##TITLE=Analysis number 327685
Compound Code cc 59614
Book Reference 521/31
Project Code adrs
Chemist Name evam
##JCAMPDX= 6.0         $$ Bruker NMR JCAMP-DX V2.0
##DATA TYPE= NMR SPECTRUM
##DATA CLASS= NTUPLES
##ORIGIN= Bruker BioSpin GmbH
##OWNER= nmr
$$ XWIN-NMR		Version 3.5
$$ Fri Mar 30 14:14:00 2007 GMT Daylight Time (UT+1h)  MAYBRIDGE\nmr@NMR_250MHZ
##.OBSERVE FREQUENCY= 250.131544655141
##.OBSERVE NUCLEUS= ^1H
##.ACQUISITION MODE= SIMULTANEOUS (DQD)
##.ACQUISITION SCHEME= undefined
##.AVERAGES= 16
##.DIGITISER RES= 18
##SPECTROMETER/DATA SYSTEM= dpx250
##.PULSE SEQUENCE= zg30
##.SOLVENT NAME= CDCl3
##.SHIFT REFERENCE= (INTERNAL, CDCl3, 0, 16.522)
##AUDIT TRAIL= $$ (NUMBER, WHEN, WHO, WHERE, WHAT)
$$ ##TITLE= Audit trail, XWIN-NMR		Version 3.5
$$ ##JCAMPDX= 5.01
$$ ##ORIGIN= Bruker BioSpin GmbH
$$ ##OWNER= nmr
$$ C:\u/data/dgb/nmr/ADRS/2800/pdata/1/auditp.txt
$$ ##AUDIT TRAIL=  $$ (NUMBER, WHEN, WHO, WHERE, WHAT)
(   1,<2007-03-30 14:13:37.81 +100>,<MAYBRIDGE\nmr>,<NMR_250MHZ>,
      <created by zg, POWCHK disabled, PULCHK disabled
       configuration hash MD5:
       49 4B E0 1D 92 C2 6B 37 9F E6 65 BC 52 41 86 1D
       data hash MD5: 64K
       32 AC 88 D4 D8 10 BA 18 4D F5 1F 8A B6 E9 F1 65>)
(   2,<2007-03-30 14:13:50.56 +100>,<MAYBRIDGE\nmr>,<NMR_250MHZ>,
      <Start of raw data processing
       ef LB = 0.3 FT_mod = 6 PKNL = 1 SI = 32K 
       data hash MD5: 32K
       8B 34 D6 44 9A DD 05 BF 2F 4C B0 01 AA 83 F2 15>)
(   3,<2007-03-30 14:13:52.32 +100>,<MAYBRIDGE\nmr>,<NMR_250MHZ>,
      <apk 
       data hash MD5: 32K
       6C 72 68 07 FF EB 5A 25 D3 20 8C C4 3D D0 7B FC>)
(   4,<2007-03-30 14:13:53.26 +100>,<MAYBRIDGE\nmr>,<NMR_250MHZ>,
      <abs ABSG = 5 
       data hash MD5: 32K
       E4 49 17 AB 62 3E 82 52 46 8B E5 BD D9 1A 9C 11>)
$$ ##END=
$$ 
$$ hash MD5
$$ 4A A1 07 1A 1F 68 A7 BB 37 C3 F6 76 A2 C1 A9 2E
##$RELAX= 
##$RELAX= 
##$RELAX= 
##$RELAX= 
##$RELAX= 
##$RELAX= 
##$RELAX= 
$$ Bruker specific parameters
$$ --------------------------
##$DU= <C:\u>
##$EXPNO= 2800
##$NAME= <ADRS>
##$PROCNO= 1
##$TYPE= <nmr>
##$USER= <dgb>
##$AMP= (0..31)
100 100 100 100 100 100 100 100 100 100 100 100 100 100 100 100 100 100 
100 100 100 100 100 100 100 100 100 100 100 100 100 100 
##$AQSEQ= 0
##$AQ_mod= 3
##$AUNM= <au_zg>
##$AUTOPOS= <21 >
##$BF1= 250.13
##$BF2= 250.13
##$BF3= 250.13
##$BF4= 250.13
##$BF5= 500.13
##$BF6= 500.13
##$BF7= 500.13
##$BF8= 500.13
##$BYTORDA= 1
##$CFDGTYP= 0
##$CFRGTYP= 5
##$CHEMSTR= <none>
##$CNST= (0..31)
1 1 145 1 1 1 1 1 1 1 1 1 1 1 1 1 1 1 1 1 1 1 1 1 1 1 1 1 1 1 1 1 
##$CPDPRG= <>
##$CPDPRG1= <>
##$CPDPRG2= <>
##$CPDPRG3= <>
##$CPDPRG4= <mlev>
##$CPDPRG5= <mlev>
##$CPDPRG6= <mlev>
##$CPDPRG7= <mlev>
##$CPDPRG8= <mlev>
##$CPDPRGB= <>
##$CPDPRGT= <>
##$D= (0..31)
0 1 0 0 0 0 0 0 0 0.06 0 0 0 0 0 0 0.0002 0 0 0 0 0 0 0 0 0 0 0 0 0 0 
0 
##$DATE= 1175260417
##$DBL= (0..7)
120 120 120 120 120 120 120 120 
##$DBP= (0..7)
150 150 150 150 150 150 150 150 
##$DBP07= 0
##$DBPNAM0= <>
##$DBPNAM1= <>
$$ [...]
##$SUBNAM7= <"">
##$SUBNAM8= <"">
##$SUBNAM9= <"">
##$SW= 20.6930455092707
##$SWIBOX= (0..15)
0 0 3 0 0 0 0 0 0 0 0 0 0 0 0 0 
##$SW_h= 5175.983436853
##$TD= 65536
##$TD0= 1
##$TE= 683.16
##$TE2= 300
##$TE3= 300
##$TEG= 300
##$TL= (0..7)
0 120 120 120 120 120 120 120 
##$TP= (0..7)
150 150 150 150 150 150 150 150 
##$TP07= 0
##$TPNAME0= <>
##$TPNAME1= <>
##$TPNAME2= <>
##$TPNAME3= <>
##$TPNAME4= <>
##$TPNAME5= <>
##$TPNAME6= <>
##$TPNAME7= <>
##$TPOAL= (0..7)
0.5 0.5 0.5 0.5 0.5 0.5 0.5 0.5 
##$TPOFFS= (0..7)
0 0 0 0 0 0 0 0 
##$TUNHIN= 0
##$TUNHOUT= 0
##$TUNXOUT= 0
##$USERA1= <user>
##$USERA2= <user>
##$USERA3= <user>
##$USERA4= <user>
##$USERA5= <user>
##$V9= 5
##$VALIST= <valist>
##$VCLIST= <CCCCCCCCCCCCCCC>
##$VD= 0
##$VDLIST= <DDDDDDDDDDDDDDD>
##$VPLIST= <PPPPPPPPPPPPPPP>
##$VTLIST= <TTTTTTTTTTTTTTT>
##$WBST= 1024
##$WBSW= 4
##$XGAIN= (0..3)
0 0 0 0 
##$XL= 0
##$YL= 0
##$YMAX_a= 603437
##$YMIN_a= -625614
##$ZGOPTNS= <>
##$ZL1= 120
##$ZL2= 120
##$ZL3= 120
##$ZL4= 120
##$ABSF1= 16.522
##$ABSF2= -4.171173
##$ABSG= 5
##$ABSL= 3
##$ALPHA= 0
##$AQORDER= 0
##$ASSFAC= 0
##$ASSFACI= 0
##$ASSFACX= 0
##$ASSWID= 0
##$AUNMP= <proc_1d>
##$AZFE= 0.1
##$AZFW= 0.1
##$BCFW= 0
##$BC_mod= 0
##$BYTORDP= 0
##$COROFFS= 0
##$CY= 12.5
##$DATMOD= 1
##$DC= 0
##$DFILT= <>
##$DTYPP= 0
##$F1P= 14.0000005364418
##$F2P= -0.99999901652339
##$FCOR= 0.5
##$FTSIZE= 32768
##$FT_mod= 6
##$GAMMA= 0
##$GB= 0
##$INTBC= 1
##$INTSCL= 1
##$ISEN= 128
##$LB= 0.3
##$LEV0= 0
##$LPBIN= 0
##$MAXI= 10000
##$MC2= 0
##$MEAN= 0
##$ME_mod= 0
##$MI= 0
##$NCOEF= 0
##$NC_proc= -2
##$NLEV= 6
##$NOISF1= 0
##$NOISF2= 0
##$NSP= 0
##$NTH_PI= 0
##$NZP= 0
##$OFFSET= 16.522
##$PC= 1
##$PHC0= 232.0084
##$PHC1= 6.071875
##$PH_mod= 1
##$PKNL= yes
##$PPARMOD= 0
##$PSCAL= 4
##$PSIGN= 0
##$REVERSE= no
##$SF= 250.13
##$SI= 32768
##$SIGF1= 0
##$SIGF2= 0
##$SINO= 400
##$SIOLD= 32768
##$SREGLST= <1H.CDCl3>
##$SSB= 0
##$STSI= 32768
##$STSR= 0
##$SW_p= 5175.98343685301
##$SYMM= 0
##$S_DEV= 0
##$TDeff= 65536
##$TDoff= 0
##$TI= <Analysis number 999999
Compound Code 99
Book Reference 9
Project Code 9>
##$TILT= no
##$TM1= 0
##$TM2= 0
##$TOPLEV= 0
##$USERP1= <user>
##$USERP2= <user>
##$USERP3= <user>
##$USERP4= <user>
##$USERP5= <user>
##$WDW= 1
##$XDIM= 32768
##$YMAX_p= 301689272
##$YMIN_p= -29212
$$ End of Bruker specific parameters
$$ ---------------------------------
##NTUPLES= NMR SPECTRUM
##VAR_NAME=  FREQUENCY,     SPECTRUM/REAL,   SPECTRUM/IMAG
##SYMBOL=    X,             R,               I
##VAR_TYPE=  INDEPENDENT,   DEPENDENT,       DEPENDENT
##VAR_FORM=  AFFN,          ASDF,            ASDF
##VAR_DIM=   32768,         32768,           32768
##UNITS=     HZ,            ARBITRARY UNITS, ARBITRARY UNITS
##FACTOR=    0.157963299565203, 1,           1
##FIRST=     4132.6476996994, 0,             0
##LAST=      -1043.33573715361, 0,           0
##MIN=       -1043.33573715361, -29212,      0
##MAX=       4132.6476996994, 301689272,     0
$$ Real data points
##PAGE= N=1
##DATA TABLE= (X++(R..R)), XYDATA
$$ [...]
16596A3488m987r956l40Q764O399L5j099j269K82q04k666J989L8O050K499n253
$$ 13488 8501 -1455 -1795 6969 13368 13403 12304 11035 11317 10513 7847 9836 9874 15924 18423 13170
16580A3170j577n224J288P521l517n436N315P271M140p052k779j692J796j457
$$ 13170 11593 6369 7657 15178 11661 6225 11540 18811 22951 15899 13120 11428 13224 11767
16566A1767Q789L120m240K482l131n010q348k447N92J018q69J819K825k828L871
$$ 11767 20556 23676 19436 21918 18787 13777 5429 2982 3574 4592 3723 5542 8367 5539 9410
16551I410J670j33P822r9r032l363K542N55M360L119k561l828j311J039p077K355
$$ 9410 11080 10947 18769 18670 9638 6275 8817 9372 13732 16851 14290 10462 9151 10190 3113 5468
16535E468N171l740p960l25P018P293L439K713j428p294n08o21n452m25k994k20
$$ 5468 10639 6899 -1061 -1386 5632 12925 16364 19077 17649 10355 9847 9226 3774 3349 355 135
16519A35L401N025M565J670J804o918q327k451J138N966L065k135k305k960K276
$$ 135 3536 8561 13126 14796 16600 9682 1355 -1096 42 6008 9073 6938 4633 1673 3949
16504C949L32O41k385L980J3645J072q595m15M36M595l954J423j713k788n382
$$ 3949 4281 4922 2537 6517 20162 21234 12639 12224 12660 17255 13301 14724 13011 10223 4841
16489D841m659M001P292O34o3k499p675o39L410K8J1600K554n902j56J919o860
$$ 4841 182 4183 11475 12109 12046 9547 1872 1233 4643 4671 16271 18825 12923 12767 14686 7826
16473G826o697R74l206L926N81k847M249P142K951r578j1715J555O837O052R54
$$ 7826 1129 2103 -1103 2823 3404 557 4806 11948 14899 5321 -6394 -4839 1998 8050 9004
16458I004o56p57N53j573l368K260m046o4j040m500q71L433J169K886P97k019
$$ 9004 8348 7591 8144 6571 3203 5463 1417 1353 313 -4187 -5058 -1625 -456 2430 3227 1208
16442A208k447J13O90O505L390M523k881j844K89J495l347N556J482q316p009
$$ 1208 -1239 -1126 -436 6069 9459 13982 11101 9257 9546 11041 7694 13250 14732 6416 -593
16427e93N530N370j924j566K731k68N48q46j273K501l829m053J018J546k855l372
$$ -593 4937 10307 8383 6817 9548 9280 9828 8982 7709 10210 6381 2328 3346 4892 2037 -1335
16411a335k335R42K968N641K647m335j620L533p42j157k893k215L415M340J436
$$ -1335 -3670 -2728 240 5881 8528 4193 2573 6106 5364 4207 1314 -901 2514 6854 8290
16396H290J866O392q125k198K138n603L22J918M680j108j059l901p91R580j585
$$ 8290 10156 16548 8423 6225 8363 2760 3082 5000 9680 8572 7513 3612 2821 12401 10816
16381A0816m273J180M427q13K340l463o419n48J186N529J147m24j868N128n27
$$ 10816 6543 7723 12150 11337 13677 10214 3795 3247 4433 9962 11109 10685 8817 13945 13418
16366A3418J60n85l191k834k125L980J530n051l392r558n176O300N362L414J142
$$ 13418 13578 12993 9802 6968 4843 8823 10353 5302 1910 -7648 -12824 -6524 -1162 2252 3394
16351C394m14j871m19l143J450l07r09L046L46j414o01P872O340k481J072J59
$$ 3394 2980 1109 690 -2453 -1003 -1310 -2219 827 1173 -241 -842 7030 13370 10889 11961 12120
16335A2120q725r094k262J685l200L659N491j773O924O583M683l514l258j495
$$ 12120 3395 -5699 -7961 -6276 -9476 -5817 -326 -2099 4825 11408 16091 12577 9319 7824
16321G824L024Q87L888L738K336m341o359o662j548k156k08r66J367m608j443
$$ 7824 10848 11735 15623 19361 21697 17356 10997 4335 2787 631 423 -543 824 -3784 -5227
16306e227O75l577L924J4494L498j061l28L124o963n777N116l13m286k772j117
$$ -5227 -4552 -8129 -4205 10289 13787 12726 12398 15522 8559 2782 7898 7585 3299 527 -590
16291e90M180o1j524k47o326P97M069N208L817n59L206j198k768n579K941n6J082
$$ -590 3590 3529 2005 1758 -4568 -3771 298 5506 9323 8764 11970 10772 8004 2425 5366 5310 6392
16274F392M701N023m723o97k227n478P51N668k453k956j368K023P050J819m010
$$ 6392 11093 16116 11393 10696 8469 2991 3742 9410 6957 4001 2633 4656 11706 13525 9515
16259I515J954n982n151j414L953O255r06p449j480l595M027M492O586k041o226
$$ 9515 11469 5487 336 -1078 2875 9130 8224 775 -705 -4300 -273 4219 10805 8764 2538
16244B538k236J823m719N759l501l502L389k29K344J857J561m087k604K937J0788
$$ 2538 302 2125 -2594 3165 -336 -3838 -449 -678 1666 3523 5084 997 -1607 1330 12118
16229A2118l760N703J212k214o121k005k023L56N374Q57n160k201K694p99o407
$$ 12118 8358 14061 15273 13059 6938 4933 2910 3266 8640 9497 4337 2136 4830 4031 -2376
16214b376O332m616m926n956j860R89R454J0324M094q001o345o08m393q038L509
$$ -2376 3956 -660 -5586 -11542 -13402 -12413 -2959 7365 11459 3458 -2887 -3495 -7888 -15926 -12417
16199a2417O260L901M462L55l637J247L539K983N280o190r013m125L508N522K207
$$ -12417 -6157 -2256 2206 2561 -1076 171 3710 6693 11973 5783 -3230 -7355 -3847 1675 3882
16184C882m256l206L273k895o510M698Q663Q913j279j0402j18L673n735N11O454
$$ 3882 -374 -3580 -307 -3202 -9712 -5014 3649 12562 11283 881 763 4436 -1299 -788 5666
16169E666N5o512o922N392P18K433Q302P680l966N55j4p346o170M983J150k824
$$ 5666 5721 -791 -7713 -2321 -1603 830 9132 16812 12846 13401 13387 6041 -129 4854 6004 3180
16153C180P107L563m475n254k11J280r64k802P285L764r442K773J402p579k961
$$ 3180 10287 13850 9375 4121 3910 5190 4226 1424 8709 12473 3031 5804 7206 -373 -3334
16138c334p69j286r97K061M493J096j091J893L174q936P99R647j80n530q889Q357
$$ -3334 -4103 -5389 -6386 -4325 168 1264 173 2066 5240 -3696 -2897 6750 6570 1040 -7849 508
16122E08K696L863O82o01M33k859k370o310m342K90J737J132L517j499J518L891
$$ 508 3204 7067 7749 7148 7581 4722 2352 -3958 -8300 -8010 -6273 -5141 -1624 -3123 -1605 2286
16106B286L776L7q889q867j41O429M860J1309J453L029L438q865m669k3L994o56
$$ 2286 6062 6099 -2790 -11657 -11798 -5369 -509 10800 12253 15282 18720 9855 5186 5163 9157 8501
16090H501k480k367k914j229L579K69r90l798n631K514L280k6O183l818m132J723
$$ 8501 6021 3654 740 -489 3090 3359 2369 -1429 -7060 -4546 -1266 -1292 4891 1073 -3059 -1336
16074a336L266N40k57J930q14n134M432O75N7j80k171n404N72K272q59Q17L107
$$ -1336 1930 2470 2213 4143 3329 -1805 2627 3302 3359 3179 1008 -4396 -3824 -1552 -2411 -1594 1513
16057A513K211m891k461j847m549O161P889M158l374Q94L043M551k737o677k38
$$ 1513 3724 -1167 -3628 -5475 -10024 -3863 4026 8184 4810 5704 8747 13298 10561 3884 3646
16042C646j576j28J111j612Q82l868J354O57k51l067k154L406J790j80r12L888
$$ 3646 2070 1942 3053 1441 2323 -1545 -191 466 215 -2852 -5006 -1600 190 10 -902 2986
16026B986J828J090J744L6n113o788r15M73K332q75J572O636K791o330L193L27
$$ 2986 4814 5904 7648 7684 2571 -4217 -5132 -4659 -2327 -3202 -1630 5006 7797 1467 4660 4987
16010D987L733J623l348n657m358j341o599K00Q383N520m423o966L375k824j148
$$ 4987 8720 10343 6995 1338 -3020 -4361 -10960 -10760 -2377 3143 -1280 -8246 -4871 -7695 -8843
15995h843O125R46O65Q485Oo705j501k032J146j448k167M714J94m890j157k323
$$ -8843 -2718 -1772 -1107 7378 7384 679 -822 -2854 -1708 -3156 -5323 -609 -415 -5305 -6462 -8785
15979h785o4O832N393P845K68q12J666j106l925n716J089N142N259m231N039n466
$$ -8785 -8849 -2017 3376 11221 11489 10677 12343 11237 7312 1596 2685 7827 13086 8855 13894 8428
15963H428k480J353N696j017l052l489l721l153J966J413N800m906p951M79k43
$$ 8428 5948 7301 12997 11980 8928 5439 1718 -1435 531 1944 7744 2838 -5113 -4634 -4877
15948d877j1881K182K073k400K390P419O634J607K544l056K593L0K333q25M338
$$ -4877 -16758 -14576 -12503 -14903 -12513 -5094 1540 3147 5691 2635 5228 5258 7591 6766 11104
15933A1104L221o351j097K452j182p017p399p826N59R498L947m759j572J316m539
$$ 11104 14325 7974 6877 9329 8147 1130 -6269 -14095 -13536 -4038 -91 -4850 -6422 -5106 -9645
15918i645J098j91N245K697K747j4080L422N551m382j282K933J720M502O183n300
$$ -9645 -8547 -8738 -3493 -796 1951 -12129 -8707 -3156 -7538 -8820 -5887 -4167 335 6518 1218
15903A218J854J1569j731m604p57M232l230p192m365N62L26N393K001l364r33
$$ 1218 3072 14641 12910 8306 7549 11781 8551 1359 -3006 -2444 -2118 3275 5276 1912 979
15888I79k693k378j345R946K971p265O17L237J765J975K516j720o214O47o751
$$ 979 -1714 -4092 -5437 4509 7480 215 832 4069 5834 7809 10325 8605 2391 3038 -3713
15873c713L085K232l658l576n873Q136L261J200M47j474O550P74p165j281K733
$$ -3713 -628 1604 -2054 -5630 -11503 -3367 -106 1094 1541 67 6617 7391 226 -1055 1678
15858A678j284J688k682l559q979J232K709P554J067J921k521Q41r29k467p813
$$ 1678 394 2082 -600 -4159 -13138 -11906 -9197 -1643 -576 1345 -1176 -335 -1264 -3731 -11544
15843a1544J337P002P681Q04n815j2356Q21L686N279j220l869k793l584O720M424
$$ -11544 -10207 -3205 4476 5280 -535 -12891 -12070 -8384 -3105 -4325 -8194 -10987 -14571 -7851 -3427
15828c427M882r42p930K218M888M90L19l314R11Q08j372l524p89l51J449l83k214
$$ -3427 1455 513 -7417 -5199 -311 179 498 -2816 -1905 -1097 -2469 -5993 -6782 -7133 -5684 -6067 -8281
15811h281Q824N706o504K135P391k139n132m846j042L62N681l028P148J464l172
$$ -8281 543 6249 -255 1880 9271 7132 2000 -2846 -3888 -3526 2155 -873 6275 7739 4567
15796D567J284l981l837J309K764L562K926m26j360p013k335L423J834o257J31
$$ 4567 5851 1870 -1967 -658 2106 5668 8594 8168 6808 -205 -2540 883 2717 -3540 -3409
15781c409K873R12Q39j166m807K294Q342L205l482j74J507m639J69J156L612l188
$$ -3409 -536 376 1215 49 -4758 -2464 5878 9083 5601 5427 6934 2295 2464 3620 7232 4044
15765D044l901N632J917n770m106j667j870l425M537M252o219M553M188R75k339
$$ 4044 143 5775 7692 1922 -2184 -3851 -5721 -9146 -4609 -357 -6576 -2023 2165 3140 801
15750H01J409l230p746k132N53j215J369j40N063q37k729N003O397K648m093o908
$$ 801 2210 -1020 -8766 -10898 -10345 -11560 -10191 -10331 -5268 -6105 -8834 -3831 2566 5214 1121 -5787
15734e787j195M854k607P977L803q440O27O400J756q460o917J991Q18K478o721
$$ -5787 -6982 -2128 -4735 3242 7045 -1395 -768 5632 7388 -1072 -7989 -5998 -5180 -2702 -9423
15719i423j868J315K07k205O758R236p26K347K992K467k497N26m727j699J280
$$ -9423 -11291 -9976 -9769 -11974 -5216 4020 3294 5641 8633 11100 8603 9129 4402 2703 3983
15704C983K93K277J498l789j875O956J237j911m340J238j38m616L815q54K156
$$ 3983 4276 6553 8051 4262 2387 9343 10580 8669 4329 5567 5429 813 4628 3774 5930
15689E930k340m679l642J73M251N888O244J019q321n333l435J878O903m054n361
$$ 5930 3590 -1089 -4731 -4558 -307 5581 11825 12844 4523 -810 -4245 -2367 4536 482 -4879
15674d879M206N823j849k212K47K308l490k596k279m350n92J84O738M283L654
$$ -4879 -673 5150 3301 1089 1336 3644 154 -2442 -4721 -9071 -9663 -9479 -2741 1542 5196
15659E196N586j870P38L707k283r272p506j618K482K162n88R13n071k171l272
$$ 5196 10782 8912 9650 13357 11074 1802 -5704 -7322 -4840 -2678 -3266 -2353 -7424 -9595 -12867
15644a2867p337M202N783j882o208M589O774M616k90L984m419m865m203m842J305
$$ -12867 -20204 -16002 -10219 -12101 -18309 -13720 -6946 -2330 -2620 1364 -3055 -7920 -12123 -16965 -15660
15629a5660K396K731L280M788o05M9J336j415Q905L45L208M201n989k649j981
$$ -15660 -13264 -10533 -7253 -2465 -3070 -3021 -1685 -3100 5805 6150 9358 13559 7570 4921 2940
15614B940n56j696Q49K548k23l557J014K562J03k43Q08m46p757m872J107L980
$$ 2940 2384 688 1537 4085 3862 305 1319 3881 3984 3741 4549 4103 -3654 -8526 -7419 -3439
15598c439k945k191j991P489O219j519R93m098p475O61K910O373J44k7J892p59
$$ -3439 -6384 -8575 -10566 -3077 3142 1623 2616 -1482 -8957 -8296 -5386 987 1131 1104 2996 2237
15582B237l90K690M086Q104n230p891k494l959n235M28j22n04K260k908m59L728
$$ 2237 1847 4537 8623 16727 11497 3606 1112 -2847 -8082 -7654 -7776 -8280 -6020 -8928 -9387 -5659
15566e659R461O700p540q165q748K813J490k252j534K264Q515M300O423K776o162
$$ -5659 3802 10502 2962 -5203 -13951 -11138 -9648 -11900 -13434 -11170 -2655 1645 8068 10844 4682
15551D682q783O971K934o895p48j469K586K239l797Q63k542n102M427k933L535
$$ 4682 -4101 2870 5804 -1091 -1839 -3308 -722 1517 -2280 -1417 -3959 -9061 -4634 -7567 -4032
15536d032O77n425J722J974k415j93L196P385J050q418o285n11K893k921L699
$$ -4032 -3355 -8780 -7058 -5084 -7499 -7692 -4496 2889 3939 -4479 -10764 -11275 -8382 -11303 -7604
15521g604J814L767M40j147k674k591k00J739k016o102j310P702M019J8l527M493
$$ -7604 -5790 -2023 -1583 -2730 -5404 -7995 -8195 -6456 -8472 -14574 -15884 -8182 -4163 -4145 -7672 -3179
15505c179M836M459n967m020K146O384J311J309J617r587r067J899j127M680M894
$$ -3179 1657 6116 149 -3871 -1725 4659 5970 7279 8896 -691 -9758 -7859 -8986 -4306 588
15490E88J122n066j687j237K479J749o05l20M74L3K266K188P049j332q829q060
$$ 588 1710 -3356 -5043 -6280 -3801 -2052 -2657 -2977 -2503 -2470 -204 1984 9033 7701 -1128 -9188
15474i188k299K307N86J800N873l702n986l53K436M970K308n59l859k497P465
$$ -9188 -11487 -9180 -8594 -6794 -921 -4623 -10609 -10962 -8526 -3556 -1248 -1807 -5666 -8163 -698
15459f98M961n002l955k947M0k510Q834M442Q40m008n638j423j065m236K804n043
$$ -698 4263 -739 -4694 -7641 -7601 -10111 -1277 3165 4005 -3 -5641 -7064 -8129 -12365 -9561 -14604
15443a4604l307N091N605L349O175j735j330Q303j010l569J602n903J97l384l48
$$ -14604 -17911 -12820 -7215 -3866 2309 574 -756 7547 6537 2968 4570 -1333 -1136 -4520 -4868
15428d868k169l923L671K511K335l189j384Q15n395j762p65M55J0019N665n568
$$ -4868 -7037 -10960 -7289 -4778 -2443 -5632 -7016 -6201 -11596 -13358 -14123 -13668 -3649 2016 -3552
15413c552M84N811L387o90o248l516j394q113L341L387l446M6L24O215K752p092
$$ -3552 -3068 2743 6130 5440 -808 -4324 -5718 -13831 -10490 -7103 -10549 -10503 -10179 -3964 -1212 -8304
15397h304L904L004m81N166k542o873o708N602J3500N87q036l214m873m743K381
$$ -8304 -4400 -1396 -1877 3289 747 -6126 -12834 -7232 6268 6855 -1181 -4395 -9268 -14011 -11630
15382a1630N181j832n120O150O299M435N25k084M7L478O210l705p067p15J41L141
$$ -11630 -6449 -8281 -13401 -7251 -952 3483 4008 1924 1971 5449 11659 7954 887 172 313 3454
15366C454Q4l098K817R86m725O6k173K541K173n775M205j065n843M703m77N01
$$ 3454 3538 440 3257 4243 -482 -416 -2589 -48 2125 -3650 555 -510 -6353 -1650 -2127 -1626
15350a626J924k480q47J24N292k504l455J524j067L316K715j974L119n209q260
$$ -1626 298 -2182 -3029 -2905 2387 -117 -3572 -2048 -3115 201 2916 942 4061 -1148 -9408
15335i408O864l141p052m442J0391N966L558k105p16M822k40m111n424K245Q77
$$ -9408 -2544 -5685 -12737 -17179 -6788 -822 2736 631 -85 4737 4497 386 -5038 -2793 -1916
15320a916p94j841j390p239k085Q732J1904l792p622L475j495n232n861J945K758
$$ -1916 -2710 -4551 -5941 -13180 -15265 -6533 5371 1579 -6043 -2568 -4063 -9295 -15156 -13211 -10453
15305a0453M8J455N200J439p71K833k053p299L143L834k973K168K40k821J807
$$ -10453 -10405 -8950 -3750 -2311 -3082 -249 -2302 -9601 -6458 -2624 -5597 -3429 -3189 -6010 -4203
15290d203J930J909L56O60K698K515J874K299J232k726j50k303K83K619j950m784
$$ -4203 -2273 -364 -8 652 3350 5865 7739 10038 11270 8544 8394 6091 6374 8993 7043 2259
15274B259L668J431O27k989m230J85K343k384o806K448N384J019m876q065j424
$$ 2259 5927 7358 7985 4996 766 951 3294 910 -5896 -3448 1936 2955 -1921 -9986 -11410
15259a1410K557q50j56n48O80J462J858L379K325O781J73n482r979p216l22M727
$$ -11410 -8853 -9703 -9859 -10407 -9727 -8265 -6407 -3028 -703 6078 6251 769 -9210 -16426 -16748 -12021
15243a2021L578M689j281P931Q418R38j258o425j54n24j0020m097P343l27m188
$$ -12021 -8443 -3754 -5035 2896 11314 12252 10994 4569 4415 3891 -6129 -10226 -2883 -3210 -7398
15228g398l912P393L271k210j472L720j59j657n032N398K0o538j124L926J137
$$ -7398 -11310 -3917 -646 -2856 -4328 -608 -767 -2424 -7456 -2058 -2038 -8576 -9700 -5774 -4637
15213d637P070k307K76K412R11l775j662o822k483m615N905J5361k974j1520k819
$$ -4637 2433 126 402 2814 3725 -50 -1712 -8534 -11017 -15632 -9727 5634 2660 -8860 -11679
15198a1679k774J677O249M172P703q280q767J940M270m056n03P393K925o11k317
$$ -11679 -14453 -12776 -6527 -2355 5348 -2932 -11699 -9759 -5489 -9545 -10048 -2655 270 -341 -2658
15183b658j1934M183L995l399J959l193L217L342k098r114l586P519K289m0j969
$$ -2658 -14592 -10409 -6414 -9813 -7854 -11047 -7830 -4488 -6586 -15700 -19286 -11767 -9478 -9518 -11487
15168a1487p343M130N341P718L132L12m716m347k942O97J09Q54K741M707j543
$$ -11487 -18830 -14700 -9359 -1641 1491 1803 -2913 -7260 -10202 -9505 -9396 -8542 -5801 -1094 -2637
15153b637O49O2P848N612r384L22N55k687q232k167M633L487n167O46M089J728
$$ -2637 -1988 -1926 5922 11534 2150 2472 3027 340 -7892 -10059 -5426 -1939 -7106 -6460 -2371 -643
15137f43k786n900n817k075O841l660j01K984L874J917k031O134N071q73p429
$$ -643 -3429 -9329 -15146 -17221 -10380 -14040 -14141 -11157 -7283 -5366 -7397 -1263 3808 2935 -4494
15122d494k189n94l07J958K823J249Q397L843n020q859l012N343N032J188m20
$$ -4494 -6683 -7277 -7584 -5626 -2803 -1554 6843 10686 5666 -3193 -6205 -862 4170 5358 4938
15107D938l400l086J068R08L344m488n578l659k940J775J31M19k916j675O975
$$ 4938 1538 -1548 -480 428 3772 -716 -6294 -9953 -12893 -11118 -10987 -10568 -13484 -15159 -8184
15092h184J1063n1J305R75o238O17K385n605q521o69O216K412q60J969O96p22
$$ -8184 2879 2828 4133 5108 -1130 -513 1872 -3733 -12254 -12923 -6707 -4295 -5155 -3186 -2490 -3212
15076c212J083m108k175K714k236N748k719k987m38q2J566L349K250j038n270
$$ -3212 -2129 -6237 -8412 -5698 -7934 -2186 -4905 -7892 -8330 -8412 -6846 -3497 -1247 -2285 -7555
15061g555K98j15K349N863J387k497n247l838J872m68J41l713L127n181o445K750
$$ -7555 -7257 -7372 -5023 840 2227 -270 -5517 -9355 -7483 -7951 -7810 -11523 -8396 -13577 -20022 -17272
15045a7272M990O93k316L049K054Q50O40l265P98Q2O56L770L891J643L070K537
$$ -17272 -12282 -11589 -13905 -10856 -8802 -7952 -7312 -10577 -9779 -9697 -9041 -5271 -1380 263 3333 5870
15029E870r0n921K770k300j980mM628n32m168j342m660M757K567K293K971p484
$$ 5870 5780 -141 2629 329 -1651 -1655 2973 2441 -1727 -3069 -7729 -2972 -405 1888 4859 -2625
15013b625p641k477k034p72k624o655M808N577M069J531o5j206M750L991l907
$$ -2625 -10266 -12743 -14777 -15549 -18173 -24828 -20020 -14443 -10374 -8843 -8908 -10114 -5364 -1373 -5280
14998e280k350N196K990P83p021k194K654P808K384J78k671M695q47n427m626
$$ -5280 -7630 -2434 556 1339 -5682 -7876 -5222 2586 4970 5148 2477 7172 6325 898 -3728
14983c728r625J680N550O533L440K410j352p306p811p450J381N598J788M254J633
$$ -3728 -13353 -11673 -6123 410 3850 6260 4908 -2398 -10209 -17659 -16278 -10680 -8892 -4638 -3005
14968c005J915m446M156J467n703M498n955l587O874J707J222M006q427m37Q252
$$ -3005 -1090 -5536 -1380 87 -5616 -1118 -7073 -10660 -3786 -2079 -857 3149 -5278 -5715 2537
14953B537N016n471J763k285J914k857m092j873k235L278m018j1287J707N432
$$ 2537 7553 2082 3845 1560 3474 617 -3475 -5348 -7583 -4305 -8323 -19610 -17903 -12471
14939a2471M669L886K303J754j355L73Q23k90M50j175p988n181J549J037J229
$$ -12471 -7802 -3916 -1613 141 -1214 -841 -18 -308 142 -1033 -9021 -14202 -12653 -11616 -10387
14924a0387O897j518m141l116o734j855N147K572M530P929P128N467K876q258
$$ -10387 -3490 -5008 -9149 -12265 -18999 -20854 -15707 -13135 -8605 -676 6452 11919 14795 6537
14910F537p923j0323J373O11J957N872J688k437n064r00P11N082n65Q072o79n779
$$ 6537 -1386 -11709 -10336 -9725 -7768 -1896 -208 -2645 -7709 -8609 -7898 -2816 -3381 4691 4012 -1767
14894a767k889L098L531N47k546j087P07N256K48k166l477k903M671O905P777
$$ -1767 -4656 -1558 1973 2520 -26 -1113 -406 4850 5098 2932 -545 -3448 1223 8128 15905
14879A5905p178q053j976j972m035M141M183K258r35j603m259j1310m628J581
$$ 15905 8727 674 -1302 -3274 -7309 -3168 1015 3273 2338 735 -3524 -14834 -19462 -17881
14865a7881P174J1462j95o651L218Q99m63n109j625m241k895k423O632N589M83
$$ -17881 -10707 755 560 -6091 -2873 -1974 -2437 -7546 -9171 -13412 -16307 -18730 -12098 -6509 -6026
14850f026M695J681J491K353k389o305J960p2k075K48j143J852k016l212j177
$$ -6026 -1331 350 1841 4194 1805 -4500 -2540 -2612 -4687 -4439 -5582 -3730 -5746 -8958 -10135
14835a0135N384l019K291J826l190m039j463M105M464j181J962L234O11K760J502
$$ -10135 -4751 -7770 -5479 -3653 -6843 -10882 -12345 -8240 -3776 -4957 -2995 239 850 3610 5112
14820E112l337m824k391m348j091L921j987n192P445K426Q93L769o487n042k608
$$ 5112 1775 -3049 -5440 -9788 -10879 -6958 -8945 -14137 -6692 -4266 -3373 396 -6091 -11133 -13741
14805a3741P90L908j681l961J494k340k220L710O622L823N479j827r55M467J570
$$ -13741 -12951 -9043 -10724 -14685 -13191 -15531 -17751 -14041 -7419 -3596 1883 56 -899 3568 5138
14790E138m912j5019n003m885J285j970M999R971P020n50n231K834M260n835L534
$$ 5138 226 -14793 -19796 -24681 -23396 -25366 -20367 -10396 -3376 -3926 -9157 -6323 -2063 -7898 -4364
14775d364O063o97j2600j208J4062j157l574l874j191L60m592O041P476M914l595
$$ -4364 1699 1002 -11598 -12806 1256 99 -3475 -7349 -8540 -8180 -12772 -6731 745 5659 2064
14760B064l863L577L20k217o219r6K990n68M277p138o075L652M484N006m991j164
$$ 2064 -1799 1778 2098 -119 -6338 -6434 -3444 -4012 265 -6873 -12948 -9296 -4812 194 -4797 -5961
14744e961L90k1k989l653J145M405K131j284Q96o086o219K310O276M798o756p882
$$ -5961 -5571 -5592 -8581 -12234 -11089 -6684 -4553 -5837 -4941 -11027 -17246 -14936 -8660 -3862 -10618 -18500
14728a8500J177R264M437o740N195K348j862R02n185j0068N139O664L634m165
$$ -18500 -17323 -8059 -3622 -10362 -5167 -2819 -4681 -3779 -8964 -19032 -13893 -7229 -3595 -7760
14714g760O762M004n369l379n466K671J812K981J719l103m609K339r43q414K038
$$ -7760 -998 3006 -2363 -5742 -11208 -8537 -6725 -3744 -2025 -5128 -9737 -7398 -8341 -16755 -14717
14699a4717P677L515l17j619j71l568k892L356J344R31K748n058j986n9M35M491
$$ -14717 -7040 -3525 -3842 -5461 -5632 -9200 -12092 -8736 -7392 -6461 -3713 -8771 -10757 -10816 -10381 -5890
14683e890k608k324J172P151K376n71O92N590j207l763j983o90L020Q437P7k147
$$ -5890 -8498 -10822 -9650 -2499 -123 -694 -2 5588 4381 618 -1365 -2055 965 9402 9479 7332
14667G332o157K460ok046m517q59o362j575K816K433l861N97P952j545m643r64
$$ 7332 1175 3635 3629 1583 -2934 -3793 -10155 -11730 -8914 -6481 -10342 -9745 -1793 -3338 -7981 -8945
14651h945K038m491O533N883n564q40j601r98k547J244K177P75m790K931N816
$$ -8945 -6907 -11398 -4865 1018 -4546 -5386 -6987 -7985 -10532 -9288 -7111 -6336 -11126 -8195 -2379
14636b379Q31r636n44M480R587K784R6J716K978q674l659L378M335o743m910l46
$$ -2379 -1548 -11184 -11728 -7248 2339 5123 5219 6935 9913 1239 -2420 958 5293 -1450 -6360 -6706
14620f706K627L413o526r492k585M709M528J063J375k715k169Q488N634M425Q244
$$ -6706 -4079 -666 -7192 -16684 -19269 -14560 -10032 -8969 -7594 -10309 -12478 -3990 1644 6069 14313
14605A4313q24o055j586m97m425l649L045J561l496k104N07K68k616L917Q756
$$ 14313 13489 7434 5848 5351 926 -2723 322 1883 -1613 -3717 -3210 -2942 -5558 -1641 7115
14590G115j156q12q432l607J367l360j16M090L457m98o190K614M517J491j375
$$ 7115 5959 5147 -3285 -6892 -5525 -8885 -9001 -4911 -1454 -1952 -8142 -5528 -1011 480 -895
14575h95j956n27k38K935j753J527Jm54n63K445L468l56m632R85L87k761l075
$$ -895 -2851 -3378 -3616 -681 -2434 -907 -906 -1360 -1923 522 3990 3634 -998 -13 374 -2387 -5462
14558e462j675M02O120N294K007o199J597k421k313m032p86P844j78L23L194j84
$$ -5462 -7137 -6735 -615 4679 6686 487 2084 -337 -2650 -6682 -7468 376 198 521 3715 3531
14542C531j102J484O152K446j197K419n664q287J510O934L444l575m678l065k786
$$ 3531 2429 3913 10065 12511 11314 13733 8069 -218 1292 8226 11670 8095 3417 352 -2434
14527b434k781R57N920K43J5o753J727K804L348k614m395J110M132O028j48j2796
$$ -2434 -5215 -4258 1662 1905 1920 -4833 -3106 -302 3046 432 -3963 -2853 1279 7307 7159 -5637
14511e637r102M367N601N513J52L945p08n938k811j565K277L098j521k646J270
$$ -5637 -14739 -10372 -4771 742 894 4839 4131 -1807 -4618 -6183 -3906 -808 -2329 -4975 -3705
14496c705J759N283K03l805K506n387n76M796K031J539k987j898P722o847L50
$$ -3705 -1946 3337 3540 -265 2241 -3146 -3722 1074 3105 4644 1657 -241 7481 634 984
14481I84Q927m350k595K58j408l714q837n174J182N505K484N24O599L19n212o668
$$ 984 9911 5561 2966 3224 1816 -1898 -10735 -15909 -14727 -9222 -6738 -6214 385 704 -4508 -11176
14465a1176M23J583k443q79Q37l221K748P845J623J371K831l446k943J984j375
$$ -11176 -10753 -9170 -11613 -12492 -11655 -14876 -12128 -4283 -2660 -1289 1542 -1904 -4847 -2863 -4238
14450d238m558j861p944K09J911P534O834k786r57M952j595o051j598j016M25
$$ -4238 -8796 -10657 -18601 -18392 -16481 -8947 -2113 -4899 -5856 -904 -2499 -8550 -10148 -11164 -10739
14435a0739L482k114L16l703L382K737j314K687L928M418L174l781j964n903L402
$$ -10739 -7257 -9371 -9055 -12758 -9376 -6639 -7953 -5266 -1338 3080 6254 2473 509 -5394 -1992
14420a992P959J287M814q29q127r540k287R77M154L759l11l921k837m221N385
$$ -1992 5967 7254 12068 11239 3112 -6428 -8715 -7738 -3584 175 -136 -4057 -6894 -11115 -5730
14405e730J474r9j61K166O269l800r40M480n537J757O879l940n184l655p99Q946
$$ -5730 -4256 -4355 -4516 -2350 3919 119 -821 3659 -1878 -121 6758 2818 -2366 -6021 -6820 2126
14389B126L647k737q516J312l634m258M786M204n230O959J10N60p260r658N881
$$ 2126 5773 3036 -5480 -4168 -7802 -12060 -7274 -3070 -8300 -1341 -1231 -671 -7931 -17589 -11708
14374a1708j995q855L009Q039K562l013J932j63n427J988J181K677J241M19j811
$$ -11708 -13703 -22558 -19549 -11510 -8948 -11961 -10029 -10192 -15619 -13631 -12450 -9773 -8532 -8113 -9924
14359i924J307M916J1794j993j147m044j923O148K164M443k289j3043m540J579
$$ -9924 -8617 -3701 8093 6100 4953 909 -1014 5134 7298 11741 9452 -3591 -8131 -6552
14345f552P847k282K996O883j749r387j335o869p194M822P197J516m5K398K861
$$ -6552 1295 -987 2009 8892 7143 -2244 -3579 -10448 -17642 -12820 -5623 -4107 -4152 -1754 1107
14330A107O097j585k483J430p832p47J318m860J547P61J688p815o315l211R62
$$ 1107 7204 5619 3136 4566 -3266 -4013 -2695 -7555 -6008 -5247 -3559 -11374 -17689 -20900 -19938
14315a9938N847L660K586k063O358j010Q20K124j653k141J733K72p94k522n24
$$ -19938 -14091 -10431 -7845 -9908 -3550 -4560 -3740 -1616 -3269 -5410 -3677 -3405 -4199 -6721 -7245
14300g245L307k5j932m810m060O454N943L870m433l631Q051M163p298O245R56
$$ -7245 -3938 -3963 -5895 -10705 -14765 -8311 -2368 1502 -2931 -6562 1489 5652 -1646 4599 5555
14285E555r624J611L033K703n397q220K060O843k803j383m457j819n699k141L411
$$ 5555 -4069 -2458 575 3278 -2119 -10339 -8279 -1436 -4239 -5622 -10079 -11898 -17597 -19738 -16327
14270a6327J0366L035r959o81J1573M049p9p160J872P361J063n865j081l637L106
$$ -16327 -5961 -2926 -12885 -13566 -1993 2056 1977 -5183 -3311 4050 5113 -752 -1833 -5470 -2364
14255b364m54r388L445K499Q993K273k634N079L096m262K16n521r044m528K89
$$ -2364 -2818 -12206 -8761 -6262 2731 5004 2370 7449 10545 6283 6499 978 -8066 -12594 -12305
14240a2305O86l592J401Q303J939p274M73K107K541Qk639j189o941j53N658P719
$$ -12305 -11619 -15211 -13810 -5507 -3568 -10842 -10369 -8262 -5721 -5713 -8352 -9541 -16482 -16635 -10977 -3258
14224c258j851K910o24j639j197P49J96J969L193M173j124o419J625k285j419
$$ -3258 -5109 -2199 -2823 -4462 -5659 -4910 -4714 -2745 448 4621 3497 -2922 -1297 -3582 -5001
14209e001L232K700l010L490K452j084O71k635q620k358J029o40m551J632Q65
$$ -5001 -1769 931 -2079 1411 3863 2779 3450 815 -7805 -10163 -9134 -9774 -14325 -12693 -11828
14194a1828J012q31M243N262m295o349L997R768M444m435m291k422K823J589j991
$$ -11828 -10816 -11647 -7404 -2142 -6437 -12786 -8789 979 5423 988 -3303 -5725 -2902 -1313 -3304
14179c304L822j339K845L242K188p982m025J912N675j325k52J603r57n733n75
$$ -3304 518 -821 2024 5266 7454 -528 -4553 -2641 3034 1709 1457 3060 2103 -3630 -4205
14164d205k049L874n193r09L309k435n292j516O351O201j8J071J951O781q88q164
$$ -4205 -6254 -2380 -7573 -8482 -5173 -7608 -12900 -14416 -8065 -1864 -1882 -811 1140 7921 7033 -1131
14148a131k250J612L87j165L550j592N022N891l11K094k597L165J211q250o830
$$ -1131 -3381 -1769 -1382 -2547 1003 -589 4433 10324 10013 12107 9510 12675 13886 5636 -1194
14133a194K73P263K821M701L606l416j0629k847Q799O988k69p09l027k037n661
$$ -1194 -921 6342 9163 13864 17470 14054 3425 578 9377 16365 16096 15387 12360 10323 4662
14118D662p6K07o359j514K221O046Q414K588J421L521p25o462j1176K369N370
$$ 4662 4586 4793 -1566 -3080 -859 5187 13601 16189 17610 21131 20406 13944 2768 5137 10507
14103A0507J517m84P85k585P09O376J432m939J827P177J482n220m811l559m004
$$ 10507 12024 11540 12325 9740 10449 16825 18257 13318 15145 22322 23804 18584 13773 10214 6210
14088F210Q305L638m504n256K994M585J144J397k598j852n375k749k442n669P16
$$ 6210 14515 18153 13649 8393 11387 15972 17116 18513 15915 14063 8688 5939 3497 -2172 -1456
14073a456j87j959L180J291N955R188L294M675J80q991j861j562m429o737M796
$$ -1456 -1643 -3602 -422 869 6824 16012 19306 23981 24161 15170 13309 11747 7318 581 5377
14058E377l19Q37M129n080o384m460O362M614n674l837r32N15K815J440R10Q684
$$ 5377 5058 5895 10024 4944 -1440 -5900 462 5076 -598 -4435 -5367 -4852 -2037 -597 313 8997
14042H997j929j509k969m623j247O276p62k88M313K295M519k808Q92q813J112
$$ 8997 7068 5559 2590 -2033 -3280 2996 2234 1946 6259 8554 13073 10265 11157 2344 3456
14027C456q7Q0O023L43n691l656k483m476J144rQ02N155K959m06m876l381K864
$$ 3456 3369 3449 9472 9815 4124 468 -2015 -6491 -5347 -5356 -4554 601 3560 3154 -1722 -5103 -2239
14010b239Q726O56p715j51l936Q66O972n58k798n369j243L123Q784m266j585J011
$$ -2239 6487 7143 -572 -723 -4659 -3793 3179 2621 -177 -5546 -6789 -3666 5118 852 -733 278
13994B78M878j288N26J188L421o59J301P818j508j869K300J08p749o188n593J09
$$ 278 5156 3868 4394 5582 9003 8344 9645 17463 15955 14086 16386 16494 8745 2557 -3036 -2927
13978b927K489j256n052j364K251O686j297J675J740Q51N867O807J314J392k963
$$ -2927 -438 -1694 -6746 -8110 -5859 827 -470 1205 2945 3796 9663 16470 17784 19176 16213
13963A6213J814M020j859l886q122o729q236L192K334J260K131m400l091l196
$$ 16213 18027 22047 20188 16302 8180 1451 -6785 -3593 -1259 1 2132 -2268 -5359 -8555
13949h555k701O23J855N135O4p397M683j008l715R01O728O404P176L979q000p95
$$ -8555 -11256 -10633 -8778 -3643 -3579 -10976 -6293 -7301 -11016 -10115 -3387 3017 10193 14172 6172 5377
13933E377J302l588M458K667p60k313k183j0895r85O620M089N9N615J0189k398
$$ 5377 6679 3091 7549 10216 9456 7143 4960 -5935 -6920 -300 3789 3848 9463 19652 17254
13918A7254p392k113k014k663l872O033N439l767m111j373L032j094j065j806
$$ 17254 9862 7749 5735 3072 -800 5233 10672 6905 2794 1421 4453 3359 2294 488
13904D88M726J360J933K008o50j61l165k486J164K716K396l500k421J926k003
$$ 488 5214 6574 8507 10515 9865 9704 6539 4053 5217 7933 10329 6829 4408 6334 4331
13889D331o07J4l476M466P096l277N850k407p221K463R849N435o341o731r595
$$ 4331 3724 3738 262 4728 11824 8547 14397 11990 4769 7232 17081 22516 16175 9444 -151
13874a51k863O263N628p169n92K705M58M67L12p665K584N088N740N409p073l000
$$ -151 -3014 3249 8877 1708 1116 3821 4279 4746 5058 -2607 -23 5065 10805 16214 9141 6141
13858F141l06m86k559o785k333m538K147O775j70o51j171L058P85L70J03J736
$$ 6141 5835 5349 2790 -3995 -6328 -10866 -8719 -1944 -2114 -2765 -3936 -878 -93 277 380 2116
13842B116J038j530m257k735J596K756J580N05L644K407Q77J719P081L468O1k888
$$ 2116 3154 1624 -2633 -5368 -3772 -1016 564 1069 4713 7120 7997 9716 16797 20265 20326 17438
13826A7438o682k44n633J2j209P75m717n260J359j024K463L090J518K853k057
$$ 17438 10756 10512 4879 4891 3682 4457 -260 -5520 -4161 -5185 -2722 368 1886 4739 2682
13811B682L588n43o578n909l077N316O913O92n058j72l583k717M212M561L1M87
$$ 2682 6270 5727 -851 -6760 -9837 -4521 2392 3084 -1974 -2146 -5729 -8446 -4234 327 358 845
13795H45O62K66J503M614N752j896p974p424l349n995K35K065L983k393J341O267
$$ 845 1507 1773 3276 7890 13642 11746 3772 -3652 -7001 -12996 -12761 -10696 -6713 -9106 -7765 -1498
13779a498j373n437P5J889Q810M141Q17k093M791j483l280l327O770J193o40K444
$$ -1498 -2871 -8308 -8233 -6344 2466 6607 7424 5331 10122 8639 5359 2032 8802 9995 9355 11799
13763A1799K20k163m205q913j645O769O089k051j957l468o051l492l42k858J373
$$ 11799 12019 9856 5651 -3262 -4907 1862 7951 5900 3943 475 -5576 -9068 -9410 -12268 -10895
13748a0895k392m28N304J0282k0q400M882M837R31r04m819L928M36K952m081j473
$$ -10895 -13287 -13715 -8411 1871 1851 -6549 -1667 3170 4101 3197 -1622 2306 2742 5694 1613 140
13732A40j272j22N52L297K136j753l16K104O51L888O407k05n016l25J354O203
$$ 140 -1132 -1254 -702 2595 4731 2978 2662 4766 5417 9305 15712 15507 10491 10166 11520 17723
13716A7723l717r115j994l356k725M907Q517m177p969o550P49k399O235O374J346
$$ 17723 14006 4891 2897 -459 -3184 1723 10240 6063 -1906 -8456 -7707 -10106 -3871 2503 3849
13701C849R24l65K613J147k280p509j580O102R978P853R93R19l425p096q410m397
$$ 3849 4773 4408 7021 8168 5888 -1621 -3201 2901 12879 20732 21725 22644 19219 12123 3713 -684
13685f84n156N560J2694K546K80l319l725p81L376L807q94o895m513L402J637
$$ -684 -5840 -280 12414 14960 15240 11921 8196 7415 10791 14598 13704 6809 2296 5698 7335
13670G335l283R3n933L996J493N694O188N20N14k160R64J160J622o887j913p09
$$ 7335 4052 4145 -1788 2208 3701 9395 15583 16103 16617 14457 15421 16581 18203 11316 9403 8694
13654H694J604K268l140K389r29j91q84l227J669M357P596O36o143o508L315M073
$$ 8694 10298 12566 9426 11815 10886 10695 9811 6584 8253 12610 20206 20842 14699 8191 11506 15579
13638A5579j227n011k034J038M038R84p235n543J401L576R03q364L842R260m773
$$ 15579 14352 9341 7307 8345 12383 13367 6132 589 1990 5566 6469 -1895 1947 11207 6434
13623F434J941J1805R529r333j2052P95M159J861l241l13o128n839l014m73o11
$$ 6434 8375 20180 29709 20376 8324 9119 13278 15139 11898 11585 5457 -382 -3396 -3869 -4480
13608d480L935J737Q93N801M502M572O019P39l640k19n917j2095L578L157M17
$$ -4480 -545 1192 2085 7886 12388 16960 22979 23718 20078 19859 13942 1847 5425 8582 8999
13593H999M05N962J298l881J717Q148k675K512K839n423n476P81j5k002j133O638
$$ 8999 9404 15366 16664 12783 14500 22648 19973 22485 25324 19901 14425 15206 15191 13189 12056 18694
13577A8694l121n518M510O711N18l205n44n53l887N343P18j299k119l296K082
$$ 18694 15573 10055 14565 21276 21794 18589 18045 17492 13605 18948 19666 18367 16248 12952 15034
13562A5034m823k692o77O295O72p937o074J699J857K564L834L533J813o641R884
$$ 15034 10211 7519 6842 13137 13809 5872 -202 1497 3354 5918 9752 13285 15098 8457 18341
13547A8341J4210K267p564q712m58M882n016p885j41J1804K582O462L337K11N247
$$ 18341 32551 34818 27254 18542 18084 22966 17950 10065 9924 21728 24310 30772 34109 34320 39567
13532C9567J962o037l663m511j666j293M175Q649J0683l029o535J184N13r82k63
$$ 39567 41529 35492 31829 27318 25652 24359 28534 37183 47866 44837 38302 39486 39999 39017 38754
13517C8754l308M047Q95l698P503k367R36M25q46L185M757L005P569Q713R946
$$ 38754 35446 39493 40388 36690 44193 41826 42762 43187 42341 45526 50283 53288 60857 69570 79516
13502G9516N273O320R933R924J3381J0341O005L561n779j2480j3527j7104k0390
$$ 79516 84789 91109 101042 110966 124347 134688 140693 144254 138475 125995 112468 95364 74974
13489G4974j0225l653r229m851j041J619P753L474k972P60L574k276K021J05M526
$$ 74974 64749 61096 51867 47016 45975 47594 55347 58821 55849 56609 60183 57907 59928 60033 64559
13474F4559L172q6M489L477L969K41J616M947J1059L889j229J0197J9820J7166
$$ 64559 67731 67645 72134 75611 79580 79821 81437 86384 97443 101332 100103 110300 130120 147286
13460A47286J7357J8099J8917K7057J5051O325J140j1217k5955l1706l2122l5385
$$ 147286 164643 182742 201659 228716 243767 250092 251232 240015 214060 182354 150232 114847
13448A14847k3876q600j1386n891K50J083k552p853K45J305J70k783m895q077
$$ 114847 90971 82371 70985 65094 65344 66427 63875 56022 56267 57572 57742 54959 50064 41987
13434D1987M039M180J146P62p580o09Q371O212J838o99j471K237N751J0346J6266
$$ 41987 46026 50206 51352 52114 44534 43925 52296 58508 60346 59647 58176 60413 66164 76510 92776
13419I2776J4566P250N821P436P510K684l980j2206r722k1341k6728j3659l149
$$ 92776 107342 114592 120413 127849 135359 138043 134063 121857 112135 90794 64066 50407 47258
13406D7258P8L458k738r795j076j578j0847q094k659j602k062K554J2381L851
$$ 47258 47336 50794 48056 38261 37185 35607 24760 16666 14007 12405 10343 12897 25278 29129
13392B9129m96K031o0J956l546j972N156P14k992K820o430J924P72k22L103L649
$$ 29129 28633 30664 30604 32560 29014 27042 32198 32912 29920 32740 26310 28234 29006 28784 31887 35536
13376C5536J0640J286j487p567j0389L822j727O184M666J446k298o453n131M747
$$ 35536 46176 47462 45975 38408 28019 31841 30114 36298 40964 42410 40112 33659 28528 33275
13362C3275n596m63K134O102l495p41L117m005j685K976J846J174J0430J829j5310
$$ 33275 27679 27216 29350 35452 31957 31216 34333 30328 28643 31619 33465 34639 45069 46898 31588
13347C1588m439O734k143J704l13n949K102K950l722j957n204N554P506J814p90
$$ 31588 27149 33883 31740 33444 33131 27182 29284 32234 28512 26555 21351 26905 34411 36225 35435
13332C5435j515K881P11P02Q73K541R1R8O842n99k878o47l354L340L516K70n078
$$ 35435 33920 36801 37512 38214 39087 41628 41719 41817 48659 48060 45182 44535 41181 44521 48037 48307 43229
13315D3229k765j026M501J6740N219j1149m632m733o477K153L605O081L767O385
$$ 43229 40464 39438 43939 60679 65898 54749 50117 45384 38907 41060 44665 50746 54513 60898
13301F0898O49m7R24k664k42l465m773K65o33J31j17R419P436N135K166K388J2638
$$ 60898 61547 61500 62424 59760 59518 56053 51280 51545 50912 51043 50926 60345 67781 72916 75082 77470 90108
13284I0108j027k215O951R008L106n95l736p789r361j6167j347K406M522J005
$$ 90108 89081 86866 93817 102825 105931 105336 101600 93811 84450 68283 66936 69342 73864 74869
13270G4869j338J070m987K455n397j704R690P521P737J659L831k126K639L867
$$ 74869 73531 74601 69614 72069 66672 64968 74658 82179 89916 91575 95406 93280 95919 99786
13256I9786J118p635n86m296n644m890o934N756L760L023J0883J1594J3280P996
$$ 99786 100904 93269 92683 88387 82743 77853 70919 76675 80435 83458 94341 105935 119215 127211
13242A27211R656Q629Q679Q042N441n39j4939k6984j7246o560r170r170l719K001
$$ 127211 136867 145496 154175 162217 167658 167119 152180 125196 107950 101390 92220 83050 79331 81332
13228H1332O39n41m708n421l74L221N606L544M991L25O697j111M395M450M13p079
$$ 81332 81971 81430 76722 71301 70927 74148 79754 83298 88289 88614 95311 94200 98595 103045 103458 96379
13212I6379n109m784N425l8k394O092L118R384O247l74o321n800m016Q994R666
$$ 96379 91270 86486 91911 91873 89479 95571 98689 108073 114320 113946 107625 101825 97809 106803 116469
13197A16469J062L297o167j4662j2543m661l219P297k658n855J329k36q407n49
$$ 116469 117531 120828 114661 99999 87456 82795 79576 86873 84215 78360 79689 79453 71046 70497
13183G0497m78K978N907J0832j373j4056k293M552L239Q758r1N51J494L287N769
$$ 70497 70019 72997 78904 89736 88363 74307 72014 76566 79805 88563 88472 89023 90517 93804 99573
13168I9573l553K820L837j048J746k180j3022r771J728J403j18j374k383J0852
$$ 99573 96020 98840 102677 101629 103375 101195 88173 78402 80130 81533 81415 80041 77658 88510
13154H8510Q703L829j279j190R647L294k858M975O891P919m090k195k65l92O360
$$ 88510 97213 101042 99763 98573 108220 111514 108656 113631 120522 128441 124351 122156 121891 121499 127859
13139A27859L136L531l397K358L233k386j962L267N579N348P215N068l144L841
$$ 127859 130995 134526 131129 133487 136720 134334 132372 135639 141218 146566 153781 158849 155705 159546
13125A59546M34Q637J919j1254j2410M964L501l705n844N964K424k634J5101O474
$$ 159546 159980 168617 170536 159282 146872 151836 155337 151632 145788 151752 154176 151542 166643 173117
13111A73117L550L269K285L93M877R461O850Q925J5346k458k31J0266J2829N194
$$ 173117 176667 179936 182221 182614 187491 196952 203802 212727 228073 225615 225384 235650 248479 253673
13097B53673O883J298J0450J3073R683J3915J3017J3543J7888J3603Q833J6204
$$ 253673 260556 261854 272304 285377 295060 308975 321992 335535 353423 367026 375859 392063
13085C92063K1874K3093K9584L0902M4622N3339N6697Q1629R1276J14317J21685
$$ 392063 413937 437030 466614 497516 542138 595477 652174 733803 825079 939396 1061081
13074A061081J43463J68070J92261J95293K01282K12001K00589J98753K00414
$$ 1061081 1204544 1372614 1564875 1760168 1961450 2173451 2374040 2572793 2773207
13065B773207J97682K07279K14118K20227K36223K59482K88512L30863L99346
$$ 2773207 2970889 3178168 3392286 3612513 3848736 4108218 4396730 4727593 5126939
13056E126939N12579O63938Q90959J192348J531182J838139K034236K087804K021586
$$ 5126939 5639518 6303456 7194415 8386763 9917945 11756084 13790320 15878124 17899710
13047A7899710J881281J668936J208920L02966j032913k391047l262678l342893
$$ 17899710 19780991 21449927 22658847 22961813 21928900 19537853 16275175 12932282
13039A2932282k811212k054093j374168q68755n15679k76764r8598M5757J55160
$$ 12932282 10121070 8066977 6692809 5824054 5308375 5031611 4933013 4978770 5133930
13030E133930K26162K56308K76293K82836K89105L02735L15916L47002L74293
$$ 5133930 5360092 5616400 5892693 6175529 6464634 6767369 7083285 7430287 7804580
13021G804580L98237M40609N05791N97384P31533R16230J214756J662816K270157
$$ 7804580 8202817 8643426 9149217 9746601 10478134 11394364 12609120 14271936 16542093
13012A6542093L003223L699204M175316M324637M191276L917491L551560K771282
$$ 16542093 19545316 23244520 27419836 31744473 35935749 39853240 43404800 46176082
13004D6176082J098429j652275m762068p035807p610306o581721m884596l319970
$$ 46176082 47274511 45622236 40860168 33824361 26214055 19632334 14747738 11427768
12996A1427768k197987j464974r97549o71753m56856k96289j77544j11883n8960
$$ 11427768 9229781 7764807 6767258 6095505 5638649 5342360 5164816 5052933 4993973
12987D993973l4710k5136j055L8331P3200R1346J28014J56753K00220K56862L34243
$$ 4993973 4959263 4934127 4933072 4971403 5044603 5135949 5263963 5420716 5620936 5877798 6212041
12976F212041M39583N83864P94933J081149J431544J784107K033397K122710K066871
$$ 6212041 6651624 7235488 8030421 9111570 10543114 12327221 14360618 16483328 18550199
12967A8550199J931188J735586J339268N48704p27341k211442l373207l777838
$$ 18550199 20481387 22216973 23556241 24104945 23377604 21166162 17792955 14015117
12959A4015117l396409k629756j851461j261539q73668o24908m71380l56689k73171
$$ 14015117 10618708 7988952 6137491 4875952 4002284 3377376 2905996 2549307 2276136
12950B276136k09613j78036j50286j29756j15938j02284q6916q2848p8375n8820
$$ 2276136 2066523 1888487 1738201 1608445 1492507 1390223 1303307 1220459 1142084 1083264
12940A083264m7680m5943l7996l5170k4841j8304j6198j8242r737q807j1690j2272
$$ 1083264 1035584 989641 951645 916475 891634 873330 857132 838890 829153 820346 808656 796384
12928G96384j5997o855m283j89o446j2765r702j024o179r545k509l063j685O82
$$ 796384 780387 773532 769249 769060 762614 749849 740147 739123 732944 723399 720890 717827 716142 716824
12914G16824m527n11K399Q914K880k521N268O431p021K241k988K999k220p313
$$ 716824 712297 711786 714185 723099 725979 723458 728726 735157 728136 730377 727389 730388 728168 720855
12900G20855q935l198J378m970p83L226o574j975P792O127O524N084P04J138L252
$$ 720855 711920 708722 710100 705130 704347 707573 700999 699024 706816 712943 719467 724551 725255 726393 729645
12885G29645N323J048L302R461R659J2512J0753J2944R540M595r010o874L943
$$ 729645 734968 736016 739318 748779 758438 770950 781703 794647 804187 808782 799772 792898 796841
12872G96841M825P095J3100L090L801J8168J4292K214k76m634m621j019r63p318
$$ 796841 801666 808761 821861 824951 828752 846920 861212 863426 863150 858516 853895 852876 851913 844595
12858H44595n199N645Q124J2677J4515J2227l199L518J696Q81O543O689J64N653
$$ 844595 839396 845041 853165 865842 880357 892584 889385 892903 894599 895480 902023 908712 908876 914529
12844I14529J3165J3676J6871J8123J6516J7175Q272J4364J2664Q684K537k474
$$ 914529 927694 941370 958241 976364 992880 1010055 1018327 1032691 1045355 1054039 1056576 1054102
12832A054102p607j866L710M021J0455O451J4396K1079J1244l340j993J1635J0304
$$ 1054102 1046495 1044629 1048339 1052360 1062815 1069266 1083662 1104741 1115985 1112645 1110652 1122287 1132591
12819A132591R774J2482J5512Q093O732J5064J2741J0450J0017J3154J3874J3416
$$ 1132591 1142365 1154847 1170359 1178452 1185184 1200248 1212989 1223439 1233456 1246610 1260484 1273900
12807A273900J4390J8146J7599J4750J6001J3681J7704K4345K2411K1421K5221
$$ 1273900 1288290 1306436 1324035 1338785 1354786 1368467 1386171 1410516 1432927 1454348 1479569
12796A479569J6935J0753K5175J4446J5283J7121J6748J8844K5441K3470J1235
$$ 1479569 1496504 1507257 1532432 1546878 1562161 1579282 1596030 1614874 1640315 1663785 1675020
12785A675020J9654K5749J7576J9608K2676K9628K8120K3800K4951J4964K2151
$$ 1675020 1694674 1720423 1737999 1757607 1780283 1809911 1838031 1861831 1886782 1901746 1923897
12774A923897L7538L5566L0959K3292L1891L2182K9550K9314K5163L5160L2256
$$ 1923897 1961435 1997001 2027960 2051252 2083143 2115325 2144875 2174189 2199352 2234512 2266768
12763B266768L5242L8072M2675L9085L4445M5164M6380M1985M3774M1303L6292
$$ 2266768 2302010 2340082 2382757 2421842 2456287 2501451 2547831 2589816 2633590 2674893 2711185
12752B711185M1461L6038M1922M9632N3044M7823N0736M6721N1476N2247N1040
$$ 2711185 2752646 2788684 2830606 2880238 2933282 2981105 3031841 3078562 3130038 3182285 3233325
12741C233325M9041N0146N8100N7404N9742O2089O0774O2669P1673O8488O1287
$$ 3233325 3282366 3332512 3390612 3448016 3507758 3569847 3630621 3693290 3764963 3833451 3894738
12730C894738O5317O2282N9948O8084O7809O7162P0392P3643P3302O6819Q0837
$$ 3894738 3960055 4022337 4082285 4150369 4218178 4285340 4355732 4429375 4502677 4569496 4650333
12719D650333P6658Q0043P5024P8772Q7571Q6413Q0157P8173P7530P5364Q7070
$$ 4650333 4726991 4807034 4882058 4960830 5048401 5134814 5214971 5293144 5370674 5446038 5533108
12708E533108R0518R4220Q6219P4687Q4821Q3167P8936Q0280Q5479P7668P7607
$$ 5533108 5623626 5717846 5804065 5878752 5963573 6046740 6125676 6205956 6291435 6369103 6446710
12697F446710P5616P5559Q6943Q3122P6762P6246P6922P3827P7305O6450O8516
$$ 6446710 6522326 6597885 6684828 6767950 6844712 6920958 6997880 7071707 7149012 7215462 7283978
12686G283978P1459O4529N6595N3941N7433M8540M6250N1380M6802L4310L5309
$$ 7283978 7355437 7419966 7476561 7530502 7587935 7636475 7682725 7734105 7780907 7815217 7850526
12675G850526L4418K9169J7663J8830J3997J2260Q670j89k116r01r074j2196j6387
$$ 7850526 7884944 7914113 7931776 7950606 7964603 7976863 7985533 7985344 7983228 7982327 7973253 7961057 7944670
12662G944670k5161k1090k1273l1344m2472m2822m7343m4896m0301m9992n4628
$$ 7944670 7919509 7898419 7877146 7845802 7803330 7760508 7713165 7668269 7627968 7577976 7523348
12651G523348n7832m7986o1533o0835o4352o8582p4316p6234p3101q2689p5777
$$ 7523348 7465516 7417530 7355997 7295162 7230810 7162228 7087912 7011678 6938577 6855888 6780111
12640F780111p3629p9080p7991q0716p8606p3145q6234q8851p8938p6452p7358
$$ 6780111 6706482 6627402 6549411 6468695 6390089 6316944 6230710 6141859 6062921 5986469 5909111
12629E909111p9115q2983q0896q3321q0767p9923p9940p9571q3688p6306p5301
$$ 5909111 5829996 5747013 5666117 5582796 5502029 5422106 5342166 5262595 5178907 5102601 5027300
12618E027300p6958p4986p5599p6307p0211p3909o7166o9045o3806o2070p1037
$$ 5027300 4950342 4875356 4799757 4723450 4653239 4579330 4512164 4443119 4379313 4317243 4246206
12607D246206o8177o0111o1892n8883n8137n6124o2234n5257n6470m7181n1803
$$ 4246206 4178029 4117918 4056026 3997143 3939006 3882882 3820648 3765391 3708921 3661740 3609937
12596C609937m7546m2378m0820m2254m3755m1681l6900m1919m6860m8538n2452
$$ 3609937 3562391 3520013 3479193 3436939 3393184 3351503 3314603 3272684 3225824 3177286 3124834
12585C124834m6983m6575m8833o0969n9659n2682m2981m0345l9122m9656l9339
$$ 3124834 3077851 3031276 2982443 2921474 2861815 2809133 2766152 2725807 2686685 2637029 2597690
12574B597690m1111l8618k8396l3079k8519k9751k2349l2462k6806j9949k7992
$$ 2597690 2556579 2517961 2489565 2456486 2427967 2398216 2375867 2343405 2316599 2296650 2268658
12563B268658l5531l0120k4800k9204k5791k1846k3481j8800j7222j1202r695
$$ 2268658 2233127 2203007 2178207 2149003 2123212 2101366 2077885 2059085 2041863 2030661 2020966
12552B020966l586L987k50l685J724q005k7443l4724l7917m3715n4762n5118m0670
$$ 2020966 2017380 2021367 2021117 2017432 2019156 2011151 1983708 1948984 1911067 1867352 1812590 1757472 1716802
12539A716802l3290l6873l2613k1832k0619k2671j7125j7443j4849j6943j1899
$$ 1716802 1683512 1646639 1614026 1592194 1571575 1548904 1531779 1514336 1499487 1482544 1470645
12528A470645j7008j2959j2218j0234j1558j5433j5858k2450r141p454j0467j5886
$$ 1470645 1453637 1440678 1428460 1418226 1406668 1391235 1375377 1352927 1343786 1336332 1325865 1309979
12516A309979j4484r992j200o814J561j719m366l730m418o319j4611j3046j6059
$$ 1309979 1295495 1285503 1284303 1277489 1279050 1277331 1272965 1269235 1264817 1258498 1243887 1230841 1214782
12503A214782l1402l0330k6246k9580k0358j2327l650j0612j7635j4321r109r365
$$ 1214782 1183380 1153050 1126804 1097224 1076866 1064539 1060889 1050277 1032642 1018321 1009212 999847
12491I99847n576j1804j7468q622j0006j1242k569J469l366q262j1160p821o036
$$ 999847 994271 982467 964999 956377 946371 935129 932560 934029 930663 922401 911241 903420 897384
12478H97384r019j3213j1659j1910j3306j943p66j2063q557j479p9j266o78k555
$$ 897384 888365 875152 863493 851583 838277 836334 835568 823505 814948 813469 813390 812124 811446 808891
12464H08891r232p990k0332l788K087j873m911l036k770l55J833m139k357k709
$$ 808891 799659 791669 771337 767549 769636 767763 762852 759816 757046 756691 758524 754385 752028 749319
12450G49319n861n035j433k379p91O954k936m01K601O864J2042R343J6685K8166
$$ 749319 743458 738423 736990 734611 733820 740774 737838 737437 740038 746902 758944 768287 784972 813138
12436H13138L3760K6268K3306J7064J6602K3943M94m4077p8668p4316n3088l4595
$$ 813138 846898 873166 896472 913536 930138 954081 954575 910498 831830 757514 704426 669831
12424F69831k3396j7332j7030p984j373j2780j1122j6228r002m492k751K720M695
$$ 669831 646435 629103 612073 604089 602716 589936 578814 562586 553584 549092 546341 549061 553756
12411E53756r129j0551m771m737n215k411r121l861m104k252l070j239l495l899
$$ 553756 544627 534076 529305 524568 519353 516942 507821 503960 499856 497604 494534 493295 489800 485901
12397D85901l629q839j6996J16O207K757P075j1099p385J896O196o800r705L831
$$ 485901 482272 473433 456437 456553 462760 465517 472592 461493 454108 456004 462200 455400 445695 449526
12383D49526k930j549n711n900k043n934n289p258m386q310m198K932q644o986
$$ 449526 446596 445047 439336 433436 431393 425459 420170 412912 408526 400216 396018 398950 390306 383320
12369C83320J530p63K437L998M390k976o536k033n974m566j984q911L869O805
$$ 383320 384850 384087 386524 390522 394912 391936 385400 383367 377393 372827 370843 361932 365801 372606
12355C72606L763Q89p812o961j0202n73o25k552j020j945M83l789l492L76N50
$$ 372606 376369 377258 369446 362485 352283 351710 351085 348533 347513 345568 346051 342262 338770 339146 339696
12340C39696o76j758j1703j1484J645L098r25K891m068K417J212j226n794k884
$$ 339696 339020 337262 325559 314075 315720 318818 317893 320784 316716 319133 320345 319119 313325 310441
12326C10441n625J1K940k004Q39m48m459J066m79q361l598L928L227K198r237
$$ 310441 304816 304827 307767 305763 306602 306154 301695 302761 302282 293921 290323 294251 297478 299676 290439
12311B90439m628l456M913N212k478j1101m952k922l866j971l417j535M420k283
$$ 290439 285811 282355 287268 292480 290002 278901 273949 271027 267161 265190 261773 260238 264658 262375
12297B62375l312n264Q95k481K925P509n367q250k04L645Q945N391j756k000j670
$$ 262375 259063 253799 254694 252213 255138 262647 257280 249030 248826 252471 261416 266807 265051 263051 261381
12282B61381p729l758o49r400L093O770J858k948j080p074q303N735j27n258Q54
$$ 261381 253652 249894 249245 239845 242938 249708 251566 248618 247538 240464 232161 237896 237769 232511 233365
12267B33365N2p362k598L917K288p709j797n265k535L542p86l291k001l942l046
$$ 233365 233417 226055 223457 227374 229662 221953 220156 214891 212356 215898 215112 211821 209820 205878 202832
12252B02832K047m66n410N170J0248M023K453p22n888j657m466k169Q661L355
$$ 202832 204879 204413 199003 204173 214421 218444 220897 220175 214287 212630 208164 205995 214656 218011
12238B18011m392l772l973o82K376p51L404m771n895j368m671k836r19P784J147
$$ 218011 213619 209847 205874 205192 207568 206817 210221 205450 199555 198187 193516 190680 189761 197545 198692
12223A98692L7K135J55J219n49p730m242K725N286k862p908j0532M244N549J68
$$ 198692 198729 200864 201019 202238 201689 193959 189717 192442 197728 194866 186958 176426 180670 186219 186387
12208A86387k388q20j488K660k169q314L48m36N036K566k301L99l554n614l275
$$ 186387 183999 183179 181691 184351 182182 173868 174216 173780 178816 181382 179081 179480 175926 170312 167037
12193A67037j774r54K826l704l949J705l187k830L636l90M735j0J266J053n227
$$ 167037 165263 164309 167135 163431 159482 161187 158000 155170 158806 158416 163151 163141 164407 165460 160233
12178A60233M27J1P92m58O183K658q79j522l27q99j738j999L306l027k63k24l601
$$ 160233 160660 160671 161463 161005 167188 169846 168967 167445 167118 166219 164481 162482 165788 162761 162498 162274 158673
12161A58673m508J542L009q109O049K896N918j708q89Q22k823j786m563l751J178
$$ 158673 154165 155707 158716 150607 156656 159552 165470 163762 162873 163695 160872 159086 154523 150772 151950
12146A51950K590o490n748L087J84m840m74R87J730K838N330K570q93m420o744
$$ 151950 154540 148050 142302 145389 145573 140733 140259 141246 142976 145814 151144 153714 152821 148401 141657
12131A41657N224l794J960p69K425J946o066k582K217P851j448K332M706m454
$$ 141657 146881 143087 145047 144278 146703 148649 142583 140001 142218 150069 148621 150953 155659 151205
12117A51205o690j741O679M279K453P868N597j275N118J455j593P952J1359J2345
$$ 151205 144515 142774 149453 153732 156185 164053 169650 168375 173493 174948 173355 181307 192666 205011
12103B05011J6291J7766J6182J7363Q311L957J4957J7034J0250J2839R620J1282
$$ 205011 221302 239068 255250 272613 280924 284881 299838 316872 327122 339961 349581 360863
12091C60863K3484K0870J7209K5791K4284L3189N1655R0326J34294J85618K05678
$$ 360863 384347 405217 422426 448217 472501 505690 557345 647671 781965 967583 1173261
12080A173261J72815J39380J26221J46132J96594J56169k01731n45961m66680
$$ 1173261 1346076 1485456 1611677 1757809 1954403 2110572 1908841 1362880 896200
12071H96200k76494j54951q7589n5352l7177k5192k3156j2484j5166j2294j1856
$$ 896200 619706 464755 377166 321814 284637 259445 236289 223805 208639 196345 184489
12060A84489m931n691m564n435l404o48q422j2480m259o488n066O640P414j3955
$$ 184489 179558 173867 169303 163868 160464 159816 151394 138914 134655 128167 123101 129741 137155 123200
12046A23200m338N159N925N219M115j559p727j0110p720Pp8k562M916J374O499
$$ 123200 118862 124021 129946 135165 139280 137721 129994 119884 112164 112171 112093 109531 114447 115821 122320
12031A22320k436r352K915J720j0635o44P691M450L812r85M171n110q344p096
$$ 122320 119884 110532 113447 115167 104532 103888 111579 116029 119841 118856 123027 117917 109573 102477
12017A02477O31K835j969m526j502P836Q132o071o348l590o80m202p61J2091M267
$$ 102477 103108 105943 103974 99448 97946 105782 113914 107843 101495 97905 97225 93023 92262 104353 108620
12002A08620K222j00k233o05o69k426j582J357J162K674K517K413k497N177l788
$$ 108620 110842 110742 108509 107904 107235 104809 103227 104584 105746 108420 110937 113350 110853 116030 112242
11987A12242j202J257k853p673k055M261o33j335l127R639M908p940k138K930
$$ 112242 111040 112297 109444 101771 99716 103977 103344 102009 98882 108521 113429 105489 103351 106281
11973A06281l667m030J998q752j2192K317J0998J581J73n447L102K919k121l330
$$ 106281 102614 98584 100582 91830 79638 81955 92953 94534 94707 89260 92362 95281 93160 89830
11959H9830P768J066r43k806r157j560M905J175n387K995P298p069j2672K921
$$ 89830 97598 98664 97721 94915 85758 84198 89103 90278 84891 87886 95184 88115 75443 78364
11945G8364J2349p176p234N265m092l561M041P776k699l152Q74O180J333l116
$$ 78364 90713 83537 76303 81568 77476 73915 77956 85732 83033 79881 80755 86935 88268 85152
11931H5152p2R94N505j479m626L326O908J409m749P98K827l375J82J064J290J378
$$ 85152 85080 86074 91579 90100 85474 88800 95708 97117 92368 93166 95993 92618 92800 93864 95154 96532
11915I6532k320l375J549P136r14P52L630P03l032j588p032j0811O344O033P5
$$ 96532 94212 90837 92386 99522 98608 99360 102990 103693 100661 99073 92041 81230 87574 93607 93682
11900I3682K913j744J184k626j922J782k242K14l79o49k03n059n193n451l255
$$ 93682 96595 94851 96035 93409 91487 93269 91027 91241 90862 90213 90010 84951 79758 74307 71052
11885G1052O405j079k361M70o208J804K107N675j185l123k21k432K364J239J631
$$ 71052 77457 76378 74017 74487 68279 70083 72190 77865 76680 73557 73336 70904 73268 74507 76138
11870G6138J247J642j3490o247K438M839O409K077n89j237K984K902M074p655
$$ 76138 77385 79027 65537 59290 61728 66567 72976 75053 74464 73227 76211 79113 83187 75532
11856G5532K704L860J409K850O522R30K790J540m867o904q963l890O37k766o342
$$ 75532 78236 82096 83505 86355 92877 93807 96597 98137 93270 86366 77403 73513 74150 71384 65042
11841F5042j338O156L121j993k67O370k0q155n525n78P272N662L47j1954m901
$$ 65042 63704 69860 72981 70988 70721 77091 77071 68916 63391 62813 70085 75747 76094 64140 59239
11826E9239L065L680j967p870P23K958l95M604j902q80k594M73L930l436J007
$$ 59239 62304 65984 64017 56147 56870 59828 59433 64037 62135 61255 58661 59134 63064 59628 60635
11811F0635k467O715O603K579O28o231k873P73K59o024K95K585P648l631J429
$$ 60635 58168 64883 71486 74065 74693 68462 65589 66362 66621 60597 60892 63477 71125 67494 68923
11796F8923j693k08M527p432j444q3n732N889p13o001n047o020k323Q848N955
$$ 68923 67230 67022 71549 64117 62673 62590 56858 62747 62034 56033 50986 44966 42643 51491 57446
11781E7446K126j843J617M3n221r37j873l446j25N840N105k917k990p29j00Q221
$$ 57446 59572 57729 59346 59389 54168 53231 51358 47912 47787 53627 58732 55815 52825 52096 51996 60217
11765F0217k55L93l004P08K724P64n157l620l415K423k181M180l488K805k661
$$ 60217 59962 60355 57351 58059 60783 61547 56390 52770 49355 51778 49597 53777 50289 53094 50433
11750E0433K098L458o609M48J209Q54J391k882l195o100j956L533K188n103K380
$$ 50433 52531 55989 49380 49828 51037 51891 53282 50400 47205 41105 39149 42682 44870 39767 42147
11735D2147P971K272J288L420q35P78o813p562K143M584l682K573j079j588k101
$$ 42147 50118 52390 53678 57098 56263 57041 50228 42666 44809 49393 45711 48284 47205 45617 43516
11720D3516N729Q480q89j545O583j354K411k510j0659l627O641L743K311n326
$$ 43516 49245 57725 56836 55291 61874 60520 62931 60421 49762 46135 52776 56519 58830 53504
11706E3504j575q846M242j209J790J583N476M732n326o015M05k427l618l184M262
$$ 53504 51929 43083 47325 46116 47906 49489 54965 59697 54371 48356 48761 46334 42716 39532 43794
11691D3794j476k015M475O011M66l034L012K945L743k31q541k09o651L245N108
$$ 43794 42318 40303 44778 50789 51255 48221 51233 54178 57921 57690 49149 48940 42289 45534 50642
11676E0642k764m329j935M444N184N557J251o918N453J0658k88k283p142m340
$$ 50642 47878 43549 41614 46058 51242 56799 58050 51132 56585 67243 66955 64672 57530 53190
11662E3190l046p182K009J152o868n72L091N727o18m231L361J931k869r55K753
$$ 53190 50144 42962 44971 46123 39255 38683 41774 47501 46883 42652 46013 47944 45075 44120 46873
11647D6873J202M410K617J537l035l466M105k998k628l071m497J792P499k885
$$ 46873 48075 52485 55102 56639 53604 50138 54243 51245 48617 45546 41049 42841 50340 47455
11633D7455k509P475R838J348O53n508m232j332J655M939j779k369K518N82J470
$$ 47455 44946 52421 62259 63607 64260 58752 54520 53188 54843 59782 58003 55634 58152 58734 60204
11618F0204L581M473L340k049J543L383N247M670Q78l663l78k242m004j773j1837
$$ 60204 63785 68258 71598 69549 71092 74475 79722 84392 85270 81607 81229 78987 74983 73210 61373
11603F1373m103k742J720J612r185j0322l428P087L242j565j586Q01K804j1811
$$ 61373 57270 54528 56248 57860 48675 38353 34925 42012 45254 43689 42103 42904 45708 33897
11589C3897m339Q419K838J872j947k276P951M277p47k527n267m791K418j410k497
$$ 33897 29558 37977 40815 42687 40740 38464 46415 50692 49945 47418 42151 37360 39778 38368 35871
11574C5871J008P003l748k319m175K188N451o64q518r539j485N465J4004R780
$$ 35871 36879 43882 40134 37815 33640 35828 41279 40615 32097 22558 21073 26538 40542 50322
11560E0322n191p756p087P74K277K632K432O96j733L399k624o569m304m006N801
$$ 50322 45131 37375 30288 31062 33339 35971 38403 39099 37366 40765 38141 31572 27268 23262 29063
11545B9063O723M824n402p393r71N206M557k94p100p969j625N252O242n671K726
$$ 29063 35786 40610 35208 27815 26844 32050 36607 36313 29213 21244 19619 24871 31113 25442 28168
11530B8168N33K645P63j759j010o954M036P604o949m704O290J248k488R558N147
$$ 28168 28701 31346 32109 30350 29340 22386 26422 34026 27077 22373 28663 29911 27423 36981 42128
11515D2128o666j713J801j070n895j887K137R27O972o732p556P886J2020K265
$$ 42128 35462 33749 35550 34480 28585 26698 28835 29762 36734 30002 22446 30332 42352 44617
11501D4617k992j145L901j3428j4771l979r29L590M406L728L625M102K458n39
$$ 44617 41625 40480 44381 30953 16182 12203 11274 14864 19270 22998 26623 30725 33183 32644
11487C2644q899n610O90P77O087J918j335R17j442L981J768k63N182p34k526J846
$$ 32644 23745 18135 18825 19602 25689 27607 26272 27189 25747 29728 31496 31233 36415 35681 33155 35001
11471C5001K427K079l641j960J219j233j053L526K961J149k512K993O95K257q589
$$ 35001 37428 39507 35866 33906 35125 33892 32839 36365 39326 40475 37963 40956 41651 43908 35319
11456C5319p662m575M25R899O207m754n003R357m97N53M64j3003p400L541P857
$$ 35319 27657 23082 23507 33406 39613 34859 29856 39213 38716 39269 39733 26730 19330 22871 30728
11441C0728J417L685n741m84M762k916J671o059k15j486k925J332N64j786J148
$$ 30728 32145 35830 30089 29605 34367 31451 33122 27063 26848 25362 22437 23769 24333 22547 23695
11426B3695N642P218k94o061j425Q6j85M153n616l582J444k578k644M992M180
$$ 23695 29337 36555 36261 30200 28775 28861 28676 32829 27213 23631 25075 22497 19853 24845 29025
11411B9025k901o76p19J985P8p275l238J576M803J037k238k785p74O533M788p89
$$ 29025 26124 25448 24729 26714 26792 19517 16279 17855 22658 23695 21457 18672 17898 24431 29219 28430
11395B8430p6P797m407j318j89k064q660j550P93M847K225o48j254J281j549l138
$$ 28430 28354 36151 31744 30426 30237 28173 19513 17963 18756 23603 25828 25180 23926 25207 23658 20520
11379B0520L407l853m626K721L061M30n881L519Q647m715n434K73J262j472k749
$$ 20520 23927 20074 15448 18169 21230 21660 15779 19298 27945 23230 17796 18069 19331 17859 15110
11364A5110P788J308J304p17j936O9M246j069J849J215Q23L092k617n644p030
$$ 15110 22898 24206 25510 24793 22857 22926 27172 26103 27952 29167 29990 33082 30465 24821 17791
11349A7791J450K998j974O170R970k439k873m916K542N183n562k980m166k887
$$ 17791 19241 22239 20265 26435 36405 33966 31093 26177 28719 33902 28340 25360 21194 18307
11335A8307M534J589O01k805k517k861M017N257l053r664j810N350M396l245k213
$$ 18307 22841 24430 25031 22226 19709 16848 20865 26122 23069 13405 11595 16945 21341 18096 15883
11320A5883N358P122p231k842J499J413O75M43M738l90j945J052L185K971M04
$$ 15883 21241 28363 21132 18290 19789 21202 21877 22320 27058 26668 24723 25775 28960 31931 32335
11305C2335L01l204j873J113j161J622L863p854l640j414k936n922P500J178l943
$$ 32335 32636 29432 27559 28672 27511 29133 32996 25142 21502 20088 17152 11230 18730 19908 15965
11290A5965m767j474L923M036p0P206M043n090L694J0507n449q686J246N84K65
$$ 15965 11198 9724 13647 17683 17613 24819 28862 23772 27466 37973 32524 23838 25084 25668 25933
11275B5933O366O560N942R584L091p360m422l160m453j5136o177l468o794q245
$$ 25933 32299 38859 44801 54385 57476 50116 45694 42534 38081 22945 16768 13300 6506 -1739
11261a739l710L232L640M971Q503R152J586j272k813o146k851J486J544m186L28
$$ -1739 -5449 -2217 1423 6394 14897 24049 25635 24363 21550 15404 12553 14039 15583 11397 11725
11246A1725O887P024R360l436k862o778p514L979N585L907K464l813m118j158
$$ 11725 18612 25636 34996 31560 28698 21920 14406 18385 23970 27877 30341 26528 22410 21252
11232B1252N087M429Q114j317m395R8O870N426K57j779P495R425Q917p034n575
$$ 21252 26339 30768 38882 37565 33170 33268 40138 45564 45821 44042 51537 60962 69879 62845 57270
11217E7270J564j50O13N624O418L883Q783O086L075L810J205l270k790m006k175
$$ 57270 58834 58684 59297 64921 71339 75222 84005 90091 93166 96976 98181 94911 92121 88115 85940
11202H5940o345j616j560L0l554J485n141r277p810k120L290j728m75m618M73
$$ 85940 79595 77979 76419 76449 72895 74380 69239 59962 52152 50032 53322 51594 51119 46501 46974
11187D6974m498p245o535N780P691K122N04j0143p758N562M505q24O801N236N126
$$ 46974 42476 35231 28696 34476 42167 44289 44793 34650 26892 32454 36959 36135 42936 48172 53298
11172E3298P154R55j691J879J319L737O862o848o052j07j025K125J4599R747N232
$$ 53298 60452 61407 59716 61595 62914 66651 73513 66665 60613 60506 59481 61606 76205 85952 91184
11157I1184m045n870L899J2639O213l502q97O41k086O85r57N87N017q81L425O928
$$ 91184 87139 81269 85168 97807 104020 100518 99621 100262 98176 98861 97904 98491 103508 102627 106052 112980
11141A12980l419k302O609j1349j1922o883o20O699k19j3134o891o784p165p956
$$ 112980 109561 107259 113868 102519 90597 83714 83094 89793 89574 76440 69549 62765 55600 47644
11127D7644J793j536Q53k856m709j377j467P51q496J338l0q254l486M272L973
$$ 47644 49437 47901 48754 45898 41189 39812 38345 39096 30600 31938 31908 23654 20168 24440 28413
11112B8413j841r921M286O968k415q205m184O41M880j432L152P003J982k211k681
$$ 28413 26572 16651 20937 27905 25490 17285 13101 13742 18622 17190 20342 27345 29327 27116 24435
11097B4435q796N618k87K770j388k988J789k019m236L699n994k458N697P395L111
$$ 24435 15639 21257 20970 23740 22352 19364 21153 19134 14898 18597 12603 10145 15842 23237 26348
11082B6348M30l941J185j532p860K022J20P359J084L197N548J741P65k10M311
$$ 26348 26778 22837 24022 22490 14630 16652 16772 24131 25215 28412 33960 35701 36466 36256 40567
11067D0567P139p215n179j247l773j1669k245L612O853L897J860m143k846n84
$$ 40567 47706 40491 35312 34065 30292 18623 16378 19990 26843 30740 32600 28457 25611 25027
11053B5027l608l969n024k50J0939j189p98K227M596N384J936K223M57r71j840
$$ 25027 21419 17450 12426 12176 23115 21926 21128 23355 27951 33335 35271 37494 37951 36980 35140
11038C5140J699J3235m634k734N523L17N49o254N137R711P651P765L269J532J348
$$ 35140 36839 50074 45440 42706 48229 48546 49095 42841 47978 57689 65340 73105 76374 77906 79254
11023G9254L238J717k333m213j2784j6274m796n686j7505m374p813k683N027M686
$$ 79254 82492 84209 81876 77663 64879 48605 43809 38123 20618 16244 8431 5748 10775 15461
11009A5461L374L477j867k98k608O98M97Q165L711j020o64n764n05k305L209K216
$$ 15461 18835 22312 20445 20147 17539 18237 18734 26899 30610 29590 28926 23162 22657 20352 23561 25777
10993B5777J0569P350K826k165L38J356j871Q7J1878J07O580Q851J0001M026J0252
$$ 25777 36346 43696 46522 44357 44695 46051 44180 44267 56145 56252 62832 71683 81684 85710 95962
10978I5962Q875L414K195Q71M270P463J374o843o442j1021j0252j0736j6408n018
$$ 95962 104837 108251 110446 111317 115587 123050 124424 117581 111139 100118 89866 79130 62722 57704
10964E7704j1781j0361n720m150R890q63j452K084l044k357O359K049k268q041
$$ 57704 45923 35562 29842 25692 35582 34719 33267 35351 32307 29950 36309 38358 36090 28049
10950B8049r32P313J830P180O116L816M003n694O617O092k914P635L970P120J2649
$$ 28049 27117 34430 36260 43440 49556 53372 57375 51681 58298 64390 61476 69111 73081 80201 92850
10935I2850Q931R446P607J4819J4469Q784J4415R937k1k887j254j7240k1697j8405
$$ 92850 101781 111227 118834 133653 148122 156906 171321 181258 181237 178350 177096 159856 138159 119754
10921A19754j5054j0011m837j0739j3338o045r566n330m174j3736p086L973N944
$$ 119754 104700 94689 89852 79113 65775 59730 50164 44834 40660 26924 19838 23811 29755
10908B9755Q462N458K025m049r45q392Q5o62k288q527q85j756O09M256j070M516
$$ 29755 38217 43675 45700 41651 40706 32314 32399 31737 29449 20922 20037 18281 18890 23146 22076 26592
10892B6592K844J1224J0557L304k03J3033R011O229J5473P731O790J0486K909
$$ 26592 29436 40660 51217 54521 54318 67351 76362 82591 98064 105795 112585 123071 125980
10879A25980k81j656j0540j6436j7203j8702j4450j1216l862p655j3055l041P577
$$ 125980 125699 124043 113503 97067 79864 61162 46712 35496 31634 23979 10924 7883 15460
10866A5460j389o034j754J706L704n846N06J740j2L335p92o041m589L513J006
$$ 15460 14071 8037 6283 7989 11693 5847 6353 8093 8081 11416 10624 4583 -6 3507 4513
10851D513k453j574P250j222J764K877n397o417k673K112L5N898K511K271L18
$$ 4513 2060 486 7736 6514 8278 11155 5758 -659 -3332 -1220 -1185 4713 7224 9495 9813
10836I813j695L61J056n710K163K230k234N189j532L976L894k484m464o515l208
$$ 9813 8118 8479 9535 3825 5988 8218 5984 11173 9641 13617 17511 15027 10563 4048 840
10821H40N337J429J039L994M620M797r8J148n318k201K615j388l841k307j26j097
$$ 840 6177 7606 8645 12639 17259 22056 21958 23106 17788 15587 18202 16814 12973 10666 10540 9443
10805I443k859O638K691m0q535q015J788j597Q215J267p853L548j992k478N269
$$ 9443 6584 13222 15913 15873 7338 -677 1111 -486 7729 8996 1143 4691 2699 221 5490
10790E490J0560j19J344J436l823p048R32K868o30n653j923j527O684M752J674
$$ 5490 16050 15931 17275 18711 14888 7840 8772 11640 11010 5357 3434 1907 8591 13343 15017
10775A5017L167N350R866q05n328K89l405j314M965J584l035P12J685M025R2m773
$$ 15017 18184 23534 33400 32595 27267 27556 24151 22837 27802 29386 26351 27063 28748 32773 32865 28092
10759B8092K036M427k156L812J643o852N940N82M40j765P690Q519J1100l10J231
$$ 28092 30128 34555 32399 36211 37854 31002 36942 37524 37964 36199 43889 52408 63508 63198 64429
10744F4429L342j203P145Q995L664R687K7527M4081M4477M7596L8282K7693K9104
$$ 64429 67771 66568 73713 82708 86372 96059 123586 167667 212144 259740 298022 325715 354819
10731C54819M4955N4843J0277j10963j34795q8157m1465j9680j7761j0235m278
$$ 354819 399774 454617 464894 353931 219136 130979 89514 69834 52073 41838 37560
10720C7560J74q557o040o088n119j735k187m904l452j238N465Q03k371L087Q881
$$ 37560 37734 29177 23137 17049 11930 10195 8008 3104 -348 -1586 3879 4682 2311 5398 14279
10705A4279K558M498K443l123j47M244J139K68j409n284l000P382N694K680k324
$$ 14279 16837 21335 23778 20655 20508 24752 25891 26159 24750 19466 16466 23848 29542 32222 29898
10690B9898j476K747J6132N233q616P02R619Q079K111k949N007K371L956Q386
$$ 29898 28422 31169 47301 52534 43918 44620 54239 62318 64429 61480 66487 68858 72814 81200
10676H1200J838m565q774M72j321r455n662p206k144R33m082l880p62K689N812
$$ 81200 83038 78473 69699 70171 68850 59395 53733 46527 44383 45316 41234 37354 36592 39281 45093
10661D5093Q958L301l5n027K253N968K222M308J385j536O257R092P028Q000m537
$$ 45093 54051 57352 57317 52290 54543 60511 62733 67041 68426 66890 73147 82239 89267 97267 92730
10646I2730p039o835n360j3680r748j2611j5313J014P200R723R516J4381J0576
$$ 92730 85691 78856 73496 59816 50068 37457 22144 23158 30358 40081 49597 63978 74554
10633G4554J3532J1624J1932J4756J7138R708J8746J8350J3713P479N385J1528
$$ 74554 88086 99710 111642 126398 143536 153244 171990 190340 204053 211532 216917 228445
10621B28445J7999K1989J4736J5528R922J0073J1388J4853J7271K2122L4346M7958
$$ 228445 246444 268433 283169 298697 308619 318692 330080 344933 362204 384326 418672 466630
10609D66630N1447N4345P4069R4642J14601J33323J37453J45805J33463J10686
$$ 466630 518077 572422 646491 741133 855734 989057 1126510 1272315 1405778 1516464
10599A516464P7464M1663j6201q0516j21757j28090j15701q4617l3983L334M6451
$$ 1516464 1593928 1635591 1619390 1538874 1417117 1289027 1173326 1088709 1054726 1058060 1104511
10588A104511Q5259J22164J41856J63577J77598J74121J80343J84316J84291J89775
$$ 1104511 1189770 1311934 1453790 1617367 1794965 1969086 2149429 2333745 2518036 2707811
10578B707811J90398K00969K10738K28473K46615K79725L33172M12112N27203
$$ 2707811 2898209 3099178 3309916 3538389 3785004 4064729 4397901 4810013 5337216
10569E337216O90486Q95739J134521J374830J563479J691925J735093J676024
$$ 5337216 6027702 6923441 8057962 9432792 10996271 12688196 14423289 16099313
10561A6099313J490244J103089M79385l61287j217214j924921k360183k423168
$$ 16099313 17589557 18692646 19172031 18810744 17593530 15668609 13308426 10885258
10553A0885258k185621j771297j298054q87070n76752l48725j90156r0924j0045
$$ 10885258 8699637 6928340 5630286 4743216 4166464 3817739 3627583 3536659 3526614
10544C526614N8828J13297J53038J94537K22019K60736L00467L41769L97206M59247
$$ 3526614 3585442 3698739 3851777 4046314 4268333 4529069 4829536 5171305 5568511 6027758
10534F027758N23901N77896O15151O43841O72159O88614P10345P24129P45992
$$ 6027758 6551659 7129555 7744706 8388547 9060706 9749320 10459665 11183794 11929786
10525A1929786Q30467J026524J376168J805205K227370K550020K723663K749728
$$ 11929786 12760253 13786777 15162945 16968150 19195520 21745540 24469203 27218931
10517B7218931K623497K281928J583896M75259q93322k200183l047291l252720
$$ 27218931 29842428 32124356 33708252 34183511 33290189 31090006 28042715 24789995
10509B4789995k904972k293627j745568j488299j530694j690761j754116j600816
$$ 24789995 21885023 19591396 17845828 16357529 14826835 13136074 11381958 9781142
10501I781142j260052q67192n40476l03350j44897p1682p6855j62059k95483m07952
$$ 9781142 8521090 7653898 7113422 6810072 6665175 6593493 6516638 6354579 6059096 5651144
10491E651144l98991l01613j83349p7614Q659P0540J19134J64494K09094K55925
$$ 5651144 5252153 4950540 4767191 4689577 4698236 4768776 4887910 5052404 5261498 5517423
10481E517423K98153L48074M30284N61239P40323R79205J278970J599357J890504
$$ 5517423 5815576 6163650 6593934 7155173 7895496 8874701 10153671 11753028 13643532
10472A3643532K079013K154399K110809J937784J563024R01676q4444j267229
$$ 13643532 15722545 17876944 19987753 21925537 23488561 24390237 24305793 23038564
10464B3038564k373756l128132l367287l115067k573537j950287j391950r71532
$$ 23038564 20664808 17536676 14169389 11054322 8480785 6530498 5138548 4167016
10456D167016o80426m88581l65312k90120k41844k10846j94423j71333j55352
$$ 4167016 3486590 2998009 2632697 2342577 2100733 1889887 1695464 1524131 1368779
10447A368779j47674j22879r7393p2804o8603n1517l4722j7772j6583j5994j5498
$$ 1368779 1221105 1098226 1000833 928029 859426 807909 773187 755415 738832 722838 707340
10436G07340j718P661J4645j6972n7248p6926o9001l9456j9829k0137k1715j0672
$$ 707340 705622 713283 727928 710956 653708 576782 507781 468325 448496 428359 406644 395972
10424C95972k0440q925r907p394r706q827l321k487K491J49J770m349l013L89
$$ 395972 375532 366607 356700 349306 339600 330773 327452 324965 327456 327605 329375 325026 322013 322402
10410C22402r903n218q859p886n632j2575j3350r067K31q43n81K28m731k048M33
$$ 322402 312499 307281 298422 290536 284904 272329 258979 249912 250143 249300 248719 248947 244216 242168 242601
10395B42601L896N428R169L162J354Q900K805O571L412J115j076r219q007j3020
$$ 242601 246497 251925 261094 264256 265610 274510 277315 283886 287298 288413 287337 278118 270111 257091
10381B57091j3414r260q696J915n519o020p823K159J650j0614k0713j8181q304
$$ 257091 243677 234417 225721 227636 222117 216097 208274 210433 212083 201469 180756 162575 154271
10368A54271n959j3331j0956k938N170m25o22j574K019R773J2916J5454J4863
$$ 154271 148312 134981 124025 121087 126257 125832 125210 123636 125655 135428 148344 163798 178661
10355A78661J3173J3569M701M06k594L628K402L616K75j23n976K553O225m394
$$ 178661 191834 205403 210104 210510 207916 211544 213946 217562 217837 217714 211738 214291 220516 216122
10341B16122n246j8287l1440k1031k6670l2315l1587l4254k8612j680J3216J8957
$$ 216122 210876 192589 161149 140118 113448 81133 49546 15292 -13320 -15000 -1784 17173
10329A7173L3473K8619K7748K2410J6770j0j79J0082O670q430q546j672l916q854
$$ 17173 50646 79265 107013 129423 146193 146183 146004 156086 162756 154326 145780 144108 140192 131338
10315A31338j5151k434P077L078p319n705k871R931J2979n958r079J729K5312
$$ 131338 116187 113753 120830 123908 116589 110884 108013 117944 130923 124965 115886 117615 142927
10302A42927J1177J5623R742m70Q217R441Q299N155J1806J5662Q549P164L348
$$ 142927 154104 169727 179469 178999 187216 196657 204956 210111 221917 237579 246128 253292 256640
10289B56640o099l802p417j1776m948M827L349q727p037K680J712j594L233J5408
$$ 256640 250541 246739 239322 227546 222598 227425 230774 222047 215010 217690 219402 217808 221041 236449
10275B36449R490j721r667L05K495L445L977M937O634N018O343k40L371N170N240
$$ 236449 245939 244218 234551 234856 237351 240796 244773 249710 256344 261362 267705 267465 270836 276006 281246
10260B81246J2284L698O652M976j336J9338L3776L2948M5041L9213L0179L6283
$$ 281246 293530 297228 303880 308856 307520 326858 360634 393582 438623 477836 508015 544298
10248E44298L5122K2194L3690N2234M9509M1945K9998L0839L3341M2513N1896
$$ 544298 579420 601614 635304 687538 737047 778992 808990 839829 873170 915683 967579
10237I67579N1329N1466N2523O0106O8811Q6451R4875R9884R4127R8099J02972
$$ 967579 1018908 1070374 1122897 1183003 1251814 1338265 1433140 1533024 1627151 1725250 1828222
10226A828222J12049J32143J55961J81154K33938L08746L72581M47971N31016
$$ 1828222 1940271 2072414 2228375 2409529 2643467 2952213 3324794 3772765 4303781
10217D303781O31436P31057Q57613R99877J174141J394990J665317J951661K244163
$$ 4303781 4935217 5666274 6523887 7523764 8697905 10092895 11758212 13709873 15954036
10208A5954036K523923K737649K809464K710842K497009K365271K414528K501579
$$ 15954036 18477959 21215608 24025072 26735914 29232923 31598194 34012722 36514301
10200C6514301K521516K454151K399822K453728K619346K841215L280358M244177
$$ 36514301 39035817 41489968 43889790 46343518 48962864 51804079 55084437 59328614
10192E9328614N893568Q408190J2187907J7536495K3810094K8613738K9259090
$$ 59328614 65222182 73630372 85818279 103354774 127164868 155778606 185037696
10185A85037696K6169410K2787201K1719411K2682843K0321319K971392l2049228
$$ 185037696 211207106 233994307 255713718 278396561 298717880 301689272 269640044
10178B69640044o0563899o1386570m5255564k9265679j8642526j2238741q329359
$$ 269640044 209076145 147689575 102434011 73168332 54525806 42287065 33957706
10171C3957706n814007m126940k969699k194553j652216j265775r88900q65598
$$ 33957706 28143699 24016759 21047060 18852507 17200291 15934516 14945616 14080018
10163A4080018r64860j205969j346176j249655j070133r03585p54840o20094n19893
$$ 14080018 13115158 11909189 10563013 9313358 8243225 7339640 6584800 5964706 5444813
10154E444813m42209l74452l20344k45376j85010j28525r7465r2009r4732p5268
$$ 5444813 5002604 4628152 4307808 4062432 3877422 3748897 3651432 3559423 3464691 3389423
10144C389423o5541o0534o6157q9278j16149j21227j14105r1047o8173o0174m0414
$$ 3389423 3323882 3263348 3197191 3107913 2991764 2870537 2756432 2665385 2597212 2537038 2496624
10133B496624m1930m2951m1337j7073O21k0234r4396j72999j85672j30662p9550
$$ 2496624 2454694 2411743 2370406 2353333 2353954 2333720 2239324 2066325 1880653 1749991 1670441
10122A670441m6505r656J0917Q117J8101K9711K8064J3794k5278o5757r0934p6377
$$ 1670441 1623936 1614280 1625197 1633314 1651415 1681126 1709190 1722984 1697706 1631949 1541015 1464638
10110A464638n5084k7810j4436k3803l7028l4058l8632m8757m3321k9652k0288
$$ 1464638 1409554 1381744 1367308 1343505 1306477 1272419 1233787 1185030 1141709 1112057 1091769
10099A091769j4772j4804k3368k5589k9764k6483k5354l2381m0509k5733j4281
$$ 1091769 1076997 1062193 1038825 1013236 983472 956989 931635 899254 858745 833012 818731
10088H18731j6785k0619j1855r022j6931k0465K90O67r160r629j1715j6506j7147
$$ 818731 801946 781327 769472 760450 743519 723054 723344 724011 714851 705222 693507 677001 659854
10075F59854p969L227L70p739k423K268K316P17J097P721R549j196k770J4120
$$ 659854 651885 655112 655482 647743 645320 647588 649904 650621 651718 659439 668988 667792 665022 679142
10061F79142J3639J5902K1477J7446K1500L6321M4332K9888K0666K4360K7272
$$ 679142 692781 708683 730160 747606 769106 805427 849759 879647 900313 924673 951945
10050I51945K9488O1052Q7128Q3735O2397M1394K8130M8763R4934R9189j39216
$$ 951945 981433 1042485 1129613 1213348 1275745 1317139 1345269 1394032 1488966 1588155 1448939
10039A448939l40511k39759j18267n3389l1662j7632j0218j0963j1077j0872j4588
$$ 1448939 1108428 868669 750402 697013 665351 647719 637501 626538 615461 604589 590001
10028E90001k2220l7139m7775n0702l5077k8376j6221j3838o230J606m213j4452
$$ 590001 567781 530642 482867 432165 397088 368712 352491 338653 332423 334029 329816 315364
10016C15364j8003j2595l6k359r743q637l29Q40J5N977j504P961J5232Q770j802
$$ 315364 297361 284766 284730 282371 272628 263991 263662 264502 264517 270494 268990 276951 292183 300953 299151
10001B99151o93L444l023j1193j4084q928j0101j0576j7876j0054m682k129j564
$$ 299151 298458 301902 298879 287686 273602 264674 254573 243997 226121 216067 211385 209256 207692
9988B07692l985p616j309k286p58k668k287L672N861L194j6466j4352M065J1654
$$ 207692 203707 196091 194782 192496 191738 189070 186783 190455 196316 199510 183044 168692 172757 184411
9974A84411K506l242l344k022J012j27N337K004q8o611K703P14k154m982q599
$$ 184411 186917 183675 180331 178309 179321 179194 184531 186535 186447 179836 182539 183253 181099 176117 167518
9959A67518j473R484J3309K221o883k162j455l040k444j857k76p635j1102j458
$$ 167518 166045 175529 188838 191059 184176 182014 180559 177519 175075 173218 172942 165307 154205 152747
9945A52747q26k418M980k045M462O339K968M173N284Q595k219m378M809P504m897
$$ 152747 151921 149503 154483 152438 156900 163239 166207 170380 175664 184259 182040 177662 182471 189975 185078
9930A85078l922o478k047l504J638l793m485j331k80O544J820K766N934K320Q29
$$ 185078 181156 174678 172631 169127 170765 166972 162487 161156 160876 167420 169240 172006 177940 180260 181089
9915A81089o3k348L217Q206K926M322j990k728q383m531k632n212l269j423mm314
$$ 181089 181026 178678 181895 190101 193027 197349 195359 192631 184248 179717 177085 171873 168604 167181 167177 162863
9899A62863n014k81k372N482l27j147M66J0261R850l120m911j917K362J4446R111
$$ 162863 157849 157568 155196 160678 160351 159204 159670 169931 179781 176661 171750 169833 172195 186641 195752
9884A95752j088j949j005J676O147K925N027j599m336k57J241k172j0263o529
$$ 195752 194664 192715 191710 193386 199533 202458 207485 205886 201550 201293 202534 200362 190099 183570
9870A83570Q358K3166L0235L3011L7877L9384M1294M2375N0795N5560N7440N7680
$$ 183570 191928 215094 245329 278340 316217 355601 396895 439270 490065 545625 603065 660745
9858F60745O3916O1707O1900P2066O8521N9138O3450O9037P6877Q9278R2926J04074
$$ 660745 724661 786368 848268 920334 988855 1047993 1111443 1180480 1257357 1346635 1439561 1543635
9846A543635J17077J50353K05170K69313L47652M35120M97814N46804N78513N73440
$$ 1543635 1660712 1811065 2016235 2285548 2633200 3068320 3566134 4112938 4691451 5264891
9836E264891N35413M44062K70327q997k99533n19359p23834q46981p67212n68586
$$ 5264891 5800304 6244366 6514693 6505696 6206163 5686804 4962970 4115989 3348777 2780191
9826B780191l77785k34601j18048m7059Q127M0936Q2771J13816J31206J35491
$$ 2780191 2402406 2167805 2049757 2002698 2010825 2051761 2134532 2248348 2379554 2515045
9816B515045J44826J65886J89750K06306K38790K63498K83967L09719L13901L31239
$$ 2515045 2659871 2825757 3015507 3221813 3460603 3724101 4008068 4317787 4631688 4962927
9806D962927L71750M37356N16705O03659P30903R35818J177314J378898J460044
$$ 4962927 5334677 5772033 6288738 6892397 7623300 8559118 9736432 11115330 12575374
9797A2575374J452235J436186J413807J283465Q30596j2323r46915j592973j669696
$$ 12575374 14027609 15463795 16877602 18161067 18991663 18979340 18032425 16439452 14769756
9788A4769756j293761q21414n05986m64303p02478j039741j258685j206093r30690
$$ 14769756 13475995 12654581 12148595 11684292 10981814 9942073 8683388 7477295 6546605
9779F546605n98102l41948j66664o4616J6575R6059J76677K31630K22380K21681
$$ 6546605 5948503 5606555 5439891 5375275 5391850 5487909 5664586 5896216 6118596 6340277
9769F340277K53410L10698L68722M50510N28023N94246N92842N72232O86445R33718
$$ 6340277 6593687 6904385 7273107 7723617 8251640 8845886 9438728 10010960 10697405 11631123
9759A1631123J146051J235089J213307J187720J247752J344879J292054Q31434
$$ 11631123 12777174 14012263 15225570 16413290 17661042 19005921 20297975 21129409
9751B1129409P2348l60983k37868J41276M64638N28747J79634m77559j268748
$$ 21129409 21201757 20840774 20602906 20744182 21208820 21737567 21917201 21439642 20170894
9742B0170894k040193k453491k335088j954765j609683j326220j030615p42004
$$ 20170894 18130701 15677210 13342122 11387357 9777674 8451454 7420839 6678835
9734F678835m85272k86801j81126k03876k58217k46816j51995n8786R295O7939
$$ 6678835 6193563 5906762 5725636 5521760 5263543 5016727 4864732 4805946 4815241 4883180
9724D883180Q9842R3600P4577Q6854J70773K48554L13660L60143M35010N26194
$$ 4883180 4973022 5066622 5141199 5228053 5398826 5647380 5961040 6321183 6756193 7282387
9714G282387O27143P25938P50327O84331O70043Q06106R81288J072820J046724
$$ 7282387 7909530 8635468 9385795 10070126 10740169 11546275 12527563 13600383 14647107
9705A4647107Q66134N44910J42112l74821r77600j451165j626809j703606j776727
$$ 14647107 15513241 16058151 16200263 15825442 14847842 13396677 11769868 10066262 8289535
9696H289535j635947j289723r18027o22277m25677l30839l08994k97470k38892
$$ 8289535 6653588 5363865 4445838 3823561 3397884 3067045 2758051 2460581 2221689
9687B221689j71124j11691q3939p3506o5311n7185m3701j5265q239P363J6904
$$ 2221689 2050565 1938874 1854935 1781429 1716118 1658933 1615232 1599967 1591728 1599091 1615995
9676A615995J7717K7972N0526P6625J06382J49671J99520K54128L23017L62876
$$ 1615995 1633712 1661684 1712210 1788835 1895217 2044888 2244408 2498536 2821553 3184429
9666C184429L76652L83124L75385L32705K43223P4952j60795l49264m90653o30113
$$ 3184429 3561081 3944205 4319590 4652295 4895518 4970470 4809675 4460411 3969758 3339645
9656C339645o85120n97985m39507l00450k10204j49224j11189q3128n7161l9989
$$ 3339645 2654525 2056540 1617033 1316583 1106379 957155 845966 762838 705677 665688
9646F65688k8622l0402k6209k7898k4610k4963k7427j3947j6812j3613j4583j3071
$$ 665688 637066 606664 580455 552557 527947 502984 475557 461610 444798 431185 416602 403531
9634D03531q459j3823j9330j8625j4996r521n199k495q589j883r035j7648j1456
$$ 403531 395072 381249 361919 343294 328298 318777 313578 311083 302494 300611 291576 273928 262472
9621B62472k841m264o518M53l79L980K843n96l926l067K030l788m069J71j038
$$ 262472 259631 255367 248849 249302 248923 252903 255746 255150 251224 248157 250187 246399 242330 242501 241463
9606B41463m887j342j392k715q73L131j505J224j384l736L436N934L207k614m998
$$ 241463 236576 235234 233842 231127 230254 233385 231880 233104 231720 227984 231420 237354 240561 237947 232949
9591B32949j084k540n652m301l133K036J36l367n04q729q034k537j568r128q482
$$ 232949 231865 229325 223673 219372 216239 218275 218411 215044 214540 205811 197777 195240 193672 184544 176062
9576A76062k029J2107K156l94K794N786m205l31k943n146l876n093J24j1231n260
$$ 176062 174033 186140 188296 187902 190696 196482 192277 191946 189003 183857 179981 174888 175012 163781 158521
9561A58521L191M840n99o211q21l176l01K032R961j958l107m872o879k793R616
$$ 158521 161712 166552 165953 159742 158921 155745 155444 157476 167437 165479 162372 157500 150621 147828 157444
9546A57444j794l638m92O41n34O118Q2Q629J67p469l750k633L207k017K814R09
$$ 157444 155650 152012 151520 152161 151627 157745 157827 166456 166623 159154 155404 152771 155978 153961 156775 157684
9530A57684K533J382m8K049j741k068R536m920l311J1726K67r049k328m293j2001
$$ 157684 160217 161599 161551 163600 161859 159791 169327 164407 161096 172822 173089 164040 161712 157419 145418
9515A45418j0251o782m672k230m459M053O644l921K604R580k622n397j568j523
$$ 145418 135167 128385 123713 121483 117024 121077 127721 123800 126404 135984 133362 127965 126397 124874
9501A24874J535K22R503L6p468L548R869Q42n580l382J985q34o633m298j802l226
$$ 124874 126409 126631 136134 136170 128702 132250 142119 142961 137381 133999 135984 135150 128517 124219 122417 119191
9485A19191k224p915J666Q612J197L681L486j312K818L46l868J232K929q884o729
$$ 119191 116967 109052 110718 119330 120527 124208 127694 126382 129200 129546 125678 126910 129839 120955 114226
9470A14226p96l760r15M603k555p700p202j072J651r39N327k65N00L048l769M363
$$ 114226 113430 109670 108755 113358 110803 103103 95901 94829 96480 95541 100868 100603 101103 104151 100382 104745
9454A04745j24n608K395m688l227J64M555P859j444l516j227k899j418L103k666
$$ 104745 104621 99013 101408 96720 93493 93657 98212 106071 104627 101111 99884 96985 95567 98670 96004
9439I6004m043Q71N820j480K04Q223K196O590N050j748n124j860n253m544k650
$$ 96004 91961 92832 98652 97172 97376 105599 107795 114385 119435 117687 112563 110703 105450 100906 98256
9424I8256l612o647m815J871L545J46p029m927L257K38O744J475K048J64l413
$$ 98256 94644 87997 83182 85053 88598 88744 81715 76788 80045 80283 87027 88502 90550 90714 87301
9409H7301K225j425K234M371L989n729l67L118L413Q532O735K475N218N952O58
$$ 87301 89526 88101 90335 94706 98695 92966 92599 95717 99130 107662 114397 116872 122090 128042 128700
9394A28700J0261N922J847J3209P691J814p044j7182o857M00r40o356j0233j559
$$ 128700 138961 144883 146730 159939 167630 169444 162400 145218 138361 138761 137821 131465 121232 119673
9380A19673M097L55m956m586m49p682n811j562O014l328r244J695P491l1q103
$$ 119673 123770 124125 119169 114583 114134 106452 100641 99079 105093 101765 92521 94216 101707 101676 93573
9365I3573K662M012K757k616p162M091P143M357L597R651L151L612R750L945N822
$$ 93573 96235 100247 103004 100388 93226 97317 104460 108817 112414 122065 125216 128828 138578 142523 148345
9350A48345Q994L700M53n62L321l918L060P766M339j2788p953m162j1497n746
$$ 148345 157339 161039 161492 160930 164251 160333 163393 171159 175498 162710 154757 150595 139098 133352
9336A33352p234q901j4555j5495m665Q26J5K045O644L623j955m082l278p89K118
$$ 133352 126118 117217 102662 87167 82502 83328 83343 85388 92032 95655 93700 89618 86340 85551 87669
9321H7669k59K739l359o761K817P306L709o83J788P681M463k157M414P523N597
$$ 87669 87410 90149 86790 80029 82846 90152 93861 93178 94966 102647 107110 104953 109367 116890 122487
9306A22487p92N38P794J960j615k974L122K553r04o812r456j1469o997n448o932
$$ 122487 121695 122233 130027 131987 130372 127398 130520 133073 132169 125357 115901 104432 97435 91987 85055
9291H5055j0044L025J661R3J170q466n057M230k472K94J185o610j1486k218J526
$$ 85055 75011 78036 79697 79790 80960 72494 67437 71667 69195 69489 70674 64064 52578 50360 51886
9276E1886k463K066L072N047q510p815J398k39P036m72J151J0057Q901J935j053
$$ 51886 49423 51489 54561 59608 51098 43283 44681 44442 51478 51006 52157 62214 71115 73050 71997
9261G1997j561k752M173K955j454k689m944p262M08k795m708l781N011l927k127
$$ 71997 70436 67684 71857 74812 73358 70669 65725 58463 58871 56076 51368 47587 52598 48671 46544
9246D6544M539M726K583m035l207L124J221o09M104l204m780J445k791p240m92
$$ 46544 51083 55809 58392 54357 51150 54274 55495 54886 58990 55786 51006 52451 49660 42420 41928
9231D1928p51l99M703J509m990m359N268l212m947K940P110l04j263L237M317
$$ 41928 41177 40778 45481 46990 42000 37641 42909 39697 34750 37690 44800 44496 43233 46470 50787
9216E0787J0459o48n854L436j000q554q89R34K54M156J053m838j953K397J282
$$ 50787 61246 60598 54744 58180 57180 48626 47737 48671 48925 53081 54134 49296 47343 49740 51022
9201E1022N693l847j0873n243o53M192L327k393p051P136K273j637j147J164O67
$$ 51022 56715 52868 41995 36752 36099 40291 43618 41225 34174 41310 43583 41946 40799 41963 42630
9186D2630j533r807k623O158L948L346O322k605k466k515P94k320K332M175n472
$$ 42630 41097 31290 28667 34825 38773 42119 48441 45836 43370 40855 41649 39329 41661 45836 40364
9171D0364k47l500k972J129P65M660k122l958l91M993P141p23J543M826l292j1775
$$ 40364 40117 36617 33645 34774 35539 40199 38077 34119 33728 38721 45862 45139 46682 51508 48216 36441
9155C6441o268N40M931n897K003j114j402P49L03J242M441O439P87l475K276L416
$$ 36441 30173 30713 35644 29747 31750 30636 29234 29983 30286 31528 35969 42408 43195 39720 41996 45412
9139D5412l831l10l557j0186j0945K762M964L022J985J840L422O45N355n470r611
$$ 45412 41581 41271 37714 27528 16583 19345 24309 27331 29316 31156 34578 35223 40578 35108 25497
9124B5497j058n475L31O671N08J22J851L941N911l44j272M78J425K432L451J466
$$ 25497 24439 18964 19295 25966 26474 26596 28447 32388 38299 37955 36683 37161 38586 41018 44469 45935
9108D5935n179l38j527p872L542Q298j491n46O335P623l174M25k906K888K28p567
$$ 45935 40756 40418 38891 31019 34561 42859 41368 40822 47157 54780 51606 52031 49125 52013 52241 44674
9092D4674M59n284R74m357n770l697p188o907l034J0912J0498J691M867o124k877
$$ 44674 45133 39849 40823 36466 30696 26999 19811 12904 9870 20782 31280 32971 37838 31714 28837
9077B8837N314K638J312k365j901Q64K076O090l57o475N49K477K831N518m117
$$ 28837 34151 36789 38101 35736 33835 34699 36775 42865 42508 36033 36582 39059 41890 47408 43291
9062D3291n499o57l465K266J364M932J604k373J276p67m849j058k651r757O46
$$ 43291 37792 37135 33670 35936 37300 42232 43836 41463 42739 41972 37123 36065 33414 23657 24303
9047B4303O467J858MJ683J024L851k916l674p91J389J194o74O78k294L935k88
$$ 24303 30770 32628 32632 34315 35339 39190 36274 32600 31809 33198 34392 33718 34396 32102 36037 35749
9031C5749n161j143n028M93l053J75k20L509O031K391o097r201k654J1863Q817
$$ 35749 30588 29445 24417 24910 21857 22032 21812 25321 31352 33743 27646 18445 15791 27654 36471
9016C6471N029j387n133j027O203j727p080n36P027m398l010K107K302m693k588
$$ 36471 41500 40113 34980 33953 40156 38429 31349 30813 37840 33442 30432 32539 34841 30148 27560
9001B7560L693L23n308j566J028M932Q090j51j910q27k698q943k425P099l998
$$ 27560 31253 31576 26268 24702 25730 30662 38752 38601 36691 35864 33166 24223 21798 28897 24899
8986B4899n942N329P12j812j096l150l212N88M283N459L688M51K09K132j397N51
$$ 24899 18957 24286 24998 23186 22090 18940 15728 16316 20599 26058 29746 30197 30406 32538 31141 31692
8970C1692J736k784k63Q583j338j3519o242Q09N173O09K137K509P23P10j003k030
$$ 31692 33428 30644 30381 38964 37626 24107 17865 18674 23847 24456 26593 29102 29825 30535 29532 27502
8954B7502k481K096M15N775O962P931k579n637o753J604J914m248p233j125Q525
$$ 27502 25021 27117 27532 33307 40269 48200 45621 39984 33231 34835 36749 32501 25268 24143 32668
8939C2668L858L57l62o825K431k893l444n429K141P795N898N95q658m975k851
$$ 32668 36526 36883 36521 29696 32127 29234 25790 20361 22502 30297 36195 36790 28132 23157 20306
8924B0306K84L186R98Q890J211m287k776N930N752k973j010p794l684j94k174
$$ 20306 20590 23776 24774 33664 34875 30588 27812 33742 39494 36521 35511 27717 24033 23839 21665
8909B1665L607J948j138R22N930O68L797J441n752j571k073N131L666K512K505
$$ 21665 25272 27220 26082 27004 32934 33602 37399 38840 33088 31517 29444 34575 38241 40753 43258
8894D3258l815o915K411J2720K955L190K942Q52j040N854j016M576R569N867L251
$$ 43258 39443 32528 34939 47659 50614 53804 56746 57598 56558 62412 61396 65972 75541 81408 84659
8879H4659O558K306r497j9851o056j1096j0125n161K85R656M29n354m722J320
$$ 84659 91217 93523 84026 64175 58119 47023 36898 31737 32022 41678 42107 36753 32031 33351
8865C3351O901k252o051J189K038j479k803k332k557M28J557m237o8M193j331
$$ 33351 40252 38000 31949 33138 35176 33697 30894 28562 26005 26433 27990 23753 23685 27878 26547
8850B6547n394n196k004M424j804M825j289o711j679M424m994K415O569P030Q14
$$ 26547 21153 15957 13953 18377 16573 21398 20109 13398 11719 16143 11149 13564 20133 27163 27977
8835B7977K303L523K609n165o069L064lO506j24k458L848k083l411m155L298j360
$$ 27977 30280 33803 36412 31247 25178 28242 28239 34745 34621 32163 36011 33928 30517 26362 29660 28300
8819B8300J990K856J773p93k463k977m964R39J484N975M169l130m642j596P370
$$ 28300 30290 33146 34919 34126 31663 28686 23722 24661 26145 32120 36289 33159 28517 26921 34291
8804C4291R52o665J744J565K227o433k919K096o057n248L160M121N319N699q25
$$ 34291 35243 28578 30322 31887 34114 27681 24762 26858 20801 15553 18713 22834 28153 33852 33027
8789C3027m754j898l08L16J217M99j597N64L319j79j834m352J302L11l773l772
$$ 33027 28273 26375 26067 26383 27600 28099 26502 27066 30385 30206 28372 24020 25322 25633 21860 18088
8773A8088L987j180N895j760n039l639O884K785k325o253j205o173K517L783K49
$$ 18088 22075 20895 26790 25030 19991 16352 23236 26021 23696 17443 16238 10065 12582 16365 16614
8758A6614N632j60j727l681N439j057j741J160j72m707O883K557k751M491j022
$$ 16614 22246 22086 20359 16678 22117 21060 19319 20479 20307 15600 22483 25040 22289 26780 25758
8743B5758m044k528k897N086K916L895L795o004L704L45j1740q94M09L18K015
$$ 25758 21714 19186 16289 21375 24291 28186 31981 25977 29681 30026 18286 17392 17801 18119 20134
8728B0134J127M07K301K282k315l479k950O614M755l600N177K143Q91l552j1572
$$ 20134 21261 21668 23969 26251 23936 20457 17507 24121 28876 25276 30453 32596 33487 29935 18363
8713A8363K185M675n818l05N600M053j250K46k386K013n658j483R587J646l156
$$ 18363 20548 25223 19405 19100 24700 28753 27503 27749 25363 27376 21718 20235 29822 31468 28312
8698B8312m572j324p10N819l196Q165O691m823l586j812K434N945M488l007n027
$$ 28312 23740 22416 21706 27525 24329 32494 39185 34362 30776 28964 31398 37343 41831 38824 33797
8683C3797M99P49q42K722o43n086j0350q743J061l165r76L484J441J0481N952
$$ 33797 34296 35045 34203 36925 36282 31196 20846 12103 13164 9999 9023 12507 13948 24429 30381
8668C0381N40r88p57r736O695o34k513O516N268L389J151L224J143P331l898j018
$$ 30381 30921 29933 29176 19440 26135 25501 22988 29504 34772 38161 39312 42536 43679 51010 47112 46094
8652D6094j491m031j657n33L318L857P364Q330J958N664N454P802J575o281n870
$$ 46094 44603 40572 38915 38382 41700 45557 52921 61251 63209 68873 74327 82129 83704 77423 71553
8637G1553n861o883l806j0894K616j969O526J617j746j578k302j38R625o74n681
$$ 71553 65692 58809 55003 44109 46725 44756 51282 52899 51153 49575 47273 47135 56760 56086 50405
8622E0405l84K513J843k127K071M830j574N921O533Q408N692N823R41M99K530
$$ 50405 50021 52534 54377 52250 54321 59151 57577 63498 70031 78439 84131 89954 90895 91394 93924
8607I3924M466N219q62k170k721k573N509O535M88k460q703j4275k336r605j2990
$$ 93924 98390 103609 102747 100577 97856 95283 100792 107327 107815 105355 96652 82377 80041 70436 57446
8592E7446q727J390M877p516q698L025M397l837j256n398J26m47n860k596j675
$$ 57446 48719 50109 54986 47470 38772 41797 46194 42357 41101 35703 35829 35382 29522 26926 25251
8577B5251O478R900k754j187R21o552k659M563Q85j13n373n73K076O856M832j864
$$ 25251 31729 41629 38875 37688 38609 32057 29398 33961 34846 34733 29360 28787 30863 37719 42551 40687
8561D0687q894L628j197j724K300N246q41M902K759J867M91p297p500m916L069
$$ 40687 31793 35421 34224 32500 34800 40046 39205 44107 46866 48733 49224 41927 34427 29511 32580
8546C2580j772p080K928L235L793l643l295j560O716J275n557n437k444M530j302
$$ 32580 30808 23728 26656 29891 33684 30041 26746 25186 31902 33177 27620 22183 19739 24269 22967
8531B2967M603K540m733j600L575M298N284J872p426K06L885R437J738j940K053
$$ 22967 27570 30110 25377 23777 27352 31650 36934 38806 31380 31586 35471 44908 46646 44706 46759
8516D6759r702q893k429l667j44L640K943r95j087r77O89K656m847n702p545N508
$$ 46759 37057 28164 25735 22068 21924 25564 28507 27512 26425 25448 26137 28793 23946 18244 10699 16207
8500A6207R53l85M578j014m70K696j724K595j654J7j943k236r269J578K803Q841
$$ 16207 17160 16775 21353 20339 19869 22565 20841 23436 21782 21799 19856 17620 8351 9929 12732 21573
8484B1573j742j95m607m64K276R65K153m662m02O515J866Q652M484j2056k167
$$ 21573 19831 19636 15029 14565 16841 17806 19959 15297 14895 21410 23276 31928 36412 24356 22189
8469B2189n8M453j361j519k162k619m610J383j131N705P024l72l289l761j388
$$ 22189 22131 26584 25223 23704 21542 18923 14313 15696 14565 20270 27294 26922 23633 19872 18484
8454A8484m799K525K499j879o351M068k397o82J967r37L067l069Q14J540j288
$$ 18484 13685 16210 18709 16830 10479 14547 12150 11468 13435 12498 15565 12496 13310 14850 13562
8439A3562J0615L774l748m789m536m52L052k477Q06L591L670K901k816k321K0
$$ 13562 24177 27951 24203 19414 14878 14426 17478 15001 15807 19398 23068 25969 23153 20832 20852
8424B0852n893l3r11P4M014J553R30m145r068r23L199N85Q967L157O08Q14r544
$$ 20852 14959 14926 14015 14089 18103 19656 20586 16441 7373 6450 9649 10234 19201 22358 22966 23780 14236
8407A4236m808M779R493L044Q521n786j2480m373j2Q27P364j302m648l713R05
$$ 14236 9428 14207 23700 26744 35265 29479 16999 12626 12614 13441 20805 19503 14855 11142 12047
8392A2047L162P06k296M903N522j0881o230O581N683K934o258l106J061K332k116
$$ 12047 15209 15915 13619 18522 24044 13163 6933 13514 19197 22131 15873 12767 13828 16160 14044
8377A4044o357M856L842K776L690K5r77L593j263m498J989K466M343j886J586
$$ 14044 7687 12543 16385 19161 22851 22876 21899 25492 24229 19731 21720 24186 28529 26643 28229
8362B8229j320j41l32Q2k533l634P82K323N133K231L80n36L175Q580P641O821
$$ 28229 26909 26768 26436 26518 23985 20351 21133 23456 28589 30820 31200 30664 33839 42419 50060 56881
8346E6881L609O730L685M687K236j1753j2491j3926j0650o141k513N82O04K672
$$ 56881 60490 67220 70905 75592 77828 66075 53584 39658 29008 22867 20354 20936 21540 24212
8332B4212L338J646j19K742P807M376k183q54Q693P117k012r94K216L703N983
$$ 24212 27550 29196 29077 31819 39626 44002 41819 40965 49658 56775 54763 53769 55985 59688 65671
8317F5671j484l457p534q096q228p386j389J638Q656Q156J164L770R465P876J1364
$$ 65671 64187 60730 53196 45100 36872 29486 28097 29735 38391 46547 47711 51481 60946 68822 80186
8302H0186J9347J4937L765j92O765L482q017k4290j9594j5199l338j359j1399
$$ 80186 99533 114470 118235 118043 124808 128290 120273 95983 76389 61190 57852 56493 45094
8289D5094j2608l026n33P448M500n281J150O115M003J1202Q292R019N425N818
$$ 45094 32486 29460 28927 36375 40875 35594 36744 42859 46862 58064 66356 75375 80800 86618
8275H6618J3662J0937K450n902k2684k2297j6573j610j47n374O27m688j0524k849
$$ 86618 100280 111217 113667 107765 85081 62784 46211 44601 44454 39080 39707 35019 24495 21646
8261B1646Q141K053K868M652P767J1699R696R202M635p739n595j245j3658r321
$$ 21646 29787 31840 34708 39360 47127 58826 68522 77724 82359 74620 69025 67780 54122 44801
8247D4801n753k333l877K252Q966j8j784l199k747o028j679K579K780p96J303
$$ 44801 39048 36715 32838 35090 44056 44038 42254 39055 36308 30280 28601 31180 33960 33164 34467
8232C4467m216K244N470J1427N809o335k565j123j705l324r730p720K792j800
$$ 34467 30251 32495 37965 49392 55201 48866 46301 45178 43473 40149 30419 22699 25491 23691
8218B3691K904j945Q87m990n197k06L884k213n577P058Q12o42K464R94k889J346
$$ 23691 26595 24650 25537 20547 15350 15144 19028 16815 11238 18296 19108 18466 20930 21924 19035 20381
8202B0381m116K007R058L987n747n474O38m132m005m143n19Q48M827M024N00j1446
$$ 20381 16265 18272 27330 31317 25570 20096 20734 16602 12597 8454 7935 8783 13610 17634 18134 6688
8186F688o219L264K367j57N863R495j0498j088N454L200J502j2336p282J1585
$$ 6688 469 3733 6100 5943 11806 21301 10803 9715 15169 18369 19871 7535 253 11838
8172A1838L348M021M01l065o143M75J912m37J060l04l401N386K129k075M947N479
$$ 11838 15186 19207 19608 16543 10400 10875 12787 12350 13410 13106 9705 15091 17220 15145 20092 25571
8156B5571N900j391q607o086J113K309M766K707n171k529O8m364J076n423P82
$$ 25571 31471 30080 21473 15387 16500 18809 23575 26282 21111 18582 18650 14286 15362 9939 10721
8141A0721j589K645O044J605K682m266J655J67j255N433m523q919m324p58O06
$$ 10721 9132 11777 17821 19426 22108 17842 19497 19664 18409 23842 19319 10400 6076 5318 5924
8126E924m307p63L911K273P483l166m417n092K097N13L864P20Q361l242m016L233
$$ 5924 1617 854 4765 7038 14521 11355 6938 1846 3943 4456 8320 9040 17401 14159 10143 13376
8110A3376n518k500O015L318J690R85J445O949J357m850n481K016N744R13k925
$$ 13376 7858 5358 11373 14691 16381 17366 18811 25760 27117 22267 16786 18802 24546 25459 22534
8095B2534o096k66J340N737J596O072Q594j026m587J89q294m236O687L813j010
$$ 22534 16438 16172 17512 23249 24845 30917 39511 38485 33898 34087 25793 21557 28244 32057 31047
8080C1047j569p289L824R197P812N016Mn441l15q123l637N958L563K509p49j414
$$ 31047 29478 22189 26013 35210 43022 48038 48042 42601 42286 34163 30526 36484 40047 42556 41807 40393
8064D0393R557o448n981k734J870P74L082K978m214o159l276K115K880q41j689
$$ 40393 49950 43502 37521 34787 36657 37431 40513 43491 39277 33118 29842 31957 34837 33996 32307
8049C2307N015m64J677k165k206j74J439j941K742m690m11J5347J1917L808J180
$$ 32307 37322 36858 38535 36370 34164 33990 35429 33488 36230 31540 31129 46476 58393 62201 63381
8034F3381m770R13P870L253L431L761M179j414l552L319j58l565l078p663M551
$$ 63381 58611 59524 67394 70647 74078 77839 82018 80604 77052 80371 80213 76648 73570 65907 70458
8019G0458M069l438k991p492q574p756P83K921o96r765j845p97J689k776j416
$$ 70458 74527 71089 68098 60606 52032 44276 45059 47980 47284 37519 35674 34877 36566 33790 32374
8004C2374O17j421j79l88l16K572k291m194j115P673M086Q377O934j106P11P581
$$ 32374 32991 31570 31391 31003 30687 33259 30968 26774 25659 33332 37418 45795 52729 51623 52334 59915
7988E9915L459o598k451K53k82Q46n620L401j61n28o95j183j630l641j837p329
$$ 59915 63374 56776 54325 54578 54296 55142 49522 52923 52762 52234 51539 50356 48726 45085 43248 35919
7972C5919K515K24o806m422J116K987q46m816m59K166k660J166l123k001O936
$$ 35919 38434 38658 31852 27430 28546 31533 30687 25871 25412 27578 24918 26084 22961 20960 27896
7957B7896m704j167n27n112o331M00K442o194L277O600L371J349l053m868J656
$$ 27896 23192 22025 21498 16386 10055 10455 12897 6703 9980 16580 19951 21300 18247 13379 15035
7942A5035N050L846J694p500M62l04J331n695j678L316K120P12l974o73K134K339
$$ 15035 20085 23931 25625 18125 18587 18283 19614 13919 12241 15557 17677 18389 14415 13742 15876 18215
7926A8215L02m002j842M24l487N291Q779k775l634r10m782k391J017L223J1501
$$ 18215 18517 14515 12673 13097 9610 14901 23680 20905 17271 16361 11579 9188 10205 13428 24929
7911B4929k60n410j313o959n647j63L52j788N942O446m067n305j864K84R216P900
$$ 24929 24669 19259 17946 10987 5340 5177 5529 3741 9683 16129 12062 6757 4893 5177 14393 22293
7895B2293O248o504n227j407q51m466k383K027J265L62k434K90q3J679N937l445
$$ 22293 28541 22037 16810 15403 14552 10086 7703 9730 10995 11357 8923 9213 9130 10809 16746 13301
7879A3301L609K421m878l433K735K45m974q857j69P159J643K759L56l991m985
$$ 13301 16910 19331 14453 11020 13755 14000 9026 169 0 7159 8802 11561 11917 7926 2941
7864B941k204K809K693m761m800J324Q663Q27K282N68k70k257K17M330K951l206
$$ 2941 737 3546 6239 1478 -3322 -1998 6665 7492 9774 10342 10072 7815 8032 12362 15313 12107
7848A2107O919l569n312l98J838J369j1341j611K655R49N154K820l683n286Q582
$$ 12107 19026 15457 10145 9747 11585 12954 1613 2 2657 3606 8760 11580 7897 2611 11193
7833A1193Q88L152Q26l152o019K19K166J990J679r80m012p48r49J110n73o524
$$ 11193 12081 15233 16059 12907 6888 7107 9273 11263 12942 11962 7950 7202 6253 7363 6790 266
7817B66R466q978J28J3059Q481l876k991q801l89N17L828k57j069k707k66L027
$$ 266 9732 754 882 13941 22422 18546 15555 6754 6365 6882 10710 10453 9384 6677 6411 9438
7801I438j34l020J511K041o361o061J141j779M281O776K493o24m280l880k496
$$ 9438 9304 6284 7795 9836 3475 -2586 -1445 -3224 1057 7833 10326 9702 5422 1542 -954
7786i54l618K76m015P974L416l4j429J278M979j030n61J393M488j704L199R18
$$ -954 -4572 -4296 -8311 -337 3079 3045 1616 2894 7873 6843 6282 7675 12163 10459 13658 14576
7770A4576m06l670l791r542k306J164o31j277l351J504n64k152N611K584q663
$$ 14576 14170 10500 6709 -2833 -5139 -3975 -4606 -5883 -9234 -7730 -8294 -10446 -4835 -2251 -10914
7755a0914N476O538L648L951l089n021L278l533L507K974p237n472o8K257J870
$$ -10914 -5438 1100 4748 8699 5610 589 3867 334 3841 6815 -422 -5894 -5962 -3705 -1835
7740a835O052K104o871M492Q916L000Q92o70m437J934K19j342k748p48j398l71
$$ -1835 4217 6321 -550 3942 12858 15858 16750 16080 11643 13577 13796 12454 9706 8958 7560 7189
7724G189L181L189N48n410n214L96n474m608k401K784J206m99K091N399N693k918
$$ 7189 10370 13559 14107 8697 3483 3879 -1595 -6203 -8604 -5820 -4614 -5113 -3022 2377 8070 5152
7708E152k068J34K882k34P006k394m937n097j88K048Q545M26k491K121j536R3
$$ 5152 3084 3218 6100 5866 12872 10478 5541 444 256 2304 10849 11275 8784 10905 9369 9462
7692I462L679K168r958m104o429N824J2731k053q56P906O1j1714p366m209Q212
$$ 9462 13141 15309 5351 1247 -5182 642 13373 11320 10464 18370 18431 6717 -649 -4858 3354
7677C354K967k471Q761O492j438m262l394k217M22o85J07M536j05n519m045O141
$$ 3354 6321 3850 12611 19103 17665 13403 10009 7792 8214 7529 7636 12172 12067 6548 2503 8644
7661H644P713q044r105k302K994j059p371k661k014M294P322Q369P902m836J260
$$ 8644 16357 8313 -792 -3094 -100 -1159 -8530 -11191 -13205 -8911 -1589 6780 14682 9846 11106
7646A1106M815j260m441j948k49J381l451K888l207J439K63r036l301J74Q57K525
$$ 11106 15921 14661 10220 8272 8023 9404 5953 8841 5634 7073 7336 -1700 -5001 -4827 -3970 -1445
7630a445m72p85P034J0807m35o30K136n052n052p93K950O860K78k645k450l812
$$ -1445 -1917 -2702 4332 15139 14704 14074 16210 11158 6106 5313 8263 15123 15401 12756 10306 6494
7614F494N645L770j914K687L346j613n794m717J138j891M50m057j574K079J64
$$ 6494 12139 15909 13995 16682 20028 18415 12621 7904 9042 7151 7601 3544 1970 4049 4213
7599D213k069q07J794N58L033J689L838N471k560m154M33j363k62k011j921J044
$$ 4213 2144 1337 3131 3689 6722 8411 12249 17720 15160 11006 11439 10076 9814 7803 5882 6926
7583F926N095j89r601l797n19m253M738L483Q094N112P07k021j176n577o492o201
$$ 6926 12021 11832 2231 -1566 -2085 -6338 -1600 1883 9977 15089 15796 13775 12599 7022 530 -5671
7567e671K524O478L146K67j837r76o43k757M727k619l237N32l727J893K655l469
$$ -5671 -3147 3331 6477 6744 4907 3931 3288 531 5258 2639 -598 -66 -3793 -1900 755 -2714
7551b714N195N332k862j745k211L819M974M906k361k56N151K893l883q169o320
$$ -2714 2481 7813 4951 3206 995 4814 9788 14694 12333 12077 17228 20121 16238 8069 1749
7536A749K96K148o721l725O6N017q32m038K857l687M559N881n84q27K91k771L655
$$ 1749 2045 4193 -2528 -6253 -6187 -1170 -2002 -6040 -3183 -6870 -2311 3570 2986 2159 2450 -321 3334
7519C334q76J634L629J963O10q59j464l541k969m313m664P218P985n50l704l229
$$ 3334 2458 4092 7721 9684 10294 9435 7971 4430 1461 -2852 -7516 -298 7687 7137 3433 204
7503B04Q338p16L659l744m310n673P038M251J119k421j914Q22j857j606P316J918
$$ 204 8542 7826 11485 7741 3431 -2242 4796 9047 10166 7745 5831 6653 4796 3190 10506 12424
7487A2424l538q174q667J218r53q038l654O836j29P360O97m002J602j60o38K038
$$ 12424 8886 712 -7955 -6737 -7690 -15728 -19382 -12546 -12675 -5315 -4618 -8620 -7018 -7178 -7816 -5778
7471e778J0159Q116J112o691L916J001m280j208m629K448J712k634k946j257j346
$$ -5778 4381 12497 13609 6918 10834 11835 7555 6347 1718 4166 5878 3244 298 -959 -2305
7456b305n752L855P202n23n795J121O029l147P195P231n447o734k376l461L916
$$ -2305 -8057 -4202 3000 2477 -3318 -2197 3832 685 7880 15111 9664 2930 554 -2907 1009
7441A009j590j522L336L716j130P20K050n260l10n83L910L110M482J105o152n905
$$ 1009 -581 -2103 1233 4949 3819 4539 6589 1329 1019 436 4346 7456 11938 13043 6891 986
7425I86K408K674m769m987m286M490m887N112Q994j393J192m111r59O640M984
$$ 986 3394 6068 1299 -3688 -7974 -3484 -8371 -3259 5735 4342 5534 1423 464 7104 12088
7410A2088M287M490l053o75o072k436n539j465J689m249l16M558P649j827j564
$$ 12088 16375 20865 17812 17137 11065 8629 3090 1625 3314 -935 -1251 3307 10956 9129 7565
7395G565o375k464K757K019j570R95q04q487k005M233L163L694r15m543M139N92
$$ 7565 1190 -1274 1483 3502 1932 2927 2123 -6364 -8369 -4136 -973 2721 1806 -2737 1402 1994
7379A994k671N352L137r89n846o604K865O15j092n511M583O383l932M622L640
$$ 1994 -677 4675 7812 6823 977 -5627 -2762 -2147 -3239 -8750 -4167 2216 -1716 2906 6546
7364F546Q49M134n987q427K293J5387J3965o625j1609r055n581o593j552K647
$$ 6546 7395 11529 5542 -2885 -592 14795 28760 22135 10526 1471 -4110 -10703 -12255 -9608
7350i608P919J0943O457Q13m083l976L387N86o414q292P585k366K272M441L541
$$ -9608 -1689 9254 15711 16524 12441 8465 11852 12438 6024 -2268 5317 2951 5223 9664 13205
7335A3205j131O27n125m237M067k257k469O043Q193l995n785O357o077m152k587
$$ 13205 12074 12701 7576 3339 7406 5149 2680 8723 16916 12921 7136 13493 7416 3264 677
7320F77N277j225k410k737O681M446k23n891M405J804r329k589Q572K07j398J409
$$ 677 5954 4729 2319 -418 6263 10709 10486 4595 9000 10804 1475 -1114 7458 7665 6267 7676
7304G676K114r133k893N83K303K626n44j815R335j64n95j579J43l959o966j653
$$ 7676 9790 657 -2236 -1653 650 3276 2732 917 10252 10088 9493 7914 8057 4098 -2868 -4521
7288d521R92l11L177J244L897N275j874p429M150N418J702L970M53M7r652l154
$$ -4521 -3529 -3840 -663 581 4478 9753 7879 450 4600 10018 11720 15690 16143 16190 6538 3384
7272C384m162J406K284O152k29q047j150m91K520p58M31M610L665Q42j501n952
$$ 3384 -778 628 2912 9064 8835 788 -362 -853 1667 909 1340 5950 9615 10457 8956 3004
7256C004m883N58l381K80J366k875j148O37N586M598k730o530M572p77p5j896
$$ 3004 -1879 -1321 -4702 -4422 -3056 -5931 -7079 -6442 -856 3742 1012 -5518 -946 -1723 -1798 -3694
7240c694N289K055k399Q74R280K611l717p6k96K66n875o168K442j896l114O545
$$ -3694 1595 3650 1251 2125 11405 14016 10299 10223 9927 10193 4318 -1850 592 -1304 -4418 2127
7224B127O546J017p982j947q05k025j882J579j65L466k903R74p884l195K595O903
$$ 2127 8673 9690 1708 -239 -1044 -3069 -4951 -3372 -3537 -71 -2974 -2000 -9884 -13079 -10484 -3581
7208c581N742j515k350R301K716O77k46j449k900l470k964p516r24J029P466M528
$$ -3581 2161 646 -1704 7597 10313 10990 10744 9295 6395 2925 -39 -7555 -8479 -7450 16 4544
7192D544p87L520l389j386l24Q54L406k95n323N586P838J642m946K452N812k305
$$ 4544 3757 7277 3888 2502 2178 3032 6438 6143 820 6406 14244 15886 10940 13392 19204 16899
7176A6899n169o267n739J893j709m39j698m480J001j331k815M282J895P169l055
$$ 16899 11730 5463 -276 1617 -92 -531 -2229 -6709 -5708 -7039 -9854 -5572 -3677 3492 437
7161D37r73o62J157N033k644J141Q13L9l554k732Q34r14J434P279J130K659M543
$$ 437 -536 -1198 -41 4992 2348 3489 4302 4341 787 -1945 -1111 -2025 -591 6688 7818 10477 15020
7144A5020m540q992j0888J40l756P558j823L340N600J73m399l441J558N897M088
$$ 15020 10480 1488 -9400 -9260 -13016 -5458 -7281 -3941 1659 1832 -2567 -6008 -4450 1447 5535
7129E535K629N07o18p333o475L57N561M150Q362M178l097l048J226L631j253q328
$$ 5535 8164 8671 8053 720 -5755 -5398 163 4313 12675 16853 13756 10708 11934 15565 14312 5984
7113E984R2Q286N82K499k347k31K946j458n212K223r025o223K953J038m10n453
$$ 5984 6076 14362 14944 17443 15096 14865 17811 16353 11141 13364 4339 -1884 1069 2107 1697 -3756
7097c756q13M712K462J646m968L364L793l02M182L171q36l199l494r393m491P018
$$ -3756 -4569 143 2605 4251 -717 2647 6440 6138 10320 13491 12655 9456 5962 -3431 -7922 -904
7081i04Q773m401P19J350n842J758N100L591k196m815K882J256k098j090J174
$$ -904 7869 3468 4187 5537 -305 1453 6553 10144 7948 3133 6015 7271 5173 4083 5257
7066E257k453n16J312J199l605m462N617N102m739o955m738j454O774j787K559
$$ 5257 2804 2288 3600 4799 1194 -3268 2349 7451 2712 -4243 -8981 -10435 -3661 -5448 -2889
7051b889P557M309q798r355N86j763J19M449L015L834k928j078m891N470M690
$$ -2889 4668 8977 179 -9176 -8590 -10353 -10234 -5785 -2770 1064 -1864 -2942 -7833 -2363 2327
7036B327m600n60l497q13P772N024j210l942k401l950O556O592L62m761q263l955
$$ 2327 -2273 -2833 -6330 -7143 629 5653 4443 501 -1900 -5850 706 7298 7660 2899 -5364 -9319
7020i319L608J686L138m284O729J0692P7m89j472J839m025m331M13J064k907j550
$$ -9319 -5711 -4025 -887 -5171 1558 12250 12327 11838 10366 12205 8180 3849 4262 5326 2419 869
7004H69l392N088L266j99p507l4M32k31j997p510K465P777K582j347N776L01o890
$$ 869 -2523 2565 5831 5632 -1875 -1909 -1477 -1708 -3705 -11215 -8750 -973 1609 262 6038 6339 -551
6987e51l223p1L742m960Q28j341j523N152M386p591M731N79k08k676l062m382
$$ -551 -3774 -3845 -103 -5063 -4235 -5576 -7099 -1947 2439 -5152 -421 158 -50 -2726 -5788 -10170
6971a0170J724N42L458K69n269K009R743M063J615J636l737j176j619k461l17
$$ -10170 -8446 -7904 -4446 -4177 -9446 -7437 2306 6369 7984 9620 5883 4707 3088 627 310
6956C10K848n44m463n894k331L507r98j780M212L854k078Q901M425J733q088l975
$$ 310 3158 2614 -1849 -7743 -10074 -6567 -7565 -9345 -5133 -1279 -3357 5544 9969 11702 3614 -361
6940c61L609L754m371p929q98q69r90K074n759M551M618L293J117L787M902k730
$$ -361 3248 7002 2631 -5298 -6196 -7065 -8055 -5981 -11740 -7189 -2571 722 1839 5626 10528 7798
6924G798L132J681L67p28l882L757j499k085K050k74q5l566k128k899j87o47n679
$$ 7798 10930 12611 12978 12250 8368 12125 10626 8541 10591 10317 10232 6666 4538 1639 1452 805 -4874
6907d874j149J231q271J525N100N464l794j0109l264P411q50M176K016J820j156
$$ -4874 -6023 -4792 -13063 -11538 -6438 -974 -4768 -14877 -18141 -10730 -11580 -7404 -5388 -3568 -4724
6892d724K476J295L875k253k738J961j951n027n065K557M037L735l089K371l273
$$ -4724 -2248 -953 2922 669 -2069 -108 -2059 -7086 -12151 -9594 -5557 -1822 -4911 -2540 -5813
6877e813m072J197m42P72L32l51L709L041o64L589L7L726L877K958p317o706m210
$$ -5813 -9885 -8688 -9130 -8358 -8026 -8377 -4668 -1627 -2291 1298 1335 5061 8938 11896 4579 -2127 -6337
6860f337K988K162Q048J309L901L84m043n697q250M28O464J100r80k085K630R533
$$ -6337 -3349 -1187 6861 8170 12071 12455 8412 2715 -5535 -5107 1357 2457 1477 -608 2022 11555
6844A1555l520j0382k544K048o31K560N888q4J996j046n531m400J052K862J891
$$ 11555 8035 -2347 -4891 -2843 -3474 -914 4974 4890 6886 5840 309 -4091 -3039 -177 1714
6829A714n968L705K095q314J471J1188Q247L079N28o422j0496M007M152O447j2023
$$ 1714 -4254 -549 1546 -6768 -5297 5891 14138 17217 17745 11323 827 4834 8986 15433 3410
6814C410p971M406n425M07K171m443J16q25k119L709m344k89k29O138L472k715
$$ 3410 -4561 -155 -5580 -5173 -3002 -7445 -7329 -8154 -10273 -6564 -10908 -11197 -11426 -5288 -1816 -4531
6798d531M089P026O86r577n152m446R59Q35m275k454J637O336N822N725n41N87
$$ -4531 -442 6584 7270 -2307 -7459 -11905 -10946 -10111 -14386 -16840 -15203 -8867 -3045 2680 2139 2726
6782B726J15o189p675j991P020k759J0160J2893j280m349n021k966O106M587P84
$$ 2726 2841 -3348 -11023 -13014 -5994 -8753 1407 14300 13020 8671 3650 684 6790 11377 12161
6767A2161k422jL34K941J149j973r273K42O245J070m678L854m855p68K035J0919
$$ 12161 9739 9738 10072 13013 14162 12189 2916 3158 9403 10473 5795 9649 4794 4026 6061 16980
6751A6980j046o567M165k662r315J6O89l068J1305m61m922M41J1178J0255l123
$$ 16980 15934 9367 13532 10870 1555 1571 2260 -808 10497 10036 5114 5555 16733 26988 23865
6736B3865q155p278o350O303Q620R29l894K465l694n130J740k382j584Kj1419
$$ 23865 15710 8432 2082 8385 17005 17934 14040 16505 12811 7681 9421 7039 5455 5457 -5962
6721e962k726L174N59N591K913j214n360l188m709o473K391j52P251N984o74n43
$$ -5962 -8688 -5514 -4955 636 3549 2335 -3025 -6213 -10922 -17395 -15004 -15156 -7905 -1921 -2595 -3138
6705c138M964M310l697J258j892q556l268J279l21K339l657l738J974M773P896
$$ -3138 1826 6136 2439 3697 1805 -6751 -10019 -8740 -9061 -6722 -10379 -14117 -12143 -7370 526
6690E26K757k699j247l178m481J788P961R29j930J682o621m545m64K509Q08l984
$$ 526 3283 584 -663 -3841 -8322 -6534 1427 2356 426 2108 -4513 -9058 -9522 -7013 -6205 -10189
6674a0189L670O387p9m216O750n25p59l722K802K880k200m217R029J321k587k189
$$ -10189 -6519 -132 -211 -4427 2323 1798 1039 -2683 119 2999 799 -3418 5611 6932 4345 2156
6658B156q093j651K938M915m407J878M253p07J658l412K535R23o89K477q099o577
$$ 2156 -5937 -7588 -4650 265 -4142 -2264 1989 1282 2940 -472 2063 2986 2297 4774 -3325 -9902
6642i902O474N715o098p302Q277N065k944Q66m764m279N571l390k526k089K274
$$ -9902 -3428 2287 -3811 -11113 -2836 2229 -715 151 -4613 -8892 -3321 -6711 -9237 -11326 -9052
6627i052J776L482N096m338l952J323R155j722n132j1001k591J684N105N104N176
$$ -9052 -7276 -3794 1302 -3036 -6988 -5665 3490 1768 -3364 -14365 -16956 -15272 -10167 -5063 113
6612A13L565J611j531r734j695O155R556K182J443k268l345L282q397J210l875
$$ 113 3678 5289 3758 -5976 -7671 -1516 8040 10222 11665 9397 6052 9334 937 2147 -1728
6597a728m146l242O828k088J628n747m131N567N904J155K68m281k750M985Q458
$$ -1728 -5874 -9116 -2288 -4376 -2748 -8495 -12626 -7059 -1155 0 268 -4013 -6763 -1778 6680
6582F680p78q081L432J621k778L619l067r411m488L640m91m406k365R423L763
$$ 6680 5902 -2179 1253 2874 96 3715 648 -8763 -13251 -9611 -10102 -14508 -16873 -7450 -3687
6567c687O283O407j674q829o144P106L963j168j28K37j445L07l295M280K1p118
$$ -3687 2596 9003 7329 -1500 -7644 -538 3425 2257 2129 2366 921 1228 -2067 2213 2234 -4884
6551d884k639K086L114L668M469J007K707m962k033K336o052m623P590p95n20
$$ -4884 -7523 -5437 -2323 1345 5814 6821 9528 4566 2533 4869 -1183 -5806 1784 989 469
6536D69m21O607J033n940K964O852o092n968N697J227j703N393n887j0087q946
$$ 469 48 6655 7688 1748 4712 11564 5472 -496 5201 6428 4725 10118 4231 -5856 -14802
6521a4802K996J0427Q522n869p012J778J19j25k694m45N178j166j541j267j26
$$ -14802 -11806 -1379 7143 1274 -5738 -3960 -3841 -3966 -6660 -7105 -1927 -3093 -4634 -5901 -6027
6506f027k123R71o04O763O846J345L5K746l240m309k055j286O551M153M272k835
$$ -6027 -8150 -7179 -7783 -1020 5826 7171 7206 9952 6712 2403 348 -938 5613 9766 14038 11203
6490A1203k393o03K610k035n403r35J847l630k022n09j660l684P42K912n780m719
$$ 11203 8810 8207 10817 8782 3379 2444 4291 661 -1361 -1870 -3530 -7214 -6472 -3560 -9340 -14059
6474a4059K348j78q648l111K201M169n8m576J566O367R058L428p436K038o71K789
$$ -14059 -11711 -11889 -20537 -23648 -21447 -17278 -17336 -21912 -20346 -13979 -4921 -1493 -8929 -6891 -7562 -4773
6458d773L725K184Q1n579J382M689J393m614N63J152k432o774l432k272J263r17
$$ -4773 -1048 1136 1217 -4362 -2980 1709 3102 -1512 -949 203 -2229 -9003 -12435 -14707 -13444 -14361
6442a4361J286M679L539J23R11K306n40j085N350J022k892L064Kl622n767l060
$$ -14361 -13075 -8396 -4857 -4734 -3823 -1517 -2057 -3142 2208 3230 338 3402 3404 -218 -5985 -9045
6426i045K218M739M928o747p55J220p414n890J128Q450J547o868K779L648M64
$$ -9045 -6827 -2088 2840 -3907 -4662 -3442 -10856 -16746 -15618 -7168 -5621 -12489 -9710 -6062 -5598
6411e598O48O48J261l153M70J192k226M380L163k836J830Q529n11J661k095L49
$$ -5598 -4950 -4302 -3041 -6194 -5724 -4532 -6758 -2378 785 -2051 -221 8308 7797 9458 7363 7712
6395G712n818k18K24l886L52K858K659J628o412q447j809J275J730O038O734n211
$$ 7712 1894 1676 1900 -1986 -1634 1224 3883 5511 -901 -9348 -11157 -9882 -8152 -2114 4620 -591
6379e91m824L370l3j0190m17n21K731K702J767L309o6O627J223j862j137L818
$$ -591 -5415 -2045 -2078 -12268 -12685 -13206 -10475 -7773 -6006 -2697 -2763 3864 5087 3225 2088 5906
6363E906o986m246k512R84J541K949P032P647k275o919m605J866J420o094N43
$$ 5906 -1080 -5326 -7838 -6854 -5313 -2364 4668 12315 10040 3121 -1484 382 1802 -4292 -3749
6348c749o707q07O484N539L816j404l07j270k604K966O188K927q642n702m931
$$ -3749 -10456 -11263 -4779 760 4576 3172 2865 1595 -1009 1957 8145 11072 2430 -3272 -8203
6333h203k797O072M560Q44M579Q275N970n276j2001j952M13J203l690l077r678
$$ -8203 -11000 -4928 -368 476 5055 13330 19300 14024 2023 71 484 1687 -2003 -5080 -14758
6318a4758M96P750L746J621K551l756l871J356K016j949l146L312j421Q31k807
$$ -14758 -14262 -6512 -2766 -1145 1406 -2350 -6221 -4865 -2849 -4798 -7944 -4632 -6053 -5222 -8029
6303h029o54O232L578p12o034k079j266m454K092K613N549Q518O013l262o836
$$ -8029 -8683 -2451 1127 415 -5619 -7698 -8964 -13418 -11326 -8713 -3164 5354 11367 8105 1269
6288A269k653k693J981K009L494k175m318n27k784l040M646P449m527o333j023
$$ 1269 -1384 -4077 -2096 -87 3407 1232 -3086 -3613 -6397 -9437 -4791 2658 -1869 -8202 -9225
6273i225J940M446Q648k613n46j137J409l744p811q28J464J431N582m43q67k123
$$ -9225 -7285 -2839 5809 3196 2650 1513 2922 -822 -8633 -9461 -7997 -6566 -984 -1427 -2294 -4417
6257d417L227M585q325r682N020R312J774k007j506l323L333o285K11N005N739
$$ -4417 -1190 3395 -4930 -14612 -9592 -280 1494 -513 -2019 -5342 -2009 -8294 -8083 -3078 2661
6242B661J405O678j573L985p63p439l250M943L689k22J949J818l27n419o426r344
$$ 2661 4066 10744 9171 13156 12393 4954 1704 6647 10336 10114 12063 13881 13554 8135 1709 -7635
6226g635o600j065m225J494J0038P533J552n650j179P738P573J416m118n145o50
$$ -7635 -14235 -15300 -19525 -18031 -7993 -460 1092 -4558 -5737 2001 9574 10990 6872 1727 1077
6211A077k245j313j993m876l665K812k401m617Q820O259O32p685m858P343Q244
$$ 1077 -1168 -2481 -4474 -9350 -13015 -10203 -12604 -17221 -8401 -2142 -1510 -9195 -14053 -6710 1534
6196A534M819l360p925M203J544R97k938J609K517M336N98j419q667q993N371
$$ 1534 6353 2993 -4932 -729 815 1812 -1126 483 3000 7336 7934 6515 -2152 -11145 -5774
6181e774K419M27K48K688M32j802N748q31k494p192l640L626M15k158n15P56k028
$$ -5774 -3355 -2928 -2680 8 440 -1362 4386 3555 1061 -6131 -9771 -6145 -5730 -7888 -8403 -7647 -9675
6164i675J023L232l177n024K795J022J371l63O862P983p63j2709p693M22J192
$$ -9675 -8652 -5420 -8597 -13621 -10826 -9804 -8433 -8796 -1934 6049 5286 -7423 -15116 -14694 -13502
6149a3502M60K315L076N690M410k480k939L511o99j707L407j335j0119J458j32
$$ -13502 -13042 -10727 -7651 -1961 2449 -31 -2970 541 -158 -1865 1542 207 -9912 -8454 -8586
6134h586k384L349M73m942o552l77P513K820J0113K821l349o838k986R185M953
$$ -8586 -10970 -7621 -7148 -12090 -18642 -19019 -11506 -8686 1427 4248 899 -5939 -8925 260 5213
6119E213m999n491m99O740m83q234O195O898k721k384N501K006l745N29l564J345
$$ 5213 214 -5277 -5776 964 481 -7753 -1558 5340 2619 235 5736 7742 3997 4526 962 2307
6103B307L067k140p453p171n31O950J877K530l825j841J275l211O160J952l585
$$ 2307 5374 3234 -4219 -11390 -11921 -4971 -3094 -564 -4389 -6230 -4955 -8166 -2006 -54 -3639
6088c639M601L430q625r87m759O31M990N707J276o808J686N200J067p63n107K892
$$ -3639 962 4392 -4233 -5220 -9979 -9348 -4358 1349 2625 -4183 -2497 2703 3770 3007 -2100 792
6072G92p39k080L865j235k282O931N303k86o176J292J0788J44k768K017j328l080
$$ 792 53 -2027 1838 603 -1679 5252 10555 10269 4093 5385 16173 16317 13549 15566 14238 11158
6056A1158k958L91K108m16jp798m362j825j840J735P829J949J19m430l690M012
$$ 11158 8200 8591 10699 10283 10282 2484 -1878 -3703 -5543 -3808 4021 5970 6089 1659 -2031 1981
6040A981r737o175L989M583J630N05k047J361j448M17L572j626l503j555K329
$$ 1981 -7756 -13931 -9942 -5359 -3729 -3224 -5271 -3910 -5358 -4941 -1369 -2995 -6498 -8053 -5724
6025e724k096K667N009l010P20j62j0874o783M018J1761j022m58k833J0200L224
$$ -5724 -7820 -5153 -144 -3154 -2434 -2596 -13470 -20253 -16235 -4474 -5496 -5954 -8787 1413 4637
6010D637k986m004O75J501l371m336m412Q14l580O959M019l440o352J251M809
$$ 4637 1651 -2353 -1678 -177 -3548 -7884 -12296 -11482 -15062 -8103 -4084 -7524 -13876 -12625 -7816
5995g816K25o15j042p634j930k485L282L580o410O325N736K193M022n730n382
$$ -7816 -7591 -8206 -9248 -16882 -18812 -21297 -18015 -14435 -20845 -14520 -8784 -6591 -2569 -8299 -13681
5980a3681L072M014K7N526M077m504j018L090j730N511P996m809o430l902M087
$$ -13681 -10609 -6595 -6568 -1042 3035 -1469 -2487 603 -1127 4384 12380 7571 1141 -2761 1326
5965A326N222R29l688n833N405j4l921p259m65J2176m747l48k302k137k406o81
$$ 1326 6548 7477 3789 -2044 3361 3347 -574 -7833 -8298 3878 -869 -1217 -3519 -5656 -8062 -8743
5949h743O889j118M304M596J534K101l610q61o739J315J791K56q307j152N169
$$ -8743 -1854 -2972 1332 5928 7462 9563 5953 5092 -1647 -332 1459 1715 -6592 -7744 -2575
5934b575Q171J851o167R4J281l396k857L975K60j3763o171O25J109K246Q362M361
$$ -2575 5596 7447 1280 1374 2655 -741 -3598 377 637 -13126 -19297 -18672 -17563 -15317 -6955 -2594
5918b594n5n503M649m99o814k445k724O584J324O38L639l61k698l53P588L356
$$ -2594 -2649 -8152 -3503 -4002 -10816 -13261 -15985 -9401 -8077 -7439 -3800 -4161 -6859 -7212 376 3732
5902C732q584p946K531N114l86M506o154L572p07p355n925O929M119J822K047
$$ 3732 -4852 -12798 -10267 -5153 -5539 -1033 -7187 -3615 -4322 -11677 -17602 -10673 -6554 -4732 -2685
5887b685l549n525j371n78M160K301N692m94q63o994l812M04R63o569L980M033
$$ -2685 -6234 -11759 -13130 -13708 -9548 -7247 -1555 -2049 -2912 -9906 -13718 -13314 -12351 -18920 -14940 -10907
5871a0907m70N555O162r69q112K944O327J65O307q921l404P164j10o3j316m240
$$ -10907 -11377 -5822 340 -629 -8741 -5797 530 695 7002 -1919 -5323 1841 1731 1668 352 -3888
5855c888J171o611p12k32J684j315K863L024K989q55J359m725J356L078M935M75
$$ -3888 -2717 -9328 -10040 -10272 -8588 -9903 -7040 -4016 -1027 -1882 -523 -5248 -3892 -814 4121 4596
5839D596K344K040n751p260l814M402J1176L437n795p406n263o472k574L632L012
$$ 4596 6940 8980 3229 -4031 -7845 -3443 7733 11170 5375 -2031 -7294 -13766 -16340 -12708 -9696
5824i696N806n92l373P745k155M70L582p49o614M808L081J961n841k468K354k506
$$ -9696 -3890 -4482 -7855 -110 -2265 -1795 1787 1038 -5576 -768 2313 4274 -1567 -4035 -1681 -4187
5808d187p008o32k42N28J264M977R634k450r731n04P993j550m910J430Q266p25
$$ -4187 -11195 -11827 -12069 -11541 -10277 -5300 4334 1884 -7847 -8351 -358 -1908 -6818 -5388 2878 2153
5792B153l054j259p17q963K553P812Q458r2l470k141o77n9j019r84N516n149P98
$$ 2153 -901 -2160 -2877 -11840 -9287 -1475 6983 6891 3421 1280 603 544 -475 -1459 4057 -1092 -294
5775b94m6k426J477J997k635p208j087m309j150N251M06pL63j02L090O559N283
$$ -294 -340 -2766 -1289 708 -1927 -9135 -10222 -14531 -15681 -10430 -10024 -10031 -9668 -9770 -6680 -121 5162
5758E162l562k379M25o978J879J640l22N640n245O25l92J765m47l363k802L334
$$ 5162 1600 -779 -354 -7332 -5453 -3813 -4135 1505 -3740 -3115 -3507 -1742 -2189 -5552 -8354 -5020
5742e020P181J90m836p993J104L804O00J0778k205K261J893l956L903N159o156
$$ -5020 2161 2351 -2485 -10478 -9374 -5570 -4970 5808 3603 5864 7757 3801 7704 12863 6707
5727F707r042J640N200J92j095K61m330n293m471J532K112n544J743m918j49j55
$$ 6707 -2335 -695 4505 4697 3602 3863 -467 -5760 -10231 -8699 -6587 -12131 -10388 -15306 -15455 -15610
5711a5610l939J995K555P221O950M778J305l857j2678l526P886j891o729K322
$$ -15610 -19549 -17554 -14999 -7778 -828 3950 5255 1398 -11280 -14806 -6920 -8811 -15540 -13218
5697a3218M644M399M007P97K265R77n977j324J543p41O14K597j299K292J565k933
$$ -13218 -8574 -4175 -168 629 2894 3871 -2106 -3430 -1887 -2628 -2014 583 -716 1576 3141 208
5681B08l130R27q356K220O386J630k055M885m175n029J126J690j95p472l401O570
$$ 208 -2922 -1995 -10351 -8131 -1745 -115 -2170 2715 -1460 -6489 -5363 -3673 -3868 -11340 -14741 -8171
5665h171j012L907P150m24k311l671R74k394K971l704K668J255J0826m647o426
$$ -8171 -9183 -5276 1874 1450 -861 -4532 -3558 -5952 -2981 -6685 -4017 -2762 8064 3417 -3009
5650c009K7Q54R60J515m752J242j080O87J261J936O253m614k702j77m192R983
$$ -3009 -2982 -2128 -1168 347 -4405 -3163 -4243 -3556 -2295 -359 5894 1280 -1422 -1599 -5791 4192
5634D192n37p305k546L687o69K166J191r720k773P355O968O130l953q300l665
$$ 4192 3655 -3650 -6196 -2509 -3178 -1012 179 -9541 -12314 -4959 2009 8139 4186 -4114 -7779
5619g779N557L872J130k831j019K871m17L421O95M469K652o608n005o687p19o824
$$ -7779 -2222 1650 2780 -51 -1070 1801 1384 4805 5500 9969 12621 6013 1008 -5679 -6398 -13222
5603a3222p062O101l531O634K861m541m192j425R240M065L120r99j973J596q69
$$ -13222 -20284 -14183 -17714 -11080 -8219 -12760 -16952 -18377 -9137 -5072 -1952 -2951 -4924 -3328 -4197
5588d197j0640j17J2086n236o081j741n46L372P73J125M777J646m68N581L856
$$ -4197 -14837 -14954 -2868 -8104 -14185 -15926 -16472 -13100 -12327 -11202 -6425 -4779 -5247 334 4190
5573D190n129K267J916l24k997J624K820J676K771j0066j463J191q75l305l526
$$ 4190 -939 1328 3244 2920 -77 1547 4367 6043 8814 -1252 -2715 -1524 -2399 -5704 -9230
5558i230j603J500Q453P101j057m073L225j938M40N302k621m423m319j040J948
$$ -9230 -10833 -9333 -880 6221 5164 1091 4316 2378 2818 8120 5499 1076 -3243 -4283 -2335
5543b335J186j312j710J579J191N903L199r51m3k025j034m022J407L772N631k058
$$ -2335 -1149 -2461 -4171 -2592 -1401 4502 7701 6750 6707 4682 3648 -374 1033 4805 10436 8378
5527H378j0988p598k910K837M646N794J645P64K356n57k222k860q436l327L253
$$ 8378 -2610 -10208 -13118 -10281 -5635 159 1804 2568 4924 4367 2145 -715 -9151 -12478 -9225
5512i225K030K290J388L293l846j14K48j73L783L240n515l129n34l198O7P980
$$ -9225 -7195 -4905 -3517 -224 -4070 -4184 -3936 -4109 -326 2914 -2601 -5730 -6264 -9462 -9395 -1415
5496a415J187o284l153p763k139R684O306j051j448q6m867K207O158O493L336
$$ -1415 -228 -6512 -9665 -17428 -19567 -9883 -3577 -4628 -6076 -6162 -11029 -8822 -2664 3829 7165
5481G165o40q826j637m490K994n6p105m836J224O104J081N73O211J0360N00j1000
$$ 7165 6525 -2301 -3938 -8428 -5434 -5490 -12595 -17431 -16207 -10103 -9022 -8449 -2238 8122 8622 -2378
5465b378m207J228L032L440j819l098J770J386m651j410O501M332m016k165M007
$$ -2378 -6585 -5357 -2325 1115 -704 -3802 -2032 -646 -5297 -6707 -206 4126 110 -2055 1952
5450A952l485m870K75K529K021M874l952k152J230Q253l566o68L015R74K639n742
$$ 1952 -1533 -6403 -6128 -3599 -1578 3296 -656 -2808 -1578 6675 3109 2441 5456 6430 9069 3327
5434C327n332L438J544K35J524p382L514J547O37j991J634l143m998m458O912
$$ 3327 -2005 1433 2977 3212 4736 -2646 868 2415 3052 1061 2695 -448 -5446 -9904 -2992
5419b992O454N34O620M584K142m106j1936n910K194J682p246J635J284l669J122
$$ -2992 3462 3996 10616 15200 17342 13236 1300 -4610 -2416 -734 -7980 -6345 -5061 -8730 -7608
5404g608l651M77P082O928n781j802Q020R591n071L35J235o984l867J765L411
$$ -7608 -11259 -10782 -3700 3228 -2553 -4355 3665 13256 8185 8520 9755 2771 -1096 669 4080
5389D080o629j0564k792O216l944P062N702l912o389J350l913k874O107K968J547
$$ 4080 -2549 -13113 -15905 -9689 -13633 -6571 -869 -4781 -11170 -9820 -13733 -16607 -10500 -7532 -5985
5374e985m302n60K067L455K672J970J21l250k180N781j535r878p57J2100j59O380
$$ -5985 -10287 -10847 -8780 -5325 -2653 -683 -562 -3812 -5992 -211 -1746 -11624 -12381 -281 -440 5940
5358E940K876n599m707J470N653m235m18k245k807j206k565L17j418K673M212
$$ 5940 8816 3217 -1490 -20 5633 1398 980 -1265 -4072 -5278 -7843 -7526 -8944 -6271 -2059
5343b059J104K814m524j119J703M423k046n524m101j298k912j227L425K271k587
$$ -2059 -955 1859 -2665 -3784 -2081 2342 296 -5228 -9329 -10627 -13539 -14766 -11341 -9070 -11657
5328a1657l233J713J0718O086L590j857p621o569L965l508n539L703K478N095
$$ -11657 -14890 -13177 -2459 3627 7217 5360 -2261 -8830 -4865 -8373 -13912 -10209 -7731 -2636
5314b636P1m01j0181k503m88P017P603O185l666j592j0525j0062L930J1431l711
$$ -2636 -2565 -2966 -13147 -15650 -16138 -9121 -1518 4667 1001 -591 -11116 -21178 -17248 -5817 -9528
5299i528m515K056K177n73m156J0436J942k885k997N590k35j314p5O30N839O058
$$ -9528 -14043 -11987 -9810 -10383 -14539 -4103 -2161 -5046 -8043 -2453 -2688 -4002 -4077 -3447 2392 8450
5283H450n264m628l861k525J109n225L48q50N644r10l322L61N421J652L834O04
$$ 8450 3186 -1442 -5303 -7828 -6719 -11944 -11596 -12446 -6802 -7712 -11034 -10673 -5252 -3600 234 838
5267H38l094J036K461n68P07m178p35k953N537m111j816k481M588J116l265N926
$$ 838 -2256 -1220 1241 673 1380 -2798 -3533 -6486 -949 -5060 -6876 -9357 -4769 -3653 -6918 -992
5251i92J773o16J216N640n442n490J554M03J846o119j633n22M711K754m405j93
$$ -992 781 165 1381 7021 1579 -3911 -2357 -1954 -108 -6227 -7860 -8382 -3671 -917 -5322 -5515
5235e515l44J893j626K771k474K955J611L314J099l195l202L148l33m192J546
$$ -5515 -5859 -3966 -5592 -2821 -5295 -2340 -729 2585 3684 489 -2713 435 102 -4090 -2544
5220b544L019l995l479N634N08L048l247m476j538K092k194J488K082j85L19l107
$$ -2544 475 -3520 -6999 -1365 -857 2191 -1056 -5532 -7070 -4978 -7172 -5684 -3602 -3787 -3468 -6575
5204f575q164q138j853Q390N664L846K277J654L022M335l494p003l546r725p8
$$ -6575 -14739 -22877 -24730 -16340 -10676 -6830 -4553 -2899 123 4458 964 -6039 -9585 -19310 -19388
5189a9388L131l828l462L674J1195M279J436n24K837M227j00k358m600J58N419
$$ -19388 -16257 -20085 -23547 -19873 -8678 -4399 -2963 -3487 -650 3577 3477 1119 -3481 -3323 2096
5174B096n562K036J567L930O80M339k22j61o733k011j693m674m175L710K545L185
$$ 2096 -3466 -1430 137 4067 4747 9086 8864 8703 1970 -41 -1734 -6408 -10583 -6873 -4328 -1143
5158a143N174j010l081k417K299K600l254n448O79Q47M875k37o078j335M019N64
$$ -1143 4031 3021 -60 -2477 -178 2422 -832 -6280 -5601 -4754 121 -116 -6194 -7529 -3510 -2946
5142b946l748K716N637J05n534R28P52N241l38n418O438M992k291j183M330m555
$$ -2946 -6694 -3978 1659 1764 -3770 -2842 -2090 3151 2813 -2605 3833 8825 6534 5351 9681 5126
5126E126j0083k068K416K263m011K324N265J869J705P152n434r168n61L880J713
$$ 5126 -4957 -7025 -4609 -2346 -6357 -4033 1232 3101 4806 11958 6524 -2644 -3205 675 2388
5111B388m264n80n941k573L861r2l493K544N913j44m749l75Q510L931j6062j481
$$ 2388 -1876 -2456 -8397 -10970 -7109 -7201 -10694 -8150 -2237 -2381 -7130 -7505 1005 4936 -11126 -12607
5095a2607R479N710J428o166l076K623Q682J480j398j53m061o979L938J829P370
$$ -12607 -3128 2582 4010 -2156 -5232 -2609 6073 7553 6155 6002 1941 -5038 -1100 729 8099
5080H099n677j948n34p358K630j380k120m404K095j513J736j015J120K395L682
$$ 8099 2422 474 -60 -7418 -4788 -6168 -8288 -12692 -10597 -12110 -10374 -11389 -10269 -7874 -4192
5065d192K372r43p658M3J501J847K148K188j601m503M136N76j727L033J433q97
$$ -4192 -1820 -2763 -10421 -10378 -8877 -7030 -4882 -2694 -4295 -8798 -4662 -4086 -5813 -2780 -1347 -2244
5049b244n260N659N943P89n315p11J329q15k102J269j511p38P62J231j717l45
$$ -2244 -7504 -1845 4098 4887 -428 -1139 190 -625 -2727 -1458 -2969 -3707 -2945 -1714 -3431 -3776
5033c776L581Q65P54J863m075j711l73l897p366Q86N238k349K5M633j73j96k728
$$ -3776 -195 670 1424 3287 -788 -2499 -2872 -6769 -14135 -13249 -8011 -10360 -10335 -5702 -5875 -6071 -8799
5016h799j513n15o39K398M610Q686K109n570N86k326l305O81l080K022N319n99
$$ -8799 -10312 -10827 -11466 -9068 -4458 4228 6337 767 1353 -973 -4278 -3597 -6677 -4655 664 65
5000F5j940P2J857l044k454o342o121j8O584J071J79L026j365k541M277M016k740
$$ 65 -1875 -1803 54 -2990 -5444 -11786 -17907 -17925 -11341 -10270 -10091 -7065 -8430 -10971 -6694 -2678 -5418
4983e418n234Q123N358j783p594j57J502k972K030N037n7N77j610k082N131K037
$$ -5418 -10652 -2529 2829 1046 -6548 -6705 -5203 -8175 -6145 -1108 -1165 -588 -2198 -4280 851 2888
4967B888k158l643q98K686K762k578m566P26k43j788k152M984m230R56L004L227
$$ 2888 730 -2913 -3811 -1125 1637 -941 -5507 -4781 -5024 -6812 -8964 -3980 -8210 -7254 -4250 -1023
4951a023R098J754l555k036J774k729J142K774q156n863q63l78R28J014j08K645
$$ -1023 8075 9829 6274 4238 6012 3283 4425 7199 -957 -6820 -7683 -8061 -7133 -6119 -6227 -3582
4935c582k280o05P424m572m411o380J371O341M947N097K728l248m020l662j3625
$$ -3582 -5862 -6467 957 -3615 -8026 -14406 -13035 -6694 -1747 3350 6078 2830 -1190 -4852 -18477
4920a8477j0363J00L044Q184L846Q353P292j995o176M765J212O01K482l746L006
$$ -18477 -28840 -28740 -25696 -17512 -13666 -5313 1979 -16 -6192 -1427 -215 386 2868 -878 2128
4905B128J331K793j466L803L756l93j300n435k273m523k117j196n72l212k676
$$ 2128 3459 6252 4786 8589 12345 11952 10652 5217 2944 -1579 -3696 -4892 -5464 -8676 -11352
4890a1352N404K64J666M047jp946j085k640R379P973L483k266j0061L64M03P55
$$ -11352 -5948 -5684 -4018 29 28 -7918 -9003 -11643 -2264 5709 9192 6926 -3135 -2771 -2368 -1613
4874a613K814R36N049k579J353nm639o607j871K133j528J424j06k913R11K205
$$ -1613 1201 2137 7186 4607 5960 5955 1316 -5291 -7162 -5029 -6557 -5133 -5239 -8152 -7241 -5036
4858e036r24O86N906L823l788n226J938l127n98J312R163K081l615J642l775l050
$$ -5036 -5960 -5274 632 4455 667 -4559 -2621 -5748 -6346 -5034 4129 6210 2595 4237 462 -2588
4842b588l550q868O82N211N381k730k514l779j10O225M753R92P17m2J706p558
$$ -2588 -6138 -15006 -14324 -9113 -3732 -6462 -8976 -12755 -12865 -6640 -1887 -895 -178 -220 1486 -6072
4826f072j273k728j78J224O201Q220k44K680J01J330o483m953J019J280J8j011
$$ -6072 -7345 -10073 -10251 -9027 -2826 5394 5150 7830 7931 9261 2778 -2175 -1156 124 142 -869
4810h69j2798l894P765J0726J105l153K235M715o039n97J300j326L917J484J408
$$ -869 -13667 -17561 -9796 930 2035 -1118 1117 5832 -207 -804 496 -830 3087 4571 5979
4795E979n324m672l684o536m576O809O332j941N229O576N194n539q744k749O383
$$ 5979 655 -4017 -7701 -14237 -18813 -12004 -5672 -7613 -2384 4192 9386 3847 -4897 -7646 -1263
4780a263j101J182o16k432j401p216k339L558M889L209K5N654J886o990o788j755
$$ -1263 -2364 -1182 -1798 -4230 -5631 -12847 -15186 -11628 -6739 -3530 -3505 2149 4035 -2955 -9743 -11498
4764a1498M223k326n324L698J476M109m84q11k135M207l081K752R777K106l023
$$ -11498 -7275 -9601 -14925 -11227 -9751 -5642 -6126 -6937 -9072 -4865 -7946 -5194 4583 6689 3666
4749C666q590L76P327l753J564K465n669K633j816P62K930K191l109m124k731
$$ 3666 -4924 -4548 2779 -974 590 3055 -2614 19 -1797 -1035 1895 4086 977 -3147 -5878
4734e878M126j349r10N504M770O861q357r077l769O796M331J044j955q086l920
$$ -5878 -1752 -3101 -4011 1493 6263 13124 4767 -4310 -8079 -1283 3048 4092 2137 -5949 -9869
4719i869J0430O507j256j857J538l984L65m616n987j926K123O419k9n513K508
$$ -9869 561 7068 5812 3955 5493 1509 1874 -2742 -8729 -10655 -8532 -2113 -2142 -7655 -5147
4704e147N724L309o345o698k727K666L77L61M161j7M109L249l291j607K394K325
$$ -5147 577 3886 -2459 -9157 -11884 -9218 -8841 -8480 -4319 -4336 -227 3022 -269 -1876 518 2843
4688B843N784k176o58k185L167j110n93J947j246n797L624M016p470J353N786
$$ 2843 8627 6451 5793 3608 6775 5665 5072 7019 5773 -24 3600 7616 146 1499 7285
4673G285o155p133L480m9J237J987q9N68J94j536L169K945o119p651L124K291
$$ 7285 1130 -6003 -2523 -2572 -1335 652 563 1131 1325 -211 2958 5903 -216 -7867 -4743 -2452
4657b452j908L814o996J773L032m557m806n70L678n56k854m839P24N420N615K599
$$ -2452 -4360 -546 -7542 -5769 -2737 -7294 -12100 -12670 -8992 -9548 -12402 -17241 -16517 -11097 -5482 -2883
4641b883J706q24J929K352L360J936J282o880o531p344O578Q43j047o28O161K359
$$ -2883 -1177 -2001 -72 2280 5640 7576 8858 1978 -4553 -11897 -5319 -4476 -5523 -6151 10 2369
4625B369k186o396l931L98P113L564n126j001J690k441j828l062R5O377M831m026
$$ 2369 183 -6213 -10144 -9746 -2633 931 -4195 -5196 -3506 -5947 -7775 -10837 -10742 -4365 466 -3560
4609c560K247N33J708J712k537M91K182r4L352K880k368k360o28p43r92J28L680
$$ -3560 -1313 -780 928 2640 103 594 2776 2682 6034 8914 6546 4186 3558 2815 1823 1951 5631
4592E631J468q575l279L528J688n878o124m12O867N958k527K035P73k393p5J893
$$ 5631 7099 -1476 -4755 -1227 461 -5417 -11541 -11953 -5086 872 -1655 380 1153 -1240 -1315 578
4576E78l269l600K111L052L734K626k431l631K154l40q18J740n673k839J99m156
$$ 578 -2691 -6291 -4180 -1128 2606 5232 2801 -830 1324 984 166 1906 -3767 -6606 -6407 -10563
4560a0563j213L420j907j734J524n527J730P578K756n075j127M573O74J763j252
$$ -10563 -11776 -8356 -10263 -11997 -10473 -16000 -14270 -6692 -3936 -9011 -10138 -5565 -4891 -3128 -4380
4545d380o074J989O551m31N95k361j674L684J213L213p333Q14p128l695m343R82
$$ -4380 -10454 -8465 -1914 -2345 -1750 -4111 -5785 -2101 -888 2325 -5008 -4194 -11322 -15017 -19360 -18378
4529a8378K922Q899P746L424k322o147k397R83n851k512L101l658M077Q355o05
$$ -18378 -15456 -6557 1189 4613 2291 -3856 -6253 -5270 -11121 -13633 -10532 -14190 -10113 -1758 -2363
4514b363k372j167J216j822M470L228k123n010m514K314P427o06K147J257j1116
$$ -2363 -4735 -5902 -4686 -6508 -2038 1190 -933 -5943 -10457 -8143 -716 -1322 825 2082 -9034
4499i034k36l382l580K444M647R95P08j689L967L673QJ814J412m631r233o97j072
$$ -9034 -9270 -12652 -16232 -13788 -9141 -8146 -7438 -9127 -5160 -1487 -1479 335 1747 -2884 -12117 -12814 -13886
4482a3886n19N247K215n174J324p37k94m015L091L745O005j038Q00M229k398j371
$$ -13886 -14405 -9158 -6943 -12117 -10793 -11530 -11824 -15839 -12748 -9003 -2998 -4036 -3236 993 -1405 -2776
4466b776k389n807M910j647m52L162L580j693J405M571L58l590j1719l530O568
$$ -2776 -5165 -10972 -6062 -7709 -8161 -4999 -1419 -3112 -1707 2864 3222 -368 -12087 -15617 -9049
4451i049N691q15m84M75M759L564p809j045j83J492L484k954n760K729N980m083
$$ -9049 -3358 -4173 -4657 -4182 577 4141 -3668 -4713 -4896 -3404 80 -2874 -8634 -5905 75 -4008
4435d008K356K622Q36M016j570K169O93j411O628J536n852k737j211L203j0766
$$ -4008 -1652 970 1806 5822 4252 6421 7114 5703 12331 13867 8015 5278 4067 7270 -3496
4420c496m870O307M521q43l406p7M479m734j922J62P590R72K770L779M037j916
$$ -3496 -8366 -2059 2462 1619 -1787 -1864 2615 -2119 -4041 -3879 3711 4683 7453 11232 15269 13353
4404A3353q023k720m786j07p12L149N743J952j321k017j0577n722k657L457O289
$$ 13353 5330 2610 -2176 -2283 -2995 154 5897 7849 6528 4511 -6066 -11788 -14445 -10988 -4699
4389d699P832O192n247p926K682M89j234r93Q5k856l848N672N730k657j203P56
$$ -4699 3133 9325 4078 -3848 -1166 -677 -1911 -2904 -2819 -5675 -9523 -3851 1879 -778 -1981 -1225
4373a225l945p14l152n516p9J56j85M347n75k160L210O24R75k327M08J0825p43
$$ -1225 -5170 -5884 -9036 -14552 -14631 -14475 -14660 -10313 -10888 -13048 -9838 -9214 -8239 -10566 -10158 667 -76
4356g6j0163O37M180L296M13p990l828K96N075j205R92L688k348J086P018J083
$$ -76 -10239 -9602 -5422 -2126 -1713 -9703 -13531 -13235 -8160 -9365 -8373 -4685 -7033 -5947 1071 2154
4340B154n329p918m168m109m58N079N954K061J551p026l860m726M22N259K543
$$ 2154 -3175 -11093 -15261 -19370 -19828 -14749 -8795 -6734 -5183 -12209 -16069 -20795 -20373 -15114 -12571
4325a2571P929R242m897p89j380m472O05N082k679n644q456n644P372M757K825
$$ -12571 -4642 4600 -297 -1086 -2466 -6938 -6333 -1251 -3930 -9574 -18030 -23674 -16302 -11545 -8720
4310h720M521j584k247m111K645j95K450K469p329M125O607k265J501L520m100
$$ -8720 -4199 -5783 -8030 -12141 -9496 -9691 -7241 -4772 -12101 -7976 -1369 -3634 -2133 1387 -2713
4295b713k209M755j215l274m473L02L027K574k508J775r15J626K355N559N540
$$ -2713 -4922 -167 -1382 -4656 -9129 -8827 -5800 -3226 -5734 -3959 -4874 -3248 -893 4666 10206
4280A0206j1946j2353O941L574k253K88J730N204O67R64m002L658L042r691o105
$$ 10206 -1740 -14093 -7152 -3578 -5831 -5543 -3813 1391 2058 3022 -980 2678 5720 -3971 -10076
4265a0076R83K745L369K684R34o661p086k370P946O029j388L902k24o989j530
$$ -10076 -9093 -6348 -2979 -295 639 -6022 -13108 -15478 -7532 -1503 -2891 1011 787 -6202 -7732
4250g732P949j122l449j0129l910P041R222J369n336n198m440K664J0105Q881
$$ -7732 217 -905 -4354 -14483 -18393 -11352 -2130 -761 -6097 -11295 -15735 -13071 -2966 5915
4236E915K614j762l834r109l3L025j617K189O804l083m658L082J748J208L33J121
$$ 5915 8529 6767 2933 -6176 -6209 -3184 -4801 -2612 4192 1109 -3549 -467 1281 2489 2822 3943
4220C943l62N453m826j814Q58M08o67k872j05k747k756R05M628O319k581p450
$$ 3943 3581 9034 4208 2394 3252 3660 2993 121 16 -2731 -5487 -4582 46 6365 3784 -3666
4204c666N337N80Q325q924l721O257L379r780o141M195l260K114K807r09l487
$$ -3666 1671 2251 10576 1652 -2069 4188 7567 -2213 -8354 -4159 -7419 -5305 -2498 -3407 -6894
4189f894n934j141Q762p41J397m303J479N79l526J860Q964O54o305l794O944j42
$$ -6894 -12828 -13969 -5207 -5948 -4551 -8854 -7375 -6796 -10322 -8462 502 1156 -5149 -8943 -1999 -2141
4173b141l350J454l52k211N228J681k801l335n259M757N191j893n902N495k33
$$ -2141 -5491 -4037 -4389 -6600 -1372 309 -2492 -5827 -11086 -6329 -1138 -3031 -8933 -3438 -3671
4158c671k490K927j633Q36j649k32j663m298L206L099K00m249M834K812o185N52
$$ -3671 -6161 -3234 -4867 -4031 -5680 -5912 -7575 -11873 -8667 -5568 -5368 -9617 -4783 -1971 -8156 -7604
4142g604Q96m632J952J785K632K252L928J373m545m873L394M353m072q54o49Q75
$$ -7604 -6708 -11340 -9388 -7603 -4971 -2719 1209 2582 -1963 -6836 -3442 911 -3161 -4015 -4664 -3789
4126c789m85M154mO277N687r53K765m786K305K384q735o318O17p57k945K561K223
$$ -3789 -4274 -120 -124 6153 11840 10887 13652 8866 11171 13555 4820 -1498 -881 -1638 -4583 -2022 201
4109B01n789M45N338K505k730n240K55o493o152J530K040K116O067l83L173l63
$$ 201 -5588 -5143 195 2700 -30 -5270 -5015 -11508 -17660 -16130 -14090 -11974 -5907 -6290 -3117 -3480
4093c480K46k582q62L602J187n466j466l376l179K012r91O100l625q340P936k541
$$ -3480 -3234 -5816 -6678 -3076 -1889 -7355 -8821 -12197 -15376 -13364 -14355 -8255 -11880 -20220 -12284 -14825
4077a4825o84K8Q109L508k1n166K71O012n385l364J506O203N607k255k694n433
$$ -14825 -15509 -15481 -7372 -3864 -3885 -9051 -8780 -2768 -8153 -11517 -10011 -3808 1799 -456 -3150 -8583
4061h583k554l92P55O270Q025l984o033j193P18J021n203j489N083n11J501M820
$$ -8583 -11137 -11529 -10774 -4504 3521 -463 -6496 -7689 -6971 -5950 -11153 -12642 -7559 -8070 -6569 -1749
4045a749N060N446N494m294q067m740j680j344m567N509N672o587l046K339M37
$$ -1749 3311 8757 14251 9957 1890 -2850 -4530 -5874 -10441 -4932 740 -5847 -8893 -6554 -6117
4030f117M553K254k982M037P641j908j0864o260m18P617j98n116M595K811N4j797
$$ -6117 -1564 690 -2292 1745 9386 7478 -3386 -9646 -10064 -2447 -2645 -7761 -3166 -355 -301 -2098
4014b098j175K625l274J471o61J394p672r2M388J472J324o88L473l969k406J557
$$ -2098 -3273 -648 -3922 -2451 -3112 -1718 -9390 -9482 -5094 -3622 -2298 -2986 487 -3482 -5888 -4331
3998d331K180l71n966M00K689m770L747l077k671M234K352o827j63O893P307L97
$$ -4331 -2151 -2522 -8488 -8088 -5399 -10169 -6422 -9499 -12170 -7936 -5584 -12411 -12574 -5681 1626 2023
3982B023L610M851K907p695r638J15J238m571L807L878K153k715k541m24q604
$$ 2023 5633 10484 13391 5696 -3942 -3827 -2589 -7160 -3353 525 2678 -37 -2578 -3002 -11606
3967a1606n049k260K589J66k090M820O825J951o262l040L574Mp60K197k238N333
$$ -11606 -16655 -18915 -16326 -16160 -18250 -13430 -6605 -4654 -10916 -13956 -10382 -10378 -11138 -8941 -11179 -5846
3951e846M589N668k831P51P577N121q630j3625N33k281N231Q47j803K383L694
$$ -5846 -1257 4411 1580 2331 9908 15029 6399 -7226 -6693 -8974 -3743 -2896 -4699 -2316 1378
3936A378R55q88m645o023J52M124P129L71m810l993j182J171P734o383m323n007
$$ 1378 2333 1445 -3200 -9223 -9071 -4947 2182 2553 -2257 -6250 -7432 -6261 1473 -4910 -9233 -14240
3920a4240K184K112j421N77L701L150o424j769m95j617m439m234k898J1827P806
$$ -14240 -12056 -9944 -11365 -10788 -7087 -3937 -10361 -12130 -12625 -14242 -18681 -22915 -25813 -13986 -6180
3905f180n691k115O687q177L846M658P52J792j110p69r95k327j26K829J406M565
$$ -6180 -11871 -13986 -7299 -15476 -11630 -6972 -6220 -4428 -5538 -6307 -7302 -9629 -9755 -6926 -5520 -955
3889i55L56J675L858K046P21k719K96m226k713q9j479J390O703J097K836L809
$$ -955 -599 1076 4934 6980 7701 4982 5278 1052 -1661 -1750 -3229 -1839 4864 5961 8797 12606
3873A2606M64j2728J054K690m159R279K824l013n62O699l903J585q95j0128n033
$$ 12606 13070 342 1396 4086 -73 9206 12030 9017 8455 15154 11251 12836 11941 1813 -3220
3858c220n883J085L419o48j952l760J609J634l801M853M426L115K208K801j960
$$ -3220 -9103 -8018 -4599 -5247 -7199 -10959 -9350 -7716 -11517 -6664 -2238 877 3085 5886 3926
3843C926k327K695M128o94q28j040l775m203M457k745l135n909j936M651K131
$$ 3926 1599 4294 8422 7728 6900 5860 2085 -2118 2339 -406 -3541 -9450 -11386 -6735 -4604
3828d604j749p296J609Q45O44L904L997K412J317r11O86j482Q97l128l732J854
$$ -4604 -6353 -13649 -12040 -11195 -10551 -6647 -2650 -238 1079 168 854 -628 269 -2859 -6591 -4737
3812d737l923n024M56k531k487K879Q310L476j0043k970P584O474n432K734P331
$$ -4737 -8660 -13684 -13228 -15759 -18246 -15367 -7057 -3581 -13624 -16594 -9010 -2536 -7968 -5234 2097
3797B097l746J059j087L260K685o024r781L192l29m372J6690o05k508p359k415
$$ 2097 -1649 -590 -1677 1583 4268 -1756 -11537 -8345 -8674 -13046 3644 3039 531 -6828 -9243
3782i243j226N419N028J513m503k389J905L580O590R52j331l722o769j971O6j528
$$ -9243 -10469 -5050 -22 1491 -3012 -5401 -3496 84 6674 7626 6295 2573 -4196 -6167 -6101 -7629
3766g629N931N109k63O90p895j3195n435L959Q073N866L282o715K62m462J001
$$ -7629 -1698 3411 3148 3838 -4057 -17252 -22687 -18728 -10655 -4789 -1507 -8222 -7960 -12422 -11421
3751a1421J298l998M167M955R80j0272j564K261N10J981J2757P130K226L664n702
$$ -11421 -10123 -14121 -9954 -4999 -4019 -14291 -15855 -13594 -13084 -11103 1654 8784 11010 14674 8972
3736H972K201K919k853q611k379l470N025K937l961k241j425N988Q13k883K740
$$ 8972 11173 14092 11239 2628 249 -3221 1804 4741 780 -1461 -2886 3102 3915 1032 3772
3721C772Q229j606j0666l588p752J626K372k147l38K913N50m437j302l971j948
$$ 3772 12001 10395 -271 -3859 -11611 -9985 -7613 -9760 -10098 -7185 -6635 -11072 -12374 -16345 -18293
3706a8293M147M562N48J177K314j090L927l178k041J064j858l552J50J751p160
$$ -18293 -14146 -9584 -9036 -7859 -5545 -6635 -2708 -5886 -7927 -6863 -8721 -12273 -12123 -10372 -17532
3691a7532J240P028M656K775K931n264N20O559K909l745J79l83K175j471j154
$$ -17532 -16292 -9264 -4608 -1833 1098 -4166 -3646 2913 5822 2077 2256 1873 4048 2577 1423
3676A423K183q44l971k103N341J165l929M227K233M668k699q892m960K393L529
$$ 1423 3606 2762 -1209 -3312 2029 3194 -735 3492 5725 10393 7694 -1198 -6158 -3765 -236
3661b36L971O549m305k709n445P08m852J837j037p290L821J1459j302n500J584
$$ -236 3735 10284 5979 3270 -2175 -1467 -6319 -4482 -5519 -12809 -8988 2471 1169 -4331 -2747
3646b747Q229N807l159m796L469l731k752l730l213n333l66N715O390N231O91
$$ -2747 5482 11289 8130 3334 6803 3072 320 -3410 -6623 -11956 -12322 -6607 -217 5014 5705
3631E705r142l585r10K50O528J416K652M31k107k638q540K435J303Q20k632n779
$$ 5705 -3437 -7022 -7932 -7682 -1154 262 2914 3345 1238 -1400 -9940 -7505 -6202 -5382 -8014 -13793
3615a3793N898l89N761K371K935K122M06j445p471j856k182L163n636p295l6O382
$$ -13793 -7895 -8284 -2523 -152 2783 4905 5311 3866 -3605 -5461 -7643 -4480 -10116 -17411 -17447 -11065
3599a1065L584k158K717R374j712k930m939k341N885N741J41m744m09O397K81
$$ -11065 -7481 -9639 -6922 2452 740 -2190 -7129 -9470 -3585 2156 2297 -2447 -2856 3541 3822
3584C822p778J02K78j792L034L352r64N777N226q088j1349k452Q757O613N74l056
$$ 3822 -3956 -3854 -3576 -5368 -2334 1018 54 5831 11057 2969 -8380 -10832 -2075 4538 5112 2056
3568B056k346L1J878L450L611k260l770l222m846N127q43L009k453l45K546K718
$$ 2056 -290 -259 1619 5069 8680 6420 2650 -572 -5418 -291 -1134 1875 -578 -923 1623 4341
3552D341k885K853m59O57L800k402l002k969k94p934k379J991Q94l44k601j081
$$ 4341 1456 4309 3850 4507 8307 5905 2903 -66 -360 -8294 -10673 -8682 -7788 -8132 -10733 -11814
3536a1814O159j964p96j971J669M815j29m607K299J171J849k126o583L203K833
$$ -11814 -5655 -7619 -8415 -10386 -8717 -3902 -4031 -8638 -6339 -5168 -3319 -5445 -12028 -8825 -5992
3521e992J8K584j56J621j486L826J91l79K243k024L37l392L9J698k915o942K158
$$ -5992 -5974 -3390 -3546 -1925 -3411 415 606 227 2470 446 783 -2609 -2570 -872 -3787 -10729 -8571
3504h571J2646O126l755j3800n924k33J504N22r89r647J769M793L109n648n728
$$ -8571 4075 10201 6446 -7354 -13278 -13511 -12007 -11485 -12474 -22121 -20352 -15559 -12450 -18098 -23826
3489b3826J2096L876O92L242l805r841M054l022n668k311O556N646L677M350M81
$$ -23826 -11730 -7854 -7162 -3920 -7725 -17566 -13512 -16534 -22202 -24513 -17957 -12311 -8634 -4284 -3803
3474c803J246N3j041m731m942M638N836r57m198n595j341M112J890m540M258L872
$$ -3803 -2557 -2504 -3545 -8276 -13218 -8580 -2744 -3701 -7899 -13494 -14835 -10723 -8833 -13373 -9115 -5243
3458e243k342J901P617K345m329l803l967N588Q522K188o935n118L990j128q314
$$ -5243 -7585 -5684 1933 4278 -51 -3854 -7821 -2233 6289 8477 1542 -3576 414 -714 -9028
3443i028n046N316R496l314J177M192j647l357l9l663L229j717L181K878J59q6
$$ -9028 -14074 -8758 738 -2576 -1399 2793 1146 -2211 -2250 -5913 -2684 -4401 -1220 1658 1817 1731
3427A731l023m435J36J986L717L757J377n305m218J056j981k753m297j163J59
$$ 1731 -1292 -5727 -5591 -3605 112 3869 5246 -59 -4277 -3221 -5202 -7955 -12252 -13415 -13256
3412a3256M980K699N877k474k956L57j07k369O316N67K873J321K391K99k114p689
$$ -13256 -8276 -5577 300 -2174 -5130 -4773 -4880 -7249 -933 -366 2507 3828 6219 6518 4404 -3285
3396c285r3O298j65j131k778p73j215M706J625q974m507O801K671J141p73l114
$$ -3285 -3378 2920 2755 1624 -1154 -1927 -3142 1564 3189 -5785 -10292 -3491 -820 321 -452 -3566
3380c566j915M807O37m288j783r82k132j111K438K304j432q24l755K276L520P111
$$ -3566 -5481 -674 -37 -4325 -6108 -7090 -9222 -10333 -7895 -5591 -7023 -7847 -11602 -9326 -5806 1305
3364A305K29l570l450j97l30j667L447J808p717j022O319j678N31M099M030R58
$$ 1305 1534 -2036 -5486 -5683 -6013 -7680 -4233 -2425 -10142 -11164 -4845 -6523 -5992 -1893 2137 3095
3348C095J626l388K650P95L44K840k638m499K8m381K304J157K878k626l92k758
$$ 3095 4721 1333 3983 4778 5122 7962 5324 825 853 -3528 -1224 -67 2811 185 -207 -2965
3332b965J278O450k004k495n570Q62k642k814J02m025O98L601R894K614r27K208
$$ -2965 -1687 4763 2759 264 -5306 -4444 -7086 -9900 -9798 -13823 -13125 -9524 370 2984 2057 4265
$$ [...]
##END NTUPLES=NMR SPECTRUM
##END=
