##TITLE=Analysis number 327493
Compound Code cc 60516
Book Reference 486/78
Project Code adrs 
Chemist Name craigr
##JCAMPDX= 6.0         $$ Bruker NMR JCAMP-DX V2.0
##DATA TYPE= NMR SPECTRUM
##DATA CLASS= NTUPLES
##ORIGIN= Bruker BioSpin GmbH
##OWNER= nmr
$$ XWIN-NMR		Version 3.5
$$ Tue Mar 27 12:25:48 2007 GMT Daylight Time (UT+1h)  MAYBRIDGE\nmr@NMR_250MHZ
##.OBSERVE FREQUENCY= 250.131544655141
##.OBSERVE NUCLEUS= ^1H
##.ACQUISITION MODE= SIMULTANEOUS (DQD)
##.ACQUISITION SCHEME= undefined
##.AVERAGES= 16
##.DIGITISER RES= 18
##SPECTROMETER/DATA SYSTEM= dpx250
##.PULSE SEQUENCE= zg30
##.SOLVENT NAME= CDCl3
##.SHIFT REFERENCE= (INTERNAL, CDCl3, 0, 16.522)
##AUDIT TRAIL= $$ (NUMBER, WHEN, WHO, WHERE, WHAT)
$$ ##TITLE= Audit trail, XWIN-NMR		Version 3.5
$$ ##JCAMPDX= 5.01
$$ ##ORIGIN= Bruker BioSpin GmbH
$$ ##OWNER= nmr
$$ C:\u/data/dgb/nmr/ADRS/2230/pdata/1/auditp.txt
$$ ##AUDIT TRAIL=  $$ (NUMBER, WHEN, WHO, WHERE, WHAT)
(   1,<2007-03-27 12:25:23.24 +100>,<MAYBRIDGE\nmr>,<NMR_250MHZ>,
      <created by zg, POWCHK disabled, PULCHK disabled
       configuration hash MD5:
       49 4B E0 1D 92 C2 6B 37 9F E6 65 BC 52 41 86 1D
       data hash MD5: 64K
       39 EE 1F 84 C9 72 92 E7 AA 95 A2 76 A0 C3 BC 59>)
(   2,<2007-03-27 12:25:37.97 +100>,<MAYBRIDGE\nmr>,<NMR_250MHZ>,
      <Start of raw data processing
       ef LB = 0.3 FT_mod = 6 PKNL = 1 SI = 32K 
       data hash MD5: 32K
       67 71 1D B4 94 94 88 A5 28 10 AC 16 83 33 25 05>)
(   3,<2007-03-27 12:25:39.61 +100>,<MAYBRIDGE\nmr>,<NMR_250MHZ>,
      <apk 
       data hash MD5: 32K
       89 64 6B C1 0F E6 1C 0A 1B 9C 25 2E BA 8C D1 36>)
(   4,<2007-03-27 12:25:40.38 +100>,<MAYBRIDGE\nmr>,<NMR_250MHZ>,
      <abs ABSG = 5 
       data hash MD5: 32K
       EE 17 49 13 AD 8C 44 C8 65 7E 95 42 2D 4B A0 80>)
$$ ##END=
$$ 
$$ hash MD5
$$ 2E 0F CB D5 07 3D DC 82 95 BB 2B 5A E2 C7 53 8F
##$RELAX= 
##$RELAX= 
##$RELAX= 
##$RELAX= 
##$RELAX= 
##$RELAX= 
##$RELAX= 
$$ Bruker specific parameters
$$ --------------------------
##$DU= <C:\u>
##$EXPNO= 2230
##$NAME= <ADRS>
##$PROCNO= 1
##$TYPE= <nmr>
##$USER= <dgb>
##$AMP= (0..31)
100 100 100 100 100 100 100 100 100 100 100 100 100 100 100 100 100 100 
100 100 100 100 100 100 100 100 100 100 100 100 100 100 
##$AQSEQ= 0
##$AQ_mod= 3
##$AUNM= <au_zg>
##$AUTOPOS= <26 >
##$BF1= 250.13
##$BF2= 250.13
##$BF3= 250.13
##$BF4= 250.13
##$BF5= 500.13
##$BF6= 500.13
##$BF7= 500.13
##$BF8= 500.13
##$BYTORDA= 1
##$CFDGTYP= 0
##$CFRGTYP= 5
##$CHEMSTR= <none>
##$CNST= (0..31)
1 1 145 1 1 1 1 1 1 1 1 1 1 1 1 1 1 1 1 1 1 1 1 1 1 1 1 1 1 1 1 1 
##$CPDPRG= <>
##$CPDPRG1= <>
##$CPDPRG2= <>
##$CPDPRG3= <>
##$CPDPRG4= <mlev>
##$CPDPRG5= <mlev>
##$CPDPRG6= <mlev>
##$CPDPRG7= <mlev>
##$CPDPRG8= <mlev>
##$CPDPRGB= <>
##$CPDPRGT= <>
##$D= (0..31)
0 1 0 0 0 0 0 0 0 0.06 0 0 0 0 0 0 0.0002 0 0 0 0 0 0 0 0 0 0 0 0 0 0 
0 
##$DATE= 1174994722
##$DBL= (0..7)
120 120 120 120 120 120 120 120 
##$DBP= (0..7)
150 150 150 150 150 150 150 150 
##$DBP07= 0
##$DBPNAM0= <>
##$DBPNAM1= <>
$$ [...]
##$SUBNAM7= <"">
##$SUBNAM8= <"">
##$SUBNAM9= <"">
##$SW= 20.6930455092707
##$SWIBOX= (0..15)
0 0 3 0 0 0 0 0 0 0 0 0 0 0 0 0 
##$SW_h= 5175.983436853
##$TD= 65536
##$TD0= 1
##$TE= 683.16
##$TE2= 300
##$TE3= 300
##$TEG= 300
##$TL= (0..7)
0 120 120 120 120 120 120 120 
##$TP= (0..7)
150 150 150 150 150 150 150 150 
##$TP07= 0
##$TPNAME0= <>
##$TPNAME1= <>
##$TPNAME2= <>
##$TPNAME3= <>
##$TPNAME4= <>
##$TPNAME5= <>
##$TPNAME6= <>
##$TPNAME7= <>
##$TPOAL= (0..7)
0.5 0.5 0.5 0.5 0.5 0.5 0.5 0.5 
##$TPOFFS= (0..7)
0 0 0 0 0 0 0 0 
##$TUNHIN= 0
##$TUNHOUT= 0
##$TUNXOUT= 0
##$USERA1= <user>
##$USERA2= <user>
##$USERA3= <user>
##$USERA4= <user>
##$USERA5= <user>
##$V9= 5
##$VALIST= <valist>
##$VCLIST= <CCCCCCCCCCCCCCC>
##$VD= 0
##$VDLIST= <DDDDDDDDDDDDDDD>
##$VPLIST= <PPPPPPPPPPPPPPP>
##$VTLIST= <TTTTTTTTTTTTTTT>
##$WBST= 1024
##$WBSW= 4
##$XGAIN= (0..3)
0 0 0 0 
##$XL= 0
##$YL= 0
##$YMAX_a= 287761
##$YMIN_a= -401428
##$ZGOPTNS= <>
##$ZL1= 120
##$ZL2= 120
##$ZL3= 120
##$ZL4= 120
##$ABSF1= 16.522
##$ABSF2= -4.171173
##$ABSG= 5
##$ABSL= 3
##$ALPHA= 0
##$AQORDER= 0
##$ASSFAC= 0
##$ASSFACI= 0
##$ASSFACX= 0
##$ASSWID= 0
##$AUNMP= <proc_1d>
##$AZFE= 0.1
##$AZFW= 0.1
##$BCFW= 0
##$BC_mod= 0
##$BYTORDP= 0
##$COROFFS= 0
##$CY= 12.5
##$DATMOD= 1
##$DC= 0
##$DFILT= <>
##$DTYPP= 0
##$F1P= 14.0000005364418
##$F2P= -0.99999901652339
##$FCOR= 0.5
##$FTSIZE= 32768
##$FT_mod= 6
##$GAMMA= 0
##$GB= 0
##$INTBC= 1
##$INTSCL= 1
##$ISEN= 128
##$LB= 0.3
##$LEV0= 0
##$LPBIN= 0
##$MAXI= 10000
##$MC2= 0
##$MEAN= 0
##$ME_mod= 0
##$MI= 0
##$NCOEF= 0
##$NC_proc= -3
##$NLEV= 6
##$NOISF1= 0
##$NOISF2= 0
##$NSP= 0
##$NTH_PI= 0
##$NZP= 0
##$OFFSET= 16.522
##$PC= 1
##$PHC0= 229.3153
##$PHC1= 8.98255
##$PH_mod= 1
##$PKNL= yes
##$PPARMOD= 0
##$PSCAL= 4
##$PSIGN= 0
##$REVERSE= no
##$SF= 250.13
##$SI= 32768
##$SIGF1= 0
##$SIGF2= 0
##$SINO= 400
##$SIOLD= 32768
##$SREGLST= <1H.CDCl3>
##$SSB= 0
##$STSI= 32768
##$STSR= 0
##$SW_p= 5175.98343685301
##$SYMM= 0
##$S_DEV= 0
##$TDeff= 65536
##$TDoff= 0
##$TI= <Analysis number 999999
Compound Code 99
Book Reference 9
Project Code 9>
##$TILT= no
##$TM1= 0
##$TM2= 0
##$TOPLEV= 0
##$USERP1= <user>
##$USERP2= <user>
##$USERP3= <user>
##$USERP4= <user>
##$USERP5= <user>
##$WDW= 1
##$XDIM= 32768
##$YMAX_p= 569786019
##$YMIN_p= -139612
$$ End of Bruker specific parameters
$$ ---------------------------------
##NTUPLES= NMR SPECTRUM
##VAR_NAME=  FREQUENCY,     SPECTRUM/REAL,   SPECTRUM/IMAG
##SYMBOL=    X,             R,               I
##VAR_TYPE=  INDEPENDENT,   DEPENDENT,       DEPENDENT
##VAR_FORM=  AFFN,          ASDF,            ASDF
##VAR_DIM=   32768,         32768,           32768
##UNITS=     HZ,            ARBITRARY UNITS, ARBITRARY UNITS
##FACTOR=    0.157963299565203, 1,           1
##FIRST=     4132.6476996994, 0,             0
##LAST=      -1043.33573715361, 0,           0
##MIN=       -1043.33573715361, -139612,     0
##MAX=       4132.6476996994, 569786019,     0
$$ Real data points
##PAGE= N=1
##DATA TABLE= (X++(R..R)), XYDATA
$$ [...]
18665A6485832M344744K335301l425457n339505m419047k841682j707993j006571
18657D425622o89651n08304l50242k39914j33522r42L9409P3330O6688R617j5643
18646B676448j31382j65306r9859M1592J40916K20887K97384M41280N49754P57450
18636D729164J167573J877590K968221L968033K266744q78639j715367p77234
18628A3606085Q25456K952784O038805J0709713J3150912O677896n683307j2728458
18620C5549886j1339250p480765m194784k094175n32734Q36738N50078j560011
18612I734983k313294j907454j248741p74184m81671l62835k39144j49126j18056
18603B140478m4268k0006m1447J9315O0446M1535p844K2593L5118K6382l5686
$$ plain form
18665 16485832 20830576 23165877 19740420 14400915 9981868 7140186 5432193 4425622
18657 4425622 3735971 3227667 2877425 2637511 2503989 2503047 2542456 2615786 2682474 2692091 2676448
18646 2676448 2545066 2379760 2279901 2321493 2462409 2683296 2980680 3421960 3971714 4729164
18636 4729164 5896737 7774327 10742548 14710581 16977325 16098686 14383319 13606085
18628 13606085 14431541 17384325 23423130 34132843 47283755 53961651 48278344 35549886
18620 35549886 24210636 16729871 12535087 10440912 9908178 10744916 11294994 9734983
18612 9734983 7421689 5514235 4265494 3491310 3009639 2646804 2407660 2258534 2140478
18603 2140478 2096210 2076204 2034757 2054072 2114518 2156053 2148209 2170802 2205920 2232302 2196616
18592B196616l5421N1043J48676K60179L34323M01958N94245R71835J606869J578022
18582H108345K20136q63216r10219m53360J64518Q11062J563728K854710M691320
18573A6187024L885228j543332m039440l499700k136796r60393k50747K78000
18565G919844P35336J176205J675241K476539L610998N367547Q295410J2683769
18557D3940889J7003511J4234192N22510j1999215j4941765j1775581p152335
18550B9832206l388411m85793K256270N596429J0075791J5027414J4924842L195575
18542G7034323j1178871j6544981j4573989j0283822o670392m364326k949923
18535A0468019k061965j462018j036218p77714n68185l97446l23362l02214l24821
$$ plain form
18592 2196616 2161195 2212238 2360914 2621093 2955416 3357374 3951619 4923454 6530323 8108345
18582 8108345 8328481 7465265 6555046 6101686 6266204 7077266 8640994 11495704 16187024
18573 16187024 20072252 18528920 14489480 10989780 8852984 7892591 7641844 7919844
18565 7919844 8655180 9831385 11506626 13983165 17594163 22961710 31257120 43940889
18557 43940889 60944400 75178592 75701102 63701887 48760122 36984541 29832206
18550 29832206 26443795 25958002 28214272 33810701 43886492 58913906 73838748 77034323
18542 77034323 65855452 49310471 34736482 24452660 17782268 13417942 10468019
18535 10468019 8406054 6944036 5907818 5130104 4561919 4164473 3841111 3538897 3214076
18526C214076l50151k90279j74574j10692n2585r2081j54594j46860j13333r0628
18516A638299p4930q2622n0654r5101m3907J0948M1231j7016p3182o2429m5634
18505A145003m6587l7012k4995k6009m9093m7606q918q1307j01233j03138l5849
18494E83256j9545l8676n0440n2378k2530m4079m7814R709K9807O079j1167k1536
18482C20686l736k6147o8681l2095K4753J9358J0249j0612O367o775m509m670
18470B24188K1049K4364j0006j5937j7798m607j4976K6690L4010R971n396k8004
18458B43548K8418M6971L6947O7510J4791k0917r565L5816K3274n5148j05556
18447C06089k5826m1320n1540K610j2880l4228k9910j264J0771J0100j5226Q254
$$ plain form
18526 3214076 2863925 2573646 2399072 2288380 2235795 2143714 1989120 1842260 1728927 1638299
18516 1638299 1563369 1480747 1430093 1334992 1291085 1302033 1343264 1326248 1253066 1190637 1145003
18505 1145003 1098416 1061404 1036409 1010400 961307 913701 904783 823476 722243 619105 583256
18494 583256 563711 525035 474595 422217 399687 355608 307794 317503 347310 353389 342222 320686
18482 320686 316950 290803 222122 190027 214780 234138 244387 233775 240142 233367 228858 224188
18470 224188 245237 269601 259595 243658 225860 221253 206277 232967 266977 276948 271552 243548
18458 243548 271966 318937 355884 423394 438185 417268 407703 443519 466793 411645 306089
18447 306089 280263 238943 187403 190013 177133 142905 112995 111731 122502 132602 117376 125630
18435A25630j3611N8733M1694l478m379r741J5685L5285J4172l2019m4385k683
18423A80903R557K2932j3882j9220k2683k2033k1321l9018m628K5446k1032K9490
18411A04511N4990J0226k5000r520N086K9172K105q559j3463L2435J8225j3641
18399A86567n9617n3334k600O985J494n767k1928j7856N758K4001L4185n371j691
18386I0826p529M496j6902j0595L432l5811j0285J8082K8109o377p514J696J0013
18373F1641L02J7668J6093m422K1074n580l6939O7437K6376J5656O5208N6391
18361C00905M8661O2412J299m1386j6683o8494p9573k1961K964p415j4810K061
18349A67980J6009K2125M9344P7532M5910K0659l4968l1932r1186o8558l0349
$$ plain form
18435 125630 112019 170752 212446 208968 204589 194848 210533 245818 259990 227971 183586 180903
18423 180903 190460 213392 199510 180290 157607 135574 114253 75235 70607 96053 75021 104511
18411 104511 159501 169727 144727 135207 140293 169465 171570 163011 149548 181983 200208 186567
18399 186567 126950 73616 71016 78001 79495 73728 51800 33944 39702 63703 97888 92517 90826
18386 90826 83297 87793 70891 60296 63728 27917 17632 35714 63823 57446 49932 51628 61641
18373 61641 61943 79611 95704 91282 112356 106776 69837 137274 163650 179306 244514 300905
18361 300905 349566 411978 413277 371891 355208 286714 207141 185180 188144 180729 165919 167980
18349 167980 183989 206114 255458 332990 378900 399559 364591 332659 241473 172915 142566
18338A42566l364k6881j7805l1242n604R39M06j3379o230r732L064J9087M247
18325E6072j1552K545J0192J3639P513J7450L2291K7311K9590K1339R797J0316
18313B26503J0091J2581r250k635L4219M2121L5834M8728O1296Q718n9951J4551
18301D22806K1618L3165L430L2447p825o7230k8484m9760m3523k7705j1754k7266
18289B49919j4897n660k0791n1690n4737j9447J1885k570K7915m726j7154o835
18277I1212N532j2024j9104j1513l310P896L5811K9352L1410o443r248j5407J4093
18264A38257M7950L4561K9031J9171k424m868n2345m7403J5615M1711L6764Q6884
18252C42904J03532M8672o9469p2490m5184n1904l5932N803L1249O9925L2430
$$ plain form
18338 142566 139202 112321 94516 63274 57670 58609 59015 45636 39406 29674 32738 51825 56072
18325 56072 44520 47065 57257 70896 78409 95859 128150 155461 185051 206390 216187 226503
18313 226503 236594 249175 239925 237290 271509 313630 349464 398192 459488 468206 408255 422806
18301 422806 444424 477589 481019 513466 505641 438411 409927 360167 316644 288939 277185 249919
18289 249919 235022 229362 208571 156881 102144 82697 94582 92012 119927 115201 98047 91212
18277 91212 96744 84720 65616 54103 50793 58689 94500 123852 155262 148819 139571 124164 138257
18264 138257 186207 220768 249799 268970 266546 261678 209333 161930 177545 219256 256020 342904
18252 342904 446436 495108 425639 353149 307965 256061 220129 225932 257181 327106 359536
18241C59536m3345n7889o8641p2641l9860k0873Q127o176J012K0674m5710k6860
18229G354P681n724K252L1371j6167j5446K0292J326J0368m756J5997K7475J3939
18216I5962j4957l1419K762N1218J1568K1017k3889k8353P832K0074l09k636P110
18203A15980l052k5510o539P184k5477P938O544J2229L5865J592L507n848j7694
18190A06719j0973k4756n719N119k0863J396J3236k9297q932j73l569K7376L0811
18177H0375J2229J0275l4233L62J5560p380r462R998P828L9839K9620j4138j5053
18164A25820O038j4756j8734J4582K4808M6733M3227J0404l4899k0188K8340l210
18152B08165j0264J7738l111R806k973k956J0537j0159l11M733l702O450J5798
$$ plain form
18241 359536 316191 258302 189661 117020 77160 56287 64414 58238 59250 79924 34214 7354
18229 7354 15035 9311 11563 42934 26767 11321 31613 32939 43307 38551 54548 82023 95962
18216 95962 81005 49586 52348 103566 115134 136151 112262 83909 91741 111815 111506 108870 115980
18203 115980 112928 87418 80879 88063 62586 70524 77068 89297 125162 126754 130261 124413 106719
18190 106719 95746 70990 65271 70390 49527 50923 64159 34862 25930 25757 22188 49564 80375
18177 80375 92604 102879 68646 69008 84568 77188 67726 77724 85552 125391 155011 140873 125820
18164 125820 131858 117102 98368 112950 137758 184491 227718 238122 203223 183035 211375 208165
18152 208165 197901 215639 212528 222334 219361 216405 226942 216783 216472 221205 217503 223953 239751
18139B39751l5746j3274N1163N3477J0150L5875O3410L1149L4767P3298P0983
18128F15003M0566R5762P7949N4109R8892J44571J72496K24154L23430L94023
18118B240955N01637O48681Q48770J114095J523883K272377L628764O301029J1613745
18109C0693936K2172114K4483691n492251k2067695j9311636j2279336o427276
18102A1771547l559663k192057j468963r82727o64495n25742l88924k78351k26627
18093A483998j58814j69974j32163j48656j24260n3923n4595m0223n7813n5340
18083D88237n0777l2036l7828k8857k6048m5890l0246J4691j6677j8200J0532
18072B26901j9354k8635k8307l7847k3309P458M096L1566L471J4497L0865k469
$$ plain form
18139 239751 204005 190731 241894 295371 305521 341396 404806 435955 470722 544020 615003
18128 615003 655569 751331 829280 883389 982281 1126852 1299348 1523502 1846932 2240955
18118 2240955 2742592 3391273 4240043 5354138 6878021 9150398 12779162 19080191 30693936
18109 30693936 52866050 77349741 71857490 49789795 30478159 18198823 11771547
18102 11771547 8211884 6019827 4550864 3568137 2903642 2377900 1988976 1710625 1483998
18093 1483998 1325184 1155210 1023047 874391 750131 696208 641613 601390 543577 488237
18083 488237 437460 405424 367596 338739 312691 266801 236555 251246 234569 216369 226901
18072 226901 207547 178912 150605 112758 89449 96907 101003 132569 136040 150537 181402 178933
18060A78933J0227r991l8012j9199L1509M2277m4252k8532k7090l9889j9068k173
18048C4740l2569j1819K3579M1148m407k8959J688l3472l4994k828J8111M1622
18036A1840R152j1893l4148J4731K1244L7642j7562m6200j735r150K6268M8302
18024D8491k434k0852K917J4940j0795j746m8156j9828j8117R192L9470q683r081
18011b4682M0148K9290l5584n2986J661J8136N3521M0781J9585l681j7661j8797
17999D9731l0481J165J3409p696o763Q210J532l1465j6041N352K2208J0074J7178
17986C6413j4746k061j941N156j284L6905K9268K53o828k9050k4495L1790l9423
17973A9957k8905O471J0326M4239K6961Q792L3079L8380P6913J24690O5340l3531
$$ plain form
18060 178933 189160 179169 141157 121958 153467 195744 151492 122960 95870 55981 36913 34740
18048 34740 2171 -9648 13931 55079 50672 21713 23401 -10071 -45065 -47893 -29782 11840
18036 11840 20992 9099 -25049 -10318 10926 48568 31006 -15194 -16929 -26079 189 48491
18024 48491 46057 25205 28122 43062 32267 30521 -17635 -37463 -55580 -46388 -6918 -15601 -24682
18011 -24682 15466 44756 9172 -43814 -42153 -24017 29504 70285 89870 86189 68528 49731
17999 49731 19250 20415 33824 26128 19365 27575 29107 -2358 -18399 -13047 9161 19235 36413
17986 36413 21667 19606 17665 22821 21537 58442 87710 87963 81135 52085 27590 59380 19957
17973 19957 -8948 -2477 7849 52088 79049 87841 120920 159300 236213 360903 426243 392712
17961C92712p6875o9184n8807l8607q28J9918L2933L1760K8365O7494O5978j5659
17949C79200p1779q9962m7853l5537m9558l7317k7847O606L781m023m571l3249
17937a2109k6618k5120K6993L7880L0722k1864m1392k3155p469L3253K3303K7872
17925B2296K6110J7120k588j4108q764K8289M822k9963j0252o263L474k1825l3750
17912b5402j3969r093K5956L3481j4222o712L913K1685J0534o135k2553k1953
17900b4470o125L7162R063R657p17q364n1888L954L7346l863q592k7614p364n464
17886d7279P552K065J5J0563K4766K5378l741k940k552j0277J4178k3002l7024
17873d2298M8458L3818q088k9071j4359j6594l2524k7150p489P842M1899J8917
$$ plain form
17961 392712 315837 246653 187846 149239 148411 168329 201262 233022 261387 328881 394859 379200
17949 379200 307421 217459 169606 134069 84511 47194 19347 25953 29734 25711 21140 -12109
17937 -12109 -38727 -63847 -36854 1026 31748 9884 -31508 -54663 -62132 -28879 -5576 22296
17925 22296 48406 65526 62938 48830 40066 68355 73177 43214 32962 26699 30173 8348 -25402
17912 -25402 -39371 -48464 -22508 10973 -3249 -9961 -6048 15637 26171 20036 -2517 -24470
17900 -24470 -30595 6567 15630 25287 24570 16206 -35682 -31728 5618 1755 -6837 -34451 -41815 -47279
17886 -47279 -39727 -37662 -37647 -27084 -2318 23060 19319 16379 13827 3550 17728 -5274 -42298
17873 -42298 6160 39978 31890 2819 -11540 -28134 -60658 -87808 -95297 -87455 -45556 -26639
17861b6639l291l4786K0433L2803R488k0092P245k392j4558J479N761J4827K0876
17848A1154k4271j6809j9523l659N4853L6129k1044j1749j3003k0050k0817l019
17836e1808K6914P558J7875R202j876p604q826K2002J2128L937q493j1009j0884
17823h84p947K917J4126n719J3916K638j4779J7992q472n06K2547J503J3078j5050
17809C5360l1111k7084K7684L3740k5014l9839n622K1084J2380k789M526l1843
17797b8528O471O164j8802K420R003l05r547M422J2540j7954P962m7562j0027
17784h3743M6654k973P274J9992r709M898R501j7303j3513L2877P695J1246m063
17771H833J4968j153q29L3610k8660l1575q798L7568l0391l4703J0204k463R721
$$ plain form
17861 -26639 -29930 -64716 -44283 -11480 -1992 -22084 -14839 -17231 -31789 -30310 -24549 -9722 11154
17848 11154 -13117 -29926 -49449 -53108 1745 37874 16830 5081 -7922 -27972 -48789 -51808
17836 -51808 -24894 -17336 539 9741 7865 261 -8565 13437 25565 29502 21009 10000 -884
17823 -884 -8831 -5914 8212 2493 16409 19047 4268 22260 13788 13282 35829 37332 50410 35360
17809 35360 4249 -22835 4849 38589 13575 -26264 -31886 -10802 1578 -1211 3315 -28528
17797 -28528 -22057 -15893 -34695 -32275 -23272 -23577 -33124 -28702 -16162 -34116 -26154 -73716 -83743
17784 -83743 -37089 -40062 -32788 -12796 -22505 -17607 -8106 -25409 -38922 -6045 1650 12896 8833
17771 8833 23801 22648 21819 55429 26769 -4806 -13604 23964 -6427 -41130 -30926 -33389 -23668
17758b3668K248M091L5376J8169M596m258l3021l3474J8719m0864l9081K559J6273
17745g2335P06L4366J4653M619p318j1463J497L8393k6442l0975J3628J7575L6294
17732A3198o060r766o334l415J2926p400L198j1403k7242r028M7792M1706k1096
17719A7076k9043Q522L5323k0780j3225l9279L2974L9125j922j1044j6915m4006
17707d3194l3501J2676K891L1828R707k915r48q990P194J9510j023l7977j8187
17694f2929J5487J2414k7362j3286m388M3560J4129j2070k7997J6375J3041l009
17682c6035k8540k4936K8050M3695K5162N14j9542j0230n702j1573K2866L028
17670a3243j015k237j9174M544l2686K8789K042k4513K1993k583O169O442j107
$$ plain form
17758 -23668 -21420 -17329 18047 36216 40812 36554 3533 -29941 -11222 -52086 -91167 -88608 -72335
17745 -72335 -71629 -37263 -22610 -17991 -25309 -36772 -35275 3118 -23324 -54299 -40671 -23096 13198
17732 13198 7138 -2628 -8962 -12377 549 -6851 -3653 -15056 -42298 -51326 -3534 38172 17076
17719 17076 -11967 -3445 31878 11098 -2127 -41406 -8432 30693 28771 17727 812 -43194
17707 -43194 -76695 -64019 -61128 -29300 -19593 -22508 -23456 -32446 -25252 -5742 -6765 -44742 -62929
17694 -62929 -47442 -35028 -62390 -75676 -80064 -36504 -22375 -34445 -62442 -46067 -33026 -36035
17682 -36035 -64575 -89511 -61461 -17766 7396 7910 -11632 -21862 -27564 -39137 -16271 -13243
17670 -13243 -14258 -16495 -35669 -31125 -63811 -35022 -32980 -57493 -35500 -38083 -31914 -25472 -26579
17657b6579l953l3359J2086J9982Q514k3864k7688K0285K7041J4773k0452L420
17645b9794j1196K0481k3935J9288J6844k946K9742l4835j2946K4982j0061k7221
17633d1597P843j2457m97J1961J6186J7475o147j2814n303q364M371k886P251
17620b4978J7658K936k4401r449m592L1013L1187J4733L335p857J8734R409q875
17607D8853P403K448l6873k1859L072m5253J1889L9422j6343j7794K0213J3763
17595H941L8932J4074K398k1391n9865j7190k884M4622K0061L72k084n13m3588
17582a8115J808j6565n9014j358K6345J9943O457L3543P614k9841J5733L580k1567
17569c1437m407J3507m16r029k2745j3567K3399L1796k4297k902R815j4076J5277
$$ plain form
17657 -26579 -30532 -63891 -51805 -31823 -23309 -47173 -74861 -54576 -27535 -12762 -33214 -29794
17645 -29794 -40990 -20509 -44444 -25156 -8312 -11258 18484 -16351 -29297 -4315 -14376 -41597
17633 -41597 -33754 -46211 -46708 -34747 -18561 -1086 -7233 -20047 -25350 -33714 -29343 -32229 -24978
17620 -24978 -7320 -4384 -28785 -38234 -42826 -11813 19374 34107 37442 29585 48319 57728 48853
17607 48853 56256 58704 21831 -28 3044 -42209 -30320 9102 -7241 -25035 -4822 8941
17595 8941 47873 61947 64345 42954 -16911 -34101 -36985 7637 27698 28070 25986 25473 -18115
17582 -18115 -16307 -32872 -91886 -93244 -66899 -46956 -40499 -6956 658 -29183 -13450 -9870 -31437
17569 -31437 -35844 -22337 -22753 -31782 -54527 -68094 -44695 -12899 -37196 -40098 -30283 -44359 -29082
17556b9082K5695j8571J1493L8147p221k2950k052O769M272L811j846j2597j4752
17543a8884L677n3262j8442L6941K1311L8753k7441m2539l4980k426N1720K8538
17531a7034P79M099k7523J1755r384l7303J2494J4653j7972o24L7616L6334j5448
17518g558K2477K0431m1430k7441n897K5065j4364k0777Q025L075M084J4099o100
17505b6311j5807M4101L1452j6229k7284l5297J5814n065J1705K3067K3222J2259
17493C5627O668k2230J7193j1200r300J415p581k3725j8566o370L0354j8780m1541
17480f8036r744M1280M4591j7695l3402k8199K195j672k603J2587J3075K9044
17468a8579m131j9327k7758L811K7036K1315o433q660K2214J4645k4617j8912
$$ plain form
17556 -29082 -3387 -21958 -10465 27682 20461 -2489 -4541 2228 6500 10311 8465 -4132 -18884
17543 -18884 -15207 -68469 -86911 -49970 -28659 10094 -17347 -59886 -94866 -97292 -45572 -17034
17531 -17034 -16255 -12156 -39679 -27924 -37308 -74611 -62117 -47464 -65436 -66060 -28444 7890 -7558
17518 -7558 14919 35350 -6080 -33521 -39418 -14353 -28717 -49494 -41469 -38394 -34310 -20211 -26311
17505 -26311 -42118 1983 33435 17206 -10078 -45375 -29561 -34626 -22921 146 23368 35627
17493 35627 42295 20065 37258 26058 16758 18173 10592 -13133 -31699 -38069 -7715 -26495 -68036
17480 -68036 -77780 -36500 8091 -9604 -43006 -71205 -69010 -70682 -73285 -60698 -47623 -18579
17468 -18579 -22710 -42037 -69795 -65984 -38948 -17633 -24066 -32726 -10512 4133 -20484 -39396
17456c9396j7960K1477k5486j5806M3118K8211Q274j1261r44R24J3517N5909O9977
17443A30554J11518J47915L2479j54326j40599n0457j3078j8053m5292k941J0364
17432H084O724L559p837M468k0085j522q149j6440L1036r613K2438P562j8905
17419A320R98Q993j6004n1899k1342k5690J1513P0914J9362k913Q272k363k5596
17406b4435J2995J9583K433J3390K0746o5506l7485L0168L1991N642p589q128
17394f195L164k8334K7618M1874l2001j4581J5989j6643q772j3737M467l453j2871
17381d3475j9650j4288p110J2917K1212K976L9838r790o805N166J2813N87K4863
17368A9254j7489k0693j0383J4098j385j344J0851q352R1Q104J4229J5942p522
$$ plain form
17456 -39396 -57356 -35879 -61365 -77171 -34053 -5842 2432 -8829 -9773 -8849 4668 60577 130554
17443 130554 242072 389987 422466 268140 127541 77084 64006 45953 661 -2280 8084
17432 8084 14808 18367 10530 14998 -5087 -6609 -14758 -31198 -162 -9775 12663 20225 1320
17419 1320 2318 11311 -4693 -56592 -77934 -103624 -92111 -21197 -1835 -4748 3524 1161 -24435
17406 -24435 -11440 8143 10576 23966 44712 -20794 -58279 -28111 3880 9522 1933 -6195
17394 -6195 -3031 -31365 -3747 38127 6126 -8455 7534 -9109 -17881 -31618 -27151 -30604 -43475
17381 -43475 -63125 -77413 -84523 -71606 -50394 -47418 -7580 -17370 -24175 -19009 -6196 -5609 19254
17368 19254 1765 -18928 -29311 -15213 -16598 -17942 -7091 -15443 -15352 -7248 6981 22923 15401
17355A5401K9810J1360m0071J43j3066j2133m9097O358L2548n941p287j3967J7745
17342b8197j1493J3892N2449L0822j3525J1240M54k2297k0395k9471n22M975L807
17329h261M537j2656R296L3005N414o7405k8250L157K8068p70J8735R611P8K2400
17315A6959J3083K1840q766j4232n4105P402q511o204m283N495J3258K928L3658
17302A8522M69J082l5487R648L2411k1331m4575J156K4764n790R268M081p409
17289a3191k6437O589K3297Q281m0034K33K6271R818j920J9273q811j2882L3334
17276B3821J8350m9482n2753k452K7634L7532j9759k217j767j740r298J1724J7208
17263c199L6176J1494l4692L366m136J185k4905J959l340K3299J8542j9248L200
$$ plain form
17355 15401 45211 56571 16500 16643 3577 -8556 -57653 -51295 -18747 -24688 -31975 -45942 -28197
17342 -28197 -39690 -25798 26651 57473 43948 55188 55642 33345 12950 -16521 -17043 -12068 -8261
17329 -8261 -3724 -16380 -7084 25921 31335 -36070 -64320 -61163 -33095 -33865 -15130 -5519 -5441 16959
17315 16959 30042 51882 43116 28884 -25221 -17819 -26330 -32534 -36817 -31322 -18064 -15136 18522
17302 18522 18991 20073 -15414 -5766 26645 5314 -39261 -38105 -13341 -19131 -9863 -5782 -13191
17289 -13191 -39628 -33039 -9742 -1461 -41495 -41262 -14991 -5173 -7093 12180 3369 -9513 23821
17276 23821 42171 -7311 -60064 -62516 -34882 2650 -17109 -19326 -21093 -22833 -32131 -20407 -3199
17263 -3199 32977 44471 9779 13145 9009 10194 -14711 -12752 -16092 7207 25749 6501 9701
17250I701K7590L7006m9087k5788M8824N8962j0289o961J6039N8797O8303P9499
17238C12596P2108J4100n7289j39398o5201j9406J0200Q794M3951K3161N5680
17227B59296J07964R7120N015p3206j33327j06477l2343k6144m5807r560L220
17216D5751K2010K5788l5952l0293j7293M179J106k402Q022L4780l6429K496J6484
17203C8247M0824k206l4745j8253L387l4987m6476j4400k496K2782K3596M094
17191b0633k0612m992K2031J6201k1309K6351M4890K3548M3728L9916J161j2814
17179A37466l9390j00m2594k0860k2261j7507J7079n401l7642m822K4770L3676
17167B2414N7902R872K599N872j0860j1616n1490l4000K8867j2726j3500L5591
$$ plain form
17250 9701 37291 74297 25210 -578 48246 107208 96919 89958 105997 164794 233097 312596
17238 312596 384704 398804 341515 202117 136916 117510 127710 136504 180455 203616 259296
17227 259296 367260 464380 469395 396189 262862 156385 124042 97898 52091 42531 45751
17216 45751 67761 93549 57597 27304 10011 14190 15296 12894 20916 55696 19267 21763 38247
17203 38247 79071 76865 42120 23867 27254 -7733 -54209 -68609 -71105 -48323 -24727 -20633
17191 -20633 -41245 -46237 -24206 -8005 -29314 -2963 41927 65475 109203 149119 150280 137466
17179 137466 98076 97976 55382 34522 12261 -5246 11833 6432 -31210 -36032 -11262 22414
17167 22414 80316 90188 92787 98659 87799 76183 24693 -9307 19560 6834 -6666 28925
17155B8925O561l1160j5986k3783l5312K5407J6581o702n271r329l7779K1246
17143f6602J8307n07o815j1427p363k727K0994O84L2852J0654l3167N991L2903
17130f223m5558p2727L0492J8589K2317J6938l645J6197N2011K7555o877m1903
17118G166j2503K0275j958j5338n046k7436J8152P141k9152n165N0669K3243Q699
17105C8747j8137k3624r432Q204J7992p433j1274K1661M5266J1454m1110k3137
17093I177L5786K9844m074k2907m1667j5246k4507k1394L6146K0293j0032K2815
17081A4234M190k3507j8160K0439J5702q581L3719P948o384J2637L2817j9350
17069F5704J452k7337l9089k9221j1522N418O855j4325n07j5423l77J6500K7868
$$ plain form
17155 28925 35486 4326 -11660 -35443 -70755 -45348 -28767 -35469 -40740 -50069 -87848 -66602
17143 -66602 -48295 -48802 -55617 -67044 -74407 -77134 -56140 -55456 -22604 -11950 -45117 -39126 -6223
17130 -6223 -51781 -124508 -94016 -75427 -53110 -36172 -39817 -23620 28391 55946 49069 7166
17118 7166 -5337 14938 12980 -2358 -7404 -34840 -16688 -9547 -38699 -43864 6805 30048 38747
17105 38747 20610 -3014 -12446 -4242 13750 6317 -4957 16704 61970 73424 32314 9177
17093 9177 44963 74807 70733 47826 6159 -9087 -33594 -54988 -18842 1451 -8581 14234
17081 14234 18424 -5083 -23243 -2804 12898 4317 38036 45984 39600 52237 85054 65704
17069 65704 67156 39819 730 -28491 -40013 -34595 -27740 -42065 -42572 -57995 -58372 -41872 -14004
17056a4004J6758p582j0500K3606M1848k772J5771q58l091n808l6729j0657J609
17043G591J8108j3590m5752K8641J5673j51N994j2054J4210j3170N462O071J652
17030A8685J6439l278m27J0059K3072l5965o326M576j0234j8491n975J4228K5677
17017C2040J0432j7505j9546O322J9316k0176j4058J6663q798K4664L3892K5819
17005H9065L8127M8703P6428J15751O2110l5777j04700q9375l5170K638k1590
16994A46210k7714l7765k7951n994L1785N6732J11277J15651R4599m8103j15869
16983B92858j16281o8663k4950n1349k9801K624J693k4071p853K2702K0704j3974
16971C639J6058k594K642J3364p223O823L506K089P973k6690j6431j8817j9847
$$ plain form
17056 -14004 2754 -4828 -15328 8278 50126 47354 63125 62267 59176 53368 16639 5982 7591
17043 7591 25699 12109 -33643 -5002 10671 10520 16514 4460 18670 5500 10962 17033 18685
17030 18685 35124 31846 31419 41478 64550 28585 22259 26835 16601 -1890 -7865 6363 32040
17017 32040 42472 24967 5421 11743 31059 10883 -3175 13488 4690 29354 63246 89065
17005 89065 127192 175895 252323 368074 430184 394407 289707 200332 165162 167800 146210
16994 146210 118496 80731 52780 46786 78571 135303 246580 362231 456830 408727 292858
16983 292858 176577 107914 82964 31615 1814 4438 6131 -17940 -25793 -3091 17613 3639
16971 3639 19697 17103 19745 33109 25886 32709 36215 38304 46277 19587 3156 -15661 -35508
16958c5508R332L3271K19m1686k4774j9788j61J2020J7961L6859O0046K4741m0154
16945C2378R834Q890q460j3198k7535L0540L0604R29l0592J5614j3719o111P037
16932C6211o95j1678j7553K9660M4148o736l7816l0729o662J0907J2469R20J4067
16919C6513K1659k4557p6524j2980N5532J5430M861n922L3679k8333j5695J7194
16907B0857O384J0627l3314k3072J0694k1647l0787L1608K2559k2754M89J7742
16895a0614J3043k6394J6862j5409k3233P134Q791L2081R066j1202o870J1292
16883D547J2408K2043j9697K434J3520l0106k5960M437m4877k9794J9626J7505
16871e3914K8622Q456K9129Q842l4110p880K3914J811L2730p081l259k0424l3613
$$ plain form
16958 -35508 -26176 7095 7314 -34372 -59146 -78934 -79095 -67075 -49114 -12255 47791 72532 32378
16945 32378 42212 51102 42642 29444 1909 32449 63053 63982 33390 49004 35285 29174 36211
16932 36211 35516 23838 6285 35945 80093 73357 35541 4812 -1850 9057 21526 22446 36513
16919 36513 58172 33615 -42909 -55889 -357 15073 19934 14012 47691 19358 3663 20857
16907 20857 27241 37868 4554 -18518 -7824 -29471 -60258 -28650 -6091 -28845 -28356 -10614
16895 -10614 2429 -23965 -7103 -22512 -45745 -38611 -29820 2261 11327 125 -6745 4547
16883 4547 16955 38998 19301 21735 35255 5149 -20811 -16374 -61251 -91045 -71419 -53914
16871 -53914 -25292 -16836 12293 21135 -12975 -20855 3059 4870 37600 30519 27260 6836 -26777
16858b6777M2112J3315J3009K1374j0390P528j3942l1226p274J9716J0645Q895
16846D6985K4177m594n978l6258k8220J0475J3383J5745O296L0115j984r388o043
16833E4711l4773k3890j5431L6120l682k1855J4553j0085k2424j8121j502J5112
16821c1267M590K1283O7430L4378j5764J5420l3l3986k2515k0715J5301K4517
16809E8639k478J8794m945J2750L37k4126J1210L7341k6279j4803j0848j4378
16797D1214j8885q631N396J538M632J9551j4154J3458R157M747J2859P86m736
16784F6932J3669M537p498m0516M253p242k4325L3112K8416K5512J416O943j4237
16771I0972j0628n120n930J4599R630n242j1739J9827J7344q705m1073J6830O4099
$$ plain form
16858 -26777 15335 28650 41659 63033 52643 60171 46229 15003 7729 27445 38090 46985
16846 46985 71162 66568 60590 24332 -3888 6587 19970 35715 42011 72126 70142 60754 54711
16833 54711 19938 -3952 -19383 16737 13055 -8800 5753 -4332 -26756 -44877 -46379 -31267
16821 -31267 -26677 -5394 62036 96414 80650 96070 96037 62051 39536 18821 34122 58639
16809 58639 56161 74955 70010 82760 83097 58971 70181 107522 81243 66440 55592 41214
16797 41214 22329 13698 19094 20632 25264 44815 30661 44119 53276 58023 70882 71668 66932
16784 66932 80601 85138 77640 37124 41377 34135 9810 42922 71338 96850 98266 105209 90972
16771 90972 80344 75224 69294 83893 93523 88281 76542 96369 113713 105008 63935 80765 144864
16758A44864N920m9954n2129j0664j3997J7536J6488L3065J7830J0886Q774K7913
16746A56532R907L0685R582k0605j5107K6360L5646P033J5167N757L665R94J9735
16733B85351j1177K4621M1j5339N0072J3043n92O869j8311l3493K0310P3732L8634
16720D33761J9228J1827J1934L977L8680p61N9408O0432N3567Q3282J17863J41079
16708A034277J71869K13867N8712j8831K8548Q2556J54692K23681L02198L44980
16698B596549L17069K95910M22742N21762N36433O39069R02704J258543J767107
16689I257888K555999L779505N917220R641578J6263848K4454579J9488282m795502
16681H6563397k0350242j9947537j3480907p221720l068664j17275K809149O673848
$$ plain form
16758 144864 150784 100830 48701 38037 24040 41576 58064 91129 108959 119845 128619 156532
16746 156532 166439 197124 206706 186101 170994 197354 233000 240033 255200 260957 264622 265616 285351
16733 285351 274174 298795 298836 283497 333569 346612 346020 352889 334578 301085 321395 395127 433761
16720 433761 452989 464816 476750 480727 519407 518646 578054 638486 692053 775335 893198 1034277
16708 1034277 1206146 1420013 1478725 1459894 1488442 1570998 1725690 1949371 2251569 2596549
16698 2596549 2913618 3209528 3632270 4154032 4690465 5329534 6232238 7490781 9257888
16689 9257888 11813887 15593392 21510612 31152190 47416038 71870617 91358899 86563397
16681 86563397 66213155 46265618 32784711 25562991 22494327 22377052 25186201 31860049
16673C1860049J2747768K1275126K1712758P26296j9262396k2025494j6363982
16666C0670125r978206n907808l792894k532816j737531j214254q41437o00248
16658D064931m06165k36710j56836j86709k57939k95376k91988l00300k34092
16649A698816j88492j63466q6110n2324O5581Q4857n5492j71224j54313j15494
16639H62339j16534n2149m6165o5731l9822j1969o1514o0459O028j3213l6721
16628C64090k1720l331m7820k380N4931n243k0635j4701k6860m8881m0142J2892
16616B00200m577Q983o775r102M870J1781o939P024l3339m6798K0680j0270r69
16603A34769N760R306L678j6628P752L2818J0246j7370l5929p673o425O692k2996
$$ plain form
16673 31860049 44607817 65882943 87595701 88321997 69059601 47034107 30670125
16666 30670125 20691919 14784111 10991217 8458401 6720870 5506616 4665179 4064931
16658 4064931 3658766 3422056 3265220 3078511 2820572 2525196 2233208 1932908 1698816
16649 1698816 1510324 1346858 1260748 1208424 1274005 1358862 1303370 1132146 977833 862339
16639 862339 745805 693656 647491 581760 541938 529969 468455 407996 414024 400811 364090
16628 364090 342370 339039 291219 288839 343770 338527 317892 303191 276331 227450 187308 200200
16616 200200 195623 204606 197831 188729 193599 205380 198441 205465 172126 125328 146008 135738 134769
16603 134769 140529 149835 153513 136885 144637 177455 187701 170331 134402 126729 120304 126996 104000
16590A04000J4791j3267j0777n550J5535j0420p329J8974m5331k6757n859P157
16578C5167K2859Q976J3315J3424j664k042p441j0282J5668k5633m6268j4531
16566A548K5932J6288Q038P249K5485J1603n699J6433j6114j9547J0226L453j0212
16553G4683Q050J1487k674k5674j9990k1519m646Q924r376p543J5793N6425o439
16540G7501L1m6919m5627j8018J0188k4507L0021J6032j9864M097L540j4542p503
16527c5570J3438M4883J1486k4436l037M3049Q289j9100j7470q555K0916L289
16515C7182K0746j1414q184k4251m242K2992K8184j3031k7665q25p504J8539K5668
16502E6195k6357l7095J1935p15N464J3228K3209K651n314J720K2877j6913j9556
$$ plain form
16590 104000 118791 105524 94747 89197 104732 94312 86983 105957 60626 33869 28010 35167
16578 35167 58026 67002 80317 93741 92077 90035 82594 72312 87980 62347 16079 1548
16566 1548 27480 43768 51806 59055 84540 96143 90444 106877 90763 71216 81442 84895 74683
16553 74683 82733 94220 91546 65872 45882 24363 19717 28641 19265 11722 27515 83940 77501
16540 77501 77532 30613 -15014 -33032 -22844 -47351 -17330 -1298 -21162 -17065 -13525 -28067 -35570
16527 -35570 -22132 22751 34237 9801 6764 49813 58102 39002 21532 12977 33893 37182
16515 37182 57928 46514 38330 14079 9837 32829 61013 47982 20317 19492 11988 30527 56195
16502 56195 29838 -7257 4678 3963 9427 22655 45864 48515 43201 44921 67798 50885 31329
16489C1329q962l514j2895j5975Q729J1081m0190j0025K0023J2700K3932R117
16477B5350R856j1480j6425J1683M900K0435q54j4958J0593k2683Q467J4085n775
16464C3194j5846j7281Q746J0182L00L1180J6793J5915p822m832j2991m4949R034
16451B1623M3633k7346l5685j9545J4049J6206k2341L809J8684K7750o897N545
16439C9485o206K75l183k1191R832K8561q526l7670J0464j0436r167K1861k6076
16426a1977j3034j0184k563J0754P821o244j26m095M3243J9564m8903r945J4922
16413a0767J7649J7674K936j4192o978k1220L6379L6355J449j8133j9047k6312
16401d207k2675j7491P137K0379J9792O607p571k5149r843L6269L0228j1221k0965
$$ plain form
16489 31329 22367 18853 5958 -10017 -1288 9793 -30397 -40422 -20399 -7699 16233 25350
16477 25350 35206 23726 7301 18984 23884 44319 43465 28507 39100 16417 24884 38969 33194
16464 33194 17348 67 8813 18995 19295 50475 67268 83183 75361 70529 57538 12589 21623
16451 21623 65256 37910 2225 -17320 -3271 12935 -9406 -5597 13087 40837 33940 39485
16439 39485 33279 33554 30371 9180 19012 47573 39047 1377 11841 1405 -7762 14099 -11977
16426 -11977 -25011 -35195 -37758 -27004 -19183 -25427 -25553 -29648 13595 33159 -15744 -25689 -10767
16413 -10767 6882 24556 27492 13300 6322 -14898 21481 57836 59285 41152 22105 -4207
16401 -4207 -26882 -44373 -37236 -16857 2935 9542 1971 -23178 -33021 3248 33476 22255 1290
16388A290J5246J2448O602J0636k1587L052J0072n496J2735m041j3926j4913m890
16375G228N483L2499K4808k7492l8189j4203j5462K2913k5749l2585L3431J1487
16363a5831J1855K6537m9050k586P956J4323K4201k9711j2298J5367L816J6107
16351A0686m297k1920k0463m218J073k8819k2807M8795K5081k7590j0570J5405
16339c9644J9548O032p832p6j8146k9159M4418K8672Q701K9115J1168l1103j7588
16326D106m109j0943K6205q910k4997L096J1073M076j0714j6254j7360K1554J489
16313b1688l1579j112k5668l404P390K2863M2615R314m986o277m863q865J6864
16300i396K1224l8563l3097J5178M6262K3437k4004m1421j9761M671J9417k4497
$$ plain form
16388 1290 16536 28984 35586 46222 24635 27687 37759 32263 44998 40957 27031 12118 7228
16375 7228 12711 45210 70018 42526 4337 -9866 -25328 -2415 -28164 -60749 -27318 -15831
16363 -15831 -3976 22561 -26489 -29075 -21119 -6796 17405 -12306 -24604 -9237 -5421 10686
16351 10686 6389 -15531 -35994 -40212 -39139 -67958 -90765 -41970 -16889 -44479 -55049 -39644
16339 -39644 -20096 -14064 -21896 -21972 -40118 -69277 -24859 3813 12514 41629 52797 21694 4106
16326 4106 -3 -10946 15259 6349 -18648 -15552 -4479 -403 -11117 -27371 -44731 -23177 -21688
16313 -21688 -53267 -54379 -80047 -83451 -76061 -53198 -10583 -1269 -6255 -12532 -17395 -26260 -9396
16300 -9396 11828 -26735 -59832 -44654 1608 25045 1041 -40380 -60141 -55470 -36053 -60550
16288f0550j0962L8078j0970k0554J0387K2509J3062P365J3843J1101L883k0952
16276c760k1816K1829J6750j6303j4086K70J1896j4358j4484j0488M285J8178
16264b2087J0915j927L3237P844k1608k981J6639K0201M830l5063j5755J8901
16252A3146o147l7088P233K5373L2810n952k6186j4380j0830L723R723J6706j7688
16239i557J8029K6432N099j7059j4867q948j4407j9782J7922O935K262J473P150
16226F82m2078J2860o944K5066L195J1125j816q498j230k3969k126P2J4705m442
16212b3398K2054J3389k0470o808r052j622K3371R415K9700J3255J2667k3629
16200C8872j0451J8747k1343m8152j3754m028j5221J5320K3401J2343m3941j0174
$$ plain form
16288 -60550 -71512 -33434 -44404 -64958 -54571 -32062 -19000 -11635 2208 13309 17192 -3760
16276 -3760 -25576 -3747 13003 -3300 -17386 -17116 -5220 -19578 -34062 -44550 -40265 -22087
16264 -22087 -11172 -13099 20138 27982 6374 3393 20032 40233 45063 10000 -5755 13146
16252 13146 6999 -30089 -22856 2517 35327 29375 3189 -11191 -22021 -18298 -8575 8131 -9557
16239 -9557 8472 34904 40003 22944 8077 -871 -15278 -35060 -17138 -10203 -7941 -6468 682
16226 682 -41396 -28536 -35480 -10414 -7219 3906 2090 -6408 -7638 -31607 -33733 -33661 -18956 -23398
16212 -23398 -1344 12045 -8425 -15233 -24285 -25907 -2536 6879 36579 49834 62501 38872
16200 38872 28421 47168 25825 -22327 -36081 -40109 -55330 -40010 -16609 -4266 -48207 -58381
16188e8381J2068K1952J2220J7561J1432j0176j5647j2557n809k670J5777p560
16176b1790r697r172L1605K7814k0512q724l6663M007M362J1895J3076n1352j7611
16163h2762K4272M1915o206k0285J2834N003n734k0094K944m520K6236k0620O954
16150d0063K3942R185j537J120l9644J9479K0743K4272M0773J0955n565l486k5875
16137C4299l5395j2537q035L050l926M352l1430J5331L6266M1893J2915N4330
16125A11113N2522Q7417J03871J03343J1251q3810j37237n4966m4137j220o822
16114A41325j7644J4543N1806Q9050J29607N1373o8329j12399r7466n4415o3981
16103F3470l7035j8677j9005K7362L6755o535J205o738k0786q039m854j4967k3867
$$ plain form
16188 -58381 -46313 -24361 -12141 5420 16852 6676 -8971 -21528 -27337 -30007 -14230 -21790
16176 -21790 -31487 -40659 -9054 18760 -1752 -10476 -47139 -43132 -38770 -26875 -13799 -65151 -82762
16163 -82762 -58490 -16575 -22781 -43066 -30232 -25229 -30963 -51057 -48113 -52633 -26397 -47017 -40063
16150 -40063 -16121 -6936 -8473 -7353 -46997 -27518 -6775 17497 58270 69225 63660 60174 34299
16137 34299 -1096 -13633 -21668 -18618 -22544 -18192 -49622 -34291 1975 43868 56783 111113
16125 111113 163635 251052 354923 458266 469517 385707 248470 193504 149367 148147 141325
16114 141325 123681 138224 190030 279080 408687 460060 391731 279332 181866 127451 63470
16103 63470 26435 7758 -11247 16115 52870 46335 47540 40802 20016 11977 7123 -7844 -31711
16090c1711J0793Q934q131n550J0737m814l743n131m539J0272P90R175K8908j5171
16076H19j6990J2271L1056J6021l3763n3936K0995J0991j4457j5717J1319P653
16064b3738N393l989l42N032K1830j3844O622r872j8988N2619K4166k1826J283
16051B4346L1188J370m7123k2691p170O985K8345P092q161m770j5066M570l991
16038e076J0000J3505O43K072K374j8093k2971J3608k7931n1931K5575L8619L9546
16025A9940l156k7180K0402j0422j6382o84K1092j2789j1953r946J9093j4602
16013b6587J4661j972m8554l3345Q675N410M967K9908M0082j594j9500k0980J5335
16000c3494N64N069J1653O230q768j0237M599q319n672L2675n877k3603p095K3447
$$ plain form
16090 -31711 -20918 -11984 -20115 -25665 -14928 -19742 -23485 -28616 -33155 -22883 -22093 -12918 15990 819
16076 819 -16171 -3900 27156 43177 9414 -44522 -23527 -12536 -26993 -42710 -31391 -23738
16064 -23738 -18345 -22334 -22676 -17644 4186 -9658 -3036 -12908 -31896 20723 44889 23063 24346
16051 24346 55534 56904 9781 -12910 -20080 -13095 15250 22342 14181 9411 -5655 -1085 -5076
16038 -5076 4924 18429 19072 21144 23518 5425 -17546 -3938 -31869 -83800 -58225 -19606 19940
16025 19940 16784 -10396 10006 -416 -16798 -17482 3610 -9179 -21132 -31078 -11985 -26587
16013 -26587 -11926 -13898 -62452 -95797 -87122 -81712 -76745 -46837 -6755 -8349 -27849 -48829 -33494
16000 -33494 -32930 -27861 -16208 -9978 -18746 -28983 -24384 -32703 -38375 -5700 -11577 -35180 -42275 -18828
15986a8828J6883k447m0347j1792q811K1959L4012J6372R724J4922j2157l6296
15974a6806M634L7880O583l72J0077k9179P104J0581j9568m335l909K4362R898
15961C6950m051j4658k7712m0639m606K3273J930q822K0101K6202m701r347k6378
15948c2458m5614L1004K3173Q790n975J1858R716Q215m972M629j4933k9489j7258
15935e3314O929k399N648L4004k289J7049o405l8520j55M698j4274K8569M4573
15922B4114L2800j9062k599J932n182l1122l275K1420M5028k5319p023q128l1263
15909g679k5565n709Q270K759J8843J6263q948n314j0154J0832J4597k230L910
15896I875k044k6708r779L650J4265k2743K686N9627K5520k152j6806l1839m8062
$$ plain form
15986 -18828 -1945 -4392 -44739 -56531 -65342 -43383 -9371 7001 16725 31647 19490 -16806
15974 -16806 -12172 25708 32291 31919 41996 12817 19921 30502 10934 6599 2690 27052 36950
15961 36950 32899 18241 -9471 -50110 -54716 -31443 -29513 -38335 -18234 7968 3267 -6080 -32458
15948 -32458 -78072 -47068 -23895 -15105 -21080 -9222 494 8709 3737 8366 -6567 -36056 -53314
15935 -53314 -46385 -48784 -43136 -9132 -11421 5628 -777 -39297 -39452 -34754 -49028 -20459 24114
15922 24114 56914 37852 35253 37185 32003 881 -2394 19026 64054 38735 31712 23584 -7679
15909 -7679 -33244 -38953 -30683 -27924 -9081 7182 -1766 -7080 -17234 -6402 8195 5965 9875
15896 9875 7831 -18877 -28656 -25006 -10741 -33484 -30798 28829 54349 52197 35391 3552 -44510
15883d4510J4782L011J8966K9709q874l2874j7064P324o312j6147q31K9364J3248
15870a0208J7317j6788j8538K473J2353J1823J0250l6005j5956j363l339K9557
15858a8424o532l586O70j2246j6107N147Q295o197k1331l411r192N004K3873L9252
15844a4785L9356q638k5656o919k4652k4469J0447K3984M064k453j8671l1312
15832g9704K8086L0284J7717j7252Q443l5792j261J7307J89J4725K2159k5964
15820b1063k3486L817l3602J0233J3931o99m398L3204N4023K4940j928m6475k0535
15807a2038K2761j3543k1216m145K4304K0308l326p317k1350J3186J4261p611
15795D274k0580J1204M410j4213l5348K2422M1135J4381l3229l2755L449O064
$$ plain form
15883 -44510 -29728 -26717 -7751 21958 13084 -19790 -36854 -29530 -35842 -51989 -52820 -23456 -10208
15870 -10208 7109 -9679 -28217 -25744 -13391 -1568 8682 -27323 -43279 -44642 -47981 -18424
15858 -18424 -24956 -28542 -27872 -40118 -56225 -51078 -42783 -48980 -70311 -73722 -82914 -77910 -54037 -14785
15844 -14785 24571 15933 -9723 -16642 -41294 -65763 -55316 -31332 -27268 -29721 -48392 -79704
15832 -79704 -51618 -21334 -3617 -20869 -12426 -48218 -49479 -32172 -31983 -17258 4901 -21063
15820 -21063 -44549 -40732 -74334 -64101 -50170 -50869 -55267 -22063 31960 56900 54972 8497 -12038
15807 -12038 10723 -2820 -24036 -28181 -3877 16431 13105 5788 -15562 -2376 11885 4274
15795 4274 -16306 -5102 -692 -14905 -50253 -27831 13304 27685 -5544 -38299 -34850 -28786
15783b8786o768J1198Q017J419J3395q107j5547J2813K745m798j6503k439L5331
15770A970M9156r572l2276K0329j33l5910j6663K2797j2535j3933j2804K791J3700
15757b3083J9333l1653j21K3901P671M579o19k3990k3596N265K3124L0860j1088
15744E83P51K2856n843j0716p080o922L9178j0247m0603j2352q652L3836L2826
15731B7615l7014l6169K0043k3855m201K1459K61M446j6198l1111J4971L0740
15719b9013K9857o774l067J0928m217l7445j7228J8564K0435o814J4329O902L1089
15706B7546L3600L5223k896n8375n1353N744J4696m629k4910l2752k1703K2168
15694e7641J2684p133J4014L160P042L499K0407J5540K1062N761J446j158l8340
$$ plain form
15783 -28786 -35554 -24356 -16339 -14920 -1525 -9632 -25179 -12366 -9621 -14419 -30922 -33361 1970
15770 1970 51126 41554 9278 29607 29474 -6436 -23099 -302 -12837 -26770 -39574 -36783 -23083
15757 -23083 -3750 -35403 -35524 -11623 -3952 627 8 -23982 -47578 -42313 -19189 11671 583
15744 583 1334 24190 18347 7631 551 -6371 32807 22560 -18043 -30395 -39047 -5211 27615
15731 27615 -9399 -45568 -25525 -49380 -53581 -32122 -31861 -27415 -43613 -74724 -59753 -29013
15719 -29013 844 -5930 -8997 1931 -2286 -39731 -56959 -38395 -17960 -24774 -10445 -3543 27546
15706 27546 61146 96369 93473 35098 -16255 -10511 4185 -444 -25354 -58106 -79809 -57641
15694 -57641 -44957 -52090 -38076 -34916 -27874 -24375 -3968 11572 32634 38395 39841 38683 343
15681C43l0315p80J4660K5023j8495O481k732j5313l1083j9392k7178L4259N0217
15668a4305J2723P664J4457n193K3656k5970P525L8663J0780o381j0620j6063
15656C6936l0372n114j8313j4940L9846k5754j6320j124M192L6584n137k326k0578
15643b2420j305J986J144k825k06K4649J6210j6533l0191Q373r522o812L3257
15630d195n829J741M587J6286L7630K611k4886l4312r842j4051K3968J4020k9151
15617b1423j6573m561J4406j5168K9057J1163J0454k0848k3218J5517J6876J0430
15605F112L429J5035J8364j9499j3798K9635k0439j9684J1830J5182k9046o799
15593i678J2721j3476M0413L571k3144n3573K2204k1945j7371J167O31J7193k754
$$ plain form
15681 343 -29972 -30752 -16092 8931 -9564 -3083 -5815 -21128 -52211 -71603 -98781 -64522 -14305
15668 -14305 -1582 6082 20539 15346 39002 13032 20557 59220 70000 63619 52999 36936
15656 36936 6564 1450 -16863 -31803 8043 -17711 -34031 -35155 -30963 5621 484 -1842 -22420
15643 -22420 -23725 -21739 -20595 -23420 -23626 1023 17233 700 -29491 -21118 -30640 -37452 -4195
15630 -4195 -10024 -8283 -3696 12590 50220 52831 27945 -6367 -16209 -30260 -6292 7728 -21423
15617 -21423 -37996 -42557 -28151 -43319 -14262 -3099 7355 -13493 -36711 -21194 -4318 6112
15605 6112 9541 24576 42940 23441 9643 39278 18839 -845 10985 26167 -2879 -9678
15593 -9678 3043 -10433 29980 33551 10407 -43166 -20962 -42907 -60278 -59111 -58480 -41287 -44041
15580d4041J42j4546J9821M2181K2975K9328J0940k4335j1030O632N497k028L335
15567D4871Q533R930j1355j6630k8847j9544J3041o545k591L7600O858J0284k7419
15554A8186m6969k6030m576K8338K7745n840L1966j5663p330O352J9983p542K3906
15541D2526L143k2761j9413j6089K892J7476J7744L471j9462n686L83K0064Q879
15528C3167k7807k037J6818p998l2265k6414P48K6224R941k2862K9814K2605j9006
15515I28p59O566q221J0740r107r921j2303n342J5926J5497k0224k113O448l8851
15501e0736j3008R565J4193o609K024K8604K55J881M0481J1690k8355j9773L2736
15488B2948k0683k5139l90n457L637j451j8266K2075N2586K0364M764r303j6257
$$ plain form
15580 -44041 -43899 -58445 -38624 3557 26532 55860 66800 42465 31435 38067 43564 41536 44871
15567 44871 53404 63334 51979 35349 6502 -13042 -1 -6546 -9137 28463 35321 45605 18186
15554 18186 -28783 -54813 -59389 -31051 -3306 -9146 22820 7157 -173 6179 26162 18620 42526
15541 42526 45669 22908 3495 -12594 -9702 7774 25518 28989 9527 3841 4224 24288 33167
15528 33167 5360 3323 20141 12143 -20122 -46536 -45788 -19564 -9623 -32485 -2671 19934 928
15515 928 169 6735 -1486 9254 147 -9774 -22077 -27419 -11493 4004 -16220 -18333 -11885 -50736
15501 -50736 -63744 -54179 -39986 -46595 -44571 -15967 -15712 -13831 26650 38340 9985 -9788 22948
15488 22948 2265 -22874 -23264 -28721 -25084 -26535 -44801 -22726 29860 50224 54988 45685 29428
15475B9428m2633j0750K6957L991r092r510J69J846J3996j4690l1040J3291L6695
15462H658J7224n822K4256j5752m1588l0861k1176P471L6877l302K7694Q457j7786
15449e650k8207l8178K9031K5647j0180j7288n707L7189Q263L82M063L2112O10
15436C2087k2376k2094R358l1036P309J0918R163q667j4964J2790M2335L46r764
15423A5405Q201K0364j8940n3103l6861K8833M7655R637L305O657M923k2265l8055
15410b4244k115K8824J689l0085q460J997R76K4780P19J0638K207J2687k9461
15397i848l5502L5253P19N728J3816q09m2043J0344J7516J2329r83j1208j8181
15384b2869k044r921J7099J417K2507L745L34J7898J1282p798n3221j4550k2363
$$ plain form
15475 29428 -13205 -23955 3002 6993 -2099 -11609 -11440 -9594 4402 -10288 -41328 -28037 8658
15462 8658 25882 20060 44316 28564 -13024 -43885 -65061 -57590 -20713 -24015 3679 12136 -5650
15449 -5650 -33857 -72035 -43004 -17357 -27537 -44825 -50532 -13343 -5080 -4698 -635 31477 32087
15436 32087 9711 -12383 -3025 -34061 -26752 -15834 -6671 -15338 -30302 -17512 24823 25169 15405
15423 15405 23606 43970 25030 -28073 -64934 -36101 11554 21191 24496 31153 36076 13811 -24244
15410 -24244 -26359 2465 4154 -25931 -34391 -32394 -31418 -6638 -5919 4719 6926 19613 -9848
15397 -9848 -45350 -10097 -9378 -3650 10166 9357 -32686 -22342 -4826 7503 6520 -4688 -22869
15384 -22869 -24913 -34834 -17735 -16318 6189 9934 10268 28166 39448 31650 -21571 -36121 -58484
15371e8484K0626L776K0155K8283L627j207k5650l4944l171P562o887M690K4753
15358a6871K3066N082j7801k2382p817J3171K4644J3387P980K2771J6922m0389
15346B1763n1152k222M0625k8843k0022j1936J3429K3214k3147j6384J4118O770
15334c3787K5631M9336N391m2438m9872K445l185k6245L5858L3477l947k8398
15322c5734n088K428J2401J3825R774J2742j7107M726K5518l158k4126L873R122
15309I196j4154K027l1999k0451J8605N2403r412l2065p421r468M600M4121j18
15296E864k745P187j9918K005N570j5380M556r324K2823p528R650J606J285j697
15282C954p499k2198j5116J9776L4567O543K0779l0198k3093J8525K2592j0250
$$ plain form
15371 -58484 -37858 -34082 -13927 14356 17983 16776 -8874 -43818 -46989 -39427 -46314 -41624 -16871
15358 -16871 6195 11277 -6524 -28906 -36723 -23552 1092 14479 22459 45230 62152 21763
15346 21763 -29389 -31611 9014 -19829 -39851 -51787 -38358 -15144 -38291 -54675 -40557 -33787
15334 -33787 -8156 41180 46571 4133 -45739 -43294 -46479 -72724 -36866 -3389 -7336 -35734
15322 -35734 -40822 -38394 -25993 -12168 -2394 10348 -6759 -2033 23485 20327 -3799 74 9196
15309 9196 -4958 -2931 -34930 -55381 -36776 15627 6215 -25850 -33271 -42739 -38139 5982 5864
15296 5864 3119 10306 -9612 -7607 -2037 -17417 -12861 -22185 638 -6890 2760 4366 5651 3954
15282 3954 -3545 -25743 -40859 -21083 13484 20027 40806 10608 -12485 6040 28632 18382
15270A8382k6237l534M1278R261k0122p362o649j9813L0380M4810k5164j9798
15258A5432j5256j8588r37M79K1171r444O622n56L5758N699n2592j9570R156J2433
15244a0193j880r334l196O533l6323m358M8777L7750j4223k7343j0669j4052j2452
15231e0963J8998o738k0626l4997M6960q63J4454K6810o899q686o999O93M638
15218b4218Q286J3967N115l7735R418J6216K4477K0872k1493j3132J1925L6184
15206D9882K660k3272J828k7395K3403J7061k6315k4346m028m340j0838K9782
15194D082J1234Q872J3345L8224j926m1083j0902n296J0390Q553J1460j5460k2653
15181H840k347K5794K554m936k715L459k7215l8178j1153j1682K559J0672L8596
$$ plain form
15270 18382 -7855 -11389 29889 39150 19028 11666 5017 -14796 15584 60394 35230 15432
15258 15432 176 -18412 -19349 -18870 2301 -7143 -521 -1077 34681 40380 -12212 -31782 -22626 -10193
15244 -10193 -12073 -21407 -24603 -18070 -54393 -58751 -9974 27776 13553 -13790 -24459 -38511 -50963
15231 -50963 -31965 -38703 -59329 -94326 -47366 -48229 -33775 -6965 -13864 -22550 -29549 -28856 -24218
15218 -24218 -15932 -1965 3150 -34585 -25167 -8951 15526 36398 14905 1773 13698 49882
15206 49882 52542 29270 31098 3703 27106 44167 17852 -6494 -10522 -14862 -25700 4082
15194 4082 15316 24188 37533 75757 73831 32748 21846 16550 26940 35493 46953 31493 8840
15181 8840 6493 32287 34841 29905 27190 30649 3434 -34744 -45897 -57579 -55020 -44348 -5752
15168e752O846n604l9187K7455J2884K8426j1031k6764K276j2975N154J7052M34
15155g86j1543p26K6170k9494j3352L6149J3979o358r985J8637k0826J0738K9353
15142D1956J8910k5660K7717j0378k3218k0843k157J0750L403J1570M866j3526
15130B3390l5166j9212O190n969J4190K9858m451J116j2054j7037p912o999O18
15117c3438M0008m177J59J1592j4387m5506k0110K9975L5943n466j3568J5282
15105c693J5816K3125L0356l5297m5098L8385J4561r588J5526k913k5588m5623
15093c0031J0914J7889J5539k4346l2932n802K2221o385l2817O985j6651j468
15081g6884O19K984k23J5626J7383J8364O134L419J3685J2240r427J6753k3291
$$ plain form
15168 -5752 1094 -4510 -43697 -16242 -3358 25068 14037 -12727 -10451 -23426 -18272 -1220 -786
15155 -786 -12329 -13055 13115 -16379 -29731 6418 20397 14039 4054 22691 1865 12603 41956
15142 41956 60866 35206 62923 52545 29327 8484 6327 17077 20480 32050 36916 23390
15130 23390 -11776 -30988 -24798 -30767 -16577 13281 8830 9946 -2108 -19145 -27057 -34056 -33438
15117 -33438 6570 2393 2552 14144 -243 -45749 -65859 -35884 59 -5407 -18975 -3693
15105 -3693 12123 35248 65604 30307 -14791 23594 38155 28567 44093 41180 15592 -30031
15093 -30031 -19117 -1228 14311 -10035 -42967 -48769 -26548 -32933 -65750 -58765 -75416 -76884
15081 -76884 -76265 -73281 -73504 -57878 -40495 -22131 -15997 -12578 1107 13347 3920 20673 -2618
15068b618p49r321p374j2408q504r947K8836J8017k0001j2183K2891j8611k1115
15055e3087k3203o849j7317q594L1432n970j7088L9960L6785N0496J3150R530
15043D9245j0904p840k7508j8443n481N850K5337j1596j4759O321q142j1843J9420
15030a0343N6109j2707p556J894k674K9503N208r780M219J2396m5723l3592p792
15017b0838K9327J5146R559k764O886l3268j764K2210l400J6287j5852j0964o827
15004C738j7886j2123q122J8325J353k4206J1561L7288j60J2231j1501n878K0585
14991B5205j433k6274n532N598l357L3150J9722J2382L261k5701O137l4113j4603
14978e558L0268L281p373J6853k879k2912J1196K3027l3554j5915n791r612j9379
$$ plain form
15068 -2618 -3367 -12688 -20062 -32470 -40974 -50921 -22085 -4068 -24069 -36252 -13361 -31972 -53087
15055 -53087 -76290 -83139 -100456 -109050 -77618 -83588 -100676 -60716 -23931 26565 39715 49245
15043 49245 38341 30501 2993 -15450 -20931 -15081 10256 -1340 -16099 -9778 -17920 -29763 -10343
15030 -10343 45766 33059 25503 27397 24723 54226 59434 49654 53873 66269 20546 -13046 -20838
15017 -20838 8489 23635 33194 30430 37316 4048 2284 24494 21094 37381 21529 10565 3738
15004 3738 -14148 -26271 -34393 -16068 -14715 -38921 -27360 9928 9768 21999 10498 4620 25205
14991 25205 23772 -2502 -8034 -2436 -5793 27357 47079 59461 62722 37021 43158 9045 -5558
14978 -5558 24710 27991 20618 37471 34592 11680 22876 45903 12349 -3566 -9357 -18969 -38348
14965c8348K1563J2113j8139j0596j7220n441J0874K1078J1757m745l640M920
14953a5824k1054n561L8309L6338l4533n4901j9304O8558m24O037l0979Q890L1692
14940G244j3394j4641L3329q713Q157J2553p695N911J0894l7529k5509M766N7448
14927C2821k2004k1725K9967j91k0836k943K6111K6210M565k1844j2007M36L5659
14914E4219k936j4364j7082k8340J1842J034n835j4003N748k1398k7979k596L022
14901e8668K3282j391R482N0722l0151j7570J3504k8510L763l6955K4307K0176
14889b8009R099J7293k5148j0707N939J0188o583j98J7496K8678r982J3693Q254
14876C0013k4651k8028n015K0331L6507j2793l8986O859L7780L5846j0745j0343
$$ plain form
14965 -38348 -16785 -4672 -22811 -33407 -50627 -56068 -45194 -24116 -12359 -17104 -20744 -15824
14953 -15824 -36878 -42439 -4130 32208 -2325 -57226 -76530 -7972 -8396 -2359 -33338 -24448 7244
14940 7244 -6150 -20791 12538 3825 11982 24535 16840 22751 33645 -3884 -29393 -24627 32821
14927 32821 10817 -10908 19059 18868 -1968 -4911 21200 47410 51975 30131 18124 18560 54219
14914 54219 51283 36919 19837 -8503 3339 4373 -1462 -15465 -9717 -31115 -59094 -61690 -58668
14901 -58668 -35386 -36777 -27295 23427 -6724 -24294 -10790 -39300 -35537 -72492 -48185 -28009
14889 -28009 -18910 -1617 -26765 -37472 -31533 -21345 -27928 -28126 -10630 18048 8066 21759 30013
14876 30013 5362 -22666 -27681 -7350 29157 16364 -22622 -15763 22017 57863 47118 36775
14864C6775K0972l1306k1902j5512j2014K3562N0254o152k3535K1052J785l7519
14852F460P672j3739k3442j0344k969J44K8417K5379j6857j3350p680j7070R192
14839b8187N9706L5347n5028n154J894M793K2303R700l1820k927K7708n041l2346
14826I48j0181j6110m5928j1572K2157K7377K0267k445k7270k654K6884K8595
14814A0068J0631K323k0392n678J2245j3549k2646J4816o559n575J054N074k013
14801b0201m0096k0764L7707J7385L413R742J9137K194k1283l797J5844J056P461
14788G798l5253j0647M1344M4731l4039K619J8534p980j6770j1273k6020O641
14776b0315L8676J2594k5144k6966J1927J557l4863L560J8712k3778n045K1285
$$ plain form
14864 36775 57747 26441 4539 -10973 -22987 575 50829 44677 21142 42194 43979 6460
14852 6460 14132 393 -23049 -33393 -36362 -36218 -7801 17578 721 -12629 -20309 -37379 -28187
14839 -28187 31519 66866 11838 6684 8578 13371 35674 45374 13554 10627 38335 33294 948
14826 948 -9233 -25343 -71271 -82843 -60686 -33309 -13042 -15487 -42757 -45411 -18527 10068
14814 10068 20699 23022 2630 -3048 9197 -4352 -26998 -12182 -18741 -24316 -23262 -18188 -20201
14801 -20201 -60297 -81061 -43354 -25969 -22556 -12814 6323 8517 -12766 -16563 -719 337 7798
14788 7798 -27455 -38102 3242 47973 13934 16553 35087 27107 10337 -936 -26956 -20315
14776 -20315 18361 30955 5811 -21155 -9228 -7671 -42534 -38974 -20262 -44040 -49085 -27800
14764b7800L0012J1957J4903P558j1786k7699j2674J3477J7514j7024j0765N579
14752f748l7345j5232L7018J5944j4232j2776M140J6884L138R113K0906j7015
14740C795J3740J107l5987J2452J6127k1207K0166m44p82J5802j130K3938J820
14727D9397o021j3114k1970k2287l8134o387R284J58k1601j4202j2485N1699K1038
14714b4625k1683J7736K1580K1462N895j0110K5988j034j0936K398j8653m2390
14702c4372O347K0941J8589L4722l948j5069m5579k5433l3172l200N0386K9921
14690A33j2632q913m0216o333K5929p255j6078p446K7532L023J0835L5720L670
14677G969k2446k908R046l3316n055L7597L6173k2867k1692j9265J3162K2250
$$ plain form
14764 -27800 2212 14169 29072 36630 24844 -2855 -15529 -2052 15462 -1562 -12327 -6748
14752 -6748 -44093 -59325 -22307 -6363 -20595 -33371 -29231 -12347 -9209 -96 20810 3795
14740 3795 17535 18642 -17345 -4893 11234 -9973 10193 9749 8967 24769 23639 47577 49397
14727 49397 43376 30262 8292 -13995 -52129 -58516 -49232 -49074 -70675 -84877 -97362 -45663 -24625
14714 -24625 -46308 -28572 -6992 14470 20365 10255 36243 35209 24273 26671 8018 -34372
14702 -34372 -28025 -7084 11505 46227 42279 27210 -18369 -43802 -76974 -80174 -29788 133
14690 133 -12499 -21412 -61628 -67961 -42032 -49287 -65365 -72811 -45279 -42256 -31421 4299 7969
14677 7969 -14477 -17385 -8339 -41655 -46710 -9113 27060 4193 -17499 -36764 -23602 -1352
14665a352j1482j265j0877K90L5368Q127m336J2635q441l5337l347j949l1740
14652e3706J982J3741r11J3121K5967j5674J1566L6977P432l3866L758J3947j0745
14639A3589j7947K4892J8406J0874j301l5745q162o312J3348J6123o201q316K025
14626A5273N976l4024n372O640k9311m6673q414J6936L9348J3374L218J4362j8313
14613b6980k2583k9065k0175J2680K0695J3741J8850l0394J5870L7829J0633K5148
14601B6249K4065L144J3143l6699j2166r674j6139L8706J0192m907N245j0678
14589C0481j1035m29n7976k4312L2196L0207K5174m278K0770J2480l6372m2914
14577b6008k8959J5446N1467j4714m1172N366J1296L6919J0708p898p664M729
$$ plain form
14665 -1352 -12834 -14099 -24976 -24686 10682 18809 14473 27108 18667 -16670 -20017 -21966 -53706
14652 -53706 -51724 -37983 -38894 -25773 194 -15480 -3914 33063 40495 6629 10387 24334 13589
14639 13589 -4358 20534 38940 49814 48513 12768 4606 -1706 11642 27765 21564 13248 15273
14626 15273 21249 -12775 -18147 -11507 -40818 -87491 -95905 -78969 -39621 -26247 -23029 -8667 -26980
14613 -26980 -49563 -78628 -98803 -86123 -65428 -51687 -32837 -63231 -47361 -9532 1101 26249
14601 26249 50314 53458 66601 29902 17736 8062 -8077 30629 40821 35914 41159 30481
14589 30481 19446 19017 -38959 -63271 -31075 -868 24306 20028 40798 53278 16906 -26008
14577 -26008 -54967 -39521 11946 -2768 -43940 -38574 -27278 9641 20349 12451 4787 9516
14565I516L3669n1600l9384O277J9852l703k4365N645j3442o677j501K0683K6616
14552a8414P906j360l673K0998j3707R186k4855n831M213K8347L2430m64l9045
14539d269k1369L5990J7326R139k7830q973J1729J0257K878L1378J1276l3178
14527C4354k8753l2480R693Q851L5134N976o4934m9668j4103j180M6971J9057
14515c1082l463j489K3374L809j9540L8983q048k3831j638Q757J1731L818j0307
14502h926k7050K4376N3449K7255P720l2694m7491j8229j0583j5145K2580M5574
14490B0836J2458J5335k109N286L0763j9734l1314l6756p97L0865k261k2140J2023
14477A2455K616j7426J3019K9831L6961l159k7515J3384k2904l5538Q837P152
$$ plain form
14565 9516 43185 -8415 -47799 -41522 -21670 -25373 -49738 -44093 -57535 -64212 -65713 -45030 -18414
14552 -18414 -10508 -11868 -15541 5457 -8250 936 -23919 -29750 -25537 2810 35240 34776 -4269
14539 -4269 -25638 10352 27678 36817 8987 14 11743 22000 24878 56256 67532 34354
14527 34354 5601 -26879 -17186 -8335 26799 32775 -32159 -81827 -95930 -97110 -50139 -31082
14515 -31082 -34545 -36034 -12660 -8851 -28391 10592 2544 -21287 -22925 -14168 -2437 1381 -8926
14502 -8926 -35976 -11600 41849 69104 76824 44130 -3361 -21590 -32173 -47318 -24738 20836
14490 20836 33294 48629 46520 51806 82569 62835 31521 -5235 -6032 24833 22572 432 12455
14477 12455 15071 -2355 10664 40495 77456 74297 46782 60166 37262 1724 10561 17713
14465A7713k6955l561J9467M023j6537o426J6424l903K7713k0177j7621k6099
14453c5939j0612O09J6852P242j4541j3794J9322m366K1207J0259J1935J1305
14441A9479j3085k4749j6385O492K1615k430l32J7480p066J2563k321l4632l0117
14428e3488K4986L4810o190j3252j0272l2607J6906K0602R032K3110Q978j7509
14416E106m5655N254J8310L3016J5254k2646k3968q717J1743J1886J5089J8799
14404C3471q552N632j6490J1358j9886k5278j5333k1828L785K4489L0374j0206
14392h464j9017L6749j7024j5303j784O645L401J9914J6794L0890q443m9675k8926
14379c4243l0848K3622L117Q668J5691p422k9914j6223K7249J816j4031j9563
$$ plain form
14465 17713 -9242 -12803 6664 10687 -5850 -12276 4148 245 27958 7781 -9840 -35939
14453 -35939 -46551 -45942 -29090 -21848 -36389 -50183 -30861 -35227 -14020 -3761 8174 19479
14441 19479 6394 -18355 -34740 -28248 -6633 -9063 -9395 8085 1019 13582 11261 -23371 -53488
14428 -53488 -28502 6308 118 -13134 -23406 -56013 -39107 -18505 -9473 13637 22615 5106
14416 5106 -40549 -35295 -16985 16031 31285 8639 -15329 -24046 -12303 -417 14672 33471
14404 33471 24919 30551 14061 25419 5533 -19745 -35078 -56906 -53121 -28632 1742 -8464
14392 -8464 -27481 9268 -7756 -23059 -24843 -18198 -14797 5117 21911 52801 44358 -5317 -34243
14379 -34243 -65091 -41469 -38352 -29684 -13993 -21415 -51329 -67552 -40303 -38487 -52518 -72081
14367g2081J7807K9089L7542m002k9395j1047j564J4109J7806Q584j4004J9587
14355A2431n997j5753K3222k0372J6085O587r609j2734L0323L64j9723l3146K9615
14342A293O3539J0032j6828o907j2957n334j6669l201j5127n488k5963K1774K1386
14329I550P639o526K602M870j2611m3163j0740L4122J200j7626k6912J1148J2415
14316c4032J2424L8505O630j2021o246l5928l3505j9933N839L0588K9811o054
14304b3922j2015k3873j0411r970J7764L4587J1120J908p192J2846N571m350J5071
14291G134j2514n160K4668J4627J1640n36L252O023j1684J5714k124k0784J2532
14278D2788k5930l0106J9438r182Q496K4582J2863k5491k1444k3061K101L2940
$$ plain form
14367 -72081 -54274 -25185 12357 8355 -21040 -32087 -33651 -19542 -1736 6848 -7156 12431
14355 12431 6434 -9319 13903 -6469 9616 16203 6594 -6140 24183 24547 4824 -28322 1293
14342 1293 64832 74864 58036 51129 38172 32838 16169 12968 -2159 -7647 -33610 -11836 9550
14329 9550 17189 10663 13265 18135 5524 -37639 -48379 -14257 -13057 -30683 -57595 -46447 -34032
14316 -34032 -21608 16897 23527 11506 5260 -30668 -64173 -84106 -78267 -47679 -17868 -23922
14304 -23922 -35937 -59810 -70221 -80191 -62427 -27840 -16720 -14812 -22004 -9158 -3587 -7937 7134
14291 7134 -5380 -10540 14128 28755 40395 39859 43111 49134 37450 53164 51040 30256 42788
14278 42788 16858 -13248 6190 -2992 5504 30086 42949 17458 -3986 -27047 -24946 7994
14266G994K7668j4224m9665l0592J3532K0474L0341L355k1361O322J175J8834
14254A3853k2257m584m345k270J1132L676j4021l111K3547q629j7628p348k8823
14241f0808r798K1988j2525J4114M6191K9788K4905l0963k7732j7180j9994K0712
14229b1302J8634j2918P831j044L0779K8266R08j9838k3456M887M496K4727Q562
14216E0532O807k1251j4214p578k9357O353J79l4660R800N548m880K431l6526
14203f6816K661J4555K751J3456K1903L7397K2917j9173m7562j6435R836L470
14191b1040m8011J0950K2945K1016J930K2032R890j2779L679J3575l643J3042
14179C3586J9033j6069p131m626k6468k2474L1777J9730j6268N708j3589J090
$$ plain form
14266 7994 35662 21438 -28227 -58819 -45287 -24813 5528 8883 -12478 -6156 -4981 13853
14254 13853 -8404 -12988 -17333 -19603 -8471 -4795 -18816 -21927 1620 -7009 -24637 -31985 -60808
14241 -60808 -70606 -48618 -61143 -47029 -838 28950 53855 22892 -4840 -22020 -42014 -21302
14229 -21302 -2668 -15586 -7755 -8799 21980 50246 51154 31316 7860 12747 17243 41970 50532
14216 50532 57339 36088 21874 14296 -15061 -8708 -8529 -43189 -33389 -27841 -32721 -30290 -66816
14203 -66816 -64155 -49600 -46849 -33393 -11490 25907 48824 29651 -17911 -34346 -24510 -21040
14191 -21040 -69051 -58101 -35156 -14140 -12210 9822 19712 6933 10612 24187 20544 33586
14179 33586 52619 36550 29419 24793 -1675 -24149 7628 27358 11090 16798 3209 4299
14167D299k7720M935L9632l503k3855n850J3937m402J9209L2898J0668L4816n272
14154H9792m1488K77Q827o656j9448r703j8728k3518K9887J6156J1661j413j9750
14141A5896m1489N564R846m745L6574K3450k453k0637J3300P469j7502N445K1159
14128E1877J5812J275q137m7435k7094j3751J2003L423J3911J7810j2899l4887
14116b8092P225K5503J8956J7552q012k2602k2774o83K8079N397m417k3239J2459
14103E352J0596r902j2489j5991K3670J2692K6218j5283o362K4574q978j5682
14091A8415K883M580j5956q377J666K1258K2278K5717k7783k9489k8259m2752
14079e5819R112K5816L982j526l514j4406K0550K971k783K699N898M3487j1344
$$ plain form
14167 4299 -23421 -18486 21146 17643 -6212 -12062 1875 -2527 16682 49580 60248 95064 89792
14154 89792 48304 48581 57408 50752 31304 21601 2873 -20645 9242 25398 37059 35646 15896
14141 15896 -25593 -20029 -10183 -14928 21646 45096 42643 22006 35306 42775 25273 30718 51877
14128 51877 67689 68964 60827 13392 -13702 -27453 -15450 -12027 1884 19694 6795 -28092
14116 -28092 -20867 4636 23592 41144 33132 10530 -12244 -12927 15152 20549 16132 -7107 5352
14103 5352 15948 6046 -6443 -22434 1236 13928 40146 24863 18501 43075 34097 18415
14091 18415 21298 25878 9922 1545 3211 24469 46747 72464 44681 15192 -13067 -55819
14079 -55819 -46707 -20891 -16909 -18435 -21949 -36355 -15805 -12834 -15617 -12918 -7020 36467 25123
14066B5123l4523k2737k4293j487O773O545j594J9159K8296r981l582J2538j1420
14053a1183J973m29J8213k7046o0700q636J6206m96n75q68j01J3389M4097k051
14039a8207j2387Q08q079k833J7719J0666J7923L8494P628k6950r692J708K3251
14026D0049K8402m1586j7280k0907N864k1096l7336L3079L2304P484l0843m709
14014b6575J9378L617L552j9530j7083J7954N076K0509J403k4130j2092j6600
14002d4521l5494J3716J3534N236K8897R377k6946p636K3205M077L3451J9399
13990C6295m752j6288l0607j1689J4968J5830r772L3011J9159l3933l0374p789
13978b5941m8491K4123m568M030r0J2948j8814J5645L4134J6414P254j9444J9563
$$ plain form
14066 25123 -9400 -32137 -56430 -57917 -51144 -44599 -46193 -27034 1262 -8719 -12301 237 -11183
14053 -11183 -9210 -9639 8574 -18472 -79172 -87808 -71602 -72098 -72673 -73541 -73642 -60253 -16156 -18207
14039 -18207 -30594 -29786 -37865 -40698 -22979 -12313 5610 44104 51732 24782 15090 16798 40049
14026 40049 68451 26865 9585 -11322 -5458 -26554 -63890 -30811 1493 8977 -21866 -26575
14014 -26575 -7197 -3580 -28 -19558 -36641 -18687 -13611 6898 8301 -15829 -27921 -44521
14002 -44521 -80015 -66299 -52765 -47529 -18632 -9255 -36201 -43837 -20632 -16555 16896 36295
13990 36295 31543 15255 -15352 -27041 -12073 3757 -6015 26996 46155 12222 -18152 -25941
13978 -25941 -74432 -50309 -54877 -50847 -50937 -37989 -56803 -41158 -7024 9390 16644 -2800 16763
13965A6763k255P910k699j8899J132L9728k4399l5703J5447M587K0275k7696j1867
13952a7676N284j7036N246N2636K4564l4590j7027j270J3053M384k0495k6202
13940b9129J964J928j496J6634Q957J6897J4572j2008j4862l04p183j1944o123
13927b2097P055j7763K9451J0732r909r989M146K8930J9783q141j2546k158K6677
13914D4171q937n1119j1460J4158q392M924o717M105J7242P756k7799k990J3113
13901a1945l8065j2039K9659K918J6850K4460p295K1526j1887K420O826K6322
13889D9750N251k8994k8884k9156k9120M202K9504L7439L0926k2749j5798p971
13877e600l2419r773q87O315j428J7471N2141L737l4621L918K7581o899k1043
$$ plain form
13965 16763 14508 22418 19719 820 1952 41680 17281 -18422 -2975 1612 21887 -5809 -17676
13952 -17676 -12392 -29428 -24182 28454 53018 18428 1401 131 13184 17568 -2927 -29129
13940 -29129 -27165 -25237 -26733 -10099 -1142 15755 30327 18319 3457 3153 -4030 -15974 -22097
13927 -22097 -15042 -32805 -3354 7378 -2531 -12520 -8374 20556 40339 32198 19652 17494 44171
13914 44171 35234 -15885 -27345 -13187 -21579 -16655 -23372 -19267 -2025 5731 -22068 -25058 -11945
13901 -11945 -50010 -62049 -32390 -29472 -12622 11838 4543 26069 14182 16602 23428 49750
13889 49750 55001 26007 -2877 -32033 -61153 -56951 -27447 9992 40918 18169 2371 -5600
13877 -5600 -38019 -47792 -48679 -42364 -43792 -26321 25820 29557 -5064 -1146 26435 19536 -1507
13864a507Q371L0276n695J5710J326k1552o309q711l3067j3043K853K7904N17
13851b927j0178J9567J1906j881j2279j7070j2869j2770k0186M1607K5697p860
13839G57k8897K212l91J6091r044K456Q122J0017r192o544K2242R697l369k5211
13825a1054m6616K91M9859J1360O841K0890j1185o269K4388j367j8444J6999R807
13812D5500r171m7075k6448l456M713J0904R148K3310K8078M529Q35K38n528j7141
13798A8436N301l475M204K5846j9807O496p771k4264l4486K6595J9616K1923M2370
13785H0984K4594j9641m8183k3852k3893M053K4932j8165J2794n835J0148j1592
13773F344j0738K67p085J3760M3968R693k7225o691q83k0251N292R941R415J8203
$$ plain form
13864 -1507 6864 37140 31445 47155 48481 26929 20620 11909 -21158 -34201 -31348 -3444 -2927
13851 -2927 -13105 6462 18368 16487 4208 -12862 -25731 -38501 -58687 -17080 8617 757
13839 757 -28140 -25928 -26319 -10228 -19272 -16816 -8694 1323 -7869 -14413 7829 17526 14157 -11054
13825 -11054 -57670 -57379 -7520 3840 10681 31571 20386 14117 38505 37138 18694 35693 45500
13812 45500 36329 -10746 -37194 -40650 -35937 -25033 -15885 7425 35503 40032 40867 41105 35577 18436
13798 18436 23737 20262 24466 50312 30505 37001 29230 4966 -29520 -2925 16691 38614 80984
13785 80984 105578 85937 37754 13902 -9991 -5938 18994 829 13623 7788 17936 6344
13773 6344 -4394 -4127 -11212 2548 46516 56209 28984 22293 21410 1159 6451 16392 25807 44010
13759D4010k4017k5834o383O504J1740k5188k979M2277M271q628l1630r680J1380
13746a4157M7587K6597j3776K6943p63j2338k6579j3990J3567L3271n737j7777
13734D2848k3992j7277J2980M242k0501J026j0983l0135J0949j093l564L6298
13722G98L3558J0072j8642k4045n5360k162K2495J2095J036j415J9179K0200K0992
13709C8801r493o901k9867L944J8773j4403j3451j1645J3720K1299o947N359j5039
13696e850J1848N716k9632l6419K214L0311K8622K9031k5233j1907k4233j830
13684b7362j9019n75P980j1303P084K9260L125j5161n419R752K0060L108j4047
13671a2517J7052j615L778p761j5957j5573J6378j5962J5643J7589j5975m582
$$ plain form
13759 44010 19993 -5841 -12224 -5720 6020 -19168 -22147 20130 24401 15773 -15857 -25537 -14157
13746 -14157 33430 60027 46251 73194 72431 60093 33514 19524 33091 66362 60625 42848
13734 42848 18856 1579 14559 18801 -1700 -674 -11657 -41792 -30843 -31936 -35500 798
13722 798 34356 44428 25786 1741 -53619 -55781 -33286 -21191 -20155 -21570 -2391 17809 38801
13709 38801 29308 22407 -7460 -3516 15257 854 -12597 -24242 -10522 10777 3830 9189 -5850
13696 -5850 5998 11714 -17918 -54337 -52123 -21812 6810 35841 10608 -1299 -25532 -27362
13684 -27362 -46381 -46956 -38976 -50279 -43195 -13935 -10810 -25971 -31390 -21638 -1578 1530 -12517
13671 -12517 4535 2920 6698 -1063 -17020 -32593 -16215 -32177 -16534 1055 -14920 -19502
13659a9502m6743l728N0246J1613R358L5932j0880J0611O444J2447j0620j187
13647D3991o495o340r434k0981l2280j6179Q915J1086j058j0250L6223L3428N448
13634C6074p974l6972R95j2974K9009Q81q65M698K8440K9995q951j9246l9832
13621C278k6783L7199q625o705M166j2172Q315k0039j6075J1170L6891o2898j0622
13608f2900J9521L2267j587m1165K1267P758N856k5050l1205K2071L3010J530
13596a8627J1491o132l4360j0758J8980J2671P426P510P219p197n43J1678k1228
13583b1870k238L3800O456k2106J3251l634k3139M425r470l1155M0788K0007m235
13570H80q197o913J0873P030k657j2641k0059k5307M4659K1213j3293Q848O066
$$ plain form
13659 -19502 -66245 -69973 -19727 -8114 1244 37176 26296 36907 43351 55798 45178 43991
13647 43991 37496 31156 21722 741 -31539 -47718 -38803 -27717 -28775 -39025 -2802 30626 36074
13634 36074 28100 -8872 -7877 -20851 8158 9039 8174 12872 41312 71307 62356 43110 3278
13621 3278 -23505 13694 5069 -1636 2530 -9642 -1327 -21366 -37441 -26271 10620 -52278 -62900
13608 -62900 -43379 -11112 -12699 -53864 -32597 -24839 -18983 -44033 -75238 -53167 -20157 -18627
13596 -18627 -7136 -13268 -47628 -58386 -39406 -26735 -19309 -11799 -4580 -11777 -12320 -642 -21870
13583 -21870 -24108 9692 16148 -5958 7293 3659 -19480 -15055 -24525 -55680 -14892 5115 880
13570 880 -7317 -14230 -3357 3673 1016 -11625 -31684 -56991 -12332 8881 -4412 4436 10502
13557A0502K2656J5604j8363k6445j413r10q334K0153J0688K3140J5931l483m5506
13544A4220j8913J1250J5190p264N820k4638j9000J0496J0253r581k3991o280
13532d2438K1348j3407k0533j8178j0362O598L027r065J5252M3236K2052J4133
13520A1663j1713m366K4054L1305R533K503r581q678k1934O581K469L6234R709
13507G7779m3968m1820k5928J9798K9966K0937r223m308j9983k3975J2361j0758
13495a9122j2844K4382K2564K1559J8891o457L302Q06m3202J3698J8229k9950
13483A1856R125O1322R23p557J6620j5003l2538K6585J2662l2549l4303k5573
13471h430k3151J8464J6970J0730k360J2835L836j5749O603J3986j3456J1906
$$ plain form
13557 10502 33158 48762 30399 3954 2541 1631 -6703 13450 24138 47278 63209 59726 14220
13544 14220 -4693 6557 21747 14483 20303 -4335 -23335 -12839 -2586 -12167 -36158 -42438
13532 -42438 -21090 -34497 -55030 -73208 -83570 -76972 -73945 -83010 -67758 -24522 -2470 11663
13520 11663 -50 -4416 19638 50943 60476 62979 53398 44720 22786 29367 31836 68070 77779
13507 77779 33811 -8009 -33937 -14139 15827 36764 27541 23233 3250 -20725 -8364 -19122
13495 -19122 -31966 -7584 14980 36539 55430 48973 52275 53081 9879 23577 41806 11856
13483 11856 20981 82303 83226 75669 92289 77286 44748 71333 83995 51446 17143 -8430
13471 -8430 -31581 -13117 3853 14583 12223 25058 28894 13145 19748 33734 20278 32184
13459C2184K4296j009n1836j5953K5174J6813M456j2417l4679k5824j9973q33
13447e9601K1013J0661J0062k542J476j6942o312K4662J3672k4096M395K7041
13435C489j2432J1003O216j4879l5482J2528K9545n01J0292R33p901Q728m805
13422F734L1385P218k6483j8739k191M457k354K0416J6581l4790K884J978l892
13409C204m512K977L791k0716K3446K2183j9248j1093J6127l8569m0053j7590
13397h0053L372M3243J3617K562k087j8311J6235L3174J4122k3668J0786L7450
13385E0442j4477o4368j3402j8453k995M4005R196j7287K5640L6515L633k5422
13373A3027m252O860j3537O28L2539J6765j8199k9459j0810m914J4993R055k0665
$$ plain form
13459 32184 56480 55471 3635 -12318 12856 29669 34125 21708 -12971 -38795 -58768 -59601
13447 -59601 -38588 -27927 -17865 -20407 -18931 -35873 -42185 -17523 -3851 -27947 -23552 3489
13435 3489 -8943 2060 8276 -6603 -42085 -29557 -12 -513 9779 10712 2811 11539 6734
13422 6734 38119 45337 18854 115 -2076 2381 27 20443 37024 2234 5118 7096 3204
13409 3204 -1308 1669 5460 -15256 8190 30373 11125 32 16159 -22410 -62463 -80053
13397 -80053 -76681 -33438 -19821 -17259 -19346 -37657 -21422 11752 25874 2206 12992 50442
13385 50442 35965 -28403 -41805 -60258 -63253 -19248 -10052 -27339 -1699 34816 38449 13027
13373 13027 8775 15635 2098 2726 35265 52030 33831 4372 -6438 -11352 3641 12696 -7969
13360g969m401L8800L6179N586k7787j1760k061j0674J6722P411p35q107k2040
13347I164k1250j2042N784k0569M732j996J794J6281M3769M4577k230k4103l7969
13334E942l6681k5395K5573O9998J0291K359J8193k4897j7981l5834j1500Q640
13322a1292J0834L3074J006k5300j1032k4122n104k1435k567L7672K5028r220
13310b458j8620M569L5713K0144k2878k7893k5158J4609M4014J3282J6551q834
13298D3041n702K0377J5385k130P003m5504j7652K52J4501J356K18l528l448M6557
13284G0726K702m8346j9379L3313l2496k6254J2745L0660J4430Q449L990K782
13272E3322j0311j3646M553r336p253n881l9982K1250L8781J618l7667k6636P327
$$ plain form
13360 -7969 -12370 26430 62609 68195 40408 28648 26587 15913 32635 40046 39311 31204 9164
13347 9164 -12086 -24128 -18344 -38913 -34181 -36177 -34383 -18102 25667 70244 68014 43911 5942
13334 5942 -30739 -56134 -30561 39437 49728 52087 70280 45383 27402 -8432 -19932 -11292
13322 -11292 -458 32616 33622 8322 -2710 -26832 -31936 -53371 -55938 -18266 6762 -2458
13310 -2458 -21078 -16509 19204 39348 16470 -11423 -36581 -21972 22042 35324 51875 43041
13298 43041 37339 57716 73101 70971 77974 32470 14818 15070 29571 30927 31145 27617 24169 70726
13284 70726 73428 25082 5703 39016 6520 -19734 -6989 23671 38101 46550 50540 53322
13272 53322 43011 29365 33918 24582 17329 11448 -28534 -7284 31497 33115 -4552 -31188 -23861
13259b3861O5953j471l2956K4981R892k128p438J3576J4746L1172k0150p070j8180
13246D7066R154K9150L1467M2397L7047M6559M0765O0637R3275P2686K09787M21011
13234A141001P24277Q79494K58278n78707p52831n99446l78891j70729j24263
13225C98183j11119k7511n1519m9511l1835j4794k1688M346k0718Q961K3558k447
13213A03906J7129M748N70p299j2317l0415m1783N784k1211K8451k923K8455L0778
13200A03873J4550K4508J9212O033l7736l0331m4114n6063k5584J0411N4399J6474
13188E5632k7904j6543J3453N561j7983k5084O489P089p056p605K983J8493M6114
13175E3639N207K0572n784k0908q287N738Q855k7188K2142K7525m0733j4056M2817
$$ plain form
13259 -23861 42092 40621 7665 32646 42538 40410 32972 46548 61294 92466 72316 65246 47066
13246 47066 56220 85370 116837 159234 196281 242840 283605 344242 437517 510203 719990 1141001
13234 1141001 1865278 2744772 3003050 2424343 1671512 1072066 693175 522446 398183
13225 398183 287064 259553 208034 158523 126688 111894 90206 94552 73834 82795 106353 103906
13213 103906 121035 125783 126353 119054 106737 76322 34539 40323 19112 47563 44640 73095 103873
13200 103873 118423 142931 162143 168176 130440 100109 55995 -68 -25652 -15241 39158 55632
13188 55632 27728 11185 24638 30199 12216 -12868 -6379 710 -6346 -13951 -10968 7525 53639
13175 53639 58846 79418 73634 52726 44439 50177 59032 31844 53986 81511 40778 26722 69539
13162F9539K9064j8253l4235k6820J144L5359M5780P9410J26654J08401N5934
13151D71977n604o0594q9182o3685q4176q5416l2106J26R906l937Q389J280l3416
13138C3562k3730R064K5832K5433j2297P616L8278j293l4594k117J2368r07j427
13125G5788K566J3291L1765j9543m9351k3314J7697K4523K3865j485k1226l684
13113G0892q765K9268O2849M7310P4823J14370J12626L5246m9836j13747j21977
13102B53059j14999j29817n1251J2535m523k1616l0889k3938j4760j1175L5672
13091a01702J1914K663N705Q115J2962K2936p390P72n588N608J9093q479j71L0009
13077c553J2307Q431l991P158l5330m1647J3977M0637M1800K9861Q042k8879j5996
$$ plain form
13162 69539 98603 80350 46115 19295 20439 55798 101578 180988 307642 416043 471977
13151 471977 466373 405779 316597 252912 168736 83320 51214 51340 61246 57309 65698 66978 33562
13138 33562 9832 18896 44728 70161 57864 65480 103758 102465 67871 65754 78122 77215 75788
13125 75788 78354 91645 123410 103867 54516 31202 48899 73422 97287 95802 74576 70892
13113 70892 62127 91395 154244 201554 276377 390747 503373 538619 488783 375036 253059
13102 253059 138060 8243 -43008 -30473 -34996 -56612 -87501 -111439 -126199 -137374 -101702
13091 -101702 -89788 -87125 -81420 -73305 -60343 -37407 -44797 -44025 -49613 -44005 -24912 -33391 -33562 -3553
13077 -3553 8754 17185 13194 20352 -14978 -56625 -42648 -2011 39789 69650 77692 48813 32817
13064C2817L4484L0464N0656L1372k0701q536K0782j9722k8709j3946K3669K0265
13052A52895K1727K1676l4153j2006J0864j0109N664J1306j7720j296j4520n7437
13040G6891j1046J4709J4044L2852m2369k0099l6152l1784k638J0509m2359j0146
13028d7588K6759M6554L8707J1104j1987l3431J664N000Q410K6855p875k0576
13016D3596p260o612r382q549n821K8935K8463j8343j2812l2959J6959K4832R0
13003D1137L207J3059k955k4540o565k209q567l6315k0584q99K0698K6116l506
12990a923M593M7905N1202K9464k0331m450r28k3022k2853l0719j4682k6323Q991
12977c076M4783r351j4871m552K0963J9300K4409r084L1531J3259K069J1482j4820
$$ plain form
13064 32817 67301 97765 148421 179793 159092 150556 171338 151616 122907 108961 132630 152895
13052 152895 174622 196298 162145 150139 161003 150894 156558 167864 150144 148848 134328 76891
13040 76891 65845 80554 94598 127450 85081 64982 28830 -2954 -5592 4917 -37442 -47588
13028 -47588 -20829 25725 64432 75536 63549 30118 31782 36782 45192 72047 64172 43596
13016 43596 36336 29724 20342 11793 5972 34907 63370 45027 32215 -744 16215 41047 41137
13003 41137 44344 57403 54448 29908 23343 21134 12567 -23748 -44332 -45231 -24533 1583 -1923
12990 -1923 2670 50575 101777 131241 110910 106460 105532 82510 59657 28938 14256 -12067 -3076
12977 -3076 41707 32356 17485 12933 33896 53196 77605 68521 100052 113311 115380 126862 112042
12964A12042l6397N895J1163l1328j5524J102N8926J4846j2659J0435j872P533
12952A24162J4468l2988j4216k4522M096K9557j8192k4084o3205j03762J6300
12941i2386P0198K3317M0006P110J5605O4019J8335p291M078L3670M5632L5913
12929B58206P2248R5097P6600M4099k7186o2678j16390j63704l5607Q1716M3080
12918B65481J601o070n5810j1726j119n929P197j1619N681J789K6226J0774J0006
12905B36482Q059k8040n2582J5598M2564N5720P4115O9009N8022O4110P0569J37449
12893G51075K64156M74550O09225M58783J83586j69483n37328n41033m13451k82567
12883G97513j54236n9345n7649m4637p8153j04694m8115N899O8162J9847K3514
$$ plain form
12964 112042 75645 81540 92703 61375 45851 46953 105879 120725 108066 118501 116629 124162
12952 124162 138630 105642 91426 66904 71000 100557 82365 58281 -4924 -108686 -92386
12941 -92386 -22188 1129 41135 48245 63850 127869 146204 138913 142991 176661 222293 258206
12929 258206 330454 425551 502151 546250 519064 456386 339996 176292 140685 222401 265481
12918 265481 267082 261012 205202 193476 192357 186428 193625 182006 187687 189476 215702 226476 236482
12905 236482 244541 216501 163919 179517 222081 277801 351916 420925 478947 543057 613626 751075
12893 751075 1015231 1489781 2099006 2557789 2741375 2571892 2034564 1493531 1080080 797513
12883 797513 643277 583932 526283 481646 403493 298799 250684 256583 324745 344592 368106
12872C68106L1021j276K4716P969j7007L462J1493n324k878K0027P2062O0078
12860E72449K4369l0095j341J3122P611j4913k1991M762n525K8185M9741L3870
12848F60244Q1290O1596J2210N511R024J9097q589k3391M3087J05370R0456M1621
12836A097526j2887J3858M5739N0032N6003J08188O6560L7200P2001R4744Q5635
12825A714599O7996R9221J43343K14228K30047J95918K55114L45789L33073L60666
12815C959994L61828M58268N61759O47643P23813P72687Q14985R87560J361077
12806A0649614J881996K586349L301696M209940N317835P028210R660151J2821818
12798E7457609J6772791K4768832M1440122P3762651J31743496J73600984N0239534
$$ plain form
12872 368106 399127 397851 422567 430536 413529 416991 428484 423160 420282 440309 512371 572449
12860 572449 596818 566723 565382 578504 586115 571202 549211 553973 548448 576633 626374 660244
12848 660244 741534 803130 815340 820851 829875 848972 840383 816992 860079 965449 1055905 1097526
12836 1097526 1084639 1098497 1144236 1194268 1250271 1358459 1425019 1462219 1534220 1628964 1714599
12825 1714599 1782595 1881816 2025159 2239387 2469434 2665352 2920466 3266255 3599328 3959994
12815 3959994 4321822 4780090 5341849 5989492 6713305 7485992 8300977 9288537 10649614
12806 10649614 12531610 15117959 18419655 22629595 27947430 34975640 44635791 57457609
12798 57457609 74230400 98999232 140439354 214202005 345945501 519546485 569786019
12791E69786019j15676216j48321667j13614211o7529935l7037594k1749399j4970025
12784E0886972j1352842q258915n979279m316739l058581k363859j895194j541666
12776A2119897j422631j381797j202635q57728o49736n23292m94396m93611m52704
12767D641367l44426k29293k38926k66355j90810j11157j47489j48236j99310
12758B765365k01481j70053j26283j18490j16726q0765j27852j02813r7096j22159
12748A501647p2443k4742l6485k5967l5566l7181q0534q5617n8749m8897m4742
12737I50724o2404k5199r11K8188J6591l0062k3566n2257j01855m9867J8689P752
12725F75823m6693m9295m258M6173J3635j5695k045m7404k8497r042j7455k1315
$$ plain form
12791 569786019 454109803 305788136 192173925 124643990 87606396 65856997 50886972
12784 50886972 39534130 31275215 25295936 20979197 17920616 15556757 13661563 12119897
12776 12119897 10697266 9315469 8112834 7255106 6605370 6082078 5587682 5094071 4641367
12767 4641367 4296941 4067648 3828722 3562367 3371557 3260400 3112911 2964675 2765365
12758 2765365 2563884 2393831 2267548 2149058 2032332 1951567 1823715 1720902 1623806 1501647
12748 1501647 1429204 1404462 1367977 1342010 1306444 1269263 1188729 1103112 1044363 995466 950724
12737 950724 888320 863121 862210 890398 906989 876927 853361 801104 699249 649382 668071 675823
12725 675823 629130 579835 575577 621750 635385 619690 617645 570241 541744 532702 515247 493932
12713D93932J0150Q096P773j8184n830J72m5244k1679J4202j2391k0328K38k1927
12700C88980n6893n9013j4875O7295L4559M0498l73n0338k0518k066J9057K9900
12688C76213P070Q215M3915q25l0542m7984j7618J3062m898j3960j9049J6789
12676C30388J2735J3043K890J6608J1164L6714R0106M505o7177q2151j2564N7147
12664D13408P6631N1136l3069j64127j84953o0200n1696n6916J2492L3867J0781
12653D7354L6717Q9017N0685l4947j5136N2620J4678p692L0448K3372j3104L9027
12641C13039q163p3453p1092j8718K7186N0547J5142j9662n4079k4467j3310j7828
12629A05142m8664J5661L8579k1623j2568N432K9733K2800l67k1213r410q812
$$ plain form
12713 493932 504082 512178 519951 501767 495937 496109 450865 429186 443388 430997 410669 410907 388980
12700 388980 332087 273074 258199 325494 360053 400551 400178 349840 329322 327256 346313 376213
12688 376213 383283 391498 435413 434588 404046 356062 338444 351506 346608 332648 313599 330388
12676 330388 343123 356166 359056 375664 386828 423542 513648 518153 450976 368825 356261 413408
12664 413408 490039 541175 508106 343979 159026 98826 47130 -9786 2706 36573 47354
12653 47354 84071 173088 223773 188826 173690 226310 240988 233296 263744 287116 274012 313039
12641 313039 304876 231423 160331 141613 168799 219346 234488 214826 160747 136280 122970 105142
12629 105142 56478 72139 110718 89095 76527 81959 111692 134492 134125 112912 103502 94690
12617I4690P965J2786J0306k5008l3193J0167J6334o370R836o232k575j7506r360
12604F1840Q944J3673k0755l4770O642O2322k3379m6876J032m474O2253L4497
12592A20949j3195m2406K8524Q1149M3357k2452m2295k5321j0713j6591j4509
12581H6497p155J6960J9069J3650o362o941l7707k8421j427J4967p230j2108P247
12568E1039r672j0129K057L8215K8309l3953R754K707o081j8290k205J9880N8909
12555A30540K1137k6277m1051j3973J3085k7018q334L8067J6326m1466J6371N843
12543H3250m3502l3918K7018N4909J8233k8097j0347Q987J8802J8543j7093J0829
12531A07614M7275K707j8220k7594o186k504j5028j9408j7043p505Q862K8202
$$ plain form
12617 94690 102655 115441 125747 100739 67546 77713 94047 87677 97513 91281 88706 71200 61840
12604 61840 70784 84457 63702 28932 35574 97896 74517 27641 28673 24199 86452 120949
12592 120949 107754 65348 93872 175021 218378 195926 153631 128310 117597 101006 86497
12581 86497 79342 96302 115371 129021 122659 115718 78011 49590 48163 63130 55900 43792 51039
12568 51039 41367 31238 33295 71510 99819 65866 75620 78327 72246 53956 51751 71631 130540
12555 130540 151677 125400 84349 70376 83461 56443 48109 86176 102502 61036 77407 83250
12543 83250 39748 5830 32848 87757 105990 77893 67546 76533 95335 113878 96785 107614
12531 107614 154889 157596 139376 111782 105596 103092 88064 68656 51613 44108 52970 81172
12519H1172R113j8285m756M598N412m674k7512r013j0096p05J9718j3113m412
12506B7447K9703J2478k0897k7269J7204O9615N2207N813l9613j8984K759K2034
12494A32497L8077M09l6664R679O1043K4736P283J1492m1021l3640k1576m7011
12482A05304l9775o3746l9179O293K1326r014L1697L7145n840l2461N75L15K3667
12469C6307K1479m4334J0922J8857o49l5908J0609K1259K651k0907j2698R641
12457A7229j3398J214P212j8418k7110L8766K3495j4096L080L6124q256j1635
12445C4207k2713O151o199k1839K848K6952L923m600p72J1082Q28M908M09k1509
12431A3676o1067k2950M8461K5144J6811L1577L5892j6066j0019j7331q221k5443
$$ plain form
12519 81172 90285 72000 67244 71842 77254 72580 45068 36055 25959 25254 44972 31859 27447
12506 27447 57150 69628 48731 21462 38666 108281 160488 166301 126688 107704 110463 132497
12494 132497 170574 170983 134319 143998 205041 229777 237060 248552 207531 173891 152315 105304
12482 105304 65529 1783 -37396 -31103 -9777 -18791 12906 50051 44211 11750 12325 12640 36307
12469 36307 57786 13452 24374 43231 42582 6674 17283 38542 41193 20286 7588 17229
12457 17229 3831 5045 12257 -6161 -33271 5495 28990 14894 17974 54098 45842 34207
12445 34207 11494 17645 11446 -10393 -7545 19407 23330 18730 17958 29040 29868 34776 35185 13676
12431 13676 -47391 -70341 -21880 3264 20075 51652 87544 71478 61459 44128 35907 10464
12419A0464J0965J5645J049J0255l611r612J037l322o455K1841l2j7455K4794
12406E5563Q972J0425J5337K5501k0181l6730j1313J1139J6388K6703l9769m8571
12394A3464j7106j1077K3296L9039N29K1467j1762j5483k9426j8009J1502L9696
12382D6130K092k341L0433P14p567K3386m04j0505L2333O636k5987m7231j7353
12369C0336K8252j4427k2602K2972M3019L7147j1793m473q923l7493k6598o797
12357B8620L6394Q6943Q0472N9904K1981K1101Q5975J57745K85410M68274P58882
12346B091701Q34235K9604o96915p69275n46454l30072k09513r2398l8873l7816
12336B34224m2202l9263K4370J1958o8277j3823K2568k4649m7045j0056L426K2364
$$ plain form
12419 10464 21429 37074 38123 48378 44767 35155 36192 32870 26415 48256 48224 30769 55563
12406 55563 64535 74960 90297 115798 95617 58887 47574 58713 75101 101804 62035 13464
12394 13464 -3642 -14719 8577 47616 48145 69612 57850 42367 12941 -5068 6434 46130
12382 46130 48222 45881 76314 77028 69461 92847 92443 81938 114271 120907 94920 47689 30336
12369 30336 58588 44161 21559 44531 87550 124697 112904 108431 99508 62015 35417 28620
12357 28620 65014 151957 232429 292333 314314 335415 421390 579135 864545 1332819 2091701
12346 2091701 2925936 2955540 2258625 1489350 942896 612824 403311 310913 272040 234224
12336 234224 192022 152759 177129 189087 120810 106987 129555 104906 57861 47805 51231 73595
12324G3595K7725k348j2837j7930j0268j2376R525k3452j1581j341J0068l3096
12312d316o42J9433J4213M1806j1353j2227J2229L0448o423l1515j3433R445j0202
12299C7463k7567l324K1092j1232k990L8713k0220Q725L5474J1211n252k4428
12287E7665l4644J0849j5166j1734J0430k4507J7709M4688J531k2035J5269J2924
12275F2979K8813O188l6413j8991j1464k0969L332J8168J0226Q343j316k929r996
12262C5971j2625n19L611K2641R062K2111k1037j6795j1003l0550k3252K4877
12250B492K743J3483M7979j2355l0615l3011j4407K3788J2599j7715J2784J6947
12238B4712K0588j6559N883j4863m506j6699M049m450J4956R732n725L892j3909
$$ plain form
12324 73595 101320 98972 86135 68205 57937 45561 55086 31634 20053 18712 28780 -4316
12312 -4316 -4958 14475 28688 70494 59141 46914 59143 89591 83168 51653 38220 47665 37463
12299 37463 9896 6572 27664 16432 13442 52155 31935 40660 76134 87345 82093 57665
12287 57665 23021 33870 18704 6970 17400 -7107 10602 55290 56821 34786 50055 62979
12275 62979 91792 97980 61567 42576 31112 10143 13475 31643 41869 50212 48896 45967 35971
12262 35971 23346 22827 26438 49079 58141 80252 59215 42420 31417 867 -22385 2492
12250 2492 5235 18718 66697 54342 23727 -9284 -23691 97 12696 -5019 7765 24712
12238 24712 45300 28741 34624 19761 15255 -1444 2605 -1845 13111 22843 17118 21010 7101
12225G101j6732O610K8197J7341J553m335j537l581L2436j0997l462k5896O082
12212C2780J717q274K7751j2374N456K0100j6968k3623m3454k8804J6549K6860
12200b284L0552M117k3033j5030m273q374k6789M5381M719k608J7476m822R466
12187B4498J1478M0625J059n4468k4068j1452j117K0570P381J3152J3848P954
12175D9460j7993l5255k8077K0933K7712J3057J3316j3937k5711K8393K0761M9
12163E2708l5504O39R29J8417K1775j9311m1169k4197P100Q496J4074j5478K7624
12150A6103N750n5813L2076L0931j0081K1907o343m2462m1427k4116O293M5933
12138b1249j5210k1626K3912K1737j5289k6152j1700m756R501J3375N7532J6419
$$ plain form
12225 7101 -9631 -3021 25176 42517 44070 39735 38198 34617 67053 56056 52594 26698 32780
12212 32780 34497 26223 53974 41600 47056 67156 50188 26565 -16889 -45693 -29144 -2284
12200 -2284 28268 32385 9352 -5678 -9951 -18325 -45114 267 4986 2378 19854 15032 24498
12187 24498 35976 76601 77660 23192 -876 -12328 -13445 7125 14506 27658 41506 49460
12175 49460 31467 -3788 -31865 -10932 16780 29837 43153 29216 3505 31898 52659 52708
12163 52708 17204 17843 18772 37189 58964 39653 -1516 -25713 -18613 -10117 3957 -11521 16103
12150 16103 21853 -33960 -1884 29047 18966 40873 34530 -7932 -49359 -73475 -67182 -21249
12138 -21249 -36459 -58085 -34173 -12436 -27725 -53877 -65577 -70333 -60832 -47457 10075 26494
12126B6494N480m741K4666K2549n2140m9174k5518o441l417J1021Q949K29J5960
12113b6083J6669k514k5788P855K3449j7926K4745K0102J301L8790K6510K6769
12101A13879q287J0548n185n8655m1226k4485j0484K8335K4528l977o508N082
12089B3565M5764K602j4404O764p574j6356o173J8670J0717j6207j6340j6368
12077A4660K6701k3819p870J0158J1728M6553Q055l5563l3467p341J0592k3259
12065b872k1880N952M53L0514J8540K564o940Q030L2421l0157j0372k3042n528
12052b317q631R685K3850p963l092O624J095q638j3029j3558M8959j2188m924
12039A5873n309L8678Q777n182j731j5209M919q174j5094j4961j1439k167M861
$$ plain form
12126 26494 31974 27233 51899 74448 22308 -26866 -52384 -58825 -62242 -51221 -42272 -42043 -26083
12113 -26083 -9414 -11928 -37716 -29861 -6412 -24338 407 20509 21810 60600 87110 113879
12101 113879 105592 116140 110955 52300 11074 -13411 -23895 4440 28968 24991 18483 23565
12089 23565 69329 71931 57527 64291 56717 40361 34188 52858 63575 47368 31028 14660
12077 14660 41361 17542 9672 19830 31558 78111 86166 50603 17136 9795 20387 -2872
12065 -2872 -24752 -18800 -18347 12167 30707 33271 26331 34361 66782 36625 26253 3211 -2317
12052 -2317 -10948 -1263 22587 14624 11532 18156 19251 10613 -2416 -15974 32985 20797 15873
12039 15873 10564 49242 58019 52837 51106 35897 40816 32642 17548 2587 -8852 -11019 -6158
12026f158j8394k2709L7719J0521k9533m712L5636L2148R349j5530j5017J5306
12014B8626j9540k2445o725j6484p955q04J5614o397j1195K4670M136j8384P944
12001b8939n865l4459K2941K1137K9086J7746q508J6899K0158K4807l584k3460
11989D7959p705K2210K0719Q921l3916n1110j965J3058k2563J8855J3972L4809
11977F3244j3256l7569N16j8411N618K6264j9952k3419R470J3593L0215O529K1005
11964F3847j074m6713j2829J2862j0153O387r123j3011J773K4373L885r905n139
11951E180j0442J311L1877L0253q803m1442l1256J0921K263O311o045J3335J7351
11938B0814r422K4742k6582l6896j1058J8013O862J6483k6151n724J5343K0909
$$ plain form
12026 -6158 -24552 -47261 -9542 979 -28554 -33266 2370 34518 43867 28337 13320 28626
12014 28626 9086 -13359 -20084 -36568 -44523 -45327 -29713 -36110 -47305 -22635 -18499 -36883 -28939
12001 -28939 -34804 -69263 -46322 -25185 3901 21647 13139 30038 50196 75003 71419 47959
11989 47959 40254 62464 83183 92104 58188 7078 5113 18171 -4392 14463 28435 63244
11977 63244 49988 12419 12935 -5476 142 26406 6454 -16965 -7495 6098 36313 42842 63847
11964 63847 62773 16060 3231 16093 5940 12327 3204 -9807 -8034 16339 20224 10319 5180
11951 5180 -5262 -3951 27926 58179 49376 7934 -23322 -12401 -10138 -3827 -9872 3463 20814
11938 20814 11392 36134 9552 -27344 -38402 -20389 -13527 2956 -23195 -28919 -13576 7333
11926G333R712J8621m6960m73L4824p2k9942j8082M6631J5686K3738k150K59k0525
11912C8600L4164m710q593j4781k2129j140R307K3210O802k323p425j5867l5899
11899g84J6503J8211J636k0176M211L7596K6358l6745m2246j9392j9629R984l245
11886b7718l514j6178J5969J6369k8615n0J1321M9917K8570J0127j7842j9139
11874A9217j0325m4512P63Q066l926j1439j9141J7300p117M7556m4j2223j7199
11861c3024J7033L3183j5976k4976K5464K5805J324N825K0064J1512p818l1505
11849B6911j6398k4025K4540L0710K2628j8169l3918j0007O293K2142l765j5045
11837A1897Q452m735l455K1719N496J3268j4608l2789J78J4673j5214j7337K9026
$$ plain form
11926 7333 17045 35666 -11294 -11767 23057 22985 -6957 -25039 21592 37278 61016 58866 59125 38600
11912 38600 72764 68054 59461 44680 22551 21411 30718 53928 60730 58407 50982 35115 -784
11899 -784 15719 33930 35566 15390 19601 57197 83555 46810 4564 -14828 -34457 -24473 -27718
11886 -27718 -31232 -47410 -31441 -15072 -43687 -43737 -32416 17501 46071 56198 38356 19217
11874 19217 8892 -35620 -34857 -26791 -30717 -42156 -61297 -43997 -51114 -3558 -3602 -15825 -33024
11861 -33024 -15991 17192 1216 -23760 1704 27509 28833 34658 54722 66234 58416 26911
11849 26911 10513 -13512 11028 41738 64366 46197 12279 2272 8565 30707 26942 11897
11837 11897 20349 15614 12159 33878 39374 52642 38034 5245 5423 20096 4882 -12455 16571
11824A6571k1118j1339L1064j2677k0446J4997R210J3495N770l0000j8665M4002
11812B0864M177l4848j4681N88r658j669M2074L4880N728J0101k701j3777l9117
11799A961j6334j3043M302K1450J5274o097k0246P889N1361L4987J2398n5454
11787C8448p1658L914J258o841K8854K9683Q141j589l9580p489k0992N995J1951
11774a9905j0510P396l201K1888J3461J2775R261R447M4364l4497m4541l5679
11762b9741P24J7269M6709L1042m9594m2651N37K2432j4274p832j3846p293l850
11749e0368J9563J279K5316L1300l156k9878k7490K1363K4210R532k7134q957
11737a4420j7502J2727N3385j4042l077J1190p048J202k3365n591q4j8963j1518
$$ plain form
11824 16571 -4547 -15886 15178 2501 -17945 -2948 6262 19757 25527 -4473 -23138 20864
11812 20864 25041 -9807 -24488 -23900 -33558 -35227 6847 41727 47455 57556 54855 41078 1961
11799 1961 -14373 -27416 -23114 -1664 13610 7513 -12733 -4844 46517 81504 93902 38448
11787 38448 -33210 -29296 -28038 -34879 -6025 23658 31799 30210 -9370 -16859 -37851 -31856 -19905
11774 -19905 -30415 -23019 -26220 -4332 9129 21904 31165 40612 84976 50479 5938 -29741
11762 -29741 -29017 -11748 34961 66003 16409 -26242 -25705 -3273 -17547 -25379 -39225 -46518 -50368
11749 -50368 -30805 -29526 -4210 27090 23934 -5944 -33434 -12071 12139 21671 -5463 -14420
11737 -14420 -31922 -19195 34190 20148 17071 28261 21213 22415 -950 -6541 -6625 -25588 -37106
11724c7106O644L9618L7122q483k5876k7429j9251J2928P232j5858j0824j548
11712d2831J249l2090J0337L8575M2022J1322k5822j4315J0617j3720j8517P395
11700b5778K5714j4806O385j7902J2255K4764Q886j620R315r530n362r436j5657
11687a2772J5457K447O226l5247j9897K1134K2946p880M599J6971m103K7004O126
11674D3011k0571m7745J8351L3675L217k2051o197K0154N250q34q177k7866n831
11661a5614R131J6162k606j3133J8753J0039J4444j5113j2891k6806k4540K0632
11649b1542K0685J1893n40m3923o669J8263J4178r769k5080k0850L9124L4815
11637A0585j9582N8929R611j5267j9952r225j9181R250l3979R663J2851n979N5521
$$ plain form
11724 -37106 -30462 9156 46278 37795 11919 -15510 -34761 -21833 -14601 -30459 -41283 -42831
11712 -42831 -41582 -73672 -63335 -24760 17262 28584 2762 -11553 -936 -14656 -33173 -25778
11700 -25778 -64 -14870 -8485 -26387 -14132 10632 19518 17898 27213 17683 12321 2885 -12772
11687 -12772 2685 5132 11358 -23889 -43786 -22652 294 -7586 -2987 13984 9881 36885 43011
11674 43011 22440 -25305 -6954 26721 29938 7887 1690 21844 27094 26260 18083 -9783 -15614
11661 -15614 -6483 9679 7073 -6060 12693 22732 37176 22063 9172 -17634 -42174 -21542
11649 -21542 -857 11036 10496 -33427 -40096 -21833 -7655 -17424 -42504 -63354 -24230 10585
11637 10585 -8997 49932 59543 44276 24324 15099 -4082 5168 -28811 -19148 -6297 -12276 43245
11624D3245N4508r116l6029j2618J6195k9092l7552K2182K2442m3324l9506n354
11612e4019J2152Q250j7968J8563M1856q240m9861Q49M3107N2505k195j4920q8
11599B9991j6969J64Q216K612R429o872J0124j2530m4018j1506K7970K8694N745
11586C1050K579j8929m352k9379l5764J9512j1253K8166N635j150P144J4843J6493
11573B4595j3260J0347K389j2707k3625K4132q334M373K1205K8080k3343k358
11561C1494n831M63j6184m6539K9663L819K8853p472j6595K691j1897j4056R383
11548a2208M2546j2930m0078R100R565j0773l0170Q426j5438J3063J3978M4483
11536A9564J6968N775o169j5471l201J2521q428l2807K6736K9439N400j3297l7175
$$ plain form
11624 43245 97753 88637 52608 39990 56185 27093 -10459 11723 34165 -9159 -48665 -54019
11612 -54019 -41867 -33617 -51585 -33022 8834 594 -49267 -48418 -5311 47194 44999 30079 29991
11599 29991 13022 13186 21402 24014 33443 26571 36695 24165 -19853 -31359 -3389 25305 31050
11586 31050 33629 14700 10348 -19031 -54795 -35283 -46536 -18370 -12735 -13885 -6741 8102 24595
11573 24595 11335 21682 24071 11364 -12261 11871 3537 7910 29115 57195 33852 31494
11561 31494 25663 26126 9942 -36597 -6934 -3115 25738 18266 1671 4362 -7535 -21591 -12208
11548 -12208 30338 17408 -22670 -13570 -4005 -14778 -44948 -36522 -51960 -38897 -24919 19564
11536 19564 36532 42307 36138 20667 17466 29987 21559 -11248 15488 44927 50327 37030 -145
11523a45k291m408J0147J3839k3483j6220J8082L68n719K7768O969M842m960n039
11509A9750j3212o401j241N3889r153m932N956r912o193J8998K8428k334j2225
11496F1418j7484nJ5659J5658k7348j6417m943K099j112j3162j4837q398K6732
11483A7860j0639l5744O594K0859j2369j6583J7705L0098M862o568M140l2155
11471a1940J5341m4315J4881K3197l820k9141P544L0572O796k636j3987k584J056
11458i036k9736L494J0189m002k9256L0055R509j4537J0152j4525k3017k2909
11446h3619K6332M389J4830l988L5685q791k1859R112K159K6498K2955j6199m643
11433B861K556j1853J3351j3852j8788K4075J2321j2813k0483q855l353M01P014
$$ plain form
11523 -145 -2436 -6844 3303 17142 -6341 -22561 -4479 -4111 -9830 17938 24907 29749 24789 19750
11509 19750 6538 137 -1104 52785 43632 38700 44656 34744 28551 47549 75977 73643 61418
11496 61418 43934 43929 59588 75246 47898 31481 26538 28637 27525 14363 -474 -8872 17860
11483 17860 7221 -28523 -21929 -1070 -13439 -30022 -12317 17781 22643 16075 20215 -11940
11471 -11940 3401 -40914 -26033 -2836 -6656 -35797 -28253 2319 9115 6479 -7508 -10092 -9036
11458 -9036 -38772 -35278 -25089 -29091 -58347 -28292 -18783 -33320 -23168 -37693 -60710 -83619
11446 -83619 -57287 -52898 -38068 -42056 -6371 -15162 -37021 -27909 -25750 748 23703 7504 2861
11433 2861 5417 -6436 6915 -6937 -25725 -1650 10671 -2142 -22625 -31480 -34833 -34432 -27418
11420b7418P720K1240J1111m780K891j2199M223k240p409J5284O39K6942p138
11407B8866l944j0678k7483R537p12J984k0047M419K7201J5646K6571J4676m140
11394F1896k2580j6336l0819J3013K3515N360O024m873j3546l4112L0991L0125
11382D8658P45Q028q19j5512J3369P352K016k1026l6246k9717l5437j7687o636
11369h2912k602M9132Q742L820J5831j2330m5408j892J9854K2503N635M363P064
11356h200R820K5442j0341j1738L0630Q39j3073J4285k4869k5487O646J7078J5639
11343B6671k8921k2162j156j789m66l3250R727L2266M281j5514k6205l852K3510
11330c6860R946J5986K5818n682j2014Q6q213M393q975l5192o602K6589O796K441
$$ plain form
11420 -27418 -19698 1542 12653 7873 10764 -1435 2788 548 -6861 8423 9062 36004 28866
11407 28866 24922 14244 -13239 -3702 -4414 -2430 -22477 -18058 9143 24789 51360 66036 61896
11394 61896 39316 22980 -7839 5174 28689 34049 40073 35200 21654 -12458 18533 48658
11382 48658 49403 57431 56612 41100 54469 61821 63837 42811 6565 -23152 -58589 -76276 -82912
11369 -82912 -85514 -36382 -27640 -23820 -7989 -20319 -65727 -67619 -47765 -25262 -19627 -15264 -8200
11356 -8200 1620 27062 16721 4983 35613 36452 23379 37664 12795 -12692 -6046 11032 26671
11343 26671 -2250 -24412 -25568 -27357 -27823 -61073 -51346 -19080 -14799 -30313 -56518 -60370 -36860
11330 -36860 -26914 -10928 14890 9208 -2806 -2720 -10933 -6540 -15515 -50707 -57309 -30720 -23924 -21483
11316b1483J0820k7984J3685K2802k737Q537J1457Q839k8379J3434J0484O396
11304B5871O566p665l5798l6474J3557M6974k2870M003l2415m4461K9364P7801
11292B4453M9924J9279n4667o7780M153M4369J3428r949k3727l7041J981M6406
11280A0829o25m2090L3816k5180k7576o735J3585K1638K4661J0325p998o06Q840
11267A2884j1879M616J4992N11k993r477k5702J4920n654P732L5424j7l0100k4389
11253a9132k6844q974j4506K1403K1535N677N80J8479r730J2298J8815J2066k1164
11240A0503j4572j5606Q490J3330j4382m781p624o12j0957J0620K8651O255l9337
11227c0022J9796j0658j8658K5185J8081J2488m3377k4213k835q198j2030j6868
$$ plain form
11316 -21483 -10663 -38647 -24962 -2160 -4897 3640 15097 23936 -4443 8991 19475 25871
11304 25871 32437 24772 -11026 -47500 -33943 13031 -9839 -5836 -38251 -82712 -53348 24453
11292 24453 74377 93656 38989 -28791 -24638 19731 33159 23210 -517 -37558 -35577 10829
11280 10829 10204 -31886 1930 -23250 -50826 -57561 -43976 -22338 2323 12648 4650 4044 12884
11267 12884 1005 5621 20613 21124 18131 8654 -17048 -2128 -7782 -50 35374 35357 5257 -19132
11253 -19132 -45976 -54950 -69456 -48053 -26518 -20841 -20261 -1782 -11512 786 19601 31667 10503
11240 10503 -4069 -19675 -11185 2145 -12237 -17018 -24642 -25254 -36211 -25591 3060 9315 -30022
11227 -30022 -10226 -20884 -39542 -14357 3724 16212 -27165 -51378 -54213 -62411 -74441 -91309
11215i1309K2638L7012m203K0026l035J1570L9905L105l9092p1459k496N6446
11203b0892J2482m72K5152L664R797k509j8513l2442k1126p038Q078M3771N924
11190E876J5163M97L79j1648j8131R54J677j9088K3967J5940J1080l839l1894
11177i067j3116L3877J2077j8317k9685j3011L678K149J5173N5872k429n956J2889
11164D4134l3245k5962J1925L1772N864J2323k4187k0414j7052j0192K3479m146
11152e701P246J3024m346L627M6621J1380o11k4221j9630k792l0986l8901q010
11139e3300J0490J4969M4315J4125r570k6032K778j1074j9650R589J1224m756
11127a6892j7460K421K676J636K1303J6801j0777r090j5022j7395k4996l2792
$$ plain form
11215 -91309 -68671 -31659 -35862 -15836 -18871 -7301 32604 35709 -3383 -74842 -77338 -20892
11203 -20892 -8410 -8882 16270 19934 29731 27222 8709 -23733 -44859 -51897 -43819 -48 5876
11190 5876 21039 21536 21915 10267 -7864 -6910 -5233 -24321 -354 15586 26666 22827 -9067
11177 -9067 -22183 11694 23771 5454 -24231 -37242 -33564 -31415 -16242 39630 37201 31245 44134
11164 44134 10889 -15073 -3148 28624 34488 46811 22624 2210 -14842 -25034 -1555 -5701
11152 -5701 1545 14569 10223 13850 60471 71851 71240 47019 27389 24597 -6389 -45290 -53300
11139 -53300 -42810 -27841 16474 30599 21029 -5003 -2225 -13299 -32949 -23360 -12136 -16892
11127 -16892 -34352 -31931 -29255 -27619 -6316 10485 -292 -9382 -24404 -41799 -66795 -99587
11115i9587R2M7536L4917L173L177m462l1259o184L9799P857n396o299J3964j9508
11101b2180m523j2092j0901K8353N5055L1265q691J6691q059n0663k1406R235
11089B084J3167j4037k9467J9737K1387J8452k269r268l0605K806M9923j1319
11077C0591k0820J8295J8754N498o630j4529o310K079P437O879m310k9243N537
11064A3228K0433r281l44n77M83n372l1151k8242K1022J2887Q23l7504j8985j5467
11050g8047J1522M5948O465M567M759K5926J1194l9082k1162L214j523J324J5690
11037i205L789j9474k0432J8002J4457J5834j3299J2705J830j1558j59j2022j6269
11024c5801j3834r579L1540k2360o768J2103J5226r51K18L6550j738J5634k5973
$$ plain form
11115 -99587 -99495 -51959 -17042 -13869 -10692 -15154 -46413 -52597 -12798 -4941 -10337 -16636 -2672 -22180
11101 -22180 -26703 -38795 -49696 -21343 33712 64977 56286 72977 64918 14255 -7151 2084
11089 2084 15251 1214 -28253 -8516 12871 31323 29054 19786 -10819 -8013 41910 30591
11077 30591 9771 28066 46820 52318 45688 31159 24849 26928 34365 41244 36934 7691 13228
11064 13228 33661 24380 24036 23459 23942 18570 -12581 -40823 -19801 -6914 -6091 -43595 -62580 -78047
11050 -78047 -66525 -20577 -14112 -9545 -4786 21140 32334 -6748 -27910 -24696 -26219 -24895 -9205
11037 -9205 -5416 -24890 -45322 -27320 -12863 2971 -10328 2377 4207 -7351 -7510 -19532 -35801
11024 -35801 -49635 -59214 -27674 -50034 -56802 -44699 -29473 -30424 -30206 6344 4606 20240 -5733
11011e733J2779J7646J3695k3588O572o309P87m571K176o24p835J8207j3299J5412
10997B5315O641k0441o995Q495j501J782J556m250k6049k759R549J2079J478l906
10983I94q408n325J6375J2231J22K346K028n318j3324J9047p778K3789J6870k1427
10969C2222k0218j6390j800p390j6752O610P878K565L0808J8416r339o3925j2155
10956d9470K4365K5034J5413L8453K613j0711k1962K374N559J5082j2153q160
10944B6437M370K106l6976k2027N1215q390k7887P797l4808P044K021M166j898
10931b6830Q108K2988n382R376J787K5278O449j7753m4301j6234q63K6833k09
10918a0753N155r279j656j7814L4815K4947K839J544n564J1647p862Q742m544
$$ plain form
11011 -5733 7046 24692 38387 14799 21371 15062 15849 11278 13454 12830 4995 23202 9903 25315
10997 25315 31956 11515 4520 13015 11514 13296 14852 10602 -15447 -18206 -8657 3422 4900 994
10983 994 -7414 -12739 3636 15867 15989 18335 20363 15045 1721 20768 12990 36779 53649 32222
10969 32222 12004 -4386 -6186 -13576 -30328 -23718 -15840 -13275 17533 35949 26610 -37315 -49470
10956 -49470 -25105 -71 15342 53795 56408 45697 23735 26109 31668 46750 34597 26437
10944 26437 30807 32913 -4063 -26090 25125 16735 -11152 -3355 -38163 -31119 -29098 -24932 -26830
10931 -26830 -18722 4266 -1116 8260 10047 35325 41774 24021 -20280 -36514 -37377 -10544 -10753
10918 -10753 -5598 -14877 -16533 -34347 468 25415 28254 29798 24234 35881 28019 36761 32217
10905C2217j2698l5403r579k0153L5523J5056r15K296k594j61l727m773l0548
10892c5459q475J5351J8113P797K4306k1188k5495J9702J9245j2163j1307Q073
10880a500K4788j2870l2705J1339K286o705k4280k0236Q892L6286O600N971J9832
10867A7698k4108J0091k0362j3516K4463K056m0949J8830M0206k6922j5144k870
10855c0527L640O819K0759K1358K0913K1796j429k8740j5349l698o948q146K3555
10842B4003k1881k2499L7010J008k8331q623l2988l2567L0328M4992N2615K7k8195
10829A4899j0429j3557l0078k5542L4148P279K0046R484J3554j1454M515k663
10817A0202J1432J5708j6143k1777k4854l1015l360K6480O407J7045n3445M4496
$$ plain form
10905 32217 19519 -15884 -25463 -45616 -10093 4963 4048 6344 3750 3589 -138 -4911 -35459
10892 -35459 -43934 -28583 -10470 -2673 21633 445 -25050 -5348 13897 1734 -9573 -1500
10880 -1500 23288 10418 -22287 -10948 -8662 -15367 -39647 -59883 -50991 -14705 -8105 -2134 17698
10867 17698 -6410 3681 -16681 -30197 -5734 -3678 -44627 -25797 14409 -12513 -27657 -30527
10855 -30527 -26887 -20068 691 22049 42962 64758 63329 34589 19240 15542 8594 448 24003
10842 24003 2122 -20377 16633 17641 -10690 -19313 -52301 -84868 -54540 -9548 43067 43094 14899
10829 14899 4470 -9087 -39165 -64707 -30559 -23280 -3234 6250 19804 8350 12865 10202
10817 10202 21634 37342 21199 -578 -25432 -56447 -59807 -33327 -26920 -9875 -63320 -18824
10805a8824O9953o023j422r235J1953j6152L801Q852m478j3691j584k2512l205
10792b567J0880K3548K1879l1711k5197J7337J3633j339l7977l386K6613M0715
10780E2428M357k9688j7127j7992K917K6937j942p885j0432r655j2101Q532N800
10767e851k8203J1416J2456J1175m698j2302j7573L3969K4700K537K2107j6186
10755C3547n9962k3541J1880K1549N2166q190J738j5132k6531p027J8521K1883
10743B0901M649k7103j5299K8545k220J9632r550R904l9817K5878N0795l4046
10731C2269m4830Q296L7298k144j8432K734O021k1558j5758K8653Q591j5933k0191
10718a4984M400q248l2887j180M8037J9967j8361j375J4447Q542j7448j9828K7314
$$ plain form
10805 -18824 51129 45106 43684 34449 46402 30250 34051 42903 38425 24734 23150 638 -2567
10792 -2567 8313 31861 53740 22029 -3168 14169 27802 26463 -11514 -14900 11713 52428
10780 52428 56785 27097 9970 -8022 -5105 21832 19890 12005 1573 -8082 -20183 -11651 -5851
10767 -5851 -34054 -22638 -10182 993 -3705 -16007 -33580 389 25089 27626 49733 33547
10755 33547 -26415 -49956 -38076 -16527 35639 27449 29187 14055 -12476 -19503 -982 20901
10743 20901 25550 -1553 -16852 11693 9473 29105 19555 29459 -10358 15520 66315 32269
10731 32269 -12561 -4265 33033 30889 12457 15191 21212 -346 -16104 12549 21140 5207 -14984
10718 -14984 -10584 -18832 -51719 -52899 -4862 15105 -3256 -4631 9816 18358 910 -18918 8396
10705H396L0253K484k0774o22O795j9236P916J519k3817m6114l5397L9820p15
10692d9492J3109M6830K1999j1466q027k500J7972K80k9354k84m4620j0493L2876
10679b3170L0810K9981O896l5053l216J4521K810K062q167l2702j3470K6871K5247
10666B3420K0876k8449k6626j8013Q864k5132l1744O229L0770J0697J2201o419
10654b3326K8385L0802j1190k7822M803K6813n358r688J3060j899o50K2204k0426
10641B5708l0695k6628r029q852L785J1549J8463j3906j6116J8922K7046j1727
10629a1480k435n782l601j69K5070L2875l0941j4409r734l762l094j6834J9654
10616b4642J0234j6055q848M4761M4231K1611k7580j6300k1673o387K6131n927
$$ plain form
10705 8396 38649 41133 20359 19737 26532 7296 15212 16731 -7086 -53200 -88597 -48777 -49492
10692 -49492 -36383 10447 32446 20980 12953 10453 28425 28705 -649 -933 -45553 -56046 -23170
10679 -23170 7640 37621 44517 9464 6248 20769 23579 25641 17474 -15228 -28698 -1827 23420
10666 23420 44296 15847 -10779 -28792 -19928 -45060 -76804 -70575 -39805 -29108 -16907 -23326
10654 -23326 5059 35861 24671 -3151 1652 28465 23107 13419 26479 24580 23930 46134 25708
10641 25708 -4987 -31615 -40644 -49496 -45711 -34162 -15699 -29605 -45721 -26799 247 -11480
10629 -11480 -13915 -19697 -23298 -23467 1603 34478 3537 -10872 -20606 -24368 -27462 -44296 -24642
10616 -24642 -14408 -30463 -39311 5450 49681 71292 43712 27412 5739 -648 25483 19556
10604A9556M15j3675j5568j4765j9312L5418P402J848N012l3383l7161m1995j7213
10591a23421M4050O1469J2795n28k013Q046j6815J6305m023n006l673L1869m254
10578A4801p394r707m3019j4148J6172K6253M097L231K4864J9383k6585p162M882
10565E668P684L785J1783l1551l1226j363O771J0661R621j3010k0621K0408L596
10552a7794K3717L398k782M297M972M0624j7581k5230j9544o689K4545q60l9640
10539b8567j9467o81M1138N610k332J3811K4381L2887M510j9489l8866l4407M304
10526a7168K701Q74j6597j581R663Q940N022n425L3923r640N45J007k1829j8559
10512b8124m209L42N158J8255J1919l2275o018L939j0974p747L6947K9891J3775
$$ plain form
10604 19556 19971 6296 -9272 -24037 -43349 -7931 -529 1319 6331 -27052 -64213 -106208 -123421
10591 -123421 -79371 -17902 -5107 -5635 -7648 398 -16417 -112 -4135 -9141 -12814 19055 14801
10578 14801 7407 -2300 -45319 -59467 -43295 -17042 -12945 -9714 15150 34533 7948 786 5668
10565 5668 13352 17137 28920 -2631 -33857 -35220 -28449 -17788 -8167 -21177 -41798 -21390 -17794
10552 -17794 5923 9321 6539 10836 15808 56432 38851 13621 -5923 -12612 11933 11073 -28567
10539 -28567 -48034 -48715 -7577 -1967 -4299 9512 33893 66780 71290 51801 12935 -21472 -17168
10526 -17168 -14467 -13593 -30190 -31771 -22108 -13168 -8146 -13571 20352 10712 11257 12264 -9565 -28124
10512 -28124 -32333 -31991 -26833 -8578 3341 -28934 -34952 -31013 -41987 -49734 -12787 17104 30879
10499C0879M625r813k51O473l628k2514M7352k4368k1637q944j9853j5946l828
10486d1453J2501o900J920p281K6514K9805Q264K932l6141k3197Q11J1240J1727
10473i258J4733k3168j9896k0515K2282K2210J7609L4960k0935l6332j4384K7275
10461e419j4380K96r544j1947J5255l017k4447J0508K2142m9470J9150j8071m442
10448g3386M7295J8974k9577m097j5498l4095j6265q797K7537M2238L5141K717
10436g813l9137J5567K1017P430K479J6944j2714J9226J5637k2664K535R890k7148
10423A249J3045L4400m104k3074P406N0985m038l4010j5074j3983J540k0322k0379
10410b6359n81j6784k8098k780L0560j9o598K5792N0483Q960m3433l1154k5238
$$ plain form
10499 30879 35504 25691 25440 31913 28285 5771 53123 28755 7118 -1826 -21679 -37625 -41453
10486 -41453 -28952 -35852 -33932 -41213 -14699 15106 23370 26302 -9839 -33036 -32225 -20985 -9258
10473 -9258 5475 -17693 -37589 -58104 -35822 -13612 3997 38957 18022 -18310 -32694 -5419
10461 -5419 -19799 -19503 -29047 -40994 -25739 -28756 -53203 -42695 -20553 -70023 -50873 -68944 -73386
10448 -73386 -26091 -7117 -36694 -40791 -56289 -90384 -106649 -115446 -87909 -45671 -10530 -7813
10436 -7813 -46950 -31383 -10366 -2936 -457 16487 3773 22999 38636 15972 18507 28397 1249
10423 1249 14294 48694 44590 21516 28922 79907 75869 41859 26785 12802 14342 -5980 -26359
10410 -26359 -26940 -43724 -71822 -74602 -44042 -44061 -50659 -24867 25616 34576 -8857 -40011 -65249
10397f5249N5890L2383j1197j2932K6030l8701k2503J6716k6106J4262M0473L3183
10385D2249l32O470j9131r08j2108j4781J3478l1451j2899J2642P364J2774m857
10372a490k719l854L4605L8620Q016j6967k5271n4899J0811L7934J5990Q119l742
10359D5153l8716j7552M6921Q849k6118j9371R056k109L7997J848k9405O548K7951
10346E1052K0128m9121m2789L716P152j2058J5734L6656L12k3261Q533K7236r160
10333C4130k2917l657K0754j698J4687j9388k0637O37K1674k2155m691J6102R111
10320B1952j6359L1437N791k7334m2369n512n372j8444j5380J6288j977K7766
10308b9513L2566l823L14K0594J4368J7755j364k5099l5544l8471K4949K5648
$$ plain form
10397 -65249 -9359 23024 11827 -1105 24925 -13776 -36279 -19563 -45669 -31407 9066 42249
10385 42249 41917 48387 29256 28348 16240 1459 14937 -16514 -29413 -16771 -9407 3367 -1490
10372 -1490 -4209 -8063 26542 65162 73178 56211 30940 -23959 -13148 24786 40776 48895 45153
10359 45153 6437 -11115 35806 44655 18537 -834 8222 6113 44110 45958 16553 23101 51052
10346 51052 71180 22059 -20730 -17014 -9862 -21920 -6186 30470 30782 7521 16054 43290 34130
10333 34130 11213 7556 28310 26612 41299 21911 1274 1911 23585 1430 -3261 12841 21952
10320 21952 5593 37030 42821 15487 -26882 -32394 -37766 -56210 -71590 -55302 -57279 -29513
10308 -29513 3053 -770 -456 20138 34506 52261 50897 25798 -9746 -48217 -23268 2380
10296B380P408J0396k954J2175N432j3626k7219j5638l9977l0204M4701L0181
10284a6945l531j9684l8354J2257K5312K6712J683j3647L0633J9137K1298N868
10272E0739j4985k8913k563m235j6779n940J2497J3214j2905J7131k5275k4174
10260d2188q230K8217J4093j6960j2664q735j6504K4181L587K0131j0188J8581
10248f679J3234l3287K2202q985l3396J5630M4541J5502R208l2204l2566n649
10236c2449L5130L870L3303L8106k9703m5505k9530k5873Q324L4535N1924O532
10224D8664l2716q009K1341L89J9988J7399k1760k9517J3413k3839J1701o511
10212A0543n7123k030L6342J7573K4128J0054k542m6355l9049M6174L587l1245
$$ plain form
10296 2380 9788 20184 17230 29405 34837 21211 -6008 -21646 -61623 -91827 -47126 -16945
10284 -16945 -20476 -40160 -78514 -66257 -40945 -14233 -12550 -26197 4436 23573 44871 50739
10272 50739 35754 6841 4278 43 -16736 -22676 -10179 3035 -9870 7261 -18014 -42188
10260 -42188 -50418 -22201 -8108 -25068 -37732 -46467 -62971 -38790 -35203 -15072 -25260 -6679
10248 -6679 6555 -26732 -4530 -13515 -46911 -31281 13260 28762 37970 5766 -26800 -32449
10236 -32449 2681 6551 39854 77960 48257 2752 -26778 -52651 -44327 -9792 42132 48664
10224 48664 15948 7939 29280 29669 49657 67056 45296 15779 29192 5353 17054 10543
10212 10543 -46580 -48610 -12268 5305 29433 39487 36945 -9410 -48459 -2285 1302 -29943
10200b9943j5098r540J7366O36J7792Q434l109k0768N762L1580k8192J610K8432
10187D962K7982j7910l292K045M547p05j7429j4416K951j1674j03L182K3513Q425
10173A2078q370J3902J1480Q949l708k5102m876j6499m3851j1858J2149j6844
10161g2550J7162K2137J427O259J2228R864r513o711L143K1738n25n69N54Q625
10147A3269J2229Q384J0593k0339q011k5122j0095m0591j9657Q921L2985K9477
10135g957K4899K3602J0123n517N88k9383j8379k566Q719J5193o384R511O46k5365
10121b270j2356n3124Q026q000J8776J5691l525m79L5044p502l3591q584K3404
10108b8490K0753J2315J5047P910J4452k5707q400L6l1361k761Q206O332p01J478
$$ plain form
10200 -29943 -45041 -54581 -37215 -36579 -18787 -10353 -13462 -34230 -28468 3112 -25080 -23470 4962
10187 4962 32944 15034 11742 13787 18334 17629 200 -14216 -11265 -22939 -23042 -19860 3653 12078
10173 12078 3708 17610 29090 38039 34331 9229 4353 -12146 -55997 -67855 -55706 -72550
10161 -72550 -55388 -33251 -31824 -25565 -13337 -3473 -12986 -19697 -16554 5184 4659 4090 4644 13269
10147 13269 25498 33882 44475 24136 16125 -8997 -19092 -59683 -79340 -70419 -37434 -7957
10135 -7957 16942 40544 50667 45150 45738 16355 -2024 -4590 4129 19322 12938 22449 23095 -2270
10121 -2270 -14626 -67750 -59724 -67724 -48948 -33257 -36782 -37261 -2217 -9719 -43310 -51894 -28490
10108 -28490 -7737 4578 19625 27535 41987 16280 7880 7916 -23445 -26206 -18000 -11668 -12369 -10891
10094a0891O232K0793j9052l0098Q658l14J9318j032k8109N264K6776k378K6246
10081B1413K5651j4876j1616k5948m806M6145M7481K3134m1786j211j9345l4806
10069I430k4937K4067K3815J2098L075M420j6833m8806k2022N1234J5293l627
10057B7207J0232n5357m932L1786Q780K1471j1655l9157J4203L5464j6603K2284
10045D3723P354j0476l004j7933Q411k0652r366j5112K0330o483k6897m612M7439
10032A2722j0161P445l1723l408Q644K1086J2683K2705K965j5637k25j648k1705
10019C743m7258J5498j2073O21J4879J5582L5347j6024j1622L1634l379l35j099
10006B5514n684j32o604j5354j8051L45K7263j1201j6841J1889R950R004K3541
$$ plain form
10094 -10891 -4659 16134 -2918 -33016 -24358 -24672 -5354 -6386 -34495 -29231 -2455 -4833 21413
10081 21413 47064 32188 20572 -5376 -10182 35963 83444 106578 64792 63581 44236 9430
10069 9430 -15507 8560 32375 44473 47548 51968 35135 -13671 -35693 15541 30834 27207
10057 27207 37439 -17918 -22850 8936 17716 39187 27532 -11625 2578 38042 21439 43723
10045 43723 51077 40601 37597 19664 28075 7423 -1943 -17055 3275 -3208 -30105 -34717 12722
10032 12722 2561 10006 -21717 -25125 -16481 4605 17288 39993 42958 27321 27096 25448 3743
10019 3743 -43515 -28017 -40090 -39469 -24590 -9008 26339 10315 -1307 30327 26948 26613 25514
10006 25514 19830 19698 13094 -2260 -20311 -19966 7297 -3904 -20745 -8856 1094 10098 33639
9993C3639Q615K124m0013K125J3583m958J5835m239K539k8271k2820Q16j514M3392
9979B0853m139l3150p914Q873o208l659k219M512O182L2739j32j9261J0938j625
9965E790j241Q153N592J0688P550J7212k4515k5105j6154M2373l4001l0631J3538
9952b0751N1862J0584K574J2415l5388j1579L2058p254j4053J3793k380n231l9313
9939a2663K546K8522j0117M535q372N470j3804Q456r64l6522j2356j5855J7332
9926d3792M475R026L5983J7730P506j1742j4594j3137K0442o211k598j8278k8551
9913d3741K3754L0926j2224k2300J0115K8466M088j5220K1348J2159N896K8321
9901G1588J4212l0244p308j3094k2799J0276j6760p466M394K7740J5218r467N001
$$ plain form
9993 33639 42254 44378 4365 6490 20073 15115 30950 26711 29250 979 -21841 -21025 -22539 20853
9979 20853 16714 -16436 -24350 -15477 -21685 -25344 -27563 -23051 -16869 15870 15738 -3523 7415 5790
9965 5790 4549 12702 18294 28982 36532 53744 29229 4124 -12030 30343 -3658 -34289 -20751
9952 -20751 31111 41695 44269 56684 21296 9717 41775 34521 20468 34261 31881 26650 -12663
9939 -12663 -10117 18405 8288 12823 4451 9921 -3883 4573 3609 -32913 -45269 -61124 -43792
9926 -43792 -39317 -30291 5692 23422 30928 19186 4592 -8545 11897 5686 3088 -15190 -43741
9913 -43741 -19987 10939 -1285 -23585 -13470 14996 19084 3864 25212 37371 43267 71588
9901 71588 85800 55556 48248 35154 12355 22631 5871 -1595 2799 30539 45757 36290 41291
9888D1291P473j5221n0345j0591K5963N09k1263K3718K0408k0591j9791j4271
9876c2711r787l312k1658J2155J5757M2657K9184J5289J3295k5492l1156O278
9864A0499J9034M557j5742k1901q640j5522L1735K9947J3785K9342n875M7971
9852A19190O9510p3j6367J4860L6751J11377K24898L69652N35312M01790J6290
9841A883190l79103n19271l64226j89275j44719q2715l5016m2096k6655j6997
9831H3117m066J1992n1746j4429m2525N854P730j1858j328L0610J6359j6168k092
9818A1450j0549k162J6880k0086J6266K5616k7128k0898J277k1951J2107J9254
9806G6J0917J6396R799n0666N464Q49q295j8102N4749K6734M291j7079n6428l2863
$$ plain form
9888 41291 48764 33543 -16802 -27393 -1430 -921 -22184 1534 21942 1351 -18440 -32711
9876 -32711 -42498 -45810 -67468 -55313 -39556 3101 32285 47574 60869 35377 4221 10499
9864 10499 29533 34090 18348 -3553 -12193 -27715 4020 33967 47752 77094 71219 119190
9852 119190 188700 188627 172260 187120 223871 335248 560146 929798 1465110 1866900 1883190
9841 1883190 1504087 984816 620590 431315 286596 203881 168865 126769 100114 83117
9831 83117 79051 91043 39297 24868 -17657 -11803 -4073 -15931 -17259 13351 29710 13542 11450
9818 11450 901 -1261 15619 -4467 11799 37415 10287 -10611 -9334 -31285 -19178 76
9806 76 10993 27389 37188 -13478 -8014 -7165 -15460 -33562 21187 47921 52212 35133 -21295 -54158
9792e4158R9K9192N206K0716K7541K019l947l5462l167L1131n149r821j0565J1869
9778E504J8872k2611r261j1499P121M089q143k8959K8363K4092j4187K235J6609
9765A2225J1355m5922j6720K6398O157j3845l2432L628L3412M2256N872k0839
9753A1545k6625m5240j2948K2371N5677K0807r786p784r197j598j7926L6392J2005
9740B7693j6048j7471k6977L9213K6959l9858j9495K8945q772r558M764j65o944
9727a7714j3467j1384K1452J4546R515O814q875q416J3675L6695m866p071l6194
9714e290l4670J3066o375R182J4264J846n504K1338K6506J5963J0684q453k4637
9701B7920j1883n964Q398J2870k0681k5720N603q721P491M0724m363J391m224
$$ plain form
9792 -54158 -54059 -24867 -19661 1055 28596 30615 26668 -8794 -11961 19170 14021 4200 -6365 5504
9778 5504 24376 1765 -7496 -18995 -11874 -7785 -15928 -44887 -16524 7568 -6619 -4384 12225
9765 12225 23580 -22342 -39062 -12664 -6507 -20352 -52784 -49156 -15744 26512 32384 11545
9753 11545 -15080 -60320 -73268 -50897 4780 25587 15801 8017 -1180 -2778 -20704 15688 27693
9740 27693 11645 -5826 -32803 6410 33369 -6489 -25984 2961 -5811 -15369 -10605 -10770 -17714
9727 -17714 -31181 -42565 -21113 -6567 2948 9762 887 -7529 6146 42841 37975 30904 -5290
9714 -5290 -39960 -26894 -33269 -24087 -9823 -7977 -13481 7857 34363 50326 61010 52557 27920
9701 27920 16037 10073 18471 31341 10660 -15060 -9457 -18178 -10687 30037 25674 27065 22841
9688B2841j8123J6684L7381K5033j5701k2821l9980J127N464M751K2271j4668
9676B4259m3438k3276J0029J2891j2638L3920n660j4398k6668M6034J0215k2749
9664a1479j584j2778N527K3040j438L853L975j381j9511j4614J0039K4539M374
9651A2562R534j3822j8423k8674L874R638l451J7551m3604l100K5022k1551N713
9638d8731J2582O169o264j833J3024N802L2785J4697j1254j4960j5194n254K1908
9625C477j1820l452J2859k0897j8759O826K0023o349j2553m799K734j994K7454
9612g250J6814K5600J5928j4899n7628j8956m602R838J6887R368n328K6144J8309
9599C0225j6322l98l4129N95K6111j013k6211J3840J5416M487J562k2082P113
$$ plain form
9688 22841 4718 21402 58783 83816 68115 45294 5314 6441 11905 16656 38927 24259
9676 24259 -19179 -42455 -32426 -19535 -32173 1747 -3913 -18311 -44979 1055 11270 -11479
9664 -11479 -13063 -25841 -20314 2726 1288 5141 9116 7735 -11776 -26390 -16351 8188 12562
9651 12562 22096 8274 -10149 -38823 -34949 -25311 -28762 -11211 -54815 -57915 -32893 -54444 -48731
9638 -48731 -36149 -29980 -36244 -38077 -25053 -19251 13534 28231 16977 2017 -13177 -18431 3477
9625 3477 -8343 -11795 1064 -19833 -38592 -31766 -11743 -18092 -30645 -35444 -32710 -34704 -7250
9612 -7250 9564 35164 51092 36193 -21435 -40391 -44993 -35155 -18268 -8900 -14228 11916 30225
9599 30225 13903 13505 -20624 -20029 6082 5069 -21142 -7302 8114 12601 14163 -7919 -806
9586h06J0089K0012k383k7612r721o614j3376j9730j2942j542K2163L4548l3108
9573d1022m3678l4091M0098N0256L8196k5275q242n693l3384L4840J9423j6392
9561b4964j0785O148J0877J0700P188K5466J4305K6582j602j4055k1330l9245
9549a0715j5155k078K3045L5824N437j0889l9730J945L5875k6012k5287J401k5762
9536e2101q561K3175K2808k1944l3977k2184K1662M4405K3835P593j3310j9864
9524b8463J2739P507P876l1598Q115M233K9365J8689N761P375l0654m316j8208
9511a1579J3583J7881J8654Q524j7542J6013J5510l009j9798l9207K8089L4310
9499F1429j1205j8568l2270j4819J1885P444k468j1328q786j0081J8677K0863
$$ plain form
9586 -806 9283 29295 26912 -700 -10421 -17035 -30411 -50141 -63083 -64625 -42462 -7914 -41022
9573 -41022 -84700 -118791 -78693 -28437 9759 -15516 -23758 -29451 -62835 -27995 -8572 -24964
9561 -24964 -35749 -29601 -18724 -8024 -836 24630 38935 65517 63915 49860 28530 -10715
9549 -10715 -25870 -27948 -4903 30921 36358 25469 -14261 -12316 23559 -2453 -27740 -26339 -52101
9536 -52101 -60662 -37487 -14679 -36623 -70600 -92784 -71122 -26717 -2882 4711 -8599 -28463
9524 -28463 -15724 -8217 -341 -31939 -23824 -19591 9774 28463 34224 41599 10945 6629 -11579
9511 -11579 2004 19885 38539 47063 29521 45534 61044 58035 38237 -970 27119 61429
9499 61429 50224 31656 -614 -15433 -3548 3896 1428 -9900 -18686 -28767 -10090 10773
9487A0773J7758L9689l3072j2615n85K1395l5719j5609N458j5492m81j5848L305
9474c1043J8177N1408J1210l8308k2810J8654R699k448n535n062K651M773l4491
9461b3125q396o721j5439m437L450p258J5434L2108P640l0997o486K0865J2685
9448a0677L239l274j0164n270K8735L854J368J7913N128J0107j9846k5754Q980
9435D339j802J6831K958J867N6561j2184M299j2315r012j9307j2979o964n5401
9422d3109P511M1239O084j6755l0466L4155K1764l1426j0587J4127Q822L089K6916
9409C1364K9976J2826l3409j5455p858k7512K3473J9236l2069m5799m903N8633
9397H503J3229j0442o856r105j4149M80J0531L1996J0530m4819l3889K0315L6132
$$ plain form
9487 10773 28531 68220 35148 22533 21948 43343 7624 -7985 -2527 -18019 -18500 -34348 -31043
9474 -31043 -12866 38542 49752 11444 -11366 7288 16987 14539 9004 3942 6593 11366 -23125
9461 -23125 -31521 -38242 -53681 -58118 -54668 -61926 -46492 -14384 -6744 -37741 -44227 -23362 -10677
9448 -10677 -7438 -10712 -20876 -26146 2589 6443 7811 25724 30852 40959 21113 -4641 4339
9435 4339 2537 19368 22326 24193 80754 68570 72869 60554 51542 32235 19256 12292 -43109
9422 -43109 -35598 5641 11725 -5030 -35496 -1341 20423 -11003 -21590 -7463 1359 4448 31364
9409 31364 61340 74166 40757 25302 17444 -10068 13405 32641 572 -45227 -50130 8503
9397 8503 21732 11290 4434 -4671 -18820 -18340 -7809 24187 34717 -10102 -43991 -23676 12456
9384A2456k5003K1913j9057k4970J4443k7130K0287K7647R943L881o53k5815J9689
9371G631k30k6126q769K3501N2686J0955k532j2596l2130K817k2917j5104J7994
9358d820M1822K2798l2251j297J2848P257J8075L5963j8767n4466J0237N20k9880
9345H039m581r089j2546m167N582O252J8269R333j8170l882O774k6479k9795K374
9331e2086J8776K0206J0484l348p52l301j1837j4766L924P317L1198k1118J5868
9318E65K7158J1453J4219j1840k7244l8059k3916M2816j6747l0778n221M0427
9306a7167J9853j3751j1044j0392K9706J7328K9309k2522r441K0784K8504J3060
9294G4227k1075K55J6671l2961q799r502j4266O306L0228J2630R31Q361l4415
$$ plain form
9384 12456 -12547 9366 -9691 -34661 -20218 -47348 -27061 586 10529 14410 13757 -12058 7631
9371 7631 7401 -18725 -27494 -3993 48693 59648 57116 44520 12390 15207 -7710 -22814 -4820
9358 -4820 37002 59800 27549 26252 39100 46357 64432 100395 81628 27162 37399 37919 8039
9345 8039 3458 -5631 -18177 -22344 -16762 -10510 7759 17092 -1078 -4960 1814 -24665 -54460 -52086
9331 -52086 -33310 -13104 -2620 -5968 -6720 -10021 -21858 -36624 -32700 -25383 5815 -15303 565
9318 565 27723 39176 53395 41555 14311 -23748 -47664 -4848 -21595 -52373 -57594 -17167
9306 -17167 2686 -11065 -22109 -32501 -2795 14533 43842 21320 11879 32663 61167 74227
9294 74227 53152 53407 70078 37117 28318 18816 4550 10856 41084 53714 54645 63006 28591
9281B8591k1274K798J5416K0159K8179k1148j9317o693k0998M2784L3757J4331
9269I6585k7753J9810K1590o50r511k2272K1869K1326K0202M3300L3011J1112
9257B28619l0708L3545M4902M2870p853o496Q237J0294J7721O1157Q3644P7892
9245E63824R2000J29665J45038J61956K42454K92797L44381M52068O70235R38120
9235D032538J377328K137867L261069M419435M098009O08106l121533m275284
9227A2537535l684316k563157j652944j113717q34798n61738l91219k82263k04744
9218A248639j97526j47596j01120q3199q7231o9385n3928m8748l8968L526j4047
9207D10417k5413l8941o5913l3220J2987k765m5558k5658M351j0292l6733p855
$$ plain form
9281 28591 7317 10115 25531 45690 73869 52721 33404 26711 5713 48497 82254 96585
9269 96585 68832 88642 110232 109582 100071 77799 99668 120994 141196 184496 217507 228619
9257 228619 197911 231456 276358 319228 311375 304879 313116 323410 341131 402288 485932 563824
9245 563824 655824 785489 930527 1092483 1334937 1627734 1972115 2424183 3094418 4032538
9235 4032538 5409866 7547733 10808802 15228237 19326246 19934352 16812819 12537535
9227 12537535 8853219 6290062 4637118 3523401 2688603 2126865 1735646 1453383 1248639
9218 1248639 1051113 903517 802397 719198 631967 562582 508654 459906 420938 424464 410417
9207 410417 385004 346063 280150 246930 259917 257152 211594 185936 190287 179995 143262 135407
9195A35407l1121J5596K0933P89J8134J1953l6549j9304j2868J1052P246O434
9183A27702k5534O654R482R403l1200j5840k1565J0767k1449k105Q912j1549K8866
9170G2544j3066p596M546j6402j6707k1978J6626J3154L6550k4755p3006L656
9158b6434M4544n269j9138J0467j5770K771O2042Q952m1852j5640J9928J9384
9146D3985M87o907K0154J1555o595l674j0324m3145m324L7110J2667p268r733
9133C3988k6290K1223k869q116J7659K1609j4397L1418l8317n0210l084L8283
9121B0897j215k7630j4370J2142j8698O824K3007J084j0487j1875j4421m145K1576
9108a7311L1407J4110K2898J0918j9145k3032J4112P437J785m4829j2349P335
$$ plain form
9195 135407 104286 119882 140815 141604 159738 171691 135142 115838 102970 114022 121268 127702
9183 127702 102168 108822 118304 127707 96507 80667 59102 69869 48420 46315 55227 43678 72544
9170 72544 59478 51882 56428 40026 23319 1341 17967 31121 67671 42916 -30090 -26434
9158 -26434 18110 12841 -6297 4170 -11600 -8829 53213 62165 20313 4673 24601 43985
9146 43985 44472 37565 57719 69274 62679 59005 48681 5536 1212 38322 50989 43721 33988
9133 33988 7698 28921 26052 17936 35595 57204 42807 74225 35908 -14302 -17386 20897
9121 20897 19682 -7948 -22318 -10176 -28874 -22050 957 2041 -8446 -20321 -34742 -38887 -17311
9108 -17311 14096 28206 51104 62022 42877 19845 33957 41394 43179 -1650 -13999 -6664
9096f664J5540j32K6554K2922o216j9902M992L8791J7856j3253j0458j710p345
9083F0975L524K4206l2293j6117k1897J3408L2438K2987m310k5780j9517J0410
9071D8034o892l3405k3571J9774K6061j8287k4074K7837L2458K3657n303j2880
9059E3409l9818j475J6763p319j8293k521N6418K88k5961k8750K8268l442j6100
9046A1467N096n310J4641J1854k9314o660R574O180j3439J4794K1140l3750r805
9033c532n0427q26L1370K8029L6129j030l002n313J867Q117l3881k0181J4881
9020B201P849k1050j2763P209K647j3258j8300K8591K3170k1458J88K0698o478
9007g54k5150j3891j2434L6333M4551K2423L934k8498j9914j8219J9087J7291
$$ plain form
9096 -6664 8876 8744 35298 58220 52004 32102 37094 75885 93741 80488 70030 68320 60975
9083 60975 64499 88705 56412 40295 18398 31806 64244 87231 82921 57141 37624 48034
9071 48034 41142 7737 -15834 3940 30001 11714 -12360 15477 47935 71592 66289 53409
9059 53409 13591 12116 28879 21560 3267 746 57164 57452 31491 2741 31009 27567 11467
9046 11467 16563 11253 25894 37748 8434 1774 11348 17528 4089 18883 40023 6273 -3532
9033 -3532 -53959 -54785 -23415 4614 40743 39713 36711 31398 33265 41382 7501 -12680 2201
9020 2201 10050 -11000 -23763 -16554 -13907 -27165 -45465 -16874 6296 -15162 -14974 5724 -754
9007 -754 -25904 -39795 -52229 -15896 28655 51078 55012 26514 6600 -11619 7468 24759
8995B4759j811J362J3383K7435R7n7575m1647l882J6508K1873K3157J6705p298
8982C3066l6438l0717N074j6527O844L2909J7441J9827j5945k7430j3401K0421
8970d876j8072K0870J7593j945J7641M8080J3509j7332k8571k7318k0714l9100
8958d0235L0911L04j9670J8975J8606K019k6118k6114J8355M0163j5733k4373
8946b2910J9549p356j2701J2k616J3236K2493o915J8088J6180m264j1054J2796
8933C4538n301k002n144K4340j2327j2320j4581O924j5948k9175m7234j2732J6922
8920g4040J9617K0794j3374K202J6826N913M473J0666k5269q525R504J4355j6683
8907c3541j2918J0332J7287K9607K8940J9236q149k5552j6423L979K854k2809
$$ plain form
8995 24759 22948 24310 37693 65128 65225 7650 -33997 -37879 -21371 502 23659 40364 33066
8982 33066 -3372 -34089 -29015 -45542 -38698 -5789 11652 31479 15534 -11896 -25297 -4876
8970 -4876 -22948 -2078 15515 13570 31211 79291 92800 75468 46897 19579 -1135 -40235
8958 -40235 -9324 -9020 -28690 -9715 8891 10910 -15208 -41322 -22967 17196 1463 -22910
8946 -22910 -3361 -10717 -23418 -23406 -26022 -12786 9707 2792 20880 37060 32796 21742 34538
8933 34538 29237 27235 22091 46431 34104 21784 7203 14127 -1821 -30996 -78230 -90962 -74040
8920 -74040 -54423 -33629 -47003 -44801 -27975 -22062 -17589 -6923 -32192 -40717 -31213 -16858 -33541
8907 -33541 -46459 -36127 -18840 10767 39707 58943 50794 25242 8819 12798 15652 -7157
8895g157J5351K1836n5q811Q45P078J3792L669l9350k598j3029o012P609J6788
8881I956K0177l0095l434J3478k2503l743N254n197J4237r483j9880j6318j0282
8868e7833K5800J3557m670P181Q000k4898J1161q171p506q147j2173k1593J1616
8855f7676M0911J1259m956p919n4983j7621J5374M2093K7290M572K0518j1268
8843b406l9909k0629K1429J8629N3704n696J8637J4620p346J3355k8865j3972
8831B1551j3113l8339j8185R466M1347J0496l543r363j7663K6847l0592o077J8497
8818h671J8709J7314q633n3136j3J9325L4902M75j7225j0381K5127J7399j5812
8805A9380k3334J0109L9245k7371l6824K8108K7712J5361O420J86j7017j8211
$$ plain form
8895 -7157 8194 30030 29975 21164 22009 29087 42879 46548 7198 4600 -8429 -14441 -6832 9956
8881 9956 30133 38 -3396 10082 -12421 -16164 -10910 -16107 -1870 -11353 -31233 -47551 -57833
8868 -57833 -32033 -18476 -23146 -15965 -7965 -32863 -21702 -29873 -37379 -45526 -57699 -79292 -67676
8855 -67676 -26765 -15506 -20462 -28381 -83364 -100985 -85611 -43518 -16228 -11656 8862 -2406
8843 -2406 -42315 -62944 -41515 -22886 30818 25122 43759 58379 51033 64388 35523 21551
8831 21551 8438 -29901 -48086 -38620 2727 13223 9680 317 -17346 9501 -21091 -27168 -8671
8818 -8671 10038 27352 18719 -34417 -34430 -15105 19797 20272 3047 -7334 17793 35192 19380
8805 19380 -3954 6155 45400 18029 -18795 9313 37025 52386 58806 58992 41975 23764
8793B3764j9292P293N063n688q512N14k2887j9350j0356R259k2536O390L2182
8780b4156K6308J8268m2681m7617N979K3014O876J6840K4459K6846K6077k2571
8768C7642l6952k5096K2980r970N083J6057j6831r134M0792K2k9710M417R526
8755H826K1554Q219j3585n2226L877k0026j9041L2988P698k6715O080L3690M7106
8742C8445K3087j73l9920m2235K819K8483k6068j9603N679J1259K9300o944k6355
8729b2226N9018M134k3493l1228k3813L0096L7510L0797n304J7333j9496j6655
8717C6673l764l0103o889Q893J2250m523j6903j6670J0747j8354J8693J0481O011
8704F542q965L928L205k17j5579K4165k6207k1598o133O021J4090r798o697K5412
$$ plain form
8793 23764 4472 11765 16828 11140 2628 3142 -19745 -39095 -49451 -40192 -62728 -56338 -24156
8780 -24156 2152 20420 -22261 -69878 -63899 -40885 -34009 -17169 7290 34136 60213 37642
8768 37642 690 -24406 -1426 -11396 -6313 9744 -7087 -16221 24571 24593 -5117 -700 8826
8755 8826 30380 38599 25014 -27212 -23335 -43361 -62402 -29414 -21716 -48431 -42351 -8661 38445
8742 38445 61532 61359 21439 -20796 -17977 10506 -15562 -35165 -29486 -18227 11073 4129 -22226
8729 -22226 36792 40926 17433 -13795 -37608 -7512 29998 60795 55491 72824 53328 36673
8717 36673 32909 2806 -4083 4810 17060 12537 -4366 -21036 -10289 -28643 -9950 531 6542
8704 6542 -2423 1505 4710 4493 -11086 13079 -13128 -34726 -40859 -34838 -20748 -30546 -37243 -11831
8690a1831k3122j1320R132J7637N516J5358K5465J11M02m877R480k4028k5672
8677a7749k2800j243J7520J1875J0987K3083j9788k9411L3615J3888J4812J9392
8665E4181k5696R151J0318J5840P109k3595k9409j1724Q453K6989J8547k1399
8653C8765k7515L0335K3584L3437K8630p544k975N7473J00882J37214J36727j3120
8641E35893j29152q4267p9917o6071j0704k7687n2521k6310l0999l2289j0387
8630a4411r922k4946J4573K3514L6937k3400o157M5721j5162j9445J4838j9550
8618B590r748o531L3902L6403K2234J0070L5099j7037l8317l8396j4034K3012
8606C9247K4851L5063K9903K3354M4526R3051J38431K64762L13139N0580k07498
$$ plain form
8690 -11831 -34953 -46273 -37141 -19504 -13988 1370 26835 26946 27348 22471 31951 7923 -17749
8677 -17749 -40549 -41792 -24272 -12397 -1410 21673 1885 -27526 6089 19977 34789 54181
8665 54181 28485 37636 47954 63794 70903 47308 17899 6175 14628 41617 60164 38765
8653 38765 11250 41585 65169 98606 127236 119692 116717 174190 275072 412286 549013 535893
8641 535893 406741 322474 242557 176486 165782 138095 85574 59264 28265 -4024 -14411
8630 -14411 -24333 -49279 -34706 -11192 25745 2345 -3812 41909 26747 7302 22140 2590
8618 2590 -7158 -13689 20213 56616 78850 88920 124019 106982 68665 30269 16235 39247
8606 39247 64098 99161 129064 152418 196944 289995 428426 693188 1006327 1056907 849409
8595H49409k70976j94674o8763o2902j4096l4698l3832k4669j2709k0309j0366
8584A01415q69r576k7745n247J5334J3574K557R566k3114l7634l525o590J7066
8571D5212J518J904P209j3648l030k816J0107k3006j4692M436J5665m686K9647
8558E3820N5980J2631M5645P0435P7344J50691P0155j00628j33040j06082p7625
8547A19326m9109l1971j0285k4442q173L3443M557m2472J4978K8625L3706Q177
8535G6360l6421P57K3330r939j3984j9465j0715k3560K6612L585j3254k6756j6934
8522d0384J0152k739k1646k380K9457J8712J596L0498N901o6454j7320n065J7823
8509d1849N0j1248J0672M2685j5368J5661R171J4843j801J6188J3566k7968m5560
$$ plain form
8595 849409 578433 383759 314996 252094 237998 203300 169468 144799 132090 111781 101415
8584 101415 100546 90970 63225 57978 73312 86886 89443 99009 75895 38261 34736 28146 45212
8571 45212 46730 48634 55843 42195 39165 36349 46456 23450 8758 13194 28859 24173 53820
8558 53820 109800 122431 168076 238511 315855 466546 536701 436073 303033 196951 119326
8547 119326 70217 38246 27961 3519 -4654 28789 33346 -9126 5852 34477 68183 76360
8535 76360 39939 40696 64026 54087 40103 20638 9923 -13637 12975 16560 3306 -23450 -40384
8522 -40384 -30232 -32971 -54617 -56997 -27540 -8828 -7232 23266 29167 -37287 -54607 -59672 -41849
8509 -41849 -41799 -53047 -42375 310 -15058 603 9774 24617 22816 39004 52570 24602 -20958
8496b0958j3956J23k313J8463K1336K9827m0036k5102m933L3073K4906Q910k851
8483B6489k5741j418k039J0858o085q732N856K7584J5400J7883j0160m9358L7949
8470C8486K4909l227k0614m5722j617m484k278j305N988K3741j367r850n887J890
8456a337K9678j774j0386J0199j1358k250r289j1951L403k43R26j5200K1901K7589
8442B9908j265o991n423j3120j316M472m644J8422R455J9723j1644k5861q832
8429B884K3080K1491j7481m5204l6633N2571J041K6076L9273q148j9369k0651
8417A8930n8042r77Q344K9675K636m535K4182j5293n2045k5855J8540K3160L3814
8404B534K2883N046j0018k3176O89J144j1410N455N84K0498R911j2682J0165k2254
$$ plain form
8496 -20958 -34914 -34791 -37104 -18641 2695 32522 -7514 -32616 -37549 -4476 20430 29340 26489
8483 26489 748 -670 -2709 8149 2064 -6668 -812 26772 42172 60055 49895 537 38486
8470 38486 63395 60168 39554 -6168 -7785 -12269 -14547 -15852 -9864 13877 12510 2660 -3227 -1337
8456 -1337 28341 26567 16181 26380 15022 12772 3483 -8468 -5065 -5308 -4382 -19582 2319 29908
8442 29908 28643 21652 16229 3109 1793 6265 1621 20043 29498 49221 37577 11716 2884
8429 2884 25964 47455 29974 -15230 -51863 708 1749 27825 67098 58950 39581 18930
8417 18930 -39112 -40089 -31745 -2070 566 -3969 20213 4920 -47125 -72980 -54440 -31280 2534
8404 2534 25417 30463 20445 -2731 -2042 -898 -12308 -6853 -6269 14229 24140 11458 21623 -631
8390f31j5512J9850R910L271J2049p002J2877J0594q560j4002l6008K4555K0364
8377C1755J9453j1277n212j7938K3153l1599k7805l9420K1421J9911J6332j1904
8365a3130l5948J1965J3660R3k2711K0170L5515j7119j3363j999K2902r89j8676
8352a9630q296N414k2685q360L1277N551J7810L6886K7285M604j0002l8947l3192
8339a2285l7228L7887M8919j6620l6430j2165N076K9344j705L667l685L5161K2805
8326F2741k7020k4497j1518j4507l0512K0163J7762r313l4968o375R801J6167
8314c2076J4655L9258K3993j3182o892L569j9227J8479q708m511J6882j3741j8062
8301D37m7732j1968K4971K0919K0403L0339r018r052K1685L1434P470o7381o1483
$$ plain form
8390 -631 -16143 3707 13617 16888 28937 21935 34812 45406 36846 22844 -13164 11391 31755
8377 31755 51208 39931 34719 16781 39934 8335 -19470 -58890 -37469 -17558 -1226 -13130
8365 -13130 -49078 -37113 -23453 -23360 -46071 -25901 9614 -7505 -20868 -22867 35 -954 -19630
8352 -19630 -27926 -22512 -45197 -53557 -22280 -16729 1081 37967 65252 69856 59854 20907 -12285
8339 -12285 -49513 -11626 37293 20673 -15757 -27922 -22846 6498 4793 8460 4775 39936 62741
8326 62741 35721 11224 -294 -14801 -45313 -25150 -7388 -16701 -51669 -58044 -48243 -32076
8314 -32076 -17421 21837 45830 32648 25756 29325 10098 28577 19869 15358 32240 18499 437
8301 437 -47295 -59263 -34292 -13373 7030 37369 28351 19299 40984 72418 79888 12507 -48976
8288d8976Q409L2047K0857J0832k655l1499l9427m0448K969M2308K2306L2145
8276H868p131O776k7932k9404P41L276J9359K1707j0715l5488J1350J4038k4932
8263d9487j9388L0684P31J7417K5322J3867j1148k3445m4910j1933K6790K1786
8251b3714j4106L3952J2506m2032O296o700K5855R907k7167J7221L6147r916n697
8238A2552P359j5263l099J0957J2213l7269J1618k67j9956R782N890O710j2949
8225a1722k3989m4157N669j2499k065j1709J2019M2537M4552K4184k0382j6571
8213a4133K2640M6811N745l6723j9178j3221o0275O360P6089J7273n674m7937
8201b2223o479M3237K4555k3998l6543J1190J3716J0583j7155J2610n59J0085
$$ plain form
8288 -48976 -40567 -8520 12337 23169 20514 -10985 -50412 -90860 -87891 -45583 -23277 8868
8276 8868 1737 8513 -19419 -48823 -48082 -44806 -25447 -3740 -14455 -49943 -38593 -24555 -49487
8263 -49487 -68875 -38191 -37460 -20043 5279 19146 7998 -15447 -60357 -72290 -45500 -23714
8251 -23714 -37820 -3868 8638 -33394 -27098 -33798 -7943 1964 -25203 -7982 28165 18249 12552
8238 12552 19911 4648 1549 12506 24719 -12550 -932 -1199 -21155 -11373 -5483 1227 -11722
8225 -11722 -35711 -79868 -74199 -86698 -88763 -100472 -88453 -45916 -1364 22820 2438 -14133
8213 -14133 8507 55318 61063 24340 5162 -8059 -68334 -61974 14115 31388 25714 -22223
8201 -22223 -28702 14535 39090 15092 -21451 -10261 3455 14038 -3117 9493 8934 19019
8189A9019J0364m979j1474J1892N116k9743k5858j9368J8641L381m128k703N919
8176b3921J0263j2491j842k1414J4744J6409L7596J3879l35j1966R188L4627K764
8163F7501m0287j7943J9781O517J0911j6479J0642R379O893m1246m5215J8785
8151a0761j4620k834m941J4581L9488J5778k0158j4297K6152M742l5178m7700
8139d9748k4182j7915L3492J8050K9334K7308L537k1578k8154p91R346J8334P636
8126D669p013J2233O329l0100J5257K7138R17j0015l515n732l681N747N0241J3609
8112G6084j1840k0244k6767r356k8313p428J9861Q416O729J460l0332M914J2967
8099c849l525J1792j1340m9779j6486K528M4420j942k3460J5111J4514J348J4800
$$ plain form
8189 19019 29383 24404 12930 24822 29938 195 -25663 -45031 -26390 -23009 -27137 -29840 -23921
8176 -23921 -13658 -26149 -27991 -49405 -34661 -18252 19344 33223 32888 20922 30110 64737 67501
8163 67501 27214 9271 29052 35569 46480 30001 40643 50022 56915 15669 -29546 -10761
8151 -10761 -25381 -28215 -33156 -18575 20913 36691 16533 2236 28388 33130 -2048 -49748
8139 -49748 -73930 -91845 -58353 -40303 -10969 16339 19876 -1702 -29856 -30647 -21301 -2967 4669
8126 4669 -2344 9889 16218 -13882 1375 28513 29430 19415 15900 10168 6487 12234 62475 76084
8112 76084 64244 44000 17233 7877 -20436 -27864 -8003 413 7142 8602 -21730 -16816 -3849
8099 -3849 -7374 4418 -6922 -56701 -73187 -70659 -26239 -28181 -51641 -36530 -22016 -20668 -5868
8086e868J3405K2909K4356m0105m4172j5724k5091k5858R141J6907J3906K4674
8074c1520Q270j4898R235L5379K1381k7830l1824p79R522M1600L5743m2738j9635
8061h094L2415K9265j1378l0340j4392M6891N0392k5124M915j497l150M612m6166
8048B8349l3093n361p85q193J3902L8397j8253j4809K4810K5310m846m0741n0301
8035d5614l401K3915L0485K2998J8516l711P295m310j4590n327l8970j8187J2282
8022a8619K8143J8038J1806l1598m870J2675j2929l4550L547L5955L6587j8307
8010B5878j4804J4247K1530q948o660p141m474k2683J3809J2711M339m111k150
7997B1543j8651k9370O745M4711j0201k7925j3883K5530M3774j1930J5313J6319
$$ plain form
8086 -5868 7537 30446 54802 14697 -29475 -45199 -70290 -96148 -87007 -70100 -56194 -31520
8074 -31520 -23250 -38148 -28913 6466 27847 17 -31807 -32586 -23064 18536 54279 11541 -8094
8061 -8094 24321 53586 42208 11868 -2524 44367 94759 69635 74550 73053 69903 74515 28349
8048 28349 -4744 -10105 -10890 -19083 -5181 33216 14963 154 24964 50274 45428 4687 -45614
8035 -45614 -49015 -25100 5385 28383 46899 43188 50483 46173 31583 26256 -12714 -30901 -18619
8022 -18619 9524 27562 39368 7770 2900 15575 2646 -31904 -28357 7598 44185 25878
8010 25878 11074 25321 46851 37903 31243 24102 19628 -3055 10754 23465 27804 23693 21543
7997 21543 2892 -26478 -19733 24978 14777 -13148 -27031 -1501 42273 30343 45656 61975
7985F1975K0298m244J5651K0629l5408k3617q448k3952l2986J1565j7604K0454
7973D313N2784J5804p647J4874N184n995J2215k1744m5683j1330N23M0899L6567
7960I0764K2674n270k5316j5524q095j7844K831J0852K5628k3819j1542O145N027
7947E6511N1420K7174L549j9311j8226l1617j9086j9949J3853j2626m3010j8059
7935b9377L754J0799J3946J2724k1177j6192M3861L3496j6892n2405J701K4585
7923H823p56m79L655J550J0854J0716j3047J2109J6826J876J043J4249p578r078
7909E0763q117P517o611l6802j6468J4507K2306j80l7239J5422L3577N0370k7654
7896F1391k3408j7877p935R336K56k8861l08L101k6810k9384J1602K0956L1417
$$ plain form
7985 61975 82273 78029 93680 114309 78901 55284 46836 22884 -10102 1463 -16141 4313
7973 4313 57097 72901 65254 80128 85312 79317 91532 69788 24105 12775 13298 54197 90764
7960 90764 113438 108168 82852 67328 59233 41389 44220 55072 80700 56881 45339 51484 56511
7947 56511 107931 135105 138654 119343 101117 69500 50414 30465 44318 31692 -11318 -29377
7935 -29377 -25623 -14824 -878 11846 -9331 -25523 18338 51834 34942 -17463 -15762 8823
7923 8823 8067 7588 11243 12793 23647 34363 21316 33425 50251 52127 53170 67419 59841 50763
7909 50763 42646 50163 43552 6750 -9718 4789 27095 26915 -10324 5098 38675 89045 61391
7896 61391 37983 20106 12171 21507 21763 -7098 -7406 -4305 -31115 -60499 -48897 -27941 3476
7883C476J2964o538l5407q147p869n847l485J4970M2771N780K4351R006J5052
7870F1077m5276M256K2973l6335j4707J078n610L8387Q635l2551P823o627J9757
7857B2880l653O799L022l4561J0791N375K239k8186J9880K7870m0081m5999o586
7844f0210J8241K2198R948M2131K848l7415l525k042j5058k8331J5191J2845K5591
7831B412K588M842j749r225l99k588R88m730m5292q505K7159L4468J970j4841
7817a2902Q476L0167M592j1611J0098J2870N1631l1611n4611l963j4568j6767
7805b8199J3441j3341J0270J5556k3463J8673L8857j87Q234M66j0319k0332k3032
7792a3376r583P766K1468O442j8987J9999K354j2155K5383J4150Q485k2348L2245
$$ plain form
7883 3476 16440 9902 -25505 -33652 -41521 -47368 -50853 -35883 6888 12668 37019 46025 61077
7870 61077 15801 20057 43030 6695 -8012 -6934 -12544 25843 34478 1927 9750 3123 22880
7857 22880 19227 26026 29048 -5513 5278 10653 12892 -15294 4586 32456 -7625 -53624 -60210
7844 -60210 -41969 -19771 -9823 32308 35156 -2259 -5784 -7826 -22884 -51215 -36024 -23179 2412
7831 2412 5000 9842 8093 -1132 -1531 -4119 -3131 -7861 -53153 -61658 -34499 -31 1939 -12902
7817 -12902 -4426 25741 30333 18722 28820 41690 93321 61710 7099 3136 -11432 -28199
7805 -28199 -14758 -28099 -17829 -2273 -25736 -7063 31794 31607 39841 40307 29988 9656 -13376
7792 -13376 -22959 -15193 6275 12717 -6270 13729 16083 3928 29311 43461 51946 29598 61843
7779F1843r267k3425J26N63l930k5900k7002p663p857K4077L0289J8458j8867
7766A1445j1939j1963j905J3351J4719j9229r879n82R778k8j6023k5400K4299
7753b3356K9884J2281j7708L209K195j6344j8287j98K4774R687J3665m188r507
7740F107k3643k3077r27P339l5796j3251K8121M937J9795M3941K0146R255l08
7727D2639q436l7655j5850K9624J2316q86l6413k6420K6008L8958L5374r341l5030
7714A4888j1120m0855j6291K9340j360J1376M4652M94k6783k9035N0518K1551
7702D7375l6722J5325N752k7848k8850J4241l9478o912J8440k0025j2406M2276
7690b8832M6472K271j6025j5033m447K2363J002M9j3213k4509K6178n32J7366
$$ plain form
7779 61843 52576 29151 29277 29840 25910 10 -26992 -34655 -42512 -18435 11854 30312 11445
7766 11445 -494 -12457 -14362 -1011 13708 -5521 -15400 -15982 -6204 -6232 -22255 -47655 -23356
7753 -23356 6528 18809 1101 4310 6505 -9839 -28126 -28324 -3550 6137 19802 15614 6107
7740 6107 -17536 -40613 -41540 -34201 -69997 -83248 -55127 -50190 -30395 13546 33692 42947 42639
7727 42639 34203 -3452 -19302 10322 22638 21752 -14661 -41081 -15073 23885 59259 49918 14888
7714 14888 3768 -37087 -53378 -24038 -25398 -14022 30630 31124 4341 -24694 25824 47375
7702 47375 10653 25978 31730 3882 -24968 -10727 -50205 -57117 -38677 -58702 -71108 -28832
7690 -28832 17640 19911 3886 -11147 -15594 6769 7771 7820 -5393 -29902 -3724 -4256 13110
7677A3110K8873j1523J9066m2044m6587o106K5172J4991l9574j788J1363M7798
7665A2751r754o561K0006R437j1154j2678O429L5531J0737k7553j7626j8868J2763
7652C460m612k3992k339M1246J2813k2046o045l1997K3467J9629O892J6284j3225
7639A9535l2766L7562J3635L88k1585l2855n405J7480j8990J5490O966R574J5323
7626B4352j7607M674k7738K3897K9687j7182p899J2321n438k4584J0157r474j0334
7613a5168j9922J1852N2710M969o413O312o094K2043J3835j8291k6402k2167j8289
7600b1025j3695J7652J7398j3615J2024j6273N906J414P834K4930q382J5327j3117
7587A6378k2984J7242O12q006l2243j5042l0740J1791K0768j7806K9304P49K2212
$$ plain form
7677 13110 41983 30460 49526 7482 -39105 -45211 -20039 -5048 -44622 -46410 -35047 12751
7665 12751 2997 -3564 16442 25879 14725 2047 8476 44007 54744 27191 9565 -9303 3460
7652 3460 -1152 -25144 -27483 13763 26576 4530 -1515 -33512 -10045 9584 16476 32760 19535
7639 19535 -13231 24331 37966 38354 16769 -16086 -21491 -4011 -23001 -7511 -545 9029 24352
7626 24352 6745 11419 -16319 7578 37265 20083 12184 24505 19067 -5517 4640 -4834 -15168
7613 -15168 -35090 -23238 29472 34441 28028 34340 28246 50289 64124 45833 19431 -2736 -21025
7600 -21025 -34720 -17068 330 -13285 -1261 -17534 -11628 -10214 -2380 22550 14168 29495 16378
7587 16378 -6606 10636 11248 3242 -29001 -44043 -74783 -62992 -42224 -60030 -30726 -29977 -7765
7574g765J6953m3821l5271N598L4231M801J6952j440K219J3350J4562j2694L887
7561A1562J5927L903k8385n3398j5572P149O624J4209Q152K3530J1827l3813k4987
7548e3272L7030j3963j5283J0080K9722L4201K2373j1153l2690q682k6201k6756
7536e4594P119Q567L540O316L796p754q160J8965K410j9621r577j0565J9854K4160
7522a5544L0760k9851K303O693J7321N860j0721L502J3982q59N820J2054k4969
7509A6351l6637K613J0694J2271R345Q19m3620l6314K4431o242K5693Q115K3822
7496A1341K7114J3031l4686p581J6887m1253j8112j2483j5804J7487M5595J5132
7484A6668n3757n922j4775J8348K6008L4210k1709K314L699Q970J5356J1307k0979
$$ plain form
7574 -7765 9188 -34633 -69904 -64306 -30075 -25274 -8322 -9762 -7543 5807 20369 7675 11562
7561 11562 27489 31392 3007 -50391 -65963 -58814 -52190 -37981 -29829 -6299 5528 -28285 -53272
7548 -53272 -16242 -30205 -45488 -35408 -5686 28515 50888 39735 7045 -1637 -27838 -54594
7536 -54594 -47475 -38908 -35368 -29052 -25256 -33010 -41170 -22205 -19795 -39416 -48993 -59558 -39704 -15544
7522 -15544 15216 -14635 -12332 -5639 11682 17542 6821 10323 24305 23446 29266 41320 16351
7509 16351 -20286 -17673 -6979 5292 14637 15456 -28164 -64478 -40047 -46289 -20596 -12481 11341
7496 11341 38455 51486 16800 9219 26106 -15147 -33259 -45742 -61546 -44059 1536 16668
7484 16668 -37089 -43011 -57786 -39438 -13430 20780 -929 1385 5084 14054 29410 40717 19738
7471A9738j8614Q474k2850p966k918q032J9343k6388l6861j6053J7863P319L1606
7458c5339m290q325L9896K6225k7507k6232K433L3497M8478k4022m4903J6096
7446c993N247j2130n216j0196j2666Q43n777J6538j890K563J5045K4975q379Q156
7432A3120m59J767k392K8345j218j022j5689M740k4706l5137J8484j0267k1846
7419d6280j8188m55L7209L0616m164p921K4551m290k9805J1463j8827k1664L1421
7406a6334L3136M458k9763k6707j3325j3447m01K6914P568n0180K3548L5373j2869
7393c2029Q499n3l068J0012j3643k3199J6427K4852J3621j4376L0612L8522J8025
7380G4202j1176k5606q65j8115m5106j1032K6154k459Q948n763j3080r603m022
$$ plain form
7471 19738 1124 9598 -13252 -21218 -24136 -32168 -12825 -39213 -76074 -92127 -74264 -66945 -35339
7458 -35339 -39629 -47954 -8058 18167 -9340 -35572 -33139 358 48836 24814 -20089 -3993
7446 -3993 1254 -10876 -16092 -26288 -38954 -38111 -43888 -27350 -29240 -26677 -11632 13343 4964 13120
7432 13120 12661 14428 12036 40381 39163 38141 22452 27192 2486 -32651 -14167 -24434 -46280
7419 -46280 -64468 -64923 -27714 2902 -1262 -9183 15368 11078 -18727 -7264 -26091 -47755 -16334
7406 -16334 16802 21260 -8503 -35210 -48535 -61982 -62383 -35469 -27901 -78081 -54533 -19160 -32029
7393 -32029 -23530 -23583 -26651 -16639 -30282 -53481 -37054 -12202 1419 -12957 17655 56177 74202
7380 74202 63026 37420 36555 18440 -26666 -37698 -11544 -14003 -5055 -10818 -23898 -33501 -37523
7367c7523m584K433P254J5210M64P696O224j700K0577J0368l7701k4496l064J8420
7353b0422j236o60M3315M894j6914k9827l736J3642M8403M3439j7119n1470P836
7340B0145J5422j1516j4190l0395m223O069k4396Q181J6280M5625N5940L659r051
7327G7550l9227k7539l4706l0454J554J5991l153J9428J0345k8605M4455M5774
7315E1413N49j5251j1583K0161m288J230J2812j0467j975k0738j9944N91l0063
7302b7553q524J14J7283J72l7777O627K2337N944J1996k0377j7050l148K2348
7289b7608J7651q822j6656j636j8178l522P4K4229J5194K0496J7214k4514K5982
7276A9904k441j004J6535p144o214j9251J097J3630K133l4549l1768K1977J2044
$$ plain form
7367 -37523 -42107 -39674 -32420 -17210 -16746 -9050 -2826 -4526 16051 26419 -11282 -35778 -38842 -20422
7353 -20422 -21658 -22318 20997 25891 8977 -20850 -24586 -10944 37459 80898 63779 12309 20145
7340 20145 35567 24051 9861 -20534 -24757 -18688 -43084 -34903 -18623 27002 82942 86601 77550
7327 77550 38323 10784 -23922 -54376 -52822 -36831 -39984 -20556 -10211 -38816 5639 51413
7315 51413 51962 36711 25128 45289 41001 42231 55043 44576 42601 21863 1919 2510 -27553
7302 -27553 -36077 -35963 -18680 -18508 -56285 -49658 -27321 -21377 -9381 -29758 -46808 -49956 -27608
7289 -27608 -9957 -18779 -35435 -37071 -55249 -58771 -58697 -34468 -19274 1222 18436 -6078 19904
7276 19904 17463 16459 32994 25850 19636 385 1482 15112 17245 -17304 -49072 -27095 -15051
7263a5051J121m048p764j992M25K4807k5193j1442L8683L0992R487l5237j5532
7250a0744j5083j0643J3222K1039m228j7844J1312j279J3236J0358q207j183k1441
7237b1485K8753P478m0614K8568K2023j4930R616n406L236j6070j6675j8090M124
7224b9472R659K9421j4227K5546R601j0434K1815J1317m9355k482l568K0187j6125
7211A883l2484J4411o266K0912m028j0798k6584K5460J9952K4593K554M330j3360
7198B0575j1362j7571j5449k9276k7290K9758L8538J0341j0347j5989K1788r860
7186a6144k2282J6840K1071j1082M674J8896K1245O775k7136k6753k2532j1037
7174d7465Q146j3574K1108M1957J7431J159K4277K4001k5878m185n199n483k3785
$$ plain form
7263 -15051 -13930 -17978 -25742 -27734 -27309 -2502 -27695 -39137 -454 30538 40025 4788 -10744
7250 -10744 -25827 -36470 -23248 -2209 -6437 -24281 -12969 -14248 -1012 9346 1139 -44 -21485
7237 -21485 7268 14746 -25868 2700 24723 9793 19409 14003 17239 1169 -15506 -33596 -29472
7224 -29472 -19813 9608 -4619 20927 30528 20094 41909 53226 3871 1389 -2179 18008 1883
7211 1883 -30601 -16190 -22456 -1544 -5572 -16370 -42954 -17494 2458 27051 29605 33935 20575
7198 20575 9213 -8358 -23807 -53083 -80373 -50615 -12077 -1736 -12083 -28072 -6284 -16144
7186 -16144 -38426 -21586 -515 -11597 -6923 11973 33218 39993 12857 -13896 -36428 -47465
7174 -47465 -39319 -52893 -31785 10172 27603 28762 53039 77040 51162 46977 41778 36295 12510
7161A2510k7345K2499M679k9843j472L5255J7487j4801l1209j8290K4850J5370
7149I690J0897R824J6839M79k2278n1878j5699J3485J8974J1681j9959j2634L7773
7136G194O423K532J082k4751N111j4654M237L5960r465K2761P188q512l8296k0398
7122b3588J6393o512J6796j0997J5050q579L446k324p521k970J0640k005j1810
7109a3981M1483n723l9851J2812K7985L3088r501O174J3823m0206n9999J679L2129
7096h8j6099l821L7515N334j815J9746j1418m753k1093O702l9437k1643K0219
7083c0651K159J3012K6785r422n513l930L0384l750m0016k801J8725m139K1740
7070A2583J6372k1196j3020j1014J6994n951j0097O152M6510l664m8483K6717
$$ plain form
7161 12510 -14835 7664 12343 -17500 -18972 16283 33770 18969 -12240 -30530 -5680 9690
7149 9690 20587 30411 47250 47729 25451 -26427 -42126 -28641 -9667 2014 -17945 -30579 7194
7136 7194 13617 16149 17231 -7520 -2409 -17063 -12826 23134 13669 36430 43618 35106 -3190 -23588
7122 -23588 -7195 -13707 3089 -7908 7142 -1437 2009 -315 -7836 -10806 -166 -2171 -13981
7109 -13981 27502 21779 -18072 -5260 22725 55813 46312 52486 66309 26103 -33896 -32217 -88
7096 -88 -16187 -20008 17507 22841 21026 40772 29354 24601 3508 10210 -29227 -50870 -30651
7083 -30651 -28492 -15480 11305 1883 -3630 -7560 22824 19074 -20942 -23743 -5018 -9157 12583
7070 12583 28955 7759 -5261 -16275 719 -5232 -15329 -9177 37333 33669 -14814 11903
7058A1903q706n662K5078J2497J1212K3487m284q291k6670k0817k5943M109k6903
7045c8990R552M390L1313M7639K8631k5884l7975k231r916k2391q606J1113J8870
7032E515J9979L171k6053l254j0280k7156k0182J3372k0825j358L7925J7854K6974
7019A5682j393j4511l2896M649K4869N917J6166J326l589J2131k97k8864j3418
7006a4228k0383j3643m0906J8327K3259L7550J0872p870J3513J485q399L8126
6994C7703M6139l7072p736j3133K833l8820k9862J5260K7231N026j6656k809n300
6981a7196j876M0882L4014Q55R569k5913l2463j4670n642k210K4147L9067J795
6968E0359r182l6461N090K6496o975k553M865q648j8207j6024k6183k391Q396
$$ plain form
7058 11903 3197 -2465 22613 35110 46322 69809 65525 57234 30564 9747 -16196 -12087 -38990
7045 -38990 -29438 -25048 6265 53904 82535 56651 18676 16445 6529 -15862 -24468 -13355 5515
7032 5515 25494 28665 2612 -642 -10922 -38078 -58260 -44888 -65713 -67071 -29146 -11292 15682
7019 15682 14289 -222 -33118 -28469 -3600 2317 18483 19809 16220 28351 28054 -810 -14228
7006 -14228 -34611 -48254 -89160 -70833 -47574 -10024 848 -7022 6491 7976 -423 37703
6994 37703 83842 46770 39034 25901 28734 -10086 -39948 -24688 2543 7569 -9087 -11896 -17196
6981 -17196 -19072 21810 55824 56679 66248 40335 7872 -6798 -12440 -14650 9497 48564 50359
6968 50359 41177 4716 9806 36302 29327 26774 31639 22991 4784 -11240 -37423 -39814 -31418
6955c1418l638J037p130J0371J4822K1453J8243k3007n282j2385O465K6912j7283
6942h40l20m133j5859j185k0148J1794R992P957j3746P761O862j7581K6873M7553
6928D4980j7173M239p168j9888N699k5007l1982M223P010R139J9645o757l7886
6915e0926R287L6998J4532K8853J5942N468j4969m3389K93L4497m359k8360j6605
6902a2738m845l0858l2017j0962J2354L965O865L8724M2564j1876m0145j7668
6890e6637j5165j439K0356J7726J3718l948N587L7507K4636k6197L419q31j9704
6877i72r956p279r608l16L6113r587m3042O581M5612L9973k0069N003J5359m325
6863D3487j9844k6417m1945J6512O4942k9979p053K4485Q883L620o806m121J920
$$ plain form
6955 -31418 -35056 -34019 -41149 -30778 -15956 5497 23740 733 -4549 -16934 -10469 16443 -840
6942 -840 -1160 -5293 -21152 -22337 -42485 -30691 -20699 -12742 -26488 -18727 -11865 -29446 -2573 44980
6928 44980 27807 32046 24878 4990 10689 -14318 -46300 -42077 -35067 -25928 -6283 -13040 -50926
6915 -50926 -41639 -4641 9891 38744 54686 60154 45185 1796 2089 36586 32227 3867 -12738
6902 -12738 -17583 -48441 -80458 -91420 -79066 -75101 -68236 -29512 13052 1176 -38969 -56637
6890 -56637 -71802 -73241 -52885 -35159 -21441 -25389 -19802 17705 42341 16144 19563 18732 -972
6877 -972 -10928 -18207 -27815 -28131 7982 -1605 -44647 -38066 7546 47519 27450 32453 47812 43487
6863 43487 23643 -2774 -44719 -28207 36735 6756 -297 24188 33071 36691 29885 25764 27684
6850B7684J677r684k804m851o311r776k0312j4635J1227J7197k040m7956m4024
6837a04608M5750L4603K188M024p845K2518N293K0996J330n4441J1142L009j5574
6824c1615n956k5996r609O035P682K6284R087k425k0480P196L0708L3073P21l5665
6810a0960j929k4845k0125L3113J8533L7601J5728k4598k8817J8769K4313j1362
6798B5421j6156k483j8733L5080L7358k1280j1960K974o13j9950K3870P29j7502
6785A6755k4122k578J5096K1333l499j3281j9188j7042k1541j9273n358L8376
6773c4322J0359L5688R127j4255l1039p382L5489J4773k2645m5628m6049K7797
6761f8087N5785J9972k2936j2454M8713L6161K3965q662p9683l4077l584K0883
$$ plain form
6850 27684 29361 19677 16873 12022 5711 -4065 -24377 -39012 -27785 -10588 -12628 -60584 -104608
6837 -104608 -58858 -24255 -22067 -18043 -25888 -3370 1923 22919 24249 -30192 -19050 -16041 -31615
6824 -31615 -37571 -63567 -73176 -67141 -59459 -33175 -24088 -26513 -46993 -39797 -9089 23984 24705 -10960
6810 -10960 -12889 -37734 -57859 -24746 -6213 31388 47116 22518 -6299 12470 36783 25421
6798 25421 9265 6782 -11951 23129 60487 39207 27247 30221 29608 9658 33528 34257 16755
6785 16755 -7367 -9945 5151 26484 22985 9704 -9484 -26526 -48067 -67340 -72698 -34322
6773 -34322 -23963 11725 20852 6597 -24442 -31824 3665 18438 -4207 -49835 -95884 -68087
6761 -68087 -12302 7670 -15266 -27720 20993 57154 81119 72457 -7226 -41303 -44887 -24004
6749b4004M6961J6145K6068Q93M092k6316l3144l9508K2223J6454j3813M7218
6737D3269J0896k7997P342Q130l4790k3773l2981N725J2904K7546K4098K38l2283
$$ plain form
6749 -24004 22957 39102 65170 66063 70155 43839 10695 -28813 -6590 9864 -3949 43269
6737 43269 54165 26168 33510 41640 6850 -16923 -49904 -44179 -31275 -3729 20369 20607 -11676
$$ [...]
##END NTUPLES=NMR SPECTRUM
##END=
