##TITLE=Analysis number 328624
Compound Code cc 60603
Book Reference 494/186
Project Code adrs
Chemist Name craigr
##JCAMPDX= 6.0         $$ Bruker NMR JCAMP-DX V2.0
##DATA TYPE= NMR SPECTRUM
##DATA CLASS= NTUPLES
##ORIGIN= Bruker BioSpin GmbH
##OWNER= nmr
$$ XWIN-NMR		Version 3.5
$$ Thu Jun 21 09:31:30 2007 GMT Daylight Time (UT+1h)  MAYBRIDGE\nmr@NMR_250MHZ
##.OBSERVE FREQUENCY= 250.131544655141
##.OBSERVE NUCLEUS= ^1H
##.ACQUISITION MODE= SIMULTANEOUS (DQD)
##.ACQUISITION SCHEME= undefined
##.AVERAGES= 16
##.DIGITISER RES= 18
##SPECTROMETER/DATA SYSTEM= dpx250
##.PULSE SEQUENCE= zg30
##.SOLVENT NAME= CDCl3
##.SHIFT REFERENCE= (INTERNAL, CDCl3, 0, 16.522)
##AUDIT TRAIL= $$ (NUMBER, WHEN, WHO, WHERE, WHAT)
$$ ##TITLE= Audit trail, XWIN-NMR		Version 3.5
$$ ##JCAMPDX= 5.01
$$ ##ORIGIN= Bruker BioSpin GmbH
$$ ##OWNER= nmr
$$ C:\u/data/dgb/nmr/ADRS/1770/pdata/1/auditp.txt
$$ ##AUDIT TRAIL=  $$ (NUMBER, WHEN, WHO, WHERE, WHAT)
(   1,<2007-06-21 09:31:08.82 +100>,<MAYBRIDGE\nmr>,<NMR_250MHZ>,
      <created by zg, POWCHK disabled, PULCHK disabled
       configuration hash MD5:
       76 6E 9A 78 1E 09 19 81 EC 84 63 8F B0 6A 59 2D
       data hash MD5: 64K
       F5 96 4D BA B4 5A F2 43 7E 06 5C 73 64 38 EE 86>)
(   2,<2007-06-21 09:31:21.26 +100>,<MAYBRIDGE\nmr>,<NMR_250MHZ>,
      <Start of raw data processing
       ef LB = 0.3 FT_mod = 6 PKNL = 1 SI = 32K 
       data hash MD5: 32K
       36 7F B0 FE B1 DB D6 19 4A D0 FD D3 BF DB 40 E9>)
(   3,<2007-06-21 09:31:23.00 +100>,<MAYBRIDGE\nmr>,<NMR_250MHZ>,
      <apk 
       data hash MD5: 32K
       2D D9 20 DE 1D 83 37 2B B0 78 07 BC 99 76 02 48>)
(   4,<2007-06-21 09:31:23.71 +100>,<MAYBRIDGE\nmr>,<NMR_250MHZ>,
      <abs ABSG = 5 
       data hash MD5: 32K
       48 CF 48 0C 5A A7 C8 47 01 A2 93 3D 70 FF E8 21>)
$$ ##END=
$$ 
$$ hash MD5
$$ 0E F4 82 70 F5 29 98 E1 97 06 3D 12 9C 25 73 5D
##$RELAX= 
##$RELAX= 
##$RELAX= 
##$RELAX= 
##$RELAX= 
##$RELAX= 
##$RELAX= 
$$ Bruker specific parameters
$$ --------------------------
##$DU= <C:\u>
##$EXPNO= 1770
##$NAME= <ADRS>
##$PROCNO= 1
##$TYPE= <nmr>
##$USER= <dgb>
##$AMP= (0..31)
100 100 100 100 100 100 100 100 100 100 100 100 100 100 100 100 100 100 
100 100 100 100 100 100 100 100 100 100 100 100 100 100 
##$AQSEQ= 0
##$AQ_mod= 3
##$AUNM= <au_zg>
##$AUTOPOS= <7 >
##$BF1= 250.13
##$BF2= 250.13
##$BF3= 250.13
##$BF4= 250.13
##$BF5= 500.13
##$BF6= 500.13
##$BF7= 500.13
##$BF8= 500.13
##$BYTORDA= 1
##$CFDGTYP= 0
##$CFRGTYP= 5
##$CHEMSTR= <none>
##$CNST= (0..31)
1 1 145 1 1 1 1 1 1 1 1 1 1 1 1 1 1 1 1 1 1 1 1 1 1 1 1 1 1 1 1 1 
##$CPDPRG= <>
##$CPDPRG1= <>
##$CPDPRG2= <>
##$CPDPRG3= <>
##$CPDPRG4= <mlev>
##$CPDPRG5= <mlev>
##$CPDPRG6= <mlev>
##$CPDPRG7= <mlev>
##$CPDPRG8= <mlev>
##$CPDPRGB= <>
##$CPDPRGT= <>
##$D= (0..31)
0 1 0 0 0 0 0 0 0 0.06 0 0 0 0 0 0 0.0002 0 0 0 0 0 0 0 0 0 0 0 0 0 0 
0 
##$DATE= 1182414668
##$DBL= (0..7)
120 120 120 120 120 120 120 120 
##$DBP= (0..7)
150 150 150 150 150 150 150 150 
##$DBP07= 0
##$DBPNAM0= <>
##$DBPNAM1= <>
$$ [...]
##$SUBNAM7= <"">
##$SUBNAM8= <"">
##$SUBNAM9= <"">
##$SW= 20.6930455092707
##$SWIBOX= (0..15)
0 0 3 0 0 0 0 0 0 0 0 0 0 0 0 0 
##$SW_h= 5175.983436853
##$TD= 65536
##$TD0= 1
##$TE= 296.16
##$TE2= 300
##$TE3= 300
##$TEG= 300
##$TL= (0..7)
0 120 120 120 120 120 120 120 
##$TP= (0..7)
150 150 150 150 150 150 150 150 
##$TP07= 0
##$TPNAME0= <>
##$TPNAME1= <>
##$TPNAME2= <>
##$TPNAME3= <>
##$TPNAME4= <>
##$TPNAME5= <>
##$TPNAME6= <>
##$TPNAME7= <>
##$TPOAL= (0..7)
0.5 0.5 0.5 0.5 0.5 0.5 0.5 0.5 
##$TPOFFS= (0..7)
0 0 0 0 0 0 0 0 
##$TUNHIN= 0
##$TUNHOUT= 0
##$TUNXOUT= 0
##$USERA1= <user>
##$USERA2= <user>
##$USERA3= <user>
##$USERA4= <user>
##$USERA5= <user>
##$V9= 5
##$VALIST= <valist>
##$VCLIST= <CCCCCCCCCCCCCCC>
##$VD= 0
##$VDLIST= <DDDDDDDDDDDDDDD>
##$VPLIST= <PPPPPPPPPPPPPPP>
##$VTLIST= <TTTTTTTTTTTTTTT>
##$WBST= 1024
##$WBSW= 4
##$XGAIN= (0..3)
0 0 0 0 
##$XL= 0
##$YL= 0
##$YMAX_a= 431438
##$YMIN_a= -300964
##$ZGOPTNS= <>
##$ZL1= 120
##$ZL2= 120
##$ZL3= 120
##$ZL4= 120
##$ABSF1= 16.522
##$ABSF2= -4.171173
##$ABSG= 5
##$ABSL= 3
##$ALPHA= 0
##$AQORDER= 0
##$ASSFAC= 0
##$ASSFACI= 0
##$ASSFACX= 0
##$ASSWID= 0
##$AUNMP= <proc_1d>
##$AZFE= 0.1
##$AZFW= 0.1
##$BCFW= 0
##$BC_mod= 0
##$BYTORDP= 0
##$COROFFS= 0
##$CY= 12.5
##$DATMOD= 1
##$DC= 0
##$DFILT= <>
##$DTYPP= 0
##$F1P= 14.0000005364418
##$F2P= -0.99999901652339
##$FCOR= 0.5
##$FTSIZE= 32768
##$FT_mod= 6
##$GAMMA= 0
##$GB= 0
##$INTBC= 1
##$INTSCL= 1
##$ISEN= 128
##$LB= 0.3
##$LEV0= 0
##$LPBIN= 0
##$MAXI= 10000
##$MC2= 0
##$MEAN= 0
##$ME_mod= 0
##$MI= 0
##$NCOEF= 0
##$NC_proc= -3
##$NLEV= 6
##$NOISF1= 0
##$NOISF2= 0
##$NSP= 0
##$NTH_PI= 0
##$NZP= 0
##$OFFSET= 16.522
##$PC= 1
##$PHC0= -53.4221
##$PHC1= 6.707775
##$PH_mod= 1
##$PKNL= yes
##$PPARMOD= 0
##$PSCAL= 4
##$PSIGN= 0
##$REVERSE= no
##$SF= 250.13
##$SI= 32768
##$SIGF1= 0
##$SIGF2= 0
##$SINO= 400
##$SIOLD= 32768
##$SREGLST= <1H.CDCl3>
##$SSB= 0
##$STSI= 32768
##$STSR= 0
##$SW_p= 5175.98343685301
##$SYMM= 0
##$S_DEV= 0
##$TDeff= 65536
##$TDoff= 0
##$TI= <Analysis number 999999
Compound Code 99
Book Reference 9
Project Code 9>
##$TILT= no
##$TM1= 0
##$TM2= 0
##$TOPLEV= 0
##$USERP1= <user>
##$USERP2= <user>
##$USERP3= <user>
##$USERP4= <user>
##$USERP5= <user>
##$WDW= 1
##$XDIM= 32768
##$YMAX_p= 501049888
##$YMIN_p= -66763
$$ End of Bruker specific parameters
$$ ---------------------------------
##NTUPLES= NMR SPECTRUM
##VAR_NAME=  FREQUENCY,     SPECTRUM/REAL,   SPECTRUM/IMAG
##SYMBOL=    X,             R,               I
##VAR_TYPE=  INDEPENDENT,   DEPENDENT,       DEPENDENT
##VAR_FORM=  AFFN,          ASDF,            ASDF
##VAR_DIM=   32768,         32768,           32768
##UNITS=     HZ,            ARBITRARY UNITS, ARBITRARY UNITS
##FACTOR=    0.157963299565203, 1,           1
##FIRST=     4132.6476996994, 0,             0
##LAST=      -1043.33573715361, 0,           0
##MIN=       -1043.33573715361, -66763,      0
##MAX=       4132.6476996994, 501049888,     0
$$ Real data points
##PAGE= N=1
##DATA TABLE= (X++(R..R)), XYDATA
$$ [...]
18948C05030L0785O5956P6438N7056N5047N4425R597l2275n1785q8734p8317l9076
18936C64147j1567J6971J8675J0002m159j540j6437l1240l9652l6595m0448k0029
18924B08128l2046k3502o644j3695m961k1376j5644M896L474L709n440o216l1309
18911E9374r461O251K0040j1298k6630J633L3246K837N300M637o256p383j0292
18898F1998J9914j4803p267k458N179L993j0345o297N088J859K5108K404Nj9085
18884F5293j4574m684q347o795K473Q424j1251J8145J4527M655K7953K5761j7965
18871A03615j9101n293J818J460N300N38k2706k041M006j3984q42p482J0879L186
18857E9353j992n563Q141J2086J6560K0122K244j7868p293K712r361o364j0300
$$ plain form
18948 305030 335815 401771 478209 535265 590312 644737 654334 622059 570274 481540 403223 364147
18936 364147 352580 369551 388226 398228 394069 392529 376092 344852 305200 268605 228157 208128
18924 208128 176082 152580 145936 132241 127280 105904 90260 95156 98630 102339 96899 90683 59374
18911 59374 49913 56164 76204 64906 38276 39909 73155 75992 81292 85929 79673 72290 61998
18898 61998 81912 67109 59842 57384 62563 66556 56211 49914 55002 56861 81969 84373 84378 65293
18884 65293 50719 46035 37688 30893 33366 41790 30539 48684 63211 67866 95819 121580 103615
18871 103615 84514 79221 81039 82499 87799 88337 65631 63590 67596 53612 52770 45288 56167 59353
18857 59353 57361 51798 59939 72025 88585 108707 110951 93083 85790 88502 79141 72777 62477
18844F2477l062J629J2045m799n240k3312Q48J176O874J378J3389O001j5990j0728
18830D2686M40k2508n707R781K6149R567K6913K2415M051o760j8227O522Q349
18817A03671j4732L419J0521K5097K336j6279j4054m320o655j5475Q043K1383
18805A02955J6365L2899K3238R774J3530Q732l419k8944j2421R500O96o514N271
18792A71662j30K919j6911r968m371k0249k665J5718r99J3679J1672r297l44K2211
18778A72927J6085M894K0072O0823N6811N3295O5204O5881J9468j327K538L7884
18766E74555M3319N574O176O510M8819P7095L1713k3664k7323M0952M5689L7237
18754H66652Q3334R0347R1333N9011N480j4085q220j6613k9158n718K5550O0407
$$ plain form
18844 62477 59415 61044 73089 68290 63050 39738 40586 41762 48636 50014 63403 69404 53414 42686
18830 42686 43126 20618 14911 24692 50841 60408 87321 109736 113787 107027 88800 95322 103671
18817 103671 88939 92358 102879 127976 130312 114033 99979 95659 89004 73529 81572 102955
18805 102955 119320 152219 175457 185231 198761 207493 204074 175130 162709 172209 172905 166391 171662
18792 171662 171532 174451 157540 147572 143201 122952 120287 136005 135006 148685 160357 151060 150716 172927
18778 172927 189012 193906 213978 274801 331612 384907 450111 515992 535460 534133 536671 574555
18766 574555 617874 623448 629624 636134 684953 762048 793761 770097 742774 783726 829415 866652
18754 866652 949986 1040333 1131666 1190677 1196157 1182072 1173852 1157239 1128081 1122363 1147913 1208320
18742A208320Q0968O5258J24419J77824K06949K46514L37203M26562N62569P28183
18732D164769J011181J435955K086841L205712N098812P645727R095276O710600
18724D0454873L014055J099891k931210p279108q266967p675072n706629l569772
18716I140061k142601j358583r53658p41469n93952m48614l15986k01576j03697
18707B279925r246M2584K8773P204m448J6546J3338M995n385M218j0989L623Q234
18694B379372O721L5263Q1327J20414J41146K14339L10414M21711N50464P06604
18684D967775R13623J231078J717841K425010L527092N444692Q554365J2484305
18676D1265781J4367322J1128905N853962J453297m706695j1178041j3782395
$$ plain form
18742 1208320 1289288 1354546 1478965 1656789 1863738 2110252 2447455 2874017 3436586 4164769
18732 4164769 5175950 6611905 8698746 11904458 17003270 24648997 33744273 40454873
18724 40454873 43468928 44568819 41637609 34358501 26091534 18416462 12709833 9140061
18716 9140061 6997460 5638877 4685219 3943750 3349798 2901184 2585198 2383622 2279925
18707 2279925 2270679 2313263 2342036 2349240 2344792 2361338 2374676 2379671 2374286 2378504 2367515 2371138 2379372
18694 2379372 2386093 2421356 2502683 2623097 2764243 2978582 3288996 3710707 4261171 4967775
18684 4967775 5881398 7112476 8830317 11255327 14782419 20227111 28781476 41265781
18676 41265781 55633103 66762008 72615970 74069267 69362572 58184531 44402136
18669D4402136j2852440r928205o487508m042651k603509j781818j253755r28548
18661D523702o63838m87724l64690k77985j83067j22620j10445p7318j524L1768
18651B266259M2468O818l0861k7402m0783m2337l1428l3861j4293n55L7110N2966
18639B184101J09478J35413J64079K10446K54432L37555M36780O19879R31179
18630E383342J359147K066973L356207N215104O596647N299736K349376R79876
18622C2606408j615835n107183o139444n813377m486485k858704j769144j131651
18614C684585p55428n57947m09245k97381k02820j67698j50641j09655q8313n6580
18604H88877m6118l9301q239P516J1186k9859k8528k5057l2330k5682n0572l4011
$$ plain form
18669 44402136 31549696 21621491 15133983 11091332 8487823 6706005 5452250 4523702
18661 4523702 3859864 3372140 3007450 2729465 2546398 2423778 2313333 2236015 2234491 2266259
18651 2266259 2308727 2315545 2284684 2257282 2216499 2174162 2142734 2108873 2094580 2094025 2131135 2184101
18639 2184101 2293579 2428992 2593071 2803517 3057949 3395504 3832284 4452163 5383342
18630 5383342 6742489 8809462 12165669 17380773 23977420 29277156 31626532 32606408
18622 32606408 30990573 25883390 19743946 13930569 9444084 6585380 4816236 3684585
18614 3684585 2929157 2371210 1961965 1664584 1461764 1294066 1143425 1033770 945457 888877
18604 888877 842759 803458 795219 802735 813921 784062 755534 730477 698147 672465 621893 587882
18592E87882n921k5454m0628k6902n3571m5177j3276k7902j9646P927r984k4414
18580C02934j3419j7245k7170j8053p582K960N608R188k5461j3914Q887l595K688
18567B05826j7506K67K326M823q082j4694K987Q27k5164P039j4554j2537Q172
18554A39730J5720j286L272J3488l422j2001O970q38j2195k4273q940K4513j0498
18541A30240k4212o141K689Q852n630o618m332n583n712K2846m931o376Q734R544
18527A13370J6958N933k2476q743J6719K6215K2591L4528K8956J9225o447j6249
18515B30580j5071j0145k3484o447m129p718j6533r737K6014N5267L1757J2802
18503B63156J1241N863j1608k7932k8560j6801k5746k6180M997J5494j6934k0773
$$ plain form
18592 587882 581961 556507 515879 488977 435406 390229 376953 349051 329405 337332 327348 302934
18580 302934 289515 272270 245100 227047 219465 222425 228033 237221 211760 197846 206733 203138 205826
18567 205826 188320 188587 190913 195736 187654 172960 175947 176774 151610 158649 144095 131558 139730
18554 139730 155450 154164 157436 170924 167502 155501 162471 161633 149438 125165 116225 140738 130240
18541 130240 106028 99887 102576 111428 105798 99180 94848 89265 83553 106399 101468 95092 103826 113370
18527 113370 130328 136261 113785 105042 121761 147976 170567 205095 234051 253276 246829 230580
18515 230580 215509 205364 181880 175433 171304 163586 147053 137316 163330 218597 250354 263156
18503 263156 274397 280260 268652 240720 212160 195359 169613 143433 148430 163924 146990 126217
18491A26217N637M628o665r752p823J1208N341j8565j3915J7338J5476m323Q373
18478A33175J0480R948J1494L863j4445P86J1650O114J3786J0462Q409J3488K372
18465B21582j2750n671J2388n51j8284M890J4860K9553J0697J2244J3222n721
18453B76459M630J1008J6893r145P508K1730J1257Q408J05K0620K5934J4796l133
18440D07070m714J30J7161J4063R252P855J8478M8773L9742L2421K7825K2487
18428F40543M8589M3079N8948N5650O8419Q2440J31857J61647J70420J64962J47230
18417A773784J11078P2126J8603j6906l923M7410R7834J51101K07754K76820L56466
18406C092147M67987N53362O46970P19030Q01024R75928J234783J739913K630926
$$ plain form
18491 126217 131854 136482 129817 120065 112242 123450 128791 110226 96311 113649 129125 124802 133175
18478 133175 143655 153603 165097 168960 154515 155301 166951 173065 186851 197313 205722 219210 221582
18465 221582 208832 203161 215549 214998 196714 201604 216464 246017 256714 268958 282180 276459
18453 276459 281089 292097 308990 299845 307353 329083 340340 348748 348853 369473 395407 410203 407070
18440 407070 402356 402486 419647 433710 442962 450817 469295 518068 557810 590231 618056 640543
18428 640543 689132 732211 791159 846809 915228 997668 1129525 1291172 1461592 1626554 1773784
18417 1773784 1884862 1956988 1975591 1958685 1954762 2002172 2100006 2251107 2458861 2735681 3092147
18406 3092147 3560134 4113496 4760466 5479496 6280520 7256448 8491231 10231144 12862070
18397A2862070M073188O294347R151102J1890228J3263496J1457974O254020L74898
18389G5621323o770240j0875184j1818021j0359764p215550l945998q48345K206207
18381B5994428N530328Q970470J1691377J2414798R277304L567328k894326r820797
18373F4730910j2772708j3130377j1067427q090905n433536l491638k264079j499931
18365F980309j039053p53629n83690m88593m61432m17228l65162l35277l07951
18356B228294k11579j21956p0369n2705P631R855m400j4126q4597j22050j62536
18345A401462j69055j43912j37987j08647q0345n7315m4210k1289j0300k8625
18335E99777l6336k7802m0949m1037k0700j9667j6070q580l1644j4807L40r943
$$ plain form
18397 12862070 16935258 23229605 32380707 44270935 57534431 68992405 75246425 75621323
18389 75621323 68851083 57975899 46157878 35798114 28582564 24636566 23788221 25994428
18381 25994428 31524756 40495226 52186603 64601401 73878705 77446033 74551707 64730910
18373 64730910 51958202 38827825 27760398 19669493 14235957 10744319 8480240 6980309
18365 6980309 5941256 5187627 4603937 4115344 3653912 3236684 2871522 2536245 2228294
18356 2228294 2016715 1894759 1824390 1771685 1779316 1789171 1784771 1770645 1686048 1563998 1401462
18345 1401462 1232407 1088495 950508 841861 761516 704201 659991 638702 628402 599777
18335 599777 563441 535639 494690 453653 432953 413286 397216 388636 356992 342185 342525 332582
18323C32582L813L415J0524J1490K073j9675l85J7822L2728O5349P6183P6844
18311F12763R5671R5510K8044l0954r0882r6589r9399q3936n4095j9163J3116
18300C70086M5513Q2783O5751P4810Q7428K4593j4942o4267q5153r1682q9109
18289D05811q0492o8157l5573m0202j1242j5149Q55j4380q880P288O628l408J067
18276A44166l486N670j5514j2525J1474J693R052Q600J9121m970R44j0224j5389
18263A38612l329j4757j5318r386r63o789p25Q809J347o348J2289J1081J2239
18250A26762J1576J8252n377l2291k6296j1480J088j0268J2447J0308O746M1435
18238A42902K2766J1998K6777O0786L8763K651j2239k9688m4469m6917m1559n2507
$$ plain form
18323 332582 336395 339810 350334 361824 363897 344222 343837 361659 394387 459736 535919 612763
18311 612763 708434 803944 831988 801034 710152 613563 514164 430228 376133 356970 370086
18300 370086 415599 498382 564133 638943 726371 750964 736022 671755 586602 494920 405811
18289 405811 325319 257162 221589 181387 170145 154996 155851 141471 132591 139879 146507 143099 144166
18276 144166 140680 146350 130836 118311 129785 131478 140530 149130 168251 163281 164225 154001 138612
18263 138612 135283 120526 105208 95822 94859 88070 87345 96154 97501 91153 103442 114523 126762
18250 126762 138338 156590 151213 118922 92626 81146 82234 71966 84413 94721 101467 142902
18238 142902 165668 177666 204443 265229 303992 306643 294404 264716 220247 173330 131771 79264
18226G9264k0240J6955J4994J874L972j128K75J325k036r381o884q359Q600j1649
18212F7582j7042L447q634q092R735M1117J2316j2130J3736L2524N0227L2476
18200B17262K2997m047J2095j192m1893n3079k2284j086n721R276M0832L2473
18188B05633M6867M0865N7511P9245Q7309K8048j797m51m1766p8498j04655r6482
18176B21829m7289l6287j6813L988P846M01p538k9750j2092O411j4179P908Q848
18163I3283K3791o89j0043K5245M0651J5357j2021J925L4013K2569N8147Q6676
18151C78904N7740M2966K2598J6903r8m1354o2413k5095j6977Q77M810M5720Q4203
18138E08784Q8739N2335J9745Q320J9199k8196m8686n4066m4562N20J9788J3774
$$ plain form
18226 79264 59024 75979 90973 92847 96819 95691 95966 97291 95255 85874 78990 70631 79231 67582
18212 67582 50540 53987 45353 37261 46996 88113 100429 88299 102035 134559 184786 217262
18200 217262 240259 236212 248307 247115 205222 152143 129859 128773 123052 132328 173160 205633
18188 205633 252500 293365 350876 430121 517430 545478 543681 543230 501464 422966 318311 221829
18176 221829 174540 138253 121440 125428 133274 133675 126137 96387 84295 90706 76527 84435 93283
18163 93283 117074 116385 106342 131587 172238 187595 175574 177499 211512 234081 292228 378904
18151 378904 436644 479610 502208 519111 519013 477659 415246 390151 373174 374051 378861 424581 508784
18138 508784 597523 649858 669603 677923 697122 668926 620240 566174 521612 522132 541920 555694
18126E55694N1716O7317O3903P2235J20987J75017K21940K53660K80834K76556
18116B139859L38961M70835P14892J170092J957644L371519N955944R271149R582471
18107C4973366J737125o156809q335417q144859n284403k906193j621586j010266
18099C250958o62724m24059k85477k37795k14897k06653k05492j85970j14343
18090G13548p6521p7400n4994n5595p0409l9836k5210j1659l6330r915k0886j6097
18078B18696j1032j3160k1168J170J6854j1114k163J032P044K5596K2117R198
18066B43070j4518k8008l2206k3383p416J2513L967l351K5990L8606J6671l698
18054B28237l2134l5029j5949r94k5162n275j8130R395Q562j732j7571l9267j4674
$$ plain form
18126 555694 607410 674727 738630 810865 931852 1106869 1328809 1582469 1863303 2139859
18116 2139859 2478820 2949655 3664547 4834639 6792283 10163802 16119746 25390895 34973366
18107 34973366 36710491 30553682 22218265 14073406 8789003 5882810 4261224 3250958
18099 3250958 2588234 2164175 1878698 1640903 1426006 1219353 1013861 827891 713548
18090 713548 637027 559627 504633 449038 378629 338793 313583 301924 265594 255679 234793 218696
18078 218696 207664 194504 173336 174506 191360 180246 178083 179115 186159 211755 233872 243070
18066 243070 228552 200544 168338 144955 137539 150052 154019 150668 176658 215264 231935 228237
18054 228237 196103 161074 145125 144131 118969 113694 95564 104959 113521 111789 94218 54951 40277
18041D0277R880j3197q702J1893m975k4750M061P119O029N802N168J5966n093
18028D9478j2608K478l585k624l913j411k449J1513N699M325j6199M706J7379
18015E2789K848j7118p314j5471n369J797J8637m496q986j9385k2393R746N227
18002i488m865N352J5377L264P39j5193n866r278K274k162Q095K5915K931j4463
17988B632j092j811k001Q487J5527J7089O463j344j8617l72j161l351K135N746
17974B8330o743k267o885k4473j0297r452R572J2518J3747k292j2585o874K291
17961a5410K6577R361m649P847R315J1179O794j506n170o115k200j808L749m306
17947C3658N78l744J724Q39j6655j0365J2669Q781j9343m986o071O527l792p069
$$ plain form
18041 40277 50157 36960 28258 40151 35176 10426 14487 21606 27635 33437 38605 54571 49478
18028 49478 36870 39348 35763 33139 29226 27815 25366 36879 42578 46903 30704 35410 52789
18015 52789 55637 38519 31205 15734 10365 12162 30799 26303 17317 -2068 -24461 -14715 -9488
18002 -9488 -14353 -9001 6376 9640 10379 -4814 -10680 -19958 -17684 -19846 -11751 14164 17095 2632
17988 2632 1540 -271 -2272 6215 21742 38831 45294 43950 25333 24961 23800 20449 22584 28330
17974 28330 21587 19320 12435 -12038 -22335 -31787 -22215 -9697 4050 1758 -10827 -17701 -15410
17961 -15410 11167 20528 15879 23726 33041 44220 51014 49508 44338 38223 36023 34215 37964 33658
17947 33658 34236 30492 32216 33055 16400 6035 18704 27485 8142 3156 -2915 3612 -180 -7249
17933g249N961K62O592K450p55O42K36n569P162l80k3377J3947R454n628j4380
17918a0632l1930R431K6721J0603j721J8072J3571r997j9074k287K0825Q543j4054
17905A8071P314N451k5394j0172j6123J4839Q742q060J2130J2234R368j506j8748
17892H146n732j7887q898j427J1308l053n15Q417J034Q25J3891j040r461n087
17878i479k2067l262K5314j8950j3046K2010J503p747J6879J5517M625k2284j0598
17865b1585j8588J6604K5373K470O660j7724j3696K514M975q984j1485O874K886
17852b3706L68J4825m075q076R385O52q478N503n058j21J5128J0131O769l999
17838I248j0896j219R630O481m68J078M884j933q92n196p420j3170R07n234O602
$$ plain form
17933 -7249 -1288 -1026 5566 8016 7261 7903 8139 2570 9732 9352 -14025 -78 9376 3748 -10632
17918 -10632 -42562 -33131 -6410 4193 2472 20544 34115 24118 5044 2757 23582 32125 18071
17905 18071 25385 30836 5442 -4730 -20853 -6014 2728 -5332 6798 19032 28400 26894 8146
17892 8146 2414 -15473 -24371 -25798 -14490 -17543 -18058 -9641 -8607 -7782 6109 5069 -4392 -9479
17878 -9479 -31546 -34808 -9494 -28444 -41490 -19480 -17977 -25724 -8845 6672 11297 -10987 -21585
17865 -21585 -40173 -23569 1804 4274 10934 -6790 -20486 -17972 -12997 -21981 -33466 -26592 -23706
17852 -23706 -23338 -8513 -12588 -20664 -11279 -10627 -19105 -13602 -18660 -18781 -3653 6478 13247 9248
17838 9248 -1648 -2867 6763 13244 12776 13854 18738 16805 15913 10717 3297 -9873 -8966 -14200 -7598
17823g598O989M51o365m759L992R279p605l514O575j2746K4453K5060j0351k2211
17809A650P77L761J0500K8183J7906P169J2089J5793L7195O5958P4762N6912L9636
17796C72291J7667l3840l5421n0249n4674m9985j2300l925k965K6251L8630O0831
17784B72311L4348K7603J1665K372j0963m7947p5050n6375l1084l6898k1259j8502
17772E0221l0395j6831L74j704K3836K1135r662r635M877K66K227r13J3195l351
17758D3640l87j0046j1446p09l317J4006k9503j4472r342L055N831r158K825L418
17744a5605J1288J8181p796O216q432L609q672r538L685R905o986j181q223P90
17730a2759K037n444q509J585J5229M241M710J5972k0497k9604J2737K1655r87
$$ plain form
17823 -7598 -609 -158 -6523 -11282 -7290 1989 -5616 -9130 -2555 -15301 9152 34212 23861 1650
17809 1650 2427 6188 16688 44871 62777 69946 82035 97828 135023 200981 275743 332655 372291
17796 372291 389958 356118 320697 270448 215774 165789 153489 149564 146599 172850 211480 272311
17784 272311 306659 334262 345927 348299 337336 289389 214339 157964 126880 89982 68723 50221
17772 50221 19826 2995 3369 1665 25501 46636 36974 27339 32216 32482 34709 33796 46991 43640
17758 43640 43253 33207 21761 21052 17735 31741 2238 -12234 -21576 -18521 -12690 -21848 -19023 -15605
17744 -15605 -4317 13864 6068 12284 3852 7461 -1211 -10749 -7064 2841 -4145 -5326 -13549 -12759
17730 -12759 -10722 -16166 -24675 -23090 -7861 -3620 1090 17062 -3435 -33039 -20302 1353 366
17717C66j6945j2339K2281K1287j7419r66l704k797J9616l166l695k093q243l538
17703a1355J7679j015Q634K0148j4360O082j222L037K550J722k4380o65j1500
17690d645j93J3746J860J8535J0988R95j2464k2931j959R457P124j8451p273M259
17676i52J1241N658Q705L822l403m309m469j419J2842R034l463J0516J1733M499
17662F0035K9900K1919Q205M4645N4037P4281Q6457O8365K526p5841q6603n3913
17650B34013n1177o5584m3682J5221K3407J2433L8660P1084R3677Q7310L9437
17639D54799k6042q6033r5620p6003n2059l2715j6316J3466m532m577p52k3397
17627E0219k1781j9081k1842K0334J9683n638j8001j176R173j2197j2793J4659
$$ plain form
17717 366 -16579 -28918 -6637 14650 -2769 -3735 -7439 -10236 9380 6214 2519 426 -7817 -11355
17703 -11355 6324 5309 13943 34091 19731 25813 24591 27628 30178 31900 7520 6855 -4645
17690 -4645 -4838 8908 10768 29303 40291 41286 28822 5891 3932 13389 20513 2062 -5211 -952
17676 -952 10289 15947 24652 28474 25071 20762 16293 14874 27716 36750 33287 43803 55536 60035
17662 60035 89935 111854 120059 164704 218741 293022 379479 447844 450370 374529 287926 234013
17650 234013 182836 117252 73570 88791 112198 124631 163291 234375 328052 415362 454799
17639 454799 428757 342724 247104 171101 119042 86327 70011 83477 78945 74368 73616 50219
17627 50219 28438 9357 -12485 7849 27532 21894 3893 2717 11890 -307 -13100 1559
17615A559J3387K240j5283n679K656K9273j7998k843O259N68j4747P117M966k684
17601H791m915p439j4673j5401k634K7093J3530J2661K50r757j5373l03k266K285
17587h151j6534q570k051J2215K2473R518o470j9865J0498J6767q061j6515o10
17574a5356j580l296R540r648m57O531Q039k697M873K8939K3904l0827j0436j0784
17560c255L157P190k762l149r198M896J2681L537q504p456l272K317J9389j3086
17546B485N705K710J7910k2388k9420M862J3528j17j1154q700J379K1360R022
17533G182J0265J5383j3888J085M831q478j2519N233n428j0105J092O934m783
17520c196l226j578o453J0310K3563J51j4572J1270o801q761j2651M005q51j6810
$$ plain form
17615 1559 14946 17186 1903 -3776 -1120 28153 10155 7312 13571 14139 -608 6509 11475 8791
17601 8791 3876 -3563 -18236 -33637 -36271 -9178 4352 17013 17263 7506 -7867 -8170 -10436 -8151
17587 -8151 -24685 -33255 -35306 -23091 -618 8900 2430 -17435 -6937 9830 1769 -14746 -15356
17574 -15356 -16936 -20232 -10692 -20340 -20797 -14266 -6227 -8924 -4051 24888 48792 17965 7529 -3255
17560 -3255 -98 7092 4330 1181 -8017 -3121 9560 13097 4593 -2863 -6135 -3818 15571 2485
17546 2485 8190 10900 28810 6422 -22998 -18136 -4608 -4725 -15879 -24579 -23200 -1840 7182
17533 7182 17447 32830 18942 20027 24858 16380 3861 9094 3666 -6439 -5347 1587 -3196
17520 -3196 -6422 -8000 -14453 -4143 19420 19571 4999 16269 9468 707 -11944 -7939 -8790 -25600
17506b5600j2232J0863J9504o354K159j910M338n616o71p29m719j921K0190k740
17492e438P671J227M131j3125l962Q861J3409j5176M594J082j6276R388J6944
17479A3330O88j1762j4597K967J431M890j89n590l587j567O880O615Q883r936
17465a544J528j029L99Q555k758p331K4929J5674r973j8248n880o763K5690N924
17451B9173j2356P905L285J0045j0351r208J3688L3864N9583P2560L9749m7463
17439A90474n1819l7174l3078j8282j9345j6356m973r410n17J9796p261j6913
17427d858J9144p078k852k431r175k115o08N892R835O103m071K3997Q144n948
17413C3979M289J792k0422r596J2027L56j5899j9525q335j223J3621L13l41R200
$$ plain form
17506 -25600 -37832 -26969 -7465 -13819 -11660 -13570 -9232 -14848 -15519 -16248 -20967 -22888 -2698 -5438
17492 -5438 2233 3460 7591 -5534 -9496 -635 12774 -2402 2192 3274 -13002 -3614 13330
17479 13330 14018 2256 -12341 -9374 -7943 -3053 -3242 -8832 -12419 -13986 -7106 -491 8392 -1544
17465 -1544 -16 -1045 -646 7909 5151 -2180 22749 38423 28450 10202 4322 -2441 23249 29173
17451 29173 16817 24722 28007 38052 27701 18493 32181 66045 125628 198188 237937 190474
17439 190474 138655 101481 68403 50121 30776 14420 9447 37 -480 19316 12055 -4858
17427 -4858 14286 7208 4356 1925 -7250 -9365 -9973 -4081 5754 11857 7786 31783 39927 33979
17413 33979 38268 40060 19638 10042 22069 22425 6526 -12999 -21334 -22557 -8936 -8623 -8964 236
17399B36J3651R127k6296j1910J2127J2169J808q911n409r985L002n39J910n823
17385a4843J4523J6962R195q811n303J3896j6417j0437j0952J2046K5833k6982
17373a290o271J1767j2008L194O253K884M89J7227O786J9359J407J991p678j2951
17359C1159r188M204M97q519L1267L5357J5330j4214j2331j2422j2650p970R254
17346D9774M5l305P59j3857P834J8925J0245J5434J0828N435k9385k6303k1330
17333B5099j5683o983R41K0735p848M520j1003J3833J0417j2769k2075O510L9728
17320D5422P488N214j0406l0844m808J1633K068Q261k806j0766P76Q693L409j554
17306C1780j6835K351K7016Q751j416j0415j6611J0010L871M015r4K923O14N920
$$ plain form
17399 236 13887 23014 -3282 -15192 -3065 9104 10912 2001 -3408 -13393 -10391 -10930 -9020 -14843
17385 -14843 -320 16642 25837 17026 11723 25619 9202 -1235 -12187 -141 25692 -1290
17373 -1290 -7561 4206 -7802 -4608 1645 4529 5018 22245 29031 48390 49797 51788 44110 31159
17359 31159 21971 26175 26672 18153 49420 84777 100107 85893 73562 61140 48490 40520 49774
17346 49774 49819 46514 47273 33416 41250 60175 70420 85854 96682 102117 72732 46429 25099
17333 25099 9416 2433 3374 24109 16261 20781 9778 23611 34028 21259 -816 5694 45422
17320 45422 52910 58124 47718 16874 12066 23699 25767 34028 31222 20456 21232 29925 33334 31780
17306 31780 14945 17296 44312 53063 51647 41232 24621 34631 38502 42517 42423 45346 45960 51880
17292E1880J918K05j467j2382P149j733P405Q451k7080m5312L071O718K3590J1234
17278C3647n460k3145n790j8960K8256J3472j6175j1338M35J2729K9184J631l0679
17265G807k5125N287M1085J0315o477j7482k7892J5718J4611k2434J8865L642
17253A7920J0198L5545J6268j7187l92o521k2026n682O862l257j2625P250M597
17240C0950L038J0910K4045L2947J1455j1839k4176R773K0192K6763K9021J8949
17228A82028J2611j6632k3932m0223j0269P659j7246j6718l875j840R374J1836
17216I2773J3144K1175N4313K0152k4797m1258j8833p716k0447P124J915j7248
17204H0297o73J0902p150l695j135J3966J6826J8234L693K62j7505r859o738j6864
$$ plain form
17292 51880 53798 54003 52536 40154 47303 45570 52975 61426 34346 -10966 -7895 -1177 22413 33647
17278 33647 28187 5042 -748 -19708 8548 22020 5845 -5493 -5058 7671 36855 38486 7807
17265 7807 -17318 -12031 29054 39369 32892 15410 -12482 3236 17847 -4587 14278 17920
17253 17920 28118 63663 79931 62744 62352 55831 33805 28123 34985 31728 19103 26353 30950
17240 30950 33988 44898 68943 101890 113345 101506 77330 87103 107295 134058 163079 182028
17228 182028 194639 178007 154075 113852 103583 111242 93996 77278 73403 71563 80937 92773
17216 92773 105917 127092 181405 201557 176760 135502 116669 108953 88506 95630 97545 80297
17204 80297 79624 90526 83376 79681 78546 92512 109338 127572 131265 131527 114022 104163 97425 80561
17190H0561J2245M266J658J8163L3346m584n127J5144l578N475J3698j077p202
17177A62988P359j4089l434J8148J3437j9516j8047R341J7026K4177K6782J4767
17165B38939O999K907l622J4618K0141l675j4401R201K8895K5355K5495L2762
17153C83614J5909l214P246J636J0867K4708J1686J9368k885K77J2973L6722N8168
17140E77075L2251L3904L9151L1464N8228M9235M5429N2902O5713P6990P7281
17129A139623J30211J57134J81993J81259J41868J05092R7848J45363J48474J68257
17119B597122K10170K79185L78769M66578M96113N81249P14320Q69904J091795
17110G685205J318163J784560K582418L975977O278124J0112294J6002831K1778956
$$ plain form
17190 80561 92806 97072 98730 116893 150239 145655 140528 155672 152094 157569 171267 170190 162988
17177 162988 170347 156258 152824 170972 184409 164893 146846 156187 173213 197390 224172 238939
17165 238939 245938 248845 245223 259841 279982 276307 261906 271107 300002 325357 350852 383614
17153 383614 399523 396309 403555 405191 416058 440766 452452 471820 468935 469212 482185 518907 577075
17140 577075 609326 643230 682381 713845 772073 821308 866737 919639 985352 1062342 1139623
17129 1139623 1269834 1426968 1608961 1790220 1932088 2037180 2135028 2280391 2428865 2597122
17119 2597122 2807292 3086477 3465246 3931824 4427937 5009186 5723506 6593410 7685205
17110 7685205 9003368 10787928 13370346 17346323 23624447 33736741 49739572 71518528
17102G1518528J9939625M794111j1512719j8643869j8699120j3477820p824242
17095B6094494m007717j546753N00335K732089N810446J0482154J6800780K1195184
17087G8061012J5277978j954118j5256647j9908785j8017394j2399945p632500
17080A8169601m740234l088591k123913j458590r76414o48426m91711m01521l56817
17071C883384l20874l35814l53245l07481k57460k26601j86424j44900j28711
17062A621874p7303k4898J7809l5937j06877j50294j68271j20706r2183p6759
17052G86455p2807n8849l7371j7108o714P171j7878q721j8725k9922n5767m5221
17040D24543k3604q663k4709k0212j6177j1078j6303j1384J4260N097p172j3269
$$ plain form
17102 71518528 91458153 96252264 84739545 66095676 47396556 33918736 26094494
17095 26094494 22086777 20540024 21040359 23772448 29582894 40065048 56865828 78061012
17087 78061012 93338990 91384872 76128225 56219440 38202046 25802101 18169601
17080 18169601 13429367 10340776 8216863 6758273 5781859 5133433 4641722 4240201 3883384
17071 3883384 3562510 3226696 2873451 2565970 2308510 2081909 1895485 1750585 1621874
17062 1621874 1544571 1519673 1537482 1501545 1394668 1244374 1076103 955397 863214 786455
17052 786455 713648 654799 617428 600320 593606 600777 582899 574178 555453 525531 469764 424543
17040 424543 400939 392276 367567 347355 331178 320100 303797 292413 306673 311770 304598 291329
17028B91329J824j5416o949J1176j8471j2745k4100k5242j6652m435K1256J3667
17016B15242j4625l347K285l596N767k0136q683J154n188j1863m884j8528O255
17003A39853O615on254J7749P066j6162j1744j0773J1000O329O916j2638Jj4317
16989A24635l3975J9889K2061O832k4495j5207k954J6465J6043J2929k757K105
16977A41571J5116L1879J8318l0170j1038j0942k3093k3851j2202P919K219j9096
16965H6630J1180K869n211K8132J6755m140J2335o285k5165j4577N932K8983J7258
16952A54696K2163J8047M2592R6624J69656J93970J65210M84j31040j70798j65528
16941C96076j00923l2677O693l2169k1999J9795O1188J11306J90630J80586Q1998
$$ plain form
17028 291329 293153 277737 270788 281964 263493 250748 226648 201406 184754 180319 201575 215242
17016 215242 200617 197270 199555 195959 201726 181590 172907 174061 168873 157010 152126 133598 139853
17003 139853 146468 146462 141208 158957 166023 149861 138117 127344 138344 144673 151589 138951 138952 124635
16989 124635 90660 110549 132610 139442 114947 99740 96786 113251 129294 142223 139466 141571
16977 141571 156687 188566 206884 176714 165676 154734 131641 107790 95588 103507 105726 86630
16965 86630 97810 100679 95468 123600 140355 136215 148550 142265 117100 102523 108455 137438 154696
16952 154696 176859 194906 237498 334122 503778 697748 862958 863442 732402 561604 396076
16941 396076 295153 262476 269169 237000 215001 234796 295984 407290 597920 778506 860504
16930H60504o6033j43776j72366j35117q5558n5245n5879k5574j6148k3105j4430
16919F7273l092l761m059o158L947m872j263m827J4951l82l030m493l0092p060
16905A3082L399k1233n583J534K983o53K1969K1116j8162l1493q31K0920N164
16892A2212j2596p240J0633J3054N397j0953j8178J4018K6982n116J7370o649
16880C8934r873j5305j3210k009j945J69K043K4432J6479j4470m984J9721j3310
16867B6672n414J2113K7520n549j3455j2390j1277J756L805P136K784J2302j3950
16854C2053j8136j5033j1296o979J2085K7383J0101N803J6876o894m0973j2756
16842g766L179J7127J409J885j8936n400N186N368q077K013J6756j300j4014n450
$$ plain form
16930 860504 794471 650695 478329 343212 257654 202409 146530 120956 104808 81703 67273
16919 67273 64181 60420 56361 50203 54150 49278 48015 43188 58139 57757 54727 50234 20142 13082
16905 13082 16481 -4752 -10335 -8801 -5818 -6471 15498 36614 18452 -13041 -13872 7048 12212
16892 12212 -384 -7624 3009 16063 21460 10507 -7671 6347 33329 28213 45583 38934
16880 38934 29061 13756 546 -1463 -3408 -3239 -1196 23236 39715 25245 20261 39982 26672
16867 26672 21258 33371 60891 55342 41887 29497 18220 19976 23781 30917 33701 46003 32053
16854 32053 13917 -1116 -12412 -19391 -7306 20077 30178 35981 52857 45963 4990 -7766
16842 -7766 -4587 12540 13949 15834 -3102 -8502 -3316 2052 -6025 -4012 12744 11444 -2570 -8020
16828h020l850q066j804j0497k315J707J5256k389J3490J9173M132J740R04q640
16814A0821j5231q711J6650Q078j9869j7380j2158J6759J1860o685j7289M274
16802b8881J8707J265l957J1781K2554Q025J1592j7866j6407k4910j1810j247
16790c1154P287K2516r161k0664m922P363J7132J2017j3057J49L778J5953P309
16777A4546Q172k0214m276Q081K1476k502p289q853j6703N391K403j0239n322
16764a5329M267J3727Q67J4069J4759k4749j1598n828J99n33J411j597k560o013
16750a8908Q025M636p213P839N943l221j7984J6770J9309L979k397p437O164j7653
16736b148m649J4199K3126O934k3298n329J8721K614j4376j1552L99q986p178
$$ plain form
16828 -8020 -11870 -19936 -21740 -32237 -34552 -32845 -17589 -19978 -6488 12685 16817 18557 19461 10821
16814 10821 -4410 -13121 3529 11607 -8262 -25642 -37800 -21041 -9181 -15866 -33155 -28881
16802 -28881 -10174 -8909 -12866 -1085 21469 29494 41086 23220 6813 -18097 -29907 -31154
16790 -31154 -23867 -1351 -10512 -31176 -36098 -28735 -11603 414 -12643 -12494 -8716 7237 14546
16777 14546 22718 2504 -1772 6309 27785 25283 17994 9141 -7562 -2171 232 -10007 -15329
16764 -15329 -11062 2665 3532 17601 32360 7611 -3987 -9815 -9616 -10149 -8738 -10335 -12895 -18908
16750 -18908 -10883 -6247 -13460 -5621 322 -2899 -20883 -4113 15196 19175 16778 9341 15505 -2148
16736 -2148 -6797 7402 30528 37462 14164 8835 27556 30170 15794 4242 4641 -4345 -11523
16723a1523K5172K4503j1250j2371j5635k0015j4531k203k725Q459Q610Q609K4
16710a4876m499l874J7208L1215j52j9991j2596J1981N540R432J8164j0513p738
16697A9301j0523q219q419J2023Q368j2914j313M205O419J1478m421k2293r48
16684g256J8255q01j8598n203Q565P261O429m515j0452k709n430N271J0761K691
16670D269l184O932O674j1044L855J4044N008j6915J5050K0118j9643k8117j5438
16657a8391J840K1741K2179p660o612K582j3700k1421k961J8027O718l751K616
16644A207J405q28J034Q917L136j092L119o452K931k0083q818o539J5627K4339
16630A7903J1931j7670K960j9957n865q312p452j062J7568O935M254M299J882
$$ plain form
16723 -11523 13649 38152 26902 14531 -1104 -21119 -35650 -37853 -40578 -32119 -23509 -14900 -14876
16710 -14876 -19375 -23249 -6041 25174 25022 5031 -7565 4416 9956 19388 37552 27039 19301
16697 19301 8778 559 -7860 4163 12531 -383 -1696 2509 8928 20406 15985 -6308 -7256
16684 -7256 10999 10198 -8400 -13603 -5038 2223 8652 4137 -6315 -9024 -14454 -9183 1578 4269
16670 4269 1085 8017 14691 3647 7502 21546 26554 9639 24689 44807 25164 -2953 -18391
16657 -18391 -16551 5190 27369 19709 13097 15679 1979 -19442 -22403 -4376 2342 -1409 1207
16644 1207 2612 1784 2818 11735 14871 13779 16898 10446 13377 -6706 -15524 -22063 -6436 17903
16630 17903 29834 12164 15124 -4833 -10698 -19010 -26462 -27524 -9956 -3021 1233 5532 7414
16617G414j919j018R342n169J4003L063o955k8619j0837P633O448J633Q083J6380
16603A9482J453K4r015n597L838J8680j4041k1741Q690n959L246r872r55R957
16589a810J0914J8397K704L621j8067j4390k6027j138K0544M876k653J4574k311
16576I234L626Q306J978r211j2655k7862n274J0881J6582J3055J0459K4305K513
16563D5937O687k4531j1094j1779n154m759K3888J2121P270j5927j3074K9039
16551C8624J4120M426N096J7966M5690N8025M7865P1270J10240Q5349J358o4251
16539D35778r9827q0247n3378l4915l2243j1667j457K2035M7906N4299P5792Q5983
16527D08059N8342j5545o4426j12020q9057m2665l0189l9658k2474j4786K454
$$ plain form
16617 7414 5495 4477 13819 8650 22653 25716 18761 -9858 -20695 -13062 -6614 -4981 3102 19482
16603 19482 20935 20959 11944 6347 10185 28865 14824 -6917 1773 -4186 -940 -10812 -11767 -1810
16589 -1810 9104 27501 30205 33826 15759 1369 -24658 -25796 -5252 -376 -3029 11545 9234
16576 9234 12860 21166 23144 13933 1278 -26584 -31858 -20977 -4395 8660 19119 43424 45937
16563 45937 52624 28093 16999 5220 66 -4693 19195 31316 38586 22659 9585 38624
16551 38624 52744 57170 62266 80232 125922 183947 231812 303082 413322 498671 500029 435778
16539 435778 335951 255704 202326 167411 135168 123501 122044 144079 191985 246284 322076 408059
16527 408059 466401 450856 386430 274410 185353 142688 112499 72841 50367 35581 38035
16516C8035n710j3186q943n481m116J7076N346o755n333j8793j680J396M263J6921
16502A3040j1566j4238j5555k854J2327k617j9701j2844K1218J5898o755J0537
16490a3110J3867k866J5141p159J1720J4233m60k7510k2413N271K395Q923q485
16477a0453L732M20R356j727j6094j2686P31J3144J3695m553m917Q446J84K973
16463B251M348j1950j3505K3643J2727K299n502m844j9191j1204Q952J1650l943
16450d269K75L5813m626M328Q303j2239k9097r891m512Q680Q091L908l427k420
16436a083R341r221j4377r882K2581Q205N67l232o52q356j1637k1277j4762m341
16422e8126K5714P574k49J9383K4095J0728p000L980p340r881l595j4543k1756
$$ plain form
16516 38035 32325 19139 10196 4715 599 17675 23021 16266 10933 -7860 -9540 -8144 -3881 13040
16502 13040 1474 -12764 -28319 -31173 -18846 -21463 -41164 -54008 -32790 -16892 -23647 -13110
16490 -13110 757 -2109 13032 5873 17593 31826 31366 3856 -18557 -13286 -10891 -1968 -10453
16477 -10453 -6721 -6301 3055 1328 -14766 -27452 -26721 -13577 118 -4435 -9352 -906 -722 2251
16463 2251 6599 -5351 -18856 4787 17514 19813 14311 9467 -9724 -20928 -11976 -326 -4269
16450 -4269 -3994 31819 27193 31521 39824 27585 -1512 -11403 -15915 -7235 856 4764 1337 -1083
16436 -1083 8258 -963 -15340 -25222 -2641 5564 6131 2899 2247 -6109 -17746 -39023 -53785 -58126
16422 -58126 -32412 -24838 -25087 -5704 18391 29119 22119 26099 18759 8878 5283 -9260 -31016
16409c1016Q167J2329O300j5726j8375m936K9756J5446m804j7404J847J2999l857
16396i274l1050j9026J6402K8701N017P535K4551K028R40j3380j7224j9872l610
16383b8262j3496j2055K566J9446K1849Q463o857l874K434J9153J9729o44j5357
16370A3095j0029J4017K6849Q385j3776r758o764N678m114p460p555r334r721
16357a0487n217N566m460r05j0937P590m0P179n110M532J539j0763J7146J3832
16343I465Q094M328j3234k744J2391J2486p11k3440j0235l298R19J2379j284L252
16329H368J3278j1021j9477j375K752K6263j9231j6984p06J0044j80O958p919
16316i230j5547L801J6237N0J1888P602R720Q675q623j169j8119q735n983r328
$$ plain form
16409 -31016 -22849 -10520 -4220 -19946 -38321 -43257 -13501 1945 -2859 -20263 -18416 -5417 -9274
16396 -9274 -40324 -59350 -42948 -14247 -9230 -1695 22856 24884 25824 12444 -4780 -24652 -28262
16383 -28262 -41758 -53813 -51247 -31801 -9952 -1489 -8346 -12220 -9786 9367 29096 28452 13095
16370 13095 3066 17083 43932 52317 38541 28783 22019 27697 23583 16123 8568 -766 -10487
16357 -10487 -15704 -10138 -14598 -15503 -26440 -18850 -18890 -11711 -16821 -12289 -10750 -21513 -4367 9465
16343 9465 17559 21887 8653 5909 18300 30786 30075 6635 -3600 -6898 -5979 6400 5116 8368
16329 8368 21646 10625 -8852 -10227 -7475 18788 -443 -17427 -18133 -8089 -8269 -1311 -9230
16316 -9230 -24777 -20976 -4739 -4689 7199 14801 24521 33196 24573 23404 5285 -3450 -9433 -18761
16302a8761O958O564J2747k06n724R74k165p150m497m09l117K0643J3065j7088
16288A834M151J1714K12r536r539l737Q328J5925N148J2127j2305o368k963j1567
16274C424k1818J1531Q857m051r557n537J3877n27j7651P59K1549J5530j6990
16261f04q57J4255J970q633j668J2595Q340M582o323j0465J465k3613k7660k030
16247c8646J7573k770O909J540m957J9722N042k1075K310o977O439n171O604Q631
16233d826O433k889q774j894J4703l241q340k8408r406J7538Q470N012J2635o735
16219i722j9486P064k055J1243n548j0319J0641J4220o725m898Q887j0940j6003
16206c3641J2214L382K365K554j553k372J758J2712n559J6287J2066l020j031
$$ plain form
16302 -18761 -11803 -5239 7508 7302 1578 2552 387 -6763 -11260 -11669 -14786 5857 18922 1834
16288 1834 5985 17699 17911 8375 -1164 -4901 3427 19352 24500 36627 24322 17954 14991 3424
16274 3424 -18394 -6863 1994 -2057 -11614 -17151 -3274 -3801 -21452 -20693 856 16386 -604
16261 -604 -1461 12794 14764 6131 4463 17058 25398 29980 23657 13192 14657 -8956 -36616 -38646
16247 -38646 -21073 -23843 -16934 -15394 -20351 -629 4413 -16662 -14352 -21329 -14890 -20061 -13457 -4826
16233 -4826 1607 -1282 -10056 -11950 2753 -488 -8828 -37236 -46642 -29104 -20634 -15622 -2987 -9722
16219 -9722 -29208 -22144 -24199 -12956 -18504 -28823 -18182 -3962 -10687 -15585 -6698 -17638 -33641
16206 -33641 -21427 -18045 -15680 -13126 -14679 -17051 -15293 -2581 -8140 8147 20213 17193 16162
16193A6162l107j8405O372J7316P258k5001j0634k2515k8630M159K6306K6804
16181c915J2539k072j28J5126M938j9284k158K3528j5847j6808r990O354l911
16168a1628q893l135j4513J4245J7608P022K8044O057k2248j2131R41r019J3543
16155E893J2524O721p506k7281j5092L797m957K2666J4523j1045j1912J3855J1236
16142A3422k764m16j574l807M110l355m054j6111q04r819L150J3749j2998M27
16128b0844J4660k511n154Q258j6974j0500k37o479P296K521J2407J2527q419
16115a3449K1871J3697j0032j7138m432J7322j341J1365p839l0339K874O806k739
16102a3374J705l85O477L545k908k4880K534K4434R111K205j496M56q850j0918
$$ plain form
16193 16162 13055 -5350 1022 18338 25596 595 -10039 -32554 -61184 -57025 -30719 -3915
16181 -3915 8624 6552 6424 21550 26488 7204 5046 28574 12727 -4081 -14071 -7717 -11628
16168 -11628 -20521 -23656 -38169 -23924 -6316 706 28750 34807 12559 428 1369 -7650 5893
16155 5893 18417 25138 17632 -9649 -24741 -20944 -25901 -3235 11288 243 -11669 2186 13422
16142 13422 10658 10242 8668 4861 8971 5616 1562 -14549 -15353 -25172 -22022 -8273 -21271 -20844
16128 -20844 -6184 -8695 -13849 -5591 -22565 -33065 -33302 -39781 -32485 -29964 -17557 -5030 -13449
16115 -13449 8422 22119 12087 -5051 -9483 7839 6498 17863 10024 -20315 -17441 -10635 -13374
16102 -13374 -11669 -12054 -5577 -2032 -4940 -29820 -27286 -2852 6259 8464 6968 7424 -1426 -12344
16088a2344k215j4331J9982K3147q052o248O828j3419j2891r36Q288P249j2141
16075a7083j3118L805N240K678l237M326j451j0565l350o096j1542J3627K3746
16062a3020J8795P545N73n822l3729j4077J2997Q131j0942n371q171M693J3172
16049b5226Q730J1915J9603N119q329j2356P221j308M631j4168k2853N773L460
16036a7788r582k0818J4425J1555j146J8399L473L901J5417j8158n482k109O851
16023a062J6182j3501p869J3462R732R060j1574j4944m912J0080r102o648J0818
16010b78N023J9039J362j3942J1825j0377K820j943j9172P058j1063J489q806
15997a6965o616L036j26J5250j735q805n932j6621P880J6728P978j159j261N46
$$ plain form
16088 -12344 -14559 -28890 -8908 14239 6187 -61 6767 -6652 -19543 -20479 -12191 -4942 -17083
16075 -17083 -30201 -26396 -21156 -18478 -21715 -17389 -18840 -29405 -32755 -38851 -50393 -36766 -13020
16062 -13020 5775 13320 13893 8071 -25658 -39735 -26738 -18607 -29549 -34920 -43091 -38398 -25226
16049 -25226 -16496 -4581 15022 20141 11812 -544 6677 5369 10000 -4168 -27021 -21248 -17788
16036 -17788 -27370 -48188 -33763 -22208 -23354 -4955 -1482 2419 17836 -322 -5804 -7913 -1062
16023 -1062 15120 1619 -6250 7212 16944 26004 14430 -514 -5426 4654 -4448 -11096 -278
16010 -278 4745 23784 25146 11204 23029 12652 15472 13529 -5643 1415 -9648 -8159 -16965
15997 -16965 -23581 -20545 -20671 -5421 -7156 -15961 -21893 -38514 -30634 -13906 -5928 -7087 -8348 -7802
15983g802R409O085o453m84q202n027K511k3004J064J1452p906r004n331J3104
15969b9588J3031m278P452O195m926J1742o289o456J9627J9847j6071k7647j5734
15956c3095o301J6226P125p39j536P685j7848m65J4611Q243N842J1232N616l642
15942A2954k3008j0512k91p163Q778J8714O907j9617j7555Q34K373K2346O986
15929A746k945J5607Q92R30p143p001K910j3949j668J0145O587k89j3784k0441
15915b8403L561K2143M131l842N758j838j8192L446J0501R287J01J069J735p305
15901B152k167r613J182J5986O170j5747Q756j5885J3943J6025Q550J1670r092
15888C1930l3023j969q518o180R81j0062N396J7070N853r264N664K6081J662N882
$$ plain form
15983 -7802 1607 7692 1239 755 -7447 -12474 -9963 -32967 -31903 -20451 -28357 -37361 -42692 -29588
15969 -29588 -16557 -20835 -13383 -7188 -12114 -372 -6661 -13117 6510 26357 10286 -17361 -33095
15956 -33095 -39396 -23170 -16045 -16784 -18320 -10635 -28483 -28948 -14337 -6094 -252 10980 16596 12954
15942 12954 -10054 -20566 -20857 -28020 -19242 -528 6379 -13238 -30793 -29959 -27586 -5240 1746
15929 1746 -1199 14408 15300 16230 9087 2086 4996 -8953 -10621 -476 6111 5822 -7962 -28403
15915 -28403 -24842 -2699 1432 -2410 3348 1510 -16682 -13236 -2735 6552 6653 7722 9457 2152
15901 2152 -15 -9628 -8446 7540 13710 -2037 6719 -9166 4777 20802 29352 41022 31930
15888 31930 -1093 -3062 -11580 -17760 -16779 -26841 -21445 -4375 1478 -7786 -2122 23959 25621 31503
15874C1503l057j0969m318r283j9793q834J3290J6432J7775r760j8129r224j0338
15861b4705r045Q773J3223J446k2316j0345M845m183P719R605L0708J5734k5655
15848d196n760J7172Q538r600O642M130j888j1318m368J1710O542J0169j0223
15835A7550p385p609j463Q553N164j4679J8023J4420n000j0435j4004K344k0931
15822a5452n08J4532R677Q223J0544j0891o457o108j8816J0671M693j5144J8266
15809C230m246j6858J1350J6006o284j3052l243j508l600M159P510L723K688j272
15795a397M456R093r691j4688j000M096J0713L090Q00j2325k7168J8954J7399
15782B332O055J991p216q114l678Q783N896j3031l345K628k0169j6337N249J0411
$$ plain form
15874 31503 28446 17477 13159 3876 -15917 -24751 -11461 4971 22746 12986 -5143 -14367 -24705
15861 -24705 -33750 -24977 -11754 -10308 -32624 -42969 -38124 -42307 -34588 -24983 5725 21459 -4196
15848 -4196 -9956 7216 15754 6154 12796 16926 15038 3720 -648 11062 17604 27773 17550
15835 17550 10165 2556 1093 9646 14810 131 18154 32574 27574 17139 3135 5479 -15452
15822 -15452 -15960 -1428 8249 16472 27016 16125 9668 3560 -15256 -4585 108 -15036 3230
15809 3230 -1016 -17874 -6524 9482 3198 -9854 -13097 -14605 -18205 -14046 -6536 -2813 -125 -1397
15795 -1397 3059 12152 2461 -12227 -13227 -9131 1582 4672 5472 -6853 -34021 -15067 2332
15782 2332 8387 10378 3162 -4952 -8630 153 6049 -6982 -10327 -7699 -27868 -44205 -38956 -28545
15768b8545P432j112m540N196P710o023j7769k1840L0871K4228P945K775J76N093
15754A1597j3001j1695n10j740J27o35R27K834l031N857m112J988J9735r53j5722
15739h334k39o839q986j8049J594L1994O786o813J5022K5727J5914k2372n029
15726B0376M856p902L993m296j4223j7463J4995J2757n537j3347j3364l17r497
15713b8969J4144q397r771R271J3590K62j5903l72K885P662m564R19k793j661
15699b3697J5557K2332l088k9314m547o747q489J0107J139n41R570N084j1298
15686b3932N640J5313j2922j5619R76j239j0496K47K8664j23r630P38J1016l39
15672a1706j4204M73P874j360j0469j9892Q510J6792L925J066O555J273j2458
$$ plain form
15768 -28545 -21113 -22225 -26765 -21569 -13859 -19882 -37651 -59491 -28620 -4392 3553 6328 6504 11597
15754 11597 -1404 -13099 -13609 -15349 -15222 -15857 -14930 -12096 -15127 -9270 -13382 -11394 8341 7388 -8334
15739 -8334 -8573 -15412 -24398 -42447 -40853 -8859 -2073 -8886 6136 31863 47777 25405 20376
15726 20376 25232 17330 21323 17027 2804 -14659 336 13093 7556 -5791 -19155 -19472 -28969
15713 -28969 -14825 -23222 -32993 -23722 -10132 -9870 -25773 -26145 -23260 -15598 -20162 -19243 -22036 -23697
15699 -23697 -8140 14192 11104 -18210 -22757 -29504 -37993 -27886 -26747 -27288 -17718 -12634 -23932
15686 -23932 -18292 -2979 -15901 -31520 -30544 -31783 -42279 -42032 -13368 -13491 -23121 -22383 -11367 -11706
15672 -11706 -25910 -25437 -17563 -18923 -29392 -49284 -40774 -23982 -20057 -18991 -12436 -11163 -23621
15659b3621m086R796n675L039K4581R95n250L345K2111k699j1900K448m171p347
15645A566q180O100M726m986P015p363j0425L132N443q519J962L533O173k785
15631b608k4396R829J7892P291k427l534m498J3381J452j0617p378J1104M109
15618I600j8788m486J604l225J6026O183N889q992J6526N596p110l151k0744j5485
15604b0557J1320Q375N852k619j5366j8658J559J1725J6838N934j3008O478l44
15591b471m874J521j000J3136K867j914k3254j415L077j4456J6839P613j3433
15578a7764R117J3367j6281j1350Q638J0138j3164j1284K5182k918j4049N105
15566a5263j3553J4138L2427K386m347n078l258m747J1010K7155k5138k0773J8027
$$ plain form
15659 -23621 -27707 -17911 -23586 -20547 4034 5029 -221 3124 25235 22536 10636 13084 8913 1566
15645 1566 -6614 -514 4212 -774 6241 -1122 -11547 -8415 -2972 -11491 -9529 -5996 177 -2608
15631 -2608 -27004 -17175 717 8008 5581 2047 -2451 10930 12382 1765 -5613 5491 9600
15618 9600 -9188 -13674 -12070 -15295 731 6914 12803 3811 20337 25933 18823 15672 -5072 -20557
15604 -20557 -9237 -862 4990 2371 -12995 -31653 -30094 -18369 -1531 4403 -8605 -2127 -2471
15591 -2471 -7345 -5824 -6824 6312 9179 7265 -15989 -17404 -14327 -28783 -11944 -4331 -17764
15578 -17764 -8647 4720 -11561 -22911 -14273 -4135 -17299 -28583 -3401 -6319 -20368 -15263
15566 -15263 -28816 -14678 17749 20135 15788 10710 7452 2705 13715 40870 15732 -5041 12986
15553A2986O425m024J304q605Q56j503J1454L408p419j0137o743j6263j248J874
15539a7635Q263l482J759J5788l921k5179j2235P814K330J8399J7958J1008j4735
15526F132o029l343N25p06k812K3072N21j2796j5231R188p525p92q591j257J591
15511a8053k295J0212J6396p70J1479J084J380k552j0392m048j457P033P50J4661
15497B3428n331j0977l866j2628M869M191m191J1055J270m652J8503n609j5180
15484H82j432r646L18J780R799R126M471M872r061j3189K645K0858k982k6247
15470g806j3847m706O52O783o636m906K1898K7564J1501p920j7459j1274q074
15457a4230j1462l251j171R303J7568K802p606j1133P023J5709J1613J56p891
$$ plain form
15553 12986 19411 15387 16691 8086 8942 7439 18893 22301 14882 4745 -1998 -18261 -19509 -17635
15539 -17635 -9372 -12854 -11095 4693 772 -24407 -36642 -28828 -26498 -8099 9859 20867 6132
15526 6132 103 -3240 -2715 -3421 -6233 16839 17360 4564 -10667 -1479 -9004 -9796 -18387 -19644 -18053
15511 -18053 -20348 -10136 6260 5490 16969 18053 19433 16881 6489 2441 984 8017 8767 23428
15497 23428 18097 7120 3254 -9374 -4505 -314 -4505 6550 7820 3168 21671 16062 882
15484 882 -550 -10196 -9878 -8098 1701 10827 15298 20170 11109 -2080 565 21423 18441 -7806
15470 -7806 -21653 -26359 -25707 -18924 -25560 -30466 -8568 18996 30497 22577 5118 -6156 -14230
15457 -14230 -25692 -28943 -30114 -20811 -3243 -441 -8047 -19180 -12157 3552 15165 15321 7430
15444G430j1521j3604q396M745O591q303j5813M957J2213J6138J1082K913j0221
15431a789q028l773j2686p38J3239J1763o253P27k052J2491K797j1892J2017P788
15417A3611n977J2946j1403j3467o30j3931j3429K8628J9825N928N657j9812l9966
15404c2020m362K965K3355J2925N500M813N074K755l279L390m788j0054j9969
15391a3695k0510M268J9915n193J4085k2983p865J3227J9637j1265l023K3146
15379I744M277m171J1521K919j3620l6696p707N89K1463J3533J151j3620j8785
15366b9402q864L134O830L612O990K609l771O054P096R988j2649j0575J9251m606
15352d303j0788n498L106J5414M123J147R923j0824J9961J4316j8900l1073n033
$$ plain form
15444 7430 -4091 -17695 -26091 -21346 -14755 -23058 -38871 -33914 -21701 -5563 5519 8432 -1789
15431 -1789 -9817 -13590 -26276 -27014 -13775 -2012 -8265 -7538 -9590 2901 5698 -6194 5823 13611
15417 13611 7634 20580 9177 -4290 -4920 -18851 -32280 -3652 16173 22101 27758 7946 -32020
15404 -32020 -36382 -33417 -10062 2863 8363 13176 18250 21005 17726 21116 16328 6274 -13695
15391 -13695 -34205 -29937 -10022 -15215 -1130 -24113 -31978 -18751 886 -10379 -13402 9744
15379 9744 14021 9850 21371 24290 10670 -26026 -33733 -33144 -11681 1852 3003 -10617 -29402
15366 -29402 -38266 -35132 -28302 -24690 -17700 -15091 -18862 -12808 -5712 4276 -8373 -18948 303 -4303
15352 -4303 -15091 -20589 -17483 -2069 2054 3201 13124 2300 22261 36577 17677 -13396 -18429
15339a8429J776m638J4116M842R834N826q308j0286j7969P416R029p544m644j3533
15325c2512J1883R148J7046n297j3607M31N565q347N95R21k368J4166o394j778
15311a0548K577j0805o337l41K3143J5902n544k0863q543J7584K8194l2734k8341
15298c6656J30K8418L1393o871k0434j5945P066Q6l384n480n165J4237J463R409
15284a733k877p109J3170Q179q833k3186M769j354j554l55O026j075J5720j732
15270a944l646J6858q868j3785m492j084J3933L172k525K605j3388r285q73m77
15256b3799L799K3202Q477M44j6941o371j6358N660K2520R068P690K452j1430
15243H413J694q968j5608j0706l447m368L865n061o198K4466L7328J0918j4504
$$ plain form
15339 -18429 -16653 -21291 -7175 -2333 7501 13327 5019 -5267 -23236 -15820 -6791 -14335 -18979 -32512
15325 -32512 -20629 -11481 5565 268 -13339 -12908 -7343 -15690 -15095 -14174 -16542 -2376 -8770 -10548
15311 -10548 -7971 -18776 -25113 -25454 -2311 13591 8047 -12816 -21359 -3775 24419 -8315 -36656
15298 -36656 -36526 -8108 23285 16414 -4020 -19965 -12899 -12813 -16197 -21677 -26842 -12605 -11142 -1733
15284 -1733 -4610 -11719 1451 9630 797 -22389 -17620 -18974 -20528 -20883 -14857 -15932 -212 -1944
15270 -1944 -5590 11268 2400 -11385 -15877 -16961 -3028 144 -2381 224 -13164 -22449 -23322 -23799
15256 -23799 -20000 3202 11679 12123 -4818 -11189 -27547 -21887 633 9701 17391 19843 8413
15243 8413 10107 1139 -14469 -25175 -28622 -32990 -29125 -34186 -40384 -15918 21410 32328 17824
15230A7824j4237K770L007Q268j4275q706j3788L393J7068r179k337L574k802
15217i420l915J2860P680J0647r059j3906L635N894k1578k4529q937J864J2140
15204c6624J6869K1035K0572j0898j9207j0522m058J0067l284j394K1534j8674
15192a4584q338L0348M013j3821j6024o724J2723J3341J4048j12j1550K9084j215
15179C1189k2941J1945j706r469k1203k0007j1502J2991J8612O151Q652R903k45
15166A2370j4652j9819O021J0902j2370k075L378P073K615J2360o233N125M200
15153H895P243m558n691p282j5966j415q445L973nr350N507q130P680N346M422
15138a7776Q97j0482k651Q677K3961m577j8862r790J3240K4350L522j4782M240
$$ plain form
15230 17824 3587 6357 9364 17632 3357 -5349 -19137 -15744 1324 -7855 -10192 -6618 -9420
15217 -9420 -13335 -475 7205 17852 8793 -5113 -1478 4416 -17162 -41691 -50628 -48764 -36624
15204 -36624 -19755 1280 21852 10954 -8253 -18775 -22833 -12766 -16050 -17444 4090 -14584
15192 -14584 -22922 7426 11439 -2382 -18406 -25130 -12407 934 14982 14870 3320 32404 31189
15179 31189 8248 20193 18487 9018 -12185 -32192 -43694 -30703 -12091 -5940 2712 12615 12370
15166 12370 -2282 -22101 -16080 -5178 -17548 -19623 -16245 -9172 -6557 5803 -430 4695 8895
15153 8895 16138 11580 5889 -1393 -17359 -18774 -27219 -23246 -23251 -32601 -27094 -35224 -27544 -22198 -17776
15138 -17776 -16879 -27361 -30012 -21335 2626 -1951 -20813 -30603 -17363 6987 10509 -4273 -33
15125c3K930O103N155n481r856o613P294R096r623J3360J3787N877k0552j5838
15111d394l489k6770j1297j0202L4389R098m811J5747Q983l952j4365j3245Q009
15098a6299o164J1991n646J1333l906k207J5435J1904k7481l113l61R31J972k774
15084a4385K048m889N686O912j1721q88J8655o855n12J3227j1886J0270J062k730
15070C994m998j0632K721k170k2322J3844K4669K749O398o031j1247n246J098
15057g173o51j7201N497K3066J6563q322l0728k0042J0003J5754l544J0628J3385
15044G235l63j6700k586M218n223O457j9249j1634O928J4414J0996k647J466O229
15030d59J2473J4208L737j7643k3621q991R948K2677J4762j5021P728J1258r243
$$ plain form
15125 -33 2897 9000 14155 8674 -1182 -7795 -501 8595 -1028 12332 26119 31996 11444 -4394
15111 -4394 -7883 -34653 -45950 -56152 -21763 -12665 -17476 -1729 7254 3302 -11063 -24308 -16299
15098 -16299 -22463 -10472 -16118 -4785 -8691 -10898 4537 16441 -11040 -14153 -14514 -13583 -11611 -14385
15084 -14385 -12337 -17226 -11540 -4628 -16349 -17237 1418 -5437 -5949 7278 -4608 5662 6724 3994
15070 3994 -1004 -11636 -8915 -11085 -33407 -19563 5106 7855 14253 8222 -3025 -8271 -7173
15057 -7173 -7824 -25025 -19528 3538 20101 11779 -18949 -38991 -28988 -13234 -16778 -6150 7235
15044 7235 6872 -9828 -12414 -8196 -13419 -6962 -26211 -37845 -30917 -16503 -5507 -8154 -6688 -459
15030 -459 12014 26222 29959 12316 -11305 -20296 -10348 12329 27091 12070 19798 31056 21813
15017B1813o154j0762j156m711P927K1300Q935L08k8192j6584k624J1527L362
15004D989r371k864N654k013m265R94j0136M112K034J476j9268K033J9006M012
14990c607Q168J3574n050o263q988j1680m853Q766m629l195J9037j319L799N981
14976I741J422R022j0108j2402J6849K1975n422l4834p215Q134j6362Q06K4014
14963E620Q444K0425N457j0907j1340o175r118j0348j622K4953j376j9628j2408
14950a8023j0061J404J1926P926R691k617M808J431n08J217N195L683m061J4481
14936B6492J0126j7795j1707K061K4813J0717k2665k6145q372n308O492Q670r56
14923c577j3137j922J6245n152n164j470K3231J7667j973k631m491j3701j8486
$$ plain form
15017 21813 15659 4897 3741 -970 6957 28257 37192 37500 9308 -7276 -9900 1627 4989
15004 4989 -4382 -7246 -1592 -3605 -7870 -6876 -17012 -12900 -10866 -9390 -28658 -26625 -7619 -3607
14990 -3607 4561 18135 13085 6822 -2166 -13846 -18699 -9933 -14562 -17757 1280 -39 3760 9741
14976 9741 11163 20185 10077 -2325 14524 36499 31077 -3757 -10972 -2838 -19200 -18394 5620
14963 5620 14064 34489 39946 29039 17699 11524 2406 -7942 -9564 15389 14013 -5615 -18023
14950 -18023 -28084 -26680 -14754 -6828 2863 246 5054 6485 5977 7194 12389 16072 12011 26492
14936 26492 36618 18823 7116 9177 33990 44707 22042 -4103 -12475 -17783 -11291 -2621 -3577
14923 -3577 -16714 -18636 -2391 -7543 -12707 -14177 9054 26721 24748 22117 17626 3925 -14561
14910a4561o592J3570N17J6050K3029m230k2518j0678j5235j647J7680N234j3621
14897a3002P278O711K517p29j9959P083J1746j0373j3122o773J8091J4466p643
14884c709j2381N134J2570J0541j4011j319J6100r009j0020K973M600K4873j0017
14871A6325k939l581n413k183m913j2719K646J5276n322O186K2057K3737n223
14858D3934k1905K42J275q301o448k8802o448J405P070J2901j3509J2213R902
14845C529p85P513J6972j872j2509n777P481O319K081P163L941J1737n358k0706
14831A9729j2892k526L411J0570P831j8469k4258l132K0284N294L248N735j2286
14818B539j3999K1986O326l333j4056n467J4552K307L801r3l102j1588q726m458
$$ plain form
14910 -14561 -21153 -7583 -7066 8984 32013 27783 5265 -5413 -20648 -22295 -4615 619 -13002
14897 -13002 -5724 987 3504 2775 -17184 -10101 1645 -8728 -21850 -28623 -10532 3934 -3709
14884 -3709 -16090 -10956 1614 12155 -1856 -3175 12925 3916 -6104 -3131 1469 26342 16325
14871 16325 13386 9805 4392 2209 -2704 -15423 -12777 2499 -2823 3363 25420 49157 43934
14858 43934 22029 22271 23546 15245 8797 -20005 -26453 -25048 -17978 -5077 -18586 -6373 3529
14845 3529 2744 10257 27229 25357 12848 7071 14552 20871 22952 30115 34056 45793 40435 19729
14831 19729 6837 4311 7722 18292 26123 7654 -16604 -19736 548 5842 9090 14825 2539
14818 2539 -11460 10526 16852 13519 -537 -6004 8548 10855 14656 14563 11461 -127 -8853 -13311
14804a3311R423K726L871P849N885l5921k960J5593k092PP941j3460M732L089
14790f628N968J3985K309o365m036m347j3133L819r36j0986j7431K148P574O878
14776b1181J0364J8685M988M106J373M408j0112j3214j0977j126J8363p747Q503
14763F433M42K794m560j1122k305m738k522P539J8779L468o034J2386L27l177
14749A7710L36l353p213J5958k0185j4635J2405r433L161N071j3024m341J774
14736a5769O909J1542K271l226M923j3189J693l663r417n914R623M193k02m964
14722a5190k4774q08J1053O577j3559p848p980J4133J1556m009J5299K5699Q256
14709A8405k1816p227Q076K3729J9001K3515j8336j5168j534j2088k4316r255
$$ plain form
14804 -13311 -3888 -1162 2709 10558 16443 -19478 -22438 -6845 -8937 -8930 -989 -14449 -9717 -6628
14790 -6628 -660 13325 15634 9269 5233 886 -12247 -8428 -9364 -20350 -37781 -35633 -28059 -21181
14776 -21181 -10817 7868 12856 16962 18335 22743 12631 -583 -11560 -12686 5677 -2070 6433
14763 6433 6875 9669 5109 -6013 -8318 -13056 -15578 -8039 10740 14208 8174 20560 20887 17710
14749 17710 18046 14693 7480 23438 3253 -11382 1023 -8410 -5249 -178 -13202 -17543 -15769
14736 -15769 -8860 2682 4953 1727 6650 -6539 -4846 -8509 -17926 -23840 -14217 -10024 -10226 -15190
14722 -15190 -39964 -40772 -29719 -23142 -36701 -44549 -52529 -38396 -26840 -30849 -15550 10149 18405
14709 18405 -3411 -10638 -2562 21167 40168 63683 45347 30179 28645 16557 -7759 -17014
14697a7014K3719J854k2760K816L529r743j8665N130O414N765j8537N840O947
14684b4705K0503j838m227j6941o013O043J3943K1605R580N464l708m112p777
14671G817j5642J4030p490J872r313m985p836n30J0788L590k55J0016O749O589
14657A5400j7789O172J0260N269r16P075l755j5867p251K0470M157k7698J00j5938
14643b0311k862K523J9748J8498j869q895K294K969p929Q625K0863M386j2110
14630B5930o219R625k452q381p904j0006k586m238r491R756M282J2008J6245J0554
14616C7123j3950q422j4801k670q951O562r66l615n507R334k1477n428J3984N092
14602a3692r680J261J0780J3878P506j2456P72K086K631m351r779J4102k249j9200
$$ plain form
14697 -17014 6705 8559 -14201 -11385 -7856 -17599 -36264 -31134 -24720 -18955 -37492 -31652 -24705
14684 -24705 -4202 -6040 -10267 -27208 -33221 -27178 -13235 8370 17950 23414 19706 15594 7817
14671 7817 -7825 6205 -1285 587 -8726 -13711 -21547 -22077 -11289 -7699 -7954 2062 8811 15400
14657 15400 -2389 3783 14043 19312 18396 25471 21716 5849 -1402 19068 23225 -4473 -4373 -20311
14643 -20311 -23173 -20650 -902 17596 15727 6832 9126 12095 4166 12791 33654 38040 25930
14630 25930 19711 29336 26884 18503 10599 593 -1993 -6231 -15722 -5966 -1684 10324 26569 37123
14616 37123 23173 14751 -50 -2720 -11671 -5109 -6075 -9690 -15197 -5863 -27340 -32768 -18784 -13692
14602 -13692 -23372 -22111 -11331 2547 10053 -2403 -1631 455 3086 -1265 -11044 3058 809 -18391
14588a8391r215j0950Q093J224R378l468K391M026j9394k187K1429J2432J4160
14575I528L460n106j1691k388m750J8076K106L549K017p179o551O1J2102J8145
14561C1379l03j6985j2385K808J844n846J3957j1938o147J6653P307L948k8377
14548d085j5339m339L4164J238L3504R972k5321j2578n130L609J270j289J933
14535A7609L692j6102Q41n322q995K819J3516k905M435j3332L026J0245Q417j1290
14521F654j9886q290p12k849J6941J1530m737j835R934j2344q680m400q750O380
14507b1044Q278r633m969m993J3895J0742j157J3184k058M636O758m430p870K3799
14493B5138J0077l378n30J593j5672j3091k4322j1356K3115K4246n012n29L265
$$ plain form
14588 -18391 -27606 -38556 -30463 -29239 -19861 -23329 -20938 -16912 -36306 -38493 -17064 -4632 9528
14575 9528 12988 7882 -3809 -6197 -10947 7129 9235 12784 14801 7622 1071 1132 13234 31379
14561 31379 31076 14091 1706 4514 6358 512 14469 2531 -3616 13037 20344 24292 -4085
14548 -4085 -19424 -23763 10401 11639 45143 55115 29794 17216 12086 15695 16965 15676 17609
14535 17609 21301 5199 6040 718 -8277 -5458 8058 5153 9588 -3744 -718 9527 17944 6654
14521 6654 -13232 -21522 -22234 -25083 -8142 3388 -1349 -3184 6750 -5594 -14274 -18674 -27424 -21044
14507 -21044 -12766 -22399 -27368 -32361 -18466 -7724 -8881 4303 2245 6881 13639 9209 1339 25138
14493 25138 35215 31837 31307 32900 17228 4137 -20185 -31541 -8426 15820 10808 10279 13544
14480A3544j0454J88Q67K967J5860J9333J3785n054k2554j8811q812K661p686
14467d166n758L0956J9782J7132j9531j5586j1746R04J0194P201J8481q443l7078
14454B342j2768J1715K0756J7400j2162k9015o713J1322p162l394O758R201P556
14441A5836J4836j458l987N784M727m625p693J0917j2700j6434j9557Q551N698
14428a05k003K2941n62l735p637o600Q955J4726j0547j1780j3837O04J278M779
14414c523K0194p522j4745j9655m543j3214K8771K5917l080k2839l1669K3865
14402b2043J1433J6602J5960l900k3777l112j0635N944J3656j766J3712K87l059
14389I302N130j061Q286k4143q540K139J2783K7191j654j79j9112O37J5165J7432
$$ plain form
14480 13544 3090 3278 4145 7112 22972 42305 56090 51036 28482 9671 859 3520 -4166
14467 -4166 -9924 21032 40814 57946 38415 22829 11083 11987 22181 29382 47863 39420 2342
14454 2342 -10426 1289 22045 39445 27283 -1732 -8445 2877 -4285 -7679 -921 8280 15836
14441 15836 30672 29214 25227 31011 35738 31113 23420 34337 21637 5203 -14354 -5803 -105
14428 -105 -2108 20833 20271 16536 8899 2299 11254 25980 15433 3653 -10184 -9580 -8302 -3523
14414 -3523 16671 9149 -5596 -25251 -29794 -43008 -14237 11680 8600 -14239 -45908 -22043
14402 -22043 -10610 5992 21952 18052 -5725 -8837 -19472 -13528 128 -1638 12074 12361 9302
14389 9302 14432 13371 21657 -2486 -11026 -8887 3896 31087 29433 29254 10142 10779 25944 43376
14375D3376l254M43j8500k7127q887K550J7845p794j1086K502N810n235p83K1224
14361A1084O253R45j8280O911N952J0518r780M522N615J326j6106j1680l402M624
14347a498j038P034L859r867j2269P673K6392k539q483m0J4883j4331k0657n777
14333a6658K620J0645K962O358N443l080K536m787M236l861n160n087j3730j7904
14319c5467n859K9503J3574M525r055O411p173o749j1897p087J3007R245j4627
14306b1649J758K3295J6995q262j552M019L631j4492p388R977K845L136J0039
14293B2352j4450p41L162N602N038k1795m332j4762K538J5687J4688o998j4714
14280h725K9760K400k5453q16J8906q741n082K49j349j3780J668J9837m960j2023
$$ plain form
14375 43376 40122 40565 22065 -5062 -13949 -11399 6446 -1348 -12434 -9932 -4122 -9357 -10140 11084
14361 11084 17337 18282 2 6913 12865 23383 13603 18125 23740 25066 8960 -2720 -6122 -1498
14347 -1498 -2536 4498 8357 -1510 -13779 -6106 20286 17747 9264 9224 24107 9776 -10881 -16658
14333 -16658 -14038 -3393 -431 5927 11370 8290 10826 6039 10275 6414 1254 -3833 -17563 -35467
14319 -35467 -41326 -11823 1751 6276 -2779 3632 -3541 -10290 -22187 -29274 -16267 -7022 -21649
14306 -21649 -19891 3404 20399 12137 10585 14604 18235 3743 -3645 6332 9177 12313 22352
14293 22352 7902 7161 10323 15925 20963 -832 -5164 -19926 -17388 -1701 12987 5989 -8725
14280 -8725 21035 23435 -2018 -2834 16072 7331 2249 2498 1149 -12631 -10963 8874 3914 -8109
14266h109r8L667l222J1958o41j7510q476O330l921R128L131q77Q320q956m969
14251a4245N785o555q977O871J5673o179j5043J4337J2016K035K0737O856j1398
14238B1913r460J5060j3003j7297M229K677k48j6632j7613R470J0008N356k09
14225e749o955L689p608K112J5433N36R786O1n933J329k0498m765j2130O433K5920
14210A661J9928N965P388j307J326R197k2160j2943j0417N655P795J13j3435m805
14196f039J3835Q913m32N131l362k1323K84K609k70L575K2212m24M329P572j14
14181C6496j3319q691o266k606J0760K4162p854q435K099q423N311P401p75j5200
14167A4660j2344J7089j647j4454p001Q457k741k0793j8501L696L8631P127O448
$$ plain form
14266 -8109 -8207 -4540 -7762 4196 3555 -13955 -22431 -16101 -20022 -10894 -7763 -8640 -320 -9276 -14245
14251 -14245 -8460 -15015 -23992 -17121 -1448 -7627 -22670 -8333 3683 5718 26455 33311 21913
14238 21913 12453 27513 14510 -2787 1442 4119 3871 -12761 -30374 -20904 -10896 -5540 -5749
14225 -5749 -12704 -9015 -16623 -14511 922 1458 11244 11305 5372 6701 -13797 -18562 -30692 -24259 1661
14210 1661 21589 27554 34942 33635 34961 44158 21998 9055 -1362 4293 12088 12201 -1234 -6039
14196 -6039 7796 16709 16277 21408 18046 -3277 -2993 -384 -654 2921 25133 24709 29038 36610 36496
14181 36496 23177 14486 8220 5614 16374 40536 32682 24247 26346 17923 23234 30635 29860 14660
14167 14660 2316 19405 17758 3304 -3697 4760 2019 -18774 -37275 -33579 5052 12179 18627
14154A8627n169L107p178M585J9899O377j1646j5170l284J4023l946m036j8660
14141b471j0526O255N469J0250N087J9827o033q174p907O807r861j0191J1854
14128A0386k482j516j54k6259j1426R978J3212K2387l173p081J1100K442J1441
14115B8855L702j1978q984k281l419J332Q827J366O498j4922k3711R365J1892
14102F542p90J03j1087L24J5090j745j529Q851r964r829O599P784j760N343j2113
14087A819j4480q511R454J5673j0326j7796K2421J6032q228r18O167p892j3056
14074i641Q195R193J9444j302j6428p816n561K4071k517J453q435k0014J3521
14061D163K1864q1j2113k3873j3312K6798O556j2505N706K8319m706l1146m719
$$ plain form
14154 18627 13458 16565 9387 13972 33871 40248 28602 13432 10148 24171 20225 16189 -2471
14141 -2471 -12997 -6742 -1273 8977 14064 33891 27858 19684 11777 18584 8723 -1468 10386
14128 10386 7904 6388 6234 -20025 -31451 -21473 -8261 14126 10953 3872 14972 17414 28855
14115 28855 32557 20579 11595 9314 5895 7227 16054 17420 23918 8996 -14715 -5350 6542
14102 6542 5752 5855 -5232 -4908 10182 8437 6908 15759 5795 -4034 2565 10349 8589 13932 1819
14087 1819 -12661 -21172 -11718 3955 -6371 -24167 -1746 14286 6058 5140 11307 3415 -9641
14074 -9641 -1446 7747 27191 25889 9461 1645 -3916 20155 17638 19091 10656 -9358 4163
14061 4163 26027 25946 13833 -10040 -23352 3446 10002 -2503 3203 31522 26816 -4330 -9049
14048i049R577J8897p226j5760p670K67J8819J1733r329k570J4031J0015k422
14035B9313j0145l3373j0862J0889Q939Q950j541P338Q430q935k2640j3756j2657
14022d0050m670J8479J6140J0551J7468n73r308J8762J281k2126l028M080j1481
14009d475m821q006J3668J8062r289r984J704m98j2703p30o197l394K936M296
13995a9431L0301L035N732r304r063o272j4180J1770P145j5264j7422J800J0357
13982b0796J2269N816P239q769L29J6798k040M731J14K691R92r533j3009q332
13968a1500L052J3400m578Q927J2504o878p923L022L007k801J4759L907M700j9612
13954A3986j2718k00N142M466k0175J766J4997J2185j2874j1519K115j2542l634
$$ plain form
14048 -9049 528 19425 12199 -3561 -11231 -10964 7855 19588 10259 7689 21720 31735 29313
14035 29313 19168 -14205 -25067 -14178 -5239 3711 2170 9508 17938 9003 -13637 -27393 -40050
14022 -40050 -44720 -26241 -10101 450 17918 17345 8037 26799 28080 5954 2926 7006 -4475
14009 -4475 -9296 -17302 -3634 14428 5139 -4845 -3141 -3639 -16342 -17072 -23269 -26663 -23727 -19431
13995 -19431 10870 13905 19637 10333 1270 -5002 -19182 -7412 -267 -15531 -32953 -31153 -20796
13982 -20796 -8527 -2711 4528 -4241 -3912 12886 10846 15577 15691 18382 19374 9841 -3168 -11500
13968 -11500 -8448 4952 374 9301 21805 14927 7004 10026 13033 10232 24991 28898 33598 13986
13954 13986 1268 1068 6210 10676 -9499 -7733 7264 19449 6575 -4944 -2829 -15371 -19005
13941a9005m345O699K6351J4005m400j9919j0273J8687l150J7880R811j8371J664
13928A5634m432j4571P88j502J783J004j4576P829K7250j870j1615K268k771n828
13914f09j0632m031J3745j6317O03Q107O698R799J3880O62k6957o417N787r228
13900a4910l238k996J3219K7541O343j3620J1221j7100j8287k0765N486l214k041
13887c2361J6475J0345J6603r704J397j160o701L833M259J3553m326r803J3579
13874A5989J2394J140M120j0988k0676p931J3041K7409j0822j8794J843k335r344
13861d954J7589K2685q073q067O403m904j1660K5344N335q945O129j8950q592
13848I340l653r521m252R251M846M412l722o910j0345k0547N385O446r204J1981
$$ plain form
13941 -19005 -23350 -16651 9700 23705 19305 -614 -10887 7800 4650 22530 32341 13970 15634
13928 15634 11202 -3369 -2581 -4083 -2300 -1296 -15872 -8043 19207 17337 5722 7990 5219 -609
13914 -609 -11241 -15272 -1527 -17844 -17241 -9134 -2436 7363 21243 21905 -5052 -11469 -5682 -14910
13900 -14910 -18148 -21144 -7925 19616 25959 12339 23560 6460 -11827 -32592 -27106 -30320 -32361
13887 -32361 -15886 -5541 11062 1358 2755 1595 -5106 -1273 2986 16539 12213 2410 15989
13874 15989 28383 29523 33643 22655 1979 -5952 7089 34498 23676 4882 6725 4390 -4954
13861 -4954 12635 35320 27247 19180 25583 20679 9019 34363 39698 30753 36882 17932 9340
13848 9340 5687 -3834 -8086 1165 6011 10423 6701 -209 -10554 -31101 -25716 -19270 -28474 -16493
13834a6493J3943j485p076r821J5501N811L096M217O721Q878k179k6017Q472O669
13820A0237n3J0458m683j7726j1733N065J953O294M892k43L408K687j2154k2641
13806b4239J8813M899R748R661j8576j1883K2063N627j941q79K3059J2926r846
13793C9432j7779j069j0094j1341j209j6465M547l383O871L1908n612K971n885
13780A2892lO382P125j1957l829m072j4169Q598R003N004l86l2087k2616J9422
13766b0693J2116p989j166j3122r367L8492J3673j5200k045l306N921K4867N48
13753B2729j2985p528J3523j2500j4705P795J5872J0435Q55m34m709J808J8448
13740C8604j591p455J0327o533q636k911J661k102m475P521Q814J413M442r17
$$ plain form
13834 -16493 -2550 -4035 -11111 -20932 -5431 380 3476 7693 14414 23292 21113 -4904 3568 10237
13820 10237 10184 20642 15959 -1767 -13500 -8435 -6482 -188 4704 4461 7869 10556 -1598 -24239
13806 -24239 -5426 -527 9221 18882 306 -11577 10486 16113 14172 13293 36352 49278 39432
13793 39432 21653 20584 10490 -851 -2060 -18525 -13978 -17361 -10490 21418 15806 18777 12892
13780 12892 12889 19271 26396 14439 10610 6538 -7631 967 9970 14974 14588 -17499 -40115 -20693
13766 -20693 -8577 -16566 -17732 -30854 -40221 -1729 11944 -3256 -5301 -8607 -2686 22181 22729
13753 22729 9744 2216 15739 3239 -11466 -3671 12201 22636 23491 23057 18348 20156 38604
13740 38604 37013 29558 39885 33352 24716 21805 23466 21364 16889 24410 33224 34637 39079 38162
13726C8162k779l963o159j655r971M33L355p169J4450J7028k2384k9986J1310
13713F72J3846P229r439j2604r257m398q088J3727J4992l619k9650o214L898K0246
13699h659J6486Q452K4364p251k4607j7083j7202J120N334P204J8226P136l974
13686I546L060J4718N259n750n899o811j7487r128j1515J4865J4616K0255J2492
13673C8221j7823K6656k242j2944j4883J1529O131j0766r439P686J8990l07l0965
13660I844j1939M751K8155O458j9092K558m231l767m786p6O027J4486j42N30q260
13645B0516o794L31M122j561j0120J3535N836j8357k6379J6527J9389O431n541
13632A7935n266K897M519k5123Q27O386L986M572o90M787j5583M422L378L925
$$ plain form
13726 38162 35383 31420 25261 23606 13635 14068 17423 10254 24704 41732 19348 -10638 672
13713 672 14518 21747 12308 -296 -9553 -13951 -22039 -8312 6680 3061 -26589 -32803 -28905 -8659
13699 -8659 7827 16279 40643 33392 8785 -8298 -25500 -24380 -19046 -11842 6384 13520 9546
13686 9546 12606 27324 32583 26833 20934 14123 -3364 -12492 -24007 -9142 5474 25729 38221
13673 38221 20398 47054 44812 31868 16985 28514 34645 23879 14440 22126 41116 40809 9844
13660 9844 -2095 2656 30811 37269 18177 20735 16504 12737 7951 7875 13902 28388 28246 28776 20516
13645 20516 13722 14053 18175 16614 6494 20029 25865 7508 -18871 -2344 17045 23476 17935
13632 17935 12669 15566 20085 -5038 -4211 2175 6161 10733 10043 14830 -753 3669 7047 10972
13618A0972P638M51Q139j0434m130K2657O624M528j1300k5717K9r372j4401n969
13604b0285P630K171r472K558Q034N84K9481Q33j0460J7077j0484j5546n607J176
13590b310l136P037R04J984m541l701L702j1206J0341l924k4069J4577J2288K1741
13576A9687J5415j6368k2893j2059o892j0371J4615K7497J537j073j4515J3145
13564G725J9594M758J662K594j2919q62Q52j6471j708P219k57N74j2166J5609
13550A6204J7152j284l936j2598j4660K61o4q207j2213n465N803K0572J2968P144
13536B1677k112n491k0810J0941K925N640J1969M946J8369J3670j7712k7482k0252
13523c722J2008M196P272R765q721o301L662p082j4614L51J1245j5480Q22J3153
$$ plain form
13618 10972 18610 19061 27200 16766 12636 35293 41917 46445 35145 9428 9457 85 -14316 -20285
13604 -20285 -12655 -10484 -19956 -17398 -9364 -8780 20701 21534 11074 28151 17667 2121 -3486 -2310
13590 -2310 -5446 1591 2495 4479 -62 -3763 -61 -11267 -926 -4850 -28919 -14342 -2054 19687
13576 19687 35102 18734 -4159 -16218 -23110 -33481 -18866 8631 10168 9095 -5420 7725
13564 7725 27319 32077 33739 36333 23414 22552 23404 6933 5225 12444 12187 12761 595 16204
13550 16204 33356 32072 28136 15538 878 1139 1075 -7132 -19345 -24810 -19007 1565 14533 21677
13536 21677 19565 14074 -6736 4205 7130 12770 24739 29685 48054 61724 44012 16530 -3722
13523 -3722 8286 12482 19754 29519 20798 14497 18159 11077 -3537 -3186 8059 -7421 -6599 6554
13509F554R802j9223o872K2771l21J4101J2092j4002J3195K583j4984k6724K256
13496A228N302K436M488j0400J1493R000L046k1490L007J4243L35j3318R722J230
13482B0322k637p291j5697M43M914J0630j2696J4182M308j4421P819J1053m545
13469A6384K261n715j3126j5141J4683O827R31j1495L661M095J3568r872o480
13456E81J2214p364p74J0701n023J0699J298m091q83J4070L486k4822K585J0400
13442B3077r144j9155Q118J1116J4698J6488q943M894J7974L908k4038j6088K1586
13429D4491r624j2226N496K9235J8243j6237k5443j4607j8662K373K0905L0683
13417E4627O101r551m420m116N043J2045K154j1171k5639Q59R022J1834r131j9254
$$ plain form
13509 6554 16356 -2867 -9739 13032 12711 26812 38904 24902 38097 40680 25696 -1028 1228
13496 1228 6530 8966 13454 3054 14547 23547 26593 5103 8110 22353 22688 9370 19092 20322
13482 20322 17685 10394 -5303 -4860 54 10684 -2012 12170 16478 2057 9876 20929 16384
13469 16384 18645 12930 -196 -15337 -654 6173 7104 -4391 -730 3365 16933 7061 581
13456 581 12795 5431 4657 15358 10335 21034 22332 18241 17358 31428 34914 10092 12677 23077
13442 23077 13933 -5222 2896 14012 28710 45198 36255 41149 59123 63031 38993 22905 44491
13429 44491 34867 22641 28137 57372 75615 59378 33935 19328 666 3039 23944 54627
13417 54627 60728 51177 46757 42641 47684 59729 61883 50712 25073 25932 34954 46788 37657 18403
13403A8403j3528l415J6601N44j4673p465j008L664J7221J7894O553r523j5749
13390A5519J393K316J9447K0228n854j2047J1761N080q456J0877l897k890J094
13377E4571O891J4976r643j7617k130Q844N691p730k057M469L196j0752K2709
13364G1418M102K4086J2616K3615J6518K217Q828J2333L6593M0217M7195Q1383
13352C81121J18051J71722L01141M26011N40247M73155K62452m4396l81418n07413
13342A740673m85402l96702k65558j58790j00642m4066n4751m3763k2652l8789
13332A29558j8215l755q732j635l329j5070j7057q572j6937r853J3747j350K0915
13319E9715k359j8659j0196N797K967P266k360o220j5928p743j3428l632j2334
$$ plain form
13403 18403 4875 1460 18061 18605 3932 -3533 -4541 -877 16344 34238 40791 31268 15519
13390 15519 16912 19228 38675 58903 53049 41002 52763 57843 49387 60264 56367 53477 54571
13377 54571 61462 76438 66795 49178 47048 55892 61583 53853 51796 56265 59461 48709 71418
13364 71418 75520 99606 112222 135837 152355 154572 163400 175733 212326 252543 299738 381121
13352 381121 499172 670894 972035 1398046 1938293 2411448 2673900 2629504 2248086 1740673
13342 1740673 1255271 858569 593011 434221 333579 289513 234762 190999 168347 129558
13332 129558 111343 107588 98856 97221 93892 78822 61765 53193 36256 26403 40150 38800 59715
13319 59715 57356 38697 28501 34298 37265 44531 42171 35951 20023 12280 -1148 -4780 -17114
13306a7114j0172L8316K6218n708N45J8339k69r724j0739J2603J1945J059k272
13293E3027m895J2312J3996N863m722o017r348J6775M768k983k4552o969Q943
13280E6198L842j6539k1559O073K7286P70n98J2528K861j501k510q820k097K051
13266E7985P672j1351j5781j1102n63O276J5253m825j0020j215J0460J6291P454
13253F6534R221J4907J555n864k3689j6010K2243N05l262k83j1708k575L884K21
13239E5679m432q296j1642N535O745J6608J9391m063n75k888j5395j3760j1498
13226C1409l164j20p079k631K7153J2789R241p836j3983J396p717m7035l4471
13213d2048p869J0648J1646K8552K8305P102J6134J8072K6729J0591j4873j3153
$$ plain form
13306 -17114 -27286 11030 37248 31540 32085 50424 50155 40431 29692 42295 54240 55299 53027
13293 53027 48132 60444 74440 80303 75581 69564 60216 76991 81759 78776 54224 47255 56198
13280 56198 60040 43501 21942 28015 55301 56071 55473 68001 70862 69361 66851 58031 55934 57985
13266 57985 65657 54306 38525 27423 26860 33136 48389 43564 33544 32329 42789 59080 66534
13253 66534 75755 90662 92217 86353 62664 46654 68897 69402 66140 65857 54149 51574 55458 55679
13239 55679 51247 42951 31309 36844 43589 60197 79588 75525 74950 72062 56667 42907 31409
13226 31409 28245 28125 21046 18415 45568 58357 67598 59762 45779 47175 39458 -7577 -42048
13213 -42048 -49917 -39269 -27623 929 29234 36336 52470 70542 97271 107862 92989 79836
13201G9836j4966j1386N958m604j1594K3804K5830k6n045k1162j3360m1n470j1308
13187C6466K0033K6197M462p371k372N791q417p571o52r056m007J7325o003N981
13173G0806J7679M235j0668j6173J6309K3346J0403J6841K164q258r47N643N6303
13160A87683Q9672Q7068P9605K0230m9018q8803p8795m0134j7081j5204k684p610
13148A64929k481n753j7197j1415J185n843l1480K247L51k964q752j6289L630
13135G0168K0117Q748k1083p026L699J6074J5221j8132j1094p212L012m89J2992
13122H4995j808J2051J8472N040m423l328J3358P219j3988P275j164j558o460
13109A15681J2690Q974Q831J2448j1435o882k255p41K4858K3381K5790O500l0380
$$ plain form
13201 79836 64870 53484 59442 54838 43244 67048 92878 92852 87807 66645 53285 53244 47774 36466
13187 36466 56499 82696 87158 79787 77415 83206 74789 67218 66566 57510 53503 70828 64825 70806
13173 70806 88485 92720 82052 65879 82188 105534 115937 132778 134942 126684 125737 131380 187683
13160 187683 277355 364423 444028 464258 415240 326437 247642 207508 190427 175223 172539 164929
13148 164929 162448 156695 139498 128083 129268 123425 91945 94192 94543 91579 82827 66538 70168
13135 70168 90285 99033 77950 70924 74623 90697 105918 87786 76692 69480 72492 72003 84995
13122 84995 83187 95238 113710 118750 114327 110999 124357 131576 117588 124863 123699 122141 115681
13109 115681 128371 137345 146176 158624 147189 140307 138052 137311 162169 185550 211340 217840 187460
13096A87460M077L61r769j2833m612k2962k784m358R238l877k4782l0493k2553
13083F2113k7098p021k779k830K0217J2122J3569L945M595p045q324R458L4839
13070A05761K8279o372r907j2990j6660l3681m3427m9200k1963Q479L6211K7223
13058A1753N1691M2723L7631K6459L6085K0090j2892j8032r499K757L1771R441
13046B29978p331R571J5827M495L165K6274K0555M689K3541O5570R8977J42573
13034F37884J85486J15297R784j18512k00314j66564j00343o5111l4171j8007
13024B45429k3133p550j4892R371K0492R469j4332L246J5412K0691K5857M124
13012B94184o213N821Q763J2043N759J302j586K480R264q144J1694M320j1049
$$ plain form
13096 187460 191537 191898 182129 169296 164684 141722 138938 134580 143818 139941 115159 84666 62113
13083 62113 35015 27994 25215 22385 42602 54724 68293 72238 76833 69788 61464 70922 105761
13070 105761 134040 127668 117761 104771 88111 54430 11003 -38197 -60160 -51681 -15470 11753
13058 11753 63444 106167 143798 170257 206342 226432 213540 195508 186009 188766 220537 229978
13046 229978 222647 232218 248045 252540 255705 281979 302534 307223 330764 396334 495311 637884
13034 637884 823370 938667 948451 829939 629625 463061 362718 297607 263436 245429
13024 245429 222296 214746 199854 209225 229717 239186 224854 228100 243512 264203 290060 294184
13012 294184 287971 293792 302555 314598 320357 321659 320073 322553 331817 323673 335367 339687 328638
12999C28638J1886K764J4579J1655O590j570m859J5799Q937J3245K7518L1159
12987D66341L1894K5267K6702L7811J6778J2250N687j4943J4290L1082K8773R113
12975F91045K4262J7569L9920L4974R144L1099M9172J2427Q735J7401L4209K2003
12963I91960K5542N2614N5898P6391Q9389Q2164N1384M9728M9865K4326L0072
12952A579333M7915P2194N4539L8085M3462J04875J09323J30812J51565J62909
12942B495012J86739K17416K26548K21439K14972J93121K12435K44003K73459
12933D485144L31052L97541M35834M94580N81951O39874P01187Q05539R64546
12924I837248J138148J304741J544499J910057K409343L092205L942724N033646
$$ plain form
12999 328638 340524 343288 357867 369522 376112 374542 369683 385482 394419 407664 435182 466341
12987 466341 498235 523502 550204 588015 604793 617043 622730 607787 622077 653159 681932 691045
12975 691045 715307 732876 772796 807770 816914 848013 897185 909612 918347 935748 969957 991960
12963 991960 1017502 1070116 1126014 1202405 1291794 1373958 1425342 1475070 1524935 1549261 1579333
12952 1579333 1627248 1699442 1753981 1792066 1835528 1940403 2049726 2180538 2332103 2495012
12942 2495012 2681751 2899167 3125715 3347154 3562126 3755247 3967682 4211685 4485144
12933 4485144 4816196 5213737 5649571 6144151 6726102 7365976 8067163 8872702 9837248
12924 9837248 10975396 12280137 13824636 15734693 18144036 21236241 25178965 30212611
12916C0212611O390815Q061808J0507913J4443372K1209859L3156944N3380513
12909A77363835Q1654750J03783789R1772546M6474968j1024573p3601308r9252610
12902C17171397r3038434p1433816m6189402k8432060j8290167j2682924r308241
12895C7796353p010400n268960l978315l036357k440648k022444j671025j355856
12887A1012348j124372r47082q16664o95842n93710m96634l94681l43880l24453
12878E275030l11142l17512l05920k53972k30595j51503k8575P2919K55058M54138
12868D457926P15196Q13661N55665J21386m78243r70447j005920q43657o03608
12859B761959m00762k80049j90920j65659j16074j14804p2855k1724J0j2046l3015
$$ plain form
12916 30212611 36603426 44665234 55173147 69616519 90826378 123983322 177363835
12909 177363835 259018585 362802374 454574920 501049888 490025315 416424007 317171397
12902 317171397 224132963 152699147 106509745 78077685 59787518 47104594 37796353
12895 37796353 30785953 25516993 21538678 18502321 16061673 14039229 12368204 11012348
12887 11012348 9887976 8940894 8124230 7428388 6834678 6338044 5943363 5599483 5275030
12878 5275030 4963888 4646376 4340456 4086484 3855889 3704386 3675811 3748730 4003788 4457926
12868 4457926 5173122 5986783 6542448 6663834 6185591 5215144 4209224 3365567 2761959
12859 2761959 2361197 2081148 1890228 1724569 1608495 1493691 1420836 1399112 1399122 1387076 1354061
12848A354061n2287o5272p4627n7958m3465l3822k0930k0816m9678m8120k5159
12837H61927q470j1852k1456l0890k9120l8198k7535j3493k4561m056k3233j8882
12825F10181o061q51R191J1717m077j9799k2512l7997l1616P388k907q619k6357
12812D77681j8679k050O034o924m112k1929j546J6072J6498j0409k2502k2989
12800D05145O150k040j3800j0161m244j4200J1213J433J2384N874k4016j0368
12788C63370m973m823M828K2416M7490N8236P4021P1264N9248l598p4965j33390
12776D79124r4654n5828m8479l9113j9723k4873k4551Q96j182r36L694j553j2730
12763A60092J1571j3089r118l958J708P290p025K479L8519M8436N1101M7920M0357
$$ plain form
12848 1354061 1301774 1236502 1161875 1103917 1060452 1026630 1005700 984884 935206 887086 861927
12837 861927 853457 841605 820149 789259 760139 721941 694406 680913 656352 652296 629063 610181
12825 610181 604120 603269 612460 624177 620100 600301 577789 539792 508176 515564 512657 504038 477681
12812 477681 459002 456952 462986 456062 451950 430021 428475 444547 461045 450636 428134 405145
12800 405145 411295 409255 395455 385294 381050 366850 378063 379496 391880 397754 373738 363370
12788 363370 358397 353574 358402 380818 428308 486544 560565 631829 691077 687479 612514 479124
12776 479124 384470 328642 280163 241050 221327 196454 171903 172799 171617 170681 174375 172822 160092
12763 160092 171663 158574 149456 145498 147206 154496 147471 149950 188469 236905 288006 335926 376283
12750C76283J2543k2928m3069l2045n2233m1458m963L294p11k9884j6250J6765
12738A65344R837j6029m651J1543J2983M970R969J7661m396m586n223K488J2018
12725B11928k3938m2046j0718k343l4419j8780L402j2179j4196j8974k2364j9514
12713d141j977K4101K3330K1144j2881j8913M674n038J6136L5135J0508k743p274
12700H2061p076k563Q255j090j523k2086n162J6372K1501K9148P052o333j0621
12687A07935j3290o07l698k115j2954k1524K2068P912j9199l079n969R615J1152
12674G6247n29L989J4269k0701p431R781J1601j2143j0548p707R284L2486K2639
12661A21237Q418J152M249N677q07k6287k3408J191M644J0376J5501q95j7125
$$ plain form
12750 376283 388826 365898 322829 290784 238551 197093 192130 195424 194713 164829 148579 165344
12738 165344 175181 159152 154501 166044 179027 183997 193966 211627 207231 202645 197422 199910 211928
12725 211928 187990 145944 135226 132883 98464 79684 83086 70907 56711 37737 15373 -4141
12713 -4141 -6118 17983 41313 62457 49576 30663 35337 30299 46435 81570 92078 89335 82061
12700 82061 74985 72422 80677 79587 78064 55978 50816 67188 88689 117837 124889 118556 107935
12687 107935 94645 94038 90340 88225 75271 53747 75815 83727 64528 61449 55480 65095 76247
12674 76247 75718 79707 93976 73275 65844 75625 87226 75083 64535 56828 66112 98598 121237
12661 121237 129655 130807 135056 140733 139926 113639 90231 91422 96066 106442 121943 121048 103923
12648A03923l2352k5549K388l346M609K2342l717J1812o541k0087j349o455J180
12635D6858p126j3252P751J1348P278n058j6295k6999k717J1177J8377J3493K585
12622D7420Q848Q177o653k2612j4458J020Q905J0471J2907j7068l360Q240P679
12609D9516j9153k839O710j1240R059K1693k198K2439J9767J2443q203k5147k1873
12596E0974J225m517n77j5341j6003j4992m161J0542J8200K0921J0430n009m263
12583D7429J113K111m62k340R73J2114k5921j8717K0420J8264O553j2534m622
12570D4381l457j1192j0268M39j061J7991J1792r887j8058m198K00p46J4915m337
12556B6514q082J025K2894J5222j8423k145j3419L304R353o529q313J1415l747
$$ plain form
12648 103923 71571 46022 48410 45064 49673 72015 68298 80110 73569 53482 52133 45678 46858
12635 46858 39732 26480 34231 45579 52857 47799 31504 4505 1788 12965 31342 44835 47420
12622 47420 56268 64445 57792 35180 20722 21742 30647 41118 54025 36957 33597 41837 49516
12609 49516 30363 27524 34234 22994 32053 53746 51548 73987 93754 106197 97994 72847 50974
12596 50974 52199 47682 47105 31764 15761 769 -3392 7150 25350 46271 56701 51692 47429
12583 47429 48542 50653 50191 47851 48824 60938 35017 16300 36720 54984 61537 49003 44381
12570 44381 40924 29732 19464 19903 18842 36833 48625 38738 20680 16482 16682 15936 30851 26514
12556 26514 18432 19457 42351 57573 39150 37005 23586 26890 36243 29714 21401 32816 29069
12543B9069J1035K93j4636p165N431P965R823J8429O105k704j9812j5340R467
12530C7960N114l153J2226J4974n925j995J996j1002j4838N910M374j4675k0317
12517A0649J650K1956K555K3818J0039P533k236j8919k5867n488L04K0883Q268
12504E5145J301j1942j6312r313n650K810K2657Q483j1011R91Q669j0135R45p384
12490B9254j2252O706J7130M510r421R65n434o836P65N360J747J0873J6031J7693
12476G7091L5693K7483J6531m244n252j24L7958M1219N1057O7649P6564J23720
12464E45345J97466K93603M47214N46603M46747J92754j34647m40879n35749m69649
12454A088808l40742k13081j39182r8887o6944l0466l0611k0493r927N756k3769
$$ plain form
12543 29069 40104 40397 25761 18596 24027 31992 41815 60244 66349 63645 43833 28493 37960
12530 37960 43074 39921 52147 67121 61196 59201 61197 50195 35357 41267 45641 30966 10649
12517 10649 12299 34255 36810 60628 70667 78200 75964 57045 31178 25690 25994 46877 55145
12504 55145 56446 44504 28192 18879 13229 16039 38696 47179 36168 37159 45828 35693 36638 29254
12490 29254 17002 23708 40838 45348 35927 36892 31458 24622 25387 30747 32494 43367 59398 77091
12476 77091 112784 140267 156798 152554 147302 147178 185136 226355 277412 345061 421625 545345
12464 545345 742811 1036414 1483628 2030231 2476978 2669732 2535085 2094206 1558457 1088808
12454 1088808 748066 534985 395803 296916 229972 199506 168895 148402 138475 144231 120462
12443A20462l178l075l2646J755j433k2470o092L255o946n019M47M200K1267j0599
12429E9928j1807q844Q88P183J2969O429k398j9184N754N409r145q042j450j175
12415C6515q083l450N831j0441j4381J1045m89P342r201r899N178j2028J5957
12402A3896J6456K8181p111k0523j2224Q41L357j9762o511L465q057j0549q75
12389a9416N056J1843L397j720M567k879r784O254K3R758J2519p142r408Q012
12375A1080n900K738q387l859o728J0219r189K0064K3382R925l922j4590N05K669
12361B8007n518J1375M44M951L755l4709l720Q103k481m744N899j2003j3610L690
12347a0561O293O843M314l926P558J1570j734n173q930p322R748K642Q553o805
$$ plain form
12443 120462 117284 114209 81563 83318 81885 59415 53323 56578 49632 44613 45060 49260 70527 59928
12429 59928 48121 39277 40165 47348 60317 66746 64348 45164 50918 56327 47182 39140 37690 36515
12415 36515 28432 24982 30813 20372 5991 17036 16547 23889 14688 4789 9967 -2061 13896
12402 13896 30352 58533 51422 30899 18675 19516 22873 3111 -3400 65 -7992 -18541 -19416
12389 -19416 -14360 -2517 880 -840 3727 848 -8936 -2682 -2659 7099 19618 12476 3068 11080
12375 11080 5180 7918 -469 -4328 -11056 -837 -10026 10038 33420 43345 39423 24833 25338 28007
12361 28007 22489 33864 34308 39259 43014 8305 4585 12688 10207 5463 11362 -641 -14251 -10561
12347 -10561 -4268 2575 6889 2963 10521 22091 20357 15184 6254 -1068 8680 11322 19875 13070
12333A3070r25k405L905J0656N450n725m736j1161j6710j7315m978L104K9770
12320B000J3658L061j6433j8341K5256J1595j0448j4405n221o016M17J3332J1240
12307I695m413q269J2766L106k7899r162J0858J2210J8403Q100j9513j2847R67
12294e998P643K054K99k83j938M251j4325J1230J7072N585J3373j7724r458j0579
12280A202m711j2937N210N452L789N329m38L702n470J3299m563j0351P237K3354
12266C0104K535j5465j1828j7977L706j456j969J838M040q143K998Q062O890r319
12252e984N679K3167n111j6405j1496k484q671j6860l646L692J8362J525M897
12239a3335J6466N247J8861K847j0279k924n722n846J443K277K574J369j952J879
$$ plain form
12333 13070 12145 9740 13645 24301 29751 24026 19290 8129 -8581 -25896 -30874 -27770 2000
12320 2000 15658 18719 2286 -16055 9201 20796 10348 -4057 -9278 -15294 -14877 -1545 9695
12307 9695 5282 -2987 9779 12885 -15014 -24176 -13318 -1108 17295 25395 5882 -6965 -5998
12294 -5998 1645 3699 3998 3715 1777 6028 -8297 2933 20005 25590 38963 21239 11781 1202
12280 1202 -3509 -16446 -11236 -5784 -1995 3334 2896 6598 1128 14427 9864 -487 6750 30104
12266 30104 32639 17174 5346 -12631 -8925 -10381 -12350 -10512 -6472 -14615 -11617 -3555 3335 -5984
12252 -5984 -305 22862 17751 1346 -10150 -12634 -21305 -38165 -41811 -38119 -19757 -18232 -13335
12239 -13335 3131 8378 27239 30086 19807 16883 11161 5315 6758 9035 11609 12978 11026 12905
12225A2905J2362J1784o107R65J0387o040k543k325k273m732l0191r016M546J121
12211i157J1526J7731K766k7067L93J4231j0552o495m772K0794J4047q81j0780
12198A1784k005m017r347J4942J0203j460j0562Q447m465J653L423L286n550r663
12184F669p386P335M650j0259j2830p841N490K4313J8918k1620P59O930N434N847
12170B6409p27o589r164o000J6912q437O948M614j47K951J2553j3997j1309K138
12156A6155m376P58J6704j162l1897k8112L094K4549J6742n033m697k19N807L782
12142A2095k2619k3486J2795J6625m99l552J8815K42J0957J2591L720j4528o948
12129A6208K3003j1519p219J7010P30n004q96n30j4913j0085J3906p4j9653j5986
$$ plain form
12225 12905 25267 37051 30944 31909 42296 36256 33713 31388 29115 24383 -5808 -14824 -10278 -9157
12211 -9157 2369 20100 22866 -4201 -3808 10423 -129 -6624 -11396 9398 23445 22564 11784
12198 11784 9779 5762 -3585 11357 21560 20100 9538 17985 13520 15173 18596 21882 16332 6669
12184 6669 -717 6618 11268 1009 -11821 -19662 -14172 10141 29059 7439 8198 15128 20562 26409
12170 26409 25682 19093 9929 3929 20841 12404 19352 23966 23819 26770 39323 25326 14017 16155
12156 16155 11779 12537 29241 28079 -3818 -31930 -28836 -4287 12455 7422 2725 2506 8313 12095
12142 12095 -10524 -34010 -21215 -4590 -5089 -8641 10174 10416 21373 33964 37684 23156 16208
12129 16208 39211 27692 20473 37483 38213 33209 32313 31783 16870 6785 20691 20617 964 -15022
12115a5022j316J2717L2301P671p887j3579q430k667j0371m273m927k949J359
12102a7373K6256K6898j2552O860M118j97q466m802M797k283j9287n149J3086
12089A1906O855Q706k055j6526j2042j3305J1796o960N236N982P848l483j601
12076B357J2396M905J2405o754j7440k0975J773K5883L008L344J789j2268j1403
12063i80O861J6680J0124j303K28l577j6756j4361Q61r671j9092k350l343l694
12049d0373J7699P855J5565r113r095j0917O86n901l642J1702J6986J550J053
12036e945j0249k790J8693J521j6536j819J1879m647J2816J3395k2287q444K7780
12023A3367L5130p943k1824O575L809M930j0814n096j0306K399J479k7455n50
$$ plain form
12115 -15022 -16338 -3621 28680 36351 28464 14885 6455 3788 -6583 -10856 -15783 -18732 -17373
12102 -17373 8883 35781 23229 30089 34207 34010 25544 20742 25539 23256 3969 -1180 11906
12089 11906 18761 27467 25412 8886 -3156 -16461 -4665 -11625 -6389 -407 7441 3958 2357
12076 2357 14753 19658 32063 25309 7869 -13106 -11333 14550 17558 20902 22691 10423 -980
12063 -980 5881 22561 32685 31382 31610 28033 11277 -3084 -2223 -11894 -30986 -33336 -36679 -40373
12049 -40373 -22674 -14819 746 -8367 -17462 -28379 -27693 -33594 -37236 -25534 -8548 -6998 -5945
12036 -5945 -16194 -18984 -291 1230 -15306 -17125 -5246 -9893 2923 16318 -5969 -14413 13367
12023 13367 48497 40554 18730 25305 29114 34044 23230 18134 7828 10227 11706 -15749 -16299
12010a6299l23J8635O568J2403j1831j3607n139j2021j0348R859K851o348j44
11997b5744J5167J4360m793O51J984j846j507K9177j0323m249R840J1208L728
11984C7653q773k3500j9096J6863M726O352P285l15L563j3174r876N292Q956o589
11970I367j6869M314K2983M68j4542j6181J9994J5798J0040j8554j6198m093L251
11957b22P064J2275l1680o63K927l315N562J5126P521K601q305K651Q953K8630
11943D9125L072j3006j2160j3627l835L757M410k1646o091N20m350n732j3802
11930c3365j484K4241K6393R239k1265j9080k040K937M29J7136l319p602J9318
11917A1538O77o142j2387j3563q262J0062J3289J7609J8035k269k0960q079k95
$$ plain form
12010 -16299 -16622 2013 8581 20984 9153 -4454 -9593 -21614 -31962 -22103 -19252 -25600 -25744
11997 -25744 -10577 3783 -1010 -359 1625 -221 -1728 27449 17126 12877 22717 33925 37653
11984 37653 28880 5380 -13716 3147 7873 14225 21510 21195 24758 11584 1708 7000 15956 9367
11970 9367 -7502 -3188 19795 20263 5721 -10460 9534 25332 35372 16818 620 -3473 -222
11957 -222 6842 19117 -12563 -13226 -10299 -13614 -8052 7074 14595 17196 8891 11542 20495 49125
11943 49125 52197 39191 27031 13404 9569 13326 17736 -3910 -10001 -9481 -13831 -19563 -33365
11930 -33365 -34849 -10608 15785 25024 3759 -15321 -17361 -14424 -13995 3141 -178 -7780 11538
11917 11538 12215 6073 -6314 -19877 -28139 -18077 -4788 12821 30856 28587 7627 -452 -747
11904g47O658J4748j1870m84P844k931q253j0110j7024J7579R897j320j2263r413
11890a7689j8252L583K7799K1674r638K469j2k3142N375l809r694P050J3914J7165
11876A6793j2997j401r363K730m396P105Q611O69P955J3818P642M482j8133q450
11862A5065j4857l2534p568J7898n092l566k445K882K5626J0642r542p929L661
11849g759j4453r334M720l409L2J3301Q315m780l150J1281L14j4255m047m298
11835b7522J901L762J1385J0391P300J2310K107K337j1480k326m637j3432M141
11822c763N764J496R471J5032Q105k6912j4460j106M314J2634P545P641N270J5987
11808D7018m625o672j8403m987J0843K3270N647k3403n935l806j4837j8268k2908
$$ plain form
11904 -747 5911 20659 8789 8305 16149 13218 4965 -5145 -22169 -4590 5307 3987 -8276 -17689
11890 -17689 -35941 -32358 -4559 17115 7477 9946 9934 -13208 -7833 -11642 -21336 -14286 -372 16793
11876 16793 3796 2395 -6968 -4238 -8634 -1529 7082 7751 15706 29524 37166 41648 23515 15065
11862 15065 208 -32326 -39894 -21996 -27088 -30654 -33099 -30217 -4591 6051 -3491 -11420 -7759
11849 -7759 -22212 -31546 -26826 -30235 -30203 -16902 -8587 -13367 -16517 -5236 -4922 -19177 -23224 -27522
11835 -27522 -25621 -21859 -10474 -83 7217 19527 21634 23971 12491 10165 5528 -7904 -3763
11822 -3763 2001 3497 12968 28000 36105 9193 -5267 -6373 -2059 10575 18120 25761 31031 47018
11808 47018 42393 35721 17318 12331 23174 46444 52091 28688 22753 18947 4110 -14158 -37066
11795c7066r062L475L2392R181l869k0866R698K7506R590j3551L164J2695P452
11782C0739j0100k1886m701k1760M169O623P669J785j496J9493K0190L085p843
11769B5967j7772k1920L2J2957N634j0313J1787l038J3935P618j0636j7135o218
11756i102Q163N166q859K688J921l35K1663l749j7921j4852m522L142r998J8127
11742h468K0034p394o744J140K809q187k746J29L380j0440m211M105J3617P755
11728D779j2777o532j5875j8026J7334J6100K3744K3246n872j4316l1077p210
11716b6482J5704Q13M071J5939J3248j546k300m179n829j3046j3456J0058N389
11703a616o062p152J5805p272j811N166j553j050j0172J364K1272K1196j2951
$$ plain form
11795 -37066 -46128 -42653 -10261 -1080 -4949 -25815 -16117 11389 20979 7428 10592 23287 30739
11782 30739 20639 -1247 -5948 -27708 -23539 -16916 -9247 -7462 -8958 10535 30725 33810 25967
11769 25967 8195 -13725 -13693 -736 4898 -5415 6372 3334 17269 24887 14251 -2884 -9102
11756 -9102 -939 4227 -4632 -1944 -23 -358 21305 17556 -365 -15217 -19739 -16597 -26595 -8468
11742 -8468 11566 4172 -2572 -1432 1377 -6810 -9556 -9427 -6047 -16487 -20698 -16593 -2976 4779
11728 4779 -7998 -14530 -30405 -48431 -31097 -14997 8747 31993 26121 11805 -19272 -26482
11716 -26482 -10778 -9965 -5894 10045 23293 21747 19447 15268 9439 -3607 -17063 -7005 -1616
11703 -1616 -7678 -14830 975 -6297 -8108 -2942 -4495 -5545 -15717 -14353 6919 28115 15164
11690A5164o72m420k380r18J4648j1725j2842k724P930R683q841j8258m583J8962
11676i76K4944M027k0411j0774q010j3016R567j1319o36J1195n80J4146K867Q423
11662I447J6009J0348q720J1840Q656k9221k8493n394J2334r032o118J0080J5431
11649G167J1281q846M20j667n938r028n177L499J1344J110j6240O6j186J0037
11635c158R509Q949K317J0658j2232O22j5404j1850J0627o23r864O372n079m245
11621a3401M906p164J3582J0954m854k691o215j0663O613K0833J8824j5807j6152
11608a235j8268j9148K973K2069J367p85J785J5605j270k2891j064K5233Q280
11595A2651j4935p777J0482J9686o677j5887P613O394J8527k410k3016p097r969
$$ plain form
11690 15164 14492 10072 7692 6774 21422 9697 -3145 -5869 2061 11744 2903 -15355 -19938 -976
11676 -976 23968 27995 7584 -3190 -11200 -24216 -14649 -25968 -26604 -15409 -15989 -1843 1024 9447
11662 9447 25456 35804 27084 38924 47580 18359 -10134 -15528 -3194 -12226 -18344 -8264 7167
11649 7167 18448 9602 10022 8355 2417 -6611 -11788 -8289 3055 4165 -12075 -12009 -13195 -3158
11635 -3158 6351 15300 17617 28275 16043 16665 1261 -10589 38 -585 -10449 -4077 -9156 -13401
11621 -13401 -8495 -15659 -2077 8877 4023 1332 -4883 -15546 -8933 11900 30724 14917 -1235
11608 -1235 -19503 -38651 -35678 -13609 -12242 -13027 -11242 4363 3093 -19798 -20862 4371 12651
11595 12651 -2284 -10061 421 20107 13430 -2457 5156 11550 30077 27667 4651 -2446 -12415
11582a2415o819K1641K1719m790k1412l781J528m948K306o433N952o709P611R395
11568B845L5J2837j2203q480q722m418j2469M828J8908P806j2722L452n38K504
11554f337J951j4270k2806P863K0422O762k452J8300R446j4017k8518Q146R46
11541a4564P32q234J4787J5607o034M028j773N913j015j2213j056k778J2059m376
11527A083M556K4400j1549k1617K0530n687k0172m670J2620j6898r875K0146J1057
11514C924L986k3457J2082K0011p449j5210p451J7679n780M086R817p495j2980
11501h237k0028r433Q251Q758K666N051j1989O797K4942O068J7169R461n21o255
11487C2700j7765j1780j3926J0380k120j7199j0212K319j115K993J886J1109O495
$$ plain form
11582 -12415 -19234 2407 24126 19336 -2076 -5857 -4329 -9277 -6971 -13404 -7452 -14161 -6550 2845
11568 2845 2880 15717 3514 -4966 -13688 -18106 -30575 -25747 -6839 967 -11755 -8303 -8841 -6337
11554 -6337 -4386 -18656 -41462 -33599 -13177 -6415 -8867 9433 18879 4862 -23656 -15510 -14564
11541 -14564 -13832 -22066 -7279 8328 2294 6322 4549 10462 9447 -2766 -3822 -6600 5459 1083
11527 1083 5639 30039 18490 -3127 17403 11716 -8456 -13126 -506 -17404 -27279 -7133 3924
11514 3924 7910 -15547 -3465 16546 9097 -6113 -13564 4115 -1665 2421 12238 4743 -8237
11501 -8237 -28265 -37698 -29447 -20689 -18023 -12972 -24961 -18164 6778 12846 30015 39476 38955 32700
11487 32700 14935 3155 -10771 -391 -2511 -19710 -29922 -27603 -28718 -25725 -23839 -12730 -6235
11474f235k242P050J0479k2375L801K7226Q618k3491j0640K859j4213j6660J2879
11461b2944J0320j6207P634K1349J1318k0908k872M332j387N327m785J911n867
11448a2779M784M460l615j809m229k5339O392P386J3271j0728j2853K717j4885
11435d7227O098J4188j4621J9158L1314J087l515L086j3790l880k640p59j3323
11422b4824J8317L3126j3396Q224N247k013k9176k4249J6959M331k2427K3053
11410f828K1392j5606j4634j022J4869L76m756N705o578j7655J3J5130P898j4494
11396a6190j7723Q220R850j2231r233R056l900j051J9668l392o037j25J3673J6797
11382G382k670p118k391Q579k2664k8406K3591J2549r60n014p299R220J6189o292
$$ plain form
11474 -6235 -8477 -1427 9052 -13323 -9522 17704 26322 2831 -7809 -4950 -19163 -35823 -22944
11461 -22944 -12624 -28831 -21197 152 11470 -9438 -12310 -7978 -9365 -4038 -8823 -6912 -12779
11448 -12779 -7995 -3535 -7150 -8959 -13188 -38527 -32135 -24749 -11478 -22206 -35059 -32342 -47227
11435 -47227 -41129 -26941 -41562 -22404 8910 9997 6482 9568 -4222 -8102 -10742 -11501 -24824
11422 -24824 -6507 26619 13223 21447 26694 24681 -4495 -28744 -11785 -7454 -29881 -6828
11410 -6828 14564 -1042 -15676 -16698 -1829 -1453 -6209 -504 -7082 -24737 -24724 -9594 -1696 -16190
11396 -16190 -33913 -25693 -15843 -28074 -37307 -28251 -32151 -33202 -13534 -16926 -22963 -23088 -9415 7382
11382 7382 4712 -2406 -4797 3782 -18882 -47288 -23697 -11148 -12108 -17122 -24421 -15201 988 -5304
11368e304O928J0174L188M096m545j3436j114L680R748R489l739J2621l13j0433
11354B1040j1444j0724L314m88j1340m900J098j4319k554m015P834J862m877J1809
11340a7704q159K204J6657J541J4909P386k3468J0307K4880n266j5781k0132N398
11327g228O275M270j3063k846J864J4635l863j0276Q254R047j1507k2217L833
11314b2822n912M757J6055J0458M534R405p407j8018j6527j261J9544R351K567
11301D724Q60J6075j0142m3J3781j9330k1840N655Q501K0293N576l6297N059K6294
11287A9166j5777k0146O969K465M25M443J4192R209N330K634j8402m70P77k5920
11273a5105o061J3809J8441j420J850J7793k253j6829j735O982r341q761J4002
$$ plain form
11368 -5304 1624 11798 14986 19082 14537 1101 -13 3667 13415 22904 19165 31786 31473 21040
11354 21040 9596 -1128 2186 1698 -9642 -14542 -13444 -27763 -30317 -34332 -26498 -24636 -29513 -17704
11340 -17704 -25863 -23659 -7002 -5461 9448 16834 -6634 3673 28553 23287 7506 -12626 -7228
11327 -7228 -953 3317 -9746 -12592 -10728 3907 44 -10232 -1978 7069 -4438 -26655 -22822
11314 -22822 -28734 -23977 -7922 2536 7070 16475 9068 -8950 -25477 -26738 -7194 2157 4724
11301 4724 5584 21659 11517 11474 25255 5925 -15915 -10260 -1759 18534 24110 -12187 -7128 19166
11287 19166 3389 -16757 -9788 -7323 -6898 -2455 11737 20946 26276 28910 10508 10038 10815 -15105
11273 -15105 -21166 -7357 11084 9664 11514 29307 27054 10225 8490 15472 6131 -2630 11372
11260A1372%j748K868n736K147J6992k969k6641o070J4532J6132o305j4050r969
11246i445J1900p183k4275q865M907P243p677j3615M814J9460K5473J7433q381
11233A1789q98j112j7906m417r468k360M00P316j2079m596L1040J0944j360k204
11219E089q535p792K027M966J9950O323r301r451p27M160k6074k3685J7445L7062
11205A1457J521j0922P514j8526K650r70L662M899m092j2193j5012j7485P717
11192c9780N163M391J8196N134l801j785j0088J6146K5132j6501j3097L697N755
11179a438j9015L414L795p435k875J0038M873j6978J6645K3528r670j1507L551
11166c074r92J446K723M488K789j0800r195J5706P440K381o132o398J1547K0743
$$ plain form
11260 11372 11372 9624 12492 6756 8903 25895 22926 -3715 -9785 4747 20879 14574 524 -9445
11246 -9445 2455 -4728 -29003 -37868 -32961 -25718 -33395 -47010 -42196 -22736 2737 20170 11789
11233 11789 10891 9779 -8127 -12544 -22012 -24372 -23972 -16656 -28735 -33331 -2291 8653 7293 5089
11219 5089 -3446 -11238 -9211 -4245 15705 22028 12727 3276 2549 6709 -19365 -43050 -25605 11457
11205 11457 12978 2056 9570 -8956 -6306 -7276 -3614 1285 -2807 -15000 -30012 -47497 -39780
11192 -39780 -34617 -30226 -12030 -6896 -10697 -12482 -22570 -6424 18708 2207 -10890 -7193 -1438
11179 -1438 -20453 -17039 -13244 -20679 -23554 -13516 -8643 -25621 -8976 14552 4882 -6625 -3074
11166 -3074 -4066 -2620 103 4591 7380 -3420 -12615 3091 10531 12912 6780 382 11929 32672
11152C2672P44k2508k3590J4721K533R31J8184P00p723k4695q622m997P388M388
11138i874J1128L132r084l362K6031K1566O20r370l7640k1424J173K6346K2589
11125B1831K653k584p18j0643o094j2839J3365p269r448J1443J3716j5563O314
11112D164p159j9929Q228K4867o675L538j078k1053k0154j0342N829J4037J3626
11099a2101M152j9039j0370k712J2101J5728k542p359j7063L011L0285l881j3601
11086b3391m192R415J0600J5279J5677l096j1520k161N650N141n871J4877N652
11073C2060j9179j9415K686j1793p767R446J143m810q508l850Q414J3968Q241
11060F36K7391Q393l451j4008k2999j0402N69n717l165J9903J3399j6803N663
$$ plain form
11152 32672 33416 10908 -12682 2039 4572 5503 23687 24387 16664 -8031 -16653 -21650 -14262 -9874
11138 -9874 1254 4386 -4698 -8060 17971 39537 40157 30787 -6853 -28277 -27104 -758 21831
11125 21831 24484 21900 21182 10539 4445 -8394 4971 -2298 -11746 -303 13413 -2150 4164
11112 4164 -2995 -22924 -14696 10171 3496 7034 5956 -15097 -35251 -45593 -39764 -25727 -12101
11099 -12101 -7949 -26988 -37358 -40070 -27969 -12241 -14783 -22142 -39205 -36194 -5909 -9790 -23391
11086 -23391 -27583 -18168 -7568 7711 23388 20292 8772 6611 12261 17402 11531 26408 32060
11073 32060 12881 -6534 -3848 -15641 -23408 -13962 -12819 -17629 -26137 -29987 -21573 -7605 636
11060 636 28027 36420 32969 18961 -4038 -14440 -13871 -19588 -22753 -2850 10549 -6254 -591
11047e91L898q151n201L672J317n904r400K759K0118J1910o750k5920j1240Q700
11033b0783M009j3528j4245J9387J1423l864K3358m085j127P971J4661p628P51
11020A6300R496j9979j1131N958q572p804Q166K443l623K4676Q073j3106p749
11007C148P458p796m501K84j1013K3855J3968j740Q078j7858n55K814j135P243
10993B2250j6477j7512R739J4259J6724q300k3085j6823m748R63L446R888q719
10980a8395n513N206L07j3794J6686J2247L33k129M312M783m659L319N414J68
10966H285j909p888l0892M243J3364k585Q622l617K881J3982p089j8890J2579
10953h914J7453o54J650O506k596j2455K465K747k813j4680k2683J4678J1896
$$ plain form
11047 -591 3307 -4844 -10045 -6373 -5056 -10960 -20360 -17601 2517 14427 7677 -18243 -29483 -20783
11033 -20783 -16774 -30302 -44547 -25160 -13737 -17601 5757 1672 545 8516 23177 15549 16300
11020 16300 25796 5817 -5314 644 -7928 -15732 -7566 -5123 -8746 15930 24003 10897 3148
11007 3148 10606 2810 -1691 -1407 -12420 11435 25403 23663 31741 13883 13328 16142 15007 22250
10993 22250 5773 -11739 -2000 12259 28983 20683 -2402 -19225 -23973 -23010 -19564 -9676 -18395
10980 -18395 -23908 -18702 -18395 -32189 -15503 -3256 -2923 -5052 -740 4043 -616 2703 8117 8285
10966 8285 6376 -1512 -32404 -28161 -14797 -17382 -8760 -12377 -9496 4486 -2603 -21493 -8914
10953 -8914 8539 7885 9535 16041 13445 990 3455 6202 3389 -11291 -33974 -19296 -7400
10940g400N627M494n548N232M244R871L362p184j2580K557j4809o309n064j3312
10926c6819j0502J2070K0718j678J602q159P38q449P551Q41o819j2617J0623L0019
10912h81J5260L88M76k88o930j1175j6894k676N605j1125K0195L2884K274j1831
10898A5282o967j7267J2165J0554p677J450Q299k6j6107k347p424l645j832j787
10884a7329K1227l639p318r900J2697J6409o194r301l601J1059j4866o313K1273
10871D204J1987l578qJ4948J5031m742l69j1700j6167j2708j1239N342J1920j432
10857A489J2381p937j9784O774R765R140n795j9414K486k735Q68J0520J7448K865
10843A8071m346j6480j7838m607j8824l3K3294J7728j518J7197O838q337O577
$$ plain form
10940 -7400 -1773 2721 -2827 2405 6649 16520 19882 12698 118 2675 -12134 -18443 -23507 -36819
10926 -36819 -47321 -35251 -14533 -16211 -14609 -22768 -22030 -30479 -22928 -22087 -28906 -41523 -30900 -881
10912 -881 14379 14767 15243 14955 8025 -3150 -20044 -22720 -17115 -28240 -8045 24839 27113 15282
10898 15282 8315 -8952 3213 13767 6090 7540 15839 15813 -294 -2641 -10065 -13710 -15542 -17329
10884 -17329 3898 259 -7059 -16959 -4262 12147 5953 -3348 -6949 4110 -10756 -17069 4204
10871 4204 16191 12613 12605 27553 42584 37842 37473 25773 9606 -3102 -14341 -8999 2921 1489
10857 1489 13870 5933 -13851 -7077 2688 11828 6033 -13381 -10895 -13630 -12762 -2242 15206 18071
10843 18071 13725 -2755 -20593 -25200 -44024 -44057 -20763 -3035 -4553 12644 19482 11145 17722
10830A7722k927j4961j5574j2305J5921k334O95J1906J8174j1210j3080l456O993
10817d436j7166j1818M186K4023K139O402q187p861M261M778J952J2409j2472
10804a790o532N495K161J3488N728o807K3794n345k8340j0008j9597j1852p983
10791d7588P84Q93k443O686J2438K7621L94m859R679R734O515k0088j4835j173
10777a6242K5200l03r515p951o582Q295K346m232N636J502L881M518Q935Q906
10763B4394j5109J861L250j7645n949J4040P152k0481J4479P361j5759J596o965
10750g775J0328J5159l670k2872Q789k0959n768q34K015j0099p139j810J717N992
10736c6926J2034j665J1434m157j1491O404J3041P857J0785J914J2906k12L251
$$ plain form
10830 17722 14795 -166 -15740 -28045 -12124 -14458 -13763 -1857 16317 5107 -7973 -11429 -4436
10817 -4436 -21602 -33420 -29234 -5211 -3072 3330 -4857 -12718 -8457 -3679 -1727 10682 -1790
10804 -1790 -8322 -2827 -666 12822 18550 11743 35537 30192 1852 -8156 -27753 -39605 -47588
10791 -47588 -46804 -45911 -48354 -41668 -29230 -1609 -1215 -6074 3605 13339 19854 -234 -15069 -16242
10777 -16242 8958 8655 -860 -8811 -15393 -7098 -4752 -8984 -3348 -1846 2035 6553 15488 24394
10763 24394 9285 11146 14396 -3249 -9198 4842 11994 -8487 5992 13353 -2406 -810 -7775
10750 -7775 2553 17712 14042 -8830 -41 -21000 -26768 -27602 -25587 -35686 -42825 -44635 -42918 -36926
10736 -36926 -24892 -26557 -15123 -19280 -30771 -24367 -11326 -3469 7316 9230 22136 21924 25175
10723B5175J3857J6835j4963j0813L256k3052p444L33j0406P820Q40n662r389
10710a3613J5583J6555O956n824j9355o178l464l047q801m549k610K1052J907
10697e388l479q135p441J4599L0680O535k5764j9981k64j8135j02m194O196J5605
10683a9268K4813N319p785j1802k172K0931R162j0916j1339j2978J3946n391L716
10670c764J4946J5186K379p597p911m549N343j2396j2221J0608N906L507j7120
10657g683j7251P691N177o48J0349P541j0602J939j2965p059q95m849q748Q510
10643b9493J6806j031L989M236J0274l969j3330Q215p774o692O062O016J2241
10630E550Q802J0342Q717k6860j7868k526O495J0037J833J255l677O495L308J559
$$ plain form
10723 25175 39032 55867 40904 30091 33347 10295 2851 3184 -7222 598 1438 -4224 -13613
10710 -13613 1970 18525 25481 19657 302 -5876 -9340 -12387 -21188 -25737 -28347 -7295 -5388
10697 -5388 -8867 -17002 -24443 -9844 20836 27371 1607 -18374 -18638 -36773 -36875 -41069 -34873 -19268
10683 -19268 5545 10864 3079 -8723 -10895 10036 19198 8282 -3057 -16035 -2089 -7480 -3764
10670 -3764 11182 26368 28747 21150 13239 8690 14033 1637 -10584 24 5930 9437 -7683
10657 -7683 -24934 -17243 -12066 -12714 -2365 5176 -5426 -3487 -16452 -23511 -24406 -29255 -38003 -29493
10643 -29493 -12687 -13718 -9729 -5493 4781 812 -12518 -4303 -12077 -18769 -12707 -6691 5550
10630 5550 14352 24694 33411 6551 -11317 -13843 -7348 2689 4522 5777 2100 8595 11903 13462
10616A3462k207o259J708P58r690q763k615m494P607J6264k0616j8291J4123K4522
10602E509O68K724O764O663L200j3111p922mJ4299J1788J8672k7336k6963k568
10588g617Q966j3001O312P678j7084M521J5378L190N441j4224k3050n883K3157
10575f216J2438j0344l021L475J739p777k8147r239O533K9149J5709O29j9663
10562a4735k1854q559J2591K3915J9809J4025p973q404p902M307J8003j4738l0371
10549b1886L478Q626j3529j7790J785j1469J0645J3324K000r581J6440J8278n096
10536d775J6826L519j226J6413J9952j7199j4241k2583j1716K884j251o959Q034
10523a2322k875j0111k529J4734j245O442M404J0679k7412j0651j0978J4914J5313
$$ plain form
10616 13462 11255 4996 6704 7462 -2228 -10991 -13606 -18100 -10493 5771 -14845 -33136 -19013 5509
10602 5509 6177 8901 15665 22328 25528 12417 4495 4491 18790 30578 49250 21914 -5049 -7617
10588 -7617 1349 -11652 -5340 2338 -14746 -10225 5153 8343 13784 -440 -23490 -29373 -6216
10575 -6216 6222 -4122 -7143 -3668 -1929 -9706 -37853 -47092 -40559 -11410 4299 4928 -14735
10562 -14735 -36589 -45148 -32557 -8642 11167 25192 17219 8815 913 5220 23223 8485 -21886
10549 -21886 -18408 -9782 -23311 -41101 -39316 -50785 -40140 -26816 -24816 -34397 -17957 321 -4775
10536 -4775 12051 15570 14344 30757 50709 33510 19269 -3314 -15030 -12146 -13397 -20356 -12322
10523 -12322 -15197 -25308 -27837 -13103 -14348 -7906 -3502 7177 -20235 -30886 -41864 -26950 -11637
10510a1637J4235P120p299p3k0315J9016P705m402n009l175Q492m824j1537j0344
10496b2047M831J1616J378J863J534j5069j877J8318m841j0275k165m921K4260
10483B605J5407j2902p951n005R774J3030J6282K447p643k0694j9506r031N573
10470a7614J7937J901Q661m297L206J1257M971o070O553L660M069k6352o875M598
10456E605j800L75k2419J540J9258j8053j3589k637J5031J3801j235j359J4287
10443H805q315o751j0756n4R798K927M460K2756J7102O824K039k7746j5254l712
10429B123O565K820j0704K794k914R537J3234L815j8200q568k3514j2781K0231
10416a5562n089j2025L310K864K7791J5564j219M000r058P74o640K923j1183q869
$$ plain form
10510 -11637 2598 9718 2419 2346 -17969 1047 8752 4350 -659 -3834 4658 -166 -11703 -22047
10496 -22047 -17216 -5600 -4222 -2359 -825 -15894 -17771 547 -4294 -14569 -16734 -21655 2605
10483 2605 18012 5110 -2841 -7846 1928 14958 31240 33687 26044 5350 -14156 -23187 -17614
10470 -17614 323 2224 10885 6588 9794 21051 26022 19952 26505 30165 34234 7882 1007 5605
10456 5605 3805 4180 -18239 -16699 2559 -15494 -29083 -31720 -16689 -2888 -4123 -5482 8805
10443 8805 490 -6261 -17017 -17071 -7273 -4346 114 22870 39972 46796 48835 21089 5835 2123
10429 2123 8688 11508 804 3598 684 10221 23455 27270 9070 502 -23012 -35793 -15562
10416 -15562 -20651 -32676 -29366 -26502 1289 16853 15634 19634 10576 11350 4710 7633 -3550 -12419
10402a2419K2379J9958k3807j5173M957Q367L075j4729q507Q459K881K861k3734
10389b5432l3285N284O868K5717R762o680O738O75J319R057r517j4946O549M020
10375a3871M144J911j782j6337J4921K4369j2019n737J6372j4115L17N387J8293
10362B1853o143k5510j3434j406k167j3135m185K2643J4688o06j4607j4703Q565
10349b8147M121L364j896P852K5563J2165l948k0600q192K581K258P993J0122
10336A3236r277N10P910R144n40j0295j2268j9858J904N115P340q798K192j0520
10322b4205J7929J0873r365l938J5292K5561p70k1134k2789Q730K080K0709J1034
10309C0007m390k5640L060K170k2609K573J2200m74n208j3778p540N021l629l361
$$ plain form
10402 -12419 9960 29918 6111 -9062 -4105 4262 7337 -7392 -15899 -7440 -4559 -1698 -25432
10389 -25432 -58717 -53433 -46565 -20848 -11086 -17766 -11028 -10353 -9034 23 -9494 -24440 -17891 -13871
10375 -13871 -9727 -7816 -9598 -25935 -11014 13355 1336 -4401 11971 -2144 -1827 3560 21853
10362 21853 15710 -9800 -23234 -24640 -26807 -39942 -44127 -21484 -6796 -7402 -22009 -36712 -28147
10349 -28147 -24026 -20662 -22558 -14706 10857 23022 19074 -1526 -9718 -7137 -4879 3114 13236
10336 13236 3959 4469 12379 21523 20983 10688 -1580 -21438 -19534 -14419 -7079 -15877 -13685 -24205
10322 -24205 -6276 4597 -4768 -8706 6586 32147 31377 10243 -12546 -3816 -1736 18973 30007
10309 30007 25617 -23 3037 5207 -17402 -14829 -2629 -3103 -8311 -22089 -29629 -24608 -28237 -31598
10295c1598j716P864l294j6612L297J111n20R579J2638J632M124j68l175J566
10281a5272j082L903J2861J0431L845K435J598o521k178m989j6765o056q906R701
10267a6995J8507J9869J9491J119K398j9870k1146p020M980J0389j232j4525K255
10254a780R887J0799k302l1098j5498m523l476l31J5074N133p989O330K1958p466
10240e282j2149n725j052R312P996J1188J1229o859j2644q22q041J8601L023n047
10226C728j11P429l129l200j5023p320O134J6940K291q173n896K2786J0122j9206
10212G372r903P030O014N167j0099l939j8356M884J8089p745O684J8415L913j3613
10198A3913r568J9213Q308o575K33k4953r112j8024Q737O262Q731m009K130R572
$$ plain form
10295 -31598 -33314 -25450 -28744 -45356 -42059 -40948 -41468 -31889 -19251 -17619 -13495 -13663 -16838 -15272
10281 -15272 -16354 -12451 410 10841 14686 17121 18719 12198 10020 5031 -11734 -17790 -26696 -16995
10267 -16995 1512 21381 40872 41991 44389 24519 3373 -3647 1333 11722 10490 -4035 -1780
10254 -1780 8107 18906 16604 -14494 -29992 -34515 -37991 -38322 -23248 -18115 -26104 -19774 2184 -5282
10240 -5282 -17431 -23156 -24208 -14896 -6900 4288 15517 8658 -3986 -4808 -12849 5752 8775 3728
10226 3728 3617 11046 7917 4717 -10306 -17626 -11492 5448 7739 -434 -6330 16456 26578 7372
10212 7372 -2531 4499 10513 15680 5581 1642 -16714 -11830 6259 -1486 5198 23613 27526 13913
10198 13913 4345 23558 31866 25291 25524 571 -8541 -26565 -17828 -11566 -2835 -6844 -4714 4858
10184D858q406O335j851q073N34J0721J2648l01q254J008N575k6905j5032J5984
10170a1159P235m852r516N519J9646L2256j5643k1056m855r472n925J1445q567
10157a4944J898R723O103K0011K710j3381j3994J6314M360k3091k7699J2789K3586
10144D385R085k115j1421k1820l457P375M861N228j0421j0526J0151O820N51J506
10130i798K2781N523O142J413k640p462M925o327o849K992l343j3046o818K978
10116i529r493L680j5995J2116j2164L235J3257J0739K950j6874j3401P476J3775
10103a0228J3802p036k7251Q8J7009j8259l071R60P038J8825k3895p988L3611
10090f395J749n295n5J7190R292q586j6099r463r39j0238k5839K1448J0330L430
$$ plain form
10184 4858 -3548 2787 936 -7137 -6603 4118 16766 16465 8211 9219 14794 -12111 -27143 -11159
10170 -11159 -3924 -8776 -18292 -12773 6873 39129 23486 2430 -2425 -11897 -17822 -6377 -14944
10157 -14944 -13046 -3323 2780 22791 25501 12120 -1874 14440 18800 -4291 -31990 -19201 4385
10144 4385 13470 11355 -66 -21886 -25343 -17968 -13107 -7879 -18300 -28826 -18675 -11855 -11304 -9798
10130 -9798 12983 18506 24648 26061 23421 15959 20884 14557 7708 10700 7357 -5689 -12507 -9529
10116 -9529 -19022 -15342 -31337 -19221 -31385 -28150 -14893 -4154 -1204 -18078 -31479 -24003 -10228
10103 -10228 3574 -3462 -30713 -30625 -13616 -31875 -34946 -33986 -26948 -8123 -32018 -40006 -6395
10090 -6395 -4646 -9941 -9996 7194 16486 7900 -8199 -17662 -18601 -28839 -54678 -33230 -22900 -19470
10076a9470N062J032O988m961j1696J2626L8004j1621K713J8413j2438j2179j2207
10063B66O993n169q098r925k778J8733Q202P677Q691P985m840r722j4028q046
10049d059m000J664K0666J5724K107K2320K5322l1820k1638r340j4829K332J5920
10036B0369j4945l4640N069P706M815Q657J1123J7011k1198j8195J2729r581r350
10023b0430O72J0490L0154j1250J35J9135n099j8419J3893J6851r310J098j7803
10010A0117o544p541p052o846K0334L462j589k4106q25Q818m278L934J4494Q62
9996C240J9291N561r438k3049J9145K7677n121j1260p006j3988j0951m920k522
9983a3341K981k239L03J2533k3802n199R525L2231K05m26O773o724j356m505j7520
$$ plain form
10076 -19470 -14408 -13376 -6388 -11349 -23045 -10419 27585 15964 18677 37090 24652 12473 266
10063 266 7259 2090 -6008 -15933 -18711 22 8224 15901 24592 32577 27737 18015 3987 -4059
10049 -4059 -8059 -6395 14271 29995 32102 54422 79744 47924 26286 16946 2117 4449 20369
10036 20369 5424 -29216 -24147 -16441 -11626 -2969 8154 25165 3967 -14228 -1499 -11080 -20430
10023 -20430 -19758 -9268 20886 9636 9771 28906 23807 5388 19281 36132 26822 27920 10117
10010 10117 3573 -3968 -11020 -17866 2468 5930 4341 -19765 -20590 -11772 -16050 -12116 2378 3240
9996 3240 22531 28092 18654 -4395 14750 42427 37306 26046 19040 5052 -5899 -10819 -13341
9983 -13341 -10360 -12599 -12296 237 -23565 -28764 -19239 12992 13197 12771 19544 12820 11464 6959 -10561
9968a0561k0827k812P168K1928M235p178P992n216J581J7058J9734J819l38j517
9954C3066q078p102N943m200j9334p450l82M719J1733Q641J0886k5191j1356J7802
9940I697M543k727l560N454Q023Q389j3214j9825k617O933j5621o849l977K1323
9926d028R397j4297n93K006J4382J1318k384J8333r915r622j4254k348P262N725
9912A0982j9529m0262J2375K5265M638K0659k962k7145o719N566Q950j0782k0635
9899c9599P844K0275K3910n334k123k120J702K292l914N524J2658J5236J4992
9886E1343j272R34j3446j8015j249m877j768j910o119P391m190j3583J968n694
9872a0487L405p693m796K19K4467J4670o610k9368j5520K2976K3106l958N845
$$ plain form
9968 -10561 -31388 -34200 -27032 -5104 -869 -8047 -55 -5271 -3690 13368 33102 34921 34583 33066
9954 33066 24988 17886 23829 19629 295 -7155 -7537 -2818 8915 17556 28442 3251 -8105 9697
9940 9697 14240 11513 7953 13407 21430 29819 16605 -3220 -5837 1096 -14525 -21374 -25351 -4028
9926 -4028 5369 -8928 -9521 -7515 6867 18185 15801 34134 24219 14597 343 -2005 5257 10982
9912 10982 -8547 -48809 -36434 -11169 -6531 14128 11166 -15979 -22698 -17132 -8182 -18964 -39599
9899 -39599 -31755 -11480 12430 7096 4973 2853 4555 6847 2933 8457 21115 36351 51343
9886 51343 50071 51005 37559 19544 18295 13418 11650 9740 3621 11012 6822 -6761 -4793 -10487
9872 -10487 -7082 -14775 -19571 -19352 5115 19785 13175 -16193 -31713 -8737 14369 10411 16256
9859A6256J0433j9663j2202p3R298J1269N659O305K1421O011q777j9017N297P735
9845C9952r963j7578L268K411p648p120j6903J864N71j508j1799L786J2021J3643
9831D997P003q77J216K2125J177o918j9333m586j1415k953L147J4218J4150Q642
9817C0593j1510j0817j977J472j6924M457J8187K2347k658m534j7277o553j289
9804C517J2055q302M262m734j0259k952Q111P035q243k103P585R212J7510O758
9790C9452j1069k2416R166j1510r404L37P590k485p516k735J4962O696j1228r31
9776a091JJ1756R884j589p707j1310J121O528J691R749m737J8300o21q613P021
9761C0383j1423O600M36m06J658j225j514k0265k1737K26q448j1462J4486o948
$$ plain form
9859 16256 26689 7026 -5176 -5249 4049 15318 20977 27282 48703 54714 45937 26920 32217 39952
9845 39952 29989 12411 15679 18090 10442 3322 -13581 -11717 -11146 -12654 -24453 -20667 -8646 4997
9831 4997 12000 11123 12339 34464 35641 28723 9390 4804 -6611 -9564 -6417 7801 21951 30593
9817 30593 19083 8266 6289 7761 -9163 -4706 13481 35828 33170 28636 11359 4806 3517
9804 3517 15572 7270 11532 6798 -3461 -6413 1698 8733 490 -1613 5972 15184 32694 39452
9790 39452 28383 5967 15133 3623 -5781 -5444 2146 -339 -7855 -10590 4372 11068 -160 -1091
9776 -1091 -1090 10666 20550 18961 11254 -56 1065 7593 9284 19033 14296 32596 31975 23362 30383
9761 30383 18960 25560 25996 25590 27248 26023 24509 4244 -17493 -17267 -25715 -37177 -22691 -29639
9747b9639j7179Q95J5611J7999J6387j2151N783k63j0152M565J9478J4582k823
9734B3093j2224j7781N759o940J3931J0387m491o971j739J4585O435n13O32k4014
9720A49l4514J411P601R242R598J2324K753j2433j0426k775m89M434Q429j1414
9706a6110O509j809N020J0285j136r288p326k3332J1866J6892J4541J0064K393
9693A8569j0921P546J9547n419j3030j6139q709N654j3732o272j0813K3691J5019
9680D991j5443K0205M238j3591j2676k2090j793J7560K391k3936j8484J4710N916
9667c8002N79M885J3340Q489j2444q8N00K012L817J1887j5907k974O604Q151L592
9652e559l387k0963j415K7425L427N864K092l537O756p810j5574J1310Q922J0747
$$ plain form
9747 -29639 -46818 -45923 -30312 -12313 4074 -8077 -2294 -2557 -12709 -8144 11334 25916 23093
9734 23093 10869 -6912 -1153 -8093 5838 16225 11734 4763 3024 17609 24044 23531 24163 149
9720 149 -34365 -32954 -25353 -16111 -6513 5811 8564 -3869 -14295 -17070 -17559 -13125 -4696 -16110
9706 -16110 -9601 -11410 -6390 3895 2759 -6529 -13855 -37187 -25321 -8429 6112 16176 18569
9693 18569 7648 15194 34741 29322 16292 153 -8556 -2902 -16634 -22906 -33719 -10028 4991
9680 4991 -10452 9753 13991 400 -12276 -34366 -36159 -18599 -16208 -40144 -58628 -43918 -38002
9667 -38002 -37423 -32538 -19198 -10709 -23153 -23241 -22741 -20729 -16912 -5025 -20932 -23906 -17302 -9151 -5559
9652 -5559 -8946 -29909 -31324 -3899 -472 5392 7484 3947 10703 2893 -12681 -1371 7551 18298
9638A8298J2622k1411j2281K2447L028J2635J17k4763j2136j452L347o754k4721
9625c1024r816J7238k349L4475P662j1733L905J5562J0903k2075K025K0263j5902
9612A9134k2942j0301l444O217K929K211J1022J1981J4689j5132j456J0253M003
9599B9164j3298P846j336N756J4327N278p697l0642k1578J1100k241k2642Q040
9586a7923J6995J9840J7507k98j0006k4935M182K3069J0371j0231l020k580O938
9573B9909J8391j7614j3372l423J0248j0196j5237l726M090j3824N957Q48P173
9560g76q731R976K4536J0435j8372j8613O424J7596J2521N290n867j4183j7141
9547C095l651J0199J356J4609J0194M400j3237j9342J9247R720j2236k629M197
$$ plain form
9638 18298 30920 9509 -2772 19675 22703 35338 35455 10692 -1444 -2896 451 -6303 -31024
9625 -31024 -40840 -23602 -25951 8524 16186 4453 8358 23920 34823 12748 14773 35036 19134
9612 19134 -3808 -14109 -17553 -11336 -8407 -6196 4826 16807 31496 16364 14908 25161 29164
9599 29164 15866 23712 22376 28132 42459 47737 40040 9398 -12180 -1080 -3321 -25963 -17923
9586 -17923 -928 18912 36419 36121 26115 1180 5362 28431 38802 28571 25551 22971 29909
9573 29909 48300 30686 17314 13891 24139 13943 -1294 -5020 -930 -14754 -8797 -7949 -776
9560 -776 -9507 469 25005 35440 17068 -1545 4879 22475 34996 40286 34419 20236 3095
9547 3095 -556 9643 10999 25608 35802 40202 26965 7623 26870 36590 24354 21725 25922
9534B5922j0146O711M063J5690J3701j0005q328P433r451l168J0478l0341k4300
9521a1741j511N753J3470j0311J667R384J3292k05P816K423J3438L563j8485o327
9507B2226O269J5151J7750l354P28q238j3615q168R218j6241k0870r208k891J8686
9493G443K0998k4074J5533J2491j423P111Q651j0968n713k978K4941N638j614
9480E6036j845Q705j740j1388j1576J7136Q387M558R395j6235j372j672m726j206
9466E2457K279J8481Q492o046k9128j1247J6560L2026K391J366p431m015n761
9453G0424K178m410j0508R404K2668n626k340J3264L4M658n398M739j742q683
9439H8662R451Q914n403q474m813L866P165j1450j1956O216k057J6021L3950K1259
$$ plain form
9534 25922 15776 22487 26550 42240 55941 45936 37608 45041 35590 32422 42900 12559 -11741
9521 -11741 -13252 -7499 5971 -4340 -2673 6711 20003 19798 27614 30037 43475 47038 28553 22226
9507 22226 28495 43646 61396 58042 58770 50532 36917 28749 37967 21726 856 -8352 -11243 7443
9493 7443 28441 4367 19900 32391 30968 38079 46730 35762 30049 27071 52012 57650 56036
9480 56036 54191 62896 61156 49768 38192 55328 63715 68273 77668 61433 60061 58389 53663 52457
9466 52457 54736 73217 81709 75663 46535 35288 51848 83874 86265 87631 80200 76185 70424
9453 70424 72602 68192 57684 67088 89756 84130 81790 95054 95088 99746 94348 99087 97345 88662
9439 88662 98113 107027 101624 93150 88337 92203 99368 87918 75962 82178 80121 96142 130092 151351
9425A51351j8940j5823J7393J3755J816r911L555K4516J2518N611j8214q432J1573
9412A70768J6649q92J651k99K630N561J5808O204L935l297M145K5117J0297n298
9398B52979K258J9045J7349J264M395J7769J641J9983J5716K2651K6715J1170
9386D12935J5945L4814M3495J6778K0177K5733K6581K4630J4057L9039K2356J6271
9374G12811K6064N2176M5143M2309N6232O7939O8769O5149N8253O6685P9082Q9281
9362A429893R2732R2611R6865R1570J02896R8282J07916J04983J20632J21405
9352B459785J26267J03606J03430J10141J03656Q5920M2855K9110J1841j3793
9342C162818j8932m9298p0106r3372r5725j00973j16062j14538r7486j31755j21703
$$ plain form
9425 151351 132411 116588 133981 147736 149552 139641 143196 167712 180230 185841 167627 159195 170768
9412 170768 187417 186525 188176 187877 190507 196068 211876 218080 222015 218718 222863 247980 258277 252979
9398 252979 255237 274282 291631 292895 297290 315059 316700 336683 352399 375050 401765 412935
9386 412935 428880 463694 507189 523967 544144 569877 596458 621088 635145 674184 696540 712811
9374 712811 738875 791051 836194 878503 934735 1002674 1071443 1136592 1194845 1261530 1340612 1429893
9362 1429893 1522625 1615236 1712101 1803671 1906567 2004849 2112765 2217748 2338380 2459785
9352 2459785 2586052 2689658 2793088 2903229 3006885 3092805 3135660 3164770 3176611 3162818
9342 3162818 3143886 3094588 3024482 2931110 2835385 2734412 2618350 2503812 2406326 2274571 2152868
9331B152868j06303j25826j12789q1269r7636q4042p3642q8637r1884q1474o1178
9320A148188o1531o2131l6693n0574n6159n1478o3263m3966l0005m9239k9053
9309F14096j4026k8285k9393l0247j1889q951j453j7651k2805j8235j5526k7184
9297C88451k2275k4811k6554J851j2449j4854j6865m547j1802j1228R423l98l08
9284B53634j4857k7167o185J2556m405k7322L714J4189j0853J209N791n862O077
9271B00519j3825k7634k635J1337j377l717J9863M502J3181j3545j2723l821K077
9258A72202j0917j5637q16j3448k4961P93J6329j3836l344n766q073J4136N32
9245A07194j0088o401J9815K3318k3553j3502p822J6463K6587J1362k9157j1054
$$ plain form
9331 2152868 2046565 1920739 1807950 1726681 1629045 1545003 1471361 1382724 1290840 1209366 1148188
9320 1148188 1086657 1024526 987833 937259 881100 829622 766359 722393 692388 643149 614096
9309 614096 600070 571785 542392 512145 500256 491305 489852 472201 449396 431161 415635 388451
9297 388451 366176 341365 314811 316662 304213 289359 272494 267947 256145 244917 254340 253942 253634
9284 253634 238777 211610 205425 217981 213576 186254 189968 204157 193304 194513 200304 194442 200519
9271 200519 186694 159060 156425 167762 166385 162668 182531 187033 200214 186669 173946 170125 172202
9258 172202 161285 145648 144832 131384 106423 107216 123545 109709 106365 100599 92526 106662 107194
9245 107194 97106 90705 110520 133838 110285 96783 88961 105424 132011 143373 114216 103162
9233A03162k22M927J5428L789J9915O699j8846j4457q890J7159N717k852j5824
9220A15705k2670o902l558k0747j6553R158K073P062K401m999k1483j1345J514
9207B9656K3952J7943M777j1862o259o854P772r538j2131J7155K0050n108j4571
9194E4982J2597J8478m822j4626r674M99J1883J8317r101j2272j4965j4398J7833
9181E4731J6777j6915j2932j3577J0297J0237J282p268N912J3706j6303l684Q188
9168E0451J520o589K889r590r724j7180P512L030M645K3031q424k0303J066n065
9154A7269p719j4132J8187K1906P142Q638J1437O474j2749j7606j0147o791o209
9141A5700K606J1854J5075Q626j9747j2463m129J5118L475m626R465j1663o21
$$ plain form
9233 103162 102940 107867 123295 127084 146999 153698 134852 120395 111505 128664 134381 131529 115705
9220 115705 93035 86133 82575 61828 45275 54433 56506 63568 65969 60970 39487 28142 29656
9207 29656 53608 71551 76328 64466 58207 51353 59125 49587 37456 54611 74661 69553 54982
9194 54982 67579 86057 81235 66609 56935 57434 69317 87634 78533 66261 51296 36898 54731
9181 54731 71508 54593 41661 28084 38381 48618 49900 42632 48544 62250 45947 42263 50451
9168 50451 51971 45382 48271 38681 28957 11777 19289 22319 26964 49995 41571 21268 22334 17269
9154 17269 9550 -4582 13605 35511 42653 51291 62728 69202 56453 38847 28700 21909 15700
9141 15700 18306 30160 45235 53861 34114 21651 17522 32640 36115 31489 40954 29291 28670
9128B8670k631p685n891Q791J5739J5108j7065j8591j0296R904j0196j0281O207
9115A783J0476p995J4136P886O447j2688K640J9642L016j9061J427n334J207K200
9101B5782L07N97L930N034l703j7863j0638N668o952l483M652q25k3681N690L4382
9086A8897N703j3210j3744j802K2544J1935j8833k058L739K239K268r98j1049
9073E631j2667P172Q011K0831l504k7405p577J0837o385J401J6042j1497J0318
9060A1208L295J625j2334k0958L641P609k441J2949L2423J4143j0156j0611p120
9047B3273j0590Q879m677K652n267j9967M712J8299L3387n018j9798N598M65k7409
9033D539j235j140k1849o349k78J7760J3342O198n906P943J0793J1067j5253k3502
$$ plain form
9128 28670 26039 18354 12463 21254 36993 52101 35036 16445 6149 16053 5857 -4424 1783
9115 1783 12259 4264 18400 26286 32733 20045 22685 42327 45343 26282 27709 22375 23582 25782
9101 25782 26089 26686 30616 35650 31947 14084 3446 9114 2162 -1321 3331 2506 -21175 -15485 18897
9086 18897 24600 11390 -2354 -4156 18388 30323 11490 9432 13171 15410 17678 16680 5631
9073 5631 -7036 136 8147 28978 25474 -1931 -9508 1329 -5056 -3655 12387 890 11208
9060 11208 14503 16128 3794 -17164 -13523 -5914 -8355 4594 37017 51160 41004 30393 23273
9047 23273 12683 21562 16885 19537 14270 -5697 -985 17314 50701 45683 25885 31483 31948 4539
9033 4539 3304 2164 -19685 -26034 -26312 -8552 4790 10988 5082 13025 23818 34885 19632 -3870
9019c870K713J469J3408n822j3085K1476J2477N79J0297k1276j9641k7847q560
9006c7682J7166J8649l460M949K4581q072r909q534r506J5356K9565j136j6757
8993A5210m561j21j4086J3560j941r227n970O172J3617Q01j3315P649M856L188
8979A5832n952M714l662j4257R013J2041n711n819j842q658J7868K7405K964P913
8965E1849P325q040j8654Q94j0424l359o882N697K522k153L987j7200n979m811
8951e228J1173M868j1729N468k934o528j1604O115M460R436Q809k861M337l524
8937A0258o322k680O920m751l732P311J5841J5595n148j3319j7232L265o140k5291
8923b5425j5032l24K94J4901R561j0383o836N150J2481j0195R648M012P549Q72
$$ plain form
9019 -3870 -1157 312 13720 7898 -5187 16289 28766 29345 39642 18366 -1275 -29122 -37682
9006 -37682 -20516 -1867 -5327 -378 24203 16131 6222 -2312 -11818 3538 33103 31967 15210
8993 15210 10649 10528 -3558 10002 8061 -1166 -7136 -964 12653 13454 139 7788 12644 15832
8979 15832 9880 14594 10932 -3325 5688 17729 12018 6199 4357 -4301 13567 40972 43936 51849
8965 51849 59174 51134 32480 33374 22950 19591 12709 18406 20928 18775 22762 5562 -417 -5228
8951 -5228 5945 10813 -916 4552 1618 -4910 -16514 -10399 -5939 3497 12306 9445 13782 10258
8937 10258 3936 1256 8176 3425 -307 7004 22845 38440 33292 19973 2741 6006 -134 -25425
8923 -25425 -40457 -40781 -40487 -25586 -16025 -26408 -33244 -28094 -15613 -25808 -16160 -12148 -4599 -3727
8909c727R140J3050l664q667j1718l080J399o079N411J807N063j3854n454J3265
8895g108J7017p923k3845k760L1663K001n215J4264P848j1127k3413l717p98P378
8881e735l459m413K3201J0504o659j9203k7590K656K7077J1925J1091j1314J233
8868I314L482R789M681j7731n164k2685m054j1687J9237M0711J4703L796j5249
8855B9143k0650q601K179J309M819q733O756J2500k322j2212j5863m246j535J1644
8841e812J8606J6703n305o284l404o741j4810r59J6494q775j060M866J5053J6442
8827C5014p949N213N869n281r060o745j5044l4864m695L1673K078O497j864j189
8813c47j0236K080j7512p113J5013r125l215Q957J9356j3876j3670j715J4407
$$ plain form
8909 -3727 5413 18463 14799 6132 -5586 -8666 -7267 -13346 -7935 -6128 -1065 -14919 -20373 -7108
8895 -7108 9909 1986 -21859 -24619 7044 9045 3830 18094 25942 14815 -8598 -12315 -13113 -5735
8881 -5735 -9194 -13607 9594 20098 13439 -5764 -33354 -30698 -3621 8304 19395 8081 9314
8868 9314 12796 22585 27266 9535 4371 -18314 -22368 -34055 -14818 25893 40596 44392 29143
8855 29143 8493 -108 2071 3380 8199 -534 6222 18722 16400 4188 -11675 -15921 -17456 -5812
8841 -5812 12794 29497 24192 17908 14504 7763 -7047 -8006 8488 -287 -1347 3519 18572 35014
8827 35014 27065 32278 38147 32866 23806 17061 2017 -32847 -37542 -5869 -3791 2706 842 -347
8813 -347 -10583 -8503 -26015 -33128 -18115 -27240 -30455 -21498 -2142 -16018 -29688 -31403 -16996
8800a6996J6664J5823k331k0493m407K1714O612r803p625p081O278R770J0179
8787A8304j3558j0703m279q751n142J5002J5494n893j2063j7526k50K561K0137
8774f667K317J8755J3648o272j8703j5647J0225n806o747J4119O323L701J3581
8761B2827j374k9913q176P083O076K2689j4186j9802R020j66j3634j183J2276
8748h463J623J716J256J7521o534q288J2510J1279l916j2496K753j208j1568j4261
8734a8076j308J0857J3708r131j1067R054k200J2535L6763O088r363k2310K469
8721A8019j1068r618J6539P853O576m354q573j88J5113O339J3192J271j0621k0709
8707A9771r248k6906l934J887O390l955N887r26j9255l880J4940K4054J2563J6517
$$ plain form
8800 -16996 -332 15491 13160 -7333 -11740 9974 16586 6783 -842 -7923 -1645 8125 18304
8787 18304 4746 -5957 -10236 -18987 -24129 -9127 6367 474 -11589 -29115 -29365 -26804 -6667
8774 -6667 -4350 14405 28053 21781 3078 -12569 -2344 -8150 -14897 -778 5545 9246 22827
8761 22827 21453 -8460 -16636 -9553 -3477 19212 5026 -14776 -5756 -5922 -19556 -20739 -8463
8748 -8463 -6840 -5124 -3868 13653 7119 -1169 11341 22620 18704 6208 8961 7753 -3815 -18076
8734 -18076 -19384 -8527 5181 -3950 -15017 -5963 -8163 4372 41135 47223 37860 15550 18019
8721 18019 6951 -2667 13872 21725 28301 23947 15374 15186 30299 36638 49830 51101 40480 19771
8707 19771 10523 -16383 -20317 -18430 -12040 -15995 -10108 -11034 -30289 -34169 -19229 4825 17388 33905
8693C3905j595p4p180k3230k1086n21J0330j2849o2J148j1040K9829K5830J2453
8679C5858o601j4831R696n240k4024Q868Q067K3769J1349k7394j3860J9331Q388
8666C3376j6198j6903k0214J0850J2612l071J8119j3856r812m464J448J2380o858
8653b591J063J0260N094L54J873j922J0263q391p127l218j3079j1614O916K2375
8639A0256J9981J6716o614P813r14M145n370k7789j3068Q300p600K1555Q723r908
8625B6226m519l546K328N897k799l928N758q221j1071J4445J1781J1383J9642
8612F3376o296p908Q830J0823j3405j5626o445M039K325p268o640P741j07l730
8598B9709N078K4637L045k3072j2198k074k021K109J2209J2133n545q224K373
$$ plain form
8693 33905 32310 32236 25056 1826 -19260 -19781 -9451 -22300 -22362 -21214 -32254 -2425 23405 35858
8679 35858 29257 14426 24122 18882 -5142 3726 11793 35562 46911 19517 5657 24988 33376
8666 33376 17178 275 -19939 -9089 3523 452 18571 4715 -5097 -9561 -8113 4267 -2591
8653 -2591 -1528 8732 13826 14180 16053 14131 24394 16003 8876 5658 -7421 -19035 -12119 10256
8639 10256 30237 46953 40339 48152 47238 51383 46013 18224 5156 13456 5856 27411 36134 26226
8625 26226 21707 18161 20489 26386 23587 19659 25417 17196 6125 20570 32351 43734 63376
8612 63376 57080 49172 58002 68825 55420 39794 33349 37388 39713 32445 25805 33546 33439 29709
8598 29709 34787 59424 62469 39397 27199 25125 23104 25213 37422 49555 44010 35786 38159
8585C8159j8549J3250J8261l364k3796j4245ok0866k250R534J4875O249J7439
8572C4691N034j0093j4245K562m771P569K836k0226K573R888P725L296Q578Q93
8558C6310k6293j1052M814Q163Q026r452L78j008k1642p562j0008n243J1645J8562
8544d362J6693R239L421K38q664O686q22m001J186R864j4192j9135k246Q545J7361
8529A9811j0734k7535J5129Q677J4481K6388k3073k9291k8108j9341L0304K8554
8517E262Q609n444p789J0170J273m560n154M732N151j413p202J7437K5881r521
8503C7432j0370J0683J9829j0330l4210R888M585j6906n275o434O303j1780M487
8490b098J5641L360Q815J302j2160N137j0195J144n315k418L174O178O961N618
$$ plain form
8585 38159 19610 32860 51121 47757 23961 9716 9710 -11156 -13406 -3872 11003 17252 34691
8572 34691 39725 29632 15387 17949 13178 20747 23583 3357 5930 15818 23543 26839 35417 36310
8558 36310 10017 -1035 3779 11942 19968 10516 10894 9886 -11756 -19318 -29326 -34569 -22924 -4362
8544 -4362 12331 21570 24991 25229 16565 23251 22429 18428 19614 29478 15286 -3849 -6095 2450 19811
8529 19811 9077 -18458 -3329 5348 19829 46217 23144 -6147 -34255 -53596 -23292 5262
8517 5262 13871 8427 638 10808 12081 7521 2367 7099 12250 10837 3635 21072 46953 37432
8503 37432 27062 37745 57574 47244 13034 22922 27507 10601 5326 -1108 5195 -6585 -2098
8490 -2098 13543 16903 25718 27020 14860 19997 9802 10946 5631 3213 6387 12565 19526 25144
8476B5144q524l302j8479m368P013J071J1241m23K292R874j8682p552L134k396
8462c957J3778j386o296m23L079P955J079j0491K78m631j6925J0915J0691j476
8448B190L498M461R138L508l583R030J1226P21j1326j1752k7408k0285P003J5022
8434h557J9604m11o548L221K5466Q04o533m759j3982m888O684j8679l885L230
8420i233j7590J949N801N761m485o51J2592O916N008q353N012j4361k3473j9590
8406e4697R579L2304k765K8983J3984j7584n383P071L556J003J6646O085L3071
8393G1853K1666J5323K9536O0958P0900M8922O27l6744n9000n6621n3095n2288
8381F2037r937j2737j1359p116L487m70k020K1025J852J1454N757j7523j2028
$$ plain form
8476 25144 16620 13318 -5161 -9529 -2516 -1445 9796 9373 11665 21539 2857 -4695 -1561 -3957
8462 -3957 9821 8435 2139 1716 4795 12750 13829 3338 3616 -1015 -17940 -7025 3666 2190
8448 2190 5688 10149 19287 22795 19212 28242 39468 40189 28863 17111 -10297 -30582 -23579 -8557
8434 -8557 11047 10636 4088 7309 32775 33579 27046 22287 8305 3417 10101 -8578 -12463 -9233
8420 -9233 -26823 -24874 -19073 -13312 -17797 -18448 -5856 1060 6068 -2285 2727 -11634 -35107 -54697
8406 -54697 -45118 -12814 -15579 13404 27388 9804 4421 11492 15048 16051 32697 38782 71853
8393 71853 93519 108842 138378 199336 270236 319158 319785 283041 224041 167420 114325 62037
8381 62037 52100 39363 28004 20888 24375 23905 21885 42910 44762 56216 61973 44450 32422
8368C2422j163n35q832k0555n222P02J5157K2618l424J5777O1038P9494P4368
8355B61845N7329J3251k3712n2248n4470n1397l8447m3297k3786L210j0039k0227
8343A8012j0819p254J1295l130R610J0095j5740O257m611j2135K616j0756j6257
8330b2817J0181j088K170J3499J3843R412m23j932k3040K314J8665K909j0455
8317A3238J2560k466R622o024j871Q59k6306j3088J3711r96n963R192J2839J5254
8303C0561j0952q379k5159k301O299n435r26r483M82K0039J3377q755N833K1485
8289B6686J4800K7o187l074j7025Q322l790k255j179L338N813q787n208K947O297
8274B0725j4780q948K6192J5899o090n105o434l085j0393j0483o145J01K1919
$$ plain form
8368 32422 31259 30724 21892 1337 -3885 -3183 11974 34592 31168 46945 107983 187477 261845
8355 261845 319174 332425 308713 256465 201995 150598 112151 68854 45068 48278 38239 18012
8343 18012 7193 -61 11234 8104 17714 27809 12069 18326 13715 1580 4196 -6560 -22817
8330 -22817 -12636 -13724 -11554 1945 15788 25200 24777 22845 -195 2119 20784 23693 13238
8317 13238 25798 23332 32954 26930 25059 25918 -388 -13476 235 -761 -6724 2468 15307 30561
8303 30561 19609 11230 -13929 -16230 -9931 -15366 -16292 -25775 -25293 -5254 8123 -632 5201 26686
8289 26686 41486 41513 35326 32252 15227 23549 19759 17504 16325 19663 25476 16689 11481 14428 20725
8274 20725 5945 -3003 23189 39088 32998 27893 21459 18374 7981 -2502 -8647 -8546 13373
8261A3373N740k1154J4021L162j776j9912j8932P612J1313r7J0250k861m849q34
8247d944J2093n043M772k532P729j9279J242k405M114L544J0638J7791P913J2182
8233D7815m137j8642j4688j8583j7488L982J5433K00O563m246J1146J0979k186
8220A6148j2415P571Q41j0233r555j166q001K3081J8957j0951l545k813k306p17
8206D896P345Jk5829j0684L30N333J1940K9206J1337k2945j3771J2470j0667k248
8192c286k3047l866Q444l600R489J355L26L064j7390J3205l555P705j476J377
8178a1255N719J3129K116k218J2848O904r031j8559q607p822k557L480K166J863
8164a1824R095J81j7498J043J2026n189L977J5621O484j3627k0532J1313J3798
$$ plain form
8261 13373 19113 -2041 11980 15142 13366 -6546 -25478 -17866 -6553 -6650 3600 739 -4110 -4944
8247 -4944 7149 2106 6878 4346 12075 -7204 -5962 -8367 -4253 -709 9929 27720 35633 47815
8233 47815 43678 25036 10348 -8235 -25723 -21741 -6308 -6108 455 -3791 7355 18334 16148
8220 16148 3733 11304 12145 1912 -7643 -8809 -16810 6271 25228 14277 10732 7919 5613 4896
8206 4896 12241 12242 -13587 -24271 -23941 -18608 -6668 22538 33875 10930 -2841 9629 -1038 -3286
8192 -3286 -26333 -30199 -21755 -25355 -15866 -14511 -14185 -11121 -28511 -15306 -18861 -11156 -12632 -11255
8178 -11255 -5536 7593 9709 7491 20339 27243 18212 -347 -8954 -16776 -19333 -15853 -13687 -11824
8164 -11824 -2729 -2548 -20046 -19003 -6977 -12166 -8189 7432 13916 289 -20243 -8930 4868
8151D868J87O305Q051O637J534j0968p379k1746p439K1928O550J7640L964r607
8137B0525k0803n415o82P277j2003l501K387j189P353L680J249o880K1433j7688
8123d257j9725j4607P231O931M775R018J888J6632n868J1302m343j4034n044j1085
8109b1186M399J3788M219J3879j872j1702J3640P205p547l636K3931K992r699
8096B8411r966j1529j1801k879J5067J602n014j1188j1399p888J3485K7231K921
8083A7053l742l129Q544o222q744j709M874R755J1758K0730L278O326j2416R953
8069E6309K3505J477j7916k1971K2525M3115K8767K9667O5432R3237J34714K17318
8057F76179K79853K26570J9943j95243k65559k45622j58662r8562n8763m7389
$$ plain form
8151 4868 5055 11360 19411 26048 27582 16614 9235 -12511 -19950 1978 8528 26168 30132 20525
8137 20525 -278 -5693 -6375 902 -11101 -14602 -12215 -13404 -6051 -2371 -1122 -8002 13431 -4257
8123 -4257 -23982 -38589 -31358 -24427 -19652 -10634 -8746 7886 2018 13320 8977 -5057 -10101 -21186
8109 -21186 -16787 -2999 1220 15099 13227 1525 15165 22370 14823 11187 35118 38110 28411
8096 28411 18445 6916 -4885 -7764 7303 8905 3891 -7297 -18696 -26584 -13099 14132 17053
8083 17053 13311 10182 18726 12504 3760 2051 6925 16680 28438 49168 52446 58772 46356 56309
8069 56309 79814 81291 63375 41404 63929 107044 135811 165478 230910 324147 458861 676179
8057 676179 956032 1182602 1202545 1007302 741743 496121 337459 238897 180134 132745
8047A32745l0778j7533r185P79o533j5289R467J1051L215j951j0285O232Q733
8034H0668K0494L0921L995j1215o30L3681J2540J609K3766K1403L975L0554M6445
8021B98206M6377O9751Q6509J43018K42191L78192N63405P44429Q26003O75054
8011D073135J34566n29503q68182q59406o81872m31551k45938j55313q7219m1462
8001C07255j0661o685k4287q579j0661l7283k9750l3270j3836j827M604p172j3122
7988A14726j9531k3m153k8677k3142j0638o184J0304M848m287j7077O823J9287
7975D2276N304p735p925n122k4972J510K167P108M826J1646J8413n783q360j8848
7961A4505p377J5114K0936O208j955J2550J4969m905k7847j2583p751J911P763
$$ plain form
8047 132745 101967 84434 75249 76028 69495 54206 63673 74724 77939 75988 65703 71935 80668
8034 80668 101162 132083 136078 124863 124233 157914 170454 172063 195829 217232 221207 251761 298206
8021 298206 344583 414334 500843 643861 886052 1264244 1827649 2572078 3398081 4073135
8011 4073135 4207701 3678198 2810016 1950610 1268738 837187 591249 435936 348717 307255
8001 307255 296594 289909 265622 257043 246382 209099 179349 146079 132243 130416 135020 127848 114726
7988 114726 95195 95172 91019 62342 39200 28562 22378 32682 37530 33243 16166 22989 42276
7975 42276 47580 39845 31920 26798 1826 3336 5503 12611 17437 29083 47496 41713 33353 14505
7961 14505 7128 22242 43178 49386 47431 59981 74950 70045 42198 29615 21864 23775 31538
7948C1538j4205p137J43J3495Q564J4973J0007q191j4988l4405j4960J8367N152
7935H353j1316j2415J0729R251L493J287L628Q939P358j2684k3268m292k035l39
7921a3311K5871J9537q758j4782k397q033N707J2168K2889j127k135j237m350
7908C0042j6242j0898j1360M428J1325M892k672l384N54L941p812J1989k518j8869
7894f584j452Q450P404k686O026J2768j1627o96l663r923j1961m223p340L173
7880b2334K441K1610L0151k163p031j7706j4137J8480N396N241J2881J2836l2388
7867A3277l5407K216R192L190k319j0445K1307Q738R03n599K209o262J6012m240
7853A2772j266J27j4097p076j273N326Q824j2117J0584q904j6987k934j0805J7661
$$ plain form
7948 31538 17333 10196 10339 23834 32398 47371 57378 49187 34199 -206 -15166 3201 8353
7935 8353 -2963 -15378 -4649 4602 8095 9382 13010 21949 29307 16623 -6645 -10937 -12972 -13311
7921 -13311 12560 32097 23339 8557 6160 -1873 3834 16002 38891 37764 35629 34392 30042
7908 30042 13800 2902 -8458 -4030 7295 12187 9515 6131 6685 10626 2814 14803 12285 -6584
7894 -6584 -8036 414 7818 5132 11158 23926 12299 11603 7940 -1983 -13944 -18167 -25507 -22334
7880 -22334 -19893 1717 31868 29705 22674 4968 -9169 9311 14707 19948 32829 45665 13277
7867 13277 -22130 -19914 -10722 -7532 -9851 -20296 1011 9749 10652 5053 7262 1000 17012 12772
7853 12772 11506 11633 -2464 -9540 -10813 -5487 3337 -8780 1804 -7100 -24087 -27021 -37826 -20165
7839b0165K7210J0110P896j918j5440j3959o608q665o779J3428J807j4152K935
7826b4300R198K023P686j5061k390R329L484M786P523j0547j710j7903k725R207
7812b1400N009J2009J2207K924k415o891Q415K076o617j1968r469L527Q216l89
7798d766p985j5883j6529J3167J4064m173P067L707M025O264J4512j3041j0358
7785i929K581K2717R878j0723m415R452J642q070j7222j885j6574k904k074Q772
7771a8754K4380J2721J1729k134q522k3467n778J3716j3121j3377J2266J4245
7759C904j4625O502J1533R573n58p09j878j7729J3356R101l854P155j5703j3727
7745g659q523Q516j4872R42J0807k495J517R652J6464r752k1838L099R01j5310
$$ plain form
7839 -20165 7045 17155 25051 23133 7693 -6266 -12874 -21539 -28318 -14890 -13083 -27235 -24300
7826 -24300 -15102 -13079 -5393 -20454 -22844 -13515 -10031 -5245 2278 -8269 -9979 -27882 -30607 -21400
7812 -21400 -16391 -4382 7825 10749 8334 1443 9858 11934 5317 -6651 -16120 -12593 -4377 -4766
7798 -4766 -12751 -28634 -45163 -31996 -17932 -22105 -15038 -11331 -7306 -1042 13470 429 -9929
7785 -9929 -7348 15369 25247 14524 10109 19561 21203 13133 -4089 -5974 -22548 -25452 -27526 -18754
7771 -18754 5626 18347 30076 27942 19420 -4047 -9825 3891 -9230 -22607 -10341 3904
7759 3904 -10721 -4219 7314 16887 16329 15620 13742 -3987 9369 18470 14616 21771 6068 -7659
7745 -7659 -16182 -7666 -22538 -21596 -10789 -13284 -11767 -2115 14349 4597 -17241 -14142 -13241 -28551
7731b8551L2048J7516K026k173j469o147j3120k878J9684K539l1645j3222o428
7718c1820O180J4194j1240k674J763n956n592L276L396O062J3787P724k092j428
7704d420O160q905j922l807n132j2659L085J0771J4032k818o961N727J1147P465
7690A1763R129K967k141j2765p294R050O262j8420K781N579q859k44K480p779
7676g491M314m008j5104M292M626l02R42N568K5516m589k8696o742l756J0598
7662a4832L278L061J9057m605j4219j0311J4681K091p116P918N311J0876J773
7649A6963R437j4053k174K644j4565k8941J371Q480J0777j0771N310j5426o90
7636c1638p038j1611J6143K7625K845k100L165r36J1133j911p775j1038O175J3272
$$ plain form
7731 -28551 3497 21013 23039 20866 19397 13250 130 -2748 16936 19475 -12170 -25392 -31820
7718 -31820 -25640 -11446 -22686 -25360 -23597 -29553 -35145 -31869 -28473 -22411 -8624 -900 -2992 -4420
7704 -4420 1740 -7165 -9087 -12894 -18026 -30685 -27600 -16829 -2797 -5615 -12576 -6849 4298 11763
7690 11763 20892 23859 21718 8953 1659 10709 16971 -1449 1332 6911 -1948 -2192 288 -7491
7676 -7491 -3177 -7185 -22289 -17997 -13371 -13673 -12731 -7163 18353 13764 -14932 -21674 -25430 -14832
7662 -14832 -11554 -8493 10564 5959 -8260 -18571 -3890 -1799 -8915 -997 4314 15190 16963
7649 16963 26400 12347 10173 12817 -1748 -30689 -29318 -20838 -10061 -20832 -15522 -30948 -31638
7636 -31638 -38676 -50287 -34144 -6519 -3674 -5774 -2609 -3545 7588 5677 -2098 -13136 -6961 6311
7622F311j6931l867J1615J4542k660Q784K592L996k020q148J7720j1329n660q913
7608F032p545k0776j1027M017J1099K561J081r713M397L914n605N017J8266j908
7594a90l669q334K274K1658j8824j1872j4640j0994N531J8690K2009R228j7265
7581f398o301l296k7703q44J8683J7745R171J1781J86J2366p590j7334l04N717
7567E879O311q231j0576j7589r736J2622Q047o183J92J42o128Q937J7188o732
7553e857j719J1646o063j1308o908K3113J279L777M157j6305j0607p523L205J5842
7539c271j859q922J9259J5858j4830J299j4298k0468J1266P220q109o287r805
7526c2947m525j182J5075P744J209j1812J3616o163k762j0144r442J1632J4139
$$ plain form
7622 6311 -10620 -14487 -2872 11670 9010 17794 20386 24382 22362 14214 31934 20605 14945 6032
7608 6032 -1513 -22289 -33316 -29299 -18200 -15639 -14558 -24271 -19874 -15960 -21565 -16548 1718 -190
7594 -190 -3859 -12193 -9919 11739 -7085 -18957 -33597 -44591 -39060 -20370 1639 10867 -6398
7581 -6398 -12699 -15995 -43698 -44542 -25859 -8114 1057 12838 13024 25390 17800 466 162 5879
7567 5879 12190 3959 -6617 -24206 -33942 -21320 -13273 -19456 -19264 -19122 -25250 -16313 875 -5857
7553 -5857 -7576 4070 -1993 -13301 -20209 2904 4183 7960 12117 -4188 -14795 -22318 -19113 -3271
7539 -3271 -5130 -14052 5207 21065 6235 7534 -6764 -27232 -15966 -8746 -16855 -23142 -32947
7526 -32947 -37472 -38654 -23579 -15835 -14626 -26438 -12822 -18985 -21747 -31891 -41333 -29701 -15562
7513a5562L717k211m065j101k068o626P605J040k792K2920P848k52o727j6579
7499a4853p17O140k502l197P503J702L029j2930q130j0116K902k6783j378J4172
7485d5158J0768J9668P986j189L155j0873q452M677K0033L4090J839j0152n0022
7472b3630j6111L4577J4063l245j9495j6255J8820K4569j3921j0665Q339J3716
7460A0762N634j3053j8569n817n758r429K5682O82k0411M399J8856J0186p384
7447d220k946L705j3110j6166K9928O360p223n403l959J3391k636J9063L136k7022
7433g102j8020j1058N416K3506J7558l922o888r737J0672L5135l809j4326n429
7420A1996N413j8102r797k158N668j9116j1880R058K1245k43J6935M898j0892
$$ plain form
7513 -15562 -11845 -14056 -18121 -19222 -21290 -27916 -20311 -19271 -22063 857 8705 8453 1726 -14853
7499 -14853 -15570 -9430 -11932 -15129 -7626 -5924 -2895 -15825 -23955 -34071 -31169 -57952 -59330 -45158
7485 -45158 -34390 -14722 -6736 -7925 -4770 -15643 -24095 -19418 615 34705 36544 26392 -23630
7472 -23630 -39741 -5164 8899 5654 -13841 -30096 -11276 13293 -628 -11293 -2954 10762
7460 10762 16396 3343 -15226 -21043 -26801 -36230 -10548 -9866 -30277 -25878 -7022 3164 -4220
7447 -4220 -7166 -3461 -16571 -32737 -2809 3551 -3672 -9075 -13034 357 -2279 16784 19920 -7102
7433 -7102 -25122 -36180 -30764 -7258 10300 6378 -510 -10247 425 35560 31751 17425 11996
7420 11996 17409 -693 -10490 -12648 -6980 -26096 -37976 -28918 -7673 -7916 9019 13917 3025
7407C025j2660j9464j8938J1566L5110o684o506P31o308P329k065m668J8835N296
7393D599Q898L713j5773k0602r205M481J2905J3218M713M127j3520j0078N311
7380g213m505P185J3189R401n534n854m998j7035j0232R615M255O905J0653P308
7366A3140J4081l982Q919j2754q495Q09j8293j1278K116O025J477Q272J3839M831
7352A8707m766j1585k890J3227J1100j6218k0820j9031J8450O261J0988M178j0258
7339b657R02j6514J3305O708K509O71j144M171p236P54J0390m417k3591r766P30
7324b5185K816j7710p945j291J6195O965P952J174J8685R794r161n827n177J0514
7310A799J3504l720o085K048k342P73q987l268l776J5233r896L052j8952k6758
$$ plain form
7407 3025 -9635 -29099 -48037 -36471 -1361 -8045 -14551 -13820 -20128 -12799 -14864 -19532 -697 4599
7393 4599 13497 17210 1437 -19165 -28370 -23889 -10984 2234 6947 11074 -2446 -12524 -7213
7380 -7213 -11718 -4533 8656 18057 12523 6669 1671 -15364 -25596 -15981 -11726 -4821 5832 13140
7366 13140 27221 23239 32158 19404 10909 11718 -6575 -17853 -15737 -9712 -8235 37 13876 18707
7352 18707 13941 2356 -534 12693 23793 7575 -13245 -32276 -13826 -7565 3423 7601 -2657
7339 -2657 -1755 -18269 -4964 1744 4253 4924 3780 7951 715 1469 11859 7442 -16149 -25915 -25185
7324 -25185 -22369 -40079 -48024 -49315 -33120 -26155 -18203 -17029 1656 11450 2289 -3538 -8715 1799
7310 1799 15303 11583 5498 7546 5204 5977 -3010 -6278 -10054 5179 -4717 -1665 -20617 -47375
7296d7375J1401K7832M008O465p247n781j1768J955K1744O012j666j169l666j1636
7282a0891j4064L997N017J0656J1906r174k6055J0890J2830J646l262L533M737
7269A766j3116j3230J638J351k559R750L6011n82j228Q116j1023j8510j6332L773
7255a4175J5645p422J8788M49k3222k8735J040J9531M098n757j599O667R76O624
7241g092R451R069p095L163J7623r306j1390M482j1039r309k019r62J6693K948
7227E217k5846l854J0147J2785k294L550j3158n273j260o064j094J8006K3933
7214A4795N521n293q158n029O753J3757m122m16l860j6201M40N360j3847P7j1238
7199b1461J3700L428L806m749P867K0329Q120j7116K089O263r590O65J4794k3913
$$ plain form
7296 -47375 -35974 -8142 -4134 2331 -4916 -10697 -22465 -20510 1234 7246 5580 4411 745 -10891
7282 -10891 -24955 -20958 -15941 -5285 6621 -2553 -28608 -17718 -4888 -3242 -6504 -2971 1766
7269 1766 -11350 -24580 -22942 -21591 -24150 -14400 21611 21029 19801 27917 16894 -1616 -17948 -14175
7255 -14175 1470 -5952 12836 13285 -9937 -38672 -37632 -18101 -14003 -19760 -21359 -14692 -13716 -7092
7241 -7092 2359 11428 4333 7496 25119 15813 4423 8905 -2134 -11443 -13462 -14424 2269 5217
7227 5217 -20629 -24483 -14336 -1551 -3845 -295 -13453 -18726 -19986 -26050 -27144 -9138 14795
7214 14795 20316 15023 6865 1836 8589 22346 18224 17808 13948 -2253 -1813 3547 -10300 -10223 -21461
7199 -21461 -7761 -4333 -527 -5276 2591 22920 31040 13924 16013 22276 12686 13351 28145 4232
7185D232j3931j051P868P466R737M977K15j2465k5854n265J0582P3J814J395j7214
7170b7421P512Q340L225n644J4830p515l0645j4323J0589J6813k110l755K9m607
7156c4682j3531J3696j364N39K1800j0076k3964o376J417J2643M662J821J6215
7143a7200J8554m239R76P106Q487O277J7306P491n795j0691p376p705k17q086
7129D888p319o224j221n867O370O773O101j1441K188J722L939O482j4519j6370
7115b4498l915N400K2204J4416J7481k7557k5122j5160L619J0796K733J3529J2617
7102F543J81l660q618O223K9118j3294j7746k662M457m691J852L223n380j5055
7088a9509R619P82N620J208q76j4144j6593J7157K0661r636P77j6127J1781K6113
$$ plain form
7185 4232 -9699 -10750 -2882 4584 14321 19298 19513 7048 -18806 -24071 -13489 -13416 -11602 -10207 -27421
7170 -27421 -19909 -11569 -8344 -13988 842 -6673 -37318 -51641 -41052 -24239 -26349 -30104 -30075 -34682
7156 -34682 -48213 -34517 -35881 -35342 -13542 -23618 -47582 -53958 -52541 -39898 -35236 -33415 -17200
7143 -17200 1354 -2885 -1909 5197 13684 19961 37267 44758 38963 28272 20896 13191 12974 4888
7129 4888 -2431 -8655 -9876 -15743 -9373 -2600 3501 -7940 -5752 -4030 -91 6391 -8128 -24498
7115 -24498 -28413 -23013 -809 13607 31088 3531 -21591 -36751 -33132 -22336 -19603 -6074 6543
7102 6543 6724 3064 -5554 669 29787 16493 -1253 -3915 542 -4149 -2297 926 -4454 -19509
7088 -19509 -9890 -9108 -3488 -2280 -3156 -17300 -33893 -16736 3925 -5711 -4934 -21061 -9280 16833
7074A6833N005j7239j4258m977R817M936K6893l649l5355l1528p725L4682K8432
7061A1867N187P712j1707k1270k250J7712N361K552j1967j0780q356J1001J084
7048c854J1497J9820J277j6871j9976Q619m182j5471l2263Q032J3958P775j1721
7035c3360j489J341J3547K3011m912l217q831N820K3805j0135j7075P749K0946
7022A7200M868j4271j4154o579l468K438Q842j5601j1391L291L108m722O795J4423
7008i221J6711m367j1232R426j5545m433J4517R798L933j1457R48j00M767j3279
6994i534J775O262P645l833J0691q042j3481q583J6413Q15r83J581Q479r270q332
6979h397k0752J6389R944M597R287n231P783n437j4159J194o584L810O454J285
$$ plain form
7074 16833 21838 4599 -9659 -14636 -4819 117 27010 23361 -11994 -43522 -51247 -16565 11867
7061 11867 17054 24766 13059 -8211 -10461 7251 12612 15164 3197 -7583 -15939 -4938 -3854
7048 -3854 7643 27463 28740 11869 -8107 512 -3670 -19141 -51404 -43372 -29414 -21639 -33360
7035 -33360 -34849 -33508 -19961 3050 -1862 -5079 -13910 -8090 15715 5580 -11495 -3746 17200
7022 17200 22068 7797 -6357 -12936 -16404 -13966 -5124 -20725 -32116 -28825 -25717 -30439 -23644 -9221
7008 -9221 7490 3123 -8109 1317 -14228 -18661 -4144 5654 9587 -1870 -922 -1022 3745 -9534
6994 -9534 -7759 -1497 6148 2315 13006 4964 -8517 -17100 -687 128 -855 726 9205 -65 -8397
6979 -8397 -29149 -12760 -2816 1781 11068 5837 13620 8183 -5976 -4782 -11366 -7556 -1102 183
6965A83L468m420R585j0064K619n276M439p631l429N174R198p581q082o728J8267
6950b78J1611M522k298j9182m147K3863R998m939M74k0137r251P315J389n968
6936g028Q882J2247O626r845r913o303j58p250j5905m818J1501q223J8570K8831
6922A7214m623r037j944l880k313r450j1154Q767Q347L740q085J3089J3038r189
6908D520N753j2356k5680k578Q926K2508J2471k0478N82J7703Q297l105q842J901
6894I622K000R24n415k1018j2681M945J3535j2009k2085J5430L3951M678r903
6881A974q892J9452R4j2964n184o158o460j1796l31m851J8085J0983j7133N943
6867a7238N618J4164O476p429l7641K656J1178k176R719J4990J7309j6200k1259
$$ plain form
6965 183 3651 -769 8816 -1248 1371 -3905 534 -7097 -10526 -5352 3846 -3735 -11817 -18545 -278
6950 -278 11333 15855 13557 -5625 -9772 14091 24089 19150 19624 -513 -9764 -2449 -1060 -7028
6936 -7028 1854 14101 20727 10882 969 -5334 -5492 -12742 -28647 -33465 -21964 -30187 -11617 17214
6922 17214 12591 3554 1610 -2270 -4583 -14033 -25187 -16420 -8073 -4333 -12418 671 13709 4520
6908 4520 10273 -2083 -27763 -30341 -21415 1093 13564 -6914 -6332 11371 19668 16563 7721 9622
6894 9622 11622 12546 7131 -13887 -26568 -21623 -8088 -20097 -42182 -26752 7199 11877 1974
6881 1974 -6918 12534 12628 -336 -5520 -11678 -18138 -29934 -30265 -35116 -17031 -6048 -23181 -17238
6867 -17238 -11620 2544 9020 1591 -36050 -33394 -22216 -24392 -14673 317 17626 1426 -19833
6854a9833n930q850J3820K7765k846j3589j4172K3667K0777k5373k2992j4307
6842d1863M882N427P682j483j650j0719J0371J4291J6834o527j3104q821M218
6829b0462J3010j0539j0076p39N326P972P915P164J4851p681j3510j4313R75n954
6815b6061l074O947P801J3350J1306j1670j6451J709K055J3272L338J4222J135
6802A7879q349j972j0504k702l763Q723P0l349m737O366N343J3226l652R825N022
6787B7426r760k8371J2931r540j7793p86J1039Q260O765o160o632J0470j036j3237
6773a6424r854K9176r298k9460P83K7447K5001r35p190J884o687J6854J0336Q025
6759C9658J4338k10k838L396L555j106j3109k5320j3273J592M504o428O409j5612
$$ plain form
6854 -19833 -25763 -34613 -20793 6972 4126 -9463 -23635 32 20809 -4564 -27556 -41863
6842 -41863 -36981 -31554 -23872 -25355 -27005 -37724 -27353 -13062 3772 -2755 -15859 -24680 -20462
6829 -20462 -7452 -17991 -28067 -28806 -23480 -15508 -7593 -429 14422 6741 -6769 -21082 -20107 -26061
6815 -26061 -29135 -22188 -14387 -1037 10269 -1401 -17852 -16143 -14088 -816 2522 16744 17879
6802 17879 9530 7558 -2946 -5648 -9411 -688 -618 -3967 -8704 -2338 3005 16231 12579 22404 27426
6787 27426 17666 -10705 2226 -7314 -25107 -25893 -14854 -6594 171 -5989 -12621 -2151 -3187 -16424
6773 -16424 -26278 2898 -6400 -35860 -35077 -7630 17371 16436 9246 11130 4443 21297 31633 39658
6759 39658 53996 53786 50948 54344 57899 56793 43684 18364 5091 6683 11187 4759 11168 -4444
6745d444m311J1017M042r77r496j9061m937J003k1099m691K7885J4920l747l35
6731a4231j1841o350L989Q727J3820n321o164R191K192l6311l629J9170R657K145
6717a4956J5917K3477J082j1014k2375k021o76p229m734K237q989O172J8053K6905
6703B1849P400j2421J510Q678k2368j1687j1086p861k686O305r153o519M260k558
6689c6337m7J3769J2194j6301j9799j0287R525J7219J0406J7596j709j782O856
6676A303p968m804J4120r559k0520J1391J2520P787m460k6920r48K3457M1803
6663C7202K0273j300j6912k5575j7562q584J6068J3406K881j8409o640o091p787
6650a9030o272n208J88K2994J4375j2246M659o621j6357r504k0027j188M169L890
$$ plain form
6745 -4444 -8755 2262 6304 5327 -4169 -23230 -28167 -27164 -48263 -52954 -25069 -10149 -13896 -14231
6731 -14231 -26072 -32422 -28433 -19706 -5886 -11207 -17371 -8180 -5988 -42299 -45928 -26758 -17101 -14956
6717 -14956 961 24438 25520 14506 -7869 -9890 -10566 -17795 -22529 -20292 -29281 -23109 -5056 21849
6703 21849 29249 16828 18338 27016 4648 -7039 -18125 -25986 -28672 -22367 -31520 -38039 -33779 -36337
6689 -36337 -36384 -22615 -10421 -26722 -46521 -56808 -47283 -30064 -19658 -2062 -3771 -5553 1303
6676 1303 -6665 -11469 2651 -6908 -27428 -16037 -3517 4270 -190 -27110 -28058 -4601 37202
6663 37202 57475 56175 39263 13688 -3874 -12458 3610 17016 19897 1488 -5152 -11243 -19030
6650 -19030 -25302 -30510 -30322 -7328 7047 -5199 -540 -7161 -23518 -33022 -53049 -54237 -50068 -46178
6636d6178K7843L3742R066j2847J850m272k4088k3788J1630J7523J6671k252Q43
6623E743O803Q2J2517q480k943q129k030J3706J8q379l181k265J6964J264p316
6608A4374n760K100P782j3324p352J731j6630j1684j0736n042J87J5106J6824
6595a2424p747j1538k5646r408J946L5027K3471J291R104n30j7940j9199N873
6582b7720N114J0513J788J9675J4755l245o299j1401J402R493M995P368j0492
$$ plain form
6636 -46178 -18335 15407 24473 11626 13476 9204 -14884 -38672 -27042 -9519 7152 4900 5743
6623 5743 12546 12628 25145 16665 13722 5593 3563 17269 17287 8908 5727 3462 20426 21690 14374
6608 14374 8614 10714 18496 5172 -2180 -449 -17079 -28763 -39499 -44541 -44354 -29248 -12424
6595 -12424 -20171 -31709 -57355 -66763 -64817 -29790 -6319 -5028 4076 3546 -14394 -33593 -27720
6582 -27720 -22606 -12093 -10305 9370 24125 20880 14581 3180 4582 14075 19070 26438 15946
$$ [...]
##END NTUPLES=NMR SPECTRUM
##END=
