##TITLE=Analysis number 328306
Compound Code cc 62309
Book Reference 464/138/7
Project Code adrs
Chemist Name chrisr
##JCAMPDX= 6.0         $$ Bruker NMR JCAMP-DX V2.0
##DATA TYPE= NMR SPECTRUM
##DATA CLASS= NTUPLES
##ORIGIN= Bruker BioSpin GmbH
##OWNER= nmr
$$ XWIN-NMR		Version 3.5
$$ Wed May 23 09:55:57 2007 GMT Daylight Time (UT+1h)  MAYBRIDGE\nmr@NMR_250MHZ
##.OBSERVE FREQUENCY= 250.131544655141
##.OBSERVE NUCLEUS= ^1H
##.ACQUISITION MODE= SIMULTANEOUS (DQD)
##.ACQUISITION SCHEME= undefined
##.AVERAGES= 16
##.DIGITISER RES= 18
##SPECTROMETER/DATA SYSTEM= dpx250
##.PULSE SEQUENCE= zg30
##.SOLVENT NAME= CDCl3
##.SHIFT REFERENCE= (INTERNAL, CDCl3, 0, 16.522)
##AUDIT TRAIL= $$ (NUMBER, WHEN, WHO, WHERE, WHAT)
$$ ##TITLE= Audit trail, XWIN-NMR		Version 3.5
$$ ##JCAMPDX= 5.01
$$ ##ORIGIN= Bruker BioSpin GmbH
$$ ##OWNER= nmr
$$ C:\u/data/dgb/nmr/ADRS/1370/pdata/1/auditp.txt
$$ ##AUDIT TRAIL=  $$ (NUMBER, WHEN, WHO, WHERE, WHAT)
(   1,<2007-05-23 09:55:37.68 +100>,<MAYBRIDGE\nmr>,<NMR_250MHZ>,
      <created by zg, POWCHK disabled, PULCHK disabled
       configuration hash MD5:
       76 6E 9A 78 1E 09 19 81 EC 84 63 8F B0 6A 59 2D
       data hash MD5: 64K
       9C DA FA A9 76 DD 8F 47 D0 1F 21 49 EA 71 86 DD>)
(   2,<2007-05-23 09:55:49.12 +100>,<MAYBRIDGE\nmr>,<NMR_250MHZ>,
      <Start of raw data processing
       ef LB = 0.3 FT_mod = 6 PKNL = 1 SI = 32K 
       data hash MD5: 32K
       2E B6 6D 73 35 E6 F9 84 B6 3D 84 00 11 D8 AF 73>)
(   3,<2007-05-23 09:55:50.76 +100>,<MAYBRIDGE\nmr>,<NMR_250MHZ>,
      <apk 
       data hash MD5: 32K
       E6 85 1A 3A A8 15 45 A0 ED FE 3E B6 B8 12 61 02>)
(   4,<2007-05-23 09:55:51.60 +100>,<MAYBRIDGE\nmr>,<NMR_250MHZ>,
      <abs ABSG = 5 
       data hash MD5: 32K
       14 24 FF 15 E7 DE 74 A9 52 FC 28 B1 F1 EA 71 A9>)
$$ ##END=
$$ 
$$ hash MD5
$$ 6F D8 6A 42 66 2A C4 7A A0 DA D3 09 39 D0 3E A6
##$RELAX= 
##$RELAX= 
##$RELAX= 
##$RELAX= 
##$RELAX= 
##$RELAX= 
##$RELAX= 
$$ Bruker specific parameters
$$ --------------------------
##$DU= <C:\u>
##$EXPNO= 1370
##$NAME= <ADRS>
##$PROCNO= 1
##$TYPE= <nmr>
##$USER= <dgb>
##$AMP= (0..31)
100 100 100 100 100 100 100 100 100 100 100 100 100 100 100 100 100 100 
100 100 100 100 100 100 100 100 100 100 100 100 100 100 
##$AQSEQ= 0
##$AQ_mod= 3
##$AUNM= <au_zg>
##$AUTOPOS= <3 >
##$BF1= 250.13
##$BF2= 250.13
##$BF3= 250.13
##$BF4= 250.13
##$BF5= 500.13
##$BF6= 500.13
##$BF7= 500.13
##$BF8= 500.13
##$BYTORDA= 1
##$CFDGTYP= 0
##$CFRGTYP= 5
##$CHEMSTR= <none>
##$CNST= (0..31)
1 1 145 1 1 1 1 1 1 1 1 1 1 1 1 1 1 1 1 1 1 1 1 1 1 1 1 1 1 1 1 1 
##$CPDPRG= <>
##$CPDPRG1= <>
##$CPDPRG2= <>
##$CPDPRG3= <>
##$CPDPRG4= <mlev>
##$CPDPRG5= <mlev>
##$CPDPRG6= <mlev>
##$CPDPRG7= <mlev>
##$CPDPRG8= <mlev>
##$CPDPRGB= <>
##$CPDPRGT= <>
##$D= (0..31)
0 1 0 0 0 0 0 0 0 0.06 0 0 0 0 0 0 0.0002 0 0 0 0 0 0 0 0 0 0 0 0 0 0 
0 
##$DATE= 1179910536
##$DBL= (0..7)
120 120 120 120 120 120 120 120 
##$DBP= (0..7)
150 150 150 150 150 150 150 150 
##$DBP07= 0
##$DBPNAM0= <>
##$DBPNAM1= <>
$$ [...]
##$SUBNAM7= <"">
##$SUBNAM8= <"">
##$SUBNAM9= <"">
##$SW= 20.6930455092707
##$SWIBOX= (0..15)
0 0 3 0 0 0 0 0 0 0 0 0 0 0 0 0 
##$SW_h= 5175.983436853
##$TD= 65536
##$TD0= 1
##$TE= 683.16
##$TE2= 300
##$TE3= 300
##$TEG= 300
##$TL= (0..7)
0 120 120 120 120 120 120 120 
##$TP= (0..7)
150 150 150 150 150 150 150 150 
##$TP07= 0
##$TPNAME0= <>
##$TPNAME1= <>
##$TPNAME2= <>
##$TPNAME3= <>
##$TPNAME4= <>
##$TPNAME5= <>
##$TPNAME6= <>
##$TPNAME7= <>
##$TPOAL= (0..7)
0.5 0.5 0.5 0.5 0.5 0.5 0.5 0.5 
##$TPOFFS= (0..7)
0 0 0 0 0 0 0 0 
##$TUNHIN= 0
##$TUNHOUT= 0
##$TUNXOUT= 0
##$USERA1= <user>
##$USERA2= <user>
##$USERA3= <user>
##$USERA4= <user>
##$USERA5= <user>
##$V9= 5
##$VALIST= <valist>
##$VCLIST= <CCCCCCCCCCCCCCC>
##$VD= 0
##$VDLIST= <DDDDDDDDDDDDDDD>
##$VPLIST= <PPPPPPPPPPPPPPP>
##$VTLIST= <TTTTTTTTTTTTTTT>
##$WBST= 1024
##$WBSW= 4
##$XGAIN= (0..3)
0 0 0 0 
##$XL= 0
##$YL= 0
##$YMAX_a= 463334
##$YMIN_a= -406017
##$ZGOPTNS= <>
##$ZL1= 120
##$ZL2= 120
##$ZL3= 120
##$ZL4= 120
##$ABSF1= 16.522
##$ABSF2= -4.171173
##$ABSG= 5
##$ABSL= 3
##$ALPHA= 0
##$AQORDER= 0
##$ASSFAC= 0
##$ASSFACI= 0
##$ASSFACX= 0
##$ASSWID= 0
##$AUNMP= <proc_1d>
##$AZFE= 0.1
##$AZFW= 0.1
##$BCFW= 0
##$BC_mod= 0
##$BYTORDP= 0
##$COROFFS= 0
##$CY= 12.5
##$DATMOD= 1
##$DC= 0
##$DFILT= <>
##$DTYPP= 0
##$F1P= 14.0000005364418
##$F2P= -0.99999901652339
##$FCOR= 0.5
##$FTSIZE= 32768
##$FT_mod= 6
##$GAMMA= 0
##$GB= 0
##$INTBC= 1
##$INTSCL= 1
##$ISEN= 128
##$LB= 0.3
##$LEV0= 0
##$LPBIN= 0
##$MAXI= 10000
##$MC2= 0
##$MEAN= 0
##$ME_mod= 0
##$MI= 0
##$NCOEF= 0
##$NC_proc= -2
##$NLEV= 6
##$NOISF1= 0
##$NOISF2= 0
##$NSP= 0
##$NTH_PI= 0
##$NZP= 0
##$OFFSET= 16.522
##$PC= 1
##$PHC0= -52.27804
##$PHC1= -1.201602
##$PH_mod= 1
##$PKNL= yes
##$PPARMOD= 0
##$PSCAL= 4
##$PSIGN= 0
##$REVERSE= no
##$SF= 250.13
##$SI= 32768
##$SIGF1= 0
##$SIGF2= 0
##$SINO= 400
##$SIOLD= 32768
##$SREGLST= <1H.CDCl3>
##$SSB= 0
##$STSI= 32768
##$STSR= 0
##$SW_p= 5175.98343685301
##$SYMM= 0
##$S_DEV= 0
##$TDeff= 65536
##$TDoff= 0
##$TI= <Analysis number 999999
Compound Code 99
Book Reference 9
Project Code 9>
##$TILT= no
##$TM1= 0
##$TM2= 0
##$TOPLEV= 0
##$USERP1= <user>
##$USERP2= <user>
##$USERP3= <user>
##$USERP4= <user>
##$USERP5= <user>
##$WDW= 1
##$XDIM= 32768
##$YMAX_p= 506249544
##$YMIN_p= -317076
$$ End of Bruker specific parameters
$$ ---------------------------------
##NTUPLES= NMR SPECTRUM
##VAR_NAME=  FREQUENCY,     SPECTRUM/REAL,   SPECTRUM/IMAG
##SYMBOL=    X,             R,               I
##VAR_TYPE=  INDEPENDENT,   DEPENDENT,       DEPENDENT
##VAR_FORM=  AFFN,          ASDF,            ASDF
##VAR_DIM=   32768,         32768,           32768
##UNITS=     HZ,            ARBITRARY UNITS, ARBITRARY UNITS
##FACTOR=    0.157963299565203, 1,           1
##FIRST=     4132.6476996994, 0,             0
##LAST=      -1043.33573715361, 0,           0
##MIN=       -1043.33573715361, -317076,     0
##MAX=       4132.6476996994, 506249544,     0
$$ Real data points
##PAGE= N=1
##DATA TABLE= (X++(R..R)), XYDATA
$$ [...]
23790 8204 3568 5084 8404 8450 3397 -1716 2069 -7394 -13926 -6961 782 130 -6895 -4988 -88
23775 -88 2559 9958 -4051 -3636 2947 -6591 1406 5546 7545 1291 -1896 -4799 -10615 -4366 7458
23760 7458 3825 -2947 -2968 -8810 -5625 -4773 2505 1017 2018 5515 7975 1255 1005 3813 -4282 -10264
23744 -10264 -5745 -8644 -12928 -17407 -11934 -7757 -5732 -4710 -10952 -7140 -1967 -4233 -7667 -12113
23730 -12113 -9855 -299 -2378 -563 -1505 -1952 -307 2232 623 -4739 -3333 7005 6935 2343 2457
23715 2457 6128 3333 -1729 -5187 -11839 -13564 -14097 -8787 -5768 -766 4655 15199 11623 -2490
23701 -2490 -9068 -7114 2365 4666 6623 11964 10412 17275 10416 -1198 2581 8154 11502 15137
23687 15137 2458 -2141 -568 5363 3942 611 8887 8565 -918 -7231 -2118 2441 4829 5663 9705
23672 9705 2898 -4248 -10967 -11145 -977 197 -4285 -8284 -8007 -6424 563 7260 -49 971 5804
23657 5804 7796 1 -8844 384 2733 -2230 -3480 -9697 -16298 -9167 -5102 5000 7378 -4674
23643 -4674 -3384 4563 5847 -2769 -1974 3153 13307 18509 17514 13340 3106 -10849 -13704 -16550
23629 -16550 -14208 -6012 1441 6580 6074 -3443 -2342 -9067 -16242 -16482 -5843 -5177 -3622 -8943 -18515
23614 -18515 -18997 -19145 -11772 -3330 1431 9563 13790 10505 6783 2650 -6447 -13360 -17966 -14727 -17101
23599 -17101 -27156 -32955 -26133 -15690 -13598 -19338 -30782 -37505 -41805 -41045 -24779 -15359 -19385 -24010
23585 -24010 -26842 -33042 -27381 -18456 -18199 -11124 -17087 -15115 -5489 -9535 -8616 -3695 -7122 -8668 -11481
23570 -11481 -3816 -6416 4436 15229 -2247 -8862 3763 7648 3997 2118 4097 8 -2895
23557 -2895 -3319 -873 -897 6502 -2486 -17314 -25627 -21565 -12357 -10407 -10390 -13781 -17957 -9489 -4379 -4882
23541 -4882 8388 13532 8359 -899 -3251 -4406 -15134 -16613 -10573 -5878 -1659 3294 6150 5140
23527 5140 -1790 -11482 -6454 -7226 -8845 4722 16545 17623 17137 8341 -6807 -16261 -16247 -8877 -2455
23512 -2455 -5723 -9074 -15259 -18307 -20823 -14710 -9910 -1683 -1818 -7612 641 406 -4668 -2155 3730
23497 3730 932 -4317 -6146 -17267 -18420 -22563 -19861 -12123 -10778 -9480 -4058 -8648 -10561 -11726
23483 -11726 -8840 -892 7107 10987 67 -5786 -5403 -10169 -14102 -8441 -5192 -1361 6965 4529
23469 4529 -1685 529 7318 5352 2312 -5748 -6178 4522 -2524 -9435 -12845 -14100 -20552 -18581 -10554
23454 -10554 -10850 -17101 -10101 -501 -951 -1723 593 -882 -371 -631 2155 1482 -9582 -15704 -10539 2014
23438 2014 6355 12608 20371 23748 14865 40 -12323 -13768 -11044 -9879 -8876 -5982 -13498 -14925
23424 -14925 -10135 -527 7730 1681 4966 6440 7013 5697 2829 786 5954 9576 1953 -510 13091
23409 13091 14631 -1078 -9560 -1711 4661 -2701 -7521 -5114 -12667 -13065 -2243 4749 6171 14152
23395 14152 9557 2337 -5722 -5862 -3970 2490 13931 12434 2555 -3807 -15273 -16256 -448 5037
23381 5037 3099 2078 -1740 -8789 -10422 -6051 -5949 -7082 -8906 -4737 -2553 428 -9141 -12867 -18128
23366 -18128 -8831 -8910 -12585 -3700 5070 10507 4877 -827 1532 -9204 -15399 -23863 -22969 -13103 -7934
23351 -7934 -13291 -20414 -14229 -14646 -8726 -4581 -9134 -6206 -5372 -6695 -4803 -874 -71 -2562 -1576 -551
23335 -551 -5300 -10828 -10607 -4696 -1236 -4871 -4380 495 -2418 -280 -522 -5638 2856 3076 -651 728
23319 728 6791 -4523 -12026 -17441 -18274 -19853 -22223 -19669 -16883 -17827 -9101 -13622 -22165 -27626 -15218
23304 -15218 -1379 4855 8763 8097 6423 2569 9840 16508 16775 9150 6906 8526 7728 5558 2572
23289 2572 9610 6483 -4129 -9362 -9450 -14030 -13840 -11051 -3442 5766 8545 5449 3972 -628 -1387
23274 -1387 -3288 -14078 -22988 -23322 -22987 -12426 1746 7442 11407 5923 4789 7384 12729 11810 959
23259 959 -5367 -9773 -8172 -7107 -2425 -10103 -14374 -14388 -20217 -31339 -37163 -25816 -4679 -156 -8884
23244 -8884 -16679 -11612 -4131 -4217 -8826 -14182 -17411 -24155 -13685 -6868 -10082 -2036 5749 6194 -730
23229 -730 -3982 -9526 -11971 -14027 -8274 -5784 -5387 4933 15770 10563 -34 -5335 5052 4673
23215 4673 5136 -4123 -9905 -17766 -15955 -14285 -10041 -3475 2537 8202 14280 8451 -2953 -6557 -1396
23200 -1396 4479 -4744 -14734 -14107 -12272 -19156 -21956 -11943 1519 7394 -6826 -12010 -20250 -21775
23186 -21775 -18337 -10352 -8132 -12021 -7615 -5565 -8078 -10646 -10985 -10369 -13302 -17704 -22756 -24319 -21928
23171 -21928 -18021 -6793 -4664 207 4002 6141 -2339 836 7418 8821 8957 6635 4426 464
23157 464 3849 3917 -5516 -10820 -14899 -18984 -17730 -20527 -23121 -16190 -8123 -7602 -9835 -5469 -1842 -4982
23141 -4982 -10550 -18865 -17131 -12652 -1238 -6642 -12854 -12596 -3182 -8444 -20822 -20250 -9134 2412
23127 2412 18706 17393 18340 17752 10856 5077 4634 180 7341 4296 3636 3090 5974 -2669 -4908 -5426
23111 -5426 -12546 142 1928 1834 -7307 -13725 -15826 -17042 -5965 -4106 -1963 2407 23217 21556
23097 21556 17949 2113 1728 2468 2765 -1779 -7342 -3504 -7669 -11998 -7414 -6955 -5246 5877 1913
23082 1913 -620 -338 -5070 -3729 7888 9171 3491 389 744 1058 9588 4339 2307 -2742 882
23067 882 188 8008 11264 5316 10578 19256 10105 4703 -1270 -4966 -4310 1901 1527 3111 3274 -1180
23051 -1180 -8590 -14398 -8439 671 2734 6253 4737 3837 135 -4572 -8985 -3863 4184 4897 7533
23036 7533 9014 10 -9728 -6024 -11210 -15414 -14592 -10405 -9511 -11529 -7711 4137 2791 1456 -475
23021 -475 -228 -11398 -18711 -21831 -18960 -7528 7834 6234 1351 -4656 -5628 -5542 -14686 -8978 -9674
23006 -9674 -10435 -7220 -10417 -12441 -12406 -11712 -11916 -8890 -2390 -1648 5108 4565 3471 5811 5870 -6339 -13257
22989 -13257 3172 12829 6727 2551 -5438 -14286 -7180 -356 1202 -2255 -16191 -24706 -22855 -14014
22975 -14014 -11824 -15487 -17440 -15043 -5236 -10567 -17031 -16988 -10192 -4821 -6189 -8152 -7960 -312 -4969
22960 -4969 -20077 -10446 -5465 -13336 -18872 -12423 -9882 1174 3313 -763 -5459 -6461 -13713 -9715
22946 -9715 -5108 -3945 1204 -4859 -4918 -4698 -8196 -11726 -10422 -6825 -10165 -12037 -4830 -2450 -670
22931 -670 -2735 1027 -225 -1234 -2139 -5868 -5902 -5105 -10384 -8132 -1082 -7294 -12570 -12977 -14835 -14097
22915 -14097 -14011 -7081 3024 -84 -12268 -16077 -6243 -6722 -7188 -10247 -12933 -8028 -374 9635 22718
22900 22718 24767 7181 4458 5111 12302 5120 -8614 -7647 1817 2945 7743 15342 13814 15178
22886 15178 10985 -5903 -22313 -18122 -12582 -11978 -1448 3807 3767 2221 -4515 -6387 -7660 -7654 -6319
22871 -6319 -4292 -5663 -6199 -4073 -4543 -7459 -7915 -6187 -2196 -1236 -26 -3783 -19043 -15067 -9813
22856 -9813 -12773 -9762 -4798 -4012 7751 11998 10095 574 242 -3301 -8218 -14028 -16961 -20119 -16044
22841 -16044 -12757 -13851 -3771 4562 3640 -22 5947 11384 7120 -2662 -6727 -14409 -5441 3118
22827 3118 -6115 -15756 -14820 -8937 -13017 -15356 -20674 -23274 -20054 -11871 -9682 -20207 -20668 -13968 -220
22812 -220 -353 -6407 -5558 -2204 -1563 -14052 -18189 -14424 -9264 -10696 -8700 -2139 -5747 -3635 -11045
22797 -11045 -4631 -143 -1295 808 -3894 -3964 -6036 7152 4211 -412 -1053 4054 11744 14004 11775
22782 11775 15963 12287 5310 -5910 -14477 -5125 -4729 -9593 -17346 -18392 -12531 -5059 -4063 -5126 -6285
22767 -6285 -5660 -3970 10791 12699 14412 16384 22204 17607 13579 16470 13069 4173 -1772 -9945 -6502
22752 -6502 2236 7968 3956 8338 6619 3806 1945 -8182 -12318 -7157 -4804 -13709 -11154 -5627
22738 -5627 -6081 -12920 -19403 -18121 -17756 -14268 -10889 -8407 572 -384 -6170 -11888 -9618 -1349 -6566
22723 -6566 -17597 -15827 -8760 -6068 -4791 -4623 -2587 -689 2117 2235 5894 7016 5963 4022 11254
22708 11254 12907 6190 6942 7734 1285 -2864 3114 1054 -1657 -2347 -6279 -6269 -614 4067 2139 202
22692 202 -1591 -8821 -15216 -5022 -3073 -4540 -3157 -1436 -6829 -10160 -4176 -7730 -3868 -7279 -13962
22677 -13962 -11595 -17784 -22577 -13210 -7757 -4103 -1934 -3459 9444 9678 -5953 -12822 -3872 7690
22663 7690 2500 -8360 -24843 -22874 -19771 -21105 -9103 -7911 -10846 -15044 -18707 -20504 -22500 -18905
22649 -18905 -15746 -8823 -9834 -13644 -17579 -9929 -6017 -10646 -16711 -16595 -10004 -8004 -7701 -6103 -7686
22634 -7686 -8288 -17718 -19774 -3922 -2155 -8661 -5442 2293 1183 3948 7327 9790 9107 5589 5586 8375
22618 8375 14337 23117 25787 15399 2473 -154 10340 12338 8197 8415 11563 16778 13391 2717
22604 2717 -1353 7078 -298 -5793 -5874 -5276 -7592 -9299 -4589 -4011 -7742 -8584 -6518 -4492 -7142 -3120
22588 -3120 6649 2836 2730 -2032 -5121 -13641 -11675 -3996 -4332 -6063 -6337 -8433 -2925 -8310 -2509
22573 -2509 6440 4690 -1193 -8211 -7214 -2847 -5982 1269 2871 -5637 -11607 83 -1132 -5285 -9180
22558 -9180 -12963 -5186 -6387 -11519 -9997 -18344 -7263 -9408 -20397 -6304 2905 -9972 -11298 -15658
22544 -15658 -14967 -10493 -10976 -15740 -13580 -7583 -12401 -12235 -2717 58 -8533 -17194 -17036 -3770 -4671
22529 -4671 -15362 -13890 -15032 -12337 -26835 -34629 -36312 -33419 -17142 -13731 -19804 -20542 -16693 -9077
22515 -9077 -9658 -14894 -15470 -8765 -3092 -5992 744 1358 -4562 -5799 -7913 -12992 -13430 -8455 -5950 -4153
22499 -4153 7014 -9148 -16470 -17759 -14174 -7183 -6512 -233 -1324 1538 1135 6187 9626 2735 -1193
22484 -1193 4561 7883 -242 -43 6603 8808 -1738 -4138 -4428 -10352 -6739 -2892 -3410 -1855 2390
22469 2390 -5165 -16650 -15375 -2665 -323 1293 6047 -204 -4946 -1193 5791 8265 10444 12368
22455 12368 12828 11441 15216 16135 14886 8503 3405 -3673 -9483 -3722 -2145 -5014 -8070 4386 6230
22440 6230 -5295 -6664 -1530 -2768 1119 7574 5570 793 -381 -7185 -6616 -1266 1601 4274 2801
22425 2801 8103 2623 -1625 -1824 2160 11427 7634 4185 11060 9686 -1613 -8620 -10105 -11330 -13918
22410 -13918 -20348 -25368 -22628 -18329 -18558 -20794 -20307 -10919 -9319 -8094 -6939 1156 7909 11646 11233
22395 11233 8226 -2511 -13059 -6897 -8510 -12556 -7289 -9422 -17116 -18862 -15589 -8427 8211 517
22381 517 -4504 -7626 -8344 -5951 -3732 6845 7008 907 -11046 -12655 -8197 -2322 -9644 -16394 -17945
22366 -17945 -12137 -18269 -17149 -18958 -14118 -7964 -11154 -13313 -8806 -1718 -10729 -15825 -3785 12192
22352 12192 14655 13614 -695 -21108 -27036 -27905 -21220 -11408 930 1782 -2717 1285 5979 2169
22338 2169 -10541 -16307 -26723 -24607 -18304 -10634 -1475 -5016 -11365 -13003 -12878 -15026 -12255 -11406 -9724
22323 -9724 -7159 -5751 -2311 -1532 -6877 -8148 6387 14530 6344 3344 6524 -3928 -10984 -12598
22309 -12598 -18049 -15994 -19355 -21259 -14305 -6026 -6091 -13478 -8202 -6061 -11707 -18402 -23589 -21275 -6693
22294 -6693 198 5382 7004 4590 953 -5386 -9409 -10538 -10724 -9699 -2115 -3823 -2006 -5761 -15371
22279 -15371 -10725 1138 5674 3538 -4832 -7219 -2863 -1462 -2381 -5382 -17414 -28187 -30079 -22701
22265 -22701 -9324 -2814 5709 9885 5227 -2071 -1862 -1042 922 -5364 -1179 -1611 -7815 -11917 -10839
22250 -10839 -8970 2064 6752 6123 -4526 -8559 -2528 -6039 -5986 -8530 -6545 -1862 -1191 2504 3540
22235 3540 -4602 -12455 -10863 -3173 589 -4752 -9297 -9085 -9637 -7534 -5377 -573 1170 4837 -3296
22220 -3296 -6542 -2753 2984 8546 5220 -3596 -1747 -693 9525 18493 18589 16788 16043 28067 40723
22205 40723 64268 85866 132304 202857 205386 143543 90046 53072 35025 33230 24659 19645
22193 19645 15443 12106 12425 9425 1207 1125 -9064 -19093 -13006 -9068 2246 3348 110 2124
22179 2124 4652 -3537 -764 -1526 3494 4855 -341 -4234 -2694 951 7077 5696 7025 6443 333
22164 333 -6669 -12521 -13366 -9540 6332 15428 3541 -1181 4749 -2251 1 -5596 -1285 308 2253
22149 2253 42 -3508 4841 8407 7828 1108 -3577 -2291 -109 10066 20341 13812 11192 6537
22135 6537 9067 8718 6185 -2423 -2313 4144 6873 9641 3894 7008 1677 -7110 -5823 -5377 -5952 -9513
22119 -9513 -6661 -3522 -6201 -4843 -2891 -3298 -3684 6168 2987 2797 1804 3998 7696 4840 3461 -3350
22103 -3350 -5476 -14086 -16589 -16449 -7667 -12935 -22141 -22838 -22697 -28077 -28822 -23390 -27693 -23961 -20661 -20451
22087 -20451 -8814 -5849 -12754 -15168 -14453 -13399 -1609 6937 -599 -3803 -2494 -3833 2853 4458
22073 4458 3381 3957 -2353 -6477 -11320 -13583 -11253 -13964 -18950 -11713 -10117 -6378 -3013 -7858 -16136
22058 -16136 -13328 -5253 -8398 -18843 -18124 -26414 -24586 -12493 -519 2377 -11611 -10155 -2682 3806
22044 3806 -1595 -3811 -7580 -3383 3729 6480 -5235 -8783 -1349 3364 3123 5194 3986 -4030 -10069
22029 -10069 -18906 -17524 -10202 -1675 540 -1029 2028 -2397 -539 -942 3947 7515 3829 10301 15052
22014 15052 22639 14367 -4193 484 10069 158 -6380 -9526 -11757 -11587 -13891 -12542 -2428 5344
22000 5344 4106 -6126 -7135 11869 8612 -2444 -13154 -22324 -23136 -9142 -7226 -7622 -1984 6936
21986 6936 9066 6794 10479 14641 10703 6967 6754 7445 805 -3686 3118 5401 2523 6065 4395
21971 4395 3569 -2243 -15630 -18300 -19260 -13354 -14101 -10366 -7916 -9903 -8439 -4953 -5884 -7311 -579
21956 -579 -4358 -2762 1789 -1726 -8128 -8138 -4992 -9824 -12022 -17192 -27621 -29403 -22472 -16900 -10976
21941 -10976 -5839 -1490 -1035 3838 -2913 -5403 -7604 -9960 -16324 -14455 -8063 -7450 -8525 -6248 4380
21926 4380 -897 -252 -4765 -1957 -7050 -5098 -3919 -10338 -11600 -5403 -7287 -2495 -8392 -14320 -15721
21911 -15721 -15596 -12389 -12264 -15381 -13875 -10317 -17390 -18452 -4927 -4043 -5324 7188 9498 -2689
21897 -2689 -1074 -3634 -11198 -12344 -13220 -11178 2498 11217 2386 -5137 -8212 2980 3395 924 6439
21882 6439 15380 12957 8566 8718 6313 1293 2955 -2221 -8981 -12053 -1023 6992 2940 -6741 -16243
21867 -16243 -23115 -25968 -21028 -15160 -6245 -9087 -8486 -10165 -7173 -145 3886 9223 9866 -39 2286
21852 2286 1969 -826 -4322 -6953 -4500 -2765 -8091 -4847 -6261 -6815 -6460 -9227 -9800 -6877 -4343 -2809
21836 -2809 -5355 -15127 -23047 -15622 -2554 -6338 -6130 -7409 2060 2168 -5209 -10488 -12421 -266 10743
21821 10743 9225 6019 4573 1270 274 2305 -4302 -13766 -17436 -19365 -11057 -3216 -3255 -5112 -12136
21806 -12136 -8537 -11547 -9485 -28 -2729 -5961 -2016 5851 8536 2772 917 5803 7778 260
21792 260 -6807 4223 466 -9925 -12335 -2736 -12276 -9873 -11618 -7617 -6503 -6695 913 139 4799
21777 4799 10348 17657 10605 9299 9667 -1414 2046 7756 1507 -9472 -10896 -10811 -13418 -11662 -11600
21762 -11600 -17620 -18165 -10835 -9026 -10533 -5621 -6145 -5555 -13529 -11715 -6284 452 1583 3884 3645
21747 3645 -5951 -902 -1395 -7247 -8246 -4855 -7437 -10723 -14818 -8969 -13248 -4713 -1072 4373 6618
21732 6618 3754 4088 -994 -2371 -4301 -530 539 3710 7583 7445 8200 -1698 1852 -869 -2340
21717 -2340 -595 -4896 -12687 -23875 -26713 -17011 -12118 -13510 -14353 -15750 -5167 2935 4904 6438
21703 6438 9729 14807 14658 12397 6788 264 -1528 -5033 -1681 -9382 -6589 -10812 -17327 -18027 -10120
21688 -10120 -8111 -9153 -6179 -7525 -8646 -7662 -5568 -3856 1009 6079 731 -3884 -7826 -10775 -12270
21673 -12270 -16359 -16076 -9736 -3443 973 -5814 -9997 -12070 -12788 -14182 -14253 -9531 -636 4465 9429
21658 9429 6371 3015 4231 -3246 -140 3053 5871 2871 299 1012 -4560 -6073 1641 8849 6826
21643 6826 4608 5820 3772 2580 7396 4777 1481 -8389 -2022 1626 -1076 -907 -1683 -6691 -11280
21628 -11280 -9374 -1744 -2688 8575 21751 1539 -11924 -23138 -23121 -12833 -10600 -11988 -1958
21615 -1958 -4278 302 3934 -8134 -9585 -6091 -8188 1815 3904 510 1328 2590 7889 3087
21601 3087 -1144 -655 -2634 -14129 -10276 747 4019 5438 15136 9162 -4195 -7973 375 -3364
21587 -3364 -11674 -11027 -12718 -10103 -4357 -5874 -1304 5064 3854 -6117 -5289 -2141 -3805 -6199 -8074
21572 -8074 -14494 -8533 377 5183 11947 10959 15170 954 -21173 -29441 -18368 -16569 -17459 -7580
21558 -7580 1543 9203 9794 3996 -3732 -3953 -12928 -8072 -4457 -11770 -4763 2503 14911 13104 13133
21543 13133 16252 10337 8652 -2409 -10129 -17729 -23061 -15322 -2756 -4694 -10749 -8795 -7172 -6189
21529 -6189 -3110 -8817 -15242 -7745 523 3487 -9593 -17074 -18296 -19498 -6635 129 1479 -3375
21515 -3375 -8889 -6642 -3420 4803 3946 -1039 -8759 -18080 -23487 -18828 -10299 -5781 -2680 1115 6182
21500 6182 -5401 -14982 -8501 -3366 230 -2022 -2925 632 12431 18908 21983 13962 -3651 -7729
21486 -7729 -8277 -13552 -16041 -6332 -1846 -9411 -9768 -6141 -2032 5523 6094 -522 1745 714 -6407
21471 -6407 -3044 -2291 -5515 -8319 -3187 -8099 -16395 -12175 -10258 -6483 -2288 2075 -2659 -9466 -8208
21456 -8208 -9654 -6433 -11409 -2548 5134 3254 -1081 -7263 -14377 -14150 -17316 -13008 -7474 -18682 -4925
21441 -4925 1761 440 -1133 -1723 -5873 4639 6724 -2903 -138 -9094 -16436 -15946 -19675 -17474 -8590
21426 -8590 -11326 -6438 2860 -312 -5290 -13949 -25492 -24825 -13334 -1718 2069 -5010 1753 9349
21412 9349 9159 12179 12681 5747 -1779 -1888 -1303 -7157 -5321 -5117 -8662 -7217 -7157 -2570 -1348 10573
21396 10573 7778 1068 -369 846 -7217 -7953 -672 546 -1415 -4965 -6626 1408 -4735 -21004
21382 -21004 -16012 -16367 -12455 -3486 -10218 -9024 -10500 -5988 -4806 -10783 -13846 -20918 -20632 -11737 -14620
21367 -14620 -20280 -17214 -10567 -9693 -11000 -5582 -651 -967 -3040 -3759 -3475 4140 2476 -7169 -7311 -4166
21351 -4166 -4300 5643 8499 -3745 -17862 -13324 -4991 2484 3013 3371 389 -5517 -2800 324 -5990
21336 -5990 -6464 -3557 4855 6396 4828 2791 208 4386 3162 -569 -4824 -7382 -1789 -4275 -15661
21321 -15661 -16517 -10030 2755 -174 2033 -968 -1557 2575 -1531 -3066 -9064 -17500 -13895 -13185 -13048
21306 -13048 -6662 -12504 -19961 -15913 -10437 -14897 -11028 -6839 -5062 -1238 -589 5046 1855 293 -2451
21291 -2451 -4794 3018 10545 10637 6716 -1350 -2869 6130 6485 1647 5867 -1159 -3830 -684 -1853
21276 -1853 -12094 -7592 -3117 823 -3059 -6882 -9390 -7655 -1811 -1858 1055 -7155 -9221 -5646 -3561
21261 -3561 -2330 -1396 -978 2831 -5484 -4140 -4889 -9676 -6093 -9588 -18000 -9853 -7521 -10037 -7658
21246 -7658 -2957 -2646 -6393 -4873 162 919 -32 -4861 -4707 -2021 -13028 -18090 -12960 -12229 -8876 1767
21230 1767 1393 448 4936 -6095 -7652 -8472 8072 17647 14036 9481 1378 -18423 -30208 -30453 -31208
21215 -31208 -27518 -20812 -5272 5076 -5223 -11710 -6528 -1021 9067 14308 7026 9345 7569
21202 7569 3448 -1731 -320 2545 7770 8222 3510 8055 15982 11879 10328 15987 17385 4654 611
21187 611 4485 1246 1724 -3137 -4362 -9374 -3452 307 -97 1226 -9758 -14870 -7060 -2921 1562
21172 1562 4866 7964 8049 9485 9576 12724 9970 8268 -866 -6687 3517 15539 15806 6281 -7718
21157 -7718 -15834 -15920 -15793 -12024 -21508 -19219 -14700 -12176 -6585 -12154 -19724 -14916 -16146 -12103 -6627
21142 -6627 -264 -3560 -12041 -18836 -15180 -5016 -4202 -9545 -12239 -19282 -21993 -14601 -7937 -5621 -495
21127 -495 -7872 -8748 -14152 -4526 712 -3281 -13008 -25228 -27110 -19830 -12139 -12653 -20627 -20915 -19465
21112 -19465 -19877 -8682 -3041 -9587 -14235 -12846 -9753 4793 1443 -1430 -5740 -5150 1920 1110 -6315
21097 -6315 -13168 -14516 -9663 -9010 -14695 -16084 -16221 -11974 -10517 -5283 -6971 -3099 -980 5007 10698
21082 10698 21699 12551 4646 8206 11926 15423 2906 -7983 -14727 -10446 -9851 -4252 14330 11174
21068 11174 10105 9810 1336 -2948 -5118 -7656 -4256 -1081 -4764 -12608 -6998 -3381 -1000 1420 4524
21053 4524 4154 2184 1824 5641 4157 1854 3256 6371 7001 1163 899 -5965 -12865 -13331 -6428 88
21037 88 3464 2522 4833 14098 7487 275 -8381 -10085 58 2215 -2588 -2514 7714 8873 6035
21022 6035 8508 13138 11895 5801 4618 3819 -2390 384 5131 -1149 6 4830 -6568 -8120 -899
21007 -899 -3633 -5150 -4861 -2472 -280 -6687 -6320 -6556 -2007 3064 -2905 -11698 -4658 -5180 -5041 -4958 -6683
20990 -6683 -3128 -7099 -13571 -7999 -5371 -3864 -1337 -2567 -429 -232 -10112 -13979 -9184 -272 -8236
20975 -8236 -12423 -4852 6340 8832 -3383 -4944 590 -1370 781 2722 6649 -4436 3643 14075
20961 14075 12778 22661 17458 3731 6574 14138 11381 8972 13066 12647 9297 15731 10645 11819
20947 11819 11108 10515 5841 -6351 -15196 -13545 -13078 -10153 -11477 -8425 -10898 -2254 -2276 711 2023
20932 2023 -3178 -12777 -11591 -15571 -15206 -12199 -17938 -13976 -4807 -4577 -6855 -4233 -6930 -16699 -14193
20917 -14193 -5099 1962 -8934 -11248 -7141 -7929 -10648 499 9507 2337 203 -3425 -12847 -5894
20903 -5894 5500 4026 -10391 -9980 -5377 -8740 -5331 -8654 -13471 -21013 -16867 -4218 -4143 1757 5096
20888 5096 4879 -1273 -2310 -1960 -583 -2009 -2724 -2568 -3139 -7032 -7135 -3837 -4241 -3194 -5061 -10279
20872 -10279 -13898 -19256 -14731 -2837 2505 2312 1000 -406 -9238 -20065 -10155 -4497 -9404 -4275
20858 -4275 3332 3310 -3492 -7789 -9674 -6627 -478 2617 13107 11171 -10087 -14982 -5809 4754
20844 4754 9039 10267 5060 -8210 -10797 -12669 -13205 -9271 -10593 -7436 -3017 -2219 -4656 -11161 -13509
20829 -13509 -18903 -11354 -5171 -19384 -22645 -20940 -18427 -11567 -2992 -683 -5494 -243 -4133 -11208
20815 -11208 -6504 6366 8316 3856 -2203 -4774 -7439 -15019 -9754 -39 422 -2716 1301 -665
20801 -665 -6903 -11226 -3023 -8210 -11106 -16633 -10120 -9487 -12112 -18121 -24459 -26221 -20377 -10782 -13198
20786 -13198 -11224 -4811 1217 -2808 -7146 -1088 -5644 -15004 -14759 -7218 -2893 965 -852 -2355 -4618
20771 -4618 -655 709 1114 -6738 -12277 -5081 -3022 -3135 -1506 -3535 -3139 -2467 4121 6420 4455 23
20755 23 289 -4045 -3910 2718 2044 1892 -1714 1777 268 -5973 -8068 -8342 -8126 -6060 -9909 -6861 -18738
20738 -18738 -29242 -28581 -28609 -16044 -13133 -9291 -10779 -2283 3892 -7489 -9637 -4818 -6514 -11166
20724 -11166 -9103 -7568 -12804 -19040 -16012 -9750 -4454 -11272 -17107 -27731 -25139 -29977 -30537 -12266
20710 -12266 -218 1797 -4246 -4996 -1149 13624 7660 7269 2773 -7487 -9369 -5162 -11948 -22013
20696 -22013 -22871 -18548 -13773 1962 18205 20020 744 -710 -4248 -10183 -11542 -10430 -3580 -1334
20682 -1334 -4663 -3654 766 1558 1779 7382 9880 8488 9389 12317 2514 1915 5779 1876 -2064 -214
20666 -214 2619 -470 202 -1500 7626 9064 9992 6083 -2262 -13816 -14155 -11800 -11828 -6948 -2172 -3252
20650 -3252 -6074 -9597 -10680 -3926 4690 5037 3133 391 -2655 -3532 1666 368 4189 2634 -4356
20635 -4356 -4607 -3927 -9528 -11822 -20440 -20126 -9168 418 3513 10138 16623 21760 18443 6613 -5193
20620 -5193 -5918 -4118 -6407 -4016 141 550 -1891 -7068 -11651 -15303 -17352 -12630 -8454 -19326 -19245
20605 -19245 -9279 5036 14985 10795 3033 1395 4224 -3724 -5990 -8828 94 2561 1943 4892
20591 4892 -4352 1103 13345 23365 17745 13267 -1060 -9003 -3463 4347 -2503 447 5091 6264
20577 6264 4925 -4507 -5933 -11402 -11449 -11951 -9158 -3521 -9507 -8797 -1037 -2913 -3871 -2409 7186 1709
20561 1709 -113 524 -482 -7357 -11447 -2924 -4947 -7448 -3222 2755 10609 8362 2677 -10847 135
20546 135 4296 11494 8787 4109 7984 11673 11837 4757 -6805 -7798 -6556 -66 4411 5435 1570
20531 1570 -1641 3674 8945 -732 -9929 -7556 -8721 -7703 -14805 -15788 -20826 -15546 -5034 -1648 -3675
20516 -3675 3205 7571 14556 7077 4293 -5923 -19112 -12393 5719 2870 -9399 -11211 -6756 3423
20502 3423 1233 -693 -574 1991 1019 -7691 -3803 2041 1935 5903 7046 7436 5512 5903 140 -11979
20486 -11979 -10031 -5814 -8832 -9822 -10054 -7742 -9078 -12130 4015 1367 -1686 299 363 7040 9165
20471 9165 6510 3597 2121 -1457 2562 8719 16762 18301 9696 12062 11433 5680 1515 5588 6714
20456 6714 -1803 -2227 6354 2773 -5527 1584 173 -1760 4442 -8379 -14385 -16847 -20797 -11152 -16659
20441 -16659 -18266 -10271 -1546 5212 4962 1301 5539 14753 11761 9813 3426 -7013 -3779 -13060
20427 -13060 -19384 -22281 -31183 -36490 -29250 -16764 -1074 3282 -2156 -4844 -5457 -10556 -6564 -4903
20413 -4903 -4816 -9482 -17206 -17867 -14206 -3072 -4000 -4748 -1056 -2759 -1745 -16411 -10739 -986 3758
20398 3758 475 -2756 -931 -3657 -2064 -5608 -4844 -9359 -8150 -2249 5282 11725 12207 10769 2582
20383 2582 -3638 -837 -1375 -3412 -753 -2744 -5876 -7795 -366 2504 7932 13171 4488 8433 12098
20368 12098 8037 15971 297 -9555 -2021 3285 7855 6772 2793 -2511 -8822 -19944 -13182 -5132
20354 -5132 -9111 -10258 -11104 -18874 -14149 -3866 2619 10344 6257 2819 1725 3414 2100 -729 -4367
20339 -4367 -5927 -6338 -122 -3605 -8104 -13487 -9606 -5953 -3416 459 -5990 -11695 -10305 2056 4463
20324 4463 -1882 -4873 -3832 -1049 -2236 -1732 -13 -747 -1845 6144 2508 1435 -1065 -3801 -1805
20309 -1805 -378 7007 6181 6584 8370 -1351 -4427 -12115 -9368 3289 -1065 -5243 -4942 1173 -572
20294 -572 1475 2924 -1337 868 5608 6836 3919 3027 -2050 -13251 -8517 -5389 -2111 -5721 -4391
20279 -4391 -2802 -3479 -5256 -6663 -12315 -16178 -12753 -11010 -6377 2042 -958 -5867 -7099 -1028 1089
20264 1089 -10588 -8823 -6487 -5262 -7433 -19809 -16135 -7738 241 -201 -4031 1861 7423 2339
20250 2339 -5876 -8055 -7904 -3950 -5497 -3441 -1401 -12269 -7846 -13328 -11142 -11421 -3676 -5373 -4307
20235 -4307 -11554 -20248 -17567 -15907 -16022 -9834 -6263 -7177 -8875 3825 4903 -2886 -10561 -13166 -9713
20220 -9713 -15394 -16314 -20004 -16160 -17762 -25392 -17811 -5052 -6207 -10843 -12194 -10441 -2980 4278 -4662
20205 -4662 -3107 13282 5074 -9077 -7031 -2846 2448 -5365 -3734 -8735 -10164 -7150 -9227 -12204
20191 -12204 -12532 -7405 -5451 -9914 -8330 -1997 2160 2744 6156 9540 314 -9188 -17430 -16989 -8434
20176 -8434 2001 -2027 -9881 -8787 -12151 -2815 -1521 -8179 -7842 -5784 -5014 -16221 -11980 669
20162 669 -1190 -17885 -22945 -14285 -9803 -6089 5774 13124 20621 24112 20522 15293 14079 23459
20148 23459 25094 12339 9816 8018 6214 14540 18316 9292 7029 7413 2905 1272 5376 546
20134 546 1614 8879 7042 -15 -5092 -4054 4823 6043 1653 -1479 -4117 -2499 -5452 -12238 -14490
20119 -14490 -10182 -10677 -12647 -10244 -3272 -6703 -21319 -21169 -6475 -4697 -4216 -536 -1730 -9653 -10771
20104 -10771 1897 8544 2970 -7825 -9231 -7077 -6156 -6877 -7854 -5335 -4214 -11049 -16001 -15928 -12140
20089 -12140 -12023 -4996 -945 -7631 -7151 -7954 -13032 -19383 -19828 -16586 -18075 -12935 -10178 311 4163
20074 4163 3265 -1152 -2638 -3820 4452 7449 3143 680 -5813 -5300 -5303 -12315 -10106 -101 -3341 -13973
20058 -13973 -10330 -6730 -4439 632 9944 6579 5623 9255 9204 2160 9122 11213 -3502 -13026 -2676
20043 -2676 -7945 -7227 -5020 -5110 3187 4584 3120 637 2485 -5503 -5504 -1412 -1792 310 652 8194 4438
20026 4438 2034 8189 6334 -32 -3814 3189 11770 10032 3804 -4490 -3946 -4833 -9420 -20094 -25719
20011 -25719 -24615 -19063 -8717 1126 13712 19935 12961 6075 1172 9276 4883 -2855 -2196 -6107
19997 -6107 -8518 -479 2880 5121 -514 -2913 -8638 -5960 -4847 -5837 5310 12630 7273 4792 8337
19982 8337 12352 6192 8160 6397 4134 5106 6596 9717 4245 -2353 -8659 -15139 -12835 -9366 -1106
19967 -1106 3655 13617 10240 -935 -5210 -2518 -2068 -3514 1960 6903 7464 3509 1987 1002 -4820
19952 -4820 -10649 -10323 -4558 -3067 -6351 -3575 5703 -1174 -8493 -10226 -9080 -5516 -2390 -2546 8
19937 8 -4206 5243 15298 19861 12918 6052 6849 15140 13664 14381 19108 14595 1435 -2618 342
19922 342 13289 14239 6216 699 -5136 -4009 -9870 -12132 -4644 -137 -2197 -3811 -3014 -7727 -3916
19907 -3916 3616 2682 11338 14497 16631 8148 2499 -4794 -12488 -11089 -9436 2671 12442 11731 279
19892 279 -6915 -5965 -3240 4245 7570 15759 18787 19860 23471 6409 -1251 -6202 -9415 -5866 -3930
19877 -3930 -2748 -7777 -15500 -19484 -105 8032 -4003 -3875 -4112 -5149 -3770 -5016 -2615 -8953 -4111
19862 -4111 -1406 10346 15132 16213 4337 5538 14241 22490 21474 16247 16734 4350 4374 12099 2153
19847 2153 -2011 -4076 -9103 -576 -734 6583 12078 11407 8687 6402 11282 3438 893 1966 16614
19832 16614 16997 3962 -6450 -1108 -303 2229 -196 2725 7054 8837 1710 -4975 -9584 -18383
19818 -18383 -13075 3277 8799 12121 11195 17201 7338 -1958 6900 4856 -2541 -6741 -7872 -7131 1732
19803 1732 -3909 -10988 -7887 -836 -741 4868 8624 1759 2197 9215 7804 7963 4296 6043 8650 -2119
19787 -2119 -3988 4900 9757 7696 704 -700 -3977 -8396 -2627 616 283 -9399 -18967 -8126 -1373
19772 -1373 7810 9039 7159 9096 6483 -5774 -16139 -16584 -10875 -9295 -2254 948 -424 858
19758 858 -1140 -6951 -11640 -6961 9858 9110 4035 7035 7154 9691 1567 4312 8084 7852 13468
19743 13468 18439 21897 11881 7405 16048 22276 18619 9808 9585 4961 7881 12065 11646 12447 8480
19728 8480 3330 4247 -1384 -11527 -14443 -5766 -2346 -60 857 840 8954 8873 7893 7371 13100 12361 13970
19711 13970 18335 18317 16368 23716 26350 19255 13586 11617 6744 13412 19904 15874 18210 17151 18629
19696 18629 11128 8959 16801 19707 24659 23797 22894 20664 14240 12032 11832 12546 10495 13718 6492
19681 6492 3346 -8209 -6215 -4372 -4704 10808 19614 14285 2548 6990 -65 -5964 -2369 1481
19667 1481 6893 -2841 -6999 -11260 -13309 -3374 -3728 -6717 -19831 -23251 -9551 -7206 2006 8713
19653 8713 6290 7552 14574 -1678 -8093 -6991 -3929 -5881 -2708 3899 14455 15339 7316 1738
19639 1738 2756 7140 7214 -3334 -5448 -3386 466 1003 -1365 -3514 -7101 -11717 -3376 -2600 -5898
19624 -5898 2309 361 -1044 -8711 -17807 -16260 -19536 -15320 -16284 -16044 -12670 -9771 -14446 -13478 -9947
19609 -9947 -7619 -11176 -14238 -13507 -309 9730 14000 19428 12409 8790 16046 11408 1571 -4117
19595 -4117 -6560 -2975 -751 -4171 310 -549 3693 2558 7014 11483 3476 -5328 -11022 -10059 -9066
19580 -9066 -2831 2836 6692 715 -15701 -18808 -9986 -10986 -17105 -17462 -21104 -8770 -2106 805
19566 805 -4927 -10184 -6692 -9136 -13222 -15953 -13158 -396 -5741 -9542 -5332 5110 8412 665
19552 665 3848 3378 737 -3166 1031 -945 -8313 -572 2992 -5109 -1329 8752 6310 -5674 -2004
19537 -2004 14923 14992 16470 15012 11332 5997 1099 -5402 -10715 -5321 4661 4327 -502 -4479 -1686
19522 -1686 5086 17729 18063 13766 9411 7046 -94 -4413 -508 -238 7788 12050 14340 9702 5837
19507 5837 -2481 -6604 -3479 -553 1920 5014 4722 13779 20987 21669 10400 3943 -1905 -7745 -9014
19492 -9014 8122 10067 9317 13545 13217 21832 26833 30052 29669 21183 16733 11969 8948 14409 9697
19477 9697 7471 4930 4598 2425 6764 12761 10965 2579 -6795 -6924 340 5788 3900 -5352 -2357
19462 -2357 1413 1707 9567 11136 2315 5449 11501 4178 -2112 -11430 -9027 -12087 -16895 -15545 -8026
19447 -8026 -10038 -5507 -3155 8546 8137 -5031 -17979 -8204 1734 208 -5913 -545 8303 3642
19433 3642 7791 8305 7415 15368 10722 2516 -81 -5531 -10101 -10690 -12582 -12733 -9663 -9220 -10811 -2799
19417 -2799 9938 17573 20268 17605 6461 981 3303 -6194 -17366 -7055 2812 6029 5353 6045
19403 6045 8271 6707 803 -767 -13 4712 19255 13679 6144 6276 6169 9134 8683 -1161 -4703
19388 -4703 3380 8973 4714 -2922 -12009 -6989 -5152 -7352 -6904 -7209 -8725 -3599 4011 6440 9897
19373 9897 11660 13009 8714 9056 12179 3068 -1902 1142 4318 6617 10859 18658 16016 12714 13426
19358 13426 17353 9994 3079 6507 13372 13988 7668 7003 10269 -91 -14201 -11817 -5470 -5097 3544
19343 3544 7444 13314 12897 4362 135 2846 3674 11132 490 -1472 -1379 -3938 2378 7947 4727
19328 4727 3867 7476 10133 7749 6582 -1890 -5664 -2915 12108 19244 17112 2793 -1342 2307
19314 2307 8316 4348 -1781 680 -1506 -7587 -9019 4273 1300 -2763 72 -895 -1096 873 6495
19299 6495 6797 6694 6949 -578 -2263 -11415 -8943 -7451 -7665 -2911 -3293 -4268 -2904 1067 5895 1773
19283 1773 7410 16814 7402 13172 20719 17660 24442 14235 -536 -5555 -893 -539 13 -6058 -5464
19268 -5464 -11733 -14614 -5012 1857 -1246 -3843 -4876 -1810 -1676 1179 5352 986 -901 -2835 -8436
19253 -8436 -5773 1032 322 -4079 -9956 -17238 -17383 -8347 2978 13185 11824 -1679 -8109 527
19239 527 1227 5268 9440 9594 8717 7928 5756 13119 17742 7732 -4268 -9759 -13685 -9373 -13841
19224 -13841 -2164 -4986 -666 -4480 -12376 -9143 -1224 2034 -5068 3636 1676 -3937 1849 4890
19210 4890 9625 19302 9750 9059 9708 5465 10759 4885 75 -2872 -6830 -5537 -712 4524 9514
19195 9514 5996 -3309 -8166 -3313 -7036 -3253 202 6831 10315 7161 11790 11565 20423 17242 5975
19180 5975 -1345 391 320 -4756 2048 2780 2639 6077 14324 9541 4784 9578 16234 4993 8293
19165 8293 11866 16581 16534 26060 26247 25897 29355 21501 12016 4394 -1934 -4205 8486 5821 7203
19150 7203 10239 8321 4818 884 -15163 -6032 8227 9014 3355 -751 4371 5208 10666 11466 8950
19135 8950 12307 18678 18085 13964 7697 16684 16135 8717 8613 16873 18688 12930 4709 -5092 -2137
19120 -2137 818 2058 7083 5341 -3983 -5169 -5999 -4671 -11587 -6984 3136 6747 2695 4263 3568
19105 3568 3180 5343 6476 7929 8014 8602 7181 15015 18914 7446 2758 12483 13185 14530 26427
19090 26427 25647 30356 26774 20975 15182 12449 14313 19042 15859 9322 8449 6039 10513 10964 3975
19075 3975 7381 9157 7910 9412 7315 1454 4628 529 954 8128 6311 2643 -1717 5504 7267
19060 7267 6672 2504 5933 10028 7370 41 8851 13327 16160 15892 9490 4963 6735 2574 -3240
19045 -3240 1681 3529 5284 4573 -243 607 7339 15218 16917 20977 14641 12774 12024 13369 14626
19030 14626 9645 3014 2109 6396 11277 16747 13655 36 -14108 -9522 5703 13922 5955 7382
19016 7382 15761 22648 32450 38659 20820 8625 7416 11938 11949 11958 21070 20712 21488 19645 9829 8015
19000 8015 6299 6143 5201 7108 8593 8547 14376 25422 19501 4425 8484 10325 5628 -3053 -4027
18985 -4027 -12507 -4167 6874 7911 14224 18196 11939 15914 21253 10654 4175 -334 -9740 -7626
18971 -7626 -9396 -10788 -9441 -1509 14495 24488 26619 19621 16329 11431 9561 7226 13206 19920
18957 19920 12183 16982 20403 7919 3536 12441 13850 11443 12205 1659 -1901 -5226 500 7742
18943 7742 19540 15815 16171 12847 16678 17194 16393 26624 26083 19888 8207 4882 769 -5900 -16877
18928 -16877 -8886 1840 10740 16390 13228 14089 19058 30282 19242 10117 3550 2140 -379 9786
18914 9786 12525 8132 14597 15642 28195 32753 23886 27069 24125 16503 18176 14158 7414 7189 9553
18899 9553 15146 16462 17188 11737 -1419 -4154 -252 1887 5684 12187 14595 20976 24148 22436 7713
18884 7713 7169 17225 11905 5855 15059 14966 21469 17083 10415 2697 3318 8822 15661 16759 15502
18869 15502 22015 22263 14009 6431 1428 10710 17042 24418 16520 7623 4359 5707 8180 6540 13379
18854 13379 22963 33444 35709 31738 36919 33839 25979 18896 15143 10822 14999 12334 5787 6964
18840 6964 13118 19361 14817 13955 15087 12404 9432 6137 12845 20460 23492 25072 14705 11435 20623
18825 20623 28876 35544 38668 35478 25500 16246 19672 37240 39769 31555 29567 28651 32520 43523
18811 43523 56074 60940 67432 77454 92650 112144 151689 202438 237459 255798 254322 250761
18799 250761 234102 208336 183058 162949 158448 168684 198393 239787 272159 281401 272534 246213
18787 246213 216430 180928 142597 112774 84122 69849 64126 56011 46194 28536 21764 20177
18775 20177 29770 33531 35469 33822 21968 21406 45237 79216 123436 146172 115357 78278 42170
18762 42170 31538 33018 42870 35132 30364 37011 29578 27725 33424 29653 20918 8365 413 -8580
18748 -8580 -4851 7502 19392 22137 22501 20006 25176 26093 17369 17282 15531 17119 20731 19785 23934
18733 23934 28114 24841 5725 8078 16954 27666 26859 27186 24844 15884 10794 2837 12864 15601
18719 15601 16463 20623 30983 34159 29740 20670 12950 11416 22028 27509 21463 23326 29612 27360
18705 27360 31313 27288 23115 23905 21002 17394 14048 19819 24035 24128 24425 19454 20185 22019 21749 19639
18689 19639 23951 31516 29142 24294 16029 27848 31949 25267 16375 21094 31525 26915 15639 16114
18675 16114 19497 16396 11354 17461 21584 20706 15866 14328 11270 13484 21084 20541 11537 11304 11734
18660 11734 7731 7167 19087 30954 35349 25321 14901 13065 17421 28702 24512 18228 18520 14521
18646 14521 15312 21258 27487 22467 23594 23934 24747 25608 28383 29274 32142 28582 28106 25094 20423 21342
18630 21342 13117 12066 16682 11432 13585 18657 20022 25705 29843 23871 18927 19907 15098 13235 19545
18615 19545 26224 23738 10922 10325 10825 11228 19504 28092 32822 33534 33417 25028 19486 17204 25394
18600 25394 35609 35663 26861 19606 12202 16620 15542 20201 29576 27331 25087 18943 20182 29470 30464
18585 30464 34074 36599 38726 32335 34068 39000 40571 32590 26330 28849 35124 30628 22768 22285 26825
18570 26825 35260 42914 55228 49241 45643 49013 40168 30294 30875 24463 23057 24200 39287 40795
18556 40795 36238 31893 26144 25438 18775 17664 20376 19791 27638 33950 33950 32402 32335 32197 24228 24266 26347
18539 26347 35737 44356 44971 48413 36600 22117 17593 24383 31210 29236 34493 43116 39567 44342
18525 44342 47551 44974 50420 48792 37795 31807 34041 38779 46168 57586 55930 61227 73271 74239
18511 74239 67852 75558 81033 87214 97389 100707 92259 88833 80005 75626 73819 66390 63260 66841
18497 66841 83020 105799 114022 108447 110734 114699 99379 90335 79405 69479 62568 65895 67442
18484 67442 73460 87037 94250 96295 94032 101014 110786 126301 135193 147586 149104 150142 149412 149769
18470 149769 148469 135370 128308 126847 118256 104238 104927 118035 127844 130434 127029 120235 110675 97122
18456 97122 94598 82155 82120 70902 52802 49350 48294 50718 44129 43851 47423 53174 60138 59642 61938
18441 61938 60709 52829 45466 42517 47810 51719 61076 58057 52064 48037 50290 59235 62082 55901
18427 55901 48071 47930 48581 56144 57970 61655 73314 66270 48193 35668 38214 39530 46760 44242
18413 44242 46228 56645 57484 52319 45369 46192 50230 52902 54952 44909 34548 40215 41128 52814
18399 52814 59166 66564 68707 72286 66546 69019 64252 54051 57220 64894 63273 68639 74359 87657
18385 87657 97737 109257 121131 137161 140015 131873 131752 144733 145166 129752 123444 113321 104186
18372 104186 97171 97374 86555 100863 120735 140834 147215 155567 161507 155853 143772 138029 130514
18359 130514 115187 89052 83440 83356 100145 105439 120351 129714 139587 149434 158954 156688 146827 151361
18345 151361 162397 163508 162476 165929 171957 187558 195068 197703 204084 208585 210928 218536 229431
18332 229431 230063 224774 213491 203690 201653 195398 189848 190603 188828 189199 194293 194140 193982 187597 186206
18317 186206 184109 179991 176753 181686 192478 193596 184680 179074 174983 185911 205912 211798 203627
18304 203627 201179 218309 225844 234039 234247 237077 244680 245028 242112 244916 255276 252877 244867 242570
18290 242570 248802 257338 278920 289405 293859 293766 293433 287914 287071 294766 307816 301291 296573 307900
18276 307900 314206 323838 348332 345904 348989 359226 360866 369012 396051 413713 428488 436563 459201
18263 459201 484809 517665 546124 581655 624844 668663 718391 765000 796542 835429 892189
18252 892189 958265 1013726 1066706 1114890 1163010 1225499 1283189 1356058 1446900 1537121 1651179
18241 1651179 1776736 1921412 2087892 2268618 2471457 2699578 2968045 3277175 3638544
18232 3638544 4052746 4581167 5285092 6240674 7579663 9533090 12432810 16704502 22667313
18223 22667313 30024094 37649557 44341484 48564731 48664924 45093402 39558783 33562748
18215 33562748 28668965 26127499 26499081 29747183 35122139 41173159 46477708 49336491
18207 49336491 48030828 43053784 36042715 28354092 21290066 15732615 11754826 9006140
18199 9006140 7115465 5786523 4832993 4128554 3598209 3186192 2854768 2570884 2322831
18190 2322831 2121814 1945216 1795959 1676601 1570347 1471025 1382576 1299356 1221755 1145391
18180 1145391 1078765 1028589 986813 957467 926368 891927 845090 786261 728317 667893 610632
18169 610632 561922 528626 502373 462394 418880 376924 339015 314239 301058 280441 258206
18158 258206 243509 231524 208436 189425 167318 165786 173376 172050 162505 153072 155564 169052 171397
18145 171397 154652 140122 133585 130776 124107 130071 134650 129918 132634 138334 139636 139606 150323 163393
18131 163393 164003 175479 190291 201392 217303 236668 252994 280771 317584 343677 392276 450233
18119 450233 514520 591989 693944 833573 1041503 1358075 1881933 2836641 4664044 8313135
18109 8313135 15227760 23295079 21777841 14129349 7806601 4476311 2849603 1945411
18101 1945411 1392665 1044715 804375 625640 499516 412855 337977 280873 238406 211494
18091 211494 200714 182045 157658 147697 144192 132085 119786 110392 106488 112532 114924 115144 106540
18078 106540 96754 91956 92528 97212 95674 89169 81692 76815 75723 73464 70767 69939 74629 66710 65287
18063 65287 65485 54998 32572 28058 33896 43684 48315 43673 38388 38819 41766 36276 31262 32888
18049 32888 26572 17792 14834 17157 19317 20362 16148 7140 1837 480 6412 9602 12947 17224
18035 17224 25041 26565 20063 12235 20261 17124 8304 8292 19927 23296 13116 13633 17989 16652 8516
18020 8516 13381 9240 9136 14965 9936 2759 3713 2732 649 -5226 -4202 -2650 -2098 3054 9879 2904
18004 2904 -10529 -16168 -21588 -15083 -4499 -2346 -5042 -5475 -13260 -20707 -31030 -29497 -18606 -10156
17990 -10156 -16690 -14649 -11842 -16635 -22788 -23497 -13822 -7721 1286 6676 16643 14470 -2180 -6871
17976 -6871 -9568 -1019 3058 -328 396 245 -2601 -2135 3991 9627 6436 11822 14829 10175 6242
17961 6242 7425 2804 2174 14123 25545 25278 24957 17674 17141 8550 2979 -155 -2130 -11000 -13630
17946 -13630 -14530 -17637 -17501 -9265 -5295 0 6736 7965 -4468 -8748 -16144 -5829 -74 1615
17932 1615 4506 -1351 -7616 -10049 -7198 -9511 -10401 -8488 2120 -3315 -6561 -6655 1556 6173 -9425
17917 -9425 -21842 -18915 -29342 -25306 -14706 -14268 -8625 -8389 -3073 3529 3882 4272 -6069 -8197 -17093
17902 -17093 -16522 -19145 -18149 -19790 -19239 -17373 -13367 -13611 -11287 -10952 -9388 -6645 4768 11708 1478
17887 1478 -804 5269 9438 5019 3563 -656 -11878 -12692 -8571 465 -6035 -14607 -16795 -11460 -3065
17872 -3065 -374 11903 8807 1779 762 -564 -2745 -6801 -10903 -16544 -20831 -17688 -16260 -11688
17858 -11688 -11465 -8557 -15321 -17336 -13188 -12857 -23824 -23636 -14217 -5742 -1048 -5249 -267 -3518 -12336
17843 -12336 -13168 -7168 -8985 -16452 -19113 -24855 -27327 -11143 -4971 -8131 -13630 -17500 -9651 -3732
17829 -3732 -473 -6368 -5890 -7112 -6598 -4234 -11621 -16773 -19469 -21513 -21669 -13193 -11968 -8987 -4083
17814 -4083 -7350 -15509 -16539 -13866 -5770 -10343 -12531 3546 16208 14314 3712 -6254 -11041 -7597
17800 -7597 5738 6811 2068 -3500 -9504 -4031 10278 14335 10416 1916 -1912 -6322 1225 2372
17786 2372 -5880 -8030 -11313 -9345 -7708 4112 -858 -8500 -2809 458 -3034 -1204 -4101 1404
17772 1404 1344 2544 2823 5587 -116 2846 9475 11882 4424 5225 6314 -830 -3909 -2886 -2562 9856
17756 9856 9466 -8931 -6239 -1198 -3291 5303 16320 14134 11620 1209 2489 -4408 -6752 1166
17742 1166 -3911 -2789 8293 5533 7388 2720 1480 -8356 -8061 218 6753 6346 3451 -5553 -6328
17727 -6328 -8965 -12843 -9212 -3756 -3330 -9014 -7276 793 10975 16422 14795 7697 -8188 -4842
17713 -4842 -2272 -7020 -18170 -12647 -1717 -1025 -10529 -4435 5658 11331 14911 13173 4233 -12715
17699 -12715 -21572 -17954 -4810 1948 3239 -4398 -8709 -6947 -1851 -15263 -8803 -8344 -15727 -9612
17685 -9612 -10272 -20395 -17990 -9810 -5080 -7017 -6176 -4282 -2948 1103 -1866 -10141 -5376 -5081 -8667
17670 -8667 -10143 1157 2031 -2796 -2076 4993 13965 15329 19358 25210 39310 38795 37542 34251 32533
17655 32533 46762 53456 55309 69006 78468 104031 118768 128605 134098 130317 140918 145466 137393
17642 137393 122361 100702 87623 80822 79968 80970 89609 102250 128393 165385 200812 235403
17630 235403 268042 276188 254904 224347 198773 177925 164935 165569 175287 200641 217455 232108
17618 232108 250500 256376 241826 212452 171442 121620 92065 79159 62766 51193 41720 41407
17606 41407 35635 24313 19401 16684 13267 15720 12386 7750 12203 14819 9179 5277 11000 12928
17592 12928 9509 12175 7165 6091 11061 9168 9852 2306 -6085 -8878 -6970 -6254 -4391 -3099 -5968
17577 -5968 -9980 -5847 -2243 -7688 -8292 -10238 -13902 -10916 1002 17545 11756 -1249 -7791 -9325
17563 -9325 -7099 -5680 -6056 -18428 -23893 -20949 -18709 -14834 -7665 4883 7850 7352 7786 -5336 -12489
17548 -12489 -15356 -14113 -9320 -13523 -13625 -8520 -996 3834 -4228 -17025 -13395 -7001 -8194 -2617
17534 -2617 -5778 -13657 -8326 -5243 3416 9732 12004 6349 9465 8211 12409 32790 59504 87688
17520 87688 100569 82441 66639 55952 44992 28517 18811 22648 24373 32047 40287 50861 75951
17507 75951 100222 96069 64711 36991 24578 16782 9017 11162 12087 8690 13131 5932 1615 372
17493 372 -5022 -5611 -5583 -7873 -4846 667 2203 1680 8709 10911 2286 4500 382 2053 8624 -775
17477 -775 -3036 1718 5382 1636 -10480 6669 16918 11689 1980 1592 17612 11901 3594 4399
17463 4399 -4895 -9914 -4232 1643 5447 11627 16808 14970 14758 18186 18335 6462 1714 -5054 444
17448 444 7497 10478 15993 22746 27764 48979 89929 121588 95526 55658 39039 21661 10556
17435 10556 12168 13940 8189 4223 10026 7455 5824 792 -2205 -2816 -14177 -6831 9241 15732
17421 15732 19885 23478 25131 20424 9014 10804 9177 1344 -3568 -11670 -15838 -10670 3144 14951
17407 14951 17143 21870 18371 11189 554 -7887 -4301 4601 14288 12713 -2748 -14926 -17021 -8205
17393 -8205 216 8720 9272 10701 9399 5920 16178 17032 6488 5776 529 3891 5353 2477 1279
17378 1279 -649 -10070 -12748 -10933 -13643 3599 19215 20607 18345 7303 2168 -3528 1977 9566
17364 9566 8307 -1386 3633 5551 702 2928 10588 14764 12410 9499 9405 8378 14230 13021 8141
17349 8141 7246 7818 7377 3744 566 7659 4981 -1026 126 -6999 -6275 -3204 -5211 -6502 5772
17334 5772 19078 16612 19910 19425 3940 3364 9059 7931 8275 12490 10162 80 1592 8015 10568
17319 10568 2268 -630 954 3082 10192 17163 14226 10882 13456 16080 9328 6530 1887 2208 -6638
17304 -6638 -3897 310 9098 8398 -912 4652 9003 2273 8151 18515 16713 18526 24575 18534 14904
17289 14904 17214 16541 12881 16985 13995 13882 13440 6605 6918 7336 10337 15771 13378 233 -3886
17274 -3886 -4206 3366 5489 6341 10709 9822 9836 3747 4876 11143 13693 19217 20768 10912 2677 830
17258 830 9303 5451 5747 12684 17275 14039 11568 4900 6164 22707 35995 28523 13914 7880
17244 7880 11853 13549 11005 5122 9639 4493 -2707 -12460 -2531 5138 7944 6152 4475 2801 -1010
17229 -1010 13231 24697 24836 20049 22946 20478 15324 17245 10700 17359 22662 34939 46196 44242
17215 44242 40063 37470 34110 46467 64905 63765 63857 62247 62418 59515 63221 68651 66406 56845 60942
17200 60942 61603 58476 55160 53995 47752 52175 56168 58886 50638 43314 36825 35640 35238 31890 22161
17185 22161 23061 22657 16906 10832 8311 15081 13187 12312 5467 9372 9268 7192 -3032 -7418 -5398
17170 -5398 861 -7173 -3714 2367 2576 3753 6048 3377 -1280 -2950 6745 19106 22573 28541 29612
17155 29612 25100 20337 4260 -4760 -5248 402 8271 9241 1565 -1053 -119 5994 16225 17703 16079
17140 16079 20285 20624 27312 25611 17722 22020 27724 23552 22681 22607 29973 33303 19406 10502 12539
17125 12539 8957 6140 5822 9782 17986 24200 20042 21390 20392 29747 32525 26782 19736 15163 15849
17110 15849 15873 23296 20391 11952 9443 14114 18640 16333 10328 7897 19486 14908 6107 970 5440
17095 5440 14157 11498 9110 5207 437 7514 -2318 6181 5939 -9600 -4180 10397 11396 17640 8437
17080 8437 6005 18086 20653 11843 9623 8422 6511 3434 1259 2807 3383 -229 -2040 -401 10644
17065 10644 15126 20522 23790 29538 30297 20516 14073 9774 9858 4771 10517 9840 15124 19803 16708
17050 16708 6191 8805 20879 20192 27775 28414 20170 8672 8028 18336 16644 13042 12253 16123
17036 16123 21798 28479 28544 29873 26460 17434 17801 7606 7880 17254 8000 5826 11613 19903 23353
17021 23353 21330 15431 14264 11915 5391 2449 8638 14849 10729 7548 22140 19473 12644 12344
17007 12344 15224 21700 25410 26640 21901 22408 17795 19537 18067 11872 11689 16866 6678 1563 -1733
16992 -1733 3923 15339 22461 19037 15464 13404 21349 25147 17537 9934 10715 18461 16629 19990 23837
16977 23837 16744 16881 21775 24394 15481 15686 11030 21712 32930 25917 13291 18038 17490 21274
16963 21274 25554 18108 8659 14053 24172 24891 16008 16572 14335 8451 6589 11038 20575 26781 23087
16948 23087 24077 22569 12891 12524 26387 35808 31591 29216 30688 30092 26614 24523 21873 32546 38200
16933 38200 32891 32137 33310 34718 37355 41359 53552 56299 62469 94195 129252 164708 214851
16920 214851 259652 301589 332585 321261 289574 251968 206032 165574 143611 154717 187636
16909 187636 230078 267397 300987 317001 300291 262661 226051 180436 134633 101613 81142
16898 81142 65932 55240 45714 35167 33522 26915 27500 26302 33123 35584 45817 45494 37985 33458
16884 33458 26908 23583 16529 15921 19102 10092 6982 8142 7182 13727 23577 26014 32263 37531 33776
16869 33776 31686 10979 7125 7923 17241 16695 8225 9962 14265 16318 15987 20515 32762 41015 43046
16854 43046 36353 28307 23347 23532 20016 23246 21893 27049 23108 24604 29349 27506 26345 33581 39496
16839 39496 37823 34278 33287 33039 33249 32746 37246 27514 15407 13070 23072 26362 23609 24501 26189
16824 26189 18228 11893 20041 28232 28519 21779 15066 11766 3295 10129 10590 12482 18177 16171 9977
16809 9977 15745 19259 17101 9640 -132 4729 6956 8327 5545 -1510 121 6347 5491 4936 18873
16794 18873 28724 25796 14271 15852 22440 16390 18390 24495 17383 18219 21910 26343 24680 24639 24102
16779 24102 22079 22807 20297 22430 21559 25620 33211 31877 35620 30329 26191 19257 19140 23722 31702
16764 31702 38815 38024 26080 27415 34864 31345 32283 33029 31517 44204 50502 54652 55332 50292 41042
16749 41042 42131 36816 33376 35767 42627 37702 39587 42157 39147 36565 35869 28021 32466 30722 21286
16734 21286 23450 37660 34472 28179 20363 14822 20317 28583 29260 17131 22547 23817 27469 28868
16720 28868 26816 26131 19181 12093 16717 20049 21612 17268 25845 28600 23345 25063 30413 24501 18469
16705 18469 25984 35490 26297 28454 27257 19987 24679 35039 46048 44335 37918 29857 28777 28366
16691 28366 23962 30088 35869 34390 34044 34002 27730 22572 28477 39032 45554 44184 45521 41137 40513
16676 40513 41093 41352 32605 35098 37840 48078 54013 54484 44816 34492 42557 44166 46257 48228 48503
16661 48503 48395 53183 47377 40504 35461 41161 47401 45184 35923 33471 39708 46751 54019 56919 55195
16646 55195 48652 50934 53392 46733 42483 51341 59844 50854 45222 40788 41775 44589 39084 45180 50989
16631 50989 50495 51923 44939 38945 45570 59924 63687 67802 76126 84529 78960 68903 75990 77414
16617 77414 77279 75607 73632 74337 72985 70568 64600 52914 55482 66309 73211 75255 73804 72876 67426
16602 67426 67273 62313 64916 63853 61839 59862 51476 59650 64078 60526 68484 63579 59655 59571 64725
16587 64725 66666 56445 54747 56161 61849 57311 58720 66452 70267 75225 72401 63337 63657 63287 66631
16572 66631 62742 70014 82612 91902 98054 98962 112575 113617 120238 113271 106424 100183 96509 88768
16558 88768 70581 63237 73214 65216 67301 85435 89607 90760 85533 82119 78208 80706 80044 69604
16544 69604 68188 72470 70372 62661 61601 61915 64160 71856 73773 72520 76831 83212 84644 92481 101897
16529 101897 117230 125517 119966 112517 92282 69380 62917 71108 86419 95580 104584 103875 112477
16516 112477 138607 157113 155921 150775 133103 104148 79419 64357 62620 60966 70522 74653 82003
16503 82003 104493 131196 140913 129118 124323 128300 131326 133568 119931 116160 112059 118170 130049
16490 130049 135149 146225 148718 151413 154915 166768 180863 193127 193539 194780 190345 184504 179134
16477 179134 173786 172884 176757 170863 167526 168658 165230 156494 147426 152477 155769 151833 147031 153481
16463 153481 158870 157633 155925 159490 156262 157605 164324 170462 178025 168917 171202 175995 178024 178371
16449 178371 182506 186692 186835 183797 194057 198830 200941 203470 206695 205625 201098 204588 211469 216032
16435 216032 226715 232331 235688 240998 248968 257065 258274 263803 270979 283875 291016 301360 287122
16422 287122 279576 288230 305934 317583 317216 323699 342465 342807 343062 342361 358997 367222 377269 396946
16408 396946 410044 411898 406564 411303 433701 445120 459554 479588 503870 528338 563519 603260
16396 603260 661633 748004 835426 922173 1018432 1118730 1200985 1254913 1308216 1390901 1509819
16385 1509819 1648920 1814556 2025733 2263496 2501866 2744855 3033700 3348500 3738234
16376 3738234 4310753 5155965 6430182 8417699 11660132 16989299 24974507 34024413
16368 34024413 41817662 49776202 56015924 54364976 48130719 41773943 34635099 27899445
16360 27899445 24311543 25187394 30318186 37344188 43574668 50252193 55219901 52425139
16352 52425139 45233794 37802368 29307904 20674416 14027824 9789747 7166193 5441342
16344 5441342 4274029 3458658 2890479 2498051 2230612 2053433 1916325 1775356 1626226
16335 1626226 1490259 1334156 1173742 1043182 941977 875005 828449 791926 780131 735460
16325 735460 667548 598626 519428 450711 394921 344351 306556 268734 238198 211119 192108
16314 192108 178239 167102 157395 156288 146790 147834 157776 163615 150720 136999 128298 119783 100729
16301 100729 78764 82007 90291 93787 94317 101102 99534 92285 77628 67260 54400 37906 31349
16288 31349 29988 19341 9784 798 -4967 -16261 -22717 -20456 -8722 -14220 -23496 -14223 -4115
16275 -4115 -11460 -7633 -10456 -12266 -11070 -16082 -23808 -22401 -19498 -13307 -15753 -16788 -9503 -10794 -14050
16260 -14050 -16252 -11230 -13124 -17636 -24087 -14554 -6198 -14672 -26662 -36870 -39788 -44697 -53880 -53420
16246 -53420 -53411 -48115 -46212 -41778 -48127 -39805 -38266 -40042 -39915 -40384 -36139 -25778 -16014 -20616 -24749
16231 -24749 -20587 -11418 6417 13229 13360 15977 20519 36450 29913 21869 19275 20457 33965 35397
16217 35397 37167 44680 45657 47152 44141 39713 32871 39363 35557 25175 11314 5171 14744 20474
16203 20474 19245 21414 11417 7026 3994 -8842 -17251 -14000 -2842 11800 3713 -1224 -2372 -6906
16189 -6906 -2311 13557 17450 14336 9893 7846 7430 851 -5512 -5423 -7210 -10451 -10212 -1934 -2009 -7092
16173 -7092 -13084 -17567 -21973 -18703 -3508 6834 11950 944 -4651 -1657 -3284 -15293 -14590 -17624
16159 -17624 -16602 -22168 -25920 -28122 -22213 -22105 -22868 -14152 -15471 -17893 -19824 -23645 -22062 -11844 268
16144 268 -1130 -9485 -5465 -15838 -19710 -12034 -52 1690 3976 -1943 -9146 -13976 -6154 557
16130 557 -3541 -9707 -19062 -21171 -17382 -13164 -15291 -15802 -17228 -14175 -7953 -6366 -11364 -2244 7472
16115 7472 1170 -4992 -12802 -8906 -4585 -5668 -12202 -17611 -20411 -12599 -15875 -3264 2436 -3112
16101 -3112 -6059 -12816 -17659 -11696 -11954 -8103 -2208 -497 -4197 -4279 -8267 -17783 -5293 3655 -4082
16086 -4082 -19079 -27586 -22853 -16562 -17269 -13455 -17134 -19319 -11529 -10682 -4711 -1708 -7363 -2961 2342
16071 2342 6278 -5414 -15377 -17411 -17449 -14511 -8250 -5501 -13228 -11764 -13407 -13120 -19867 -26730 -14878
16056 -14878 3554 6639 7888 1189 3019 8125 3104 -8684 -19380 -21678 -16670 -12269 -14750 -7095
16042 -7095 9742 9518 1365 1321 7611 6058 10932 5198 -4629 2412 -3864 -9146 -8377 -8421 -10092 -13305
16026 -13305 -10911 -472 2754 -5118 -9356 -2003 -5070 -1967 -2836 -3026 2396 6016 2840 -6721 -12275
16011 -12275 -14892 -11085 -18528 -22295 -16863 1451 10682 9587 2618 5459 -1655 -3732 -14039 -11828
15997 -11828 -8911 -13157 -18386 -20688 -6441 -5889 -12496 -10241 -7389 -14386 -14264 -1283 957 1185 -370
15982 -370 -7134 -9272 -16266 -17009 -12712 -8635 -5192 2384 10302 10592 2833 -3138 -4520 -9980 -23538
15967 -23538 -29235 -24461 -14428 -10987 -6721 -4790 -11442 -13405 -12340 -3660 -6276 -8527 -13015 -10500
15953 -10500 -7033 -10868 -7709 -9550 -14307 -8913 -3693 -2966 -65 -4865 -4270 -9317 -7591 -9188 -11588
15938 -11588 -9288 -14044 -10810 -14728 4431 15092 14788 9760 5933 5899 -3791 -7558 -3896 -191 2430
15923 2430 2608 6597 -3688 -7993 -5578 -1756 12743 15123 16631 16612 3421 -3278 -2901 -2753 -5478
15908 -5478 -5233 523 10972 7797 5886 11485 14663 9885 530 1784 6635 5180 -61 4066 1113
15893 1113 1061 -1441 5611 6877 -3616 -9371 -8648 -8305 -5058 -2922 -7425 -9933 -12088 -17194 -8886
15878 -8886 1848 6997 12726 9556 -3334 -10863 -13910 -7767 -7583 -9458 -13271 -13224 -17600 -13819 -1792
15863 -1792 1357 -4226 -6218 -80 9342 17187 16189 8999 6578 237 -5828 -1710 1822 1192 1030
15848 1030 -78 -2872 -6482 -5293 -3070 362 8409 7512 -2128 -11912 -11947 -16584 -20020 -14333 -11739
15833 -11739 -7552 1995 984 -3753 -8694 -1751 13343 18401 4389 1616 11260 21726 19143 19824
15819 19824 25945 25521 29300 38721 42812 46544 60782 86961 121475 164715 212797 263176 293874
15806 293874 280508 257202 227081 181060 149449 137003 144707 170571 205654 237924 278973 294875
15794 294875 277202 249617 222292 175958 125454 82658 64714 46265 30382 29474 28981 17008
15782 17008 7308 6290 5973 26665 37180 28951 24171 9046 563 -1202 370 2713 10169 9236
15768 9236 9029 6001 906 2535 13111 10796 10589 15882 19806 11549 4767 2961 388 2908 5661
15753 5661 12359 9588 13959 13593 7759 3750 1732 12851 14121 12762 14676 14692 7057 4799 9373
15738 9373 15149 10204 -1409 6132 6657 8871 13183 23390 20673 8448 531 9257 25093 25064
15724 25064 23097 21344 27818 16993 11045 14778 18980 10232 3498 4103 -1516 -5756 -1468 6609
15710 6609 11991 8606 1943 -1659 -5252 -5177 -8108 -4843 -5526 -6749 -1863 -579 4511 9442 164
15695 164 7809 1904 3600 3449 -305 -7019 -8292 -841 69 -726 -436 -9677 -8074 -9047 -7586 -8940
15679 -8940 -2483 1641 3207 9676 13849 12222 12162 9982 -2173 -9757 -5784 -4222 -2099 -2472 2706
15664 2706 5389 5896 -2862 -56 5730 19072 20265 12212 2933 -93 500 9694 11637 6730 4653
15649 4653 5812 9602 13017 6493 -4229 -2204 11969 9632 6552 5495 -3464 -6165 -697 -611 -1615
15634 -1615 -1794 -2525 -2021 -1268 3688 5842 7434 2496 -2210 -1636 6959 8418 5165 3527 446 -3329
15618 -3329 -794 1493 4763 12983 12028 4418 4869 12719 9309 11912 15474 12797 13449 19269 19551 10092
15602 10092 -5544 -6916 -3524 -8852 -3836 -8521 -12116 -4893 5130 10202 9451 8553 9058 4166 2116
15587 2116 -943 -1723 -2462 1596 5229 -2858 -4854 -2125 7847 7591 1175 -516 -1254 11573 20235
15572 20235 15860 18347 23591 17151 9470 16130 24533 29285 34840 24393 15999 16880 15241 13960
15558 13960 17943 21242 19961 16880 8202 -3502 -7164 -200 10426 19677 24399 20459 11710 4879
15544 4879 9770 9177 3695 -1024 -3197 -322 -2682 1699 -393 5177 2176 59 5843 5978 5478
15529 5478 6526 -3176 -4561 2069 8682 14674 11034 -1638 4040 7801 8275 6677 7272 4538 3985
15514 3985 2829 10532 5726 -5677 2107 11087 14661 9631 8327 5456 6667 15746 21973 16484
15500 16484 7088 7751 7525 4600 607 -2778 4093 7282 6899 5649 9352 8584 9101 3261 -1750 -729
15484 -729 747 -2620 2979 4634 7456 10178 12795 12667 21108 23180 16383 10067 8685 14242 15476
15469 15476 8027 1485 1482 7852 9241 13157 15980 13760 11973 17564 18402 14152 19577 15132 8050
15454 8050 3510 2713 2524 5969 4696 6270 11047 17795 17498 18161 11581 1167 6786 23838 28129
15439 28129 17703 15232 15970 15050 6152 2876 6077 4562 -380 -1994 -5988 -4792 682 16537
15425 16537 26930 29041 35735 26445 11566 6961 7612 4692 7715 13069 20930 27415 30538 33761
15411 33761 33519 18234 7181 -4288 -7627 -3788 7227 4916 2024 2612 6380 10135 16865 18957
15397 18957 8681 1869 12888 15131 14637 16284 21019 21874 12646 14798 20384 26034 19672 14958
15383 14958 9141 15275 4623 7339 9607 5231 11687 8454 4794 3037 14935 25175 25575 26634
15369 26634 22801 27225 32477 29748 27791 21785 21744 17725 18015 19441 18168 18980 22167 19831 19514 16940
15353 16940 25392 25355 19038 22797 19542 16976 9689 -2284 1345 9915 13046 14426 17559 21461 11849
15338 11849 14357 16390 14527 17713 16843 11562 11020 10353 18126 10229 11766 9329 4879 13229 13723
15323 13723 15919 19325 14076 18832 23208 22950 19471 22585 23112 17132 13321 17475 25890 34515 32056
15308 32056 30670 30930 23878 18180 15965 19686 21889 19749 19158 17910 15584 16295 15197 21037 32671
15293 32671 37882 38109 28701 26448 33688 27171 22907 17195 18420 21198 25017 16940 19469 29205 22027
15278 22027 16191 11135 14234 11754 9281 17197 24722 24618 19588 13504 17839 25458 34554 35974 37045
15263 37045 32009 28143 22698 12506 11445 17906 26213 27596 25586 19765 19903 18777 21141 25997
15249 25997 30006 21607 22150 18492 17826 23828 32621 38121 32342 17177 9813 8967 18146 14144 11160
15234 11160 16539 37569 38571 29848 33710 35823 30089 19950 24003 24971 25307 30461 33407 36124
15220 36124 35889 33475 28321 18221 20777 21961 16178 12307 8617 18014 21618 14999 12037 10182
15206 10182 12063 18990 30558 37969 28551 24509 31041 41088 36998 23815 15872 21971 31285 33838
15192 33838 27432 21591 22926 25710 26399 26334 37763 35457 30097 25048 18446 19193 22718 23467 30188
15177 30188 34273 31376 24355 22124 30844 25211 21979 21679 15813 18503 25248 37025 25623 15416
15163 15416 4147 11773 25916 28157 27935 32183 26318 15103 21791 16574 18018 27546 31153 38534
15149 38534 33338 31011 30012 32922 34064 37126 40652 29424 16544 19382 26608 29100 26680 22659
15135 22659 20881 19691 9736 16045 31638 30758 28525 37911 36797 32449 35473 29401 23861 31626
15121 31626 35574 21818 21626 31170 43117 39552 30452 29032 28896 40409 42279 46075 42758 38131
15107 38131 40924 35814 32984 30918 27595 28211 36223 34336 38871 38318 28010 31238 31427 27178 20141
15092 20141 19974 24607 28879 31867 35544 30036 25056 24378 32290 35241 28264 29075 26757 27640 29336
15077 29336 32307 32071 31682 20419 21486 26851 34776 42026 50887 37439 36452 27412 21871 26635 33638
15062 33638 36931 35355 31924 21083 26825 28477 30274 26801 29701 29849 34835 38638 32998 23834
15048 23834 21257 21380 24425 23053 24223 26812 25626 29462 32700 29673 24956 24216 22525 19632 32756
15033 32756 40258 46469 47005 50009 45512 41040 38092 38377 36962 34005 43489 39885 25201 22129 25629
15018 25629 23424 22785 40490 54209 50841 39369 43626 35246 36047 39586 30960 28506 30608 26424
15004 26424 25150 34965 41157 47586 45127 32910 32070 37798 39994 35448 26769 14323 19951 25763
14990 25763 26191 25395 25528 29146 32999 32811 30180 30661 38598 34838 33813 36960 42945 44541 46270 48683
14974 48683 50891 54893 50078 46759 45862 45967 41010 45094 45770 47869 41658 44818 48307 45133 37398
14959 37398 30289 24748 27609 18075 19807 29666 33467 42774 45523 38888 36681 37077 37689 32662 32104
14944 32104 52972 55298 43905 48015 51426 41149 29926 25853 31441 30689 35215 27092 28283 32931
14930 32931 32505 32852 34629 38473 41812 38789 37335 28865 26619 38430 35136 30663 38279 45671 42628
14915 42628 45114 43822 42809 43316 40946 37084 24373 33668 40538 39472 36490 41003 37724 45043
14901 45043 45736 41370 37152 34281 32446 30376 34304 43587 40840 35366 29061 21272 27281 18140 30131
14886 30131 36936 34245 32633 35162 48154 56500 53821 41798 33791 35600 36903 24046 21871 30800
14872 30800 35914 35885 38476 31784 35059 40766 39923 37870 45501 44229 40963 37602 35911 36535 32932
14857 32932 27351 20870 20548 27494 28694 28349 31308 30717 28900 34074 45595 42699 35706 32657 40901
14842 40901 56052 71140 64772 51056 40893 42248 35743 36368 37966 34944 36546 36488 27010 16453
14828 16453 16888 22718 18698 15070 20767 20519 20483 27484 33285 39542 40330 39573 37877 33522 35213 36995
14812 36995 36651 36175 31395 33856 43681 48103 50265 53278 45988 44736 46943 55409 48457 43645 37318
14797 37318 40965 51149 48541 47356 38304 35209 40309 38052 34878 41860 44889 42909 46483 44712
14783 44712 49060 42485 32893 37755 46939 59791 57544 43868 40329 35250 43683 58816 67869 56062
14769 56062 51704 57908 60020 50754 45259 59565 62760 57278 54123 52047 51813 49165 47833 41397
14755 41397 27932 24034 25971 16206 8299 21297 36738 32130 32398 35399 40619 39329 32703 30955
14741 30955 32535 26914 27966 33099 34771 24970 23431 23631 30760 39206 47678 37940 25270 25982 25900
14726 25900 32882 38448 41860 45715 40301 42176 50111 47779 54360 55381 58884 59891 56373 52889
14712 52889 55655 57316 48687 52662 51691 47756 46199 46357 47536 47004 48632 49792 49798 51974 49073 49099
14696 49099 49993 51861 53853 50110 50569 47144 52275 57571 66930 67361 60490 54307 67714 78995 70711
14681 70711 72484 72210 72264 73782 76833 88305 110277 138597 170751 202650 214666 204933 177127
14668 177127 147103 122085 103658 85863 72001 63275 60520 53058 53429 61248 60442 64245 67346
14655 67346 62255 51315 50669 58623 65005 57868 45818 42383 47728 57976 66732 69749 70836 73131
14641 73131 80061 86514 86238 91635 87455 79029 71946 77325 72924 66128 57469 48851 46671 52262 61325
14626 61325 61527 65593 62834 55647 58324 56043 50759 43608 39643 39947 39415 43984 45102 54321 62892
14611 62892 62838 55823 52010 56575 48662 40032 49187 59141 63767 64444 64278 68977 69330 56648 51996
14596 51996 56471 65926 64164 62819 60476 52294 58053 62364 54619 40546 38243 44052 39333 44430
14582 44430 49357 52485 56294 67114 66582 72423 73866 75191 87423 110498 126229 144496 148595
14569 148595 139235 124837 109637 92265 75480 68799 75022 69605 64586 63743 65534 62379 60642
14556 60642 68066 67590 60966 61474 60638 60693 63702 66084 63419 69840 66958 64716 71849 57015 48739
14541 48739 39029 41757 52227 60281 67320 60440 58539 60224 56618 50589 53089 64523 68398 67286
14527 67286 59260 66457 63880 65450 65890 59567 59580 60909 65519 72556 71612 65647 59937 59985 56941 58219
14511 58219 57509 62422 65429 62691 62499 67176 58189 62411 78124 74123 73522 72025 77353 76041 75275
14496 75275 80358 80331 71139 59899 65314 69414 62051 58858 68752 69402 63429 60927 60532 68048 85083
14481 85083 88300 79847 70834 73197 75231 78627 73324 72414 70711 68715 73836 76992 80509 83988 78804
14466 78804 81200 78364 69713 79002 82797 86289 96397 91604 76996 79463 78182 75058 87722 96442
14452 96442 97053 90114 79717 77237 82420 76945 84746 89637 88663 96691 100961 94185 90967 91438 91932
14437 91932 93765 104345 103857 104833 103495 94938 94814 97384 105712 118523 124050 118564 127561 145349
14423 145349 156544 165258 172686 179815 185369 190874 223093 269691 334935 423442 534183 660680
14411 660680 787827 892218 959639 959218 887062 785226 662520 538198 436200 360618 298461
14400 298461 257592 226131 199773 169891 155983 145811 134918 113244 97871 93184 94147 99678
14388 99678 102250 94424 92074 90927 95773 94691 101528 102198 101553 94433 82261 78668 85133 92514 94742
14373 94742 92140 85387 77739 76047 85684 90857 84685 85110 87926 88353 88715 102712 111178 107528 100853
14358 100853 109922 113081 102564 97605 97961 101687 96573 86746 84251 87694 96329 109987 108705 104890
14344 104890 105508 108518 104056 103671 95621 98919 104918 107702 102743 102626 101169 92056 95320 106889 109188
14329 109188 106998 104437 104828 98035 104528 109710 111490 112991 101139 98658 97260 107921 110047 103921
14315 103921 98518 93425 94006 103320 103459 100367 102048 107986 115929 117488 117575 116278 112598 111226 117532
14300 117532 122551 119862 106176 108512 103491 99332 108558 113055 112847 102526 94723 91385 101090 104511
14286 104511 98892 99693 92940 87423 88747 96318 99566 98543 98035 100452 105449 96547 91971 93513 92922
14271 92922 100581 95626 97188 104034 106904 124986 127941 132113 144854 144153 133936 124249 118767 109353
14257 109353 104222 113285 130782 136650 133819 139887 140857 133706 124919 127224 133617 135281 126268 120627
14243 120627 119486 119835 125354 116087 115377 123397 132277 137428 139816 141352 152918 160086 164258 172346
14229 172346 181350 184717 183603 177955 173370 179527 190435 192976 190861 185713 181678 175873 160765 160959
14215 160959 169225 178618 179997 188742 189936 186532 192025 198511 182113 177767 173370 162551 153069 147363
14201 147363 148437 155610 168624 170532 155814 150358 148137 152313 154733 156602 154780 159871 166426 162840
14187 162840 152591 151961 155776 167773 162763 159441 153037 152987 159809 165768 165068 165471 166424 172064 187581
14172 187581 187980 193032 198914 196647 194751 194398 198841 195183 193539 187130 188774 192928 191461 178582
14158 178582 179038 179032 173608 176076 175579 181063 196358 205656 196636 191177 184856 185462 175880 168761 166743
14143 166743 162471 166033 165655 162694 159869 159931 164472 165875 175957 189680 204942 214887 219206 218608
14129 218608 210138 213870 216835 212963 197960 200996 204479 196962 199400 193837 192127 187624 180857 187316
14115 187316 178988 166378 150443 148962 148691 149486 167029 175283 165961 171270 169816 169948 171229 174139
14101 174139 175630 191246 191608 188042 185093 191453 210405 232423 256594 283861 315337 342276 375030
14088 375030 396458 414449 427393 453080 485020 500125 493172 504416 506289 494080 479177 471557
14076 471557 468023 462885 464357 460509 454882 454695 447422 446763 449924 459211 459129 453599 440912 449032 438941
14061 438941 439031 441341 443657 451651 458740 466886 470616 470874 469415 472006 477494 479375 483548 495070 508074
14046 508074 523598 535249 554936 565393 568496 583577 605061 611099 616856 616247 626899 640411
14034 640411 652083 660123 680218 705485 726986 730758 734881 754265 768907 794089 808548 820720
14022 820720 827532 828919 839423 856724 881956 906323 934000 968887 995791 1013114 1034529 1059441
14010 1059441 1088791 1124538 1151461 1180949 1206797 1225532 1264911 1300933 1333352 1377012 1433052
13999 1433052 1504485 1572072 1643649 1717281 1798368 1870054 1945702 2030394 2117221 2218746 2347026
13988 2347026 2501073 2670450 2865400 3069431 3298651 3551393 3843608 4168393 4545188
13979 4545188 4977286 5472954 6059537 6749842 7566955 8553492 9750288 11188902 12888910
13970 12888910 14898948 17305145 20253719 24013539 29074304 36251431 46705542 61978635
13962 61978635 83148729 108781660 134094418 155499507 170459545 173151506 162334784
13955 162334784 143197428 118972737 92756625 69314866 51428097 38894816 30264748
13948 30264748 24212466 19815141 16478794 13863866 11740618 9959694 8491155 7287547
13940 7287547 6281594 5458891 4789566 4239796 3786716 3402155 3070777 2798516 2549685
13931 2549685 2335015 2153438 1983674 1837809 1696431 1561816 1448806 1349863 1247446 1147533
13921 1147533 1047588 950685 874682 813011 764290 725075 684418 653074 614243 579581 536089
13910 536089 488944 459414 421861 387539 370333 347626 316351 288672 272479 259824 244353
13899 244353 238918 237524 234197 219649 210464 203885 195635 178067 164509 151650 138109 127375 112907
13886 112907 100731 95816 91743 87331 78235 65198 53770 55019 50132 38028 26211 26770 18610
13873 18610 21970 26024 28487 36866 35086 38330 41881 39533 35856 21553 8533 969 3711 2147
13859 2147 -8067 -10099 -8967 -6595 -4985 -2505 -19004 -32693 -38600 -51690 -60050 -62593 -64122 -78804
13845 -78804 -81743 -87643 -81925 -78014 -79978 -80685 -83865 -93261 -92194 -76553 -67967 -58872 -47797 -35298
13831 -35298 -17411 -4588 -1575 -2000 2629 18038 32742 53103 54411 50608 53836 53721 54405 58246
13817 58246 62028 58270 53645 59295 66991 62872 62686 64892 77572 87525 81733 84664 86956 75895
13803 75895 71523 64199 57290 56207 51768 50377 57833 60540 54609 43235 39672 33490 20379 9414
13789 9414 4133 865 -650 -7576 -7475 -4114 1326 1670 8946 17624 22234 23624 23399 28546 22447
13774 22447 19921 13804 6291 7881 8256 -816 -8262 -7404 -16548 -25343 -16519 -5985 5007 6108
13760 6108 -5773 -10466 -8377 -2526 -3209 -15048 -25310 -36212 -42549 -38221 -35265 -33453 -30069 -30639
13746 -30639 -26944 -27098 -29206 -31885 -33165 -35331 -28295 -24955 -19483 -15066 -18813 -13749 -3422 -7829
13732 -7829 -16473 -13932 -7942 -6837 -6498 -2730 -8314 -15401 -14389 -5443 1714 6063 -1202 -10101 -9643
13717 -9643 -13826 -5231 4195 -1007 -11868 -24283 -20626 -15781 -7485 -7346 695 10885 17720 24643
13703 24643 21660 8370 7172 15174 13289 21 -31 3864 5199 -6293 -6851 2748 1549 -2738
13689 -2738 -13566 -21208 -19364 -17038 -26335 -31123 -16903 -7997 -10711 -11021 -12094 -13451 -2724 -2429
13675 -2429 4154 2577 -1650 -6364 -10225 -488 9458 5249 3050 642 -958 -6370 -11630 -11657 -12567
13660 -12567 -21250 -15771 -2701 572 1052 -6019 -13923 -18431 -22278 -21107 -30517 -28851 -19442 -10936
13646 -10936 -11355 -4074 6884 14865 20941 24442 26586 20888 7424 7469 5557 6627 10122 10355 9031
13631 9031 12785 12537 279 1255 8861 11811 5062 5058 5224 7410 2143 852 -1907 -4983 -11564 -14162
13615 -14162 -8414 3093 5874 12060 7507 -4775 -8395 -2097 -553 -8555 -9294 -4772 -7821 -2382
13601 -2382 -870 -161 -6329 -6461 -3119 7580 9470 11236 7492 6483 7929 11972 19335 15009 10859
13586 10859 7773 5015 6716 5300 14176 11215 9875 20075 28932 15694 9776 8359 12096 20230
13572 20230 25151 20696 14046 18015 13857 21436 25156 22403 13876 10813 17742 12856 11490 24478
13558 24478 36334 35729 21626 16620 17631 21523 22902 24786 23488 18787 18583 16713 18196 10975
13544 10975 16133 18589 17235 12755 16990 11956 15575 17567 18677 30879 28467 23961 20090 11653
13530 11653 13710 12034 13970 35931 50519 49281 49930 60883 58228 55844 54792 60102 62775 63181
13516 63181 69180 76507 85887 97084 107068 124919 140609 158362 181037 215961 264795 345146
13504 345146 444077 576541 720242 832678 919947 947028 895722 794521 670199 544598
13494 544598 421916 327372 255216 181975 130246 107999 91928 80067 69183 56451 56431 58325
13482 58325 49792 43828 30589 23968 23472 22682 20717 25621 31130 29785 29503 28848 34214 32628 27930
13467 27930 23300 26032 24426 18778 19041 20924 13711 15336 16923 28213 27996 27579 25995 28172 31025
13452 31025 23829 22394 18554 14838 25719 31750 31102 24464 19150 23499 26815 32313 32648 23410 24109
13437 24109 20019 20087 28716 31385 30225 26392 18749 18961 19303 25519 20476 15920 22499 26215 27376
13422 27376 20479 18362 19655 24271 24202 21518 23876 22794 27705 26837 23669 19386 16271 18816 28436
13407 28436 33617 24004 18298 15582 23552 21740 25841 20035 20320 34896 43254 44629 39806 27269
13393 27269 26764 19125 11167 20731 37074 38496 39352 36490 28394 26906 28272 28040 31077 35146 32823
13378 32823 25912 23879 24647 21407 14394 21262 30303 32534 40468 39175 38588 41681 40698 39398 35744
13363 35744 37866 34585 27572 38722 49467 53067 57204 58271 47834 41171 43493 37330 34326 47944
13349 47944 47736 44398 44618 43691 47172 53240 47575 46351 49173 50879 52697 54475 49469 49957 42346
13334 42346 43693 49406 44577 46842 52031 58995 64350 77164 64608 51049 53983 57418 54385 48790
13320 48790 44594 53718 50629 39348 38729 36556 48106 60288 70809 80020 75668 64970 61426
13307 61426 62233 62695 66981 75820 93390 121349 138606 148490 142758 120702 103196 88913 79304
13294 79304 70768 68202 63395 61840 69010 71355 65741 52559 55109 66046 67221 62699 63880 72285
13280 72285 78658 87309 90616 98814 109223 127217 149708 159140 165319 162683 161936 166639 156298 142645
13266 142645 123592 122602 128923 140695 144542 132029 111249 95295 87928 78226 70835 68318 70726
13253 70726 74070 78554 80034 79068 77685 86790 88712 96002 101158 104210 111933 116865 133957 154825
13239 154825 179264 199355 203038 183087 150276 122394 100627 94509 87255 84935 89602 100338
13227 100338 106790 100720 85349 74743 78393 80056 80897 70851 64251 62874 71190 79231 87197 83697
13213 83697 86941 87692 91277 96329 98497 101693 104288 98559 101662 113378 130093 141211 161271 186116
13199 186116 234509 341187 529899 756879 754446 549135 358074 250768 196706 176329
13189 176329 159969 147948 130943 110374 99543 97970 88875 82903 76573 74499 80728 82902 81534
13176 81534 88899 92532 93282 94200 83678 86505 87306 90228 97009 102316 89294 80873 85861 88656 93905
13161 93905 98789 105862 105251 112403 119122 112480 113079 109426 93797 66799 68544 83272 87161 102092
13147 102092 118973 131743 146096 159617 170717 199154 241185 295322 369873 494737 711537
13136 711537 1112114 1807475 2634400 2755119 2049426 1271788 785727 534819 406059 323411
13126 323411 263021 216798 164170 143927 145893 147637 141976 131169 128122 133096 135552 130841 131175
13113 131175 134795 121768 109482 108557 106887 105560 104892 98873 95070 97159 105406 99614 100285 97855
13099 97855 99569 109744 107272 95973 98650 102733 101741 97431 95925 98326 108175 122875 120182 112320
13085 112320 115471 116752 116959 112194 99927 92080 95961 103411 104975 103433 99359 105398 111899 116817
13071 116817 109828 108049 110024 109355 117483 127382 118460 121622 132264 142843 165578 189005 207109
13058 207109 233947 232077 194199 160898 159003 159851 161097 156451 140901 135272 127044 115201 120068
13045 120068 126603 137125 135981 131635 124140 117704 119753 126635 129118 128026 130114 122309 119050 141517
13031 141517 156523 155623 146408 135521 119942 109827 103576 93885 98521 108257 112487 111441 109620
13018 109620 111672 123276 132785 134968 132142 122582 112995 118290 121212 125271 117044 113497 122539 139364
13004 139364 134786 136497 158610 215008 248421 236189 183303 124695 97162 100817 105633 114683
12992 114683 134532 155719 171689 163667 153964 153352 154851 152692 148798 147793 140027 150533 154646
12979 154646 153546 148152 144318 146172 156332 160916 163249 156129 150559 150346 148485 159651 180495 190450
12965 190450 202819 214913 226692 241100 244602 243662 248735 237659 235469 233093 235552 227705 212981
12952 212981 208818 218217 229761 263554 277469 273654 268040 261471 257576 252928 250143 232954 206491
12939 206491 189047 173241 162094 156606 160712 173548 173044 170271 173287 179209 176818 178648 178379 177767
12925 177767 190740 193987 191736 208369 212349 201757 198785 201321 198525 187859 186105 182179 197273
12912 197273 223686 238625 255840 265263 272782 272615 272431 268506 267352 259588 257912 253269 241388 237188
12898 237188 238762 246464 258563 257472 250492 223547 206302 206768 216268 225891 245961 268901 287313
12885 287313 301878 288802 255647 241770 237075 224345 213058 211195 220613 227051 239009 259395
12873 259395 293317 324353 351860 349092 326588 307523 305688 312804 322706 337644 347622 337486
12861 337486 311551 294410 273787 243661 226815 216427 202328 207989 216162 229382 251582 266722
12849 266722 258901 219308 183053 186678 212487 243960 276204 308146 323627 321290 322532 330091
12837 330091 319459 299815 282130 261570 240281 237912 274514 324721 356045 382461 441179 562930
12825 562930 654130 645452 596382 642711 747215 785201 749452 735772 745188 737786 700918 682381
12813 682381 686988 695091 706470 716253 707415 699289 676955 659529 651246 648686 641129 644271 663541
12800 663541 699161 716646 687523 626765 585938 593595 620694 635021 636231 639298 635314 621423
12788 621423 614557 620137 631276 639509 643499 645013 644602 652563 689971 747874 780806 783159 768573
12775 768573 749556 749850 745150 750372 776273 826203 861584 884679 891478 894412 901563 917595 937027
12762 937027 958812 969305 972385 980639 989477 993646 1002177 1032579 1080850 1127652 1154737 1168161
12750 1168161 1194168 1258226 1311829 1315720 1302819 1313685 1343124 1370488 1392407 1412498 1431269
12739 1431269 1462370 1521954 1582707 1644942 1751949 1868035 1977751 2053975 2101924 2090955 2078399
12728 2078399 2121866 2217025 2352106 2517775 2704295 2902341 3089677 3261257 3513890 3858929
12718 3858929 4221016 4581446 4953833 5389309 5908293 6492888 7177211 8006767 9012963
12709 9012963 10162894 11440035 12945367 14830511 17265433 20500545 24957906 31279169
12701 31279169 40242901 52552190 71638648 105643069 169585617 284095375 439067505
12694 439067505 506249544 409319101 263030502 155580514 96829334 65916597 48507673
12687 48507673 36849288 27712936 20831630 16027960 12634255 10152195 8234112 6747898
12679 6747898 5668615 4903503 4305261 3791281 3387936 3029435 2685917 2340756 2073974
12670 2073974 1926089 1839008 1735147 1583444 1395092 1228684 1102018 1021669 945493 878256
12660 878256 803980 696136 554918 434086 335465 283472 271641 286924 283210 266850 251291
12649 251291 241382 213348 174818 135126 101897 71061 23940 -41892 -110095 -144844 -140333 -121382
12637 -121382 -120044 -134630 -145442 -134630 -128288 -144743 -169218 -181027 -181422 -186514 -209323 -217655 -211808
12624 -211808 -210182 -201683 -208486 -202962 -197668 -177342 -124932 -46040 55431 220742 467015 662770
12612 662770 557134 285128 83864 -2680 -36456 -65028 -100854 -133677 -144084 -144753 -138244
12601 -138244 -127295 -144037 -175276 -201291 -206833 -207468 -194520 -176338 -162521 -168217 -188908 -202780
12589 -202780 -219393 -230047 -228717 -236138 -242627 -253477 -262767 -276533 -285418 -287027 -291372 -298284 -309145
12576 -309145 -313991 -317076 -312458 -311025 -290547 -241171 -203374 -184110 -154073 -126689 -116797 -110072 -122947
12563 -122947 -128272 -65848 -14329 -45249 -64099 -45218 -21339 -20378 -26325 -32008 -25215 -24781 -30847
12550 -30847 -27583 -33652 -42505 -37872 -39788 -30531 -8761 32146 63940 62625 15143 -27038 -51710
12537 -51710 -41274 -22845 -28760 -39883 -52215 -61408 -72005 -101568 -123835 -139936 -157182 -160648
12525 -160648 -168335 -168833 -148408 -120447 -107251 -118646 -132398 -135575 -119154 -88601 -61354 -52105
12513 -52105 -48132 -42360 -39102 -49729 -71535 -96443 -101858 -102112 -119631 -135459 -148073 -147366 -135446
12500 -135446 -117756 -103878 -91608 -76592 -64905 -61290 -64961 -62336 -63512 -76443 -89713 -116466
12488 -116466 -141265 -159268 -163383 -151565 -144664 -152781 -157656 -155552 -149486 -147713 -137932 -117004 -98067
12475 -98067 -87544 -71173 -64576 -60204 -48978 -18065 28823 81768 117595 152751 190834 206612
12463 206612 184457 157311 123472 77153 24380 -26210 -55450 -63921 -63604 -60969 -50139 -37801
12451 -37801 -41953 -58742 -70510 -84640 -81871 -73246 -69310 -65289 -62484 -56024 -61595 -64210 -63726 -71880
12437 -71880 -78166 -85541 -89537 -88733 -89013 -86503 -102611 -108106 -106784 -112201 -120615 -116985 -120091 -117103 -117167
12422 -117167 -118225 -102008 -87272 -79879 -86109 -86723 -85337 -85204 -75199 -64000 -47531 -43792 -41833
12409 -41833 -30172 -8364 14866 8039 -25007 -54633 -61881 -56499 -44694 -47237 -47011 -49311 -29717
12396 -29717 -12160 7859 19680 22530 13645 -13692 -73730 -111415 -112217 -71306 -24361 -2250
12384 -2250 5651 20587 28346 24927 17952 20203 39500 41887 30977 32674 59707 97314 127367
12371 127367 153565 187109 196243 197097 204318 209019 165785 107015 49462 31965 24596 13136 92
12358 92 -1294 -3763 -3520 -3110 -11951 -10428 -3050 -5354 -9813 -14560 -11051 -9099 -16130 -21266 -25727 -39092
12342 -39092 -59829 -57217 -43203 -38603 -39827 -46882 -30313 3564 28327 32974 23486 11200 -12624
12329 -12624 -32010 -42725 -56306 -67464 -70423 -70870 -72372 -62759 -58259 -62997 -64883 -54837 -46028
12316 -46028 -42519 -46713 -43150 -34247 -32351 -43659 -51912 -51407 -59038 -72912 -65758 -58718 -46446 -44984
12302 -44984 -48895 -52001 -44971 -42389 -50657 -47649 -44919 -48460 -38711 -29743 -37167 -46089 -47309 -36359
12288 -36359 -18192 -3857 17639 40711 66730 91558 96348 70109 38005 12687 -14191 -34131
12276 -34131 -40149 -41844 -32794 -27706 -16481 -23112 -33954 -36569 -36739 -31432 -13953 8028 17897 18543
12262 18543 18907 27395 39850 61255 75331 103913 133933 169719 220349 312875 477599 782481
12250 782481 1354412 2215022 2708032 2228943 1426928 833563 503214 342100 251834 196509
12240 196509 156828 120973 93793 66335 22339 -11632 -37433 -49229 -53873 -56884 -52461 -53339
12228 -53339 -54521 -56287 -52487 -45065 -42500 -46838 -54049 -52472 -51079 -46932 -49326 -57150 -64388 -61749
12214 -61749 -56490 -48154 -51879 -59492 -61033 -52996 -50863 -44538 -53268 -56086 -56907 -53982 -46769 -51724 -57517
12199 -57517 -58091 -53998 -57072 -57146 -60782 -62357 -58811 -67006 -63813 -54165 -48451 -48548 -57155 -53473 -57728 -53194
12183 -53194 -46772 -49278 -58650 -61295 -67255 -63812 -49936 -54266 -59517 -57269 -52011 -40015 -35247 -42868
12169 -42868 -50075 -49904 -45522 -46991 -43733 -48196 -50955 -60118 -60166 -57040 -48740 -48293 -49937 -46427 -40994
12154 -40994 -42333 -40541 -28814 -31492 -35030 -32941 -36847 -45162 -45118 -47286 -49004 -44660 -43807 -39020 -37830
12139 -37830 -39163 -28788 -4235 18320 18930 12883 -14082 -30594 -25594 -24251 -24835 -12799 1792
12126 1792 12540 23276 21158 11541 5345 596 -13331 -14166 -24484 -34686 -34744 -28863 -28251 -28249 -24840
12111 -24840 -14731 -12762 -6531 1697 5014 -4226 -8808 -18813 -33444 -34261 -25193 -25528 -29603 -30794
12097 -30794 -27080 -30842 -33190 -40927 -38188 -34407 -38044 -30181 -29847 -33386 -34877 -34069 -35357 -38539 -52176
12082 -52176 -43697 -41576 -39567 -38150 -40937 -37247 -32943 -31417 -19312 -25177 -35680 -26974 -20681 -25222
12068 -25222 -22509 -19979 -17897 -16164 -15511 -15124 -17210 -14777 -17381 -19489 -24995 -32810 -38613 -34070 -45245
12053 -45245 -49088 -40078 -29754 -33478 -39216 -45439 -38198 -34105 -36539 -43944 -48161 -47844 -46043 -37908
12039 -37908 -29468 -21328 -12062 -12564 -13562 -20029 -32865 -34238 -30993 -30771 -25882 -28898 -25041 -20523 -21692
12024 -21692 -15517 -18107 -13377 -12722 -16552 -22018 -16417 -14762 -10954 -12997 -16821 -14151 -24807 -24133 -14908
12009 -14908 -10482 -14452 -8855 567 -2120 -4282 -3230 33 -2321 -7874 -6590 -14144 -22790 -24908
11995 -24908 -22109 -17985 -13008 -18766 -16824 -12001 -8521 2310 1412 3842 2722 -10612 -13167 -17828
11981 -17828 -12885 -5224 -5132 -12186 -22468 -15472 -10764 -12366 -14367 -10442 -9416 -14111 -9810 4707
11967 4707 3832 908 800 -2287 -757 -1745 -4031 -10312 -10006 -11858 -10318 -2999 -5250 -3017 11367
11952 11367 16383 15128 13589 9325 9909 9585 -1536 -11393 -7244 -7622 -9059 -7404 3774 10564 5160
11937 5160 4399 1689 4036 -8975 -8986 -1934 14491 15051 2457 4866 11049 6156 7190 8447 8920
11922 8920 11480 15257 14892 9224 9233 13039 1029 -8927 -6821 -7064 -8932 6481 10768 10794 15943 16769
11906 16769 23797 28538 25866 20868 18813 14759 9041 16044 20757 22021 20685 26471 23422 27347
11892 27347 20156 16238 13238 24605 24850 18393 16065 13976 23838 29342 23101 21477 11107 3941
11878 3941 14218 16618 7094 2226 7370 18038 23014 25284 19708 19053 18794 30112 37867 35322
11864 35322 21674 19451 19916 25930 21350 18028 25763 28231 20553 15269 21740 27324 34946 27228
11850 27228 30636 33548 37093 42222 47917 45331 42635 39308 31577 32892 38164 32925 27462 27781 32481
11835 32481 35158 34039 32337 32420 32376 23188 24814 39555 42250 40284 42634 44463 54692 58453 52462
11820 52462 40009 35680 42687 48235 47760 48196 47464 51989 63980 72195 70613 69350 58838 57318
11806 57318 57585 56223 49579 52470 52984 57417 65241 62209 69669 75244 65785 57505 49585 47289 54309
11791 54309 58044 61881 59431 54864 54603 60971 57419 62130 64405 60763 56086 47606 44337 47461 58859
11776 58859 60746 60122 64742 64366 61382 57292 64692 78441 78419 63636 60920 68290 69359 65186 56736
11761 56736 61221 76354 87972 79429 82905 84351 88135 85790 80746 89334 90781 87663 89610 95842
11747 95842 103234 103029 99955 93641 96652 100707 102442 86872 88613 93397 93613 95728 97589 99458 96417
11732 96417 105395 113977 115342 111513 113214 114014 115302 120366 127375 131944 125201 121575 118059 125882 138685
11717 138685 136406 133668 126756 131789 132343 131965 127745 122095 133327 133830 135300 140448 140132 144835 154450
11702 154450 153732 143234 143069 152084 164490 163004 163022 157452 144885 145073 145038 140174 145031 151904 159091
11687 159091 162484 161158 165982 162212 157706 160034 165496 158914 149733 161586 165329 172115 176947 173657
11673 173657 172501 176599 183267 184796 187556 186325 190484 186834 184746 192187 199043 202935 208088 208577
11659 208577 205839 203822 201539 207676 221014 215492 212304 224977 228130 225372 216684 227075 241599
11646 241599 240799 223974 214290 224070 234027 230503 236136 236480 238358 235713 246155 251995 257472 262772
11632 262772 265699 271633 282104 283583 280989 277731 279550 283300 279158 277944 281090 295603 305470 308984
11618 308984 308721 317425 327200 324932 322943 321593 333218 337431 331666 334496 347175 355381 369305 370813
11604 370813 369766 366915 367250 374048 382292 377486 388582 395117 400676 398643 399101 402477 414795 423369
11590 423369 429148 425756 432797 436208 447763 460571 467761 469171 486160 492294 490995 489965 494153
11577 494153 506074 513535 520257 521424 530869 539733 549325 555939 571684 584455 586745 592284 605270
11564 605270 611538 610871 611181 625338 637371 650243 654626 662392 682213 695990 705704 722001 736952
11551 736952 739637 735364 753647 761632 766993 779666 788883 802082 823720 845485 860766 877129
11539 877129 884656 886522 898599 917879 940453 953679 966162 982756 1003782 1025112 1037100 1045283
11527 1045283 1066862 1083788 1093456 1113606 1138144 1157417 1177263 1204675 1236061 1268895 1295665
11516 1295665 1308026 1313897 1338199 1370959 1392369 1415117 1452860 1479925 1499223 1531926 1574316
11505 1574316 1606516 1644658 1676406 1704361 1745453 1783017 1812839 1852692 1895120 1940017 1973032
11494 1973032 2014008 2056984 2097261 2144269 2191971 2240572 2285011 2338917 2398667 2454033 2516452
11483 2516452 2577676 2632889 2684524 2747924 2828464 2909426 2973438 3048157 3125319 3197972 3276185
11472 3276185 3339445 3424265 3522874 3615863 3709788 3811162 3911884 4023125 4128549 4230335
11462 4230335 4333910 4443884 4556663 4685524 4814504 4925581 5046806 5185479 5326193
11453 5326193 5468012 5618537 5769559 5909391 6047105 6189663 6336439 6496824 6670289
11444 6670289 6819790 6958652 7105257 7259628 7404162 7558365 7705116 7844478 7987668
11435 7987668 8126773 8263621 8387064 8512736 8623882 8706225 8785292 8856633 8918327 8966606
11425 8966606 9011053 9033256 9055907 9074345 9080787 9065192 9042501 9011726 8961650 8902669 8839104
11414 8839104 8766131 8674389 8568676 8451058 8331235 8208028 8079903 7943269 7803299 7664748
11404 7664748 7509580 7352135 7208628 7064977 6906497 6768303 6625059 6470614 6313877
11395 6313877 6152798 5990057 5843645 5707484 5565596 5428941 5288448 5153424 5027134
11386 5027134 4892632 4764216 4642140 4523929 4397478 4280420 4169258 4074921 3971597 3872484
11376 3872484 3775536 3686942 3594293 3506784 3422688 3343773 3264931 3179367 3091657 3011063 2937848
11365 2937848 2856714 2775653 2714641 2649464 2584509 2521314 2465073 2411187 2357342 2314682 2265809
11354 2265809 2218053 2172154 2122439 2070065 2034573 1992944 1944525 1898986 1860990 1828755 1782076
11343 1782076 1737664 1694579 1657856 1631673 1600493 1567546 1534007 1506825 1472313 1440933 1426922
11332 1426922 1406304 1383521 1351482 1335902 1309520 1266831 1238190 1207852 1187945 1168251 1143742
11321 1143742 1127399 1111029 1087738 1067455 1052151 1027693 1005344 980260 960067 945637 946821
11310 946821 938969 928929 917824 902888 889618 877033 861018 838463 827795 822417 806780 792961
11298 792961 776409 762563 750372 751774 745855 738991 729025 711742 694795 681431 682876 675698 655415
11285 655415 645781 635829 624229 625036 626338 624916 604205 584817 571464 565090 558808 548093 551107
11272 551107 549982 549188 545748 532486 521139 513017 509457 498726 487407 487615 484995 482439 483809 477420
11258 477420 460000 448894 444880 442273 443128 433806 431765 441191 443174 429964 418238 406948 401732
11245 401732 397352 393569 390805 384922 384064 381860 371219 365497 360152 357410 351674 338055 341834 340763
11231 340763 341442 347073 342774 343862 334078 325974 323781 322007 317898 308516 307447 299381 286801 286319
11217 286319 288112 287145 285368 275807 271812 274506 275320 265227 262112 263383 258069 250248 255749 261741
11203 261741 266693 263905 252860 247200 251896 256162 247916 235447 232710 239214 237460 224875 222108
11190 222108 221875 220921 225596 221610 221119 217227 199811 192394 194501 197953 198978 205313 202465 199194 200153
11175 200153 200384 201666 202220 189475 178915 193511 208767 207576 200275 190183 182439 183862 173829
11162 173829 172203 175310 183865 178739 175640 177534 172256 159760 142449 139806 149648 156797 160263 155357
11148 155357 155623 152128 152865 154980 139554 130550 131605 132157 137255 143560 149588 151520 145480 136268 131708
11133 131708 139948 151932 150451 141332 133975 130383 125985 124885 126493 132078 132089 130258 128253 130154
11119 130154 129198 123759 109597 104796 111238 112103 116151 118394 116833 129512 138600 143426 125528 122801
11105 122801 118016 114963 114305 105964 94692 92056 98726 99537 98675 109895 109387 98718 102424 103458
11091 103458 104146 104356 109394 103241 98728 101043 101234 98337 94550 96944 99991 93867 85348 90594 96727
11076 96727 91683 87511 87527 83814 89427 89370 81695 82022 84377 86103 89943 92130 100018 102204 88274
11061 88274 84380 72969 76228 83182 85948 93315 90695 88203 93768 88875 88791 84274 82525 79796 74639
11046 74639 77188 74666 77082 74230 74998 82163 90591 91131 89355 90363 90448 94719 100821 88984 84466
11031 84466 85182 97903 113560 120024 117683 120373 130317 140252 168025 207202 250451 338555 480780
11018 480780 648351 749522 743589 631167 482836 355800 260840 205047 185344 173256 161863
11007 161863 162482 157377 144986 137802 129152 118003 112981 102991 93602 90417 76111 62271 55114
10994 55114 61932 64112 57002 53252 55940 60342 58601 53519 51797 58703 62188 65719 65977 66352 66597
10979 66597 64662 67416 68149 65827 53682 50650 54670 59271 53855 57389 64371 59130 60428 65898
10965 65898 66262 70068 70441 63822 54037 49113 49339 45958 42998 43250 50680 51440 53863 65793 75839
10950 75839 75756 80190 91710 93542 93682 87186 80456 79848 80354 91052 102125 107773 111732 114525 108592
10935 108592 92577 77780 76443 78226 75144 75912 87846 88154 81324 67692 52767 46689 48029
10922 48029 52022 47615 49231 47689 31364 22991 24769 21923 29529 38064 42418 43119 40700 33025
10908 33025 28889 34914 31238 34047 31769 22417 27143 34614 33685 33121 36221 43979 40924 35150 30277
10893 30277 34403 38834 37125 31062 40195 40866 38111 39378 42267 48985 48793 37927 35854 46859
10879 46859 65270 58541 53358 47580 40091 35268 37266 42393 31560 25352 24910 35504 42157 35717
10865 35717 35279 36791 36243 38430 25848 11259 15884 27604 28466 34573 34471 29638 30562 26856 33423
10850 33423 45280 48457 42979 40763 37443 36826 37821 44075 41075 45327 39845 33702 32722 32699 33061 38818
10834 38818 37149 39849 45580 39312 30876 31298 39726 38118 33784 45020 46275 45431 38126 30449 36889
10819 36889 42782 35788 26111 18587 25348 32400 29976 30020 27664 31931 45802 48535 37237 28927
10805 28927 17819 13592 12142 10769 18561 22088 23682 29991 43030 44771 35296 35893 38030 41595
10791 41595 35528 35544 39951 28651 30001 32924 24809 19918 22181 23497 26476 36939 38633 30722
10777 30722 32595 23760 24046 21733 22362 26154 37739 46230 42371 38472 37071 27757 25500 38982
10763 38982 40231 32987 28923 16798 14659 24974 20653 23157 38426 42524 35351 28712 24436 30517
10749 30517 28923 20054 21316 25503 30712 22620 14801 9139 16946 17620 24134 40657 43079 29967
10735 29967 23914 20882 12553 10897 22227 34783 33027 27527 20387 15086 23042 31489 30317 27922
10721 27922 19278 18850 21701 28396 28538 28913 24100 32979 34507 39026 34607 35614 35645 32384 25412 25059
10705 25059 23076 16013 15917 19983 25430 24817 23837 23939 25641 25922 27513 32592 24735 20412 22419 22374
10689 22374 17210 25025 28851 31420 25772 28809 25446 20267 17746 24126 26945 36178 31419 19298
10675 19298 15019 21671 21944 24437 34215 31494 26195 23019 16514 13448 12545 14401 15105 19305 17461
10660 17461 24012 21310 22339 29289 26267 15454 7667 12119 13919 15209 13426 12754 17580 15696
10646 15696 10117 9962 21547 20975 21460 21512 21843 32988 35117 30209 27173 30632 29481 33801 38843
10631 38843 33519 26085 23852 20083 24723 29009 34749 46538 41234 31784 26680 15966 15062 19145
10617 19145 21843 15057 14164 18831 25661 26230 20996 17098 19900 30375 26901 31339 29659 23351 20073
10602 20073 22426 24476 29174 38667 38605 36210 25212 26984 23942 22061 17931 24540 23940 9628 15789
10587 15789 30416 34863 32651 31489 25204 18583 22302 22600 21774 18531 14319 10432 11202 20945 32906
10572 32906 36906 30596 23333 26022 35409 27934 15310 21485 35671 32976 33366 31217 25188 24138
10558 24138 25317 18246 15987 16918 22522 25152 29129 19247 12425 21747 19904 15552 14861 20889 20112
10543 20112 19049 24020 18673 16816 17513 26450 35693 29662 31283 30112 28127 35294 39985 33927 23075
10528 23075 18842 16244 14140 11282 17698 19516 26543 25294 19144 13552 17728 19292 8498 14455
10514 14455 25777 32500 29762 27209 32907 36276 38744 44970 52722 48295 45141 42803 37313 31552
10500 31552 30715 37365 33705 31093 25508 29582 37369 42302 35105 26086 22109 29309 39220 39438 32583
10485 32583 25380 21703 27851 30935 39312 46731 49623 55678 56893 52870 36770 32170 40080 41267
10471 41267 38663 30317 30225 41559 40803 39178 47533 52209 34394 23188 24104 26911 35754 39205 39523
10456 39523 37582 39260 52051 56985 50244 49634 42665 56086 63092 61127 61766 61691 59621 64216 70025
10441 70025 75838 70758 64434 65565 75499 84816 95386 113908 151165 198858 292797 462927 681465
10428 681465 832089 756524 538942 353584 231527 163027 111049 83992 70763 52743 45616
10417 45616 39466 33899 34134 40101 47225 49559 52415 57240 47525 45714 40114 39377 43026 50321 50817
10402 50817 45272 31097 24766 25828 26343 39234 38016 25655 27822 36733 34587 36756 48099 52292
10388 52292 47479 47950 38877 39995 45093 39373 35677 35675 33950 31136 28973 36373 35587 34666 33997 34322
10372 34322 39319 42915 36076 37128 41059 32443 34369 41635 45982 52589 48605 48162 48284 48889 56442
10357 56442 58691 54091 46985 43314 44366 40199 32596 28768 33885 27395 22574 25157 35602 31043
10343 31043 36085 37850 32596 40167 47764 53803 58995 55922 55676 55264 56087 50874 43452 49624 47176
10328 47176 43690 37746 37181 36235 34218 31152 35492 43418 37266 35596 51948 47269 46812 38571 38046
10313 38046 40262 38981 26142 26451 30010 35004 40430 48454 60237 64743 59944 61303 54848 46517
10299 46517 48218 45616 45326 44834 44125 51309 48971 37810 41087 38969 35186 35099 42624 54046 56336
10284 56336 51239 45073 53034 54210 49665 50978 52467 46458 34115 37580 45834 50520 53830 52358
10270 52358 57139 57786 48575 41316 37297 39176 39235 42482 44208 46187 39159 39938 41890 39660 37007
10255 37007 39482 36428 44566 53420 55327 60678 60136 53594 56403 62035 59488 51818 53165 59128 58515
10240 58515 47580 42536 50419 60419 56953 59206 71636 68282 74880 66565 60464 55294 51702 53372
10226 53372 58990 63143 64815 61035 56463 57295 59655 61347 64250 73564 73716 73535 72423 72531 71637 74370
10210 74370 69903 64145 74291 94949 113964 129928 149545 171217 178995 169532 142457 128597
10198 128597 131704 144731 164080 188562 212494 233416 257835 296839 322778 305973 257434 227030
10186 227030 213723 184414 154553 129979 108311 93210 81057 78316 85412 84786 81870 82368 80040
10173 80040 71739 60641 51113 47639 59906 63328 63034 61591 61005 53693 60507 64404 61407 70483
10159 70483 75327 65843 69451 73096 73027 74419 67501 64200 67851 71684 72338 69771 65838 59499 55900
10144 55900 59717 66823 68955 76687 77944 70494 67907 63331 67634 65958 60504 54248 60495 65422
10130 65422 62020 57436 51183 61295 70298 74668 68112 59080 66263 79223 76542 77986 81092 77805
10116 77805 75676 69287 70704 78686 80895 70981 63515 66806 75432 79044 67992 63472 65289 61911
10102 61911 72688 71304 67002 56638 57474 63076 53746 57872 68202 69947 70048 73822 73136 67169
10088 67169 68252 61509 60951 64116 65818 73912 73863 85483 81702 86322 90404 98301 93935 90745 93061
10073 93061 91417 80531 82003 86751 91778 99381 95700 92608 94451 85867 78774 83695 88239 85531
10059 85531 81529 89290 88737 78768 69606 65182 67123 76417 80251 89921 95185 100947 98724 106481 109298
10044 109298 104728 109671 121941 120982 115160 97066 89309 84881 75487 75715 81254 89630 97039 98156
10030 98156 95039 89294 87655 87635 94137 89237 77277 79381 80128 81251 79211 80243 83741 90750 100979
10015 100979 89680 79326 79324 80469 90486 95044 99391 102679 101306 99687 95307 93607 90440 84171
10001 84171 103709 106563 97192 100792 105297 107540 102919 94411 97962 98811 91405 88291 85259 84397 91831
9986 91831 101101 95910 88909 89882 101006 106620 103945 91673 90449 91489 85254 89877 92126 98499
9972 98499 106195 106824 96063 97292 98854 105861 110707 105004 109870 110470 105426 110490 116485 120857 125965
9957 125965 124555 109822 102425 104563 110674 106627 110016 119773 123624 108629 100506 108711 107900 113423
9943 113423 110019 106264 104736 109451 109159 112283 113580 111670 114559 113316 117403 118358 108773 98704 99806
9928 99806 102321 105675 103978 102497 105778 109383 105124 109456 110074 107424 115085 120189 123169 123634 116504
9913 116504 119350 127635 137999 136833 129672 127896 131568 140558 136522 132083 142163 146510 146453 160768
9899 160768 186543 231232 323536 437978 489222 432749 336519 249638 191698 159934 146059
9888 146059 144294 158672 159858 144300 146035 144266 139757 134118 132272 138360 138071 135465 141170 150195
9874 150195 143719 132805 127250 134636 136056 137765 136678 122572 130314 132095 133722 138795 141823 141020
9860 141020 140806 144996 150612 157567 163808 167837 172019 177912 178565 191323 225335 296302 420353 610606
9846 610606 783380 741897 550681 389686 293379 234594 196717 178425 176597 172432 166958 156047
9834 156047 153029 143513 142972 149851 148875 145600 135206 126071 131002 128000 125399 124513 121828 122272 128163
9819 128163 133983 137263 128751 127132 121762 123331 126964 119356 115325 112334 103707 98930 104372 112644
9805 112644 107385 101476 100128 96444 98020 108503 117747 126424 128374 122436 117734 115588 128666 139277
9791 139277 145853 134585 123730 122829 131240 124438 125738 136839 135446 128984 123215 126172 121698 113359
9777 113359 114335 111489 113505 117837 117614 107772 105601 111643 112412 122351 124489 129099 127858 120401 120037
9762 120037 127319 119746 112429 112363 114501 113310 116727 118567 116861 113658 107643 106843 101927 110690 113925
9747 113925 110138 103849 99851 98079 101703 99492 89309 84660 91236 92812 91233 96743 99378 116529
9733 116529 116097 103795 105555 109931 107198 109642 107364 107756 106564 96375 95870 90912 99118 95305 101651
9718 101651 115569 105133 96597 98403 88940 84943 85362 91492 101518 95388 90307 97303 99707 99934
9704 99934 100665 99547 100275 99809 90966 85062 87234 94852 91246 92934 92705 90670 90157 84972 81285 84854
9688 84854 86528 80732 87663 96738 96473 93453 92631 92233 93076 92216 89099 88016 87394 93508 94770 94450
9672 94450 93157 90306 84641 80076 76973 79677 89201 89433 92148 92068 88121 82627 81878 74041 74884 90378
9656 90378 92709 77497 74950 78564 71274 70991 71902 75653 71109 66853 69517 82806 83558 73778 70356
9641 70356 64637 75552 76806 71356 66961 64438 66595 62077 63486 73417 77110 84671 72764 61946
9627 61946 55429 54032 47061 46198 54725 57526 55890 65232 66359 66228 66927 61925 70461 78424 76717
9612 76717 59413 60685 70526 73622 80342 78936 65629 64172 66871 70063 74533 65927 58025 60227
9598 60227 58022 51859 49713 44566 48827 49575 49317 42336 36515 43911 41098 51879 55954 57533 60431
9583 60431 59567 58175 54973 50028 44472 53529 52083 39275 44212 41756 39128 41560 40563 30507 36606
9568 36606 37536 41880 43534 40149 29265 28655 31839 38912 38980 41871 40080 38869 36780 36732 41948 42643
9552 42643 40133 38000 38232 47163 47043 49723 40570 44361 49810 42523 34243 36119 34666 36801 46969
9537 46969 41171 27865 31572 44223 43859 38809 35941 45565 55482 48951 43747 45917 37850 36297
9523 36297 34975 32204 31739 20928 29909 39901 31867 33327 29302 21824 14283 24533 23204 20778
9509 20778 26193 34714 36685 40030 41475 28124 26780 26549 26996 31274 38270 38200 27218 32798 39174
9494 39174 40404 28067 20407 14874 15382 20237 31163 35248 31910 17806 19867 23138 14147 18495
9480 18495 16642 15035 16158 16110 18685 20392 27184 28367 27221 33720 34827 41804 36622 39137 39576
9465 39576 36254 32913 25931 14892 9250 16220 23413 13451 8001 9538 19771 19037 15248 18140
9451 18140 20125 11394 6970 7627 10950 6170 5677 13023 14388 6924 10176 14214 12098 10548 18320
9436 18320 15936 17399 14227 21415 27390 37377 42507 41926 32467 16002 17331 35752 41125 42584
9422 42584 42549 38935 29852 21785 13927 15865 19830 18763 24279 27233 15753 14222 2871 -1138 3920
9407 3920 9961 13867 27996 17317 5174 10558 16582 19086 26196 23414 21885 17491 15899 11999
9393 11999 3340 9133 18171 16133 12614 13379 13838 14530 5356 898 5150 15359 21150 21257 23897
9378 23897 21691 6445 1202 3021 4028 5797 11061 10974 15651 10177 4157 1708 2515 -4641 -192
9363 -192 1440 5502 7990 4901 14044 13618 3080 -10293 -5688 7006 12544 10639 14437 17521 14833
9348 14833 11980 14173 13806 8602 7420 7346 1415 -2110 945 6124 9151 14455 13857 10954 12432 21997
9332 21997 17708 11946 17846 16281 15498 19394 15681 7882 15553 17292 17015 17587 11217 2291 13026
9317 13026 18897 19184 21062 31611 40507 33321 17525 1545 -6222 1352 7191 8615 2325 -1777
9303 -1777 -977 385 5291 12498 13327 10167 13677 10661 11927 11832 15587 11302 10032 15127 9969 8921
9287 8921 12915 20022 14060 8022 10862 8722 4536 6833 8988 7431 25498 27450 24043 16334 8634
9272 8634 5389 4071 7753 11756 7660 10162 18552 23183 17600 9559 8613 6667 11688 24023 21900
9257 21900 26643 29645 22050 29676 39039 45987 53138 61495 70517 89149 107240 101625 90522 70671
9243 70671 51050 36793 26533 29196 24413 22475 26056 27976 28978 41581 58764 67528 80795
9230 80795 84993 85871 79298 70818 75828 66682 53491 47837 41689 46753 57173 56259 54866 51958 51422
9215 51422 67479 103447 144778 185011 221888 242559 239023 200407 155943 123124 91101 66617
9203 66617 63322 68589 65230 63831 56820 54606 57371 60909 66036 73675 76695 85983 97836 100652
9189 100652 86273 73627 58104 47263 31724 28077 18094 10606 10698 14643 22969 37123 45779
9176 45779 60993 93213 110021 115389 97557 64199 52709 44334 34817 21540 13171 -2531 -2777
9163 -2777 -1652 3153 8868 12684 7599 -3388 -12920 -1457 8474 15577 9978 -2627 -4784 -1648
9149 -1648 1106 2048 3527 6402 -2153 -9113 -5198 -1170 -383 3217 6538 -1571 4591 16592 13669
9134 13669 573 -3392 11354 10659 11787 10423 12911 22687 21518 24143 40956 45227 37001 15485
9120 15485 2340 8757 5153 -4049 -16765 -12206 499 4922 -4063 -499 6186 7752 3058 -2325
9106 -2325 1669 4037 5844 17731 11557 4699 -2014 -15111 -16313 -9401 -6345 -344 2232 5898
9092 5898 5745 3513 -2752 3220 3978 7348 12054 9718 11537 21344 42496 47150 15147 2914 2034
9077 2034 2694 -351 861 6115 -2116 469 4349 -218 -2891 -1000 6690 16866 13534 -561 5976
9062 5976 5305 6470 2181 -483 1493 5280 -1024 -13891 -18604 -10232 -7836 -9380 -12352 -8009 -9239
9047 -9239 -12139 -7960 -2726 -7760 -4863 -1483 -7657 -6796 -2557 -5340 -2480 -2710 2963 4362 9684
9032 9684 5690 -8413 -18437 -22595 -15760 1143 11698 19152 12825 -2151 -6302 -12580 -17018 -21832
9018 -21832 -25695 -17171 -9392 -6680 -7193 -12021 -18186 -9630 -2081 6742 10734 7084 -200 -8916 -16607
9003 -16607 -11389 -8211 -5482 -7782 -24572 -18259 -823 -4004 -7478 -7541 -12009 -11983 -7304 -10788 -6211
8988 -6211 -2150 -6173 -6941 -4314 -2176 -2541 -4488 -7063 -1956 5035 2159 -4016 -3480 158 -8019 -6425
8972 -6425 788 1608 3214 -333 -7853 -8203 -7133 -5390 -10641 -7853 151 1987 -6328 -11436 -6649
8957 -6649 -8332 -6472 -3989 -7705 -12415 -8211 -7508 -11892 -18337 -12819 -5745 -1964 2777 -7386 -14937
8942 -14937 -15941 -13125 -11626 -14888 -10797 -4948 -17681 -23760 -17960 -14915 -14538 -14116 -10452 -10597 -2754
8927 -2754 7179 14273 16997 1740 -15755 -16888 -8699 -6049 -16605 -17342 -18229 -7655 -4899 -19368
8913 -19368 -19883 -11239 -10667 -11908 -7122 2208 2678 -2018 1201 2982 2240 17687 16486 189 -1820
8898 -1820 219 4012 2664 8557 10348 15298 10465 10877 5489 9161 6416 6646 11048 6215 11939
8883 11939 19149 11491 14705 22946 28318 30582 51975 64544 65835 76982 88989 93275 94767 110396
8869 110396 131391 157114 178629 210414 271751 363653 509013 770390 1204895 1826506 2289057
8858 2289057 2122884 1535949 987003 626153 416780 289701 204402 148331 107643 90108
8848 90108 75705 65055 59929 49279 36877 31775 32380 34635 27890 16953 9258 8379 3663 -8452
8834 -8452 -11522 -6257 8206 4051 -1429 -2785 -7142 -15757 -20050 -17527 -9590 3476 641 -65 7772
8819 7772 9168 9847 11383 5835 11246 2475 -4048 -7219 -11388 -7880 -5297 -7014 509 -3874 -4582
8804 -4582 -8419 -9350 -17862 -27085 -29717 -26704 -23044 -15028 -12277 -14787 -18436 -15766 -6634 -3529 -5140
8789 -5140 -14174 -17208 -5690 834 288 -4752 -3732 -3530 -4208 778 -2899 -13161 -10426 -1538 3490
8774 3490 -16632 -18293 -12620 -9195 -5092 -4893 -12424 -15007 -13181 -14887 -13644 -13993 -9570 -13270 -18958
8759 -18958 -16890 -14049 -16897 -17859 -12684 -17744 -24537 -24724 -7352 -2296 -5179 -13263 -16963 -17085 -20468
8744 -20468 -21308 -14271 -15260 -9127 62 -3886 -8925 -3852 -10072 -19180 -19221 -17706 -18438 -14306 -8569 -7312
8728 -7312 -4408 -483 4163 -5907 -12738 -16630 -9471 -7252 -11435 -14216 -11700 -13736 -12048 -4308 -541
8713 -541 -7992 -5964 -5588 -12253 -14926 -8209 1588 7247 5550 1793 -8404 -15346 -14296 -12062 -5887
8698 -5887 -3832 -1389 -4541 -4973 -10603 -14514 -16317 -23706 -25200 -17822 -9550 -3134 -3416 -7363 -11722
8683 -11722 -17942 -19768 -12377 -5505 -3423 1726 4568 9515 13953 9278 8132 5062 661 -11759
8669 -11759 -13550 -14663 -19750 -19105 -9719 -4426 -9674 -20552 -15691 -2801 1633 -6231 -10341 -12126
8655 -12126 -12988 -12568 -8030 -7165 -6131 -3728 -7694 -6212 -9818 -4529 520 3519 4701 14105 -440
8640 -440 -3087 2497 194 -4525 -6359 237 7763 -8088 -9720 -15356 -13029 -8544 -4332 -2781 784
8625 784 -1256 -10487 -5761 -13046 -25669 -26789 -22581 -22295 -11413 -3217 -7757 -13671 -14594 -15491 -13369
8610 -13369 -8477 -4930 401 6494 1822 8803 7326 1622 -5178 -2654 2268 -4909 -2420 -1118 2199
8595 2199 3002 17420 27484 35228 30795 29145 26945 24707 25886 17284 10380 7470 4261 9114 16266
8580 16266 22895 27701 27702 23887 15574 6585 -1101 -5657 -1284 5827 12281 1442 -11277 -3949 3302
8565 3302 783 -7736 -6814 -11584 -11352 -8717 750 -69 1782 5422 7752 9249 15696 17078 17068 16033
8549 16033 14022 13353 15613 12347 11511 14514 10537 16102 15719 8528 2406 -3572 -3282 2969 4449 -7978
8533 -7978 -12945 -1510 11305 9635 -2286 -9854 -11453 -9991 -13113 -5823 -3921 -9863 -3689 6730
8519 6730 21818 39983 52573 59726 63152 53799 37079 22237 10414 4965 4911 6863 5905 4552
8505 4552 5748 2182 -2598 4225 1040 -5600 -2612 2229 6813 803 -3304 -8364 -13468 -15901 -14201
8490 -14201 -5833 1542 4285 7315 3830 -8100 -8443 -7913 -10528 -11286 -12937 -3104 -9865 -20049 -26436
8475 -26436 -16722 -3129 11534 9440 1651 3748 -1891 -11886 -9301 -8205 -3354 -3377 -7305 -4611 5775
8460 5775 12843 9722 6606 1102 731 -4622 -9774 -13551 -15176 -10156 -6500 7741 2077 7982 12817
8445 12817 3413 -5645 -7686 -7511 -1805 -3585 -11985 -18485 -14055 -12697 -12879 -15764 -19266 -13662 -3800
8430 -3800 -5057 -13089 -9789 -13096 -7777 -3116 -4962 -4946 -1090 3843 1313 -8030 -11291 -11244 -3925 -1714
8414 -1714 -7513 -3869 -52 4 -2273 -5847 -7000 -11158 -8246 -9812 -14827 -7139 -11425 -18055 -18137 -18940
8398 -18940 -8780 -6564 -5609 -10202 -15677 -23153 -27050 -26298 -19978 -18458 -14644 -17409 -21043 -23180 -17484
8383 -17484 -15863 -18775 -21525 -16367 -8272 -6785 -8468 -85 623 3853 14744 4841 -14499 -18859
8369 -18859 -21041 -17114 -15635 -9580 -6414 -2776 -5176 -19098 -11257 -10600 -17370 -15742 -11689 -2892 -8393
8354 -8393 -11860 -16242 -17604 -21200 -21295 -16406 -8310 -736 2475 3141 -3361 -12229 -11935 -10243 -11913 -17021
8338 -17021 -26429 -19136 -9728 -10884 -9544 1461 1037 -5002 -15234 -19770 -18844 -20453 -19085 -12924 -10566
8323 -10566 -13055 -16446 -18636 -19882 -9767 -11678 -18970 -28452 -26869 -21532 -23948 -22270 -20975 -24226
8309 -24226 -16738 -1538 -9635 -22555 -17985 -13222 -15233 -9299 -7232 -3769 -1896 -8349 -17761 -21155
8295 -21155 -20592 -19830 -13509 -18233 -20176 -10713 -6837 -11123 -11644 -14532 -13618 -20962 -32585 -27051 -24438
8280 -24438 -27604 -26405 -17841 -4692 -1266 2024 -1378 -8171 -454 601 -7234 -9062 -14010 -12933
8266 -12933 -12797 -6415 1931 -2599 -1203 -4494 -14989 -25594 -15287 -14351 -20549 -15546 -20132 -27044
8252 -27044 -29512 -21196 -14574 -12576 -13266 -13035 -18650 -20625 -28827 -35434 -23748 -21084 -19317 -24719 -17200
8237 -17200 -5575 -557 -7359 -12602 -37 6586 6458 666 -813 155 -2250 -5453 -9059 -4176 -6358
8222 -6358 -4067 -4490 -9292 -13355 -14657 -13242 -15260 -14006 -9624 -7066 -4889 -834 5227 -1998 -9406
8207 -9406 -10519 -9011 -8162 -29928 -34357 -25238 -24414 -17817 -22548 -20685 -13800 -21078 -24256 -15589 -8464
8192 -8464 -7156 -6888 1073 4368 5589 3628 3952 1501 -3235 -5647 -580 -2637 -4341 -5289 -8374 -8633
8176 -8633 -9960 -13872 -12881 -11269 -9806 -8387 -11843 -13291 -22535 -29826 -31052 -30562 -25538 -15592 -17780
8161 -17780 -22188 -20265 -23062 -15472 -5317 -2824 -2339 -5688 -10584 1384 5738 3321 1071 -10763
8147 -10763 -7432 -10646 -16681 -17370 -16872 -6661 -3890 -8973 -21356 -25872 -17313 -7536 -1642 1436 -10181
8132 -10181 -16072 -19237 -20830 -18197 -13492 -7504 -11144 -10178 -2583 -9847 -2637 5856 4769 3863 6108
8117 6108 2494 -1231 -4850 -11753 -13803 -13065 -6781 2677 2550 -1285 -476 -4019 -7367 -18091 -21898
8102 -21898 -15852 -21685 -28352 -18908 -7262 3663 13561 17651 6415 -4500 1174 725 -5460 -6488
8088 -6488 -8008 -12544 -9287 -7493 -812 9355 12667 11550 10461 2354 29 463 -4422 -410 2327
8073 2327 7474 3733 4864 7091 -880 -8094 -6691 -3603 -8423 -9443 -5885 557 4343 3843 -893
8058 -893 -778 -3797 -4298 4096 12799 8482 -3066 -284 -3135 -6072 3236 1672 -4433 -12746 -13604 -13023
8042 -13023 -18927 -14377 -5357 5588 -260 -3829 -7020 -1939 -2968 1473 6866 -4546 -6438 5653
8028 5653 11803 11222 3417 1416 -5446 -2426 -1788 5014 7369 7693 -7079 -1178 2537 2006 -3119 -8423
8012 -8423 -10958 -23294 -17922 7 9536 3534 1864 3316 1165 1751 8884 10504 4344 1706 3060
7997 3060 7707 2809 -1723 -1092 565 6972 3136 -3910 -13635 -15410 -5862 4111 8917 1636 -12093
7982 -12093 -10937 -6006 -7701 -14459 -10798 -5490 -15490 -23714 -18202 -4238 12646 6682 -5956 -5726
7968 -5726 -689 235 1592 -6678 -9615 -13461 -14423 -12005 -9750 -5377 -870 -5496 -18205 -28273 -21018
7953 -21018 -11877 -3611 -3476 -16655 -20329 -16366 -18567 -13412 -13109 -8017 -9230 -21866 -23613 -17721 -14109
7938 -14109 -24366 -20116 -19600 -15864 -9981 -12663 -18505 -18118 -17361 -6790 -3448 1157 7471 4998 4075
7923 4075 -3204 -5821 -9211 -6354 -3544 6271 8611 1426 -8244 -18980 -16502 -17357 -14790 -10544 -6794
7908 -6794 -7396 -17299 -14982 -7741 1078 3453 -1689 -6715 -13295 -15390 -14255 -13674 -11233 -5696 -7119
7893 -7119 -870 -1675 237 1236 -2704 -8981 -15962 -22009 -24221 -21579 -25757 -20512 -21876 -27421 -23355
7878 -23355 -8541 -1247 6461 12976 11240 11585 -1487 -9327 -13432 -17288 -21406 -21265 -15487 -16343 -18597
7863 -18597 -21388 -24054 -23038 -17624 -9865 -5092 -9829 -11049 -869 3041 5689 10401 5701 10639
7849 10639 8108 -4751 -14460 -15190 -12208 -5206 -1338 3202 1672 -734 -3675 3281 550 -8635 -3055
7834 -3055 -3889 -5452 -12092 -16291 -24325 -20742 -15609 -19069 -24810 -9888 -7209 -14875 -20532 -20268 -17538
7819 -17538 -25205 -21998 -17548 -11130 -8333 -8732 -9035 -11836 -9453 -7022 -4022 -4704 -7921 -9449 -4685
7804 -4685 -5920 -6954 -11480 -15425 -18605 -31097 -25317 -20360 -16485 -13887 -11813 -3390 -659 -4467 -2553
7789 -2553 550 1049 -1942 -1162 -1802 781 2147 -9079 -10953 -12526 -10564 -9338 -14010 -13297 -12011 -14473
7773 -14473 -18989 -19185 -20526 -22454 -24739 -14789 -12368 -6496 -2391 -946 -11369 -15001 -8109 -10242 -15619
7758 -15619 -14354 -15398 -13964 -12460 -8038 -2721 -698 5659 5716 -5890 -9400 -3364 -1152 -2458 -6894
7743 -6894 -8979 -5823 -4495 -6261 -8763 -25194 -28972 -18209 -15837 -21067 -25168 -20802 -17569 -14797
7729 -14797 -8458 -8007 -15479 -10291 -2529 956 -5106 -986 2249 -1652 -2255 -5039 -9860 -12089 -13277
7714 -13277 -10783 -8751 -7423 -490 3696 2236 785 -3774 -8277 -13021 -19344 -11815 -1890 -3962 -11802
7699 -11802 -13941 -17069 -24665 -26860 -27697 -16470 -2174 1653 3239 12141 13986 8728 2277 -2954
7685 -2954 -1544 746 -3062 -17965 -19784 -9981 -6857 -9818 -13050 -10427 -2882 -6678 74 2923 1541
7670 1541 -5720 -16920 -13073 -13062 -17976 -13867 -6209 -5439 -6352 -6512 -4332 -15392 -17597 -15665 -12336 -9673
7654 -9673 -16161 -19443 -17464 -9113 -5465 -2635 -43 -3542 -765 -552 -1439 -2938 -134 -1193 -236 -749
7638 -749 1381 -786 -1406 -2507 -22 2065 2371 -2305 -4711 1476 -4009 -6258 -5087 -9739 -8937 -10778
7622 -10778 -7413 -10482 -10093 -10660 -7677 -7336 -3883 -3068 -11285 -14829 -16699 -14304 -19715 -19472 -16341 -902
7606 -902 3228 -3104 -5216 -1305 399 -1395 -384 9912 8432 -1315 -6044 -7106 -11844 -18053 -19025
7591 -19025 -20748 -10308 7615 14953 9062 -1681 -8731 -14566 -17220 -14292 -17209 -18745 -15645 -13554
7577 -13554 -18794 -18101 -14239 -20898 -15255 -10235 -1716 -281 -12457 -8515 -7683 -7824 -3715 -8524 -13896
7562 -13896 -1788 -651 -1398 7568 2240 -11980 -15152 -11670 -3799 -2849 -2951 -13983 -18332 -18219 -12101
7547 -12101 -2374 4115 -3231 -4477 -1847 -683 6565 7657 5625 -850 -11106 -13856 -5211 -4970 -2312
7532 -2312 -6045 -400 7429 -66 -3970 -237 3440 3380 32 -10293 -16014 -12374 -13355 -16459 -15440
7517 -15440 -8689 -9831 -9768 -7283 -10276 -8808 -40 8745 11890 4537 -5030 -6019 -3024 3449 862
7502 862 -2487 -7441 -10456 -15445 -7759 -12062 -5240 -1519 -5074 -1278 -7161 -19375 -12383 -15022 -15370
7487 -15370 -12552 -8888 -3420 10367 5795 4460 4665 3023 5173 11739 9047 -1861 -9334 -11382
7473 -11382 -13237 -14857 -14654 -9882 -3845 -2131 1157 11700 6041 -3755 -1137 -2831 -6726 -12892 -9235
7458 -9235 -5210 -5420 -9718 -11853 -9267 -8413 -11559 -9632 -9944 -5681 -8815 -12275 -18471 -16158 -10087 -9241
7442 -9241 -14945 -12355 -5141 -1367 2032 8518 8423 365 -15903 -17912 -11126 -5397 -3089 4935 7663
7427 7663 6818 -3941 -8529 -14193 -25251 -22387 -23785 -24631 -18423 -15258 -17439 -17058 -8488 -10219 -16755
7412 -16755 -19967 -20535 -15817 -15241 -16145 -22117 -18683 -12530 -59 7151 6312 -104 -13190 -16490 -9702
7397 -9702 -9705 -9743 -3271 9696 3840 -16899 -19771 -11887 -7611 -2800 -1929 -832 -5547 -9124 136 2352
7381 2352 -4226 -2857 -1347 -4773 -14285 -10323 -5280 810 5376 6744 6159 -3280 -20822 -23666 -13308
7366 -13308 -7105 -4571 -8500 -5980 -5509 -4073 -3181 -1461 1359 3893 -1916 -7893 -7622 -3332 -600
7351 -600 -7864 -17683 -14586 -8132 -3414 -4976 -4906 -11130 -16506 -9436 -10541 -5174 -6194 -10475 -18694 -10608
7335 -10608 -15723 -16296 -14378 -10369 -7932 -4829 2572 9047 9058 4400 -3117 -6278 -10521 -13826 -11602
7320 -11602 -4660 -5487 -3922 -4428 -12007 -17859 -13290 -5667 1276 2689 -12798 -11449 -9248 -4532 -2761
7305 -2761 -8073 -14415 -10431 -5934 -14628 -17108 -8330 7745 11825 12792 14678 7248 2169 -3256 -8115
7290 -8115 -5511 1147 7166 10868 4072 -552 -1819 -2469 4537 6136 -8227 -17169 -20077 -12362 -2067
7275 -2067 1656 -4382 1365 1914 -7338 -10239 -11122 -14686 -21972 -19722 -12736 -9874 -12292 -13129 -6804 -10130
7259 -10130 -2772 -4653 -10271 -8526 -313 -6770 -11986 -12253 -13350 -9448 -9625 -12018 -17988 -16074 -7977
7244 -7977 -7355 -13757 -12602 -7171 -6450 -2983 3469 2552 -4276 -16924 -16686 -14424 -17035 -18441 -18641 -9326
7228 -9326 1641 -1364 -13395 -17084 -15446 1367 4000 -3148 -1418 -869 1100 5499 -5606 -11165
7214 -11165 -7311 4752 9714 8313 6607 -4773 -19415 -14807 -1943 7898 8159 4791 -235 4948
7200 4948 14932 17390 9673 3266 4069 9174 4321 -517 -1292 4374 3984 3286 2040 -8244 -5538 -9767
7184 -9767 -4010 -3290 -8405 -8168 -5007 -6690 -13164 -9333 -5483 -11602 -16072 -15080 -11150 -5693 -3667 -1444
7168 -1444 -1545 -5091 -10147 -12727 -10960 -6653 4956 7521 -4655 -9457 1176 5783 -264 -6065
7154 -6065 -9513 -10469 -15393 -18665 -9824 -7722 -8132 -11492 -10707 -1947 234 5168 1963 -4511 -7013 -7112
7138 -7112 -3246 40 1392 -8612 -10179 -6684 6253 16347 8583 -6174 -11421 -10278 -9622 -13254
7124 -13254 -17064 -14329 -11352 -11276 -10192 -8644 -3351 6640 8658 1516 -10732 -13827 -7112 -7283 646
7109 646 5989 -7633 -12967 -10400 -1348 -658 -1749 -5863 -8278 -2143 4511 12201 17011 16469 9271
7094 9271 12266 13985 7494 12032 16817 6146 -2677 -5245 -3369 -5840 -12017 -13371 -7530 -3917 -6527
7079 -6527 -2388 -11596 -15762 -19486 -17900 -14364 -11984 -11202 -6674 -5716 360 4732 -1060 -4805 -9191
7064 -9191 -9123 -11783 -6470 -3359 -5807 -5903 -6321 -2325 1955 2596 -9242 -13934 -12736 -17747 -5826 -2254
7048 -2254 -4829 -2058 -12627 -13229 -5216 2514 1984 -1069 -13785 -22452 -6974 4364 11019 7392
7034 7392 8963 -181 -8809 -9386 -11395 -12844 -8971 -4733 -433 -5363 -14067 -22064 -11321 -4556 -12836
7019 -12836 -13741 -5893 9474 10028 8703 2624 -894 -1998 4642 8068 2093 -3487 -6560 -9589 -22581
7004 -22581 -25005 -13116 4788 -6048 -10925 -13454 -17845 -20505 -10935 -6703 -9340 -18025 -12692 -2231
6990 -2231 -5655 -9180 -2393 4516 2985 374 -3057 -4851 -8254 -4685 -5739 -2913 -1901 430 -1446
6975 -1446 -12782 -7902 -10014 -7495 -14468 -18420 -14774 -21041 -18252 -5041 672 9112 7600 11298
6961 11298 -1748 -9542 -12389 -16134 -18375 -17659 -12813 -15357 -13680 -6095 -2393 5812 4135 2595 14549
6946 14549 11823 9281 6925 7076 3876 -3313 1842 7074 12287 -13 -8900 -6317 -7140 -8576 -3417
6931 -3417 3827 2252 -6044 -13207 -8699 -4466 3990 11593 12816 7239 -5484 -7994 -5176 -750 -413
6916 -413 -2612 -4426 -5040 -1843 -73 324 4938 13104 11737 -333 -1231 17979 25627 15064 11584
6901 11584 5702 -180 -3695 -1265 -1833 4219 9657 3174 1017 114 -5819 -4987 -1188 -9455 -13182
6886 -13182 -11552 -3366 -8718 -3437 -3344 -4401 -10068 -10129 -4965 -860 6694 10961 7555 7843 14488 3738
6870 3738 -5341 -2118 6320 1626 818 -1995 3347 2468 -4737 -3360 -2809 -3322 117 6178 8324 -2101
6854 -2101 -4963 -3764 -6934 -7927 -9128 3563 10047 -2251 -11531 -11306 -10108 -10959 1430 4526 6381
6839 6381 8258 -1802 -1195 3302 1132 386 -7375 -7376 -8201 385 670 -5345 -9716 -14327 -19677 -19704 -19684
6822 -19684 -20518 -22528 -16080 -7572 -8081 -17721 -22768 -17448 -13439 -14872 -7449 -2943 -4852 -12049 -18635
6807 -18635 -31027 -29338 -17552 -8889 -15298 -23034 -18061 -10311 -6539 -7500 1406 8107 4967 2597
6793 2597 -1473 113 4810 -7156 -4141 -7649 -14944 -13135 -16102 -11171 -8350 -11168 -9062 -14695 -13765
6778 -13765 -4991 -9809 -10365 -21025 -25371 -19193 -9775 -7712 -11258 -3345 2858 2542 5294 5010 682
6763 682 -3915 -2395 -3568 -3909 -13042 -5884 -6585 -15655 -13535 -4755 -268 4113 -238 -4809 -7389 -6307
6747 -6307 -8444 -6533 -945 -1540 -2531 -7170 195 4422 -834 4401 2204 -11575 -21942 -14256 -5442
6732 -5442 -9138 -14475 -11103 -8312 -13033 223 7622 7073 9529 5424 4088 7345 2552 -2549 -10813
6717 -10813 -14385 1393 7954 2866 -934 -8394 -7499 2358 4684 11421 4005 583 -4162 6345
6703 6345 3145 5 -464 5234 2490 -8614 -3849 4582 18552 15007 12838 8783 4719 -6023
6689 -6023 -1003 4487 4700 3469 -892 -1384 -2090 -230 -4281 -2237 2523 6604 1662 1016 5093 6629
6673 6629 12981 14473 12179 6515 -3969 -10073 -8414 -5253 -7204 -4413 -1449 1603 8774 1440 -13146
6658 -13146 -21183 -8875 -1755 3319 1790 -1651 -13107 -17386 -17223 -26447 -24856 -13331 -11457 -14326
6644 -14326 -15390 -11820 -7132 -5645 -6121 10694 11504 10255 4609 -3506 4729 10593 -4397 -17008
6630 -17008 -21735 -13784 -7276 -5145 -9343 -16781 -13062 -9189 -1486 4459 4555 9222 -40 -6199 385
6615 385 1838 -6078 -4339 7233 6419 5022 809 2151 -2225 -9771 -9987 3269 22469 29614 14234
6600 14234 2265 6670 5468 -988 -1730 1325 5746 1791 -1405 411 4725 6115 -5876 -10603
6586 -10603 -14676 -10486 -12682 -12597 -12700 -6768 -373 -12546 -21613 -18581 -9185 -8671 -4575 -11505 -22486
6571 -22486 -20945 -12412 -10375 -13899 -13700 -7182 1526 -540 -12932 -11496 -12497 -13848 -6348 -3488 -8628
6556 -8628 -8437 -12090 -10663 -7854 -4047 3623 10779 8497 2351 -2738 -12070 -16685 -21685 -18438 -4514
6541 -4514 2018 -2566 -8789 -10305 -416 -19 -2877 74 -4597 -7999 -5019 9003 19119 15976 10279
6526 10279 -391 1577 9221 11303 6139 -2543 -3875 -3603 1741 -198 -6456 -898 -2097 -2775 3816
6511 3816 10459 -2117 -15234 -10446 714 -5153 -15174 -15210 -9019 -9046 -16817 -23460 -18912 -7473 -4371
6496 -4371 4206 -1928 -5793 -8814 -4596 -2940 -2310 5094 5108 5935 325 -3995 -6768 -8703 -5545 -565
6480 -565 -6824 -4355 -662 2255 6472 4657 675 5038 4768 595 -201 -282 -2913 10634 18582 19355
6464 19355 14311 9214 2955 2242 6481 2124 -6529 -11072 -14427 -10409 -11608 -4383 -1345 -13249 -16341
6449 -16341 -10041 -7500 -9582 -9002 -9427 -18167 -16758 -7768 1086 3737 -1069 1529 -7551 -12564 -15720
6434 -15720 -10922 -4124 -9626 -10575 -4663 1503 7531 -2407 -10265 -1368 -11133 -14918 -3024 -4436 -13578
6419 -13578 -8051 1766 6709 2658 2836 -850 -7574 -7160 888 -1388 9330 7527 2915 5553 2141
6404 2141 -525 -10955 -6649 -275 -9766 -5000 4968 7420 7962 -605 -3128 -4273 -6440 -7709 -4628
6389 -4628 -2430 -5487 -18057 -16193 -8503 -6870 -3569 -3987 -8368 -2626 -1514 -8743 -5628 4223 4287
6374 4287 7142 8996 6628 -2395 1803 6304 7211 11155 6562 -4306 -4388 -5773 -5215 6098 9700
6359 9700 4962 5678 -1551 -7326 -10743 -14632 -24644 -20223 -6898 1117 429 -2930 -529 4648 6437
6344 6437 2177 -3550 3632 15602 16262 16528 12348 13458 -831 -5308 5512 404 -7062 -6585 -4848
6329 -4848 -13395 -18666 -13173 -10087 -5545 1572 -4283 -17998 -18551 -10599 -6411 -4719 9383 12562 12341
6314 12341 13876 9844 11055 8545 -1784 -1127 975 -3205 980 3533 6849 9222 6393 6634 3920
6299 3920 2382 -1855 -4151 -6853 -11121 -5657 -5977 -11725 -12923 -15314 451 -452 -5413 2875 6801
6284 6801 2341 1781 -6003 -12391 -9545 -5847 -8010 -6294 -1710 5579 3387 7135 12320 8619 4175
6269 4175 -813 -4044 -1499 -403 -1735 1592 7906 6913 3484 -1805 -4285 -3945 -4429 835 -1046 183
6253 183 -6017 -7908 -6867 4478 16062 11769 1456 -32 925 8062 13588 11224 5379 -1677 -10669
6238 -10669 -18742 -13287 -14914 -6980 -1292 -3622 -8075 -12037 -13102 -20877 -10251 -11258 -3975 -546
6224 -546 -1864 -5480 -10482 -23595 -31563 -21504 -2170 1011 -5044 -5556 -555 8757 16230 16793 8821
6209 8821 6103 -3645 -10156 -9685 -5772 7896 15361 14204 4115 -296 -8423 -6405 2326 3861 -11348
6194 -11348 -14143 -10383 -7053 -4085 -1533 7973 5884 218 -1110 2603 1180 -2331 -6498 -3347 2227
6179 2227 3715 12439 21399 20083 10561 2173 3237 73 2958 140 -3926 -6253 -10623 -7555 -9687
6164 -9687 -17100 -28347 -13840 -1680 -13571 -20548 -18727 -16194 -6650 -4137 -10469 -4435 -4704 4651
6150 4651 7096 476 1957 -643 -4937 -5136 -3503 -433 -5456 -15240 -11058 101 -1949 10380 10410
6135 10410 2413 3138 -1587 -918 -3488 -4853 -7209 -7124 -7972 -336 2050 -8307 -5055 -3088 -4377 5756
6119 5756 15090 12877 12338 9458 8766 15032 14304 10025 999 -5248 -13651 -18251 -13932 -2766 2533
6104 2533 4807 -7594 -20130 -12025 1705 6742 -3286 -7517 -6724 -1677 3088 3938 929 -685
6090 -685 -6045 52 3403 4258 123 -1837 -1662 -1229 97 9449 6593 1164 382 6856 19417 16516
6074 16516 -591 -9562 -12401 -12961 -8489 -5135 -2073 2506 5743 9553 10007 5343 9823 8477 7681
6059 7681 11648 9345 533 -9231 -11415 -11049 -14111 -12902 -8078 2346 10438 14707 4996 -155 8044
6044 8044 12816 11270 1128 -3208 -1433 -9080 -10540 -6878 7574 9391 16487 13902 12835 15716
6030 15716 3709 6405 12103 6241 3367 -123 1402 6057 4305 10725 12210 7629 3510 2359
6016 2359 6198 7657 8415 9677 10713 2316 -71 -2922 -2278 -5351 -8194 -15116 -15159 -8062 -2079 9352
6000 9352 9169 3576 -1765 -13536 -14189 -16712 -22887 -16395 -10521 -1244 1414 -749 -5923 -127 2531
5985 2531 -1983 -8411 -6435 -9481 -15550 -12810 -10090 -6109 -4491 787 -257 -2689 -4683 -3493 -8729
5970 -8729 -8387 -250 1662 3840 3938 -630 1680 6251 3409 -3702 2911 13293 15292 8054 8889 4411
5954 4411 -11539 -10375 -8257 -7700 -402 -318 -3638 -12545 -12328 -3807 -287 835 -2041 -2704 245 8356
5938 8356 12229 -4931 -16450 -10002 -3261 -4865 233 5437 15029 15149 11940 4085 4079 -451 -2373
5923 -2373 1089 4106 -4316 -5336 -5093 2187 -1492 6225 2242 -46 1377 -2234 5412 2498 -4627
5908 -4627 -9657 -15902 -17975 -15481 -2229 6843 -127 -14023 -15500 -12941 -11070 -12856 -3766 2355
5894 2355 10050 14062 6807 4408 2282 -6637 -9289 6024 3072 -7349 -13600 -8406 -6555 -6954 -1381
5879 -1381 -4355 -1872 943 5728 -7570 -6410 -1427 3695 6516 -6808 -11088 -5064 -2387 -4912
5865 -4912 -2801 -2952 -4559 -4311 -758 6422 14315 15469 12188 7533 10745 7326 1688 -5026 -10746
5850 -10746 -9606 -4331 -733 -3271 -1676 -634 -942 2351 2088 2834 4439 6792 4251 2641 2004 5962
5834 5962 5594 571 6892 17749 23618 22906 11254 -674 -6253 4025 9253 20213 29979 26025
5820 26025 13540 1478 9316 11267 10064 9725 6002 -7129 -2783 -1496 852 5147 5276 1394
5806 1394 1189 1723 13394 12878 8867 8361 -6788 -18794 -25080 -21567 -16778 -17646 -21039 -11195 -7251
5791 -7251 -11585 -8033 -1304 1039 -1757 -606 1246 4046 7369 118 -760 2879 2289 4768 9753
5776 9753 5581 5647 6239 3976 -2233 -1905 -4353 -6640 -13610 -15847 -2992 -1140 -12350 -14136 -3436
5761 -3436 4760 4289 -1895 -241 -1132 -780 8887 12172 7349 1855 1217 -3565 -6324 -8029 -10013 -11533
5745 -11533 -2789 -3584 -11681 -20108 -23486 -15585 -9825 1170 4982 12164 14629 11161 12567 8333 5709
5730 5709 5183 -658 -6839 -1956 1563 5612 9456 4981 15908 19646 4452 -6617 -13211 -9721
5716 -9721 71 1218 -1289 -3654 -786 4452 617 -6673 -2989 -1849 2767 1578 -1276 4323 12786
5701 12786 14837 10153 1200 -11260 -10810 -12176 -7581 -2189 2308 12 165 -4959 3394 18103 19383
5686 19383 5718 -3034 -5358 -8604 -5672 -7820 -15659 -17450 -11601 -14609 -21084 -22478 -14545 -4039
5672 -4039 -2468 -81 10597 13607 11043 7240 169 -2857 -8767 -6499 -1211 3221 3473 5902 15840
5657 15840 19239 22235 20476 15110 9396 7923 13667 7865 12581 3451 -5727 -9630 -3693 8302
5643 8302 1741 -1042 3747 8933 4427 -1170 -7277 57 -2760 -215 -3807 -4419 -2005 5116 5684
5628 5684 3403 -5353 -5021 -5594 -4474 2780 1690 4648 4039 7348 8017 3538 -5308 -4154 8870 15031
5612 15031 8987 11478 9193 5529 6324 701 3365 10563 7266 126 -10365 -8788 -4953 -3539 3203
5597 3203 4914 5588 -1845 8027 12533 5826 7705 9242 5705 988 2191 59 8302 8945 -5023
5582 -5023 -11871 -16031 -9740 5172 14695 14414 10001 3042 4235 -5241 -11797 -11444 -10003 -7491 1440
5567 1440 9761 5185 9227 9303 3295 8231 8987 5385 -118 -1531 -2413 3949 12441 9400 13315 15873
5551 15873 10875 2390 3230 167 682 3518 9037 3753 -5444 -2224 1991 -1200 -7257 -15519 -17469
5536 -17469 -7095 -4439 514 815 -3249 -3344 -1721 4215 1384 5186 13783 23436 18447 1243 -4266
5521 -4266 -13205 3034 7543 8776 11579 5980 -2918 -1441 -739 -7050 -3234 3131 9882 10918 6597
5506 6597 -4385 -1621 -307 8603 11902 12662 13040 14121 18282 19302 20679 13156 4505 2813 9581
5491 9581 17388 25246 23579 20844 11990 7742 7647 2586 2029 -2264 -4141 3281 7522 7508 -2854 -2578
5475 -2578 47 -1118 -8702 -7241 -9930 340 -2008 -6401 2761 7983 10872 6848 6134 7125 14806
5460 14806 15224 10946 2981 5184 1554 8128 7426 8639 8843 5235 2417 -4099 -11941 -13071 -17966
5445 -17966 -12266 4088 5293 13651 17976 15414 16111 11323 11836 6443 194 333 -752 2956 14901
5430 14901 17453 21931 12322 11909 10180 -3834 -7789 -7704 -2062 -2784 -6650 -4010 5196 950 4715
5415 4715 8945 3045 6645 12252 6225 2731 4991 2584 798 -2351 -8557 -8682 -566 5068 7867
5400 7867 11134 19130 18964 5394 6893 10933 10896 10122 5368 4404 3988 1529 8171 6348 -1431 -1670
5384 -1670 3875 6396 1692 -2510 2379 -186 -12499 -12593 -4839 10282 10792 4340 -3923 5625 8293
5369 8293 3516 -8696 -7629 3937 2551 6526 3494 6253 5366 -2221 -2674 -3252 -3666 -3840 5300 4391
5353 4391 6714 17121 14359 13083 4213 2390 2167 -2660 -3594 -8174 -1109 1344 -5089 -8993 -3671
5338 -3671 7261 3341 -1919 1403 -4420 -6448 -4257 -5749 -3084 2763 922 -5827 -12878 -16839 -1791
5323 -1791 1731 1960 9772 8827 5038 4882 9660 4270 -954 -3864 -4088 1372 5604 832 -6884 -10420
5307 -10420 2665 8651 11753 8612 14031 18190 19050 22976 11705 8795 11604 5831 5594 475 421
5292 421 -2237 -609 -5336 -1767 -1934 -3913 10396 11730 8821 10455 -2802 -13807 -16787 -11774 -7962
5277 -7962 5280 10638 20392 17094 3811 -3248 8655 7091 10802 15944 14004 20547 21820 17029
5263 17029 14391 5427 -3815 -7221 -1334 5944 1255 -17 4339 13451 14548 10094 -2433 -5545
5249 -5545 -3806 -62 710 -3141 3492 1674 4578 973 -2630 -3914 21 -4680 -1078 120 -10203
5234 -10203 -4068 -275 -1015 -6769 -14935 -13603 1096 11458 6026 1874 5404 9546 6772 5208
5220 5208 10614 11189 13413 12162 -1635 -9625 -4855 -2354 3232 -587 1370 -302 -2463 -178 3134
5205 3134 3011 430 5364 6435 5397 1742 2859 3848 12897 12663 5734 2316 7268 6669 -134 -6766
5189 -6766 -3558 -6636 -5452 2723 3733 751 -2596 2803 3972 -2921 -9976 -12213 -7 6796 3906
5174 3906 3768 10924 6455 1421 -435 -5227 -420 1302 -7258 -3152 -2201 -3095 -1245 -1602 -2636 -1437
5158 -1437 -11778 -11698 5463 10142 17867 18641 8466 4167 -5404 -399 6530 3391 8918 8299 -2062
5143 -2062 -9219 -22463 -26343 -18449 -12784 -8140 -4598 1536 1586 2863 -615 -4888 -8138 -15169 -22962
5128 -22962 -16761 -2428 -1519 -6939 -11014 -11585 -11918 -12226 -10251 -4946 401 -2692 -4528 1131 1934 -927
5112 -927 -5154 -5207 1901 3812 5288 3394 -6680 -6199 3642 8607 10556 16453 20345 5585 5537 10314
5096 10314 8691 11623 207 -506 -377 -939 -1071 6789 12785 14503 15546 21459 21964 19158 13474 3024
5080 3024 -1716 -1142 -4985 -1885 3190 10524 6541 3188 4308 2961 -7472 -8047 -7409 -9384 -5608
5065 -5608 -591 -3140 -7150 4068 18847 10427 5027 6132 3529 4823 8077 4840 2533 -5726
5051 -5726 -5751 -159 3077 887 -3371 -11304 -13476 -14649 -1722 2545 7575 16246 21213 10275 3413
5036 3413 786 -4241 -5932 -6007 -10292 -14022 -10646 -2293 2954 -3208 -13917 -12586 -1995 -791 -4541
5021 -4541 -7694 -4100 -8573 -1264 3384 -987 -6562 -2661 2919 3000 8198 12756 18130 14995 8878
5006 8878 940 -5513 5749 5229 -3323 -8439 856 -1376 2243 8430 447 -7018 -6979 3692 13109
4991 13109 8197 6261 9856 17026 25441 14043 3637 2634 2223 4585 7977 -1446 -4986 2026
4977 2026 3225 4533 4536 3790 3756 7056 4918 7029 14041 12568 18676 15892 9701 2713 447 -635
4961 -635 8572 7378 9886 12285 18626 16485 15038 10110 1815 5441 3359 4175 15363 21172 22987
4946 22987 9622 2793 7607 13382 11038 1260 6927 17028 12329 12027 19705 14543 10757 10347 5612
4931 5612 6544 6588 157 -483 2853 -7060 -12274 -14839 -7345 -5901 -5677 -3869 2408 -2280 -17821 -14764
4915 -14764 -13963 -7932 -443 9166 18710 20762 17108 2872 -3590 778 1433 3955 1330 -3656 -9602
4900 -9602 -12087 -169 6571 -1817 -5392 2908 6045 7518 11451 -279 -13160 -11568 -7651 -10524
4886 -10524 -26037 -16330 -12071 -8456 -5762 -5380 -2326 -526 -1332 -3902 1536 3580 502 3553 7950
4871 7950 6142 10072 9292 6408 7340 3143 -825 11786 20330 16643 10839 4950 -4846 -11051 -7099
4856 -7099 4393 4419 -120 -7529 -7008 -4390 5918 10922 15505 20473 21625 11968 2915 4587 7076
4841 7076 -77 -1638 1012 8699 10083 13444 17707 18317 21104 9769 -70 -3748 345 -1110 4552
4826 4552 12796 8295 2470 758 8897 13156 23425 22244 18919 14766 12298 11059 7729 244 -4609
4811 -4609 -1166 -2569 -2171 -67 5103 21463 14846 4698 -433 -11080 -1046 13030 11868 5819
4797 5819 5347 3921 5319 7663 3630 -244 7428 8906 9449 -756 -1674 -1048 2498 4432 -2060 -3949
4781 -3949 -3466 1827 2977 9165 12074 22124 16688 10988 6355 7362 8980 2194 830 3594 3536
4766 3536 11228 11089 12491 10081 6015 1547 7085 8732 15851 19018 6782 -2939 -2368 3292 1637
4751 1637 7352 3264 6377 10335 2801 4971 365 -4898 -6704 3353 15507 11821 11165 5993 510
4736 510 1795 3958 8164 2675 -4219 -9358 -9368 -4854 -2652 -2531 -8856 319 8155 -3483 1625 6491
4720 6491 15303 14681 2142 -4516 7815 15985 21260 18668 7721 -12035 -16022 -12250 -15769 -14365
4706 -14365 -5043 672 -2594 -5395 -6111 -6005 3024 2954 -5263 -9391 -4198 -2676 1303 6459 11407 5836
4690 5836 -2239 -4176 -4288 -5265 6580 13741 11158 4241 -4277 -10599 -2822 -1528 -2083 4887 6876
4675 6876 4809 4104 2255 -4843 -1505 -3200 -4050 -728 515 8147 13398 15470 7332 4957 -3420
4660 -3420 -8723 -10639 -12355 -13566 -11509 -4053 -6884 -1821 1550 5501 8052 8291 6046 4579 -3326
4645 -3326 -7376 -3832 6789 11428 7348 -9963 -13452 783 13485 13521 18353 20221 19061 20580
4631 20580 16880 10621 10983 11415 8986 6829 11675 5257 6217 5009 4010 6661 5374 1999 618 5295
4615 5295 9244 6221 3803 7275 6902 8607 10284 8693 14116 29518 27587 19837 15065 12221 11169
4600 11169 18951 20214 15035 18933 21220 15106 4712 -9433 -8703 1662 6757 -285 -2373 681
4586 681 1810 2171 5733 -1477 496 6233 8398 4854 10393 9243 10865 22506 22084 12847 -1023
4571 -1023 -4815 -3288 3727 9015 12013 3926 -6876 -6388 -872 2346 14683 20240 12084 15363 6244
4556 6244 4722 -592 -5615 3217 2185 1092 11095 15271 18846 14117 5323 8003 13433 10916 12868
4541 12868 16197 13926 19382 14887 -3700 -8682 -9796 -4791 523 -6622 -8907 1412 2658 -942
4527 -942 4386 10900 15965 73 -3860 6570 13611 17500 16139 13000 -1811 -701 235 3238 10940
4512 10940 6948 -2146 -4286 -3504 -9385 -1900 -940 -15514 -27124 -19760 -5080 229 3195 15000
4498 15000 4710 -7133 -11904 -11399 -7553 -2566 -5764 -9901 -9913 -5026 -4994 -7482 -5598 1063 3202
4483 3202 1532 2400 -4748 -352 -739 2545 8409 -27 215 7840 18854 27560 28073 18093 7405
4468 7405 14486 20197 10186 6040 3323 7553 12360 -428 -8847 -3154 -3223 -2336 -1934 1312 1554 1242
4452 1242 620 -12508 -10815 -4412 -1418 8145 20242 15060 4608 1021 -744 2048 3241 -1452
4438 -1452 -306 3260 3377 5740 15094 21726 14163 12695 9388 6805 -284 -7840 598 4354 8243
4423 8243 4706 980 -3900 742 5391 10394 18435 13352 11818 9111 9824 8796 8232 4693 7547
4408 7547 6196 18715 19297 10753 5064 5046 -1861 1534 -5545 -13370 -7805 -900 -2940 4912 8354
4393 8354 6070 10468 6527 4567 -91 3074 9946 14828 16830 4572 1706 4818 6527 7780 4868
4378 4868 -2061 -7698 -4690 4617 7479 4518 -2808 -8968 3189 22231 19181 6101 -1368 5062
4364 5062 6370 5410 11980 13928 14295 10780 1987 5691 4691 3379 6879 3129 -3049 -5595 -4392
4349 -4392 -5754 -7699 -2256 12412 6330 -1007 2082 7851 5401 10580 10813 5123 4047 14380 13691
4334 13691 4075 -1813 -5818 3942 2037 -8326 -11264 -5030 -6118 -3501 -6237 -15339 -22180 -13880
4320 -13880 3592 14168 14898 15099 7581 -3339 1475 4094 1185 -339 1537 -3196 -770 -7128
4306 -7128 -13492 -13480 -12968 -7001 -10180 -14752 -6938 3899 477 1874 -1531 -3367 -7726 -12390 -14647
4291 -14647 -2862 8186 12442 17515 13041 1246 -2773 7646 13869 4235 -5108 -3537 2818 6195
4277 6195 14148 15544 7344 -2764 1515 -5184 3076 8882 10241 9325 -348 -11001 -9735 7062
4263 7062 6051 1986 3139 6097 4592 -5200 -2556 6547 12225 6819 12546 14534 12670 8940 2448
4248 2448 -3003 6317 14640 18564 14738 17542 19592 7172 2077 -4336 5636 15167 17171 15034 14146
4233 14146 15646 20394 18353 18540 12138 7972 5591 6116 7870 11431 18391 26358 20820 2523 -481
4218 -481 13262 17861 13230 699 -6977 -4938 4 2101 3868 2796 -660 -2905 7723 11775
4204 11775 20602 23276 15922 15143 12285 14045 10887 7860 6869 6036 -3249 -20680 -24186 -2809 7596
4189 7596 8128 8518 15145 7638 2698 -7815 -12684 -7607 242 7280 3615 4516 6887 3704 -637
4174 -637 -1189 1042 5586 2887 3578 6620 6688 2496 -4095 -10807 -892 8587 5810 3924 -4073 -14008
4158 -14008 -2279 -2573 -7713 -12687 -6848 1691 6733 10862 8295 8758 11464 88 -2191 1289 4254
4143 4254 19310 26845 22172 19901 17541 21012 24840 21078 9581 -3313 -10109 -9014 -10084 -10708
4129 -10708 -2075 6141 13069 14066 4101 4464 7395 3965 4100 2284 5415 8312 6946 4824 6411
4114 6411 8807 13340 18628 26558 24694 20987 16563 10722 12291 14143 14888 16583 12590 3986 3141
4099 3141 -5945 -3728 6368 24633 29274 22754 15060 11764 5836 -2269 -1140 8219 7367 5282 -1550
4084 -1550 -1962 -617 1864 -2503 -7026 -8170 -4171 6891 13004 2045 -5866 -1824 -3372 -8938 -9965
4069 -9965 -6525 -650 -1486 -4847 -751 -1876 808 4677 -1922 -6119 -1479 5424 -5872 -9004 -8376
4054 -8376 -9449 -4111 1044 -3288 -7797 3255 1783 2973 7586 11093 14485 22377 20021 7604
4040 7604 9376 20653 22891 23238 28149 18210 6807 8018 7195 5025 12189 15073 16004 19322 17606
4025 17606 15062 11572 7454 4800 10289 11101 -1348 -9279 -4616 1281 6854 12091 14168 8849 14808
4010 14808 16975 18570 7431 73 6044 2564 1433 2673 9444 12234 7601 -1251 -3069 8873
3996 8873 3129 -6851 -11760 -4557 1890 7164 13406 12481 12459 12239 6924 5349 6401 6087 2158 -4406
3980 -4406 6741 8777 982 -2662 -1958 7488 6466 163 -888 3059 5281 6285 3884 -1625 670
3965 670 6581 7208 6918 12807 14201 16339 12969 8008 1717 703 3431 10895 14755 10486 7733 14129
3949 14129 21159 21541 17734 7964 16113 19012 10773 2210 -1692 -2981 -8618 -9675 -7843 -3145 2510
3934 2510 17909 16952 4991 -4903 -4893 3111 10362 3555 -9140 -14888 -7029 2637 6973 6420 3417
3919 3417 2635 7199 3038 3069 7180 15499 19230 12359 -379 4514 10038 9823 360 -427 5011 13780
3903 13780 23653 24420 22384 16078 7407 3233 1353 -1155 -391 398 -3091 -6139 -713 -920 2364 1273
3887 1273 -5758 -1470 2855 -1445 -8409 -699 8231 7319 1603 -5815 -6739 4924 7432 5812 1475
3872 1475 -3510 -3077 -964 7101 10598 11584 11356 -1865 -6177 -4601 -6108 -857 -5736 -15693 -11642
3857 -11642 2311 8391 14486 22687 14331 -49 -13930 -19084 -20255 -20684 -9441 -5521 4115 2911
3843 2911 -6460 -9384 -15122 -21129 -24313 -18208 -2548 8661 11589 5722 6981 1780 3252 6542
3829 6542 18314 18824 4451 -1404 -10475 -10855 -10644 -13182 -9075 4249 2201 -226 10508 1949 1604
3814 1604 4416 -10155 -21258 -13806 2915 2436 -6286 3648 10942 15627 4452 -5359 -8168 -3273
3800 -3273 -7520 -5738 -8440 -7894 2115 -804 5558 8302 1959 3015 3745 5000 12886 12067 4164
3785 4164 2681 -5366 -12476 -8247 -271 29 4046 1901 568 3138 -2013 1605 5731 3755 -7279
3770 -7279 -4603 6310 12100 10382 15523 19821 11631 1647 8259 17289 12409 6691 1208 -983 -11261
3755 -11261 -12181 -6162 884 -4054 -2174 1861 1142 6669 11191 8352 8970 9011 1646 -3558 -189 2337
3739 2337 4839 -3510 -13450 -10646 -5322 -10299 -13748 -2945 6218 1206 4010 14820 8950 367
3725 367 2789 10653 4646 2598 9224 16762 15546 11771 -422 -627 8502 14743 16288 2229 -3333
3710 -3333 1205 -7887 -18046 -20229 -5948 9344 6891 4076 3365 -5670 -5944 6203 12344 3783
3696 3783 763 7979 8995 7425 1423 1594 9196 18883 12580 -5402 -14200 -2362 -4860 -16300
3682 -16300 -8553 -2172 -6069 -17977 -12377 -1122 6733 -168 -1460 -13971 -13875 -3 -1868 7434
3668 7434 12632 8487 4024 -4964 -6646 6449 12998 13836 8182 -2462 3748 16066 9965 -6468
3654 -6468 -6270 -5602 -5535 -5675 -6889 -860 2897 1984 -3133 6040 11690 11848 7024 5224 -5820 5908
3638 5908 5343 8899 13950 11599 10086 10432 1527 -3446 1579 -6765 -6873 -8763 -11414 -10555 -5960 -4802
3622 -4802 91 -1007 -4055 -3113 -10270 -7004 5905 8594 12418 12554 5789 8155 12603 10127 4441
3607 4441 7257 9567 8281 2095 660 7013 9481 7962 6882 8956 13140 15828 7424 9412 7142
3592 7142 844 -7739 -8541 252 6747 15119 16679 11568 2441 2720 9084 6932 1847 -3467 -5758
3577 -5758 -12413 -12547 -9530 -4287 -815 2624 -290 -9409 -9395 -224 13690 17687 12353 8210 8763 7196
3561 7196 2200 2796 575 -3277 2166 2637 1581 -1974 -1787 -4116 8287 2481 675 1470 8916 17094
3545 17094 8133 10317 13681 14965 15362 12619 9448 -779 6668 16744 21567 18902 8276 4942
3531 4942 5813 -3782 1893 8812 16317 23813 19156 2436 -1415 9934 15365 4966 -6644 3297
3517 3297 8191 -3985 -9870 -3325 -1839 2260 -2676 -7613 -9138 -5402 -2150 1656 10268 4531 -2847
3502 -2847 -7743 -11779 -4528 6038 10164 6413 -819 3500 4744 5262 5268 5623 15151 13255 2124 4812
3486 4812 9549 9723 8748 13695 7596 -646 4 4714 5247 6983 6971 2953 -2952 -7628 -17756 -9390
3470 -9390 -4095 -6850 -10971 -12462 -6642 -12773 -9757 -6164 -10280 -14291 -23643 -11638 2220 -7701
3456 -7701 -10998 -9872 -1769 3229 -253 -1425 -158 10703 5445 7591 12822 525 -6123 -8799
3442 -8799 -6558 -3274 3248 7888 10673 7895 -2785 -10436 -12478 -6229 -8305 -5513 -3806 -7620 -6985
3427 -6985 5627 11576 10962 4776 -14443 -20111 -12183 -5286 -3081 -7357 -7038 937 8245 20879 18714
3412 18714 9642 8379 6527 5203 11292 16092 8128 3318 6580 7333 10664 7585 2875 3014 8266
3397 8266 7232 5665 -618 -7911 -1433 -1250 6248 11798 11748 -157 -9260 -6291 -653 3770 7371
3382 7371 -764 -10285 -3693 -1229 4608 2994 681 -4453 -1604 -1996 -1495 -1848 3538 6455 4553 1040
3366 1040 -5478 -4830 -1515 3048 9459 15606 5834 1793 5727 64 500 1197 -2792 -4410 -5515 -4053
3350 -4053 2979 14529 12139 9971 9380 8855 5153 13077 15824 12300 3944 8976 10171 6748 7644
3335 7644 7509 11607 16409 18363 15333 9861 8798 6074 -4634 -1302 6576 11543 19735 16447 2202
3320 2202 -5813 3200 6447 13629 13593 16287 23733 24016 26473 22633 12113 2696 -7081 -13254 -12832 -15558
3304 -15558 -7475 5435 13782 20904 23127 17951 10840 7538 16331 7921 -6838 -14211 -2109 7253
3290 7253 9829 9797 6264 783 -1603 -4412 -12169 -12667 -6180 4905 10192 8245 11589 10406 6209
3275 6209 1583 -1655 -3986 1076 4397 9273 -668 -13842 -13099 -4546 2400 5799 6898 -2917 -5644
3260 -5644 -4051 9343 14435 12611 11406 10867 3636 -624 -4052 -4870 -3356 4541 4476 -676 -10774
3245 -10774 -11443 -6745 -3765 -8689 -12716 -8830 -4092 -8491 -16933 -16552 -11898 -10759 -3394 2416 1014
3230 1014 -4508 -8705 -9605 -16208 -11278 -6345 1177 -1596 -695 12052 17620 16883 10317 5705 1896
3215 1896 6828 1766 -1936 6792 11134 17808 25815 25794 19202 12408 10709 5874 5490 13315 10609 6743
3199 6743 14588 20157 7579 2270 1958 7917 5007 4342 2238 -7238 -9874 -7277 -2927 2087 11369
3184 11369 6284 1199 -237 -3688 -7820 -6582 -6689 2877 9999 5993 3397 716 -1490 5671 5373
3169 5373 -9062 -13721 -2618 5116 5205 443 -3064 -682 7209 1606 -2941 -11718 -7536 9199 7934
3154 7934 -2593 -9501 1901 -5960 -4964 -4783 -9268 -8032 -728 4530 16749 14140 -376 -3518
3140 -3518 -2582 -1717 1834 -3092 -4353 -2193 862 5100 7119 9389 7466 2089 2260 4922 8826 12725
3124 12725 10740 11404 17061 11654 4225 11672 14604 4589 -2252 -5601 -3955 2448 1314 -4647 -9945
3109 -9945 -11490 -12025 -5537 6722 1630 597 3288 -3642 -9949 -6095 2201 5124 8781 12892 5958
3094 5958 5313 10197 13027 9810 11005 13773 13440 12751 19237 10746 -3121 -6132 -1279 747 -7696
3079 -7696 -8285 -3759 206 2983 8520 4923 7114 9226 3631 419 9796 14410 14763 13322 10880
3064 10880 333 -46 12861 12210 1620 -4106 736 -1187 -1952 252 4940 4166 2713 -4700 -4300
3049 -4300 -10712 -15087 -12568 -1783 8765 9419 -7370 -18927 -14795 -8958 -11172 -13465 -1480 7935
3035 7935 9986 3241 -484 -7932 -13036 -7981 -1415 798 199 -4846 3508 -2952 -1978 1503 -7208
3020 -7208 -11008 -706 7623 5173 6134 -688 -15164 -17558 -20344 -15329 -11133 -7181 1486 7247 11715
3005 11715 10953 7642 3320 7197 4389 5759 10135 11382 9930 7263 5339 7883 5168 21108 19556
2990 19556 4657 37 -1429 176 298 10630 14882 -1276 -7904 2655 12034 16286 17864 13290
2976 13290 12913 8592 8987 10530 9409 5714 8042 11766 15337 9195 5282 1700 6379 11619 17541
2961 17541 5475 51 2173 8906 9406 6692 2558 -10499 -17348 -5463 9207 -3142 -496 12057
2947 12057 14959 19168 13315 13416 10912 6509 13178 11150 6774 3234 4391 8687 -475 -11184 -12746
2932 -12746 -934 12734 16384 14724 6436 -2375 650 3442 3231 5306 7871 11462 7189 4772
2918 4772 3542 -1982 -5589 -3227 -4855 -1439 -6453 -10369 -10132 -11137 -13687 -17254 -13460 -8253 -5987
2903 -5987 -2566 1871 -3505 312 6693 7182 -1863 -11017 -13882 -11965 -3048 -274 -3296 -5944 -15027
2888 -15027 -25835 -25497 -18287 -8616 -12171 -6673 -4736 4504 167 -3492 -9214 -14854 -11666 -14413 -13707
2873 -13707 -3914 -10778 -20613 -13223 -2685 6752 8399 -1819 8988 11186 15040 16398 19409 16839
2859 16839 9076 4809 5603 8622 1442 1239 7200 5779 -2607 -423 1100 -1522 -1183 12224 12357
2844 12357 7406 6192 14096 15525 15904 930 -13571 -8291 -3748 -2300 -7259 -14800 -4519 -2929
2830 -2929 -9412 -21122 -23494 -12123 -9594 -9671 -9371 -2794 -8081 -8862 -8223 -13774 -8710 2817 2904 -8648
2814 -8648 -2158 -5146 -4013 4302 6143 1734 -8873 1726 10418 9743 8864 8762 2391 -2634 -13029
2799 -13029 -13223 -4802 -13674 -9017 193 1034 -431 6075 4836 6146 14119 16772 11211 8305 11423
2784 11423 7224 6547 3613 4738 6607 5079 9555 611 -1264 2468 10093 -57 7985 10820 10248
2769 10248 16138 21934 26921 21512 24104 23269 7304 -1013 571 5508 5261 4785 11147 15581 9669
2754 9669 2982 10176 10244 8773 9270 5205 3880 2637 9404 11318 8581 3922 -2476 3149 2414 2781
2738 2781 2766 3407 10008 21719 24585 7635 3881 2425 14766 14145 1675 7400 14996 10296 -1125
2723 -1125 -1203 339 4249 5667 9160 13346 21276 6925 -9088 -13156 -3799 -1069 -4897 -4272 -1070
2708 -1070 589 -1619 -8550 -12984 -17136 -19191 -15995 -4531 2187 7524 3159 -1750 -4797 3611 3076
2693 3076 3082 2530 5086 -984 4739 9769 9050 10229 8196 1064 4241 9713 2797 6318 12521 12816
2677 12816 18260 15161 8472 3208 4388 5153 9828 11038 3544 492 -378 135 943 -896 3690 12494
2661 12494 12302 2023 -1173 -2473 -12416 -12295 -3812 -4402 -3493 2872 6045 11100 11466 8973 8590 7155
2645 7155 -3120 -15173 -12282 -14189 -3006 -2195 -1927 5229 -187 -5587 4500 9178 8676 9704 8446
2630 8446 1317 -5780 -1993 1832 -10113 -5219 -3293 -11110 -10539 -5463 -9817 -8213 -4451 5870 10680
2615 10680 1081 -7108 -2884 6307 9171 10059 10034 10400 162 -653 1704 442 609 -901 5275 7104
2599 7104 4492 -3321 683 3074 9035 10016 -1189 287 7890 5194 -477 -664 4280 7886 5752
2584 5752 3264 9008 21368 24510 18241 13266 11270 4832 4213 8921 13280 6337 2750 7343 5461
2569 5461 -4992 -8734 -8845 -6134 -2440 -7887 -6785 -8098 -12799 -8131 2799 8499 3214 3021 2849
2554 2849 8600 11735 10409 2651 -4647 -7997 -363 1682 1897 -6639 -3270 701 1419 2661 3583 3683
2538 3683 5483 508 2586 8533 7117 7770 14285 12110 12387 10767 9762 14428 9798 4502 2932
2523 2932 6131 9218 4184 4179 7549 6741 2972 6399 7619 4428 -3351 -2134 83 2653 4297 -2955
2507 -2955 -4494 902 3512 3090 10164 16696 7438 -1738 6948 6048 6820 12619 14613 19549 9620 5050
2491 5050 -4100 -7986 -4809 9025 17542 10505 17497 21598 12101 9900 8493 7569 4550 778 -3773
2476 -3773 -9498 -3151 6002 8305 5728 830 3597 -2478 -4570 -10128 -6143 670 13305 10914 11395
2461 11395 8762 647 1566 -4640 -9142 -8359 -3297 -2572 2049 4882 1490 6737 7834 5277 5145 5524
2445 5524 9007 9601 21236 26026 31809 33448 31824 21320 14172 24994 28695 22170 17224 14144
2431 14144 10183 14760 16909 13384 9968 7729 277 -4300 -4388 -5110 -4107 -712 9228 8446 9224 7339
2415 7339 1046 -10301 -9023 690 6339 7262 1890 3147 10661 19887 17663 17518 7816 346 -3843
2400 -3843 -4687 -2979 -5128 -8731 -9289 -2786 4842 10167 11197 2365 -4455 -12893 -8948 -3563 -4410 -6029
2384 -6029 -2803 -6899 -2276 1605 -6196 -3392 -4117 3572 -4020 -7984 -2408 3126 -3803 -12754 -49
2369 -49 6883 -2184 -7270 -2295 479 -4195 6038 11063 15390 13789 10483 8789 2365 442 4428
2354 4428 1075 1976 10588 1558 2514 12556 14964 11264 9997 1093 4095 14690 16937 20005 19909
2339 19909 14986 12657 9493 6168 937 -724 6745 4047 -595 -2186 -8021 -13002 -4122 -2979 -9097
2324 -9097 -75 -410 1396 4438 8664 11872 8623 2211 1242 175 7175 14192 5408 3232 13669
2309 13669 20457 17868 7756 -9269 -15050 -3292 2508 5553 16729 17687 8510 -2126 -1260 5749
2295 5749 471 5936 -1937 -5636 1582 2856 6935 6337 16553 22629 21915 17653 6819 5008 8872
2280 8872 6675 13415 13604 3261 -3422 -6219 -7283 -5063 -4182 7336 11252 16506 17983 8680 -3488
2265 -3488 10711 21387 10888 5905 3654 -3275 -3089 -1335 -4137 -5078 -4556 -3506 -6147 -7400 -7712
2250 -7712 -10161 -7150 -4215 953 4246 3211 -9086 -6691 4377 6985 244 -117 5553 1863 -2485
2235 -2485 14279 24548 24087 14423 7687 207 141 2604 -3537 -8282 -2156 5003 16838 12861 4736
2220 4736 -1348 -13695 -14160 1949 9279 12687 12512 13368 5642 5560 9688 16637 15384 14631 19522 25591
2204 25591 25606 13653 6632 6505 8071 10147 2946 -3735 -7075 -9609 -5361 -1497 930 9339 8370
2189 8370 583 -3660 -10391 -11438 -8907 624 -2754 -215 -585 -8111 -10307 -3599 -709 -3098 -4227
2174 -4227 -3921 2079 3163 139 2268 4565 1454 10134 5488 -2038 -9707 -6371 -2267 -1483 12022
2159 12022 7002 3982 -3573 -7978 -17527 -9800 -4491 1633 -6029 -15692 -14327 -12983 -1521 -5357
2145 -5357 -14268 -6746 -143 -636 -4308 -7038 -8709 -12450 -859 8448 6364 4683 5272 6562 9926
2130 9926 16376 6395 746 -3309 -5478 -14141 -17778 -12628 -12414 -4145 182 4354 10076 8834 1690
2115 1690 1621 -2445 -4058 -3351 114 -3734 -10244 -7715 -2356 -3593 -3474 -9 3473 14451 14972 15534
2099 15534 9573 3402 -1473 -13990 -13418 -7081 -1257 6089 5740 -5534 -11058 -9422 -3873 4073 2227
2084 2227 -8867 -2463 -7145 -1583 5784 -640 -279 4208 1918 -1485 -873 7550 6242 -13705 -20360
2069 -20360 -15707 -10110 -427 2310 2265 3980 678 -644 3415 12205 11828 17542 24361 25665 20400
2054 20400 10317 -5771 -6930 1571 5663 6647 9721 406 -2644 3494 10742 7710 -4445 -11077
2040 -11077 -4982 261 -6399 -9741 -9138 -14429 -16944 -11449 -5921 241 2138 2962 14014 17994 9408
2025 9408 2142 3496 1232 1762 753 -8074 -8984 -10896 -5359 2034 10951 8539 4846 6566 5952 -4048
2009 -4048 -5873 -231 411 1801 1385 2616 -3027 -5746 2339 1367 -8683 -17014 -19100 -19550 -15892 -7565
1993 -7565 10024 19695 22279 18679 17540 19580 14259 17106 6383 -4436 -12875 -13379 -10699 -731
1979 -731 3302 -1209 5800 4322 -7092 -11199 -5546 3141 -4006 -6901 -5886 -6815 -1937 -9206 -13034
1964 -13034 -7855 -672 3965 2158 4226 657 784 -2956 -10611 -13934 -15079 -6975 -7439 -5140 -6690
1949 -6690 -7747 995 -2817 -1665 4228 6208 4501 -2038 -2213 591 1118 -6688 -15868 -13154 -4044
1934 -4044 4764 110 -5883 -2085 -7250 -5113 -5109 -2493 5213 14353 18018 12752 2902 2100 5899 -3133
1918 -3133 722 2325 -2189 -524 6727 7022 6657 6667 2319 883 -5071 -2228 -18136 -19861 -16130 -15941
1902 -15941 -10294 -3796 1306 3276 5129 2669 8132 7386 5164 2835 -7632 -11348 -9687 -10804 -2427
1887 -2427 10237 14129 15757 11165 1444 -1679 -5685 2129 11137 8019 -4107 -1081 7098 11761
1873 11761 6474 2061 -5672 -11198 -19616 -20143 -9664 -2070 -1504 6636 12922 12763 8872 11288 7251
1858 7251 2378 4094 4699 4081 -3166 -3152 -1027 -4946 -6183 -16989 -14621 -10508 -1800 -629 2369 1459
1842 1459 -5618 -13054 -8215 4288 9067 8469 1129 3287 -1147 -12063 -21430 -19613 -15127 -3395
1828 -3395 -1182 -9369 -14489 -15980 -7580 9529 17888 4458 11064 9557 7715 9101 4291 6874
1814 6874 10854 4983 7304 8356 17599 21700 20765 20511 12911 -231 -8856 -901 6362 6761 -1427
1799 -1427 5749 4627 3993 10242 10993 16363 13899 4012 8704 10386 1285 1420 939 -2750 -4379 -2827
1783 -2827 2003 5327 3264 -3134 11210 13837 10064 7974 1335 -336 -6646 6439 12305 13850
1769 13850 3025 -936 4350 8038 4329 124 -604 -9842 -4885 -3307 7978 10169 6270 12356
1755 12356 17236 8790 3204 6616 700 5074 16691 10654 5198 3526 -696 -3649 -9441 -13131
1741 -13131 -8695 1904 9461 8289 14189 11719 7621 -1801 -5644 -3715 3089 104 3687 10268
1727 10268 -142 -7228 -7591 -34 -910 -4455 -5268 -8508 -5164 5705 9690 2545 1704 -2943 -5526
1712 -5526 -3221 -1182 1066 1132 791 5682 5107 4445 6517 -1891 -5147 -2920 1874 46 1355 1995
1696 1995 -2010 197 -3930 -9282 -13579 -11973 -6744 -1517 6263 3684 5111 9985 6046 -3847 -10342
1681 -10342 -11349 -1166 7970 5906 -471 -548 3202 7986 6699 4940 -332 -5493 -5745 -6061 -7760
1666 -7760 -4338 4418 9616 5952 536 -4676 -9927 -2263 -3896 -7066 -5978 -7579 -6517 901 8906
1651 8906 7308 -3776 -2315 -2191 -7998 -8247 -1561 -4428 -5762 -800 2241 1010 10509 20440 27691
1636 27691 23066 12389 -184 -5869 -8746 -6759 -3342 -367 -3746 -3772 304 -8562 -13597 -11814 -7734
1621 -7734 -3808 -1253 5116 7405 1231 -3554 -7337 -10258 -9815 -4841 -13454 -14806 -9637 -3023 -1250
1606 -1250 -2677 -9332 -2850 -6183 -7930 -3732 -6855 -15017 -12411 -8839 3750 1941 3803 -3113 -252
1591 -252 57 -8501 -7586 -7512 -4435 -847 -3942 -4069 -21 3631 5296 3852 -2073 -932 -10671 -10886 3537
1574 3537 12130 8326 1007 -6202 -150 4054 10190 13607 8994 8965 1389 836 4604 1790 145 3864
1558 3864 -328 -10079 -11997 -7801 -16034 -20592 -9962 -3543 -277 4769 1957 -739 -1114 -8259 -14588
1543 -14588 -9850 -6146 -2292 -3413 -5668 -186 -6219 -1239 -2583 -3890 -6609 -7514 -1604 7588 22803
1528 22803 17708 4999 8316 8944 12350 4538 5067 9586 16187 10756 10159 -5663 -14866 -10509 -868
1513 -868 4831 6541 -1465 3849 -451 898 8015 5289 15924 14128 3742 7822 1765 -8753
1499 -8753 -4039 696 -2410 2195 9481 12058 9182 -5869 -853 -2448 -10263 -7435 1744 1024 -1658
1484 -1658 -4602 -2064 3157 -5156 -8922 -5344 -15260 -17383 -7351 -7020 -12765 -11683 -3775 -9848 -7798
1469 -7798 -8783 -7845 -13565 -13847 -14810 -11259 -12793 -8419 -11243 -11176 -14355 -8898 734 12271 11798 9161
1453 9161 6767 3269 -1873 -10930 -19545 -19496 -10893 -11834 -17762 -16340 -11198 -1807 9193 2759 -2429
1438 -2429 -8046 -20607 -28156 -29912 -24552 -15715 -15547 -23044 -20643 -6603 -5747 -11849 -11657 -9759 -12008
1423 -12008 -20184 -22023 -23047 -22501 -20500 -5558 3398 7658 10863 10262 923 619 4937 2860 -6672
1408 -6672 -7710 -7624 -8306 -8531 -5097 -23 -12192 -17446 -21837 -22149 -11502 -10606 -11624 -3218 1676 -1989
1392 -1989 -771 4761 1996 4866 -156 -7409 287 -474 619 253 239 -7588 -8801 -8799 5821 20123
1376 20123 18538 17437 9494 2287 998 3886 3591 -1728 -1852 -10670 -12908 -4254 -943 4937 12176
1361 12176 9974 3976 5863 4244 2221 1476 -4847 -3139 -6299 -3034 -844 -3753 974 1524 -4742
1346 -4742 -15161 -13989 -3012 4979 2197 2063 1479 5882 3087 -3212 -4420 3219 2694 2704 1091 -1993
1330 -1993 1511 7434 2690 -9389 -11075 -10081 -5898 -11754 -12997 -11762 -22757 -23738 -8376 -4443 3290
1315 3290 4732 -3872 -3345 -8834 -8340 -1550 4681 -741 -5846 -6744 -5587 6724 16251 21161 22056 11284
$$ [...]
##END NTUPLES=NMR SPECTRUM
##END=
