##TITLE=Analysis number 328428
Compound Code cc 62602
Book Reference 494/174
Project Code adrs
Chemist Name craigr
##JCAMPDX= 6.0         $$ Bruker NMR JCAMP-DX V2.0
##DATA TYPE= NMR SPECTRUM
##DATA CLASS= NTUPLES
##ORIGIN= Bruker BioSpin GmbH
##OWNER= nmr
$$ XWIN-NMR		Version 3.5
$$ Tue Jun  5 11:18:12 2007 GMT Daylight Time (UT+1h)  MAYBRIDGE\nmr@NMR_250MHZ
##.OBSERVE FREQUENCY= 250.131544655141
##.OBSERVE NUCLEUS= ^1H
##.ACQUISITION MODE= SIMULTANEOUS (DQD)
##.ACQUISITION SCHEME= undefined
##.AVERAGES= 16
##.DIGITISER RES= 18
##SPECTROMETER/DATA SYSTEM= dpx250
##.PULSE SEQUENCE= zg30
##.SOLVENT NAME= CDCl3
##.SHIFT REFERENCE= (INTERNAL, CDCl3, 0, 16.522)
##AUDIT TRAIL= $$ (NUMBER, WHEN, WHO, WHERE, WHAT)
$$ ##TITLE= Audit trail, XWIN-NMR		Version 3.5
$$ ##JCAMPDX= 5.01
$$ ##ORIGIN= Bruker BioSpin GmbH
$$ ##OWNER= nmr
$$ C:\u/data/dgb/nmr/ADRS/210/pdata/1/auditp.txt
$$ ##AUDIT TRAIL=  $$ (NUMBER, WHEN, WHO, WHERE, WHAT)
(   1,<2007-06-05 11:17:49.61 +100>,<MAYBRIDGE\nmr>,<NMR_250MHZ>,
      <created by zg, POWCHK disabled, PULCHK disabled
       configuration hash MD5:
       76 6E 9A 78 1E 09 19 81 EC 84 63 8F B0 6A 59 2D
       data hash MD5: 64K
       78 2C FF 2E 64 78 B3 42 F5 C9 AB 1A 82 3A 08 76>)
(   2,<2007-06-05 11:18:02.77 +100>,<MAYBRIDGE\nmr>,<NMR_250MHZ>,
      <Start of raw data processing
       ef LB = 0.3 FT_mod = 6 PKNL = 1 SI = 32K 
       data hash MD5: 32K
       C6 5A 26 53 67 62 C0 E2 48 A5 55 36 EA 60 9A 70>)
(   3,<2007-06-05 11:18:04.41 +100>,<MAYBRIDGE\nmr>,<NMR_250MHZ>,
      <apk 
       data hash MD5: 32K
       E7 4B 3E 03 63 21 28 44 82 6D 6A 82 14 F6 C0 A1>)
(   4,<2007-06-05 11:18:05.21 +100>,<MAYBRIDGE\nmr>,<NMR_250MHZ>,
      <abs ABSG = 5 
       data hash MD5: 32K
       1D 03 EF 57 96 BF 55 52 3B 9A 59 21 91 80 C2 43>)
$$ ##END=
$$ 
$$ hash MD5
$$ 8A 22 A2 61 87 80 45 DD E7 35 8F C3 ED 9B 58 84
##$RELAX= 
##$RELAX= 
##$RELAX= 
##$RELAX= 
##$RELAX= 
##$RELAX= 
##$RELAX= 
$$ Bruker specific parameters
$$ --------------------------
##$DU= <C:\u>
##$EXPNO= 210
##$NAME= <ADRS>
##$PROCNO= 1
##$TYPE= <nmr>
##$USER= <dgb>
##$AMP= (0..31)
100 100 100 100 100 100 100 100 100 100 100 100 100 100 100 100 100 100 
100 100 100 100 100 100 100 100 100 100 100 100 100 100 
##$AQSEQ= 0
##$AQ_mod= 3
##$AUNM= <au_zg>
##$AUTOPOS= <53 >
##$BF1= 250.13
##$BF2= 250.13
##$BF3= 250.13
##$BF4= 250.13
##$BF5= 500.13
##$BF6= 500.13
##$BF7= 500.13
##$BF8= 500.13
##$BYTORDA= 1
##$CFDGTYP= 0
##$CFRGTYP= 5
##$CHEMSTR= <none>
##$CNST= (0..31)
1 1 145 1 1 1 1 1 1 1 1 1 1 1 1 1 1 1 1 1 1 1 1 1 1 1 1 1 1 1 1 1 
##$CPDPRG= <>
##$CPDPRG1= <>
##$CPDPRG2= <>
##$CPDPRG3= <>
##$CPDPRG4= <mlev>
##$CPDPRG5= <mlev>
##$CPDPRG6= <mlev>
##$CPDPRG7= <mlev>
##$CPDPRG8= <mlev>
##$CPDPRGB= <>
##$CPDPRGT= <>
##$D= (0..31)
0 1 0 0 0 0 0 0 0 0.06 0 0 0 0 0 0 0.0002 0 0 0 0 0 0 0 0 0 0 0 0 0 0 
0 
##$DATE= 1181038668
##$DBL= (0..7)
120 120 120 120 120 120 120 120 
##$DBP= (0..7)
150 150 150 150 150 150 150 150 
##$DBP07= 0
##$DBPNAM0= <>
##$DBPNAM1= <>
$$ [...]
##$SUBNAM7= <"">
##$SUBNAM8= <"">
##$SUBNAM9= <"">
##$SW= 20.6930455092707
##$SWIBOX= (0..15)
0 0 3 0 0 0 0 0 0 0 0 0 0 0 0 0 
##$SW_h= 5175.983436853
##$TD= 65536
##$TD0= 1
##$TE= 683.16
##$TE2= 300
##$TE3= 300
##$TEG= 300
##$TL= (0..7)
0 120 120 120 120 120 120 120 
##$TP= (0..7)
150 150 150 150 150 150 150 150 
##$TP07= 0
##$TPNAME0= <>
##$TPNAME1= <>
##$TPNAME2= <>
##$TPNAME3= <>
##$TPNAME4= <>
##$TPNAME5= <>
##$TPNAME6= <>
##$TPNAME7= <>
##$TPOAL= (0..7)
0.5 0.5 0.5 0.5 0.5 0.5 0.5 0.5 
##$TPOFFS= (0..7)
0 0 0 0 0 0 0 0 
##$TUNHIN= 0
##$TUNHOUT= 0
##$TUNXOUT= 0
##$USERA1= <user>
##$USERA2= <user>
##$USERA3= <user>
##$USERA4= <user>
##$USERA5= <user>
##$V9= 5
##$VALIST= <valist>
##$VCLIST= <CCCCCCCCCCCCCCC>
##$VD= 0
##$VDLIST= <DDDDDDDDDDDDDDD>
##$VPLIST= <PPPPPPPPPPPPPPP>
##$VTLIST= <TTTTTTTTTTTTTTT>
##$WBST= 1024
##$WBSW= 4
##$XGAIN= (0..3)
0 0 0 0 
##$XL= 0
##$YL= 0
##$YMAX_a= 345587
##$YMIN_a= -265707
##$ZGOPTNS= <>
##$ZL1= 120
##$ZL2= 120
##$ZL3= 120
##$ZL4= 120
##$ABSF1= 16.522
##$ABSF2= -4.171173
##$ABSG= 5
##$ABSL= 3
##$ALPHA= 0
##$AQORDER= 0
##$ASSFAC= 0
##$ASSFACI= 0
##$ASSFACX= 0
##$ASSWID= 0
##$AUNMP= <proc_1d>
##$AZFE= 0.1
##$AZFW= 0.1
##$BCFW= 0
##$BC_mod= 0
##$BYTORDP= 0
##$COROFFS= 0
##$CY= 12.5
##$DATMOD= 1
##$DC= 0
##$DFILT= <>
##$DTYPP= 0
##$F1P= 14.0000005364418
##$F2P= -0.99999901652339
##$FCOR= 0.5
##$FTSIZE= 32768
##$FT_mod= 6
##$GAMMA= 0
##$GB= 0
##$INTBC= 1
##$INTSCL= 1
##$ISEN= 128
##$LB= 0.3
##$LEV0= 0
##$LPBIN= 0
##$MAXI= 10000
##$MC2= 0
##$MEAN= 0
##$ME_mod= 0
##$MI= 0
##$NCOEF= 0
##$NC_proc= -4
##$NLEV= 6
##$NOISF1= 0
##$NOISF2= 0
##$NSP= 0
##$NTH_PI= 0
##$NZP= 0
##$OFFSET= 16.522
##$PC= 1
##$PHC0= -53.93844
##$PHC1= 5.529428
##$PH_mod= 1
##$PKNL= yes
##$PPARMOD= 0
##$PSCAL= 4
##$PSIGN= 0
##$REVERSE= no
##$SF= 250.13
##$SI= 32768
##$SIGF1= 0
##$SIGF2= 0
##$SINO= 400
##$SIOLD= 32768
##$SREGLST= <1H.CDCl3>
##$SSB= 0
##$STSI= 32768
##$STSR= 0
##$SW_p= 5175.98343685301
##$SYMM= 0
##$S_DEV= 0
##$TDeff= 65536
##$TDoff= 0
##$TI= <Analysis number 999999
Compound Code 99
Book Reference 9
Project Code 9>
##$TILT= no
##$TM1= 0
##$TM2= 0
##$TOPLEV= 0
##$USERP1= <user>
##$USERP2= <user>
##$USERP3= <user>
##$USERP4= <user>
##$USERP5= <user>
##$WDW= 1
##$XDIM= 32768
##$YMAX_p= 466599597
##$YMIN_p= -476768
$$ End of Bruker specific parameters
$$ ---------------------------------
##NTUPLES= NMR SPECTRUM
##VAR_NAME=  FREQUENCY,     SPECTRUM/REAL,   SPECTRUM/IMAG
##SYMBOL=    X,             R,               I
##VAR_TYPE=  INDEPENDENT,   DEPENDENT,       DEPENDENT
##VAR_FORM=  AFFN,          ASDF,            ASDF
##VAR_DIM=   32768,         32768,           32768
##UNITS=     HZ,            ARBITRARY UNITS, ARBITRARY UNITS
##FACTOR=    0.157963299565203, 1,           1
##FIRST=     4132.6476996994, 0,             0
##LAST=      -1043.33573715361, 0,           0
##MIN=       -1043.33573715361, -476768,     0
##MAX=       4132.6476996994, 466599597,     0
$$ Real data points
##PAGE= N=1
##DATA TABLE= (X++(R..R)), XYDATA
$$ [...]
20227 189135 156165 107315 129542 151843 160688 125388 147811 99524 68657 86285 141024 140695
20215 140695 127800 103328 175763 241775 197445 173356 199306 222368 230062 241521 212017 183562
20203 183562 202215 206668 164692 168890 177018 198729 203485 191568 220721 279990 277665 324897
20191 324897 290673 268085 272538 239323 229835 137775 146198 240003 201546 95649 23808 42765
20179 42765 100566 156668 137576 91198 108725 106899 15862 92590 234294 215695 199885 197510
20167 197510 152100 161601 172132 208565 230783 236624 211641 211088 133554 102502 91677 56409
20155 56409 104784 71437 81696 43715 100569 33690 90076 132359 120705 128625 142778 165593
20143 165593 142990 164124 183984 178695 197020 216712 201743 123779 111096 118178 150383 144409
20131 144409 146160 86656 57381 39304 72118 96659 116759 167894 197820 243740 224584 155900
20119 155900 203289 234166 147084 88270 26548 37168 94769 58110 -26319 -56934 -45133
20108 -45133 -4240 68074 133753 160503 140738 151188 74434 78513 146519 131913 37712 59657
20096 59657 94748 94264 48789 19087 85579 113723 118673 88969 80953 88347 83749 64296 70265
20083 70265 61406 65079 67757 119471 142914 100136 51356 71936 172130 167772 104113 46166
20071 46166 51285 103310 106413 64074 74188 74175 15748 57570 106593 109323 69098 79702 88934
20058 88934 149440 158381 132376 196918 240830 263176 183082 132452 108930 130695 135182 108800
20046 108800 103470 83289 99532 86625 57874 50811 53245 90657 142595 184537 178171 135352
20034 135352 145358 189317 226442 242858 243311 226242 255229 264582 185203 79016 18294 50449
20022 50449 74858 113563 217900 249342 200875 196254 208568 201532 207587 201528 171078 181236
20010 181236 192998 180744 221590 192295 151236 143538 144793 197020 177936 148953 121237 121608
19998 121608 113182 120612 161716 222896 229481 185820 172865 147461 136055 147211 166768 173117
19986 173117 256971 290258 270704 266125 304876 249497 151545 105703 107937 120828 116649 117790
19974 117790 131938 212090 323421 345767 261210 237155 240791 259381 267405 256542 213463 223761
19962 223761 223671 271184 406641 404936 333728 250909 317339 361662 324607 293008 341074 353464
19950 353464 362152 355620 322675 336709 348887 335636 245572 171826 166253 222620 271740 332960
19938 332960 324253 280804 265776 263278 253166 297484 337935 351390 397125 430947 450198 425419
19926 425419 413414 404599 386142 327978 353358 428899 378193 400736 482709 472275 406591 421744
19914 421744 496734 417533 374907 410233 445916 517066 564054 518601 552885 527266 542752
19903 542752 575038 523735 477850 483221 461842 458864 479189 503111 511872 536296 550663 558686
19891 558686 559838 546771 447779 393112 434530 387014 355428 412828 463666 548510 615333 625746
19879 625746 655270 636019 549863 538583 564497 518778 511814 502905 485301 586086 639209 666739
19867 666739 629931 638413 698096 713434 704218 709349 744302 755778 769460 732004 734047 748311
19855 748311 750795 749397 700550 686664 711595 752887 750897 765943 835681 910176 945396 933580
19843 933580 880071 848845 865603 856988 842177 840469 852583 947517 1065174 1086803 1065552 1002217
19831 1002217 1012732 1055598 1151516 1142067 1184775 1229574 1239921 1198318 1311748 1424755 1454362
19820 1454362 1402036 1363736 1354124 1397181 1391897 1408814 1499309 1508613 1518509 1573946 1556710 1572359
19808 1572359 1648648 1615936 1541597 1552305 1559489 1564489 1624403 1664180 1582546 1625444 1677080 1716175
19796 1716175 1741289 1746036 1726380 1720392 1782085 1886774 1945084 2048536 2146833 2165521 2173867
19785 2173867 2140938 2136660 2116027 2110282 2107211 2260239 2342723 2415785 2555005 2689508 2803917
19774 2803917 2887652 2855298 2837032 2857204 2882113 2932462 2957911 2953151 3085002 3237292 3302102
19763 3302102 3295424 3289280 3480132 3537827 3536566 3608155 3792546 3872732 3931067 4050161 4190028
19752 4190028 4267902 4315185 4437815 4559608 4647178 4783023 4913988 5081807 5215571 5358363
19742 5358363 5467149 5618282 5775944 5951769 6174528 6327619 6534469 6811920 7063044
19733 7063044 7267893 7492154 7725285 7981348 8300920 8613188 8992660 9339617 9650410
19724 9650410 9940208 10375148 10823088 11250647 11728233 12182513 12678564 13194519 13661844
19715 13661844 14215350 14814616 15409822 16098430 16797380 17419807 18121964 18838647 19671378
19706 19671378 20492213 21305480 22127500 23048696 23914048 24716247 25561123 26474034 27333340
19697 27333340 28113152 28814040 29491367 30143003 30701264 31242855 31755210 32138553 32453013
19688 32453013 32728792 32841525 32956528 33067242 33039763 32914253 32700071 32359538 31887824
19679 31887824 31457722 30965004 30442186 29986549 29513208 29017269 28441813 27834202 27232992
19670 27232992 26649987 26103517 25610929 25142256 24642690 24159905 23758185 23346822 22991656
19661 22991656 22731960 22435812 22113724 21843290 21736492 21634278 21491530 21397690 21344055 21367657
19651 21367657 21388559 21360203 21406211 21543782 21738093 22050357 22430030 22777914 23141843 23602831
19641 23602831 24201886 24787441 25418036 26141711 26943444 27791388 28748783 29719955 30748802
19632 30748802 31859510 32985233 34179847 35365012 36618472 37797147 38834416 39867827
19624 39867827 40788873 41594821 42295827 42719370 43048019 43288864 43295669 43114474 42827618 42309549
19614 42309549 41571788 40751983 39813254 38764634 37613599 36463654 35233211 34023808
19606 34023808 32797959 31586414 30388423 29125960 28018931 27017731 25947396 24900922
19598 24900922 23925530 23042369 22214786 21352032 20476143 19692657 18987324 18297912 17625111
19589 17625111 17002028 16456794 15880683 15280260 14781099 14286685 13768940 13253337 12805346
19580 12805346 12412757 12007670 11590107 11176016 10798767 10440532 10075462 9723472 9380687
19571 9380687 9111117 8893500 8600111 8322851 7972585 7694128 7510739 7277863 7038568
19562 7038568 6848569 6635899 6500316 6306483 6109651 5951083 5904282 5761086 5524561 5347821
19552 5347821 5214091 5060155 4904737 4701775 4615951 4503122 4350262 4183840 4109738 4047229
19542 4047229 3972301 3905832 3801305 3659159 3561687 3440167 3377762 3380937 3365195 3284062 3228062
19531 3228062 3187605 3109659 3003190 2943194 2937559 2888355 2819857 2721444 2699779 2653221 2589932
19520 2589932 2640280 2655384 2631367 2541919 2482567 2445561 2466719 2391874 2327818 2271872 2196890
19509 2196890 2151826 2144345 2112241 2027250 2011693 2049808 2043254 1918528 1806095 1779128 1816965
19498 1816965 1847230 1827682 1782796 1762658 1672137 1614992 1585795 1616990 1616470 1571578 1571129 1551143
19486 1551143 1476642 1415180 1388886 1421522 1412063 1390938 1412567 1422290 1426881 1334126 1290587 1222013
19474 1222013 1211368 1301478 1276518 1244358 1193531 1222283 1244721 1241536 1176838 1151278 1099059
19463 1099059 1044733 1050279 1115298 1163312 1222719 1169443 1104374 1082896 1079436 954490 881585
19452 881585 889462 877183 830784 928450 926994 881173 872979 885513 887330 917968 965890 948660
19440 948660 929258 922481 951917 898193 826449 804559 821422 886041 911425 947004 956619 986316
19428 986316 1026091 916709 845775 850920 837424 869028 802371 796078 795518 841550 846935 812053
19416 812053 758709 819867 888287 921681 882807 829642 785094 675143 654566 659879 678580
19405 678580 666771 689038 728792 748298 696037 675865 687027 672416 745200 747613 797380 828348
19393 828348 801344 832698 873835 943825 1068784 1108325 1024861 890714 797797 784177 800729
19382 800729 783373 737480 677045 643422 610062 616456 651912 692923 662401 605755 590571 543191
19370 543191 490501 520202 489035 526559 539292 557263 582528 586379 571997 587104 599470 629128
19358 629128 653299 701467 755349 872547 861721 882073 908212 869449 833700 835165 825428 788239
19346 788239 789264 887712 961913 1035994 1114350 1139335 1104448 1052799 1078992 1191901 1183178 1219538
19334 1219538 1293941 1322279 1320497 1476596 1701496 1885744 2041436 2089576 2186856 2212241 2257144
19323 2257144 2309246 2398574 2569459 2877235 3342667 3940367 4689857 5604825 6827086 8704879
19313 8704879 11796642 16717108 23461584 29280300 30650733 26913137 22084967 19638484
19305 19638484 19631469 22063544 27425121 35923177 45939760 54091350 56481425 52170659
19297 52170659 43467904 34393067 28732744 26502329 27325158 31227370 36937621 40706827
19289 40706827 38802341 31519092 23942092 18787604 15546600 13437715 12035428 10990828
19281 10990828 10174282 9632491 9352985 9089009 8809773 8563443 8445222 8404356 8491374 8618206
19271 8618206 8811147 9225973 9971340 11021333 12700878 15514081 20200023 27056649 33861432
19262 33861432 36283255 32635296 26532745 22895945 22215813 24077633 28797312 36993980
19254 36993980 47661273 57616302 63475012 62691760 55887571 44829727 35354329 30481822
19246 30481822 29449730 31673952 37217681 44201000 47505872 43565713 34077969 25535010
19238 25535010 20147190 16863787 14688636 13129052 11897414 10869155 10011415 9393777
19230 9393777 8920662 8510447 8067100 7620636 7309780 7076920 6761803 6356793 5940666
19221 5940666 5623058 5374215 5132867 4905300 4635364 4332506 4062668 3889293 3696509
19212 3696509 3477986 3252059 3020059 2858890 2772650 2708377 2648971 2600173 2532172 2490580
19202 2490580 2387713 2351002 2332505 2320177 2318218 2411874 2569567 2695496 2747231 2796092 2882026
19191 2882026 3014639 3201409 3421194 3620564 3823053 3976740 4162464 4462361 4861016
19182 4861016 5497384 6356053 7590431 9253680 11780010 15580351 21435175 30150608
19174 30150608 40440633 48992534 53620955 55583817 56278675 53016589 44837462 36972895
19166 36972895 33771777 35294589 41178793 50181684 59384997 67064994 75205827 85701986
19158 85701986 93000454 91883599 84739227 76833739 67078950 55263134 46289052 42345380
19150 42345380 42930242 47208108 52421045 55052611 54481980 53247999 51515329 46328813
19142 46328813 37562040 29442866 24034739 20534917 18132733 16419233 15102942 13996477
19134 13996477 13077656 12330092 11699891 11088887 10556682 10048185 9509019 9035530 8507700
19125 8507700 7935086 7446481 6967638 6584923 6211850 5840041 5552042 5283527 4917396
19116 4917396 4623800 4346413 4084735 3812502 3585377 3399409 3280337 3159571 2983296
19107 2983296 2842566 2742193 2629808 2507853 2425874 2404090 2326040 2293916 2377456 2498394
19097 2498394 2531872 2449934 2242615 2062399 1912030 1806375 1758338 1689822 1586762 1475834
19087 1475834 1395633 1394883 1402146 1381699 1346172 1278358 1300728 1289368 1224557 1235760 1253419 1169797
19075 1169797 1138497 1207033 1269300 1258465 1193865 1163630 1114345 1083550 1034283 1011063 1007784
19064 1007784 1014372 1072932 1156320 1239865 1255249 1250133 1201455 1240906 1247225 1223927 1201192 1195742
19052 1195742 1165381 1131998 1150259 1239878 1355840 1373670 1347005 1320499 1300034 1235785 1185315
19041 1185315 1161037 1118072 1080621 1064431 1050840 1040256 1061053 1080707 1075439 1136815 1137070 1097015
19029 1097015 1090005 979598 879463 790377 709719 680374 723129 752974 770010 765187 718638
19018 718638 681248 737804 764727 735175 734259 697753 667137 636406 646596 643531 633593 627331
19006 627331 617430 612410 504774 413166 322991 377310 487373 434559 408427 492817 568519
18995 568519 556158 527245 499016 475098 468635 441373 454829 564271 605832 602885 604384 609776
18983 609776 606396 568559 533964 591820 555807 550601 510096 532305 583283 570304 538090 399956
18971 399956 425832 479928 530157 583931 599971 494084 367137 359133 484516 505670 454823
18960 454823 476323 433557 362465 309528 238193 269194 292511 281733 314673 300825 274768
18949 274768 261988 250884 257504 238258 276754 246528 269742 284645 306997 331656 248702 242636
18937 242636 346393 363242 298066 261539 236052 183415 212320 233554 253052 317669 253513
18926 253513 101213 172910 223012 198834 214607 215919 181552 171863 206790 241480 218390 191160
18914 191160 202797 229650 248387 178409 138380 99878 3965 8564 -477 -42307 8878 105489
18902 105489 125180 69831 61080 77332 118254 173142 95474 63104 85311 54845 53587 59925
18890 59925 171082 135569 106064 47808 77501 78678 120417 215701 242288 232642 230297 149207
18878 149207 90323 82368 125502 140407 145424 192531 207514 166561 86547 86818 126581 162238
18866 162238 205766 233177 208518 191033 196245 199640 228613 197015 224595 234058 244912 229430
18854 229430 172654 237012 214929 212216 247007 257738 240046 172036 183555 192265 267725 278879
18842 278879 245120 176730 141566 168718 124718 134183 170483 175467 86970 11904 68908 33537
18830 33537 -25666 -102478 -128449 -85522 -60712 -24554 -11133 -18413 -30244 -15282 28199 96710
18818 96710 146986 152111 153698 126117 130308 82342 79306 140598 118336 77558 30542 39646 103462
18805 103462 120515 93247 65500 72594 64335 117722 178794 161057 138672 106028 108432 99239
18793 99239 83753 91566 113362 143240 161794 139547 130483 182819 162396 94417 124689 191167
18781 191167 182874 132964 123227 183765 192750 268260 388744 401638 412560 400927 366026 441179
18769 441179 532573 622780 784382 894042 861232 761948 562861 478649 403953 358085 350612
18758 350612 320280 250238 115527 115764 192944 198056 191953 162441 115052 84350 113792 125532
18746 125532 175742 194301 194518 174951 122626 77444 26120 60326 143544 194933 214093 276752
18734 276752 318016 295377 204542 219846 351093 511050 614924 716775 852951 991959
18724 991959 1041231 1108986 1100163 1048514 1026053 1075162 1178170 1152719 1036686 923324 839962
18713 839962 738601 682411 544498 488795 430305 406302 429031 378759 348164 323124 338874
18702 338874 362276 355244 305948 287464 296060 287884 357318 404466 445846 465148 397259 364857
18690 364857 350927 338345 311243 275193 239875 209300 160732 158272 214408 249981 282160 244916
18678 244916 202372 187398 240396 304123 270679 306306 445260 548990 661328 718139 695595
18667 695595 761124 766857 717142 709666 697440 684653 621639 649971 733054 709594 675770 720851
18655 720851 775300 844141 961060 1177043 1353973 1622128 1936062 2362008 2991645 3787363
18645 3787363 4938921 6319917 8253056 11335685 16052958 22348667 28328157 31589451
18637 31589451 32055372 31628147 29870298 25132011 18738060 13850388 10882258 9013677
18629 9013677 7842035 7083985 6412790 5824439 5383411 4952493 4625001 4508957 4546463
18620 4546463 4604922 4720773 4751342 4752024 4758053 4737049 4655620 4518392 4345723 4086782 3974094
18609 3974094 3973483 4163365 4436130 4740922 4906734 4959301 4942462 4892524 4949580 5230884 5769611
18598 5769611 6609925 7871431 9585970 12116429 16047820 21689033 28495256 35472296
18590 35472296 43510441 55211011 69895693 80901502 83435737 79811928 74886181 66592323
18582 66592323 52916190 39036259 29355643 23196021 19223937 16485796 14478164 12961725
18574 12961725 11820963 10778805 9990930 9395446 9009145 8756578 8584079 8468089 8310335
18565 8310335 8113194 7972660 7790445 7658061 7499308 7280928 7040344 6926639 6860479 6736085
18555 6736085 6583489 6444992 6427483 6411295 6504311 6839725 7413520 8288048 9663147 11686630
18545 11686630 14507598 18431477 24436240 33813398 46629125 58844550 65426205 65915875
18537 65915875 65274012 64041283 57272291 44701606 32797418 24983223 20104942 17032102
18529 17032102 15019840 13626461 12663523 12007284 11502056 11191035 11230816 11497030 12012911
18520 12012911 12888318 14223107 16380089 19901252 25541292 34166850 45006123 53709276
18512 53709276 54912916 47886359 39049070 33843907 32699808 35296532 42071461 52513632
18504 52513632 62324010 65446596 60385722 53969406 53513982 58141500 61875342 59189418
18496 59189418 50145329 41100293 36101614 35335230 38660342 46018565 54563815 58254330
18488 58254330 53020269 41472604 31183348 24483505 20221672 17498761 15656807 14322495
18480 14322495 13320110 12495238 11859959 11305593 10757995 10331433 9959984 9484717 9106457
18471 9106457 8869750 8801611 8871088 9122754 9636032 10463433 11775585 14018064 17599682
18462 17599682 21992026 24822459 24055200 20147664 16341520 14142732 13388119 13927430
18454 13927430 15852092 18901058 21660326 22429867 21229533 20521706 22105896 24906389
18446 24906389 26152789 23947840 19503654 16008664 14160540 13804768 14975362 17457588
18438 17457588 19914108 20335186 17688423 13578752 10427742 8494843 7260833 6384845
18430 6384845 5741910 5317467 5010284 4780126 4531247 4238131 4030522 3944826 3775677 3580348
18420 3580348 3304532 3114379 2984915 2871555 2779289 2686307 2556012 2442093 2301178 2204753
18410 2204753 2167647 2028710 1872885 1747274 1674949 1637987 1554762 1436579 1361028 1289776
18400 1289776 1245117 1182433 1086477 1047666 1044363 992047 1030660 1023401 1015404 950069 949435 945050
18388 945050 917144 842963 806961 792361 751373 687190 686683 621924 671268 736985 678117 589391
18376 589391 529126 550008 572349 603243 629266 723165 692691 593110 493972 488642 543593 600369
18364 600369 525195 516852 530362 480855 509310 496277 490805 451303 411649 312646 324011 406736
18352 406736 442333 439704 505214 564036 619324 705305 615942 507945 475733 502032 553352
18341 553352 579342 583182 573741 563928 588754 592460 578007 517607 567785 599208 528796 465560
18329 465560 474666 435899 377400 423806 540332 567205 558652 496120 526104 454534 366673 389495
18317 389495 467642 433738 379406 339435 302208 348100 363756 311085 333015 313899 290102
18306 290102 244305 217651 244894 254407 240909 272227 301088 346732 379021 398368 433532 420531
18294 420531 451576 416967 365830 380433 460951 492303 517344 485621 481084 457996 503754 484042
18282 484042 454167 505449 651106 681513 546619 451338 416919 356125 445986 404243 346170
18271 346170 307660 290877 285993 269193 276970 276431 304834 313610 283699 258451 242148 242957 267063
18258 267063 252443 232468 261416 255327 328822 363560 348037 296038 246526 240346 215920 252081
18246 252081 211846 156433 133756 238452 330563 326487 326447 355362 355574 346265 321993 265753 241159
18233 241159 198013 164430 217023 328357 343809 351735 298415 238651 203623 175306 177757 215235
18221 215235 281869 211349 167022 151861 138568 159408 196778 209032 237905 178438 123018
18210 123018 138330 103648 167750 196158 216338 225859 225427 200237 183894 249375 306865 343241
18198 343241 300340 255667 236049 202668 190038 157280 148923 111349 130426 180554 222959 233744
18186 233744 273851 276524 304696 285355 255090 262661 240357 228356 203679 136856 162017 257116
18174 257116 292391 248734 200938 232202 252911 222259 163718 147382 202577 202530 156534 173765
18162 173765 216226 240537 235722 182935 232495 270756 217485 190204 204053 288661 371212 312424
18150 312424 302624 334980 259514 290702 309112 312173 380999 427285 386724 344805 395932 361337
18138 361337 434956 503785 578354 637209 669795 679655 767338 803383 794118 845841 925322 1123625
18126 1123625 1199010 1265510 1405976 1665006 1992485 2289609 2724975 3348837 4214829 5272385
18116 5272385 6791891 8968731 12111033 16948360 24800518 38415362 61455838 91700695
18108 91700695 112569901 107898682 78745388 50479913 33959000 24644762 19077784
18101 19077784 15488069 12980313 11266299 10005906 9036145 8224624 7574121 7068205 6595529
18092 6595529 6245955 5981816 5781167 5656391 5586999 5625498 5635785 5498063 5228713 4915250
18082 4915250 4591674 4239628 3911425 3613167 3334010 3114885 2928284 2728892 2540246
18073 2540246 2332380 2182615 2021206 1884918 1783352 1739789 1690874 1591777 1494802 1466407
18063 1466407 1444017 1399435 1376412 1416604 1472537 1584246 1596229 1595488 1588436 1489019 1359353
18052 1359353 1266436 1188727 1100981 1003471 946998 907191 830843 802445 819704 786450 721672
18041 721672 690827 708397 715766 660971 630346 646480 655616 639679 550074 492490 445974 377573
18029 377573 351215 388273 412565 464903 527082 518455 445715 398177 349540 338206 305535 320492
18017 320492 348298 340020 355204 341139 280964 289707 333021 457688 458116 441429 480614 578241
18005 578241 575437 541360 570636 529571 478328 458821 472529 474402 469798 509069 538501 543228
17993 543228 560947 591965 591575 602963 695325 806855 833540 784529 762757 750870 762728 841380
17981 841380 893632 790137 705857 636084 580796 546236 582373 597523 524775 481350 462465
17970 462465 412693 305100 293945 272776 291687 262540 219647 229789 240359 207517 225705
17959 225705 251607 262057 339032 362268 291055 203465 156702 196765 200878 206345 238280 395785
17947 395785 495231 475605 491423 555149 558536 553780 525947 524473 529351 499768 495826 555158
17935 555158 562366 460646 380834 409103 453393 476809 505771 449487 420117 382841 353672
17924 353672 337797 367891 361137 292991 278677 184178 132787 146477 166945 86671 93423 121305
17912 121305 105098 83266 116310 148467 117624 107020 110691 125027 132891 133480 107302 132006
17900 132006 130349 57046 14669 38584 140307 174100 144270 147846 132094 124869 96347 105950
17888 105950 49907 48394 61865 94997 185499 157292 133868 108419 109533 72536 16498 51961
17876 51961 40302 65955 71766 52844 75406 63791 81861 56534 44160 77474 14188 23671
17864 23671 65582 67172 39923 34077 -5038 -5340 24214 33891 97416 174573 195825 164668 119173
17851 119173 101953 91002 64410 90456 57247 14193 15719 52771 81315 63616 53007 61082
17839 61082 77600 20104 7167 38489 81079 55791 72692 69400 116561 118517 78561 98214
17827 98214 89872 68769 22808 53422 78267 63320 97983 132050 164657 113508 6269 -26372
17815 -26372 30217 110928 145970 108041 67334 45223 62958 65790 109500 142686 156065 145879
17803 145879 43948 38322 149447 144105 124516 184931 132127 123258 68698 76136 127291 115931
17791 115931 80511 63675 120647 143324 109362 16219 19472 76088 100824 59221 14612 79092
17779 79092 51998 -1900 -18199 5368 3616 -9165 18807 72306 63673 70881 110522 44145
17767 44145 21382 8626 20246 27062 -27464 11560 70327 56579 54218 56371 84224 102791
17755 102791 188853 211096 148112 42971 -24709 -39308 -12594 -23599 -85350 -47412 10997
17744 10997 17644 109800 95471 432 -54955 -54605 -31292 -84931 -39668 24337 91261 23381
17732 23381 40715 69732 57417 -50251 -35594 28603 76148 96040 108033 102057 86843 84916
17720 84916 62127 64871 117236 83321 21203 2816 -28067 22058 106828 109291 66121 24151
17708 24151 83571 83567 -2108 -44021 -23193 55060 119740 136062 78725 101663 159567 146250
17696 146250 114874 92885 105860 41958 23267 81383 94458 95340 6821 5949 29808 40067
17684 40067 21786 23029 19087 46010 -24486 15105 10707 -11896 40173 109892 85183 32812
17672 32812 -7873 -14414 47430 54520 83673 125829 106600 78830 49456 11051 4415 7366
17660 7366 814 -73275 -71187 -32105 35704 101094 115475 168893 119664 84767 46410 -24235
17648 -24235 -53473 -24468 -17718 28056 3433 -19189 9263 18476 62286 66521 38432 7654
17636 7654 -21585 -24234 -6961 32399 5329 -17234 -42806 -101365 -127784 -136119 -69809 24680
17624 24680 51366 29012 27441 -7896 -41979 14034 44808 14664 87262 116022 114004 122074
17612 122074 185300 132012 150948 169437 131093 126418 95348 60682 66184 64522 134183 126591
17600 126591 57917 33830 28989 36907 58100 60130 105498 56551 41778 84024 40643 -21753
17588 -21753 -11932 -49165 -27657 5814 -1349 26666 -14669 -13005 3486 10427 10902 32845 60138
17575 60138 122043 120692 60911 -34943 -8506 -11695 -43103 30242 36749 -5571 -46672 -29974
17563 -29974 -36657 26532 15628 26671 -14084 -26966 21402 94116 164226 108868 86916 54738
17551 54738 3094 -21337 -26347 26817 18498 54387 132259 127314 48499 32348 77312 21739
17539 21739 -49739 21381 67892 106571 83716 36560 -11058 37480 60643 96997 64358 18635
17527 18635 28964 122350 144620 102216 83205 11863 -13254 35664 96338 62641 -1398 3670
17515 3670 -11572 17490 -14102 16094 12650 22135 38561 49791 37273 14239 22752 31066 42884
17502 42884 76446 96128 32999 -10715 73399 51649 -56702 11827 78176 77014 40275 9017
17490 9017 -53295 -59038 -29974 -7989 75088 159882 135956 76263 -9532 -20222 53981 38564
17478 38564 20869 27674 77638 40089 37459 55014 -14271 -28487 13103 31742 22206 -21600
17466 -21600 5491 16043 14383 4539 -27656 -8199 43970 156448 178022 119377 14250 -27709
17454 -27709 2637 -5579 20562 77007 102748 39378 -3932 -12082 40158 115430 213449 460632
17442 460632 587932 579189 515458 395844 278010 176772 161021 169910 143787 126791 168716
17431 168716 145295 166456 137329 101852 117071 51852 71586 85553 52446 32883 66071
17420 66071 45356 23454 25284 26184 49143 48060 731 -51921 -70950 -44192 -42850 10435 616
17407 616 -2608 -19081 -11593 42401 65916 80980 69737 83172 105800 139586 130660 101077 10590
17394 10590 -27826 -9951 -10466 -35948 -25357 24301 13501 -13189 20495 10555 -8703 -15375
17382 -15375 16242 95544 54674 24327 37445 66351 -8205 -18030 26816 38641 -2292 66322
17370 66322 69253 85752 39017 76545 40103 28809 -1548 -12985 19661 43656 42294 45136
17358 45136 3157 -17812 -31977 -11697 10095 41249 48193 102229 71468 25629 62094 144682
17346 144682 62655 -12101 -57680 -1786 28511 25288 -1140 -1508 32546 8226 95548 122562
17334 122562 -6821 -49331 -108008 -59851 -18537 -60482 -55870 -40064 -70299 -72153 -36290 35598
17322 35598 59174 78662 86798 55691 35700 52880 61046 25070 -13033 27696 39933 38854
17310 38854 72556 -50764 -116374 -25221 -56673 -75173 -64230 -42334 8732 4418 36499 47222
17298 47222 59282 40745 46007 102036 130441 59468 -8925 -43675 -70827 -107783 5106 24235
17286 24235 -23031 -26325 -81179 -93534 -70197 -38434 -55340 -9685 33286 40005 36401 38418
17274 38418 20628 -7836 12642 5550 -1101 -20922 -28799 -72377 -61423 16973 22289 12118
17262 12118 -21234 1510 18986 -97 33999 58273 26707 -19970 -46676 -16760 50337 89966
17250 89966 46290 -16404 -111010 -97216 -120383 -122853 -52828 -16130 -35840 -29835 25107 86945
17238 86945 79203 33392 17635 103226 68083 31144 -13593 -564 17471 54490 79811 63446
17226 63446 95351 105915 57741 46132 53556 72845 29969 52625 108638 99203 17519 -7717
17214 -7717 -48966 -54317 -73 39551 26764 -7239 11194 28130 79924 83768 1013 5326
17202 5326 58166 96529 56332 -6738 7383 22187 448 8785 72529 139166 99665 56293
17190 56293 69717 92712 -2927 -59273 -49400 -28094 16418 41897 -13998 -52928 -65349 -29523
17178 -29523 10625 -24457 -9322 24373 18195 -37779 -28145 -39413 -9332 -26176 -41478 -55159
17166 -55159 -134942 -57677 -52234 -45039 -34473 5016 32164 1930 12954 -23451 -42102 -21324
17154 -21324 -12704 -42315 13683 60265 38880 227 40244 34581 48139 40715 100705 86384
17142 86384 -13141 -25937 -39816 -49001 17264 85622 72392 64499 55672 23481 6635 73826
17130 73826 113012 61490 49353 53334 26667 -3109 43258 37632 -630 -61306 -36146 -1644
17118 -1644 265 2695 -41783 -39693 -24678 -41385 -44488 -30483 -10736 41373 78033 68909 105793
17105 105793 111824 139416 127856 94466 80530 74598 47545 49693 30621 -6520 -18050 -56
17093 -56 40921 48730 2775 8740 29237 2546 20417 25444 16459 47332 55924 2057 21976
17080 21976 88439 112236 65483 105370 158813 143462 101388 57675 17300 4948 51248 52994
17068 52994 6881 -23340 3907 -45035 12752 59802 58930 44006 67492 102932 86317 62688
17056 62688 25245 16078 -22509 -7407 36995 24618 -28726 -36629 17569 37865 14504 4556
17044 4556 51756 22661 14711 2435 23215 -38193 -16374 36924 148396 156587 129870 86556
17032 86556 2087 -43473 -23199 23772 18110 -24326 5691 19020 25988 55978 55922 50685 17253
17019 17253 -29236 -62345 -37569 -11375 -3096 17410 28791 13173 -13243 38271 74387 48078
17007 48078 17450 -9064 -5925 -3502 15105 8233 21382 40544 65991 9893 -37392 -25413
16995 -25413 30111 19029 -5715 60806 98370 111562 144720 123646 82679 65106 25107 29279
16983 29279 68641 46832 -20048 13031 74585 87391 52534 56917 68862 79990 57975 88470
16971 88470 103232 97136 130289 58579 -17767 -28925 14372 18203 10813 28391 70170 27688
16959 27688 -66696 -71091 -15611 10984 4137 34542 16748 -25168 -66178 -50764 -25417 -58434
16947 -58434 -48019 -2353 39960 14306 -36702 -5533 47640 59804 109127 84442 38678 8730
16935 8730 35189 96721 80116 70098 36777 91216 99946 25038 7788 -20903 -21655 -71706
16923 -71706 -92280 -140409 -122559 -49105 -44194 -26544 -15297 -32151 -61103 -66169 -30335 -30412 36454
16910 36454 83465 60237 24167 46419 43160 61067 4401 28304 72026 38311 12658 33305
16898 33305 1945 -86822 -113317 -36487 -37190 -40866 589 -29051 32138 88114 77280 3603
16886 3603 -75920 -118845 -90212 -20024 13253 -12354 30776 1205 7290 7197 -17985 -51298 -48858
16873 -48858 -48091 -45618 27256 22678 97531 107904 26951 29496 13221 36507 5045 -53311 -30169
16860 -30169 75176 81576 51095 -401 51601 50697 90576 155008 104087 54437 -11424 -44295
16848 -44295 -114402 -112716 -63365 -5195 63418 20019 -8201 -15706 16182 5715 -13327 -43596
16836 -43596 -48038 -48392 -73602 -58461 -57176 -36489 -786 -8004 -15407 8235 -38642 -52924 -8640
16823 -8640 21221 75392 78173 63894 79271 51149 53124 38162 97532 129545 91131 78901
16811 78901 76643 24830 5948 -48359 -101213 -87107 -46591 14736 6676 -35741 -51856 -809
16799 -809 59103 69725 395 38173 80867 57851 48275 123503 116976 105880 129355 69455
16787 69455 24042 52993 11930 -13194 26528 55227 61269 41945 -796 15784 41270 46224
16775 46224 36336 -22408 23286 60754 115876 141111 124246 63386 38589 59514 61388 33858
16763 33858 33279 34147 21838 53211 90802 30002 63255 79787 5080 27834 43118 32919
16751 32919 53005 58214 11244 -11771 18242 39985 -11598 -114320 -111368 -78186 -38608 -47400
16739 -47400 11686 8109 -9058 5854 -30361 -3646 1445 -32778 -139525 -176255 -167305 -103503
16727 -103503 21245 39792 15393 -44280 -91816 -35670 39457 35416 -48486 -81677 9114
16716 9114 78210 20173 86653 100525 72628 66622 23804 -41642 -33903 6467 35188 -1947
16704 -1947 30829 107177 90741 62931 -3168 -11256 33414 17812 -26987 -2287 38828 30636
16692 30636 57763 46992 -5183 22802 26558 31860 8024 -41047 -11800 28849 -20651 -132045
16680 -132045 -153444 -121086 -155013 -109743 10947 92260 58759 45373 29652 -1663 -67906
16669 -67906 -65948 -18451 -14499 -46737 -78001 -94932 -41377 -33985 -61890 3933 43654 18025
16657 18025 -22075 9455 27632 29841 45345 59320 93582 77152 35561 8115 -32079 -23579
16645 -23579 24630 41068 96530 23502 -88646 -104271 -125677 -151020 -135228 -73719 -3128
16634 -3128 -3077 55851 41690 -38539 -118152 -151069 -112112 4084 89237 73389 35976 24017
16622 24017 25389 -35593 -10281 63188 56888 59266 -43153 -78533 -79545 -46014 -19403 -87064
16610 -87064 -85246 -120450 -144647 -97676 -87319 -79709 -18857 13891 -652 13493 18132 -44311
16598 -44311 -68914 -19958 3443 -2431 17780 58055 -19566 -19519 -73819 -65470 -62493 -100933 -104036
16585 -104036 -46068 -28034 -7336 -33307 16747 39066 48258 52584 15722 3902 -6718 -34383
16573 -34383 -28290 -59867 -37408 44985 31638 19516 10135 17647 -18963 -45223 -52150 66910
16561 66910 48613 5965 -15576 -28703 -67329 -51258 -15950 38522 11150 101390 155938 130368
16549 130368 122615 79740 -7354 -49908 -87469 -125624 -80922 -27824 12665 -33220 -15631 51468
16537 51468 33151 49594 4303 -11985 -7570 9326 21344 32910 -19162 -26768 -70779 -44240
16525 -44240 -51816 -53210 -44745 -65132 -70638 -47492 -18548 13223 -58462 -63031 -28151 -31888 -13084
16512 -13084 11087 -17511 11044 8664 -42436 -10812 31 6806 -20059 65358 140783 114098
16500 114098 39079 -45858 -59072 2851 42140 88836 70179 1690 -46937 -55557 22065 89384
16488 89384 91214 107704 31729 -18841 15952 18608 -31323 40701 10668 -54196 -67960 -39325
16476 -39325 27738 56193 56040 53075 34625 98633 116746 78173 42586 -6445 -37988 -50146
16464 -50146 -23360 -28904 -63302 -36640 -29801 -75727 -74462 -64529 -73959 -50184 -16340 -59284 -41688
16451 -41688 -735 1342 2299 -34112 -55471 -18588 -19236 -38563 8826 56594 70328 4366 -28507
16438 -28507 27141 45899 77514 90419 90395 79232 36587 21742 57971 32953 45462 98776
16426 98776 66390 -27637 -43967 17719 45057 -21170 -1761 -27239 -55938 -45163 -49593 -82913
16414 -82913 -92855 -55873 13351 42692 77914 41498 8922 9423 30769 2428 65765 183087
16402 183087 172997 98211 -4417 -83649 -54225 -31677 -17904 -11483 8666 -2066 -39958
16391 -39958 -38962 -67698 -48363 -44101 -22249 -62 -27295 -63508 -97750 -102575 -44422 -38970 -31983
16378 -31983 -44183 -49996 -33171 -44718 -29276 -90309 -44416 48274 70900 28395 52690 112621
16366 112621 111966 107560 84172 55732 27487 -3108 1589 -22471 -14882 3888 37831 44484 37564
16353 37564 -25453 -11771 -37512 -38033 -19623 17544 -30759 -114337 -96274 -74512 -51875 -64164
16341 -64164 -28324 -28890 -20147 -1306 7898 13885 12053 54451 24181 49160 78261 7227 -51361
16328 -51361 -74205 -31773 -26562 13040 79185 82711 74358 30136 18231 45228 36986 23897
16316 23897 15942 61035 72315 17086 29135 48227 50954 52146 27717 -712 -20767 -15057
16304 -15057 -17888 16978 68882 96418 96691 68408 65225 59872 -41425 -46175 7011 4373 9249
16291 9249 19298 805 -22370 -24178 -52159 -28298 -20603 -61046 -9572 20878 -96083 -104564
16279 -104564 -68502 -60084 -51169 -11511 -46018 -84719 -54166 -39294 -39266 9908 34316 32943 26547
16266 26547 38493 84694 72957 96251 115482 44949 -20032 -27853 22860 26144 32658 -39748
16254 -39748 -92442 -109473 -101033 -90824 -14376 -37209 -16636 -44555 -43414 -11659 -60095 -65149
16242 -65149 -23851 -53533 -60628 -78931 -69282 -43655 -39346 -54442 -48749 -24932 29442 43689
16230 43689 -10605 -1109 49547 101110 89593 62007 43188 15188 29734 29690 62655 78033
16218 78033 79440 51686 17349 -26479 -71922 -94903 -76291 -20603 55970 28433 4013 51701
16206 51701 35071 -33379 -34431 -9907 -37410 6891 37170 33885 4380 -52711 -65672 -14959
16194 -14959 -64936 -22203 -34195 -31598 8194 36938 30353 -79754 -87255 -2528 -14273 -18599
16182 -18599 -39734 -85657 -54147 30661 -46899 -20527 -20266 -51846 8918 -4046 -45944 -30710
16170 -30710 -29404 -15488 -7588 -38586 -52890 -50740 -54462 -54503 -44189 -12723 -6964 -64914 -119570
16157 -119570 -120920 -107197 -56305 -35164 -18252 -13849 -53886 -44624 11142 62173 29621 -17510
16145 -17510 -44319 -69016 -15709 -13449 14015 63300 50496 20638 -16319 -49716 -15920 20337
16133 20337 16261 -24380 -37037 -45446 -43467 -58146 -60671 -44933 28367 -24485 -55533 -40524
16121 -40524 18151 21120 34169 23831 34045 63900 108365 61921 -4838 -29802 -19468 32241
16109 32241 -25156 -49803 13176 120263 79549 49934 80333 100955 75869 -15424 -41512
16098 -41512 23007 51530 4352 -23855 27376 65597 5449 -45984 -48690 17676 32055 8400
16086 8400 38438 35804 -20919 -83785 -76941 -25866 -16089 -67859 -47833 -94588 -129060 -40854
16074 -40854 14789 -28579 -92299 -112831 -103250 -58571 -92925 -115104 -124875 -91412 -67427 -74346
16062 -74346 -88920 -64168 -21621 26853 66447 47857 19740 -68055 -158443 -143882 -101804 -25747
16050 -25747 -5672 -37834 -14496 41628 40526 44905 53533 63594 31141 38699 47054 41183 39106
16037 39106 24822 9454 -35366 -68594 -109242 -39681 -6442 -3786 1011 5211 -65074 -82704
16025 -82704 -38925 -32372 -46378 -8620 -14664 4327 -9091 -19335 -8434 -3790 -7950 33564
16013 33564 22053 -7798 -28205 -44374 -18715 -8380 -7957 13284 48084 61894 38695 5589
16001 5589 -54740 -90319 -125240 -77617 -60086 -32965 -867 33974 95348 126504 118077 118881
15989 118881 67601 -8796 27832 87142 149503 92583 -5283 -42552 -64621 -39289 -49638
15978 -49638 -57065 42780 160173 155087 122557 96805 103043 135396 82992 33647 20307 27620
15966 27620 56391 20436 -63502 -113078 -148114 -87391 -40881 34928 47248 13670 -30767 -3983
15954 -3983 1204 36276 42852 18044 4059 -14154 -16473 -41064 -45844 -35231 -23392 18617 21962
15941 21962 81418 88993 90824 14988 14409 39066 66560 58778 -37283 -51146 -58447 -78817 12790
15928 12790 42371 63098 70844 65635 70834 62161 20455 -1062 46168 29540 7074 33330
15916 33330 79199 53765 14 36126 -24333 -50535 -39570 -19515 -13379 27663 30685 -43256
15904 -43256 -72894 -124529 -90811 -39804 -55105 -94464 -96328 -96599 -101096 -71758 10879 58375
15892 58375 78478 77265 84428 117477 147355 105840 2993 47400 118435 64244 -5052 -77069
15880 -77069 -59593 -23674 -27801 -14220 39851 9842 3172 -4005 -15276 -42540 -35238 -35606 -18167
15867 -18167 7557 10645 -1924 -97458 -80803 -82464 -80375 -82306 -47829 -47990 38406 31163 36586
15854 36586 47821 55615 67129 72562 8460 6942 6581 27047 65445 4791 -10721 32051 57041
15841 57041 24488 -29802 -38842 -9472 -19781 -5699 -58035 -68704 -24948 28502 47147 57761
15829 57761 103457 99779 98026 9713 -52850 -84712 2826 63166 88646 73158 47007 35948
15817 35948 70978 41699 -31474 -41791 -11905 -40839 -44607 -41820 -48278 -27460 -50568 -62880
15805 -62880 -34607 8223 12221 -12830 -26673 -48069 -78939 -66594 771 74587 49707 33608
15793 33608 11400 44 -60641 -18744 -11134 10450 -49533 -111736 -87748 -84621 -82084 24099
15781 24099 81432 47834 48564 -32574 -97719 -76603 -3254 -8597 -9108 18797 40757 26914 -38658
15768 -38658 -85332 -65915 -35999 -18481 -36261 -71061 -92255 -28518 27475 126062 92425 38415
15756 38415 76713 75793 87860 52826 53248 53859 63559 55576 18516 -4918 58025 109838 119381
15743 119381 7873 34294 82156 80764 60847 52432 12039 -24424 -99923 -42144 56872 89659
15731 89659 151680 159776 133726 126518 64832 50813 -26659 -36558 -26255 -4387 52870 83567
15719 83567 46198 37362 52369 26800 -15555 -23816 -7973 -2410 56182 98002 86658 20338
15707 20338 -41501 -94232 -43783 -13341 4954 28223 1911 -46011 -41176 -61044 -32653 15186
15695 15186 -9260 24742 28879 3161 -3662 -9383 -9414 48748 58444 33938 70348 44978 -14522
15682 -14522 -12337 -61106 -63286 -69082 -82669 -50684 -29864 -45190 -67401 -73042 8038 15385 -16768
15669 -16768 -37806 38428 63263 53973 37219 40821 7810 -790 28446 22957 42097 -6928
15657 -6928 -49935 -42515 10223 13447 -9258 -81874 -24742 6925 65933 28582 -65210 -115054
15645 -115054 -91762 -37792 -51876 -40182 -43192 -47068 -10196 -21779 -77049 -12318 -48964 -41366
15633 -41366 -3938 66307 82537 43074 5730 -7351 -29670 -9985 72398 104571 31935 -60488
15621 -60488 -82541 -113207 -171373 -111558 -71282 3071 24809 9454 14157 -6648 28225 47243
15609 47243 117923 171973 111034 -2046 -81508 -83631 -50843 -26021 -43110 -60119 -52457 -36012
15597 -36012 -13202 44221 87841 59034 10289 48515 72027 -29280 -75141 -58322 4135
15586 4135 49089 7904 -46841 -72192 -406 -50809 -94536 -70555 -23015 -28411 -44854 -60175
15574 -60175 -27591 52008 34215 -12443 -19140 222 13446 1599 16305 32386 77291 78072
15562 78072 21932 -18403 -17573 -17719 -57664 -14143 36881 15278 -31037 -24975 5290 -48510 -34230
15549 -34230 6301 23218 89581 166467 175496 65871 -26096 -52877 -42262 -74837 -57903 -53698
15537 -53698 -53595 -15744 -5490 -5859 -51982 -92914 -28183 26122 42046 32118 29039 -50576 -87397
15524 -87397 -108460 -115304 -63857 -81503 -91124 -49185 -24757 -6942 -4556 25598 56314 87704
15512 87704 53093 55046 60972 63344 17881 -13133 -4204 10644 69226 75374 69638 12648 7876
15499 7876 106739 107315 79834 84312 13635 39531 37669 -29409 -69547 -3272 28651 34812 59640
15486 59640 69652 23240 11231 47487 48717 36873 -7705 -70149 -75598 -10916 4543 75455
15474 75455 118817 96378 72554 19364 -19093 19942 30217 88472 92696 61553 41505 22657
15462 22657 -40677 -28917 -36203 -63829 -3890 -20394 -31261 -78325 -74570 -61734 11158 23255
15450 23255 -4583 76243 98540 34401 16156 5395 -4182 -8838 -9686 30475 -11428 16853
15438 16853 63085 88795 137250 71221 -10621 -42603 -119323 -117242 -10511 29190 -26900 -31665
15426 -31665 65537 132948 80634 83511 115819 68860 96391 67065 60674 94257 86603 67545
15414 67545 -5047 -20090 17767 -17481 -8197 -22313 14835 923 11816 593 -80791 -124741
15402 -124741 -41690 34246 25918 -18583 -62365 -122711 -206955 -182234 -125353 -98556 -43083 55437
15390 55437 58054 1231 -38148 -48062 -53450 -57665 -23339 -17333 -51964 -27547 -15264 4542 26742
15377 26742 19114 33669 94689 99746 56634 51888 94172 54074 68459 97912 89930 441
15365 441 -35387 -41462 -72695 -52003 30558 43029 42135 65923 159062 153056 83477 46593 57262
15352 57262 87030 57176 97542 173145 157160 129272 138408 104027 56705 -35719 37611 56999
15340 56999 45782 18797 -43914 -105263 3940 33422 -12106 -57741 -6975 56370 31963
15329 31963 33968 64539 -24529 -96167 -65782 -14803 -2902 -52115 -71391 -20293 16431 30292
15317 30292 -8468 -13408 11676 -90503 -74863 1586 96425 100753 132539 134665 84180 -4696
15305 -4696 -63277 -51711 -44636 14757 47992 25664 50883 22461 -46612 -11071 37463 18386
15293 18386 -25603 -20526 15069 75797 52910 20560 63988 88319 51067 56355 47096 82434
15281 82434 65174 27652 -44421 -37290 42051 5322 -21460 26157 11467 -69673 -64354 -49821
15269 -49821 -67498 -103477 -106076 -71407 -31014 -49556 -84930 -81014 -114177 -129692 -14105 59173
15257 59173 10214 -54914 -92894 -29475 35373 3869 25327 7361 -489 -32874 -117724 -44704
15245 -44704 43040 56023 -12849 -31635 -3385 6328 -23948 -29775 -67617 -70914 -41604 -56882
15233 -56882 -108626 -65338 -15679 4874 -15555 -45909 -77984 -105212 -127640 -99069 -99998 -127129
15221 -127129 -86365 -37989 -31033 -56383 -30657 -57278 -50631 -54626 -652 -30004 -106381 -40023
15209 -40023 3095 -4909 -30545 -26529 -17608 16502 -32531 -68235 -41890 -39077 -120506 -173995
15197 -173995 -137499 -46814 -7700 1242 -17580 -46899 -94537 -109898 -8442 21478 46275
15186 46275 61978 40947 -56156 -107644 -131868 -60655 23168 -40643 -106830 -98498 -6650 42183
15174 42183 11247 -18902 11046 80187 64567 85998 82961 77131 45170 44113 -62354 -110905
15162 -110905 -76731 -51937 -51146 19105 346 -27296 -43259 -113887 -140909 -108860 -64661 -44642
15150 -44642 -13715 -51361 -71110 -102277 -59974 -62461 -73241 -40151 -14650 -9490 -20102 45815
15138 45815 38060 29277 -3150 -4771 -5551 -20693 -109192 -145614 -67828 43889 95102 127120
15126 127120 35605 51398 48336 42830 51106 32917 3764 25354 35366 21979 -27328 -35719
15114 -35719 -34091 -62233 -137315 -102543 -72808 -25940 -18575 -42445 -19643 10995 -33353 -5208
15102 -5208 28288 66925 50684 55072 102 -18121 5492 -8602 -65753 -75346 -77901 -47518
15090 -47518 -8854 33794 60692 44003 75142 55788 339 -19946 -60507 -104286 -87197 -33624
15078 -33624 10230 -58725 -121925 -71464 1897 34758 87072 60744 24015 -74921 -113278 -104500
15066 -104500 -25647 -17574 -57511 -126703 -143624 -108604 2111 28299 17957 -26854 -46355
15055 -46355 -61829 -56406 -54845 -61293 -73659 -97088 -38191 -71728 -40580 -13752 5035 29113
15043 29113 32875 907 10359 14808 40079 60589 42219 26854 -6227 2697 59457 99744
15031 99744 114037 76274 27498 -44592 -73077 -38829 -54816 -47650 19627 19653 3497 15770
15019 15770 2131 -47146 -115822 -89363 -30126 45359 56868 29049 -5958 60676 54176 -19167
15007 -19167 -74712 -61947 -54150 -61576 -48463 8816 12660 -45154 -51355 -40592 -26538 -29053 -57547
14994 -57547 43939 108890 98507 101948 13618 -84237 -103041 -49347 15344 53441 101381 88416
14982 88416 26421 -29438 -78826 -112700 -60403 -54719 -45238 -7226 66364 131851 82088 39201
14970 39201 18113 -50296 -106267 -94925 -89272 -110939 -94345 -109261 -82120 -68037 32732 27594
14958 27594 -66088 -108924 -116041 -134447 -105444 -46068 -24008 18301 1239 24761 22497 -13004
14946 -13004 17251 28559 48106 15838 90952 98750 75716 50027 42379 6347 -18879 -35881
14934 -35881 -29029 2563 -40306 -109331 -152672 -88462 -117385 -75243 -28802 -23752 -3622 44877
14922 44877 87015 89512 66747 108456 50474 -41183 -37603 -39409 10720 -37087 -143298 -188016
14910 -188016 -179835 -67996 -52196 -110770 -119051 -100048 -22856 9761 -48221 -40465 -36792 26324
14898 26324 -14321 -67826 -86309 -53938 2626 -8521 26543 40512 62966 52776 77317 96668
14886 96668 40831 -19877 -3365 -9212 18304 -5204 -23210 51371 37771 -47836 -84004 -91566
14874 -91566 -74981 -3363 -631 -12273 -24152 -55214 -70037 -105808 -84269 -22239 -39815 -71052
14862 -71052 -25588 20843 -1892 -33433 -69913 -60618 28147 52866 58740 33092 59148 20172
14850 20172 -19563 -14427 13745 15152 -39263 -62986 5611 41679 27669 63851 56267 30884
14838 30884 -30154 -70460 -107249 -55207 -26019 -13108 -13012 -18397 13993 -25700 -1208 -4488 -39917
14825 -39917 -52367 -136030 -243709 -192618 -93196 4717 43555 57584 -40993 -65999 -51290
14814 -51290 -43762 -5485 -59369 -121128 -139009 -164548 -121622 -82062 9585 40312 70132 105594
14802 105594 118717 144197 78595 -35297 -38979 -54712 32369 -5772 -60105 -71269 -72806 -80101
14790 -80101 -79130 -70869 -31147 -37101 -10841 -53088 -43421 -9132 -21591 -65721 -79154 -44186 -8336
14777 -8336 38157 73635 16013 -28621 -92625 -78117 -53308 -94297 -105569 -82044 -99368 -62570
14765 -62570 -58925 -39946 -25427 -35013 -32438 -34855 655 42992 -46028 -72929 -20549 40813
14753 40813 52023 20987 24766 48314 83090 41324 13153 -45425 -95597 -93510 -35637 47481
14741 47481 34562 9908 -14924 14776 71572 62918 -18916 -54048 -74873 -17779 6016 3793
14729 3793 -38791 12596 102312 114709 93259 115539 48662 3806 -25957 -118987 -224739 -207231
14717 -207231 -165055 -75611 -73156 -88982 -51898 -4651 -23987 -7095 21456 44070 80519 124810
14705 124810 119030 60939 47701 -3893 18151 68832 -40902 -178114 -114989 -37127 -13845
14694 -13845 40405 1919 -1429 7449 56649 69177 75769 82084 65850 -10906 -81204 -34867
14682 -34867 -31416 -24111 5598 -29588 -66553 -49445 -31963 17666 110821 134150 121855 81345
14670 81345 62885 65326 6367 -44423 -56155 -54394 -69589 -126125 -99409 -117712 -86138 -99870
14658 -99870 -51313 -20970 -65068 -116511 -96845 -90870 -29403 45177 58510 54770 25774 -70207
14646 -70207 -92702 -13051 26409 -7399 9886 25538 16614 29203 -8751 27272 18518 -41263
14634 -41263 -74971 -128217 -102372 -101180 -101960 -66054 -65718 -68426 -13605 24215 -9267 -21517 -18517
14621 -18517 15525 22444 32824 58632 70996 37811 50420 60709 166273 141130 110734 136452
14609 136452 131552 47461 36705 15602 5413 -33687 -70174 22954 111880 82139 -41845
14598 -41845 -83896 -77971 -47831 -79534 -85023 -41902 -49456 -31788 4173 -11611 -24660 -25530 -17843
14585 -17843 -4159 -29940 -58786 -62843 -30485 -18493 2588 -39826 -12121 -6974 -37350 -13126
14573 -13126 47741 25013 -4071 -17831 -26763 -1961 42670 -5127 -6472 -7583 -54504 -71088
14561 -71088 -55207 -74099 -144268 -132509 -73937 18489 63216 4811 -18152 27029 84818 41536
14549 41536 -7191 -22028 -15676 32494 117966 83344 1374 -46924 -18331 11406 -32501 -64295
14537 -64295 -24635 -17006 -21634 3959 -93590 -87372 -55307 -11149 -13596 -66581 -46726 -7543
14525 -7543 -21711 2789 -15359 -78414 -65956 -84719 -70494 -94945 -95176 10081 -8812 -65793
14513 -65793 -94596 -99657 -144344 -143148 -81166 -27441 -34351 -28808 -19917 -41840 -65007 -50656 -43399
14500 -43399 -26618 -56663 -40267 -86105 -43580 12855 14701 24801 4090 -67129 -66823 -4524
14488 -4524 25178 20025 -19750 -42938 -86029 -118799 -42506 -20954 -92049 -95054 -59062 -89624
14476 -89624 -79223 -5201 41907 4041 -84581 -83871 -33565 11873 22315 24445 -4029 4019
14464 4019 44964 11387 57895 -1929 -60679 -36540 80422 97316 114432 116524 84693 67527
14452 67527 73196 65122 37121 14367 30394 44878 40843 49604 86584 81258 60131 121279 156298
14439 156298 40920 -97002 -83234 -95376 -69477 -69267 -38917 1026 -4113 19157 66323 84296
14427 84296 43611 -41705 -103455 -124140 -76272 -25067 -24921 -65357 -49771 11677 8425 -44305
14415 -44305 -58207 -91516 16500 68321 -30765 -21225 43290 41834 49812 74258 40107 -13054
14403 -13054 -96976 -119387 12512 78908 40633 2434 -20408 -56233 -70742 -81665 -88117 -49553
14391 -49553 -12741 12880 90510 131773 66115 -73893 -77028 -10570 -8212 -35704 -46022 11511
14379 11511 15392 -56161 -73826 -52638 -35228 -12644 9377 1599 5870 -37198 -24162 24937
14367 24937 17941 -34438 -53671 -91971 -119366 -93191 -78340 -63556 -99143 -114396 -17090 -18512
14355 -18512 6836 4383 65902 5595 -13010 5000 -26031 -6097 21998 17668 4940 27417
14343 27417 12886 48856 113466 137152 113991 76264 25784 -39 24652 43928 47600 -1924
14331 -1924 -20276 -87202 -103537 -47507 31820 67199 -35104 -86447 5671 -3773 -1096 -72355
14319 -72355 -94877 -44615 -5226 3063 -2203 -44721 -83508 -113285 -107119 -84026 -87296 -74005
14307 -74005 -41730 -41634 -74267 -105830 -78482 9458 52407 118222 136138 77170 98812 115402
14295 115402 147770 94812 45359 -40442 -5652 28060 19561 71266 160019 127236 32578 19636
14283 19636 -44374 -84449 -98459 -83659 -14043 31605 12188 -4258 62832 104550 77692 616
14271 616 -35975 -15658 5550 -4251 -2164 -19854 -69474 -16584 26561 -6466 -16667 -86438
14259 -86438 -178995 -176156 -167652 -76840 -50746 -110741 -71438 -12318 -71366 -48683 -35262 -11875
14247 -11875 -14943 -53630 -61886 -89404 -91734 -44561 -27690 -1046 12300 58576 61381 20717
14235 20717 40269 47446 50107 47780 -6823 -24365 -57186 -72372 -72322 -14778 -6550 -40737 3757
14222 3757 -15471 -55704 -34408 -43669 -27670 17032 27300 15685 39666 41685 13584 36663
14210 36663 -11726 -44015 -7373 -26230 30908 25156 5013 48176 -8486 -13970 56025 66465
14198 66465 47229 25581 -16984 -43113 39644 80081 109823 65962 72280 76864 51509 -37876
14186 -37876 -44005 -63810 -125493 -149920 -73962 -2916 39355 860 -8658 -36131 -87457 -93929
14174 -93929 -133721 -127962 -142065 -153304 -155612 -70744 24196 -34680 -83698 -69512 -76086 -22906
14162 -22906 5529 -21396 -17904 -13445 19644 94436 16975 -22319 -31287 -13317 -20141 -71521
14150 -71521 -74104 -12085 -454 26532 40075 94069 137454 104611 107456 82684 26982 67680
14138 67680 42642 -34730 -87713 -29803 -38307 -81195 -91700 -102233 -86387 -77108 -65423 -85947
14126 -85947 -102655 -168129 -200545 -191772 -87883 -18498 13085 20210 35437 22006 16301 -34279
14114 -34279 -92752 -137941 -158958 -163707 -146122 -161322 -166069 -146218 -100771 -58400 77 53047
14102 53047 33308 21374 -21103 -33742 -73978 -143323 -115081 -38537 9681 -4021 -21593 12803
14090 12803 -11964 -38022 -30176 28656 39870 -2611 -86279 -91071 -68162 -50777 -14882 33341
14078 33341 38964 12099 3547 -16684 19405 64729 99288 2211 -76107 -46390 -38780 -73201
14066 -73201 -84057 -50205 -23115 -54224 -74797 -57982 -82719 5528 77555 106836 54697 48526
14054 48526 -25386 -53382 -27571 -56029 -88081 51418 61880 26185 12935 10518 39759 56216
14042 56216 55433 66336 -3223 -26891 77555 84319 64332 54841 55065 22524 9868 25195 64314
14029 64314 65093 111479 98228 83500 65403 53501 54207 16808 59551 80917 -833 -102521
14017 -102521 -118010 -23506 -41113 -43944 -3305 13974 67434 82281 71694 40114 -50545 -96457
14005 -96457 -12694 28667 91282 118619 83683 112832 164644 130918 49077 -24530 -46901 -98290
13993 -98290 -72894 16862 51660 32516 6242 -8091 -5286 9069 7848 52482 63192 30699
13981 30699 6634 -1533 -94123 -117331 -71164 -53996 -70861 -24022 9157 23044 39697 23104
13969 23104 -8794 38051 30578 -19437 -50919 -69363 -137402 -70214 -47455 -143693 -123549 -100618
13957 -100618 -110943 -129601 -130978 -93531 -60818 -42734 -20099 15547 -11651 11476 -1026 -79374
13945 -79374 -148944 -161713 -155543 -134712 -41602 54908 42392 19602 24443 34449 86070 42556
13933 42556 1408 -24450 -66505 -117627 -44312 -42863 -3943 19750 -47582 -130663 -109271 -46579
13921 -46579 -3715 -48408 -80953 -46318 45254 80163 40647 -48301 -87361 -119442 -138002 -95836
13909 -95836 -52174 -55360 -48262 -32617 -37268 2725 -66780 -118608 -136033 -104112 -29369 43705
13897 43705 110013 58316 10293 34392 75879 20459 -30346 -43234 -95776 -123456 -135654 -126546
13885 -126546 -89526 -16238 -50899 -69865 -91485 -120593 -115615 -103732 -123291 -156272 -121361 -77691
13873 -77691 -41923 -26536 6229 43272 -11499 -92976 -146491 -202314 -176998 -122511 -103669 -79653
13861 -79653 -72590 -36225 42583 12553 -73448 -40908 -19705 -30957 788 -31450 -40353 -41209
13849 -41209 21162 27796 28369 98646 91125 42484 -77098 -148669 -123962 -22963 24879 39965
13837 39965 95660 58909 16009 10487 -17130 -10986 -13000 -44972 -10453 12816 30832 -48875
13825 -48875 -60894 -80680 -67848 -56854 4460 -46826 -45261 78288 179068 102733 21255
13814 21255 -51283 -134174 -145816 -146825 -181043 -191374 -135523 -120714 -127958 -145409 -129818 -151993
13802 -151993 -147633 -94778 -51507 -28665 -31641 -111377 -105558 -108349 -64034 -66111 -37364 -17674
13790 -17674 -58333 -33230 13073 46564 17771 -40124 -45060 5569 25241 16873 11051 -9764
13778 -9764 -4214 -20854 -10057 -646 -66272 -86296 -61604 -34610 -63294 -48265 9715 39004
13766 39004 67714 110056 75334 5117 6110 -30537 -52980 -73332 -115874 -104670 -47553 -56387
13754 -56387 919 48276 35043 -37833 -79074 -85807 -90253 -47267 24980 -62234 -51811 -69177
13742 -69177 -38513 21310 -3046 13482 10344 51856 90472 66503 64007 83917 96619 141001
13730 141001 163626 141374 84758 7645 -19355 -109313 -128350 -100438 -102493 -19069 -2042 -43915
13718 -43915 11991 56860 49837 7611 -15339 -81253 -29525 67729 86760 57231 45220 -18396
13706 -18396 -90081 -50951 -28981 27243 -5099 23448 -555 -23178 -24725 -28787 -24626 -16682
13694 -16682 4325 56940 191525 204618 210887 231244 114423 2726 -5561 5795 40863
13683 40863 66225 69174 85583 55517 33747 47769 45703 28465 63183 32065 10470 55454
13671 55454 38996 66627 106689 4495 -25785 -52921 -80119 -100158 -104193 -136059 -41435 84954
13659 84954 883 -18324 -31022 27319 23216 5480 -1018 -7191 -36260 -66324 37 22777
13647 22777 24468 -166 -21066 41784 58780 9197 -3062 -22621 -21124 -20861 1967 -33688
13635 -33688 -75552 -32672 13412 7817 10588 58725 60255 83394 102636 97966 64589 73625 86733
13622 86733 69758 26179 17448 -52896 -57796 -47368 -47634 -44565 -35045 -14056 -72103 -57357 -13051
13609 -13051 54604 13853 -31551 -15583 99298 152097 137188 87101 54151 -23011 -64624
13598 -64624 -58495 -53482 -98272 -95070 -53739 14389 23530 31146 13370 -51863 -121347 -95855 -72148
13585 -72148 -56829 -56883 -132433 -97939 -73527 -112194 -64889 -22439 -11078 -81158 -65370 29888
13573 29888 72564 65565 48676 76583 56930 48661 25970 34453 61292 41302 85890 74121
13561 74121 84901 81506 35475 -34963 -82720 -105873 -92382 -129290 -146771 -149938 -93956 -95613
13549 -95613 -108548 -142658 -121924 -147579 -149601 -168603 -165443 -169699 -157965 -71242 -60392 -129089
13537 -129089 -164952 -139781 -129341 -141234 -97568 -9855 52000 11943 -7067 17024 52165
13526 52165 32728 23296 88621 92251 44054 9699 24031 11661 31442 -7935 12553 43668
13514 43668 8664 -6134 -25999 -75502 -59132 -27646 -6187 -5993 -35858 1442 -45736 -76661
13502 -76661 -3697 6765 -8036 33725 43463 5164 -29370 -20452 2677 -25810 -48862 -56254
13490 -56254 -95652 -94910 -68066 -86002 -96302 -95164 -76519 22696 5408 -7308 24526 13965
13478 13965 -22527 -65067 -127657 -132674 -118190 -73018 5741 66330 77875 -1228 -73783 -85118
13466 -85118 -54010 -59253 -101986 -87160 -47394 -38078 -64532 -83857 -83110 -95498 -87514 -62349 -47208
13453 -47208 -56152 -50379 -68347 -75119 -89169 -98819 -148834 -125892 -104809 -69683 -97891 -103607 -115880
13440 -115880 -123450 -112900 -153646 -141363 -76791 20086 -7774 11158 -18227 11076 67397 62941
13428 62941 53635 62558 95065 48513 9325 39673 -21982 -38807 -13589 -4052 -4096 61176 72118
13415 72118 33703 35094 -8742 -77800 -88405 -63093 -69796 -50893 3450 76489 90340 59948
13403 59948 22067 -26687 -94257 -36800 20415 -8692 19660 46313 16536 22271 -3558 -43913
13391 -43913 -74037 -114351 -86261 -134877 -72727 -38207 -28509 -21006 -28700 12854 14922 -248
13379 -248 -37182 -32336 28669 105834 23791 20410 64440 25683 44649 74889 60143 79165
13367 79165 133284 93883 39077 -25064 -56817 -30323 -95115 -101522 -52476 -19710 -6192 74712
13355 74712 101631 26337 9302 -18631 -77752 -63679 -41200 4494 -24038 -69420 -64389 -128972
13343 -128972 -143385 -72735 2085 -5908 -59275 -59196 -25254 12436 -31603 1793 85975 166894
13331 166894 107920 112074 91100 102359 62642 56470 101876 20523 -10529 -34996 12462 42583
13319 42583 69119 136325 112917 104012 33722 53518 60200 12040 -22541 -45072 -92937 -140581
13307 -140581 -53940 54404 34818 -383 -15113 25323 93879 64499 -7593 -32506 35026
13296 35026 67157 10533 20766 12884 -2818 24143 10881 26472 19992 18706 19080 -12016 19534
13283 19534 -1287 -16904 16626 52520 56354 91370 72305 21097 13710 47347 70762 23772
13271 23772 40 11876 -68881 -94710 -27389 36633 43832 -12164 -14245 4182 502 13060
13259 13060 -63581 -86227 -40534 16369 24016 50992 52967 87220 108048 83350 23942 -15148
13247 -15148 -48351 -20014 -5987 7097 -73639 -164731 -108410 -99486 -94304 -115699 -90793 -101247
13235 -101247 -78197 -49612 -112638 -101073 -28548 44094 77305 9642 -6661 21735 6437
13224 6437 -41289 -3641 49082 92616 61235 25322 35061 22735 27653 11154 3932 7350 -21849
13211 -21849 -49533 15932 5881 11608 -3572 -32090 33945 87724 17215 -55909 -16761 50801
13199 50801 61125 9844 -17506 -18596 -15301 -6062 -5340 29023 49661 12403 -4998 2097 -5724
13186 -5724 -94492 -116742 -64975 -55861 14204 46783 9867 -46417 -90163 -74330 -13785 62594
13174 62594 83519 86214 106554 44972 32077 45115 67531 77222 27504 -7673 -34579 -45935
13162 -45935 -51319 -68088 -42808 -37956 -44709 -76663 -140822 -114693 -12003 65582 19923 -6578
13150 -6578 -2389 24036 3882 21387 30021 -20496 -22823 -2438 53285 46078 15285 19114 13650
13137 13650 -29531 6430 1920 -33956 -64703 -51969 -85525 -135188 -124724 -92976 -70193 -111854
13125 -111854 -76183 -68801 -44837 2658 92071 125432 47812 -12734 -38312 -40841 7901 -35989
13113 -35989 -56035 -85939 21121 15567 -25607 -97506 -107524 -72501 -63520 -51778 -44698 -34123
13101 -34123 -7856 -21450 -36708 -43563 -35808 -1989 52329 4404 -8551 -49845 -87454 -51875
13089 -51875 -53716 -47722 -7996 23800 20280 5139 -14561 -6699 19998 -3760 15718 -7031
13077 -7031 34643 103383 45476 -28944 -61631 -7743 22090 -18339 45047 54896 -9021 -46653
13065 -46653 -41841 -37788 -71101 -124193 -59355 -43245 -21407 26037 -13814 -64901 -48400 -38241
13053 -38241 -48915 -16078 -30681 -73821 -55043 -28479 -14161 -23164 43620 80304 103620 95113
13041 95113 25731 -68959 -118504 -130052 -107962 -127150 -138307 -95769 -94450 -58348 -16211 -52164
13029 -52164 -32037 -30368 -11428 -5986 -46447 -44545 -31661 28469 45838 -28171 -52936 -64075
13017 -64075 -84202 -85265 -56653 599 44516 58280 -4125 -54274 -29768 -28562 -7144 -6377
13005 -6377 28159 -11933 -28395 -65936 -73114 -5964 29548 12071 -20958 -71297 -49244 -43120
12993 -43120 -37693 -9679 19687 -23874 23493 74060 120053 80710 -1614 -43028 -20021 51499
12981 51499 86676 66928 -17280 -79710 -8968 13183 22596 6787 -12550 -24700 -33482 20618
12969 20618 30169 40339 83354 109233 71511 -33915 -66451 -65879 -76562 -63119 -56078 3271
12957 3271 11088 20164 -7565 -12453 31056 33524 3073 1868 -76601 -57081 -37064 -108665 -168913
12944 -168913 -107280 -66084 -34159 -13931 -189 5647 -62004 -107485 -87567 -79716 -3043 -44115
12932 -44115 -74819 -86402 -83010 17507 14942 9565 41807 133574 111459 73234 32442 -53879
12920 -53879 -44615 -8613 -14037 -28815 -122394 -110820 -59874 9918 40248 84678 21410 -44389
12908 -44389 -98415 -171189 -135827 -109406 -97513 -83080 -11195 15814 3954 2632 63231 98678
12896 98678 105803 61837 10074 3186 6917 1436 4870 -4695 -36467 34894 82490 77785 42977
12883 42977 29699 -28611 -84763 -58799 26455 19890 -26760 -59577 -129603 -139349 -151142 -181562
12871 -181562 -181591 -143680 -79747 -76718 -31961 -43424 -132689 -136298 -44811 20623 90253 74391
12859 74391 12152 -80333 -92541 -65792 -11813 -1128 6809 21401 51390 72852 68737 43822
12847 43822 -80614 -87776 -29564 34766 38576 37897 4732 1882 -2750 24498 37712 54715 81372
12834 81372 79466 14415 -33690 -69896 -97956 -52623 16715 -11699 -46100 -12312 -11806 51065
12822 51065 121900 104409 98074 65203 40466 67875 125061 75290 14180 -85275 -87008 -43917
12810 -43917 -28255 9685 53295 46863 30528 -55712 -57023 -92427 -101617 -8188 50647 57743
12798 57743 55642 85231 90594 85619 100606 79509 96916 157979 160797 195358 62554 3165
12786 3165 -679 -24749 63308 136446 138382 35261 -75519 -75716 10229 32041 59649 33858
12774 33858 53034 48911 -3344 20821 48610 -47904 -74259 -45721 -12883 -23683 -53647 -53552
12762 -53552 -16076 14138 22197 34821 50980 29541 30763 -551 44675 91120 38939 -15795
12750 -15795 -37259 -52722 -31233 -42312 -84650 -42325 -31535 -69030 -87153 -74890 -117677 -18538
12738 -18538 33060 34995 -50150 -65835 -24582 2386 10878 29038 -5274 -47683 -15655 28161
12726 28161 11415 -29168 -60083 -39912 -22974 -29554 -65994 -76495 -53330 -65657 -66050 6531
12714 6531 38848 72419 42547 15735 19542 19176 31584 67564 44104 46059 53572 12814 17870
12701 17870 82504 37991 15634 -15274 -15708 -49374 -49509 85102 105966 86767 -3096 4321
12689 4321 5477 8941 48004 92543 101841 81412 102963 63605 25827 40798 35130 56671 82484
12676 82484 63570 18738 -4058 35792 81617 105294 38912 5089 36281 45947 -20453 -58162
12664 -58162 -153722 -158207 -80984 -47457 -11360 16888 -18499 -75397 -71804 -104274 -73815 -65995
12652 -65995 14744 -2109 -68031 -82315 -50367 20798 55835 21264 7745 -51983 -33869 -39954
12640 -39954 -31842 -23305 42999 53323 20067 -6558 16047 42533 43712 15317 15513 23028 46556
12627 46556 43457 28218 11537 -15529 -71952 -71049 -75305 -47555 -28438 -104766 -95117 -81907 -105377
12614 -105377 -60514 -41972 -11574 59234 50486 -73731 -68461 -61292 -114703 -79536 -40444 -36518
12602 -36518 -6573 2435 -4982 8696 -11431 -14989 -74788 -126413 -108821 -84389 -44407 -40556
12590 -40556 31118 137750 166504 152101 92854 43255 15587 76035 49198 -13110 28780
12579 28780 35269 16208 30044 33690 -16725 -41060 -79032 -49145 10242 572 -29536 -42398
12567 -42398 -87563 -44232 -77560 -54855 -36437 -35947 -58707 -94479 -50629 -2338 -33246 -114755
12555 -114755 -96426 -13547 -26629 -65898 -50075 -6102 -122 -42530 -59335 -51531 10290 -12241
12543 -12241 349 60733 128106 157668 98705 57104 2372 -36980 -29749 17874 48690 46325
12531 46325 53318 6749 1008 -4510 -20772 -28559 -73860 -67849 13190 49843 -10446 -26041 -6693
12518 -6693 -56248 -41556 -36886 -23463 -13542 10958 3909 3322 9559 38926 -4550 -75468 -15521
12505 -15521 23757 -22296 16762 4317 -44489 -80814 -88909 -33998 16032 334 -12886 7519
12493 7519 58150 87518 104068 112503 65627 -9953 -13653 -6111 60119 55875 93574 131229 103723
12480 103723 101826 88662 73141 54473 66274 132826 156601 85415 61050 18356 25625 -21371
12468 -21371 -5907 -11166 -26025 -50285 5472 -27129 -63846 -63799 -61343 -83349 1324 80483 29676
12455 29676 -1671 -45701 -44201 45791 64414 42056 5687 -36013 -461 12509 4052 1237
12443 1237 63171 29984 33183 42531 -1 53860 23354 -50530 -50003 -34806 -48076 -27290 24227
12430 24227 89373 81863 84294 131125 150031 130824 136630 115041 114177 108652 47028 1088 38252
12417 38252 -4445 -6015 14749 43710 37788 -14585 -1486 -41266 -45627 18141 60469 92226
12405 92226 -14251 -116558 -55726 -56322 -101118 -77162 -29103 -30587 11773 26181 -12832 -18690
12393 -18690 -22595 -2342 -21520 -29107 -11115 -31430 -49204 -99867 -27843 47026 45101 -5865
12381 -5865 -55640 -40949 33174 68791 77099 4585 -69603 -26360 24874 12882 -66626 -78743
12369 -78743 -73581 -44799 24447 33546 -25643 -30100 7344 -21266 -8587 -10269 49924 59472 44532
12356 44532 -43871 -63406 -36142 -52532 33706 92809 84251 75213 70849 66845 37063 84440
12344 84440 114825 93269 58963 53839 67731 108025 117591 107512 88921 33332 -11246 -70366
12332 -70366 -9375 13151 80689 72765 62313 52443 13094 4033 14464 118873 137657 111779
12320 111779 87351 60158 73456 120988 69601 809 -36274 -48275 -62725 -58287 26801 43503
12308 43503 -17564 3972 6905 -690 -13653 -71466 15982 66735 49124 61818 7849 -45763
12296 -45763 1027 43704 12398 -3100 -2164 32751 63574 33056 -24074 -70260 -51959 -70585
12284 -70585 -59829 -34574 10143 -26813 -109240 -30441 56950 22670 -97291 -134526 -96111
12273 -96111 -84622 -39259 36334 48005 -3636 21093 98206 126341 107473 83991 69603 103318
12261 103318 49884 34842 8997 52672 45688 60229 126985 99310 46303 122587 63984 68586
12249 68586 15972 -28509 -25761 -7178 -26300 -32443 -2020 2863 18834 62634 94790 82776
12237 82776 30621 29428 5230 -17993 15025 44966 87159 64867 7316 96501 80971 87806
12225 87806 20747 -10624 -41126 4114 46195 40307 82155 81419 43306 38576 97310 79542
12213 79542 78490 52605 65521 61198 90218 63318 81996 69117 131237 115437 123218 120085
12201 120085 73361 35346 27878 63855 110721 139768 104212 97474 70734 -9055 19726 105319
12189 105319 67219 73635 51785 28497 -19495 150 34104 51443 14677 4043 -13666 -4701
12177 -4701 2891 -16143 -3736 11495 21408 78582 101923 26982 -5709 -12334 15646 17165 23413
12164 23413 57375 109714 157655 187269 170424 119239 95734 60707 5825 -14127 51865 73825
12152 73825 31925 25080 84876 60668 -32741 -53111 -23403 -5288 14142 58335 65169 114294
12140 114294 88672 54574 62606 106320 128927 161076 143374 145071 122829 159543 143612 162920
12128 162920 170423 189893 201942 187822 206226 197356 133973 52944 90823 114254 124628 117500
12116 117500 103456 85497 96348 100296 145804 164967 209847 180054 189779 210089 208529 166069
12104 166069 66179 14786 11276 60974 112492 202423 167420 142272 195485 168023 137856 104731
12092 104731 98700 128573 135616 135812 126946 59463 -19356 16504 63361 -604 46363 7810
12080 7810 -30867 35789 74226 73536 117580 62553 27437 113770 182327 196672 160939 128004
12068 128004 81957 57231 73253 44865 91398 110184 82961 94188 217385 267053 233587
12057 233587 201363 187048 168462 197032 169095 157556 136100 154896 193297 141968 89744
12046 89744 88369 39321 46714 74239 108776 134969 125114 111821 70661 54117 14449 48090
12034 48090 66556 84905 132720 84587 64568 103351 93711 70240 119000 123147 136305 82211
12022 82211 93982 162885 203427 154647 142862 161334 205407 132941 97191 182729 172023 100122
12010 100122 113945 61376 104121 99576 131499 167936 190783 131697 116516 77876 29156 32795
11998 32795 69132 81546 100203 70244 59580 52315 57563 40274 42443 104147 168322 102197
11986 102197 105889 144751 170099 167300 199542 198153 144919 129197 106441 157088 177652 197584
11974 197584 294951 319608 338390 305708 266912 260342 227755 262305 323022 269287 204719 185653
11962 185653 232733 237979 247425 223781 176614 224055 266734 233424 229597 196400 183319 163600
11950 163600 164064 260687 242827 170364 195132 278886 312033 338965 261399 236309 217084 254086
11938 254086 244598 187914 144195 157962 204928 266681 315147 347440 383137 368733 339597 384254
11926 384254 351170 298147 253170 243759 244705 264421 241021 242365 281528 290242 267873 229573
11914 229573 241822 237268 235326 242757 315334 338688 378940 370539 364558 275130 243394 244817 258094
11901 258094 262108 215392 250987 315033 307878 347792 345663 358281 415579 383356 314768 298321
11889 298321 342078 407316 428032 448877 429318 374386 337147 251477 236881 293684 328660
11878 328660 317138 283313 289525 314656 331591 391708 393794 365629 409599 435633 447625 409502
11866 409502 384426 424653 439779 373193 347838 313019 325608 393246 365094 361705 389384 381854
11854 381854 397106 448740 465671 469198 439619 502760 553340 539108 432882 433070 397412 371545
11842 371545 404415 412075 404122 479079 471555 424141 396405 382755 380617 437708 462672 425135
11830 425135 434870 451635 458176 455624 444139 465987 522192 556564 489547 422080 385069 454649
11818 454649 560652 581484 519663 425980 398260 468875 568423 624677 538794 527597 472475
11807 472475 455436 513601 586480 563586 490245 519227 543797 547279 526935 492092 482437 501006
11795 501006 490020 430085 487158 556359 601813 618414 593969 606649 549741 507092 519250
11784 519250 552136 559324 526343 563851 554828 557491 534248 614142 670632 666298 607360 591196
11772 591196 632638 710803 728857 706139 676009 713110 711726 688815 689495 697161 745884 716012
11760 716012 670512 660710 640227 679721 739142 711190 642371 620218 562945 537556 552784 567831
11748 567831 580521 659287 726320 680332 673630 655098 672262 728223 719317 690915 635736 664376
11736 664376 644044 582650 584470 672166 712608 688412 725465 799771 777434 721051 694747 643633
11724 643633 640451 627569 595181 605345 634911 573658 612176 654684 705914 725276 729949 719641
11712 719641 680901 702357 675144 615221 633863 611847 655513 692920 744266 658330 607189
11701 607189 583135 565059 533515 592578 654752 650740 669301 740819 777947 710689 706539 731861
11689 731861 695017 734455 797016 710003 619222 667810 699367 705347 720994 672924 658537 728413
11677 728413 738281 766647 741147 724337 737559 739235 742621 715469 724503 657578 554355 630170
11665 630170 687861 662333 595424 606018 625294 612156 626632 604702 620564 675318 677508 606596
11653 606596 577148 606332 643258 618155 604074 641087 645427 611453 618169 669792 667838 656040
11641 656040 659728 675869 728435 694461 623905 637101 643207 648073 703591 716680 722999 705200
11629 705200 671571 630810 638891 589275 563734 583899 583556 620398 681300 639186 626749 586203
11617 586203 555418 600833 602407 608941 585590 633183 646782 639272 681466 731950 691191 658280
11605 658280 559675 558848 530127 466662 492488 512037 498882 564300 642344 626757 526509 472072
11593 472072 468740 487597 502584 498546 505629 476005 515872 571736 529946 496170 516365 481629
11581 481629 457603 462872 444193 435905 453219 512309 526490 548773 467653 531058 563277 539298
11569 539298 507869 464684 467196 460726 453583 503041 487324 495436 488145 436062 461312 466077 405474
11556 405474 338068 327128 342714 388948 416692 460915 478735 437421 429978 392174 411768 441245
11544 441245 448244 484264 511843 528310 532585 469676 490166 535722 555403 502410 452404 446669
11532 446669 452473 375663 340029 338983 360777 365229 337862 313418 306433 288147 262736 266747
11520 266747 310776 357348 431099 455432 398189 433735 475273 477382 376523 260118 215358
11509 215358 173199 206890 189052 216783 302798 341637 373852 360346 340766 306270 318301
11498 318301 280025 299941 362588 422059 408940 335140 268672 314084 280448 229260 290095
11487 290095 360524 390500 305516 274083 226363 236728 273331 334558 393845 478432 398159
11476 398159 359413 339656 318239 261136 256452 257889 267012 307203 327279 365788 351044 273900
11464 273900 253389 319450 401744 372366 245214 225604 290570 377863 376856 373091 355918 329793
11452 329793 354349 364022 340732 350365 365451 351502 263977 217685 276433 270172 210450 218183
11440 218183 228698 170097 175760 290661 318853 253875 185469 234332 277446 243061 257054
11429 257054 278868 286813 257744 247572 245249 234457 203173 198917 294483 338847 251749 158820
11417 158820 164140 192438 208007 205854 220578 198689 193460 237539 238162 279589 285810 269060 315159
11404 315159 306424 269991 158464 105463 118656 170032 204096 200208 185841 133396 164751 235366
11392 235366 223616 213856 249123 241373 147654 120362 149755 160919 176990 170997 129981 221627
11380 221627 240681 310643 320955 293268 253321 183366 117280 125291 115550 125099 122564 140119
11368 140119 176413 152003 146903 130348 202517 152464 139978 180778 252467 217038 189545 123011
11356 123011 136812 95206 77438 81026 107101 152435 198648 221312 248700 251502 247230 210140
11344 210140 254743 236712 177717 173777 144690 170369 152719 171150 153694 153647 172684 166338
11332 166338 182178 214669 227916 242081 213976 252669 300372 262928 185988 84883 89029
11321 89029 154190 161907 134937 171221 163376 140920 109685 84751 115677 165693 235296 231383
11309 231383 215373 241140 218915 209137 146955 113364 51568 -1566 -42060 -27182 -65598 -78679
11297 -78679 -32670 68516 158705 174790 122345 56350 63103 39677 14414 42207 97208 59172
11285 59172 -12144 -22359 -29258 12710 50095 77524 51818 -69153 -76137 -45776 13253 118200
11273 118200 143789 68047 24024 5041 -44282 -45920 -11728 18634 43964 74366 17171 -39799
11261 -39799 -42709 -60722 -31854 -6074 1222 4833 15306 43835 61820 94511 86040 21147
11249 21147 56385 118759 64437 81202 67113 88818 57759 9769 72129 60798 26217 -34589
11237 -34589 -12062 88798 74560 44033 39731 34 -36962 2687 44759 46187 43890 57932
11225 57932 22653 4151 72789 87370 24485 -14730 37079 153966 185774 108350 57138
11214 57138 -32142 -5453 107279 115840 105647 48940 77797 85883 126557 133160 50220 14664
11202 14664 2989 33899 73215 65288 24257 46540 42570 -3345 48038 73853 47247 32576
11190 32576 32227 10609 -12099 -43541 33473 27888 44361 80168 38797 60831 74973 84823
11178 84823 85922 59021 31204 30633 82148 59435 49995 73515 -10525 28909 81148 95764
11166 95764 97879 -4032 -17872 1476 -27892 -39262 -64553 -54120 -38758 -8700 -18921 15329
11154 15329 50352 25629 -17306 -72028 -58157 -11948 -10601 -9883 33183 62258 12735 21893
11142 21893 80176 65758 13174 51698 55429 67154 24948 7459 -2793 -43406 -141429 -68247
11130 -68247 -61723 -88812 -110731 -81609 16493 76149 123877 47355 7983 62355 57088 86354
11118 86354 14468 -14270 242 33073 782 -77431 -83885 -94725 -33587 44482 18953 -17540
11106 -17540 -3921 84374 -2142 -75729 -77100 -61545 -17787 10804 2456 13008 -21031 -7552
11094 -7552 -14071 -94852 -195683 -169575 -74908 -71771 -106131 -76911 -54655 -47252 411 17806
11082 17806 42447 71916 51348 118276 47409 -13235 19798 56217 94750 63843 69590 95937
11070 95937 85619 37432 -64754 -111582 -84381 13939 49242 63859 -26055 -56990 -20410
11059 -20410 22885 69181 23014 -38352 1872 32099 44962 38157 -50184 -57401 -85298 -81936
11047 -81936 -69895 -94767 -96108 -73075 -10383 12322 -22398 -27463 -29009 31185 93971 116691
11035 116691 56855 95148 178794 177845 167233 134006 113690 81879 59233 61090 77895 40179
11023 40179 -8495 -89086 -76514 -94866 -146486 -144009 -105419 -54260 -51912 -63240 -105175 -105925
11011 -105925 -88381 -93468 -45858 35727 55609 37304 -18497 -86454 -115106 -140166 -133627 -73303
10999 -73303 -32428 -276 31658 18750 -2286 54157 54595 85925 45025 -56905 -38634 -103467
10987 -103467 -163621 -133920 -88595 -72410 -16155 37854 50398 34165 50667 77102 74252 45945
10975 45945 3600 -47627 -89192 -110854 -98605 -89659 -109069 -102351 -77449 -33437 -5217 -6471
10963 -6471 -38932 -51018 -37638 -21753 -19338 -299 44539 69981 104318 40586 4646 -6370
10951 -6370 -40381 -15984 10015 5428 14193 3641 10791 27520 16809 -1161 -43724 -29753
10939 -29753 -26148 -71805 -124502 -140311 -36649 31333 7336 -3503 3208 33353 48304 -54692
10927 -54692 -91956 -82916 -80998 -97065 -31517 9728 10389 -11763 -8870 20772 11583 1257 381
10914 381 24580 26810 -16791 -76716 -107287 9119 2614 1986 22647 54065 79493 32681 -2091
10901 -2091 49099 56504 30410 24565 18564 56586 124649 111800 62034 51065 52006 31678 33500
10888 33500 36075 1309 -12346 -1828 31344 32603 -3050 43898 65390 70969 48834 12649
10876 12649 37349 8523 2720 20667 84071 115804 145948 83300 45350 119081 99885 50130
10864 50130 49704 66194 92249 148268 212259 171146 151472 159935 213586 243471 300717 312378
10852 312378 317557 361640 490721 627840 915009 1192877 1453800 1788883 1958159 2154831
10842 2154831 2337845 2479075 2373284 2171572 1942772 1760306 1525522 1243125 958796
10833 958796 719080 649210 582328 536977 501815 378732 320489 317061 298032 273947 248448
10822 248448 236921 239187 247803 238682 207972 241055 281623 354897 316205 233310 229163 168618
10810 168618 111499 70554 36022 56290 50117 29204 58740 26028 53034 76637 114424 121853
10798 121853 62026 91611 161570 141872 113018 74444 18733 43566 40338 26890 36998 62638
10786 62638 49671 11503 123 13305 -6805 51958 90020 53668 17876 -15710 -10411 18098
10774 18098 -18048 -57433 -21813 -28892 6778 41398 40095 31633 100591 166346 162182 119357
10762 119357 158916 93158 -2978 21348 55624 129148 127397 120355 113506 89299 64268 30771
10750 30771 -12832 -75404 -113360 -179894 -253588 -354865 -433273 -476768 -435672 -357033 -290743
10739 -290743 -327617 -300309 -246021 -178431 -77089 -99404 -157783 -176556 -167673 -163267 -138003 -38521
10727 -38521 -5685 -51849 -81710 -72473 -67229 -57236 -57570 -4791 14303 68819 73626 350 -66948
10714 -66948 -90475 -79072 -67981 -20887 -62058 -91938 -96031 -73509 -12609 48311 57855 28927
10702 28927 20308 54739 143155 230027 291312 272957 280127 293906 351237 383439 342529 309739
10690 309739 259140 205961 183390 140698 71913 -4248 17871 131577 107349 78270 43626
10679 43626 -16195 -59235 -85849 -74892 -4279 24326 -38210 -75560 -106255 -104586 -127811 -87858
10667 -87858 34724 8969 -36658 -32918 -54768 -5315 12314 6596 -57359 -117243 -98325 -57297
10655 -57297 16938 76305 69380 44201 20157 40710 24908 4889 10510 -24010 -55625 -54637
10643 -54637 -2814 -80080 -51110 66480 117100 6423 -28876 14147 10923 -24655 -95813
10632 -95813 -117054 -79621 -123611 -97804 -122352 -110170 -63776 -42948 -53315 -12094 13477 -26254
10620 -26254 -12489 69275 142012 146747 83503 34516 35776 43596 44431 83418 100568 135301 73399
10607 73399 -9711 28737 43550 43418 38179 23748 59320 177625 176697 97334 50676 97061
10595 97061 87112 64513 107254 194646 154858 131086 105323 140822 180315 137291 84285 109469
10583 109469 170607 195782 183055 165129 163186 233106 364058 462826 470298 511306 603990 672619
10571 672619 679754 706053 657730 591963 487816 349030 171511 45738 -514 -49491 -75710
10560 -75710 -78102 -120829 -87318 -91976 -78763 -43189 -56572 -79825 -82286 -101545 -64762 -52478
10548 -52478 -88285 -131076 -83552 -30979 -20391 -7280 -48071 -82235 -92630 -31314 95211
10537 95211 126046 107922 101864 108372 153724 222343 266317 316435 291222 201724 220880 271962
10525 271962 248423 212425 265004 295182 342074 312810 363156 460987 499089 479142 518290
10514 518290 540899 564144 593074 585454 549809 542393 509769 563023 639294 620982 604095 570716
10502 570716 632628 638400 571361 556249 646732 743829 767998 787394 801132 822120 877048 942647
10490 942647 1064852 1213689 1270642 1271686 1343093 1446093 1476491 1462177 1530041 1619788 1789963
10479 1789963 1915309 2018421 2200750 2365349 2454062 2575560 2726765 2897681 3155442 3427421
10469 3427421 3793269 4212994 4679296 5334834 6119635 7060339 8076002 9169701 10397369
10460 10397369 11814452 13375602 14931032 16501734 18194694 20122719 22421614 25261070
10452 25261070 28849794 33577595 40073030 49192829 62130854 80939731 108879670 149568148
10444 149568148 203664749 264178559 319904175 367098844 411313512 450499170 466599597
10437 466599597 448700732 409491361 367738268 324255541 272038367 215275482 166709402
10430 166709402 131965225 108423997 92135650 80539119 71988928 65601203 60764647
10423 60764647 56858909 53711934 51243231 49247418 47468555 45845864 44350641 42763816
10415 42763816 40933520 38902646 36826474 34623451 32322191 30054771 27855343 25900054
10407 25900054 24106593 22418746 20901330 19468562 18182135 16987509 15868471 14869311
10399 14869311 14029532 13171093 12305453 11607597 10956515 10326278 9758248 9215316 8679511
10390 8679511 8268287 7893802 7508379 7111297 6837471 6528273 6162360 5853121 5572769
10381 5572769 5343531 5168975 4955259 4785938 4561088 4382405 4216523 3995677 3791428
10372 3791428 3614951 3521030 3432117 3287987 3084832 2942579 2832318 2712433 2595975 2501642
10362 2501642 2370885 2311853 2288452 2212523 2110264 2037138 2031029 2093057 2006078 1916978 1924400
10351 1924400 1868900 1775006 1645245 1570710 1549624 1535010 1495504 1513231 1555155 1558430 1619701
10340 1619701 1673197 1754428 1855511 1938472 1969244 1965726 1980845 1997120 1922364 1836502 1746965
10329 1746965 1672963 1569620 1550446 1571621 1524898 1540591 1554878 1621121 1746707 1961233 2161539
10318 2161539 2527043 3098591 3655407 4062722 4085507 3960232 3988176 3982063 3766706 3329657
10308 3329657 2740803 2265241 1856696 1545501 1279795 1120403 1137548 1134773 1077129 933308
10298 933308 942283 898087 939052 950432 905864 878476 834046 784090 850121 800200 749249 694576
10286 694576 669824 677463 645620 601775 595457 634066 632435 602998 592912 601441 648476 678012
10274 678012 735410 756887 760536 745389 699938 708551 666284 634974 582808 524600 476118 412648
10262 412648 447571 466968 510942 565938 628931 672667 648610 676666 687484 706253 686187
10251 686187 661409 581919 602409 571877 537980 531944 596927 582875 565082 537867 554324 543869
10239 543869 497447 480424 472769 430541 447192 480395 455566 466638 419411 358742 381399 332381
10227 332381 308798 298689 275033 256900 244247 289148 311693 312911 328771 366760 385170 264787
10215 264787 181949 185303 234832 228472 167035 127013 152272 184182 199856 257177 258685 244272
10203 244272 249956 239918 192182 252311 334030 276002 264355 243204 242265 193564 245011 289285
10191 289285 267339 304496 272803 294145 326972 343803 349306 337822 361853 399204 386565 405314
10179 405314 401903 402108 324686 282327 339965 297246 265103 232409 206119 200042 222062 185732
10167 185732 180359 126299 142405 218990 193286 131907 115065 202308 176603 157399 221603 222352
10155 222352 204846 212668 252747 245695 307402 333544 331118 343736 309808 216964 212317 301923
10143 301923 324047 316680 349335 437417 470621 502496 492189 495973 555798 557875 523270 480242
10131 480242 441924 369416 328803 287101 264195 217822 200226 191967 187608 114867 81261 118007
10119 118007 141576 191234 175735 64589 6703 -12742 -17155 34621 21190 17080 85686 126152
10107 126152 98206 101088 141744 113554 78808 61267 80306 61867 13844 29589 78805 90474
10095 90474 72552 78032 136291 116129 106038 92482 121501 133561 79154 84129 108469 46250
10083 46250 -11595 51726 72737 25003 22393 61481 112757 120340 110286 91022 63286 2761
10071 2761 21026 98592 126274 118938 121686 101087 23626 50147 94553 111561 89090 119279
10059 119279 144415 136402 44440 66343 215064 213290 173597 156045 196560 212420 195815 219316
10047 219316 227125 240046 294142 294373 285206 291359 300903 314034 376026 597741 824991 1064486
10035 1064486 1362849 1662366 1902835 2154349 2370146 2515472 2479851 2336157 2133370 1931938
10025 1931938 1663948 1370172 1142886 965644 773082 620565 582706 489023 407008 293228
10015 293228 226568 237298 234630 257465 270427 251006 211402 205358 257763 283265 263041 224810
10003 224810 268547 280877 198301 235579 247951 220401 154608 117749 122528 95465 123667 210547
9991 210547 171026 76505 54312 88074 30960 5039 56625 115534 117362 77174 84906 80564
9979 80564 74274 83334 98423 87630 150974 159018 148160 185947 190233 171063 179996 229001 206229
9966 206229 221577 180088 180599 149226 215593 276404 246668 150783 101877 89095 151209 153229
9954 153229 107606 90857 65978 47406 47810 45277 82275 127233 176354 212977 147740 92295
9942 92295 86642 66918 92154 97319 82545 61031 100783 129417 88722 134420 170524 130131
9930 130131 70408 100255 66517 23018 -15475 -1741 39264 48467 110263 173640 188864 112387
9918 112387 20563 -9737 -1850 -34102 -31780 -40510 -24252 -39542 -29639 31329 90579 119884
9906 119884 122612 78951 104946 136039 147982 167441 100682 67865 61445 82501 104047 162337
9894 162337 202197 127931 114100 132101 96976 99002 86999 35241 70172 84903 132841 129638
9882 129638 58062 677 5054 28869 99599 115818 106021 107929 131948 137807 107864 130330
9870 130330 109857 58121 104694 153832 194812 181718 111750 13294 9724 18597 24760 33852
9858 33852 8287 -30301 -13289 73904 59564 52309 109259 81666 69560 24090 68052 55171
9846 55171 66775 33021 17868 22924 33830 77874 121585 120136 82477 28118 -11771 28227
9834 28227 104217 132639 144757 103813 45046 14030 66191 15371 -31781 -16095 16818 23610
9822 23610 55130 58275 90208 142957 147212 30305 21754 40679 56220 95776 57007 79137
9810 79137 95065 38956 38697 -826 -83626 -43980 69422 122772 92362 64626 11489 29883
9798 29883 60988 31300 23154 70155 36940 61338 64478 17420 58853 93997 145024 151212
9786 151212 117009 115343 103003 82435 84945 74015 49439 17783 -5754 -29321 -28359 -27336 -38152
9773 -38152 -11310 60493 69737 51169 17320 37798 10214 -14859 7929 -25028 -15205 -18377
9761 -18377 -8452 61687 6655 -81135 -85466 -61570 -80832 -75307 -65136 -22403 66790 44570
9749 44570 56170 104927 143506 63350 -30440 -9809 -62183 -61146 -70370 -75397 -32007 -18537
9737 -18537 -31568 -99565 -84095 -4263 39696 77752 103822 91717 41141 -77268 -102477 6251
9725 6251 4558 -35735 7783 79483 145493 146395 142922 78615 54969 34877 29233 49060 50101
9712 50101 88234 56951 57998 4300 -45427 -16215 35079 7174 55319 103776 87562 43455
9700 43455 -19160 -17456 34486 55761 45396 27194 78962 104483 77041 37490 -25833 -24708
9688 -24708 -17474 9658 6397 -38567 -27837 7029 34523 42869 71465 42195 -28344 12763
9676 12763 47920 -2081 -32275 10558 11852 26034 122833 107551 71127 94379 124842 139400
9664 139400 77890 55183 49191 28298 34192 54215 31927 -16993 -58340 -51212 -65669 -74276
9652 -74276 -37812 -34565 -23286 37953 19066 -45739 -89145 -72308 -80913 -72228 -68195 -77492 -123567
9639 -123567 -100503 -115017 -67928 -23424 28333 16969 -12082 4000 -9980 -44418 -35971 -9998
9627 -9998 -10029 36677 -18907 -16219 4377 39319 32567 49364 34825 11303 24357 69432 49358
9614 49358 4307 13138 49935 98173 33182 -13559 42843 102787 158650 153452 146282 136294 140073
9601 140073 74485 23381 -10770 1433 -10644 -57823 -77775 -13934 -25029 -4919 51432 48582
9589 48582 34052 25434 -4548 -27565 -17692 -67185 -31386 -3285 71637 68825 28310 -75733
9577 -75733 -80892 -70751 -58225 -41703 -79523 -6579 -22526 -35168 11466 47499 18618 13442
9565 13442 13063 -9486 -30277 38213 85491 58558 3430 -63374 -105043 -85315 -80894 -45117
9553 -45117 -37739 14109 28377 95185 52894 23474 45881 39931 85012 86169 66688 36559
9541 36559 57487 93275 118016 97163 117772 91727 113553 82715 99849 119769 86039 100810
9529 100810 46093 -21727 -50608 -81092 -35733 51907 42053 68990 105078 79126 59643 79625
9517 79625 61516 31389 36903 -8324 -103793 -121622 -87408 -17572 -24436 1730 20958 23644
9505 23644 12922 -13541 -14168 -59275 -61695 -83763 -98088 -47153 -21306 -12352 49824 68357 38896
9492 38896 5081 29214 48152 74878 42507 -33740 -15963 19057 12481 9823 5802 -24602
9480 -24602 25689 39182 38540 46577 52158 20944 29351 36347 49510 32461 -2023 -36725 -10047
9467 -10047 -45643 -124004 -77779 4675 -44202 -50614 291 37501 38514 26021 -22572 -12710
9455 -12710 -29689 -77469 -44761 -62355 -18114 33125 61170 85762 -12733 -986 38627 14300
9443 14300 60667 -30510 -55715 -26196 11420 25839 50613 78586 46552 53450 -14327 -46866
9431 -46866 4280 -17272 -57589 -64874 -104394 -106945 -104661 -41371 32903 45338 69043 88951
9419 88951 2543 -32232 -37466 16644 18138 42872 -5529 -79576 -55911 -68232 4861 81328
9407 81328 58342 49991 -28664 -15821 43701 8768 -69357 -95643 -63011 106 41746 3442
9395 3442 35679 72827 24717 -18052 -47009 -70467 -43728 3395 29789 71669 82508 22630
9383 22630 -54481 -29480 36136 11077 -28614 11534 41723 100421 113127 312 -40018 -12005
9371 -12005 -44758 3344 -4422 -59470 -49426 4929 15268 -2064 4726 -2435 -70280 -113071
9359 -113071 -172868 -153447 -75481 -45021 -30729 26917 37245 -17106 -13063 15947 56088 68071
9347 68071 63413 88845 61837 37274 -21095 -30947 -27000 -45538 -61036 -29196 -21762 -25428 1763
9334 1763 13652 -32186 -23454 894 -4475 -56423 2417 49932 16332 59165 39872 35049 84814
9321 84814 63029 51762 -4367 -28755 41702 63989 6981 -43453 -38431 -77227 -103627 -62113
9309 -62113 -65636 -72722 -10726 28845 5624 31018 110628 102432 37300 -33338 -78012 -64172
9297 -64172 22803 26307 8596 90001 120207 79695 11144 -1974 -90308 -101385 -59214 31606
9285 31606 -1185 -38992 -50525 -15073 -34968 -67925 -108985 -97064 -43050 -43333 -56880 42501
9273 42501 52053 64420 89903 76702 101403 57644 51519 42287 14327 29167 4162 -13832
9261 -13832 -25052 19057 38941 89643 116801 127538 131208 -7114 -49068 -21708 -3728 44556
9249 44556 128012 132315 85831 8302 2172 -17812 -74029 -30778 -45751 -70591 -46866 -21050
9237 -21050 -13032 -9902 4800 -8151 -53995 -34471 -19978 -83689 -90792 -59753 1078 19672
9225 19672 38743 9577 -23528 3609 -2940 -64799 -59994 -38086 -21832 4679 -20607 -33051
9213 -33051 19318 -1629 -63724 -94444 -23350 18984 22762 26876 6709 -8186 -51410 -17076
9201 -17076 -15817 -13806 -12223 -58970 -143514 -129292 -81775 -7754 22138 69274 105261 30263
9189 30263 25640 2833 22203 -31332 -29342 36061 52073 21059 -24825 -47148 5181 33662
9177 33662 -12414 -31973 -46601 35506 75463 30497 34223 -1770 4867 54826 69280 50970
9165 50970 57765 12969 -5681 -27487 -37192 4467 6036 23189 28688 83592 131995 92471 41758
9152 41758 3707 23441 94035 6891 -24853 -30976 22842 50276 10416 13887 18603 -27803
9140 -27803 -101253 -49155 -20487 -35725 -20852 -28984 -39463 -96497 -81808 13403 -9524 -26979
9128 -26979 -99838 -103077 -44283 -38308 -38117 -76109 -69804 -58499 -79409 -77170 -53076 22388 32514
9115 32514 49323 55776 82469 30864 59137 50557 38311 67923 95806 64069 24979 -11822
9103 -11822 2939 19308 78952 20834 -20387 -31170 -15536 17527 55506 38851 1958 7181
9091 7181 -3089 113 -59746 -31673 16688 -42453 -65683 -72446 -35332 -31988 -92860 -99500 -54520
9078 -54520 -2693 -52976 -85944 -134029 -82115 -190 -33045 -57632 21534 -43280 -118034 -129210
9066 -129210 -96353 -34697 -13369 3816 19880 48937 114928 81700 -8076 -36583 -54772 -84791
9054 -84791 -88122 -50156 -58999 12178 52915 62574 14076 -31179 -18863 13859 -20039 -61461
9042 -61461 -60234 -2243 -35393 -23679 15917 8221 -3549 11673 39620 15699 9666 47325
9030 47325 11717 -5158 -59184 1416 3685 61124 154400 198293 163628 137760 137007 89226
9018 89226 34553 93793 95629 53233 -22174 -23454 53706 53944 35710 2512 -24733 21732 -14810
9005 -14810 -25435 -22893 -11667 44022 22559 -63925 -108998 -133365 -105910 -86932 -107081 -123872
8993 -123872 -111229 -23645 -8847 -13566 14028 65548 130955 114506 104638 59613 627 -18175
8981 -18175 -9327 39119 34512 12291 38524 -41909 -97092 -62406 -106977 -25846 63601 126266
8969 126266 77490 40949 103403 119318 92458 81840 2900 -19229 34102 -29421 -68615 -66319
8957 -66319 -92091 -100328 -73226 -97117 -106150 -54813 17815 97695 80264 -7120 -83740 -108433
8945 -108433 -57614 -22343 -2262 -27715 -52904 43254 37668 -13696 -26699 9039 12791 -22227
8933 -22227 8537 113410 105461 -19478 -57444 -25445 -35579 -69383 -51661 -19636 51393 56159
8921 56159 -17163 -64965 -30228 38744 68566 -35997 -92328 -60519 -29438 -95260 -142915 -90405
8909 -90405 -54711 -45538 -70121 -84130 -109679 -60346 -30966 48393 42241 -80 19412 52926
8897 52926 98471 81732 38972 -33399 -20828 -36050 -12326 58542 36960 -79111 -110951 -67096
8885 -67096 -69434 -48278 -63477 -38739 11807 48487 23713 442 -23596 -62102 -47350 -67482
8873 -67482 -164646 -121852 -55116 11401 101072 79472 87191 82960 123062 132984 127739 38151 -18945
8860 -18945 -10190 36091 25715 48233 54197 30288 31562 42725 64806 66198 65604 46253 -4959
8847 -4959 -18820 -13940 -49207 -29635 -16800 -4369 5520 -4785 3303 -25953 -11948 35629 49250
8834 49250 91219 108432 69018 41548 78012 44950 -2668 43622 22477 27012 -38160 -66614
8822 -66614 -43714 13128 53397 68531 103709 116598 102767 49884 19204 36483 54168 68181
8810 68181 97103 89062 133286 124207 99028 114987 152333 86872 -28077 -50671 8669 58562
8798 58562 106735 119996 97563 103462 73242 23241 16926 20844 5306 16721 -35614 -40069 59438
8785 59438 132223 120058 135710 97849 23122 29816 -4608 -21977 -83295 -62598 -13757 42058
8773 42058 56198 30188 32101 89640 80710 28920 39171 66281 99685 108699 103348 110373 63520
8760 63520 1869 -57611 -47301 -12539 -34779 -73913 -50510 12090 92888 64600 -16675 -87827
8748 -87827 -38953 -12079 -8356 5656 -44258 -36530 -4343 43802 -45124 -65834 12754 39673
8736 39673 -51449 -82868 -42704 -24344 -4023 87408 87249 26762 -5722 -39454 -39168 -31843 35577
8723 35577 91737 10874 -30935 35917 94594 38237 35148 45282 1803 -31606 -2083 -4195
8711 -4195 -45757 -36717 -48388 -117826 -106349 -52890 -21973 1130 8346 -37717 -14246 -172
8699 -172 22336 -26629 -88624 -68410 -41795 -56884 -71880 -39196 -37304 -45949 -16075 43220 100462
8686 100462 58689 48730 66587 65030 65348 66678 18641 -25550 -49936 -34259 -44555 -40749 -44995
8673 -44995 -32954 51818 13475 15108 27235 16870 -18987 7955 78020 26325 -708 51398
8661 51398 -7802 -22447 -17248 -33210 21416 49264 23366 23622 31068 41044 -79712 -22943 92252
8648 92252 80325 49541 47663 41466 10269 6071 7480 49300 83668 27778 37867 54998 42574
8635 42574 102502 110278 104521 117169 117678 139915 151663 148600 72615 118887 139372 132420 50657
8622 50657 -31436 -3608 115537 141856 86596 64415 97233 131198 157871 140289 159589 110048
8610 110048 60007 47144 115414 179654 174119 142883 95598 68638 48520 91131 157444 163212
8598 163212 185555 217045 197257 207637 196444 235054 241031 274703 259913 247105 238544 203625
8586 203625 128722 65012 54983 73290 88004 145218 201096 215487 210548 154027 117670 90274
8574 90274 25492 52937 21401 -34917 -27546 -19369 12462 -19778 32856 -4876 -14323 74047
8562 74047 36645 -3384 -18672 -23469 -63230 -99555 -81251 -73074 -61047 -47980 -8437 -16789
8550 -16789 8660 12598 57977 32416 15702 -34452 -23663 9217 -49525 -74313 -107997 -43039
8538 -43039 13740 7662 20312 47180 51237 15257 9229 53434 42326 2915 -26847 39284
8526 39284 9379 58019 88941 33843 56298 21622 23653 -32988 30686 78279 35525 17392
8514 17392 11329 -8343 6412 -20610 -73041 -156139 -62107 27887 94227 58283 35028 20408
8502 20408 9495 -72533 -152856 -177045 -132720 -70222 -92610 -123707 -64852 -26246 -18283 -20953
8490 -20953 -40672 -40829 -76466 -31339 8016 -7318 -29466 -3105 4056 24018 40300 17993
8478 17993 -1322 -7451 42270 57030 34362 42826 80343 64645 70270 43359 -29361 -71061
8466 -71061 -15199 34910 6958 -69294 -24799 -19065 -3161 -35336 -90895 -93155 -79468 -14944
8454 -14944 -2796 -64376 -41810 9178 -3541 -35967 -73283 48854 61925 -42396 -79397
8443 -79397 -31741 -15312 10178 49947 71562 40593 -551 60795 104301 57782 81106 84231
8431 84231 59138 12171 -34969 -10135 18930 -33398 -60842 -43342 -28895 -33364 -40379 -42849
8419 -42849 -68018 -86801 -53779 -34270 23964 40785 76032 89211 76687 11465 -73595 -58120
8407 -58120 -75836 -87137 -85554 -61240 28227 76036 57783 72268 103472 45248 -36666 -60386
8395 -60386 -57332 -39074 22459 65453 85268 28660 14806 2658 8848 862 23166 28814 16064
8382 16064 2232 -45217 -37767 -37781 -8297 78910 97602 15083 55198 82498 30430 52055 44134
8369 44134 75124 50900 25147 10232 -42179 -36688 11301 23068 76191 83880 88455 80455 85885
8356 85885 52575 17764 40556 90578 69983 79102 55329 7493 -14530 13972 57801 45397
8344 45397 32647 31471 -15031 1656 14648 27111 54992 84335 99761 82300 13795 -38779
8332 -38779 -36353 -62926 -28126 -1568 -29968 9885 43589 72463 33215 44482 -18707 -75515
8320 -75515 -126285 -29552 -21322 5638 -21246 -57470 -1223 -66602 -54744 -102479 -103935 -41457
8308 -41457 -61791 -39563 -87814 -96564 -91840 -105346 -80191 -48360 -56868 -117462 -103954 -69064
8296 -69064 -66185 -53193 -47370 14571 6817 -33225 -21523 14549 47108 22092 18499 -27678 -56751
8283 -56751 -128274 -62475 -71411 -87927 11611 71967 62381 73263 43460 6366 -57869 -20038
8271 -20038 21329 31514 51800 2316 -10514 -7685 -11139 -50382 -88056 10024 -11308 -74931
8259 -74931 -28101 5224 -2551 12545 110890 61711 2741 17066 19236 -14333 35984 83737
8247 83737 58130 48068 14015 23035 34107 3542 34207 44394 -55420 -4015 56423 33960
8235 33960 58017 107512 60407 52726 -25568 -76149 -101223 -63698 -7958 -24612 -8020 -3039
8223 -3039 -41793 -56136 -68355 -94674 -66786 -58782 29963 -21129 -39093 -33839 -24965 -50821 -102755
8210 -102755 -80819 -10798 -18699 28794 17203 -87324 -80574 -20499 4064 -42259 -38800 -5500
8198 -5500 54805 101419 89740 72391 97307 114991 69178 49887 -2315 -3674 35599 65838
8186 65838 94880 71261 13942 -69505 -118121 -91026 -23494 -30980 44691 102457 122202 127350
8174 127350 124630 82350 61578 62077 53618 96103 85590 57256 42841 48019 25979 60571 48591
8161 48591 -3315 1951 -53222 -11383 70319 56958 46546 59097 63075 43993 48228 29890
8149 29890 30120 22303 76696 46251 -2399 -80447 -100416 -77591 -100470 -20172 34884 28193 -29351
8136 -29351 -79478 -43196 21068 -28024 -33897 -35187 11981 -63966 -46556 -14373 112722 86777
8124 86777 48732 12729 44216 8544 34243 66667 72912 4494 61148 67813 73631 82816 61584
8111 61584 58932 36786 60045 22487 29592 -52787 -107078 -77353 -40482 -13784 -15604 11365
8099 11365 48306 -25851 -12827 -8332 14778 24210 -9285 -17258 34942 52932 22443 -9166
8087 -9166 -9542 -52166 -114778 -126705 -143443 -133984 5607 132094 113155 82201 52371 14593
8075 14593 61569 103133 88575 71066 21878 -49675 -37990 -37780 -47233 -59970 -36728 -2555
8063 -2555 31728 20425 -4374 5338 30095 30433 13925 -4690 -21437 -19039 58346 50895 -30929
8050 -30929 48960 140131 124539 105316 63756 92105 61534 98306 59339 54604 73475 93470
8038 93470 21786 -10845 -24116 -569 69279 114316 153947 158319 121419 110726 115727 41618
8026 41618 121948 184097 122376 78568 47082 5573 111846 173393 106181 91298 79567 27996
8014 27996 101362 177804 121916 113807 99328 43237 -59925 22812 85586 37970 70234 121937
8002 121937 158285 127805 121582 66057 51170 106089 143501 120152 147122 168159 201045 175836
7990 175836 164857 174079 138467 123648 81225 98 -15750 65340 62813 102222 62013 8925
7978 8925 -2746 16477 50497 66196 68286 22574 55211 84322 108214 63345 36122 70790
7966 70790 134430 117431 129411 124822 127263 139895 81423 61650 143279 164347 149804 144809
7954 144809 203976 197629 111147 74621 113038 111184 96854 87584 42690 17082 46825 82159
7942 82159 -28050 -1236 66678 64546 110992 109662 38456 21739 -6407 -22407 -80833 -53997
7930 -53997 -11092 28467 74968 80976 49361 64246 100238 104018 56208 55836 73879 74008 67842
7917 67842 67992 100400 163069 155025 152343 84184 -12549 -10249 73154 46815 851 -23561 -43603
7904 -43603 8328 27499 14727 -9758 40980 83800 28217 -35269 2333 -10205 -43579 -40409
7892 -40409 -55774 -9401 13131 50063 63653 144628 74655 40601 8757 -2519 -59504 -7389
7880 -7389 -3884 -40051 -74137 -62980 -21251 -4172 -13673 7951 -19975 3402 58208 61174 26600
7867 26600 55089 114506 59496 30609 18162 33089 14421 49527 45296 56262 54966 98189
7855 98189 148037 190793 77292 51772 87028 60834 16905 54605 39803 -24200 48217 71964
7843 71964 106107 99088 64062 13894 -29776 -63284 -38446 -79611 -85348 -91925 -64399 -25333
7831 -25333 -25940 10748 55266 10495 24876 47400 16702 -30971 -13194 -25322 -84849 -46827
7819 -46827 -8176 -3350 -11409 -10380 -27167 11852 -42636 -125736 -104343 -68759 -71487 -77966 -53966
7806 -53966 71411 92739 48298 -72107 -118372 -135822 -107475 -107523 -154066 -161101 -86993 -36367
7794 -36367 16288 -17470 -67199 -20425 99 5682 47298 32511 -3325 -5626 27100 25186
7782 25186 -12853 -80560 -103662 -60395 1366 29855 29970 87990 169040 124448 103590 116380
7770 116380 102142 91121 127017 142295 104080 94010 75758 53469 57526 -8507 -63858 -97580
7758 -97580 -128385 -83025 -15201 -11248 -104341 -48963 9243 -39399 -1486 16695 12274 -13239
7746 -13239 -42194 -39746 -63984 -57759 -25449 8803 -24975 -96519 -64423 34996 37903 25892
7734 25892 -32343 -76748 -64176 -53359 -26101 -22390 20529 36936 12852 -18193 -38184 18007
7722 18007 -7558 -67219 -80841 -115376 -102198 -62587 -110492 -123863 -92309 -50862 -69604 -4648
7710 -4648 1229 38592 81533 79536 52935 17945 -51486 -86828 -112577 -130748 -103426 -32868
7698 -32868 48722 34930 -57935 -69153 -28737 -25947 23110 104377 27016 -49734 -44677 -15464
7686 -15464 -5391 -25357 -23413 -93452 -59864 6639 -16135 -3391 15839 11173 -27530 22244
7674 22244 62968 55756 12793 -80899 -113325 -91779 -8204 13966 -12987 -27274 916 13070
7662 13070 -52364 -9284 39138 59841 37798 -38480 -32486 -16563 -8063 22544 72438 47456
7650 47456 28775 19794 11099 -29542 40015 69715 68230 42553 2363 -66555 -76913 -106207
7638 -106207 -139262 -164398 -152138 -128383 -60346 -51830 -30694 27632 35068 -6779 -79942 -158138
7626 -158138 -171169 -74956 62138 97652 65235 24387 -30101 -20711 -43273 -75093 -27055 41403
7614 41403 32791 10237 -50601 -142404 -33599 13849 -14340 -10893 8680 8930 390 34130 36785
7601 36785 89350 108174 57500 2485 9052 4534 -1723 34093 53210 78002 48589 34274
7589 34274 51595 47000 83823 63900 48931 26144 -10381 -58467 -75620 -51690 -22366 -36896
7577 -36896 -82462 -46440 -241 -11414 -62870 -21276 30935 27040 16727 -21053 -17716 -32876
7565 -32876 -22736 -34217 12680 120604 168597 91729 2308 -82407 -41497 37738 29513 -10676
7553 -10676 14623 86936 73731 18840 -70927 -21653 59072 7949 -46181 -62748 -114376 -52038
7541 -52038 22114 43141 51783 12772 -46711 -46951 -27646 50124 70078 -3100 -51452 -59070 12183
7528 12183 43841 83428 76275 65413 31317 10523 -1243 11272 22483 34578 38082 12675
7516 12675 90516 157482 131575 71412 56309 54286 36968 28446 30143 -42241 -96577 -35201
7504 -35201 -14212 -38396 -68411 -106507 -84935 -107229 -126609 -84912 -73880 -85706 -67876 -65510
7492 -65510 -114239 -116736 -60684 -51849 2215 26353 36362 10791 6762 -41643 -44519 -54898 -85280
7479 -85280 -66965 -70024 -23200 11488 19432 44169 11640 -63800 -84514 -123591 -96160 -34436
7467 -34436 -1127 2575 -4445 38277 81299 104204 66351 103263 65341 -16056 -33884 -283
7455 -283 9128 44908 69505 114203 71822 -21106 -95822 -88595 -67437 -21461 26731 -15007 -39698
7442 -39698 -36663 25397 10999 -22595 19366 83403 106882 24304 -2732 38190 61374 27702
7430 27702 -9977 22026 24949 -2058 -42448 -102963 -84181 -36039 -19016 33722 47744 20500
7418 20500 -33060 -13403 -16847 -76729 -61271 -10033 6801 19638 45175 -3286 -37126 -63485
7406 -63485 -13088 7978 -2993 -3314 2618 -24454 -11601 -46558 -65913 -132090 -111016 -107814 -78441
7393 -78441 -40502 -9173 65898 96782 82005 77775 14793 -65388 -124911 -86939 -73906 -41206
7381 -41206 -32750 -38027 -89109 -83267 -56989 -9587 34695 -27662 -43859 -24405 -106352 -151879
7369 -151879 -61916 51883 89249 113976 48862 -93899 -180159 -186729 -111275 -70982 -62476 14659
7357 14659 18251 -61972 -132456 -178441 -167121 -103178 -46589 -4682 -485 -4595 8437 -6136
7345 -6136 -10129 -27683 -37622 -69989 -57522 63662 113836 69941 -1340 8084 8494 -28801 44
7332 44 -9263 -364 1040 2820 487 25298 17443 9494 -22156 -80985 -71396 -78553 -74361 -57930
7318 -57930 -83200 -134366 -137297 -87882 -70346 10746 64964 94031 25637 18553 2295 -61849
7306 -61849 -107801 -87468 -28181 14962 51823 27050 22163 18531 -41961 21671 48435 -9847
7294 -9847 -54416 7235 14023 -35096 -1612 -20955 10871 75201 42576 27961 -2134 -30764
7282 -30764 -62447 -75175 -71960 -71489 -56186 -88734 -114640 -48165 -62303 -53006 -6650 6721 -77336
7269 -77336 -106197 -75518 -95282 -100644 -88604 -65238 10301 33138 43573 -67542 -51678 -53814
7257 -53814 -58227 -78717 -68153 7956 9810 -29885 -52238 -64494 14115 -937 -55163 -53257
7245 -53257 -28278 -8952 277 12044 76470 41167 24178 19263 -9250 -12757 -2583 -55245
7233 -55245 -76353 -46041 -103743 -187475 -152579 -140572 -80660 -44929 -27532 9882 -9966 -67635
7221 -67635 -91487 -71991 -99853 -113116 -107615 -58112 -3442 21483 21118 45185 -35355 -74374
7209 -74374 -90413 -94430 -79662 -33199 15619 41805 -66736 -113476 -121104 -117049 -29849 -192
7197 -192 -26105 -32754 -17903 -56062 -47043 -68448 -78588 -46478 -21843 -6036 -25373 8060 -42839
7184 -42839 -111628 -111233 -75262 -55521 -19694 -210 50078 49516 44520 7729 -28280 -13901 3584
7171 3584 -25098 2516 57490 57165 100244 93089 90283 81680 83257 7599 -48320 -17325 -18901
7158 -18901 -19514 -50759 -132707 -97680 -29658 -10193 56727 53219 -17360 9084 60368 93310
7146 93310 96766 1160 22017 46401 56376 -8831 -10510 -28974 -89545 -27969 26932 41693
7134 41693 37633 42056 59562 96333 122352 133956 87370 47208 99242 137290 90701 -31285
7122 -31285 -71988 14665 59315 80478 51246 45268 59855 14844 24791 60496 43965 68515
7110 68515 40426 41777 41424 94956 55273 34076 55911 -408 -11613 86681 49048 -17274
7098 -17274 -13038 22535 29450 -9843 -42184 -94113 -79259 9283 77333 53603 13108 59327
7086 59327 63943 37059 45290 62161 78654 35941 33183 21994 55653 27432 -88682 -149832
7074 -149832 -90545 7604 -78129 -65935 33813 110592 125727 109745 21803 -46499 -65110 -102363
7062 -102363 -66387 -7767 43960 95513 74232 82610 49136 -21581 -68293 -113214 -159994 -103658
7050 -103658 -57720 -85937 -84218 -62958 -7853 -9506 -57386 -46389 27924 123865 142661 83677
7038 83677 73970 24125 -32255 -77010 -81009 -105037 -68028 -71517 -79795 -45890 -12554 -32202 -40856
7025 -40856 -35591 -103038 -173698 -155676 -124655 -95439 -12101 -23429 -81670 -54556 -13166 -43873
7013 -43873 -63584 -10639 -48718 -68288 -40156 -61307 -76283 -60009 -22641 25508 106503 154561
7001 154561 116147 68660 84136 96925 107381 146756 94803 -46734 -103854 -89684 -50393
6990 -50393 -50278 -14701 -13934 14074 58808 59007 -20842 -97886 -73995 -85695 -57053 -28219 -43473
6977 -43473 -73351 -85736 -76528 -58950 -42216 -24570 4620 14533 22727 6966 -5634 -24677
6965 -24677 -5740 32693 51326 23378 -17507 -50509 -21513 17289 -49466 -103925 -72567 -79666
6953 -79666 -20364 17261 48196 58538 67534 49525 41770 92697 18017 5886 12986 9522 17392
6940 17392 18422 -12772 -32935 -41538 -87409 -97101 -81080 -66535 -80204 -155812 -187654 -118903
6928 -118903 -152495 -105255 -115994 -110482 -93096 -27785 -7786 12264 -45424 -16389 14027 37376
6916 37376 67994 110974 76004 71812 100780 60197 41895 111069 141351 138112 90974 98546
6904 98546 30400 -46945 -86962 -47207 -44759 22663 -33193 -118189 -16082 57199 46757 60211
6892 60211 97421 85768 42059 29959 -48400 -92209 -122185 -69162 -37291 34407 39323 -52467
6880 -52467 -73857 -94187 2887 32717 63945 70080 82794 94500 65303 -36218 -77923 -71637
6868 -71637 -48885 -105555 -69426 -78036 -119466 -73361 -4467 -17431 -27753 -39461 -35020 -33602
6856 -33602 -87846 -124524 -130601 -106041 -72349 -107834 -143417 -137760 -85205 -74402 -61632 -48328
6844 -48328 -2640 43137 53854 39349 49600 80635 91284 92146 37245 20527 -16844 35704
6832 35704 85890 25360 44809 6836 52916 158961 124749 45674 -49535 -34707 -48194 -83706
6820 -83706 -90244 -152168 -131447 -82778 -58964 -63834 -40773 -83769 -142887 -83905 -27975 -24017
6808 -24017 29460 17453 15802 -33516 -28587 -10588 -41912 -72123 -90686 -38874 27288 22840
6796 22840 -57900 -76916 -94603 -69163 -15106 -18449 -60558 1705 39402 2919 -38776 -18307
6784 -18307 -3128 -21346 -50376 -40025 13654 -8248 164 61332 42196 23298 -10084 -45658
6772 -45658 -87884 -99991 -100542 -58771 -100825 -91717 -108624 -101825 -2038 54412 53399 50963 -13006
6759 -13006 -103138 -180615 -101463 -75442 47993 121441 145238 188552 243027 229558 154788 89360
6747 89360 66163 43947 5709 12734 -2385 -18881 2421 23841 20766 -23627 -36908 -22567
6735 -22567 694 8093 95335 84823 20240 -8935 -61521 -4761 -10888 -6673 3917 10362 -12247
6722 -12247 24519 29676 33667 25006 43820 38845 7573 14462 31145 -8367 -15182 22405 21606
6709 21606 27762 9568 -4254 -46029 -102539 -114288 -107521 -103362 -113280 -138952 -104804 -52170 -19023
6696 -19023 23404 34403 -25191 -60311 -53193 -16614 -3935 35226 30981 -21860 -20343 20
6684 20 -55760 -109997 -56636 40306 60099 -4998 12766 57493 56625 -16112 -54696 -25093 36681
6671 36681 14486 -22486 -36023 -3668 9958 4813 -62588 -100830 -99713 -107653 -112227 -127892 -156458
6658 -156458 -94935 -145672 -179658 -160734 -104817 -12582 26092 -57889 -88377 -78723 -11089 30272
6646 30272 10409 36895 72532 92061 39843 14261 28934 4747 11107 -1206 -16053 -33932
6634 -33932 2600 -20099 -63760 -120113 -156364 -64849 -9340 -27700 -61799 -83474 -73744 -70317
6622 -70317 -73391 -133747 -147074 -10623 -10051 -115572 -124370 -24887 15774 28651 71464 62379
6610 62379 -4896 -83421 -115700 -66083 -55291 -61282 -102980 -58711 -34347 -55873 -66903 -51743
6598 -51743 -41682 -95292 -70025 -32946 -9181 12704 -36648 -83088 -163120 -175430 -138614 -149428
6586 -149428 -144765 -129800 -123675 -106189 -28083 -21796 -65040 -87017 -70670 -1875 -18490 -44377
6574 -44377 11159 41735 50258 61056 40793 -4537 -38820 -81187 -100074 -42448 -36247 -5935
6562 -5935 14512 57487 43551 24726 -15347 -29188 -49056 -45721 -21493 -30951 -68260 -137609
6550 -137609 -146594 -70634 -89067 -108799 -107424 -135570 -178892 -109902 -58187 -97119 -97246 -99469 -40919
6537 -40919 -59120 -52842 65550 60958 32626 -28187 -42001 -90442 -122909 -77948 -49184 -35714
6525 -35714 -20824 -57463 -96744 -114699 -109974 -135142 -117821 -38506 32271 45806 59437 63205
6513 63205 -45415 -44722 -4565 -28982 -17075 -31029 -45362 -43290 30328 1749 -54449 -100678
6501 -100678 -64159 -41123 -71584 -14208 1438 52917 18156 -30036 -2991 18954 66355 58722
6489 58722 21220 46736 33270 13743 -21443 -4889 50385 80153 35148 29714 66512 -4075
6477 -4075 -13087 8488 19836 27479 24276 -17243 -65183 -46932 2914 34453 32122 96787 58849
6464 58849 -7155 15114 -29428 -14270 24364 -4799 -27184 -28389 5087 47646 66649 33070
6452 33070 -10880 -19693 8104 -6967 53506 -3738 -26953 39516 41566 62312 71583 64940 95761
6439 95761 117974 127985 105629 32536 -52623 -132022 -50078 51927 25181 -20761 -39112 -30282
6427 -30282 -34103 -55659 -74756 -37032 -42666 -23466 -43586 -43802 -30306 -24814 -30317 -11456 -74686
6414 -74686 -163589 -155565 -92558 -76995 -90082 -36787 36235 112129 96668 117563 103311 51908
6402 51908 35441 -5831 -61400 -57620 -65496 -2103 64203 88568 62453 -7243 3819 85839
6390 85839 82671 34561 -26951 -44786 -60574 -30118 -37297 -3141 23022 53950 25475 21475
6378 21475 49159 34304 11467 -48557 -94462 -84399 -69312 -90954 -115736 -83534 -41280 -31531
6366 -31531 -19037 -41335 -10862 16346 7834 -12601 -58309 -105299 -106268 -17291 -33201 -74323
6354 -74323 -72173 -47781 -63621 -2230 1550 36755 45738 75822 55474 2544 45068 43303 1597
6341 1597 47499 8791 -75089 -64235 -110146 -102569 -35599 -60037 -99041 -115252 -77683 -42883
6329 -42883 2402 76685 109615 138111 104055 69073 -25851 -73035 -69656 -51273 -94776 -61865
6317 -61865 -50910 -61741 -64976 -43416 -42371 -78285 -107900 -134870 -87421 -65077 -74469 -98204
6305 -98204 -80769 -52460 -1864 46492 -3847 -49354 -84358 -44359 93 -20038 -23887 -27481
6293 -27481 3561 -61997 -47128 22018 34509 1296 57751 85373 91710 112556 109647 65456
6281 65456 20035 -53541 -60521 -30661 -56364 -128961 -112167 -11902 5509 99957 93679 44100
6269 44100 -8972 -57677 -142907 -130420 -86040 -97101 -104018 -38539 8964 -81 -4512 25704
6257 25704 -6943 -62432 -5219 28605 -5383 -62973 -60440 9652 18487 11185 -26031 -14829
6245 -14829 35162 53823 41079 41490 60568 42024 26698 52007 81781 96579 66358 43163
6233 43163 -12650 -24037 -40600 2888 39503 85009 26543 -44398 14021 95286 118807 103407
6221 103407 99114 118141 112473 135299 170593 113661 85917 49788 61980 92373 41304 78817
6209 78817 107215 87604 77917 107327 90185 52033 -31618 -63797 -28498 -69138 -61536 -48308
6197 -48308 12413 17877 2618 -16405 -20490 -88907 -106508 -97783 -1267 25871 13186 62771
6185 62771 110851 47653 -8297 -45932 -42546 -106245 -112296 -128973 -114474 -108790 -35068 10524
6173 10524 -46481 -87210 -88265 -57833 -8144 55873 86700 76581 30320 5769 32589 80496
6161 80496 101976 60905 111585 88268 58960 22069 -41937 -9401 56951 140387 92937 -15603
6149 -15603 -54152 -77055 -95424 -244 66325 89583 59651 -32898 -24565 13792 4241 -61126
6137 -61126 4211 64866 39020 178 41869 68760 118868 104869 27836 24112 -12372 -37340
6125 -37340 7359 20021 22474 4943 -8684 36236 82726 52121 12289 40091 6663 18859
6113 18859 49367 26283 -11251 -22236 -35682 2249 842 -22126 -51776 -20712 -19753 40311
6101 40311 101746 24910 -47644 -46001 34340 -36420 -22460 38167 70800 70694 27723 65962
6089 65962 90484 88072 42872 -32899 -18560 -19911 18946 33928 -22705 -56706 -91537 -124110
6077 -124110 -35411 -53105 -66868 -102407 -134212 -120959 -129637 -73869 -75140 -106442 -71419 -43191
6065 -43191 -55575 -75415 -57007 36235 98092 88889 51243 -5847 -21257 -10244 -8808 -41016
6053 -41016 -35338 28790 55499 42747 134416 159093 109595 -5409 -73073 -34040 -2446 69070
6041 69070 104722 37724 -8825 15897 72029 97211 66730 89774 74291 45578 -81079 -69783
6029 -69783 -55378 -57875 -35001 -2246 44693 56621 65262 73034 91485 44505 16718 -14878
6017 -14878 -77987 -40896 -8124 18994 37830 9250 -61953 -108682 -33890 47866 99175 73541
6005 73541 2140 -3389 -5697 -52580 -86791 -70281 -16849 14684 50534 58679 -7448 -70905
5993 -70905 -33525 -3944 15685 -11598 -68639 -85396 -103136 -47791 -52223 -56799 -34212 34791
5981 34791 -3847 -35635 -26101 -30861 -17737 -59788 -21887 3516 -21225 -38224 -28133 -56312
5969 -56312 6395 40824 -30268 -21139 -37147 -23199 -47549 -62320 -30209 8226 -3156 14406
5957 14406 62557 57276 14965 3976 41002 4219 -7548 -27468 -19985 15000 53040 76705
5945 76705 -18094 -48500 -12958 5419 28135 56855 28922 20754 32530 71980 110546 128991
5933 128991 79811 26103 -68796 -96002 -106606 -130659 -96856 -65237 25493 97996 77080 -25942
5921 -25942 -72804 -52636 -12724 13948 -51512 -41927 -48984 -119877 -71170 -66441 -77712 -37903
5909 -37903 61834 84195 42495 40798 64705 136996 117628 42599 7478 500 -58068 -103854
5897 -103854 -54867 33926 23458 43965 131636 126689 35714 60362 69230 -6296 -82887 -54495
5885 -54495 3208 -30353 -38275 -54889 -59476 -69256 -105132 -128047 -73581 -53480 -705 63813
5873 63813 67648 56617 2393 30318 83972 61858 29784 42710 27362 21394 13748 46324
5861 46324 -6618 -69808 -60957 -115958 -134657 -110750 -74362 513 23071 -23143 -2416 18490
5849 18490 -1053 3633 -24339 -96078 -119240 -86314 -52569 -65680 -82365 -154058 -162699 -122923
5837 -122923 -74910 -75489 -70445 -23890 14361 19398 11805 -3323 864 -54095 -61623 -5755 52687
5824 52687 78823 69840 71383 38915 85593 92070 72439 124171 113055 84916 85768 67188 70818
5811 70818 -6185 34261 19539 87123 6574 -68106 -34895 -34069 -18980 -27737 24939 41294
5799 41294 1086 -1546 -48499 -70275 -19522 5248 -8281 -11445 -15776 35980 48726 -18644
5787 -18644 -57241 18678 112864 127305 121852 98683 49893 -36160 -27220 -17182 -24137 -15815 -35750
5774 -35750 -28996 -5846 28671 9097 -49439 -68260 -61808 -10327 99353 135448 79398 -13253
5762 -13253 -34680 -46116 -52388 -55567 1319 34377 54540 71956 62320 54837 7012 -26550 -39045
5749 -39045 -42054 7455 4013 -19998 24161 72981 95773 53723 29257 39131 31928 28231 -50286
5736 -50286 -52224 -38437 -21988 -43742 -21581 29057 57688 15537 -57082 -88796 -83201 -12002
5724 -12002 80360 103328 49037 -18779 3810 -8420 -57482 -94427 -8894 -38197 -16898 1104
5712 1104 30660 82799 73452 55708 44547 -2824 11370 -55767 -48803 -69207 -47466 -20878
5700 -20878 34854 8516 17023 68575 85606 14540 -41622 -18317 17853 28123 11120 13736
5688 13736 36300 -3138 -27963 -39391 -22188 9654 44124 71277 39800 28034 -19733 -37116
5676 -37116 -39042 9086 -25647 -27211 -50168 -79052 -79277 -48314 -52740 -72139 -74714 -75144 -65095
5663 -65095 -90475 -84535 -53237 -4918 -31752 -3553 -131925 -79223 -40348 -93373 -113925 -38936
5651 -38936 -15495 -89541 -86184 -38959 -10105 11133 -3556 -14736 -56909 -80352 -101225 -136173
5639 -136173 -31611 43048 -24937 -89155 -49438 -86473 -122841 -174477 -112316 -35280 -54814
5628 -54814 -59632 -51250 -67894 -80316 -77910 -25143 10588 20749 41667 34926 10887 -17850 -41142
5615 -41142 -59235 -95281 -50409 22910 26518 11484 -37800 -66351 -63113 -58367 -37534 23509
5603 23509 56464 40609 13801 22293 13751 78330 76643 168734 166481 71616 58877 95134 76595
5590 76595 19884 17160 -19840 27556 54959 -590 -15379 -68136 -104820 -42642 -9573 11028
5578 11028 -49966 -114814 -71332 -30930 27196 4378 32143 9229 5873 31932 34524 -20312
5566 -20312 -23900 -18011 -38585 -58735 -43467 -82111 -144978 -122376 -133966 -122706 -48570 29379
5554 29379 28457 -43322 -58868 30092 19714 7629 40740 23013 4179 12477 49027 75189
5542 75189 -4457 -63897 -20837 4267 -5542 -41920 -45758 -33755 -28797 -10296 24616 18265 65769
5529 65769 61574 27853 32237 -93586 -53347 41603 30787 -44152 -36411 40492 5896 -31036
5517 -31036 -15836 -40053 -52541 -62897 -40295 -63126 -108011 -114161 -85036 -29508 -74437 -141101
5505 -141101 -73627 -65408 -59706 -42167 -59591 -119351 -127818 -99922 -70450 1144 -21440 -92568
5493 -92568 -83335 -95054 -167888 -147524 -87328 -127149 -88224 -13639 26953 27201 23766 10348 26173
5480 26173 66219 61307 113118 154857 110289 69364 62804 54474 74274 66515 57535 11496 24400
5467 24400 38323 48862 -37616 -54926 -10133 4515 -25717 -5641 32984 43995 71783 111285
5455 111285 121985 83851 23701 -24931 -10544 -11871 24142 18144 -25073 -74584 -60805 -83804
5443 -83804 -143777 -126621 -158107 -142781 -190085 -138633 -64744 -64173 -60434 -70828 -74114 -31948 -72990
5430 -72990 -112589 -41419 -32864 -28447 61311 133781 70729 36292 31343 75692 11557 -49924
5418 -49924 -80879 -95688 -122394 -135122 -75706 -52807 -22640 -7412 8542 72751 92318 -14593
5406 -14593 -59054 -57543 -70513 -40690 14078 -19765 -19619 -18958 -44746 -64930 -118468 -44857 50875
5393 50875 93051 103411 76006 69683 18032 4254 106063 45030 -3260 -47286 -79724 -87953
5381 -87953 -63775 -47372 -44029 -28924 -24827 -56464 -5360 -7214 -27976 -10310 -17508 -34733 -32171
5368 -32171 -94484 -153694 -115013 -89993 -74048 -89976 -1130 109928 43846 -32465 -34177 -49642
5356 -49642 -54848 10797 91274 82157 110702 47283 -43497 -64393 17013 20108 -20740 -14710 -33515
5343 -33515 -98438 -126952 -108479 -77682 58164 158189 61730 -2766 -34973 -51908 -72969
5332 -72969 -125330 -98716 -64045 -10195 20420 25229 23629 5021 27972 -6683 -52439 -59549
5320 -59549 -29512 -369 -38069 -43418 -18274 -26064 -58238 -75851 -1680 -39616 -34415 -68447
5308 -68447 -114021 -63648 -68983 -111787 -124613 -76630 -26432 2762 -30551 -112960 -132689 -66182
5296 -66182 -82592 -83580 -55977 -21139 115 7411 -2750 18702 39103 29311 -15701 -48497 -9788
5283 -9788 27976 54336 87535 80443 28600 16981 34728 28580 38323 23850 -22636 -24063 13310
5270 13310 42237 -11926 -25772 -17095 -14449 -52764 -47783 -49564 -15704 -6612 4559 -12049 -63642
5257 -63642 -75588 -51964 5842 111676 161873 164326 93069 36304 50765 -549 -82467 -100986
5245 -100986 -92866 -96354 -113603 -156865 -128903 -30953 9384 6680 -26626 -26453 -17094 -8838 27007
5232 27007 75756 65313 -30955 -95454 -111219 -33261 -23283 -51080 -71808 -49187 -43884 -23812
5220 -23812 27723 74314 47768 67959 54922 6915 -15249 -40441 -54269 -81641 -64419 -69031
5208 -69031 -20506 -3734 10579 31242 17342 96586 141091 79263 68808 32606 -13846 -44971
5196 -44971 -55252 -63491 -32559 4913 -10973 11368 15017 -12390 -41808 -18911 75162 112295
5184 112295 68335 62533 76947 102105 127252 105124 -7736 -49881 -38128 -31319 -64396 -30459
5172 -30459 32339 41481 62960 6593 -26118 -43590 -101400 -85384 -129637 -108386 51863 183574
5160 183574 118897 114308 76690 87036 101616 52624 20304 -29209 -35578 27241 21498 795
5148 795 -75661 -93378 -102218 -75076 -27790 -66365 -56872 19145 58506 31618 -54488 -116694 -99417
5135 -99417 -32385 21974 -16609 -45978 -10838 12160 -11839 27760 17319 -20846 -8254 71918
5123 71918 23233 -59105 -69823 -51955 -36074 -14648 -36569 -79386 25433 80231 93995 54224
5111 54224 84163 101240 64108 14555 -8556 -11288 -44383 -59171 -85194 -146754 -154240 -75760
5099 -75760 -23509 -38434 -53884 -62161 -67362 -46890 -67900 1844 68165 43643 13076 17779
5087 17779 58010 -3772 -150867 -132100 -75373 -54652 -65178 -57609 22859 77894 73965 -20973
5075 -20973 -99350 -98146 -39689 2983 -17655 15916 39059 66497 50427 39390 73733 85786
5063 85786 5443 3320 -18042 181 6854 -22594 -41981 -20782 23736 47105 -17219 -53906
5051 -53906 -30758 -60962 -33075 -5210 27044 68334 32595 39837 86314 119927 36905 32932
5039 32932 53238 24696 5436 -8247 -38338 -104368 -98484 -43668 -52529 -90038 -78406 -28885
5027 -28885 47961 62635 41331 -6334 -72394 -88676 -117 98837 79720 33367 57216 50919
5015 50919 21609 40454 18758 30473 109476 104512 30473 -48855 -80331 -56044 -87434 -74360
5003 -74360 10896 96610 141910 139661 118466 95084 36757 20882 -17312 -12929 -36950 -45308
4991 -45308 -20636 -73863 -99665 -54436 28850 129621 113169 64405 92499 73218 34336 -48540
4979 -48540 -120093 -116433 -79171 -51940 10991 22883 -19890 -24520 -39117 -71883 -99975 -165871
4967 -165871 -136961 -108724 -145583 -128103 -80710 -62589 -98805 -42568 -4513 12689 -49359 -147292
4955 -147292 -139946 -131556 -135084 -147048 -170348 -158471 -84115 410 644 31087 44999 -4295 -9247
4942 -9247 -1105 -1072 -21512 -88941 -57695 -74464 -152063 -129668 -60935 -39270 -10818 15918 -55733
4929 -55733 -76227 -92702 -37038 -37645 -89224 -59249 -97320 -121415 -120092 -64832 -27307 -39938
4917 -39938 -106143 -116208 -71343 -62263 -65723 -64211 -78035 -104139 -94392 -52082 -69144 -88700 -73824
4904 -73824 -21710 -83256 -186452 -115144 -110515 -152619 -122468 -73143 -67211 -73150 -148857 -93619
4892 -93619 -45233 14986 12870 2222 -13954 7530 9206 -11659 14565 36404 60814 76230
4880 76230 49421 62776 109162 64640 -10139 -19091 -71697 -75601 -47826 -6620 35213 10252
4868 10252 55515 44004 -64302 -40415 -7523 -11100 3320 23620 62566 39099 14216 74520
4856 74520 64803 -37968 -48931 -30418 -27337 -7169 48878 68082 67960 155382 162744 96208 11391
4843 11391 -79903 -63544 -53571 -75924 -112189 -64923 -56306 -2193 35370 53507 46270 -1013
4831 -1013 -9702 26139 3653 7482 -29550 -114505 -70694 -32242 -4268 -13374 -18006 24788 48887
4818 48887 41231 90725 144191 164028 197233 183560 80103 52860 59967 60576 3592 9240 13927
4805 13927 -37875 -56383 -56508 -41610 128 18194 56516 65384 47428 37620 59085 59600 -23892
4792 -23892 -22080 -11066 -26426 -103655 -102426 -50444 -66781 -94723 -78710 -40009 2272 34207
4780 34207 42462 79584 95088 -14578 -14047 17286 -25187 -24374 35897 38328 -44897 -55283 4130
4767 4130 27394 27425 24826 63782 11772 -5956 64962 148610 117197 56138 70738 93580 100354
4754 100354 122685 71244 -15961 -18403 6584 16662 13405 -10950 3462 -10161 -9797 23800
4742 23800 4686 36228 1176 -39263 -47042 -36410 -1109 10504 80640 56677 43867 -15608
4730 -15608 -108304 -132769 -143801 -94585 -34777 -8336 15776 39239 73830 93962 61200 59032
4718 59032 4955 12235 -41574 -58592 -53385 -54141 -35501 -43611 -55153 -52571 -30609 -1415 7017
4705 7017 -35875 -73495 -46837 -57152 -162805 -144451 -46591 39010 41459 116198 82404 76087
4693 76087 81888 23243 11363 43053 41804 12040 -30521 8362 42874 -6579 -49682 -14961
4681 -14961 -68842 -162105 -139303 -106224 -34098 -8329 7252 -4048 3834 -2422 13907 45970
4669 45970 117207 134351 122061 91834 57242 44068 54705 26026 20577 4371 -782 20405
4657 20405 -39197 -37418 9982 51232 40207 52859 -21383 -79176 -98582 -99548 -72218 -92545
4645 -92545 -143494 -135823 -26536 15605 -4366 30832 35350 -39229 -51128 -79959 -73465 -89188
4633 -89188 -47485 -80053 -4678 -10797 -56932 -46915 42038 20111 -21661 41853 85500 96795
4621 96795 94755 103207 113436 88578 107346 106212 19826 -34700 9353 5990 -22131 4114 117045
4608 117045 97821 -3456 -26296 -10940 -19758 -112386 -121502 -137469 -74657 -15374 -61409 30823
4596 30823 13211 48194 -6179 -45937 -85636 -93829 -44874 35003 17542 -41845 -30291 -17367
4584 -17367 -45943 6103 -7300 -3071 -46335 -47744 -84615 -83540 -56144 -50263 -49147 -37212 -41581
4571 -41581 -93619 -150885 -60153 -78239 -69564 -36176 -24269 -177 50859 89855 65366 10680
4559 10680 -21436 29272 67444 80584 -29347 -95926 -113460 -36512 44988 49480 19009 -35884
4547 -35884 -67469 -57649 -118524 -65227 -21782 -82720 -126823 -85840 -100129 -64824 -21244 21655
4535 21655 52713 54525 39216 -2407 -54971 -11148 25929 34667 34578 97142 92135 61311 41416
4522 41416 46015 58797 38442 -75299 -21694 -914 -51335 -87009 -54972 -59452 -42930 -63788
4510 -63788 -57771 -25957 -82285 -108529 -23833 21957 2702 -17040 -80890 -78460 -20496 -42392
4498 -42392 -37178 -11719 35108 34840 -6940 -24255 -19275 40945 45521 -3594 -13183 21437 40181
4485 40181 27574 70824 114428 45388 -77668 -51990 18195 63486 33786 60845 24985 17006
4473 17006 72961 102005 6836 -7889 53655 74120 22677 40022 23892 22841 -17490 6263
4461 6263 36124 45050 81511 106077 31402 12048 19362 34895 -47465 -25811 -15246 -32909
4449 -32909 -44813 -67090 -45797 -2662 -23415 -27243 -30028 -18056 -954 -52596 -19724 40389
4437 40389 8590 21315 39684 23579 28989 12646 -27339 -51331 -15236 45156 81061 103047
4425 103047 37920 -6346 51880 -3212 -21871 -25965 7210 59883 32365 -9121 -38004 50273
4413 50273 95830 48817 14205 43983 45281 32192 -45413 -68742 -46314 -64498 4715 116882
4401 116882 90428 11146 29083 40853 49399 86469 45872 -6929 -11026 -7972 5268 -42916
4389 -42916 -42410 -57935 1117 10621 8277 75471 113870 142651 157851 108049 17212 -3949 -23252
4376 -23252 14224 46441 21418 26065 134179 140899 161344 115799 147722 130049 78171 1809
4364 1809 -29710 -26153 -51076 -49414 -7338 17089 5566 -52425 -25828 31163 95476 77440
4352 77440 43152 13700 27941 -2662 -6156 19064 -9438 32567 32921 -42979 -20628 47086
4340 47086 -1920 -23545 27870 46144 69898 38773 36076 -8346 2571 16653 37501 28747
4328 28747 -1387 -50837 -64649 -22032 21059 45557 59699 5377 -10862 1385 44951 72804
4316 72804 19972 3481 -44443 -41879 -24305 -7119 -14163 -57994 -55361 -56188 -32810 7155 3888
4303 3888 7563 -30550 -40036 -19781 -52018 -28868 -24687 -70868 -76843 -93643 -60572 -6183 4793
4290 4793 -66801 -112396 -106554 -55597 -52934 -54462 -104312 -157739 -130482 -60708 -14551 -8619 -10702
4277 -10702 -126109 -198976 -111952 -62944 -36769 -51591 3792 8333 38815 106433 113507 111473
4265 111473 57155 40368 66407 52968 89374 79010 103653 110561 159139 157943 131010 126395
4253 126395 101707 44521 126169 148795 101936 108295 58617 -19246 -35730 -75903 2582 54784
4241 54784 41923 9674 31734 12583 -40113 -68267 -55561 -43148 -47860 29465 69486 37453
4229 37453 -8233 -93787 -58873 14748 83516 101046 63934 16813 -56376 -15129 -33773 -36267
4217 -36267 7365 -22652 -57362 -53089 -53309 -66013 -77512 -74187 -26620 -47503 -116877 -101268 -69902
4204 -69902 -22810 21888 43862 75968 48557 10301 87596 143066 83224 -4552 26532 -10017
4192 -10017 -36237 -54088 -81887 -53991 -10480 5931 -4194 29462 6366 -24962 7125 50310
4180 50310 6490 -58862 -104865 -93995 -57624 -60578 3052 23255 -20389 -44785 9494 36350
4168 36350 63107 19625 -16973 -88918 -161699 -173209 -167075 -144976 -71263 -16601 -87337 -113515
4156 -113515 -113014 -62023 -38955 -43643 -39333 -51300 -31175 -18314 33309 77502 82442 111369 114834
4143 114834 113444 142537 112954 86254 70677 35970 41758 93973 112025 31593 -10852 -5649
4131 -5649 -36984 29528 57834 64868 111566 155779 87473 -73210 -47137 -16566 -5722 -46494
4119 -46494 -43399 -50863 -29881 23490 46236 16205 23953 15451 -10461 -22661 -47859 -45309 -19239
4106 -19239 -53745 -20872 -9264 -56330 -40457 -77705 -72828 -38694 59295 36973 58538 97724
4094 97724 109290 96650 39352 45872 83181 76903 -18846 -41747 14040 29013 -13467 -40076
4082 -40076 -59777 -76407 -62524 -76047 -47669 11806 21175 43324 43988 12224 -16932 -6094
4070 -6094 3035 26198 94151 64116 -44883 -105758 -44833 -51291 -87983 -78987 -72613 -11230 24898
4057 24898 40095 97631 92503 18167 2882 -42131 -68793 -45776 -67507 -63062 -48787 -52823
4045 -52823 -37158 -75451 -73399 -11282 27885 72395 126874 175428 135762 117386 68100 14720
4033 14720 -23803 55414 24465 15064 -9724 -24530 18380 1798 -40916 21153 50033 66234
4021 66234 49175 20679 -5827 -33186 -10729 -18508 -44297 -34887 -1243 -41395 -58409 -34205
4009 -34205 -18512 -53224 -108309 -106586 -47492 -21276 -75202 -97717 -73510 -94354 -51409 -59638
3997 -59638 -122251 -99681 -33497 6817 23306 -29841 -28299 -42776 -26673 -33809 -32113 -2267
3985 -2267 -20880 -7387 -17506 -9453 22820 14857 11294 -58402 -47233 29212 51428 75841 78052
3972 78052 74826 54192 39724 5948 -4154 38127 34896 10261 45512 47352 -25826 -18954 21291
3959 21291 9407 -5623 556 37879 60452 24010 -289 2117 16648 4138 488 39981
3947 39981 103756 57552 23840 72983 25759 44715 -27511 -108164 -95246 -137585 -138654 -108016
3935 -108016 -35178 -39086 -76530 -85446 -37951 13303 40493 842 -67092 -77906 -92255 -104210
3923 -104210 -61537 -54469 -102192 -131435 -136837 -98298 -89444 -66671 -2387 40148 -4132 -52886
3911 -52886 -34086 38628 44257 6259 -11865 40858 42486 -2504 -8032 59744 77818 68893 48438
3898 48438 -12582 -20245 -19304 -32083 -39315 -100211 -10523 43836 -51477 -30166 49062 72020 90572
3885 90572 39926 -23066 -34676 -52665 -76835 -74914 -82702 -75627 -46127 -77545 -109326 -83819
3873 -83819 3794 53860 30743 1140 -92192 -109942 -63962 -33673 -37094 6153 38463 21959
3861 21959 -32298 -8386 -17547 -3213 12564 67803 137662 147260 126731 83902 39975 15353
3849 15353 8829 47626 -5648 -39357 -62273 -26303 32944 36612 75539 91422 44230 44928 61079
3836 61079 26127 -19276 -102422 -86529 -91033 -74839 -104053 -96210 -62095 -23732 39974 23699
3824 23699 394 19654 39285 91947 83709 90348 95867 40895 18459 -54128 -58978 -101941 -138152
3811 -138152 -79248 -21726 12662 31679 62926 -2405 -29072 10823 39999 -34818 -51707 -58030
3799 -58030 -70398 -129233 -199157 -121032 -48490 45723 12450 -34288 -31223 23743 38902 18545
3787 18545 46956 67669 41469 60129 51092 41411 49398 2198 -54550 -26083 -36775 1355
3775 1355 11058 -39463 -56564 14604 12430 -42073 -31739 25876 7450 -35521 -18661 -35206
3763 -35206 30114 13652 -36262 -38604 -17935 -8340 -55660 -3223 -4091 -45540 -47123 -4769 45312
3750 45312 -478 3972 89394 104176 125374 56108 -35280 -58212 -55789 30295 29702 -29400 -7657
3737 -7657 -64623 -64522 54546 126137 100031 14521 -26614 3470 22270 19649 -28367 -41793
3725 -41793 15516 56315 43928 -4791 -46790 -72325 -19201 -65661 -98403 -37767 -18420 67122
3713 67122 42405 -56546 -87044 -100142 -36873 43457 2372 -14233 -25478 32503 33430 55768
3701 55768 73683 97506 83933 116585 72213 26638 59188 64242 22367 -23386 6992 46305
3689 46305 61163 13010 -60362 -62980 -4697 -23673 -49758 -46877 -38677 -80115 -69362 -22020
3677 -22020 47287 67804 17162 17258 20444 -49301 -86551 -61801 -10536 47863 33258 1147 -20571
3664 -20571 -15896 -16627 18136 51819 17243 -27356 -49000 -42434 -18766 -5940 8854 -2440 -8013
3651 -8013 64519 67566 52068 50644 17554 13601 -2542 2550 16663 27587 -14479 17829 98590
3638 98590 117958 83809 70380 68226 55859 77101 59046 29962 41981 50800 43283 -16930
3626 -16930 -11390 10003 -41409 -86687 -45935 58316 149054 187148 107175 -10463 -63505 -112392
3614 -112392 -41663 -81812 -99723 -58075 41219 74482 52216 25388 99370 143403 121046 84705
3602 84705 111717 117146 23161 -2724 140 5783 1999 -55840 -31107 -30567 87295 155845 108054
3589 108054 60265 23343 35883 -12051 -311 -20034 -45843 -18915 41106 43004 35815 58584
3577 58584 73709 67261 88793 83228 -13777 -99256 -52063 84988 110814 15160 28079 43120
3565 43120 19252 51500 101551 104478 79671 27849 -21657 10947 60986 75531 77008 73913
3553 73913 68750 51973 46844 48518 58569 31805 9416 37363 -15215 -16596 27051 21433 35118
3540 35118 7286 -1047 -6096 15310 100031 105058 72224 42294 67648 110469 85869 66535
3528 66535 49207 84103 90839 107975 127368 110520 30748 -111954 -173691 -109858 -53005 15470
3516 15470 115153 81128 -35557 -64866 309 5243 5706 30279 -11820 23648 31852 21449
3504 21449 13475 -16245 13157 -14700 -104488 -113589 -103690 -46881 -26796 -55207 -27306 -27282 -12871
3491 -12871 -11241 -55832 -42837 -52019 -49045 7447 -15039 -4527 -38498 -56189 -64619 -68828 -18891
3478 -18891 -49688 2912 46738 45999 60 -12534 -3647 -23288 -74882 -18179 53863 111616
3466 111616 118760 103949 50442 1359 -91510 -133462 -108701 -69982 -5368 -26265 -35057 16412
3454 16412 10676 84621 128058 96533 81781 109365 41052 19930 43627 17368 -50951 -110928
3442 -110928 -198591 -180060 -156369 -73579 1916 -24561 -15166 -40806 -50329 -62691 -64465 -11332
3430 -11332 66775 105884 129756 88643 39727 -2141 -51992 -50164 40444 39954 -46626 -60444
3418 -60444 -47644 -6602 29801 -1739 -35708 -4995 13593 -1029 -28493 17908 77083 88357
3406 88357 78275 52006 -32090 -108590 -78933 13360 26911 3706 -54541 -97250 -131801 -83592
3394 -83592 -65560 -15239 67470 21453 -39713 -22114 7075 30135 57632 54938 52610 54713
3382 54713 38604 43037 97192 91989 48857 178 12185 9818 13138 62697 71711 63254 37598
3369 37598 -13243 -6948 -34614 -11805 -24359 43806 37636 -13551 -52876 5256 -6362 33232
3357 33232 49857 84159 54050 64670 150178 142124 109563 82017 6424 17208 72864 112511
3345 112511 110048 133243 72437 18312 82911 35543 -49308 -31671 -41226 -25252 -49926 -41886
3333 -41886 -2308 31591 21457 16230 32814 73456 43026 67523 40243 -62679 1589 58014
3321 58014 60772 74444 56318 67248 56923 53099 56930 29002 -22772 -79285 -105514 -72402
3309 -72402 -15342 -20220 -9626 -15330 11605 59315 35881 -52739 -61320 23285 26532 -29207 -86619
3296 -86619 -151782 -139406 -59019 -45364 -43700 -17272 -19515 -16872 -13369 -55425 -786 -8795 6970
3283 6970 23896 37339 58323 29710 16376 -30484 -45922 34439 53493 41022 16431 35176
3271 35176 58726 53171 -17780 -64994 -75632 -51117 -36305 -38232 -55218 -29720 -14238 -70317
3259 -70317 -58854 -78244 -69012 -5503 -8944 -36482 -80098 -119419 -102571 -96431 -88940 -48695 -46520
3246 -46520 -9702 25310 29475 47481 40563 62073 -7795 -24839 36964 35337 -11329 -14915 33782
3233 33782 68515 46559 156935 171204 155407 69890 17805 -16537 -33386 -18325 -34696 -20691
3221 -20691 -61400 -86430 -70699 -77070 -80800 -49772 -10562 -13213 -2108 6414 12211 -31259 -47409
3208 -47409 -27799 2081 58501 68237 88781 92647 95858 117912 129398 58167 37153 -5602
3196 -5602 -45227 -42468 -75660 -43258 16349 4128 28144 8616 -46160 -48834 -46814 -6094 -4084
3183 -4084 -88083 -26396 99549 116729 106557 97336 22410 -14829 -48558 -88317 -42127 -26420
3171 -26420 -20147 65874 85357 26308 10981 -49329 -88902 -49455 -26112 -29563 20452 25900
3159 25900 -96814 -136494 -62639 -50079 -29740 -42939 -28124 -54038 -13247 -4714 -340 -23363
3147 -23363 -43789 -17586 -17961 -47847 -38536 -14796 407 64517 81674 140611 128210 25119
3135 25119 -11291 38115 66385 76009 88731 78032 4880 -41271 197 -67005 10521 92188
3123 92188 48216 11469 -39085 -47692 -25810 -17247 53734 104348 122912 43914 78088 123247
3111 123247 99970 -1544 -67650 -68543 -7951 -12184 -12319 -20715 22544 -2625 4934 2885 38831
3098 38831 -2005 -66507 -1223 45863 80630 87688 4348 21703 67985 26290 7380 30440
3086 30440 63823 134558 57127 14459 -1323 44654 93294 88283 89751 70585 68445 114223
3074 114223 91803 28520 -56137 -30229 17805 -2752 -3563 48644 9989 6282 -1175 -21088
3062 -21088 -76246 -124194 -88466 -29277 -1609 -27350 -43963 -64011 -31325 -64096 -79505 -74254
3050 -74254 -73342 -57862 3565 42478 41955 -7738 -29003 -10997 -1031 -48662 -73005 -61499 17208
3037 17208 75141 35192 13673 -24335 12975 63670 145238 140442 68605 -23766 -14251 1537
3025 1537 -73843 -132044 -106042 -3099 42110 10106 17027 26519 -12562 -32458 -20245 -35263
3013 -35263 -46409 -42648 -100298 -129061 -103105 -102999 -140722 -197006 -205025 -122771 -57034 -65816 18215
3000 18215 66652 82828 48128 -63373 -101107 -88167 -68605 -16967 60525 81639 25980 -44820
2988 -44820 -49940 -44894 -4573 -17040 31743 33649 -68259 -117439 -69643 -19620 -35699 -50996
2976 -50996 -65992 -51290 -57320 -48863 -92807 -129438 -134443 -121439 -60883 -3094 18738 29905
2964 29905 18766 12952 -27442 -14920 -14350 -32979 -37158 529 10906 39854 60727 29754 52030
2951 52030 69638 -21161 -100959 -99536 -80487 21327 36567 18021 -7100 -28232 -74903 -87817
2939 -87817 -90110 -80424 -112766 -85538 -12773 -35653 -98295 -86330 3962 105519 175653 172175
2927 172175 86853 24617 65378 98680 27622 -23092 12419 78283 44228 35251 31884 16723
2915 16723 76958 41731 62481 -23166 -74079 -15314 46950 22276 64529 7122 -21555 -40762
2903 -40762 -44504 -708 -4624 45595 51962 64369 102985 107161 81343 55655 -26895 -30086 -17054
2890 -17054 -63913 -38603 -63961 -100386 -61997 -2428 -13608 16703 13896 -17644 -30275 -6315
2878 -6315 5671 16613 45050 79658 36022 22615 12774 -27911 -56770 10625 32542 31155
2866 31155 -25871 -30348 -72832 -94119 -50923 -37958 -96950 -134215 -77674 -48397 4971 -15035
2854 -15035 -63701 -81178 -52317 -48241 -19158 -66188 27431 88091 7452 -85488 -79403 -76777
2842 -76777 -51032 -4426 64028 37809 45768 -39010 -168956 -121885 -69253 -41044 -42558 -108918
2830 -108918 -96083 -94080 -43551 6807 33837 -14145 38625 78840 15305 -35632 -36662 -90720
2818 -90720 -95255 -31550 11903 -23934 -5250 -16825 -76069 -25929 -28905 -35577 47738 74885
2806 74885 16141 15320 16478 -7668 -37124 -29494 -57639 6843 34248 49795 33743 58678 92844
2793 92844 74167 98730 72641 42826 62911 92893 56166 22496 -8795 64717 55273 80821
2781 80821 126175 123797 80002 1949 -34685 18119 95266 90206 30909 15251 61164 83627
2769 83627 59877 26910 31845 3966 -13564 -23737 17829 11229 -35067 -76260 -40552 -4109
2757 -4109 16226 -11481 -14352 1649 -43398 -106431 -111873 -33508 -26186 -84945 -36441 37429 27292
2744 27292 -83016 -155691 -129853 -50793 912 9168 4859 82107 101790 70573 37147 7272
2732 7272 49317 27621 -19449 -19663 20789 65936 85490 94720 75257 65737 97557 108047 144358
2719 144358 73413 17162 11053 -9652 -40000 -17769 50135 39153 -5467 -70094 -65667 -76913
2707 -76913 -119509 -121254 -114467 -74558 7098 5860 -75581 -69171 -563 73809 55277 41845 19728
2694 19728 -41149 -19603 -4320 569 -14142 10178 -35246 -30039 1053 52267 118558 81810
2682 81810 3394 -61891 -157699 -124385 -57339 -20782 -10778 10050 10731 -19898 11903 -33364
2670 -33364 -43661 -49841 -3483 -4018 -6733 38315 70047 109477 69876 44132 -11926 48020 36270
2657 36270 36834 59051 69568 77549 -24024 -79521 6104 43215 -3803 -17065 -51191 -53756
2645 -53756 19204 -11186 -24448 36316 70177 42206 18055 17905 63711 61992 40294 68445
2633 68445 19641 -47890 -7406 2895 24739 33031 -40133 -37861 5001 14882 62880 76715
2621 76715 15 -25665 4242 5430 30664 30335 -7336 -6326 -39633 -29307 6266 78152 124893
2608 124893 61275 40702 77598 89514 871 -73830 -59671 41178 98331 51274 104556
2597 104556 87310 7680 27611 19243 -5962 19322 -16424 -38647 -20934 23546 64104 31102
2585 31102 24185 19837 34409 50985 -8110 -72342 -102275 -72823 -55367 -44656 -53598 -88447
2573 -88447 -104239 -109104 -99465 -49802 -24391 -64882 -90379 -104398 -124738 -138584 -51557 -5448
2561 -5448 -22587 -24411 378 -1314 19105 57343 97915 43766 4513 38043 44874 94723 69883
2548 69883 -14700 -81029 -103746 -94950 -30661 16868 64689 63081 39784 115040 89856 33211
2536 33211 32683 -28912 -18909 52358 35899 5687 -1906 -45261 -76334 -91407 -129465 -162061
2524 -162061 -140349 -121449 -55371 8903 -10794 -7847 11913 -6498 -17095 1509 49166 50227
2512 50227 39478 30724 37132 27523 27651 45080 -17207 -60374 -87846 -80479 -86085 18586 45401
2499 45401 21094 -38229 -17054 25390 5015 -19380 -43030 -56562 9425 -15407 -15238 -59703
2487 -59703 -113618 -57400 11614 30081 -10163 -106876 -72453 -36911 -105538 -75934 -60277 3703
2475 3703 24746 -2426 -44356 -66234 -65557 -66579 -34821 -10851 -45963 -109234 -162704 -115509 -103430
2462 -103430 -42005 -44404 -59888 -25558 21362 -12134 -5767 25015 94057 111121 64706 44143
2450 44143 -62833 -29368 -3915 53604 62884 75400 94092 80260 34782 62501 8385 -30112
2438 -30112 -71413 -104601 -30529 56984 95514 88607 58468 9416 -26702 -24814 -13498 -21459
2426 -21459 18081 -14658 -66710 -29200 3408 58529 60929 38729 -315 56883 120995 57431
2414 57431 -16921 219 20197 5259 5491 -88657 -160252 -126952 -98719 -67982 -77696 -110709
2402 -110709 -122445 -91308 -63023 -8375 47978 43925 61461 56640 -19312 -27845 -716 -4345
2390 -4345 -48167 -53016 -53388 -80115 2864 55269 39664 57078 69416 24868 24352 19455 49958
2377 49958 70115 68412 133515 109023 25853 -28108 -38816 46199 48587 -3709 -70282 -65627
2365 -65627 -62046 -69862 -31152 37928 63854 42381 13892 15404 19956 13630 8009 7653 -561 19673
2351 19673 10190 52612 42294 35111 -37152 -35327 -49826 -81902 -63638 -68139 -30801 90829
2339 90829 151440 146802 140434 62961 57291 43212 -3699 -85613 -80768 -47693 -43319 -17320 11007
2326 11007 19285 20232 8366 -20923 -18178 62360 70211 78427 94323 88650 74704 125810 141485
2313 141485 117187 113718 119735 153653 157548 125611 95398 74923 57421 -1560 -54195 -78868
2301 -78868 -19537 58200 38686 -4600 49543 122610 128455 72616 93890 87303 92236 65736
2289 65736 90966 109039 141006 171606 199769 45516 -63806 -86226 -25288 21354 -17527
2278 -17527 5787 -9786 34115 88280 40206 16792 46321 102267 89197 47896 10605 50721
2266 50721 111877 99542 40741 41847 34290 -2647 3896 15663 23247 104491 68730 -20133 -26598
2253 -26598 -31120 47989 99494 52737 -13612 -34751 -6655 -66071 -61009 -21916 26827 77316
2241 77316 68394 21490 -68243 -92015 -26732 47165 51523 44414 22098 54524 72874 29371
2229 29371 -3517 23091 75038 64689 42221 8387 -58539 -62944 -46983 -124551 -160079 -74806
2217 -74806 12685 40707 8713 7017 17432 -54107 -95140 -52585 -70201 -110974 -80548 -27701
2205 -27701 -36790 -56981 -78904 -64015 -32917 26560 47719 35956 22348 44808 58484 42881
2193 42881 21055 36933 78 -45767 -21276 237 -21881 -68421 -89543 -91484 -109294 -108167
2181 -108167 -62477 5727 6263 59801 48539 25845 6101 -8486 -43984 -71809 -61785 -50877
2169 -50877 -38402 43044 56285 -14005 15047 -34098 -57095 17537 71449 63425 30058 -15455
2157 -15455 -41948 -48965 -25689 988 -18645 5978 15515 -35705 -34538 -70460 -105563 -101781 -77789
2144 -77789 -90009 -76187 -62620 -59188 -95042 -70624 -29712 -17367 62630 47077 2652 -12720
2132 -12720 -45222 -56869 -48448 -30127 5160 36952 16505 -2791 -18698 45831 100099 93070
2120 93070 39352 66610 21439 19624 44248 74969 71321 48379 22659 23322 39893 39657 35979
2107 35979 4894 -27588 -1169 16580 -8426 -14329 25258 49098 1645 -44144 -48943 -57698
2095 -57698 -103072 -80248 -55787 -104002 -153761 -112480 -117603 -60995 13146 -29268 -35560 39195
2083 39195 48399 34375 -10154 20483 -8352 22343 60528 38526 -19620 -28746 37560 3109
2071 3109 10748 65819 13233 -43661 -6433 21285 11437 -105 -5330 32909 -6993 -71759 -86011
2058 -86011 -53871 -52728 -79251 -111565 -106291 -147486 -122629 -72024 -55403 -54317 58298 127303
2046 127303 52798 21212 -37345 10721 -7454 1860 -8672 -69023 -100506 -76801 -59121 -116694
2034 -116694 -128536 -116951 -129007 -84417 -57990 -80512 964 54046 75788 70906 13943 4672
2022 4672 23849 45409 25615 -37950 -35952 -5363 96087 112302 47541 -4860 -30866 -110101
2010 -110101 -57619 29281 8630 -15377 42349 10300 -33584 -132135 -136086 -27456 39353 75462
1998 75462 25653 -18166 60251 90919 124734 74864 23224 26463 10566 32621 83923 16735
1986 16735 -52420 -55268 -28519 -6371 34022 -15840 -47480 -97905 -112459 -32375 1886 -23442
1974 -23442 -53218 -25120 -1238 -61477 -51725 -4255 20831 26819 52942 43700 96749 20959
1962 20959 -27414 -7243 46706 31369 -23057 -28042 -29696 -37837 31533 57255 61072 59037 -25875
1949 -25875 -13168 -26490 -33920 -68038 -33668 -24324 28517 60855 91223 91227 70823 43484 7189
1936 7189 -69940 -41079 -14825 -15068 -1737 -46126 -45170 -39788 16286 14191 9651 55202 77560
1923 77560 11725 -57804 14651 29551 32052 33417 33097 -30852 -94145 -153797 -81353 -6358 60782
1910 60782 45471 6284 59091 109216 79744 65199 -20918 -65525 -26198 46877 46895 68690
1898 68690 22241 15419 11179 -2091 43442 46507 -61531 -107306 -37267 6241 44555 26618
1886 26618 6311 -6957 -6415 -31567 -29604 -27307 -6349 34228 78505 65515 24674 49407 61655
1873 61655 4400 -9064 28714 21337 -9728 -8803 38050 51611 61384 9382 -4143 -35384 -60520
1860 -60520 -17572 31289 10230 -55911 -25361 66532 90156 -23765 -12104 -3443 7896 45197
1848 45197 72174 84045 60963 29718 34730 45985 16624 63847 84188 63108 54769 -38233
1836 -38233 -131295 -123644 -120579 -114391 -22413 3857 19095 65251 73767 100860 43535 -18455 35990
1823 35990 1183 -19772 -48070 -27998 27403 5659 6080 73849 74381 95740 169922 128943 147385
1810 147385 122204 64673 21418 -1287 -23197 -66469 3938 37601 58925 46198 78003 86522
1798 86522 55941 39880 31804 42309 75797 32863 -66125 -103670 -76069 -22237 -37405 -11172
1786 -11172 -46972 3259 -101025 -104374 -68025 -47679 -64546 -38989 23847 42205 25597 -8211
1774 -8211 7338 -161 24407 42860 51538 54135 89513 131656 144824 112605 45901 30813 5096
1761 5096 -31548 -31353 -42498 -10498 21222 25713 -42882 -30769 55523 58573 -14465 -58388 -77286
1748 -77286 5788 19184 -35976 -65763 -69853 -47412 -49691 -60571 -19324 -60544 -30483 -2772
1736 -2772 -32595 13409 86545 106600 73502 13829 8056 -22226 -832 3951 -71556 -59690
1724 -59690 -62938 -95054 -55749 26099 -13953 -9303 43067 18384 10830 -34128 -58171 14993
1712 14993 49620 44046 80135 78383 96141 141345 86119 29941 -39044 18970 7939 41568
1700 41568 21266 -40921 -84105 -107727 -24955 35741 28319 -41376 -126336 -123974 -113437 -62735
1688 -62735 -107057 -91822 -77740 -47193 -23108 -32459 -79457 -69679 -40889 -78754 -30894 26886
1676 26886 9002 -56252 -90648 -150082 -111183 -65832 -35681 -49121 -38649 -31469 -77870 -48842
1664 -48842 -26544 -35424 -126112 -173633 -127850 -98292 -26833 -10947 -39949 -80372 -126204 -126060
1652 -126060 -127542 -65695 -18943 -73683 -67341 -49068 -62091 -122361 -99846 -28978 -2093 -1112
1640 -1112 -1746 -27158 21504 40758 56081 -7384 -1734 58579 64649 21388 -5212 -31803 10920
1627 10920 55808 79281 112994 25100 86 42998 77582 39222 17637 50298 101148 120145
1615 120145 111565 42478 -35419 -52678 18732 36074 -9726 -35601 -21620 7841 5091 10788
1603 10788 23394 25919 -38875 -49502 -69081 -16155 -9305 -8265 5470 6839 27666 31090 -7652
1590 -7652 84027 108288 102941 75717 87670 43537 28175 57244 44070 16341 -38450 28791
1578 28791 73523 14550 -11614 20897 -5930 -5901 -20560 -30371 42625 113573 95772 43145 -21674
1565 -21674 -68549 -56425 -101167 -126468 -119825 -91564 -39030 -8135 7975 76665 165490 185937
1553 185937 96071 -36000 -92334 -76896 -49435 -34572 -26923 -107060 -125576 -78248 -96014 -76033
1541 -76033 -39246 -52385 -41937 18935 117532 109100 80308 40483 19783 29004 42076 91311
1529 91311 30946 -10924 -45676 -108339 -96120 -75984 -28850 -5586 5126 3345 -980 -25477
1517 -25477 4768 28981 57171 110528 67522 49897 42022 -8130 -54755 -58946 -57522 -10140
1505 -10140 -32653 -32805 -53050 -73636 -62401 -52953 -37490 16029 12622 -19049 -19802 -98705 -33715
1492 -33715 25329 -5615 -45733 -54849 -55136 -71514 -79037 -8005 65630 104450 83401 60388 -4645
1479 -4645 -77359 -56181 -49263 -48290 -32653 1667 35518 -38529 -105226 -162328 -157942 -112178 -36840
1466 -36840 48120 43694 -21234 -43009 3294 24813 10135 13603 -19228 25026 6100 -8664
1454 -8664 -8009 22407 -9458 -8972 5301 32328 27524 12619 -50570 -88911 -27197 22408 -6209
1441 -6209 -39648 -76280 -136999 -165384 -153365 -137287 -52246 14803 100020 36084 -22571 -85974
1429 -85974 -88325 -87308 -51335 -34285 4442 -26145 -40385 4832 91808 143875 108771 79198
1417 79198 53152 70982 26809 2726 -46739 -74768 -73732 -67895 3970 16330 -21573 -36530
1405 -36530 -111786 -92132 -13864 -31782 -32002 -10206 8462 -20692 -39474 -52108 -87856 -53263
1393 -53263 -8686 -18449 -47322 -12380 51894 84179 80577 70533 -5869 13007 21544 -10600
1381 -10600 -13659 43570 41815 55432 105641 33210 39091 7326 -74003 -86003 -30233 28871
1369 28871 47631 -12937 -13763 -29189 -9174 -13800 -4250 50469 64648 27542 -48167 -85016 -55006
1356 -55006 -60529 -12986 69817 76171 112787 81285 52026 98293 58616 32740 75217 97207
1344 97207 33635 -31331 12445 88449 36121 38683 96169 91564 128158 98066 64819 17538
1332 17538 50737 10122 -29008 -49529 -18723 31925 65296 2253 46133 89513 53121 -5546
1320 -5546 -21997 -53131 -72916 -69632 -106033 -137949 -140992 -131177 -45025 20581 12984 -23022 -16972
1307 -16972 -19763 3353 1413 10926 41984 -2046 23012 32531 -28954 -2636 88377 113871 119442
1294 119442 29470 21066 -26483 -37871 10276 133328 156967 134775 79141 22332 5499 11494
1282 11494 45936 98940 122667 97841 32767 23153 -25714 19968 31494 96224 110038 98593
1270 98593 81507 57959 75616 135594 99031 70686 95897 144662 141798 79901 65356 80476
1258 80476 15970 -6571 18527 30471 -95479 -96693 -44753 16116 80569 78759 -22583 -58372
1246 -58372 -61310 -19523 36590 36730 75806 45046 57260 39928 57517 78674 37506 1501
1234 1501 -52225 -12580 9241 -30900 -57944 4381 48811 32257 -51802 -85318 -39430 -62630
1222 -62630 -42086 759 -14639 28996 22003 1530 -18608 -46460 -20658 26591 2732 -24672
1210 -24672 62668 65651 -7713 -31849 -6203 -12528 -75799 -48654 -696 -15077 459 17855
1198 17855 43776 48865 54720 37954 -25156 -26370 -17134 -13260 9921 -20666 -53314 -104964 -40498
1185 -40498 13664 -46717 -50185 16399 40956 61041 51737 35593 113195 124198 57595 11338
1173 11338 -67631 -93486 -67061 -11741 1542 -48220 -54008 21579 96088 63266 71139 107263
1161 107263 92289 88173 32971 3299 10576 9210 1465 11031 44423 35101 -40319 -12220 -19909
1148 -19909 -94169 -96090 -2074 34840 -33544 2461 31754 -477 -24085 28039 46438 68622
1136 68622 136154 127911 16933 -60009 -29127 -10387 29976 24641 -14347 22248 -28758 -6462
1124 -6462 53565 61670 -855 -7844 -31839 -37004 22972 65004 -11565 -44273 -53390 1311 -30081
1111 -30081 -12089 -15506 -45441 15583 -21804 -26058 -46191 -34178 -22959 52465 94170 115089
1099 115089 48900 -28710 -14828 39636 -17316 7170 -32121 -34425 41293 65184 31101 -3073
1087 -3073 91904 129352 37877 -19704 -20720 -62968 -75581 -90225 -92786 -41273 29545 19538
1075 19538 2899 1417 -5118 4549 21863 -3005 -21766 -39259 -67232 -55906 9702 58483
1063 58483 82517 63760 -21223 -29648 9390 48154 20336 47985 70097 76638 20009 -79586
1051 -79586 -73872 -114928 -84525 -2600 64528 33377 37299 34193 467 -49235 -17868 36640
1039 36640 42511 50642 54160 100191 56255 32193 51555 34721 -14358 24096 52601 -27079
1027 -27079 -89906 -68997 -59976 -46414 -25486 -18423 24513 21960 3027 7581 34282 -12465 -28553
1014 -28553 26366 58762 21415 -11231 -33193 -38491 -27076 68308 128830 117556 89871 101249
1002 101249 93259 82505 73776 23989 -19727 -22547 37017 90675 75564 15934 -482 47402
990 47402 95666 42394 41716 16958 -20504 -30570 32648 38034 17014 16846 12754 -17501 -1972
977 -1972 68548 40829 -20839 1179 -10369 -26461 -47400 -83824 -183313 -69898 23134 69380
965 69380 66092 51874 -3675 -28219 -15182 -31835 11515 26002 45843 68307 31454 6556
953 6556 -10385 33391 133145 187977 158616 109956 132463 78702 18842 -18902 8768 27672
941 27672 4220 -16010 4520 12308 45220 48771 80538 55237 42389 68788 23024 27922 7022
928 7022 -22894 8730 85878 120610 91757 48814 51554 68875 82821 141272 98478 87116
916 87116 52849 28943 11698 -31005 3951 70680 120218 53242 40785 61970 80001 97954
904 97954 85000 93063 172020 130028 59772 12835 -23464 -74459 -75639 -101266 -103699 -58308 -31126
891 -31126 -30651 -55020 -62569 -73366 -56760 -31848 -3445 25067 106325 94293 18493 50445 37356
878 37356 -5973 -49104 -49424 -65721 -32534 5284 24028 68359 52768 19999 -59732 -40757
866 -40757 -71124 -132908 -85158 -29920 28892 16450 6283 32666 112563 179662 89384 59449
854 59449 37101 17978 31038 -3072 -62280 -28908 -17505 32328 37647 14059 -4094 6753
842 6753 -15260 -26359 -1348 -18382 17671 61501 70776 94727 88344 6637 -28784 14588 -15918
829 -15918 -124 -50439 -72292 -31886 7718 -34355 -69400 -69214 -91512 -71542 33054 108150
817 108150 113931 124533 65260 44317 -24865 -53265 -58017 -95506 -89135 -88533 -109349 -60812 28948
804 28948 51877 89103 29510 -7673 8548 43392 78238 90321 65612 30622 25784 -40804
792 -40804 -46900 -18530 43969 75882 85634 23596 -24038 -80234 -104254 -127710 -151227 -111078
780 -111078 -25024 46242 97739 61425 -11532 -76635 -110959 -124726 -38527 59262 25918 -33054
768 -33054 -25089 -39483 -77064 -98197 -68020 -25543 -36964 -38716 -75161 -50844 25142 33742 -32530
755 -32530 -20434 -25892 -43980 13371 7868 -54958 -6830 1786 4204 52415 89246 92219 80279
742 80279 68928 24949 -104690 -104251 -80375 -60412 -49108 -47729 -64034 -80953 -56082 -75316
730 -75316 -84022 -94996 -112453 -66631 13110 48313 29806 46060 46054 13164 13281 -12967 -32657
717 -32657 -18486 -22008 26149 21940 13969 96499 92279 107572 38420 64173 70894 23888 -87113
704 -87113 -134244 -128998 -93072 -9384 10090 17474 25627 -56141 -58376 -82465 -92046 -75895 -17056
691 -17056 25491 25889 -19860 -45646 -59503 -49618 -81428 -79866 -78143 -38706 -66928 -60260 12490
678 12490 79968 48602 -64698 -43283 -42695 -66289 -40050 -37433 -119044 -116025 -82470 -14692 60131
665 60131 170009 49445 -10375 72644 114661 39112 -48877 -9916 -8083 -80201 -72394 -11829
653 -11829 -22910 -67141 -26761 -50691 13735 64853 81637 55 -48352 -86481 -111160 -76264
641 -76264 21629 20480 34637 86227 42386 47183 23814 7480 27974 28304 40899 14766 -8012
628 -8012 -47316 -52241 -37110 -10572 16598 26536 56408 69849 65213 88815 103583 30910 16323
615 16323 8381 -28878 -57706 -28852 -4967 -47261 -111156 -138205 -92440 -51450 -30645 -29226
603 -29226 -31665 -42576 -34612 6269 3551 -31513 -8752 16043 31224 17755 -41945 -64672 16347
590 16347 68512 73666 37376 26437 26942 20714 24909 24433 -11555 -55933 -29419 -48548 -64968
577 -64968 -1651 63080 93330 53085 18130 60947 105081 43571 18500 -1843 -9789 -74383
565 -74383 -101063 -73029 -23578 29719 30894 19341 16823 -16955 -23907 -7457 -19203 -39630 -7259
552 -7259 -57984 -103372 -50296 -18061 -53594 -34447 -42956 -3620 40315 5177 -5181 -19250
540 -19250 24575 98471 93906 73399 42931 36899 26075 -55386 -77364 -51333 7000 67228
528 67228 68605 43240 104407 96925 77004 58678 67414 95634 68226 -15726 -46180 -29400 1269
515 1269 27546 74810 50688 -12772 -88303 -98119 -18892 -4546 65468 105709 80512 43270
503 43270 32905 -3256 -23827 69893 91334 73831 16399 -24984 -16454 -7116 18283 33086
491 33086 79752 56099 36187 22332 21198 14555 -10785 -40076 -49606 42387 115246 110995 110814
478 110814 85651 32976 7789 25414 449 -68159 -55934 -97560 -130196 -116176 -62246 -25482
466 -25482 -43351 -87011 -49948 -45431 -64502 -51894 -53919 18102 47802 -8404 -33706 -9889
454 -9889 7530 5906 -6191 -14242 -9482 23802 -22423 -135716 -126087 -89864 -41524 -38412 -35923
441 -35923 -12061 -11751 -8953 27525 -10536 -69382 -71060 -51582 25743 41806 75245 117628 85646
428 85646 82758 89323 58567 34074 54251 87604 139422 90728 8089 25757 24449 -32513 -25218
415 -25218 -12278 3458 4286 5281 -5652 -55204 -59999 -41969 -49759 -24328 12927 1586 17659
402 17659 43319 31671 -8898 -60992 -92292 -67182 -52437 -42668 -28444 -39544 -24635 16282
390 16282 35602 -498 -54244 -48655 -93806 -47653 -20409 -47457 -23110 19108 -43696 -97572
378 -97572 -109249 -57948 -19454 -2902 -6183 -23954 -26819 -22492 -37698 -102784 -87863 -111623 -65365
365 -65365 -41524 -70319 -55594 17607 63340 -36091 -24948 1495 -8422 28898 52407 -6542
353 -6542 -5353 27750 41502 32605 35575 1212 -50506 -108933 -102860 -73243 -63950 -49879 -45595
340 -45595 -26839 -51574 -64831 -62770 -27237 58119 31818 -9471 28804 13073 8191 -19248
328 -19248 -27724 -41874 -32540 -56972 -81737 -55450 -37284 11370 32379 39046 40780 -656 19347
315 19347 17783 35786 47125 -1420 9239 19937 -19331 7797 14940 29222 12429 14719 41666
302 41666 81491 15643 -46342 -42939 -45589 -30279 -32932 -82444 -59584 -19617 39100 39535 4990
289 4990 23840 -36679 -54943 -2728 17750 -29308 3066 -14676 -69689 -91196 -40162 23520
277 23520 -18640 -58633 -69320 25550 73623 6178 -18233 -41802 16975 61269 37826 20750
265 20750 17607 3166 10505 -20193 -78852 -87070 -80287 -76739 -78797 -11894 25994 11774 1723
252 1723 -13617 15445 21553 23992 7342 2079 60127 120563 92674 15348 7751 -4205 64244
239 64244 113359 131138 126607 99688 43931 -33886 -55333 -54393 -57783 -7911 48396 -19262 -66398
226 -66398 -87846 -58750 -3748 81249 121790 45773 74371 46365 -31688 -47086 -76130 -58981
214 -58981 -26906 43111 55320 895 -18526 -9588 11102 -26623 -24802 15668 44327 42199 52858
201 52858 16781 8283 41841 39249 5753 31387 50082 4514 -46187 -39350 -15595 -1874 33852
188 33852 53201 49485 -10953 -71701 -107755 -48192 21092 19971 45572 77426 94223 80437
$$ [...]
##END NTUPLES=NMR SPECTRUM
##END=
