##TITLE=Analysis number 327614
Compound Code btb 07116
Book Reference 48625
Project Code adrs flro3
Chemist Name jom
##JCAMPDX= 6.0         $$ Bruker NMR JCAMP-DX V2.0
##DATA TYPE= NMR SPECTRUM
##DATA CLASS= NTUPLES
##ORIGIN= Bruker BioSpin GmbH
##OWNER= nmr
$$ XWIN-NMR		Version 3.5
$$ Wed Mar 28 09:28:02 2007 GMT Daylight Time (UT+1h)  MAYBRIDGE\nmr@NMR_250MHZ
##.OBSERVE FREQUENCY= 250.131544655141
##.OBSERVE NUCLEUS= ^1H
##.ACQUISITION MODE= SIMULTANEOUS (DQD)
##.ACQUISITION SCHEME= undefined
##.AVERAGES= 16
##.DIGITISER RES= 18
##SPECTROMETER/DATA SYSTEM= dpx250
##.PULSE SEQUENCE= zg30
##.SOLVENT NAME= CDCl3
##.SHIFT REFERENCE= (INTERNAL, CDCl3, 0, 16.4474)
##AUDIT TRAIL= $$ (NUMBER, WHEN, WHO, WHERE, WHAT)
$$ ##TITLE= Audit trail, XWIN-NMR		Version 3.5
$$ ##JCAMPDX= 5.01
$$ ##ORIGIN= Bruker BioSpin GmbH
$$ ##OWNER= nmr
$$ C:\u/data/dgb/nmr/ADRS/2350/pdata/1/auditp.txt
$$ ##AUDIT TRAIL=  $$ (NUMBER, WHEN, WHO, WHERE, WHAT)
(   1,<2007-03-28 09:27:35.50 +100>,<MAYBRIDGE\nmr>,<NMR_250MHZ>,
      <created by zg, POWCHK disabled, PULCHK disabled
       configuration hash MD5:
       49 4B E0 1D 92 C2 6B 37 9F E6 65 BC 52 41 86 1D
       data hash MD5: 64K
       39 DD 6C FF 02 FC D8 1F BB 7D 6C 27 F9 48 5B 55>)
(   2,<2007-03-28 09:27:51.37 +100>,<MAYBRIDGE\nmr>,<NMR_250MHZ>,
      <Start of raw data processing
       ef LB = 0.3 FT_mod = 6 PKNL = 1 SI = 32K 
       data hash MD5: 32K
       0E A9 92 6A A5 E5 E8 11 2D C2 B3 BF 58 C0 67 95>)
(   3,<2007-03-28 09:27:53.03 +100>,<MAYBRIDGE\nmr>,<NMR_250MHZ>,
      <apk 
       data hash MD5: 32K
       70 14 EE 15 E2 4A 00 A4 71 0B 15 38 65 8A E6 34>)
(   4,<2007-03-28 09:27:53.75 +100>,<MAYBRIDGE\nmr>,<NMR_250MHZ>,
      <abs ABSG = 5 
       data hash MD5: 32K
       8E 90 BA 7E EB 7A CD 26 33 C8 6D 59 2C F0 04 2D>)
$$ ##END=
$$ 
$$ hash MD5
$$ D4 53 BA AD 68 FA 4C A3 63 FD CA CE 5D 03 70 FB
##$RELAX= 
##$RELAX= 
##$RELAX= 
##$RELAX= 
##$RELAX= 
##$RELAX= 
##$RELAX= 
$$ Bruker specific parameters
$$ --------------------------
##$DU= <C:\u>
##$EXPNO= 2350
##$NAME= <ADRS>
##$PROCNO= 1
##$TYPE= <nmr>
##$USER= <dgb>
##$AMP= (0..31)
100 100 100 100 100 100 100 100 100 100 100 100 100 100 100 100 100 100 
100 100 100 100 100 100 100 100 100 100 100 100 100 100 
##$AQSEQ= 0
##$AQ_mod= 3
##$AUNM= <au_zg>
##$AUTOPOS= <1 >
##$BF1= 250.13
##$BF2= 250.13
##$BF3= 250.13
##$BF4= 250.13
##$BF5= 500.13
##$BF6= 500.13
##$BF7= 500.13
##$BF8= 500.13
##$BYTORDA= 1
##$CFDGTYP= 0
##$CFRGTYP= 5
##$CHEMSTR= <none>
##$CNST= (0..31)
1 1 145 1 1 1 1 1 1 1 1 1 1 1 1 1 1 1 1 1 1 1 1 1 1 1 1 1 1 1 1 1 
##$CPDPRG= <>
##$CPDPRG1= <>
##$CPDPRG2= <>
##$CPDPRG3= <>
##$CPDPRG4= <mlev>
##$CPDPRG5= <mlev>
##$CPDPRG6= <mlev>
##$CPDPRG7= <mlev>
##$CPDPRG8= <mlev>
##$CPDPRGB= <>
##$CPDPRGT= <>
##$D= (0..31)
0 1 0 0 0 0 0 0 0 0.06 0 0 0 0 0 0 0.0002 0 0 0 0 0 0 0 0 0 0 0 0 0 0 
0 
##$DATE= 1175070454
##$DBL= (0..7)
120 120 120 120 120 120 120 120 
##$DBP= (0..7)
150 150 150 150 150 150 150 150 
##$DBP07= 0
##$DBPNAM0= <>
##$DBPNAM1= <>
$$ [...]
##$SUBNAM7= <"">
##$SUBNAM8= <"">
##$SUBNAM9= <"">
##$SW= 20.6930455092707
##$SWIBOX= (0..15)
0 0 3 0 0 0 0 0 0 0 0 0 0 0 0 0 
##$SW_h= 5175.983436853
##$TD= 65536
##$TD0= 1
##$TE= 683.16
##$TE2= 300
##$TE3= 300
##$TEG= 300
##$TL= (0..7)
0 120 120 120 120 120 120 120 
##$TP= (0..7)
150 150 150 150 150 150 150 150 
##$TP07= 0
##$TPNAME0= <>
##$TPNAME1= <>
##$TPNAME2= <>
##$TPNAME3= <>
##$TPNAME4= <>
##$TPNAME5= <>
##$TPNAME6= <>
##$TPNAME7= <>
##$TPOAL= (0..7)
0.5 0.5 0.5 0.5 0.5 0.5 0.5 0.5 
##$TPOFFS= (0..7)
0 0 0 0 0 0 0 0 
##$TUNHIN= 0
##$TUNHOUT= 0
##$TUNXOUT= 0
##$USERA1= <user>
##$USERA2= <user>
##$USERA3= <user>
##$USERA4= <user>
##$USERA5= <user>
##$V9= 5
##$VALIST= <valist>
##$VCLIST= <CCCCCCCCCCCCCCC>
##$VD= 0
##$VDLIST= <DDDDDDDDDDDDDDD>
##$VPLIST= <PPPPPPPPPPPPPPP>
##$VTLIST= <TTTTTTTTTTTTTTT>
##$WBST= 1024
##$WBSW= 4
##$XGAIN= (0..3)
0 0 0 0 
##$XL= 0
##$YL= 0
##$YMAX_a= 319452
##$YMIN_a= -462685
##$ZGOPTNS= <>
##$ZL1= 120
##$ZL2= 120
##$ZL3= 120
##$ZL4= 120
##$ABSF1= 16.4474
##$ABSF2= -4.245773
##$ABSG= 5
##$ABSL= 3
##$ALPHA= 0
##$AQORDER= 0
##$ASSFAC= 0
##$ASSFACI= 0
##$ASSFACX= 0
##$ASSWID= 0
##$AUNMP= <proc_1d>
##$AZFE= 0.1
##$AZFW= 0.1
##$BCFW= 0
##$BC_mod= 0
##$BYTORDP= 0
##$COROFFS= 0
##$CY= 12.5
##$DATMOD= 1
##$DC= 0
##$DFILT= <>
##$DTYPP= 0
##$F1P= 14.0000005364418
##$F2P= -0.99999901652339
##$FCOR= 0.5
##$FTSIZE= 32768
##$FT_mod= 6
##$GAMMA= 0
##$GB= 0
##$INTBC= 1
##$INTSCL= 1
##$ISEN= 128
##$LB= 0.3
##$LEV0= 0
##$LPBIN= 0
##$MAXI= 10000
##$MC2= 0
##$MEAN= 0
##$ME_mod= 0
##$MI= 0
##$NCOEF= 0
##$NC_proc= -4
##$NLEV= 6
##$NOISF1= 0
##$NOISF2= 0
##$NSP= 0
##$NTH_PI= 0
##$NZP= 0
##$OFFSET= 16.4474
##$PC= 1
##$PHC0= 233.1306
##$PHC1= 9.655136
##$PH_mod= 1
##$PKNL= yes
##$PPARMOD= 0
##$PSCAL= 4
##$PSIGN= 0
##$REVERSE= no
##$SF= 250.130018658269
##$SI= 32768
##$SIGF1= 0
##$SIGF2= 0
##$SINO= 400
##$SIOLD= 32768
##$SREGLST= <1H.CDCl3>
##$SSB= 0
##$STSI= 32768
##$STSR= 0
##$SW_p= 5175.98343685301
##$SYMM= 0
##$S_DEV= 0
##$TDeff= 65536
##$TDoff= 0
##$TI= <Analysis number 999999
Compound Code 99
Book Reference 9
Project Code 9>
##$TILT= no
##$TM1= 0
##$TM2= 0
##$TOPLEV= 0
##$USERP1= <user>
##$USERP2= <user>
##$USERP3= <user>
##$USERP4= <user>
##$USERP5= <user>
##$WDW= 1
##$XDIM= 32768
##$YMAX_p= 342670149
##$YMIN_p= -347619
$$ End of Bruker specific parameters
$$ ---------------------------------
##NTUPLES= NMR SPECTRUM
##VAR_NAME=  FREQUENCY,     SPECTRUM/REAL,   SPECTRUM/IMAG
##SYMBOL=    X,             R,               I
##VAR_TYPE=  INDEPENDENT,   DEPENDENT,       DEPENDENT
##VAR_FORM=  AFFN,          ASDF,            ASDF
##VAR_DIM=   32768,         32768,           32768
##UNITS=     HZ,            ARBITRARY UNITS, ARBITRARY UNITS
##FACTOR=    0.157963299565203, 1,           1
##FIRST=     4113.98825361919, 0,            0
##LAST=      -1061.99518323382, 0,           0
##MIN=       -1061.99518323382, -347619,     0
##MAX=       4113.98825361919, 342670149,    0
$$ Real data points
##PAGE= N=1
##DATA TABLE= (X++(R..R)), XYDATA
$$ [...]
24615C4782k8972j9142p2363k0662L652J8481O4414k1263j4188m0056K4548q8099
24603a58868r5680N2488P4993l5451Q1572O0715n795K1515J6463L0170L23j1833
24591C0612j5529n7269L246J20219n250l8697N0283j24017j32511L1620J47875
24580A0582Q246j4894K1297O342l5764M160M9981N7342O424j938k9335j28465
24568d6022j5404l3416k1008o055K9536M83M7130L491J2440M7527L3349L7466
24556H9517r237k8823j02524n0030n1650K567Q3623O4245o3942o7183J0628j2080
24544a34889K0702R2272R8188p098k4386m1993m5984q156J4176j7543l6766O5428
24532b6049J6685j4666K0554O7591l6628l3902n254q4851l7560j3315M5714Q3506
$$ y = [34782, 5810, -13332, -85695, -106357, -102705, -84224, -19810, -41073, -55261, -95317, -70769, -158868, -254548, -202060, -127067, -162518, -80946, -20231, -26026, -4511, 11952, 42122, 42445, 30612, 15083, -42186, -38940, 81279, 76029, 37332, 87615, -36402, -168913, -137293, 10582, 18828, 3934, 25231, 31573, -4191, -31, 49950, 107292, 113716, 111778, 82443, -46022, -61426, -94842, -115850, -121905, -92369, -91886, -44756, -41265, -28825, 18702, 52051, 89517, 80280, 51457, -51067, -101097, -152747, -150180, -66557, -2312, -66254, -133437, -122809, -134889, -114187, -21915, 76273, 69175, 44789, 2796, -43188, -51344, -37168, -54711, -91477, -26049, -9364, -24030, -3476, 64115, 27487, -6415, -11669, -96520, -134080, -147395, -101681, -18175]
24520a8175P1130p9550m5065N7107L132j1720j1508J5577m2764J6469K7836p2312
24508h9843L5099J22620M1348j32127M46L9514l4854P6188N9358p8229o6200m0053
24496f6733J1299O7327l4765k5776l1498M8163O8441m388j4762m3813k049P0758
24484D2204R5259p4670n7004j35138R596M7257O3614l6367L1991p8779p8160J07293
24472f2904J3254l540M294K5038O8259m9960m0963L1782Q3913r3327j25743L0861
24460a19036R1528R0906J01419o891q0104p2801r9060m8088K5682O9050Q0239
24449C2844N5203m0635k8421o2864J15983L9844r673k3194r161O7303j4168m1910
24437H1151j25829J0400P734M8841j4092o4831k810k8329j2959Q502m3150k0872
$$ y = [-18175, 52955, -26595, -71660, -14553, -11421, -23141, -34649, -19072, -61836, -45367, -17531, -89843, -54744, 67876, 109224, -22903, -22457, 17057, -17797, 58391, 117749, 39520, -26680, -66733, -55434, 11893, -22872, -48648, -80146, -31983, 36458, 32070, 17308, -26505, -28554, 42204, 137463, 62793, 5789, -129349, -119753, -72496, -8882, -45249, -13258, -92037, -170197, -62904, -49650, -53190, -48896, -23858, 44401, -5559, -46522, -14740, 69173, -24154, -149897, -119036, -27508, 63398, 164817, 157926, 77822, 5021, -94039, -142127, -116445, -47395, 32844, 88047, 47412, 18991, -43873, 72110, 111954, 102281, 79087, 69926, 137229, 123061, 81151, -44678, -34278, -26544, 22297, 8205, -56626, -59436, -87765, -100724, -92222, -135372, -156244]
24425a56244J11015O9547N6013j0994n7369j290K644M0475k2168K6166P8065o1828
24413G4032l6538M0033M4708p7721m5821J5067L3077K0434j3127l3180L6078L0809
24401H7851l4441R5495o7611o6477L4837n2233n921l639L9217o1878j7063n638
24389e7501P0201n3337l2692L9112k513J1892J09000L0218o7681J1031J4363j099
24377G0994M5846n8296k9302j10835j8241m4020K3355P7418N1790j5486O9317
24366F2540N5682m8308r4754n1789N0212k9985k5988m8489K1480O1011j8676m4866
24354a11930N7413j3041l786L9835N3997L4362K2619m958L7572L6959L0208j01597
24342G7653m357Q2293K5886o1586k2789k3856q1397q275K6765r588n662l4428
$$ y = [-156244, -45229, 24318, 80331, 69337, 11968, 10678, 13322, 53797, 31629, 57795, 135860, 74032, 37494, 77527, 122235, 44514, -1307, 13760, 46837, 67271, 54144, 20964, 57042, 87851, 53410, 148905, 81294, 14817, 49654, -2579, -8500, -12139, 27078, -34800, -51863, -57501, 12700, -40637, -73329, -34217, -36730, -24838, 84162, 114380, 46699, 57730, 72093, 70994, 116840, 58544, 29242, -81593, -99834, -143854, -120499, -43081, 8709, -6777, 62540, 118222, 69914, -24840, -76629, -26417, -56402, -82390, -130879, -109399, -48388, -67064, -111930, -54517, -67558, -71344, -31509, 22488, 56850, 79469, 74511, 112083, 149042, 179250, 77653, 73296, 155589, 181475, 119889, 97100, 73244, -8153, -16428, 10337, 749, -4913, -39341]
24330c9341J6156O3999L3513k8121j52114p1170N2168M8316k5673M575l4823L2411
24318a00104L0074J3056L4023M9587J00420J4149J04l3144m5138l961K0069m8895
24306C0240J3024l4556J6415M2715J0570l1249l404m210M1893k3455q4492J5699
24294a0810N0474L446K3180l88o8196j2325P7279L507k4766k0948o5019O4609
24282B0043l536j39274J1686K2853J7162Q2865k4866p328R8949J6978O3267n89
24270A58210p0386j27694K2230K031k6361K1208J4173K0689l8902k1696J8568
24259b7930L9767J41J9216m4385M234M2551J06562o8420p65L4795j5716j4852
24247G5198k4383j00041J6699M2649l3629N6080j4202q960l0354P8755J8695q5167
$$ y = [-39341, -23185, 40814, 74327, 46206, -105908, -177078, -124910, -76594, -102267, -97692, -132515, -100104, -70030, -56974, -22951, 26636, 127056, 141205, 141309, 108165, 63027, 59066, 79135, 30240, 43264, 8708, 25123, 67838, 78408, 47159, 43755, 39545, 81438, 57983, -26509, -10810, 39664, 43110, 66290, 65902, -2294, -14619, 62660, 66167, 41401, 20453, -44566, 20043, 16507, -122767, -111081, -88228, -71066, 11799, -13067, -20395, 78554, 95532, 158799, 158210, 87824, -39870, -17640, -15609, -41970, -20762, -6589, 14100, -24802, -46498, -27930, 11837, 11978, 31194, -13191, -8957, 33594, 140156, 71736, 70971, 105766, 90050, 75198, 50815, -49226, -32527, 10122, -23507, 32573, 18371, 9411, -20943, 57812, 76507, -8660]
24235h660k3910m2119O0062J13080o2195p1756n1006L0209Q4298J4355k8069q0166
24223f5877K2386L3241M5988m7686j16460O290L8861O3280J01832L0086r4737
24212A7204P6098O3988L8310l8482j09708r3102j6122O6099j1658K9273J01256
24201A23156P3700m6847k5953p9440k1703l3352Q326j0388o9739M8811Q5284l1245
24189B0610J7474M3725k5909j328j4319r9818k0914N3148J6181j8603P9335L0948
24177H0530m0194j11002k4012j095P8200N1944Q890k117n7001k9222K2373K9224
24165F518M1336j5433m5653K5262P9m2884o3603L5233p187m6492J02911M2542
24153C2629M855L4443k4027k3630J7942L3460m3460p9191J5199M2076j2904j0729
$$ y = [-8660, -32570, -74689, -14627, 98453, 36258, -35498, -86504, -56295, 28003, 42358, 14289, -65877, -43491, -10250, 35738, -11948, -128408, -122118, -83257, -19977, 81855, 111941, 17204, 93302, 157290, 195600, 157118, 47410, -45692, -61814, 4285, -7373, 21900, 123156, 196856, 150009, 124056, 44616, 22913, -10439, -2113, -12501, -82240, -33429, 51855, 20610, 38084, 81809, 55900, 54572, 40253, -59565, -80479, -27331, -11150, -29753, 49582, 80530, 40336, -70666, -94678, -95773, -17573, 34371, 43261, 41144, -15857, -45079, -22706, 6518, 47854, 32421, -13232, 12030, 12109, -30775, -94378, -59145, -66332, -112824, -9913, 32629, 37484, 71927, 47900, 24270, 42212, 75672, 32212, -46979, -31780, 10296, -2608, -13337]
24141a3337M2110j7449n7528J06796J5856m6007J7803R355k8043m9199p8660J9996
24129g8307K4875M963K6188N2223k109k4408p180O6838J5287n1722L250k6366
24117C532q1817K0674L6207m0020j9922M5770j02045N926P2732Q0568P3138P2586
24105A67329q5142o1332n6464k9609K208K0796n802m5165n8282N4036M1286M1187
24093a4954m8107N450j7481l3943M2476n310q140M1680M4583K1500j1059j0310
24081F385K1421l8626n8372o5575O3345Q2568k4919L0909N0822o4330M4636p0994
24069b2730K1865k3926j9649j2104N9823j9143M2213j7028l8289n0184k0900L7848
24057f2204M316m7032l9799J641L7668O2551N406o1650L0994J0057Q2963M3275
$$ y = [-13337, 28773, 11324, -46204, 60592, 76448, 30441, 48244, 57599, 29556, -19643, -98303, -78307, -53432, -48469, -22281, 29942, 27833, 3425, -3755, 63083, 78370, 26648, 29898, 3532, -78285, -57611, -21404, -61424, -81346, -35576, -137621, -131695, -58963, 21605, 94743, 167329, 82187, 20855, -35609, -65218, -63010, -42214, -48016, -93181, -151463, -97427, -56141, -14954, -63061, -57611, -75092, -109035, -66559, -71869, -80009, -38329, 6254, 27754, 16695, 6385, 27806, -10820, -69192, -134767, -71422, 11146, -13773, 17136, 67958, 3628, 48264, -22730, -865, -24791, -44440, -56544, 3279, -15864, 26349, 9321, -28968, -79152, -100052, -62204, -57888, -104920, -144719, -143078, -105410, -42859, -37453, -99103, -68109, -58052, 24911, 68186]
24045F8186l3389P3080N7698n8846j13068m3656l4811P430l1447j477L1374N3055
24033b5871J7691k613n0052Q6603K5723j1118M9861j9923n3682k6811N8822N5527
24021A04157k82j8016k2076l785o8394j7194L3245M3804K877J9948j4174l3935
24009B6175l6679n0812R681P748O368L9674q266k1247m0012l6783K1085P6691
23997f377L3671M7911K8106o9m6875K5166k995q7863N1864K6311p3452q9105M12
23984i3295L6898R0121j1287p7545J0839L9518L5210Q47L524n2238l4142K2462
23972b9088l7253j9832N12k8055r2060k0063K3826M0131N6350N2518Q9444m7480
23960a1050p1215m6344J5110m2772j134O7617k989N5844K9433L8293r1119p3353
$$ y = [68186, 34797, 107877, 165575, 106729, -6339, -49995, -84806, -77376, -108823, -110300, -78926, -25871, -8180, -10793, -60845, 25758, 51481, 40363, 90224, 70301, 16619, -10192, 48630, 104157, 103875, 85859, 63783, 59998, -8396, -25590, 7655, 51459, 54336, 74284, 60110, 26175, -10504, -61316, -51635, -43887, -37519, 2155, -6111, -27358, -67370, -104153, -83068, -6377, 27294, 75205, 103311, 103242, 56367, 81533, 78538, -9325, 42539, 68850, -4602, -93707, -93295, -56397, 33724, 22437, -55108, -44269, -4751, 30459, 31306, 34830, -17408, -51550, -29088, -66341, -86173, -85661, -113716, -205776, -225839, -202013, -161882, -105532, -53014, 36430, -11050, -82265, -128609, -113499, -156271, -157405, -89788, -92777, -36933, -7500, 30793, -60326, -133679]
23948a33679M4816N6849p9417l1946O436M9391m6351n307K7673N8937J21816O2343
23936A31561l8068j2764r7448l932M1939Q848j4874j971M870k4524k2405N7049
23924B8281L1752j6172k1864j1406j4800q6998l8080K2156P7910K5255n9563J6233
23912d7296O9540J2807p5479j5607n452O9518N5904k428K6401K1782m8611l7391
23900B3688M2447j2651l3341j2023m6144m2102l4949j6113M8618J07469L3265
23889E8164Q151K5515n375J5236l2396r9600N0991j5472p1614j6736J4304K2324
23877d6508N1660O9066L1453m5716o3643k7982O6034j4201q5807k2096m598J04590
23865A2252M1869l7712r6372p1941j04380K4493J51186O1882r731p2583K2712
$$ y = [-133679, -88863, -32014, -111431, -143377, -136941, -87550, -133901, -139208, -111535, -52598, 69218, 131561, 93493, 80729, -16719, -20651, 21288, 30136, 15262, 13291, 18161, -6363, -28768, 28281, 60033, 43861, 21997, 10591, -4209, -91207, -129287, -107131, -29221, -3966, -63529, -47296, 22244, 35051, -40428, -56035, -61487, 8031, 63935, 61507, 87908, 109690, 61079, 23688, 66135, 53484, 20143, 8120, -38024, -80126, -115075, -131188, -82570, 24899, 58164, 66315, 91830, 86455, 101691, 69295, -30305, 20686, 5214, -66400, -83136, -68832, -46508, 5152, 74218, 105671, 59955, -3688, -31670, 34364, 20163, -65644, -87740, -92338, 12252, 54121, 16409, -79963, -151904, -256284, -231791, -80605, -18723, -28454, -101037, -78325]
23854g8325J05202J09964K5800o7116o7420M6343m3785N2214M782q1082p4708
23843f8131K2981M3397J07292l5031j5472M5650m6385o5570m6163o3011L0046
23832i0397M7554R3480J5965k1859m6882j9562M6665L6652q3083q3110L0898J02835
23820B9156K1122K3534K6819J6548j5485n7000q0654N484p547n6817k1994L0249
23808h6585M4685n9415Q2784J03808M1897J4577j0768k8481j4371r342j27242
23797d8453j19586m4753Q1089J29021J15836R689j06804n4712q260N5117l9075
23786c0891j9460o888O8756m662j30501n7095Q1967l672M2794M8722M6830q3566
23774d7666k114K9918m9989N2000K8661N830l7010j5962P3971M4642l545j7475
$$ y = [-78325, 26877, 136841, 162641, 95525, 28105, 74448, 30663, 82877, 87659, 6577, -68131, -45150, -1753, 105539, 70508, 55036, 100686, 54301, -11269, -57432, -120443, -90397, -42843, 50637, 66602, 44743, -2139, -21701, 24964, 61616, -21467, -104577, -73679, 29156, 50278, 73812, 100631, 117179, 101694, 44694, -35960, -30476, -38023, -94840, -116834, -86585, -41900, -101315, -18531, 85277, 127174, 141751, 130983, 102502, 88131, 78789, -48453, -168039, -212792, -131703, -2682, 113154, 122843, 16039, -38673, -46933, 8184, -30891, -50351, -57239, 11517, 6855, -123646, -180741, -98774, -102446, -59652, -10930, 35900, -47666, -49780, -19862, -69851, -17851, 10810, 16640, -20370, -36332, 37639, 82281, 78736, 61261]
23762F1261q9831J9007M7750p543o2564K3045M736K3445j8578k9182M5515J1656
23750B8717N5616K273q1106p6472r7447P8590j7102J731R3428K2723p4587p4041
23738a37677N5671M6283M849J8031K1200l5150p5197L5546L1556M2099l942k2449
23726a9180L1267M4781j9520j8010o8950q130P2550J12093k3949p7402r581O6789
23714H2758O3668r2639j34001p9238P5595M3187j23780J126N8695l1539L5257
23703a00911L5058L6503O4584Q3201p5118j6472M5945l7487q0165l7342o1577
23692a43781N2627O9247o199M3705P3098p4838m0583p573n6160m6453m0524J32126
23680d5308P4405k8141r278J3052L117J1850j9536J4463J9303J3367K2383r319
$$ y = [61261, -28570, -9563, 38187, 30644, -31920, -8875, -4139, 19306, 728, -28454, 17061, 28717, 84333, 86606, 5500, -70972, -168419, -89829, -106931, -105200, -11772, 10951, -63636, -137677, -82006, -35723, -30874, -12843, 8357, -26793, -101990, -66444, -34888, 7211, 3269, -19180, 12087, 56868, 37348, 19338, -49612, -57742, 14808, 126901, 102952, 25550, 15969, 82758, 146426, 53787, -80214, -159452, -83857, -40670, -164450, -163324, -104629, -136168, -100911, -65853, -29350, 35234, 118435, 43317, 26845, 72790, 35303, -44862, -82204, -143781, -91154, -21907, -28106, 15599, 88697, 13859, -26724, -34297, -90457, -136910, -177434, -45308, 29097, 956, -8322, 4730, 7847, 19697, 161, 14624, 33927, 47294, 69677, 60358]
23668F0358k4022R997Q832l2640j9980J6563J4735o3554j00263K1250M0378O3197
23656e149K9615j10784o4745P4161L6987k8242p3811n7907J0959P7246K0844j8110
23644a08936Q4935N5696m396j9859n500n9526j4435M9864J8690K4227K5624j2739
23632C3645K7783M796J7926l3000q5586q696K1509k1139o0056J886Q0675j6890
23620c7147p7086N3551O8394J6898n7521M2614M3105o3305p7360L5385l5580j0086
23608i8138p945K6895n3423n64K3904L4020r579O0829o956k5909R9770R3397L567
23595A39868m3141m8350q2086q6238N7508J17878k6297o5281l1733q1851R0687
23584e9036L6764K9740O0121j44469l181n629n034J9095k5351k0741N8173P0744
$$ y = [60358, 36336, 46333, 55165, 22525, 2545, 19108, 33843, -29711, -129974, -108724, -68346, -5149, 24466, -86318, -151063, -76902, -39915, -68157, -141968, -199875, -188916, -111670, -90826, -108936, -24001, 31695, 27299, 7440, 1940, -57586, -72021, -22157, -3467, 20760, 46384, 33645, 61428, 66224, 84150, 51150, -34436, -43132, -21623, -42762, -102818, -100932, -20257, -37147, -114233, -60682, 7712, 24610, -32911, 9703, 52808, -10497, -87857, -52472, -88052, -98138, -106083, -79188, -132611, -133175, -109271, -75251, -84830, -24001, -30957, -56866, 42904, 136301, 139868, 96727, 48377, -33709, -119947, -62439, 55439, 29142, -36139, -67872, -149723, -59036, -22272, 7468, 67589, -76880, -80061, -85690, -90724, -71629, -96980, -117721, -59548, 11196]
23572A1196N0088m0575l2074m7276k9037n6221O4921K1248k4429L435N9957l0142
23560d8909k2420l0008O6910J15444k6215o1021m4780k0853K6713M5989p0049
23549f9199R075J2697l6315n9418n986J75078M5484j51834l1269K7909Q0939L1071
23537B8232J9143J0495K5150q6450m8459J39629M2732m6036M7726k2325o7943
23526D1894l8043l467n9398j50098k9300j717K5015J12980P803j7436n432J1549
23514a05650M3708J2391O4516n4440o9318k7360K7622J2893K4617L3106N9432
23503B1517K4215p3755q8936m8123R777K6236J0844j501l2892Q1343j1708j4873
23491i7856L3101J948k1594J15322J5004k1883J5113N2719l5125k3537l0658j4471
$$ y = [11196, 61284, 20709, -11365, -58641, -87678, -143899, -78978, -57730, -82159, -78724, -18767, -48909, -71329, -101337, -34427, 81017, 54802, -6219, -50999, -71852, -45139, 850, -69199, -60124, -47427, -83742, -143160, -149146, 25932, 71416, -80418, -111687, -83778, -2839, 28232, 47375, 57870, 83020, -3430, -51889, 87740, 130472, 84436, 132162, 109837, 41894, 3851, 384, -59014, -209112, -238412, -240129, -215114, -102134, -94331, -111767, -117199, -105650, -61942, -49551, 14965, -39475, -108793, -136153, -108531, -95638, -71021, -37915, 21517, 45732, -28023, -116959, -165082, -155305, -129069, -118225, -119726, -152618, -71275, -82983, -97856, -64755, -62807, -84401, 30921, 45925, 24042, 39155, 91874, 56749, 33212, 2554, -11917]
23479a1917J1674L3640J2594m6469J7780l4062j7086k6441o1240O0080J00575
23468C9128m8343J7900M0003O3508N07k8820m6899r4367k395l5306n120J09085
23456H881L1156J4315l9932l2587Q8778o217j40734p8661K0368L3418Q0388L6659
23444A5832p0570o6570L6138o3345j2003Q5567K4874l865L0885M6391N6498J9838
23432I9670l9674j14434l8136N0132K6225N597j0109O6432j7127k7494N4108o5535
23420a0345m7578m6681L6577j0387k3152j2884Q5984J38476m390N799p5545o2446
23408b6572m4948N6389Q8920m721o6788L0715r16o0309L0623K0753O2526O5853
23396A51525j03472p5222n3618M343J3344q149R382J3089q93M1467N9006Q366
$$ y = [-11917, -243, 33397, 45991, -478, 17302, -16760, -33846, -60287, -121527, -61447, 39128, -9215, 8685, 48688, 112196, 112703, 83883, 36984, -57383, -59778, -95084, -100204, 8881, 40037, 54352, 14420, -18167, 70611, 64394, -76340, -155001, -134633, -101215, -20827, 15832, -54738, -121308, -85170, -148515, -160518, -74951, -50077, -53942, -23057, 23334, 79832, 99670, 59996, -54438, -92574, -42442, -16217, -10620, -20729, 45703, 28576, 1082, 55190, -10345, -57923, -104604, -68027, -78414, -101566, -114450, -28466, 110010, 105620, 111419, 35874, -26572, -71520, -15131, 73789, 69068, 2280, 32995, 32079, -28230, 2393, 23146, 85672, 151525, 48053, -27169, -80787, -76444, -63100, -71249, -61867, -48778, -49671, -8204, 50802, 59168]
23384E9168p5961n4638j47852m5445J04439J28075k685j5371R1341j9518q3542
23373f1989q9847L6718P2991M524p704J5265J283J9626N6623M8430r293n6395
23361C0232j7364n9491q8129M7366L5296n7980k5701L1706j3235M3716l8860J3367
23349i9077L0193j1689j4254M7033K7374Q7467N8215p6684k377R8872l3321o4746
23337D7006j8429m6658M4767M6703l781n4684k7425r998N3844L37n4919k6114
23325d9351L1242j6777k2973R9272j2072l2165O1324k0515k7666n123j0499O757
23313A454L3418J7324n655L6652M4015r185J1722p8375q388J05790l1505k7793
23301H9474M5168m0834n979J3575J4413K7847k6951j40321j01499N3481O1338
$$ y = [59168, -16793, -71431, -219283, -264728, -160289, -32214, -34899, -50270, 41071, 21553, -61989, -151836, -115118, -42127, -37603, -45307, -30042, -28759, -9133, 47490, 95920, 86627, 30232, 12868, -46623, -134752, -87386, -52090, -110070, -135771, -104065, -117300, -73584, -112444, -99077, -68884, -80573, -94827, -47794, -20420, 67047, 125262, 48578, 46201, 145073, 111752, 47006, 28577, -18081, 26686, 73389, 69608, 14924, -12501, -22499, 31345, 31682, -23237, -49351, -18109, -34886, -57859, 41413, 29341, -2824, 58500, 37985, 10319, 5196, -5303, 1454, 34872, 52196, 46541, 83193, 127208, 118023, 129745, 51370, 42982, 148772, 117267, 89474, 134642, 93808, 87829, 101404, 115817, 143664, 116713, -23608, -125107, -71626, -10288]
23290a0288n4737q6680m8281L4819J22564M2284l7647K4140K9680N9939o3808
23279A1985j4911K3548n0860j6921l8328p5616j6436L8258P9557Q9387o1983l8199
23267g0519N8676M3585j0560l2005k1341l466L6067j5512l9241N0216O8315k1150
23255D3065M926n4858o2551P5710R394q3978k2370M9665K0331o222M9637J28926
23243A51675l2501n7359o9793k6648L6095J2846k6921K9130L7348K735R526j16
23231F6017l7003j02334K09Q8771M5157J9627L872J2379J9378k2295j6325K2368
23219I9821k6989r1721o9687O6800j2251K4759l8402q6460J0665K7948K4831O994
23207f3692J3957J77r2004k4562K6734j9790r993n1217K4401Q7588L502L6680
$$ y = [-10288, -65025, -151705, -199986, -165167, -42603, -319, -37966, -13826, 15854, 75793, 11985, -2926, 20622, -30238, -47159, -85487, -161103, -177539, -139281, -59724, 29663, -32320, -70519, -11843, 31742, 21182, -10823, -32164, -35630, 437, -15075, -54316, -4100, 64215, 43065, 47991, -6867, -69418, 6292, 15686, -68292, -90662, -40997, -20666, -26888, 22749, 151675, 119174, 61815, -7978, -34626, 1469, 14315, -12606, 16524, 53872, 56607, 66133, 66017, 29014, -73320, -73111, 15660, 60817, 80444, 84316, 96695, 116073, 93778, 77453, 99821, 72832, -18889, -88576, -21776, -34027, -9268, -47670, -134130, -123465, -95517, -70686, -63692, -49735, -49558, -141562, -166124, -139390, -159180, -169173, -220390, -195989, -108401, -104899, -68219]
23195f8219Q752L2985K4810l965L2038j0163m7658p273q6389q4736K6070L0394
23183a53354K1731J9016K1549N4934R6074l8874l3768o3925j2715M0643P7309
23172B8620J6447O9149O780j1844q6891n0264O1966M6873L1482k9760K9393l3121
23160G8830m3539k6757k0654M5265N3696K0936L4622l7592k8988l5777J747L009
23148D4798Q7941K6067q135o9296m2624l7922R980j51R899P2967K8907k7471R341
23135A04301p1622j05733R000O300l8754J5124M4498N0003L3976o6187m6493K12
23123f5375n9159k6413p6140J28231J03925l33J5334O3272J0535k4907m782q9863
23111b5675j9950R304l4136k7429M8893j1736j7588L5579K4002l1192K718K0617
$$ y = [-68219, -59467, -26482, -1672, -5637, 26401, 16238, -31420, -38693, -125082, -209818, -183748, -153354, -131623, -112607, -91058, -36124, 59950, 21076, -12692, -76617, -89332, -48689, 28620, 45067, 114216, 120996, 109152, 22261, -28003, 33963, 80836, 112318, 82558, 111951, 78830, 35291, 8534, -12120, 33145, 86841, 107777, 142399, 104807, 75819, 40042, 41789, 44798, 132739, 158806, 150671, 81375, 38751, 829, 10809, 10658, 20557, 93524, 122431, 94960, 104301, 32679, -73054, -64054, -57754, -96508, -81384, -36886, 13117, 47093, -19094, -65587, -65375, -124534, -150947, -227087, -98856, 5069, 4736, 20070, 83342, 93877, 68970, 64188, -25675, -45625, -36321, -70457, -97886, -48993, -60729, -78317, -42738, -18736, -49928, -47210, -26593]
23099b6593r536K9773L0012n8380p7787J16989O5204l2344n211p0104j5364k2004
23087g5345Q618J351J3559N4490k7313n2047k3445J5275k7312P8062N0466j7767
23075a408o0404m9910J4129l403Q3518J0198M6706J0828m5947J457K9589L878
23063C9231l0830o3319m6215n1917P495N2654J03831P1525N5617k3837r4202K4219
23051D4252J0863l152p5246R0574N6304r8274j37405l3161M0751Q8691k528L6021
23039A7690j6020j0959l8862O866m291j15860j0294K5273J7016J19748P32L293
23027e668J07240M4758j19121j45452L0588N8770p2788r5908K6596J02788r189
23016g7386k7582J399K1367P7771M6488k5486n6055m405j9422N9444J04014l931
$$ y = [-26593, -36129, -6356, 23656, -34724, -112511, 4478, 69682, 37338, 32127, -37977, -53341, -75345, -66727, -65376, -51817, 2673, -24640, -76687, -100132, -84857, -112169, -34107, 16359, -1408, -61812, -111722, -97593, -100996, -17478, -7280, 39426, 50254, 4307, 5764, 35353, 39231, 8401, -54918, -101133, -153050, -145555, -92901, 10930, 82455, 138072, 114235, 20033, 44252, 55115, 51963, -23283, 67291, 123595, 25321, -112084, -145245, -104494, -15803, -18331, 17690, 1670, -9289, -48151, -41285, -45576, -161436, -171730, -146457, -129441, -9693, -8961, -5668, 101572, 146330, 27209, -118243, -87655, -28885, -101673, -197581, -170985, -68197, -77386, -104968, -103569, -82202, -4431, 42057, 16571, -39484, -43889, -63311, -3867, 100147, 96216]
23004I6216l3385r1928j3629J0224O5790K7990k7715K7985l6708o4374k6956j6123
22992h2613O0306k0919q863K0267qQ8960p9219m8815J4671P7642j910L945j6664
22979F780o8765K4426J09097k5491n1064o4713p161Q500M3060L5299k4797L7975
22967B3146j1809q7956o3092K8527R6720P9713j6998k9249N4155L8288n4959k7510
22955B8976M7839J5801n8165n6888M5391M6120o1586l3884n870K5477K8835k8106
22943f060m711L3216n9142m2271k3129N0015J7869k8240j10880r9522J5147J4947
22931b42761N7958R0573j4808k0920L1656N0262R8125K144j3254j02723Q577l7769
22919i2940q4956r542p901k918K5897M100L1974R3298R526n0424l5387p4961P1496
$$ y = [96216, 62831, -29097, -42726, -32502, 33288, 61278, 33563, 61548, 24840, -39534, -66490, -82613, -22307, -43226, -52089, -31822, -31830, 57130, -22089, -70904, -56233, 21409, 19499, 23444, 6780, -61985, -37559, 71538, 46047, -5017, -69730, -76891, -68391, -25331, 9968, -14829, 23146, 11337, -76619, -139711, -111184, -14464, 65249, 48251, 19002, 73157, 111445, 56486, 28976, 76815, 92616, 34451, -22437, 22954, 69074, 7488, -26396, -32266, -6789, 22046, -6060, -10771, 22445, -36697, -78968, -102097, -52082, -34213, -62453, -173333, -272855, -257708, -242761, -184803, -94230, -109038, -129958, -98302, -48040, 50085, 52229, 38975, -63748, -55171, -92940, -177896, -187438, -195339, -198257, -172360, -168260, -136286, -42988, -33462, -83886, -119273, -194234, -122738]
22906a22738J02921J5452o6118o0202M2193J39328P5706n3485k8047l5899j8748
22895i637o108q44K8273k4003k8158M1088L1055k6473l5832k0879n5557j0008
22883a17083q934L2494m216m4858L5710J30905J01535p4554l646q1593j18954
22872a53194M9989Q0964J0978p7329j9672l6814K4912O8469J7220K4460l9947
22861d9964o545O064J7286k8497M35K007N6013J9386j3430j04621j7958N5609
22849f4215N1324o8335k043N6427J4280M1230j18074j2346Q3114Q4536R7450J0907
22837A74255o0208q8689q0835q4789J4547j0703O3686O9839j965L2011j3902O782
22825B0029L6591l0252n1460K671L0679o111Q2414L6419k8962l3670j44761m8356
$$ y = [-122738, -19817, -4365, -70483, -130685, -88492, 50836, 126542, 73057, 45010, 9111, -9637, -15745, -16589, 11684, -12319, -40477, 611, 31666, 5193, -30639, -51518, -107075, -117083, -126017, -93523, -97739, -142597, -106887, 24018, 125553, 50999, 47353, -34240, -153194, -103205, -22241, -11263, -88592, -108264, -145078, -120166, -51697, -34477, -10017, -49964, -56509, -50445, -33159, -61656, -61221, -59214, -3201, 16185, 2755, -101866, -119824, -64215, -12891, -81226, -83269, -26842, -12562, 28668, -89406, -101752, -18638, 65898, 163348, 174255, 114047, 25358, -55477, -140266, -125719, -136422, -72736, -2897, -4862, 27149, 13247, 20029, 56620, 26368, -25092, -22421, 8258, 2147, 84561, 120980, 92018, 58348, -86413, -134769]
22813a34769K9486J3368O306o6698P1241O6715R3747J3671o3084n6014m0713M3771
22801b2973J5001k6917P4767k7332K4666r8368o4511p4651L6434J53870P9448
22790F9434m368n6950j973k8060r1955j2014l4773o0793K203R5179K9834L2337
22778f1899M2038p4364N0582m1829M4751k4546O4279Q5767P415n6233m2614j9927
22766b6580K9732L1361l8490J5992N8169P338r4582p8479n494M7803R3054N8029
22754I7853Q2105K6585o8636j34558J3859L3137K5276M7536j9111l7470L4347
22743A00923N3630j7881o1754L894M1146o4715K4235l5309J2351m1509o9614J810
22731e2793J16596o5008j6738j0000q4453k0371N4791j3406J3764L2592K9469
$$ y = [-134769, -105283, -91915, -85609, -152307, -81066, -14351, 79396, 93067, 29983, -26031, -66744, -22973, -7972, -34889, 39878, 12546, 37212, -61156, -125667, -200318, -163884, -10014, 69434, 65066, 8116, 6143, -21917, -113872, -125886, -160659, -221452, -219249, -124070, -94236, -61899, -19861, -94225, -43643, -85472, -40721, -65267, -988, 84779, 92194, 35961, -6653, -26580, 3152, 34513, -3977, 12015, 70184, 77522, -17060, -95539, -101033, -53230, 39824, 97853, 179958, 206543, 137907, 3349, 17208, 50345, 75621, 123157, 104046, 66576, 100923, 154553, 136672, 74918, 78812, 119958, 55243, 79478, 44169, 56520, 15011, -54603, -52793, 63803, -1205, -17943, -27943, -112396, -132767, -77976, -91382, -77618, -45026, -15557]
22720a5557m711J8773j2500K1081j2465j1768k6543J8166p2026N9309N7597M4631
22708F3987O394m4431l1289L0126L1842k3361L4375J8380R106k1884l872l6957
22696C2416m5445k0208k2411n4207M5118J7803j6289k2294R315O6351m8940R640
22684d9151L9206n8018K8618N4752j022k9437j1461K0508K0132j9973l4381M142
22672c6085j2020J3205j2964j6174O8397P0382m1723p6083J7539M5593M4583k0698
22660D3952o5624p4158J483K2076J4640L207L7593J47126J11689j8708o2724n3400
22648A07152P139J9015o0783j05126n1873n987O1157R077M6744k254l2734L8212
22636B9739k4812k0815m3348L8946O498L8985P2163J2622m7717j16979j0468p8923
$$ y = [-15557, -20268, -1495, -13995, 7086, -5379, -17147, -43690, -25524, -97550, -38241, 19356, 63987, 70381, 25950, -5339, 24787, 56629, 33268, 67643, 86023, 95129, 73245, 69373, 32416, -13029, -33237, -55648, -109855, -64737, -46934, -63223, -85517, -76202, -9851, -58791, -49151, -9945, -67963, -39345, 15407, 14385, -15052, -26513, -6005, 14127, -5846, -40227, -36085, -48105, -34900, -47864, -64038, 4359, 74741, 33018, -43065, -25526, 20067, 64650, 43952, -21672, -95830, -94347, -72271, -57631, -54424, -16831, 130295, 241984, 223276, 160552, 107152, 114291, 133306, 72523, -32603, -84476, -90463, -29306, -20229, 26515, 24261, -8473, 29739, 4927, -15888, -59236, -20290, -13792, 25193, 97356, 109978, 62261, -54718, -65186, -144109]
22624a44109J9658N8206N1966K4993K6186K7798L9410n1853l8025k2432J8626
22613A0424L3270J4624q5422k8701J13565J5028l7943K0071l5887l4336M5500
22602C0193J09761M770k9289j11664q4014K8483J06120J8876m9001m1282j3968
22591c1015J9630l5356K9405N7554m765L1651N875j5166L4690k3417r4043k4163
22579d9120N8881O2275j342M6376L5438j2353p2634K845n5253j6731L423k7928
22567b6123q0681n7329K6042n313N4387R843K4043n844K9713N7711L6142n1746
22555A0845m9245m1241M4538R0547Q1604k7869j49673l9911Q1955Q7682j5068
22544G4164o9924l4544n6002J7115N7747O6135q0594q8635N0881R5044K8178k8852
$$ y = [-144109, -124451, -66245, -14279, 10714, 36900, 64698, 104108, 52255, 14230, -8202, 10424, 43694, 58318, -27104, -55805, 57760, 72788, 34845, 54916, 19029, -15307, 30193, 139954, 144724, 115435, 3771, -80243, -51760, 54360, 73236, 24235, -17047, -31015, -11385, -46741, -17336, 40218, 35453, 67104, 72979, 57813, 92503, 69086, -24957, -49120, 9761, 72036, 70694, 117070, 152508, 140155, 67521, 70366, 15113, -1618, 1805, -26123, -106804, -164133, -138091, -143404, -89017, -79174, -55131, -60975, -31262, 26449, 62591, 10845, -38400, -79641, -35103, 55444, 137048, 109179, -40494, -80405, 1550, 89232, 74164, 4240, -30304, -86306, -69191, -11444, 54691, -25903, -114538, -63657, 31387, 59565, 30713]
22532C0713m544O891L40n957j6376l5520L0578k5685k4470O4367L2086M570L6498
22519I3491l3108j2516j7029L6999K3739L7792J7265m9224o8263l4044J570k2682
22507b6010p9071j6291Q8560L951L7217l4269k3658n9658k3430p247M1479K4845
22495g3582K3327m3256p078R4689M7990n5831l3739k5599L9680J10819r733j3875
22483E3812O0775n5361p6926L9769K968p2657L996n276k9021k4687L6785L2249
22471c3574k0773O5456r675n9170P2050L116j6311J5088J4330k7274l8433R51
22459c4219M2418O936k9580n6956J10045J34157J0284K5550Q022l7479n5040r9085
22447B5053l3305m1628K7432J1132j5951k5618K5266j7995M2611q2823o3506M6776
$$ y = [30713, 26169, 33060, 33400, 27443, 11067, -24453, 6125, -19560, -44030, 20337, 52423, 56993, 93491, 60383, 47867, 30838, 67837, 91576, 129368, 146633, 97409, 29146, -4898, -3328, -26010, -105081, -121372, -32812, -28861, 8356, -25913, -49571, -109229, -132659, -139906, -98427, -73582, -50255, -93511, -100589, -5900, 42090, -13741, -47480, -73079, -33399, 77420, 67687, 53812, 114587, 59226, -17700, 22069, 25037, -47620, -43624, -48900, -77921, -102608, -65823, -33574, -54347, 11109, 1434, -57736, 14314, 17430, 1119, 16207, 30537, 3263, -35170, -34219, 8199, 15135, -14445, -71401, 38644, 172801, 183085, 208635, 216657, 179178, 124138, 25053, -8252, -49880, -22448, -11316, -27267, -52885, -27619, -45614, -3003, -85826, -149332, -102556]
22435a02556M2960M228J9864K1792P6981q7189q7247q7017L999N4935J23828m265
22423a9687M1323L500q495k4273l6028L5205j71L6732J01007n0545l4276Q381
22411E2673L0633M5534M8310q082p8309p3607n6251M5865O55K4312K0154p6391
22399b4504j2610O2471P833l0360L653J44803j0710M8876l2000j02836p7822m8451
22387g1657M5879j4108k9557J53380N5502o7409K7495m5864J5913M7326L026k8955
22375I0971n1106M870K5677n6979o2731m9191n0577J1998L401J3087O3172Q2556
22363B5148M4562p0527J4644l025j0354l0562r01j3142R021n5852Q3051L5399
22351B7462Q1394j9424r3761j7760k0620k6235l1405l9311Q9386m9651L3456O3157
$$ y = [-102556, -59596, -55368, -35504, -13712, 63269, -23920, -111167, -198184, -194185, -139250, -15422, -19687, 21636, 25136, 16641, -7632, -43660, -8455, -8626, 28106, 129113, 78568, 44292, 52673, 83306, 128840, 177150, 169068, 90759, 17152, -39099, 6766, 7421, 31733, 51887, -24504, -37114, 25357, 33190, 2830, 6483, 151286, 140576, 189452, 157452, 54616, -23206, -71657, -25778, -39886, -69443, 83937, 139439, 72030, 99525, 53661, 69574, 116900, 119926, 90971, 39865, 44735, 70412, 13433, -49298, -98489, -149066, -137068, -133667, -120580, -57408, 25148, 69710, -817, 13827, 10802, 448, -30114, -31015, -44157, -35136, -90988, -7937, 27462, 108856, 89432, -4329, -22089, -42709, -68944, -100349, -139660, -50274, -99925, -66469, -3312]
22339c312o4453P9677K2391k6547m0160M8797l2025L1723R3549M8608l5539q6407
22327C6302J0030P1503k8466l454n0519n3108o5961L4620J3682O609j8195M516
22315d2441M0405L1624J2118j14211l7087N1675N8491j6350J8945N932J0867m5427
22303b5459n4242Q397K6485Q5023m7549j6360J2092k2529M5793q903j3684l271
22291a4207o5494j5062Q8656N2098r4692m4884L3189Q1267J3981L90l1052O481
22279A0671n02J4737N5347o188r1900n4609L6730O7529l530n1464K5734M8460
22267E1015j8207n6847L6816J26853m0727n5466l0753n591J9564n0630K8780N8670
22255F3477J9866p3480k4737k6118K5233M8056J2158k2659j7918m0458m2000n0274
$$ y = [-3312, -67765, 11912, 34303, 7756, -32404, 16393, -15632, 16091, 109640, 158248, 122709, 36302, 46332, 117835, 89369, 85915, 35396, -17712, -83673, -49053, -35371, -28762, -46957, -42441, -2036, 29588, 41706, -72505, -109592, -57917, 574, -15776, 3169, 9101, 19968, -25459, -79701, -71304, -44819, 40204, -7345, -23705, -11613, -34142, 11651, 2748, -10936, -14207, -79701, -94763, -6107, 45991, -48701, -93585, -60396, 20871, 34852, 35242, 4190, 10671, 10169, 24906, 80253, 74065, -17835, -72444, -35714, 31815, 28285, -23179, 2555, 51015, 32808, -24039, 12777, 139630, 98903, 43437, 12684, 7093, 26657, -23973, 4807, 63477, 83343, 9863, -14874, -40992, -15759, 32297, 44455, 21796, 3878, -36580, -78580, -128854]
22243a28854P0787L107O2169n6533k2449Q4681K342o3326n7553j5472K9377O6617
22231b5107Q9196Q2279o1003m0152N268o732l2263m9991k7267L328L2524k0344
22219e0264N9381p6229L7085J36738J3586p4117n4251p4970N2821L4068J272k9642
22207b4522L1002N5611r5167p689l588K106q377j8122M701M0491M8768l8426k6236
22194c9448P6992J2270m212K329M5375r8438l6376M9449p2432J8092J7380Q3286
22182E4267N5993j1094l7069m5121k9840J9833O2908J8603l4805j1257M5576p9481
22170H513J9372K2256p5012n0123o4715L7790J3252r0964L1622j1181m622J24289
22158c9523O2094n5294O0415M5386Q660P616q9524j20708l7577p351k0211M4822
$$ y = [-128854, -58067, -54960, 7209, -49324, -71773, 12908, 15250, -48076, -105629, -121101, -91724, -25107, 64089, 146368, 85365, 45213, 50481, 43749, 11486, -38505, -65772, -62444, -29920, -50264, 9117, -67112, -30027, 106711, 120297, 46180, -8071, -83041, -30220, 3848, 5120, -24522, 6480, 62091, -33076, -40765, -44353, -42247, -50624, -68746, -64045, -23554, 25214, -13212, -39448, 37544, 49814, 45602, 47931, 93306, -5132, -41508, 7941, -64491, -46399, -29019, 54267, 110260, 99166, 62097, 16976, -12864, 6969, 69877, 88480, 53675, 42418, 87994, 8513, 27885, 50141, -24871, -74994, -139709, -101919, -88667, -179631, -148009, -159190, -163812, -39523, 22571, -32723, 27692, 73078, 81738, 89354, -170, -120878, -158455, -165806, -186017, -141195]
22146a41195P8040O3273r4540m9925J6954N4241L1619O3875R4470m2066m7214
22135B7532m6246l3023N2759q387M4707k7708O4160L0224J892l5108J500j3599
22123E8703l8324l6989K9127M7103J7339m683K7825j40m3714l5283m5486o1973
22111h6495O9902m213N286P7437q895K3644M376p5797P921P6772r4868m447L6903
22098B7526O6995l568l1682K7240M8460P363p3340n3490L5668j540q8660J4698
22086b4330l8604J33161j4763o8107N0061j8792q9514q705K815k8295j8014N9944
22074f3143k011L7390Q625O166j5366l3325J934k3433m3326Q8766M6386j3104
22062d441R992O6677o8787J231k1846J6366Q835k5614k1855M7311O5358o045n7885
$$ y = [-141195, -63155, 118, -94422, -144347, -127393, -73152, -41533, 22342, 116812, 74746, 27532, -18714, -51737, 1022, -7365, 37342, 9634, 73794, 104018, 105910, 70802, 72302, 58703, 20379, -16610, 12517, 59620, 76959, 72276, 100101, 99961, 56247, 20964, -24522, -86495, -16593, -20806, -15520, 61917, 53022, 76666, 81042, 5245, 13166, 89938, -4930, -9377, 27526, 94521, 90953, 59271, 86511, 134971, 142334, 68994, 15504, 51172, 49632, -39028, -24330, -62934, 70227, 55464, -12643, 37418, 18626, -70888, -79593, -76778, -105073, -123087, -63143, -65154, -27764, -19139, -12973, -28339, -61664, -59730, -83163, -126489, -37723, 8663, -4441, 5551, 72228, 3441, 4672, -17174, -808, 8027, -17587, -39442, 7869, 73227, 67182, 9297]
22049I297k4474K8317J3882j682p4696K1894R5493R515l0699n34n6097J0217M0051
22036D0484j8535P92K6941M3722l4819M3J0748K6168M2508m7900p0166N1392j1713
22023E9665j825K0320l6308M204q158k9102j6856J0492K954j8862l2557l7430
22011h3463R1373L61p6989J5186N4718M554p682j0437N0804M8339K2422n3244
21999E5942m9025k5494K2275L4322J2939l6690j8293L0386n8826j17470P1068
21988g8866k8640r822K7659j7954j10626j6955Q5080R3162N9250K6334p0116n9955
21976a01449L5900O3506M7197K8510j3325p5504q1358N8714P4748K197R4419Q0427
21964B13982o1974j25144m1674q185l771K679k6704O3478N6240l7619n6811N927
$$ y = [9297, -15177, 13140, 27022, 25340, -49356, -27462, 68031, 77546, 46847, 46313, -9784, 433, 40484, 21949, 22741, 49682, 93404, 58585, 58628, 69376, 95544, 138052, 90152, 19986, 71378, 59665, 57840, 78160, 41852, 46056, 37898, 8796, -8060, 2432, 5386, -13476, -46033, -83463, 7910, 8271, -68718, -53532, 1186, 5740, -1942, -12379, 38425, 86764, 109186, 55942, 6917, -18577, 3698, 38020, 50959, 14269, -4024, 26362, -32464, -149934, -78866, -107506, -117328, -89669, -107623, -218249, -235204, -150124, -56962, 2288, 28622, -41494, -101449, -65549, -2043, 45154, 73664, 60339, -15165, -96523, -37809, 36939, 39136, 133555, 213982, 152008, 26864, -14810, -22995, -26766, -24087, -50791, 12687, 68927, 31308, -25503, -19576]
21952a9576k3044Q616O2139q133j04304k1538k9260n5503J4610R0737L2332k2328
21940g5252N0445L9542M5543l3135n558N5205J5343K0291m4802m0979L2599L225
21928F2467N9630k0432j41354J6515O9307j2189p6716K5860M2075M1964J4270
21917H1397m1427J6106k8285r1381p2030K5597J21264P3482k9113j00156m6301
21906i0847J7450J26399L4141k7599L2692P4748k041j24476K0769j6859K480n0415
21894c558p327M5324l2296p1329j766K5548K3722n2853r0203K8704K8095n835
21882a13774l2343L317R04K5595o6691J2705O420N7870J1727J1422N5632O4460
21870C7244j05418J0861P6666k6225j6017O796n5358p2326J8301L2548R7226p671
$$ y = [-19576, -42620, -34004, 28135, 20002, -84302, -105840, -135100, -190603, -175993, -85256, -52924, -75252, -24807, 14735, 60278, 27143, 21585, 76790, 92133, 112424, 67622, 26643, 59242, 62467, 122097, 101665, -39689, -23174, 46133, 33944, -42772, -16912, 25163, 67127, 81397, 39970, 56076, 27791, -63590, -135620, -110023, 11241, 84723, 55610, -44546, -90847, -73397, 53002, 87143, 59544, 92236, 166984, 164943, 40467, 61236, 44377, 46857, -3558, -10885, 34439, 2143, -69186, -70952, -45404, -21682, -74535, -164738, -136034, -107939, -113774, -146117, -142800, -141896, -116301, -182992, -170287, -163867, -105997, -94270, -82848, -27216, 37244, -68174, -57313, 19353, -6872, -22889, -16093, -71451, -143777, -125476, -92928, 4298, -3373]
21858c373j6987K2291J9101q6107K8593Q0929J0350k2574Q4231L8461j29072l486
21846B2357J6815P585j5761m2527L0446m9801r5503n5818L0049K4970m4397M8900
21834a22685N2403m4116q021K6563J5520O2007K4517k6663p2809l3743O0849J71252
21822A05074l2205n5017o8869q529m5639r726O8507J09325l5466l585l0936p9591
21810h6657L9553M6576k1186l3621O9787P2034k6642j2485P2611o433p3865J1444
21798E1116p0560k0899p1817m021M6678K4489k0225M4032Q0572j3862n5731j609
21786a1837J0540j2459J748r906o6049M7771J7529L9116K2704m309n058k7532
21774B258l746k1964r236m0896M6059j94q644k0576l4386j2673k3409L0500N2905
$$ y = [-3373, -20360, 1931, 21032, -65075, -36482, 44447, 54797, 32223, 116454, 154915, 25843, 22357, 39172, 46757, 30996, -11531, 18915, -30886, -126389, -182207, -152158, -127188, -171585, -122685, -70282, -114398, -122419, -95856, -80336, -18329, 6188, -20475, -93284, -127027, -66178, 105074, 72869, 17852, -51017, -59546, -105185, -114911, -46404, 62921, 27455, 23870, -7066, -86657, -47104, -528, -21714, -55335, 14452, 86486, 59844, 47359, 119970, 113537, 39672, 51116, -19444, -40343, -112160, -116181, -69503, -45014, -65239, -21207, 59365, 45503, -10228, -11837, -1297, -13756, -12008, -21914, -87963, -40192, -22663, 16453, 39157, 34848, 29790, 2258, -1488, -23452, -32688, -73584, -27525, -27719, -36363, -56939, -91325, -103998, -127407, -96907, -44002]
21761d4002L9546j57517k7042J07191K539J1014L4413n6314l1934P7245L2139
21750a2722K4191N6286N7121N6710j11075q0521l4965K8415R3800k0999n9330
21739c089p966k9359o605M8048m7159j7632m3887q967J25476N7828o7438o6568
21727f7318R50M2762O7764o4746j1934J087n035l0851K2869K5833K4971j6479
21715a0127q937M2832k4752k8837Q884n1366l6517J8172J02263M7381R945j16758
21703d7817l9372J7173p6780k5827J17061L2648M471P1237J2308m3004n8749L1256
21691e395J1684q7115K0109M1138o4247L2983O2108m2944p9044O5950O0778K825
21679A8830j0225n1318M86l4975l9641O6956P5222n0466q9603P1789M7678l9989
$$ y = [-44002, -4456, -161973, -189015, -81824, -79285, -68271, -33858, -90172, -122106, -44861, -12722, 11469, 67755, 124876, 181586, 70511, -10010, -44975, -16560, 77240, 56241, -3089, -11055, -40414, -47019, 1029, -46130, -63762, -107649, -116616, 8860, 66688, -750, -67318, -66368, -23606, 44158, -20588, -32522, -31435, -36470, -67321, -44452, -18619, 6352, -10127, -19064, 23768, -984, -29821, -20937, -72303, -108820, -90648, 11615, 58996, 68941, -47817, -87189, -70016, -146796, -172623, -55562, -22914, -18443, 52794, 65102, 22098, -36651, -5395, 6289, -80826, -60717, -19579, -83826, -50843, 11265, -31679, -110723, -44773, 16005, 18830, 8605, -42713, -42227, -77202, -116843, -49887, 25335, -25131, -114734, -42945, 4733, -35256]
21667c5256r5941r782M8649M1569J5084N3993N3929l2529m2603K8421j9145J4503
21655B0892p454n5946n1434j0239N5926n1110O0252O9843l6857J386j2234l6753
21643e3728m7687r858o6444j7112K2350J01949J8889j3052P5883L5900j8267K8425
21631E7248R1853k9809k0656o9957l3628K3241n6455K657k079m3513M2227M1150
21619B279N7124p9408K4577j7381o7681o3987L0545p7985J723O5254J11166n6382
21607g0156m3083r20J6598J6848P691O1560L0218j18536j8274Q8671J25647J07015
21595B03279Q29k8002J1131m9545p4456K5498m0028n7866n1870M2238n678l2227
21583e6697M0963o2613r083m446O7829p936l5486P4547Q3941j9417n0168m4969
$$ y = [-35256, -131197, -140979, -92330, -50761, -35677, 18316, 72245, 39716, -2887, 25534, 6389, 20892, 13438, -42508, -93942, -104181, -48255, -99365, -39113, 30730, -6127, -4741, -16975, -53728, -101415, -111273, -177717, -194829, -172479, -70530, -51641, -64693, 11190, 47090, 28823, 57248, 149101, 119292, 98636, 28679, -4949, 18292, -38163, -35506, -37585, -81098, -38871, 2279, 59403, -20005, 4572, -12809, -80490, -144477, -113932, -191917, -190194, -124940, -13774, -70156, -113239, -114159, -97561, -80713, -73022, -11462, 18756, -99780, -118054, -29383, 96264, 203279, 204108, 176106, 187237, 137692, 63236, 88734, 48706, -9160, -61030, -18792, -24470, -56697, -15734, -78347, -87430, -91876, -24047, -31983, -67469, 7078, 91019, 71602, 21434, -23535]
21571b3535K6337q3599R259L6419K7097j2378O411j2403n4894J4831L8841l9763
21559f7377j6153J21504j1746K1647J9439k492Q5476K6243m2804j08879o3564
21548c8706q9372o261L334L5282J5213m6391J7716K4089j0781L8811J2339j0341
21536e5068r769M45O573L9293O370j1510m0355j9207k2960k0711m207J6211M2224
21523g2671N5954J26700l4913J9600L731P197M376j5478p8469j744R5120L700
21511A13103l6989j2860K2462j0627j5179o1042P7180k9880l388M596n233p883
21499C4260l5733J8728N5351Q938j03241o0047J1898R5054K799J10205L0211j07774
21487F0649k0944J0226l3571j7765J2719k8892k0555o77J9115j101R4777l6552
$$ y = [-23535, 2802, -80797, -71538, -35119, -8022, -20400, -13989, -26392, -81286, -66455, -27614, -67377, -83530, 37974, 26228, 47875, 67314, 64822, 150298, 176541, 133737, 24858, -38706, -128078, -134339, -131005, -95723, -80510, -126901, -109185, -85096, -95877, -57066, -44727, -55068, -64837, -64392, -57819, -18526, -12156, -23666, -64021, -83228, -106188, -126899, -131106, -114895, -72671, -16717, 109983, 75070, 94670, 98401, 105598, 109974, 94496, 16027, 14283, 109403, 113103, 76114, 63254, 85716, 75089, 59910, -1132, 76048, 46168, 42780, 47376, 42143, 34260, -1473, 17255, 72606, 81544, -21697, -81744, -69846, 25208, 28007, 138212, 168423, 60649, 39705, 49931, 16360, -1405, 11314, -17578, -38133, -38810, -19695, -20796, 73981, 37429]
21475C7429q3994l5513J1409p2983M6144J11139P3081L2180p5780L452p4554r9935
21463a27925Q693m95N7956J6699J9991l7422M46P6180O6093O6224j6017l4993
21451I5430p3760q6485r3018r1178K0436R2043J09375M5811k0160m115L5058L6562
21439F5999l1157j1434o5006j6862O0459j4869m7225o793O9927q6837j1859O1341
21427c4316J4855p6615J34058J57194r1205r2829p4025Q734L7890q2535L4534
21416f4260K3653k7138R0489L8855q967j5250k9477o5177k7463M2387J7261P8673
21404E3586k2350j4573P6852J727j10954q4686O1165Q1366q796p3243m238J01871
21392E7727R43j276k7684K4859k5075m2432o1445O9560N5305n2094m316N2415
$$ y = [37429, -46565, -82078, -70669, -143652, -97508, 13631, 86712, 118892, 43112, 46564, -27990, -127925, -119232, -119727, -61771, -45072, -25081, -62503, -62057, 14123, 80216, 146440, 130423, 95430, 21670, -64815, -157833, -249011, -228575, -136532, -27157, 18654, -1506, -5621, 29437, 65999, 34842, 23408, -41598, -58460, 1999, -12870, -60095, -66888, 3039, -83798, -95657, -34316, -19461, -96076, 37982, 195176, 103971, 11142, -62883, -54149, -16259, -98794, -64260, -40607, -67745, 22744, 61599, 52632, 37382, 7905, -57272, -84735, -42348, -25087, 53586, 31236, 16663, 93515, 95242, -15712, -100398, -39233, 42133, 33337, -39906, -44144, 57727, 58670, 57394, 29710, 54569, 29494, -12938, -74383, -4823, 50482, -1612, -5928, 46487]
21380D6487N6403n4510j82657j0684R19j15962J2401L7728K9828L2805Q1940L4990
21368c0312N939J366O0808Q4126J3592r5496p2381k6675k4953L1103k252l1649
21356h6784n0035L6397P4288l970J8131L3352j5117l9790J1651J15207M5147o9674
21344F8803r2642j23920o1324J2626J26663R6526O8257K5418p1873j7487L1824
21333F2871m4555n0244M5485O9607J8009p4198n9147L858N8461N748p3555m5443
21321h3103j5490N8213K0384j216L9330L521K4998L667l4991l3572n6175Q738
21309f5696M4080m5693l852O0599J6554K3325l8160J7107P3933j3053o1966p6358
21297f9180M5515n0981K1331K2761K1487J4907O4878q9514j4431J4186P8826l0706
$$ y = [46487, 102890, 48380, -134277, -144961, -144042, -260004, -247603, -209875, -180047, -147242, -65302, -30312, -24373, -23007, 37801, 121927, 135519, 40023, -32358, -59033, -83986, -52883, -55135, -86784, -136819, -100422, -26134, -30104, -11973, 21379, 6262, -33528, -21877, 93330, 138477, 68803, -23839, -147759, -209083, -196457, -69794, 26732, 94989, 120407, 48534, 31047, 62871, 18316, -31928, 13557, 83164, 101173, 26975, -32172, -28314, 30147, 35895, -37660, -83103, -98593, -40380, -19996, -21212, 18118, 21639, 46637, 50304, 15313, -18259, -74434, -65696, -21616, -67309, -71161, -10562, 5992, 29317, -8843, 8264, 82197, 69144, 7178, -69180, -23665, -74646, -53315, -30554, -9067, 5840, 70718, -18796, -33227, -19041, 59785, 29079]
21285B9079m7469R9398M0104l0803k6427p7066q8830r9003K2057K6065O5024p60
21273h8631L1396L0583L8020m0723j5686j5366r095L3541J1513n1573L5086N8665
21261A7730q779K5952l5191r1551J1902P642n2262J3441O5718R9674j3779N008
21249D5505k3855J7130L6152r689m555l3383k7364n4918j2685N2433Q1802L9485
21237A06058j63271o8844M6297R0206q42P0046o5255o2695o6473Q727N3175N1682
21225a189q2462j09Q1962n8759Q6416P8684l7890q81J5980k6200m5237J2639J2607
21212C5561R541k4368j37320m2998O6210P6184M9252L8818K2136K4318o6442j7864
21200C3028L2556o0843p2558Q867l204j4240o1091Q7168R9994M9297j12910j26217
$$ y = [29079, -18390, 81008, 121112, 90309, 63882, -13184, -102014, -201017, -178960, -152895, -87871, -88631, -57235, -26652, 11368, -29355, -45041, -60407, -69502, -35961, -24448, -76021, -40935, 17730, 8951, 34903, -288, -91839, -79937, -72295, -124557, -111116, -45398, 54276, 40497, 45505, 21650, 38780, 74932, 65243, 60688, 27305, -59, -54977, -67662, -15229, 66573, 106058, -57213, -126057, -79760, 10446, 9604, 79650, 14395, -48300, -114773, -106046, -52871, -1189, -83651, -83760, -1798, -60557, 25859, 104543, 66653, 65772, 81752, 55552, 10315, 22954, 35561, 45102, 20734, -116586, -159584, -93374, -17190, 32062, 70880, 93016, 117334, 50892, 33028, 65584, 4741, -67817, -58950, -62154, -76394, -137485, -50317, 49677, 98974, -13936, -140153]
21188a40153N326J32042j5814M892L5326N3265Q7281l9994k5512L9780k1356o5363
21176D9720K9738k8680l5197J6700Q61n3165o8620l586j6029j6724M5085K1026
21164e8871N503L0193O0353k4269p9008k9398O5922O4293l3728k6822L8990O7664
21152H0822o1007o7791R947O3215M5128K4881k1688n7180o7574r944l8774J0354
21140h9611J31250J5822m5959p8530M7017N1430M9736j5900o8730r3193K8563
21129f8105L796R222k2322J45875J08556j6574o196l4652p5080q4178L841M9291
21117A3474J8314J9009O0867l9575m4633l9807o3310M628K0390k7853k6765R996
21105i5265j6389J28885N8062o9452K9259N7383k0040J1210N5666o4811M277k1019
$$ y = [-140153, -134827, -2785, -18599, -13707, 21619, 74884, 162165, 122171, 96659, 136439, 115083, 49720, 79458, 50778, 15581, 32281, 33142, -20023, -88643, -92229, -108258, -124982, -79897, -58871, -53368, -23175, 37178, 12909, -66099, -95497, -29575, 34718, 990, -25832, 13158, 80822, 19815, -47976, -38029, 25186, 70314, 95195, 73507, 16327, -51247, -61191, -99965, -89611, 41639, 57461, 11502, -67028, -20011, 31419, 81155, 65255, -3475, -96668, -68105, -64309, -55087, -77409, 68466, 177022, 160448, 154252, 119600, 44520, -39658, -35817, 13474, 31788, 50797, 111664, 72089, 27456, -12351, -75661, -71033, -50643, -78496, -105261, -95265, -111654, 17231, 75293, 5841, 35100, 92483, 72443, 83653, 139319, 74508, 78785, 57766]
21093E7766j4870L6645M3755K796k2179p0817j00827j3212M5860K0798N108L1045
21081B1868J9714m956p0015N5167j752n4937M4226O7210M0531J8717p7972o7797
21069i996n3614m950J8185P7674Q764n3853K761K125K9749k2893k2817l0851K4779
21056c4937K0055N252o5330j1917P0453k1094j5614J6179R6356N5967l0562l9412
21044D5396J7895l1370J2880K4406r1847k7162r558m2635P4933L5351r8728p3011
21032a63450j6930M2666M9230M0295M8252R5121K7016M117k2060q9159l8927k2239
21020d6068o8210j0692L8527K9367L48Q4039M3719J5269m51L0927m4472j00147
21008b7844k5291N2191k8333L331P0432m9522n526l9947K3063J6622J6059k773
$$ y = [57766, 42896, 79541, 123296, 126092, 103913, 33096, -67731, -80943, -35083, -14285, -9177, 21868, 41582, 36626, -33389, 21778, 20026, -34911, 9315, 76525, 117056, 135773, 57801, -9996, -63610, -68560, -50375, 27299, 36063, -17790, -15029, -12904, 16845, -6048, -28865, -59716, -34937, -14882, -9630, -74960, -86877, -16424, -37518, -53132, -36953, 59403, 115370, 84808, 45396, 63291, 31921, 44801, 69207, -22640, -49802, -59360, -101995, -27062, 8289, -90439, -163450, -180380, -137714, -88484, -48189, 63, 95184, 122200, 126317, 104257, 15098, -23829, -46068, -114278, -124970, -86443, -57076, -56728, 27311, 71030, 86299, 85848, 116775, 72303, -27844, -53135, -944, -29277, -25946, 44486, -5036, -10562, -50509, -27446, -10824, 5235, 2462]
20996B462j04176p4256P5420J02089J3777M3339M0129m6775j14015k8323l0083
20985a20412K9367l9862j2715J06550J2760M122K9788N8897J5936l3850q9850
20974c9269q7395M513J25315O4727N0802j622o64p53j2436K780j08588q0521P094
20961g6017J4421K0452l4321J08757J6875j00587L8220N3027j8536p087k9180
20950a3976O0745R2811m5106j03764k3057N6740L0602M911N4465L9812p5452j21209
20938d2478j32429j0455R8929K0091K9709K9143J7506n9069j1531j5539M1917
20927c4206m3800K4091o2859L3094N6352p093M2583k302M1157p1864m2188Q3997
20915A6962k2567m0044m4443k3727P7945J17290J8796j0106k5296n5651p2169
$$ y = [2462, -101714, -175970, -100550, 1539, 15316, 58655, 98784, 52009, -62006, -90329, -120412, -91045, -130907, -143622, -37072, -24312, -20190, 9598, 68495, 84431, 50581, -39269, -126664, -122151, 3164, 67891, 118693, 117071, 116407, 115654, 103218, 105998, -2590, -83111, -76017, -61596, -41144, -75465, 33292, 50167, -50420, -12200, 40827, 22291, 15204, -13976, 46769, 139580, 94474, -9290, -32347, 24393, 54995, 59906, 114371, 154183, 78731, -42478, -174907, -185362, -86433, -66342, -36633, -7490, 10016, -49053, -60584, -76123, -34206, -78006, -53915, -116774, -83680, -27328, -34421, 8162, 5860, 47017, -24847, -67035, 16962, -5605, -45649, -90092, -113819, -35874, 81416, 100212, 90106, 64810, 9159, -63010]
20904f3010L3967N0554p0993M0132n2820l5331J8272N0278O1791J5178m8393k5384
20892b5759J2022R0636Q3505K4070n3204j55212j8032J11725M6521j3424j5513
20881H7335j0122m7503o4765j1528n806O891n3019m7840Q2201J22558o970j0121
20869D1311J2504l6134l6957r165m6243J5687K4715k1475L2187l0833m7399j01209
20857b03011O0775P4274K4205j7459m2861M3289j3369M3082O6333J9975j6455
20846C8778m488Q115J6491K505k5071p5675j2636M8032n683q3847N591k0209O9833
20833c8264M7264o0807k441N8976N9142M1701O0981R36j33776m3114M157m4775
20821e0020q264P6412n6665n4298M0719R1669K5753j593M4531o438O6318o6419
$$ y = [-63010, -29043, 21511, -49482, -9350, -62170, -97501, -79229, -28951, 32840, 48018, -375, -25759, -13737, 76899, 160404, 184474, 131270, -23942, -41974, 69751, 116272, 102848, 87335, 77213, 29710, -35055, -46583, -52389, -45498, -98517, -146357, -64156, 58402, 51432, 41311, 53815, 17681, -19276, -28441, -74684, -58997, -34282, -55757, -23570, -54403, -101802, -203011, -142236, -67962, -43757, -61216, -104077, -60788, -74157, -31075, 35258, 55233, 38778, 34290, 42405, 58896, 61401, 36330, -39345, -51981, -3949, -9632, -93479, -87888, -108097, -38264, 9000, -51807, -54248, 4728, 63870, 105571, 166552, 167488, 33712, -9402, -5245, -50020, -58284, 18128, -38537, -92835, -52116, 39553, 65306, 63713, 108244, 101806, 168124, 101705]
20809A01705m4644m2575j1834n5365r6697J7402L5669J1528m3182k3857N6175
20798i5675J070k4057O4838L2150l7595j7582p9014m2998J3089L3492n167P8415
20786g9034L6519l3312M9725M7346q5486k3034O8759n586J6648n2112m6349N7725
20774d8191J7409l8361J8794K4530l2440j043N4120K6767J9043K8624J58l0148
20762C9262Q454p2736p5801m9698P3933M9236L8200N9373k3806P4944Q960j01058
20750B9263j30245O2249K8899l1713j05860l5173O2111J30676R5568l1370j2691
20739F1714l3724m6915m0472M5970N544l5212o7035j1919m2370k4699P1844j3377
20727a30651j169Q4684N7490k1284m9102k4858P106K8647N2520L8435L444j2218
$$ y = [101705, 57061, 14486, 2652, -52713, -149410, -132008, -96339, -84811, -127993, -151850, -95675, -94605, -118662, -53824, -21674, -59269, -76851, -155865, -198863, -185774, -152282, -157449, -79034, -42515, -75827, -26102, 21244, -64242, -87276, -18517, -24103, -7455, -59567, -105916, -48191, -30782, -69143, -50349, -25819, -58259, -59302, -5182, 21585, 40628, 69252, 69410, 39262, 47716, -25020, -100821, -150519, -76586, -27350, 10850, 70223, 46417, 121361, 130321, 29263, -100982, -38733, -9834, -41547, -147407, -182580, -120469, 10207, 105775, 74405, 61714, 27990, -18925, -59397, -13427, -7883, -43095, -110130, -122049, -164419, -189118, -117274, -130651, -131820, -47136, 10354, -10930, -60032, -84890, -77784, -49137, 3383, 41818, 45262, 33044]
20715C3044N36j7382o572P89j12344n1282K6521M756j9353K8636R6578n3911j27093
20702a97077O8548N2063L9172J8595R9597j7319n2359p1310o4784k9630O5370
20691h9134P0481J8075m5609r6617n9643O1792p599Q2919M6463Q0538k7803l1078
20679B785L7493l029m8259K2969m3024j13321k6423M1446J24789R3401j11971
20668b3144j02355n7407J23907N5557P950N854m3512k840l1818l3800o6070J7261
20656a50417J59312Q7281j3153k5204O5851k7836j25241Q793K1489J8697k6223
20645f651m8368N703M8196K1427j56543p984P8950p5725j9709P1306N0187L413
20633c5798o9526q657M5097R8255N3388l6451p8979j05758N869K6439R1510J6449
$$ y = [33044, 33580, 16198, 9626, 10415, -101929, -153211, -126690, -121934, -141287, -112651, -16073, -69984, -197077, -128529, -76466, -37294, -18699, 80898, 63579, 11220, -60090, -124874, -154504, -89134, -18653, -578, -46187, -142804, -202447, -140655, -148254, -65335, -18872, 61666, 33863, 2785, 40278, 37249, -11010, 11959, -31065, -144386, -170809, -129363, -4574, 88827, -23144, -125499, -182906, -58999, -3442, 4508, 10362, -33150, -35990, -67808, -101608, -167678, -150417, 8895, 96176, 83023, 57819, 123670, 95834, -29407, -20614, 875, 19572, -6651, -55019, -49316, -1120, 20307, -136236, -144220, -65270, -140995, -160704, -89398, -39211, -35798, -105324, -113981, -68884, 29371, 82759, 46308, -32671, -138429, -132560, -106121, -14611, 1838]
20621A838k561N8314N5984n528l6433m3677L7364J5797k5058q850M4957N955l0456
20608F7646N6584J7317o7477o3319L2781M589o227K6477j4152N2071R335l8065
20596G7560m1474j1857p0403L4557P9357O5024j7272j20706j9486r6j575J2960
20584a3411m4664m3949L432J2025j7799N1673M0988n0110o5297P222K9574R298
20572h1018m633M4818L8159k319k4558j1926K182L4365J27241O8685N328o3840
20560A32484o6278K6409o2559k911K1482j34061m8353O8904Q5483L7948m257l3
20548E4258M2569j6413p6512p7536J2483K8531q736J1354M7655L4956L4580j3993
20536G3196o9820j8724J1010q500J04088J9920j23987p4329N813K1351L3655O59
$$ y = [1838, -723, 57591, 113575, 108047, 71614, 27937, 65301, 81098, 56040, 47190, 92147, 98102, 67646, 124230, 141547, 74070, 10751, 43532, 48121, 41894, 68371, 54219, 106290, 115625, 77560, 36086, 24229, -46174, -11617, 67740, 132764, 115492, -5214, -24700, -24796, -26371, -13411, -58075, -102024, -98592, -86567, -104366, -52693, -11705, -61815, -127112, -119890, -90316, -81018, -85651, -40833, -2674, -4993, -29551, -41477, -39295, -4930, 122311, 190996, 196324, 132484, 66206, 92615, 30056, 27145, 48627, -85434, -133787, -64883, 20600, 58548, 54291, 54258, 96827, 80414, 3902, -73634, -61151, -32620, -41356, -30002, 17653, 52609, 87189, 73196, 3376, -15348, -4338, -12838, 91250, 111170, -12817, -87146, -81333, -59982, -26327, -25668]
20524b5668K6135J3308n6845R4554K2973p3222m7695K0980K0052R2524J9316n1973
20512E4439n4009n032J03696o8777q6888k0420P4057m5819J2839k5266q4720p84
20500a46684O8980M4352M6199m9185q2392Q5181L8945N4208j8541L5048o5568
20489A0543l3611L433J0214K1042J5560p3041J2881m9938j5654Q0859M8431r5468
20477f4749k5252J7662o1602Q2676m194M7597K3942l3361K9591m9314N603N7566
20465B6165M760l3543K7961N9181j4938l6051j41112o5373l6365L5375p110J6576
20453a64474J34661O4307M8988o0274k9042L3720L7973l9080m6835j11376q244
20442a39676k094j592L2178O9642O2631Q2340m8001j15919R46m7024K9260J38368
$$ y = [-25668, 467, 13775, -43070, 51484, 74457, 1235, -46460, -25480, -5428, 87096, 106412, 54439, 430, -4602, 99094, 30317, -56571, -76991, -2934, -48753, -35914, -61180, -145900, -146684, -77704, -33352, 12847, -36338, -118730, -33549, 5396, 59604, 41063, 76111, 10543, -23068, -19635, -9421, 11621, 27181, -45860, -32979, -82917, -98571, -17712, 30719, -64749, -90001, -72339, -133941, -51265, -55459, -7862, 16080, -17281, 12310, -37004, -31401, 26165, 30925, -2618, 25343, 84524, 69586, 33535, -107577, -172950, -209315, -173940, -181050, -164474, -29813, 34494, 83482, 23208, -5834, 27886, 65859, 26779, -20056, -131432, -139676, -141770, -143362, -111184, -41542, 21089, 103429, 55428, -60491, -59545, -106569, -77309, 61059]
20430F1059j2723j49413k6038N4697L1244O7515l3227M933N2354k294K2061j5122
20418E5046l0406l2808M8249N019j02400N7051J6669j0530l6087j40482R0840
20407g9839P8813n194O9597J12818j7468j32118k4097r3163n65O0634l8739L2868
20395c6453Q6317Q9476L1085K4590o3978p9778m4097o4241l3217O5222R2182m5454
20383B1654p5024M6564L2006m1597p1623j1439Q6241R1761M1043j0058l2974M1418
20371A17972m352j02405j8309j367P4632r776l9272o0953m761m942M746j3369
20359f2156O8387o1819o315j8766j586Q372M9206L0680k3709J9341K4552j1082
20347A5105L72O8003k3456L4735o6332q3299j9959k1471P935n258K826J2384N3546
$$ y = [61059, 48336, -101077, -127115, -72418, -41174, 26341, -6886, -1953, 50401, 48107, 70168, 55046, 24640, -8168, 40081, 45100, -57300, -249, 16420, 5890, -30197, -170679, -79839, -1026, -6220, 63377, 176195, 158727, 26609, 2512, -90651, -91216, -30582, -69321, -36453, 49864, 139340, 170425, 195015, 131037, 51259, 7162, -57079, -90296, -25074, 67108, 21654, -53370, -6806, 25200, -16397, -88020, -99459, -13218, 78543, 119586, 109528, 76554, 117972, 113620, 11215, -7094, -8461, 66171, 56395, 17123, -43830, -48591, -53533, -48787, -62156, 6231, -55588, -61903, -80669, -82255, -73883, -24677, 6003, -17706, 1635, 26187, 15105, 15477, 83480, 60024, 94759, 28427, -54872, -74831, -96302, -88367, -93625, -90799, -78415, -24869]
20334b4869L7912M6309k6662j110n471j8903l344r104j9565l3337k5956J10573
20322B6473J6254n2602J0854j0909j7175m3283P0771N3537n801j16337L5849R5258
20310F2889j9815r7374r9097L9732M9824M0356O4729J6693o0454r2963K9133J07637
20298D1290p005j24050M1870N2322O8289J0233k1300O4506k1454m1559R05L2607
20286I6654j9386n5556j38716m896P5672J31454K9576r3138m8118M9238J9733
20275D2517k9310k7598k6541K4410M4740O4792L9495P4135n4903m9161K9094M4307
20263A75977J0676j11002o3497j9569M6664o058p8102P5782J6601o9201k2826
20252d4555Q0535M3620L491o1652L5540L366j01965o2447Q4494j13545l7733M5905
$$ y = [-24869, 13043, 59352, 32690, 31580, 26109, 7206, 3862, -5242, -24807, -58144, -84100, 26473, 42727, -9875, 979, -9930, -27105, -70388, 383, 53920, 48119, -68218, -32369, 62889, 43074, -54300, -153397, -113665, -63841, -23485, 41244, 57937, -2517, -95480, -66347, 41290, 34285, -89765, -47895, 4427, 72716, 82949, 61649, 126155, 104701, 63142, 64047, 96654, 77268, 21712, -117004, -121900, -46228, 85226, 114802, 21664, -26454, 22784, 42517, 13207, -14391, -40932, -16522, 28218, 93010, 132505, 206640, 151737, 102576, 131670, 175977, 186653, 75651, 12154, -7415, 39249, 33191, -44911, 30871, 47472, -21729, -44555, 35980, 79600, 83091, 21439, 56979, 60345, -41620, -104067, -19573, -133118, -170851, -124946]
20240a24946M7683K632P9553J8663l8560l2604Q672L660M2605n8700p2449J9817
20228a03974N7433J06349J5608q1983J872k9188k6721M8147j9937j51740m0814
20217b24948R0896O3361O3103O7049J8315L9306j8473n4886j1824m0270r3472
20206a01843o2902L2718J19414K0034j9489O6393L9419K9230K0073j7288q0162
20195D5597n482n0939O0492J0889N9697K0283j277O79q332p0433n3502l9904j6430
20182d8662m8453M3784o219j6681j1532L9013N5357k7624K7969l7567o1839J8024
20170g4430K652J4791l2727R1820O2692m8246k5243N553p3994Q1132M7738J393
20158E3131l5049o3652R607j4249r1727n6086N8840M8925N1543J5077r676L7403
$$ y = [-124946, -77263, -74631, 4922, 23585, -14975, -47579, -38907, -35247, 7358, -51342, -123791, -103974, -46541, 59808, 75416, -6567, -4695, -33883, -60604, -12457, -32394, -184134, -224948, -134052, -70691, -7588, 59461, 77776, 117082, 98609, 43723, 31899, -8371, -101843, -164745, -132027, -12613, 7421, -12068, 54325, 93744, 122974, 143047, 125759, 45597, 40115, -10824, 49668, 60557, 120254, 140537, 139260, 139939, 131607, 61174, 7672, -32232, -48662, -97115, -53331, -59550, -76231, -87763, -48750, 6607, -21017, 6952, -30615, -92454, -74430, -71778, -56987, -89714, 2106, 64798, 16552, -8691, -3138, -77132, 4000, 51738, 53131, 18082, -45570, -35963, -50212, -141939, -198025, -139185, -90260, -38717, -23640, -33316, 4087]
20146D087M2130L6710n0397m5022M3959R3303J8871o9990p9070K4432L2752o3404
20134a1639m5067M1418M9224m0851m2749K7981K9859q367M9126m7956l3642k0182
20122e2845p8524p4063K6562Q2609J07900O5942M0578J4826J0270p78K1852N3707
20110B18036r4773n4826L7326J2344Q402l4764m2315m8164n7293K7902L7354l5767
20098b6538j4121m4600N5786J28013N3808o5958m1054m6066k2634R7601K9174
20087A03411m6957r89N7272k6672M6093N3638l4775J3139k1725o417O5910Q505
20075B10433L353o4911n2836N908L1456l571j11827r2093k252M9872P753o339
20063b5054M017j2048Q751j2762m9046p9749m2177N2699Q4400O7700M6072k201
$$ y = [4087, 46217, 82927, 32530, -12492, 31467, 124770, 143641, 73651, -5419, 19013, 51765, -11639, -56706, -15288, 33936, -6915, -49664, -21683, 8176, -191, 48935, 979, -32663, -52845, -131369, -205432, -178870, -96261, 11639, 77581, 118159, 132985, 143255, 142477, 164329, 218036, 123263, 68437, 105763, 118107, 126509, 91745, 49430, 1266, -56027, -28125, 9229, -26538, -40659, -85259, -29473, 98540, 152348, 86390, 45336, -730, -23364, 74237, 103411, 56454, 55465, 112737, 86065, 132158, 185796, 151021, 164160, 142435, 136018, 201928, 210433, 213786, 148875, 96039, 101947, 133403, 129832, 18005, -74088, -76340, -26468, -18715, -25054, -21037, -33085, -24334, -37096, -86142, -165891, -208068, -155369, -70969, -3269, 42803, 40602]
20051D0602P0247n3841o0828L0130R6159P0459p1742o2346j5560p038p2717m3624
20039h0099M8644K0751J1267M5770j7267O6545j14764q6715k1055J4897K8150
20028h3876J4495q4310l885N7647J07839k1432k3487n1733O731P6321Q1875l0804
20016D5381r8200p0504N4678O0749L1306O2170K2399j1332k550m1470k5551O8541
20004I5617R592n1909r336r085j7137j06021l0022L8796M6919N544N4023J1638
19992C8619j0504N7485J6381J2847r2384p5328Q18J5448N2795O5314m2835L054
19980D1710j3934P9483l0579p2870J303K5233L1545j1661o8570J1065K7996J5127
19968C5848J5975P4289N2602r4276q1701j7735M6934m5378o4487J08875Q8986
$$ y = [40602, 110849, 57008, -3820, 26310, 122469, 192928, 121186, 58840, 43280, 36242, -36475, -80099, -31455, -10704, 563, 46333, 29066, 95611, -19153, -105868, -126923, -112026, -83876, -69381, -153691, -157576, -99929, 7910, -13522, -37009, -88742, -82011, -5690, 76185, 45381, -52819, -123323, -68645, -7896, 23410, 85580, 107979, 96647, 94097, 52627, 27076, 95617, 105209, 53300, 43964, 34879, 17742, -88279, -118301, -79505, -32586, -27042, 26981, 38619, 28115, 85600, 101981, 114828, 22444, -52884, -52066, -36618, 16177, 81491, 38656, 41710, 27776, 107259, 76680, 3810, 5113, 30346, 61891, 50230, -18340, -7275, 20721, 35848, 51823, 126112, 178714, 84438, 2737, -14998, 31936, -13442, -77929, 30946, 119932]
19957A19932j5178J631o1624k7028l8367L9699N9776k1554k8354M8410K0341j01983
19945d299m1828K3530k6673L9477q542R900R759k2921J6398j0893P7487j11654
19933e0259p4690J94K851l6457M802j8969Q0200J41493J9268q8492L8773n4871
19921c6157N8975L8722o7664j9658L0036J9416N0018M5438K7852l2865p9916j3179
19909B1018K7103O0190p0458j8912J4811K7308J2098o5653J1444J4429O2771K0150
19897A16299k8775l845j7027k9978j6668o5838o6764N0999N9360k7728n3837O5840
19885a7962O543L7775Q0684R7278n6650p5121K923M1751N3311K308n1029m2334
19873G9477J3916j1726j5966J9842m3265m6061R2975K0252p2195n7389l5178l9324
$$ y = [119932, 104754, 106385, 44761, 17733, -20634, 19065, 78841, 57287, 28933, 77343, 97684, -4299, -46127, -22597, -49270, -9793, -18335, -8435, 1324, -21597, -5199, -16092, 61395, -50259, -124949, -124755, -121904, -158361, -153559, -172528, -92328, 49165, 68433, -20059, 18714, -36157, 22818, 61540, -6124, -25782, 4254, 23670, 73688, 119126, 146978, 114113, 34197, 21018, 48121, 108311, 37853, 18941, 33752, 61060, 73158, 7505, 18949, 33378, 96149, 116299, 87524, 83679, 66652, 36674, 20006, -45832, -112596, -61597, -2237, -29965, -83802, -17962, -11419, 26356, 107040, 204318, 147668, 72547, 75470, 117221, 170532, 172840, 121811, 79477, 93393, 81667, 65701, 85543, 42278, -3783, 89192, 109444, 37249, -20140, -55318, -94642]
19861i4642P711N254l8300k6737O5817P2908P4313M1429N4705m6464o4174L2061
19849H3881l6770m6280L8777N8120M544k5717L323m1687q8384K6300K4138J3720
19837A3965l0495k9461K603J07353P1422K0744j8631q8310l271r500k7976l484
19825D959k4187l5956m6086O008J3120L571q8467K4110L7673J2915P4702O9029
19813E1391k1742l4461J5895L0975n2871p2975O0331n591m0703L5227K470j8822
19801e0876R3688J0855l4084J0354j7462j5522k7686O7279L5001k273l8507p19
19789C0048J7533M3304k6988l3128M5080p8777K624J5836J4386n2085j3561M488
19777c1240O7781K3048n4476j4932L4270N4709q8762l8053o1851N6449L9094L520
$$ y = [-94642, -86931, -81677, -119977, -146714, -80897, -7989, 66324, 107753, 162458, 115994, 51820, 83881, 47111, 831, 39608, 97728, 102272, 76555, 79878, 38191, -50193, -23893, 245, 13965, -16530, -45991, -43388, 63965, 135387, 156131, 137500, 49190, 45919, 36419, 8443, 4959, -19228, -55184, -101270, -95262, -82142, -78571, -167038, -142928, -105255, -92340, -17638, 51391, 29649, -4812, 11083, 42058, -10813, -83788, -23457, -29048, -69751, -34524, -32054, -50876, 42812, 53667, 19583, 29937, 12475, -3047, -30733, 36546, 71547, 69274, 30767, 30048, 47581, 90885, 63897, 30769, 75849, -2928, -304, 15532, 29918, -22167, -35728, -31240, 36541, 59589, 5113, -9819, 24451, 79160, -9602, -47655, -109506, -53057, -13963, -10443]
19765a0443M6531j4154l2374k1286M7173k9962k2267P4734r2P1190N6337j01878
19753F3509n4245M0002Q132j32118n6104L2223J10046P4371k6971j01920l2848
19742g5923R155L8950K684L8374Q4492J0127q1255m8360K2509J23412J26296J4155
19730B64616j2037n6940r9169p8436k3105R785n8559k8145j7295M2117J06161
19719D8993K8411j34527k6198Q0850O1618J6005m1810n7018K3796P563M455J6666
19707B8804P3402l4351n4166o6367r9741L1098O6640l5849k3149J7666O9147M9484
19695B2618k1970L6614l4357m727j4395M8750L0717L8915m4765k4878K658K9133
19683F4313n8627m2601K2419N484k4077J2750O3145o532p867R9727p2802p4286
$$ y = [-10443, 36088, 21934, -10440, -31726, 15447, -14515, -36782, 37952, 37860, 109050, 165387, 63509, 9264, 49266, 57398, -74720, -130824, -98601, 11445, 85816, 58845, -43075, -75923, -66768, -27818, -25134, 13240, 97732, 107859, 26604, -21756, 753, 124165, 250461, 264616, 252579, 195639, 96470, 18034, -5071, 4714, -53845, -81990, -99285, -57168, 48993, 77404, -57123, -83321, -2471, 59147, 75152, 33342, -23676, 120, 7683, 12138, 28804, 102206, 67855, 13689, -52678, -152419, -121321, -54681, -90530, -113679, -96013, -26866, 22618, 648, 37262, 2905, -1822, -16217, 32533, 63250, 102165, 57400, 32522, 35180, 64313, 5686, -36915, -14496, -9012, -33089, -20339, 42806, 36274, 28407, 128134, 55332, -18954]
19671a8954J0211j169l8317J3008K855N942P1303k4576k393q1875k4839J8379
19659g0425k601N1233N3206m0889m7033K395P1697O2843l9988l7272p1187n4368
19647a22389p517Q0814M2971j33281o4657O3583L0524K8169l378L7034P1720m4542
19635b0949l0011m090m9763L2980Q5346N8404m2493N3191M43O823P902o6218k1898
19622I667M8712ql7776j8380M5979p5333o3655P2686J893l1390L1386K214K5565
19609A1560L153N113l8972k8188L1291N8385K3446O370l6608p1378k873J846L1410
19596e445o614k8052N628J6148q0429l2494J12926J33035O5597m5208p0170m08
19584F4514K8438R155k8649J7516L4195p132r7045p373L2157N2263O1529l5624
$$ y = [-18954, -8743, -9912, -48229, -35221, -32366, -26424, 44879, 20303, 17910, -63965, -88804, -70425, -73026, -21793, 31413, -9476, -56509, -54114, 17583, 80426, 40438, 3166, -68021, -122389, -129906, -49092, -6121, -139402, -204059, -140476, -109952, -81783, -85161, -48127, 23593, -20949, -50960, -55050, -104813, -71833, 13513, 71917, 29424, 82615, 83058, 89881, 97783, 31565, 9667, 58379, 58371, 20595, 2215, 48194, -27139, -90794, -18108, -16215, -47605, -16219, -14005, 11560, 14713, 19826, -19146, -47334, -16043, 42342, 65788, 72158, 35550, -35828, -38701, -36855, -5445, -12059, -40111, -34483, -18335, -98764, -131258, -18332, 114703, 180300, 135092, 64922, 64514, 92952, 102107, 73458, 90974, 125169, 118037, 20992, 13619, 45776, 98039, 159568, 123944]
19572A23944n1239J8074m7766o3278l6599J51482L9210j63658n6450M8718j3318
19561e0880m9921j6246J1099Q7803J4137l0228O5355L1497L6008M337L0604p701
19549A25864j8926n6158j17950j6622M0641R9966K2751j6607q1636J0098R0114
19538H1535K3780k7639J8332p4173n7979N4588j1917n7877P1477J4973M0400M1418
19526A16918P3664k5751J5986n4907p9651M1643k4344j998N3998J0677M468N2875
19514A83578l1613Q448J39810J94760J13213O5935J11578m7902j90581j23936
19504D23290j17161j24609L8683J08327K9040j02182j4457J09790J90202R7424
19494F38347L3719N3080N7453n4033j13648j95522m3721J31941J49668o3920k26910
$$ y = [123944, 72705, 90779, 43013, -20265, -56864, 94618, 133828, -29830, -86280, -37562, -50880, -100801, -117047, -105948, -18145, -4008, -34236, 31119, 62616, 98624, 102961, 133565, 125864, 106938, 50780, -67170, -83792, -43151, 56815, 79566, 62959, -18677, -8579, 81535, 105315, 77676, 96008, 21835, -36144, 18444, 6527, -51350, 20127, 35100, 75500, 116918, 190582, 164831, 180817, 125910, 46259, 87902, 63558, 61560, 115558, 126235, 130703, 183578, 151965, 160413, 300223, 494983, 608196, 674131, 785709, 737807, 547226, 423290, 306129, 181520, 220203, 328530, 357570, 255388, 240931, 350721, 540923, 638347, 672066, 725146, 782599, 728566, 614918, 419396, 375675, 507616, 657284, 593364, 366454]
19483C66454o0683q8960l4480J7009Q423n05J1654P5271l0313q5729n8007P4296
19471A94430k501O5000l4783n0453J6263J00094R8730r049L2912J318k6422j12050
19459B73489o4430K1197J1519l8178M1778J25904Q4741J80151K56185J3304p1910
19448H33750r8315r0500j43000j41806R86K42075K61297J074k15704j74051K9356
19437E05162J28117J34136K2544k55390k00731n5429m6893l6950k2939O8305J19828
19426C59760O9540p5015j01110o3753o9145r2627J6053L4828j49J1606j4508O321
19414H1801n1808p731M9668O8770k3317p5803K6808K0936l8392o8202M5065Q6587
19402A14382J3536n1776k5048l9976k9767p2939k0027P5144O6543J45110N0204
$$ y = [366454, 305771, 216811, 182331, 199340, 207763, 207258, 218912, 294183, 263870, 178141, 120134, 194430, 191929, 256929, 222146, 171693, 187956, 288050, 386780, 377731, 410643, 411961, 385539, 273489, 209059, 230256, 241775, 203597, 245375, 371279, 456020, 636171, 892356, 905660, 833750, 735435, 644935, 501935, 360129, 361115, 603190, 864487, 865561, 649857, 475806, 505162, 633279, 767415, 789959, 534569, 333838, 278409, 231516, 194566, 171627, 239932, 359760, 429300, 354285, 253175, 189422, 120277, 27650, 43703, 78531, 78382, 89988, 75480, 81801, 29993, 22262, 71930, 140700, 117383, 41580, 68388, 89324, 50932, -17270, 27795, 114382, 127918, 76142, 51094, 11118, -18649, -91588, -111615, -36471, 30072, 175182, 225386]
19391B25386k1098p5521m1231L4636M7030q8957j734n9065L7909J05989N8586
19380B21930L847M1293P389j10690o7988k1910l4576J14731K7726l0208q3478
19369F8066J71R3827k0271K8167l4439n9442m0188k2368K5716j586j1796Q4748
19357A10605J14510n3445l4883K7678j5001o4051l0799l183j16055O614O6321
19346H311J14534J01164l3563J15410l8493j27686j2833L7664m903P91K3815j23327
19334F0884q0390L8296J09830N1346j7707m6657O7739K8687J563j0661l2006N3024
19322B23948o9133p8877O2861J4434N3151K1177J245q4927O7962N8595J6888P3663
19310C60987p6695q0735n152j1214M7246j7982Q4713L527l788N6165N4869m9669
$$ y = [225386, 204288, 128767, 87536, 122172, 169202, 80245, 78511, 19446, 57355, 163344, 221930, 225777, 267070, 274459, 163769, 95781, 73871, 39295, 154026, 181752, 151544, 68066, 68237, 162064, 141793, 169960, 135521, 76079, 35891, 13523, 39239, 37653, 25857, 110605, 225115, 171670, 136787, 164465, 149464, 85413, 54614, 51431, -64624, -58010, 8311, 122845, 224009, 190446, 305856, 267363, 139677, 126844, 164508, 159605, 160396, 184211, 60884, -19506, 18790, 128620, 179966, 162259, 115602, 183341, 212028, 213591, 202930, 170924, 223948, 154815, 75938, 138799, 153233, 206384, 227561, 228806, 143879, 211841, 270436, 287324, 360987, 284292, 203557, 198405, 187191, 234437, 216455, 301168, 304695, 300907, 357072, 411941, 362272]
19298C62272l9883O822q0799R3475K44j67319q3416r1816J1877P3318M110Q50
19286H9735N94n4210M3167m969p1919m9460O3254M9909r678P049m8510J11707
19274A26669N7054j4764J15720O5109l9866q891Q576p892n8933p4825p9442l0113
19262E8402P8893L5821J1557J0251M1357P794p5196Q270R703j42959o8523Q4945
19250F0315P6140k1829O114J6873r672J3603L7107k1188m8414J8843o3892n4181
19238I819R2606P5919K6856P8189j1672q3960J8193J2387N3050p5487j57730P9130
19226A17300O5211j8153R6019N5598p0115l8810k0291k0676M5737k6353p4353
19215A11114R491N927n7673n4818q528L7578Q3449N0913q806k7429J8290n812
$$ y = [362272, 322389, 329211, 248412, 341887, 342131, 174812, 91396, -420, 11457, 84775, 88885, 89735, 90329, 36119, 79286, 74317, 2398, -47062, 16192, 66101, 56423, 63472, 14962, 126669, 183723, 168959, 284679, 349788, 309922, 301031, 309607, 301715, 242782, 167957, 88515, 58402, 137295, 173116, 184673, 194924, 236281, 244075, 168879, 177149, 186852, 43893, -24630, 60315, 136455, 114626, 120740, 137613, 127941, 141544, 178651, 157463, 109049, 127892, 64000, 9819, 102425, 178344, 205200, 283389, 271717, 187757, 205950, 218337, 271387, 195900, 38170, 117300, 182511, 164358, 260377, 315975, 245860, 207050, 186759, 166083, 211820, 185467, 111114, 120605, 126532, 68859, 14041, 5513, 43091, 126540, 177453, 168647, 141218, 159508, 153696]
19203A53696m2959M7838N1157o8808K72K9406q035M360J2856j839J7468p004L709
19190A92117J0285J3621p2753j7137R5430L2498L4699P2335L4558j5834k1729
19179C58090N4044K3955j11519j49156l4500O0775R5542r4921p1868J03104J22537
19168C56083J37632k0039p7514p7733k3928P970O478j01864k4565J16496L5833
19157C34849m6187m690j2784N5696M0069J0645o8162L5893m552p5046L4819M0849
19145C41399J783M3053n6850M4339Q0238M6255P0777k695j25566l6904m368J3413
19133D14874q1438o1785J1785N941L1292O7239J8915l9426j6080Q4671R4951q704
19121E22235M2267M5879k3249M406j26543k6111N6443m0432J3605J13411N8018
$$ y = [153696, 110737, 158575, 209732, 140924, 141196, 170602, 162567, 166927, 179783, 177944, 195412, 188408, 192117, 202402, 216023, 143270, 126133, 221563, 254061, 288760, 361095, 395653, 379819, 358090, 412134, 436089, 324570, 175414, 140914, 201689, 297231, 202310, 130442, 233546, 356083, 493715, 473676, 396162, 318429, 294501, 302471, 308949, 207085, 182520, 299016, 334849, 288662, 283972, 271188, 326884, 366953, 377598, 309436, 345329, 340777, 265731, 300550, 341399, 343182, 386235, 329385, 373724, 453962, 500217, 570994, 568299, 442733, 405829, 401461, 414874, 333436, 271651, 283436, 289377, 320669, 387908, 406823, 367397, 351317, 435988, 530939, 522235, 564502, 610381, 587132, 591538, 464995, 438884, 495327, 454895, 468500, 581911, 639929]
19110F39929R0243J3895Q1621J49827K91851L02532K92447o159k21827j55307
19100A479052j20610k62877j86494q6564K1048j5464P5450J06606J04939L6974
19090A152060l8272j28246j72078n8890k234L6724l0141l7030p991P3430k9029
19079G58303M2747O0677o0770k7564q6839k056j1742L1140L6827P057J0863N2218
19067H10861J37840R5436R430k3251M524J68989P9408K936j44041j62011l1425
19056I48696J67908O9278J06374K85676K47730K24398J80436J58802J70774j54354
19046B405718m69562m28410k16588q0379k4796K6391j5192r7933R293J49399Q1741
19035A339682M4290K0953j1052O803j750J3953q6883N4327J83163J10999K6241
$$ y = [639929, 730172, 744067, 825688, 975515, 1267366, 1569898, 1862345, 1856186, 1634359, 1479052, 1358442, 1095565, 909071, 822507, 843555, 828091, 903541, 1010147, 1115086, 1152060, 1113788, 985542, 813464, 754574, 752340, 789064, 758923, 721893, 713902, 787332, 758303, 801050, 861727, 800957, 773393, 686554, 684498, 672756, 703896, 740723, 747780, 758643, 810861, 948701, 1044137, 1053567, 1030316, 1034840, 1203829, 1283237, 1286173, 1142132, 980121, 948696, 1116604, 1185882, 1292256, 1577932, 1825662, 2050060, 2230496, 2389298, 2560072, 2405718, 1936156, 1507746, 1291158, 1210779, 1185983, 1212374, 1197182, 1099249, 1108542, 1257941, 1339682, 1383972, 1404925, 1393873, 1400676, 1398926, 1412879, 1325996, 1380323, 1563486, 1674485, 1700726]
19024A700726K2234M6912O0341P8267n7928K833P684K9275Q0104M993O0504J05134
19012B141079K17904K08938J49631R0373J16252L8415J06753K93365L35510k7345
19002C670875j51360j9929J37482J52515J18156O5198Q4141J66266L91921P18756
18992E334021R93375J290415J732456L073983N663706Q589958M247289m920721
18984B6004482o340422l775831j500473p6330P68298J482106K607221M387401
18976B3556452P295308J1938920K0133420L7220787O8084998Q5524377R528720
18969B63282982l8976842l8805154l3968005l9107978l2639771k0325947j0792487
18962D8666798m495357P67373P237569J6222966K1852839L426084k0657872k2435558
$$ y = [1700726, 1722960, 1769872, 1830213, 1908480, 1850552, 1853385, 1861069, 1890344, 1970448, 1975441, 2035945, 2141079, 2358983, 2567921, 2717552, 2807925, 2924177, 2962592, 3069345, 3362710, 3698220, 3670875, 3519515, 3499586, 3637068, 3789583, 3907739, 3972937, 4057078, 4223344, 4615265, 5334021, 6327396, 7617811, 9350267, 12424250, 18087956, 26677914, 30925203, 26004482, 19664060, 15888229, 14387756, 14311426, 15079724, 16561830, 19169051, 23556452, 30851760, 42790680, 62924100, 100144887, 168229885, 253754262, 263282982, 224306140, 185500986, 151532981, 112425003, 79785232, 59459285, 48666798, 44171441, 44938814, 52176383, 68399349, 90252188, 93678272, 73020400, 50584842]
18954E0584842j4887469q659105n271812l574544k381250j493792p97515o68794
18946A2850561o06294m67224q46485r12303m42937l04461o8017M67444Q23939
18937A0494223N73879O72760J129149J915460L119558N013217Q244314J4337014
18929D5499574K3969942K6003694l32731k0948488j8892649j0081083l061291
18922D2156968K505647Q369086J6857582L0672524M8646852N2150677N4551890
18915B55911226O1753500K5005423q0227907r6885582o3246811l3411391j7857806
18908E1040652j0831381p289023n038684l417464k294592r04580J193359M302961
18900B6761248Q868790R027323m611507j1660044r193293n121447k932779k073027
$$ y = [50584842, 35697373, 27038268, 21766456, 18191912, 15810662, 14316870, 13519355, 12850561, 12244267, 11777043, 10930558, 10018255, 9575318, 9270857, 9202840, 9670284, 10494223, 11068102, 11740862, 12870011, 14785471, 17905029, 22918246, 31162560, 45499574, 69469516, 95473210, 95140479, 74191991, 55299342, 45218259, 42156968, 44662615, 53031701, 69889283, 100561807, 149208659, 201359336, 255911226, 317664726, 342670149, 262442242, 165556660, 102309849, 68898458, 51040652, 40209271, 32920248, 27881564, 24464100, 22169508, 21264928, 22458287, 26761248, 35630038, 44657361, 40045854, 28385810, 19192517, 14071070, 11138291, 9065264]
18892I065264j505750r60778n14165l73669m16240l74569m43854k97543m4405
18883D134291l8236Q9832P4790n81915p15659o00066l79808k68011k20201n742
18873A489275n4587q1275n1908r6571n7157N2707M8809J2220m611m2487q3381
18862A131034r7310J8115M1341n6589q3912l6678l0063Q305N7006L086k1436N2701
18850I85600q0025r1198m1415K867p958J15168Q1345Q6776P0013N0821q4089j36524
18838I51381q8928q4319j57196q7672j1530J6157o3180J10447Q6868n8512r0911
18827E22605K3692J9990k1291l0438r6575j8041j7613P754K5928k5614k2622k834
18815C64941Q4077J6304M4764J05170K4861n0815m6079p2089q777K395N4290p0697
$$ y = [9065264, 7559514, 6598736, 6084571, 5710902, 5294662, 4920093, 4476239, 4178696, 4134291, 4096055, 4185887, 4260677, 3678762, 2963103, 2363037, 1983229, 1715218, 1495017, 1489275, 1434688, 1353413, 1301505, 1204934, 1147777, 1200484, 1249293, 1261513, 1256902, 1214415, 1131034, 1033724, 1051839, 1093180, 1036591, 952679, 916001, 885938, 894243, 951249, 954335, 932899, 985600, 905575, 814377, 772962, 775829, 767871, 883039, 964384, 1051160, 1121173, 1171994, 1087905, 951381, 862453, 778134, 620938, 533266, 521736, 537893, 474713, 585160, 672028, 613516, 522605, 546297, 566287, 544996, 514558, 417983, 399942, 382329, 390083, 416011, 390397, 367775, 364941, 449018, 465322, 510086, 615256, 640117, 589302, 543223, 471134, 462357, 464752, 519042, 448345]
18803D48345k9526K7502N0285o4786m0753l406R0294j935J8570L1379J2634o9722
18791D68881r8166p0157L8157J01530O3525L4450l9197r5779L6480M0312m7480
18780D32556o1226k2185n3047j5773L5154P7108M48P4603J13998J7765n5485J01074
18768F44990J54409K03610K93284j67764k87648k29513j69945J7457k8569j38636
18758B91675r6873p4927K4364Q2185J9078O673M4404J5098l0804M620l468l2145
18746B49880m4860K9019J9060N203m6496r7750p0969R0970R3801O1592J2780o2491
18734B39739q5446J651L3831K0066L195M1560O5304r330K3975j9684n2272j30303
18722A32286r097M6710J9157m7747M965J6379j6955l5917K5526j5335k0357Q6609
$$ y = [448345, 418819, 446321, 496606, 431820, 391067, 387661, 477955, 476020, 494590, 525969, 538603, 468881, 370715, 300558, 338715, 440245, 503770, 538220, 499023, 403244, 439724, 480036, 432556, 371330, 349145, 296098, 280325, 315479, 392587, 393035, 467638, 581636, 599401, 543916, 644990, 799399, 1003009, 1296293, 1128529, 840881, 611368, 441423, 458880, 430311, 291675, 194802, 119875, 144239, 226424, 245502, 252175, 296579, 311677, 280873, 285493, 282025, 249880, 205020, 234039, 253099, 258302, 211806, 114056, 43087, 134057, 227858, 289450, 302230, 239739, 154293, 155944, 189775, 209841, 213036, 254596, 319900, 310570, 334545, 314861, 262589, 132286, 123189, 169899, 189056, 141309, 146274, 162653, 145698, 109781, 135307, 119972, 99615, 186224]
18710A86224N0320k7841k0281l535n3098N6503N5016l744j9449m3725m9313J8867
18698A45944Q7426M6087l3258m6240j0276m622n807N1015P2219m8278j4507J4663
18686B54366O1599o492R377l6892l5297J8988P1235J12528j31695k3492j1310
18675B82915k664n7608J3035p376M6427J1893n7321j5402R5080K2666l7389M333
18663B98589j310p9043K4682K8643R7O3917o2918j75781j12592J16655J36144
18652B37083P1184j9739l8833l0793n3691k7781Q4913j7652p5165J5807P7082
18641B22415M0095L4005N2921L7057Q8610O61m7242p4804q8794P0852P5789L5817
18629D47382O5856J1714M4529R9618P7833M4053J9693q0725j04819o1617k9527
$$ y = [186224, 236544, 208703, 188422, 184887, 131789, 188292, 243308, 239564, 220115, 176390, 127077, 145944, 233370, 279457, 246199, 199959, 189683, 185061, 179254, 230269, 302488, 254210, 239703, 254366, 315965, 309473, 318850, 281958, 246661, 265649, 336884, 449412, 317717, 294225, 282915, 280251, 222643, 235678, 228302, 274729, 286622, 229301, 213899, 308979, 331645, 294256, 298589, 297279, 218236, 242918, 271561, 271658, 335575, 272657, 96876, -15716, 100939, 237083, 308267, 288528, 249695, 218902, 165211, 137430, 222343, 204691, 129526, 145333, 222415, 262510, 296515, 349436, 386493, 475103, 475764, 428522, 353718, 264924, 335776, 411565, 447382, 513238, 524952, 569481, 669099, 746932, 790985, 810678, 729953, 625134, 563517, 533990]
18618E33990J8136k039k1973k9698N4197l2176q7480o5891q20q546k3618M1763
18606C75845O228M5771J02423J81767l7450j12578j8279n5742R3036R9305L696
18595F84022Q1929J10145l349o6875O7732J39978J31423J38364m8942K3783R9750
18584A357960o4125j46674K2967J25959J01620k9822j5990o2482p4322n973M7327
18573A256445r0248l6365m8779l6089N5934N7480p1694Q386L3467m0355k8649
18562A059533k645K9555N0121L2072K6674K9897k8976J14341J55743K62208K73403
18551B001926J84957R6959J62488K2731q9441r9227k25993j01085K5723J0953
18541A989991M1132K89801N47465N28544K96062j54445j74951r4790p6076l8643
$$ y = [533990, 552126, 550087, 528114, 498416, 552613, 520437, 432957, 367066, 366246, 357700, 334082, 375845, 382073, 427844, 530267, 712034, 674584, 562006, 543727, 487985, 581021, 680326, 684022, 765951, 876096, 872747, 805872, 873604, 1013582, 1145005, 1283369, 1234427, 1258210, 1357960, 1293835, 1147161, 1170128, 1296087, 1397707, 1367885, 1351895, 1289413, 1215091, 1209118, 1256445, 1166197, 1129832, 1081053, 1044964, 1100898, 1158378, 1086684, 1095070, 1128537, 1088182, 1059533, 1056888, 1086443, 1136564, 1168636, 1195310, 1225207, 1196231, 1310572, 1466315, 1728523, 2001926, 2186883, 2283842, 2446330, 2469061, 2379620, 2280393, 2054400, 1953315, 1979038, 1989991, 2031123, 2320924, 2868389, 3396933, 3692995, 3538550, 3363599, 3268809, 3192733, 3154090]
18531C154090j97032k73432j55409Q9035J69577P7851O5291J74874J06797J24431
18521C336073N8975O2067M6688l9011p5172j58691J4614K29360L29824M1173j19211
18510C726689O1537N7422j16771k15072j63412j45662j57916q859L4643J04924
18500C177523J89983J59180R8032J78022K86811M61584O99552Q56959L33596J0276
18490F451518J14369L63346M65600M75742O85838J399599K495473M714196Q571302
18481B5736983J2600173N288301p627369q968577n204846j798784L87983J574327
18473B1988191K342472L635698O156679J0353860J7238087L1071153N8533729
18466A51319869J00417616Q5779140j8913154n5660412n0407917n2717178m9167080
$$ y = [3154090, 2957058, 2683626, 2528217, 2617252, 2786829, 2864680, 2929971, 3104845, 3211642, 3336073, 3395048, 3457115, 3503803, 3464792, 3389620, 3230929, 3245543, 3474903, 3804727, 3845900, 3726689, 3788226, 3845648, 3728877, 3513805, 3350393, 3204731, 3046815, 3037956, 3072599, 3177523, 3367506, 3526686, 3624718, 3802740, 4089551, 4551135, 5250687, 6107646, 6441242, 6451518, 6565887, 6929233, 7394833, 7870575, 8556413, 9956012, 12451485, 17165681, 25736983, 38337156, 43625457, 35998088, 27029511, 21824665, 20025881, 20413864, 21988191, 24330663, 27966361, 34123040, 44476900, 61714987, 92786140, 151319869, 251737485, 337516625, 318603471, 262943059, 212535142, 159817964, 110650884]
18459A10650884l2801352j8260667r020123l147990J973634Q901122J7797133
18452G6092641K2726886J133041k3825146k4745300j6182315r283808n400431
18445B0515568l335640k330566j414376p86369n24270l42680j63810J61099J4485
18436A1793441j61679m66829m12871M5494P18898J121188O07981M62134J254252
18427A4962009K746442M869584Q226159J3817369K2182505K2971160k101260j8925557
18419F8748411j6162874q125393k486961K555375R290787J9007934L3850726M0640232
18411A47318237L3728443L6538885M9244611q813904p7770710o9847171m0602644
18404F9795747k1289078j1850929p085660m608806l240894k117374j120465k42835
$$ y = [110650884, 77849532, 59588865, 50568742, 47420752, 49394386, 58295508, 76092641, 98819527, 99952568, 76127422, 51382122, 35199807, 25915999, 20515568, 17179928, 14849362, 13434986, 12648617, 12124347, 11781667, 11617857, 11778956, 11793441, 11631762, 11164933, 10752062, 10797556, 11516454, 12637642, 13245623, 13707757, 14962009, 17708451, 22578035, 30804194, 44621563, 66804068, 89775228, 87673968, 68748411, 52585537, 44460144, 41973183, 44528558, 53819345, 72827279, 106678005, 147318237, 181046680, 217585565, 266830176, 258016272, 180245562, 110398391, 69795747, 48506669, 36655740, 29570080, 24961274, 21720380, 19603006, 18482541, 18239706]
18396A8239706P02434K797616O014303N394486m149524q424158o583316l795767
18388A0195780j961190j116826o40874m16061m62478m13114j82447j18989n29777
18379D354024o80865n41984l39832j75332j95669k32406j39837j45095J5892J10022
18369B028918j18944j50876j01746j56252m3536P261n184N2153R263J34891J34580
18358A790528M2966j506M1569j27807j64440k3165n9437j6130Q829l3956K3418
18347A480869J8685R637M4624K3241L7832j08j07288o8622l4202q2850j38702
18336A183116k00763n2683j4179m030m7670l5995q4819m9607p2734o4466M7442
18325F03612M8110l1710J3212J2402j9090k1968q2313k4102L048o2572O364J62107
$$ y = [18239706, 18942140, 21739756, 27754059, 33148545, 28999021, 20574863, 13991547, 10195780, 8234590, 7117764, 6476890, 6060829, 5598351, 5185237, 5002790, 4883801, 4354024, 3673159, 3131175, 2791343, 2616011, 2420342, 2187936, 2048099, 1903004, 1918896, 2028918, 1909974, 1759098, 1657352, 1501100, 1457564, 1464825, 1459641, 1511794, 1521057, 1655948, 1790528, 1833494, 1831988, 1873557, 1745750, 1581310, 1558145, 1498708, 1482578, 1491407, 1457451, 1480869, 1499554, 1509191, 1553815, 1577056, 1614888, 1614780, 1507492, 1438870, 1404668, 1321818, 1183116, 982353, 929670, 915491, 911461, 863791, 827796, 742977, 693370, 620636, 556170, 603612, 651722, 620012, 633224, 645626, 626536, 604568, 522255, 498153, 501201, 438629, 444993, 607100]
18313F07100J76744J68909M6320N4268j25980r1016m2714j03044j55072j25441
18303D10074j2054P4758k363o5821l3988n126j6961R2264P7098J2977k5034q0382
18291D25442m3039O7048J4844l9114L2125l8545q6552J2173P7697m566l069p1960
18279C42484k1355p9352M9948K8928k3619l2743l418K1308J19984P8683Q956K8310
18267E18114J0326m2804r3077J1194k8122K57K077n695M0013l0653k5654p1015
18255B84961K9207K0151M926o6162l9835j8048R9529R4049J3378k6463p5410M5393
18243C65676m5209j29229J1539Q7914J2523o4085m819o9545N5185k6999j00541
18232I2410j2443K3832K3053n8334l9009M4612O9413P1381M7959k9590r6387k4537
$$ y = [607100, 783844, 952753, 999073, 1053341, 927361, 836345, 793631, 690587, 535515, 410074, 398020, 472778, 470415, 404594, 370606, 365480, 348519, 440783, 517881, 530858, 505824, 425442, 382403, 449451, 464295, 425181, 457306, 418761, 332209, 344382, 422079, 417513, 414444, 342484, 321129, 241777, 291725, 320653, 297034, 264291, 260873, 282181, 402165, 480848, 489804, 518114, 528440, 485636, 392559, 403753, 375631, 375888, 377965, 372270, 412283, 381630, 355976, 284961, 314168, 334319, 339245, 273083, 233248, 215200, 314729, 408778, 422156, 395693, 320283, 365676, 320467, 191238, 202777, 290691, 303214, 239129, 234310, 164765, 219950, 192951, 92410, 79967, 103799, 126852, 68518, 29509, 74121, 143534, 214915, 262874, 233284, 136897, 112360]
18220A12360k449M3415J8073K4782K7177p7360J2056Q4172r117m0471m3014O255
18208A55879M0362J03001N4520q2145o9519Q3423j897Q752n4730j1781j2104O7355
18196B81116M7687M7511j9347j7329l8177l1521k8437K1409P0739r45j05650K0043
18184B47099J02953K6958o8209N8918k5071n9025Q7925L2051j626L8087Q9925
18173E29985N8239o0211M7150J61257J21274n8805j13410m8576m1107m0505M1608
18162E96899R6601l7256r8505n5975j3135K8557M7224j300N154N2126L7930N714
18150F64034j3380j03960m2931k8129j143P1064P6557L0685J3287K458K5871j5406
18138F79007P1479L7388j0121j0890O4146P0900J91522K29087J66370N2701Q5163
$$ y = [112360, 109911, 153326, 171399, 196181, 223358, 145998, 158054, 242226, 233109, 192638, 149624, 155879, 196241, 299242, 353762, 271617, 202098, 285521, 283624, 292376, 237646, 225865, 213761, 281116, 328803, 376314, 356967, 339638, 301461, 269940, 241503, 262912, 333651, 332706, 227056, 247099, 350052, 377010, 308801, 367719, 342648, 283623, 371548, 403599, 401973, 440060, 529985, 588224, 528013, 575163, 736420, 857694, 798889, 685479, 636903, 595796, 555291, 596899, 693500, 656244, 557739, 501764, 488629, 517186, 564410, 563110, 568264, 620390, 658320, 664034, 650654, 546694, 503763, 475634, 474491, 545555, 622112, 652797, 666084, 668542, 694413, 679007, 750486, 787874, 777753, 766863, 831009, 901909, 1093431, 1322518, 1488888, 1541589, 1626752]
18127A626752J03927J16658K27390L75998L79841L94300L15129M05862O83031
18118D628888Q30024J054098J440752K259775L373693N345786R076994J6807545
18110D4817555L3154205O3097997O6042276l0672906o7409739m7192506k3980724
18103C7856158j2120424o754641m272226k895695k091442j512152j291200j090681
18095E827697q46278o83978n94101m97654k99426k82546k70065l58270k98698
18086A696681j92137k6131N3665m2313j53430j26771j86139k9675m1764o7464
18076H84522o5800J9697J6036j3504q2668j18696j3494O426k04276j34925p3721
18065B19597o0039R5533O5846q853o1168P6035R2338N2880k9565j4010k4053J7969
$$ y = [1626752, 1730679, 1847337, 2074727, 2450725, 2830566, 3224866, 3539995, 3945857, 4628888, 5458912, 6513010, 7953762, 10213537, 13587230, 18933016, 28010010, 44817555, 77971760, 141069757, 207112033, 176439127, 109029388, 61836882, 37856158, 25735734, 18981093, 14708867, 11813172, 9721730, 8209578, 6918378, 5827697, 4981419, 4297441, 3703340, 3205686, 2906260, 2623714, 2353649, 1995379, 1696681, 1504544, 1478413, 1532078, 1489765, 1336335, 1209564, 1023425, 993750, 951986, 884522, 818722, 838419, 854455, 840951, 758283, 639587, 626093, 632519, 428243, 293318, 219597, 159558, 255091, 320937, 312084, 250916, 326951, 419289, 472169, 442604, 428594, 404541, 422510]
18053D22510R0929j5476J798n9823l782l88j7780K6070K03176K3555p0707j12464
18041D87618o9365j33607O0103Q7141N8803l8244K8378o3927P4207J41712P8713
18030G11532m891l5695r8765m0484j2582r3478j4513l9568L2720p350J28655Q2465
18018F08046K6924L551j05272k4825P4537M868J249j04625n0995M4255M6365M7688
18006E71766m416O39R337k6915l7926J3592L2635j4967L3115P4115L4520M8294
17994G33789O1836O3092Q26m5505o2L1003J26042K2512p1030M358J26487J63112
17982A216460k7898n1741O7896K4808j6035M046N7910J12593J43826O3597N1690
17971A647152l5809L9405J90448K73125K16311J28303K48533M44231P77790R99734
$$ y = [422510, 513439, 497963, 499761, 439938, 436156, 435768, 417988, 444058, 647234, 670789, 600082, 487618, 418253, 284646, 344749, 431890, 490693, 452449, 480827, 416900, 491107, 632819, 711532, 706641, 670946, 572181, 531697, 519115, 425637, 411124, 371556, 404276, 396926, 525581, 608046, 634970, 638521, 533249, 508424, 582961, 587829, 589078, 484453, 433458, 477713, 524078, 571766, 567350, 567989, 577326, 550411, 512485, 526077, 558712, 543745, 576860, 650975, 685495, 733789, 795625, 858717, 859543, 814038, 813976, 844979, 971021, 993533, 922503, 926861, 1053348, 1216460, 1188562, 1136821, 1204717, 1229525, 1213490, 1217536, 1275446, 1388039, 1531865, 1595462, 1647152, 1611343, 1650748, 1841196, 2114321, 2330632, 2458935, 2707468, 3151699, 3929489, 4929223]
17961D929223P91212K66705L21498O51048J49594n46775n44653j93339K54744
17952F079257P44515J061519J206214J223179J214403J470982J907491K407404
17944A7314964L007454M140220O504028J1198703J9797170L6821856O5598691
17937A64383086P6556927o417001o4029732n1434332k2937840r932755j1243476
17930G4944877q079025o71221P982292K0552011M0195507N5293282L9720620K8968279
17922B58906622J1331900j1697915k6088444k7209656m7292647m5474645k8533646
17915H3941569j3548980l282689N454187J2554065J2053174J7549594M1985920
17908A56706840P3366783L4021593o0112847p4316481m8567289k6284079j4471625
$$ y = [4929223, 5720435, 5987140, 6308638, 6959686, 7109280, 6562505, 6017852, 5824513, 6079257, 6823772, 7885291, 9091505, 10314684, 11529087, 13000069, 14907560, 17314964, 20322418, 24462638, 30966666, 42165369, 61962539, 98784395, 164383086, 240940013, 234523012, 170493280, 119058948, 96121108, 86188353, 74944877, 66865852, 66194631, 74176923, 94728934, 134924441, 190217723, 229938343, 258906622, 270238522, 258540607, 232452163, 205242507, 157949860, 112475215, 83941569, 70392589, 67109900, 72564087, 85118152, 97171326, 114720920, 156706840, 230073623, 264095216, 203982369, 129665888, 81098599, 54814520, 40342895]
17901D0342895q538522n339178l479803k503423k503391k254349j525227j272207
17893A2926795j687544j776442j336446p54215k14859K33215O81453j13377j061305
17884F897275p47837l6594L59469k8195r35715j027389p62415l59509j9999k00745
17874C138346m65567l74863l30532l01493j33996j6734j07686q676N0262k8783
17864A420278j2094K0611J44499q9893k55117j39219K6103o7612j01102j11373
17854H35081q4749p3991j0432k2470m5308o829l9387o4146l3947l6614K2507P7577
17842E17292p5337k3264k8962M3128q113j67773m8627r961J1451O3227L9311l8807
17830B73565o3448m1761J8445l5677m2885N3167J05074k5051j00052n3453L2249
$$ y = [40342895, 31804373, 26465195, 22985392, 20481969, 17978578, 15724229, 14199002, 12926795, 11239251, 9462809, 8126363, 7372148, 7157289, 7390504, 8071957, 7958580, 6897275, 6149438, 6112844, 6472313, 6444118, 5508403, 4481014, 3718599, 3359090, 3339091, 3138346, 2672779, 2297916, 1967384, 1665891, 1531895, 1515161, 1407475, 1398799, 1449061, 1420278, 1408184, 1428795, 1573294, 1483401, 1228284, 1089065, 1115168, 1047556, 946454, 835081, 750332, 676341, 665909, 643439, 598131, 591302, 551915, 487769, 453822, 417208, 439715, 517292, 441955, 418691, 389729, 432857, 424744, 256971, 208344, 198383, 209834, 273061, 312372, 273565, 210117, 168356, 186801, 151124, 108239, 161406, 266480, 241429, 141377, 87924, 120173]
17819A20173R773M7918o794L9881r7816r3220m5333k8437J10977Q3494O0786L4454
17807B35856K2470N5962N6003j01082o4288j3529k3617m3339j00883o3712L5601
17796d558J02013J42360O9634l6120N9689J12821l59r2657p8105j7327r7715m7173
17784A12503K8843J56550N0764n2519K8756N7578N7595j16178p3687m3890n4421
17773A51894q6991m1861O6021N3922K2053n6635p310k1579R53J3624n4668p5454
17761c6031P4968L4000j8144J3227l3301o4349N7201j4997m0658O2090J2512k2610
17749B3908L7828J2067J0369O7963k3803n0830r4823n8002R8792m842o2100R692
17737c3781O2860L7896j17413o2403J0151n0598M6883O0590L5503J5113K0153
$$ y = [120173, 129946, 177864, 171070, 210951, 113135, 19915, -25418, -53855, 57122, 140616, 201402, 235856, 258326, 314288, 370291, 269209, 204921, 191392, 167775, 124436, 23553, -40159, -4558, 97455, 239815, 309449, 273329, 333018, 445839, 445480, 352823, 274718, 257391, 159676, 112503, 141346, 297896, 348660, 296141, 324897, 382475, 440070, 323892, 250205, 206315, 151894, 64903, 23042, 89063, 142985, 165038, 108403, 101093, 79514, 80467, 94091, 39423, -36031, 38937, 72937, 54793, 68020, 34719, -29630, 27571, 12574, -28084, 34006, 46518, 23908, 61736, 73803, 84172, 152135, 128332, 77502, -17321, -75323, 23469, 18627, -43473, -33781, 29079, 66975, -50438, -112841, -102690, -153288, -106405, -45815, -10312, 4801, 24954]
17726B4954K0342j9377j47954R849O0340Q5249j2974p9687l9560n3120n529M7254
17714a10213M3185N4643k7403M3042j6381n8618J2228k5943l6708n0410R151J00964
17702f2463J776p6154M4529O6352N6027j9306M283N3150P1326j3458j20210l5159
17690b9307R2018j6953q3605j1213K3535J06792K2996n832o6564m4496q5177N5057
17678d2749P9715Q7797p7165m4394j4914r7754P4833J7950q4144J7059O5659j6340
17666c4447O490l3140q8436k8459L6354k2341J58875P7045k7103J0643M2876N4317
17654A52674m6018p4937M072P701k7097m1624L1657j2984j16424j4141M513J9808
17642a12800L5475L6071m1036j01128l3749L9567m229J5868N1539R0115j2160
$$ y = [24954, 45296, 25919, -122035, -112186, -51846, 33403, 20429, -59258, -98818, -151938, -157467, -110213, -67028, -12385, -39788, 3254, -13127, -71745, -59517, -85460, -122168, -172578, -163427, -62463, -60687, -136841, -92312, -25960, 30067, 10761, 15044, 68194, 139520, 126062, 5852, -29307, 62711, 45758, -37847, -49060, -25525, 81267, 104263, 98431, 31867, -12629, -97806, -42749, 36966, 124763, 47598, 3204, -11710, -109464, -34631, -16681, -100825, -83766, -18107, -34447, -27957, -61097, -149533, -177992, -141638, -163979, -5104, 71941, 44838, 55481, 98357, 152674, 106656, 31719, 35791, 43492, 16395, -25229, 6428, -6556, -122980, -137121, -132608, -112800, -77325, -41254, -82290, -183418, -217167, -177600, -181829, -165961, -114422, -24307, -36467]
17631c6467j8409o1863l2761j9520R754K4635L1563J00214L4137L1259p1691n305
17619a4454j2814P0618J6892n7135q7056L0005N0119O4870K7556m2347j9869N0428
17607G6813J7336L8439P325M0206l0036p3459o5003P974l1549l0698l5762R2064
17595A3650O1305O1649j00713k8835m2212P0355j6482j46487R3353M5494j24532
17584a13455l9606N3890n732M1299j6501q175p243K5198O7018o783O2681K1455
17572G4046l0544j10640p1278K4556J7328l1378J0710L0086L2394m2572p7714
17561a75006J01796O2133n2028Q513K5500O9160m9474l413J9785k1585m4712m5898
17549a05229K5081j769r571j365L0159m3073j01120J9810J47753M4971p5778j09567
$$ y = [-36467, -54876, -116739, -149500, -169020, -159266, -134631, -103068, -2854, 31283, 62542, -9149, -14454, -27268, 43350, 60242, 3107, -83949, -53944, -3825, 61045, 88601, 46254, 26385, 76813, 94149, 132588, 139913, 180119, 150083, 76624, 11621, 19595, -11954, -42652, -78414, 13650, 74955, 136604, 35891, 7056, -35156, 35199, 18717, -127770, -34417, 11077, -113455, -153061, -99171, -104903, -63604, -80105, -88280, -95523, -70325, -3307, -10090, 52591, 74046, 43502, -67138, -138416, -113860, -96532, -127910, -117200, -87114, -54720, -97292, -175006, -73210, -11077, -63105, -54592, -29092, 40068, -9406, -12819, 6966, -14619, -59331, -105229, -80148, -81917, -91488, -92853, -62694, -105767, -206887, -187077, -39324, 5647, -70131, -179698]
17537a79698m7957L1773M1915p087N2013R8710K998p4939k0032q538j861O0025
17525e2678l6610p7383J5936l189m2178K2162O9476L0433m5022R7516j2572n1647
17513h5756j9098k4403p3613l315N169P3498m1j7564J03445l1335l7344Q4640
17501b5717p727j5046l2898p7558n8965l959J03611J51843M8961J6764j07359
17490h050k8345K8977O1452J7487j2520r6761p5445Q0390L9056K4847K1383p8361
17478b5890q5989L4571M2761J1239L8996L5621N3277j5968m8425o3342k1079K9874
17466a4354O2108n8526p7325o7547j4055Q0530Q1764o5622q49N4242P6139r524
17454D6981k909K9949j6735q484r7906k4854L762P99O8817K3980J72985L65723
$$ y = [-179698, -227655, -195882, -153967, -161054, -109041, -10331, -7333, -82272, -102304, -110842, -112703, -52678, -89288, -166671, -150735, -153924, -196102, -173940, -104464, -74031, -119053, -21537, -34109, -85756, -104854, -129257, -202870, -206185, -201016, -127518, -127559, -145123, -41678, -73013, -110357, -25717, -33444, -48490, -81388, -158946, -217911, -221870, -118259, 33584, 82545, 99309, -8050, -36395, -7418, 54034, 71521, 59001, -37760, -113205, -32815, 6241, 31088, 52471, -25890, -111879, -77308, -34547, -23308, 15688, 51309, 104586, 88618, 40193, -23149, -44228, -14354, 47754, -10772, -88097, -155644, -169699, -89169, -7405, -73027, -73876, -19634, 56505, 46981, 44072, 74021, 57286, 48802, -49104, -73958, -70196, -69397, -580, 23400, 196385, 562108]
17442E62108M47706m2221l70465l39486j46440n4566n4130q8024K9278L6026J4922
17431e292K1j5428q2735m7511M1695n099N0308K1969q3781n692L0921Q6006K2714
17418H096J500K4163J8461J9444j414O1539o9334r6632j5650k8317p60K3740K0569
17405c4595p2960K3645j0111l823K2796j1610M6122j4948n4798K8332N0037Q7923
17393E6010K3389o3613q4451p4188k1489O7775l2436k2279k60J759Q1102K6711
17381d1970J5700L6863l92p3720L8699M5381o0223j19270L80j8342O2126J6173
17369i8595N16r274J0108Q4901L9205l3532J6339k5768j7786J4198l1150o4684
17357a15522o1875j8118O3843Q1246j9082p227J870L0477j6464l8163L5577J697
$$ y = [562108, 1009814, 967593, 597128, 257642, 111202, 56636, 2506, -85518, -56240, -20214, -5292, -5271, -20699, -103434, -150945, -109250, -114349, -64041, -42072, -125853, -131545, -100624, -14618, 8096, 9596, 33759, 52220, 71664, 70250, 131789, 62455, -34177, -49827, -78144, -78904, -55164, -34595, -107555, -83910, -94021, -97844, -75048, -86658, -40536, -55484, -110282, -81950, -31913, 56010, 79399, 15786, -68665, -142853, -164342, -96567, -129003, -151282, -151542, -149783, -68681, -41970, -26270, 10593, 10201, -63519, -24820, 20561, -39662, -158932, -158552, -176894, -114768, -98595, -98079, -107353, -97245, -12344, 26861, -6671, 9668, -16100, -33886, -19688, -50838, -115522, -177397, -195515, -131672, -50426, -69508, -76735, -74865, -44388, -60852, -99015, -63438, -61741]
17345f1741j08912j2483J44865k5735l4147J8216J1821O83J10023L6870m3103
17334C6357j9364Q8340j855n649P3779J61390K02959N0053j32322j84851l6434
17323B32403L5392K0373o191k874J23867J89125J94321K77206J20352k0968k12048
17312I50958k51759P4297N2031j04675k14987r4420L421n1861M9585J07421K50387
17301G70398L46461L13151J39878k35790m09639l28953k02949o6981j9565q5095
17291B20916j9772M2592o6801l118J53381J29495J25204k4946j55627j84023o9887
17280A47414p8665m1886M1040K8453p7922j28353j09047L5112N2360N1161J09910
17269B9577J27957M0928N5j32898l0142P397k4685k3866Q309K2747q6152j09504
$$ y = [-61741, -170653, -183136, -38271, -64006, -98153, -79937, -68116, -67433, 42590, 79460, 36357, 16993, 105333, 103478, 97829, 171608, 332998, 535957, 586010, 453688, 268837, 232403, 267795, 288168, 281977, 279103, 402970, 592095, 786416, 1063622, 1183974, 1163006, 950958, 699199, 773496, 825527, 720852, 505865, 411445, 414866, 363005, 412590, 520011, 770398, 1116859, 1430010, 1569888, 1334098, 924459, 595506, 392557, 325576, 306011, 220916, 201144, 243736, 176935, 173817, 327198, 456693, 581897, 556951, 401324, 217301, 147414, 68749, 26863, 67903, 96356, 18434, -109919, -218966, -183854, -131494, -80333, 29577, 157534, 198462, 198517, 65619, 35477, 42874, 18189, -5677, 2632, 25379, -60773, -170277]
17257a70277L1715O9646M2078L8017L0359k2231m6657n9094q011P0506J4230r0682
17245a00401j16073K0754M7760L5286M2117J07013k7492j095M4592l7438k1637
17234f614j05499J0568J13886j0201j13309j1842R8066O9035o8006M6600Q7398
17223A10082K7537n5506m9352Q5588j8298m552q1173o964r5238K0857L6313j06117
17211a36823k0449O0484K7499o350j1394p068m9783M9792L5075o753N5791M7968
17199C7989L0503k5402J7888P761L0538o3574o8627O7786K1380L037K9141J56773
17187B45193J1674M5177J67813J10138l6233j40738j10844r9374K2940J1909j827
17176B25828k2521K1353R3739K16643J08830p1735j22245n093Q6775J64863J46196
$$ y = [-170277, -138562, -68916, -26838, 11179, 41538, 19307, -27350, -86444, -94455, -23949, -9719, -100401, -216474, -195720, -147960, -112674, -70557, 36456, 8964, 7869, 52461, 15023, -6614, -112113, -101545, 12341, 2140, -111169, -123011, -24945, 44090, -23916, 22684, 110082, 137619, 82113, 32761, 118349, 100051, 95499, 14326, 7362, -87876, -67019, -30706, -136823, -157272, -96788, -69289, -75639, -87033, -94101, -143884, -94092, -59017, -65770, -9979, 37989, 68492, 43090, 60978, 68739, 99277, 35703, -32924, 34862, 56242, 59279, 88420, 245193, 256867, 302044, 469857, 579995, 543762, 403024, 292180, 192806, 215746, 227655, 225828, 203307, 224660, 318399, 535042, 643872, 572137, 449892, 444799, 531574, 696437, 842633]
17165H42633J04324M0811K9031q7180l07885k21451n1252L6577O2601N1684J84641
17154F84534J13812o7329j10401J16674J69805J74916J05053j0508k92034l53152
17144E31370k31410j79682j7960J7821O1113m5692l9894J64580Q5346J44805J98285
17133F88682Q0893j37161k20693j46006q4598q4275q6556N4684P9283M3826m3590
17122A44489l7854P2660j3880o4868m9949J9650Q5659P5131o9346O02n2131j34070
17110b3907n9976m4758l5638M5179Q4565k705M6361q754N3662J07970k4548n5202
17098H2249J9020o2103l32K0920J1780o5934l2783N6860k4257n6031k0673J805
17086f9479R09k9877L4905J49135K4000k9042q213l5330J1972r872j4336k1264
$$ y = [842633, 946957, 987768, 1016799, 929619, 621734, 400283, 349031, 385608, 448209, 499893, 684534, 798346, 731017, 620616, 737290, 907095, 1082011, 1187064, 1176556, 884522, 531370, 299960, 120278, 102318, 120139, 181252, 135560, 95666, 260246, 345592, 490397, 688682, 769575, 632414, 411721, 265715, 181117, 96842, 10286, 64970, 144253, 188079, 144489, 106635, 179295, 165415, 100547, 50598, 70248, 155907, 231038, 161692, 162294, 110163, -23907, -83883, -128641, -164279, -119100, -34535, -37240, 9121, 367, 54029, 161999, 137451, 82249, 101269, 39166, 38834, 59754, 71534, 5600, -27183, 29677, 5420, -50611, -71284, -69479, -68570, -98447, -63542, 85593, 109593, 80551, 72338, 37008, 48980, 39108, 24772, 3508]
17074C508r8589Q8Q1698R4780J6380o6755o470j2398q2544p7122J4173P3173R7638
17061C7560J06970p8216j04345k5565L0771m2568l0606L5499L0302J957l9091
17050g7332L5073k3803j3582l2870M0453n5713o3910J18238N3704o740o3651K080
17038h8053N9294o902l7407M0422K4648J4340L0753J0583j19157J7482K7324q8101
17026a14774p0446M9594R4880Q6151Q4593o50m1574L1532K074l8057k2386m957
17014E5980m924q024n971j36911q1952N8571J9416k1872j11570J8850J33679R2945
17002H217k1404Q139K7781N044p6494O1813L7125p3903l2842j5136L018R4557
16990B5915J06077M3702k5334p7689l016k1133l7111j38396m5353n0223N7313
$$ y = [3508, -95081, -94993, -13295, 81485, 97865, 31110, 24640, 12242, -70302, -147424, -133251, -60078, 37560, 144530, 66314, -38031, -63596, -32825, -75393, -105999, -70500, -40198, -38241, -77332, -42259, -66062, -79644, -112514, -72061, -127774, -191684, -73446, -19742, -26482, -90133, -88053, -28759, -35661, -73068, -32646, -7998, 6342, 37095, 47678, -71479, -53997, -26673, -114774, -185220, -135626, -40746, 45405, 129998, 129348, 87774, 119306, 121380, 83323, 60937, 55980, 51056, 43032, 37061, -99850, -181802, -123231, -103815, -125687, -237257, -218407, -84728, 8217, -13187, -5048, 22733, 27777, -48717, 13096, 50221, -23682, -56524, -71660, -68642, 25915, 131992, 175694, 150360, 72671, 69655, 48522, 11411, -126985, -172338, -222561, -165248]
16979a65248R299Q5646J03941n2241p682O7019l7911J7937m427N9349K693j05706
16967b7331q3837N85J67457P4018p0343j7309j0004L4225m0827l0202k5802k9951
16955e9321O9335m0303l3926n2136j923j644M8554J5703L8164M4489M3516M7123
16943A17631j0246r8907j10209k5988J9737J7271j5837p28L8799O4679L2431L7385
16931F6018j8110l712J7191O8785L137m4770K2457K2468j51051p6333L4448j8338
16919g7810L9959P0877M5306j993M6287q4345j04941m0425J0051l239K6219m0993
16907a15047k708R0099P7640Q2753P1752m5887j29393o3619j1688k605M6705K9027
16895B7029q9185p2077N5899K1520Q653J21593L8498K1762p1392j04802L1091
$$ y = [-165248, -155949, -70303, 33638, -18603, -26285, 40734, 2823, 20760, 16333, 75682, 78375, -27331, -111168, -110583, 56874, 130892, 60549, 43240, 33236, 67461, 26634, -3568, -29370, -59321, 10014, -30289, -64215, -116351, -118274, -119918, -71364, -55661, -17497, 26992, 70508, 117631, 107385, 8478, -101731, -127719, -107982, -90711, -106548, -107276, -68477, -3798, 28633, 66018, 47908, 44196, 61387, 130172, 133309, 88539, 110996, 133464, -17587, -93920, -59472, -77810, -37851, 33026, 78332, 76339, 122626, 38281, -66660, -107085, -97034, -100273, -74054, -115047, -117755, -27656, 49984, 132737, 204489, 158602, 29209, -34410, -46098, -48703, -1998, 27029, -62156, -134233, -78334, -56814, -48161, 73432, 111930, 133692, 62300, -42502, -11411]
16884a1411J10801r388k1716m378j14209J7271J4523m3845N2174Q6880N1948m3745
16872H4905J05841P4368Q431n9005o4194K7530n6971k7486l0865K2034K4655M3346
16860A52589J2461p2125N6117P4172O0920m5025l0016k6544r3599r8465j2699
16849b2214Q5734K0397l0856R426j3965J4430o0230O5573Q7767n4684n14n8202
16837D2662O3214M3031J6998o5579j4680j2922J4291l6465p0414J9598O0651o2556
16825b171J7493J2937l2457N3815O5921m3955P22j6046q993N8678N1876m1176
16813A16644K4433O179N3551o7493q0781o368l6859M6690L4956K4344O3914o2888
16801A16322l010N7356M8465m3605k9689r2641j4093k1081J5947J9580M3822L6328
$$ y = [-11411, 99390, 90002, 68286, 63908, -50301, -33030, -18507, -62352, -10178, 76702, 128650, 84905, 190746, 265114, 273545, 214540, 150346, 177876, 120905, 93419, 62554, 84588, 109243, 152589, 165050, 92925, 149042, 223214, 284134, 239109, 209093, 182549, 88950, -9515, -22214, 63520, 83917, 53061, 62487, 48522, 62952, 2722, 68295, 156062, 101378, 100864, 42662, 105876, 148907, 165905, 100326, 85646, 72724, 87015, 50550, -19864, -266, 60385, -2171, 15322, 28259, -4198, 49617, 115538, 71583, 72305, 56259, 47266, 105944, 157820, 116644, 141077, 147256, 200807, 133314, 52533, 46165, 9306, 55996, 90952, 115296, 179210, 116322, 113312, 170668, 219133, 175528, 145839, 53198, 39105, 18024, 33971, 53551, 97373, 133701]
16789A33701j05845K1540L6282J11528R1872k6231j07071l1304K8955K3901M7779
16778B25107J3003m8655j19197j05467M6815M2345J9330p7186K4003K8516J2383
16767F0997M964k2305M9567M69K0337n6514l407L8540Q921k326m2792J9674P8117
16754A54242j129j18991j7712N6972J1651M1549J06014K1171Q0490M0899j27917
16743B47239j38362l7081L5856O9416n578J3432J36978O429o3625N7910N5943
16732C78557R345l3251p3355j17504j0394O0682R7525l3877l7250J2709m1370
16721B11817R9955J36409K0719n8992p0436J11310L5732J1140m016p7445J2642
16710D28835L8317n674R0635Q2502q982j29370n8251o1182O7627r549m86Q2589
$$ y = [133701, 27856, 49396, 85678, 197206, 289078, 262847, 155776, 124472, 153427, 177328, 225107, 238110, 189455, 70258, -35209, 11606, 53951, 73281, -3905, 20098, 48614, 60997, 65961, 43656, 93223, 93692, 114029, 57515, 54108, 92648, 101569, 99243, 56451, 76125, 154242, 153113, 34122, 16410, 73382, 85033, 126582, 232596, 253767, 334257, 375156, 247239, 108877, 71796, 107652, 177068, 171490, 184922, 321900, 328329, 264704, 322614, 378557, 387902, 354651, 281296, 163792, 153398, 214080, 311605, 277728, 240478, 253187, 211817, 311772, 448181, 468900, 409908, 339472, 450782, 486514, 497654, 493638, 416193, 428835, 467152, 461478, 552113, 634615, 625633, 496263, 438012, 376830, 444457, 434908, 434422, 517011]
16698E17011q285l6687m5618Q396l0512M135Q2322J24706l6361p6942m1545M9664
16686E10284J0470K5145J7607R1129O1537m1154J9381P3429M7712O4868K8950
16675I09358K341n3948O8793N5132J00909O1587O4353o6129l161J45895J10054
16664A395184k336L418J21940J52520J28201L40J53309J77695J44705K33180L97084
16653B905240N20640Q24338J022812O54146L63638L79462O09485L37626l71565
16644G245822m70404l35024J41811N83368Q03077J089485J304252J592567J963184
16635A3918138K057558K241937L137120M491314O946419J1661596K0316190L6797163
16627A01567435O3590572P4732430J872994n9659471n2729391k5974172j3048936
$$ y = [517011, 508726, 472039, 426421, 434817, 404305, 408440, 490762, 615468, 579107, 502165, 460620, 510284, 520754, 545899, 563506, 654635, 716172, 675018, 694399, 767828, 815540, 880408, 909358, 911699, 857751, 926544, 981676, 1082585, 1144172, 1208525, 1142396, 1139235, 1285130, 1395184, 1392848, 1396266, 1518206, 1670726, 1798927, 1799267, 1952576, 2130271, 2274976, 2508156, 2905240, 3425880, 4250218, 5273030, 5927176, 6290814, 6670276, 7279761, 7617387, 7245822, 6775418, 6440394, 6582205, 7165573, 7968650, 9058135, 10362387, 11954954, 13918138, 15975696, 18217633, 21354753, 25846067, 32792486, 44454082, 64770272, 101567435, 165158007, 239890437, 241763431, 182103960, 129374569, 103400397, 90351461]
16620I0351461j2835043q806670j179923Q159457K0825301L7819250M6870984
16613A81204817L5132055L0435332J8871649n84677k1374964l4423551m9725843
16606A59534818m4897007k8652856j4399005l929583M810282J0932562J0214124
16599I3613335J6277995L7864377O4358194L5142604m8299850o8054055m7341082
16592H3561518k6531256j4921594r013097n812853m122563l310780k363236j346772
16584A6139367j062021j725464j894507j360959q34520n20360l85584k25490R9935
16575H230397k23679r69758p33743k90634q2423p8909l99643o31754p87310o59454
16565C373090m50211k71677j32544j11034q8057r9281j31296p6591j53772j43215
$$ y = [90351461, 77516418, 68709748, 67529825, 75689282, 96514583, 134333833, 181204817, 216336872, 246772204, 265643853, 265059176, 243684212, 209260661, 159534818, 114637811, 85984955, 71585950, 67656367, 72466649, 83399211, 93613335, 109891330, 147755707, 212113901, 247256505, 198956655, 130902600, 83561518, 57030262, 42108668, 33095571, 27282718, 23160155, 19849375, 17486139, 16139367, 15077346, 13351882, 11457375, 10096416, 9261896, 8741536, 8355952, 8130462, 8230397, 8006718, 7036960, 6303217, 6012583, 5930160, 5851251, 5451608, 4819854, 4032544, 3373090, 2922879, 2651202, 2518658, 2407624, 2319567, 2220286, 2088990, 2012399, 1858627, 1715412]
16555A715412o5780k18783j27545j36771M3579J4654r9563Q113J12365P8403o1538
16544A262546j03124j11306p1593m8466l0515r9247j62160n2912n444o9477M3932
16533E52234j543q9028m3758K5180P968L3069K6507m9764n0661j8518j9288j6820
16521C55578K3369k8704o2734m5958k9689O205p3646M6861L8586m2674l4328N3930
16509B06796l9810M741P3128l4538l6811J1959m4272R671J3618L6117k4342K2132
16497A98389j3316M4397J7554j1132K4615O6592k420o7663j07775J7230P6472
16486B42943m021R0123m1131m8924j08169n0536J0155O6388K4418k9414l2737
16475A19095J121j1979J24119L1435k3939K5696q4584n2557N2221R287N6847L8733
$$ y = [1715412, 1649632, 1430849, 1303304, 1166533, 1210112, 1224766, 1125203, 1133316, 1245681, 1324084, 1262546, 1159422, 1048116, 976523, 928057, 897542, 798295, 636135, 583223, 577779, 508302, 552234, 550691, 461663, 417905, 443085, 451053, 484122, 510629, 460865, 410204, 391686, 372398, 355578, 378947, 350243, 287509, 241551, 211862, 218067, 144421, 191282, 229868, 187194, 152866, 206796, 166986, 171727, 244855, 210317, 173506, 185465, 141193, 150864, 164482, 200599, 176257, 198389, 185073, 229470, 247024, 235892, 260507, 327099, 324679, 257016, 149241, 166471, 242943, 238922, 329045, 287914, 238990, 130821, 80285, 90440, 156828, 181246, 151832, 119095, 120216, 108237, 232356, 263791, 239852, 265548, 180964, 128407, 180628, 189915, 246762, 285495]
16463B85495o3113o1653j8291M6951k4786k1139O0476N3130l9047q4523o5972
16452F7528k5889R8674N2815n4576j197j2476J7401L723p9767m4835L7123P7378
16440A35902K0586L6700J3226j1559r155o1250K398K8624n36k8361n5290j23230
16428e1945m5950Q7831j7720m6827L0785N0783P4156l1018l0853N920m3361J0075
16416h124q826k7332M9406M2727l5347m1405O6090J6875J5709L3657K8898j2224
16404A20104m5000m9977q3971M1923N8271L1406m2611P238L424m6098p6898L9622
16392d2567r728J4884N420K7867j6456O3698L8606n4838q4771j8138l6303q8496
16380b00822R7768P9743K0535O7222m4109J2959L6373n6698r8230j9882J6652
$$ y = [285495, 222382, 160729, 142438, 189389, 164603, 143464, 203940, 257070, 218023, 133500, 67528, 41639, 140313, 193128, 138552, 137355, 124879, 142280, 146003, 66236, 21401, 58524, 135902, 156488, 193188, 206414, 194855, 185700, 124450, 126848, 155472, 154936, 126575, 71285, -51945, -97895, -10064, -27784, -74611, -43826, 6957, 81113, 50095, 19242, 25162, -18199, -8124, -16950, -44282, 5124, 47851, 12504, -28901, 37189, 54064, 69773, 103430, 132328, 120104, 75104, 25127, -58844, -16921, 41350, 72756, 30145, 37383, 40807, -5291, -82189, -42567, -52295, -37411, -31991, -4124, -20580, 43118, 81724, 26886, -57885, -76023, -112326, -200822, -103054, -23311, -2776, 64446, 20337, 33296, 69669, 12971, -85259, -105141, -88489]
16369h8489L6968l8144n5586N1934n3992J167J14375R216j57365k8386J05659
16358a02643M038J0436m3028L249L1259J1146k196K1803L6325J2104j3758l516
16346c4781q0071n8930m4842j0583K6411r912j3707L099K2472L0004j590L8359
16334a34071m9230l8651K3068L4556m3966k9140J4035J22746l8765O267Q4332
16323d8819J3590j2881m4469q723M411L1793k5100R2205N9639j7116l3095n2246
16311d0811K0249J7719j14419j3796O6125l3723k4085P5411q0116J5817M9483
16300f2146R9962O0961k0119l9769k1303M4725Q0107n0368o1917K1742q662N1354
16288I4567P2599J7759j09605p2084J0085J8336o3666l9932p0297m5990k3953
$$ y = [-88489, -51521, -89665, -145251, -93317, -147309, -146142, -31767, -22551, -179916, -208302, -102643, -98605, -88169, -131197, -127948, -96689, -85543, -87739, -65936, -29611, -17507, -31265, -34781, -114852, -173782, -218624, -229207, -202796, -212708, -226415, -223316, -200844, -170840, -172430, -134071, -183301, -221952, -198884, -164328, -208294, -237434, -223399, -100653, -139418, -133151, -48819, -35229, -48110, -92579, -101302, -96891, -65098, -90198, 2007, 61646, 44530, 11435, -40811, -20562, -2843, -117262, -131058, -64933, -98656, -122741, -47330, -127446, -111629, -62146, 37816, 98777, 78658, 38889, 17586, 62311, 142418, 92050, 30133, 51875, 43213, 94567, 167166, 184925, 75320, 3236, 13321, 31657, -32009, -71941, -142238, -188228, -212181]
16277b12181O8203P6340L8536j16296L4327J6795L0227L1269J6317M6949L7706
16266F8192J7466l1794o7310n1080J6407Q1459l1655m3982p8202K614L300J01980
16254a2605k1206j49681L4654J53171J8472n9496l3584n373O6203P77l105j8936
16242c0709K1419K5695N9365j7540q0946P387L3955J1547J7505j2666n3954J1502
16230g440Q388j7935j7399M3758N8973l8891n5949j0248M0755q894l2085p0483
16218a07450K2822o6928n8066J05041O6004m628k3R3436k9674k9075j2550j4207
16206c5298j7156K3767j8732J7621M843l3991j1748L4119M8879L9921o9788n1040
16194f8603j7730R714O6342M9253k5694O6542o3973o2870N8226J9055m5940j2508
$$ y = [-212181, -143978, -67638, -29102, -145398, -111071, -94276, -64049, -32780, -16463, 30486, 68192, 85658, 53864, -13446, -64526, -48119, 33340, 1685, -42297, -120499, -117885, -114585, -12605, -33811, -183492, -148838, 4333, 22805, -36691, -70275, -75648, -9445, -8668, -11773, -30709, -9290, 16405, 75770, 58230, -22716, -15329, 18626, 30173, 47678, 35012, -18942, -7440, 948, -16987, -34386, 9372, 68345, 29454, -26495, -36743, 4012, -4882, -36967, -107450, -84628, -151556, -209622, -104581, -38577, -43205, -43228, 50208, 20534, -8541, -21091, -35298, -52454, -28687, -47419, -29798, -24955, -58946, -70694, -36575, 12304, 52225, -17563, -68603, -86333, -76619, -10277, 38976, 13282, 79824, 15851, -47019, 11207, 30262, -15678, -28186]
16182b8186p4370q1958n237k3006k7242q170N1196M8377l3555j7811k1158R3569
16170a27551O5143n5649j4021k5509k372k1584O0404N4830K756K237m4607K0069
16158h5854k5476p1208K6600J04717J2357o6427l9496r027O6189l1948j9268L6738
16146a02103Q6033k103k9819p993m7290J9698L2044N8330l2303j01324K3516J4900
16134h8414r123K0597o2127r131Q8900O9503L4837J5350m300o8928o5770j7133
16122i5739M5465R5008K9298l785n8097n2244L0614o4599n4868N8348k5351l9141
16110a35091N991K2297N7129K1990J9416l0829j9581k2245R719Q3666M2564L2019
16098H7045m8878m810L1461j429o1290r073Q0994n711J1702l5976M4664M5826
$$ y = [-28186, -102556, -184514, -189751, -212757, -239999, -248169, -196973, -148596, -182151, -199962, -221120, -127551, -62408, -118057, -132078, -157587, -159959, -181543, -121139, -66309, -63553, -61316, -105923, -85854, -111330, -182538, -155938, -51221, -38864, -105291, -144787, -153814, -87625, -119573, -138841, -102103, -16070, -18173, -47992, -55985, -103275, -83577, -51533, 6797, -25506, -126830, -103314, -88414, -97537, -76940, -139067, -148198, -59298, 10205, 45042, 60392, 56092, -12836, -78606, -95739, -50274, 44734, 74032, 70247, 12150, -40094, -9480, -74079, -128947, -70599, -95950, -135091, -129100, -106803, -49674, -27684, -8268, -39097, -58678, -80923, -71204, 12462, 55026, 87045, 38167, 33357, 64818, 63389, 2099, -6974, 74020, 68309, 80011, 44035, 88699, 134525]
16086A34525J7081M6556R9733J86972K32731m9311k03060k00328o9469j5381k3063
16075A56986J8350l4627p48J32439P6360J26979R8333J28862Q9639O1421J8597
16064H72591j11345q1649O842P0280l4383j67878j21399p3755n9280J6857J36629
16053D53510K09651J78116m9j08179L7385O9421j7159n2164J3699m9476j53517
16042E81238j90538j48756k2149O085k8278p1665q502M6888N6239J33171J28530
16031D82263O8478o6114r2890j54796j41224n6848K5975Q8473p282n3677L1767
16020A24125L3299m7851M719K6335k1173o2447n5699k1586J911n3163m995R9903
16008B3378Q2517r238m8588k8239k3233m5416m5972j4846k0453N5764M1150k2010
$$ y = [134525, 151606, 198162, 297895, 484867, 717598, 668287, 465227, 264899, 195430, 180049, 156986, 175336, 140709, 139961, 272400, 348760, 475739, 574072, 702934, 792573, 853994, 872591, 761246, 679597, 686439, 756719, 722336, 554458, 433059, 359304, 300024, 316881, 453510, 663161, 841277, 841228, 733049, 770434, 839855, 822696, 770532, 784231, 734755, 581238, 390700, 241944, 219795, 225880, 197602, 125937, 117435, 164323, 220562, 353733, 482263, 550741, 484627, 391737, 236941, 95717, 38869, 64844, 153317, 146035, 92358, 124125, 157424, 109573, 114292, 140627, 119454, 57007, 1308, -20278, -18367, -71530, -76525, 23378, 105895, 96657, 48069, 19830, -3403, -48819, -94791, -109637, -130090, -74326, -33176, -55186]
15996e5186m0491P4018J2760r3776k3062Q2726L1821P5020k059r6814o1167m9249
15984a45459n3037J1223N5247N3635M280j6006l2546k8612L4660O6140L4698p0829
15972h6606l9262r7248n2481P3487O0507O1771O9045J9298n2141j9344j2717M1964
15960c3727J50823l253j36521r0790l3956n0534L4041M1988o0603J8039M9743
15949a14750M4632p1949M5071K0784J0477N7857L6809p1095k3485M7671R2991
15938G5013k7802o1075k6415j21484J8515K8105j6586J15209K2926J4913P444
15927B8763J6473p4754M811J605N358j6451m2648n11L1572j8011j3487L708l0911
15914a04483m0363n890R2413K5543q078j0318m9480q0052m528k9993l7378J9869
$$ y = [-55186, -95677, -21659, -8899, -102675, -125737, -43011, -11190, 63830, 61771, -35043, -96210, -145459, -198496, -187273, -132026, -78391, -74111, -90117, -122663, -151275, -116615, -50475, -15777, -86606, -125868, -223116, -275597, -202110, -141603, -79832, -10787, 8511, -43630, -62974, -75691, -33727, 117096, 113843, -22678, -113468, -147424, -197958, -163917, -121929, -182532, -164493, -114750, -70118, -142067, -96996, -76212, -65735, -7878, 28931, -42164, -65649, -17978, 75013, 47211, -13864, -40279, -161763, -143248, -115143, -131729, -16520, 6406, 21319, 28763, 45236, -29518, -24707, -23102, -17744, -34195, -76843, -77354, -45782, -63793, -77280, -73572, -104483, -144846, -150736, -58323, -32780, -40858, -51176, -100656, -180708, -185236, -215229, -252607, -232738]
15902b32738n1013k7658J38932R9189P863L3402J17094J4057Q725p2758m5274
15891a0179m4597L11N6980o2909n0045N0788l7587n7865o163L0548k3313l9044
15879a93075J00415M4283Q155M893M7708l8721l9176J7382P797l618O2430N1346
15867F9819j07317J441J3603L5997M2790J5498J9932k7522m3323j4598j8865j5146
15855b7691k0884N020q567l289M6734n8110L8314N5348k6796k2379J0024m8235
15843f0511j6068K3365J6344q5988q136k2719l3865Q708O8883M7922M5112K4591
15831G638l717p246q7534L2669L1847P2001j6368l0372Q69n2043p6169l322J64066
15818C2319M6919J1212n3287o2025n7238k1072k0262j9395P7265M4790j0944K3872
$$ y = [-232738, -283751, -311409, -172477, -73288, -65425, -32023, 85071, 99128, 107853, 35095, -10179, -54776, -54465, 2515, -60394, -110439, -59651, -97238, -155103, -161266, -130718, -154031, -193075, -92660, -48377, -40222, -35329, 12379, -26342, -65518, -48136, -40339, -43957, 18473, 69819, -37498, -36057, -22454, 13543, 56333, 71831, 91763, 64241, 20918, 6320, -12545, -27691, -48575, -43555, -52122, -55411, -8677, -66787, -28473, 26875, 79, -22300, -12276, -60511, -76579, -53214, -36870, -122858, -130994, -153713, -187578, -178870, -109987, -62065, -16953, 7638, 3921, -3325, -90859, -58190, -26343, 45658, 29290, -1082, -213, -52256, -128425, -131747, 32319, 79238, 90450, 37163, -24862, -82100, -103172, -123434, -142829, -65564, -20774, -31718, -7846]
15806g846J23420N701p0748j50953K5143J1662M2368J7889o244r0065j5388K9658
15794h5403K4890m430j2719j4180l0331O0533k3467p4195n256N8044O8688R464
15782b8362o7787k1384Q387k2764J3129L354k5356k268P6562L2294l2244j2314
15770g8753N2162p8193k1577J3579N5854L5616n4067L9510j3895n9290n4154p8075
15758b41283o0305J760J02916P4854K7641J8752m7470p6877J4395P1944P9368
15747c4305R3362l39k8722n157k1767j4254j4201P816J9423M6220L3362o2855
15735A8583l3758P6274k844r293k4468n4034j5532K9262L8115J0211k4330M0588
15723D8774k4899p6946J9953O7637J9120k727L5496L0859k6226p1153l6081k9832
$$ y = [-7846, 115574, 121275, 50527, -100426, -75283, -63621, -21253, -3364, -9608, -99673, -115061, -85403, -60513, -64943, -77662, -91842, -122173, -61640, -85107, -159302, -164558, -106514, -37826, -28362, -96149, -117533, -109146, -131910, -118781, -115427, -140783, -143051, -66489, -34195, -66439, -78753, -26591, -104784, -126361, -112782, -56928, -21312, -75379, -35869, -49764, -109054, -163208, -241283, -301588, -299828, -196912, -122058, -94417, -75665, -123135, -200012, -185617, -113673, -34305, 59057, 58718, 29996, 24839, 3072, -11182, -25383, -17567, 1856, 48076, 81438, 18583, -15175, 61099, 58255, 48962, 24494, -29540, -45072, -15810, 22305, 32516, 8186, 48774, 23875, -53071, -33118, 34519, 53639, 50912, 86408, 117267, 91041, 19888, -16193, -46025]
15711d6025m138N6514O4148p0464o2337r41Q6667L1221k1167K5644K9231m1856
15699D6497j14344M101K1953m960p618L1061L1257J5851M9330r927j07790L128
15687d1461M5951P1596O9686k5387q2342j05377N7516j9150K3383j54911l9411
15676a99907K5967O1153n664K1989Q490M1914R4868k4024r61k3804n6405m7999
15664a04383L8865R5631O348k6018K9879j5820j455K2475q4387k8019M0547J9215
15652g122L2290k6327J8312J8540J170K2386n2486p2057k9244l4026r6640K8810
15640a96394Q833J08197P6816K9902m6433l6632K6088K8322M1874n2224m2672
15629e4323L655k4403N7874K8804Q196l8825M5831m9530R772J41420j143j02358
$$ y = [-46025, -50163, 6351, 70499, 35, -62302, -63243, 23424, 54645, 33478, 59122, 88353, 46497, -67847, -63746, -41793, -46753, -54371, -23310, 7947, 23798, 73128, 63201, -44589, -41461, 4490, 76086, 145772, 120385, 38043, -67334, -9818, -28968, -5585, -160496, -199907, -173940, -112787, -118451, -96462, -87972, -46058, 48810, 24786, 23825, 21, -56384, -104383, -65518, 30113, 36461, 10443, 40322, 24502, 23047, 45522, -38865, -66884, -26337, -7122, 25168, -1159, 17153, 35693, 36863, 59249, 6763, -65294, -94538, -128564, -225204, -196394, -187561, -79364, -2548, 27354, -19079, -55711, -29623, -1301, 40573, -11651, -54323, -50668, -75071, -17197, 11607, 19803, -19022, 26809, -22721, -12949, 128471, 127328, 24970]
15617B4970l6653L5056q6890O725J13159M5981k8753q6054j25180M1536J06126
15606A0023L1557P992o899O802J3205Q76m4807m4521m6539Q9079O1041J603j483
15593G7929j3408N8p2514p6706m106Q6656O2971O5949o3046o4476m4026r8422
15581a43141J0932j7590K4043L9096R2739N0861L8068J0489j2665l6362K8450
15570H4920j0267M8976k554n3902J9166N7373L9960M5723L6882q4670r5918O0742
15558A46431j4132k7227j36676o414J22300N656n0465L6302N4104N4957m1596
15547A43240l1307j8706p4974N217Q059k1296l3430P1996O6200Q734j8433p1369
15535C3931n913k854j24729j5002Q9787N5307J5723M6402P6745k0585P1956p202
$$ y = [24970, -11683, 23373, -63517, -56792, 56367, 102348, 73595, -12459, -137639, -96103, 10023, 41580, 49572, 42673, 49475, 62680, 63556, 18749, -25772, -72311, 16768, 77809, 79412, 77929, 64521, 64579, -7935, -84641, -88747, -2091, 60880, 126829, 63783, -693, -44719, -143141, -132209, -149799, -125756, -86660, 6079, 56940, 95008, 105497, 92832, 56470, 84920, 74653, 123629, 121075, 67173, 86339, 143712, 183672, 229395, 266277, 181607, 85689, 146431, 132299, 105072, -31604, -38018, 84282, 89938, 39473, 75775, 129879, 184836, 143240, 111933, 93227, 18253, 23470, 31529, 10233, -23197, 48799, 114999, 123733, 105300, 33931, 28018, 25164, -99565, -114567, -24780, 30527, 46250, 92652, 169397, 148812, 220768, 213566]
15523B13566p7639j6507L4423j7140j29352n1288K1026p7966J6372J75889J22971
15512B14355j1235R174J8287k5684J345L3398j4729J943n2095k3193p2492r5736
15500a6662N8553O8843O1371L1221r3832n9652J6651j6627j1646n615n464j0129
15488A7012N6016k5039q9010P8820Q086j9461l4196L9879R4202m6650r0743M136
15476f948L3451L6975L4800P088K1430k4269K0021L9694O0053L0797l3810o4315
15464A54967J5834m0047r3003k0862K2273Q4789R8389L965k9940R988k260k5051
15452A79042j7045j42970q5779j2565J0419Q3859k6542o6349P9383k3306k8754
15441e0607n892m6593k9794k1116o242Q730Q7657o96O119N195J10999l0122M7674
$$ y = [213566, 135927, 119420, 153843, 136703, 7351, -43937, -22911, -100877, -84505, 91384, 214355, 203120, 212294, 230581, 204897, 206242, 239640, 224911, 226854, 174759, 151566, 79074, -16662, 41891, 110734, 172105, 203326, 109494, 49842, 66493, 49866, 38220, 32605, 27141, 17012, 73028, 47989, -41021, 37799, 45885, 26424, -7772, 32107, 126309, 79659, -11084, -6948, 26503, 63478, 98278, 105366, 126796, 102527, 122548, 162242, 222295, 253092, 219282, 154967, 170801, 130754, 37751, 16889, 39162, 123951, 222340, 226305, 196365, 206353, 204093, 179042, 161997, 19027, -66752, -79317, -68898, 14961, -11581, -77930, 1453, -21853, -50607, -56499, -103092, -132886, -154002, -160244, -151514, -63857, -64553, -58434, -53239, 57760, 27638, 75312]
15428G5312J6495m1115m3558j1675J899O4942J0930p8927m1402L0133K0002k1747
15416a8711K7827L9054n4525J4705J1959k2313l9181o692P5996J0085o3086J9558
15404e324m746k6131K1675Q9312J2163L347l3782L9814p538p2877k4629J9396
15392A0680L482j8727J4817J5932J8965M9329P723j7043L5408L7772M6502N1444
15380B56284p427q0530q7588l5731q4081R913l3573J4690N9582M3566N229L766
15368F4100Q1785j2899m6683p3798k1198P2057P4169M6748N503J218o0839l5671
15356I4492L6754O4278m9848o2925J2535k6387M1284k9170p4171j0609p5971n633
15344h5371M2510j0052P661K4560N9278M9227l692n00M85l7982j945N3507J06158
$$ y = [75312, 91807, 50692, 7134, -4541, -2642, 62300, 73230, -5697, -47099, -16966, 3036, -18711, 9116, 48170, -6355, 8350, 20309, -2004, -41185, -47877, 28119, 38204, -24882, -5324, -10070, -36201, -14526, 74786, 86949, 90296, 56514, 96328, 88790, 15913, -8716, 10680, 14162, -4565, 10252, 26184, 45149, 94478, 102201, 85158, 120566, 158338, 204840, 256284, 248857, 168327, 80739, 45008, -39073, -29160, -62733, -48043, 11539, 55105, 60334, 64100, 145885, 132986, 86303, 12505, -8693, 63364, 137533, 184281, 189784, 191002, 130163, 94492, 131246, 195524, 145676, 82751, 95286, 68899, 110183, 81013, 6842, -3767, -79738, -85371, -42861, -52913, -45252, -20692, 38586, 87813, 84121, 83621, 84106, 46124, 44179, 97686, 203844]
15331B03844l9921M964k3713m6577J4663r172K3243j6322n7697n9330n3187L7542
15319b1663J3317j6638J8097l561L0695K4990n0332J8268L6144l922j9705l3090
15307g400N2808m318K7847N587l7243m9236P1228P1683q779j13408k593K4024
15295C0200o91o1791K6325j1949k9438j0289K5588M0015Q4456M1961L9276m3395
15283A30268j07974l0195P285K7231J2332J6386J4877L0531J8250L2396K0276
15272A71663r9011j1520O2566m3412K5635o8549p8148K3552L7917L4768j01603
15261d6142j5762O6707m2970O9884l2040K0237L4125j4576l3622k7984L7472j897
15249A3432J3037j08633k9620P6124J05674J04541m9130k3435J6137M068j6180
$$ y = [203844, 163923, 168887, 145174, 98597, 113260, 104088, 127331, 111009, 53312, -6018, -59205, -21663, -8346, -24984, -6887, -10448, 20247, 45237, -5095, 13173, 49317, 45395, 25690, -7400, 45408, 41090, 68937, 74524, 37281, -11955, 59273, 130956, 122177, 8769, 6176, 30200, 29509, -32282, -5957, -17906, -47344, -57633, -32045, 7970, 92426, 134387, 173663, 130268, 22294, -7901, -616, 26615, 38947, 55333, 70210, 100741, 118991, 151387, 171663, 72652, 61132, 123698, 80286, 105921, 37372, -40776, -17224, 20693, 55461, -46142, -61904, 4803, -38167, 31717, -323, 19914, 54039, 39463, 5841, -22143, 15329, 13432, 26469, -82164, -111784, -35660, 70014, 174555, 125425, 101990, 118127, 122195, 106015]
15238A06015K3171k0831k2897M8561j8384N3092K2896r244K3277q2560l3477r6347
15226f728l0036j4865Q0057Q1974k519n8310l9885l8994K5143M4613J50136L4428
15214B25014q5226p4125K8255O9135m2156j03055L7835j8940J1276R5129J6421
15203A59563L9282n0184r7781m4916l5556o2556l4431j1200Q7102k3361m5676
15192a19714N4643Q0803L4244l9771k858J3112M5280l9718o6717j01506l0169
15181a72371P3856J44423J20997Q5003m9787j34282o02l0059j026k2484l2463
15170a8795m7789J1393P8369M2930O4225k1018j0556l2346k0147K8319L4640l9888
15158F9337j7204J9519Q7171O0184P8305K1459j25250n5441J5306p8762k8859
$$ y = [106015, 129186, 108355, 85458, 134019, 115635, 168727, 191623, 182379, 205656, 123096, 89619, -6728, -36764, -51629, 28428, 110402, 107883, 49573, 9688, -29306, -4163, 40450, 190586, 225014, 139788, 65663, 93918, 163053, 120897, 17842, 55677, 36737, 48013, 143142, 159563, 198845, 148661, 50880, 5964, -29592, -92148, -126579, -137779, -50677, -74038, -119714, -65071, 15732, 49976, 10205, 7347, 20459, 65739, 26021, -40696, -142202, -172371, -98515, 45908, 166905, 251908, 202121, 67839, 67237, 37178, 36152, 13668, -18795, -66584, -55191, 23178, 66108, 130333, 109315, 98759, 66413, 46266, 74585, 109225, 69337, 52133, 71652, 158823, 219007, 297312, 318771, 193521, 138080, 153386, 74624, 45765]
15147D5765l0948N0241j1810P492O7512K6980J7679q9596l3249l5009j8965O977
15135C069K8782N6874J1659k1971m9256p554j9946M7779L0608j5717L8486k1201
15123H1612j2125K545K4655q92K8778j9110K4772k4465j4235m1667k2382l8856
15111a1370L5679R7049J1498K996M3693m3463o789J9020K4514q8727O5695N432
15099A55227l3394l4394N014L5122M2030J148m1127r0252k6314k9370O1565j3611
15087C1644n7680M6801J10727o7033j55676K7997M2394j1462p7742j2985M8008
15076g5007Q0101n2581o4802N1641N7638N8300K0934K2854J09265L3982j3898
15065B28427j21219k1927L1791K9641j06174m1528L7766N2610R9799O6757J22719
$$ y = [45765, 14817, 65058, 53248, 60740, 128252, 155232, 172911, 83315, 50066, 15057, -3908, 3069, 31851, 88725, 100384, 78413, 29157, 21603, 1657, 49436, 80044, 64327, 102813, 81612, 69487, 72032, 96687, 95795, 124573, 105463, 130235, 105770, 91535, 49868, 27486, -11370, 24309, 121358, 132856, 135852, 179545, 136082, 129293, 148313, 172827, 84100, 149795, 155227, 121833, 87439, 92453, 127575, 169605, 170753, 129626, 39374, 13060, -16310, 45255, 31644, -26036, 20765, 131492, 64459, -91217, -63220, -20826, -32288, -110030, -123015, -75007, 5094, -47487, -112289, -60648, -3010, 55290, 76224, 99078, 208343, 242325, 228427, 107208, 85281, 117072, 146713, 40539, -989, 36777, 89387, 189186, 255943, 378662]
15054C78662M1855j30727j39611j0376j16679j13049J17641J04604k040j6551
15044A13729k4589o2632J1741J7417q246j0197J499l4360L6134O8162j6932n2444
15032C9282q8461n8321k9691r672K2539j1867K0447J7624J8443J0769M6554O0216
15020C7862l7219J9702p7216k9012M2066o2992Q1953J07119K5757O7268Q1472
15009B56760o073p6455k8727n7404K0122M9034P580M3079K4635k8432J0015J1778
14997B25912r3852j36932j8221R404O3849J1027J4689L7238n5988m3812M6898
14986F0212L8761k4q0444N7142n60J3659L347J0110l6382o2040o9354M0586J30831
14973A05844Q7628J1515p9441j8987Q9893j5107l1170p3639o1092N3030J8541
$$ y = [378662, 420517, 289790, 150179, 139803, 23124, -89925, 27716, 132320, 130280, 113729, 89140, 26508, 38249, 55666, 47420, 37223, 38722, 4362, 40496, 108658, 91726, 39282, -49179, -107500, -137191, -146863, -124324, -136191, -115744, -98120, -79677, -68908, -22354, 37862, 643, 20345, -56871, -85883, -43817, -106809, -24856, 82263, 108020, 175288, 256760, 250687, 174232, 145505, 88101, 108223, 157257, 164837, 207916, 232551, 204119, 214134, 225912, 132060, -4872, -23093, -13689, 50160, 61187, 75876, 113114, 57126, 13314, 60212, 98973, 98949, 18505, 75647, 75087, 88746, 92093, 102203, 65821, 3781, -65573, -24987, 105844, 193472, 204987, 125546, 106559, 196452, 181345, 150175, 76536, 15444, 68474, 87015]
14962H7015K7037P1325L9601m8956P1058n3208n7531J7257M9537m2532j18875
14951D1728k5223R338K040N4896O3385L0243n4695q784L1475k3609k8028J3965
14939A06731J6392n7161o8446R617J15551N7108k1371o1294O210p3547m9417M2557
14927B2930L8249K4965j498M4667m696L8895M0876l0175l9611M527k3225m3463
14915G2441L7816k922J4968q4493J1505O9615P8048M7653o0468j1251j06043P602
14903G4471L7172j0826k59J4909M6111k1050k0608p035K3974j1167J2172J36M0431
14890A78431Q268N4406M2306l8122o5713q1504L4815Q008l7575n2847n4257j11343
14878a15127R5689J25541K4596K1576p1866p8714J9058P776p7754p0024R3934
$$ y = [87015, 114052, 185377, 224978, 176022, 247080, 193872, 136341, 153598, 203135, 160603, 41728, 16505, 25843, 27883, 82779, 146164, 176407, 121712, 112928, 144403, 120794, 92766, 106731, 123123, 65962, -2484, 7133, 122684, 179792, 158421, 97127, 103337, 29790, -19627, 22930, 61179, 86144, 84646, 129313, 124617, 163512, 204388, 174213, 134602, 139129, 115904, 72441, 110257, 107335, 122303, 37810, 49315, 118930, 196978, 244631, 184163, 172912, 66869, 74471, 111643, 100817, 100558, 115467, 161578, 140528, 119920, 112885, 136859, 125692, 137864, 138000, 178431, 186699, 241105, 283411, 245289, 179576, 98072, 132887, 140895, 103320, 50473, -3784, -115127, -19438, 106103, 130699, 152275, 80409, 1695, 20753, 28529, -49225, -119249, -25315]
14867b5315M031L3109L7764J6460P2593n1992o7041Q8972j18043n755P6558P5647
14855A36988l844k6145K5396K053j8075o9504j14048k587R7506M7461m6309J8252
14843D7144k8659M602O9069J05118L170o5404o1815p6547q5126L700R626R6547
14831B1425M6730m3580N1651R9014K7831l1870l1258N806J2047k1732n310J48745
14819B79499J7832q9458o27k0335o9294l1158k943N7868J7410n7360j23231M4611
14807B2814P4756N1403J0380J3166n9285K116l4376j6036p5808J180o6790P3874
14795b606O4246J5993O1660n2022j4417O9965N9612l0051k2266o3012J70816M3737
14783C01655j1371j4944l030m0221l9452o5237p893n1533O4384M8187l1797k0859
$$ y = [-25315, -21284, 11825, 49589, 66049, 138642, 86650, 19609, 108581, -9462, -15217, 61341, 136988, 133144, 106999, 132395, 134448, 116373, 46869, -67179, -69766, 27740, 75201, 28892, 47144, 18485, 23087, 92156, 197274, 200444, 135040, 73225, -3322, -88448, -84748, -75122, 21425, 68155, 24575, 76226, 175240, 203071, 171201, 139943, 145749, 157796, 136064, 130754, 279499, 297331, 207873, 207246, 186911, 117617, 86459, 83516, 141384, 158794, 101434, -21797, 22814, 97570, 148973, 159353, 172519, 113234, 115350, 80974, 64938, -10870, -9690, -76480, -2606, 61640, 77633, 139293, 87271, 72854, 142819, 202431, 172380, 150114, 87102, 257918, 301655, 290284, 275340, 272310, 232089, 192637, 127400, 119507, 67974, 132358, 180545, 148748, 127889]
14771A27889n5550Q72l7732j6260N51j4309J6452l1775K261J5532J22154k6917
14759A03168J949m954k8897l3878M168K983M146Q83J0500l4011k0660l2589n0803
14746g7995K7915L3998O8224NO714Q8091L6387j755j52735j2034N2721J0725o477
14733G3784K0855K7739l8500l1892l8051p8845l9923O0322N8880J06776m989p1487
14721D4669m5038J816R0884M8518K2713n9187l9500n6648q954P197l8858j0790
14709d3178L1135J0926L55k9155k9466O932L5074O7341L8094K2541k5660O6753
14697A51692m297r0251j643o8857R8841L3755o6359j8369Q017L63K7557J1469
14685H1918j5166J1593K1504R458l136l582k6067L0673j76719k7373O0591O9279
$$ y = [127889, 72339, 73211, 35479, 19219, 19770, 5461, 21913, -9862, -7601, 7931, 130085, 103168, 105117, 100163, 71266, 37388, 41556, 44539, 48685, 49568, 60068, 26057, 5397, -27192, -77995, -50080, -16082, 52142, 52147, 58861, 146952, 183339, 181584, 28849, 16815, 69536, 80261, 73784, 94639, 122378, 83878, 51986, 13935, -64910, -104833, -44511, 14369, 121145, 116156, 44669, -369, 1447, 92331, 140849, 163562, 104375, 64875, 8227, -727, 6470, -32388, -43178, -12043, -1117, -762, -29917, -59383, -52451, -17377, 49964, 88058, 110599, 84939, 151692, 147395, 57144, 55501, -13356, 85485, 119240, 52881, 34512, 42529, 42892, 70449, 81918, 66752, 78345, 99849, 109307, 106171, 102589, 76522, 107195, -69524, -96897, -36306, 32973]
14673C2973Q1450M0851O3503p5831m6176J6500j5820L6535q6376l8563K1299l6962
14661f617K6268j7097k5192L7923m7972N5315j15169l8131L7372P2950m5812O0845
14649e317m171M0213L9692M9427l0368r5387q0451m278K2525K7343r5887L9212
14637i7447J6779L5390Q7053m39j01493j8875R6464Q2524K7386j403J7538N5892
14625A99369n5766q6012j4807m8433J01858J7461k9892Q752J903q5578j7055J03082
14613I4882l4482L2698k1569k0012o6687l7751Q828l6211j1830P8983O2301j8414
14601C0736p0481j49P779o9689K2836J01112j27474n5219J08755J29060K5321
14590A02587J8552O786J22257N9264L3346k9944j26186j13526j7549R9067J05942
$$ y = [32973, 114423, 155274, 218777, 142946, 96770, 113270, 97450, 133985, 47609, 9046, 30345, -6617, 19651, 2554, -22638, 15285, -32687, 22628, -92541, -130672, -93300, -20350, -66162, -5317, -9488, 30725, 70417, 119844, 89476, -5911, -86362, -90640, -68115, -40772, -136659, -97447, -80668, -45278, 41775, 41336, -60157, -79032, 17432, 99956, 127342, 125939, 143477, 199369, 143603, 57591, 42784, -5649, 96209, 113670, 83778, 92530, 94433, 8855, -8200, 94882, 60400, 93098, 71529, 51517, -15170, -52921, -44093, -80304, -92134, -13151, 49150, 30736, -39745, -39894, -32115, -101804, -78968, 22144, -105330, -160549, -51794, 77266, 102587, 121139, 127925, 250182, 309446, 342792, 312848, 186662, 73136, 55587, 154654, 260596]
14579B60596o2600n3486k1860L8249j6826l2532K6405l1050J06909L6514k4956
14568B25363Q465l4316k4550j3071M5362J09232P0870K1030m380l6156l9071L5037
14556C63815L3078l1896j9174j7927j08868n588K4995m1173K61N4783k845j4202
14544B35259l0920L6837k0112o2918k0839L5187M8621L7836l9018L431K5065m7128
14532B01301K3836K3015m5272m1111p237j6234l2423M8541K3039K1835n0659m5773
14520A02858k0978j12187K139J09465O2706m0323l1545J4141K9044K4287l2538
14509A07069r0151k1120M6538l2164L1436j1456r8095J14534k279m3880j2605
14498a2173M5206N7590l2421j1127K8857J8799j5190K9186j3172j4473N9298J5431
$$ y = [260596, 197996, 144510, 122650, 160899, 144073, 111541, 137946, 106896, 213805, 250319, 225363, 233828, 199512, 174962, 161891, 207253, 316485, 387355, 408385, 404005, 367849, 328778, 363815, 396893, 364997, 345823, 327896, 219028, 213440, 238435, 197262, 197523, 252306, 249461, 235259, 204339, 241176, 221064, 158146, 137307, 172494, 221115, 258951, 219933, 223364, 248429, 201301, 225137, 248152, 202880, 161769, 154532, 138298, 105875, 154416, 177455, 199290, 148631, 102858, 81880, -30307, -28168, 81297, 144003, 103680, 72135, 86276, 115320, 139607, 107069, 16918, -4202, 42336, 10172, 41608, 30152, -67943, 46591, 44312, 432, -12173, 33033, 90623, 58202, 47075, 75932, 94731, 79541, 108727, 95555, 81082, 140380, 155811]
14486A55811j7365l4739J493n3586j03382N229J1159k4756r6088m0546J30845
14475f5925O8996Q0158o515l5503m3265j1649k7060l4359o7722j5446Q3988K1952
14463e2350K0657J7691K3935r735k1389N4229L4776n260J8529R7966O2515l2210
14451B09354p9973L6569l4638m4085l3931M4848J4379N5600O2006k2114l874k8556
14439A75585r7947o6782N1305l2289O778L2739k7169m2246N207P1098J01861O1003
14427B39143r8176J0384O5384M2055N5204P6810K1220q0773m3762J8059J7702
14416C23250K4295r0689j02459N8975J5330m3691L1234P0898m5089j20019n5248
14405F6787J1965P8753j9631m2213L3995K9409k8332R986L3522m4714j5708M4484
$$ y = [155811, 138446, 103707, 105200, 51614, -51768, -46539, -35380, -60136, -156224, -196770, -65925, 3071, 83229, 76714, 41211, -2054, -13703, -40763, -75122, -142844, -158290, -74302, -52350, -31693, -14002, 9933, 198, -21191, 33038, 67814, 62554, 81083, 179049, 241564, 209354, 129381, 165950, 131312, 87227, 53296, 98144, 112523, 168123, 230129, 208015, 204141, 175585, 77638, 10856, 62161, 29872, 36650, 69389, 42220, -26, 5181, 76279, 178140, 239143, 140967, 151351, 216735, 258790, 313994, 390804, 412024, 331251, 287489, 305548, 323250, 347545, 256856, 154397, 213372, 228702, 185011, 216245, 287143, 242054, 122035, 66787, 78752, 157505, 137874, 95661, 129656, 159065, 130733, 140719, 174241, 129527, 113819, 158303]
14393A58303n3193p8862n5691j4120R8245Q7167Q0128l1749L6577p751o2715p1369
14381H4970j9300O7851J2426o9312k7939k101n4347l1783J8022P5370L0473K7828
14369A12158J2091r953q8208k7513J20896Q1925N1689l3416n4419p132M9825L7435
14357B45378N0066o1051o0677j7242P397L4984m8762l8312o3089k7063Q6063N1836
14345A59528o2414N0658N4868L462n753j4900M3835l976l6774Q532O482l4092
14333A69456O5818m775r4925n5395j8221j6478N479n3919M3920J05845N1257j48815
14321D9247j12520k3125p621J11021k8592k0208J4052P8581N1287m7489j4757
14310D9876P0178L2604k9771l1144N2595l6025q7522L5464N3666r0641m7044O1303
$$ y = [158303, 105110, 26248, -29443, -43563, 54682, 141849, 221977, 190228, 226805, 219054, 156339, 84970, 65670, 133521, 145947, 76635, 48696, 46595, -7752, -39535, -21513, 53857, 84330, 112158, 124249, 114296, 26088, -1425, 119471, 201396, 253085, 219669, 165250, 158118, 207943, 245378, 295444, 234393, 173716, 156474, 163871, 198855, 150093, 111781, 48692, 21629, 107692, 159528, 97114, 147772, 202640, 206102, 200349, 185449, 229284, 225308, 188534, 197066, 203548, 169456, 235274, 230499, 135574, 80179, 61958, 45480, 50959, -2960, 40960, 146805, 198062, 49247, -63273, -86398, -94019, 17002, -11590, -31798, -17746, 60835, 112122, 64633, 49876, 120054, 152658, 122887, 91743, 144338, 108313, 20791, 56255, 109921, 19280, -27764, 33539]
14298C3539J209m073J7956p65m2570K6799L6418J0363n0851k3261O0406L6450
14286A01620j4029n5781r049j7594m0848n8553J7006N3628P7385J1044k1882j01059
14274e8112M5259P6573m0462m2563l4503K4594k3640Q7521L0959q3363o069M6739
14262B2933l2160K2096N1504N6584K5022j19302j06739K1390P8221M2436L3160
14251I5145N9142P0238k609o9969j19176m3939L097N4621R0679L2043n1209J01103
14239B19166N1589M6223J3523n1254j0373p7987J8301L3005L7303r5948o701N8105
14227B34952Q9981m4477j00730l2166J5045J8969j1694K9765O5747J9152O2103
14216C46647o5481L8725L4536K2247L7925j3531o2573m6980N0236N805J8808L6037
$$ y = [33539, 34748, 30675, 48631, 47866, 5296, 32095, 68513, 78876, 28025, 4764, 65170, 101620, 87591, 31810, 22761, 5167, -35681, -94234, -77228, -23600, 53785, 64829, 42947, -58112, -12853, 63720, 23258, -19305, -53808, -29214, -52854, 34667, 65626, -17737, -23806, 22933, -9227, 12869, 64373, 120957, 145979, 26677, -80062, -58672, 19549, 61985, 95145, 154287, 224525, 221916, 151947, 32771, -11168, -8071, 46550, 137229, 169272, 118063, 219166, 270755, 316978, 330501, 279247, 268874, 190887, 209188, 242193, 279496, 183548, 176847, 234952, 324933, 280456, 179726, 147560, 162605, 181574, 169880, 199645, 265392, 284544, 346647, 281166, 319891, 354427, 376674, 414599, 401068, 338495, 291515, 341751, 347556, 366364, 402401]
14204D02401L0538o3930m6172p8824P185M4358K2930k324N950j3033J3046k073
14192C20052o7233n0672k4088p603j1856p7060J9326l235k5598N2762j6811M817
14180A12801J8892K4020N687l4775o4901P3336O7348k9741m6679L1446J1051N778
14168A74263O509o2337n1601R72j4666l2412J7227O489P3639R685k4996L4672
14156A37444J2569q2296K8859M1055k8947M0803N9999p5427p788j24623n240J2664
14144I072k797m5845j5743Q9702L2467l611P4179m4966j54953R441O2440M2542
14132E1928l641k8373k1578j3769J8085M9293N790j14683J2948N8411j3241o9791
14120f8621p059o2257m00M0937Q7871K108l2363q11j615P9443L8231o308m1190
$$ y = [402401, 432939, 369009, 322837, 244013, 251198, 295556, 318486, 316162, 322112, 309079, 322125, 320052, 252819, 202147, 178059, 170456, 158600, 81540, 100866, 97631, 72033, 124795, 107984, 112801, 131693, 155713, 161400, 126625, 61724, 135060, 202408, 172667, 125988, 157434, 168485, 174263, 180772, 118435, 66834, 67806, 53140, 20728, 37955, 44444, 118083, 127768, 102772, 137444, 150013, 67717, 96576, 137631, 108684, 149487, 209486, 134059, 126271, 1648, -3592, 9072, 6275, -39570, -55313, 34389, 66856, 63245, 137424, 92458, -62495, -53054, 9386, 51928, 48287, 19914, -1664, -15433, 2652, 51945, 57735, -56948, -44000, 14411, 1170, -68621, -75680, -137937, -138337, -97400, -9529, -7421, -39784, -40595, -42210, 37233, 75464, 69156, 27966]
14107B7966k5432l2878M236l4797R3980J0560m4122M0590M4925P4758L0224j09621
14095H0389k8486M7625p957o3149n1405k2825J23914O4544n3733M5218P2452k5231
14083A81356K023l5481j41252o8182m9585M1461N7301m73r288q87k8275m430N7686
14070A974L2689M0264p6783l8682O4729j2501p824M9232l4194j9796J3035m959
14058G184r9262m7885M7386J0669j18322j9249P7046K7035L5471n98J041l8320
14046a17804R567O6368Q2534R5923n178k0960J0175J6385m3433q6420K8169q901
14034B6425l3577J121m8675r1O3438N7885k5589o0076K649n031l0953m4721P2957
14021b4238J1520R407P6592Q2980n1337p7744L791j6363L4151J52700N5973p3438
$$ y = [27966, 2534, -30344, -26108, -60905, 33075, 43635, -487, 40103, 85028, 159786, 190010, 80389, 51903, 99528, 91571, 28422, -22983, -45808, 78106, 142650, 88917, 134135, 206587, 181356, 183379, 147898, 6646, -61536, -111121, -69660, -12359, -12832, -22120, -23007, -51282, -55712, 1974, 34663, 74927, -1856, -40538, 24191, 11690, 3866, 53098, 18904, -892, 12143, 7184, -92078, -139963, -92577, -81908, -200230, -219479, -142433, -115398, -79927, -80525, -79484, -117804, -108237, -41869, 40665, 136588, 131410, 110450, 120625, 137010, 93577, 7157, 35326, 26425, -7152, -6031, -54706, -54797, 8641, 66526, 40937, -19139, -16490, -21521, -52474, -97195, -24238, -12718, -3311, 73281, 156261, 104924, 27180, 30971, 14608, 48759, 201459, 257432, 183994]
14009A83994r0845m0407K7102N6579J1861j5790r7186l5662j6778O685n7412l3501
13997a01360l3957P1044J7955l9328K0838R5010N9362j6500P0981m9662N853p0339
13985B9897L6615O9386K2459J2025m4302N4496n7185j806M2646L5999j8568k1802
13973A59860j2414o5316k9834O5503K8781q392l1387m8390j2203n9445p4455k9503
13961a17195P0153R0606j1758k6647l0490n0961J0130L0414o4637m8973O1259
13950h8099J38358M3905R0686k0521o5057m7532J9552j10560j6065J12166Q639
13939F5472j2061m9016K048P727r805j4476m1871J5006p6159r3684R0132K9674
13927h7013j8212P595j4817l4105k2164Q6270K771l7157l7106l9207k055L0525
$$ y = [183994, 93149, 52742, 79844, 136423, 148284, 132494, 35308, -354, -17132, -10447, -67859, -101360, -135317, -64273, -46318, -85646, -64808, 30202, 89564, 73064, 144045, 94383, 100236, 29897, 66512, 135898, 158357, 170382, 126080, 180576, 123391, 121585, 164231, 200230, 181662, 159860, 147446, 82130, 52296, 117799, 146580, 138188, 106801, 58411, 46208, -13237, -87692, -117195, -47042, 43564, 31806, 5159, -25331, -76292, -66162, -35748, -100385, -149358, -88099, 50259, 94164, 184850, 164329, 99272, 51740, 71292, -39268, -55333, 56833, 65472, 53411, 4395, 6443, 14170, 4365, -10111, -51982, -36976, -113135, -206819, -116687, -87013, -105225, -97630, -112447, -146552, -168716, -82446, -79675, -116832, -153938, -193145, -195200, -164675]
13915a64675J14833N3787M1667L1329M7305l7091o7485K6028M4255N7616l5749
13904A11820q5512l3774l4408J6942o5584K7444K031n242K345O6006K0659n8718
13892c5991m8059L68Q179J1087L8165l3216l9678J4355M6824J2271K8848l498
13880c45K2785M3328P5278Q115j4215J5267r618j06644l0804l2873q550K1146
13868a7130k4179L1746K319K5100K9159k055n0860O977l1159n0560O2401M5429
13856B7188J3466m45Q3401K8428n0326m8100j42720j6999L7145O3703P4675j7772
13844E1644p4036K8001p6836J7113J36010J7261j31717p7489r054j6882J7116
13833a18869P1002O6666P7631k2736j1093q1722O5533l617l0176r141j1042L6838
$$ y = [-164675, -49842, 3945, 45612, 76941, 124246, 87155, 19670, 45698, 89953, 147569, 111820, 26308, -7466, -41874, -24932, -90516, -63072, -61041, -66283, -63938, 2068, 22727, -35991, -84050, -83682, -75503, -64416, -26251, -59467, -99145, -84790, -37966, -25695, 3153, -345, 22440, 65768, 141046, 149161, 134946, 150213, 140595, 33951, 3147, -29726, -38276, -17130, -41309, -9563, -7244, 17856, 47015, 44960, -5900, 1077, -30082, -80642, -18241, 27188, 40654, 40209, 123610, 152038, 101712, 53612, -89108, -106107, -68962, -5259, 69416, 51644, -22392, 5609, -71227, -54114, 81896, 99157, -32560, -110049, -119103, -135985, -118869, -47867, 18799, 96430, 73694, 62601, -19121, 46412, 42795, 12619, 3478, -7564, 29274]
13821B9274O6752n8909m0600M9006P4148o2437J328O8946n3396p5407P5475N4186
13809A28366m6164j5569l783k4636K2100j3179k2309n9929p1145Q2195j9232l0904
13797g4189k7902O7381n8912m8118P8571N8450j2911O709N9312k1140k178l863
13785B1210L1863L4347m7443j14126m420M8356O4669k2836M7240n9035j22492
13774a22667J1938N1497R625O4299O5850M1809o0886K6865J7568n0420r174j5755
13762C0549P3564l0875M9373M4824j07813n3746N0439k7444n5018Q82K6542O7507
13750F8784L1840P6921O1147N9187J6349K0860j16190j74665j05766O689M6490
13739h354K3368j7263R48N6356j6150m4978K6094j0516K1750j1659o450L5533
$$ y = [29274, 96026, 37117, -3483, 45523, 119671, 57234, 58562, 127508, 74112, -1295, 74180, 128366, 82202, 66633, 62850, 38214, 60314, 47135, 24826, -35103, -106248, -24053, -43285, -74189, -102091, -34710, -93622, -141740, -63169, -4719, -17630, -10921, 48391, 27251, 25073, 21210, 53073, 87420, 39977, -74149, -78569, -30213, 34456, 11620, 58860, -175, -122667, -110729, -59232, -49607, 14692, 80542, 122351, 61465, 88330, 105898, 55478, 46304, 30549, 104113, 73238, 122611, 167435, 59622, 5876, 56315, 28871, -26147, -25265, 1277, 68784, 100624, 177545, 238692, 297879, 314228, 335088, 218898, 44233, -61533, -54844, -8354, 15014, -2249, -1301, 55055, 38905, -6073, 20021, 9505, 31255, 19596, 13146, 48679]
13727D8679q0409o1250O2147j0390Q313J16900L5356K3573N0594n1145j7463q0617
13715D4288m4490k9815n381K704Q3611M4305o7785M6667m1403j3486j06902j05201
13703a92888O3287P9373Q8205k4796N3975M9581o3001J4323K893q1886q2013k8079
13691a21026L475P5540K1106j2347n4999K4329O5954P3437O4490J1703p6339p1739
13679C584K3294L4132m8609m6223n098o5685K2437J63312O2092o3005r6319K6344
13667A0256J0894L6349N2053l0892m5686j7794J6468N1062O730j7330m1988n7179
13655b7057J9625N5029k4011l2999K1258P1771J02258j09256n4136M5363o6235
13644A610n6828J424J31139M4472P9383n2328r5681k1411M8929J6633k9331k1686
$$ y = [48679, -31730, -92980, -30833, -41223, -32910, 83990, 119346, 142919, 193513, 142368, 124905, 44288, -202, -30017, -35398, -32694, 50917, 95222, 27437, 74104, 32701, 19215, -87687, -192888, -129601, -50228, 37977, 13181, 67156, 116737, 53736, 68059, 70952, -10934, -92947, -121026, -117551, -42011, -20905, -33252, -88251, -63922, 2032, 75469, 139959, 151662, 75323, 3584, 26878, 61010, 12401, -33822, -38920, -104605, -82168, 81144, 143236, 80231, -16088, 10256, 21150, 57499, 109552, 78660, 32974, 15180, 31648, 82710, 89440, 72110, 30122, -27057, -7432, 47597, 23586, -9413, 11845, 83616, 185874, 76618, 22482, 67845, 1610, -55218, -53794, 77345, 121817, 201200, 148872, 53191, 31780, 80709, 97342, 68011, 46325]
13632D6325l1742j2234k6797K3684r5112j0765J55092J05753o0131O737O8996
13621A69806k0949n3146N74n413K4673k8484n4275N9312K4131J4090k5633q4580
13609B0106L6381M0096p8251q8083l7610J1948M7335M1712j5709n5980J7538J1412
13597d9105j4294r2320J2520M7919J45903M1341n1230o4172q6310L601m5686l4891
13585a86724j9065P9618P6908M9819o295n2287m3949J4683O3457N066o8308O2787
13573b4290O0392L4412J2512j3698l6504L6476Q4709l56q3013o3904K3193j7663
$$ y = [46325, 14583, 2349, -24448, -764, -95876, -106641, 48451, 154204, 94073, 100810, 169806, 148857, 95711, 96285, 90872, 115545, 87061, 32786, 92098, 116229, 130319, 104686, 20106, 56487, 96583, 18332, -69751, -107361, -95413, -48078, -6366, -22075, -78055, -60517, -49105, -63399, -155719, -143199, -95280, 50623, 91964, 40734, -23438, -109748, -106147, -151833, -186724, -205789, -126171, -49263, 556, -5739, -58026, -101975, -87292, -23835, -18769, -87077, -24290, 36102, 70514, 83026, 69328, 32824, 69300, 154009, 153653, 70640, 6736, 29929, 12266]
$$ [...]
##END NTUPLES=NMR SPECTRUM
##END=
