##TITLE=Analysis number 327304
Compound Code btb 07911
Project Code adrs
Chemist Name fudan
##JCAMPDX= 6.0         $$ Bruker NMR JCAMP-DX V2.0
##DATA TYPE= NMR SPECTRUM
##DATA CLASS= NTUPLES
##ORIGIN= Bruker BioSpin GmbH
##OWNER= nmr
$$ XWIN-NMR		Version 3.5
$$ Tue Mar 20 12:16:14 2007 GMT Standard Time (UT+0h)  MAYBRIDGE\nmr@NMR_250MHZ
##.OBSERVE FREQUENCY= 250.131544655141
##.OBSERVE NUCLEUS= ^1H
##.ACQUISITION MODE= SIMULTANEOUS (DQD)
##.ACQUISITION SCHEME= undefined
##.AVERAGES= 16
##.DIGITISER RES= 18
##SPECTROMETER/DATA SYSTEM= dpx250
##.PULSE SEQUENCE= zg30
##.SOLVENT NAME= CDCl3
##.SHIFT REFERENCE= (INTERNAL, CDCl3, 0, 16.522)
##AUDIT TRAIL= $$ (NUMBER, WHEN, WHO, WHERE, WHAT)
$$ ##TITLE= Audit trail, XWIN-NMR		Version 3.5
$$ ##JCAMPDX= 5.01
$$ ##ORIGIN= Bruker BioSpin GmbH
$$ ##OWNER= nmr
$$ C:\u/data/dgb/nmr/ADRS/1360/pdata/1/auditp.txt
$$ ##AUDIT TRAIL=  $$ (NUMBER, WHEN, WHO, WHERE, WHAT)
(   1,<2007-03-20 12:15:52.01 +000>,<MAYBRIDGE\nmr>,<NMR_250MHZ>,
      <created by zg, POWCHK disabled, PULCHK disabled
       configuration hash MD5:
       49 4B E0 1D 92 C2 6B 37 9F E6 65 BC 52 41 86 1D
       data hash MD5: 64K
       D7 73 8B D9 77 2F 34 F4 32 88 B7 74 81 50 F7 09>)
(   2,<2007-03-20 12:16:04.59 +000>,<MAYBRIDGE\nmr>,<NMR_250MHZ>,
      <Start of raw data processing
       ef LB = 0.3 FT_mod = 6 PKNL = 1 SI = 32K 
       data hash MD5: 32K
       61 5A 98 CC 68 CB 17 CC C5 9E 88 2E D1 64 C9 4D>)
(   3,<2007-03-20 12:16:06.32 +000>,<MAYBRIDGE\nmr>,<NMR_250MHZ>,
      <apk 
       data hash MD5: 32K
       99 66 A0 7A 94 49 1D C1 B6 A3 FD D8 C7 CA 8A B8>)
(   4,<2007-03-20 12:16:07.09 +000>,<MAYBRIDGE\nmr>,<NMR_250MHZ>,
      <abs ABSG = 5 
       data hash MD5: 32K
       53 98 C1 B6 C4 F1 1B 30 17 22 11 58 E4 D1 C3 A9>)
$$ ##END=
$$ 
$$ hash MD5
$$ 80 1F AF 2B 85 04 84 C5 5D 7E E6 2C 25 D1 31 97
##$RELAX= 
##$RELAX= 
##$RELAX= 
##$RELAX= 
##$RELAX= 
##$RELAX= 
##$RELAX= 
$$ Bruker specific parameters
$$ --------------------------
##$DU= <C:\u>
##$EXPNO= 1360
##$NAME= <ADRS>
##$PROCNO= 1
##$TYPE= <nmr>
##$USER= <dgb>
##$AMP= (0..31)
100 100 100 100 100 100 100 100 100 100 100 100 100 100 100 100 100 100 
100 100 100 100 100 100 100 100 100 100 100 100 100 100 
##$AQSEQ= 0
##$AQ_mod= 3
##$AUNM= <au_zg>
##$AUTOPOS= <15 >
##$BF1= 250.13
##$BF2= 250.13
##$BF3= 250.13
##$BF4= 250.13
##$BF5= 500.13
##$BF6= 500.13
##$BF7= 500.13
##$BF8= 500.13
##$BYTORDA= 1
##$CFDGTYP= 0
##$CFRGTYP= 5
##$CHEMSTR= <none>
##$CNST= (0..31)
1 1 145 1 1 1 1 1 1 1 1 1 1 1 1 1 1 1 1 1 1 1 1 1 1 1 1 1 1 1 1 1 
##$CPDPRG= <>
##$CPDPRG1= <>
##$CPDPRG2= <>
##$CPDPRG3= <>
##$CPDPRG4= <mlev>
##$CPDPRG5= <mlev>
##$CPDPRG6= <mlev>
##$CPDPRG7= <mlev>
##$CPDPRG8= <mlev>
##$CPDPRGB= <>
##$CPDPRGT= <>
##$D= (0..31)
0 1 0 0 0 0 0 0 0 0.06 0 0 0 0 0 0 0.0002 0 0 0 0 0 0 0 0 0 0 0 0 0 0 
0 
##$DATE= 1174392950
##$DBL= (0..7)
120 120 120 120 120 120 120 120 
##$DBP= (0..7)
150 150 150 150 150 150 150 150 
##$DBP07= 0
##$DBPNAM0= <>
##$DBPNAM1= <>
##$DBPNAM2= <>
$$ [...]
##$SUBNAM7= <"">
##$SUBNAM8= <"">
##$SUBNAM9= <"">
##$SW= 20.6930455092707
##$SWIBOX= (0..15)
0 0 3 0 0 0 0 0 0 0 0 0 0 0 0 0 
##$SW_h= 5175.983436853
##$TD= 65536
##$TD0= 1
##$TE= 683.16
##$TE2= 300
##$TE3= 300
##$TEG= 300
##$TL= (0..7)
0 120 120 120 120 120 120 120 
##$TP= (0..7)
150 150 150 150 150 150 150 150 
##$TP07= 0
##$TPNAME0= <>
##$TPNAME1= <>
##$TPNAME2= <>
##$TPNAME3= <>
##$TPNAME4= <>
##$TPNAME5= <>
##$TPNAME6= <>
##$TPNAME7= <>
##$TPOAL= (0..7)
0.5 0.5 0.5 0.5 0.5 0.5 0.5 0.5 
##$TPOFFS= (0..7)
0 0 0 0 0 0 0 0 
##$TUNHIN= 0
##$TUNHOUT= 0
##$TUNXOUT= 0
##$USERA1= <user>
##$USERA2= <user>
##$USERA3= <user>
##$USERA4= <user>
##$USERA5= <user>
##$V9= 5
##$VALIST= <valist>
##$VCLIST= <CCCCCCCCCCCCCCC>
##$VD= 0
##$VDLIST= <DDDDDDDDDDDDDDD>
##$VPLIST= <PPPPPPPPPPPPPPP>
##$VTLIST= <TTTTTTTTTTTTTTT>
##$WBST= 1024
##$WBSW= 4
##$XGAIN= (0..3)
0 0 0 0 
##$XL= 0
##$YL= 0
##$YMAX_a= 447290
##$YMIN_a= -467383
##$ZGOPTNS= <>
##$ZL1= 120
##$ZL2= 120
##$ZL3= 120
##$ZL4= 120
##$ABSF1= 16.522
##$ABSF2= -4.171173
##$ABSG= 5
##$ABSL= 3
##$ALPHA= 0
##$AQORDER= 0
##$ASSFAC= 0
##$ASSFACI= 0
##$ASSFACX= 0
##$ASSWID= 0
##$AUNMP= <proc_1d>
##$AZFE= 0.1
##$AZFW= 0.1
##$BCFW= 0
##$BC_mod= 0
##$BYTORDP= 0
##$COROFFS= 0
##$CY= 12.5
##$DATMOD= 1
##$DC= 0
##$DFILT= <>
##$DTYPP= 0
##$F1P= 14.0000005364418
##$F2P= -0.99999901652339
##$FCOR= 0.5
##$FTSIZE= 32768
##$FT_mod= 6
##$GAMMA= 0
##$GB= 0
##$INTBC= 1
##$INTSCL= 1
##$ISEN= 128
##$LB= 0.3
##$LEV0= 0
##$LPBIN= 0
##$MAXI= 10000
##$MC2= 0
##$MEAN= 0
##$ME_mod= 0
##$MI= 0
##$NCOEF= 0
##$NC_proc= -2
##$NLEV= 6
##$NOISF1= 0
##$NOISF2= 0
##$NSP= 0
##$NTH_PI= 0
##$NZP= 0
##$OFFSET= 16.522
##$PC= 1
##$PHC0= 232.7045
##$PHC1= 7.906305
##$PH_mod= 1
##$PKNL= yes
##$PPARMOD= 0
##$PSCAL= 4
##$PSIGN= 0
##$REVERSE= no
##$SF= 250.13
##$SI= 32768
##$SIGF1= 0
##$SIGF2= 0
##$SINO= 400
##$SIOLD= 32768
##$SREGLST= <1H.CDCl3>
##$SSB= 0
##$STSI= 32768
##$STSR= 0
##$SW_p= 5175.98343685301
##$SYMM= 0
##$S_DEV= 0
##$TDeff= 65536
##$TDoff= 0
##$TI= <Analysis number 999999
Compound Code 99
Book Reference 9
Project Code 9>
##$TILT= no
##$TM1= 0
##$TM2= 0
##$TOPLEV= 0
##$USERP1= <user>
##$USERP2= <user>
##$USERP3= <user>
##$USERP4= <user>
##$USERP5= <user>
##$WDW= 1
##$XDIM= 32768
##$YMAX_p= 268335021
##$YMIN_p= -48700
$$ End of Bruker specific parameters
$$ ---------------------------------
##NTUPLES= NMR SPECTRUM
##VAR_NAME=  FREQUENCY,     SPECTRUM/REAL,   SPECTRUM/IMAG
##SYMBOL=    X,             R,               I
##VAR_TYPE=  INDEPENDENT,   DEPENDENT,       DEPENDENT
##VAR_FORM=  AFFN,          ASDF,            ASDF
##VAR_DIM=   32768,         32768,           32768
##UNITS=     HZ,            ARBITRARY UNITS, ARBITRARY UNITS
##FACTOR=    0.157963299565203, 1,           1
##FIRST=     4132.6476996994, 0,             0
##LAST=      -1043.33573715361, 0,           0
##MIN=       -1043.33573715361, -48700,      0
##MAX=       4132.6476996994, 268335021,     0
$$ Real data points
##PAGE= N=1
##DATA TABLE= (X++(R..R)), XYDATA
$$ [...]
16654b1836K826K029Q217m887J13o16L425M26K241M765P251P629j8998j3489P06
16639b0198N745P383m11K640Q921M039K041o521o71j2866l29O418r821L32o15
16624a3913o70J3356K615r13K85J267q089O65j0340K516N616J1429J696N25m730
16609A315J732j2343q281O526J534k825P916J6918N118j8905n952j748O972p002
16595i025j63J0174K026M172l11M362p139r29q574r357R062L789L193L968j661
16580C587N508l094o866M02L189n563Q769R613j0679k7758n715N800O110L523
16566a3174J3051n447O29m267j322m299p033L183l34k161P034J1908j500L803
16552G1L925L856J1707l193k0173K011J2402n152j1675M883j421k2654n835Q277
$$ plain form
16654 -21836 -19010 -16981 -8764 -13651 -13538 -14154 -10729 -10303 -8062 -3297 3954 11583 -7415 -20904 -20198
16639 -20198 -14453 -7070 -7481 -4841 4080 8119 10160 3639 2968 -9898 -10227 -3809 -13630 -13298 -13913
16624 -13913 -14583 -1227 1388 475 760 2027 -6062 -5397 -15737 -13221 -7605 3824 5520 6045 1315
16609 1315 3047 -9296 -17577 -11051 -9517 -12342 -4426 12492 17610 -1295 -7247 -8995 -2023 -9025
16595 -9025 -9188 986 3012 7184 6873 11235 4096 3167 -5407 -14764 -5702 -1913 1280 5248 3587
16580 3587 9095 6001 -865 -463 2726 -2837 5932 15545 4866 -22892 -28607 -22807 -16697 -13174
16566 -13174 -123 -5570 -4941 -9208 -10530 -14829 -21862 -18679 -19013 -21174 -14140 -2232 -3732 71
16552 71 3996 7852 19559 16366 -3807 -1796 10606 5454 -6221 -1338 -2759 -25413 -31248 -22971
16538b2971O349p26m257O527l330M051J2076J0577p601j6306l186j0722l295R068
16524b3746K487M377J0319J2350J061j2371k926l132O596o748M056P765O659K067
16510H814m588j5195N0k809K045J4975R225Q410j2333p594J4046N532n022Q202
16496B3758J0944p695j2581j6087l729n652j3198m40O500O351J0743N202O51L816
16482H583P651m108j1359J217O685k788r366j8772J8598J4351P027M417p713k4598
16468a0175m754k841J514J7851j220j2949j984L504J1224M544j2620j1831L648
16455a6089j026o26K129K872J3253J6877O465n286q849o40l517Q807R311j0737
16441A2944l659k233q849o128R6L127l816j2280J2691J6185k08m423N273Q15j0659
$$ plain form
16538 -22971 -16622 -17348 -21605 -15078 -18408 -14357 -2281 8296 695 -15611 -18797 -29519 -32814 -23746
16524 -23746 -21259 -16882 -6563 5787 6848 -5523 -8449 -11581 -4985 -11733 -7677 88 6747 8814
16510 8814 4226 -10969 -10919 -13728 -11683 3292 12517 20927 8594 1000 15046 20578 15556 23758
16496 23758 34702 27007 14426 -1661 -5390 -11042 -24240 -24680 -18180 -11829 -1086 4116 4767 8583
16482 8583 16234 12126 767 1984 8669 5881 -3485 -22257 -3659 10692 17719 22136 14423 -10175
16468 -10175 -14929 -17770 -16256 1595 375 -12574 -14558 -11054 170 4714 -7906 -19737 -16089
16455 -16089 -17115 -17741 -15612 -12740 513 17390 23855 18569 9720 9080 5563 14370 23681 12944
16441 12944 9285 7052 -1797 -7925 -7829 -4702 -8518 -20798 -8107 8078 7870 3447 8720 9535 -1124
16426a124N06Q237O818j1161j9059m312J8976l787n389O313M110o863Q306o994
16412e423j4253j089J5631J1764P767o560j110j3029P635K564n753K703M575j4264
16398h842P107N526l179q723l052p408k73J3916L976O907k591k568O783Q902j800
16383A4681o416q140r856r457m590Q145J0002n841p507J1261R871O599r07O08
16369H453O653m685K162P222o332l135j398j3854j4132J23L959l280l032J2154
16355i122J4578l794j893N591J897K252j4933j2368j795j0815q2N296j011N646
16341b0553M109j3611J447L514Q641J2475j1605N173k2J016J943K541l076L070
16327d938l092j7793p818M790Q026J8164k817k930j3702j5398P568J1917J7140
$$ plain form
16426 -1124 -618 7619 14437 3276 -15783 -20095 -1119 -4906 -10295 -3982 128 -6735 1571 -5423
16412 -5423 -19676 -20765 -5134 6630 14397 7837 6727 -6302 1333 3897 -1856 847 5422 -8842
16398 -8842 -1735 3791 612 -8111 -11163 -18571 -18844 -4928 -952 5955 3364 796 7579 16481 14681
16383 14681 8265 125 -9731 -19188 -23778 -15633 -5631 -11472 -18979 -7718 2153 8752 7845 8453
16369 8453 15106 10421 12583 19805 13473 10338 8940 -4914 -19046 -18923 -14964 -18244 -21276 -9122
16355 -9122 5456 1662 -231 5360 7257 9509 -5424 -17792 -19587 -30402 -30484 -25188 -26199 -20553
16341 -20553 -16444 -30055 -28608 -25094 -16453 -3978 -15583 -10410 -10432 -9416 -7473 -4932 -8008 -4938
16327 -4938 -8030 -25823 -33641 -28851 -20825 -2661 -5478 -8408 -22110 -37508 -29940 -18023 -883
16314h83N341m219r850j2823m493P040q069j1578O198n70O131J7180L258o21J319
16299f639k863r659L874J411Q263J695p048j494J1347K163r216q13r819p413M900
16284b1311j792K031J1M251O045j425M156O410l086P79q00k0548j0349J4771Q907
16269a1950o685L773j742j1365K866N720J3382J217o755P816J0874n73m419l751
16255a592N006p790o268J2491p591o364j936P508M730j765R87O039J1670N462
16241B0587O434q422j2828J5816o908j8613m797j4967j2598n729J5111K510O98
16228b3706J7723L194q546O037J0999k903j854o149P442M499J5239J2871j1420
16215B3426j1609j8580M89j816J0017q014q952m965K3n694n871O985J698Q221
$$ plain form
16314 -883 4458 239 -9611 -22434 -26927 -19887 -27956 -39534 -33336 -33906 -27775 -10595 -7337 -7958 -6639
16299 -6639 -9502 -19161 -15287 -13876 -5613 -3918 -10966 -12460 -1113 1050 -8166 -8979 -18798 -26211 -21311
16284 -21311 -23103 -21072 -21061 -16810 -10765 -12190 -8034 -1624 -4710 -3931 -4731 -25279 -35628 -20857 -11950
16269 -11950 -18635 -14862 -16604 -27969 -25103 -19383 -6001 -4784 -11539 -3723 7151 6578 2159 -1592
16255 -1592 3414 -4376 -10644 1847 -5744 -12108 -14044 -6536 -1806 -3571 -2584 3455 15125 20587
16241 20587 27021 18599 5771 21587 14679 -3934 -8731 -23698 -36296 -42025 -26914 -24404 -23706
16228 -23706 -5983 -2789 -11335 -5298 5701 2798 944 -5205 2237 6736 21975 34846 23426
16215 23426 11817 -6763 -6274 -8090 1927 -6087 -15039 -20004 -19981 -25675 -31546 -24561 -22863 -14642
16201a4642J0483m01l57O966M489q937M871q156k776j566K629n218N737M669K63
16186a946J408L18N626k207M723p466p010K525r799P728l23k681q170j565J1809
16171g030J0557l441j2526j5595J2437R132j1553j153P016M883R902q10Q829p383
16157C265q352k730p522O660J4849J188m100j1723j6214J0062J1284o385j0916
16144b0634o185K275J2955j796L733L206R976o577r667l71Q250J0161k935q957
16130f566m634J2609m486L529J522j2983L792l89l533k690J1097m945K984j6432
16116b1125J63K237J8234o855L598J7162k695L604j971q525Q256k602l699j0706
16102d924o825K349R659P65l201J809J2408o852k1508q419Q534Q902L540K138
$$ plain form
16201 -14642 -4159 -4560 -4917 2049 6538 -2399 2472 -5684 -8460 -10026 -7397 -12615 -6878 -2209 -1946
16186 -1946 -538 -220 5406 3199 7922 456 -6554 -4029 -13828 -6100 -6423 -9104 -17274 -18839 -7030
16171 -7030 3527 86 -12440 -28035 -15598 -6466 -18019 -19172 -12156 -7273 2629 1819 10648 3265
16157 3265 -5087 -7817 -15339 -8679 6170 7358 3258 -8465 -24679 -14617 -3333 -9718 -20634
16144 -20634 -26819 -24544 -11589 -13385 -9652 -6446 3530 -3047 -12714 -13085 -4835 5326 2391 -6566
16130 -6566 -11200 1409 -3077 452 1974 -11009 -7217 -7606 -11139 -13829 -2732 -7677 -4693 -21125
16116 -21125 -20962 -18725 -491 -7346 -3748 13414 10719 14323 12352 3827 12083 9481 5782 -4924
16102 -4924 -11749 -9400 259 1024 -2177 -368 12040 5188 -16320 -24739 -16205 -7303 -3763 -1625
16088a625j0631k474K016m570o870k612J2254N31L326Q380n487r713J6352M072
16074B949l64m017n96J292k869j1604j880R13K820p7q980N107n712M149R989n019
16058a3899P259J1611M171R367m516j1003n87M707M623j2714m69q310j6267R048
16044a6979J2919j3619j1834J2666J712J197N675k645l972K4J6500P246n191k315
16030A384k074P671O421J3161j314j0967l927K55K894j7072m756k572K335j2215
16016b0776L448J5649J0978j0726p745J2090L013o605L880j813q831O150K802
16003A514l483o05J484N105n212K766J5723P76r594n694J1129j2618m361K396
15989f74J4771R068q032M220Q634m029l453M923n24p176P53n186j51q860l33k420
$$ plain form
16088 -1625 -12256 -14730 -12714 -17284 -24154 -26766 -14512 -13981 -10655 -2275 -7762 -17475 -1123 2949
16074 2949 2585 -1432 -2028 -736 -3605 -15209 -17089 -16176 -13356 -13433 -22413 -17306 -23018 -18869 -8880 -13899
16058 -13899 -6640 4971 9142 18509 13993 2990 2403 7110 11733 -981 -1450 -9760 -26027 -16979
16044 -16979 -4060 -17679 -29513 -16847 -15135 -13938 -8263 -10908 -14880 -14856 1644 8890 3699 1384
16030 1384 -690 6981 13402 26563 25249 14282 10355 10610 13504 -3568 -8324 -10896 -8561 -20776
16016 -20776 -17328 -1679 9299 -1427 -9172 2918 5931 -674 3206 1393 -7438 -1288 1514
16003 1514 -1969 -2574 -1090 4015 -1197 1569 17292 18068 8474 2780 13909 1291 -3070 -674
15989 -674 14097 23165 15133 19353 27987 23958 20505 25428 24904 17728 18481 13295 13144 4284 3951 1531
15973A531o59m6O135J7230m597L060m468m482j1935n913J5009k253r427o903K266
15958e452r532o100P154K571J0901O972Q608p404j724J918n997L999m492L04k623
15943h97q15N881j377M338N69j731m07k839N681M250K2o358k379l0j929m970J1006
15926H015P419j0243R86J6802j2514J0299n422J805o592K653M576o16j260k305
15912A3603k906k867l946j8K382J3285j310n211J2539P089m90j574n010n94Q371
15897C3343l725l902j3977r916o11J445n539J4389J2352K022r188j2428o43L917
15883G539o94j0405m466N364m982L429K745k058J3008M330j0963j0633N075P82
15869a929K667M528K018q645j3939L672J4872K555K679j495m490P631l94m933
$$ plain form
15973 1531 872 826 6961 24191 19594 22654 18186 13704 1769 -4144 10865 8612 -815 -7718 -5452
15958 -5452 -14984 -21084 -13930 -11359 -458 6514 15122 7718 5994 7912 1915 5914 1422 1726 -897
15943 -897 -1712 4169 2792 7130 7699 5968 5561 2722 8403 12653 12675 6317 3938 3908 1979 -2991 8015
15926 8015 15434 5191 6177 22979 10465 20764 15342 17147 10555 13208 17784 17168 15908 13603
15912 13603 10697 7830 3884 3866 6248 19533 18223 13012 25551 32640 32150 30576 25566 24972 33343
15897 33343 29618 25716 11739 1823 1212 2657 -2882 11507 23859 25881 16693 4265 3622 7539
15883 7539 6845 -3560 -8026 -2662 -7644 -4215 -1470 -3528 9480 13810 2847 -7786 -2711 -1929
15869 -1929 738 5266 7284 -1361 -15300 -11628 3244 5799 8478 6983 2493 10124 9730 4797
15855D797j1400p859P252O413j969M144J4003J961q38k65n820l561j848j641M644
15840H013J815J2173M001M816J7349m880k227n949M087K280O08k4874r066O034
15826A4180J1833Q58J4901l204o421m974r797l138J730Q145P35K402m44k990Q674
15811C2490L198r031p801l094j288J926j508n253J9732Q491j020k674q169j3912
15797A2087J597L696j951N455o715m613k121m234O997l240N578J2584k454r128
15783A3538Q303K02k048L226P331N31p207K462l223j089J3414L881j5732J812
15769B5401L401P309L160j0389j5719M963j0664j2892M247J5832M467J0357j173
15756B8300k6052r100J9224J7410m29o165j4451j260R628J8217q224K749j1229
$$ plain form
15855 4797 -6603 -14462 -7210 -797 -2766 1378 15381 17342 16504 16239 10419 6858 5010 3369 8013
15840 8013 9828 22001 26002 30818 48167 43287 41060 35111 39198 41478 42086 17212 8146 14180
15826 14180 26013 26871 41772 38568 32147 27173 17376 14238 15968 24113 24848 27250 26806 23816 32490
15811 32490 35688 26657 18856 15762 14474 16400 14892 9639 29371 37862 36842 34168 25999 12087
15797 12087 13684 17380 15429 20884 14169 9556 7435 3201 10198 6958 12536 25120 22666 13538
15783 13538 21841 22043 19995 23221 30552 31083 23876 26338 23115 22026 35440 39321 23589 25401
15769 25401 28802 36111 39271 28882 13163 18126 7462 -5430 -1183 14649 19116 29473 28300
15756 28300 2248 -6852 12372 29782 29353 23188 8737 7477 17105 35322 27098 29847 18618
15743A8618j2462J5028Q520q686j7516k509P477J019j404J873P035P216Q082N98
15729C2889J1663j451K975M816N941k397p686q861j3393p631R281j954J442k996
15715B2638L814J4470J0234J034n990k613Q56K094l254M314k924q434J2984K444
15701E1667j4581o750R102J4595J886L196j120j2001n524r259o505J2174J7081
15688E3961n135j5451k866J2946j915j5002r714J2070J4572n606j2121k439k233
15675B1067K115J845m250J2019O170l03r695P157Q188n226m011j5801o622O107
15661A8760J8197J566J1511J5692P772j82m531O10J161p929j2815o07o238r600
15647C3367k355P60r97K100K267k002K52r947j1831j279J3363P367Q167J724J6325
$$ plain form
15743 18618 6156 21184 29704 21018 3502 993 8470 9489 8085 9958 16993 24209 32291 32889
15729 32889 44552 43101 46076 50892 56833 54436 46750 37889 24496 16865 26146 24192 25634 22638
15715 22638 26452 40922 51156 52190 46200 43587 44443 46537 43283 47597 44673 36239 49223 51667
15701 51667 37086 30336 39438 54033 55919 59115 57995 45994 40470 31211 24706 36880 53961
15688 53961 48826 33375 30509 43455 41540 26538 16824 28894 43466 37860 25739 23300 21067
15675 21067 23182 25027 20777 32796 38966 38663 28968 36125 44313 39087 35076 19275 12653 18760
15661 18760 36957 38523 50034 65726 73498 73316 68785 69395 70556 62627 49812 49205 42967 33367
15647 33367 31012 31772 30775 32875 35142 33140 33392 23445 11614 10335 23698 31065 39232 40956 57281
15632E7281O873k662k897j355m223q407l552q253l32j732N706J1827J4018P859
15618G0151k292r349k4633j7713J4568M045q298j1956o438N821J4047K4052R141
15605F1146l592n808R35J4489r059j2778J09P146Q668Q817j3594j0985P204N383
15591E8081l2L60J4742L8k0515j6124R800K0727R907j1541o078L813n45j786j937
15576E8910q687Q700Q507L347K549L07q052j4657j7446Q95R253P555k916q296
15562C9969j1090K124J5749J8822K142j7219l753N978N383J905K28J45l916M411
15548F0878K015N322j645r302J7416O202K562N296j625r622j0063P573j7307r177
15534D8523R169J6345L644o554K671n934K051J2570j378l736J3086P931j5715
$$ plain form
15632 57281 64154 61492 58595 57240 53017 44610 41058 32805 32473 30741 36447 48274 62292 70151
15618 70151 67859 58510 33877 16164 30732 34777 26479 14523 8085 13906 27953 52005 61146
15605 61146 57554 51746 52681 67170 58111 45333 45442 52588 61256 70073 56479 45494 52698 58081
15591 58081 58049 58409 73151 73189 52674 36550 46350 67077 76984 65443 59365 63178 62633 60847 58910
15576 58910 50223 58923 67430 70777 73326 73633 65581 50924 33478 34373 43626 51181 48265 39969
15562 39969 28879 31003 46752 65574 67716 50497 46744 52722 58105 60010 60238 60383 56467 60878
15548 60878 62893 68215 66570 57268 74684 80886 83448 88744 87119 77497 67434 75007 57700 48523
15534 48523 57692 74037 77681 71127 73798 67864 69915 82485 81107 77371 90457 98388 82673
15521H2673j1812K492L667K929q294J0106M011o740n404o52l5j2724n515J9349
15507G4051R880o867j4536O103l821m852R101J6581o42n226m962O063K655q702
15493G4826o474o806J6435J194n392J5470J3175M621J0524k262j1906R23j0494
15480I3834q785L782n986j343R17O473k182Q064J969o347p94j4886N510J322J3860
15465I5408J2583k221O722l107p304p757L284O247J2184N673j5948l63m015r38
15451A00448P25J433l692k568J948m692J083r80N61k422O38j9233L832J9246Q622
15436A04949r9N380J153R19K613j912j4196l587m743M484J650j6070l35M987q517
15421G6676L476J7209R789O045P106n486m71q945j26N028K565p042M470M91j1566
$$ plain form
15521 82673 70861 73353 77020 79949 71655 81761 85772 79032 73628 72976 72941 60217 54702 74051
15507 74051 83931 77064 62528 68631 64810 59958 69059 85640 84998 79772 74810 80873 83528 74826
15493 74826 68352 61546 77981 79175 73783 89253 102428 107049 117573 115311 103405 104328 93834
15480 93834 85049 88831 82845 81502 82419 88892 86710 94774 96743 90396 89602 74716 80226 81548 95408
15465 95408 107991 105770 112492 109385 102081 94324 97608 103855 116039 121712 105764 105401 101386 100448
15451 100448 101173 102606 98914 96346 98294 93602 94685 93705 94266 91844 92482 73249 77081 96327 104949
15436 104949 104850 110230 111383 112302 114915 113003 98807 95220 90477 94961 96611 80541 80206 85193 76676
15421 76676 80152 97361 107150 113195 120301 114815 114344 105399 105273 110301 112866 105824 110294 110785 99219
15406I9219j731O833J4659m148j0109n430p342K890R184J0744O180K781K209n234
15392A20705j3751J328M945l856L49k279K444k160j7273p829O916P665N700O543
15378A09447k675j5235P654O545K5266O79j0323K791L228L150q006j0333p439
15365A04749j6019K454l977J6573Q497l374P827L860q585j750Q75M116n526k702
15351A07018M60N474o756m337l786p44J194l463M658P514L580J262l614J280o459
15336A03281J1714L467j8527j5571r261K657J447j806J0280P16m684R135J4480
15323A07328M572k833q209J242o436n581m397N021J0423J7406p883m373j3722
15310I2558p111J9086J506j8656k643L552m06o216l018J9173P061j967M44Q14
$$ plain form
15406 99219 97488 104321 118980 114832 104723 99293 91951 94841 104025 114769 120949 123730 125939 120705
15392 120705 106954 108282 113227 109371 109720 107441 109885 107725 90452 82623 89539 97204 102904 109447
15378 109447 106772 91537 99191 105736 131002 131681 121358 124149 127377 130527 122521 112188 104749
15365 104749 88730 91184 87207 103780 112277 108903 116730 120590 112005 110255 111130 115246 109720 107018
15351 107018 107478 112952 106196 101859 98073 97329 98523 95060 99718 107232 110812 112074 108460 109740 103281
15336 103281 114995 118462 99935 84364 75103 77760 79207 77401 87681 88397 83713 92848 107328
15323 107328 111900 109067 100858 102100 95664 90083 85686 90707 101130 118536 110653 106280 92558
15310 92558 85447 104533 106039 87383 84740 88292 87886 81670 78652 97825 104886 102919 103363 104177
15296A04177k782J085k26Q322J3663j6018r014p497K37P771j3451o304l785k622
15282G3556J902j545p773R661O886P895M296k332k292k63Q838q772q074m525Q536
15267H5994j1300O170J0563q31q199l894J071n959k354J0794N240j8487o97K143
15253G0254l936P926K588p806J2106P486N003j0449k917m163r450K598J2531j0450
15239G1321j2833L491O721q66p937J190N651q27N875J187N69K491j0297j0973
15225E4763m624P300J0513P614L596j2649q598J2598O398j9263m792L018p642
15212D8232j656O665P610j566N746M301n416k847n444j668k014k378R327J128
15198F0020K137K005m337L695q00j919N672j620P087m227o783N72K870l608Q966
$$ plain form
15296 104177 101395 102480 102254 110576 124239 108221 99207 91710 91947 99718 86267 79963 76178 73556
15282 73556 75458 73913 66140 75801 82687 90582 94878 92546 90254 89991 98829 90057 81983 77458 85994
15267 85994 74694 80864 91427 90596 82397 78503 79574 73615 71261 82055 87295 68808 68111 70254
15253 70254 66318 74244 76832 69026 81132 88618 93621 83172 80255 76092 66642 69240 81771 71321
15239 71321 58488 61979 68700 67834 59897 61087 66738 65911 71786 72973 73542 76033 65736 54763
15225 54763 50139 57439 67952 75566 79162 66513 57915 70513 76911 57648 52856 55874 48232
15212 48232 46576 53241 60851 59285 65031 69332 63916 61069 55625 53957 51943 49565 58892 60020
15198 60020 62157 64162 59825 63520 62720 60801 66473 64853 71940 67713 60930 61502 64372 60764 69730
15183F9730J2779P478j8247k1826K324J1910J1526j3127l727P083R703j497l650
15170G0459j4589j0077P605p027p568J6692J7559K393n475L630l865q926p737
15157E3074p991o790Q93j106Q855J6344p434j2943J9622J3120k385j123j215L000
15143G3921r773k228P185P133J438K540j8361K332n387j0680J75R290J97J1593
15129F9375J6231K379j2314p532o045j6025o060O082P994m887L462J261j252Q016
15115F0685J565j1263m738k307k799L536k97m445o092p359J690O620P050K204
15101D4050n925J0874N512N587Q960p576j6695q025M761J0931n063j2024j476
15088C3891R615J708k180K516p955J0492M154r583O413N269q537n28j479n922
$$ plain form
15183 69730 82509 89987 71740 49914 52238 64148 75674 62547 58820 65903 75606 74109 70459
15170 70459 55870 45793 53398 46371 38803 55495 73054 75447 69972 73602 69737 60811 53074
15157 53074 45083 38293 39186 38080 46935 63279 55845 42902 62524 75644 73259 72136 70921 73921
15143 73921 64148 61920 69105 76238 77676 80216 61855 64187 58800 48120 48295 57585 57782 69375
15129 69375 85606 87985 75671 68139 62094 46069 40009 46091 54085 49198 52660 53921 52669 60685
15115 60685 62250 50987 46249 43942 41143 44679 44382 39937 33845 26486 28176 34796 41846 44050
15101 44050 38125 48999 54511 60098 69058 61482 44787 36762 41523 52454 47391 35367 33891
15088 33891 43506 45214 43034 45550 37595 48087 52241 42658 49071 54340 45803 45275 43796 37874
15074C7874q163J407N20N825l273j1743o444R823K1123R573p359K631p845p89
15060D3160o448L928J4307m863r080l249m384Q32J3431J1475j2424n149j2040
15047B9496Q82l059J310j1884M819J0031Q554O84j2869L268Q742M905J825o902
15033C9802q341M972j1488K869N081J3801J127l960n276L219m985M147K753Q859
15019E2580R472j340k3747j2652r22M802O402M289J0347k0252K945R964j3158
15006B8730N4O271o616p673k0J2074r933n294N18K700O514L920J540L004j0036
14991B5753j2908L513Q749P855k331J0521j8981q833J2912R386J0183m333o802
14978C4684N388r231j2577j102k573l110J0974K779j822O148n00J2249n463j0143
$$ plain form
15074 37874 29711 31118 31638 37463 34190 22447 16003 25826 46949 56522 49163 51794 43949 43160
15060 43160 36712 40640 54947 50084 41004 37755 33371 34203 47634 59109 46685 41536 29496
15047 29496 30378 27319 28629 16745 21564 31595 40149 40833 27964 31232 39974 44879 46704 39802
15033 39802 31461 36433 24945 27814 32895 46696 47823 43863 38587 41806 36821 40968 43721 52580
15019 52580 62052 60712 36965 24313 23391 28193 34595 38884 49231 28979 31924 41888 28730
15006 28730 28784 35055 28439 20766 20746 32820 22887 17593 18111 20811 27325 31245 32785 35789 25753
14991 25753 12845 16358 25107 32962 30631 41152 22171 13338 26250 35636 45819 41486 34684
14978 34684 40072 30841 18264 17162 14589 11479 22453 25232 23410 29558 29058 41307 35844 25701
14964B5701R396p569j4915J3367J2009l990r835K159J617j2039j478L450O432
14951B4305j5887j4951M126K2030M943r752k858k984L151Q297j1882K80O83P575
14937A7076N650m591l816N394n60q397L525P017J0607n070m123P225j1511j8197
14923B29K822M720L817k698o88j710r087M088L914q86N774l08j606J1485k04j005
14907A8657M29j3218Q972J5069M142J779N865l803j3797r342M62R685N79O058
14893C1537k0351l641P054K379l574p174l232K194j0476k673N533J0230L34N45
14879H685o558J0124m772K471R612o497P857j025J558N661p270k004L01j3042
14865E101o784M486Q749K446O069P227O21r8m563N889J451l840l683j480j6478
$$ plain form
14964 25701 35097 27528 12613 25980 37989 33999 24164 26323 27940 15901 14423 17873 24305
14951 24305 8418 -6533 -2407 19623 24566 14814 11956 8972 12123 20420 8538 8818 9501 17076
14937 17076 22726 18135 14319 19713 19153 10756 14281 21298 31905 26835 22712 29937 18426 229
14923 229 3051 7771 11588 8890 8202 6492 -2595 1493 5407 4521 10295 9987 8381 19866 19662 18657
14907 18657 19086 5868 14840 29909 34051 35830 41695 37892 24095 14753 15215 24900 25479 31537
14893 31537 11186 7545 14599 16978 13404 6230 2998 5192 -5284 -7957 -2424 7806 8140 8685
14879 8685 2127 12251 7479 9950 19562 13065 20922 19897 21455 27116 19846 17842 18143 5101
14865 5101 -1683 2803 11552 13998 20067 27294 27915 27817 23254 29143 30594 26754 23071 21591 5113
14850E113j0070m255q475r270P562M642N583K3366J0608q653j7134j3948p307
14837b2238J4130O701m102N737l51k307l326J5471K511m39Q531j036o330M303
14823A7255r203j6586O427K1381J4639P626k315q021j5678o554j2783j005L219
14810a598J970J6366j500J0934J943l049j842j0733l385J1457O814q404n573m349
14796I051q209N468K2154J5416M147J625j7557l119j723K070m152L15N69j517
14782B4538j1172K475j239Q737n65m127M104J1172m622m461j2005j032K2196p274
14768B6725j0720j77j69l392n219O86N195J6648O598j1732k4983l455J9282M889
14754B0176k913K829o758J4o522M189j281m763j0823j7516O480K725Q77M557Q875
$$ plain form
14850 5113 -4957 -9212 -17687 -26957 -19395 -14753 -9170 14196 24804 16151 -983 -14931 -22238
14837 -22238 -8108 -1407 -5509 228 -123 -2430 -5756 9715 12226 11787 20318 19282 12952 17255
14823 17255 8052 -8534 -2107 19274 33913 41539 39224 31203 15525 8971 -3812 -4817 -1598
14810 -1598 372 16738 15238 26172 28115 25066 23224 12491 9106 20563 27377 18973 13400 9051
14796 9051 842 6310 28464 43880 48027 49652 32095 28976 27253 29323 25171 25486 26055 24538
14782 24538 13366 15841 14602 23339 22774 18647 22751 33923 29301 24840 12835 11803 33999 26725
14768 26725 16005 15828 15659 12267 7048 7734 12929 29577 36175 24443 -540 -3995 15287 20176
14754 20176 17263 20092 13334 13348 6826 11015 9734 4971 -5852 -23368 -16888 -14163 -13286 -8729 146
14739A46J0054L95Q609J4966O447K562j6084m647J85o509j2284p468Q279Q564
14725A3215K626J301m23M26q193k856o232M377O855n142j1984k417L719J140j074
14710d662J3681k134J438k605K447P519J652L576j258n448o117o265J3277N984
14696B1085k749O991j4816N158J8387L258j7191N134O69j9722m728J505N631M08
14682I020Q05Q217M492l391o412P129J0119L401o891O19o173p236o208P858l488
14667A1861p799R34J2062q669m619R01J0360O919K952P37P693k2059o209L899
14653H963L175l221J0610J0733j0520j564J2762R161L49l015m11j373J1318O076
14639E3043j2335k0312p776j235j2456J0677p425m32L628O60j272j4298j1245
$$ plain form
14739 146 10200 10595 19204 34170 40617 43179 27095 22448 22633 16124 3840 -3628 4651 13215
14725 13215 15841 17142 16719 17145 8952 6096 -136 4241 11096 5954 -6030 -8447 -4728 -3588 -4662
14710 -4662 9019 6885 8323 5718 8165 15684 17336 20912 19654 14206 8089 1824 15101 21085
14696 21085 18336 25327 10511 15669 34056 37314 20123 25257 25926 6204 1476 2981 8612 9020
14682 9020 9825 18042 22534 19143 12731 19860 29979 33380 26489 27108 20935 13699 7491 15349 11861
14667 11861 4062 4996 17058 8389 3770 4671 15031 21950 24902 25639 33332 11273 5064 8963
14653 8963 12138 8917 19527 30260 19740 18176 30938 40099 40448 37433 37022 35649 46967 53043
14639 53043 40708 20396 12620 11385 -1071 9606 2181 1749 5377 6037 4765 -9533 -20778
14626b0778L039J3725m17Q473K4323J2222j421l941j4919j0437R763J3996J0344
14613D3972k438j7279N95O439j605j2548r152o382J5791R756J374K622j0535o174
14599A4436o59J673n052J695J0594q68K567l025o79P602j6789j0677J0804k509
14585I113Q740J1182R350k564j3515K138j5661j3465Q084Q229j8438K116J2941
14572H250J2825O771o298o301Q385p026L563k134m360J3957r69n701J71J199J804
14557B4136l448n922L958n981j9568N709J4995P713o816k319M979R886L106l793
14543B6635o528n294R374L826r048j719R227j5198j3478o426Q05L212K1378J5892
14529C2658K762P153p124l933j1264p043R627l254M649K702j1454K674P713R0
$$ plain form
14626 -20778 -17739 -4014 -4431 4042 28365 40587 39166 35225 20306 9869 19632 33628 43972
14613 43972 41534 24255 24850 31289 29684 17136 7984 1602 17393 27149 28523 31145 20610 14436
14599 14436 13777 15450 10398 12093 22687 21819 24386 21361 20682 28284 11495 818 11622 9113
14585 9113 17853 29035 38385 35821 22306 24444 8783 -4682 3402 11631 -6807 -4691 8250
14572 8250 21075 27846 21548 15247 23632 16606 20169 18035 13675 27632 26663 20962 21133 22332 24136
14557 24136 20688 14766 18724 12743 -6825 -1116 13879 21592 14776 12457 17436 27322 30428 26635
14543 26635 20107 14813 24187 28013 18965 17246 26473 11275 -2203 -8629 -7824 -4612 16766 32658
14529 32658 35420 42573 35449 31516 20252 13209 22836 19582 24231 26933 15479 18153 25866 25956
14515B5956j124l405j2841O826R815r335J395p25P710J39N920l700o458j109r163
14500I901P08L236j9K488J3508n188m205j396P34J1594J816j0303j5690P368M843
14485A9395m418o442n359N637p84m114R087j74j0235m575K381J1499R114P45K040
14470B3797l066m897j03n72p043l630O936O332P0L283J2660J0713L029O963j8427
14455C6045l729m209r538j3396O02J3564l372m098J4834L898j6842k076K1652
14442C3335Q030k304Q864p137q863N29k400J258O81R900L420j2342k4186o671
14428B114R487J0323k790J964j6937R848J8326R299n798k3583j1855J6031l398
14415A3031n609K0466O001k522J864J507N668k794n664K721L351O16J1019M790
$$ plain form
14515 25956 24832 21427 8586 15412 25227 15892 17287 16562 24272 24411 30331 26631 20173 19064 9901
14500 9901 10609 13845 13826 16314 29822 24634 20429 19033 19767 31361 33177 22874 7184 14552 19395
14485 19395 14977 8535 3176 8813 8029 3915 13002 12828 2593 -1982 399 11898 21012 21757 23797
14470 23797 20731 15834 15731 15159 8116 4486 11422 17754 17824 21107 33767 44480 47509 54472 36045
14455 36045 32316 28107 18569 5173 5775 19339 15967 11869 26703 30601 13759 11683 33335
14442 33335 41365 39061 47925 40788 31925 32454 30054 31312 31993 41893 45313 32971 8785 2114
14428 2114 11601 21924 19134 21098 4161 14009 32335 41634 35836 12253 398 16429 13031
14415 13031 7422 27888 33889 31367 33231 34738 40406 37612 31948 34669 38020 38636 49655 54445
14401E4445j4021j5730r738L022K0375J0722j1525j361l640n023n873k280n681
14388A3692J2948l013j0178k013N398J1015L026o56P333j514L719K326k994n77
14374C8512r730N211k063p934r332P780J4787j36o826J0232K735p545q124Q245
14360C5812J4296p160j1170N966P626L520N635q0K457J316r459j7528o68J8387
14346D8950q891K936J0095M058j449J375M295l37J493n090k46o067L275J0781
14332F5178j1869j7882J0695J8926m597j4142L586j790q840j097M107K685M68
14319D5428o174N513Q423j1087q809O803r948m178J4790J892M180n312k471J8437
14305E7487P531j7306o363q324M84J4341J2414j2650k964Q31k437k376M286J0988
$$ plain form
14401 54445 40424 24694 14956 17978 38353 49075 37550 36189 32549 27526 21653 19373 13692
14388 13692 26640 23627 13449 11436 16834 27849 30875 30219 37552 36038 39757 42083 39089 38512
14374 38512 28782 33993 31930 23996 14664 22444 37231 37095 30269 40501 43236 35691 27567 35812
14360 35812 50108 42948 31778 37744 45370 48890 54525 54445 56902 58218 48759 31231 30563 48950
14346 48950 40059 42995 53090 57148 55699 57074 61369 61032 62525 57435 57189 51122 54397 65178
14332 65178 53309 35427 46122 65048 60451 46309 49895 48105 39265 38168 42275 44960 45428
14319 45428 39254 44767 53190 42103 33294 40097 30149 25971 40761 42653 46833 41521 39050 57487
14305 57487 65018 47712 41349 33025 33509 47850 60264 47614 44650 45481 43044 40668 44954 55942
14291E5942J928q240j1244j941J8458J2566j0605j324j7414j2577N137m42l468
14278B6776N019J5752J3251L653j5805j6934Q228J4583J306J037p04R29j2849
14265D4242q957N462j0660m051J7819R068M184Q478J13r349j9574j5951K0967
14252D1791J3188m954K160o60J1245J920r684m903o931M693L147Q274p329m366
14238D7591L948r464N667r46r294r391n152K3020j528k314O137l946p60O659N122
14223E5349n993K792O667j3362P409J8628M736j1020j3423j4228l49J3240K889
14210E3335j045J023L600J1309k401P820q253p799J0087Q848j3192j859r336K263
14196E4400J3474n290N691j46L212m708p629O055J368J253j0675m546J4418k154
$$ plain form
14291 55942 57870 49630 38386 36445 54903 67469 56864 55540 38126 25549 30686 30244 26776
14278 26776 31795 47547 60798 64451 48646 31712 39940 54523 55829 56866 56162 57091 44242
14265 44242 35285 40747 30087 26036 43855 52923 57107 65585 65698 56349 36775 20824 41791
14252 41791 54979 50025 52185 51525 62770 64690 55006 50103 43172 47865 51012 59286 51957 47591
14238 47591 51539 42075 47742 46796 37502 28111 22959 45979 44451 42137 48274 44328 43568 50227 55349
14223 55349 49356 52148 58815 45453 52862 71490 76226 65206 51783 37555 37206 50446 53335
14210 53335 52290 53313 56913 68222 65821 73641 65388 57589 67676 76524 63332 61473 52137 54400
14196 54400 67874 62584 68275 68129 71341 66633 59004 65059 66427 67680 57005 52459 66877 64723
14182F4723R543O894j0025m020J9389j5075j7062k322N700J7526o598L775Q719
14169H1167j334j3021L582l336p24P765J814J780q13k77r604l762L035p366l800
14154E5106J7284n606n077R568L598j949q390j1645N821j162k392l324K285J0045
14140F4162J6416j087r45k922m426O684L216J354k958q407j6601J377J272J090
14126E8225M122j5452q01Q482J5971R797K659r169K791O262J2559N607j3438j5697
14112G1918J0979j261p624J1299R026n111p234l504J7060O244p739k915l255J972
14098H9855N552k259J0086P171j031M043n901q298K374k509K5222l458j2740j1303
14084I6804O641M719J0985m992m517r803n667R449j2559Q692L190j448O093J582
$$ plain form
14182 64723 74266 81160 71135 67115 86504 71429 54367 52045 57745 75271 68673 72448 81167
14169 81167 79833 66812 70394 67058 66334 74099 75913 77693 76880 76603 66999 63237 66272 58906 55106
14154 55106 72390 66784 61707 71275 74873 72924 64534 52889 58710 57548 55156 51832 54117 64162
14140 64162 80578 79491 78546 75624 71198 77882 81098 82452 79494 71087 54486 55863 57135 58225
14126 58225 62347 46895 46094 54576 70547 80344 83003 73834 76625 82887 95446 101053 87615 71918
14112 71918 82897 81636 74012 85311 94337 89226 81992 78488 95548 101792 94053 91138 87883 89855
14098 89855 95407 93148 103234 110405 109374 113417 107516 99218 101592 99083 124305 120847 108107 96804
14084 96804 103445 108164 119149 114157 109640 99837 94170 103619 91060 99752 102942 101494 107587 109169
14070A09169r246J362L625j873m087O526N808K153r703K455J2247j735j2332j4538
14056H9831Q664J6825J3619j3938k467O318n895K731q250m889Q669L251q52K122
14042A15739j94M037M38j696r424m045j1672L989J8236J2362L811m648Q65M769
14028A32567M79o619J1773J523k186o318p383P491K929J043J67N67n99r349J663
14013A27748J3550l354r553r053j4363J0326J51m111N626J1288l757J1614r4n485
13999A30533m356M194J2060L818o323R33J1113J4718j3011m812J445q550k495
13986A39267l199q497r76R286M052M133l911k779J1159l250L590o255k052K540
13972A43108J4547J049j051J5661L810J459k06J0467J457m551j0849n440N024
$$ plain form
14070 109169 99923 101285 104910 103037 98950 105476 111284 113437 103734 106189 118436 116701 104369 89831
14056 89831 98495 115320 128939 115001 112534 118852 112957 115688 107438 102549 111218 114469 113617 115739
14042 115739 115545 119582 120020 118324 108900 104855 93183 97172 115408 127770 131581 126933 127798 132567
14028 132567 133046 126427 138200 139723 137537 131219 123836 131327 134256 135299 135466 136033 135434 126085 127748
14013 127748 141298 137944 128391 119338 104975 115301 115452 111341 116967 128255 124498 136112 136018 130533
13999 130533 126177 130371 142431 146249 139926 140859 151972 166690 153679 148867 150312 141762 139267
13986 139267 136068 127571 126595 135881 139933 144066 140155 137376 148535 145285 148875 142620 140568 143108
13972 143108 157655 158704 157653 173314 177124 178583 178377 188844 190301 185750 174901 169461 174485
13959A74485L333n272N501L230J3273l226M645l328N03K511J578q430k187P935
13945A94551j4145M627J2572n738k784Q603J4919m943j0733O952R325j7560q486
13932A87160l206M053J7633N350n966o599j0594K837j2039K1989P649J832Q220
13919B18319Q06p319r169J4252J4270O87j0712q574j4399l039K242O153N328R439
13905B18284Q302Q329M390m732N960L303J3810O757Q646j6863j2966j1892Q143
13892B39471O682P749J6227n51o56n848R691J0171n602n428N325L723k016j0816
13878B68122k70J3331M48J482K2J6143J4747j6573p662R167O093Q470P100Q679
13864C29299J3958N6M276o323j3059j0754O33J496O693J629O56J1393J5327O699
$$ plain form
13959 174485 177818 172546 178047 181277 194550 191324 195969 192641 193144 195655 197233 188803 186616 194551
13945 194551 180406 185033 197605 191867 189083 197686 212605 207662 196929 203881 213206 195646 187160
13932 187160 183954 188007 205640 210990 205024 198425 187831 190668 178629 200618 208267 210099 218319
13919 218319 219125 211806 202637 216889 231159 231846 221134 212560 198161 195122 197364 203517 208845 218284
13905 218284 226586 234915 239305 234573 240533 243836 257646 264403 273049 256186 243220 231328 239471
13892 239471 246153 253902 270129 269578 268922 263074 272765 282936 277334 271906 277231 280954 278938 268122
13878 268122 267852 281183 281631 283113 283135 299278 314025 297452 289790 298957 305050 313520 320620 329299
13864 329299 343257 343313 347589 341266 328207 317453 318086 319582 326275 327904 328560 339953 355280 361979
13850C61979j2316j1314P158j070L848j384p92m761M028M143j464j521J4157J078
13836C61769m918K581O027M580J1475P420K417J2309L452k983k586j480M35O049
13822D06547R472N254P967m998O414J2675n754j75P458K989N52L855J8114J7577
13808D87947K0964L958l088Q461L9255K7536L7906M5517M8010O1441L8632l852
13796H12687n1906p3895n5922l2248k2333j3736R570l347n354O192K025Q718Q66
13783E81317N511P290R55J3519P48j6720L735J3273J2874m038P904K3182N754
13770F55304k656j799N057J4266Q129L288N177M117J2660O955l513K0729m730
13757G22984k790J4588J1887J2671R929R544K761j725j93N249n16J1291L3633
$$ plain form
13850 361979 349663 338349 345507 344437 348285 346901 346109 341348 345376 349519 348055 346534 360691 361769
13836 361769 356851 359432 365459 370039 381514 388934 391351 403660 407112 404129 401543 400063 400498 406547
13822 406547 416019 421273 429240 424242 430656 443331 437577 437402 444860 447849 448401 452256 470370 487947
13808 487947 508911 512869 509781 518242 557497 585033 622939 668456 716466 777907 816539 812687
13796 812687 760781 686886 630964 598716 576383 562647 572217 568870 563516 569708 571733 580451 581317
13783 581317 586828 594118 595073 608592 609340 592620 596355 609628 622502 618464 626368 649550 655304
13770 655304 652648 650849 655906 670172 678301 681589 686766 690883 703543 710498 706985 727714 722984
13757 722984 720194 734782 746669 759340 769269 778813 781574 779849 779656 784905 784389 795680 829313
13744H29313O513K690P698j643R927Q184N400L827J0259J6444M590K583J2061
13731I17846K2923K4857j112M945J0242O709K109K2235J0667M971N532J1917M669
13718A048510j0373M143K1550J9650J5517J5210L614K0391J6381N338L790l12
13706A163409O682J7979Q485R945O951R917K3765J0357K124p022N89L3656K7342
13693A314179N362K629J3019J8509Q405J2867Q182J8232K8257L529J2203J7486
13681A462859J5795P824R036Q589P156K9781J4550J3171L3969J5607M17J8329
13669A637083J4895J1010J8656K7515J8868J3408K3770K3676K1705J1839K1447
13658A843872L3873L1723J6128L1003K5492K0496K3857K3001L3310J5126K4611
$$ plain form
13744 829313 835826 838516 846214 844571 854498 862682 868082 871909 882168 898612 903202 905785 917846
13731 917846 940769 965626 964514 969459 979701 986410 988519 1010754 1021421 1026392 1031924 1043841 1048510
13718 1048510 1038137 1042280 1063830 1083480 1098997 1114207 1117821 1138212 1154593 1159931 1163721 1163409
13706 1163409 1170091 1188070 1196555 1206500 1213451 1223368 1247133 1257490 1259614 1252592 1253181 1286837 1314179
13693 1314179 1319541 1322170 1335189 1353698 1362103 1374970 1383152 1401384 1429641 1433170 1445373 1462859
13681 1462859 1478654 1486478 1495514 1504103 1511259 1541040 1555590 1568761 1602730 1618337 1618754 1637083
13669 1637083 1651978 1662988 1681644 1709159 1728027 1741435 1765205 1788881 1810586 1822425 1843872
13658 1843872 1877745 1909468 1925596 1956599 1982091 2002587 2026444 2049445 2082755 2097881 2122492
13647B122492M2784L5940J5438K0074L5553K4946L7674L3784K5989L2202M4821
13636B471697L5522L8388L8280M4813M4814M0956L9089M2566M8071N0625L5999
13625B930820L3363M5712N3506N8112M8982N1473N1732M8350O4460M2226L8695
13614C467431O2229N8951O7003O4825N2709P0029Q0869Q2996P0137N8238O0049
13603D195466P7539R0561P4956O9484Q8020Q2088Q5048R4864R1858R5147R2103
13592E137134R5167J11097J10830J00164R9378P9365R7950J22435J11262J15490
13582F180272J18147J09691J21666J15096J26029J35067J25129J27124J26579
13573G284800J31987J20581J25186J21409J46586J42610J31775J31988J32063
$$ plain form
13647 2122492 2165276 2201216 2216654 2236728 2272281 2297227 2334901 2368685 2394674 2426876 2471697
13636 2471697 2507219 2545607 2583887 2628700 2673514 2714470 2753559 2796125 2844196 2894821 2930820
13625 2930820 2964183 3009895 3063401 3121513 3170495 3221968 3273700 3322050 3386510 3428736 3467431
13614 3467431 3529660 3588611 3655614 3720439 3773148 3843177 3924046 4007042 4077179 4135417 4195466
13603 4195466 4273005 4363566 4438522 4508006 4596026 4678114 4763162 4858026 4949884 5045031 5137134
13592 5137134 5232301 5343398 5454228 5554392 5653770 5733135 5831085 5953520 6064782 6180272
13582 6180272 6298419 6408110 6529776 6644872 6770901 6905968 7031097 7158221 7284800
13573 7284800 7416787 7537368 7662554 7783963 7930549 8073159 8204934 8336922 8468985
13564H468985J39922J41882J40386J40906J24046J19678J26271J24488J37430
13555I663994J25604J12220J13200J08389R6792R7746J00683R9165R3051R1569
13545A0702413P7359O5759O1030N2426O1942N2164M0159K5376K8075K2341r425
13534A1179619j5543J073r053l2920k9334k3888k4679n9823o9045o8567p8313
13523A0769527p2602p9954q8683r4749r5916q3546r0293j17601j15117j20716
13513I810350j26018j23004j24782j25299j23509j30110j31215j30422j32771
13504H663220j34688j15514j22689j35179j45094j48497j36985j19758j19377
13495G485439j14571j17107j21937j27784j35557j16530j06300j17323j13879
$$ plain form
13564 8468985 8608907 8750789 8891175 9032081 9156127 9275805 9402076 9526564 9663994
13555 9663994 9789598 9901818 10015018 10123407 10220199 10317945 10418628 10517793 10610844 10702413
13545 10702413 10779772 10845531 10906561 10958987 11020929 11073093 11113252 11138628 11166703 11189044 11179619
13534 11179619 11164076 11165149 11156096 11123176 11093842 11069954 11045275 10985452 10916407 10847840 10769527
13523 10769527 10696925 10616971 10528288 10433539 10337623 10254077 10163784 10046183 9931066 9810350
13513 9810350 9684332 9561328 9436546 9311247 9187738 9057628 8926413 8795991 8663220
13504 8663220 8528532 8413018 8290329 8155150 8010056 7861559 7724574 7604816 7485439
13495 7485439 7370868 7253761 7131824 7004040 6868483 6751953 6645653 6528330 6414451
13486F414451j30833j24932j21206j03132q9237r2782j11275j23405r5176q8793
13476E333680r6296q7259r2975j03065r4363p4353p6438q0927r2120q1753q4146
13465D369985p4859o9305o0025p5381p3973o6546o9628o8380n7501p8206o5246
13454C610935o1002o2622n9761n0599n0789m1806o2191p0653m2099l2879m1270
13443C035264l9837m0736n6484n9213m4289n3039n4299l8330l7761l6344l2051
13432B542881l6944l6643l7705m3620l2315k8392l9401l3325m0943m3206k3650
13421B146737j2194k4013m1705l9265k4363k5249k6123l0735p655j9761k6907
13410A868767k9396l3795m5901k3084n565r120j5206l1365k3317j9923j8720j4430
$$ plain form
13486 6414451 6283618 6158686 6037480 5934348 5845111 5752329 5641054 5517649 5422473 5333680
13476 5333680 5237384 5150125 5057150 4954085 4859722 4785369 4708931 4628004 4535884 4454131 4369985
13465 4369985 4295126 4225821 4165796 4090415 4016442 3949896 3880268 3811888 3754387 3676181 3610935
13454 3610935 3549933 3487311 3427550 3376951 3326162 3284356 3222165 3151512 3109413 3076534 3035264
13443 3035264 2995427 2954691 2898207 2838994 2794705 2741666 2687367 2649037 2611276 2574932 2542881
13432 2542881 2505937 2469294 2431589 2387969 2355654 2327262 2287861 2254536 2213593 2170387 2146737
13421 2146737 2134543 2110530 2068825 2029560 2005197 1979948 1953825 1923090 1915435 1895674 1868767
13410 1868767 1839371 1805576 1759675 1736591 1731026 1721906 1706700 1675335 1652018 1632095 1613375 1598945
13398A598945k386L038l4048l1442l3498l2786k0302m087o608q755j2762j5358
13386A399951k3096l2389p352j8438k2022j015j2802k3665j8526j6467M491j5360
13374A213310k8372k6256k0451j2941j2390j3459r939P378l446k0617k1676J842
13362A052983l407k8269o904R875L01N563j5951j7349j0889q003j7965j9277j4628
13349I26080j6764p055o854m893m976p966j6248q146l913j3096j6645l636j5687
13336H00201j6773K744j0788j1430J7510k958j2729j5209k57N207l988k5999j7034
13323G08497p258j0470O054P592j1408j2326j1346j5053l427O999J6446l586k4688
13310F46026j9980K05O240j5239%J1254j898q682j0386j7946J166K490o261k4488
$$ plain form
13398 1598945 1596559 1599597 1565549 1534107 1500609 1467823 1447521 1443434 1436826 1428071 1415309 1399951
13386 1399951 1376855 1344466 1337114 1318676 1296654 1295639 1282837 1259172 1240646 1224179 1228670 1213310
13374 1213310 1184938 1158682 1138231 1125290 1112900 1099441 1089502 1096880 1093434 1072817 1051141 1052983
13362 1052983 1049576 1021307 1014403 1024278 1024579 1030142 1014191 996842 985953 977950 959985 940708 926080
13349 926080 909316 902261 895407 890514 885538 877572 861324 853178 849265 836169 819524 815888 800201
13336 800201 783428 786172 775384 763954 781464 778506 765777 750568 750311 755518 751530 725531 708497
13323 708497 701239 690769 696823 704415 693007 680681 669335 654282 650855 657854 674300 670714 646026
13310 646026 626046 626251 632491 617252 617252 628506 626608 617926 607540 589594 590760 593250 586989 562501
13296E62501J558j694j0204J3209N666q899j5774j5439N112R513N229m42O295
13283E56631q775n969j7k698j0588Q068K6280Q606J3358M6984L6475M7275M2384
13270G58014J5500k3089o1956n6859m4699k9300j4788j9678k6924k286M186r007
13258D89114n846k0256k2241r630o120K003R258k247j9050r360j327j5861O417
13245C94854l677J59O49j2494j1670q519l96r29P291J961Q860j253q140n241m826
13230C56629n528O894J0698K509j7719j2283k098J0828k63j8799j2203r160l465
13217C06040R631pK49m403R237L14J0616P165j8222k6522j0223M424R780n532
13203B92547j0923K701M445L453J3835p637r094K799R19j7819j197k666j0350
$$ plain form
13296 562501 564059 562365 552161 565370 571036 562137 546363 530924 536036 545549 550778 550336 556631
13283 556631 547856 541887 541870 539172 528584 536652 562932 571538 584896 631880 668355 715630 758014
13270 758014 773514 750425 688469 631610 586911 557611 542823 523145 496221 493935 498121 489114
13258 489114 483268 463012 440771 431141 425021 427024 436282 434035 414985 405625 404298 388437 394854
13245 394854 391177 391336 391985 379491 367821 359302 358906 357977 365268 367229 376089 374836 366696 361455 356629
13230 356629 351101 357995 368693 371202 353483 341200 339102 349930 349667 330868 318665 309505 306040
13217 306040 315671 315664 315913 311510 320747 321061 331677 338842 320620 294098 283875 288299 298079 292547
13203 292547 281624 284325 288770 292223 306058 298421 289327 292126 293045 275226 274029 271363 261013
13190B61013L774L752N86m840j3736N968J8293O779p055j2423j2999P247J858
13177B58217l37l953l193l200p948O645j5790r63O339J0990J865p078j3938J8832
13163B46488P532j0311o735m926M230K211O139k0002j6930n077M330R943J252
13150B18144P379p728j0623m213o149M64m136Q077J4347M881Q934k120J1935J4402
13136B53594o802p984j5110P320k328j2991n326J311r966M965N180n236p100o948
13122A92579K153K02O427Q68j0752K033j0246j4379L034Q97l615q323k971j379
13108A56528m329P958J3206N190p335j6119J861M600K783j3014N169l463j572
13095A51463J5219K0847J9669K5321K2843N221k0199k9881o665j4993r386j0200
$$ plain form
13190 261013 264787 268539 269125 264285 250549 256517 274810 281589 274534 262111 249112 256359 258217
13177 258217 257880 253927 250734 247534 239586 246231 230441 229478 235817 246807 248672 241594 227656 246488
13163 246488 254020 243709 236974 232048 236278 238489 244628 224626 207696 202619 206949 216892 218144
13150 218144 225523 217795 207172 202959 196810 197274 193138 201215 215562 220443 229377 227257 239192 253594
13136 253594 246792 238808 223698 231018 228690 215699 210373 211684 201718 206683 211863 206627 199527 192579
13122 192579 194732 194934 201361 202229 191477 193510 183264 168885 171919 172816 169201 160878 157907 156528
13108 156528 152199 160157 173363 178553 171218 155099 156960 161560 164343 151329 156498 153035 151463
13095 151463 166682 187529 207198 232519 255362 260583 240384 210503 203838 188845 179459 169259
13083A69259J325j3679k0510j469K800J150o54n093M550J2466j0702J225J3599
13070A54267M881l899L217j2892m13n702M328j132O504j641O856Q427k597m136
13056A56068j0344p193r097m643j2158j404J0946J6655j181J765K662J831o599
13043A37308o287m034j929r486j271P368M720K423J172k249m046O93j0163j1078
13029A03141O886P256N380J3273J1653k647p267j3046j0961J029k003R505L554
13016A25753j2731K177m587q860m763M127M151p525M690o978J282r295p801J1607
13002I1247Q510N574Q437J773m521M534P231L29L623j2021j0044j0615p896l20
12988H5841j413M194q731K0965P867j3984J078R571m753j1168L867l119o686m121
$$ plain form
13083 169259 170584 156905 136395 134926 137726 138876 138222 133129 137679 150145 139443 140668 154267
13070 154267 159148 155249 158466 145574 145161 139459 143787 142655 149159 147518 154374 162801 160204 156068
13056 156068 145724 138531 129434 124791 112633 111229 122175 138830 137649 139414 142076 143907 137308
13043 137308 131021 126987 125058 115572 114301 121669 126389 128812 129984 127735 123689 124382 114219 103141
13029 103141 110027 117283 122663 135936 147589 144942 137675 124629 113668 114697 112694 122199 125753
13016 125753 113022 115199 110612 101752 96989 101116 105267 97742 102432 95454 96736 87441 79640 91247
13002 91247 99757 105331 113768 115541 111020 115554 122785 123114 126737 114716 104672 94057 86161 85841
12988 85841 84428 88622 79891 100856 108723 94739 95817 105388 100635 89467 93334 90215 83529 79408
12974G9408J8963M871m752J4381J1023j965j7156n991R209o660L705j933n564
12961I7539r911J581o692k221p026j3690J634J1407j889J1858Q055J0503J3040
12948A14188N103j0556J489n306j0460O962k174j2117l892j5024j0605J489O804
12935F5901J3051P09p900Q351N153k565n548L471O604j587n221m734L913q364
12921G1234r5p83J0698r995p265O345J0243o458N147L395n782j5197j762J1399
12907G1124L907o856m57m496J534q541p97q635K366J0513J7007k913n111q292
12893F0353n543J642O052L851q302J2024N191K883n364k151j726M365r10P129
12879G9494k523p382q624p933J173l663n861j87J64L561N785O909Q91j944J1191
$$ plain form
12974 79408 98371 103242 98490 112871 123894 121929 104773 98782 107991 101331 105036 103103 97539
12961 97539 87628 89209 82517 80296 73270 59580 61214 72621 70732 82590 90645 101148 114188
12948 114188 119291 108735 110224 104918 94458 101420 99246 87129 83237 68213 57608 59097 65901
12935 65901 78952 79661 71761 80112 85265 82700 77152 80623 87227 85640 80419 75685 79598 71234
12921 71234 71139 70356 81054 71059 63794 70139 80382 73924 79071 82466 76684 61487 59725 71124
12907 71124 75031 68175 67718 63222 64756 56215 55418 46783 49149 59662 76669 73756 68645 60353
12893 60353 54810 56452 62504 66355 58053 70077 75268 78151 72787 70636 68910 73275 72365 79494
12879 79494 76971 69589 60965 53032 54205 50542 44681 44494 44658 48219 54004 60913 61804 59860 71051
12864G1051M65q631k441J909J5590l831m546p761q285L447K567N990J1339q090
12850F8773m208L369o125J1979m569j6307n139r28Q710q632j8950M515M877O653
12836D4018J3824K833l657M933l107R887Q249j2734q475j0432r628j820J1835
12823D5726J2378L576o834q999Q071P736p819j0897m055P954P403R858J2640K348
12809G9086j5833j0189n197q372k897L538m571J5168K490p052p035j896P007J381
12795D5628l567n558J8L984q41J3051k875p252J3927O996o28o911J418M815J367
12780F3572O983k097j2747L961p160m838n229O076M507P893l971n750k5125j1426
12766A4649J0206J1650M039j1138k66J5389R142r624j599L324l242J804j6262
$$ plain form
12864 71051 71516 62885 60444 62353 77943 74112 69566 61805 53520 56967 59534 65524 76863 68773
12850 68773 64565 67934 61809 73788 69219 52912 47773 46845 55555 46923 27973 32488 37365 44018
12836 44018 57842 60675 57018 61951 58844 68731 76980 64246 55771 45339 35711 33891 45726
12823 45726 58104 61680 54846 45847 53918 61654 53835 42938 38883 46837 54240 64098 76738 79086
12809 79086 63253 53064 47867 39495 36598 40136 35565 50733 53223 46171 39136 37240 44247 45628
12795 45628 42061 36503 36521 40505 39664 52715 49840 42588 56515 63511 62883 55972 57390 62205 63572
12780 63572 70555 68458 55711 59672 52512 47674 42445 48521 53028 60921 56950 51200 26075 14649
12766 14649 24855 36505 40544 29406 29140 44529 53671 44047 42448 45772 42530 44334 28072
12753B8072j049J3239N508n006j723j890J0295J3862k737O740O683j2941j6308
12740D2745L264j385J621q324k929M691M289j1627p837n777R251K077n046n407
12726A9606k794j169J0466O282j360j2547j2735P430J2551R328j3181l692o559
12713A1626N532J4442J9k412J7143Q583P6k631o299l082m22m620k0481J164Q128
12698B6766K827j572l979L619q014N415J4248n647N33K230q485l940J5986l421
12684C6566r491N557k524n094J80L552o109K728J5379k19r97j6935j572m244Q397
12669B5174J0559J2180l953p663p992R56j87Q347J2997L622q156o413j482L905
12655D1894n987q421M533J2555l416j3730K857J2679o244r355L555J0700l418
$$ plain form
12753 28072 27023 40262 45770 40764 39041 37151 47446 61308 58571 65311 71994 59053 42745
12740 42745 46009 44624 46245 37921 34992 39683 43972 32345 24508 18731 27982 30059 25013 19606
12726 19606 16812 15643 26109 32391 31031 18484 5749 13179 25730 35058 21877 18185 11626
12713 11626 17158 31600 31619 29207 46350 54933 55009 52378 46079 42997 42575 37955 17474 18638 26766
12698 26766 29593 28021 24042 27661 19647 25062 39310 33663 34196 36426 27941 24001 39987 36566
12684 36566 27075 32632 30108 25014 25194 28746 22637 25365 40744 40525 39528 22593 21021 16777 25174
12669 25174 35733 47913 43960 36297 28305 29261 29074 37421 50418 54040 45884 39471 37989 41894
12655 41894 35907 27486 32019 44574 41158 27428 30285 42964 36720 27365 30920 41620 38202
12642C8202p807p818M355L172J653L198j2383k0967Q237Q535j633n24K399J1025
12628B9644N74j834l582J316n449k37M317p536J994P266q205L489P729O24L393
12613C3503N526Q848N085o491K503J899m664j2451p31R524q772k288J1292P359
12599E0142r753j6396j439K9l430L065J3775L360K283j7757l342n353R18J2217
12585B8319n418o016j310R456J821n487m772l517n57q97J1266R395R521m834j2464
12570B4506j0793n347M384M792Q285K740j6922J894R025Q732Q87J330j6260m608
12556A2645J7459J5352k74k504p617p098N708L839m981n100j4011j3214p611o499
12542a3906o652N254J7331O188J4235L419M271q039n616P54K245J050j0145j736
$$ plain form
12642 38202 30395 22577 26932 30104 31757 34955 22572 1605 9842 18377 16744 16220 18619 29644
12628 29644 30218 28384 24802 26118 20669 20432 24749 17213 19207 26473 18268 21757 29486 30110 33503
12613 33503 39029 47877 52962 46471 48974 50873 46209 33758 33027 42551 33779 31491 42783 50142
12599 50142 40389 23993 22554 22583 19153 22218 35993 39353 41636 23879 20537 15184 16102 28319
12585 28319 22901 16885 15575 25031 26852 21365 16593 13076 12519 11622 22888 32283 41804 36970 24506
12570 24506 13713 8366 12750 17542 25827 28567 11645 13539 22564 31296 32183 33513 17253 12645
12556 12645 30104 45456 45182 42678 35061 27963 33671 37510 32529 27429 13418 204 -7407 -13906
12542 -13906 -20558 -15304 2027 8215 22450 25869 30140 22101 16485 17239 19484 20534 10389 8653
12528H653O633J449n079m01M727p105n065N124J1716m22k296Q133J032o315j837
12513A8947L561k055n6M030j328j576J2806N832K195j1966n907j3498k972J2326
12499B0339p06j0048j84o074k821J1311O955J0594r786m005j3711P356L142J150
12485A3512l332q835O308J3726N131K835n469j1812K785J03Q117o62m376p038
12471A0993J3913q45j3980P638Q465p382o446J2793m988q086R513P432N302m911
12457B9411m081k990p701K463m068p070J520Q992J0588q70j7472J3442j415L473
12443B4222J2610l750p674j1519j080L369O165j495l374o787k642N359Q741J725
12429B3870J1950r36j1051j7511j0199J7484O992k853j701K263L11J625j5282
$$ plain form
12528 8653 15286 16735 11656 11255 15982 8877 3812 8936 20652 20230 17934 26067 27099 20784 18947
12513 18947 22508 20453 20397 24427 23099 21523 34329 40161 42356 30390 24483 10985 8013 20339
12499 20339 19633 9585 9401 3327 506 11817 18772 29366 19580 15575 1864 9220 12362 13512
12485 13512 10180 1345 7653 21379 26510 29345 23876 12064 14849 14952 23069 22407 18031 10993
12471 10993 24906 24061 10081 17719 26184 18802 12356 25149 20161 12075 21588 29020 34322 29411
12457 29411 25330 22340 14639 17102 13034 5964 7484 16476 27064 26194 8722 22164 20749 24222
12443 24222 36832 33082 25408 13889 12809 16178 22343 20848 17474 10687 8045 13404 22145 23870
12429 23870 35820 34884 23833 6322 -3877 13607 20599 17746 16045 18308 18619 20244 4962
12416D962r844M652K282l210R455P416Q79R178L950p248J457M685j254p852j2815
12401F693k020K329j1758j52m29l463J0399Q191r39n413j045j713M526K231k115
12386E322P319N992P445O60m990J809m979n920n82m504J625J400k141L389O594
12371A8439n595o264J0196J0009p018j4419M490N48J1730j4893j2390J2770l60
12358G243J3174J0221q192j0064k1310K714J2465P563j705r713m616M449M191
12345F420M296q118j1188m530o19J1624Q613J17R029k735j1354J0369j2013m99
12331e88K922J7937k957j9905j1313j5335J7291N196M536m766L353L824j612J4117
12317A2700J910k801K49J687l548M785L314J2370M239p164p286j6383l29M120
$$ plain form
12416 4962 -4882 -230 2052 -1158 8297 15713 16592 25770 29720 22472 23929 28614 27360 19508 6693
12401 6693 4673 7002 -4756 -4908 -5337 -8800 1599 9790 8851 3438 2393 680 5206 7437 5322
12386 5322 12641 18633 26078 26738 21748 23557 18578 12658 12076 7572 9197 10597 8456 11845 18439
12371 18439 12844 6580 16776 26785 19767 5348 9838 10386 22116 7223 -5167 7603 7243
12358 7243 20417 30638 22446 12382 -8928 -6214 6251 13814 12109 2396 -2220 2229 6420
12345 6420 10716 2598 -8590 -13120 -13739 -2115 6498 6615 15644 12909 1555 11924 -89 -588
12331 -588 2334 20271 17314 -2591 -13904 -29239 -11948 -6752 -2216 -6982 -3629 195 -1417 12700
12317 12700 14610 11809 12058 13745 10197 14982 18296 30666 34905 27741 20455 4072 3743 7863
12303G863R961R197j231j5876j4129l131P27l107q684J588K099J0247J3160p119
12289A565l254l27J4307m077n751r32n358j264O968J519Q636O875p281q098J1272
12274A4800K363J1677j3868j0857j866K188l478l416J410K1929J196j608N748
12261B6218J899n614q405k1366J1162J1579J2031K0918K092j8545p409J237M222
12248C0019m749n688l088Q136J533n391q563q9k56j819r65J176J008Q422Q103
12233B7789m062o890K260M698O201K080j0756j3009r57J0656n643j1310R464r212
12219A309Q009J642N700J2602L47q110k2507n556M833J954j0569p503J3557J472
12205b820L356r44L01Q309J031J3598O155n550o842j1206q327p863M072L764K554
$$ plain form
12303 7863 17824 27021 25790 9914 -4215 -7346 -6619 -9726 -18410 -16822 -14723 -4476 8684 1565
12289 1565 -1689 -2016 12291 8214 2463 1531 -3827 -5091 1877 3396 12032 18907 11626 3528 14800
12274 14800 17163 28840 14972 4115 2249 4437 959 -2457 -1047 20882 22078 20470 26218
12261 26218 28117 22503 14098 -7268 3894 15473 27504 48422 50514 31969 24560 25797 30019
12248 30019 25270 19582 16494 24630 26163 20772 12209 12120 11864 10045 9080 10256 11264 19686 27789
12233 27789 23727 16837 19097 23795 29996 32076 21320 8311 7354 18010 12367 1057 10521 1309
12219 1309 9318 10960 16660 29262 29609 21499 -1008 -6564 -1731 223 -10346 -17849 -4292 -2820
12205 -2820 536 -408 -107 8202 9233 22831 28986 23436 16594 5388 -2939 -10802 -6730 -2966 -412
12190d12K165K577J844J3341J5350L872k2926j3522N924Q739q061m461J103k017
12176C516R905o72j5633Q691J577J1127L463j0093L307Q977p042j5233Q155n471
12162D574o581j1034k350P180O508m849L374O654j1454K73J3651q397n152K302
12148e301j67O596K756J3639j0696o199p78n898k0700j8674O570K3974K6017N574
12134A6713k0130L449M479q18J482J8881R661j5679j5007k4949O574P990O54K0653
12120A3953L979J421K586k44Q406K137q992P48m083j0503k731L172L138J768Q45
12105A5600m178J418q48N087j2369n527J419j0152M163O820o930m452N872J5929
12091A1852J3538N610J729j3533j9725q324P182o624l790P47q6j707O693J288
$$ plain form
12190 -412 1753 4330 6174 19515 34865 38737 15811 2289 8213 16952 8891 4430 5533 3516
12176 3516 13421 12749 -2884 5807 7384 18511 21974 11881 15188 24165 17123 1890 10045 4574
12162 4574 -2007 -13041 -15391 -8211 -1703 -6552 -3178 3476 -7978 -7705 5946 -2451 -7603 -5301
12148 -5301 -5468 1128 3884 17523 6827 628 -150 -6048 -26748 -45422 -38852 -14878 11139 16713
12134 16713 -3417 32 4511 3693 5175 24056 33717 18038 3031 -21918 -15344 -7354 -6700 13953
12120 13953 17932 19353 21939 21695 30101 32238 23246 23994 19911 9408 6677 9849 12987 14755 15600
12105 15600 11422 12840 11992 17079 4710 -817 602 -9550 -5387 1433 -5497 -9949 -4077 11852
12091 11852 25390 31000 32729 19196 -529 -8853 -1671 -8295 -12085 -11338 -11424 -13131 -6438 -5150
12077e150q231R481O967P969P641j4629M695j969l26K178k463m962l059Q894J726
12062H762L524m075q508q279Q886J3441K599k505q747j065o90q21k784n058J0608
12047E288K81j75j1716m372J0725j662K532q460p939R023J0105N733j45j3389
12033d171n128m070J3742J2130M291m366p905l085J457J615P553l326j3904k817
12019g984J4720j769j391m794N31L687m223P61o665j371N756O989N506j941M698
12004A2510K750n631j1651n468K20K162R892n366p22q040P134M111k451k871N896
11989B475q846j1858q375j333j964R727J025L461M698j668p51J0009o643J0330
11975B87Q26R46r43j877m019K588q137L680N349K601j1705l405J0406j3154l197
$$ plain form
12077 -5150 -13381 -3900 3067 11036 18677 4048 8743 6774 6448 8626 6163 1201 -1858 7036 8762
12062 8762 12286 8211 -297 -8576 310 13751 16350 13845 5098 4033 3343 2522 -262 -5320 5288
12047 5288 5569 5394 -6322 -10694 31 -1631 901 -7559 -15498 -6475 3630 9363 9218 -4171
12033 -4171 -9299 -13369 373 12503 16794 12428 4523 1438 2895 4510 12063 8737 -5167 -7984
12019 -7984 6736 4967 3576 -1218 -687 3000 -1223 -462 -7127 -8498 -2742 4247 9753 7812 12510
12004 12510 15260 9629 -2022 -7490 -7270 -5108 4784 -582 -1304 -9344 -2210 1901 -550 -3421 2475
11989 2475 -6371 -18229 -26604 -27937 -29901 -20174 -19149 -15688 -10990 -12658 -13409 -3400 -10043 287
11975 287 1113 2059 1116 -761 -4780 -2192 -10329 -6649 -1300 1301 -10404 -13809 -3403 -16557 -19754
11960a9754L207m384j1722O248J0751N230O375J2885p736p793j522q61J465q842
11946a6453N075L255k062o578j5421m30J879R508O920J949J597m184N46k306J364
11931a5341K358P804m672J4612L374n901j5832o596k241L076J8488J1632p445
11918C316j3220J803r82j1483O269J4067R83L991J1065M788Q701l695k4169k245
11904h11L571j6350L56R10m900k375J2396K883n311J0765L388k304p703J530K258
11889a697l165k814J0854j4400L344J6886l3n707q92j1964j3720J3954J118R01
11875g335j2951m234K7001J1099j3166j601k083L483l332m168o906Q573J1669
11862F049N223k35l252j1448M93L025Q528L413j1258J40j081R43n219j1455P346
$$ plain form
11960 -19754 -16547 -20931 -32653 -26405 -15654 -10424 -4049 8836 1100 -6693 -8215 -9076 -7611 -16453
11946 -16453 -11378 -8123 -10185 -16763 -32184 -32614 -30735 -21227 -14307 -12358 -10761 -14945 -14399 -16705 -15341
11931 -15341 -12983 -5179 -9851 4761 8135 2234 -13598 -20194 -22435 -19359 -871 10761 3316
11918 3316 -9904 -8101 -9083 -20566 -14297 -230 753 4744 15809 20597 29298 25603 1434 -811
11904 -811 2760 -13590 -13234 -12324 -17224 -19599 -7203 -4320 -9631 1134 4522 2218 -5485 -3955 -1697
11889 -1697 -4862 -7676 3178 -11222 -7878 9008 8975 3268 2376 -9588 -23308 -9354 -8236 -7335
11875 -7335 -20286 -24520 2481 13580 414 -1187 -3270 213 -3119 -7287 -14193 -5620 6049
11862 6049 11272 11037 7785 -3663 -3170 -145 8383 11796 538 678 -403 540 -4679 -16134 -8788
11847h788K142o014J1876P02j255k595k304j13O058l59p480r526R020R06M911
11832b819J7497j1973j7812P412R190n323j4569N481j1433n757J4869J3302M719
11819B784j808j3466q675M601R918j1368L89M070J3003q445J315J1051O90j428
11805B631P647j3836j5075M34J3670N592O372j201j8278l413P759J9190L14j7511
11791e705j4149K7L642Q496J3546K4321R016j6376m598j0866n300J0868K207q255
11777F874p762r600q57n900P164J0710l673j0210k560J1449K600j9595k463J4951
11763h872Q366J0263j3005l954J0678K398o747l328P507R99m63l77o938j5851
11749a9324l526J2147K505J784K465J3837m920j1623r144Q375n704N907J5786
$$ plain form
11847 -8788 -6646 -12660 -784 -82 -1337 -3932 -6236 -6349 -291 -650 -8130 -17656 -8636 -7730 -2819
11832 -2819 14678 2705 -15107 -7695 1495 -3828 -18397 -12916 -24349 -30106 -15237 -1935 2784
11819 2784 976 -12490 -21165 -16564 -6646 -18014 -17625 -13555 -552 -8997 -7682 3369 4059 2631
11805 2631 10278 -3558 -18633 -18199 -4529 1063 7435 6234 -12044 -15457 -7698 11492 11806 -5705
11791 -5705 -19854 -19827 -16185 -7689 5857 30178 39194 22818 18220 7354 2054 12922 15129 6874
11777 6874 -888 -10488 -11345 -17245 -10081 629 -3044 -13254 -15814 -4365 -1765 -21360 -23823 -8872
11763 -8872 -506 9757 -3248 -7202 3476 5874 -873 -4201 3306 4305 3842 3465 -3473 -19324
11749 -19324 -22850 -10703 -8198 -6414 -3949 9888 4968 -6655 -15799 -7424 -13128 -7221 8565
11736H565l118j0690q815m426k688J239P077L9J9216J4559o152j5504L452j1182
11722h428j781J3479O225M811j0774J993p754r336L03p856n025K1060J335q820
11708a0568k168Q7r797J2032m345o588L234n0M340J0747n54k350k932M632Q981
11693D701r633j5436o294J2535J8662P32j6967j0822J4417J3930j4095m105J2081
11680b94q25j29k495K305j43p914j3165J248J317K002M793l619K662m044M483
11665a3818j247k372n367l355O315m181J281l006O992J1029Q215j2943p528M399
11651a5586n091O868l587M822M704P65N529K919J1228Q881j3909j7317l740q71
11637a4385J9245Q388p464j4661n618M764M608r157j1745l285O666K464P71j875
$$ plain form
11736 8565 5447 -5243 -14058 -18484 -21172 -19933 -12856 -12817 6399 20958 14806 -698 2754 -8428
11722 -8428 -10209 3270 9495 14306 3532 5525 -2229 -11565 -11262 -19118 -24143 -3083 -1748 -10568
11708 -10568 -12736 -12649 -22446 -10414 -14759 -21347 -18113 -18163 -13823 -3076 -3630 -5980 -8912 -4280 4701
11693 4701 -4932 -20368 -26662 -14127 4535 5267 -11700 -22522 -8105 5825 -8270 -12375 -294
11680 -294 -1119 -1248 -3743 -1438 -1581 -9495 -22660 -21412 -20095 -18093 -13300 -16919 -14257 -18301 -13818
11665 -13818 -15065 -17437 -22804 -26159 -19844 -24025 -22744 -25750 -18758 -7729 486 -12457 -19985 -15586
11651 -15586 -20677 -13809 -17396 -12574 -7870 -7105 -1576 1343 12571 21452 7543 -9774 -13514 -14385
11637 -14385 4860 13248 5784 -8877 -14495 -9731 -5123 -14280 -26025 -29310 -22644 -20180 -19409 -21284
11623b1284l754p71j184M662R965R111J4097Q132J508j2906k6526m321J2744r166
11609a9693l971J1384O153J111k814M479J138K890m16l64l902k4190L288J6437
11595h470k912q765j3682p479Q229O472K193Q559L370r187j7196J3894j428n399
11581c1801P971Q421P01J399K032R267L629o408M707j0267n653q75K477J0147
11567d253O836k991j5338j9627P999J8500n428L35r807L112L607J4311J2614N27
11553A0397j2636N427j179p158p824O264O163r18O928j398o379j5953O162K646
11539i458J6265N901j2394j0545j528p95m599n256l34J5284N629P93j549K60o998
11524i324n013J1327j473n281L903j6132j1261K1689J7865j149n730j1796k579
$$ plain form
11623 -21284 -25038 -25809 -26993 -22331 -12366 -3255 10842 18974 20482 7576 -18950 -23271 -10527 -19693
11609 -19693 -23664 -12280 -6127 -5016 -7830 -3351 -2213 677 261 -103 -4005 -28195 -24907 -8470
11595 -8470 -11382 -20147 -33829 -41308 -33079 -26607 -24414 -15855 -12485 -21672 -38868 -24974 -26402 -31801
11581 -31801 -23830 -15409 -14708 -13309 -11277 -2010 1619 -4789 -82 -10349 -16002 -16877 -14400 -4253
11567 -4253 2583 -408 -15746 -35373 -27374 -8874 -14302 -13967 -23774 -20662 -17055 -2744 9870 10397
11553 10397 -2239 3188 2009 -5149 -12973 -6709 -546 -1464 5464 4066 -2313 -18266 -12104 -9458
11539 -9458 6807 12708 314 -10231 -11759 -12554 -17153 -22409 -22743 -7459 -1830 -1037 -2586 -2326 -9324
11524 -9324 -14337 -3010 -4483 -9764 -5861 -21993 -33254 -11565 6300 5151 -579 -12375 -14954
11511a4954m366R736P529k766n076m822r524J1444J931P138R212l823k307J0179
11497I531o348p350j0225j3320k706M629K527q624p785N489Q503j619l407P700
11483b3005j073K79K381j7104k261M276J687O335J1625M88J1108J586j6768m833
11469b5279J6248k199k328M26M434l543j322k586J3040P731k724j0251K526l504
11455i331O80l346L666J347m677j007Q421R449M513k348j3981r575j0984P559
11441a9614M008J6498P846m352K373J1867M8k0370j0761J1859m176n037r305q91
11427b0007P382p801J061K1889O081O315q486k839q591J399K391m834j1320j8351
11413c5711J0952J4731K873j2617P442P961l97n477q34P470Q22j793p767K699
$$ plain form
11511 -14954 -19320 -9584 -2055 -4821 -9897 -14719 -24243 -12799 -10868 -3730 5482 1659 -648 9531
11497 9531 3183 -4167 -14392 -27712 -30418 -25789 -23262 -31886 -39671 -34182 -25679 -27298 -30705 -23005
11483 -23005 -24078 -23799 -21418 -38522 -40783 -36507 -34820 -28485 -16860 -16372 -5264 -3678 -20446 -25279
11469 -25279 -9031 -11230 -13558 -13132 -8698 -12241 -13563 -16149 -3109 4622 1898 -8353 -5827 -9331
11455 -9331 -8651 -11997 -8331 -6984 -11661 -12668 -4247 5202 9715 7367 -6614 -16189 -27173 -19614
11441 -19614 -15606 892 8738 4386 6759 18626 18674 -1696 -12457 -598 -4774 -9811 -19116 -20007
11427 -20007 -12625 -20426 -19365 2524 8605 14920 6434 3595 -4996 -3597 -1206 -6040 -17360 -35711
11413 -35711 -24759 -10028 -7155 -19772 -12330 -4369 -4766 -10243 -11077 -3607 -2785 -4578 -12345 -9646
11399i646n637k518K075m935M556m066M143K54m787J0671O405r945o222P742M137
11384g773j6884j914P217P625M215p415m047J7972K513j3130o901J645r644o851
11370c3372L251R714J4687M71O816n225k795k089J676M572P492Q692k0860r188
11356a6158M754Q461O579j205r671m109L798o557j2281j3674Q532K5525Q792l524
11342g38L537L903M052q243K979j0956L866J6824L167n697j2707l621N532P11
11328B609j2793o112R915J6073l778j7574j2520N093N692k875L486j770M09P642
11314f503K1645k152k244j2112r350M76j8212n151j802J0229o571J1504P031N168
11300h044N115q6P77r608k332N817q64K304L743L570l003l520R09m083J3871P36
$$ plain form
11399 -9646 -15283 -17801 -15726 -20661 -16105 -20171 -16028 -15774 -20561 -9890 -3485 -13430 -19652 -11910 -7773
11384 -7773 -24657 -26571 -19354 -11729 -7514 -14929 -18976 -1004 1509 -11621 -18522 -16877 -26521 -33372
11370 -33372 -30121 -20407 -5720 -5249 1567 -3658 -6453 -8542 -6866 -2294 5198 13890 -6970 -16158
11356 -16158 -11404 -2943 3636 2431 -7240 -11349 -7551 -14108 -26389 -40063 -31531 -6006 2786 -738
11342 -738 2799 6702 10754 2511 5490 -5466 -1600 15224 18391 12694 -13 -3634 1898 2609
11328 2609 -10184 -16296 -6381 9692 5914 -11660 -24180 -19087 -13395 -16270 -12784 -14554 -14145 -6503
11314 -6503 15142 12990 10746 -1366 -10716 -10240 -28452 -33603 -35405 -25176 -31747 -20243 -13212 -8044
11300 -8044 -2929 -3015 -2238 -11846 -14178 -8361 -9225 -6921 -3178 392 -2611 -6131 -5222 -9305 4566 5302
11284E302n214k949m342j0987j3967j5101M82j924J4070J5185j1109l535J5187
11271a8902L480k788l188L01O432P130j3065k894J5341K255p153j094N695J734
11257f716Q038l385J4115J1804K396j3731j1062o9J2511Q168j943m773J2618q584
11243A9387k6438K541J7234L964k655j1881j1645q308j249j012N864M635r164
11230a8727J1851K878j0418L762k712M922J1436j0012j3319J1439M154q252l270
11217a6268K643J337P581k187o922n971j0838j3931M703M692J1586O345J2652
11204d578n647j4640M299O667R58k804m410N235Q304p942j1951J4022J2892j539
11190a134m412j954K313R132l14J1920K272M133j5836j6231M476o846j3200j592
$$ plain form
11284 5302 88 -2861 -7203 -18190 -32157 -47258 -46776 -48700 -34630 -19445 -30554 -34089 -18902
11271 -18902 -15422 -18210 -21398 -21097 -14665 -7535 -20600 -23494 -8153 -5898 -13051 -14145 -8450 -6716
11257 -6716 1322 -2063 12052 23856 26252 12521 1459 1390 13901 22069 20126 15353 27971 19387
11243 19387 -7051 -4510 12724 16688 14033 2152 -9493 -17801 -19050 -20062 -14198 -9563 -18727
11230 -18727 -6876 -3998 -14416 -10654 -13366 -8444 2992 -7020 -20339 -8900 -4746 -12998 -16268
11217 -16268 -13625 -12288 -4707 -6894 -13816 -19787 -30625 -44556 -39853 -35161 -23575 -17230 -4578
11204 -4578 -10225 -24865 -20566 -13899 -12941 -15745 -20155 -14920 -6616 -14558 -26509 -12487 405 -1134
11190 -1134 -5546 -7500 -5187 3945 3631 15551 17823 21956 6120 -10111 -5635 -12481 -25681 -27273
11176b7273K770J2404R512M122Q766j813M119p8j692j5319o539o01o837l245P488
11161a4216J3267j135k964n068j2991n498J935m60J1588j0168P72K568Q161l410
11147a7619p278o45m582j027N893J8454P269p190j3727j672j631L482K311J597
11133a6365p77j4342l034K4571P405P99k835o27o263l119n55M724J55k25O050
11118d438q38P73p277k219q713M782j0377J696P695k139N191q088J1328K341m638
11103a4921J0451J9010l389J125r605j5364J3269k199J087J3062m842K688p145
11090C227r368l316q149N455K0500J5989o821j3099j7289j2522O905K711R30N836
11076i011J599J46p397p277O513P049r87K473j3802n390J4653j85q908K63O038
$$ plain form
11176 -27273 -24503 -12099 -2587 1535 10301 8488 12607 12529 10837 -4482 -11021 -11622 -18459 -21704 -14216
11161 -14216 -949 -2084 -5048 -10116 -23107 -28605 -26670 -27130 -15542 -25710 -24938 -22370 -14209 -17619
11147 -17619 -24897 -25542 -30124 -31151 -25258 -6804 465 -6725 -20452 -22124 -23755 -20273 -17962 -16365
11133 -16365 -17142 -31484 -34518 -9947 -2542 -1743 -4578 -5205 -11468 -14587 -15142 -10418 -10263 -10488 -4438
11118 -4438 -5276 -4503 -11780 -13999 -22712 -17930 -28307 -26611 -18916 -21055 -15864 -23952 -12624 -10283 -14921
11103 -14921 -4470 14540 11151 12276 2671 -12693 576 -1623 -536 12526 7684 10372 3227
11090 3227 -6141 -9457 -17606 -12151 8349 24338 17517 4418 -12871 -25393 -18488 -15777 -14847 -9011
11076 -9011 -7412 -7266 -14663 -21940 -15427 -8378 -9365 -6892 -20694 -26084 -11431 -11616 -20524 -20261 -14223
11061a4223Q12p019n423Q764L603J640k433k403J0807o91N272j470j922j776M722
11046a740J3860L209o414p692j1595p861m295M487o80J427J4899k337M558n24
11032f98p433O956Q85j2016r904k440J907l598r515P921J8412R460r775j1734
11018b1572k533N605J5309J021O708K955j0568J4320P601k076k222j8720p08P62
11004d118j1236M005n065K495O591P421M153l001l093r159P547J1013L003J614
10990A2170n387J306N023j3049q386L180M895L895L053j0827q7Q445J3444j7281
10976C94j6123j647J8381r42j975K169L593k881r229m403M422J57J1912n920j6343
10961a8435l909N8N649J4366n496K67J2996o549n524j643q419P96J4494J0108
$$ plain form
11061 -14223 -13411 -20430 -25853 -17089 -13486 -11846 -14279 -16682 -5875 -6566 -1294 -2764 -4686 -6462 -1740
11046 -1740 12120 15329 8915 1223 -10372 -18233 -22528 -18041 -18721 -17294 -2395 -4732 -174 -698
11032 -698 -8131 -1175 -290 -12306 -22210 -24650 -22743 -26341 -35856 -27935 -9523 -63 -9838 -21572
11018 -21572 -24105 -18500 -3191 -2170 4538 7493 -3075 11245 18846 16770 14548 -4172 -4880 -4118
11004 -4118 -15354 -11349 -16414 -13919 -7328 93 4246 1245 -1848 -11007 -3460 7553 10556 12170
10990 12170 6783 8089 13112 63 -8323 -5143 -248 3647 6700 -4127 -4214 4231 17675 394
10976 394 -15729 -17376 1005 63 -1912 257 3850 969 -8260 -12663 -8241 -8084 3828 -2092 -18435
10961 -18435 -22344 -22286 -16637 -2271 -7767 -7500 5496 -1053 -6577 -8220 -16639 -15843 -1349 8759
10947H759K99l879j1435j8643l955R262Q665J4427q264j2567M354l006j6468o181
10933c8632Q790j922J954r57j570P293q31P170J9844K362j0355j0011R205n528
10919a3188j381O125M987J651j6108j8508P985J6096n54K065O613M733L551J1876
10905A5943L280o325J1592k413p47J219j5036o6l477j1694j2309K884J1876j0724
10891a5997l855Q382j0757m832R260J4561L352m720j6955o472J4296N515M711
10878c511O062p797o625J124Q257r845J180j362k665Q621J8326R229N850m405
10864B2439o402Rk64J156p287l353N829L054k675j0303n753o959p76k221J247
10849a2259k101L733J5406J0481M111R924j2998j60r554m823M348J971j050j0097
$$ plain form
10947 8759 9058 5179 -6256 -24899 -28854 -19592 -10927 3500 -4764 -17331 -12977 -15983 -32451 -38632
10933 -38632 -29842 -31764 -29810 -30767 -32337 -25044 -25875 -18705 1139 3501 -6854 -16865 -7660 -13188
10919 -13188 -14569 -8444 -3457 -1806 -17914 -36422 -28437 -12341 -12895 -10830 -4217 516 4067 15943
10905 15943 19223 12898 24490 22077 21330 22549 7513 7447 3970 -7724 -20033 -17149 -5273 -15997
10891 -15997 -19852 -11470 -22227 -27059 -17799 -3238 114 -4606 -21561 -28033 -13737 -8222 -3511
10878 -3511 2551 -5246 -11871 -10747 -2490 -12335 -11155 -12517 -15182 -6561 11765 20994 26844 22439
10864 22439 16037 16046 15782 16938 9651 6298 12127 15181 12506 2203 -3550 -10509 -11285 -13506 -12259
10849 -12259 -14360 -10627 4779 15260 19371 29295 16297 16137 6583 1760 6108 8079 7029 -3068
10835c068j2328N972J4254j882L822k710p63j2493o182P762M3L601N533P846J0587
10820A9994M145j1070O499K564k124j0101k663k551R266k121M778L295J156j0204
10806A0863j2596k159R65L778j5638j1244K4609K3843N786J6247Q277q779p171
10793C6781k557j4890j0901Q132M963K269Q479J1540J4995P773p926K1066J9954
10780I9678J4523L2558L2336M9541P3894J21525J96310K68931K23159J21439M2100
10769A275994J0114O2354O5299J510l2953P987O6239N3324k1197n4844l8886q3396
10757A311545j74075k58327k41417j50499n9070l5754K8826Q8618J23868J13371
10747G47086M7939q191p352n605k5451q0489j32998j08221r9644o5977m9367m0990
$$ plain form
10835 -3068 -15396 -9424 4830 2948 6770 4060 3297 -9196 -15378 -7616 -7573 -3972 1561 9407 19994
10820 19994 24139 13069 19568 22132 20008 9907 7244 4693 13959 11838 16616 19911 21067 10863
10806 10863 -1733 -3892 -2927 851 -14787 -26031 -1422 22421 28207 44454 52731 43952 36781
10793 36781 34224 19334 8433 16565 21528 23797 32276 43816 58811 66584 58658 79724 99678
10780 99678 114201 146759 179095 228636 302530 424055 620365 889296 1112455 1233894 1275994
10769 1275994 1286108 1348462 1413761 1415271 1382318 1390305 1456544 1509868 1488671 1433827 1394941 1311545
10757 1311545 1137470 879143 637726 487227 428157 392403 421229 509847 633715 747086
10747 747086 795025 786834 779482 773877 748426 667937 534939 426718 327074 261097 211730 170740
10735A70740k0659n267r772j7205J254o489j2020m462k4658j5020p805K783r890
10722D1530j397J166j584r734j2089r34J3406p709j8204O639J9939J0646m199
10709C7476n952R100K5338K5632L6869K8594K3919J4753J0769n129j9784l4358
10697A47227k9659j9277k2246N345q909o271r472j6322j348J4512J0352k2890
10685D1042k6066m708J3104J2743K3176J0741k33j8267j8134l81J7447P873K748
10672F1085N752k5519j6076J1872K8942R208J966K70R286K161j0528k5035k0114
10659C3270P485K838O222N257J2149j141q897q033m192O791L17P043n072Q099
10645F2136L470p065O31J1878N777p024N144J6300L0779K2864Q266K2171J6565
$$ plain form
10735 170740 150081 144814 135042 117837 119091 112602 100582 96120 71462 56442 48637 51420 41530
10722 41530 40133 41299 39715 29981 17892 16958 30364 22655 4451 11090 31029 41675 37476
10709 37476 31524 40624 65962 91594 128463 157057 180976 195729 206498 201369 181585 147227
10697 147227 117568 98291 76045 81390 72481 66210 56738 40416 39068 53580 63932 41042
10685 41042 14976 10268 23372 36115 59291 70032 69799 51532 33398 33017 50464 58337 61085
10672 61085 66837 41318 25242 37114 66056 75264 77230 77500 86786 88947 78419 53384 33270
10659 33270 40755 43593 49815 55072 67221 66080 57183 49150 44958 51749 52066 59109 54037 62136
10645 62136 65606 58541 59172 71050 76827 69803 74947 91247 122026 144890 153156 175327 191892
10632A91892o062J93q930k3973k1236n548K235Q499J606L2511K3759O494K2827
10619B24267J5586n073k414L141q85J577q653r377n033J179r849j3837l5472k8051
10605A27106r912j9830k2673o323p351j867P41Q983O717J5321K0541L364j5300
10592I9517j4957q960N925k432q666M679K618P41k853q796p805j6613j6524J889
10578B7763J7084L572l652K5806N9106P2815J03111J36123J38333J12517O7721
10567G60299O830l8092q0334j38034j48324j34080p7710n4476j1142p14j2836
10556G1387l311J2706J1265J4871p353j2970J2988M852j691K128J2348j0145r464
10543I7611J7000J6052l234j3446L007k548r515j752M867P244j1195J4172l559
$$ plain form
10632 191892 185830 186023 177093 153120 131884 126336 128571 137070 138676 171187 194946 201440 224267
10619 224267 239853 234780 232366 235507 234622 236199 227546 218169 213136 214315 204466 190629 155157 127106
10605 127106 117194 97364 74691 68368 61017 59150 59891 68874 75591 90912 111453 114817 99517
10592 99517 84560 75600 81525 79093 70427 75106 77724 78465 75612 66816 59011 42398 25874 27763
10578 27763 44847 48419 44767 70573 129679 202494 305605 441728 580061 692578 760299
10567 760299 767129 729037 648703 510669 362345 228265 150555 96079 84937 84223 71387
10556 71387 68076 80782 92047 106918 99565 86595 99583 104435 102744 104872 117220 107075 97611
10543 97611 114611 130663 127429 113983 116990 114442 104927 103175 108042 115286 104091 118263 114704
10530A14704L087J2709K351l949J3511O116J2884J6348l12L450J7769R142J2127
10517B19937K7969J2476J1991K2523J5047L0305M2699M3655O4559Q6397J26660
10506G04218J83221K79683M28976O11923O96447O01665L40808Q8225L4381J05986
10496D075533K2312k80877o07592o98038o00020m16992k71050j89122j31576r7836
10486H04742o5527n4999m8748m2437m9442m7595m2216l1476k4007j6489k3303
10475C58503k3277j2637l922j142l417j1301j1471J2642K0437M468l45K57j0694
10462C18101j3769k343J530M218K17P619J746k133R530J2707j2798o886Q696J574
10448C28009M056J8618J3805J6563K2981K4198K2527K2892J0449L4900N7674M3643
$$ plain form
10530 114704 117791 130500 132851 128902 142413 148529 161413 177761 177449 180899 198668 207810 219937
10517 219937 247906 260382 272373 294896 309943 340248 382947 426602 491161 577558 704218
10506 704218 887439 1167122 1596098 2208021 2904468 3506133 3846941 3935166 3969547 4075533
10496 4075533 4097845 3816968 3209376 2511338 1911318 1494326 1223276 1034154 902578 804742
10486 804742 739215 684216 635468 593031 543589 495994 453778 422302 398295 381806 358503
10475 358503 335226 322589 318667 317525 314108 302807 291336 303978 324415 328883 328538 328795 318101
10462 318101 304332 301989 303519 307737 307954 315573 317319 315186 324716 337423 324625 317739 326435 328009
10448 328009 332065 350683 364488 381051 404032 428230 450757 473649 484098 518998 576672 620315
10436F20315K3296L4490K2907J4410K0290J7415K4624K9146J9036L8021L5936
10425H99886L7361M7107J6822R74o999K754K1346K693k880q00J5830L1971K2937
10412A089002J8565K8892M1939K4824O1474O1356O6194Q2083R9414J17734J25838
10401A817315J34236J63091J77475J99638K43073K94268L97257M92064N66849
10392D485266N34072M61822M66264N84704P10213P72042Q53539J111853J510027
10383A1489802J920598K270095K669562L365017M689125O948983J0636466J6577616
10375F0567264K5921371L7993383M5620241L8329606J7736758K431703N124153
10368B33724479J4022946J0617438j199767k624440O369331P425034l353929r856228
$$ plain form
10436 620315 643611 678101 701008 715418 735708 753123 777747 806893 825929 863950 899886
10425 899886 937247 984354 1001176 1002150 995151 997905 1019251 1021944 1019064 1018264 1034094 1066065 1089002
10412 1089002 1107567 1136459 1178398 1203222 1264696 1326052 1392246 1474329 1573743 1691477 1817315
10401 1817315 1951551 2114642 2292117 2491755 2734828 3029096 3426353 3918417 4485266
10392 4485266 5019338 5481160 5947424 6532128 7242341 8014383 8867922 9979775 11489802
10383 11489802 13410400 15680495 18350057 21715074 26404199 33353182 43989648 60567264
10375 60567264 86488635 124482018 170102259 208431865 226168623 228600326 233724479
10368 233724479 247747425 258364863 257165096 254540656 260909987 268335021 264981092 255124864
10360B55124864o109112q375210k5206717m3206325m6491590l6455548k3728903
10353F5551459j4654984r362709o369715m646933l623722k920257k358561j952055
10345A9662523j729561j590353j414040j211278j021548q10830o18025m86347
10337A0780541m71751m89431m20348k45486j04792q8680j67634j96349j37103
10328H458967j81796l63470n57595o23041n84496n15667n02502m74607m27789
10319D228004l15397k37488k06294j76936j51521j36359j20157j19982j08899
10310B654971p1149m3624l8226j2942K3844J08088J75696K19086K29725K25055
10300C470524L04030L88458K50026J2058j580J63194Q8032k60590m31190l07032
$$ plain form
10360 255124864 249015752 240640542 215433825 172227500 125735910 89280362 65551459
10353 65551459 50896475 41533766 35164051 30517118 26893396 23973139 21614578 19662523
10345 19662523 17932962 16342609 14928569 13717291 12695743 11884913 11266888 10780541
10337 10780541 10308790 9819359 9399011 9153525 9048733 8960053 8792419 8596070 8458967
10328 8458967 8277171 7913701 7356106 6733065 6148569 5632902 5130400 4655793 4228004
10319 4228004 3912607 3675119 3468825 3291889 3140368 3004009 2883852 2763870 2654971
10310 2654971 2583822 2540198 2501972 2489030 2512874 2620962 2796658 3015744 3245469 3470524
10300 3470524 3774554 4163012 4413038 4425096 4423516 4586710 4674742 4414152 3982962 3675930
10290C675930j94304k92227m14306l66256k53536j87620j76812j73088j29207
10281A488574j07794q2133p4058n2166m4753n3752m1445k2669j4073k0772k1174
10270I53785k0744j8222m2334m4273j9874k5964n307J949q687j4230r994k4634
10258G21471j8530j2006r119j6598m243j2738j3022J62K236j4964J962k0386k8854
10245E75371N221r181j0947l145L887o362q658L00j604O337j5299k5452j0853
10232D99615j4606j3973j8773j9753L817J4812J039j1681j116j1962o280R90q019
10219D14110N119L550p053P092J0323N335M891P245R119L317J6877K6879K5408
10206E32212K5370J7450K7577L9601M6511M0733P9430J48169K66085M03494N58979
$$ plain form
10290 3675930 3481626 3189399 2775093 2408837 2155301 1967681 1790869 1617781 1488574
10281 1488574 1380780 1298647 1224589 1172423 1127670 1073918 1032473 1009804 995731 974959 953785
10270 953785 933041 914819 872485 828212 808338 782374 777067 779016 770329 756099 746105 721471
10258 721471 702941 690935 681816 665218 660975 648237 635215 635377 637613 622649 624611 604225 575371
10245 575371 580592 571411 560464 557319 561206 554844 546186 546486 544882 551219 535920 510468 499615
10232 499615 485009 471036 452263 432510 436327 451139 452178 440497 439381 427419 421139 422129 414110
10219 414110 419229 422779 415726 422818 433141 438476 443367 450612 459731 463048 479925 506804 532212
10206 532212 557582 575032 602609 642210 688721 729454 808884 957053 1223138 1626632 2185611
10195B185611O46842N31943K57838k5245j07799J2141J85076J54153r4764m13454
10185C332342n97562n73981m41737k90739k09745j69010j39021j07698q4346m8856
10175F69647l2941j0477j0555j5145J137K9551L2543M2803K3516j2850m7255l7987
10163F31987m0499l7261l3849j7339j8672k6800p073J953k2449l5769k4031j8332
10151C51866k0839k4955j9822k8056m908Q587j0798j7610k048p417j3285l480
10139B07235Q353K44q136j1291r153O874m281J1628J2568L952K349j1663j5873
10126A92806k475J0844K3593M138k0494j1584j1041M11L506K3437L509j6828N935
10113B05757O849j558K534K1449J072N392r027j9471j9040j5106o354p488L545
$$ plain form
10195 2185611 2832453 3364396 3622234 3596989 3489190 3501331 3686407 3840560 3745796 3332342
10185 3332342 2734780 2160799 1719062 1428323 1218578 1049568 910547 802849 718503 669647
10175 669647 636706 626229 615674 600529 601666 631217 663760 706563 730079 717229 669974 631987
10163 631987 591488 554227 520378 503039 484367 457567 450494 452447 429998 394229 370198 351866
10151 351866 331027 306072 286250 258194 253286 261873 251075 233465 231417 224000 210715 207235
10139 207235 215588 215832 207696 196405 187252 194126 189845 201473 214041 217993 220342 208679 192806
10126 192806 190331 201175 224768 228906 208412 196828 185787 186198 189704 213141 216650 199822 205757
10113 205757 212606 211048 213582 235031 236103 241495 232468 212997 193957 178851 172497 165009 168554
10100A68554K669j2748l324k609q465j0991P291Q186N131L977R565q275j4952
10087A44009M807R384o586O577M294j5314k1348j4680n342J195O836O920q807
10074A11945r494r530o316M144J3607R193Q923L942j3102p541l330m290p961J3256
10060A03446J7351L346M118J8209L223J3723k386N587N545Q989M342j5450L922
10047A73965n624j4375j3038L317K0184J0682m226p315j0731L086n461j0874j2282
10034A27308O417Q951J3696J8258K8106N2965J6349j3625n816o155n70J9467J391
10021B66742j9194j0790j2736k6873k5855j0297k54k427j2446p428m380o922l916
10008A23224m95K0586j26p009P60J042j581O101j7593q313k984J1181O653J3194
$$ plain form
10100 168554 171223 158475 155151 152542 144077 133086 140377 148563 153694 157671 167236 158961 144009
10087 144009 148816 158200 151614 158191 162485 147171 125823 111143 105801 106996 113832 120752 111945
10074 111945 102451 92921 86605 90749 104356 113549 122472 126414 113312 105771 102441 98151 90190 103446
10060 103446 120797 124143 128261 146470 149693 163416 161030 166617 172162 181151 185493 170043 173965
10047 173965 168341 153966 140928 144245 164429 175111 170885 163570 152839 155925 150464 139590 127308
10034 127308 133725 142676 156372 174630 202736 255701 272050 258425 252609 246454 245884 265351 266742
10021 266742 247548 236758 224022 197149 171294 160997 160743 158316 145870 138442 134062 127140 123224
10008 123224 122729 143315 143189 136180 136940 137982 136401 142502 124909 116596 113612 124793 131446 144640
9994A44640m128j0496P681J2268r192J0781K5577j5978N762J2458N211N146K954
9981A92684l295R695j54k278R915Q928J1498M972K1569N3501Q1763J47686J98142
9968G34626K44497K31091J19977K7403L6860Q1692O1889M991r951L5155K7972
9957A596202k6898n7775m1066m3541j28274k36099k63962j96716j25153q1557
9947C95161l8964l1561m1705l2241m587K97l5230q640j4431l567J3380r121p402
9934A81389j2178L277M13j0732j2052J0373N914q751L646L545p696m657n107j5245
9920A32139O900J0771N297j3917j4363J304M747R844p322k825P980j875L815J1025
9906A53520M13n089M105P39o558o219n677J0355J4603J9511K4585Oj9692p349
$$ plain form
9994 144640 140512 130016 137697 149965 140773 151554 177131 161153 166915 179373 184584 189730 192684
9981 192684 189389 199084 198930 196652 206567 215495 226993 231965 253534 307035 388798 536484 734626
9968 734626 979123 1210214 1330191 1357594 1394454 1476146 1538035 1543026 1533075 1568230 1596202
9957 1596202 1569304 1511529 1470463 1426922 1298648 1062549 798587 601871 476718 395161
9947 395161 356197 324636 282931 250690 246103 246400 211170 202530 188099 184532 197912 188791 181389
9934 181389 169211 172488 172901 162169 150117 160490 166404 157653 161299 164844 157148 152491 147384 132139
9920 132139 139039 149810 155107 141190 126827 128131 132878 142722 135400 132575 140555 138680 142495 153520
9906 153520 153933 148844 152949 153688 147130 140911 135234 145589 160192 179703 204288 204294 184602 177253
9892A77253j1977J5396r808j5907J1585M718n424r484L771M819O547m892j09R359
9878A75847q417j4567Q824j0935q622K1601N903J1214k440k0642p046j3398O439
9865A43761N869j0027O256K5205J8504o309m278k710n547J379q292M389O36o683
9851A62153r653Q568L081M902N184j4390M038J3973R770K240o205R895O030L776
9837B03362O8O714K3304J9011K2623K1230L8583P7830Q6982K3392n8395o1305
9825D03399n0803m6164k1838n221m532L245n147J0293R042J1678J0126J5065R823
9812C38966J6071L1553M2047L7723K0799J6477N198L6884O3577R8237J15987J38856
9800I62375K03176L33369N39790Q99058J460799J816938J492886Q26146J64112
$$ plain form
9892 177253 165276 180672 170864 154957 166542 171260 165836 156352 160123 164942 171489 166597 166488 175847
9878 175847 167430 152863 161687 150752 142130 163731 169634 180848 178408 157766 150720 137322 143761
9865 143761 149630 139603 145859 171064 189568 183259 178981 176271 170724 172103 163811 168200 168836 162153
9851 162153 152500 161068 164149 169051 174235 159845 163883 177856 187626 189866 183661 193556 199586 203362
9837 203362 203430 210144 233448 252459 275082 296312 334895 412725 499707 523099 464704 403399
9825 403399 352596 306432 284594 279373 274841 278086 272939 283232 292274 303952 314078 329143 338966
9812 338966 355037 386590 428637 466360 487159 503636 508834 545718 609295 707532 823519 962375
9800 962375 1165551 1498920 2038710 2937768 4398567 6215505 7708391 8534537 8698649
9791H698649k70501r39056j604386j731155j255672p39676m69403l06022k14150
9782A168628j55913j17433r4139p2261n8418l4792k9035k6887k0260j4132j5235
9771E30123j9022k1249l1466j7870k2070j9255q020k421Q65P48l077j7909j0385
9758C58992m634l548n275L491j6068j7386J923J0328O824M582r639j0201K459
9745C21848O012j0895j4350Q836r550J028l690k496n26k971j9248m524m247O619
9731B71846L719O175O625K602j4704j03l150j5715j0973J956p260L483Q528q161
9717B44868K312N995j3419L317M568K088n809J0158q87n382p316p961q247K256
9703B26541L921k133j202j6606j4348m681J6088J337m141q417R200O415L028r755
$$ plain form
9791 8698649 8428148 7489092 5884706 4153551 2897879 2158203 1688800 1382778 1168628
9782 1168628 1012715 895282 801143 728882 670464 635672 606637 579750 559490 545358 530123
9771 530123 511101 489852 458386 440516 418446 399191 391171 388750 389615 390363 387286 369377 358992
9758 358992 354358 350810 345535 349026 332958 315572 317495 327823 334647 339229 329590 319389 321848
9745 321848 327860 316965 302615 311451 301901 302929 299239 296743 296217 293246 273998 269474 265227 271846
9731 271846 275565 281740 288365 290967 276263 276160 273010 257295 246322 248278 241018 244501 253029 244868
9717 244868 247180 253175 239756 243073 247641 249729 243920 254078 253191 247809 240493 232532 224285 226541
9703 226541 230462 228329 227127 210521 196173 191492 207580 208917 204776 196359 205559 211974 215002 205247
9689B05247K307K419O823p426q119n157K986m642J3082q59k3866j0522j47r640
9675A62486n625J5434m22K926Q793J5803r2p206j3273N726K923J52k929j0936
9661A73760j0277j0788J331j285m176O745j279l848j1971r347P51O737j4446l759
9647A18148J2459K0834p091k1779N253J6841j0286j4804k093j569J4209O980Q180
9634A45282j2816r366k776J0501J956j1476M035k199M435Q555P248N535m933r368
9620A34613j4156j7988j0707L979J2261J0891m886k5142O722R635M961q23l349
9607A06011j3751j6565J0280N901O451K751P020Q688r962n70k012j027J224M140
9593A08579j0199j7020m719J550J884j244l613K328l906J2522J143o476o852M614
$$ plain form
9689 205247 207554 209973 216796 209370 201251 196094 199080 194438 207520 206661 182795 172273 172126 162486
9675 162486 156861 172295 171873 174799 183592 199395 199303 192097 178824 184550 187473 187625 184696 173760
9661 173760 163483 152695 154026 152741 148565 155310 154031 150183 138212 128865 129616 136353 121907 118148
9647 118148 130607 151441 144350 122571 127824 144665 134379 119575 117482 115913 130122 137102 145282
9634 145282 132466 123100 120324 130825 132781 121305 125340 123141 127576 136131 143379 148914 143981 134613
9620 134613 120457 102469 91762 95741 108002 118893 114007 88865 95587 105222 110183 109360 106011
9607 106011 92260 75695 85975 91876 98327 101078 108098 116786 106824 106254 104242 103215 104439 108579
9593 108579 98380 81360 76641 78191 80075 78831 75218 77546 73640 86162 87305 80829 73977 78591
9579G8591j14o729L75J553M825j0245j6970m751J1475M070k320N494R988l508
9565G1734o246M72n368r288N921O673p257J458Q362N288n316M833r341N29L351
9550F5805l276o535K2Q67M002J0134N92q690j2909M977J2278N191l992j6014j7884
9535C4568J535J2545Q867o891j5998P99O447l35jj1174J3852R931K542J267K769
9520F0723l780k477K125n943j880p515k536j562K943N021J2562R724k460j5668
9506D9277n579J2262L681j7952r711M790K1112P843p453L985m375k304l399k691
9492D9486K575k707K193p234M734M122K1673M784r064m699j1452l849J3995k337
9478F2220j2910j4788j654J8282K459j3900m036P158r862O109K274K60p0J7922
$$ plain form
9579 78591 78477 71748 72123 73676 78501 68256 51286 46535 58010 62080 59760 65254 75242 71734
9565 71734 65488 65960 60592 51304 57225 63898 56641 58099 66461 71749 66433 71266 61925 62454 65805
9550 65805 62529 55994 56016 56883 60885 71019 71611 62921 50012 54989 67267 72458 68466 52452 34568
9535 34568 36103 48648 57515 50624 34626 35425 41872 41537 41536 30362 44214 54145 56687 57954 60723
9520 60723 56943 54466 56591 50648 48768 41253 38717 37155 40098 45119 57681 67405 64945 49277
9506 49277 43698 55960 59641 41689 31978 36768 57880 65723 58270 62255 57880 55576 52177 49486
9492 49486 52061 49354 51547 44313 49047 53169 74842 79626 70562 65863 54411 50562 64557 62220
9478 62220 49310 34522 32868 51150 53609 39709 35673 42831 32969 39078 41352 41612 41542 59464
9464E9464K932j1555M99j0937l6851q965R133Q013j96P853J2011J2334o468o531
9450C0736p173K618M040Q079q42m599m140k531L937k877j879J540J1270J5519
9436E3698l592j0138q132j736m667P156r52j0723R40R307q316k698L238k10q03
9421B2372o187K520l332P023K450r379J0304P02L093m861m296L501M935o337L238
9406B5746J880P989J83n895j1520J796J7391M741l368J874q38J0725q213j0089
9392C2402k839n755K677J2511O272J1667P427J0631l693k207j738p320j3608k788
9378D3639l78m780L258r539o003J1305r526j1895r436K205J5263J3069m305Q664
9364D1541N53j1904j398l028j6985N288J1443L658L775j9222p256P695J5306P686
$$ plain form
9464 59464 62396 50841 51340 40403 3552 -5413 3720 11733 11537 19390 31401 43735 37267 30736
9450 30736 23563 26181 30221 38300 37458 32859 28719 26188 30125 27248 25369 26909 38179 53698
9436 53698 50106 39968 31836 30100 25433 32589 31637 20914 21854 31161 22845 20147 23385 23175 22372
9421 22372 16185 18705 15373 22396 24846 15467 25771 26473 29566 24705 20409 23910 28845 22508 25746
9406 25746 27626 35615 35798 29903 18383 20179 37570 42311 38943 40817 39979 50704 42491 32402
9392 32402 29563 23808 26485 38996 45268 56935 64362 74993 71300 69093 67355 60035 46427 43639
9378 43639 43261 38481 41739 32200 26197 37502 27976 16081 6645 8850 24113 37182 32877 41541
9364 41541 42094 30190 28792 25764 8779 14067 25510 29168 32943 13721 6465 14160 29466 37152
9350C7152n221q294p537o544L667Q139j2698M397K1541J6405k4632r297J9J230
9336A8327J1637k510K38P726q171q987J2377K323q777j8626R443J238J917P067
9322B5222k232K707J6050j495k0113L68P95K498o75K442Q09K786j236j1556J1749
9307B8119P123j0803J006L190k219l649j3923J720J1889J1371j6140j3053P595
9294A2226Q044o344n884m13m58N897M14O71P987O025J0404Q472k581k1180n024
9279A8256J1913j2408n346Q985K395L383O842J042j585O423j0553j8439P872N936
9265B4716o455k945K773M814J0945J436r554p073q444J409M302K0855p28K011
9251C8062p43j0758j5733l847k942l806M444N696K591R17M786K528J1702j101
$$ plain form
9350 37152 31931 23637 16100 9556 13223 21362 8664 13061 34602 51007 26375 17078 17097 18327
9336 18327 29964 27454 27692 35418 27247 18260 30637 32960 24183 5557 15000 16238 18155 25222
9322 25222 22990 25697 41747 40252 20139 20507 21302 23800 23125 25567 26376 29162 27926 16370 28119
9307 28119 35242 24439 25445 28635 26416 22767 8844 10564 22453 33824 17684 4631 12226
9294 12226 20270 13926 8042 7629 7171 13068 13482 14153 22140 28165 38569 47041 44460 23280 18256
9279 18256 30169 17761 12415 21400 23795 27178 34020 35062 33477 39900 29347 10908 18780 24716
9265 24716 18261 15316 18089 22903 33848 35284 25730 18657 10213 11622 15924 36779 36051 38062
9251 38062 37319 26561 10828 6981 4039 233 4677 10373 12964 13881 18667 21195 32897 31796
9237C1796j5919J323K789R179K706j5330l608Q466R066o749j3583M710P756K675
9223B5277j113K216J658K572j70m328K730J4327j0924p031M351J2052Q263k39
9209D9641j3837j0913O74J3476m581o580L444K184j2317j4210J0546O062o627
9196A6962p826M919L332J1247l124L057L457k798j0981o351m393n630K656K4420
9182B8947J2460m414p519o099j394P528Q292j0585P220P660n317j7468j2083Q323
9168A5551K2260J1532r072j8664j820o852j3024N181O909L779n573k342Q504n321
9154A1048M607J5938N376p388K028o831r387m494j0656Q080p94n128p93J8991
9140B0597J062M933Q112j0263j7838l431J6241J1099j240r109m782n208k235j2197
$$ plain form
9237 31796 15877 17200 19989 29168 31874 16544 12936 21402 30468 23719 10136 14846 22602 25277
9223 25277 24164 26380 28038 30610 30440 26112 28842 43169 32245 25214 29565 41617 49880 49641
9209 49641 35804 24891 25565 39041 34460 27880 31324 33508 21191 6981 17527 23589 16962
9196 16962 9136 14055 17387 28634 25510 28567 32024 29226 18245 11894 7501 1871 4527 28947
9182 28947 41407 36993 29474 23375 21981 29509 37801 27216 34436 42096 36779 19311 7228 15551
9168 15551 37811 49343 40271 21607 19787 12935 -89 5092 12001 15780 10207 7865 16369 11048
9154 11048 15655 31593 36969 29581 31609 24778 15391 10897 241 8321 7527 2399 1606 20597
9140 20597 21659 26592 34704 24441 6603 3172 19413 30512 29272 20163 15381 10173 7938 -4259
9126d259K113K0760J7384L741n184Q005m960j1108Q63k009j109m728p026L681
9112A6164p98q961P856P147m615O931J968j524o233n028k171m968O891P456Q105
9097B8220M142m69l94o40p996j4767M835k065j596N670j10L448M556l16M936m980
9081B2474j972J012Q811O408J281n780j0920j5489L640J5804k254j209J0436n40
9067C1702J0952j1062k5550j1144M264K0551K6610m471p403r626p505M655o656
9054A5317r675o511O814K392l200J5700R004P839l346j3861j7952J629m478n652
9040e980R824O769L656R68m341n101k747J0035r94j0918M825O044R511O92R908
9025C2151R158j720k1960q895J8274J4759R723J1533p465j1864j5918l140q921
$$ plain form
9126 -4259 -2146 18614 35998 39739 34555 42560 37600 26492 27355 25346 24237 19509 12483 16164
9112 16164 15366 6405 14261 21408 16793 23724 25692 24168 17935 12907 10736 5768 12659 20115 28220
9097 28220 32362 31893 31499 30859 22863 8096 12931 10866 9270 14940 14830 18278 22834 22518 27454 22474
9081 22474 20502 21514 30325 36733 38014 32234 21314 5825 9465 25269 23015 21806 32242 31702
9067 31702 42654 31592 6042 -5102 -838 19713 46323 41852 34449 24823 17318 21973 15317
9054 15317 5642 -869 5945 8337 5137 20837 29841 37680 34334 20473 2521 4150 -328 -5980
9040 -5980 3844 10613 14269 15237 10896 5795 3048 13083 12089 1171 5996 12040 21551 22243 32151
9025 32151 41309 39589 17629 8734 27008 41767 51490 63023 55558 43694 27776 24636 15715
9012A5715O422J921J1848p8j0329K787O099k990o174k1929m32l580N734l3l95
8997D586M149P892j250l718Q615l107j6189m791L591Q543J0183N189p92P825R43
8982C1669P11m46n226j3830N803Q260o741j7014M0Q504N358o056j2548K020J693
8967B197m871M540J8801O450K017K652m338l065p48r941J3086Q257J886j1737
8953B5186o579k928n260P447m167M00N864O29j567M827l399m215r844l010J0598
8938A3982M991n986j3591j4587J4779j240l353k21L575k12o570l819J4246j075
8924I19p094o766P685J4363J6871J488p356n313M416r183O116M388n285R61M282
8909B0492K2m771j2605O516M267P511J3894n934p02J211J931o564n635L719Q684
$$ plain form
9012 15715 22137 24058 35906 35828 25499 28286 34385 31395 25221 3292 2860 -720 5014 4981 4586
8997 4586 8735 16627 15377 11659 20274 17167 978 -3813 -222 8321 18504 23693 22901 30726 31669
8982 31669 32380 31934 26708 12878 18681 26941 20200 3186 3226 11730 17088 11032 -1516 504 2197
8967 2197 -2674 1866 20667 27117 29134 31786 27448 24383 23635 13694 26780 35037 36923 25186
8953 25186 18607 15679 10419 17866 13699 14099 19963 20592 19025 23852 20453 16238 6394 3384 13982
8938 13982 18973 12987 -604 -15191 -412 -1652 -5005 -5226 -1651 -1863 -8433 -12252 1994 919
8924 919 -6175 -12941 -5256 9107 25978 27466 20110 14797 19213 10030 16146 20534 15249 16210 20492
8909 20492 20514 15743 3138 9654 13921 21432 35326 29392 28690 29901 31832 25268 19633 23352 32036
8894C2036K529n511L455p630l4O669n23o191j0067k890j2334j4035J5087J5137
8880A5698j1193j2320M838P298k172M454j606n509l895l875n235O578R910J0837
8866A3808q716m42K4404p337j7331M129M7o972R437Q33j073J5691P039r331j3880
8851A0306J701j490j864N351L210j0883r520J5681O388j3712k019P507K152r598
8837C210l302j0001J419L161n036j597q18J6583M316l776N992K86R974j9094j6874
8822a5557J8550N613j307k167L9p118j272J247Q866J0723j3402n539R380n121
8808B935J2011J2532o656m455L161k953L60j184K601M674p25L26j0325r817M96
8793B981M288q991q887L684J527P536O020M043Q948L21q278o924j828l490K812
$$ plain form
8894 32036 34565 29054 32509 24879 24845 31514 30991 24800 14733 11843 -491 -14526 561 15698
8880 15698 4505 -7815 -2977 4321 2149 6603 4997 -512 -4407 -8282 -13517 -6939 2971 13808
8866 13808 5092 4650 29054 21717 4386 8515 8562 1590 11027 11860 10787 26478 33517 24186 10306
8851 10306 12007 10517 8653 14004 17214 6331 -3189 12492 18880 5168 3149 10656 12808 3210
8837 3210 -92 -10093 -8674 -5513 -10549 -12146 -12964 3619 7935 4159 10151 10437 20411 1317 -15557
8822 -15557 2993 8606 7299 5132 5171 -1947 -3219 -1972 6894 17617 4215 -1324 8056 2935
8808 2935 14946 27478 20822 16367 19528 16575 16935 15751 18352 23026 22301 22627 12302 2485 2981
8793 2981 7269 -1722 -10609 -6925 -5398 2138 8158 12201 21149 21470 13192 6268 4440 950 3762
8778C762l13l841J0196l721n077O417L250J2082o3j3923j8775k838Q553J898L54
8763b039O781N660L804O636j0460P311o76m832m953J2584k190J748l205J569O402
8748B4140l133o866n729m06j382o912o597K716O040M001j6P226o007m323P034
8733I786L229O516l42l693M526J3553L056r150j5308M11l256L907M822R735k065
8718B5727k398Q859j511O767j4358r423j279O214J3372P518l654q413r39k294
8704B4188J256Q500J5904j1051j6473R297k300L599k478n727j882o754p822M704
8690A2961l170j001J1082k594k231J0673P736j530L395L055j3150k665l518M166
8676B3209J452L018J430J0065o222l31N089j3246r857k14o405J7313K5646j3097
$$ plain form
8778 3762 3449 -392 9804 6083 1006 7423 10673 22755 22692 8769 -10006 -12844 -4291 -2393 -2039
8763 -2039 4742 10402 14206 20842 10382 17693 17017 12185 7232 19816 17626 19374 16169 17738 24140
8748 24140 21007 14141 8412 8006 6624 -288 -6885 -4169 1871 5872 5856 13082 7075 2752 9786
8733 9786 13015 19531 19189 15496 20022 33575 36631 27481 12173 12584 9328 13235 18057 27792 25727
8718 25727 23329 32188 30677 37444 23086 13663 12384 18598 31970 39488 35834 27421 26482 24188
8704 24188 25444 33944 49848 38797 22324 31621 29321 32920 30442 24715 22833 16079 8257 12961
8690 12961 9791 8790 19872 17278 15047 25720 33456 31926 35321 38376 25226 22561 19043 23209
8676 23209 24661 27679 29109 39174 32952 32621 37710 24464 14607 14393 7988 25301 50947 37850
8662C7850k9833j3561J8252J2006L696J1800O333l3K689j687r767n520j2655J24
8648A9694L860o225K238J1773O038Q935q359j4008K120L869M283m169J290Q022
8634C9361j4353n944J6270P242J9371O296J1380J6990Q895j6406o187p240n497
8621G0178m221k752j405j0333j4107k812J038J3050k095r281j812M6N446O043
8607D6983l370p546P671J1281N013M224j1731j3921m959j412o307P266K7639M194
8593F5025j1052j558M247K029q752k0N034L600N181K8453L4696M5188L8973R888
8579B20932m6576m0551k5783M198j320L947K3277l27j2177j3113j7480j0258j3477
8566G1292J094l946j369m165r812N201j1061J6869R513j9911j2879L97N775M619
$$ plain form
8662 37850 8017 -5544 12708 24714 28410 40210 46543 46510 49199 47512 37745 32225 19570 19694
8648 19694 23554 17329 19567 31340 37378 46313 37954 23946 26066 29935 34218 30049 31339 39361
8634 39361 25008 19064 35334 42576 61947 68243 79623 96613 105508 89102 82915 75675 70178
8621 70178 65957 63205 61800 51467 37360 34548 35586 48636 46541 37260 35448 35494 40940 46983
8607 46983 43613 36067 43738 55019 60032 64256 52525 38604 33645 32233 25926 33192 60831 65025
8593 65025 53973 52415 56662 58691 49939 49919 54953 58553 63734 92187 126883 172071 211044 220932
8579 220932 174356 133805 108022 112220 110900 114847 138124 137797 125620 112507 95027 84769 71292
8566 71292 72386 68440 67071 62906 53094 58295 47234 64103 73616 53705 40826 41223 46998 51617
8552E1617j8521j4912J1426L655j0508r01P418o334n79K183P648l312k688J0129
8538C6321J2477N378J8430K334j3157k3058j3888l117n999P076J5431m309o614
8525B7305J9301K097j4166j0532q756J7179K1006J8874J1673j0755l1221j8241
8513B3764j1577k302L319p489j3139j958N986O629P062L542K508k55N270O295
8499B7655k657J0412J0953J8149J4523L173N446q338j5673k3472p072J755O888
8486D1742l259j3448n589j0889o641L924n86j5348n374R102K7449P909r126j3075
8472F791M060J3221J0268q262j2236l342l535N8O902l807j350R139K386j5678
8458D615p155O761J6086k342j807M011L664j107O051K6335K1053N0278M0777k45
$$ plain form
8552 51617 33096 18184 29610 33265 22757 21856 29274 22940 22361 24544 32192 28880 26192 36321
8538 36321 48798 54176 72606 74940 61783 38725 24837 21720 15721 22797 38228 33919 27305
8525 27305 46606 48703 34537 24005 15249 32428 53434 72308 83981 73226 42005 23764
8513 23764 12187 9885 13204 5715 -7424 -9382 -3396 3233 10295 13837 16345 16090 21360 27655
8499 27655 24998 35410 46363 64512 79035 82208 87654 79316 63643 40171 33099 34854 41742
8486 41742 38483 25035 19446 8557 1916 5840 5254 -10094 -15468 -6366 21083 28992 19866 6791
8472 6791 10851 24072 34340 26078 13842 10500 6965 7023 13925 10118 8768 17907 20293 4615
8458 4615 -2540 4221 20307 17965 16158 20169 23833 22726 28777 55112 76165 126443 167220 166975
8444A66975k3842m3359l5525j3456o923l570j2868J1862J4933q93j3819l803K704
8431C8416j104p632r57r645o7m964j1849p531j302J3370M839j721q036j3895O230
8416e848J7576r688m346J290n30J3938J6323j409j5384N222J1557J0608K359L024
8402D4692l557K819o790O678J6743K62j1954j0598O232l580j2017r935P940N292
8388C2227j022n082j3531j5303m368P155N728m354j040r83O656K119j4131J259
8374d670K2621J1181j6109q986J61K286J3923K944j892q952j4858n685j7162L818
8360b1380K3154j603k836O666k774L524N800r87j6395l205O820J2670p1L678k356
8345A0705j0512j2794P272P934j0517n860m222M985l924M221K003m012o098p412
$$ plain form
8444 166975 143133 99774 64249 50793 43870 40300 27432 39294 54227 53334 39515 35712 38416
8431 38416 37312 29680 28723 19078 19011 14047 2198 -5333 -6635 6735 11574 9853 1817 -12078 -5848
8416 -5848 11728 2040 -2306 -1016 -1546 12392 28715 27306 11922 17144 28701 39309 41668 44692
8402 44692 41135 43954 37164 43842 60585 60847 48893 38295 44527 40947 28930 18995 26935 32227
8388 32227 31205 26123 12592 -2711 -7079 76 5804 1450 410 -573 6083 8202 -5929 -4670
8374 -4670 17951 29132 13023 4037 4198 6484 20407 23351 21459 12507 -2351 -8036 -25198 -21380
8360 -21380 1774 171 -2665 4001 1227 4751 10551 9564 -6831 -10036 -3216 9454 9383 13061 10705
8345 10705 193 -12601 -5329 2605 -7912 -13772 -17994 -13009 -16933 -12712 -10709 -14721 -20819 -28231
8331b8231J799O134m724J5606K2930L289M971j2356o183O297j436k999Q265R327
8317B2689j6882j665J4211j421N20l989m39J4888n841j4144K147m078J2306Q061
8303B6363j196j4832j2092N49p970N812K325J9098J2265j0377j5147L77p76q572
8289d173K318J2072L310J2058j398j5649p533k044L951J492L124j728o269p096
8275g565J0484J4617l280l739M360o025M8K127j406j4818r440Q612J2742L813
8261A0530P922J5968K891j0803j7620p076M755l502L245l51j3079j455N630k68
8247c213O029R756J7310L38j2133j5335n306L525J5451P54l07P6M003o081j4430
8232D37m467L656K731o280j773Q438k411p669J42J5567K0653K412M242j3458j9627
$$ plain form
8331 -28231 -26432 -20298 -25022 -9416 13514 16803 21774 9418 3235 9532 8096 5097 13362 22689
8317 22689 5807 4142 18353 16932 17452 13463 13024 27912 22071 7927 10074 5996 18302 26363
8303 26363 25167 10335 -1757 -1208 -9178 -3366 -1041 18057 30322 19945 4798 5175 4399 -4173
8289 -4173 -1855 10217 13527 25585 24187 8538 1005 -1039 2912 4404 7528 5800 -469 -7565
8275 -7565 2919 17536 14256 10517 14877 8852 8900 11027 9621 -5197 -14637 -6025 6717 10530
8261 10530 18452 34420 37311 26508 8888 1812 6567 3065 6310 5959 -7120 -8575 -2945 -3213
8247 -3213 2816 12572 29882 30220 18087 2752 -2554 971 16422 17176 16869 16945 20948 14867 437
8232 437 -4030 -374 2357 -3923 -5696 2742 331 -7338 -7196 8371 29024 31436 35678 22220 2593
8217B593J2929L87q299k004k57j166j530J347J0689p982K810M471l543q061m2
8202B342r100k587M744O490P31k178Q65K476q768M677J6490R680O862m392j2319
8187A6013l035L464j2507j6430m738Q466J0353K158n192j4406J2984J0910R210
8174A7250Q203q908l722q752M912j520q068k961R069Q668m049j1027J122J663
8160A880k255n921J455j038p973j7715o995J7897J0660K28J1337K521J4187n468
8146A2800j7335n935L146J6382J2704K784p646n147M68m064J4668L830j3745j6714
8132c804o951J9073K7938j101r770o513l950O720p731p658m277R84j303j0600
8118h943n864O548m11n83M702J6440K117j0696J321N520P209k713n961n722N28
$$ plain form
8217 2593 15522 15909 7610 5606 5349 4183 2653 4000 14689 6707 9517 13988 10445 2384 2342
8202 2342 -6758 -9345 -4601 1889 2620 442 1307 3783 -4985 -308 16182 25862 32724 28332 16013
8187 16013 12978 16442 3935 -12495 -17233 -8767 1586 3744 -1448 -15854 -2870 8040 17250
8174 17250 25453 16545 12823 4071 8983 7463 -605 -3566 5503 14171 10122 -905 217 1880
8160 1880 -375 -6296 -4841 -5879 -13852 -31567 -38562 -20665 -10005 -9777 1560 4081 18268 12800
8146 12800 -4535 -10470 -7324 9058 21762 24546 16900 11753 12221 8157 22825 26655 12910 -3804
8132 -3804 -10755 8318 36256 35155 25385 18872 14922 21642 13911 6253 1976 2960 1657 -8943
8118 -8943 -14807 -8259 -8670 -9253 -4551 11889 14006 3310 4631 10151 17360 14647 8686 2964 3492
8103C492l072j4755K966J0082R937r285p07l53n650j828O561M36m766J882J773
8088c287J4974m075j1696k535O910j774L300o251J734K936j191R60m325J0226
8074E906K0814J0985J97j4196j6882r809p998m419q114L521Q207q940O023Q477
8060f228N237P608o835j77o772p178o086N692Q085L525j810j1044o160J2662j7016
8045b6497R202J1829J1635K691j2565j081j9775p796P979J1534J0420J2084P632
8032A7292O16o315Q368R893N635j5292j0679o343m327o68R790j106j1562J2071
8018G373P768K580j333M836Q85J4026N673p657j832m503j0252r627L543J0016
8004B1496Q738k412n632j4L654l563K270R589K137n521j8096j474K2870Q084r382
$$ plain form
8103 3492 420 -14335 -11369 -1287 8650 -635 -1342 -1695 -7345 -9173 -2612 -2176 -6942 -5060 -3287
8088 -3287 11687 7612 -4084 -6619 291 -1483 1817 -4434 -2700 236 -955 5 -4320 5906
8074 5906 26720 37705 37902 23706 6824 -2985 -10983 -15402 -23516 -19995 -11788 -20728 -14705 -6228
8060 -6228 -991 6617 -218 -395 -7167 -14345 -20431 -14739 -6654 -3129 -4939 -15983 -22143 -9481 -26497
8045 -26497 -17295 -5466 6169 8860 -3705 -4786 -24561 -32357 -24378 -12844 -2424 9660 17292
8032 17292 17908 11593 19961 29854 35489 20197 9518 3175 -1152 -1820 7970 6864 -4698 7373
8018 7373 15141 17721 16388 21224 22109 36135 41808 34151 32319 27816 17564 7937 11480 21496
8004 21496 30234 27822 22190 22176 25830 22267 24537 34126 36263 30742 12646 11172 34042 42126 32744
7989C2744j3945O337J3333J0544J5299J0119M145J7p19k77M997j1661j6634j3591
7975D0708K228J1084K130K2020K8934l271k0625k4889j7518j4944l542L008M875
7962C0198n056P133k0113J609K260K623j43J781K418P980n213j8982O296P354
7948B0145o822l694k818P871K1897J5859M226J6785O280m760r820R176L590q380
7934F9535M916K4438L006p792R657J4513K020j9281k8813j9056m023j1283j2622
7921B5215m040K311J893r199J0666P085j94j4322m482N909j177L686N304n214
7907B3441K582l274L590N683j0233N732M846Q979K062K908M210l727p432m109
7893C5258j410M597r620q930J484R702P666j6488m415M973q319j2021l501p82
$$ plain form
7989 32744 18799 25136 38469 49013 64312 74431 78576 78593 77874 77597 82594 70933 54299 40708
7975 40708 42936 54020 56150 78170 107104 103833 83208 58319 40801 25857 22315 25323 30198
7962 30198 25142 32275 12162 13771 16031 18654 18511 20292 22710 30690 25477 6495 12791 20145
7948 20145 13323 9629 6811 14682 36579 52438 56664 73449 79729 74969 65149 74325 77915 69535
7934 69535 74451 98889 101895 94103 103760 118273 120293 101012 72199 53143 49120 37837 25215
7921 25215 21175 23486 25379 16180 26846 33931 33737 19415 14933 20842 19665 23351 28655 23441
7907 23441 26023 22749 26339 32022 21789 27521 32367 41346 43408 46316 50526 46799 39367 35258
7893 35258 33848 38445 28825 19895 21379 31081 38747 22259 17844 22817 14498 2477 -1024 -1806
7879a806J0109Q785l608Q646L883K444o472j5532J431m471k028j5041k325J0282
7865e703J5406O802j5449n415j982P820N1O11p598l544O507J0987j1656K354M757
7850C948r162Q320L275j1092J258J3712r319O973J1308j4764j3840q7L427P39
7836e304j332J312l10p325J5881J3582k169q5q043o32Q246p179k88Q24J4267M950
7820B6395M766j2280q700j1824j6905J106L709M49j741J2794J4554j0433j1362
7807i472r692l75P143M968R528j299q534k500J1366J3041L346l711K699j2275
7793D233m301m022P880M693q2p954j4990M446P662K79n707M755k604P560J7874
7778A9722Q89N12K642j658q840p405j0750l596j665J2782R674j6291l056m413
$$ plain form
7879 -1806 8303 17088 13480 22126 26009 28453 21981 6449 7880 3409 1381 -13660 -15985 -5703
7865 -5703 9703 16505 1056 -4359 -6341 1479 1530 2141 -5457 -9001 -2494 8493 -3163 -809 3948
7850 3948 -5214 3106 6381 -4711 -3453 10259 940 7913 19221 4457 -9383 -9470 -6043 -5304
7836 -5304 -6636 -5324 -5634 -12959 2922 16504 14335 14250 6207 5575 13821 6642 6354 7178 21445 26395
7820 26395 31161 18881 10181 -1643 -18548 -17442 -13733 -13284 -15025 -2231 12323 1890 -9472
7807 -9472 -19164 -19539 -12396 -7428 2100 801 -7733 -10233 1133 14174 17520 13809 16508 4233
7793 4233 -68 -4090 3790 8483 8401 447 -14543 -10097 -2435 -2156 -7863 -3108 -5712 1848 19722
7778 19722 20611 21123 23765 22107 13267 5862 -4888 -8484 -10149 2633 12307 -3984 -7040 -11453
7764a1453r078O384M175k867m953k901J770J2143J529j6514L954J034L253j026
7750a4550J166L042p308J8682L313p062j21P999j012J953J7143N141O660p691
7736B7355j6920J9862p272r445j0718O642P761l300J519o66m416J279q70Q64p248
7721D427j7432J135p01K614O27l20Q803r45R30M893j1892q772P745N604r850r532
7705b2666M828J1786L055J738n339r266j4092l563J9032l202p910J5393J1154
7692I48J129j2959K181J8295P730Q092P636k282k984o176N83k819j6103J782L550
7677H603m330N275j286j244M475j965j1635o825n007L076K381R816L232k1761
7663a7195L446K5565M871o875L447K478j7287j3676j901K0090J294j5643k491
$$ plain form
7764 -11453 -20531 -14147 -9972 -12839 -17792 -20693 -18923 -6780 -5251 -21765 -17811 -16777 -13524 -14550
7750 -14550 -13384 -10342 -17650 1032 4345 -2717 -2838 5161 4149 6102 23245 28386 35046 27355
7736 27355 10435 30297 23025 13580 2862 9504 17265 13965 15484 14818 10402 11681 10811 11675 4427
7721 4427 -13005 -11870 -12571 -9957 -9330 -9650 -847 -1792 -862 4031 -7861 -16633 -8888 -3284 -13134 -22666
7705 -22666 -17838 -6052 -2997 -1259 -6598 -15864 -29956 -33519 -14487 -17689 -25599 -10206 948
7692 948 2077 -10882 -8701 9594 17324 25416 33052 30770 27786 21610 22193 19374 3271 5053 8603
7677 8603 4273 9548 8262 7018 11493 9528 -2107 -8932 -13939 -10863 -8482 1334 4566 -17195
7663 -17195 -13749 11816 16687 9812 13259 15737 -1550 -15226 -17127 2963 4257 -11386 -13877
7650a3877m338O553J105N872M571O017J457R054k932m051J071j6485j0887O092
7636a0778L295K139m724o25P96M259R390p074j189L785M96J141O527q747N792
7621D483k104m361n747j3976N362J9011j948j5064j312J3209P079j611J711L733
7607H465L002N182p160K374n28r356N048J684m424j658j276O70q356m598Q926
7592b005l300m235O120j5497k278R013k77j1717j1508j705K3233J5627R56O989
7578I416j0491m892j931k419M804k621K159l781o758J0694K691q270N778P572
7564A951k385J2228O527r921O627M995K469m638k534p768j6031l30K721K447Q369
7549D727Q35L225n677Q480N054j0575k1058r738P090J2470J8672J278M420o358
$$ plain form
7650 -13877 -18215 -11662 -10557 -4685 -114 5903 7360 16414 13482 9431 10502 -5983 -16870 -10778
7636 -10778 -7483 -5344 -10068 -10693 -9897 -5638 3752 -3322 -4511 -726 -230 911 7438 -1309 4483
7621 4483 2379 -1982 -7729 -21705 -16343 2668 720 -14344 -15656 -2447 4632 3021 4732 8465
7607 8465 11467 16649 9489 11863 11335 1979 7027 8711 4287 2629 1353 2023 -6333 -10931 -2005
7592 -2005 -5305 -9540 -3420 -18917 -21195 -12182 -12459 -24176 -35684 -37389 -14156 1471 2427 9416
7578 9416 -1075 -5967 -7898 -10317 -5513 -8134 -5975 -9756 -16514 -5820 -3129 -11399 -5621 1951
7564 1951 -434 11794 18321 8400 15027 20022 22491 17853 15319 7551 -8480 -8810 -6089 -3642 4727
7549 4727 5562 8787 3110 11590 16644 6069 -14989 -24727 -17637 -5167 13505 14783 19203 12845
7535A2845p498j9822j136P184K983J0601N633L906L969P83q343n718k184l903
7521g00l549p535J319n597k698M405P494n132N759k0053J3594J2862q079m69J184
7506g195q58O95J2648N256j0848k139j144o532n13J2885K448P013l193j015K249
7491I757l34j0747j1069J944o64M956J140P616P288L647J953l572q777n161n367
7476g390M229J9466N735J126q608k2419n943p38k853l422l386l648Q519l495J682
7461b1145R693K725Q411L03J098p58L155P465J0526j061m692j6156p371q894k783
7446a9484J0157m954n799R22J2553M351m344L717L153r9K1561k178j3423m99j3979
7431h345k81o98N62o495j115J3518M7o180Q08j1827L155J1592O43l790k907o309
$$ plain form
7535 12845 5347 -14475 -15611 -8427 -5444 5157 10790 14696 18665 19448 11105 5387 3203 -700
7521 -700 -4249 -11784 -10465 -16062 -18760 -14355 -6861 -11993 -6234 -26287 -12693 169 -7910 -8379 -7195
7506 -7195 -8053 -7358 5290 10546 -302 -2441 -3585 -10117 -10630 2255 4703 11716 8523 7508 9757
7491 9757 9423 -1324 -12393 -10449 -11113 -6157 -5017 2599 9887 13534 15487 11915 3138 -2023 -7390
7476 -7390 -3161 16305 22040 23166 14558 -7861 -13804 -14542 -17395 -20817 -24203 -27851 -19332 -22827 -21145
7461 -21145 -11452 -8727 -316 -13 1085 327 3482 10947 21473 20412 15720 -436 -7807 -16701 -19484
7446 -19484 -9327 -14281 -20080 -19158 -6605 -2254 -6598 -2881 272 173 21734 19556 6133 5634 -8345
7431 -8345 -8626 -9324 -8762 -15257 -16372 -2854 -2807 -8987 -8179 -20006 -16851 -5259 -4616 -8406 -11313 -17622
7415a7622M398l409J999K3047N505o931P665l910l565K513M63Q342J304k0756
7401i57j1021k947N208j1940K148q873R661J8054m751Q092o749j2053M488J8853
7387G213M400l827r313p536O174r025j183l44k127M444o565M309k547L971J345
7372a0611M955J1091R077p224n726n09J717q060l515N398J6488M740k865m150
7358A0806K397N821p246l019J6058r290j5313j1769l799P98J732P61r190P439
7344a3814J4917j5227r389K050r840p590K564K0740J4313R006K067r840l79k337
7330b759M75Q794j0200l063q70R607J1335R361m624j026q37j3353K319J0801p813
7315H147j4416P82O270j2459J151J7977N459r313j5827N634P153N81J1432q208
$$ plain form
7415 -17622 -13224 -16633 -14634 8413 13918 6987 14652 10742 7177 9690 10153 18495 19799 -957
7401 -957 -11978 -14925 -9717 -21657 -19509 -28382 -18721 -667 -5418 2674 -4075 -16128 -11640 7213
7387 7213 11613 7786 -1527 -9063 -2889 -11914 -13097 -13441 -15568 -11124 -17689 -13380 -15927 -11956 -10611
7372 -10611 -5656 5435 14512 7288 1562 1053 2770 -5290 -8805 -3407 13081 17821 14956 10806
7358 10806 13203 19024 11778 8759 24817 15527 214 -11555 -15354 -14556 -12824 -12063 -21253 -13814
7344 -13814 1103 -14124 -23513 -21463 -31303 -38893 -36329 -15589 -1276 7730 9797 -43 -422 -2759
7330 -2759 -2284 6510 -3690 -6753 -7623 1984 13319 22680 18056 17030 16193 2840 5159 15960 8147
7315 8147 -6269 -5487 783 -11676 -10525 7452 12911 3598 -12229 -6595 558 1139 12571 4363
7301D363m436j9242n903L899L291P037R850N965J0427j7081j4292Q078R901m261
7287b404N193m412J1531N571p83j357O424K57L549p222K067P31j0175j5729p494
7272a4253n115M860L404N632p177o41l183n012J695j239j0055l682P792J8294
7258h680R393r68N787p017m13R306l654q536j936Q542Q612L477o222n574j0224
7243h107K585P181K99p933J863Q120K11L854n397l32n577J838K1511M545j0158
7228A4503j3583o600R102j985o061J131J1300N337P92j629n491j0318k155m372
7214a0029m718j497Q032p788O282Q123M865j810L287J3960O697J146m464j5230
7200F856r184Q589p45l780O938N57o855q944O958N563J026p833q120m152R821
$$ plain form
7301 4363 -73 -19315 -25218 -21319 -18028 -10991 -1141 4824 15251 -1830 -16122 -8044 1857 -2404
7287 -2404 2789 -1623 9908 15479 14696 13339 19763 20020 23569 16347 18414 19145 8970 -6759 -14253
7272 -14253 -19368 -14508 -11104 -5472 -12649 -13290 -16473 -21485 -19790 -21029 -31084 -34766 -26974 -8680
7258 -8680 713 -255 5532 -1485 -1898 7408 3754 -4782 -6718 1824 10436 13913 7691 2117 -8107
7243 -8107 -5522 1659 1958 -5975 -4112 4008 4219 8073 2676 2344 -3233 -1395 20116 24661 14503
7228 14503 920 -5680 3422 1437 -4624 -3493 7807 13144 13936 12307 6816 -3502 -5657 -10029
7214 -10029 -14747 -16244 -8212 -16000 -9718 -1595 3270 1460 4747 18707 25404 26550 22086 6856
7200 6856 -2328 6261 5516 1736 8674 9231 2376 -6568 390 5953 6979 -854 -8974 -13126 -3305
7185c305k52l722o052Q25O822q936K566K07p708J6409K2475n817o035R510O75
7170A7662m612j4924M599l582r654r88k322K219O517J6769k263j3870j7372N384
7156a6437M483p159l885r327K143J8380m082m146J4951Q287m909m505L101N34
7142b571P852r759j879J1953j114j188k060M674q880m902K954n861R78P610O726
7127D533P363n824q155r403K591q978R623R007L843J234p677r388J828J0413N353
7112F363n180o947J504M088J5209j1828m437O24n251k22j218Q465j1267o6M613
7097e550j133M648l137q649r282M067P899O281K909l29j4002j805J4089m190m20
7082h604k259m881q279L866R425j950P476P773k965O007o965o144m273j446q199
$$ plain form
7185 -3305 -3557 -7279 -13331 -12506 -5684 -14620 -12054 -11847 -19555 -3146 19329 13512 7477 16987 17662
7170 17662 13050 -1874 2725 -857 -10511 -11499 -13821 -11602 -5085 11684 9421 -4449 -21821 -16437
7156 -16437 -11954 -19113 -22998 -32325 -30182 -11802 -15884 -20030 -5079 3208 -1701 -6206 -3105 -2571
7142 -2571 5281 -4478 -6357 5596 4482 3294 1234 5908 -2972 -7874 -4920 -10781 -9803 -2193 4533
7127 4533 11896 6072 -2083 -11486 -8895 -17873 -8250 757 4600 5834 -1843 -11231 -9403 1010 6363
7112 6363 1183 -5764 -4260 -172 15037 3209 -1228 -604 -5855 -6077 -7295 1170 -10097 -10163 -5550
7097 -5550 -6683 -2035 -5172 -13821 -23103 -19036 -11137 -4856 -1947 -2276 -16278 -18083 -3994 -8184 -8604
7082 -8604 -10863 -15744 -24023 -20157 -10732 -12682 -5206 2567 -398 5609 -1356 -7500 -11773 -13219 -21418
7067b1418J3147J9316J2133l321q656j5277L250J5656J1232k4558j0948K55N68
7054h621o653Q373K3020Q570k059L994j5103j2912K386k396k580q804M220M30
7040h135l584Q929J805m902o164k195M838k588P910k240k505J2180L768j9086
7026a1969j575J060N425P394j8001m810P669J3043P968k193M143l625M481n395
7012C615j5096l534M979M504o178J500L855p935j4810J2966J5949J804r805K227
6998e959j3609p883o001O378J2344n166M876r97N398J5824l760j066P092j2617
6984e146j4738P53L484O728j66k278L044m541J957J0594J1057o421n731Q437P706
6969A4739m792j9480K017k4n230L580M452J1363Q598j537r622j27P1Q48P138n255
$$ plain form
7067 -21418 -8271 11045 23178 19857 11201 -4076 -826 14830 26062 1504 -9444 -9189 -8621
7054 -8621 -15274 -6901 16119 24689 22630 26624 11521 -1391 995 -1401 -3981 -12785 -8565 -8135
7040 -8135 -11719 -2790 -985 -5887 -12051 -14246 -9408 -11996 -4086 -6326 -8831 3349 7117 -11969
7026 -11969 -13544 -12484 -7059 335 -17666 -22476 -14807 -1764 6204 4011 8154 4529 9010 3615
7012 3615 -11481 -15015 -10036 -5532 -11710 -10210 -6355 -14290 -29100 -16134 -185 1619 -8186 -5959
6998 -5959 -19568 -27451 -33452 -27074 -14730 -19896 -15020 -16017 -10619 5205 1445 379 7471 -5146
6984 -5146 -19884 -19131 -15647 -8919 -9085 -11363 -8319 -12860 -10903 -309 10748 4327 -1404 7033 14739
6969 14739 9947 -9533 -7516 -7540 -12770 -9190 -4738 6625 15223 13686 4064 3937 4008 4856 11994 6739
6953F739p269K0668O280j9451n220N208L524K035r384N47M973k627j5106N707
6939c376J123J74N172l212L202o276p563q835P148J872J9382J1307j7548j3980
6925a1410M611P547O707k406r120K184O294l360Q513q301p679M559l132N209j785
6910a569r621J0221M313l197j5840j823J1736O588L045K522R500P857j8337j2152
6896f757j203Q163q031m558Q826q928J136p128Q722R029o879L029R677O590Q816
6881B0504J914j0588j1517j1643R090J990o054p303j203j0027k318Q121J8258
6868g76N025o802n965R247J1293j0376j8027k259M81l149J1363J0413j374o269
6854g175j521J16j827o277N673m094J1024J5705p303r06l553o881q5l68N871r598
$$ plain form
6953 6739 -530 20138 26418 6967 1747 6955 10479 12514 3130 3677 8650 6023 -9083 -3376
6939 -3376 -2253 -2079 3093 -119 3083 -3193 -10756 -19591 -12443 -10571 8811 20118 2570 -11410
6925 -11410 -6799 748 7455 5049 -4071 -1887 4407 1047 9560 1259 -6420 -1861 -4993 216 -1569
6910 -1569 -11190 -969 3344 147 -15693 -17516 -5780 808 3853 6375 15875 23732 5395 -6757
6896 -6757 -7960 203 -7828 -12386 -3560 -12488 -11352 -18480 -9758 -729 -7608 -4579 5098 11688 20504
6881 20504 22418 11830 313 -11330 -2240 -250 -6304 -13607 -14810 -24837 -27155 -19034 -776
6868 -776 4249 -2553 -8518 729 12022 1646 -16381 -18640 -18159 -21308 -9945 468 -906 -7175
6854 -7175 -8696 -8580 -10407 -16684 -11011 -15105 -4081 11624 4321 3415 -138 -7019 -7104 -7472 -1601 -11199
6838a1199P535R962J5160m725j1193o639L244l492p24O922K593N595P33J2634
6824B6406r458o54n292n726j3504K429Q549o16j0588O130K879j4245o437L79J5122
6809d626J3094q24j0591l497k55m247l909K554J5217K0388p700j2109N98q873
6795d780n738M010K399L051l682j2691N941J2478J0518j593o86K589q132j1105
6781g421o049r53j1407R952Q469P386n754p7J4259Q939l439L327k5460j4182Q410
6766a4000j95k013J2590J2848p823k5939l882l735J3425J5744N239p114l753J2189
6752C581L268l650n749P588L620m979o446m312l928L872P900O381J330j743L283
6737A0016J031o588j8545Q797R223K072q064K596k099L491j4986K866P784J155
$$ plain form
6838 -11199 -3664 6298 21458 16733 5540 -1099 2145 -1347 -2071 4851 7444 13039 13772 26406
6824 26406 16948 16294 11002 5276 -8228 -5799 2750 2134 -8454 -2324 555 -13690 -20127 -19748 -4626
6809 -4626 8468 7644 -2947 -6444 -6699 -10946 -14855 -12301 2916 23304 15604 3495 4093 -4780
6795 -4780 -10518 -6508 -4109 -1058 -4740 -17431 -11490 988 11506 9913 9227 11816 3684 -7421
6781 -7421 -13470 -14423 -25830 -15878 -7409 -23 -5777 -5854 8405 17344 13905 17232 -8228 -22410 -14000
6766 -14000 -14195 -16208 -3618 9230 1407 -24532 -28414 -32149 -18724 -2980 2259 -4855 -8608 3581
6752 3581 6849 3199 -2550 5038 8658 3679 -2767 -7079 -11007 -7135 765 7146 8476 6733 10016
6737 10016 11047 4459 -14086 -5289 3934 6006 -2058 538 -1561 1930 -13056 -10190 -2406 -1251
6723a251M113k219L718l981K54N48J684j979K424k719m822N400j2226J006M544
6708e506k288n520K100J3335k039L666L071Q344R640N776J78j4580q482K539q702
6693A532P296L561k680K030j3472q504R079L845K03J1238O173P252p880j4103
6679E570n196j904Q49k580m434l997j0923p500L187K5846J8478o934j0740r405
6665i683o659j19O198q629j918J08l59P172J5477Q897M240q466p497j1609J9862
6650G015N086j3186r227L796L035O48R613J544J2546q806p245N257j2216r253
6636a1393m043R958O612n07N95J372M330l822r678m802N803k671L001M633j407
6621b019p987n818o237K628j487R926J7716J6084Q081k0382j6177k92n226q431
$$ plain form
6723 -1251 2862 643 4361 380 634 1182 2866 887 3311 592 -4230 1170 -11056 -10050 -5506
6708 -5506 -7794 -13314 -11214 2121 82 3748 6819 15163 24803 30579 30757 16177 7695 10234 1532
6693 1532 8828 12389 9709 11739 -1733 -10237 -1158 2687 2890 14128 20301 27553 19673 5570
6679 5570 374 -1530 -681 -3261 -7695 -11692 -22615 -30115 -26928 -1082 17396 10462 -278 -9683
6665 -9683 -16342 -16461 -10263 -18892 -20810 -20702 -21061 -13889 1588 10485 14725 6259 -1238 -12847 7015
6650 7015 12101 -1085 -10312 -6516 -3481 -2833 6780 8324 20870 12064 4819 10076 -2140 -11393
6636 -11393 -15436 -5478 1134 627 1222 2594 6924 3102 -6576 -11378 -5575 -8246 -5245 -612 -2019
6621 -2019 -10006 -15824 -22061 -19433 -20920 -10994 6722 22806 30887 10505 -5672 -5964 -11190 -19621
6607a9621m877N340q651r191R033J5052m276l652L923j231k788q724J3203J2378
6593d082M795o717r226k359J094Q112M589P36j483R633k79o466r507O653Q643
6578D136N469R245O194L399j2892j3297j967j3047M432L329L711Q72l183l886
6564g485M491N99j204P733P81k861l845O597O720n283p242k783p884l002K611
6549a2057j992l156k253J3619M665J1619P894r611j1887M317O177J455J0713j028
6535A8475r150j1135k2811J259K3220K0011q62j4083j1618j1113K71m037K456
6522a9117J0910k400K491P602L720r65Q904q49n332j425j237j3394O238O152J3567
6507A4865r158j1912p563M087N902K073P008m210j1730O91J1534J3378P236j2914
$$ plain form
6607 -19621 -24498 -19158 -27809 -37000 -27967 -12915 -17191 -20843 -16920 -18151 -20939 -29663 -16460 -4082
6593 -4082 713 -6004 -15230 -17589 -16495 -8383 -3794 -3058 -4541 5092 4813 -1653 -11160 -4507 4136
6578 4136 9605 18850 25044 28443 15551 2254 287 -12760 -8328 -4999 -1288 -416 -3599 -7485
6564 -7485 -2994 -2395 -3599 4134 4915 2054 -1791 4806 11526 6243 -999 -3782 -11666 -14668 -12057
6549 -12057 -14049 -17205 -19458 -5839 -1174 10445 18339 8728 -3159 1158 7335 8790 19503 18475
6535 18475 9325 -1810 -24621 -23362 -142 19869 19007 4924 -6694 -17807 -17536 -21573 -19117
6522 -19117 -8207 -10607 -8116 -514 3206 2241 11145 10296 4964 3539 2302 -11092 -4854 1298 14865
6507 14865 5707 -6205 -13768 -9681 -3779 -1706 5302 1092 -10638 -9947 1587 14965 22201 9287
6493I287j7053P1O641N100p155k579k196j192K448Q815q35m143R663K945k334
6478G483N3q863Q650J1188n369r673j2730j0700M252K268K566K065j1074r255
6464b9139n118J5546K4187J0601j7579j2409M117M531j4814m245Q536P779O454
6451a553l702j0553m763M778J2329k238j717P73j682q780M178j319O439J3793
6437E983m073l402j298m172n692J1598J5238J045j2396j1741L500m768L300R122
6423B244J3716k291l8j060M742o764p037L52M423n221L736M992r167m377J0399
6408H649R569j0093j0787n317k232P958J6396j2449j0380K163k284m541N651J2094
6394D397J0019M644P850j860j4000k5208m47J8057o654k1337j3992M628K5963
$$ plain form
6493 9287 -7766 -7695 -1054 4046 -3109 -5688 -7884 -9076 -6628 2187 1352 -2791 6872 9817 7483
6478 7483 7536 -1327 7323 18511 13142 3469 -9261 -19961 -15709 -13441 -10875 -8810 -19884 -29139
6464 -29139 -34257 -18711 5476 16077 -1502 -13911 -9794 -5263 -20077 -24322 -15786 -8007 -1553
6451 -1553 -5255 -15808 -20571 -15793 -3464 -5702 -7419 -6646 -8328 -17108 -12930 -14249 -7810 5983
6437 5983 1910 -1492 -2790 -6962 -12654 -1056 14182 15227 2831 -8910 -5410 -10178 -6878 2244
6423 2244 15960 13669 13631 12571 17313 10549 3512 3864 8287 3066 6802 11794 2627 -1750 8649
6408 8649 18218 8125 -2662 -7979 -10211 -2253 14143 1694 -8686 -6523 -8807 -13348 -7697 4397
6394 4397 14416 19060 26910 25050 11050 -14158 -14605 3452 -3202 -24539 -38531 -33903 -7940
6381g940k896j0618P260M938J8759J8656O91o533j0047l169j4324j7307J5613
6368f917o175L00J2955N998l302N638N372o128k023m950j076p21q866o131J0795
6353e231N500j3785J806K0165l213j3751r681m28O513q049J7521J2276o54r062
6339g3m627P639R548m323K632j75j5446J835M367p305r002m819Q32j4147L848
6324b9216J6752J4382P921K229L881o335L166J7012j9037L9m012k1923k026Q547
6310h620J5274R31j472K23k485l587j842l605j4491L836J3532J5032R957o214
6296A6469r357q546q050Q755l959k594Q210j1198o197M975L203j237Q69M097p16
6281e276j5706J020Q512J2985J7192m92r11j3349J23M555r894m655q989N791M079
$$ plain form
6381 -7940 -10836 -21454 -14194 -9256 9503 28159 28850 22317 12270 9101 -5223 -22530 -6917
6368 -6917 -13092 -12792 163 6161 2859 8497 13869 7741 5718 768 -308 -1029 -9895 -16026 -5231
6353 -5231 269 -13516 -11710 8455 5242 -8509 -18190 -18618 -12105 -20154 -2633 9643 8989 -73
6339 -73 -4700 2939 12487 8164 10796 10621 -4825 -2990 1377 -5928 -14930 -19749 -18917 -33064 -29216
6324 -29216 -12464 1918 9839 12068 15949 9614 12780 29792 10755 10794 6782 -15141 -17167 -8620
6310 -8620 6654 7585 6113 6336 3851 264 -1578 -5183 -19674 -15838 -2306 12726 22683 16469
6296 16469 7112 -1434 -9484 -729 -4688 -7282 928 -10270 -16467 -11492 -8289 -9526 -8657 -4560 -5276
6281 -5276 -20982 -19962 -11450 1535 18727 18235 17324 3975 4098 8653 -1241 -5896 -14885 -9094 -5015
6266e015j584P666m806r465m68q980J2202o000P728n506o174O541M325m759L558
6251a0737l776m791Q743J0150P10n460J4546K195n547k094p219j0222o236R593
6237a0145J820j042Q422J1864M868j315n987j043j6731L80J001j0515O345J6670
6223D592N194p949q754n24l255l492J9057j575r40q677J7590N075k557J128m384
6208A0529j9279J2560j1828q357k67J3654l281j365J432r295o884j724j693P400
6194a8398m866j439O169J8232Q331q49m055n623j244k598J4855P535N761n101
6180A6710m726j414j059l110L371J3672J731k1498j2365j6958M006J4494R735
6167B589n047o068O748R458j0671j1352O891N676N751Q736K05Nr31j0619o075
$$ plain form
6266 -5015 -6599 1067 -3739 -13204 -13672 -22652 -10450 -16450 -8722 -14228 -20402 -13861 -9536 -14295 -10737
6251 -10737 -14513 -19304 -10561 -411 299 -5161 9385 11580 6033 3939 -3280 -13502 -19738 -10145
6237 -10145 -8325 -9367 -945 10919 15787 14472 8485 7442 -9289 -8909 -7908 -18423 -12078 4592
6223 4592 9786 1837 -6917 -7441 -10696 -14188 4869 3294 2354 -6323 11267 16342 13785 14913 10529
6208 10529 -8750 3810 -8018 -16375 -16642 -2988 -6269 -7634 -6202 -15497 -22381 -24105 -25798 -18398
6194 -18398 -23264 -24703 -18534 -302 8029 7180 3125 -2498 -3742 -6340 8515 16050 21811 16710
6180 16710 11984 10570 9511 6401 9772 23444 25175 3677 -8688 -25646 -21640 -7146 2589
6167 2589 -2458 -8526 -1778 7680 -2991 -14343 -7452 -1776 3975 12711 12916 12921 11990 1371 -4704
6152d704m153l473j835j85L05J6509o388j527l597j7023J084K3124P05p938o737
6137a5833J051N477P205O158J9001Q84j8171j8058Q43P312O376N383M61j0846
6123b757p172P742p950j0201n762j785J3363K173r835K1153m921l451l320j2314
6109b5037l151n55J4406Q141J4305J638o480j5373m467n287J0977J2196J0546
6096A1859k716k258j723n924j0548p728L01m289N684J1031R08m324m849J69J7075
6081B668R846p411m248K776k061n407P885M335l787O647q440p512n569K096P386
6066g96k554K580l065r202j1802N077J1343n514K476O571K260j409n697p544r913
6051b7189k913K7802K0292N602k051k2035r32Q62P96K714J08j203o458R802J1836
$$ plain form
6152 -4704 -8857 -12330 -14165 -14350 -14045 2464 -3924 -5451 -9048 -26071 -24987 -1863 -1158 -9096 -15833
6137 -15833 -14782 -9305 -2100 4058 23059 23943 5772 -12286 -11443 -4131 2245 7628 8089 -2757
6123 -2757 -9929 -2187 -10137 -20338 -26100 -27885 -14522 -12349 -22184 -1031 -5952 -9403 -12723 -25037
6109 -25037 -28188 -28743 -14337 -6196 8109 9747 3267 -12106 -16573 -21860 -10883 1313 11859
6096 11859 9143 6885 5162 -762 -11310 -19038 -18737 -23026 -17342 -6311 -5403 -9727 -14576 -14407 2668
6081 2668 12514 5103 855 3631 1570 -3837 4048 8383 4596 11243 2803 -4709 -10278 -8182 -796
6066 -796 -3350 -770 -3835 -13037 -24839 -19762 -8419 -13933 -11457 -4886 -2626 -4035 -9732 -17276 -27189
6051 -27189 -30102 -2300 17992 23594 21543 -492 -1424 -562 234 2948 3056 1853 -4605 5197 17033
6036A7033Q20o308j0147m71N355q848J0976K2581L730j2312j6196k3430k555o569
6022b6341N62J3593K0440P365j103n280o300p449l115L183M904q224L106Q576
6008C917L700j5086n274m513J5064J4666j211j1158P057P440r722j2498l795K0842
5994I429N854j8968l298O855o490j4368o662Q95J1620J6163J3923M021k119J051
5980A7906r915j1541M247Q520q309j4251r875M457M722J3134J1270k335o110j736
5966A84k881o506j148m015J5345M041O50O210J2956r63j196m357j915k6106r511
5951a9212M901J474k879O407j240K038J285R409O194q010Q921P605K84k787j6744
5936b354N187L255J236r294N330m240k0063R452J8883J7625m500k1700j7109L302
$$ plain form
6036 17033 17853 11545 1398 927 6282 -2566 8410 30991 34721 22409 6213 -17217 -19772 -26341
6022 -26341 -25779 -12186 8254 15619 14516 9236 2936 -4513 -7628 -4445 459 -7765 -4659 3917
6008 3917 7617 -7469 -12743 -17256 -2192 12474 11263 105 7162 14602 4880 -7618 -11413 9429
5994 9429 15283 -3685 -6983 -128 -6618 -20986 -27648 -26753 -15133 1030 14953 18974 16855 17906
5980 17906 7991 -3550 697 9217 908 -13343 -23218 -18761 -14039 -905 10365 8030 1920 184
5966 184 -2697 -9203 -10351 -14366 979 5020 5670 11880 24836 23873 22677 18320 16405 -9701 -19212
5951 -19212 -14311 -12837 -15716 -9309 -10549 -8511 -7226 2183 8377 367 9288 16893 17177 14390 -2354
5936 -2354 2833 6088 7324 -1970 3360 -880 -20943 -11491 7392 25017 20517 -1183 -18292 -14990
5922a4990n176P273O474n88J4516q796L600K179P551J8591m28p387k4559j2976
5908a4716q20J0057K1072J276p207j4936o84R541k062o879o342J82J805N735O604
5893B626l401K69L51p488l582q767O189L208o251J1783Q417K638j6219o042J1030
5878e239J0924o010K912R678k396m663j0881m816l22n419l32o10L602J9967N045
5863A1440j5890P491R062l639l468m558j6194O7o54j1331J0589N967p184P98k595
5848b0099Q102J3104M667j132J1664k130j4364j5738J1287P320R46m317O197M459
5834I966Q563n407j4875q018r717Q93Q750N285o11j5195J75Q699M728m856J195
5819a0425j6528k968J2285J0317J9238R384P58r166j0649m618n74m666L867Q260
$$ plain form
5922 -14990 -20166 -12893 -6419 -7007 7509 -1287 2313 4492 12043 30634 30206 22819 -1740 -14716
5908 -14716 -15536 -5479 15593 16869 9662 -5274 -5958 3583 1521 -5358 -11700 -11518 -9713 -3978 2626
5893 2626 -775 -506 -155 -7643 -11225 -19992 -13803 -10595 -16846 -5063 3354 5992 -10227 -16269 -5239
5878 -5239 5685 -325 2587 12265 9869 5206 -5675 -10491 -10813 -16232 -16564 -17174 -13572 6395 11440
5863 11440 -4450 3041 12103 8464 4996 438 -15756 -15689 -16343 -27674 -17085 -11118 -18302 -17504 -20099
5848 -20099 -11997 1107 5774 4642 16306 14176 -188 -15926 -4639 2681 3627 -690 5507 9966
5834 9966 18529 13122 -1753 -9771 -19488 -18595 -9845 -4560 -5171 -20366 -20191 -11492 -6764 -11620 -10425
5819 -10425 -26953 -29921 -17636 -7319 11919 21303 22061 12895 2246 -2372 -2946 -7612 -3745 4515
5805D515L259M965K818p007j689k049j6324j2321Q747M193j3703o183J3414l267
5791b0632j048O902n784O53N272R580M135m658j2026M889J5312q30j2634j3235
5777b4104m018K190Q43j405J4374m576r746P198O972j0250j058P976n409r926
5763c0939R103Q372R202P297m508j0130n914k657L833n093N822J2732L052n4j3382
5748a3264J3075J1615O761L18j0449P359j9169n743R043K988j3626j363J2893
5735D38J0271q787r484q1R8K482j0112q351P097P0J1905m205o31O375J9077P41
5719A6903j8993k1101N079J560o831p905J3284J6394Q090P501k980j8907n440
5706a3346J4798R830o452j4946j8778M601J5518O294Q361M597R886k489j0045
$$ plain form
5805 4515 7774 12739 15557 8550 6861 4812 -11512 -23833 -15086 -10893 -24596 -30779 -17365 -20632
5791 -20632 -21680 -14778 -20562 -19909 -14637 -5057 -922 -5580 -17606 -12717 2595 1765 -10869 -24104
5777 -24104 -28122 -25932 -25089 -26494 -12120 -16696 -26442 -19244 -12272 -22522 -23580 -15604 -21013 -30939
5763 -30939 -21836 -13464 -4262 3035 -1473 -11603 -17517 -20174 -16341 -21434 -15612 -2880 172 118 -13264
5748 -13264 -189 11426 18187 18505 8056 15415 -3754 -9497 -454 2534 -11092 -12455 438
5735 438 10709 1922 -7562 -7643 -7545 -5063 -15175 -23526 -16429 -16359 -4454 -8659 -9290 -2915 16162 16903
5719 16903 -2090 -23191 -18112 -16552 -23383 -31288 -18004 -1610 6480 13981 11001 -7906 -13346
5706 -13346 1452 11282 4830 -10116 -28894 -24293 -8775 -2481 5880 10477 20363 17874 7829
5693G829j1663M61j048p470P68m087m975n222m942J3498J5118l590o528j363l494
5678a6708o104j0808m868J2537p997L456Q146j608J685j381o510l696M598N319
5664b3939R452k69K1362n384n123J6875l453K13q469j0037M179n145q99J1104
5650D67J137j1418j0366p953O810L384K0648Q680K921k852m640L45K661j0846
5636a022j0030j4159K892K788o325l520J1600J2771J80O633N484p203k3015n470
5622b8396J0259R460L875P746K892j5158m200P415Q388R003o717k241r401o496
5608a3571j1159M98N223Q465J4475Q960l470j3991L086n670O409J079L077J37
5594C548m542p299N515l26L500R649p978K860k133o476q100j6212j606J5942K1291
$$ plain form
5693 7829 -3834 -3373 -4421 -11891 -11123 -15210 -20185 -25407 -30349 -16851 -1733 -5323 -11851 -13214 -16708
5678 -16708 -22812 -33620 -38488 -25951 -33948 -30492 -22346 -23954 -22269 -23650 -30160 -33856 -29258 -23939
5664 -23939 -14487 -14756 6606 1222 -3901 12974 9521 9734 1265 -8772 -4593 -9738 -10637 467
5650 467 1604 -9814 -20180 -28133 -21323 -17939 2709 11389 14310 11458 6818 7163 9824 -1022
5636 -1022 -11052 -25211 -22319 -19531 -25856 -29376 -17776 -5005 -4825 1808 7292 89 -22926 -28396
5622 -28396 -18137 -8677 -4802 2944 5836 -9322 -13522 -6107 2281 11284 4567 2326 -7075 -13571
5608 -13571 -24730 -24232 -19009 -10544 3931 12891 9421 -4570 -1484 -7154 -745 334 3411 3548
5594 3548 -994 -8293 -2778 -3104 396 10045 2067 4927 2794 -3682 -11782 -27994 -29600 -13658 7633
5579G633p972J367J80j2454L689M035m320J460L912j0476j4234O998K0502J3667
5565A3987J29j242j972l562o195j0301J1807J191j5791o68N240o332M838M213
5551d658L870l93l959J607R851L758j5918q829k642K137k404n35P518Q96O804
5536b897Q438n538M255R401k028j1012m369M305p57J848j3013j2547J4220J2885
5522C191J0413j3529j3944J2644M008j1484Q091m22r867J577N21k598M940M434
5508b025K325O692j0722L009O47l209o956j6869P852J6645O52j337R284J960j2525
5493d577n537p169R45j696Q999O34Q0J8239J3912j4009k5997j5888N68l28o05
5478c2429K0239J4641L016J069m930j7620j885J4976Q292n786L798N825O660L043
$$ plain form
5579 7633 -339 1028 1208 -11246 -7557 -3522 -7842 -6382 -2470 -12946 -27180 -20182 320 13987
5565 13987 14116 12874 10902 7340 1145 -9156 2651 3842 -11949 -12617 -7377 -13709 -8871 -4658
5551 -4658 -788 -1181 -5140 -3533 6318 10076 -5842 -14671 -17313 -15176 -17580 -18115 -10597 -9701 -2897
5536 -2897 5541 3 4258 13659 11631 619 -3750 555 -202 1646 -11367 -23914 -9694 3191
5522 3191 13604 75 -13869 -1225 2783 -8701 -610 -1032 -10899 -9322 -8801 -11399 -6459 -2025
5508 -2025 300 6992 -3730 -721 -74 -3283 -10239 -27108 -19256 -2611 -1959 -3296 5988 7948 -4577
5493 -4577 -10114 -17283 -16338 -18034 -9035 -8401 -8321 9918 23830 9821 -16176 -32064 -31496 -31824 -32429
5478 -32429 -12190 2451 5467 6536 1606 -16014 -17899 -2923 5369 -417 3381 9206 15866 18909
5464A8909J165o457k0529m331k48Q010J4327j0417N017j7447j0759n311M163M639
5450a9269N836o57J0416M353l436r991j3887Q525O230J618o385J0416P241K541
5436C551N132L59J642n649p942O027M746P151M619k3921q867o859k904K0227J722
5421i66j2537k359P462K619j0724j1707J803J6177P269N408P511p908j6756O471
5407h237r70R766L909L709L476J200r84N75q218m585m281P888L947j1594o025
5392a0424J759R879J3856P10K425n747n62j3071j4689J7772L3421m860k3281j1314
5378d126j1716J2038P190n781j4522L600K422M442J7676M23k749r774q075M117
5364d835J3101L405n199n139K912M21L797q204j4425K28Q311q8j256Q53J4139
$$ plain form
5464 18909 20074 13617 -6912 -11243 -11491 -3481 10846 429 5446 -12001 -22760 -28071 -23908 -19269
5450 -19269 -13433 -14090 -3674 679 -2757 -12748 -26635 -18110 -11880 -10262 -16647 -6231 1010 3551
5436 3551 8683 9042 10684 5035 -2907 3120 7866 15017 19636 -4285 -13152 -20011 -22915 -2688 -966
5421 -966 -13503 -15862 -8400 -5781 -16505 -28212 -26409 -10232 -2963 2445 9956 2048 -14708 -8237
5407 -8237 -9207 559 4468 8177 11653 12853 11869 12444 4226 -359 -4640 3248 7195 -4399 -10424
5392 -10424 -8665 1214 15070 15780 18205 12458 11896 -1175 -15864 1908 35329 30469 7188 -4126
5378 -4126 -15842 -3804 3386 -2395 -16917 -13317 -10895 -6453 11223 11646 8897 -877 -8952 -4835
5364 -4835 8266 11671 6472 1333 4245 4666 8463 259 -14166 -13938 -5627 -5715 -6971 -6118 8021
5349H021R188n343n931j8680k827n584l318J8456K633l08L582l453R23r59n019
5334h619R570L161n708q440j283j2345N09Q621J7846J2353j5409o301J378P591
5320B924L729P47P590j2052o206P05L938p543M434j367m464J262k175P553j127
5305b052r497K152M86R32L564p02q68j2969m56O741O939J3623J0534n216N552
5290A8763j110j8312r852L758L433P036k516M142J0196L861q732o08j0625r142
5276i708j92P489l065m198q56r392j7551J7779Q006J776p26J0084K417N048j5132
5261h221j4176J061L325P582N287L017R13M346r515n321O086j1229o952J4623
5247i174J1565R199J2030j4881j5629K697k084J4000M54j1779P094J7900j0666
$$ plain form
5349 8021 17209 11866 5935 -12745 -15572 -21156 -24474 -6018 -3385 -3693 -111 -3564 -2641 -3600 -8619
5334 -8619 951 4112 -1596 -10036 -11319 -23664 -23155 -14534 3312 15665 256 -6045 -4667 2924
5320 2924 6653 7400 14990 2938 -3268 -2563 1375 -6168 -1734 -3101 -7565 -6303 -8478 -925 -2052
5305 -2052 -11549 -9397 -8911 -7979 -4415 -5117 -5985 -18954 -19410 -12669 -5730 7893 18427 13211 18763
5290 18763 17653 -659 -10511 -6753 -3320 3716 1200 5342 15538 19399 10667 10059 -566 -9708
5276 -9708 -9900 -2411 -5476 -9674 -10530 -19922 -37473 -19694 -11688 -9912 -10638 -554 1863 6911 -8221
5261 -8221 -22397 -21336 -18011 -10429 -5142 -2125 -1212 3134 -6381 -11702 -5616 -16845 -23797 -9174
5247 -9174 2391 11590 23620 8739 -6890 -4193 -6277 7723 8177 -3602 3492 21392 10726
5234A0726j4077m221q31L028k605k513K881n201m879Q054N305J344o756M759o363
5219a1349j5451l011J2712R271N787n322J54q179m99J2387r015o457J916P638
5205i418K154N628k016j5971r416L981N233J1183Q652Q212R314R90j0606q813
5191h93O522M304k375O354k1063j4590R761J0187O510M786p125L465J3948o130
5177A3661q516n916o972r130p422Q263L190M517j40l966J5830P680r312j4634
5163a2867J4112j1433m657k729J045j2997m972J4657l036J577N791n68O836L895
5149e346k99j3282l493L669J2645m607j690r556J110J1564n688j323O833J991
5135g472j66R408J6175k398K688M093k556j0109o308l876m330q955n467J2966
$$ plain form
5234 10726 -3351 -7572 -8403 -5375 -7980 -10493 -7612 -12813 -17692 -9638 -4333 -2989 -9745 -4986 -11349
5219 -11349 -26800 -29811 -17099 -7828 -2041 -7363 -7209 -15388 -15887 -3500 -12515 -18972 -17056 -9418
5205 -9418 -7264 -1636 -3652 -19623 -29039 -25058 -19825 -8642 10 8222 17536 18526 7920 -893
5191 -893 5629 9933 7558 13912 -7151 -21741 -11980 -1793 4717 9503 2378 5843 19791 13661
5177 13661 5145 -771 -7743 -16873 -24295 -16032 -12842 -8325 -8465 -12431 3399 11079 1767 -12867
5163 -12867 1245 -10188 -14845 -17574 -16529 -29526 -34498 -19841 -22877 -21300 -15509 -16077 -9241 -5346
5149 -5346 -5645 -18927 -22420 -18751 -6106 -10713 -12403 -21959 -20849 -9285 -14973 -16296 -9463 -7472
5135 -7472 -7638 1770 17945 15547 18235 22328 19772 9663 3355 -521 -4851 -13806 -19273 -6307
5121f307P249p229J982R676n19r514J37M146o591M232L972K669R88n231r555m781
5105a4676J384j1367o416M786P32K523J1500R851P082J0129R27j303j0126m459
5091E67Q321N072n438r323n568q941M603o789J217j1378M406J5278J0795m581
5077a759j881Q967q510N033r319l450M175j3425j038Q713R8N664m343j352K87
5062a2140l927P620K396Q099n230k560J691J0330q656j8178R782K0051P191o791
5048I678j6827K260R554P220P499l107k1741m500K863J1336k70J977j0490J0544
5034E996n967k317k985L306J3778q724j3718J639o50J448M172q090N734M282J117
5019i79m123j1155K000Q756l189P641o978r545R681J5917R653n404J234p567j4886
$$ plain form
5121 -6307 942 -6287 -4305 5371 4852 -4662 -4525 -379 -6970 -2738 1234 3903 4891 -340 -9895 -14676
5105 -14676 -13292 -24659 -31075 -26289 -25557 -23034 -11534 -1683 5399 15528 16455 15152 5026 567
5091 567 8888 13960 8522 -801 -6369 -15310 -10707 -17496 -16279 -27657 -23251 -7973 2822 -1759
5077 -1759 -3640 5327 -3183 1850 -7469 -10919 -6744 -20169 -21207 -12494 -12396 -6732 -11075 -12427 -12140
5062 -12140 -16067 -8447 -6051 2048 -3182 -5742 -4051 6279 -2377 -20555 -10773 9278 16469 9678
5048 9678 -7149 -4889 4665 11885 19384 16277 -5464 -9964 -7101 4235 3965 5942 -4548 5996
5034 5996 29 -2288 -5273 -1967 11811 3087 -10631 -8992 -9642 -8194 -4022 -12112 -6378 -2096 -979
5019 -979 -5102 -16257 -14257 -5501 -8690 -1049 -8027 -17572 -7891 8026 17679 12275 13509 5942 -8944
5004h944J476P374O438l372Q716m699m109j2170q546j597O964P183P7q419j0612
4989b4240Q928J2199J728J1529N169L697K920J751K939m339r435j8121j433K328
4975d380K801k753M781m659L406J1048j0510l335j3305o057J0849J0996O474R863
4961A5219J3866o455q389J5j3730j9985j262L952J951J784K584J3329l569j1951
4947a2641O505J3956m91j1678K793N350J2420O821J1916j3261j8455o973l301
4934g039j870K505N920q023q013O53j3728N06J5881L36r931j637J2331l273p417
4919b2799N025J952j341M747Q052l266l654L230J8939q729m481J6702j633q773
4905C971j7036J0189J8149O288O885k2238j8242O688J5904O12j4509n712J0801
$$ plain form
5004 -8944 -7468 -94 6344 2972 11688 6989 2880 -9290 -17836 -19433 -12469 -5286 -5209 -13628 -24240
4989 -24240 -15312 -3113 -1385 10144 15313 19010 21930 23681 26620 22281 12846 -5275 -6708 -4380
4975 -4380 -1579 -4332 449 -4210 -804 10244 -266 -3601 -16906 -22963 -12114 -1118 5356 15219
4961 15219 29085 22630 14241 14256 526 -19459 -20721 -16769 -14818 -13034 -10450 2879 -690 -12641
4947 -12641 -6136 7820 7329 -4349 -1556 3794 16214 23035 34951 21690 3235 -3738 -7039
4934 -7039 -8909 -6404 -484 -8507 -16520 -15867 -29595 -29089 -13208 -12872 -22803 -24440 -12109 -15382 -22799
4919 -22799 -17774 -15822 -17163 -12416 -4364 -7630 -11284 -8054 10885 2156 -2325 14377 12744 3971
4905 3971 -13065 -2876 15273 21561 28446 6208 -12034 -5346 10558 11170 -3339 -9051 1750
4892A750k84K97K955J1393q567k1498J2867J4339n646L3m5m615P196K326k466
4877A0035N380m397k425r459r142k137p480L497J0243p201q245J9069P164K435
4863G337k888j156q052o104R509L166l302M691N912j096L714J6429l533q326p862
4848H439j0100k794j507L241M946l917m083k910K914O98q99O258R20j4032r567
4833b2393J2076J4851J870l070Q49M577M771M634j7975j3357j3390q483l27J0824
4819b4543J9457J488M8k008M226p953n437n650J7259J952j0250J1678n678j183
4805f594L796l423m477n470l810l48J2916M439q045N811Q057P787J188j4079o057
4790h309o50J519j388O726Q782P505n495k5288K022N031j1165N691J3061J033
$$ plain form
4892 1750 1466 1763 4718 16111 7544 -13954 -1087 13252 7606 7639 7594 2979 10175 12501 10035
4877 10035 15415 11018 8593 -866 -10008 -12145 -19625 -16128 -5885 -13086 -21331 -2262 4902 7337
4863 7337 4449 3293 -4759 -10863 -1354 1812 -1490 3201 9113 8017 11731 28160 24627 16301 8439
4848 8439 -1661 -4455 -5962 -2721 2225 -1692 -5775 -8685 -5771 -5073 -5972 286 1206 -12826 -22393
4833 -22393 -10317 4534 6404 3334 4183 8760 13531 18165 190 -13167 -26557 -35040 -35367 -24543
4819 -24543 -5086 -3598 -3550 -5558 -1332 -9285 -14722 -20372 -3113 -1161 -11411 267 -5411 -6594
4805 -6594 -2798 -6221 -10698 -16168 -19978 -20326 -7410 -2971 -11016 -5205 2852 10639 11827 -2252 -8309
4790 -8309 -8959 -7440 -8828 -2102 6680 14185 8690 -16598 -14576 -9545 -20710 -15019 -1958 -925
4776i25P648Q244j4700o844l934q225R833R455j2432l355J5809J4847J624k6455
4762i410j8033Q438L551J0735J8596M90l092p080p723P427J1483J829q51j2026
4748D334M28p780l823O520j79k87m538P6K894o45k532N398O544N918n182k199
4732D947l529j5212p087n827n390M722o58K130J0426m775M216R521j0570j5546
4718c2632m871O455J4797l491k0227l594R919j794N242Q595r78k994Q045O697
4704a0831J1875o898M437J0626Q892r455k330p251j3771O655L946J968j1751O541
4690g347L407j672R804k430j826P444O492j1751o876n855j047j212l624O289j11
4675a0315M18M270K910q188k638m938m61J3314o06k3742p828J4604K1483J5118
$$ plain form
4776 -925 6723 14967 267 -6577 -10511 -18736 -8903 552 -11880 -15235 574 15421 17045 -9410
4762 -9410 -27443 -19005 -15454 -4719 13877 14367 11275 4195 -3528 3899 15382 17211 16360 4334
4748 4334 4762 -3018 -6841 -321 -500 -787 -5325 -5249 -2355 -3000 -5532 -134 6410 12328 7146 4947
4732 4947 1418 -13794 -20881 -26708 -32098 -27376 -28034 -25904 -15478 -20253 -16037 -6516 -17086 -32632
4718 -32632 -37503 -31048 -16251 -19742 -39969 -43563 -33644 -35438 -30196 -21601 -22579 -25573 -17528 -10831
4704 -10831 1044 -5854 -1417 9209 18101 8646 6316 -935 -14706 -8051 -4105 -2137 -13888 -7347
4690 -7347 -3940 -5612 4192 1762 -64 7380 13872 2121 -4755 -10610 -11657 -12869 -16493 -10204 -10315
4675 -10315 -9897 -5627 -2717 -10905 -13543 -18481 -18942 -5628 -6234 -29976 -37804 -23200 -1717 13401
4661A3401r782m16m27N17n237j3157j898J6759K364k043l064j950L643K953j2065
4646a0402L04n856N863O621m050j584m609J843j2539J0033J3827J0136l401k291
4632C895l354J330l665N374r212J4J9463N247m958l031k024J240n193k167l74
4617B585K435k978q61k51o359j6048j0923L458Q904N192P713j1895J0024Q599
4603d05K106j3004r857Q563J3063j301j1530k813R086N473J594P6q668k550n762
4588a5929J3743K1777k431o956L895m182j3136J1747O221J447k118j3196p515
4575f633M789L373l28j916O939q3k505r414j897K608J1015p675L671p73K218P726
4559A1115q819k449l085l307l576n819J1221M128J565P978l732j3345n271J020
$$ plain form
4661 13401 3619 3203 2776 3293 -1944 -15101 -16999 -240 2124 81 -2983 -4933 -1290 1663 -10402
4646 -10402 -10098 -15954 -10091 -3470 -7520 -9104 -13713 -11870 -24409 -14376 -549 9587 6186 3895
4632 3895 541 1871 -1794 3580 -5632 -5618 13845 19092 14134 11103 9079 10319 5126 2959 2585
4617 2585 5020 2042 1181 930 -5429 -21477 -32400 -28942 -20038 -14846 -7133 -19028 -9004 -405
4603 -405 1701 -11303 -21160 -12597 466 -835 -12365 -15178 -6092 -619 975 1051 -7617 -10167 -15929
4588 -15929 -2186 19591 17160 10204 14099 9917 -3219 8528 14749 16196 14078 882 -6633
4575 -6633 -1844 1529 1201 -715 6224 6141 3636 -5778 -7675 -5067 5948 -1727 1944 1171 3389 11115
4559 11115 2296 -153 -3238 -6545 -10121 -15940 -4719 -591 974 8952 5220 -8125 -13396 -12376
4545a2376j7160M317J0405J1810J4424j220k486n1n878k664O578k679j7135J0328
4531c787J615p48N074l067K465J1839k710j9046k94L216q47J8584J5717j2626
4517A5385j0106M480j82O361j709k807j1066k14q1j58K787l726K128m615j238
4502d761Q012J770j2030l688l53L614r972l693J3950M416n305O886m068l473J7230
4487H535R629P769J709k2489K222N401j1959L926l645m545k581l576J965p490
4473a5129n437P638M917J1497J5487r575n901j1571j4453n363Q82J9786J9544
4460A2322l532j3811j0266p28R732L645k702N463p557l114l065P485J3740K349
4446I961j0102r463J475K7402P548q539j7632p36p849N879J8411N380l004o763
$$ plain form
4545 -12376 -29536 -25219 -14814 -3004 11420 10200 7714 7663 1785 -879 5699 3020 -14115 -3787
4531 -3787 -2172 -2920 2154 -913 1552 13391 10681 -8365 -8659 -5443 -6290 12294 28011 15385
4517 15385 5279 9759 9577 15938 14229 11422 356 142 61 -97 2690 -1036 1092 -3523 -4761
4502 -4761 3251 5021 -7009 -10697 -11050 -7436 -17408 -21101 -7151 -2735 -8040 -1154 -5222 -8695 8535
4487 8535 18164 25933 27642 5153 7375 12776 817 4743 1098 -3447 -6028 -9604 -7639 -15129
4473 -15129 -20566 -12928 -8011 3486 18973 9398 3497 -8074 -22527 -27890 -27008 -7222 12322
4460 12322 8790 -5021 -15287 -16015 -6283 -2638 -5340 123 -7434 -10548 -13613 -6128 7612 9961
4446 9961 -141 -9604 -8129 19273 26821 18282 650 -86 -7935 -2056 16355 21735 18731 11968
4432A1968j3552j5245q111L355M335R122n350M631J8105m988P152j3191n324N961
4418a132J5909l285j4541m591l071r754q083K05n290n319K0348P602L492J766
4404e744J3499R686K05O727j5468j7240J1665l304k662M126j1981l20M95o092
4390a6408l633k528K499J3292J4463L002O749j0643q217p032k000J628R725N648
4376F545m437l853N16P255L0750l626k0020m534j677M691K396l247k775J23q41
4361G266j327k860P145J1305l203j784o747L431j0115j9772o068Q647Q359n43
4347f266o780J1045l189j1100M125J7881O930n316o016r213l468j2656K353K0066
4333a604j217N506j257J4351J3296m08p133o917p210l630n326N87J765j336j515
$$ plain form
4432 11968 -1584 -16829 -24940 -21585 -17250 -8128 -13478 -8847 9258 4270 11422 -1769 -7093 -1132
4418 -1132 14777 11492 -3049 -7640 -10711 -20465 -28548 -28343 -33633 -38952 -18604 -11002 -7510 -5744
4404 -5744 7755 17441 17646 24373 8905 -8335 3330 26 -2636 1490 -10491 -10811 -10316 -16408
4390 -16408 -20041 -22569 -20070 -6778 7685 10687 17436 6793 -1424 -8456 -10456 -8828 897 6545
4376 6545 2108 -1745 -1229 6026 36776 33150 13130 8596 6919 11610 14006 10759 7984 8107 7266
4361 7266 5939 3079 10224 21529 18326 16542 9795 13226 3111 -16661 -22729 -14082 -5723 -6266
4347 -6266 -13046 -2001 -5190 -16290 -12165 5716 12646 7330 1314 -7899 -11367 -24023 -21670 -1604
4333 -1604 -2821 2685 1428 15779 29075 28667 21534 14617 7407 3777 -1549 -962 803 -533 -2048
4318b048O403j357j814j2979j2422K981J0199J343J641K975P447L401J0550Q475
4304B4795j1552j8485k820M02Q202o673J4704J0638k958N97o760r212J1754P24
4290A3356k921j495k663j4101j0659L518P820J4870O741m730l620l41L493j265
4276H003m727M300P756p262m326o812L826n97J4428R949N536j9160k5863L884
4262a1065J2532m348m077J654O617k527m918J849m003K05K417n51l44N652J004
4247I7l941l742m418K463k233J600R973j488P173N40J0041L039L823r950j3709
4232g32j0818l981l435j628K333J0270L570j974P620K524K057j2804o833J8834
4218E003N922k62j2487m744k809m018P3J594J1692J7166M415j7581k0734L417
$$ plain form
4318 -2048 4355 2998 1184 -11795 -24217 -21236 -11037 -9694 -8053 -5078 2369 5770 16320 24795
4304 24795 13243 -5242 -8062 -7660 542 -6131 8573 19211 16253 16850 10090 878 12632 13356
4290 13356 10435 8940 6277 -7824 -18483 -14965 -7145 7725 14466 9736 6116 5775 9268 8003
4276 8003 3276 7576 15332 8070 3744 -3068 758 161 14589 24538 30074 10914 -14949 -11065
4262 -11065 1467 -2881 -6958 -5304 1313 -1214 -6132 -4283 -8286 -8081 -5664 -6215 -6559 -907 97
4247 97 -3844 -7586 -12004 -9541 -11774 -10174 -201 -1689 5484 6024 16065 19104 22927 12977 -732
4232 -732 -11550 -15531 -18966 -20594 -18261 -7991 -4421 -6395 1225 3749 5806 -6998 -13831 5003
4218 5003 10925 10663 -1824 -6568 -9377 -13395 -13322 -11728 -36 17130 21545 3964 -16770 -13353
4204a3353P767j010j0645J636r809m576R529P902J874J1083o283L973O507k150
4190B445m076L004l473j444r68K595q026Q821O801o71p233q560J0743O691K139
4175H788o171o80J3320j1246P596J0591M627r745j7135K004p227r943L144O40
4161a1437k0608P44O37K867M263P045J1075Q992O929o601q075j727k567M263P555
4146C355O513J1315k899p082j1102n174K386M679J035M777o425j820R976r028
4132E06r03L445l234J160L644j7586J2659J4080q290L813j341j0965p938N207
4118e743m710K218J6580P525j225O352j1379p766R176J923J742k0818j5393q013
4104b9531p39J3253n827O837J4606K4j3124p313K355K0425J2838M100k630j819
$$ plain form
4204 -13353 -5586 -6596 -17241 -15605 -25414 -29990 -20461 -12559 -10685 398 -5885 -1912 4595 2445
4190 2445 -1631 1373 -2100 -3544 -4512 -1917 -9943 -1122 5679 5008 -2225 -10785 -42 6649 8788
4175 8788 2617 1937 15257 4011 11607 22198 26825 17080 -55 1949 -5278 -15221 -12077 -11437
4161 -11437 -32045 -31301 -30664 -27797 -23534 -16489 -5414 3578 10507 3906 -4169 -5896 -8463 -4200 3355
4146 3355 9868 21183 18284 11202 100 -5074 -2688 1991 3026 7803 1378 -442 9534 506
4132 506 -397 3048 -186 974 4618 -12968 -309 13771 5481 9294 7953 -3012 -10950 -5743
4118 -5743 -10453 -8235 8345 15870 14645 20997 9618 1852 11028 12951 14693 -6125 -21518 -29531
4104 -29531 -30270 -17017 -22844 -16007 -1401 -1377 -14501 -21814 -19459 966 13804 17904 15274 13455
4090A3455n563p524q076J4525R800k0789k1765o53L916J412N456N100J9109J727
4076A0130r262R378m650l458J84r6j0374k474J0157R640j833j3275L965N739K0295
4061B4066M519j261j0080k059j0082j4648Q76L336j818J0619K5541o04k4262q210
4047d067J3564K628j0693J2888P041q706j4868o356j5078J787o96n030k73J346
4033b6513O831o031P16J741R749J7199N593M305J1086j033n184j4021p227Q498
4019E709O933m802r954k783j335l220K084K832k133j0887M946M644m491o602P008
4004a2051J6008P992j7577m42j233o59n213j861o254q98O176j36o587K512J6416
3989c807J0164j298K053p822l740j0111L824M606J7370l523j7638K355R579o026
$$ plain form
4090 13455 7892 368 -7708 6817 16617 -4172 -25937 -26590 -22674 -21262 -15806 -10706 8403 10130
4076 10130 868 10246 5596 2138 2322 2226 -8148 -10622 -465 9175 7342 -5933 -1968 3771 24066
4061 24066 28585 27324 17244 15185 5103 -9545 -8669 -5333 -7151 3468 29009 28405 4143 -4067
4047 -4067 9497 12125 1432 14320 21361 12655 -2213 -8569 -23647 -21860 -22556 -27586 -27859 -26513
4033 -26513 -19682 -25713 -24997 -23256 -13507 3692 9285 13590 24676 23643 18459 4438 -2789 5709
4019 5709 12642 7840 -2114 -4897 -6232 -9452 -7368 -4536 -6669 -17556 -12610 -7966 -12457 -19059 -12051
4004 -12051 3957 11949 -5628 -6070 -7303 -7962 -13175 -15036 -21290 -22188 -16012 -16148 -22735 -20223 -3807
3989 -3807 6357 5059 7112 -710 -4450 -14561 -10737 -6131 11239 7716 -9922 -7567 2012 -4014
3975d014p648K265O019Q531J0377q25p662k2250m086J1825N952Q199j056j1970
3961f343p627j4464J281N415l129Q682O529R235m40j377p558l972j570q75K535
3946a3678m35K968n281n023Q519j0717q16O205q433J5148j869n262J0141k748
3932a1281o346j8191N53J5315K0581O181j1367l303r081k0951l07K5374J6225
3919C402N64P167n475p273o718K956J745K784O691L73k381j7441P31P737J2026
3904F888Q031k481j1942J3287l141o041q067M323J998l922M204R592m429k231
3890F069O490M538k921M444R738k0560L34P591Q668j537j1289j4285r864O174
3876f410K843N752J48M217r246M159l297o94r841L496M296m753n702k132K469
$$ plain form
3975 -4014 -11662 -9397 -3378 5153 15530 14705 7043 -15207 -19293 -7468 -1516 6683 5627 -6343
3961 -6343 -13970 -28434 -27153 -21738 -24867 -16185 -9656 -421 -861 -2238 -9796 -13768 -15338 -16213 -13678
3946 -13678 -14113 -11145 -16426 -21449 -12930 -23647 -24463 -18258 -26691 -11543 -13412 -18674 -8533 -11281
3932 -11281 -17627 -35818 -35265 -19950 631 6812 -4555 -7858 -16939 -37890 -38197 -12823 3402
3919 3402 3966 11133 5658 -1615 -8333 -5377 -3632 -848 5843 6216 3835 -13606 -12875 -5138 6888
3904 6888 14919 12438 496 13783 10642 4601 -3466 857 2855 -1067 3137 12729 8300 6069
3890 6069 12559 17097 14176 18620 28358 7798 8132 15723 24391 22854 11565 -2720 -12584 -6410
3876 -6410 -3567 2185 2333 6550 -2696 1463 -1834 -2528 -12369 -8873 -4577 -9330 -15032 -17164 -14695
3861a4695J2089J4906n866p174j6434j193J6165J739j5420r899R690J6501q85
$$ plain form
3861 -14695 -2606 12300 6434 -740 -17174 -18367 -2202 -463 -15883 -25782 -16092 409 -476
$$ [...]
##END NTUPLES=NMR SPECTRUM
##END=
