##TITLE=Analysis number 327456
Compound Code btb 08676
Book Reference 123397
Project Code adrs  flro3
Chemist Name jom
##JCAMPDX= 6.0         $$ Bruker NMR JCAMP-DX V2.0
##DATA TYPE= NMR SPECTRUM
##DATA CLASS= NTUPLES
##ORIGIN= Bruker BioSpin GmbH
##OWNER= nmr
$$ XWIN-NMR		Version 3.5
$$ Mon Mar 26 16:15:14 2007 GMT Daylight Time (UT+1h)  MAYBRIDGE\nmr@NMR_250MHZ
##.OBSERVE FREQUENCY= 250.131544655141
##.OBSERVE NUCLEUS= ^1H
##.ACQUISITION MODE= SIMULTANEOUS (DQD)
##.ACQUISITION SCHEME= undefined
##.AVERAGES= 16
##.DIGITISER RES= 18
##SPECTROMETER/DATA SYSTEM= dpx250
##.PULSE SEQUENCE= zg30
##.SOLVENT NAME= DMSO
##.SHIFT REFERENCE= (INTERNAL, DMSO, 0, 16.522)
##AUDIT TRAIL= $$ (NUMBER, WHEN, WHO, WHERE, WHAT)
$$ ##TITLE= Audit trail, XWIN-NMR		Version 3.5
$$ ##JCAMPDX= 5.01
$$ ##ORIGIN= Bruker BioSpin GmbH
$$ ##OWNER= nmr
$$ C:\u/data/dgb/nmr/ADRS/2000/pdata/1/auditp.txt
$$ ##AUDIT TRAIL=  $$ (NUMBER, WHEN, WHO, WHERE, WHAT)
(   1,<2007-03-26 16:14:52.57 +100>,<MAYBRIDGE\nmr>,<NMR_250MHZ>,
      <created by zg, POWCHK disabled, PULCHK disabled
       configuration hash MD5:
       49 4B E0 1D 92 C2 6B 37 9F E6 65 BC 52 41 86 1D
       data hash MD5: 64K
       16 3C EB 46 ED 56 8B 8D C9 48 BC A4 2B BB 49 67>)
(   2,<2007-03-26 16:15:04.96 +100>,<MAYBRIDGE\nmr>,<NMR_250MHZ>,
      <Start of raw data processing
       ef LB = 0.3 FT_mod = 6 PKNL = 1 SI = 32K 
       data hash MD5: 32K
       73 23 A6 B0 CD 16 4E DF 30 E1 9C B9 43 9F 3E 36>)
(   3,<2007-03-26 16:15:06.60 +100>,<MAYBRIDGE\nmr>,<NMR_250MHZ>,
      <apk 
       data hash MD5: 32K
       23 BF 7C 7F 5D 20 21 D8 F7 33 25 7E 11 D3 F9 B7>)
(   4,<2007-03-26 16:15:07.35 +100>,<MAYBRIDGE\nmr>,<NMR_250MHZ>,
      <abs ABSG = 5 
       data hash MD5: 32K
       56 DB 85 DA D2 90 FD 94 A9 1B 41 A1 A6 0D C2 5B>)
$$ ##END=
$$ 
$$ hash MD5
$$ 0A 0E A7 F7 8F 98 E3 D4 97 B4 59 49 EA B8 19 01
##$RELAX= 
##$RELAX= 
##$RELAX= 
##$RELAX= 
##$RELAX= 
##$RELAX= 
##$RELAX= 
$$ Bruker specific parameters
$$ --------------------------
##$DU= <C:\u>
##$EXPNO= 2000
##$NAME= <ADRS>
##$PROCNO= 1
##$TYPE= <nmr>
##$USER= <dgb>
##$AMP= (0..31)
100 100 100 100 100 100 100 100 100 100 100 100 100 100 100 100 100 100 
100 100 100 100 100 100 100 100 100 100 100 100 100 100 
##$AQSEQ= 0
##$AQ_mod= 3
##$AUNM= <au_zg>
##$AUTOPOS= <49 >
##$BF1= 250.13
##$BF2= 250.13
##$BF3= 250.13
##$BF4= 250.13
##$BF5= 500.13
##$BF6= 500.13
##$BF7= 500.13
##$BF8= 500.13
##$BYTORDA= 1
##$CFDGTYP= 0
##$CFRGTYP= 5
##$CHEMSTR= <none>
##$CNST= (0..31)
1 1 145 1 1 1 1 1 1 1 1 1 1 1 1 1 1 1 1 1 1 1 1 1 1 1 1 1 1 1 1 1 
##$CPDPRG= <>
##$CPDPRG1= <>
##$CPDPRG2= <>
##$CPDPRG3= <>
##$CPDPRG4= <mlev>
##$CPDPRG5= <mlev>
##$CPDPRG6= <mlev>
##$CPDPRG7= <mlev>
##$CPDPRG8= <mlev>
##$CPDPRGB= <>
##$CPDPRGT= <>
##$D= (0..31)
0 1 0 0 0 0 0 0 0 0.06 0 0 0 0 0 0 0.0002 0 0 0 0 0 0 0 0 0 0 0 0 0 0 
0 
##$DATE= 1174922091
##$DBL= (0..7)
120 120 120 120 120 120 120 120 
##$DBP= (0..7)
150 150 150 150 150 150 150 150 
##$DBP07= 0
##$DBPNAM0= <>
##$DBPNAM1= <>
$$ [...]
##$SUBNAM7= <"">
##$SUBNAM8= <"">
##$SUBNAM9= <"">
##$SW= 20.6930455092707
##$SWIBOX= (0..15)
0 0 3 0 0 0 0 0 0 0 0 0 0 0 0 0 
##$SW_h= 5175.983436853
##$TD= 65536
##$TD0= 1
##$TE= 683.16
##$TE2= 300
##$TE3= 300
##$TEG= 300
##$TL= (0..7)
0 120 120 120 120 120 120 120 
##$TP= (0..7)
150 150 150 150 150 150 150 150 
##$TP07= 0
##$TPNAME0= <>
##$TPNAME1= <>
##$TPNAME2= <>
##$TPNAME3= <>
##$TPNAME4= <>
##$TPNAME5= <>
##$TPNAME6= <>
##$TPNAME7= <>
##$TPOAL= (0..7)
0.5 0.5 0.5 0.5 0.5 0.5 0.5 0.5 
##$TPOFFS= (0..7)
0 0 0 0 0 0 0 0 
##$TUNHIN= 0
##$TUNHOUT= 0
##$TUNXOUT= 0
##$USERA1= <user>
##$USERA2= <user>
##$USERA3= <user>
##$USERA4= <user>
##$USERA5= <user>
##$V9= 5
##$VALIST= <valist>
##$VCLIST= <CCCCCCCCCCCCCCC>
##$VD= 0
##$VDLIST= <DDDDDDDDDDDDDDD>
##$VPLIST= <PPPPPPPPPPPPPPP>
##$VTLIST= <TTTTTTTTTTTTTTT>
##$WBST= 1024
##$WBSW= 4
##$XGAIN= (0..3)
0 0 0 0 
##$XL= 0
##$YL= 0
##$YMAX_a= 312572
##$YMIN_a= -322525
##$ZGOPTNS= <>
##$ZL1= 120
##$ZL2= 120
##$ZL3= 120
##$ZL4= 120
##$ABSF1= 16.522
##$ABSF2= -4.171173
##$ABSG= 5
##$ABSL= 3
##$ALPHA= 0
##$AQORDER= 0
##$ASSFAC= 0
##$ASSFACI= 0
##$ASSFACX= 0
##$ASSWID= 0
##$AUNMP= <proc_1d>
##$AZFE= 0.1
##$AZFW= 0.1
##$BCFW= 0
##$BC_mod= 0
##$BYTORDP= 0
##$COROFFS= 0
##$CY= 12.5
##$DATMOD= 1
##$DC= 0
##$DFILT= <>
##$DTYPP= 0
##$F1P= 14.0000005364418
##$F2P= -0.99999901652339
##$FCOR= 0.5
##$FTSIZE= 32768
##$FT_mod= 6
##$GAMMA= 0
##$GB= 0
##$INTBC= 1
##$INTSCL= 1
##$ISEN= 128
##$LB= 0.3
##$LEV0= 0
##$LPBIN= 0
##$MAXI= 10000
##$MC2= 0
##$MEAN= 0
##$ME_mod= 0
##$MI= 0
##$NCOEF= 0
##$NC_proc= -4
##$NLEV= 6
##$NOISF1= 0
##$NOISF2= 0
##$NSP= 0
##$NTH_PI= 0
##$NZP= 0
##$OFFSET= 16.522
##$PC= 1
##$PHC0= 218.3442
##$PHC1= 9.217214
##$PH_mod= 1
##$PKNL= yes
##$PPARMOD= 0
##$PSCAL= 4
##$PSIGN= 0
##$REVERSE= no
##$SF= 250.13
##$SI= 32768
##$SIGF1= 0
##$SIGF2= 0
##$SINO= 400
##$SIOLD= 32768
##$SREGLST= <1H.DMSO>
##$SSB= 0
##$STSI= 32768
##$STSR= 0
##$SW_p= 5175.98343685301
##$SYMM= 0
##$S_DEV= 0
##$TDeff= 65536
##$TDoff= 0
##$TI= <Analysis number 999999
Compound Code 99
Book Reference 9
Project Code 9>
##$TILT= no
##$TM1= 0
##$TM2= 0
##$TOPLEV= 0
##$USERP1= <user>
##$USERP2= <user>
##$USERP3= <user>
##$USERP4= <user>
##$USERP5= <user>
##$WDW= 1
##$XDIM= 32768
##$YMAX_p= 334575288
##$YMIN_p= -562603
$$ End of Bruker specific parameters
$$ ---------------------------------
##NTUPLES= NMR SPECTRUM
##VAR_NAME=  FREQUENCY,     SPECTRUM/REAL,   SPECTRUM/IMAG
##SYMBOL=    X,             R,               I
##VAR_TYPE=  INDEPENDENT,   DEPENDENT,       DEPENDENT
##VAR_FORM=  AFFN,          ASDF,            ASDF
##VAR_DIM=   32768,         32768,           32768
##UNITS=     HZ,            ARBITRARY UNITS, ARBITRARY UNITS
##FACTOR=    0.157963299565203, 1,           1
##FIRST=     4132.6476996994, 0,             0
##LAST=      -1043.33573715361, 0,           0
##MIN=       -1043.33573715361, -562603,     0
##MAX=       4132.6476996994, 334575288,     0
$$ Real data points
##PAGE= N=1
##DATA TABLE= (X++(R..R)), XYDATA
$$ [...]
20029 271982 265357 277554 304043 271489 245561 253909 274494 271080 271541 264120 286103 275463 263898
20016 263898 278312 299188 300530 285071 301112 323852 311479 313442 278672 268624 284183 282157
20004 282157 272836 254251 274670 293882 314070 294556 278260 268603 261204 284067 294373 299722
19992 299722 293410 319936 294045 264151 266314 268632 287990 303126 291705 306737 300319 311419
19980 311419 296806 272879 277975 294224 313267 328102 316572 294512 300543 321986 343121 344866
19968 344866 357896 340410 318177 327734 314884 308141 312540 316250 306048 286326 256808 263694
19956 263694 298703 309225 295904 310938 325255 315605 311308 323962 326256 334100 323109 300684
19944 300684 307339 300942 312481 336615 315454 310344 359695 377233 361761 341160 341317 338605 340570
19931 340570 354998 378240 366918 365154 344794 340169 343953 348989 355819 373211 385452 392427 387061
19918 387061 393832 374643 363425 372419 354712 343064 336347 336860 359561 360280 372887 367473 375771
19905 375771 379698 392772 383803 386381 388265 399514 413192 399531 390382 365901 345608 358732
19893 358732 381656 378870 391003 413232 408080 403276 386089 396738 404156 424254 431630 427431 419537
19880 419537 436276 437618 413440 406312 409279 410048 413079 434848 428350 409269 386624 393245 417246
19867 417246 424819 447129 436640 428454 413452 406103 412240 407693 394846 388112 414144 423890 415500
19854 415500 386433 385497 389463 396496 419287 437374 459397 443929 444738 448049 441208 451423 454431
19841 454431 462082 437972 426351 411008 417117 431004 452999 466129 461969 433061 436150 465768
19829 465768 483003 491892 505736 485769 454842 488432 502845 478700 478180 476862 477274 479196 464920
19816 464920 498779 503827 520917 531279 502541 485807 448601 437534 452853 459331 466510 458948
19804 458948 472573 482547 479430 487221 491338 491353 503940 505025 505651 524040 537777 504292 508451 515310
19790 515310 516054 526236 528484 529856 511764 485047 462516 463874 475657 494996 484991 498070
19778 498070 501946 473089 511442 510407 507421 545768 572449 580569 583194 545488 523251 538176
19766 538176 527051 518335 547339 557824 542296 534624 527593 536329 565478 559361 532831 542118 555105
19753 555105 544762 523977 529176 542723 548625 558941 585682 595029 597776 595580 588808 571178 574475
19740 574475 586229 578511 587943 590459 575254 569660 578989 584419 591452 595945 604666 613076 615366 623544
19726 623544 619152 578621 560312 577957 611886 615262 579995 566388 594913 585923 585784 608157
19714 608157 616512 595890 582581 580803 582107 588906 613115 637828 608985 613843 644181 644649 672956
19701 672956 684095 665879 663233 673835 647151 634750 639036 658402 653218 641297 644470 658798
19689 658798 656466 630252 602596 603759 619423 653828 663124 677972 662880 675416 669371 665854
19677 665854 659627 652209 632761 636367 649296 647915 657547 663455 635599 617180 630731 658796 657823
19664 657823 648938 660550 654585 618011 629800 633810 618531 644072 650327 654528 665531 672083 685299
19651 685299 709396 722043 718428 715232 685160 690603 702434 708112 717019 711624 702729 706641 713032
19638 713032 737881 753752 770590 731354 710731 726962 745830 708814 697292 689325 689941 668697
19626 668697 663825 686166 707008 719490 720878 736242 718695 712479 714033 736368 754606 759589
19614 759589 765732 761684 787765 780124 757658 750832 748986 743486 740243 743358 752371 773669 768779
19601 768779 773838 752599 731639 738080 745404 760122 736433 736935 748142 769314 781776 765362
19589 765362 768319 783729 783546 804775 810278 827221 791780 794406 786193 803891 821531 796164 792077
19576 792077 804668 809960 835532 866579 875764 863398 870500 870979 868981 872429 879128 872932 864496
19563 864496 830713 814187 812493 806792 826110 840035 838545 825365 797475 818252 827857 836719
19551 836719 859159 875713 874324 849078 872456 908775 918018 856827 845156 871586 879345 907676
19539 907676 911783 911169 911426 907241 898969 902898 890392 876207 865791 873363 885324 909371 901671
19526 901671 897054 899628 903194 917512 902462 897112 882056 900457 931625 927095 924609 910279 893781
19513 893781 899816 911993 907743 891204 909016 934898 920181 931167 938240 938691 915310 920996 943818
19500 943818 947850 937293 937521 944192 942072 935153 926966 940426 947674 930252 935847 907306 918961
19487 918961 925155 948880 949018 935739 913941 919040 931722 938247 939241 943101 959097 962275 953263
19474 953263 958212 986222 1014175 993286 968495 970304 972194 983141 977388 966591 977211 1011313
19462 1011313 1044341 1008749 998161 1008458 996645 978698 981463 964554 966460 973085 1008364 1026246
19450 1026246 1017928 1018887 1000099 991984 1012756 1011531 1018515 1027253 1025575 1018529 1029725 1033625 1046673
19437 1046673 1049014 1029268 1004577 999557 1032028 1041310 1051951 1069597 1080395 1069149 1066777 1063443
19425 1063443 1071088 1065821 1045246 1043865 1067609 1060585 1060672 1047540 1037784 1041630 1035132 1037195 1055575
19412 1055575 1073902 1086307 1044478 1033959 1024548 1038423 1064975 1083696 1074675 1065082 1052025 1043743
19400 1043743 1019771 1019874 1038251 1074389 1097841 1087488 1046396 1036633 1051015 1057731 1065902 1061046
19388 1061046 1071493 1091424 1074815 1075406 1104006 1097261 1075237 1052377 1060151 1052810 1023585 1023001 1048558
19375 1048558 1071184 1077228 1059977 1052212 1045582 1076004 1078219 1084231 1093186 1086938 1073164 1044922 1052306
19362 1052306 1075334 1093532 1095629 1110275 1115550 1114072 1126487 1147876 1136672 1151566 1142197 1100953
19350 1100953 1075148 1061653 1060744 1074292 1091055 1082670 1055543 1060707 1096570 1086714 1073726 1098550
19338 1098550 1143265 1149980 1137021 1104461 1103894 1089472 1064306 1047302 1040517 1066118 1104779 1134101
19326 1134101 1115389 1103127 1108156 1112839 1104125 1112916 1126855 1139174 1136206 1124722 1128411 1111811
19314 1111811 1121412 1122956 1124854 1136523 1160506 1150288 1122060 1074134 1078404 1102669 1105846 1074951
19302 1074951 1090451 1110909 1122122 1112496 1107774 1098983 1093310 1099587 1117446 1130879 1137789 1130583 1122690
19289 1122690 1107328 1097257 1125206 1134767 1148085 1160528 1147616 1144206 1161618 1132237 1116540 1106098
19277 1106098 1089485 1062027 1084053 1103525 1101598 1099716 1107382 1134392 1148429 1152967 1154450 1152039
19265 1152039 1163702 1153977 1140056 1146707 1138980 1126355 1098430 1065700 1055801 1064175 1068185 1067963 1101778
19252 1101778 1109373 1111976 1115332 1097925 1085116 1067697 1042316 1023457 1028022 1058358 1086279 1103991
19240 1103991 1086946 1070641 1065903 1091245 1098408 1083080 1069506 1060164 1086132 1096728 1093152 1116965
19228 1116965 1121761 1118292 1130360 1128258 1107257 1096230 1118002 1110893 1087587 1076118 1085096 1084345 1088527
19215 1088527 1117690 1121222 1105271 1089444 1072955 1081166 1088589 1104011 1086466 1064198 1076459 1080435
19203 1080435 1084601 1077879 1068021 1041022 1047611 1082008 1060624 1056665 1088095 1085816 1064309 1059791 1041766
19190 1041766 1021724 1050614 1075127 1074469 1071509 1056957 1060539 1060695 1051212 1039206 1023752 1011848 1012658
19177 1012658 1013625 1017488 1035605 1033768 1034982 1051738 1054642 1038183 1033697 1042467 1055271 1060964 1038123
19164 1038123 1028843 1048681 1059630 1068403 1044272 1033049 1035058 1072767 1067797 1057361 1066275 1067921
19152 1067921 1060357 1039854 1029491 1029866 1033115 1006046 978084 984790 1007729 1029126 1009366 1000143
19140 1000143 1028194 1016328 1012166 1002035 974899 955812 982724 1015388 1010151 994898 1004130 993035
19128 993035 989686 1002898 979522 967727 988040 984761 967359 965863 943986 948813 955386 950136 961689
19115 961689 960589 948640 936192 948163 956637 949647 939230 938195 947542 962113 967600 982016 984639
19102 984639 965520 951449 950730 952861 942167 928567 976180 972913 925789 909619 940919 932940
19090 932940 925205 908012 890426 904860 922322 928701 946674 957156 951748 939818 950469 935920
19078 935920 944833 930031 893976 878555 898276 897637 901494 917257 914027 925213 929997 945166 943440
19065 943440 950418 945518 933690 900798 903735 917002 925391 932574 932062 933803 930980 900012 891988
19052 891988 896839 889110 883003 905179 892704 883487 879809 877124 857156 880596 896738 879948 886050
19039 886050 861472 849307 845995 846897 856798 868375 871706 870366 862657 858178 850494 841996 847409 859290
19025 859290 864314 856981 854835 874657 899472 890025 899152 901233 907749 924288 909559 892246 880228
19012 880228 844164 824153 838828 854590 847673 853216 864491 847186 816946 799348 794785 814581
19000 814581 844171 843691 841892 872611 868127 854616 858965 870306 853338 818419 799185 808418 807318
18987 807318 783957 769847 788896 811861 831712 798456 759470 788535 797837 807584 810218 795080
18975 795080 796309 797792 749512 712326 718157 752913 788896 782424 766045 759255 764172 761051 780923
18962 780923 817039 815705 803005 786305 769575 747289 710613 714768 734168 740310 741383 732660
18950 732660 742697 782474 775975 765034 749605 725506 737977 743108 755917 760832 749273 750441
18938 750441 758346 732408 739533 747271 720684 713775 713870 730483 729324 734653 717306 705168 704190 721794
18924 721794 723285 694124 701394 710059 715202 713650 708633 715127 718854 721422 733893 750721 711505
18911 711505 692735 662313 678932 689136 688551 697432 695917 683141 674987 692060 678533 679897 694598
18898 694598 689195 685374 663501 659444 671991 684518 691940 710620 694944 706094 703993 712328 720987
18885 720987 698167 706429 699752 710816 714404 700157 680725 651447 640007 666514 678933 690327
18873 690327 708313 691594 669716 646766 659236 651498 656813 660874 655342 648009 640760 612714 617991
18860 617991 623289 617844 610197 604023 627168 640844 629207 638220 621513 607317 579152 591883
18848 591883 612073 637520 641308 627484 604271 598965 592836 583324 585348 599829 624230 628233 614351
18835 614351 576135 543920 569425 581222 580540 591395 585924 589370 607887 621281 622961 634852
18823 634852 618529 625818 607656 593642 595291 598741 622369 610756 595131 593401 564545 555226
18811 555226 571381 569303 572388 562329 550165 559729 586223 589816 591096 589827 559976 535397 523933
18798 523933 538537 571821 549398 552119 565806 567890 561976 534685 508604 532493 513429 498134
18786 498134 511353 520246 511041 498975 512150 513794 491835 496954 501046 514702 516947 515064 533891
18773 533891 552278 540643 529708 512452 501581 491417 493933 501763 505582 512571 540388 532906
18761 532906 541472 525590 513616 505324 498268 477619 497723 495384 466339 477172 505287 525089
18749 525089 534236 515570 476413 482418 485090 490772 487034 473126 493459 523480 521062 522689 505303
18736 505303 502213 494245 462632 454787 452941 437231 442719 447456 432906 439488 463861 430874 436311
18723 436311 494452 516316 511014 485266 484851 459723 433270 445413 453540 433240 451182 474242
18711 474242 470377 475764 474667 484955 495917 494036 467776 454313 454264 435777 419462 386251 412418
18698 412418 446169 467127 473592 478065 459788 434699 427691 426900 420877 417195 434425 432670 421061
18685 421061 419026 430813 452824 442234 417896 403299 388832 384715 412297 433484 420276 427125
18673 427125 421462 412474 437090 442834 462139 458516 454910 463035 451729 442575 447020 434478 429946
18660 429946 432417 443916 435900 426591 420062 440860 450167 488076 481665 468031 466198 455441 426965
18647 426965 436072 461654 455794 431856 423314 420767 450376 458216 449999 444032 434144 423201 421523
18634 421523 403335 377262 359911 361918 400917 413230 410710 391870 375656 385216 393380 374566
18622 374566 355254 373280 385755 391307 378865 375340 392943 398811 410021 401398 370669 350018
18610 350018 359632 373943 388299 402825 421020 415270 393418 391581 380960 344989 334302 348249
18598 348249 348018 330742 316156 302048 303830 308943 332851 339824 335531 338932 315219 293604 285703
18585 285703 290314 298567 328423 336933 322105 337752 355731 358159 348143 327406 360824 380235
18573 380235 361190 339010 329167 311045 320413 290912 278691 284019 266352 264811 276482 287812
18561 287812 298732 308193 299159 295802 286772 289695 317385 315128 325213 331891 306733 290247 303246
18548 303246 318200 326864 322534 332132 314812 309222 331797 337496 319083 324231 320055 315171 310768
18535 310768 296561 307324 326985 342549 360199 382579 400596 409431 429911 411289 419844 459082
18523 459082 474018 495175 483596 464690 434103 423036 432081 431138 424438 429287 445138 456449
18511 456449 453538 452830 445488 420844 402449 399618 384110 368339 367895 336941 313147 297764 294533
18498 294533 302230 302747 300937 279504 266461 286019 291740 292140 285340 268064 256040 245107 214772
18485 214772 220683 242320 258644 302274 332122 366904 323557 282676 269813 283604 277251 275239
18473 275239 284409 288787 285620 313688 346591 375514 386047 392200 351116 322141 298909 294616
18461 294616 328762 365664 358016 314790 286223 329307 336158 333844 311058 313104 348185 340293
18449 340293 320433 315807 293955 288521 289426 310996 304679 284495 286037 292072 286262 270613 223683
18436 223683 217466 221653 218421 253957 260798 251235 236805 235718 263449 268638 258327 257380 285472
18423 285472 294369 279705 308925 344890 397177 375166 364658 390801 391351 370415 369164 358454
18411 358454 371657 386868 358716 349561 349414 355715 361015 349994 368480 403983 399063 379714 351838
18398 351838 344301 332594 340350 303383 261752 239741 221223 236112 259886 254959 260624 260127 220590
18385 220590 209054 227601 223765 222528 224659 215112 231332 237908 211356 212083 210726 224792 212887
18372 212887 209748 202453 194880 197187 202723 206519 205810 230478 236182 211136 206799 197214 191437 208008
18358 208008 225915 217523 180534 169820 159645 159663 148653 150615 152622 163719 172479 174791 199284
18345 199284 227030 240596 217476 209915 216614 206132 208555 251841 244364 242450 231598 215721
18333 215721 200926 185411 203749 229830 224037 198966 175025 174452 186601 218107 231706 214572
18321 214572 210331 187084 192146 206466 187649 163953 152838 182712 195168 207922 219408 237491
18309 237491 199615 183518 182357 187182 211409 222792 234560 208885 204680 228151 219111 215662
18297 215662 212007 213505 230297 217990 205406 208423 206859 212918 203560 197570 197608 189115 190486 181943
18283 181943 180045 178150 163623 164775 188980 201553 194341 209629 241332 234962 231996 268465 290451
18270 290451 290924 296443 314909 356754 391701 386484 406144 426965 416977 420072 406927 345691 312747
18257 312747 314306 320486 324968 315708 303543 276756 260220 250421 236126 210757 187663 181192 172204
18244 172204 156056 161806 196305 204195 168314 155573 164713 158415 180729 191836 182488 204338
18232 204338 227455 218562 208122 193840 190681 173193 181217 192449 167635 191185 245319 295681
18220 295681 346536 396122 424739 448476 490606 520356 544187 551912 532601 525609 524269 521685
18208 521685 495731 446251 405151 356394 355432 339844 326450 316517 280774 245411 212903 189754
18196 189754 167073 176539 180835 170260 153470 130874 151037 172499 158287 129652 119504 138944
18184 138944 159741 171841 148516 137076 125346 120447 138639 138925 111963 132400 144736 179826
18172 179826 207791 214573 220777 214967 197043 190884 204035 227968 217115 213371 218248 212193 189517
18159 189517 200686 223164 222858 196751 166188 148422 137003 102482 82366 92297 105066 113682
18147 113682 123705 121789 109338 91097 102614 112859 121169 121405 117676 92563 89711 101797 107760
18134 107760 105740 87384 77630 84731 95545 126478 150814 135993 137944 132719 131681 130380 142259
18121 142259 149453 156901 157044 156193 120987 103684 103097 119624 168912 170939 118541 96876 112021
18108 112021 109771 108538 129234 133141 122120 109749 127679 122725 96677 106685 120862 128163
18096 128163 132102 131880 139623 146394 136152 137668 121953 108249 117731 99353 74362 55605 60318
18083 60318 104397 123041 72628 56240 82879 110144 99654 47811 57217 74689 58091 75971
18071 75971 97513 103266 76925 71373 79954 101734 82520 60686 69942 98224 101537 103359 107106
18058 107106 114328 119303 101664 119033 132417 124655 125767 128349 114973 122192 128963 167502 167677
18045 167677 167729 153986 135345 144966 153278 153368 119997 93040 82461 57524 57698 73057 65402 64352
18031 64352 107207 119050 115986 114129 99594 96116 112435 112821 98921 60878 85357 102718 138271
18018 138271 139695 95363 87213 106751 108949 100067 82886 68565 60431 89954 97677 109532 91577
18005 91577 82522 88933 76471 51385 37409 45148 57062 55302 41310 76189 100882 113417
17993 113417 123634 136765 134991 138726 126034 139385 100438 73062 87244 107830 91293 64281
17981 64281 64408 99396 107944 111896 117797 105324 106509 100822 115855 99574 89527 77784 74607
17968 74607 61307 64769 78658 75540 88836 67743 58360 38021 41553 78807 87751 89554 105414
17955 105414 90901 75506 62748 62618 48311 55994 59978 61444 97930 104936 68732 46775 63887
17942 63887 103999 130427 127314 89165 104358 132851 161328 167930 177905 205716 182585 175139
17930 175139 206899 228784 224522 210799 224358 261590 258466 233132 223230 224528 213155 184019
17918 184019 190656 215315 271200 318339 326615 342689 360097 360989 364600 369571 380953 405946 413032
17905 413032 413739 392322 358152 359430 398469 439037 455980 431398 422541 420743 373907 327908
17893 327908 329519 301912 299791 272455 236645 184160 145519 109443 102195 133681 136203 125749
17881 125749 145781 135600 145944 144553 142347 159348 168130 151793 140464 118391 118885 163445
17869 163445 168546 157949 123358 83622 57068 80767 97289 65027 41393 44541 29181 39670
17857 39670 77628 114716 137506 135965 119950 116660 111110 112574 149597 152056 145622 120041 132211
17844 132211 139085 160153 163983 168604 131025 116259 140301 133363 142910 174193 207403 233226
17832 233226 241179 239722 230465 217666 221051 209822 202920 190806 187674 179058 182769 161902 135207
17819 135207 123530 137742 126572 151702 198400 215756 217094 235862 266678 299227 325966 349840
17807 349840 427553 472375 528978 615278 699658 768026 847069 922241 1018784 1121604 1212249
17796 1212249 1308185 1406177 1514796 1640271 1770799 1946029 2151953 2372203 2664257 3047877
17786 3047877 3594759 4333452 5316213 6668903 8516337 10920140 14004510 17894857 22585567
17777 22585567 27971225 33707180 39046078 43738434 47373906 49246742 49872165 49279127
17769 49279127 47476383 44435537 40183537 35431710 30385483 25435425 21111393 17446857
17761 17446857 14411462 11946661 10011977 8498644 7301346 6411356 5739928 5201250
17753 5201250 4795639 4449541 4197041 4044115 3934153 3820374 3729691 3667717 3621825 3636443
17743 3636443 3648046 3675577 3752352 3853136 4004704 4250073 4558692 5033319 5691866 6569098
17733 6569098 7754258 9365652 11494845 14268365 17814581 22259308 27592571 33703675
17725 33703675 40316354 46701309 52519184 57260969 60202976 61735815 61727948 60213022
17717 60213022 56947992 51747887 45776271 39229818 32635011 26743721 21737788 17603583
17709 17603583 14295540 11678620 9646545 8080436 6836235 5908500 5217178 4665646
17701 4665646 4232312 3858710 3510926 3233204 3018123 2827824 2615708 2458894 2329200
17692 2329200 2194108 2030070 1890316 1759535 1635918 1529312 1422514 1330133 1205250 1093375
17682 1093375 1044510 1015324 963961 909488 881912 852107 796793 781996 750151 731761 697558
17671 697558 665136 652604 661890 655623 625457 599340 570740 536328 510310 464443 448709 433953
17659 433953 419741 414268 414565 399866 397638 363953 357949 360320 344129 302295 282410 289546 297752
17646 297752 331802 320513 297500 298596 309528 315932 307959 302955 316333 306117 300711 300996 316515
17633 316515 340305 390544 393001 371307 356859 324960 296815 272239 276327 297036 296252 272566
17621 272566 278464 270774 240769 225073 217514 241824 240951 231335 212596 174480 200993 224217 178056
17608 178056 173384 199510 210411 230314 204452 169464 157011 146251 142533 136871 149705 165416
17596 165416 175390 196992 200773 190934 171713 187321 210998 190977 185071 185086 171358 185067 217037
17583 217037 203999 213159 210742 200642 207199 168870 120335 131694 170042 173218 169337 174838 166342
17570 166342 160023 145612 143617 125088 120870 133582 146737 140050 128449 135101 118970 135957
17558 135957 174260 171074 131951 131483 147193 194349 221386 257361 267889 285070 331296 371596
17546 371596 443376 527099 597659 656938 691051 695281 733874 721244 663351 623854 588219 518597
17534 518597 450146 395254 332395 306619 260594 223531 218946 183145 153856 167901 172668 157003
17522 157003 163062 159489 141581 135585 119259 118723 141733 149226 164883 182903 150233 138297 151465
17509 151465 149455 127337 115868 118591 133018 152338 174231 195752 227355 262240 303895 357416
17497 357416 427887 512984 618427 728188 839091 951205 1021619 1059551 1076853 1093150 1099295
17486 1099295 1061028 983319 937721 943255 925405 891097 896471 892246 910123 926894 936642 946708
17474 946708 928485 952613 953196 944430 926910 904100 920597 957079 977180 1047381 1116001 1164403
17462 1164403 1201392 1248891 1305429 1276049 1212309 1192834 1167439 1141447 1107498 1117496 1133471
17451 1133471 1180819 1243135 1328331 1429148 1557189 1716937 1903088 2088643 2305311 2592403
17441 2592403 2912113 3263074 3704636 4300082 5008623 5920254 7109376 8628978 10578867
17432 10578867 13055190 16080576 19678054 23895626 28590476 33475593 38193346 42549295
17424 42549295 46081720 48523680 50184961 51039248 51005307 50109503 48756587 47519315 46550960
17415 46550960 46238276 47000690 48957729 51974895 55494659 58888017 62062599 64460852
17407 64460852 65374522 64980245 63412439 60690743 56543204 51125598 45256672 39210026
17399 39210026 33290749 27942509 23324977 19444426 16243184 13672204 11669138 10036637
17391 10036637 8728941 7696834 6862092 6156505 5560378 5061674 4655155 4305710 3969186
17382 3969186 3657762 3364387 3089450 2816208 2615477 2459539 2321933 2183358 2092509 1990021
17372 1990021 1892613 1814251 1729326 1644138 1563109 1536755 1528373 1513908 1478285 1444060 1428303
17361 1428303 1414167 1422808 1473630 1528059 1583531 1660871 1763154 1856054 1981474 2112480 2261754
17350 2261754 2420989 2585628 2805651 3031194 3258470 3559692 3922715 4364984 4930037
17341 4930037 5682347 6729303 8150137 10053438 12547418 15723479 19582231 24027158
17333 24027158 28846559 33452462 37235525 39966914 41444962 41390558 40004994 37675134
17325 37675134 34482173 30931241 27798684 25384776 23905219 23388231 23757202 24946063
17317 24946063 26687863 28652466 30342471 31462620 31834893 31169967 29576234 27306286
17309 27306286 24387570 21042563 17782470 14876368 12413544 10410878 8835476 7668034
17301 7668034 6799221 6144142 5648050 5339081 5132962 4983842 4932915 4950656 5039055 5220954
17291 5220954 5532403 6024096 6735250 7708298 9044247 10893820 13251474 16146284 19513898
17282 19513898 23190643 26775549 29676529 31713592 32828240 32873108 31818664 29922248
17274 29922248 27423876 24700502 22328304 20561971 19570990 19355187 19914752 21175088
17266 21175088 22931790 24847891 26412019 27402380 27751313 27272194 25867589 23739901
17258 23739901 21045477 17995455 15011698 12405817 10195629 8402716 7019141 5897613
17250 5897613 5025566 4375415 3846780 3431551 3115927 2853337 2617810 2414334 2269434
17241 2269434 2133378 1999020 1850313 1734572 1639532 1547001 1462076 1392882 1355271 1266993
17231 1266993 1188638 1130418 1076491 1035275 1006687 965945 940649 922518 901538 881687 859898
17220 859898 842995 804102 773864 767853 766894 779636 758472 716262 697300 696226 696351 674884 662734
17207 662734 693387 673935 629388 586099 570391 565604 559784 549099 582967 593976 561239 539070
17195 539070 512210 494831 486641 480687 490165 482182 476977 468674 473515 490025 477372 479561 478122
17182 478122 470353 490648 476188 485720 490756 478012 472201 456857 446490 424574 413752 411171
17170 411171 433624 432438 426875 418741 419402 417226 390282 364308 371725 369534 358239 338895 349812
17157 349812 349582 338080 345191 381206 411252 408286 404661 392088 367075 352032 383401 403920
17145 403920 415524 380862 352329 369809 356980 339466 354272 382832 380907 367798 352765 332543
17133 332543 320138 329535 329867 340862 335424 322875 327088 352821 345652 313042 287817 287535 273636
17120 273636 282832 280293 271269 289766 287144 267723 233926 238943 257517 283134 283677 237843 227604
17107 227604 227817 260014 263648 226737 202993 177566 201229 223255 247861 267013 279402 247602
17095 247602 238597 234063 231211 213695 187290 187485 205140 218967 237552 243696 209594 209215 247212
17082 247212 253867 237387 234356 238638 216446 221839 236851 232194 211796 210442 215589 238096 215380
17069 215380 197415 207277 198775 167537 169245 178510 167450 161178 179908 187992 181816 173534 187244
17056 187244 196169 206802 214378 220468 206186 190825 231534 236998 192690 168680 156920 139298
17044 139298 142448 151362 172641 186014 170364 159834 163825 180090 204515 228871 208997 200743
17032 200743 202892 245612 225257 203451 209567 188289 192123 213172 214112 206381 217791 204284 186736
17019 186736 192108 200437 221536 210923 196261 194266 200868 189228 158356 143089 131769 145308
17007 145308 127561 144951 166219 191098 179882 186916 189901 209137 194260 175025 188168 198531
16995 198531 196906 159324 130078 159369 149174 124132 153720 166316 153889 133867 162533 172230
16983 172230 163525 164850 161755 174904 184342 156279 149339 126120 137661 163142 169125 158068 123845
16970 123845 124573 135461 143406 114310 126688 182394 190589 168192 142797 144383 155349 175847
16958 175847 166886 154308 167982 165502 186145 173284 157635 173838 183280 184043 175481 191352 185102
16945 185102 162950 154983 147240 135957 150785 161877 168968 192241 219037 225648 232812 262641
16933 262641 290260 309630 324087 328888 343010 345069 364894 371789 388299 394705 392056 413140
16921 413140 417461 375451 327897 336035 345187 366651 389492 397027 415481 394880 400981 396829 394212
16908 394212 388476 371422 355054 331322 291220 274869 266004 265499 237371 190123 192885 186193 158694
16895 158694 142367 151966 157180 147752 151155 123975 106938 99606 95667 90976 96654 121626 110166
16882 110166 82044 68628 47434 55357 85895 112482 155931 142160 109619 104917 110874 102089
16870 102089 96580 66495 71767 95072 113958 125678 158212 165602 159334 161457 130535 99602
16858 99602 105517 109711 115408 104773 94266 98419 102386 86928 85323 92824 111387 104965 104260 103971
16844 103971 109249 148741 157782 137732 123669 127450 124555 129404 115174 111998 107645 97228 123513
16831 123513 161913 182385 186490 202060 232591 223819 226284 236416 223241 229922 242922 224393
16819 224393 204047 216155 187856 179034 212556 243292 250183 228218 222144 261942 282235 263161
16807 263161 208271 177067 182078 200728 200304 189516 196407 207230 167690 147347 137580 153410
16795 153410 141333 143079 156259 150983 132760 111065 88341 84606 92658 79600 85499 81050 89697
16782 89697 115611 150074 152801 158647 172841 185189 205978 243113 246134 236350 236087 218619 186672
16769 186672 180997 172965 185280 199185 196796 207349 226759 232378 232027 237500 258607 255080 202579
16756 202579 193215 210854 176227 113739 100161 112846 134594 121657 116085 100773 97243 97329 91613
16743 91613 78911 97586 110451 97434 80122 45725 32887 26635 25386 54695 79774 96002
16731 96002 77842 57701 77018 94041 76687 67236 87776 103117 80505 73251 54306 63825
16719 63825 74147 60628 18884 -2595 -3900 9749 4361 12031 63620 48376 54458 51887 28080
16706 28080 33503 51917 55432 52997 45810 90326 101246 73731 71180 71028 40367 33290 26846
16693 26846 41876 59411 27269 33545 31229 52060 45760 17516 28116 10158 -1349 663
16681 663 7188 5171 35809 49874 47802 67247 60149 54064 41206 26985 25127 57507 86507
16668 86507 72138 52187 73047 105960 86106 37192 60473 78727 52681 51667 71142 52792
16656 52792 40912 57267 67162 50039 49993 60820 42217 24668 27811 35641 26775 45717 24928
16643 24928 43741 63375 55085 36452 31877 47857 46711 37741 42410 59294 59086 54071 42557
16630 42557 44417 44838 63349 58604 35672 7921 3476 2017 -7787 -13856 -9327 3311 7374 16788
16616 16788 24287 2616 18490 22528 16529 35135 65179 70863 78506 53229 35740 53044 62408
16603 62408 59713 67601 77595 85869 100427 85707 62511 36894 16844 2853 37110 51175
16591 51175 25932 18016 7292 -168 8014 25661 17913 25213 10216 33091 59830 57277 39511
16578 39511 16413 29953 41958 47481 32775 10685 17844 16884 -2643 -26186 -10529 15833
16566 15833 24000 19328 16322 17501 19307 24009 8063 21228 27851 38640 30019 17151 85
16553 85 11507 33880 45246 41869 50096 38800 52826 41810 18647 19925 27019 28307 17839
16540 17839 28449 48173 54537 54559 41667 36272 12763 41478 48471 18640 7006 -3534 -25015
16527 -25015 -21773 -2941 19709 36976 38481 43731 32531 36372 39617 20686 13550 34601 43382
16514 43382 41935 44700 43036 18121 19303 12215 28492 2978 -12726 -13337 -2872 -551 14089
16501 14089 14043 6905 -12370 -15052 -11834 8899 15402 35177 49168 40125 19832 14117 29703
16488 29703 18980 4830 13881 33542 23482 10568 13720 15542 28837 47875 31004 39778
16476 39778 39923 28711 29270 30155 15533 40973 53725 51133 36025 18495 33974 49959 55546
16463 55546 58539 47506 30654 18029 16984 47388 68871 60157 42439 24496 2143 -15162
16451 -15162 12468 38053 61928 54615 49645 29017 18433 18292 28889 31527 39632 37281 13912
16438 13912 3921 3898 24582 19097 29247 29642 4169 -7372 29311 39906 28382 12719 11536
16425 11536 13355 2038 -4699 25282 34032 13519 2236 -2157 10019 13526 27018 37102 16269
16412 16269 -3940 -686 -9491 20 26365 14126 16690 15805 -1992 -9878 19477 20745 2661
16399 2661 -17799 -5706 25224 13588 8304 33474 54050 64217 75683 53558 72355 36453
16387 36453 9943 -14827 -35687 -25179 -20474 -49222 -26673 -3638 -29166 -17565 -20585 -2645
16375 -2645 10669 8019 3353 -19876 -22377 9845 6489 7859 20673 51898 64582 40466 20767
16362 20767 37349 35064 16966 1309 7738 -12182 -5199 35779 23487 13058 -10190 -19268
16350 -19268 28852 34244 -6840 -21464 2256 6419 -4468 -4989 -16806 -213 25225 35928
16338 35928 8721 -5191 -79 -17640 -47909 -29616 28963 48456 27210 22512 11746 12777
16326 12777 15914 -3503 -645 6577 -3315 -26508 -16752 6767 13858 7102 29096 31007 26896
16313 26896 30728 17992 10765 5136 38579 45315 39465 52458 47597 2016 -10759 7948 -19788
16300 -19788 -29175 -7581 8903 20749 18560 20881 33903 17041 12194 6335 1617 6874 32144
16287 32144 45385 26000 12597 17461 21531 11040 -1141 4323 32228 38995 46693 56192 40547
16274 40547 26857 14916 9173 -2658 11512 37763 13498 -18737 -9944 -14856 -15906 6811
16262 6811 -8050 -12272 -19468 -25507 3636 37123 54533 49112 31003 -476 -2505 -5539 -18966
16249 -18966 -21596 -15017 5306 14160 6910 334 -11906 -10081 -14265 4615 29341 9463 -4177
16236 -4177 16700 3841 -19000 -4490 -1307 24919 19520 15877 20221 22195 30542 48800 28955
16223 28955 20235 27379 31107 9173 -1595 -16474 -23953 -13466 -26800 -18058 -4343 9729 15899
16210 15899 2466 -16194 -2981 10540 19445 -2737 -2436 497 -4313 5861 -457 -25354 -25096
16197 -25096 -54718 -52688 -38945 -5424 7573 4455 7131 -17482 -17696 -27711 -48246 -37374 -33831
16184 -33831 -28462 -14931 14790 4664 -7353 5972 6702 -805 33381 9156 -12622 -9749 -2718
16171 -2718 -18043 -46723 -18179 12347 -564 -25478 -7420 2122 11869 10797 18230 7130 10488
16158 10488 15460 -21462 -39712 -27635 -12327 -18993 -28112 -1966 26536 34562 -10410 -14643 -442
16145 -442 29563 60414 65269 55645 26553 14391 24849 32989 16810 20504 6171 -16862 -1904
16132 -1904 11531 16333 11459 9772 22 -5537 -15602 -15654 -30020 -17542 5136 27849 38960
16119 38960 43174 35504 38611 22038 9737 11345 23820 7020 -9756 1696 13444 -5878
16107 -5878 6490 -16982 -16734 16547 -7044 -22738 -28459 -16969 -11327 -28366 -50318 -24748 5177
16094 5177 -19569 -7089 -12274 -11012 -5389 7424 27986 33828 7679 -6850 -1177 7440 1623
16081 1623 8696 -2099 -28297 -42659 -40831 -35760 -14336 4760 -11950 -43588 -76152 -51761
16069 -51761 -14963 -8504 -22841 -24809 -22646 -967 8513 23899 17773 -995 -27571 -29609 -25639
16056 -25639 -33622 -49986 -43124 -8513 -4413 1298 5591 3105 7133 -3433 -38583 -27825 -22726
16043 -22726 -25533 -24610 -11091 3708 15999 18075 19518 6141 10279 -20295 -22651 -37061 -47978
16030 -47978 -36018 -5457 11904 -12410 -18109 -34377 -21730 12924 -18226 -40459 -26618 -17431
16018 -17431 -22881 -21799 4058 7397 -32062 -40707 -9986 17411 5473 -2984 -11968 -15085 -13981
16005 -13981 16336 25842 11644 -5346 6109 34684 59084 65301 79194 59439 35321 18792
15993 18792 32035 50983 48787 15432 11017 24984 10090 -1911 -23604 -17110 -19767 -20707 -15081
15980 -15081 -10213 -14035 -33131 -38872 -13456 20114 -9458 -11126 3536 8103 1175 5206 23022
15967 23022 30736 18890 3929 -9129 -16063 -10276 13971 3810 -10365 -7964 -8957 -29116 -27477
15954 -27477 -28743 -4084 39874 21216 7497 20845 3593 1080 10002 40395 58451 33770
15942 33770 -10436 -43393 -41924 -13502 16129 -3714 -14944 -1736 3706 -7557 -2548 3226
15930 3226 3900 5561 22419 17018 759 -12738 -34328 -57092 -37147 -22963 -12590 -10834 -17659
15917 -17659 23239 36289 14653 5826 17462 13348 -19712 -36045 -34274 -16029 3540 6213
15905 6213 1384 9313 5681 2134 746 -12603 -26328 -3512 26805 45628 15415 -10159 1705
15892 1705 -7280 -15240 4262 4965 -17064 -31879 -19176 -1200 -14523 -28941 -7122 -5829 -21102
15879 -21102 -33612 -54094 -62526 -43589 -28220 -1547 -12476 -207 11930 29438 41795 24176
15867 24176 19775 1490 -21793 -19457 -21239 -37120 -19078 -3945 7047 5346 -19849 -33442
15855 -33442 -41960 -40394 -39301 -27981 -37877 -37910 -51952 -56372 -26477 15037 -29196 -55316 -40996
15842 -40996 -31723 -19788 3330 22985 13128 12712 -15047 -11420 -623 -2589 -3658 6091 28704
15829 28704 20344 5764 -15191 -17552 -22566 -52082 -27793 18394 13459 23166 25168 26840 26986
15816 26986 14428 -10593 -43154 -34616 5808 690 -27476 -7823 -21108 -21502 -17692 -13584 9975
15803 9975 23164 2352 -20023 -32278 -8798 25401 22017 829 -19901 -11796 -1372 -11146
15791 -11146 -36969 -45843 -20629 -38318 -58954 -70200 -56966 -14310 394 2884 2704 -983 -8791
15778 -8791 -1848 -24037 -44111 -43373 -31980 -7368 -16954 -18166 9485 -8184 -17545 -11301 -13839
15765 -13839 -36932 -73015 -72552 -32453 -25438 -42809 -27548 -48312 -38388 -32358 -46758 -39406 -21480
15752 -21480 -12107 -20433 -45483 -48154 -19773 -7757 -43160 -52013 -37325 -18712 7023 -1323 -6724
15739 -6724 -28487 -53981 -53250 -42530 -7464 6618 242 1494 20666 34222 12802 10943 9011
15726 9011 14790 2516 -3390 -6097 -24948 -32653 -15165 -25018 -40596 -45195 -59630 -36360 -24790
15713 -24790 -34154 -50605 -59540 -33883 -7571 -23195 -32490 -21714 -15200 -226 6603 -27649 -46984
15700 -46984 -24292 -19535 -3876 -14219 -15833 -10041 -19803 -14969 5929 7576 12005 28067 28131 29847
15686 29847 40007 55522 40859 28714 -392 -48180 -32476 -24968 -37951 -24608 -7953 -15620
15674 -15620 -16788 -19616 -21824 -28405 -40422 -48713 -31176 -14284 2415 -4248 1198 -11136 -21877
15661 -21877 -21699 -31486 -27981 -11287 -12179 -4471 -14294 -16740 -13001 -7931 10463 -22234 -32071 -6894
15647 -6894 -6049 -16554 -9574 -23004 -22406 -21631 -17251 8852 8925 -24916 -30362 -22563 -4160 -12481 -14089
15632 -14089 -3372 -26029 -23643 2341 14118 10705 -39929 -45964 -18784 8823 21452 27489
15620 27489 30611 6128 -32509 -22426 -29413 -43004 -12132 21122 18912 982 -24106 -23642 -27766
15607 -27766 -50580 -39133 -24351 -37185 -28548 -23571 -15636 3851 15141 -2451 -20029 18147
15595 18147 19078 -884 -24091 -34825 -27380 2066 10462 11132 -23105 -42855 -30938 -25580 -22864
15582 -22864 -30532 -10664 12687 3432 -3665 -9850 -24299 -36438 -14338 -19705 -27520 -47079 -69140
15569 -69140 -60747 -43266 -27538 2627 11910 9829 -411 -4553 -8671 -12328 -27385 -15280 -3525
15556 -3525 10458 36857 14847 11405 -11637 -60726 -68102 -58962 -39105 16849 23548 19090 -866
15543 -866 486 6766 896 -767 -10562 -6405 17857 -5335 -5911 2569 -6173 -24750 -43754 -54734
15529 -54734 -48232 -19121 -13822 -15260 -25565 -40087 -30532 -15821 -149 -4611 -17601 -10531 -11631
15516 -11631 -8330 3489 -3125 -15065 -6721 -22204 -19154 -5115 30 -22160 -29734 -44390 -62032
15503 -62032 -41449 -13696 -15460 -21439 -17824 -6668 -4606 -17540 -10485 -868 -1138 -20096 -53853
15490 -53853 -49873 -55636 -33353 -24351 -28866 -31452 -53013 -84929 -69448 -39217 -11409 -21552 -19506
15477 -19506 -16428 -17012 -38906 -36210 -25870 -18036 -15982 -19608 -2596 2757 -18598 -24615 -13438
15464 -13438 -29530 -53329 -39855 -27947 -18453 -1602 -6107 18491 23489 19963 -6523 -21191
15452 -21191 -33040 -31131 4673 25965 29711 18003 -10339 -35068 -27199 -24035 -36 543 -7974
15439 -7974 -4748 23378 44659 29548 8097 1316 8409 26908 -9518 -39530 -27181 -31307 -29356
15426 -29356 -33019 -32383 -14529 -24072 -30660 -51890 -70614 -61825 -29392 3300 18887 22813 39966
15413 39966 36685 20377 10135 -12660 15873 19455 20507 14493 11575 -17971 -47048 -40461 -27540
15400 -27540 -27325 -19468 -22824 6046 20792 -4514 -9535 -48244 -55710 -35162 -24897 -25063 -548
15387 -548 -5966 -43046 -32114 -42257 -61889 -51444 -29813 -17995 -19599 -20651 -30292 -7 3431
15374 3431 -11751 -12763 7063 27939 6498 -3829 -12895 -32186 -51861 -72071 -70144 -46691
15362 -46691 -32849 -22064 -13693 -18443 -11899 -9288 -22622 3351 30974 32610 30382 33642 9188
15349 9188 -14632 -30064 -24591 -27464 -17056 -3399 -25997 -15814 15776 6345 17932 11851 -26445
15336 -26445 -7430 22253 -16044 -36277 -27779 -33065 -25005 -19994 -28664 -33987 -25552 -19612 -24953
15323 -24953 -32518 -54805 -61094 -38225 -19694 -3375 -5965 -41017 -62733 -74669 -74094 -77173 -84967
15310 -84967 -85708 -64871 -39661 -19446 -3634 -29083 -56094 -40095 -16368 -1671 11373 2539
15298 2539 -21477 -15784 4840 4124 -42442 -54304 -46156 -39971 -52714 -52582 -45619 -11337 320
15285 320 -30592 -26182 -16607 -27430 -38820 -17677 7522 -12776 -46815 -68661 -58313 -27721
15273 -27721 -36543 -47651 -47527 -52557 -44241 -38213 -37844 -18334 11185 8813 3125 -15298 -29239 -51094
15259 -51094 -37537 -10268 6221 -8800 -24744 -26073 -32384 -27321 -34969 -21990 1785 27447
15247 27447 13219 -12308 6868 14771 -13678 -18144 -18365 -21579 -33111 -13501 -6131 -28670 -22959
15234 -22959 2048 6836 -5626 -34190 -46017 -39751 -35401 -14406 -18768 -44304 -68131 -67303 -29568
15221 -29568 10813 30069 17191 5198 -1014 -4179 1832 -25641 -13512 8389 22991 -20754
15209 -20754 -34755 -26777 -24433 -47358 -55375 -53756 -71951 -60922 -37971 -34145 -7914 -11254 -34552
15196 -34552 -61732 -78241 -78892 -65152 -52115 -44869 -41905 -39574 -30436 -65748 -49114 -34868 -17771
15183 -17771 -30726 -30739 -27964 -23127 5390 2210 -26482 -23830 -19703 -2826 -12269 -42740 -27044
15170 -27044 -34017 -55702 -26800 16641 25069 17367 9162 -29089 -61580 -67843 -45029 -23302 -20442
15157 -20442 -18553 -31613 -49626 -84234 -71432 -33432 -20790 -3666 -1908 9072 -3035 -22469
15145 -22469 -47981 -45307 -34400 -6218 11062 6126 2926 26098 30289 19099 -14629 -20222 -8253
15132 -8253 -20763 -15898 -13023 -4171 -32991 -19857 -12744 -19275 -17188 -13336 -15861 -9752 -28292 -23079
15118 -23079 11886 2601 4827 12370 12328 16936 21475 26815 17562 13031 -9690 -33694 -32690 -30056
15104 -30056 -46242 -30935 -27582 -26585 -42715 -24434 -8652 -10459 -7201 -24204 -28358 -18005 -22023
15091 -22023 -30464 -15410 -39852 -72798 -49709 -31690 -33058 -22615 -26042 -28357 -31933 -29606 -37846
15078 -37846 -7901 12098 1550 -14036 -18980 -5058 8364 4082 10150 17883 -2260 -42158
15066 -42158 -28824 -45297 -34136 -34934 -26266 -48952 -65778 -55781 -27325 -30789 -16718 -18433 -40080
15053 -40080 -48873 -48762 -34776 -45361 -34499 -55729 -53658 -61773 -45915 -10728 7995 1974 -3485
15040 -3485 -9788 -26164 -46370 -48421 -43965 -11837 -10525 -21286 -24962 -10252 24918 24530 -4735
15027 -4735 -2249 15745 11936 12000 20442 18353 1174 -20515 -34079 -28926 -20124 -23458 -25211 -24629
15013 -24629 -37357 -37786 -9913 3150 -2842 -3173 11354 -12657 -51769 -44943 -13756 -15407 -15556
15000 -15556 4967 -10961 -41244 -52668 -5749 2827 -933 6186 14914 17057 -8951 -22641 -21226
14987 -21226 -17207 4336 -274 1068 31076 28137 1162 -8442 -12336 -7134 -10688 -2333 27455
14974 27455 2057 -15170 -16704 8481 18237 16577 18284 24616 12801 -4774 -10728 -10692 -3057 22046
14960 22046 14342 -7603 -3028 -37534 -61175 -44945 -48158 -29191 4401 14733 9934 4048 12561
14947 12561 14841 4931 -6047 -13362 -6786 -705 4984 2008 7632 -9693 -6276 -6060 -26536 -21265
14933 -21265 -1440 -8259 -22476 -35382 -9270 -9155 -18257 -23466 24183 57358 26476 7543 13012
14920 13012 -26781 -22139 -16349 10910 29438 16557 7879 -36262 -65094 -65387 -47952 -60041 -55039
14907 -55039 -19945 -11232 -11057 -4121 -16269 -32399 -45299 -18894 1347 -8025 -38295 -36421 -32795
14894 -32795 -373 -13540 -20728 -480 31211 27185 1219 -14409 -18989 -17717 -40951 -30516
14882 -30516 -13138 -20173 -28542 -26731 -22378 -20655 -41380 -54858 -45723 -16936 4553 12355 -17044
14869 -17044 -24184 -13499 -27944 -33930 -28901 -18779 -35880 -23879 -5507 32226 37196 18584
14857 18584 3810 5265 11167 36132 -8704 -24519 -9544 3284 -7962 4683 5110 -6108
14845 -6108 -5008 -3971 -6256 -7636 -9128 6707 -24751 -50899 -49669 -36756 -20967 -4478 11907
14832 11907 18731 -2555 2706 11658 21490 17070 18460 -1018 3213 489 -1787 -24096 -33761 -36550
14818 -36550 -60597 -39567 10442 19233 8533 3732 -10631 -40529 -54972 -33578 -25327 -48286
14806 -48286 -30620 -16087 1867 -17004 -31835 -26164 -12378 -9917 -22443 7630 48704 44696
14794 44696 7097 -1633 -6038 -13900 20928 38855 21721 829 -17077 -30374 11403 37182
14782 37182 32896 35343 33368 29681 24350 19126 28384 -13268 -34002 -32957 -20026 -13202 -10636 -21449
14768 -21449 -42255 -33729 -19242 -25757 -24740 -28953 -34094 -37500 -12922 5527 534 -29343 -39349
14755 -39349 -20442 -28598 -39645 -46231 -56637 -45272 -46891 -61268 -30305 -35604 -33911 -32634 -29156
14742 -29156 -21379 -3706 4033 -9007 -24957 -45347 -44873 -40166 -19132 -15386 -777 -13286 -22300
14729 -22300 -5286 -22281 -36556 -49086 -58203 -30613 -27862 -24205 -18998 -32349 -53557 -58637 -30909
14716 -30909 -8925 8454 15227 2400 8472 17642 12848 -11665 -35766 -42777 -48754 -27402 -3861
14703 -3861 -3047 -14845 -9212 1819 7149 2734 18752 21465 -12474 -49459 -47971 -56718 -65241 -63388
14689 -63388 -64517 -55652 -51493 -59503 -57625 -63051 -28103 -5671 -5661 -4441 17690 -13448 -23812 5609
14675 5609 -3762 -31006 -48967 -33567 -47675 -23783 15655 5205 8841 -1297 -2243 -11416 -1641
14662 -1641 8474 14723 15512 17605 -6872 -4944 -1311 -11908 -32817 -40157 -32474 -23756 -53725 -64536
14648 -64536 -39034 -11701 -9696 -26891 -40304 -25928 -12900 -3243 13089 39212 34329 17426
14636 17426 21290 41098 37758 5571 -23878 -16343 -18205 -22527 -21819 -19437 -28482 -15491 631
14623 631 21555 3552 -25326 -9713 -7460 -3158 -15752 9781 7966 -2542 -12490 -10632 11316
14610 11316 23673 15869 15316 15254 1742 -7661 -20009 -11821 -26615 -49133 -51369 -13106 15833
14597 15833 27876 9233 2730 -12301 -21843 -24530 3523 9989 -9622 3103 -4324 -32892 -5407
14584 -5407 16042 -6393 -23441 -35441 -26230 -9752 1934 27774 31844 27261 24123 26515 17949
14571 17949 6087 508 -2781 -6000 8061 -16663 -1819 40992 38000 16268 26052 29054 40170
14558 40170 18534 -869 -19263 -8076 -21455 -45355 -19473 2156 -4836 -22229 -19196 8348
14546 8348 19112 -869 -14144 -19621 4091 501 -19653 -30021 -1737 -27168 -35929 -49754
14534 -49754 -58412 -14125 29884 42295 33087 9802 -17507 -42902 -73766 -55421 -15727 -19736
14522 -19736 -9527 -3229 -9780 -17207 -25307 -11477 -12417 -3852 537 19662 27900 7696 -7684
14509 -7684 8851 22041 -10082 -27780 -35464 -11693 10417 28067 29083 1175 2666 16248
14497 16248 24685 42841 50774 7902 -15323 30366 48964 33383 15431 556 13446 23998
14485 23998 37401 23123 24631 13125 -24539 -27227 753 6148 -9053 -21362 -12460 21468
14473 21468 33511 11085 -10109 -43093 -33613 -20303 -30978 10979 52524 21849 -19002 -19767
14461 -19767 -4076 3478 31805 67811 56898 33378 -13925 -1509 -16455 -40951 -29873 -15039
14449 -15039 6343 -787 357 -8628 -11205 -9820 -13160 -17150 -13392 -12230 -11614 6635 -3350 -26773
14435 -26773 -24709 -24887 -25169 -28512 -29037 -9314 -19629 -12691 -6015 2544 -5665 -7370 38 1104 16198
14420 16198 27915 19529 -1370 -15494 -10821 10406 35961 20049 23887 12976 1920 8104
14408 8104 20386 18406 15285 -14790 -29042 -52562 -30183 -21310 -13943 -10877 -11253 -8901 -1689 -6270
14394 -6270 11164 14738 15876 -26951 -57669 -56972 -40605 -47399 -32249 -17404 -29964 -25156 3027
14381 3027 35582 64235 53065 37026 36205 43483 28196 27012 5431 -7121 -12458 1005 952
14368 952 10579 17978 28440 29830 38889 27106 -9526 -46751 -52748 -47422 -26901 -10435 -12339
14355 -12339 -2821 38820 -2826 -19569 -8259 8009 3446 7680 13718 738 -7613 -9393 -22434
14342 -22434 -10769 -7823 -21254 820 4350 -24137 -34452 -36775 -29793 268 7707 -4145 22988
14329 22988 16548 10555 15728 14441 -4189 -17887 -7435 3308 15968 12129 8439 10881 1636
14316 1636 23669 23680 23334 24407 36396 36474 30807 12275 -16581 -21862 -45570 -40819 -16995 122
14302 122 15351 7403 11755 16150 27110 34862 39407 48734 48901 46446 60262 27890 18499 12482
14288 12482 14645 5961 24768 48167 44447 52848 28895 19128 53159 46948 13358 -5995 294
14275 294 153 4458 27294 19957 3876 4711 -5471 -3142 -10437 -31317 -32107 -27313 -26073 -17311 -8609
14260 -8609 17884 35465 4205 -25481 770 -4354 3001 27234 15281 4682 -2034 10445
14248 10445 23973 50938 52794 62485 52000 33640 -5715 -35121 -27809 -11451 4890 32682
14236 32682 48866 20184 -17161 -35626 -15477 23109 51688 29949 -10731 -14883 -9489 -4500
14224 -4500 -1786 6908 3651 5159 -3060 13466 19670 -16227 -22232 -7029 2593 18712 7340
14211 7340 7343 3428 20791 28117 36299 25358 -27881 -40147 -35620 -45033 -31653 -21811 2879 41184
14197 41184 20898 -19157 -28248 -8027 13787 30959 33384 18250 30575 40555 13911 13358 -6393
14184 -6393 -10553 11755 25474 20055 -836 -15457 -38101 -29824 7644 38693 34408 40475 46560
14171 46560 34609 4892 6402 -11289 -28563 -23657 -27249 -21238 -8025 -4213 -1312 13513 21813
14158 21813 31753 42656 47212 22125 -5983 -7951 31362 37148 26948 33964 24826 -2711 -11836
14145 -11836 -1755 -4081 1365 -12957 -19703 -15692 -3627 23495 18942 -2191 -6105 14866 9045
14132 9045 -8781 -24508 -1702 15413 14344 21756 23949 6231 7558 28010 36716 10114 19023
14119 19023 34878 39650 60566 66684 40483 46155 86803 72087 19943 -10682 -19857 -27767 -27669
14106 -27669 -25060 -34966 -41103 -23893 -17871 7611 41397 62010 85429 81271 64922 70661 75178
14093 75178 57034 47085 22394 39435 38326 20470 36629 46021 51542 56255 38137 28727 40667
14080 40667 49900 47231 31128 -303 -11857 4370 9242 1108 5716 11254 7167 -16733 -30432
14067 -30432 -45561 -52498 -34650 -29743 6893 -14463 -8445 -408 -2625 6224 33453 28176 9206
14054 9206 3787 -4112 -9119 -22030 -35545 -20644 -21458 -23119 -3647 -11632 -3152 13067 -12274
14041 -12274 -21811 -11238 16008 10637 -16745 -7275 12958 20215 11324 38575 46315 28523 30792
14028 30792 20292 33976 44401 66015 44129 41477 79179 76857 66469 51600 33418 39607
14016 39607 23733 15982 -3496 -5500 17963 20577 19406 18422 8962 10889 32262 42878 59293
14003 59293 53293 57475 68606 44783 21776 -16314 -26619 -5839 -5478 18743 35817 31663 36868
13990 36868 31545 30565 29605 35775 18703 13694 34156 57615 65988 46958 40221 26922 9853
13977 9853 18502 11538 17763 -191 -1099 20468 75951 82604 39707 30015 44113 23278 16270
13964 16270 -293 1626 20372 5921 -7999 1265 26143 55110 60899 42198 29581 30249 8616
13951 8616 -4068 1234 4859 15572 5548 7707 -5807 -1335 -7610 -4269 -5631 -7224 -5341 -7007
13937 -7007 8442 32051 10797 4228 44137 28110 12737 29849 32647 11104 9350 603 -18957
13924 -18957 -23504 -16742 -8759 718 5638 2518 10368 21032 3289 9184 30343 62991 75667
13911 75667 99211 88080 98264 64171 60046 70283 80513 91549 84708 85540 51108 29539
13899 29539 25479 40815 31721 41445 60560 40789 28110 35215 50387 72753 47814 198
13887 198 12878 41830 47963 82235 86920 49130 29540 31093 8353 21521 6025 -5145 -4716
13874 -4716 10340 32359 49925 59334 68565 85231 80501 88015 64067 55376 65665 61680 58686
13861 58686 52277 37378 33624 39465 26454 30775 45844 48485 56314 64206 71257 51378 65557
13848 65557 93400 76853 55350 91973 77630 45716 53053 72073 58846 27939 32989 55024
13836 55024 81455 78244 49798 24199 14035 55102 78875 92900 90935 63181 22252 -897
13824 -897 -3480 17871 54158 62146 63816 61113 46685 47935 57129 50748 48057 20823 25351 76107
13810 76107 99299 82393 46786 65004 63360 69392 81445 66115 58894 75988 67624 38421
13798 38421 41611 42597 31204 28578 34856 29126 14197 6546 27393 41186 28821 -8783 -33521
13785 -33521 -29394 15224 39406 26543 17294 14304 39830 46685 54900 52897 60684 67397 73237
13772 73237 69696 73699 60611 65753 69565 62554 31718 57481 74758 64443 62580 51677 33911
13759 33911 56954 57433 50335 50040 65741 58237 21530 -150 123 9602 -7595 21896 48142
13746 48142 41729 39026 72248 61967 67057 65327 65756 82162 59171 55531 58148 60862 67967 82260
13732 82260 81033 83118 95197 88169 68823 40203 16192 4166 39488 85833 88038 91168 80964
13719 80964 84423 85231 79818 70650 49246 55094 62817 47651 40369 48337 49953 58519 65516 74537
13705 74537 61863 64329 68245 38849 38212 66762 71654 60693 40125 42678 68556 56288 66874
13692 66874 58306 34859 21908 35688 81955 114570 84438 63412 72477 52290 70179 95917
13680 95917 126726 140290 135641 119922 114357 101637 91441 86620 71133 74968 90659 77206
13668 77206 43350 41156 58646 68186 74606 72496 80170 85847 71990 66100 60439 53683 71584
13655 71584 71243 52451 42710 51706 50630 29655 4377 12529 13565 48726 90904 89397 67588
13642 67588 54550 46826 16702 1048 33760 53609 87002 119825 110469 91071 73926 48542
13630 48542 57543 80371 42894 34085 52865 82844 87049 84963 90085 85271 79808 80744 90812
13617 90812 90206 93636 87904 76375 80774 103837 120779 93171 83721 89949 99536 96610 103313 74655
13603 74655 63093 38419 18265 20358 48295 40818 44647 71943 74919 49771 53302 79832 91144
13590 91144 72971 56335 64147 44972 53139 45139 42856 43722 46484 41469 20880 39717 61869
13577 61869 83503 71463 47286 50387 39829 34233 32751 30471 46342 86814 109470 97127
13565 97127 80648 65694 65031 83849 59588 46072 48032 60755 92774 106654 98768 79240
13553 79240 97101 108879 83426 55472 80107 98462 108421 98039 107029 93232 104253 120077
13541 120077 112746 108405 116710 101418 106687 116875 85834 59780 69200 94554 94606 95898 82209
13528 82209 71214 88770 95804 87529 94952 106252 106015 101792 113804 135370 126554 97100 93068
13515 93068 75444 40392 66556 96849 89054 94725 96875 67232 52270 28742 16334 24614
13503 24614 49497 73399 86651 81015 84582 93923 123037 135113 124542 124751 117979 104828 117152
13490 117152 126149 101768 72666 83219 76231 67498 98761 138215 142900 119881 98707 93440
13478 93440 70206 38734 38021 83658 101761 91156 94030 77367 69098 74018 77334 79137 91859
13465 91859 119064 146790 136146 112074 85126 108583 115852 119553 93962 74962 51436 64553
13453 64553 91141 78508 93278 78235 64283 93086 80961 72593 78987 95721 108123 131340
13441 131340 148348 127341 124917 119505 115984 107356 114232 108871 119494 115268 115304 106744 88616 84819
13427 84819 90131 93881 60763 50651 68027 64548 82429 57203 70990 88645 116398 115040
13415 115040 128667 124789 150617 148641 154476 163240 165563 167725 145592 116899 98601 125515 124884
13402 124884 102211 116248 130426 116742 86276 72786 110190 137969 120404 118867 136471 124056
13390 124056 87234 85084 84581 40634 54958 82294 74254 98241 110424 99485 112724 104181
13378 104181 79340 78423 77811 94189 101230 89696 111246 86990 66414 112444 136247 114678
13366 114678 102303 99912 79661 115523 136131 131425 109855 102902 89849 87687 75160 66197
13354 66197 54097 47036 79333 126711 134652 109866 109903 118818 146447 128906 124197 109973 82831
13341 82831 99875 113920 116831 125469 119522 109476 76171 86890 117082 126728 144036 129866
13329 129866 90425 79905 91296 127096 128732 98667 103145 134354 165728 152226 121310 105880
13317 105880 112720 106279 114717 122800 135346 168787 182004 172051 143389 128842 132162 147117 154901
13304 154901 159328 152417 149809 172761 181564 167758 168122 165682 181598 160584 145353 164080 175771
13291 175771 158367 154321 152592 163426 179637 179421 124065 98760 107432 100656 124500 133486 129087
13278 129087 121698 129149 116385 91343 113964 129553 165698 170363 155129 184950 179939 160745
13266 160745 149740 143415 122654 116737 87651 93825 103310 104475 120951 143057 135059 157988 164875
13253 164875 167942 179459 157469 167812 189931 172012 124674 115595 107445 125329 132545 149983
13241 149983 147668 163456 162820 137954 143467 157420 190040 193797 158847 140692 125636 132067 150775
13228 150775 160688 165219 144684 111425 91670 80430 124620 144110 157241 149811 160997 169933
13216 169933 186170 167264 163932 158796 143430 152712 168517 180813 185760 201632 190351 155727
13204 155727 136269 131450 141121 133418 103818 128148 166726 167216 169041 164169 168438 176947 185145
13191 185145 177508 189627 193868 200859 194252 171151 149448 150942 139117 134378 139711 159910 150010
13178 150010 154629 167087 175566 162565 159651 152257 166738 166299 162524 143233 137480 164450 198099
13165 198099 221660 226337 220528 226086 188965 197880 212730 227119 220547 196761 199937 173350 156083
13152 156083 147903 169986 192202 165233 152671 153775 143277 126554 113485 126300 139135 157201
13140 157201 161899 172092 191340 170884 166600 149712 140539 152633 170062 153368 168956 190219
13128 190219 168329 155817 170433 200795 224209 212745 197088 175966 165346 172405 195258 202996
13116 202996 201360 201134 215144 213330 205566 191290 210959 228313 193126 162238 157268 150779 172090
13103 172090 171619 149635 156863 153126 163864 176468 180674 176993 152961 152893 169752 185066 207472
13090 207472 241531 227662 218411 221079 242847 236039 191483 189005 192081 185427 205047 198250 174038
13077 174038 173185 193042 194691 171026 162188 167967 208241 192187 204446 222789 234556 231562 239056
13064 239056 226496 218129 196831 186935 210288 209918 216427 215409 199546 172634 155787 176199 192685
13051 192685 214103 243192 230268 199570 180926 194747 203136 209739 206957 206366 219497 232073
13039 232073 235663 243567 208151 191393 170478 158786 169593 183148 190558 193705 199895 189118
13027 189118 194704 188105 174295 174135 184865 187476 193251 205424 220573 216317 229810 236661 227565
13014 227565 250105 279162 248126 240034 221445 216055 188699 179705 180740 164837 182863 202988
13002 202988 198504 165136 143232 152749 192969 220547 211712 222314 237353 224369 231504 239079
12990 239079 230323 211634 196021 201863 208733 193009 201152 213721 181665 165980 164414 182220
12978 182220 197884 220280 244003 238314 211713 219142 223381 226983 262903 243989 235373 244034 223974
12965 223974 214610 255808 252095 255433 240368 253675 251581 244488 271782 281283 242584 254832 254997
12952 254997 238391 248705 261935 241493 244973 256654 243338 241892 240797 238967 215674 213329
12940 213329 220179 216431 213122 208232 231769 229220 214124 222250 252994 244913 232893 222807 249462
12927 249462 260109 245451 250043 248594 225726 220467 224340 230707 212602 235678 300452 321997
12915 321997 298669 293329 267085 226069 197066 190922 191976 187975 210443 236447 209317 204735
12903 204735 189029 211017 223489 217415 208830 186966 174890 188402 185120 186702 216541 242555
12891 242555 245998 234029 241306 231528 243335 246315 250044 271002 270419 240837 223741 209569 221046
12878 221046 240883 239501 229998 244542 249282 231751 228378 211630 203471 200004 196218 195303 196390
12865 196390 214999 222746 228789 206863 227304 234761 213682 188629 182687 190120 216200 232635
12853 232635 243992 241433 248047 254361 249023 233658 218443 224690 241781 258653 256301 272783 257536
12840 257536 258212 270272 272845 254367 226084 228690 245873 275595 292219 295042 296923 275664 260603
12827 260603 241206 235377 256454 276593 285887 292357 288296 263002 267989 287800 288513 284333 282183
12814 282183 270450 256799 234418 212120 233143 270462 303241 322565 301972 275438 270256 274788
12802 274788 276620 261945 250666 222020 231565 226446 231961 232115 223712 242549 264731 265199 257130
12789 257130 259703 245901 232397 231221 252967 272094 280415 278046 284153 280742 278677 262691 268863
12776 268863 264156 214552 215193 268214 266118 250306 259616 286026 270767 276357 273701 287584 311950
12763 311950 308287 270678 243407 232815 238594 263741 287254 304259 312816 282766 268480 255719
12751 255719 238476 274007 311940 311192 288463 263461 248086 238785 238369 278156 294356 285990 273006
12738 273006 249152 247006 243392 237076 233008 231873 231532 238424 248996 274751 281565 280235 253932
12725 253932 261177 272871 276082 272609 272778 270112 274873 279581 276150 267942 268737 275148 255958 247382
12711 247382 277148 280115 251623 249927 245188 265372 268838 255995 245313 253994 221031 203279
12699 203279 220380 244826 252866 237994 241349 254677 244843 250569 244405 237883 222007 196818 223689
12686 223689 243977 234866 211790 208933 211964 228975 260341 258687 267931 282571 292848 311534
12674 311534 299395 283788 275759 250127 223952 230977 261994 260906 239097 237657 257737 281069
12662 281069 267851 258842 247143 232760 226001 247178 248712 256146 300182 316658 301207 286184
12650 286184 294927 291881 283468 251377 221744 225433 245355 228912 236395 260258 249191 263869
12638 263869 278187 292972 295383 307969 288053 270327 273460 278527 293286 272569 232694 213126
12626 213126 213840 227219 233166 239611 235617 249652 255006 267765 273870 285519 283455 269096 266747
12613 266747 283707 255976 224473 225824 246905 237043 232137 253431 274599 277476 276415 279210 275536
12600 275536 267058 261024 294912 311819 300681 288355 251371 234223 227050 209709 230248 230991
12588 230991 229973 237403 228573 232655 243372 266364 284992 285041 272432 271470 267762 265241 271143 271754
12574 271754 279814 282529 305565 283744 268083 269120 261717 268459 282409 295608 309386 286454
12562 286454 260819 303886 301685 282677 283927 295501 341255 346971 333381 323391 294165 287875
12550 287875 287914 273558 276328 283100 273153 256324 268121 291342 279910 251805 277931 288952 279008
12537 279008 261681 251220 244954 237901 242001 251237 261133 279438 280041 293697 303241 273648 239053
12524 239053 246725 267165 234451 224301 245575 257965 256299 241176 225540 235377 259536 248991
12512 248991 206972 225828 249360 269701 287355 281461 280290 279154 254882 265674 274776 246563
12500 246563 263765 277903 289118 304322 300042 327916 341844 321642 283843 272280 288973 297665
12488 297665 306415 261051 287809 266088 237042 243401 244744 252182 242857 238384 262010 266025 259169
12475 259169 264070 262704 274056 254168 219117 198808 234106 275169 284791 288965 279288 266249
12463 266249 253973 263330 295734 319169 294356 291429 301472 285587 260119 232574 222898 217257
12451 217257 208361 214986 208453 218381 224568 241600 251295 239353 223566 242719 244886 239271 258151
12438 258151 265631 256336 242145 246312 238984 222824 218147 237903 271626 272339 262127 231072 267744
12425 267744 279267 283392 285505 278955 304800 307325 275569 254411 273571 271157 271975 261122 256439
12412 256439 249086 255538 276435 291388 280992 258079 269400 268029 255610 236212 237959 237087 241845
12399 241845 242336 239498 253978 268538 256622 270643 285194 274133 279626 237238 213017 226368
12387 226368 230094 227758 238875 262147 251372 267081 287878 312815 297489 266275 231274 231518
12375 231518 239583 237219 241921 213827 214580 225189 255209 275960 251034 246637 241714 235549 222059
12362 222059 213073 206031 176530 197360 238844 270984 269799 265339 263915 254243 256020 234380 204655
12349 204655 226970 251519 262776 262223 247661 256044 263046 254164 250001 249414 238496 254629 265579
12336 265579 255241 228594 242215 238683 225359 241310 277634 291269 271698 246384 236103 223529
12324 223529 210495 235727 251287 244756 213227 174756 166179 150772 161625 173490 191636 203744
12312 203744 216315 223205 216956 217851 232352 233827 212692 207758 185821 178069 194414 221399 208920
12299 208920 204066 229197 206971 212045 233801 199414 179331 175070 192246 221778 238690 236150
12287 236150 250072 249493 213893 206688 204478 215662 225643 237572 232334 244459 230538 220317 215083
12274 215083 207446 210358 181979 161001 192975 236433 256840 231156 216429 211896 199335 205497
12262 205497 211312 198185 207328 241606 263602 273508 251235 231920 210901 190215 187416 214802
12250 214802 200517 199821 215609 234853 235742 225894 208093 200930 204014 210331 233835 270442 250781
12237 250781 204659 185468 186313 213160 218242 192198 184271 174921 177863 202668 214098 210157 219805
12224 219805 215927 204965 220849 228207 202816 190658 189255 212743 223982 226593 203028 161057
12212 161057 166483 151505 170318 166731 190830 223881 226189 241484 219482 213420 212620 218464 215302
12199 215302 207858 222856 236025 245119 251983 217712 209808 192769 187395 221390 223560 251083 246522
12186 246522 233003 209700 224746 234238 222078 216585 197901 198095 211747 235252 228651 197886
12174 197886 184174 185865 189050 176670 173274 167832 161834 152898 178567 167903 169363 183765 173972
12161 173972 153444 142832 159706 156880 175254 193492 197149 166456 143037 142210 152806 150543
12149 150543 178790 177713 157982 193312 228463 219431 203936 198869 168928 151890 127916 119139
12137 119139 180030 205902 204384 201487 198226 182043 168780 148277 143506 151943 166861 174688 163440
12124 163440 159025 133132 123821 144540 146787 159033 160093 157361 176359 179738 172933 170039 178918
12111 178918 180189 173601 153570 154039 153454 134799 161684 188716 192179 185757 203982 217931 205649
12098 205649 194708 192913 162138 119281 115138 124207 138158 154439 166797 148286 143221 150553
12086 150553 126791 106089 92337 103368 109025 117528 135322 136465 142705 139043 133152 139610 165670
12073 165670 186211 202227 221476 221101 215171 201547 182533 184031 207338 184226 166217 161418
12061 161418 149613 159471 164442 161810 145544 153703 177595 171358 186762 177662 154944 154495 150563
12048 150563 158600 154556 134267 120686 129471 141231 137763 122014 138633 164515 169429 170743 156464
12035 156464 163614 137412 128217 125645 123145 104731 93763 119936 136209 138668 116964 109461 107027
12022 107027 113281 118395 116638 117461 134624 102627 98349 101244 70909 97053 136005 111153 83070
12009 83070 91587 118582 143644 135893 138437 145839 157096 182747 193913 174075 164366 172523 143084
11996 143084 143703 134535 133007 138172 147779 130845 126778 145399 142166 131956 102297 107849 116093
11983 116093 122527 128647 123386 107552 81089 83815 92275 114162 124517 110786 104312 102301 82598
11970 82598 96755 116241 108378 125720 119031 131954 133592 148845 168421 154525 131211 113739
11958 113739 142496 167475 162350 158863 145570 136116 153558 153847 146588 142106 141594 153913 155728
11945 155728 147529 134361 96974 103218 120253 93438 82514 83209 65986 78591 90496 65599
11933 65599 64777 86623 94455 91829 108564 114386 143820 127797 103939 81022 78522 84309 98157
11920 98157 99244 90437 85204 77963 40268 61153 78963 68846 86091 71627 62261 64081 83688
11907 83688 107498 115613 94186 89446 100689 140258 136091 110983 114279 118836 119302 110600 108782
11894 108782 82014 75105 77998 73324 59218 52786 56197 50649 48770 76998 110010 114775 116936
11881 116936 109946 77442 87020 100665 82075 71041 61056 68447 57275 33779 -9994 12542
11869 12542 30616 62265 61897 64482 68261 74525 74026 84312 104331 94577 89614 94977 85245 78599
11855 78599 80383 70023 66666 96568 112756 112822 101161 61579 49895 93708 86901 45864 21254
11842 21254 36279 48639 56416 98496 112587 97042 90043 82191 50336 29413 40918 42690
11830 42690 51338 61417 61188 60420 48254 45581 25389 7437 9547 19292 37384 64378 78351
11817 78351 44094 43420 49528 36852 33144 3081 6926 17179 6884 8815 27236 35514 61343
11804 61343 31363 6726 2447 13201 28374 55804 81871 72832 55800 46453 25918 25304 46992
11791 46992 53373 44844 34108 42841 49136 41477 37270 25338 26598 17667 41307 63169 64636
11778 64636 33204 -7667 -10857 -11118 5197 -2648 -9343 -782 8711 30583 37248 31938 31718 25499
11764 25499 50970 45594 24273 13418 36665 58825 57299 32678 43510 43843 19042 21615 5293
11751 5293 -554 19376 12787 1868 1644 -17206 11809 15747 39815 22333 19002 24274 49151
11738 49151 80451 92705 75402 31416 -6037 -13289 -10983 30619 40848 27305 38093 51614
11726 51614 54384 52376 36355 18204 -5716 -3018 -4625 18785 35361 33410 29804 7559 -5116
11713 -5116 -36763 -35198 -22274 -23780 -29918 -18884 1880 30624 27909 18868 2706 33551 39139
11700 39139 16659 9769 55110 65721 50111 22543 21365 -672 -20651 10763 22952 32561
11688 32561 41553 47555 38596 18195 9387 27784 28363 34583 18001 -5508 -25581 -50282 -40257
11675 -40257 -46599 -30506 -21096 -7208 11551 -2562 -12783 361 -10775 -7701 -40809 -59633
11663 -59633 -44292 -21270 -19991 -2986 -34683 -52719 -63488 -50563 -30082 -35814 -17912 -654
11651 -654 10197 9405 -15526 -6628 15570 15195 7885 25294 28516 15191 546 2140 1563 -17350
11637 -17350 -15973 9365 -15107 9433 14995 15664 -16828 -23936 -14993 -808 -20720 -51099 -29133
11624 -29133 16339 38184 29029 -5426 -18851 -7379 13879 6197 -2374 -16970 -25703 -45459
11612 -45459 -40856 -18401 -10094 -6328 -4581 -3280 13295 10330 -3 -5496 -2352 5287 2120 -8607
11598 -8607 -12103 667 -15523 2629 -5675 -36078 -42515 -23639 -21390 -11940 1549 10882 26992
11585 26992 21526 7620 -1670 8876 8993 3670 8361 5618 -9538 -24381 574 4873 -2640
11572 -2640 18770 8833 11499 -5836 -24738 -28050 -14958 -671 -5329 -2863 20590 25900 8422
11559 8422 -21370 -18736 -17765 -6511 8084 -24055 -29572 -1793 10557 3952 -9706 -16285 -32394
11546 -32394 -55141 -77865 -48728 -31711 -6188 -17827 -44692 -43439 -33545 -16607 -35493 -51042
11534 -51042 -23428 -20301 -19490 -18819 -34955 -45453 -33657 -46373 -54865 -71022 -57173 -46033 -59141
11521 -59141 -59587 -55312 -44253 -42603 -69779 -35546 -3760 -2670 -18036 -13552 -8345 -22310 -25161
11508 -25161 -9155 6098 -21309 -65688 -63778 -72400 -93032 -91333 -85032 -65282 -50488 -53224 -73468
11495 -73468 -95715 -90871 -64955 -28828 -948 -12362 -21430 -48948 -70733 -76646 -64948 -66825
11483 -66825 -66315 -54762 -84164 -122009 -130669 -103242 -76521 -71539 -39075 -25472 -26392 -59549 -58742
11470 -58742 -63997 -74524 -70698 -29569 -30626 -34751 -72441 -76444 -74305 -74070 -67955 -60984 -54885 -49515
11456 -49515 -41714 -20166 -40299 -47516 -61818 -68994 -68400 -66456 -69795 -84836 -92851 -79889 -82184
11443 -82184 -98563 -110128 -116950 -99242 -87654 -89305 -103257 -101782 -102291 -101438 -98155 -113586 -127824
11430 -127824 -85595 -71094 -56848 -64565 -89883 -88943 -63539 -83003 -99195 -86333 -75348 -59988
11418 -59988 -82493 -93277 -57801 -60912 -99877 -103906 -92437 -87088 -57243 -83438 -93281 -108611
11406 -108611 -131620 -130503 -153020 -123207 -111854 -122256 -103033 -83584 -84731 -73275 -59942 -52566
11394 -52566 -79633 -87916 -102542 -113860 -95819 -61197 -67937 -77436 -73996 -60899 -61918 -54333 -66315
11381 -66315 -98132 -101775 -72783 -74162 -113763 -120777 -109562 -127276 -124233 -109943 -91500 -97199 -76934
11368 -76934 -74792 -80612 -81166 -80199 -91253 -97680 -94131 -69501 -71533 -86959 -90088 -88151 -79125 -70193
11354 -70193 -59244 -72907 -74238 -71749 -102017 -95944 -102866 -105252 -103029 -107163 -95446 -95483 -82087 -98308
11340 -98308 -105747 -102028 -112763 -104026 -89109 -113031 -131503 -134025 -139389 -130263 -122792 -122369 -114369 -105728
11326 -105728 -118355 -115780 -117858 -116533 -111368 -109923 -101925 -96011 -96790 -106541 -114395 -96178 -88364 -90603
11312 -90603 -109671 -110061 -86090 -95863 -87620 -83154 -72715 -82930 -100626 -110724 -105333 -99378 -107563
11299 -107563 -89197 -80701 -96229 -110731 -107476 -97443 -73182 -77612 -87200 -119866 -126153 -124399 -111710
11286 -111710 -104762 -107870 -127115 -130829 -123610 -111121 -107110 -117007 -120836 -131004 -145822 -158190 -153404
11273 -153404 -163222 -160643 -127541 -100175 -112929 -134208 -134163 -137669 -146814 -147742 -132918 -124136 -119970 -109144
11259 -109144 -119527 -112828 -89556 -116370 -144278 -158914 -152296 -154057 -138336 -119438 -116165 -115025
11247 -115025 -130167 -163892 -137704 -129230 -114149 -107771 -114533 -122852 -120433 -101539 -92751 -119588 -135232
11234 -135232 -138589 -141483 -133505 -136622 -154525 -144583 -112072 -84833 -83399 -85806 -67963 -65942 -96726
11221 -96726 -106229 -124536 -125687 -136001 -140995 -142759 -150043 -122689 -152974 -174068 -167636 -147650 -119639
11208 -119639 -94766 -89546 -95875 -95681 -113910 -104532 -102932 -114473 -112808 -115979 -133207 -155392 -158767
11195 -158767 -168051 -196290 -213916 -191855 -172284 -162656 -155249 -156181 -169321 -161926 -130060 -116814 -118340
11182 -118340 -133380 -145893 -155955 -192296 -224308 -223879 -206716 -195090 -162645 -144393 -159050 -140069
11170 -140069 -111231 -118936 -144242 -145144 -146097 -143674 -159536 -166868 -162090 -151618 -158745 -182579 -181920 -199933
11156 -199933 -190642 -151513 -126982 -141939 -164362 -166721 -131683 -140176 -153386 -161947 -153169 -148309 -159249
11143 -159249 -188912 -189151 -207983 -227796 -222121 -196814 -186800 -187465 -170241 -144932 -123929 -117776 -132186
11130 -132186 -137727 -128065 -146159 -175519 -192767 -210665 -188741 -162091 -142606 -126082 -101615 -70094
11118 -70094 -96922 -126076 -170488 -180018 -147668 -146768 -134531 -129702 -163747 -178536 -176838 -185388 -185058
11105 -185058 -183335 -196568 -205060 -183908 -124896 -117614 -146262 -145864 -146415 -151056 -141374 -153188 -154609
11092 -154609 -135077 -141653 -164270 -163492 -130084 -128642 -149313 -182183 -168634 -130566 -108031 -123831
11080 -123831 -169605 -177756 -179086 -163361 -160090 -170740 -182139 -189673 -197436 -188170 -189237 -186167 -197468
11067 -197468 -192304 -197649 -211650 -204114 -175802 -172392 -186336 -183971 -167757 -131586 -114363 -128410
11055 -128410 -133536 -129780 -145252 -181226 -187387 -166786 -140631 -124480 -114958 -88758 -64534 -42765
11043 -42765 -58839 -72432 -91204 -84807 -78096 -61734 -24434 25497 53172 58921 86579 109691
11031 109691 117925 79820 33434 6151 27886 26191 31972 51626 90258 159575 189860 161896
11019 161896 129273 112262 82919 26746 -174 18393 53464 58324 86326 89582 113306 115914
11007 115914 67528 1331 -519 -19378 -62602 -92478 -111877 -104422 -72115 -37930 -39876 -51236
10995 -51236 -61325 -104395 -106482 -96431 -130152 -149712 -175404 -178483 -175507 -177360 -173457 -182526 -203501
10982 -203501 -204272 -202520 -179767 -164031 -163959 -147744 -132916 -145916 -145578 -154739 -163068 -200016 -220400
10969 -220400 -200479 -180770 -188315 -182260 -173392 -156123 -190512 -203266 -185316 -186979 -184115 -190109 -208705
10956 -208705 -221851 -226869 -208371 -173727 -179766 -203524 -179882 -193104 -209785 -207986 -216942 -206586
10944 -206586 -194486 -162610 -165277 -169458 -172290 -165891 -152048 -154749 -149457 -145331 -160885 -173674 -193817
10931 -193817 -174843 -153734 -195896 -202486 -205896 -197033 -209610 -201991 -181954 -189115 -192777 -187293 -195956
10918 -195956 -231332 -257114 -262780 -246931 -254668 -239931 -233095 -237881 -231797 -229913 -213585 -191971 -204652
10905 -204652 -245554 -237499 -227538 -228152 -240834 -253101 -256420 -245144 -219092 -212472 -222021 -236426 -205012
10892 -205012 -192558 -200536 -209190 -203133 -223613 -245274 -252510 -259561 -272731 -261347 -239597 -232155 -236968
10879 -236968 -210536 -188450 -216606 -260450 -265969 -268675 -254997 -235703 -228634 -217740 -198232 -214351
10867 -214351 -226185 -230725 -241307 -239854 -188599 -175725 -209261 -246709 -256348 -255759 -255328 -262875 -261003
10854 -261003 -255853 -224546 -225337 -242086 -270807 -263744 -283665 -287481 -269781 -256601 -251931 -231270 -216684
10841 -216684 -219341 -209912 -200887 -208741 -212981 -216326 -248169 -260702 -244167 -240729 -254881 -223357 -229138
10828 -229138 -251774 -248784 -229199 -243810 -258612 -247302 -233418 -235942 -227102 -211358 -216152 -226825
10816 -226825 -245819 -240729 -239340 -226303 -244711 -250713 -244374 -221838 -209029 -209243 -231525 -262258 -284673
10803 -284673 -292288 -287500 -285755 -256207 -234043 -248095 -286508 -304402 -262613 -236710 -232879 -250289
10791 -250289 -250022 -253303 -254662 -262824 -250841 -249710 -257002 -256907 -246487 -233464 -232923 -251489 -297590 -298664
10777 -298664 -315029 -311354 -263724 -244187 -236647 -245930 -280462 -260621 -213492 -257421 -270603 -276826
10765 -276826 -248933 -244595 -266376 -270817 -282245 -289777 -287185 -289806 -309534 -314490 -325240 -346661 -322770
10752 -322770 -287841 -291469 -319004 -339578 -330129 -332773 -318616 -312129 -344471 -357594 -348572 -336116
10740 -336116 -322418 -305294 -319931 -323030 -324438 -307618 -291084 -312901 -338394 -342792 -322147 -322121 -335468
10727 -335468 -318287 -327778 -334168 -323075 -301066 -310839 -316264 -296475 -315756 -328997 -347492 -342899
10715 -342899 -331815 -301228 -302666 -306165 -304642 -309482 -314767 -322036 -319931 -327732 -319260 -310884 -310850 -299851
10701 -299851 -299748 -328534 -343880 -346029 -352847 -364156 -361355 -336599 -341246 -349647 -371587 -365072 -318165
10688 -318165 -290748 -281830 -328972 -363673 -381972 -394610 -392316 -383834 -370399 -362435 -354288 -352634 -362480
10675 -362480 -361605 -364254 -381179 -367999 -345121 -355888 -348731 -315700 -295434 -278369 -274256 -278965 -267324
10662 -267324 -292218 -323928 -314190 -305991 -298625 -327105 -358345 -382926 -365802 -339840 -341655 -324500
10650 -324500 -309277 -321234 -325214 -311728 -331876 -322270 -320248 -309075 -318656 -333766 -331812 -326134 -290497
10637 -290497 -273576 -248316 -200956 -94031 -16892 52757 162127 238983 278857 334996 425091
10626 425091 533166 683288 933167 1247769 1681924 2331676 3278415 4587634 6307019
10617 6307019 8500935 11193522 13933463 15913251 16452628 15784378 14720489 13900583 13721799
10608 13721799 14422237 16205009 19247314 23761021 29404454 35046164 38482149 37913110
10600 37913110 34399157 30381668 27386106 25943802 26209054 28279975 32360848 38384220
10592 38384220 45648605 52369492 55242442 52073102 45041151 37862526 32372018 28896653
10584 28896653 27284943 27456793 29277171 32468168 36406840 39614872 39899949 36242050
10576 36242050 30402501 24844820 20694608 17972837 16500701 15962711 16213001 17040398
10568 17040398 17997962 18485139 17783254 15668160 12854613 10172357 7964924 6333350
10560 6333350 5172715 4284896 3573001 3021524 2614467 2298150 2057101 1856526 1681170
10551 1681170 1501866 1360548 1234335 1114493 1004436 905805 812141 752377 711504 670890
10541 670890 629046 581411 552453 513222 462355 436215 431850 386812 363160 359931 334016 321736
10529 321736 298695 307355 297804 287364 261497 218730 201591 198548 185172 171887 165709 166576 165314
10516 165314 124227 109665 106076 139978 146882 156888 153985 97387 80001 59151 41792 12233
10504 12233 -25388 -41600 -34697 -26430 -23648 -26438 -5791 2420 8590 16064 18456 15356 5545 -5595
10490 -5595 -13263 -15117 -26448 -38879 -48924 -72207 -75104 -79669 -77762 -60747 -58999 -57162 -35817
10477 -35817 -17830 -14675 18520 54198 49342 27940 2249 25247 42953 49762 61959 86221
10465 86221 108933 159916 213125 242001 284503 342845 423788 531647 660105 826143 1017075
10454 1017075 1215646 1381297 1510497 1583935 1617446 1586815 1507907 1388163 1219528 1070381
10444 1070381 893740 715752 568794 437886 356988 297631 247001 201994 176172 125121
10434 125121 63904 29232 15618 21495 33702 58656 62674 21494 -11994 -52159 -48635 -23259
10422 -23259 -24503 -23469 -1625 -9211 -24797 -14975 24513 46602 63961 96767 143896 198528
10410 198528 272586 375634 489734 611651 758446 912145 1063383 1193910 1303341 1376640
10400 1376640 1415476 1395919 1355288 1268352 1118771 952489 803060 647809 483835 360563
10390 360563 248842 185355 158304 144104 106307 34779 -12569 -42689 -68216 -68967 -66255 -94799
10378 -94799 -117173 -124635 -153004 -177713 -172455 -153514 -144612 -167667 -182324 -190973 -206377 -229187
10366 -229187 -253485 -259040 -251995 -238522 -222673 -242303 -265812 -260050 -270796 -273707 -288566 -297598
10354 -297598 -289566 -287797 -276545 -279898 -282651 -272856 -283732 -263121 -261411 -261055 -256956 -239738 -230942
10341 -230942 -240267 -241443 -245528 -235918 -247763 -261026 -241090 -224633 -228723 -238336 -216043 -182505 -154672
10328 -154672 -145823 -147088 -128498 -127322 -153383 -171308 -204243 -199891 -179875 -188375 -204586 -203170 -199954
10315 -199954 -198892 -190961 -236489 -249474 -204125 -175909 -191920 -197749 -160686 -148908 -145466 -125467
10303 -125467 -140028 -145960 -146597 -173336 -182876 -203814 -226373 -222038 -237532 -291292 -310304 -306307 -295120
10290 -295120 -285396 -252776 -243414 -226748 -209054 -234996 -235035 -225806 -230394 -221673 -199975 -184850 -177014
10277 -177014 -161916 -126251 -83932 -14269 53147 125542 204513 280258 362380 473513 533002
10266 533002 601012 663004 677498 695554 676447 623910 577820 507852 428822 350792 280387
10255 280387 214673 161883 122453 137818 145221 165532 184918 243632 343579 448539 513572
10244 513572 538243 570330 641924 643660 617026 567102 490443 376088 251443 137672 56147
10233 56147 -5345 -78374 -143703 -166465 -177888 -143223 -128718 -126775 -131981 -127932 -96392 -103182
10221 -103182 -93156 -104713 -127827 -165073 -172338 -177589 -220417 -256482 -260342 -279053 -290003 -335053
10209 -335053 -342831 -361925 -352074 -355192 -402503 -452233 -450161 -472842 -482073 -481170 -492652 -480129 -497102
10196 -497102 -520304 -554770 -560634 -556901 -562603 -526518 -463455 -433936 -396473 -345114 -334755 -322388
10184 -322388 -282559 -251429 -220288 -193372 -203923 -154790 -127453 -114801 -72385 -78933 -131355 -116283
10172 -116283 -82410 -47630 -1403 56247 117629 169574 203202 201694 146558 96636 31001 -15014
10160 -15014 -62480 -112055 -139320 -127425 -101791 -63992 -5065 1272 -15693 -68946 -73238 -97052
10148 -97052 -102360 -79975 -28724 -5130 93290 164290 221018 252408 251425 228267 188496 177551
10136 177551 183291 185421 200738 218724 208768 223688 256855 262243 247561 257384 275198 318800
10124 318800 331326 361390 439896 544686 750383 1033824 1369099 1589584 1580476 1332251
10114 1332251 989089 723542 568359 512002 507686 504926 493230 496447 506779 522674 564931
10103 564931 621070 684045 751316 811305 860830 932849 1020848 1094135 1200034 1337073 1459270
10092 1459270 1597045 1787961 1989088 2189713 2401418 2651568 2955461 3301317 3684023
10083 3684023 4111453 4602072 5195993 5910317 6728594 7671244 8755982 10021277 11476833
10074 11476833 13122043 15007443 17146291 19590461 22450248 25878613 30153529 35641956
10066 35641956 42827067 52409318 65188137 82047286 103705283 130569465 162074999
10059 162074999 196861749 233479056 268561826 298258441 320632176 333431447 334575288
10052 334575288 324088953 304035703 276680743 243916735 209165462 176154182 146113178
10045 146113178 120025301 98737329 81993125 69104939 59161492 51461915 45447051
10038 45447051 40741204 37003228 33919053 31372555 29210505 27415605 25954782 24790295
10030 24790295 23944734 23440706 23261628 23435163 23916056 24730214 25861490 27349034 29213999
10021 29213999 31603237 34594173 38416531 43389931 49871826 58390904 69624424 84308531
10013 84308531 103199654 126854452 155362340 187799692 221929640 255439115 285175258
10006 285175258 308172835 322682374 326715423 320167339 303521131 278960060 249138612
9999 249138612 216706064 184799594 155198413 129429943 108154761 91103561 77547879
9992 77547879 66790707 58184459 51193900 45456661 40687649 36645263 33113148 30021879
9984 30021879 27303647 24860674 22676239 20767563 19089490 17597911 16290157 15168654
9976 15168654 14138585 13205559 12426453 11735302 11101219 10550786 10053285 9585505 9182087
9967 9182087 8792696 8451268 8146397 7849797 7584136 7351021 7079372 6853202 6602014 6366847
9957 6366847 6171682 5995145 5840438 5688217 5543366 5378837 5212554 5106860 4979330 4833412
9947 4833412 4703071 4575549 4472811 4397004 4334287 4300382 4261882 4230280 4235852 4299132 4433636
9936 4433636 4612378 4877120 5207151 5593541 6023075 6470236 6893282 7272453 7579067 7827186
9926 7827186 8080450 8411312 8005776 6825523 5945558 5289648 4782702 4366230 4050450
9917 4050450 3839655 3666462 3498055 3388459 3281140 3154996 3050464 2970035 2880363 2813339
9907 2813339 2743081 2671958 2580930 2510003 2460810 2407131 2356410 2332743 2290436 2238233 2201471
9896 2201471 2184194 2159969 2103409 2047753 2015498 1984838 1942791 1949060 1909793 1865706 1824264 1797744
9884 1797744 1796589 1783920 1749002 1753814 1772588 1803788 1810469 1785856 1775329 1740664 1699092 1697870
9872 1697870 1696440 1682050 1682158 1670701 1658647 1669597 1689050 1675810 1658952 1634900 1630913 1625692
9860 1625692 1646887 1638320 1613883 1567708 1549826 1537065 1506339 1491863 1471886 1410322 1354484 1345362
9848 1345362 1344106 1350571 1305599 1249686 1203904 1194697 1194174 1166443 1139900 1121093 1113666 1122283 1141735
9835 1141735 1141075 1165643 1183257 1167096 1151592 1128220 1125065 1147265 1155706 1156967 1153582 1114366 1084805
9822 1084805 1092374 1079940 1043829 1042912 1055707 1078185 1105387 1124979 1122489 1136909 1151874 1148454
9810 1148454 1134494 1095882 1050233 1029295 1009864 991304 974994 938432 927552 901555 892258 883330
9798 883330 877793 882188 879228 883793 856147 847468 842687 845026 828643 790904 770109 780976 765096
9785 765096 781762 796669 787503 759560 748609 743574 754054 750115 738594 768411 787397 769362
9773 769362 775186 783964 775287 743881 739825 730322 733200 756562 763922 782781 772756 756693 728618
9760 728618 723644 758365 767721 768996 757704 695814 667803 687976 739527 738669 725867 728469 715462
9747 715462 707295 711657 682488 700711 713261 687898 680730 662843 636575 637414 657056 662542 653045
9734 653045 639120 664307 642564 604014 581982 598771 589680 595518 617221 606880 580365 591545
9722 591545 597687 619827 591065 561476 592483 606640 578604 570463 569604 571283 580915 580408 593567
9709 593567 606784 587802 614486 629003 597656 571281 574099 593619 635790 654169 681806 675251
9697 675251 704613 745185 770525 797591 832384 868799 913344 978480 1052309 1200690 1459291
9686 1459291 1782588 2256339 2909674 3766802 4756968 5677281 6263769 6367449 6042891 5260193
9676 5260193 4303923 3442556 2724876 2197163 1838182 1613726 1438953 1292439 1180736 1120846
9666 1120846 1090548 1043497 1013311 1019866 1064032 1113079 1213763 1339062 1498076 1672353 1841468
9655 1841468 2035745 2193622 2289296 2389334 2474105 2549698 2555177 2289073 1958976 1702981
9645 1702981 1519680 1369425 1210020 1048508 934384 853330 804164 783385 736420 709953
9635 709953 653089 647483 631552 592173 587292 587845 606006 614296 609369 578331 583610 611897 629955
9622 629955 616994 578982 591711 613647 604588 607708 656332 735843 811035 873985 963589 1063830
9610 1063830 1193216 1334076 1492233 1670810 1801150 1941873 2044565 2051313 2019681 1978762
9600 1978762 1873831 1737320 1591953 1435600 1274953 1127594 1014265 930889 881299 825258
9590 825258 748147 679925 657656 641167 582143 566564 563188 571057 581243 582810 563022 524889
9578 524889 497235 519153 533699 540654 538844 560018 559777 544469 554395 580592 617378 670441 733988
9565 733988 803005 875997 994571 1164605 1430193 1782227 2282212 3028503 3968316 5015245
9555 5015245 5990608 6438052 6320989 5765628 4801902 3773909 2903170 2255972 1795626
9546 1795626 1464135 1201184 1066296 955097 859727 795442 722550 684027 654364 640281 594026
9535 594026 565276 561010 566394 555366 507247 505094 514545 507037 482540 467644 468770 457128 464458
9522 464458 461172 457904 445180 415748 389981 394629 412466 420345 396298 372532 377273 390973 369616
9509 369616 357990 360655 360145 328849 321995 310286 330668 346954 338922 313424 316553 306476 285627
9496 285627 294216 308881 323790 351047 362525 369922 373242 369700 369778 349672 319791 301590 296520
9483 296520 332460 368576 366673 339935 313126 321753 312179 299439 309703 327907 307828 297998
9471 297998 309603 301385 307718 314250 294805 278592 271578 262157 282534 315681 310421 287767 271275
9458 271275 270935 277438 276265 294370 304114 295233 272875 270537 274218 280860 262410 230312 240142 249459
9444 249459 246839 264707 263310 252755 278258 309136 315354 277936 275958 288623 268420 250601
9432 250601 232860 230932 242083 246589 260403 252854 243262 247994 243789 256561 288668 299957 285582
9419 285582 261281 226734 209704 235929 247526 231718 214282 230581 220717 232574 242068 241869
9407 241869 224740 216126 249592 258431 267671 285668 283756 242191 228567 257297 261445 238055 216090
9394 216090 213114 222460 238142 220540 225374 215729 212957 211834 207744 211082 214654 213486 213176 211356
9380 211356 199320 215677 221933 214103 222782 206502 205472 234823 263706 268696 241789 214970 210664
9367 210664 214255 209950 212141 233360 239019 245656 240494 237591 235600 224221 225178 216663 211178 183870
9353 183870 154943 166203 190374 178213 169571 181940 179883 164883 191441 242270 235955 218303
9341 218303 213222 206978 206627 197928 214391 224164 211543 191997 160069 144050 154483 178741 224513
9328 224513 224930 226156 202153 193373 208684 190955 193289 212643 233259 218436 195977 190452 189139
9315 189139 189159 158263 133791 151947 161948 160382 191171 215438 232571 215185 219843 228890 235903
9302 235903 240050 227147 235485 234553 249070 227801 208816 213001 223425 220178 223663 191306 157251
9289 157251 180211 213218 220841 211159 201761 213846 237276 211813 184612 186482 197795 204363 215134
9276 215134 217823 220722 224379 205008 219516 216790 201323 182579 175322 147769 148521 169864 155928
9263 155928 153898 150335 147447 153226 154038 168640 184886 183790 198937 211374 197901 187579 151049
9250 151049 148467 151956 176553 181764 187785 193248 203905 176684 179227 194273 226693 226975 221015
9237 221015 199741 174537 165945 164349 169469 150120 155899 166511 169655 161268 137462 140276 151700
9224 151700 154210 124973 137214 129863 127143 120569 113617 149672 169422 163438 145766 152022 154479
9211 154479 146971 154210 123318 118089 129916 134593 137006 123103 146635 158773 139134 132671 115984
9198 115984 115421 119355 119245 121253 118370 103583 129806 152227 158828 161866 173353 187898 209387
9185 209387 209034 191727 168091 128803 113412 143874 181254 175375 136018 104719 108388 132761
9173 132761 124060 126155 125847 128377 125702 150755 175167 195249 179803 154663 131853 105823 153084
9160 153084 194776 212500 177722 116576 107169 113682 111160 136124 139528 134845 145622 156212 172314
9147 172314 172853 166527 154315 143838 127018 145731 167142 155295 134820 124998 133212 147280 152312
9134 152312 170193 148372 138782 144138 137929 166711 172861 174559 190656 173674 147015 126899 134482
9121 134482 133066 117595 114504 137506 152936 136618 148374 147342 142416 139019 132619 132761 165098
9108 165098 183087 150767 124995 142372 130646 110918 108067 133625 154501 162255 153288 159211
9096 159211 159775 162139 164709 150216 114742 126933 154378 147714 140348 126070 123478 118417 139853
9083 139853 164739 183719 182474 150339 113595 102332 127303 138539 127523 95337 109875 130432
9071 130432 135605 130816 119878 104518 108883 141033 157074 122796 109800 99819 94683 101210 89999
9058 89999 73523 74862 68791 84869 103632 129834 151099 127875 114260 108718 104593 91466 75269
9045 75269 67423 55514 51447 84248 128518 130765 114360 121337 119392 107857 96006 92996 102315
9032 102315 123257 124603 98959 95462 88513 78862 95622 92800 89290 108087 89475 85544 83199
9019 83199 87306 116369 137670 104125 96838 125771 101954 106046 100207 72490 84253 118314 133846
9006 133846 156904 160566 150562 137856 147238 128754 122615 112868 109305 112457 131354 122826 111490
8993 111490 111452 114577 100025 91548 97378 118409 140480 135206 91492 59858 59042 65382 122755 114831
8979 114831 100049 105853 149377 117903 78463 107112 129511 104980 107697 113263 113935 120464 127611
8966 127611 105114 80358 64095 59932 56246 90495 120633 126215 139788 120767 110560 88954
8954 88954 78308 87297 108475 102662 101238 98629 75873 56230 57186 68656 79305 92969 95092
8941 95092 81889 107512 112447 101227 89117 80088 85551 108430 91762 88842 107345 98566 105907
8928 105907 118596 105666 106252 128962 128351 101882 76431 52975 49592 65261 69113 87515 84817
8915 84817 67644 77024 62926 54939 36149 59224 88461 89404 81459 86587 83964 88750 91852 83393
8901 83393 71978 63893 66456 63346 79471 87238 101921 87234 86597 75917 81224 68758 87841
8888 87841 95546 88470 72250 95120 96569 103434 117015 121154 93442 74121 65213 55402 62316
8875 62316 89121 90622 91770 111821 96839 79826 94612 70383 41354 49564 67451 58420 56444
8862 56444 54771 75467 103423 94551 124926 152650 119951 83391 62505 65124 79623 49903
8850 49903 21355 17474 47539 82400 124677 125178 101866 74495 66346 61966 48699 56442 56463 79131
8836 79131 120205 125838 119107 89163 78625 81409 93961 100176 106984 101703 86524 76705 67041
8823 67041 112890 133429 78968 94071 88337 76815 91949 109678 99160 77265 66935 81569
8811 81569 95982 128211 151242 140649 129323 109859 86529 57685 50972 77492 75960 93665
8799 93665 122128 129242 139896 148385 124973 91052 81391 100225 107622 90566 67067 67586 67011
8786 67011 77352 80867 64382 46172 42803 64484 68819 61473 49262 32404 17207 15404 29530
8773 29530 47844 50451 34155 46910 42960 40140 45380 66113 87281 85199 80434 76502 82122
8760 82122 113997 117878 111554 87459 91493 98376 94047 81584 64321 68097 79830 83322 80993
8747 80993 85431 95074 95968 86153 97475 92967 70891 76137 106444 159345 155356 167397 236063
8734 236063 277262 228516 156887 115014 109978 105530 105641 110585 89624 63113 70593 87986 89845
8721 89845 67534 51003 69655 92611 94527 113911 130886 134885 137918 136384 118839 103672 88091
8708 88091 97373 97635 75697 80100 86937 88175 64347 46344 68399 121729 124808 105915 95159
8695 95159 87275 103677 103019 76432 30129 35409 71568 93904 95068 110698 90964 86085 103919
8682 103919 123514 148047 123800 121264 116809 107524 97891 129725 120353 86046 73688 81481 78512
8669 78512 84358 84164 86898 86701 100235 102042 98649 99610 105207 85447 73132 60285 47556 44168
8655 44168 77552 68986 53539 61290 89098 84767 52638 29133 30667 29870 51021 77306 90188
8642 90188 85406 116286 115418 93053 73916 64885 47917 38183 52878 66769 73129 72726 74452 97605
8628 97605 109182 107716 107687 114170 123060 120110 100198 92209 79287 100016 103217 89917 104537 104393
8614 104393 93347 102409 82007 101391 91230 65648 67920 39921 22902 30777 48547 39752
8602 39752 42500 58779 74635 75421 75384 65746 62250 52025 20227 54013 55155 56851 81178 112193
8588 112193 131769 81979 51390 44947 51682 66638 61761 56706 63848 57751 56733 42998 71871
8575 71871 94409 106489 99856 87684 67670 61828 89511 83072 75206 48138 45289 30558 41457
8562 41457 48068 58936 73171 77964 76174 73756 70993 67350 81480 54340 51620 62144 47937
8549 47937 77675 63378 61723 58877 66238 89734 69900 78370 71673 93759 87947 88444 107914
8536 107914 85245 63724 55467 69368 82679 71913 78119 71713 79470 79667 59456 43842 44320
8523 44320 41866 58185 44915 35601 27670 24480 34426 37744 46704 41890 56335 46318 43667 79486
8509 79486 72826 43358 35577 38867 41079 59659 85931 81321 79206 71843 60451 42775 24089
8496 24089 53513 33200 46383 72111 85510 77620 61297 50705 87666 96559 90533 72061
8484 72061 59912 46758 62988 71377 62135 56866 64899 60850 43502 25607 16997 9977 -11172
8471 -11172 1382 30014 62635 87679 87627 71164 66629 40736 44374 37700 29133 41622 48330
8458 48330 52338 43931 27514 16336 18380 35955 30783 24189 38738 46923 49117 37127 35526
8445 35526 44187 56497 81800 75023 68638 51614 63143 89044 95748 56727 57030 81995 69205
8432 69205 44490 44161 46427 45089 45522 33874 18365 -2922 -9071 33627 38411 38882 76150 87100
8418 87100 83272 108972 96868 83975 67625 77733 84245 72378 80395 71215 64051 42322 35255
8405 35255 26583 10919 -687 9640 13838 402 32561 35832 11444 -3341 10565 38702
8393 38702 39542 29536 12422 18495 18979 34318 41837 38846 40478 55052 94054 93985 92098 91487 69065
8378 69065 50156 30417 35313 21072 12836 6411 15618 30707 39562 38445 28337 31012 40048
8365 40048 36301 23963 48597 57521 29555 6507 -6303 5167 -6967 -9597 -9136 3347 43769
8352 43769 50657 33279 28260 29506 34397 33576 4361 14686 20051 38487 51503 66696 55997
8339 55997 78340 60372 36499 47572 53453 50364 61988 71511 71981 43127 28530 38287 49513
8326 49513 50147 38704 28654 14566 14640 28328 33536 22818 20910 36138 45326 42874 43961 58524
8312 58524 55267 37898 11522 3829 25239 32708 23659 18290 30508 23572 14828 28583 37724
8299 37724 39120 52867 50729 67578 78342 89424 68621 71032 55224 39682 37669 28167 47815
8286 47815 68424 115405 173429 177368 115848 61972 52006 45302 68621 70146 76757 49635 27656
8273 27656 62506 65387 70071 55100 51303 38486 37627 34470 21834 33760 47603 51326 21311
8260 21311 -16227 -10706 9867 14292 19568 14671 18298 26189 45246 66555 60238 27888 12065
8247 12065 42222 83823 105040 109393 99800 61678 60704 49190 24052 23605 38675 35357 33719
8234 33719 41729 32073 11979 -13446 4163 34901 37873 38885 47524 41282 -3400 -3370 9989 22394
8220 22394 26483 11584 23491 38839 20334 17517 20824 1778 3210 11201 12659 1603 23373
8207 23373 2199 -15427 -12934 14782 49006 58819 74451 64718 55881 53411 52584 80904 74160
8194 74160 32393 38493 53733 36657 25991 35783 59056 49521 34522 24315 45563 62662
8182 62662 64171 37693 14973 -5915 5370 -807 5921 29344 2546 -25268 -28868 4793 23230
8169 23230 19080 23447 41305 38797 11304 6073 398 1225 34832 50997 53100 54162 43880 58573
8155 58573 52519 40259 29343 52337 46130 26241 22934 28745 47357 35466 6172 -1190 12386
8142 12386 34164 33966 27201 12759 13576 5470 16958 30256 6855 -13128 5827 21861 30658
8129 30658 20303 23488 28036 27657 37436 43643 31854 37935 24422 10689 31806 25880 9498
8116 9498 6188 6236 17766 20353 7245 1958 11353 54348 57371 60560 78600 64846 45907 13634
8102 13634 7134 17907 29928 31826 32452 57671 74534 67769 48549 43499 38676 20036 35448
8089 35448 36023 29762 56755 68509 66211 47516 43549 57525 36680 4485 3702 -20795 -20274 -14956
8075 -14956 -22658 -23139 2795 38493 22757 -5792 -7486 23052 13072 -3595 -10034 5570 -17470
8062 -17470 -11368 6750 35585 39673 9561 -674 23485 16356 22415 49411 75977 68640 41668
8049 41668 50570 60977 47789 36820 -9675 4555 33513 20539 -1094 -16819 -15877 -1446
8037 -1446 -8707 1729 -3797 2023 9986 53000 63955 50016 45220 35970 60355 81841 80076
8024 80076 48381 60647 76977 63510 37049 24995 40962 48688 28165 44466 41662 50338
8012 50338 59435 66609 59863 56206 46204 39234 46031 39299 40590 31870 19160 20223 32141 47051
7998 47051 42441 11281 13379 8561 -2851 24715 37240 29014 -8707 -4321 25659 21852 -25033
7985 -25033 -26030 -15943 -10617 -786 33902 35068 30812 31381 23818 18228 4707 11951 38379 31498
7971 31498 -2547 -9214 17092 54731 51741 21013 -4908 13860 52765 60932 36372 25898
7959 25898 56387 54600 38569 57962 60087 59956 71402 97256 63494 28185 17352 9843 8576
7946 8576 10886 7381 30246 54456 87315 54790 14712 20937 30312 44816 37691 35602 36538 34321
7932 34321 46106 17267 11616 28420 17127 42203 63962 73358 44083 13965 -13611 7136
7920 7136 51270 41332 14844 -3921 -27565 -16644 2555 34508 59048 25198 -11800 -15745
7908 -15745 -8547 -5857 14827 20107 413 -559 34024 57565 49938 13616 6597 12500 20310 10158
7894 10158 -16323 -20096 -12417 9688 39576 47485 35268 16030 8689 20889 34159 17996 -9024
7881 -9024 7841 13888 2197 7328 915 11788 44498 29613 23924 52259 48252 34494 36831
7868 36831 28369 30676 57379 57062 38665 14366 32001 64397 69900 50613 30375 -450 -16559
7855 -16559 -16239 -8197 -14652 8756 50061 41573 19763 27303 44210 24201 32746 37594 28931 14966
7841 14966 18294 20358 60964 65254 23204 -2292 21202 58547 54608 6895 -4093 19000 17594
7828 17594 24101 60128 76749 67740 36663 19341 17346 6243 4408 -8651 -11090 -26948 -40718
7815 -40718 -34280 -3983 -13308 -43115 -3542 36722 15108 12777 11132 216 -1969 4430 21548
7802 21548 41542 17120 -5884 788 -3151 19615 37699 35138 28331 45536 55304 52605 25775
7789 25775 32634 11362 12157 -3791 -7791 8961 2627 -32372 -52120 -53309 -28546 -27457 -13591
7776 -13591 -5615 -6958 7302 22809 11606 -9502 -7859 -14790 -3862 41752 62096 50140 23750
7763 23750 14272 4867 15192 29436 18915 -9578 -29713 -4206 14721 10136 554 -6041 -14885
7750 -14885 1017 24256 23295 12050 8189 -3721 -28115 953 29886 -5993 -47831 -49388 -22549
7737 -22549 -10579 11819 25872 7923 27126 66772 87461 78495 80286 60785 44349 32019
7725 32019 19790 2172 6169 31000 45628 39411 54566 55394 25161 5501 440 9493 19697
7712 19697 43092 33750 36035 34112 33987 10849 1025 -35026 -34627 -11875 -14168 -4060 9402 6536
7698 6536 17477 4460 -10661 -2023 -7750 -14741 12931 33228 -3602 -16021 4701 12843 6614
7685 6614 -7370 -7870 1843 10760 19060 42193 36760 28938 27740 37452 11586 11451 17501 29889
7671 29889 32363 22558 3652 14216 39460 42426 30409 19139 10840 6252 -18265 -20139 -5981
7658 -5981 -8965 -42503 -33304 -32020 -9329 -13238 -17286 3811 29493 20854 25688 39571 35446 12679
7644 12679 7787 -4702 5185 7353 2757 27056 11362 -14196 -6463 -12181 4216 8063 3943
7631 3943 10333 15720 10695 10820 28716 34573 17031 12125 13073 35686 51076 45132 33485 46632
7617 46632 32994 20252 11818 -5893 -3238 16183 22141 -5509 -12156 2825 31204 50182 31269
7604 31269 3507 -3896 2417 12116 22748 6677 -3523 -209 4040 25836 31123 12177 -9391
7591 -9391 -16625 -35358 -53110 -26128 -12426 -13052 -25967 -23714 -6223 17367 34988 35443 24089
7578 24089 -13202 -20465 -9914 2965 -5367 -8881 -10790 6230 50038 51610 33702 27147 12701
7565 12701 13343 7076 2603 842 -1974 3359 19636 12594 4091 4219 12217 12053 20753 1598 -19225
7550 -19225 -767 11850 3562 -4201 -21255 -21732 -10167 13565 11521 -7435 -2646 10521 22937
7537 22937 47787 65011 45389 50380 53318 43859 54019 53396 48359 50398 40494 52321 47006 52193
7523 52193 38549 45938 41703 13510 -14586 -18458 -26307 3196 8185 6084 -9292 -13544 -33906
7510 -33906 -44122 -18447 -29410 -19156 11167 -13555 448 -28226 -21389 -3917 -21671 628
7498 628 11684 28931 34406 26425 10045 -10317 1480 -46 12149 10829 6632 36854 67571
7485 67571 61986 42309 19889 1817 4077 4670 13814 19667 20570 -1668 -13462 1664 -10515
7472 -10515 -39288 -14298 16751 39051 41659 -3550 -4072 -1598 -15842 -10556 6057 -9603 -21609
7459 -21609 -43622 -6462 30103 18604 6371 2384 -13348 -15544 -32288 -51816 -10789 17570
7447 17570 -21095 -54318 -39245 17325 24883 -10319 -37988 -61108 -64903 -34106 -13609 2379
7435 2379 3682 -16412 -5845 8212 5196 13542 -4584 -15499 -10008 -24062 -29475 -19881 -8773
7422 -8773 16142 20837 8572 -388 -4450 -7003 -18285 7809 47656 74728 53467 14939 -10938
7409 -10938 -2152 -14310 -30895 -30230 -29364 -42956 -31648 -9099 -8266 -23612 -49609 -39301 -13161
7396 -13161 -22243 -39939 -31802 9223 42584 39508 1591 14273 41237 41502 27449 14208 28069
7383 28069 22561 32024 21559 12395 -3217 14072 20672 8469 -4472 8900 54487 80409 68649
7370 68649 27154 -13477 -39879 -35010 -37123 -52720 -56682 -37766 -4510 -1221 -10842 -27821 -34259
7357 -34259 -11041 -10494 -12684 -15743 -1905 15354 39589 42158 17108 9453 -4186 -440 11634
7344 11634 42149 51474 32949 27428 12272 -5303 2827 -14075 -7428 -17480 -27171 -53900 -43319
7331 -43319 -35932 -15424 1629 -18119 -32906 6049 30072 18919 14422 25351 23649 -18876
7319 -18876 -10466 -8667 -35034 -36908 -13777 -9739 -14435 -40472 -58331 -30764 -6375 -790 -7906
7306 -7906 -6058 11961 24939 6262 5289 14388 30530 30266 54881 48002 10640 -22178 -49538
7293 -49538 -34129 -14971 -10388 -9856 -26343 -25038 -14776 8286 8930 -6551 -12093 -13767 -4240 9757
7279 9757 22463 29609 40898 54952 43897 50445 76988 68193 47482 50843 40772 2648 -23730
7266 -23730 14322 42038 35068 33363 14478 10533 19033 -4055 -14205 2599 192 7966 13963
7253 13963 18925 8305 3798 8894 -6040 -30299 -13259 -3687 7128 25117 16283 4244 4781
7240 4781 -4432 -24522 -12970 3393 4982 -3551 10374 23458 17124 10200 -18440 -21303 -23537
7227 -23537 -30169 -37444 -28804 -33333 -29092 -13337 -2164 17068 14164 19663 35890 52226 36020
7214 36020 8375 -8380 -1701 -5733 -5237 -8213 -2286 -135 -20533 -21896 -9166 -11336 -37912 -48491
7200 -48491 -23002 -8270 18232 14793 -4251 -23508 -30663 -4659 11534 25644 6164 -3729
7188 -3729 -6403 -8060 -18669 -24689 -30962 -21562 12603 2121 -3402 -13772 -31752 -50750 -51214 -35494
7174 -35494 -14069 -12506 1313 12934 10694 9700 14000 -1644 8763 2595 -27185 -41199 -17642
7161 -17642 1655 20530 26743 5453 -19542 -17330 6295 21035 14645 16562 -15147 -37998 -22599
7148 -22599 19807 39281 37012 8122 -9525 -38132 -30281 -18678 149 505 -495 -24320 -10722
7135 -10722 -9306 -3391 -7206 -30766 -39796 -18639 6582 23675 -1017 18068 20786 -569 -6204
7122 -6204 -18072 -30204 -22532 -7062 -14136 -21744 -23573 -36163 -28795 -34511 -43883 -30740 -18146
7109 -18146 -18917 -31189 -52380 -50576 -22998 -19705 -3459 7795 16022 -2789 -25613 -53442 -64620
7096 -64620 -15334 -13730 -38929 -54218 -44050 -19230 -15702 -15138 -31646 -23652 -9287 10833 -2059
7083 -2059 -15899 -20715 -29169 -39131 -27753 -13688 3299 -7029 -7265 8812 35219 38764 19924
7070 19924 30737 12899 466 38020 19333 26156 9604 -26233 -5873 25156 55185 40190
7058 40190 32774 -5515 -15584 -1501 -8224 -14029 17525 28319 19799 37086 32336 1827 -6794
7045 -6794 19368 34437 13475 -10849 26894 25373 10832 9238 -5374 -589 -12880 -15348 -7315
7032 -7315 -7933 7308 -5547 -7568 -27212 -48325 -58205 -11227 -9796 -7178 26099 51358 51821 48234
7018 48234 43486 23009 17949 5590 -14522 -29496 -23214 -21120 -18048 -23184 -46410 -57112 -78164
7005 -78164 -68995 -63679 -63066 -81102 -51487 -23376 -16822 -7074 -3851 -14554 -5756 -6198 789 -7911
6991 -7911 -22194 -13201 10447 27627 19137 6703 -19914 -11686 2629 409 -20235 -18133 -12340
6978 -12340 -20051 -21107 -37833 -49179 -36190 -36826 -10936 -1936 32425 18511 20009 5253 8355
6965 8355 10110 474 2310 2171 26446 23254 6921 -674 -8172 -6084 -12390 -920 10535 12428
6951 12428 2810 16086 4667 19651 -6950 -34032 -18144 16691 21968 17594 5321 -14660
6939 -14660 -17368 22644 40527 54917 60952 48483 46150 25075 31017 40245 12188 2560 4199
6926 4199 37993 27260 33863 16726 -3102 -2662 -560 2470 18298 28299 20963 -7016 -30336
6913 -30336 -26658 -1365 8942 19318 34116 37066 27018 23875 37932 54609 38036 41271 58036
6900 58036 73452 47723 18933 1783 -13825 3894 13442 1188 -21144 -23421 -14872 -25247
6888 -25247 -30402 -34530 -25566 -2264 -11361 -17122 -11521 3941 -7651 24258 21099 36731 33191
6875 33191 29637 17921 14944 28881 31836 20868 9232 1949 16212 -2576 -28081 -27499 -78
6862 -78 3461 1532 3864 7277 7024 19720 18585 26940 19385 -3265 -5828 -11549 -1654 7573 9149
6847 9149 -6937 -15875 -6707 17748 29954 24183 6310 13960 7663 -20998 -24922 -23679 -30064 -41998
6833 -41998 -45466 -19522 -8372 -23703 14112 47050 32373 1422 25363 17065 -18836 -25321
6821 -25321 -34136 -24799 7992 8112 15960 14474 24607 11862 -1387 -17605 -29396 -16898 11500
6808 11500 16331 8733 591 7194 -6084 -7064 -49023 -70659 -71635 -36870 -14200 -7518 9193 18385
6794 18385 13400 -6254 -4362 15833 5754 7978 18978 -42 -29654 -49421 -57983 -43213 -41175
6781 -41175 -59312 -50184 -32975 -20351 -14145 -20723 8505 9806 14390 24270 19641 4104 -166
6768 -166 8086 103 -31932 -61703 -34863 -7546 -14997 -16667 -21148 -41373 -37915 -15406 20446
6755 20446 27783 12563 -29041 -54115 -82512 -87145 -68508 -64398 -72199 -75856 -47570 -54 28324
6742 28324 32762 38133 25695 40064 46382 33749 27890 17958 -10297 -2441 7110 -15637 -7066
6729 -7066 5610 -4985 -14224 -38412 -27422 -7849 -16943 -13072 -4495 -19144 -15609 -13680 -21633
6716 -21633 -11218 745 -2207 -12993 -18771 -14868 -28279 -16334 8128 283 7469 22636 27114
6703 27114 24256 24168 2346 -458 8696 10276 -1501 432 -25640 -31308 -65316 -54767 -65879 -53528
6689 -53528 -58370 -30360 -12460 -18341 -19867 -9527 -26614 -35864 6703 16624 17772 6444 11345
6676 11345 1143 -2531 20484 14047 -12411 -25754 -49784 -47682 -38774 -25105 193 17737 -13386
6663 -13386 -20982 -28787 -19339 -5693 6950 -1851 -17243 -7222 18703 21610 -6930 9888 25248
6650 25248 2701 5359 18124 8325 13190 11889 19879 18022 -2558 -26593 -33573 -18199 -11683
6637 -11683 16799 38855 15135 -509 -11083 -7311 4543 -12718 -6500 -9037 1026 35985
6625 35985 42603 2888 555 721 2464 -12804 -7017 5434 2838 6339 -2996 -14053 -15377 -21075
6611 -21075 -26764 -51960 -69054 -47072 -43258 -26734 -2034 3961 8948 2593 6915 -15109 -5726
6598 -5726 1867 -2375 -6971 -3230 -11253 -15534 -7152 -25819 -10781 -12118 -629 26524 38555 27220
6584 27220 396 -9415 -14691 -11752 5806 8795 -14035 -31444 -18925 -19789 -6841 -41869 -53178
6571 -53178 -1713 -7811 -21347 -28561 -43574 -28614 -11176 -8716 17172 12492 -3322 -10755 -19872
6558 -19872 -14786 -24732 -7613 -1376 9499 -1012 1700 -16713 -41875 -31244 -13944 -26170 -39258
6545 -39258 -31110 -23062 -21630 5321 18258 24345 23890 33993 33167 34426 7152 -24904 -18875 4592
6531 4592 25864 13544 -5907 -32254 -21420 -15474 -12698 5228 -12367 -26704 -2567 15416
6519 15416 5322 -17274 -35101 -30074 -40653 -37694 -30364 -28295 3044 34031 13142 -19488 -18728
6506 -18728 -5918 4804 -11016 -9144 10650 21052 18593 18783 13153 -1217 8964 12598 19593
6493 19593 18381 1601 6408 -980 -4368 6581 5570 11220 -4305 -32584 -25296 -13712 -41509
6480 -41509 -38074 -17871 49 3646 -8950 -23631 -32717 -28080 -39368 -25229 755 -11999 -24716
6467 -24716 -34579 -28436 -5060 -12303 -46934 -60463 -38896 -29210 -19018 -41611 -46232 -8285 3851
6454 3851 -1929 -11209 -35659 -15633 2324 -21965 -44825 -40300 -10520 11826 11133 4951 -3776
6441 -3776 -8357 -14712 -39503 -32809 -46781 -55716 -46319 -33082 -30383 -11816 -25598 -30195 -23186 -57788
6427 -57788 -71678 -54273 -54461 -47559 -25911 -15090 3974 13521 6243 -12685 -20793 -31243 -27408
6414 -27408 -16690 5148 12580 22907 -14499 -30725 -22181 -18604 -25433 -41127 -42659 -21574 686
6401 686 14604 11074 8386 9104 -13819 -16028 192 -9833 -15529 5569 -4513 -18129 -43564
6388 -43564 -31102 -30324 -13232 219 -21255 -23631 -30647 -34501 -26969 -26951 -24142 -22005 -7107 -5050
6374 -5050 -366 3707 -13960 -33990 -42992 -40731 -22754 -12317 -7430 1488 16301 11615 46063
6361 46063 48097 18838 19220 19632 23330 16046 3246 -20905 -20612 -8258 18631 21927 2325 13063
6347 13063 10127 29030 53482 55662 39380 27545 -9731 -18160 -13556 -9783 203 -3498 -33462
6334 -33462 -29493 -37844 -48897 -51091 -16755 204 -23609 -21995 -15588 -42684 -28130 -13775 -9835
6321 -9835 -21636 -6559 -35343 -35594 -11237 -10595 -25060 -17112 13713 18795 15895 26895 26911 21611
6307 21611 50243 49631 10703 -32307 -55788 -36767 874 -13492 -37957 -53199 -45258 -38602 -24347
6294 -24347 -64 -10636 -11550 -18414 -35977 -34663 -22833 -30252 -35736 -19897 2829 12074 10753
6281 10753 -10262 -21435 -12349 9960 12257 35432 24691 6758 7543 8866 -1855 -9297 6430
6268 6430 12044 15648 -21882 -41395 -43673 -44627 -37272 -15398 3582 1061 -27957 -23144 8926 -1504
6254 -1504 -18549 -28819 -31524 -9992 -12053 -23628 -30028 -53534 -36380 -26420 -26240 -25627 -24839 -13687
6240 -13687 -13603 -21966 -7580 8323 2707 3063 -723 19167 41339 9511 4503 -2274 -11569 -15326
6226 -15326 -35450 -31014 -2940 3455 17114 2468 -32948 -68109 -67246 -59647 -63014 -56268 -21298
6213 -21298 -28099 -28535 -19371 -23628 -8538 -5049 -34331 -57785 -29778 -28519 -12031 3984 -11750
6200 -11750 7110 14442 -467 -20982 -37506 -44235 -30119 -14343 -10942 -8656 9639 12049 1157
6187 1157 5604 7612 10160 -15025 -24354 -21922 -38581 -5608 34996 42615 28458 14599 -7405
6174 -7405 1389 26649 14672 -5285 -4993 303 -286 -3203 -4510 -6479 -27334 -40775 -18290 -23273
6160 -23273 -9828 -22881 -20532 3542 16576 11605 40944 68558 41782 25727 13465 -7732
6148 -7732 -17033 -29271 -11417 -4298 1911 -8619 2629 -3037 -27041 -25248 -6287 -23125 -23602
6135 -23602 -159 16223 27388 31493 43741 38412 21624 16863 -1972 -27355 -23146 -8256 2959
6122 2959 297 1466 10110 26328 35238 34779 12842 -6707 -20376 -20874 -4140 4793 -13450 -21739
6108 -21739 -17907 -26508 -10183 -5948 -8689 -10658 -22118 -27917 -18632 -10283 24155 36647 29095 8804
6094 8804 -5606 11070 3813 29716 22290 14964 7329 -15187 -22144 -22866 -17323 3193 21160 18125
6080 18125 -2869 -3469 -20986 -20416 -13226 -21875 -20689 -23100 -36731 -43014 -25013 -42793 -54232 -36690
6066 -36690 -34627 -36879 -60306 -56358 -45091 -21713 -11661 -8633 -9857 -1196 4660 16183 33752
6053 33752 1777 -35167 -36732 -35767 -46513 -67844 -29263 2659 -8075 -16012 -19007 -30028 -36921
6040 -36921 -68201 -87979 -70469 -64593 -55906 -39243 -3978 -6217 -36472 -26948 -17127 -29718 -24398
6027 -24398 -6741 3852 4935 -6335 -11534 -1499 1626 -5343 -20388 -20744 -11124 -28418 -15628
6014 -15628 6914 6479 14482 35410 47876 43650 44617 16713 20626 31385 -3792 -11137 -26497
6001 -26497 -45257 -23580 3661 10066 17520 24362 17371 9491 13597 14404 -27586 -26384 1190 -6671
5987 -6671 -8016 1184 21388 29188 21828 -9459 -11854 1697 -21853 -20412 -33185 -40366 -5947
5974 -5947 -16671 -11528 42821 26023 -24729 -20339 -27879 -30412 -16758 -4262 12951 1170 -7613
5961 -7613 -12985 -27518 -28319 -17466 19574 23189 4527 -18302 -22519 -10111 5570 -298 1141
5948 1141 19740 39752 33195 6259 2240 -733 -25068 -40045 -29119 -32538 -25869 -4285 -15975
5935 -15975 -29766 -41814 -18576 9314 -3274 -25727 -19935 -9084 -24503 -22795 -852 -5670
5923 -5670 -21232 3991 22920 46488 43870 37354 34804 11154 3972 17936 8794 4052 6772
5910 6772 407 -10492 -30030 -35989 -8929 6962 -7159 -12627 -19619 -46491 -62260 -74093 -58657
5897 -58657 -41767 -21843 -14935 -19963 -35887 -46714 -45623 -16945 13116 -4411 -45468 -62451
5885 -62451 -32085 -2118 -4066 -10510 1240 5390 12089 34971 -8505 -20750 -28395 -11461 18004
5872 18004 31432 12470 16450 -7007 -38803 -25891 -14368 918 -13840 -36147 -34981 -7336
5860 -7336 -17044 -23920 -19967 -31071 -17338 -2536 7166 5023 -1254 -18598 -15465 -3629 8764
5847 8764 3183 2512 -347 -142 -1293 7697 17829 8534 12370 26339 11030 -3171 10793 31834
5833 31834 33916 30700 18053 7223 -4888 -6976 -13752 -23732 -4458 -19209 -22207 -16255 -7402
5820 -7402 -29903 -64095 -67101 -59164 -31908 -9996 15829 29953 26909 22725 11082 18687 22930
5807 22930 22958 2802 -8088 1533 11121 25096 46087 30279 9490 12762 8110 -7070 -16705
5794 -16705 -13706 -1075 1629 -8104 -393 -3808 -8757 -10574 1405 -13397 -31562 -54107 -57498
5781 -57498 -32295 3408 20160 24196 -4396 5337 10100 9718 49890 61909 35315 2526 3676
5768 3676 -5735 1408 -6225 -14817 -22507 -34451 -27720 -24551 -47814 -48879 -23212 7290 16100 -3547
5754 -3547 12761 11172 4494 292 1037 20088 16704 6999 2250 -15631 -35453 -25883 -18727 -11090
5740 -11090 -1484 3787 9039 12151 4819 -14490 -45863 -57995 -28494 -26721 -30750 -28079 -39149
5727 -39149 -56011 -47751 -46036 -36920 -27158 -39777 -36866 -22098 -24208 -25513 -47133 -22883 11369
5714 11369 -1750 -17289 -30070 -34505 -30129 -33086 -11206 -2945 6395 3708 9412 4484 20813
5701 20813 28157 12314 16615 4086 13769 27530 23079 -3081 -13855 -18423 -6952 -20435 -32426
5688 -32426 -4173 29354 36640 31281 26101 31285 36213 11140 -21670 -23732 -8860 -9451 5048
5675 5048 12909 -20981 -50899 -58189 -49432 -38462 -18384 -32138 -36154 -34650 -26174 -38947 -61015
5662 -61015 -18682 8238 -14737 -35833 -31152 -43855 -39919 -29764 -23809 -16097 1496 -3749 -5198
5649 -5198 -7883 -6271 -10659 -24857 -2808 -2290 -254 -4531 -15753 -11886 -24805 -18632 -7085 -7627
5635 -7627 16238 34616 6669 -10355 -8593 13492 -16347 -45482 -43802 -34517 -30812 -33599 -47957
5622 -47957 -32350 -16026 -9689 -36088 -47775 -55596 -59477 -31606 -29598 -18407 -18403 -14449 7248 14138
5608 14138 33424 50360 43658 19424 25759 25188 30002 8792 -18987 -32335 -43424 -45496 -54889
5595 -54889 -64596 -53520 -60441 -37620 -23973 -37076 -42331 -33540 -27227 -29026 -40849 -35344 -14581
5582 -14581 1977 5650 -15398 -25124 -7973 -18712 -58345 -70501 -64350 -42214 -23893 -10499
5570 -10499 -34955 -38163 -27388 -22490 10565 27638 16508 11990 -13169 -50991 -53990 -36913 -44820
5557 -44820 -41857 -41785 -29110 -27121 -19307 8832 15822 -32011 -49244 -43099 -44121 -47678 -68211 -39274
5543 -39274 -2999 8401 8621 9455 2079 16025 8595 -4116 25664 14590 7983 5536 2595 -3972
5529 -3972 -20153 -39400 -49229 -32270 -62431 -54182 -31243 -27767 -32474 -7659 9265 -25741 -42900
5516 -42900 -27384 -21381 -46907 -77086 -81326 -65125 -30431 -12251 -9153 -47509 -49711 -19037 -16255
5503 -16255 -11921 3146 5863 -10003 -31890 -37077 -19742 -18357 -10615 8142 17919 12513 -18820
5490 -18820 -32061 -11466 7261 13461 -7557 -18723 -7276 -36793 -41796 -23284 -21642 -23635 -6199
5477 -6199 -25699 -7684 5798 -27745 -32199 -41428 -42864 -22321 -7007 13508 1361 -17139 -16481
5464 -16481 -10603 14612 25308 6643 -18765 -19515 -7585 752 2984 -5218 14745 26490 10941
5451 10941 6435 9100 -14365 -9647 30759 30225 -11877 -29380 -15431 -31747 -10186 8695 305
5438 305 1131 5166 -17593 -2402 24339 14960 230 23198 29509 21143 13411 10279 1577 -2648
5424 -2648 5072 -7199 -8661 1566 18228 10696 12470 1577 -19907 -61819 -80657 -78301 -52911
5411 -52911 -40811 -43712 -14563 -14427 3414 -2219 -20111 -28949 -46105 -59502 -57543 -33846 -2449
5398 -2449 7037 9336 6499 14404 10409 -5713 -2675 10643 8249 4765 -12002 -8200 -9353 -2051
5384 -2051 12117 8313 3454 5009 10436 12150 13240 8664 -10434 13869 37812 64792 51100
5371 51100 40943 19884 11124 22148 20488 431 -26012 -53077 -50012 -25092 -4586 19193
5359 19193 11909 9276 3038 -20329 -50564 -52707 -35468 -26972 -36720 -52890 -54794 -41168 -31595
5346 -31595 -36223 -40308 -32397 -26552 -12114 -2386 -18342 -18035 9779 -2797 21659 33476 9557
5333 9557 -12778 -8424 -8030 2119 52844 58527 43261 9005 -21310 -28993 -10265 5546 -11772
5320 -11772 -38826 -32073 -27842 -6642 -17065 -50839 -46051 -33799 -25976 -54483 -61770 -30254 -12410
5307 -12410 -2149 20587 59692 43863 12905 12174 -11254 -46073 -54433 -51128 -19324 -20387 -14102
5294 -14102 -9463 -29672 -39002 -22408 -11071 6056 -7695 -22227 -29305 -26071 -32542 -22145 -6547
5281 -6547 -19028 -26908 -985 37425 15388 -15729 -13778 -17839 -14812 -3829 10726 -951 -27752
5268 -27752 -43680 -50815 -52442 -37162 -1956 -11677 -38253 -29784 -12631 -13989 -4667 1353 -21857
5255 -21857 -35987 -24162 -22703 -20805 -33095 -13054 -18242 -6909 -6110 2400 -1639 -36792 -23959
5242 -23959 -4541 19041 23583 675 -23439 -13564 8625 990 -4013 -31440 -48959 -46076 16603
5229 16603 53079 51376 3137 -41020 -33598 -4704 11757 27580 33769 -8572 -44997 -44080 -20786
5216 -20786 -18935 -3947 -8232 -12974 -22050 -28512 -17130 -26049 -23594 7014 21118 20868 17052 -8707
5202 -8707 2659 9419 37369 34251 34033 10016 -16435 987 7355 -17376 -48771 -41632 -24789
5189 -24789 -19816 -20386 2306 23378 9109 -8296 -16538 -18084 -13124 -7085 -5018 21222 31083 18394
5175 18394 -6243 -7993 -36380 -35080 -35265 -50119 -26353 9983 1535 -35271 -54608 -47725 -12621
5162 -12621 -392 -23141 -28371 11688 14012 -18697 -14767 18561 21944 29828 15247 -8901 -984
5149 -984 45075 45880 31055 3964 586 -30289 -22172 -4617 12927 39204 38118 -16478 -30153
5136 -30153 -27544 -53332 -38997 -24886 -19232 -21597 -12112 -30791 -29513 -9875 1744 -12267 -18111
5123 -18111 -7626 -6062 -23736 -34958 -18013 8507 222 -5561 -13319 -11312 -27706 -30762 -17577
5110 -17577 -16221 -13571 -28791 -55670 -54159 -30990 -1446 -22566 -7935 -23028 -47924 -57787 -66104
5097 -66104 -54610 -30046 -31915 -15406 -39078 -71007 -59163 -53477 -63016 -86274 -70185 -57747
5085 -57747 -49834 -59316 -66037 -45405 -23524 -41127 -40208 -54639 -62837 -31817 -12805 -23101 -18415
5072 -18415 -1162 25439 36666 47170 33431 21616 17707 -20285 -38372 -16463 6254 22429
5060 22429 5221 3452 2765 52 11102 2633 -6337 7042 18005 124 5960 30512 22871
5047 22871 19880 29941 35580 32235 25317 12180 -15768 -31992 -46273 -41354 -25909 -22312 -17340
5034 -17340 -7733 -3318 6540 6905 14482 1723 3819 13103 31776 44475 54206 33621 12053 -9892
5020 -9892 -7833 16895 15588 29702 44795 48062 5364 12369 11855 4310 -6975 -15003 6597 13599
5006 13599 12900 21506 32735 21769 18230 3540 -1448 -389 -70 2539 14734 13053 1583 -15931
4992 -15931 8868 -5740 -15541 919 5874 -7617 -35660 -61686 -68054 -45389 -28380 -12466
4980 -12466 -14785 -36165 -52419 -47752 -827 -10017 -26384 -16802 5485 4160 624 3538 6771
4967 6771 23241 38776 3701 -23866 -25408 -17311 -19634 -27037 -17184 -14471 19740 39983 53551
4954 53551 50238 33810 35288 40737 33288 9459 31558 30365 28734 37499 30802 20698 18509 14850
4940 14850 -2627 -29215 -24222 -8854 -23245 -25002 -5481 -26900 -56499 -21543 -37134 -40365
4928 -40365 -33945 -21041 -15845 1404 -12157 -11136 -1357 -6868 -5037 -22562 -5110 -7927 -19307
4915 -19307 -39305 -33593 -35741 -20236 -28378 -31331 -24057 -20327 5175 6546 -11557 -31859 -21495
4902 -21495 -17025 -13644 -18373 -33646 -19085 444 12419 23277 34128 24508 -7263 -11290 -15982
4889 -15982 -18884 -28430 -40427 -6191 8441 20414 9888 -16683 -32477 -4617 13004 24377
4877 24377 17926 -19157 -18524 32580 45389 1824 -18094 -27504 -24511 -3546 -13037 -8092 1659
4864 1659 -3083 -14357 -13775 -23706 -37451 -40219 -6908 15723 12264 10721 -1029 -37648 -32282 -16480
4850 -16480 -14973 -20425 -18662 -33902 -17227 -417 -25703 -14747 -13500 -5981 13122 -9929 -22140
4837 -22140 -39843 -32753 -27551 -14580 -2650 6285 -4845 -7909 -36591 -16066 5477 -14724 -21607
4824 -21607 -12545 -17391 -2102 3670 5036 -9616 -24975 -21497 -33901 -30366 -25292 -38868 -50869
4811 -50869 -40520 -29040 -26029 -36379 -33255 2148 3100 -8055 -12317 -22861 -13205 -4914 -14797
4798 -14797 1056 8296 -24327 -43969 -21073 -2691 17350 21385 5635 -18020 -19264 -2623
4786 -2623 -15311 -43969 -41934 1793 15009 6551 1536 15477 14107 1822 5921 -14997 -49379
4773 -49379 -66158 -55138 -34358 -18356 -3989 4413 18481 26023 20267 4277 -20092 -23313 -35825
4760 -35825 -14174 -2704 -29153 -25772 -759 10290 13907 37208 22395 -13 -20925 -17731
4748 -17731 -15107 13070 17260 -674 -33782 -76192 -52426 -23707 -12459 11322 7801 13852 -4295
4735 -4295 5444 13212 -13550 -21425 -25025 -12682 -27649 -23841 -1118 -9701 -47307 -57203 -46674
4722 -46674 -18839 -7198 1546 -4883 -5835 -18920 -15277 4523 1674 -4189 -3490 2949 33529 37398
4708 37398 34326 31827 46506 31062 14741 15129 7390 6002 769 -41215 -72394 -60661 -37577
4695 -37577 -32709 -24820 -8203 27041 43946 70987 46305 5611 2640 3934 27692 14594 -11783
4682 -11783 -19244 -23701 -32794 7348 38786 46885 27823 3169 -8553 -17502 -25386 -32685 -12372
4669 -12372 -16983 -39517 -35862 -10543 11958 10933 -7663 -35880 -44723 -36449 -28681 -19000 19445
4656 19445 26028 -5410 -32259 -29643 -11639 9816 16340 14771 17490 -20658 -49049 -31281 -5890
4643 -5890 766 20048 24918 -1144 -945 -2131 10623 -3957 -12549 -13883 -14020 -22660 -14200 -50508
4629 -50508 -51676 -56182 -49930 -44566 -25226 -25423 -26582 8213 25913 26177 13907 -1341 39306 35666
4615 35666 41597 24425 3175 20124 37360 22306 30644 15207 1436 -30579 -33569 -3460
4603 -3460 522 -12321 -4942 13887 -14845 -29992 -17388 -10035 -590 -8185 -3703 5427 7372 12194
4589 12194 14522 23433 33369 38173 30497 5874 6810 27322 48915 59483 27703 -31340 -25231
4576 -25231 -7658 -1495 -27576 -40583 -12218 -903 5601 5692 -9438 136 18264 11262 41621
4563 41621 28107 21623 34961 -8801 -34967 -22723 -38111 -17325 -6711 -10408 1302 -26366
4551 -26366 -38504 -20063 -4953 -4820 6968 7380 11607 2331 -10588 -4528 -21634 -17903 -4903
4538 -4903 -1812 10738 9744 -7935 -23205 -23839 -18925 -3611 19306 24267 20450 25363 26888 37904
4524 37904 20482 -18138 -55269 -47756 -46665 -33501 -21540 7994 -962 -10463 -13791 -26168 -25706
4511 -25706 -33834 -27758 6636 35105 38209 9834 -21143 -10864 5551 4264 -10285 -1370 8271
4498 8271 -11606 -43585 -72993 -94173 -64177 -55536 -59426 -50807 -21831 18110 13287 -40069 -39572
4485 -39572 -37729 -24110 -8109 -16007 -29577 -5900 6558 13080 -21201 -39075 1428 9271 -8055
4472 -8055 1472 18850 3711 -3512 -6800 -14829 15308 40770 43139 27640 2114 -25822 -33129
4459 -33129 -7287 15842 16890 17130 20171 11788 -12438 -20262 -4045 3959 -7670 -8939 16136
4446 16136 14293 -19630 -4264 19912 17548 -5218 -2720 14693 -4026 -10807 -24465 -26334 -11777
4433 -11777 -12039 -11263 -10126 6537 -12712 -38129 -32681 -6994 2990 -9847 7218 16060 31970
4420 31970 21879 12413 23652 6128 22320 17847 -7919 -10276 -9409 -42743 -23500 -36354 -39725
4407 -39725 -15330 7297 23670 36044 46305 25150 -7591 -21666 -8403 -5106 1501 -4160
4395 -4160 -29469 -27275 -17185 -23632 -35356 -19795 7693 12277 6876 -396 -4894 -1288 8925
4382 8925 21972 12646 -29130 -25966 -10393 -956 -12804 -19137 -7887 11127 -1603 -6079 -11609
4369 -11609 -17276 -10087 -34190 -48353 -49135 -37910 -37716 -27800 -27809 -46554 -61171 -67942 -27553 -6368
4355 -6368 -36357 -27435 6869 21857 7064 -14106 11244 -2114 -25214 -12966 3574 13051
4343 13051 6610 3192 10709 17425 4566 27041 30662 18758 662 -6911 -37510 -67832 -32165
4330 -32165 21320 32385 24006 28008 38423 24723 6017 -6588 -1363 2038 20216 3979 10073
4317 10073 22298 -7942 -32372 -51404 -33073 -18231 -6050 15093 23204 14519 -4986 -18005
4305 -18005 -31368 -42679 -38159 -16093 -13290 -26988 -16064 -21035 -9069 -11225 -15785 21647 31891
4292 31891 54880 46354 33785 27601 10072 -4759 -16555 -15160 8920 23730 31550 15129 5101
4279 5101 31398 18729 19141 38025 39408 29523 14538 -805 13819 11263 -3108 -19990 -9374
4266 -9374 19574 46591 13032 -10852 -22892 10099 29539 14591 -8718 -15413 6399 8443
4254 8443 -369 -2844 7311 -11331 -36677 -37747 -3436 39186 24481 12219 -1851 -12950 24649
4241 24649 36747 35775 5830 -30281 -31367 -40388 -21778 -131 -405 24686 26564 32161 21802
4228 21802 -30330 -55833 -22841 22489 23770 1382 -12958 -8063 6104 5474 27267 33552 31048
4215 31048 31985 18277 -10494 -41774 -53875 -49740 -34212 -7504 1546 -11961 -1842 -20590 -44627
4202 -44627 -34655 -17237 3106 -11801 -15640 5190 9580 10850 27149 32016 -13339 -22149 -31385
4189 -31385 -31057 -27742 -30090 -16858 9339 5096 -24789 -26360 -15187 20348 19586 30149 28085 7722
4175 7722 -26100 -29335 -5377 6444 11684 21520 26162 13578 11671 30791 29028 10548 2738
4162 2738 -241 19933 1047 -24541 -21633 -1665 -11987 -32033 -13960 23186 39617 23969
4150 23969 10956 -5573 -6203 -14177 -3821 17474 15744 1380 23838 18106 5036 -3341 -2450
4137 -2450 4252 -2798 -6954 -1756 -15667 -10190 30011 29889 22523 9839 1236 -2983 -20775 9795
4123 9795 18829 -1136 -42080 -26412 198 5507 -12130 -36275 -28732 -24938 -32288 -27462 -24091
4110 -24091 -30300 -36989 -22425 -20539 -12753 -11394 -3523 -5086 12191 25941 12806 7759 2659 10857
4096 10857 8765 14269 5234 -8113 -18391 17814 24127 14150 16913 -1167 -21619 -37749 -42580
4083 -42580 -27156 -40451 -32304 -32162 -7842 -7306 -25376 -22790 8981 36355 35651 25908 5406 10967
4069 10967 -58 -22297 -17279 -638 -14539 118 47267 54147 43779 30688 22962 4607
4057 4607 42 -13629 -16395 -28916 -48953 -54874 -41098 -29591 -2504 22688 32443 9895 11942
4044 11942 -11613 -23852 -18833 -42416 -29113 -4106 -2929 -3587 9177 6520 54481 83157 69740
4031 69740 32884 -12094 -39624 -19170 -23075 -17194 -21573 -10052 -15428 -7813 24366 50942 28789
4018 28789 -5563 15773 19321 16399 -6364 10115 30242 23581 27416 2632 -7533 8358 10265
4005 10265 -8826 -34613 -25819 -16770 3549 -1942 -15341 -37100 -29332 2790 11847 8852 8248
3992 8248 5244 -6964 -18234 -7087 -4736 -22284 -17629 -33831 -38605 -42113 -30293 3068 15678
3979 15678 10620 13007 7614 -15044 9179 32347 6761 -15902 -10837 7981 -26713 -55960 -27413
3966 -27413 -5279 -19948 -45549 -43917 -36799 -46071 -25308 -10778 1010 2441 13309 24631 10823
3953 10823 -3306 -7426 -7436 -20942 -26267 -35655 -27080 -19490 -21539 -37781 -46052 -38413 -39240 -46672 -15939
3938 -15939 -7958 -23794 -12059 -7047 12984 19828 10122 1136 -16687 -23049 -20889 -6697 -15607
3925 -15607 -13565 -27087 -50624 -37713 -23118 -3144 5862 15453 22688 7926 284 3556 -15213
3912 -15213 -38843 -15403 9356 1458 -8190 -2225 -8260 21466 32874 -1616 18451 22212 9687
3899 9687 -4673 -14905 -13412 -37703 -42730 -9578 -780 10264 14216 -14572 -23335 -11755 -10893
3886 -10893 -41924 -33770 -9689 -2970 9080 -7789 -11986 -14325 -19587 -61384 -89097 -65537 -29353
3873 -29353 -16891 -22713 -37243 -37583 -20720 10179 10918 -15744 -21209 -33912 -27702 -4899 -1779
3860 -1779 7547 -2433 -5848 2193 33889 33309 16240 -6978 -15403 -13735 -24327 -62593 -91298 -78295
3846 -78295 -29789 -23795 -24748 -36471 -57523 -32195 -8085 -6969 -30777 -30619 -32906 -29719 -17953
3833 -17953 -25735 -22145 -11604 -25231 -27940 -49393 -67628 -76316 -62549 -39984 -23628 -22527 -7223
3820 -7223 29151 46348 51537 32021 -3961 5665 28459 49056 14050 -26093 -39914 -41996 -43169
3807 -43169 -24986 -10647 -122 9858 6121 -6936 -33014 -42031 -37083 -18791 -34732 -29493 -679
3794 -679 -11069 -10982 -18137 -10007 -13234 -9988 7137 4236 -9324 -19819 -23275 -30664 -19060 -5810
3780 -5810 -402 11354 1258 20276 32210 51899 41700 6126 -6667 -11916 -16419 -15506 899
3767 899 12171 2647 14313 15840 -17695 -27645 -5179 30966 28191 15472 15721 24360 18059 -493
3753 -493 -5296 -1339 -5561 -12294 -8130 -7495 -10870 -14426 13580 40112 40738 16061 25571 27171 17997
3738 17997 -18376 -31705 1440 14194 16088 27690 32816 24430 38776 37083 -6627 -2570 4193
3725 4193 15007 22887 28423 6313 -8712 -5033 -23405 -7209 9187 -858 28191 39369 42715
3712 42715 30181 21502 17119 39542 37457 3768 -15894 -22635 -17556 7376 -2008 1925 22852
3699 22852 18394 19048 9290 -18947 -9526 10910 4520 4939 -4 -5048 20146 13500 14148 -6692
3685 -6692 -9976 -7165 7074 22908 -14228 -15577 1321 30501 30474 23364 32751 11540 -9248 6574
3671 6574 22229 24333 22010 10748 17750 -280 -25026 -33353 -14527 14482 37700 17785 28112
3658 28112 15787 22908 50026 12569 -22271 -5000 13117 18327 17671 24413 44344 39759 51832
3645 51832 49404 -1368 4070 5287 1064 -7431 -1989 2041 25505 11284 14247 18216 33035 21503
3631 21503 -1149 -7163 -6171 13110 28699 31737 31928 11346 -4781 17343 48570 70709 42606
3618 42606 12673 11632 -11559 -14135 1539 11501 5047 5344 10104 13923 8491 -16091 -31079 -41361
3604 -41361 -14029 -10722 9957 19102 5380 -620 -4221 5574 517 -28986 -24575 -34445 -31197 -14432
3590 -14432 -2486 24125 16107 -1884 -18119 -13315 -3783 17030 34447 23298 -15985 -4493
3578 -4493 16294 -9109 -16342 -25187 -35425 -45960 -54754 -54938 -57747 -78215 -57660 -37213 -26715
3565 -26715 2687 9400 -8157 -20172 -46590 -34732 -35758 -58204 -30723 -17165 -39502 -45235
3553 -45235 -23846 -2588 17609 3804 -2758 -4505 -5503 1357 -12446 2532 3088 -38388 -46660
3540 -46660 -81827 -71131 -46373 -33337 -29523 -27087 -14873 29927 33405 35768 42402 47674 33233
3527 33233 32624 24626 21646 13444 10642 32703 31925 11411 7573 -3521 -42404 -49531 -38677 -14768
3513 -14768 -13930 -37640 -28125 -10719 319 13206 10337 11533 -4105 11042 2505 -14058 -6791
3500 -6791 -39020 -80284 -50418 -35451 -23136 -7151 -7127 -23526 -26775 -32473 -26330 8154 -7904
3487 -7904 -20451 -22235 -2640 13171 6977 -7543 -7832 15036 4726 13786 32513 34246 9098
3474 9098 22780 51202 51052 25556 484 6959 21765 11699 -9876 -19931 -30641 -30370 -31018
3461 -31018 -23872 16810 11819 2556 3844 9941 7515 -17834 -25546 -31015 -32625 -9804 14500 10450
3447 10450 -12927 -23778 -9369 -6994 -12482 -14547 -9614 2425 2475 7865 18503 13256 2716 27045
3433 27045 44426 37664 16319 -8175 -5667 -16917 -5729 3625 7698 2548 5158 8005 23832
3420 23832 15958 11440 27249 47744 39498 17576 32866 31952 40967 9530 -33793 -15605 17633
3407 17633 18444 9877 -3062 -20786 -39727 -36722 -36478 -27042 -18213 -29463 -24849 -30951 -50634 -44808
3393 -44808 -50283 -11159 3868 -17277 -26555 -56842 -44485 -20199 -9777 -24741 -50800 -51342 -25009
3380 -25009 -9604 1948 -10644 -8672 -8723 -19060 -4831 -6358 -37656 -36173 -42209 -16359 7366
3367 7366 17534 -2524 10029 11088 -352 9864 24729 28867 3797 4048 -5483 -31017 -45476
3354 -45476 -33952 -24622 -19985 -27852 -4347 -545 -8292 -24722 -19131 -12392 -45143 -57441 -45919
3341 -45919 -34698 -27853 -18150 -4790 -10944 -7547 -5980 -16822 7419 23641 8310 11162 -1975
3328 -1975 8775 1780 -3377 -26856 -29149 -23248 -2540 25124 30768 44580 15936 -3581 -8313
3315 -8313 2573 6125 7204 2626 15077 40059 31135 24873 5491 -8896 -22957 -28021 -36370
3302 -36370 -22875 -509 24446 40449 48761 11740 -29131 -28076 -39759 -34669 -1220 -20694
3290 -20694 -6452 13602 8234 -16628 -17984 5212 13907 -2739 -1872 -13113 -24082 -9755 8498
3277 8498 22720 21003 -3664 -13027 -12073 -171 27404 25024 37094 35521 40704 39276 24660 11080
3263 11080 83 15714 32682 38937 34657 40082 41455 1404 21175 33760 46863 12616 -21160
3250 -21160 -23724 -9812 5793 1647 -23195 -20457 -13326 -28004 -41403 -25426 -22260 -15082 -11482
3237 -11482 1635 14889 -6165 -19272 -96 11946 5638 -1193 18012 16696 -4013 -8553 -40005
3224 -40005 -45554 -42669 1824 24341 49135 33990 29424 14012 -7630 -6937 4912 -16335 -18264
3211 -18264 25337 45481 29353 7377 11512 12833 12800 35070 46721 32178 5422 19965 31569
3198 31569 3582 -31855 -35791 -27702 -9341 7412 12935 -16728 -36612 -24638 -24932 -4750 -5236
3185 -5236 -925 -12877 -34390 -18324 -19716 -22055 8213 7047 -12516 21540 23798 15900 19456
3172 19456 9460 24179 1229 9229 57164 37409 6912 28372 38668 17113 24281 22108 -2479
3159 -2479 -21264 -31072 -8566 5778 12618 19070 20503 37203 41403 34308 29518 6512 -7066
3146 -7066 -1434 18036 29933 22546 2590 -4131 1622 -13134 -18703 -22781 -12225 5365 16437
3133 16437 19614 15312 12676 42194 1215 -35660 -22412 -7292 -9785 -1845 14541 27850 -1644
3120 -1644 -44508 -43051 -63564 -48246 -25340 -20064 -42759 -31553 13963 41708 13004 -16656
3108 -16656 -36877 -42273 -20685 12171 30211 14577 9953 13196 8761 -962 -1182 -37066 1391
3095 1391 56914 69287 44997 31855 29141 42333 55162 22132 27032 33362 34691 49639 43142
3082 43142 38511 37732 22739 13964 33754 50107 49343 31000 9889 -17749 -25600 -7555 -21687
3069 -21687 -41821 -35789 -20631 -18656 -5216 -4641 12880 21169 25701 36690 20254 999 937 -8480
3055 -8480 9766 39395 33833 17232 3736 -8615 -17205 -25470 -36858 551 22947 9225 3961
3042 3961 -23253 -40454 -31196 -4638 8374 -9470 -13951 16028 48426 42012 11726 -20901 -27372
3029 -27372 -15028 1526 -5865 -27467 -26077 -20836 -34966 -52467 -65401 -57426 -36499 -38720 -24259
3016 -24259 2409 2343 -22159 -56041 -45845 -16120 -16032 1503 7113 6670 16807 10205 -4432 -22653
3002 -22653 -52051 -18005 -6030 -13453 -36802 -22867 -20688 -14539 -9481 -13296 -28012 -29956 -6970
2989 -6970 33460 34480 17130 19788 14639 11477 17273 16406 2197 636 11215 16703 -545 17733
2975 17733 55606 51830 37498 4563 -23256 -26589 3644 37669 65606 46141 48416 25328
2963 25328 8548 6240 -25754 -62401 -67800 -25503 -9296 5695 -6644 -31191 -16994 -1396
2951 -1396 -1657 6411 -825 -2894 3933 702 -22946 -31739 -25723 -28170 -33213 -18695 -20202 5989
2937 5989 -687 -23852 -25321 -18215 -15946 -3021 -2906 -9113 -28752 -52428 -65219 -54910 -31209
2924 -31209 18679 16719 5677 19583 4120 -18161 -20363 -7296 2341 -11235 3962 -6155
2912 -6155 -11861 -22350 -40458 -25472 -29466 -27416 -13173 11601 21210 -16248 -35841 2664 20789
2899 20789 10441 10818 3300 9474 51745 72204 57450 34666 31160 28481 44738 15992 6794
2886 6794 -7316 18953 45786 32229 18894 23039 21131 30211 6116 1250 13064 50752 47601
2873 47601 33176 48039 47305 18738 -6210 17058 33535 15192 11078 10421 12149 34610 29419
2860 29419 -6658 -35902 -13175 8815 24704 10677 12080 -7500 5523 28219 31327 31902 59958
2847 59958 74884 53367 59569 54528 23513 33642 43416 27759 47118 43702 13481 16281 30807
2834 30807 24688 56647 68216 55118 56914 53053 58866 48901 26796 8798 28044 22758 32424
2821 32424 29166 22718 17073 30639 47989 37323 9129 17596 29367 30523 27826 29800 10035
2808 10035 13397 26189 39656 14941 -39178 -63014 -34987 13230 52880 21919 19205 42888
2796 42888 40714 41043 39182 27727 34597 22874 10154 1528 -22159 -21786 7966 18188 24958 29419
2782 29419 24922 9821 -5709 -832 -5969 -16228 -10139 -22727 -18515 -27125 -28363 4053 14639
2769 14639 8948 -27168 -27708 -20714 -19036 1166 -159 -6516 -2940 -11666 24345 29113 7955 -11807
2755 -11807 -6848 5727 -25184 -31740 -11779 9377 20823 35578 39190 35260 35113 22577 15019
2742 15019 -16202 -24124 -30214 -38373 -26619 -9126 -7474 -9653 15797 45461 35230 17190 33344
2729 33344 30127 13042 34154 38615 31869 33033 23186 5901 27263 34990 29801 13211 -10330
2716 -10330 6453 10009 -9486 -36618 -21907 -22102 -35687 -33340 -12987 2560 16976 8176 -4677
2703 -4677 -10531 15253 28098 34287 -658 -32734 -13362 -30496 -17743 -11486 -25714 -30187 -10178
2690 -10178 -7862 -4414 -9059 -13276 -18981 7478 13350 -2064 6271 8971 23411 38680 44386 76887
2676 76887 54880 14549 9702 8205 33279 26215 -13292 -22243 2505 13960 8570 -1588 -8184
2663 -8184 -7447 -26873 -10252 569 -21412 5582 31365 36197 55912 57635 24774 13305 24464
2650 24464 22676 10021 12860 15562 9117 1693 -2055 13544 41746 68142 46420 28708 25644
2637 25644 -21074 -3251 16255 -809 15779 12154 11913 5896 10355 2399 -3156 9001 6725
2624 6725 14953 8010 -26930 -26766 -28040 -47266 -67314 -50715 -16848 -1796 -12609 -13897 -29455
2611 -29455 -12321 -22545 -24536 910 -8958 7561 -171 -26336 -10654 1044 -5635 4545 23503
2598 23503 9019 257 4059 20377 13692 -13860 -21216 23988 42919 25794 26326 57934 41276
2585 41276 41359 15282 4641 6639 2381 -9598 207 4634 11822 -1770 -25580 -42578 -8636
2572 -8636 -12677 -43986 -48112 -44064 -21942 -15405 -10668 -5613 15528 47447 46231 30364 22069 -14662
2558 -14662 -9811 -9598 -5911 -3699 -3588 -15390 -17752 5179 6745 325 -15492 -37475 -37717 -26149
2544 -26149 -20812 -35357 -22676 -11023 774 -2748 1534 8324 9933 2313 2638 6270 19944 12002
2530 12002 13168 -479 -1057 -8293 -18439 -20069 -25079 -35785 -33693 -52304 -44562 -25012 -12994
2517 -12994 -9217 -27362 -43524 -66745 -32601 -7299 -15721 -54839 -36722 -9421 3924 -10757
2505 -10757 -11177 -14518 -25063 -69993 -76383 -50033 -72248 -79014 -58419 -30337 -5744 19559 26927
2492 26927 3409 -4963 10651 8166 3834 -8011 -1138 -8068 -14581 -42809 -28053 -10694 697
2479 697 -9560 -21947 -21793 -54315 -56629 -33351 -15495 -32269 -28571 -9833 -953 -222 11344 26127
2465 26127 8585 16085 3995 4149 -3411 -1005 6570 -8451 -20948 -34446 -18942 33189 61247
2452 61247 43019 31282 5440 -306 -16686 -29753 -22519 -28554 10087 20281 15419 10695 17760
2439 17760 6419 893 -3105 6800 -23481 -52073 -20237 9447 6255 -4040 -8300 -1613 28425
2426 28425 57693 37994 17545 130 -24506 -26462 4309 -4858 -10545 7655 15009 26828 32890
2413 32890 32258 39296 31746 11375 10835 27113 21980 -6489 -9604 23905 50551 60211 27877 28626
2399 28626 43942 39667 4284 -18771 -13230 -12752 -11981 -10764 -12596 1548 -17059 -38624 -24332
2386 -24332 -18698 -28215 -17418 -19682 -530 -3370 2747 -5382 -4085 -11361 -19966 -30125 4136 13199
2372 13199 31737 9243 -12197 -32115 -45970 -31487 -31200 -29621 -13818 27295 61820 23518
2360 23518 10032 -7555 -11852 -28884 -56995 -38459 -12045 8899 -3740 -38054 -46145 -37516
2348 -37516 -18617 -6682 27155 50246 50224 29972 42365 57651 45672 25984 32411 48016 34081
2335 34081 21305 19730 31587 12511 -32847 -38346 -21249 -24049 -5610 18738 9121 1273 -2133
2322 -2133 -4686 3592 12001 -7438 -10878 3797 5706 -3990 -4700 -7198 25149 44491 43699 35416
2308 35416 41404 172 -27032 -28392 -34480 -14274 12982 16342 13292 6322 12554 10306 3652 3237
2294 3237 -1911 -32412 -43942 -12857 -9343 -11380 -24135 -25986 6811 31148 36434 41944 69992
2281 69992 64668 54576 7070 1122 23248 17541 13622 25571 30201 49099 46153 20210 21928
2268 21928 16960 -4876 -16856 -23191 -13904 313 16813 19429 -942 -12432 2291 9881 -5738
2255 -5738 -14906 -9745 8416 13752 -16384 -15860 -19616 -309 28986 41981 17425 16749 -2805 -11385
2241 -11385 -28110 -11737 -7093 -18445 -26016 -27966 -27367 -32394 -34230 -52017 -53803 -36457 -30658 -17895
2227 -17895 -4487 -1112 13718 1908 3410 -26283 -45101 -27396 -24688 -14878 -19435 -22464 -20049
2214 -20049 -30931 -32839 -10245 -10417 -21102 -26215 -29219 -14773 -7884 -24964 -20375 -27321 -25436 -13626
2200 -13626 -18169 -6014 6515 11021 14060 32120 32656 42030 53246 38153 4357 -5086 -4871 2906
2186 2906 14483 8904 23696 25546 22578 -3379 -30922 -26796 -27483 -11287 -9332 -15793 -37035 -43087
2172 -43087 -13052 8546 32836 31753 35687 44080 28461 22536 45303 38934 23473 17854 -6641
2159 -6641 -54424 -22156 5771 -19027 -14800 -1718 34218 25578 24532 23933 11081 1281 3021
2146 3021 11132 2970 -25574 -8026 -23464 -18588 -5455 -3556 4696 25494 32492 22659 27068 6595
2132 6595 -6758 -16523 -757 16298 22179 32987 -7662 -65394 -61605 -3885 369 -16879 -3244
2119 -3244 23383 6408 -13287 -22289 -27069 -12399 13523 23276 25988 37047 37271 -299 -1210 -16055
2105 -16055 -38613 -38425 -30479 -13313 22259 25764 17619 23802 30224 50511 46270 40253 20443 32436
2091 32436 35990 33665 54599 39304 14434 3050 -21984 -18624 -4586 -20237 -3934 -2844 1870
2078 1870 3208 14721 22960 21743 -1083 -25459 -20323 -33386 -36233 -24685 -17171 -21289 5671
2065 5671 39764 42773 46022 40086 17306 -10924 -12117 22528 15977 16356 6755 -14539 -4150 -4081
2051 -4081 -24167 -4087 7497 5669 8659 -3373 -26123 -44582 -47209 -23884 -15064 -12704 -9115
2038 -9115 -11826 3174 10148 -5369 -2555 9974 3101 5092 -18892 -18246 -4045 11340 22294
2025 22294 9845 -1001 -26941 -32890 -26110 -9653 -2443 6992 -2126 -12594 -4820 5931 26490
2012 26490 21271 5675 -62 3277 5494 -6111 -18572 -1587 20048 12840 -22890 -34553 -16892
1999 -16892 -27365 -33055 -28893 -7896 20149 34483 29379 15120 11135 19456 17405 4936 -11089
1986 -11089 -27297 -26729 -3500 -15220 -14538 -6822 -30095 -35616 -30747 -12908 -13126 -35250 -41710 -31140
1972 -31140 -10439 8896 -9585 -22799 6447 6510 2901 -3476 -11724 -21714 -17041 -26848 -28983 -44093
1958 -44093 -32745 -25843 -19342 -1287 34962 50977 38560 47869 48686 45377 56151 25599 342
1945 342 11460 -17237 -15664 -13375 11145 33645 20036 -10411 1090 18965 2829 2844 15255
1932 15255 2297 -9663 4010 4725 -2149 -9970 -20446 -29137 -5601 11860 891 2743 22627
1919 22627 28045 23817 34472 28950 34660 50071 51049 28896 12879 16310 21065 8895 -10503
1906 -10503 22761 61535 48436 7068 -2224 19403 11864 -1954 -15705 -15892 -29827 -37120 -35495
1893 -35495 -192 30108 19320 3431 -2700 -2174 -8953 -7019 8206 -134 5534 22868 3000
1880 3000 -25054 -1901 18029 12502 -12741 -10886 8803 32338 40381 38035 9903 9644 29929
1867 29929 36603 42323 23207 5171 -24665 -9222 9721 22735 29520 25616 39398 26753 7608
1854 7608 22370 12818 -3833 -23936 -18265 2756 23468 53402 41632 13406 -1890 13399
1842 13399 23348 39148 34634 16088 26549 44010 39292 1863 -23071 -10896 -8989 -11929 -20686
1829 -20686 -18788 5613 2446 10492 17671 17615 25478 -1307 -5004 -7766 -5857 -4479 -1064 457 -4065
1814 -4065 5902 1389 -7855 9399 22131 15227 -6749 10110 31721 50950 21454 -11051 -13633
1801 -13633 13023 27347 7837 19092 34862 48742 26572 -12882 -29429 -47619 -18800 4652
1789 4652 -20089 -12309 10122 28399 13547 6989 13730 -1385 -7664 1560 -8853 17874 30601
1776 30601 3200 -12611 -4101 4329 29414 41337 34242 10995 -24708 2970 28975 53406
1764 53406 78352 56791 19872 22875 27482 30092 20552 10445 36276 40585 26125 9265 26759
1751 26759 36727 24782 1289 43092 67177 70601 41258 18321 -6415 -7507 9682 4479 18913
1738 18913 33695 28044 14228 -5704 -32718 -34453 -33606 2425 39091 32316 22840 36750 32771
1725 32771 19290 38667 19129 1416 -2208 15764 11556 -14815 -10378 -13689 10055 17202 31073
1712 31073 -2732 -26743 -12278 -5906 -11969 -9364 -6384 -10508 -28798 -16986 1003 12876 1609
1699 1609 8254 -5149 1958 37817 18798 12803 39385 20109 14257 25811 35925 7806 17223
1686 17223 25899 16012 35382 35016 10242 2396 25877 50919 42168 15306 3660 -13665 -18514
1673 -18514 -27196 -62147 -85283 -91649 -54885 -32518 -26353 -36997 -33475 7509 44012 47976 20840
1660 20840 -11369 -5036 25875 30570 19297 6887 16333 14192 -25057 -33223 3987 17773 17837
1647 17837 56117 30231 15832 9219 9363 -3770 -8890 -16365 -26254 -33571 -18640 -2739 7341
1634 7341 -1728 4454 13211 -1421 7365 14901 1856 4075 9307 26119 8857 -35776 -27182 -2800
1620 -2800 18044 -1337 -23847 -16295 -6057 -11091 -12862 -8671 15471 19990 8768 3192 -5078
1607 -5078 -6918 -11867 7571 413 -36380 -48337 -42472 -41445 -28141 -14933 -14586 1646 14829
1594 14829 4858 -14869 -18875 -8345 -4733 -8215 -8691 1292 -1172 33575 38224 52041 39383 27155
1580 27155 -1980 1534 30155 24382 22189 23076 -1716 -38344 -40739 -25723 -20548 -29947 -32085 -19957
1566 -19957 1442 12979 25252 33951 10391 -9583 -28483 -12680 17008 14811 1985 -28879
1554 -28879 -20565 586 8137 37295 51557 22004 19995 32002 19756 36166 25654 20486 28856
1541 28856 18614 7411 20203 36358 64671 72836 44626 5691 -9100 -9417 -12424 11447 6511
1528 6511 -12041 11345 20167 19250 10875 3929 1674 -2922 -34680 -25304 -15832 -13690 -7426 10062
1514 10062 31626 20994 -5561 4303 -9578 -22186 -10138 -17631 -16597 -20754 -24262 -12291 10459
1501 10459 20923 48879 63312 45122 33752 43532 33904 28495 22591 25851 9075 15312 14754
1488 14754 3734 -9076 14892 10604 -6740 841 -1554 4181 26539 37418 7171 2039 6909
1475 6909 -4737 -28714 -6693 44405 23438 -6627 2243 11973 -8331 -22411 -17239 -7243 -6558
1462 -6558 1647 -6311 -7401 -6486 9750 418 9264 24081 29732 8838 -7845 -8822 -21557 -23724
1448 -23724 -22224 -3714 7023 10415 11258 23351 24761 43526 31676 3019 -28312 -29328 -8459
1435 -8459 -33530 -14360 29333 43850 38717 60899 30890 5352 14306 46422 55969 41421 4805
1422 4805 -3231 -17954 -37345 -22627 -7831 2018 -1974 -16253 -19234 -18984 -8773 -11847 4600
1409 4600 -11243 -41461 -65836 -62626 -5239 9019 18192 22578 17669 33893 26350 7950 19640
1396 19640 14840 8644 22704 27013 6114 -8395 -21422 12482 23294 -4218 6486 17257
1384 17257 10368 6041 -15240 -17299 7072 14509 -7075 687 29126 22814 -2068 -20178 -11001
1371 -11001 689 -30678 -21004 2532 18728 -4028 11683 17817 32561 58870 25723 -8075
1359 -8075 -17807 11198 16713 11426 38131 68191 77189 65207 50994 47894 47413 48946 37366 24300
1345 24300 4097 -12436 5828 2611 -22315 -14930 -13055 -13031 -20883 -20668 -12606 -23570 -40777 -26531
1331 -26531 -1086 -5130 -3284 1262 -11822 -18309 -889 32984 50100 40636 17060 4661 -17330
1318 -17330 -8108 -20856 -24481 7074 14313 9045 18483 14227 2137 12630 38407 38020 4328
1305 4328 -15457 9509 -11674 -31143 -28970 -5972 16314 3735 -12252 -3975 21962 44169
1293 44169 52818 29899 20277 28015 25317 41844 30046 15194 19029 56271 64275 27140 -17923
1280 -17923 -18616 -3480 6966 17610 20213 20543 20326 35813 43235 33437 14392 10208 23941 -1777
1266 -1777 -17226 -22643 -14955 3443 -805 -4624 -1331 -4038 24260 16607 22587 18573 2458 -9196
1252 -9196 5566 3809 17088 12389 16419 33766 30509 30708 38411 51981 23154 14343 15174 37131
1238 37131 44955 29973 23641 28142 8440 -3925 586 18375 15986 -6712 -24421 4029 4028 13140
1224 13140 20155 4219 14544 -10112 -29645 -15411 2478 -7828 -23306 -21998 -5567 5378
1212 5378 12724 -7345 -45743 -22720 13518 16825 -19349 -21719 -23177 -34973 -27599 -21751 -29506
1199 -29506 -35257 -20489 -18821 -29504 -34829 4789 55985 55831 43898 44078 15158 -28827 -21714
1186 -21714 -16702 5722 35035 29687 8117 11026 8550 -6072 -3673 -19229 2255 26595 45623
1173 45623 22503 15567 30339 24717 11996 -4162 -14704 -38122 -19682 -6331 -10393 -35800
1161 -35800 -23244 -12021 -21765 -30021 -45956 -46506 -15869 2824 4868 18731 34800 35536 23741
1148 23741 12169 1384 19340 17331 -13231 -29723 -12025 -630 10607 -8644 -11800 24062
1136 24062 36440 36356 29656 17622 23386 27547 13120 -27573 -39865 -2890 -874 -6544 -12598 -22563
1122 -22563 -16032 -2835 -3627 22234 52685 25983 16431 -3813 -33422 -84527 -78853 -59913 -36725
1109 -36725 -30293 -28181 -15968 -26985 -45380 -32864 -21057 -16065 -1680 -13465 -21059 -23446 327
1096 327 2487 -2025 22663 40676 12942 13321 -2026 -30813 -31083 -1948 38618 14330 16714 11954
1082 11954 4876 10783 25694 22648 2998 -7072 5392 -4522 1466 7414 -20757 -17122 16298
1069 16298 34740 18147 6690 -5063 -24976 -35766 -23345 3557 7135 -16138 -33597 -28655
1057 -28655 -28952 -22302 -575 6101 35563 29657 1531 -11312 -11455 -24362 -43035 -37777 -1234
1044 -1234 22296 22767 20516 50105 73363 66342 20807 1767 4264 10993 -16443 -37430 -31483
1031 -31483 -4097 23799 12486 11670 4339 -22255 -33807 -24497 -9620 20417 36894 12987 -3863
1018 -3863 1154 -5674 -847 26908 23919 94 781 14377 28195 -2415 -13886 -30714 -38867
1005 -38867 -57452 -42406 -30630 -21419 -7507 6602 7033 -4939 9128 37889 28038 14181 -5241
992 -5241 2030 -2129 -10162 -28354 -19309 9559 257 -3539 -8506 7228 4441 -11128 6536 14863
978 14863 -9110 -38302 -39785 -12114 -3634 2262 -14352 535 -1933 -27733 -33606 -3442 8703
965 8703 1732 -6716 14457 21581 7472 -4194 1143 3522 -25462 -52334 -47413 -14598 17802
952 17802 -4397 -7646 1890 16662 21732 19386 12205 18988 10986 -9879 -13802 -26633 -33366 -9556
938 -9556 13921 25001 41915 46244 17058 3185 7370 18798 8581 -896 -973 7141 4748 8493
924 8493 29858 19178 -1409 -20975 -7807 -50 12351 26084 36478 34159 9707 -9037 -29857
911 -29857 -4566 -3637 3111 26497 21116 19005 14414 29594 37238 14157 -26475 -27294 -34330 -51175
897 -51175 -36241 -15120 -3954 -30467 -35990 -16271 -12523 -29991 -47050 -20376 -31610 -35503 -24066
884 -24066 -22295 -22743 -16245 -14460 -6914 12907 15375 4034 -6661 -31999 -24828 -1773 13076 -1086
870 -1086 1141 21214 8270 6240 8107 -20287 -17462 -336 7719 9629 3070 1043 462 -14197
856 -14197 -14714 -18089 -3948 13782 22344 446 -11764 -45948 -47832 -20528 2202 -5698 -19560
843 -19560 -22516 -37274 -26671 -11725 -14134 9797 -2288 -7448 9255 18123 36736 25029 9314
830 9314 12851 9854 -1302 -12771 -4473 18043 25914 23289 21063 -1137 -9052 -16426 6354 -544
816 -544 -3072 14288 8477 -4925 -13129 -3757 584 3199 -635 15544 46663 60889 41230 8832
802 8832 1802 -9804 -47949 -20174 15726 33652 39648 31568 8810 4034 32586 46969 14767
789 14767 3130 3104 -11438 -16810 -18994 -3633 4912 -1529 8893 -7997 -17602 -8678 -3071 3784
775 3784 12553 40512 45180 41643 79935 30180 -18866 -12175 26846 15363 2504 15610 40242
762 40242 43310 20041 28228 29317 -870 5575 -3236 -40314 -32308 -31413 6685 53652 81869 74558
748 74558 48023 15740 2669 -10405 -16266 -29505 -18969 10154 39511 39878 19638 12995 -6392
735 -6392 -2368 -3868 -4768 -3608 4127 8470 4484 -831 -4530 -8483 7117 -4674 -37929 -34765 -14054
720 -14054 -37947 -40104 -25400 -1886 5122 4109 19202 15519 -29010 -38244 -9058 16219 2331
707 2331 -28262 -21058 -22184 -17265 -8267 4618 12598 25147 2019 -8627 -10191 5815 49201
694 49201 47623 13954 3052 16669 21630 22148 24778 28881 12842 -2734 -13686 -18724 -4563
681 -4563 13356 16594 4369 -3955 11289 23914 40407 33245 32174 6241 -26534 -10182 -249
668 -249 -1782 8390 -1111 10025 1623 -50738 -55338 -8497 24657 41115 35160 15713 24356 28257
654 28257 30844 37312 28789 15196 14130 29527 25054 29437 28619 26838 38686 33393 11104 1187
640 1187 981 -35581 -52443 -50030 -20902 17612 24442 16635 18511 12358 24378 31969 12731 16947
626 16947 34227 21403 547 -6564 -31211 -19753 -2295 -1354 619 12326 7893 5140 807
613 807 -1233 2105 10907 5698 30767 24693 17702 19537 13141 16152 6189 -6506 -11057 8484 14030
598 14030 35655 19096 23608 32475 44572 37131 38274 5163 1184 11846 1256 -13345 24335
585 24335 10358 -15377 -14808 -14907 -6967 37318 10753 -14744 25740 30225 21848 1479 -16547 -20821
571 -20821 -28065 -43863 -39765 -41430 -42177 -41844 -36019 -45545 -50984 -31560 22438 14192 -9599 -1104
557 -1104 15452 32771 29783 18987 17783 9277 24992 3326 -12846 -7162 -13627 -3946 4711 10965
543 10965 6995 -14978 -4879 9588 -4037 -18815 1363 28568 37322 26681 23468 44280 38584
530 38584 33978 30347 15240 15584 42618 33121 21822 4660 5678 19423 16147 -1621 -22765
517 -22765 -17862 11259 18518 -16008 -35485 -41849 -53687 -42742 -16896 -15170 1370 984 -226
504 -226 19818 1841 -16962 -26111 -4707 -5539 -1683 31868 50878 11213 16956 2479 -6356 -13199
490 -13199 -7404 -1428 7527 40545 43869 38519 29146 34466 8487 -1303 -260 -18218 13865 26815
476 26815 42296 43892 41305 40324 32024 41589 60845 65306 36980 15907 6262 -7799 -13027 10542
462 10542 21690 22094 26589 17940 1915 -26780 -27379 -28246 -58156 -73370 -49284 -33062 -35499 -31388
448 -31388 -14239 -4971 -10758 -41493 -30488 6656 27070 34440 22098 -336 3052 -18193 -44546
435 -44546 -26685 -45462 -52735 -30179 -21853 11195 26336 24939 18345 13719 13423 692 -16537
422 -16537 -19077 7789 28813 18541 12021 27428 41237 38540 27388 10134 -9992 6366 14600
409 14600 37715 46753 30929 25167 15680 -5366 -7596 -30117 -10239 -37253 -53249 -32887 -29046
396 -29046 -11097 -22976 -42414 -37235 9097 50239 54775 15136 8009 5272 -12770 -15448 -3968
383 -3968 -1658 3553 17024 15930 -20438 -12889 -3093 -28627 -28636 -2743 20726 7575 -14265 -722
369 -722 24751 655 -6298 -9394 9282 18229 18731 9760 -19994 -33765 -27785 -14635 -12963 -7568
355 -7568 4208 7767 14575 10355 16691 19269 22143 -3004 -3620 -1784 -1649 -25601 -4483 159 -1982
340 -1982 7979 16654 11142 11086 -6728 -2344 717 -8169 -27727 -46478 -31235 17260 23322 19532
326 19532 14113 38254 36086 22804 9521 3017 5148 2886 3983 33031 49853 42948 29580
313 29580 -2614 656 31879 27442 32760 38126 11151 2482 22240 28830 38519 22901 -860
300 -860 -19615 -21408 -18341 17021 4571 -3874 -939 -7822 -13599 -7057 10599 25617 25216 32678
286 32678 31371 32524 35743 17221 7618 5349 -4915 -7519 -3642 9009 6714 19130 21324 11913
272 11913 2254 -14094 -28968 -32846 -8445 -17497 -24607 8800 46660 49598 24587 -6867 -11807
259 -11807 -22362 -16766 -13308 3766 2971 -4956 -7380 -10037 -4613 14999 611 -24687 -25036 -22850
245 -22850 -3954 -4723 983 13668 8385 7984 6678 -6151 -3881 -76 -15698 -30330 -6157 -6715
231 -6715 -13799 -1277 3744 8791 6740 19776 21053 3455 -14338 3073 20359 31312 -4532
218 -4532 -12319 -49 2480 16894 9480 -2157 13104 63 -22273 -20668 -14427 -15843 1058
205 1058 12120 16511 7451 9319 6594 -5558 -1804 -3352 -6428 -14021 -12462 -18104 -20133 -7068
191 -7068 9404 10645 -9324 -23343 -11695 6920 10177 267 -11500 5920 4423 13822 11952
178 11952 -2539 -9125 -5402 -8960 690 12954 10390 732 31471 63547 39500 33203 31452 27466
164 27466 17659 -15520 -42723 -63719 -68490 -55822 -43592 -29710 -15393 -16795 -7507 17648 7490
151 7490 -5510 -1374 9865 6186 -2790 -976 -3365 -917 30039 17235 -5746 -13196 -12576 -10006
137 -10006 -14382 -15300 -4088 10050 2776 9348 13426 13358 15654 3432 8993 10846 12220 20995 12581
122 12581 -1514 5803 3232 21003 33672 12793 -13586 -16373 -11945 -9977 -12606 -3373 -4552 -10208
108 -10208 -7690 2600 12842 35821 12118 -9888 -13810 -15995 -20432 -1252 20702 21465 11746
95 11746 27350 34450 18722 -856 -374 -5936 5413 19005 6752 -11080 2766 2333 13201
82 13201 19835 13517 -3484 -6119 -10131 -7532 2717 -4543 -3958 351 -11091 -10864 3047 -2722 -10984
67 -10984 3120 8750 792 2294 -3430 -4054 -17535 -3845 -1553 -1806 -6284 -21961 -18666 -33682
53 -33682 -35604 -12636 -1408 -7645 1197 938 6081 18188 2149 -3449 -2590 3535 -7893 -20755
39 -20755 -25405 -2697 9422 10507 27898 12873 15316 3090 -9907 -8063 -2218 -16314 -23932
26 -23932 -35343 -26480 -15721 10237 17417 28264 34924 30874 37131 28938 22397 17060 9536 -2430
12 -2430 -3425 8555 9244 -5226 -24601 -29742 -17516 -4875 31 10693 -2272 -26351
0 -26351
$$ Imaginary data points
##PAGE= N=2
##DATA TABLE= (X++(I..I)), XYDATA
32767 194428 188986 179876 175272 166986 175169 177687 193893 197565 179354 187441 206417 208347 209540
32754 209540 205388 192213 184512 183156 189870 191254 182701 174566 173701 184209 194558 205544 215320
32741 215320 200550 183530 184327 193218 187747 177942 174763 181185 189936 221373 207540 202430 208660
32728 208660 201132 188000 195498 190866 192954 229929 238190 237163 226053 217299 211032 227290 232843
32715 232843 236043 245693 239758 224550 226030 222784 227236 223629 225462 250555 266840 255167 249142
32702 249142 245643 240715 244005 258362 265673 269930 263655 255614 258779 273119 290084 283725 282129
32689 282129 270233 269351 263073 257686 242310 237865 243922 245599 268585 288908 294965 289396 293247
32676 293247 312253 303845 290371 283246 287094 291895 295297 286217 302878 326804 347231 358558 357503
32663 357503 336241 329182 330493 324947 333654 325592 309555 329043 361099 359371 330137 307489 323102
32650 323102 311886 345153 350900 334963 326599 316682 298670 292561 294573 306091 333434 340458 329214
32637 329214 336248 350832 340504 329560 330643 334080 359833 366987 359146 332841 323029 328115 343803
32624 343803 336803 343374 345828 342560 330322 329357 332397 366865 382283 387580 379594 377936 382470 377320
32610 377320 361833 339082 358873 373705 375539 384457 390486 380573 390159 401682 395591 385796 373339
32597 373339 354181 357592 384134 376585 389918 417491 427953 426498 411478 396174 390889 412125
32585 412125 420933 425679 431392 417718 413815 415927 439206 440329 432860 415400 416755 430870 436164
32572 436164 438706 429157 436252 429403 420306 409545 387950 384000 396150 421995 443954 421954 428701
32559 428701 442443 454927 467547 469958 458356 434192 412968 410701 442315 456059 443457 453490
32547 453490 459696 451860 447172 431859 413817 409645 416395 410174 430861 460712 445836 417965 438247
32534 438247 460157 454426 456867 458961 475862 460738 447777 475438 483626 482674 476780 486568 491879
32521 491879 476749 497681 482438 448748 473451 482903 467473 484115 471347 439290 453181 467458
32509 467458 481523 476874 483334 516375 506541 518798 541174 523631 527931 521197 500547 509729 527244
32496 527244 533898 529093 568023 559754 524594 520420 518640 531178 517271 522103 523998 508916 497221
32483 497221 493395 484796 475351 490483 492910 479719 484628 503435 496537 503901 500832 526706 545595
32470 545595 534239 512690 498364 511172 524748 521377 529126 502567 459154 467401 510912 527355
32458 527355 522354 531694 556940 565900 562486 552060 532944 527172 496153 491813 512871 519534 516659
32445 516659 503176 514085 540121 537126 522625 496405 496387 499628 482045 492705 513623 549070
32433 549070 536450 523240 532192 549563 537257 553039 581704 575497 578133 570875 566773 581514
32421 581514 599468 580582 560438 556032 562955 542164 526138 533719 530180 534144 541810 542865 565843
32408 565843 573622 589252 599425 577356 548999 526754 511046 505936 518867 535577 564471 604293
32396 604293 608624 611524 597306 585656 584073 578597 562200 579711 582547 597384 611812 605677 593126
$$ [...]
##END NTUPLES=NMR SPECTRUM
##END=
