##TITLE=Analysis number 327179
Compound Code btb 08739
Project Code adrs
Chemist Name aci
##JCAMPDX= 6.0         $$ Bruker NMR JCAMP-DX V2.0
##DATA TYPE= NMR SPECTRUM
##DATA CLASS= NTUPLES
##ORIGIN= Bruker BioSpin GmbH
##OWNER= nmr
$$ XWIN-NMR		Version 3.5
$$ Tue Mar 13 14:23:39 2007 GMT Standard Time (UT+0h)  MAYBRIDGE\nmr@NMR_250MHZ
##.OBSERVE FREQUENCY= 250.131544655141
##.OBSERVE NUCLEUS= ^1H
##.ACQUISITION MODE= SIMULTANEOUS (DQD)
##.ACQUISITION SCHEME= undefined
##.AVERAGES= 16
##.DIGITISER RES= 18
##SPECTROMETER/DATA SYSTEM= dpx250
##.PULSE SEQUENCE= zg30
##.SOLVENT NAME= CDCl3
##.SHIFT REFERENCE= (INTERNAL, CDCl3, 0, 16.4453)
##AUDIT TRAIL= $$ (NUMBER, WHEN, WHO, WHERE, WHAT)
$$ ##TITLE= Audit trail, XWIN-NMR		Version 3.5
$$ ##JCAMPDX= 5.01
$$ ##ORIGIN= Bruker BioSpin GmbH
$$ ##OWNER= nmr
$$ C:\u/data/dgb/nmr/ADRS/840/pdata/1/auditp.txt
$$ ##AUDIT TRAIL=  $$ (NUMBER, WHEN, WHO, WHERE, WHAT)
(   1,<2007-03-13 14:23:15.43 +000>,<MAYBRIDGE\nmr>,<NMR_250MHZ>,
      <created by zg, POWCHK disabled, PULCHK disabled
       configuration hash MD5:
       49 4B E0 1D 92 C2 6B 37 9F E6 65 BC 52 41 86 1D
       data hash MD5: 64K
       5C 73 22 69 96 34 3F 86 51 CE 10 FB E2 0A 2A BF>)
(   2,<2007-03-13 14:23:30.28 +000>,<MAYBRIDGE\nmr>,<NMR_250MHZ>,
      <Start of raw data processing
       ef LB = 0.3 FT_mod = 6 PKNL = 1 SI = 32K 
       data hash MD5: 32K
       C5 98 86 F1 E4 F0 E8 E7 08 81 F0 5C 6A 3F 45 A9>)
(   3,<2007-03-13 14:23:32.26 +000>,<MAYBRIDGE\nmr>,<NMR_250MHZ>,
      <apk 
       data hash MD5: 32K
       7A 16 73 FF 74 17 A5 57 73 3B 7F 3E 05 3E 0E CC>)
(   4,<2007-03-13 14:23:33.07 +000>,<MAYBRIDGE\nmr>,<NMR_250MHZ>,
      <abs ABSG = 5 
       data hash MD5: 32K
       15 DA 55 5B F3 29 05 C1 DA 70 45 89 6C 7D E2 57>)
$$ ##END=
$$ 
$$ hash MD5
$$ 7B BA CF 47 86 A6 93 6E DE 01 D2 ED 63 77 85 B6
##$RELAX= 
##$RELAX= 
##$RELAX= 
##$RELAX= 
##$RELAX= 
##$RELAX= 
##$RELAX= 
$$ Bruker specific parameters
$$ --------------------------
##$DU= <C:\u>
##$EXPNO= 840
##$NAME= <ADRS>
##$PROCNO= 1
##$TYPE= <nmr>
##$USER= <dgb>
##$AMP= (0..31)
100 100 100 100 100 100 100 100 100 100 100 100 100 100 100 100 100 100 
100 100 100 100 100 100 100 100 100 100 100 100 100 100 
##$AQSEQ= 0
##$AQ_mod= 3
##$AUNM= <au_zg>
##$AUTOPOS= <33 >
##$BF1= 250.13
##$BF2= 250.13
##$BF3= 250.13
##$BF4= 250.13
##$BF5= 500.13
##$BF6= 500.13
##$BF7= 500.13
##$BF8= 500.13
##$BYTORDA= 1
##$CFDGTYP= 0
##$CFRGTYP= 5
##$CHEMSTR= <none>
##$CNST= (0..31)
1 1 145 1 1 1 1 1 1 1 1 1 1 1 1 1 1 1 1 1 1 1 1 1 1 1 1 1 1 1 1 1 
##$CPDPRG= <>
##$CPDPRG1= <>
##$CPDPRG2= <>
##$CPDPRG3= <>
##$CPDPRG4= <mlev>
##$CPDPRG5= <mlev>
##$CPDPRG6= <mlev>
##$CPDPRG7= <mlev>
##$CPDPRG8= <mlev>
##$CPDPRGB= <>
##$CPDPRGT= <>
##$D= (0..31)
0 1 0 0 0 0 0 0 0 0.06 0 0 0 0 0 0 0.0002 0 0 0 0 0 0 0 0 0 0 0 0 0 0 
0 
##$DATE= 1173795794
##$DBL= (0..7)
120 120 120 120 120 120 120 120 
##$DBP= (0..7)
150 150 150 150 150 150 150 150 
##$DBP07= 0
##$DBPNAM0= <>
##$DBPNAM1= <>
##$DBPNAM2= <>
##$DBPNAM3= <>
$$ [...]
##$SUBNAM7= <"">
##$SUBNAM8= <"">
##$SUBNAM9= <"">
##$SW= 20.6930455092707
##$SWIBOX= (0..15)
0 0 3 0 0 0 0 0 0 0 0 0 0 0 0 0 
##$SW_h= 5175.983436853
##$TD= 65536
##$TD0= 1
##$TE= 683.16
##$TE2= 300
##$TE3= 300
##$TEG= 300
##$TL= (0..7)
0 120 120 120 120 120 120 120 
##$TP= (0..7)
150 150 150 150 150 150 150 150 
##$TP07= 0
##$TPNAME0= <>
##$TPNAME1= <>
##$TPNAME2= <>
##$TPNAME3= <>
##$TPNAME4= <>
##$TPNAME5= <>
##$TPNAME6= <>
##$TPNAME7= <>
##$TPOAL= (0..7)
0.5 0.5 0.5 0.5 0.5 0.5 0.5 0.5 
##$TPOFFS= (0..7)
0 0 0 0 0 0 0 0 
##$TUNHIN= 0
##$TUNHOUT= 0
##$TUNXOUT= 0
##$USERA1= <user>
##$USERA2= <user>
##$USERA3= <user>
##$USERA4= <user>
##$USERA5= <user>
##$V9= 5
##$VALIST= <valist>
##$VCLIST= <CCCCCCCCCCCCCCC>
##$VD= 0
##$VDLIST= <DDDDDDDDDDDDDDD>
##$VPLIST= <PPPPPPPPPPPPPPP>
##$VTLIST= <TTTTTTTTTTTTTTT>
##$WBST= 1024
##$WBSW= 4
##$XGAIN= (0..3)
0 0 0 0 
##$XL= 0
##$YL= 0
##$YMAX_a= 324709
##$YMIN_a= -430978
##$ZGOPTNS= <>
##$ZL1= 120
##$ZL2= 120
##$ZL3= 120
##$ZL4= 120
##$ABSF1= 16.44526
##$ABSF2= -4.247913
##$ABSG= 5
##$ABSL= 3
##$ALPHA= 0
##$AQORDER= 0
##$ASSFAC= 0
##$ASSFACI= 0
##$ASSFACX= 0
##$ASSWID= 0
##$AUNMP= <proc_1d>
##$AZFE= 0.1
##$AZFW= 0.1
##$BCFW= 0
##$BC_mod= 0
##$BYTORDP= 0
##$COROFFS= 0
##$CY= 12.5
##$DATMOD= 1
##$DC= 0
##$DFILT= <>
##$DTYPP= 0
##$F1P= 14.0000005364418
##$F2P= -0.99999901652339
##$FCOR= 0.5
##$FTSIZE= 32768
##$FT_mod= 6
##$GAMMA= 0
##$GB= 0
##$INTBC= 1
##$INTSCL= 1
##$ISEN= 128
##$LB= 0.3
##$LEV0= 0
##$LPBIN= 0
##$MAXI= 10000
##$MC2= 0
##$MEAN= 0
##$ME_mod= 0
##$MI= 0
##$NCOEF= 0
##$NC_proc= -4
##$NLEV= 6
##$NOISF1= 0
##$NOISF2= 0
##$NSP= 0
##$NTH_PI= 0
##$NZP= 0
##$OFFSET= 16.44526
##$PC= 1
##$PHC0= 219.1351
##$PHC1= 31.08632
##$PH_mod= 1
##$PKNL= yes
##$PPARMOD= 0
##$PSCAL= 4
##$PSIGN= 0
##$REVERSE= no
##$SF= 250.130019194155
##$SI= 32768
##$SIGF1= 0
##$SIGF2= 0
##$SINO= 400
##$SIOLD= 32768
##$SREGLST= <1H.CDCl3>
##$SSB= 0
##$STSI= 32768
##$STSR= 0
##$SW_p= 5175.98343685301
##$SYMM= 0
##$S_DEV= 0
##$TDeff= 65536
##$TDoff= 0
##$TI= <Analysis number 999999
Compound Code 99
Book Reference 9
Project Code 9>
##$TILT= no
##$TM1= 0
##$TM2= 0
##$TOPLEV= 0
##$USERP1= <user>
##$USERP2= <user>
##$USERP3= <user>
##$USERP4= <user>
##$USERP5= <user>
##$WDW= 1
##$XDIM= 32768
##$YMAX_p= 338056058
##$YMIN_p= -415998
$$ End of Bruker specific parameters
$$ ---------------------------------
##NTUPLES= NMR SPECTRUM
##VAR_NAME=  FREQUENCY,     SPECTRUM/REAL,   SPECTRUM/IMAG
##SYMBOL=    X,             R,               I
##VAR_TYPE=  INDEPENDENT,   DEPENDENT,       DEPENDENT
##VAR_FORM=  AFFN,          ASDF,            ASDF
##VAR_DIM=   32768,         32768,           32768
##UNITS=     HZ,            ARBITRARY UNITS, ARBITRARY UNITS
##FACTOR=    0.157963299565203, 1,           1
##FIRST=     4113.45297289467, 0,            0
##LAST=      -1062.53046395834, 0,           0
##MIN=       -1062.53046395834, -415998,     0
##MAX=       4113.45297289467, 338056058,    0
$$ Real data points
##PAGE= N=1
##DATA TABLE= (X++(R..R)), XYDATA
$$ [...]
$$ plain form
23892 -54384 -81086 -43837 -14930 10095 37495 112744 117011 27972 -27609 -48122 -54803 -43037
23880 -43037 -43145 -20579 34296 79868 87787 119114 85770 84280 35759 -41268 -36736 -68507 -74224
23867 -74224 -49476 -12376 54624 95219 48656 4690 20021 58537 53012 43025 72840 93062
23855 93062 34100 -18371 -74968 -36425 18239 -2568 10993 17854 18737 16505 32765 -20933
23843 -20933 -60856 -102620 -131603 -176729 -122116 -66321 -50180 -31115 -17986 -48148 6326 56267
23831 56267 20538 8415 41067 17087 20021 23134 70794 76292 27894 -44220 -64111 -61019
23819 -61019 -68585 -75874 -21112 -14228 -34841 -25489 -7360 -10012 -17725 15026 -17074 -77936 -90032
23806 -90032 -47359 -91956 -121808 -122839 -136212 -168899 -181473 -167638 -76353 -57807 -34027 58255
$$ packed form
23892e4384k6702L7249K8907K5025K7400P5249M267q9039n5581k0513o681J1766
23880d3037j08K2566N4875M5572P919L1327l3344j490m8521p7027M532l1771n717
23867g4224K4748L7100O7000M0595m6563m3966J5331L8516n525r987K9815K0222
23855I3062n8962n2471n6597L8543N4664k0807J3561O861Q83k232J6260n3698
23843b0933l9923m1764k8983m5126N4613N5795J6141J9065J3129l0162N4474M9941
23831E6267l5729j2123L2652k3980K934L113M7660N498m8398p2114j9891L092
23819f1019p566p289N4762O884k0613R352J8129k652p713L2751l2100o0862j2096
23806i0032M2673m4597k9852j031j3373l2687j2574J3835R1285J8546K3780R2282
$$ plain form
23794 58255 109007 98861 27992 67649 94777 113330 77646 -12947 -30566 -13600 -34194 -75201
23782 -75201 -30704 20575 20863 73751 40669 -7605 25601 12896 526 -28582 -37697 -35060
23770 -35060 -23272 -54219 -14245 -64104 -59106 -25287 -78580 -109176 -80009 -36469 -37172 2435
23758 2435 18938 -2218 -14648 -6272 38489 -55453 -84172 -33359 -895 27359 -36187 -20900
23746 -20900 6799 -37150 -3227 -7046 -11924 -6554 -37827 -37229 -5064 -7029 -30141 -9318 34457
23733 34457 44072 51526 65344 100151 67581 61678 48970 -36917 -55207 -47576 -64672 -119730
23721 -119730 -114826 -105306 -94396 -42396 -18293 -34455 -5461 27491 26963 -41338 -63969 -35534
23709 -35534 -5257 -15279 28242 43755 27184 12976 78084 12754 -48064 -43935 -18537 6153
$$ packed form
23794E8255N0752j0146p0869L9657K7128J8553l5684r0593j7619J6966k0594m1007
23782g5201M4497N1279K88N2888l3082m8274L3206j2705j2370k9108r115K637
23770c5060J1788l0947L9974m9859M998L3819n3293l0596K9167M3540p03L9607
23758B435J6503k1156j2430Q376M4761r3942k8719N0813L2464K8254o3546J5287
23746b0900K7699m3949L3923l819m878N370l1273N98L2165j965k3112K0823M3775
23733C4457R615P454J3818L4807l2570n903j2708q5887j8290P631j7096n5058
23721a19730M904R520J0910N2000K4103j6162K8994L2952n28o8301k2631K8435
23709c5534L0277j0022M3521J5513j6571j4208O5108o5330o0818M129K5398K4690
$$ plain form
23697 6153 49610 55928 -2210 -6177 -39740 -40062 -41158 -61054 965 14633 74004 110497 63835
23684 63835 11964 -6129 -77944 -147296 -114569 -100593 -118229 -174743 -129815 -44092 -44312 -947
23672 -947 -10522 -46430 -52414 -65769 -37592 -59263 -22862 -13014 -37230 -68176 -48056 -14739 26415
23659 26415 11611 -4088 204 -44517 -67873 -47287 -39080 -2090 -13203 -15523 -50964 -42115
23647 -42115 30362 67365 74515 106550 60636 -12867 -16059 -56690 -74378 -27954 18342 -5359
23635 -5359 -4319 11204 -46098 -26849 -33885 23425 69570 99332 103251 95913 59410 16836 18857
23622 18857 17295 -28270 -53911 -43580 -584 -7443 -97561 -57453 -26709 16179 22919 26891
23610 26891 1191 12535 22256 36941 85884 117020 135952 73420 16173 10899 -12126 -52681
$$ packed form
23697F153M3457O318n8138l967l3563l22j096j9896O2019J3668N9371L6493m6662
23684F3835n1871j8093p1815o9352L2727J3976j7636n6514M4928Q5723k20M3365
23672i47r575l5908n984j3355K8177k1671L6401R848k4216l0946K0120L3317M1154
23659B6415j4804j5699M292m4721k3356K0586Q207L6990j1113k320l5441Q849
23647d2115P2477L7003P150L2035m5914p3503l192m0631j7688M6424M6296k3701
23635e359J040J5523n7302J9249p036N7310M6145K9762L919p338l6503m2574K021
23622A8857j562m5565k5641J0331M2996o859r0118M0108L0744M2888O740L972
23610B6891k5700J1344R721J4685M8943L1136J8932o2532n7247n274k3025m0555
$$ plain form
23598 -52681 -51762 -58512 -25857 -17911 -3528 9632 -23432 -48776 -13817 3021 25683 -34429
23586 -34429 8202 41862 67485 76332 -8201 -39719 -23627 25662 64088 39276 63494 56058
23574 56058 16830 4585 25297 24601 -10376 523 -24640 -83389 -97975 -78447 -18767 17419
23562 17419 66389 66445 15521 -44464 -55153 -38673 -52375 -31771 -30782 1441 -10757 2923 10236
23549 10236 8247 18780 36453 47765 -7613 -83012 -76566 -66341 -14503 62718 100841 103187
23537 103187 65916 14497 2640 34955 49175 68960 15581 1024 -26518 -6603 26883
23526 26883 -27153 -15739 -42802 -27968 -10772 28740 -22916 -95094 -95668 -36378 -21884 58247
23514 58247 84332 24320 -7980 7621 -46516 -56600 -36164 -28846 3238 30937 37085 48837
$$ packed form
23598e2681R19o750L2655P946J4383J3160l3064k5344L4959J6838K2662o0112
23586c4429M2631L3660K5623Q847q4533l1518J6092M9289L8426k4812K4218p436
23574E6058l9228j2245K0712o96l4977J0899k5163n8749j4586J9528N9680L6186
23562A7419M8970N6n0924n9985j0689J6480j3702K0604R89L2223j2198J3680P313
23549A0236j989J0533J7673J1312n5378p5399O446J0225N1838P7221L8123K346
23537A03187l7271n1419j1857L2315J4220J9785n3379j4557k7542J9915L3486
23526B6883n4036J1414k7063J4834J7196L9512n1656p2178n74N9290J4494Q0131
23514E8247K6085o0012l2300J5601n4137j0084K0436P318L2084K7699O148J1752
$$ plain form
23502 48837 74436 49923 33892 32910 8246 60530 102164 61616 57861 48356 -20367 -4238
23490 -4238 8637 -25338 15129 42204 85103 -26160 -54094 57 48458 67281 28268 17148
23478 17148 3302 6405 39438 16256 4647 -33438 -14051 -22851 3348 -14203 -3058 -22674
23466 -22674 -41752 -32030 -3518 -7543 14866 -3828 10075 20867 30139 27805 -63942 -74228
23454 -74228 -76670 -80605 -71449 -49361 -24540 26265 40426 53645 71105 43224 -23627 -71773
23442 -71773 -33993 -33910 -55252 -75430 -94819 -22655 -11914 -52196 -26645 -25686 -16557 18786 41286
23429 41286 41807 34588 101823 100584 74748 40071 -27212 -27346 1259 -22430 -58925 -43560 -53345
23416 -53345 -50341 -53592 -18757 -17776 -55839 -107680 -94886 -81883 -54638 -20775 -1049 10023
$$ packed form
23502D8837K5599k4513j6031r82k4664N2284M1634m0548l755r505o8723J6129
23490d238J2875l3975M0467K7075M2899j11263k7934N4151M8401J8823l9013j1120
23478A7148j3846L103L3033k3182j1609l8085J9387q800K6199j7551J1145j9616
23466b2674j9078R722K8512m025K2409j8694J3903J0792R272k334r1747j0286
23454g4228k442l935R156K2088K4821N0805J4161J3219J7460k7881o6851m8146
23442g1773L7780Q3k1342k0178j9389P2164J0741m0282K5551R59R129L5343K2500
23429D1286N21p219O7235j239k5836l4677o7283j34K8605k3689l6495J5365r785
23416e3345L004l251L4835R81l8063n1841J2794J3003K7245L3863J9726J1072
$$ plain form
23404 10023 41134 61659 81548 -8446 -84188 -74508 -55030 1161 23826 -198 -50520 -75084
23392 -75084 -37437 824 21676 42542 32614 20580 -45886 -47636 5012 73301 18395 -53287
23380 -53287 27890 154869 140794 59002 18911 23297 29943 5208 -4081 -32577 -7738 55774
23368 55774 53587 38 -70568 -50505 -54313 -143087 -164949 -162503 -143826 -85461 33271 88562
23356 88562 54802 57044 9636 17019 -13734 -97506 -80846 -98543 -112529 -102004 -54269 -23983
23344 -23983 12059 65409 77218 37004 4947 5261 -3961 -250 25293 78210 141798 225546
23332 225546 168485 94609 37191 57843 54692 54456 33584 29427 -14746 -42414 -63867 -57079
23320 -57079 -51081 8846 26395 12325 -22739 -36798 -40941 -9313 7096 -57845 -67600 -40615
$$ packed form
23404A0023L1111K0525J9889q9994p5742R680J9478N6191K2665k4024n0322k4564
23392g5084L7647L8261K0852K0866r928j2034o6466j750N2648O8289n4906p1682
23380e3287Q1177J26979j4075q1792m0091M386O646k4735r289k8496K4839O3512
23368E5774k187n3549p0606K0063l808q8774k1862K446J8677N8365J18732N5291
23356H8562l3760K242m7408P383l0753q3772J6660j7697j3986J0525M7735L0286
23344b3983L6042N3350J1809m0214l2057L14r222L711K5543N2917O3588Q3748
23332B25546n7061p3876n7418K0652l151k36k0872m157m4173k7668k1453O788
23320e7079N998N9927J7549j4070l5064j4059m143L1628J6409o4941r755K6985
$$ plain form
23308 -40615 -31539 -4939 6821 -24145 -35122 -22097 -7876 -24661 -33942 -57660 -6172 -2908
23296 -2908 63633 50081 15084 -21643 -27800 14803 48782 56035 24513 -3762 27372 25893
23284 25893 -44156 -64038 -54152 -84082 -84664 -77308 -32805 -25711 -68843 -40068 10786 3307 -19591
23271 -19591 -25776 -38317 -3261 -17033 -2027 -55755 -53384 -20012 -27227 -26681 4948 25051 45215
23258 45215 30971 -59603 -94638 -75218 -38864 -40330 -79953 -57767 -45545 -56502 -31288 -19619
23246 -19619 -28933 -1363 949 -27823 -18924 5834 34895 82822 86885 82712 55116 37831 -12851
23233 -12851 -42752 -70217 -52370 35488 67439 63716 78191 72495 20615 23452 21132 -7626
23221 -7626 -31598 -2138 -52608 -89126 -72388 -55866 -25697 -30437 -59293 -113508 -82479 -30036
$$ packed form
23308d0615R076K6600J1760l0966j0977J3025J4221j6785r281k3718N1488L264
23296b908O6541j3552l4997l6727o157M2603L3979P253l1522k8275L1134j479
23284B5893p0049j9882R886k9930n82P356M4503P094m3132K8775N0854p479k2898
23271a9591o185j2541L5056j3772J5006n3728K371L3372p215N46L1629K0103K0164
23258D5215j4244r0574l5035J9420L6354j466l9623K2186J2222j0957K5214J1669
23246a9619r314K7570K312k8772Q899K4758K9061M7927M063m173k7596j7285n0682
23233a2851k9901k7465J7847Q7858L1951l723J4475n696n1880K837k320k8758
23221g626k3972K9460n0470l6518J6738J6522L0169m740k8856n4215L1029N2443
$$ plain form
23209 -30036 11065 -11978 10183 85407 117413 113049 17145 33511 30157 48557 82711 96629
23197 96629 80301 27570 -687 20712 -10160 -35165 -56818 -19441 36286 49943 45406 50486
23185 50486 21986 36966 77335 107272 43305 -28260 -36876 7474 7162 23880 3344 -13910
23173 -13910 -120834 -115116 -69696 -67275 -70844 -8034 21841 29484 -12846 21131 20916 -22043 -49576
23160 -49576 -75404 -57452 -36102 27392 16426 -16656 -63713 -119311 -101167 -59586 -58602 -58726
23148 -58726 -64740 -5635 -6040 -26479 -34561 -15345 -14610 -14971 65449 96216 75244 30767 -27411
23135 -27411 -80303 -143631 -110441 -82335 -50166 -9849 -7707 15522 26260 10819 -35651 -44504
23123 -44504 -48975 -17351 -40483 -21737 59100 92121 105821 -6602 -33629 -45006 -52091 -28249
$$ packed form
23209c0036M1101k3043K2161P5224L2006m364r5904J6366l354J8400L4154J3918
23197I6629j6328n2731k8257K1399l0872k5005k1653L7377N5727J3657m537N080
23185E0486k8500J4980M0369K9937o3967p1565q616M4350l12J6718k0536j7254
23173a3910j06924N718M5420K421l569O2810K9875P643m2330L3977k15m2959k7533
23160d9576k5828J7952K1350O3494j0966l3082m7057n5598J8144M1581R84j24
23148e8726o014N9105m05k0439q082J9216P35l61Q0420L0767k0972m4477n8178
23135b7411n2892o3328L3190K8106L2169M0317K142K3229J0738j5441m6470q853
23123d4504m471L1624k3132J8746Q0837L3021J3700j12423k7027j1377p085K3842
$$ plain form
23111 -28249 8453 7122 -19440 -47632 -4142 21031 6842 -2233 -10281 3213 34899 26413
23099 26413 -8374 17214 29810 16956 25524 70215 72042 28271 32777 72419 82945 38909
23087 38909 66913 65031 71822 97605 97857 53383 -1587 2220 10193 -6168 7765 51208 38874
23074 38874 -490 -16176 -35851 2089 -18179 -34371 -20305 -10029 17496 10307 33162 14757
23062 14757 -9942 -7454 -20373 -10155 19526 -12019 -39070 -46812 -66354 -58993 -5233 -45831
23050 -45831 -51635 -36641 -21972 -8979 42040 14767 -60589 -86371 -49437 -70365 -63512 -37159
23038 -37159 -10547 -13296 -24761 -43756 -16194 -28480 -109953 -131820 -51745 24026 35516 26087
23026 26087 -60656 -64012 -9637 39526 22269 42457 63465 85714 13852 28835 68594 35700
$$ packed form
23111b8249L6702j331k6562k8192M3490K5173j4189r075q048J3494L1686q486
23099B6413l4787K5588J2596j2854Q568M4691J827m3771M506L9642J0526m4036
23087C8909K8004j882O791K5783K52m4474n4970L807P973j6361J3933M3443j2334
23074C8874l9364j5686j9675L7940k0268j6192J4066J0276K7525p189K2855j8405
23062A4757k4699K488j2919J0218K9681l1545k7051p742j9542P361N3760m0598
23050d5831n804J4994J4669J2993N1019k7273p5356k5782L6934k0928O853K6353
23038c7159K6612k749j1465j8995K7562j2286q1473k1867Q0075P5771J1490r429
23026B6087q6743l356N4375M9163j7257K0188K1008K2249p1862J4983L9759l2894
$$ plain form
23014 35700 20630 55036 68336 82640 130986 84241 67225 37872 27099 82553 181824 155030
23002 155030 92458 69110 59537 85742 98334 86096 71651 54323 -6465 -69826 -66211 -30424
22990 -30424 -27866 -70799 -72484 -84128 -68746 -2019 23581 -34461 -66124 -58174 -65278 -90634
22978 -90634 -53909 -8130 -1720 -7605 -11726 -76986 -71830 -7835 -9649 -38359 -69620 -59568 -51792
22965 -51792 -56895 -61150 -22258 1237 11354 5191 57838 -6530 -67750 -70498 -85812 -142214
22953 -142214 -112047 -15740 10501 2175 -25757 -2146 -25037 -10298 3579 -24053 -22453 21962
22941 21962 49308 52555 3749 -47649 -18982 22804 58769 25150 -1999 31664 32983 -29933
22929 -29933 -40943 -47936 -100576 -54237 -25348 -1517 -6803 -61823 -65072 -18457 -23238 -47317
$$ packed form
23014C5700j5070L4406J3300J4304M8346m6745j7016k9353j0773N5454R9271k6794
23002A55030o2572k3348r573K6205J2592j2238j4445j7328o0788o3361L615L5787
22990c0424K558m2933j685j1644J5382O6727K5600n8042l1663P950p104k5356
22978i0634L6725M5779O410n885m121o5260N156O3995j814k8710l1261J0052P776
22965e1792n103m255L8892K3495J0117o163N2647o4368o1220k748j5314n6402
22953a42214L0167R6307K6241q326k7932K3611k2891J4739J3877k7632J600M4415
22941B1962K7346L247m8806n1398K8667M1786L5965l3619k7149L3663J319o2916
22929b9933j1010o993n2640M6339K8889K3831n286n5020l249M6615m781k4079
$$ plain form
22917 -47317 -83178 -85863 -51161 11934 31724 63455 44235 -30089 -22500 -32429 -34288 -53933
22905 -53933 -47923 -47361 -50652 -27015 9522 32721 16479 -35271 -6912 2474 -67099 -114713 -112810
22892 -112810 -90061 -26302 -33831 -23767 -39263 -47693 -62884 -20881 -39859 -78113 -83707 -38562
22880 -38562 -19991 -42028 -11407 56870 50621 24942 12872 15816 -27078 -56349 -37129 51201
22868 51201 117753 90589 85503 26222 -1841 -7924 19142 33752 -60719 -106065 -71747 -68663
22856 -68663 -72965 -95770 -79287 -41758 -38686 -72338 -70205 -39975 -31961 -64732 -119418 -115270 -72237
22843 -72237 13347 73328 95638 5874 -37930 -23307 -30621 -43495 -19675 44974 58823 39250
22831 39250 24166 7640 -11320 -33217 -65572 -75742 -62989 -47897 -20755 -41037 -111717 -57154
$$ packed form
22917d7317l5861k685L4702O3095J9790L1731j9220p4324P589r929j859j9645
22905e3933O010N62l291K3637L6537K3199j6242n1750K8359R386o9573m7614J903
22892a12810K2749O3759p529J0064j5496q430j5191M2003j8978l8254n594M5145
22880c8562J8571k2037L0621O8277o249k5679j2070K944m2894k9271J9220Q8330
22868E1201O6552k7164n086n9281k8063o083K7066J4610r4471m5346L4318L084
22856f8663m302k2805J6483L7529L072l3652K133L0230Q014l2771n4686M148M3033
22843g2237Q5584N9981K2310q9764m3804J4623p314j2874K3820O4649J3849j9573
22831C9250j5084j6526j8960k1897l2355j0170J2753J5092K7142k0282p0680N4563
$$ plain form
22819 -57154 -25772 -31842 -102736 -99701 -51492 -11701 -20857 -50295 -20032 18058 21465 -8082
22807 -8082 -59925 -49898 11479 133929 181715 93252 15015 -115 47768 52748 23250 12363
22795 12363 30610 56561 105227 57626 -2213 -56437 -44347 -44948 -28498 -13043 23717 -31478
22783 -31478 -55171 -33889 -10474 25942 85396 90806 131030 151335 114219 59433 -751 -57749
22771 -57749 -55706 18865 24024 -51797 -24796 -8748 11106 17792 33352 55570 3220 -15436
22759 -15436 -20772 -6573 22478 19569 11054 -33778 -99701 -113779 -56118 -5877 26360 52543
22747 52543 17082 60488 68353 61368 -10591 -68557 -43466 -8298 -45116 -79801 -79646 -63994
22735 -63994 -10288 -5893 -47394 -90687 -85240 -74381 -100342 -129564 -86071 -88446 -69255 -24460
$$ packed form
22819e7154L1382o070p0894L035M8209L9791r156k9438L0263L8090L407k9547
22807h082n1843J0027O1377J22450M7786q8463p8237j5130M7883M980k9498j0887
22795A2363J8247K5951M8666m7601n9839n4224J2090o01J6450J5455L6760n5195
22783c1478k3693K1282K3415L6416N9454N410M0224K0305l7116n4786o0184n6998
22771e7749K043P4571N159p5821K7001J6048J9854O686J5560K2218n2350j8656
22759a5436n336J4199K9051k909q515m4832o5923j4078N7661N0241L2237K6183
22747E2543l5461M3406P865o985p1959n7966K5091L5168l6818l4685J55J5652
22735f3994N3706M395m1501m3293N447J0859k5961k9222M3493k375J9191M4795
$$ plain form
22723 -24460 -465 -16780 30148 65377 63996 28766 47317 60400 51570 33817 74882 91576
22711 91576 78354 68019 42432 15446 82693 155597 115557 61712 -47712 21760 38868
22700 38868 52394 59354 463 -47753 -61866 -54294 -11251 46494 50543 24112 17081 38645
22688 38645 12749 9159 -3183 60719 39205 -8833 9754 6956 -63212 -75302 -63941 -97109
22676 -97109 -93623 -102490 -88049 -12456 79336 102521 41551 -15568 39862 23943 32207 2850
22664 2850 -42649 -14183 14142 -15996 -74738 -57650 32522 97578 51945 -6465 -50634 -17594
22652 -17594 -9548 -63311 -46657 -61393 -84092 -64418 -14843 7633 11798 4155 17737 44542
22640 44542 88721 129125 100236 -1121 -103052 -142691 -124197 -107638 -16875 46564 19957
$$ packed form
22723b4460K3995j6315M6928L5229j381l5230J8551J3083q830j7753M1065J6694
22711I1576j3222j0335k5587k6986O7247P2904m0040n3845j09424O9472J7108
22700C8868J3526O960n8891m8216j4113P572M3043N7745M049k6431p031K1564
22688C8645k5896l590j2342O3902k1514m8038J8587k798p0168j2090J1361l3168
22676i7109L486q867J4441P5593R1792K3185o0970n7119N5430j5919Q264k9357
22664B850m5499K8466K8325l0138n8742J7088R0172O5056m5633n8410m4169L3040
22652a7594Q046n3763J6654j4736k2699J9674M9575K2476M165p643J3582K6805
22640D4542M4179M0404k8889j01357j01931l9639J8494J6559R0763O3439k6607
$$ plain form
22629 19957 35080 17701 -17447 -37163 -19873 -8569 -21135 -60548 638 6924 9234 -3668
22617 -3668 45061 81321 29143 70183 38610 -27790 -36451 -543 -4882 33414 69689 52280
22605 52280 17689 -25053 -42769 19221 67376 89254 34428 -13618 -58776 -146028 -170322 -139415
22593 -139415 -116104 -91519 -13939 65612 87204 58972 91698 89417 37639 15669 9380 7643
22581 7643 -9183 11487 -4112 -18245 1097 20461 11976 -28005 -21049 9516 -72685 -117579
22569 -117579 -50219 -72888 -32553 -31487 -27473 3219 43634 15155 54803 54169 9920 -74191
22557 -74191 -75297 -81911 -61422 -77731 -13152 20936 29770 -17521 -45448 -43584 -21590 -13598 -40023
22544 -40023 -62031 -49900 3388 -51255 -142128 -57763 -18308 -38932 -67141 -19608 -30592 -2347
$$ packed form
22629A9957J5123j7379l5148j9716J7290J1304j2566l9413O1186O286K310j2902
22617c668M8729L6260n2178M1040l1573o6400q661L5908m339L8296L6275j7409
22605E2280l4591m2742j7716O1990M8155K1878n4826m8046m5158q7252k4294L0907
22593a39415K3311K4585P7580P9551K1592k8232L2726k281n1778k1970o289j737
22581G643j6826K0670j5599j4133J9342J9364q485l9981O956L0565q2201m4894
22569a17579O7360k2669M0335J066M014L0692M0415k8479L9648o34m4249q4111
22557g4191j106o614K0489j6309O4579L4088Q834m7291k7927J864K1994P992k6425
22544d0023k2008J2131N3288n4643r0873Q4365L9455k0624k8209M7533j0984K8245
$$ plain form
22532 -2347 40258 76329 65575 54692 24555 -31237 12056 81025 52584 21038 51079 56485
22520 56485 67606 669 -49960 -59820 -39581 23952 64020 53716 22410 -38759 -44380 -7413
22508 -7413 -46347 -82757 -45345 -39294 -15711 -32880 -42956 -39174 -7141 81863 157008 111171
22496 111171 116960 120136 102874 75147 74611 96851 91593 83932 98684 87252 56523 79079 108136
22483 108136 104024 141936 80520 -32259 -80492 -78174 -15785 29859 35242 14671 -30654 11582
22471 11582 77770 55015 14818 4334 -1791 -10240 26520 7254 -18602 -47771 -59445 -61071
22459 -61071 -58103 -62446 -98815 -81999 -27057 49148 -1282 -36577 -45288 -19540 -40665 5190
22447 5190 35499 79103 40913 7226 -16325 -19035 -26352 -5394 47690 41026 82649 74357 15821
$$ packed form
22532b347M2605L6071j0754j0883l0137n5792M3293O8969k8441l1546L0041N406
22520E6485J1121o6937n0629r860K0239O3533M0068j0304l1306o1169n621L6967
22508g413l8934l6410L7412O051K3583j7169j0076L782L2033Q9004P5145m5837
22496A11171N789L176j7262k7727n36K2240n258p661J4752j1432l0729K2556K9057
22483A08136m112L7912o1416j12779m8233K318O2389M5644N383k0571m5325M2236
22471A1582O6188k2755m0197j0484o125q449L6760j9266k5856k9169j1674j626
22459f1071K968m343l6369J6816N4942P6205n0430l5295q711K5748k1125M5855
22447E190L0309M3604l8190l3687k3551k710p317K0958N3084o664M1623q292n8536
$$ plain form
22434 15821 2450 -8659 4964 57215 74937 48858 6355 -20003 -14170 -43438 -3116 85740
22422 85740 79628 38089 -44783 -49305 20028 80152 26881 -5915 -60338 -38614 49168 53545
22410 53545 50334 -8297 23511 38741 24239 11522 52408 95614 29708 -11530 -24851 -34447
22398 -34447 -18737 8638 7316 -60241 -126995 -65448 -56167 -11939 1597 14075 32959 29281
22386 29281 40924 19665 22818 46629 43428 17800 1791 -7707 9264 38833 9183 40290
22374 40290 18589 27910 29901 8910 -14316 -32647 42385 54448 106641 109457 109989 54869 60199
22361 60199 16916 -27701 -12495 -1974 29993 108860 104302 60235 52085 36899 39989 9372
22349 9372 -15612 -7498 15972 22759 35860 37436 -15224 -29841 21114 56355 42644 17746
$$ packed form
22434A5821j3371j1109J3623N2251J7722k6079m2503k6358N833k9268M0322Q8856
22422H5740o112m1539q2872m522O9333O0124n3271l2796n4423K1724Q7782M377
22410E3545l211n8631L1808J5230j4502j2717M0886M3206o5906m1238j3321r596
22398c4447J5710K7375j322o7557o6754O1547R281M4228J3536J2478J8884l678
22386B9281J1643k1259L153K3811l201k5628j6009r498J6971K9569k9650L1107
22374D0290k1701R321J991k0991k3226j8331P5032J2063N2193K816N32n5120N330
22361F0199m3283m4617J5206J0521L1967P8867m558m4067q150j5186L090l0617
22349I372k4984Q114K3470O787J3101J576n2660j4617N0955L5241j3711k4898
$$ plain form
22337 17746 21171 46754 59697 66945 56701 19262 1266 -11594 -8000 -16622 30496 19564
22325 19564 13972 11874 -24667 -58470 -116500 -75616 -27990 -29332 -49838 -11165 -56307 -95727
22313 -95727 -54192 -66178 -33998 38402 34172 8146 57454 72716 83666 53615 72872 69933
22301 69933 89550 29618 -8210 -38176 -88766 -21471 -40432 -121471 -98359 -23586 25201 -17618
22289 -17618 -11620 4584 40900 8847 -14043 -5706 6134 1275 22953 26902 13159 1035
22277 1035 -6115 -23471 -11659 -30574 -51114 -61934 -38091 -54990 -48489 -25750 11236 2503
22265 2503 -19405 -74413 -36461 17916 49530 88603 95201 31211 -54309 -130862 -115766 -30820
22253 -30820 -35628 -51553 -13653 -5156 -42373 -89252 -108969 -73973 -87163 -147271 -123399 -63065
$$ packed form
22337A7746L425K5583J2943P248j0244l7439j7996j2860L594q622M7118j0932
22325A9564n592k098l6541l3803n8030M0884M7626j342k0506L8673m5142l9420
22313i5727M1535j1986L2180P2400m230k6026M9308J5262J0950l0051J9257k939
22301F9933J9617n9932l7828k9966n0590O7295j8961q1039K3112P4773M8787m2819
22289a7618N998J6204L6316l2053k2890Q337J1840m859K1678L949j3743j2124
22277A035p150j7356J1812j8915k0540j0820K3843j6899O501K2739L6986q733
22265B503k1908n5008L7952N4377L1614L9073O598o3990q5520p6553J5096Q4946
22253c0820m808j5925L7900Q497l7217m6879j9717L4996j3190o0108K3872O0334
$$ plain form
22241 -63065 -1340 -2646 -78410 -58205 8304 48692 26555 8099 -7833 -79101 -109765 -93756
22229 -93756 -99398 -75755 -64384 -45265 -62702 -34729 13144 39902 -34555 -68472 -22945 -3751
22217 -3751 10342 -2039 -42274 -47533 -59204 -71283 -56494 -34939 -16621 -10268 -41436 -28550
22205 -28550 -48044 -96427 -158105 -198122 -191896 -173032 -206755 -166016 -123092 -90390 -86225 -54524
22193 -54524 -61381 -47795 -27393 22487 48118 -16942 -32276 -62262 -90232 -32937 -66720 -97264
22181 -97264 -124129 -94559 -37148 -32351 -40278 -53280 -11549 -17452 -48874 -19349 31585 72181
22169 72181 96424 71187 51597 23358 -20918 -58781 -39412 -19858 7744 73499 14303 -51219
22157 -51219 -66378 -69354 -48218 7375 -7058 -45475 -64628 -86283 -65604 -87888 -108646 -83587
$$ packed form
22241f3065O1725j306p5764K0205O6509M0388k2137j8456j5932p1268l0664J6009
22229i3756n642K3643J1371J9119j7437K7973M7873K6758p4457l3917M5527J9194
22217c751J4093j2381m0235n259j1671j2079J4789K1555J8318O353l1168J2886
22205b8550j9494m8383o1678m0017O226J8864l3723M0739M2924L2702M165L1701
22193e4524o857J3586K0402M9880K5631o5060j5334k9986k7970N7295l3783l0544
22181i7264k6865K9570N7411M797p927j3002M1731n903l1422K9525N0934M0596
22169G2181K4243k5237j9590k8239m4276l7863J9369J9554K7602O5755n9196o5522
22157e1219j5159k976K1136N5593j4433l8417j9153k1655K0679k2284k0758K5059
$$ plain form
22145 -83587 -40336 -36172 -37732 -39372 -16448 10138 57306 44699 13965 6530 -28948 -75635
22133 -75635 -989 31009 46054 14935 17590 53469 80305 109423 125564 -18951 -123933
22122 -123933 -79391 32396 44568 64432 29933 -4959 -20345 -23383 -1527 -37353 -55361
22111 -55361 -63016 -34850 -70835 -98242 -118596 -113633 -116690 -120774 -116986 -67945 -90480 -74544 -5113
22098 -5113 34650 61032 36693 -4672 13634 60121 16535 9915 77025 62268 93360 64624
22086 64624 80923 54128 -20645 -21428 -1453 9612 30908 3574 7481 59669 95783 49377
22074 49377 -17216 -20079 20381 26842 10743 24826 7546 22916 6463 -14667 -40747 -66903
22062 -66903 -73158 -24986 -18776 -43715 -70372 -67696 -35000 -17296 19510 64189 7108 -48618
$$ packed form
22145h3587M3251M164j560j640K2924K6586M7168j2607l0734p435l5478m6687
22133g5635P4646L1998J5045l1119K655L5879K6836K9118J6141j44515j04982
22122a23933M4542J11787J2172J9864l4499l4892j5386l038K1856l5826j8008
22111e5361p655K8166l5985k7407k0354M963l057m084L788M9041k2535J5936O9431
22098e113L9763K6382k4339m1365J8306M6487m3586o620O7110j4757L1092k8736
22086F4624J6299k6795p4773p83J9975J1065K1296k7334L907N2188L6114m6406
22074D9377o6593k863M0460O461j6099J4083j7280J5370j6453k1130k6080k6156
22062f6903o255M8172O210k4939k6657K676L2696J7704L6806M4679n7081n5726
$$ plain form
22050 -48618 -8840 -6733 -36447 1943 35222 47291 55954 16371 -41880 -66173 -54937 -62483
22038 -62483 -44427 -6712 -929 47962 30744 -31325 -44179 -22012 -42837 -7929 27591 89741
22026 89741 102346 120938 111303 64929 60361 62255 3595 -15753 -28593 -44238 -75745 -30368
22014 -30368 -21054 -29551 -7463 38684 72527 69576 65187 38772 33466 27027 35563 27091 -31444
22001 -31444 -18939 5843 -41897 -39964 -25336 6769 -2606 -14250 -44919 -84399 -41484 19609
21989 19609 57508 109091 119374 72194 -4711 8655 918 -42162 -66302 -62113 7171 -8219
21977 -8219 -3050 -68075 -51123 1929 40050 51391 34854 -13413 -33009 21038 -24830 -54069
21965 -54069 -35577 40293 84728 49862 -1554 -19044 -35604 -9381 21977 43649 1194 -27427
$$ packed form
22050d8618L9778K107k9714L8390L3279J2069Q663l9583n8251k4293J1236p546
22038f2483J8056L7715N783M8891j7218o2069j2854K2167k0825L4908L5520O2150
22026H9741J2605J8592r635m6374m568J894n8660j9348j2840j5645l1507M5377
22014c0368R314q497K2088M6147L3843k951m389k6415n306o439Q536q472n8535
22001c1444J2505K4782m7740J933J4628L2105r375j1644l0669l9480M2915O1093
21989A9609L7899N1583J0283m7180p6905J3366p737m3080k4140M189O9284j5390
21977h219N169o5025J6952N3052L8121J1341j6537m8267j9596N4047m5868k9239
21965e4069J8492P5870M4435l4866n1416j7490j6560K6223L1358K1672m2455k8621
$$ plain form
21953 -27427 -47266 -32973 -31838 -78686 -65185 -17852 2399 -26293 -41960 -44883 -87892 -66757
21941 -66757 1582 34642 35063 29238 12387 -6504 3042 24761 51977 37322 -6384 -65243
21929 -65243 -33892 10954 34565 71687 87927 141832 157816 134881 5001 -55039 -61144 -32967
21917 -32967 56626 52016 41221 78737 92054 133110 111690 77697 87972 45079 33764 -15997
21905 -15997 -47437 -72493 -55623 -88954 -45704 -37177 -49487 -14578 98932 114648 92981 83879
21893 83879 31470 -4419 3723 9743 -50913 -117371 -119091 -110336 -85191 -38499 -9789 -19758 -407
21880 -407 75562 146535 141724 122710 35046 2830 44037 9484 -21424 -64701 -58307 -57330 -26815
21867 -26815 22010 -294 70330 79160 9257 -26722 -37670 -48871 -3074 75213 58347 21544
$$ packed form
21953b7427j9839J4293J135m6848J3501M7333K0251k8692j5667k923m3009K1135
21941f6757O8339L3060M21n825j6851j8891R546K1719K7216j4655m3706n8859
21929f5243L1351M4846K3611L7122J6240N3905J5984k2935j29880o0040o105K8177
21917c2967Q9593m610j0795L7516J3317M1056k1420l3993J0275m2893j1315m9761
21905a5997l1440k5056J6870l3331M3250Q527j2310L4909J13510J5716k1667r102
21893H3879n2409l5889Q142O020o0656o6458j720Q755K5145M6692K8710r969J9351
21880d07P5969P0973m811j9014q7664l2216M1207l4553l0908m3277O394R77L0515
21867b6815M8825k2304P0624Q830o9903l5979j0948j1201M5797P8287j6866l6803
$$ plain form
21855 21544 38769 29370 -20137 37636 100723 48300 24770 39746 -34380 -86269 -76657 -23491
21843 -23491 27723 41194 103650 108272 72598 46375 27423 36971 21528 -24118 -110051 -132911
21831 -132911 -73627 -38601 25 8154 36202 30603 3973 41104 16414 563 28539 47099
21819 47099 42759 42799 49090 21631 6273 -19167 -21171 -19270 -39407 -62252 -79770 -86686 -95492
21806 -95492 -66243 -61131 -55385 -82393 -43949 -46148 -52261 -44091 -28199 -6244 -20409 -7577 27161
21793 27161 41853 -56505 -36645 32542 17928 -39627 -70352 -82754 -80781 -69046 -50839 -103975
21781 -103975 -94704 -63033 -94987 -69796 -60765 -35491 -59329 -75986 -84451 -10031 17039 -24715
21769 -24715 -40005 -36240 -52733 -87671 -36195 -15678 -4183 -41638 -110098 -142416 -36849 6598
$$ packed form
21855B1544J7225r399m9507N7773O3087n2423k3530J4976p4126n1889R612N3166
21843b3491N1214J3471O2456M622l5674k6223j8952R548j5443m5646q5933k2860
21831a32911N9284L5026L8626Q129K8048n599k6630L7131k4690j5851K7976J8560
21819D7099m340M0O291k7459j5358k5440k004J901k0137k2845j7518o916q806
21806i5492K9249N112N746k7008L8444k199o113Q170J5892K1955j4165J2832L4738
21793B7161J4692r8358J9860O9187j4614n7555l0725j2402J973J1735J8207n3136
21781a03975R271L1671l1954K5191R031K5274k3838j6657q465P4420K7070m1754
21769b4715j5290L765j6493l4938N1476K0517J1495l7455o8460l2318J05567M3447
$$ plain form
21757 6598 -5071 27298 53802 65857 40263 28198 -12699 51922 80665 72976 43725 15253
21745 15253 35799 88743 116822 115340 70925 6460 -15134 -43288 -45598 -5211 52161 63764
21733 63764 69117 62371 58400 60012 29458 32700 -28914 -43871 64238 130631 46725 -18422
21721 -18422 5170 41125 21371 -41387 -77891 -53668 -70113 -132036 -106002 -53454 10030 424
21709 424 -9459 -8893 32582 44071 42267 6030 -88566 -71077 -36443 6599 3866 16170 606
21696 606 30744 55428 28736 1708 21640 62711 82611 105203 29093 -53029 -105566 -39128
21684 -39128 51383 70540 32783 21042 83971 146228 173810 146570 106330 68100 23352 -2790
21672 -2790 29139 46219 13886 -57769 -90084 -47218 -1508 5200 -33318 -61503 -31778 -34740
$$ packed form
21757F598j1669L2369K6504J2055k5594j2065m0897O4621K8743p689k9251k8472
21745A5253K0546N2944K8079j482m4415o4465k1594k8154k310M0387N7372J1603
21733F3764N353o746l971J612l0554L242o1614j4957J08109O6393q3906o5147
21721a8422K3592L5955j9754o2758l6504K4223j6445o1923K6034N2548O3484r606
21709D24r883N66M1475J1489j804l6237r4596J7489L4634M3042k733J2304j5564
21696F06L0138K4684k6692k7028J9932M1071J9900K2592p6110q2122n2537O6438
21684c9128R0511J9157l7757j1741O2929O2257K7582k7240m0240l8230m4748k6142
21672b790L1929J7080l2333p1655l2315M2866M5710O708l8518k8185K9725k962
$$ plain form
21660 -34740 -11748 -39832 -75387 -101583 -109012 -86674 -109774 -143095 -83094 -43413 4163 -6786
21648 -6786 -6136 -14986 4088 25342 76204 115525 30164 -17319 -63953 -37753 24660 13434
21636 13434 -37119 -41497 27108 53413 72028 28646 18042 47993 -25456 -32573 -263 61775
21624 61775 23113 -1398 49955 89926 71540 23362 -8730 9883 53059 53798 -41829 -79878
21612 -79878 -130625 -153786 -112171 -65974 -58552 -62954 -55511 -48413 -30066 -16411 -13185 492 2878
21599 2878 -7525 30513 7923 -6618 85458 144799 22907 -101533 -52700 -29852 -79355
21588 -79355 -139165 -143806 -106236 -44755 -42105 -61703 -63801 47830 62212 -12875 33204 29303
21576 29303 25120 -34945 -26526 19783 113692 190154 141896 63400 10822 -29458 -71852 -87823
$$ packed form
21660c4740K2992k8084l5555k6196p429K2338k3100l3321O0001L9681M7576j0949
21648f786O50q850J9074K1254N0862L9321q5361m7483m6634K6200O2413j1226
21636A3434n0553m378O8605K6305J8615m3382j0604K9951p3449p117L2310O2038
21624F1775l8662k4511N1353L9971j8386m8178l2092J8613M3176P39r5627l8049
21612g9878n0747k3161M1615M6197P422m402P443P098J8347J3655L226J3677K386
21599B878j0403L8038k2590j4541R2076N9341j21892j24440M8833K2848m9503
21588g9355n9810m641L7570O1481K650j9598k098J11631J4382p5087M6079l901
21576B9303m183o0065Q419M6309R3909P6462m8258p8496n2578m0280m2394j5971
$$ plain form
21564 -87823 -48305 -44203 -12785 -37266 -47917 -36569 -16836 -25576 -50344 -72822 -163196 -147248
21552 -147248 -75223 -44644 -44730 -95520 -81893 -34913 49954 137474 67328 21362 45588 25021
21540 25021 -67395 -126945 -161833 -68105 -974 3022 35835 37069 21558 19348 -6457 11687
21528 11687 -24044 -41824 13832 -42317 8583 17448 3618 37076 24153 35303 46762 53756
21516 53756 80811 52330 51985 33440 -18033 -71168 -78391 -80165 -73637 -29326 -4263 -10402 41916
21503 41916 72037 61502 30793 57004 33307 15924 34879 34815 20739 58686 59708 56534 49153
21490 49153 10763 -59417 -34858 -12946 84260 96360 14286 -13500 22273 -46574 -48827 -32368
21478 -32368 23156 80771 76537 103099 98160 -5248 -4658 -12792 -29884 -53236 -29858 -35712 -43250
$$ packed form
21564h7823L9518M102L1418k4481j0651J1348J9733q740k4768k2478r0374J5948
21552a47248P2025L0579q6n0790J3627M6980Q4867Q7520p0146m5966K4226k0567
21540B5021r2416n9550l4888R3728O7131L996L2813J234j5511k210k5805J8144
21528A1687l5731j7780N5656n6149N0900Q865j3830L3458j2923J1150J1459O994
21516E3756K7055k8481l45j8545n1473n3135p223j774O528M4311K5063o139N2318
21503D1916L0121j0535l0709K6211k3697j7383J8955o4j4076L7947J022l174p381
21490D9153l8390p0180K4559K1912R7206J2100q2074k7786L5773o8847k253J6459
21478c2368N5524N7615m234K6562m939j03408N90q134j7092k3352K3378n854p538
$$ plain form
21465 -43250 -230 32646 47547 53750 63629 -12147 2607 -24583 -83582 -76395 -39929 8422
21453 8422 1561 -20800 -42475 -54954 -17997 18686 5997 -22461 -15945 -113809 -114763 -115036 -125693
21440 -125693 -121793 -108164 -72131 -59602 -48717 -43140 -45110 -10207 56654 37183 -10805 -29156
21428 -29156 -70543 -48887 -52675 -55649 -32247 -22514 -29689 -59734 -109929 -117317 -129981 -119360 -126629
21415 -126629 -104959 -101830 -79975 -33132 -7642 37761 55406 -9664 -35977 -4525 651 -48192
21403 -48192 -69953 -86070 -61031 15532 -1748 15573 26591 49034 27997 72341 118341 140093
21391 140093 192464 151308 71848 67526 52524 -21235 -20370 13837 44804 -5383 -20094 -29360
21379 -29360 -29245 -3010 -59665 -90000 -78970 -40885 -16205 -35080 -32057 -70129 -112434 -60965
$$ packed form
21465d3250M3020L2876J4901O203R879p5776J4754k7190n8999P187L6466M8351
21453H422o861k2361k1675j2479L6957L6683j2689k8458O516r7864r54k73j0657
21440a25693L900J3629L6033J2529J0885N577j970L4903O6861j9471m7988j8351
21428b9156m1387K1656l788k974K3402R733p175l0045n0195p388j2664J0621p269
21415a26629K1670L129K1855M6843K5490M5403J7645o5070k6313L1452N176m8843
21403d8192k1761j6117K5039P6563j7280J7321J1018K2443k1037M4344M6000K1752
21391A40093N2371m1156p9460m322j5002p3759Q65L4207L0967n0187j4711r266
21379b9360J15K6235n6655l0335J1030L8085K4680j8875L023l8072m2305N1469
$$ plain form
21367 -60965 -8291 24554 28925 26834 74896 5313 -7753 9966 37282 18920 9730 26982
21355 26982 23994 7915 12166 33388 35737 14166 64901 89641 52631 -24961 -49545 -9805
21343 -9805 -21791 -34241 -5510 6948 -29794 -55090 -102946 -42294 12369 99317 122148 99870
21331 99870 71810 49792 16741 -3938 55185 68648 51586 57823 48400 60621 37868 9552
21319 9552 27930 58690 68947 3149 -24033 23567 2563 52165 76841 56385 -12326 -48219
21307 -48219 44349 75394 49588 51509 64373 72738 66319 62030 54741 97639 110365 81551 49084
21294 49084 25237 41091 51102 71889 123661 98499 1201 -41521 -9137 -8549 -15679 -24883
21282 -24883 1835 35785 -20337 -44930 -78354 -110573 -102090 -67980 -9044 15647 32630 9360
$$ packed form
21367f0965N2674L2845M371k091M8062o9583j3066J7719K7316j8362r190J7252
21355B6982k988j6079M251K1222K349k1571N0735K4740l7010p7592k4584L9740
21343i805j1986j2450K8731J2458l6742k5296m7856O0652N4663Q6948K2831k2278
21331I9870k8060k2018l3051k0679N9123J3463j7062O237r423J2221k2753k8316
21319I552J8378L0760J0257o5798k7182M7600k1004M9602K4676k0456o8711l5893
21307d8219R2568L1045k5806J921J2864Q365o419m289p289M2898J2726k8814l2467
21294D9084k3847J5854J0011K0787N1772k5162r7298m2722L2384N88p130r204
21282b4883K6718L3950n6122k4593l3424l2219Q483L4110N8936K4691J6983k3270
$$ plain form
21270 9360 -98419 -73021 -4444 52952 3470 89593 153764 62944 37411 36816 42194 14902
21258 14902 -41012 -11539 78357 97309 89629 47448 -11662 -5660 12042 26894 5593 21984
21246 21984 50349 93890 72686 26342 72073 64408 54638 68022 40337 45148 55399 52435
21234 52435 82288 81070 138455 109513 31523 2769 -58813 -107124 -91514 -58331 3930 15326
21222 15326 -35860 -21552 -84807 -93564 -87614 -110599 -80676 -24121 25140 16303 29888 16731
21210 16731 -103712 -119707 -82971 -112503 -75575 -29017 33002 53804 123131 71208 32408
21199 32408 -27714 -16119 -8410 -11838 25675 7930 -63771 -32587 -17785 -6033 6291 41281
21187 41281 39234 20331 -46316 -115633 -101634 -41217 -42480 -90172 -32648 17126 48735 61985
$$ packed form
21270I360j07779K5398O8577N7396m9482Q6123O4171r0820k5533n95N378k7292
21258A4902n5914K9473Q9896J8952p680m2181n9110O002J7702J4852k1301J6391
21246B1984K8365M3541k1204m6344M5731p665r770J3384k7685M811J0251k964
21234E2435K9853j218N7385k8942p7990k8754o1582m8311J5610L3183O2261J1396
21222A5326n1186J4308o3255q757N950k2985K9923N6555M9261q837J3585j3157
21210A6731j20443j5995L6736k9532L6928M6558O2019K0802O9327n1923l8800
21199C2408o0122J1595P709l428L7513j7745p1701L1184J4802J1752J2324L4990
21187D1281k047j8903o6647o9317J3999O0417j263m7692N7524M9774L1609J3250
$$ plain form
21175 61985 32853 -35346 -51454 3830 40699 34198 70356 135955 134898 61781 2638 9799
21163 9799 31446 33949 -25362 -32767 -31029 -47779 -8943 15255 -6526 11341 21033 70739 123575
21150 123575 88775 69186 28528 73806 81373 68687 13619 14459 40572 -39935 -63469 12777
21138 12777 25053 33514 -12055 -41519 -62038 -21012 -5828 36187 43889 41503 100873 90199
21126 90199 37177 46593 55432 -10257 -30104 3632 67848 89563 83225 14963 -34531 -5166
21114 -5166 6297 39803 22390 20621 67870 83003 62157 59066 53212 80847 46662 5689
21102 5689 -59836 -32467 -17718 44967 60515 32488 -68779 -71937 -70404 -20875 46823 64880
21090 64880 56217 19745 29635 20358 62160 101948 96502 67406 62912 -6051 -63595 -18731 -73123
$$ packed form
21175F1985k9132o8199j6108N5284L6869o501L6158O5599j057p3117n9143P161
21163I799K1647K503n9311p405J738j6750L8836K4198k1781J7867R692M9706N2836
21150A23575l4800j9589m0658M5278P567j2686n5068Q40K6113q0507k3534P6246
21138A2777J2276Q461m5569k9464k0519M1026J5184M2015P702k386N9370j0674
21126I0199n3022R416Q839o5689j9847L3736O4216K1715o338o8262m9494K9365
21114e166J1463L3506j7413j769M7249J5133k0846l091n854K7635l4185m0973
21102E689o5525K7369J4749O2685J5548k8027j01267l158J533M9529O7698J8057
21090F4880q663l6472R890r277M1802L9788n446k9096m494o8963n7544M4864n4392
$$ plain form
21077 -73123 -107696 -41863 -72192 8648 15399 65432 59560 40563 21963 29865 57282 50948
21065 50948 66466 31594 -15581 -55887 -55634 -33393 -11117 -2124 423 37642 43514 60595 50716
21052 50716 60061 69525 12023 -3685 39459 95542 29444 -27691 -49971 -53305 -67833 -84340
21040 -84340 -85961 -51401 -61842 -7408 -11389 25609 97940 74251 21864 40758 84029 32887
21028 32887 16213 -26913 -54108 -13669 12237 12515 32947 29660 49910 18676 7045 62447
21016 62447 121853 79533 3052 -47150 -29515 -16001 -20282 -39175 -53942 3245 1616 -46121
21004 -46121 -106641 -102425 -56517 -25296 -25372 10637 53981 54697 73853 68114 59647 52559 -16067
20991 -16067 -29888 -2146 -2328 -46595 -27573 4458 17981 34850 -19426 12244 54726 76931
$$ packed form
21077g3123l4573O5833l0329Q0840O751N0033n872j8997j8600P902K7417o334
21065E0948J5518l4872m7175m0306K53K2241K2276Q993K547L7219N872J7081r879
21052E0716R345R464n7502j5708M3144N6083o6098n7135k2280l334j4528j6507
21040h4340j621L4560j0441N4434l981L6998P2331k3689n2387J8894M3271n1142
21028C2887j6674m3126k7195M0439K5906K78K0432l287K0250l1234j1631N5402
21016F2447N9406m2320p6481n0202J7635J3514m281j8893j4767N7187j629m7737
21004d6121o0520M216M5908L1221p6L6009M3344P16J9156n739q467p088o8626
20991a6067j3821K7742j82m4267J9022L2031J3523J6869n4276L1670M2482K2205
$$ plain form
20979 76931 95831 34442 -36995 -38032 -45279 -55847 -21053 2298 18280 66402 79233 58504
20967 58504 -8093 -36173 -40369 -85390 -94245 -29413 10640 -25454 -15603 -6253 39250 24622
20955 24622 -15761 2085 42803 -716 -12471 36494 77470 93883 87310 45828 32857 34629
20943 34629 50435 18100 17610 61745 46818 44713 47280 67590 54583 19992 -9969 -56245
20931 -56245 -84396 -127791 -102743 -28941 -43695 -38939 -15245 -24683 2943 59035 58297 94619
20919 94619 113762 117525 93800 87912 98027 126290 124673 112343 53641 461 -17523 -15725
20907 -15725 -13339 -47042 -24781 -43727 -22411 26151 51508 55172 -12015 -64449 -108919 -115018
20895 -115018 -63192 -2859 47200 96525 69511 70236 91330 28237 -13098 -47366 -80516 -100292
$$ packed form
20979G6931J8900o1389p1437j037p247j0568L4794K3351J5982M8122J2831k0729
20967E8504o6597k8080m196m5021q855O4832M0053l6094R851R350M5503j4628
20955B4622m0383J7846M0718m3519j1755M8965M0976J6413o573m1482j2971J772
20943C4629J5806l2335m90M4135j4927k105K567K0310j3007l4591k9961m6276
20931e6245k8151m3395K5048P3802j4754M756K3694r438K7626N6092p38L6322
20919I4619J9143L763k3725n888J0115K8263j617j2330n8702n3180j7984J798
20907a5725K386l3703K2261j8946K1316M8562K5357L664o7187n2434m4470o099
20895a15018N1826O0333N0059M9325k7014P25K1094o3093m1335l4268l3150j9776
$$ plain form
20883 -100292 -51129 -29861 8309 -8288 7806 -5382 -58142 -102055 -81344 -49239 -64922
20872 -64922 -21689 -60882 -34351 -2476 23455 33460 33046 -24807 -51353 -19483 104547 125826
20860 125826 71183 25119 42647 58871 111471 129788 126739 106976 29949 16128 -7073 7172
20848 7172 6640 -19178 -16223 -82684 -93443 -35840 59235 102414 57449 43078 30995 17161
20836 17161 66250 90745 68286 73575 72826 99861 95249 80203 63002 57770 30493 81335 86023
20823 86023 19258 23253 28031 44015 42099 -9616 15753 68627 65262 46663 99433 87980
20811 87980 1084 35919 29773 67055 132786 102507 92444 80074 58281 40290 -21208 -2596
20799 -2596 -4105 -11153 12817 -44800 -120312 -43995 81546 101046 45350 56950 77207 69729
$$ packed form
20883a00292M9163K1268L8170j6597J6094j3188n2760m3913K0711L2105j5683
20872f4922M3233l9193K6531L1875K5931J0005m14n7853k6546L1870J24030K1279
20860A25826n4643m6064J7528J6224N2600J8317l049j9763p7027j3821k3201J4245
20848G172n32k5818K955o6461j0759N7603R5075M3179m4965j4371j2083j3834
20836A7161M9089K4495k2459N289p49K7035m612j5046j7201n232k7277N0842M688
20823H6023o6765L995M778J5984j916n1715K5369N2874l365j8599N2770j1453
20811H7980q6896L4835o146L7282O5731l0279j0063j2370k1793j7991o1498J8612
20799b596j509p048K3970n7617p5512P6317J25541J9500n5696J1600K0257p478
$$ plain form
20787 69729 56083 7903 4839 45188 94879 137163 26235 -42740 16932 68496 58766 54549
20775 54549 54531 70530 113669 120267 108890 88154 76263 23656 -35731 -2965 22352 88357
20763 88357 73480 33890 29903 16482 9971 19743 19057 -17433 -30268 10501 46842 4894 -14116
20750 -14116 19266 64528 62458 47523 21163 -15224 -24674 2754 -50756 -10877 45754 110135
20738 110135 43539 -19198 1747 59245 45654 25779 47421 84170 90924 41212 32197 81290
20726 81290 133905 109218 52683 18913 27840 -9592 -14759 11254 -9349 -15295 14308 58305
20714 58305 91534 65611 47997 72366 74381 95150 123709 147231 117630 95282 109112 103021
20702 103021 105804 95644 64025 62391 7492 -38884 -5810 16839 34013 86075 84665 69215
$$ packed form
20787F9729j3646m8180l064M0349M9691M2284j10928o8975N9672N1564r730m217
20775E4549j8J5999M3139O598j1377k0736j1891n2607n9387L2766K5317O6005
20763H8357j4877l9590l987j3421o511R772o86l6490j2835M0769L6341m1948j9010
20750a4116L3382M5262k070j4935k6360l6387r450K7428n3510L9879N6631O4381
20738A10135o6596o2737K0945N7498j3591j9875K1642L6749O754m9712r015M9093
20726H1290N2615k4687n6535l3770Q927l7432n167K6013k0603n946K9603M3997
20714E8305L3229k5923j7614K4369K015K0769K8559K3522k9601k2348J3830o091
20702A03021K783j0160l1619j634n4899m6376L3074K2649J7174N2062j410j5450
$$ plain form
20690 69215 53781 -12387 -11204 -4832 23540 64034 86414 102466 105551 109843 125834 151603
20678 151603 141101 149222 133145 154447 125654 94857 51467 58881 90769 102966 143729 168649
20666 168649 105900 36727 29445 57841 189044 249242 336901 363646 395989 504552 595515
20655 595515 577225 446390 357139 264274 156449 168571 184942 258847 321462 410016 471709
20644 471709 550038 514332 387489 273734 207076 217359 251219 223183 190545 207686 205398
20633 205398 197985 181281 168339 111036 57741 87390 138451 109717 132426 147257 110628 114846
20621 114846 196291 217117 188746 163750 119306 150998 138147 146557 154784 150725 185181 288588
20609 288588 426765 499410 568244 584614 484249 414556 387319 370081 378811 366433 370550
$$ packed form
20690F9215j5434o6168J183O372K8372M0494K2380J6052L085M292J5991K5769
20678A51603j0502Q121j6077K1302k8793l0797m3390P414L1888J2197M0763K4920
20666A68649o2749o9173p282K8396J31203O0198Q7659K6745L2343J08563R0963
20655E95515j8290j30835q9251r2865j07825J2122J6371P3905O2615Q8554O1693
20644D71709P8329l5706j26843j13755o6658J0283L3860k8036l2638J7141k288
20633B05398p413j6704j2942n7303n3295K9649N1061k8734K2709J4831l6629M218
20621A14846Q1445K0826k8371k4996m4444L1692j2851Q410Q227m059L4456J03407
20609B88588J38177P2645O8834J6370j00365o9693k7237j7238Q730j2378M117
$$ plain form
20598 370550 382452 485310 607093 672961 647076 480668 365681 301963 244209 237188 199791
20587 199791 193054 226973 280787 253197 172305 145499 72248 65637 86265 67407 79988 108472
20575 108472 84840 126779 172869 178311 159016 128128 137568 116247 117767 155087 179033 168350
20563 168350 126048 125594 82817 92955 87883 76894 93127 111454 108532 169932 175653 156084
20551 156084 88279 75429 119102 73193 73779 60209 39855 10107 -1323 36655 38204 57802
20539 57802 70409 130502 186218 182104 135401 137905 187214 187129 137423 105433 103454 138570 133444
20526 133444 74820 47450 90655 94251 93635 78454 73381 119316 172476 199683 168249 162523
20514 162523 120222 82823 106224 101558 139885 167737 127709 137839 118706 112797 107573 95420
$$ packed form
20598C70550J1902J02858J21783O5868k5885j66408j14987o3718n7754p021l7397
20587A99791o737L3919N3814k7590q0892k6806p3251o611K0628j8858J2581K8484
20575A08472k3632M1939M6090N442j9295l0888R440k1321J520L7320K3946j0683
20563A68350m2302m54m2777J0138n072j0989J6233J8327k922O1400N721j9569
20551A56084o7805j2850M3673m5909N86j3570k0354k9748j1430L7978J549J9598
20539E7802J2607O0093N5716m114m6703K504M9309q5m9706l1990j979L5116n126
20526A33444n8624k7370M3205L596o16j5181n073M5935N3160K7207l1434n726
20514A62523m2301l7399K3401m666L8327K7852m0028J0130j9133n909n224j2153
$$ plain form
20502 95420 77745 61208 43814 -22729 -12166 48418 26385 29456 79304 104697 148658 163932
20490 163932 128512 133980 122386 122849 85841 116402 130814 78195 95470 148133 189205 193879
20478 193879 99840 114719 183247 140964 125870 208193 237596 194539 186875 216968 242088 210454
20466 210454 138618 105097 89390 88372 102958 142516 162561 124290 88671 96013 92417 133646
20454 133646 200514 222169 307592 338161 338350 257379 145163 132553 180884 247503 222112 157251
20442 157251 177885 198713 223522 217794 202517 167952 217080 244174 242203 231736 257535 286419
20430 286419 290896 274358 258285 190328 179046 134263 82787 51384 97602 96265 141999 193753
20418 193753 177473 205627 247188 285535 315550 342503 365998 389044 522492 687180 782005
$$ packed form
20502I5420j7675j6537j7394o6543J0563O0584k2033L071M9848K5393M3961J5274
20490A63932l5420N468j1594M63l7008L0561J4412n2619J7275N2663M1072M674
20478A93879r4039J4879O8528m2283j5094Q2323K9403m3057p664L0093K5120l1634
20466B10454p1836l3521j5707j018J4586L9558K0045l8271l5619P342l596M1229
20454A33646O6868K1655Q5423L0569J89q0971j12216j2610M8331O6619k5391o4861
20442A57251K0634K0828K4809n728j5277l4565M9128K7094j971j0467K5799K8884
20430B86419M477j6538j6073o7957j1282m4783n1476l1403M6218j337M5734N1754
20418A93753j6280K8154M1561L8347L0015K6953K3495K3046J33448J64688R4825
$$ plain form
20407 782005 769577 688648 639193 574300 513919 529080 449594 463780 507546 509884 563514 589346
20395 589346 661526 685686 647421 621211 524421 409537 354589 342583 319366 341088 334703
20384 334703 375166 394241 393873 363874 366360 429842 534398 661528 796989 742794 608816
20373 608816 506486 412136 410369 434250 434043 459759 442770 542251 689033 706603 699480 580695
20361 580695 435599 362627 400800 359608 272318 278589 327796 304037 234786 231116 241246 229748
20349 229748 195521 232642 242460 215942 206987 183816 250710 349560 413225 389679 319294 253182
20337 253182 246307 300021 375907 365841 301111 265898 235125 248525 275866 271561 294423 354478
20325 354478 403520 387441 409317 380212 360786 312809 297197 279848 271691 271945 257842 231243
$$ packed form
20407G82005j2428q0929m9455o4893o0381J5161p9486J4186M3766K338N3630K5832
20395E89346P2180K4160l8265k6210r6790j14884n4948j2006k3217K1722o385
20384C34703M0463J9075l68k9999K486O3482J04556J27130J35461n4195j33978
20373F08816j02330r4350j767K3881k07K5716j6989R9481J46782J7570p123j18785
20361E80695j45096p2972L8173m1192q7290O271M9207k3759o9251l670J0130j1498
20349B29748l4227L7121R818k6518q955k3171O6894R8850O3665k3546p0385o6112
20337B53182o875N3714P5886j0066o4730l5213l0773J3400K7341m305K2862O0055
20325C54478M9042j6079K1876k9105j9426m7977j5612j7349q157K54j4103k6599
$$ plain form
20313 231243 204994 247086 221468 268550 319781 380798 391531 347742 374216 410823 425721
20302 425721 436522 428844 381048 349457 357320 334353 326831 397375 412626 381572 396333 423631
20290 423631 437226 426346 427965 454283 527665 603092 667293 740472 824950 831686 837943 875720
20278 875720 873873 900635 816162 782849 751964 826700 849256 901372 931057 956903 906810 901241
20266 901241 844247 749379 698859 662607 608175 597962 544320 540148 561498 579059 597416 592581
20254 592581 557441 525024 525021 558667 628687 671949 598312 605793 690610 663273 662466 686214 767924
20241 767924 807559 847010 929613 1025146 1058248 1032119 1018715 1007092 1011711 1010096 1022065 1021924
20229 1021924 989115 1006994 1006089 1001356 1013148 1047021 1069971 1097837 1034368 935294 845010 751314
$$ packed form
20313B31243k6249M2092k5618M7082N1231O1017J0733m3789K6474L6607J4898
20302D25721J0801p678m7796l1591P863k2967p522P0544J5251l1054J4761K7298
20290D23631J3595j0880J619K6318P3382P5427O4201P3179Q4478O736O257L7777
20278H75720j847K6762q4473l3313l0885P4736K2556N2116K9685K5846n0093n569
20266I01241n6994r4868n0520l6252n4432j0213n3642m172K1350J7561J8357m835
20254E92581l5140l2417lL3646P0020M3262p3637P481Q4817k7337q07K3748Q1710
20241G67924L9635L9451Q2603R5533L3102k6129j3404j1623M619j615J1969j41
20229A021924l2809J7879r05m733J1792L3873K2950K7866o3469r9074r0284r3696
$$ plain form
20217 751314 665184 637263 651863 697882 656159 632500 685719 791997 749152 700444 709114
20206 709114 689545 665701 606583 560995 554181 569272 627052 733444 811844 924062 984659
20195 984659 972564 915826 895019 882797 874575 884262 845301 814014 875869 914249 957485 922822
20183 922822 936530 999014 1033824 1045095 1029894 1096633 1152613 1140421 1137907 1145201 1177664 1198626
20171 1198626 1189717 1247017 1351532 1445910 1501310 1539440 1627361 1770183 1914956 2043718 2321294
20160 2321294 2693641 3014578 3110966 3037160 2970601 3048200 3201266 3281599 3313442 3427621
20150 3427621 3661698 4012906 4538715 5129064 5538761 5776497 6200057 6888642 7866678
20141 7866678 9152638 10839322 13424776 17482538 24148942 35434046 54619266 82314247
$$ packed form
20217G51314q6130k7921J4600M6019m1723k3659N3219J06278m2845m8708Q670
20206G09114j9569k3844n9118m5588o814J5091N7780J06392P8400J12218O0597
20195I84659j2095n6738k0807j2222q222R687l8961l1287O1855L8380M3236l4663
20183I22822J3708O2484L4810J1271j5201O6739N5980j2192k514P294L2463K0962
20171A198626q909N7300J04515R4378N5400L8130Q7921J42822J44773J28762K77576
20160B321294L72347L20937R6388p3806o6559P7599J53066Q0333L1843J14179
20150C427621K34077L51208N25809N90349M09697K37736M23560O88585R78036
20141G866678J285960J686684K585454M057762O666404J1285104J9185220K7694981
$$ plain form
20133 82314247 105437807 99855624 72158436 49190234 36454515 30273138 28113600
20126 28113600 28956181 33130781 42191046 59253820 86757721 115252866 117224331 87283897
20118 87283897 56976356 38279611 27617238 21326339 17561534 15185352 13672035 12684639
20110 12684639 12013058 11537857 11141448 10981925 10873299 10193281 8848741 7639917 6971216
20101 6971216 6778256 6971574 7420852 7903037 8249076 8402136 8509483 8824539 9435662
20092 9435662 10316473 11618264 13725942 17295127 23171882 33074021 50346406 77635018
20084 77635018 106967691 112050341 85316066 57073506 40576927 32455311 29215122
20077 29215122 29477860 32873967 40581218 55461442 80670022 111715123 124753201 101238416
$$ packed form
20133H2314247K3123560n582183k7697188k2968202j2735719o181377k159538
20126B8113600Q42581M174600R060265J7062774K7503901K8495145J971465k9940434
20118H7283897l0307541j8696745j0662373o290899l764805k376182j513317r87396
20110A2684639o71581m75201l96409j59523j08626o80018j344540j208824o68701
20101F971216j92960J93318M49278M82185L46039J53060J07347L15056O11123
20092I435662Q80811J301791K107678L569185N876755R902139J7272385K7288612
20084G7635018K9332673N082650k6734275k8242560j6496579q121616l240189
20077B9215122K62738L396107P707251J4880224K5208580L1045101J3038078k3514785
$$ plain form
20069 101238416 66656193 43143424 29886127 22270920 17665772 14715763 12664787
20062 12664787 11264563 10231889 9599799 9383155 9245732 8555838 7127129 5581869 4486718
20053 4486718 3774673 3388212 3216827 3155702 3069161 3040812 2964042 2839337 2578586 2155008
20043 2155008 1766467 1500002 1269100 1131432 952286 789740 679425 706083 716830 742527
20033 742527 727960 705804 703219 660466 599081 569895 575600 522297 455744 441611 469441 487814
20021 487814 506053 484315 445133 408188 388147 406028 372167 330916 261940 238369 221517
20010 221517 235720 201584 220272 230362 203410 237915 226544 241635 234562 236511 247603 240039
19998 240039 261228 315693 306743 292964 275259 308180 332368 299869 218917 191960 186351 263946
$$ packed form
20069A01238416l4582223k3512769j3257297p615207m605148k950009k050976
20062A2664787j400224j032674o32090k16644j37423o89894j428709j545260j095151
20053D486718p12045l86461j71385o1125q6541k8349p6770j24705k60751m23578
20043B155008l88541k66465k30902j37668j79146j62546j10315K6658J0747K5697
20033G42527j4567k2156k585m2753o1385k9186N705n3303o6553j4133K7830J8373
20021D87814J8239k1738l9182l6945k0041J7881l3861m1251o8976k3571j6852
20010B21517J4203l4136J8688J0090k6952L4505j1371J5091p073J949J1092p564
19998B40039K1189N4465q950j3779j7705L2921K4188l2499q0952k6957n609P7595
$$ plain form
19986 263946 292149 317508 358326 376634 401026 437453 443251 483126 436993 327505 242554
19975 242554 200279 241449 245220 301928 354181 375389 420146 458219 425955 385058 357226 296479
19963 296479 292048 345004 393381 395946 380625 342167 296378 273408 310348 323181 310540 258064
19951 258064 229767 262250 260276 251341 278244 246780 202049 204030 292258 301099 332927 350767
19939 350767 324370 250653 275659 333330 328000 349570 349239 410995 423864 454571 492654 517077
19927 517077 489549 438195 480540 500241 406229 301387 284737 321724 341155 415386 498729
19916 498729 506800 516773 561426 517961 499778 465892 482422 530508 506740 483226 446298 461757
19904 461757 471746 446232 484755 536757 573549 605861 631442 636579 627381 699732 716032 661858
$$ packed form
19986B63946K8203K5359M0818J8308K4392L6427N798L9875m6133j09488q4951
19975B42554m2275M1170L771N6708N2253K1208M4757L8073l2264m0897k7832o0747
19963B96479m431N2956M8377K565j5321l8458m5789k2970L6940J2833j2641n2476
19951B58064k8297L2483j974q935K6903l1464m4731J981Q8228Q841L1828J7840
19939C50767k6397p3717K5006N7671n330K1570l31O1756J2869L0707L8083K4423
19927E17077k7528n1354M2345J9701r4012j04842j6650L6987J9431P4231Q3343
19916D98729Q071R973M4653m3465j8183l3886J6530M8086k3768k3514l6928J5459
19904D61757R989k5514L8523N2002L6792L2312K5581N137r198P2351J6300n4174
$$ plain form
19892 661858 663379 689392 656165 654342 705818 759365 776892 813578 852001 909014 953649 996979
19880 996979 1056478 1062927 1049067 1089612 1215569 1380342 1467929 1596726 1713433 1704766 1724891
19869 1724891 1721670 1711441 1691652 1772940 1894336 2030507 2153165 2306589 2606148 2873446
19859 2873446 3069280 3243388 3387231 3415822 3442273 3490119 3580357 3741545 3926526 4205414
19849 4205414 4555264 4942103 5380822 5931681 6718841 7747804 8956376 10348759 12092252
19840 12092252 14530148 18137689 23518197 31955381 45700739 66922566 92347047 106018725
19832 106018725 93634404 69147829 50410928 39790308 34578791 33018585 34432369
19825 34432369 38953784 48168536 64357583 86656910 102734854 95116788 70511627
$$ packed form
19892F61858J521K6013l3227j823N1476N3547J7527L6686L8423N7013M4635M3330
19880I96979N9499O449j3860M0545J25957J64773Q7587J28797J16707q667K0125
19869A724891l221j0229j9789Q1288J21396J36171J22658J53424K99559K67298
19859B873446J95834J74108J43843K8591K6451M7846R0238J61188J84981K78888
19849D205414L49850L86839M38719N50859P87160J028963J208572J392383J743493
19840A2092252K437896L607541N380508Q437184J3745358K1221827K5424481J3671678
19832A06018725j2384321k4486575j8736901j0620620n211517j560206J413784
19825C4432369M521415R214752J6189047K2299327J6077944p618066k4605161
$$ plain form
19818 70511627 49151674 36001280 28489534 24032886 21412765 19925486 19211357 19193151
19810 19193151 19846562 21677473 25035169 30502204 39545781 54787139 78294999 104610328
19802 104610328 114356530 96515234 70555722 52191134 41557252 36182484 34664927
19795 34664927 36439324 41716494 51970363 69338633 91451874 103793323 91462706
19788 91462706 66236671 46080798 33372228 25308749 20007341 16473130 14063681 12185395
19780 12185395 10405118 8959659 7853725 6953868 6173483 5453223 4954174 4790723 4956160
19771 4956160 5290685 5721051 5887201 5457985 4714583 4103694 3759870 3620453 3424863
19762 3424863 3115545 2781901 2649205 2777774 3146725 3607481 3698167 3324212 2781000 2348388
$$ packed form
19818G0511627k1359953j3150394p511746m456648k620121j487279p14129j8206
19810A9193151O53411J830911L357696N467035R043577J5241358K3507860K6315329
19802A04610328R746202j7841296k5959512j8364588j0633882n374768j517557
19795C4664927J774397N277170J0253869J7368270K2113241J2341449j2330617
19788I1462706k5226035k0155873j2708570q063479n301408l534211k409449j878286
19780A2185395j780277j445459j105934q99857p80385p20260m99049j63451J65437
19771D956160L34525M30366J66150m29216p43402o10889l43824j39417j95590
19762C424863l09318l33644j32696J28569L68951M60756R0686l73955n43212m32612
$$ plain form
19752 2348388 2112987 1916404 1713819 1427630 1176956 997259 821865 730698 638462 566772
19742 566772 489894 466982 369989 375213 427211 400109 348878 328873 360736 450681 443115 348174
19730 348174 309814 317836 262665 175142 94206 69480 111852 119971 111958 169191 196236 243741
19718 243741 288506 248619 159923 144862 123218 86861 82897 125193 154942 142989 115202 41839
19706 41839 15566 84636 62560 56602 85924 61728 -25631 -5868 4752 -6937 -20738 -24101
19694 -24101 -10549 58132 82201 124893 203420 175049 123952 55789 57907 78232 118862 111646
19682 111646 178211 244671 219867 82871 -21651 -18465 -22631 31275 82514 131632 156061
19671 156061 121765 110611 103526 92522 58842 76794 105516 113735 149410 192736 229097 208410
$$ packed form
19752B348388k35401j96583k02585k86189k50674j79697j75394r1167r2236p1690
19742E66772p6878k2912r6993N224N1998k7102n1231k0005L1863Q9945p566r4941
19730C48174l8360Q022n5171q7523q0936k4726M2372Q119q013N7233K7045M7505
19718B43741M4765l9887q8696j5061k1644l6357l964M2296K9749j1953k7787p3363
19706D1839k6273O9070k2076n958K9322k4196q7359J9763J0620j1689j3801l363
19694b4101J3552O8681K4069M2692P8527k8371n1097o8163K118K0325M0630p216
19682A11646O6565O6460k4804j36996j04522L186m166N3906N1239M9118K4429
19671A56061l4296j1154p085j1004l3680J7952K8722Q219L5675M3326L6361k0687
$$ plain form
19659 208410 75561 4829 -57624 -83732 -111033 -75504 -46683 -65498 -86401 -85556 -73249 -63210
19647 -63210 -67046 -55922 -49906 -70965 -38276 -31558 -31438 -55115 -59075 -68634 -97713 -93075 -46262
19634 -46262 -21607 -33215 -55904 -42308 -37483 -10716 22929 68997 70420 -9504 -44166 -27580
19622 -27580 -8620 -17699 -127055 -123252 -80520 -56612 -74718 -85515 -33986 -30325 -14887 5310
19610 5310 14691 18278 28122 66569 128596 173704 258260 350203 403817 260600 178559 143383
19598 143383 119447 107347 100215 122475 197553 238285 265466 318987 271839 245338 214499 100413
19586 100413 56539 36843 29824 46827 42865 28238 76614 43442 25487 -5405 -13147 -23058
19574 -23058 16124 -13907 -64965 -122739 -117353 -113255 -70123 -62309 -58567 -224 61868 49886
$$ packed form
19659B08410j32849p0732o2453k6108k7301L5529K8821j8815k0903Q45J2307J0039
19647f3210l836J1124O016k1059L2689O718J20k3677l960r559k9079M638M6813
19634d6262K4655j1608k2689J3596M825K6767L3645M6068J423p9924l4662J6586
19622b7580J8960r079j09356L803M2732K3908j8106j0797N1529L661J5438K0197
19610E310R381L587R844L8447O2027M5108Q4556R1943N3614j43217q2041l5176
19598A43383k3936j2100p132K2260P5078M0732K7181N3521m7148k6501l0839j14086
19586A00413m3874j9696p019J7003l962j4627M8376l3172j7955l0892p742r911
19574b3058L9182l0031n1058n7774N386M098M3132P814L742N8343O2092j1982
$$ plain form
19562 49886 74354 82160 75608 50988 70396 157640 303315 373853 487591 422029 258148
19551 258148 184923 192544 112282 67305 100976 135963 153755 198713 291146 372562 453135 382029
19539 382029 241716 120290 928 -32671 -44600 -97286 -88094 -57195 -61187 -44434 -61178
19528 -61178 -65126 -77318 -53752 -60566 -106434 -84334 -45089 -79899 -118660 -84538 -5023 -15356
19516 -15356 -44959 -121907 -133718 -31308 927 -60879 -45651 -1498 -13905 -1625 34874
19505 34874 -13036 -66335 -85174 -114000 -99856 -76063 -53540 -4778 -19325 -34496 -3209 -13742
19493 -13742 -70258 -124454 -148874 -125274 -123567 -134647 -180513 -152949 -83376 -67820 -83379 -62676
19481 -62676 -87782 -99591 -21285 -3281 16716 22816 -4082 -13749 -14108 60519 49870 993
$$ packed form
19562D9886K4468P806o552k4620J9408Q7244J45675P0538J13738o5562j63881
19551B58148p3225P621q0262m4977L3671L4987J7792M4958R2433Q1416Q0573p1106
19539C82029j40313j21426j19362l3599j1929n2686R192L0899l992J6753j6744
19528f1178l948j2192K3566o814m5868K2100L9245l4810l8761L4122P9515j0333
19516a5356k9603p6948j1811J02410L2235o1806J5228M4153j2407J2280L6499
19505C4874m7910n3299j8839k8826J4144K3793K2523M8762j4547j5171L1287j0533
19493a3742n6516n4196k4420K3600J707j1080m5866K7564O9573J5556j5559K0703
19481f2676k5106j1809P8306J8004J9997O100k6898r667l59P4627j0649m8877
$$ plain form
19469 993 -67083 -120953 -77355 -66947 -50496 -84759 -127048 -82670 -141386 -136918 -131238 -131007 -84270
19456 -84270 -83664 -20198 66646 50730 -42473 -124059 -121674 -39732 6829 -23946 -72367 -10658
19444 -10658 36153 -7557 -48220 -75304 -105461 -106197 -51361 9525 1695 -7776 71539 84648
19432 84648 120766 125910 77569 89556 31206 -25032 -19857 -13726 -45884 -91533 -39168 38064
19420 38064 23474 -27860 -60130 -41725 -59433 -43929 -40073 -18880 25340 22988 15599 -22944
19408 -22944 -29821 -41513 -45691 3356 70707 28543 -65389 -90849 -109928 -153137 -155237 -156633
19396 -156633 -131522 -214571 -237122 -182098 -136682 -125496 -93899 -81061 -59463 -75588 -91245
19385 -91245 -72765 -75357 -87779 -113604 -71511 -105206 -86386 -80222 -80035 -90391 -74288 -60507
$$ packed form
19469I93o8076n3870M3598J0408J6451l4263m2289M4378n8716M468N680K31M6737
19456h4270O06O3466Q6844j5916r3203q1586K385Q1942M6561l0775m8421O1709
19444a0658M6811m3710m0663k7084l0157p36N4836O0886p830r471P9315J3109
19432H4648L6118N144m8341J1987n8350n6238N175O131l2158m5649N2365P7232
19420C8064j4590n1334l2270J8405j7708J5504L856K1193M4220k352p389l8543
19408b2944o877j1692m178M9047O7351m2164r3932k5460j9079m3209k100j396
19396a56633K5111q3049k2551N5024M5416J1186L1597J2838K1598j6125j5657
19385i1245J8480k592j2422k5825M2093l3695J8820O164J87j0356J6103J3781
$$ plain form
19373 -60507 -25786 -44334 -90147 -109489 -97880 -131402 -136588 -117991 -90633 -110438 -93005 -40744
19361 -40744 -33698 -53605 -24494 -22416 -1623 -5050 -66109 -103912 -88021 -27857 33694 82
19349 82 -22526 -75340 -55861 10492 -10840 -111502 -115427 -112105 -171186 -166951 -137113 -167584 -164203
19336 -164203 -150716 -115546 -117430 -85588 -84033 -77444 -75044 -96944 -51613 -80433 -54422 -80682
19324 -80682 -69520 -26137 -37453 -34212 22634 -2633 -5379 -47559 -1821 29631 -21643 -97549
19312 -97549 -170948 -157673 -110231 -97275 -112830 -78648 -36213 -49923 -105144 -126732 -64970 -71450
19300 -71450 -66852 -69124 -86396 -19403 -8564 -72290 -103657 -139069 -128856 -107253 -113268 -94697
19288 -94697 -103727 -88669 -109063 -170163 -167384 -160826 -138155 -97700 -76354 -66476 -56945 -82815 -58214
$$ packed form
19373f0507L4721j8548m5813j9342J1609l3522n186J8597K7358j9805J7433N2261
19361d0744P046j9907K9111K078K0793l427o1059l7803J5891O0164O1551l3612
19349H2k2608n2814J9479O6353k1332j00662l925L322n9081M235K9838l0471L381
19336a64203J3487L5170j884L1842J555O589K400k1900M5331k8820K6011k6260
19324h0682J1162M3383j1316L241N6846k5267k746m2180M5738L1452n1274p5906
19312i7549p3399J3275M7442J2956j5555L4182M2435j3710n5221k1588O1762o480
19300g1450M598k272j7272O6993J0839o3726l1367l5412J0213K1603o015J8571
19288i4697r030J5058k0394o1100K779O558K2671M0455K1346R878R531k5870K4601
$$ plain form
19275 -58214 -49031 -43776 -1549 16328 -644 -7113 -9257 -2376 -24507 -3219 19701 47921 27165
19262 27165 10359 -14486 -23046 36732 99402 111574 91019 120819 178560 335890 432040 444086
19250 444086 366316 217383 161729 85698 44200 51922 85644 194863 357593 467537 467005
19239 467005 398269 273444 171673 98409 101642 141417 110970 78090 62554 24623 46476
19228 46476 88446 110177 97713 116489 220827 401091 546253 529772 372416 258917 192964
19217 192964 154729 119375 152302 130801 166998 269864 357482 441828 448818 324660 214662
19206 214662 116823 61283 81932 115413 49888 -22990 -35667 -40481 -45114 -71076 -70211 -67401
19194 -67401 -16802 -35712 -57519 -57615 -94819 -61714 -49765 -58687 -60925 -59036 -77852 -115242 -130809
$$ packed form
19275e8214R183N255M2227J7877j6972o469k144O881k2131K1288K2920K8220k0756
19262B7165j6806k4845q560N9778O2670J2172k0555K9800N7741J57330R6150J2046
19250D44086p7770j48933n5654p6031m1498P722L3722J09219J62730J09944n32
19239D67005o8736j24825j01771p3264L233L9775l0447l2880j5536l7931K1853
19228D6476M1970K1731j2464J8776J04338J80264J45162j6481j57356j13499o5953
19217A92964l8235l5354L2927k1501L6197J02866Q7618Q4346O990j24158j09998
19206B14662r7839n5540K0649L3481o5525p2878j2677m814m633k5962Q65K810
19194f7401N0599j8910k1807r6l7204L3105J1949q922k238J889j8816l7390j5567
$$ plain form
19181 -130809 -153546 -154796 -143087 -114593 -58605 -2060 -64312 -102189 -90230 -125495 -165495 -154754
19169 -154754 -189997 -151866 -101546 -53483 8817 -44908 -137541 -108723 -128790 -109926 -58257
19158 -58257 -8531 38023 67035 17250 -555 -60735 -96757 -131049 -157439 -125305 -64976 -46684
19146 -46684 -48674 -71055 -69094 -47373 -76539 -95584 -60199 -62691 -75186 -77102 -64082 -39789
19134 -39789 -42650 -72220 -63554 -88701 -64676 -80849 -19793 71222 44180 -28643 -16678 -27665
19122 -27665 -30779 -60642 -47862 -57706 -113910 -161160 -185454 -186533 -125773 -43383 -35588 -32096 -15963
19109 -15963 -15590 -41158 -36762 -35375 -40338 -46103 -61760 -92448 -106010 -125763 -137083 -132330 -73971
19096 -73971 -88791 -101690 -76150 -38282 -18700 -37250 -31403 -24600 -33826 -122288 -145584 -146595
$$ packed form
19181a30809k2737j250J1709K8494N5988N6545o2252l7877J1959l5265m0000J0741
19169a54754l5243L8131N0320M8063O2300n3725r2633K8818k0067J8864N1669
19158e8257M9726M6554K9012m9785j7805o0180l6022l4292k6390L2134O0329J8292
19146d6684j990k2381J961K1721k9166j9045L5385k492j2495j916J3020K4293
19134c9789k861k9570Q666k5147K4025j6173O1056R1015k7042p2823J1965j0987
19122b7665l114k9863J2780r844n6204m7250k4294j079O0760Q2390P795L492J6133
19109a5963L73k5568M396J387m963n765j5657l0688j3562j9753j1320M753N8359
19096g3971j4820j2899K5540L7868J9582j8550N847O803r226q8462k3296j011
$$ plain form
19084 -146595 -68948 -52448 -22780 -92219 -88714 -22910 7672 -2775 -30603 -22530 -19112 -28067
19072 -28067 -69045 -94357 -29458 10735 -21463 -51945 -43973 -40405 -60195 -55159 -100302 -106742
19060 -106742 -69432 -13264 -41407 -85800 -26139 -22849 -15138 -5011 9994 -22520 -54798 -33861
19048 -33861 -45914 -72958 -80179 -17699 9432 -149 -19024 2753 -2631 -2037 3315 8851 -20475
19035 -20475 10510 48000 12688 -48349 -103806 -85443 -82895 -15333 34206 -55871 -57361 -54618
19023 -54618 -74384 -107908 -178314 -185494 -181286 -130691 -92316 -46059 -65084 -92611 -100284 -91750
19011 -91750 -28834 13714 -41081 -38232 -30283 -57909 -43792 26686 20993 -3547 -31536 -79098
18999 -79098 -146845 -183777 -162442 -158263 -178633 -148673 -121483 -139173 -134505 -157079 -117816 -82421
$$ packed form
19084a46595P7647J6500K9668o9439L505O5804L0582j0447k7828Q073L418q955
19072b8067m0978k5312O4899M0193l2198l0482P972L568j9790N036m5143o440
19060a06742L7310N6168k8143m4393N9661L290P711J0127J5005l2514l2278K0937
19048c3861j2053k7044p221O2480K7131r581j8875K1777n384N94N352N536k9326
19035b0475L0985L7490l5312o1037n5457J8363K548O7562M9539r0077j490K743
19023e4618j9766l3524p0406p180M208N0595L8375M6257j9025k7527p673Q534
19011i1750O2916M2548n4795K849P949k7626J4117P0478n693k4540k7989m7562
18999g9098o7747l6932K1335M179k0370K9960K7190j7690M668k2574L9263L5395
$$ plain form
18987 -82421 -66871 -84656 -88300 -117447 -148474 -147819 -79266 -45021 -76301 -108213 -17955 24351
18975 24351 -31832 -90149 -114293 -89485 -16949 52193 33734 53658 59988 51604 -8355 -68079
18963 -68079 -111006 -127269 -142623 -107147 -76639 -37791 -112854 -148169 -113397 -12977 -21576 -37977
18951 -37977 -37299 -31938 -56903 -44764 -73927 -56436 -86975 -103327 -81496 -104500 -127328 -91843
18939 -91843 -66068 -76967 -109854 -149311 -153052 -102843 -54870 -61119 -78499 -42020 -10783 46441
18927 46441 91823 106349 95935 45003 -3155 -18562 1376 -23730 -56387 -67920 -81065 -77728
18915 -77728 -20278 -125 -62010 -58177 -3757 76424 37587 -46114 -551 46548 2306 -27621
18903 -27621 -40322 16543 -10402 9011 81239 81265 94791 89793 47989 28397 40581 65816
$$ packed form
18987h2421J5550j7785l644k9147l1027O55O8553L4245l1280l1912R0258M2306
18975B4351n6183n8317k4144K4808P2536O9142j8459J9924O330q384n9959n9724
18963f8079m2927j6263j5354L5476L0508L8848p5063l5315L4772J00420q599j6401
18951c7977O78N361k4965J2139k9163J7491l0539j6352K1831k3004k2828L5485
18939i1843K5775j0899l2887l9457l741N0209M7973o249j7380L6479L1237N7224
18927D6441M5382J4526j0414n0932m8158j5407J9938k5106l2657j1533j3145L337
18915g7728N7450K0153o1885L833N4420Q0181l8837q3701M5563M7099m4242k9927
18903b7621j2701N6865k6945J9413P2228K6J3526m998m1804j9592J2184K5235
$$ plain form
18891 65816 110097 172976 147573 157967 218539 284360 288010 300578 327899 379639 441206 476216
18879 476216 559937 662470 633751 528313 446773 327367 352356 411906 417364 422809 422357 444729
18867 444729 542871 576696 565385 569230 596105 637769 685591 729692 652247 551671 483364
18856 483364 436228 398180 405141 449586 483659 442832 354168 282807 229438 127072 125881 119804
18844 119804 82654 57952 85107 85222 98511 112564 56943 130713 194587 173745 148127 282557
18832 282557 332145 323096 314375 271897 235999 266636 266650 219583 241866 310063 432891 541946
18820 541946 655832 680555 528331 447740 422302 440277 519743 660309 733104 664867 550570
18809 550570 415044 345096 277311 345982 451194 584935 652798 586112 426921 342037 352499
$$ packed form
18891F5816M4281O2879k5403J0394O0572O5821L650J2568K7321N1740O1567L5010
18879D76216Q3721J02533k8719j05438q1540j19406K4989N9550N458N445m52K2372
18867D44729R8142L3825j1311L845K6875M1664M7822M4101p7445j00576o8307
18856D83364m7136l8048O961M4445L4073m0827q8664p1361n3369j02366j191o077
18844A19804l7150k4702K7155J15J3289J4053n5621P3770O3874k0842k5618J34430
18832B82557M9588r049q721m2478l5898L0637J4m7067K2283O8197J22828J09055
18820E41946J13886K4723j52224q0591k5438J7975P9466J40566P2795o8237j14297
18809E50570j35526o9948o7785O8671J05212J33741O7863o6686j59191q4884J0462
$$ plain form
18798 352499 339127 293185 247204 240623 251166 193021 145530 117335 135294 167786 117791 108650
18786 108650 81263 31715 -17873 -51256 -78468 -14814 79318 112837 82680 55020 86399
18775 86399 98629 92683 49384 65205 135217 177332 277110 418593 669579 877921 722076
18764 722076 487196 308364 236647 168918 95378 34781 68828 86955 87398 62492 132055
18753 132055 172310 224910 296055 315997 328679 283108 310675 289879 269954 367056 339167
18742 339167 273278 284448 280120 300415 322360 372302 386733 351056 309767 375409 425316 411409
18730 411409 373075 305187 206627 189663 158647 117540 86860 41079 20646 57596 91952
18719 91952 164963 209706 231438 177931 175410 177615 163326 201786 223902 264515 286983 359371
$$ packed form
18798C52499j3372m5942m5981o581J0543n8145m7491k8195J7959L2492m9995r141
18786A08650k7387m9548m9588l3383k7212O3654R4132L3519l0157k7660L1379
18775H6399J2230n946m3299J5821P0012M2115R9778J41483K50986K08342j55845
18764G22076k34880j78832p1717o7729p3540o0597L4047J8127M43k4906O9563
18753A32055M0255N2600P1145J9942J2682m5571K7567k0796j9925R7102k7889
18742C39167o5889J1170m328K0295K1945M9942J4431l5677m1289O5642M9907j3907
18730D11409l8334o7888r8560j6964l1016m1107l0680m5781k0433L6950L4356
18719I1952P3011M4743K1732n3507k521K205j4289L8460K2116M0613K2468P2388
$$ plain form
18707 359371 396647 368137 302961 252573 268445 286198 265903 263260 315626 306249 343355 348391
18695 348391 332220 314470 295102 306894 313599 273007 204401 172349 197916 189168 183796 142621
18683 142621 145147 184641 228985 241678 201302 136869 114140 46211 1364 -5129 27503 64737
18671 64737 113819 74295 48208 60940 16477 -16062 -25884 -31155 -79341 -56793 2890 -8880
18659 -8880 -91507 -124930 -110194 -76676 -33867 -9225 -22582 9590 66520 77758 -18215 23289
18647 23289 80002 47591 -24627 -21898 4402 41553 20350 -7022 -22737 50683 41872 -46572
18635 -46572 -52318 39585 71740 59430 1018 -13086 -13986 7293 442 -57134 -56164 -7285 -27364
18622 -27364 19968 21847 14882 40961 17813 34021 57278 78787 60691 42172 43748 55607
$$ packed form
18707C59371L7276k8510o5176n0388J5872J7753k0295k643N2366r377L7106N036
18695C48391j6171j7750j9368J1792O705m0592o8606l2052K5567q748n372m1175
18683A42621K526L9494M4344J2693m0376o4433k2729o7929m4847o493L2632L7234
18671F4737M9082l9524k6087J2732m4463l2539r822n271m8186K2548N9683j1770
18659h880q2627l3423J4736L3518M2809K4642j3357L2172N6930J1238r5973M1504
18647B3289N6713l2411p2218K729K6300L7151k1203k7372j5715P3420q811q8444
18635d6572n746R1903L2155j2310n8412j4104r00K1279o851n7576R70M8879k0079
18622b7364M7332J879o965K6079k3148J6208K3257K1509j8096j8519J576J1859
$$ plain form
18610 55607 42161 9446 -1321 -7470 11734 22696 50139 79685 73792 88301 133479 117188
18598 117188 153336 221961 277179 264360 221560 153577 140333 109821 66416 84513 97879
18587 97879 81606 65555 82149 122061 147122 199610 246914 211506 148252 120383 137372 133149
18575 133149 61533 57536 85779 104040 129333 159460 118658 91183 65983 81843 73640 47221
18563 47221 76006 51619 19224 47490 122195 143483 133886 156317 209619 278322 353785 409959
18551 409959 547281 627484 643109 612362 492698 449581 389258 402942 468142 452054 392448
18540 392448 371206 338515 305181 251152 216980 103294 48287 72026 103129 43084 38981
18529 38981 65796 108730 104693 97930 145031 185127 297219 326554 321331 406478 564396 644337
$$ packed form
18610E5607j3446l2715j0767o149J9204J0962K7443K9546n893J4509M5178j6291
18598A17188L6148O8625N5218j2819m2800o7983j3244l0512m3405J8097J3366
18587I7879j6273j6051J6594L9912K5061N2488M7304l5408o3254k7869J6989m223
18575A33149p1616l997K8243J8261K5293L0127m0802k7475k5200J5860q203k6419
18563D7221K8785k4387l2395K8266P4705K1288r597K2431N3302O8703P5463N6174
18551D09959J37322Q0203J5625l0747j19664m3117o0323J3684O5200j6088n9606
18540C92448k1242l2691l3334n4029l4172j13686n5007K3739L1103o0045m103
18529C8981K6815M2934m037o763M7101M0096J12092K9335n223Q5147J57918P9941
$$ plain form
18517 644337 574631 464026 348284 309851 300894 278258 228961 221572 214654 213006 252252 324005
18505 324005 319640 333371 444893 542691 619874 686047 690951 578057 504434 441462 344124
18494 344124 314600 290142 247532 249401 229457 255443 212421 122380 152683 241498 226492 175651
18482 175651 144359 191379 222482 308999 294653 273984 262051 245781 220999 340060 540264
18471 540264 713475 862422 907855 814834 682548 573822 491087 423367 361585 390518 416552
18460 416552 459743 463413 437453 485586 503819 485393 523767 493043 481197 449811 459882 433714
18448 433714 482629 449491 418337 355171 376765 455732 490873 507857 580249 668377 755755
18437 755755 702768 617812 629418 661077 598857 596437 726942 799524 740646 732222 768660 811882
$$ packed form
18517F44337o9706j10605j15742l8433q957k2636m9297p389o918j648L9246P1753
18505C24005m365J3731J11522R7798P7183O6173M904j12894p3623o2972r7338
18494C44124k9524k4458m2610J869j9944K5986m3022r0041L0303Q8815j5006n0841
18482A75651l1292M7020L1103Q6517j4346k0669j1933j6270k4782J19061K00204
18471E40264J73211J48947M5433r3021j32286j08726q2735o7720o1782K8933K6034
18460D16552M3191L670k5960M8133J8233j8426L8374l0724j1846l1386J0071k6168
18448D33714M8915l3138l1154o3166K1594P8967L5141J6984P2392Q8128Q7378
18437G55755n2987q4956J1606L1659o2220k420J30505P2582n8878q424L6438M3222
$$ plain form
18425 811882 887294 1030410 1199972 1381527 1436119 1375245 1205740 1053911 1057831 1117556 1133885
18414 1133885 1237285 1249018 1234986 1237793 1298487 1415700 1519620 1588451 1719880 2045718
18404 2045718 2532526 3259487 4513686 6357015 8013244 8165757 7170802 6092499 5002096
18395 5002096 4014162 3275006 2873471 2785088 2819890 2993284 3269709 3646089 4098605 4404038
18385 4404038 4315350 3990357 3675923 3645661 3820094 4050260 4326005 4597510 4855287 4922938
18375 4922938 4850716 4809553 4990367 5296199 5716531 6409640 7638306 9775142 13368906
18366 13368906 18676304 23591335 23951067 20090043 16363944 14076315 13044620 12899838
18358 12899838 13385472 14291840 15282475 16226346 17269031 19036029 22073674 26850692 34643972
$$ packed form
18425H11882P5412J43116J69562J81555N4592o0874j69505j51829L920N9725J6329
18414A133885J03400J1733j4032K807O0694J17213J03920O8831J31429L25838
18404B045718M86808P26961J254199J843329J656229J52513r94955j078303j090403
18395E002096r87934p39156m01535q8383L4802J73394K76425L76380M52516L05433
18385D404038q8688l24993l14434l0262J74433K30166K75745K71505K57777O7651
18375D922938p2222m1163J80814L05832M20332O93109J228666K136836L593764
18366A3368906N307398M915031L59732l861024l726099k287629j031695j44782
18358A2899838M85634R06368R90635R43871J042685J766998L037645M777018P793280
$$ plain form
18349 34643972 47415937 69143052 107052572 167547283 235317815 261183880 232864461
18342 232864461 192128993 149887200 108716335 79003728 61683295 51920345 46655924
18335 46655924 44972459 47111380 54069093 66644795 81426949 86558059 73510354 53613110
18327 53613110 38859943 30104122 25079934 21998010 19821647 18046669 16616251 15461244
18319 15461244 14406172 13343538 12455028 11906346 11830415 12092275 12582185 13095575 13570927
18310 13570927 14477606 16015003 18403742 22202856 28390286 38497403 54509770 75344812
18302 75344812 90684424 86811273 69576522 54595428 46263092 42776411 43160694 47577889
18294 47577889 56995113 74049533 103743365 150779313 210994663 271905729 321598414
$$ packed form
18349C4643972J2771965K1727115L7909520O0494711O7770532K5866065k8319419
18342B32864461m0735468m2241793m1170865k9712607j7320433r762950n264421
18335D6655924j683465K138921O957713J2575702J4782154N131110j3047705j9897244
18327E3613110j4753167q755821n024188l081924k176363j774978j430418j155007
18319A5461244j055072j062634q88510n48682p5931K61860M89910N13390M75352
18310A3570927R06679J537397K388739L799114O187430J0107117J6012367K0835042
18302G5344812J5339612l873151j7234751j4981094q332336l486681L84283M417195
18294D7577889R417224J7054420K9693832M7035948O0215350O0911066M9692685
$$ plain form
18287 321598414 322433769 249655874 163002292 107117232 76021266 58226614 47491591
18280 47491591 40460064 35219431 30821111 27187667 24321458 22066455 20135630 18618242
18272 18618242 18131916 19156759 22318411 28144302 35022885 36673685 29756963 21071734
18264 21071734 15312656 11989283 10049907 8888894 8158697 7584487 7164303 6925140 6765668
18255 6765668 6405194 5586519 4723403 4044203 3529390 3182631 2892726 2687655 2554413
18246 2554413 2362648 2197802 2033841 1904799 1844953 1771966 1666386 1578892 1647524 1687502
18236 1687502 1691448 1643894 1515083 1424200 1419786 1368156 1312429 1251921 1125422 1038780 984582
18225 984582 964794 951725 940968 921515 869479 853473 902348 919909 971652 954937 944183
$$ packed form
18287C21598414Q35355p2777895q6653582n5885060l1095966j7794652j0735023
18280D7491591p031527n240633m398320l633444k866209k255003j930825j517388
18272A8618242m86326J024843L161652N825891O878583J650800o916722q685229
18264B1071734n759078l323373j939376j161013p30197n74210m20184k39163j59472
18255F765668l60474q18675q63116o79200n14813l46759k89905k05071j33242
18246B554413j91765j64846j63961j29042n9846p2987j05580q7494O8632L9978
18236A687502L946m7554j28811r0883m414n1630n5727o0508j26499q6642n4198
18225I84582j9788j3069j0757j9453n2036j6006M8875J7561N1743j6715j0754
$$ plain form
18214 944183 910948 861384 835184 884457 947361 962488 977610 916448 829240 834302 924380 1050363
18202 1050363 1102823 1140693 1100942 999540 938008 956095 1019954 1022571 942285 865176 761113
18191 761113 731463 762340 788772 857453 881621 855126 749037 656198 679440 661684 568919
18180 568919 574524 560074 490291 497669 580607 606376 593639 571136 579338 531383 568796 604196
18168 604196 635923 631661 602156 602315 602473 731662 810793 831022 997305 1045545 1015441 968780
18156 968780 975713 992313 980460 1046677 1151760 1179648 1154091 1068539 1085081 1092013 1136623 1229256
18144 1229256 1311409 1195885 1079648 1050950 990836 1003151 1030831 943700 933667 945881 989236
18133 989236 1065221 1138618 1239126 1318157 1417669 1569095 1748884 1953348 2148578 2356436
$$ packed form
18214I44183l3235m9564k6200M9273O2904J5127J5122o1162q7208N062R0078J25983
18202A050363N2460L7870l9751j01402o1532J8087O3859K617q0286p7109j04063
18191G61113k9650L0877K6432O8681K4168k6495j06089r2839K3242j7756r2765
18180E68919N605j4450o9783P378Q2938K5769j2737k2503Q202m7955L7413L5400
18168F04196L1727m262k9505J59J58J29189P9131K0229J66283M8240l0104m6661
18156I68780O933J6600j1853O6217J05083K7888k5557q5552J6542O932M4610R2633
18144A229256Q2153j15524j16237k8698o0114J2315K7680q7131j0033J2214M3355
18133I89236P5985P3397J00508P9031R9512J51426J79789K04464J95230K07858
$$ plain form
18123 2356436 2542798 2699839 2981921 3357463 3892637 4647969 5560818 6925966 8910926
18114 8910926 11797303 16371685 24086157 37935830 63973158 106744533 146399358 135677956
18106 135677956 87094847 51564785 33248175 23797204 18431701 15054765 12701628
18099 12701628 10745073 9202062 8024420 7103962 6204712 5289131 4463015 3850612 3338885
18090 3338885 2941046 2636242 2359375 2143377 1938746 1766855 1671303 1643841 1603952 1565099
18080 1565099 1487639 1441597 1362798 1270648 1266926 1245404 1159261 1127575 1144402 1142957 1102412 1125465
18068 1125465 1151977 1168769 1264694 1478284 1796004 2181612 2592451 2942585 3524380 4263589
18058 4263589 4826855 4644788 3875939 3135878 2593504 2241199 2014922 1926713 1850347 1758492
$$ packed form
18123B356436J86362J57041K82082L75542N35174P55332R12849J365148J984960
18114H910926K886377M574382P714472J3849673K6037328M2771375L9654825j0721402
18106A35677956m8583109l5530062j8316610r450971n365503l376936k353137
18099A2701628j956555j543011j177642r20458q99250r15581q26116o12403n11727
18090C338885l97839l04804k76867k15998k04631j71891r5552k7462l9889l8853
18080A565099p7460m6042p8799r2150l722k1522q6143l1686J6827j445m0545K3053
18068A125465K6512J6792R5925K13590L17720L85608M10839L50134N81795P39209
18058D263589N63266j82067p68849p40061n42374l52305k26277q8209p6366r1855
$$ plain form
18048 1758492 1694603 1619079 1583508 1599995 1618219 1641374 1743518 1979774 2140406 2319673
18038 2319673 2311907 2328283 2475878 2648148 2842441 3212683 3665881 4232597 5094905 6333417
18028 6333417 7782076 8932644 9446020 9838265 10904681 12955417 16300490 21592819
18020 21592819 30424154 45893564 71611025 103273646 117032269 95512012 63987301
18013 63987301 43033248 31598780 25591800 22254132 19751405 17128757 14591003 12586212
18005 12586212 11117911 10175309 9576462 9111751 8744745 8468968 8411345 8647906 9190903
17996 9190903 9974290 10882313 12100158 13937361 16607195 20330125 25942810 35267333
17988 35267333 51504940 77733342 106740551 113390652 88394353 59551536 41548418
$$ packed form
18048A758492o3889p5524l5571J6487J8224K3155J02144K36256J60632J79267
18038B319673p766J6376J47595J72270J94293L70242M53198N66716Q62308J238512
18028F333417J448659J150568N13376L92245J066416K050736L345073N292329
18020B1592819Q831335J5469410K5717461L1662621J3758623k1520257l1524711
18013F3987301k0954053j1434468o006980l337668k502727k622648k537754k004791
18005A2586212j468301r42602n98847m64711l67006k75777n7623K36561N42997
17996I190903P83387R08023J217845J837203K669834L722930N612685R324523
17988C5267333J6237607K6228402K9007209O650101k4996299k8842817j8003118
$$ plain form
17981 41548418 31885836 26892503 24241087 22220025 20183231 18628220 18136955 18923904
17973 18923904 21052550 24903337 31612194 43444343 64149734 93374534 114377904
17966 114377904 103224328 72732189 49117661 35731517 28499700 24743123 23328329
17959 23328329 23370704 23300344 21672720 19140801 16784047 14873420 13359811 12318720 11636995
17950 11636995 11126625 10770649 10914201 11390481 12211902 13512555 15332716 17412497 20021994
17941 20021994 24154365 31383707 44409963 66800841 96386763 112966894 96223540
17934 96223540 66055384 44585708 32318751 25360711 21280499 18816009 17231010 16216285
17926 16216285 15877081 16433763 18472970 22813716 30020556 37477648 38637223 32076662
$$ packed form
17981D1548418r662582m993333k651416k021062k036794j555011m91265P86949
17973A8923904K128646L850787O708857J1832149K0705391K9224800K1003370
17966A14377904j1153576l0492139k3614528j3386144p231817l756577j414794
17959B3328329M2375p0360j627624k531919k356754j910627j513609j041091o81725
17950A1636995n10370l55976J43552M76280Q21421J300653J820161K079781K609497
17941B0021994M132371P229342J3026256K2390878K9585922J6580131j6743354
17934I6223540l0168156k1469676j2266957o958040m080212k464490j584999j014725
17926A6216285l39204N56682K039207M340746P206840P457092J159575o560561
$$ plain form
17918 32076662 25068181 21001635 19327131 18925567 19193079 19749689 20426755 21432178 23232923
17909 23232923 26192176 30785120 37572104 47900245 64666330 93613105 143993843
17902 143993843 222971935 308522229 338056058 296218690 233438153 172966438 123005515
17895 123005515 90451173 71796758 61109366 55075299 52430729 53436676 59392173
17888 59392173 71798311 88577454 98371584 88375014 66366534 47809566 36115906
17881 36115906 29177793 24843170 21856976 19626956 17752521 16016208 14562687 13445899
17873 13445899 12687380 12156066 11969456 12019381 12365752 13033854 13860392 14662570 15633229
17864 15633229 17247807 20084973 24905181 32869485 45806641 63885188 79946922 80421539
$$ packed form
17918C2076662p008481m066546j674504m01564K67512N56610O77066J005423J800745
17909B3232923K959253M592944O786984J0328141J6766085K8946775N0380738
17902A43993843P8978092Q5550294K9533829m1837368o2780537o0471715m9960923
17895A23005515l2554342j8654415j0687392o034067k644570J005947N955497
17888E9392173J2406138J6779143R794130r996570k2008480j8556968j1693660
17881C6115906o938113m334623k986194k230020j874435j736313j453521j116788
17873A3445899p58519n31314j86610M9925L46371O68102Q26538Q02178R70659
17864A5633229J614578K837166M820208P964304J2937156J8078547J6061734M74617
$$ plain form
17856 80421539 65664950 50614777 41714574 38208236 38736980 42728100 51020207 65801880
17848 65801880 90699503 127299321 170226992 212630442 247696321 246715846 190000489
17841 190000489 124553349 82630156 59164583 45601413 37136841 31412468 27081105
17834 27081105 23407074 20487188 18275315 16588061 15292599 14409266 14009874 14202340
17826 14202340 15693895 19023318 23402535 25418449 21973530 16261050 12118001 9743274
17818 9743274 8380552 7494436 6814905 6277624 6005887 5986411 5823682 5588403 5319797
17809 5319797 4947856 4363092 3861219 3485653 3159569 2905188 2773610 2649147 2587137 2569380
17799 2569380 2682454 2750268 2797731 2775348 2597304 2321383 2129636 2051436 2100819 2217850
$$ packed form
17856H0421539j4756589j5050173q900203l506338N28744L991120Q292107J4781673
17848F5801880K4897623L6599818M2927671M2403450L5065879r80475n6715357
17841A90000489o5447140m1923193k3465573j3563170q464572n724373m331363
17834B7081105l674031k919886k211873j687254j295462q83333l99392J92466
17826A4202340J491555L329423M379217K015914l444919n712480m143049k374727
17818I743274j362722q86116o79531n37281k71737j9476j62729k35279k68606
17809E319797l71941n84764n01873l75566l26084k54381j31578j24463o2010j7757
17799B569380J13074O7814M7463k2383j78044k75921j91747p8200M9383J17031
$$ plain form
17789 2217850 2387122 2504200 2400572 2213342 1992188 1681202 1442986 1286855 1206811 1141507
17779 1141507 1101730 1096974 1048588 939191 902260 1006404 1086940 1133382 1196272 1140978 1153676
17768 1153676 1197337 1132666 1127340 1140614 1047147 948968 929281 956441 973955 901920 865691
17757 865691 865589 844584 919338 1003116 1005624 940390 897851 904352 960705 993262 980013 988448
17745 988448 939938 855631 824573 811052 808541 816089 855969 899968 913590 910154 845537 799422
17733 799422 783609 806805 830224 890216 939018 886881 740958 612023 635589 640386 570950
17722 570950 580183 605501 666947 677081 662526 663036 720914 784747 811437 856033 910158 920073
17710 920073 890557 802845 719783 644772 553086 505927 445386 512228 505009 436434 388876 331950
$$ packed form
17789B217850J69272J17078j03628j87230k21154l10986k38216j56131q0044o5304
17779A141507l9777m756m8386j09397l6931J04144Q0536M6442O2890n5294J2698
17768A153676M3661o4671n326J3274r3467r8179j9687K7160J7514p2035l6229
17757H65691j02k1005P4754Q3778K508o5234m2539O501N6353L2557j3249Q435
17745I88448m8510q4307l1058j3521k511P548L9880M3999J3622l436o4617m6115
17733G99422j5813K3196K3419N9992M8802n2137j45923j28935K3566M797o9436
17722E70950R233K5318O1446J0134j4555N10N7878O3833K6690M4596N4125R915
17710I20073k9516q7712q3062p5011r1686m7159o0541O6842p219o8575m7558n6926
$$ plain form
17698 331950 296507 354659 410910 470077 451399 452299 462874 494645 530665 584567 754963 887242
17686 887242 912617 821980 651946 584717 552766 463201 448512 464103 473988 470626 399739 385162
17674 385162 451430 442484 436508 490211 527075 525211 485314 460155 464011 456769 450200 426927 396181
17661 396181 426105 419416 439602 458343 458882 521784 545962 545030 543876 476889 433622 351527 326893
17648 326893 362790 343093 357687 422895 425025 382536 351340 363543 365628 368654 343332 317972
17636 317972 362575 391101 376482 387670 512242 620759 650731 591453 487188 378124 318712
17625 318712 263978 221852 198908 163154 207613 230357 229186 271771 291973 275375 313353 286137
17613 286137 257461 214758 219163 207635 277928 373584 400392 338585 246223 222858 237955 189526
$$ packed form
17698C31950l5443N8152N6251N9167j8678R00J0575L1771L6020N3902J70396J32279
17686H87242K5375r0637j70034o7229l1951q9565j4689J5591R885l362p0887j4577
17674C85162O6268q946n976N3703L6864j864l9897k5159L856p242o569k3273l0746
17661C96181K9924o689K0186J8741N39O2902K4178r32j154o6987m3267q2095k4634
17648C26893L5897j9697J4594O5208K130m2489l1196J2203K085L026k5322k5360
17636C17972M4603K8526j4619J1188J24572J08517K9972n9278j04265j09064n9412
17625C18712n4734m2126k2944l5754M4459K2744j171M2585K0202j6598L7978k7216
17613B86137k8676m2703M405j1528P0293R5656K6808o1807r2362k3365J5097m8429
$$ plain form
17601 189526 181644 204302 139808 102784 194850 165420 128326 86287 139560 162082 173752 168904
17589 168904 194971 235731 225561 246973 184761 97319 134943 184162 152097 143084 150194 135904
17577 135904 122965 103578 127304 113284 115007 156988 158711 138662 94546 85289 117142 144826
17565 144826 183316 215401 178665 124127 92419 69142 104740 120443 136667 156251 157208 149053
17553 149053 156843 142381 132024 160258 127246 79650 100728 96240 54063 69497 75671 97744
17541 97744 145789 126490 58544 10116 -11984 15447 100635 141304 137889 118377 17804 23841
17529 23841 42112 76498 140920 132330 63081 81978 74189 50316 81639 29046 34634 56788
17517 56788 118420 130372 74799 6913 37423 101714 123030 129260 97174 148555 201155 221497
$$ packed form
17601A89526p882K2658o4494l7024R2066k9430l7094m2039N3273K2522J1670m848
17589A68904K6067M0760j0170K1412o2212q7442L7624M9219l2065r013P110j4290
17577A35904j2939j9387K3726j4020J723M1981J723k0049m4116r257L1853K7684
17565A44826L8490L2085l6736n4538l1708k3277L5598J5703J6224J9584R57q155
17553A49053P790j4462j0357K8234l3012m7596K1078m488m2177J5434O174K2073
17541I7744M8045j9299o7946m8428k2100K7431Q5188M0669l415j9512j00573O037
17529B3841J8271L4386O4422q590o9249J8897p789k3873L1323n2593N588K2154
17517E6788O1632J1952n5573o7886L0510O4291K1316O230l2086N1381N2600K0342
$$ plain form
17505 221497 190186 181347 172849 245812 333525 297187 246667 220040 167253 88291 70886 78495
17493 78495 117924 141732 123581 125777 92760 62622 93756 129682 110406 174049 269855 283812
17481 283812 217242 224224 344615 494957 601681 581340 430616 319100 314562 270827 231106
17470 231106 193621 169754 202704 228156 204885 187217 131100 100578 149523 205400 267209
17459 267209 262044 259258 212660 185334 179817 215053 196663 183810 230353 269445 357118 507426
17447 507426 702110 789256 711209 666796 762653 964632 999875 731313 510191 373191
17437 373191 263426 264857 279203 279838 257111 233915 250061 280410 392181 576847 590452
17426 590452 448560 301952 265534 190762 160624 179968 211628 210774 153009 80803 33283
$$ packed form
17505B21497l1311q839q498P2963Q7713l6338n0520k6627n2787p8962j7405P609
17493G8495L9429K3808j8151K196l3017l0138L1134L5926j9276O3643R5806J3957
17481B83812o6570O982J20391J50342J06724k0341j50724j11516m538m3735l9721
17470B31106l7485k3867L2950K5452k3271j7668n6117l0522M8945N5877O1809
17459B67209n165k786m6598k7326n517L5236j8390j2853M6543L9092Q7673J50308
17447E07426J94684Q7146p8047m4413R5857K01979L5243k68562k21122j37000
17437C73191j09765J431J4346O35k2727k3196J6146L0349J11771J84666J3605
17426E90452j41892j46608l6418p4772l0138J9344L1660q54n7765p2206m7520
$$ plain form
17415 33283 31181 58147 92927 78281 21119 73328 156184 173167 84252 59884 56263 96567
17403 96567 94216 165219 233566 362177 517670 655653 729771 703325 559323 427129 390353
17392 390353 387315 398700 433026 512056 662392 717345 650694 552931 523017 560928 615167
17381 615167 671222 755061 666398 528036 447704 449765 571779 636921 603100 558383 591196
17370 591196 684431 741906 710487 583400 469757 401922 376015 339824 293601 287640 289594
17359 289594 270673 276624 309893 396243 429879 390131 307438 236888 165098 112046 88751 104541
17347 104541 155542 151922 127185 136521 188731 229994 219543 182987 203321 274945 401317 503019
17335 503019 494576 455968 450777 523745 658853 799349 846714 739437 588271 552274 544347
$$ packed form
17415C3283k102K6966L4780j4646n7162N2209Q2856J6983q8915k4368l621M0304
17403I6567k351P1003O8347J28611J55493J37983P4118k6446j44002j32194l6776
17392C90353l038J1385L4326P9030J50336N4953o6651r7763k9914L7911N4239
17381F15167N6055Q3839q8663j38362q0332K061J22014O5142l3821m4717L2813
17370E91196R3235N7475l1419j27087j13643o7835k5907l6191m6223n961J954
17359B89594j8921N951L3269Q6350L3636l9748q2693p0550p1790n3052k3295J5790
17347A04541N1001l620k4737R336N2210M1263j0451l6556K0334P1624J26372J01702
17335E03019q443l8608n191P2968J35108J40496M7365j07277j51166l5997p927
$$ plain form
17324 544347 526759 531501 705681 943307 1044355 935493 761243 598815 509392 514619 546024
17313 546024 588302 656290 749322 786983 674119 622571 639186 702247 635049 448532 346518
17302 346518 236468 162160 60172 81220 117204 189480 204164 199908 155884 121633 115167
17291 115167 84336 82239 99088 146604 153383 118541 122839 123336 81257 104675 154482 208347
17279 208347 260787 254315 183943 143873 129978 148935 100315 46709 120043 201698 318904
17268 318904 373165 419905 427883 461406 510534 522970 429914 312017 246911 183763 128185
17257 128185 185599 193837 153042 78317 27077 26625 62967 101349 131792 91201 64387 40275
17245 40275 23136 49071 59094 50138 11803 14443 94877 83171 91712 110553 66897 43123
$$ packed form
17324E44347j7588M742J74180K37626J01048j08862j74250j62428q9423N227L1405
17313E46024M2278O7988R3032L7661j12864n1548J6615O3061o7198j86517j02014
17302C46518j10050p4308j01988K1048L5984P2276J4684m256m4024l4251o466
17291A15167l0831k097J6849M7516O779l4842M298M97m2079K3418M9807N3865
17279B08347N2440o472p0372m0070j3895J8957m8620n3606P3334Q1655J17206
17268C18904N4261M6740P978L3523M9128J2436r3056j17897o5106o3148n5578
17257A28185N7414Q238m0795p4725n1240m52L6342L8382L0443m0591k6814k4112
17245D0275j7139K5935J0023q956l8335K640Q0434j1706Q541J8841m3656k3774
$$ plain form
17233 43123 139994 233648 217095 240575 284414 304357 381399 437732 433855 338407 342869 278828
17221 278828 193615 167861 177234 148862 156717 198195 191069 141330 92204 13526 20760 14289
17209 14289 86681 133236 154796 186705 176385 113188 94626 94780 115892 162028 234238 221511
17197 221511 208355 204694 178988 198150 209793 191626 189281 219519 246567 249483 322512 384259
17185 384259 461704 562509 638418 620199 682061 642016 570751 517532 514470 483364 432654
17174 432654 362934 338595 293385 206180 213860 211694 166268 177500 169855 166915 182666 157287
17162 157287 194795 220516 151639 88759 69888 134817 193101 200878 210676 201836 174296 112589
17150 112589 23773 25956 109226 149980 150015 183141 276796 318459 297077 343351 326535 372436
$$ packed form
17233D3123R6871R3654j6553K3480M3839J9943P7042N6333l877r5448M462o4041
17221B78828q5213k5754R373k8372P855M1478p126m9739m9126p8678P234o471
17209A4289P2392M6555K1560L1909j0320o3197j8562J54K1112M6136P2210j2727
17197B21511j3156l661k5706J9162J1643j8167k345L0238K7048K916P3029O1747
17185C84259P7445J00805P5909j8219O1862m0045p1265n3219l062l1106n0710
17174D32654o9720k4339m5210q7205P680k166m5426J1232p645k940J5751k5379
17162A57287L7508K5721o8877o2880j8871O4929N8284P777R798q840k7540o1707
17150A12589q8816K183Q3270M0754L5L3126R3655M1663k1382M6274j6816M5901
$$ plain form
17138 372436 395348 376841 291056 241224 211615 195537 221594 162366 109658 79519 30437
17127 30437 18606 57641 72576 86268 160766 174714 148775 145361 148750 111216 95789 69067
17115 69067 17432 -15087 -18403 8865 -5512 -43844 13845 76282 85857 94801 115616 65241
17103 65241 58808 44056 6896 -18042 42655 89762 89363 96950 123737 114287 110024 83016 57749
17090 57749 5458 27385 10718 6222 -1045 -5485 897 4354 -12969 -22505 -9455 -51956 -50823
17077 -50823 36419 46608 40802 51859 3245 -14293 -12245 4184 25864 36365 6187 -77402
17065 -77402 -83812 -104999 -76436 -39404 -10326 355 -3639 25225 -13186 -26338 -8632 -78951
17053 -78951 -107803 -42542 9901 22967 -11648 -94557 -40197 11627 12700 -439 -23953 20910
$$ packed form
17138C72436K2912j8507q5785m9832k9609j6078K6057n9228n2708l0139m9082
17127C0437j1831L9035J4935J3692P4498J3948k5939l414L389l7534j5427k6722
17115F9067n1635l2519l316K7268j4377l8332N7689O2437R575Q944K0815n0375
17103F5241o433j4752l7160k4938O0697M7107l99P587K6787r450m263k7008k5267
17090E7749n2291K1927j6667m496p267m440O382L457j7323r536J3050m2501J133
17077e0823Q7242J0189n806J1057m8614j7538K048J6429K1680J0501l0178q3589
17065g7402o410k1187K8563L7032K9078J0681l994K8864l8411j3152J7706p0319
17053g8951k8852O5261N2443J3066l4615q2909N4360N1824J073j3139k3514M4863
$$ plain form
17041 20910 53905 39026 40015 71941 69763 54141 18981 321 -20464 -12053 7085 -9178
17029 -9178 -25016 -25187 65110 111730 131449 169138 185684 155037 96413 120659 150211 146195
17017 146195 161267 126513 35051 744 52614 131369 168873 187759 164908 93283 89770 97525
17005 97525 97502 89093 108671 124049 48691 -40963 -84188 -120936 -76357 -14001 39166 65672
16993 65672 -11641 -105863 -93074 -73923 -41804 12443 22380 94200 174229 174650 131782 187942
16981 187942 211298 178919 156814 168040 142286 122202 131283 188959 149187 130444 147376 121816
16969 121816 139756 145288 134667 36335 46468 3148 -9666 9040 6853 -1473 -44050 -22559
16957 -22559 30072 83579 95203 29472 -7360 32341 16499 -39967 -49138 -88357 -63898 11180
$$ packed form
17041B0910L2995j4879R89L1926k178j5622l5160j8660k0785Q411J9138j6263
17029i178j5838j71R0297M6620J9719L7689J6546l0647n8624K4246K9552m016
17017A46195J5072l4754r1462l4307N1870P8755L7504J8886k2851p1625l513P755
17005I7525k3q409J9578J5378p5358q9654m3225l6748M4579O2356N3167K6506
16993F5672p7313r4222J2789J9151L2119N4247R937P1820Q0029M21m2868N6160
16981A87942K3356l2379k2105J1226k5754k0084R081N7676l9772j8743J6932k5560
16969A21816J7940N532j0621r8332J0133m3320j2814J8706k187q326m2577K1491
16957b2559N2631N3507J1624o5731l6832L9701j5842n6466r171l9219K4459P5078
$$ plain form
16945 11180 29257 -113 13796 68021 96525 124017 101429 112425 170143 129924 83020 100864
16933 100864 57642 21372 -23339 10855 81859 11355 4791 71419 96712 65826 -31580 -45645
16921 -45645 -31249 -20616 -50447 -38287 21550 60757 49871 100212 160627 149933 59376 45462
16909 45462 33577 35285 -49674 -32962 30807 96924 172675 143797 116047 110038 107525 59910
16897 59910 51603 77860 93263 125049 68416 25636 88686 119204 97881 33029 -14060 -58238
16885 -58238 -25204 -5693 24686 112 -20644 -7229 1211 22368 45759 3109 -26139 -32633
16873 -32633 -34579 14069 32657 34244 33498 -16459 -48899 -80203 -68445 -83222 -121375 -96047
16861 -96047 -41100 2206 18939 2124 -42146 -54423 -67828 14060 75896 83626 82142 63331
$$ packed form
16945A1180J8077k9370J3909N4225K8504K7492k2588J0996N7718m0219m6904J7844
16933A00864m3222l6270m4711L4194P1004p0504o564O6628K5293l0886r7406j4065
16921d5645J4396J0633k9831J2160N9837L9207j0886N0341O0415j0694r0557j3914
16909D5462j1885J708q4959J6712O3769O6117P5751k8878k7750o009k513m7615
16897E9910q307K6257J5403L1786n6633m2780O3050L0518k1323o4852m7089m4178
16885e8238L3034J9511L0379k4574k0756J3415Q440K1157K3391m2650k9248o494
16873c2633j946M8648J8588J587p46m9957l2440l1304J1758j4777l8153K5328
16861i6047N4947M3306J6733j6815m4270j2277j3405Q1888O1836P730j484j8811
$$ plain form
16849 63331 59551 42083 43134 65432 96794 11714 77114 19874 -26235 -65285 -28630 -24020
16837 -24020 -33929 4863 16107 -905 -61098 -54425 -27027 -33344 -43857 -82677 -94252 -33619
16825 -33619 -29013 -50403 -79404 -106946 -67356 -96501 -103711 -125449 -137865 -79321 -60846 -89316
16813 -89316 -45385 -26983 -4111 33526 57023 76686 32589 35524 22911 58962 53405 84101
16801 84101 63424 3068 -7810 95032 116739 73080 33587 45842 26741 -4041 -82466
16790 -82466 -86592 -63661 -5799 -68331 -121349 -67423 -40363 -2449 -26591 7814 56111 76662
16778 76662 61778 57045 84603 111135 75036 62681 85053 97622 99803 81112 19013 -17820
16766 -17820 -47542 44854 52959 12623 31202 8423 4951 -9182 -8220 -17216 -22898 54114 60262
$$ packed form
16849F3331l780j7468J051K2298L1362q5080O5400n7240m6109l9050L6655M610
16837b4020r909L8792J1244j7012o0193O673K7398o317j0513l8820j1575O0633
16825c3619M606k1390k9001k7542L9590k9145p210k1738j2416N8544J8475k8470
16813h9316M3931J8402K2872L7637K3497J9663m4097K935j2613L6051n557L0696
16801H4101k0677o0356j0878J02842K1707m3659l9493J2255j9101l0782p8425
16790h2466m126K2931N7862o2532n3018N3926K7060L7914k4142L4405M8297K0551
16778G6662j4884m733K7558K6532l6099j2355K2372J2569K181j8691o2099l6833
16766a7820k9722R2396Q105m0336J8579k2779l472j4133R62q996n682P7012O148
$$ plain form
16753 60262 57382 93793 63651 21153 72396 70200 74343 52531 -67727 -35796 11215 18358
16741 18358 22995 3151 -7303 6986 -14661 -75612 -111257 -21556 42115 64815 42004 54159
16729 54159 16121 37082 88568 57885 15420 1377 -14181 -40514 -58393 -114077 -84732 -6848
16717 -6848 -8146 -35878 -40860 -37684 -4000 32987 21194 2013 -29108 -79428 -24721 9189
16705 9189 6786 -54718 -95188 -107149 -79884 -47821 -75073 962 26036 46160 74620 106627
16693 106627 71420 -25994 -53813 -58335 -64299 -58763 -95869 -112765 -53745 8821 62508 71680
16681 71680 17036 20831 31151 20849 5895 -28706 -36844 -59925 -105708 -68667 784 -48772
16669 -48772 4277 -20973 -16761 30630 61327 57825 -5171 -54692 -31030 18543 8176 -50303
$$ packed form
16753F0262k880L6411l0142m2498N1243k196M143k1812j20258L1931M7011P143
16741A8358M637j9844j0454J4289k1647o0951l5645Q9701O3671K2700k2811J2155
16729E4159l8038K0961N1486l0683m2465j4043j5558k6333j7879n5684K9345P7884
16717f848j298k7732m982L176L3684L6987j1793j9181l1121n0320N4707L3910
16705I189k403o1504m0470j1961K7265L2063k7252P6035K5074K0124K8460L2007
16693A06627l5207r7414k7819m522n964N536l7106j6896N9020O2566N3687R172
16681G1680n4644L795J0320j0302j4954l4601q138k3081m5783L7041O9451m9556
16669d8772N3049k5250M212M7391L0697l502o2996m9521K3662M9573j0367n8479
$$ plain form
16657 -50303 -121394 -92953 -82137 -48255 -31907 -50450 2683 41222 12055 15453 39058 -60969
16645 -60969 -95955 -72124 -55510 -88515 -114264 -132210 -119053 -106706 -89763 -20808 -6027 12297
16633 12297 10398 13191 -19452 24553 -500 -45856 5228 20254 27772 43375 67898 51845
16621 51845 39479 77522 48243 47801 92406 62084 63511 -14494 -59447 -35329 -29169 -50897
16609 -50897 6964 9836 28782 18328 -11040 27516 -19560 -14424 -19506 -50731 -48105 -3608
16597 -3608 -13422 -48720 -83959 -59027 17069 96324 58920 28401 18400 41125 56609 12915
16585 12915 -37461 -13965 -50664 -76679 -62418 -6817 2864 19114 6955 28779 4424 -4171
16573 -4171 -25989 -30897 33630 -9757 -9751 6041 -40469 -51939 -38046 -33177 27530 101506 107912
$$ packed form
16657e0303p1091K8441J0816L3882J6348j8543N3133L8539k9167L398K3605j00027
16645f0969l4986K3831J6614l3005k5749j7946J3157J2347J6943O8955J4781J8324
16633A2297j899K793l2643M4005k5053m5356N1084J5026P518J5603K4523j6053
16621E1845j2366L8043k9279m42M4605l0322J427p8005m4953K4118O160k1728
16609e0897N7861K872J8946j0454k9368L8556m7076N136n082l1225K626M4497
16597c608r814l5298l5239K4932P6096P9255l7404l0519j0001K2725J5484m3694
16585A2915n0376K3496l6699k6015J4261N5601R681J6250j2159K1824k4355q595
16573d171k1818m908O4527m3387OJ5792m6510j1470J3893M869O0707P3976O406
$$ plain form
16560 107912 91874 66537 10833 -34683 -63498 -56185 -19158 26243 13322 -25508 -30710 13671
16548 13671 26025 69403 46505 36280 69740 94975 104186 50672 28079 67397 101965 59522
16536 59522 50514 58201 32481 -69217 -81571 -76688 -46351 -29193 -10343 9003 31450 8650
16524 8650 -13573 31672 -14287 -42488 -38201 -49245 -89926 -93347 -24203 -25334 59717 88055
16512 88055 12522 -118403 -117457 -50769 -13842 13611 43537 -68157 -132823 -108426 -30536 -29568
16500 -29568 -43295 -49184 -30098 31636 42502 71379 81796 100249 54778 27914 56421 16263
16488 16263 -695 52273 41800 43927 19576 10148 64871 76262 71254 59407 12433 -28026
16476 -28026 -29121 -59680 -38589 -9697 -85650 -114456 -155996 -100256 -44512 -11572 -31897 -16081
$$ packed form
16560A07912j6038k5337n5704m5516k8815P313L7027M5401j2921l8830n202M4381
16548A3671J2354M3378k2898j0225L3460K5235R211n3514k2593L9318L4568m2443
16536E9522r008P687k5720j01698j2354M883L0337J7158J8850J9346K2447k2800
16524H650k2223M5245m5959k8201M287j1044m0681l421O9144j131Q5051K8338
16512H8055p5533j30925R46O6688L6927K7453K9926j11694o4666K4397P7890R68
16500b9568j3727n889J9086O1734J0866K8877J0417J8453m5471k6864K8507m0158
16488A6263j6958N2968j0473K127k4351r428N4723J1391n008j1847m6974m0459
16476b8026j095l0559K1091K8892p5953k8806m1540N5740N5744L2940k0325J5816
$$ plain form
16464 -16081 -23097 -68427 -61159 -65456 -56762 -19261 14126 21502 -24727 -41077 -7346 4529 -21790
16451 -21790 -103863 -127795 -87382 -47259 -69394 -36934 -3219 28302 91168 29584 26157 43341
16439 43341 32146 5167 -5098 6409 14696 1595 41295 60163 42002 -20297 -24911 17682
16427 17682 -2906 -41167 66457 107782 24437 -21259 -12591 33920 18709 18784 -27872 -57225
16415 -57225 -53228 -20632 -37789 -91035 -108335 -53203 -23408 -32433 16485 6388 26161 27886
16403 27886 36303 33572 36623 40487 42830 9316 -35406 22276 61060 31566 -24364 -91488 -164449
16390 -164449 -94404 -3156 43585 14055 -40379 -47858 -45279 -2498 12054 -12736 -18569 -34430
16378 -34430 -89726 -90742 -44142 -151 -1885 -3043 27802 53544 57667 33230 -25158 -41657
$$ packed form
16464a6081p016m5330P268m297Q694L7501L3387P376m6229j6350L3731J1875k6319
16451b1790q2073k3932M0413M0123k2135L2460L3715L1521O2866o1584l427J7184
16439D3341j1195k6979j0265J1507Q287j3101L9700J8868j8161o2299m614M2593
16427A7682k0588l8261J07624M1325q3345m5696Q668M6511j5211P5m6656k9353
16415e7225L997L2596j7157n3246j7300N5132K9795r025M8918j0097J9773J725
16403B7886Q417k731L051L864K343l3514m4722N7682L8784k9494n5930o7124p2961
16390a64449P0045R1248M6741k9530n4434p479K579M2781J4552k4790n833j5861
16378c4430n5296j016M6600M3991j734j158L0845K5742M123k4437n8388j6499
$$ plain form
16366 -41657 33161 61550 52533 13848 -35873 -77346 -120377 -127564 -122430 -70427 -46640 -56567
16354 -56567 -58996 -15362 22216 37346 26196 -12841 -4870 -31697 -31931 -4114 28619 -45372
16342 -45372 -66050 -42015 4918 6024 -16568 -22981 40192 77813 75093 50091 -7889 -8629 -9622
16329 -9622 -32008 -26781 29167 45120 8332 -40576 -5944 -4545 -8664 45763 63527 33572
16317 33572 -2009 -50018 -71264 -113472 -94548 -7567 39663 54051 85509 110274 102715 74043
16305 74043 48843 68551 68950 58564 97511 73571 21144 65700 36127 29401 -2222 -10699
16293 -10699 -23511 -33563 -11198 10247 8084 8153 -3168 14446 41058 -5739 53296 19470
16281 19470 -28791 -38697 -169 18265 -10104 -31093 -37616 -72722 -33569 13735 -26757 -48501
$$ packed form
16366d1657P4818K8389r017l8685m9721m1473m3031p187N134N2003K3787r927
16354e6567k429M3634L7578J5130j1150l9037P971k6827k34K7817L2733p3991
16342d5372k0678K4035M6933J106k2592o413O3173L7621k720k5002n7980p40r93
16329i622k2386N227N5948J5953l6788m8908L4632J399m119N4427J7764k9955
16317C3572l5581m8009k1246m2208J8924Q6981M7230J4388L1458K4765p559k8672
16305G4043k5200J9708L99j0386L8947k3940n2427M4556k9573o726l1623q477
16293a0699j2812j0052K2365K1445k163O9j1321J7614K6612m6797N9035l3826
16281A9470m8261r906L8528J8434k8369k0989o523l5106L9153M7304m0492k1744
$$ plain form
16269 -48501 -83873 -68430 31211 2174 -42031 -105489 -111844 -119898 -91821 -63867 -54505 -46580
16257 -46580 -49186 -15640 5668 -27104 -112154 -166615 -207471 -157445 -118780 -124156 -124799 -93266
16245 -93266 -29644 43508 -22356 -47927 -65373 -98833 -68906 -24646 -79991 -111181 -68180 -60477
16233 -60477 -58025 -80321 -125878 -162599 -154018 -142530 -86798 -94875 -80723 14222 7651 -57043
16221 -57043 -80255 -47847 -36403 -53669 -31348 -23032 -20768 19612 -4089 -37841 -5827 -9099
16209 -9099 -28013 -43460 -44108 -41883 -18976 -55671 -82836 -67827 -6127 30235 60648 27204
16197 27204 43081 47155 10967 1982 30786 65729 13650 5391 25869 45140 -8788 -21904
16185 -21904 -4405 -16240 39029 43306 -33393 -49209 -52380 -114489 -130314 -141003 -209564 -165804
$$ packed form
16269d8501l5372J5443R9641k9037m4205o3458o355q054K8077K7954R362P925
16257d6580k606L3546K1308l2772q5050n4461m0856N0026L8665n376o43L1533
16245i3266O3622P3152o5864k5571j7446l3460K9927M4260n5345l1190M3001P703
16233f0477K452k2296m5557l6721Q581J1488N5732q077J4152R4945o571o4694
16221e7043k3212L2408J1444j7266K2321Q316K264M0380k3701l3752L2014l272
16209i099j8914j5447o48K225K2907l6695k7165J5009O1700L6362L0413l3444
16197B7204J5877M074l6188q985K8804L4943n2079q259K0478J9271n3928j3116
16185b1904J7499j1835N5269M277p6699j5816l171o2109j5825j0689o8561M3760
$$ plain form
16173 -165804 -93716 -50360 -22728 -33009 -69315 -70121 22572 75787 3276 19847 32001 -18452
16161 -18452 -43691 -120358 -142468 -86751 -24459 14161 84407 144474 36412 -33516 -8652
16150 -8652 -53027 -101474 -123563 -87031 -40957 382 3017 48998 23794 -73581 -104905 -56079
16138 -56079 -54829 -36756 -45161 -43418 -11868 3394 -3335 67260 76785 34119 -8156 -41365 -55905
16125 -55905 -31819 19464 -26091 -41062 -4427 31264 15699 -19981 -56444 -41271 -3937 -24616
16113 -24616 -47223 25281 77003 -18589 -10835 43227 55184 -17998 -25063 19679 20107 19563 -418
16100 -418 -26865 -51699 -19529 -73801 -48884 49085 88846 49097 4008 -9323 7522 -30428
16088 -30428 -70949 -80087 -85641 -182040 -157484 -22257 25542 82955 96263 78377 38086 14925
$$ packed form
16173a65804P2088M3356K7632j0281l6306q06R2693N3215p2511J6571J2154n0453
16161a8452k5239p6667k2110N5717O2292L8620P0246O0067j08062o9928K4864
16150h652m4375m8447k2089L6532M6074M1339K635M5981k5204r7375l1324M8826
16138e6079J250J8073q405J743L1550J5262o729P0595R525m2666m2275l3209j4540
16125e5905K4086N1283m5555j4971L6635L5691j5565l5680l6463J5173L7334k0679
16113b4616k2607P2504N1722r5592P754N4062J1957p3182p065M4742M28n44j9981
16100d18k6447k4834L2170n4272K4917R7969L9761l9749m5089j3331J6845l7950
16088c0428m0521r138n554r6399K4556J35227M7799N7413J3308j7886m0291k3161
$$ plain form
16076 14925 8693 -13236 905 40275 70791 28867 -17492 -43370 36622 109209 69781 17177
16064 17177 2550 11029 -8822 23217 48395 38577 -25734 -97627 -93246 -79140 -40015 -17606
16052 -17606 13325 8572 -39984 -83629 -68442 -32592 46117 92144 74112 49709 15226 -7460
16040 -7460 -11832 -18220 -50123 -53251 -6359 16251 3355 -34337 -12149 33278 36131 27080 31515
16027 31515 32713 -1149 -1496 -5310 -44192 -22949 8313 9198 4016 12624 16490 36711 82077
16014 82077 85918 24896 8039 21782 898 18083 28056 16548 8311 -49389 -82074 -54132
16002 -54132 -71833 -58260 -36323 -47213 -65836 -50462 937 16717 33505 62146 22171 5104
15990 5104 13606 24599 36539 60553 50177 -19605 -46404 -53220 -43500 -16065 -58521 -61459 -34475
$$ packed form
16076A4925o232k1929J4141L9370L0516m1924m6359k5878P9992P2587l9428n2604
16064A7177j4627Q479j9851L2039K5178r818o4311p1893M381J4106L9125K2409
16052a7606L0931m753m8556m3645J5187L5850P8709M6027j8032k4403l4483k2686
16040g460m372o388l1903l128M6892K2610j2896l7692K2188M5427K853r051M435
16027C1515J198l3862l47l814l8882K1243L1262Q85n182Q608L866K0221M5366
16014H2077L841o1022j6857J3743k0884J7185R973j1508q237n7700l2685K7942
16002e4132j7701J3573K1937j0890j8623J5374N1399J5780J6788K8641l9975j7067
15990E104Q502J0993J1940K4014j0376o9782k6799o816R720K7435m2456k938K6984
$$ plain form
15977 -34475 -56208 -37436 3290 11935 -6483 20201 48711 50474 248 -42193 22240 71649
15965 71649 45945 7585 7663 61228 80289 55677 -5961 -40230 -40053 -45490 2713 49283 15094
15952 15094 24576 -25442 23204 35196 -47841 -73294 -39536 -20917 12034 45603 32078 11427
15940 11427 -15529 6904 18861 9591 -5589 -23763 -81859 -108305 -62483 -35370 -39753 -38377
15928 -38377 1918 6294 -36725 -11012 6414 18983 -11232 -4913 79731 99632 35138 -22396
15916 -22396 -92608 -91866 -41894 -7279 11984 -25550 -71121 -117077 -41197 14612 -3966 -12065
15904 -12065 -79560 -71533 -46293 -79042 -97086 -58835 -15032 -21554 -25881 -66109 -63617 11019
15892 11019 15382 -7167 -79317 -52842 -21973 -36803 11075 34769 8455 1803 -13587 -18853
$$ packed form
15977c4475k1733J8772M0726Q645j8418K6684K8510J763n0226m2441O4433M9409
15965G1649k5704l8360P8N3565J9061k4612o1638l4269J77n437M8203M6570l4189
15952A5094R482n0018M8646J1992q3037k5453L3758J8619L2951L3569j3525k0651
15940A1427k6956K2433J1957r270j5180j8174n8096k6446M5822K7113m383J376
15928c8377M0295M376m3019K5713J7426J2569l0215O319Q4644J9901o4494n7534
15916b2396p0212P42M9972L4615J9263l7534m5571m5956P5880N5809j8578q099
15904a2065o7495Q027K5240l2749j8044L8251M3803o522m327m0228K492P4636
15892A1019M363k2549p2150K6475L0869j4830M7878K3694k6314o652j5390n266
$$ plain form
15880 -18853 -47274 -38678 17391 21428 31573 -7167 -57712 -68815 -45828 -40611 -45355 -160733
15868 -160733 -172562 -106592 -93206 -64146 -34904 7899 3462 -36692 -66981 -101958 -129090 -123285
15856 -123285 -63000 -32084 7180 46695 19014 5508 -6300 -57650 -25120 3514 32499
15845 32499 2404 43040 62948 48448 34147 17683 19370 41816 66275 74597 35704 34499
15833 34499 -30969 -63824 -67934 -82760 -51190 -17650 -2615 -16949 -62252 -79208 -72664 -38214
15821 -38214 -11481 -4763 41427 68178 124190 140713 105087 40229 20421 -32438 -42221 -2773
15809 -2773 -11135 1040 -81538 -107748 -95682 -44179 -54844 -57351 -79267 -107165 -139572 -100953
15797 -100953 -84505 -21392 15219 -38419 -53846 -57694 -84140 -91842 -158550 -147301 -120111 -130644
$$ packed form
15880a8853k8421Q596N6069M037J0145l8740n0545j1103K2987N217m744j15378
15868a60733j1829O5970J3386K9060K9242M2803m437m0154l0289l4977k7132N805
15856a23285O0285L0916L9264L9515k7681j3506j1808n1350L2530K8634K8985
15845C2499l0095M0636J9908j4500j4301j6464J687K2446K4459Q322l8893j205
15833C4499o5468l2855m110j4826L1570L3540J5035j4334m5303j6956O544L4450
15821c8214K6733O718M6190K6751N6012J6523l5626o4858j9808n2859r783L9448
15809b773q362J2175q2578k6210J2066N1503j0665k507k1916k7898l2407L8619
15797a00953J6448O3113L6611n3638j5427l848k6446p702o6708J1249K7190j0533
$$ plain form
15785 -130644 -57601 -36202 -16354 23114 8244 49863 -19801 -57541 -36943 -3119 -47718
15774 -47718 -61256 -48599 -42342 -27352 1957 24475 -8875 15764 -57919 -71540 -21012 7812
15762 7812 -73729 -59452 -4969 -27915 -54550 -633 24827 86951 102522 112962 146601 148268
15750 148268 161338 203661 194812 172862 150400 129496 94331 33137 32457 33980 9548 27622
15738 27622 60450 91860 97254 77168 42468 82768 69746 53779 85632 86617 46645 -61231
15726 -61231 -37787 4546 -28733 -32331 7377 34697 393 -7936 31153 -3660 -100168 -110653
15714 -110653 -120127 -92577 -88244 -105064 -104284 -57395 -25623 -7220 -38510 -27182 -52835 -35664
15702 -35664 -78131 -48400 -31660 6591 -4467 -47599 -41862 866 40959 18666 50386 71452
$$ packed form
15785a30644P3043K1399J9848L9468j4870M1619o9664l7740K0598L3824m4599
15774d7718j3538J2657O257J4990K9309K2518l3350K4639p3683j3621N0528K8824
15762G812q1541J4277N4483k2946k6635N3917K5460O2124J5571J0440L3639J667
15750A48268J3070M2323q849k1950k2462k0904l5165o1194o80J523k4432J8074
15738B7622L2828L1410N394k0086l4700M0300j3022j5967L1853R85l9972j07876
15726f1231K3444M2333l3279l598L9708K7320l4304q329L9089l4813r6508j0485
15714a10653r474K7550M333j6820P80M6889L1772J8403l1290J1328k5653J7171
15702c5664m2467K9731J6740L8251j1058m3132N737M2728M0093k2293L1720K1066
$$ plain form
15690 71452 73241 43178 2262 -44867 -32723 -49653 -71355 -58417 -2864 22563 -29538 -29670
15678 -29670 -14925 -59965 -154830 -239494 -121262 -43565 -3050 4364 -3894 -31336 -60778 44691
15666 44691 55116 38868 20304 -26133 -47001 -19199 21487 42857 7182 -14088 -1732 -11089
15654 -11089 -6184 -69130 -98055 -58158 -23086 -18772 -27735 -6055 28289 -11524 -81220 -70781
15642 -70781 -28884 -18752 -15195 657 19102 -30002 -148054 -86969 -22591 -44647 -81309 -128945
15630 -128945 -105133 -58050 -54898 -68584 -67128 -69380 -66046 -70813 -44122 -30306 -60160 -76673
15618 -76673 -48427 -30350 -80661 -112571 -126787 -113932 -13376 74076 103992 71010 59672
15607 59672 71967 -15581 -37291 -48725 -35621 -2361 11108 42168 77866 79032 37894 -7893
$$ packed form
15690G1452J789l0063m0916m7129J2144j6930k1702J2938N5553K5427n2101j32
15678b9670J4745m5040r4865q4664J18232P7697M0515P414q258k7442k9442J05469
15666D4691J0425j6248j8564m6437k0868K7802M0686K1370l5675k1270J2356r357
15654a1089M905o2946k8925L9897L5072M314q963K1680L4344l9813o9696J0439
15642g0781M1897J0132L557J5852J8445m9104j18052O1085O4378k2056l6662m7636
15630a28945K3812M7083L152j3686J456k252L334m767K6691J3816k9854j6513
15618g6673K8246J8077n0311l1910j4216J2855J00556Q7452K9916l2982j1338
15607E9672J2295q7548k1710j1434J3104L3260J3469L1060L5698J166m1138m5787
$$ plain form
15595 -7893 -52672 -13194 -26651 -25302 -39516 -22528 11715 42697 39831 16574 27793 -21061
15583 -21061 -62887 -50239 66111 38726 -51893 -66835 2363 55901 97219 41974 4393
15572 4393 45153 37555 -30344 -76451 -29218 -9402 -19820 13678 68110 42236 3008 -51107
15560 -51107 -45083 -10371 -37599 1530 50435 57425 77659 44100 -92864 -149143 -88863 -19537
15548 -19537 37454 9083 17679 78184 45112 -9137 -25884 -23506 18606 73864 26278 104
15536 104 1005 -68979 -67769 -33429 -73452 -54920 -24830 17265 59852 41200 13773 -55874 -90757
15523 -90757 -79542 -153228 -179326 -140272 -72756 -73357 -59131 -42461 -42699 -22443 -54637 -121327
15511 -121327 -124624 -124861 -119120 -31302 -34858 -52341 -58893 -50518 3389 -28205 -23244 -8196 -28637
$$ packed form
15595g893m4779L9478j3457J349j4214J6988L4243L0982k866k3257J1219m8854
15583b1061m1826J2648J16350k7385r0619j4942O9198N3538M1318n5245l7581
15572D393M0760p598o7899m6107M7233J9816j0418L3498N4432k5874l9228n4115
15560e1107O024L4712k7228L9129M8905O990K0234l3559j36964n6279O0280O9326
15548a9537N6991k8371Q596O0505l3072n4249j6747K378M2112N5258m7586k6174
15536A04R01o9984J210L4340m0023J8532L0090M2095M2587j8652k7427o9647l4883
15523i0757J1215p3686k6098L9054O7516o01J4226J6670k38K0256l2194o6690
15511a21327l297k37N741Q7818l556j7483o552Q375N3907l1594M961J5048k0441
$$ plain form
15498 -28637 -36085 -60496 -81616 -31626 -50456 -64943 -22524 5337 49731 14018 -34743 -75188
15486 -75188 -106433 -103059 -31675 -20657 -19801 -22461 -4885 -4752 446 -6404 -19932 -46041 -84588
15473 -84588 -77584 -39497 5577 35309 48745 29553 15552 70742 42666 29374 40756 -11209
15461 -11209 -47919 22655 24260 -33074 -21421 4944 8336 12686 51144 59669 66046 17795 58247
15448 58247 31796 -24025 -69417 -46230 7547 49904 66988 35993 38788 73646 69337 73054
15436 73054 32024 9235 -2694 -82479 -47467 -23863 -28750 -20651 -47772 -44494 -51020 -87017
15424 -87017 -69741 -48507 -19992 -25130 -19174 -52098 7988 18086 -51851 -87133 -40264 -14801
15412 -14801 -58850 -69169 -75668 -48680 -29241 -59597 -27120 14727 92414 62130 41702 23912
$$ packed form
15498b8637p448k4411k1120M9990j8830j4487M2419K7861M4394l5713m8761m0445
15486g5188l1245L374P1384J1018Q56k660J7576J33N198o850j3528k6109l8547
15473h4588P004L8087M5074K9732J3436j9192j4001N5190k8076j3292J1382n1965
15461a1209l6710P0574J605n7334J1653K6365L392M350L8458Q525O377m8251M0452
15448E8247k6451n5821m5392K3187N3777M2357J7084l0995K795L4858m309L717
15436G3054m1030k2789j1929p9785L5012K3604m887Q099k7121L278o526l5997
15424h7017J7276K1234K8515n138N956l2924O0086J0098o9937l5282M6869K5463
15412a4801m4049j0319o499K6988J9439l0356L2477M1847P7687l0284k0428j7790
$$ plain form
15400 23912 -6390 -22603 -49522 -48306 -69161 -18456 18701 -28179 -119754 -98282 221 -6957
15388 -6957 -52948 -47100 5481 48571 113803 105039 84744 64272 14994 -34116 -18714 -95500
15376 -95500 -71985 -48524 22355 -6603 -18159 -8610 -57657 -44250 -3883 -36988 -11111 -17135
15364 -17135 -6988 -27158 -116497 -78425 10107 54433 57283 29833 40207 39020 57533 20593
15352 20593 18464 29155 58645 45528 16120 -28185 -59892 -59427 -30284 18786 57043 49614
15340 49614 -12441 5399 40331 9562 7163 -60980 -36446 1964 8988 21841 -3260 -36832
15328 -36832 -75406 -53197 -58581 -62265 -67417 -13026 24802 4027 -55302 -99123 -112350 -32344
15316 -32344 -5447 -54808 -25474 527 32739 40599 27193 73349 65923 41645 43317 33859
$$ packed form
15400B3912l0302j6213k6919J216k0855N0705L7157m6880r1575K1472R8503p178
15388f957m5991N848N2581M3090O5232q764k0295k0472m9278m9110J5402p6786
15376i5500K3515K3461P0879k8958j1556R549m9047J3407M0367l3105K5877o024
15364a7135J0147k0170q9339L8072Q8532M4326K850k7450J0374j187J8513l6940
15352B0593k129J0691K9490j3117k9408m4305l1707M65K9143M9070L8257p429
15340D9614o2055J7840L4932l0769k399o8143K4534L8410P024J2853k5101l3572
15328c6832l8574K2209n384l684n152N4391L7828k0775n9329m3821j3227Q0006
15316c2344K6897m9361K9334K6001L2212P860j3406M6156p426k4278J672r458
$$ plain form
15304 33859 -51471 -87314 -52535 -42276 -30477 65764 118606 33419 -22605 -4810 -47321 -80891
15292 -80891 -69961 -27665 18893 46078 80863 89584 58119 26416 48981 10648 -42366 -80119
15280 -80119 -20480 -3448 28570 79810 -14123 -44353 12618 47639 47783 11671 9832 -1150
15268 -1150 57875 124890 165629 164918 63051 6739 4492 16689 -27461 -117430 -150588 -92418
15256 -92418 -26104 52902 66788 23515 -13071 -40434 -54166 -49701 -50507 19761 47614 32376
15244 32376 14458 2864 -34713 -6916 60551 112200 94467 55521 54545 39805 26393 30560
15232 30560 37944 -5329 -18808 18907 20630 -31977 -24168 -42578 -36827 -11013 -29434 -42318
15220 -42318 -5721 32800 54450 47281 20522 -1444 30232 14037 -21303 -29734 -47685 -86250
$$ packed form
15304C3859q5330l5843L4779J0259J1799R6241N2842q5187n6024J7795m2511l3570
15292h0891J0930M2296M6558K7185L4785Q721l1465l1703K2565l8333n3014l7753
15280h0119N9639J7032L2018N1240r3933l0230N6971L5021J44l6112j839j0982
15268a150N9025O7015M0739p11j01867n6312k247J2197m4150q9969l3158N8170
15256i2418O6314P9006J3886m3273l6586k7363j3732M465q06P0268K7853j5238
15244C2376j7918j1594l7577K7797O7467N1649j7733l8946r76j4740j3412M167
15232C0560P384m3273j3479L7715J723n2607P809j8410N751K5814j8421j2884
15220d2318L6597L8521K1650p169k6759k1966L1676j6195l5340q431j7951l8565
$$ plain form
15208 -86250 -65455 -38812 -17392 17112 48612 4283 -42111 -26646 -32904 -43460 -10431 -48217
15196 -48217 -8670 34566 29023 25709 -45161 -70935 -64443 -58329 -85370 -80294 -18206 34011 -17175
15183 -17175 -18383 -43588 -44252 -67535 -74846 -42821 -34141 -3280 16735 -26702 -63995 -40952 18472
15170 18472 58672 79714 33805 32860 63168 60535 40233 15768 27209 15184 -62245 -100938
15158 -100938 -67902 4691 -14555 -20882 -25045 -40553 -37241 1991 3274 33514 47803 58035
15146 58035 66571 20362 -50062 -85877 -61247 -28420 -66924 -100220 -51742 -26413 -46579 -58266
15134 -58266 -20260 -50659 -96245 -34847 -8590 -25301 -18892 39295 54943 69482 59723 33200
15122 33200 39377 -24616 29902 40923 27813 16774 20485 2715 -50880 -28760 39553 78127
$$ packed form
15208h6250K0795K6643K1420L4504L1500m4329m6394J5465o258j0556L3029l7786
15196d8217L9547M3236n543l314p0870k5774O492O114k7041N076O2088N2217n1186
15183a7175j208k5205o64k3283p311L2025Q680L0861K0015m3437l7293K3043N9424
15170A8472M0200K1042m5909r45L0308k633k0302k4465J1441j2025p7429l8693
15158a00938L3036P2593j9246o327m163j5508L312L9232J283L0240J4289J0232
15146E8035Q536m6209p0424l5815K4630L2827l8504l3296M8478K5329k0166j1687
15134e8266L8006l0399m5586O1398K6257j6711O409N8187J5648J4539r759k6523
15122C3200O177o3993N4518J1021j3110j1039L711j7770n3595K2120O8313L8574
$$ plain form
15110 78127 52505 26537 53614 75698 59101 37001 89665 126880 131012 53771 -29015 998
15098 998 34072 13008 -61587 -71425 -78938 -51525 57637 84654 58266 31556 4922 21355
15086 21355 29415 -3572 -2333 18639 16203 27296 17483 26175 12321 -46261 -46884 -37936 -16929
15073 -16929 -54742 -48377 -7412 -31733 -41029 -23135 -61958 -47084 -33374 -694 -40905 -82690
15061 -82690 -5906 -71157 -77072 -40661 16825 20930 23522 58115 15481 -42422 -77554 -130094
15049 -130094 -70026 -9508 -52489 -44497 -732 -5027 -3880 -80847 -122221 -96072 -29868 29449
15037 29449 89225 47652 -16324 -76886 -114920 -59968 -49913 -77880 -48007 -399 -3444 -47339
15025 -47339 -49178 -50259 -16857 6126 -28755 -9937 5123 4563 -49802 -81264 -80902 -144786 -127427
$$ packed form
15110G8127k5622k5968K7077K2084j6597k2100N2664L7215M132p7241q2786L0013
15098I98L3074k1064p4595r838p513K7413J09162K7017k6388k6710k6634J6433
15086B1355Q060l2987J239K0972k436J1093r813Q692j3854n8582o23Q948K1007
15073a6929l7813O365M0965k4321r296J7894l8823J4874J3710L2680m0211m1785
15061h2690P6784o5251n915L6411N7486M105K592L4593m2634n7903l5132n2540
15049a30094O0068O0518m2981P992M3765m295J147p6967m1374K6149O6204N9317
15037B9449N9776m1573o3976o0562l8034N4952J0055k7967K9873M7608l045m3895
15025d7339j839j081L3402K2983l4881J8818J5060n60n4365l1462L62o3884J7359
$$ plain form
15012 -127427 -110467 -105644 -61373 -33765 54681 135913 63499 19850 73088 59186 70560 30672
15000 30672 -68535 -104220 -86168 -74370 -110699 -179343 -155625 -117331 -65549 -9083 -88547 -82176
14988 -82176 -29499 5037 55020 26277 -11062 7667 -20997 -74030 -41165 -34052 -2892 4243
14976 4243 47842 74412 58297 61846 75112 53585 -389 -16816 -14189 -49028 -69046 -87114
14964 -87114 -52091 7602 -12932 -26568 42725 76912 66960 38263 -25889 -105387 -65703 -71824
14952 -71824 -128938 -116168 -83021 -134860 -130668 -44622 -56854 -72270 -103043 -63948 -42867 -32121
14940 -32121 -22874 -53920 -69438 -111436 -147969 -76569 -30084 -18106 2326 -31 25499 7550
14928 7550 64963 59937 61746 80860 20891 7307 23604 -27558 -102757 -124360 -110768 -84946
$$ packed form
15012a27427J6960M823M4271K7608Q8446Q1232p2414m3649N3238j3902J1374l9888
15000C0672r9207l5685J8052J1798l6329o8644K3718L8294N1782N6466p9464O371
14988h2176N2677L4536M9983k8743l7339J8729k8664n3033L2865P113L1160P135
14976D243M3599K6570j6115L549J3266k1527n3974j6427K627l4839k0018j8068
14964h7114L5023N9693k0534j3636O9293L4187r952k8697o4152p9498L9684o121
14952g1824n7114J2770L3147n1839M192Q6046j2232j5416l0773L9095K1081J0746
14940c2121R247l1046j5518m1998l6533P1400M6485J1978K0432k357K5530j7949
14928G550N7413n026J809J9114n9969j3584J6297n1162p5199k1603J3592K5822
$$ plain form
14916 -84946 -68172 -74179 -35021 19342 9650 -37563 31241 51103 45587 8141 17519 -25037
14904 -25037 -85002 -34804 25503 25556 26654 28238 8111 8926 29331 35050 32843 -56665 -95737
14891 -95737 -31200 27183 24021 20940 -13366 -66829 -32970 -4089 7844 1026 -2125 -20502
14879 -20502 -35722 -48305 -44815 -30828 802 39645 38088 -3847 -45249 -5988 -23896 -93457
14867 -93457 -111088 -71716 -85390 -36024 33124 41289 20071 -18930 -26515 -7944 -34464 -64409
14855 -64409 -78134 -89908 -2643 52000 59607 65644 15222 -25177 -10713 39525 55548 78633
14843 78633 35660 -17377 3300 15646 21215 12953 -36661 -35221 10150 33084 21611 11363
14831 11363 -37066 -28403 32329 32143 -904 17222 3468 -56869 -91190 -124431 -130716 -88119
$$ packed form
14916h4946J6774o007L9158N4363r692m7213O8804J9862n516l7446R378m2556
14904b5037n9965N0198O0307N3J098J584k0127Q15K0405N719k207q9508l9072
14891i5737O4537N8383l162l081l4306n3463L3859K8881J1933o818l151j8377
14879b0502j5220j2583L490J3987L1630L8843j557m1935m1402L9261j7908o9561
14867i3457j7631L9372j3674M9366O9148Q165k1218l9001p585J8571k6520k9945
14855f4409j3725j1774Q7265N4643P607O037n0422m0399J4464N0238J6023K3085
14843G8633m2973n3037K0677J2346N569q262m9614J440M5371K2934j1473j0248
14831A1363m8429Q663O0732j86l3047J8126j3754o0337l4321l3241o285M2597
$$ plain form
14819 -88119 33660 82058 50839 12493 -38161 -43995 -6805 -14953 -16106 -9517 -13175 -94827
14807 -94827 -94039 -87581 -53422 -22711 -1469 47627 47880 -866 21097 -33935 -47875 6932 -30345
14794 -30345 -4150 -3945 -1009 -48808 -54619 -61650 -55819 -36697 -36463 -70518 -78067 -94196 -80952
14781 -80952 -57385 -33142 -11088 16584 4757 16173 41682 79245 55774 15037 -21234 -42873
14769 -42873 -8998 -8762 -22853 -50636 -43727 7463 11375 -15112 -55214 -32749 -12862 -55637
14757 -55637 -49049 -13997 -691 -49791 -89652 -108387 -90006 -15462 51824 87085 40962 -45743
14745 -45743 -76449 -86387 -15597 22828 21996 35805 77801 109450 45593 -8208 -49305 -34916
14733 -34916 262 35650 -15658 -94904 -90168 -36421 -28490 -21037 -7950 13687 -28135 -25929
$$ packed form
14819h8119J21779M8398l1219l8346n0654n834L7190q148j153O589l658q1652
14807i4827P88O458L4159L0711K1242M9096K53m8746K1963n5032j3940N4807l7277
14794c0345K6195K05K936m7799n811p031N831J9122K34l4055p549j6129J3244
14781h0952K3567K4243K2054K7672j1827J1416K5509L7563k3471m0737l6271k1639
14769d2873L3875K36j4091k7783O909N1190L912k6487m0102K2465J9887m2775
14757e5637O588L5052J3306m9100l9861j8735J8381P4544O7286L5261m6123q6705
14745d5743l0706r938P0790L8425q32J3809M1996L1649o3857n3801m1097J4389
14733c4916L5178L5388n1308p9246M736N3747P931P453J3087K1637m1822K206
$$ plain form
14721 -25929 -23337 -24667 -21368 -20202 8999 2520 15015 40082 2935 -36354 -2162 6302 52067
14708 52067 32669 -59500 -109619 -121209 -75594 -52894 -3489 -2094 -35900 -92414 -128631 -63309
14696 -63309 -54817 -43195 987 28191 45472 84491 58936 -71759 -105735 -71973 -30340 15730
14684 15730 48439 -9572 -54060 -51173 -71440 -66547 -62740 -132915 -132395 -36899 7591 18388 -2017
14671 -2017 -67554 -92956 -103030 -74577 17827 -58187 -90141 -97850 -93141 -57375 -47234 -37164
14659 -37164 -8475 -26812 -56016 2573 90693 117111 123382 91051 48047 34234 54157 97752
14647 97752 69663 10300 22716 9304 -37660 -39271 -7911 45523 43413 65263 61754 40398
14635 40398 48671 6394 -19120 -26974 17571 61959 72563 46433 66184 92773 20082 27987
$$ packed form
14721b5929K592j330L299J166K9201o479J2495K5067l7147l9289L4192Q464M5765
14708E2067j9398r2169n0119j1590M5615K2700M9405J395l3806n6514l6217O5322
14696f3309Q492J1622M4182K7204J7281L9019k5555j30695l3976L3762M1633M6070
14684A5730L2709n8011m4488K887k0267M893L807p0175N20R5496M4490J0797k0405
14671b017o5537k5402j0074K8453R2404p6014l1954p709M709L5766J0141J0070
14659c7164K8689j8337k9204N8589Q8120K6418O271l2331m3004j3813J9923M3595
14647I7752k8089n9363J2416j3412m6964j611L1360N3434k110K1850l509k1356
14635D0398Q273m2277k5514p854M4545M4388J0604k6130J9751K6589p2691P905
$$ plain form
14623 27987 50321 68076 59671 28261 -11173 6173 78065 48412 -1269 19699 67633 82626
14611 82626 68114 71338 79057 33016 -5681 -10921 -8530 3387 -38048 -42669 -20288 -53975 -36231
14598 -36231 -79919 -122114 -91828 -44882 -4414 3700 -23893 -117755 -122606 -51009 -20031 -37777
14586 -37777 -45203 -11831 8672 -56206 -56249 -34597 -51033 -35658 -40890 -66264 -58636 -30920 -46243
14573 -46243 -18473 25090 -12017 5944 53160 52096 -8639 -24034 -22177 23469 23177 -1185
14561 -1185 -26042 -124535 -131941 -57204 -63430 -103990 -36000 54308 80565 111271 61164 27118
14549 27118 37245 -3586 7637 -37253 -51451 -53322 -2303 32801 17014 -3044 -23873 -20928
14537 -20928 50982 69609 31178 -54474 -434 23329 4457 -3065 -3315 6188 -12661 -1848
$$ packed form
14623B7987K2334J7755q405l1410l9434J7346P1892k9653m9681K0968M7934J4993
14611H2626j4512L224P719m6041l8697n240K391J1917m1435m621K2381l3687J7744
14598c6231m3688m2195L0286M6946M0468Q114k7593r3862m851P1597L0978j7746
14586c7777p426L3372K0503o4878m3K1652j6436J5375n232k5374P628K7716j5323
14573d6243K7770M3563l7107J7961M7216j064o0735j5395J857M5646k92k4362
14561a185k4857r8493p406P4737o226m0560O7990R0308K6257L0706n0107l4046
14549B7118J0127m0831J1223m4890j4198j871N1019L5104j5787k0058k0829K945
14537b0928P1910J8627l8431q5652N4040K3763j8872p522k50R503j8849J0813
$$ plain form
14525 -1848 -13269 -47106 -56899 -56138 -57518 -45487 -21400 -63689 -40252 43917 116631 115976 62219
14512 62219 79247 123518 109642 67123 18998 13602 9862 16332 68000 88862 40729 -7226
14500 -7226 -11827 22771 16834 15234 -33216 -29071 10274 41407 47583 30667 33305 60146 92207
14487 92207 81132 44549 21886 12374 9953 27027 17257 41714 70993 30675 41535 54936
14475 54936 7495 -275 36040 64899 55549 87517 88194 79836 49839 11333 31358 23712 69068
14462 69068 65701 64452 85831 128282 65397 40173 33584 9478 -6019 58352 104595 84465
14450 84465 94144 57150 39669 69991 69800 38058 65063 50116 3405 -4280 -24520 -80001
14438 -80001 -70296 -46549 -32702 -27841 -22001 -40439 -100979 -107732 -14301 43139 39451 -3917 -46025
$$ packed form
14525a848j1421l3837r793P61j380J2031K4087m2289K3437Q4169P2714o55n3757
14512F2219J7028M4271j3876m2519m8125n396l740O470N1668K0862m8133m7955
14500g226m601L4598n937j600m8450M145L9345L1133O176j6916K638K6841L2061
14487I2207j1075l6583k2663r512k421J7074r770K4457K9279m0318J0860J3401
14475E4936m7441p770L6315K8859r350L1968O77q358k9997l8506K0025p646M5356
14462F9068l367j249K1379M2451o2885k5224o589k4106j5497O4371M6243k0130
14450H4465R679l6994j7481L0322j91l1742K7005j4947m6711p685k0240n5481
14438h0001R705K3747J3847M861N840j8438o0540o753R3431N7440l688m3368m2108
$$ plain form
14425 -46025 -65533 -93017 -43892 -9506 92561 74544 -20173 -15393 -16715 -40102 -65097 -69993
14413 -69993 -30458 14488 -81700 -119502 -40592 -30468 -37578 -39695 -33098 -45464 -41662 -82668
14401 -82668 -110244 -113372 -62807 -24574 -3823 -65475 -141568 -114946 -97977 -45714 -15397 -34838
14389 -34838 -26471 -4774 15945 -43673 -83459 -126243 -129202 -80160 -58312 -42741 -75687 -108700
14377 -108700 -53243 -58755 -86470 -94637 -108650 -96561 -70213 -47439 30031 18955 24297 66264
14365 66264 57298 -7331 -40889 -36478 -20790 -51711 -48639 -77388 -48798 8454 -35709 -86625
14353 -86625 -64513 -31637 10914 18224 2067 27906 20177 -2583 -5323 4601 31750 -9444
14341 -9444 -25293 -55219 -84618 -105234 -91498 -75878 -41431 -70112 -22503 20609 -29943 -76593
$$ packed form
14425d6025j9508k7484M9125L4386J02067j8017r4717M780j322k3387k4995m896
14413f9993L9535M4946r6188l7802P8910J0124p110k117O597j2366L802m1006
14401h2668k7576l128N0565L8233K0751o1652p6093K6622J6969N2263L0317j9441
14389c4838Q367K1697K0719n9618l9786m2784k959M9042K1848J5571l2946l3013
14377a08700N5457n512k7715q167j4013J2089K6348K2774P7470j1076N342M1967
14365F6264q966o4629l3558M411J5688l0921L072k8749K8590N7252m4163n0916
14353h6625K2112L2876M2551P310j6157K5839p729k2760k740R924K7149m1194
14341i444j5849k9926k9399k0616J3736J5620L4447k8681M7609M3112n0552m6650
$$ plain form
14329 -76593 -51320 -43989 -48091 -40965 -30866 12587 3716 -31233 -65176 -105613 -131594 -120004
14317 -120004 -39914 -48646 -74431 -64964 -5735 -15656 -109008 -132305 -124215 -26572 63625 19540
14305 19540 -33463 -25366 -30248 -49579 -48712 -51165 -33145 16083 17974 23817 -37956 -88966 -77371
14292 -77371 -79026 -102763 -94531 -149323 -182134 -141682 -88717 -47769 -35811 1888 -25287 -53057
14280 -53057 -49679 -61493 -48305 4256 28355 34184 27903 -38402 -15517 14576 21167 -3730
14268 -3730 -50538 -22786 28980 31584 28077 82127 129380 125932 51840 -9164 -45393 -34140
14256 -34140 -10727 -23468 -32030 -29291 -24615 -47661 2465 10696 -11111 34474 81909 41322
14244 41322 9454 -28887 -16495 -28731 -37383 -61334 -100355 -58892 -25587 -17643 7173 1988
$$ packed form
14329g6593K5273P331m102P126J0099M3453q871l4949l3943m0437k5981J1590
14317a20004Q0090q732k5785R467N9229r921r3352k3297Q090R7643R0197m4085
14305A9540n3003Q097m882j9331Q67k453J8020M9228J891N843o1773n1010J1595
14292g7371j655k3737Q232n4792l2811M0452N2965M0948J1958L7699k7175k7770
14280e3057L378j1814J3188N2561K4099N829o281o6305K2885L0093O591k4897
14268c730m6808K7752N1766K604l507N4050M7253l448p4092o1004l6229J1253
14256c4140K3413j2741q562K739M676k3046N0126Q231k1807M5585M7435m0587
14244D1322l1868l8341J2392j2236q652k3951l9021M1463L3305P944K4816n185
$$ plain form
14232 1988 33565 43948 33007 -12084 -40983 -50673 -43054 -41677 -128232 -142059 -102032 -31451
14220 -31451 -53163 -66906 -25127 7981 8195 -13228 -59173 -51840 -49421 -81031 -137370 -127848 -79240
14207 -79240 -62557 -8978 33769 32422 24931 -41796 -71326 -19887 -24521 -28539 -27351 -29396 -43356
14194 -43356 2121 -18343 -91409 -79960 -10693 47874 72536 24247 -7123 -55642 -5673 11639
14182 11639 8225 10767 15381 -19699 -29671 -18510 -50993 -46596 -58687 -77116 -47446 22880 -25597
14169 -25597 -76661 -84596 -62275 -55240 -37232 -24681 30294 58053 7712 -17107 25100 71818
14157 71818 77763 104512 138733 104070 74651 51602 36573 1381 -69193 -54850 -28747 -77501
14145 -77501 -38480 -10236 30632 77513 70628 -16140 -22526 -22116 3938 -24580 -5114 48513
$$ packed form
14232A988L1577J0383j0941m5091k8899r690P619J377q6555j3827M0027P0581
14220c1451k1712j3743M1779L3108K14k1423m5945P333K419l1610n6339R522M8608
14207g9240J6683N3579M2747j347p491o6727k9530N1439m634m018J188k045j3960
14194d3356M5477k0464p3066J1449O9267N8567K4662m8289l1370m8519M9969J7312
14182A1639l414K542M614l5080r972J1161l2483M397j2091j8429K9670P0326m8477
14169b5597n1064p935K2321P035J8008J2551N4975K7759n0341k4819M2207M6718
14157G1818N945K6749L4221l4663k9419k3049j5029l5192p0574J4343K6103m8754
14145g7501L9021K8244M0868M6881o885q6768o386M10K6054k8518J9466N3627
$$ plain form
14133 48513 71553 41661 23550 -91435 -98747 -20080 -47517 -57908 21668 48053 59548 24113
14121 24113 17161 -7225 3330 1139 19566 -27817 -11194 -94963 -107674 -31499 -28702 -37349
14109 -37349 -95544 -116278 -66615 -9454 7549 41677 30680 -29046 -19892 -33879 -54430 -67025
14097 -67025 -79152 -99679 -128995 -114280 -62649 -17290 -55433 -67927 -94239 -61358 -2804 4767
14085 4767 10325 1311 24268 63549 118873 82888 -8269 -13355 32766 54953 47419 44030 25355
14072 25355 76711 100638 48970 -17407 -58915 -20602 -8165 -8171 -45408 -18453 -33037 -35664 24891
14059 24891 75601 66513 73882 2310 -31626 949 75699 76545 71767 103269 72854 12763 -14869
14046 -14869 -30036 -31090 4578 -14477 17376 27315 43950 48820 54553 65794 -13490 -26803
$$ packed form
14133D8513K3040k9892j8111j14985p312P8667k7437j0391P9576K6385J1495l5435
14121B4113o952k4386J0555k191J8427m7383J6623q3769j2711P6175K797q647
14109c7349n8195k0734M9663N7161J7003L4128j0997n9726R154j3987k0551j2595
14097f7025j2127k0527k9316J4715N1631M5359l8143j2494k6312L2881N8554P571
14085D767N558r014K2957L9281N5324l5985r1157n086M6121K2187p534l389j8675
14072B5355N1356K3927n1668o6377m1508L8313J2437ol7237K6955j4584k627O0555
14059B4891N0710r088P369p1572l3936L2575P4750Q46m778L1502l0415o0091k7632
14046a4869j5167j054L5668j9055L1853R939J6635M870N733J1241p9284j3313
$$ plain form
14034 -26803 -14533 41698 59849 63453 54069 84944 99248 395 -43326 -76323 -102626 -79417
14022 -79417 -70183 -79986 -69773 -8033 32634 43364 36574 8407 34577 -11213 -88967 -78396
14010 -78396 -109252 -94045 -142009 -150049 -116269 -61283 -32757 -20417 -71663 -90260 -163792 -164441
13998 -164441 -99776 -83383 -40248 12856 29716 -25096 -37082 20322 38944 23519 -14639
13987 -14639 -6788 7159 -6132 -31966 26925 81339 81555 46496 -19142 27018 11109 -65169
13975 -65169 -38953 7097 -8464 -16001 7861 31022 61582 71297 56620 82442 104948 99060
13963 99060 101531 132343 101768 44095 57266 73330 8270 -24297 -42164 -29725 15745 46397
13951 46397 11963 -30380 28667 42923 -12924 -21195 58028 60396 41305 60718 -24286 -97010
$$ packed form
14034b6803J2270N6231J8151L604r384L0875J4304r8853m3721l2997k6303K3209
14022g9417R234r803J0213O1740M0667J0730o790k8167K6170m5790p7754J0571
14010g8396l0856J5207m7964q040L3780N4986K8526J2340n1246j8597p3532o49
13998a64441O4665J6393M3135N3104J6860n4812j1986N7404J8622j5425l8158
13987a4639P851J3947j3291k5834N8891N4414K16l5059o5638M6160j5909p6278
13975f5169K6216M6050j5561p537K3862K3161L0560R715j4677K5822K2506n888
13963I9060K471L0812l0575n7673J3171J6064o5060l2567j7867J2439M5470L0652
13951D6397l4434m2343N9047J4256n5847q271P9223K368j9091J9413q5004p2724
$$ plain form
13939 -97010 -122713 -100904 -158782 -119777 -11749 -16218 -56917 6410 32228 20513 -1196 47388
13927 47388 64082 40180 42481 23420 -6354 -1247 21648 -36511 -64497 12176 46189 45753
13915 45753 26596 25494 26157 -91199 -148926 -121191 -120557 -101733 -12475 -3449 951 -6787 13119
13902 13119 819 -32953 -44782 -65122 -31638 -33056 -59600 -44116 -20093 -5913 20671 -7439
13890 -7439 -29715 -28008 -92343 -90231 -69395 -13645 -27171 -35083 -84720 -82476 -91906 -50463 -31095
13877 -31095 -13288 -15540 -17348 -18596 48077 7005 -16425 85950 76286 15115 -2340 -5030
13865 -5030 32672 9260 6607 16620 -33642 -58620 -39514 -52909 -49646 -73972 -3867 -10984
13853 -10984 -2985 62848 59719 29395 -9736 -11295 -29699 -53526 -78030 -1258 36392 -10748
$$ packed form
13939i7010k5703K1809n7878L9005J08028m469m0699O3327K5818j1715k1709M8584
13927D7388J6694k3902K301j9061k9774N107K2895n8159k7986P6673L4013m36
13915D5753j9157j102O63j17356n7727K7735O34J8824Q9258R026M400p738J9906
13902A3119j2300l3772j1829k0340L3484j418k6544J5484K4023J4180K6584k8110
13890g439k2276J707o4335K112K0836N5750j3526p912m9637K244r430M1443J9368
13877c1095J7807k252j808j248O6673m1072k3430J02375r664o1171j7455k690
13865e030L7702k3412k653J0013n0262k4978J9106j3395L263k4326P0105p117
13853a0984P999O5833l129l0324l9131j559j8404k3827k4504P6772L7650m7140
$$ plain form
13841 -10748 -30836 -9654 -17233 -30909 32047 57301 7971 47041 38775 34792 65106 112595
13829 112595 123617 88519 13239 -410 23029 18059 -15018 28243 49469 56995 55221 29298
13817 29298 15056 -41804 -88386 -99930 -68585 -66242 -28036 39768 67744 70835 69973 53811
13805 53811 23747 -9751 -1147 17887 53542 54638 125568 73727 69252 35934 -41000 -44401
13793 -44401 -23980 -9055 3004 26508 -26120 -23450 -5309 -63350 -62137 -32806 -66801 -62691
13781 -62691 9455 57751 85836 96918 -1492 -49592 -46909 -107281 -94602 -74229 -64108 -84225
13769 -84225 -94818 -11708 31523 9321 -33109 -16084 -14644 2033 -49221 -59350 -40690 -51761
13757 -51761 -86466 -135422 -154830 -87615 8811 72897 50286 74284 129219 80831 39713 78298
$$ packed form
13841a0748k0088K1182p579j3676O2956K5254m9330L9070q266l983L0314M7489
13829A12595J1022l5098p5280j3649K3439m970l3077M3261K1226P526j774k5923
13817B9298j4242n6860m6582j1544L1345K343L8206O7804K7976L091q62j6162
13805E3811l0064l3498Q604J9034L5655J096P0930n1841m475l3318p6934l401
13793d4401K0421J4925J2059K3504n2628K670J8141n8041J213K9331l3995M110
13781f2691P2146M8296K8085J1082r8410m8100K683o0372J2679K0373J0121k0117
13769h4225j0593Q3110M3231k2202m2430J7025J440J6677n1254j0129J8660j1071
13757e1761l4705m8956j9408O7215R6426O4086k2611K3998N4935m8388m1118L8585
$$ plain form
13745 78298 67422 24649 323 -73123 -107130 -52226 6326 5366 -74118 -91388 -65354 -80047
13733 -80047 -59387 -22982 22053 63301 67909 -44901 -35069 29618 69489 72893 23425 -64
13721 -64 -5158 -2146 12915 39441 5141 35097 98750 145554 98788 55672 32276 -9929 -34369
13708 -34369 -24345 4167 -12998 -1569 -40955 -69452 -71978 13629 124957 91686 11424 -34362
13696 -34362 -14952 3415 -29845 -57121 -70545 -44304 -30254 -36695 -12287 14346 51640 23827
13684 23827 9378 32230 33470 -34760 -100269 -78910 -4209 -40800 -51221 -59255 -85673 -43109
13672 -43109 -14104 -87437 -91749 -30800 16714 44325 18863 -3628 57789 103071 72986 39245
13660 39245 11045 34775 50614 117705 111759 50271 20540 45450 36650 -11984 36 5288
$$ packed form
13745G8298j0876m2773k4326p3446l4007N4904N8552r60p9484j7270K6034j4693
13733h0047K0660L6405M5035M1248M608j12810R832O4687L9871L404m9468k3489
13721f4n094L012J5061K6526l4300K9956O3653M6804m6766m3116k3396m2205k4440
13708c4369J0024K8512j7165J1429l9386k8497k526Q5607J11328l3271q0262m5786
13696c4362J9410J8367l3260k7276j3424K6241J4050o441K4408K6633L7294k7813
13684B3827j4449K2852J240o8230o5509K1359P4701l6591j0421q034k6418M2564
13672d3109K9005p3333m312O0949M7514K7611k5462k2491O1417M5282l0085l3741
13660C9245k8200K3730J5839O7091n946o1488k9731K4910q800m8634J2020N252
$$ plain form
13648 5288 -40468 -38693 -17330 20616 -3902 4168 22875 16781 16490 13744 -21379 43204 102856
13635 102856 120316 94442 10269 -20782 -25820 -13980 -13052 21349 20852 57880 72442 62431
13623 62431 90204 100107 107993 105942 101188 72647 150811 196864 103571 52916 2920 6818 15425
13610 15425 55250 120226 141130 91109 46086 14387 -4012 -31309 -17212 52342 26702 768
13598 768 -4285 44832 31014 -20444 1798 -15322 -25698 -6350 25742 -18016 -56176 -6782
13586 -6782 51148 23986 5871 -29473 -44970 -77789 -71867 -33123 -60594 -38832 -58981 -77806
13574 -77806 -52607 4261 1488 -9769 26726 9175 61523 63936 58858 23173 -9316 11227
13562 11227 49347 84189 60578 45819 45054 50662 32875 -21395 -105098 -96023 -57296 -20140
$$ packed form
13648E288m5756J775K1363L7946k4518Q070J8707o094k91k746l5123O4583N9652
13635A02856J7460k5874q4173l1051n038J1840R28L4401m97L7028J4562j0011
13623F2431K7773R903P886k051m754k8541P8164M6053r3293n0655m9996L898Q607
13610A5425L9825O4976K0904n0021m5023l1699j8399k7297J4097O9554k5640k5934
13598G68n053M9117j3818n1458K2242j7120j0376J9348L2092m3758l8160M9394
13586f782N7930k7162j8115l5344j5497l2819N922L8744k7471K1762k0149j8825
13574g7806K5199N6868k773j1257L6495j7551N2348K413n078l5685l2489K0543
13562A1227L8120L4842k3611j4759p65N608j7787n4270q3703R075L8727L7156
$$ plain form
13550 -20140 42230 29326 -10999 -27185 10059 71100 45875 16316 14442 -12973 -38193 -35087
13538 -35087 -24588 49256 20179 6936 29767 47573 21262 -7093 -24526 -23916 -18529 -12083
13526 -12083 -7202 43485 58078 79812 26982 1195 3473 -21794 -35841 -58235 -4375 53627
13514 53627 69129 142328 114600 110088 59443 -34767 -30253 35067 37110 44054 45412 76725 35095
13501 35095 44551 -731 40266 28061 59688 90406 92075 65192 -4372 -23316 -32633 -56776
13489 -56776 -53912 -1704 1930 27315 38022 -28348 -109522 -22828 7643 -35701 -33040 -32498 -13074
13476 -13074 46763 40444 30786 56124 52781 61914 47314 18906 11878 -42105 -50005 -76810 -23405
13463 -23405 31569 77150 49855 7274 -21369 -34958 -37382 -16471 25267 56477 287 -37867
$$ packed form
13550b0140O2370j2904m0325j6186L7244O1041k5225k9559j874k7415k5220L106
13538c5087J0499P3844k9077j3243K2831J7806k6311k8355j7433O10N387O446
13526a2083M881N0687J4593K1734n2830k5787K278k5267j4047k2394N3860N8002
13514E3627J5502P3199k7728m512n0645r4210M514O5320K043O944J358L1313m1630
13501C5095R456m5282M0997j2205L1627L0718J669k6883o9564j8944r317k4143
13489e6776K864N2208L634K5385J0707o6370q1174Q6694L0471m3344K661N42J9424
13476a3074N9837o319r658K5338l343R133j4600k8408p028n3983p900k6805N3405
13463b3405N4974M5581k7295m2581k8643j3589k424K0911M1738L1210n6190l8154
$$ plain form
13451 -37867 -35132 -15205 73406 96128 53699 14707 62207 33893 -2940 -22431 -74057 -77302
13439 -77302 -84124 -45702 10197 13033 17499 11995 -12011 10144 14591 -9308 13957 8233 5230
13426 5230 -28915 -21267 38180 39197 35237 37617 -32003 -55253 39545 147705 83334 13752
13414 13752 20013 -20741 -4327 48286 37610 40572 26197 -25194 -29559 14213 43948 67679
13402 67679 87494 36394 7625 28081 86840 142457 103816 95485 91517 3472 -33370 -31633
13390 -31633 -45116 -42520 -63720 -78966 -49006 -3479 42920 31019 1700 -26930 -30198 -46707
13378 -46707 -77178 -92321 -55668 -10780 3763 -69350 -33405 -64343 -42003 9927 49210 44286
13366 44286 66242 68998 15001 -21456 9442 51315 45676 35021 30133 19217 39672 19351
$$ packed form
13451c7867K735J9927Q8611K2722m2429l8992M7500k8314l6833j9491n1626l245
13439g7302o822L8422N5899K836M466n504k4006K2155M447k3899K3265n724l003
13426E230l4145P648N9447J017l960K380o9620k3250R4798J08160o4371o9582
13414A3752O261m0754J6414N2613j0676K962j4375n1391m365M3772K9735K3731
13402F7679J9815n1100k8769K0456N8759N5617l8641q331l968q8045l6842J737
13390c1633j3483K596k1200j5246K9960M5527M6399j1901k9319k8630l268j6509
13378d6707l0471j5143L6653M4888J4543p3113L5945l0938K2340N1930L9283m924
13366D4286K1956K756n3997l6457L0898M1873n639j0655m888j0916K0455k0321
$$ plain form
13354 19351 -511 8342 -22521 1516 -4028 872 -35883 10403 29840 -4119 -76631 -58491
13342 -58491 -48171 -45038 -38351 17931 53317 4589 -12708 -31589 -33567 -57534 -107600 -72086
13330 -72086 -40523 -18162 -44260 -13784 10025 27054 14565 -4151 39512 76512 49055 103050
13318 103050 84665 19719 -16581 -8391 -77306 -123016 -87162 -30440 25140 43870 29229 22014
13306 22014 -12119 -53176 -51832 -17373 -29019 -26167 -18667 58321 56579 60534 44613 60495 44229
13293 44229 19965 -23519 -15581 34064 7134 29152 28953 -26364 -48771 -46723 7461 73314
13281 73314 109638 120096 108143 141762 129200 97045 88403 59211 11099 10194 -16377 -48882
13269 -48882 -28023 8468 -44388 -63024 -7633 45090 83475 82858 74327 76885 43740 16509
$$ packed form
13354A9351j9862Q853l0863K4037n544M900l6755M6286J9437l3959p2512J8140
13342e8491J0320L133O687N6282L5386m8728j7297j8881j978k3967n0066L5514
13330g2086L1563K2361k6098L0476K3809J7029j2489j8716M3663L7000k7457N3995
13318A03050j8385o4946l6300Q190o8915m5710L5854N6722N5580J8730j4641p215
13306B2014l4133m1057J344L4459j1646K852P500P6988j742L955j5921J5882j6266
13293D4229k4264m3484P938M9645k6930K2018j99n5317k2407K048N4184O5853
13281G3314L6324J0458j1953L3619j2562l2155q642k9192m8112r05k6571l2505
13269d8882K0859L6491n2856j8636N5391N2723L8385o17q531K558l3145k7231
$$ plain form
13257 16509 15831 28350 86476 126023 107963 93731 35001 31038 -1540 -50835 -29688 -6326
13245 -6326 937 -15146 6078 14751 -30090 8411 74907 107315 7328 -43810 -43276 18775 48133
13232 48133 11572 -47497 -47554 26562 14177 4150 85304 96105 73291 94185 75028 78943
13220 78943 131944 136249 141205 91353 32721 34824 63124 16585 13397 -18572 -3258 48012
13208 48012 66998 3916 -63770 -12973 59246 59251 66645 19436 -65451 -47870 282 8977 41644
13195 41644 -25686 -46001 -54970 -35842 -8870 -36077 -17806 2252 -12352 -24594 -5449 26456
13183 26456 37515 -22175 -36901 -6460 25625 47476 44965 57503 86024 85462 57044 29190
13171 29190 -49428 -2580 55802 42436 66515 78836 82071 142305 190801 209643 185048 166757
$$ packed form
13257A6509o78J2519N8126L9547j8060j4232n8730l963l2578m9295K1147K3362
13245f326P263j6083K1224Q673m4841L8501O6496L2408r9987n1138N34O2051K9358
13232D8133l6561n9069n7P4116j2385j0027Q1154J0801k2814K0894j9157L915
13220G8943N3001M305M956m9852n8632K103K8300m6539l188l1969J5314N1270
13208D8012J8986o3082o7686N0797P2219NP394m7209q4887J7581M8152Q695L2667
13195D1644o7330k0315q969J9128K6972k7207J8271K0058j4604j2242J9145L1905
13183B6456J1059n9690j4726L0441L2085K1851k511J2538K8521n62k8418k7854
13171B9190p8618M6848N8382j3366K4079J2321L235O0234M8496J8842k4595j8291
$$ plain form
13159 166757 83259 44650 38928 -28800 -30046 -9707 17010 79698 25485 -45891 -25479 -25647
13147 -25647 7025 56475 23750 -862 -9320 -46704 -14317 32780 25708 -32916 -46364 2457
13135 2457 -59180 -65691 -65868 -46832 868 22882 24586 17426 27897 33162 35811 -7611 -63554
13122 -63554 -100740 -108910 -22429 69033 86843 52613 109059 117449 32479 -35102 -68694 -63597
13110 -63597 -53901 -26836 25186 38366 7302 35993 77188 107256 84816 42210 -25015 -65285
13098 -65285 -40390 36136 67164 15346 26364 -11893 -34370 -3563 10008 -8406 -30583 -25816
13086 -25816 -3744 20245 59995 48851 -5737 1847 17774 7673 26190 52950 75144 62052
13074 62052 64737 53739 53627 3697 11116 91165 154264 119908 47338 7818 1189 -60460 -32468
$$ packed form
13159A66757q3498l8609n722o7728j246K0339K6717O2688n4213p1376K0412j68
13147b5647L2672M9450l2725k4612q458l7384L2387M7097p072n8624j3448M8821
13135B457o1637o511j77J9036M7700K2014J704p160J0471N265K649m3422n5943
13122f3554l7186q170Q6481R1462J7810l4230N6446Q390q4970o7581l3592N097
13110f3597R696K7065N2022J3180l1064K8691M1195L0068k2440m2606o7225m0270
13098f5285K4895P6526L1028n1818J1018l8257k2477L0807J3571j8414k2177M767
13086b5816K2072K3989L9750j1144n4588P584J5927j0101J8517K6760K2194j3092
13074F2052K685j0998j12m9930P419Q0049O3099l4356p2570l9520o629o1649K7992
$$ plain form
13061 -32468 -32514 381 23472 -7658 -6859 13783 -14255 -2392 19701 -9869 23949 15188 -11911
13048 -11911 -19445 -8472 -60941 -91822 -33100 46448 104107 78609 30451 -1936 6956 51893
13036 51893 18134 6243 27431 41421 69465 160868 174470 150932 149099 155044 136686 141216
13024 141216 110294 77416 55831 42949 56221 52139 62630 77173 105944 129212 122215 69141
13012 69141 52867 101322 95341 82977 93063 80269 87172 135656 133274 104742 45585 13035
13000 13035 72286 38409 -54247 27827 72428 70415 55417 40696 -5550 54724 56936 20136
12988 20136 8869 38349 136903 125274 39298 30013 40887 10484 37682 49291 100503 117416
12976 117416 73073 83353 59972 58869 18320 36065 119321 145726 128350 109413 157235 170068
$$ packed form
13061c2468m6L2895K3091l1130P99K0642k8038J1863K2093k9570L3818q761k7099
13048a1911p534J0973n2469l0881N8722P9548N7659k5498m8158l2387Q892M4937
13036E1893l3759j1891K1188J3990K8044R1403J3602k3538j833N945j8358M530
13024A41216l0922l2878k1585j2882J3272m082J0491J4543K8771K3268o997n3074
13012F9141j6274M8455n981j2364J0086j2794O903M8484k382k8532n9157l2550
13000A3035N9251l3877r2656Q2074M4601k013j4998j4721m6246O0274K212l6800
12988B0136j1267K9480R8554j1629q5976r285J0874l0403K7198J1609N1212J6913
12976A17416m4343J0280k3381j103m0549J7745Q3256K6405j7376j8937M7822J2833
$$ plain form
12964 170068 139261 103711 52453 46465 43875 50347 87257 79177 72840 17561 -45038 -23520
12952 -23520 37790 58647 39821 45633 43455 48520 5044 35016 134518 151278 134194 112288
12940 112288 109670 59163 12146 13767 23511 83263 84373 78458 79904 51340 38906 41404 77176
12927 77176 110372 75386 23657 35069 70531 12846 46337 64896 91571 99863 99908 92732 60917
12914 60917 44540 39193 68537 69807 43237 89387 68011 65053 9933 -4376 16058 29705
12902 29705 14808 1181 56042 41668 49257 104805 68248 84670 52872 -28272 -46153 -90805
12890 -90805 -47271 -12830 -21080 28075 81424 126951 161517 203347 126791 53870 27054 4640
12878 4640 -35732 -7019 25692 41283 72268 90577 111585 101557 96247 82125 48938 34384
$$ packed form
12964A70068l0807l5550n1258n988k590O472L6910q080o337n5279o2599K1518
12952b3520O1310K0857j8826N812k178N065m3476K9972R9502J6760j7084k1906
12940A12288k618n0507m7017J621R744N9752J110n915J446k8564j2434K498L5772
12927G7176L3196l4986n1729J1412L5462n7685L3491J8559K6675Q292M5p176l1815
12914F0917j6377n347K9344J270k6570M6150k1376k958n5120j4309K0434J3647
12902B9705j4897j3627N4861j4374P589N5548l6557J6422l1798q1144j7881m4652
12890i0805M3534L4441q250M9155N3349M5527L4566M1830p6556p2921k6816k2414
12878D640m0372K8713L2711J5591L0985J8309K1008j0028n310j4122l3187j4554
$$ plain form
12866 34384 82580 140039 151215 127620 147053 217906 221155 168732 100943 94571 98258 133108
12854 133108 115209 65701 46453 80459 133241 104990 59413 62555 86312 80589 -4229 -59366
12842 -59366 6448 10250 44104 68649 52569 30025 -5691 -28170 37457 112509 133585 108337
12830 108337 76224 54975 -10612 13466 101939 121572 108295 63185 54837 39285 69668 84979
12818 84979 94773 109496 146434 116858 69376 86906 83908 127019 106055 31742 22210 73914
12806 73914 76541 72098 91159 98798 120058 127443 63343 81795 137087 250033 226371 82978
12794 82978 155529 236555 175844 122125 132585 112848 126635 175982 220684 190381 112554 79040
12782 79040 94764 108692 166886 158232 119916 147851 162535 140133 147291 182442 133995 161265
$$ packed form
12866C4384M8196N7459J1176k3595J9433P0853L249n2423o7789o372L687L4850
12854A33108j7899m9508j9248L4006N2782k8251m5577L142K3757n723q4818n5137
12842e9366O5814L802L3854K4545j6080k2544l5716k2479O5627P5052K1076k5248
12830A08337l2113k1249o5587K4078Q8473J9633j3277m5110q348j5552L0383J5311
12818H4979R794J4723L6938k9576m7482J7530k998M3111k0964p4313r532N1704
12806G3914K627m443J9061P639K1260P385o4100J8452N5292J12946k3662j43393
12794H2978P2551Q1026o0711n3719J0460j9737J3787M9347M4702l0303p7827l3514
12782G9040J5724J3928N8194q654l8316K7935J4684k2402P158L5151m8447K7270
$$ plain form
12770 161265 162496 130153 106873 124124 175773 90945 -6579 58638 90955 136438 181394 196947
12758 196947 162635 82747 111985 48401 41812 117876 49900 -20563 3456 -51683 -23191 -17242
12746 -17242 56533 79894 64200 83715 117007 135306 87512 120980 165351 174579 159664 102113
12734 102113 98379 59990 28010 27761 122211 196271 169399 103357 91226 92227 72660 61869
12722 61869 84291 122759 95822 101947 140525 197005 186965 228576 209566 143275 137998 157891
12710 157891 153869 116610 110705 149327 195418 174938 148517 142714 119818 103907 127589 127415
12698 127415 162068 189056 145290 78206 89369 115694 124570 254669 280851 259237 281657
12687 281657 242856 224555 285855 272040 244729 214800 176130 96850 50022 62694 148470
$$ packed form
12770A61265J231l2343k3280J7251N1649q4828r7524O5217L2317M5483M4956J5553
12758A96947l4312p9888K9238o3584o589P6064o7976p0463K4019n5139K8492N949
12746a7242P3775K3361j5694J9515L3292J8299m7794L3468M4371R228j4915n7551
12734A02113l734l8389l1980k49R4450P4060k6872o6042j2131J001j9567j0791
12722F1869K2422L8468k6937O125L8578N6480j0040M1611j9010o6291n277J9893
12710A57891m022l7259n905L8622M6091k0480k6421n803k2896j5911K3682j74
12698A27415L4653K6988m3766o7084J1163K6325Q876J30099K6182k1614K2420
12687B81657l8801j8301O1300j3815k7311k9929l8670p9280m6828J2672Q5776
$$ plain form
12676 148470 172375 75544 127751 203222 148240 126899 145720 211005 194615 145378 89904
$$ packed form
12676A48470K3905r6831N2207P5471n4982k1341J8821O5285j6390m9237n5474
$$ [...]
##END NTUPLES=NMR SPECTRUM
##END=
