##TITLE=Analysis number 327865
Compound Code btb 09397
Book Reference 39605
Project Code adrs 
Chemist Name jom
##JCAMPDX= 6.0         $$ Bruker NMR JCAMP-DX V2.0
##DATA TYPE= NMR SPECTRUM
##DATA CLASS= NTUPLES
##ORIGIN= Bruker BioSpin GmbH
##OWNER= nmr
$$ XWIN-NMR		Version 3.5
$$ Fri Apr 13 09:40:55 2007 GMT Daylight Time (UT+1h)  MAYBRIDGE\nmr@NMR_250MHZ
##.OBSERVE FREQUENCY= 250.131544655141
##.OBSERVE NUCLEUS= ^1H
##.ACQUISITION MODE= SIMULTANEOUS (DQD)
##.ACQUISITION SCHEME= undefined
##.AVERAGES= 16
##.DIGITISER RES= 18
##SPECTROMETER/DATA SYSTEM= dpx250
##.PULSE SEQUENCE= zg30
##.SOLVENT NAME= CDCl3
##.SHIFT REFERENCE= (INTERNAL, CDCl3, 0, 16.522)
##AUDIT TRAIL= $$ (NUMBER, WHEN, WHO, WHERE, WHAT)
$$ ##TITLE= Audit trail, XWIN-NMR		Version 3.5
$$ ##JCAMPDX= 5.01
$$ ##ORIGIN= Bruker BioSpin GmbH
$$ ##OWNER= nmr
$$ C:\u/data/dgb/nmr/ADRS/1380/pdata/1/auditp.txt
$$ ##AUDIT TRAIL=  $$ (NUMBER, WHEN, WHO, WHERE, WHAT)
(   1,<2007-04-13 09:40:20.88 +100>,<MAYBRIDGE\nmr>,<NMR_250MHZ>,
      <created by zg, POWCHK disabled, PULCHK disabled
       configuration hash MD5:
       49 4B E0 1D 92 C2 6B 37 9F E6 65 BC 52 41 86 1D
       data hash MD5: 64K
       A3 F7 D5 CE FC 75 E6 A5 E4 CC 77 2F EF 35 2F 16>)
(   2,<2007-04-13 09:40:36.76 +100>,<MAYBRIDGE\nmr>,<NMR_250MHZ>,
      <Start of raw data processing
       ef LB = 0.3 FT_mod = 6 PKNL = 1 SI = 32K 
       data hash MD5: 32K
       E9 E9 66 23 72 82 1C BE 58 45 A1 78 A4 35 42 43>)
(   3,<2007-04-13 09:40:41.67 +100>,<MAYBRIDGE\nmr>,<NMR_250MHZ>,
      <apk 
       data hash MD5: 32K
       BC 67 E7 F2 5F 58 16 15 28 0A 6F 3B EA 2C 44 42>)
(   4,<2007-04-13 09:40:43.34 +100>,<MAYBRIDGE\nmr>,<NMR_250MHZ>,
      <abs ABSG = 5 
       data hash MD5: 32K
       5E 2E 6C E4 70 1E 73 D7 A0 03 62 01 91 E8 09 97>)
$$ ##END=
$$ 
$$ hash MD5
$$ 1D 1D 6E EE 7A 01 8D 4E 41 32 A5 DD FA 0D 83 18
##$RELAX= 
##$RELAX= 
##$RELAX= 
##$RELAX= 
##$RELAX= 
##$RELAX= 
##$RELAX= 
$$ Bruker specific parameters
$$ --------------------------
##$DU= <C:\u>
##$EXPNO= 1380
##$NAME= <ADRS>
##$PROCNO= 1
##$TYPE= <nmr>
##$USER= <dgb>
##$AMP= (0..31)
100 100 100 100 100 100 100 100 100 100 100 100 100 100 100 100 100 100 
100 100 100 100 100 100 100 100 100 100 100 100 100 100 
##$AQSEQ= 0
##$AQ_mod= 3
##$AUNM= <au_zg>
##$AUTOPOS= <59 >
##$BF1= 250.13
##$BF2= 250.13
##$BF3= 250.13
##$BF4= 250.13
##$BF5= 500.13
##$BF6= 500.13
##$BF7= 500.13
##$BF8= 500.13
##$BYTORDA= 1
##$CFDGTYP= 0
##$CFRGTYP= 5
##$CHEMSTR= <none>
##$CNST= (0..31)
1 1 145 1 1 1 1 1 1 1 1 1 1 1 1 1 1 1 1 1 1 1 1 1 1 1 1 1 1 1 1 1 
##$CPDPRG= <>
##$CPDPRG1= <>
##$CPDPRG2= <>
##$CPDPRG3= <>
##$CPDPRG4= <mlev>
##$CPDPRG5= <mlev>
##$CPDPRG6= <mlev>
##$CPDPRG7= <mlev>
##$CPDPRG8= <mlev>
##$CPDPRGB= <>
##$CPDPRGT= <>
##$D= (0..31)
0 1 0 0 0 0 0 0 0 0.06 0 0 0 0 0 0 0.0002 0 0 0 0 0 0 0 0 0 0 0 0 0 0 
0 
##$DATE= 1176453619
##$DBL= (0..7)
120 120 120 120 120 120 120 120 
##$DBP= (0..7)
150 150 150 150 150 150 150 150 
##$DBP07= 0
##$DBPNAM0= <>
##$DBPNAM1= <>
$$ [...]
##$SUBNAM7= <"">
##$SUBNAM8= <"">
##$SUBNAM9= <"">
##$SW= 20.6930455092707
##$SWIBOX= (0..15)
0 0 3 0 0 0 0 0 0 0 0 0 0 0 0 0 
##$SW_h= 5175.983436853
##$TD= 65536
##$TD0= 1
##$TE= 683.16
##$TE2= 300
##$TE3= 300
##$TEG= 300
##$TL= (0..7)
0 120 120 120 120 120 120 120 
##$TP= (0..7)
150 150 150 150 150 150 150 150 
##$TP07= 0
##$TPNAME0= <>
##$TPNAME1= <>
##$TPNAME2= <>
##$TPNAME3= <>
##$TPNAME4= <>
##$TPNAME5= <>
##$TPNAME6= <>
##$TPNAME7= <>
##$TPOAL= (0..7)
0.5 0.5 0.5 0.5 0.5 0.5 0.5 0.5 
##$TPOFFS= (0..7)
0 0 0 0 0 0 0 0 
##$TUNHIN= 0
##$TUNHOUT= 0
##$TUNXOUT= 0
##$USERA1= <user>
##$USERA2= <user>
##$USERA3= <user>
##$USERA4= <user>
##$USERA5= <user>
##$V9= 5
##$VALIST= <valist>
##$VCLIST= <CCCCCCCCCCCCCCC>
##$VD= 0
##$VDLIST= <DDDDDDDDDDDDDDD>
##$VPLIST= <PPPPPPPPPPPPPPP>
##$VTLIST= <TTTTTTTTTTTTTTT>
##$WBST= 1024
##$WBSW= 4
##$XGAIN= (0..3)
0 0 0 0 
##$XL= 0
##$YL= 0
##$YMAX_a= 292945
##$YMIN_a= -351229
##$ZGOPTNS= <>
##$ZL1= 120
##$ZL2= 120
##$ZL3= 120
##$ZL4= 120
##$ABSF1= 16.522
##$ABSF2= -4.171173
##$ABSG= 5
##$ABSL= 3
##$ALPHA= 0
##$AQORDER= 0
##$ASSFAC= 0
##$ASSFACI= 0
##$ASSFACX= 0
##$ASSWID= 0
##$AUNMP= <proc_1d>
##$AZFE= 0.1
##$AZFW= 0.1
##$BCFW= 0
##$BC_mod= 0
##$BYTORDP= 0
##$COROFFS= 0
##$CY= 12.5
##$DATMOD= 1
##$DC= 0
##$DFILT= <>
##$DTYPP= 0
##$F1P= 14.0000005364418
##$F2P= -0.99999901652339
##$FCOR= 0.5
##$FTSIZE= 32768
##$FT_mod= 6
##$GAMMA= 0
##$GB= 0
##$INTBC= 1
##$INTSCL= 1
##$ISEN= 128
##$LB= 0.3
##$LEV0= 0
##$LPBIN= 0
##$MAXI= 10000
##$MC2= 0
##$MEAN= 0
##$ME_mod= 0
##$MI= 0
##$NCOEF= 0
##$NC_proc= -4
##$NLEV= 6
##$NOISF1= 0
##$NOISF2= 0
##$NSP= 0
##$NTH_PI= 0
##$NZP= 0
##$OFFSET= 16.522
##$PC= 1
##$PHC0= 230.1024
##$PHC1= 9.076952
##$PH_mod= 1
##$PKNL= yes
##$PPARMOD= 0
##$PSCAL= 4
##$PSIGN= 0
##$REVERSE= no
##$SF= 250.13
##$SI= 32768
##$SIGF1= 0
##$SIGF2= 0
##$SINO= 400
##$SIOLD= 32768
##$SREGLST= <1H.CDCl3>
##$SSB= 0
##$STSI= 32768
##$STSR= 0
##$SW_p= 5175.98343685301
##$SYMM= 0
##$S_DEV= 0
##$TDeff= 65536
##$TDoff= 0
##$TI= <Analysis number 999999
Compound Code 99
Book Reference 9
Project Code 9>
##$TILT= no
##$TM1= 0
##$TM2= 0
##$TOPLEV= 0
##$USERP1= <user>
##$USERP2= <user>
##$USERP3= <user>
##$USERP4= <user>
##$USERP5= <user>
##$WDW= 1
##$XDIM= 32768
##$YMAX_p= 323549991
##$YMIN_p= -256623
$$ End of Bruker specific parameters
$$ ---------------------------------
##NTUPLES= NMR SPECTRUM
##VAR_NAME=  FREQUENCY,     SPECTRUM/REAL,   SPECTRUM/IMAG
##SYMBOL=    X,             R,               I
##VAR_TYPE=  INDEPENDENT,   DEPENDENT,       DEPENDENT
##VAR_FORM=  AFFN,          ASDF,            ASDF
##VAR_DIM=   32768,         32768,           32768
##UNITS=     HZ,            ARBITRARY UNITS, ARBITRARY UNITS
##FACTOR=    0.157963299565203, 1,           1
##FIRST=     4132.6476996994, 0,             0
##LAST=      -1043.33573715361, 0,           0
##MIN=       -1043.33573715361, -256623,     0
##MAX=       4132.6476996994, 323549991,     0
$$ Real data points
##PAGE= N=1
##DATA TABLE= (X++(R..R)), XYDATA
$$ [...]
15687d6136m4167j9026L3531M8690M7714n6830m5554N150J39315P9928p869m1889
15675I2857j3722l958l4358l2176k5073l3154K0994L9154L1831J2805k7895j9785
15663G520K230l9830K8418J3678K250k6l5783k3316p2330M167P7810k348L223
15650c4337N810k76M1587O6915o9739k1934O0754M9057j422j3817q5206j11064
15638a13672j1221L549O7224J01273J650n2071K1332l1022k9470K941o6801o5835
15626a72123L5945K325J15038j345n9738K3165l55k3080M944J23183M4882r8426
15614e585o9795m0652K3561P9411N2124j4961J7873R454j2209J5852J7586n0390
15602B2269l5051K5975K7843j2751L5389P1991K7099o2753n6599O75j5754L2080
$$ plain form
15687 -46136 -90303 -109329 -75798 -27108 20606 -36224 -81778 -76628 62687 142615 134746 92857
15675 92857 79135 75177 40819 8643 -16430 -49584 -28590 10564 42395 55200 27305 7520
15663 7520 9750 -30080 -1662 12016 14266 14240 -21543 -44859 -117189 -113022 -35212 -37560 -34337
15650 -34337 -28527 -28803 12784 79699 9960 -11974 48780 97837 96415 82598 -2608 -113672
15638 -113672 -124893 -121344 -54120 47153 48803 -3268 18064 -12958 -42428 -39487 -106288 -172123
15626 -172123 -136178 -133853 -18815 -20160 -79898 -56733 -57088 -80168 -75224 47959 92841 -5585
15614 -5585 -75380 -116032 -92471 -13060 39064 24103 41976 51430 39221 55073 72659 22269
15602 22269 -12782 13193 41036 28285 63674 135665 162764 100011 43412 44087 28333 60413
15590F0413l2060L0935P9478P818p7998p2039l6247n4032l9919o335J02587Q4134
15578D6735Q200J0049l4289o328q0838k0943J6276k6788l2366N0102O1478r428
15566a8140J6493m2738m2912j8620J9622k9261O639L433j1996m8487R9481P9002
15554A2516m3649J0623M6992K960p3511l1731J8872j4866P091k2871l4699O3585
15542e8688L2727J5788n5993m6468Q961O7292O2845j4343k4924r5466m7710J5494
15530a40485N8881Q0932l5886j2906L8006k5981q110K0054l5715L5990j097M1272
15518A4955L9082j0794P9426j9215l7651p680j8406M137j3280L8939m252L4646
15506I9907m6613M017M1570L6472j0746n4400l160o3537k3283l3716P735M4864
$$ plain form
15590 60413 28353 59288 138766 146584 68586 -3453 -39700 -93732 -133651 -139986 -37399 46735
15578 46735 54935 64984 30695 24367 -56471 -77414 -61138 -87926 -120292 -70190 -8712 -18140
15566 -18140 -1647 -44385 -87297 -105917 -86295 -115556 -108917 -105484 -117480 -165967 -66486 12516
15554 12516 -31133 -20510 26482 29442 -44069 -75800 -56928 -71794 -64703 -87574 -122273 -58688
15542 -58688 -25961 -10173 -66166 -112634 -103673 -36381 26464 12121 -12803 -108269 -155979 -140485
15530 -140485 -81604 -672 -36558 -49464 -11458 -37439 -45549 -25495 -61210 -25220 -26317 14955
15518 14955 54037 43243 122669 103454 65803 58123 39717 43854 30574 69513 65261 99907
15506 99907 53294 57311 98881 135353 124607 70207 67047 3510 -19773 -53489 -45754 -890
15494h90Q0936o956j17075p6429P6663J4272l0713P9007k7846j0062k3635p882
15482e0610J3780j8793k712j1164l5819L2860L9066K8608L6404m4276l3968L0895
15470a5729J0216k2082l6320m2421K9303J1442K7336Q8019K3291k9652m5353m3075
15458d5025q563K5587L2688O785N528j2472n2660J12872k4968r9499n3643N9616
15446e3754N8687R874o4935j11496m2575M0991R174M7326m6568P181N2226j359
15434i5228m0485M7716J2743O5842M5738K4967j9915p9448K4291K4023j073J0491
15422A9662j5096n7828l8393J5187r239K164N0542K4843K4155j8434k6695L2706
15410C574K6010m471r826K8695k3406j7083k3104k0487O802m204J1382P3377Q605
$$ plain form
15494 -890 80046 73090 -43985 -120414 -43751 -29479 -60192 18815 -9031 -19093 -42728 -50610
15482 -50610 -36830 -55623 -58335 -69499 -105318 -72458 -33392 -4784 31620 -12656 -46624 -15729
15470 -15729 -5513 -27595 -63915 -106336 -77033 -65591 -38255 49764 73055 43403 -1950 -45025
15458 -45025 -53588 -28001 4687 11472 17000 4528 -48132 64740 39772 -59727 -113370 -53754
15446 -53754 4933 14807 -50128 -161624 -204199 -163208 -154034 -106708 -153276 -146095 -93869 -95228
15434 -95228 -135713 -87997 -75254 -9412 36326 61293 41378 -38070 -13779 10244 9171 19662
15422 19662 4566 -53262 -91655 -76468 -85707 -83543 -33001 -8158 15997 -2437 -29132 3574
15410 3574 29584 25113 15287 43982 20576 3493 -19611 -40098 -33296 -37500 -26118 47259 55864
15397E5864m6405n1408M0058M0067J0798J7238l5113Q61J9768N4958K64k9455
15385G7495m0983k1788K3302l1924m0198m2333j315L587l846J9299J3256m5602
15373i1050o7371L7023J24034N6274k2860o7913J8976M291K5024O7825K6295o3203
15361D7345q0055J087K2734L0064K0522J6946q688k5403m3451l729m072L293n9885
15348h3292L6935L0370k9248L2380J4285l685K6048M1527l5399o9178K2753N6506
15336D0002j2780o446m8989o2441K8268K5683j8620m7868j7238R7097O3108n7483
15324a7707k7585l3947J5703R7475K5472o1300n4972l7820K953J0609O1336j8087
15312c7870l3770L0360Q2292l8798N9120M9863p2749r730k6729k294K8662o9216
$$ plain form
15397 55864 9459 -41949 -1891 38176 48974 66212 31099 31960 51728 106686 106950 77495
15385 77495 36512 14724 38026 6102 -34096 -76429 -77744 -74157 -78003 -58704 -45448 -91050
15373 -91050 -158421 -121398 2636 58910 36050 -31863 -12887 -8596 16428 84253 110548 47345
15361 47345 -32710 -31623 -8889 21175 41697 58643 49955 24552 -18899 -22628 -26700 -23407 -83292
15348 -83292 -46357 -15987 -45235 -12855 1430 -2255 23793 65320 29921 -39257 -16504 40002
15336 40002 27222 20776 -28213 -90654 -62386 -36703 -55323 -103191 -120429 -23332 39776 -17707
15324 -17707 -45292 -79239 -63536 33939 59411 -1889 -56861 -94681 -91728 -81119 -19783 -37870
15312 -37870 -71640 -41280 41012 2214 61334 111197 38448 28718 1989 -305 28357 -40859
15300d0859J5832J0083j3375Q987j2213J0569k2726J046O4576L860j4295p5132
15288f3647j1852J7712l4360l2090R652O977O8541M6268p086L754m4734J8526
15276b2339R858J1995K3150l2282m8448j367K5419L5367l359k794k4430j937R729
15263b1438n5584l3066P3261J6552J1121P0569L8478l7901k3647K3031K1119k7709
15251E4786j0011n8248n328J9586L7209l9511n6047j8974R569N690n252L1873
15239c4658m0312J10136j8265j5129L5810L0442L261j8620p8810Q511O618K3385
15227A2369m0251n0536N9953J7621k3356m0904k0729L1249P993p1938m738K1228
15215a02039M8625L8175q787R0817L0266N853K4274J0483k7873p6834m5141q4175
$$ plain form
15300 -40859 -25027 -14944 -28319 -19332 -31545 -20976 -43702 -42656 21920 25780 11485 -63647
15288 -63647 -75499 -57787 -92147 -124237 -114585 -107608 -39067 7201 115 3869 -40865 -22339
15276 -22339 -12481 -486 22664 -9618 -58066 -59433 -34014 1353 -2006 -4800 -29230 -31167 -21438
15263 -21438 -77022 -110088 -36827 -20275 -9154 61415 99893 61992 38345 61376 82495 54786
15251 54786 44775 -13473 -18801 785 37994 -1517 -57564 -76538 -66969 -61279 -66531 -34658
15239 -34658 -74970 35166 16901 1772 37582 68024 71285 52665 -26145 -17634 -11016 12369
15227 12369 -27882 -78418 -18465 -844 -24200 -65104 -85833 -54584 -46591 -118529 -123267 -102039
15215 -102039 -53414 -15239 -24026 66791 97057 102910 127184 137667 109794 32960 -12181 -96356
15203i6356L2905R9859J2661j35281r750P6206j0203N811o5389j7479J5708O1310
15191b9998O6152K6666k4643k2270J6334j019o1458n080K706N0774l154k4923
15179i913j1146k556p2402p166l911O9179R9501M6750k9851m3007n8417K139k075
15166b2875m1788K9917J2837Q628p2449o6084M8316M8239l813p5961J3591M7262
15154g4180l0342j5803k1485m0420M4684R2833k2291J7856N6926l9321l3566J6756
15142d8353l442L8129r899l9657j242M1712P8608J8931J6199p9809p2271M331
15130e6763J1651L914K1440J9464j7939J3167K3455p586r2740J6000K675l7341
15118a00603L0834L9473n4783L992j4215Q1408Q9312N2822j0077l6690o3419j4795
$$ plain form
15203 -96356 -63451 36408 49069 -86212 -95962 -19756 -29959 -24148 -89537 -107016 -91308 -29998
15191 -29998 36154 62820 38177 15907 32241 31222 -30236 -35316 -32610 18164 15010 -9913
15179 -9913 -21059 -23615 -96017 -103183 -107094 -37915 61586 108336 78485 35478 -22939 -20800 -22875
15166 -22875 -64663 -34746 -21909 -13281 -85730 -151814 -103498 -55259 -59072 -135033 -121442 -74180
15154 -74180 -104522 -120325 -141810 -182230 -137546 -44713 -67004 -49148 7778 -31543 -65109 -48353
15142 -48353 -51795 -13666 -23565 -63222 -64464 -22752 55856 74787 90986 11177 -61094 -56763
15130 -56763 -45112 -41198 -19758 -294 -18233 -5066 18389 10803 -81937 -65937 -63262 -100603
15118 -100603 -69769 -30296 -85079 -81087 -95302 -13894 75418 128240 118163 81473 18054 3259
15106C259Q990j8417L6836o289M4472K7125k5112R954j9003O2816m9533p0437
15094D661j5478j7065N2649p910m5094J3654M6189r686q4669j0714P9323J6885
15082B2745j9301J05953K4939o0446k9583K2023M8386L675p7150l2972k077p6420
15070g0228l6370l696k3836M9074N8847K2022j9297N3004M8315l4481n6025r717
15058b2388K8642l0659p4224k3108P8019L7147N0310O3539R34l4904o5998k9003
15046b1693m4284J5177n2626J0241L5020k3180k9478N7273M5539J5450j4841p8496
15034h5898P09m7478K6283O7408l0062o1612L4359N9451J0584r675M1104m8366
15022d3193k848J748p576J3274M8071l4126k8862j2619r454P259N3447O1276m1666
$$ plain form
15106 3259 12249 -6168 30668 24379 68851 95976 70864 80818 61815 124631 75098 4661
15094 4661 -10817 -27882 24767 16857 -28237 -14583 31606 21920 -62749 -73463 5860 22745
15082 22745 3444 109397 134336 73890 44307 66330 114716 118391 41241 8269 6192 -70228
15070 -70228 -106598 -110294 -134130 -85056 -26209 -4187 -23484 29520 77835 43354 -12671 -22388
15058 -22388 6254 -24405 -98629 -121737 -43718 -6571 43739 107278 108212 73308 7310 -21693
15046 -21693 -65977 -50800 -103426 -93185 -58165 -81345 -110823 -53550 -8011 7439 -7402 -85898
15034 -85898 -85189 -132667 -106384 -38976 -69038 -130650 -96291 -36840 -26256 -35931 5173 -43193
15022 -43193 -46041 -44293 -51869 -38595 9476 -24650 -53512 -66131 -75585 -68326 -14879 46397 4731
15009D731n2556j153q582M042k7546M7324J5246j2430N420L1465k1222k4322J723
14996c7860M736o8282K9104O6252k6731J4274j6226M4896O8270J7070k2790J6627
14984H9340l881p7779q5700N7294J0767J7550m095J499R76k7594m5742J7433M7721
14971b211J9480j2026J2528m3666J8386J8653l7655O965N9987j397q9819n4576
14959a05351K7219M8706J1462k0963O4027j8377n3504r4464J4245K8003m4018
14948a43015n275N1719K4230m7375K5426K6161J4186J5809L8243N1621o9062q849
14936b6181R661K8890k2151j8063l0071K7814L9107N7069l7295o5288o965N1529
14924H056N9025r2042j21412l5872O6440M5555L4693L197K3852r9711o5637N4278
$$ plain form
15009 4731 -47825 -48978 -57560 -53518 -81064 -33740 -18494 -30924 -25504 5961 -15261 -39583 -37860
14996 -37860 -33124 -101406 -72302 -6050 -32781 -18507 -34733 10163 78433 95503 72713 89340
14984 89340 85459 7680 -78020 -20726 -9959 7591 3496 4995 5971 -21623 -67365 -49932 -2211
14971 -2211 17269 5243 17771 -25895 -7509 11144 -26511 -19546 40441 39044 -50775 -105351
14959 -105351 -78132 -29426 -17964 -38927 25100 6723 -46781 -141245 -127000 -98997 -143015
14948 -143015 -148290 -96571 -72341 -119716 -94290 -68129 -53943 -38134 109 51730 -17332 -26181
14936 -26181 -16520 12370 -9781 -27844 -57915 -30101 9006 66075 28780 -36508 -43473 8056
14924 8056 67081 -24961 -146373 -182245 -115805 -70250 -35557 -32360 -8508 -108219 -173856 -119578
14912a19578L3893K4350J2651L3965k8993J8497k3472J8998M9281J1781m6401
14901a5028o4740J0081M6812m4578L0600N8552k8666q9681j2780J7925j9848O220
14889a05131L3417j0024K4998J0528Q763o318K6131L8927J4755q273l7216j6666
14877b6109M3903k5862m975J6273k3831k4165L899K7521L0321J0862J5554L4717
14865G8108k5229j4023r5151k6901R1641J4186J8585p8991J0573J8088k8758l9512
14853g7384j6571m1315j0969M6325J13148j8931J6554O227o5645m5637J1930n423
14841h7691J5627N3245L0204K9807l9896l0320k9375K0403J5952p0935k2481P1881
14829d3579l1888N3442K6617P5703P730m2264n3819j5184M4592n1034k4170k267
$$ plain form
14912 -119578 -85685 -61335 -48684 -14719 -43712 -25215 -48687 -29689 19592 31373 -15028
14901 -15028 -79768 -69687 -22875 -67453 -36853 21699 -6967 -96648 -109428 -91503 -111351 -105131
14889 -105131 -71714 -81738 -56740 -46212 -37449 -43767 -17636 21291 36046 27773 -9443 -26109
14877 -26109 17794 -8068 -13043 3230 -20601 -44766 -40867 -13346 16975 27837 43391 78108
14865 78108 52879 38856 -56295 -83196 8445 22631 41216 -37775 -27202 -9114 -37872 -77384
14853 -77384 -93955 -135270 -146239 -99914 13234 -5697 10857 17084 -48561 -94198 -82268 -87691
14841 -87691 -72064 -18819 11385 41192 1296 -29024 -58399 -37996 -22044 -92979 -115460 -43579
14829 -43579 -75467 -22025 4592 80295 88025 45761 -8058 -23242 21350 -29684 -53854 -56121
14817e6121O067m1900p4044j7612J12523J07722n3962m768N6728j0539J0696K196
14805C6986J0838O027n287J1194m5441n6363P727J8376J718L5748k2480k1645
14793b2602J4621R2128O606q5023K0822P3620l3716j3866o3741j2937M3687N1683
14781G1282j06695q5732K8720P6015k5185n376O1812N7608K2780m9493p9349k896
14769c6509K1122L8145J9772K985n89J9243o1662o0070K3661L9313j2479l9008
14757d6076M887l3515J9247l6238o259M9792L8013K4970k1947K5984o0553m258
14745d5953Q6009R010o7196o1020L3904Q8153P0174K6442k9255p5972l9673J2576
14733G199N113m8866N7637M03J2816L0689q1328r255L119R577Q698Q8204m9564
$$ plain form
14817 -56121 -50054 -91954 -165998 -183610 -71087 36635 -17327 -22095 34633 24094 34790 36986
14805 36986 47824 53851 48564 59758 14317 -42046 -34319 -15943 -14225 21523 -957 -22602
14793 -22602 -7981 84147 90753 5730 26552 100172 66456 52590 -11151 -24088 19599 71282
14781 71282 -35413 -121145 -92425 -16410 -41595 -46971 14841 72449 95229 45736 -33613 -36509
14769 -36509 -15387 22758 42530 45515 44926 64169 2507 -57563 -33902 5411 -7068 -46076
14757 -46076 -41189 -74704 -55457 -91695 -97954 -48162 -10149 14821 -7126 18858 -41695 -45953
14745 -45953 40056 49066 -18130 -79150 -45246 42907 113081 139523 110268 34296 -5377 7199
14733 7199 12312 -36554 21083 21486 34302 64991 -16337 -25592 -22473 -12896 -4198 84006 34442
14720C4442k0010k9621l9191k7428J3510K6437N8196N7917p197o572l3458p681
14708A9344J1519K3303k4960l4360M338M974o3745k6994N0036M5961q380N9909
14696F0945l733l6330m3039j8059n8186o6871J6763M4761R3997j3194q8837K0952
14684i0831P4736n992r0572k0903L4332j090N7319N3646J1907L6207n008j7881
14672C5870p7659Q795O9412P627j3173j2334N3588k4574N738l4209j7246L8180
14660D0015m7638M3625M6986m1683o0881m869P3964k185p2570n4640N8452J0565
14648a0859k6134J391O2624K4191k8051J5515l7388O2534M5283k5981L6143l8535
14636H0733p1066O2595L5675n7901j7978O7185m0240q6021m4268J4076j9335J8704
$$ plain form
14720 34442 14432 -15189 -54380 -81808 -68298 -41861 16335 74252 67055 60483 27025 19344
14708 19344 30863 54166 29206 -5154 -816 4158 -59587 -86581 -36545 9416 1036 60945
14696 60945 57212 20882 -22157 -40216 -98402 -165273 -148510 -103749 -9752 -22946 -111783 -90831
14684 -90831 -16095 -22087 -112659 -133562 -99230 -100320 -43001 10645 22552 58759 53751 35870
14672 35870 -41789 -32994 36418 44045 30872 18538 72126 47552 53290 19081 1835 40015
14660 40015 -7623 36002 82988 41305 -19576 -24445 49519 47334 -25236 -79876 -21424 -10859
14648 -10859 -36993 -35602 27022 51213 23162 38677 1289 63823 109106 83125 119268 80733
14636 80733 9667 72262 107937 50036 32058 99243 59003 -27018 -71286 -57210 -76545 -57841
14624e7841m418M785P1609j2632l8963o99n4068m8487m358K6019O1458K6993m9165
14611g9767N9205K8421L8581M563M046N3842j0567k7610L0509k301p4695m6086
14599b1859M8741j5479j6608l3904L43l7065m2709Q7379R7242k8833M0540R919
14587H7707J989M559k5618l5873r69j7593L930J5719m269o2829n3225O7984k291
14574b0779k4712M8615J8717L1440n4429L562L806P201P068m584L9079o0696K7012
14561B1300q364j5423P303K0174l7088n9464P9699O81p8284m5052k9269M2516
14549a01271k9165P2620n7987k7369P8390J5002j232K4014J4449M754P164J8861
14537A8230J6541L480m3987k9720M6662O8646o8986j282O99m1364k5172n694o828
$$ plain form
14624 -57841 -62259 -57474 14135 1503 -37460 -38159 -92227 -140714 -145072 -119053 -57595 -30602 -79767
14611 -79767 -20562 7859 46440 51003 55049 108891 98324 70714 101223 98922 24227 -21859
14599 -21859 26882 11403 -5205 -39109 -38766 -75831 -118540 -31161 66081 37248 77788 87707
14587 87707 89696 94255 68637 32764 31795 14202 18132 33851 29582 -33247 -86472 -18488 -20779
14574 -20779 -45491 3124 21841 53281 -1148 2414 6220 13421 20489 15905 54984 -5712 21300
14561 21300 12936 -2487 4816 24990 -12098 -71562 8137 8818 -69466 -114518 -143787 -101271
14549 -101271 -130436 -57816 -115803 -143172 -64782 -49780 -51012 -26998 -12549 -7795 -631 18230
14537 18230 34771 38251 -5736 -35456 11206 79852 10866 9584 10283 -31081 -56253 -61947 -68775
14524f8775r4831l7066Q9796O5832j9189j176L1367O7942R3365N3292j09715j13962
14512d3120K6898P9542M2840m6025j01637J6239m8776p7064K6361Q9043P038k8578
14500e7239k2175M0242M7275L8481q9162j0783N1361M553L2624j9164l0113J5047
14488I47q792L394j6488m7227k5131M3304M0990K9402L325q4402m7446O4351J7556
14475b6217M5175N6793k9062m5676k9363k4648o075L8343N7023K2728l3432n3653
14463b8064l2247J0936J3986M7479K5107J8293k5819J0749j4227j2351K8043o3154
14451b1269m5997j0115J9763M2710M2549J6121n3447M2121O127n0561M9944Q493
14439D6439j26266o0942J0478K3601M5324L1187K116l3733l1094n827o514m0974
$$ plain form
14524 -68775 -163606 -200672 -110876 -45044 -64233 -65409 -34042 33900 127265 180557 70842 -43120
14512 -43120 -16222 63320 106160 60135 -41502 -25263 -74039 -151103 -124742 -35699 -28661 -57239
14500 -57239 -79414 -39172 8103 46584 -42578 -53361 -2000 2553 35177 16013 -14100 947
14488 947 -7845 -4451 -20939 -68166 -93297 -49993 -9003 20399 23724 -60678 -108124 -43773 -26217
14475 -26217 18958 75751 46689 1013 -28350 -52998 -59073 -20730 36293 59021 25589 -28064
14463 -28064 -60311 -49375 -35389 12090 37197 55490 29671 40420 26193 13842 41885 -21269
14451 -21269 -67266 -77381 -57618 -14908 27641 43762 -9685 32436 38563 -11998 37946 46439
14439 46439 -79827 -140769 -130291 -106690 -61366 -30179 -28063 -61796 -92890 -98717 -105231 -146205
14427a46205J9345J3110N502k0046K049L0342L9380O677k4025m0109M1000N4468
14415a8512q7874j3797M9399M8347N834q4685n0160Q2103Q9894n7525M6919K8886
14403C8829O3002o4227q7875l9131P5754K8398Q120J6294j0196k1926L1444O17
14391C9103k1523q218M048m2041l3333l4721K7268j3379r319J2353n2169P2285
14379e9646M4815j8283k1884k8982k7144Q604N4105K9718K7407K0641k0619n7087
14367d8355j2865j8793P5249L5033Q198o1091r436K4045k3136q9400M547L0633
14355h5371N1569n5012m2392M6643Q297L1841Q0031R850J5780L0401k4980L9292
14343A05949R860J2116J5635M0021n2936j44052o9270J1662M3510r075o999Q2895
$$ plain form
14427 -146205 -126860 -113750 -108248 -128294 -126245 -95903 -56523 -49846 -73871 -113980 -72980 -18512
14415 -18512 -106386 -120183 -70784 -22437 -16603 -101288 -151448 -69345 20549 -36976 9943 38829
14403 38829 101831 37604 -50271 -89402 -13648 14750 22870 39164 28968 7042 38486 39103
14391 39103 17580 9362 13410 -28631 -61964 -96685 -69417 -82796 -92115 -79762 -131931 -59646
14379 -59646 -14831 -33114 -54998 -83980 -111124 -102520 -48415 -18697 8710 29351 8732 -48355
14367 -48355 -61220 -80013 -4764 30269 38467 -22624 -32060 -8015 -31151 -120551 -116004 -85371
14355 -85371 -33802 -88814 -131206 -84563 -76266 -44425 35606 45456 61236 91637 66657 105949
14343 105949 115809 127925 143560 183581 130645 -13407 -82677 -71015 -27505 -36580 -43579 39316
14331C9316K360j4100j6177N8M9026K9077m5102r6001J5245M356r466R984O2197
14318C0773K4426l3894J5144m9272p7774K7500O8912m450l5064o4467m2039M4714
14306i5491R86L0407k4205L9859P9289K5563o0075k5760k3371O162j4752j1612
14294g3000N5933Q7156K1446o6058l7580K2133K5418j7237l6169r08L8002k8974
14282i838m7985N637R17N0139j581k1509L3847j9142J6083k5380M686M2957Q061
14269C6892l490q737n7541k2632K2819L2664k9495n5838m3357M4834O5185N8271
14257C9575K2053J8479l1172q8659l50M4430l9128l7401j5259P7268P0256k1857
14245C8235K6689k5453n377j5743n0677P5652L1723l4038k9726k1825k257J9952
$$ plain form
14331 39316 41676 27576 11399 11457 60483 89560 44458 -51543 -36298 -31942 -41408 -31424 30773
14318 30773 55199 21305 36449 -12823 -90597 -63097 5815 1365 -33699 -98166 -140205 -95491
14306 -95491 -94505 -64098 -88303 -48444 30845 56408 -3667 -29427 -52798 -46636 -61388 -73000
14294 -73000 -17067 70089 91535 25477 -12103 10030 35448 18211 -17958 -18866 19136 -9838
14282 -9838 -57823 -52186 -51269 -1130 -2711 -24220 9627 -9515 6568 -18812 -14126 28831 36892
14269 36892 33402 24665 -32876 -55508 -32689 -25 -29520 -85358 -128715 -83881 -18696 39575
14257 39575 61628 80107 48935 -39724 -40074 4356 -34772 -72173 -87432 -10164 60092 38235
14245 38235 64924 39471 34094 18351 -32326 43326 75049 41011 11285 -10540 -12797 7155
14233G155m2317j0944K41O9414M9231o6075q2020m2004O1851M6158k3305j8531
14221e1146j5700o4428k9833R2527J59314O33m5769k9918m6241j1862M6057K1825
14209B5459n5292J0345P5367L1380j2176k8558j4588p0150L2834N8227p3692j6712
14197c7556O1582M2308q0357l8554P2052J04611J4302j7746o6701n1048n1893
14186d9000L6072n3340N1034Q8275K4233k4874r5806K6558J4570O4397K0596k6969
14174G5746o5378L0155k9897q0912N9865J09949N1583n8089l5138J7894L7465
14163A13243j4961J3160p397n55k5366q1405r477k0237K63M2473k629j2634k2012
14150b7534j2525Q4030M4191j5514N796k8599o4669k6663l8733K3N9640L1566
$$ plain form
14233 7155 -35162 -46106 -45865 23549 72780 6705 -75315 -117319 -55468 -9310 -32615 -51146
14221 -51146 -66846 -131274 -161107 -68580 90734 91367 45598 15680 -30561 -42423 3634 25459
14209 25459 -29833 -19488 55879 87259 75083 46525 31937 -38213 -5379 52848 -20844 -37556
14197 -37556 24026 66334 -14023 -52577 19475 124086 138388 120642 53941 2893 -49000
14186 -49000 -12928 -66268 -15234 73041 97274 72400 -23406 3152 17722 82119 102715 75746
14174 75746 10368 40523 10626 -70286 -10421 99528 151111 93022 57884 75778 113243
14163 113243 98282 111442 104045 103490 78124 -3281 -12758 -32995 -32732 9741 7112 -5522 -27534
14150 -27534 -40059 43971 88162 72648 78444 49845 -14824 -41487 -80220 -80197 -20557 11009
14138A1009k0235O335m0670L3624j3356j01823O8745J11142N7252J1985j4121
14127A09887j9731o2073n9841l8846j1610l4226k7468K5366j8318M787P3540P5959
14115A7426l900K3595P899m5655j8902j1495m4436j4446K4808J10768k7217r3852
14103g5407j524j7367M9633J07720j617k0852n264K8659n0335j14437k6953N7331
14091g0413n595J4768L8442P488l9267K8342m2962k3277j9761J3231P238P5332
14079a6434L8172k1276J2316J6193n957p7454n1193M6428K8757l5780n663L5228
14067c6663L0149K8202K2743J9015m235l8697Q204L2406p1351o6799K2228L9546
14055a5252K6699k5232J9269K2917k4955L233R1605l2983k052k5235N822L9448
$$ plain form
14138 11009 -9226 -2891 -43561 -9937 -23293 -125116 -56371 54771 112023 124008 109887
14127 109887 90156 28083 -31758 -70604 -82214 -116440 -143908 -118542 -136860 -132073 -58533 17426
14115 17426 13526 37121 45020 -635 -19537 -31032 -75468 -89914 -65106 45662 18445 -75407
14103 -75407 -76931 -94298 -44665 63055 61438 40586 35322 63981 13646 -100791 -127744 -70413
14091 -70413 -76008 -61240 -22798 -15310 -54577 -26235 -69197 -92474 -112235 -99004 -91766 -16434
14079 -16434 21738 462 12778 28971 23014 -54440 -105633 -59205 -30448 -66228 -71891 -36663
14067 -36663 -6514 21688 44431 63446 59211 20514 28718 61124 -10227 -77026 -54798 -15252
14055 -15252 11447 -13785 5484 28401 3446 6679 98284 65301 63249 38014 43836 83284
14043H3284r976n0169J6953j4298p9069K9346k9111k8600n960p351o3008J1374
14031a46585N1344Q5653O079J2834k5148J79K8095J6401K4878L4540j08902o8740
14019h9372k6745J4147P4217J9388K9385k7974k8920n3926J1204N2257M2821L2726
14007D9208J9241L8125k4093O6918n835j58779o4429K5467M6087j2779j4326j0074
13995d5269K5760R12l1304n84J8940k2240K4434Q0666M2960j2185k9695k3754
13983B8641j3981J5438l0315m531M4348l2219m6851M2943K0423j5897n4675k6786
13971g3462J9128J7217N302L7149q1441q026N7392O5384l7706j3688P0077L4301
13959I1627r4535l5396O0028M327k9304P2704O035k0370n2847m3422M2337R4567
$$ plain form
14043 83284 73308 23139 40092 25794 -53275 -23929 -53040 -81640 -87600 -94951 -157959 -146585
14031 -146585 -95241 -9588 -3509 9325 -15823 -15644 12451 28852 53730 88270 -20632 -89372
14019 -89372 -116117 -101970 -27753 -8365 21020 -6954 -35874 -89800 -78596 -26339 16482 49208
14007 49208 68449 106574 82481 149399 143564 -15215 -79644 -54177 -8090 -20869 -35195 -45269
13995 -45269 -19509 -18597 -49901 -50485 -31545 -53785 -29351 51315 94275 82090 52395 28641
13983 28641 14660 30098 -217 -4748 39600 7381 -39470 3473 23896 7999 -46676 -73462
13971 -73462 -54334 -37117 -31815 5334 -76107 -84133 -26741 38643 937 -12751 57326 91627
13959 91627 -2908 -38304 21724 26051 -3253 69451 75486 55116 2269 -41153 1184 95751
13947I5751j7677m6905p8968p0618O789O7245l4208r610N3590L8699p4441L732
13935f6621P6511k0690r1390o1709L8192L5283j9152n73j2161L6599Q6561r686
13923h836j4303L3880k9661o2433K0746M5109L2055J3656k1420j8871l2483L7244
13911e317K8863L4803k051p4816N398K0414J5566m7522n8346K8203j2484l9871
13899a07160N2401M4418N104M2000K1334J804L7654j7030J3280o364n0739j0177
13887B6525j1225n4647K9682O8143J6668o1233j6290j866k3282n5864Q109r652
13875h4932K4394K5771O0637k3291p7728j4661O2182J3454k362N2584j3795m4760
13863b2507j9268J7067j0730M343n988M4557K6041N7418J6069n1843l7145j2869
$$ plain form
13947 95751 78074 31169 -47799 -118417 -111628 -44383 -78591 -88201 -34611 4088 -70353 -66621
13935 -66621 9890 -10800 -102190 -163899 -125707 -90424 -109576 -110149 -122310 -85711 850 -8836
13923 -8836 -23139 10741 -18920 -81353 -60607 -15498 16557 30213 8793 -10078 -42561 -5317
13911 -5317 23546 58349 56298 -18518 -13120 7294 22860 -24662 -83008 -54805 -67289 -107160
13899 -107160 -54759 -10341 -5237 36763 58097 59901 97555 80525 93805 87441 36702 26525
13887 26525 15300 -39347 -9665 58478 75146 13913 -2377 -4243 -27525 -83389 -75280 -84932
13875 -84932 -60538 -34767 25870 2579 -75149 -89810 -27628 -14174 -16536 36048 22253 -22507
13863 -22507 -41775 -24708 -35438 -31095 -37083 7474 33515 90933 107002 55159 18014 5145
13851E145j854J9563J0181l6157Q503n87k4856J3059P7255j7268m5995J7656M3512
13838F8157N3702O241p1666r8608K5752m2752M522Q7107P4034L1401k8054O816
13826A16652l9970o9282l5975J1732m1053r305M4752M822J6463K6678N876P255
13814C8645M7995j14675m8523P2162L1738l5250o0424K3350L6439K4719M0638
13803E6814K4972k4983n5462m7272L2282L1445K9349n287m7478k1694K3497k6435
13791c0252J5809N2028Q420j8741J0102k515l7073N033L5004l5489q9050j5043
13779a01767K4871M1149N8623J2807k6996k7640K0510j687o6995K785J2291q81
13767e2930M7046O024P0414j5083n9559l4216n8540K5716L0569l9352L1534L6660
$$ plain form
13851 5145 3291 22854 33035 -3122 5381 4794 -20062 -7003 70252 52984 6989 24645 68157
13838 68157 121859 128100 56434 -42174 -16422 -59174 -54652 32455 106489 137890 109836 116652
13826 116652 76682 7400 -28575 -16843 -57896 -67201 -22449 -17627 -1164 25514 31390 38645
13814 38645 86640 -28035 -76558 -4396 27342 -7908 -68332 -44982 -8543 16176 56814
13803 56814 81786 56803 1341 -45931 -13649 17796 47145 41858 -5620 -27314 -3817 -30252
13791 -30252 -14443 37585 46005 27264 37366 34851 -2222 2811 37815 2326 -86724 -101767
13779 -101767 -76896 -35747 22876 35683 8687 -18953 1557 -130 -67125 -64340 -52049 -52930
13767 -52930 -5884 140 70554 55471 -4088 -38304 -96844 -71128 -40559 -79911 -48377 -11717
13755a1717N5957J5080o0684N2807J07265J2242n7076R992n6664R34p575k2704
13743C7857l0461l0226J8166R37J2069O7659N0675K2014N755o4565m1393n8012
13731i525j1504M3748k4641j4142j726L849L2020J9321k1943k4229m2m474N1725
13718C8437M8308N8192o9068l8455k5764J6109L0290j9288j05644n25j2826m2155
13706a22389N2380Q8482l1319m3204N2369N544p657J5538L7375J0746m5928l7083
13694b5146M0593q091l0958k9553O3634J4044m0743o3563n8919O2280O2475N6651
13682D2704j1080l1886P2790J2710l4228L0251n118K6489P223n4565n4901p1134
13670g0745k4291q107r330r587P2000K6068m1139K399K4488r870l1842k5526J3022
$$ plain form
13755 -11717 44240 59320 -1364 51443 158708 170950 113874 123866 67202 68136 60561 37857
13743 37857 7396 -22830 -4664 -3727 8342 76001 126676 148690 154445 89880 48487 -9525
13731 -9525 -21029 22719 -1922 -16064 -17790 -13941 18079 37400 15457 -8772 -8814 -13288 38437
13718 38437 86745 144937 75869 37414 11650 27759 58049 38761 -66883 -67408 -80234 -122389
13706 -122389 -70009 18473 -12846 -56050 -3681 1863 -5794 9744 47119 57865 11937 -25146
13694 -25146 15447 7356 -23602 -53155 10479 24523 -16220 -79783 -138702 -76422 -13947 42704
13682 42704 31624 -262 72528 85238 51010 81261 76143 102632 109855 55290 389 -70745
13670 -70745 -95036 -103143 -112473 -122060 -50060 -23992 -65131 -62732 -38244 -48114 -79956 -105482 -92460
13657i2460l2435j2861K1564O4629J00712j90N047L352k0101p2557q5979L711
13645a17568L0471r473k9970J2622j871M5958O3159L3854O767m9217o6794k3199
13633a05261Q91Q8859l401o3874L954O3397K0122k2921K1790m6570M1369J7377
13621A5732P7808K7K265n1892n1947j3670K3551N928l8213K563k5963j944q200
13608f3955L2825L504m2434K3585Q7743N6144l3429o3389n2709O565K8878N0071
13596C3399k1638J1190l3239n9337J8726K4316K0880K8942q115K9492R663l8040
13584A6239j7932L3422J9135k978l5001R666L9284k5533k0904M353K1919O5298
13572A06968p894p3512J3624K5521l2127O991L3406k5463K9961J9227j8186O1844
$$ plain form
13657 -92460 -124895 -137756 -116192 -51563 49149 48959 54006 57358 37257 -35300 -121279 -117568
13645 -117568 -87097 -96570 -126540 -113918 -115789 -69831 -6672 27182 33949 -15268 -82062 -105261
13633 -105261 -104370 -15511 -18912 -82786 -78832 -15435 4687 -18234 3556 -43014 -1645 15732
13621 15732 93540 93567 95832 43940 -8007 -21677 1874 7802 -30411 -27848 -53811 -55755 -63955
13608 -63955 -31130 -27626 -70060 -46475 41268 97412 63983 594 -52115 -45550 -16672 33399
13596 33399 11761 22951 -10288 -69625 -50899 -26583 -5703 23239 15124 44616 54279 16239
13584 16239 -1693 31729 50864 47886 12885 22551 61835 36302 15398 19751 41670 106968
13572 106968 99074 25562 39186 64707 32580 39571 72977 47514 77475 96702 78516 140360
13560A40360Q539k6887q7202j0552K4120j1482M0131K112k4580J6757j3125p5429
13548a7238Q380R7419j1209k2222L5197K1337m7968k3581K3722j4088l536q5401
13536c9188Q9745L4736m9842l7349m0209M076O9936L3628o752n1926K2887L9935
13524F9677m3211R452p834r896k8849K059l4574J8890O8939l0513j279J4458M4075
13511G1394n912m9740L4312p6535r2016K4773P4290L5559J3132N3930k8217o9034
13499a4064m2733l1539K5813L4341l7118N7203O6008L052J9025n5872K6436J9394
13487F9946n2984r2094m4582O4109L8689J5760K0229O5294n7185p496J9998n020
13475C4664K2690k0881n4175j1739O2755N7592O960p3421n5038P467R6102L0839
$$ plain form
13560 140360 148899 122012 34810 24258 48378 36896 77027 79139 54559 71316 58191 -17238
13548 -17238 -8858 88561 77352 55130 90327 111664 63696 40115 63837 49749 46213 -39188
13536 -39188 50557 85293 35451 -1898 -42107 -38031 31905 65533 58781 6855 29742 69677
13524 69677 26466 35918 28084 18188 -10661 -8602 -43176 -24286 44653 14140 12861 27319 71394
13511 71394 65482 15742 50054 -26481 -118497 -93724 -19434 16125 29257 83187 54970 -14064
13499 -14064 -56797 -88336 -62523 -28182 -65300 -8097 57911 60963 79988 24116 50552 69946
13487 69946 16962 -75132 -119714 -55605 -16916 -1156 19073 84367 27182 19686 39684 34664
13475 34664 57354 36473 -17702 -29441 33314 90906 97866 24445 -30593 -23126 72976 103815
13463A03815L261l4283n7838n1285j4347n7966N1184J45395m92j18369m691J9003
13451a6613n305J04357M5039J584l9174j1530L9068K4800n7257p3490n5974k7235
13439g1730J3542Q7632o502k9881l1722k045M2259o2447J1970L8720m300K8726
13427A4222R400M0996j9545p7857M2645K199N12O9389J1432m1868r0480k0391
13415e9346L9642K5850M1757l4880N671m5146j1698M6246R6k5984J4042N2328
13403D8578j3320J1668M1356K5783j2393J0591k9724q7272m8477K4340K0837O3713
13391E5680J5823p8856r977j9931J1660L8578K1000J1918K1216Q1569K0257k5425
13379A43512j17066j4758M0068K0581N1269M5862j4166n2693N418K9498n1107
$$ plain form
13463 103815 107076 72793 14955 -36330 -50677 -108643 -57459 87936 87444 -30925 -35616 -16613
13451 -16613 -21918 82439 127478 129062 89888 78358 117426 142226 84969 11479 -44495 -71730
13439 -71730 -58188 29444 22942 -6939 -38661 -40706 1553 -60894 -48924 -10204 -14504 14222
13427 14222 23622 64618 45073 -32784 9861 12060 12572 81961 93393 51525 -38955 -59346
13415 -59346 -19704 6146 47903 13023 18694 -26452 -38150 8096 8192 -17792 -3750 48578
13403 48578 35258 46926 88282 114065 101672 112263 82539 -4733 -53210 -28870 -8033 55680
13391 55680 71503 -7353 -17330 -37261 -25601 12977 33977 45895 67111 148680 168937 143512
13379 143512 26446 11688 51756 72337 123606 169468 155302 102609 108027 137525 86418
13368H6418J1226R830o9243n8608N5938Q9143m927M3031K1962k0117r657K4254
13356A79250j1185p3516p2557k7047P3448n690j5265O7046Q291M4183q815k2464
13344A35679r1752k357J6231K2966l8867K5694L303J1163L3680K942l6254p205
13332G5223K2160K1099K0937N9945j8676j11270k2824J9499J06286J4483p7557
13321A09305n4110p582N1326N7798J2107p565n187l5487k9676Q728O783m5760
13309F0680o747O2661O5748j4646j28847l8444L3600O9447j2205M805J2702j2049
13297I6705M2695J2947r8748l3910m52L2644N9304K2844K0572K2973p9970n6394
13285D1210K4776L698K7693j2778o5402K0432J2043J2464N9144L7806J5727l3919
$$ plain form
13368 86418 97644 107474 38231 -20377 35561 124704 119777 162808 184770 164653 154996 179250
13356 179250 168065 94549 21992 -5055 68393 62703 47438 114484 122775 166958 158143 135679
13344 135679 43927 41570 57801 80767 41900 67594 70897 82060 115740 118682 82428 75223
13332 75223 97383 118482 139419 199364 180688 69418 46594 66093 172379 186862 109305
13321 109305 55195 47613 98939 156737 168844 161279 156092 120605 90929 99657 106440 60680
13309 60680 53933 116594 182342 167696 38849 405 34005 103452 91247 96052 108754 96705
13297 96705 139400 152347 53599 19689 19237 51881 111185 134029 154601 177574 97604 41210
13285 41210 65986 69684 97377 84599 19197 39629 51672 64136 123280 161086 176813 142894
13273A42894J742k0468l696K9564j4075p6614j1253K9962o3344m0218J5770k4416
13261c4152k2409O7575P4673O957p8315K572k0635P9099j3991m0778M7975k6474
13249D2097k7896K3752Q1345L368K2726K4608p3403l2791p2102l3562K618Q4161
13237D4921P4305N5552k5795q6601k5251K9695J9476k5780r907M2851M9782L0032
13225A73280j0227K5443O3177J8135k0965j00823k6866k6061k9855K2718J02050
13214A90006O9153l8661m3620j7990q249j4530k8589Q964L437J1505m2796L9917
13202A28547k4720j4515l515N4904J5565J6663K3343N2313L5314j941p9025k3421
13190A79512P123N54m8566K1757l5989l9243J2922O4417P0509k0525j5347m3049
$$ plain form
13273 142894 144636 124168 120472 150036 135961 59347 48094 78056 14712 -25506 -9736 -34152
13261 -34152 -56561 11014 85687 92644 14329 16901 -3734 75365 61374 20596 68571 42097
13249 42097 14201 37953 119298 122666 145392 170000 96597 63806 -8296 -41858 -39240 44921
13237 44921 119226 174778 148983 62382 37131 66826 86302 60522 50615 93466 143248 173280
13225 173280 163053 188496 251673 269808 248843 148020 121154 95093 65238 87956 190006
13214 190006 259159 220498 176878 158888 150639 136109 107520 116484 119921 131426 88630 128547
13202 128547 103827 89312 85797 140701 156266 172929 196272 248585 283899 281958 202933 179512
13190 179512 186635 187189 138623 160380 124391 85148 98070 162487 232996 212471 197124 154075
13178A54075l6422L1458M8198J0359l1922J2338N3222O4862q187K9962j0197j7960
13166B99786l1925r0701p1931J7283M0855M2034Q6836K1000j23355J4343L1337
13155B35562l1223J9240J8563m81k2125J1056m5468J5336J0951j9114N438k5274
13143A72461L113Q5O3001M0094j9951o629q728K3979l1096J9830n8021m9571J04362
13130B52929Q1920M1417j1345k3088k1175j1641l2504J4765l1920q955K7295J4033
13118B91731K884O281K6142P903k311M5188M0481k8273K674K4380N3928J9204
13106D90212j7806J4290R059M7394L4035o6693q161K9459J1460l2080q1732J5489
13094D44926L3701q3724k104Q7156P3974J4363o7637q0155n8392j05698l6236
$$ plain form
13178 154075 117653 149111 197309 207668 175746 188084 241306 306168 297981 327943 317746 299786
13166 299786 267861 177160 105229 122512 163367 205401 292237 313237 189882 204225 235562
13155 235562 204339 223579 242142 241661 219536 230592 185124 200460 211411 192297 197735 172461
13143 172461 175574 175659 238660 278754 258803 252174 243446 267425 236329 256159 198138 148567 252929
13130 252929 334849 376266 364921 341833 320658 309017 276513 291278 259358 250403 277698 291731
13118 291731 294615 300896 327038 334941 332630 377818 418299 390026 392700 417080 471008 490212
13106 490212 472406 486696 495755 543149 577184 510491 502330 531789 543249 511169 429437 444926
13094 444926 478627 394903 392799 479955 553929 568292 500655 420500 362108 256410 220174
13083B20174O3941p365K3207N6963Q0558n237L056K2144K1274k9382k3214o0966
13071C65153q3701Q7445Q6084m6008j2349o1652k0125N4633L9192k315O7213Q135
13059D81705M6603j1513J3825L6012n0647j9191j1332L7994O3658l4204L316K5669
13047E81895O8585l59j5991o9199k7264J0760k5991k6923o2199L2143O4234J11079
13035F40770L2040q084J0483l6306L9960j1878J8731J1780o4663O0697Q942j4850
13023F87622L5407j5320k9573o969M2662M7945L8226K563Q703r7099o7069K9480
13011F76578P8908N179j1351P7030M0583j4807O3590P764L4765l7353M457K3383
12999I48726O6137L151k1495k2171j9135R0068P740m8329O2714R4800O887J0048
$$ plain form
13083 220174 284115 276750 299957 356920 437478 432241 435297 457441 478715 449333 426119 365153
13071 365153 281452 368897 454981 408973 396624 334972 314847 369480 408672 406357 473570 481705
13059 481705 528308 516795 530620 566632 515985 496794 485462 523456 587114 552910 556226 581895
13047 581895 650480 650121 634130 564931 537667 548427 522436 495513 433314 465457 529691 640770
13035 640770 672810 664726 675209 638903 678863 666985 685716 697496 632833 693530 702472 687622
13023 687622 723029 707709 678136 671167 713829 761774 800000 802563 811266 714167 647098 676578
13011 676578 755486 760665 749314 826344 866927 852120 915710 923474 958239 920886 925343 948726
12999 948726 1014863 1018014 996519 974348 955213 1045281 1053021 1004692 1067406 1162206 1169093 1179141
12987A179141R5934M5448n5714l0072k9934N3445K5261l565N1398Q0834M697J1718
12975A428591O1321J3802J6970n4132k52R9967J6390J9574M7809N6249j7640M712
12963A693361O4513N4206K8131p632l7815M9128n898m603P7084O5344N9868K4968
12951B060655P1154l3531n1332O6149O3720N800K5915J22465O6091m0033Q6080
12940B443133J64671K9287J8240K8501O8766P0605J20859O9205L8008K5304R0655
12929C167234O6451R0456O0936R3503N4909J10214P8130J72183J22603M7554O7525
12918D131698J02563J55590P7907M9545Q1044J72787K02208J86258J23538K26458
12908E509596K13707J76321J18963J90076J15266J66090K22939K17684K34596
$$ plain form
12987 1179141 1275075 1320523 1264809 1234737 1204803 1258248 1283509 1279944 1331342 1412176 1416873 1428591
12975 1428591 1489912 1503714 1520684 1466552 1466300 1566267 1582657 1602231 1650040 1706289 1688649 1693361
12963 1693361 1757874 1812080 1840211 1832579 1794764 1843892 1837994 1833391 1910475 1975819 2035687 2060655
12951 2060655 2131809 2098278 2046946 2113095 2176815 2182615 2208530 2330995 2397086 2357053 2443133
12940 2443133 2607804 2637091 2655331 2683832 2752598 2823203 2944062 3013267 3051275 3076579 3167234
12929 3167234 3233685 3324141 3385077 3478580 3533489 3643703 3721833 3894016 4016619 4064173 4131698
12918 4131698 4234261 4389851 4467758 4517303 4598347 4771134 4973342 5159600 5283138 5509596
12908 5509596 5723303 5899624 6018587 6208663 6323929 6490019 6712958 6930642 7165238
12899G165238J79007K70664L14302K42156K83590L01387L24076L76172L69546
12890I826138K94722L51141L59582L76801M53551M92339M82745M67645N09679
12881A3614343N53505N85957O13484N12358O20127O39856O98976P27577Q09428
12872A9375611Q90163Q94501R73700R46546R34407J048640J026178J071594J108799
12863B8270139J164340J115397J180170J185002J103033J044803J055488J020943
12855C7139315J022381R13633Q49178P88524N95384M98614M92369L49809J42160
12846D2791367j8233j25718k88841m68218o13366o93400p53928p86669q08585
12837C8234409r12590j022248j050303j109172j159777j097301j047051j159994
$$ plain form
12899 7165238 7344245 7614909 7929211 8171367 8454957 8756344 9080420 9456592 9826138
12890 9826138 10120860 10472001 10831583 11208384 11661935 12154274 12637019 13104664 13614343
12881 13614343 14167848 14753805 15367289 15879647 16499774 17139630 17838606 18566183 19375611
12872 19375611 20265774 21160275 22133975 23080521 24014928 25063568 26089746 27161340 28270139
12863 28270139 29434479 30549876 31730046 32915048 34018081 35062884 36118372 37139315
12855 37139315 38161696 39075329 39924507 40713031 41308415 41807029 42299398 42649207 42791367
12846 42791367 42773134 42647416 42358575 41890357 41276991 40583591 39829663 39042994 38234409
12837 38234409 37321819 36299571 35249268 34140096 32980319 31883018 30835967 29675973
12829B9675973j089295j027781r59184r75622r94745j032465r72550q53354q26501
12820B0944476p40296o50795p76303p90708o71109o24337o25051n59311o81874
12811A4824692n91432m73049m52634n83600m61849m11482l54545m39312m49533
12802A0607256l03975l12163l30116l34906k51842k57986l20992k88411k79565
12793G927300j94346k30683j90675k77355j94129j47750j85544k39184j77985
12784F089649k10959j58083j31414j18138k23436j62283j69089n2833o1020j45421
12774D656973j06751r8967j43273o1917j49474j43507q868o8863j28683n3707
12764C692963l2042j10587j41274o8541J4690p5803j01123l1439o1120p1965l6961
$$ plain form
12829 29675973 28586678 27558897 26599713 25624091 24629346 23596881 22624331 21770977 20944476
12820 20944476 20204180 19553385 18777082 17986374 17315265 16690928 16065877 15506566 14824692
12811 14824692 14233260 13760211 13307577 12723977 12262128 11850646 11496101 11056789 10607256
12802 10607256 10303281 9991118 9661002 9326096 9074254 8816268 8495276 8206865 7927300
12793 7927300 7732954 7502271 7311596 7034241 6840112 6692362 6506818 6267634 6089649
12784 6089649 5878690 5720607 5589193 5471055 5247619 5085336 4916247 4863414 4802394 4656973
12774 4656973 4550222 4451255 4307982 4246065 4096591 3953084 3944216 3875353 3746670 3692963
12764 3692963 3660921 3550334 3409060 3340519 3355209 3279406 3178283 3146844 3085724 3013759 2976798
12753B976798o6656r4474k5022q2237j19194m3699q927r3809p5174m1646l8342
12742B287618r1200k4396M8545j1857j0427q1045j5496j0336l5347j12269j33586
12731A810204K322L879n7689n5199M1078J08541m322j10669j09898J7438Q437
12720A654122j04495l9626N2717j0810l4052J9480l1273L8690l7427p0794m2436
12709A394096o0787r656j0758n1820n4180N5055L0630l3424n873J4470m9739p902
12697A210112J9529j3268N838k6556l0100o2679p4104j6973J8667M5311L2588
12686A108365j7636p1926k6209N7425k6673k490M6266r6849K8232M4112j8686
12675A023931l6046p6883j0151n3939K2450j3082m6445l4415m4465m6563L2864
$$ plain form
12753 2976798 2910142 2815668 2790646 2708409 2589215 2545516 2536589 2442780 2367606 2325960 2287618
12742 2287618 2196418 2172022 2220567 2208710 2198283 2117238 2101742 2091406 2056059 1943790 1810204
12731 1810204 1812526 1816405 1758716 1703517 1744595 1853136 1848814 1738145 1628247 1645685 1654122
12720 1654122 1549627 1510001 1562718 1551908 1517856 1537336 1506063 1544753 1507326 1436532 1394096
12709 1394096 1333309 1323653 1312895 1261075 1206895 1261950 1292580 1259156 1253283 1267753 1218014 1210112
12697 1210112 1229641 1216373 1222211 1195655 1165555 1102876 1028772 1011799 1030466 1075777 1108365
12686 1108365 1090729 1018803 992594 1050019 1023346 1020856 1067122 970273 998505 1042617 1023931
12675 1023931 987885 911002 900851 846912 869362 856280 809835 775420 730955 684392 717256
12664G17256K0717m606K136q587L9893j5722j00085n0171j3586M8346O2936J9427
12652G17954k8920M269R105j4376m7768j1391M5173K78m3227n7481j9837l7083
12640E16696L2463K0906K9099J2285k1970K0940l0452J9430J6843l7889N9072
12629F37423l1368k2507j2179l9309L3545J0743J7769o4883r6312L1877J4254
12618D79053j3910n905M5895j6788j12223p689N4636M7673k788m8453J6509J19660
12606E55670J7635j07441n8350L6648m8036K684K3688P9624k90J0213Q541J7676
12594E38262N9240M5222k5879r1070j7425n736J3721m8974K3632K5767r936k7224
12582D79600Q429m4707k3641k4744N8513p24k1032Q816p2966j8483j0514O1871
$$ plain form
12664 717256 737973 733367 735503 726916 766809 751087 651002 600831 587245 635591 698527 717954
12652 717954 689034 693303 702408 688032 640264 628873 674046 674324 631097 573616 553779 516696
12640 516696 549159 570065 599164 611449 589479 610419 579967 599397 616240 578351 637423
12629 637423 606055 583548 571369 532060 565605 576348 594117 529234 432922 464799 479053
12618 479053 465143 459238 505133 488345 376122 368433 423069 470742 467954 419501 436010 555670
12606 555670 573305 465864 407514 444162 396126 398810 422498 502122 501832 512045 520586 538262
12594 538262 597502 642724 616845 525775 508350 502614 516335 467361 490993 516760 506824 479600
12582 479600 488029 443322 419681 394937 453450 452726 431694 440510 367544 349061 338547 400418
12570D00418K8770l6494p130k0356k9473R636L1708q3072j0914K6710N4749m033
12558C60519j6729k5372o124k3086j4971M5255J01543Q3351l1428j3200j20045
12547C39713k1365M0587K9524q6430m2571j1303J4998M3021k0970M564P615K2825
12535C20208p0013R868J919o920r1213k8124j9822N7996l7005l6165K1073m195
12523A17607N1867L1303J02588R7346l5630n8697k1112m7883m1684R316K8975
12512B33996M77n167M552p2881j2962K6115k4666j1329P2314L0231n3341K4398
12500B11737J439J5971O790K6821j0967l1719J6822K2604o7579p9424L3529J8232
12488A64256L7570M9539m6975m4238j7178j9678M4936M0303L939M8059o09o8698
$$ plain form
12570 400418 429188 392694 385564 365208 335735 345371 377079 294007 283093 309803 364552 360519
12558 360519 343790 318418 312294 289208 274237 319492 421035 504386 472958 459758 339713
12547 339713 318348 358935 388459 302029 259458 248155 263153 306174 285204 289768 297383 320208
12535 320208 250195 260063 261982 255062 163849 135725 115903 173899 136894 100729 121802 117607
12523 117607 169474 200777 303365 400711 365081 306384 285272 237389 195705 205021 233996
12512 233996 234473 229306 233858 160977 148015 174130 149464 138135 210449 240680 187339 211737
12500 211737 213176 229147 235937 262758 251791 220072 236894 259498 191919 112495 146024 164256
12488 164256 201826 251365 204390 160152 142974 123296 168232 208535 212474 260533 259924 191226
12476A91226R493l9838p9149N7084N9796K8012q2334j3120J7253m0912m0432R334
12464G6413P6808n294m3715J1833P366k0346M8823p3718m2388n94N5829M9013
12452A40030O5735L3435o3856k926l2743r765q0829k7117M1985l1779L5451J4635
12440H2256O8044K0769k5836l6273p8841J3152K3489L5241L0289l7954M4928k1504
12428A17760q453l5698r447M0716M2308k1507l7288O3089N6364J1706J6769p286
12416B29033k8545j9500M715J463l8607j9966m2680m2640L6484M961L7644L94
12404A22756P27l8414n0319M2622R2096N6137K5469m1589n6013K9831R026q311
12392A84018j19677m7938N9279K5182n6319k0698J6260k773q671M5767p23N4165
$$ plain form
12476 191226 200719 160881 81732 138816 198612 226624 144290 131170 148423 107511 67079 76413
12464 76413 153221 147927 104212 116045 123411 103065 151888 78170 35782 35188 91017 140030
12452 140030 205765 239200 175344 172418 139675 129910 49081 21964 63949 32170 67621 82256
12440 82256 150300 171069 145233 108960 30119 43271 66760 102001 132290 94336 139264 117760
12428 117760 109307 73609 64162 104878 147186 125679 88391 151480 207844 219550 236319 229033
12416 229033 200488 180988 185703 187166 148559 128593 85913 43273 79757 84718 122362 122756
12404 122756 123483 85069 34750 77372 169468 225605 251074 209485 153472 183303 192329 184018
12392 184018 64341 16403 75682 100864 44545 23847 40107 37334 28663 74430 73707 127872
12380A27872j500M6169m2053p4870L944j6294Q735K1311l78o104K4584l2538J223
12367F0101R557P7680J7410r119L8685l2807l7010J0644K9028L224P056m0608
12355A33841J3233J4966L4694K0503J5305K0102j38997p8640j3140k1217Q2640
12344H3290M5376l2714L0716j6888l7168k7176n4006j8324O3671O1470J8087J03143
12332B19477j4076j41432j13778k2350n4366J6300P0754N9257j9866J2106M1809
12321E3835p355J5223J6319k8781q166O1395p827m0350L0538m159k8332p6873
12309b4533m8944R3758J4795n265k581p436j9960Q234K1894J9451k7900l4083
12297a2570J829J3051q896K1531J8975J7466m1416k6000O9526P6737N0617L4166
$$ plain form
12380 127872 126372 172541 130488 55618 59562 43268 52003 73314 72936 66832 91416 58878 60101
12367 60101 69658 147338 164748 155629 194314 161507 124497 135141 164169 167393 174449 133841
12355 133841 147074 162040 196734 217237 232542 252644 113647 35007 21867 650 83290
12344 83290 128666 95952 126668 109780 72612 45436 -8570 -26894 36777 98247 116334 219477
12332 219477 205401 63969 -49809 -72159 -126525 -110225 -39471 19786 -80 12026 53835
12321 53835 46480 61703 78022 49241 41075 102470 94643 54293 84831 80672 52340 -24533
12309 -24533 -73477 20281 35076 29811 27230 19794 -166 8068 29962 49413 21513 -12570
12297 -12570 -10741 2310 -6586 14945 33920 51386 9970 -16030 53496 130233 180850 215016
12285B15016m5475o9649q2296l1359k8757K0604O0328J5600K9894K0778R504k6014
12273H8174K3170J6030l5271l550o7444K9273p285l4674k056l177J7581L6199
12261E6970l6278j3567N6142M898K0936R302m3659m980P533m537k9854l2907l4184
12248d4185L9707L2525j2021l3547l0205M6673k5226j5697l5910o6306k4292J0832
12236a57652M6844N4307K5083o112Q4292N0159m5446q416m069n3445L2517J13297
12224A31359K8532n637Q180k5706q6008n1160k3924j5332j6356J3403M0351N290
12212B992k3563j0838J037j2865j2345Q6586M6129p389j1946L2636P5375j2198
12200A53611q0473k9730k8833j0385K5390j8240K2327K360l5605J8227L057L7863
$$ plain form
12285 215016 169541 99892 17596 -13763 -42520 -21916 38412 54012 83906 104684 114188 88174
12273 88174 111344 127374 92103 88553 21109 50382 43097 8423 6367 3190 20771 56970
12261 56970 20692 7125 63267 68165 89101 98403 54744 49764 57297 52760 22906 -10001 -44185
12248 -44185 -4478 28047 16026 -17521 -47726 -1053 -26279 -41976 -77886 -144192 -168484 -157652
12236 -157652 -110808 -56501 -31418 -37530 46762 96921 51475 43059 38990 -14455 18062 131359
12224 131359 159891 154254 162434 136728 50720 -440 -24364 -39696 -56052 -42649 -2298 2992
12212 2992 -20571 -31409 -30372 -43237 -55582 31004 77133 69744 57798 90434 165809 153611
12200 153611 73138 43408 14575 4190 29580 11340 33667 36027 422 18649 21706 59569
12188E9569P728L7433m825o80k0091J5439m206p1821M546j8497M1579J425k2678
12175B4921Q4813l999o2620o7907J5060O7256l2941k8283k795M4720J2502L4618
12163H5345j3770M2818l4383m6400L7937k9955j4720l960K8816m48j17941j4326
12151h0987P9526q86N3696j4037o9259m7360M59J51j0035K5693J1063p4647j9538
12138a46161N6116J1215K815L5232N7716M1369K5732m6283q8504K1248J7476L906
12126h123N2116j8332m7838o583q83N0664l6960m1042n5567q281M3627N5178P4367
12113E2343l8165o3267K5609l1598K2543M9590l7578o8247J6954r274k5130L5771
12101g0449J2937K1657J1927N382M2453m6177k8681o345K279K9530N3399m5690
$$ plain form
12188 59569 67297 104730 99905 99225 79134 94573 90367 18546 23092 4595 46174 47599 24921
12175 24921 109734 105735 43115 -24792 -9732 57524 24583 -3700 -6495 38225 50727 85345
12163 85345 71575 114393 80010 33610 71547 41592 26872 22912 51728 51280 -66661 -80987
12151 -80987 -1461 -2347 51349 37312 -31947 -79307 -78848 -78697 -88732 -63039 -51976 -126623 -146161
12138 -146161 -90045 -78830 -76015 -40783 16933 58302 84034 37751 -50753 -29505 -12029 -8123
12126 -8123 43993 25661 -22177 -28760 -29643 21021 -15939 -56981 -112548 -120829 -77202 -22024 52343
12113 52343 14178 -49089 -23480 -55078 -32535 17055 -20523 -88770 -71816 -81090 -106220 -70449
12101 -70449 -57512 -35855 -23928 -18546 23907 -22270 -50951 -57296 -55017 -25487 27912 -17778
12089a7778O37j2054P4938m25l8136K6743m5569r5793k4196M8360O6668J1698
12077d907l4043k9115O498n4930j0764L5573K2123l4723J2136P121k4554N449
12065a04136M9762O1653R389k3609J0066j4451O1470J0417o8442j29795l1090
12054a68766J06603N3523p9421K0554O0861J8044l0056p333k167k9167O8401N216
12042A6292J6697m1132m4822k4979m3312k6201N49J0120J1495N7000O6674L1562
12030B9943L7434j7807p836k6019K2867J0645m6429j5294J4803K1908M1386r458
12018E6143q1803m1114m526J7873K8174O5018L1084j4552J3437N1572k0351m3689
12006E7266R17j7556k0673j6619J8807K3998m303j985K1561J0154L74j3215n5750
$$ plain form
12089 -17778 -17141 -29195 45743 45318 7182 33925 -11644 -107437 -131633 -83273 -16605 -4907
12077 -4907 -38950 -68065 -61567 -116497 -127261 -91688 -69565 -104288 -92152 -85031 -109585 -104136
12065 -104136 -54374 7279 16668 -6941 3125 -11326 50144 60561 -7881 -137676 -168766
12054 -168766 -62163 -8640 -88061 -67507 -6646 11398 -18658 -25991 -28158 -57325 11076 16292
12042 16292 32989 -8143 -52965 -77944 -121256 -147457 -146908 -136788 -125293 -68293 -1619 29943
12030 29943 67377 49570 41734 15715 38582 49227 2798 -12496 2307 24215 65601 56143
12018 56143 -25660 -66774 -71300 -53427 -25253 39765 70849 56297 69734 121306 100955 57266
12006 57266 58183 40627 19954 3335 22142 46140 41837 39852 61413 71567 71941 58726 2976
11993B976l2534M9827O632r435k6465j7598K8823m365l1983n9043L3738l6906
11981i6333N5733M9435p18N6961M0243o0967l1124k2399k6769k838L9174J5745
11969A6143l4830n2100j8497M8188J7020k3155o2806K497P2419M9654R737j5367
11957H903p9890r365L1407J4054J7042K1030k3666l7593k0130Q5640m8827o6353
11945a07748K9730J034m1188L3443R8629O0942J0735r163k328l0719m6296p3088
11933g6017M3963J6450j21722k9791j8754J2294M9756J5109L9206K1895j6371
11922f3982p4338J308P2408o768m3279l587L8880P2173K1601l2876n6073N7946
11910a6587K1570n9877k9077M5242J8829l3587K1492l4252k6405o599Q1607M807
$$ plain form
11993 2976 -29558 20269 26901 17466 -8999 -26597 2226 -2139 -34122 -93165 -59427 -96333
11981 -96333 -40600 8835 8117 65078 105321 44354 13230 -9169 -35938 -38776 398 16143
11969 16143 -18687 -70787 -89284 -41096 -24076 -47231 -110037 -107540 -35121 14533 24270 8903
11957 8903 -70987 -80352 -48945 -34891 -17849 3181 -20485 -58078 -78208 7432 -41395 -107748
11945 -107748 -78018 -76984 -118172 -84729 13900 74842 85577 76414 74086 43367 -2929 -76017
11933 -76017 -32054 -15604 -137326 -167117 -185871 -173577 -123821 -108712 -69506 -47611 -63982
11922 -63982 -138320 -137012 -64604 -71372 -114651 -118238 -79358 -7185 14416 -18460 -74533 -16587
11910 -16587 4983 -54894 -83971 -38729 -19900 -53487 -31995 -66247 -92652 -99251 -17644 -12837
11898a2837K9891p0458l817L528K871K1338K4647j9004K7510j6033k675N754o503
11885a5788l7879j4J6430q744k0783Q134K3921N4007J01590M1460m322r7925r969
11872E0118r694j8334K9412k4915k3457o16M81l1365l2441M50m1112L4673J6853
11859d9947M0878q400K6025l498l0899O7536K2385m3140m2609R872O3101J1105
11847F2409j7019j4511l5095P1396N6693q8884l1549l9865O9516J4905o832R897
11835E1061J1401j8623m9409m5066N0135m1401j7334l1531M4028j1103M707P3976
11823B0841J5885q727k8492J5146L250m2036m589j7537n8105Q8860J1545J338
11811b621K5323R808n6133o1931l6428K2660N4897m769j4887J8735L960J3751
$$ plain form
11898 -12837 17054 -53404 -57221 -53693 -50822 -29484 -4837 -23841 3669 -12364 -15039 -9285 -15788
11885 -15788 -53667 -53681 -37251 -45995 -66778 -58644 -34723 19284 120874 162334 158012 60087 50118
11872 50118 40424 22090 51502 26587 3130 2514 2995 -28370 -60811 -60361 -101473 -66800 -49947
11859 -49947 -9069 -17469 8556 5058 -25841 41695 64080 20940 -21669 -11797 51304 62409
11847 62409 45390 30879 -4216 67180 123873 34989 3440 -36425 33091 47996 41164 51061
11835 51061 62462 43839 -5570 -50636 -501 -41902 -59236 -90767 -46739 -57842 -53135 20841
11823 20841 36726 27999 -493 14653 17903 -24133 -28722 -46259 -104364 -15504 -3959 -2621
11811 -2621 22702 32510 -23623 -85554 -121982 -99322 -44425 -49194 -64081 -45346 -41386 -27635
11799b7635Q782K0704J1007O2874l0082k6171K1884l3178J7909R838k6304m3233
11787c3605m0133P8996j5374r4740N7968l6114O514Q7411k2837j2334k3578M3424
11775d402Q7652L2130k1559l2450q486q1879j2997P810N085n3252O292P0123l6057
11762d1990l7449K5576L8311P0816k7789k7415k1853n1096l3805N9857p847j1254
11750f5938M4733j5909p837K4223K3857m496j8059q4149k7595r600J8460M9216
11738g3094j1646Q739k7111M6732J6915L3841N391q2777l4832L0579J7401p089
11726g6951K8122M784l8483J2155k1738L7909j1435p1984m1911J6397Q3267J3819
11714f6049l2957L2797m239o1385R6584R4152j7024k1015m8729j2543J0568J2635
$$ plain form
11799 -27635 -18853 1851 12858 75732 45650 19479 41363 8185 26094 35932 9628 -33605
11787 -33605 -73738 5258 -10116 -104856 -46888 -83002 -76488 10923 -11914 -24248 -47826 -4402
11775 -4402 83250 115380 93821 61371 52885 -28994 -41991 -34181 -29096 -82348 -76056 -5933 -41990
11762 -41990 -79439 -53863 -15552 55264 27475 60 -21793 -72889 -106694 -46837 -54684 -65938
11750 -65938 -21205 -37114 -44951 -20728 3129 -1367 -19426 -103575 -131170 -140770 -122310 -73094
11738 -73094 -84740 -76001 -103112 -56380 -39465 -5624 -233 -83010 -117842 -87263 -69862 -76951
11726 -76951 -48829 -44045 -82528 -70373 -92111 -54202 -65637 -137621 -179532 -163135 -79868 -66049
11714 -66049 -99006 -66209 -70448 -131833 -35249 58903 41879 20864 -27865 -40408 -29840 -17205
11702a7205J0836K8654j2647N122M2016o5967j6884j622O188l7905l4093M2154
11690e1353k8534K9233O002p979M1317M0648J0503K3630K567o9090o6798l717
11678g3571l2846l8507M7596L1149o2311N471O2473l342O4416n143l7021j6782
11666e8418n0078k0880M4659L1054k3622n5601m642J1618J8517N3805K6045J8475
11654i068J8754k9611p0139o2797K3858L9020p421l3236k4696L1626J9784P2091
11642c1835l828j0529k7196K713M6731l6890L1003K5260l8277m6715N259k6249
11630a10553J9777N5351L4688M5165J7071k8316m1913k5102k7543L3932M6607
11619A9164l2455M5326j4562L0321N8425K000q5206J2222K593L127O0263q457
$$ plain form
11702 -17205 -6369 22285 9638 14760 56776 -9191 -26075 -27697 -21509 -59414 -93507 -51353
11690 -51353 -79887 -50654 -44652 -52631 -11314 29334 39837 63467 66034 -3056 -69854 -73571
11678 -73571 -106417 -144924 -97328 -66179 -128490 -123019 -60546 -63888 528 -4615 -41636 -58418
11666 -58418 -108496 -129376 -84717 -53663 -77285 -132886 -137528 -125910 -107393 -53588 -27543 -9068
11654 -9068 9686 -19925 -90064 -152861 -129003 -89983 -97404 -130640 -155336 -123710 -103926 -31835
11642 -31835 -35663 -46192 -73388 -70675 -23944 -60834 -29831 -4571 -42848 -89563 -84304 -110553
11630 -110553 -90776 -35425 -737 44428 61499 33183 -8730 -33832 -61375 -27443 19164
11619 19164 -13291 32035 17473 47794 106219 108219 23013 35235 37828 40955 101218 92761
11607I2761N9361Q0043N3911m2286m5462N0548O2545m2191q1306J0107k3055r2810
11595H2166r1541k4549J12207K7272l9529o8852q2414Q482j1081L7459L8106l5361
11583d7635j0225O252r68K4455k0006J0525M988L8124L8019j0288J3835R240j1040
11570D5276K4403m258j8931N5352O5123L2601k8245Q23N5859l0149O7084M9977
11558C14915j4992J8762L3865p193o0775p3971l4441J4093J3042p6117M5732k2655
11546A50265k4147j6522J7237Q899k3182m2483k9013m1429N9659L3582q9281l1239
11534b7654m3755N9623Q3920L4176r6929r6482o0287N5404J04737O4312N0052
11523A27117J1315o2535k9092n7967O165J5771K599N9456N6003J7207M9563L3659
$$ plain form
11607 92761 152122 232165 286076 243790 198328 248876 311421 269230 187924 198031 174976 82166
11595 82166 -9375 -33924 78283 105555 66026 -2826 -85240 -76758 -87839 -50380 -12274 -47635
11583 -47635 -57860 -51608 -52576 -28121 -48127 -37602 -32614 5510 43529 33241 47076 56316 45276
11570 45276 69679 65421 46490 101842 166965 199566 171321 172144 228003 197854 264938 314915
11558 314915 299923 318685 352550 345357 284582 210611 176170 190263 203305 127188 172920 150265
11546 150265 126118 109596 126833 135732 112550 70067 41054 -375 59284 92866 3585 -27654
11534 -27654 -71409 -11786 72134 106310 9381 -87101 -147388 -91984 12753 77065 127117
11523 127117 138432 75897 46805 -11162 -4997 10774 13373 72829 128832 146039 195602 229261
11511B29261m4804j3408l844p1990k3396N5572l418J7874n5101l7007M8054m31
11499I7362r399k0541k5214k5766o5031j2573M7003O0093l2158o665j4005n9419
11487f6313k3632N3297R6844m1372j0199K0641N245J90j9189J9861M4415p4516
11475E272K6256L3727q9944n9723J5281J8696K1613L3667K9185p2189j6003m6282
11463a00444n9751Q622q772N8490L7152J7208L9O7740K1805q0672R061M5931O3083
11450G9492p3412k8807k385q285N849m4628j6054M6043r015K0104P149O9328j1205
11437C4174l8550n153Q8609J767o2241j1403m5780J0207l5925k6091L4277j1834
11425f7943o0447q638L2219m0734M0664R5782L3588J42760M8222l6160o5536r1701
$$ plain form
11511 229261 184457 171049 167205 95215 71819 127391 123973 141847 86746 49739 97793 97362
11499 97362 87963 67422 42208 16442 -48589 -61162 -14159 45934 13776 7111 -6894 -66313
11487 -66313 -89945 -36648 60196 18824 8625 29266 34511 34701 15512 35373 79788 5272
11475 5272 31528 65255 -24689 -84412 -69131 -50435 -28822 4845 34030 -38159 -54162 -100444
11463 -100444 -160195 -151573 -160345 -101855 -64703 -47495 -47456 20284 42089 -38583 -29522 16409 79492
11450 79492 6080 -22727 -25112 -33397 -27548 -72176 -88230 -42187 -51202 -31098 -23949 45379 34174
11437 34174 -4376 -9529 79080 80847 18606 7203 -38577 -28370 -64295 -90386 -56109 -67943
11425 -67943 -128390 -137028 -104809 -145543 -104879 -9097 24491 167251 215473 179313 113777 22076
11413B2076p2786J3942K0198M7236J932j5593k4164K9761O0296n6309M059j7506
11401A3142m4183J5786J0785O752M2767J3699N4071N2287J1659M272N0694K9234
11389B60965q2543l8272K8087J1970m9087q2241N1467j67k9467k9384n5621L68
11377a3925N1110J4763n6038L039L4745Q127J6926J5596k9500M6784M528l3654
11365F2501n0937k4212L1358k0899J4309M7047J6946L6526O8879m7763l7867n1281
11353D4607J3985K4425k9772J3107j61N1369J32690P9618l4561J0713N477N664
11341C17161Q4789K6418j0298O7269K466m3628o3383J5862K8092o8318o2947r7327
11329A96156J9202R59l328K2468o3225m1542k6564n2365o9133k7730n1730L0944
$$ plain form
11413 22076 -50710 -36768 -16570 30666 32598 17005 -7159 22602 82898 26589 30648 13142
11401 13142 -31041 -15255 -4470 2282 45049 58748 112819 165106 176765 181037 231731 260965
11389 260965 178422 140150 168237 180207 131120 48879 100346 100179 70712 41328 -14293 -13925
11377 -13925 37185 51948 -4090 -1051 33694 41821 58747 74343 44843 91627 96155 62501
11365 62501 11564 -12648 18710 -2189 12120 59167 76113 112639 181518 133755 95888 44607
11353 44607 58592 83017 53245 66352 66191 117560 250250 329868 295307 306020 311497 317161
11341 317161 401950 428368 418070 485339 487805 444177 380794 396656 424748 356430 293483 196156
11329 196156 215358 216317 212989 235457 172232 130690 104126 51761 -17372 -45102 -96832 -65888
11317f5888Q4131M436j4231J3737k2330j3244N1918J9777m7803M7157l8252k2024
11305b616M5343p398n2001k8228N1237N4392R6276Q0513O6877P0259p3145q8938
11293B12571o0561K3985P5018k5402L7616Q680n9482j0197o0594n4878m8966p2084
11281c4294K9926l0224j3980M4840P3808J747n4651k2227L5194Q8984J9437o6171
11269G2389k3888K9221o6226k4243M1552Q2671M748n0434K5467j8316P8806N0710
11257B02457q222j1366P251P7401R0516J8044j0078n8129J0144R2045N8511O4252
11245E32826m5291k9286N1126J3739k6346J4635J4961L9987K0328k5147j6335
11234E45197L3857O1626J351M8009m964l606R6750M4107k871R0249L98J20955
$$ plain form
11317 -65888 18243 22679 8448 22185 -145 -13389 38529 58306 10503 57660 19408 -2616
11305 -2616 42727 35329 -16672 -44900 6337 60729 157005 237518 304395 374654 301509 212571
11293 212571 152010 175995 251013 225611 263227 271907 212425 202228 141634 86756 37790 -34294
11281 -34294 -4368 -34592 -48572 -3732 70076 71823 17172 -5055 30139 119123 138560 72389
11269 72389 48501 77722 11496 -12747 28805 111476 116224 65790 91257 72941 151747 202457
11257 202457 194235 182869 190120 267521 358037 376081 366003 307874 318018 410063 468574 532826
11245 532826 487535 458249 509375 523114 496768 511403 526364 566351 586679 561532 545197
11234 545197 579054 640680 642031 690040 685076 681470 778220 822327 819456 909705 910103 1031058
11222A031058P6808J04453J43862J90324K72290K30225L39403M24205N28945O52961
11212C994534P68324J058933J378009J705433J923421K365423K684513K969342
11204A8847932L193929L293349L286576K957259K545542K109055J586356P89102
11196C8609100j95027j030714j637702k246024k637303k905448l101722l038298
11188B1816862k854690k664455k241262j824309j622079j169747q46755o80812
11180G912753m85659l57539k65489j53208j04777j8213N5083R0384J95356L06844
11170G175535L31121M93641O81060Q46107J156032J517650J991868K580956L232123
11161B0006093L822803M389912M872599N343773N804570N944132N741723N203487
$$ plain form
11222 1031058 1107866 1212319 1356181 1546505 1818795 2049020 2388423 2812628 3341573 3994534
11212 3994534 4762858 5821791 7199800 8905233 10828654 13194077 15878590 18847932
11204 18847932 22041861 25335210 28621786 31579045 34124587 36233642 37819998 38609100
11196 38609100 38414073 37383359 35745657 33499633 30862330 27956882 24855160 21816862
11188 21816862 18962172 16297717 14056455 12232146 10610067 9440320 8593565 7912753
11180 7912753 7427094 7069555 6804066 6650858 6546081 6527868 6582951 6673335 6868691 7175535
11170 7175535 7506656 8000297 8681357 9527464 10683496 12201146 14193014 16773970 20006093
11161 20006093 23828896 28218808 33091407 38435180 44239750 50183882 55925605 61129092
11153F1129092M508881L805050K668611J359308r882j383699k502505l617211
11145F5957645m576311n167010n504131n562601n524959n279133m764804m243849
11137B5334847l672158l091042k635261k066827j574834j271469r65378o80873
11129I377005n27652l22158k21672j67489l3842m821N5218J7728L5912J30928
11119H339157J77230M02683O51262Q50113J236229J632538K132376K593856K933290
11110B0948734L172961L513105L744926L648202L184411K656030K110703J475596
11102D4454668M85202n74034j509644k218813k814614l408548l740387l820465
11094B6853365l595940l335638l008844k690501k367215j928364j501337j138509
$$ plain form
11153 61129092 65637973 69443023 72111634 73470942 73461060 72077361 69574856 65957645
11145 65957645 61381334 56214324 50710193 45147592 39622633 34343500 29578696 25334847
11137 25334847 21662689 18571647 15936386 13869559 12294725 11023256 10057878 9377005
11129 9377005 8849353 8527195 8305523 8138034 8104192 8099371 8154589 8172317 8208229 8339157
11119 8339157 8516387 8919070 9570332 10420445 11656674 13289212 15421588 18015444 20948734
11110 20948734 24121695 27634800 31379726 35027928 38212339 40868369 42979072 44454668
11102 44454668 44939870 44365836 42856192 40637379 37822765 34414217 30673830 26853365
11094 26853365 23257425 19921787 16912943 14222442 11855227 9926863 8425526 7287017
11086G287017r23689q48324o82374n03176l99166l32550l38074l13176k27544
11077B718944j95902k20822k01362j89457j37609n9530j31727j47128n1857J7543
11067A401093N4726j346j10177o3205l3672k6892m4239o9679p6291j3397m4553
11056I72368n1945m5776J0541O1334J3493J91j21591K5583m843l3987m964K7566
11044H47970j29O9387J01010m9415l5365o180L1572J6150j8638r186n0103p0013
11032H27060r1388K3644J4643K3001m1727K2363p0768o0383j3219J9780r378L9018
11020F82646R2968l9060m9133k0115m727O2205O8375J6100O2497P6306P3904M668
11008A026634j1904P4929M6265J7844m915L7403J05666J18246J57883K64379J19706
$$ plain form
11086 7287017 6363328 5515004 4832630 4329454 3930288 3597738 3259664 2946488 2718944
11077 2718944 2523042 2302220 2100858 1911401 1773792 1714262 1582535 1435407 1383550 1401093
11067 1401093 1455819 1454473 1344296 1281091 1247419 1220527 1176288 1106609 1030318 1016921 972368
11056 972368 920423 874647 885188 946522 960015 960206 838615 864198 859355 825368 820404 847970
11044 847970 847841 917228 1018238 968823 933458 927278 958850 975000 956362 947176 897073 827060
11032 827060 735672 759316 773959 796960 755233 777596 706828 646445 633226 653006 643628 682646
11020 682646 775614 736554 687421 667306 662579 724784 793159 809259 871756 948062 1021966 1026634
11008 1026634 1014730 1089659 1135924 1153768 1148853 1186256 1291922 1410168 1568051 1832430 1952136
10997A952136J86825J90520J77848L38571M24945M98974N82924Q16922J029348
10988F199013J317495J823326K286879K717705L128602L487790L880729M143912
10980B8985451L960309L443111K652970J755924P26329l14835j302907k327053
10972C7579299l094832l591883l786594l751987l533535l206257k657483k162090
10964A1794638j687801j261610q97563n85645k95247j76656j29797j57454r3834
10955F509031m2094m4939p464J7678J35183K14746K75157K52000L74748N41480
10945H225526P74064J047302J391624J922038K621918L529604M542790N398941
10937B9453807O034281O491023O746963O921264O907594O376974N331083L766409
$$ plain form
10997 1952136 2138961 2329481 2507329 2845900 3270845 3769819 4352743 5169665 6199013
10988 6199013 7516508 9339834 11626713 14344418 17473020 20960810 24841539 28985451
10980 28985451 32945760 36388871 39041841 40797765 41524094 41209259 39906352 37579299
10972 37579299 34484467 30892584 27105990 23354003 19820468 16614211 13956728 11794638
10964 11794638 10106837 8845227 7947664 7362019 7066772 6890116 6760319 6602865 6509031
10955 6509031 6466937 6421998 6414534 6432212 6567395 6782141 7057298 7309298 7684046 8225526
10945 8225526 8999590 10046892 11438516 13360554 15982472 19512076 24054866 29453807
10937 29453807 35488088 41979111 48726074 55647338 62554932 68931906 74262989 78029398
10929G8029398J940425O2135j702895l028345m236656n336949o145906o758891
10921E2822316p019343o698984n982210n073038m334752l684914l066724k527312
10913A4435039j997074j481150j061518p42028n66125l29168k19059p9624Q496
10904G967789P2420Q59m9906j0596J2810L9538l7991R6227K61600L60414O40125
10893I353289J156605J639259K227389K836267L463803L992744M347225M717810
10885C3734391M743281M280999L488412K425090J238983n526j213859k450931
10877D6240840l501698m295595m768457m707075m583548m136566l498121k905849
10869A3843931k439236j960759j451070j153269q44487p23895n44630m77354m03950
$$ plain form
10929 78029398 79969823 80031958 78329063 75300718 71064062 65727113 59581207 52822316
10921 52822316 45802973 39103989 33121779 28048741 23713989 20029075 16962351 14435039
10913 14435039 12437965 10956815 9895297 9153269 8587144 8257976 8038917 7959293 7967789
10904 7967789 8040209 8041068 7991162 7980566 7993376 8032914 7994923 8091150 8352750 8713164 9353289
10893 9353289 10509894 12149153 14376542 17212809 20676612 24669356 29016581 33734391
10885 33734391 38477672 42758671 46247083 48672173 49911156 49905630 48691771 46240840
10877 46240840 42739142 38443547 33675090 28968015 24384467 20247901 16749780 13843931
10869 13843931 11404695 9443936 7992866 6839597 5995110 5271215 4726585 4249231 3845281
10860C845281l69101l47301k26300k16542k36819k27265j07189j24730p6047p7888
10850A836099o9537j36885j21544j17201m3644l1823k8987l3675K3310n6482j15990
10839A103641j02019n3468r3751o6758k5176r3096j1332l537m8737k4413q2169
10828D99185q062L8997N0419M915j4277K2246o7396k4362M6626L0555l9395r927
10816E29524q162l7345m972M0556J3982j1799m5489l3630K6364M5098J890r065
10804E06952J6288p7770m8775J8281J5896k4569k5564p9331L7344J42758O5811
10793E47321J7673k663m3429k7146L456K8579k2229m1176N0689R7916L974l6812
10781E76153n1008m7401N8767k1522M6165K5169n0375l3497J0657P13r3126o4059
$$ plain form
10860 3845281 3476180 3128879 2902579 2686037 2449218 2221953 2114764 1990034 1913987 1836099
10850 1836099 1766562 1629677 1508133 1390932 1347288 1315465 1286478 1252803 1276113 1219631 1103641
10839 1103641 1001622 948154 854403 787645 762469 669373 658041 654504 605767 581354 499185
10828 499185 491123 530120 580539 585454 571177 593423 526027 501665 548291 578846 539451 529524
10816 529524 521362 484017 479045 519601 533583 521784 476295 442665 469029 514127 516017 506952
10804 506952 523240 445470 396695 414976 430872 406303 380739 301408 338752 481510 547321
10793 547321 564994 562331 518902 491756 495212 523791 501562 460386 511075 608991 612965 576153
10781 576153 525145 477744 536511 514989 561154 586323 535948 502451 513108 513821 420695 356636
10769C56636m6838k6408K0381K753L088j4519j412m7779k4006K5857J6888K7552
10757B92193q224l017J1338k5657M4204M9485M0764J490K3203j2733R741L8637
10745D61424J9128O7260j76J0709N4873m574R487M137O836k4493m3885P928l5127
10732E33527N861j8932r468j3875o3741j12584m1482r321q6686O376L3871N3453
10720B76999j2827p5886M7924P2878k1059l0836J2350j3191k8367J0561R885o5592
10708A82839m548J4222l0142K1119P7835O3975k4778l9131k952l4220k5056J1228
10696B10391J8570L1935N3222J7099k894j2660R157j3633J23358J2445n1609m9827
10684C45554l1923j4929J3293M269j8493k463m8439l0554m3450J8944K618n757
$$ plain form
10769 356636 309798 283390 303771 306524 309612 295093 293681 245902 221896 247753 264641 292193
10757 292193 283969 280952 292290 266633 310837 360322 401086 402576 425779 413046 422787 461424
10745 461424 480552 547812 547636 558345 613218 608644 618131 622268 629104 604611 560726 568654 533527
10732 533527 539388 520456 510988 497113 433372 320788 279306 269985 183299 189675 223546 276999
10720 276999 264172 188286 236210 309088 288029 257193 269543 256352 227985 238546 248431 182839
10708 182839 178291 192513 162371 183490 261325 325300 300522 261391 258439 224219 199163 210391
10696 210391 228961 260896 314118 331217 328323 315663 324820 311187 434545 446990 395381 345554
10684 345554 313631 298702 311995 316264 297771 295308 246869 216315 172865 191809 194427 188670
10672A88670l4450m7274m0603k2703M2251l084J675k0558L7781k8714L9548O7918
10660A80457K0202l681N362J3681q4996j7917n2450J3844M2840N8131J0143n1059
10648A34557p9110J7750N8172M4256m8421m9845K444m1836m6225l701L2877k5296
10636d378k710P2009N2407M0356k8855m760k1748l129j6511l433J5547k9809N3226
10623A18212m541l4917L5981J6784k2297l4511j8748n9717l0192O9554O9777L4573
10611A39958l536j06346l0137l5734k4806M7918l6536K2291P1129K0350j6732
10600D7819n527k0102J8726m0774J6670q483K8009k0348k6597L9231M1460J4978
10588H5062k7011R8429M3384K2097m0210j09326j0462K4565J6645j4972K2212
$$ plain form
10672 188670 154220 106946 66343 43640 85891 82807 84482 63924 101705 72991 112539 180457
10660 180457 200659 196978 202340 216021 131025 113108 60658 74502 117342 175473 185616 134557
10648 134557 55447 73197 131369 175625 127204 77359 79803 37967 -8258 -11959 20918 -4378
10636 -4378 -7088 64921 117328 157684 128829 124069 102321 99192 82681 79248 94795 64986 118212
10623 118212 113671 78754 114735 131519 109222 74711 55963 -3754 -33946 35608 105385 139958
10611 139958 136422 30076 -61 -35795 -60601 -12683 -49219 -26928 44201 64551 47819
10600 47819 42292 22190 40916 142 16812 8329 36338 15990 -10607 28624 70084 85062
10588 85062 58051 156480 199864 221961 181751 72425 61963 86528 103173 88201 110413
10577A10413M0968N4250J51577J21180R4536J58336J77500K25780K61323J81726
10567A577589J48798Q9912N4269J7572q3539j06009j58976k91013k96028j59028
10557G93547j16435j21065m2835k3341o5718q4893o9239J6270K780o4312m9649
10546A75110m5931k4728o51K9265k3358n3347L4441L4440K6469K0910N1198n5133
10534A68685l7222L4697k002j722K9385l7652l1636P854J5655o2033j8277M206
10522F9938K765O6975j1717M1078J19488M8151j849J947L3069K7798O1911J8392
10510D77946l0310j2180r967p3334p0381j7034o9803k8809o3315q0520p851l0218
10498a5776l7832O2027K0318R4790N3408l5994o8968j2286P65k4305m3932k6036
$$ plain form
10577 110413 151381 205631 357208 478388 572924 731260 908760 1134540 1395863 1577589
10567 1577589 1726387 1816299 1870568 1888140 1804601 1698592 1539616 1248603 952575 793547
10557 793547 677112 556047 513212 489871 424153 339260 270021 286291 289071 224759 175110
10546 175110 129179 104451 103800 133065 109707 56360 90801 125241 151710 172620 223818 168685
10534 168685 131463 166160 164158 162436 191821 154169 122533 130387 146042 84009 65732 69938
10522 69938 72703 139678 127961 169039 288527 336678 334829 336776 369845 397643 459554 477946
10510 477946 447636 435456 425489 352155 281774 264740 194937 166128 102813 22293 14442 -15776
10498 -15776 -53608 8419 28737 123527 176935 140941 71973 59687 60452 36147 -7785 -33821
10486c3821K4817Q0378L1295K277k6725N830k4585q918K3937M6517o3673k7282
10474C0047M5076l7898J082Q4966J40929K3099O2533M8048q1755o0649m8314m4674
10462A62490K720Q4518j7334j5120N5969j324n0508p0276j9575l040N5174k1438
10450A62256j6985K7135L6987j06578j30608J1862J10870k4544m8234R1094r451
10439A03804J8254K6629k3040J2943j3084j2254o4619M592O6841J8087m5005j3957
10427G9191J0219R169n8912k170j5547q2474O7366N4937j1429J5535j803l746
10415F0336o0991o4027L1482j7627K5715N1276J3677k2790o975J21972M3501J7600
10403A93149J4030j744j5105j09719j15442j8714O2143K1478r11J6810N733N2757
$$ plain form
10486 -33821 -9004 71374 102669 104946 78221 84051 59466 50548 74485 121002 57329 30047
10474 30047 75123 37225 38307 123273 264202 287301 349834 397882 316127 255478 207164 162490
10462 162490 165210 249728 232394 217274 273243 271919 221411 151135 131560 128520 183694 162256
10450 162256 145271 172406 209393 102815 -27793 -15931 94939 70395 22161 113255 103804
10439 103804 122058 148687 125647 138590 125506 113252 48633 53225 120066 138153 93148 79191
10427 79191 89410 98579 39667 37497 21950 -60524 6842 61779 50350 65885 64082 60336
10415 60336 -655 -64682 -33200 -50827 -25112 26164 39841 17051 10076 132048 175549 193149
10403 193149 207179 205435 190330 80611 -34831 -53545 8598 30076 29165 45975 51708 104465
10391A04465j2420N454p080O277q223M661m726m0415L0028O466j1321m5351l9882
10378a2067J5143K5574o2339p419o210j4603M9710K6167L5691N7982N5678j4525
10366A48782m7951K1382n24K737O2919M4857n0287K8315J95319K21339K65436
10355H92324M34971M47463L99960M21281M47409L66738K06438R5773p339m4527
10345C660491k78076m89760o31866m46924l72328m07221l12327j85320j28443
10336D08226q5536o4474r6149r7420j20286m0790J2545P169l4426N4680O2306
10325E845K7280j5850L0963M189l9939o6321K1672J11327M2147K207J7174n6705
10313H3989Q7705M9406K529K698m5853K8570Q7626J13091Q8888J9825N4437N4851
$$ plain form
10391 104465 92045 97499 90419 96696 88473 93134 88408 47993 78021 84487 73166 27815 -12067
10378 -12067 3076 28650 -33689 -41108 -47318 -61921 -12211 13956 49647 107629 163307 148782
10366 148782 100831 122213 121689 124426 187345 232202 181915 210230 405549 626888 892324
10355 892324 1327295 1774758 2174718 2595999 3043408 3410146 3616584 3712357 3705018 3660491
10345 3660491 3382415 2892655 2260789 1813865 1441537 1034316 721989 536669 408226
10336 408226 322690 258216 162067 64647 -55639 -96429 -83884 -76715 -111141 -56461 5845
10325 5845 33125 17275 48238 52427 12488 -53833 -32161 79166 121313 123520 140694 83989
10313 83989 171694 221100 223629 226327 180474 209044 296670 409761 498649 518474 572911 627762
10301F27762J3230P862K196K5118l0150o6941j27590n8992j7514n6076r8191j6100
10289B04614M648l034o7796k4009j756J593j6269M2190j2035k1576J1119k7958
10277H9731m4742O7230K6893K3975m7556n8853M7903L0350j6419k1171P8051M8323
10265B23715j8449M4842J7401k0501L0720p4461L6252L1510j2776P6201J47486
10254D81940R2353L468R88o9191J944N385k0495j4431J7589l0901r6336q454O1882
10241D25741O219l8861L5094O7040O1700N4411k1138N5427O6969J25802L5393
10230H73797J91865K25464J62824J30641K44244J95823K06447J04903J00639O7758
10220B504405j1255r3788j79828j32051j51286j56094p9019o1554L5771M2246
$$ plain form
10301 627762 640992 648854 651050 676168 646018 579077 451487 392495 374981 318905 220714 204614
10289 204614 209262 206228 138432 114423 112667 114260 97991 140181 128146 106570 117689 89731
10277 89731 44989 112219 139112 163087 115531 56678 104581 134931 118512 97341 175392 223715
10265 223715 205266 250108 267509 247008 277728 203267 239519 271029 258253 334454 481940
10254 481940 574293 577761 578749 509558 511502 516887 496392 481961 499550 468649 372313 363859 425741
10241 425741 431960 393099 428193 495233 556933 611344 590206 645633 712602 838404 873797
10230 873797 1065662 1291126 1453950 1584591 1828835 2024658 2231105 2336008 2436647 2504405
10220 2504405 2493150 2399362 2219534 2087483 1936197 1780103 1701084 1639530 1675301 1717547
10210A717547Q7601J26156J47879J11976K0338L8834J47890R8065J37021J02464
10200B735771R5460P1018J11648K94027M56861M57554N62786P12571Q23654R50993
10190G272343J047903J218361J335684J453291J681794J892841K221618K867760
10182B0991595L748242N325321P818222J1611263J6750386K2582490K8339464
10175A17166983L3496975L7745596L9572995L6943518K9769144K0009714Q845066
10168C23549991k521232j4149417k4915050l3648896l8072911l8022715l4812725
10161A37407045l0184144k4784872j8887990j3615499r424239o457770m593864
10154B9458667l399482k691822k275179j908902j716506j576283j527598j354546
$$ plain form
10210 1717547 1805148 1931304 2079183 2191159 2211497 2250331 2398221 2496286 2633307 2735771
10200 2735771 2831231 2902249 3013897 3307924 3764785 4222339 4785125 5497696 6321350 7272343
10190 7272343 8320246 9538607 10874291 12327582 14009376 15902217 18123835 20991595
10182 20991595 24739837 30065158 37883380 49494643 66245029 88827519 117166983
10175 117166983 150663958 188409554 227982549 264926067 294695211 314704925 323549991
10168 323549991 321028759 306879342 281964292 248315396 210242485 172219770 137407045
10161 137407045 107222901 82438029 63550039 49934540 40510301 34052531 29458667
10154 29458667 26059185 23367363 21092184 19183282 17466776 15890493 14362895 13008349
10146A3008349j295229j202316j039814r00140q62159p04072n43183m63535l90811
10137E607090l77569l61239k41452j72907k58731k29025k07859k37536j98246
10128C322526k21594j57578k08368j62570j17887j42603j29080o5248j04701o1028
10118A951869m7242n6927n5643q4198r8806r6071q2520m1834K1419m314o1217
10107A344516j21687m3416r6227n0711N6091M9586l6349m1004q3539q2950J8009
10096I12319Q2962M2137l1294p8042o2708k6575k2948q223K269R4382l5790p6140
10084G92349o6930R722j0412o694L8051O1272l5083o3300M4235P0292O1764l1141
10072H64125n5889j7468L9347n4179p1441K0340J1644m405k1541J8069l3987m1868
$$ plain form
10146 13008349 11713120 10510804 9470990 8570850 7708691 7004619 6461436 5997901 5607090
10137 5607090 5229521 4868282 4626830 4453923 4195192 3966167 3758308 3520772 3322526
10128 3322526 3100932 2943354 2734986 2572416 2454529 2311926 2182846 2117598 2012897 1951869
10118 1951869 1904627 1847700 1792057 1707859 1609053 1512982 1430462 1388628 1410047 1405733 1344516
10107 1344516 1222829 1179413 1083186 1032475 1088566 1138152 1101803 1060799 977260 894310 912319
10096 912319 995281 1037418 1006124 928082 865374 838799 815851 807628 809897 904279 868489 792349
10084 792349 725419 735141 724729 718035 756086 817358 782275 718975 763210 833502 895266 864125
10072 864125 808236 790768 830115 775936 704495 724835 736479 732074 710533 728602 694615 652747
10060F52747o2041J2564L8863K3355n620m8926j28143m3094K8208k625Q794J8147
10048D92229k5300M4335k157O2539K4954M2424o1582l9127K4937j7957p012p491
10036E30792o6506l5840K9024m6161k1583P0714R8239l2219J0049q5250k0345
10025D30914O5937P0505J04257K5568l5751j9271N0887l5230j9871m2596n5259
10014E40090L9905O0167M3428O4903R1639M4289K6574l1783Q6354J00314J2977
10003A078857j9110m1840m8981J0882Q868q3813j01198j39675j37979l7148m3633
9992D45230q1321L6582m7181o87o41j4534L3892P3285J0896K1440m2804R765O8880
9979E12802K8995m2086n6311O0334J3221P7123K6286m1953m5079k000j3159M3795
$$ plain form
10060 652747 590706 603270 642133 665488 659868 610942 482799 439705 467913 465288 474082 492229
10048 492229 466929 511264 509107 571646 596600 639024 577442 538315 563252 545295 538283 530792
10036 530792 464286 428446 457470 411309 389726 460440 558679 526460 536509 451259 430914
10025 430914 496851 567356 671613 697181 661430 642159 693046 657816 637945 595349 540090
10014 540090 579995 640162 683590 748493 840132 884421 910995 879212 965566 1065880 1078857
10003 1078857 1059747 1017907 968926 979808 988676 904863 803665 663990 526011 488863 445230
9992 445230 363909 400491 353310 352623 351982 337448 371340 444625 455521 476961 434157 443922 512802
9979 512802 541797 499711 443400 503734 516955 594078 620364 578411 533332 531332 518173 561968
9967E61968M0071Q133k9476J8027m724J00140N471k2019N3317J22760J79132J28242
9955A161042J53022K21152K18827L68873L81866L73608M99375P32607J067177
9946E177549J499151K164779K826952L042036K391916J273521N27782l88589j815399
9937A6699698k887120l110337k476576j732146j181135p66067m51056l05948k36603
9928C552710j85895j15023j72107o0419N702J82166K56201L61877N54840L82805
9918D762857j19165m68454n21203l63201j62279k9533J04837J18078L10360M23069
9908D055366M27228N12759O84091R86898J336360J769851K494165L546040M894430
9899B0707188O063421N473796K985269J464413K762253N797987P959077O760090
$$ plain form
9967 561968 602039 610172 580696 598723 593999 694139 699610 677591 730908 853668 1032800 1161042
9955 1161042 1314064 1535216 1754043 2122916 2504782 2878390 3377765 4110372 5177549
9946 5177549 6676700 8841479 11668431 14710467 17102383 18375904 18903686 18515097 16699698
9937 16699698 13812578 10702241 8225665 6493519 5312384 4546317 4095261 3789313 3552710
9928 3552710 3366815 3251792 3079685 3019266 3024968 3207134 3463335 3825212 4380052 4762857
9918 4762857 4643692 4175238 3654035 3290834 3128555 3099022 3203859 3321937 3632297 4055366
9908 4055366 4482594 4995353 5679444 6666342 8002702 9772553 12266718 15812758 20707188
9899 20707188 26770609 32244405 35229674 36694087 39456340 45254327 53213404 59973494
9891E9973494K027850m381027r536736j0924697r192760o551306m380585k978739
9883A4055494k002890j334293r42715p30638o15841l99256k35469L9828N88488
9874H422708R21807O74137k01691o07983m06748m61873o52259p11038o24115k61360
9864F091585M181J41008K62056L99759N77733R12911J432031J967013K825045
9855A4613322L902274M789897M257181K904735K812810L869336N668405Q781484
9847E1599444J2292994J2692918O621473k488140p773263q340998q358258r738398
9839D6507772r955656q366693o089582m085118k713052j933851j537349j235056
9831A0591415j034507p70098o58727n30345l59522r2237L15093P39074R23443
$$ plain form
9891 59973494 62001344 57620317 48083581 37158884 27966124 21414818 17034233 14055494
9883 14055494 12052604 10718311 9775596 9044958 8429117 8029861 7794392 7834220 8422708
9874 8422708 9344515 10018652 9816961 9208978 8802230 8340357 7688098 6977060 6352945 6091585
9864 6091585 6095766 6236774 6498830 6898589 7476322 8389233 9821264 11788277 14613322
9855 14613322 18515596 23305493 27562674 30467409 33280219 37149555 42817960 51599444
9847 51599444 63892438 76585356 83206829 80718689 72945426 64604428 56246170 46507772
9839 46507772 36552116 28185423 22095841 18010723 15297671 13363820 11826471 10591415
9831 10591415 9556908 8786810 8128083 7597738 7238216 7145979 7461072 8200146 9123589
9822I123589P65640R3980o62854p71254p30719p24663o61542m45750j79801N1451
9812E858077K84864M41104N49611O51258R04737J220136J859598K683615L954844
9803A8407844N631783P063975O766589N103896L844254L240294K145833p37985
9795E1466483n151404q384270q791032p137172n071013l406388k403066j664030
9787I458108j137103q52651o94017n85893o28932n78052m04186k29600n8351R3013
9777D382336L91610M91700K83860j71243m91664m38711k43254j59327q4206O3046
9767D024147O1969m6509j5631k4692m0204j12018n1614J13200K09570L52996M01703
9756D872917Q07127J377130J833099K047284J709268Q33827K59984r62p84596
$$ plain form
9822 9123589 9889229 9983209 9320355 8549101 7818382 7093719 6432177 5986427 5806626 5858077
9812 5858077 6142941 6584045 7133656 7784914 8689651 9909787 11769385 14453000 18407844
9803 18407844 24039627 31103602 37870191 42974087 46818341 50058635 52204468 51466483
9795 51466483 46315079 37930809 29139777 22002605 16931592 13525204 11122138 9458108
9787 9458108 8321005 7468354 6774337 6188444 5559512 4981460 4577274 4347674 4289323 4382336
9777 4382336 4773946 5265646 5549506 5378263 4886599 4447888 4204634 4045307 3961101 4024147
9767 4024147 4086116 4039607 4023976 3999284 3959080 3847062 3795448 3908648 4118218 4471214 4872917
9756 4872917 5680044 7057174 8890273 10937557 12646825 13480652 13740636 13739674 12955078
9747A2955078j825052k285180k011694j516573j003464o41254m03503k65872j55204
9738B847282o1842q0989j92902j54309j51808k03103j49105j72702j42676j33663
9728A404183j53883j40209q8661k9298l4990j03274n3312k9928o0143m0606o7651
9717F02228J115J1349n5878o9807p766L6329K5841L5104j04166m8768k815J5693
9705D38459J6885L0380n5232J2241P025M944P4781J6457k4241q9r1216o0229J8755
9692C88920L5416M004p565q2672p7145j762N4607J01338j1240n3443l8960L9812
9680C51310O2853K1509p5218K148K0931J4781Q825pl7928p2087k882O7629K1044
9667C82908k3502j6766j2554j7466O8401J5175p155m8914j9150k7937K0341o8053
$$ plain form
9747 12955078 11130026 8844846 6833152 5316579 4313115 3671861 3268358 3002486 2847282
9738 2847282 2785440 2704451 2511549 2357240 2205432 2002329 1853224 1680522 1537846 1404183
9728 1404183 1250300 1110091 1021430 992132 957142 853868 800556 770628 710485 669879 602228
9717 602228 603343 614692 558814 489007 481241 517570 543411 578515 474349 425581 422766 438459
9705 438459 455344 485724 430492 442733 449758 454702 529483 545940 521699 521610 430394 370165 388920
9692 388920 424336 428340 420775 338103 260958 259196 313803 415141 403901 350458 311498 351310
9680 351310 414163 435672 360454 362602 383533 398314 407139 407132 369204 297117 294235 361864 382908
9667 382908 359406 342640 330086 312620 381021 396196 389041 340127 320977 293040 313381 245328
9655B45328k6467J7601M0957M124k5095m1335K5623k255O0657N1866N7953L9191
9643D48148Q878J6883n1735q9169l6636J7904K6746m2885k5794j4451j5669p029
9631B35191N6217J1436P878J1618l5172M5161K9065j25859n3209q471M0207m5179
9619A68883m6703K573P5219k9817M6504N9462o1568n1839k2755L1020p8015l9900
9607E3064L7239M1642J2475M2307L1289L6039k1540p0371k9911j8664M4388j277
9595A56680j2524J319m341Q2364L4082m4946p7039m1930j4596L1877P0421k8734
9583A52633n0401m140P595J7765l2522L4261M2931L8549p3972O166O6697L4737
9571B40299m669m9186J6906J7815j492l2594N0975K6996M142l2185n2149l1053
$$ plain form
9655 245328 218861 236462 277419 281543 256448 215113 240736 238481 299138 351004 408957 448148
9643 448148 457026 473909 422174 333005 296369 314273 341019 298134 272340 257889 242220 235191
9631 235191 291408 302844 310722 322340 287168 332329 361394 235535 182326 173855 214062 168883
9619 168883 122180 124753 199972 170155 216659 276121 214553 162714 139959 170979 92964 53064
9607 53064 90303 131945 144420 186727 218016 254055 232515 162144 132233 113569 157957 156680
9595 156680 144156 145475 141134 223498 257580 212634 135595 93665 79069 110946 181367 152633
9583 152633 102232 98092 105687 123452 90930 125191 168122 206671 132699 138865 205562 240299
9571 240299 235630 186444 203350 221165 219673 187079 238054 265050 269192 237007 184858 153805
9559A53805n0814K4232j896N347K2918m206k8476j8470K7724P3446J0496j5976
9547A98130M602l1177m8284N2831q265q4868k5206O8524l1587q285L9579L6492
9535A62486L001J018M1097K1058M109O1064M1270N803q0858q5623J8637M2203
9523B35265p1526j6066k2084k2385k7921m0009k1859j4433K0759j5623N8651K5677
9511H8446l0195L9196J0282l956p3600K9785Q5186N402k962J03090j1043p494
9499B32137j4162l2704o6404p6727O5343P5078m7457n3662J2923K9906L5967O3937
9487B24175J6308j03282l1280R5490K6357j5275M6454N4367m744N4024P1465j5052
9475D19007q5956j9929p0276l7270n7811r0696J3201O5148l9424J4111L119P5000
$$ plain form
9559 153805 102991 127223 125327 130674 153592 149386 120910 102440 130164 203610 214106 198130
9547 198130 202732 171555 123271 176102 167837 82969 57763 126287 94700 86415 125994 162486
9535 162486 165487 166505 207602 228660 232769 293833 335103 340906 260048 174425 193062 235265
9523 235265 163739 147673 125589 103204 75283 35274 13415 -1018 19741 4118 62769 88446
9511 88446 58251 97447 107729 103773 30173 59958 145144 150546 147584 250674 239631 232137
9499 232137 217975 185271 118867 42140 107483 182561 135104 81442 94365 124271 160238 224175
9487 224175 240483 137201 105921 201411 227768 212493 258947 313314 308570 362594 434059 419007
9475 419007 333051 313122 242846 205576 147765 57069 70270 135418 95994 110105 113224 188224
9463A88224P217j21717M842J4869K3930O5769M1270K4320k8485k8570o06M5899
9451B36962j17063r2269j3623K6648M7480J7595r9834o4253p528O9216N5940R2348
9439A51619M7159O4611l3085K6812N2822P1508O6742M6215L9587L0430k809J6725
9427E78336j21143k7461Q765o5409p2045N0443l5058q1602n4016K0041L546j0412
9415A93985j7758k0715N6282L2886n8547J4654o6943k9919M6787J5440K6969J2726
9403B05847n3948k6413L4961l601n6968Q745M1798j309j1702J6020j247J712J5599
9390A69494n9617l1472K8997L3135K5417N7009M6122O2640K3829M139K1636m1202
9378C40127k5995o3027n921o1391m6395m9615m366J2307J6462K1072J4884N2628
$$ plain form
9463 188224 195441 73724 78566 93435 117365 183134 224404 248724 220239 191669 191063 236962
9451 236962 119899 27630 14007 40655 88135 105730 5896 -58357 -65885 3331 59271 151619
9439 151619 198778 263389 230304 257116 309938 381446 448188 494403 533990 564420 561611 578336
9427 578336 457193 429732 438497 373088 301043 351486 316428 234826 180810 200851 204397 193985
9415 193985 176227 155512 211794 244680 186133 200787 133844 103925 150712 166152 193121 205847
9403 205847 151899 125486 160447 156846 99878 108623 150421 149112 137410 153430 152183 153895 169494
9390 169494 109877 78405 107402 140537 165954 222963 269085 331725 355554 359693 381329 340127
9378 340127 314132 251105 245184 183793 137398 87783 83417 95724 112186 133258 148142 200770
9366B00770J3775j18964m3787L8940K3657p1999n3187r948J5622L4623J11225
9355A40727J6425J0638m9797q8638N1765N4873M5591n8922J2438k6831j9478j4915
9343G3876j597l8650L4648j0209L9975O80J04221N2868M9695N4213j7884o2769
9331B79067m6843K4237p616o1437n1729o0343m1884q7180l1367R7502M1044L7058
9319I0509K7803L1366K5499l8749n7014q8439M6961N4497L2441k4125L8872M7538
9307A87159K7096k0625o1967J2943J6241k7675o4085l6398m1816j7250N6083K4953
9295E4659K7974Q233J6528q641k6752l8140k894J6436J6564m3522l1059J8525
9283G911N2489L7390n536n9787O203L1729M1307J2196j5507K3220L6127J5398
$$ plain form
9366 200770 214545 95581 51794 90734 114391 42392 -10795 -20743 -5121 29502 140727
9355 140727 157152 167790 117993 29355 81120 135993 181584 122662 135100 108269 88791 73876
9343 73876 72279 33629 68277 58068 98043 98723 202944 255812 305507 359720 341836 279067
9331 279067 232224 256461 248845 187408 135679 75336 33452 -53728 -85095 12407 53451 90509
9319 90509 118312 149678 175177 136428 79414 -9025 37936 92433 124874 100749 139621 187159
9307 187159 214255 193630 131663 144606 160847 133172 69087 32689 -9127 -26377 29706 54659
9295 54659 82633 90866 107394 98753 72001 33861 30967 47403 63967 20445 -10614 7911
9283 7911 60400 97790 92254 32467 38670 70399 111706 123902 108395 131615 167742 183140
9271A83140m3783J9315J2526o9200j9405j0731K9987O9426K7997m7703n3384L6392
9259A34577k4255M2945j4153j26187k9334N2087M4689N3469P5038Q369l4053m1891
9247A41301j02939r207l5791j3988R5546N4823n7252p7797J8666N0168l5455J4527
9235D2602r571n5462M4558j955k1489k9001L8796R0254J2231n9526l5762R516
9223B5191p030M5064j8574L5561k58l6223P708L665J8998k0531l186J8950J7808
9210H7143J1401m9525L3674K7994J2940M2368k3264m3859k7176L7947M9539J3463
9198A72645n4618k0279Q270j8842R362j7745K6128Q0139l9935k4171Q2663K0608
9186B24225n1358r300K2390l6220j8690K9009O250K2996K8587K9307k2512l9556
$$ plain form
9271 183140 139357 158672 171198 101998 82593 71862 101849 171275 199272 151569 98185 134577
9259 134577 110322 153267 139114 12927 -16407 35680 80369 133838 208876 217245 183192 141301
9247 141301 38362 29155 -6636 -20624 74922 129745 72493 -5304 13362 63530 28075 42602
9235 42602 33031 -22431 22127 20172 -1317 -30318 8478 98732 110963 51437 15675 25191
9223 25191 18161 63225 44651 80212 79954 43731 51439 55104 74102 53571 50385 69335 87143
9210 87143 98544 49019 82693 110687 123627 165995 142731 98872 71696 109643 159182 172645
9198 172645 118027 97748 106018 87176 96538 78793 104921 185060 145125 120954 203617 224225
9186 224225 172867 163567 185957 149737 131047 160056 166306 189302 217889 247196 224684 185128
9174A85128o4104J8502K7742P649n2744K3787L2919K40J4204L0323K50r9846l4917
9161H9133R5203J3524N0674O7479m6826L5615M2212j4510L8297L815l152M2094
9149D13558l6323o6207J4089R9285N2462J828n1888o1870L917j4968L8713Q7023
9137D79619N8563J2577J740l7273N789Q7617R8511J2390R7359Q3250J335K0548
9125I22025n534J8710O1687J56254J09511Q7517J08307J16989J71032J54266J64907
9114B065671K00735J47991J58059K75303L24938M15297M32002L95119L84286M59200
9104E258601N33161N75968N73912M64199L54975L39142J50747K570q1552k05018
9094G966705k83223m45220m98464m45587m88199m82436m24139m63347l85463l47529
$$ plain form
9174 185128 121024 139526 167268 174917 122173 145960 178879 179119 193323 223646 223896 124050 89133
9161 89133 184336 197860 248534 316013 269187 304802 347014 332504 370801 374616 371464 413558
9149 413558 377235 311028 325117 424402 476864 478692 426804 364934 368851 353883 392596 479619
9137 479619 538182 550759 552499 515226 521015 608632 707143 719533 816892 900142 901477 922025
9125 922025 916491 935201 996888 1153142 1262653 1350170 1458477 1575466 1746498 1900764 2065671
9114 2065671 2266406 2414397 2572456 2847759 3172697 3587994 4019996 4415115 4799401 5258601
9104 5258601 5791762 6367730 6941642 7405841 7760816 8099958 8250705 8253275 8171723 7966705
9094 7966705 7683482 7238262 6739798 6294211 5806012 5323576 4899437 4436090 4050627 3703098
9084C703098l12973l16656k42436j83065k44698k94366j86734j03672j17139q8672
9074A612687r0259j46046j02594r8975n0014R702l3503n0017o3343p0422j5985
9063I01231j22942l49J8193p9534o3533k4806j3544l1853k193r8170o2557J828
9051D21771n6816k0518O8467N3882J5622n9969m8194p9403M0661N6457m724j878
9039C85358q9394l3679K4149k4578K8208j8330N9555M3351K345l7595q04o9048
9027B69538l3094N5179k6043o0133l7449o738j9619m1718l6148k8564K472M5846
9015H3529Q4182q9602l4465k178N5864J04471M9564n1494p0835N9810O0489k3128
9003B26207m6775J9966j3566m5600j0021j2234k6617L3242L9561n2513J707K0986
$$ plain form
9084 3703098 3390125 3073469 2831033 2647968 2403270 2108904 1922170 1818498 1701359 1612687
9074 1612687 1522428 1376382 1273788 1174813 1124799 1134501 1100998 1050981 987638 917216 901231
9063 901231 778289 777940 796133 716599 653066 628260 614716 582863 580670 482500 419943 421771
9051 421771 364955 344437 412904 466786 482408 422439 374245 294842 335503 391960 387236 385358
9039 385358 295964 262285 286434 261856 290064 271734 331289 374640 376985 339390 338586 269538
9027 269538 236444 291623 265580 205447 167998 161260 141641 99923 63775 35211 37683 83529
9015 83529 167711 78109 43644 41466 97330 201801 251365 199871 129036 188846 249335 226207
9003 226207 179432 199398 185832 140232 130211 117977 91360 124602 164163 111650 113357 134343
8991A34343q6115J4884K29p8957P6899Q0188O7544n112m3876l4505j8424k5487
8979H1611J0510J9261K7523M798n4108k9172R870J3086L3595p160P8057J0982
8967A98853n2469k2484n838O1011R402l3561M7186l1562m7649J6525L6048n3773
8955A21689l4016j1298l9493j5572L8321P8027k9117n0089k7264N9222M0374o643
8943A24141l805m4994K3477R4558r6550o4476K1707R593r44P736j5495k6767m0404
8930a2223n555j5186k4477M9362N7576O2440k5278L1680m0956k6429M1599M1102
8918A33655L881m1082j38874K1544L9772j1880k5748O0623M7387J1684O4365N457
8906A70784k1465R889j221K5853N3023n9185j37267m0032Q397j3359m7286k3517
$$ plain form
8991 134343 48228 63112 63341 -15616 61283 141471 209015 203903 160027 125522 107098 81611
8979 81611 92121 111382 138905 143703 89595 60423 70293 83379 116974 109814 187871 198853
8967 198853 146384 123900 118062 179073 188475 154914 202100 170538 122889 139414 175462 121689
8955 121689 87673 76375 36882 21310 59631 137658 108541 58452 31188 90410 130784 124141
8943 124141 120336 75342 98819 193377 96827 32351 54058 63651 62707 70443 54948 28181 -12223
8930 -12223 -17778 -32964 -57441 -8079 49497 111937 86659 118339 77383 50954 92553 133655
8918 133655 137536 96454 -42420 -20876 18896 7016 -18732 41891 89278 100962 165327 170784
8906 170784 149319 159208 157987 183840 236863 177678 40411 379 8776 -4583 -51869 -75386
8894g5386K8476M6841M393O2547L8053k8376j9214N884K3583j3450P680k1776
8882E9255n8703q3034j6677K4699J1253N6081O2511n1980r5132K0014N7510L075
8870a1128j9647K7945R567Q662j8757J1016k3320J0089Q3233O4424K9071m5681
8858A25474k616k6900K6717q4010m8162l079M2354J7387L0852J5355k8550n6878
8846G944O291R019q2460p525J4871J6857K9145K1345R0707Q4079j2692m6257p2257
8833E9067o4074l4562k439P732j5836L9007J9947L8828J0761m2769o868M394l7947
8820b4759p2893Q7368N1243m7056m8744j2498P0785L3177k7126L0383K3789n2118
8808A1551J1980O9244L3662l0472M8390n0888j394k6449k9200l1961n148n7717
$$ plain form
8894 -75386 -46910 -69 4324 66871 104924 76548 57334 63218 86801 73351 81031 59255
8882 59255 552 -82482 -99159 -74460 -63207 -7126 55385 3405 -91727 -71713 -14203 -11128
8870 -11128 -30775 -2830 6737 15399 -3358 7658 -15662 -5573 77660 142084 171155 125474
8858 125474 122858 95958 122675 38665 -9497 -12576 29778 47165 78017 93372 64822 7944
8846 7944 14235 23254 -59206 -66731 -51860 -35003 -5858 15487 106194 190273 177581 131324 59067
8833 59067 -5007 -39569 -42008 -34276 -50112 -11105 8842 47670 58431 15662 8794 13188 -24759
8820 -24759 -97652 -10284 40959 -6097 -54841 -67339 3446 36623 9497 39880 63669 11551
8808 11551 23531 92775 126437 95965 144355 93467 92073 65624 36424 4463 -685 -58402
8796e8402N312J1220J9604p883J7763n310p301N8374m1631K0492K8517K8358q2011
8783a2898o3494R7316L3479k3006P1200O0344k911m9540m5067j6684k2887l5394
8771i542K0516K269L4638j2068l5845N200j8264n4161M2181L6807p235R0743J5158
8758A10397m1293m4620j3322P6629J5857R60m8300q6140m7229j6420K0352j2882
8746h6011p254O0513j5526M310N4410J6726q455l3348K934J2976M4392r31l2497
8733A2239o7054n1455j4730P2156J7681N150j4848O0484O3522K1318l9410j8324
8721D6729m6988j4688N556j4934M1771p068j02103o532O5980Q1405k1545o3889
8709c6306m4943K5759P4661M2334m0369J7591J4276K5629r583o5030M5092j6234
$$ plain form
8796 -58402 -53090 -41870 -22266 -30149 -12386 -17696 -24997 33377 -8254 12238 40755 69113 -12898
8783 -12898 -76392 20924 54403 31397 102597 162941 160030 110490 65423 48739 25852 -9542
8771 -9542 10974 13243 47881 35813 -32 5168 -13096 -67257 -25076 11731 4496 95239 110397
8758 110397 69104 24484 11162 87791 103648 104608 56308 -29832 -77061 -93481 -73129 -86011
8746 -86011 -93265 -32752 -48278 -43968 10442 27168 18713 -14635 -11701 1275 45667 44736 12239
8733 12239 -54815 -106270 -121000 -48844 -31163 -26013 -40861 19623 83145 104463 65053 46729
8721 46729 -259 -14947 -9391 -24325 17446 10378 -91725 -98257 -32277 49128 27583 -36306
8709 -36306 -81249 -55490 19171 61505 21136 38727 53003 78632 69049 4019 49111 32877
8697C2877k4410j8487k2628O1219K699J2727R167l7299K742Q6241O8739k2544
8685A51043m5089n1489L429J5848O2787J168p4942k1026M2107K7168l0020o002
8673G4982K0256l3160m1320j0426k6618l0708M7070M2115J2930j027j3904n0481
8661a0291l2575r3327r025L0118J05428Q4304K1938O873j3956p6522l7191N497
8649a8729k6267j7499K6464n460k4442O6370J07906M2940Q257m6601M5338M112
8637A62389j5898Q960j9190k3088l8539j2835K2992L3928q972j3280O111p4589
8625B7989K2472K3254m7526J7127J1888k9026M7969K8647K2732k5364k0254k5376
8613E4532L5028N5644n72j8567p2794K121K3302J3239l6299R709N3760j7606M180
$$ plain form
8697 32877 8467 -10020 -32648 28571 31270 43997 53164 15865 18607 104848 173587 151043
8685 151043 105954 54465 57894 73742 136529 137697 62755 41729 83836 111004 80984 74982
8673 74982 95238 62078 20758 10332 -16286 -46994 76 42191 55121 54094 40190 -10291
8661 -10291 -42866 -136193 -145218 -115100 -9672 74632 96570 103443 89487 12965 -24226 -18729
8649 -18729 -44996 -62495 -36031 -41491 -65933 437 108343 151283 159540 112939 158277 162389
8637 162389 146491 155451 136261 113173 74634 61799 84791 118719 109747 96467 102578 27989
8625 27989 50461 73715 26189 43316 55204 26178 74147 102794 125526 100162 79908 54532
8613 54532 89560 145204 144632 126065 53271 55392 78694 91933 55634 65343 119103 101497 105677
8600A05677j0334n0130j9368J7183j8529l1822L1931P5880J1219j6849L29L765
8588I8952j604l2443N9443J7293m0888m5558K9968M7948J5234l9432o9035j0450
8576B9428K5333m8128J5832Q423j3849j7265K161j6149k5255N3446r759J0223
8564A4441L0853k0850p1380p2172j6891O9925L3291O8922J836J6392M642j3110
8552D5899o029k2232m459m6095o8823n3624K8038O5970N2381L5854K5802n9271
8540f589l8567M3468o839O8440L1604j6765o4113K4374J3726o433l8665j704N1288
8527E3225P85r6087l3454O1860J0437j5426J1942L4016J5091j0112m2527M1034
8515C0784J4075j0156l6650j7121J5159J5469K318j4378l3591p4883j9549M8093
$$ plain form
8600 105677 95343 45213 25845 43028 24499 -7323 24608 100488 111707 94858 95187 98952
8588 98952 97348 64905 124348 141641 100753 55195 85163 133111 148345 108913 39878 29428
8576 29428 54761 6633 22465 30888 17039 -226 1935 -14214 -39469 13977 4218 14441
8564 14441 45294 24444 -46936 -119108 -135999 -66074 -32783 36139 37975 54367 59009 45899
8552 45899 39870 17638 13179 -32916 -101739 -155363 -127325 -61355 -8974 26880 52682 -6589
8540 -6589 -45156 -1688 -8527 59913 91517 74752 10639 35013 48739 42306 3641 1937 53225
8527 53225 54010 -42077 -75531 -13671 -3234 -18660 -6718 27298 42389 32277 -10250 30784
8515 30784 44859 34703 -1947 -19068 -3909 11560 13878 -500 -34091 -108974 -128523 -80430
8503h0430K2440J9160K5224j081K9432L1884L6437l3128p9139j0093j423M0825
8491A08M6226K890K3038J3099R226l634L1723l4760j9800p0918o2550N2212L4615
8478B1475M5921O8901N5502l5787l9886n7285q6689l8303M2744J10225l034o439
8466G7345m0127q1320j0869P7361J32805n4820o4270j1139K9535K2869k6502k1622
8454B9246n4573k3483r286P4852L513l2841p933J5243l4402K6863L5797N9339
8442H2335J1330k7969j8178N9925q246p3713j975L118m7503J4171P105j5122o4988
8429g9710j6165P35Q2367M6145o606l6342k0295O057L2937P8922K4200k1114k150
8416H8981O1572M8186j26644q1022J4399J211K8544l2900M1473K1005p6551r3464
$$ plain form
8503 -80430 -57990 -38830 -13606 -14687 14745 46629 83066 49938 -29201 -39294 -40717 108
8491 108 46334 49224 72262 85361 94587 90953 122676 87916 68116 -2802 -65352 -13140 21475
8478 21475 67396 136297 191799 156012 116126 58841 -27848 -66151 -23407 86818 83784 77345
8466 77345 37218 -44102 -54971 22390 155195 100375 36105 24966 54501 77370 50868 29246
8454 29246 -25327 -48810 -58096 16756 20269 -12572 -20505 -5262 -39664 -12801 22996 82335
8442 82335 93665 65696 47518 107443 99197 25484 23509 26627 -20876 -6705 400 -14722 -79710
8429 -79710 -95875 -95140 -12773 33372 26766 -9576 -29871 -23814 9123 88045 112245 91131 88981
8416 88981 150553 198739 72095 -8927 5472 6683 35227 2327 43800 64805 -11746 -105210
8404a05210n0376J02556J27134O100n7287J9399L7828k4022l8617O729J0833O9462
8392A04529P0234l8462n4881j4738j8630J4683M956l2246L8006P3130Q965j5261
8380A40285L9801O798m9911m0846l792j7410n7538j08625J2756P7334J4833m1290
8368b7605L8739O0736q6365n3274L4099M8050J3314P2456j5311o6607K1752n6264
8356a6280M4815l808M21O6119n9273q5230J4828O6905P3265L3102j30352n6681
8344e2169m126k7223m8887L8842R9108J0436j01865k4435P5753l6318K5437R907
8332c5540P2017M1398n4753j5563M2829L453k8530q000K7851N0286k9747L1956
8320I7657K6359m7190n590J4363m2035J0744P7673M7857k5191j8980r883o1559
$$ plain form
8404 -105210 -155586 -53030 74104 80204 22917 42316 80144 56122 17505 24234 35067 104529
8392 104529 174763 136301 81420 66682 48052 62735 67691 35445 73451 146581 155546 140285
8380 140285 180086 186884 136973 96127 92335 74925 17387 -91238 -78482 -1148 13685 -27605
8368 -27605 11134 71870 -14495 -67769 -33670 14380 27694 100150 84839 18232 39984 -16280
8356 -16280 28535 24727 25148 91267 31994 -53236 -38408 28497 101762 134864 4512 -52169
8344 -52169 -56295 -83518 -132405 -93563 5545 15981 -85884 -110319 -34566 -70884 -45447 -35540
8332 -35540 36477 77875 23122 7559 50388 53841 25311 17311 45162 95448 65701 97657
8320 97657 124016 76826 71236 85599 43564 54308 131981 179838 154647 135667 125784 64225
8308F4225q0306n1384L603J8058l0189m3498L9667J4368M4596J488m7806n755
8296g2933J6547Q0490M4068n2449l4023l5681M3700M8578k763J8823k0208j4655
8284A9494j5598K1280k4614j13768K8498O560J8589L9408l7636L035K9042k0444
8272d6154q946M4331R6887l0492n3005L7620J3120m3917j596N81J2861N0861n1433
8259B0718l6077l24J9484O303J8425k0290L9466n4612J7837L3059J8351m6501
8247A5839j897K5779k3439o1187m150O5505O8093Q3499o1573q5779n229J6231
8235C1692o5673l1817J3027J9888J3736j8302n285k9284M4517l450n7584N7175
8223c1360O5391J1651o2482k949P6153K1146m2747M4754J7492k2167n213J1389
$$ plain form
8308 64225 -16081 -67465 -63862 -45804 -75993 -119491 -79824 -65456 -20860 -19372 -67178 -72933
8296 -72933 -56386 24104 68172 15723 -18300 -53981 -10281 38297 35534 54357 34149 19494
8284 19494 3896 25176 562 -113206 -84708 -78148 -59559 -20151 -57787 -54752 -25710 -46154
8272 -46154 -55100 -10769 86118 55626 2621 40241 53361 9444 7848 8429 21290 72151 20718
8259 20718 -15359 -15683 3801 10104 28529 8239 47705 -6907 10930 43989 62340 15839
8247 15839 13942 39721 16282 -44905 -49055 16450 84543 168042 106469 20690 15461 31692
8235 31692 -33981 -65798 -52771 -32883 -19147 -37449 -42734 -72018 -27501 -30951 -88535 -31360
8223 -31360 34031 45682 -16800 -19749 56404 77550 34803 79557 97049 74882 69669 81058
8211H1058l64k2892J7606L0256j9952l8819J3726N649n2333l1081k8357K6145
8199a9358J1944J4896L5429P327j8892l5193k3034O4513L4699n5161j3037l2367
8187b8234p3099o4194N4608J2484J9098L5469O8563N0459j5081l9317L0407j7086
8175C4077o9129J3185O2378K6563j07604j23514k5654Q7717O0470P122P5989L09
8163D1909p75L9243j3221K0240j5553j6531m2539l8148j06387O35P9883J4705
8151c6539l8145j1984l0053l8864P0114R6273k6143K8235L4919k1854j25133J23
8139i9051K2985R1801P0295J3268p398n6888p613J7798K8358r463p3939n5233
8127f5080M155L2231r911N5488o90J6809K7897o4018Q552k5388L2318K3322n8550
$$ plain form
8211 81058 80694 57802 75408 105664 85712 46893 60619 66268 13935 -17146 -45503 -19358
8199 -19358 -7414 7482 42911 50238 31346 -3847 -26881 37632 72331 17170 4133 -28234
8187 -28234 -101333 -165527 -110919 -98435 -79337 -43868 24695 75154 60073 20756 51163 34077
8175 34077 -35052 -21867 40511 67074 -40530 -164044 -189698 -101981 -41511 -34389 41600 41909
8163 41909 41134 80377 67156 87396 71843 55312 12773 -25375 -131762 -131127 -51244 -36539
8151 -36539 -74684 -86668 -116721 -155585 -85471 10802 -15341 12894 47813 25959 -99174 -99051
8139 -99051 -76066 15735 86030 99298 91900 35012 27399 45197 73555 64092 -9847 -65080
8127 -65080 -60925 -28694 -38605 16883 16193 33002 60899 -3119 5433 -19955 12363 35685 -22865
8114b2865R323j8985l4688N2498N4067k9945n2633p9838K6601n448j9933l1795
8102a53641j7969N7316o031N7336K2880r594O1211L7847l1428o5682M4188R3018
8090H9451K4958k5066n3655m5944K8579n9269m021J9682M3693J2988o494L9133
8078F4035j0184N1621K9154n9249r5742n9072L8588L532K3804M3572p079J4818
8066C7798n3978K302R207M245P9295j5094J7959R663k2867p3306P3302Q3935j1429
8053A41032n0471p2609K2437K1184k8934n3464p3807J505J2112P3363L6369l4504
8041e787l2037j4958M1964K2492q472L7392o3504o0853j1314L4176Q5854k7253
8029b300m6161J3340L7127k3290k3738O114j4126J7399M3986l1190L994L9637
$$ plain form
8114 -22865 -13542 -32527 -67215 -14717 39350 9405 -43228 -123066 -96465 -101913 -121846 -153641
8102 -153641 -171610 -114294 -120325 -62989 -40109 -49703 11508 49355 17927 -47755 -3567 89451
8090 89451 114409 89343 35688 -10256 18323 -40946 -44967 -25285 18408 31396 24902 64035
8078 64035 53851 105472 134626 75377 -20365 -79437 -40849 -37317 -13513 30059 22980 37798
8066 37798 -16180 -13878 -4671 -426 78869 63775 81734 91397 68530 -4776 68526 152461 141032
8053 141032 90561 17952 40389 61573 32639 -20825 -94632 -93127 -81015 -7652 28717 -5787
8041 -5787 -37824 -52782 -10818 11674 3202 40594 -22910 -83763 -95077 -60901 24953 -2300
8029 -2300 -48461 -35121 2006 -21284 -45022 -38908 -53034 -35635 8351 -22839 -18845 20792
8017B0792N2850j846K9782M2804j5239r144K536J1159J0605j4993L045m7782n4988
8004B9581k4925O0982N4617m8322p9512n0816L5632Q3844L429l3635o3861m071
7992c7057O298L533M4029N071L5447K1753l3183M026j4931j0450N88j1285M3863
7979E7702N9143o5250l2020k2393k5606Q0237L4249k6595J5856R4L5667K025j00260
7966A2849n1896L8844R0199M6431Q5687k8585q6694k1973L1364O642j0005n3764
7954E9099k9307J660K208n6805M5689J2392o592j0191M027M473o3398J5707R9752
7941G8714P758k0424j03785k3600R3729J4458n7617k1354L674O8552p396j1726
7929B0983J6009K1867n1925o1606l8263J8019k5611J3850K9016N2286k6279k6542
$$ plain form
8017 20792 73642 71796 101578 144382 129143 119999 122535 133694 144299 129306 132351 84569 29581
8004 29581 4656 65638 120255 71933 -7579 -58395 -22763 61081 64510 30875 -32986 -37057
7992 -37057 -30759 -27226 16803 21874 57321 79074 45891 49917 34986 24536 25124 13839 57702
7979 57702 116845 51595 19575 -2818 -28424 51813 86062 59467 75323 75417 111084 113109 12849
7966 12849 -39047 -203 89996 136427 222114 193529 106835 84862 116226 122868 112863 59099
7954 59099 29792 31452 33660 -23145 22544 34936 28344 18153 22180 26653 -36745 -21038 78714
7941 78714 86472 66048 -37737 -61337 32392 46850 -10767 -32121 -28447 40105 32709 20983
7929 20983 36992 58859 6934 -54672 -92935 -74916 -100527 -86677 -57661 -5375 -31654 -58196
7917e8196L835j3211K6972J5222P2857J0279J6067j6190l5001j5533r426k6227
7905b8552k3906O9842J8115l3312m8990l338K2706K5902K3662L3652L6848J2100
7893A04729j3179m5462l3874k4892j1983J6177r437J8148p448m7498k3488J6256
7881f1951Q0970M6318m936r1470j9725m1923M0694Q2617r1830m5299P9347N6160
7869B8972k8231k9706n097k3881M3876J9558l9264L7373J1867J4735p1060m524
7857d5382k9387n4730J1703J00353K2855P7652L8076j2857p3186L442K6709q77
7845F4371O2485m9104q6169l8225P3082j4040m2160O7209M835q3486o5273M0144
7833f6331K6319K9308l086j4341N624P3420J9893j7528m556k5657N4664O3464
$$ plain form
7917 -58196 -54361 -67572 -40600 -25378 47479 57758 73825 57635 22634 7101 -2325 -28552
7905 -28552 -52458 17384 35499 2187 -46803 -50141 -27435 -1533 22129 55781 92629 104729
7893 104729 91550 46088 12214 -12678 -24661 -8484 -17921 227 -7221 -54719 -78207 -61951
7881 -61951 19019 65337 60401 -31069 -50794 -92717 -52023 30594 -61236 -106535 -27188 28972
7869 28972 741 -28965 -34062 -57943 -14067 5491 -33773 3600 15467 30202 -40858 -45382
7857 -45382 -74769 -129499 -117796 -17443 5412 83064 121140 108283 35097 38539 65248 64371
7845 64371 126856 77752 -8417 -46642 26440 12400 -29760 37449 42284 -41202 -106475 -66331
7833 -66331 -40012 -10704 -13790 -28131 -22507 50913 70806 53278 48722 23065 77729 141193
7821A41193O651m6371L1783K8632m2674r4650p0398p3635O2099M8663k8183K4765
7809a2125J686q12L6513O431l5746n3488J7270J10642L0671K0104j2740o6184
7797D2222o0266k3657j3420m2495J276M5532M1588K3412N9873L4998O946m9494
7785F6515j5331m2288j0287p303M4098M6539L1869M4878j9191n0122O484j9660
7773G6201o4757l5259L7387n5690K7486n4364l1945L198Q4781N7480Q465K4303
7761G7286r7079q3948P184O6126j8458L7396K9291n69J7349q3089k9482k8925
7749a06918L8262Q5308J7258j5756p6593l2745L5605m2401k2985O7622K2857K5464
7737e022m328m049K7633O6753m5570l9581m4668N905L2232n314j1415j6828n7040
$$ plain form
7821 141193 147844 101473 133256 161888 119214 24564 -45834 -119469 -57370 -8707 -36890 -12125
7809 -12125 -10439 -11251 25262 31693 -4053 -57541 -40271 70371 101042 121146 108406 42222
7797 42222 -18044 -41701 -55121 -97616 -96340 -50808 -9220 14192 74065 109063 116009 66515
7785 66515 51184 8896 -1391 -8694 35404 81943 113812 158690 139499 89377 95861 76201
7773 76201 11444 -23815 13572 -42118 -14632 -68996 -100941 -97743 -12962 44518 52983 77286
7761 77286 -19793 -103741 -96557 -30431 -48889 -11493 17798 17229 34578 -48511 -77993 -106918
7749 -106918 -68656 16652 33910 18154 -58439 -91184 -55579 -97980 -120965 -53343 -30486 -5022
7737 -5022 -9350 -13399 14234 80987 35417 -4164 -48832 -42927 -10695 -16009 -27424 -44252 -101292
7724a01292J1396P4473M0531K1047p2419o4149M1795M2344Q345Q9743N850Q223
7712A05887M6804k7224p1498p4623j00383N3259O0013O2160K775j6751k7531K1541
7700C4429M3296J382j6045j9585p2520p6073j1846N9786N577L3927n6442m672
7688g8786P7804P759r633l7311M3407K8583K657m9286l867O812N0387K6797o0876
7675D447l3310q1L9113n891J3855l5895l4510J818J9994m94P939k1285m3965o357
7661i4622L5681K0660j2746p991M5404m18o3764r044Q7277M4869K9292k056n5408
7648A7134n560N8726l5064n1947l8831m702L0571M9305j8342N442m7567n2218
7636i3053J4513j5770P622l4192l807L9293J7638M5029R1523j425l2103k9368
$$ plain form
7724 -101292 -89896 -15423 25108 46155 -26264 -90413 -48618 -6274 2071 91814 97664 105887
7712 105887 152691 125467 53969 -20654 -121037 -67778 -7765 54395 57170 40419 12888 34429
7700 34429 77725 79107 63062 43477 -29043 -105116 -116962 -57176 -51599 -17672 -74114 -78786
7688 -78786 -982 6777 -2856 -40167 3240 31823 34480 -14806 -18673 -11861 38526 65323 4447
7675 4447 -28863 -28944 10169 4278 18133 -17762 -52272 -50454 -30460 -30954 -23015 -44300 -88265 -94622
7661 -94622 -58941 -38281 -51027 -59018 -13614 -14032 -77796 -86840 437 45306 74598 72542 17134
7648 17134 11574 70300 35236 -16711 -55542 -60244 -29673 19632 1290 6732 -40835 -93053
7636 -93053 -78540 -94310 -86688 -120880 -124687 -85394 -67756 -22727 68796 67371 35268 5900
7624E900K8528N6634j2491n0604K639L4649j1350j3142M3781n7131p568M1444
7612F1289J7589J5196k9179l3155p1421N6606p739o055J3563o9543n1289K5239
7600g8899J2555N3184L3110K2427M375M0782J27k7356l7953J8704N7965m4589
7588E4432j9526N2725m9231l6576j1003l9447J0740j4419j0734j7204J7861K5295
7576c7087L9467j9574j8444j7924o7137J5956K8755j6912K1718O2503L5267J6863
7564D3451o4340j1470j0806M786j1752k9895L1840J2260r590R1292p56o6128n3289
7551g4397n0461N4120O8566K1013j7790M637R044J6475r811n2002o99j0080k5652
7538f7037K7650k414k9109r67j1463J8854L701q701k0473L4664L7477K816m5078
$$ plain form
7624 5900 34428 91062 78571 27967 30606 65255 53905 40763 84544 27413 19845 61289
7612 61289 78878 94074 64895 31740 -39681 16925 9186 3131 16694 -52849 -104138 -78899
7600 -78899 -66344 -13160 19950 42377 46752 87534 87661 60305 22352 41056 99021 54432
7588 54432 34906 87631 38400 1824 -9179 -48626 -37886 -52305 -63039 -80243 -62382 -37087
7576 -37087 2380 -17194 -35638 -53562 -120699 -104743 -75988 -92900 -71182 -8679 26588 43451
7564 43451 -20889 -32359 -43165 -38379 -50131 -80026 -48186 -35926 -45516 45776 45020 -21108 -74397
7551 -74397 -124858 -70738 -2172 18841 1051 5688 14732 31207 21396 -30606 -31305 -41385 -67037
7538 -67037 -39387 -41801 -70910 -71877 -83340 -64486 -60785 -69486 -89959 -55295 -17818 -15002 -60080
7525f0080N8542P1297l54j3616j0451k1841L16m3974j4744J352R6022L4822n8388
7512C8903l8827M1361J0170j4419j7766K2010P396n0627m0395N9916L2541m234
7500D6029p761q1886k9238N9292J8188N4216L1004r957K587M5638j1150l8627
7488G8335p9687l9241O8225N2125O8212m9843J5735n0446n723j4299o5482p7787
7476i9876l8649R1366R0179L5246o7004p8948m472j3475L259n777n3209l940N8444
7463h6856Q415P7119l9805m6159O7276N3734K1756j2083j3314n183K4791l2302
7451A7389R217Q2568L9843L608j11063o9152J1277N080L8316k6496j8464j03k5963
7438d3943L7687K4362k3647j7903l3639K5690q065K2701j15J6081k0163n4245
$$ plain form
7525 -60080 -1538 69759 69405 55789 45338 23497 23813 -20161 -34905 -33553 62469 97291 38903
7512 38903 76 41437 51607 37188 19422 41432 48828 -1799 -42194 17722 50263 46029
7500 46029 38268 -43618 -72856 -13564 4624 58840 89844 79887 82474 128112 116962 78335
7488 78335 -1352 -40593 27632 79757 147969 98126 113861 63415 57692 43393 -22089 -99876
7476 -99876 -138525 -47159 43020 78266 11262 -67686 -72158 -85633 -82374 -88151 -141360 -145300 -86856
7463 -86856 -78441 -1322 -41127 -87286 -20010 33724 55480 43397 30083 24900 49691 17389
7451 17389 26606 109174 149017 152625 41562 -27590 -16313 -11233 27083 587 -17877 -17980 -43943
7438 -43943 -6256 18106 -5541 -23444 -57083 -31393 -39458 -16757 -16872 -791 -20954 -75199
7426g5199M6255K4820k997l7704L3832L2353o47n4732n088L9735K6774J1498k0166
7413A8734n299k0260n6236p960K1186K0129n314k8P0257m104l4160L7127k1496
7400A2576K3574L214J0028k6658j1708j9978L4185J919m7337K0638J0619o6l2792
7387b1786k8119M8237J1550k9367N6015L5788K2160J9559J3997j802j1256K2077
7375A37053j2396m2558n0841k4024n8438J447q619J6680K5148m0894P1751P3357
7363H7666k4114J1082J0031K4685P284Q648o3863n9225l6514l503O2371j2605
7351A1943k7217o722l7273n859M9032j332k0278L1857j011m3954l7654m668K3531
7338f9605P524N6703j8474R931r495n5767r5733M5733J17142L1764q6035m7718
$$ plain form
7426 -75199 -28944 -4124 -7121 -44825 -10993 21360 20713 -34019 -39107 628 27402 38900 18734
7413 18734 13435 -6825 -63061 -71021 -49835 -29706 -35020 -35048 35209 31105 -3055 34072 12576
7400 12576 36150 39364 49392 22734 11026 -8952 25233 27152 -20185 453 11072 11006 -21786
7387 -21786 -49905 -1668 9882 -19485 36530 72318 94478 114037 128034 126232 114976 137053
7375 137053 124657 82099 31258 7234 -51204 -49757 -58376 -41696 -16548 -57442 14309 87666
7363 87666 63552 74634 84665 109350 116634 125282 61419 2194 -34320 -37823 24548 11943
7351 11943 -15274 -21996 -59269 -65128 -16096 -17428 -37706 -5849 -6860 -50814 -88468 -93136 -69605
7338 -69605 -62081 -5378 -23852 -13921 -23416 -79183 -174916 -129183 -12041 19723 -66312 -114030
7326a14030K2750J24084m1491P669J0040K3850J6259J0287l0475k0777K3307L4262
7314F5735J4568k5533M547n7077j5132l38l8078L2148j9416k5435O4399N2749
7302E3137k0287l1556n1274J510J7531k404j2774N1413J1185p4251q617L7696
7290b8691l0684o0069Q6349j3900J8322N2448J5413k7863k3616m463j01757L0808
7278h7703R2383N910k2083J1902k1108o1599l5998O3037K0556o0075R932l8714
7266a23560m4099O1827L9088L4353Q8830P16j6619n2262K8017N0251j2773r1981
7254c8212j3907Q1380J4755q605M323k7432m6667M348M772K1213J4720L0012p35
7241C9965L036N088q2116K2755N1093j2916k911L4888j6224q4203k1208j0557
$$ plain form
7326 -114030 -91280 32804 -8687 -1018 9022 32872 49131 59418 28943 8166 31473 65735
7314 65735 80303 54770 59317 2240 -12892 -13230 -51308 -19160 -38576 -64011 388 53137
7302 53137 32850 1294 -49980 -48470 -30939 -33343 -46117 5296 16481 -57770 -66387 -28691
7290 -28691 -59375 -119444 -33095 -46995 -28673 23775 39188 11325 -12291 -16754 -118511 -87703
7278 -87703 4680 10590 -11493 409 -20699 -82298 -118296 -55259 -34703 -94778 -84846 -123560
7266 -123560 -167659 -105832 -66744 -32391 56439 57155 40536 -11726 16291 66542 53769 -38212
7254 -38212 -52119 29261 44016 35411 39734 12302 -34365 -30017 -25245 -4032 10688 40700 39965
7241 39965 43001 48089 -34027 -11272 39821 26905 23994 58882 42658 -41545 -62753 -73310
7229g3310P6124J1506L7163j9215l620n5812l4634K325k7862N362p5179j9297
7217a76449L1628K1840q454J3577l2285o054N5519O6237J8493J7642o4629o8887
7205a31822k7080j6141O4218M6133N518L3194P9800M0537J0082q2791k4360m1175
7193d3887J2327M5975K0021k5191m454K8587m5099m9348M4854n7793o9422k317
7181a45747N9077O2204n101k7772P966P28m8296j6093M4552J14547M3805k6113
7169F3757l9827k6039m1383j3085K7153k6533k4071N8953M3250m8519j9123l5163
7157h0630k7861J15051l6482m850L1881m652L7156J1214K8349P441M973l1070
7145E0520l137O845n7475m2394N3275O1313m042l3127m0620j4231o7370Q743J3243
$$ plain form
7229 -73310 2814 14320 51483 32268 28648 -27164 -61798 -59473 -87335 -81973 -157152 -176449
7217 -176449 -144821 -122981 -131435 -117858 -150143 -156197 -100678 -34441 -15948 1694 -62935 -131822
7205 -131822 -158902 -175043 -110825 -64692 -59174 -25980 53820 94357 104439 21648 -2712 -43887
7193 -43887 -31560 14415 34436 9245 4791 33378 -11721 -61069 -16215 -74008 -143430 -145747
7181 -145747 -86670 -24466 -29567 -57339 -49373 -48645 -96941 -113034 -68482 46065 89870 63757
7169 63757 23930 -2109 -43492 -56577 -29424 -55957 -80028 -21075 22175 -26344 -45467 -80630
7157 -80630 -108491 6560 -29922 -34772 -2891 -7543 29613 40827 69176 76617 81590 50520
7145 50520 47383 54228 -3247 -45641 7634 68947 64905 31778 -8842 -23073 -90443 -81700 -68457
7132f8457o757m2784N6557K7996Q325N0991K6591o6642l1745k4776j9217o3699
7120a53617k1281L3780O1587k3363J3946N0191q652O591J1717N2177J9555k9042
7108A3589J6559k5300N9180k3494o821k4786L2160n580Q775k1717L8762l389p7338
7095a9400j1855L4519m1249L6079n7575q5956J1946Q3870P443O779M4075o8143
7083e9467m8878n630K788l0359l0572L8031K7227O2908M7309O629j7279J7772
7071A0479j7190k2094q2213l3479M717J13734M398o2591O1272O3901j2209p652
7059B1073j1373K1212p633l4645K8671r53r5182p5833k4816k6044L9671J00666
7047f5186O0826L7516O0483l9402j04296n4660m2025P4138M6622k8476j7952Q866
$$ plain form
7132 -68457 -75214 -117998 -61441 -33445 -25120 25871 52462 -14180 -45925 -70701 -89918 -153617
7120 -153617 -174898 -141118 -79531 -102894 -88948 -38757 -47409 -40818 -29101 23076 42631 13589
7108 13589 30148 4848 64028 40534 33713 8927 41087 35507 44282 22565 61327 57938 -19400
7095 -19400 -31255 3264 -37985 -1906 -59481 -145437 -133491 -49621 -42178 -35399 8676 -59467
7083 -59467 -108345 -113975 -111187 -141546 -172118 -134087 -106860 -43952 3357 9986 -7293 10479
7071 10479 -6711 -28805 -111018 -144497 -139780 -26046 -21648 -84239 -22967 40934 28725 21073
7059 21073 9700 30912 23279 -11366 17305 16352 -78830 -154663 -179479 -205523 -165852 -65186
7047 -65186 -4360 33156 93639 54237 -50059 -104719 -146744 -72606 -25984 -54460 -72412 -63546
7035f3546L6830m1570K5542K2924M9970K8118O58L7181L965o2620l1493l1162
7023b5203j8654l436M5898N8403k4603j5191l7133j8355J0142o699L4207N9590
7011E8966J2130l1167J5836L3326M0872j03057q2978O798O5495M6535L1500o7876
6999B6380n6110k9792J0673l9081o938O567l1342q862j3430M2096M7737j8668
6987g0770q8269l069M1578j5844K7126m5606J7776J16733M1336J1728j1761l4301
6975a3343L6015K642L4903J9968o452l8519j2771L921l8776n7669l1052n174k5655
6962a31962L1120j9524J0530J3466k138o4758L7720J5648J01876R8051k9366j08151
6950d7488j8816N1983N48m5558K9052L7411k1779K1163P24m586P060p031m4588
$$ plain form
7035 -63546 -26716 -68286 -42744 -19820 30150 58268 58926 96107 100072 37452 5959 -25203
7023 -25203 -43857 -47293 -1395 57008 32405 17214 -19919 -38274 -28132 -34831 -624 58966
7011 58966 71096 39929 55765 89091 129963 26906 -56072 -49274 16221 62756 94256 26380
6999 26380 -29730 -59522 -48849 -87930 -94868 -88301 -119643 -128505 -141935 -99839 -52102 -70770
6987 -70770 -159039 -162108 -120530 -136374 -109248 -154854 -137078 -20345 20991 32719 20958 -13343
6975 -13343 22672 25314 60217 80185 73733 35214 22443 26364 -12412 -70081 -101133 -106307 -131962
6962 -131962 -100842 -120366 -109836 -96370 -98508 -163266 -125546 -109898 -8022 90029 60663 -47488
6950 -47488 -66304 -14321 -13773 -59331 -30279 7132 -14647 6516 7240 2654 9714 2683 -41905
6937d1905L129R4464M8516J2672k5726k3977L0816m4942rk3322o9467J2364O415
6924b0972o0n497Q1750J7607l8724o3658J4654K1820j6729L244J51l4974n1272
6911i2660l9525L3653P8983j3339m933q647q2284q876P1845J4706M5786Q9139
6899H3848k3198j0647k1900k611k547m1312k0217K2040O536N5399j586q7242j933
6886d5370J29891Q096k3619R920n2707n5349O6467R270o5289K1049m6159p2353
6874a16153K8922P7056j0267J4213k521o5641K9640K5768O119N693J3343R14P5395
6861H2481Q354o3773o945k4902Q627O696m684M5636L6533n2694l0369k8651n4411
6848g8102Q0101N2245r9379n9646l1294j6350M5172O1333j9337m9980L1479K7021
$$ plain form
6937 -41905 -38776 55688 104204 116876 91150 67173 97989 53047 53038 29716 -39751 -27387 -20972
6924 -20972 -21032 -26529 55221 72828 34104 -29554 -14900 6920 -9809 -6565 -6414 -41388 -92660
6911 -92660 -132185 -98532 -19549 -32888 -37821 -46468 -128752 -137628 -65783 -51077 -5291 83848
6899 83848 60650 50003 28103 25492 22945 -18367 -38584 -16544 -10008 45391 43805 -43437 -45370
6886 -45370 84521 92617 68998 78918 26211 -29138 37329 46599 -18690 2359 -43800 -116153
6874 -116153 -87231 -10175 -20442 -6229 -8750 -74391 -44751 -18983 -12864 -7171 6172 7086 82481
6861 82481 90835 27062 20117 -4785 3842 10538 5854 51490 88023 35329 4960 -23691 -78102
6848 -78102 1999 54244 -45135 -104781 -136075 -152425 -107253 -45920 -65257 -115237 -83758 -56737
6836e6737j4640J2140p240K6396K2973K1722k9527P736J3816O5763K1831l7425
6824D6808n6344K3815k5433K972q0409k4264p1826k7068O3709O6695O0006J3274
6812h065K14J7550j1996m4003m588N4471K0910k1564P0340M4066o9855q7860M4221
6799C841K1093J0890k991K4176j3778j047n572n9852Q573N9658N2493j4545j7156
6786F5783j0012m0780l4961m6701J8830K865k4917Q151L3197m0653n4577L0211
6774i3564M8202J3062n0373K4722L7762m2477l4462P7572k0767j5391N1601M9664
6762D5551J301J8857k9753o5015j4671N2567L978m3150J3291J1920l2L4037k6051
6749B830O245R9547N5173l1229j4126R531o1044o429l7563j3730K9765J215N191
$$ plain form
6836 -56737 -71377 -59237 -66477 -40081 -17108 4614 -24913 -17177 -3361 62402 84233 46808
6824 46808 -9536 14279 -11154 -8182 -88591 -112855 -184681 -211749 -148040 -81345 -21339 -8065
6812 -8065 -7851 9699 -2297 -46300 -50888 3583 24493 2929 73269 117335 47480 -40380 3841
6799 3841 24934 35824 32833 57009 43231 42184 36612 -23240 -14667 44991 97484 82939 65783
6786 65783 55771 14991 -19970 -66671 -47841 -44976 -69893 -61742 -28545 -69198 -123775 -93564
6774 -93564 -45362 -32300 -82673 -57951 -20189 -62666 -97128 -19556 -40323 -55714 -4113 45551
6762 45551 46852 65709 35956 -29059 -43730 8837 12815 -30335 -17044 -5124 -5156 28881 2830
6749 2830 9075 108622 163795 132566 118440 127971 66927 60498 22935 9205 38970 40185 45376
6736D5376M0513J9849j9318j4488r38L0726N3174L6824r6406o6391j16234j4862
6724a02175L1548K2238K2658k7044m4253k6324K8650M5795K68P899j3887K6647
6712b7980K2789K7002L0878K473P645j134K5411L1115n0324j7149m0124k9350
6700a8748L7054q137k9603l2561R551P6547L8203m4710m0989j4980K5205n0470
6688e3638k8071K5037K2797J05094o786l5535M9584l9143k0690L4042k3881J0915
6676C9725j0843j2770K8628m9108k5642J470L302M2973j7451p42j3613k1903l5918
6663g1892J9743N650l4040m314j0688J8900Q5234O2211m2853n1970J7838k5114
6651c1295j9102K0780L8629K51N9226k6628p012K5870k643J0397k541m4283j2127
$$ plain form
6736 45376 85889 105738 86420 71932 70994 101720 154894 191718 95312 28921 -87313 -102175
6724 -102175 -70627 -48389 -25731 -52775 -97028 -123352 -94702 -48907 -48639 -40740 -54627 -27980
6712 -27980 -5191 21811 52689 55162 62807 61673 87084 118199 67875 50726 10602 -18748
6700 -18748 18306 10169 -19434 -51995 -42444 34103 72306 27596 -13393 -28373 -3168 -53638
6688 -53638 -81709 -56672 -33875 71219 64433 28898 78482 39339 18649 52691 28810 39725
6676 39725 28882 16112 44740 -4368 -30010 -28540 -25238 17735 284 -458 -14071 -35974 -71892
6663 -71892 -52149 -46499 -80539 -84853 -95541 -76641 8593 70804 27951 -24019 -6181 -31295
6651 -31295 -50397 -29617 9012 9263 68489 41861 34849 60719 58076 68473 65932 21649 9522
6638I522K2144o7536l6484j6760m673Q7526O5292L1020o1953n7765J9158K1409
6626A0900R370L8990k1333p124L5164K0688k6481l8702J6986M6651P7328j969
6614A60468m2584n1934j0578j4435K9766N8941O963l8324l7806k4868R993l8843
6602F759l1401O9061L6899m573l6090K5251O4121k2502o0970q276K2972j3170
6590D8081q1714k8093j1454l2761L1679N3720K4280R2988O414M1084o2727m9136
6578C2361L1226K1107n8832J403Q7301l5543l9484K1283j0086m4636j4755K6281
6566A7626j2940r6746n5837M6283P5842M1567n2544J2585m8903j3685K8410K1534
6554c6808R707R565J112n7212j5552k4396K0869K1938L7607n039L3898N0960j1488
$$ plain form
6638 9522 31666 -35870 -72354 -89114 -93787 -6261 59031 90051 28098 -29667 -10509 10900
6626 10900 20270 59260 37927 30803 65967 86655 60174 21472 38458 85109 162437 160468
6614 160468 117884 65950 55372 40937 70703 129644 136607 98283 60477 35609 45602 6759
6602 6759 -24642 44419 81318 76745 40655 65906 130027 107525 46555 38279 61251 48081
6590 48081 -33633 -61726 -73180 -105941 -74262 -20542 3738 96726 103140 144224 81497 32361
6578 32361 63587 84694 25862 27265 114566 79023 39539 60822 50736 6100 -8655 17626
6566 17626 4686 -92060 -147897 -101614 -25772 15795 -36749 -24164 -73067 -86752 -58342 -36808
6554 -36808 -27101 -17536 -16424 -73636 -89188 -113584 -92715 -70777 -33170 -38209 -4311 46649 35161
6541C5161j9627N443l0779q908k8678l4464k8111L9034J6193j2713m560l5972
6529a07981j112O4029k2154j0462O3724l1407K7226k2084L4980L0193L775m7580
6517a8853j3294j5362O627K6795j7431L142l474J3133M1573j8614n3617j00388
6505a49763L0081M9448L23M405K2406l7519l2259l8214L2774Q2802M3802k6425
6493a8139l413q413l464K377O4942N2129l1662j2049l425m3458k1515o3722Q718
6480h1094K5689n0253m8150P1781L3794l0065L1581J4004m6916K79j0601J726
6468h8225k964O5382M650n5547n508L032P171k0923P7060Q068n8579K6361N5163
6455A5141J6581n6955j2217L1210M4797J3285L069l8416K0612P473L2660p4719
$$ plain form
6541 35161 15534 20977 -9802 -18710 -47388 -81852 -109963 -70929 -54736 -67449 -72009 -107981
6529 -107981 -109093 -45064 -67218 -77680 -13956 -45363 -18137 -40221 -5241 24952 28727 -18853
6517 -18853 -32147 -47509 -40882 -14087 -31518 -28376 -31850 -18717 22856 4242 -49375 -149763
6505 -149763 -119682 -70234 -69911 -65506 -43100 -80619 -112878 -151092 -118318 -35516 8286 -18139
6493 -18139 -21552 -29965 -33429 -31052 33890 86019 54357 42308 38883 -4575 -26090 -89812 -81094
6480 -81094 -55405 -105658 -153808 -82027 -48233 -78298 -46717 -32713 -79629 -79350 -89951 -88225
6468 -88225 -91189 -25807 -21157 -76704 -82212 -79180 -72009 -92932 -15872 -7804 -66383 -40022 15141
6455 15141 31722 -25233 -37450 -6240 38557 51842 54911 16495 37107 44580 77240 2521
6443B521q5084l28P4119P4673l0172l0362r149k715j1522J6570k1073N3906n7022
6430b5638k0190j3629p4743p286N3985J8156L4505L0842J8943r532j2371J9726
6418A2768m431m5721O03N0568m5464j0490J02824M6973k7869J8028N4727p347
6406A45169k272M3503J0276m3675l8551o6536q4689j4383K8405O9993L3462O623
6394H7325K973j9195q149O2769k5415o1168m1597Q526n913L2263n8653k8891M7943
6381g182P4050l3598j23251l5819J482N7337j0672k578k0122k45J3849N740m7696
6368a28705M0218j3396P75J07139Q381k4727m5912m2490j3372J02865k5643p2207
6356a07074K9235P0753K806n1613m7899j4010L3104R6359K2769M2264m593l3818
$$ plain form
6443 2521 -82563 -82891 -8772 65901 35729 5367 -3782 -6497 -18019 -1449 -22522 31384 -25638
6430 -25638 -45828 -59457 -134200 -141486 -87501 -69345 -34840 -3998 14945 5413 -6958 12768
6418 12768 8337 -37384 -36781 13787 -31677 -42167 60657 107630 79761 97789 152516 145169
6406 145169 142897 186400 196676 153001 114450 47914 -36775 -51158 -22753 47240 80702 87325
6394 87325 90298 71103 62954 125723 100308 39140 -2457 6069 156 32419 -26234 -55125 -7182
6381 -7182 66868 33270 -89981 -125800 -124318 -66981 -77653 -80231 -100353 -100598 -86749 -81009 -128705
6368 -128705 -88487 -101883 -101108 6031 14412 -10315 -56227 -98717 -112089 -9224 -34867 -107074
6356 -107074 -77839 -7086 -4280 -55893 -103792 -117802 -84698 11661 34430 76694 72101 38283
6344C8283M4041m9166l4881k4127n286m531k5534r011j3871j5886N9308M1141
6332D80M2585N2122l7149q8797k2260L2334M6712J3516J4096M192L739o887k538
6319E2145Q2108O7787p5527j19415m2722m4476L0771J16201O3232Q118r8944j9574
6307A9704L4672m499m8865R934l8396m958M5240J2351m1740n0236j5927M2347
6295d0373O7746l0416K2197L2012n4229O221P1332k2808l0054n0211P0033K9792
6283G1242r620L7639K5821o965j3013J4575o0611L3273L9430L5937j3910o3972
6271H9826k6802p3167j1331K5490k7529k1101J8402P2129M2069o4220j05504m1286
6259a23024J6757L7576R0163M6421m3707k5455k1435m4781m9106K8278L7395o8415
$$ plain form
6344 38283 82324 33158 -1723 -25850 -31136 -35667 -61201 -70212 -84083 -99969 -40661 480
6332 480 43065 95187 58038 -30759 -53019 -20685 26027 39543 53639 57831 61570 54683 52145
6319 52145 134253 202040 126513 7098 -35624 -80100 -49329 66872 130104 138222 39278 19704
6307 19704 54376 49877 1012 10946 -27450 -32408 12832 25183 -16557 -66793 -82720 -40373
6295 -40373 27373 -3043 19154 51166 -3063 3158 74490 51682 21628 -28583 41450 71242
6283 71242 61622 99261 125082 118117 105104 119679 59068 92341 131771 167708 153798 89826
6271 89826 63024 -10143 -21474 4016 -23513 -44614 -26212 45917 87986 23766 -81738 -123024
6259 -123024 -106267 -68691 21472 67893 24186 -1269 -22704 -67485 -116591 -88313 -50918 -119333
6247a19333J9081R6781J2447r213k4799P3504P3583L0485K4324k6940l836o6062
6235H0022n0495o6318n1624K5713K3643M255m1293o6081j7916N4345n086k623
6223a13458L7994M372O7282l0478J471P7840L3291j12063k2665R9858K0159m1458
6211B2145J4156q5788M388N0811k913m1033j07956O021O2851K7641j6343r1799
6199a57819K2320L1289L1606N9298k6547k9831J3800O0396R9704M2325q2270r6852
6187c2581o8290N5495K1677l890k754j4865Q5436K3855K1876n9100J5333L692
6175D5884q6663M011J3549J4940N045k6001N5761N4809j1416m2206r1735n1162
6163a15184N1121P3273k7506l2347n403j3785O999P2059l3347J5976L4179L6022
$$ plain form
6247 -119333 -100252 -3471 8976 -237 -25036 48468 122051 152536 176860 149920 146084 80022
6235 80022 29527 -36791 -88415 -62702 -39059 -34804 -76097 -142178 -160094 -105749 -110835 -113458
6223 -113458 -75464 -71092 -3810 -34288 -32817 45023 78314 -33749 -56414 43444 63603 22145
6211 22145 36301 -49487 -45099 5712 2799 -38234 -146190 -140169 -77318 -49677 -66020 -157819
6199 -157819 -135499 -104210 -72604 -13306 -39853 -69684 -55884 4512 104216 146541 64271 -32581
6187 -32581 -100871 -45376 -23699 -27589 -30343 -45208 40228 64083 85959 26859 42192 45884
6175 45884 -40779 -36768 -23219 -8279 -3234 -29235 26526 81335 69919 27713 -64022 -115184
6163 -115184 -64063 9210 -18296 -50643 -56046 -69831 -62832 9227 -24120 -8144 26035 62057
6151F2057M4794k0529m4733k017J7189m9687o5404k3193l121K708P4340l0183
6139c7779J8552M7868m8253j7681L4614l394n5306K3513R8473P1875j0296p5577
6127D6609n3124O093n474K6705K6203l3407p2731m2808J2108N1308K7434n776
6115a6860n5895J3384K4981N348j399k2257Q889J5052J8357L6547n243q255P676
6102B0325N0414m6249m0080L1251L620m0672l4222p7700L1681M423K1539O0228
6090a5442p8043n9208j1717M8110N8576j405j7568n101J3166n3675J5351J27573
6078B0617Q949J9099m6911m0177N0940o542N4001j1863m1216O412k845k8877O677
6065a1736M4847l5200k426O9163M3497p6726K5378J3507n3528L978M9370m4822
$$ plain form
6151 62057 106851 86322 41589 39572 56761 7074 -58330 -81523 -84644 -81936 -7596 -37779
6139 -37779 -19227 28641 -19612 -37293 -2679 -6073 -61379 -37866 60607 132482 122186 46609
6127 46609 -6515 -422 -5896 20809 47012 13605 -59126 -101934 -89826 -38518 -11084 -16860
6115 -16860 -72755 -59371 -34390 -29042 -30441 -52698 -43809 -28757 -10400 26147 20904 12649 20325
6102 20325 70739 24490 -15590 15661 19281 -21391 -55613 -133313 -101632 -97209 -75670 -15442
6090 -15442 -93485 -152693 -164410 -116300 -57724 -59129 -76697 -81798 -68632 -122307 -106956 20617
6078 20617 29566 48665 1754 -38423 12517 5975 59976 48113 6897 13309 10464 -18413 -11736
6065 -11736 33111 -2089 -4515 64648 108145 31419 56797 70304 16776 20754 70124 25302
6053B5302K4338o3620n0943K7789O5812L2418k8260n5348k4751M7370J0458p5833
6041f5268J7372K8249L0276L5673K6524K2555r5850j12256Q671j646M0184O8568
6029C052j3348K5889N5116l4020j2059N8136L8946o7630p0017k2743L016J1017
6017b4645l054L573l8527j3660M7657N6345J7832J9233r5887k2168o2669k4289
6005a40259Q3705K7166J1642k9606m6913l5312l2015L8983Q3767L9276q898j0137
5993a8601L3800K2947J3228O53j2405p3229k8182L3181M4886j9048r781m7078
5981e9629k2809Q5026K0708k1639n1512L9615Q1344J6514q3179l2434J3714k7426
5969d1707j5072M7170m221J612l9104o7655L5375N0178M9450M8789p3834k8064
$$ plain form
6053 25302 49640 -13980 -64923 -37134 28678 61096 32836 -22512 -47263 107 10565 -65268
6041 -65268 -47896 -19647 10629 46302 72826 95381 -469 -112725 -104054 -105700 -65516 3052
6029 3052 -10296 15593 70709 36689 24630 82766 121712 54082 -15935 -38678 -35662 -24645
6017 -24645 -27699 -24126 -62653 -76313 -28656 27689 45521 64754 -31133 -53301 -115970 -140259
6005 -140259 -56554 -29388 -17746 -47352 -94265 -129577 -161592 -122609 -38842 434 -8464 -18601
5993 -18601 15199 38146 51374 52027 39622 -33607 -61789 -28608 16278 -2770 -12551 -59629
5981 -59629 -82438 2588 23296 1657 -49855 -10240 71104 87618 4439 -27995 -14281 -41707
5969 -41707 -56779 -9609 -13830 -12218 -51322 -118977 -83602 -33424 16026 64815 -9019 -37083
5957c7083O211j1501r943Q865L8111k2331k576m7316q2997K3739N6863J7813N0322
5944a1823J698n0441J4696q445K9081N3328j3229j01089l564P8044M9000J4939
5932E2195k1908j8748Q3647Q0048o3620r2957j1776j3665k2801R658Q985l080
5920a4022k9485K2424j9262k4750J7796L9605L2056j3669J3390r3434j4934j0202
5908i4487K103m585L0661K3697q4427j4952N148J09465K4538J6205n2842o8712
5896a08188K7960K1884n8891n642O1901Q06J8332N4646k7412k5264n3789j7002
5884a10659J0555M9818Q9422p0057p0692J17630M5490j5491n104j3988m9814n9528
5872h2418Q136O516j3795P5746Q9510j5918j04871k5140L1608O0000Q547q881
$$ plain form
5957 -37083 -30872 -42373 -52316 -43451 -5340 -27671 -30247 -77563 -160560 -136821 -79958 -62145 -11823
5944 -11823 -10125 -60566 -45870 -54315 -25234 28094 14865 -86224 -89788 -11744 37256 52195
5932 52195 30287 11539 95186 175234 111614 18657 6881 -6784 -29585 -19927 -10942 -14022
5920 -14022 -43507 -21083 -40345 -65095 -47299 -7694 24362 10693 24083 -69351 -84285 -94487
5908 -94487 -92384 -96969 -66308 -42611 -127038 -141990 -136842 -27377 -2839 13366 -39476 -108188
5896 -108188 -80228 -58344 -117235 -122877 -60976 -60170 -41838 12808 -14604 -39868 -93657 -110659
5884 -110659 -100104 -50286 39136 -30921 -101613 16017 61507 46016 40912 26924 -22890 -82418
5872 -82418 -74282 -67766 -81561 -5815 83695 67777 -37094 -62234 -30626 29374 37921 29040
5860B9040k9135O1043o9034n8210j2242q910L545M4701P8357o1846L3262L5650
5848D6221L0985k5477l2982k1095J6330J2384k3508J1299L2048p412l1696o0836
5836e3739O28o687R896P1581L6650p034j8392m2921P350q659L8973L484j6210
5823A4920N5669J8269n1398j2581K1670r546m983p4661j3734m5781L9193P4684
5811A1721k0985L0744j5566m7220l4173J5633N502l2922L5253O9237j0472K1892
5799B8644O6290j8056L8288q1087j9616O7109l7821n0495m6028O5250J10034K268
5787A24780o2521l3846k5931o4205k6743L4566M2595M9013m502q7119o628L9397
5775b1144J6048L0116j3220q2691p2222j7741J6109O1327J24280l214o9326p2221
$$ plain form
5860 29040 -95 60948 -8086 -66296 -78538 -87448 -83903 -39202 39155 -22691 10571 46221
5848 46221 77206 51729 18747 -2348 13982 26366 2858 14157 46205 38793 7097 -53739
5836 -53739 -53111 -59798 -49902 21679 58329 51295 32903 -10018 -2668 -11327 27646 31130 14920
5823 14920 70589 88858 37460 24879 46549 37003 32020 -42641 -56375 -102156 -62963 11721
5811 11721 -9264 21480 5914 -41306 -75479 -59846 -54344 -87266 -52013 17224 6752 28644
5799 28644 94934 76878 115166 34079 14463 81572 43751 -6744 -52772 12478 122512 124780
5787 124780 62259 28413 2482 -61723 -88466 -53900 -11305 37708 33206 -53913 -60541 -21144
5775 -21144 -5096 25020 11800 -70891 -143113 -160854 -144745 -83418 40862 37648 -31678 -103899
5763a03899p307O3821Q643p4725j1050M0937j2185k5649M3168J3042K8340J8637
5751a8227L5839q220k1257k3030l7546J3702j214l5085l7448K5727m651O2416
5739d8994M4507m2108K7420k5840K2159N2747k2416j20380m5450N9688M4842N2151
5727a674k8706K9648P5215J7962J5475k6755o849l0382p728J3848K270l0883l648
5714A7793m3123K102K3127o4391j9544j2414m2741K4109Q274l9556K5261J4315
5702a06788K0451K0013K087q4511m5754P3661J41233J4932r188L1867l9865l9142
5690b1004l1426N867L9786Q978M511L2534m8013l5473R169J6975O4431M259L7595
5677H8189l1300K872J4693K2604L4441q1214j2416n2077n7844J7622p468K1363
$$ plain form
5763 -103899 -111206 -47385 -38742 -113467 -124517 -83580 -95765 -121414 -78246 -65204 -36864 -18227
5751 -18227 17612 9392 -11865 -34895 -72441 -58739 -59953 -95038 -132486 -106759 -111410 -48994
5739 -48994 -4487 -46595 -19175 -45015 -22856 29891 7475 -112905 -158355 -98667 -53825 -1674
5727 -1674 -30380 -732 74483 92445 107920 81165 74316 43934 36206 50054 52324 21441 17793
5714 17793 -25330 -23228 -101 -64492 -84036 -96450 -139191 -115082 -106808 -146364 -121103 -106788
5702 -106788 -86337 -66324 -64237 -148748 -194502 -120841 20392 35324 26136 58003 18138 -21004
5690 -21004 -52430 -46563 -6777 2201 6712 39246 -8767 -44240 -35071 -18096 46335 50594 88189
5677 88189 56889 59761 74454 97058 131499 50285 37869 -14208 -72052 -54430 -61898 -40535
5665d0535m6753r4327K0699K8608l1870l9480L8739L5044k4881n478J4984j0304
5653a55554q074K2671P6239L8199K5611j5147j8152j5427k980O1133L7520j10496
5641f4457o9107N1568L8403M9157P6712k0452j3486N034M214n544J9447q186j1732
5628E1571Q254l7736m0797K8843N2833M6042m9187o0339k2116J8530N8740J9270
5616G3908M5494N1807n5417m8286j3329P032k3324q024j7593J0210o4782L118
5604c9186k6042M8207P0026j24480P34O0873L696n7116q477L8743l6263l7551
5592a06836r498R1249l0059p5860M6001P3436J9193j3433m5455p9764m0569L3135
5580a38460Q5338K3479m7905l8533o854M9071J03100M9119l6370k6476m0308L4064
$$ plain form
5665 -40535 -87288 -181615 -160916 -132308 -164178 -203658 -164919 -129875 -154756 -160234 -145250 -155554
5653 -155554 -163628 -140957 -64718 -26519 -908 -16055 -34207 -49634 -52614 8519 46039 -64457
5641 -64457 -133564 -81996 -43593 5564 82276 61824 48338 53372 57586 52042 71489 63303 51571
5628 51571 59825 22089 -18708 10135 62968 109010 59823 -516 -22632 -4102 54638 73908
5616 73908 119402 171209 115792 67506 54177 61209 37885 29861 12268 22478 -42304 -39186
5604 -39186 -65228 -17021 53005 -71475 -70741 -9868 -6172 -63288 -71765 -33022 -69285 -106836
5592 -106836 -116334 -25085 -55144 -131004 -85003 -11567 7626 -5807 -51262 -131026 -171595 -138460
5580 -138460 -53122 -29643 -77548 -116081 -122935 -73864 29236 78355 41985 15509 -24799 9265
5568I265N8901l1663k476k3422o4270k300m9374O688M0003L3410L0935r9768m4524
5555a38595J5366J0597L3962L563j3213r434K4377j0325M1917k659k0234m1966
5543a06644K3803R7294l6644p8098K6385M6837J0866N7856J1245p5586q0204J1058
5531i1832j0793O516n11R247K4654o226q162k9107K2836K6773m0401m8353K929
5518a42430l4925m7296N1090N3812Q7139O1463r017L2904p6080J3692L1600p2995
5506e1043o4651o3437o0726K7819R7801Q8401J1108K5425j1757r0000K3313k4910
5494i2657j08745L2958J06983J8704k7394M3420l0302j8510J8284O152K699l7414
5482h5822j4025J067K9251j376o8064l0831K8890O0957L8572L0277k6300m4786
$$ plain form
5568 9265 68166 36503 34027 10605 -53665 -55965 -105339 -98651 -58648 -25238 5697 -94071 -138595
5555 -138595 -123229 -112632 -78670 -75107 -88320 -97754 -73377 -83702 -41785 -44444 -64678 -106644
5543 -106644 -82841 14453 -22191 -100289 -73904 -27067 -16201 41655 52900 -22686 -102890 -91832
5531 -91832 -102625 -96109 -96620 -87373 -62719 -68945 -77107 -106214 -83378 -56605 -97006 -145359 -142430
5518 -142430 -177355 -224651 -173561 -119749 -32610 28853 19836 52740 -23340 -9648 21952 -51043
5506 -51043 -115694 -179131 -239857 -212038 -114237 -25836 -14728 10697 -1060 -91060 -67747 -92657
5494 -92657 -201402 -168444 -61461 -42757 -70151 -26731 -57033 -75543 -57259 -51107 -48408 -85822
5482 -85822 -99847 -98780 -69529 -70905 -138969 -169800 -140910 -79953 -41381 -11104 -37404 -82190
5470h2190K9898J45763m5344n6392k9415r8163J8716n379N046K3091N9537Q761
5458b6071l8888K6114P3971k879n0356r6857N2226P6230l2840l4382O940L7856
5446h936j221l7969n9140Q5991O0091k7058m007k7183m6577k1221o363L0873l8760
5433a01480m2600K2708O4970L4528O0180q2211m1222L5396O2091Q0905k4035p7777
5421h547l9428n1601n8477J0795L0414K7379N4114k1693k1028O107L3001K1333
5409a7631o397k1788l1862J4530j9518Q929K0525k2831K3916n1965Q654O4428
5397c1010R1974K6158j6971K5871K0050l6993q1666r005M8993J586N2311n924
5385H5374L695r9194n8614k7247M6562j3864m154P1830Q1121J9823l5606m1548
$$ plain form
5470 -82190 -52292 93471 48127 -8265 -37680 -135843 -117127 -122506 -117460 -94369 -34832 -26071
5458 -26071 -64959 -38845 35126 32247 -18109 -114966 -62740 13490 -19350 -53732 -46792 -8936
5446 -8936 -10157 -48126 -107266 -21275 38816 11758 7751 -19432 -66009 -87230 -93593 -62720 -101480
5433 -101480 -144080 -121372 -56402 -21874 38306 -43905 -85127 -49731 12360 93265 69230 -8547
5421 -8547 -47975 -99576 -158053 -147258 -116844 -89465 -35351 -57044 -78072 -71965 -38964 -17631
5409 -17631 -24028 -45816 -77678 -63148 -82666 -73737 -53212 -76043 -52127 -104092 -95438 -31010
5397 -31010 60964 87122 70151 96022 116072 79079 -2587 -11592 37401 38987 91298 85374
5385 85374 89069 -10125 -68739 -95986 -49424 -63288 -67442 4388 85509 105332 69726 28178
5373B8178K7057j0933m5245j9715p466J6985n8325j6955N7842M2178J0791M285
5361B8677K2986l5776k2790j6003m2638K8254N8327J6626J6251j0852M698r591
5349C8169p1324L3259j839k1227L6162j3570m165K500K6919j2572j6892q1476
5337h6056o1271M1474N3699Q8069j9768L2546j5245k9442M2267L6394K3008k8616
5325G7059n0297m8177K7409O7590J59K2270K059J3834m2766n574q640N6766k3671
5312H8021m5434l7775m5254L0709K0716m6181J1475M5470k1263n1469m3152L6103
5300e8034N5520M7564R9693m8451o1735o0925M0615M1174L7477O5837J9374j05583
5288G2526m103l3001M356M0260L3967K725m6586j234Q294J8689l7434k2642m2885
$$ plain form
5373 28178 55235 44302 -943 -20658 -28124 -11139 -69464 -86419 -28577 13601 24392 28677
5361 28677 51663 15887 -6903 -22906 -65544 -37290 21037 37663 53914 43062 47760 38169
5349 38169 -33155 104 -1735 -22962 13200 -370 -4535 -2035 24884 12312 -4580 -86056
5337 -86056 -147327 -105853 -52154 35915 16147 48693 33448 4006 46273 82667 105675 77059
5325 77059 26762 -21415 5994 73584 73743 96013 98072 111906 69140 63566 54926 111692 88021
5312 88021 42587 4812 -40442 -9733 10983 -35198 -23723 21747 484 -50985 -94137 -58034
5300 -58034 -2514 45050 144743 96292 34557 -26368 14247 55421 92898 158735 178109 72526
5288 72526 68423 35422 39778 80038 114005 116730 70144 68910 77204 95893 58459 35817 -7068
5275g068m4081J1568P8724J8607o0147p1793l3736m2260o3555N0196J63123M3373
5263D2951N7180o230P391J3206j6293p7747p3437q721P570J539n4619m9404l1457
5250a88071Q2876R6353M6665O387j5140j9280J188l4099P0775L2573n9068n2649
5238c1490j1940P1376L2754Q160J1366l8726m6268j20144J6492N6860N9036l9844
5226c2368j4580L6599Q561k1383m0179r200J477N03M8570K8027k812p617j3195
5213a7597M1476N2088k7328o250l9302J7309O444l7743P773N2921k7722K6911
5201D8980k022l5451L6306M4612L5228Q6369O6198j00718j14880J6397j4550j00064
5189c3595j1954M5199P585Q028N1018M198o6740K0555N0839O1514L9338l4403
$$ plain form
5275 -7068 -51149 -39581 39143 57750 -2397 -74190 -107926 -150186 -213741 -163545 -422 42951
5263 42951 100131 93901 101292 114498 98205 20458 -52979 -61700 -54130 -52591 -107210 -156614 -188071
5250 -188071 -105195 -8842 37823 44210 29070 9790 10978 -23121 47654 80227 21159 -31490
5238 -31490 -43430 27946 60700 68860 80226 41500 -4768 -124912 -108420 -51560 7476 -32368
5226 -32368 -46948 -10349 -1788 -23171 -63350 -72550 -71073 -70570 -22000 6027 3215 -4402 -17597
5213 -17597 23879 75967 48639 42389 3087 20396 26840 -10903 -3130 49791 22069 48980
5201 48980 46958 11507 47813 92425 127653 214022 280220 179502 64622 81019 66469 -33595
5189 -33595 -45549 -350 7235 15263 66281 70479 3739 24294 75133 136647 175985 141582
5177A41582r879M4811k854l9925n1479r2175o4705K6122j3933o7831N6920N7078
5165a6268J6028M393M8213J566K0098n4270n7321p173o645J4459J9701Q8612K3421
5152I4814M3700m7780n6491J3815Q613q178k6186k5268J0249q1772N889o067J8532
5139e6130Q6522K91m6652n512m5040l809j5722P3711J0228M277L6548M3457k850
5126G9319o4680l29M8437k5423n9438M287J2769o7523J2721P033R268N696m4666
5113h2529L04M6970L4372J3030M6M9553l615l8026J0933k611k8313o7900o6345
5100a34131L1664J8253K9509P0705K3481n6571j5660n038p09M0150j8298K4823
5088H178m7079k6289J2681M1066K7210O732k8406j7455j14012n0043M3723M5993
$$ plain form
5177 141582 131703 176514 173660 133735 82256 -9919 -74624 -48502 -62435 -130266 -73346 -16268
5165 -16268 -240 4153 52366 53932 74030 19760 -37561 -44734 -51379 -36920 -17219 71393 94814
5152 94814 138514 90734 34243 48058 56671 48493 22307 -2961 7288 -74484 -68595 -74662 -56130
5139 -56130 30392 30683 -15969 -21481 -66521 -70330 -86052 -12341 -2113 2164 38712 82169 79319
5126 79319 14639 14310 62747 37324 -22114 -17827 -5058 -72581 -59860 -52827 -43559 -37863 -82529
5113 -82529 -82225 -35255 -883 12147 12193 61746 58131 20105 31038 28427 114 -67786 -134131
5100 -134131 -102467 -84214 -54705 16000 39481 -17090 -32750 -37788 -38497 1653 -16645 8178
5088 8178 -38901 -65190 -52509 -11443 15767 22499 -5907 -23362 -137374 -187417 -143694 -97701
5076i7701K3543o2870J2455P4418P4779N9988R57p996m6151j7146l073J0401o0854
5063c9250R521j6270p44m6306n4977N4751R0816q36l302j0611j8931J6082L836
5050a6221m4182M170L9825J2006m728K6373k1061k719J6386l4090m0175n3702
5038a18118K8417L3055J6901K2198l2030j0397P617K4925L708l002l3243M2295
5026a7674l1236o3337M3555J1172l0030J815r076L8894j3277R725J7015Q0521
5014C8067N3172p1737n7358K6927J0303l058j4790K4237K5980m4461q7548O4088
5002c6178L1793l1236m5343l7926M0976m1871j8210N0985Q9592N4643n0199n7436
4990e0410J1041j7672J0390L6541o2395J3985j8482K0760N6171N2580o4368M327
$$ plain form
5076 -97701 -74158 -137028 -124573 -50155 24624 84612 85569 77573 31422 14276 11203 21604 -39250
5063 -39250 -29729 -45999 -46743 -93049 -148026 -93275 -2459 -3295 -6597 -17208 -36139 -20057 -16221
5050 -16221 -60403 -56233 -16408 -4402 -9130 17243 -3818 -6537 9849 -24241 -64416 -118118
5038 -118118 -89701 -56646 -39745 -17547 -49577 -59974 -52357 -27432 -23724 -26726 -59969 -17674
5026 -17674 -48910 -112247 -68692 -57520 -87550 -85735 -94811 -55917 -69194 -59469 -42454 38067
5014 38067 91239 19502 -37856 -10929 -626 -3684 -18474 5763 31743 -12718 -100266 -36178
5002 -36178 -4385 -35621 -80964 -118890 -77914 -119785 -137995 -87010 2582 57225 7026 -50410
4990 -50410 -39369 -57041 -46651 -10110 -72505 -58520 -77002 -56242 -71 52509 -11859 -7532
4978g532O5046L2008J4337n2444n5584K6168k2203l1139o3978l9769M8731K1170
4966f5189m2303J636J2624o4382m6030J01519L4097L1379l655M0248J0914l9135
4954b8277o1601K192R4336N6571n175m3125J2546J7321n1922n4392o831P3676
4942E319n2359K6656K6740K0827J8758J2859k8700o1384m13K6925j0094k80o9012
4929h4158n2441N4473p611N0765Q8246K6805P321m6137j02654m0653O2018K1813
4917b2213L0129R426l5599K5109l0811m0152J6412K6267j8714K3559K1236N5248
4905E9897o4181O337q946j09227O5877K2499q9466L6021J05246k5738n9962J4718
4893d6925L6263k3128K1380j1455r6196J2393L1343O7948k7197P60P7782N1473
$$ plain form
4978 -7532 57514 89522 103859 51415 -4169 21999 -204 -31343 -95321 -135090 -86359 -65189
4966 -65189 -107492 -105856 -93232 -157614 -203644 -102125 -68028 -36649 -40304 -56 10858 -28277
4954 -28277 -89878 -87686 6650 63221 58046 14921 27467 44788 -7134 -61526 -68357 5319
4942 5319 -47040 -20384 6356 27183 45941 58800 30100 -31284 -31697 -4772 -14866 -15146 -84158
4929 -84158 -136599 -82126 -89737 -38972 49274 76079 83400 37263 -65391 -106044 -44026 -22213
4917 -22213 7916 17342 -18257 6852 -23959 -64111 -47699 -21432 -40146 -16587 4649 59897
4905 59897 -4284 2053 -6893 -116120 -50243 -27744 -117210 -81189 24057 -1681 -61643 -46925
4893 -46925 -10662 -33790 -12410 -23865 -120061 -107668 -76325 -8377 -35574 -34814 42968 94441
4881I4441j9801j9679o1198q2007n0006L9639J7746O96n8878R155J3805L9682
4869g6405K1850l0877j7570k8438N8229k7046m7574L8367L6097J901k3892M3079
4857e2279K0489r906r044k3506O657M0142M5907J2929o8856p2k98P320K5589k1318
4843b6246o1542J2096K3465l3417K1837J9818n821J7174J7760j8534J5599n799
4831b3610N4475Q0754L8340M9783o1519j12829J3539J7891n1293r2341q6856R425
4819a64241J5862Q4230o65K4504j2922o0703K166L1048k4307K2908M7540l7218
4807g1798M6104K6564m7830M004K7340J4568l5199o1252j613R891L8240M0084
4795a0897m5247J9952K0909O8700O6236K1982j9852n9720o0490q9477l0334L5102
$$ plain form
4881 94441 74640 54961 -6237 -88244 -138250 -98611 -80865 -80169 -139047 -129892 -116087 -76405
4869 -76405 -54555 -85432 -103002 -131440 -73211 -100257 -147831 -109464 -73367 -71466 -95358 -52279
4857 -52279 -31790 -41696 -50740 -74246 -67589 -27447 18460 31389 -37467 -37539 -37837 -30517 -4928 -26246
4843 -26246 -87788 -75692 -52227 -85644 -63807 -43989 -49810 -32636 -14876 -33410 -17811 -23610
4831 -23610 30865 111619 149959 199742 138223 25394 38933 56824 5531 -86810 -173666 -164241
4819 -164241 -148379 -64149 -64814 -40310 -53232 -113935 -111769 -80721 -105028 -82120 -34580 -71798
4807 -71798 -25694 870 -46960 -42956 -15616 -1048 -36247 -97499 -99112 -89221 -50981 -10897
4795 -10897 -56144 -36192 -15283 53417 119653 141635 121783 62063 1573 -87904 -118238 -83136
4783h3136N9155O9438K587m212m3627j7676j4865p539r479l6093M4596o670M9693
4770B172j4487L586L5427p078o5395l6578L4710P5550L6234m4182k3931N4584
4758E0612L7984n4233N5276l2141n0882K6317k4046k1308L1932J7642J0974M7050
4746I5177J7033l5258m8393n6971n4059K0008k6064K5074J5282L9289m7029n4897
4734a10808K9374K5410L7688r805k8591J0646M7071l0970l9918k7070Q633Q0061
4722h279M564n0229k5970K4680K7504k6062o1953O2690O4368r778m1924r531N3153
4709C233J3960j7304j2662n6852J8356M523N1980K0103N3490M5643L6557n8761
4697A02266m8091j00543k3354M3989P043l9570N1711J8225n6973o879o7812o6985
$$ plain form
4783 -83136 -23981 45457 48044 43832 205 -17471 -32336 -39875 -49354 -85447 -40851 -47521 2172
4770 2172 -12315 -8729 26698 19620 -45775 -82353 -47643 27907 64141 19959 -3972 50612
4758 50612 88596 34363 89639 57498 6616 32933 8887 -12421 19511 37153 48127 95177
4746 95177 112210 76952 28559 -28412 -82471 -62463 -88527 -63453 -48171 -8882 -55911 -110808
4734 -110808 -81434 -56024 -18336 -28141 -56732 -46086 985 -29985 -69903 -96973 -88340 -8279
4722 -8279 -3715 -53944 -79914 -55234 -27730 -53792 -115745 -53055 11313 1535 -40389 -49920 3233
4709 3233 17193 -111 -12773 -69625 -51269 -46746 5234 25337 78827 124470 161027 102266
4697 102266 54175 -46368 -69722 -25733 -18690 -58260 -6549 11676 -45297 -52176 -119988 -186973
4685a86973J1324O8115M5798L9513l711k7634J7443k6995l9579j6448J2356N6171
4673e0620K7489m0446O5696R8073k1100J7882l1121n8060j5816M5084k6910k0819
4661a0668K9342l3526j915P061n6689n4364K9914O0127l6414L4213K2425p7934
4649h8428r6096J4408L7988K0121O0894N4587L3703k8189j01269r3749L9632Q1247
4637f5151L3218Q5342J04194p8197l4149j1293m9445O6058M3711l1615k7096K9020
4625F4597j3790j8182k7779m4653m8819n1461k479j7108k2580J9452L3924L2662
4613i6216O9198N0931L2463j7049n7334j6186M54j3461o042J5566K9187l533m8892
4600f0914M0063K0876m4693l8063M9424Q453k1954N5723Q3398m5514m4622q09
$$ plain form
4685 -186973 -175649 -107534 -61736 -22223 -25934 -53568 -36125 -63120 -102699 -119147 -106791 -50620
4673 -50620 -23131 -63577 2119 100192 79092 96974 65853 7793 -8023 37061 10151 -10668
4661 -10668 18674 -14852 -16767 -9706 -66395 -120759 -90845 -30718 -67132 -32919 -10494 -88428
4649 -88428 -184524 -170116 -132128 -112007 -51113 3474 37177 8988 -92281 -186030 -146398 -65151
4637 -65151 -31933 53409 157603 79406 45257 33964 -15481 50577 94288 62673 35577 64597
4625 64597 50807 32625 4846 -39807 -88626 -140087 -142566 -159674 -182254 -162802 -128878 -96216
4613 -96216 -27018 23913 56376 39327 -18007 -34193 -33739 -47200 -53242 -37676 -8489 -12022 -60914
4600 -60914 -20851 25 -44668 -82731 -33307 -24854 -46808 8915 92313 46799 2177 1368
4588A368M3354R4112J1274n3521K1632j959l1072q0359j1050Q1966j7719l9027
4576A8999m180J9126K0129N9778L0194k5371p4533l80L1416L8113N7141q7735
4564H2697o0358p7082l2278P3209J4584k7435n4413j2703J7864M1496J0242O7792
4552D3615q121p4044n5768l3110M0545O9590j69O613L4456L1621N7306k5730L2266
4539A19070N6377o5034j7138R799o3488o8835J5175K7839K3907l390L7326n713
4527F5895L533k0836q6633r7993j470J37500j9338k3870J22967o803n1192j0318
4515A1442o2559o1318m205K1986O9510J9482q5368j8830K1864K422J1051N0020
4503b4503P4219J9759m6827N374q7735L2963N4585r930p8881j0091Q4806J1685
$$ plain form
4588 1368 44722 138834 150108 96587 118219 116260 85188 4829 -6221 75745 58026 18999
4576 18999 14819 33945 54074 113852 144046 118675 44142 43762 75178 113291 170432 82697
4564 82697 22339 -54743 -87021 -13812 772 -26663 -81076 -93779 -75915 -34419 -24177 43615
4552 43615 35494 -38550 -94318 -127428 -86883 -17293 -17462 -10849 23607 55228 112534 86804 119070
4539 119070 175447 110413 93275 103074 39586 -29249 -14074 13765 37672 34282 71608 65895
4527 65895 69428 48592 -38041 -136034 -137504 -4 -19342 -43212 79755 72952 21760 11442
4515 11442 -51117 -112435 -116640 -94654 -25144 -5662 -91030 -109860 -87996 -85574 -74523 -24503
4503 -24503 49716 69475 22648 28022 -59713 -26750 27835 17905 -60976 -71067 13739 25424
4491B5424J5090P086m3926p986J2354J6849l9388J2504J05099J7048m4755l8367
4479C7032r404p2451J3160J808j0525L1240K1691k7330j9041j3932J3853K1408
4467a2491m4066K678r6945n014P0458K4526L6668L4763l8046j9055k1011K4872
4455d2663k9416J8177l7649Q2637M0749J2468m8878n662M4590J9240m4280j4701
$$ plain form
4491 25424 40514 47600 3674 -4312 8042 24891 -14497 -1993 103106 120154 75399 37032
4479 37032 27628 -44823 -31663 -29855 -40380 -9140 12551 -14779 -33820 -47752 -33899 -12491
4467 -12491 -56557 -53879 -150824 -155838 -85380 -60854 -24186 10577 -27469 -46524 -67535 -42663
4455 -42663 -72079 -53902 -91551 -8914 31835 44303 -4575 -10237 34353 53593 9313 -5388
$$ [...]
##END NTUPLES=NMR SPECTRUM
##END=
