##TITLE=Analysis number 327856
Compound Code btb 13839
Book Reference 103125
Project Code adrs
Chemist Name jom
##JCAMPDX= 6.0         $$ Bruker NMR JCAMP-DX V2.0
##DATA TYPE= NMR SPECTRUM
##DATA CLASS= NTUPLES
##ORIGIN= Bruker BioSpin GmbH
##OWNER= nmr
$$ XWIN-NMR		Version 3.5
$$ Thu Apr 12 13:20:43 2007 GMT Daylight Time (UT+1h)  MAYBRIDGE\nmr@NMR_250MHZ
##.OBSERVE FREQUENCY= 250.131544655141
##.OBSERVE NUCLEUS= ^1H
##.ACQUISITION MODE= SIMULTANEOUS (DQD)
##.ACQUISITION SCHEME= undefined
##.AVERAGES= 16
##.DIGITISER RES= 18
##SPECTROMETER/DATA SYSTEM= dpx250
##.PULSE SEQUENCE= zg30
##.SOLVENT NAME= CDCl3
##.SHIFT REFERENCE= (INTERNAL, CDCl3, 0, 16.522)
##AUDIT TRAIL= $$ (NUMBER, WHEN, WHO, WHERE, WHAT)
$$ ##TITLE= Audit trail, XWIN-NMR		Version 3.5
$$ ##JCAMPDX= 5.01
$$ ##ORIGIN= Bruker BioSpin GmbH
$$ ##OWNER= nmr
$$ C:\u/data/dgb/nmr/ADRS/1290/pdata/1/auditp.txt
$$ ##AUDIT TRAIL=  $$ (NUMBER, WHEN, WHO, WHERE, WHAT)
(   1,<2007-04-12 13:20:16.53 +100>,<MAYBRIDGE\nmr>,<NMR_250MHZ>,
      <created by zg, POWCHK disabled, PULCHK disabled
       configuration hash MD5:
       49 4B E0 1D 92 C2 6B 37 9F E6 65 BC 52 41 86 1D
       data hash MD5: 64K
       70 97 64 82 4E BA F4 86 1A 67 8E 35 2D F4 C1 AF>)
(   2,<2007-04-12 13:20:33.76 +100>,<MAYBRIDGE\nmr>,<NMR_250MHZ>,
      <Start of raw data processing
       ef LB = 0.3 FT_mod = 6 PKNL = 1 SI = 32K 
       data hash MD5: 32K
       B7 7A 02 0C 79 08 1D 33 85 47 99 75 E7 25 BF 41>)
(   3,<2007-04-12 13:20:35.67 +100>,<MAYBRIDGE\nmr>,<NMR_250MHZ>,
      <apk 
       data hash MD5: 32K
       58 EB 60 89 CD 9E C7 1C 17 B3 D1 36 56 5F 48 FC>)
(   4,<2007-04-12 13:20:36.51 +100>,<MAYBRIDGE\nmr>,<NMR_250MHZ>,
      <abs ABSG = 5 
       data hash MD5: 32K
       C5 99 B7 53 A0 A8 D7 C7 87 63 E9 17 E3 20 D1 59>)
$$ ##END=
$$ 
$$ hash MD5
$$ 78 42 6E F2 3D A9 84 18 39 1C 91 9D A9 18 C3 61
##$RELAX= 
##$RELAX= 
##$RELAX= 
##$RELAX= 
##$RELAX= 
##$RELAX= 
##$RELAX= 
$$ Bruker specific parameters
$$ --------------------------
##$DU= <C:\u>
##$EXPNO= 1290
##$NAME= <ADRS>
##$PROCNO= 1
##$TYPE= <nmr>
##$USER= <dgb>
##$AMP= (0..31)
100 100 100 100 100 100 100 100 100 100 100 100 100 100 100 100 100 100 
100 100 100 100 100 100 100 100 100 100 100 100 100 100 
##$AQSEQ= 0
##$AQ_mod= 3
##$AUNM= <au_zg>
##$AUTOPOS= <23 >
##$BF1= 250.13
##$BF2= 250.13
##$BF3= 250.13
##$BF4= 250.13
##$BF5= 500.13
##$BF6= 500.13
##$BF7= 500.13
##$BF8= 500.13
##$BYTORDA= 1
##$CFDGTYP= 0
##$CFRGTYP= 5
##$CHEMSTR= <none>
##$CNST= (0..31)
1 1 145 1 1 1 1 1 1 1 1 1 1 1 1 1 1 1 1 1 1 1 1 1 1 1 1 1 1 1 1 1 
##$CPDPRG= <>
##$CPDPRG1= <>
##$CPDPRG2= <>
##$CPDPRG3= <>
##$CPDPRG4= <mlev>
##$CPDPRG5= <mlev>
##$CPDPRG6= <mlev>
##$CPDPRG7= <mlev>
##$CPDPRG8= <mlev>
##$CPDPRGB= <>
##$CPDPRGT= <>
##$D= (0..31)
0 1 0 0 0 0 0 0 0 0.06 0 0 0 0 0 0 0.0002 0 0 0 0 0 0 0 0 0 0 0 0 0 0 
0 
##$DATE= 1176380415
##$DBL= (0..7)
120 120 120 120 120 120 120 120 
##$DBP= (0..7)
150 150 150 150 150 150 150 150 
##$DBP07= 0
##$DBPNAM0= <>
##$DBPNAM1= <>
$$ [...]
##$SUBNAM7= <"">
##$SUBNAM8= <"">
##$SUBNAM9= <"">
##$SW= 20.6930455092707
##$SWIBOX= (0..15)
0 0 3 0 0 0 0 0 0 0 0 0 0 0 0 0 
##$SW_h= 5175.983436853
##$TD= 65536
##$TD0= 1
##$TE= 683.16
##$TE2= 300
##$TE3= 300
##$TEG= 300
##$TL= (0..7)
0 120 120 120 120 120 120 120 
##$TP= (0..7)
150 150 150 150 150 150 150 150 
##$TP07= 0
##$TPNAME0= <>
##$TPNAME1= <>
##$TPNAME2= <>
##$TPNAME3= <>
##$TPNAME4= <>
##$TPNAME5= <>
##$TPNAME6= <>
##$TPNAME7= <>
##$TPOAL= (0..7)
0.5 0.5 0.5 0.5 0.5 0.5 0.5 0.5 
##$TPOFFS= (0..7)
0 0 0 0 0 0 0 0 
##$TUNHIN= 0
##$TUNHOUT= 0
##$TUNXOUT= 0
##$USERA1= <user>
##$USERA2= <user>
##$USERA3= <user>
##$USERA4= <user>
##$USERA5= <user>
##$V9= 5
##$VALIST= <valist>
##$VCLIST= <CCCCCCCCCCCCCCC>
##$VD= 0
##$VDLIST= <DDDDDDDDDDDDDDD>
##$VPLIST= <PPPPPPPPPPPPPPP>
##$VTLIST= <TTTTTTTTTTTTTTT>
##$WBST= 1024
##$WBSW= 4
##$XGAIN= (0..3)
0 0 0 0 
##$XL= 0
##$YL= 0
##$YMAX_a= 330918
##$YMIN_a= -451087
##$ZGOPTNS= <>
##$ZL1= 120
##$ZL2= 120
##$ZL3= 120
##$ZL4= 120
##$ABSF1= 16.522
##$ABSF2= -4.171173
##$ABSG= 5
##$ABSL= 3
##$ALPHA= 0
##$AQORDER= 0
##$ASSFAC= 0
##$ASSFACI= 0
##$ASSFACX= 0
##$ASSWID= 0
##$AUNMP= <proc_1d>
##$AZFE= 0.1
##$AZFW= 0.1
##$BCFW= 0
##$BC_mod= 0
##$BYTORDP= 0
##$COROFFS= 0
##$CY= 12.5
##$DATMOD= 1
##$DC= 0
##$DFILT= <>
##$DTYPP= 0
##$F1P= 14.0000005364418
##$F2P= -0.99999901652339
##$FCOR= 0.5
##$FTSIZE= 32768
##$FT_mod= 6
##$GAMMA= 0
##$GB= 0
##$INTBC= 1
##$INTSCL= 1
##$ISEN= 128
##$LB= 0.3
##$LEV0= 0
##$LPBIN= 0
##$MAXI= 10000
##$MC2= 0
##$MEAN= 0
##$ME_mod= 0
##$MI= 0
##$NCOEF= 0
##$NC_proc= -5
##$NLEV= 6
##$NOISF1= 0
##$NOISF2= 0
##$NSP= 0
##$NTH_PI= 0
##$NZP= 0
##$OFFSET= 16.522
##$PC= 1
##$PHC0= 236.7099
##$PHC1= -1.924701
##$PH_mod= 1
##$PKNL= yes
##$PPARMOD= 0
##$PSCAL= 4
##$PSIGN= 0
##$REVERSE= no
##$SF= 250.13
##$SI= 32768
##$SIGF1= 0
##$SIGF2= 0
##$SINO= 400
##$SIOLD= 32768
##$SREGLST= <1H.CDCl3>
##$SSB= 0
##$STSI= 32768
##$STSR= 0
##$SW_p= 5175.98343685301
##$SYMM= 0
##$S_DEV= 0
##$TDeff= 65536
##$TDoff= 0
##$TI= <Analysis number 999999
Compound Code 99
Book Reference 9
Project Code 9>
##$TILT= no
##$TM1= 0
##$TM2= 0
##$TOPLEV= 0
##$USERP1= <user>
##$USERP2= <user>
##$USERP3= <user>
##$USERP4= <user>
##$USERP5= <user>
##$WDW= 1
##$XDIM= 32768
##$YMAX_p= 496085086
##$YMIN_p= -943055
$$ End of Bruker specific parameters
$$ ---------------------------------
##NTUPLES= NMR SPECTRUM
##VAR_NAME=  FREQUENCY,     SPECTRUM/REAL,   SPECTRUM/IMAG
##SYMBOL=    X,             R,               I
##VAR_TYPE=  INDEPENDENT,   DEPENDENT,       DEPENDENT
##VAR_FORM=  AFFN,          ASDF,            ASDF
##VAR_DIM=   32768,         32768,           32768
##UNITS=     HZ,            ARBITRARY UNITS, ARBITRARY UNITS
##FACTOR=    0.157963299565203, 1,           1
##FIRST=     4132.6476996994, 0,             0
##LAST=      -1043.33573715361, 0,           0
##MIN=       -1043.33573715361, -943055,     0
##MAX=       4132.6476996994, 496085086,     0
$$ Real data points
##PAGE= N=1
##DATA TABLE= (X++(R..R)), XYDATA
$$ [...]
$$ plain form
13627 -38822 -16882 -32223 13668 77664 53228 15428 5765 6541 -49510 -37222 -57741 -106068
13615 -106068 -126998 -56748 54845 79458 41887 30937 46469 4390 22312 2287 -10022
13604 -10022 8181 -45546 -39442 -40457 -7284 51968 70651 -12489 -58408 -55642 18195 60925
13592 60925 117340 113183 98132 53607 24401 14961 42804 47750 -1989 -80972 -75407 -3077
13580 -3077 54120 84448 5892 -33671 -25952 -36493 -53164 -41397 -21816 -9179 -42147 -17610
13568 -17610 20684 32425 -6089 -24064 -15906 -27996 -51395 -60199 -69742 -122718 -129296 -108163
13556 -108163 -64734 -62268 -119109 -114307 -41329 26934 30954 -11267 -66860 -89895 -75184 -97624
13544 -97624 -82633 -88469 -89789 -86548 -60082 -64355 -84852 -48883 14024 5506 6083 43629 70439
$$ packed form
13627c8822K1940j5341M5891O3996k4436l7800r663P76n6051J2288k0519m8327
13615a06068k0930P0250J11593K4613l7571j0950J5532m2079J7922k0025j2309
13604a0022J8203n3727O104j015L3173N9252J8683q3140m5919K766P3837M2730
13592F0925N6415m157j5051m4525k9206r440K7843M946m9739p8983N565P2330
13580c077N7197L0328p8556l9563P719j0541j6671J1767J9581J2637l2968K4537
13568a7610L8294J1741l8514j7975Q158j2090k3399q804r543n2976o578K1133
13556a08163M3429K466n6841M802P2978O8263M020m2221n5593k3035J4711k2440
13544i7624J4991n836j320L241K6466m273k0497L5969O2907q518N77L7546K6810
$$ plain form
13531 70439 1378 -60431 -22699 -68313 -96984 -61996 -43346 -11550 -394 -15782 -37849 -43341
13519 -43341 -91535 -138503 -105409 -95633 -74591 -54553 -2841 78867 64432 30532 5660 -27237
13507 -27237 -64127 -80223 -55159 -30992 -39122 -76694 -40401 13144 25498 17197 4973 9275
13495 9275 7997 -9861 -3764 45411 11318 -24464 -3855 3387 -7401 -21455 -49719 -59524 -47383
13482 -47383 -28182 9489 64577 91836 85766 94276 79589 25807 21804 20422 -10533 -39263
13470 -39263 -33867 -31529 -84096 -104566 -64114 -44125 -20021 -16219 -40703 -76224 -100654 -137733
13458 -137733 -98993 778 25996 30334 6613 -12440 -4737 9011 -25128 -11634 -12831 40197
13446 40197 26065 13377 -42900 -38176 -40200 -53289 -15547 190 53100 92353 47751 5207
$$ packed form
13531G0439o9061o1809L7732m5614k8671L4988J8650L1796J1156j5388k2067n492
13519d3341m8194m6968L3094R776K1042K0038N1712Q1708j4435l3900k4872l2897
13507b7237l6890j6096K5064K4167q130l7572L6293N3545J2354q301j2224M302
13495I275j278j7858O097M9175l4093l5782K0609P242j0788j4054k8264r805J2141
13482d7383J9201L7671N5088K7259o070Q510j4687n3782m003j382l0955k8730
13470c9263N396K338n2567k0470M0452J9989K4104L802k4484l5521k4430l7079
13458a37733L8740R9771K5218M338k3721j9053P703J3748l4139J3494j197N3028
13446D0197j4132j2688n6277M724k024j3089L7742J5737N2910L9253m4602m2544
$$ plain form
13434 5207 -20637 -34002 -17741 32834 27485 54744 11206 -9111 5219 35437 31915 -38320
13422 -38320 -21610 32635 -582 -19768 -31482 -14606 1203 41679 65098 39878 44187 28369
13410 28369 21589 9490 -4058 -14992 -4789 54 -2432 30865 58965 23396 -22326 -41986
13398 -41986 -39710 -57093 -48265 -8810 -14311 -19466 -60427 -6771 -22937 -49948 -91943 -92450 -71766
13385 -71766 -45539 -54524 -71625 -65456 -104560 -83343 -51099 -18735 2252 -10969 -74419 -143420
13373 -143420 -106987 -89264 -79029 -68569 -41111 -27607 -11438 -80266 -71944 -34960 -22109 6189
13361 6189 29347 21928 45706 46317 74177 50500 -19849 -67018 -59368 -34537 10381 -26992 -15192
13348 -15192 41827 39255 -17537 -30224 -37703 -12105 -11212 18763 57359 43361 10848 -13098
$$ packed form
13434E207k5844j3365J6261N0575n349K7259m3538k0317J4330L0218l522p0235
13422c8320J6710N4245l3217j9186j1714J6876J5809M0476K3419k5220M309j5818
13410B8369o780j2099j3548j0934J0203M843k486L3297K8100l5569m5722j9660
13398d1986K276j7383Q828L9455n501n155m0961N3656j6166k7011m1995n07K0684
13385g1766K6227q985j7101O169l9104K1217L2244L2364K0987j3221o3450o9001
13373a43420L6433J7723J0235J0460K7458J3504J6169o8828Q322L6984J2851K8298
13361F189K3158p419K3778O11K7860k3677p0349m7169P650K4831M4918l7373J1800
13348a5192N7019k572n6792j2687p479K5598Q93K9975L8596j3998l2513k3946
$$ plain form
13336 -13098 -46993 -106632 -122364 -84982 -48695 -77847 -42407 -14220 -74541 -31559 7467 -410
13324 -410 23824 44180 18359 -18146 4362 -518 30072 47511 34279 47488 42754 -60471
13312 -60471 -82413 -22089 -23862 -42472 -37427 26616 23539 61241 24993 -17660 -25636 -28920 -33472
13299 -33472 -98066 -91176 -63569 -29576 -16397 -14201 -3210 747 -14106 -20934 36599 24560
13287 24560 7976 16695 -66348 -91222 -136675 -108836 -124003 -84543 -72561 -50459 -60789 -87793
13275 -87793 -92686 -83894 -47354 -84736 -79993 -82094 -68982 -56771 -87093 -97550 -47804 -37200
13263 -37200 -29929 -44900 -34494 -72386 -86230 -59575 -18486 -670 -4730 18336 -6183 -54395
13251 -54395 -82701 -58934 -67999 -78267 -94118 -109144 -77416 -68390 -62935 4912 73335 42891
$$ packed form
13336a3098l3895n9639j5732L7382L6287k9152L5440K8187o0321M2982L9026p877
13324d10K4234K0356k5821l6505K2508m880L0590J7439j3232J3209m734j03225
13312f0471k1942O0324j773j8610N045O4043l077L7702l6248m2653p976l284m552
13299c3472o4594O890K7607L3993J3179K196J0991L957j4853o828N7533j2039
13287B4560j6584Q719q3043k4874m5453K7839j5167L9460J1982K2102j0330k7004
13275h7793m893Q792L6540l7382M743k101J3112J2211l0322j0457M9746J0604
13263c7200P271j4971J0406l7892j3844K6655M1089J7816m060K3066k4519m8212
13251e4395k8306K3767r065j0268j5851j5026L1728R026N455O7847O8423l0444
$$ plain form
13239 42891 17627 -40317 -83040 -42841 -31349 -20646 4587 -40537 -45639 -4218 85335 72270
13227 72270 73931 47406 79358 69309 37282 50026 66500 49738 -48388 -131933 -81262 -3834
13215 -3834 -7392 -59759 -81747 -20652 36873 50899 11173 -813 20400 -10293 -17126 1323
13203 1323 -3764 -52202 -39139 9860 25389 4604 -2977 -8916 67396 111595 44302 -2055
13191 -2055 -5853 -10786 24638 58850 63408 66472 45605 24993 33007 26536 -43508 -110953 -80243
13178 -80243 -89155 -139845 -125128 -25278 38112 33407 39234 41189 21962 76304 75600 3860 -18771
13165 -18771 -2529 71836 87623 97772 80378 81868 63713 81317 133599 110552 54534 27207
13153 27207 -17308 -70644 -29341 17335 -24015 -59513 13628 12584 45384 107675 98953 74205
$$ packed form
13239D2891k5264n7944m2723M0199J1492J0703K5233m5124n102M1421Q9553j3065
13227G2270J661k6525L1952j0049l2027J2744J6474j6762r8126q3545N0671P7428
13215c834l558n2367k1988O1095N7525J4026l9726j1986K1213l0693o833J8449
13203A323n087m8438J3063M8999J5529k0785p581n939P6312M4199o7293m6357
13191b055l798m933L5424L4212M558L064k0867k0612Q014o471p0044o7445L0710
13178h0243q912n0690J4717R9850O3390m705N827J955j9227N4342p04p1740k2631
13165a8771J6242P4365J5787J0149j7394J490j8155J7604N2282k3047n6018k7327
13153B7207m4515n3336M1303M6676m1350l5498P3141j044L2800O2291q722k4748
$$ plain form
13141 74205 78023 103282 143909 103538 42839 27216 47717 55818 36128 -2721 30693 62369
13129 62369 64246 77996 138060 107470 83574 89316 96041 136546 104825 45858 57190 79938
13117 79938 58023 35218 30000 42299 114867 150966 198325 173968 135411 115657 146727 163666
13105 163666 160293 109373 62595 36327 19063 37240 86529 105090 78779 77544 117327 112086
13093 112086 97063 78842 113088 175616 164802 181478 194810 227260 261665 230748 200969
13082 200969 201042 259088 258681 270018 215583 161658 155912 117086 75911 99675 133107 163885 148833
13069 148833 180802 236060 242300 271569 273959 193371 118343 108609 94641 98694 121343 62007
13057 62007 68261 48555 67318 54991 110538 164642 169620 229056 196424 241364 230165 181886
$$ packed form
13141G4205L818K5259M0627m0371o0699j5623K0501Q101j9690l8849L3414L1676
13129F2369J877J3750O0064l0590k3896N742O725M0505l1721n8967J1332K2748
13117G9938k1915k2805n218J2299P2568L6099M7359k4357l8557j9754L1070J6939
13105A63666l373n0920m6778k6268j7264J8177M9289J8561k6311j235L9783n241
13093A12086j5023j8221L4246O2528j0814J6676J3332L2450L4405l0917k9779
13082B00969P3N8046m07J1337n4435n3925n746l8826m1175K3764L3432L0778j5052
13069A48833L1969N5258O240K9269K390q0588p5028r734j3968M053K2649n9336
13057F2007O254j9706J8763j2327N5547N4104M978N9436l2632M4940j1199m8279
$$ plain form
13045 181886 185003 188229 179447 230866 232402 265553 302726 306240 289342 282488 263351 232715 187149
13032 187149 187341 208586 244929 266463 268229 241986 221008 219457 221982 244122 230429 249630
13020 249630 237931 220542 191009 187590 137295 137017 117649 156963 186809 191045 187545 152820
13008 152820 136155 135575 190484 229805 268030 252080 253342 297956 309606 271980 217573 220527
12996 220527 233775 236885 249180 264176 246875 217833 266146 275067 238470 214149 153234 170883
12984 170883 145123 194185 195214 141784 128552 110976 103679 62876 52295 105137 116219 32785
12972 32785 35931 85666 54482 66374 65215 81681 151759 203385 203264 187546 131084 118199
12960 118199 162409 179461 162999 170360 212415 268051 250347 224097 184391 151722 141103 77567
$$ packed form
13045A81886L117L226q782N1419J536L3151L7173L514j6898o854j9137l0636m5566
13032A87149J92K1245L6343K1534J766k6243k0978j551K525K2140j3693J9201
13020B49630j1699j7389k9533l419n0295k78j9368L9314K9846M236l500l4725
13008A52820j6665n80N4909L9321L8225j5950J262M4614J1650l7626n4407K954
12996B20527J3248L110J2295J4996j7301k9042M8313Q921l6597k4321o0915J7649
12984A70883k5760M9062J029n3430j3232j7576p297m0803j0581N2842J1082q3434
12972C2785L146M9735l1184J1892j159J6466P0078N1626j21j5718n6462j2885
12960A18199M4210J7052j6462P361M2055N5636j7704k6250l9706l2669j0619o3536
$$ plain form
12948 77567 66694 74551 139189 158592 98267 74750 146147 132419 64668 3106 50687 94006
12936 94006 98009 49724 58673 72732 67639 37634 15769 23174 -7050 -33709 6726 79042
12924 79042 59863 104589 110705 82390 32896 49982 94980 70511 57553 14288 25924 86880
12912 86880 88951 51273 6288 23969 43352 59833 68630 103498 110428 66002 51252 86105
12900 86105 91596 131012 136919 99867 43245 1951 35430 80461 98792 139528 167159 134448
12888 134448 105361 48203 60865 51221 32036 81471 173271 153905 53612 16891 119278
12877 119278 93502 47599 2349 3917 -11205 40971 62548 67052 50781 99984 94135 34438
12865 34438 21119 104763 149420 132852 129653 181514 170227 152158 160057 131042 115297 116421
$$ packed form
12948G7567j0873P857O4638J9403o0325k3517P1397j3728o7751o1562M7581M3319
12936I4006M003m8285Q949J4059n093l0005k1865P405l0224k6659M0435P2316
12924G9042j9179M4726O116k8315m9494J7086M4998k4469j2958m3265J1636O0956
12912H6880K071l7678m4985J7681J9383J6481Q797L4868O930m4426j4750L4853
12900H6105N491L9416N907l7052n6622m1294L3479M5031J8331M0736K7631l2711
12888A34448k9087n7158J2662r644j9185M9435R1800j9366j00293l6721J02387
12877A19278k5776m5903m5250J568j5122N2176K1577M504j6271M9203n849n9697
12865C4438j3319Q3644M4657j6568l199N1861j1287j8069P899k9015j5745J124
$$ plain form
12853 116421 127119 131600 94298 146330 180177 203911 177505 109270 121470 154610 153176 138782
12841 138782 164254 198568 234568 183024 138270 133301 101427 138419 162617 159451 93064 22670
12829 22670 85999 105853 111232 100427 107988 95352 135017 200477 193118 127484 125722 179917
12817 179917 194906 216651 265884 251285 274457 290458 297711 281105 227547 258190 236758 231340
12805 231340 240948 176970 145366 173219 180262 223249 268509 258209 207232 191729 177719 140529
12793 140529 140193 186865 216145 270170 298576 263596 237781 207576 177682 244122 242642 232308
12781 232308 218798 237878 262660 263399 274845 321798 357655 367876 422338 446832 421573 434754
12769 434754 456163 454009 444212 438457 513218 535558 616528 663388 681111 645368 683794 764572
$$ packed form
12853A16421J0698M481l7302N2032L3847K3734k6406o8235J2200L3140j434j4394
12841A38782K5472L4314L6000n1544m4754m969l1874L6992K4198l166o6387p0394
12829B2670O3329J9854N379j0805P561j2636L9665O5460p359o5634j762N4195
12817A79917J4989K1745M9233j4599K3172J6001P253j6606n3558L0643k1432n418
12805B31340R608o3978l1604K7853P043M2987M5260j0300n0977j5503j4010l7190
12793A40529l36M6672K9280N4025K8406l4980k5815l0205k9894O6440j480j0334
12781B32308j3510J9080K4782P39J1446M6953L5857J0221N4462K4494k5259J3181
12769D34754K1409k154r797n755P4761K2340Q0970M6860J7723l5743L8426Q0778
$$ plain form
12757 764572 786543 901591 1030461 1079650 1151883 1267308 1403351 1578780 1879116 2192023
12747 2192023 2530284 2896945 3246750 3613861 3908288 3948421 3790826 3458369 3140288 2842048
12737 2842048 2551898 2275519 2080733 2016963 1945561 1878136 1871622 1823015 1817112 1818062 1820385 1892711
12725 1892711 1937533 1949081 2047542 2150631 2262926 2356997 2519423 2710697 2941226 3201495
12715 3201495 3510265 3929788 4438729 5000029 5565726 6133286 6653267 7111158 7374152
12706 7374152 7526342 7797682 8242634 8702128 9149286 9549476 9728393 9632029 9433610 9188896
12696 9188896 8778801 8193185 7553344 6966968 6490220 6102409 5877438 5778543 5820016 5932697
12686 5932697 6186454 6562444 7003183 7599269 8302033 9258247 10542880 12028207 13707865
$$ packed form
12757G64572K1971J15048J28870M9189P2233J15425J36043J75429L00336L12907
12747B192023L38261L66661L49805L67111K94427M0133j57595l32457l18081k98240
12737B842048k90150k76379j94786o3770p1402o7425o514m8607n903R50K323P2326
12725A892711M4822J1548R8461J03089J12295R4071J62426J91274K30529K60269
12715C201495L08770M19523N08941N61300N65697N67560N19981M57891K62994
12706G374152J52190K71340M44952M59494M47158M00190J78917r6364j98419k44714
12696I188896m10095n85616o39841n86376m76748l87811k24971r8895M1473J12681
12686E932697K53757L75990M40739N96086P02764R56214J284633J485327J679658
$$ plain form
12677 13707865 15398934 16830056 17743317 18015486 17663086 17009136 16343197 15948778 15879346
12668 15879346 15898010 15920048 15873437 15634713 15346001 15089772 14789949 14456841 14136278 13885770
12658 13885770 13815990 13876713 13923021 13908591 13784520 13561210 13268348 13112631 13186080 13530151
12648 13530151 14161336 15039135 16242089 17745115 19626314 21563950 23399595 24999454
12640 24999454 26171488 27006454 27808364 28895049 30360383 32098008 33769969 35123863
12632 35123863 36005935 36352663 36357878 35967782 35032038 33714763 32470916 31640691 31391953
12623 31391953 31730539 32257823 32630128 32449601 31510167 29797346 27650956 25554205 23780655
12614 23780655 22398526 21444264 20890289 20630895 20679554 20942546 21536419 22456248 23639183
$$ packed form
12677A3707865J691069J431122R13261K72169l52400o53950o65939l94419o9432
12668A5879346J8664K2038m6611k38724k88712k56229k99823l33108l20563k50508
12658A3885770o9780O0723M6308j4430j24071k23310k92862j55717P3449L44071
12648A3530151O31185Q77799J202954J503026J881199J937636J835645J599859
12640B4999454J172034Q34966Q01910J086685J465334J737625J671961J353894
12632C5123863Q82072L46728N215l90096r35744j317275j243847q30225k48738
12623C1391953L38586N27284L72305j80527r39434j712821k146390k096751j773550
12614B3780655j382129r54262n53975k59394M8659K62992N93873R19829J182935
$$ plain form
12605 23639183 25248713 27278854 29670654 32327839 35061267 37538030 39494440 40932158
12597 40932158 41951489 42668944 43206166 43521956 43611839 43748374 44402872 45863330 47830728
12588 47830728 49883377 51609087 52513946 52495052 51717314 50342668 48600673 46858910 45212159
12579 45212159 43662445 42291785 41146711 40242346 39403844 38230873 36502931 34214145
12571 34214145 31776796 29585761 27839773 26509303 25539395 24917569 24645259 24602078 24782782
12562 24782782 25357331 26243132 27443890 29031536 31010591 33366421 35886067 38307988
12554 38307988 40347419 41606803 42001285 41712647 41297815 41233654 41601466 42411169 43236214
12545 43236214 43809228 43966067 43901788 43831589 43921258 43977795 43792450 43174737 42118168 40765787
$$ packed form
12605B3639183J609530K030141K391800K657185K733428K476763J956410J437718
12597D0932158J019331P17455N37222L15790Q9883J36535O54498J460458J967398
12588D7830728K052649J725710R04859j8894p77738j374646j741995j741763j646751
12579D5212159j549714j370660j145074r04365q38502j172971j727942k288786
12571C4214145k437349k191035j745988j330470r69908o21826k72310m3181J80704
12562B4782782N74549Q85801J200758J587646J979055K355830K519646K421921
12554C8307988K039431J259384L94482k88638m14832o4161L67812Q09703Q25045
12545D3236214N73014J56839o4279p0199Q9669N6537j85345o17713j056569j352381
$$ plain form
12535 40765787 39099753 36959106 34304079 31292159 28398113 25849160 23832889 22335890
12527 22335890 21183400 20353925 19826281 19512745 19380072 19436097 19711002 20146937 20643828
12518 20643828 21127545 21543380 21847228 22008266 22166364 22323662 22455899 22654753 22862343
12509 22862343 23306765 23931201 24692498 25518599 26412064 27326919 28319977 29117752 29524621
12500 29524621 29147381 27779801 25637635 23121432 20786108 18822294 17235970 15944671
12492 15944671 14968430 14192159 13611496 13225352 12930964 12706602 12592692 12605899 12783764
12483 12783764 13110831 13526478 14022391 14583007 15137735 15615245 15894307 16021765 16103943
12474 16103943 16234385 16379411 16455742 16417653 16261921 15940827 15545864 14968721 14138944 13187579
$$ packed form
12535D0765787j666034k140647k655027l011920k894046k548953k016271j496999
12527B2335890j152490q29475n27644l13536j32673N6025K74905M35935M96891
12518B0643828M83717M15835L03848J61038J58098J57298J32237J98854K07590
12509B2862343M44422O24436P61297Q26101Q93465R14855R93058P97775M06869
12500B9524621l77240j367580k142166k516203k335324j963814j586324j291299
12492A5944671r76241p76271n80663l86144k94388k24362j13910J3207J77865
12483A2783764L27067M15647M95913N60616N54728M77510K79062J27458Q2178
12474A6103943J30442J45026P6331l8089j55732l21094l94963n77143q29777r51365
$$ plain form
12464 13187579 12095696 11070984 10276171 9664097 9108803 8732298 8367836 8025909 7748901
12455 7748901 7568296 7384392 7149441 6963072 6802785 6718873 6691227 6643527 6579040 6547532
12445 6547532 6633666 6685505 6768618 6846529 6953909 7115088 7370445 7731402 8219808 8768475
12435 8768475 9323028 9700206 9847286 9677317 9122775 8372083 7583430 6861723 6241724
12426 6241724 5771653 5396444 5071775 4826554 4605361 4381927 4252906 4121915 4004196
12417 4004196 3932429 3895959 3806751 3674414 3560248 3466315 3404670 3346612 3293157 3205979 3139346
12406 3139346 3096323 3051010 2983762 2932081 2858642 2769697 2678227 2682843 2631563 2561851 2504775
12395 2504775 2427504 2367809 2340461 2339946 2333346 2239490 2142432 2136815 2144490 2126864 2103241 2037406
$$ packed form
12464A3187579j091883j024712p94813o12074n55294l76505l64462l41927k77008
12455G748901j80605j83904k34951j86369j60287q3912k7646m7700o4487l1508
12445F547532Q6134N1839Q3113P7911J07380J61179K55357L60957M88406N48667
12435H768475N54553L77178J47080j69969n54542p50692p88653p21707o19999
12426F241724m70071l75209l24669k45221k21193k23434j29021j30991j17719
12417D004196p1767l6470q9208j32337j14166r3933o1645n8058n3455q7178o6633
12406C139346m3023m5313o7248n1681p3439q8945r1470M616n1280o9712n7076
12395B504775p7271n9695k7348n15o600r3856r7058n617P675j7626k3623o5835
$$ plain form
12383 2037406 2008917 1969242 1917657 1866573 1861957 1891126 1905310 1877740 1816698 1810426 1772732 1834613
12371 1834613 1854609 1775115 1731070 1768893 1774664 1693785 1694758 1737164 1787900 1746374 1667791 1622738
12359 1622738 1667896 1640914 1618293 1573049 1562734 1614245 1582688 1624079 1671189 1688239 1717911
12348 1717911 1688501 1660634 1620642 1633381 1698401 1818929 1862619 1934776 2001963 2112443 2207259
12337 2207259 2294507 2396894 2478586 2569831 2789714 3063196 3413076 3787119 4163941 4634048
12327 4634048 5212167 5917508 6782822 7935893 9399328 11329043 13596925 16041723 18559939
12318 18559939 20681870 21975392 21998915 20818038 18677524 16093624 13566757 11385366
12310 11385366 9692746 8493168 7625103 6951224 6472724 6147507 5934928 5737258 5607721
$$ packed form
12383B037406k8489l9675n1585n1084m616K9169J4184k7570o1042o272l7694O1881
12371A834613J9996p9494m4045L7823N771q0879R73M2406N0736m1526p8583m5053
12359A622738M5158k6982k2621m5244j0315N1511l1557M1391M7110J7050K9672
12348A717911k9410k7867l9992J2739O5020J20528M3690P2157O7187J10480R4816
12337B207259Q7248J02387Q1692R1245K19883K73482L49880L74043L76822M70107
12327D634048N78119P05341Q65314J153071J463435J929715K267882K444798K518216
12318A8559939K121931J293522K3523j180877k140514k583900k526867k181391
12310A1385366j692620j199578q68065o73879m78500l25217k12579j97670j29537
$$ plain form
12301 5607721 5472876 5337971 5345427 5427167 5549725 5724437 5933884 6146605 6489152 6977504
12291 6977504 7542672 8342408 9407912 10824572 12654602 14728790 16978146 19123216
12283 19123216 20764336 21471023 21058270 19821704 18204401 16697384 15774154 15534571 15935321
12274 15935321 16885689 18132708 19310753 20004556 19899183 18907684 17181085 15146061 13158565
12265 13158565 11388649 10022782 8985075 8254813 7730534 7299369 7001737 6839657 6676108
12256 6676108 6558565 6525749 6544422 6548064 6570751 6652895 6742377 6927745 7118504 7340331 7675232
12245 7675232 8089494 8594052 9377324 10427532 11707312 13157966 14789372 16419324 17762775
12236 17762775 18546767 18683914 18266780 17501675 16751009 16427547 16729071 17793037 19561088
$$ packed form
12301E607721j34845j34905P456Q1740J22558J74712K09447K12721L42547M88352
12291F977504N65168P99736J065504J416660J830030K074188K249356K145070
12283A9123216J641120P06687m12753j236566j617303j507017r23230k39583M00750
12274A5935321R50368J247019J178045O93803j05373r91499j726599k035024j987496
12265A3158565j769916j365867j037707p30262n24279m31165k97632j62080j63549
12256F676108j17543l2816J8673L642K2687Q2144Q9482J85368J90759K21827L34901
12245G675232M14262N04558P83272J050208J279780J450654J631406J629952J343451
12236A7762775P83992J37147m17134p65105p50666l23462L01524J063966J768051
$$ plain form
12227 19561088 22099785 25329130 28905540 32153852 34349465 35031276 33886685 31165416
12219 31165416 27511632 23707229 20244339 17429804 15321315 13743232 12580102 11670247
12211 11670247 11020522 10568132 10219671 9965817 9786382 9692350 9702424 9735582 9745513 9851844
12201 9851844 10113653 10531514 11050085 11617179 12382910 13498451 14873315 16670851 18985343
12192 18985343 21886637 25367011 29005134 32334974 34662849 35433569 34635663 32783438
12184 32783438 30564608 28639313 27691874 27873817 29019546 30822876 32645311 33745909
12176 33745909 33667644 32268789 29744679 26541935 23230467 20260367 17800328 15871595
12168 15871595 14457085 13371366 12483754 11779442 11257977 10844495 10434855 10163723 10018491
$$ packed form
12227A9561088K538697L229345L576410L248312K195613O81811j144591k721269
12219C1165416l653784l804403l462890k814535k108489j578083j163130r09855
12211A1670247o49725m52390l48461k53854j79435r4032J0074L3158R931J06331
12201I851844K61809M17861N18571N67094P65731J115541J374864J797536K314492
12192A8985343K901294L480374L638123L329840K327875P70720p97906j852225
12184C2783438k218830j925295r47439J81943J145729J803330J822435J100598
12176C3745909p8265j398855k524110l202744l311468k970100k460039j928733
12168A5871595j414510j085719q87612p04312n21465m13482m09640k71132j45232
$$ plain form
12159 10018491 9904021 9855333 9875557 9991604 10073822 10239330 10550412 10970345 11494632 12196739
12149 12196739 13100380 14335861 15903296 17945162 20202790 22488474 24448109 25630833
12141 25630833 25674620 24484817 22373376 19824685 17251999 14927158 13056121 11613510
12133 11613510 10490924 9597454 8910462 8364690 7930285 7558224 7187748 6928571 6719961
12124 6719961 6541861 6382443 6177913 6005446 5851675 5683144 5518014 5414650 5371768 5285835
12114 5285835 5152353 5045318 4944323 4866006 4846592 4782626 4670190 4574344 4490041 4377360
12104 4377360 4265558 4162636 4062804 3957727 3869281 3889504 3781444 3658428 3603145 3569265
12094 3569265 3519648 3444133 3367284 3365572 3376269 3350809 3394319 3400163 3417606 3385721 3358110 3395376
$$ packed form
12159A0018491j14470m8688K0224J16047Q2218J65508L11082M19933N24287P02107
12149A2196739R03641J235481J567435K041866K257628K285684J959635J182724
12141B5630833M3787j189803k111441k548691k572686k324841j871037j442611
12133A1613510j122586q93470o86992n45772m34405l72061l70476k59177k08610
12124F719961j78100j59418k04530j72467j53771j68531j65130j03364m2882q5933
12114E285835j33482j07035j00995p8317j9414o3966j12436r5846q4303j12681
12104D377360j11802j02922r9832j05077q8446K0223j08060j23016n5283l3880
12094C569265m9617p5515p6849j712J0697k5460M3510N844J7443l1885k7611L7266
$$ plain form
12082 3395376 3404084 3387598 3382679 3335981 3198587 3025573 2919407 2832220 2757659 2617094 2489453
12071 2489453 2429054 2373549 2351298 2355998 2298012 2334088 2356629 2333607 2265354 2226843 2228134 2239733
12059 2239733 2238839 2235297 2196499 2136126 2186302 2195041 2098963 2013813 2043500 2019981 1984150 1970787
12047 1970787 1963970 1975406 1973113 1966860 1943395 1950196 1961881 1871987 1762818 1709140 1648852 1621316
12035 1621316 1594087 1566374 1533685 1484619 1418751 1415909 1439921 1382599 1327113 1302688 1348962
12024 1348962 1374127 1409990 1401787 1391619 1368622 1320053 1275609 1268286 1265692 1278488 1291636 1310802
12012 1310802 1324718 1317642 1228264 1169524 1169666 1114456 1063294 992890 954528 959735 998984 1041532
12000 1041532 1022831 988032 958977 959667 958657 926554 915227 967226 975555 952768 984551 969862
$$ packed form
12082C395376Q708j6486m919m6698j37394j73014j06166q7187p4561j40565j27641
12071B489453o0399n5505k2251M700n7986L6076K2541k3022o8253l8511J291J1599
12059B239733q94l542l8798o0373N0176Q739r6078q5150K9687k3519l5831j3363
12047A970787o817J1436k293o253k3465O801J1685q9894j09169n3678o0288k7536
12035A621316k7229k7713l2689m9066o5868k842K4012n7322n5486k4425M6274
12024A348962K5165L5863q203j0168k2997m8569m4444p323k594J2796J3148J9166
12012A310802J3916p076q9378n8740J42n5210n1162p0404l8362N207L9249M2548
12000A041532j8701l4799k9055O90j010l2103j1327N1999Q329k2787L1783j4689
$$ plain form
11988 969862 949837 926607 883980 893587 972551 978503 945674 996948 1060269 1042117 998123 996739
11976 996739 984346 934633 947460 1001213 1020065 1029633 1039012 1022822 1016199 1049257 1086214 1141915
11964 1141915 1152547 1166619 1154777 1175115 1195296 1184571 1165394 1159269 1198968 1217163 1231334
11953 1231334 1322569 1393938 1455155 1570247 1670848 1766612 1857418 1921421 2095336 2250069
11943 2250069 2451740 2652822 2854910 3113849 3473935 3937292 4493899 5234506 6069855
11934 6069855 7056513 8324040 9874735 11785406 14096830 16767994 19604184 22291976
11926 22291976 24518495 25989315 26443838 25941654 24648742 22527960 19894650 17161735
11918 17161735 14678635 12624608 10986633 9742629 8783894 8063960 7554056 7138597 6876182
$$ packed form
11988I69862k0025k3230m2627R607P8964N952l2829N1274O3321j8152m3994j384
11976I96739j2393m9713J2827N3753J8852R568R379j6190o623L3058L6957N5701
11964A141915J0632J4072j1842K0338K0181j0725j9177o125L9699J8195J4171
11953A231334R1235P1369O1217J15092J00601R5764R0806O4003J73915J54733
11943B250069K01671K01082K02088K58939L60086M63357N56607P40607Q35349
11934F069855R86658J267527J550695J910671K311424K671164K836190K687792
11926B2291976K226519J470820M54523n02184j292912k120782k633310k732915
11918A7161735k483100k054027j637975j244004r58735p19934n09904m15459k62415
$$ plain form
11909 6876182 6680193 6541921 6455602 6339225 6238681 6236005 6270543 6420132 6582702 6807406
11899 6807406 7116357 7570851 8100925 8726383 9457996 10373026 11565909 12979576 14696963
11890 14696963 16846509 19584051 22854276 26548875 30637974 34798688 38775198 42188394
11882 42188394 44584007 45658694 45232956 43332998 40237183 36358570 32099407 27818394
11874 27818394 23815256 20308196 17539938 15435951 13856141 12672930 11773776 11073190
11866 11073190 10500292 10022277 9655226 9333588 9139442 8972548 8775798 8551110 8411738
11857 8411738 8368921 8444043 8533210 8689761 8952621 9289451 9681681 10137093 10736394 11495965
11847 11495965 12358069 13510437 15001412 16747215 18849109 21211740 23683320 25976009
$$ packed form
11909F876182j95989j38272q6319j16377j00544k676L4538J49589J62570K24704
11899F807406L08951M54494N30074O25458P31613R15030J192883J413667J717387
11890A4696963K149546K737542L270225L694599M089099M160714L976510L413196
11882D2188394K395613J074687m25738j899958l095815l878613m259163m281013
11874B7818394m003138l507060k768258k103987j579810j183211q99154p00586
11866A1073190n72898m78015l67051l21638j94146j66894j96750k24688j39372
11857H411738m2817P5122Q9167J56551K62860L36830L92230M55412N99301P59571
11847A1495965Q62104J152368J490975J745803K101894K362631K471580K292689
$$ plain form
11839 25976009 27956454 29443936 30396284 30826177 30827770 30594587 30052611 29282624 28370105
11830 28370105 27213761 25835216 24253035 22362896 20241083 18029267 15962801 14141663
11822 14141663 12723033 11648830 10785606 10057492 9568539 9153633 8813018 8573637 8390165
11813 8390165 8253427 8100275 7911661 7784512 7766610 7775956 7882817 7974494 8072202 8211104
11803 8211104 8432596 8723895 9056748 9510744 10107215 10824512 11690855 12793908 14242102
11794 14242102 16013712 18140188 20411556 22827267 25197513 27238074 28899102 30025304
11786 30025304 30266159 29606861 28096892 25969146 23534909 20942434 18324802 15891339
11778 15891339 13819967 12173785 10918781 10001639 9318655 8785420 8337333 7965953 7674747
$$ packed form
11839B5976009J980445J487482R52348M29893J593k33183n41976p69987r12519
11830B8370105j156344j378545j582181j890139k121813k211816k066466j821138
11822A4141663j418630j074203q63224p28114m88953m14906l40615k39381j83472
11813H390165j36738j53152j88614j27149j7902R346J06861R1677R7708J38902
11803H211104K21492K91299L32853M53996N96471P17297Q66343J103053J448194
11794A4242102J771610K126476K271368K415711K370246K040561J661028J126202
11786C0025304K40855o59298j509969k127746k434237k592475k617632k433463
11778A5891339k071372j646182j255004r17142o82984n33235m48087l71380k91206
$$ plain form
11769 7674747 7417898 7211073 6955563 6712047 6592135 6499304 6399221 6416266 6527459 6570701
11759 6570701 6571023 6638459 6785566 7008875 7269638 7549285 7883979 8340910 8984848 9737125
11749 9737125 10671710 11863713 13190879 14428844 15385251 15948117 15996817 15649635 14893978
11740 14893978 13758292 12329570 10790955 9391612 8256347 7305418 6560943 6039348
11732 6039348 5655351 5309100 5055070 4883033 4681731 4458581 4241892 4092973 4047164 3952514
11722 3952514 3870539 3714955 3614698 3534940 3482773 3444783 3385095 3306647 3253297 3220147 3125533
11711 3125533 3004715 2926203 2909784 2878187 2829223 2774627 2703913 2602521 2548977 2469027 2445675
11700 2445675 2425817 2331856 2198395 2184516 2200534 2130629 2110929 2051720 1966633 1866155 1823109
$$ packed form
11769G674747k56849k06825k55510k43516j19912r2831j00083J7045J11193M3242
11759F570701L22O7436J47107K23309K60763K79647L34694M56931O43938P52277
11749I737125R34585J192003J327166J237965R56407N62866M8700l47182p55657
11740A4893978j135686j428722j538615j399343j135265r50929p44475n21595
11732F039348l83997l46251k54030j72037k01302k23150k16689j48919m5809r4650
11722C952514q1975j55584j00257p9758n2167l7990n9688p8448n3350l3150r4614
11711C125533j20818p8512j6419l1597m8964n4596p0714j01392n3544p9950k3352
11700B445675j9858r3961j33461j3879J6018o9905j9700n9209q5087j00478m3046
$$ plain form
11689 1823109 1804121 1762971 1703355 1646956 1660483 1616399 1566922 1578112 1586359 1538316 1499916
11678 1499916 1432327 1417493 1440793 1460786 1374088 1338921 1342862 1332584 1325061 1282047 1269237 1269388
11666 1269388 1255298 1235975 1231810 1221098 1161973 1175842 1160880 1156787 1145266 1110627 1084786 1119207
11654 1119207 1120946 1064687 1036016 1020990 1012370 1030517 1051030 1012731 918428 947949 986607 957593
11642 957593 910127 868704 845018 791084 770740 790742 752398 727348 768728 815548 777099
11631 777099 698629 689822 779512 809157 788530 803826 872054 848616 820071 812590 755995 701061
11619 701061 698680 700981 650514 610477 591554 586705 555472 563819 552154 598048 619104 616851
11607 616851 614959 586246 551193 503363 520223 515816 503166 488722 463174 451104 482109 528034
$$ packed form
11689A823109j8988m1150n9616n6399J3527m4084m9477J1190Q247m8043l8400
11678A499916o7589j4834K3300J9993q6698l5167L941j0278p523m3014j2810J51
11666A269388j4090j9323m165j0712n9125J3869j4962m093j1521l4639k5841L4421
11654A119207J739n6259k8671j5026q620J8147K0513l8299r4303K9521L8658k9014
11642I57593m7466m1423k3686n3934k0344K0002l8344k5050M1380M6820l8449
11631G77099p8470q807Q9690K9645k0627J5296O8228k3438k8545p481n6595n4934
11619G01061k381K301n0467m0037j8923m849l1233Q347j1665M5894K1056k253
11607F16851j892k8713l5053m7830J6860m407j2650j4444k5548j2070L1005M5925
$$ plain form
11595 528034 524154 552451 520085 478434 528435 543428 535987 497595 569316 582264 549487 459222
11583 459222 436589 496123 556129 520716 504976 547454 539627 474652 459020 436153 397426 390124
11571 390124 430676 476920 520710 480619 450589 422840 430167 397245 371806 372096 385643 403238
11559 403238 403731 426920 360511 328045 354704 400364 408067 391701 371762 402118 426767 409040
11547 409040 383243 365710 364051 395453 451231 473260 467626 471048 441937 423041 483904 454896
11535 454896 411662 411895 458108 441181 387141 424727 444444 447036 429411 433427 417494 396319
11523 396319 373176 304059 374149 443385 418424 416252 426196 424111 421678 488284 516025 442662
11511 442662 390918 453540 486781 482455 440659 407566 377926 390732 401586 428628 411351 418417
$$ packed form
11595E28034l880K8297l2366m1651N0001J4993p441l8392P1721J2948l2777r0265
11583D59222k2633N9534O0006l5413j5740M2478p827o4975j5632k2867l8727p302
11571C90124M0552M6244M3790m0091l0030k7749P327l2922k5439K90J3547J7595
11559D03238M93K3189o6409l2466K6659M5660P703j6366j9939L0356K4649j7727
11547D09040k5797j7533j659L1402N5778K2029n634L422k9111j8896O0863k9008
11535D54896m3234K33M6213j6927n4040L7586J9717K592j7625M016j5933k1175
11523C96319k3143o9117P0090O9236k4961k172R944k085k433O6606K7741p3363
11511D42662n1744O2622L3241m326m1796l3093k9640J2806J0854K7042j7277P066
$$ plain form
11499 418417 389021 385549 391789 461895 478933 436696 408676 380059 414390 483783 484673 474659
11487 474659 466485 502234 516690 453335 419772 426192 335335 285646 284903 358191 417080 409479
11475 409479 388256 403654 410689 323440 258669 286337 313338 276997 235716 316269 369975 388556
11463 388556 432581 480261 513760 484988 457983 414449 411726 425839 440894 485551 499107 481494
11451 481494 404475 365467 373609 386372 334947 325557 309022 300370 285439 271607 294284 305528
11439 305528 270567 230235 214358 233047 262565 308180 289137 276512 302927 315219 314452 296932
11427 296932 286067 301622 228432 192992 198605 240888 257555 283046 302136 336506 348337 346290
11415 346290 327401 369381 368139 399243 391158 367283 380933 346747 352387 379050 384556 387956
$$ packed form
11499D18417k9396l472O240P0106J7038m2237k8020k8617L4331O9393Q90j0014
11487D74659q174L5749J4456o3355l3563O420r0857m9689p43P3288N8889p601
11475D09479k1223J5398P035q7249o4771K7668K7001l6341m1281Q0553N3706J8581
11463C88556M4025M7680L3499k8772k7005m3534k723J4113J5055M4657J3556j7613
11451D81494p7019l9008Q142J2763n1425r390j6535q652j4931j3832K2677J1244
11439C05528l4961m0332j5877J8689K9518M5615j9043j2625K6415J2292p67j7520
11427B96932j0865J5555p3190l5440N613M2283J6667K5491J9090L4370J1831k047
11415C46290j8889M1980j242L1104q085k3875J3650l4186N640K6663N506L400
$$ plain form
11403 387956 338772 317346 299156 312907 323660 308681 298316 294250 279309 242660 214539 237108
11391 237108 275441 287250 260604 274323 283590 318528 359243 340249 354623 348046 322738 264250
11379 264250 250527 320767 313999 250066 224985 230633 241969 331289 361913 327793 271854 287680
11367 287680 350644 360093 331431 347850 391653 445894 477556 483903 494895 488639 474009 444236
11355 444236 402111 430785 436035 424487 392617 358994 349286 364824 375500 336050 323435 342792
11343 342792 314403 309779 346688 282474 307864 395948 389689 357548 346736 377326 386888 346451
11331 346451 299875 298359 347812 369098 367470 415874 353905 362190 336748 335686 377568 437486
11319 437486 488913 443921 465445 519107 513847 452820 402297 429620 411650 381766 393202 401977
$$ packed form
11403C87956m9184k1426j8190J3751J0753j4979j0365m066j4941l6649k8121K2569
11391B37108L8333J1809k6646J3719R267L4938M0715j8994J4374o577k5308n8488
11379B64250j3723P0240o768o3933k5081N648J1336Q9320L0624l4120n5939J5826
11367B87680O2964R449k8662J6419M3803N4241L1662O347J0992o256j4630k9773
11355D44236m2125K8674N250j1548l1870l3623r708J5538J0676l9450j2615J9357
11343C42792k8389m624L6909o4214K5390Q8084o259l2141j0812L0590R562m0437
11331C46451m6576j516M9453K1286j628M8404o1969Q285k5442j062M1882N9918
11319D37486N1427m4992K1524N3662n260o1027n0523K7323j7970k9884J1436Q775
$$ plain form
11307 401977 421370 435314 438274 457745 453519 462026 408484 395729 454471 501369 514291 519362
11295 519362 503092 518031 583930 617684 644970 680843 682212 689008 809119 951965 996855
11284 996855 1025215 1084482 1129011 1232290 1359629 1514544 1699424 1845405 2011493 2215586
11274 2215586 2418662 2578033 2762218 2934085 3052485 3158309 3205193 3225502 3294692 3263021
11264 3263021 3167667 3126552 3067680 3037179 2989255 2873235 2796917 2770582 2688901 2613162 2606147
11253 2606147 2661157 2705575 2715835 2796683 2941946 3136225 3405453 3659323 3949841 4271973
11243 4271973 4668982 5017733 5417527 5860391 6293465 6801691 7263183 7735996 8227333
11234 8227333 8647127 9127813 9605662 9982300 10326397 10585507 10848293 11018999 11109429 11080716
$$ packed form
11307D01977J9393J3944K960J9471m226Q507n3542j2755N8742M6898J2922N071
11295E19362j6270J4939O5899L3754K7286L5873J369O796J20111J42846M4890
11284I96855K8360N9267M4529J03279J27339J54915J84880J45981J66088K04093
11274B215586K03076J59371J84185J71867J18400J05824M6884K0309O9190l1671
11264C263021r5354m1115n8872l0501m7924j16020p6318k6335q1681p5739p015
11253B606147N5010M4418J0260Q0848J45263J94279K69228K53870K90518L22132
11243D271973L97009L48751L99794M42864M33074N08226M61492M72813M91337
11234H227333M19794M80686M77849L76638L44097K59110K62786J70706R0430k8713
$$ plain form
11224 11080716 10969158 10813773 10598033 10316623 9968232 9594787 9227499 8832068 8453274
11215 8453274 8127986 7849183 7592313 7464756 7379141 7415757 7511820 7743867 8066178 8518969
11205 8518969 9009336 9622482 10326771 11088352 11883346 12653595 13431714 14258085 15082176
11196 15082176 15929507 16751983 17408661 17951345 18500714 18906523 19204235 19440359 19514045
11187 19514045 19435677 19281824 19070498 18712706 18294441 17787859 17205970 16584988 15968323
11178 15968323 15288960 14665067 14067709 13488561 13007534 12494691 12060952 11777139 11597710
11169 11597710 11594313 11762539 12068565 12393382 12835882 13360495 14049043 14926995 15878662 16822486
11159 16822486 17742202 18728933 19723408 20655356 21566472 22425080 23232176 23894449 24385647
$$ packed form
11224A1080716j11558j55385k15740k81410l48391l73445l67288l95431l78794
11215H453274l25288k78803k56870j27557q5615L6616R6063K32047L22311M52791
11205H518969M90367O13146P04289P61581P94994P70249P78119Q26371Q24091
11196A5082176Q47331Q22476O56678N42684N49369M05809K97712K36124P3686
11187A9514045p8368j53853k11326l57792m18265n06582n81889o20982o16665
11178A5968323o79363o23893n97358n79148m81027n12843m33739k83813j79429
11169A1597710l397J68226L06026L24817M42500N24613O88548Q77952R51667R43824
11159A6822486R19716R86731R94475R31948R11116Q58608Q07096O62273M91198
$$ plain form
11150 24385647 24681235 24785272 24776036 24671670 24402700 24022700 23386154 22570127 21667077 20786841
11140 20786841 19895192 18935831 18006007 17142458 16300252 15522163 14825077 14218743 13709008
11131 13709008 13344523 13149739 13085430 13153938 13337491 13669244 14122552 14656440 15282182 16006652
11121 16006652 16763540 17546561 18327370 19101488 19869088 20575878 21223041 21867645 22354296
11112 22354296 22761076 23050871 23271022 23349440 23229778 22989478 22589870 22103052 21618907
11103 21618907 20958070 20204898 19369665 18422515 17499676 16729228 15967220 15202630 14426817
11094 14426817 13674365 12986044 12420906 11957295 11529924 11260047 11098408 11080104 11156113 11331812
11084 11331812 11653555 12013502 12393720 12861854 13393912 13898164 14372271 14781129 15111428
$$ packed form
11150B4385647K95588J04037r236j04366k68970l80000o36546q16027r03050q80236
11140B0786841q91649r59361r29824q63549q42206p78089o97086o06334n09735
11131A3709008l64485j94784o4309O8508J83553L31753M53308N33888O25742P24470
11121A6006652P56888P83021P80809P74118P67600P06790O47163O44604M86651
11112B2354296M06780K89795K20151P8418j19662k40300l99608m86818m84145
11103B1618907o60837p53172q35233r47150r22839p70448p62008p64590p75813
11094A4426817p52452o88321n65138m63611m27371k69877j61639j8304P6009J75699
11084A1331812L21743L59947L80218M68134N32058N04252M74107M08858L30299
$$ plain form
11075 15111428 15453983 15741785 15986103 16107706 16096904 15944319 15737429 15455125 15094121
11066 15094121 14682199 14156484 13600220 13071276 12507652 11921865 11364402 10809771 10235430
11057 10235430 9717968 9282430 8883733 8498302 8061142 7712849 7417294 7135964 6842964
11048 6842964 6592728 6405740 6309050 6207526 6139351 6108028 6114808 6163633 6239325 6382989 6496421
11037 6496421 6488083 6486823 6538358 6646047 6736260 6779465 6783229 6651138 6478895 6321663 6183425
11026 6183425 6043052 5868773 5632905 5394473 5189466 4885950 4577147 4342811 4179564
11017 4179564 4008285 3854979 3646693 3443700 3309430 3192470 3068003 2912321 2802660
11008 2802660 2705516 2660467 2644848 2585449 2537628 2437945 2327053 2273410 2237816 2185472 2124299
$$ packed form
11075A5111428L42555K87802K44318J21603j0802j52585k06890k82304l61004
11066A5094121m11922n25715n56264n28944n63624n85787n57463n54631n74341
11057A0235430n17462m35538l98697l85431m37160l48293k95555k81330k93000
11048F842964k50236j86988r6690j01524o8175l1323O780M8825P5692J43664J13432
11037F496421q338j260N1535J07689R0213M3205L764j32091j72243j57232j38238
11026F183425j40373j74279k35868k38432k05007l03516l08803k34336j63247
11017D179564j71279j53306k08286k02993j34270j16960j24467j55682j09661
11008B802660r7144m5049j5619n9399m7821r9683j10892n3643l5594n2344o1173
$$ plain form
10997 2124299 2079555 2047339 2035729 2014122 2015270 1941240 1836560 1787180 1778736 1748517 1682665
10986 1682665 1660152 1668279 1634194 1620238 1631869 1622646 1576093 1530358 1462795 1473817 1428506 1404564
10974 1404564 1353656 1353504 1370636 1324722 1235981 1171450 1186924 1138562 1106111 1070703 1007425 1036088
10962 1036088 996287 951116 1020004 1060307 1064793 1068376 1067296 1055112 975256 907163 881826 858269
10950 858269 815770 824329 812389 742992 732371 714302 654807 615609 661888 711362 691009 735818
10938 735818 783676 713080 670747 615160 585189 592504 649683 669887 606724 613716 608407 583348
10926 583348 598581 637114 569801 565959 544953 551677 545144 464650 411517 438235 486152 514389
10914 514389 548236 536631 489899 483557 509704 508902 486654 475450 473944 541306 539035 463200
$$ packed form
10997B124299m4744l2216j1610k1607J148p4030j04680m9380q444l0219o5852
10986A682665k2513Q127l4085j3956J1631r223m6553m5735o7563J1022m5311k3942
10974A404564n0908j52J7132m5914q8741o4531J5474m8362l2451l5408o3278K8663
10962A036088l9801m5171O8888M0303M486L583j080j2184p9856o8093k5337k3557
10950H58269m2499Q559j1940o9397j0621j8069n9495l9198M6279M9474k0353M4809
10938G35818M7858p0596m2333n5587k9971P315N7179K0204o3163O992n309k5059
10926E83348J5233L8533o7313l842k1006O724o533q0494n3133K6718M7917K8237
10914E14389L3847j1605m6732o342K6147q02k2248j1204j506O7362k271p5835
$$ plain form
10902 463200 470552 461113 457392 489103 525289 470063 426588 440359 420820 384287 363846 405328
10890 405328 404456 326894 341775 367320 355315 364923 350469 325038 374318 434027 412492 401290
10878 401290 369503 382914 360985 300118 288464 338841 408052 464075 468872 397755 353285 310277
10866 310277 255851 262959 273042 242487 251248 287661 332771 380752 406063 375955 336563 341060
10854 341060 375354 371503 332559 318262 312315 285485 291737 322043 324111 316697 307316 377624 381583
10841 381583 299025 261550 285213 328142 362090 371770 338867 292884 311578 358372 349540 316961
10829 316961 370897 380073 375193 369916 346286 359070 421290 376993 325582 314391 312543 305117
10817 305117 310886 268013 236074 246883 253563 262150 236196 251647 315287 261664 183834 210253
$$ packed form
10902D63200P352r439l721L1711L6186n5226m3475J3771j9539l6533k0441M1482
10890D05328q72p7562J4881K5545j2005R608j4454k5431M9280N9709k1535j1202
10878D01290l1787J3411k1929o0867j1654N0377O9211N6023M797p1117m4470m3008
10866C10277n4426P108J0083l0555Q761L6413M5110M7981K5311l0108l9392M497
10854C41060L4294l851l8944j4297n947k6830O252L0306K068p414r381P0308L959
10841C81583q2558l7475K3663M2929L3948R680l2903m5983J8694M6794q832l2579
10829C16961N3936R176m880n277k3630J2784O2220m4297n1411j1191j848p426
10817C05117N769m2873l1939J0809O680Q587k5954J5451O3640n3623p7830K6419
$$ plain form
10805 210253 178799 178324 191645 236541 237964 246334 303867 333087 340821 347644 335977 333314 342049
10792 342049 361230 393915 372294 313339 285288 372131 450348 458459 442673 394429 438240 467256
10780 467256 432380 397834 395094 420734 434325 425889 378250 392704 444119 419430 416223 429890
10768 429890 349074 323331 293737 299420 284206 296928 392833 408749 300917 280217 341960
10757 341960 370307 354047 341607 315867 333683 392065 372423 294118 284398 408693 405081 322177
10745 322177 327064 365511 382456 375610 356779 299979 293783 322642 334447 374055 365149 345982
10733 345982 338364 250968 221577 280558 319064 336121 285543 228215 230068 214761 243878 260137
10721 260137 203442 155869 187128 212945 236270 280906 333545 347869 348477 406979 408365 379244
$$ packed form
10805B10253l1454m75J3321M4896J423Q370N7533K9220P734O823j1667k663Q735
10792C42049J9181L2685k1621n8955k8051Q6843P8217Q111j5786m8244M3811K9016
10780D67256l4876l4546k740K5640J3591q436m7639J4454N1415k4689l207J3667
10768D29890q0816k5743k9594N683j5214J2722R5905J5916j07832k0700O1743
10757C41960K8347j6260j2440k5740J7816N8382j9642p8305r720J24295l612q2904
10745C22177M887L8447J6945o846j8831n6800o196K8859J1805L9608q906j9167
10733C45982p618q7396k9391N8981L8506J7057n0578n7328J853j5307K9117J6259
10721B60137n6695m7573L1259K5817K3325M4636N2639J4324O08N8502J386k9121
$$ plain form
10709 379244 354967 339697 390074 371274 353471 347547 308746 312175 373270 399021 417538 398996
10697 398996 369269 331897 314197 290342 199519 195717 231380 223753 179063 157361 146838 182412
10685 182412 209186 219452 203530 213883 234059 284056 287778 266211 326381 345258 342826 349863
10673 349863 360794 371169 380211 421174 414940 360579 340523 348929 390915 407486 446788 473527
10661 473527 497961 489676 503824 605067 690244 730156 763375 784956 859228 968038 1124489
10650 1124489 1329939 1553683 1770681 1969496 2130872 2277556 2421290 2560897 2613246 2539755
10640 2539755 2495358 2375872 2132729 1829084 1603625 1451223 1274723 1113234 994666 948134
10630 948134 932324 833315 747605 778826 753689 687224 675190 632340 644848 630435 546264
$$ packed form
10709C79244k4277j5270N0377j8800j7803n924l8801L429O1095K5751J8517j8542
10697C98996k9727l7372j7700k3855r0823l802L5663p627m4690k1702j0523L5574
10685A82412K6774J0266j5922J0353K0176M9997L722k1567O0170J8877k432P037
10673C49863J0931J0375R042M0963o234n4361k0056Q406M1986J6571L9302K6739
10661D73527K4434q285J4148J01243Q5177L9912L3219K1581P4272J08810J56451
10650A124489K05450K23744K16998J98815J61376J46684J43734J39607N2349p3491
10640B539755m4397j19486k43143l03645k25459j52402j76500j61489j18568m6532
10630I48134j5810r9009q5710L1221k5137o6465j2034m2850J2508j4413q4171
$$ plain form
10619 546264 513020 453434 421781 478213 490998 506221 500554 487760 476336 463208 490177 479958
10607 479958 451314 408079 434109 464083 427261 370956 329286 298113 307425 356131 356182 358917
10595 358917 313395 312773 254816 209352 223896 237490 255959 336652 317603 270645 267130 278235
10583 278235 282672 264228 243444 261897 259280 283091 252362 250926 279268 286187 260887 260291 302810
10570 302810 307005 263381 262260 288163 284514 262592 320590 307671 241705 250179 281078 278400
10558 278400 268188 240522 232633 195238 200355 285802 343017 353592 302931 240971 234537 241689
10546 241689 218375 229849 258660 254599 275771 329913 346594 333452 304400 237743 242163 230883
10534 230883 297654 302691 299812 342549 374198 377848 337254 311038 373885 353170 341956 292785
$$ packed form
10619E46264l3244n9586l1653N6432J2785J5223n667j2794j1424j3128K6969j0219
10607D79958k8644m3235K6030K9974l6822n6305m1670l1173R312M8706N1K735
10595C58917m5522o22n7957m5464J4544J3594J8469Q0693j9049m6958l515J1105
10583B78235M437j8444k0784J8453k617K3811l0729j436K8342O919k5300n96M2519
10570C02810M195m3624j121K5903l649k1922N7998j2919o5966Q474L0899k678
10558B78400j0212k7666p889l7395N117Q5447N7215J0575n0661o1960o434P152
10546B41689k3314J1474K8811m061K1172N4142J6681j3142k9052o6657M420j1280
10534B30883O6771N037k879M2737L1649L650m0594k6216O2847k0715j1214m9171
$$ plain form
10522 292785 342338 360343 291523 303714 334209 408508 419172 414445 397426 366172 360025 372200
10510 372200 369544 374658 388451 436815 496688 474642 448378 467836 455889 408782 388591 389540
10498 389540 354009 345284 340956 356294 327185 298576 283421 300760 311487 301458 281077 306478
10486 306478 311782 304255 326763 345003 349803 345177 368318 362294 350421 348021 332431 373813 364918
10473 364918 327267 326752 446495 514683 504424 457704 400211 420370 450248 443506 397669 371552
10461 371552 398988 389805 314291 292578 289974 293676 292222 320903 348399 409025 442808 428149
10449 428149 356105 333583 328307 352791 312718 281098 303335 332978 333804 339947 327274 372379
10437 372379 363349 287422 272020 307636 296017 334968 335696 297830 263935 285688 362346 357121
$$ packed form
10522B92785M9553J8005o8820J2191L0495P4299J0664m727j7019l1254o147J2175
10510C72200k656N114J3793M8364N9873k2046k6264J9458j1947m7107k0191R49
10498C89540l5531q725m328J5338k9109k8609j5155J7339J0727j0029k0381K5401
10486C06478N304p527K2508J8240M800m626K3141o024j1873k400j5590M1382q895
10473C64918l7651n15J19743O8188j0259m6720n7493K0159K9878o742m5837k6117
10461C71552K7436r183p5514k1713k604L702j454K8681K7496O0626L3783j4659
10449D28149p2044k2522n276K4484m0073l1620K2237K9643Q26O143j2673M5105
10437C72379r030p5927j5402L5616j1619L8951P28l7866l3895K1753P6658n225
$$ plain form
10425 357121 335937 358408 404856 439849 437406 456516 428621 403061 400393 402907 394922 375323
10413 375323 423279 496923 501663 582258 632718 697251 772821 817360 842852 920497 1007821 1046409
10401 1046409 1035182 1083848 1162863 1191286 1246649 1333344 1402631 1493067 1584098 1640354 1724741
10390 1724741 1839897 1886699 2024500 2228454 2330376 2431021 2529548 2568125 2567037 2578348
10380 2578348 2644932 2687339 2682135 2655519 2585500 2518025 2458448 2366841 2227276 2111533 2036866
10369 2036866 1936542 1824194 1740418 1671920 1600066 1479367 1352178 1296793 1238466 1183383
10359 1183383 1171515 1140598 1108969 1065580 1092903 997964 954835 937873 911430 871781 899402
10348 899402 945426 952153 931057 884391 826160 766627 755327 771464 802580 840907 812235 864718
$$ packed form
10425C57121k1184K2471M6448L4993k443J9110k7895k5560k668K514p985j9599
10413C75323M7956P3644M740Q0595N0460O4533P5570M4539K5492P7645Q7324L8588
10401A046409j1227M8666P9015K8423N5363Q6695O9287R0436R1031N6256Q4387
10390A724741J15156M6802J37801K03954J01922J00645R8527L8577j088J1311
10380B578348O6584M2407n204k6616p0019o7475n9577r1607j39565j15743p4667
10369B036866j00324j12348q3776o8498p1854j20699j27189n5385n8327n5083
10359A183383j1868l0917l1629m3389K7323r4939m3129j6962k6443l9649K7621
10348H99402M6024O727k1096m6666n8231n9533j1300J6137L1116L8327k8672N2483
$$ plain form
10336 864718 878411 858037 798037 747578 763053 812255 843570 933627 971567 968689 948392 961248
10324 961248 1000663 1034504 1077246 1122504 1163182 1226104 1230059 1266437 1382435 1467636 1463946 1519585
10312 1519585 1615337 1673121 1746451 1762457 1819281 1879940 1948483 2044159 2161052 2265286 2332596
10301 2332596 2405318 2522091 2633926 2817544 2902484 3022156 3129205 3324748 3506571 3704760
10291 3704760 3884346 4101873 4352456 4515691 4706632 4965601 5244123 5533174 5893131
10282 5893131 6311980 6702473 7096930 7583320 8174867 8948187 9747627 10709245 11807161
10273 11807161 12997177 14482260 16207780 18145229 20323479 22809874 25556956 28558461
10265 28558461 32001147 35915721 40371731 45651229 52053230 59974793 70083280 83445449
$$ packed form
10336H64718J3693k0374o0000n0459J5475M9202L1315R0057L7940k878k0297J2856
10324I61248L9415L3841M2742M5258M0678O2922L955L6378J15998Q5201l690N5639
10312A519585R5752N7784P3330J6006N6824O0659O8543R5676J16893J04234O7310
10301B332596P2722J16773J11835J83618Q4940J19672J07049J95543J81823J98189
10291C704760J79586K17527K50583J63235J90941K58969K78522K89051L59957
10282E893131M18849L90493L94457M86390N91547P73320P99440R61618J097916
10273A1807161J190016J485083J725520J937449K178250K486395K747082L001505
10265B8558461L442686L914574M456010N279498O402001P921563J0108487J3362169
$$ plain form
10257 83445449 101018493 123594900 151434723 183899199 219526131 256689428 294281608
10250 294281608 330891328 363795139 388880410 402716094 405562992 399812111 386681197
10243 386681197 364819655 333646435 296328906 258323058 223141296 191180296 161899615
10236 161899615 136218690 115540206 100494635 89982959 82404752 76726928 72266639
10229 72266639 68523168 65243367 62285384 59536424 56914710 54505917 52264696 50258466
10221 50258466 48453816 46885861 45578585 44471167 43525796 42721142 41994665 41250654 40343155
10212 40343155 39371871 38283090 37086061 35828487 34518232 33089166 31611158 30180880
10204 30180880 28821912 27461238 26172040 25063153 24107887 23203208 22391084 21679306 21006834
$$ packed form
10257H3445449J7573044K2576407K7839823L2464476L5626932L7163297L7592180
10250B94281608L6609720L2903811K5085271J3835684K846898n750881j3130914
10243C86681197k1861542l1173220l7317529l8005848l5181762l1961000k9280681
10236A61899615k5680925k0678484j5045571j0511676p578207n677824m460289
10229G2266639l743471l279801k957983k748960k621714k408793k241221k006230
10221E0258466j804650j567955j307276j107418r45371q04654p26477p44011r07499
10212D0343155r71284j088781j197029j257574j310255j429066j478008j430278
10204C0180880j358968j360674j289198j108887r55266r04679q12124p11778o72472
$$ plain form
10195 21006834 20405724 19902557 19345585 18860957 18489028 18161187 17825400 17454025 17068922
10186 17068922 16823719 16623388 16338316 16083307 15892259 15621124 15423118 15284178 15143014
10177 15143014 15026125 14899554 14816310 14749719 14702966 14639746 14549613 14475155 14489544 14513674 14545952
10166 14545952 14578800 14551534 14601433 14692986 14719108 14689472 14593731 14447332 14240963 14050461
10156 14050461 13892418 13669657 13416697 13094989 12728724 12395711 12047038 11735743 11481006
10147 11481006 11203919 10936244 10632096 10311911 10037379 9778342 9541086 9227209 8995224
10138 8995224 8815748 8698835 8555400 8420353 8299441 8147657 8027683 7854526 7706439
10129 7706439 7594210 7515661 7430029 7275383 7072736 6903871 6760984 6563974 6341432 6186723
$$ packed form
10195B1006834o01110n03167n56972m84628l71929l27841l35787l71375l85103
10186A7068922k45203k00331k85072k55009j91048k71135j98006j38940j41164
10177A5143014j16889j26571q3244o6591m6753o3220r0133p4458J4389K4130L2278
10166A4545952L2848k7266M9899R1553K6122k9636r5741j46399k06369j90502
10156A4050461j58043k22761k52960l21708l66265l33013l48673l11295k54737
10147A1481006k77087k67675l04148l20185k74532k59037k37256l13877k31985
10138H995224j79476j16913j43435j35047j20912j51784j19974j73157j48087
10129G706439j12229p8549q5632j54646k02647j68865j42887j97010k22542j54709
$$ plain form
10119 6186723 6028798 5788931 5489593 5309086 5103932 4909943 4693195 4399814 4183242
10110 4183242 3968773 3777012 3648558 3552179 3360257 3205617 3128362 2994071 2849310 2717963
10100 2717963 2645346 2584284 2519733 2481516 2372784 2241942 2150830 2063592 2002999 1872244 1758206
10089 1758206 1684548 1668571 1651955 1584289 1439758 1296555 1166487 1158011 1181655 1146224 1038022
10078 1038022 988078 951017 910510 888177 888927 880657 895656 930004 913649 853708 781155 702579
10066 702579 666324 751256 770572 728886 668952 668322 652930 689150 675596 668547 653358 621572
10054 621572 612944 651521 652873 665320 710053 725891 705499 655565 668622 655597 600691 628248
10042 628248 666498 676664 678182 698808 729869 761779 768329 794722 809294 808088 789656 814609
$$ packed form
10119F186723j57925k39867k99338j80507k05154j93989k16748k93381k16572
10110D183242k14469j91761j28454r6379j91922j54640p7255j34291j44761j31347
10100B717963p2617o1062o4551l8217j08732j30842r1112q7238o0593j30755j14038
10089A758206p3658j5977j6616o7666j44531j43203j30068q476K3644l5431j08202
10078A038022m9944l7061m0507k2333P50q270J4999L4348j6355n9941p2553p8576
10066G02579l6255Q4932J9316m1686n9934o30j5392L6220j3554p049j5189l1786
10054F21572q628L8577J352J2447M4733J5838k0392m9934J3057j3025n4906K7557
10042F28248L8250J0166J518K0626L1061L1910O550K6393J4572j206j8432K4953
$$ plain form
10030 814609 868475 928361 948493 962443 1000954 1066469 1132931 1153215 1136404 1120502 1133015
10019 1133015 1142895 1137424 1150402 1133013 1124730 1119074 1152110 1162534 1193965 1197666 1118670 1159216
10007 1159216 1211372 1269702 1311825 1299897 1293898 1288398 1272595 1240445 1202867 1257341 1308643 1305290
9995 1305290 1268031 1307044 1356656 1308144 1333665 1350731 1302087 1245480 1256955 1273475 1190239
9984 1190239 1156601 1161376 1191304 1196022 1208156 1196406 1131036 1105746 1046002 965982 970870 964658
9972 964658 981414 966119 961822 947138 932869 902528 839372 804224 820369 843505 789847 755363
9960 755363 696916 700825 699211 674058 635419 693105 656677 629234 686605 625102 560143 570566
9948 570566 547262 621445 657046 666702 623606 577589 576121 623798 602763 554503 542731 555132
$$ packed form
10030H14609N3866N9886K0132J3950L8511O5515O6462K0284j6811j5902J2513
10019A133015R880n471J2978j7389q283n656L3036J0424L1431L701p8996M0546
10007A159216N2156N8330M2123j1928n999n500j5803l2150l7578N4474N1302l353
9995A305290l7259L9013M9612m8512K5521J7066m8644n6607J1475J6520q3236
9984A190239l3638M775K9928M718J2134j1750o5370k5290n9744q0020M888o212
9972I64658J6756j5295m297j4684j4269l0341o3156l5148J6145K3136n3658l4484
9960G55363n8447L909j614k5153l8639N7686l6428k7443N7371o1503o4959J0423
9948E70566k3304P4183L5601R656m3096m6017j468M7677k1035m8260j1772J2401
$$ plain form
9936 555132 597172 567281 482473 423629 372274 373334 344562 380549 425765 443486 493342 465048
9924 465048 448908 451839 451757 439068 445670 472095 458951 476426 460754 468194 471885 437648 412184
9911 412184 409613 356543 356871 397286 429029 401740 349942 325705 300319 343765 308749 310274
9899 310274 378057 448198 482396 462630 435162 471021 476571 476374 446664 417936 471074 520009
9887 520009 510936 488843 482549 487810 512356 495499 508565 598784 622997 677355 696821 722722
9875 722722 798423 801775 805977 793793 806156 780804 717242 709688 669624 717971 768639 788652
9863 788652 796628 863033 911305 906926 934230 1004081 1062809 1070221 1190116 1389171 1601615 1835379
9851 1835379 2030057 2226743 2440834 2650284 2800976 2931067 2984206 2947244 2868186 2777116
$$ packed form
9936E55132M2040k9891q4808n8844n1355J060k8772L5987M5216J7721M9856k8294
9924D65048j6140K931q2j2689O602K6425j3144J7475j5672P440L691l4237k5464
9911D12184k571n3070L28M0415L1743k7289n1798k4237k5386M3446l5016J525
9899C10274O7783P0141L4198j9766k7468L5859N550j97k9710k8728N3138M8935
9887E20009r073k2093o294N261K4546j6857J3066R0219K4213N4358J9466K5901
9875G22722P5701L352M202j2184J2363k5352o3562p554m0064M8347N0668K0013
9863G88652P976O6405M8272m379K7304O9851N8728P412J19895J99055K12444K33764
9851A835379J94678J96686K14091K09450J50692J30091N3139l6962p9058r1070
$$ plain form
9841 2777116 2622648 2440940 2196671 1919821 1718567 1626746 1504690 1345105 1227062 1186655
9831 1186655 1102591 1039659 1011841 981134 995624 941795 884855 843480 872291 814230 780781
9820 780781 771734 795052 724897 672742 742962 745770 722866 739839 741027 757224 721041 719934
9808 719934 723343 749866 721530 657693 646105 687741 741771 815690 831841 820013 782300 756430
9796 756430 745712 663629 612347 697283 754992 720597 697493 702029 629995 547190 517400 500985
9784 500985 510574 515205 507982 516964 491683 495273 528146 524918 501510 477204 528270 551842 473438
9771 473438 509949 547966 540446 531561 622340 690929 636716 668984 780836 815001 868680 840026
9759 840026 814299 833486 820865 739952 705185 708559 735300 821663 917594 962031 1027269 1229839
$$ packed form
9841B777116j54468j81708k44269k76850k01254r1821j22056j59585j18043m0407
9831A186655q4064o2932k7818l0707J4490n3829n6940m1375K8811n8061l3449
9820G80781r047K3318p0155n2155P0220K808k2904J6973J188J6197l6183j107
9808G19934L409K6523k8336o3837j1588M1636N4030P3919J6151j1828l7713k5870
9796G56430j0718q2083n1282Q4936N7709l4395k3104M536p2034q2805k9790j6415
9784E00985R589M631p223Q982k5281L590L2873l228k3408k4306N1066K3572p8404
9771D73438L6511L8017p520q885R0779O8589n4213L2268J11852L4165N3679k8654
9759H40026k5727J9187j2621q0913l4767L374K6741Q6363R5931M4437O5238K02570
$$ plain form
9747 1229839 1474923 1677978 1827138 1908315 1817190 1736544 1671459 1656943 1637220 1686641 1774614
9736 1774614 1878658 1919325 1797419 1582673 1325077 1095821 897725 815211 805930 794768
9726 794768 784854 787419 809412 824698 833556 787483 762418 752263 759639 764780 715996 709570 608635
9713 608635 596669 588914 570740 578822 594754 568032 599111 625946 611812 594937 613377 584539
9701 584539 622684 732508 693151 609043 569819 525848 519042 524104 500160 529521 537959 518417
9689 518417 509656 534348 542833 540459 511939 560862 568395 526489 557658 524783 527067 505984 533975
9676 533975 568546 610229 670705 696447 691584 674412 651144 605988 625015 616998 522207 449419
9664 449419 486781 520576 519804 507407 480626 477915 468826 438795 398267 430019 502826 545844
$$ packed form
9747A229839K45084K03055J49160Q1177r1125q0646o5085j4516j9723M9421Q7973
9736A774614J04044M0667j21906k14746k57596k29256j98096q2514r281j1162
9726G94768r914K565K1993J5286Q858m6073k5065j0155P376N141m8784o426j00935
9713F08635j1966p755j8174Q082J5932k6722L1079K6835j4134j6875J8440k8838
9701E84539L8145J09824l9357q4108l9224m3971o806N062k3944K9361Q438j9542
9689E18417q761K4692Q485k374k8520M8923P533m1906L1169l2875K284k1083K7991
9676E33975L4571M1683O0476K5742m863j7172k3268m5156J9027q017r4791p2788
9664D49419L7362L3795p72j2397k6781k711r089l0031m0528L1752P2807M3018
$$ plain form
9652 545844 537170 507718 477205 490606 489748 448827 455645 495900 476914 460617 537260 587569
9640 587569 628596 694174 696858 687615 747694 786881 761692 737088 769797 888476 978914 923771
9628 923771 875116 796297 739399 665248 639531 637347 588561 564239 579936 594439 594633 557581
9616 557581 546571 575196 554114 557575 557309 580726 561648 515578 481558 526223 570316 558219
9604 558219 551930 584776 604632 582295 583732 571317 587922 622703 632464 585246 597034 636286
9592 636286 661283 615739 589925 581252 562480 599466 635535 604674 585316 593804 627647 684287
9580 684287 713529 661666 646765 670252 699972 725298 686558 657463 615712 614485 669288 659367
9568 659367 585935 590048 618832 580074 586765 590251 558527 539834 593862 599809 576488 587266
$$ packed form
9652E45844q674k9452l0513J3401q58m0921O818M0255j8986j6297P6643N0309
9640E87569M1027O5578K684r243O0079L9187k5189k4604L2709J18679R0438n5143
9628I23771m8655p8819n6898p4151k5717k184m8786k4322J5697J4503J94l7052
9616E57581j1010K8625k1082L461k66K3417j9078m6070l4020M4665M4093j2097
9604E58219o289L2846J9856k2337J437j2415J6605L4781R761m7218J1788L9252
9592F36286K4997m5544k5814q673j8772L6986L6069l0861j9358Q488L3843N6640
9580F84287K9242n1863j4901K3487K9720K5326l8740k9095m1751j227N4803r921
9568F59367p3432M113K8784l8758O691L486l1724j8693N4028N947k3321J0778
$$ plain form
9556 587266 592157 572771 544160 614663 664184 660170 672232 681988 738796 728088 692986 710104
9544 710104 748946 785231 785940 756547 719772 765649 822301 868235 918859 922983 945818 951152
9532 951152 937279 963836 959069 950601 964310 972686 1041994 1088418 1094413 1084741 1118899 1117347 1088931
9519 1088931 1075895 1072826 1091262 1099641 1123734 1168783 1174501 1171007 1217789 1204425 1260446 1308425
9507 1308425 1371465 1455530 1570371 1637573 1701567 1716091 1768196 1935603 2065782 2159538 2296104
9496 2296104 2386163 2510761 2633108 2757444 2869158 3015794 3175681 3421308 3663688 3958457
9486 3958457 4378401 4931768 5566045 6319754 7275561 8465529 9964189 11929147 14409412
9477 14409412 17578144 21413805 25773032 30218409 33835790 35723577 35272520 32550701
$$ packed form
9556E87266M891j9386k8611P0503M9521m014J2062R756N6808j0708l5102J7118
9544G10104L8842L6285P09k9393l6775M5877N6652M5934N0624M124K2835N334
9532I51152j3873K6557m767q468J3709Q376O9308M6424N995r672L4158j552k8416
9519A088931j3036l069J8436Q379K4093M5049N718l494M6782j3364N6021M7979
9507A308425O3040Q4065J14841O7202O3994J4524N2105J67407J30179R3756J36566
9496B296104R0059J24598J22347J24336J11714J46636J59887K45627K42380K94769
9486C958457M19944N53367O34277P53709R55807J189968J498660J964958K480265
9477A4409412L168732L835661M359227M445377L617381J887787m51057k721819
$$ plain form
9469 32550701 28384508 23830404 19721629 16433134 14002535 12344812 11106665 10242396
9461 10242396 9660653 9203834 8866527 8604248 8590985 8784162 9065897 9363851 9869321 10598937
9451 10598937 11443097 12439475 13822791 15754695 18268367 21501026 25459947 29845769
9443 29845769 34157311 37561400 39063555 38066761 34741154 30076667 25173720 20874827
9435 20874827 17449100 14948444 13125777 11777043 10726086 9903342 9341268 8924884 8561670
9426 8561670 8290341 8021643 7819036 7672947 7565923 7519036 7499223 7546816 7643854 7663590
9416 7663590 7733904 7782312 7869283 7963719 8026150 8035040 8124910 8294256 8538452 8886135 9269555
9405 9269555 9690594 10176320 10823770 11646462 12707740 14025394 15663836 17795848 20584967
$$ packed form
9469C2550701m166193m554104m108775l288495k430599j657723j238147q64269
9461A0242396n81743m56819l37307k62279j3263J93177K81735K97954N05470P29616
9451A0598937Q44160R96378J383316J931904K513672L232659L958921M385822
9443B9845769M311542L404089J502155r96794l325607m664487m902947m298893
9435B0874827l425727k500656j822667j348734j050957q22744n62074m16384l63214
9426H561670k71329k68698k02607j46089j07024m6887j9813M7593R7038J9736
9416G663590P0314M8408Q6971R4436O2431Q890Q9870J69346K44196L47683L83420
9405I269555M21039M85726O47450Q22692J061278J317654J638442K132012K789119
$$ plain form
9396 20584967 24201673 28877789 34635947 41334873 48303081 54276862 57778605 57694720
9388 57694720 54016231 47773880 40520807 33790726 28341631 24305631 21457068 19416883
9380 19416883 17937162 16846213 16088659 15618698 15343424 15224039 15252286 15437358 15834915
9371 15834915 16442199 17313285 18463316 19944229 21903802 24470777 27807797 32116416
9363 32116416 37403655 43445097 49465231 54368786 56886905 56135442 52165474 46079867
9355 46079867 39280575 32977562 27854993 23912523 20975229 18795913 17148130 15881068
9347 15881068 14922636 14087867 13401927 12887543 12477716 12164143 11897696 11641076 11527959
9338 11527959 11461332 11472533 11491795 11491404 11611910 11825793 12105210 12458654 12998286 13743880
$$ packed form
9396B0584967L616706M676116N758158O698926O968208N973781L501743q3885
9388E7694720l678489o242351p253073o730081n449095m036000k848563k040185
9380A9416883j479721j090949p57554m69961k75274j19385K8247J85072L97557
9371A5834915O07284Q71086J150031J480913J959573K566975L337020M308619
9363C2116416N287239O041442O020134M903555K518119p51463l969968o085607
9355D6079867o799292o303013n122569l942470k937294k179316j647783j267062
9347A5881068r58432q34769o85940n14384m09827l13573k66447k56620j13117
9338A1527959o6627J1201J9262l91J20506K13883K79417L53444N39632P45594
$$ plain form
9328 13743880 14710810 15934293 17435106 19222391 21373295 23972843 27181066 31054760
9320 31054760 35331730 39553553 42920649 44695220 44252732 41700484 37790127 33492673
9312 33492673 29540959 26297316 23799814 21789807 20235202 19162328 18310847 17684844
9304 17684844 17261997 16936182 16701440 16606274 16660377 16892263 17266494 17666249 18255913 19005660
9294 19005660 19994584 21313910 23070677 25217600 27956090 31376312 35584549 40794651
9286 40794651 46962051 53765315 60707821 67017150 71855878 74743943 75577313 74522227
9278 74522227 71597266 66732810 60229616 52877032 45626932 39399350 34435337 30686396
9270 30686396 27842152 25651019 23922998 22567158 21506276 20676130 20041130 19514632 19080605
$$ packed form
9328A3743880R66930J223483J500813J787285K150904K599548L208223L873694
9320C1054760M276970M221823L367096J774571m42488k552248l910357m297454
9312C3492673l951714l243643k497502k010007j554605j072874q51481o26003
9304A7684844m22847l25815k34742r5166N4103K31886L74231L99755N89664P49747
9294A9005660R88924J319326J756767K146923K738490L420222M208237N210102
9286D0794651O167400O803264O942506O309329M838728K888065Q33370j055086
9278G4522227k924961m864456o503194p352584p250100o227582m964013l748941
9270C0686396k844244k191133j728021j355840j060882q30146o35000n26498m34027
$$ plain form
9261 19080605 18779827 18616934 18603729 18715369 18880236 19226054 19717786 20448349 21480718
9252 21480718 22760805 24344347 26372417 28912344 31944234 35372649 38951767 42155795
9244 42155795 44215752 44538031 42751341 39270068 34855839 30347787 26374144 23073276
9236 23073276 20547647 18614094 17074199 15862508 14804863 13917213 13197108 12586042 12009271
9227 12009271 11508345 10992316 10603910 10272697 9936036 9667858 9365541 9044660 8770437
9218 8770437 8558477 8370376 8227183 8106662 7986875 7929072 7821615 7670914 7597883 7468520
9208 7468520 7317840 7142863 6989687 6865770 6714554 6542953 6463674 6367800 6283517 6253160
9198 6253160 6189300 6091361 6076182 6038743 5952599 5884417 5882197 5891055 5866052 5798093 5746915 5746339
$$ packed form
9261A9080605l00778j62893j3205J11640J64867L45818M91732P30563J032369
9252B1480718J280087J583542K028070K539927L031890L428415L579118L204028
9244D2155795K059957L22279j786690l481273m414229m508052l973643l300868
9236B3073276k525629j933553j539895j211691j057645q87650p20105o11066n76771
9227A2009271n00926n16029l88406l31213l36661k68178l02317l20881k74223
9218H770437k11960j88101j43193j20521j19787n7803j07457j50701p3031j29363
9208G468520j50680j74977j53176j23917j51216j71601p9279r5874q4283l0357
9198F253160o3860r7939j5179l7439q6144o8182k220Q858k5003o7959n1178n76
$$ plain form
9186 5746339 5786457 5834048 5935137 6078901 6250972 6474701 6750597 7135478 7623179 8178149
9176 8178149 8790424 9516558 10247036 10839560 11155535 11136041 10786541 10137404 9295048 8453509
9166 8453509 7742479 7117778 6661362 6279445 5909749 5654960 5426038 5299538 5202333 5091572
9156 5091572 5008783 4896621 4813800 4734862 4619249 4496115 4395748 4344157 4232836 4124580
9146 4124580 4013919 3937129 3856853 3757759 3696809 3663048 3646771 3611526 3598144 3542749 3559644
9135 3559644 3612286 3686910 3654928 3679737 3665007 3709307 3806478 3818608 3934355 4073768 4236220
9124 4236220 4354393 4500267 4734894 5016162 5373031 5789219 6328849 6947428 7660462 8499957
9114 8499957 9533617 10699962 12069305 13580809 15393893 17518748 19900859 22560337
$$ packed form
9186E746339M0118M7591J01089J43764J72071K23729K75896L84881M87701N54970
9176H178149O12275P26134P30478N92524L15975j9494l49500o49137q42356q41539
9166H453509p11030o24701m56416l81917l69696k54789k28922j26500r7205j10761
9156E091572q2789j12162q2821p8938j15613j23134j00367n1591j11321j08256
9146D124580j10661p6790q0276r9094o0950l3761j6277l5245j3382n5395J6895
9135C559644N2642P4624l1982K4809j4730M4300R7171J2130J15747J39413J62452
9124D236220J18173J45874K34627K81268L56869M16188N39630O18579P13034Q39495
9114H499957J033660J166345J369343J511504J813084K124855K382111K659478
$$ plain form
9106 22560337 25569156 28783496 32016285 35134413 37739426 39516872 40364356 40380204 39753188
9097 39753188 38435475 36285063 33437464 30202964 26944592 23921580 21213187 18881069
9089 18881069 16774663 14934338 13415288 12218015 11326879 10662052 10139324 9697668 9234835
9080 9234835 8881378 8606992 8370782 8204230 8040033 7935501 7877561 7898501 7942736 7990838
9070 7990838 7981079 7936318 7849525 7651835 7402186 7186442 7033777 6830843 6607314 6370895
9060 6370895 6176438 6086125 6047650 5958767 5876868 5858309 5928853 5981116 6107619 6209010 6360877
9049 6360877 6644498 6945594 7260894 7610230 8035709 8522647 8938571 9257007 9515887 9779648
9039 9779648 10130800 10555140 11037403 11667465 12443537 13586683 15020159 16748079 18836097
$$ packed form
9106B2560337L008819L214340L232789L118128K605013J777446Q47484J5848o27016
9097C9753188j317713k150412k847599l234500l258372l023012k708393k332118
9089A8881069k106406j840325j519050j197273q91136o64827n22728m41656m62833
9080I234835l53457k74386k36210j66552j64197j04532n7940K0940M4235M8102
9070G990838r759m4761q6793j97690k49649k15744j52665k02934k23529k36419
9060F370895j94457r0313l8475q8883q1899j8559P0544N2263J26503J01391J51867
9049F360877K83621L01096L15300L49336M25479M86938M15924L18436K58880K63761
9039I779648L51152M24340M82263O30062P76072J143146J433476J727920K088018
$$ plain form
9030 18836097 21460808 24593972 28192763 32266530 36787526 41621359 46607850 51385711
9022 51385711 55554523 58826815 61053915 62123671 61973894 60587060 58042662 54472951
9014 54472951 50155353 45483454 40684487 36146312 31983994 28315943 25157885 22501904
9006 22501904 20252336 18464289 16996261 15800474 14836759 13997254 13296281 12668722 12151315
8997 12151315 11692362 11269572 10917097 10552349 10246943 9971520 9746963 9553475 9379220
8988 9379220 9169276 9020909 8921745 8770038 8594676 8408311 8189877 8019827 7806763 7537067
8978 7537067 7330347 7120434 6848593 6648348 6487384 6303528 6137771 6014610 5967966 5880565
8968 5880565 5741874 5647676 5616910 5637714 5604111 5567223 5589272 5669868 5756482 5890850 6080166
$$ packed form
9030A8836097K624711L133164L598791M073767M520996M833833M986491M777861
9022E1385711M168812L272292K227100J069756j49777j386834k544398l569711
9014E4472951m317598m671899m798967m538175m162318l668051l158058k655981
9006B2501904k249568j788047j468028j195787r63715q39505p00973o27559n17407
8997A2151315m58953m22790l52475l64748l05406k75423k24557j93488j74255
8988I379220k09944j48367r9164j51707j75362j86365k18434j70050k13064k69696
8978G537067k06720k09913k71841k00245j60964j83856j65757j23161m6644q7401
8968E880565j38691r4198l0766K0804l3603l6888K2049Q0596Q6614J34368J89316
$$ plain form
8957 6080166 6250066 6504043 6821569 7246612 7796023 8351450 8940717 9708487 10787049
8948 10787049 11993513 13354226 14927421 16700171 18603235 20631698 22705343 24593395
8940 24593395 26100003 27089655 27476986 27395006 26934310 26037511 24572664 22605044 20466177
8931 20466177 18417415 16476798 14751169 13215537 11960068 10925898 9988400 9214560
8923 9214560 8605882 8160744 7810745 7469044 7206091 6915445 6698742 6560019 6436116 6219580
8913 6219580 6072797 6031685 5965232 5824587 5729524 5733072 5740484 5658835 5542057 5456473 5367374
8902 5367374 5292965 5249755 5179639 5104288 5021604 5018877 5077614 5181950 5308578 5412526 5521848
8891 5521848 5539188 5582197 5618504 5605714 5555615 5382353 5166736 4952903 4704376 4422376
$$ packed form
8957F080166J69900K53977L17526M25043N49411N55427N89267P67770J078562
8948A0787049J206464J360713J573195J772750J903064K028463K073645J888052
8940B4593395J506608R89652L87331q1980m60696q96799j464847j967620k138867
8931B0466177k048762j940617j725629j535632j255469j034170r37498p73840
8923I214560o08678m45138l49999l41701k62953k90646k16703j38723j23903k16536
8913F219580j46783m1112o6453j40645r5063L548P412q1649j16778q5584q9099
8902E367374p4409m3210p0116p5351q2684k727N8737J04336J26628J03948J09322
8891E521848J7340M3009L6307j2790n0099j73262k15617k13833k48527k82000
$$ plain form
8881 4422376 4156472 3933438 3772941 3673863 3622406 3572383 3458418 3427467 3421188 3356663 3327620
8870 3327620 3314666 3365304 3421062 3445858 3379887 3331279 3333012 3388657 3408581 3423372 3428352 3542731
8858 3542731 3647282 3675894 3738084 3765891 3822862 3861624 3856713 3912791 3979331 3947433 3924237
8847 3924237 3900103 3880770 3907171 3879985 3848839 3811689 3752138 3614197 3516559 3389204 3292936
8836 3292936 3211316 3131637 3086636 3059070 3011237 3006592 2955599 2897720 2872399 2918112 2929047 2900340
8824 2900340 2886118 2894553 2916392 2962796 2940665 2917751 2939674 2991721 3094706 3198982 3288680
8813 3288680 3408736 3535471 3650792 3723336 3716027 3740718 3726406 3740230 3785646 3801502 3848946
8802 3848946 3869493 3924444 3963766 4018324 4018864 4034168 3990778 4053188 4134045 4201087 4278876 4474091
$$ packed form
8881D422376k65904k23034j60497r9078n1457n0023j13965l0951o279o4525k9043
8870C327620j2954N0638N5758K4796o5971m8608J733N5645J9924J4791M980J14379
8858C542731J04551K8612O2190K7807N6971L8762m911N6078O6540l1898k3196
8847C924237k4134j9333K6401k7186l1146l7150n9551j37941r7638j27355r6268
8836C292936q1620p9679m5001k7566m7833m645n0993n7879k5321M5713J0935k8707
8824B900340j4222Q435K1839M6404k2131k2914K1923N2047J02985J04276Q9698
8813C288680J20056J26735J15321P2544p309K4691j4312J3824M5416J5856M7444
8802C848946K0547N4951L9322N4558N40J5304m3390O2410Q0857O7042P7789J95215
$$ plain form
8790 4474091 4604650 4692415 4837074 5022329 5145827 5158998 5203361 5251537 5279039 5273970 5265716
8779 5265716 5219781 5179204 5179908 5119495 5172164 5202979 5210993 5275011 5255564 5194459 5139536 5006808
8767 5006808 4944276 4957294 4975663 4994082 5060614 5141638 5236225 5320781 5376670 5489203 5622721
8756 5622721 5753123 5940892 6151976 6322437 6508911 6729409 7072561 7435616 7772616 8132311
8746 8132311 8560204 8974940 9462973 10068133 10726744 11439483 12283949 13254207 14390152
8737 14390152 15666575 17181507 18897297 20872445 23083562 25687767 28624884 31852241
8729 31852241 35545399 39833559 44971705 51272274 59152863 69271703 82451101 99905351
8721 99905351 122984540 152624729 188157630 225926125 258953415 278340964 276856389
$$ packed form
8790D474091J30559Q7765J44659J85255J23498J3171M4363M8176K7502n069q254
8779E265716m5935m0577P04o0413N2669L0815Q014O4018j9447o1105n4923j32728
8767E006808o2532J3018J8369J8419O6532Q1024R4587Q4556N5889J12533J33518
8756E622721J30402J87769K11084J70461J86474K20498L43152L63055L37000L59695
8746H132311M27893M14736M88033O05160O58611P12739Q44466R70258J135945
8737A4390152J276423J514932J715790J975148K211117K604205K937117L227357
8729C1852241L693158M288160N138146O300569P880589J0118840J3179398J7454250
8721I9905351K3079189K9640189L5532901L7768495L3027290J9387549j484575
$$ plain form
8714 276856389 253692802 216202318 175759899 140797770 114279575 95317129 81992735
8707 81992735 72587595 65888678 61133376 57732039 55275510 53440515 51905945 50646436
8699 50646436 49599774 48748996 48105508 47714145 47577404 47693985 48131487 48995979 50326045
8690 50326045 52162881 54445578 57206225 60592474 64699275 69724866 75901605 83485576
8682 83485576 92998970 105055821 120688530 141286276 168119149 200926919 236951478
8675 236951478 270189309 292104674 295159714 277021755 243416106 205126234 171408180
8668 171408180 146239921 129182992 118548601 112567318 110075991 110526157 113332841 118320405
8660 118320405 125403155 134838873 147116376 163163566 184026369 210734421 244400725
$$ packed form
8714B76856389k3163587l7490484m0442419l4962129k6518195j8962446j3324394
8707H1992735r405140o698917m755302l401337k456529j834995j534570j259509
8699E0646436j046662q50778o43488l91363j36741J16581M37502Q64492J330066
8690E0326045J836836K282697K760647L386249M106801N025591O176739P583971
8682H3485576R513394J2056851J5632709K0597746K6832873L2807770L6024559
8675B36951478L3237831K1915365L055040j8137959l3605649l8289872l3718054
8668A71408180k5168259j7056929j0634391n981283k491327M50166K806684M987564
8660A18320405P082750R435718J2277503J6047190K0862803K6708052L3666304
$$ plain form
8653 244400725 285445829 332740943 383530967 432392363 471993255 494879209 496085086
8646 496085086 475161040 436024001 385313359 331119707 280622338 237673709 203207456
8639 203207456 176628338 156438513 141113489 129377128 120067676 112417693 105953498
8632 105953498 100264222 95194915 90676476 86499097 82683830 79160556 75869760 72949576
8624 72949576 70290405 68012685 66064320 64344273 62858167 61705624 60705867 59899651
8616 59899651 59156008 58276618 57265886 55991547 54418823 52658976 50717464 48674913
8608 48674913 46631709 44771645 43069021 41491590 40040788 38735292 37540658 36583621
8600 36583621 35786844 35137733 34647341 34144883 33722179 33203868 32493611 31605812 30774808
$$ packed form
8653B44400725M1045104M7295114N0790024M8861396L9600892K2885954J205877
8646D96085086k0924046l9137039n0710642n4193652n0497369m2948629l4466253
8639B03207456k6579118k0189825j5325024j1736361r309452p649983o464195
8632A05953498n689276n069307m518439m177379l815267l523274l290796k920184
8624G2949576k659171k277720j948365j720047j486106j152543r99757q06216
8616E9899651p43643q79390j010732j274339j572724j759847j941512k042551
8608D8674913k043204j860064j702624j577431j450802j305496j194634r57037
8600C6583621p96777o49111m90392n02458m22704n18311p10257q87799q31004
$$ plain form
8591 30774808 30156835 29652331 29168352 28710833 28275682 27871907 27357209 26833202 26350649
8582 26350649 25866148 25446559 25095192 24742874 24339426 23961464 23626256 23333038 23026035
8573 23026035 22745671 22546155 22411772 22294088 22172621 22136755 22108439 22042989 21992358 22030187
8563 22030187 22051984 21983966 21887267 21664276 21382166 21061249 20784038 20563063 20296078 20121490
8553 20121490 19921993 19620448 19387128 19081115 18682018 18261358 17915793 17611855 17337135
8544 17337135 17069110 16813683 16697172 16597088 16474683 16387546 16377384 16449080 16551024 16575142
8534 16575142 16579110 16603586 16624716 16686899 16868416 17092802 17362736 17664596 18043242 18492297
8524 18492297 19013423 19599481 20327771 21203448 22244812 23401967 24751594 26320534 28220631
$$ packed form
8591C0774808o17973n04504m83979m57519m35151m03775n14698n24007m82553
8582B6350649m84501m19589l51367l52318m03448l77962l35208k93218l07003
8573B3026035k80364j99516j34383j17684j21467l5866k8316o5450n0631L7829
8563B2030187K1797o8018r6699k22991k82110l20917k77211k20975k66985j74588
8553B0121490j99497l01545k33320l06013l99097m20660l45565l03938k74720
8544A7337135k68025k55427j16511j00084j22405q7137j0162P1696J01944K4118
8534A6575142L968K4476K1130O2183J81517K24386K69934L01860L78646M49055
8524A8492297N21126N86058P28290Q75677J041364J157155J349627J568940J900097
$$ plain form
8515 28220631 30453005 33096515 36209088 39926849 44329820 49559706 55840591 63365351
8507 63365351 72442197 83560208 97132470 114034085 135255764 161580663 193395489
8500 193395489 230403618 271158411 313017571 352236916 384796771 407499978 418511560
8493 418511560 416983405 403141761 378316817 344790774 305731333 264592032 225019520
8486 225019520 190122866 161320277 138529111 120980748 107599851 97274878 89217586
8479 89217586 82658037 77122547 72384635 68312248 64701561 61419548 58481646 55939530
8471 55939530 53682623 51656561 49889875 48429096 47263468 46247519 45460133 44855396
8463 44855396 44303175 43665208 42985291 42197179 41193859 39996175 38661184 37190708 35590588
$$ packed form
8515B8220631K232374K643510L112573L717761M402971N229886O280885P524760
8507F3365351R076846J1118011J3572262J6901615K1221679K6324899L1814826
8500A93395489L7008129M0754793M1859160L9219345L2559855K2703207J1011582
8493D18511560j528155j3841644k4824944l3526043l9059441m1139301l9572512
8486B25019520l4896654k8802589k2791166j7548363j3380897j0324973q057292
8479H9217586o559549n535490m737912m072387l610687l282013k937902k542116
8471E5939530k256907k026062j766686j460779j165628j015949p87386o04737
8463D4855396n52221o37967o79917p88112j003320j197684j334991j470476j600120
$$ plain form
8454 35590588 33972401 32435418 30969482 29538921 28273137 27113739 26097906 25156431
8446 25156431 24324704 23597931 22886731 22287587 21752738 21281689 20770976 20251769 19876174
8437 19876174 19550915 19244528 18907472 18596628 18359418 18076159 17829853 17615723 17417166
8428 17417166 17261235 17139074 17032384 16879900 16697590 16551919 16440962 16312878 16227948 16143431
8418 16143431 16072750 16035793 16082013 16143445 16220168 16259157 16303366 16323568 16348861 16385392 16308539
8407 16308539 16234863 16035859 15853519 15641421 15298146 15059569 14824092 14526011 14206591 13899524
8397 13899524 13561984 13268488 12993690 12680063 12358176 12046513 11804113 11506243 11166967
8388 11166967 10864237 10620073 10406872 10159470 9925107 9742688 9576949 9422581 9185951
$$ packed form
8454C5590588j618187j536983j465936j430561j265784j159398j015833r41475
8446B5156431q31727p26773p11200n99144n34849m71049n10713n19207l75595
8437A9876174l25259l06387l37056l10844k37210k83259k46306k14130j98557
8428A7417166j55931j22161j06690j52484j82310j45671j10957j28084q4930q4517
8418A6143431p0681l6957M6220O1432P6723L8989M4209K0202K5293L6531p6853
8407A6308539p3676j99004j82340k12098l43275k38577k35477k98081l19420l07067
8397A3899524l37540k93496k74798l13627l21887l11663k42400k97870l39276
8388A1166967l02730k44164k13201k47402k34363j82419j65739j54368k36630
$$ plain form
8379 9185951 9005792 8862464 8661454 8494496 8386843 8281700 8162769 8000820 7822534 7610466
8369 7610466 7429642 7288013 7180587 7017420 6951829 6782240 6548135 6304682 6012244 5723660
8359 5723660 5555736 5327031 5037033 4778382 4519589 4284415 4109389 3956805 3781544 3630866
8349 3630866 3455161 3301502 3212237 3164510 3089371 2986361 2838923 2684537 2551553 2431285
8339 2431285 2347438 2266474 2224139 2184520 2144447 2104684 2040982 1973784 1908471 1839550 1807953
8328 1807953 1773806 1791684 1785282 1786050 1826856 1879090 1886930 1927945 1948046 2075008 2220596 2293594
8316 2293594 2475587 2641793 2657775 2552146 2373283 2122523 1931315 1769855 1623575 1595683
8306 1595683 1569885 1472754 1423671 1389665 1358331 1384569 1399400 1423360 1426114 1384625 1410261 1432562
$$ packed form
8379I185951j80159j43328k01010j66958j07653j05143j18931j61949j78286k12068
8369G610466j80824j41629j07426j63167o5591j69589k34105k43453k92438k88584
8359E723660j67924k28705k89998k58651k58793k35174j75026j52584j75261j50678
8349C630866j75705j53659q9265m7727p5139j03010j47438j54386j32984j20268
8339B431285q3847q0964m2335l9619m0073l9763o3702o7198o5313o8921l1597
8328A807953l4147J7878o402P68M0806N2234P840M1015K0101J26962J45588P2998
8316B293594J81993J66206J5982j05629j78863k50760j91208j61460j46280k7892
8306A595683k5798r7131m9083l4006l1334K6238J4831K3960K754m1489K5636K2301
$$ plain form
8294 1432562 1443320 1422653 1411306 1412054 1453178 1490459 1491239 1499402 1498327 1528216 1604974 1771392
8282 1771392 1883974 1943961 2037028 2165710 2340577 2570312 2740943 2867588 3043295 3196010
8272 3196010 3220342 3078790 2923485 2713952 2520941 2409072 2339325 2298731 2277380 2281227 2272159
8261 2272159 2303152 2308113 2385846 2576895 2693762 2751050 2833030 2933321 3082456 3290741 3546968
8250 3546968 3846510 4034883 4231354 4275193 4218194 4093760 3865294 3623222 3436566 3248429
8240 3248429 3060198 2860933 2763672 2687875 2676268 2558672 2364236 2215661 2154326 2110738
8230 2110738 2041357 1975225 1964551 1928728 1865663 1797021 1731312 1730436 1711741 1682830 1644106 1652994
8218 1652994 1607068 1523644 1512225 1543635 1484204 1442647 1422816 1398244 1383469 1343485 1271975
$$ packed form
8294A432562J0758k0667j1347P48M1124L7281P80Q163j075K9889P6758J66418
8282A771392J12582N9987R3067J28682J74867K29735J70631J26645J75707J52715
8272C196010K4332j41552j55305k09533j93011j11869o9747m0594k1351L847r068
8261B272159L0993M961P7733J91049J16867N7288Q1980J00291J49135K08285K56227
8250C546968K99542J88373J96471M3839n6999j24434k28466k42072j86656j88137
8240C248429j88231j99265r7261p5797j1607j17596j94436j48575o1335m3588
8230B110738o9381o6132j0674l5823o3065o8642o5709q76j8695k8911l8724Q888
8218A652994m5926q3424j1419L1410n9431m1557j9831k4572j4775l9984p1510
$$ plain form
8207 1271975 1214514 1279657 1326328 1270366 1163488 1035897 1029669 1071021 1014531 998146 1036543
8196 1036543 990294 987563 1006119 963561 924055 892554 829251 779756 830539 864915 823278 760020
8184 760020 752756 740265 736622 725579 690783 672154 656843 671337 748770 798545 805891 777845
8172 777845 779404 782664 766428 817769 802979 792499 729103 704821 700180 692264 699920 672999 658790
8159 658790 685069 752360 818086 811859 815057 778869 774064 783549 760214 679661 628987 603513
8147 603513 626930 704798 765467 731193 648434 637194 604644 620809 643007 605863 583599 591009
8135 591009 614936 629419 652459 627496 584583 578277 642818 736673 793938 821463 793555 771577
8123 771577 822449 868868 918971 974260 999568 946202 954378 950840 910475 904228 894559 945005
$$ packed form
8207A271975n7461O5143M6671n5962j06878j27591o228M1352n6490j6385L8397
8196A036543m6249k731J8556m2558l9506l1501o3303m9495N0783L4376m1637o3258
8184G60020p264j2491l643j1043l4796j8629j5311J4494P7433M9775P346k8046
8172G77845J559L260j6236N1341j4790j0480o3396k4282m641p916P656k6921j4209
8159F58790K6279O7291O5726o227L198l6188m805R485k3335q0553n0674k5474
8147F03513K3417P7868O0669l4274q2759j1240l2550J6165K2198l7144k2264P410
8135E91009K3927J4483K3040k4963m2913o306O4541R3855N7265K7525k7908k1978
8123G71577N0872M6419N0103N5289K5308n3366Q176l538m0365o247r669N0446
$$ plain form
8111 945005 989661 978793 1028617 1090606 1109760 1193716 1287107 1390863 1521619 1664172 1793486
8100 1793486 1886580 2080853 2267628 2433018 2608178 2764146 2786490 2753876 2661676 2571419
8090 2571419 2425332 2289276 2086448 1864331 1675912 1510464 1429336 1372716 1298319 1254838
8080 1254838 1174935 1136036 1121368 1092730 1028366 944978 889694 849958 800517 793007 770284 723601
8068 723601 761041 799931 753222 712822 746995 789748 761244 746591 765375 728169 732239 645749
8056 645749 612706 635296 628889 578203 548940 549322 641139 641514 550491 465329 459041 483376 481910
8043 481910 497566 422307 369790 345193 350089 365347 319534 323036 400822 402804 401618 459838
8031 459838 497820 462939 447298 392137 338821 359216 380187 392145 372869 342072 305528 303422
$$ packed form
8111I45005M4656j0868M9824O1989J9154Q3956R3391J03756J30756J42553J29314
8100A793486R3094J94273J86775J65390J75160J55968K2344l2614r2200r0257
8090B571419j46087j36056k02828k22117j88419j65448q1128n6620p4397m3481
8080A254838p9903l8899j4668k8638o4364q3388n5284l9736m9441p510k2723m6683
8068G23601L7440L8890m6709m0400L4173M2753k8504j4653J8784l7206M070q6490
8056F45749l3043K2590o407n0686k9263L82R1817L75r1023q5162o288K4335j466
8043D81910J5656p5259n2517k4597M896J5258m5813L502P7786J982j186N8220
8031D59838L7982l4881j5641n5161n3316K0395K0971J1958j9276l0797l6544k106
$$ plain form
8019 303422 281442 294351 331069 297531 259792 250735 239296 250690 248999 266654 308540 314787
8007 314787 318907 362058 392551 372995 367414 399137 405396 369466 333476 320672 308932 302200
7995 302200 338236 281384 257841 228827 258841 305949 296973 281572 305543 318901 289090 258603
7983 258603 254101 246238 224904 224250 288481 320341 266207 224151 214821 263588 312696 313038 281163
7970 281163 239022 229052 229054 261412 301783 295037 323223 326262 365484 333035 301417 272313 280824
7957 280824 374362 404819 421821 393348 368756 362583 339361 265212 276778 306474 338090 362062
7945 362062 345156 322175 305572 312556 283500 255162 270214 298496 256417 201537 243394 315311
7933 315311 354996 363050 342992 282355 272950 300657 339112 352117 341867 349083 318332 279942
$$ packed form
8019C03422k1980J2909L6718l3538l7739r057j1439J1394j691J7655M1886O247
8007C14787M120M3151L0493j9556n581L1723O259l5930l5990j2804j1740o732
7995C02200L6036n6852k3543k9014L0014M7108q976j5401K3971J3358k9811l0487
7983B58603m502p863k1334o54O4231L1860n4134m2056r330M8767M9108L42l1875
7970B81163m2141r970KL2358M0371o746K8186L039L9222l2449l1618k9104Q511
7957B80824R3538L0457J7002k8473k4592o173k3222p4149J1566K9696L1616K3972
7945C62062j6906k2981j6603O984k9056k8338J5052K8282m2079n4880M1857P1917
7933C15311L9685Q054k0058o0637r405K7707L8455J3005j0250P216l0751l8390
$$ plain form
7921 279942 240220 194970 147935 160556 202883 227577 262155 203003 199177 255648 236289 225593
7909 225593 273345 274930 232987 190941 180707 198132 217139 232626 280228 308302 283608 251759
7897 251759 257180 261661 259861 193982 165432 185933 166870 135015 78155 137670 204525 213684
7885 213684 217006 198585 184592 209154 205246 184579 160899 169609 207859 199318 198288 218865 163250
7872 163250 104274 47958 57670 98267 195783 247203 205423 161981 125193 100695 99482 84822
7860 84822 48399 34057 64639 83613 126098 123180 83683 113491 141477 154730 185848 190572
7848 190572 201260 190769 139179 124196 137315 82358 58977 114248 209014 158838 126309 107083
7836 107083 111540 154189 152627 138190 192164 158059 94895 29136 47110 129089 149348 148130
$$ packed form
7921B79942l9722m5250m7035J2621M2327K4694L4578n9152l826N6471j9359j0696
7909B25593M7752J585m1943m2046j0234J7425J9007J5487M7602K8074k4694l1849
7897B51759N421M481j800o5879k8550K0501j9063l1855n6860N9515O6855R159
7885B13684L322j8421j3993K4562l908k0667k3680Q710L8250q541j030K0577n5615
7872A63250n8976n6316R712M0597R7516N1420m1780m3442l6788k4498j213j4660
7860H4822l6423j4342L0582J8974M2485k918l9497K9808K7986J3253L1118M724
7848A90572J0688j0491n1590j4983J3119n4957k3381N5271R4766n0176l2529j9226
7836A07083M457M2649j562j4437N3974l4105o3164o5759J7974Q1979K0259j218
$$ plain form
7824 148130 174230 217083 259725 233425 248734 232894 229356 210820 177616 160746 156886 160894
7812 160894 132789 121513 120714 128631 115570 82668 70922 81204 66435 66145 55794 94129 143902
7799 143902 93034 65947 82004 149563 178242 188472 199269 146932 116089 116521 94536 75527
7787 75527 124867 130107 92749 80426 95764 179889 236624 213788 199388 210699 208289 199584
7775 199584 228341 258427 264604 191585 149681 96054 69431 85980 165437 175815 113846 114502
7763 114502 138706 131833 141402 171769 121787 98701 79011 125491 133972 120093 107857 78275
7751 78275 62680 91504 98718 127037 120941 100268 131522 134940 98743 122435 129205 104322 120244
7738 120244 114894 87187 81112 75488 49784 -3822 34613 5448 35329 49722 15017 2132
$$ packed form
7824A48130K6100M2853M2642k6300J5309j5840l538j8536l3204j6870l860M008
7812A60894k8105j1276p99P917j3061l2902j1746J0282j4769k90j0351L8335M9773
7799A43902n0868k7087J6057O7559K8679J0230J0797n2337l0843M32k1985j9009
7787G5527M9340N240l7358j2323J5338Q4125N6735k2836j4400J1311k410q705
7775A99584K8757L0086O177p3019m1904n3627k6623J6549P9457J0378o1969O56
7763A14502K4204o873R569L0367m9982k3086j9690M6480Q481j3879j2236k9582
7751G8275j5595K8824P214K8319o096k0673L1254L418l6197K3692O770k4883J5922
7738A20244n350k7707o075n624k5704n3606L8435k9165K9881J4393l4705j2885
$$ plain form
7726 2132 24911 47550 23202 44650 68417 23221 15011 14555 43439 51324 69594 48967 38565
7713 38565 34977 19902 -340 -7223 -25152 4160 47097 58953 119002 104993 68499 32874
7701 32874 -7434 -87853 -62128 -15002 -546 -479 7187 25944 15836 -25874 -5768 28027 9202
7688 9202 41847 77901 67924 39396 29450 112876 124114 106869 86397 56935 71274 -5120
7676 -5120 -11567 79982 181118 172630 140348 141400 78956 66411 49758 26087 68085 86747
7664 86747 53972 20687 29841 58206 70153 57382 36562 99943 95510 42531 34153 22859
7652 22859 57584 81953 63193 72930 35696 31935 71164 92233 11520 -3696 57301 31421
7640 31421 -63855 -54778 -58492 -79857 -87898 -37311 -13466 80833 140315 71577 -9464 7976
$$ packed form
7726B132K2779K2639k4348K1448K3767m5196q210m56K8884P885J8270k0627j0402
7713C8565l588j5075k0242o883j7929K9312M2937J1856O0049j4009l6494l5625
7701C2874m0308q0419K5725M7126J4456O7P666J8757j0108m1710K0106L3795j8825
7688I202L2645L6054r977k8528r946Q3426J1238j7245k0472k9462J4339p6394
7676e120o447R1549J01136q488l2282J052o2444j2545j6653k3671M1998J8662
7664H6747l2775l3285R154K8365J1947j2771k0820O3381m433n2979q378j1294
7652B2859L4725K4369j8760R737l7234l761L9229K1069q0713j5216O0997k5880
7640C1421r5276R077l714k1365q041N0587K3845R4299N9482o8738q1041J7440
$$ plain form
7628 7976 23447 54487 91503 144721 201473 158923 74705 -2455 -3109 -63491 -90758 -69114
7616 -69114 -31610 -3561 33796 28949 11241 -480 -6776 5876 27333 16448 -9203 15038
7604 15038 52498 82400 20334 2020 15366 11491 65047 54986 33714 57799 -13552 -53655
7592 -53655 -32854 17998 75954 44653 50291 74294 76058 74149 51049 98304 128920 80928
7580 80928 54458 31987 43006 53483 17210 -25319 -74425 -113401 -93009 -38803 -23075 -9928
7568 -9928 -72067 -92848 -28813 -18017 -36636 -56020 -83230 -105823 -137993 -139445 -107027 -8817
7556 -8817 30193 62612 78651 96903 62430 33100 27358 62486 64155 40172 54807 109009
7544 109009 92002 23354 -59787 -49521 -29297 -22840 15170 19152 -4501 39332 34779 -8720
$$ packed form
7628G976J5471L1040L7016N3218N6752m2550q4218p7160o54o0382k7267K1644
7616f9114L7504K8049L7357m847j7708j1721o296J2652K1457j0885k5651K4241
7604A5038L7460K9902o2066j8314J3346l875N3556j0061k1272K4085p1351m0103
7592e3655K0801N0852N7956l1301N638K4003J764j909k3100M7255L0616m7992
7580H0928k6470k2471J1019J0477l6273m2529m9106l8976K0392N4206J5728J3147
7568i928o2139k0781O4035J0796j8619j9384k7210k2593l2170j452L2418R8210
7556h817L9010L2419J6039J8252l4473k9330n742L5128J669k3983J4635N4202
7544A09009j7007o8648q3141J0266K0224O457L8010L982k3653M3833m553m3499
$$ plain form
7532 -8720 66 42605 92360 110025 94308 117779 122318 63198 76698 81114 89361 98783 95278
7519 95278 58503 86525 93545 38550 6610 13091 -8689 49555 64749 31148 -25656 -39930
7507 -39930 33916 68312 90629 87219 74906 42327 26976 48801 92451 113885 82957 41623
7495 41623 14371 -18689 5572 22779 -9097 -1893 -32220 -45898 26658 47206 27732 41671
7483 41671 95320 63933 97802 71132 83436 81898 76548 85684 38716 -28033 -6046 21531
7471 21531 14896 -19456 -31450 -25692 -16266 2129 94234 128770 74158 36165 -8427 -5431 12227
7458 12227 4452 -2851 -40442 -15887 20054 17750 -9700 -68529 -67723 -70938 -36262 41764 72620
7445 72620 66646 24414 -42909 -36054 33817 90265 127262 122465 117981 133905 107539 65863 61354
$$ packed form
7532h720Q786M2539M9755J7665j5717K3471M539n9120J3500M416Q247R422l505
7519I5278l6775K8022P020n4995l1940O481k1780N8244J5194l3601n6804j4274
7507c9930P3846L4396K2317l410j2313l2579j5351K1825M3650K1434l0928m1334
7495D1623k7252l3060K4261J7207l1876P204l0327j3678P2556K0548j9474J3939
7483D1671N3649l1387L3869k6670J2304j538n350R136m6968o6749K1987K7577
7471B1531o635l4352j1994N758R426J8395R2105L4536n4612l7993m4592K996J7658
7458A2227p775p303l7591K4555L5941k304k7450n8829Q06l215L4676P8026L0856
7445G2620n974m2232o7323O855O9871N6448L6997m797m484J5924k6366m1676m509
$$ plain form
7432 61354 52325 -10685 -61364 -26102 48176 36807 30851 -32354 -72566 -39927 2955 22321
7420 22321 28052 -20580 -9320 -26617 -17136 -18222 41612 31303 12772 -1459 -54067 -27262
7408 -27262 -8867 -21039 -53868 -10001 20560 10026 28033 10772 2538 -1673 7776 82964
7396 82964 102787 94026 98579 64099 7970 -31929 -21247 28473 29612 23104 40108 -6530 -62809
7383 -62809 -118827 -84753 -27086 -2878 -4325 4265 -9927 -4501 2528 41093 22282 49341 -3357
7370 -3357 -56542 -57631 27397 54691 25812 1385 4716 18317 59405 74274 23736 48587
7358 48587 12572 8705 78955 97699 38431 -10700 -36189 -5274 32483 68221 90022 84700
7346 84700 102628 118472 50186 1341 57406 73614 37394 44340 57853 50813 21216 5353
$$ packed form
7432F1354r029o3010n0679L5262P4278j1369n956o3205m0212L2639M2882J9366
7420B2321N731m8632J1260j7297R481j086N9834j0309j8531j4231n2608K6805
7408b7262J8395j2172l2829M3867L0561j0534J8007j7261q234m211R449P5188
7396H2964J9823q761M553l4480n6129l9899J0682M9720J139o508J7004m6638n6279
7383f2809n6018L4074N7667K4208j447Q590j4192N426P029L8565j8811K7059n2698
7370c357n3185j089Q5028K7294k8879k4427L331J3601M1088J4869n0538K4851
7358D8587l6015l867P0250J8744n9268m9131k5489L0915L7757L5738K1801n322
7346H4700J7928J5844o8286m8845N6065J6208l6220O946J3513p040k9597j5863
$$ plain form
7334 5353 -9850 -35457 -28524 23826 17236 3600 -20954 -82474 -84848 -22975 -39879 -18377 5067
7321 5067 37588 24508 24830 16198 -6095 24856 -13773 3760 -26647 -25534 -50455 -24667 38088
7308 38088 -1147 4969 -18296 -76944 -74175 -46585 -6607 -95061 -163314 -110131 -84881 -136460
7296 -136460 -114857 -27694 -33308 -36554 26738 -16099 13189 38323 90658 93497 113503 110156
7284 110156 11899 -22425 -3829 -23110 -74727 -104087 -108585 -92298 -95595 -114941 -29555 13535
7272 13535 -14470 -23870 -27648 20489 93173 62481 10619 -18420 -29331 -29376 -69987 -69596 -36473
7259 -36473 -39835 -1431 -39667 -25105 -862 -27080 -14841 -23737 -30600 -59371 -62387 -43669 -32592
7246 -32592 -38328 -63127 -60808 -2245 -25378 -4256 -38934 -74724 -71631 -52903 -80789 -57824
$$ packed form
7334E353j5203k5607O933N2350o590j3636k4554o1520k374O1873j6904K1502K3444
7321E067L2521j3080L22q632k2293L0951l8629J7533l0407J113k4921K5788O2755
7308C8088l9235O116k3265n8648K769K7590L9978q8454o8253N3183K5250n1579
7296a36460K1603Q7163n614l246O3292m2837K9288K5134N2335K839K0006l347
7284A10156r8257l4324J8596j9281n1617k9360m498J6287l297j9346Q5386M3090
7272A3535k8005r400l778M8137P2684l0692n1862k9039j0911m5m0611L91L3123
7259c6473l362L8404l8236J4562K4243k6218J2239q896o863k8771l016J8718J1077
7246c2592n736k4799K319N8563k3133K1122l4678l5790L093J8728k7886K2965
$$ plain form
7234 -57824 -10860 9869 -5329 -50104 -95521 -51646 -8400 4767 -21169 2661 39615 30195
7222 30195 -15611 -30261 -23696 22645 -2010 -11879 -5533 -33571 -9747 -603 7412 -40846 -32581
7209 -32581 -12791 3455 -20899 -39060 11501 35535 34963 -6823 -56533 -65575 -5010 4203 -27534
7196 -27534 -82798 -107382 -49378 -30692 -26012 -37152 -3416 2163 30947 2407 -15678 -18858
7184 -18858 -63808 -68670 -60802 -39570 -30162 -58519 -34600 30670 60268 55040 44506 29739 -30218
7171 -30218 -33762 -10801 -49844 -117812 -53768 14601 14347 -2386 -14979 19515 7998 5056 2870
7158 2870 18010 53651 73967 24784 35883 12974 -30465 -56189 -58319 -9959 -16887 3661
7146 3661 34207 36838 -7152 10962 43099 37756 9281 -14808 -76170 -71165 -72742 -53596 7429
$$ packed form
7234e7824M6964K0729j5198m4775m5417M3875M3246J3167k5936K3830L6954r420
7222C0195m5806j4650O565M6341k4655r869O346k8038K3824R144Q015m8258Q265
7209c2581J9790J6246k4354j8161N0561K4034n72m1786m9710r042O0565R213l1737
7196b7534n5264k4584N8004J8686M680j1140L3736N579K8784k8540j8085l180
7184a8858m4950m862P868K1232R408k8357K3919O5270K9598n228j0534j4767n9957
7171c0218l544K2961l9043o7968O4044O8369k54j6733j2593L4494j1517k942k186
7158B870J5140L5641K0316m9183J1099k2909m3439k5724k130M8360o928K0548
7146C661L0546K631m3990J8114L2137n343k8475k4089o1362N005j577J9146O1025
$$ plain form
7133 7429 12644 -36253 -15553 22156 3494 -21672 -39110 -17429 -22080 12155 35044 -3098
7121 -3098 35515 72910 106203 100882 84286 18903 -37208 -49349 -67775 -96488 -70769 -76756
7109 -76756 -85285 -40022 -87299 -100266 -77273 -45435 -18259 -19273 -10311 -56710 -96190 -68779
7097 -68779 -80145 -74584 -63825 -39540 -43631 -72343 -64445 -35107 -81534 -159776 -156229 -123730 -99608
7084 -99608 -66362 -25744 75143 123911 86475 62510 52554 20550 28457 71332 72814 39638
7072 39638 -12422 -72262 -82030 -39316 8507 -32629 -66265 -39936 -38974 -77438 -14420 60606
7060 60606 55515 44159 18744 62404 112416 140629 114897 53261 30712 16991 1357 53194
7048 53194 66484 57753 14923 3706 -15012 -33343 19763 -9889 -24954 7323 21562 -2808
$$ packed form
7133G429N215m8897K0700L7709j8662k5166j7438K1681m651L4235K2889l8142
7121c098L8613L7395L3293n321j6596o5383n6111j2141j8426k8713K5719n987
7109g6756q529M5263m7277j2967K2993L1838K7176j014Q962m6399l9480K7411
7097f8779j1366N561J0759K4285m091k8712P898K9338m6427p8242L547L2499K4122
7084i9608L3246M0618J00887M8768l7436k3965r956l2004P907M2875J482l3176
7072C9638n2060n9840r768M2714M7823m1136l3636K6329R62l8464O3018P5026
7060F0606n091j1356k5415M3660N0012K8213k5732o1636k2549j3721j5634N1837
7048E3194J3290q731m2830j1217j8718j8331N3106k9652j5065L2277J4239k4370
$$ plain form
7036 -2808 -21908 -86421 -103612 -17505 -10503 -21884 -43558 -77210 -87561 -77891 -65893 -7239
7024 -7239 80108 84805 10182 13765 -22531 -97303 -139951 -146056 -113185 -87841 -80861 -42120 30359
7011 30359 25935 -34660 -38596 -72037 -92386 -77342 -122328 -159535 -144993 -133743 -115129 -83133
6999 -83133 -89694 -54024 -11491 26014 3842 -8249 15214 -4072 -23362 -24344 109 -3357 -21019
6986 -21019 -37016 -41983 -51154 -29075 -39612 -46749 -46160 -5392 14448 24329 37204 2531 -16161
6973 -16161 30653 55075 65145 55625 19914 -9814 16774 10674 37552 45767 60278 46810
6961 46810 29492 -14605 -47304 616 -45607 -9645 -45554 -57528 -23556 -8114 -21470 -10490
6949 -10490 -42200 -41443 4494 -2739 12463 67257 51858 -7252 -38663 -34453 -15390 -7175 18493
$$ packed form
7036b808j9100o4513j7191Q6107P002j1381k1674l3652j0351R670J1998N8654
7024g239Q7347M697p4623L583l6296p4772m2648o105L2871K5344O980L8741P2479
7011C0359m424o0595l936l3441k0349J5044m4986l7207J4542J1250J8614L1996
6999h3133o561L5670M2533L7505k2172j2091K3463j9286j9290r82K4453l466j7662
6986b1019j5997m967r171K2079j0537p137N89M0768J9840R881J2875l4673j8692
6973a6161M6814K4422J0070r520l5711k9728K6588o100K6878Q215J4511j3468
6961D6810j7318m4097l2699M7920m6223L5962l5909j1974L3972J5442j3356J0980
6949a0490l1710P57M5937p233J5202N4794j5399n9110l1411M210J9063Q215K5668
$$ plain form
6936 18493 -25729 -80838 -63496 -44842 -56947 -44044 9439 39828 79897 56885 55291 -13305
6924 -13305 -56357 -1264 41823 67715 90152 95263 87807 7350 -26807 -69675 -106140 -114902
6912 -114902 -108521 -77451 -11904 -8696 -22274 -11222 33943 124427 178855 124212 81097 100026
6900 100026 132059 127797 119184 91235 179997 210585 179365 161598 91878 49974 7440 5070
6888 5070 -72432 -83214 -76272 -77628 1162 867 -23779 -29661 -80378 -110981 -104407 -122928 -132841
6875 -132841 -92315 -106194 -92243 -65744 -56308 -14169 -479 -25505 -35919 -49950 -94655 -86787
6863 -86787 -52269 -50064 -19448 18726 -8089 -40966 -33152 360 -57146 -91698 -72524 -68063
6851 -68063 -45899 -36500 -30125 -42376 -47178 -33561 -5374 -8172 -21147 -52531 -47477 -20952 -23015
$$ packed form
6936A8493m4222n5109J7342J8654j2105J2903N3483L0389M0069k3012j594o8596
6924a3305m3052N5093M3087K5892K2437N111p456q0457l4157m2868l6465q762
6912a14902O381L1070O5547L208j3578J1052M5165R0484N4428n4643m3115J8929
6900A00026L2033m262q613k7949Q8762L0588l1220j7767o9720m1904m2534k370
6888E070p7502j0782O942j356P8790k95k4646n882n0717l0603O574j8521r913
6875a32841M0526j3879J3951K6499R436M2139J3690k5026j0414j4031m4705P868
6863h6787L4518K205L0616L8174k6815l2877P814L3512n7506l4552J9174M461
6851f8063K2164R399O375j2251m802J3617K8187k798j2975l1384N054K6525k063
$$ plain form
6838 -23015 13162 35796 79508 82123 90370 83981 62361 -464 -73776 -136376 -137404 -59447 -47876
6825 -47876 -148354 -140461 -128410 -55243 -8786 -31215 -62482 -63123 -55433 -88787 -60055 -85882
6813 -85882 -73175 -56897 16970 36313 5323 5523 -14759 -62546 -70804 -34062 -28671 -20006 -23644
6800 -23644 -33832 -51556 -41572 -3929 9340 -54568 -96061 -87930 -96258 -37829 -15761 -28145
6788 -28145 -48778 -52316 -67146 -103836 -110404 -121257 -113319 -64692 -27325 21133 25774 9615 -47944
6775 -47944 -67202 -58495 -75953 -62147 -29084 -65186 -91957 -102840 -65290 -94194 -129315 -112933
6763 -112933 -51473 -31625 -73144 -68265 -91921 -109828 -119990 -55969 -27764 -7569 42913 36552
6751 36552 -16531 -43659 -65983 273 76699 63305 71487 44500 39478 45347 27889 14359
$$ packed form
6838b3015L6177K2634M3712K615Q247o389k1620o2825p3312o2600j028P7957J1571
6825d7876j00478P893J2051P3167M6457k2429l1267o41P690l3354K8732k5827
6813h5882J2707J6278P3867J9343l0990K00k0282m7787q258L6742N391Q665l638
6800b3644j0188j7724R984L7643J3269o3908m1493Q131q328N8429K2068j2384
6788b8145k0633l538j4830l6690o568j0853P938M8627L7367M8458M641j6159n7559
6775d7944j9258Q707j7458J3806L3063l6102k6771j0883L7550k8904l5121J6382
6763a12933O1460J9848m1519M879k3656j7907j0162O4021K8205K0195N0482o361
6751C6552n3083k7128k2324O6256P6426j3394Q182k6987n022N869j7458j3530
$$ plain form
6739 14359 -22875 -82050 -102579 -78124 -46954 -4864 70859 104995 86495 56341 25723 38002
6727 38002 56437 76281 42342 48195 52946 17913 19377 18429 49634 66609 37769 -45512 -43424
6714 -43424 -54296 -36640 40257 49479 59040 47243 77851 44869 -901 19106 10947 -19310
6702 -19310 -14996 4634 7758 -19377 -82595 -84932 -27927 -17992 -12650 -54044 -44304 -27610 -24149
6689 -24149 -35714 -61591 -62426 26027 76047 90961 64918 16293 22423 5630 -22122 -17473 30111
6676 30111 68745 42924 19990 23518 -11172 -20191 -14743 -81194 -62522 -42299 -56535 -49303 -60711
6663 -60711 -70859 -75714 -59225 -46114 -80250 -73737 -73767 -64964 -54220 -39960 -35315 -58873 -75482
6650 -75482 -53016 -77112 -131155 -50296 68023 59887 -29353 -57264 -5377 19938 1245 -15447
$$ packed form
6739A4359l7234n9175k0529K4455L1170M2090P5723L4136j8500l0154l0618J2279
6727C8002J8435J9844l3939N853M751l5033J464r48L1205J6975k8840q3281K088
6714d3424j0872J7656P6897R222R561j1797L0608l2982m5770K0007q159l0257
6702a9310M314J9630L124k7135o3218k337N7005R935N342m1394R740J6694L461
6689b4149j1565k5877q35Q8453N0020J4914k6043m8625O130j6793k7752M649M7584
6676C0111L8634k5821k2934L528l4690r019N448o6451J8672K0223j4236P232j1408
6663f0711j0148m855J6489J3111l4136O513l0Q803J0744J4260M645k3558j6609
6650g5482K2466k4096n4043Q0859J18319q136q9240k7911N1887K5315j8693j6692
$$ plain form
6638 -15447 -26487 -487 7459 11832 -3683 -44524 -34388 -24421 -57607 -90657 -76091 -25995
6626 -25995 -10794 5474 22395 94205 59390 24770 12284 20339 -377 32218 33522 32504
6614 32504 27821 -20219 -59996 -51883 -1466 2090 -11064 -8220 -44444 -75708 -70654 -70084 -85865
6601 -85865 -64641 -85204 -153772 -100006 -82355 -134281 -140050 -125835 -99525 -122334 -158506 -129084
6589 -129084 -38568 -15573 -52144 -74244 -77013 -19306 9288 19667 21644 32594 5173 -36979
6577 -36979 -27413 -15950 -1443 -979 -14071 -14554 4267 12603 -62546 -78892 -101331 -101808 1263
6564 1263 -8289 -32618 8221 -39512 -50606 -23742 -29219 5845 -3558 7053 44257 96195 74075
6551 74075 90375 57645 15128 -37114 -35171 -29547 14995 -10572 -82044 -65014 -48403 -64946
$$ packed form
6638a5447j1040K6000P946M373j5515m0841J0136R967l3186l3050J4566N0096
6626b5995J5201J6268J6921P1810l4815l4620j2486Q055k0716L2595J304j018
6614C2504m683m8040l9777Q113N0417L556j3154K844l6224l1264N054N70j5781
6601h5865K1224k0563o8568N3766J7651n1926n769J4215K6310k2809l6172K9422
6589a29084R0516K2995l6571k2100k769N7707K8594J0379J977J0950k7421m2152
6577c6979R566J1463J4507M64j3092m83J8821Q336p5149j6346k2439m77J03071
6564A263r552k4329M0839m7733j1094K6864n477L5064r403J0611L7204N1938k2120
6551G4075J6300l2730m2517n2242J943N624M4542k5567p1472J7030J6611j6543
$$ plain form
6539 -64946 -57560 -26525 -36481 -30661 -1916 15108 56624 46182 12447 36844 59071 31445
6527 31445 -8422 11580 50831 13870 -10730 -29557 -13681 -84 58166 27601 -31084 -23109
6515 -23109 14711 -11081 -38581 -32743 -44016 -29530 -46953 -71747 -83596 -31034 18015 -40135
6503 -40135 -101426 -111520 -141898 -140966 -76352 -26118 -34679 -34299 -51884 -29956 -48541 -81819 -40829
6490 -40829 -37472 -106311 -103588 -66353 -72117 -47401 -77827 -105228 -86606 -25389 -40292 -121621
6478 -121621 -106362 -93790 -115466 -89067 24708 53974 38132 31552 9220 9103 -78176 -101491
6466 -101491 -105257 -102114 -45241 -91613 -115330 -90849 -35888 -28625 -62070 -27484 55951 13150
6454 13150 9788 -15978 -16727 -15328 -4455 18666 39075 36976 39550 19111 21689 -10463 -32489
$$ packed form
6539f4946P386L1035r956N820K8745J7024M1516j0442l3735K4397K2227k7626
6527C1445l9867K0002L9251l6961k4600j8827J5876J3597N8250l0565n8685P975
6515b3109L7820k5792k7500N838j1273J4486j7423k4794j1849N2562M9049n8150
6503d0135o1291j0094l0378R32O4614N0234q561L80j7585K1928j8585l3278M0990
6490d0829L357o8839K723L7235n764K4716l0426k7401J8622O1217j4903q1329
6478a21621J5259J2572k1676K6399J13775K9266j5842o580k2332j17q7279k3315
6466a01491l766L143N6873m6372k3717K4481N4961P263l3445L4586Q3435m2801
6454A3150l362k5766p49J399J0873K3121K0409k099K574k0439K578l2152k2026
$$ plain form
6441 -32489 -23950 -1431 -41762 -68916 -58639 -27835 15148 35570 12960 -36646 -28303 2821
6429 2821 41222 50637 46835 31877 104865 104801 38469 12809 16088 13453 38891 51757 13841
6416 13841 -7146 -34034 -79825 -141186 -170678 -150131 -106814 -13006 19042 -19014 -22447 -2290
6404 -2290 -17958 -46678 -45805 40919 134224 138933 85193 15304 -72263 -45375 12221 1588 15905
6391 15905 -7620 -51064 -62001 -56744 -26398 50276 107140 58193 7567 20531 38855 22421
6379 22421 28120 72617 32381 -19876 -7709 10368 41866 4341 -53018 -49768 4331 55180
6367 55180 26236 -3664 -66615 -69493 -71586 -34799 -37567 -72509 -34875 -15131 5836 23904
6355 23904 18253 27985 -19648 -37886 -67441 -42845 -1376 23721 -35339 -85519 18142 16917
$$ packed form
6441c2489Q539K2519m0331k7154J0277L0804M2983K0422k2610m9606Q343L1124
6429B821L8401R415l802j4958P2988o4o6332k5660L279k635K5438J2866l7916
6416A3841k0987k6888m5791o1361k9492K0547M3317R3808L2048l8056l433K0157
6404b290j5668k8720Q73Q6724R3305M709n3740o9889q7567K6888N7596j0633J4317
6391A5905k3525m3444j0937N257L0346P6674N6864m8947n0626J2964J8324j6434
6379B2421N699M4497m0236n2257J2167J8077L1498l7525n7359L250N4099N0849
6367E5180k8944k9900o2951k878k093L6787k768l4942L7634J9744K0967J8068
6355B3904n651R732m7633j8238k9555K4596M1469K5097n9060n0180J03661j225
$$ plain form
6343 16917 -4680 51837 79899 45632 51304 57923 39751 7886 -45012 -93612 -48558 11655
6331 11655 34711 40379 17277 16895 43358 16099 -26939 -56716 -71931 -64934 -18792 -21656 -18361
6318 -18361 -29341 -36255 8330 27059 84109 45059 -1439 -60418 -6790 -10156 -22856 -64536
6306 -64536 -119667 -176018 -144349 -113726 -128237 -143271 -91766 -20474 45752 64147 89164 87358
6294 87358 77778 29991 -19522 -33800 -20253 -16905 -23161 4029 -4695 -12344 -28345 -48032 -51535
6281 -51535 -27255 35653 37373 18309 6846 -24951 -16024 56531 63741 -6427 -11476 -61299 -98566
6268 -98566 -61953 -14570 23764 18533 40280 66994 77375 43844 -16409 -37849 -29728 -7429
6256 -7429 26563 -14532 -45162 -63718 -33290 12019 48313 46347 4327 -17842 19293 60406
$$ packed form
6343A6917k1597N6517K8062l4267N672O619j8172l1865n2898m8600M5054O0213
6331A1655K3056N668k3102l82K6463k7259m3038k9777j5215O997M6142k864L295
6318a8361j0980o914M4585J8729N7050l9050m6498n8979N3628l366j2700m1680
6306f4536n5131n6351L1669L0623j4511j5034N1505P1292O6226J8395K5017j806
6294H7358r580m7787m9513j4278J3547L348o256K7190q724p649j6001j9687l503
6281e1535K4280O2908J720j9064j1463l1797Q927P2555P210p0168n049m9823l7267
6268i8566L6613M7383L8334n231K1747K6714J0381l3531o0253k1440Q121K2299
6256g429L3992m1095l0630j8556L0428M5309L6294j966m2020k2169L7135M1113
$$ plain form
6244 60406 55537 60249 23341 -25525 -49039 9022 29168 20543 14460 22727 -17970 -63426 -67881
6231 -67881 -19911 -26241 -23976 -786 40956 29296 -21259 7125 69827 92948 87867 51854
6219 51854 -16257 -65194 -32885 11816 31174 46185 83897 90889 68487 37222 -6769 -27278
6207 -27278 -24541 4293 -20762 9832 5571 15168 -8727 -1688 -2053 60117 43718 -17341 -28018
6194 -28018 2544 32864 41721 73028 101685 31812 35364 27854 19502 -9144 -46267 -22712 10292
6181 10292 -8669 -46873 -33222 -37122 -37968 38639 72255 64615 45215 -17202 -4589 5467 47352
6168 47352 53312 4827 14065 -41062 -73871 -69290 -48039 -48413 -82452 -71240 -41118 -42731 -61858
6155 -61858 -60573 -59941 -73377 -40499 -81574 -110764 -37359 2245 26558 30154 9369 -48958 -97042
$$ packed form
6244F0406m869M712l6908m8866k3514N8061K0146q625o083Q267m0697m5456m455
6231f7881M7970o330K265K3190M1742j1660n0555K8384O2702K3121n081l6013
6219E1854o8111m8937L2309M4701J9358J5011L7712O992k2402l1265m3991k0509
6207b7278K737K8834k5055L0594m261R597k3895P039l65O2170j6399o1059j0677
6194b8018L0562L0320Q857L1307K8657o9873L552p510q352k8646l7123K3555L3004
6181A0292j8961l8204J3651l900q46P6607L3616p640j9400o2417J2613J0056M1885
6168D7352N960m8485R238n5127l2809M581K1251l74l4039J1212L0122j613j9127
6155f1858J285O32j3436L2878m1075k9190P3405L9604K4313L596k0785n8327m8084
$$ plain form
6142 -97042 -137485 -109597 -118368 -128942 -61741 -13640 -25402 -33885 -17419 36447 43243 -21379
6130 -21379 -58651 -27545 23006 9784 -1696 -56552 -75007 -55265 -69595 -75662 -44398 -9343
6118 -9343 980 -27599 -18924 2876 2813 -4298 28924 12968 -43029 -68716 48025 76302 46387
6105 46387 -17302 -78988 -66259 -33823 -80473 -34158 -19795 -9411 38365 26824 31015 7523
6093 7523 -31489 -42047 -20416 24831 12320 -41251 -88814 -96305 -31844 -5731 18095 45213
6081 45213 10721 -20241 -36924 -109250 -155006 -149646 -125873 -18717 27425 34378 41950 -7363
6069 -7363 -68338 -28496 -9350 -23586 15949 68493 55054 19942 -6590 -2410 14669 9097
6057 9097 -28444 -65085 -75947 3326 46345 24324 -20640 -59875 -98155 -98113 -54394 -27630 -13897
$$ packed form
6142i7042m0443K7888q771j0574O7201M8101j1762q483J6466N3866O796o4622
6130b1379l7272L1106N0551j3222j1480n4856j8455J9742j4330o067L1264L5055
6118i343J0323k8579Q675K1800o3p111L3222j5956n5997k5687J16741K8277k9915
6105D6387o3689o1686J2729L2436m6650M6315J4363J0384M7776j1541M191k3492
6093G523l9012j0558K1631M5247j2511n3571m7563p491O4461K6113K3826K7118
6081D5213l4492l0962j6683p2326m5756N360K3773J07156M6142O953P572m9313
6069g363o0975L9842J9146j4236L9535N2544j3439l5112k6532M180J7079n572
6057I097l7541l6641j0862P9273M3019k2021m4964l9235l8280M2M3719K6764J3733
$$ plain form
6044 -13897 -40037 -44203 -66650 -33990 -26333 -77688 -54299 7431 4856 24392 2119 -22403
6032 -22403 6391 -14930 31780 1838 -27743 -27622 -4926 -22603 -48650 -15959 -22187 -27536 -41021
6019 -41021 -30291 -15222 -30804 -48989 -34856 18491 22465 -4787 37198 52884 16770 2782
6007 2782 -34435 -5947 19872 -52885 -28671 -23175 -35171 10826 4598 5221 39765 93778 97886
5994 97886 81680 18328 -43582 -48405 -52468 -18013 -4101 -18944 -40749 -52596 -68943 -59900
5982 -59900 -25227 -9990 -40383 -75676 -91830 -105669 -107986 -104770 -83781 -68872 -82773 -104903
5970 -104903 -51431 3104 14151 -29998 -24466 -9718 18872 44622 26428 31964 27549 -38075
5958 -38075 -84171 -109682 -64175 -14229 23097 16981 -22212 -75200 -54197 -2807 -10975 -56020
$$ packed form
6044a3897k6140m166k2447L2660P657n1355K3389O1730k575J9536k2273k4522
6032b2403K8794k1321M6710k9942k9581J21K2696j7677k6047L2691o228n349j3485
6019d1021J0730J5069j5582j8185J4133N3347L974k7252M1985J5686l6114j3988
6007B782l7217K8488K5819p2757K4214N496j1996M5997o228O23L4544N4013M108
5994I7886j6206o3352o1910m823m063L4455J3912j4843k1805j1847j6347R043
5982e9900L4673J5237l0393l5293j6154j3839k317L216K0989J4909j3901k2130
5970a04903N3472N4535J1047m4149N532J4748K8590K5750j8194N536m415o5624
5958c8075m6096k5511M5507M9946L7326o116l9193n2988K1003N1390q168m5045
$$ plain form
5946 -56020 -7161 60148 84443 45230 37529 87255 62301 7336 22558 33320 -10626 -61337
5934 -61337 -137012 -145710 -92551 -55400 -22248 -39605 -17381 -39303 -95485 -53084 -2799 -10277
5922 -10277 -3386 11810 -8120 -76530 -115353 -63379 -46392 -66553 -114721 -124927 -46077 -8362
5910 -8362 -10547 -23773 -18872 8424 69676 64576 24900 -22315 -10382 36135 -26992 -74968 -53597
5897 -53597 -12757 -15632 789 10219 -39752 -27227 -41680 -57576 -12999 -14093 -940 10732
5885 10732 -35054 -49642 -16514 -8140 -36561 -41130 -26586 -97839 -125816 -105935 -101519 -88995
5873 -88995 -29885 21960 -65858 -91357 -29141 4546 -2688 13911 2397 -20204 -44220 -62929
5861 -62929 -20988 2307 9001 3871 -18449 -28067 -25428 -35144 1392 37448 30362 -2770 -10890
$$ packed form
5946e6020M8859O7309K4295l9213p701M9726k4954n4965J5222J0762m3946n0711
5934f1337p5675q698N3159L7151L3152j7357K2224k1922n6182M2401N0285p478
5922a0277O891J5196j9930o8410l8823N1974J6987k0161m8168j0206P8850L7715
5910h362k185j3226M901K7296O1252n100l9676m7215J1933M6517o3127m7976K1371
5897e3597M0840k875J6421R430m9971J2525j4453j5896M4577j094J3153J1672
5885A0732m5786j4588L3128Q374k8421m569J4544p1253k7977J9881M416J2524
5873h8995N9110N1845q7818k5499O2216L3687p234J6599j1514k2601k4016j8709
5861f2929M1941K3295O694n130k2320r618K639r716L6536L6056p086l3132q120
$$ plain form
5848 -10890 -3268 54923 -20516 -14082 42068 56234 67949 8352 -22798 9204 10872 -7803
5836 -7803 -40549 -18062 11278 -24182 -58195 -41907 -6086 -6920 -10462 10754 65652 59140 29077
5823 29077 22088 13594 -48657 -78509 -99755 -74560 14148 38095 44955 38801 38486 6295 -21622
5810 -21622 15032 56966 39668 5727 -39098 -41137 -14225 63789 73085 20999 -50727 -25139
5798 -25139 12504 -34569 -20885 -1828 -29250 -49577 -118180 -88594 -52689 -76115 -91361 -119184
5786 -119184 -59859 -38355 -8240 13895 -34870 -60582 -57107 -24377 13502 45236 73413 19301
5774 19301 -54953 -72605 -48253 -84536 -54468 -1887 34704 23582 25686 79176 65491 34820
5762 34820 14348 -10028 -32653 -32926 -40294 -75869 -44042 -16061 9060 11177 -4549 19992 28360
$$ packed form
5848a0890P622N8191p5439O434N6150J4166J1715n9597l1150L2002J668j8675
5836g803l2746K2487K9340l5460l4013J6288L5821q34l542K1216N4898o512l0063
5823B9077o989q494o2251k9852k1246K5195Q8708K3947O860o154l15l2191k7917
5810b1622L6654M1934j7298l3941m4825k039K6912P8014R296n2086p1726K5588
5798b5139L7643m7073J3684J9057k7422k0327o8603K9586L5905k3426j5246k7823
5786a19184N9325K1504L0115K2135m8765k5712L475L2730L7879L1734K8177n4112
5774A9301p4254j7652K4352l6283L0068N2581L6591j1122K104N3490j3685l0671
5762C4820k0472k4376k2625k73p368l5575L1827K7981K5121K117j5726K4541Q368
$$ plain form
5749 28360 60959 8537 -4760 -16422 3773 -30458 -63527 -43911 -46631 -21985 -7244 -19727
5737 -19727 -15088 -57488 -95702 -85307 -53337 -61271 -62946 -6575 -46453 -115598 -81944 -10484
5725 -10484 -34168 -59883 -78899 -37517 -22883 -56435 -68000 -59142 -86066 -82031 -35420 1815
5713 1815 -493 9553 15663 7804 40590 3549 8434 -17203 -17819 -42406 -66867 -29841 -6689
5700 -6689 -26394 -43997 -464 8865 -19275 -11717 -54896 -31990 5373 -33214 -45470 -11794
5688 -11794 -5998 -33151 -9211 40471 28126 24024 47803 20044 27147 3266 -9108 1484
5676 1484 25752 62298 56171 35797 34886 -33932 -39339 -12171 -25737 30839 89926 93201 69947
5663 69947 64428 42042 47428 20312 93 -28007 -37849 -41528 -37071 28324 77277 31786 29479
$$ packed form
5749B8360L2599n2422j3297j1662K0195l4231l3069J9616k720K4646J4741j2483
5737a9727M639m2400l8214J0395L1970p934j675N6371l9878o9145L3654P1460
5725a0484k3684k5715j9016M1382J4634l3552j1565Q858k6924M035M6611L7235
5713A815k308J0046O110p859L2786l7041M885k5637o16k4587k4461L7026K3152
5700f689j9705j7603M3533R329k8140P558m3179K2906L7363l8587j2256L3676
5688a1794N796k7153K3940M9682j2345m102K3779k7759P103k3881j2374J0592
5676A484K4268L6546o127k0374r11o8818n407K7168j3566N6576N9087L275k3254
5663F9947n519k2386N386k7116k0219k8100r842l679M457O5395M8953m5491k307
$$ plain form
5650 29479 25360 10257 69794 70499 61348 32838 40616 35342 -353 -29094 -45136 -20768 -9830
5637 -9830 -91747 -106191 -88580 -39451 -1174 16925 65163 37951 -46940 -53441 -34643 -19318
5625 -19318 -37912 -96291 -81193 -61324 -94121 -71606 -13378 -356 40739 6213 -55793 -122504
5613 -122504 -146359 -92102 -17649 -35108 -110163 -30512 12011 12256 -15136 -71417 -75515 21500
5601 21500 46862 5080 -39736 -33891 -33521 -21422 -12740 -39144 -60944 -58423 -61704 -65399 -60178
5588 -60178 -43393 -102301 -100335 -39552 -26022 -63799 -52214 17628 48665 38166 -8790 -34978
5576 -34978 -6916 -2432 10847 3243 -29233 -46201 -22141 -37939 -33324 18607 55811 17577
5564 17577 56949 32198 -30452 -36311 -16469 -22002 4243 53766 84362 5815 -57256 -29751
$$ packed form
5650B9479m119j5103N9537P05r151k8510P778n274l5695k8741j6042K4368J0938
5637i830q1917j4444J7611M9129L8277J8099M8238k7212q4891o501J8798J5325
5625a9318j8594n8379J5098J9869l2797K2515N8228J3022M1095l4526o2006o6711
5613a22504k3855N4257P4453j7459p5055P9651M2523K45k7392n6281m098R7015
5601B1500K5362m1782m4816N845L70J2099Q682k6404k1800K521l281l695N221
5588f0178J6785n8908J966O0783J3530l7777J1585O9842L1037j0499m6956k6188
5576c4978K8062M484J3279p604l2476j6968K4060j5798M615N1931L7204l8234
5564A7577L9372k4751o2650n859J9842n533K6245M9523L0596p8547o3071K7505
$$ plain form
5552 -29751 27139 36425 4427 -8244 7070 23271 4349 -32023 -24036 21463 65491 80116
5540 80116 12319 -51978 -47056 -55863 -23285 30366 45619 15663 44752 22883 -14366 -7814
5528 -7814 -39873 -46276 -63670 -68365 -22068 1789 -36053 -38385 -44707 -25452 -3655 -34746 -65650
5515 -65650 -48657 -35798 -21635 -12376 4707 22612 28908 31410 -332 51149 109304 96762
5503 96762 80013 62893 3665 -44614 -32423 20483 16165 1201 11657 38895 12025 12831
5491 12831 2751 -9988 2239 -6718 4427 36568 72894 93312 102459 71915 106983 72954
5479 72954 18793 51438 94063 70931 58791 65182 8691 -23623 6408 72007 54737 33822
5467 33822 18198 -22422 -10863 6283 64216 73440 57391 -5630 21517 58193 10018 13646
$$ packed form
5552b9751N6890R286l1998j2671J5314J6201j8922l6372P987M5499M4028J4625
5540H0116o7797o4297M922q807L2578N3651J5253k9956K9089k1869l7249O552
5528g814l2059o403j7394m695M6297K3857l7842k332o322J9255K1797l1091l0904
5515f5650J6993J2859J4163R259J7083J7905O296K502l1742N1481N8155j2542
5503I6762j6749j7120n9228m8279J2191N2906m318j4964J0456K7238k6870Q06
5491A2831j0080j2739J2227q957J1145L2141L6326K0418R147l0544L5068l4029
5479G2954n4161L2645M2625k3132j2140O391n6491l2314L0031O5599j7270k0915
5467C3822j5624m0620J1559J7146N7933R224j6049o3021K7147L6676m8175L628
$$ plain form
5455 13646 -10728 -90066 -91698 -79375 -33766 -1681 -2634 -41564 -31153 -38328 -36826 -48596 7076
5442 7076 27830 -14799 -38638 -55250 -77617 -46730 -26493 -54336 -8081 26841 13798 23343
5430 23343 29653 -23434 -20654 -54051 -109542 -112734 -70752 -79850 -120426 -133077 -105769 -33667 -48106
5417 -48106 -16068 -2229 47805 65945 -17577 -97884 -77573 -54415 -32318 -32484 419 -2899
5405 -2899 -4478 -43608 -71201 -50350 18558 57063 15680 -32026 -58842 -65193 -55779 -48606 -10392
5392 -10392 -38897 -96945 -71129 -48454 -57609 -24312 -13268 1928 33076 49474 111169 71043
5380 71043 81039 8237 -53289 -51434 -12251 49607 75561 53471 27700 16366 -623 -17786
5368 -17786 -34137 -50521 -48925 -62371 -102164 -126766 -142444 -110191 -93693 -43823 4349 2796
$$ packed form
5455A3646k4374p9338j632J2323M5609L2085r53l8930J0411p175J502j1770N5672
5442G076K0754m2629k3839j6612k2367L0887K0237k7843M6255L4922j3043R545
5430B3343O310n3087K780l3397n5491l192M1982r098m0576j2651K7308P2102j4439
5417d8106L2038J3839N0034J8140q3522q0307K0311K3158K2097j66L2903l318
5405b899j579l9130k7593K0851O8908L8505m1383m7706k6816o351R414P173L8214
5392a0392k8505n8048K5816K2675r155L3297J1044J5196L1148J6398O1695m0126
5380G1043R996p2802o1526J855L9183O1858K5954k2090k5771j1334j6989j7163
5368a7786j6351j6384J596j3446l9793k4602j5678L2253J6498M9870M8172j553
$$ plain form
5356 2796 18457 -13863 -5894 -816 35544 -4744 -50812 5253 45159 -7304 -62733 -113178
5344 -113178 -113193 -37761 -25143 -27659 -30800 -20831 -54286 -45035 -30151 -46589 -50653 -11686 11236
5331 11236 22632 21251 -15360 -32700 -33319 -21557 -51956 -96428 -108777 -76914 -73875 -95249 -42475
5318 -42475 -45780 -43956 -25942 -21528 31736 61485 16434 31241 58937 19861 -21990 15560
5306 15560 -11187 -27931 -32711 -30325 1934 -30559 -17980 67441 52425 -70508 -81375 -79840
5294 -79840 -94583 -101532 -98344 -88275 -54925 -59231 -45885 -41835 -63185 -21535 21816 20191 10063
5281 10063 -33185 -6497 30091 25208 -19452 -32148 9053 18607 49400 56023 19922 -22673
5269 -22673 -108309 -106593 -90661 -90228 -110746 -63663 14732 44868 12960 -3107 -28217 -56318
$$ packed form
5356B796J5661l2320P969N078L6360m0288m6068N6065L9906n2463n5429n0445
5344a13178j5P5432J2618k516l141R969l3455R251J4884j6438m064L8967K2922
5331A1236J1396j381l6611j7340o19J1762l0399m4472j2349L1863L039k1374N2774
5318d2475l305J824J8014M414N3264K9749m5051J4807K7696l9076m1851L7550
5306A5560k6747j6744m780K386L2259l2493J2579Q5421j5016j22933j0867J535
5294g9840j4743o949L188J0069L3350m306J3346M050k1350M1650M3351j625j0128
5281A0063m3248K6688L6588m883m4660j2696M1201R554L0793O623l6101m2595
5269b2673q5636J716J5932M33k0518M7083P8395L0136l1908j6067k5110k8101
$$ plain form
5257 -56318 -2788 15936 37907 51863 44848 -47 -41026 -32290 -48237 -55921 3943 32979
5245 32979 4419 -7010 -19333 -50868 297 14466 2902 -23629 -60802 -38474 -36326 -94901
5233 -94901 -122746 -84063 -99014 -40074 -8193 -2104 37134 70920 8992 -54264 -43185 -35607
5221 -35607 -59648 -51219 -44076 -17153 -37258 -16748 -8923 -53830 -36953 -61120 -65574 -45886 -81882
5208 -81882 -73058 -24337 5817 55549 74069 11759 -53708 -66300 -29980 31048 -9089 -65519
5196 -65519 -2030 20083 -17810 -12258 -41908 -62920 -31797 10299 12427 38306 80468 138195
5184 138195 144532 86703 70848 45072 -533 -44916 -17938 30917 70232 22701 -31133 -47625
5172 -47625 -18943 26666 -527 -50777 -8381 50650 99067 122287 32793 -43332 -58012 -97482
$$ packed form
5257e6318N3530J8724K1971J3956p015m4895m0979Q736j5947p684N9864K9036
5245C2979k8560j1429j2323l1535N1165J4169j1564k6531l7173K2328K148n8575
5233i4901k7845L8683j4951N8940L1881O089L9238L3786o1928o3256J1079P578
5221c5607k4041Q429P143K6923k0105K0510P825m4907J6877k4167m454J9688l5996
5208h1882Q824M8721L0154M9732J8520o2310o5467j2592L6320O1028m0137n6430
5196f5519O3489K2113l7893N552k9650k1012L1123M2096K128K5879M2162N7727
5184A38195O337n7829j5855k5776m5605m4383K6978M8855L9315m7531n3834j6492
5172d7625K8682M5609k7193n0250M2396N9031M8417K3220q9494p6125j4680l9470
$$ plain form
5160 -97482 -143067 -92986 -37558 -2262 -13766 7320 23602 25657 -9440 -37592 -8923 -36950
5148 -36950 -99478 -46010 -12676 22949 20384 -18424 26892 73711 73366 40111 -7990 -19746
5136 -19746 -54373 -81006 -105355 -98289 -75077 -54165 -28948 -46118 -21220 -33597 -13134 35376
5124 35376 69254 -35903 -52132 -47528 -13528 37053 36203 20050 22436 -1413 -7358 -2782 -11497
5111 -11497 -29262 -29454 3623 49852 85619 58488 31352 33957 28884 -53507 -62553 -72267 -124659
5098 -124659 -144234 -103186 -28403 -49186 -75397 -30444 -45046 -58565 -63430 -32993 -27576 -20654
5086 -20654 -31766 -67607 -70779 -74818 -73185 -84961 -82428 -57297 -107495 -125408 -74836 28497
5074 28497 60741 52269 67858 121640 114758 29147 -10000 10092 37598 77023 76411 58358 48334
$$ packed form
5160i7482m5585N0081N5428L5296j1504K1086J6282K055l5097k8152K8669k8027
5148c6950o2528N3468L3334L5625k565l8808M5316M6819l45l3255m8101j1756
5136a9746l4627k6633k4349P066K3212K0912K5217j7170K4898j2377K0463M8510
5124C5376L3878j05157j6229M604L4000N0581q50j6153K386k3849n945M576q715
5111a1497j7765j92L3077M6229L5767k7131k7136K605n073q2391r046r714n2392
5098a24659j9575M1048P4783k0783k6211M4953j4602j3519m865L0437N417O922
5086b0654j1112l5841l172m039J633j1776K533K5131n0198j7913N0572J03333
5074B8497L2244q472J5589N3782o882q5611l9147K0092K7506L9425o12j8053j0024
$$ plain form
5061 48334 31249 -72261 -50853 -14135 -1348 10211 24152 4425 -25846 -38378 -45491 -46954
5049 -46954 35518 74678 -12556 7560 40018 47985 -35125 -13645 28486 -11005 19909 31949
5037 31949 13348 4135 17683 17231 42519 45560 30760 32190 44060 30212 38228 21608 -36447
5024 -36447 -32557 -61935 -69820 -103880 -135618 -137489 -125104 -76164 -4149 71779 48442 -5511
5012 -5511 -38742 -39351 12886 92058 99045 41953 28548 27638 24353 35112 38867 4570 -2344 51345
4998 51345 60894 27410 -35001 -8551 -15832 -24549 -48604 -12913 10968 -27377 -22946 -5610 -466
4985 -466 22736 23136 12788 -584 59185 30764 21976 -77071 -75719 -35335 3727 31454 16703
4972 16703 38483 3071 -17347 34540 18724 1645 14188 37821 -10427 -29026 -16094 13213
$$ packed form
5061D8334j7085j03510K1408L6718J2787J1559J3941j9727l0271j2532p113j463
5049d6954Q2472L9160q7234K0116L2458P967q3110K1480M2131l9491L0914J2040
5037C1949j8601r213J3548m52K5288L041j4800J430J1870j3848Q016j6620n8055
5024c6447L890k9378p885l4060l1738j871J2385M8940P2015P5928k3337n3953
5012e511l3231o09N2237P9172O987n7092j3405r10l285J0759L755l4297o914N3689
4998E1345R549l3484o2411K6450p281q717k4055L5691K3881l8345M431J7336N144
4985d66K3202M00j0348j3372N9769k8421q788r9047J352M0384L9062K7727j4751
4972A6703K1780l5412k0418N1887j5816j7079J2543K3633m8248j8599J2932K9307
$$ plain form
4960 13213 4669 -79087 -84300 -93223 -56552 -76044 -92747 -79935 -91084 -71371 -61955 -47155 -34648
4947 -34648 -39884 -84873 -72332 3726 33692 19853 22853 5989 -41215 -50406 -22919 -7970
4935 -7970 -4837 2741 29144 22044 21365 -4820 7599 -19122 -54624 -25711 -47065 -48356 -9023
4922 -9023 5939 12326 21052 15831 7869 39769 22514 36173 3934 -25392 -64921 -58609 -16066
4909 -16066 -11479 -11594 -77335 -58623 38308 77038 55427 74216 46780 -21409 -19951 -65463 -96937
4896 -96937 -65974 -42306 -13807 50079 15375 -65201 -65875 -82726 16673 28315 -2764 15720
4884 15720 16442 -7546 28883 56064 65632 42960 -8344 -17965 -60296 -83828 -90377 -90468 -100322 -80396
4870 -80396 -145882 -139307 -115784 -83079 -70989 -39088 -42732 -16856 -14726 36221 7184 5693 -31085
$$ packed form
4960A3213q544q3756n213q923L6671j9492j6703J2812j1149J9713R416J4800J2507
4947c4648n236m4989J2541P6058K9966j3839L000j6864m7204r191K7487J4949
4935g970L133P578K6403p100o79k6185J2419k6721l5502K8913k1354j291L9333
4922i023J4962O387Q726n221p962L1900j7255J3659l2239k9326l9529O312M2543
4909a6066M587j15o5741J8712R6931L8730k1611J8789k7436o8189J458m5512l1474
4896i6937L0963K3668K8499O3886l4704q0576o74j6851R9399J1642l1079J8484
4884A5720P22k3988L6429K7181R568k2672n1304r621m2331k3532o549r1r854J9926
4870h0396o5486O575K3523L2705J2090L1901l644K5876K130N0947k9037j491l6778
$$ plain form
4857 -31085 -74449 -64216 -30869 38407 65046 14877 57614 18680 -19647 41229 29676 -10914
4845 -10914 -52929 -109026 -81516 -42938 -12510 31883 49076 40902 13834 -7990 -25578 -33448
4833 -33448 24757 93654 104257 88781 80926 12557 -37161 -53989 -54327 -39958 -13450 16037
4821 16037 37911 94597 80381 83582 40964 -46239 -41358 -44469 -31521 -48903 -31655 -13458
4809 -13458 -5019 46601 50085 18386 9741 12155 -18514 -25579 -33247 -13736 45465 38050 17278
4796 17278 40585 14593 29043 -8832 -11732 11617 48811 2187 -11535 2652 2191 -6421 -30306
4783 -30306 28825 52557 62689 12987 -14903 -16164 5674 -8336 11997 65484 85708 58402
4771 58402 -3111 -44933 -46104 -62151 -59023 -14143 -16343 -3892 5509 -18011 -33737 -1875 2835
$$ packed form
4857c1085m3364J0233L3347O9276K6639n0169M2737l8934l8327O0876j1553m0590
4845a0914m2015n6097K7510L8578L0428M4393J7193q174k7068k1824j7588p870
4833c3448N8205O8897J0603j5476p855o8369m9718j6828l38J4369K6508K9487
4821A6037K1874N6686j4216L201m2618q7203M881l111J2948j7382J7248J8197
4809a3458Q439N1620L484l1699q645K414l0669p065p668J9511N9201p415k0772
4796A7278K3307k5992J4450l7875k900K3349L7194m6624j3722J4187m61q612k3885
4783c0306N9131K3732J0132m9702k7890j261K1838j4010K0333N3487K0224k7306
4771E8402o1513m1822j171j6047L128M4880k200J2451R401k3520j5726L1862M710
$$ plain form
4758 2835 2054 -43155 -19014 -6149 12111 8534 21569 48286 48254 10007 18067 77639 87202 9823
4744 9823 -8481 -11959 -15916 -54292 -8930 68334 17573 -55174 -40797 -4493 -27324 -84033
4732 -84033 -102933 -79015 -26394 -14754 -10866 4071 -21504 -63096 -77949 -3860 75455 43850
4720 43850 -1903 39013 24168 14050 17668 60297 104189 98902 92700 71125 48361 33480
4708 33480 -37700 -83535 -123374 -86832 -113756 -87442 -94104 -92781 -67155 -54314 -87120 -45073
4696 -45073 -6150 -13079 -31349 -32978 -20264 -18038 -42579 -70266 -72335 -75318 -23153 -5225 -22925
4683 -22925 -53729 -42820 -20628 17272 83924 17826 -33505 -32912 10057 62950 66915 36823
4671 36823 -6394 -43573 8824 25658 70555 60558 -10497 -34204 -39818 -46260 -49123 -45321 -78494
$$ packed form
4758B835p81m5209K4141J2865J8260l577J3035K6717l2l8247Q060N9572R563p7379
4744I823j8304l478l957l8376M5362P7264n0761p2747J4377L6304k2831n6709
4732h4033j8900K3918N2621J1640L888J4937k5575m1592j4853P4089P9315l1605
4720D3850m5753M0916j4845j0118L618M2629M3892n287o202k1575k2764j4881
4708C3480p1180m5835l9839L6542k6924K6314o662J323K5626J2841l2806M2047
4696d5073L8923o929j8270j629J2714K226k4541k7687k069k983N2165J7928j7700
4683b2925l0804J0909K2192L7900O6652o6098n1331N93M2969N2893L965l0092
4671C6823m3217l7179N2397J6834M4897r997p1055k3707n614o442k863L802l3173
$$ plain form
4658 -78494 -60102 -12803 -13105 -59129 -89378 -119494 -105516 -28337 -30852 -55682 -57761 -75187 -11068
4645 -11068 29989 56245 27973 -9060 -33260 -84668 -76387 -30014 -39216 -56633 -95462 -80427
4633 -80427 -47306 -58313 -39191 -46214 -99163 -150943 -147200 -152184 -115693 -93767 -73348 -39185
4621 -39185 14554 40706 11907 3740 -30346 -48546 -5516 8455 12815 7833 -11090 -32250
4609 -32250 -26380 -8963 -27649 44666 48614 51908 22531 -37827 -84870 -79655 -50296 -534 -37470
4596 -37470 -71955 -64048 -52156 -59657 -17772 -10207 -57319 -70414 -121854 -99535 -33568 -29671 -25345
4583 -25345 -53739 -54442 -58350 -25602 10047 -4967 -35579 -25557 14771 57164 36303 33060 20141
4570 20141 63530 54476 -6649 -42184 -46091 -36750 -7131 10215 34129 -23424 32068 28360 -7152
$$ packed form
4658g8494J8392M7299l02m6024l0249l0116J3978P7179k515k4830k079j7426O4119
4645a1068M1057K6256k8272l7033k4200n1408Q281M6373r202j7417l8829J5035
4633h0427L3121j1007J9122p023n2949n1780L743m984L6491K1926K0419L4163
4621c9185N3739K6152k8799q167l4086j8200M3030J3971M360m982j8923k1160
4609c2250N870J7417j8686P2315L948L294k9377o0358m7043N215K9359M9762l6936
4596c7470l4485P907J1892p501M1885P565m7112j3095n1440K2319O5967L897M326
4583b5345k8394p03l908L2748L5649j5014l0612J0022M0328M2393k0861l243j2919
4570B0141M3389r054o1125l5535l907R341K9619J7346K3914n7553N5492l708l5512
$$ plain form
4557 -7152 -26853 -39129 -78558 -64936 -28207 2293 -10619 -1554 -40161 -72199 -50661 -31597
4545 -31597 -7229 11614 -5879 -29885 -43554 -68496 -22538 -57183 -93912 -61732 -26436 -70792
4533 -70792 -72536 -24579 -16163 8807 -20616 -13080 -8457 11154 37318 40348 55923 40267 -10622
4520 -10622 -6682 -8883 -5259 -31604 -53679 -66410 -67640 -59712 -32043 -22547 -5724 -3050 -6035
4507 -6035 -15910 -35381 -33251 11290 65133 94141 26249 12262 33051 48400 46416 29273 45518
4494 45518 25021 -16402 7655 -1600 41636 30630 11179 2112 -15981 -41295 -48097 -42606 -33081
4481 -33081 -6417 25745 61087 78552 -23681 -78039 -51343 -47408 -41994 -71026 -39127 -55662
4469 -55662 -50901 -11696 -46590 -28922 -25551 -10541 -62746 -105984 -86202 -73707 -101440 -128135
$$ packed form
4557g152j9701j2276l9429J3622L6729L0500j2912R065l8607l2038K1538J9064
4545c1597K4368J8843j7493k4006j3669k4942M5958l4645l6729L2180L5296m4356
4533g0792j744M7957Q416K4970k9423P536M623J9611K6164L030J5575j5656n0889
4520a0622L940k201L624k6345k2075j2731j230P928K7669R496J6823K674k985
4507f035r875j9471K130M4541N3843K9008o7892j3987K0789J5349j984j7143J6245
4494D5518k0497m1423K4057r255M3236j1006j9451r067j8093k5314o802N491R525
4481c3081K6664L2162L5342J7465j02233n4358K6696L935N414k9032L1899j6535
4469e5662M761L9205l4894J7668L371J5010n2205m3238J9782J2495k7733k6695
$$ plain form
4457 -128135 -119805 -125078 -90375 -82835 -86788 -67265 -15390 -43704 -39769 -2064 21842 40080 37419
4444 37419 13992 -60099 -36226 17137 22822 -28421 -64025 -32877 5536 29949 39005 780
4432 780 39877 29628 50043 92193 62590 -14410 -27440 42370 77094 33296 19147 -5492
4420 -5492 -61470 -33817 -14691 -64139 -110998 -97175 -106677 -122836 -98587 -35940 -32183 -53805
4408 -53805 -57233 -64868 -76152 -55055 -18259 -10505 -17072 32536 60224 67782 49442 43032 28871
4395 28871 43293 69839 38822 2187 -12935 -47388 -41331 -46417 -27297 -24447 -57333 -51865 -17246
4382 -17246 -51391 -55902 -81388 -112885 -53663 13968 12241 32819 -3883 -29535 -64533 -105108
4370 -105108 -84587 -41420 -84032 -122291 -98900 -64025 -8023 -28861 -25886 10984 68973 73140
$$ packed form
4457a28135Q330n273L4703P540l953J9523N1875k8314L935L7705K3906J8238k661
4444C7419k3427p4091K3873N3363N685n1243l5604L1148L8413K4413R056l8225
4432G80L9097j0249K0415M2150k9603p7000j3030O9810L4724m3798j4149k4639
4420e492n5978K7653J9126m9448m6859J3823r502j6159K4249O2647L757k1622
4408e3805l428p635j1284K1097L6796P754o567M9608K7688P558j8340o410j4161
4395B8871J4422K6546l1017l6635j5122l4453O057n086J9120K850l2886N468L4619
4382a7246l4145m511k5486l1497N9222O7631j727K0578l6702k5652l4998m0575
4370a05108K0521M3167m2612l8259K3391L4875N6002k0838K975L6870N7989M167
$$ plain form
4358 73140 31638 35648 11734 -29079 -55196 -1668 -63475 -183913 -138386 -51862 -39933 -65466
4346 -65466 -100537 -142036 -104838 -51698 -63976 -41287 -5874 -7092 -3389 13623 35331 30348
4334 30348 22135 19918 57924 65618 83932 127818 71478 -17665 -58262 -40179 32620 -860
4322 -860 -40513 -23760 -10243 18052 13790 26815 16908 26672 31965 31723 -11482 -75952 -108289
4309 -108289 -115537 -61887 -7118 34906 73382 88083 58123 27399 10497 1057 -28427 -84774
4297 -84774 -112497 -123369 -84057 -34243 -17403 -22559 -51686 -57512 -57402 -93344 -104350 -74512 -35250
4284 -35250 -26653 -32859 -31894 -48118 -10142 19178 -32131 -44418 -16545 11263 22104 37000 -35671
4271 -35671 -24545 -11894 -24478 -24675 -31831 -39130 -42707 -60105 -63734 -15753 20522 6307 4242
$$ packed form
4358G3140m1502M010k3914m0813k6117N3528o1807j20438M5527Q6524J1929k5533
4346f5466l5071m1499L7198N3140j2278K2689L5413j218L703J7012K1708m983
4334C0348q213k217L8006P694J8314M3886n6340q9143m0597J8083P2799l3480
4322h60l9653J6753J3517K8295m262J3025r907R764N293k42m3205o4470l2337
4309a08289p248N3650N4769M2024L8476J4701k9960l0724j6902r440k9484n6347
4297h4774k7723j0872L9312M9814J6840n156k9127n826J10l5942j1006K9838L9262
4284c5250Q597o206R65j6224L7976K9320n1309j2287K7873K7808J0841J4896p2671
4271c5671J1126J2651j2584j97p156p299l577j7398l629M7981L6275j4215k065
$$ plain form
4258 4242 -12477 -70964 -82880 -80335 -85530 -106734 -85843 -73886 -44195 8010 -5062 -19499
4246 -19499 -6670 14094 -13895 -37700 -71941 -71175 -25242 -45507 -40083 15502 22167 16276 25559
4233 25559 56789 60655 26442 4358 -17059 -45958 -15106 16560 19013 31403 -4050 -56836
4221 -56836 -75920 -32018 11986 -35773 -43671 -28525 -63743 -103679 -59011 -40404 -71791 -54987
4209 -54987 -20986 -97262 -125755 -25666 2197 7026 -2266 -6514 33798 -852 45999 67725
4197 67725 45397 31288 5528 -19372 -20830 -44270 -69792 -80857 -76424 -24801 22488 23423 13810
4184 13810 -11359 53202 121746 113989 89504 73594 70602 44898 9427 -73092 -49851 -54849
4172 -54849 -71722 -81317 -59019 -84286 -105104 -50185 -30072 -1043 40733 28648 25512 1351
$$ packed form
4258D242j6719n8487j1916K545n195k1204K0891J1957K9691N2205j3072j4437
4246a9499J2829K0764k7989k3805l4241P66M5933k0265N424N5585O665n891R283
4233B5559L1230L866l4213k2084k1417k8899L0852L1666K453J2390l5453n2786
4221e6836j9084M3902M4004m7759p898J5146l5218l9936M4668J8607l1387J6804
4209e4987L4001p6276k8493J00089K7863M829r292m248M0312l4650M6851K1726
4197F7725k2328j4109k5760k4900j458k3440k5522j1065M433N1623M7289R35r613
4184A3810k5169O4561O8544p757k4485j5910k992k5704l5471q2519K3241m998
4172e4849j6873r595K2298k5267k0818N4919K0113K9029M1776j2085l136k4161
$$ plain form
4160 1351 -18349 -17165 -39693 -45159 -30088 -33093 12484 79849 50086 47352 41097 24617 -3042
4147 -3042 5345 -12181 -55390 -36161 12064 -2383 -17060 -30997 -41545 5480 26739 9631
4135 9631 31855 -52312 -87765 -59656 27866 79640 137376 93974 39651 59350 79724 65045
4123 65045 61562 -424 -70126 -57012 22023 53729 32729 -30625 -58277 5154 15887 -41174
4111 -41174 -81591 -67835 -93038 -47719 -34134 -31680 -13863 -33280 -46134 -35426 -17579 8802
4099 8802 47972 50996 13124 23779 60710 66447 29565 5280 39416 45041 47080 13455 27393
4086 27393 36036 33502 30438 51794 57980 13039 36825 4302 -13142 4852 28504 -3592 21448
4073 21448 67534 86464 87849 82535 43519 -26577 14305 67559 121553 167057 161635 85895
$$ packed form
4160A351j9700J184k2528n466J5071l005M5577O7365k9763k734o255j6480k7659
4147c042Q387j7526m3209J9229M8225j4447j4677j3937j0548M7025K1259j7108
4135I631K2224q4167l5453K8109Q7522N1774N7736m3402n4323J9699K0374j4679
4123F5045l483o1986o9702J3114P9035L1706k1000o3354k7652O3431J0733n7061
4111d1174m0417J3756k5203M5319J3585K454J7817j9417j2854J0708J7847K6381
4099H802L9170L024l7872J0655L6931N737l6882k4285L4136N625K039l3625J3938
4086B7393Q643k534l064K1356O186m4941K3786l2523j7444J7994K3652l2096K5040
4073B1448M6086J8930J385n314l9016p0096M0882N3254N3994M5504n422p5740
$$ plain form
4061 85895 7947 4659 31126 33056 -24328 -63641 -32187 -9872 -11766 -32438 -44351 -2546
4049 -2546 39026 38994 66124 54341 54674 94458 79366 48589 29515 -9249 -49093 -35932 -20538
4036 -20538 -28613 1716 32537 28985 74403 74751 49631 47213 38406 37490 -3937 5169 -20808 790
4022 790 44539 6329 -5898 9881 -13321 -26481 -12709 18653 -5970 -43615 -51947 -59882 -31209
4009 -31209 -56089 -77738 -74980 -53944 -102608 -106564 -115481 -177153 -134234 -91666 -7849 3422
3997 3422 -49588 -69373 -27137 -46338 -5557 4912 10830 5134 -11638 5561 2173 -47021 -89498
3984 -89498 -75392 -44813 -16132 -41648 17562 55741 59804 80569 13850 26729 -5138 -34604
3972 -34604 21390 56047 26954 -28292 -52404 -16160 26822 3438 -37761 -47470 -85281 -99927
$$ packed form
4061H5895p7948l288K6467J930n7384l9313L1454K2315j894k0672j1913M1805
4049b546M1572l2K7130j1783L33L9784j5092l0777j9074l8764l9844J3161J5394
4036b0538q075L0329L0821l552M5418L48k5120k418q807r16m1427R106k5977K1598
4022G90M3749l8210j2227J5779k3202j3160J3772L1362k4623l7645q332p935K8673
4009c1209k4880k1649K758K1036m8664l956q917o1672M2919M2568Q3817J1271
3997C422n3010j9785M2236j9201M0781J0469N918n696j6772J7199l388m9194m2477
3984h9498J4106L0579K8681k5516N9210L8179M063K0765o6719J2879l1867k9466
3972c4604N5994L4657k9093n5246k4112L6244M2982k3384m1199r709l7811j4646
$$ plain form
3960 -99927 -110193 -56566 14440 40168 -5342 -5342 1133 11459 -35058 -73356 -91627 -60894 1132
3947 1132 48264 2139 24044 55153 26335 -50606 -87481 -51481 -14221 -11625 -18824 -50135
3935 -50135 -66465 -6137 -23606 -71176 -52076 -63802 -53756 -57386 -65627 -8689 50576 77227
3923 77227 16050 -19330 -32719 15578 58841 16228 -22007 -12616 3509 51764 64508 38822
3911 38822 9477 -13455 -13041 -38892 -48485 -94775 -69362 1013 50587 55018 6504 -39000 -64808
3898 -64808 -66953 -60106 -34873 -66134 -38059 49870 28665 25226 -4416 -16303 -35359 -58136
3886 -58136 -61499 -55941 35690 70128 30955 -5278 8301 23371 -1401 -31421 -67572 -67153 -80078
3873 -80078 -124198 -122742 -47049 24872 47610 59456 32093 6481 -13217 -25718 -25579 -39820
$$ packed form
3960i9927j0266N3627P1006K5728m5510%O475J0326m6517l8298j8271L0733O2026
3947A132M7132m6125K1905L1109k8818p6941l6875L6000L7260K596p199l1311
3935e0135j6330O0328j7469m7570J9100j1726J0046l630q241N6938N9265K6651
3923G7227o1177l5380j3389M8297M3263m2613l8235R391J6125M8255J2744k5686
3911C8822k9345k2932M14k5851r593m6290K5413P0375M9574M431m8514m5504k5808
3898f4808k145O847K5233l1261K8075Q7929k1205l439k9642j1887j9056k2777
3886e8136l363N558R1631L4438l9173l6233J3579J5070k4772l0020l6151M19j2925
3873h0078m4120J456P5693P1921K2738J1846k7363k5612j9698j2501J39j4241
$$ plain form
3861 -39820 -9012 -31118 -17312 258 -1516 27598 22698 315 2589 -9620 -1414 -32526 -60280
3848 -60280 -81776 -39884 48381 24463 -42682 -9726 37021 56785 52282 41091 84697 87211
3836 87211 29129 -207 500 -64807 -82650 -21354 16138 11010 7052 34652 40544 34662 17978
3823 17978 -13416 -6729 -6682 -35772 -51849 -50793 -51233 -65756 -44443 -60966 -53282 -71432 -65856 -44614
3809 -44614 18487 37684 43604 21916 38568 71430 86739 11387 -32273 -5296 11976 18160
3797 18160 58103 113735 103850 86903 78599 98487 84589 39641 39162 -764 -21090 26587 33852
3784 33852 34719 -4888 -49062 -33593 -7530 -50668 -3602 34041 56363 47516 101786 104176 70454
3771 70454 28004 63741 60179 1892 -13266 -78666 -149888 -109399 -12984 16266 -6555 -59203
$$ packed form
3861c9820L0808k2106J3806J7570j774K9114m900k2383K274j2209Q206l1112k7754
3848f0280k1496M1892Q8265k3918o7145L2956M6747J9764m503j1191M3606K514
3836H7211n8082k9336P07o5307j7843O1296L7492n128l958K7600N892n882j6684
3823A7978l1394O687M7k9090j6077J056m40j4523K1313j6523P684j8150N576K1242
3809d4614O3101J9197N920k1688J6652L2862J5309p5352m3660K6977J7272O184
3797A8160L9943N5632r885j6947q304J9888j3898m4948m79l9926k0326M7677P265
3784C3852Q67l9607m4174J5469K6063m3138M7066L7643K2322q847N4270K390l3722
3771G0454m2450L5737l562n8287j5158o5400p1222M0489R6415K9250k2821n2648
$$ plain form
3759 -59203 -6206 57146 91282 26867 -3403 -18104 -4762 -146 -35029 -50808 -81416 -83789
3747 -83789 -91259 -90070 -59561 -51068 -25574 -45805 -47793 -44210 -14129 -13258 -16759 17724 31844
3734 31844 85281 113036 88836 17138 24745 43498 43083 28207 20885 29932 31230 63536 52319
3721 52319 9299 -2470 27443 35119 10643 17739 -159 -30505 -28063 -20809 -2414 6390 -5268
3708 -5268 -54919 1106 -15291 -103320 -99752 -15421 -15034 -28072 -42591 -65353 -57280 16522 15813
3695 15813 10845 85180 110943 89473 40428 -16648 -40977 -62908 1076 53677 52171 61742
3683 61742 70807 38475 52875 80050 65531 16221 20236 15377 12471 9898 29442 22625 -20166
3670 -20166 -34873 -8081 15830 4240 17790 17694 -12378 -40741 -17311 -26325 -64916 -32457 208
$$ packed form
3759e9203N2997O3352L4136o4415l0270j4701J3342M616l4883j5779l0608k373
3747h3789p470J189L0509Q493K5494k0231j988L583L0081Q71l501L4483J4120
3734C1844N3437K7755k4200p1698P607J8753m15j4876p322R047J298L2306j1217
3721E2319m3020j1769K9913P676k4476P096j7898l0346K442P254J8395Q804j1658
3708e268m9651N6025j6397q8029L568Q4331L87j3038j4519k2762Q073P3802p09
3695A5813m968P4335K5763k1470m9045n7076k4329k1931O3984N2601j506R571
3683F1742R065l2332J4400K7175j4519m9310M015m859k906k573J9544o817m2791
3670b0166j4707K6792K3911j1590J3550r6l0072k8363K3430r014l8591L2459L2665
$$ plain form
3657 208 1328 -23566 -31240 -80096 -28829 -43258 -81939 -53760 -34150 -39230 -72237 -91525 -50089
3644 -50089 -13033 26039 -777 -13864 27291 11261 -366 18444 55667 44985 21974 23464
3632 23464 31741 -24258 -615 29199 40018 4162 -31018 -31936 -13786 -31409 -26783 7559 -1028
3619 -1028 -10973 40289 53759 21581 -7137 -4905 21035 32197 82222 71740 42734 86640
3607 86640 105776 108262 67342 60988 74009 86340 -19344 -41413 -13313 6074 66577 66864
3595 66864 -429 -32196 -32147 -34006 -59804 -78928 -26399 -14306 -30414 -20071 17448 14551 -5700
3582 -5700 38473 54694 28588 -31308 12776 -5483 -73188 -52794 -57473 -101528 -49500 -20159
3570 -20159 -13231 28511 7787 15439 104462 147395 73171 -20490 -79103 27597 85767 55161
$$ packed form
3657B08J120k4894p674m8856N1267j4429l8681K8179J9610n080l3007j9288M1436
3644e0089L7056L9072k6816j3087M1155j6030j1627J8810L7223j0682k3011J490
3632B3464Q277n5999K3643K9814J0819l5856l5180r18J8150j7623M626L4342q587
3619a028r945N1262J3470l2178k8718K232K5940J1162N0025j0482k9006M3906
3607H6640J9136K486m0920o354J3021J2331j05684k2069K8100J9387O0503K87
3595F6864o7293l1767M9j859k5798j9124N2529J2093j6108J0343L7519k897k0251
3582e700M4173J6221k6106n9896M4084j8259o7705K0394m679m4055N2028K9341
3570b0159O928M1742k0724P652Q9023M2933p4224r3661n8613J06700N8170l0606
$$ plain form
3558 55161 48889 -10736 10191 21095 -42493 -35167 -11494 1777 28997 93768 65418 -25286
3546 -25286 -45951 -44098 -7674 -24550 -60909 -106384 -129971 -156678 -101413 -40690 -200 -21337
3534 -21337 -28909 -29537 -6271 -25425 -77662 -82404 -70991 -30379 32216 34417 -3037 412 -56206
3521 -56206 -32233 16583 36912 1718 -22009 37299 74920 114290 95267 49004 -13902 5459
3509 5459 -14119 -2926 4613 16553 38540 37891 52897 96141 93117 2685 -5897 46046 64390
3496 64390 23579 -4106 -14937 -10730 -17175 -24596 -7967 640 19911 25850 4412 -7240 -27183
3483 -27183 14425 -9426 -28251 -64030 -98418 -108405 -55013 -47661 -72899 -89827 -78512 -65968
3471 -65968 -89057 -93122 -56948 -96649 -64800 -3252 16538 -3501 -47531 -71467 -54999 -60603
$$ packed form
3558E5161o272n9625K0927J0904o3588P326K3673J3271K7220O4771k8350r0704
3546b5286k0665J853L6424j6876l6359m5475k3587k6707N5265O0723M0490k1137
3534b1337p572o28K3266j9154n2237m742J1413M0612O2595K201l7454L449n6618
3521e6206K3973M8816K0329l5194k3727N9308L7621L9370j9023m6263o2906J9361
3509E459j9578J1193P539J1940K1987o49J5006M3244l024r0432q582N1943J8344
3496F4390m0811k7685j0831M207o445p421J6629Q607J9271N939k1438j1652j9943
3483b7183M1608k3851j8825l5779l4388r987N3392P352k5238j6928J1315J2544
3471f5968k3089m065L6174l9701L1849O1548J9790k0039m4030k3936J6468n604
$$ plain form
3459 -60603 -100587 -92603 -38943 -61185 -64174 -52429 -51612 -22674 6097 -35641 -47444 -42587 -19523
3446 -19523 -9302 47057 67674 104621 60136 20479 17051 25106 26242 53385 58220 30436 73796
3433 73796 103322 78821 50636 40064 9150 -57049 -116525 -93731 -21799 -3317 -52319 -8050
3421 -8050 33718 44190 48761 51674 15936 -41810 -38258 -8645 94 31590 57653 37825 51715
3408 51715 38450 -9886 -5209 -19611 -52985 -112376 -88158 -58982 -115224 -141933 -129002 -123497
3396 -123497 -112128 -86152 -56428 -38533 -1460 -9450 -15433 -33299 -65627 -65726 -69538 -13665 32164
3383 32164 11196 1503 -56888 -50698 -13304 -7976 38554 27688 9438 30830 80115 73987 69998
3370 69998 27294 -83 -1649 -19411 -2251 -64293 -105483 -114974 -58476 -46408 17800 55943
$$ packed form
3459f0603l9984P984N3660k2242k989J1745Q17K8938K8771m1738j1803M857K3064
3446a9523J0221N6359K0617L6947m4485l9657l428Q055J136K7143M835k7784M3360
3433G3796K9526k4501k8185j0572l0914o6199n9476K2794P1932J8482m9002M4269
3421h050M1768J0472M571K913l5738n7746L552K9613Q739L1496K6063j9828J3890
3408E1715j3265m8336M677j4402l3374n9391K4218K9176n6242k6709J2931N505
3396a23497J1369K5976K9724J7895L7073p990n983j7866l2328r9l812N5873M5829
3383C2164k0968r693n8391O190L7394N328M6530j0866j8250K1392M9285o128l989
3370F9998m2704k7377j566j7762J7160o2042m1190r491N6498J2068O4208L8143
$$ plain form
3358 55943 91967 82003 45034 -16796 -17222 -25386 -354 33 56447 41251 -8624 8031 45731
3345 45731 27704 -40188 -32117 -14763 -1876 -4340 -23863 -82227 -118830 -146480 -81614 -56333
3333 -56333 -22734 -12136 14492 17882 21306 45097 14033 9831 557 35833 -861 20835 16299
3320 16299 26138 52207 53053 62371 42637 43581 45311 6982 943 103622 98576 62576 66404 80680
3306 80680 88242 84731 98806 103909 113678 72552 55175 72838 60625 37719 -13689 -26722 -44114
3293 -44114 11311 49893 46447 38417 44672 72587 103407 126928 128309 103483 63045 6074 -18134
3280 -18134 10568 49547 87789 55367 -18784 -11884 57139 82680 53925 37334 17193 4720
3268 4720 -6313 -21554 -28257 -50123 -47638 1820 22885 94242 95035 67001 14416 11769 21320
$$ packed form
3358E5943L6024r964l6969o1830m26q164K5032L87N6414j5196m9875J6655L7700
3345D5731j8027o7892Q071J7354J2887k464j9523n8364l6603k7650O4866K5281
3333e6333L3599J0598K6628L390L424K3791l1064m202r274L5276l6694K1696m536
3320A6299R839K6069Q46R318j9734R44J730l8329o039J02679n046l6000L828J4276
3306H0680P562l511J4075N103R769m1126j7377J7663j2213k2906n1408j3033j7392
3293d4114N5425L8582l446q030O255K7915L0820K3521J381k4826m0438n6971k4208
3280a8134K8702L8979L8242l2422p4151O900O9023K5541k8755j6591k0141j2473
3268D720j1033j5241o703k1866K485M9458K1065P1357P93k8034n2585k647R551
$$ plain form
3255 21320 19771 25504 10751 -42482 -95816 -80341 -54687 -35112 -16618 40322 76952 65549
3243 65549 62454 26489 6825 -17305 -23522 -32839 31064 58556 3822 -9280 19457 20704 4605
3230 4605 76491 50910 -12350 -11821 44225 34247 12994 -48004 -48699 7647 18704 36569 29990
3217 29990 -3680 22661 9692 -1685 -15231 71475 101380 96547 88217 86645 76695 39468 57996
3204 57996 39233 -19824 -88823 -107635 -98348 -46423 17507 -22449 -28162 -22701 42204 85605
3192 85605 51010 -9185 -33247 28765 67329 71345 14473 -41194 -75433 -55415 -36174 -51717
3180 -51717 -52552 -61329 -78063 -71042 -55748 -62424 -95213 -131157 -80351 -15345 28139 19859 996
3167 996 40780 23840 -3310 17983 -12311 -55450 -25352 -11787 -47586 -64439 -22937 -20842
$$ packed form
3255B1320j549N733j4753n3233n3334J5475K5654J9575J8494N6940L6630j1403
3243F5549l095l5965j9664k4130o217r317O3903K7492n4734j3102K8737J247j6099
3230D605P1886k5581o3260N29N6046r978k1253o0998o95N6346J1057J7865o579
3217B9990l3670K6341j2969j1377j3546Q6706K9905m833q330j572r950l7227J8528
3204E7996j8763n9057o8999j8812R287N1925O3930l9956n713N461O4905M3401
3192H5605l4595o0195k4062O2012L8564M016n6872n5667l4239K0018J9241j5543
3180e1717q35q777j6734P021J5294o676l2789l5944N0806O5006M3484q280j8863
3167I96L9784j6940k7150K1293l0294m3139L0098J3565l5799j6853M1502K095
$$ plain form
3155 -20842 -53696 -11550 6886 -22627 -76841 -95361 -119009 -25533 6217 -20057 -55669 -65102
3143 -65102 -27721 2725 -9160 -24921 -16840 -39871 -33913 -9725 18987 29671 37513 12581
3131 12581 -2097 -3351 14515 14798 30218 27791 45524 14356 35931 66839 32663 -34849 -47186
3118 -47186 -22525 -29977 -2354 23377 20735 75976 104956 90417 63978 46414 5725 -45592
3106 -45592 -57099 -24506 -1100 -63056 -24919 -143 56435 24369 -18134 -9569 31610 56020
3094 56020 67115 5512 -43600 -14487 22017 26360 -8532 -26111 -55472 -54469 -36147 -64877
3082 -64877 6485 67980 61058 35243 33806 -24318 -16847 16328 -10603 -21311 -59339 -123196
3070 -123196 -102072 -70175 -48218 -23561 22425 65669 61581 71769 57629 63182 79997 117869
$$ packed form
3155b0842l2854M2146J8436k9513n4214j8520k3648R3476L1750k6274l5612r433
3143f5102L7381L0446j1885j5761Q081k3031N958K4188K8712J0684P842k4932
3131A2581j4678j254J7866K83J5420k427J7733l1168K1575L0908l4176o7512j2337
3118d7186K4661p452K7623K5731k642N5241K8980j4539k6439j7564m0689n1317
3106d5592j1507L2593K3406o1956L8137K4776N6578l2066m2503Q565M1179K4410
3094E6020J1095o1603m9112K9113L6504M343l4892j7579k9361J003J8322k8730
3082f4877P1362O1495o922k5815j437n8124P471L3175k6931j0708l8028o3857
3070a23196K1124L1897K1957K4657M5986M3244m088J0188j4140N553J6815L7872
$$ plain form
3058 117869 45362 8147 -22821 -37696 -31095 -17230 18143 26549 43429 98344 73880 39823
3046 39823 6811 -55659 -69193 -31847 -21019 -25314 -7218 4934 -39144 -78738 -48873 -22761
3034 -22761 -71410 -98989 -37228 13617 8226 47152 95125 81463 42295 43624 52098 19460
3022 19460 -27307 -19025 16425 47707 39698 15357 -12450 -8336 12516 56678 76038 65036
3010 65036 38912 58253 36762 4958 -17415 -14779 2593 48369 45139 41687 34378 69725 105332
2997 105332 137388 54928 20645 27744 53531 15114 -5923 37496 81137 28813 14502 -21753
2985 -21753 -11789 -10654 -9461 8326 -30365 -24908 -27491 34763 79097 125965 118729 102613 96400
2972 96400 100120 62909 5282 67718 143925 139449 102493 136775 96377 93060 83702 52372 21040
$$ packed form
3058A17869p2507l7215l0968j4875O601J3865L5373Q406J6880N4915k4464l4057
3046C9823l3012o2470j3534L7346J0828m295J8096J2152m4078l9594K9865K6112
3034b2761m8649k7579O1761N0845n391L8926M7973j3662l9168J329Q474l2638
3022A9460m6767Q282L5450L1282q009k4341k7807M114K0852M4162J9360j1002
3010F5036k6124J9341k1491l1804k2373K636J7372M5776l230l452p309L5347L5607
2997A05332L2056q2460l4283P099K5787l8417k1037M3419M3641n2324j4311l6255
2985b1753R964J135J193J7787l8691N457k583O2254M4334M6868p236j6116o213
2972I6400L720l7211n7627O2436P6207m476l6956L4282m0398l317r358l1330l1332
$$ plain form
2959 21040 -26358 -23139 5211 -43425 -20526 9747 -21565 -47208 -46435 -2757 464 -62780 -40633
2946 -40633 46770 17558 29341 38874 43467 34422 25545 19233 22732 90 28436 72405 50491
2933 50491 -22453 -103793 -94256 -82200 -34445 14444 40176 -4810 34499 75770 68771 58330
$$ packed form
2959B1040m7398L219K8350m8636K2899L0273l1312k5643P73M3678L221o3244K2147
2946d0633Q7403k9212J1783R533M593r045q877o312L499k2642K8346M3969k1914
2933E0491p2944q1340R537J2056M7755M8889K5732m4986L9309M1271o999j0441
$$ [...]
##END NTUPLES=NMR SPECTRUM
##END=
