##TITLE=Analysis number 327623
Compound Code cc 18313
Book Reference 228616
Project Code adrs flro3
Chemist Name jom
##JCAMPDX= 6.0         $$ Bruker NMR JCAMP-DX V2.0
##DATA TYPE= NMR SPECTRUM
##DATA CLASS= NTUPLES
##ORIGIN= Bruker BioSpin GmbH
##OWNER= nmr
$$ XWIN-NMR		Version 3.5
$$ Wed Mar 28 10:44:22 2007 GMT Daylight Time (UT+1h)  MAYBRIDGE\nmr@NMR_250MHZ
##.OBSERVE FREQUENCY= 250.131544655141
##.OBSERVE NUCLEUS= ^1H
##.ACQUISITION MODE= SIMULTANEOUS (DQD)
##.ACQUISITION SCHEME= undefined
##.AVERAGES= 16
##.DIGITISER RES= 18
##SPECTROMETER/DATA SYSTEM= dpx250
##.PULSE SEQUENCE= zg30
##.SOLVENT NAME= CDCl3
##.SHIFT REFERENCE= (INTERNAL, CDCl3, 0, 16.522)
##AUDIT TRAIL= $$ (NUMBER, WHEN, WHO, WHERE, WHAT)
$$ ##TITLE= Audit trail, XWIN-NMR		Version 3.5
$$ ##JCAMPDX= 5.01
$$ ##ORIGIN= Bruker BioSpin GmbH
$$ ##OWNER= nmr
$$ C:\u/data/dgb/nmr/ADRS/2440/pdata/1/auditp.txt
$$ ##AUDIT TRAIL=  $$ (NUMBER, WHEN, WHO, WHERE, WHAT)
(   1,<2007-03-28 10:43:48.16 +100>,<MAYBRIDGE\nmr>,<NMR_250MHZ>,
      <created by zg, POWCHK disabled, PULCHK disabled
       configuration hash MD5:
       49 4B E0 1D 92 C2 6B 37 9F E6 65 BC 52 41 86 1D
       data hash MD5: 64K
       C0 16 42 02 1C 21 75 FA 7A BE 06 4F E8 DC 25 90>)
(   2,<2007-03-28 10:44:06.10 +100>,<MAYBRIDGE\nmr>,<NMR_250MHZ>,
      <Start of raw data processing
       ef LB = 0.3 FT_mod = 6 PKNL = 1 SI = 32K 
       data hash MD5: 32K
       EB 81 11 C6 0D 4D 27 A1 E5 EF D1 DA 2E 1D 2F B8>)
(   3,<2007-03-28 10:44:08.55 +100>,<MAYBRIDGE\nmr>,<NMR_250MHZ>,
      <apk 
       data hash MD5: 32K
       13 D8 D6 6B 50 E3 91 8F 96 76 41 39 11 8A C9 70>)
(   4,<2007-03-28 10:44:09.30 +100>,<MAYBRIDGE\nmr>,<NMR_250MHZ>,
      <abs ABSG = 5 
       data hash MD5: 32K
       63 59 45 70 55 EF 29 58 43 F9 AC AB 24 87 AE 38>)
$$ ##END=
$$ 
$$ hash MD5
$$ 5A 02 0E 38 D9 E1 5C F3 6C 02 6D 84 39 53 1F 46
##$RELAX= 
##$RELAX= 
##$RELAX= 
##$RELAX= 
##$RELAX= 
##$RELAX= 
##$RELAX= 
$$ Bruker specific parameters
$$ --------------------------
##$DU= <C:\u>
##$EXPNO= 2440
##$NAME= <ADRS>
##$PROCNO= 1
##$TYPE= <nmr>
##$USER= <dgb>
##$AMP= (0..31)
100 100 100 100 100 100 100 100 100 100 100 100 100 100 100 100 100 100 
100 100 100 100 100 100 100 100 100 100 100 100 100 100 
##$AQSEQ= 0
##$AQ_mod= 3
##$AUNM= <au_zg>
##$AUTOPOS= <10 >
##$BF1= 250.13
##$BF2= 250.13
##$BF3= 250.13
##$BF4= 250.13
##$BF5= 500.13
##$BF6= 500.13
##$BF7= 500.13
##$BF8= 500.13
##$BYTORDA= 1
##$CFDGTYP= 0
##$CFRGTYP= 5
##$CHEMSTR= <none>
##$CNST= (0..31)
1 1 145 1 1 1 1 1 1 1 1 1 1 1 1 1 1 1 1 1 1 1 1 1 1 1 1 1 1 1 1 1 
##$CPDPRG= <>
##$CPDPRG1= <>
##$CPDPRG2= <>
##$CPDPRG3= <>
##$CPDPRG4= <mlev>
##$CPDPRG5= <mlev>
##$CPDPRG6= <mlev>
##$CPDPRG7= <mlev>
##$CPDPRG8= <mlev>
##$CPDPRGB= <>
##$CPDPRGT= <>
##$D= (0..31)
0 1 0 0 0 0 0 0 0 0.06 0 0 0 0 0 0 0.0002 0 0 0 0 0 0 0 0 0 0 0 0 0 0 
0 
##$DATE= 1175075025
##$DBL= (0..7)
120 120 120 120 120 120 120 120 
##$DBP= (0..7)
150 150 150 150 150 150 150 150 
##$DBP07= 0
##$DBPNAM0= <>
##$DBPNAM1= <>
$$ [...]
##$SUBNAM7= <"">
##$SUBNAM8= <"">
##$SUBNAM9= <"">
##$SW= 20.6930455092707
##$SWIBOX= (0..15)
0 0 3 0 0 0 0 0 0 0 0 0 0 0 0 0 
##$SW_h= 5175.983436853
##$TD= 65536
##$TD0= 1
##$TE= 683.16
##$TE2= 300
##$TE3= 300
##$TEG= 300
##$TL= (0..7)
0 120 120 120 120 120 120 120 
##$TP= (0..7)
150 150 150 150 150 150 150 150 
##$TP07= 0
##$TPNAME0= <>
##$TPNAME1= <>
##$TPNAME2= <>
##$TPNAME3= <>
##$TPNAME4= <>
##$TPNAME5= <>
##$TPNAME6= <>
##$TPNAME7= <>
##$TPOAL= (0..7)
0.5 0.5 0.5 0.5 0.5 0.5 0.5 0.5 
##$TPOFFS= (0..7)
0 0 0 0 0 0 0 0 
##$TUNHIN= 0
##$TUNHOUT= 0
##$TUNXOUT= 0
##$USERA1= <user>
##$USERA2= <user>
##$USERA3= <user>
##$USERA4= <user>
##$USERA5= <user>
##$V9= 5
##$VALIST= <valist>
##$VCLIST= <CCCCCCCCCCCCCCC>
##$VD= 0
##$VDLIST= <DDDDDDDDDDDDDDD>
##$VPLIST= <PPPPPPPPPPPPPPP>
##$VTLIST= <TTTTTTTTTTTTTTT>
##$WBST= 1024
##$WBSW= 4
##$XGAIN= (0..3)
0 0 0 0 
##$XL= 0
##$YL= 0
##$YMAX_a= 632383
##$YMIN_a= -536937
##$ZGOPTNS= <>
##$ZL1= 120
##$ZL2= 120
##$ZL3= 120
##$ZL4= 120
##$ABSF1= 16.522
##$ABSF2= -4.171173
##$ABSG= 5
##$ABSL= 3
##$ALPHA= 0
##$AQORDER= 0
##$ASSFAC= 0
##$ASSFACI= 0
##$ASSFACX= 0
##$ASSWID= 0
##$AUNMP= <proc_1d>
##$AZFE= 0.1
##$AZFW= 0.1
##$BCFW= 0
##$BC_mod= 0
##$BYTORDP= 0
##$COROFFS= 0
##$CY= 12.5
##$DATMOD= 1
##$DC= 0
##$DFILT= <>
##$DTYPP= 0
##$F1P= 14.0000005364418
##$F2P= -0.99999901652339
##$FCOR= 0.5
##$FTSIZE= 32768
##$FT_mod= 6
##$GAMMA= 0
##$GB= 0
##$INTBC= 1
##$INTSCL= 1
##$ISEN= 128
##$LB= 0.3
##$LEV0= 0
##$LPBIN= 0
##$MAXI= 10000
##$MC2= 0
##$MEAN= 0
##$ME_mod= 0
##$MI= 0
##$NCOEF= 0
##$NC_proc= -3
##$NLEV= 6
##$NOISF1= 0
##$NOISF2= 0
##$NSP= 0
##$NTH_PI= 0
##$NZP= 0
##$OFFSET= 16.522
##$PC= 1
##$PHC0= 77.97106
##$PHC1= 6.547112
##$PH_mod= 1
##$PKNL= yes
##$PPARMOD= 0
##$PSCAL= 4
##$PSIGN= 0
##$REVERSE= no
##$SF= 250.13
##$SI= 32768
##$SIGF1= 0
##$SIGF2= 0
##$SINO= 400
##$SIOLD= 32768
##$SREGLST= <1H.CDCl3>
##$SSB= 0
##$STSI= 32768
##$STSR= 0
##$SW_p= 5175.98343685301
##$SYMM= 0
##$S_DEV= 0
##$TDeff= 65536
##$TDoff= 0
##$TI= <Analysis number 999999
Compound Code 99
Book Reference 9
Project Code 9>
##$TILT= no
##$TM1= 0
##$TM2= 0
##$TOPLEV= 0
##$USERP1= <user>
##$USERP2= <user>
##$USERP3= <user>
##$USERP4= <user>
##$USERP5= <user>
##$WDW= 1
##$XDIM= 32768
##$YMAX_p= 276664920
##$YMIN_p= -39228
$$ End of Bruker specific parameters
$$ ---------------------------------
##NTUPLES= NMR SPECTRUM
##VAR_NAME=  FREQUENCY,     SPECTRUM/REAL,   SPECTRUM/IMAG
##SYMBOL=    X,             R,               I
##VAR_TYPE=  INDEPENDENT,   DEPENDENT,       DEPENDENT
##VAR_FORM=  AFFN,          ASDF,            ASDF
##VAR_DIM=   32768,         32768,           32768
##UNITS=     HZ,            ARBITRARY UNITS, ARBITRARY UNITS
##FACTOR=    0.157963299565203, 1,           1
##FIRST=     4132.6476996994, 0,             0
##LAST=      -1043.33573715361, 0,           0
##MIN=       -1043.33573715361, -39228,      0
##MAX=       4132.6476996994, 276664920,     0
$$ Real data points
##PAGE= N=1
##DATA TABLE= (X++(R..R)), XYDATA
$$ [...]
$$ plain form
19028 816459 803071 788678 779120 795760 826120 849599 835448 806766 773504 737229 706836 682895
19016 682895 665361 643364 615134 594202 579755 565499 567380 568072 555451 554281 547136 533673
19004 533673 529841 527532 528784 520361 513514 512902 511625 496972 494380 494108 493246 480810 467986 455749
18990 455749 452818 455873 454473 437426 417329 395423 370385 361636 364873 363650 373430 387607 393229
18977 393229 392655 387296 381126 371077 361730 347726 342746 349559 342050 331809 333013 341362 339525 354673
18963 354673 359506 353035 353547 349176 332378 315941 311297 303500 296911 286514 288036 286018 278123 270909
18949 270909 265068 263331 268414 275330 281520 284177 268199 255230 248965 258312 268999 265546 257085
18936 257085 257967 254328 242179 245213 252998 260860 261585 265218 266456 261680 271224 275287 285281 301810
$$ packed form
19028H16459j3388j4393r558J6640L0360K3479j4151k8682l3262l6275l0393k3941
19016F82895j7534k1997k8230k0932j4447j4256J881O92j2621j170p145j3463
19004E33673l832k309J252q423o847o12j277j4653k592k72q62j2436j2824j2237
18990D55749k931L055j400j7047k0097k1906k5038q749L237j223R780J4177N622
18977C93229n74n359o170j0049r347j4004m980O813p509j0241J204Q349j837J5148
18963C54673M833o471N12m371j6798j6437m644p797o589j0397J522k018p895p214
18949B70909n841j737N083O916O190K657j5978j2969o265R347J0687l453q461
18936B57085Q82l639j2149L034P785P862P25L633J238m776R544M063R994J6529
$$ plain form
18922 301810 313665 318422 313598 299333 285079 286297 284835 279114 276726 289869 299523 303137 295960
18909 295960 286153 279057 272823 276992 268708 259374 263072 277226 304277 341016 392790 463506 517868
18896 517868 517701 470388 415686 378820 347495 325630 316861 327702 341120 368578 425722 491722
18884 491722 529238 518102 480886 437865 387816 338090 315199 298919 289817 281197 283077 299732
18872 299732 322947 347397 379851 396744 380932 368563 366820 354183 357772 391534 425335 449829
18860 449829 467879 494509 514400 517050 521752 537716 564687 563488 526674 482825 440830 417370
18848 417370 417153 421766 423500 448341 497683 565880 629910 654394 633053 580882 523153 471140
18836 471140 436142 421763 431894 440663 418477 399166 377123 378166 403165 435090 470534 473231
$$ packed form
18922C01810J1855M757m824j4265j4254J218j462n721k388J3143R654L614p177
18909B95960r807p096o234M169q284r334L698J4154K7051L6739N1774P0716N4362
18896E17868j67m7313n4702l6866l1325k1865q769J0841J3418K7458N7144O6000
18884D91722L7516j1136l7216m3021n0049m9726k2891j6280r102q620J880J6655
18872B99732K3215K4450L2454J6893j5812j2369j743j2637L589L3762L3801K4494
18860D49829J8050K6630J9891K650M702J5964K6971j199l6814m3849m1995k3460
18848D17370k17M613J734K4841M9342O8197O4030K4484k1341n2171n7729n2013
18836D71140l4998j4379J0131Q769k2186j9311k2043J043K4999L1925L5444K697
$$ plain form
18824 473231 447398 423542 414273 399054 400771 403238 416188 440051 469704 513229 533533 513153
18812 513153 482199 450584 432754 428646 432538 426322 421055 433525 437905 422015 407566 396960
18800 396960 376917 350759 326696 319749 326237 334785 323234 308588 292523 286239 291751 308376
18788 308376 322271 325367 316989 294879 269495 239929 231472 229585 217397 222096 232475 238996 254166
18775 254166 274423 285362 261124 256279 260484 268798 302743 362218 405654 397481 357897 306253
18763 306253 251534 232399 226867 226170 228792 221451 206224 193387 180164 157312 154113 153619 140306
18750 140306 130526 128890 132186 142317 139914 134718 139744 147138 142644 132013 126814 133183 133365 134682
18736 134682 133260 133179 137227 137656 131515 127596 119565 116617 112869 108082 109706 109470 109978 116941 120058
$$ packed form
18824D73231k5833k3856r269j5219J717K467J2950K3863K9653M3525K0304k0380
18812E13153l0954l1615j7830m108L892o216n267J2470M380j5890j4449j0606
18800C96960k0043k6158k4063o947O488Q548j1551j4646j6065o284N512J6625
18788C08376J3895L096q378k2110k5384k9566q457j887j2188M699J0379O521J5170
18775B54166K0257J0939k4238m845M205Q314L3945N9475M3436q173l9584n1644
18763C06253n4719j9135n532o97K622p341j5227j2837j3223k2852l199m94j3313
18750A40306r780j636L296J0131k403n196N026P394m494j0631n199O369J82J317
18736A34682j422q1M048M29o141l919q031k948l748m787J624k36N08O963L117
$$ plain form
18721 120058 121588 132216 136446 129742 138868 151142 157755 154324 153379 158665 172926 195244 203605
18708 203605 210779 206874 190494 171265 169065 173017 172084 167260 158589 156302 165714 155128 143230
18695 143230 144658 141122 156233 166970 170617 169135 176728 186866 200263 214982 240183 275215
18683 275215 297651 295715 304769 323759 340041 346939 348377 336287 323796 339243 357359 383467
18671 383467 414583 413728 418927 442334 470436 479526 474976 457298 426422 384748 345565 324112
18659 324112 328103 332433 323532 319800 304849 288767 285327 297086 293067 281995 275676 269525 266781
18646 266781 288361 326968 388289 433832 447148 416085 379461 341439 315335 304377 320124
18635 320124 350109 397638 451975 487524 507687 520762 524562 490013 444808 420827 399835 405597
$$ packed form
18721A20058J530J0628M230o704R126J2274O613l431r45N286J4261K2318Q361
18708B03605P174l905j6380j9229k200L952r33m824q671k287R412j0586j1898
18695A43230J428l536J5111J0737L647j482P593J0138J3397J4719K5201L5032
18683B75215K2436j936R054J8990J6282O898J438j2090j2491J5447J8116K6108
18671C83467L1116q55N199K3407K8102R090m550j7678l0876m1674l9183k1453
18659C24112L991M330q901l732j4951j6082l440J1759m019j1072o319o151k744
18646B66781K1580L8607O1321M5543J3316l1063l6624l8022k6104j0958J5747
18635C20124K9985M7529N4337L5549K0163J3075L800l4549m5205k3981k0992N762
$$ plain form
18623 405597 440044 500131 553553 561252 508125 439418 375191 336272 306060 278451 273687 295349
18611 295349 337119 388215 415858 408733 384804 364112 342762 343253 339038 320523 288703 260452
18599 260452 241668 236248 234754 235221 243462 256758 262299 249584 246438 244508 244191 241750 232343 226507
18585 226507 222301 216535 210526 200786 191270 181969 188196 203712 228834 249765 261976 278249 289832
18572 289832 291745 278571 267955 256012 247061 235952 226764 217127 215117 220484 240282 259364 271063
18559 271063 271909 267542 241453 220510 202804 197547 208281 202006 198838 194982 190254 185383 173917
18546 173917 170601 182379 197954 199477 194667 197854 200195 202808 216396 223483 222311 206445 192046
18533 192046 188482 191456 201702 210223 218543 211153 203834 200349 198096 188565 196823 210892 202621 196728
$$ packed form
18623D05597L4447O0087N3422P699n3127o8707o4227l8919l0212k7609m764K1662
18611B95349M1770N1096K7643p125k3929k0692k1350M91m215j8515l1820k8251
18599B60452j8784n420j494M67Q241J3296N541j2715l146j930l17k441r407n836
18585B26507m206n766o009r740r516r301O227J5516K5122K0931J2211J6273J1583
18572B89832J913j3174j0616j1943q951j1109r188r637k010N367J9798J9082J1699
18559B71063Q46m367k6089k0943j7706n257J0734o275l168l856m728m871j1466
18546A73917l316J1778J5575J523m810L187K341K613J3588P087j172j5866j4399
18533A92046l564K974J0246Q521Q320p390p319l485k253r531Q258J4069q271n893
$$ plain form
18519 196728 214864 217628 224245 231212 231985 235221 231932 235192 237525 238542 252787 264803 274083 283101
18505 283101 284728 285425 282188 279850 280862 261640 246347 239192 238899 246888 256648 250033 251847 250972
18491 250972 261525 275805 280984 277731 281968 287481 299493 305711 310765 325848 338884 354145 371956
18478 371956 391858 402598 411188 429915 437815 437162 433574 434995 447831 453118 446041 440244 440224 435336
18464 435336 429146 452028 473311 482108 495818 518543 529453 530171 535040 534978 548929 589702 648934
18451 648934 722658 799657 842516 838834 808928 784951 767695 759246 763919 779837 789763 809999
18439 809999 830507 854044 875467 909471 969485 1024167 1072937 1116346 1163107 1215754 1283102
18428 1283102 1348298 1413761 1505232 1623750 1791206 2036740 2308289 2489892 2591791 2667629
$$ packed form
18519A96728J8136K764O617O967P73L236l289L260K333J017J4245J2016R280R018
18505B83101J627O97l237k338J012j9222j5293p155k93P989R760o615J814q75
18491B50972J0553J4280N179l253M237N513J2012O218N054J5083J3036J5261J7811
18478C71956J9902J0740Q590J8727P900o53l588J421J2836N287p077n797k0m888
18464D35336o190K2882K1283Q797J3710K2725J0910P18M869o2J3951M0773N9232
18451F48934P3724P6999M2859l682k9906k3977j7256q449M673J5918R926K0236
18439H09999K0508K3537K1423L4004O0014N4682M8770M3409M6761N2647O7348
18428A283102O5196O5463R1471J18518J67456K45534K71549J81603J01899P5838
$$ plain form
18418 2667629 2761282 2929688 3183051 3558181 4131112 5053446 6513870 8081905 8519155
18409 8519155 8042755 7409195 7192725 7627129 7917721 7511419 6856103 6344892 6311600 6859889
18399 6859889 7519897 7394762 6733552 5963737 5392743 5173077 5237604 5507374 5902557 6373985
18389 6373985 6896601 7512439 8256714 9201109 10499790 12288163 14111667 15270860 16424646
18380 16424646 18509293 22628385 28472914 31507383 30038721 26205941 22115505 19320267
18372 19320267 17987670 17743831 18533038 20474631 22603092 23059792 22392231 21796085 22186448
18363 22186448 24176481 27599930 30710915 32380942 33737606 36091719 40646619 47936590
18355 47936590 58754244 72874858 83755916 90045153 95171155 94995129 87567064 78511309
$$ packed form
18418B667629R3653J68406K53363L75130N72931R22334J460424J568035M37250
18409H519155m76400o33560k16470M34404K90592m06302o55316n11211l3292N48289
18399F859889O60008j25135o61210p69815n70994k19666O4527K69770L95183M71428
18389F373985N22616O15838P44275R44395J298681J788373J823504J159193J153786
18380A6424646K084647M119092N844529L034469j468662l832780m090436k795238
18372A9320267j332597k43839P89207J941593K128461M56700o67561n96146L90363
18363B2186448J990033L423449L110985J670027J356664K354113M554900P289971
18355D7936590J0817654J4120614J0881058O289237N126002j76026p428065r055755
$$ plain form
18347 78511309 72458688 71385831 70813437 68402647 66695390 68572206 77132491 91078270
18339 91078270 102196950 100225409 87893711 73187144 61435947 53913691 48583953
18332 48583953 44700626 42169286 41238132 42056775 44633984 49237120 56699058 68105566
18324 68105566 84158300 104180362 121978777 134333642 144722711 152014736 152661256
18317 152661256 142826107 127244597 113439491 101560315 90323007 81629838 77330213
18310 77330213 79759569 91932102 118085049 153018382 164534613 147851486 122159729
18303 122159729 97707996 79539076 67362742 59506581 53335075 46519830 39562588
18296 39562588 33502930 29268436 27101466 26763567 28058277 29831750 29611668 27567879
$$ packed form
18347G8511309o052621j072857n72394k410790j707257J876816Q560285J3945779
18339I1078270J1118680j971541j2331698j4706567j1751197p522256n329738
18332D8583953l883327k531340r31154Q18643K577209M603136P461938J1406508
18324F8105566J6052734K0022062J7798415J2354865J0389069P292025O46520
18317A52661256r835149j5581510j3805106j1879176j1237308q693169m299625
18310G7330213K429356J2172533K6152947L4933333J1516231j6683127k5691757
18303A22159729k4451733j8168920j2176334p856161o171506o815245o957242
18296C9562588o059658m234494k166970l37899J294710J773473k20082k043789
$$ plain form
18288 27567879 25072103 23149786 22547593 22562749 21594968 19900857 18457036 18014685 18472578
18279 18472578 18286447 16970135 14872886 12618128 10679583 9217027 8169895 7413046
18271 7413046 6847562 6376804 5969961 5637583 5369171 5154486 4975489 4812977 4663933
18262 4663933 4545034 4449142 4380633 4327551 4333530 4451222 4769586 5292340 5594592 5344079
18252 5344079 4809842 4222014 3765268 3463632 3277071 3169952 3117660 3143310 3263883 3524285
18242 3524285 3753867 3724335 3495526 3217077 2976926 2815926 2703407 2624398 2574630 2548029
18232 2548029 2532340 2468682 2339309 2182766 2033803 1915085 1831558 1782293 1756625 1756827 1767049
18221 1767049 1776951 1785708 1770991 1743329 1720731 1713638 1679725 1621457 1547180 1461971 1373588 1320320
$$ packed form
18288B7567879k495776j922317o02193J5156r67781j694111j443821m42351M57893
18279A8472578j86131j316312k097249k254758j938545j462556j047132p56849
18271G413046n65484m70758m06843l32378k68412k14685j78997j62512j49044
18262D663933j18899r5892o8509n3082N979J17692L18364N22754L02252k50513
18252E344079n34237n87828m56746l01636j86561j07119n2292K5650J20573K60402
18242C524285K29582k9532k28809k78449k40151j61000j12519p9009m9768k6601
18232B548029j5689o3658j29373j56543j48963j18718q3527m9265k5668K02J0222
18221A767049R902Q757j4717k7662k2598p093l3913n8268p4277q5209q8383n3268
$$ plain form
18209 1320320 1287174 1242192 1199713 1169824 1143749 1102648 1075475 1044626 1004480 981149 957993
18198 957993 935118 923010 923364 915411 913833 913915 904536 892295 864833 832882 813735 781080 743396
18185 743396 720686 692419 684806 678759 667901 664063 642601 624109 634611 645091 647547 645730
18173 645730 640064 634921 629213 626336 621694 615257 606033 610858 617374 599220 580221 568755 547701
18160 547701 516725 503254 488945 470380 448131 436317 415624 404465 409416 405848 409150 408689
18148 408689 418974 431431 429612 426323 427653 430032 445485 451884 456107 460846 470833 485439 501838
18135 501838 513910 520134 527613 546701 578011 609260 629264 648996 685038 725293 766678 838280
18123 838280 925100 1043836 1195103 1369659 1567712 1779530 2008624 2263959 2572286 2966961
$$ packed form
18209A320320l3146m4982m2479k9889k6075m1101k7173l0849m0146k3331k3156
18198I57993k2875j2108L54p953j578Q2r379j2241k7462l1951j9147l2655l7684
18185G43396k2710k8267p613o047j0858l838k1462j8492J0502J0480K456j817
18173F45730n666n143n708k877m642o437r224M825O516j8154j8999j1466k1054
18160E47701l0976j3471j4309j8565k2249j1814k0693j1159M951l568L302m61
18148D08689J0285J2457j819l289J330K379J5453O399M223M739R987J4606J6399
18135E01838J2072O224P479J9088L1310L1249K0004J9732L6042M0255M1385P1602
18123H38280Q6820J18736J51267J74556J98053K11818K29094K55335L08327L94675
$$ plain form
18113 2966961 3498020 4285556 5643574 8211341 12875921 17076288 16084302 12630509 8688904
18104 8688904 5686519 3980595 2975345 2318630 1876424 1560206 1337385 1188418 1092953
18095 1092953 1012213 926023 852625 792953 760808 721557 666583 616338 574930 545741 516614
18084 516614 503544 485987 461313 454430 447069 446133 443778 420813 412786 396998 381220 357760 340543
18071 340543 334486 325753 314581 305636 303762 298197 292342 288863 280967 276335 282153 284870 276355 270462
18057 270462 260595 263390 268154 273593 267451 271853 282533 281006 285439 292857 302040 299347 305647 331756
18043 331756 363455 391725 422124 476807 544665 596672 634952 662999 696615 716741 703940
18032 703940 680596 660894 668115 716118 785482 794152 739645 670960 627780 594677 567206 539521
$$ packed form
18113B966961N31059P87536J358018K567767M664580M200367r91986l453793l941605
18104H688904l002385j705924j005250o56715m42206l16218k22821j48967r5465
18095A092953q0740q6190p3398n9672l2145l9251n4974n0245m1408k9189k9127
18084E16614j3070j7557k4674o883p361r36k355k2965q027j5788j5778k3460j7217
18071C40543o057q733j1172q945j874n565n855l479p896m632N818K717q515n893
18057B70462r867K795M764N439o142M402J0680j527M433P418R183k693O300K6109
18043C31756L1699K8270L0399N4683O7858N2007L8280K8047L3616K0126j2801
18032G03940k3344j9702P221M8003O9364Q670n4507o8685m3180l3103k7471k7685
$$ plain form
18020 539521 505851 463198 429608 413103 404996 393020 377136 376303 376125 379005 391206 386587 381459
18007 381459 396549 424729 450827 476163 493789 508140 507635 516672 537078 551505 558368 568807
17995 568807 588949 612925 626575 607118 575355 546094 517270 495162 487046 493843 497356 497352 507069
17982 507069 513501 527066 535409 567864 607699 661883 742503 847313 971157 1109333 1311096
17971 1311096 1568152 1828700 2083080 2340319 2573602 2796518 3020469 3176091 3244927 3338365
17961 3338365 3469006 3516757 3385110 3108876 2767341 2446794 2231561 2092378 1945530 1738943
17951 1738943 1493254 1239557 1027889 860208 731218 639513 568084 519632 485865 461537
17941 461537 427671 391270 383552 385875 382896 379696 380775 394612 415484 430538 431523 415892 412422
$$ packed form
18020E39521l3670m2653l3590j6505q107j1976j5884q33j78K880J2201m619n128
18007C81459J5090K8180K6098K5336J7626J4351n05R037K0406J4427O863J0439
17995E68807K0142K3976J3650j9457l1763k9261k8824k2108q116O797L513mR717
17982E07069O432J3565Q343L2455L9835N4184Q0620J04810J23844J38176K01763
17971A311096K57056K60548K54380K57239K33283K22916K23951J55622O8836R3438
17961C338365J30641M7751j31647k76234l41535l20547k15233j39183j46848k06587
17951A738943k45689k53697k11668j67681j28990r1705p1429m8452l3767k4328
17941D61537l3866l6401p718K323k979l200J079J3837K0872J5054R85j5631l470
$$ plain form
17928 412422 438779 453435 463224 482467 512886 541372 563156 571899 565070 578796 626931 715255
17916 715255 814215 859360 831041 757946 679947 626335 611731 609786 605406 589072 574105 537612
17904 537612 509392 494835 479641 466054 458697 449328 436563 410181 374214 341324 327829 328403
17892 328403 330534 341983 355450 354299 336973 329823 327414 335497 341961 372181 407303 453757 505702
17879 505702 539489 544887 534298 539548 550907 587643 621932 618697 602040 593448 575310 570542
17867 570542 573125 579648 584912 584695 614799 663659 698232 677304 639062 607606 593876 612602
17855 612602 657229 685741 683128 670599 673136 690487 708501 723886 738053 732531 718082 717093
17843 717093 748357 803309 848314 838968 786532 734546 702492 695116 714972 761185 824905 858325
$$ packed form
17928D12422K6357J4656R789J9243L0419K8486K1784Q743o829J3726M8135Q8324
17916G15255R8960M5145k8319p3095p7999n3612j4604j945m380j6334j4967l6493
17904E37612k8220j4557j5194j3587p357r369j2765k6382l5967l2890j3495N74
17892C28403K131J1449J3467j151j7326p150k409Q083O464L0220L5122M6454N1945
17879E05702L3787N398j0589N250J1359L6736L4289l235j6657q592j8138m768
17867E70542K583O523N264k17L0104M8860L4573k0928l8242l1456j3730J8726
17855F12602M4627K8512k613j2529K537J7351J8014J5385J4167n522j4449r89
17843G17093L1264N4952M5005r346n2436n1986l2054p376J9856M6213O3720L3420
$$ plain form
17831 858325 866734 864096 863358 876215 921953 979280 1038539 1070762 1063202 1021953 954857 883466
17819 883466 821726 770137 727903 698857 675601 660715 663777 676602 707347 749102 778367 785617
17807 785617 777254 785982 814260 855392 896089 943753 988694 1033155 1065624 1080001 1119063 1178349
17795 1178349 1254765 1321575 1362887 1357941 1334733 1320883 1327244 1339544 1340165 1347716 1368261 1411640
17783 1411640 1449227 1480234 1515585 1568518 1645863 1746306 1878281 2033373 2199934 2416262
17773 2416262 2684956 2988066 3288784 3573720 3853060 4212179 4710660 5283115 5773822
17764 5773822 6231891 6795040 7603401 8726254 10101497 11635903 13447350 15781694 18860331
17755 18860331 22956904 28614928 37142926 50498512 67910049 80810043 83830789 82844460
$$ packed form
17831H58325Q409k638p38J2857M5738N7327N9259L2223p560m1249o7096p1391
17819H83466o1740n1589m2234k9046k3256j4886L062J2825L0745M1755K9265P250
17807G85617q363Q728K8278M1132M0697M7664M4941M4461L2469J4377L9062N9286
17795A178349P6416O6810M1312m946k3208j3850O361J2300O21P551K0545M3379
17783A411640L7587L1007L5351N2933P7345J00443J31975J55092J66561K16328
17773B416262K68694L03110L00718K84936K79340L59119M98481N72455M90707
17764E773822M58069N63149Q08361J122853J375243J534406J811447K334344L078637
17755A8860331M096573N658024Q527998J3355586J7411537J2899994L020746r86329
$$ plain form
17747 82844460 85894316 100432312 124596653 136977221 126803835 106608304 88297767
17740 88297767 80258193 80822041 78037033 66592903 51408522 37217901 26827409 20159669
17732 20159669 15848714 12887176 10775647 9262669 8171575 7371438 6745088 6133579
17724 6133579 5554924 5098698 4749248 4390700 4017873 3633791 3262589 2970231 2738036
17715 2738036 2501329 2257642 2032238 1830295 1679241 1554961 1447484 1356730 1270368 1191926
17705 1191926 1127264 1070166 1026380 986817 941573 890336 840765 802108 763233 724803 688509
17694 688509 653351 621430 598453 585785 561293 549357 521808 489225 462983 435045 423362
17683 423362 416362 409477 402491 392575 389061 388852 388144 382878 370892 352618 343242 330940 323219 327843
$$ packed form
17747H2844460L049856J4537996K4164341J2380568j0173386k0195531j8310537
17740H8297767q039574N63848k785008j1444130j5184381j4190621j0390492o667740
17732B0159669m310955k961538k111529j512978j091094q00137o26350o11509
17724F133579n78655m56226l49450l58548l72827l84082l71202k92358k32195
17715B738036k36707k43687k25404k01943j51054j24280j07477r0754q6362p8442
17705A191926o4662n7098m3786l9563m5244n1237m9571l8657l8875l8430l6294
17694F88509l5158l1921k2977j2668k4492j1936k7549l2583k6242k7938j1683
17683D23362p000o885o986r916l514k09p08n266j1986j8274r376j2302p721M624
$$ plain form
17669 327843 321452 307972 290235 271126 256139 244338 236039 228365 216717 210940 210205 209070 201067
17656 201067 200713 197053 184061 188489 200557 202440 204386 205288 196589 194422 190982 188542 185441 192524
17642 192524 195058 184092 191543 194271 193637 197569 207444 213477 215476 211253 198649 196472 205966 210103
17628 210103 208662 198809 186191 196282 209174 219189 212558 202217 199363 198339 205275 223207 219387
17615 219387 217342 213203 211538 203477 194860 190804 199702 196343 190599 186174 191875 191823 190550 185361 182437
17600 182437 183535 180654 178309 186370 182204 174048 168533 168928 166147 185476 196440 198528 203454 227197
17586 227197 260314 312781 371569 407576 428982 445309 495706 575890 627373 605793 544825
17575 544825 485873 452257 429818 401327 340281 282277 243791 206982 180629 168258 157192
$$ packed form
17669C27843o391j3480j7737j9109j4987j1801q299p674j1648n777p35j135q003
17656B01067l54l660j2992M428J2068J883J946R02q699k167l440k440l101P083
17642A92524K534j0966P451K728o34L932R875O033J999m223j2604k177R494M137
17628B10103j441r853j2618J0091J2892J0015o631j0341k854j024O936J7932l820
17615B19387k045m139j665q061q617m056Q898l359n744m425N701n2j273n189k924
17600A82437J098k881k345Q061m166q156n515L95k781J9329J0964K088M926K3743
17586B27197L3117N2467N8788L6007K1406J6327N0397Q0184N1483k1580o0968
17575E44825n8952l3616k2439k8491o1046n8004l8486l6809k6353j2371j1066
$$ plain form
17564 157192 153466 146069 134119 137207 145961 141856 133078 123676 122261 113869 113901 127232 124078 107801
17550 107801 104100 102104 103683 106247 110390 100120 109078 113427 103190 98491 108987 108432 97018
17537 97018 106999 129430 148533 159751 173772 188609 199111 208516 223031 234695 241558 230558
17525 230558 227989 239121 258445 255657 228906 204237 196735 188780 169657 147325 132271 124331
17513 124331 117353 105254 106619 96220 86940 81525 83086 81299 81559 91518 91886 96894 103371 104741
17499 104741 92578 74242 70236 60440 44318 40190 33839 47158 65328 68371 71075 69856 66428
17486 66428 59548 57733 54095 52656 48942 47893 49906 53612 59357 56393 59059 51989 38178 36151
17472 36151 37090 40838 48024 48900 43923 43611 40975 39691 40359 35092 37529 40663 41134 33957 38253 41448
$$ packed form
17564A57192l726p397j1950L088Q754m105q778r402j415q392L2J3331l154j6277
17550A07801l701j996J579K564M143j0270Q958M349j0237m699J0496n55j1414
17537I7018R981K2431J9103J1218J4021J4837J0502R405J4515J1664O863j1000
17525B30558k569J1132J9324k788k6751k4669p502p955j9123k2332j5054p940
17513A24331o978j2099J365j0399r280n415J561j787K60R959L68N008O477J370
17499A04741j2163j8336m006r796j6122m128o351J3319J8170L043K704j219l428
17486F6428o880j815l638j439l714j049K013L706N745k964K666p070j3811k027
17472C6151R39L748P186Q76m977l12k636j284O68n267K437L134M71p177M296L195
$$ plain form
17456 41448 41056 42152 45371 54566 60631 61231 63917 70389 74380 85083 101512 124215 145454 169434
17442 169434 193307 224314 216102 184445 168965 150975 135210 114281 90952 76201 63119 55190
17430 55190 55744 57544 57262 58363 51923 41729 38769 39494 35467 23658 10702 11843 17789 31766
17416 31766 38095 42847 39923 40671 40005 41461 46636 46921 43034 33303 25654 32045 35362 36839 35186
17401 35186 35051 49121 55793 58047 67372 73405 78378 84554 76421 62855 53115 43978 35350 33559
17387 33559 30931 24588 23640 20721 15180 5264 -1485 1729 11858 7166 5882 18191 25870 28345
17373 28345 26484 29943 31906 33473 26907 29194 35144 31979 34830 37380 40122 48568 45110 39234
17359 39234 35106 35267 37797 41203 39996 32637 29350 21559 15529 16922 8817 18354 29399 29309 41080
$$ packed form
17456D1448l92J096L219R195O065O00K686O472L991J0703J6429K2703K1239K3980
17442A69434K3873L1007q212l1657j5480j7990j5765k0929k3329j4751j3082p929
17430E5190N54J800k82J101o440j0194k960P25m027j1809j2956J141N946J3977
17416C1766O329M752k924P48o66J456N175K85l887r731p649O391L317J477j653
17401C5186j35J4070O672K254R325O033M973O176q133j3566r740r137q628j791
17387C3559k628o343r48k919n541r916o749L214J0129m692j284J2309P679K475
17373B8345j861L459J963J567o566K287N950l165K851K550K742Q446l458n876
17359C9234m128J61K530L406j207p359l287p791o030J393q105R537J1045r0J1771
$$ plain form
17344 41080 43400 39243 31686 24673 18173 12718 15093 17826 18542 28976 28229 23623 18242 16982 11726
17329 11726 1227 8240 26363 26858 11287 10205 15404 17726 19084 16955 18989 21143 24202 30857
17315 30857 18022 4505 733 -975 2397 14230 25330 28911 24523 21854 14941 18148 15024
17302 15024 4134 236 8014 19033 20688 13968 3613 6757 9891 21216 22226 9317 7707
17289 7707 2144 -10411 -6236 10672 13279 5979 2972 5824 13370 13854 11015 8741 7963 1006 3787
17274 3787 3912 5743 4503 -1561 -6431 -8722 -1315 -5120 -2290 5647 8832 16117 9773 11985 9938
17259 9938 13306 20882 11302 -1496 -1916 2653 13074 14275 11483 8199 -287 2869 5059 8939
17245 8939 9623 5065 3526 14234 9754 11176 7500 6671 7638 10964 15218 11813 16233 17759 13181
$$ packed form
17344D1080K320m157p557p013o500n455K375K733P16J0434p47m606n381j260n256
17329A1726j0499P013J8123M95j5571j082N199K322J358k129K034K154L059O655
17315C0857j2835j3517l772j708L372J1833J1100L581m388k669o913L207l124
17302A5024j0890l898P778J1019J655o720j0355L144L134J1325J010j2909j610
17289G707n563j2555M175J6908K607p300l007K852P546M84k839k274p78o957K781
17274C787J25J831j240o064m870k291P407l805K830P937L185P285o344K212k047
17259I938L368P576r580j2798m20M569J0421J201k792l284q486L156K190L880
17245H939O84m558j539J0708m480J422l676q29R67L326M254l405M420J526m578
$$ plain form
17230 13181 3651 -7436 -7268 -8987 -68 4084 4925 875 7494 5105 -4715 -13541 -7757 -9189 -4135
17215 -4135 -6642 -10833 -2567 8561 12139 9205 -4521 -5660 8087 16584 6183 1902 4919 2913
17201 2913 6135 3435 674 2084 17233 21427 20257 16396 9359 4809 2501 8557 18488 15603
17187 15603 18931 22796 18988 19008 8609 10010 19755 27974 22620 20690 23110 20875 20550 14934 13119
17172 13119 19318 32191 38578 37625 30175 23719 20407 33785 50051 64409 82020 93513 96416
17159 96416 99169 123896 160563 210682 273418 361410 429056 442041 442947 466837 543610 652070
17147 652070 704417 649510 550988 470791 438161 424251 399957 338797 247642 176405 135350
17136 135350 107818 87680 76217 66824 58436 55164 45227 36117 27047 15163 17336 22010 26775
$$ packed form
17230A3181r530j1087J68j719Q919M152Q41m050O619k389r820q826N784j432N054
17215d135k507m191Q266J1128L578k934j3726j139J3747Q497j0401m281L017k006
17201B913L222k700k761J410J5149M194j170l861p037m550k308O056R931k885
17187A5603L328L865l808K0j0399J401R745Q219n354j930K420k235l25n616j815
17172A3119O199J2873O387r53p450o456l312J3378J6266J4358J7611J1493K903
17159I6416K753K4727L6667N0119O2736Q7992O7646J2985R06K3890P6773J08460
17147F52070N2347n4907r8522q0197l2630j3910k4294o1160r1155p1237m1055
17136A35350k7532k0138j1463r393q388l272r937r110r070j1884K173M674M765
$$ plain form
17123 26775 33502 30372 24882 29605 29780 25586 30464 32376 27749 24949 22342 19042 16634 13273 6182
17108 6182 2082 1797 4067 -2629 -6865 -8421 -6804 -1675 3480 4831 7766 -3321 -10185 -8220 -7886
17093 -7886 -4021 4387 8186 -1559 -5272 -18422 -14680 -10927 -7087 -4616 -5779 -4415 -5415 -6127 -7595
17078 -7595 -6076 -6157 -9925 -7329 -12501 -14533 -4341 -802 1345 273 -9416 -11881 -4452 9391 8184
17063 8184 1348 -4083 -3574 6989 9044 11021 9879 -1738 -12411 -24392 -17924 -5166 956 4117
17049 4117 2014 8509 6381 1744 7637 1035 704 2080 -190 -5808 -11553 -12917 -5763 -3322 -1665
17034 -1665 -6006 -5596 -4876 -9310 -6453 4351 12441 20192 19056 2920 -4080 -888 359 -1974 -2365
17019 -2365 -4698 -10391 -15849 -13733 -12228 -11484 -10258 -6797 -8955 -7286 -7845 -4216 -7041 -3580 -4923
$$ packed form
17123B6775O727l130n490M723J75m194M878J912m627k800k607l300k408l361p091
17108F182m100k85K270o696m236j556J617N129N155J351K935j1087o864J965L34
17093g886L865Q408L799r745l713j3150L742L753L840K471j163J364j000p12j468
17078g595J519q1l768K596n172k032J0192L539K147j072r689k465P429J3843j207
17063H184o836n431N09J0563K055J977j142j1617j0673j1981O468J2758O122L161
17049D117k103O495k128m637N893o602l31J376k270n618n745j364P154K441J657
17034a665m341M10P20m434K857J0804Q090P751j136j6136p000L192J247k333l91
17019b365k333n693n458K116J505P44J226L461k158J669n59L629k825L461j343
$$ plain form
17004 -4923 -8543 -15548 -15593 -15577 -16530 -15676 -6224 -1282 -3982 297 -1424 -7499 -6714 -3417 -5665 -3399
16988 -3399 -5407 -13215 -9000 -8595 -5039 -10893 -14569 -15587 -8313 671 -447 -2235 -2291 2611 5433
16973 5433 4423 -1085 -6762 -13389 -18172 -7625 914 -3217 -616 3674 3656 -3684 1036 5457 479
16958 479 2424 12737 18088 16323 8973 7367 10278 13564 8887 11824 15640 17438 11825 4902 196
16943 196 2150 2203 -5653 -12531 -5431 -1400 221 1326 -3788 -3281 -922 -9181 -12984 -1149 -5239
16928 -5239 -10499 -11618 -11002 -6281 -7306 -15511 -17272 -20256 -23734 -18478 -7126 843 -11650 -16334
16914 -16334 -17222 -10594 -5211 584 -2587 -2619 5163 -1520 -1771 -2160 5870 -455 5797 5110 1705 3533
16898 3533 2054 -12284 -14281 -8295 -7361 -7104 -1309 5250 14645 12636 3501 -5612 -8730 -12143 -15605
$$ packed form
17004d923l620p005m5J6r53Q54R452M942k700M279j721o075P85L297k248K266
16988c399k008p808M215M05L556n854l676j018P274Q984j118j788n6M902K822
16973E433j010n508n677o627m783J0547Q539m131K601M290j8p340M720M421m978
16958D79J945J0313N351j765p350j606K911L286m677K937L816J798n613o923m706
16943A96J954N3p856o878P100M031J621J105n114N07K359q259l803J1835m090
16928e239n260j119O16M721j025q205j761k984l478N256J1352P969j2493m684
16914a6334q88O628N383N795l171l2P782o683k51l89Q030o325O252o87l405J828
16898C533j479j4338j997N986R34K57N795O559R395k009r135r113l118l413l462
$$ plain form
16883 -15605 -16032 -3831 4830 7914 11333 7639 8714 10531 4047 -8927 -14182 -1282 8089 4172
16869 4172 -5507 -9351 -2574 105 1957 -8700 -14361 -13172 -8889 -5193 -4291 -2271 -1222 -5446 6894
16854 6894 4395 5966 -4212 -2141 2876 -1546 -7497 -1016 495 -5106 -10139 -4740 -3708 -7908
16840 -7908 -11247 -6391 7621 13169 10030 14553 7709 4044 -4622 46 7312 -1554 -4896 -8151
16826 -8151 -4404 -1090 3690 -2734 -5110 -7285 -13841 -15365 -18751 -10444 -7608 -11070 -15182 -10732 -17793
16811 -17793 -16764 -17367 -13588 -14371 -15198 -12317 -903 1310 -4403 -10562 -14179 -7628 -8141 1401 67
16796 67 -2697 -9702 -6124 -2594 -6006 -9533 -10141 -15229 -27648 -21088 -16792 -15982 -11840 -16366 -18666
16781 -18666 -19985 -21612 -20194 -18848 -14889 -16443 -9309 -7671 -6824 -6839 -8590 -7709 -10929 -15442 -12991
$$ packed form
16883a5605m27J2201Q661L084L419l694J075J817o484j2974n255J2900R371l917
16869D172r679l844O777K679J852j0657n661J189M283L696R02K020J049m224J2340
16854F894k499J571j0178K071N017m422n951O481J511n601n033N399J032m200
16840g908l339M856J4012N548l139M523o844l665q666M668P266q866l342l255
16826h151L747L314M780o424k376k175o556j524l386Q307K836l462m112M450p061
16811a7793J029o03L779p83q27K881J1414K213n713o159l617O551n13R542j334
16796F7k764p005L578L530l412l527o08n088j2419O560M296Q10M142m526k300
16781a8666j319j627J418J346L959j554P134J638Q47j5j751Q81l220m513K451
$$ plain form
16766 -12991 -7827 -4318 -13641 -19249 -19128 -9640 -11394 -5986 -1307 7570 7924 2356 7352 6186 436
16751 436 -6726 -19351 -23379 -15239 -2325 12507 18496 17079 22900 20231 9918 -3299 -7509 -13358
16737 -13358 -9463 -6089 -6888 -9348 -4745 -9838 -7941 -10990 -6321 -5480 -8873 -8255 -8895 -14381 -7838
16722 -7838 -2329 -6409 -8340 -12846 -10548 -4469 -389 -6603 -9474 -5737 1170 3927 1681 306 -7670
16707 -7670 -8116 -12620 -21825 -22676 -21661 -18123 -16475 -12848 -4660 3052 5153 -4103 -10264 -5501 2902
16692 2902 -6368 -9809 -4339 -4187 -8808 -10508 -12966 -18223 -23224 -17973 -17971 -19472 -12310 -9423 -7421 -5523
16676 -5523 -1578 -727 -8047 -14796 -15697 -13041 -16427 -20982 -18362 -14990 -17773 -15325 -15699 -8248 -3966
16661 -3966 1251 1935 -7590 -18602 -20204 -13624 -7822 -5265 -7093 -5321 -114 2031 -8184 -11461
$$ packed form
16766a2991N164L509r323n608J21R488j754N408M679Q877L54n568M996j166n750
16751D36p162j2625m028Q140J2914J4832N989j417N821k669j0313j3217m210n849
16737a3358L895L374p99k460M603n093J897l049M669Q41l393O18o40n486O543
16722g838N509m080j931m506K298O079M080o214k871L737O907K757k246j375p976
16707g670m46m504r205q51J015L538J648L627Q188P712K101r256o161M763Q403
16692B902r270l441N470J52m621j700k458n257n001N251Kj501P162K887K002J898
16676e523L945Q51p320o749r01K656l386m555K620L372k783K448l74P451M282
16661c966N217O84r525j1012j602O580N802K557j828J772N207K145j0215l277
$$ plain form
16647 -11461 -9453 -17680 -17964 -13102 -15536 -14652 -19285 -20358 -19188 -14867 -14414 -12655 -8725 -4310 -7496
16632 -7496 -11207 -12682 -12031 -5859 3341 11911 12133 199 -4261 -16094 -22757 -26629 -22390 -17612 -18793
16617 -18793 -19127 -9177 -5465 -3833 292 3445 -668 -3655 -11730 -12255 -15186 -12134 -10207 -9152 -17879
16602 -17879 -20806 -16896 -8870 -9629 -3197 -2868 -6338 -9282 -10904 -16191 -18434 -16696 -14745 -21215 -22031
16587 -22031 -24691 -23960 -15385 -8846 -4001 732 -3144 -1958 -5713 -15899 -16164 -10364 -4024 2139 420
16572 420 1086 -753 -6663 -8054 -6720 -7672 -15814 -11575 -1408 -5131 -10342 -13284 -4516 -1629 -4607
16557 -4607 5498 12314 13875 14638 6678 318 6047 -4846 -6099 -2592 -14696 -24435 -24860 -24418 -20694
16542 -20694 -13689 -13197 -19596 -17257 -12391 -19757 -22413 -23261 -15950 -15943 -10875 -12136 -12167 -14948 -7814 3060
$$ packed form
16647a1461K008q227k84M862k434Q84m633j073J170M321M53J759L930M415l186
16632g496l711j475O51O172R200Q570K22j1934m460j1833o663l872M239M778j181
16617a8793l34R950L712J632M125L153m113k987q075n25k931L052J927J055q727
16602a7879k927L910Q026p59O432L29l470k944j622n287k243J738J951o470q16
16587b2031k660P31Q575O539M845M733l876J186l755j0186k65N800O340O163j719
16572D20O66j839n910j391J334r52q142M239J0167l723n211k942Q768K887k978
16557d607J0105O816J561P63p960o360N729j0893j253L507j2104r739m25M42L724
16542b0694P005M92o399K339M866p366k656q48P311PN068j261l1k781P134J0874
$$ plain form
16526 3060 -4116 -1102 5442 1015 -10073 -15010 -9020 -10068 -13826 -8759 -9853 -10754 -10772 -7394 -7530
16511 -7530 1976 5995 4362 -5859 -15243 -26776 -27616 -14693 -8454 -13309 -20063 -20632 -24805 -17275
16497 -17275 -20375 -29153 -17106 -17267 -18944 -21633 -15984 -13426 -14875 -15760 -9328 -10369 -9200 -1254 -1853
16482 -1853 -5432 400 1301 -6340 -14028 -7115 -2583 -2615 -13864 -22425 -20746 -18488 -20840 -27456 -23380
16467 -23380 -12501 -13032 -11884 -11961 -4508 -12706 -10171 -8297 -16509 -20178 -21749 -21874 -26288 -25965 -17230
16452 -17230 -12432 -12068 -4926 3736 -1918 -2060 9907 7858 -996 4634 7962 1800 -701 1731 -4464
16437 -4464 -2407 -13239 -16302 -14185 -18536 -16347 -5516 -8898 -19531 -18995 -4643 -9491 -13312 -10281
16423 -10281 -8236 -10893 -9275 -2830 -228 4020 6368 9878 7462 3213 728 6281 323 -5152
$$ packed form
16526C060p176L014O544m427j1088m937N990j048l758N067j094r01j8L378j36
16511g530R506M019j633j0221r384j1533q40J2923O239m855o754n69m173P530
16497a7275l100q778J2047j61j677k689N649K558j449q85O432j041J169P946n99
16482a853l579N832R01p641p688O913M532l2j1249q561J679K258k352o616M076
16467b3380J0879n31J148p7P453q198K535J874q212l669j571j25m414L23Q735
16452a7230M798L64P142Q662n654j42J1967k049q854N630L328o162k501K432o195
16437d464K057j0832l063K117m351K189J0831l382j0633N36J4352m848l821L031
16423a0281K045k657J618O445K602M248K348L510k416m249k485N553n958n475
$$ plain form
16409 -5152 -5443 -5377 -7044 -14636 -20025 -21595 -13957 -3264 3805 -4857 -9919 -1095 509 3465 -997
16394 -997 -2600 -3604 -2369 -6934 -4471 -1384 -6090 -5676 -3073 -8489 -10290 -11055 -11156 -5849 -11982 -18006
16378 -18006 -25419 -21593 -15577 -16519 -17752 -21759 -15236 -16533 -21368 -24856 -16533 -19973 -17572 -7562
16364 -7562 -7138 -9842 -11483 -20032 -14149 -6271 -6304 -13614 -6691 5029 11713 8562 8037 13169 6494
16349 6494 2027 3676 -4879 -19106 -20235 -9686 -1455 5252 -165 -11219 -22420 -26741 -17438 -15894
16335 -15894 -12694 -12989 -15933 -17402 -13920 -9598 -7653 -5266 1648 -9208 -12492 -15937 -10576 -5742
16321 -5742 -1518 -3511 -4957 -10516 -15265 -6248 646 -868 -4516 3289 -4706 -10849 -19059 -21199 -16062
16306 -16062 -7171 -2945 -4123 -7378 -8130 -7659 -15689 -4679 -2353 -9045 -13341 -21036 -25448 -16009 -6175
$$ packed form
16409e152k91O6j667p592n389j570P638J0693P069q662n062Q824J604K956m462
16394i97j603j004J235m565K463L087m706M14K603n416j801p65j01N307o133o024
16378a8006p413L826O016r42j233m007O523j297m835l488Q323l440K401J0010
16364g562M24k704j641q549N883P878l3p310O923J1720O684l151n25N132o675
16349F494m467J649q555j4227j129J0549Q231O707n417j1054j1201m321R303J544
16335a5894L200k95k944j469L482M322J945K387O914j0856l284l445N361M834
16321e742M224j993j446n559m749R017O894j514l648P805p995o143q210k140N137
16306a6062Q891M226j178l255p52M71q030J1010K326o692m296p695m412R439R834
$$ plain form
16291 -6175 1851 141 -13535 -20844 -17806 -15101 -11547 -8871 -2934 -6690 -19801 -20388 -16041 -19489
16277 -19489 -15993 -5765 -9375 -12638 -13235 -6225 -8593 -27486 -21557 -13873 -9368 -12793 -19653 -20953
16263 -20953 -25813 -32909 -19633 -9869 -9051 -10982 -294 7320 1545 -3993 -7806 -6934 -6829 -7121 -4172
16248 -4172 -3310 -2921 -12612 -9140 -3267 -4787 -5960 -1629 -5864 -13878 -8683 -10152 -16350 -21746 -24097
16233 -24097 -18690 -10885 -271 8019 14717 8602 -1382 -1233 6065 395 -7963 -15889 -22662 -22695 -14760
16218 -14760 -10383 2875 10711 6889 1724 -2792 -2031 -442 -745 -2452 3672 -3043 -4083 -4029 -13207
16203 -13207 -11563 -624 64 -3755 -875 -3133 -2646 -4664 -10912 -15983 -13162 -5251 -8227 -689 5399
16188 5399 -926 -12728 -15269 -6838 -9558 -13661 -15771 -13451 -11662 -7458 -13775 -14151 -7651 -15553 -16602
$$ packed form
16291f175Q026j710j3676p309L038K705L554K676N937l756j3111n87M347l448
16277a9489L496J0228l610l263n97P010k368j8893N929P684M505l425o860j300
16263b0953m860p096J3276R764Q18j931J0688P614n775n538l813Q72J05k92K949
16248d172Q62L89r691L472N873j520j173M331m235q014N195j469o198n396k351
16233b4097N407P805J0614Q290O698o115r984J49P298n670q358p926o773l3P935
16218a4760M377J3258P836l822n165m516P61J589l03j707O124o715j040N4r178
16203a3207J644J0939O88l819K880k258M87k018o248n071K821P911k976P538O088
16188E399o325j1802k541Q431k720m103k110K320J789M204o317l76O500p902j049
$$ plain form
16173 -16602 -22240 -17639 -22333 -12610 -14179 -15380 -6115 -6462 -4662 -13565 -17048 -11011 -17187 -13730 -8584
16158 -8584 -9212 -1940 -1262 -11657 -2494 -6047 -6260 -6093 1845 11913 11138 14761 7476 -3152 -5596
16143 -5596 -10857 -15336 -25395 -30539 -22166 -20343 -25044 -25251 -28009 -27976 -25083 -19195 -17642 -22134 -15197
16128 -15197 -17244 -22284 -19748 -16012 -9561 -7916 -10206 -8860 -17731 -18682 -10067 4800 8809 10749
16114 10749 6466 2108 -2761 -8107 -8716 -9659 -7435 -4818 -2683 1015 -4473 -11783 -10454 -6323 -14038
16099 -14038 -16301 -8412 -4478 -10451 -20281 -15828 -16418 -11916 -8817 -20914 -21821 -19087 -22120 -24944 -16903
16084 -16903 -8591 -7965 -10633 -16295 -15537 -7881 -4042 -10928 -8379 3918 5226 116 -885 4825 -190
16069 -190 4483 2769 709 -3881 -5428 2505 3533 4645 -822 4466 6418 4345 -4746 -9991 -6188
$$ packed form
16173a6602n638M601m694R723j569j201R265l47J800q903l483O037o176L457N146
16158h584o28P272O78j0395R163l553k13J67P938J0068p75L623p285j0628k444
16143e596n261m479j0059n144Q373J823m701k07k758L3K893N888J553m492O937
16128a5197k047n040K536L736O451J645k290J346q871r51Q615J4867M009J940
16114A0749m283m358m869n346o09r43K224K617K135L698n488p310J329M131p715
16099a4038k263P889L934n973r830M453n90M502L099j2097r07K734l033k824Q041
16084a6903Q312O26k668n662P58P656L839o886K549J2297J308n110j001N710n015
16069a90M673j714k060m590j547P933J028J112n467N288J952k073r091n245L803
$$ plain form
16054 -6188 -13018 -11767 4151 10063 9487 10445 17834 18893 9612 4111 -1402 -5295 -7236 317 4085
16039 4085 8287 5745 -6344 -9657 -9884 -8819 -16299 -17357 -5315 -7924 -6049 -2521 715 4770
16025 4770 -3092 -1517 -2819 -15069 -20125 -21243 -19913 -13153 -7628 -844 10282 3022 -4182 -5171
16011 -5171 -1816 -6661 -4750 -1527 -10675 -2111 2343 3552 2933 514 -5619 -12410 -10128 -13983 -18865
15996 -18865 -16288 -18699 -24159 -21247 -7932 5642 4700 4996 10182 9085 -2543 -8676 -6009 -4243
15982 -4243 -9723 -7041 701 -1650 -8085 -2775 -1653 -5644 -15848 -13345 -12115 -17060 -23017 -23280 -20096
15967 -20096 -16296 -11422 -5107 -14903 -21388 -20778 -16139 -18712 -12481 -7256 -10527 -5791 -9541 -10692 -7854
15952 -7854 -4065 -17960 -24772 -24078 -24583 -18207 -14627 -9981 -1327 -6365 -16504 -20267 -13933 -12049 -17368
$$ packed form
16054f188o830J251J5918N912n76R58P389J059r281n501n513l893j941P553L768
16039D085M202k542j2089l313k27J065p480j058J2042k609J875L528L236M055
16025D770p862J575j302j2250n056j118J330O760N525O784J1126p260p204r89
16011e171L355m845J911L223r148Q564M454J209o19k419o133o791K282l855m882
15996a8865K577k411n460K912J3315J3574r42K96N186j097j1628o133K667J766
15982d243n480K682P742k351o435N310J122l991j0204K503J230m945n957k63L184
15967b0096L800M874O315r796o485O10M639k573O231N225l271M736l750j151K838
15952g854L789j3895o812O94n05O376L580M646Q654n038j0139l763O334J884n319
$$ plain form
15937 -17368 -15935 -17030 -18158 -19468 -15385 -5299 64 -2254 -3056 275 2196 -2529 -4787 777
15923 777 6005 5742 9249 3771 11738 17295 12650 13024 20694 25420 4915 -6257 -221 -1327 -7927
15908 -7927 -2918 -2507 -607 -3284 -761 1874 -1974 -5523 -10813 -4193 -3276 -11405 -22752 -17016 -9005
15893 -9005 -5945 -3845 -7295 -6865 -8393 -11886 -13155 -17495 -13129 -15924 -10634 -3674 10096 7826 -3806
15878 -3806 -6359 -8071 -12651 -15923 -7637 -13371 -12706 -10682 -9195 1003 9480 6129 -1280 8527 7036
15863 7036 362 -3874 -14021 -20167 -17773 -16022 -11134 -14223 -19583 -16101 -20915 -23063 -18152 -6587
15849 -6587 -4709 -8007 5012 3585 -3001 605 -5087 -14139 -15434 -20485 -19349 -22948 -19779 -12171
15835 -12171 -5741 -6548 -6822 -4473 -9750 -15687 -7425 -81 2433 1054 -4428 -2902 1507 -2169 972
$$ packed form
15937a7368J433j095j128j310M083J0086N363k318q02L331J921m725k258N564
15923G77N228k63L507n478P967N557m645L74P670M726k0505j1172O036j106o600
15908g927N009M11J900k677K523K635l848l549n290O620R17q129j1347N736Q011
15893i005L060K100l450M30j528l493j269m340M366k795N290O960J3770k270j1632
15878c806k553j712m580l272Q286n734O65K024J487J0198Q477l351p409R807j491
15863G036o674m236j0147o146K394J751M888l089n360L482m814k148M911J1565
15849f587J878l298J3019j427o586L606n692r052j295n051J136l599L169P608
15835a2171O430q07k74K349n277n937Q262P344K514j379n482J526M409l676L141
$$ plain form
15820 972 -5089 -16775 -22421 -20180 -11197 -2924 -3416 -12011 -15459 -25177 -21433 -19253 -10323 -11711 -18673
15805 -18673 -22453 -19539 -24258 -24572 -22728 -24804 -26170 -21031 -14232 -10552 -3781 -7329 -13745 -8436 -10542
15790 -10542 -4806 11238 10204 5643 7767 2147 2816 12057 15773 14146 12555 2533 -371 1369
15776 1369 7993 8763 -1222 5157 12904 9411 5233 10281 16322 14237 8484 6278 10978 9126 2524
15761 2524 -331 -1056 419 9695 12975 5244 -524 -674 -245 499 -8973 -12235 -13179 -8961 -15859 -16953
15745 -16953 -11883 -13260 -17260 -19968 -12217 -3516 -5453 -1356 -6200 -14727 -5278 -4600 -11131 -16238 -16174
15730 -16174 -13396 -14737 -19019 -19732 -24689 -29449 -15899 -6008 2539 4004 -1159 -1129 -1681 -8511 -10152
15715 -10152 -3526 -2176 -3913 -2895 -6491 -2203 1547 2249 -6317 -9628 -4575 -1804 -4961 -10720 -14660
$$ packed form
15820I72o061j1686n646K241Q983Q273m92q595l448r718L744K180Q930j388o962
15805a8673l780K914m719l14J844k076j366N139O799L680O771l548o416N309k106
15790a0542N736J6044j034m561K124n620O69R241L716j627j591j0022k904J740
15776A369O624P70r985O379P747l493m178N048O041k085n753k206M700j852o602
15761B524k855p25J475R276L280p731n768j50M29P44r472l262r44M218o898j094
15745a6953N070j377m000k708P751Q701j937M097m844q527R449O78o531n107O4
15730a6174K778j341m282p13m957m760J3550R891Q547J465n163L0n52o830j641
15715a0152O626J350j737J018l596M288L750P02q566l311N053K771l157n759l940
$$ plain form
15700 -14660 -8209 -5074 -9926 -15912 -23490 -23139 -20718 -14937 -19217 -18499 -14594 -17778 -20224 -14378 -16687
15685 -16687 -21156 -20939 -22453 -23096 -18867 -16071 -10857 -5002 -9362 -17475 -21879 -14860 -3434 -8311 -12994
15670 -12994 -23575 -23623 -8511 -4718 -9054 -13088 -7847 -7389 -5126 821 1444 -4956 -11087 -20740 -19119
15655 -19119 -11932 -10767 -12009 -12264 -7312 -7177 -7712 -5692 -14429 -22743 -16889 -8295 -8140 -1911 -12682
15640 -12682 -11110 -2954 -3967 -9053 -12843 -17910 -27933 -24566 -22605 -18365 -12782 -12992 -13604 -23655
15626 -23655 -20046 -23630 -21209 -15374 -6769 2486 6630 2462 -3247 -5602 -2260 107 6510 9930
15612 9930 8375 4281 7248 3501 -4553 -7506 -7116 -1612 2853 6364 -445 5456 -4330 -10780 -13777
15597 -13777 -11710 -5623 5316 8909 4189 -1722 -2135 629 -4501 -5349 -10409 -7157 -450 -509 -3535
$$ packed form
15700a4660O451L135m852n986p578L51K421N781m280P18L905l184k446N846k309
15685a6687m469K17j514o43M229K796N214N855m360q113m404P019J1426m877m683
15670a2994j0581m8J5112L793m336m034N241M58K263N947O23o400o131r653J621
15655a9119P187J165j242k55M952J35n35K020q737q314N854Q594J55O229j0771
15640a2682J572Q156j013n086l790n067j0023L367J961M240N583k10o12j0051
15626b3655L609l584K421N835Q605R255M144m168n709k355L342K367O403L420
15612I930j555m094K967l747q054k953L90N504M465L511o809N901r786o450k997
15597a3777K067O087J0939L593m720n911m13K764n130q48n060L252O707n9l026
$$ plain form
15582 -3535 -8317 -5200 -15982 -25157 -17698 -16305 -8939 -11719 -12066 -2276 -6659 -4518 575 -2917 468
15567 468 169 -1260 -15968 -25992 -22576 -16269 -17396 -22466 -12232 -13999 -27173 -22868 -17235 -21857
15553 -21857 -31178 -31627 -31091 -20118 -12215 -17089 -17707 -17630 -16096 -20489 -19646 -14017 -7447 -8327 -18826 -25334
15537 -25334 -21119 -18960 -10721 -12728 -8665 1076 1449 -1960 -7655 -2596 -5771 -7375 -1344 8731
15523 8731 1813 -6121 -3377 573 -71 3203 4998 5929 -4445 -7531 -3065 1162 -2794 -5358 -3995
15508 -3995 -3570 4699 9084 1715 -7175 -11251 -4170 -11847 -22661 -22826 -26045 -14868 -9809 -13191 -15747
15493 -15747 -17359 -22170 -21150 -12954 -7536 -8322 -807 -1976 175 -9875 -13381 -14083 -9997 -11195 -10600
15478 -10600 -10436 -8651 -1138 -8294 -5937 -12335 -18539 -18583 -18109 -16690 -18958 -18254 -13137 -15122 -10400 -3977
$$ packed form
15582c535m782L117j0782r175P459J393P366k780l47R790m383K141N093l492L385
15567D68k99j429j4708j0024L416O307j127n070J0234j767j3174M305N633m622
15553b1857r321m49N36J0973P903m874o18P7J534m393Q43N629O570q80j0499o508
15537b5334M215K159Q239k007M063R741L73l409n695N059l175j604O031J0075
15523H731o918p934K744L950o44L274J795R31j0374l086M466M227l956k564J363
15508c995M25Q269M385p369q890m076P081p677j0814j65l219J1177N059l382k556
15493a5747j612m811J020Q196N418p86P515j169K151j0050l506p02M086j198N95
15478a0600J64J785P513p156K357o398o204m4M74J419k268P04N117j985M722O423
$$ plain form
15462 -3977 -4219 -9902 -10337 -3739 -8207 -9265 -14742 -10715 -12631 -9271 -16814 -20935 -17955 -23141 -18214
15447 -18214 -10399 -17603 -16826 -8442 -18356 -22664 -20218 -28734 -17062 -7556 -9476 -7738 -5018 -8205
15433 -8205 -8699 -12671 -4953 2606 -6079 -2690 -2906 -11175 -11085 -11193 -18385 -12731 -6262 -4479 -9979 -15988
15417 -15988 -16191 -14874 -17592 -13189 -7328 -8056 -9708 -10528 -5138 7539 20358 20928 12745 13595 17345
15402 17345 14589 14549 4386 -6339 -9874 -8825 -6375 -6377 -13533 -14196 -16375 -18693 -13720 -13432 -11899 -12142
15386 -12142 -15289 -12615 -963 909 -3766 -7362 -10138 -23577 -25282 -12376 1823 8736 4911
15373 4911 2248 3904 -3953 -12975 -5571 8562 10915 5292 -5852 -12754 -17017 -21264 -9279 8045
15359 8045 6640 -889 -3194 -13680 -23504 -29851 -37111 -29618 -22145 -10522 -9051 -12883 -13418 -11005
$$ packed form
15462c977k42n683m35O598m468j058n477M027j916L360p543m121K980n186M927
15447a8214P815p204P77Q384r914m308K446q516J1672R506j920J738K720l187
15433h205m94l972P718P559q685L389k16q269R0j08p192N654O469J783n500o009
15417a5988k03J317k718M403N861p28j652q20N390J2677J2819N70q183Q50L750
15402A7345k756m0j0163j0725l535J049K450kp156o63k179k318M973K88J533k43
15386a2142l147K674J1652J872m675l596k776j3439j705J2906J4199O913l825
15373D911k663J656p857r022P404J4133K353n623j1144o902m263m247J1985J7324
15359H045j405p529k305j0486r824o347p260P493P473J1623J471l832n35K413
$$ plain form
15345 -11005 -4931 7396 -4781 -17216 -17153 -14963 -14296 -12061 -3806 -11498 -20233 -19992 -18291 -14412 -8196
15330 -8196 -8003 -8510 -9026 -8335 -16361 -18355 -23226 -30265 -24829 -25375 -18223 -9543 -12402 -17165 -24059 -30129
15314 -30129 -30898 -38273 -33887 -24651 -25650 -18978 -14019 -15539 -10992 -8524 -7711 318 -1224 -5191 -8399
15299 -8399 -16271 -23578 -19348 -15051 -11984 753 166 -841 94 -4524 -11499 -10792 -14971 900 9751
15284 9751 5920 -305 -3955 -2079 -8759 -7666 -7761 -6823 -5901 -7905 -8338 4100 3574 5254 1522 -4965
15268 -4965 -8566 -8179 -1718 -1010 -6782 -12347 -6263 -8931 -7780 -8092 -11449 -9905 -13414 -17340 -7897
15253 -7897 -6412 -7936 -8380 -9390 -15865 -18545 -16853 -4933 2759 -764 -11132 -18498 -17216 -17930 -21097
15238 -21097 -15442 -11595 -11810 -16812 -10470 -5846 -12405 -7946 -6383 -3444 499 7985 -6476 -15895
$$ packed form
15345a1005O074J2327j2177j2435O3K190O67K235Q255p692q735K41J701L879O216
15330h196J93n07n16O91q026j994m871p039N436n46P152Q680k859m763o894o070
15314c0129p69p375M386R236r99O672M959j520M547K468Q13Q029j542l967l208
15299h399p872p307M230M297L067J2737n87j007R35m618o975P07m179J5871Q851
15284I751l831o225l650J876o680J093r5R38R22k004m33J2438n26J680l732o487
15268d965l601L87O461P08n772n565O084k668J151l12l357J544l509l926R443
15253g897J485j524m44j010o475k680J692J1920P692l523j0368p366J282p14l167
15238b1097N655L847k15n002O342M624o559M459J563K939L943P486j4461r419
$$ plain form
15224 -15895 -11469 -14045 -15668 -9467 3858 12860 10591 6921 -1820 -15106 -23113 -18731 -8291 4542
15210 4542 3606 -7952 -17818 -20669 -18875 -14384 -6788 -6362 -4101 -4342 -5861 -5064 -5933 -7576 -7251 -9900
15194 -9900 -25018 -31379 -27593 -19356 -8497 -5958 577 -6676 -1606 4282 5024 6190 2137 -5448
15180 -5448 -11730 -6934 -156 -8102 -16110 -17322 -10357 3987 4078 -7203 -22276 -25331 -21502 -9612
15166 -9612 -2873 589 3356 -10846 -18860 -17994 -19306 -15860 -13461 -23943 -23518 -12143 -3011 -1950
15152 -1950 -609 425 -369 -79 -656 -4709 -17600 -22178 -11447 -20109 -25488 -26458 -19297 -11497 -9202
15137 -9202 -1477 -3423 -10560 -19558 -20880 -11146 -7661 -11231 -18603 -17055 -10976 -11498 -14204 -17824 -16886
15122 -16886 -11409 -4929 -15187 -11044 2672 6102 -7253 -14951 -11841 -11018 3163 4672 3357 -1395
$$ packed form
15224a5895M426k576j623O201J3325R002k269l670q741j3286q007M382J0440J2833
15210D542r36j1558r866k851J794M491P596M26K261k41j519P97q69j643L25k649
15194i900j5118o361L786Q237J0859K539O535p253N070N888P42J166m053p585
15180e448o282M796O778p946q008j212O965J4344R1j1281j5073l055L829J1890
15166i612O739L462K767j4202q014Q66j312L446K399j0482M25J1375R132J061
15152a950J341J034p94K90n77m053j2891m578J0731q662n379r70P161P800K295
15137i202P725j946p137q998j322R734L485l570p372J548O079n22k706l620R38
15122a6886N477O480j0258M143J3716L430j3355p698L110Q23J4181J509j315m752
$$ plain form
15108 -1395 -3720 6789 7979 -9552 -14420 -16457 -19670 -12750 -9688 -7678 -7868 -9434 -4705 -1242
15094 -1242 -3862 -3996 -6707 -1866 -2006 -7416 -834 -5890 -5430 6733 5554 354 -12985 -15193 -14576
15079 -14576 -8075 -6942 -10282 -16315 -12022 -3518 -7724 -9346 -5986 -13478 -16089 -5261 1925 1446
15065 1446 -9361 -10132 544 -12822 -16050 -15646 -14702 -11971 -5577 -1751 -5703 -16137 -21044 -27626
15051 -27626 -30283 -27276 -21668 -23376 -14998 -1353 -20 1453 -6581 -1340 -3026 -2293 -1263 -8167
15037 -8167 -12201 -8253 -11592 -1204 -5036 -6003 -1333 3498 2370 1799 -440 2975 -5208 -8807 1041
15022 1041 680 -1678 1669 13959 26509 26148 23897 26622 26434 17969 9155 8844 13718 18727 16639
15007 16639 12098 17430 12071 10164 27565 26180 13963 14577 22974 24166 25967 25838 23333 12628
$$ packed form
15108a395k325J0509J190j7531m868k037l213O920L062K010j90j566M729L463
15094a242k620j34k711M841j40n410O582n056M60J2163j179n200j3339k208O17
15079a4576O501J133l340o033M293Q504m206j622L360p492k611J0828P186m79
15065A446j0807p71J0676j3366l228M04R44K731O394L826l952j0434m907o582
15051b7626k657L007N608j708Q378J3645J333J473q034N241j686P33J030o904
15037h167m034L948l339J0388l832r67M670M831j128n71k239L415q183l599R848
15022A041l61k358L347J2290J2550l61k251K725j88q465q814l11M874N009k088
15007A6639m541N332n359j907J7401j385j2217O14Q397J192J801j29k505j0705
$$ plain form
14993 12628 8544 12544 13441 18208 20616 20529 19819 17106 16925 18070 20283 19182 16329 10579 6660 5729
14977 5729 5745 1912 8833 14486 13206 16700 10711 -5161 -2275 3122 10375 15893 13455 10162 201
14962 201 -10675 -21649 -14506 -11111 -16592 -14736 -8258 578 6275 11748 17978 18707 10816 909 4956
14947 4956 7343 5932 7578 -872 -6798 -663 7312 8782 5190 -1085 -3427 768 4451 5017 -3612
14932 -3612 -12010 -14667 -3965 3361 7298 12547 7218 2866 12149 19644 12235 6075 8948 7259
14918 7259 11401 11777 9414 11149 8745 5421 3384 1626 464 -491 -4217 -10467 -20993 -14835 -2552
14903 -2552 6009 7488 -5888 -14777 -12771 -6415 -14850 -12888 -12216 -18770 -11568 -3587 2620 -81 -592
14888 -592 -1772 2247 2140 486 527 -6910 -20922 -23260 -22155 -23237 -19771 -16250 -21409 -13922 -6684
$$ packed form
14993A2628m084M000Q97M767K408q7p10k713j81J145K213j101k853n750l919r31
14977E729J6l833O921N653j280L494n989j5872K886N397P253N518k438l293r961
14962B01j0876j0974P143L395n481J856O478Q836N697N473O230P29p891r907M047
14947D956K387j411J646q450n926O135P975J470l592o275k342M195L683N66q629
14932c612q398k657J0702P326L937N249n329m352R283P495p409o160K873j689
14918G259M142L76k363J735k404l324k037j758j162r55l726o250j0526O158J2283
14903b552Q561J479j3376q889K006O356q435J962O72o554P202P981O207k701n11
14888e92j180M019j07j654M1p437j4012k338J105j082L466L521n159P487P238
$$ plain form
14873 -6684 -12318 -15198 -16964 -13850 -10296 -14390 -8642 -2950 -8452 -3537 -713 2906 -290 -12463
14859 -12463 -18483 -22776 -21676 -17900 -18368 -33031 -26629 -23808 -15821 -9728 -14558 -16395 -12909 -8843
14845 -8843 -12790 -16896 -23537 -16534 12323 18266 11645 7835 4616 12473 6600 -7424 -11998 2818
14831 2818 12048 10254 9215 -2100 -8511 2701 13137 9480 3089 -2048 -1843 2253 -2937 -11568
14817 -11568 -8630 -4182 -1145 -940 -5829 -12506 -11555 -15596 -9119 -8268 -8030 -14072 -13581 -14245 -14361 -13888
14801 -13888 -11956 -8842 -7937 -2459 -5224 -2658 -5706 -3524 -3726 -13267 -17806 -17818 -15632 -12391 -5806
14786 -5806 -15536 -10295 -3842 -1894 -6337 -9161 -2952 -302 -6741 -4794 866 4558 12223 12800 8346
14771 8346 16209 17849 15102 7686 15929 9364 4584 3668 9124 8741 9675 14248 17710 19986 3954
$$ packed form
14873f684n634k880j766L114L554m094N748N692n502M915K824L619l196j2173
14859a2463o020m293J100L776m68j4663O402K821P987O093m830j837L486M066
14845h843l947m106o641P003K8857N943o621l810l219P857n873j4024m574J4816
14831B818R230j794j039j1315o411J1212J0436l657o391n137K05M096n190q631
14817a1568K938M448L037K05m889o677R51m041O477Q51K38o042M91o64j16M73
14801a3888J932L114R05N478k765K566l048K182k02r541m539j2K186L241O585
14786e806r730N241O453J948m443k824O209K650o439J947N660L692P665N77m454
14771H346P863J640k747p416Q243o565m780r16N456l83R34M573L462K276j6032
$$ plain form
14756 3954 2844 -124 -5512 -6230 -7340 -10105 -11301 -12092 -10422 -4699 451 683 -4148 1481 15520
14741 15520 12723 5591 2476 414 429 5710 3699 -4664 1754 -1418 3338 -2091 -18377 -16843 -6976
14726 -6976 3180 1519 -1689 7692 -294 2423 4113 -2985 -1557 -4404 -2056 2275 3735 -5288
14712 -5288 -7161 -5444 5343 13402 10693 14582 19457 17625 11651 9986 9431 15822 7590 -4451
14698 -4451 -7064 -708 -1042 10333 8537 4107 9592 7426 -1575 3990 9514 10835 15397 17473 95
14683 95 -2664 9829 14561 15503 -1793 -5150 -8354 -6832 1269 -1875 -14901 -13767 -9430 -3833 -3811
14668 -3811 -264 -713 -3362 3055 8474 9506 11865 11611 8085 5298 10225 6572 4554 6043 6514
14653 6514 6105 7015 7065 7006 852 -15420 -16258 -8505 -5636 -6377 -4688 3607 18004 15754 21321 28082
$$ packed form
14756C954j110k968n388p18j110k765j196p91J670N723N150K32m831N629J4039
14741A5520k797p132l115k062J5N281k011q363O418l172M756n429j6286J534R867
14726f976J0156j661l208R381p986K717J690p098J428k847K348M331J460r023
14712e288j873J717J0787Q059k709L889M875j832n974j665n55O391q232j2041
14698d451k613O356l34J1375j796m430N485k166r001N565N524J321M562K076j7378
14683I5k759J2493M732R42j7296l357l204J522Q101l144j3026J134M337N597K2
14668c811L547m49k649O417N419J032K359k54l526k787M927l653k018J489M71
14653F514m09R10N0n9o154j6272q38P753K869p41J689Q295J4397k250N567O761
$$ plain form
14637 28082 22300 20746 14485 8317 13196 18351 18754 8473 18368 22170 25547 26159 20389 18151 14411
14622 14411 13520 20656 26585 32695 35507 28022 31779 43347 37545 55764 67113 74727 72840 66474
14608 66474 67270 68518 89360 105730 114978 114471 119854 140269 158324 167627 178535 200987 232736
14595 232736 257019 303134 350591 408833 483195 577849 697458 851584 1033347 1208239 1349348
14584 1349348 1433567 1478137 1516531 1591028 1706100 1831739 1932283 1969895 1926289 1817201
14574 1817201 1680719 1552304 1464301 1425614 1383057 1296549 1158326 983039 797109 650753
14564 650753 543892 459877 402926 351598 308352 282164 266859 251955 226559 213464 202317
14553 202317 191606 182244 179352 171440 155844 153635 153079 149618 138032 117521 98073 90943 80999
$$ packed form
14637B8082n782j554o261o168M879N155M03j0281R895L802L377O12n770k238l740
14622A4411q91P136N929O110K812p485L757J1568n802J8219J1349P614j887o366
14608F6474P96J248K0842J6370R248n07N383K0415J8055R303J0908K2452L1749
14595B32736K4283M6115M7457N8242P4362R4654J19609J54126J81763J74892J41109
14584A349348Q4219M4570L8394P4497J15072J25639J00544L7612m3606j09088
14574A817201j36482j28415q8003l8687m2557q6508j38223j75287j85930j46356
14564F50753j06861q4015n6951n1328m3246k6188j5305j4904k5396j3095j1147
14553B02317j0711r362k892p912j5596k209n56l461j1586k0511j9448p130r944
$$ plain form
14540 80999 61472 58060 67650 65500 57860 40972 28070 23394 23792 29842 34133 25918 24198 18497
14526 18497 15804 12333 18078 22287 25939 27775 24814 9718 7653 7290 3938 5381 7776 1206
14512 1206 4937 1117 8455 10757 9206 8408 18237 22045 9756 9988 14401 22560 14583 6456 1629
14497 1629 -553 -1288 2936 2843 4997 -3951 -4679 -7942 -6054 -9247 -12898 -9697 3835 19832 21760
14482 21760 19804 19303 17923 16071 19647 21168 20317 19700 22078 22636 25598 34413 36872 32097 26936
14467 26936 28628 29876 35321 21310 17768 29909 35301 24315 22554 38887 35907 29551 16563
14454 16563 20005 21635 24381 32915 34192 34171 32070 27351 25357 21141 8396 3542 15319 13686
14440 13686 6317 5588 9926 16481 11517 10414 12804 13236 5697 4272 5886 5616 5257 14057 29186
$$ packed form
14540H0999j9527l412R590k150p640j6888j2902m676L98O050M291q215j720n701
14526A8497k693l471N745M209L652J836k961j5096k065l63l352J443K395o570
14512A206L731l820P338K302j551p98R829L808j2289K32M413Q159p977q127m827
14497A629k182p35M224r3K154q948p28l263J888l193l651L201J3532J5997J928
14482B1760j956n01j380j852L576J521q51o17K378N58K962Q815K459m775n161
14467B6936J692J248N445j4011l542J2141N392j0986j761J6333k980o356j2988
14454A6563L442J630K746Q534J277k1k101m719j994m216j2745m854J1777j633
14440A3686p369p29M338O555m964j103K390M32p539j425J614k70l59Q800J5129
$$ plain form
14425 29186 36340 33882 31672 25100 16784 17177 7507 16985 20371 16489 12570 16147 16625 16138 28201
14410 28201 29184 20704 18205 14560 12730 16453 14948 18241 26462 25020 29665 39934 44533 50657
14396 50657 49372 39845 34231 25907 27505 37479 42022 44117 46591 55177 51296 51109 51378 51418 51423 50153
14380 50153 53299 54266 48460 40063 33654 40736 51738 46539 45827 34622 31563 40278 48708 48647 57229
14365 57229 58319 51296 52186 61432 64593 62246 58124 54137 41270 36165 47711 54619 43591 38767
14351 38767 31703 42853 56924 58231 40069 32279 35806 45352 48689 60247 54703 43281 39744
14338 39744 37752 41232 43298 45169 41155 37906 41206 45682 51121 43651 44161 54919 60807 58462
14324 58462 60181 48141 49489 57725 72446 77014 79329 79664 78469 84030 90836 109212 128856 144117
$$ packed form
14425B9186P154k458k210o572q316L93r670R478L386l882l919L577M78m87J2063
14410B8201R83q480k499l645j830L723j505L293Q221j442M645J0269M599O124
14396E0657j285r527n614q324J598R974M543K095K474Q586l881j87K69M0Nj270
14380E0153L146R67n806q397o409P082J1002n199p12j1205l059Q715Q430o1Q582
14365E7229J090p023Q90R246L161k347m122l987j2867n105J1546O908j1028m824
14351C8767p064J1150J4071J307j8162p790L527R546L337J1558n544j1422l537
14338C9744j992L480K066J871m014l249L300M476N439p470N10J0758N888k345
14324E8462J719j2040J348Q236J4721M568K315L35j195N561O806J8376J9644J5261
$$ plain form
14310 144117 150860 161250 188984 219167 250166 269478 287601 323362 349770 365161 382135 395683
14298 395683 408535 415014 412453 405165 391153 382639 366134 341030 314486 294001 277914 257034
14286 257034 225864 193828 179912 171100 160255 150867 135639 139146 135364 125604 127956 129384 138025
14273 138025 135408 134126 139449 154096 174952 193282 217869 242757 284665 349840 413590 465807
14261 465807 490572 490717 479667 473181 489866 481017 442071 384180 333511 287501 243368 215295
14249 215295 199591 188219 177005 165358 162091 154503 149569 156886 158245 151179 149808 152500 158630
14236 158630 161788 167610 175046 175112 176634 187435 203651 222465 250262 289920 335341 393427 455820
14223 455820 497980 494609 476566 472524 480797 474700 434884 373745 301537 249739 208654 174157
$$ packed form
14310A44117O743J0390K7734L0183L0999J9312J8123L5761K6408J5391J6974J3548
14298C95683J2852O479k561p288j4012q514j6505k5104k6544k0485j6087k0880
14286B57034l1170l2036j3916q812j0845r388j5228L507l782r760K352J428Q641
14273A38025k617j282N323J4647K0856J8330K4587K4888M1908O5175O3750N2217
14261D65807K4765J45j1050o486J6685q849l8946n7891n0669m6010m4133k8073
14249B15295j5704j1372j1214j1647l267p588m934P317J359p066j371K692O130
14236A58630L158N822P436O6J522J0801J6216J8814K7797L9658M5421N8086O2393
14223D55820M2160l371j8043m042Q273o097l9816o1139p2208n1798m1085l4497
$$ plain form
14211 174157 143553 136562 125646 108800 107627 109400 107226 108703 112747 106160 110919 114579 119752
14198 119752 132589 143946 162833 180070 194902 195050 186253 177371 179931 192429 207049 207957 192447
14185 192447 162594 146673 143122 139438 138217 130836 125576 134709 135033 130739 126797 123204 126595 122876
14171 122876 121889 116865 115318 119498 123826 123775 121996 119159 124410 132134 142914 130982 113528 114227
14157 114227 119930 132583 144269 153087 154223 145719 137547 141031 145632 148302 147751 155302 146601 139612
14143 139612 142207 140645 125493 126512 129866 114281 96965 95692 88241 88157 87915 86754 98983 106635
14129 106635 108941 99454 84433 70365 73459 74080 76610 76158 81195 84700 82664 79534 76658 89156
14115 89156 94200 98479 87111 84860 91863 89024 93048 92348 89359 93506 96182 96619 98835 99228 102641
$$ packed form
14211A74157l0604o991j0916j6846j173J773k174J477M044o587M759L660N173
14198A19752J2837J1357J8887J7237J4832J48q797q882K560J2498J4620R08j5510
14185A92447k9853j5921l551l684j221p381n260R133L24m294l942l593L391l719
14171A22876r87n024j547M180M328n1j779k837N251P724J0780j1932j7454O99
14157A14227N703J2653J1686Q818J136q504q172L484M601K670n51P551q701o989
14143A39612K595j562j5152J019L354j5585j7316j273p451q4k42j161J2229P652
14129A06635K306r487j5021j4068L094O21K530m52N037L505k036l130k876J2498
14115H9156N044M279j1368k251P003k839M024p00k989M147K676M37K216L93L413
$$ plain form
14100 102641 101251 97509 93796 91456 90901 95082 103738 108833 98533 96565 97009 97643 101678 112846
14086 112846 121216 133783 147539 147399 156767 164727 164211 164558 164061 168147 170349 174251 181033 178125 178014
14071 178014 164600 156824 163162 172971 178471 177837 174574 179726 183580 174937 163237 151290 149843 158349
14057 158349 162059 162561 168465 168612 163082 175914 186856 200936 217104 223896 234770 243323 262906
14044 262906 291547 319168 352172 394292 430720 473008 505040 547389 597760 647656 699934
14033 699934 736820 764426 793883 828038 856984 880874 899789 911712 909902 889918 867782 848864
14021 848864 827625 808514 773926 728670 695109 653890 603243 557100 525724 487584 455526
14010 455526 432596 402070 372245 340044 309496 297645 289347 270851 253584 246790 233259 212491
$$ packed form
14100A02641j390l742l713k340n55M181Q656N095j0300j968M44O34M035J1168
14086A12846Q370J2567J3756j40R368P960n16L47m97M086K202L902O782k908j11
14071A78014j3414p776O338R809N500o34l263N152L854q643j1700j1947j447Q506
14057A58349L710N02N904J47n530J2832J0942J4080J6168O792J0874Q553J9583
14044B62906K8641K7621L3004M2120L6428M2288L2032M2349N0371M9896N2278
14033F99934L6886K7606K9457L4155K8946K3890J8915J1923j810j9984k2136j8918
14021H48864k1239j9111l4588m5256l3561m1219n0647m6143l1376l8140l2058
14010D55526k2930l0526k9825l2201l0548j1851q298j8496j7267o794j3531k0768
$$ plain form
13998 212491 209407 205119 195625 176374 165860 153687 142283 130533 124930 128481 138121 129070 123603
13985 123603 128101 129021 136799 133151 136829 144563 148877 151503 154604 154553 156003 161150 156661 150115 150607
13970 150607 148131 152407 153755 151972 152708 157005 154846 163437 173891 178064 182897 191375 189809 187683
13956 187683 201771 221627 237931 251289 266061 291669 323933 362556 411681 460512 513436
13945 513436 574435 642866 716743 788762 887628 1001874 1123749 1237706 1347648 1477354
13935 1477354 1610421 1747992 1889768 2028686 2143989 2236635 2341075 2455444 2559071 2662005
13925 2662005 2742743 2793010 2809755 2798220 2786774 2783803 2767186 2720024 2635256 2517943 2383870
13914 2383870 2252401 2135876 2026189 1903346 1769472 1624877 1461623 1322487 1198924
$$ packed form
13998B12491l084m288r494j9251j0514j2173j1404j1750n603L551R640r051n467
13985A23603M498R20P778l648L678P734M314K626L101n1J450N147m489o546M92
13970A50607k476M276J348j783P36M297k159Q591J0454M173M833Q478j566k126
13956A87683J4088J9856J6304J3358J4772K5608L2264L8623M9125M8831N2924
13945E13436O0999O8431P3877P2019R8866J14246J21875J13957J09942J29706
13935A477354J33067J37571J41776J38918J15303R2646J04440J14369J03627J02934
13925B662005Q0738N0267J6745j1535j1446k971j6617m7162q4768j17313j34073
13914B383870j31469j16525j09687j22843j33874j44595j63254j39136j23563
$$ plain form
13905 1198924 1092765 996138 902023 832990 764286 692241 621349 561912 518740 486242 468372
13894 468372 437749 400245 365520 343942 329632 308501 275260 248623 229157 210837 197533
13883 197533 186942 177308 165691 170159 177313 168648 154646 146500 143419 148069 151322 149705 144370
13870 144370 137409 136832 143657 139472 142102 146962 157543 162845 161340 170686 174484 177435 181887 173751
13856 173751 162436 164182 160524 142729 130833 112290 107680 98081 92040 88356 91800 92241 84721
13843 84721 80624 78953 90010 95761 87465 90720 100842 112175 111790 105387 100348 98450 100124 89379
13829 89379 87612 90760 82000 62068 47240 43945 52779 54328 64714 76401 93153 102947 97079
13816 97079 93736 90806 78943 73570 75108 74846 68485 47577 36014 43699 56095 54537 51741 49747
$$ packed form
13905A198924j06159r6627r4115o9033o8704p2045p0892n9437m3172l2498j7870
13894D68372l0623l7504l4725k1578j4310k1131l3241k6637j9466j8320j3304
13883A97533j0591r634j1617M468P154q665j4002q146l081M650L253j617n335
13870A44370o961n77O825m185K630M860J0581N302j505R346L798K951M452q136
13856A73751j1315J746l658j7795j1896j8543m610r599o041l684L444M41p520
13843H4721m097j671J1057N751q296L255J0122J1333l85o403n039j898J674j0745
13829H9379j767L148q760j9932j4828l295Q834J549J0386J1687J6752R794n868
13816I7079l343k930j1863n373J538k62o361k0908j1563P685J2396j558k796j994
$$ plain form
13802 49747 55815 65977 74750 75127 82203 90667 95122 105676 115859 135127 153481 160183 163298
13789 163298 161865 159468 148458 132554 128005 112777 91710 82105 85552 93824 88288 85734 73203
13776 73203 58457 53538 49475 48299 53206 56764 60822 51152 50368 50994 45991 46694 39932 27457 29997
13761 29997 29386 28519 28668 39532 59630 70810 85645 88379 86194 86014 89996 98702 107146 110523
13747 110523 106061 100807 85667 65935 58345 58197 48158 55289 59452 57552 52404 47570 47090 42290
13733 42290 38623 33121 24390 25434 24762 32443 41995 34498 35889 42881 39085 26322 19293 32195
13719 32195 48213 54316 52519 52050 40570 34851 35730 40430 46183 39758 27113 24987 30618 34575
13705 34575 30045 14711 24814 25463 28949 39950 49143 46409 41458 34953 45820 59297 63576
$$ packed form
13802D9747O068J0162Q773L77P076Q464M455J0554J0183J9268J8354O702L115
13789A63298j433k397j1010j5904m549j5228k1067r605L447Q272n536k554j2531
13776G3203j4746m919m063j176M907L558M058r670p84O26n003P03o762j2475K540
13761B9997o11q67J49J0864K0098J1180J4835K734k185j80L982Q706Q444L377
13747A10523m462n254j5140j9732p590j48j0039P131M163j900n148m834m80m800
13733D2290l667n502q731J044o72P681R552p497J391O992l796j2763p029J2902
13719C2195J6018O103j797m69j1480n719Q79M700N753o425j2645k126N631L957
13705C4575m530j5334J0103O49L486J1001R193k734m951o505J0867J3477M279
$$ plain form
13692 63576 55439 45698 34889 28829 33664 34647 37401 43495 46119 45875 40059 41265 39636 32060 25861
13677 25861 26843 31556 22648 10390 3559 4371 11178 15342 23998 39488 43465 45581 42025 45012
13663 45012 39702 33969 40041 43770 49573 56981 74395 80969 88445 99596 100264 98846 92548 96081
13649 96081 93378 86911 85675 74710 63348 67531 47770 34276 37028 33383 34663 30573 29187
13636 29187 28184 27718 21936 23091 26268 25942 25915 32568 33982 33208 37238 36665 38834 28765 23979 30466
13620 30466 26654 26744 29067 28644 30171 39348 45229 49738 50609 62698 67415 66704 68640 75114 67406
13605 67406 58641 54367 43847 35400 35502 39357 37602 32565 29602 34206 40217 47833 48416 44694 42298
13590 42298 39134 38501 31647 34766 38314 38596 36053 35073 33575 32086 31476 35723 33616 27176 34745
$$ packed form
13692F3576q137r741j0809o060M835R83K754O094K624k44n816J206j629p576o199
13677B5861R82M713q908j2258o831Q12O807M164Q656J5490L977K116l556K987
13663D5012n310n733O072L729N803P408J7414O574P476J1151O68j418o298L533
13649I6081k703o467j236j0965j1362M183j9761j3494K752l645J280m090j386
13636B9187j003m66n782J155L177l26k7O653J414p74M030n73K169j0069m786O487
13620C0466l812R0K323m23J527R177N881M509Q71J2089M717p11J936O474p708
13605F7406q765m274j0520q447J02L855j755n037k963M604O011P616N83l722k396
13590D2298l164o33o854L119L548K82k543r80j498j489o10M247k107o440P569
$$ plain form
13575 34745 42194 49562 40881 39369 36153 38865 31903 36281 36921 38259 41395 42438 39190 25691
13561 25691 14596 12258 18027 24382 28740 33439 30444 26268 16171 5864 8394 10808 15413 17308
13547 17308 21684 27165 30769 26035 21980 21186 30089 36952 29950 27069 34314 30087 32444 34042 29535
13532 29535 21060 26123 30797 30199 25091 15941 23130 28728 32717 23784 25554 25604 23008 21833 31925
13517 31925 38988 40682 30044 35579 51751 60360 57233 57686 55858 50273 43521 41801 47730 44520
13503 44520 41941 49196 51323 44344 45297 36341 28904 44749 51892 46626 45815 41739 34298 32895 27243
13488 27243 22969 16717 9234 8667 12953 11627 13096 21556 28053 26902 23767 19448 19604 19957 20759
13473 20759 31969 39264 37352 40413 39736 39467 43647 40553 33976 40975 46385 38626 40485 49518 40370
$$ packed form
13575C4745P449P368q681j512l216K712o962M378O40J338L136J043l248j3499
13561B5691j1095k338N769O355M358M699k995m176j0097j0307K530K414M605J895
13547A7308M376N481L604m734m055p94Q903O863p002k881P245m227K357J598m507
13532B9535q475N063M674n98n108r150P189N598L989q933J770N0k596j175J0092
13517C1925P063J694j0638N535J6172Q609l127M53j828n585o752j720N929l210
13503D4520k579P255K127o979R53q956p437J5845P143n266q11m076p441j403n652
13488B7243m274o252p483n67M286j326J469Q460O497j151l135m319J56L53Q02
13473B0759J1210P295j912L061o77k69M180l094o577O999N410p759J859R033r148
$$ plain form
13458 40370 36937 43205 34482 26471 22828 22501 26167 31406 34165 31658 39261 33444 30797 32653 30189
13443 30189 37562 41480 49871 50453 47687 53509 54843 52161 47893 43851 43700 40130 43694 40999 35048
13428 35048 31438 31500 28902 32770 28635 25737 19697 24467 36433 36290 38439 36586 34815 36666 33387
13413 33387 27132 29910 36776 43433 42170 41041 41932 52972 49953 50742 60059 59935 54555 69007 77302
13398 77302 81410 84295 81404 87480 98976 95703 91440 93711 84929 83926 81785 74212 75605 82385
13384 82385 85523 101501 119789 131733 135975 150336 168467 178932 199744 226899 267413 298767
13372 298767 340822 404506 496990 615837 820374 1113825 1436550 1577068 1497437 1357159
13362 1357159 1289339 1373909 1522443 1496480 1269198 970475 704265 513014 395377 319741
$$ packed form
13458D0370l433O268q723q011l643l27L666N239K759k507P603n817k647J856k464
13443C0189P373L918Q391N82k766N822J334k682m268m042j51l570L564k695n951
13428C5048l610O2k598L868m135k898o040M770J1966j43K149j853j771J851l279
13413C3387o255K778O866O657j263j129Q91J1040l019P89R317j24n380J4452Q295
13398G7302M108K885k891O076J1496l273m263K271q782j003k141p573J393O780
13384H2385L138J5978J8288J1944M242J4361J8131J0465K0812K7155M0514L1354
13372B98767M2055O3684R2484J18847K04537K93451L22725J40518p9631j40278
13362A357159o7820Q4570J48534k5963k27282k98723k66210j91251j17637p5636
$$ plain form
13352 319741 264613 223371 189494 169971 151869 140803 126915 113924 108715 108179 115281 103777
13340 103777 85642 79500 79215 73741 68277 74804 73785 70307 74935 74940 70820 76866 74070 65779 57618
13325 57618 57768 69653 69279 56549 56315 63591 60812 60805 59778 60294 48320 39795 43033 39240 33980
13310 33980 36547 33559 41803 50110 41699 35810 30337 37707 45638 41142 38941 35056 37324 50448
13296 50448 58807 62899 62999 58994 55119 53085 49405 50683 48530 69293 82377 80774 77559 72874
13282 72874 72470 62608 56637 50611 60597 62272 51519 46286 46408 37189 36295 37734 37226 39160 44550
13267 44550 45685 49866 45140 39959 39853 40283 47549 54851 66153 68801 58513 52742 53785 48457
13253 48457 33004 28035 36790 33558 17265 10333 -24 -16898 -21515 -7680 12255 20425 21883
$$ packed form
13352C19741n5128m1242l3877j9523j8102j1066j3888j2991n209n36P102j1504
13340A03777j8135o142k85n474n464O527j019l478M628Nm120O046k796q291q161
13325E7618J50J1885l74j2730k34P276k779pj027N16j1974q525L238l793n260
13310C3980K567k988Q244Q307q411n889n473P370P931m496k201l885K268J3124
13296E0448Q359M092J00m005l875k034l680J278k153K0763J3084j603l215m685
13282G2874m04r862n971o026R986J675j0753n233J22r219q94J439n08J934N390
13267D4550J135M181m726n181j06M30P266P302J1302K648j0288n771J043n328
13253D8457j5453m969Q755l232j6293o932j0357j6874m617J3835J9935Q170J458
$$ plain form
13240 21883 15770 6036 1802 -992 5038 13510 14243 7407 1446 85 10698 20401 26276 26351 39809
13225 39809 42746 43231 45398 59667 66117 59746 51624 48299 47849 60016 72417 75485 71062 64375
13211 64375 69854 73391 74993 77116 79131 84995 93867 97162 100032 106983 105469 105126 103148 109427 122469
13196 122469 123378 129181 155761 196298 224681 242479 250768 244797 237142 246379 254763 248400 229511
13183 229511 193205 157719 121666 99254 77763 64883 66254 64782 65236 65475 66606 66777 72299
13170 72299 72471 63568 53952 57361 49994 42177 49111 57421 68850 74262 74392 79567 86355 93595 92693
13155 92693 87191 90444 91770 92485 91294 93419 103365 104279 112317 109897 114590 123373 127592 113449 97365
13140 97365 90243 96762 114096 113129 101418 91304 82749 94399 100160 89816 91225 90775 86969 99143
$$ packed form
13240B1883o113r734m234k794O030Q472P33o836n961j361J0613R703N875P5J3458
13225C9809K937M85K167J4269O450o371q122l325m50J2167J2401L068m423o687
13211F4375N479L537J602K123K015N864Q872L295K870O951j514l43j978O279J3042
13196A22469R09N803K6580M0537K8383J7798Q289n971p655R237Q384o363j8889
13183B29511l6306l5486l6053k2412k1491j2880J371j472M54K39J131J71N522
13170G2299J72q903r616L409p367p817O934Q310J1429N412J30N175O788P240r02
13155I2693n502L253J326P15j191K125R946R14Q038k420M693Q783M219j4143j6084
13140I7365p122O519J7334r67j1711j0114q555J1650N761j0344J409m50l806J2174
$$ plain form
13126 99143 116555 114842 101298 95428 98179 106490 106587 103201 96603 96490 97061 100122 95223 92895 91174
13111 91174 98286 102643 104340 96411 101323 110975 116693 129596 150554 164183 176744 182931 187801
13098 187801 186373 183572 187048 191587 203757 216756 224712 232100 239227 224043 204136 192151 189453
13085 189453 192379 199399 190831 168918 143359 136165 135883 150625 180462 202578 209189 226369 244384
13072 244384 263635 275254 287092 286557 285446 304650 335656 350418 375063 383820 398465 412996
13060 412996 408881 395816 400966 389897 386180 386148 370829 336466 315120 302263 301468 315248 317211
13047 317211 308766 300696 297644 293673 296034 289206 294551 303169 323827 336166 347686 363710 382957
13034 382957 395213 407289 422331 431320 436779 444822 452501 456199 458453 468434 479918 498973 517552
$$ packed form
13126I9143J7412j713j3544n870K751Q311R7l386o598j13N71L061m899k328j721
13111I1174P112M357J697p929M912R652N718J2903K0958J3629J2561O187M870
13098A87801j428k801L476M539J2170J2999P956P388P127j5184j9907j1985k698
13085A89453K926P020q568k1913k5559p194k82J4742K9837K2116O611J7180J8015
13072B44384J9251J1619J1838n35j111J9204L1006J4762K4645Q757J4645J4531
13060D12996m115j3065N150j1069l717l2j5319l4363k1346j2857p95J3780J963
13047C17211q445q070l052l971K361o828N345Q618K0658J2339J1520J6024J9247
13034C82957J2256J2076J5042Q989N459Q043P679L698K254R981J1484J9055J8579
$$ plain form
13021 517552 527222 538509 550491 563955 581175 590151 600461 611698 615002 614442 617435 624074 622090
13008 622090 632732 644285 663605 695823 724987 752948 784266 809971 839013 870578 913970
12997 913970 952078 982650 1010940 1033880 1062266 1091296 1121974 1157927 1189531 1220091 1260613
12986 1260613 1327542 1401183 1476988 1554726 1623559 1687774 1761940 1836601 1921564 2008489 2106602
12975 2106602 2201039 2300455 2417403 2549012 2707066 2888235 3070073 3259745 3482504 3746456
12965 3746456 4066498 4424161 4832663 5272895 5767542 6361979 7043766 7805324 8689966
12956 8689966 9771759 11133736 12783470 14523650 16407029 18679418 21423592 24678530
12948 24678530 28556071 33090520 38738342 46014485 55253458 67058484 83179348 107409603
$$ packed form
13021E17552R670J1287J1982J3464J7220Q976J0310J1237L304n60K993O639j984
13008F22090J0642J1553J9320L2218K9164K7961L1318K5705K9042L1565M3392
12997I13970L8108L0572K8290K2940K8386K9030L0678L5953L1604L0560M0522
12986A260613O6929P3641P5805P7738O8833O4215P4166P4661Q4963Q6925R8113
12975B106602R4437R9416J16948J31609J58054J81169J81838J89672K22759K63952
12965C746456L20042L57663M08502M40232M94647N94437O81787P61558Q84642
12956H689966J081793J361977J649734J740180J883379K272389K744174L254938
12948B4678530L877541M534449N647822P276143R238973J1805026J6120864K4230255
$$ plain form
12940 107409603 146491275 206486083 265316194 276664920 253604093 225316422 216211267
12933 216211267 240957210 272422075 260131367 214670285 159669093 112066313 80157180
12926 80157180 60165382 47064156 37966493 31484894 26825400 23525157 20989729 18733773
12918 18733773 16555002 14638735 13158359 12004658 10844353 9628855 8492196 7514875
12910 7514875 6740543 6129741 5629246 5208788 4844086 4516098 4246812 4008594 3782457
12901 3782457 3555666 3338869 3160760 2993873 2822364 2663486 2509365 2351111 2219556
12892 2219556 2099288 1997345 1910718 1825479 1733647 1641910 1554176 1469526 1404076 1365129 1311259
12881 1311259 1266209 1220833 1175206 1142245 1115651 1075366 1032065 1000909 987821 986042 968739
$$ packed form
12940A07409603L9081672N9994808N8830111J1348726k3060827k8287671r105155
12933B16211267K4745943L1464865j2290708m5461082n5001192m7602780l1909133
12926H0157180j9991798j3101226r097663o481599m659494l300243k535428k255956
12918A8733773k178771j916267j480376j153701j160305j215498j136659r77321
12910G514875p74332o10802n00495m20458l64702l27988k69286k38218k26137
12901C782457k26791k16797j78109j66887j71509j58878j54121j58254j31555
12892B219556j20268j01943q6627q5239r1832r1737q7734q4650o5450l8947n3870
12881A311259m5050m5376m5627l2961k6594m0285m3301l1156j3088j779j7303
$$ plain form
12870 968739 966033 965435 964200 948075 942397 925989 899550 882767 859938 840734 817149 771819
12858 771819 704437 659204 625949 595230 565015 544210 532354 525553 506499 493089 492572 497091
12846 497091 490115 490112 488216 485996 491595 509476 555120 584326 581691 569863 561285 560768 574498 580613
12832 580613 561104 518079 487347 467252 460852 456060 443837 428713 421935 430286 434128 425511 418264
12819 418264 425691 436058 455054 457030 441752 435590 452768 471132 488594 478131 484453 491213
12807 491213 476324 480430 489802 465831 452411 451737 448530 437571 428437 419846 408036 406665 411136
12794 411136 407750 406361 405053 413742 414818 416529 409046 386460 347241 325614 314416 308580 300671
12781 300671 270497 229910 218158 212765 223540 225820 213893 223790 235353 229588 213928 221148
$$ packed form
12870I68739k706n98j235j6125n678j6408k6439j6783k2829j9204k3585m5330
12858G71819o7382m5233l3255l0719l0215k0805j1856o801j9054j3410n17M519
12846D97091o976lj896k220N599J7881M5644K9206k635j1828q578n17J3730O115
12832E80613j9509m3025l0732k0095o400m792j2223j5124o778Q351L842q617p247
12819D18264P427J0367J8996J976j5278o162J7178J8364J7462j0463O322O760
12807D91213j4889M106R372k3971j3420o74l207j0959r134q591j1810j371M471
12794D11136l386j389j308Q689J076J711p483k2586l9219k1627j1198n836p909
12781C00671l0174m0587j1752n393J0775K280j1927R897J1563n765j5660P220
$$ plain form
12769 221148 239394 245247 246962 250033 246980 247772 259874 254945 250820 247680 238312 227271 232487 235566
12755 235566 229027 218384 203429 198878 187287 173590 167821 173381 180903 185809 189056 170650 161171
12742 161171 161300 156741 159564 157642 152101 144940 134564 124602 117384 123607 126478 123406 135024 137688
12728 137688 132866 119971 111870 109683 120631 132731 142963 149039 153669 157776 158321 157433 155757 157308
12714 157308 157606 165314 172716 166119 159542 151590 148745 152892 154508 152687 148545 141466 145049 155303
12700 155303 157247 148064 144171 146129 150623 157112 152950 149495 161006 182544 192893 187703 175412
12687 175412 174659 173988 166628 162490 157500 138356 123544 112556 106356 102481 105270 102941 94464 90301
12673 90301 85019 79546 66025 74504 78855 75145 80783 76193 62210 61141 62433 67518 72613 72191
$$ packed form
12769B21148J8246N853J715L071l053P92J2102m929m125l140r368j1041N216L079
12755B35566o539j0643j4955m551j1591j3697n769N560P522M906L247j8406r479
12742A61171J29m559K823j922n541p161j0376r962p218O223K871l072J1618K664
12728A37688m822j2895q101k187J0948J2100J0232O076M630M107N45q88j676J551
12714A57308K98P708P402o597o577p952k845M147J616j821m142p079L583J0254
12700A55303J944r183l893J958M494O489m162l455J1511K1538J0349n190j2291
12687A75412p53o71p360m138m990j9144j4812j0988o200l875K789k329q477m163
12673I0301n282n473j3521Q479M351l710N638m590j3983j069J292N085N095m22
$$ plain form
12659 72191 69000 65486 61872 64051 71492 73792 75522 77321 79371 75396 72576 72381 67375 62035 64477
12644 64477 72357 79184 76152 79774 90321 100636 104396 108973 108620 109892 116145 108266 114654 123337
12630 123337 136819 143548 130253 108535 106387 122034 133143 128592 117922 105595 93606 88819
12618 88819 90807 103045 96991 81450 67643 58064 52391 49172 52788 47871 40606 32224 34093 38722
12604 38722 37657 32765 25794 22201 33331 49042 42772 44586 41345 42628 40620 37170 31564 39405
12590 39405 44106 40790 50921 52914 49758 34258 29472 44147 54590 60706 56833 49661 44519
12577 44519 45192 44938 45381 45794 50917 40622 38646 37777 43048 43109 28707 32478 29785 26361 31177 36880
12561 36880 40735 41123 50258 43591 43007 46962 52163 57270 48747 48505 42099 36796 36736 35785 35092 31162
$$ packed form
12659G2191l191l514l614K179P441K300J730J799K050l975k820j95n006n340K442
12644F4477P880O827l032L622J0547J0315L760M577l53J272O253p879O388Q683
12630A23337J3482O729j3295k1718k148J5647J1109m551j0670j2327j1989m787
12618H8819J988J2238o054j5541j3807r579n673l219L616m917p265q382J869M629
12604C8722j065m892o971l593J1130J5711o270J814l241J283k008l450n606P841
12590C9405M701l316J0131J993l156j5500m786J4675J0443O116l873p172n142
12577D4519O73k54M43M13N123j0295j976q69N271O1j4402L771k693l424M816N703
12561C6880L855L88R135o667n84L955N201N107q523k42o406n303o0r51o93l930
$$ plain form
12545 31162 30287 34488 36235 35335 24093 22088 18986 19998 34113 43095 60152 68081 60299 56379
12531 56379 56943 56582 59404 68641 72146 75344 74957 71605 82569 99277 114937 107656 104395 111117
12517 111117 124105 144276 164906 184899 213817 251894 290215 336598 390873 485016 615901
12506 615901 821596 1138848 1456796 1553106 1448702 1308754 1265855 1386464 1535720 1475418
12496 1475418 1228453 924357 662316 482114 357799 283488 228954 187415 155399 130832
12486 130832 110128 85766 77385 77725 88555 88545 84561 75094 62599 52082 41027 37625 36556
12473 36556 39725 35224 32681 32024 36219 41417 40513 38521 47841 49133 48575 40432 36249 30053 26836
12458 26836 28722 35896 33567 31206 26600 20183 30377 36547 26535 16937 16684 17828 25203 24077
$$ packed form
12545C1162q75M201J747r00j1242k005l102J012J4115Q982J7057P929p782l920
12531E6379N64l61K822R237L505L198l87l352J0964J6708J5660p281l261O722
12517A11117J2988K0171K0630J9993K8918L8077L8321M6383N4275R4143J30885
12506F15901K05695L17252L17948R6310j04404j39948m2899J20609J49256o0302
12496A475418k46965l04096k62041j80202j24315p4311n4534m1539l2016k4567
12486A30832k0704k4362q381L40J0830j0l984r467j2495j0517j1055l402j069
12473C6556L169m501k543o57M195N198r04j992R320J292n58q143m183o196l217
12458B6836J886P174k329k361m606o417J0194O170j0012r598k53J144P375j126
$$ plain form
12444 24077 13640 19121 33129 30359 32800 27237 14946 7763 2409 3945 9573 9316 8889 9902
12430 9902 5982 18148 26197 28342 21315 17675 28805 32544 35741 31108 25821 23586 27836 27110
12416 27110 30199 31749 32098 18221 12439 11174 10519 17969 17702 13754 18708 22733 21564 11165 1801
12401 1801 3460 3212 17458 29434 28601 27001 25777 25585 13097 9850 13515 8831 4904 13174 17831
12386 17831 21711 18713 20740 23884 27308 28655 15903 3154 6209 16688 26778 32481 26049
12373 26049 15139 18710 21753 33733 39763 38787 23804 17512 22412 27512 35823 38178 37238 34187
12359 34187 30839 30654 25176 11317 1421 1744 4290 18230 26856 29496 27033 20577 12114 9127
12345 9127 25582 24733 16885 9975 4242 6208 12044 24012 22708 27121 31223 30384 24622 16067 18725
$$ packed form
12444B4077j0437N481J4008k770K441n563j2291p183n354J536N628k57m27J013
12430I902l920J2166Q049K145p027l640J1130L739L197m633n287k235M250p26
12416B7110L089J550L49j3877n782j265o55P450k67l948M954M025j169j0399r364
12401A801J659k48J4246J1976q33j600j224j92j2488l247L665m684l927Q270M657
12386A7831L880k998K027L144L424J347j2752j2749L055J0479J0090N703o432
12373B6049j0910L571L043J1980O030r76j4983o292M900N100Q311K355r40l051
12359C4187l348j85n478j3859r896L23K546J3940Q626K640k463o456q463k987
12345I127J6455q49p848o910n733J966N836J1968j304M413M102q39n762q555K658
$$ plain form
12330 18725 18053 21337 33112 30875 23333 18751 5830 8775 20388 22273 21479 15965 9014 9341
12316 9341 10000 21362 23466 17416 13119 14353 15043 9985 7187 20200 26386 22567 23474 15577 16448
12301 16448 16395 13167 10461 8974 26965 25767 27687 24511 20716 19018 18919 23485 15373 8255 6653
12286 6653 1004 2355 1187 -169 12335 14416 21001 14585 17041 18464 5614 -1893 1453 -449
12272 -449 2219 9473 12596 8744 7997 1613 1920 -746 -2710 -2491 -4933 -7664 -11953 -16470 -14948 -3937
12256 -3937 275 -2420 -646 3064 4239 -526 7384 19592 6737 1728 7014 291 5646 5117
12242 5117 -672 -5053 -553 3343 -3033 -2461 4572 5973 10892 8183 -411 4204 11089 10519 12565
12227 12565 12023 9368 7157 12367 13567 9400 6581 2755 6823 9063 6940 7074 3209 2629 -3803
$$ packed form
12330A8725o72L284J1775k237p542m582j2921K945J1613J885p94n514o951L27
12316I341O59J1362K104o050m297J234O90n058k798J3013O186l819R07p897Q71
12301A6448n3l228k706j487J7991j198J920l176l795j698r9M566q112p118j602
12286F653n649J351j168j356J2504K081O585o416K456J423j2850p507L346j902
12272d49K668P254L123l852p47o384L07k666j964K19k442k731m289m517J522J1011
12256c937M212k695J774L710J175m765P910J2208j2855n009N286o723N355n29
12242E117n789m381M500L896o376N72P033J401M919k709q594M615O885n70K046
12227A2565n42k655k211N210J200m167k819l826M068K240k123J34l865n80o432
$$ plain form
12212 -3803 -7420 -6898 -7099 -7353 -10379 -15943 -11746 -8207 583 3280 3763 6204 4787 2819 -5241 -7145
12196 -7145 -5136 -6537 -11324 -11591 742 9129 1085 -10875 -14047 -9848 -15042 -14791 -5910 -13378 -21101
12181 -21101 -18514 -12070 -6064 1087 4558 6296 3949 6904 6963 8353 9781 12166 6263 -3313 3739
12166 3739 12887 16547 17114 27278 42459 47267 48367 41602 29957 19898 7442 4210 4281 4309 5420
12151 5420 3483 -4435 -12386 4046 10842 10600 8442 8500 2672 -2046 3563 3541 5590 -8933 -16291
12136 -16291 -5463 -411 9134 18499 17407 5760 -4008 -6577 -3842 4534 3424 3382 -942 3256
12122 3256 14566 27993 22875 24982 25692 12189 6207 13573 17984 18861 9302 2601 2158 -785 -7306
12107 -7306 -13287 -10960 7159 22392 23817 7376 -7289 -6702 -681 5072 185 -4012 -3242 -6203
$$ packed form
12212c803l617N22k01k54l026n564M197L539Q790K697M83K441j417j968q060j904
12196g145K009j401m787k67J2333Q387q044j1960l172M199n194K51Q881p468p723
12181b1101K587O444O006P151L471J738k347K955N9J390J428K385n903r576P052
12166C739R148L660N67J0164J5181M808J100o765j1645j0059j2456l232P1K8J111
12151E420j937p918p951J6432O796k42k158N8n828m718N609k2K049j4523p358
12136a6291J0828N052R545R365j092j1647r768k569K735Q376j110m2m324M198
12122C256J1310J3427n118K107P10j3503n982P366M411Q77r559o701m43k943o521
12107g306n981K327J8119J5233J425j6441j4665N87O021N753m887m197P70k961
$$ plain form
12093 -6203 -2191 -680 7763 21270 18842 4010 -3469 -10971 -14393 -9519 1384 9956 12693 14163
12079 14163 12754 10094 -1265 -14382 -19828 -15611 -9402 -10195 -6190 5637 6089 3138 2372 2333 -2223
12064 -2223 -10777 -15477 -9931 -399 6783 4928 1646 -166 -4590 -8917 -3201 7599 10494 17115
12050 17115 11608 -2693 -13980 -9291 -9589 -15957 -21657 -11687 -8732 -4442 -185 2146 4010 5904
12036 5904 10644 19686 5809 1615 -1428 5320 824 -10549 -5063 5442 17977 16689 8589 1026
12022 1026 5174 23 404 4663 1699 -1437 -1052 5129 7921 15938 12357 14611 2306 -7434 -4763
12007 -4763 8560 11192 8722 6017 -3065 -9499 -2239 -45 -2614 -3472 -2001 -149 -3024 -6938 -990
11992 -990 -650 9239 17591 14056 11200 14544 20343 24255 19279 13110 -2988 -9694 -10963 -14467 -953
$$ packed form
12093f203M012J511Q443J3507k428j4832p479p502l422M874J0903Q572K737J470
12079A4163j409k660j1359j3117n446M217O209p93M005J1827M52k951p66l9m556
12064b223q554m700N546R532P182j855l282j812m424m327N716J0800K895O621
12050A7115n507j4301j1287M689k98o368n700R970K955M290M257K331J864J894
12036E904M740R042j3877m194l043O748m496j1373N486J0505J2535j288q100p563
12022A026M148n151L81M259k964l136L85O181K792Q017l581K254j2305r740K671
12007d763J3323K632k470k705r082o434P260K194k569q58J471J852k875l914N948
11992i90L40R889Q352l535k856L344N799L912m976o169j6098o706j269l504J3514
$$ plain form
11977 -953 8286 2503 -7515 -9604 -9807 -6520 7469 -523 -1892 -5495 -3337 -2725 1901 3715 8962
11962 8962 6224 4864 5720 11601 14864 4507 2108 23967 40965 34502 28803 32570 25205 17887
11948 17887 17543 15147 8860 1380 -753 1700 342 5774 12962 16032 9468 -1309 -6327 -537
11934 -537 -1360 4739 7279 7460 9517 6995 2816 3399 1680 7020 8867 13551 20541 22362 8884
11919 8884 -1883 -10632 -17829 -16055 -9936 -322 3181 2504 -396 8969 9640 11752 4575 1372 5826
11904 5826 235 2986 -2831 -4847 19 -11333 -18712 -9999 -10294 -16486 -6124 8492 7350 6583
11890 6583 4956 -4003 -10368 -5156 271 2585 7406 18369 25022 20799 7363 4432 3821 6718
11876 6718 882 1199 -7765 -4903 6290 -1081 -9941 -20808 -18904 -24786 -26089 -20191 -24285 -25401
$$ packed form
11977i53R239n783j0018k089k03L287J3989p992j369l603K158O12M626J814N247
11962H962k738j360Q56N881L263j0357k399K1859J6998o463n699L767p365p318
11948A7887l44k396o287p480k133K453j358N432P188L070o564j0777n018N790
11934e37q23O099K540J81K057k522m179N83j719N340J847M684O990J821j3478
11919H884j0767q749p197J774O119R614L503o77k900R365O71K112p177l203M454
11904E826n591K751n817k016M866j1352p379Q713k95o192J0362J4616j142p67
11890F583j627q959o365N212N427K314M821J0963O653m223j3436k931o11K897
11876F718n836L17q964K862J1193p371q860j0867J904n882j303N898m094j116
$$ plain form
11862 -25401 -17071 -10269 -5394 8053 7669 2113 -7301 -8273 -3693 1475 7043 11755 -970 -8879
11848 -8879 -8649 -5155 3760 6002 4052 -344 -169 -296 -7973 -10401 -10196 -10696 -6641 -4801 -3867 -3901 2444
11831 2444 10717 14446 6299 5756 9433 3792 956 -3862 -6862 -4921 -1555 -228 -5152 -6774 51
11816 51 -2241 -10330 -19993 -11692 -7747 -16922 -16237 -4947 50 8488 7407 -2455 -5249 -4801 -6746
11801 -6746 -5442 -8219 -6857 -17068 -14324 -6109 -8492 -5078 3651 -452 -1611 782 -6791 -10169
11787 -10169 -6742 5224 7104 9464 11883 6925 6088 7637 13586 5079 -2952 -7054 -2960 1426
11773 1426 -6062 -11208 -405 4781 2746 811 -9793 -17083 -24509 -26934 -19954 -8628 2180 1408
11759 1408 -4627 -2730 -8880 -13694 -13423 -18014 -16759 -15100 -11656 -4616 6230 15457 22472 16388 13899
$$ packed form
11862b5401Q330O802M875J3447l84n556r414r72M580N168N568M712j2725p909
11848h879K30L494Q915K242j950m396J75j27p677k428K05n00M055J840R34l4O345
11831B444Q273L729q147n43L677n641k836m818l000J941L366J327m924j622O825
11816E1k292q089r663Q301L945r175O85J1290M997Q438j081r862k794M48j945
11801f746J304k777J362j0211K744Q215k383L414Q729m103j159K393p573l378
11787a0169L427J1966J880K360K419m958q37J549N949q507q031m102M094M386
11773A426p488n146J0803N186k035j935j0604p290p426k425O980J1326J0808p72
11759A408o035J897o150m814K71m591J255J659L444P040J0846R227P015o084k489
$$ plain form
11744 13899 4793 -6902 -9604 -8852 -10680 -8011 691 8009 5842 4389 8480 4629 -5698 -1032
11730 -1032 8634 13490 12745 13821 21645 22069 21509 26258 20901 9798 4851 10730 12381 15058 14267
11715 14267 29860 26014 20081 19937 26498 38364 40220 34835 27795 33636 38424 37665 46794 58334
11701 58334 72111 89798 103661 126562 148475 154579 157351 175569 190129 188949 178172 165318
11689 165318 156152 162812 151436 142219 122007 100178 87497 75012 64399 64057 65319 61437 52704
11676 52704 56134 62278 60048 51080 59635 64114 68423 77144 66700 44747 41809 43098 56856 64081
11662 64081 76573 92851 98547 106566 114513 136378 153853 174632 192208 220315 248894 277021
11650 277021 297884 308016 324135 341875 342129 330912 314727 297686 288156 276903 254242 225875
$$ packed form
11744A3899r106j1695k702P52j828K669Q702P318k167j453M091l851j0327M666
11730a032R666M856p45J076P824M24n60M749n357j1103m947N879J651K677p91
11715A4267J5593l846n933j44O561J1866J856n385p040N841M788p59R129J1540
11701E8334J3777J7687J3863K2901K1913O104K772J8218J4560j180j0777j2854
11689A65318r166O660j1376r217k0212k1829j2681j2485j0613l42J262l882q733
11676E2704L430O144k230q968Q555M479M309Q721j0444k1953k938J289J3758P225
11662F4081J2492J6278N696Q019P947K1865J7475K0779J7576K8107K8579K8127
11650B77021K0863J0132J6119J7740K54j1217j6185j7041r530j1253k2661k8367
$$ plain form
11638 225875 212031 204984 194577 185481 189421 202035 200103 188454 175416 167100 156684 139678
11626 139678 128224 117133 109764 100431 95393 86353 74764 66667 55838 57871 66529 67597 58501
11613 58501 56950 66329 61055 53155 58474 74056 83570 90967 105370 119998 131092 146182 163831
11600 163831 177685 198094 219544 248349 272599 277731 282285 272249 255862 244469 231856 205509
11588 205509 178270 147545 131916 116449 108113 99536 86928 80984 76654 67691 62327 57439 43553
11575 43553 44058 47765 49660 52113 57460 51471 39153 42449 46664 46688 46025 43173 48762 42839 39201
11560 39201 49630 56590 42679 34903 35578 38756 40403 44050 50697 56360 50948 42337 47125 47341
11546 47341 43450 36364 32905 32955 36621 43125 46609 48731 41437 35364 39110 36103 32491 27156 23790
$$ packed form
11638B25875j3844p047j0407r096L940J2614j932j1649j3038q316j0416j7006
11626A39678j1454j1091p369r333n038r040j1589q097j0829K033Q658J068r096
11613E8501j551R379n274p900N319J5582R514P397J4403J4628J1094J5090J7649
11600A63831J3854K0409K1450K8805K4250N132M554j0036j6387j1393j2613k6347
11588B05509k7239l0725j5629j5467q336q577j2608n944m330q963n364m888j3886
11575D3553N05L707J895K453N347n989j2318L296M215K4o63k852N589n923l638
11560C9201J0429O960j3911p776O75L178J647L647O647N663n412q611M788K16
11546D7341l891p086l459N0L666O504L484K122p294o073L746l007l612n335l366
$$ plain form
11531 23790 31327 30736 32539 38498 36349 38075 36304 37073 35781 32375 31675 29661 32804 35311 47296
11516 47296 54064 52588 52815 57765 57027 58238 67063 77578 86950 88393 86801 71173 67256 74297
11502 74297 82482 83443 78408 71210 76725 76059 78634 78265 62304 50951 50191 58016 61941 65670 61839
11487 61839 51688 55403 54825 49605 44119 46764 51450 48091 43939 48110 55806 62476 66892 72569
11473 72569 79341 89817 101015 107954 110303 111412 110769 122949 144619 163196 177612 179647 189353
11460 189353 194465 195704 204213 206093 202799 198139 198196 195637 198066 194192 181725 154006 132939 119972
11446 119972 113478 98463 88604 82471 73108 69924 74940 63942 53641 48451 47830 49969 55897 60947
11432 60947 59684 42007 39374 49731 62775 73510 69182 62804 70535 82629 97716 108522 108568
$$ packed form
11531B3790P537n91J803N959k149J726j771P69j292l406p00k014L143K507J1985
11516D7296O768j476K27M950p38J211Q825J0515R372J443j592j5628l917P041
11502G4297Q185R61n035p198N515o66K575l69j5961j1353p60P825L925L729l831
11487F1839j0151L715n78n220n486K645M686l359m152M171P696O670M416N677
11473G2569O772J0476J1198O939K349J109o43J2180K1670J8577J4416K035R706
11460A89353N112J239Q509J880l294m660N7k559K429l874j2467k7719k1067j2967
11446A19972o494j5015r859o133r363l184N016j0998j0301n190o21K139N928N050
11432F0947j263j7677k633J0357J3044J0735m328o378P731J2094J5087J0806M6
$$ plain form
11419 108568 115239 124796 133772 152931 173800 176214 178277 185583 188153 197881 200277 200182 178187 157813
11405 157813 140413 123045 105864 93188 77575 62885 58845 49885 40983 35671 29183 30861 28473
11392 28473 32428 30573 24646 23332 24804 27152 23370 15767 14755 21950 19113 25009 29976 31913
11378 31913 35235 31707 32358 27785 22632 30980 33462 26842 21412 14481 17561 23398 18547 9387 16570
11363 16570 15125 3528 -5464 -2547 1635 2826 6565 2333 6727 4799 8676 6206 9102 13754
11349 13754 20231 24596 11017 11132 17033 19551 28971 39073 38724 31796 27120 30520 29741 28102 25565
11334 25565 19745 16904 23401 24329 22483 15364 20928 15393 13011 13731 11875 20053 25609 33016 31355
11319 31355 19080 23060 20936 9060 603 8325 13602 16866 24444 29698 32571 32481 26384 27658
$$ packed form
11419A08568O671R557Q976J9159K0869K414K063P306K570R728K396r5k1995k0374
11405A57813j7400j7368j7181j2676j5613j4690m040q960q902n312o488J678k388
11392B8473L955j855n927j314J472K348l782p603j012P195k837N896M967J937
11378C1913L322l528O51m573n153Q348K482o620n430o931L080N837m851r160P183
11363A6570j445j1597q992K917M182J191L739m232M394j928L877k470K896M652
11349A3754O477M365j3579J15N901K518R420J0102l49o928m676L400p79j639k537
11334B5565n820k841O497R28j846p119N564n535k382P20j856Q178N556P407j661
11319C1355j2275L980k124j1876q457P722N277L264P578N254K873r0o097J274
$$ plain form
11305 27658 29631 23044 32729 34649 35399 48078 56118 58095 58083 52721 49494 50451 45641 40347 21875
11290 21875 21269 20104 23357 29259 30989 35236 39782 38789 47465 54765 55992 67825 72535 77084 80395
11275 80395 92222 107335 116333 116668 123494 149628 176360 196168 197658 203254 228729 240857 240154
11262 240154 244395 248163 247279 247098 232017 210785 192702 162487 153748 154876 138169 124660 120984
11249 120984 117243 106234 101808 85098 83583 89892 86087 79421 73358 72354 77575 81686 80171 83284
11235 83284 81709 78434 72768 79353 99809 109029 119061 143515 160161 184050 212643 227998 223927
11222 223927 229530 231817 247896 259922 262915 262590 260927 245916 237811 216197 197181 188272 191171
11209 191171 181248 172240 160348 149329 137217 123825 108743 97317 85526 83235 72336 62878
$$ packed form
11305B7658J973o587R685J920P50J2679Q040J977j2n362l227R57m810n294j8472
11290B1875o06j165L253N902J730M247M546r93Q676P300J227J1833M710M549L311
11275H0395J1827J5113Q998L35O826K6134K6732J9808J490N596K5475J2128p03
11262B40154M241L768q84j81j5081k1232j8083l0215q739J128j6707j3509l676
11249A20984l741j1009m426j6710j515O309l805o666o063j004N221M111j515L113
11235H3284j575l275n666O585K0456R220J0032K4454J6646K3889K8593J5355m071
11222B23927N603K287J6079J2026K993l25j663j5011q105k1614j9016q909K899
11209A91171r923r008j1892j1019j2112j3392j5082j1426j1791k291j0899r458
$$ plain form
11197 62878 59230 64025 58693 42364 36860 38775 42842 60906 61656 57354 48826 42173 45775 49514
11183 49514 43362 50484 62056 78039 90242 103910 111321 105886 94435 97875 97215 86665 73912
11170 73912 71411 71556 70815 76736 77780 73054 69259 68635 64506 64312 64046 59787 64987 64875 68671 72808
11154 72808 77252 80159 87510 97151 108832 112168 105049 106065 116403 125552 114576 118734 135041
11141 135041 146922 161142 173788 177090 183857 198498 206361 218087 231792 242165 250316 255599
11129 255599 257747 261823 265775 251965 235562 227567 213652 207887 200502 185371 177273 181949 183664
11116 183664 174261 152826 133247 121982 111363 100559 95940 90820 93671 97332 99279 104686 107778
11103 107778 118617 133290 153032 166541 183206 192617 189454 191393 204890 217927 228584 219970
$$ packed form
11197F2878l648M795n332j6329n504J915M067J8064P50m302q528o653L602L739
11183D9514o152P122J1572J5983J2203J3668P411n435j1451L440o60j0550j2753
11170G3912k501J45p41N921J044m726l795o24m129j94k66m259N200j12L796M137
11154G2808M444K907P351R641J1681L336p119J016J0338R149j0976M158J6307
11141A35041J1881J4220J2646L302O767J4641P863J1726J3705J0373Q151N283
11129B55599K148M076L952j3810j6403p995j3915n765p385j5131q098M676J715
11116A83664r403k1435j9579j1265j0619j0804m619n120K851L661J947N407L092
11103A07778J0839J4673J9742J3509J6665R411l163J939J3497J3037J0657q614
$$ plain form
11091 219970 222035 220036 218014 223363 234807 245098 251613 254305 251817 263531 278634 284510 280208
11078 280208 277537 280835 285895 270337 264928 255837 237510 222533 216165 209402 191857 177812 156085
11065 156085 143719 140567 134300 122652 109141 100400 96092 89614 86180 92759 92268 91834 96636 93884
11051 93884 99456 99266 101428 100675 111395 122586 129085 126531 134784 143284 139590 148894 157912 167147
11037 167147 168868 174800 179969 182633 174417 168063 172968 169938 163992 155611 139077 122217 112012
11024 112012 113446 109467 91143 77977 70410 62791 58730 57390 51586 42897 39012 27609 16287
11011 16287 16265 23117 21290 14995 19874 14856 9052 11011 13513 15885 17475 15676 17086 18305 22122
10996 22122 17036 23678 27756 24178 14672 4442 3075 5391 5841 17984 16109 1968 5018 7223
$$ packed form
11091B19970K065j999k022N349J1444J0291O515K692k488J1714J5103N876m302
11078B80208k671L298N060j5558n409r091j8327j4977o368o763j7545j4045k1727
11065A56085j2366l152o267j1648j3511q741m308o478l434O579m91m34M802k752
11051I3884N572j90K162p53J0720J1191O499k554Q253Q500l694R304R018R235
11037A67147J721N932N169K664q216o354M905l030n946q381j6534j6860j0205
11024A12012J434l979j8324j3166p567p619m061j340n804q689l885j1403j1322
11011A6287k2O852j827o295M879n018n804J959K502K372J590j799J410J219L817
10996B2122n086O642M078l578r506j0230j367K316M50J2143j875j4141L050K205
$$ plain form
10982 7223 5117 1185 -1631 -585 3761 -608 -65 926 -4299 -5299 -6765 -3399 5905 10249 1160
10967 1160 -2047 2396 4801 916 3654 167 3832 15930 9956 -4654 -15923 -16073 -6950 6618
10953 6618 11031 10200 18850 20459 17367 11841 10401 8501 8260 14173 16907 15318 11826 4056 1902
10938 1902 4976 6031 13984 15866 14894 13577 13693 22835 26987 24784 18539 15214 4965 1944 16525
10923 16525 12325 4776 15099 17328 13866 8964 3984 4842 5135 7397 13110 14361 10850 23944
10909 23944 27487 18589 24106 20937 13663 8507 13514 15356 10459 9663 6202 15585 21613 12937 -1614
10894 -1614 -2059 -4080 3610 3064 -1062 -387 -6344 1935 3382 6896 -1616 -5082 1505 -3800 6004
10879 6004 13385 9215 2370 5168 7650 7716 7324 -1174 -8268 -3466 -7002 -13375 -9367 6890 16070
$$ packed form
10982G223k106l932k816J046M346m369N43R91n225j000j466L366R304M344r089
10967A160l207M443K405l885K738l487L665J2098n974j4610j1269j50R123J3568
10953F618M413q31Q650J609l092n526j440j900k41N913K734j589l492p770k154
10938A902L074J055P953J882r72j317J16R142M152k203o245l325j0249l021J4581
10923A6525m200p549J0323K229l462m902m980Q58K93K262N713J251l511J3094
10909B3944L543q898N517l169p274n156N007J842m897p96l461R383O028q676j4551
10894a614m45k021P690n46m126O75n957Q279J447L514q512l466O587n305R804
10879F004P381m170o845K798K482O6l92q498p094M802l536o373M008J6257R180
$$ plain form
10864 16070 19247 25524 22227 10825 10554 9669 11231 3088 -10101 -14210 3183 7143 1454 -3533
10850 -3533 -9942 -7106 2367 6182 9844 13391 2721 -1500 2328 9553 19589 26354 26170 16207
10836 16207 2982 6953 9982 15040 22771 23394 18382 17812 20624 26532 27364 31812 37972 35573 27531
10821 27531 25268 19911 28064 30444 28414 22490 22512 16556 16565 8972 3254 -2113 4869 5678 10471 11313
10805 11313 13273 3477 -9272 -8733 -4178 -8114 -2890 1608 3291 -4396 -10813 -10696 -5713 4130 8032
10790 8032 10710 7402 8099 16310 21763 20550 7637 11645 12780 10318 16005 17849 5178 -4452
10776 -4452 -6513 -1114 -724 4715 9988 9924 8742 8058 21064 22186 15281 15639 14426 15168 24703 25812
10760 25812 25597 25346 17509 6809 20186 24819 18250 18205 24060 25951 24933 17269 10653 15089 24831
$$ packed form
10864A6070L177O277l297j1402k71q85J562q143j3189m109J7393L960n689m987
10850c533o409K836R473L815L662L547j0670m221L828P225J0036O765j84r963
10836A6207j3225L971L029N058P731O23n012n70K812N908Q32M448O160k399q042
10821B7531k263n357Q153K380k030n924K2n956Rp593n718n367O982Q09M793Q42
10805A1313J960r796j2749N39M555l936N224M498J683p687o417J17M983R843L902
10790H032K678l308O97Q211N453j213j2913M008J135k462N687J844j2671r630
10776d452k061N399L90N439N273o4j182o84J3006J122o905L58j213P42R535J109
10760B5812k15k51p837j0700J3377M633o569m5N855J891j018p664o616M436R742
$$ plain form
10745 24831 26457 20787 12416 14483 12670 6885 5220 3199 7817 11711 2407 1901 1766 -2155 6219
10730 6219 8722 3588 8348 17670 25618 29092 27122 17188 7764 8146 15471 21730 17131 15514 13990
10715 13990 12215 10584 11263 22970 25403 25773 20259 23158 19846 16989 10177 12163 15080 7912 11926
10700 11926 20754 13791 -573 8481 12487 10382 8968 3701 2377 13429 15183 15681 19739 7274
10686 7274 4176 9687 8095 6230 17276 29165 24077 19280 19866 16530 11345 10969 10756 13735 17352
10671 17352 19298 15248 15022 17484 15225 18661 19464 16295 13476 15351 22946 33009 24061 14468 20708
10656 20708 20678 20948 17638 20629 27738 32203 25370 17841 30784 33365 26361 24054 29470 34759 34192
10641 34192 32411 30293 31456 32724 24484 35222 43236 53019 60584 63365 63404 62198 73856 77160
$$ packed form
10745B4831J626n670q371K067j813n785j665k021M618L894r304n06j35l921Q374
10730F219K503n134M760R322P948L474j970r934r424L82P325O259m599j617j524
10715A3990j775j631O79J1707K433L70n514K899l312k857o812J986K917p168M014
10700A1926Q828o963j4364R054M006k105j414n267j324J1052J754M98M058j2465
10686G274l098N511j592j865J1046J1889n088m797N86l336n185l76k13K979L617
10671A7352J946m050k26K462k259L436Q03l169k819J875P595J0063q948r593O240
10656B0708l0K70l310K991P109M465o833p529J2943K581p004k307N416N289n67
10641C4192j781k118J163J268q240J0738Q014R783P565K781L9j206J1658L304
$$ plain form
10627 77160 70470 72133 78715 86358 95708 101587 101631 95247 83200 76901 69154 61989 64375 66925 63427
10612 63427 57454 53344 42447 36339 36725 30783 19171 22048 29952 21139 20879 20257 15996 23263 15304
10597 15304 780 -852 1720 3785 10081 24652 28550 22604 16459 13576 15615 18360 19292 13558
10583 13558 13270 15896 15724 15463 16286 16917 23902 32102 35407 28815 10378 1847 7330 14968 22531
10568 22531 18854 29481 35044 24219 17199 16672 20346 23603 24918 32810 41457 50892 63829 86712
10554 86712 93020 101673 132381 175835 208408 209918 202287 200573 195165 209023 223962 232513 209341
10541 209341 177195 133163 111756 98362 81698 70054 64269 64294 61953 52180 40124 26996 32024
10528 32024 31048 35890 35481 29485 28280 19619 26519 31103 28506 15965 8147 6177 14445 23513 21318
$$ packed form
10627G7160o690J663O582P643R350N879M4o384j2047o299p747p165K386K550l498
10612F3427n973m110j0897o108L86n942j1612K877P904q813k60o22m261P267p959
10597A5304j4524j632K572K065O296J4571L898n946o145k883K039K745R32n734
10583A3558k88K626j72k61Q23O31O985Q200L305o592j8437q531N483P638P563
10568B2531l677J0627N563j0825p020n27L674L257J315P892Q647R435J2937K2883
10554H6712O308Q653L0708M3454L2573J510p631j714n408J3858J4939Q551k3172
10541B09341l2146m4032k1407j3394j6664j1644n785K5k341r773j2056j3128N028
10528C2024r76M842m09n996j205q661O900M584k597j2541p818j970Q268R068k195
$$ plain form
10513 21318 29840 26401 20050 10863 8787 9073 10089 12830 18395 22364 19777 17663 25239 33686 44559
10498 44559 56300 54558 52825 53862 58989 58585 58428 56315 60859 60049 48052 40778 32635 36018 42023
10483 42023 49167 46840 35930 28781 28988 24756 24118 23288 25282 33062 26326 19753 20086 21546 24650
10468 24650 23896 26416 32146 32222 30610 26772 18757 14017 19878 16917 17977 28604 30802 38407 42036
10453 42036 43959 43831 34773 35909 37932 38583 44064 36022 35318 34262 37585 37567 29051 25854 25983 19213
10437 19213 16347 17809 19951 33042 39344 36350 44792 46572 42827 41732 39344 39120 28609 21077
10423 21077 24417 30885 34050 30302 28226 29208 31128 27988 26516 32072 30833 31728 30330 31039 27893
10408 27893 28880 35002 31082 26188 34475 37224 43614 43665 45938 43347 52006 68673 83836 77333 85237
$$ packed form
10513B1318Q522l439o351r187k076K86J016K741N565L969k587k114P576Q447J0873
10498D4559J1741j742j733J037N127m04j57k113M544q10j1997p274q143L383O005
10483D2023P144k327j0910p149K07m232o38q30J994P780o736o573L33J460L104
10468B4650p54K520N730P6j612l838q015m740N861k961J060J0627K198P605L629
10453D2036J923j28r058J136K023O51N481q042p04j056L323j8q516l197J29o770
10437A9213k866J462K142J3091O302k994Q442J780l745j095k388k24j0511p532
10423B1077L340O468L165l748k076R82J920l140j472N556j239Q95j398P09l146
10408B7893R87O122l920m894Q287K749O390N1K273k591Q659J6667J5163o503P904
$$ plain form
10393 85237 95019 105385 105872 113457 125157 125828 124250 112224 113980 127681 129688 132105 141106 140477
10379 140477 144423 137539 139764 148768 166808 183972 190863 181450 159461 146700 135158 130300 123848
10366 123848 131401 138030 123925 109764 96290 86570 91194 89404 95045 92713 82369 81057 75467
10353 75467 76666 79084 82617 77875 66110 69157 76361 73701 71426 63965 62537 64251 69754 70368
10339 70368 71894 67583 64611 58142 64917 59932 54576 61755 66342 63599 62283 58701 53296 52053
10325 52053 50648 45566 36812 34315 45940 48620 43511 38429 33372 28607 32492 29608 25699 20161
10311 20161 15970 13822 16572 19907 24057 36850 35049 26348 26753 27855 35050 29312 16714 21550
10297 21550 24931 23075 24216 23496 25932 17291 19117 24716 24570 25862 34133 46849 41204 41426 52978
$$ packed form
10393H5237R782J0366M87P585J1700O71j578j2026J756J3701K007K417R001o29
10379A40477L946o884K225R004J8040J7164O891r413k1989j2761j1542m858o452
10366A23848P553O629j4105j4161j3474r720M624j790N641k332j0344j312n590
10353G5467J199K418L533m742j1765L047P204k660k275p461j428J714N503O14
10339G0368J526m311k972o469O775m985n356P179M587k743j316l582n405j243
10325E2053j405n082q754k497J1625K680n109n082n057m765L885k884l909n538
10311B0161m191k148K750L335M150J2793j801q701M05J102P195n738j2598M836
10297B1550L381j856J141p20K436q641J826N599j46J292Q271J2716n645K22J1552
$$ plain form
10282 52978 57625 66635 57565 44763 46245 44034 35802 26853 23117 24727 24330 32068 36779 33206
10268 33206 24185 34509 39647 30836 25521 28998 26090 29335 29484 32939 28069 31715 36347 22815
10254 22815 22754 26437 23163 27240 28934 32075 32200 38122 42905 42985 46198 51787 49747 49817 47346 36855
10238 36855 37246 48078 51302 49650 40727 51689 59339 51767 54917 52271 56303 62064 56200 51434
10224 51434 44248 47727 60630 64462 59370 67020 73588 65224 58703 62927 70497 69396 71568 74782
10210 74782 70441 84111 83892 88393 102404 93387 86126 95932 100486 99366 95684 101776 109031 103529
10196 103529 98392 104239 103558 93391 79131 69017 65303 58157 42555 38602 32235 35030 31481
10183 31481 19453 16110 30298 43201 47769 44213 36743 34224 35500 39619 35237 46380 55128
$$ packed form
10282E2978M647R010r070j2802J482k211q232q949l736J610l97P738M711l573
10268C3206r021J0324N138q811n315L477k908L245J49L455m870L646M632j3532
10254B2815o1L683l274M077J694L141J25N922M783Q0L213N589k040P0k471j0491
10238C6855L91J0832L224j652q923J0962P650p572L150k646M032N761n864m766
10224E1434p186L479J2903L832n092P650O568q364o521M224P570j101K172L214
10210G4782m341J3670k19M501J4011r017p261R806M554j120l682O092P255n502
10196A03529n137N847o81j0167j4260j0114l714p146j5602l953o367K795l549
10183C1481j2028l343J4188J2903M568l556p470k519J276M119m382J1143Q748
$$ plain form
10170 55128 50800 46688 35900 31682 35594 37139 35716 41611 45804 51028 51205 53408 53044 51217 41075
10155 41075 48170 56258 54689 54932 63032 70591 75659 70890 70861 73770 75544 82851 95292 94177 91866
10140 91866 95963 98951 104861 99258 85392 84462 87633 82463 83780 79705 75222 80480 83146 86545
10126 86545 96715 90456 80400 80887 76545 66521 73776 71778 70129 77914 84343 81965 66151 58714
10112 58714 64806 70316 76401 66095 60383 61587 52668 62419 69927 80798 94929 103604 104471 118091
10098 118091 119986 117083 116173 103752 95014 88114 90464 103613 111351 110124 110448 123394 140695 165087
10084 165087 179503 201047 230196 262525 305860 362181 438531 527344 606832 677891 746233
10073 746233 835708 932864 991557 954494 869961 778718 708270 633136 553594 469827 396693
$$ packed form
10170E5128m328m112j0788m218L912J545j423N895M193N224J77K203l64j827j0142
10155D1075P095Q088j569K43Q100P559N068m769k9K909J774P307J2441j115k311
10140I1866M097K988N910n603j3866r30L171n170J317m075m483N258K666L399
10126H6545J0170o259j0056M87m342j0024P255j998j649P785O429k378j5814p437
10112E8714O092N510O085j0306n712J204q919R751P508J0871J4131Q675Q67J3620
10098A18091J895k903r10j2421q738o900K350J3149P738j227L24J2946J7301K4392
10084A65087J4416K1544K9149L2329M3335N6321P6350Q8813P9488P1059O8342
10073G46233Q9475R7156N8693l7063q4533r1243p0448p5134p9542q3767p3134
$$ plain form
10062 396693 334634 275383 238795 210214 192321 178504 167026 159737 148017 139927 141146 130609
10050 130609 126018 126731 132428 131097 132133 130712 133199 138965 141593 144833 151173 169277 180186 197308
10036 197308 222534 254664 296047 357543 442355 532194 621991 716512 747828 716750 655058
10025 655058 556915 453456 374176 319971 279994 246985 240267 246988 243636 243771 253841 278332
10013 278332 302316 323373 354715 400402 451960 494755 535941 574897 623305 696206 803761
10002 803761 940858 1102878 1303803 1546710 1832993 2160572 2514872 3012506 3835471 5396425
9992 5396425 8406245 11622479 11238270 8939830 6212268 4010053 2731670 2001561 1558586
9983 1558586 1284174 1091502 936920 816841 728745 650578 587451 549913 533365 511957 491406
$$ packed form
10062C96693o2059n9251l6588k8581j7893j3817j1478p289j1720q090J219j0537
10050A30609m591P13N697j331J036j421K487N766K628L240O340J8104J0909J7122
10036A97308K5226L2130M1383O1496Q4812Q9839Q9797R4521L1316l1078o1692
10025F55058r8143j03459p9280n4205l9977l3009o718O721l352J35J0070K4491
10013B78332K3984K1057L1342M5687N1558M2795M1186L8956M8408P2901J07555
10002H03761J37097J62020K00925K42907K86283L27579L54300M97634Q22965J560954
9992E396425L009820L216234l84209k298440k727562k202215j278383p30109m42975
9983A558586k74412j92672j54582j20079q8096p8167o3127l7538j6548k1408k0551
$$ plain form
9972 491406 485573 471986 463797 455629 446580 455244 481395 494454 513562 540632 581491 630557 683756
9959 683756 747918 828517 919865 1021267 1157213 1344280 1580836 1873375 2250035 2702494
9949 2702494 3168828 3545546 3753304 3815940 3833840 3933848 4195927 4667445 5303594 5929760
9939 5929760 6239677 6082529 5558896 4911258 4352864 3990007 3816248 3763164 3724252 3561467
9929 3561467 3226749 2781360 2306523 1883900 1547197 1291827 1104726 958050 836617 747860
9919 747860 680642 618734 571027 527130 480402 431457 397382 376784 358588 348261 347137 338910
9907 338910 319096 310037 299700 286116 281358 278497 273861 252431 235121 226450 216470 210752 211132
9894 211132 211741 203375 196986 189029 183551 179596 170149 167017 159918 139870 133440 124704 124275 129355 136552
$$ packed form
9972D91406n833j3587q189q168r049Q664K6151J3059J9108K7070M0859M9066N3199
9959F83756O4162Q0599R1348J01402J35946J87067K36556K92539L76660M52459
9949B702494M66334L76718K07758O2636J7900J00008K62079M71518O36149O26166
9939E929760L09917j57148n23633o47638n58394l62857j73759n3084l8912j62785
9929C561467l34718m45389m74837m22623l36703k55370j87101j46676j21433q8757
9919G47860o7218o1908m7707m3897m6728m8945l4075k0598j8196j0327j124q227
9907C38910j9814r059j0337j3584m758k861m636k1430j7310q671r980n718L80
9894B11132O09q366o389p957n478l955r447l132p099k0048o430q736m29N080P197
$$ plain form
9879 136552 138829 134178 128016 130728 133594 131309 118581 121765 127703 114277 102184 106946 108244 115642
9865 115642 119300 117483 109667 117495 122422 123552 124627 115248 112796 113102 116004 110011 114579 119116 114472
9850 114472 116680 120200 121492 124275 136232 143112 142129 144348 146004 147867 141048 140778 141491 141248 144552
9835 144552 149384 157289 162321 157790 146795 138080 138326 144163 139133 143436 135400 133914 126689 121961
9821 121961 127422 128085 127197 128066 130868 131617 128073 125544 127607 133463 137186 131655 138383 141166 138983
9806 138983 144591 149227 151051 150338 150633 150385 155580 159887 165004 171450 181149 181423 163532 156624 154224
9791 154224 163047 168417 162229 165108 171349 171049 175428 183501 202816 220202 241429 257634 274554
9778 274554 295560 329361 356175 366111 359152 339638 316017 295700 305468 317642 321388 334237
$$ packed form
9879A36552K277m651o162K712K866k285j2728L184N938j3426j2093M762J298P398
9865A15642L658j817p816P828M927J130J075r379k452L06K902n993M568M537m644
9850A14472K208L520J292K783J1957O880r83K219J656J863o819k70P13k43L304
9835A44552M832P905N032m531j0995q715K46N837n030M303q036j486p225m728
9821A21961N461O63q88Q69K802P49l544k529K063N856L723n531O728K783k183
9806A38983N608M636J824p13K95k48N195M307N117O446R699K74j7891o908k400
9791A54224Q823N370o188K879O241l00M379Q073J9315J7386K1227J6205J6920
9778B74554K1006L3801K6814R936o959j9514k3621k0317R768J2174L746J2849
$$ plain form
9766 334237 358309 376503 374524 408924 441686 443538 433151 421336 418263 414701 409223 411259 415965
9753 415965 425943 456779 501384 552111 617047 718821 848252 1005747 1156955 1290270 1441640
9742 1441640 1618739 1796206 1888025 1817500 1666113 1506757 1366653 1221907 1066883 915691
9732 915691 781459 679322 607656 567557 547863 532611 524775 531996 548661 565723 586345 613681
9720 613681 655954 697773 745892 810197 890343 985094 1087685 1230630 1403990 1627400 1898370
9709 1898370 2228962 2653367 3215279 3906323 4654780 5358656 5986081 6614508 7300534 7879435
9699 7879435 8052643 7735498 7124557 6456824 5778770 5036584 4238574 3467422 2797365 2263674
9689 2263674 1854048 1551131 1328987 1153716 1013921 899111 817204 744720 685467 634228
$$ packed form
9766C34237K4072J8194j979L4400L2762J852j0387j1815l073l562n478K036M706
9753D15965R978L0836M4605N0727O4936J01774J29431J57495J51208J33315J51370
9742A441640J77099J77467R1819p0525j51387j59356j40104j44746j55024j51192
9732I15691j34232j02137p1666m0099j9694j5252p836P221J6665J7062K0622K7336
9720F13681M2273M1819M8119O4305Q0146R4751J02591J42945J73360K23410K70970
9709A898370L30592M24405N61912O91044P48457P03876O27425O28427O86026N78901
9699G879435J73208l17145o10941o67733o78054p42186p98010p71152o70057n33691
9689B263674m09626l02917k22144j75271j39795j14810q1907p2484n9253n1239
$$ plain form
9679 634228 589741 557341 524475 498658 472670 442979 418388 403100 381135 375681 368613 368067
9667 368067 374718 371808 372463 370013 374610 382121 395479 418393 457508 500683 553455 610834 674194
9654 674194 741608 803989 869660 949179 1025535 1053935 1028745 963897 897712 829995 756638 676723
9642 676723 590804 520778 467318 424564 385238 351015 327379 309840 305962 287553 266341 259799
9630 259799 251181 254211 258786 252830 241376 242105 238661 226243 229619 229822 220408 214262 211118 209863
9616 209863 214494 213184 210659 213571 209082 200273 196085 201786 205407 204167 204237 211257 208951 215273 216577
9601 216577 215470 220229 213599 204267 209359 217645 222828 234454 243728 235175 235909 235881 233345 236832 252319
9586 252319 255237 250946 253715 256083 253510 252873 251040 241410 228928 217088 220121 218382 223816 226449
$$ packed form
9679F34228m4487l2400l2866k5817k5988k9691k4591j5288k1965n454p068n46
9667C68067O651k910O55k450M597P511J3358K2914L9115M3175N2772N7379O3360
9654F74194O7414O2381O5671P9519P6356K8400k5190o4848o6185o7717p3357p9915
9642F76723q5919p0026n3460m2754l9326l4223k3636j7539l878j8409k1212o542
9630B59799q618L030M575n956j1454P29l444j2418L376K03r414o146l144j255
9616B09863M631j310k525K912m489q809m188N701L621j240P0P020k306O322J304
9601B16577j107M759o630r332N092Q286N183J1626R274q553P34k8k536L487J5487
9586B52319K918m291K769K368k573o37j833r630j2482j1840L033j739N434K633
$$ plain form
9572 226449 231544 239748 227846 237693 246921 247120 240030 242284 250263 253550 259926 260196 247953 233032
9558 233032 243263 247018 255437 257961 256600 255061 261019 259741 256236 260889 262638 257956 263151 266389
9544 266389 270296 278141 276245 265321 262948 263648 272100 279845 289461 297966 304178 304903 294845 290896
9530 290896 291475 289449 291320 300781 297475 279998 282034 290325 304928 305322 306547 313064 324672 332139
9516 332139 331066 332408 319229 313949 315106 312587 311862 317492 324605 335437 343428 343712 345709 343306
9502 343306 334316 341718 344744 351274 348108 350227 371138 374945 373526 371098 380590 384686 385123 391163
9488 391163 410821 415740 406786 409699 407319 405068 402925 405249 411697 419568 427870 435966 444534 448062
9474 448062 459885 457588 466032 469582 465117 453685 462878 471802 470961 468433 470108 483849 492455 493747
$$ packed form
9572B26449N095Q204j1902R847R228J99p090K254P979L287O376K70j2243j4921
9558B33032J0231L755Q419K524j361j539N958j278l505M653J749m682N195L238
9544B66389L907P845j896j0924k373P00Q452P745R616Q505O212P25j0058l949
9530B90896N79k026J871R461l306j7477K036Q291J4603L94J225O517J1608P467
9516C32139j073J342j3179n280J157k519p25N630P113J0832P991K84J997k403
9502C43306q990P402L026O530l166K119K0911L807j419k428R492M096M37O040
9488C91163J9658M919q954K913k380k251k143K324O448P871Q302Q096Q568L528
9474D48062J1823k297Q444L550m465j1432R193Q924q41k528J675J3741Q606J292
$$ plain form
9460 493747 497092 493888 503531 516714 512123 502249 501634 500020 508350 513292 527222 535736 535805 536929 541723
9445 541723 532494 522530 516322 523626 526468 524528 527441 534648 546252 557805 554619 553712 564913 562578
9431 562578 562554 559164 558568 572489 578824 587786 591520 595897 610103 614634 615646 620224 625520 642431
9417 642431 654224 653270 650048 655289 666017 673626 675931 677365 685413 694438 700627 703237 717669 727277
9403 727277 737773 746617 761092 770852 776026 779768 790069 804580 816529 825388 829966 839215 850321
9390 850321 860828 875096 891273 901128 905575 917552 928866 935593 938136 955480 972778 984800
9378 984800 1004076 1031576 1051753 1070680 1085281 1106886 1123908 1137291 1160374 1180747 1201414 1225137
9366 1225137 1239246 1245436 1258422 1260975 1265628 1275975 1285695 1295434 1307953 1319992 1339886 1367799
$$ packed form
9460D93747L345l204R643J3183m591r874o15j614Q330M942J3930Q514O9J124M794
9445E41723r229r964o208P304K842j940K913P207J1604J1553l186r07J1201k335
9431E62578k4l390n96J3921O335Q962L734M377J4206M531J012M578N296J6911
9417F42431J1793r54l222N241J0728P609K305J434Q048R025O189K610J4432R608
9403G27277J0496Q844J4475R760N174L742J0301J4511J1949Q859M578R249J1106
9390H50321J0507J4268J6177R855M447J1977J1314O727K543J7344J7298J2022
9378I84800J9276K7500K0177J8927J4601K1605J7022J3383K3083K0373K0667K3723
9366A225137J4109O190J2986K553M653J0347R720R739J2519J2039J9894K7913
$$ plain form
9354 1367799 1384908 1399580 1420916 1448269 1471742 1493225 1509442 1541051 1566329 1589969 1626569
9343 1626569 1646551 1670991 1700935 1720062 1733682 1753712 1780002 1809459 1840569 1874914 1910252
9332 1910252 1943571 1966584 2009158 2043634 2073113 2110056 2144927 2175978 2213677 2263551 2318557
9321 2318557 2356895 2389413 2436884 2486533 2532924 2578313 2621404 2677094 2744293 2791358 2844630
9310 2844630 2909372 2981905 3043647 3107806 3184269 3247518 3316302 3404050 3482032 3561811 3646851
9299 3646851 3738586 3846243 3951906 4048875 4139114 4229887 4329730 4439773 4557943 4681584
9289 4681584 4811141 4946303 5073972 5211785 5351403 5494980 5645955 5807342 5978039 6163335
9279 6163335 6354452 6546768 6748169 6967584 7199629 7433625 7679147 7939171 8201360 8504043
$$ packed form
9354A367799J7109J4672K1336K7353K3473K1483J6217L1609K5278K3640L6600
9343A626569J9982K4440K9944J9127J3620K0030K6290K9457L1110L4345L5338
9332A910252L3319K3013M2574L4476K9479L6943L4871L1051L7699M9874N5006
9321B318557L8338L2518M7471M9649M6391M5389M3091N5690O7199M7065N3272
9310B844630O4742P2533O1742O4159P6463O3249O8784Q7748P7982P9779Q5040
9299C646851R1735J07657J05663R6969R0239R0773R9843J10043J18170J23641
9289D681584J29557J35162J27669J37813J39618J43577J50975J61387J70697J85296
9279F163335J91117J92316K01401K19415K32045K33996K45522K60024K62189L02683
$$ plain form
9269 8504043 8813944 9131033 9470108 9819544 10184031 10571120 10983431 11425690 11884679 12381496
9259 12381496 12900792 13440947 14024226 14643936 15308290 16016062 16767786 17554870 18402204
9250 18402204 19309361 20266838 21294226 22387223 23554930 24797081 26127770 27555870
9242 27555870 29066641 30673926 32393572 34220179 36160759 38210336 40387695 42686971
9234 42686971 45092990 47609586 50238200 52950378 55728278 58555265 61390082 64198197
9226 64198197 66937617 69547886 71965099 74149795 76025193 77529241 78636375 79296233
9218 79296233 79466565 79154112 78374762 77135633 75494961 73512794 71227178 68703488 66011774
9209 66011774 63199020 60328281 57454392 54613941 51835617 49139865 46533311 44034365
$$ packed form
9269H504043L09901L17089L39075L49436L64487L87089M12311M42259M58989M96817
9259A2381496N19296N40155N83279O19710O64354P07772P51724P87084Q47334
9250A8402204R07157R57477J027388J092997J167707J242151J330689J428100
9242B7555870J510771J607285J719646J826607J940580K049577K177359K299276
9234D2686971K406019K516596K628614K712178K777900K826987K834817K808115
9226F4198197K739420K610269K417213K184696J875398J504048J107134O59858
9218G9296233J70332l12453p79350j239129j640672j982167k285616k523690k691714
9209F6011774k812754k870739k873889k840451k778324k695752k606554k498946
$$ plain form
9201 44034365 41664392 39420411 37294361 35280977 33393983 31621304 29949113 28388052
9193 28388052 26928010 25556475 24266791 23062966 21933647 20875035 19887315 18958714
9185 18958714 18083285 17256687 16487181 15767470 15081191 14445938 13838720 13271831 12737235
9176 12737235 12229909 11745904 11291180 10869731 10469618 10091166 9722143 9368871 9043112
9167 9043112 8732573 8425217 8126872 7855255 7599046 7350385 7108556 6883648 6678990 6479136
9157 6479136 6281424 6100621 5928640 5762491 5600816 5450463 5305187 5152204 5003369 4873452
9147 4873452 4750653 4632936 4521125 4401984 4293873 4189499 4085585 3980020 3887052 3788270
9137 3788270 3691073 3605201 3530839 3449278 3374592 3308862 3229981 3168182 3100688 3028940 2962401
$$ packed form
9201D4034365k369973k243981k126050k013384j886994j772679j672191j561061
9193B8388052j460042j371535j289684j203825j129319j058612r87720r28601
9185A8958714q75429q26598p69506p19711o86279o35253o07218n66889n34596
9176A2737235n07326m84005m54724m21449m00113l78452l69023l53272l25759
9167I043112l10539l07356k98345k71617k56209k48661k41829k24908k04658j99854
9157F479136j97712j80803j71981j66149j61675j50353j45276j52983j48835j29917
9147D873452j22799j17717j11811j19141j08111j04374j03914j05565r2968r8782
9137C788270r7197q5872p4362q1561p4686o5730p8881o1799o7494p1748o6539
$$ plain form
9126 2962401 2911312 2861916 2804531 2753171 2701606 2643650 2595240 2551841 2507850 2465985 2427472
9115 2427472 2389853 2351716 2315666 2276580 2241512 2198588 2157723 2129694 2100406 2065008 2027005
9104 2027005 1989888 1949553 1924558 1898056 1866595 1838100 1810197 1781031 1748352 1719825 1697586
9093 1697586 1671435 1645475 1615411 1591389 1568421 1548382 1518531 1498218 1490291 1466416 1438399 1424299
9081 1424299 1407155 1382570 1373249 1361910 1334175 1320356 1294712 1275581 1259851 1250886 1235443 1217112
9069 1217112 1193301 1176304 1164090 1143965 1135744 1132765 1123714 1105645 1090288 1078698 1062981 1045111
9057 1045111 1033159 1013349 1006242 999077 988958 970659 949923 926367 917523 926591 931822 922802 893374
9044 893374 875554 871334 858331 857689 853566 833933 820597 807011 793556 790693 788223 778586 765781
$$ packed form
9126B962401n1089m9396n7385n1360n1565n7956m8410m3399m3991m1865l8513
9115B427472l7619l8137l6050l9086l5068m2924m0865k8029k9288l5398l8003
9104B027005l7117m0335k4995k6502l1461k8495k7903k9166l2679k8527k2239
9093A697586k6151k5960l0064k4022k2968k0039k9851k0313p927k3875k8017j4100
9081A424299j7144k4585r321j1339k7735j3819k5644j9131j5730q965j5443j8331
9069A217112k3811j6997j2214k0125q221k979r051j8069j5357j1590j5717j7870
9057A045111j1952j9810p107p165j0119j8299k0736k3556q844R068N231r020k9428
9044H93374j7820m220j3003o42m123j9633j3336j3586j3455k863k470r637j2805
$$ plain form
9031 765781 757337 757005 754541 745117 733025 728629 717619 708464 699682 695815 689245 681608 676037 665395
9017 665395 661497 653554 639095 633476 627166 621405 616061 615683 605133 600435 591254 588846 584471 578691
9003 578691 571894 565428 571869 563726 550577 542117 553961 562433 553121 540445 536131 535154 537208 535937
8989 535937 527518 516137 512562 500240 486921 486562 483692 492854 501827 502273 496092 481329 473109 469464
8975 469464 464084 449496 441562 435717 432243 426860 432386 442530 442494 439328 429190 422017 416870 421582
8961 421582 427229 415663 408328 412940 421471 423143 426106 422990 414566 405805 391283 389011 391013 391524
8947 391524 391339 388008 386052 380557 384683 390652 389115 387140 379271 377128 377214 375594 367519 370216 380240
8932 380240 380365 379123 375169 372325 371263 371363 370428 354044 339913 341571 349371 346036 343202 344026 350410
$$ packed form
9031G65781q444l32k464r424j2092m396j1010r155q782l867o570p637n571j0642
9017F65395l898p943j4459n619o310n761n344l78j0550m698r181k408m375n780
9003E78691o797o466O441q143j3149q460J1844Q472r312j2676m314r77K054j271
8989E35937q419j1381l575j2322j3319l59k870R162Q973M46o181j4763q220l645
8975D69464n380j4588p934n845l474n383N526J0144l6l166j0138p173n147M712
8961D21582N647j1566p335M612Q531J672K963l116q424q761j4522k272K002N11
8947C91524j85l331j956n495M126N969j537j975p869k143Q6j620q075K697J0024
8932C80240J25j242l954k844j062J00r35j6384j4131J658P800l335k834Q24O384
$$ plain form
8917 350410 348972 345042 340152 333661 323583 316278 315737 305089 295977 299548 292632 294898 301663 301546
8903 301546 296318 289628 285175 282712 279963 273776 266735 269841 274724 284031 281017 274780 266693 254608
8889 254608 256137 257873 259700 267307 261402 253218 252042 248651 250736 250236 246450 250037 245833 252234 258769
8874 258769 261128 266058 283136 280083 271552 266832 257925 263840 257083 255938 259482 271535 274058 270018
8860 270018 278437 295173 309104 331092 380517 433065 483964 497595 459128 396169 340402 301158
8848 301158 274878 254847 239815 228493 221757 214340 205660 207889 198482 186835 186399 179973 186292
8835 186292 192100 185306 177250 180130 185915 185229 185478 176447 176861 178751 173761 173756 178213 183840 190210 189801
8819 189801 191873 193497 192117 194221 185617 177663 167350 169619 175239 170643 157446 159036 169060 171811
$$ packed form
8917C50410j438l930m890o491j0078p305n41j0648r112L571o916K266O765j17
8903C01546n228o690m453k463k749o187p041L106M883R307l014o237q087j2085
8889B54608J529J736J827P607n905q184j176l391K085n00l786L587m204O401O535
8874B58769K359M930J7078l053q531m720q907N915o757j145L544J2053K523m040
8860B70018Q419J6736J3931K1988M9425N2548N0899J3631l8467o2959n5767l9244
8848C01158k6280k0031j5032j1322o736p417q680K229r407j1647m36o426O319
8835A86292N808o794q056K880N785o86K49r031M14J890m990nM457N627O370m09
8819A89801K072J624j380K104q604p954j0313K269N620m596j3197J590J0024K751
$$ plain form
8805 171811 169054 173927 171602 163264 160311 159102 166722 174862 178059 177875 180471 176348 168159 166414 159692
8790 159692 155841 166270 173873 179351 181789 189383 192818 198376 217209 237235 243425 241109 232293 218075
8776 218075 196854 190201 190757 182208 173866 167731 168489 166827 164220 164989 167522 170694 165148 158028 150740
8761 150740 155357 160326 163938 163774 160006 163112 168327 167555 162375 160384 164347 168468 171964 182260 188507
8746 188507 177935 178698 169565 153606 147382 146276 140043 135336 135701 137658 142273 142969 136897 139030 137251
8731 137251 141784 138667 129063 121483 117681 115358 124219 130702 130381 130881 130663 140885 146233 147593 136575
8716 136575 130595 137586 142820 152709 151403 147925 148065 146854 151781 146126 133137 126889 134055 134825 126004
8701 126004 129909 142840 139442 130558 132649 127417 139424 141893 139719 143589 146335 156232 162853 161782
$$ packed form
8805A71811k757M873k325q338k953j209P620Q140L197j84K596m123q189j745o722
8790A59692l851J0429P603N478K438P594L435N558J8833K0026O190k316q816j4218
8776B18075k1221o653N56q549q342o135P58j662k607P69K533L172n546p120p288
8761A50740M617M969L612j64l768L106N215p72n180j991L963M121L496J0296O247
8746A88507j0572P63r133j5959o224j106o233m707L65J957M615O96o072K133j779
8731A37251M533l117r604p580l802k323Q861O483l21N00k18J0222N348J360j1018
8716A36575n980O991N234R889j306l478J40j211M927n655j2989o248P166P70q821
8701A26004L905J2931l398q884K091n232J2007K469k174L870K746R897O621j071
$$ plain form
8687 161782 159606 163231 170195 176447 170886 170934 168753 177537 182657 186995 198172 204402 211659 220497 220808
8672 220808 231780 241155 238442 235071 216494 211833 194850 180695 175308 178720 188862 185174 189328
8659 189328 192775 195344 204225 207911 206449 211650 211117 221592 223750 231101 252634 274949 303740 329606
8645 329606 363943 398001 440673 496966 548707 592807 630830 658824 669162 639993 587742 523566
8633 523566 463648 411002 357317 313003 270986 236347 216126 203642 185302 175793 168287 162912
8621 162912 158417 151640 152833 152317 161524 169883 164196 148591 140124 141661 143201 137143 139574 131848
8607 131848 118703 117923 126259 132899 133853 134587 139827 142306 138665 142280 153937 164103 168641 159643
8593 159643 150758 150958 166072 171759 167909 161105 157064 153365 148265 146366 141116 151721 174927 181503
$$ packed form
8687A61782k176L625O964O252n561M8k181Q784N120M338J1177O230P257Q838L11
8672B20808J0972R375k713l371j8577m661j6983j4155n387L412J0142l688M154
8659A89328L447K569Q881L686j462N201n33J0475K158P351K1533K2315K8791K5866
8645C29606L4337L4058M2672N6293N1741M4100L8023K7994J0338k9169n2251o4176
8633E23566n9918n2646n3685m4314m2017l4639k0221j2484j8340r509p506n375
8621A62912m495o777J193n16R207Q359n687j5605q467J537J540o058K431p726
8607A31848j3145p80Q336O640R54P34N240K479l641L615J1657J0166M538q998
8593A59643q885K00J5114N687l850o804m041l699n100j899n250J0605K3206O576
$$ plain form
8579 181503 177616 176512 162490 147613 147732 150400 154575 159633 155807 162072 166659 158360 140346 126051
8565 126051 130679 132343 125396 123466 116455 121312 133647 155423 158749 153868 144817 132138 124606 113414
8551 113414 107759 103859 91276 87664 87054 86481 81350 83868 87032 87880 100300 99529 97323 91714 88475
8536 88475 92427 97956 102199 99499 87770 82586 80654 81655 87894 95374 110125 121663 123007 116951
8522 116951 110924 112594 120242 106134 103780 104316 102548 100958 94408 93212 88339 85771 86900 102039
8508 102039 111405 107818 109912 105652 105660 115797 107740 106021 107880 106089 109458 110847 109828 111968 116190
8493 116190 116863 121797 125528 122506 123727 133162 137228 142607 139401 135266 135767 123600 103423 101947
8479 101947 104448 106288 101537 100927 101618 103017 92745 80357 82139 83694 80512 73314 71948 77344
$$ packed form
8579A81503l887j104j4022j4877J19K668M175N058l826O265M587q299j8014j4295
8565A26051M628J664o947j930p011M857J2335K1776L326m881r051j2679p532j1192
8551A13414n655l900j2583l612o10n73n131K518L164Q48J2420p71k206n609l239
8536H8475L952N529M243k700j1729n184j932J001O239P480J4751J1538J344o056
8522A16951o027J670P648j4108k354N36j768j590o550j196m873k568J129J5139
8508A02039R366l587K094m260QJ0137q057j719J859j791L369J389j019K140M222
8493A16190O73M934L731l022J221R435M066N379l206m135N01j2167k0177j476
8479A01947K501J840m751o10O91J399j0272j2388J782J555l182p198j366N396
$$ plain form
8465 77344 84048 89281 88202 84118 72067 67955 72175 70756 82351 88416 88584 85278 89898 100930
8451 100930 102691 94159 89362 92064 96410 91582 90220 92133 96503 112302 122294 131848 134305 134897
8437 134897 147468 154420 159612 172408 183745 191506 192933 189061 185139 179047 166181 153838 131642
8424 131642 131739 129989 130891 134587 132245 124753 116902 98814 96780 99238 102222 110758 107211 94582 89178
8409 89178 82522 82108 86631 87762 88541 97017 88319 78097 79414 87200 79914 87482 98640 94700 99317
8394 99317 106668 114269 129831 140210 156118 187278 228497 288223 370900 474439 517157 478401
8382 478401 393093 312244 257604 222703 204237 191610 180740 185861 192236 194275 194001 188095 176579
8369 176579 174962 165658 150770 140103 130153 122510 118358 105337 103659 103617 112527 114174 106842 106444
$$ packed form
8465G7344O704N233j079m084j2051m112M220j419J1595O065J68l306M620J1032
8451A00930J761q532m797K702M346m828j362J913M370J5799R992R554K457N92
8437A34897J2571O952N192J2796J1337P761J427l872l922o092j2866j2343k2196
8424A31642R7j750R02L696k342p492p851j8088k034K458K984Q536l547j2629n404
8409H9178o656m14M523J131P79Q476q698j0222J317P786p286P568J1158l940M617
8394I9317P351P601J5562J0379J5908L1160M1219N9726Q2677J03539M2718l8756
8382D78401q5308q0849n4640l4901j8466j2627j0870N121O375K039k74n906j1516
8369A76579j617r304j4888j0667r950p643m152j3021j678m2Q910J647p332l98
$$ plain form
8355 106444 114985 119354 116870 116150 126082 146612 184320 233174 293657 390600 467093 466231 408163
8342 408163 327547 246306 188426 140756 106864 91259 84596 81788 85297 80689 70319 72873 71414
8329 71414 70181 69383 66985 65322 55598 50238 51727 48466 45044 45899 51151 55299 53492 52953 51015
8314 51015 50884 49364 54790 54291 48775 50524 48248 37032 34862 28921 26459 26534 23674 24436 30852 36668
8298 36668 35844 47039 51755 52415 43732 33337 24396 18367 23551 30198 34249 45775 42635 40405
8284 40405 41875 34907 25759 22562 16542 17663 28665 28485 25792 18867 13900 15880 18379 28108 31882
8269 31882 28744 25553 22958 19650 22189 19254 22807 30446 30256 24404 17224 14769 11269 8947 8135
8254 8135 3520 6015 22443 29976 30575 24697 21681 21388 27043 33683 38419 39551 38865 37239 37379 30303
$$ packed form
8355A06444Q541M369k484p20R932K0530L7708M8854O0483R6943P6493q62n8068
8342D08163q0616q1241n7880m7670l3892j5605o663k808L509m608j0370K554j459
8329G1414j233p98k398j663r724n360J489l261l422Q55N252M148j807n39j938
8314E1015j31j520N426m99n516J749k276j1216k170n941k462P5k860P62O416N816
8298C6668q24J1195M716O60q683j0395q941o029N184O647M051J1526l140k230
8284D0405J470o968r148l197o020J121J1002j80k693o925m967J980K499R729L774
8269C1882l138l191k595l308K539k935L553P639j90n852p180k455l500k322q12
8254H135m615K495J6428P533N99n878l016k93N655O640M736J132o86j626J40p076
$$ plain form
8238 30303 33765 33449 30067 33980 31827 30914 31116 31459 35184 35183 27378 19377 12310 12605 23591 19649
8222 19649 14701 17817 22116 22556 19451 18029 21431 25292 24235 24605 29199 27768 31668 32755 33220
8207 33220 36155 32245 24240 29081 27441 20693 14860 18734 27477 28651 30529 30974 25390 25304 25479 24911
8191 24911 18992 17466 12515 11993 18638 19197 18104 18742 26346 30872 37381 36778 34226 29233 18941
8176 18941 10875 12095 15038 20958 15444 13572 26821 21168 14995 13564 13598 19403 25051 17477 14951
8161 14951 16270 23090 31267 28607 25879 30983 30018 34367 24037 16650 19966 14569 5481 3425 14245
8146 14245 23969 24188 19223 20634 21382 16198 18911 18156 15276 6933 3295 8893 15275 25213 25086 34876
8130 34876 33419 27539 31256 46882 52051 56019 54343 40263 30405 26893 27573 33212 35865 15917
$$ packed form
8238C0303L462l16l382L913k153r13K02L43L725jp805q001p067K95J0986l942
8222A9649m948L116M299M40l105j422L402L861j057L70M594j431L900J087M65
8207C3220K935l910q005M841j640o748n833L874Q743J174J878M45n584q6J75n68
8191B4911n919j526m951n22O645N59j093O38P604M526O509o03k552m993j0292
8176A8941q066J220K943N920n514j872J3249n653o173j431L4N805N648p574k526
8161A4951J319O820Q177k660k728N104r65M349j0330p387L316n397r088k056J0820
8146A4245R724K19m965J411P48n184K713p55k880q343l638N598O382R938j27R790
8130C4876j457n880L717J5626N169L968j676j4080r858l512O80N639K653j9948
$$ plain form
8116 15917 1874 -5681 4031 12638 3331 3634 12279 8314 2652 6270 12166 13772 18928 19999 20843
8101 20843 19750 18821 26278 28771 20224 14368 12366 6510 12268 9752 9931 19830 25320 34825 25689
8086 25689 19843 19337 23759 25074 25831 17865 13872 21923 29365 28470 23537 18951 18953 13839 18199 21261
8070 21261 15232 10001 13275 17933 9689 11316 18428 14570 17087 27327 29337 29167 29007 17731 24177
8055 24177 29184 24194 21623 24917 31950 45511 49241 45875 50400 47488 40016 27685 33903 37247
8041 37247 38206 45951 38318 28883 30336 41486 45410 38194 29587 25301 25109 22619 24234 22937 23328
8026 23328 24496 19733 15765 17311 29243 30906 39675 43786 38085 38315 39201 29455 30942 33463 40714
8011 40714 36134 32365 37933 42325 37575 37903 43804 43359 44678 41727 36081 31268 27036 24698 20673
$$ packed form
8116A5917j4043p555R712Q607r307L03Q645l965n662L618N896J606N156J071Q44
8101B0843j093r29P457K493q547n856k002n856N758k516J79R899N490R505r136
8086B5689n846n06M422J315P57p966l993Q051P442q95m933m586Kn114M360L062
8070B1261o029n231L274M658q244J627P112l858K517J0240K010j70j60j1276O446
8055B4177N007m990k571L294P033J3561L730l366M525k912p472j2331O218L344
8041C7247R59P745p633r435J453J1150L924p216q607m286j92k490J615j297L91
8026B3328J168m763l968J546J1932J663Q769M111n701K30Q86r746J487K521P251
8011D0714m580l769N568M392m750L28N901m45J319k951n646m813m232k338m025
$$ plain form
7996 20673 26225 30395 29974 36863 38012 36174 37309 42360 50496 48487 41733 32826 37639 37702 39063
7981 39063 35363 25337 14932 17792 26046 33890 41353 43791 41161 37700 36526 40097 37486 36077
7967 36077 29214 31343 20173 22367 21998 15618 8419 12281 26165 27602 24558 25686 33958 29187
7953 29187 37581 47399 50371 41409 32075 31838 28789 36423 31201 25479 28281 26208 33272 34633 29281
7938 29281 20666 12072 13200 25225 32989 32118 40262 48591 43449 36816 31578 27238 17936 8890 8097
7923 8097 21798 33061 26742 21963 22122 25380 27170 23515 21486 21857 14830 9802 13043 18821 20335
7908 20335 27051 30428 35202 39521 34862 29344 29295 32964 29876 38864 44631 37158 34471 23903 25934
7893 25934 29778 35088 33752 25986 19177 17031 18044 21849 28400 23815 19593 21669 27510 21728 23922
$$ packed form
7996B0673N552M170m21O889J149j838J135N051Q136k009o754q907M813O3J361
7981C9063l700j0026j0405K860Q254P844P463K438k630l461j174L571k611j409
7967C6077o863K129j1170K194l69o380p199L862J3884J437l044J128Q272m771
7953B9187Q394R818K972q962r334k37l049P634n222n722K802k073P064J361n352
7938B9281q615q594J128J2025P764q71Q144Q329n142o633n238m340r302r046p93
7923H097J3701J1263o319m779J59L258J790l655k029L71p027n028L241N778J514
7908B0335O716L377M774M319m659n518m9L669l088Q988N767p473k687j0568K031
7893B5934L844N310j336p766o809k146J013L805O551m585m222K076N841n782K194
$$ plain form
7878 23922 28075 29859 25834 28430 25671 12360 8479 -2332 -5451 -10574 -1412 12148 19843 14538
7864 14538 10812 14059 11645 13885 13116 14294 19990 17878 25760 26414 18929 17321 16743 11561 11111 2598
7848 2598 7340 13953 20812 21252 14540 12388 7109 9973 15184 18715 24295 23201 9036 5301 23
7833 23 -3836 2229 11631 4427 4804 7690 1568 1694 -285 4340 8502 1987 936 -9095 -11152 1919
7817 1919 12762 16354 6501 3523 -1183 6393 9823 14641 13717 15484 5792 11552 19376 22154 21835
7802 21835 19165 11850 11470 12717 8239 782 -13053 -8838 4128 4843 3173 3097 7167 18850 18332
7787 18332 21021 21014 7747 3314 -302 -2203 5884 10995 10436 11697 9365 3010 3468 -1804 5535 15732
7771 15732 23502 21181 18483 16990 17157 7088 9945 13345 6122 1770 2236 2311 971 1903 -1021 5612
$$ packed form
7878B3922M153J784m025K596k759j3311l881j0811l119n123R162J3560P695n305
7864A4538l726L247k414K240p69J178N696k112P882O54p485j608n78n182m50q513
7848B598M742O613O859M40o712k152n279K864N211L531N580j094j4165l735n278
7833B3l859O065R402p204L77K886o122J26j979M625M162o515j051j0031k057J3071
7817A919J0843L592r853k978m706P576L430M818r24J767r692N760P824K778l19
7802B1835k670p315l80J247m478p457j3835M215J2966P15j670p6M070J1683n18
7787A8332K689pj3267m433l616j901Q087N111n59J261k332o355M58n272P339J0197
7771A5732P770k321k698j493J67j0069K857L400p223m352M66P5j340R32k924O633
$$ plain form
7755 5612 18631 12814 5423 -4916 -9882 -2087 491 -349 -885 -3003 -9983 -12858 -4560 -5646 -5970
7740 -5970 -9072 -7192 -6977 -4551 4624 11357 -5041 -3086 -6611 -11365 -14753 -10757 -6081 -12542 -1125
7725 -1125 19586 22397 19689 3349 -5679 -10412 -12082 -4630 13194 23014 17668 15661 12417 14600
7711 14600 9757 7613 4917 14185 11772 -2095 -10262 -4262 3326 1961 -6628 -11250 -3999 -1549
7697 -1549 -1159 -1851 6359 -1861 -4839 -1425 -7766 -3960 -2465 321 3940 7148 4692 -1465 -1979 -2741
7681 -2741 -2926 -884 4532 724 -6025 -2387 4711 4868 -2290 -8383 -3010 -4118 -4708 -10657 -7711 -4997
7665 -4997 -4929 -8095 -943 833 -7602 -1931 -3351 1462 -5081 -936 8550 2031 1642 2580 2148 9345
7649 9345 11558 5300 -429 -4309 -8589 2938 -216 2985 -247 -4288 -5254 -12237 -8181 -1515 2271
$$ packed form
7755E612J3019n817p391j0339m966P795K578q40n36k118o980k875Q298j086l24
7740e970l102J880K15K426R175O733j6398J955l525m754l388L996M676o461J1417
7725a125K0711K811k708j6340r028m733j670P452J7824R820n346k007l244K183
7711A4600m843k144k696R268k413j3867q167O000P588j365q589m622P251K450
7697a549L90o92Q210q220k978L414o341L806J495K786L619L208k456o157n14p62
7681b741j85K042N416l808o749L638P098J57p158o093N373j108n90n949K946K714
7665d997O8l166P152J776q435N671j420M813o543M145R486o519l89R38m32P197
7649I345K213o258n729l880m280J1527l154L201l232m041r66o983M056O666L786
$$ plain form
7634 2271 2502 -1425 2939 4574 -232 -11490 -17907 -12325 -717 783 -10141 -21266 -23639 -20279
7620 -20279 -19775 -22959 -20466 -14344 -7155 -926 3949 621 3323 -5154 -6022 -2433 -2896 -5776 -3681
7605 -3681 2614 9579 9461 -3751 -12729 -14243 -20334 -15340 -12238 -14044 -8874 -9282 -11094 -11283 -1379
7590 -1379 5729 -933 -3133 -7839 -17142 -22705 -12594 -4172 -7507 -4443 -9645 -16901 -16291 -16338 -16423 -20836
7574 -20836 -15093 -12757 -4859 2282 -2766 -2737 -2397 -15539 -8616 15177 17809 30620 36211 17290
7560 17290 -2317 -5340 -2909 9132 17393 16047 12252 6392 5153 8767 12695 5635 6658 -383
7546 -383 1880 -5910 -22128 -26760 -38735 -39228 -26056 -16170 -6159 -2603 2490 -1050 -1852 1626 6294
7531 6294 10028 12786 11680 937 5572 14242 13002 8614 5798 16093 12475 10167 6782 1004
$$ packed form
7634B271K31l927M364J635m806j1258o417N582J1608J500j0924j1125k373L360
7620b0279N04l184K493O122P189O229M875l328K702q477q68L589m63k880K095
7605c681O295O965j18j3212q978j514o091M994L102j806N170m08j812j89R904
7590a379P108o662k200m706r303n563J0111Q422l335L064n202p256O10m7q5m413
7574b0836N743K336P898P141n048K9L40j3142O923K3793K632J2811N591j8921
7560A7290j9607l023K431J2041Q261j346l795n860j239L614L928p060J023p041
7546c83K263p790j6218m632j1975m93J3172R886J0011L556N093l540q02L478M668
7531F294L734K758j106j0743M635Q670j240m388k816J0295l618k308l385n778
$$ plain form
7517 1004 -6405 6094 7363 -12046 -25905 -25768 -22150 -18647 -10679 -8258 -17962 -24278 -25341 -20558
7503 -20558 -14137 -13684 -15879 -11107 -15497 -10089 -8683 -651 8965 8512 11561 8567 2089 -3329 -11648
7488 -11648 -13369 -4577 -3883 -5186 -18262 -17791 -8149 -7512 -5118 -8768 -3680 1432 -5116 -2046 5055
7473 5055 7527 2791 -3462 -17734 -21263 -8941 3296 4732 1423 -319 -8204 -12286 -12347 -7606 -6452
7458 -6452 -9867 -14437 -2748 -5447 -9227 -8622 -10728 -9992 -8786 -459 2054 4601 1456 -6056 -6770
7443 -6770 -11391 -6013 -13304 -3808 484 -3293 -5055 -11929 -10335 1881 6220 2380 2480 -1211 6098
7428 6098 12127 7022 12352 12092 6863 3840 5342 2403 -4902 -10560 -6528 -4233 693 8275 10244
7413 10244 21837 21334 13347 10466 11228 9088 4498 -1872 271 4525 12990 12952 -63 -6115 -5241
$$ packed form
7517A004p409J2499J269j9409j3859J37L618L503P968K421r704o316j063M783
7503b0558O421M53k195M772m390N408J406Q032R616m53L049k994o478n418q319
7488a1648j721Q792O94j303j3076M71R642O37K394l650N088N112o548L070P101
7473E055K472m736o253j4272l529J2322J2237J436l309j742p885m082o1M741J154
7458f452l415m570J1689k699l780O05k106P36J206Q327K513K547l145p512p14
7443f770m621N378p291R496M292l777j762o874J594J2216M339l840J00l691P309
7428F098O029n105N330k60n229l023J502k939p305n658M032K295M926P582J969
7413A0244J1593n03p987k881P62k140m590o370K143M254Q465l8j3015o052Q74
$$ plain form
7398 -5241 -2709 1727 -151 -11241 -4294 -4898 -5730 -8070 -15471 -12268 -3833 2682 6253 5302 -459
7383 -459 -5265 -1407 1660 -2499 -8028 -6782 1460 -7901 -11071 -20712 -20007 -18319 -13519 -4712 -1622
7368 -1622 2086 1527 2669 1282 4832 75 2029 8408 17293 23977 15837 9448 -73 2220 -173
7353 -173 -7979 -12389 -15097 -11750 -1915 6758 -2098 9576 7359 13576 24092 20038 9281 -10516
7339 -10516 -18410 -17387 -9822 -1188 8403 9738 11669 3819 5666 -7384 -12911 -8476 -5429 -3876
7325 -3876 3096 1683 -5141 -5225 -3962 -2834 5215 -5446 -14553 -23817 -19740 -12849 -4449 8201 14632
7310 14632 1015 -7749 2763 8754 14762 6431 -4365 -5475 3681 -3191 -14487 -16169 -13301 -6214
7296 -6214 290 1170 -5578 -8652 -8955 -14973 -21166 -22062 -17343 -15402 -16370 -11034 -6317 -5704 -6554 -2843
$$ packed form
7398e241K532M436j878j1090O947o04q32k340p401L203Q435O515L571r51n761
7383d59m806L858L067m159n529J246Q242r361l170r641P05J688M800Q807L090
7368a622L708n59J142j387L550m757J954O379Q885O684q140o389r521K293k393
7353a73p806m410k708L347R835Q673q856J1674k217O217J0516m054j0757j9797
7339a0516p894J023P565Q634R591J335J931p850J847j3050n527M435L047J553
7325c876O972j413o824q4J263J128Q049j0661r107r264M077O891Q400J2650O431
7310A4632j3617q764J0512N991O008q331j0796j110R156o872j1296j682K868P087
7296f214O504Q80o748l074l03o018o193q96M719J941r68N336M717O13q50L711
$$ plain form
7280 -2843 -2622 -8610 -301 2459 -1394 -1172 12725 18620 13542 8152 -1637 -9837 -12809 -21719 -17009
7265 -17009 -5804 4051 7764 2064 -8077 -12361 -20323 -7346 -2744 -9 82 779 7462 5392 -1557
7250 -1557 571 -1815 -12686 -14591 -8351 -7619 -1654 773 -3666 -2387 -732 3727 -1451 -4549 -10063
7235 -10063 -6600 -1167 -7352 -7677 -6940 -12136 -8866 4980 10345 -3545 -15334 -24743 -26623 -23310
7221 -23310 -23169 -19331 -12280 -8020 779 7248 -3327 -7547 6545 18228 2379 -13476 -16578 -7356
7207 -7356 -6632 -6029 -4184 -6431 -9291 -17 2428 -8246 -8821 14 3639 1023 -1925 -584 7369
7192 7369 2624 6514 6031 13666 11577 1807 -1772 -4674 -15655 -14745 -17009 -22691 -18071 -13467 -12864
7177 -12864 -14491 -6723 -6322 -3674 -825 -6420 -12022 -661 -972 -2907 -14008 -18550 -19039 -19960 -21254
$$ packed form
7280b843K21n988Q309K760l853K22J3897N895n078n390r789q200k972q910M710
7265a7009J1205R855L713n700j0141m284p962J2977M602K735R1O97O683k070o949
7250a557K128k386j0871j905O240P32N965K427m439J279J655M459n178l098n514
7235a0063L463N433o185l25P37n196L270J3846N365j3890j1789r409j880L313
7221b3310J41L838P051M260Q799O469j0575m220J4092J1683j5849j5855l102R222
7207g356P24O03J845k247k860R274K445j0674n75Q835L625k616k948J341P953
7192G369m745L890m83P635k089r770l579k902j0981R10k264n682M620M604O03
7177a2864j627P768M01K648K849n595n602J1361l11j935j1101m542m89r21j294
$$ plain form
7162 -21254 -16313 -15343 -7218 -1540 4748 585 335 303 -1373 -8689 -11343 -5371 661 -8353 -18924
7147 -18924 -23274 -14826 -3025 -5604 -1268 -3879 -6259 -4307 -11522 -18104 -17230 -14745 -9787 -19780 -22844
7132 -22844 -15246 -10004 -12411 -13633 -7282 4095 4336 2918 6585 9769 8608 -2105 -8465 -8863 1799
7117 1799 2432 -6989 -17160 -13426 -15183 -16905 -12044 -9479 -5652 -6544 -12333 -11015 5150 11974 9569
7102 9569 2687 1215 -2129 -7780 -4506 2926 2597 -1241 -9015 -9127 -9336 -3922 -4065 -9573 -11895 -13554
7086 -13554 -17195 -10174 -12368 -19460 -16171 -16699 -17875 -19722 -23467 -29605 -35775 -33219 -16474 -2326
7072 -2326 6816 5683 -1023 -6373 -5366 -6578 -4836 -12963 -25071 -32814 -30948 -22220 -13352 -14986 -10952
7057 -10952 -705 2753 4900 3213 578 3249 7767 -6920 -22883 -20307 -10414 -252 -2484 -6069
$$ packed form
7162b1254M941R70Q125N678O288m163k50l2j676p316k654N972O032r014j0571
7147a8924m350Q448J1801k579M336k611k380J952p215o582Q74K485M958r993l064
7132b2844P598N242k407j222O351J1377K41j418L667L184j161j0713o360l98J0662
7117A799O33r421j0171L734j757j722M861K565L827q92n789J318J6165O824k405
7102I569o882j472l344n651L274P432l29l838p774j12k09N414j43n508k322j659
7086a3554l641P021k194p092L289n28j176j847l745o138o170K556J6745J4148
7072b326R142j133o706n350J007j212J742q127j2108p743J866Q728Q868j634M034
7057a0952J0247L458K147j687k635K671M518j4687j5963K576R893J0162k232l585
$$ plain form
7043 -6069 -8888 -775 7155 9760 2946 -4665 5933 3128 -3385 2658 945 -6091 -490 4540 -10210
7028 -10210 -17132 -15715 -18455 -14351 -9888 -13759 -11036 -9462 -9062 -8455 1503 3133 -5427 -16537 -16154
7013 -16154 -8752 4951 7201 6848 889 4566 7827 4871 4458 -4899 -11064 -2027 4200 5580 503
6998 503 5518 5684 4941 3468 12677 2213 -2744 -3672 -4680 907 3054 960 -3148 -8636 -18939
6983 -18939 -18683 -8105 -2225 -6265 -16127 -14633 -15698 -17444 -19567 -3015 8836 10387 4579 -4898
6969 -4898 -7649 -6171 -1703 795 1187 6092 6263 9577 7553 1527 -3727 -8454 -7876 -4707 -4271 2444
6953 2444 6627 3823 1304 -899 2343 -4993 -6615 -6816 -11201 -4407 701 4576 15539 20479 6224
6938 6224 1513 6563 5771 3408 7329 10488 11633 3522 5106 2204 3543 8194 4109 -6550 -5203
$$ packed form
7043f069k819Q113P930K605o814p611J0598k805o513O043j713p036N601N030j4750
7028a0210o922J417k740M104M463l871K723J574M00O07R958J630q560j1110L83
7013a6154P402J3703K250l53n959L677L261k956m13r357o165R037O227J380n077
6998E03N015J66p43j473R209j0464m957r28j008N587K147k094m108n488j0303
6983a8939K56J0578N880m040r862J494j065j746k123J6552J1851J551n808r477
6969d898k751J478M468K498L92M905J71L314k024o026n254m727N78L169M36O715
6953B444M183k804k519k203L242p336j622k01m385O794N108L875J0963M940j4255
6938F224m711N050p92k363L921L159J145q111J584k902J339M651m085j0659J347
$$ plain form
6923 -5203 -3901 -614 6547 7646 -5261 -10586 1106 6516 2273 -2357 -1430 -7269 -12159 -5737 -6802
6908 -6802 -12464 -11729 -13282 -23533 -17477 -12915 -12067 -14473 -11334 -17723 -22620 -22422 -12731 1550 11431
6893 11431 15771 16524 15254 10348 -519 -9148 -3979 -6640 -8228 3338 8509 10290 -2952 -4505
6879 -4505 7874 4480 -10751 -21210 -13914 -12384 -6839 -5540 -11329 -8424 -5812 -6524 -10599 -2069
6865 -2069 8243 4330 -4059 -2009 533 -4222 -6391 -9332 -10483 -13724 -16394 -21677 -18393 -8074
6851 -8074 73 -1958 -15439 -11374 2988 2498 1545 7446 12887 11198 14271 4758 -2583 -4348 -11448
6836 -11448 -12825 -19551 -22114 -17512 -10034 -4483 2191 3165 1696 6822 15691 9554 8170 4342 -1442
6821 -1442 4534 791 -10940 -13106 -5547 -9253 -10426 -10748 -2539 -7330 -4769 1452 3266 9212 4847
$$ packed form
6923e203J302L287P161J099j2907n325J1692N410m243m630R27n839m890O422j065
6908f802n662P35j553j0251O056M562Q48k406L139o389m897J98R691J4281R881
6893A1431M340P53j270m906j0867q629N169k661j588J1566N171J781j3242j553
6879d505J2379l394j5231j0459P296J530N545J299n789K905K612p12m075Q530
6865b069J0312l913q389K050K542m755k169k941j151l241k670n283L284J0319
6851h074Q147k031j3481M065J4362m90r53N901N441j689L073r513p341j765p100
6836a1448j377o726k563M602P478N551O674R74j469N126Q869o137j384l828n784
6821a442N976l743j1731k166P559l706j173l22Q209m791K561O221J814N946m365
$$ plain form
6806 4847 456 1251 -312 -2764 2905 10174 13345 13426 6065 -887 -3507 148 -9084 -13254 -4447 2936
6790 2936 -260 -11850 -12302 -2814 7767 1810 -1114 922 -1592 -10325 -18097 -20663 -21698 -12732 -5093
6775 -5093 -7820 -3502 12267 20666 18591 13023 7566 5591 384 -3163 -11682 -5234 -352 6923 4880
6760 4880 6456 2527 -4981 2436 -7717 -12038 -11494 -12190 -6220 -4801 -9608 -16203 -1168 10408 9565
6745 9565 14257 2733 -11735 -12194 -4848 -2153 1274 -3260 -4935 -5842 -8710 -8214 -6902 -5220 -1628
6730 -1628 -2441 3312 -122 337 2692 -604 -1553 -1509 -1971 -18971 -21402 -21096 -16135 -7382 -7040 -7502 -4779
6713 -4779 -3987 -1976 6768 9913 3712 610 8060 7575 -1120 -282 3102 740 -15339 -19709 -16707
6698 -16707 -16911 -7918 -7756 -13072 -9845 2509 11268 6218 -2905 -3687 -14049 -19687 -4640 9089
$$ packed form
6806D847m391P95j563k452N669P269L171Q1p361o952k620L655r232m170Q807P383
6790B936l196j1590m52R488J0581n957k924K036k514q733p772k566j035Q966P639
6775e093k727M318J5769Q399k075n568n457j975n207l547q519O448M882P275k043
6760D880J576l929p508P417j0153m321N44o96N970J419m807o595J5035J1576q43
6745I565M692j1524j4468m59P346K695L427m534j675r07k868M96J312J682L592
6730a628q13N753l434M59K355l296r49M4m62j7000k431L06M961Q753L42m62K723
6713d779P92K011Q744L145o201l102P450m85q695Q38L384k362j6079m370L002
6698a6707k04Q993J62n316L227J2354Q759n050r123p82j0362n638J5047J3729
$$ plain form
6684 9089 12822 13198 11611 -7953 -11773 -1551 5895 7781 -3073 57 2339 -597 -263 -17964
6670 -17964 -23744 -20570 -19360 -10556 -23 3208 7310 7355 6524 6795 -2206 -5106 2690 -10946 -22787
6655 -22787 -25995 -13694 -10070 -11815 -14971 -13503 -12783 -10891 220 929 -2321 -12526 -26139 -23682
$$ packed form
6684I089L733L76j587j9564l820J0222P446J886j0854L130K282k936L34j7701
6670a7964n780L174J210Q804J0533L231M102M5q31K71r001k900P796j3636j1841
6655b2787l208J2301L624j745l156J468P20J892J1111P09l250j0205j3613K457
$$ [...]
##END NTUPLES=NMR SPECTRUM
##END=
