##TITLE=Analysis number 327177
Compound Code cc 23609
Project Code adrs
Chemist Name endeavour
##JCAMPDX= 6.0         $$ Bruker NMR JCAMP-DX V2.0
##DATA TYPE= NMR SPECTRUM
##DATA CLASS= NTUPLES
##ORIGIN= Bruker BioSpin GmbH
##OWNER= nmr
$$ XWIN-NMR		Version 3.5
$$ Tue Mar 13 14:07:41 2007 GMT Standard Time (UT+0h)  MAYBRIDGE\nmr@NMR_250MHZ
##.OBSERVE FREQUENCY= 250.131544655141
##.OBSERVE NUCLEUS= ^1H
##.ACQUISITION MODE= SIMULTANEOUS (DQD)
##.ACQUISITION SCHEME= undefined
##.AVERAGES= 16
##.DIGITISER RES= 18
##SPECTROMETER/DATA SYSTEM= dpx250
##.PULSE SEQUENCE= zg30
##.SOLVENT NAME= CDCl3
##.SHIFT REFERENCE= (INTERNAL, CDCl3, 0, 16.4562)
##AUDIT TRAIL= $$ (NUMBER, WHEN, WHO, WHERE, WHAT)
$$ ##TITLE= Audit trail, XWIN-NMR		Version 3.5
$$ ##JCAMPDX= 5.01
$$ ##ORIGIN= Bruker BioSpin GmbH
$$ ##OWNER= nmr
$$ C:\u/data/dgb/nmr/ADRS/820/pdata/1/auditp.txt
$$ ##AUDIT TRAIL=  $$ (NUMBER, WHEN, WHO, WHERE, WHAT)
(   1,<2007-03-13 14:07:22.26 +000>,<MAYBRIDGE\nmr>,<NMR_250MHZ>,
      <created by zg, POWCHK disabled, PULCHK disabled
       configuration hash MD5:
       49 4B E0 1D 92 C2 6B 37 9F E6 65 BC 52 41 86 1D
       data hash MD5: 64K
       6F E5 FD B8 34 A6 E8 B3 67 AB B0 2D 92 D0 A6 ED>)
(   2,<2007-03-13 14:07:33.28 +000>,<MAYBRIDGE\nmr>,<NMR_250MHZ>,
      <Start of raw data processing
       ef LB = 0.3 FT_mod = 6 PKNL = 1 SI = 32K 
       data hash MD5: 32K
       A1 6D 93 E5 94 0F 9A B8 63 95 BB 69 4C 20 25 6E>)
(   3,<2007-03-13 14:07:35.00 +000>,<MAYBRIDGE\nmr>,<NMR_250MHZ>,
      <apk 
       data hash MD5: 32K
       06 5E 39 5C BA 3D 93 35 BE B9 A3 17 B2 A9 97 CA>)
(   4,<2007-03-13 14:07:35.67 +000>,<MAYBRIDGE\nmr>,<NMR_250MHZ>,
      <abs ABSG = 5 
       data hash MD5: 32K
       2B 2A 90 50 A2 3D FF F4 BA C3 F5 D6 CE 9D 58 F1>)
$$ ##END=
$$ 
$$ hash MD5
$$ 28 9C 1B BE A7 BD 40 91 88 55 7F CB 17 86 5F F3
##$RELAX= 
##$RELAX= 
##$RELAX= 
##$RELAX= 
##$RELAX= 
##$RELAX= 
##$RELAX= 
$$ Bruker specific parameters
$$ --------------------------
##$DU= <C:\u>
##$EXPNO= 820
##$NAME= <ADRS>
##$PROCNO= 1
##$TYPE= <nmr>
##$USER= <dgb>
##$AMP= (0..31)
100 100 100 100 100 100 100 100 100 100 100 100 100 100 100 100 100 100 
100 100 100 100 100 100 100 100 100 100 100 100 100 100 
##$AQSEQ= 0
##$AQ_mod= 3
##$AUNM= <au_zg>
##$AUTOPOS= <31 >
##$BF1= 250.13
##$BF2= 250.13
##$BF3= 250.13
##$BF4= 250.13
##$BF5= 500.13
##$BF6= 500.13
##$BF7= 500.13
##$BF8= 500.13
##$BYTORDA= 1
##$CFDGTYP= 0
##$CFRGTYP= 5
##$CHEMSTR= <none>
##$CNST= (0..31)
1 1 145 1 1 1 1 1 1 1 1 1 1 1 1 1 1 1 1 1 1 1 1 1 1 1 1 1 1 1 1 1 
##$CPDPRG= <>
##$CPDPRG1= <>
##$CPDPRG2= <>
##$CPDPRG3= <>
##$CPDPRG4= <mlev>
##$CPDPRG5= <mlev>
##$CPDPRG6= <mlev>
##$CPDPRG7= <mlev>
##$CPDPRG8= <mlev>
##$CPDPRGB= <>
##$CPDPRGT= <>
##$D= (0..31)
0 1 0 0 0 0 0 0 0 0.06 0 0 0 0 0 0 0.0002 0 0 0 0 0 0 0 0 0 0 0 0 0 0 
0 
##$DATE= 1173794841
##$DBL= (0..7)
120 120 120 120 120 120 120 120 
##$DBP= (0..7)
150 150 150 150 150 150 150 150 
##$DBP07= 0
##$DBPNAM0= <>
##$DBPNAM1= <>
##$DBPNAM2= <>
$$ [...]
##$SUBNAM7= <"">
##$SUBNAM8= <"">
##$SUBNAM9= <"">
##$SW= 20.6930455092707
##$SWIBOX= (0..15)
0 0 3 0 0 0 0 0 0 0 0 0 0 0 0 0 
##$SW_h= 5175.983436853
##$TD= 65536
##$TD0= 1
##$TE= 683.16
##$TE2= 300
##$TE3= 300
##$TEG= 300
##$TL= (0..7)
0 120 120 120 120 120 120 120 
##$TP= (0..7)
150 150 150 150 150 150 150 150 
##$TP07= 0
##$TPNAME0= <>
##$TPNAME1= <>
##$TPNAME2= <>
##$TPNAME3= <>
##$TPNAME4= <>
##$TPNAME5= <>
##$TPNAME6= <>
##$TPNAME7= <>
##$TPOAL= (0..7)
0.5 0.5 0.5 0.5 0.5 0.5 0.5 0.5 
##$TPOFFS= (0..7)
0 0 0 0 0 0 0 0 
##$TUNHIN= 0
##$TUNHOUT= 0
##$TUNXOUT= 0
##$USERA1= <user>
##$USERA2= <user>
##$USERA3= <user>
##$USERA4= <user>
##$USERA5= <user>
##$V9= 5
##$VALIST= <valist>
##$VCLIST= <CCCCCCCCCCCCCCC>
##$VD= 0
##$VDLIST= <DDDDDDDDDDDDDDD>
##$VPLIST= <PPPPPPPPPPPPPPP>
##$VTLIST= <TTTTTTTTTTTTTTT>
##$WBST= 1024
##$WBSW= 4
##$XGAIN= (0..3)
0 0 0 0 
##$XL= 0
##$YL= 0
##$YMAX_a= 284806
##$YMIN_a= -387336
##$ZGOPTNS= <>
##$ZL1= 120
##$ZL2= 120
##$ZL3= 120
##$ZL4= 120
##$ABSF1= 16.45619
##$ABSF2= -4.236982
##$ABSG= 5
##$ABSL= 3
##$ALPHA= 0
##$AQORDER= 0
##$ASSFAC= 0
##$ASSFACI= 0
##$ASSFACX= 0
##$ASSWID= 0
##$AUNMP= <proc_1d>
##$AZFE= 0.1
##$AZFW= 0.1
##$BCFW= 0
##$BC_mod= 0
##$BYTORDP= 0
##$COROFFS= 0
##$CY= 12.5
##$DATMOD= 1
##$DC= 0
##$DFILT= <>
##$DTYPP= 0
##$F1P= 14.0000005364418
##$F2P= -0.99999901652339
##$FCOR= 0.5
##$FTSIZE= 32768
##$FT_mod= 6
##$GAMMA= 0
##$GB= 0
##$INTBC= 1
##$INTSCL= 1
##$ISEN= 128
##$LB= 0.3
##$LEV0= 0
##$LPBIN= 0
##$MAXI= 10000
##$MC2= 0
##$MEAN= 0
##$ME_mod= 0
##$MI= 0
##$NCOEF= 0
##$NC_proc= -3
##$NLEV= 6
##$NOISF1= 0
##$NOISF2= 0
##$NSP= 0
##$NTH_PI= 0
##$NZP= 0
##$OFFSET= 16.45619
##$PC= 1
##$PHC0= 233.2635
##$PHC1= 11.92822
##$PH_mod= 1
##$PKNL= yes
##$PPARMOD= 0
##$PSCAL= 4
##$PSIGN= 0
##$REVERSE= no
##$SF= 250.130016458882
##$SI= 32768
##$SIGF1= 0
##$SIGF2= 0
##$SINO= 400
##$SIOLD= 32768
##$SREGLST= <1H.CDCl3>
##$SSB= 0
##$STSI= 32768
##$STSR= 0
##$SW_p= 5175.98343685301
##$SYMM= 0
##$S_DEV= 0
##$TDeff= 65536
##$TDoff= 0
##$TI= <Analysis number 999999
Compound Code 99
Book Reference 9
Project Code 9>
##$TILT= no
##$TM1= 0
##$TM2= 0
##$TOPLEV= 0
##$USERP1= <user>
##$USERP2= <user>
##$USERP3= <user>
##$USERP4= <user>
##$USERP5= <user>
##$WDW= 1
##$XDIM= 32768
##$YMAX_p= 414820319
##$YMIN_p= -159933
$$ End of Bruker specific parameters
$$ ---------------------------------
##NTUPLES= NMR SPECTRUM
##VAR_NAME=  FREQUENCY,     SPECTRUM/REAL,   SPECTRUM/IMAG
##SYMBOL=    X,             R,               I
##VAR_TYPE=  INDEPENDENT,   DEPENDENT,       DEPENDENT
##VAR_FORM=  AFFN,          ASDF,            ASDF
##VAR_DIM=   32768,         32768,           32768
##UNITS=     HZ,            ARBITRARY UNITS, ARBITRARY UNITS
##FACTOR=    0.157963299565203, 1,           1
##FIRST=     4116.18710287793, 0,            0
##LAST=      -1059.79633397508, 0,           0
##MIN=       -1059.79633397508, -159933,     0
##MAX=       4116.18710287793, 414820319,    0
$$ Real data points
##PAGE= N=1
##DATA TABLE= (X++(R..R)), XYDATA
$$ [...]
18193B14038r242J9718L2319j7925k9966r220j4558j4482k2033J9243J609N880
18181A75381O169J3147M523J1460k5382J6190n956j0431l2622P15K6609j806K0872
18168A98869N726m4186r551J4989n215m0678K754M1225L6600L0690j4501j1177
18156B05545M2723J9739m1826l9202j5497J2567k2759L7873L1580M0163L3829
18145C04735Q904n099k7591l3563m907N785j8597J8500L7553J06087Q4546K5056
18133E01409K1997N4532K3784L2112O0309R5709L5207P6801J33435J06763P5993
18122A218051J95153K88650L06872M08706M28678N75968R30292J374101K035167
18113G761638L319202N617438R771563J7376673K9032841L0397270j4505417l6205837
$$ plain form
18193 214038 204796 224514 256833 238908 208942 199722 185164 170682 148649 167892 169501 175381
18181 175381 181550 194697 199220 210680 185298 201488 195532 185101 152479 153194 179803 177997 198869
18168 198869 204595 160409 150858 165847 160632 119954 122708 163933 200533 231223 216722 205545
18156 205545 248268 268007 226181 186979 171482 184049 161290 199163 230743 270906 304735
18145 304735 313639 308540 280949 247386 242479 248264 229667 248167 285720 391807 476353 501409
18133 501409 523406 577938 601722 633834 694143 789852 825059 901860 1035295 1142058 1218051
18122 1218051 1413204 1701854 2008726 2417432 2846110 3422078 4352370 5726471 7761638
18113 7761638 11080840 16698278 26469841 43846514 72879355 103276625 88771208 52565371
18105E2565371k1361689j0726851n984458l642797k380932j674948j220769r40401
18097D632526p57977n38168m15045l29246k34152k79803k82746j40645q5287j15233
18087A454224j32000j41288m4586l2882j2041K7002m6289L582K9810J3j8628j3398
18075A073519l3207l8436j9213k0978l177p897j6804j05289j06186m7989o2840
18064F11503m8842l0005l4448o4291r4218P117J1176j7537q131L25m4431l5249
18052B52969q56J448m1769J6003k4957p845J1745l0210m0288l5428O765K089j9014
18039I0652K3871L9131l1719J4601q348J586l298J0751K3936Q004k5312l2346
18027A11509O494J7653k6080l1066m9160n804N2695N7123K7938j4029N110l2039
$$ plain form
18105 52565371 31203682 20476831 14492373 10849576 8468644 6793696 5572927 4632526
18097 4632526 3874549 3336381 2921336 2592090 2357938 2078135 1795389 1654744 1569457 1454224
18087 1454224 1322224 1180936 1136350 1103468 1091427 1118429 1072140 1075722 1105532 1105545 1086917 1073519
18075 1073519 1040312 1001876 982663 961685 958508 950611 933807 828518 722332 674343 611503
18064 611503 562661 532656 498208 433917 339699 346816 357992 340455 332324 332649 288218 252969
18052 252969 252113 253561 211792 227795 202838 194993 206738 176528 136240 100812 107577 109666 90652
18039 90652 114523 153654 121935 136536 128188 129774 126476 137227 161163 169167 143855 111509
18027 111509 118003 135656 109576 78510 29350 23546 76241 133364 161302 147273 152383 120344
18015A20344J0025j5127L83k5294N633l301k2505j3982K8282J4021p423k0795
18003G0261J6788K2711m8597j8454l4580J7713M4097J3533j8595j7940J0810K6386
17991H4133L0903J9586l1796l1118q188K1975M289N10o823m3843r384N0812J5507
17978I6563k4992j1790j7537L0064k8255j0237j9988O10J9411j418K4277J0405
17966F7113j8759q552K7342q550o3848J2429L7922l3197L9489R071k2360l478
17954C4622l531j7492k0914J7107N264K780k5792q846L8023J2813n381l8264K4806
17941A5195J8068q425R003L3352J361k3990l1537j9600l8883Q310M2949O5683
17929G1486K1742k1240o0376J4280L5734J1899P487M0925j6167j9624j4121J67
$$ plain form
18015 120344 130369 115242 115625 90331 95964 92663 70158 56176 84458 98479 91056 70261
18003 70261 87049 109760 61163 42709 8129 25842 69939 83472 64877 46937 57747 84133
17991 84133 115036 134622 102826 71708 63520 85495 89784 90294 83471 39628 30244 81056 96563
17978 96563 71571 59781 42244 72308 44053 33816 13828 14438 33849 32431 56708 67113
17966 67113 48354 39802 67144 58594 -5254 7175 45097 11900 51389 60460 38100 34622
17954 34622 31091 13599 -7315 9792 15056 17836 -7956 -16802 21221 34034 28653 -9611 15195
17941 15195 33263 24838 33841 67193 68554 44564 13027 -6573 -45456 -37146 5803 71486
17929 71486 93228 71988 11612 25892 61626 73525 81012 121937 105770 86146 72025 72192
17917G2192K2j97m115l9711j9227j8008L9249K5779L8423Q818j6263j1965k2982
17904E2015k4464k4150M176J7060k1188j3566r214m641K3189K599N8047O375l1468
17891C4770n0637J5372M1796o090l305K5079L0925l6475p846N0485o904o2483
17879B4687m12P9808M5518K2134j612Q402L3061L7177q0111n5390m2569k2480
17867D8213J8016k6300J5814L1318J2778p351J4798l9796p464l2135j3328L1365
17855D5928l7956k8714N3134L4528J06J923k7693k3506j5913O5295L4591n6343
17843D5380o2876j051j3095J0680k102M3870k2764m8660l8586L185P1279P7263
17831F2523l2029J6967K5641q18m6594P58K5473k4237m1789n9538k5804J8380
$$ plain form
17917 72192 72214 72017 67902 28191 8964 -9044 30205 55984 94407 103225 86962 74997 52015
17904 52015 27551 3401 7577 24637 3449 -10117 -19331 -23972 -783 1816 59863 66238 34770
17891 34770 -15867 -495 41301 35211 31906 56985 87910 51435 43589 94074 87170 24687
17879 24687 24275 104083 149601 171735 170123 178525 211586 248763 168652 113262 70693 48213
17867 48213 66229 39929 55743 87061 99839 92488 107286 67490 60026 27891 14563 45928
17855 45928 7972 -20742 32392 66920 67026 68949 41256 17750 1837 67132 101723 45380
17843 45380 -17496 -18547 -31642 -20962 -23064 20806 -1958 -50618 -89204 -86019 -14740 62523
17831 62523 30494 47461 73102 72284 25690 26448 51921 27684 -14105 -73643 -99447 -81067
17819h1067P1402N0534n692r428L7725j3262m357R611L094n0542l7986L8733J321
17806A0086J7258M1258q80J0679J4632n94j6754o660m326L394m3329m5266R308
17793a1194j7045j3771L3922M5231L6208j4050k5387j4248o813Q618K0252L380
17781D5103q598k2624L0239O050R651K3284L382l4978k7330m1295O064N2884J2313
17768E4145L3738j0288n9132r730K3973j752M024j6140m6022l773J518K3917j0921
17755a6443J1155j445q380K3873m800k7568O126j756L3015J0457n5979j3853L1944
17742a3654M0275j8735L2353L3332J7957l017O630k3021k0863R331r586k4212
17730B6790j357J0676n880Q340J0764j3650n8035L0438J4981n6519k7647N8935
$$ plain form
17819 -81067 -9665 40869 35177 25749 63474 50212 45855 55466 58560 8018 -29968 8765 10086
17806 10086 27344 68602 67722 78401 93033 92439 75685 69025 64699 68093 24764 -20502 -11194
17793 -11194 -28239 -42010 -8088 37143 73351 59301 33914 19666 12853 21471 41723 45103
17781 45103 36505 13881 44120 50170 59821 83105 86487 51509 24179 -17116 -11052 41832 54145
17768 54145 87883 77595 18463 8733 32706 30954 34978 18838 -27184 -30957 -29439 -5522 -16443
17755 -16443 -5288 -6733 -15113 8760 3960 -23608 -17482 -19238 13777 24234 -31745 -45598 -13654
17742 -13654 26621 7886 40239 73571 91528 88511 95141 72120 51257 60588 51002 26790
17730 26790 25433 36109 30229 38569 49333 35683 -22352 8086 23067 -33452 -61099 -2164
17718b164R361k7418J1927O2697K1094r196O448m1564J7642j0586J5552O684m2760
17705A7717l9175K4564L1776J7063K9061k1780m6016n8157R588P9591j2349j9908
17693A1975j2115o622q840j9164M3207J01869j8918k0187l2556k5016J4141Q446
17681C6220M793j1553k6164j6950K8008L733J2850J8988q070l3209k6388p22M28
17668a8036R306P044L1070L2075j3158l4740n0109p474O8522M0133J5107J0011
17656H9751K820l0187m148j4358l15J5481M774K3361J1817j7320k4125K6115r882
17643G3784N5257O6728N1947Q875P216M8781M4723J2150J7673k4707m5942J0164
17631C26649J4961k4945l1540J4486o389p6392r3154J68j8159n565m37k775K3663
$$ plain form
17718 -2164 7197 -20221 -8294 54403 75497 66301 72749 31185 48827 38241 53793 60477 17717
17705 17717 -21458 3106 34882 51945 81006 59226 13210 -44947 -35359 44232 31883 11975
17693 11975 -140 -6762 -15602 -34766 8441 110310 91392 71205 38649 13633 27774 36220
17681 36220 41013 29460 3296 -13654 14354 18087 30937 49925 41855 8646 -17742 -18464 -18036
17668 -18036 -8730 -1686 29384 61459 48301 13561 -36548 -44022 24500 64633 79740 89751
17656 89751 92571 62384 58236 43878 43563 59044 63818 87179 98996 81676 57551 83666 73784
17643 73784 129041 195769 247716 256591 263807 312588 357311 369461 387134 362427 316485 326649
17631 326649 341610 316665 285125 299611 293222 216830 123676 123844 105685 100120 99683 96908 120571
17618A20571l5589o4519p683J7865P876J0210J2694L5624K2724j7453n716J5333
17606A11937J036M9999M596m0091N492o771J436J8254m65j2946j5345n9462j2120
17593D5550K442J3409M777L8562K5601K0052j0102r8L222r650k1512k2760J6080
17580A05573M8470J9667k3620k0057j5874p715l1708j5437m5541J9737J2856L2692
17568G9043l761j8036J4904J6734L1478O038l5923j8820L0299L0019r306N265
17556A27934J9417M806k3423J4504j5825L345k3586j0658K1292L7541j1072l195
17544A41080L0172k823M2996L4205q909M9596O4005O3538O1469O1696L4398O3717
17532F35140P4995K5406j3975L0024O3919J7366K1133L9900P059l0758L7762P5700
$$ plain form
17618 120571 84982 20463 12780 30645 38521 48731 61425 97049 119773 102320 96604 111937
17606 111937 112973 162972 167568 127477 132969 126198 127634 145888 145423 132477 117132 57670 45550
17593 45550 47992 61401 66178 104740 130341 150393 140291 140193 143415 133765 112253 89493 105573
17580 105573 154043 173710 150090 130033 114159 106444 74736 59299 13758 33495 46351 79043
17568 79043 75282 57246 72150 88884 120362 126400 90477 71657 101956 131975 122669 127934
17556 127934 147351 152157 128734 143238 127413 130758 107172 96514 117806 155347 144275 141080
17544 141080 171252 168429 211425 245630 236721 286317 350322 413860 475329 537025 571423 635140
17532 635140 710135 735541 721566 751590 815509 832875 854008 893908 900967 870209 907971 983671
17520I83671O1008L0955O064L6131R6321M6444J6265O1831O2705K1938N1016Q1365
17508A555714Q5296J09359J32075J72779K29422K66596L22040L62749M59310O05607
17498D300947P89830J077129J477856K123729L099747M499471O389669P979420
17490C1737798Q175948P520086Q171867Q538768N131274J070990J133578J492904
17482G2973213n69189j289526n99929l321311p718732q305256p266783p666145
17474C6236342q033006o736919m887893l442140k403521j766405j303204j036083
17466F627171q32279o38210n03398m82268l87132l39592k44309j81307j49201
17457B869475j24283n0190k8030p2277p0760j30735q6625o2686o5358j408n0443
$$ plain form
17520 983671 1044679 1075634 1081698 1117829 1214150 1260594 1276859 1338690 1401395 1423333 1474349 1555714
17508 1555714 1641010 1750369 1882444 2055223 2284645 2551241 2873281 3236030 3695340 4300947
17498 4300947 5090777 6167906 7645762 9769491 12869238 17368709 23758378 31737798
17490 31737798 39913746 47433832 55605699 64144467 69275741 70346731 71480309 72973213
17482 72973213 72404024 71114498 70514569 67193258 59474526 51169270 43902487 36236342
17474 36236342 28203336 21466417 16578524 13136384 10732863 8966458 7663254 6627171
17466 6627171 5794892 5156682 4653284 4171016 3783884 3444292 3199983 3018676 2869475
17457 2869475 2745192 2695002 2666972 2594695 2523935 2393200 2306575 2243889 2178531 2177123 2126680
17446B126680o1008p1834l9809M8442R6195l2808k69952k25889j13193o7959k7402
17435A361463o1956k3121l3266n1414k3309n9723q9909j17374p4343k3657n8444
17424G44947p0963n6629l874l6610n9391j4152k2178p4451j3012k12l0886J0930
17412C73519k4126n2979l5520J974K5718N515m4175o363K7968J1964r035p06N525
17399B79279j6650j8025r928m7248j684N4663k8832j8273o7798l1897J9343j2050
17387A00900j7545M059n626J278J4095p438q978J5578M1313r85K2769J3309J5558
17374A88287L0997j5829k8694n1447p151j9115P067j7221j5747N966Q452l1893
17362E3672l4850L8789L6182M0146p6k1737l0577j1248J7005m1169J6511J1615
$$ plain form
17446 2126680 2065672 1993838 1954029 2002471 2098666 2065858 1795906 1570017 1456824 1388865 1361463
17435 1361463 1299507 1276386 1243120 1191706 1168397 1108674 1018765 901391 827048 803391 744947
17424 744947 673984 617355 613481 576871 517480 503328 481150 406699 393687 393475 362589 373519
17412 373519 349393 296414 260894 262868 288586 294101 249926 243563 271531 283495 274460 273754 279279
17399 279279 262629 244604 234676 187428 185744 240407 211575 193302 125504 93607 112950 100900
17387 100900 83355 87414 81788 83066 97161 89723 80745 96323 137636 136651 159420 172729 188287
17374 188287 219284 203455 174761 123314 116163 97048 104115 86894 71147 77113 85565 53672
17362 53672 18822 57611 93793 133939 133863 112126 81549 70301 87306 46137 62648 74263
17350G4263k7260K092M9374l6891l4741K4166L4791J1001n378k9086K7844Q304
17338I8479k862J7830l927n8197m5023J6179J5590J3880l859K6753j6189j0584
17326D8070q008j9369J8927L4147R772r211k4822n801j6931K6244M885J0747Q882
17313G7532l381J3578J781K444r673l2672l9783J6404M3913N1826K6877k0542
17301A28304m5290l5412j5154l6224j2966K2669J2912n296J4351K1201J6767k6513
17289C9349k7960j7229O087J0142l2659o240K6612j109k827L1403j6202J2055
17277B1422J756K5695l499K4929O38m8913m5674l8653N244L2880L9591J7720K2113
17264E5249m5335p997L9534j4837J485R304k240j3109L5827K019j8166M858j7048
$$ plain form
17350 74263 47003 49095 98469 61578 26837 51003 85794 96795 91417 62331 90175 98479
17338 98479 95617 113447 109520 51323 6300 22479 38069 51949 48090 74843 58654 48070
17326 48070 40062 20693 39620 73767 83539 74328 49506 43705 26774 53018 57903 68650 77532
17313 77532 74151 87729 89510 91954 82281 49609 9826 26230 70143 121969 148846 128304
17301 128304 83014 47602 32448 -3776 -16742 5927 18839 13543 27894 49095 65862 39349
17289 39349 11389 -5840 247 10389 -22270 -28510 -1898 -3007 -5834 25569 9367 21422
17277 21422 23178 48873 45374 70303 70941 22028 -23646 -62299 -57055 -24175 15416 33136 55249
17264 55249 9914 1917 41451 26614 28099 37403 35163 22054 57881 59900 41734 46592 29544
17251B9544l2175J358m112K0066L9493L4961K2513l457j6768o0373O662K4055
17239F1767j2853j9621J8170k5351k2820k0012j3416M6980L2655k335l946k6897
17227A2321K4469K2554J2128k5840k0760l237J074L3678j7146l7123l970K1764
17215A9912N5936K1853k3928k0698K393m0667K2726R675l263K7684N169m8341
17203B8451j7285K3429L1939o55k6114j8239J2679K4124j7669j581O689M513K5025
17190G5306j8141o074M3057J6748l7389j87o911k0877j8323j0670L0973J7048
17178F4560k5353k7412p613m603K495j1310P524p32n2050o924O0025L2089O904
17165C7600J7404j6869k0469k5019K3346k6784j7459K0776J5910K3057J8843K84
$$ plain form
17251 29544 -2631 -1273 -5385 14681 54174 89135 111648 108191 91423 31050 37712 61767
17239 61767 48914 29293 47463 22112 -708 -20720 -34136 12844 45499 43164 39218 12321
17227 12321 36790 59344 71472 45632 24872 21635 22709 56387 39241 2118 -1852 19912
17215 19912 75848 97701 73773 53075 55468 14801 37527 47202 43939 71623 76792 28451
17203 28451 11166 34595 66534 65879 39765 21526 34205 58329 40660 39079 45768 50281 75306
17190 75306 57165 51091 94148 110896 73507 73320 66409 45532 27209 16539 47512 64560
17178 64560 39207 11795 4182 -421 2074 -9236 -1712 -2444 -54494 -61418 -1393 30696 37600
17165 37600 55004 38135 17666 -7353 15993 -10791 -28250 -7474 8436 31493 50336 50620
17153E0620j0980l1762l7776k3804q332J935Q573L7752K8574k0766j2666J4504
17141d128j4137N513M8300K3372k0391m8067P218M559M673L6698k5499n6290J8336
17128a9843J6695j8388N516K6417Q34J8201k812k9294j2006j898R394j8121n57
17115b5862K849j0960n87K6255J489J2159K2544R859j3932j6518k1771k3496N666
17102c2305j4056Q567K8288M1279J1156Q028q467k6557l3320K1575J359L2029
17090C7576J1490m8787j3637l9862r997L1923J0864J2132O946m4225k0681K2170
17078d4088m257j8347K8311M4190J0073j0788P0916j4907j438K0724L620k9822
17066E4187l6457j61M64j4027M139M508L9570k2859L356J2173m5272P418K1944
$$ plain form
17153 50620 39640 7878 -29898 -53702 -62034 -60099 -51526 -13774 14800 -5966 -18632 -4128
17141 -4128 -18265 -12752 35548 58920 38529 -9538 -2320 2239 6912 43610 18111 -38179 -19843
17128 -19843 -3148 -21536 -16020 10397 11231 29432 26620 -2674 -14680 -16578 -7184 -25305 -25862
17115 -25862 -23013 -33973 -34560 -8305 -6816 5343 27887 37746 23814 7296 -14475 -37971 -32305
17102 -32305 -46361 -37794 -9506 31773 42929 50957 42490 15933 -17387 4188 5547 37576
17090 37576 49066 279 -13358 -53220 -63217 -31294 -20430 -8298 -1352 -45577 -66258 -44088
17078 -44088 -48345 -66692 -38381 5809 15882 5094 76010 61103 59665 80389 84009 54187
17066 54187 17730 17569 18033 4006 8145 12653 52223 29364 32720 44893 -379 7039 28983
17053B8983J9305k2524M978L1177r625k2773l3595j2643J386j5066j4103J7098
17041b7402J6178k666L9434k0172k8890l027K3697K0815o873j6862m6766l1859
17029h4393Q838L770K1985R205K6486l8875n4054Q4670O3311J819J5563K6480
17017H4805j0247p1615l5724L0562j8211K4020O6079k6874p3985n283N7572O01
17005B1700j5902m497J0434q909j3741P038J4313K4444K3829K5615k5430m0800
16993A8094j0851M898q700N5231K940O193K4051j5410n4901j1024q178K0304l730
16980A8917K8793k790j6824l0989n758J7724n801o031J750j7085L3600J0780n1802
16967b5516k5825K2688L1979M985K6480Q920k924p210m4797j9862L061n87r932
$$ plain form
17053 28983 48288 25764 30742 61919 52294 29521 -4074 -16717 -15331 -30397 -44500 -27402
17041 -27402 -11224 -13890 25544 5372 -23518 -26545 -2848 17967 11094 -5768 -52534 -84393
17029 -84393 -75555 -71785 -49800 -40595 -14109 -52984 -107038 -22368 40943 42762 58325 84805
17017 84805 74558 2943 -32781 -2219 -20430 3590 69669 42795 -31190 -36473 21099 21700
17005 21700 5798 1301 11735 2826 -10915 -3877 10436 34880 58709 84324 58894 18094
16993 18094 7243 12141 3441 58672 61612 67805 91856 76446 21545 10521 2343 22647 18917
16980 18917 47710 44920 28096 -2893 -8651 9073 3272 -2759 -1009 -18094 15506 26286 -25516
16967 -25516 -51341 -28653 3326 8311 34791 43711 40787 33577 -11220 -31082 -28021 -28608 -38540
16954c8540J2843Q844J2212k0262j668j2257k7002k7694L6972M6014J547Q366
16942f25k1894K6750m400m1044J5065O1281L1812O787o937k9820K4967J6304m6047
16929C2199r997M3674J3687j7078k9822k2187l4629l4427K0690J16779K1066j8507
16917H1448K3302M0629K2665j510m3857m9913k0115Q804j1733m484j841l6183
16905G212J3076M8317k7412l5964m73J5463r131n692K5335L8461Q3276R156J2816
16892A74440M4089N1496J01320L7403O795J7866N420J2647j0936K521l0079q5911
16880C27071o6320j602j8904k6316n4373l8900K6914q237j7728M801k024l7654
16868H6728N271o369n1835j6994r899J5557q149L2186j19p673Q745J4568j9837
$$ plain form
16954 -38540 -25697 -16853 -4641 -24903 -26571 -38828 -65830 -93524 -56552 -10538 -8991 -625
16942 -625 -22519 4231 -169 -41213 -26148 35133 66945 73732 66795 36975 61942 78246 32199
16929 32199 22202 65876 79563 62485 32663 10476 -24153 -58580 -37890 78889 99955 81448
16917 81448 104750 145379 168044 166534 122677 72764 52649 61453 49720 45236 43395 7212
16905 7212 20288 68605 41193 5229 4756 20219 11088 5396 30731 69192 152468 161624 174440
16892 174440 218529 270025 371345 408748 415543 433409 438829 451476 440540 443061 412982 327071
16880 327071 260751 259149 240245 213929 159556 120656 147570 139333 121605 126406 124382 86728
16868 86728 91999 85630 33795 16801 6902 22459 14310 46496 46377 38704 47449 62017 42180
16855D2180N965j7635l354K1548l746o393K7708p906n865J0341J904k5943Q021
16842D6825J6833L5087j092m9047l2158J2769j9824j8790K5725J2645l1512n823
16830h362L9747L369K9081k343J1735Q852k8411j3726P413j7973K2885J5979l2129
16817C6117r630l6418l8707n2K5572L4933M1606j2917j8016J1224p437L3977l7492
16804B2760l4712L274N834M224l505k5037P088j3533l421J2519Q934J5939k5109
16791b4745n2203P926K2071l715J0577L0407K6602J1006J8933j0823k6401k1886
16779a2251r4J6355j0893Q822M684P988l2302K1827J7404J9848L2602N799m0129
16766C9660l0387o5160o242K4641j69J6475m8360j4941L2247N606J1448N733k8588
$$ plain form
16855 42180 48145 30510 27156 48704 44958 38565 66273 58367 52502 62843 64747 38804 46825
16842 46825 63658 98745 97653 48606 16448 29217 9393 -9397 16328 28973 -2539 -8362
16830 -8362 31385 34754 63835 61492 73227 82079 53668 39942 47355 29382 52267 68246 36117
16817 36117 26487 -9931 -48638 -48690 -23118 11815 53421 40504 22488 33712 26275 60252 22760
16804 22760 -11952 -8678 -2844 1380 -2125 -27162 -20074 -33607 -37028 -24509 -15575 364 -24745
16791 -24745 -76948 -69022 -46951 -50666 -40089 -9682 16920 27926 46859 36036 9635 -12251
16779 -12251 -12345 4010 -6883 1939 6623 14611 -17691 4136 21540 41388 73990 79789 39660
16766 39660 9273 -55887 -62129 -37488 -37657 -21182 -69542 -84483 -52236 -46630 -35182 -29449 -58037
16753e8037J2134N5626K5084m00J8407j6793j3989k9061M2098J3969j7737k4547
16741F754J1130N7506j1222j3142n2971k0041K8503K8404j9342j0979J6521L4587
16729E5708j1190n4373P70R612k979K5423m211k8449l4469n3623l4747K7015M8307
16716e7206J4288m0655p980L5543M8491K3695k1288l2138Q783L3744J594N296
16704A2167k2312J8986J3999m1752j4994k5010L1347K8013j6730r120J9124M9056
16692D2774O201K637L0649k2069l99K206P393k2416q383k0780l6331m1487m0927
16679a00932P629R3276M5981n6381m0053m596k0966P660K8683K0198K8949J9660
16667B9108m8414k4540K9487J807o961k0258J4494j4310k3179k2819K4142j1283
$$ plain form
16753 -58037 -45903 9723 34807 34407 52814 36021 22032 -7029 35069 49038 31301 6754
16741 6754 17884 75390 64168 51026 -1945 -21986 6517 34921 15579 4600 21121 55708
16729 55708 44518 -9855 -9085 527 -2452 22971 18760 -9689 -44158 -97781 -132528 -105513 -57206
16716 -57206 -42918 -83573 -91553 -56010 -7519 16176 -5112 -37250 -28467 5277 6871 12167
16704 12167 -10145 8841 22840 -18912 -33906 -58916 -27569 444 -16286 -25406 -6282 42774
16692 42774 48975 51612 82261 60192 59793 61999 69392 46976 38593 17813 -18518 -60005 -100932
16679 -100932 -93303 -27 45954 -10427 -50480 -55076 -76042 -68382 -39699 -19501 9448 29108
16667 29108 -19306 -43846 -14359 -12552 -19513 -39771 -25277 -39587 -62766 -85585 -61443 -72726
16655g2726n644M6355J345m0149o2593P145M1262L6860M7475j4127l0369L3085
16643a2081J8901o435j6124J1640j4934J7307J2364m801J0931N7594k2540q4519
16631c2697j4813O3184M6144r330l1641j7922n3322K3730m253J4830M3323N238
16619C2471m598n3308J5312j2435m42R650L1942j4622l6237j0599J599k2804M689
16606e9382K4386K1639j0083m848q311j6841J5178M4771O685p3705J85Q09N4870
16593d647M5727K5514M23j5285k6743j7387K6530l2712j7989j3303J0633o812
16581b6051K1561M0719l1052o8568l7151q537R382k50M3332K5148J2185k2146
16569d1428k1570m380j252O327L3065K9905J979K2955L3221J5186o4061m3938
$$ plain form
16655 -72726 -78370 -32015 -30670 -70819 -133412 -126267 -85005 -48145 -670 -14797 -45166 -12081
16643 -12081 6820 385 -15739 -4099 -19033 -1726 10638 5837 16768 74362 51822 -32697
16631 -32697 -47510 15674 61818 52488 20847 2925 -50397 -26667 -30920 -16090 27233 32471
16619 32471 27873 -25435 -10123 -22558 -23000 -13350 18592 3970 -32267 -42866 -41267 -64071 -59382
16606 -59382 -34996 -13357 -23440 -28288 -36599 -53440 -38262 6509 13194 -60511 -60326 -59517 -4647
16593 -4647 41080 66594 67017 51732 24989 7602 34132 1420 -16569 -29872 -19239 -26051
16581 -26051 -4490 36229 5177 -63391 -100542 -109079 -99697 -99947 -56615 -31467 -19282 -41428
16569 -41428 -62998 -67378 -68630 -62303 -29238 667 2646 25601 58822 74008 9947 -33991
16557c3991J3671J8391M7957o057l9853q153o3106l192P2901N174l641L2343J3759
16544D6203k2234m3452m1251M1799K5756m0989p645L648j9527K8564J0987K2272
16532D131j9725N730K8659r060k9897K4560R114K089m3052l5601J2536M8410R153
16519G047J1399Q302M591J1749m1800K618j7461l4691L430P6O389m743N537m187
16505d1744l177Q715K0407J2023Q849j9126L9539J7764m295m4530n471N6548R221
16492E4723K4549M6512j1921p1508J9237M4821k6344n4577j1728J9737K9090P33
16480F3324m986Q117J1155n5802j9333N177q225P675K8368l8676j0841p099P24
16467b0422q034J3018j0942j7991K588L3370m070j2051l8985K7787L3256P747
$$ plain form
16557 -33991 -20320 -1929 46028 39971 118 -8035 -71141 -74333 -1432 3742 101 32444 46203
16544 46203 23969 -19483 -60734 -18935 6821 -34168 -41813 -38165 -57692 -29128 -18141 4131
16532 4131 -15594 -9864 18795 9735 -20162 4398 13512 15601 -27451 -63052 -50516 -2106 7047
16519 7047 18446 26748 31339 43088 1288 3906 -13555 -48246 -44816 -44740 -38351 -43094 -37557 -41744
16505 -41744 -44921 -36206 -15799 -3776 5073 -14053 25486 43250 38955 -5575 -11046 45502 54723
16492 54723 79272 125784 113863 42355 61592 106413 80069 25492 13764 33501 62591 63324
16480 63324 58338 66455 77610 21808 2475 7652 -573 7102 35470 -3206 -14047 -21146 -20422
16467 -20422 -28456 -15438 -26380 -44371 -41783 -8413 -12483 -24534 -63519 -35732 -2476 5271
16455E271M370Q24j7597J0514j2644K6804r789l009k2777K5511O400J1861j1229
16442A4510j9818K2051r274R393J3758Q478j8910k7135J7132j4955k065J2656
16430E821K6945k3955m05n6978k9766K926J5435L5385J5658J2223N505P978M675
16417B1447j7358K681l8171n069L3117J8360M9935Q532N001n967l1193J2249O800
16404F0364l8292o2139k4145O2785O7085j1894j1328o756l727m4769J3484j0854
16392a0186j9539J2568N5175p222k2794M2853k1608l4627k6574l4672l983N0175
16380b0434J7448K2539o827j2319j8205l063j739J0047k8547m750L0814K6007
16368A0971j4602l1842J5805M5024K5885l1100k1009R061P299J648j9705J4742
$$ plain form
16455 5271 9641 10465 -7132 3382 -9262 17542 7753 4744 -18033 7478 13878 25739 14510
16442 14510 -5308 16743 7469 16862 30620 39098 20188 -6947 10185 -4770 -6835 5821
16430 5821 32766 8811 8406 -48572 -78338 -75412 -59977 -24592 -8934 3289 8794 16772 21447
16417 21447 4089 6770 -31401 -36470 -3353 15007 64942 73474 78475 72508 41315 53564 60364
16404 60364 22072 -40067 -64212 -1427 65658 53764 42436 35680 31953 -12816 668 -10186
16392 -10186 -29725 -17157 38018 30796 8002 50855 29247 -5380 -31954 -66626 -70609 -20434
16380 -20434 -2986 19553 12726 407 -17798 -20861 -22600 -12553 -41100 -45850 -15036 10971
16368 10971 -3631 -35473 -19668 25356 51241 20141 -868 8193 15492 17140 -2565 12177
16356A2177J853K8248j5259m0397O169J4697K829p641n125j675N438q142j6112
16343b2940L0022O402j8481k0040k0020p257K8989K1882P305J7390J8589K254
16331D4095j1216J2570j7612j3650M880m221k019J8561L817m3526n3987M613M5254
16318a2441M9979J4801k8324k0561r755r63R51j1269J7672J0548J7801l3531j3069
16305a8161k432p683l5610J5018L8762m4393j816K4815K5987k8882J3052L7922
16293A6579j9654j9163J6388M2701K71j314M6382j718l0579n0918j2403j4906
16281b8334o1243l9603Q920M2020L0515M637K8466L1799K200j8779J1696k3564
16269a1270k7629o65J4859J5157J044l1629j1291Q558J0447M3814M9074k4238
$$ plain form
16356 12177 14030 42278 27019 -13378 -7209 7488 10317 2676 -2449 -4124 1314 -6828 -22940
16343 -22940 7082 13484 -4997 -25037 -45057 -52314 -23325 -1443 5862 23252 41841 44095
16331 44095 32879 45449 27837 14187 19067 14846 12827 31388 35205 -8321 -62308 -57695 -12441
16318 -12441 37538 52339 24015 3454 -6301 -7264 -6313 -17582 90 10638 28439 -5092 -18161
16305 -18161 -20593 -28276 -63886 -48868 -10106 -54499 -56315 -31500 -5513 -34395 -21343 16579
16293 16579 -3075 -22238 -5850 36851 37122 35808 82190 80472 49893 -1025 -13428 -28334
16281 -28334 -89577 -129180 -120260 -78240 -47725 -43088 -14622 17177 19377 598 12294 -11270
16269 -11270 -38899 -39564 -24705 -9548 -8504 -40133 -51424 -42866 -32419 11395 60469 36231
16257C6231n4313k6659k0830J3257Q5297j2681m3618K553m983P522j4460j9992
16245e2676k4044j2951J7631M4107O242L2043J5552P44J2421J641m9040l5562
16233d3892K3759R640P740L2522o545l8293j0965L997j0841L089Q951j6572j290
16220c8700l068K1200K4327J3043K1954j5905k661M587L6458L2660M128j3036
16208H4987m9679l0765l5347j4285J8574N3451Q574l7455r031l2982L0048j7137
16196c1047n1498j356L554J4047k139L8215L4930K232J7500R897L62l1276O911
16183A0332j743m4545j2990r293L3196J1975J3541J0295j2014J2650j2748l4119
16171c5463m3301Q159L9590P6114j7907m4833l9275K5628R536M164J2086j9220
$$ plain form
16257 36231 -18082 -44741 -65571 -52314 32983 20302 -23316 -20763 -25746 -18224 -32684 -52676
16245 -52676 -76720 -89671 -72040 -27933 -21691 10352 25904 26648 39069 40710 -8330 -43892
16233 -43892 -20133 -10493 -2753 29769 23224 -15069 -26034 -22037 -32878 -29789 -20838 -37410 -38700
16220 -38700 -41768 -20568 3759 16802 38756 22851 20190 24777 61235 93895 98023 84987
16208 84987 35308 4543 -30804 -45089 -26515 26936 35510 -1945 -10976 -43958 -13910 -31047
16196 -31047 -82545 -83901 -80347 -66300 -68439 -30224 4706 6938 24438 34335 34697 3421 10332
16183 10332 8589 -35956 -48946 -58239 -25043 -13068 473 10768 -1246 11404 -1344 -35463
16171 -35463 -78764 -70605 -31015 45099 27192 -17641 -56916 -31288 -21752 -17588 -5502 -24722
16159b4722k4490j0591J4996J4084k715K6730J0522j8476j4237Q166J8945K42
16147a546j9626J0092o880j085M360O232j700L1904R657l8661O592k5781k1200
16134d7642K7983K3903K5122o261m1271l1176j9039j3012J3267n444L6872J1259
16122b5439j8606k5512j6345R323N0118M4512k0266j7937n523k7328k1545K6917
16110d7631K0534K3483k0795J3894M3498k4391j6757J7517J0687J6848j6303J3069
16098C3653k909n7593o642K8315J1987K1448l9554R333M181L267J644p960k1506
16085b2336Q244l7608l4183K2665K9328m31q833k5704o293k7181L6439M9670k5056
16072d1279q269K9350J4719J343L6030j5225o695k6736j2580m541M4405M1750
$$ plain form
16159 -24722 -49212 -59803 -44807 -30723 -33438 -6708 3814 -14662 -28899 -20733 -1788 -1546
16147 -1546 -21172 -11080 -17960 -19045 -14685 -8453 -10153 21751 31408 -7253 -661 -26442 -47642
16134 -47642 -19659 4244 29366 23105 -18166 -49342 -68381 -81393 -68126 -73570 -36698 -25439
16122 -25439 -44045 -69557 -85902 -76579 -26461 18051 -2215 -20152 -25675 -53003 -74548 -47631
16110 -47631 -27097 -3614 -24409 -10515 32983 8592 -8165 9352 20039 36887 20584 33653
16098 33653 30744 -26849 -33491 -5176 6811 28259 -11295 -1962 2219 5486 7130 -830 -22336
16085 -22336 -14092 -51700 -85883 -63218 -33890 -34321 -43154 -68858 -75151 -102332 -65893 -16223 -41279
16072 -41279 -49548 -20198 -5479 -4136 31894 16669 9974 -16762 -29342 -33883 10522 52272
16060E2272J0862j6656j1605R079K9246j187n6858j3131K7906J4060j5788j8842
16048I358k5370j6382j1102J7126M1425r836J2361p571n0245k9084K9868k705
16036d2157J4937M8388M622j4366j9134L3040J3598O971J6977k2286p469j7117
16024A6004j0730l4727r445J9742J9898j1029l8766L3543m204k8925j7039K3725
16012d1953K1088K9991K9929o1116m5921r240M445K1108J1187J6256l7109j0004
16000g1339K8115K7575P827K4680k3505L36K2710K3682k077k7986l2552p346J2751
15987a7129j6548k4525m9231J2951P0638K0988K856K7304J4644j7578k1121j9803
15975a6554M0361L1326l8152l0901K2461K9797l5095q369J9250M770j7110N334
$$ plain form
16060 52272 63134 46478 34873 43952 73198 72011 15153 2022 29928 43988 28200 9358
16048 9358 -16012 -32394 -43496 -26370 15055 5219 17580 10009 -40236 -69320 -39452 -42157
16036 -42157 -27220 21168 25790 11424 -7710 25330 38928 45899 62876 40590 33121 16004
16024 16004 5274 -29453 -38898 -19156 742 -10287 -49053 -15510 -19714 -48639 -65678 -41953
16012 -41953 -20865 9126 39055 -22061 -67982 -77222 -72777 -51669 -40482 -24226 -61335 -71339
16000 -71339 -43224 -15649 -7822 16858 -6647 -6311 16399 40081 38004 10018 -22534 -29880 -17129
15987 -17129 -33677 -58202 -107433 -94482 -23844 -2856 0 27304 41948 24370 3249 -16554
15975 -16554 23807 55133 16981 -13920 8541 38338 3243 -5126 14124 18894 1784 7118
15963G118L1827r11k5608j044q503O670L3721r359J0069o1368j5677l0686K3269
15950d0482K7746J3114N0873J4641J3156j9527l8999J4452k8231l9279L8546K3648
15938B9658k9975j6185K3454K4165k8997K5631j831m7208p409O7199M0067m560
15926G4009l2995k6650o746k5420o123K2124l880J9047k0377L9126R499n8406
15914a6792l0477n621k0074M34M341J53L9040J8335m4749m6477K8121Q3877J9505
15901B9616j5163j2134j4351o609j8689J7594J8731J3894K006k8636m3326q481
15889f5548L6854J8488L0456L2818K9122l4960r686j1947k1486k9713q251m20
15877c4273L6484J2652r731o2760J7222J3460J9512J7600j0586K3721J4882j2625
$$ plain form
15963 7118 38945 38034 12426 11382 2879 9549 43270 33911 43980 -17388 -33065 -63751 -40482
15950 -40482 -12736 378 51251 65892 79048 59521 20522 34974 6743 -32536 6010 29658
15938 29658 -317 -16502 6952 31117 2120 27751 25920 -21288 -28697 38502 78569 74009
15926 74009 41014 14364 7618 -17802 -23925 -1801 -5681 13366 -7011 32115 41614 -16792
15914 -16792 -47269 -52890 -72964 -72530 -68189 -68036 -28996 -10661 -55410 -101887 -73766 10111 29616
15901 29616 14453 2319 -12032 -18641 -37330 -19736 -1005 12889 14895 -13741 -57067 -65548
15889 -65548 -28694 -10206 20250 53068 82190 47230 37544 25597 4111 -25602 -33853 -34273
15877 -34273 2211 14863 5132 -57628 -40406 -26946 -7434 10166 -420 23301 38183 25558
15865B5558l8436j5449k8626j9822M2932P2696k1341k9607L251J4175J342k9875
15853b3202j367K6407R280k1495k0852L7977q458p015J2400q427M690l803m496
15840h361l3339j7779K5417L3427K3323j8980k1944k594J4649L6299O563J2636
15828D9317l8718k6102K2277j0016k6650l521K61j4763j5900k342p473j4750J0920
15815g7460L6079O4887K3025l1774k3465k0296K3523k660p858J8463L2563j3489
15803B1538l339n5750L182M1313q872m4269m192K2034q778j0428p170j2573j4843
15790h2147k185N4089L741o938K0116M958J5570k4305J6764j1530l2120L415j4433
15777e5005J9565K4548K846j8953K4118k4454J7126J088l116K0929m1686J9049
$$ plain form
15865 25558 -12878 -28327 -56953 -76775 -33843 38853 17512 -12095 -8844 5331 6673 -23202
15853 -23202 -24569 1838 11118 -10377 -31229 6748 -1710 -8725 3675 -4752 -62 -3865 -8361
15840 -8361 -41700 -59479 -34062 -635 22688 3708 -18236 -20830 -6181 30118 36681 49317
15828 49317 10599 -15503 6774 -3242 -29892 -33413 -33152 -47915 -63815 -66157 -73630 -88380 -77460
15815 -77460 -41381 23506 46531 14757 -8708 -29004 -5481 -8141 -15999 2464 35027 21538
15803 21538 18199 -37551 -34369 6944 -1928 -46197 -50389 -28355 -37133 -47561 -54731 -67304 -82147
15790 -82147 -84332 -30243 -26502 -33440 -13324 -8366 7204 -17101 -337 -11867 -43987 -40572 -55005
15777 -55005 -35440 -10892 -8046 -26999 -2881 -27335 -10209 -9121 -12237 8692 -32994 -13945
15765a3945j5691L4981J3520R641k3695L442J1282k4894K297J3740k5258l7674
15753e2254r737r579K8544J0167K1245K2561m103j2128K8700k471j7843l9215
15741c6113k3239j2472L1257K7217K4005j7790J2962j4929q905m374M3298J5769
15729C6686M519J1457o462r069l1268j3970P432M717m131k7549L4174J2276L2963
15716E1775K414k2801l5014j9686N287j0618l4529L1453Q351N75j693K7937K2457
15703B5908L551j5324k8523j2667M250J4939k4421J4605J5374j9184j2093K4820
15691h765k2416j7803q552L713P713K6644o650j3580m5801m762K4958k8869J8471
15678g5699O2122O961m0967J4907l3531l7794J6371J3405j4700M8416J2444j9192
$$ plain form
15765 -13945 -29636 5345 18865 28506 4811 8253 19535 -5359 -3062 10678 -14580 -52254
15753 -52254 -61991 -71570 -43026 -32859 -11614 10947 6844 -5284 23416 20945 3102 -36113
15741 -36113 -59352 -71824 -40567 -13350 10655 -7135 5827 -9102 -18007 -22381 20917 36686
15729 36686 41205 52662 46200 37131 5863 -8107 -675 4042 -89 -27638 6536 18812 51775
15716 51775 54189 31388 -3626 -23312 -18025 -28643 -63172 -31719 -23368 -22793 -24486 3451 25908
15703 25908 29459 14135 -14388 -27055 -22805 -7866 -32287 -17682 -2308 -21492 -33585 -8765
15691 -8765 -31181 -48984 -57536 -53823 -46110 -19466 -26116 -39696 -85497 -90259 -65301 -94170 -75699
15678 -75699 -13577 -6616 -47583 -32676 -66207 -104001 -87630 -74225 -88925 -40509 -28065 -47257
15666d7257O212l6585K9753j5233k8628J4008L3626L421k8135p642J4060J2099
15654e0301M2243R981J3525l1609k8679N830N0216n1885l7736K4803M2683J5362
15642D433p458l136p715k5367O373J4697K4862J9282K5746j2580j1369k2144P742
15629A3366L961o213N846L2202K4409K4439k6298j4995k9993l605J708J2586J2442
15616D9855M737q998l8571n0276j2807J4061L0006R242N85L041m330K201j0428
15603a1682M1331M285k4482k3192L039J527K2043N545m028j1305P972J5600q089
15590A8564J9303L7903j1355m4575l9299R232k6546l0982L2448J8697J8661Q553
15578A0604l0073m6634l522L5023N093j3152K0497K2755L379j6848K972Q267l896
$$ plain form
15666 -47257 -41045 -77630 -47877 -63110 -91738 -77730 -44104 -40683 -68818 -76460 -62400 -50301
15654 -50301 -8058 1923 15448 -16161 -44840 -39010 11206 -40679 -78415 -53612 -10929 4433
15642 4433 -3025 -6161 -13876 -39243 -32870 -18173 6689 25971 51717 39137 27768 5624 13366
15629 13366 17327 11114 16960 49162 73571 98010 71712 56717 26724 23119 24827 37413 49855
15616 49855 54592 45594 7023 -43253 -56060 -41999 -11993 -2751 -2166 875 -3455 -1254 -11682
15603 -11682 29649 33934 9452 -13740 -10701 -9174 12869 18414 14386 3081 11053 26653 18564
15590 18564 37867 75770 64415 19840 -19459 -10227 -36773 -67755 -35307 -16610 2051 10604
15578 10604 -19469 -66103 -69625 -34602 -29509 -42661 -22164 591 3970 -12878 -9906 -1639 -5535
15565e535L841k9128r152j5744N4635J3037K1468p976J1552J9710l6310k0101
15553B97M2292N619n4769q741J1936j3623J1424J3035K6951j1700j0972P457k3768
15540d562J9776J9147Q654k7407N9745j863n072N6491P781m9593k7257K755m4098
15527A4497k1995k4260J4088k4354R071J3261Q5k5744M307n879L5258q013l5872
15514e5550J4313J7210p58K99k3434L9939L8006l6143j9406K421L22K1593p841
15501i029l1198j1805L7087N676P158L715L3094J005N025J08k6792j2427j9168
15488a7551k1468m8522k3235L0260L3401N607J2243m419k2825q752J7848O138
15476d1275K1467m2597P652O9107N1211n7060r738k497n993J459M775j2264k6711
$$ plain form
15565 -5535 -1694 -30822 -39974 -55718 -1083 11954 33422 25446 36998 56708 20398 297
15553 297 42589 48208 -6561 -15302 -3366 -16989 -5565 7470 34421 22721 11749 19206 -4562
15540 -4562 15214 34361 43015 15608 75353 73490 68418 124909 132690 83097 55840 58595 14497
15527 14497 -7498 -31758 -17670 -42024 -32953 -19692 -19607 -45351 -41044 -46923 -11665 -19678 -55550
15514 -55550 -41237 -24027 -24785 -24486 -47920 -7981 30025 -6118 -25524 -23103 -22781 -1188 -9029
15501 -9029 -40227 -52032 -14945 -9269 -2111 1604 34698 35703 40728 40836 14044 1617 -17551
15488 -17551 -39019 -87541 -110776 -80516 -47115 -41508 -29265 -33684 -56509 -65261 -47413 -41275
15476 -41275 -19808 -62405 -54753 14354 65565 8505 -1233 -3730 -9723 -8264 -3489 -15753 -42464
15463d2464L004n377J3059o450P933l6180j8873N645J9403O6075K547p015J3161
15450A4468N393l0893n2721o168K6536L7663J1460J9525L908l0230j5721J3934
15438b846L0096q785l0353j7099j9522J9220L2774O611m336O961M558K3186P641
15425D8106n2014o0225N0683N6956L4581m2649J0443j9620k7159j497k0064N635
15413a6824o290K2381j707k6278l3924j9673o224J3608M3939K4512J4437k4401
15401a6444k2889Q133M5637l5397M694m3976j7009k6243J7546L2586L8268J5511
15389D17L830k8280j9011N5458M4883j8877k8979k2781m9837M3032N5436K4143
15377E9434k1922m81L0029j5829j7126n0476n943L7927R145k811n082m098M664
$$ plain form
15463 -42464 -39460 -44837 -31778 -38228 -30295 -66475 -85348 -79703 -60300 5775 8322 1307 14468
15450 14468 19861 -11032 -63753 -69921 -43385 -5722 5738 25263 29171 -1059 -16780 -2846
15438 -2846 27250 18465 -11888 -28987 -48509 -29289 3485 10096 5760 12721 17279 40465 48106
15425 48106 -3908 -64133 -13450 43506 78087 35438 45881 26261 -898 -2395 -22459 -16824
15413 -16824 -23114 -733 -2440 -28718 -62642 -82315 -88539 -74931 -30992 -6480 7957 -16444
15401 -16444 -39333 -31200 14437 -20960 -16266 -60242 -77251 -103494 -85948 -53362 -15094 417
15389 417 4247 -24033 -43044 12414 57297 38420 9441 -13340 -63177 -20145 35291 59434
15377 59434 37512 37031 67060 51231 34105 -16371 -22314 15613 24758 21947 16865 12767 17431
15364A7431J4537q118J0957l638l908k0441j3916j3401k2985K3683K3552j2544
15352h791p0090k6796M4855M6819o371K5739j2650L3941L6888k4981K9850M7141
15340A15554j3881l3805j240o753m5570P43J6210j7359k3725J1541k6123m8590
15328g2998K0304M5198N32k9458O6477L6129k6911k7894k0799J2041Q931k3567
15316a2015j0206L1214L1999J2682p026k0807j4362j3571j9724K6192L787L70
15304H533K4j4229j1056k7332L2886N9044K7985k6948o2406k3299Q928k0410M867
15291d3413L2150r289K150M084J0167j5174n699O5M959L0604k8024P096j1212
15278b1536m2467j0406l688L8217L9539J7953l1455L458M2515k2593q109K009
$$ plain form
15364 17431 31968 23850 34807 31169 27261 6820 -7096 -20497 -43482 -19799 3753 -8791
15352 -8791 -78881 -105677 -60822 -14003 -20374 5365 -7285 26656 63544 38563 68413 115554
15340 115554 101673 67868 66628 59875 14305 15048 31258 13899 -9826 1715 -24408 -72998
15328 -72998 -52694 -7496 -6964 -36422 30055 66184 39273 11379 -9420 2621 11552 -12015
15316 -12015 -22221 8993 40992 53674 46648 25841 11479 -2092 -21816 4376 8163 8533
15304 8533 8557 -5672 -16728 -44060 -11174 47870 75855 48907 -13499 -36798 -27870 -48280 -43413
15291 -43413 -11263 -20552 -18402 -14318 -4151 -19325 -25024 -24959 -20000 10604 -17420 -10324 -21536
15278 -21536 -64003 -74409 -78097 -39880 -341 17612 -13843 -10385 32130 9537 1428 3437
15266C437J712J4401K62k263j5787M3611m5695l0870P623K8046K8258O491j1575
15253B7651l5064j8350J8557J0045N593m8598n9199J3531J9175L3329j1031J1834
15241c2527n797K1884j1555n521K7016K3129r215q424Q08r782m1420L1933M5030
15228B5559j5346j9008j8367j2507j9943k1470K5856L0264M5929k7663J5171j7991
15216i516m0771O692R76J7920K5185Q47P957J5303J6330k9425j0449Q410j025
15203H434J4964m9336l8151J3379L320K3815r567L9316K9731l2214k9153J4879
15191a0583P354j7425K8392k5917K8999R384l6559o880M8783m194K1198J9529
15179F2081m6075j6192k5159m934l206j1054K9360n9711l7470J8452N0352N5273
$$ plain form
15266 3437 5149 19550 19812 17549 1762 45373 -322 -31192 -23569 4477 32735 39226 27651
15253 27651 -7413 -25763 -7206 2839 8432 -40166 -99365 -85834 -66659 -33330 -44361 -32527
15241 -32527 -38324 -16440 -27995 -33516 -6500 16629 7414 -1010 -202 -9984 -51404 -19471 25559
15228 25559 10213 -8795 -27162 -39669 -59612 -81082 -55226 -24962 20967 -6696 8475 -9516
15216 -9516 -50287 -43595 -42619 -24699 486 1333 9290 24593 40923 11498 1049 9459 8434
15203 8434 23398 -25938 -64089 -50710 -47390 -23575 -33142 6174 35905 3691 -25462 -10583
15191 -10583 -3229 -20654 7738 -18179 10820 20204 -16355 -23235 25548 21354 42552 62081
15179 62081 16006 -186 -25345 -30279 -33485 -44539 -15179 -74890 -112360 -93908 -43556 11717
15167A1717j4664o646j0051k4050O32L719J8132K4684p087K8963O615j9882J0602
15154B2684j6020m0960k400M3640J2407k6878K3331k4011j4773J5472q93L574
15142d827R814J9289n0481J092K7615J8559l5533l3342n0290j7847j0206J9757
15130a06400L9182J7878l9149J2073l922N3715K6354L8044J7626o032m0308l6462
15118b7401j2486K4237L8760O557Q257J925l3848n8907L416j13r710K2991O331
15105b9991J7663J5894K5380k3807l3213P919K7473n468k2272K21O027M17L6384
15092B2627k1831n5118J1874J8137r132M642N196K3063J4643k0360L6424O675
15080C6840k2489k8537j9605L7438n155k3932N054j4497l0140K3667J3544J4401
$$ plain form
15167 11717 -2947 -9593 -19644 -43694 -43062 -39343 -21211 3473 -3614 25349 31964 12082 22684
15154 22684 6664 -34296 -36696 6944 19351 -7527 15804 -8207 -22980 -7508 -8401 -4827
15142 -4827 4987 24276 -26205 -25113 2502 21061 -14472 -47814 -98104 -115951 -126157 -106400
15130 -106400 -67218 -49340 -88489 -76416 -80338 -26623 -269 37775 55401 49369 9061 -27401
15118 -27401 -39887 -15650 23110 29667 37924 39849 6001 -52906 -49490 -49603 -59313 -36322 -29991
15105 -29991 -12328 3566 28946 5139 -28074 -20155 7318 1850 -20422 -20201 -14174 -13757 22627
15092 22627 796 -54322 -42448 -24311 -33443 -28801 -23605 -542 14101 -6259 30165 36840
15080 36840 14351 -14186 -33791 3647 -1508 -25440 -20386 -34883 -65023 -41356 -27812 -13411
15068a3411m453J6613K0042l9617o742P295L637j1826L467L8185L2615o778k8439
15055A0588k0119k1019J8358N2120k6087j5092K6766j7461n5539o104K9379j0765
15043c4975k2996J6686L7663K0170k000N657P612j7453m1336n031M0493O13k3082
15030a7979K9161J9678m7981j9337J5318q453p844J4463K5812J9690K377q646
15018A6259J6127l2749k404p861l390k514M922O978J5101J2717K264m7056j9799
15005d1405O881L6314K9273r219j015J0955k3976j0098j5297k5786k0284J0805
14993e2852L012N0109O257k3911K0580l363j5182Q212O991J834Q20j7783k2358
14980c7634J7676J5310M4657K0988k3022l327k742o8087k6733M6871J3089J5891
$$ plain form
15068 -13411 -17864 -1251 18791 -20826 -27568 -20273 -16636 -28462 -24995 13190 45805 39027 10588
15055 10588 -9531 -30550 -12192 39928 13841 -1251 25515 8054 -47485 -53589 -24210 -34975
15043 -34975 -57971 -41285 -3622 16548 14548 20205 27817 10364 -30972 -36003 4490 5103 -17979
15030 -17979 11182 30860 -17121 -36458 -21140 -29593 -37437 -22974 2838 22528 24905 16259
15018 16259 32386 -363 -2767 -10628 -14018 -16532 -11610 -4632 10469 23186 25450 -21606 -41405
15005 -41405 -34524 1790 31063 21844 20829 31784 7808 -2290 -17587 -43373 -63657 -52852
14993 -52852 -49840 269 6526 -17385 3195 -168 -15350 -7138 -147 1687 2507 -15276 -37634
14980 -37634 -19958 -4648 40009 60997 37975 34648 31906 -36181 -62914 -16043 -2954 12937
14968A2937N0697K0809k2388j5579L855J7852j2746l2511K9760k5195k6171K9171
14956C0491k1364K2263K2880L2101N046J6285q420l3103Q046j6107l1610J5870
14944D2378K9560k3549P296J0450k4602m798M3800q436m4308R582J8313o329L186
14931E2543J0351j3732K0406k236j5087R451l1006l7315M895r625k3015J5642
14919a8728M5456J4753J2568j4858k296j8614m7801m883N215K2271J5351R295
14907A7729j2195j4256m645R300L4743M4043K5477p867l9492J456P296j214M14
14894F0789J4461O151l8786k5018K0250r827k5841r928o062L9162J2681K5258
14882F3290o984m3822l2105M7566L3399l9393j6611j2573K8117L0370j1011k0219
$$ plain form
14968 12937 63634 84443 62055 46476 50331 68183 55437 22926 52686 27491 1320 30491
14956 30491 9127 31390 54270 86371 91417 107702 99282 66179 74225 58118 26508 42378
14944 42378 71938 48389 55685 66135 41533 36735 80535 72099 27791 37373 55686 49357 52543
14931 52543 62894 49162 69568 67332 52245 61696 30690 -6625 -1730 -11355 -34370 -18728
14919 -18728 26728 41481 54049 39191 36895 18281 -29520 -34403 -29188 -6917 8434 17729
14907 17729 5534 -8722 -13367 -4067 30676 74719 100196 92329 52837 54293 61589 60375 60789
14894 60789 75250 81401 42615 17597 37847 28020 2179 -7749 -13811 25351 38032 63290
14882 63290 56306 12484 -19621 27945 61344 21951 5340 -7233 20884 51254 40243 20024
14870B0024j2783Q170O3778j9143o394j974N1065J454N245J005l954k0503j5625
14857G0365j1070l0337l492o952M32Q917K6550L2736M7922L8435j2566j4496l1637
14844A14807k1717m6439l048J9660K6314k1621O1156M369j5255K6934m405j2133
14832A28622m734j2958j7812N3433N6081j1259N59j5526j7550R188l6856l3241
14820I7947j7215J087J0621K0410O7500l3137m3037R932Q862O180l2386j5901
14808H0863j5818K3106K9457k0279J7512R244k619N1267N740j9806l8747J8040
14796A37960M0179l6854M233j1988m754J2506L7785j472j6570K5412j7058q938
14784A60441l8926o269K3041K1459j8404l8550O215N1480M4159k9197k8450O1800
$$ plain form
14870 20024 7241 15411 79189 60046 53652 51678 102743 104197 109442 110447 106493 85990 70365
14857 70365 59295 28958 25466 18514 18946 27863 54413 87149 135071 173506 160940 146444 114807
14844 114807 93090 46651 43603 63263 89577 67956 129112 133481 118226 145160 140755 128622
14832 128622 123888 110930 93118 146551 202632 191373 191932 176406 158856 168044 131188 97947
14820 97947 80732 81819 92440 112850 180350 147213 104176 114108 122970 129150 96764 80863
14808 80863 65045 88151 117608 97329 114841 124085 121466 172733 178473 158667 119920 137960
14796 137960 178139 141285 145518 133530 128776 141282 179067 177595 161025 186437 169379 160441
14784 160441 121515 115246 138287 159746 141342 102792 109007 160487 204646 175449 146999 208799
14772B08799K3087m535K9146J2086p050l8143m1447R084k5940j8863j5433J5769
14760A46560J4381K8655K7282m208L277L5090r807n5931j2086L0726M145m5253
14748A62831j4283M0068k0101M5251M3195O246p2892k7248L5588q501Q237K2685
14736B21076j9045K6330M0348k3788j6978j3844R772k7940n3522J3534J3954Q417
14724A78314Q535K0825j1532r174L8466j8718j4409m199O324M2118K156k2363
14712B16343l3257o0213K2412N5901j5197J0678k5427j4654k857l6905j1441K7177
14700A32560J0248j273j2968l2823K1056L1926j701l0841p830L9995K5887L1718
14688B05954l2275m9636m1202L8316K7173r86L767n703o497L1964m9803l4047
$$ plain form
14772 208799 231886 227351 256497 268583 261533 223390 181943 191027 165087 146224 130791 146560
14760 146560 160941 189596 216878 212670 215947 251037 241230 185299 173213 203939 208084 162831
14748 162831 148548 188616 168515 213766 256961 263207 190315 163067 198655 190154 198391 221076
14736 221076 202031 228361 268709 244921 227943 214099 223871 195931 142409 155943 169897 178314
14724 178314 186849 207674 196142 186968 225434 206716 192307 188108 194432 236550 238706 216343
14712 216343 183086 122873 145285 201186 185989 196667 171240 156586 153729 116824 105383 132560
14700 132560 142808 141535 128567 95744 116800 148726 147025 116184 108354 148349 174236 205954
14688 205954 173679 124043 82841 121157 148330 147344 151111 145408 138911 170875 121072 87025
14676H7025M9500J3623R483p477j9708m2242K41K4980l2610l5495k5372L3982
14664E5930L6428q497l5572j2607L7354j5143Q391j73K7215L5272j6654l3096
14652G8848K6383P730o8799k4430J0509L5326J0369k3457j1300L3093K8439K7929
14640A30640k7655j9966K8878K3407n547l3298r148p593Q892j314j349L337j8312
14627G0972m5706K7360r285j6960p249j7362M0298k1576m6261J213L4982M7062
14615E7488j0641Q223m029J8040K4762O139J8528J5816o6783R033R718l7111n1836
14602b653K0130j2344j8342r089J1812J6762L2231K1292p982m8717j5974r925
14590b2799m795J8985J7331l2018o154N265K5312K2081O875j0999k4751K0809
$$ plain form
14676 87025 136525 150148 159631 152154 132446 90204 90445 115425 82815 47320 21948 55930
14664 55930 92358 83861 48289 35682 73036 57893 66284 66111 93326 128598 111944 78848
14652 78848 105231 112961 44162 19732 30241 65567 75936 52479 41179 74272 102711 130640
14640 130640 102985 83019 111897 135304 129757 96459 87311 79718 88610 87296 85947 89284 70972
14627 70972 25266 52626 43341 26381 19132 1770 42068 20492 -25769 -24556 10426 57488
14615 57488 46847 55070 51041 69081 93843 99982 118510 134326 67543 76576 86294 49183 -2653
14602 -2653 17477 5133 -13209 -22298 -10486 6276 38507 59799 51817 3100 -12874 -22799
14590 -22799 -27594 -8609 8722 -23296 -29450 -24185 1127 23208 30083 19084 -5667 15142
14578A5142K6119M991J8434o565k2930Q13j6458k964P107Q797J2259k8628k3469
14565g352r500J8936n2281n134J9895K1110j0953n572P994j4024K0937k662O470
14552a2136J4819k5624K158L8305k0366n3890j326L0495k4613M3616O089J5415
14540A2942k0001O800K8214k9504j3381K6033O519j5360l3219l9100k0897K8576
14528f2378L8868J4571j095j5970j9019j4731L1816K3585K3599O345O424j4094
14516A7921K4979n087m5493n1442o470r625R973L5932K9475K8468n372L0574m921
14503D8912M533m9837j9296J6633m630J7653k0574K0723J4628k9703K3064M2755
14491F4861K8253l2683j7168j4714k8272k7016l0740L1549k2866o3331j1655L3050
$$ plain form
14578 15142 41261 46252 64686 58121 35191 36004 19546 16582 23689 32486 44745 16117 -7352
14565 -7352 -16852 2084 -50197 -55331 -35436 -14326 -25279 -30851 -22857 -36881 -15944 -18606 -12136
14552 -12136 2683 -22941 -20783 17522 -2844 -56734 -58060 -27565 -52178 -8562 -2473 12942
14540 12942 -7059 -259 27955 -1549 -14930 11103 17622 2262 -30957 -70057 -90954 -62378
14528 -62378 -23510 -8939 -10034 -26004 -45023 -59754 -27938 -4353 19246 25591 32015 17921
14516 17921 42900 37813 -7680 -59122 -65592 -75217 -65244 -29312 163 28631 23259 53833 48912
14503 48912 53445 3608 -15688 945 -3685 13968 -6606 14117 28745 -958 22106 64861
14491 64861 93114 60431 43263 28549 277 -26739 -57479 -25930 -48796 -112127 -123782 -90732
14479i0732N5245M5087L7342j1874p296j5263J2838k2148J788j7338k952L2039
14467A6736M906K7812M0076j2869j7108k2806j3791K8638N5280J3588k8993j3293
14455G8176p128K2088L4248l843p4668q6019p154M0959K7536m3420J6265J7615
14443A4655M318n2028j1087L8313L5468k508j9494j2685J0641J565l008K8277
14431C2427O594m6001j8248K7879K1000l099j5119j9938M435j1585k9629Q721
14419d2563K5676J1761j7955m53j0382J620K5996j9084K334j5334R614K2759J4032
14406H021K4121k3526n2508p463J1061M7426J7973o627n6211n2025M8657L6464
14394d637J8397j3738n6123q842K4429J1459n4k0730k9078K548K5608K0302M3284
$$ plain form
14479 -90732 -35487 9600 46942 35068 27772 12509 25347 3199 4987 -12351 -15303 16736
14467 16736 21642 49454 89530 76661 59553 36747 22956 51594 106874 120462 91469 78176
14455 78176 71048 93136 127384 123541 48873 -37146 -44300 -3341 24195 -19225 -2960 14655
14443 14655 18973 -33055 -44142 -5829 29639 27131 7637 -5048 5593 7158 4150 32427
14431 32427 39021 -6980 -25228 2651 23651 20552 5433 -14505 -10070 -21655 -51284 -42563
14419 -42563 -16887 -5126 -23081 -23534 -33916 -32296 -6300 -25384 -23050 -38384 -28770 -6011 8021
14406 8021 32142 8616 -43892 -51355 -40294 7132 25105 18478 -37733 -89758 -41101 -4637
14394 -4637 13760 22 -56101 -64943 -40514 -29055 -29109 -49839 -78917 -76369 -50761 -30459 12825
14381A2825Q057J0763k1328n225N2201k312j9683K3683L0157k1624K0792L000
14369I1306L646K8214Q3356Q7029J01573J79160K33624K32926J07682N047l2698
14358A120865j7482q9766j77923j87709j67285j48645j05746m9315j153k7942
14348A47899m6490m798J4148j7782j9336L6435K7177l9537k8762j7523o4684J3771
14336E18j0302K6319j571j6871m4796J9249j967k8060R766L7295M214m490L0880
14323B0184n2925p13j573J2138m8793k2474K1832R837k8841M4070L6396m6402
14311e7264l2208L0577M8778O008M851o159J1594m4448J3379J5623J1001J2163
14299A3895q300j3878L345J3047r911l6332L5025N3321K061l533j3698j4043L8550
$$ plain form
14381 12825 20882 31645 10317 5092 57293 54981 35298 58981 89138 67514 88306 91306
14369 91306 94952 123166 206522 293551 395124 574284 807908 1040834 1148516 1153563 1120865
14358 1120865 1103383 1013617 835694 647985 480700 332055 226309 176994 175841 147899
14348 147899 101409 96611 110759 92977 73641 110076 137253 97716 68954 51431 -13253 518
14336 518 -9784 16535 14964 -1907 -46703 -27454 -29421 -57481 -47715 -10420 -6206 -10696 20184
14323 20184 -32741 -33454 -35027 -22889 -71682 -94156 -72324 -62487 -91328 -47258 -10862 -57264
14311 -57264 -89472 -58895 -10117 -4109 742 -5417 6177 -38271 -24892 -9269 1732 13895
14299 13895 5595 -8283 -4938 8109 -1802 -38134 -3109 50212 52273 48740 35042 20999 59549
14286E9549k2267j033j0966n0206j3121K3729j0083J5766K1304j713k2148l380
14274a4569K3425K7243m2536j9949k413L165K2972j6520M594q551j7081m7190
14262h7410j1108J8139K6898K1063p542p893n5876l1533L8781K0729j3791p495
14250i7038l018J9178L5374l3126n874K4802M7516o995k6647J4058J3565p254
14238b5459j835q22j413l348K902M5236N391l3903o8184K4452k0878K63J283K0198
14224e6117L7958k7131n5634l7481M3447L0857L5338K4715k3484r646J938P536
14212b7704l5196l6028j6342K4269M2826j8771J0113L5684m937K849M05M045k313
14199b1100n2329Q413K9531k340j0796M118J3405p48j0871j1795k9800J3119L0905
$$ plain form
14286 59549 37282 36249 25283 -24923 -38044 -14315 -24398 -8632 12672 10959 -11189 -14569
14274 -14569 8856 36099 -6437 -26386 -28799 -25634 -2662 -19182 -14588 -23139 -40220 -87410
14262 -87410 -98518 -80379 -53481 -32418 -39960 -47853 -103729 -135262 -96481 -75752 -89543 -97038
14250 -97038 -100056 -80878 -45504 -78630 -84504 -59702 -12186 -19181 -45828 -31770 -18205 -25459
14238 -25459 -27294 -28116 -29529 -32877 -29975 15261 20652 -13251 -81435 -56983 -77861 -77598 -76315 -56117
14224 -56117 -18159 -45290 -100924 -138405 -94958 -64101 -28763 -4048 -27532 -37178 -35240 -27704
14212 -27704 -62900 -98928 -115270 -91001 -48175 -66946 -56833 -21149 -26086 -23237 -22832 -18787 -21100
14199 -21100 -73429 -65016 -35485 -37825 -48621 -44503 -31098 -31846 -42717 -54512 -84312 -71193 -40288
14186d0288k310k183K3760J1390K653k1694K617K1693M0K0706j8971l4532j5136
14173e2255j811L3260O9260Q181J3618M9850k3380k3752P5656N6662J4584k8181
14161A91692Q571n1251o0706m0667l4975J7637J1046k1857o2781o4900m2219M0872
14149a09538K8570J5176K1219R233j963j3461J626r463l6563m1805L4857K9525
14137g2587n983M2836M0246j9335j5140m0418M0882M6449K1961J1547j6739m2841
14125i122k5104L7668K8067M917o329k0696K1638n702J3865M538J8634k410k0703
14112C9261j9548l1103R203j4544k6691k1402j1313K4011M6247J7576J8937j7816
14100A2818p9177R935M3264M5433M2384m9204m4092k9161k7236L4005O4745p30
$$ plain form
14186 -40288 -42598 -44781 -21021 -9631 -6978 -28672 -26055 -4362 -4322 16384 -2587 -37119 -52255
14173 -52255 -54066 -20806 48454 56635 70253 120103 96723 72971 148627 205289 219873 191692
14161 191692 200263 149012 88306 47639 12664 30301 41347 19490 -43291 -108191 -150410 -109538
14149 -109538 -80968 -65792 -44573 -35340 -37303 -50764 -49138 -58601 -95164 -136969 -102112 -72587
14137 -72587 -78570 -35734 4512 -14823 -29963 -70381 -29499 16950 38911 50458 33719 -9122
14125 -9122 -34226 3442 31509 36426 30097 9401 31039 25337 39202 43740 62374 59964 39261
14112 39261 19713 -11390 -2187 -16731 -43422 -64824 -76137 -52126 -5879 11697 30634 12818
14100 12818 -66359 -56424 -13160 32273 74657 25453 -18639 -47800 -75036 -41031 23714 22984
14088B2984k1581o7767l5269j4698K4697M668o425L8832J0944j1697r996l0652
14076i5960O702L5367M2281j8642m886k7803k7864k7592j540K4336J8111J9798
14064e7692j6899R979j0076N886K2724K420K351r565M794J3804K0025Q74k5100
14051c6475k1578m136j2612N618j525J6574K0782N1029L908J3379L668J0824L0686
14038H0142k802j3805J9746K5648K1012M4212J0763k0446j8641l6465l2005O955
14026H4314k9610M260O437K5415k9407m4515j1464J8788J1334J9934j2102J5282
14014E8666P333m2642j6100m0465j6514M7356J6499k7758j5998P3892L5647m533
14002G5383Q303Q652l3874k2545K9112r175J1911J3862k6903J0388L2917J8809
$$ plain form
14088 22984 1403 -66364 -101633 -116331 -91634 -86966 -93391 -54559 -43615 -55312 -65308 -95960
14076 -95960 -89258 -53891 -11610 -30252 -35138 -62941 -90805 -118397 -119937 -95601 -77490 -57692
14064 -57692 -74591 -64612 -74688 -68802 -46078 -43658 -41307 -50872 -46078 -32274 -12249 -11375 -36475
14051 -36475 -58053 -62189 -74801 -69183 -70708 -54134 -33352 17677 21585 34964 38632 49456 80142
14038 80142 77340 63535 83281 108929 129941 174153 184916 164470 145829 109364 77359 84314
14026 84314 54704 58964 65401 90816 61409 16894 5430 24218 35552 55486 43384 58666
14014 58666 65999 23357 7257 -33208 -49722 -2366 14133 -13625 -29623 44269 79916 75383
14002 75383 83686 92338 58464 35919 65031 55856 67767 81629 54726 65114 98031 116840
13990A16840n5486j2487O965K9063j5718k4540K015L250p853O115K4517R327K3747
13977A05755J5899r293K9348O0782Q3695k1423m6768J3008M6063q944K1417J591
13965B91130l097j0409j5986L7103M1044j034K1989K42j9774j2856j9025M9568
13953C58895Q7316k0077K3422J15122P9898Q8031P1236N0874O640N8391P3764
13942I93512L9097N4071N4069J40538J16371K09486K48724K26547J93633K25694
13932B501742L20738L56535L84474M28107N75378P10271R22207J175507J458070
13923H833029J733486J956022K170569K749095L628773M881434P093577J0838714
13915D3884699J7182473K6972802L9236950M6007835L5925827J8343081M572319
$$ plain form
13990 116840 61354 48867 55832 84895 69177 44637 46652 49902 42049 48164 72681 82008 105755
13977 105755 121654 112361 141709 202491 286186 264763 217995 231003 277066 268122 289539 291130
13965 291130 288033 277624 261638 298741 339785 338751 360740 360982 341208 328352 309327 358895
13953 358895 446211 426134 449556 564678 644576 732607 803843 854717 861357 919748 993512
13942 993512 1032609 1086680 1140749 1281287 1397658 1607144 1855868 2082415 2276048 2501742
13932 2501742 2822480 3179015 3563489 3991596 4566974 5277245 6199452 7374959 8833029
13923 8833029 10566515 12522537 14693106 17442201 21070974 25952408 33045985 43884699
13915 43884699 61067172 88039974 127276924 173284759 209210586 227553667 232125986
13908B32125986k825494j5455881l2564292m4219258l9045639k6592651j7043387
13901E4379384j1202346p649624n497058m223409l366448k752017k318787k046628
13893A5323067j858345j586296j376832j132056r08000p39029o02896n14946m65743
13884F138924l87892l00479k82591k40793k17562k29720j98497j76110j55097
13875C950183j78742k02961j63879j78810j61327r5245j56416j17830r0132j40171
13865B464670j76766j28707j00008q4829j24904p3112p4086o5094o0381r8068
13855A478715p0984n0364m8955o0878l2081m8967o6455n4622J2134r858l2242
13844A015443k947j0385n1492o6618m8699j5834j9636l6398j8469k8365k2269
$$ plain form
13908 232125986 229300492 213844611 181280319 137061061 98015422 71422771 54379384
13901 54379384 43177038 35527414 30030356 25806947 22440499 19688482 17369695 15323067
13893 15323067 13464722 11878426 10501594 9369538 8461538 7722509 7119613 6604667 6138924
13884 6138924 5751032 5450553 5167962 4927169 4709607 4479887 4281390 4105280 3950183
13875 3950183 3771441 3568480 3404601 3225791 3064464 2969219 2812803 2694973 2604841 2464670
13865 2464670 2287904 2159197 2059189 1974360 1849456 1776344 1702258 1637164 1576783 1478715
13855 1478715 1407731 1357367 1308412 1247534 1215453 1166486 1100031 1045409 1057543 1047685 1015443
13844 1015443 1012496 1002111 950619 884001 835302 819468 799832 763434 744965 716600 694331
13833F94331j1102l8900k0178J6938l305n0927k2428k0941j7874j5984j4661R835
13821E04804l586l6898k4899k5964m0931J5415q62K2970L5253l070m693j9455
13809D18084n7932j918L5687l9891P551N9422J6769j5559j4788K413k3757R573
13797C95654K8037l3729l6309j9203r596q618j654j4209k282M6127L1510N704
13785C81432p698K1500M2220L1096K9736K8042M1640J46m7507o7409m358n784
13773D43056k8834K8098O571J4310l0711l5403L6698k9192l0660P164o913j5187
13761C58997n1657l1318k4415j319j2499J3702j0064J9636L4509m139n894M317
13749B89856j0381m0867n4176K7679J424R982K1858J1907J2171p572l7868l5751
$$ plain form
13833 694331 683229 644329 624151 641089 637784 586857 564429 543488 525614 509630 494969 504804
13821 504804 501218 464320 439421 413457 372526 387941 387079 410049 445302 442232 437539 418084
13809 418084 360152 358234 393921 354030 361581 421003 437772 422213 407425 409838 386081 395654
13797 395654 423691 389962 353653 334450 324854 316236 314582 300373 298091 344218 375728 381432
13785 381432 373734 395234 437454 468550 498286 526328 567968 568114 520607 453198 448840 443056
13773 443056 414222 442320 448891 463201 432490 397087 433785 404593 373933 381097 374184 358997
13761 358997 307340 276022 251607 250288 237789 251491 241427 261063 295572 291433 285539 289856
13749 289856 279475 238608 184432 212111 213535 223517 245375 257282 269453 261881 224013 188262
13737A88262L1207N190m4389K8499p241k0962j2371j9669n4044l867Q8633L4811
13725B14059l7058K1817K2799j3062j7370k0083J4877k2671k0870L288J3845K4810
13713A84381M539l839j9629L0393M1139l2520o1185k8027L1909L1395j0039m9342
13701A19175k395L8825K6599K3837N469l1185l4798m0985j6329K6662M1538j978
13689A54435K7296j1577l9320k7196K803N250L7579J6267K266l1333p15K4732
13677A60487J0299q396o650J527K1447K035K4129J4211K0940l0034m3819l7717
13665A28459J7491K9298k0790j0296M710n0427R334N993q22n848l6739l9751R268
13652C9880n785J6333K7968J6720L7828n330K6196K240o1198n2945O9329L947
$$ plain form
13737 188262 219469 224659 180270 208769 201528 180566 168195 148526 94482 90615 179248 214059
13725 214059 177001 198818 221617 208555 191185 171102 185979 163308 142438 145726 159571 184381
13713 184381 188920 185081 165452 195845 236984 204464 143279 115252 147161 178556 168517 119175
13701 119175 116780 155605 182204 206041 211510 180325 145527 104542 88213 114875 156413 154435
13689 154435 181731 170154 130834 103638 106441 111691 149270 165537 167803 136470 135755 160487
13677 160487 170786 162390 155740 157267 178714 180749 204878 219089 240029 209995 166176 128459
13665 128459 145950 175248 154458 144162 148872 98445 107779 113772 112950 107102 70363 30612 39880
13652 39880 34095 50428 78396 95116 132944 127614 153810 156050 94852 41907 111236 115183
13640A15183K8943O3920P47j020K9299O8116R328o1631p5355l8302k4764j5785
13628I8679m8781p174L3518K8218J1018M474R412O995n986K260K2598l150n2644
13615I9437k0637J2251n379j0613N967K2550M001Q406L1115P91k9884p614j0727
13602I9664L615J1426j4176J5787L145j2765k994l5153l1731J3875K6694L8611
13590A15998k7245l0534l4939K8155k4763K3717J9523K0014Q986q518K4710j7484
13578I7620p6L6028l2449k3716K7606l844J8904j7443j9778m2608L1556O4799
13566A36599K2314k8104N1026n7280j8200O395n9405p92M0999j3933K511l622
13554G8508K7711J5170l1331j1635J437n749J5349J4454J4146j9652j5441j7878
$$ plain form
13640 115183 144126 208046 208793 207773 237072 305188 314516 252885 177530 139228 114464 98679
13628 98679 49898 42724 76242 104460 115478 119952 129364 136359 130373 132633 155231 152081 99437
13615 99437 78800 91051 85672 75059 81026 103576 107577 115983 147098 147889 118005 110391 99664
13602 99664 103279 114705 100529 116316 119461 106696 103702 68549 36818 50693 77387 115998
13590 115998 88753 58219 23280 51435 26672 50389 69912 89926 98912 90394 115104 97620
13578 97620 97544 133572 101123 77407 105013 101169 120073 102630 82852 40244 71800 136599
13566 136599 158913 130809 181835 124555 106355 112750 53345 52553 93552 79619 82130 78508
13554 78508 106219 121389 90058 78423 79860 74111 89460 103914 118060 98408 82967 65089
13542F5089j6111L6595J9171K6130q609q784J2531l7007n678K4279R544k0808
13530I6342K6474P617l2679j9417K403m437Q304p7998j7882J8174k1712L0325
13518A5514M509o958K3997M2821k9919j2338K134L2420M4722L6473m85K1301k0883
13505A53308n5875k0740J70l796n6179m968K9104L5269l1077k5895K7325N933
13493E2579L617K3206k6725l786o805q669L7663M2494l1726k4381L2182L6552
13481A26201L106m5398n4418k0162l3283j3542N7152M551j9057j342M9792K2366
13469G5966O3117L4656m1013j44R543J2595J2768j2432K6892M8867L7510N8125
13457C26450J21462J91004J72594J86600J47207M8919M4645m1258j07466j60442
$$ plain form
13542 65089 48978 85573 104744 130874 122265 113481 126012 89005 83327 107606 117150 96342
13530 96342 122816 130433 97754 78337 80740 76303 84607 6609 -11273 6901 -14811 15514
13518 15514 20023 13065 37062 79883 49964 37626 39760 72180 116902 153375 152890 174191 153308
13505 153308 97433 76693 76863 73067 16888 11920 41024 76293 45216 19321 46646 52579
13493 52579 56196 79402 52677 48891 42086 33417 71080 113574 81848 57467 89649 126201
13481 126201 129307 83909 29491 9329 -23954 -37496 19656 24207 5150 3808 53600 75966
13469 75966 139083 173739 132726 132582 142125 154720 167488 155056 181948 230815 268325 326450
13457 326450 447912 638916 811510 998110 1145317 1194236 1238881 1197623 1090157 929715
13447I29715k25371j75444j24701r4102m6798k2541p253n6486l7627J0862L5740
13436A85994L9377q014m1596p1690m1722J6056K5193q10m700J3462l5996l4161
13424D1393K803L8658L9965J2562k2892m2871j8829K9715l673J7008j1386m2786
13412C9667N638M2447j9838l4656m7099J4384J889M2500K0185j9522j7781J0002
13400C7816o132K9310m6959j7118N705J6032J2344L3410J2070J4454J3510l2783
13388G1659J073K3904j0398l5141N0004L328m8746j6857L378J4082j069k8421
13376B6796k0649j4640M542k5713O461j971J3105O649Q350l8426L5176K1190l4937
13363a4067j8255J2965M8496J6732j5873K6651K4929j1100l4520k2367j2003k2988
$$ plain form
13447 929715 704344 528900 404199 310097 263299 240758 233505 177019 139392 150254 185994
13436 185994 225371 217357 175761 104071 62349 78405 103598 102788 98088 111550 75554 41393
13424 41393 44196 82854 122819 135381 112489 69618 50789 80504 76831 93839 82453 39667
13412 39667 45305 87752 67914 33258 -13841 543 2432 44932 65117 45595 27814 37816
13400 37816 31684 60994 14035 -3083 2622 18654 30998 64408 76478 90932 104442 71659
13388 71659 72732 96636 86238 51097 101101 104429 55683 38826 42204 56286 55217 26796
13376 26796 6147 -8493 -3951 -29664 -23203 -25174 -12069 -5420 2930 -35496 -320 20870 -14067
13363 -14067 -32322 -19357 29139 45871 29998 56649 81578 70478 35958 13591 1588 -21400
13351b1400J9172M1008K861m3080J3275J8577J6109P148O707J2305k7868n3322
13339h508J794K6458K3138M287k6843m743J5359J9240Q233p078p551O747j692
13326D8841m631l4851k866M4993L1553J6089k9425k6787k5643L6989j4096p809
13314C2357j4670l930J9656q860l0228J9592K1985k725k4526J4263L05k5451J8286
13301A6054J8836l8703J89K3298L8313J8537l6186J9541M0338q190p4536J120
13289A8611J5821r556k4819k1470j9415M0695J8776k6091J4J9237Q364j3231J1140
13276A8076J6423j4524l3618J7055J8244q419n9415M617P7691M3674j4912j349
13264F3543p693j8291J657J6637k4366j7189R226k4382J3879J8675L474n480J5145
$$ plain form
13351 -21400 -2228 38780 41641 -1439 11836 30413 46522 53670 60377 72682 44814 -8508
13339 -8508 -6714 19744 42882 47169 20326 15583 30942 50182 58415 51337 43786 50533 48841
13326 48841 44210 9359 6493 51486 83039 99128 69703 42916 17273 54262 40166 32357
13314 32357 17687 13757 33413 24553 -5675 13917 35902 33177 8651 22914 23219 -2232 16054
13301 16054 34890 -3813 -3624 19674 57987 76524 40338 59879 100217 92027 17491 18611
13289 18611 34432 24876 57 -21413 -40828 -133 18643 -7448 -7434 11803 20167 6936 18076
13276 18076 34499 19975 -13643 3412 21656 13237 -46178 -41561 36130 79804 64892 63543
13264 63543 55850 37559 39216 55853 31487 14298 23524 -858 13021 31696 35170 29690 44835
13251D4835Q502j2773K882k4530k1336k6230j5636J9311K2504N951J2637j0856
13239E261Q526j7005M168P096n841j3842L0337K1560L4590m3693j7411M1875J9815
13226G5436L8311k4759o5614o541n1725n1852L0384M0960M7621M4403k6066p9489
13214b8931N701J8976J6429n268j1269j372J146k3038L9975K9895p105l2998n685
13201c544p494j0410L411K8701j5663J1886L1628k3451k7391k4587L9407J7628
13189B0121J6108L3366j0653k2590P020j2852l2586N832J0345k354r083l1175
13177b8501j0053L5724J6383R604p928K337n5595M2363M4873k9759j590O626M0470
13164F4954L015o1712p444j1245j526K9734J7114J1720J132p231l0631o02J874
$$ plain form
13251 44835 53337 40564 43446 18916 -2420 -28650 -44286 -24975 -2471 3480 16117 5261
13239 5261 13787 -3218 950 8046 2205 -11637 18700 40260 74850 31157 13746 55621 75436
13226 75436 113747 88988 23374 16833 -34892 -86744 -56360 -15400 32221 76624 50558 -28931
13214 -28931 -23230 -4254 12175 6907 -4362 -5734 -4588 -27626 12349 42244 35139 2141 -3544
13201 -3544 -11038 -21448 -18037 10664 -4999 6887 38515 15064 -12327 -36914 2493 20121
13189 20121 36229 69595 58942 36352 43372 30520 -2066 3766 14111 11757 2674 -28501
13177 -28501 -38554 -2830 13553 23157 15229 17566 -38029 4334 49207 19448 17858 24484 64954
13164 64954 67969 6257 -1187 -12432 -13958 15776 32890 44610 45742 38511 7880 7278 9152
13151I152L708K2594K1982K817k6792j8331L876M685q24L8j7650l048O006k1102
13137a2889j7897L4697k4959J1088j5973j3680m026M8962O527q361k6793k9939
13125e3243o696M7867j139J1664j1955J7536L3609K25n7219j1885J9693k5244
13113c6787Q410j1900j2226J8043L7924J2484L2452l31k6778k0644o109K1623
13101A6161O6514J9739M9867K8546n706k4587k4274j8143p940k1605J632P493
13089H7697k0289p126J0670J6361k7539n3707m4760j3204M1231j1732m809L5787
13077H580l974l3212K5208M414k3734K0741K3574J3410j00J5528k4459j009k9097
13064d130l3103j099N7100Q223k3864j8385k2684j8627M1727o775K2265n789L0577
$$ plain form
13151 9152 12860 35454 57436 60253 33461 15130 19006 23691 22867 22905 5255 2207 8213 -12889
13137 -12889 -30786 3911 -21048 -9960 -25933 -39613 -43639 5323 11850 3489 -23304 -53243
13125 -53243 -59939 -12072 -13211 -1547 -13502 4034 37643 37868 -19351 -31236 -11543 -36787
13113 -36787 -28377 -40277 -52503 -34460 3464 15948 48400 48069 21291 647 -5462 16161
13101 16161 82675 102414 152281 180827 175121 150534 126260 108117 100177 78572 80204 87697
13089 87697 67408 60282 70952 87313 59774 6067 -38693 -51897 -10666 -22398 -27207 8580
13077 8580 4606 -28606 -3398 1016 -22718 -1977 21597 35007 34907 50435 25976 24967 -4130
13064 -4130 -37233 -38332 18768 26991 3127 -15258 -37942 -56569 -14842 -21617 648 -5141 25436
13051B5436N3255K6917J4696k059p687k1299m8055o112q238j3999j4335m5219
13039d6699L2569L7938K6631J9581k446K9426l451l5840k8547K1015K7565n2834
13027B4908j441J2748L664l6126p906J4072k8606J9568N5195l6886M60K1495k4598
13014A6547L686L4748J2153Q914m9248L9629J556l2711m0464l3521j2555J9478
13002c1788L6052K0070j309r660j75j1888k3696k1085l3969M428J6257o160j3827
12989g6750K1348j190L0293K7860J0465k118m6938j0005j8912K7290q218J2600
12977c4275O5139R819j4553k4184j453K890L4544m3852k9314N323K5671O1249
12965E7004l591k0953K4148N0728L8512K8462n8537l7925l3567j2611K6512l8140
$$ plain form
13051 25436 78691 105608 120304 118245 110558 89259 41204 35092 26854 12855 -1480 -46699
13039 -46699 -14130 23808 50439 70020 67574 97000 93549 57709 29162 50177 77742 24908
13027 24908 23467 36215 39879 3753 -4153 9919 -18687 881 56076 19190 19650 41145 16547
13014 16547 20233 54981 67134 76048 26800 66429 67985 35274 -5190 -38711 -51266 -31788
13002 -31788 4264 24334 23025 13365 13190 1302 -22394 -43479 -77448 -73020 -56763 -62923 -76750
12989 -76750 -55402 -56592 -26299 1561 12026 9908 -37030 -47035 -65947 -38657 -46875 -34275
12977 -34275 30864 40683 26130 1946 493 3383 37927 -5925 -35239 -29916 -4245 57004
12965 57004 53413 32460 56608 107336 145848 174310 115773 77848 44281 31670 58182 20042
12953B0042j2030J3730J258K2954k7151n294J4685k1973j4903k8311r94N5332
12941A7345q228m1226j1668L5993J1288J7613K3416j793L3230L4084j6846l0313
12929F2895j5986q290j5897Q397K217r455L2172J8139k2050J7745J7258L6336
12917A23481J252J5675L8620M9354O7457J29618K05683L43805M97130N12760K19802
12906B204637k4318q2008l10543n34874m22300j96590j44178j17363n5469o3259
12896B53735p3162j0193l3187k4039N693n146M2228M34o6984l8940L4679J9183
12884A04301m4301k0398j9558j1143K7435o365J4412L0433J1435k4996j6527q699
12872C6029J4820J5005O735L1961j3661l674M7062J5966J0601j8509k3799O624
$$ plain form
12953 20042 8012 21742 23000 45954 18803 13509 28194 6221 -8682 -36993 -37987 17345
12941 17345 9117 -32109 -43777 -7784 3504 21117 44533 42740 75970 110054 93208 62895
12929 62895 46909 38619 22722 31119 33336 23881 56053 74192 52142 69887 87145 123481
12917 123481 124733 140408 179028 228382 295839 425457 631140 974945 1472075 1984835 2204637
12906 2204637 2180319 2098311 1787768 1252894 830594 634004 489826 372463 316994 253735
12896 253735 180573 170380 137193 113154 118847 113701 155929 156363 89379 50439 85118 104301
12884 104301 60000 39602 20044 8901 36336 29971 44383 74816 86251 61255 44728 36029
12872 36029 50849 65854 72589 104550 90889 87215 134277 150243 160844 142335 118536 125160
12860A25160O1278P4341M6656J04161P0954q159l6636p0109j14628o9540l4047
12849A49431l6678l8680j5374L2297m080q203l173n0773l1668p246j4070l8300
12837f6517K1679r46M5208k41J5964M0402J4573j4314j6209p939l34n148j3976
12824A2202R234J6880J9110R8k2067k6590K1808N8886J0246m1903l2472j1417
12812A4015k946J1174j3202k142J9005J1J7856j8299o698L4611j3803m2351p0603
12799g3372J1997N1889J6263n16j1431j2833R107L414R828j7328l3296K0084L2512
12786F318O903J8232K1943j8798K894j4677l2601k4677K972R785J8818K197j8023
12773a8714j1935j4765M3346J1349O70J7666L1050n242k0651m378J257L742J023
$$ plain form
12860 125160 186438 260779 307435 411596 482550 474391 437755 367646 253018 183478 149431
12849 149431 112753 74073 58699 90996 86916 78713 75540 24767 -6901 -14147 -28217 -66517
12837 -66517 -44838 -45784 -576 -817 15147 55549 70122 55808 39599 31660 31326 26178 12202
12824 12202 21436 38316 57426 57524 35457 8867 30675 89561 99807 57904 25432 14015
12812 14015 11069 22243 9041 6899 25904 25915 43771 25472 18774 53385 39582 -2769 -73372
12799 -73372 -61375 -9486 6777 6261 -5170 -18003 -8896 -5482 4346 -12982 -46278 -26194 6318
12786 6318 13221 31453 53396 34598 37492 22815 -9786 -34463 -31491 -21706 -2888 -691 -18714
12773 -18714 -30649 -45414 -2068 9281 9951 27617 58667 53425 32774 28396 29653 33395 34418
12760C4418m618q277l359K3862L72n7984m5081K7255N3188m684m1741L336K0191
12747c122K3066j0993L1653J805r905j1089j6468K3764r727R163J5809J8804k3450
12734C9310n2399l9199N7239L1161K0033J439n6272o945N9024P4078L9350K0475
12722A87294O6804J0882j6731k5747q0063q5530m6801J4861K9406j1027j4964
12711B8384l5839l5306j1199L491K3373M1212l673l4869q185n269J444m068K0182
12698b0322J0203M550l4289J6414J0378K0032K5204J1682j6505J569J7381q3365
12686c7068n3802J4482j5931K265L6659J1311J4691j4660k4545J9331L1064L9341
12674B3138J0074M891K507j8245l2496k8862j3713m3410K3877M08O044N9136M1587
$$ plain form
12760 34418 29800 21523 18164 42026 42398 -15586 -60667 -33412 19776 15092 -26649 -23313 -3122
12747 -3122 19944 8951 40604 42409 32504 21415 4947 28711 18984 28147 43956 62760 39310
12734 39310 -13089 -52288 4951 36112 56145 57584 1312 -5633 53391 127469 166819 187294
12722 187294 254098 264980 248249 222502 142439 56909 10108 24969 54375 43348 28384
12711 28384 -7455 -42761 -53960 -50469 -27096 14116 10443 -24426 -32611 -37880 -36436 -40504 -20322
12698 -20322 -10119 -5569 -39858 -23444 -13066 6966 32170 43852 27347 28916 46297 -37068
12686 -37068 -90870 -76388 -92319 -90054 -53395 -42084 -27393 -42053 -66598 -47267 -16203 23138
12674 23138 33212 38103 40610 22365 -10131 -38993 -52706 -96116 -72239 -71831 -65787 -6651 34936
12661C4936L585N939K0203L2183j7068m6687n2320k1425K5884L5139L293n3979
12649c0317J8705J7991o7592p896J2056L0766j05n9564k0146l44K4687M5214L7050
12636E05m788m956J7234K0376j518N23l4226j3644r775N5941j4722O8J4426J2501
12622C7945j3468k3646K7414j8457k4587l5188L9190K7398l0711o3813p21J9081
12610e9563j6118n7358J814K4407Q245L5130R0510k8305m3053l43q487J0454k3881
12597f6548J5464N6970N9830R1846N0937J3139n351L2421K9275k4713r0422m0591
12585A22257j7518p394p054l3306k8466n707P752M8163K8983K0683P186L8472
12573A74051K9201P382k8611q4J2542l0247k971m7121j3302L151K8360k2930p247
$$ plain form
12661 34936 38521 44460 64663 96846 79778 33091 -19229 -40654 -14770 20369 23662 -30317
12649 -30317 -11612 6379 -61213 -69109 -57053 -26287 -26392 -85956 -106102 -106446 -81759 -36545 505
12636 505 -4283 -9239 7995 28371 26853 27376 -6850 -20494 -30269 25672 10950 11018 25444 37945
12622 37945 24477 831 28245 9788 -14799 -49987 -10797 16601 -14110 -77923 -78644 -59563
12610 -59563 -75681 -133039 -131225 -106818 -98573 -63443 27067 -1238 -44291 -44634 -53121 -42667 -66548
12597 -66548 -51084 5886 65716 157562 208499 221638 216287 248708 277983 253270 162848 122257
12585 122257 104739 97345 90291 56985 28519 22812 30564 78727 107710 128393 135579 174051
12573 174051 203252 210634 182023 181939 194481 164234 161263 114142 100840 103991 132351 109421 102174
12560A02174J152J3899K2791j3299J529M6708J9020j8539p538o778j268O8900
12548B28751L2012k0750l6009l7697k9900j7182m3360M7776K5024k8678l5544
12537H4443j0457k8689j9132k5271M6972J9499N8698N3894L6871P9814M1740M6208
12525C84590K0240J5447o806L934j034p93J6685M0927N1689J1999m27J6462K9483
12512E82396J0511L49j8897N2312M6051N0330N1681M9797L175O0404Q8776Q2200
12500A059085O9258Q4157J53103J58882J23556J13142J91246K83982L01490K83366
12490B821267L17272L57992L73977M24450N59078O78917P84559J061463J430429
12481H809404J933542K403160K716391L039883M006106N433344P005576J0287288
$$ plain form
12560 102174 103326 117225 140016 126717 128246 174954 193974 175435 167897 161119 159851 228751
12548 228751 260763 240013 204004 166307 136407 119225 75865 123641 148665 119987 84443
12537 84443 73986 45297 26165 894 47866 67365 126063 179957 216828 296642 338382 384590
12525 384590 404830 420277 413471 417405 416371 415578 432263 473190 524879 536878 536451 552913 582396
12512 582396 592907 593256 574359 626671 672722 723052 774733 824530 827705 888109 976885 1059085
12500 1059085 1128343 1212500 1365603 1524485 1648041 1761183 1952429 2236411 2537901 2821267
12490 2821267 3138539 3496531 3870508 4294958 4854036 5532953 6317512 7378975 8809404
12481 8809404 10742946 13146106 15862497 18902380 22908486 28341830 35347406 45634694
12473D5634694J6780208K7304453M5172876P4475020J05812632Q7437057J2203379
12466D14820319j843323j1661969q5648431j03937969o8558413l9790270k4381223
12459G8998721j6284092j1274957q238956o566649n254910m095607l355389l030530
12451B0897631k517131k074762j745128j404139j173164r95322q45713p37737
12443I404535o23619n04566m36221l68392k78505k68252k38046k62397k57316
12434F167221k45099k29569k07366j49574j27123j89991k54274k27708k46797
12425D289720k55460k52461k34368j98030j97914k10310j34433j16023j03498
12416B587223j21479j07355o2661q8531p3262n3640n0031o7676r0058n7905p3569
$$ plain form
12473 45634694 62414902 89719355 134892231 209367251 315179883 402616940 414820319
12466 414820319 412976996 401315027 315666596 211728627 143170214 103379944 78998721
12459 78998721 62714629 51439672 43200716 36634067 31379157 27283550 23928161 20897631
12451 20897631 18380500 16305738 14560610 13156471 11983307 10987985 10142272 9404535
12443 9404535 8780916 8276350 7840129 7471737 7193232 6924980 6686934 6424537 6167221
12434 6167221 5922122 5692553 5485187 5335613 5208490 5018499 4764225 4536517 4289720
12425 4289720 4034260 3781799 3547431 3349401 3151487 2941177 2806744 2690721 2587223
12416 2587223 2465744 2358389 2295728 2207197 2133935 2080295 2030264 1962588 1872530 1814625 1741056
12405A741056n9160k0774K0721k3254o1172m7421l6361J0271K251p0739q3524
12394A371894n1189K357j3359o0470l6550o4747l0648L5221L1404o532m1990n2393
12382A082998l8841l6736n5056q0415l9663j6073J6621j3095k9995R817r598K951
12370G92915M3745k1406m3373j6283O715M8015o709k4992n8316k5148J4678K6855
12358G36696j3415m6806k3829J1976N332J9292l0806o579k0625k1022J5730l2368
12346E93576o2473K7206K2488m3445j3452J15580M0671n850M5884L3975J0025
12335G64185L6163K7938k4564k9001L703p0788j0256L1465l3547M314j1319r909
12323F78384k4991l2274l1422j7474J623J0900J3843j7673q888j6641l7976K853
$$ plain form
12405 1741056 1681896 1661122 1681843 1658589 1597417 1549996 1513635 1523906 1526157 1455418 1371894
12394 1371894 1320705 1323062 1309703 1249233 1212683 1147936 1117288 1152509 1183913 1177381 1135391 1082998
12382 1082998 1044157 1007421 952365 871950 832287 816214 832835 819740 789745 799562 789964 792915
12370 792915 836660 815254 771881 755598 762313 810328 803619 778627 720311 695163 709841 736696
12358 736696 723281 676475 652646 664622 669954 689246 658440 651861 631236 610214 625944 593576
12346 593576 531103 558309 580797 537352 523900 639480 680151 674301 720185 754160 764185
12335 764185 800348 828286 803722 774721 778424 707636 697380 728845 695298 699612 688293 678384
12323 678384 653393 621119 589697 572223 573846 584746 598589 580916 572028 555387 517411 520264
12311E20264M308q140L2427J2870n3N975K9823k2858m2210k1912n252N4952Q488
12298E68682j2536m0721j241J4325r904J0401j657k0494k5047K5421K0372k2474
12286E05127K519L9024l6213k6362J2141n8787k4593L1293j9706J8808r884j4982
12274D18385k479J4760J0707K0119K9684R750l436L6710L9099J0804k4380o0697
12262D99026k6283j4227M145K4250J8439r8161n3212M6119O1501L0991q21k3949
12250D67818j3164l3763l5129n0851q803P1243P6514N1999k2769l4266q29j8456
12238D49544l4737m5742j0068L7374M1499K3931K6818k237n5466K093K4313J4544
12226D71866J5233o356j2288l2714p047l496j2874o438J6727j7051l7636N1552
$$ plain form
12311 520264 524572 516432 548859 561729 561676 567651 597474 574616 532406 510494 505242 560194 568682
12298 568682 556146 515425 514184 528509 518605 529006 527349 506855 481808 507229 527601 505127
12286 505127 507646 546670 510457 484095 496236 437449 412856 444149 424443 443251 433367 418385
12274 418385 415906 430666 441373 461492 491176 500926 497490 534200 573299 584103 559723 499026
12262 499026 472743 458516 462661 486911 505350 407189 353977 400096 461597 492588 491767 467818
12250 467818 454654 420891 385762 334911 326108 397351 473865 525864 503095 468829 468000 449544
12238 449544 414807 369065 358997 396371 437870 461801 488619 486382 430916 433009 457322 471866
12226 471866 487099 480743 468455 435741 428694 425198 412324 405886 422613 405562 367926 419478
12214D19478K4582l0064j0006o0720k4938K3735J3977P689K7824K0797o428N365
12202D11291l5643l7997K1180L1999L5795j0899K401O296m2542k5991K8955O789
12190C91634k3260r95L5848J9270q237j7751Q241j995N889J5146j9246j5141J757
12177C91160K1134j2085l6268j5470N5705K0911j8943p0630l8421J0487M4758
12166C52338M5209J8809l3831K583k5004K5378K2676K9948j0459k9946l3230k1350
12154C43121j450K3687J5527L772L3322q417M404l8144K1115J6711J4773P129
12142D35550l6165n9192O994K6077L6736J8872J2736L807Q941O702l4025o2133
12130C64900r611j6617L6409K6794k157J1817j9876m504l2406R156K7719J5319
$$ plain form
12214 419478 444060 413996 403990 343270 318332 342067 356044 363733 391557 412354 405926 411291
12202 411291 375648 337651 358831 390830 426625 415726 418127 424423 381881 355890 384845 391634
12190 391634 368374 367379 403227 422497 414260 396509 404750 402755 408644 423790 404544 389403 391160
12177 391160 412294 400209 363941 348471 404176 425087 406144 335514 297093 307580 352338
12166 352338 397547 416356 382525 385108 360104 385482 408158 438106 427647 397701 364471 343121
12154 343121 341671 365358 380885 384657 417979 409562 413966 375822 396937 413648 428421 435550
12142 435550 399385 340193 347187 373264 410000 428872 441608 445415 454356 461058 427033 364900
12130 364900 355289 338672 375081 401875 399718 411535 391659 387155 354749 363905 391624 406943
12118D06943j0962N530j4922k7567N224J7148j5813J338j1536J0341L4819J8068
12106D18611O693L2379L2304l0215m5750j3390k008N803l4108J5759J1409j064
12094C96423q234M138m8086K7730L7277K2982N6273m3778o0627J2319J0292J7475
12082D24184j3216n5645k2627L8586K2214k523J213J4950J7501K1375K3128J3924
12070D83064k2906j5594L8987J6996j8892q7308j8373j399J4539J8907k294J9714
12058D25441J7810j7966K8952M7757p526p773m0552o1121M1635M4988j8099j8241
12046D35305M590J3850L7069L9689l2325m4524l0422K9540J7607r956J5838K3309
12034D99570M89j1111j5881L1668M3061L4425N7525Q3818J49973J62816K95090
$$ plain form
12118 406943 395981 401511 386589 359022 364246 381394 365581 366919 355383 365724 400543 418611
12106 418611 425304 457683 489987 459772 414022 400632 398624 404427 370319 386078 397487 396423
12094 396423 388189 392327 344241 371971 409248 432230 488503 444725 384098 396417 406709 424184
12082 424184 410968 355323 332696 371282 393496 390973 392186 407136 424637 446012 469140 483064
12070 483064 460158 444564 483551 500547 481655 394347 375974 374575 389114 408021 405727 425441
12058 425441 443251 425285 454237 501994 494468 486695 446143 385022 426657 471645 453546 435305
12046 435305 439895 453745 490814 530503 498178 453654 423232 452772 470379 460423 476261 499570
12034 499570 500059 488948 473067 504735 547796 582221 639746 723564 873537 1036353 1331443
12023A331443M76068N69172K77095K7680j0276k59246n14202m55951l13612j29012
12013I99159j07474n9277p5563q1524j3202j7958k7907j6554n0432J1808k406
12002E58670m8151k3922N0467J2625j8744M420r263q621k5195j15J2787J6945
11990E21903J1743o66k8961J5206l6163j3310Q986L1805j5741L6273m774n698
11978E20603K5631m502n8748q3151J3280P1588N1608K1447k3090j452r731j1950
11966E11533M703j4381M1240m13J9708j1815k4415J1910m76o36j1210K2828K0068
11953E68644j6300k7777k4292N591P017J0733K0243K0960k4731Q569Q74J7010
11941E66541M5445j7148J0691L250l4297k7440Q740M7238K6583J4880j6806O047
$$ plain form
12023 1331443 1807511 2376683 2653778 2681458 2671182 2411936 1897734 1441783 1128171 999159
12013 999159 891685 832408 756845 675321 662119 644161 616254 599700 549268 561076 558670
12002 558670 510519 486597 537064 549689 530945 535365 526102 517481 492286 492171 504958 521903
11990 521903 533646 532980 504019 519225 483062 469752 478738 510543 494802 531075 526301 520603
11978 520603 546234 541732 482984 399833 413113 484701 536309 557756 534666 533214 523483 511533
11966 511533 516236 501855 543095 542682 562390 550575 526160 538070 537594 536958 525748 548576 568644
11953 568644 552344 524567 500275 505866 512883 523616 543859 564819 540088 548657 549531 566541
11941 566541 611986 594838 605529 608779 574482 547042 555782 603020 629603 644483 627677 633724
11929F33724j1659j1749K6170K0745l0520l3239L273j8847j1273L8836L9064L9357
11917F83882J6577j3808k6067l0779k9738j3283k650K2011M122J1709j0141K8361
11905F40196K3910n0006K0902k549K993L1923L8969n384K3910j7319o3412j6318
11893F27815K8724K6105j095L6959L0792j6436j0660n390K4837P12k1742l9037
11881F81584l387J1505k6304j6009J9976M0686N417l813J1327K3019K564N964
11869G52529k6583L7268L466l7906o3544M910j039J144m892P2745L1543n1258
11857G18383M799L3884K1482J3110M2818K716J9314K1295j8359O165K1436k0287
11845H66756P059K0530K6050k6695J3434M0302k2293L0915Q897K0599l440J0708
$$ plain form
11929 633724 622065 610316 636486 657231 626711 593472 596745 577898 566625 605461 644525 683882
11917 683882 700459 686651 660584 629805 600067 586784 584134 606145 610267 621976 611835 640196
11905 640196 664106 614100 635002 632453 635446 667369 706338 700954 724864 707545 644133 627815
11893 627815 656539 682644 681549 718508 749300 732864 722204 716814 741651 742363 720621 681584
11881 681584 678197 689702 663398 647389 667365 708051 713468 709655 720982 744001 746565 752529
11869 752529 725946 763214 766680 728774 665230 670140 669101 670245 665353 738098 769641 718383
11857 718383 723182 757066 778548 791658 834476 837192 856506 877801 859442 865607 887043 866756
11845 866756 873815 894345 920395 893700 907134 947436 925143 956058 964955 985554 982114 992822
11833I92822k8101l7733L701k3176k0053M057J6525l371P443j791k2803p124m6340
11820H34056j1941m942M507L1271K2756L128l147M990M6258m428m0879J8317k39
11807H99707k4424J062J3315j5795m2971j7150L6246J7103q023K1496O189J510
11795H88265K2720K0602q421M6954L4476q024o0018o2975Q049M8176M3919K5076
11783I98799J2361K0325l4106n3527l4289M0465l1028p232L1578P620M1073k7933
11771I64106M744L3966J0739L2757Q181K6843n585k6273K8330k5635o038k7639
11759A018496r164k2953m6750o313M2613M0448K5328k9872J842M2874O170m723
11747A057996J973j2668Q494L24M852N6609J3138J6827k2097q338L1956J8944
$$ plain form
11833 992822 964721 926988 930689 907513 887460 891517 908042 904671 912114 910323 887520 880396 834056
11820 834056 822115 817173 821680 852951 875707 878835 875688 880678 926936 922508 881629 899946 899707
11807 899707 875283 876345 889660 873865 830894 813744 849990 867093 859070 880566 886755 888265
11795 888265 910985 931587 923166 970120 1004596 996572 936554 873579 881628 929804 973723 998799
11783 998799 1011160 1031485 997379 943852 909563 950028 919000 911768 943346 950966 992039 964106
11771 964106 968850 1002816 1013555 1046312 1054493 1081336 1075751 1049478 1077808 1052173 1046135 1018496
11759 1018496 1009332 986379 939629 933316 975929 1016377 1041705 1011833 1013675 1056549 1062719 1057996
11747 1057996 1059969 1047301 1055795 1056119 1060971 1117580 1130718 1147545 1125448 1117110 1149066 1168010
11735A168010j5746p7588l1693q892J5010L9355J7023L4070k1080J8933M9338
11724A186740K4680j4967l3897Q685j0012K5709K23l3477n2802L2336J5197M458
11712A152873K0640M6159l1461k0563J3272L861j5303l675j3333k2445N4651J9246
11700A203922J9222r131j1596m2423l062R023J8919m165n4M0432J782k6189J6139
11687A212819M4620L0675L6828k4516l0986k2016O137J8004J1422m244n840L3849
11675A306752L7775N292k886p7640l1219L4659J7940N0482L1141k0687p106M6580
11663A391083O7790k1699r2963K042J3712L9694k8341j6238J3375l222j3371J1535
11651A363397J5413m769o004J4687K2396J1847K8558j0467l9860n0325J8124O9179
$$ plain form
11735 1168010 1152264 1074676 1042983 1034091 1049101 1088456 1105479 1139549 1118469 1137402 1186740
11724 1186740 1211420 1196453 1162556 1171241 1161229 1186938 1187161 1153684 1100882 1133218 1148415 1152873
11712 1152873 1173513 1219672 1188211 1167648 1180920 1184781 1169478 1165803 1152470 1130025 1184676 1203922
11700 1203922 1223144 1214013 1202417 1159994 1156932 1165955 1184874 1180709 1180655 1221087 1222869 1196680 1212819
11687 1212819 1257439 1288114 1324942 1300426 1269440 1247424 1253561 1271565 1282987 1278743 1272903 1306752
11675 1306752 1344527 1349819 1346933 1269293 1238074 1272733 1290673 1341155 1372296 1351609 1344503 1391083
11663 1391083 1458873 1437174 1344211 1346253 1359965 1399659 1371318 1355080 1368455 1365233 1351862 1363397
11651 1363397 1378810 1374041 1368037 1382724 1405120 1416967 1445525 1435058 1395198 1344873 1362997 1432176
11639A432176L9385k4686m3821m510J7803O3924L2135l0390l4807K85K0696p725
11627A460465J731j9899l112M7058L288j8826j1404K6685r658r462L5688J47j3765
11614A488936l485o172L1725M2193P7j9999k6380j3365K2822J2165K3520m396
11602A547641J218L1064j8492L963K7070o443j161M606Q726j5173K1998J0925
11590A615942J2022q315n175R18l6L5586r072n1447n2315Q310K8059L4094j674
11577A606897K4200k41r13k0333m502N3417M3170k422j1727q027k0235j7559l1274
11564A610451o228K0656K5396j819j7098J747J9016l794k886K3237j3166O528
11552A662040j3707j4639N2674M2174J6751k6840l0201k9829k3895L0745L5630
$$ plain form
11639 1432176 1471561 1446875 1403054 1398544 1416347 1480271 1512406 1482016 1447209 1447494 1468190 1460465
11627 1460465 1462196 1442297 1439185 1486243 1489531 1470705 1459301 1485986 1476328 1466866 1502554 1502701 1488936
11614 1488936 1485451 1479279 1511004 1553197 1553274 1533275 1506895 1493530 1516352 1528517 1552037 1547641
11602 1547641 1548859 1579923 1561431 1565394 1592464 1586021 1584860 1589466 1598192 1583019 1605017 1615942
11590 1615942 1627964 1619649 1614474 1615392 1615356 1650942 1641870 1590423 1538108 1546418 1574477 1608571 1606897
11577 1606897 1631097 1630856 1629943 1609610 1605108 1658525 1701695 1699273 1687546 1679519 1659284 1641725 1610451
11564 1610451 1604223 1624879 1650275 1648456 1631358 1633105 1652121 1648327 1645441 1668678 1655512 1662040
11552 1662040 1648333 1633694 1686368 1728542 1745293 1718453 1688252 1658423 1634528 1665273 1700903
11541A700903K2038j5539m6050L2736J8653J3192l5762K073Q475L528l0780l1466
11529A642001J2864K7870J0250k4593m1173M412K4222L5533m042l228L0114j0527
11517A703703r358l5588k5598M520L8190M7040M0584J1549j9532q991J8681O465
11505A771665j3075N0802L9145k4171l3104k111J0433l3961m6490k7489K4469
11494A716113L7012J3988n5591m0164N9117r867k4112o66L1047l6116M3774M2126
11482A776661k7992k7303J0765l129m696P316k2603J4965K495j5623m4943o643
11470A659270j5615K9972K2740k142L324J6616N7719K2951M944l7581m0156J5233
11458A737275J6978j3725n9838L5141K9756j5663q720K8737K3137L192k0644k4524
$$ plain form
11541 1700903 1722941 1707402 1661352 1694088 1712741 1725933 1690171 1692244 1700719 1704247 1673467 1642001
11529 1642001 1654865 1682735 1692985 1668392 1627219 1631631 1655853 1691386 1687344 1684116 1714230 1703703
11517 1703703 1694345 1658757 1633159 1637679 1675869 1722909 1763493 1775042 1755510 1746519 1765200 1771665
11505 1771665 1758590 1809392 1848537 1824366 1791262 1789151 1799584 1765623 1719133 1691644 1716113
11494 1716113 1753125 1767113 1711522 1671358 1730475 1720608 1696496 1695830 1726877 1690761 1734535 1776661
11482 1776661 1748669 1721366 1732131 1729002 1724306 1731622 1709019 1723984 1726479 1710856 1665913 1659270
11470 1659270 1643655 1673627 1696367 1694225 1697549 1714165 1771884 1794835 1799779 1762198 1722042 1737275
11458 1737275 1754253 1740528 1680690 1715831 1745587 1729924 1721204 1749941 1773078 1776270 1755626 1731102
11446A731102j9558j2300R438L43l6821q943K282k3164L4185M182J0501J573R49
11433A693769j4599n0714O34L5957j8567L570L3468O9815k1154n6905l7883L7235
11421A674626j4149o446m1787o3784J3057L8702j1563M0268L8935J7294K0689
11410A705842p294p6093m0688M5719K8882l9853J1050j1338K3647j6894K0068
11399A643048K2341P541j2152m5264m1492L1170K2969l9491k3735R282M722J940
11387A580879R770k3342L7913L7253K3811r2664p5919L5179K9307M5402Q293l6971
11375A578911m651j9529o57k0350k4441K8989N4648P270j3473J217l8274k8529
11363A521131k7987K4920J7124K3717K1349k1164j0416k9765k7743k3097l376
$$ plain form
11446 1731102 1711544 1699244 1708682 1709025 1672204 1663261 1665543 1642379 1676564 1680746 1691247 1692820 1693769
11433 1693769 1679170 1628456 1629090 1665047 1646480 1650050 1683518 1753333 1732179 1675274 1637391 1674626
11421 1674626 1660477 1654031 1612244 1548460 1561517 1600219 1588656 1628924 1667859 1685153 1705842
11410 1705842 1698548 1622455 1581767 1627486 1656368 1616515 1627565 1616227 1639874 1622980 1643048
11399 1643048 1665389 1672930 1660778 1615514 1574022 1605192 1628161 1588670 1564935 1574217 1578939 1580879
11387 1580879 1590649 1567307 1605220 1642473 1666284 1573620 1497701 1532880 1562187 1607589 1615882 1578911
11375 1578911 1574260 1554731 1554074 1533724 1509283 1538272 1592920 1600190 1586717 1587934 1549660 1521131
11363 1521131 1493144 1518064 1535188 1558905 1580254 1559090 1548674 1518909 1491166 1468069 1464693
11352A464693L5581N7485o555j2536K5175j7508l7171j5066j6868L1618K1831
11341A530679l7816k3811J3524M2225J9792j3849K5374j018l738l8392M500k6108
11329A491362O051j6015K7076o742m7178m7475l009K2794L1941j931N3635j670
11317A508839l3921L4053L0156n9303m6287R959K2037k0504j209M7257k7245J6088
11305A479920J8918n5924n5870l7314Q766K5624L267q745j7510j7986K120O690
11293A351956L7865O119Q798l8892p053o419J0951q51k7767m35N628K6180L547
11280A369627K6103J4590J0783j8068J0777j1166O98N641O985J1170J2024k3302
11268A415862k8908N587j2841l7837p96j5629O742K257K4074M2543L021m2221
$$ plain form
11352 1464693 1500274 1557759 1551204 1538668 1563843 1546335 1509164 1494098 1477230 1508848 1530679
11341 1530679 1492863 1469052 1482576 1524801 1544593 1530744 1556118 1555100 1551362 1512970 1517470 1491362
11329 1491362 1497413 1481398 1508474 1501732 1454554 1407079 1404070 1426864 1458805 1456874 1510509 1508839
11317 1508839 1474918 1508971 1539127 1479824 1433537 1443496 1465533 1445029 1443820 1491077 1463832 1479920
11305 1479920 1498838 1442914 1387044 1349730 1358496 1384120 1387387 1378642 1361132 1343146 1345266 1351956
11293 1351956 1389821 1395940 1404738 1365846 1358793 1352374 1363325 1362474 1334707 1334272 1339900 1366080 1369627
11280 1369627 1395730 1410320 1421103 1403035 1413812 1402646 1403344 1408985 1415970 1427140 1439164 1415862
11268 1415862 1386954 1392541 1379700 1341863 1341067 1325438 1332180 1334437 1358511 1401054 1404075 1361854
11256A361854k5467j8119J8250l761k8478R524j0535L215L9026K0824j929l2697
11244A331707k3333n5250l5365j5792L357k9900O419J0158p402Q085J3163m1l7684
11231A168122J3204M1186O195M3048k3964j1569J3402N410M6097j9433k3320k6662
11219A231716k4344n3326P811L0041L0610j2802p958l5703l3878J8252J1773k3609
11207A138583J544J9021J2950k3755O84K073o658l9783J0316j2450K554K6101
11195A131180j6536j8373K4105K591p423L3111k3663k706Q112o855l6287j1020
11183A076236K4813j6571N121M3201J4435K3115K574k6112m3918q705J6556J5371
11171A126116K9520J1858n0716j7218p947P13l327K9170k1745p222l324j0719
$$ plain form
11256 1361854 1336387 1318268 1336518 1332757 1304279 1313803 1303268 1306483 1345509 1366333 1364404 1331707
11244 1331707 1308374 1253124 1217759 1201967 1205324 1175424 1181843 1192001 1184599 1192684 1205847 1205806 1168122
11231 1168122 1181326 1222512 1228707 1271755 1247791 1236222 1249624 1255034 1301131 1281698 1258378 1231716
11219 1231716 1207372 1154046 1161857 1191898 1222508 1209706 1201748 1166045 1132167 1150419 1162192 1138583
11207 1138583 1140127 1159148 1172098 1148343 1149027 1151100 1144442 1104659 1114975 1102525 1105079 1131180
11195 1131180 1114644 1096271 1120376 1122967 1115544 1148655 1124992 1122286 1130398 1123543 1087256 1076236
11183 1076236 1101049 1084478 1089599 1132800 1147235 1170350 1172924 1146812 1102894 1094189 1110745 1126116
11171 1126116 1155636 1167494 1116778 1099560 1091613 1092326 1088999 1118169 1096424 1089202 1085878 1075159
11159A075159J2927p421l8152m5371M9151K7043j8866J7994j2890J6973L6282
11148A112829Q290p685l791k4904k0512O811n2920j2042j704L2611m3598J2177
11136A005562K7621J4554K2948J4250K364k4071K0527l3793q769O153P820k5097
11124A030069P319j5594m257m4015Q344M9931K8744p527l1094p1171j4404K431
11112I38776l7072j872M5264J6530j5962K159J1619L7496k1322l2328j0709L3313
11100I65892l316k51J5625l4642k832Q0704J6587k5582Q032L8982K366n9727l3296
11087I68542l3298l3733K5162J7206m0779k5333k1097J4767K9053M1739N4471
11076I96700m947l4552r547j2205k4584Q095M9045l867j7613j4077j8175k0594
$$ plain form
11159 1075159 1088086 1080665 1042513 997142 1046293 1073336 1054470 1072464 1059574 1076547 1112829
11148 1112829 1121119 1113434 1109643 1084739 1064227 1071038 1018118 1006076 1004372 1036983 993385 1005562
11136 1005562 1033183 1047737 1070685 1084935 1087299 1063228 1083755 1049962 1041193 1047346 1055166 1030069
11124 1030069 1037388 1021794 1017537 973522 981866 1031797 1060541 1053014 1021920 950749 936345 938776
11112 938776 901704 899832 945096 961626 945664 947823 959442 996938 975616 943288 932579 965892
11100 965892 962576 962325 977950 943308 940476 1021180 1037767 1012185 1020217 1059199 1061565 1001838 968542
11087 968542 935244 901511 926673 943879 903100 877767 856670 871437 900490 942229 996700
11076 996700 991753 957201 947654 935449 910865 918960 968005 964138 946525 932448 914273 893679
11064H93679J6320k147M216o325N573o361j4500K2287K495m2506r183j3324K4765
11051H74989L4080k0922k1680N83j7628L5598M2393j0893k1564K1551R785j3914
11039I12378k0910j7248J9567j0700M259O8240l1958l2456k7497j8850M3864K1737
11027I10426l5014j7130m847K7584O7469N07k6668l938j6009J4617l6273n813
11015H74911j9813k7266k3292J3481N4593L7649P835l5213N978K1011l7397j1481
11003H60996J4296k0322M64N0501N3461J2552m7614k3281k9332n4507M874K7842
10991H49930k0238J5457k2074j5985P965k195q123k2552o2896K9123K3901l1352
10979G40961J739K7091J0972K6391N0265j8837j4730L9966q151J4034N8202j3284
$$ plain form
11064 893679 909999 907852 912068 905743 911316 904955 890455 912742 915237 872731 863548 850224 874989
11051 874989 909069 888147 866467 867050 849422 885020 927413 916520 894956 916507 926292 912378
11039 912378 891468 874220 893787 883087 887346 955586 923628 891172 863675 844825 888689 910426
11027 910426 875412 858282 853435 881019 948488 948995 922327 918389 902380 916997 880724 874911
11015 874911 855098 827832 804540 818021 872614 910263 918098 882885 888863 909874 872477 860996
11003 860996 875292 854970 855434 905935 959396 971948 924334 901053 871721 817214 822088 849930
10991 849930 829692 845149 823075 807090 815055 812860 804737 782185 719289 748412 772313 740961
10979 740961 742700 769791 780763 807154 857419 838582 823852 863818 855667 869701 927903 914619
10967I14619k9659m4220n944l1020J8899M4463m2965k2412m98l9724K3266R997
10955G94802l1557l0042j4657K5856K7012k5282j1896k8777L701O032J032K1629
10943G37853P689L6840K6365r681k3291N926R473N944l2375J909k3708J3011M1183
10930G97138n0436n3290k1580K1663N8709k186r87m043k873K1775n6587J2558
10918G19861J8629Q315k341k2088J21k3114m3000K6659J3896l531j279O249L5844
10905G34221k0681k1449K4216J2521l0121m645k1075J2710j5930K8472M2042L1917
10893G72198p0018k3172J9374M4019L4034j946j1522o6496K2157l119k6531m396
10881F84582o654K8612K5457K8149J39l4608n0688j4453K7603N0452k6527n0240
$$ plain form
10967 914619 884960 840740 834796 803776 822675 867138 824173 801761 801263 761539 784805 794802
10955 794802 763245 733203 718546 744402 771414 746132 734236 705459 709160 715192 716224 737853
10943 737853 745542 782382 808747 799066 775775 781701 791174 797118 764743 766652 742944 755955 797138
10930 797138 746702 693412 671832 693495 752204 750018 749031 744988 742115 763890 707303 719861
10918 719861 738490 746805 744464 722376 722497 699383 656383 683042 696938 693407 692128 698377 734221
10905 734221 713540 692091 716307 728828 698707 694062 672987 685697 669767 698239 740281 772198
10893 772198 702180 679008 698382 742401 776435 774489 762967 696471 718628 715509 688978 684582
10881 684582 677928 706540 731997 760146 760285 725677 674989 660536 688139 738591 712064 661824
10869F61824n425k0335J0410o541j212K4043L2191J886j1763j3442L2659K4048
10857G28343k6328q477J510K6935J3706k3815Q334O684l3649n8865O867J1409
10845F52654k2400k5155J2352j3148j4878K192K6696L5541K0006n850j2972l686
10833F51352K4517m481k2845k4855r687L861L3749M0037k3537r147j4792m323
10821F39849K078p554k0881m268K8840K663l4606l1871L3531K5251L624l3690
10809F02966n6545o526l141J5269o709K2415J7093L2029K7991q17k5401k8231
10797E90393k2223k4757n818J8685K924j6339p648J3851l6824Q806N4029J1406
10785E86485l3762K6653L5467l5682M5435J5133j0555k0178J758L4432N3784L8858
$$ plain form
10869 661824 656399 636064 646474 639933 638721 662764 694955 696841 685078 671636 704295 728343
10857 728343 702015 693538 695048 721983 735689 711874 720208 726892 693243 634378 641245 652654
10845 652654 630254 605099 617451 604303 589425 591617 618313 653854 673860 668010 655038 651352
10833 651352 675869 671388 648543 623688 614001 617862 651611 691648 668111 658964 644172 639849
10821 639849 641927 634373 613492 609224 638064 640727 606121 574250 607781 633032 636656 602966
10809 602966 546421 539895 536754 552023 545314 567729 584822 616851 644842 644025 618624 590393
10797 590393 568170 543413 537595 556280 559204 542865 535217 549068 512244 521050 575079 586485
10785 586485 552723 579376 614843 579161 624596 639729 629174 608996 610754 645186 698970 737828
10773G37828k3411k4573n2128k762n1908J9771K9629L6225K6156n7440j9132k0341
10761E97914k2351J7467q243j6660R677l666o304M33K9415J8564M176o856k2921
10748E90645k826j9916l4558j9398j8698j664M8375L5889M3913j235l7616j0778
10736E72133J9120J1601k1589l6806J6536P5614P469m6009n878j1018O9228r287
10724F41114k2614n3118j8928j8273k4866L563L3252K0348Q186j4481K8859K5711
10712F08753N4983R956p2585l6985L791N249l0188k6855J8727N2844O0442Q910
10700F57042k1958k7052l4384q1477k5016K7448L0215J9525j2397P286m009J0953
10688E46176k5889L3585L7880l1507r967j4251m193j6296J7301M8512K2324J4531
$$ plain form
10773 737828 714417 689844 637716 634954 583046 602817 632446 668671 694827 637387 618255 597914
10761 597914 575563 593030 584787 568127 577804 574138 567834 568267 597682 616246 620422 613566 590645
10748 590645 587819 567903 533345 513947 495249 493585 541960 577849 621762 620527 582911 572133
10736 572133 591253 602854 581265 544459 560995 636609 644078 598069 592191 581173 650401 641114
10724 641114 618500 565382 546454 528181 503315 506878 540130 560478 568664 554183 583042 608753
10712 608753 663736 673692 601107 564122 567913 573162 542974 516119 534846 587690 648132 657042
10700 657042 635084 608032 573648 492171 467155 494603 524818 544343 531946 539232 535223 546176
10688 546176 520287 553872 591752 560245 550278 536027 531834 515538 532839 581351 603675 618206
10676F18206n3304l4919k1166K4043o722k2612O790O332J0779p87J978l768j6072
10663E08778K9992L8843j2550q117j082J1161M9557k2989o4579m6866L7847O456
10651E26451m763l200L9035K796J0684k1020p840K4481o0909m0769l2133k1177
10639D11636N9403Q682k7555J7476J8735j018N4733M4471j9257j3396k075J0603
10627E62438J7391k8307l2915n4065l1590r645Q078l962L8314J03979M0862k4670
10615E85908J1579k6486l8620M0187L4507o8820l8918k1974j0595l5306K9679
10604D61141J8889k6867N0908M2986J6611k2738Q21K688k1092k1432L4927J2127
10592E48969j5742J3894k316k4852J9718J4905k5545m4944J0441k8217K2099P2289
$$ plain form
10676 618206 564902 529983 508817 532860 526138 503526 510316 516648 527427 526640 528618 524850 508778
10663 508778 538770 577613 565063 556946 555864 567025 616582 593593 529014 482148 519995 526451
10651 526451 521688 518488 557523 560319 571003 549983 542143 566624 505715 464946 432813 411636
10639 411636 471039 479721 452166 469642 488377 487359 542092 586563 567306 553910 551835 562438
10627 562438 579829 551522 518607 464542 432952 423307 431385 427423 465737 569716 610578 585908
10615 585908 597487 571001 532381 572568 607075 538255 499337 477363 466768 431462 461141
10604 461141 480030 453163 504071 547057 563668 540930 541751 544439 523347 501915 536842 548969
10592 548969 533227 547121 544805 519953 539671 554576 529031 484087 494528 466311 488410 560699
10580E60699j9967J2526K2043n551j2612j0372k5o757n162r117k929M4019J8456
10567E85251m0575l5547p219J1546R549J0939n3288m9343K3773N1721J2349j4639
10555E04517j1485L210N1449J4704l8837M399k4315K4813J1797m3680j1684K626
10543D87514l577q214J8744k333J8500m021r398l9020k8633K1654M8636K5232
10531E25084M3854l4277o5806j9393L4446K633j0596L5151q809j7109K7480l1047
10519D81611K8577j0541M967J1774J7547J4029L3964j6360p2132k8169j7197J718
10507D49788L2504L6983r482k8487k0767j0613L0068K879M474J289J1791J590
10495E02017K217m2989n7567k3482L3898P3963J9801K0705k3023l2776J0205J6449
$$ plain form
10580 560699 540732 553258 575301 569750 557138 546766 546741 539984 534822 525705 522776 566795 585251
10567 585251 544676 509129 501910 513456 523005 533944 480656 431313 455086 506807 519156 504517
10555 504517 493032 496242 547691 562395 523558 527957 503642 528455 540252 496572 484888 487514
10543 487514 483937 475723 494467 492134 510634 506613 497215 458195 429562 451216 499852 525084
10531 525084 568938 534661 468855 449462 483908 486541 475945 511096 502287 485178 512658 481611
10519 481611 510188 499647 504614 516388 533935 547964 581928 565568 493436 465267 448070 449788
10507 449788 482292 519275 509793 481306 460539 449926 479994 482873 487347 488636 500427 502017
10495 502017 504234 461245 403678 380196 414094 488057 507858 528563 505540 472764 482969 499418
10483D99418J5976r875k3211k9749m1653R536M4423Q282N012j7141k4190N366
10471D42194K9758J7914j8979j595j4352M691L8447N6630l5065n4778L943K5548
10459D94356k7297J8676o486l9179O649J2524N924J0419o436j5548l1647K0935
10447D42890L3842K1827q304j7639O3876M7763K3014k9226j9595o4588q370l632
10435D81858J4436J5871J3865o5310k3276K1450r973R788K1806k7594K4030J6286
10423D93237N083j8075k2906k9371n663L6664o855j2133m061R756j1991j7006
10411D16679j5738j9806P808L4025K8028j8822k5473p735J5464l9584l1317J4615
10399C58144L4458L9023L1964K0038J1617j894k2448k9408k9166R284L442M936
$$ plain form
10483 499418 515394 505519 482308 452559 410906 420442 464865 473147 478159 461018 436828 442194
10471 442194 471952 489866 470887 469292 454940 459631 498078 554708 519643 464865 468808 494356
10459 494356 467059 485735 479249 440070 446719 459243 465167 475586 469150 453602 421955 442890
10447 442890 476732 498559 490255 472616 536492 584255 607269 578043 558448 493860 485490 481858
10435 481858 496294 512165 526030 460720 437444 458894 448921 458709 480515 452921 476951 493237
10423 493237 498320 480245 457339 427968 422305 458969 452114 439981 435920 445676 433685 416679
10411 416679 400941 381135 388943 422968 450996 432174 406701 398966 414430 374846 343529 358144
10399 358144 392602 431625 463589 483627 495244 493350 470902 441494 412328 421612 425054 429990
10387D29990K6777K768J0099J4329j0855l0767r5725K3063O2999M8812O21k6612
10375D55499Q246l1604N948J5429J7260N2956K308l9549k6871j6905K0700l6359
10363D27058k2671L7978L3129J5639K1232q957j4628l0431j2245M1261K4744p419
10351E04690m789j0487j518j4815p533K5842k8865l8786k4600L4565M6310l6568
10339D43446J5448p615p621Q696L2512J1238k0145l0344n566L7333M3252J4966
10327E35600J5159n0843l2974J4040j1052Q179j148k0584K412k2396j494m862
10315D30037K5035R658K7251j8223M0875m8837l6194J995p565J29K8783J2498
10303D65442j2792K5034L2491Q294m717k2513J4906k1018n3612l4547k056J6796
$$ plain form
10387 429990 456767 459535 469634 483963 473108 442341 346616 369679 432678 481490 482111 455499
10375 455499 463745 432141 438089 453518 470778 523734 526042 486493 459622 442717 463417 427058
10363 427058 404387 442365 475494 491133 512365 503408 488780 458349 446104 487365 512109 504690
10351 504690 499901 489414 487896 473081 465548 491390 462525 423739 399139 433704 480014 443446
10339 443446 458894 451279 443658 452354 484866 496104 475959 445615 440049 477382 520634 535600
10327 535600 550759 499916 466942 480982 469930 478109 476961 456377 458789 436393 434899 430037
10315 430037 455072 464730 491981 473758 514633 465796 429602 431597 424032 424161 452944 465442
10303 465442 452650 477684 510175 518469 513752 491239 506145 485127 431515 396968 394912 411708
10291D11708j5273k3451J2037j621K9027K8140k9183l1760p023K1238J2578k3426
10279C82991P680J8260j4088K5872j3899r263J4749J4168K3637j8775l2151K6512
10267D25693k780m2382K8742o740l5022j2601J7137n340k0056L162N768K124J5280
10254C72985K2059K6352J6654K6285J2170n6007l6444J6293K0113J6398k889O691
10242D40660K741k507k6330O058r112l5204p393Q236M4380R225p549L5241K3590
10229D82036k5305l7241o8237o35L1248Q310R228J6446L6983p253k3991J6556
10217D38145l3718o8490N073K2949M4751L2918J5136j6805K6084L98J5606k4273
10205D57774L2637j3542n7812Q625j605n4145R610M4376k5917l1135l929J9063
$$ plain form
10291 411708 396435 372984 385021 383400 412427 440567 411384 379624 372601 393839 406417 382991
10279 382991 390671 408931 394843 420715 406816 397553 412302 426470 450107 431332 399181 425693
10267 425693 422913 380531 409273 402533 367511 354910 372047 366707 346651 349813 355581 357705 372985
10254 372985 395044 421396 438050 464335 476505 420498 384054 400347 420460 436858 433969 440660
10242 440660 443401 440894 414564 420622 411510 376306 368913 377149 421529 430754 423205 458446 482036
10229 482036 456731 419490 351253 350618 381866 390176 399404 415850 452833 445580 421589 438145
10217 438145 404427 335937 341010 363959 408710 441628 456764 439959 466043 466441 482047 457774
10205 457774 490411 476869 419057 427682 426077 371932 381542 425918 400001 368866 364937 384000
10193C84000J5743J621J5264l4837j1593K5985L0783L9171O0022K5772l3048k4804
10181D94079p934q532k5454n835J2537O467Q787J548l8582l8853R852j6472l7090
10168C54518J0589J5273L1009P956L1328P947N482l710l7384l1262m140Q926K7734
10155D24266m6952m5519l5645k766O6208P9992l3219k3344n795J3055k8341l7603
10143C24337O964L8522j9447r360K8671K3694K5454j0216k0761l9771k3258J9753
10131C44582L9777K7169l1697n201K4669L6500J7876l5984J2133R429j7806O904
10119D28351l647j5674k7263K142k1456l351K3342K382P494K4709J4102k3850
10107D07281K434j5300k0324J0390J1672K9754K574m0969l0536n2971J2767K1419
$$ plain form
10193 384000 399743 401364 416628 381791 370198 396183 426966 466137 526159 551931 518883 494079
10181 494079 486145 477613 452159 446324 458861 465328 474115 475663 437081 398228 408080 391608 354518
10168 354518 365107 380380 411389 419345 450673 458620 464102 460392 423008 391746 387606 396532 424266
10155 424266 377314 331795 296150 293384 359592 439584 406365 383021 377226 390281 361940 324337
10143 324337 331301 369823 350376 341016 369687 393381 418835 408619 387858 348087 324829 344582
10131 344582 384359 411528 379831 374630 399299 435799 453675 417691 429824 439253 421447 428351
10119 428351 424704 409030 381767 383909 362453 359102 382444 384826 392320 417029 431131 407281
10107 407281 409715 394415 374091 384481 396153 425907 428481 387512 356976 304005 316772 338191
10095C38191J2410k394M659J4763J6287K3217K9017j9948J733K6003M638l5845
10083D12731l7488M255L11L9184K4368m6934P905N1845O55J3217M2233M23m7939
10070D64766p0527q2242r475K5737J1574j4637L5746N2919K3922K2030K0492k887
10058D77418L9557J5035J293m7141q017P528K6384O6909O8884M1821K2989N6313
10046G68973J76206K99498M49049P27501J369180K428594L835319K076098l700284
10037H430134l506205j717418q66933n01821l59343k37972j38708r9340r7053
10028I05341r4234o2599m3624q180o093p501l1073O969L6245l0515p7405o1531
10016E25800j6479j2566K6536M6090l8701n1507l0812K2395r832j5386K5162j4663
$$ plain form
10095 338191 350601 348207 352866 367629 383916 407133 436150 416202 417935 443938 448576 412731
10083 412731 375243 379498 379809 418993 443361 396427 404332 456177 456832 470049 512282 512705 464766
10070 464766 394239 311997 302522 328259 339833 325196 360942 413861 437783 459813 480305 477418
10058 477418 516975 532010 533303 486162 478145 485673 512057 578966 647850 689671 712660 768973
10046 768973 945179 1244677 1693726 2421227 3790407 6219001 10054320 12130418 8430134
10037 8430134 4923929 3206511 2339578 1837757 1478414 1240442 1101734 1002394 905341
10028 905341 811107 748508 704884 696704 690611 683110 652037 659006 695251 664736 587331 525800
10016 525800 509321 496755 523291 569381 530680 479173 448361 470756 460924 445538 470700 456037
10004D56037P907j3759o2331K4585O3516K465P399n5772l2177l4762k8497J488
9992C36099J0743k1213l1929j7329L1553K5500J2807K7407k360Q665R593j1606
9980C77930k3369J3315J908J3725M726l2288L706Q171q199L7911k8692m2772r105
9967C16967J3766K0057j5403J8825O888k2076K037j133n174J3338K0018m97j0168
9954C57445j057J5959L0134j938m7108k278J0594j2470Q064L0648O2289k1168
9942D29114o0188R53L2552K0729N1932K262m0751l1542k6643m9902n066J2457
9930C35907K7621K9918j8391k1759J617j2173o0518j8066K7698j271J1006O540
9918C08129K1846q617o527K5718k608k5178P530M9848j2649K860J5928K6437J2962
$$ plain form
10004 456037 463944 450185 387854 412439 475955 478420 485819 430047 397870 363108 334611 336099
9992 336099 346842 325629 293700 276371 307924 333424 346231 373638 371278 379943 389536 377930
9980 377930 354561 367876 369784 383509 388235 355947 359653 367824 359625 397536 368844 326072 316967
9967 316967 330733 350790 335387 354212 361100 339024 341061 339928 334754 348092 368110 367613 357445
9954 357445 356388 372347 402481 400543 353435 351157 361751 349281 357345 387993 450282 429114
9942 429114 368926 369879 402431 423160 475092 477354 436603 405061 378418 328516 323450 335907
9930 335907 363528 393446 375055 353296 354913 342740 282222 264156 291854 290583 301589 308129
9918 308129 329975 321358 314831 340549 337941 312763 320293 370141 357492 360352 376280 402717 415679
9905D15679l9905q211M2004R973P732j9822k6662K5364k830Q708J6958Q150J625
9892D38763m7944k3362p253l547K5213J8161L3221k084O535o263l9379l3301q65
9879C57895k4514m22K5374k7066m568K161J8136r521J9628M5976K9930j603l776
9866D27630k2963j0965n0779J5099m437k8948K5418L5681l0753p667k119R922
9854C55119L0470l4028l1831L726J5561K7668K602L467n7802j9272K5270L8980
9842C59930j454k8990K7759r870M042K3662M6560O1115j5273K7326O6028N8791
9830F19626O1271J04436R6231L2504j8353o0105n7552j23262l5873m272o9358
9819E45293q1426l0224J5226k0496k420J2149K1014r837l5985L682K1661J0722
$$ plain form
9905 415679 375774 367563 409567 419540 427272 407450 380788 406152 403322 412030 428988 437138 438763
9892 438763 390819 367457 360204 356657 381870 400031 433252 431168 437703 431440 392061 358760 357895
9879 357895 333381 332959 358333 331267 326699 328860 346996 337475 357103 403079 433009 431406 427630
9866 427630 404667 393702 342923 358022 353585 324637 350055 385736 354983 347316 345197 355119
9854 355119 385589 351561 319730 323456 339017 366685 369287 372754 314952 295680 320950 359930
9842 359930 358476 329486 357245 347375 351417 375079 421639 482754 467481 494807 560835 619626
9830 619626 680897 785333 881564 914068 895715 835610 778058 654796 618923 614651 545293
9819 545293 463867 433643 448869 428373 425953 438102 459116 449279 413294 416976 438637 449359
9807D49359o1949o5422k690Q78L6711K6770m8604m608J7075j455r059j4695J6921
9794C39232K4692l1808m4878Q040J9890N8596K3556j8513j6515k1506j8340q738
9782C13708r677K3999J7090m652j5021O947q966j6506p959p107k9660N594P164
9769B74954J2064Q4079Q3475k484l2922n9765j162J241k3079k5151j8212M8716
9757C41754M372K319k2409k5753l0039K3490l523O343J9623J0257R80m2288L81
9744B85507L7875N0868j3600k6901j3638J2668Q582k1285m3328k5396j0343J4583
9732B55592J8986j8815K0375M3344J5625j7209k2898m7553n409N8110K9164j7858
9720C11454J811L5165O6097k5104j7340k4425m105k409o93k4617J8912M2841p1234
$$ plain form
9807 449359 387410 321988 319298 320176 356887 383657 335053 330445 347520 346065 337006 322311 339232
9794 339232 363924 332116 287238 295278 315168 373764 397320 378807 362292 340786 322446 313708
9782 313708 304031 328030 345120 340468 325447 332394 323428 306922 298963 291856 262196 267790 274954
9769 274954 287018 371097 454572 452088 419166 359401 358239 359480 336401 311250 293038 341754
9757 341754 346126 348445 326036 300283 270244 293734 290211 296554 316177 326434 327414 285126 285507
9744 285507 323382 374250 360650 333749 320111 332779 341361 320076 276748 251352 241009 255592
9732 255592 274578 255763 276138 319482 335107 317898 295000 247447 242038 300148 329312 311454
9720 311454 313265 348430 414527 389423 372083 347658 343553 341144 340451 315834 334746 377587 306353
9707C06353k5607k4257Q423K6396j7696l1883j7217K856J6390j9425J6027p098
9695B33262N3440P4161l5626j0312R727q394L8210N7682o0607k2414P737M305
9683C41171j4946p924l3408j0656J8074L3470q186P736O053L438K1108k1293l3782
9670C00855J1967J653k3942l540j0817J3798M8650q436m1554J922L2922j192n369
9657C16917l7200Q587N885k7645K3780K4280L8318R634k4997n5867m938j4935
9645B61819K2728M4735j1002J0139k9691k2418L7943J9485r98k2987j2508N4089
9633C51334J9456j4448j6496j7292J3572Q828n8368o2405l0727L9267l627N428
9621B34522l265j848O4375K7785J279k0564k3295r239Q483K4318K727R584j9108
$$ plain form
9707 306353 280746 256489 264912 291308 273612 241729 224512 227368 243758 224333 240360 233262
9695 233262 286702 360863 325237 314925 324652 316258 354468 412150 351543 329129 336866 341171
9683 341171 326225 318301 284893 274237 292311 325781 317595 325331 331384 334822 355930 334637 300855
9670 300855 312822 314475 290533 286993 276176 289974 338624 330188 288634 290556 323478 322286 316917
9657 316917 279717 288304 294189 266544 290324 314604 352922 362556 337559 281692 276754 261819
9645 261819 284547 329282 318280 328419 298728 276310 314253 333738 332740 309753 297245 351334
9633 351334 370790 356342 339846 322554 336126 344954 286586 224181 193454 232721 229094 234522
9621 234522 231257 229409 293784 321569 322848 302284 278989 269750 278233 302551 305278 314862 295754
9608B95754n2177k908J7783j2005M259K54l208j3980l662K5235J6522l799J2948
9595B81016m351R101j4396K3198R169J5680n956j3594m0508j3071P263k5418n265
9582B22868N7333K6753k0620k5256P973J3728L3678k2828J0823K9285k0143o3522
9570B50072q345L5772J1659m727J6208R108J1871k725K4172M011j2497n2297k5144
9557B57138J4343J0209K7761K0590l420k5314J8215J8791Q193j090m5694m1571
9545B58151l8701l6184K0481k8274L7095J5531K0114J0908J236k8639J9115J8050
9533B68883k577j6423R506J4045l2951j7758q343l317N7348J2252J6021J3039
9521C09725q116J1173j8457l885l3512J8983J881K2613Q875Q382J2061L617O87
$$ plain form
9608 295754 243577 240669 258452 246447 250706 250960 247752 233772 230110 255345 271867 268068 281016
9595 281016 276665 285766 271370 294568 303737 319417 313461 299867 259359 246288 253551 228133 222868
9582 222868 280201 306954 286334 261078 269051 282779 316457 293629 304452 333737 313594 250072
9570 250072 241727 277499 289158 284431 300639 309747 321618 318893 343065 347076 334579 282282 257138
9557 257138 271481 281690 309451 330041 326621 301307 319522 338313 346506 345416 299722 258151
9545 258151 219450 183266 203747 175473 212568 228099 248213 259121 260357 231718 250833 268883
9533 268883 266306 249883 259389 273434 240483 222725 214382 211065 268413 280665 296686 309725
9521 309725 301609 312782 294325 290440 256928 275911 277792 300405 309280 317662 329723 333340 334027
9508C34027j6222p46l089O109k2420n9361j4003M6532K973K3809M1399P6910n251
9495D10667q326l82J4364m4617k2477J4575j3665k462R901k6894J0953M1310m0199
9482C42748m6485J9236J9384j9898N870p867P958l623R541J8838n854K8426q708
9469C59566j032l3673l534j9290K7620R771J178n084J3610k4254k6417L057M9505
9456C51023P500r827N127O614K269k1150r726J0272K82M2626L2316j4828j5047
9443C87451K148j909M389k9573J5610L0085L3123p647P444L1739J9553J6771l0400
9430D78784L3220K9923K262k2440r212J1687L3823o50P655k5542n1083L8790K3487
9417E50704J7122L0379M7668K3315j9274m4348r665M4994O5212L4984j5662j2746
$$ plain form
9508 334027 317805 317059 313970 320079 297659 238298 224295 270827 273800 297609 339008 415918 410667
9495 410667 402341 401959 416323 371706 349229 363804 350139 347677 357578 330684 341637 382947 342748
9482 342748 296263 315499 334883 314985 320855 312988 320946 317323 326864 345702 339848 368274 359566
9469 359566 358534 324861 321327 302037 329657 339428 340606 335522 349132 324878 298461 301518 351023
9456 351023 358523 348696 353823 360437 362706 341556 331830 342102 342384 385010 417326 402498 387451
9443 387451 389599 387690 392079 362506 378116 408201 441324 433677 441121 472860 492413 509184 478784
9430 478784 512004 541927 544189 521749 512537 524224 558047 557397 565052 539510 488427 527217 550704
9417 550704 567826 598205 645873 669188 649914 605566 595901 640895 706107 741091 725429 712683
9405G12683J7569O930P374J662K4064J107L348M5819M4570J1786l0286M367m722
9392H46271R889J4199j9606p815K1013J6024k3792j5946R60p0281n5119k4252
9380F91545k681m2723l6025j2377m277p151R080k4979j2657l6614J7408J4052
9368E52601m872j1564p860P98k5913l3787Q567R427L0411K492Q210J2943j3989
9355E27464o195m2233m721l0302k8333o150j2250j0691m508M81M1810L355k6956
9342D00771j4765R091L0978l2261l8103m03m64k272p588j2266j5872Q295l6674
9329B88467l2453K0009N453K0683J447j2695j7790J358K6781K9463k7786k2471
9317B80466L7546j6354m8523K239N030K7054J6054J6338n4654l6938P460J4896
$$ plain form
9405 712683 730252 737182 744556 746218 770282 771389 774737 820556 865126 876912 846626 850993 846271
9392 846271 856160 870359 850753 842938 863951 879975 856183 840237 841197 770916 715797 691545
9380 691545 688864 646141 610116 597739 593462 586311 595391 570412 557755 521141 538549 552601
9368 552601 547729 536165 528305 529103 503190 469403 477970 487397 517808 520300 528510 541453 527464
9355 527464 521269 479036 474315 444013 415680 409530 397280 386589 382081 382562 424372 427727 400771
9342 400771 386006 395097 426075 393814 355711 355308 354844 352572 344984 332718 316846 325141 288467
9329 288467 256014 276023 281476 302159 303606 290911 273121 274479 301260 330723 302937 280466
9317 280466 318012 301658 253135 255374 260404 287458 303512 319850 265196 228258 235718 250614
9305B50614L6541J0044j4861n1933l8887j9910o926M8130O0962M59r158L195J2597
9292B80867j3048l1511k9287O388L4213k1453k6633l8495L0457L5165r943M372
9280B21092K3223P606j6217l4129m023o801R948L40Q788J1370m152l4189j5867
9267A66989N2617Q154K4701J7551j3681m3247l3495M0171M4035J0118J591l4703
9255B40801k2911K0497J2459O2098K1487k9658j8680K849j1407l0391n696l3692
9243B07756O810Q967K5997j0755r433j8237J2495m369M524k6740K157J488l9353
9230A61307m8725J4959J8776j808j8551j992J2185J8868O181O24Q996j2189N868
9217A64499j6370M0818l282l6019k7704l3026l1818L7192M0336L0136N938l607
$$ plain form
9305 250614 287155 297199 282338 230405 191518 171608 164682 212812 273774 274233 265075 268270 280867
9292 280867 267819 236308 207021 213409 247622 226169 199536 161041 191498 226663 216720 221092
9280 221092 244315 251921 235704 201575 197552 190751 200699 201039 209827 221197 217045 182856 166989
9267 166989 219606 227760 252461 270012 256331 213084 179589 219760 263795 273913 275504 240801
9255 240801 217890 238387 250846 312944 334431 304773 286093 288942 277535 247144 241448 207756
9243 207756 214566 223533 249530 238775 229342 211105 223600 219231 223755 197015 199172 200660 161307
9230 161307 112582 127541 146317 144509 125958 123966 136151 155019 161200 161824 170820 158631 164499
9217 164499 148129 188947 185665 149646 121942 88916 57098 94290 134626 164762 170700 167093
9205A67093l0547J6752K5646J7841J754J8883j0553k2738Q505m9844m1757N8280
9193A59315K470L2351K0899J3792L0355l6061k7875J3558J9847j6674k4137k517
9181A85323k3598r876l5856L950k454q00j8812J0126L6736j9595N427L4272j8808
9168A46035J0039J1229j9799m391J8133k1895K5190P951L4059q930L751j7415
9156A83957l9842o8417l05K9636J8878J6140j4718j0683r673M8392O4542K5457
9144B43364m0978m2194L3019j4643M79l821k2119m815J4232L660J7066k7257M816
9131A60809L6528K9280j9150J3320m2944n3821p984K6780K1904R962n478j0177
9119A59029j8803N2330L6603J1406k4512j9232M7889j9109k9034j3799M532J0529
$$ plain form
9205 167093 136546 153298 178944 196785 198539 217422 206869 184131 192636 142792 101035 159315
9193 159315 161785 194136 215035 228827 259182 223121 195246 208804 228651 211977 187840 185323
9181 185323 161725 151849 115993 119943 117489 116689 97877 108003 144739 125144 130571 164843 146035
9168 146035 156074 167303 147504 143113 161246 139351 164541 172492 206551 197621 201372 183957
9156 183957 144115 75698 75393 105029 123907 140047 125329 114646 104973 153365 217907 243364
9144 243364 202386 160192 193211 178568 179047 175226 153107 148292 162524 166184 183250 155993 160809
9131 160809 197337 226617 207467 220787 177843 124022 116038 142818 164722 174684 169206 159029
9119 159029 140226 192556 229159 240565 216053 196821 244710 225601 196567 182768 187300 197829
9107A97829k6624K9432K8212k3851n203m4791k9073J7423K7871N22m5547L204
9095A29404m054O454J1808j6769q369r099k0982K3002M0518L621j9837o495L3123
9082A62325M161J2651J537j7088k8406K1715O149n658j4807j1113K3443m56n835
9069A48618K5966k5248K036r988k6262m1322n33l628K4196P0792M1280O505o4164
9056A48248j2244p327j2376m808K5306J4970J3511J0361m7153n6991L213p889
9044F6821L9180J3481L600l2435L0690L529J0370m813O1205K4977j1371j9897
9032A85337k3882n439j4206k9378L781K9239k0749J3331o273K65m831l5226J6977
9019A08946J1089j551k2772K0408L9556M345k7234j0733N638M0584q907P966j346
$$ plain form
9107 197829 171205 200637 228849 204998 199795 155004 125931 143354 171225 171747 126200 129404
9095 129404 125350 131804 143612 126843 118474 109375 88393 111395 151913 155534 135697 129202 162325
9082 162325 166486 179137 180674 163586 135180 156895 163044 157386 142579 131466 154909 154453 148618
9069 148618 174584 149336 151372 141384 115122 73800 73267 69639 93835 164627 205907 212412 148248
9056 148248 136004 128677 116301 111493 136799 151769 165280 175641 128488 71497 74710 66821
9044 66821 106001 119482 123082 90647 121337 124866 135236 130423 191628 216605 205234 185337
9032 185337 161455 156016 141810 112432 116213 145452 124703 138034 131761 132026 127195 91969 108946
9019 108946 120035 118484 95712 116120 155676 160021 132787 122054 127692 168276 159369 167335 165989
9006A65989n2547q711j1957k145R04J5040K1089r860k5897L551M4541K3450j9444
8993A44003l5169J8167L35j7076j9075O254k091k8376K2001K1694k6565j8439
8981F5663k8180j7617J3253L1586k8026l946L7518j2541Q059J3811m872J1775
8969H6483r260n4j1102n885R624M6117Q949j9484l7236L0283J2950L463J4948
8956A29796j9955L695L0416l7324r59J0154J4224Q163j9555l5896J3488K528j4676
8943H4099L7362M365k4841n131j2183L736p546M952K3056n435j4890K3613J4571
8930A25728j2994j3800o6648L2285J492J2360L6418j6104j2549L4745L6766O355
8918A64054l1802l3421n70k3613K0829q773l3540J9470p892J2409P213k1780J3615
$$ plain form
9006 165989 113442 104731 92774 90629 91533 106573 127662 117802 91905 95456 139997 163447 144003
8993 144003 108834 127001 127336 110260 91185 97439 95348 66972 88973 110667 84102 65663
8981 65663 37483 19866 33119 64705 36679 32733 70251 57710 65769 79580 74708 86483
8969 86483 77223 77169 66067 60182 69806 115923 124872 105388 68152 98435 111385 114848 129796
8956 129796 109841 113536 143952 106628 105669 115823 130047 138210 118655 82759 96247 98775 84099
8943 84099 121461 125826 100985 95854 83671 87407 79861 84813 107869 102434 87544 111157 125728
8930 125728 112734 98934 32286 64571 66063 78423 114841 98737 86188 120933 157699 164054
8918 164054 132252 98831 98261 74648 95477 86704 53164 72634 64742 77151 84364 62584 76199
8905G6199r104L087J8677k6856k1302n5290j222M9623M5638J4085j3497j2010
8893F8028J6369n36k4199j020J85K4185J2767K0280n252M4667k5614p7285k6465
8880B6110P443N4521K1594j181L578k0540m6702m2192K5818M1506K1741J5465
8868A07161k3972k4250k2183k3653l383l360K9051P5148L6504M36J9012L04o5064
8855A01751l0896K028J7647l27q830p118K6859J9171k4512q024k6906k4537m492
8842C1814l2340j1947K2376m6832N479O8919L2603K4692m3275k5493k732j0274
8830A2990M439K8680M2174m4682l5436K4140K0809K1126j8540j7686L2950K1348
8818I2312k1366O174M4912j0427J4699k8777o8057J0799J7859k009K6543J7220
$$ plain form
8905 76199 67095 70182 88859 62003 40701 -14589 -15811 33812 79450 93535 80038 68028
8893 68028 84397 83861 59662 58642 58827 83012 95779 116059 110807 155474 129860 52575 26110
8880 26110 33553 88074 109668 108487 112065 91525 44823 2631 28449 69955 91696 107161
8868 107161 83189 58939 36756 13103 9720 6360 35411 110559 147063 147499 166511 166815 101751
8855 101751 70855 72883 90530 90203 81373 74255 101114 120285 95773 87749 60843 36306 31814
8842 31814 -526 -12473 9903 -36929 -31450 37469 70072 94764 51489 25996 23264 12990
8830 12990 17429 46109 88283 43601 8165 32305 53114 74240 55700 38014 70964 92312
8818 92312 70946 77120 122032 111605 126304 97527 29470 40269 58128 56119 82662 99882
8806I9882l8174k76J9642J1038J0282M821k9066n907j3211k3952k0733K7095n788
8793C5653k2573j6184J603L6567J8091N936L1818L3660l487j13k3670l4502r426
8780E3373k4220J0115M5062O3053o505r484m0590L2724N091m947l9694j3419Q64
8767G1423j0954n738J8937J0383J7206o764m7856l2459K090M3126J30n269J6236
8754G0491p237J7769j7997J7888l8184j8200l4780O073K7313K9489L4571J5268
8742A02464r183l708J8140m255m8791k0477j773J6522M7654L3612j4603l7558
8730G8044k2804n0202m2266k6982M1977L7873R380L455m742r817k0976M6163M5917
8717H5020J5856j9799k5256n806j0998k4849K770N0497M8199L3577k2009k0311
$$ plain form
8806 99882 61708 61432 81074 92112 102394 107215 78149 72242 59031 35079 14346 41441 35653
8793 35653 13080 -3104 -1501 35066 53157 59093 90911 124571 121084 120971 97301 62799 53373
8780 53373 29153 39268 84330 147383 140878 131394 90804 123528 128619 123672 83978 70559 71423
8767 71423 60469 54731 73668 84051 101257 94493 46637 14178 16268 59394 59524 54255 70491
8754 70491 63254 81023 63026 80914 42730 24530 -10250 -4177 23136 52625 87196 102464
8742 102464 93281 89573 107713 103458 54667 34190 32417 48939 96593 130205 115602 78044
8730 78044 55240 5038 -37228 -64210 -22233 15640 25020 28475 23733 13916 -7060 39103 85020
8717 85020 100876 81077 55821 50015 39017 14168 16938 67435 115634 149211 127202 106891
8705A06891m8879j4406L0885K1324j124k9989j9281k585P610k1790k7180J7119
8693A8595L2355M1909j0495l4007j8814M435l037N4080N627r504k1628k6734J6765
8680D9547L0142j3694j6802M257K033k6038L7808M8251k8699m3710k3353K4086
8668D3828M0817l3090l3747J2700J5240J5146j9461J4917J6873k7277J3012J2596
8656G1554j2497j4051J2757Q664k6673j8363J21K2940K000m921k3365M1637K5344
8643H5147k4122K5402r114m0779k5849q17j6562J6557L0962K671m7238j8619q779
8630c1140P837Q411J3348M913k0642l759K9496j8464Q357K4337L8459N4162k8576
8617H6739n4784J4407L4543k5256k8332K85j7516j2562L8778L2988J0734L94L219
$$ plain form
8705 106891 58012 43606 74491 95815 94691 64702 45421 42836 50446 28656 1476 18595
8693 18595 50950 92859 82364 48357 29543 33978 30941 85021 90648 81144 59516 32782 49547
8680 49547 79689 65995 49193 53450 55483 29445 67253 115504 86805 43095 19742 43828
8668 43828 84645 51555 17808 30508 45748 60894 41433 56350 73223 45946 58958 71554
8656 71554 59057 45006 57763 66427 39754 21391 21512 44452 46452 41531 18166 59803 85147
8643 85147 61025 86427 77313 36534 10685 9868 -6694 9863 40825 43496 -3742 -22361 -31140
8630 -31140 -23303 -14892 -1544 3369 -17273 -21032 8464 -10000 -1643 22694 61153 115315 86739
8617 86739 31955 46362 80905 55649 27317 27602 10086 -2476 36302 69290 80024 80418 83637
8604H3637M691J355j1119k2054L1725q998j2402L4332L9667l1109j9787Q4P880
8591I7902J8135Q065l0290L109O2914J0347j3906K090m4195n545L8175r680m5050
8578I2071n06K308N0564L5383n316o004l8803k855K4223j8664o9473k472N1255
8565A11711p117m359j0947J9807j2880j0951L0902k8934m0213J6034k960n45k2304
8552C7244l8527J555l881p556J9019K0185j7939r46J2383J1770k2963j976o557
8539A811L1597L4810j0534l5932J1808J2733J701k6256Q059K4472J8033k8497
8527D3805k7385J5077l736M376L9233m241k9005J0717J5699k2065n889J4398K2351
8514G3335P323m8920P009J0150j9447J1794j8509l008j5388k6076N5182P7438
$$ plain form
8604 83637 88328 89683 78564 56510 88235 79237 66835 101167 140834 109725 89938 90022 97902
8591 97902 116037 124102 93812 96921 159835 170182 156276 158366 114171 108626 146801 137121 92071
8578 92071 91565 93873 144437 179820 174504 168500 129697 126842 151065 132401 62928 60456 111711
8565 111711 104594 100235 89288 109095 96215 85264 116166 87232 47019 63053 60093 59548 37244
8552 37244 -1283 272 -3609 -11165 7854 28039 10100 9154 21537 33307 10344 8368 1811
8539 1811 33408 68218 57684 21752 33560 46293 47994 21738 29797 54269 72302 43805
8527 43805 16420 31497 27761 32137 71370 67129 38124 48841 64540 42475 36586 50984 73335
8514 73335 80658 31738 38747 48897 29450 41244 22735 19727 4339 -21737 33445 110883
8502A10883L8690m43k3488k5873j6142o719j132j1388L7852m929n6116n1879j4083
8489b4767K8102M13o985L7445P397O818k4334N272L7639M0158k6717l9547l5011
8476E883O219M1471L6689o366N332O895k9207m5960k0505j0065J5138l399k1999
8463a9874m161J0772N1017P49P378M8379M586j6306p947k592l1774j3468K2578
8450D9337J3572J4174m1587j4967L243O3307K9015n991k3174j2184m4324j126
8438B9295L2786M593k7716l4704K3333m884N297J1106R681O187O5381M1431K065
8425A63851l3445m9978k0283k9227o66L0123J3418K4992j5219k01o0232m5689
8413b2556K3511L9516J5723k5817J0036l0724J0161J8699J219l5397J2043j2638
$$ plain form
8502 110883 149573 149130 125642 99769 83627 76908 75776 64388 102240 97311 41195 -10684 -24767
8489 -24767 3335 3748 -3237 34208 41605 48423 24089 29361 67000 107158 80441 40894 5883
8476 5883 12102 53573 90262 83896 89228 96123 66916 20956 451 -9614 5524 2125 -19874
8463 -19874 -24035 -13263 37754 38503 45881 94260 98846 82540 74593 72001 40227 26759 49337
8450 49337 62909 77083 35496 20529 23772 87079 116094 110103 86929 74745 30421 29295
8438 29295 62081 66674 38958 4254 27587 22703 28000 39106 48787 54974 120355 161786 163851
8425 163851 130406 80428 60145 30918 30252 60375 73793 98785 83566 83365 23133 -22556
8413 -22556 955 40471 56194 30377 40413 9689 19850 38549 39768 4371 16414 3776
8401C776l4641k307L4791O5320J3270K4306k3756l7415J1417J018j7126k699L955
8388C9909J6749n5177j3940M8701K7960j4657J7123l1360j0053L7785L3420o9503
8376B6957k7970K6850j3751j2108L5971K3292q418k6657j0083L7114M3976j6308
8364G8865o6746j1212J2237m935p744l8931N207M0040J2605J1838n8735o574L1632
8351b453J4179J1048L4223P737j6875n9459m8997j1458L2689N7924J5930L4268
8339F8756L530J5912k9534L9763M221m875L2023j6399k3726k188n4760N993K9406
8326F8122p042J6177K723j5605l96P970l057m291j5467J7979R68k6125l6083Q962
8312A4835k4933j3815J8886R316J1242J7388l3710M354L8615K8057K77l679J9274
$$ plain form
8401 3776 -30865 -33172 1619 66939 80209 104515 80759 43344 54761 55779 38653 35954 39909
8388 39909 56658 1481 -12459 36242 64202 49545 66668 35308 25255 63040 96460 26957
8376 26957 -1013 25837 12086 -22 35949 59241 50823 24166 14083 51197 95173 78865
8364 78865 12119 907 13144 8209 465 -38466 -33259 6781 19386 31224 -27511 -34085 -2453
8351 -2453 11726 22774 56997 64734 47859 -11600 -60597 -72055 -39366 18558 34488 68756
8339 68756 72286 88198 58664 98427 102648 97773 129796 113397 89671 87483 32723 38716 68122
8326 68122 61080 77257 79980 64375 63979 71949 68892 64601 49134 67113 68081 41956 5873 14835
8312 14835 -10098 -23913 -5027 4289 15531 32919 -791 3563 42178 70235 70512 66833 86107
8299H6107k1285l5671j4091M7925K4833l1185k0157J341r450m5428n883M9826
8287B6882M8943J130j4344Q704j7992n6437j8128L3755N5102m899l4176j7743
8275A0797J9283j3309q862L6190P4484j6301n1735j61p995o703O899k015j7932
8262B2640m0798J0721J4995L2554L7967J7880N366j5487j7895k210n4250j081
8250A0402J3573k2303J4208j1012j168K0052J072k8508L3840n7421j5638R91m5046
8237h6958K2099L3448L855K1581J2834j9119n6989J1796J3294J9205K1862K1040
8225A7948m9639l4728K1238K298L0903K3274M0226R280j2391j7095l616J8607
8213D6305l286L911J2491J0517j4147K1633q151k2248m2329l7220j220o409L3085
$$ plain form
8299 86107 64822 29151 15060 62985 87818 56633 36476 37817 28367 -17061 -22944 26882
8287 26882 75825 76955 62611 71315 53323 -3114 -21242 12513 67615 62716 28540 10797
8275 10797 30080 16771 7909 44099 118583 102282 50547 50386 42391 35688 42587 40572 22640
8262 22640 -18158 -7437 7558 40112 78079 95959 101325 85838 67943 65733 11483 10402
8250 10402 23975 1672 15880 4868 3700 23752 24824 -3684 30156 -27265 -42903 -41912 -86958
8237 -86958 -64859 -31411 -27556 -5975 6859 -12260 -69249 -57453 -44159 -24954 -3092 17948
8225 17948 -31691 -66419 -45181 -42883 -11980 11294 51520 60800 48409 31314 27698 46305
8213 46305 43019 46930 59421 69938 55791 77424 69273 47025 4696 -32524 -33744 -40153 -7068
8200g068K7800l4734r488K0668j769k6842l990L8830m936j3370J9547J0695K7706
8187D3049j2334k7943k2245j499n385Q265Q028n614J0983J8013P12o132M874M5726
8173E8498O722L1930m115j6543j8589K028J2144k3506m5233m1598j6710j836m2201
8160i9009K0829L6401k6188j847M7093K6288n65J9867K8870l84j1866l550J3956
8147D9895J5989M5975L5709j4621j9468l4898r586K7460j0367l0250m3950O7175
8135G9063j2402m3037j9166o635q26J0700L5185n948Q715m1211K2089Q550l4858
8122B19q0030L2173N8905J9332k560k0403j0169K0520K3739M265J5529l3440j8643
8109I437J6842J9384J5825l5904j917r857m9883J7088L6803Q401K1940P491j7185
$$ plain form
8200 -7068 20732 -14002 -23490 -2822 -4591 -31433 -35423 3407 -1529 -14899 4648 15343 43049
8187 43049 30715 2772 -19473 -20972 -26357 -18092 -10064 -15678 -4695 13318 14030 7898 12772 58498
8173 58498 65220 97150 93035 76492 57903 59931 72075 48569 3336 -38262 -54972 -56808 -99009
8160 -99009 -78180 -41779 -67967 -69814 -22721 3567 3002 22869 51739 51355 39489 35939 49895
8147 49895 65884 111859 147568 132947 113479 78581 68995 96455 86088 55838 11888 79063
8135 79063 66661 23624 4458 -2177 -3003 7697 42882 36934 45649 4438 26527 35077 219
8122 219 -79811 -47638 11267 30599 28039 7636 -2533 17987 41726 45991 61520 28080 9437
8109 9437 26279 45663 61488 25584 23667 13810 -36073 -18985 17818 26219 48159 55650 38465
8096C8465o011n713K6442K7657j0925j2928l4569l9736k5923j9813J7000K9191
8084a6863J894K1522j7722J8612L3415k6132m9711J5505K2238k2549p477M6808
8072A9540M879j4895O970L4519O75k8092R97J6699p875k2475L0083O687k1641
8059B6071l1323l4157M6192K7302j334q256M3224J1150n7264P569J5253j9707
8047B4720l5453J7596o389J3866l748J8516M911L13q937l340q800J4259J7184
8034D4698M03J4119j2849l5214p200L0810J1735k450O838K1426j0323k4178j5221
8021B2594Q167O2457Q366l3213j5546J8514j4125j5851k5402j3551j3040k239
8009a2869J544N5121L7262j9919j3132j1962o550m6988O812k5847k4415O0901
$$ plain form
8096 38465 32454 26741 53183 80840 69915 56987 22418 -17318 -43241 -63054 -46054 -16863
8084 -16863 -14969 6553 -11169 7443 40858 14726 -34985 -19480 2758 -19791 -27268 19540
8072 19540 24419 9524 16494 51013 51688 23596 24593 41292 33417 10942 41025 47712 26071
8059 26071 -5252 -39409 6783 34085 32751 24495 67719 78869 21605 29174 44427 24720
8047 24720 -10733 6863 474 14340 10592 29108 34019 34332 25395 22055 13255 27514 44698
8034 44698 45101 59220 46371 11157 3957 34767 46502 44052 50890 72316 61993 37815 22594
8021 22594 30761 93218 101584 68371 52825 71339 57214 41363 15961 2410 -10630 -12869
8009 -12869 -11325 43796 81058 61139 48007 36045 29495 -17493 -10681 -36528 -60943 -42
7997d2J4315K805K3535J4986r193K829k6907p102M490l297K876K1359K0125J4060
7983G4839l0786k2540j8706J2433p176k4513J5010k403J8325k8781k2677k0996
7971e7971N394M6982N6354L1550k4566k2974k8269Q2643K9701O138k5788Q361
7959A07555K417m2216J030M69k744j6857l6355j2055L5845O6572K2178k9956O840
7946A02723o274p4703m2264l9133K7247N3430L8397J7118J001r702K8942J341
7934I8123l6593k4994p003M8450J624l5485m4422L4788M6103R934P315R150n8990
7921D8000j1128L3740j3960l2373R281L1141j290k388K1811K9920L5956j6502
7909A32208M197j1476J938j4060r461j6399r306o685K3769J8204r663j5763M8754
$$ plain form
7997 -42 14273 17078 40613 55599 46406 49235 22328 15226 19716 16419 19295 40654 60779 74839
7983 74839 44053 21513 2807 15240 8064 -16449 -1439 -3842 14483 -14298 -36975 -57971
7971 -57971 -52577 -5595 50759 82309 57743 34769 6500 89143 118844 124982 99194 107555
7959 107555 109972 67756 68786 69255 66511 49654 13299 1244 37089 103661 125839 95883 102723
7946 102723 96449 21746 -20518 -59651 -32404 21026 59423 76541 77542 67840 96782 98123
7934 98123 61530 36536 29533 77983 79607 44122 -300 34488 80591 90525 97840 106990 48000
7921 48000 36872 70612 56652 24279 33560 64701 63411 61023 82834 112754 148710 132208
7909 132208 136405 124929 126867 112807 103346 86947 77641 70956 94725 112929 103266 87503 136257
7896A36257J5328l2525n9570k6207q019K7137M0894R913l4980q372K8743q337
7884H0262l7731R637K7458j9465j0942L0295q214l6494l533k7253J4039M5731
7872F3790K8m2862m472J5430J183q73Q609j042j9992o764J3866J4222n871K2465
7858E7717M3031L2229k3417k6803j2039L005o02j5452K954l9415K1881K4117M183
7845G1389R41l0475k1088j8900j2782k253K2920L3176j389l7189L2212J8971r013
7832D6520j4835Q798K0658K5892m5202k9332M755j6675K5185K8417m7698n3694
7820d7211K2449k2558j2874K4551P208L6988j0145O51J6686L9283j0227q566J6539
7807E2774K330J748K972k9529j8990q321Q629K9529L519J3530k5494l7827J9376
$$ plain form
7896 136257 151585 119060 59490 33283 25264 52401 93295 103208 68228 59856 88599 80262
7884 80262 42531 52168 79626 60161 49219 79514 71300 34806 31273 4020 18059 63790
7872 63790 63818 20956 16484 31914 33097 32224 40833 39791 19799 13035 26901 41123 35252 57717
7858 57717 100748 132977 109560 82757 70718 73723 73121 57669 60623 21208 43089 67206 71389
7845 71389 72330 41855 20767 1867 -10915 -13168 9752 42928 41539 4350 36562 55533 46520
7832 46520 31685 40483 61141 87033 41831 12499 17254 579 25764 54181 6483 -47211
7820 -47211 -24762 -47320 -60194 -35643 -28435 8553 -1592 -941 15745 55028 44801 36235 52774
7807 52774 55104 56852 59824 30295 11305 2984 11613 41142 44661 58191 32697 -5130 14246
7794A4246q24j0649J6785j0842k342Q231k3482J2746J5653J7780K4744J5703k9629
7781D8120j2959k064L270J3279o491j6k9188k9739Q0968N072n0464m656j705l1098
7767a7671k3709J6040K974k9323O1650J6868K8763k9143R121L5048j427o15J1114
7754G9690j0459k5180m4569k7742K1280M4807m8818m3693P9648M4756j7624j8078
7742C4018n678m099J6425J2271q952m298r997J6993k850p081J240k1556Q781j4757
7728A0460n7178J941n361M4940K7119P891l7559l8727k1954k8680J2344N2850
7716c1914L7226l598J335j694M5638K4562J5340l464m7426k2193j8637J990l3704
7703c6539j616L2107J1042m6878m116K6024j0900m4341J8347M9796J2224K3758
$$ plain form
7794 14246 13422 2773 19558 8716 6374 14605 -8877 3869 19522 37302 62046 77749 48120
7781 48120 35161 33097 36367 49646 43155 43139 13951 -15788 65180 70252 19788 15132 13427 -17671
7767 -17671 -41380 -25340 -22366 -51689 9961 26829 55592 26449 35570 70618 69191 68576 79690
7754 79690 69231 44051 -518 -28260 -6980 37827 -10991 -54684 24964 69720 52096 34018
7742 34018 28340 24241 40666 52937 43985 39687 29690 46683 43833 36752 37992 16436 25217 10460
7728 10460 -46718 -44777 -50138 -5198 21921 29812 -7747 -46474 -68428 -97108 -84764 -31914
7716 -31914 5312 1714 3049 1355 46993 71555 86895 83431 36005 13812 -4825 -2835 -36539
7703 -36539 -38155 -6048 4994 -41884 -46000 -19976 -30876 -75217 -56870 -7074 5150 28908
7691B8908k5851Q330J9019J7997j2817j6268l5006K195K9538M4402R745o9636
7679E56j7309O621R308O698o3356R372K3234L4872k4256k2065N2250K361R65l951
7665A5300k2566k4631M970L7944p282n740r507o76l1170q819K0266P0505O2386
7652A00980L1283k3416m3441k5788m820o039N437j2626j0921J1035j1816J1085
7640B0953J6564k525k5037J2622J4971l2572N046n5696j657L3030N0559K0728
7628E6986J9049K391k5517j6431l6707j6956k2182J2765P1370M0567l3721l9659
7616A1955k0473l905k660m5719J6015K8957j1634J5114P8212K0771o462R778l2239
7603E7710l8672r27N380l4307j9542J3860J3378j9683k0489n964p379K2280K660
$$ plain form
7691 28908 3057 11387 30406 48403 35586 19318 -15688 -13493 16045 60447 70192 556
7679 556 -16753 -10132 -824 5874 -57482 -48110 -24876 9996 -14260 -36325 15925 18286 19251 15300
7665 15300 -7266 -31897 -26927 11017 3735 -2005 -11512 -12188 -43358 -52177 -31911 38594 100980
7652 100980 132263 108847 65406 39618 34798 28759 34196 21570 10649 21684 9868 20953
7640 20953 37517 34992 9955 22577 37548 4976 10022 -45674 -47331 -14301 36258 56986
7628 56986 76035 78426 52909 36478 -229 -17185 -39367 -26602 44768 85335 51614 11955
7616 11955 -8518 -12423 -15083 -60802 -44787 -15830 -27464 -12350 65862 86633 80171 89949 57710
7603 57710 19038 18111 23491 -10816 -30358 -16498 -3120 -22803 -43292 -49256 -56635 -34355 -31695
7590c1695L9545L430l3840L9561L4136K2859m4396n3447j6732J5507L2946L9613
7578D7487K5791r636m3760o0284J7172K5733M880J651j9808q78j1004M655N002
7565a2999L5869J6882o886j6919k8556L273j6524K858j428m769L0976k2299k0026
7552d0548k0959j2521L5438j918J5329N8022L0745k7248k2933j2309j8774n432
7540b3108K329L1192k1885k6861P4214J8102m1194j2975o740j0473j5128r960
7528d2487L7921J2711p376j7861M8091N4940j9967l8365k0390p790k1171J0158
7516a1586J0087j0266K654m3427J078N7783L1934K4480j828k5023R561m504j417
7503C9526J1611j3394K0711J1725j2927m8354k1894L828J8046J9577m0274K5807
$$ plain form
7590 -31695 7850 11280 -22560 17001 51137 73996 29600 -23847 -40579 -25072 7874 47487
7578 47487 73278 63642 19882 -40402 -23230 2503 7383 9034 -10774 -11652 -22656 -18001 -12999
7565 -12999 22870 39752 32866 15947 -12609 -9336 -25860 -23002 -24430 -29199 1777 -20522 -40548
7552 -40548 -61507 -74028 -38590 -40508 -25179 32843 63588 36340 13407 1098 -17676 -23108
7540 -23108 -20779 10413 -11472 -38333 35881 53983 12789 -186 -6926 -17399 -32527 -42487
7528 -42487 -4566 8145 769 -17092 30999 85939 65972 27607 7217 -573 -21744 -11586
7516 -11586 -1499 -11765 -9111 -52538 -51460 6323 38257 62737 60909 35886 45447 40943 39526
7503 39526 51137 37743 58454 70179 57252 8898 -12996 -9168 8878 28455 -11819 13988
7491A3988J1256n153K5989p845j8357j620o2034m97O308L6024m547Q86M4385l877
7477C4906O3544k2770m6411m034j9634K6007j5501k5592j856K4802J5830L027
7465C2318j7095k8444q644L4982R845K3934j0566n4406J154r369j0323K5733J1003
7452A22L0675j6469J4578J5299p187K626M652l8740j801J2890j8655j4900N777
7439a1133K0272j0341n748m8171J1235j9202K273J0770n093K3619r346l95K4801
7426a6459K3992M6827j8279l8700j0208J0933K492m45L3160K4408m0822j1479
7414E420J2648J4733l3765P680M281r794j2544L405L3450k4412l4510j0578j6550
7401f0536J6325K6676O454K2046K231l3613J1695L1963m0385K20k5380o361M6972
$$ plain form
7491 13988 25244 20091 46080 38235 19878 18258 -43776 -44273 -37965 -1941 -6488 -5602 38783 34906
7477 34906 98450 75680 29269 25235 5601 31608 16107 -9485 -11341 13461 29291 32318
7465 32318 15223 -13221 -21865 13117 22962 46896 36330 -18076 -16922 -26291 -36614 -10881 122
7452 122 30797 14328 28906 44205 37018 39644 44296 5556 3755 16645 -2010 -16910 -11133
7439 -11133 9139 -1202 -6950 -55121 -43886 -63088 -60815 -50045 -55138 -31519 -40865 -41260 -16459
7426 -16459 7533 54360 36081 -2619 -12827 -1894 598 153 33313 57721 16899 5420
7414 5420 18068 32801 -964 6716 10997 1203 -11341 -7936 25514 1102 -33408 -43986 -60536
7401 -60536 -44211 -17535 -11081 10965 13196 -20417 -8722 23241 -17144 -16924 -42304 -48665 -1693
7388a693M7052K3268R272k5019k794m674Q697K5319k1515o5151k6351j8903J9265
7375c3227J1280j4695J8594P140K868j599k4133m309J5571J9860K2468j0821n918
7362C079k484K5807K1023L705n3843q940J9333K92p247l0558p709J6639j5760
7349c6663J4806J2544J6825J6254l0312l8619m86L1540L1725l7437q260L8846
7337A0763J1094j0015k922n829n5763l411j3173j4663L3443K454K4548K074K1820
7324D20j5491J1378k3943j9812K0199L1521P524j2054l7801j8577K5235N8679
7312B7278J8267k4170J4477L5818n700j8334J4601j6742k5401J319J2485n796
7300B8102J9617k9234k3428R954M7561J9454l5003l6100k9650j4111j4899L0582
$$ plain form
7388 -1693 45359 68627 77899 52880 50086 45412 54109 79428 57913 -7238 -33589 -52492 -33227
7375 -33227 -21947 -36642 -18048 -10908 -8040 -9639 -33772 -38081 -22510 -2650 19818 8997 3079
7362 3079 595 26402 47425 51130 -2713 -11653 7680 7972 725 -29833 -37542 -20903 -36663
7349 -36663 -21857 -9313 7512 23766 -6546 -45165 -45651 -14111 17614 -19823 -28083 10763
7337 10763 21857 11842 8920 3091 -52672 -56083 -69256 -83919 -50476 -48022 -23474 -21400 420
7324 420 -15071 -3693 -27636 -47448 -27249 4272 11796 -258 -38059 -56636 -31401 27278
7312 27278 45545 21375 35852 71670 65970 47636 62237 45495 20094 21413 33898 28102
7300 28102 47719 18485 -4943 5011 52572 72026 37023 923 -28727 -42838 -57737 -27155
7288b7155K0106M763O990M2812p523k9619l96N281L6665k7695l8581l670J4127
7275c895k4883m490R57o207K4442N557J5283K497m3183l5652j105J3899M5970
7262a0810K137Q444M5340l193j9085j1199R336k713k6814J6808k386N147O4230
7249G5242J7755k3191m888k9068o079r19j1953J9930J0609k6703k9931q026j1406
7236b8628l6271Q781N2265L3012N649o402j1880m0540k8962K9497J7875k3068
7224b8672L40J924L1143P024J3291K0219m9261o2234l5400k1024Q696L0244K5902
7211e7808K7586j1152J6852J0415j141k3098o353K2205R679j0949m566K6521l392
7198e201j7750q725J0614K9674K7031k7453k3996j8575J5774L2597L715l9645
$$ plain form
7288 -27155 -7049 -2286 4704 47516 39993 10374 9978 15259 51924 24229 -14352 -18022 -3895
7275 -3895 -28778 -33268 -32311 -38518 -14076 -8519 6764 9261 -33922 -69574 -70679 -56780 -10810
7262 -10810 -8673 -229 45111 41918 22833 11634 20970 18257 -8557 8251 5865 11012 75242
7249 75242 92997 69806 64918 35850 29771 28852 16899 36829 47438 20735 -9196 -17222 -28628
7236 -28628 -64899 -56118 -3853 29159 34808 28406 16526 -24014 -52976 -23479 -5604 -28672
7224 -28672 -28332 -26408 4735 11759 25050 45269 -3992 -66226 -101626 -122650 -113954 -83710 -57808
7211 -57808 -30222 -41374 -24522 -14107 -15248 -38346 -44699 -22494 -12815 -23764 -28330 -1809 -5201
7198 -5201 -22951 -31676 -21062 8612 35643 8190 -15806 -34381 -18607 13990 17705 -21940
7186b1940r703L5334M7945O173K6002o9623l8880L861N1073m938n2461l3216j2143
7173g2516K3508K2242o535k666N1363J1618K6944q123k7749K85K1060k5979l5645
7160b2193q618J2188j6151R92J0209J7085N2408k7115j8707N226k326J1168R13
7147A5079J3547J2544l6955J4402L7773o781m2181j2867j6293O878J3789k1284
7135b2349j3095n239Q654J9264l0058j2627j3590K0809J0942M5695K9822m455
7123C3773n1710j5365L2488l4377k4395J4202J7832P31l8656J765M3041K6343
7111E672o028m3709m505L5640K4340J1924o914R898L3395r694L9245k1569k8778
7098C8917j7562o058L7776M2277n8587j7792j6648k0358l2309L5456K1384r342
$$ plain form
7186 -21940 -31643 3691 51636 57809 83811 14188 -24692 -20831 30242 25304 -27157 -60373 -72516
7173 -72516 -49008 -26766 -33301 -35967 15396 27014 53958 45835 18086 18371 39431 13452 -22193
7160 -22193 -30811 -18623 -34774 -33782 -23573 -6488 45920 18805 98 5324 2998 14166 15079
7147 15079 28626 41170 4215 18617 56390 49609 7428 -5439 -21732 -14854 -1065 -22349
7135 -22349 -35444 -40683 -32029 -12765 -42823 -55450 -69040 -48231 -37289 8406 38228 33773
7123 33773 -17937 -33302 -814 -35191 -59586 -45384 -27552 -26821 -65477 -63712 -20671 5672
7111 5672 -356 -44065 -48570 -12930 11410 23334 16420 26318 59713 50019 89264 67695 38917
7098 38917 21355 15297 53073 95350 36763 18971 2323 -18035 -50344 -14888 6496 -2846
7086b846N7827M3981l4212k3161O50j1881o203L878j2707L651q543N290o489k0870
7072a1635m7905K7504J5874Q03J3373n063l8414p662P868J4040L0117N2852p787
7059D3965j2241J7231L015J917N518o923J6443j8196l8059l2021p650l0914N076
7046e2839k571K2777J9424k2197L0527l077j6764o11L403p75j3530k6086K3678
7033c8641O203l0608J6311O0404p114k2710J2506j9546K0747j5683j2368K6238
7021d261j3818R901l8727l0170K3008L1021N551j7264L7291j0421j7760j0648
7009c6297L997L4187J9722p193k0670J4533J9564q202J5426k1597q37K4099p535
6996B9197J0722L570J4982K2798j5786l3822m9165l6566J9590M8783J1914K2626
$$ plain form
7086 -2846 54981 98962 64750 41589 42239 30358 24155 28033 15326 18977 10434 15724 9235 -11635
7072 -11635 -59540 -32036 -16162 -15359 -1986 -7049 -45463 -53125 -45257 -31217 -1100 51752 43965
7059 43965 31724 48955 51970 53887 59405 52482 68925 50729 12670 -19351 -27001 -57915 -52839
7046 -52839 -55410 -32633 -13209 -35406 -4879 -7956 -24720 -25331 -21928 -22703 -36233 -62319 -38641
7033 -38641 -32438 -63046 -46735 13669 6555 -16155 -3649 -23195 -2448 -18131 -30499 -4261
7021 -4261 -18079 -8178 -46905 -77075 -54067 -23046 -17495 -34759 2532 -7889 -25649 -36297
7009 -36297 -32300 1887 21609 14416 -6254 8279 27843 19641 35067 13470 12633 36732 29197
6996 29197 39919 43489 58471 81269 65483 31661 -17504 -54070 -34480 14303 26217 48843
6984D8843j37K5203J0674n37j8741m0239m6111J782L4908J1093J9316m22k9897
6971A5735k5803j3484j4066K0955L5376k9923r557k3372j6744L770K2671Oo756
6958d1192N320k146l2440N520J1866O957K1414R046j073M2201K1507k6664j4516
6945E800j9724j4603K961K3630M1298J8016j199k6169l325J0864O160l016l4069
6932F624k4445j5772O0626k0884j4186o622M296J8753J4712o85o967k9378j8313
6919c2241K8072J0554j4478J2759j1834K0103K114k7480p85K675j0481K8426J8650
6906B6054K2932K9498k1865m5983l048L2913l8975j8806M2574k2384k6652j5621
6894c9363p99J7934J0436K3796q373j4031n567J8014J1874O4016l6078k7181k2895
$$ plain form
6984 48843 48706 73909 84583 84046 65305 25066 -21045 -19263 15645 26738 46054 45632 15735
6971 15735 -10068 -23552 -37618 -16663 18713 -11210 -20767 -44139 -60883 -57113 -34442 -34436 -41192
6958 -41192 -35872 -38018 -70458 -64938 -53072 -46115 -24701 -15655 -16728 25473 46980 20316 5800
6945 5800 -13924 -28527 -25566 -1936 39362 57378 56179 30010 26685 37549 43709 40693 6624
6932 6624 -17821 -33593 27033 6149 -8037 -14659 -10363 8390 23102 22417 15450 -13928 -32241
6919 -32241 -4169 6385 -8093 4666 -7168 12935 15049 -12431 -13216 -10541 -21022 7404 26054
6906 26054 48986 78484 56619 10636 7588 40501 1526 -17280 25294 2910 -23742 -39363
6894 -39363 -40162 -22228 -11792 12004 3631 -10400 -15967 2047 13921 77937 41859 14678 -8217
6881h217k4171J3951M2151k0477k4810P125N1573P207J4584j8044L4920N618p8993
6868B417J240j357l810M4806L1744m747l9075J2927J3139p84m144l403K5136n2139
6854B1950j5034L017k7543l8742l792K7678J0550J6193J9921J6525p570k5287
6842b134l2238k5127m472J0271N5005K4494j9698o3829M515K9533M0778N5059
6830G2157m8280j4638j3029j3407K8442L3876n1340p3059Q031l357M5270L6652
6818G318Q224N897j46k3265l0173J6643P615o473j9727j2629N047J4212L282M0320
6804A6145M2209j4324k0857m3096j5647Q600K2640m59O842M5774M389P799j3988
6791D6027m7440R006J1797n7815k6760K4755K5449N8191L6564m4705o2275j9864
$$ plain form
6881 -8217 -32388 -18437 23714 3237 -21573 -14448 37125 44332 58916 40872 75792 81410 2417
6868 2417 3657 2300 -1510 43296 75040 70293 31218 44145 57284 56500 52356 48953 74089 21950
6854 21950 6916 9933 -17610 -56352 -60144 -32466 -21916 -5723 14198 30723 23153 -2134
6842 -2134 -34372 -59499 -63971 -53700 1305 25799 6101 -57728 -53213 -23680 17098 72157
6830 72157 23877 9239 -3790 -17197 11245 45121 -6219 -79278 -71247 -74604 -29334 7318
6818 7318 15542 21439 21293 -1972 -32145 -15502 -7887 -14360 -34087 -46716 -41669 -27457 -24175 16145
6804 16145 58354 44030 23173 -19923 -35570 -26970 -4330 -4789 2053 47827 52216 60015 46027
6791 46027 -1413 7593 19390 -38425 -65185 -40430 -14981 43210 79774 35069 -27206 -47070
6779d7070o300O1k907N4838N3463K1306l2690k4409L29j5559J3053N882J4800
6766C4797O0997l9629l7357L9155j779l5259n5320j0216r107Q846j0541j4817
6754g0230L0823M3595P4408m6534k8773l4078l9539L0818O5152J0417j7468J474
6742B0065l993l769k6963l9987R625L8263K7694J7269J6698L4139q747q078m7696
6729B4520k9777l132j6660n993m432k050J0916K0551N389j8815l2404P1627P6446
6716I6186O0422M7044N724J56879K79568L19352L11121O5276l18888l37154k18663
6705D66867j62076q0201n5310n3482j0200j6955j5839R92K2643k6509J7396j3919
6693G3407L932j0952n7754o946J3154k9474K4598L1188j4016k3627Q553J190k282
$$ plain form
6779 -47070 -53370 -53309 -56216 -1378 52085 73391 40701 16292 16621 1062 14115 19997 34797
6766 34797 95794 56165 18808 57963 56184 20925 -34395 -44611 -53718 -44872 -55413 -70230
6754 -70230 -39407 4188 78596 32062 3289 -30789 -70328 -39510 25642 36059 18591 20065
6742 20065 16072 12303 -14660 -54647 -45022 -6759 20935 38204 54902 89041 80294 72216 24520
6729 24520 -5257 -8389 -25049 -31042 -35474 -37524 -26608 -6057 -668 -19483 -51887 19740 96186
6716 96186 156608 203652 209376 366255 645823 965175 1276296 1341572 1022684 685530 466867
6705 466867 304791 224590 169280 115798 105598 88643 72804 73796 96439 69930 87326 73407
6693 73407 77339 66387 8633 1687 14841 -14633 9965 41153 27137 3510 12063 13253 10971
6680A0971p811K3784J920L30K1518L6756k4541n2831J9844l624K505l3472l0314
6667c4965J6620j8950K2200N095j4496M4241O015j1928K2967k0805k1710J4867
6655I151J1126o137m555l5449p214M185L460O8065J7497l3115k5731J0437Q304
6642B0024k4169R869J1113J868m098M182M3514N559m3748m8353j6285j1848m658
$$ plain form
6680 10971 3160 26944 28864 29194 50712 87468 62927 10096 29940 26316 28821 -4651 -34965
6667 -34965 -18345 -37295 -15095 -10000 -24496 19745 25760 13832 36799 15994 -5716 9151
6655 9151 20277 14140 9585 -25864 -33078 -28893 -25433 42632 60129 27014 1283 11720 20024
6642 20024 -4145 5724 16837 18705 14607 18789 62303 67862 24114 -24239 -40524 -52372 -57030
$$ [...]
##END NTUPLES=NMR SPECTRUM
##END=
