##TITLE=Analysis number 327223
Compound Code cc 23801
Book Reference 486/124
Project Code adrs
Chemist Name simons
##JCAMPDX= 6.0         $$ Bruker NMR JCAMP-DX V2.0
##DATA TYPE= NMR SPECTRUM
##DATA CLASS= NTUPLES
##ORIGIN= Bruker BioSpin GmbH
##OWNER= nmr
$$ XWIN-NMR		Version 3.5
$$ Thu Mar 15 14:04:55 2007 GMT Standard Time (UT+0h)  MAYBRIDGE\nmr@NMR_250MHZ
##.OBSERVE FREQUENCY= 250.131544655141
##.OBSERVE NUCLEUS= ^1H
##.ACQUISITION MODE= SIMULTANEOUS (DQD)
##.ACQUISITION SCHEME= undefined
##.AVERAGES= 16
##.DIGITISER RES= 18
##SPECTROMETER/DATA SYSTEM= dpx250
##.PULSE SEQUENCE= zg30
##.SOLVENT NAME= DMSO
##.SHIFT REFERENCE= (INTERNAL, DMSO, 0, 16.522)
##AUDIT TRAIL= $$ (NUMBER, WHEN, WHO, WHERE, WHAT)
$$ ##TITLE= Audit trail, XWIN-NMR		Version 3.5
$$ ##JCAMPDX= 5.01
$$ ##ORIGIN= Bruker BioSpin GmbH
$$ ##OWNER= nmr
$$ C:\u/data/dgb/nmr/ADRS/1000/pdata/1/auditp.txt
$$ ##AUDIT TRAIL=  $$ (NUMBER, WHEN, WHO, WHERE, WHAT)
(   1,<2007-03-15 14:04:31.61 +000>,<MAYBRIDGE\nmr>,<NMR_250MHZ>,
      <created by zg, POWCHK disabled, PULCHK disabled
       configuration hash MD5:
       49 4B E0 1D 92 C2 6B 37 9F E6 65 BC 52 41 86 1D
       data hash MD5: 64K
       E9 73 98 28 8A 73 04 A6 87 99 91 81 9B CE 63 2C>)
(   2,<2007-03-15 14:04:45.08 +000>,<MAYBRIDGE\nmr>,<NMR_250MHZ>,
      <Start of raw data processing
       ef LB = 0.3 FT_mod = 6 PKNL = 1 SI = 32K 
       data hash MD5: 32K
       55 C7 45 72 B7 E6 FA 72 46 E4 5A D9 1E 5F F8 17>)
(   3,<2007-03-15 14:04:47.64 +000>,<MAYBRIDGE\nmr>,<NMR_250MHZ>,
      <apk 
       data hash MD5: 32K
       6D 6C 3F 11 D8 B9 DA 3C 65 2E 57 4A 4B CC 87 ED>)
(   4,<2007-03-15 14:04:48.47 +000>,<MAYBRIDGE\nmr>,<NMR_250MHZ>,
      <abs ABSG = 5 
       data hash MD5: 32K
       29 6A C9 A1 A8 B7 5C 9E CD 62 6F B9 D0 00 59 1F>)
$$ ##END=
$$ 
$$ hash MD5
$$ 02 79 F3 EA 46 11 F5 B6 11 57 4E 31 6A 22 51 C3
##$RELAX= 
##$RELAX= 
##$RELAX= 
##$RELAX= 
##$RELAX= 
##$RELAX= 
##$RELAX= 
$$ Bruker specific parameters
$$ --------------------------
##$DU= <C:\u>
##$EXPNO= 1000
##$NAME= <ADRS>
##$PROCNO= 1
##$TYPE= <nmr>
##$USER= <dgb>
##$AMP= (0..31)
100 100 100 100 100 100 100 100 100 100 100 100 100 100 100 100 100 100 
100 100 100 100 100 100 100 100 100 100 100 100 100 100 
##$AQSEQ= 0
##$AQ_mod= 3
##$AUNM= <au_zg>
##$AUTOPOS= <39 >
##$BF1= 250.13
##$BF2= 250.13
##$BF3= 250.13
##$BF4= 250.13
##$BF5= 500.13
##$BF6= 500.13
##$BF7= 500.13
##$BF8= 500.13
##$BYTORDA= 1
##$CFDGTYP= 0
##$CFRGTYP= 5
##$CHEMSTR= <none>
##$CNST= (0..31)
1 1 145 1 1 1 1 1 1 1 1 1 1 1 1 1 1 1 1 1 1 1 1 1 1 1 1 1 1 1 1 1 
##$CPDPRG= <>
##$CPDPRG1= <>
##$CPDPRG2= <>
##$CPDPRG3= <>
##$CPDPRG4= <mlev>
##$CPDPRG5= <mlev>
##$CPDPRG6= <mlev>
##$CPDPRG7= <mlev>
##$CPDPRG8= <mlev>
##$CPDPRGB= <>
##$CPDPRGT= <>
##$D= (0..31)
0 1 0 0 0 0 0 0 0 0.06 0 0 0 0 0 0 0.0002 0 0 0 0 0 0 0 0 0 0 0 0 0 0 
0 
##$DATE= 1173967470
##$DBL= (0..7)
120 120 120 120 120 120 120 120 
##$DBP= (0..7)
150 150 150 150 150 150 150 150 
##$DBP07= 0
##$DBPNAM0= <>
##$DBPNAM1= <>
$$ [...]
##$SUBNAM7= <"">
##$SUBNAM8= <"">
##$SUBNAM9= <"">
##$SW= 20.6930455092707
##$SWIBOX= (0..15)
0 0 3 0 0 0 0 0 0 0 0 0 0 0 0 0 
##$SW_h= 5175.983436853
##$TD= 65536
##$TD0= 1
##$TE= 683.16
##$TE2= 300
##$TE3= 300
##$TEG= 300
##$TL= (0..7)
0 120 120 120 120 120 120 120 
##$TP= (0..7)
150 150 150 150 150 150 150 150 
##$TP07= 0
##$TPNAME0= <>
##$TPNAME1= <>
##$TPNAME2= <>
##$TPNAME3= <>
##$TPNAME4= <>
##$TPNAME5= <>
##$TPNAME6= <>
##$TPNAME7= <>
##$TPOAL= (0..7)
0.5 0.5 0.5 0.5 0.5 0.5 0.5 0.5 
##$TPOFFS= (0..7)
0 0 0 0 0 0 0 0 
##$TUNHIN= 0
##$TUNHOUT= 0
##$TUNXOUT= 0
##$USERA1= <user>
##$USERA2= <user>
##$USERA3= <user>
##$USERA4= <user>
##$USERA5= <user>
##$V9= 5
##$VALIST= <valist>
##$VCLIST= <CCCCCCCCCCCCCCC>
##$VD= 0
##$VDLIST= <DDDDDDDDDDDDDDD>
##$VPLIST= <PPPPPPPPPPPPPPP>
##$VTLIST= <TTTTTTTTTTTTTTT>
##$WBST= 1024
##$WBSW= 4
##$XGAIN= (0..3)
0 0 0 0 
##$XL= 0
##$YL= 0
##$YMAX_a= 297706
##$YMIN_a= -392355
##$ZGOPTNS= <>
##$ZL1= 120
##$ZL2= 120
##$ZL3= 120
##$ZL4= 120
##$ABSF1= 16.522
##$ABSF2= -4.171173
##$ABSG= 5
##$ABSL= 3
##$ALPHA= 0
##$AQORDER= 0
##$ASSFAC= 0
##$ASSFACI= 0
##$ASSFACX= 0
##$ASSWID= 0
##$AUNMP= <proc_1d>
##$AZFE= 0.1
##$AZFW= 0.1
##$BCFW= 0
##$BC_mod= 0
##$BYTORDP= 0
##$COROFFS= 0
##$CY= 12.5
##$DATMOD= 1
##$DC= 0
##$DFILT= <>
##$DTYPP= 0
##$F1P= 14.0000005364418
##$F2P= -0.99999901652339
##$FCOR= 0.5
##$FTSIZE= 32768
##$FT_mod= 6
##$GAMMA= 0
##$GB= 0
##$INTBC= 1
##$INTSCL= 1
##$ISEN= 128
##$LB= 0.3
##$LEV0= 0
##$LPBIN= 0
##$MAXI= 10000
##$MC2= 0
##$MEAN= 0
##$ME_mod= 0
##$MI= 0
##$NCOEF= 0
##$NC_proc= -4
##$NLEV= 6
##$NOISF1= 0
##$NOISF2= 0
##$NSP= 0
##$NTH_PI= 0
##$NZP= 0
##$OFFSET= 16.522
##$PC= 1
##$PHC0= 174.9788
##$PHC1= 109.4944
##$PH_mod= 1
##$PKNL= yes
##$PPARMOD= 0
##$PSCAL= 4
##$PSIGN= 0
##$REVERSE= no
##$SF= 250.13
##$SI= 32768
##$SIGF1= 0
##$SIGF2= 0
##$SINO= 400
##$SIOLD= 32768
##$SREGLST= <1H.DMSO>
##$SSB= 0
##$STSI= 32768
##$STSR= 0
##$SW_p= 5175.98343685301
##$SYMM= 0
##$S_DEV= 0
##$TDeff= 65536
##$TDoff= 0
##$TI= <Analysis number 999999
Compound Code 99
Book Reference 9
Project Code 9>
##$TILT= no
##$TM1= 0
##$TM2= 0
##$TOPLEV= 0
##$USERP1= <user>
##$USERP2= <user>
##$USERP3= <user>
##$USERP4= <user>
##$USERP5= <user>
##$WDW= 1
##$XDIM= 32768
##$YMAX_p= 416171477
##$YMIN_p= -18272576
$$ End of Bruker specific parameters
$$ ---------------------------------
##NTUPLES= NMR SPECTRUM
##VAR_NAME=  FREQUENCY,     SPECTRUM/REAL,   SPECTRUM/IMAG
##SYMBOL=    X,             R,               I
##VAR_TYPE=  INDEPENDENT,   DEPENDENT,       DEPENDENT
##VAR_FORM=  AFFN,          ASDF,            ASDF
##VAR_DIM=   32768,         32768,           32768
##UNITS=     HZ,            ARBITRARY UNITS, ARBITRARY UNITS
##FACTOR=    0.157963299565203, 1,           1
##FIRST=     4132.6476996994, 0,             0
##LAST=      -1043.33573715361, 0,           0
##MIN=       -1043.33573715361, -18272576,   0
##MAX=       4132.6476996994, 416171477,     0
$$ Real data points
##PAGE= N=1
##DATA TABLE= (X++(R..R)), XYDATA
$$ [...]
18176d6642J4572m7881L4707L4344K3358p0671n817k7726l3298L7286o962K528
18164i2202j0294j7227J0194L8349n0897r9443L0229N9667P868J3446j6082q6694
18152b13086j758Q2075M9861J3748J2344n1000l0289j1250O050K4632N8142K2235
18140c8296r8628n7554j1987J9048j0259K8406Q8092K3124j10141r550L5007n2102
18128a94840J7418M4268M32o1489l1100K4733N4520K4496k9950K1177k7274j6332
18116a73941j6031j9544O362J2720K3048J5924l8362K3873L7882j3468k2061Q374
18104a55224n367J2538K2962j2282L3219L8187k431n6073K126m426P1396J5134
18092d0241K2791J6940n3891n1858m0023J7439M0150J2255o4043j8467O225K4525
$$ y = [-46642, -32070, -79951, -45244, -10900, 12458, -58213, -64030, -91756, -125054, -87768, -94730, -92202, -102496, -119723, -109529, -71180, -122077, -221520, -191291, -131624, -123756, -110310, -126392, -213086, -214844, -132769, -82908, -69160, -56816, -107816, -138105, -149355, -143305, -118673, -60531, -38296, -136924, -194478, -206465, -187417, -197676, -169270, -81178, -58054, -168195, -177745, -142738, -194840, -177422, -133154, -132722, -194211, -225311, -200578, -146058, -121562, -151512, -130335, -157609, -173941, -189972, -209516, -203154, -190434, -167386, -151462, -189824, -165951, -128069, -141537, -163598, -155224, -160591, -148053, -125091, -137373, -104154, -65967, -68398, -124471, -122345, -126771, -55375, -40241, -17450, -510, -54401, -106259, -146282, -128843, -88693, -76438, -140481, -158948, -152723, -128198]
18080a28198j5945l14J10587J7241o1134l7272J6415l8384k5266m6220k2813j9462
18068b50765K7637M992N0064K5538M0937K4080l2815L4898J5757j3266J925N22
18056g0496j4535j6683O88k5822n4516m1679N1625L4493M047p801k3813l4125
18044a98617m1343K4701j0503L8861M9171j450J7086j0064O807q2925m9636K7924
18032b29988Q668j5266J7481L1035K0168k8157p0743q253L2545O7583J4930q711
18020a68708k9403n3089M1337K5353M608k0378P845j4014M4202N6120n1964k2405
18008a80496P2257J1929m359n8491m6421l2227p723r107m6414Q783K2571L5077
17996b34621J01488J9685M215k1457j7118m2504l2669J7186K9471N5745R784l9083
$$ y = [-128198, -144143, -144457, -33870, -16629, -77763, -115035, -98620, -137004, -162270, -208490, -231303, -250765, -223128, -218136, -168072, -142534, -101597, -77517, -110332, -75434, -59677, -72943, -71018, -70496, -85031, -101714, -101026, -126848, -181364, -223043, -171418, -136925, -132878, -140679, -164492, -198617, -239960, -215259, -225762, -186901, -137730, -139180, -122094, -132158, -125351, -208276, -257912, -229988, -221320, -236586, -219105, -188070, -167902, -196059, -266802, -275055, -242510, -174927, -159997, -168708, -198111, -251200, -209863, -184510, -179902, -200280, -192435, -206449, -162247, -106127, -158091, -180496, -108239, -96310, -100669, -159160, -205581, -237808, -245531, -254638, -301052, -292269, -269698, -234621, -133133, -113448, -109233, -130690, -147808, -190312, -222981, -205795, -176324, -120579, -110795, -149878]
17984a49878j9664p2014l9066N9880P5759K8344K2962K8245L862o3630q102O4889
17972f8413k4387m4517j7982J4065q19K5166k172k8844L0996O9305J19860O4358
17960A36616K1003l6605R319L4658n9050l7870j7276K030J8829j4519Q617L3106
17948I8858O798J7424J2082j8454n088N3702L8307n5354o4194j01369p1495N0993
17936c7790L6593l5545l6095j8197m6496l8363J2115J8677J1869J4554L1114L9409
17924d8155k6364l5443k8578J5199k5245k6971Q183o339M824L3725K271j4852
17912a47745O021R922m0518p2341M03L6393j165K6114J7625M750k1933k9738L4647
17899a77565L2710j6291l8703L5858K7070j9087m649j6306j6969n0141M660j1110
$$ y = [-149878, -169542, -241556, -280622, -220742, -144983, -116639, -93677, -65432, -61570, -125200, -133302, -68413, -92800, -137317, -155299, -141234, -142053, -116887, -119059, -147903, -116907, -47602, 72258, 136616, 157619, 121014, 130333, 164991, 105941, 68071, 50795, 52825, 71654, 57135, 65752, 98858, 105656, 123080, 135162, 116708, 111620, 165322, 203629, 148275, 84081, -17288, -88783, -37790, -1197, -36742, -72837, -91034, -137530, -175893, -163778, -145101, -133232, -118678, -87564, -48155, -74519, -109962, -138540, -123341, -148586, -175557, -167374, -173713, -168889, -135164, -132893, -147745, -141724, -131802, -172320, -244661, -244258, -207865, -209030, -182916, -165291, -160541, -182474, -212212, -177565, -144855, -161146, -199849, -163991, -136921, -156008, -160657, -176963, -193932, -244073, -239413, -250523]
17887b50523N1744k2161j7567L1646J0679J2731k9539Q8110L0477k8910n4840
17876a78153p6935K0658M4930l1156m9156L6271P6663l898o4004r905M9671J6070
17864a68944l2347j4517L0022M4749O189J6017k8808N016q9715O963J3206l4465
17852b46634p3397n788M3939K2351L8799J06699k6496r1461L9658K2747q638j0072
17840a88293l6513L2154j3863N1040j5952m5470L6668M4280J8617j9025o0684
17829a97041m167J1668m1401J9005J4301M6456l295p5399k8422K7215j991k4882
17817b57953j1531N3424N8736L0542l3830m4931Q278R404j9751J3861K0910n2299
17805b25140k9237J2499J5420J346L2362K2411r991J4219j6742r558l0372J7699
$$ y = [-250523, -198779, -220940, -238507, -206861, -196182, -183451, -212990, -124880, -94403, -123313, -178153, -255088, -234430, -189500, -220656, -269812, -233541, -156878, -160776, -224780, -234685, -185014, -168944, -201291, -215808, -185786, -141037, -134848, -118831, -147639, -142623, -232338, -225375, -212169, -246634, -320031, -325819, -281880, -259529, -220730, -114031, -140527, -231988, -192330, -169583, -178221, -188293, -224806, -192652, -206515, -155475, -171427, -216897, -180229, -135949, -117332, -136357, -197041, -201208, -189540, -230941, -211936, -197635, -151179, -154474, -229873, -258295, -231080, -233071, -257953, -269484, -216060, -157324, -126782, -160612, -205543, -197265, -187861, -207612, -193751, -172841, -225140, -254377, -241878, -226458, -225112, -192750, -170339, -180330, -166111, -182853, -192411, -222783, -205084]
17793b05084N4803j0221J7634n649K0844L7941l2955k5135l2639j6082k1963j6532
17781b35038L597m273K7j0360j8805o0391k8010O4524K7246l0655M9387j7865
17769b60616j8667Q57l7235M1983O2685J7513m1866j0998J5305j0997Q5894K9306
17757a26836r2218L9076J7616l8095P0J5347K0654K4181l3572r559P357l1675
17745b07654J2358J2889K3683m0373n7700J9189J6503J5328M462J1769K4298n6123
17733b21371m552L6679Q44q6847M4191L3651m4529r936l820N7088K2410J3294
17721a62898k4809k3878m8179J8174O5281K0697J041m4922Q242M4254q2090q054
17709b37141L3008k9626n193K2627P982P0947J6829J577k5816j6164k8147k2573
$$ y = [-205084, -150281, -160502, -142868, -148517, -127673, -89732, -122687, -147822, -180461, -196543, -218506, -235038, -231441, -235714, -235687, -246047, -264852, -325243, -353253, -288729, -261483, -292138, -242751, -260616, -279283, -278426, -315661, -273678, -210993, -193480, -235346, -246344, -231039, -242036, -156142, -126836, -219054, -179978, -162362, -200457, -200387, -185040, -164386, -140205, -173777, -183336, -175979, -207654, -195296, -182407, -158724, -199097, -256797, -237608, -221105, -205777, -201315, -189546, -165248, -221371, -225923, -189244, -188400, -275247, -231056, -197405, -241934, -251870, -255690, -198602, -176192, -162898, -187707, -211585, -259764, -241590, -176309, -155612, -154571, -199493, -191251, -146997, -229087, -237141, -204133, -233759, -238952, -216325, -208343, -137396, -120567, -118990, -144806, -160970, -189117, -211690]
17697b11690j5317l2639R0514L5138j9558l469N952N2020m0177m7181j0410j9382
17685b16199o3028n2660N6020O3132L1069j9514l3527K7140j5611p3625j9693
17674c16496m8392j2863M9774Q3196N2775N083k9792R746n515k7050j7753l703
17662b60990K8243L9977L2406j8240n668p585l3622k5969j3446l97n170N7957
17650b12504K1476m1163k1l9413n4157M3502J0681j5322K6262l5175L3861j1284
17638b73257k5864J3671j220N418O6198J9830m1845l7861j8626J6491L2602O9518
17626a74945k236n5395k641k0578j9509k1850l8495o4935L4295O4977m080j8485
17614c23877N162J13q251l698J1794m2513K6011J00661K388M1905q696J6807J0977
$$ y = [-211690, -227007, -259646, -169132, -133994, -153552, -157021, -151069, -99049, -139226, -186407, -196817, -216199, -279227, -331887, -275867, -212735, -181666, -201180, -234707, -207567, -223178, -296803, -316496, -364888, -377751, -327977, -244781, -192006, -186923, -216715, -206969, -212484, -239534, -257287, -260990, -232747, -192770, -160364, -178604, -184272, -191857, -225479, -251448, -264894, -265291, -270461, -212504, -191028, -232191, -232212, -271625, -325782, -282280, -271599, -286921, -260659, -295834, -261973, -273257, -299121, -285450, -286670, -281252, -215054, -195224, -237069, -274930, -293556, -277065, -244463, -174945, -177181, -232576, -235217, -255795, -275304, -297154, -335649, -400584, -366289, -301312, -305392, -323877, -318715, -318602, -326853, -330551, -318757, -361270, -335259, -234598, -232210, -190305, -199001, -182194, -171217]
17601a71217r651k1135m631k1186m2575k2245l3284N7662L9342J6476r264o8338
17589b90046J2256M2975m369o5267k0681O2644K5922K0700m3301l7663j6837L2547
17577b81120J6874q779O4741j9267k4005l16o9254l0893J4303L4087K1111l9702
17565c22220p449L6566L611q5820j590L5856K184R903r744k6336K5757P7290O9227
17552a92765j2446o5412j7558n2289J237O4067K692K8753M454m4336l0085N7726
17540b55962L0741j0468m3661K3056l9203J2530l3438k9247j0863n1253l7595
17529d45363k1703j3676J923O8382P5513J052k5230J8109n1k6652p1107N505j1584
17516d44882q0500k508j1163K5039J8432l0277k4503P3923r539l4044k571L8483
$$ y = [-171217, -180868, -202003, -206634, -227820, -270395, -292640, -325924, -268262, -228920, -212444, -221708, -290046, -277790, -234815, -239184, -304451, -325132, -262488, -236566, -215866, -259167, -296830, -313667, -281120, -264246, -273025, -208284, -227551, -251556, -251872, -321126, -352019, -337716, -303629, -282518, -322220, -329669, -293103, -289492, -375312, -376902, -341046, -338862, -328959, -338703, -365039, -339282, -261992, -192765, -205211, -270623, -288181, -340470, -339233, -275166, -272474, -243721, -239267, -283603, -313688, -255962, -225221, -235689, -279350, -256294, -295497, -282967, -316405, -345652, -356515, -407768, -445363, -467066, -480742, -478819, -410437, -334924, -333872, -359102, -340993, -341044, -367696, -438803, -433298, -444882, -525382, -527890, -539053, -514014, -495582, -525859, -550362, -476439, -485978, -520022, -522593, -484110]
17504d84110k5240l7289l4735M2157R7184L1081j2988r714N116L8492N6410m456
17492c38092r7163k1218K612M3833j7702J1862K3535k248k1603M850K791L9874
17480c68669P307l7190o2830m189R644o815k5811j3743M7940j1586j6116K6058
17468d56000M3369M1304O0239M0172K3716M7004n406l7479n9255J6607L7332o6034
17456c14431n6749l5810J9690Q1129N4241N9191j8411m594l278k3735m4253P354
17444b79656n349J6827K5484j017n2952q5398K2537J04809J07300O4560N1389
17433c1466M0271J00373P6273M7612O7037J01041J15558J76139J72130J46893
17423A011861J97178J88499K43589L86991M09061M26630M59800N84115P97897
$$ y = [-484110, -509350, -546639, -581374, -539217, -442033, -410952, -423940, -433654, -428538, -390046, -333636, -338092, -435255, -456473, -453861, -410028, -427730, -415868, -392333, -394581, -416184, -411334, -408543, -368669, -361362, -398552, -461382, -465571, -455927, -462742, -488553, -502296, -454356, -465942, -482058, -456000, -412631, -371327, -311088, -270916, -247200, -200196, -205602, -243081, -302336, -285729, -248397, -314431, -371180, -406990, -387300, -306171, -251930, -192739, -211150, -215744, -219022, -242757, -287010, -279656, -285005, -268178, -242694, -243711, -296663, -382061, -359524, -254715, -147415, -82855, -31466, 8805, 109178, 185451, 233063, 300100, 401141, 516699, 692838, 864968, 1011861, 1209039, 1397538, 1641127, 2028118, 2437179, 2863809, 3323609, 3907724, 4705621]
17414D705621R72735J288653J762481K677090M013450N779783Q373325J1544044
17406D1117182J4852149J6258021J1586769J39626r220352j0898045r464744q202773
17398D6167833o652086m458744j894398R30828L961638P356566J1044423J4123923
17390G0579983J3422099N148106o490137j1984495j1503862j0209735r206013
17383C9755946p737456o067146m457137l331481k513886j954433j497802j220719
17375A0975886r50155q09846p11668o73804o08648n78673n06571n01545m22165
17366E212811l29623l16617k58348k35709j86064j97364j51482j97719j39350
17357C200535j56261j14833j07147j56576j37745p2554j09970o2039p4802q6538
$$ y = [4705621, 5678356, 6967009, 8729490, 11406580, 15420030, 21199813, 29573138, 41117182, 55969331, 72227352, 83814121, 83953747, 74733395, 63835350, 54370606, 46167833, 39515747, 35057003, 33162605, 34093433, 38055071, 45411637, 56456060, 70579983, 84002082, 89150188, 82660051, 70675556, 59171694, 48961959, 39755946, 32018490, 25951344, 21494207, 18162726, 15648840, 13694407, 12196605, 10975886, 10025731, 9215885, 8504217, 7830413, 7221765, 6643092, 6136521, 5634976, 5212811, 4883188, 4566571, 4308223, 4072514, 3886450, 3689086, 3537604, 3339885, 3200535, 3044274, 2929441, 2822294, 2665718, 2527973, 2455419, 2345449, 2283410, 2208608, 2122070]
17347B122070j20121q1122p8319r9076p4429j6997m1229k9187n3911q6542k6037
17336A415100k6990k1592p5440m9929r578q235j8387L7645q174J3299n1249j17807
17324A078663j01457K8281M2630N3824R846r5243j50853J3824M7978j5471l1161
17313H80861j1019l7575k1941K8867M0981J4856r955p9774l7912N375j7198N3375
17301H08941O0734R526p4185j5116k5025q0878m9782M3486o277l2917k8218L1821
17289F42110L1793P375m347R748L5461L5510m4383k6340l2360L2300O6817L7648
17277G91332k430R756k4898o1856q1831J645J6543k4577q233n0689J7273J3609
17265E95644K3220j5856K3017k6381l053j2966j9916q9334o3397j4820J4771M745
$$ y = [2122070, 2001949, 1920827, 1842508, 1743432, 1669003, 1652006, 1610777, 1581590, 1527679, 1441137, 1415100, 1388110, 1366518, 1291078, 1241149, 1231571, 1223336, 1204949, 1242594, 1234420, 1247719, 1196470, 1078663, 977206, 1005487, 1048117, 1101941, 1111787, 1016544, 865691, 879515, 927493, 912022, 880861, 869842, 832267, 810326, 839193, 880174, 895030, 885075, 805301, 767389, 772764, 755566, 808941, 869675, 879201, 805016, 789900, 764875, 683997, 634215, 677701, 671424, 638507, 610289, 642110, 673903, 681278, 676931, 686679, 722140, 757650, 713267, 686927, 654567, 686867, 753684, 791332, 788902, 798658, 773760, 711904, 630073, 631718, 648261, 623684, 615451, 564762, 582035, 595644, 618864, 603008, 626025, 599644, 596591, 583625, 563709, 474375, 410978, 396158, 410929, 415674]
17253D15674j6584L121l589k4991K5047N3147j7160J438k2097m8192j1572N5040
17241D09282P557M195k37o0019q2151k4006L1735n0404Q42N5055N0231m2367L5237
17228C34950N2030l872p4837O484O66J7427j600J5927J2298m5641J3585n6643
17216B70774o0138L7196O6840o4226R455o728l0240j7016j0904K4738J0474j1030
17204B19195o1243p261J645M0559L0762M3006M2395m7083n6917p6034j7999P7122
17192A88147M1204M4204L6818j4666k0194k1746p7396l7895R3639M4735j0771
17181B66079o3861k3554K8203o2116j9227N3651Q1275Q0946J5717j7365p3674
17170B66074n5470J7545j4047j1872m297M4640k8268K4290M9200m1817n7916L8451
$$ y = [415674, 399090, 402211, 398622, 373631, 398678, 451825, 434665, 436103, 414006, 365814, 354242, 409282, 416839, 421034, 420797, 360778, 278627, 254621, 286356, 235952, 236794, 291849, 342080, 299713, 334950, 386980, 383108, 308271, 314755, 315421, 332848, 331248, 347175, 359473, 313832, 327417, 270774, 210636, 247832, 314672, 250446, 259901, 253173, 222933, 205917, 195013, 219751, 230225, 219195, 157952, 150691, 152336, 192895, 223657, 266663, 309058, 261975, 205058, 129024, 111025, 188147, 229351, 273555, 310373, 295707, 275513, 253767, 176371, 138476, 232115, 276850, 266079, 202218, 178664, 206867, 144751, 125524, 179175, 260450, 341396, 357113, 339748, 266074, 210604, 228149, 214102, 202230, 197933, 242573, 214305, 238595, 287795, 245978, 188062, 226513]
17158B26513K6611K7894k5161p1695N1875K1969k9128j7960L814J3955L3195l9359
17146B22523j4893j840M8431j7189Q936j241l2702K1525M4392p315l1219J2865
17134B52273j5370p3110p4524j2290Q252M9443j2690n3037l2718P0070N0857J3681
17122A70837k0420J5384k679p3727p5176J8448L3177O0646r326j9702j5252l013
17110G9197K7207J3205N4912K9377J8032l9346J4176J443p8656L3915J7356o8831
17098A01987j3500R680Q236Q0002J7777j07604m2920l138Q7291M9152N418q970
17086A83411o4927m4280K868K3573l4743m7220N8198L5821Q463o1803L2840J05647
17074A97848k3647p8274q1141M3319O8391J180l7743o426O969p815O3283K3043
$$ y = [226513, 253124, 281018, 255857, 184162, 236037, 258006, 228878, 210918, 214732, 228687, 261882, 222523, 207630, 205790, 254221, 237032, 245968, 244727, 212025, 233550, 277942, 270627, 239408, 252273, 236903, 163793, 89269, 76979, 85231, 134674, 121984, 68947, 36229, 106299, 157156, 170837, 150417, 165801, 163122, 89395, 14219, 32667, 65844, 126490, 117164, 97462, 82210, 79197, 106404, 119609, 174521, 203898, 221930, 182584, 196760, 198203, 119547, 153462, 170818, 101987, 88487, 98167, 106403, 186405, 204182, 96578, 53658, 50520, 137811, 186963, 192381, 183411, 118484, 74204, 77072, 100645, 65902, 18682, 76880, 112701, 121164, 59361, 92201, 197848, 174201, 95927, 14786, 58105, 126496, 127676, 89933, 83507, 90476, 82661, 145944, 168987]
17062A68987k2579K8499j3721j5723k7610j9589K4021k339N198k1848l4588J3773
17050H2481L0200k5204k1347L3422K5019j1572r173J0700q84J027m7156L7516
17038A05029J3143p148k2899M2100N0397P5876m0409n2188J4623k0512n2856l7576
17026F7580K777j0844J4434L887M0300P569o1396j4438J1280K2898L4550j1266
17014A07331p6231l4905k8661j2805M6073R0131N720m326L1694L961k4788k8346
17002G4848O4290k458L9287J7684l8219n629L5465K2051m6200m4912k7199j2521
16990G6487j3881r948L2362R479l9339p334q589L1361Q288p609N3962K4548L2851
16977A82638l424l6986k3692q60r319J5995j2401j8641j2952l355Q0965K3124
$$ y = [168987, 146408, 174907, 161186, 145463, 117853, 98264, 122285, 119946, 125144, 103296, 68708, 82481, 112681, 87477, 66130, 99552, 124571, 112999, 103826, 114526, 113642, 114669, 67513, 105029, 118172, 111024, 88125, 130225, 180622, 256498, 216089, 163901, 178524, 158012, 105156, 67580, 70357, 59513, 73947, 77834, 118134, 125703, 64307, 49869, 61149, 84047, 118597, 107331, 31100, -3805, -32466, -45271, 802, 90933, 96653, 92327, 124021, 127982, 103194, 74848, 139138, 136680, 175967, 193651, 155432, 149803, 185268, 207319, 161119, 116207, 89008, 76487, 62606, 52658, 85020, 94499, 55160, 47826, 39237, 70598, 78886, 71277, 125239, 149787, 182638, 179214, 142228, 118536, 117676, 108357, 124352, 111951, 93310, 80358, 77003, 157968, 181092]
16965A81092J8648k4800M4817J53547J45779J18937J73325J00008p1291j70858
16955F69204j58665j18074l4930L8531O3976O2445R2743J24771J51486P0458j6770
16944I45175j27604j19687j00725j20141o8269n468l8302p3280o6888J0667n1638
16933A83840n4571j9666J9703j3267J6097m9438K902l052j2015K3761N9505j8698
16921A35101n9768j57P2319J7335n2125j4145J5944k5874M997j9884J1345L3008
16909A18096L4155k3809o4574n0461m569Q6562J09978K0650m7455l8803j2347
16898A27423m0552m4256M918P1552l8753m1965K1886M4866K1976l9190p779j1831
16886F8295J2180r1440J3869K0804j582R723q571K5559L557p7232j9644K5212
$$ y = [181092, 199740, 174940, 219757, 373304, 519083, 638020, 811345, 911353, 840062, 669204, 510539, 392465, 357535, 396066, 460042, 522487, 615230, 740001, 891487, 961945, 945175, 817571, 697884, 597159, 477018, 408749, 403281, 364979, 291699, 224811, 235478, 183840, 129269, 109603, 129306, 116039, 132136, 82698, 85600, 82548, 70533, 94294, 153799, 135101, 75333, 75176, 147495, 164830, 112705, 98560, 114504, 88630, 93627, 73743, 85088, 118096, 152251, 128442, 63868, 13407, 8838, 95400, 205378, 226028, 178573, 139770, 127423, 86871, 42615, 47533, 119085, 80332, 38367, 60253, 105119, 127095, 87905, 80126, 68295, 80475, -10965, 2904, 23708, 22126, 31849, 23278, 48837, 52394, -24838, -44482, -19270]
16874a9270P9409M9823q3694o897J6432L1627J9163Q438j2536m4149L4650P2855
16862A45851J5657r323J3908n5668r7371M6392N1693p362o291k064O1160L2605
16850A89187n73M3848K2742L1369L2393k7770O7076N2506J6235k9522l6923k0445
16838C40123p8726l2401J1295M7679M4158j7138K9606P4679M6335L863m6621r3864
16826C28988l8414K8539Q672K508j4072l1510l7842m5805o8969J7948M8147j8712
16814A79478l8250Q668J8918o799j3694m993r879n338m2365j3879M9624K847l3514
16801I0824q8814O0275j0268N9899P9578j5658n5747j7836N260l0283o8265m5802
16789c6837N5240j8936r1996o6521K4782N4070N2705J1614m6121J5811R862M6747
$$ y = [-19270, 60139, 109962, 26268, 19371, 35803, 67430, 86593, 95031, 82495, 38346, 72996, 145851, 161508, 152185, 166093, 110425, 13054, 59446, 111139, 103777, 97486, 95422, 156582, 189187, 188614, 232462, 255204, 286573, 318966, 291196, 358272, 410778, 427013, 397491, 360568, 340123, 261397, 228996, 240291, 287970, 332128, 314990, 344596, 419275, 465610, 469473, 422852, 328988, 290574, 319113, 327785, 330293, 316221, 284711, 246869, 201064, 132095, 150043, 198190, 179478, 141228, 149896, 168814, 162015, 148321, 143328, 133449, 128111, 85746, 71867, 121491, 124338, 90824, 2010, 62285, 52017, 111916, 191494, 175836, 120089, 102253, 107513, 77230, 8965, -36837, 18403, -533, -92529, -159050, -134268, -80198, -27493, -15879, -62000, -46189, -36327, 10420]
16777A0420L5097n832r997l7851M0521Q683L9584M5408K1564q6023m3068j0900
16765G606j4235N5749N5360K7779k0068m4876j8004N1587O499l622J284Q108K544
16752A15711p268o2725o866R3922M0338n0846o9521K7123P5871L1543j2922m8757
16740A25603K7235j053r396j3701M701k9820o468K773p209N364m336K6777J6539
16727A37009K0589j8592j0381J5984n8896K779L7172o860J3206k6044l4295l7069
16715C4602J1214l8969p8973J0182K8445j983J233M306M458L0282N7211J5n8670
16702C353n141Q051L7066J0097K620n5964k0783L7828L2069j2535j6593j2018
16690H050M4631L5896l7099J4028K1595L4519J0571l2066k6567q952J4077n656
$$ y = [10420, 45517, 39685, 29688, -8163, 32358, 41041, 80625, 126033, 147597, 61574, 18506, 7606, -6629, 49120, 104480, 132259, 112191, 67315, 49311, 100898, 107397, 103775, 105059, 113167, 115711, 108443, 45718, 38852, 132774, 173112, 122266, 52745, 79868, 155739, 187282, 174360, 125603, 152838, 151785, 142389, 128688, 133389, 103569, 97101, 99874, 92665, 98029, 93693, 120470, 137009, 157598, 139006, 128625, 144609, 85713, 88492, 125664, 118804, 132010, 105966, 71671, 34602, 45816, 6847, -72126, -61944, -33499, -35482, -34249, -29943, -25485, 4797, 62008, 62023, 3353, -1788, 6263, 43329, 53426, 56046, 82, -20701, 17127, 49196, 36661, 20068, 8050, 52681, 88577, 51478, 65506, 87101, 121620, 132191, 100125, 73558, 64606, 78683, 73027]
16678G3027j9659k6377L5908K2854L7254l7919o2421m2000K3960K4959K8960j7136
16666D1410l5759j5230M951p0386K233O1945M8419N6213j1349k9724J0255M2782
16654A05760j5060j1709j6801L5193j75J908l0847j0289R424m0328J5378k1632
16642B0822K3005L4601J0651k6816J7848N6942l150q3293r423M1231q880L768
16630G7306n198K5318Q284k7474j9411L9427K5454k4419Q644J0219k5333p9778
16618A3039j5950M2378m432L1155N9748L7048l0589n1826j6035J7895j4278O583
16606G4736j017O1069P3403l7059l0929J0234J80j1734l5883l963q2758j9358
16594c079l745Q354K7511J9093p811n0653M1444L4285P0236L036m8394K2552N9037
$$ y = [73027, 53368, 26991, 62899, 85753, 123007, 85088, 22667, -19333, 4627, 29586, 58546, 41410, 5651, -9579, -4628, -75014, -72781, -10836, 37583, 93796, 82447, 52723, 62978, 105760, 90700, 78991, 62190, 97383, 97208, 99116, 68269, 57980, 67404, 27076, 42454, 20822, 43827, 78428, 89079, 62263, 80111, 137053, 133903, 50610, 41187, 82418, 73538, 77306, 72108, 97426, 105710, 78236, 58825, 98252, 123706, 99287, 107931, 118150, 92817, 13039, -2911, 39467, 35035, 66190, 125938, 162986, 132397, 80571, 64536, 82431, 68153, 74736, 73719, 134788, 208191, 171132, 140203, 150437, 150617, 138883, 103000, 99037, 16279, -3079, -6824, 1530, 29041, 48134, 40323, -10330, 31114, 65399, 135635, 138671, 90277, 112829, 171866]
16581A71866k4183m8500r2296l209N4586J2246m3440J8009j9096m860m7831k9058
16569e5766l0868L56O0196J0220K3078M8048N7810k0166j0775k7359n8466p723
16557a1415R2074K2599j9012k6885J9446l1834O484r138k6134l4620L9443O1143
16545H2151k069l4840P093K3397j8631m3737N459k9290l4940N550K5829O4160
16533E0132R4050o7357q950K5590J110o788j9256K5392L4617k812q6595n366K9531
16520F3298K3156l6639j8631r212j4511L6635l9900m0490K4899N4016M0920Q962
16508I2503L505O315p953J3946K1005M9207r5910o1025J6415L9718M8828j0952
16496A15602o3655k0239R351j1487M1356R1889J9155l1596q240N805K0433j0248
$$ y = [171866, 147683, 99183, 6887, 3678, 58264, 70510, 27070, 45079, 25983, 21123, -26708, -55766, -86634, -86278, -26082, -15862, 7216, 55264, 113074, 92908, 82133, 54774, -3692, -11415, 80659, 103258, 84246, 57361, 76807, 44973, 51457, 42319, 16185, -18435, 21008, 82151, 80082, 45242, 52335, 75732, 57101, 13364, 18823, -10467, -45407, -39857, -14028, 50132, 144182, 76825, 67875, 93465, 94575, 87787, 68531, 93923, 128540, 125728, 39133, 33767, 63298, 86454, 49815, 31184, 21972, 7461, 44096, 4196, -36294, -11395, 42621, 83541, 92503, 96008, 102323, 94370, 108316, 129321, 178528, 82618, 21593, 38008, 77726, 126554, 115602, 51947, 31708, 41059, 29572, 70928, 162817, 181972, 150376, 142136, 147941, 168374, 158126]
16484A58126l4984Q801N71K1642r5723l8623m376j3501L8686O3985p750n6420
16472D0434L2789J0970k5796j2954n1316n813J6962K3662L0021O0747N8839r0701
16460H7844o0839K5550R035K0127L0278m5234J5010j4133m1411j7816n476K5232
16448B8167N2852k0066m2535l8906j3695J0008L6490O820J8157K0825O094L8819
16436A03030K4508n5328k5436K6143L4125k326k9643k5617k6661l9868L9788M0922
16424F3637O941k3979j7974k1285M3524J5236p9959m583L928K2302O4978K7519
16412A00285n0464k127j9294K792L7858k572L5822l8068L939N0857P2515O476
16400A98019l8372n4303n7844k584k723J1433l928q884R72M2656M2137m0490m0108
$$ y = [158126, 123142, 131943, 132514, 154156, 58433, 19810, 15434, 1933, 40619, 104604, 96854, 40434, 73223, 84193, 58397, 45443, -5873, -11686, 5276, 28938, 58959, 119706, 178545, 87844, 27005, 52555, 61590, 81717, 111995, 66761, 81771, 67638, 26227, 8411, 2935, 28167, 81019, 60953, 18418, -20488, -34183, -24175, 12315, 19135, 37292, 58117, 64211, 103030, 127538, 72210, 46774, 72917, 107042, 104716, 75073, 49456, 22795, -17073, 22715, 63637, 70578, 46599, 28625, 7340, 50864, 66100, -13859, -18442, -14514, 7788, 72766, 100285, 49821, 47694, 28400, 31192, 69050, 66478, 102300, 64232, 68171, 119028, 191543, 198019, 159647, 105344, 47500, 44916, 42193, 53626, 49698, 40814, 41786, 84442, 126579, 86089, 45981]
16387D5981j7870J1177P0924L98l1175K3324k2213J0601K4632j1796j6470J8158
16375A05671k8985m0331o669O2999q085M518J9586P520M0165J1396j2473k1550
16363A33762K8172o890m2589J1482j8902k4143m5881k1609K3384j4777M693l5604
16351h902K9461L6756k1515J2675p432L2289r381l2793j6827m024K4802j7096
16339A8013K451J0247M2618K3491R608N5349j2897J9792J5677l1960K5436Q319
16327A86144j7027q144j687L7340l9885m8300k8l4440J2357K7332j9833k2081
16315G1748j4710L5546l7923l6541N1744N4412j8524J6117N8219j6598k3776k7332
16303A12382l3170j5355M1061K2985m9265j00589j7243J0387K4787M567N3054
$$ y = [45981, 28111, 39288, 110212, 110610, 79435, 102759, 80546, 91147, 115779, 103983, 87513, 105671, 76686, 36355, 29686, 92685, 84600, 89118, 108704, 116224, 156389, 167785, 155312, 133762, 161934, 155044, 112455, 123937, 105035, 80892, 35011, 13402, 36786, 22009, 26702, -8902, 20559, 57315, 35800, 48475, 41043, 73332, 63951, 31158, 14331, 10307, 35109, 18013, 20464, 30711, 73329, 96820, 106428, 161777, 148880, 168672, 184349, 152389, 177825, 186144, 169117, 160973, 159286, 196626, 156741, 108441, 108413, 73973, 86330, 113662, 93829, 71748, 57038, 92584, 54661, 18120, 69864, 124276, 105752, 121869, 180088, 163490, 139714, 112382, 79212, 63857, 104918, 127903, 78638, -21951, -39194, -28807, -4020, 547, 53601]
16292E3601M7666j6515l456K480n5347k6776l545L5792N9211j3930N658K6989
16280A11828n2803j1422K6965j2643l6773l5282k6054L8799N0817o363j6055N521
16268C6535M7398K680K5010K7735J8057j3603l2222M1192K3416m4198l3115n0246
16256D8639k8829J9783m1001l64P635M0361K1088k514k9975n7179J2945L8685
16244B9274L0272j1981K079J4454m0295K7837m005n4549n05J6929m3163j8389
16232e2042O3185J0525J7833k2154n5378k6096k8461P9240J8649k539M0570j0376
16220C2956m2931K0011j731J613J9791R5532K8366m3447o1864k8247M0153M5473
16208A05675M4110n527k2822K3512l936J949p2583m5066k1873L1895R6842j7162
$$ y = [53601, 101267, 84752, 81296, 83776, 28429, 1653, -1892, 33900, 93111, 79181, 84839, 111828, 59025, 47603, 74568, 61925, 25152, -10130, -36184, 2615, 53432, 47069, 31014, 36535, 83933, 86613, 111623, 139358, 157415, 143812, 111590, 152782, 176198, 132000, 98885, 48639, 19810, 39593, -1408, -1772, 5863, 46224, 67312, 64798, 34823, -22356, -9411, 29274, 59546, 47565, 49644, 64098, 23803, 51640, 47635, -6914, -7419, 9510, -33653, -52042, 11143, 21668, 39501, 17347, -38031, -64127, -92588, -13348, 5301, 2762, 43332, 32956, -9975, 10036, 8305, 9918, 29709, 125241, 153607, 110160, 48296, 20049, 60202, 105675, 149785, 144258, 121436, 144948, 141012, 142961, 70378, 25312, 3439, 35334, 132176, 115014]
16196A15014j0133r526J9681Q027L0067N8338J350k2789j1897N225m4183n1386
16184H7788J7642k074K8915j5351l9781j84l5146L9157P5185M1226k1412j5620
16172A60345J8630j4030p1962l9055L2251Q1072l7738k2540L9267l2478l2841
16161H0921j8814J3834L9586L9090N832o2667r028L8762K8602P970j4177k1302
16149A28609M5773J3618K8154K0098k5772l3019l9304K5680j9720l3791o5867
16138D4459k0750O8943L3471l7625k5512K7115j8118J7523L7701N7557l559J7312
16126A98517K2542m4520j6573K5854K001n0193l1116n072k3281o016M1921O6619
16114A80683K5541L641k9705K917M9482Q185r788l9811n834n6286m8502r189M882
$$ y = [115014, 104881, 95355, 115036, 123063, 153130, 211468, 212818, 190029, 178132, 183357, 139174, 87788, 105430, 103356, 132271, 116920, 77139, 76955, 41809, 80966, 156151, 197377, 175965, 160345, 178975, 164945, 92983, 53928, 86179, 167251, 129513, 106973, 146240, 113762, 80921, 62107, 75941, 115527, 154617, 160449, 97782, 88754, 127516, 156118, 164088, 149911, 128609, 174382, 188000, 216154, 236252, 210480, 177461, 138157, 163837, 144117, 110326, 44459, 23709, 92652, 126123, 88498, 62986, 90101, 71983, 89506, 127207, 184764, 181205, 198517, 221059, 176539, 159966, 185820, 187821, 137628, 106512, 101440, 78159, 72143, 114064, 180683, 206224, 209865, 180160, 183077, 232559, 240744, 230956, 191145, 185311, 129025, 80523, 71334, 76216]
16101G6216K59m4451j0097N5798R3743L5297l3598j5764K0956m4156l7636L661
16089A00228K0704J5791K5120J1498k0770J3889j8531R5395N5733l2769p1321
16078A94967M0815l9931k6057J1128L94j7623N2185j2615k3060L2115J5530r905
16066B17943n054k7366o944l4792j5455L1050L1818j3079l5109k4206m015l746
16054A11045J8540n4665j5033J5436M782m7386j4194P5024N2933P1489K9656n1219
16042A96408l4934j0677M7420j5798o0433O112k8649j0306N3595K800P238K8753
16030A81529K3278l208O360M9106J9840J0741J8486o4430l7716n9239o9234L6482
16018A11995J1536J718J2506L6875J7517K284k1446k1825P917m8616m2445O1988
$$ y = [76216, 76475, 32024, 21927, 77725, 171468, 206765, 173167, 157403, 178359, 134203, 96567, 100228, 120932, 136723, 161843, 173341, 152571, 166460, 147929, 243324, 299057, 266288, 194967, 235782, 195851, 169794, 180922, 181316, 163693, 215878, 203263, 180203, 212318, 227848, 217943, 212889, 185523, 178579, 143787, 128332, 159382, 191200, 178121, 143012, 118806, 114791, 111045, 129585, 74920, 59887, 75323, 80105, 32719, 18525, 93549, 146482, 217971, 247627, 196408, 161474, 150797, 198217, 182419, 121986, 128098, 99449, 89143, 142738, 145538, 152776, 181529, 204807, 201599, 207959, 257065, 276905, 287646, 306132, 241702, 203986, 144747, 75513, 111995, 123531, 125249, 137755, 174630, 192147, 194431, 172985, 151160, 159077, 110461, 68016, 130004]
16006A30004J6386J2477J9540j9835o0522J3005K4158n3950N63P3156Q2416n0539
15994A86859l440L233l1414l7868J138m069n0727J2684P260Q2312p900l9306l1601
15981H7161K8686M4354K1342J3469K6425l3436o0673L626K0259j0215M4973L671
15969A89642j7710m8719r3497N0134J8340K7833L4293N5722P0603N688p8612p9187
15957A34530l8705j3282K3024L8361l7240n6848N4027L9354K7783M4542o916l7015
15945A71615J966K9602l1635n9798J4497M1112Q086j0539J9459J4091n0780k5799
15933A21877J0574M9206q967l9128k3265M4864K9750j4556k1143K6973L8568k7635
15921A87118K8274j4898k6089p695L3287k1637l2962m3462L7208L0679n33l2532
$$ y = [130004, 146390, 158867, 178407, 158572, 98050, 111055, 135213, 81263, 81826, 154982, 237398, 186859, 183419, 186652, 155238, 117370, 118508, 114439, 63712, 76396, 83656, 165968, 158068, 118762, 87161, 115847, 160201, 181543, 195012, 221437, 188001, 127328, 130954, 151213, 140998, 185971, 189642, 171932, 123213, 29716, 79850, 98190, 126023, 160316, 216038, 286641, 292329, 213717, 134530, 95825, 82543, 105567, 143928, 106688, 49840, 103867, 143221, 171004, 215546, 208630, 171615, 173581, 203183, 171548, 111750, 126247, 167359, 175445, 164906, 184365, 198456, 147676, 121877, 132451, 181657, 172690, 133562, 110297, 155161, 184911, 170355, 149212, 176185, 214753, 187118, 215392, 200494, 174405, 166710, 199997, 178360, 145398, 101936, 139144, 169823, 169290, 136758]
15909A36758J7309L6881l319l4436J7446m6719Q353N9701l3019J2981L3758J9556
15897B25250o3906m7048k4174K7025j9087K8911L6957L135p63P022k9787j740
15885A41795n9689K1447M7040J2123O2987K0112n4601n4268N1511J5665K7849
15874B31971L8261j00300m6639N6874M6514o7055l5158N8413Q3717k4272k0213
15863B22113j7030n1954l9982K1778m5732N8086K7553l7194l7639k0594k6675
15852E2730N0708N2081L1185k0504R5899Q3083k6840j20425l9675o6844L62Q3162
15840A74922K5260n0500j0661L0670K9179k3052N7281j170j8544J571n313K1774
15828B31417j3713l1398k9307o002o659M4298K2645o025p241L4173L2229k742
$$ y = [136758, 154067, 190948, 187629, 153193, 170639, 123920, 132273, 191974, 158955, 171936, 205694, 225250, 161344, 114296, 90122, 117147, 98060, 126971, 163928, 167063, 166300, 173322, 143535, 141795, 82106, 103553, 150593, 162716, 225703, 245815, 191214, 136946, 188457, 204122, 231971, 270232, 169932, 123293, 180167, 226681, 159626, 124468, 182881, 266598, 242326, 222113, 205083, 153129, 113147, 134925, 89193, 147279, 174832, 137638, 99999, 79405, 52730, 103438, 155519, 186704, 166200, 262099, 345182, 318342, 197917, 158242, 91398, 91760, 174922, 200182, 149682, 139021, 169691, 198870, 175818, 233099, 231929, 213385, 214956, 209643, 231417, 217704, 186306, 156999, 150997, 144338, 188636, 211281, 205256, 198015, 232188, 264417, 261675]
15816B61675r311n5557n1180K8484K2994o0950k68K3067J9107q8831R449O6031
15804A64710J6689j3606k7846J4659K1581K0407J5972n0215O014K5896K9699K061
15792B26021j7472l7233l9649K9962n846k6031L3499Q446M672K2956L545p170
15780A95700O671k4217L3445J7953m8782q143K199K0175J6565k2819m3085q544
15768A37118J2163N9184J1174M1126l120L4684o048l7071m2092k1144J002J4888
15756B01864O8341M306n3992p334j1120L2785J6478M2470n8475j00706m4831L7510
15744A27296P1196N6904N8861m2333J6412k2259o3759L0452J4898k0162k8731
15733A98775j031q150j3570r794N3312L4932j6121K6416k5748m6743J6406K6689
$$ y = [261675, 252364, 196807, 145627, 174111, 197105, 136155, 135887, 158954, 178061, 89230, 98679, 164710, 181399, 167793, 139947, 154606, 176187, 196594, 212566, 162351, 168365, 194261, 223960, 226021, 208549, 171316, 131667, 161629, 155783, 129752, 163251, 171697, 176369, 199325, 202870, 195700, 202371, 178154, 211599, 229552, 180770, 172627, 174826, 195001, 211566, 188747, 145662, 137118, 149281, 208465, 219639, 260765, 257645, 292329, 286281, 249210, 207118, 185974, 186976, 201864, 270205, 274511, 220519, 213185, 202065, 234850, 251328, 293798, 235323, 134617, 89786, 127296, 198492, 255396, 314257, 271924, 288336, 266077, 202318, 232770, 247668, 227506, 198775, 197744, 189594, 176024, 166230, 219542, 254474, 238353, 264769, 239021, 192278, 208684, 235373]
15721B35373l120n7996l1472k7369Q159L9937N1163k1103m2706M693p099k9774
15709A18686L6291Q0183M5265j4570j0968k4394j0067Q154k7664L5025N2709n623
15697B83027j5730K4659j7132k9595k4310p509k2405J7688K6707N4874K6515K814
15685C19603l2787k9508m6984j670m0745K4363j5314L3095q919j440J4961m8526
15673A66129j593j041Q799K8283j9940L5386M4382k3192k5340J409k327j4170
15661A96785j1637N9246k1864J4022K8180n041l6320M7165j7814o6890L0906O0073
15649B76811j9880m4837j6393L9035m873k1440J707k0971K4047k3358p2390N0295
15637A67753K8173m029n8776L4398L8782J5233N8996M7145j4646m2557m8758j7589
$$ y = [235373, 232253, 174257, 142785, 115416, 123575, 163512, 214675, 193572, 150866, 155559, 148460, 118686, 154977, 235160, 280425, 265855, 254887, 230493, 220426, 228580, 200916, 235941, 288650, 283027, 267297, 291956, 274824, 245229, 220919, 213410, 191005, 208693, 235400, 290274, 316789, 319603, 286816, 257308, 210324, 208654, 167909, 192272, 176958, 210053, 201134, 199694, 214655, 166129, 164536, 163495, 172294, 200577, 180637, 216023, 260405, 237213, 211873, 213282, 210955, 196785, 185148, 244394, 222530, 236552, 264732, 259691, 223371, 270536, 252722, 185832, 216738, 276811, 256931, 212094, 195701, 234736, 229863, 208423, 210130, 189159, 213206, 189848, 117458, 167753, 195926, 191897, 133121, 167519, 206301, 221534, 280530, 327675, 313029, 270472, 221714, 204125]
15625B04125K3842K639l1713L8913N8321k4894l2874o398l1654L2739M2090L165
15613B78301k1067k3891Q637r07Q169k188Q693P573J5656p679Q755l3799j0179
15600B36074K4887L462J5111J1866M4417m184m3366n846K3432l2780m0920M91
15588B32644K1301K5487j3912l6670k4705j5641M2912J7610o0784k4103j1646
15577A52493P1528n747O207K8059o5536m9000L0747M2027N2806K0095j2183l615
15565B67881J031N2100j884k1071p1906l7872J6993l760l667P814l0071m7229
15553A28359k88J6076K3528O8039N4595k2891J990K8439J6040J189K3675k0176
15541C18575K4370K7195K9825j0097j8405n9479m8941j8654j3063p3842k0558
$$ y = [204125, 227967, 230606, 198893, 237806, 296127, 271233, 238359, 231961, 200307, 233046, 275136, 278301, 257234, 233343, 241980, 241073, 249242, 247054, 255747, 263320, 278976, 271297, 280052, 246253, 236074, 260961, 264423, 279534, 291400, 335817, 331633, 288267, 282421, 305853, 273073, 232153, 232644, 253945, 279432, 265520, 228850, 204145, 188504, 231416, 249026, 188242, 164139, 152493, 224021, 218274, 224481, 252540, 187004, 138004, 168751, 210778, 263584, 283679, 271496, 267881, 268912, 321012, 319128, 298057, 226151, 188279, 205272, 201512, 197845, 205659, 175588, 128359, 128071, 144147, 167675, 235714, 290309, 267418, 269408, 297847, 313887, 315076, 338751, 318575, 342945, 370140, 399965, 389868, 371463, 311984, 263043, 244389, 231326, 157484, 136926]
15530A36926Q06O0916M1030j975l6554j3383J7315q424j5668J1619J2540l8397
15518A66751J3293r859n4305J6374P3988M8606k318j0822l812q295m6135J1025
15506A94491L1550j0130M06L3990P2883O3063k6350n5434q455J8818N9238J6818
15494C90888k4546m2154J1820k1642l3271j9506M5467K9550j3647K7064m8960
15483C01063m4115k5537K1982N6261K8269j4948M4246K0522l6263n3260j0087
15472B88133N463l6057N5655J21545l7494n8031k7981K1047O6038M04k5182l9727
15460C33813l2688l3483k2968m2986J6665o55M2704J1933n8989J2372K3120J2885
15448B61723L6362q03m5034K377M2659K0926j4596J1250M3217K8545n5928l7166
$$ y = [136926, 137732, 198648, 239678, 237703, 201149, 187766, 205081, 196657, 180989, 192608, 205148, 166751, 180044, 170185, 115880, 132254, 206242, 254848, 252530, 241708, 237896, 229601, 183466, 194491, 226041, 215911, 216317, 250307, 323190, 386253, 359903, 304469, 296014, 314832, 374070, 390888, 366342, 324188, 336008, 314366, 281095, 261589, 307056, 336606, 322959, 350023, 301063, 256948, 231411, 253393, 309654, 337923, 322975, 367221, 387743, 351480, 298220, 288133, 293596, 257539, 313194, 434739, 397245, 339214, 311233, 332280, 398318, 398722, 373540, 333813, 301125, 267642, 244674, 201688, 218353, 217698, 260402, 272335, 213346, 225718, 248838, 261723, 298085, 297282, 252248, 254625, 297284, 318210, 303614, 314864, 358081, 386626, 330698, 293532]
15436B93532l0434N0337k472J0815l732m268J6287j0941k501J3346k2969k1538
15424B85462J944J3104N3032K5338l1390r049K2345L2078O0602o73l8663p2973
15412C41157k1534j2908N086p469O5011J07o0112n2480L2797N4528p056j8237
15400C18890k5892J7291p675M1973J9593k2746o451K0490L798l5549k017O6623
15388C88328M8129p042m3710o0708J0731K1462j6075j5218N9058K0252k9057n5563
15376C20587J1216k9155L9873M1202o1527m1280P226J4499n5160J8826R4405L025
15364C63737m0855M8870L6890q3500l0761k7459J0304L1135l1251K5785O1501
15353C64396J7838m6816j205P203l3955k2876r426J3174j4087M0512L7116O1444
$$ y = [293532, 263098, 313435, 310963, 321778, 318046, 313778, 330065, 319124, 316623, 329969, 307000, 285462, 287406, 300510, 353542, 378880, 347490, 338441, 360786, 392864, 453466, 452793, 414130, 341157, 319623, 306715, 311801, 304332, 369343, 369450, 309338, 256858, 289655, 344183, 337127, 318890, 292998, 310289, 302614, 344587, 364180, 341434, 334983, 355473, 359271, 323722, 321705, 388328, 436457, 429415, 385705, 324997, 335728, 357190, 341115, 325897, 384955, 405207, 376150, 320587, 331803, 302648, 342521, 383723, 322196, 280916, 288142, 302641, 247481, 266307, 360712, 363737, 322882, 371752, 408642, 325142, 294381, 266922, 277226, 308361, 277110, 302895, 364396, 382234, 335418, 334213, 341416, 307461, 284585, 275159, 288333, 274246, 314758, 351874, 413318]
15341D13318L986j0910o4719k4064P082K0589n466l0597n3982l4890M1630O0842
15329C22819N1432L404p809L1411K3290j8230k1709r3748q744P5523N7569j0770
15317D04438j0432k1085o5457L1059N8406r868j5516L9733l5004l3449l574k81
15305C38970o0797r5373j9791P8056J5758o300L3470K8792j5808r940p735N3319
15293C32621Q6058J3443L3607m6289p3281k1394N6410L4219Q9925j0759q6147
15282D08413q925P7971N028m6190j4857L4593k4409o7303k0500K2013K3430J7904
15270D07168J3438m1661k0654M4747o079L7667J0282o428q22m1683n8609n4776
15258B82590m0085K4662P8835N3661R3927K6560n4049m0635k1811k3587L2088
$$ y = [413318, 417304, 406394, 341675, 317611, 324693, 345282, 339816, 309219, 255237, 220347, 261977, 322819, 374251, 377655, 369846, 401257, 424547, 406317, 384608, 290860, 282116, 357639, 415208, 404438, 394006, 372921, 307464, 338523, 396929, 387061, 371545, 411278, 376274, 342825, 339251, 338970, 278173, 182800, 163009, 241065, 256823, 250523, 283993, 312785, 296977, 287037, 279302, 332621, 418679, 432122, 465729, 419440, 346159, 324765, 381175, 415394, 505319, 494560, 408413, 399488, 477459, 482487, 436297, 421440, 456033, 431624, 364321, 343821, 365834, 389264, 407168, 420606, 378945, 358291, 403038, 396959, 434626, 444908, 438480, 437658, 395975, 337366, 282590, 242505, 267167, 346002, 399663, 493590, 520150, 466101, 425466, 403655, 380068, 412156]
15247D12156j5107P077k3079J1771N3401L0679j0619Q126n5811Q194M1956j0698
15235D58046j4810J0609j0089N9408k2747m4418j7066P1515k1493r328P1820m4368
15223D87079m4578k1461k2420K2905j6094K3963L2731m0516l724K8939j9285m2484
15211C85055l2713M0470L4549n9867L596J8870K1463p564K4559l9511k3657n945
15199C59305P7096J6496l5715j1160M526k5981L1730L8678j102J2025K3152m8854
15187D40196O711J5227K7589j8899k5201J2233K4148l8191O82O3779L660l1951
15175D79983k2197j253J8642O8237R237n3471n2933j5236J6996P472J0763J1673
15163D77913q044p4507n4266L8466P3525j391m094l4646o5418k6208K4420O1007
$$ y = [412156, 397049, 404126, 381047, 392818, 446219, 476898, 466279, 474405, 418594, 426788, 468744, 458046, 443236, 453845, 443756, 503164, 480417, 435999, 418933, 490448, 468955, 459627, 531447, 487079, 442501, 421040, 398620, 421525, 405431, 429394, 462125, 421609, 417885, 446824, 427539, 385055, 352342, 392812, 427361, 367494, 371090, 389960, 411423, 403859, 428418, 388907, 365250, 359305, 436401, 452897, 417182, 406022, 410548, 384567, 416297, 454975, 453873, 465898, 489050, 440196, 446907, 462134, 489723, 470824, 445623, 457856, 482004, 443813, 444495, 508274, 511934, 479983, 457786, 456533, 475175, 543412, 552649, 499178, 446245, 431009, 448005, 455477, 466240, 477913, 469869, 395362, 341096, 379562, 453087, 451696, 447602, 412956, 347538, 321330, 345750, 406757]
15151D06757N3614J2492n1777K2694n1064M7920M8464j7236K0822j4934j0268
15140D67484k7407j837N5867l7665o6380M244J2130J3132Q220k3759K738l725
15128D03042J0341J18997L7429p4100K309j6535n6588j1168k9085j338K985L6213
15116D22502Q9353j428l032m8100m7698K3064K6804j5058k9921p26j4381L187
15104D04566j8155j9951J8043R0448K8885l3393j0213j4531k9515m984K5173L3451
15092D69824L1543k1112R087n6849k0156L6746k3659m9395L8480N7493M4849L2925
15080E49776o8945m4650M6456L27j5819k2592K6543Q154L5495m7737k8625j3300
15068D25083L3281j6118m9941l3204K5766r193j0437K6487N6434J7938o1850j4694
$$ y = [406757, 460371, 472863, 421086, 443780, 392716, 440636, 489100, 471864, 492686, 477752, 467484, 440077, 438240, 494107, 456442, 390062, 394306, 406436, 419568, 427788, 404029, 406767, 403042, 413383, 532380, 569809, 495709, 498018, 481483, 424895, 413727, 384642, 383304, 386289, 422502, 511855, 510427, 507395, 459295, 411597, 434661, 461465, 446407, 416486, 415760, 401379, 404566, 386411, 366460, 384503, 474951, 503836, 470443, 460230, 445699, 416184, 411200, 436373, 469824, 501367, 480255, 489342, 432493, 412337, 449083, 425424, 376029, 414509, 472002, 516851, 549776, 480831, 436181, 482637, 482964, 467145, 444553, 471096, 479250, 514745, 467008, 438383, 425083, 458364, 442246, 392305, 359101, 384867, 375674, 365237, 391724, 448158, 466096, 404246, 389552]
15056C89552Q618P37R419O0281P4065O899K9409l2481r2287n2279j7439j891K145
15043C84748M7360j1262J1689O0120J3338M222K5081m689K7046K2504j3425n9572
15031E07160o7455J2628K8788O9188J6145j6485L3623l5704l3040k314P47P7991
15019E91272J9334j6051l8113q192L1965P8168R969m4302m4108k1527m5883K72
15007E12804k4309N784N9184J647n7552m5344K6324j3117M2799P5315N3633n0719
14995E86449p3118J7373K9086j3275m7478k0587m0214M1837J5564M2647N4001
14984E92285L0430J6534j4989l9064j0731j1836k8086k4307n2953l6723m3314
14973C77246J7860O1320J3832m7567K4656J8265k6110K5647Q6259R372K0387j1516
$$ y = [389552, 398170, 398907, 408326, 468607, 542672, 549571, 578980, 546499, 454212, 401933, 384494, 382603, 384748, 432108, 420846, 432535, 492655, 505993, 510215, 535296, 530607, 557653, 580157, 566732, 507160, 439705, 452333, 481121, 550309, 566454, 549969, 583592, 547888, 514848, 512534, 513281, 591272, 610606, 594555, 556442, 548250, 580215, 658383, 668352, 624050, 579942, 558415, 512532, 512804, 488495, 494279, 553463, 555110, 497558, 452214, 478538, 465421, 508220, 583535, 637168, 586449, 513331, 530704, 559790, 546515, 499037, 478450, 438236, 480073, 495637, 538284, 592285, 622715, 639249, 624260, 585196, 574465, 562629, 534543, 510236, 457283, 420560, 377246, 395106, 456426, 470258, 422691, 447347, 465612, 439502, 465149, 551408, 560780, 581167, 569651]
14961E69651k6385j9029n2358J0712P0009o725k6799l0164m5878q440P390Q2440
14949E24424O1757k6433n0118n8403l6396M087Q994l393N8506K0389K0584l0573
14937D93425p6064P5081J8812P251K3917j4217M2251j2321K8098K9355k3347J1432
14925F03673l5805j350O4563l8507l5043j3048k9735n9340K6272O1901j9127j28
14913E24326J2923j2717m6672K8194P583n0034K2831Q9626J6811m857K5633K0676
14901F34323m0849k833k8520l3764o0993j7706M6894O6398M5354k8291l4706K2257
14889E67564j3443M0767n101q7488m1201P0507L1808n7624o699L2120K7994k0960
14877E38244k2945J988M0039J4420r764j5143P0342J0273l6678o0667J082L260
$$ y = [569651, 543266, 524237, 471879, 482591, 552600, 545875, 519076, 488912, 443034, 434594, 441984, 524424, 586181, 559748, 509630, 451227, 414831, 418918, 427912, 424519, 483025, 503414, 523998, 493425, 417361, 492442, 511254, 518505, 542422, 528205, 570456, 558135, 586233, 615588, 592241, 603673, 567868, 566518, 631081, 592574, 557531, 544483, 514748, 455408, 481680, 543581, 524454, 524326, 537249, 524532, 477860, 506054, 513637, 463603, 486434, 576060, 592871, 588014, 613647, 634323, 593474, 590641, 562121, 528357, 467364, 449658, 496552, 562950, 608304, 580013, 545307, 567564, 554121, 594888, 589787, 502299, 461098, 531605, 563413, 505789, 499090, 531210, 559204, 538244, 515299, 517287, 557326, 571746, 561982, 546839, 617181, 627454, 590776, 530109, 531191, 534451]
14865E34451q6818J1055O5028M7078m4639j3917L7373M2593K824l853m8936o432
14853E35807m0553n4464l8990N7515N0489j8538l9576L0591j3674K7419K5719
14842E21745J2729j6572m220R537J8480R971L0583k6166J9914K0303r503p677
14830E79124l912K5313N3205M3920l0131p3655l6466j0036J2823J244J9665l1931
14818E49163l2243k9502M4095P4558L0431n848l4262m4126k4065R889J5409m390
14806E49109j776m9963l8674R948K8412M8548k9605r47N2321J5871m9281P236
14794E41199L3080J4195k2807n6413k5721J3530m541k1328M6025L0725j2137j2780
14782E23027K6687P4153l0599j1895K3681P7035K0340n5065n8074m3404m3293
$$ y = [534451, 447633, 458688, 523716, 570794, 526155, 512238, 549611, 592204, 595028, 591175, 542239, 535807, 495254, 440790, 401800, 459315, 509804, 491266, 451690, 482281, 468607, 496026, 521745, 534474, 517902, 513682, 523219, 541699, 551670, 582253, 556087, 576001, 596304, 586801, 579124, 575212, 600525, 653730, 697650, 667519, 593864, 557398, 547362, 560185, 561429, 581094, 549163, 516920, 487418, 531513, 606071, 636502, 630654, 596392, 552266, 528201, 538090, 553499, 549109, 547333, 497370, 458696, 468644, 497056, 545604, 515999, 515052, 567373, 583244, 533963, 541199, 574279, 588474, 565667, 509254, 483533, 497063, 492522, 471194, 517219, 547944, 535807, 523027, 549714, 623867, 593268, 581373, 605054, 682089, 702429, 647364, 589290, 545886, 502593]
14771E02593m2152l8462K6842J13192P5085l3539k9361k1658j0948k7433K4116
14760E38275Q634n868m4646o260j4897J7460Q811M7926J07864L3278p1434L1357
14748F50500J1394K8549m4599k2565p6015m4770K9626k4530M663L1748O6064N335
14736F15400P3550m412l2030J1270l9880l5639m2307J9087O724O841m5303P442
14724E40743k4055P160Q1016K5875o2303O384N2653J4468O3515L0863r2494o4586
14712E79239k8115J3093L9909Q626o200n3115J027O3590L1116K1698p0929m3991
14700E55948L5231J2989l2211K893J2583K9874o792p614l919k3492j2392o821
14688E56277N0440R1932J8165q7342k8900J5283N697m1525q918k8561K6341K2521
$$ y = [502593, 460441, 421979, 448821, 562013, 637098, 603559, 574198, 552540, 541592, 514159, 538275, 546909, 541041, 496395, 490135, 475238, 492698, 501509, 549435, 657299, 690577, 619143, 650500, 661894, 690443, 645844, 623279, 547264, 502494, 532120, 507590, 512253, 544001, 610065, 615400, 688950, 684538, 652508, 663778, 623898, 588259, 545952, 565039, 571763, 578604, 533301, 540743, 516688, 523848, 604864, 630739, 568436, 574820, 627473, 641941, 705456, 736319, 643825, 579239, 551124, 564217, 604126, 612752, 606552, 553437, 554464, 618054, 649170, 670868, 599939, 555948, 591179, 604168, 571957, 574850, 587433, 617307, 610515, 602901, 598982, 575490, 563098, 556277, 606717, 698649, 716814, 629472, 600572, 615855, 621552, 580027, 571109, 542548, 568889, 591410]
14676E91410n795K2292j9357k6457J0371Q648P038M3224M879Q431l236L0324L0848
14663G02620p0148k2691p672k2391N7366l2902l4894L6883L6850j0050p4451J1752
14651E70272q307k3552K6603N0085L0456j5847R320K4000O557m8705o2529J208
14639E59561N1628J9087j6263l149l9677j8654J6146Q0727J3975J925J6054l9210
14627F42150n6583K8413n460K745J2192J0524K5158k393J9300l134j757j5401
14615F55754K4917N031m3035r7412N977m0925N7702M5431L4471l3976m1637M2148
14603F14446O3037K5895l0667j5166l4330k8372J8482J467j0975j756j4055O5311
14591F53317N2240J9588l0479j2046O8708l0516o5117l661K117l8650k4300k8598
$$ y = [591410, 585615, 607907, 588550, 562093, 572464, 581112, 588150, 631374, 636253, 644684, 641448, 671772, 702620, 632472, 609781, 602109, 579718, 637084, 604182, 569288, 606171, 643021, 632971, 558520, 570272, 561965, 538413, 565016, 615101, 645557, 629710, 639030, 663030, 669587, 620882, 558353, 559561, 611189, 630276, 614013, 610864, 571187, 552533, 568679, 649406, 663381, 665306, 681360, 642150, 585567, 613980, 608520, 611265, 623457, 633981, 659139, 656746, 676046, 672912, 671155, 655754, 680671, 685702, 642667, 545255, 551232, 510307, 568009, 613440, 647911, 613935, 572298, 614446, 677483, 703378, 672711, 657545, 623215, 594843, 613325, 614792, 603817, 602061, 588006, 653317, 705557, 725145, 694666, 682620, 751328, 720812, 655695, 652034, 654151, 615501, 591201, 562603]
14579E62603m58n3518M6558N9498L5390k1181j21932K3064K2315M8021L3287l2212
14567F01435j4613Q965m2105J766N1244j0160n4303l1888N7803N7526M0834K1467
14555F87971r613J8895m5987K40O107J7242O842j3180O4952M3870n3611k3442
14543G00286j976j2687k5307j4215J6306L5450J5817P543M2955n6979r1590J0731
14531F26334M6989M6242k5929J3610q072k5795N3k6124j3937k7142k4170J7795
14519E99854R058N6857p272P643j2060L9818K5441k3739o2940l1195Q657p308
14507F02814j4350k2255j7686O7862L9625j7017K3301M3660J9318m0225k7245
14496F57802n1465K9947L8078j7810m2748n056k373J2678k640m4519r960N7630
$$ y = [562603, 562145, 508627, 555185, 614683, 650073, 628892, 506960, 530024, 552339, 600360, 633647, 601435, 586822, 595787, 553682, 555448, 606692, 596532, 542229, 510341, 568144, 625670, 666504, 687971, 678358, 697253, 651266, 651506, 657613, 674855, 681697, 668517, 733469, 777339, 723728, 700286, 698310, 685623, 660316, 646101, 662407, 697857, 713674, 721217, 764172, 707193, 615603, 626334, 673323, 719565, 693636, 707246, 699174, 673379, 673432, 647308, 633371, 606229, 582059, 599854, 608912, 665769, 658497, 666140, 654080, 693898, 719339, 695600, 632660, 601465, 610122, 602814, 588464, 566209, 548523, 616385, 656010, 638993, 662294, 705954, 725272, 685047, 657802, 606337, 636284, 674362, 656552, 613804, 608748, 606375, 619053, 616413, 571894, 561934, 619564]
14484F19564o7433o3203j0593N3100O8903N3273j5149j098N3112m6059n9950l4857
14472E49610N4297O1860R7497N699l736k3457p4378j4222l012J980K8250J3537
14460F93925l7964k9835M844K3465K1075j5589m6053J014P4693o025n9288n7490
14448E66772m1746N5570N2487J4376l7950P131l0712m5885L5211J6451j0372J9357
14436F00690Q691J5052j1933J1367O2156j5215L4414K2079k4331j3870l0958J3874
14424F72016j6652m2651n1733J05312R0582k1432n5986k8870J0182o3613q2789
14413E14366M9211K5395J9583P9333L0055q431l2954o2266N772L804l4272o713
14401E82883O8739K0453m1771r117M347P2420K7066n7041m0232N931K0127m057
$$ y = [619564, 552131, 488928, 478335, 531435, 600338, 653611, 638462, 637364, 690476, 644417, 584467, 549610, 603907, 665767, 763264, 768963, 765227, 741770, 667392, 653170, 650158, 652138, 680388, 693925, 655961, 626126, 630970, 654435, 675510, 659921, 613868, 614882, 689575, 683550, 624262, 566772, 525026, 580596, 633083, 647459, 609509, 616640, 585928, 540043, 575254, 591705, 581333, 600690, 609381, 624433, 612500, 623867, 686023, 670808, 705222, 727301, 702970, 689100, 658142, 672016, 655364, 612713, 560980, 666292, 756874, 735442, 679456, 650586, 660768, 597155, 514366, 563577, 588972, 608555, 687888, 717943, 709512, 676558, 614292, 620064, 623868, 589596, 582883, 651622, 672075, 630304, 621187, 625534, 697954, 725020, 667979, 627747, 633678, 653805, 649748]
14389F49748Q28o91l481J8921L012K7557p570l4103o2687M4915K5283K7379K4845
14376G13956k1254l5885m3075J678L423N41m7233n7240M1528L3657j88K1561L4359
14363F45828K5408l8015J8777N1729J9431j9261q3692j0021M7733k7625M412Q159
14351F42863l6089L8424R465o6545O3364M2430L3953N7928l6496n6526p0218j5296
14339F07257n0225k5558L6942l135L5324P206J8093J4511P9574K9871l6960j12083
14327F00817q3704K4468P2959k4801m938M000J2734m0618L088O3178P8737J4245
14315G20165j8929m9258k6241j1487k8283N1445Q7805j3315n4397K676O694j3525
14303F53350N353J0668l8130O178M5358L0978l3269m3488n6964j8014j1574J417
$$ y = [649748, 650576, 649885, 646404, 665325, 668337, 695894, 688324, 654221, 591534, 636449, 661732, 689111, 713956, 692702, 656817, 613742, 615420, 618843, 619384, 572151, 514911, 556439, 590096, 589908, 611469, 645828, 671236, 633221, 651998, 703727, 723158, 703897, 620205, 610184, 657917, 630292, 634704, 642863, 606774, 645198, 654663, 588118, 651482, 693912, 727865, 785793, 749297, 692771, 622553, 607257, 557032, 531474, 568416, 565281, 600605, 607811, 625904, 640415, 719989, 749860, 712900, 600817, 517113, 541581, 614540, 589739, 584801, 588801, 601535, 560917, 564005, 627183, 705920, 720165, 701236, 651978, 625737, 614250, 585967, 637412, 725217, 711902, 657505, 660181, 666875, 653350, 658703, 669371, 631241, 637419, 682777, 713755, 680486, 636998, 580034, 562020, 550446, 551863]
14291E51863M4999M7530N889k8354J6730M0050L4190K1296n5809n5345N1346R619
14279F84004j2874k1081k8584O1624o379n7415j1860M3791K4144J4987j4912n1396
14267F24049n0189M7259M8422k4876l8185j4264l0591K2961P7899O508n7847j0691
14255F00455J7758L3050j0071l8243k986j8525k451L8864L7766J3398n8603M2879
14243F53291M9933k0245j0320J4811j7524o2701l3357M1075L6562Q599l669L0494
14231F86949n9430p691n4517j9848N847J8696L5993M520k4586p601N5785M2590
14219F76707m3584r4331r376L3586O1114L909K0981N2950m5033o7671L2287N2232
14207F73771L2356j0105l4294j4436K6807l0250o3930j9153k4610J371M1067Q6498
$$ y = [551863, 596862, 644392, 650281, 621927, 638657, 678707, 712897, 734193, 678384, 623039, 674385, 684004, 671130, 650049, 621465, 683089, 676710, 619295, 607435, 651226, 675370, 690357, 675445, 624049, 573860, 621119, 669541, 644665, 606480, 592216, 561625, 584586, 662485, 668993, 611146, 600455, 618213, 651263, 641192, 602949, 599963, 581438, 578987, 617851, 655617, 669015, 610412, 653291, 703224, 682979, 672659, 687470, 669946, 607245, 573888, 614963, 651525, 660124, 656455, 686949, 627519, 619828, 565311, 545463, 551310, 570006, 605999, 610519, 585933, 578332, 634117, 676707, 633123, 538792, 529416, 563002, 624116, 628025, 649006, 701956, 656923, 589252, 621539, 673771, 706127, 696022, 661728, 647292, 674099, 643849, 579919, 560766, 536156, 537527, 578594, 665092]
14195F65092o600l0826L6104J7388J5394K4935j6959k7828j7262q2080m123K8746
14183F01981L5094k6664R481N560j609J7472k0950J921K8633M3570N3032k0983
14171G26538K374n6424l4029L2744L9133m0913j7948l4710k4716K1662J595J6436
14159F31742k0726n0182l4234O7715L6399J3549K2417k1913k5440k3343K1636
14148F17620k833N5343M9300n5387o9847j3590M458m817J8710m2943j3145R116
14136E51985j8513p498Q384o5413M2801N9564l7254j9636K9104R082l9942J2690
14124E25354M2338k3987p422o9810k4988L3633R8205L6833k0048j7683j870m0727
14112E29828p8404O0599P5103J2202m536k3356k4987j4432n013O7795N721M0182
$$ y = [665092, 658492, 627666, 663770, 681158, 696552, 721487, 704528, 676700, 659438, 577358, 573235, 601981, 637075, 610411, 619892, 625452, 623843, 641315, 620365, 622286, 650919, 694489, 747521, 726538, 728912, 672488, 638459, 671203, 710336, 669423, 651475, 616765, 592049, 613711, 615306, 631742, 611016, 560834, 526600, 594315, 630714, 644263, 666680, 644767, 619327, 595984, 617620, 614787, 670130, 719430, 664043, 594196, 580606, 585064, 580247, 598957, 556014, 542869, 551985, 533472, 525974, 534358, 468945, 511746, 571310, 534056, 514420, 543524, 552606, 512664, 525354, 567692, 543705, 536283, 466473, 441485, 475118, 573323, 610156, 590108, 572425, 570555, 529828, 451424, 512023, 587126, 599328, 594792, 571436, 546449, 532017, 527004, 594799, 600520, 640702]
14100F40702J8940p2630m5159o71R7988J2186K2342l2705j2092m1860p322L8959
14088F18678J477q8431n6211L6094O5297J1995q845K9095p968l2949q275J8513
14076E78470l7573p731o1421l837L3419q19K7236M7138j8172o523r1M427m2627
14063E11896Q462N448M6216l1313o1718J2219J8583l798J4509N3316N1289K0025
14051F45134o6621j8798O303J0565J7073K5596r8440o2293m2394j2305N4624O1150
14039E19594m8465r533k7091K9381M6467N6277n0469o5853L1216R2553J1581k9714
14027E55944l5730o4514J207R3946K6848m4192m6068l7641l2212P1229O14K1200
14015E10631k318K1790j4680j1943L5938q013j6792m29J3451N1854K5848p1670
$$ y = [640702, 659642, 587012, 541853, 541182, 639170, 651356, 673698, 640993, 628901, 587041, 579719, 618678, 620155, 531724, 475513, 511607, 576904, 588899, 580054, 609149, 601181, 568232, 559957, 578470, 540897, 533166, 471745, 467908, 501327, 500508, 527744, 574882, 556710, 550187, 550096, 554523, 511896, 520358, 525806, 572022, 540709, 478991, 491210, 509793, 505995, 520504, 573820, 625109, 645134, 578513, 559715, 566018, 576583, 593656, 619252, 520812, 458519, 416125, 403820, 458444, 519594, 471129, 461596, 434505, 463886, 510353, 566630, 516161, 450308, 481524, 574077, 585658, 555944, 520214, 455700, 456907, 550853, 577701, 533509, 487441, 449800, 417588, 488817, 489431, 510631, 508313, 530103, 515423, 503480, 539418, 531405, 514613, 514184, 527635, 579489, 605337, 533667]
14003E33667k5242L5636o8746k7306M5937L7164r09j1574j6249j2817N46l6321
13991D53786K2054K8440k3952K433J1602J8813j9378L9748k4292m013j6948P809
13979D96102k6249K8702k4157L0117j8769k4858j407N7605n628j9511J8806l8780
13967D71973M602o246L7584J96n0017n5440n6575J4165j6833J0090J3678M6137
13955D13314j0405J2552O5448K8974j7205n7152n7774O076O1752L5671J137k3452
13943D58936j4720N5732M2164k09j2061j9663l9578l627K5611Q003l4150J3140
13931D79578l1726m8106P004j4835N046K3269k0258L3457J5621r468l2646N2720
13919D59656k4117J1201K8122j7926p088j5742K3120m8018J7388r54q8289l2476
$$ y = [533667, 508425, 544061, 475315, 448009, 493946, 531110, 530201, 518627, 502378, 489561, 490107, 453786, 475840, 504280, 480328, 482761, 494363, 513176, 493798, 533546, 509254, 505241, 488293, 496102, 469853, 498555, 474398, 504515, 485746, 460888, 459481, 517086, 511458, 491947, 510753, 471973, 476575, 470329, 507913, 508109, 458092, 402652, 346077, 360242, 343409, 353499, 367177, 413314, 402909, 415461, 480909, 509883, 492678, 435526, 377752, 383828, 445580, 481251, 482388, 458936, 444216, 499948, 542112, 541903, 529842, 510179, 470601, 466974, 492585, 500588, 466438, 479578, 447852, 399746, 406750, 391915, 396961, 420230, 399972, 433429, 449050, 439582, 406936, 459656, 435539, 446740, 474862, 456936, 449848, 434106, 457226, 409208, 426596, 425642, 337353, 304877]
13907C04877o3304N1033J34003M3109k5154K1046j5111j8953j2088n118J3050
13896D27390M8389k6412j7706k8389J4339J7489J3566j6376n4494m5213j2866
13885C19717M6468k4997L6600P9045M2964K290p4130o4610M8216N1967J18q357
13873D55291m471k9399m5525l9424L7918O0428Q809j9903R963K392p6638n5281
13861C04160P365j5509P541J7028J2186J1653J599K017K465K138M6371P9652N1268
13848E29934o2262r4406j6087o710l833N306K2111O0416K8284m038k5625l836
13836D29254l734p516J6573l1232n1601m7300M7470j8424k4364M297J28l572N130
13823C15109L34p930J5493K2188p961J2932J068J623O639K5162r053l9086k0286
$$ y = [304877, 241573, 292606, 426609, 469718, 444564, 465610, 450499, 431546, 419458, 414340, 427390, 475779, 449367, 431661, 403272, 417611, 435100, 448666, 432290, 377796, 332583, 319717, 366185, 341188, 377788, 456833, 499797, 502087, 427957, 363347, 411563, 463530, 463648, 455291, 450820, 421421, 375896, 336472, 374390, 434818, 443627, 423724, 433687, 436079, 359441, 304160, 311525, 296016, 303557, 320585, 332771, 344424, 346023, 348040, 350505, 352643, 399014, 478666, 529934, 467672, 373266, 357179, 350469, 346636, 351942, 374053, 434469, 462753, 458715, 433090, 429254, 425520, 418004, 434577, 403345, 351744, 304444, 351914, 333490, 309126, 313423, 313551, 309979, 315109, 315443, 307513, 323006, 345194, 337233, 350165, 351233, 352856, 359495, 384657, 375604, 336518, 316232]
13810C16232j01689j4993Q0635N1269n3776k2497o816m8224K7946M189p948J7715
13798B42043M6475J13253P2673q0017r1092L7650K4850j4430n4688J6410J2188
13787C25315J5747J384r423L7747K3867p4375j15495R278M5620M3837M083k5094
13775B82491M90n4146k0070k2754j0518O1145L8895m2867q3853l9634l756N0356
13763A55779M0218N9933L3233L7105M678n8582j9188K1971l3192m0441K3302O3549
13751B88365k2098o8127l0630r53L1364M9246n0141J9553M0744L0097l475j1627
13739B72318k439J5873j9629k6206j3416k726j2744J1806J3411k8250J8124O3667
13727B89789j5991r2311p097R2744j3476m5176M686o075m6550K5480n17j2350
$$ y = [316232, 214543, 199550, 280185, 331454, 277678, 255181, 248365, 200141, 228087, 232276, 224328, 242043, 288518, 401771, 474444, 394427, 303335, 340985, 365835, 351405, 296717, 313127, 325315, 341062, 342446, 333023, 370770, 394637, 320262, 204767, 214045, 259665, 303502, 307585, 282491, 282981, 228835, 208765, 186011, 175493, 236638, 275533, 232666, 148813, 109179, 105423, 155779, 195997, 255930, 289163, 326268, 330946, 272364, 253176, 275147, 241955, 201514, 224816, 288365, 266267, 198140, 167510, 166557, 197921, 247167, 197026, 216579, 257323, 287420, 283945, 272318, 269879, 285752, 266123, 239917, 226501, 223775, 211031, 222837, 236248, 207998, 226122, 289789, 273798, 181487, 174390, 267134, 253658, 208482, 213168, 207093, 160543, 186023, 185506, 173156]
13715A73156k609M0896N0690N053n4507m7623k6265M919o301m7741J1087N3111
13703A53866K3341j990o448L1457J7784L2936j213n4494o3527K5168O243o1021
13691A02102j5857k453j0404Q967l828J3853N1831j3854J2588M653K1821Q030
13679A77449l0709o9537j5792K9732L9031P9582K7622K063k1319k2540p760L1362
13667B19184o3664k8575L0129M0394k196K6665l0458o1333l9156k8249M5709K7464
13655A35914k8800j6127N6734L1896K9758L7556N643l4417n6872l9010J4082P6911
13643B13268j0129l6227m7479m7797n5368P8471L5623q588N3949k5192l1901J6961
13631A35591N970k4978r3635l5831r385M6317O5128q229q305k6282L112L849n6179
$$ y = [173156, 170547, 211443, 262133, 267186, 212679, 165056, 138791, 143710, 137409, 89668, 100755, 153866, 177207, 175217, 168769, 200226, 218010, 250946, 249733, 195239, 131712, 156880, 163123, 102102, 86245, 83792, 73388, 82355, 78527, 92380, 144211, 130357, 142945, 147598, 169419, 177449, 146740, 77203, 61411, 91143, 130174, 209756, 237378, 239441, 218122, 195582, 187822, 219184, 155520, 126945, 157074, 197468, 195272, 221937, 191479, 130146, 90990, 62741, 108450, 135914, 107114, 90987, 147721, 179617, 209375, 246931, 252574, 218157, 161285, 122275, 136357, 213268, 203139, 166912, 119433, 71636, 16268, 94739, 130362, 121774, 175723, 150531, 118630, 135591, 141561, 116583, 22948, -12883, -22268, 24049, 89177, 80948, 72643, 46361, 49473, 53322, -2857]
13618b857K1104Q1765n7180k6962K7816k0200o4760j9495p612M5410J3577R3879
13606H4485k5684p0749N7272N4859j573l4847l306K3965L0792K5668L636r5155
13594D9363m2564J3482J5030K3259K2805J0231l4904J2843j2395l2100k4982k7
13582D1m469K9363j6786q01m6451q85N1670K2377Q874j8179J5272o996r5410m2961
13568a05341J5414J053j5070J1508K1616K1849p603n542j3351K7548n134k1967
13556g5020r144N7287l8574l3827r054K2062K9739p6167l5560L6021K0301l506
13544a15442r138k538Q3994K3316l8180k1206o489P4570Q870j5246n4372q089
13532g9950j4443k0770j552K7456n1173r480R786q579l8573L128N8214J8205K8494
$$ y = [-2857, 18247, 100012, 42832, 15870, 43686, 23486, -41274, -60769, -68381, -22971, -9394, 84485, 58801, -11948, 45324, 100183, 98610, 63763, 60457, 84422, 115214, 140882, 144518, 49363, 6799, 20281, 35311, 58570, 81375, 91606, 56702, 69545, 57150, 25050, 68, 41, -4428, 24935, 8149, 7348, -39103, -39988, 11682, 34059, 42933, 24754, 40026, 33030, -62380, -105341, -89927, -88874, -103944, -92436, -70820, -48971, -56574, -62116, -75467, -47919, -53053, -75020, -84164, -26877, -65451, -99278, -108332, -86270, -56531, -132698, -168258, -132237, -111936, -115442, -124580, -127118, -43124, -19808, -57988, -79194, -85683, -11113, -2243, -17489, -71861, -79950, -94393, -115163, -116715, -89259, -140432, -149912, -140126, -148705, -187278, -184150, -125936, -107731, -79237]
13519g9237j2882j0476p337K8842j6660J2790l1287k6840m2144M6151R226q864
13507a38718L9089L5824N008J2335l5244n3527L8745O7188K7720L0843q5393r0042
13495a46172L134J7602K3631n9108j2624r624k3584m1793K7676q013J4502O9350
13483a45023J7815J0437Q544L5744q69r2343q6757M9753L3121l2225o1672k8620
13471b92095O1222P985J8593k1254j1252J3812n3691o0540L7184O8930k923m9689
13459b83718l6875p52K6856K3119J5724k0223M2255m1257n239K560k8517o801
13447c12868l3476p8907J651N5654J17343O4533j3389k623K0394J4429p873p7125
13435b52257p1969j2206l357M4311P650P57j0439K2535n532j3464r94O272K9813
$$ y = [-79237, -92119, -102595, -109932, -81090, -97750, -84960, -116247, -143087, -185231, -139080, -129854, -138718, -99629, -63805, -58797, -46462, -81706, -135233, -96488, -29300, -1580, 29263, -56130, -146172, -143038, -125436, -101805, -160913, -173537, -183161, -206745, -248538, -220862, -228875, -214373, -145023, -127208, -116771, -108227, -72483, -73352, -165695, -252452, -202699, -169578, -201803, -263475, -292095, -230873, -222888, -204295, -225549, -236801, -222989, -276680, -337220, -300036, -231106, -234029, -283718, -320593, -321345, -294489, -271370, -255646, -275869, -233614, -274871, -280110, -277550, -306067, -312868, -346344, -425251, -423600, -367946, -250603, -186070, -199459, -202082, -181688, -167259, -175132, -252257, -324226, -336432, -339789, -295478, -287828, -287071, -297510, -274975, -280507, -293971, -294965, -288693, -258880]
13422b58880l7355l9959K5235M2733K1913K0900R931j3448N071o0579j9850n0208
13410c54496p5145l236P0338M8329J4274n5431j8369N8702L7880M6632J7921q3569
13398b96170o8428p465P5341L4685m6980o3368r13L2264j2405K1921K5827p552
13386c13243n5361m1689J0322n725k5502L4j2863J8077k0586J1514j0741L1903
13374d13860O5005o50r4695l4776j978K2272j0304l6017J5795m1668n0239M9121
13362e31994Q0881K0039K6515l0844j7444j4721j7441J5847K1850M2241j2998
13351d18069l9748m7442k2924K8468J6920l4192m5736j9123k0856K4459M3956
13340e34287n401m8554k7565M9169K3045J9859K33l089k5907l722j780o038l1447
$$ y = [-258880, -296235, -336194, -310959, -268226, -246313, -225413, -215482, -228930, -223859, -284438, -304288, -354496, -429641, -432877, -362539, -314210, -299936, -355367, -373736, -315034, -277154, -230522, -212601, -296170, -364598, -372063, -296722, -262037, -309017, -372385, -373298, -341034, -353439, -331518, -305691, -313243, -368604, -410293, -399971, -405696, -431198, -431164, -444027, -425950, -446536, -435022, -445763, -413860, -348855, -349505, -444200, -478976, -480954, -458682, -468986, -505003, -489208, -530876, -581115, -531994, -451113, -431074, -404559, -435403, -452847, -467568, -485009, -469162, -447312, -405071, -418069, -457817, -505259, -528183, -499715, -482795, -516987, -562723, -581846, -602702, -578243, -534287, -539688, -588242, -615807, -566638, -543593, -523734, -523501, -526590, -552497, -556219, -557999, -564037, -595484]
13327e95484q56K1143k1241L418J9425M3129N0652k8609l4547M1705j6656k0739
13315e38660m4625j051J2304j1552L0547K7069N7664l6793k5138n3444o6529n461
13303f55669L6024k4205p7541k5361M1733L7122k4006n9007K0186L7156k1473
13292g15041m7334N0847J9924K4587n0438K4944O857k4708N0052M2091N3930o355
13280e70644l4065m9203j08329L504j2945p889J7498K4856n0565n6242L0798J9787
13268g93439Q991M4867J3275l577k0714n4741n978k9983j8557Q1528Q2158R6577
13256e99593Q6574J39385J51411K62686L58546L57869L31560J88807J5295j25936
13246A166604k47085k66751k23108j92616j20792j32414j24083j10175m7810o9324
$$ y = [-595484, -596340, -575197, -596438, -593020, -573595, -530466, -479814, -508423, -542970, -501265, -517921, -538660, -583285, -584336, -572032, -583584, -553037, -525968, -468304, -505097, -530235, -583679, -650208, -655669, -619645, -643850, -721391, -746752, -705019, -667897, -691903, -750910, -730724, -693568, -715041, -762375, -711528, -691604, -667017, -717455, -692511, -685654, -710362, -660310, -618219, -564289, -570644, -604709, -653912, -762241, -758737, -771682, -779571, -762073, -737217, -787782, -844024, -813226, -793439, -784448, -739581, -726306, -729883, -750597, -805338, -811316, -841299, -859856, -778328, -696170, -599593, -513019, -373634, -222223, 40463, 399009, 756878, 1088438, 1277245, 1292540, 1166604, 919519, 652768, 429660, 237044, 116252, -16162, -140245, -250420, -298230, -367554]
13236c67554j05153m6943P2939J7615o6459k9040j5961r421l0455l8838k4816
13225f44086K1627j9081j7408j01809P587J419m1585K4907M5172K2036j5141l188
13213g19550l198r6973n2406J195j241R21o851J4636j2437p7379o2372Q9710k3152
13200i49097m7241m8215j9854N2836J14103M9240k4722j3163j5887j3330m5683
13189i61013K0105n086p1404n7427J3424l828J3682M2573k4377l2337K0340O5256
13177i80092j680J9104L2002l9706l6968k4261K8778l6509l1429k5388k2894N88
13165a118455l6838R13j9892j2471n1576J9429M9861o431N333J6386l3993j6210
13153a203944j9811l9121o452K9066p772L6860K9632k5940N41r356K735K2981
$$ y = [-367554, -472707, -519650, -446711, -429096, -495555, -524595, -540556, -549977, -580432, -619270, -644086, -622459, -641540, -658948, -760757, -753170, -751751, -793336, -768429, -723257, -701221, -716362, -719550, -722748, -819721, -872127, -870932, -872173, -871252, -878103, -863467, -875904, -953283, -1015655, -925945, -949097, -996338, -1044553, -1064407, -1011571, -897468, -848228, -872950, -886113, -902000, -915330, -961013, -940908, -945994, -1017398, -1074825, -1061401, -1065229, -1051547, -1008974, -1033351, -1065688, -1045348, -980092, -981772, -962668, -930666, -970372, -1007340, -1031601, -1002823, -1039332, -1070761, -1096149, -1119043, -1118455, -1155293, -1154380, -1174272, -1186743, -1238319, -1218890, -1169029, -1175460, -1170127, -1153741, -1187734, -1203944, -1223755, -1262876, -1269328, -1240262, -1248034, -1211174, -1181542, -1207482, -1206941, -1216297, -1213562, -1190581]
13141a190581K1518j2970k4816K9539L3590k6943J1918j700l1912n7564J7644
13130a232277l3103o1916K0856k7928l409O2675p609k2648J8627r7499n6515K7107
13118a413639L8255Q926J7861J3885m537L3762o604p8878j4867j589m4232r4323
13106a545980l7362N5162K5202J2402k1486n7463m1551k7721L2566M4480J2403
13095a549348j2722J0792O808j8024J2046K1867J6749l3688p5484J0417J8407
13084a592180j07159m7956M1175N1867j8905r6799j4279j1983P2118N7954l0589
13073a696736p871j0295P7075Q4776l0731k44J7414O8067R896l4845p6917q7177
13061a687588r3078n2146L652j8239j1915l9905l6598N2127M8074l9217m5207
$$ y = [-1190581, -1169063, -1182033, -1206849, -1177310, -1143720, -1170663, -1158745, -1160445, -1192357, -1249921, -1232277, -1265380, -1327296, -1306440, -1334368, -1337777, -1275102, -1282711, -1305359, -1286732, -1384231, -1440746, -1413639, -1375384, -1366458, -1348597, -1334712, -1339249, -1305487, -1312091, -1390969, -1405836, -1407425, -1451657, -1545980, -1583342, -1528180, -1502978, -1490576, -1512062, -1569525, -1611076, -1638797, -1606231, -1561751, -1549348, -1562070, -1551278, -1544470, -1562494, -1550448, -1528581, -1511832, -1545520, -1621004, -1610587, -1592180, -1699339, -1747295, -1706120, -1654253, -1673158, -1769957, -1784236, -1796219, -1724101, -1666147, -1696736, -1704607, -1714902, -1637827, -1553051, -1583782, -1584026, -1566612, -1498545, -1488649, -1523494, -1600411, -1687588, -1780666, -1832812, -1829160, -1847399, -1859314, -1899219, -1935817, -1883690, -1835616, -1874833, -1920040]
13050a920040r80p4699l9990K1762j5946j3046j6798m8624L1355M396m3540J4539
13038b101611L2794j2236m8771m2314j4881L8241O4932J9333r0971q4912j9029
13027b259425O0055K8705m8121j02902q3033K4724l0539L838J8394j812L7812
13016b352304j4479R489K3521n009r1627q0438q2879K5667Q2106k6090p4046J742
13004b584347L8078O834M890P116j2917j8649o715n743n295q7463p7439K0324
12992b721326k2108J5937J8823l7487o870m7642M3446k0053k4200l5128j5012
12981b851620o9995n5011q483r117j9914k1830J4754J3069J3364n9362n0174L1911
12969c072408k2197q0279k4517m2588P277k1246m0394j1537k123j8899j4895k9119
$$ y = [-1920040, -1921020, -1995719, -2035709, -2013947, -2029893, -2042939, -2059737, -2108361, -2077006, -2072610, -2116150, -2101611, -2068817, -2081053, -2129824, -2172138, -2187019, -2148778, -2083846, -2064513, -2155484, -2240396, -2259425, -2199370, -2170665, -2218786, -2321688, -2404721, -2379997, -2410536, -2406698, -2388304, -2390116, -2352304, -2366783, -2357294, -2333773, -2338782, -2430409, -2510847, -2593726, -2568059, -2485953, -2512043, -2586089, -2584347, -2546269, -2539435, -2534545, -2527429, -2540346, -2558995, -2565710, -2571453, -2576748, -2664211, -2741650, -2721326, -2743434, -2727497, -2708674, -2746161, -2753031, -2800673, -2757227, -2777280, -2801480, -2836608, -2851620, -2921615, -2976626, -2985109, -2994226, -3014140, -3035970, -3021216, -3008147, -2994783, -3054145, -3104319, -3072408, -3094605, -3174884, -3199401, -3241989, -3234712, -3255958, -3296352, -3307889, -3310012, -3328911, -3343806, -3372925]
12957c372925n0682L8248n95m9370r6700K8789K3239j8448l630J3360j512m178
12945c494404J931N2181J4687k7204n9429j12533j91515k53298k01224k13240
12935d484048k24824j20681j6619L4125J34382L044K7237k6817j4260l3m449N0475
12923d642468J082l5294n6422O62j0616k1445l1364o6730p5267j10931K7094j5073
12911e036772n7227n8236k1923r2466j20995q9321q5989m3147k8720k7073j23737
12900e785606o5835o6834l727K5024m8653p6642q273n4060r6876j36867j42928
12889f461277m8409l9947r1965j07296p7614p8912q682o2415n8240j13161j11915
12878g259833j16082j04007j11042q3639k2388n0642j04839j08992o9827j78414
$$ y = [-3372925, -3423607, -3385359, -3385954, -3435324, -3532024, -3503235, -3479996, -3498444, -3502074, -3488714, -3490226, -3494404, -3492473, -3440292, -3425605, -3452809, -3512238, -3624771, -3816286, -4069584, -4270808, -4484048, -4708872, -4829553, -4846172, -4812047, -4677665, -4674621, -4647384, -4674201, -4688461, -4688494, -4692943, -4642468, -4641386, -4676680, -4733102, -4732440, -4743056, -4764501, -4795865, -4862595, -4937862, -5048793, -5021699, -5036772, -5093999, -5152235, -5174158, -5266624, -5387619, -5476940, -5562929, -5606076, -5634796, -5661869, -5785606, -5851441, -5918275, -5922002, -5896978, -5945631, -6022273, -6030546, -6084606, -6181482, -6318349, -6461277, -6509686, -6549633, -6641598, -6748894, -6826508, -6905420, -6914102, -6976517, -7034757, -7147918, -7259833, -7375915, -7479922, -7590964, -7674603, -7696991, -7747633, -7852472, -7961464, -8031291, -8209705]
12868h209705j21692p8033j16784j43675j53447j77846j48189j25409r6411j97045
12858i568236j55251j39196j37575j74490k07664k64391j63758j56897k15895
12849a1183353k65971k48130k85524k80631k34958k20333k30224k75843k33935
12840a3458902k48494k95844l31594k03741j95930k08409j91196j70618j66635
12831a5471363j73298o4425m4706j6480N7050K48459M10598O55942J051106J535204
12821a1811913K218081L280649M993556P465588J1170154J7037667K6025157L8636125
12813I9015064N4980765P2101534Q0848950O8525427L7937510K762227k9111159
12806C87060318m4533282m5825012m2687418l8406480l2392770k5903348k0335362
$$ y = [-8209705, -8331397, -8409430, -8526214, -8669889, -8823336, -9001182, -9149371, -9274780, -9371191, -9568236, -9723487, -9862683, -10000258, -10174748, -10382412, -10646803, -10810561, -10967458, -11183353, -11449324, -11697454, -11982978, -12263609, -12498567, -12718900, -12949124, -13224967, -13458902, -13707396, -14003240, -14334834, -14538575, -14734505, -14942914, -15134110, -15304728, -15471363, -15644661, -15709086, -15753792, -15770272, -15713222, -15464763, -15054165, -14398223, -13347117, -11811913, -9593832, -6313183, -1319627, 6145961, 17316115, 34353782, 60378939, 99015064, 153995829, 226097363, 306946313, 375471740, 413409250, 416171477, 387060318, 342527036, 296702024, 254014606, 215608126, 183215356, 157312008, 136976646]
12799A36976646j5947392j2787679j0889393r694881q428739p253271o275516
12792F5699775n476148m717479m102012l618039l138287k790878k409909k146953
12784C7300070j965287j704375j541312j450645j278482j196193j110558j078399
12776B5974819r18563r23282q21659p44367p48124p20046p19831o11416o04097
12767A9163434o02330n21667n37347m95718m96364m14628l91703l65671k73487
12758A5064519k90098l09032l21175l02791l24211l53533k73606k40134k95798
12749A2354141k13848k29244k11171j99739j71072j87914k09696j45979j13656
12740A0671822j73443j90384j84840j87042j58024j26796j18117j70588j38527
$$ y = [136976646, 121029254, 108241575, 97352182, 87657301, 79228562, 71975291, 65699775, 60223627, 55506148, 51404136, 47786097, 44647810, 41856932, 39447023, 37300070, 35334783, 33630408, 32089096, 30638451, 29359969, 28163776, 27053218, 25974819, 25056256, 24132974, 23311315, 22566948, 21818824, 21098778, 20378947, 19767531, 19163434, 18561104, 18039437, 17502090, 17006372, 16510008, 16095380, 15703677, 15338006, 15064519, 14774421, 14465389, 14144214, 13841423, 13517212, 13163679, 12890073, 12649939, 12354141, 12140293, 11911049, 11699878, 11500139, 11329067, 11141153, 10931457, 10785478, 10671822, 10498379, 10307995, 10123155, 9936113, 9778089, 9651293, 9533176, 9362588, 9224061]
12731I224061p1870p9683j09053p1260r5731j11579j59954j77572j43754o8005
12721H135600j12700j07539o5421q6915r8888j06780j07337j06465r6724l3819
12711G213012n1034l8558j13061r7735j03873j0265o3171j12786j39743p6458
12701F406328n5433k3431N2025m8706j28683p8167n9141k0363j858P4572k7838
12690F089305q5972r712L6889Q9453O3039R9985M5768k6114j16475j43546j56219
12679E886401o8264q1229j19921j37278j12964r6015o8379n3072o1572q863j3265
12668E065579l6915o8144p5340k6011l8394p2723l439j6974l7407p6326l2068
12657D581838n3823o8590j4925l3744k5987k9351l1260q0202j5798o8247j6928
$$ y = [9224061, 9152191, 9072508, 8963455, 8892195, 8796464, 8684885, 8524931, 8347359, 8203605, 8135600, 8022900, 7915361, 7849940, 7763025, 7664137, 7557357, 7450020, 7343555, 7246831, 7213012, 7161978, 7123420, 7010359, 6912624, 6808751, 6798486, 6735315, 6622529, 6482786, 6406328, 6350895, 6327464, 6379489, 6330783, 6202100, 6123933, 6064792, 6044429, 6042571, 6117143, 6089305, 6003333, 5993621, 6030510, 6119963, 6183002, 6282987, 6328755, 6302641, 6186166, 6042620, 5886401, 5818137, 5736908, 5616987, 5479709, 5366745, 5270730, 5202351, 5149279, 5087707, 5078844, 5065579, 5028664, 4960520, 4885180, 4859169, 4820775, 4748052, 4744613, 4727639, 4690232, 4613906, 4581838, 4528015, 4459425, 4444500, 4410756, 4384769, 4355418, 4324158, 4243956, 4228158, 4159911, 4142983]
12646D142983L4394K2994n4151n4934N052k3537l5560l526l1799j0875n684M810
12634C990167m2985r0500m6672m2254Q819M6290l0075j4349r710n0316j3204l6782
12622C668429k9389l1431M09J4745K0719m2032o4046J1129n7561m4934m1818k1906
12610C382314J4786j7618O776J5453J5480p9062k5659j7564k9546n7314m5065
12599C162981L8191k1693l0223k3457p634K9912j7024n592n1210m0629M9785J3176
12587C096583o8007m0240q0151l3011K9236P3964M4546k1429j5677j9952K6722
12576B992584m9410o0472L25L4545l1553l4481k3702l764K4184N36K0621n29l4938
12563B833946j301k1796m7141K6316k6478J4095j6107k8757J090N357l4692j1586
$$ y = [4142983, 4177377, 4200371, 4146220, 4091286, 4096338, 4072801, 4037241, 4033715, 4001916, 3991041, 3985357, 3990167, 3947182, 3856682, 3810010, 3767756, 3776575, 3822865, 3792790, 3778441, 3768731, 3718415, 3705211, 3668429, 3639040, 3607609, 3608018, 3622763, 3643482, 3601450, 3537404, 3548533, 3490972, 3446038, 3404220, 3382314, 3397100, 3379482, 3386258, 3401711, 3417191, 3338129, 3312470, 3294906, 3265360, 3208046, 3162981, 3201172, 3179479, 3149256, 3125799, 3118165, 3148077, 3131053, 3125461, 3074251, 3033622, 3083407, 3096583, 3028576, 2988336, 2908185, 2875174, 2904410, 2978374, 3022920, 3001491, 2985814, 2965862, 2992584, 2943174, 2882702, 2883027, 2917572, 2886019, 2851538, 2827836, 2824072, 2848256, 2848792, 2869413, 2868884, 2833946, 2832645, 2810849, 2763708, 2790024, 2763546, 2777641, 2761534, 2732777, 2733867, 2739224, 2704532, 2692946]
12551B692946j6708l5386K8346k6590m94m0900l5344l1434m850k9017j1992l8024
12539B450553J4670l0463J5631m8956j7045Q0928N529m2951m991O798L671j3244
12527B420130o0820K3388m3480k2063M8896J0807p7126p0803k2360J2081L6235
12516B254885j075k0028L2472K8127m8756m9289m4357m9802J223J9998K5804j3643
12504B135559m8644j5753k6425Q5314Q3860l880k4205k4293j20972p9554N6212
12493B017219l9246K9890N1983R546M6288l8097o5438L845M988J614n2827p5434
12481A894331M2049M4621r3624o1738N830J6305l359O1576O2061j0439l8817O6477
12469A985273O1860L5372l7855m8683o5726m8409J3086l1053J2590M9966J4549
$$ y = [2692946, 2676238, 2640852, 2669198, 2642608, 2642114, 2601214, 2565870, 2534436, 2529586, 2500569, 2488577, 2450553, 2465223, 2434760, 2450391, 2401435, 2384390, 2465318, 2470847, 2427896, 2422905, 2429703, 2433374, 2420130, 2359310, 2382698, 2339218, 2317155, 2366051, 2376858, 2299732, 2228929, 2206569, 2218650, 2254885, 2253810, 2233782, 2266254, 2294381, 2245625, 2196336, 2151979, 2102177, 2103400, 2123398, 2149202, 2135559, 2086915, 2071162, 2044737, 2130051, 2213911, 2210031, 2185826, 2161533, 2040561, 1961007, 2017219, 1977973, 2007863, 2059846, 2069392, 2115680, 2077583, 2012145, 2015990, 2020978, 2022592, 1969765, 1894331, 1936380, 1981001, 1887377, 1825639, 1831469, 1847774, 1844415, 1905991, 1968052, 1957613, 1918796, 1985273, 2047133, 2082505, 2044650, 1995967, 1930241, 1881832, 1894918, 1863865, 1876455, 1926421, 1940970]
12458A940970R183m5524k5378q1724l4997J4858j2316K8562J8423j6537P989j0423
12446A793086q3939n7843K3668K3804k1804M3195J6465M606p4266m7207K3120
12435A642885n319j7809q897M0178M7619j4056l0818n7059n851k4494j5479l3301
12423A517599K7797j4775j7977q526J1273N758M2369m1794l8901P3836L8561l4312
12411A560908k0706j3242j7154j7942O632l9002q7649n763J1966L8749J02205
12400A519002K4075q930n1307n1555j6913O074m4006O282p387L9350n4816j3810
12388A346059O2754M9635n035o3035m6655k0324K3848l9962J1652N5007J9915
12377A393859M174L3324J3783j0349q999j7881n9390P5187J57337J50111K47114
$$ y = [1940970, 1950153, 1904629, 1879251, 1797527, 1762530, 1777388, 1765072, 1793634, 1812057, 1795520, 1803509, 1793086, 1709147, 1651304, 1674972, 1698776, 1676972, 1720167, 1736632, 1741238, 1666972, 1619765, 1642885, 1637566, 1619757, 1610860, 1651038, 1698657, 1684601, 1653783, 1596724, 1590873, 1566379, 1550900, 1517599, 1545396, 1530621, 1512644, 1504118, 1515391, 1521149, 1563518, 1521724, 1482823, 1556659, 1595220, 1560908, 1540202, 1526960, 1509806, 1491864, 1498496, 1459494, 1371845, 1366082, 1378048, 1416797, 1519002, 1543077, 1534147, 1482840, 1431285, 1414372, 1420446, 1376440, 1382722, 1375335, 1414685, 1359869, 1346059, 1408813, 1458448, 1453413, 1390378, 1343723, 1323399, 1347247, 1307285, 1318937, 1373944, 1393859, 1398033, 1431357, 1445140, 1434791, 1425792, 1407911, 1348521, 1423708, 1581045, 1731156, 1978270]
12366A978270K51997L04272L53828K97405J45212K0977j43568k22273k02059j19313
12356B664748j34674j68645j53875j40006n3739k9467r4506l5362k5633r3308
12346A735533n7448o186l6832o6768r051m9109N3421M5250p128o7562k6099p1729
12334A436292J0392j6612o5015L0992O8632n4898m9667L7105M7323j2038m242
12323A428264o1801M656K16J7689L070o8519l3906M7032k6569M3801K4996l4209
12311A344720n9093O8347J1983j1290j2798q6297j6065J2246k8417m4078j1516
12300A167742O7180k8069K8802k5428j7042j1823l9210K8618K4046n334n6646
12289A132836J258j6696M319m3711J5974K3096L2480j844r3073q9651m5160L4462
$$ y = [1978270, 2230267, 2534539, 2888367, 3185772, 3330984, 3351961, 3208393, 2986120, 2784061, 2664748, 2530074, 2361429, 2207554, 2067548, 2013809, 1984342, 1889836, 1854474, 1828841, 1735533, 1678085, 1671899, 1635067, 1568299, 1559248, 1510139, 1563560, 1608810, 1601682, 1534120, 1508021, 1436292, 1446684, 1430072, 1365057, 1396049, 1464681, 1409783, 1360116, 1397221, 1444544, 1432506, 1428264, 1366463, 1371119, 1371335, 1389024, 1392094, 1323575, 1289669, 1336701, 1310132, 1353933, 1378929, 1344720, 1285627, 1353974, 1365957, 1354667, 1341869, 1255572, 1239507, 1251753, 1223336, 1179258, 1167742, 1234922, 1206853, 1235655, 1210227, 1193185, 1181362, 1142152, 1170770, 1194816, 1189482, 1132836, 1134094, 1117398, 1121717, 1078006, 1093980, 1117076, 1149556, 1147712, 1054639, 964988, 919828, 954290]
12277I54290R5612M7438J2139l5932O8379N6520m1265m4410m0702l5258K1012
12266A057823K3133r407j6334J4486O031l2079o31J5589N145m4993j1386l7712
12254I69665m3090M918O0437M3313K9166k7375n6071L5834J267n7667l2287J3264
12242I41374N7748j6725m8578N3418j9485o2945j7893P567O4782O7961p2738l8339
12230I16147k1763p783j9775N2794o835k2703k7592j9468k908K2650Q9810O800
12218I59374J0787k7697j6544j0081q688m8953L6693P8236L8695k500k0365j7171
12206I71786o8295k1487N0930N4031L6505o7057n4140k6527m9294j11463J7977
12195G32966Q7354N9581J1372j8506n4981j150K3978J2617k5349P0358J9215j05501
$$ y = [954290, 1049902, 1097340, 1109479, 1073547, 1141926, 1198446, 1157181, 1112771, 1072069, 1036811, 1057823, 1080956, 1071549, 1055215, 1069701, 1075732, 1043653, 1043022, 1058611, 1063756, 1018763, 1007377, 969665, 926575, 931493, 991930, 1035243, 1064409, 1037034, 980963, 1016797, 1018064, 960397, 928110, 941374, 999122, 982397, 933819, 987237, 967752, 904807, 886914, 894481, 959263, 1027224, 954486, 916147, 894384, 886601, 866826, 919620, 912785, 890082, 862490, 843022, 840114, 862764, 952574, 959374, 970161, 942464, 925920, 915839, 907151, 858198, 894891, 973127, 1011822, 1009322, 988957, 971786, 903491, 882004, 932934, 986965, 1023470, 956413, 902273, 875746, 826452, 714989, 732966, 820320, 879901, 891273, 872767, 817786, 816636, 840614, 853231, 827882, 898240, 917455, 811954]
12183H11954j6096r681M6746R4614O8996M985j5834m6391P255J957r7671L1163
12171H81997L8575K2516l8385m1534l1080l7932L5511r385k5062J1556j1885J7682
12159H12574n178k1633l0043l1795k7523j4635O5757o016k0300J7378k1951m6159
12147F70476j111J9729N2294O4130J6857l4476l307p574M492K1683K032l2761
12135G72464l1082n3451K9923P8817K6655p218L9468m7739n9808k5990m2929L033
12123F82143K5371J8820R613J0467P795J5944O36L1602K0587m3629r2703j6510
12111F70136q299K1144M8413J1650j3448j2287j5971n6892m0475J8706L6541K0743
12099F79961R959N7594O593k6238L6201l8326r752m1315l6003p571j3589K2247
$$ y = [811954, 795858, 786177, 832923, 927537, 996533, 1001518, 985684, 939293, 946548, 948505, 850834, 881997, 920572, 943088, 904703, 863169, 832089, 794157, 829668, 820283, 795221, 806777, 794892, 812574, 807396, 785763, 755720, 723925, 696402, 681767, 747524, 741508, 721208, 738586, 716635, 670476, 669365, 689094, 741388, 805518, 822375, 787899, 784592, 777018, 781510, 803193, 805225, 772464, 741382, 687931, 717854, 796671, 823326, 816108, 855576, 807837, 748029, 722039, 679110, 682143, 707514, 726334, 735947, 746414, 754209, 770153, 770789, 802391, 822978, 779349, 686646, 670136, 661837, 682981, 731394, 743044, 729596, 717309, 701338, 644446, 603971, 622677, 659218, 679961, 689920, 747514, 754107, 727869, 764070, 725744, 715992, 674677, 638674, 631103, 617514, 639761]
12087F39761J5771N0191j5422j9043l4639k3063j0774o3320M0546O5076O4328
12076G09412M3641k2106o1456m281l0575j0154J4656K5106o221L9313K4344J1936
12064G33615o5457q5179M686M6770k8066r187N7965K7126k1243p918K1646n8247
12052F16511k6553m6613K3876N2245l4856r247m4682n1810K4905l346L5901n663
12040E30668N2716J4011k0249L6108l5443m0928j5272p47Q061p51j9437O53K9029
12027E38419J733J093j0658k6820K1732j6389L114J3017j7199L0626r099j5924
12015E13645p4537k2371J08018M2846k3660l7399k5703K922j2672P1057j3583
12004E28563j6655n008o5266j3208J4348j2805k0130k0924n7559Q6840O5397n1479
$$ y = [639761, 655532, 705723, 690301, 671258, 636619, 613556, 602782, 539462, 580008, 645084, 709412, 753053, 730947, 669491, 665210, 634635, 624481, 639137, 664243, 658022, 697335, 721679, 733615, 668158, 582979, 587665, 634435, 606369, 597182, 655147, 682273, 661030, 653112, 674758, 616511, 589958, 543345, 567221, 619466, 584610, 575363, 530681, 478871, 503776, 500430, 536331, 530668, 583384, 597395, 577146, 613254, 577811, 536883, 521611, 520864, 528925, 528174, 508737, 509390, 538419, 540152, 541245, 530587, 503767, 525499, 509110, 512224, 525241, 508042, 538668, 529569, 513645, 439108, 416737, 524755, 567601, 543941, 506542, 480839, 483761, 471089, 542146, 528563, 511908, 506900, 441634, 428426, 442774, 429969, 409839, 388915, 331356, 418196, 483593, 432114]
11992D32114j3804K2364J0295J2028k837l9902k9777l5382L9008L3242k354m1190
11980C83805k2951K003p74R810k1727L0074O5559N6443j7483k6648m8259n60M5253
11967D54545l2420n8702l8159J5198K7966j0436L4009K6956p664K6263P503k6426
11955D18633J1112j0293j2900l7374M5892L7693k6032n0587m0718J7854J856k137
11943C52999O7267O982p4842m3099K6413O1346P8880r054k4520k5721R952J3623
11931D40226L295j8909J245j9156K1236K2959L2128J7160R315J5164m9882l6484
11919D38297n0236k8710k3063J4323K2883K6931L6911L1163o2243m7487L1373
11908C90142P6380J8318m4884q1204m3289M9481k8598N077m6040k0445O9672Q0030
$$ y = [432114, 418310, 440674, 450969, 462997, 460160, 420258, 390481, 355099, 394107, 427349, 424995, 383805, 360854, 362857, 362083, 371893, 350166, 380240, 445799, 502242, 484759, 458111, 409852, 409292, 454545, 422125, 363423, 325264, 340462, 368428, 357992, 392001, 418957, 411293, 437556, 445059, 418633, 429745, 419452, 406552, 369178, 415070, 452763, 426731, 376144, 335426, 353280, 355136, 352999, 420266, 427248, 352406, 309307, 335720, 397066, 475946, 466892, 442372, 416651, 426603, 440226, 443521, 424612, 425857, 406701, 427937, 450896, 483024, 500184, 509499, 524663, 474781, 438297, 388061, 359351, 336288, 350611, 373494, 400425, 437336, 468499, 406256, 358769, 390142, 466522, 484840, 439956, 358752, 315463, 364944, 336346, 341423, 295383, 274938, 344610, 424640]
11896D24640J0705j14104R80N9860O621l6391k8618j6511j6216o1336M2683N7489
11884C29802M7945m395n3336m8724L213k6848L1833Q593K045M4521m743l7533
11872B92373j834M2666K0227J3320J5835n2407o9889o7559p772L2058L7233k472
11860B51779k1619K9202j5456k0611J1652K2536M3615M970n4941r820j2643L0154
11848B58818r077O545j00560k5325J5155J5284L326k7541J1656P3609N9670j4119
11836B67441o8684Q921J6435k7952k7732k0673L5637L274k9589m336Q771l5940
11824A25573J5214L3215K6759K9568q256L1352l8029m0412k737J2560l4103O225
11812A56929j0839j7213j738J9503j6918M2929K489K9257j3259o8772M6078J5798
$$ y = [424640, 435345, 321241, 322221, 382081, 388702, 352311, 323693, 307182, 290966, 229630, 272313, 329802, 377747, 373352, 320016, 271292, 274505, 247657, 279490, 288083, 290128, 334649, 329906, 292373, 290539, 333205, 353432, 366752, 382587, 330180, 260291, 192732, 184960, 217018, 254251, 251779, 230160, 259362, 243906, 223295, 234947, 257483, 301098, 306068, 251127, 241307, 228664, 258818, 249741, 256286, 155726, 130401, 145556, 160840, 164166, 136625, 148281, 221890, 281560, 267441, 198757, 207678, 224113, 196161, 168429, 147756, 183393, 186667, 157078, 152742, 161513, 125573, 140787, 174002, 200761, 230329, 222073, 253425, 215396, 174984, 172247, 184807, 150704, 156929, 146090, 128877, 127139, 146642, 129724, 172653, 175142, 204399, 191140, 122368, 168446, 184244]
11800A84244l5670j1008M410m4815P154j8577O501P5067J1647p7614k2514k0955
11788E7870N625O2608l9696l8794J2085Q0094n0288K2686n045M5391J07Q054L5148
11775A95845l3020n9792p709k0422K3055J0211j643k136J9374L2293k4451m0750
11763I0855K0068K1654p512K0435j7180J4361R718m928m6256Q840m084l5642J6984
11750H7313J0654m0801m3776J7377L8076M7055K194m4690p5501n8530K4542P7500
11738D1413J3463l5496J186n4315K8468J6630K9443Q919j6448q9790j6447J0420
11726f2554K2958L4628L046k7678m1827R410K5171N335J3492k1600k5116j8914
11714h3649N9436k0134k4816L9107J0940m1108J3314L8925L3228r760j4950j0490
$$ y = [184244, 148574, 137566, 141976, 97161, 104315, 85738, 92239, 167306, 178953, 101339, 78825, 57870, 63495, 126103, 86407, 47613, 59698, 139792, 89504, 112190, 107145, 152536, 152643, 160697, 195845, 162825, 103033, 95324, 74902, 97957, 108168, 106525, 104389, 123763, 156056, 131605, 90855, 110923, 132577, 125065, 145500, 128320, 142681, 152399, 147471, 101215, 110055, 105971, 70329, 87313, 97967, 57166, 13390, 30767, 68843, 115898, 118092, 73402, -2099, -60629, -36087, 41413, 54876, 19380, 20566, -33749, -5281, 11349, 40792, 49711, 33263, -56527, -72974, -62554, -39596, -4968, -1922, -29600, -71427, -62017, -36846, -31511, -18019, -39619, -64735, -83649, -24213, -44347, -69163, -30056, -19116, -60224, -46910, -7985, 25243, 15483, 533, -9957]
11702i957j9766p5779k2842L2709j8918n4057J88j1604k1587m28L5048P70j6303
11689a82526k2939J6622K9647l4814o0980m1244M5974M5336K9954j9254k4306
11678b18530N7075k9181m4501M791m5690J7596K8149l0825P137K3041k5747r1833
11666c48518o4142P7059K8502n3893r7896m1807K3991O4657L3449l6589o6566
11655d81753p215j8963j1624o72O9483j4883n5226O3397J85489L41575O79178
11644G48786J178169J870897K920951L065412M74849j731439j446376j056616
11636F024633j016913r51830o99820n87137l78140k77308k40562k23167j95882
11627A453874j49217p6563l9940n7394r2693j16674j22976o2282n9308r3706k907
$$ y = [-9957, -29723, -105502, -128344, -95635, -114553, -168610, -168422, -180026, -201613, -202041, -166993, -166223, -182526, -205465, -188843, -159196, -194010, -254990, -296234, -250260, -204924, -174970, -194224, -218530, -161455, -190636, -235137, -230346, -276036, -258440, -230291, -261116, -253979, -230938, -256685, -348518, -412660, -335601, -307099, -360992, -458888, -500695, -476704, -412047, -378598, -415187, -481753, -488968, -507931, -519555, -520227, -450744, -465627, -520853, -457456, -271967, 69608, 748786, 1926955, 3797852, 6718803, 9784215, 10259064, 8527625, 7081249, 6024633, 5007720, 4055890, 3356070, 2768933, 2390793, 2113485, 1872923, 1649756, 1453874, 1304657, 1228094, 1188154, 1130760, 1038067, 921393, 798417, 736135, 676827, 583121, 580214]
11616E80214k2312l7743j1306l5153o8999k9686l6331j7505N6028J077K3437k7993
11604C73728p935l5854l1410l3639k6389R218K2823l0765l4873M6501J1379j4821
11592B47963n664j5811l2518J8132P897K77J813l0192j6933j4755J3983n446n90
11579A68156n3798n9214q164N3600Q0603m8639k8622m2988l0169m8147L8458J4983
11567C6059J244L4223N4945J8479j3014r2266m0353P7291J2388L418l5392j6825
11555D0197M911m4562m1111l1384J8309M5186o751k3610k6316m512m682K4872
11543d9453L0421k7531q8915J181L0026m0631l6487N989P3093J5109N1024P0862
11531C4688k4836l6364m1633k6090N3673N0569n000q582l4341O4166L8239n8432
$$ y = [580214, 557902, 520159, 508853, 473700, 404701, 375015, 338684, 321179, 377207, 378284, 401721, 373728, 365793, 329939, 298529, 264890, 238501, 247719, 270542, 239777, 204904, 251405, 262784, 247963, 242299, 226488, 193970, 212102, 219999, 220276, 222089, 191897, 174964, 160209, 174192, 168746, 168156, 114358, 55144, 46980, 100580, 181183, 132544, 103922, 60934, 30765, -17382, 21076, 36059, 37303, 71526, 126471, 144950, 131936, 39670, -683, 76608, 88996, 92414, 57022, 40197, 45108, 546, -40565, -71949, -53640, -8454, -15205, -38815, -65131, -69643, -74325, -49453, -19032, -46563, -135478, -134297, -104271, -144902, -181389, -175400, -102307, -87198, -36174, 34688, 9852, -26512, -68145, -94235, -40562, 10007, 5007, -3575, -37916, 26250, 64489, 6057]
11519F057j4903l01n484m7424l0318L9599n149M1170J5741q567J4189n1306k640
11506d9336N746j6392m7746p373L5181k9178o646l2190l7449j067K661O1796O2954
11493e9039j6352k3553l4106p821M33o1334K7458Q4040j6057p848j08981n8816
11481b81976O9251N7903M9469J387K802j2263J9570o0521L4207K4958k3494o4785
11469a83492l9371J8137k260N829L6280L1115k3414L2237L7216j9416P946O097
11457i3096q2960n694O499J1044K3550m0639o4363j1807K5146L9410l2285J5624
11445b09571r659k4707K5133L291K9172M549J320m3209l5073m9331n697L141N979
11432c04662P8023M6656K401J993l7337P164J1517K1080R1880M0744r5236o7661
$$ y = [6057, -8846, -9147, -14631, -62055, -92373, -52774, -57923, -16753, -1012, -9579, 4610, -46696, -49336, -43590, -59982, -107728, -115101, -79920, -109098, -115744, -147934, -185383, -186450, -183789, -121993, -59039, -75391, -98944, -133050, -140871, -140438, -201772, -174314, -90274, -106331, -114179, -223160, -281976, -212725, -154822, -105353, -103966, -101164, -113427, -93857, -154378, -120171, -95213, -118707, -183492, -222863, -204726, -206986, -201157, -164877, -133762, -157176, -124939, -87723, -107139, -99193, -93096, -176056, -181750, -175251, -164207, -140657, -181296, -245659, -257466, -232320, -192910, -225195, -209571, -219230, -243937, -218804, -215513, -186341, -181792, -180472, -223681, -258754, -308085, -313782, -310641, -304662, -226639, -179983, -177582, -175589, -212926, -205762, -194245, -173165, -81285, -40541, -135777, -203438]
11420b03438k6293N8405j2896o5926k7006k7452k1441L5441N1439N2762k1574
11409b07979Q779J8869Q569l1856p0722k0397L0366J0001k9988n321N408l1053
11397c15324j07812j5131M0168K4237n2695K6295O1855N2999N2257K4150l4518
11386b43519l6520L9704j3446n9108q6345m2677L928L1816k1587l8370Q956P2351
11374c84817O5512l0295l2364k6239O1060O559n723l1932n314p400j4871K9070
11362c76754M9649k4982Q940m771J0396m8067n738J7406j4036L6612l4818o269
11350c92432K1653M5108M2799k3312q377q817j7348j5378l2997p7887m7749N837
11338e08900Q375Q1406J0746Q049l0560r635m5768l6076Q155J0225j7400L5251
$$ y = [-203438, -229731, -171326, -184222, -250148, -277154, -304606, -326047, -290606, -239167, -186405, -207979, -199200, -180331, -171762, -203618, -274340, -294737, -264371, -254370, -284358, -289679, -284271, -315324, -423136, -438267, -398099, -373862, -426557, -400262, -338407, -285408, -233151, -209001, -243519, -280039, -240335, -253781, -312889, -399234, -441911, -437983, -406167, -427754, -466124, -457168, -384817, -319305, -349600, -381964, -408203, -347143, -340584, -346307, -378239, -383553, -390953, -405824, -376754, -327105, -352087, -343147, -347918, -337522, -385589, -391327, -373921, -387957, -351345, -386163, -392432, -370779, -325671, -282872, -306184, -314561, -323378, -340726, -356104, -389101, -466988, -514737, -508900, -500525, -419119, -408373, -400324, -430884, -440519, -486287, -522363, -514208, -503983, -521383, -486132]
11326d86132L7883M5877O316J766j2719p3511p6066k436O7214M7379J7146k0507
11314d47790o52L1263M0049K7380l8975r4573j03646k7637Q1245M1431J5668l3044
11302e09281n3013K7823J5037P929j6076M247N5738M247k9502l8021o023m7726
11290e84621N3416n162o7566J890k9855K7092O3408L0986j6118j7585l086k4013
11278e71214J9329k2694J179M4489k9475m9044M55M4388J3191n9461m0906p00
11266f50463O4795N5536K112l247K5824j3956n5977m4191K2290N9718p5389l7461
11254f50409L1035N380j0653M2789J2130j806P487N979j7344q320J9007K1522
11242e43203n3015r748K8769O293O177K7237M8090n2609m6784j1291l6809m7386
$$ y = [-486132, -448249, -402372, -396056, -394290, -407009, -480520, -556586, -559022, -491808, -444429, -427283, -447790, -448442, -417179, -377130, -349750, -388725, -483298, -586944, -614581, -533336, -491905, -476237, -509281, -562294, -534471, -519434, -511505, -527581, -523334, -467596, -463349, -492851, -530872, -536895, -584621, -531205, -536367, -603933, -602043, -631898, -604806, -541398, -510412, -526530, -544115, -547201, -571214, -551885, -574579, -573400, -528911, -558386, -607430, -606975, -562587, -549396, -608857, -649763, -650463, -585668, -530132, -528020, -531267, -505443, -519399, -575376, -619567, -597277, -537559, -612948, -650409, -619374, -613994, -624647, -581858, -569728, -571534, -564047, -558068, -575412, -583732, -564725, -543203, -596218, -605966, -577197, -570904, -564727, -537490, -489400, -542009, -588793, -600084, -636893, -684279]
11230f84279L1648P3314j3300M6948l7749m0222l5394J8496L4178n0427m5687
11219g02474j5764p1399k379K0519J4140L2464l6056j8294l1928k8004J4315L312
11207h21548L5933R192J5361j0007k0196P248m927N4095Q5845L564j3873m1909
11195g01222j58r693k4651J1743J3220K9635q4098l3464J02493P008l9908J749
11183g27346j8955j6012L492K4370j7926m0279k0381K3616M9683m9974o6403L0715
11171h25400n314k4021k077L1019m7907m0632Q0964M4559p3585O874M6517O1748
11159g47255j1429n8886o2828K5462K6221n2680m8692J1581k3145j3622M0745
11148i14528L4180M032k3024l4599j8595j0930J6643L8974r272J0606r76J4000
$$ y = [-684279, -652631, -579317, -592617, -545669, -583418, -623640, -659034, -640538, -606360, -656787, -702474, -718238, -789637, -792016, -771497, -757357, -724893, -760949, -779243, -811171, -839175, -824860, -821548, -785615, -776423, -761062, -771069, -791265, -784017, -788944, -734849, -649004, -645440, -659313, -701222, -701380, -711073, -735724, -723981, -710761, -681126, -765224, -798688, -696195, -689187, -729095, -727346, -746301, -762313, -758821, -734451, -752377, -792656, -813037, -789421, -739738, -789712, -856115, -825400, -830714, -854735, -856812, -825793, -873700, -914332, -833368, -788809, -862394, -855520, -809003, -747255, -758684, -817570, -880398, -854936, -828715, -881395, -930087, -918506, -941651, -955273, -914528, -880348, -876316, -899340, -933939, -952534, -963464, -946821, -907847, -917119, -906513, -907489, -893489]
11136h93489K1245p1929q2979K4876L2382N679M3025P0471L0819l6490q7742l0699
11124i74831L8331P2341R729k1079k0131k429l4816k0360j2412R247l0940j8616
11112a005966J8740j2469L9781N5763m7617l4326J594K518K0774j9778k8143j5206
11100a024335n3635p4054P527R2481P0157J246n1956m7088k3250R212j4504k5046
11088a133245L4377n240L9211L2802l0378r893J1443L6105m371m0102o9696n8485
11076a197472k5946K2735N5175k3827J1998P7345J9172J412n8369R26J1672n3770
11064a158949m7775p594K5293J159L3774J638k9503J6128J0736n1725l1927n5878
11052a294623r694J8097l1476M521M9012P2950N4954L9995J1284K7189n4386o743
$$ y = [-893489, -872244, -944173, -1027152, -1002276, -969894, -964215, -921190, -850719, -819900, -856390, -944132, -974831, -936500, -864159, -854430, -875509, -895640, -898069, -932885, -953245, -965657, -956410, -987350, -1005966, -987226, -999695, -959914, -904151, -951768, -986094, -984500, -981982, -961208, -980986, -1009129, -1024335, -1077970, -1152024, -1144497, -1052016, -981859, -980613, -1032569, -1079657, -1102907, -1093695, -1108199, -1133245, -1098868, -1104108, -1064897, -1032095, -1062473, -1072366, -1060923, -1024818, -1029189, -1069291, -1138987, -1197472, -1223418, -1200683, -1145508, -1169335, -1157337, -1079992, -1060820, -1059408, -1117777, -1116851, -1105179, -1158949, -1206724, -1214318, -1189025, -1187866, -1154092, -1152454, -1181957, -1165829, -1155093, -1206818, -1238745, -1294623, -1304317, -1286220, -1317696, -1313175, -1264163, -1191213, -1136259, -1096264, -1084980, -1057791, -1112177, -1118920]
11040a118920O7963k0656P704J0286j5801K4757N3160Q8828P0118M4162K2389
11029g66010n5234q5367j7897J4283O8134O4347N0686P5318O143p932J7026j676
11017f38179o8683m6196L0452L7431J3468j04118m6037N940K3993P6491m5538
11006g60976m0105p1613j48J7039l318p038j5795n0677Q55R6753j3074r1354l6510
10993i75961n6333j3160n4757j03511J0713N5612q932k5054K6177o86k8029r0372
10981a264293k6235M007p6234m8288M1825K4748k5973J3821O7067n960J9431m5342
10969a321426l1990J9089k3185l0239l3639k7775p184O4074j8054o8253m7725
10958a526307L5923N5512p004l4944k3447K2656j7521l1458k7407p0205r5L6886
$$ y = [-1118920, -1050957, -1071613, -1063909, -1053623, -1069424, -1044667, -991507, -902679, -832561, -788399, -766010, -821244, -906611, -924508, -910225, -842091, -777744, -727058, -651740, -645597, -653529, -636503, -638179, -706862, -753058, -722606, -685175, -671707, -775825, -821862, -815922, -791929, -715438, -760976, -801081, -872694, -872842, -855803, -859121, -866159, -881954, -932631, -931776, -835023, -848097, -939451, -975961, -1032294, -1045454, -1100211, -1203722, -1193009, -1137397, -1146329, -1171383, -1145206, -1145892, -1173921, -1264293, -1290528, -1286521, -1362755, -1411043, -1369218, -1344470, -1370443, -1356622, -1289555, -1295515, -1276084, -1321426, -1353416, -1334327, -1357512, -1387751, -1421390, -1449165, -1456349, -1392275, -1410329, -1478582, -1526307, -1490384, -1434872, -1441876, -1476820, -1500267, -1477611, -1495132, -1526590, -1553997, -1624202, -1624297, -1587411]
10946a587411J2436k6093k3115R716K3230M2516L1921Q211m6320j45402L9198
10935a661113N8286k9024k0400J7531M3753o454L3247m8559l5256n8964K7615
10924a679338L7028q3757m4538o231L088L6229L064l509k1015k8393j9099J1768
10912a794703K6294M0382M9425k6303j8529l6925l6240n718p354k5918m5375l7525
10900a918489k5223q10M4062m8285o7712K799k2123M1840J3340J421r933p23l2341
10887b022177j676O3411J8604m0769q8928J6773R905K0566l6386n8197K9559l7325
10875b126640k1576k267K719m306J2296j639n7384N761M0147n2945l1400j7321
10863b254555l8204J2987J7406L8349P255m6698j9063j768k4753j9335j1761j4767
$$ y = [-1587411, -1574975, -1601068, -1624183, -1614467, -1591237, -1548721, -1516800, -1508589, -1554909, -1700311, -1661113, -1602827, -1631851, -1652251, -1634720, -1590967, -1597421, -1564174, -1612733, -1647989, -1706953, -1679338, -1642310, -1726067, -1770605, -1776836, -1773748, -1737519, -1734455, -1737964, -1758979, -1787372, -1806471, -1794703, -1768409, -1728027, -1678602, -1704905, -1723434, -1760359, -1796599, -1802317, -1809671, -1835589, -1880964, -1918489, -1943712, -1944522, -1900460, -1948745, -2016457, -2013658, -2035781, -1993941, -1980601, -1979180, -1989113, -1989836, -2022177, -2023853, -1960442, -1941838, -1982607, -2071535, -2054762, -2044857, -2024291, -2060677, -2118874, -2089315, -2126640, -2148216, -2150483, -2147764, -2152070, -2139774, -2141413, -2198797, -2193036, -2152889, -2205834, -2237234, -2254555, -2292759, -2279772, -2262366, -2224017, -2216762, -2263460, -2282523, -2284291, -2309044, -2328379, -2340140, -2354907]
10851b354907K819M2460N245N5804J2055j1818k4296n4766q6714o1394O90L1502
10839b443320m7372k2676k4103k678R390j7865k9580M780O6636j1721m1424j1622
10827b571555j4077K5496J4601l8902o9392M581K0759k1941K230j501q0510o8640
10815b798851l5417j5844r124N3120m798j903K768J3830q1424j24267J0162M2004
10803b949744l2725j8040N777m1774K5698L5749J213k8284r42o2077k8574l0388
10791c124111n9432k5094K4969r6914j2592n9026K8065m5151p2874L4477L1672
10780c376011Q774j396L144m4118n389j0989m1260o3684l8131j4932n1711n682
10768c641385O710q2043j8347L6859M474m5230k7027k5411k158J2078q315p3148
$$ y = [-2354907, -2352088, -2309628, -2304383, -2248579, -2236524, -2248342, -2272638, -2327404, -2414118, -2475512, -2474822, -2443320, -2490692, -2513368, -2537471, -2540149, -2530759, -2548624, -2578204, -2573424, -2506788, -2518509, -2559933, -2571555, -2585632, -2560136, -2545535, -2584437, -2653829, -2649248, -2628489, -2650430, -2648200, -2649701, -2730211, -2798851, -2834268, -2850112, -2859236, -2806116, -2810914, -2812817, -2810049, -2796219, -2877643, -3001910, -2991748, -2949744, -2982469, -3000509, -2994732, -3036506, -3010808, -2975059, -2973846, -3002130, -3003072, -3065149, -3093723, -3124111, -3183543, -3208637, -3183668, -3280582, -3293174, -3352200, -3324135, -3369286, -3442160, -3407683, -3376011, -3367237, -3368633, -3365489, -3409607, -3414996, -3425985, -3467245, -3530929, -3569060, -3583992, -3635703, -3641385, -3634675, -3716718, -3735065, -3698206, -3693732, -3738962, -3765989, -3791400, -3793558, -3781480, -3789795, -3862943]
10756c862943q0005m2273m4553K7937J5043L6447l0709m1415n1821k9861k6633
10745d130786l3391K4897m2425o1156r189j8809r1272n3512J7268j1207k0614
10734d430196j04078j7181m0780o093M936m4734j16014p7248o972n2029o6901
10723d957290J7719L7959j4431q2005j38035j06428o6189q7178p9685o9843L1126
10712e514280P58o539k5091q5553n6876l2254j01729q7765p300m7687o5588j03169
10700f133073r6641r6833m1204m8241m9813n6005r1085j21833P486N0246j19221
10689f796217j84268p4817m3285p0657n6612q4679n8047j02336o1253o6407p2696
10678g671274j07750j06565o4945j11464j26983o4248q9245j25150j30913j16215
$$ y = [-3862943, -3942948, -3985221, -4029774, -4001837, -3986794, -3950347, -3981056, -4022471, -4074292, -4104153, -4130786, -4164177, -4139280, -4181705, -4242861, -4252050, -4270859, -4362131, -4415643, -4398375, -4409582, -4430196, -4534274, -4551455, -4592235, -4598328, -4593392, -4638126, -4754140, -4831388, -4838360, -4890389, -4957290, -4939571, -4901612, -4916043, -4998048, -5136083, -5242511, -5308700, -5395878, -5475563, -5545406, -5514280, -5513522, -5520061, -5545152, -5630705, -5687581, -5719835, -5821564, -5909329, -5916629, -5964316, -6029904, -6133073, -6229714, -6326547, -6367751, -6415992, -6465805, -6521810, -6612895, -6734728, -6727242, -6676996, -6796217, -6980485, -7055302, -7098587, -7169244, -7225856, -7310535, -7368582, -7470918, -7532171, -7598578, -7671274, -7779024, -7885589, -7950534, -8061998, -8188981, -8253229, -8342474, -8467624, -8598537, -8714752]
10668h714752o5520j31613j49558o5757j1721r4854j44970j65250j46776j75402
10658i866173j33689k07323j58501j39172j18086j67849j65372j50624k82669
10649a1389458k72512j74074j82950k31485k06199k66773k22404k35976k39402
10640a3421233k50096l13083l12783l56969k84522k81778k84420k09997k43967
10631a5958848k51901k96026l69901l56083l29391l22370k23532j38605k5919
10622a8272576K32380P18908J375452K254640L346486M568493N673250O022536
10614E919569N099437L265895J343271j5757l80203M3491J332653L283356O055343
10605B5947055R218278J1920166J2752810J0151300M928678P9005k562955l126583
$$ y = [-8714752, -8780272, -8911885, -9061443, -9127200, -9138921, -9233775, -9378745, -9543995, -9690771, -9866173, -9999862, -10207185, -10365686, -10504858, -10622944, -10790793, -10956165, -11106789, -11389458, -11661970, -11836044, -12018994, -12250479, -12456678, -12723451, -12945855, -13181831, -13421233, -13671329, -13984412, -14297195, -14654164, -14938686, -15220464, -15504884, -15714881, -15958848, -16210749, -16506775, -16876676, -17232759, -17562150, -17884520, -18108052, -18246657, -18272576, -18040196, -17321288, -15945836, -13691196, -10344710, -5776217, -102967, 5919569, 11019006, 14284901, 15628172, 15612415, 15232212, 15275703, 16608356, 19891712, 25947055, 35165333, 47085499, 59838309, 69989609, 74918287, 74997292, 72434337, 69307754]
10597F9307754k259271k03495L183532P485222J2069214J5647286J5934420J1182103
10589A32346765L117099l779413p273710q207196p629386n729567k679169J009768
10581A01175191M643031P148570P029022L482361j837365o091244p991099q264168
10573I9294299p592346o189793m255509k255730n21971N90701M68964r88295l031479
10564G5518841m638075n389182n484352n169005m729390m204789l629564l075880
10556C9198604k612690k283990j998759j715700j556680j361539j168654j095130
10548B5405462j042355r80858q94818q54049o93383o24697o26934o12822n29439
10539A8546107m37832m80435n10731m20206l80214l82078l41703l28638l35013
$$ y = [69307754, 67048483, 66844988, 70028520, 77513742, 89582956, 105230242, 121164662, 132346765, 135463864, 131684451, 124410741, 116203545, 108574159, 102844592, 100165423, 101175191, 105818222, 112966792, 119995814, 123478175, 121640810, 115549566, 107558467, 99294299, 91701953, 85512160, 81256651, 79000921, 78478950, 79069651, 79538615, 78550320, 75518841, 70880766, 65491584, 60007232, 54838227, 50108837, 45904048, 42274484, 39198604, 36585914, 34301924, 32303165, 30587465, 29030785, 27669246, 26500592, 25405462, 24363107, 23382249, 22487431, 21633382, 20939999, 20315302, 19688368, 19075546, 18546107, 18108275, 17627840, 17117109, 16696903, 16316689, 15934611, 15592908, 15264270, 14929257]
10530A4929257l12658k65612k19058k97442k83529k41910k04733k45459k98088
10521A2560768k76865k49033k10006k04190j61919j58085j64324j35995j49180
10512A0851171j50215k19468j18493j11295j38379j46584j56634j42730j80837
10503I486536j32052q1405r1506p7861j09780r1396j12107r9611J718q3220j63848
10492H445468q2626j7534j43960j57965l7465j618n8045j15552j8070o6582j70280
10481G575771j33176l5107j0660O528o2718j3505p9253j08809l3674p0988l8383
10470F996026m5505o6752j11422K226K1174o3704m8269p9153l4255j0839n3399
10459F506128n0799o1760n4507j28396k1322j0852K2706p6470r6713o3462o8626
$$ y = [14929257, 14616599, 14350987, 14131929, 13834487, 13550958, 13309048, 13104315, 12858856, 12560768, 12283903, 12034870, 11824864, 11620674, 11458755, 11300670, 11136346, 11000351, 10851171, 10700956, 10481488, 10362995, 10251700, 10113321, 9966737, 9810103, 9667373, 9486536, 9354484, 9273079, 9181573, 9103712, 8993932, 8902536, 8790429, 8690818, 8692536, 8609316, 8445468, 8362842, 8345308, 8201348, 8043383, 8005918, 8004300, 7946255, 7830703, 7812633, 7746051, 7575771, 7442595, 7407488, 7396828, 7403356, 7340638, 7327133, 7247880, 7139071, 7105397, 7034409, 6996026, 6950521, 6883769, 6772347, 6774573, 6795747, 6732043, 6683774, 6604621, 6570366, 6559527, 6506128, 6455329, 6393569, 6339062, 6210666, 6189344, 6178492, 6201198, 6124728, 6028015, 5964553, 5895927]
10448E895927k1084l8818n2627q0376m4064M702o9692r2437j6332j1885K6003
10437E499317l5146o1143q1717o4689p0820j5043r268j6466m9935j3228n585o1765
10425E014512j10628K0490j9846p8833q3707k0748j9411l8312k4104m848j0612
10414D623953P000J2806j1623m7135l7728j7891n9858n3081j5410j3053M862r791
10402D383051l4786j9018k8951R327N1912j9096j21981r2183o0576n4620r451
10391D003628O951l9512n7204M3708K0357J5707q2224o4660j1144Q940p5361n540
10379C763646J4365l0757r3936j7316J7342j0290L9094o409O18j4757o7333o2602
10367C531665r2629M5356N3249p990k3259l6578k7071O17j4010R705l1441l4574
$$ y = [5895927, 5874843, 5836025, 5783398, 5703022, 5658958, 5663660, 5593968, 5501531, 5485199, 5473314, 5499317, 5464171, 5403028, 5321311, 5256622, 5185802, 5170759, 5161491, 5145025, 5095090, 5081862, 5076277, 5014512, 4903884, 4924374, 4904528, 4825695, 4741988, 4721240, 4701829, 4663517, 4639413, 4634565, 4623953, 4630953, 4643759, 4632136, 4585001, 4547273, 4529382, 4469524, 4416443, 4401033, 4387980, 4392842, 4383051, 4348265, 4329247, 4300296, 4309623, 4361535, 4342439, 4220458, 4128275, 4067699, 4013079, 4003628, 4010579, 3971067, 3913863, 3957571, 3977928, 3993635, 3911411, 3846751, 3835607, 3844547, 3769186, 3763646, 3778011, 3747254, 3653318, 3636002, 3653344, 3643054, 3682148, 3675739, 3676357, 3661600, 3594267, 3531665, 3439036, 3484392, 3537641, 3529651, 3506392, 3469814, 3442743, 3443360, 3429350, 3439055, 3407614, 3373040]
10355C373040n741L3621O1405J7672l1491o4841n7077J5496J1563p904m0465l8107
10343C267171k0575j7541K8657j1674j2538M1740q333j3968k7554M7563q6970
10332C185978r5470m1819O2492J8357m868N6411k3909m7185n7466k8707R964L0463
10320C064241M7184m0962j1410L759o0033o7068j9418L0953M6916J5838p6176
10309B933824n6469l9987l739j6976N090K0334N2909K235m9338l2228K2977r2852
10297B745780k6257j2945l4382m4426J0442k8096j2524J7630j5735k1973K8129
10286B605643K2407J3054M1714N850l0285m4104k2387k5515k8849k5228l2199
10275B480101P258L1580L6326l274o0327l2150m0174K0631r099J7051J0018l5008
$$ y = [3373040, 3367299, 3400920, 3462325, 3479997, 3448506, 3383665, 3326588, 3342084, 3353647, 3345743, 3305278, 3267171, 3246596, 3229055, 3257712, 3246038, 3233500, 3275240, 3266907, 3252939, 3225385, 3272948, 3185978, 3090508, 3048689, 3111181, 3129538, 3124670, 3181081, 3157172, 3109987, 3052521, 3023814, 3033778, 3064241, 3111425, 3070463, 3059053, 3062812, 3002779, 2935711, 2916293, 2947246, 2994162, 3010000, 2933824, 2877355, 2837368, 2833629, 2816653, 2821743, 2842077, 2894986, 2897221, 2847883, 2815655, 2838632, 2745780, 2719523, 2706578, 2672196, 2627770, 2638212, 2610116, 2597592, 2615222, 2599487, 2577514, 2605643, 2628050, 2641104, 2682818, 2688668, 2658383, 2614279, 2591892, 2566377, 2537528, 2512300, 2480101, 2487359, 2518939, 2555265, 2551991, 2491664, 2459514, 2419340, 2439971, 2430872, 2447923, 2457941, 2422933]
10263B422933k1361j2873J1209K3080J4389K0320k7648l5242j6629n6963N262
10252B326477L3728J3936k8962J2229J2046N793l9138L4975J8619o8434q858m228
10240B308183l1411l481J1219o917n919m1154J1964K0025j9788o4795j4898J13
10228B163141L5858k0515N3039l434k8005n6162k7688l3396n7506K8634M9601
10217B103567K7534L6016K2943j5275m9754r6835M0768K4612m7868l5626Q125
10206B018207O930K6931K2339L748m3852l8236m0515J7295J0280m0039J574K2501
10194A967163P3701J8745p064j949K0986n6256j7135N124q3361n0889m0623L8162
10182A866604N9877M2372k8863n89J6879Q1182O5918q183k4029n9698n146L0181
$$ y = [2422933, 2401572, 2388699, 2399908, 2422988, 2437377, 2457697, 2430049, 2394807, 2378178, 2321215, 2326477, 2360205, 2374141, 2345179, 2357408, 2369454, 2375247, 2336109, 2371084, 2389703, 2321269, 2312411, 2308183, 2276772, 2273291, 2284510, 2277593, 2271674, 2230520, 2242484, 2262509, 2242721, 2177926, 2163028, 2163141, 2198999, 2178484, 2231523, 2228089, 2200084, 2143922, 2116234, 2082838, 2025332, 2053966, 2103567, 2131101, 2167117, 2190060, 2174785, 2125031, 2028196, 2068964, 2093576, 2045708, 2010082, 2018207, 2025137, 2052068, 2074407, 2078155, 2034303, 1996067, 1955552, 1972847, 1983127, 1943088, 1944662, 1967163, 2040864, 2059609, 2052545, 2050596, 2071582, 2015326, 1998191, 2003315, 1919954, 1869065, 1828442, 1866604, 1926481, 1968853, 1939990, 1939401, 1956280, 2037462, 2103380, 2095197, 2071168, 2011470, 2006324, 2036505]
10170B036505P214K2502K4456P5269P9750Q7550J8310J0899j4110O939k0463n3723
10158B281098J4806O6616O5056N7731O9413K3003K0885p3058J4592K8128m2664
10147B525606m2497q3319l1050K9466M4823L9283l8921p1276n8430L0123n4644
10136B289164k1544K0979p3536p9735Q4612K3893J9715R436l4651J4989L7042
10125B290364p1459o3276M0454n3606p9915o897k1347L989p2909m8422j2753k1728
10113A882495l0556r97J7318j3918j06973l443N241M3215K2936j4081J4690L252
10101A819179j676k2749q684m4385j0097Q8252J9078k3950r8846K6346K5451l386
10089A764533k0610m7784P236N9916J4545l051o5078p7674N8783M0360k2596n3489
$$ y = [2036505, 2043719, 2066221, 2090677, 2165946, 2245696, 2333246, 2351556, 2362455, 2348345, 2355284, 2334821, 2281098, 2295904, 2362520, 2427576, 2485307, 2554720, 2577723, 2598608, 2525550, 2540142, 2568270, 2525606, 2483109, 2399790, 2368740, 2398206, 2443029, 2482312, 2443391, 2372115, 2313685, 2343808, 2289164, 2267620, 2288599, 2215063, 2135328, 2219940, 2243833, 2263548, 2272984, 2238333, 2253322, 2290364, 2218905, 2155629, 2196083, 2142477, 2062562, 2055665, 2034318, 2038307, 1965398, 1916976, 1904223, 1882495, 1851939, 1850942, 1868260, 1854342, 1747369, 1743926, 1749167, 1792382, 1815318, 1801237, 1815927, 1819179, 1817503, 1794754, 1786070, 1741685, 1731588, 1819840, 1838918, 1814968, 1716122, 1742468, 1767919, 1764533, 1743923, 1696139, 1703375, 1763291, 1777836, 1774785, 1709707, 1632033, 1690816, 1731176, 1708580, 1655091]
10077A655091L619j0790j969K7834k29J2229R210N81k3634J3014l2667k5367m7772
10064A579150O862k2090m1373O3498K7322m0104K3108O0978K3691n7890q3077
10053A540075m2812L8367M3981j1694J7447J4098m3450l0409K3198N4026J5173
10042A618000K0175K8382o062n5269n6617m4276n6461j2690j4576K5391K1634
10031A467631o5747M8690P7434J4119m3918q6088K463M4973K3551k0673k4460
10020A437975j2341J797J3874J8667K1494M1636k053j0483K4188m4791o641j2040
10008A471282m9861n953k0068j4854M1939J6140k6595p969L286M0882q887o3246
9996A376096L1094K0948J1692k0838n4025m645o320j714O9764L5605k1220K3582
$$ y = [1655091, 1658710, 1647920, 1645951, 1673785, 1673556, 1685785, 1694995, 1695576, 1671942, 1684956, 1652289, 1626922, 1579150, 1586012, 1563922, 1522549, 1586047, 1613369, 1573265, 1596373, 1657351, 1681042, 1623152, 1540075, 1497263, 1535630, 1579611, 1567917, 1585364, 1599462, 1556012, 1525603, 1548801, 1602827, 1618000, 1638175, 1666557, 1660495, 1605226, 1548609, 1504333, 1447872, 1435182, 1420606, 1445997, 1467631, 1401884, 1450574, 1528008, 1542127, 1498209, 1412121, 1414584, 1459557, 1483108, 1462435, 1437975, 1425634, 1427431, 1441305, 1459972, 1481466, 1523102, 1521049, 1510566, 1534754, 1489963, 1483322, 1471282, 1421421, 1415468, 1395400, 1380546, 1422485, 1438625, 1412030, 1404061, 1407347, 1448229, 1439342, 1376096, 1407190, 1428138, 1439830, 1418992, 1364967, 1360322, 1354002, 1352288, 1422052, 1457657, 1436437, 1460019]
9984A460019l4797m308J401p6931k7304J5639L1714m1442L3622k4555q130k4009
9972A300919m7924L6382J7609m3722K0728K8154Q980K4331m547l8763K5655j0304
9960A317498N0114Q475m2200o490l0569M747K0346J7263n33l5707J417j0954j7330
9947A276077j4068j4080M9973M1212n196j08072k3371K8246l6059N676K365l092
9935A199611K0205K3682p283k5514J9739M6133K7418P3801K5059O600j2126J0900
9923A408225n1021K4640n1873j5334l5550p7642L1723M9914j3406O853J6992q048
9911A285473n0985j4883l4673k3394K4287J8941J631l8096m5515K7014M4523K1111
9899A215434K9229k4356l0850j9709N0473Q2410l7663n6281k3174M6855k7257
$$ y = [1460019, 1425222, 1420914, 1422315, 1345384, 1318080, 1333719, 1365433, 1323991, 1357613, 1333058, 1324928, 1300919, 1252995, 1289377, 1306986, 1263264, 1283992, 1312146, 1321126, 1345457, 1340910, 1302147, 1327802, 1317498, 1367612, 1376087, 1333887, 1327397, 1296828, 1301575, 1321921, 1339184, 1338651, 1302944, 1304361, 1293407, 1276077, 1262009, 1247929, 1297902, 1339114, 1333918, 1225846, 1202475, 1230721, 1194662, 1200338, 1202703, 1199611, 1219816, 1243498, 1236215, 1210701, 1230440, 1276573, 1303991, 1377792, 1402851, 1409451, 1397325, 1408225, 1357204, 1381844, 1329971, 1314637, 1279087, 1201445, 1233168, 1283082, 1269676, 1276529, 1293521, 1285473, 1234488, 1219605, 1184932, 1161538, 1185825, 1204766, 1206397, 1168301, 1122786, 1149800, 1194323, 1215434, 1244663, 1220307, 1189457, 1169748, 1220221, 1302631, 1264968, 1208687, 1185513, 1232368, 1205111]
9888A205111k5796j0346N817M1523J6523m9914J8334J6723L422l6231p1704l2867
9876A080595N1326P4388L263n8118l0525P23o5570Q152K7066K0146J5744l779
9864A123411R448Q719M0586k2034K09K2402m323k1492L2214o8251j3622K2641
9852A129908J291M1260J3148n3567M1418P4060k2192N3745K2017m5866l2685k0224
9840A202313j1844k156N0834J7394m4646p2983n3092l3257L6648j2207j4122N6538
9828A119420L0782l5379K0603l2794j3598P0011J1626k657Q928l5338p640M6679
9816A180643o852k0031o2496o243m6270P821M5924n8820L1666K3835N397j1824
9804A082750m8896L461l761n7896K0752M5735j867j9675j0497J2905J8K1227l014
$$ y = [1205111, 1179315, 1168969, 1174786, 1216309, 1232832, 1182918, 1201252, 1217975, 1221397, 1185166, 1113462, 1080595, 1131921, 1206309, 1209572, 1151454, 1120929, 1121652, 1056082, 1064234, 1091300, 1111446, 1127190, 1123411, 1132859, 1141578, 1182164, 1160130, 1160339, 1182741, 1178418, 1156926, 1189140, 1120889, 1107267, 1129908, 1131199, 1172459, 1185607, 1132040, 1173458, 1247518, 1225326, 1279071, 1301088, 1255222, 1222537, 1202313, 1190469, 1188313, 1239147, 1256541, 1211895, 1138912, 1085820, 1052563, 1089211, 1077004, 1062882, 1119420, 1150202, 1114823, 1135426, 1102632, 1089034, 1159045, 1170671, 1168014, 1176942, 1141604, 1133964, 1180643, 1173791, 1153760, 1091264, 1085021, 1038751, 1046572, 1092496, 1033676, 1065342, 1089177, 1094574, 1082750, 1033854, 1037315, 1033554, 975658, 996410, 1042145, 1040278, 1020603, 1010106, 1023011, 1023029, 1044256, 1041242]
9791A041242n923N0391L7135K8547j2775q9096r7361J6651P3857k3782k3346l0339
9779I65201n1225M1452j5951K194Q0443o19m4557N448R5318R388m6439K2201k4070
9766A038784l2024k5910K3188O7035L5832o281n7746n1622L2778K5514j354l8777
9754A009417j0988k0237l1161k157J8864j8298l8142J4086L0327j7262o1404r157
9742H63888m054J9005M8345L1027j9356J3447K6544p1987m3337j517Q9613L5555
9730I87173N4439M3981l3446q8208m8917j8510M3162L3944l8138m1241o2667M7863
9718H79435r236J0897K3429N5219N6069k8812o7761o9531k1112K2992J0122m884
9706H56827N0256J7486M1611N278m1324K6707j6503o1526j5292K5103L0722K0230
$$ y = [1041242, 1035319, 1085710, 1122845, 1151392, 1138617, 1049521, 952160, 968811, 1042668, 1018886, 995540, 965201, 913976, 955428, 939477, 941671, 1022114, 1021495, 976938, 982386, 1077704, 1087092, 1040653, 1062854, 1038784, 1006760, 980850, 1004038, 1071073, 1106905, 1100624, 1042878, 991256, 1024034, 1049548, 1048194, 1009417, 998429, 978192, 947031, 944874, 963738, 945440, 907298, 921384, 951711, 934449, 873045, 863888, 859834, 878839, 927184, 958211, 938855, 952302, 978846, 906859, 863522, 862005, 951618, 987173, 1041612, 1085593, 1052147, 963939, 915022, 896512, 939674, 973618, 935480, 894239, 831572, 879435, 870199, 881096, 904525, 959744, 1015813, 987001, 919240, 849709, 828597, 851589, 861711, 856827, 907083, 924569, 966180, 971458, 930134, 956841, 940338, 878812, 863520, 888623, 919345, 939575]
9694I39575k1756m3773l2199O547R652P3084O327o8304P97J9019j3191M4417J1872
9681I32067J2366Q758k1266o1939r253N7503j401k6524J1070k5674m2422l959
9669H29326L2771L9700J8939J606j7062J1594J2704j4369l0249k8792k4185k1413
9657H10570l0810N4542O2923N4520O4111J92502J23973q111n2996m6410p7732
9646A147082j05811n8541m6300L733K3893K5380L584o3561J031N2124N7367j0133
9634A029848j3936j16380o8688n166j2792L8450J9204n052K8994n7735n872K3373
9622H54248P0412K6418m3307Q660n1054p1545K5730n2324j5645L9508M9870J9473
9610H60444J0753n0134n8766n2180j6797N5082L1063J0314j2664M2636M012o336
$$ y = [939575, 917819, 874046, 841847, 848394, 858046, 931130, 937457, 869153, 869950, 888969, 875778, 920195, 932067, 944433, 953191, 931925, 869986, 860733, 918236, 916835, 890311, 901381, 875707, 833285, 829326, 862097, 901797, 920736, 922342, 905280, 916874, 929578, 915209, 884960, 856168, 831983, 810570, 779760, 834302, 897225, 951745, 1015856, 1208358, 1332331, 1324220, 1271224, 1224814, 1147082, 1041271, 982730, 936430, 940163, 964056, 989436, 993020, 929459, 930490, 982614, 1039981, 1029848, 1015912, 899532, 830844, 825678, 812886, 851336, 870540, 865488, 894482, 836747, 830875, 854248, 924660, 951078, 907771, 916431, 865377, 793832, 819562, 767238, 751593, 791101, 840971, 860444, 871197, 821063, 762297, 710117, 693320, 748402, 779465, 789779, 777115, 819751, 823763, 817427]
9598H17427J6053k0718O910j5710J9927M0319k3532n8573k1991O5947k1979j5320
9586G88760m3402n5037J17130R1444J9397l7927J3244j1465j8207o5544K0328
9575H18721k0306k8456l861K5582L8411q908Q389J1545k2843J2185J2393l8120
9563H04732k3773J9067K91k6479j4353j9910j4156K5759N945M2938K287j5426
9551G86922m3257K564j3666k2868O7078K5413k2340j6496M8755k5027n1270o21
9539G35187Q9013J3319r2491n4016l5488N5187Q718O200O1251P1955L0175J5359
9527I04369j5195Q117k3479k7502J226p7401j384J5793j5316j6798M382j8730
9515G38082J7438n3302l7736l6090Q5258O2732Q639m0303K9940M4714o8384j9818
$$ y = [817427, 833480, 812762, 819672, 803962, 823889, 864208, 840676, 782103, 760112, 826059, 804080, 788760, 745358, 690321, 807451, 898895, 918292, 880365, 893609, 882144, 863937, 798393, 818721, 798415, 769959, 766098, 791680, 830091, 821183, 829572, 841117, 818274, 830459, 842852, 804732, 780959, 800026, 800317, 773838, 759485, 739575, 725419, 751178, 757123, 800061, 802348, 786922, 743665, 746229, 732563, 709695, 776773, 802186, 779846, 763350, 812105, 787078, 735808, 735187, 824200, 837519, 745028, 691012, 655524, 710711, 719429, 725629, 786880, 858835, 889010, 904369, 889174, 897291, 873812, 846310, 847536, 770135, 768751, 784544, 769228, 752430, 756812, 738082, 755520, 702218, 664482, 628392, 713650, 776382, 785021, 744718, 774658, 819372, 750988, 731170]
9503G31170k2814M0341M495k4264p0126r32M7404J4060k8095l0012M9456L5147
9491G45830K7860k3019m8005L5781R6139r208j1840p5712j1205M0786J8063l3640
9479G51830Q794k1697n6811Q637M6240M96K914J573m1685R106K3526k0442j00708
9466F11773J9732R0541P9664M5529j3628j8081k2420L113m9257l2585m1369k7658
9454F45354P6044n9357l722O9480K6835l1223K2243J208l6213n168L8615N5179
9442G99275r031o3589J3189L033k1615N953J1118J1128l8040M564K4334L9303
9430G79622k2635k6307m3057j8470M8923M3952r209m0266J8191n1597p3338K058
9418F07867O5955K7122n0881O726J8955n5912k2184M8413M4913q97R267K740K5816
$$ y = [731170, 708356, 748697, 753192, 728928, 658802, 657870, 705274, 719334, 691239, 661227, 710683, 745830, 773690, 750671, 702666, 738447, 834586, 825378, 813538, 737826, 726621, 767407, 785470, 751830, 760624, 738927, 682116, 690753, 736993, 737489, 740403, 741976, 700291, 709397, 732923, 712481, 611773, 631505, 722046, 801710, 847239, 833611, 815530, 793110, 796223, 746966, 714381, 673012, 645354, 721398, 662041, 658319, 727799, 754634, 723411, 745654, 746862, 710649, 705481, 744096, 799275, 790244, 726655, 739844, 742877, 721262, 727215, 738333, 749461, 711421, 715985, 740319, 779622, 756987, 730680, 687623, 669153, 718076, 762028, 752819, 712553, 730744, 679147, 605809, 607867, 673822, 700944, 650063, 656789, 675744, 619832, 597648, 646061, 690974, 690077, 699344, 702084, 727900]
9405G27900O8998J4797M3757q0545n3478n0000k266L2668J9691M4000j8134m9168
9393F98220p8725j1232M7858N5139K103K865L1285n8492m8521L708P712k9260
9381F22660l9007K4317N0926k675O0271j4830Q755m2654m1874J8234K2873L6831
9369G03827k482J4972k5491k018j496N176o9871j1363L7483O432l3373q191K2896
9356F36501Q83K1188k52l3714K3868l8817j254L162l1151j5283M9276K3314p5801
9343E61920K9105N282M1060K7760P110k197j4243k5942J187K3902p622M3263N6956
9330G47541l2906K154m1871K6091j0962O401o4951n29J0662k7329k5925j4199
9318E74177j4968M1561O560l8428L1161J9488k1496m9567m3129P784R6186M5693
$$ y = [727900, 796898, 811695, 855452, 774907, 721429, 671429, 669163, 701831, 721522, 765522, 747388, 698220, 619495, 608263, 656121, 711260, 713363, 716228, 747513, 689021, 640500, 644208, 651920, 622660, 583653, 607970, 658896, 656221, 716492, 701662, 710417, 667763, 625889, 644123, 666996, 703827, 701345, 716317, 690826, 688808, 687312, 692488, 622617, 611254, 648737, 655169, 621796, 613605, 636501, 637384, 658572, 658320, 624606, 648474, 609657, 608403, 611565, 580414, 565131, 614407, 637721, 561920, 591025, 596307, 637367, 665127, 672237, 670040, 655797, 629855, 631042, 654944, 647322, 690585, 747541, 714635, 716789, 674918, 701009, 690047, 696448, 631497, 630968, 641630, 614301, 588376, 574177, 559209, 600770, 607330, 568902, 600063, 619551, 598055, 548488, 505359, 513143, 609329, 655022]
9306F55022K2336J1942k8498j1481N154n8758l2491k7393M2981N156l4490J1214
9294E60694L4505k0631k4827Q706J5875N891L0604R567L3045L7645l3857o2936
9282E94281k5714J4270K12L810J6706N397n997k9518L796O9376j3758k9608l5853
9269E67400L7610l855L2520N6012l7631k8285K6639n733n5100o67r013l2934Q98
9256E47861N6698m812l2444R284L2646K3488J5802l9503o1367m1007j0370K3215
9244E19491P7492n925J2057J7492J4357j1602J5791l9187n5695N6403j0488l9937
9232E50249k3218P9987J9116l899J1592l5010m3961J9785K2764J7161K877q113
9220F09330K4038O101n2013j4379j93j1994r988j8503l8691n21P3916J5211p017
$$ y = [655022, 677358, 689300, 660802, 649321, 654475, 595717, 563226, 535833, 578814, 583970, 549480, 560694, 595199, 574568, 549741, 558447, 574322, 580213, 610817, 620384, 653429, 691074, 657217, 594281, 568567, 582837, 583049, 586859, 603565, 608962, 602965, 573447, 577243, 646619, 632861, 603253, 567400, 605010, 601155, 633675, 689687, 652056, 623771, 650410, 644677, 589577, 588910, 579897, 546963, 547861, 604559, 599747, 567303, 576587, 609233, 632721, 648523, 609020, 547653, 506646, 496276, 519491, 596983, 591058, 603115, 620607, 634964, 623362, 639153, 599966, 544271, 600674, 590186, 550249, 527031, 607018, 626134, 622235, 633827, 598817, 554856, 574641, 597405, 614566, 617443, 609330, 633368, 639469, 587456, 573077, 572884, 560890, 550902, 532399, 493708, 493187, 567103, 582314, 575297]
9207E75297k7084m6628j5118K9263N6128J7061l9862k364L2997J5925J7349m5642
9195E67322l1950l7471J2024J8250J09440N2284k5683m3604j6784m9406j08748
9184D45674m790J33611L8316k567O070m1501R7R722k579l9924J0395n851p2868
9171D73805n4377M1127J7770l5993K0481N0964M5557K0183j8629n0818q781K7233
9159E28522Q763J9058J03420N693n2251m5278j3890k1572n926K1960K0053m892
9147E63660M222J7094L93m2059k8624O8480p630m5979J102j0925j3027J7012K5862
9134E49581j0812n2581P871J5387j7375K6210J6389J1721j2220k1609M2047k3106
9122E31503m2315j1880M8457J302L485M2336K1003j8073o8687m976j3667m687
$$ y = [575297, 548213, 501585, 486467, 515730, 571858, 588919, 549057, 546693, 579690, 595615, 612964, 567322, 535372, 497901, 509925, 528175, 637615, 689899, 664216, 620612, 603828, 554422, 445674, 440884, 574495, 612811, 610244, 616314, 574813, 574910, 584632, 582053, 542129, 552524, 546673, 473805, 419428, 460555, 478325, 442332, 462813, 513777, 559334, 579517, 560888, 510070, 501289, 528522, 537285, 556343, 659763, 665456, 613205, 567927, 554037, 532465, 526539, 548499, 568552, 563660, 567882, 584976, 585369, 543310, 514686, 583166, 575536, 529557, 530659, 519734, 506707, 523719, 549581, 538769, 486188, 494059, 509446, 492071, 518281, 534670, 546391, 534171, 512562, 554609, 531503, 489188, 477308, 525765, 527067, 530552, 572888, 593891, 575818, 507131, 502155, 488488, 483801]
9110D83801M3899k3975j6351m694L0490k3015N77J3339l0230L3109M5698q392
9098E44256n0323n9016k8748O4907J936m0794K8153K083K6746J2932n8531p01
9086D42900Q527K2310l5842m7786O6658L5206m4384M0036K421q5560p941P2959
9074D69504M641j3662M1392M6688k3060l093m6587n1256k9913k2092P2600M6577
9062D91739k0549P359J3988L02l9289o8787O2589K7543P036j473l4283l8464K1748
9049D29459j3516M7871M5133k6174k131j6242J5355m6341k9182K0906j2920j9996
9037C92222K4793J7056n062L8573j995r964n590l9508j0245K0577o418K2225k1374
9024D15290K0139K5953J6603M1140K598k6317p6031n4586P2427L2994l1265l5516
$$ y = [483801, 527700, 503725, 487374, 482680, 513170, 490155, 490732, 504071, 473841, 506950, 552648, 544256, 493933, 434917, 406169, 471076, 473012, 432218, 460371, 462454, 489200, 502132, 443601, 442900, 451427, 473737, 437895, 390109, 456767, 491973, 447589, 487625, 490046, 404486, 396545, 469504, 474145, 460483, 501875, 548563, 525503, 522410, 475823, 424567, 394654, 372562, 445162, 491739, 471190, 478549, 492537, 492839, 453550, 384763, 447352, 474895, 481931, 480458, 446175, 407711, 429459, 415943, 463814, 508947, 482773, 480642, 464400, 479755, 433414, 404232, 425138, 412218, 392222, 417015, 434071, 429009, 467582, 465587, 455623, 450033, 410525, 400280, 420857, 414439, 436664, 415290, 435429, 461382, 477985, 519125, 521723, 495406, 419375, 364789, 437216, 470210, 438945, 403429]
9012D03429O82l9548N58O7127J7619n1889l2136N3564K960j2594k980J856K6210
8999D34858R305M0778K3851L7035J296o0813n4065J7205m4191l9282K3205J3732
8987D02914M3405J2648j9561J3804k1952K8199j1606l867J1961M2649o3702l5303
8975C99589N0369K616j5957J0621K0776J22938K681j05358o2353K5015o110J0362
8963D55189P744l0271k2366k5299J08442O5383l4922j0947r079l5933K0776J4211
8951E02928K8343K4476k4874o5257n3159N294L3226l7623j2636N0790L0865J9924
8939E02297k6663Q949o7549k2046K4534J7748k8134P238O4290L2804K0921k3348
8927E11041n2948m5681K4790J781j2769k5046J8595K8071m2348o6240m611L5668
$$ y = [403429, 404111, 364563, 365121, 432248, 449867, 397978, 365842, 419406, 422366, 409772, 406792, 408648, 434858, 444163, 484941, 508792, 545827, 547123, 486310, 432245, 449450, 405259, 365977, 389182, 402914, 446319, 458967, 439406, 453210, 431258, 459457, 447851, 443984, 455945, 498594, 434892, 399589, 449958, 452574, 436617, 447238, 468014, 590952, 593633, 488275, 425922, 450937, 444827, 455189, 462933, 432662, 410296, 384997, 493439, 558822, 523900, 512953, 503874, 467941, 488717, 502928, 531271, 555747, 530873, 465616, 412457, 417751, 450977, 413354, 400718, 451508, 482373, 502297, 475634, 484583, 417034, 394988, 419522, 437270, 409136, 416374, 480664, 513468, 534389, 511041, 458093, 412412, 437202, 438983, 426214, 401168, 419763, 447834, 405486, 339246, 334635, 370303]
8915C70303K7409j1116J0740l114m6O1767M5463j2554l2508k495J5516m4559J2194
8902D37000L8444K9282q8368J50K3120K4065j108j8692K9401M3350p6889k3758
8890D15997j6280j5023m498P052O6058j2347l6200k1953j0971J4433J5820J167
8878D03255k9625m7289J855L8182J1062l259J0116q752j1717P651L0131L6933
8866D38543l7415l8329p448P1496K2355J2691k6712l3525q323J2300k4017n636
8854C75980j0919M7673n577o243j1142l9504j4485m9616P1778P9542m6982K6102
8842D16607k8931m4832J5524M0806L279j1622p666M5560n920j524n4144j5921
8830C51216K0091K6177K1367L478j3157l0704k6376K6963P4011m5014m816m100
$$ y = [370303, 397712, 386596, 397336, 394222, 394176, 455943, 501406, 488852, 456344, 453849, 469365, 424806, 437000, 475444, 504726, 416358, 416508, 439628, 463693, 462585, 443893, 473294, 516644, 439755, 415997, 399717, 384694, 380196, 387248, 453306, 440959, 404759, 382806, 371835, 386268, 402088, 403255, 373630, 326341, 328196, 366378, 377440, 374181, 384297, 375545, 363828, 371479, 401610, 438543, 401128, 362799, 355351, 426847, 449202, 461893, 435181, 401656, 393333, 405633, 381616, 375980, 365061, 412734, 407157, 400914, 389772, 350268, 335783, 286167, 357945, 437487, 390505, 416607, 387676, 342844, 358368, 399174, 402453, 390831, 383165, 428725, 422805, 421281, 367137, 351216, 371307, 397484, 418851, 422329, 409172, 378468, 352092, 379055, 453066, 408052, 403236, 399136]
8818C99136j5321k7802k3R1451K9562j5589j144k3413l3718k9777L6838N486k1916
8805C93770K7348j0826P36K4739m0866J0805K3872K1269k1111q078j4186l0688
8793C76784k7596N600J5141j7834J2711m0950Q219M072n1075O527M096J3962j5906
8780B93751L36J1417k5955R330J9518O5891K4836r510R512p475k945m515k1748
8767C62443j13250J7438M1647j2659L1636K8886K8177m3032J5842L3230R982k6632
8755C73708p3259R657M7160L8945L0455j5135K2413N100k2763j00468k5239Q945
8743B99519M6032n936M4246P272o8689J1065J4053J7885J9067k5785K4335j1104
8731C71960k1749j4826J2731j0748J1700o238L1953l1758j5784j244K6926j3086
$$ y = [399136, 383815, 356013, 355990, 447441, 477003, 461414, 460270, 436857, 403139, 373362, 410200, 415686, 393770, 421118, 410292, 411028, 435767, 394901, 405706, 429578, 450847, 429736, 421658, 407472, 376784, 349188, 354788, 369929, 352095, 364806, 323856, 332075, 336147, 285072, 291599, 295695, 309657, 293751, 294087, 305504, 279549, 288879, 308397, 374288, 399124, 389614, 399126, 391651, 388706, 384191, 362443, 249193, 266631, 308278, 295619, 327255, 356141, 384318, 341286, 357128, 390358, 400340, 373708, 300449, 310106, 357266, 396211, 426666, 411531, 433944, 439044, 416281, 315813, 290574, 299519, 345551, 339615, 383861, 391133, 322444, 333509, 347562, 365447, 384514, 358729, 383064, 371960, 350211, 335385, 348116, 337368, 349068, 342830, 374783, 343025, 327241, 325997, 352923, 339837]
8719C39837N3656J1188j6236r3862l1181m676q258K8740j1284M1122M1334N5714
8707D06094j4426m562K5451q285j4031p3925q2548o505N1712J09326K7828j8257
8695C97872l7554j6583L2296J1200j1395j2186l7022j5256p671k8154n8285J8274
8683B35536K0991Q596L2526K8366K9343j5916n2189j6155M1423P2736O9362m3102
8671D11517N038k4604o1026q0099R023P812L2725K6442K932j7336J8055k833p396
8658C20250N2965m8932K115J3419J5574k4684m135n039J9538P5800L3886n7118
8646C93639l0734l1865P683N1869L662K0470K8216l9744J464j0785k7260k4594
8634C42021M6611K9798J2292m0128m2415j2349J3512k2003m4726J7748O0396Q920
$$ y = [339837, 393493, 404681, 388445, 294583, 263402, 258726, 250468, 279208, 267924, 309046, 350380, 406094, 391668, 387106, 412557, 404272, 390241, 316316, 233768, 227263, 278975, 388301, 416129, 397872, 360318, 343735, 376031, 387231, 375836, 363650, 326628, 311372, 303701, 275547, 217262, 235536, 256527, 265123, 297649, 326015, 355358, 339442, 287253, 271098, 312521, 385257, 454619, 411517, 416555, 391951, 330925, 250826, 259849, 267661, 300386, 326828, 329760, 312424, 330479, 327646, 320250, 373215, 324283, 326398, 339817, 355391, 330707, 326572, 321533, 341071, 416871, 450757, 393639, 362905, 331040, 338723, 390592, 394254, 414724, 442940, 403196, 404660, 393875, 366615, 342021, 388632, 418430, 430722, 390594, 348179, 335830, 349342, 327339, 282613, 300361, 360757, 369677]
8622C69677q1280k8479N1231Q3528R2865K5141r0918k9056l5258m8314l7077j053
8610B71007J9133j5055K7428J0674Q0728M2294M934J4093k6376m5685K7019O0693
8598D70887j3637n1974m2968K6868p4221o1431L8854M4403N8574L2914K1157m0094
8586D09332J1974M335K9507j1680q476j0911k3256L4440p098l0096K2863l9681
8574C81253l7158M3254P3459k4278o0819L596k6106O7877J9733L0719O940l9370
8562D39100k9571J8845Q494m7493l9764K0690o001N4314K711P2O6765J1923o723
8549D93362j4947m4730K1000n3996l0863j6874m5648l061K9342O63M8106k0375
8537C61979r970J1027l9573L8486R2643M036n4854n4047O5501J4664J2604m9772
$$ y = [369677, 288397, 259918, 311149, 394677, 487542, 512683, 421765, 392709, 357451, 309137, 272060, 271007, 290140, 275085, 302513, 313187, 393915, 436209, 441143, 455236, 428860, 383175, 410194, 470887, 457250, 405276, 362308, 389176, 314955, 253524, 292378, 336781, 395355, 428269, 449426, 409332, 421306, 425641, 455148, 443468, 434992, 424081, 400825, 435265, 428167, 398071, 420934, 381253, 344095, 387349, 460808, 436530, 375711, 379307, 353201, 421078, 440811, 471530, 478470, 439100, 409529, 428374, 436868, 389375, 349611, 370301, 364300, 418614, 421325, 421397, 488162, 500085, 493362, 478415, 433685, 454685, 400689, 369826, 352952, 307304, 304243, 333585, 334248, 382354, 361979, 352009, 363036, 323463, 361949, 454592, 458628, 403774, 349727, 415228, 429892, 442496, 392724]
8525C92724m1091l074L3528j3288k4568k5544N7589M845j6444k8480l4848j0329
8513B91020J7124m6212J4397K4108K7530L0154O441j0638J4135j7696L957M0505
8501C94825K9432m282k1899l9803Q714L073J3906K8058m0280k3492k6223K2764
8489C44793J1692j1800k190L9425k2554r1824J3785K7761M4933p794l8899J6562
8477C23890n627r4957N0459P1745J9879r681k2048l4267p732M4136j1045j7093
8465C07659N8542J8002p3791o5340K1269K9071r598l7156N002M2320j195Q702
8453C03487K0382M3249K7115R545Q171n7373J6578J9077o0298l1678k8599q2560
8441A87096J7171J8405K9636L0240O74J7052N4875L7068k9312n6167q927q370
$$ y = [392724, 351633, 348559, 382087, 368799, 344231, 318687, 376276, 381121, 364677, 336197, 301349, 291020, 308144, 261932, 276329, 300437, 327967, 358121, 364562, 353924, 368059, 350363, 354320, 394825, 424257, 419975, 398076, 358273, 366987, 370060, 383966, 412024, 371744, 348252, 322029, 344793, 356485, 344685, 342495, 381920, 359366, 267542, 281327, 309088, 354021, 346227, 307328, 323890, 318263, 223306, 273765, 345510, 365389, 355708, 333660, 299393, 291661, 335797, 324752, 307659, 366201, 384203, 310412, 245072, 266341, 295412, 285814, 248658, 253660, 295980, 294785, 303487, 323869, 367118, 394233, 403778, 411949, 354576, 371154, 390231, 329933, 298255, 269656, 187096, 204267, 222672, 252308, 282548, 283222, 300274, 355149, 392217, 362905, 306738, 297811, 289441]
8429B89441P2738N5487L3014M72J9341p0375o4557r690J4046l8762k7326k9528
8417B44301j8779p720J6947L379O1317L6269n88k3407l131j6386L0266O7701l5658
8404C54511n5601n2828J8389M015o192J5832O208J9629l125j1081K3317r377J1649
8391C15346m4484N0150l4430l7691O0303L252q060k1345M7630M5648j7681m6082
8379C12556k495K1069L7613O664J2127J443k9972l4269K3002O9902n219q5602
8367C26819k3616r117j3690R170r371j7116J4694l105j5267J0246k1885N9725
8355C07487M0743L171k2085m0838l251j3071L7467K0769n1305j5639O979q755
8343B61672k4505M2211K4803l4515k1993R780o113K5022k497k2352J9472k0123
$$ y = [289441, 362179, 417666, 450680, 451152, 470493, 400118, 335561, 325871, 339917, 301155, 273829, 244301, 225522, 217802, 234749, 238128, 299445, 335714, 335126, 311719, 308588, 292202, 322468, 390169, 354511, 298910, 246082, 264471, 268486, 262294, 278126, 284334, 303963, 300838, 289757, 313074, 303697, 315346, 270862, 321012, 286582, 248891, 309194, 312446, 304386, 283041, 330671, 376319, 358638, 312556, 310061, 331130, 368743, 375407, 387534, 388977, 359005, 324736, 347738, 417640, 412421, 326819, 303203, 294086, 280396, 289566, 280195, 263079, 277773, 274668, 259401, 269647, 247762, 307487, 348230, 351401, 329316, 288478, 285227, 272156, 309623, 330392, 279087, 263448, 270427, 261672, 237167, 279378, 304181, 269666, 247673, 257453, 251340, 276362, 273865, 251513, 270985, 250862]
8331B50862j1410M8486J560j5801J3425M929p0668K4108P4905J425j2518J6778
8319C26081K4670K2692m4360j28673l5847J0648l4942L2657L4422M8985M0180
8308B96513j1850q800j4229o0713K3909K194l4933L0072j5485J3007k305K1286
8296B38666J6052Q3971Q5117K2474m8229m6835l2400p4336N5028K0598o4036j1418
8284B44652K6163L4358P467k8018n521k4065k0176o3908n8085M9336L0001L7222
8272B29426O091m7354m9227L1934O4505j4279l8252O6758M8605J2050l7272m1801
8260B31184l4191q3808P896N5514O4811J4582J5871m9537n6747O2181L0178k728
8248B55206K6155K1214K2759k0038l162L2217k6443o0371l2219J3278M896K2960
$$ y = [250862, 239452, 287938, 289498, 273697, 287122, 292051, 221383, 245491, 320396, 321821, 309303, 326081, 350751, 373443, 329083, 200410, 164563, 175211, 140269, 172926, 207348, 256333, 296513, 284663, 275863, 261634, 200921, 224830, 227024, 192091, 222163, 206678, 219685, 217380, 238666, 254718, 338689, 423806, 446280, 398051, 351216, 318816, 244480, 299508, 320106, 256070, 244652, 270815, 305173, 312640, 284622, 279101, 255036, 234860, 170952, 112867, 162203, 192204, 229426, 235517, 188163, 138936, 170870, 235375, 221096, 182844, 249602, 298207, 310257, 272985, 231184, 196993, 113185, 121081, 176595, 241406, 255988, 271859, 222322, 165575, 227756, 257934, 255206, 281361, 302575, 325334, 305296, 302134, 334351, 307908, 247537, 215318, 228596, 233492, 256452]
8236B56452M0084K8633L3656R446m2459k8004J415j8297L243K5199K9106m7856
8224B90618n6389K6412M6622K0740l6831k7085j2130J8982L1352L7151J964r4079
8212B47327m3534L6494K7640J9080k628J1374J3921l1364L1135M6265m0817o8051
8200B46842l4618J8394K5182j0336j12K5337P297l6545K5018L5596l0437J9761
8188B91379O830m3725L1218M5142K9244M3248n717n8474n9495O859N1499J1804
8176C49812p8805o4459l5376o953L43k7616j3482M5103M6116j6536k0765m132
8164A73250K1731N2861j366k9228O658J9761P3P2478P897m9988k0851l9860L1689
8151B45105J7763M9511O762m5207o134j3944r000n4159k1830K8585M0363Q927
$$ y = [256452, 296536, 325169, 358825, 368271, 325812, 297808, 299223, 280926, 284169, 309368, 338474, 290618, 234229, 260641, 307263, 328003, 291172, 264087, 251957, 270939, 302291, 339442, 341406, 247327, 203793, 240287, 267927, 287007, 284379, 295753, 309674, 278310, 309445, 355710, 314893, 246842, 212224, 230618, 255800, 245464, 245352, 270689, 277986, 241441, 266459, 302055, 271618, 291379, 298209, 254484, 285702, 330844, 360088, 403336, 397619, 339145, 279650, 286509, 338008, 349812, 271007, 206548, 171172, 164219, 164562, 136946, 123464, 168567, 214683, 198147, 177382, 173250, 194981, 247842, 246476, 217248, 223906, 243667, 243740, 316218, 324115, 274127, 253276, 213416, 245105, 262868, 312379, 319141, 273934, 267800, 253856, 244856, 190697, 168867, 197452, 237815, 246742]
8139B46742n2137J747j8218j7570k8122K5298P0277N0983r53K3454j8463p153
8127B75885l1363p0254P871K4474J9340k4274K1589m0760l0453p263L8802L3941
8115B17535J8306k8488j5430K0965m849L808j574N9654O2469j8184k8752q0018
8103B05442l3042j4304J0734J887M2045O6777k1346m7507k3743N604r596P236
8091A90187r990J8129K3842j8685j6812J3753N1302q846K6154J257K4437o4130
8079B30598k4596K7999j8514k3879j6858O424j5783j3589m4577J7926P6088K6637
8067B27876L7679J8275q523l6514L481n9476n3387L6395J00364K2093l8000K387
8055B52650k9313O91m5476M3991N7196j8207j4186l4595l3916L589J6222L1962
$$ y = [246742, 194605, 196352, 178134, 160564, 132442, 157740, 228017, 279000, 278047, 301501, 283038, 275885, 244522, 174268, 182139, 206613, 225953, 201679, 223268, 182508, 152055, 144792, 183594, 217535, 235841, 207353, 191923, 212888, 208039, 211847, 210273, 269927, 332396, 314212, 285460, 205442, 172400, 158096, 168830, 170717, 212762, 279539, 258193, 210686, 186943, 192547, 182951, 190187, 180197, 198326, 222168, 203483, 186671, 200424, 251726, 242880, 269034, 270291, 294728, 230598, 206002, 234001, 215487, 191608, 174750, 181174, 165391, 151802, 107225, 125151, 201239, 227876, 265555, 283830, 275307, 238793, 242274, 182798, 129411, 165806, 266170, 288263, 250263, 252650, 223337, 224028, 178552, 222543, 279739, 261532, 247346, 212751, 178835, 182424, 198646, 230608]
8043B30608N18k5635l8872M5610L4335o3465L6939j1688l4095K1672m8463Q849
8031A56313O4787j288Q807K7894r641M882m0713P463o040j525J279K0768M1781
8018B74767P647l0442k3462J013m3773P085M624o647l3805J6534O5415k591k9003
8005B07362m57M8757J0388l1884j3623R41L828L8648n086K5897n5424l1P2071
7992C01387K4834k7255n207l9624p2310k4592R982R088J9362K9114J5380K5957
7980B66116N0877M8917n9645l0234P486J5095l6452K7973K4747N0364l3209j9643
7968C12392K031l769P473M147k8715n5129k5389J0447K0576k0289n594j6051N086
7955B07216L306K9005J2840K6189J6960k6993q1906m5306q961j0717J0996O3986
$$ y = [230608, 231126, 205491, 166619, 212229, 246564, 183099, 220038, 208350, 174255, 195927, 147464, 156313, 221100, 219812, 228619, 256513, 246872, 251754, 211041, 218504, 212464, 210939, 212218, 232986, 274767, 282414, 251972, 228510, 229523, 185750, 192835, 197459, 190812, 157007, 173541, 238956, 236365, 207362, 206905, 255662, 266050, 234166, 220543, 221484, 225312, 263960, 258874, 284771, 229347, 229316, 301387, 326221, 298966, 293759, 254135, 181825, 157233, 167215, 176303, 195665, 224779, 240159, 266116, 316993, 365910, 306265, 276031, 283517, 298612, 262160, 290133, 314880, 365244, 332035, 312392, 314423, 310654, 318127, 322274, 293559, 238430, 213041, 223488, 244064, 223775, 218181, 202130, 207216, 210522, 239527, 252367, 278556, 295516, 268523, 186617, 141311, 132350, 121633, 132629, 196615]
7943A96615Q1874l8127q076o10q212r224L3955k1131J532n418j9354j9062N019
7930A89781L8981K4765M672k0799J5705L1624K9056m7840p187L3075j3422l3121
7918B45290K079R741M5410K2395j7106q372k7737l4714K4694M3550J8457l6220
7906B87467k3209K368k6337k6133j10799L0893J31675L2428j8492p5712J89J2216
7894B16554k941k5176m4023l0373L426N6721r283K6147J1313j5130n4091j117
7882A32027k990O3607L6132Q6749j9064p8459j6338j101J8942L9104k5512K505
7870B35602k4443J4636J0546j1761P525L935L5006m1260p0986j9562n493j2237
7858A21508j8117j0662J1772l0962j13K76O0424K6719K5828N0178P14J7870M441
$$ y = [196615, 278489, 240362, 232286, 231676, 223464, 214240, 248195, 227064, 228596, 223178, 203824, 184762, 189781, 228762, 253527, 258199, 237400, 253105, 284729, 313785, 265945, 258758, 291833, 278411, 245290, 247369, 257110, 302520, 324915, 307809, 299437, 271700, 236986, 261680, 305230, 323687, 287467, 264258, 266626, 240289, 214156, 103357, 134250, 265925, 298353, 279861, 204149, 204338, 216554, 213613, 188437, 144414, 114041, 117467, 174188, 164905, 191052, 202365, 187235, 133144, 132027, 129037, 192644, 228776, 315525, 296461, 218002, 201664, 200563, 219505, 258609, 233097, 235602, 211159, 225795, 236341, 224580, 232105, 236040, 271046, 229786, 158800, 139238, 133745, 121508, 103391, 92729, 104501, 73539, 73426, 73702, 134126, 160845, 186673, 236851, 237565, 255435, 259876]
7845B59876k3184m4286k8571r700Q03K1811l3304O488J6908n1970L6816R2229
7833B43916j4180L2708L9216k159o3293o8858l0824k2218l4471Q956Q9788P0545
7821B49126j3874o1999j0033l1062L4504J1514L438l2413K2391j5937K0374M9299
7809B25328K7410M6923j9489j8280j6293n5192m3746k0579N0510j2316l200M4514
7797B05590l2154M1057k0878o5788M242M7490K5005j6204J866Q11j9079n189R293
7784A76062k4063l0180L9775J0955O0101J7925l8562k8457M1343j9064K0205j1441
7772B14599m2303L7426O188K3372K2462m4762o1966J3437m519K2690l7570N519
7760A54573K7299n558J9173j239k3476K7263L1923J0356l9196j661m8240o8634
$$ y = [259876, 236692, 192406, 163835, 154135, 154938, 176749, 143445, 149933, 166841, 114871, 151687, 243916, 229736, 262444, 301660, 299501, 236208, 167350, 136526, 114308, 79837, 88793, 178581, 249126, 235252, 173253, 163220, 132158, 166662, 178176, 181614, 149201, 171592, 155655, 176029, 225328, 252738, 299661, 280172, 261892, 245599, 190407, 146661, 126082, 176592, 164276, 161076, 205590, 173436, 214493, 193615, 127827, 132069, 179559, 204564, 188360, 190226, 191037, 171958, 166769, 176062, 151999, 121819, 161594, 172549, 232650, 250575, 212013, 183556, 224899, 205835, 226040, 214599, 172296, 209722, 215910, 239282, 261744, 216982, 155016, 168453, 163934, 186624, 149054, 154573, 181872, 176314, 195487, 194248, 170772, 198035, 229958, 240314, 201118, 199457, 151217, 82583]
7748H2583j4209M4029r779k1959N1473L046K2890J7207K5185N427j7387n9595
7736A28911l6917J00809L9768R064m9681l4333L3458R4127J2359j5879j9048k9999
7724B32639m7444K006j5842j5759l302M5537M1232m3482n8839m5358K8855L0043
7712A50286L9738O96o0588R897L3288J3912m0228p2144j7557R6491Q593l8059
7700A24325j5771j0603N9036N3666K2886P84J0203n5442k813p724R716R200p48
7687A96715L4017M2437j393k6831n0546m5575n0281j906k4370J6690L4366L3844
7675A57167J4289m2202J8595m5212P846L6214J3350j175O453j4028l762k0254
7663A27281Q488K8709M6123l058k3890l686J3233k8946j7655l2827Q3329O3317
$$ y = [82583, 68374, 112403, 102624, 80665, 132138, 135184, 158074, 175281, 200466, 205893, 188506, 128911, 91994, 192803, 232571, 241635, 191954, 157621, 191079, 285206, 297565, 281686, 262638, 232639, 185195, 187201, 171359, 155600, 152298, 197835, 239067, 195585, 136746, 91388, 120243, 150286, 190024, 190720, 130132, 140029, 173317, 187229, 147001, 74857, 57300, 153791, 162384, 124325, 108554, 97951, 156987, 210653, 233539, 234323, 244526, 189084, 186271, 178547, 188263, 197463, 196715, 230732, 273169, 271776, 244945, 194399, 148824, 98543, 96637, 72267, 88957, 123323, 157167, 171456, 129254, 147849, 102637, 110483, 146697, 160047, 158872, 165325, 151297, 147535, 127281, 135769, 164478, 210601, 207543, 183653, 179967, 193200, 164254, 146599, 113772, 197101, 260418]
7651B60418n9540m3180J7877O169l8839K671L3613n0614l3485k5883L0616N3604
7639A53427k0538j3629n579j1921N0663M1367O3019k1350m3818j6443j3550l1328
7627A30320J9297k9920l2016N1157O1086J398l1519k7604J7150K0803K3821Q46
7615B04819j4490j5437M1933l8247m1756J1856M4101O5600l9824j6652L688p765
7603A97826q10j3696q165L1254K6515N2516m8110m1867n3218L9221l2224P807
7591A57049l712M8269o338o1477m9856o1962K0424L0601k9971J6097N854N0332
7579A15310j6147m3598O7690P4880M7739j8305m9299k6318L127K7347l3416j5616
7567A33394N9948L6080l0397M5709j8165J742m9498p965r83L9770l976j6747O052
$$ y = [260418, 200878, 157698, 175575, 181744, 142905, 145576, 179189, 128575, 95090, 69207, 99823, 153427, 132889, 119260, 113681, 101760, 152423, 193790, 256809, 235459, 191641, 175198, 161648, 130320, 149617, 119697, 87681, 138838, 199924, 201322, 169803, 142199, 159349, 180152, 203973, 204819, 190329, 174892, 216825, 178578, 136822, 148678, 192779, 258379, 218555, 201903, 205591, 197826, 197016, 183320, 175155, 206409, 232924, 285440, 237330, 195463, 142245, 181466, 149242, 157049, 153337, 201606, 195268, 133791, 83935, 21973, 42397, 72998, 43027, 59124, 64978, 115310, 99163, 55565, 123255, 198135, 245874, 227569, 178270, 151952, 155079, 182426, 149010, 133394, 193342, 229422, 199025, 244734, 226569, 228311, 178813, 170848, 169865, 209635, 205659, 188912, 194964]
7554A94964K6505o1542m645M500l1974m2140n2284J245M0418L5725m795J6816
7542A22793J0655n809L1059j8636m6747p475K1428j438L3927K6580O2451Q1333
7530C10121j601n9199m4610k5791j2115N753p730Q19L6714k535J1825L6183M5552
7517B93386k5468j9439k0827k6834J8956M005j484q203l166l8580l4628l4511
7505A03207O6282N8801n9961o3190J5678m210r025N2115l352m1662K3753J2392
7493A50828k1403n7629p178k4375j2138L4965K5757L6198J190k2723l8123l8660
7481B6709N5067J7625M3090k8869l6892n016K5321j8523Q7212j1590k3823k0771
$$ y = [194964, 221469, 159927, 155282, 159782, 127808, 85668, 33384, 34629, 75047, 110772, 105977, 122793, 133448, 127639, 158698, 140062, 93315, 85840, 107268, 105830, 139757, 166337, 228788, 310121, 308520, 249321, 204711, 178920, 166805, 172558, 164828, 165647, 202361, 199826, 211651, 247834, 293386, 267918, 248479, 227652, 200818, 219774, 223779, 222295, 214092, 210926, 172346, 137718, 103207, 169489, 228290, 168329, 105139, 120817, 116607, 107582, 159697, 156345, 114683, 138436, 150828, 129425, 71796, 64618, 40243, 28105, 63070, 88827, 125025, 126215, 103492, 65369, 26709, 81776, 99401, 142491, 113622, 76730, 71714, 97035, 78512, 165724, 154134, 130311, 109540]
$$ [...]
##END NTUPLES=NMR SPECTRUM
##END=
