##TITLE=Analysis number 327738
Compound Code cc 29404
Project Code adrs
Chemist Name endeavour
##JCAMPDX= 6.0         $$ Bruker NMR JCAMP-DX V2.0
##DATA TYPE= NMR SPECTRUM
##DATA CLASS= NTUPLES
##ORIGIN= Bruker BioSpin GmbH
##OWNER= nmr
$$ XWIN-NMR		Version 3.5
$$ Tue Apr  3 10:10:42 2007 GMT Daylight Time (UT+1h)  MAYBRIDGE\nmr@NMR_250MHZ
##.OBSERVE FREQUENCY= 250.131544655141
##.OBSERVE NUCLEUS= ^1H
##.ACQUISITION MODE= SIMULTANEOUS (DQD)
##.ACQUISITION SCHEME= undefined
##.AVERAGES= 16
##.DIGITISER RES= 18
##SPECTROMETER/DATA SYSTEM= dpx250
##.PULSE SEQUENCE= zg30
##.SOLVENT NAME= CDCl3
##.SHIFT REFERENCE= (INTERNAL, CDCl3, 0, 16.522)
##AUDIT TRAIL= $$ (NUMBER, WHEN, WHO, WHERE, WHAT)
$$ ##TITLE= Audit trail, XWIN-NMR		Version 3.5
$$ ##JCAMPDX= 5.01
$$ ##ORIGIN= Bruker BioSpin GmbH
$$ ##OWNER= nmr
$$ C:\u/data/dgb/nmr/ADRS/290/pdata/1/auditp.txt
$$ ##AUDIT TRAIL=  $$ (NUMBER, WHEN, WHO, WHERE, WHAT)
(   1,<2007-04-03 10:10:17.46 +100>,<MAYBRIDGE\nmr>,<NMR_250MHZ>,
      <created by zg, POWCHK disabled, PULCHK disabled
       configuration hash MD5:
       49 4B E0 1D 92 C2 6B 37 9F E6 65 BC 52 41 86 1D
       data hash MD5: 64K
       2A DF 16 12 57 67 02 44 5C 5E 8A C8 99 C5 33 1D>)
(   2,<2007-04-03 10:10:32.35 +100>,<MAYBRIDGE\nmr>,<NMR_250MHZ>,
      <Start of raw data processing
       ef LB = 0.3 FT_mod = 6 PKNL = 1 SI = 32K 
       data hash MD5: 32K
       1C 70 F8 B0 B1 68 BE E4 4F 4E 85 D7 C4 C9 4C BF>)
(   3,<2007-04-03 10:10:34.02 +100>,<MAYBRIDGE\nmr>,<NMR_250MHZ>,
      <apk 
       data hash MD5: 32K
       F0 BA 1D 5F 7D 38 80 EA FF 0C D6 3E ED 3A 7D 4A>)
(   4,<2007-04-03 10:10:34.88 +100>,<MAYBRIDGE\nmr>,<NMR_250MHZ>,
      <abs ABSG = 5 
       data hash MD5: 32K
       8F 5A 85 D4 9D 27 90 D5 75 F3 62 9B C6 19 3F AD>)
$$ ##END=
$$ 
$$ hash MD5
$$ F1 ED C1 AD 9F ED 4F 4C 38 FB 37 4A A6 25 A0 25
##$RELAX= 
##$RELAX= 
##$RELAX= 
##$RELAX= 
##$RELAX= 
##$RELAX= 
##$RELAX= 
$$ Bruker specific parameters
$$ --------------------------
##$DU= <C:\u>
##$EXPNO= 290
##$NAME= <ADRS>
##$PROCNO= 1
##$TYPE= <nmr>
##$USER= <dgb>
##$AMP= (0..31)
100 100 100 100 100 100 100 100 100 100 100 100 100 100 100 100 100 100 
100 100 100 100 100 100 100 100 100 100 100 100 100 100 
##$AQSEQ= 0
##$AQ_mod= 3
##$AUNM= <au_zg>
##$AUTOPOS= <52 >
##$BF1= 250.13
##$BF2= 250.13
##$BF3= 250.13
##$BF4= 250.13
##$BF5= 500.13
##$BF6= 500.13
##$BF7= 500.13
##$BF8= 500.13
##$BYTORDA= 1
##$CFDGTYP= 0
##$CFRGTYP= 5
##$CHEMSTR= <none>
##$CNST= (0..31)
1 1 145 1 1 1 1 1 1 1 1 1 1 1 1 1 1 1 1 1 1 1 1 1 1 1 1 1 1 1 1 1 
##$CPDPRG= <>
##$CPDPRG1= <>
##$CPDPRG2= <>
##$CPDPRG3= <>
##$CPDPRG4= <mlev>
##$CPDPRG5= <mlev>
##$CPDPRG6= <mlev>
##$CPDPRG7= <mlev>
##$CPDPRG8= <mlev>
##$CPDPRGB= <>
##$CPDPRGT= <>
##$D= (0..31)
0 1 0 0 0 0 0 0 0 0.06 0 0 0 0 0 0 0.0002 0 0 0 0 0 0 0 0 0 0 0 0 0 0 
0 
##$DATE= 1175591416
##$DBL= (0..7)
120 120 120 120 120 120 120 120 
##$DBP= (0..7)
150 150 150 150 150 150 150 150 
##$DBP07= 0
##$DBPNAM0= <>
##$DBPNAM1= <>
##$DBPNAM2= <>
$$ [...]
##$SUBNAM7= <"">
##$SUBNAM8= <"">
##$SUBNAM9= <"">
##$SW= 20.6930455092707
##$SWIBOX= (0..15)
0 0 3 0 0 0 0 0 0 0 0 0 0 0 0 0 
##$SW_h= 5175.983436853
##$TD= 65536
##$TD0= 1
##$TE= 683.16
##$TE2= 300
##$TE3= 300
##$TEG= 300
##$TL= (0..7)
0 120 120 120 120 120 120 120 
##$TP= (0..7)
150 150 150 150 150 150 150 150 
##$TP07= 0
##$TPNAME0= <>
##$TPNAME1= <>
##$TPNAME2= <>
##$TPNAME3= <>
##$TPNAME4= <>
##$TPNAME5= <>
##$TPNAME6= <>
##$TPNAME7= <>
##$TPOAL= (0..7)
0.5 0.5 0.5 0.5 0.5 0.5 0.5 0.5 
##$TPOFFS= (0..7)
0 0 0 0 0 0 0 0 
##$TUNHIN= 0
##$TUNHOUT= 0
##$TUNXOUT= 0
##$USERA1= <user>
##$USERA2= <user>
##$USERA3= <user>
##$USERA4= <user>
##$USERA5= <user>
##$V9= 5
##$VALIST= <valist>
##$VCLIST= <CCCCCCCCCCCCCCC>
##$VD= 0
##$VDLIST= <DDDDDDDDDDDDDDD>
##$VPLIST= <PPPPPPPPPPPPPPP>
##$VTLIST= <TTTTTTTTTTTTTTT>
##$WBST= 1024
##$WBSW= 4
##$XGAIN= (0..3)
0 0 0 0 
##$XL= 0
##$YL= 0
##$YMAX_a= 366426
##$YMIN_a= -450268
##$ZGOPTNS= <>
##$ZL1= 120
##$ZL2= 120
##$ZL3= 120
##$ZL4= 120
##$ABSF1= 16.522
##$ABSF2= -4.171173
##$ABSG= 5
##$ABSL= 3
##$ALPHA= 0
##$AQORDER= 0
##$ASSFAC= 0
##$ASSFACI= 0
##$ASSFACX= 0
##$ASSWID= 0
##$AUNMP= <proc_1d>
##$AZFE= 0.1
##$AZFW= 0.1
##$BCFW= 0
##$BC_mod= 0
##$BYTORDP= 0
##$COROFFS= 0
##$CY= 12.5
##$DATMOD= 1
##$DC= 0
##$DFILT= <>
##$DTYPP= 0
##$F1P= 14.0000005364418
##$F2P= -0.99999901652339
##$FCOR= 0.5
##$FTSIZE= 32768
##$FT_mod= 6
##$GAMMA= 0
##$GB= 0
##$INTBC= 1
##$INTSCL= 1
##$ISEN= 128
##$LB= 0.3
##$LEV0= 0
##$LPBIN= 0
##$MAXI= 10000
##$MC2= 0
##$MEAN= 0
##$ME_mod= 0
##$MI= 0
##$NCOEF= 0
##$NC_proc= -4
##$NLEV= 6
##$NOISF1= 0
##$NOISF2= 0
##$NSP= 0
##$NTH_PI= 0
##$NZP= 0
##$OFFSET= 16.522
##$PC= 1
##$PHC0= 237.8701
##$PHC1= 5.145557
##$PH_mod= 1
##$PKNL= yes
##$PPARMOD= 0
##$PSCAL= 4
##$PSIGN= 0
##$REVERSE= no
##$SF= 250.13
##$SI= 32768
##$SIGF1= 0
##$SIGF2= 0
##$SINO= 400
##$SIOLD= 32768
##$SREGLST= <1H.CDCl3>
##$SSB= 0
##$STSI= 32768
##$STSR= 0
##$SW_p= 5175.98343685301
##$SYMM= 0
##$S_DEV= 0
##$TDeff= 65536
##$TDoff= 0
##$TI= <Analysis number 999999
Compound Code 99
Book Reference 9
Project Code 9>
##$TILT= no
##$TM1= 0
##$TM2= 0
##$TOPLEV= 0
##$USERP1= <user>
##$USERP2= <user>
##$USERP3= <user>
##$USERP4= <user>
##$USERP5= <user>
##$WDW= 1
##$XDIM= 32768
##$YMAX_p= 469446480
##$YMIN_p= -300098
$$ End of Bruker specific parameters
$$ ---------------------------------
##NTUPLES= NMR SPECTRUM
##VAR_NAME=  FREQUENCY,     SPECTRUM/REAL,   SPECTRUM/IMAG
##SYMBOL=    X,             R,               I
##VAR_TYPE=  INDEPENDENT,   DEPENDENT,       DEPENDENT
##VAR_FORM=  AFFN,          ASDF,            ASDF
##VAR_DIM=   32768,         32768,           32768
##UNITS=     HZ,            ARBITRARY UNITS, ARBITRARY UNITS
##FACTOR=    0.157963299565203, 1,           1
##FIRST=     4132.6476996994, 0,             0
##LAST=      -1043.33573715361, 0,           0
##MIN=       -1043.33573715361, -300098,     0
##MAX=       4132.6476996994, 469446480,     0
$$ Real data points
##PAGE= N=1
##DATA TABLE= (X++(R..R)), XYDATA
$$ [...]
##PAGE= N=2
##DATA TABLE= (X++(I..I)), XYDATA
$$ plain form
27898 1245244 1298233 1267505 1250057 1282721 1380054 1369020 1346510 1292793 1266706 1265413 1191903
27887 1191903 1192862 1242724 1204386 1216686 1306631 1344796 1336486 1390510 1348594 1287363 1312207 1270468
27875 1270468 1291358 1315663 1404895 1361519 1363328 1281151 1326992 1404471 1402119 1358190 1269235 1263116
27863 1263116 1296021 1275065 1316459 1337995 1373547 1446495 1402660 1330248 1261804 1217871 1206189
27852 1206189 1220452 1197324 1179413 1214712 1276437 1331887 1353296 1399756 1386370 1378046 1363663
27841 1363663 1292874 1228362 1257211 1351456 1349140 1307669 1255439 1269073 1350091 1426802 1326217
27830 1326217 1260672 1272614 1386239 1430738 1350957 1386171 1332695 1308699 1341688 1399033 1319222
27819 1319222 1351521 1327930 1368854 1400051 1368336 1435760 1483187 1489211 1418375 1460873 1443119
$$ packed form
27898A245244N2989l0728j7448L2664R7333j1034k2510n3717k6087j293p3510
27887A191903R59M9862l8338J2300Q9945L8165q310N4024m1916o1231K4844m1739
27875A270468K0890K4305Q9232m3376J809q2177M5841P7479k352m3929q8955o119
27863A263116L2905k0956M1394K1536L5552P2948m3835p2412o8444m3933j1682
27852A206189J4263k3128j7911L5299O1725N5450K1409M6460j3386q324j4383
27841A363663p0789o4512K8849R4245k316m1471n2230J3634Q1018P6711j00585
27830A326217o5545J1942J13625M4499p9781L5214n3476k3996L2989N7345p9811
27819A319222L2299k3591M0924L1197l1715O7424M7427O024p0836M2498j7754
$$ plain form
27808 1443119 1434263 1442884 1477482 1528673 1467890 1406288 1423777 1324454 1307977 1340302 1312972 1311495
27796 1311495 1332977 1329439 1346644 1441400 1508282 1531474 1526460 1499075 1378422 1233748 1235930
27785 1235930 1212256 1197610 1191884 1246912 1344998 1308842 1305089 1344748 1373560 1281110 1227034 1239209
27773 1239209 1310538 1311020 1408568 1541497 1437722 1293922 1284325 1378739 1427138 1348743 1309142
27762 1309142 1295908 1314331 1325886 1355253 1346439 1399444 1411996 1399087 1360624 1299887 1308569 1376524
27750 1376524 1395596 1400239 1454749 1405941 1350600 1308825 1321023 1255328 1302775 1337356 1370513
27739 1370513 1355404 1402429 1393086 1384512 1454526 1413098 1414238 1405883 1419715 1394321 1375143 1387395
27727 1387395 1386742 1359222 1345355 1385919 1388038 1346010 1351855 1361725 1371717 1382792 1280478 1259621
$$ packed form
27808A443119q856Q621L4598N1191o0783o1602J7489r9323j6477L2325k7330j477
27796A311495K1482l538J7205R4756O6882K3192n014k7385j20653j44674K182
27785A235930k3674j4646n726N5028R8086l6156l753L9659K8812r2450n4076J2175
27773A239209P1329M82R7548J32929j03775j43800r597R4414M8399p8395l9601
27762A309142j3234J8423J1555K9367q814N3005J2552j2909l8463o0737Q682O7955
27750A376524J9072M643N4510m8808n5341m1775J2198o5695M7447L4581L3157
27739A370513j5109M7025r343q574P0014m1428J140q355J3832k5394j9178J2252
27727A387395o53k7520j3867M0564K119m2028N845R870R992J1075j02314k0857
$$ plain form
27715 1259621 1326247 1427502 1436709 1381313 1325490 1240447 1189081 1209085 1311363 1396618 1378879
27704 1378879 1360468 1316262 1371539 1442228 1389622 1287789 1298497 1329982 1292371 1305445 1312794
27693 1312794 1323533 1365357 1329890 1317415 1336633 1297886 1250994 1225048 1166923 1167317 1302811
27682 1302811 1304140 1221371 1265691 1380348 1335665 1246131 1248364 1287405 1303112 1356091 1388682
27671 1388682 1348962 1305884 1358658 1368627 1429794 1433208 1476910 1497229 1422553 1386901 1305111 1305948
27659 1305948 1320098 1373802 1384311 1359688 1406409 1402947 1423955 1384507 1305238 1309422 1350956 1401105
27647 1401105 1339839 1263095 1338264 1389965 1538593 1508205 1377733 1304717 1291222 1312079 1343455
27636 1343455 1304943 1285990 1332448 1331893 1269973 1228944 1296683 1315827 1352119 1355741 1329635 1313348
$$ packed form
27715A259621O6626J01255R207n5396n5823q5043n1366K0004J02278Q5255j7739
27704A378879j8411m4206N5277P0689n2606j01833J0708L1485l7611J3074P349
27693A312794J0739M1824l5467j2475J9218l8747m6892k5946n8125L94J35494
27682A302811J329q2769M4320J14657m4683q9534K233L9041J5707N2979L2591
27671A388682l9720m3078N2774R969O1167L414M3702K0319p4676l5652q1790Q37
27659A305948J4150N3704J0509k4623M6721l462K1008l9448p9269M184M1534N0149
27647A401105o1266p6744P5169N1701J48628l0388j30472p3016j3495K0857L1376
27636A343455l8512j8953M6458n55o1920m1029O7739J9144L6292L622k6106j6287
$$ plain form
27624 1313348 1414956 1513543 1511814 1449150 1352466 1340918 1366383 1385160 1407740 1379736 1349457
27613 1349457 1354985 1321239 1291430 1251965 1241510 1331111 1408758 1458983 1496060 1486677 1439172 1359297
27601 1359297 1366278 1418111 1457777 1497505 1540741 1447226 1334529 1327972 1367884 1361200 1379848 1437331
27589 1437331 1491495 1421880 1372808 1386313 1397456 1364137 1342376 1371043 1289370 1256107 1333260
27578 1333260 1349017 1409110 1494320 1404286 1327631 1339391 1358447 1261851 1226084 1289522 1281563
27567 1281563 1288501 1304041 1338705 1321444 1314254 1288879 1274085 1340001 1361656 1356834 1312707 1327792
27555 1327792 1447239 1461960 1445866 1357752 1337652 1385217 1360996 1359942 1415311 1411957 1402759 1421550
27543 1421550 1455387 1496499 1462163 1353644 1267474 1277021 1314604 1359988 1302288 1230735 1249293
$$ packed form
27624A313348J01608R8587j729o2664r6684j1548K5465J8777K2580k8004l0279
27613A349457N528l3746k9809l9465j0455Q9601P7647N0225L7077r383m7505p9875
27601A359297O981N1833L9666L9728M3236r3515j12697o557L9912o684J8648N7483
27589A437331N4164o9615m9072J3505J1143l3319k1761K8667q1673l3263P7153
27578A333260J5757O0093Q5210r0034p6655J1760J9056r6596l5767O3438p959
27567A281563O938J5540L4664j7261p190k5375j4794O5916K1655m822m4127J5085
27555A327792J19447J4721j6094q8114k0100M7565k4221j054N5369l354r198J8791
27543A421550L3837M1112l4336j08519q6170R547L7583M5384n7700p1553J8558
$$ plain form
27532 1249293 1383825 1470084 1370024 1348349 1345006 1335167 1375405 1431085 1396181 1283926 1157509
27521 1157509 1253441 1320000 1319443 1274410 1275379 1325521 1365756 1444055 1432562 1426190 1391790 1342123
27509 1342123 1355592 1444930 1457539 1439547 1379885 1360674 1336051 1349417 1379891 1333671 1312956
27498 1312956 1295655 1280268 1268716 1284217 1397158 1420003 1435506 1468164 1439819 1360369 1351980
27487 1351980 1387925 1421406 1462506 1513402 1512331 1470712 1529701 1514484 1461764 1377553 1316658
27476 1316658 1321533 1377009 1453389 1394075 1401327 1457807 1432676 1326922 1431684 1584648 1523617
27465 1523617 1470826 1382446 1428191 1463732 1480090 1439012 1334878 1249688 1317195 1435982 1469352
27454 1469352 1506693 1478134 1418084 1378169 1376163 1319081 1320498 1354027 1327983 1333883 1278610 1257627
$$ packed form
27532A249293J34532Q6259j00060k1675l343r839M0238N5680l4904j12255j26417
27521A157509R5932O6559n57m5033R69N0142M0235P8299j1493o372l4400m9667
27509A342123J3469Q9338J2609j7992n9662j9211k4623J3366L0474m6220k0715
27498A312956j7301j5387j1552J5501J12941K2845J5503L2658k8345p9450q389
27487A351980L5945L3481M1100N0896j071m1619N8989j5217n2720q4211o0895
27476A316658M875N5476P6380n9314P252N6480k5131j05754J04762J52964o1031
27465A523617n2791q8380M5745L5541J6358m1078j04134q5190O7507J18787L3370
27454A469352L7341k8559o0050l9915k006n7082J417L3529k6044N900n5273k0983
$$ plain form
27442 1257627 1307355 1357533 1349666 1428790 1499906 1536042 1553245 1464278 1417042 1430293 1409995
27431 1409995 1416186 1397356 1352230 1241214 1187148 1335209 1450286 1499793 1449093 1517114 1477717
27420 1477717 1517574 1635496 1532929 1414718 1359316 1396114 1365918 1443652 1453331 1461729 1437911
27409 1437911 1397191 1320848 1381588 1402368 1397311 1427519 1419821 1507573 1577199 1563964 1467478 1401421
27397 1401421 1374151 1351674 1429446 1453450 1474112 1483305 1520451 1449123 1350909 1293628 1362986
27386 1362986 1464844 1434770 1336111 1259911 1350731 1326903 1283182 1293353 1274410 1293024 1307668
27375 1307668 1360997 1375699 1374340 1358621 1267671 1299093 1380773 1309862 1267546 1230384 1285943
27364 1285943 1343801 1354639 1430358 1383341 1395502 1490181 1525612 1540142 1521481 1507418 1558308
$$ packed form
27442A257627M9728N0178p867P9124P1116L6136J7203q8967m7236J3251k0298
27431A409995O191j8830m5126j11016n4066J48061J15077M9507n0700O8021l9397
27420A477717L9857J17922j02567j18211n5402L6798l0196P7734R679Q398k3818
27409A437911m0720p6343O0740K0780n057L0208p698Q7752O9626j3235r6486o6057
27397A401421k7270k2477P7772K4004K0662R193L7146p1328r8214n7281O9358
27386A362986J01858l0074r8659p6200R0820k3828m3721J0171j8943J8614J4644
27375A307668N3329J4702j359j5719r0950L1422Q1680p0911m2316l7162N5559
27364A285943N7858J0838P5719m7017J2161R4679L5431J4530j8661j4063N0890
$$ plain form
27353 1558308 1576045 1541494 1474223 1439126 1372263 1320795 1337213 1408254 1448642 1431646 1490809
27342 1490809 1550282 1535186 1476682 1451826 1420253 1378072 1400272 1499712 1454831 1358414 1328928
27331 1328928 1297534 1331662 1358974 1422048 1384446 1431772 1479049 1381920 1388317 1449273 1426377
27320 1426377 1438910 1460301 1464634 1453691 1407100 1425683 1476643 1515391 1493580 1437806 1434848 1503719
27308 1503719 1483865 1489738 1576233 1554149 1617365 1613737 1567969 1539722 1432413 1467651 1482684
27297 1482684 1517866 1519733 1505404 1422073 1353932 1350734 1338131 1340520 1284931 1328704 1376000 1449877
27285 1449877 1508320 1475803 1359887 1344291 1334047 1313928 1343703 1384081 1414656 1409302 1428455
27274 1428455 1344608 1254880 1314040 1379733 1390103 1410089 1344407 1296811 1316074 1309913 1314781 1350428
$$ packed form
27353A558308J7737l4551o7271l5097o6863n1468J6418P1041M0388j6996N9163
27342A490809N9473j5096n8504k4856l1573m2181K2200R9440m4881r6417k9486
27331A328928l1394L4128K7312O3074l7602M7326M7277r7129O397O0956k2896
27320A426377J2533K1391M333j0943m6591J8583N0960L8748k1811n5774k958O8871
27308A503719j9854N873Q6495k2084O3216l628m5768k8247j07309L5238J5033
27297A482684L5182J867j4329q3331o8141l198j2603K389n5589M3773M7296P3877
27285A449877N8443l2517j15916j5596j0244k0119K9775M0378L0575n354J9153
27274A428455q3847q9728N9160O5693J0370J9986o5682m7596J9263o161M868L5647
$$ plain form
27262 1350428 1371995 1439086 1480436 1557059 1552918 1478047 1491490 1534877 1542831 1502785 1503997 1450991
27250 1450991 1396540 1412494 1395052 1327412 1293570 1328970 1295562 1359859 1426716 1432023 1369239
27239 1369239 1411527 1427097 1519934 1556579 1548078 1497394 1530537 1573929 1532912 1427298 1403316
27228 1403316 1439863 1473647 1421557 1423736 1447438 1471024 1496520 1438222 1352632 1381660 1455564
27217 1455564 1450092 1448261 1389438 1348591 1393923 1423550 1479651 1514517 1438142 1368291 1400518 1398710
27205 1398710 1390206 1313680 1440351 1426931 1358006 1341003 1323940 1379345 1347033 1406296 1548485
27194 1548485 1540777 1487882 1491329 1489133 1421568 1443404 1429460 1448399 1526292 1566165 1644899 1656491
27182 1656491 1579326 1437167 1294042 1285338 1307313 1358890 1375308 1362790 1311292 1388741 1382480
$$ packed form
27262A350428K1567O7091M1350P6623m141p4871J3443M3387P954m0046J212n3006
27250A450991n4451J5954j7442o7640l3842L5400l3408O4297O6857N307o2784
27239A369239M2288J5570R2837L6645q501n0684L3143M3392m1017j05614k3982
27228A403316L6547L3784n2090K179K3702K3586K5496n8298q5590K9028P3904
27217A455564n472j831n8823m0847M5332K9627N6101L4866p6375o9851L2227j808
27205A398710q504p6526J26671j3420o8925j7003j7063N5405l2312N9263J42189
27194A548485p708n2895L447k196o7565K1836j3944J8939P7893L9873P8734J1592
27182A656491p7165j42159j43125q704K1975N1577J6418j2518n1498P7449o261
$$ plain form
27171 1382480 1306247 1367266 1393611 1301258 1272836 1291948 1353684 1448999 1513856 1579212 1559886
27160 1559886 1536666 1477169 1347414 1297085 1279964 1377180 1436327 1419042 1481649 1520718 1448297
27149 1448297 1368969 1427681 1508600 1451565 1381609 1375401 1453029 1454250 1330774 1315908 1372454
27138 1372454 1405326 1389285 1374072 1387071 1448544 1519413 1517290 1472975 1487225 1485960 1479035 1480532
27126 1480532 1502000 1551341 1510634 1475262 1462127 1443465 1435271 1487424 1517791 1509128 1509861 1531878
27114 1531878 1508545 1417642 1448635 1481964 1547814 1485552 1418226 1354674 1333249 1371962 1399016
27103 1399016 1415909 1389660 1363393 1322388 1308722 1301899 1329528 1484506 1458868 1394143 1509824
27092 1509824 1539071 1546693 1519381 1504339 1526874 1642239 1691759 1651273 1555663 1602485 1587786
$$ packed form
27171A382480p6233O1019K6345r2353k8422J9112O1736R5315O4857O5356j9326
27160A559886k3220n9497j29755n0329j7121R7216N9147j7285O2607L9069p2421
27149A448297p9328N8712Q0919n7035o9956o208P7628J221j23476j4866N6546
27138A372454L2872j6041j5213J2999O1473P0869k123m4315J4250j265o925J497
27126A480532K1468M9341m0707l5372j3135j8662q194N2153L0367q663P33K2017
27114A531878k3333r0903L0993L3329O5850o2262o7326o3552k1425L8713K7054
27103A399016J6893k6249k6267m1005j3666o823K7629J54978k5638o4725J15681
27092A509824K9247P622k7312j5042K2535J15365M9520m0486r5610M6822j4699
$$ plain form
27081 1587786 1459736 1453061 1517036 1554665 1581156 1609757 1630005 1566109 1500237 1457503 1453747
27070 1453747 1381000 1299581 1333503 1416442 1435931 1365566 1330338 1297588 1239222 1232286 1323036
27059 1323036 1355584 1464712 1572181 1641968 1571177 1432947 1364752 1398244 1476559 1517399 1549093
27048 1549093 1436705 1417006 1457739 1481279 1453779 1448047 1446246 1471552 1502266 1518197 1501104
27037 1501104 1575544 1578658 1627711 1636578 1623672 1563639 1485677 1510403 1515738 1472181 1377664 1471280
27025 1471280 1554709 1609003 1586897 1493546 1412694 1445409 1444955 1430485 1397381 1421223 1460660 1422577
27013 1422577 1349831 1345551 1400164 1343301 1331504 1375063 1349170 1358799 1352632 1461522 1443520 1406200
27001 1406200 1462689 1429959 1465130 1515621 1506540 1511016 1597716 1622202 1569222 1525960 1452920 1409932
$$ packed form
27081A587786j28050o675O3975L7629K6491K8601K0248o3896o5872m2734l756
27070A453747p2747q1419L3922Q2939J9489p0365l5228l2750n8366o936R0750
27059A323036L2548J09128J07469O9787p0791j38230o8195L3492P8315M0840L1694
27048A549093j12388j9699M0733K3540k7500n732j801K5306L0714J5931j7093
27037A501104P4440L114M9053Q867j2906o0033p7962K4726N335m3557r4517R3616
27025A471280Q3429N4294k2106r3351q0852L2715m54j4470l3104K3842L9437l8083
27013A422577p2746m280N4613n6863j1797M3559k5893R629o167J08890j8002l7320
27001A406200N6489l2730L5171N0491r081M476Q6700K4486n2980m3262p3040m2988
$$ plain form
26989 1409932 1335841 1251653 1288098 1407067 1495083 1521163 1565917 1542907 1443472 1406691 1387933
26978 1387933 1409399 1453838 1457203 1459277 1416243 1346490 1392496 1465675 1508333 1552247 1602984 1557500
26966 1557500 1541550 1486018 1472618 1426355 1407605 1410068 1432832 1441541 1452920 1444029 1452120 1458401
26954 1458401 1492525 1504531 1495632 1496434 1511992 1491120 1496778 1474684 1434891 1365015 1334905 1396821
26942 1396821 1529291 1546973 1454359 1466708 1473035 1453060 1463471 1551308 1476110 1464242 1429379
26931 1429379 1448840 1478564 1500532 1467968 1431002 1369161 1367361 1466883 1636245 1674144 1647904
26920 1647904 1475532 1365821 1377297 1486841 1623932 1623995 1599879 1589354 1538926 1488157 1509176
26909 1509176 1492521 1477473 1459149 1433033 1480267 1578558 1637927 1637906 1534945 1465363 1531180 1520021
$$ packed form
26989A409932p4091q4188L6445J18969Q8016K6080M4754k3010r9435l6781j8758
26978A387933K1466M4439L365K074m3034o9753M6006P3179M2658M3914N0737m5484
26966A557500j5950n5532j3400m6263j8750K463K2764Q709J1379q891Q091O281
26954A458401L4124J2006q899Q02J5558k0872N658k2094l9793o9876l0110O1916
26942A396821J32470J7682r2614J2349O327j9975J0411Q7837p5198j1868l4863
26931A429379J9461K9724K1968l2564l6966o1841j800R9522J69362L7899k6240
26920A647904j72372j09711J1476J09544J37091O3k4116j0525n0428n0769K1019
26909A509176j6655j5048j8324k6116M7234R8291N9369k1j02961o9582O5817j1159
$$ plain form
26897 1520021 1498009 1486251 1482405 1444236 1323462 1364393 1475351 1538785 1508493 1484922 1493951
26886 1493951 1516974 1491732 1429855 1442501 1538996 1507106 1479875 1471468 1464524 1555214 1585866 1525221
26874 1525221 1504018 1466756 1545691 1526352 1501905 1501507 1475776 1542034 1577403 1537255 1501089 1567067
26862 1567067 1622698 1591363 1607152 1574072 1579290 1588601 1564463 1537557 1495956 1499240 1478795 1530930
26850 1530930 1548619 1551275 1524558 1467434 1499410 1523853 1508613 1546569 1579312 1552844 1543245 1434581
26838 1434581 1432183 1533278 1579079 1550626 1591604 1574022 1491728 1484867 1517782 1511660 1461982 1463732
26826 1463732 1537529 1550206 1518187 1468763 1484632 1491722 1596750 1571112 1535373 1588673 1589443 1595658
26814 1595658 1566505 1432734 1347954 1445267 1606877 1609250 1530012 1544729 1612412 1624102 1621671
$$ packed form
26897A520021k2012j1758l846l8169j20774M0931J10958O3434l0292k3571R029
26886A493951K3023k5242o1877J2646R6495l1890k7231q407o944R0690L0652o0645
26874A525221k1203l7262P8935j9339k4447l98k5731O6258L5369m0148l6166O5978
26862A567067N5631l1335J5789l3080N218R311k4138k6906m1601L284k0445N2135
26850A530930J7689K656k6717n7124L1976K4443j5240L7956L2743k6468r599j08664
26838A434581k398J01095M5801k8453M0978j7582q2294o861L2915o122m9678J750
26826A463732P3797J2677l2019m9424J5869P090J05028k5638l5739N3300P70O215
26814A595658k9153j33771q4780R7313J61610K373p9238J4717O7683J1690k431
$$ plain form
26803 1621671 1664513 1699224 1606515 1564816 1475844 1453823 1501983 1531792 1536758 1548408 1614099
26792 1614099 1625594 1541475 1471296 1489082 1539542 1545908 1483246 1419092 1429840 1534210 1641323
26781 1641323 1687972 1611675 1617630 1572913 1513929 1507110 1532116 1529790 1517308 1507649 1517896 1552645
26769 1552645 1544858 1549038 1515816 1471618 1483421 1476770 1435822 1438316 1426416 1478628 1570877 1558030
26757 1558030 1506230 1458429 1491079 1459733 1405952 1364807 1399774 1490403 1502285 1412629 1399442
26746 1399442 1480217 1557024 1590781 1523152 1545459 1529975 1473519 1439848 1439392 1513618 1504095 1546281
26734 1546281 1604481 1611811 1617934 1531305 1497586 1480832 1520110 1541372 1531943 1532463 1656635 1662625
26722 1662625 1523452 1464309 1424847 1388961 1379494 1445874 1494136 1566016 1597411 1614351 1606065
$$ packed form
26803A621671M2842L4711r2709m1699q8972k2021M8160K9809M966J1650O5691
26792A614099J1495q4119p0179J7786N0460O366o2662o4154J0748J04370J07113
26781A641323M6649p6297N955m4717n8984o819K5006k326j2482r659J0247L4749
26769A552645p787M180l3222m4198J1803o651m0948K494j1900N2212R2249j2847
26757A558030n1800m7801L2650l1346n3781m1145L4967R0629J1882q9656j3187
26746A399442Q0775P6807L3757o7629K2307j5484n6456l3671m56P4226r523M2186
26734A546281N8200P330O123q6629l3719j6754L9278K1262r429N20J24172N990
26722A662625j39173n9143l9462l5886r467O6380M8262P1880L1395J6940q286
$$ plain form
26711 1606065 1545311 1465620 1411973 1427223 1328285 1353566 1287556 1218601 1236312 1410184 1430313
26700 1430313 1417875 1430583 1400859 1464680 1550693 1607947 1627161 1535647 1479321 1525335 1444962
26689 1444962 1382896 1445055 1467388 1481531 1567776 1653741 1640512 1526135 1476085 1441040 1360518
26678 1360518 1453654 1569819 1581606 1587048 1567069 1567420 1584681 1565899 1513803 1468867 1459970 1569372
26666 1569372 1623673 1539833 1531495 1621135 1595194 1568528 1470070 1513482 1517575 1487525 1609055
26655 1609055 1580837 1555548 1582844 1570839 1576323 1631222 1623817 1632843 1678062 1670993 1545754 1547716
26643 1547716 1638617 1697093 1659515 1599027 1577492 1506782 1573184 1584843 1520407 1488837 1499559
26632 1499559 1563363 1563648 1616416 1546672 1440643 1440016 1501001 1524514 1538635 1575844 1556067 1502408
$$ packed form
26711A606065o0754p9691n3647J5250r8938K5281o6010o8955J7711J73872K0129
26700A430313j2438J2708k9724O3821Q6013N7254J9214r1514n6326M6014q0373
26689A444962o2066O2159K2333J4143Q6245Q5965j3229j14377n0050l5045q0522
26678A360518R3136J16165J1787N442j9979L51J7261j8782n2096m4936q897J09402
26666A569372N4301q3840q338Q9640k5941k6666r8458M3412M093l0050J21530
26655A609055k8218k5289K7296j2005N484N4899p405R026M5219p069j25239J962
26643A547716R0901N8476l7578o0488k1535p0710O6402J1659o4436l1570J0722
26632A499559O3804K85N2768o9744j06029o27O0985K3513J4121L7209j9777n3659
$$ plain form
26620 1502408 1484350 1572095 1543625 1472255 1409188 1392939 1425764 1444309 1361536 1397378 1448586
26609 1448586 1477388 1453340 1479116 1495326 1452704 1511829 1668273 1630288 1492742 1542434 1630183
26598 1630183 1594351 1618395 1596750 1564912 1519203 1548208 1608217 1605592 1613675 1578600 1465832
26587 1465832 1378271 1425169 1392105 1484999 1503499 1450785 1566267 1623561 1675998 1606157 1589469
26576 1589469 1613856 1647569 1597146 1647251 1641888 1576457 1495423 1519982 1597591 1619355 1655422
26565 1655422 1689672 1663705 1626086 1594612 1639555 1605811 1584488 1555960 1510636 1552867 1660287
26554 1660287 1672902 1654118 1601630 1473661 1459682 1547134 1592133 1598114 1660977 1711440 1710616 1648474
26542 1648474 1604961 1620198 1559512 1581125 1542878 1557715 1536309 1591399 1582550 1518030 1522955 1509983
$$ packed form
26620A502408j8058Q7745k8470p1370o3067j6249L2825J8545q2773L5842N1208
26609A448586K8802k4048K5776J6210m2622N9125J56444l7985j37546M9692Q7749
26598A630183l5832K4044k1645l1838m5709K9005O0009k625Q083l5075j12768
26587A465832q7561M6898l3064R2894J8500n2714J15482N7294N2437o9841j6688
26576A589469K4387L3713n0423N0105n363o5431q1034K4559P7609K1764L6067
26565A655422L4250k5967l7619l1474M4943l3744k1323k8528m5324M2231J07420
26554A660287J2615j8784n2488j27969j3979Q7452M4999N981O2863N0463q24o2142
26542A648474m3513J5237o0686K1613l8247J4837k1406N5090q849o4520M925j2972
$$ plain form
26530 1509983 1465739 1480302 1454907 1474194 1554148 1620317 1603345 1654424 1667189 1621224 1637256
26519 1637256 1685089 1714643 1652816 1533287 1504067 1470201 1482053 1564334 1630280 1664490 1735337
26508 1735337 1725647 1685499 1604210 1491956 1471944 1506880 1590353 1558496 1505141 1552139 1650091
26497 1650091 1681961 1704914 1660304 1621032 1641799 1663715 1725069 1674488 1624122 1611488 1604863
26486 1604863 1547362 1523739 1569125 1604133 1634462 1615929 1643530 1696182 1720195 1656068 1638632
26475 1638632 1531365 1473127 1585378 1699061 1717563 1669275 1589847 1594575 1606573 1624455 1636481
26464 1636481 1720844 1744226 1708724 1727795 1682568 1623938 1576657 1576663 1592559 1608930 1643972 1684538
26452 1684538 1709942 1716692 1668469 1633380 1608516 1551371 1576462 1489290 1491796 1582007 1645010 1641999
$$ packed form
26530A509983m4244J4563k5395J9287P9954O6169j6972N1079J2765m5965J6032
26519A637256M7833K9554o1827j19529k9220l3866J1852Q2281O5946L4210P0847
26508A735337r690m0148q1289j12254k0012L4936Q3473l1857n3355M6998R7952
26497A650091L1870K2953m4610l9272K0767K1916O1354n0581n0366j2634o625
26486A604863n7501k3623M5386L5008L0329j8533K7601N2652K4013o4127j7436
26475A638632j07267n8238J12251J13683J8502m8288p9428M728J1998J7882J2026
26464A636481Q4363K3382l5502J9071m5227n8630m7281OJ5896J6371L5042M0566
26452A684538K5404O750m8223l5089k4864n7145K5091q7172K506R0211O3003l011
$$ plain form
26440 1641999 1633280 1520486 1509923 1588036 1726532 1810435 1781155 1718600 1645061 1622695 1594646
26429 1594646 1569558 1514694 1541826 1614784 1629876 1634595 1704148 1689702 1648207 1632357 1565128
26418 1565128 1560411 1566111 1562849 1589054 1628893 1596412 1535138 1542007 1574175 1612889 1706085 1713620
26406 1713620 1622239 1552810 1613282 1627783 1573049 1591853 1647594 1661857 1649997 1730885 1765202
26395 1765202 1774038 1721510 1689054 1673782 1573596 1494970 1492928 1529964 1590561 1684115 1765072
26384 1765072 1757487 1722847 1623248 1501045 1551353 1585922 1642684 1768230 1766366 1631046 1623599
26373 1623599 1655917 1597858 1536320 1522885 1584523 1596425 1588308 1578893 1600761 1603469 1684163 1705826
26361 1705826 1697547 1620208 1599674 1623921 1627095 1642228 1634167 1629170 1597561 1542462 1535773 1498120
$$ packed form
26440A641999q719j12794j0563P8113J38496Q3903k9280o2555p3539k2366k8049
26429A594646k5088n4864K7132P2958J5092M719O9553j4446m1495j5850o7229
26418A565128m717N700l262K6205L9839l2481o1274O869L2168L8714R3196P535
26406A713620r1381o9429O0472J4501n4734J8804N5741J4263j1860Q0888L4317
26395A765202Q836n2528l2456j5272j00186p8626k042L7036O0597R3554Q0957
26384A765072p585l4640r9599j22203N0308L4569N6762J25546j864j35320p447
26373A623599L2318n8059o1538j3435O1638J1902q117r415K1868K708Q0694K1663
26361A705826q279p7339k0534K4247L174J5133q061m997l1609n5099o689l7653
$$ plain form
26349 1498120 1572659 1626436 1616350 1580217 1581371 1624486 1614544 1536430 1488426 1561649 1646021 1688557
26337 1688557 1702582 1739489 1664745 1667587 1678951 1670117 1700677 1712979 1654882 1586508 1500181 1552692
26325 1552692 1578715 1575807 1609422 1615687 1567712 1560815 1634069 1724395 1740949 1730872 1733041 1703994
26313 1703994 1591280 1626369 1747483 1756731 1752526 1729918 1659907 1667679 1717036 1644379 1576758
26302 1576758 1689348 1690066 1633807 1644053 1690194 1680444 1637017 1574984 1559931 1577132 1602109 1547375
26290 1547375 1544121 1645581 1757876 1754683 1748845 1759555 1730476 1653114 1624406 1609473 1656101
26279 1656101 1721360 1684591 1624997 1604830 1631626 1637136 1712330 1749890 1793464 1692064 1564112
26268 1564112 1551445 1559334 1545417 1578518 1623579 1672488 1740417 1689319 1650410 1634304 1584499
$$ packed form
26349A498120P4539N3777j0086l6133J154M3115r942p8114m8004P3223Q4372M2536
26337A688557J4025L6907p4744K842J1364q834L0560J2302n8097o8374q6327N2511
26325A552692K6023k908L3615O265m7975o897P3254R0326J6554j0077K169k9047
26313A703994j12714L5089J21114R248m205k2608p0011P772M9357p2657o7621
26302A576758J12590P18n6259J0246M6141r750m3427o2033j5053J7201K4977n4734
26290A547375l254J01460J12295l193n838J0710k9079p7362k8708j4933M6628
26279A656101O5259l6769n9594k0167K6796N510P5194L7560M3574j01400j27952
26268A564112j2667P889j3917L3101M5061M8909O7929n1098l8909j6106m9805
$$ plain form
26257 1584499 1632977 1665858 1639906 1598973 1664562 1697864 1705551 1771648 1778986 1853320 1902938 1800881
26245 1800881 1723438 1648123 1623692 1616876 1611917 1592476 1492236 1454759 1468762 1456879 1525857
26234 1525857 1636678 1699375 1676881 1640051 1679966 1743962 1690997 1657447 1639132 1704736 1726874
26223 1726874 1644618 1628628 1710532 1788719 1724094 1600643 1665789 1726131 1683828 1692220 1688473
26212 1688473 1670905 1692362 1647281 1654363 1696474 1726640 1758394 1793407 1831271 1813881 1761641
26201 1761641 1722016 1705259 1715564 1743636 1693935 1657166 1687937 1754051 1788079 1749737 1697309
26190 1697309 1724257 1729259 1701928 1624131 1603628 1573892 1634390 1701347 1761103 1734986 1602076
26179 1602076 1610917 1630721 1678400 1623054 1590399 1572559 1535407 1598012 1593588 1671589 1778289
$$ packed form
26257A584499M8478L2881k5952m0933O5589L3302P687O6097P338P4334M9618j02057
26245A800881p7443p5315k4431o816m959j9441j00240l7477J4003j1883O8978
26234A525857J10821O2697k2494l6830L9915O3996n2965l3550j8315O5604K2138
26223A726874q2256j5990Q1904P8187o4625j23451O5146O0342m2303Q392l747
26212A688473j7568K1457m5081P082M2111L0166L1754L5013L7864j7390n2240
26201A761641l9625j6757J0305K8072m9701l6769L0771O6114L4028l8342n2428
26190A697309K6948N002k7331p7797k0503k9736O0498O6957N9756k6117j32910
26179A602076Q841J9804M7679n5346l2655j7840l7152O2605m424P8001J06700
$$ plain form
26168 1778289 1834111 1834153 1718271 1569966 1581164 1604668 1597291 1679199 1706341 1695247 1688592 1594934
26156 1594934 1551840 1530707 1638209 1636760 1478275 1543734 1739236 1777889 1718278 1664637 1677001
26145 1677001 1707783 1706914 1667876 1693327 1722943 1760915 1783445 1834935 1797685 1694951 1644075
26134 1644075 1630236 1652080 1678941 1736267 1685762 1664227 1726848 1777226 1825909 1821644 1743997
26123 1743997 1719473 1766784 1819326 1741144 1754267 1733558 1788503 1763286 1778145 1787638 1715937
26112 1715937 1776813 1807655 1799012 1793466 1741874 1716937 1690112 1719393 1742138 1664293 1607640 1666420
26100 1666420 1703979 1680644 1640454 1695879 1715822 1663192 1691524 1699919 1750065 1790413 1726120
26089 1726120 1669340 1629474 1643051 1599340 1570583 1628755 1643289 1572123 1591992 1621847 1591867
$$ packed form
26168A778289N5822M2j15882j48305J1198K3504p377Q1908K7142j1094o655r3658
26156A594934m3094k1133J07502j449j58485O5459J95502L8653n9611n3641J2364
26145A677001L0782q69l9038K5451K9616L7972K2530N1490l7250j02734n0876
26134A644075j3839K1844K6861N7326n0505k1535O2621N0378M8683m265p7647
26123A743997k4524M7311N2542p8182J3123k0709N4945k5217J4859R493p1701
26112A715937O0876L0842q643n546n1592k4937k6825K9281K2745p7845n6653N8780
26100A666420L7559k3335m0190N5425J9943n2630K8332Q395N0146M0348o4293
26089A726120n6780l9866J3577m3711k8757N8172J4534p1166J9869K9855k9980
$$ plain form
26078 1591867 1553837 1486994 1507424 1527948 1514177 1503473 1540933 1475412 1556629 1621462 1671306
26067 1671306 1715632 1680450 1635322 1572959 1594136 1633967 1628525 1673278 1674791 1695746 1704722 1684913
26055 1684913 1654623 1634230 1608921 1725296 1727829 1646288 1678184 1717530 1609063 1558459 1567703
26044 1567703 1543777 1619115 1741972 1739032 1695990 1709859 1726421 1776679 1672574 1679842 1734612
26033 1734612 1756080 1803797 1694376 1653954 1663656 1696054 1720276 1778164 1701053 1602613 1523658
26022 1523658 1590059 1638586 1631957 1652990 1624435 1615550 1731996 1719313 1675317 1676307 1680437 1698705
26010 1698705 1749231 1711352 1676255 1720830 1634951 1571268 1625161 1704568 1687632 1676038 1668751
25999 1668751 1609063 1565914 1620538 1650505 1682045 1647957 1651610 1715530 1775733 1810493 1861391
$$ packed form
26078A591867l8030o6843K0430K0524j3771j0704L7460o5521Q1217O4833M9844
26067A671306M4326l5182m5128o2363K1177L9831n442M4753J513K0955Q976j9809
26055A684913l0290k0393k5309J16375K533q1541L1896L9346j08467n0604R244
26044A567703k3926P5338J22857k940m3042J3869J6562N0258j04105P268N4770
26033A734612K1468M7717j09421m0422R702L2398K4222N7888p7111r8440p8955
26022A523658O6401M8527o629K1033k8555q885J16446j2683m3996R90M130J8268
26010A698705N0526l7879l5097M4575q5879o3683N3893P9407j6936j1594p287
25999A668751n9688m3149N4624K9967L1540l4088L653O3920O0203L4760N0898
$$ plain form
25988 1861391 1862660 1828992 1732236 1716873 1702969 1686506 1738903 1808620 1862634 1917237 1864543
25977 1864543 1810104 1778323 1806208 1839404 1903820 1901889 1901864 1826197 1703046 1609067 1643714 1662629
25965 1662629 1712959 1744637 1763821 1848129 1862837 1857168 1844714 1793291 1728480 1742536 1765211
25954 1765211 1786297 1817521 1839959 1823117 1884375 1825720 1806956 1730337 1704671 1666505 1641624
25943 1641624 1619684 1684063 1742051 1682621 1603269 1593434 1597313 1591213 1654178 1695950 1734004 1691369
25931 1691369 1667843 1683988 1766532 1767100 1773017 1712510 1747628 1748401 1824649 1870853 1946815 2011004
25919 2011004 1952206 1882889 1826068 1788020 1705044 1763464 1810044 1793896 1772417 1712514 1739256
25908 1739256 1779534 1801401 1881478 1793091 1765095 1752294 1741874 1677194 1690822 1719600 1771234
$$ packed form
25988A861391J269l3668r6756j5363j3904j6463N2397O9717N4014N4603n2694
25977A864543n4439l1781K7885L3196O4416j931k5p5667j23151r3979L4647J8915
25965A662629N0330L1678J9184Q4308J4708n669j2454n1423o4811J4056K2675
25954A765211K1086L1224K2438j6842O1258n8655j8764p6619k5666l8166k4881
25943A641624k1940O4379N7988n9430p9352r835L879o100O2965M1772L8054m2635
25931A691369k3526J6145Q2544N68N917o0507L5118P73P6248M6204P5962O4189
25919B011004n8798o9317n6821l8048q2976N8420M6580j6148k1479n9903K6742
25908A739256M0278K1867Q0077q8387k7996j2801j0420o4680J3628K8778N1634
$$ plain form
25897 1771234 1661310 1607465 1624712 1657804 1731031 1717289 1727435 1768588 1785467 1764911 1783694
25886 1783694 1765390 1760398 1755570 1802438 1781960 1739892 1750467 1848415 1785858 1705534 1664106 1671619
25874 1671619 1699032 1751829 1777201 1743278 1669691 1685786 1735688 1795924 1853052 1818728 1811021
25863 1811021 1882386 1829956 1813074 1848527 1858778 1887986 1823180 1697853 1672054 1762545 1814528
25852 1814528 1862973 1913304 1900579 1770645 1736836 1734021 1791313 1807936 1831605 1814219 1787563
25841 1787563 1735301 1691834 1776013 1731793 1673784 1711656 1774860 1769246 1756524 1784608 1818238
25830 1818238 1704605 1625551 1710832 1739620 1771669 1756389 1740882 1770039 1806086 1792393 1750521
25819 1750521 1813830 1783966 1770532 1731110 1676022 1701771 1742993 1748160 1813461 1854536 1883019
$$ packed form
25897A771234j09924n3845J7247L3092P3227j3742J0146M1153J6879k0556J8783
25886A783694j8304m992m828M6868k0478m2068J0575R7948o2557q0324m1428P513
25874A671619K7413N2797K5372l3923p3587J6095M9902O0236N7128l4324p707
25863A811021P1365n2430j6882L5453J0251K9208o4806j25327k5799R0491N1983
25852A814528M8445N0331j2725j29934l3809k815N7292J6623K3669j7386k6656
25841A787563n2262m3467Q4179m4220n8009L7872O3204n614j2722K8084L3630
25830A818238j13633p9054Q5281K8788L2049j5280j5507K9157L6047j3693m1872
25819A750521O3309k9864j3434l9422n5088K5749M1222N167O5301M1075K8483
$$ plain form
25808 1883019 1868873 1799105 1770522 1774793 1789342 1834812 1797776 1834812 1877810 1910720 1898331
25797 1898331 1898707 1855221 1771939 1750237 1650537 1603490 1712364 1718740 1691633 1755989 1785358 1805182
25785 1805182 1835252 1831535 1861729 1804078 1803444 1818140 1837846 1850434 1849816 1813684 1775684 1766077
25773 1766077 1711420 1756326 1783427 1801755 1832080 1867512 1866242 1816285 1865215 1867232 1920578 1979176
25761 1979176 1969738 1916597 1917290 1885968 1822453 1774699 1789179 1736513 1809547 1820329 1869214 1933623
25749 1933623 1896832 1787376 1726832 1800987 1907374 1971224 1930984 1881678 1908187 1886588 1942723
25738 1942723 1993252 1898789 1848109 1824183 1810201 1824516 1833901 1803418 1823666 1928073 1966718
25727 1966718 1989323 2037194 2028827 1997725 1963771 1940566 1890803 1818487 1802333 1865793 1875224 1917782
$$ packed form
25808A883019j4146o9768k8583M271J4549M5470l7036L7036M2998L2910j2389
25797A898331L76m3486q3282k1702r9700m7047J08874O376k7107O4356K9369J9824
25785A805182L0070l717L0194n7651o34J4696J9706J2588o18l6132l8000r607
25773A766077n4657M4906K7101J8328L0325L5432j270m9957M8930K017N3346N8598
25761A979176r438n3141O93l1322o3515m7754J4480n2666P3034J0782M8885O4409
25749A933623l6791j09456o0544P4155J06387O3850m0240m9306K6509k1599N6135
25738A942723N0529r4463n0680k3926j3982J4315R385l0483K0248J04407L8645
25727A966718K2605M7871q367l1102l3954k3205m9763p2316j6154O3460R431M2558
$$ plain form
25715 1917782 1889933 1885792 1857205 1818634 1772138 1772731 1901796 1857115 1808438 1824139 1786670 1741559
25703 1741559 1651297 1662064 1646915 1734734 1827203 1785297 1805522 1809829 1850816 1863496 1777761
25692 1777761 1755318 1751041 1819705 1911479 1877751 1899961 1871115 1920346 1851333 1860972 1873826 1854504
25680 1854504 1767164 1737566 1749858 1762232 1840772 1884329 1790700 1744749 1804789 1877954 1946617
25669 1946617 2013434 1953404 1860070 1869271 1899954 1869903 1874596 1873079 1881987 1840439 1775255 1796165
25657 1796165 1894792 1921661 1866875 1810472 1801543 1814880 1835163 1823542 1893275 1864738 1922522
25646 1922522 1928037 1903738 1827254 1793777 1744557 1758059 1735966 1748980 1758116 1725330 1740814 1786106
25634 1786106 1823938 1854869 1905262 1972576 1966794 1987746 1929210 1870386 1868605 1982340 2001493
$$ packed form
25715A917782k7849m141k8587l8571m6496N93J29065m4681m8677J5701l7469m5111
25703A741559r0262J0767j5149Q7819R2469m1906K0225M307M0987J2680q5735
25692A777761k2443m277O8664R1774l3728K2210k8846M9231o9013R639J2854j9322
25680A854504q7340k9598J2292J2374P8540M3557r3629m5951O0040P3165O8663
25669A946617O6817o0030r3334R201L0683l0051M693j517Q908m1548o5184K0910
25657A796165R8627K6869n4786n6403q929J3337K0283j1621O9733k8537N7784
25646A922522N515k4299p6484l3477m9220J3502k2093J3014R136l2786J5484M5292
25634A786106L7832L0931N0393O7314n782K0952n8536n8824j781J13735J9153
$$ plain form
25623 2001493 1937627 1944993 1941400 1916273 1988563 1953417 1957452 1961717 1973170 2050600 2050733 1996842
25611 1996842 1988668 1982781 1981593 1984556 1871260 1885070 1899413 1850417 1778863 1829596 1954284 1988794
25599 1988794 1927244 1856820 1882697 1919917 1856140 1774714 1823290 1852363 1951545 1949554 1909321
25588 1909321 1944183 1939931 1893488 1856002 1807757 1861985 1919893 1936819 1952338 1972920 1897551
25577 1897551 1872192 1883359 1999448 2000864 1986997 2005399 2044170 2034192 2022839 1949256 1864912
25566 1864912 1838816 1792236 1789733 1857480 1894250 1990393 2002885 1880043 1923864 1884473 1810710
25555 1810710 1774121 1820499 1987073 1988912 2044274 2011793 1936811 1860088 1834431 1846673 1877168
25544 1877168 1852937 1826544 1881316 1825711 1746683 1766984 1752491 1732218 1772786 1836989 1892187
$$ packed form
25623B001493o3866P366l593k5127P2290l5146M035M265J1453P7430J33n3891
25611A996842q174n887j188K963j13296J3810J4343m8996p1554N0733J24688L4510
25599A988794o1550p0424K5877L7220o3777q1426M8576K9073R9182j991m0233
25588A909321L4862m252m6443l7486m8245N4228N7908J6926J5519K0582p5369
25577A897551k5359J1167J16089J416j3867J8402L8771r978j1353p3583q4344
25566A864912k6096m6580k503O7747L6770R6143J2492j22842M3821l9391p3763
25555A810710l6589M6378J66574J839N5362l2481p4982p6723k5657J2242L0495
25544A877168k4231k6393N4772n5605p9028K0301j4493k0273M0568O4203N5198
$$ plain form
25533 1892187 1905890 1940614 1907935 1887061 1892610 1851622 1784133 1817590 1800419 1808416 1825808 1837906
25521 1837906 1924164 1961821 1973647 2005276 1894727 1804275 1797102 1820642 1824023 1856068 1887286
25510 1887286 1877296 1856403 1878127 1876571 1873078 1833868 1888857 1907531 1895627 1860980 1841198 1874044
25498 1874044 1887596 1921187 1906979 1889376 1846931 1874737 1887597 1921835 1940301 1904139 1929173
25487 1929173 2020794 2071867 2037773 1928658 1901264 1899762 1904145 1931174 1942167 1914891 1886668
25476 1886668 1929138 1907662 1869549 1958289 2033536 2077791 2038866 2037085 2004067 1948774 2004893
25465 2004893 1997500 1968743 1918594 1897190 1889386 1899801 1929147 1880097 1832348 1912950 1999267 2038975
25453 2038975 2066313 2047651 1949604 1952043 1946066 2019377 2001153 1977708 2035401 2056475 1928058
$$ packed form
25533A892187J3703L4724l2679k0874N549m0988o7489L3457j7171P997J7392J2098
25521A837906Q6258L7657J1826L1629j10549r0452p173K3540L381L2045L1218
25510A887286r990k0893K1724j556l493l9210N4989J8674j1904l4647j9782L2846
25498A874044J3552L3591j4208j7603m2445K7806J2860L4238J8466l6162K5034
25487A929173R1621N1073l4094j09115k7394j502M383K7029J0993k7276k8223
25476A886668M2470k1476l8113Q8740P5247M4255l8925j781l3018n5293N6119
25465B004893p393k8757n0149k1404p804J0415K9346m9050m7749Q0602Q6317L9708
25453B038975K7338j8662r8047K439n977P3311j8224k3445N7693K1074j28417
$$ plain form
25442 1928058 1856694 1889858 1956260 1981771 2043334 2054788 2040976 2016191 2011654 1913377 1913703 1907797
25430 1907797 1913746 1882704 1903591 1953607 1931814 1940678 1939851 1951292 1973232 1906868 1888837 1910274
25418 1910274 1866348 1760141 1819806 1841960 1867255 1918168 1966161 1929145 1999531 2046591 2014855
25407 2014855 1965673 1977955 1901153 1904018 1832144 1774180 1848981 1870746 1867123 1868054 1885966 1945702
25395 1945702 2024109 2084467 2009012 1954989 1911596 1918081 1952384 2010605 2034990 2066787 2007361
25384 2007361 1970457 1896845 1904008 1880550 1915738 1949399 1916815 1905219 1946584 1967653 1937619
25373 1937619 1939655 1940852 1965304 1983865 1943391 1978139 1997842 2039545 2023151 1993777 1976369 1986875
25361 1986875 2012597 1982306 1895935 1882837 2007436 2018554 1978451 1990141 2003395 2045683 1955349
$$ packed form
25442A928058p1364L3164O6402K5511O1563J1454j3812k4785m537r8277L26n906
25430A907797N949l1042K0887N0016k1793Q864q27J1441K1940o6364j8031K1437
25418A910274m3926j06207N9665K2154K5295N0913M7993l7016P0386M7060l1736
25407B014855m9182J2282p6802K865p1874n7964P4801K1765l623R31J7912N9736
25395A945702P8407O0358p5455n4023m3393O485L4303N8221K4385L1797n9426
25384B007361l6904p3612P163k3458L5188L3661l2584j1596M1365K1069l0034
25373A937619K036J197K4452J8561m0474L4748J9703M1703j6394k9374j7408J0506
25361A986875K5722l0291q6371j3098J24599J1118m0103J1690J3254M2288r0334
$$ plain form
25350 1955349 1869131 1822205 1848128 1870297 1884848 1937231 1935216 1966099 1977689 1976900 1974369 1929202
25338 1929202 2012032 2059079 1990695 1989589 2004171 2034648 2031192 2000833 1974693 2041698 2049902 2064035
25326 2064035 2040869 2026388 1996980 1955005 1854701 1817060 1895268 1883132 1909223 2000906 2013101
25315 2013101 2045256 2006613 2037815 2028773 2046057 2042174 2094986 2094841 2086902 2131112 2172469 2150252
25303 2150252 1979202 1913197 1946598 2040730 2050806 2068483 2066338 2034221 2002832 2017478 2010837
25292 2010837 2017568 1980569 1981833 1928356 1959795 1974987 1960249 1965091 1938204 1889338 1965514 1987794
25280 1987794 2012091 2044922 2017711 2055410 2055760 2048122 2064490 2009386 1968280 1988633 1976595 2011845
25268 2011845 2026104 1983072 2043369 2068831 2121214 2086374 2048426 2046268 2055253 2006751 1950722 1908975
$$ packed form
25350A955349q6218m6926K5923K2169J4551N2383k015L0883J1590p89k531m5167
25338A929202Q2830M7047o8384j106J4582L0477l456l0359k6140O7005Q204J4133
25326B064035k3166j4481k9408m1975j00304l7641P8208j2136K6091R1683J2195
25315B013101L2155l8643L1202r042J7284l883N2812j45p939M4210M1357k2217
25303B150252j71050o6005L3401R4132J0076J7677k145l2117l1389J4646o641
25292B010837O731l6999J264n3477L1439J5192j4738M842k6887m8866P6176K2280
25280A987794K4297L2831k7211L7699L50p638J6368n5104m1106K0353j2038L5250
25268B011845J4259m3032O0297K5462N2383l4840l7948k158Q985m8502n6029m1747
$$ plain form
25256 1908975 1862350 1841615 1960094 2066253 2090449 2091105 2102151 2091270 2105133 2134363 2049100
25245 2049100 2018248 2060527 1996573 2088489 2117783 2019353 2028711 2075952 2035941 1959296 1900454
25234 1900454 1883922 1963553 1979677 2031598 2062206 2130286 2121430 2106766 2084019 2037026 1936781
25223 1936781 1933186 1982486 1993134 2016279 2044623 2159134 2192916 2044154 1997911 2031053 2006477
25212 2006477 1940469 1932697 1971328 1973471 1862363 1903579 1965226 2003348 2046702 2147714 2123128
25201 2123128 2073604 1968498 1972824 1982968 1880204 1787215 1832196 2021306 2128044 2106503 2069362
25190 2069362 2057089 2073827 2138759 2205310 2223554 2210747 2166754 2190065 2106725 2052324 2064563
25179 2064563 2057096 1970484 1957894 2123239 2144945 2115038 2070970 2035493 2044863 2052572 2090044 2078465
$$ packed form
25256A908975m6625k0735J18479J06159K4196O56J1046j0881J3863K9230q5263
25245B049100l0852M2279o3954R1916K9294r8430R358M7241m0011p6645n8842
25234A900454j6532P9631J6124N1921L0608O8080q856j4664k2747m6993j00245
25223A936781l595M9300J0648K3145K8344J14511L3782j48762m6243L3142k4576
25212B006477o6008p772L8631K143j11108M1216O1647L8122M3354J01012k4586
25201B123128m9524j05106M326J0144j02764r2989M4981J89110J06738k1541l7141
25190B069362j2273J6738O4932O6551J8244j2807m3993K3311q3340n4401J2239
25179B064563p467q6612j2590J65345K1706k9907m4068l5477R370P709L7472j1579
$$ plain form
25167 2078465 2035037 1990845 1976384 1999646 2039577 2094360 2078050 1981455 1964684 1961762 1961956 1870670
25155 1870670 1864689 1902467 2001944 2039104 1978843 1933728 1917269 2008568 2065504 2161650 2303958
25144 2303958 2232130 2160171 2225325 2138613 2111651 2085952 2084174 2110527 2124860 2119362 2094490 2140648
25132 2140648 2137408 2147790 2108571 2065746 2043338 2089642 2080358 2040242 2033138 2014708 2037231 2137926
25120 2137926 2150783 2109724 2063007 2119307 2168410 2157501 2203121 2125790 2062993 2091303 2137873
25109 2137873 2062540 2070428 2214760 2216069 2156670 2174568 2192062 2185459 2123963 2078249 2066474 2098812
25097 2098812 2095252 2070527 2121121 2175170 2129061 2108972 2104915 2133055 2141098 2049727 2041065 2064790
25085 2064790 2052665 2060929 2004293 1955767 1959670 1930020 1968899 2112867 2185223 2157060 2082943
$$ packed form
25167B078465m3428m4192j4461K3262L9931N4783j6310r6595j6771k922J94r1286
25155A870670n981L7778R9477L7160o0261m5115j6459R1299N6936R6146J42308
25144B303958p1828p1959O5154q6712k6962k5699j778K6353J4333n498k4872M6158
25132B140648l240J0382l9219m2825k2408M6304r284m0116p104j8430K2523J00695
25120B137926J2857m1059m6717N6300M9103j0909M5620p7331o2797K8310M6570
25109B137873p5333P888J44332J309n9399J7898J7494o603o1496m5714j1775L2338
25097B098812l560k4725N0594N4049m6109k0089m057K8140Q043r1371q662K3725
25085B064790j2125Q264n6636m8526L903k9650L8879J43968P2356k8163p4117
$$ plain form
25074 2082943 2005498 2010225 2087142 2104696 2133489 2136696 2086798 2038557 2049240 2053591 2004340 1987524
25062 1987524 2016594 2086914 2060688 2057957 2006624 1922731 1913026 1911586 2018633 2049267 2113111 2164905
25050 2164905 2170941 2141921 2132827 2092675 2123502 2093865 2098134 2140016 2284957 2277037 2277714 2203733
25038 2203733 2172788 2177863 2192143 2143972 2152151 2095938 2053199 2035217 2073051 2030198 2022387 2022060
25026 2022060 2111451 2121516 2112060 2018421 2012520 2128565 2152344 2183395 2171323 2162412 2117355 2078797
25014 2078797 2054825 2064884 2118197 2111118 2063642 2097490 2125847 2190527 2135546 2091937 2025371
25003 2025371 2038168 2097225 2061034 2060457 2052956 2028964 1987547 1978262 2021433 2104123 2105358 2154891
24991 2154891 2145378 2096534 2036468 2092362 2116425 2135554 2206910 2215311 2181916 2230736 2199767 2131728
$$ packed form
25074B082943p7445M727P6917J7554K8793L207m9898m8241J0683M351m9251j6816
25062A987524K9070P0320k6226k731n1333q3893r705j440J07047L0634O3844N1794
25050B164905O036k9020r094m0152L0827k9637M269M1882J44941p920O77p3981
25038B203733l0945N075J4280m8171Q179n6213m2739j7982L7834m2853p811l27
25026B022060Q9391J0065r456r3639n901J16045K3779L1051j2072q911m5057l8558
25014B078797k3972J0059N3313p079m7476L3848K8357O4680n4981m3609o6566
25003B025371J2797N9057l6191n77p501k3992m1417r285M3171Q2690J235M9533
24991B154891r513m8844o0066N5894K4063J9129P1356Q401l3395M8820l0969o8039
$$ plain form
24979 2131728 2155850 2174062 2158454 2114125 2136070 2194901 2174432 2180886 2215233 2272491 2238778
24968 2238778 2208866 2237777 2176427 2076686 2077885 2087185 2117067 2095433 2159799 2169477 2183881 2150936
24956 2150936 2150730 2242382 2250275 2165141 2117828 2099657 2131570 2097935 2108560 2097262 2103490 2022787
24944 2022787 2022873 2128405 2183216 2184330 2279133 2233790 2145973 2129366 2176204 2135953 2130540 2210314
24932 2210314 2226811 2223738 2228508 2207789 2174962 2173337 2139625 2116940 2159849 2127521 2139088 2171922
24920 2171922 2177548 2173888 2225121 2268290 2280616 2271474 2316809 2279531 2280095 2264088 2176743 2136074
24908 2136074 2135968 2117035 2103182 2184421 2220690 2232380 2249717 2242857 2218006 2231354 2230448 2191187
24896 2191187 2224891 2289818 2313764 2340415 2334004 2200101 2090225 2124690 2213789 2276861 2263408
$$ packed form
24979B131728K4122J8212j5608m4329K1945N8831k0469O454L4347N7258l3713
24968B238778k9912K8911o1350r9741J199R300K9882k1634O4366R678J4404l2945
24956B150936k06R1652P893q5134m7313j8171L1913l3635J0625j1298O228q0703
24944B022787Q6J05532N4811J114R4803m5343q7817j6607M6838m0251n413P9774
24932B210314J6497l073M770k0719l2827j625l3712k2685M2909l2328J1567L2834
24920B171922N626l660N1233M3169J2326r142M5335l7278N64j6007q7345m0669
24908B136074j06j8933j3853Q1239L6269J1690J7337o860k4851J3348r06l9261
24896B191187L3704O4927K3946K6651o411j33903j09876L4465Q9099O3072j3453
$$ plain form
24885 2263408 2259489 2280694 2361716 2308954 2277238 2199346 2112735 2135307 2156995 2137689 2248918
24874 2248918 2216311 2149686 2064203 2137126 2211735 2171337 2204965 2245258 2197165 2173313 2254916
24863 2254916 2303371 2361581 2328793 2318095 2288303 2260559 2306314 2256108 2205412 2135155 2129304
24852 2129304 2191108 2227725 2196151 2197184 2221667 2201578 2259295 2345650 2368965 2302802 2286670
24841 2286670 2301609 2258216 2218056 2166416 2132285 2091875 2088784 2138449 2161847 2213230 2176982
24830 2176982 2113537 2127922 2165410 2203270 2229869 2277529 2361474 2313429 2284756 2322682 2304788
24819 2304788 2238954 2203331 2217402 2171354 2179748 2238896 2244936 2209263 2311986 2359711 2317576
24808 2317576 2244192 2223526 2296768 2447617 2400573 2278644 2162386 2155621 2187312 2216360 2263894
$$ packed form
24885B263408l919K1205Q1022n2762l1716p7892q6611K2572K1688j9306J11229
24874B248918l2607o6625q5483P2923P4609m0398L3628M0293m8093k3852Q1603
24863B254916M8455N8210l2788j0698k9792k7744M5755n0206n0696p0257n851
24852B129304O1804L6617l1574J033K4483k0089N7717Q6355K3315o6163j6132
24841B286670J4939m3393m0160n1640l4131m0410l091M9665K3398N1383l6248
24830B176982o3445J4385L7488L7860K6599M7660Q3945m8045k8673L7926j7894
24819B304788o5834l5623J4071m6048Q394N9148O040l5673J02723M7725m2135
24808B317576p3384k0666P3242J50849m7044j21929j16258o765L1691K9048M7534
$$ plain form
24797 2263894 2265952 2291849 2386163 2454164 2422048 2367132 2290552 2335322 2358950 2264524 2222906
24786 2222906 2279405 2257490 2200744 2153959 2157107 2276546 2358819 2369528 2302694 2275933 2180581
24775 2180581 2208854 2236887 2212105 2214483 2264588 2322153 2313226 2223160 2245943 2407079 2442149
24764 2442149 2331654 2229436 2261089 2277218 2316699 2286162 2311925 2369938 2401415 2376615 2306132
24753 2306132 2284754 2293889 2307438 2295690 2275242 2218170 2214651 2242395 2216916 2237676 2221667 2222246
24741 2222246 2305958 2305439 2256196 2244822 2272425 2255916 2216888 2204180 2302890 2342613 2326468 2329737
24729 2329737 2380409 2367047 2333309 2350635 2420239 2390212 2370523 2402946 2371223 2298417 2372179
24718 2372179 2443639 2480226 2431624 2349330 2302272 2202178 2177049 2224050 2223099 2200984 2219911
$$ packed form
24797B263894K058K5897R4314O8001l2116n4916p6580M4770K3628r4426m1618
24786B222906N6499k1915n6746m6785L148J19439Q2273J0709o6834k6761r5352
24775B180581K8273K8033k4782K378N0105N7565q927r0066K2783J61136L5070
24764B442149j10495j02218L1653J6129L9481l0537K5763N8013L1477k4800p0483
24753B306132k1378R135J3549j1748k0448n7072l519K7744k5479K0760j6009N79
24741B222246Q3712n19m9243j1374K7603j6509l9028j2708R8710L9723j6145L269
24729B329737N0672j3362l3738J7326O9604l0027j9689L2423l1723p2806P3762
24718B372179P1460L6587m8602q2294m7058j00094k5129M7001r51k2115J8927
$$ plain form
24707 2219911 2200411 2218369 2233201 2302555 2373255 2414612 2408919 2343386 2263913 2242651 2226159
24696 2226159 2277014 2360843 2411671 2355950 2366834 2384451 2358573 2357349 2338880 2272250 2294091
24685 2294091 2318755 2297806 2306976 2266328 2210024 2202766 2227112 2219382 2203545 2243660 2334307 2377327
24673 2377327 2312875 2247302 2225474 2256212 2255292 2219455 2212497 2254533 2286417 2386808 2346239 2291396
24661 2291396 2188117 2198797 2291775 2312783 2256354 2221238 2326306 2355516 2315867 2338136 2353201
24650 2353201 2314469 2306646 2292053 2315093 2345149 2408238 2504092 2524247 2511828 2321919 2157023
24639 2157023 2214617 2282504 2286250 2265718 2261710 2292497 2292483 2283560 2199494 2209088 2244594 2290356 2401815
24626 2401815 2396412 2398551 2393012 2368901 2334877 2339978 2328802 2363545 2362743 2371788 2348141 2419949 2502833
$$ packed form
24707B219911j9500J7958J4832O9354P0700M1357n693o5533p9473k1262j6492
24696B226159N0855Q3829N0828n5721J0884J7617k5878j224j8469o6630K1841
24685B294091K4664k0949R170m0648n6304p258K4346p730j5837M0115R0647M3020
24673B377327o4452o5573k1828L0738r20l5837o958M2036L1884J00391m0569n4843
24661B291396j03279J0680R2978K1008n6429l5116J05068K9210l9649K2269J5065
24650B353201l8732p823j4593K3040L0056O3089R5854K0155j2419j89909j64896
24639B157023N7594O7887L746k0532m008L0787j4q923q4066R594L5506M5762J11459
24626B401815n403K139n539k4111l4024N101j1176L4743q02R045k3647P1808Q2884
$$ plain form
24613 2502833 2501482 2483633 2466444 2397456 2373899 2338221 2326617 2263552 2312565 2301044 2272549
24602 2272549 2244175 2254175 2332351 2334940 2366840 2434349 2426432 2397153 2410072 2420056 2372257 2320059
24590 2320059 2347626 2332936 2362272 2347725 2305022 2305565 2347694 2349843 2353083 2384951 2356509 2463872
24578 2463872 2488518 2436538 2385980 2370031 2361820 2357987 2390898 2453071 2515259 2452469 2363074 2425380
24566 2425380 2375308 2320817 2448351 2508960 2562756 2583455 2546005 2498069 2480455 2453349 2436657
24555 2436657 2517640 2499913 2501679 2482441 2384502 2339188 2406471 2325097 2298640 2320913 2369475
24544 2369475 2388622 2351559 2306961 2364310 2436714 2513985 2429508 2430823 2492252 2576494 2535352
24533 2535352 2533166 2529957 2473049 2465766 2454760 2465410 2422713 2388198 2341394 2406473 2520520 2437151
$$ packed form
24613B502833j351j7849j7189o8988k3557l5678j1604o3065M9013j1521k8495
24602B272549k8374J0000P8176K589L1900O7509p917k9279J2919R984m7799n2198
24590B320059K7567j4690K9336j4547m2703N43M2129K149L240L1868k8442J07363
24578B463872K4646n1980n0558j5949q211l833L2911O2173O2188o2790q9395O2306
24566B425380n0072n4491J27534O0609N3796K0699l7450m7936j7614k7106j6692
24555B436657Q0983j7727J766j9238r7939m5314O7283q1374k6457K2273M8562
24544B369475J9147l7063m4598N7349P2404P7271q4477J315O1429Q4242m1142
24533B535352k186l209n6908p283j1006J0650m2697l4515m6804O5079J14047q3369
$$ plain form
24521 2437151 2453406 2440374 2319703 2344167 2369823 2333320 2336418 2350424 2429997 2476713 2509911
24510 2509911 2495327 2485200 2490802 2481098 2518337 2496152 2410124 2436275 2492182 2515300 2500636 2503655
24498 2503655 2482775 2379730 2369101 2458165 2504981 2513987 2491659 2467164 2476651 2512056 2536662
24487 2536662 2503766 2410083 2407550 2423404 2422481 2466081 2418818 2465008 2482432 2402620 2370705 2444719
24475 2444719 2500410 2462386 2465187 2492313 2579420 2579695 2623477 2558379 2512677 2517354 2567328 2599404
24463 2599404 2580613 2581839 2551384 2512645 2459289 2483506 2470114 2403534 2447012 2452635 2454658 2393734
24451 2393734 2367909 2387220 2375811 2411787 2431856 2407432 2396803 2420141 2413670 2479330 2531713
24440 2531713 2569783 2562294 2477610 2390025 2419949 2475531 2457358 2442800 2423745 2408517 2458718
$$ packed form
24521B437151J6255j3032j20671K4464K5656l6503L098J4006P9573M6716L3198
24510B509911j4584j0127N602r704L7239k2185q6028K6151N5907K3118j4664L019
24498B503655k0880j03045j0629Q9064M6816R006k2328k4495R487L5405K4606
24487B536662l2896r3683k533J5854r23M3600m7263M6190J7424p9812l1915P4014
24475B444719N5691l8024K801K7126Q7107K75M3782o5098m5702M677M9974L2076
24463B599404j8791J226l0455l8739n3356K4217j3392o6580M3478N623K023o0924
24451B393734k5825J9311j1409L5976K0069k4424j0629K3338o471O5660N2383
24440B531713L8070p489q4684q7585K9924N5582j8173j4558j9055j5228N0201
$$ plain form
24429 2458718 2458603 2430011 2494108 2473855 2494727 2535481 2499324 2478694 2573359 2589162 2601543 2530197
24417 2530197 2403352 2434431 2483232 2529133 2456817 2496572 2503977 2457456 2464543 2462731 2464072 2495828
24405 2495828 2472111 2491283 2595267 2556946 2619604 2683350 2815660 2820403 2774110 2694447 2542860
24394 2542860 2434095 2376025 2439751 2533887 2505302 2456014 2387767 2347589 2362392 2423219 2487572
24383 2487572 2433223 2461451 2492684 2462332 2618563 2641923 2541013 2538762 2460132 2567675 2578479
24372 2578479 2493696 2571683 2584735 2559344 2509452 2581806 2652157 2593164 2492415 2553238 2555785
24361 2555785 2530712 2470143 2604636 2693961 2705477 2566257 2541106 2528828 2513951 2521338 2584578
24350 2584578 2630380 2634521 2601805 2479117 2484089 2523049 2494086 2489797 2529948 2568705 2619143 2619968
$$ packed form
24429B458718j15k8592O4097k0253K0872M0754l6157k0630R4665J5803J2381p1346
24417B530197j26845L1079M8801M5901p2316L9755P405m6521P087j812J341L1756
24405B495828k3717J9172J03984l8321O2658O3746J32310M743m6293p9663j51587
24394B542860j08765n8070O3726R4136k8585m9288o8247m0178J4803O0827O4353
24383B487572n4349K8228L1233l0352J56231K3360j00910k251p8630J07543J0804
24372B578479q4783P7987J3052k5391m9892P2354P0351n8993j00749O0823K547
24361B555785k5073o0569J34493Q9325J1516j39220k5151j2278j4877P387O3240
24350B584578M5802M141l2716j22688M972L8960k8963m289M0151L8757N0438Q25
$$ plain form
24338 2619968 2549867 2512076 2467470 2532225 2559990 2624018 2612159 2612640 2678002 2691915 2708543 2717153
24326 2717153 2670721 2656666 2679333 2615774 2606461 2654636 2651680 2590384 2591469 2530450 2532755 2582332
24314 2582332 2494638 2441973 2453987 2520656 2529793 2530600 2595704 2509690 2489734 2586287 2701437 2753686
24302 2753686 2721111 2622405 2535669 2596617 2684165 2703215 2750451 2743373 2738088 2862976 2737474
24291 2737474 2690505 2786073 2717442 2756718 2879093 2800842 2673848 2588799 2518156 2516284 2553028
24280 2553028 2611853 2608942 2662528 2645808 2528314 2430957 2520894 2642702 2650784 2679184 2744984
24269 2744984 2761506 2738906 2720491 2709066 2662337 2545209 2550851 2508616 2508989 2600890 2652251 2635441
24257 2635441 2660866 2677319 2688994 2703582 2720816 2700951 2682775 2642087 2631504 2559471 2541538
$$ packed form
24338B619968p0101l7791m4606O4755K7765O4028j1859M81O5362J3913J6628Q610
24326B717153m6432j4055K2667o3559r313M8175k956o1296J085o1019K305M9577
24314B582332q7694n2665J2014O6669R137Q07O5104q6014j9956R6553J15150N2249
24302B753686l2575r8706q6736O0948Q7548J9050M7236p078n285J24888j25502
24291B737474m6969R5568o8631L9276J22375p8251j26994q5049p0643j872L6744
24280B553028N8825k911N3586j6720j17494r7357Q9937J21808Q082K8400O5800
24269B744984J6522k2600j8415j1425m6729j17128N642m2235L73R1901N1361j6810
24257B635441K5425J6453J1675J4588J7234j9865j8176m0688j0583p2033j7933
$$ plain form
24246 2541538 2569235 2603172 2657902 2633540 2627005 2681851 2689015 2621752 2658621 2720795 2698291 2660500
24234 2660500 2697846 2762716 2721352 2731908 2764508 2898351 2910891 2830901 2697229 2695012 2724471
24223 2724471 2761124 2719768 2641448 2562715 2628719 2659407 2696465 2676531 2749458 2771744 2630939
24212 2630939 2603600 2672585 2670002 2681842 2721165 2684317 2656712 2729255 2727079 2624446 2613987
24201 2613987 2609184 2609399 2630260 2639647 2638966 2674822 2718556 2792752 2740215 2670114 2679775 2648061 2608086
24188 2608086 2682785 2824253 2802042 2740501 2746161 2756735 2836283 2875019 2780742 2715799 2666801
24177 2666801 2676800 2633434 2718719 2735902 2698875 2707012 2745056 2748392 2741927 2810541 2885752 2810711
24165 2810711 2760558 2730792 2725681 2752104 2816566 2888302 2872599 2830510 2865526 2867646 2814482 2750808
$$ packed form
24246B541538K7697L3937N4730k4362o535N4846P164o7263L6869O2174k2504l7791
24234B660500L7346O4870m1364J0556L2600J33843J2540p9990j33672k217K9459
24223B724471L6653m1356p8320p8733O6004L0688L7058j9934P2927K2286j40805
24212B630939k7339O8985k583J1840L9323l6848k7605P2543k176j02633j0459
24201B613987m803K15K0861R387o81L5856M3734P4196n2537p0101R661l1714l9975
24188B608086P4699J41468k2211o1541N660J0574P9548L8736r4277o4943m8998
24177B666801R999m3366Q5285J7183l7027Q137L8044L336o465O8614P5211p5041
24165B810711n0153k9766n111K6423O4462P1736j5703m2089L5016K120n3164o3674
$$ plain form
24153 2750808 2790131 2891401 2868391 2820434 2793138 2733516 2784009 2863191 2882546 2853050 2819619
24142 2819619 2794789 2815903 2786714 2714064 2753862 2789172 2789227 2822503 2861553 2875796 2827034 2780092
24130 2780092 2809434 2838236 2861494 2828786 2864804 2819325 2803785 2816916 2754726 2736444 2738875
24119 2738875 2733817 2749771 2794398 2817845 2846335 2792658 2717310 2721592 2786475 2740024 2786558 2855894
24107 2855894 2904135 2949664 2917442 2939005 2929607 2906986 2905989 2910528 2875088 2891227 2893178 2857321
24095 2857321 2813480 2745655 2770819 2807396 2847283 2878398 2929766 2928685 2924808 2952846 2978247 2953213
24083 2953213 2881708 2876297 2891583 2873706 2900074 2877661 2878622 2891792 2893767 2902092 2920785 2860917
24071 2860917 2780487 2894420 2880709 2816727 2846742 2859688 2863641 2787904 2729493 2826349 2844771
$$ packed form
24153B750808L9323J01270k3010m7957k7296n9622N0493P9182J9355k9496l3431
24142B819619k4830K1114k9189p2650L9798L5310N5L3276L9050J4243m8762m6942
24130B780092K9342K8802K3258l2708L6018m5479j5540J3131o2190j8282K431
24119B738875n058J5954M4627K3447K8490n3677p5348M282O4883m6451M6534O9336
24107B855894M8241M5529l2222K1563r398k2621r97M539l5440J6139J951l5857
24095B857321m3841o7825K5164L6577L9887L1115N1368j081l877K8038K5401k5034
24083B953213p1505n411J5286j7877K6368k2413R61J3170J975Q325J8693n9868
24071B860917q0430J13933j3711o3982L0015J2946L953p5737n8411R6856J8422
$$ plain form
24060 2844771 2869999 2821383 2796230 2813831 2844490 2993894 3035353 3078185 3002539 2937328 2932633
24049 2932633 2936658 2956297 2868238 2781343 2777416 2831859 2899275 2853389 2847408 2904100 2970679 2959800
24037 2959800 2998415 2949775 2890531 2874495 2832282 2908850 2900168 2870049 2998998 3056394 3004135
24026 3004135 2946783 2955133 2970253 3030672 3035329 3074382 2990085 2913115 2887790 2953319 2977957 2989493
24014 2989493 2949922 2903538 2941626 2968405 2942215 2923179 2988570 2977933 2926378 2918751 3004726
24003 3004726 3056452 3055531 3059290 2974732 2938340 2996067 3016024 2928986 2878319 2861722 2891914 2937292
23991 2937292 2917885 2921526 2990657 2993267 3063631 3028478 3104139 3093386 3127228 3130370 3055178 3053531
23979 3053531 3015602 3115144 3158322 3125899 3094408 3025036 2955606 3025434 3128816 3130194 3115256
$$ packed form
24060B844771K5228m8616k5153J7601L0659J49404M1459M2832p5646o5211m695
24049B932633M025J9639q8059q6895l927N4443O7416m5886n981N6692O6579j0879
24037B959800L8615m8640n9244j6036m2213P6568q682l0119J28949N7396n2259
24026C004135n7352Q350J5120O0419M657L9053q4297p6970k5325O5529K4638J1536
24014B989493l9571m6384L8088K6779k6190j9036O5391j0637n1555p627Q5975
24003C004726N1726r21L759q4558l6392N7727J9957q7038n0667j6597L0192M5378
23991B937292j9407L641O9131K610P0364l5153P5661j0753L3842L142p5192j647
23979C053531l7929R9542M3178l2423l1491o9372o9430O9828J03382J378j4938
$$ plain form
23968 3115256 3118376 3085401 3055252 3054533 3056691 3069749 3042790 3014405 3039231 3115605 3156665 3160413
23956 3160413 3098598 3173390 3184478 3119508 3079390 3152073 3179521 3185653 3176332 3186582 3193960 3211396
23944 3211396 3159174 3209260 3270098 3199668 3107783 3053479 3015096 3019713 2996511 2974545 2944674
23933 2944674 2925414 3009184 3022313 3061125 3011667 3026890 3062681 3062903 3053094 3109993 3162766 3168450
23921 3168450 3159531 3106408 3050033 2994154 2996360 3090343 3093888 3109797 3206520 3270507 3271428 3299258
23909 3299258 3306993 3255587 3218177 3162580 3124190 3097251 3086575 3112224 3079692 3089174 3165523 3242671
23897 3242671 3190324 3168333 2997023 2950786 3028304 3212775 3329509 3267021 3240799 3193106 3170380
23886 3170380 3120144 3120723 3065430 3057640 3117644 3147916 3123016 3104894 3180412 3254939 3330497 3374442
$$ packed form
23968C115256L120l2975l0149p19K158J3058k6959k8385K4826P6374M1060L748
23956C160413o1815P4792J1088o4970m0118P2683K7448O132r321J0250P378J7436
23944C211396n2222N0086O0838p0430r1885n4304l8383M617k3202k1966k9871
23933B944674j9260Q3770J3129L8812m9458J5223L5791K22r809N6899N2773N684
23921C168450q919n3123n6375n5879K206R3983L545J5909R6723O3987R21K7830
23909C299258P735n1406l7410n5597l8390k6939j0676K5649l2532R482P6349P7148
23897C242671n2347k1991j71310m6237P7518J84471J16734o2488k6222m7693k2726
23886C170380n0236N79n5293p790O0004L0272k4900j8122P5518P4527P5558M3945
$$ plain form
23874 3374442 3312550 3270047 3230502 3162509 3142203 3193299 3223776 3182730 3216250 3299716 3262526
23863 3262526 3195962 3249182 3307389 3226978 3150040 3113391 3163838 3167481 3182217 3188852 3217817 3219012
23851 3219012 3212150 3245987 3247160 3310822 3326184 3256910 3191380 3089972 3151292 3246674 3244390 3317400
23839 3317400 3300114 3260444 3307417 3306320 3295165 3324901 3322999 3306621 3294701 3358019 3376166 3347027
23827 3347027 3352401 3275640 3161579 3089188 3108260 3119962 3174691 3246355 3173461 3159832 3186204
23816 3186204 3086040 3113457 3199644 3265467 3340816 3355130 3310932 3282273 3243243 3368158 3410949
23805 3410949 3348844 3322568 3375294 3244010 3250085 3344284 3344464 3337879 3262644 3297124 3361397 3341430
23793 3341430 3270636 3282767 3300894 3300289 3319351 3301152 3292151 3219244 3255064 3350304 3370775 3365098
$$ packed form
23874C374442o1892m2503l9545o7993k0306N1096L0477m1046L3520Q3466l7190
23863C262526o6564N3220N8207q0411p6938l6649N0447L643J4736O635K8965J195
23851C219012o862L3837J173O3662J5362o9274o5530j01408O1320R5382k284P3010
23839C317400j7286l9670M6973j097j1155K9736j902j6378j1920O3318J8147k9139
23827C347027N374p6761j14061p2391J9072J1702N4729P1664p2894j3629K6372
23816C186204j00164K7417Q6187O5823P5349J4314m4198k8659l9030J24915M2791
23805C410949o2105k6276N2726j31284O075R4199J80o585p5235L4480O4273j9967
23793C341430p0794J2131J8127o05J9062j8199r001p2907L5820R5240K0471n677
$$ plain form
23781 3365098 3309396 3292072 3299700 3274746 3319245 3340486 3344802 3300729 3317141 3416151 3491743 3426177
23769 3426177 3419745 3411941 3398654 3428358 3453840 3504204 3473910 3468886 3520408 3497676 3493563 3526418
23757 3526418 3474276 3394297 3421808 3480735 3447792 3443824 3386358 3323169 3333233 3373638 3425898
23746 3425898 3395507 3395049 3520986 3505934 3531872 3529450 3543392 3518358 3440011 3460481 3493145 3451770
23734 3451770 3368642 3371016 3420873 3358933 3435948 3506628 3547305 3549970 3481307 3525399 3588656 3585833
23722 3585833 3562062 3580599 3604512 3585064 3658304 3678887 3562785 3540472 3573466 3514876 3468483
23711 3468483 3519550 3570107 3526470 3597191 3579791 3513028 3551080 3481853 3438285 3456025 3570652
23700 3570652 3588421 3607556 3585783 3544655 3499766 3475225 3353369 3362203 3406694 3541157 3573617
$$ packed form
23781C365098n5702j7324P628k4954M4499K1241M316m4073J6412R9010P5592o5566
23769C426177o432p804j3287K9704K5482N0364l0294n024N1522k2732m113L2855
23757C526418n2142p9979K7511N8927l2943l968n7466o3189J0064M0405N2260
23746C425898l0391m58J25937j5052K5938k422J3942k5034p8347K0470L2664m1375
23734C451770q3128K374M9857o1940P7015P0680M0677K665o8663M4092O3257k823
23722C585833k3771J8537K3913j9448P3240K0583j16102k2313L2994n8590m6393
23711C468483N1067N0557m3637P0721j7400o6763L8052o9227m3568J7740J14627
23700C570652J7769J9135k1773m1128m4889k4541j21856Q834M4491J34463L2460
$$ plain form
23689 3573617 3624251 3604658 3581616 3592304 3699529 3718399 3697309 3632332 3639855 3573371 3534914
23678 3534914 3591597 3651467 3664961 3674177 3689413 3604207 3526985 3421118 3431488 3462870 3546435
23667 3546435 3596934 3576377 3607174 3621308 3606785 3544546 3563932 3587379 3616498 3629498 3621903
23656 3621903 3677247 3726045 3793156 3750571 3736269 3731570 3670636 3662701 3664195 3634594 3663017 3658081
23644 3658081 3732628 3697221 3671015 3670590 3598984 3598550 3625945 3697668 3709505 3687978 3654622 3609460
23632 3609460 3692575 3695177 3718799 3731079 3710928 3689532 3691292 3772322 3786342 3696536 3635503 3638627
23620 3638627 3738068 3741043 3722050 3775154 3804046 3778214 3824869 3883225 3948915 3983753 3958874
23609 3958874 3845350 3775706 3832635 3880770 3881062 3918852 3951933 3929076 3852346 3877481 3903461
$$ packed form
23689C573617N0634j9593k3042J0688J07225J8870k1090o4977P523o6484l8457
23678C534914N6683N9870J3494R216J5236q5206p7222j05867J0370L1382Q3565
23667C546435N0499k0557L0797J4134j4523o2239J9386K3447K9119J3000p595
23656C621903N5344M8798O7111m2585j4302m699o0934p935J494k9601K8423m936
23644C658081P4547l5407k6206m25p1606m34K7395P1723J1837k1527l3356m5162
23632C609460Q3115K602K3622J2280k0151k1396J760Q1030J4020q9806o1033L124
23620C638627R9441K975j8993N3104K8892k5832M6655N8356O5690L4838k4879
23609C958874j13524o9644N6929M8135K92L7790L3081k2857p6730K5135K5980
$$ plain form
23598 3903461 3858861 3810399 3743931 3804417 3882055 3822809 3773815 3750275 3749956 3814412 3845438 3925056
23586 3925056 4014816 4020745 3963635 3946643 3913234 3868436 3788781 3733391 3743502 3817853 3865508
23575 3865508 3941606 3976247 3882501 3867871 3921217 3900285 3959350 3999720 4027267 4024934 4060745
23564 4060745 4036972 3934490 3894196 3839185 3849138 3875143 3866225 3901385 3982315 4070210 4033603
23553 4033603 3993499 4009043 3956202 4003276 4075528 4077577 4081394 4152132 4102242 4044085 3971442 3918464
23541 3918464 3963417 3932211 3984733 4033766 4081923 4095354 4020736 4012859 4052552 4106159 4126518
23530 4126518 3984992 4001147 4100307 4098229 4047847 3992763 3921621 3959639 4101091 4101123 4079759 4149241
23518 4149241 4183184 4201430 4192839 4148832 4132646 4107648 4168652 4113727 4058558 4062333 4111016 4239798
$$ packed form
23598C903461m4600m8462o6468O0486P7638n9246m8994k3540l19O4456L1026P9618
23586C925056Q9760N929n7110j6992l3409m4798p9655n5390J0111P4351M7655
23575C865508P6098L4641r3746j4630N3346k0932N9065M0370K7547k333L5811
23564D060745k3773j02482m0294n5011R953K6005q918L5160Q0930Q7895l6607
23553D033603m0104J5544n2841M7074P2252K049L817P0738m9890n8157p2643n2978
23541C918464M4953l1206N2522M9033M8157J3431p4618p877L9693N3607K0359
23530D126518j41526J6155R9160k078n0382n5084p1142L8018J41452L2k1364O9482
23518D149241L3943J8246q591m4007j6186k4998O1004n4925n5169L775M8683J28782
$$ plain form
23506 4239798 4325761 4306079 4240746 4142818 4132545 4092129 4073487 4107720 4187686 4190702 4162270
23495 4162270 4137732 4169679 4226943 4238221 4264099 4260949 4202213 4220560 4312709 4369896 4336670
23484 4336670 4282998 4298151 4308020 4344632 4357424 4296278 4259708 4234631 4245793 4289998 4265883
23473 4265883 4312181 4381661 4397404 4453600 4507959 4541775 4473585 4402213 4372878 4271697 4319935
23462 4319935 4358632 4344611 4345705 4381836 4456424 4486759 4514505 4453150 4448113 4492428 4462939 4454596
23450 4454596 4479264 4561069 4507005 4445556 4386662 4401748 4467212 4411672 4404309 4475495 4536474
23439 4536474 4560370 4559198 4597730 4637531 4727176 4746637 4689501 4662916 4662313 4695939 4718174 4762073
23427 4762073 4703146 4606985 4585222 4659922 4654496 4708710 4729493 4752350 4771519 4739717 4801210
$$ packed form
23506D239798Q5963j9682o5333r7928j0273m0416j8642L4233P9966L016k8432
23495D162270k4538L1947N7264J1278K5878l150n8736J8347R2149N7187l3226
23484D336670n3672J5153R869L6612J2792o1146l6570k5077J1162M4205k4115
23473D265883M6298O9480J5743N6196N4359L3816o8190p1372k9335j01181M8238
23462D319935L8697j4021J094L6131P4588L0335K7746o1355n037M4315k9489q343
23450D454596K4668Q1805n4064o1449n8894J5086O5464n5540p363P1186O0979
23439D536474K3896j172L8532L9801Q9645J9461n7136k6585o03L3626K2235M3899
23427D762073n8927r6161k1763P4700n426N4214K0783K2857J9169l1802O1493
$$ plain form
23416 4801210 4936075 4975170 5017637 5057870 5068607 5008221 4960767 5046515 5125962 5209987 5288061
23405 5288061 5422225 5602032 5646981 5751961 5911930 6028142 6115696 5930106 5423457 4610278
23395 4610278 3945050 3626520 3534324 3578648 3664438 3761918 3858647 3889126 4011673 4051588 4053141
23384 4053141 4099331 4182969 4169613 4258552 4256055 4289001 4268704 4281424 4292265 4315394 4350741
23373 4350741 4318902 4317010 4371679 4466098 4505134 4425493 4392058 4409101 4452911 4406629 4394569
23362 4394569 4497490 4484996 4453800 4453322 4460810 4496272 4522722 4540788 4593341 4602511 4659924 4685479
23350 4685479 4633255 4648397 4720250 4712621 4695660 4723944 4751469 4721345 4661569 4638031 4645089 4650789
23338 4650789 4637166 4602715 4685466 4829590 4860565 4873451 4802997 4731880 4816750 4843390 4885477
$$ packed form
23416D801210J34865L9095M2467M0233J0737o0386m7454Q5748P9447Q4025P8074
23405E288061J34164J79807M4949J04980J59969J16212Q7554j85590n06649q13179
23395D610278o65228l18530r2196M4324Q5790R7480R6729L0479J22547L9915J553
23384D053141M6190Q3638j3356Q8939k497L2946k0297J2720J0841K3129L5347
23373D350741l1839j892N4669R4419L9036p9641l3435J7043M3810m6282j2060
23362D394569J02921j2494l1196m78P488L5462K6450J8066N2553R170N7413K5555
23350D685479n2224J5142P1853p629j6961K8284K7525l0124n9776k3538P058N700
23338D650789j3623l4451Q2751J44124L0975J2886p0454p1117Q4870K6640M2087
$$ plain form
23327 4885477 4867339 4844792 4886731 4922020 4932013 4911642 4874210 4904793 4920907 4866289 4969373
23316 4969373 5061589 5035185 5003499 4931026 4914550 5013126 5043824 5012674 4984005 4916523 4876781
23305 4876781 4878003 4959025 5019749 5049292 5020129 5029525 5000366 5024486 5125656 5163589 5170012 5122219
23293 5122219 5041053 5000894 5003245 5073123 5164903 5233913 5175847 5210303 5284581 5335322 5317121
23282 5317121 5275616 5271555 5249614 5270724 5363593 5314531 5309447 5322802 5358131 5356739 5352203 5305000
23270 5305000 5276409 5301732 5324653 5287401 5311310 5364079 5390058 5408088 5408298 5417487 5398018 5384537
23258 5384537 5351081 5386382 5435391 5449527 5542241 5593250 5588780 5541020 5535270 5552279 5561307 5564421
23246 5564421 5641378 5709171 5692345 5679302 5666912 5696596 5726457 5621054 5544156 5590691 5588135
$$ packed form
23327D885477j8138k2547M1939L5289R993k0371l7432L0583J6114n4618J03084
23316D969373R2216k6404l1686p2473j6476R8576L0698l1150k8669o7482l9742
23305D876781J222Q1022O0724K9543k9163R396k9159K4120J01170L7933O423m7793
23293E122219q1166m0159K351O9878R1780O9010n8066L4456P4278N0741j8201
23282E317121m1505m061k1941K1110R2869m9062n084J3355L5329j392m536m7203
23270E305000k8591K5323K2921l7252K3909N2769K5979J8030K10R189j9469j3481
23258E384537l3456L5301M9009J4136R2714N1009m470m7760n750J7009R028L114
23246E564421P6957O7793j6826j3043j2390K9684K9861j05403p6898M6535k556
$$ plain form
23235 5588135 5631571 5807398 5860052 5772716 5734287 5731276 5671510 5715008 5678247 5606515 5651656
23224 5651656 5661326 5719786 5810894 5810780 5866643 5903190 5873758 5758157 5745963 5792343 5770001 5790908
23212 5790908 5884318 5893408 5923489 5911737 5889945 5912728 6024901 6089768 6043614 6076315 6169805
23201 6169805 6208656 6187625 6199455 6141176 6118481 6144696 6144173 6068457 6079880 6097567 6050103 6049762
23189 6049762 6121507 6157771 6149695 6166737 6324490 6460463 6480770 6391302 6352995 6389999 6364956
23178 6364956 6325953 6375748 6374014 6403553 6397685 6429023 6432149 6487494 6508622 6600950 6616054 6586462
23166 6586462 6659555 6674969 6665225 6611991 6572521 6661867 6676100 6637187 6734330 6815420 6792363
23155 6792363 6766336 6717244 6712129 6670365 6716520 6802612 6894166 6833738 6795479 6817656 6778222
$$ packed form
23235E588135M3436J75827N2654q7336l8429l011n9766M3498l6761p1732M5141
23224E651656R670N8460R1108j14N5863L6547k9432j15601j2194M6380k2342K0907
23212E790908R3410R090L0081j1752k1792K2783J12173O4867m6154L2701R3490
23201F169805L8851k1031J1830n8279k2695K6215n23p5716J1423J7687m7464l41
23189F049762P1745L6264q076J7042J57753J35973K0307q9468l8307L7004k5043
23178F364956l9003M9795j734K9539n868L1338L126N5345K1128R2328J5104k9592
23166F586462P3093J5414r744n3234l9470Q9346J4233l8913R7143Q1090k3057
23155F792363k6027m9092n115m1764M6155Q6092R1554o0428l8259K2177l9434
$$ plain form
23144 6778222 6769170 6823432 6919910 6965015 7003572 7020081 7051512 7057123 7057121 7077176 7097869 7114348
23132 7114348 7178783 7187381 7138869 7002329 6950746 7005770 7131743 7188015 7175603 7130552 7186493
23121 7186493 7272738 7395300 7464086 7432041 7451153 7406629 7431006 7391410 7398620 7373247 7424146
23110 7424146 7519680 7597073 7612721 7652273 7742570 7820683 7712684 7706128 7769541 7788236 7786229
23099 7786229 7793622 7790887 7831693 7793670 7730054 7775368 7825490 7798736 7799379 7848184 7910284 7925230
23087 7925230 7905586 7896731 8064302 8125623 8119619 8170981 8235026 8290657 8236198 8259509 8299505
23076 8299505 8375389 8482923 8457829 8486597 8404580 8463722 8571284 8555141 8496608 8495854 8601515
23065 8601515 8657439 8702013 8710585 8737646 8794230 8859620 8913305 8864840 8913882 8979267 8990426
$$ packed form
23144F778222r052N4262R6478M5105L8557J6509L1431N611kK0055K0693J6479
23132G114348O4435Q598m8512j36540n1583N5024J25973N6272j2412m5051N5941
23121G186493Q6245J22562O8786l2045J9112m4524K4377l9596P210k5373N0899
23110G424146R5534P7393J5648L9552R0297P8113j07999o556O3413J8695k007
23099G786229P393k735M0806l8023o3616M5314N0122k6754O43M8805O2100J4946
23087G925230j9644q855J67571O1321o004N1362O4045N5631n4459K3311L9996
23076H299505P5884J07534k5094K8768q2017N9142J07562j6143n8533p54J05661
23065H601515N5924M4574Q572K7061N6584O5390N3685m8465M9042O5385J1159
$$ plain form
23054 8990426 8980308 9067069 9197159 9257549 9263620 9288385 9369876 9302317 9270517 9304340 9345254
23043 9345254 9352812 9379997 9411341 9417823 9429969 9440079 9410177 9505061 9532431 9538047 9512900 9510949
23031 9510949 9647431 9832777 9907147 10103089 10142289 10059609 10074135 10164967 10167100 10221832 10328084
23020 10328084 10377554 10425279 10516259 10552340 10520120 10564705 10594105 10622384 10695546 10668742 10604650
23009 10604650 10726448 10792891 10871213 10952233 10982948 10994400 11111084 11281367 11411267 11357471
22999 11357471 11342269 11433316 11561426 11582167 11638714 11678313 11681265 11802912 11987810 12008290 12089766
22988 12089766 12193709 12226623 12242016 12360103 12518954 12574495 12621763 12666606 12736422 12780826
22978 12780826 12882852 12992356 13113632 13191989 13257912 13423774 13478876 13321008 13314651 13506106
$$ packed form
23054H990426j0118Q6761J30090O0390O071K4765Q1491o7559l1800L3823M0914
23043I345254P558K7185L1344O482J2146J0110k9902R4884K7370N616k5147j951
23031I510949J36482J85346P4370J95942L9200q2680J4526R0832K133N4732J06252
23020A0328084M9470M7725R0980L6081l2220M4585K9400K8279P3162k6804o4092
23009A0604650J21798O6443P8322Q1020L0715J1452J16684J70283J29900n3796
22999A1357471j5202R1047J28110K0741N6547L9599K952J21647J84898K0480Q1476
22988A2089766J03943L2914J5393J18087J58851N5541M7268M4843O9816M4404
22978A2780826J02026J09504J21276P8357O5923J65862N5102j57868o357J91455
$$ plain form
22968 13506106 13596484 13632951 13813088 13953462 14170172 14346377 14434360 14520492 14620847 14764431
22958 14764431 14960844 15043944 15102011 15174730 15267599 15339253 15469170 15614728 15745887 15887131
22948 15887131 16003784 16147250 16229736 16410884 16594259 16693178 16837240 16997454 17181869 17322490
22938 17322490 17460321 17703236 17989373 18085520 18207300 18348218 18520106 18757385 19097051
22929 19097051 19416624 19697777 20077996 20419716 20709094 20932795 21040822 20987206 20602180
22920 20602180 20009871 19578524 19668035 20081964 20426472 20810068 21135337 21479358 21815778
22911 21815778 22155502 22489869 22818818 23265865 23636125 23955299 24301342 24586557 24954745
22902 24954745 25479815 25944478 26371044 26847066 27371396 27823793 28319997 28751374 29221120
$$ packed form
22968A3506106R0378L6467J80137J40374K16710J76205Q7983Q6132J00355J43584
22958A4764431J96413Q3100N8067P2719R2869P1654J29917J45558J31159J41244
22948A5887131J16653J43466Q2486J81148J83375R8919J44062J60214J84415J40621
22938A7322490J37831K42915K86137R6147J21780J40918J71888K37279L39666
22929A9097051L19573K81153L80219L41720K89378K23701J08027n3616l85026
22920B0602180n92309m31347Q9511M13929L44508L83596L25269L44021L36420
22911B1815778L39724L34367L28949M47047L70260L19174L46043K85215L68188
22902B4954745N25070M64663M26566M76022N24330M52397M96204M31377M69746
$$ plain form
22893 29221120 29707922 30301749 30957581 31588876 32228073 32783906 33419381 34159526 34912428
22884 34912428 35739752 36598121 37484418 38446807 39453264 40553650 41642165 42657639 43696808
22875 43696808 44903357 46243623 47630479 49162266 50876883 52688788 54614047 56741116
22867 56741116 58932877 61274591 63973210 66926926 70093334 73693189 77667053 82025573
22859 82025573 86841207 92211365 98124183 104558986 111832917 120463233 130988139 144043775
22851 144043775 160156084 179745828 203210836 230095656 256829001 270748217 244311237
22844 244311237 157701476 21354152 -121941200 -208620707 -218371405 -196787138 -173842915
22837 -173842915 -154087609 -137725561 -124495078 -113884279 -105426962 -99027666 -94766508
$$ packed form
22893B9221120M86802N93827O55832O31295O39197N55833O35475P40145P52902
22884C4912428Q27324Q58369Q86297R62389J006457J100386J088515J015474J039169
22875D3696808J206549J340266J386856J531787J714617J811905J925259K127069
22867E6741116K191761K341714K698619K953716L166408L599855L973864M358520
22859H2025573M815634N370158N912818O434803P273931Q630316J0524906J3055636
22851A44043775J6112309J9589744K3465008K6884820K6733345J3919216k6436980
22844B44311237q6609761j36347324j43295352q6679507r750698K1584267K2944223
22837a73842915J9755306J6362048J3230483J0610799Q457317O399296M261158
$$ plain form
22830 -94766508 -92771524 -92250172 -91116231 -88837697 -86080071 -83006334 -79963860 -76949256
22822 -76949256 -73976800 -71151944 -68394438 -65830318 -63367899 -61006655 -58705137 -56586666
22814 -56586666 -54656744 -52723531 -50912968 -49184164 -47562790 -46116783 -44722835 -43370891
22806 -43370891 -42100667 -40841414 -39697689 -38601132 -37519379 -36441523 -35408736 -34510110
22798 -34510110 -33697824 -32854282 -31993702 -31124263 -30366634 -29670110 -28994559 -28275485 -27581736
22789 -27581736 -26876236 -26190305 -25631847 -25092082 -24588006 -23996847 -23434963 -22870371 -22335882
22780 -22335882 -21837979 -21501803 -21169906 -20717588 -20248782 -19880030 -19540892 -19163647 -18674533
22771 -18674533 -18178398 -17780201 -17400681 -16887458 -16515841 -16322434 -16441688 -16892964 -17415773
$$ packed form
22830i4766508J994984N21352J133941K278534K757626L073737L042474L014604
22822g6949256K972456K824856K757506K564120K462419K361244K301518K118471
22814e6586666J929922J933213J810563J728804J621374J446007J393948J351944
22806d3370891J270224J259253J143725J096557J081753J077856J032787Q98626
22798c4510110Q12286Q43542Q60580Q69439P57629O96524O75551P19074O93749
22789b7581736P05500O85931N58458N39765N04076N91159N61884N64592N34489
22780b2335882M97903L36176L31897M52318M68806L68752L39138L77245M89114
22771a8674533M96135L98197L79520N13223L71617J93407j19254m51276n22809
$$ plain form
22762 -17415773 -17661030 -17486799 -17197522 -16817693 -16507376 -16205936 -15861486 -15613357 -15350828
22753 -15350828 -15117891 -14909180 -14672815 -14425219 -14219664 -13976223 -13824190 -13686969 -13510238
22744 -13510238 -13393989 -13244172 -13080685 -12906294 -12773018 -12630816 -12492075 -12267782 -12051440
22735 -12051440 -11961720 -11783773 -11615092 -11566938 -11450481 -11233805 -10985816 -10840993 -10741030 -10655702
22725 -10655702 -10515092 -10338434 -10285534 -10227659 -10123370 -9988807 -9859137 -9850551 -9820384 -9715477
22715 -9715477 -9707666 -9607074 -9456691 -9381775 -9307103 -9212088 -9076353 -9008357 -8980729 -8837507 -8716651
22704 -8716651 -8651817 -8605572 -8613141 -8433064 -8271928 -8171655 -8101017 -8054848 -8056044 -8058608 -8011123
22693 -8011123 -7912471 -7846747 -7810830 -7679735 -7582699 -7516957 -7422618 -7349693 -7243904 -7260866 -7234316
$$ packed form
22762a7415773k45257J74231K89277L79829L10317L01440L44450K48129K62529
22753a5350828K32937K08711K36365K47596K05555K43441J52033J37221J76731
22744a3510238J16249J49817J63487J74391J33276J42202J38741K24293K16342
22735a2051440Q9720J77947J68681M8154J16457K16676K47989J44823R9963Q5328
22725a0655702J40610J76658N2900N7875J04289J34563J29670Q586L0167J04907
22715i715477P811J00592J50383P4916P4672R5015J35735O7996K7628J43222J20856
22704h716651O4834M6245p569J80077J61136J00273P0638M6169j196k564M7485
22693h011123R8652O5724L5917J31095R7036O5742R4339P2925J05789j6962K6550
$$ plain form
22682 -7234316 -7143518 -7112462 -7069705 -7025976 -6898811 -6784267 -6717567 -6791550 -6840466 -6780502 -6776482
22671 -6776482 -6700915 -6564737 -6382554 -6292747 -6194941 -6195114 -6277648 -6243101 -6152741 -6107388 -6012921
22660 -6012921 -5990077 -5920031 -5851435 -5783895 -5784829 -5817555 -5811221 -5730489 -5640671 -5551046 -5510839 -5553420
22648 -5553420 -5559936 -5442277 -5322206 -5355043 -5392265 -5363476 -5361261 -5337143 -5227374 -5096080 -5077478
22637 -5077478 -5066128 -5039307 -4955473 -4930789 -4880692 -4819060 -4862920 -4887802 -4775493 -4684392 -4582545
22626 -4582545 -4411009 -4312846 -4353172 -4409000 -4417365 -4362128 -4364715 -4362813 -4310719 -4263231 -4283341 -4313569
22614 -4313569 -4370033 -4352385 -4389667 -4391025 -4309942 -4226836 -4118381 -4113843 -4085297 -4046243 -3999454
22603 -3999454 -3951408 -3858781 -3821979 -3872027 -3860192 -3816287 -3757919 -3785530 -3843274 -3873055 -3845463
$$ packed form
22682g234316R0798L1056M2757M3729J27165J14544O6700p3983m8916N9964M020
22671f776482P5567J36178J82183Q9807R7806j73q2534L4547R0360M5353R4467
22660f012921K2844P0046O8596O7540r34l2726O334Q0732Q9818Q9625M0207m2581
22648e553420o516J17659J20071l2837l7222K8789K215K4118J09769J31294J8602
22637e077478J1350K6821Q3834K4684N0097O1632m3860k4882J12309R1101J01847
22626d582545J71536R8163m0326n5828q365N5237k587J902N2094M7488k0110l0228
22614d313569n6464J7648l7282j358Q1083Q3106J08455M538K8546L9054M6789
22603c999454M8046R2627L6802n0048J1835M3905N8368k7611n7744k9781K7592
$$ plain form
22592 -3845463 -3725911 -3765486 -3789006 -3709735 -3663279 -3672944 -3706874 -3687698 -3641018 -3597498 -3508918
22581 -3508918 -3486074 -3512194 -3489075 -3374506 -3306043 -3242639 -3145504 -3120726 -3210720 -3299081 -3289814
22570 -3289814 -3298685 -3249818 -3227273 -3211319 -3106970 -3101478 -3106005 -3121723 -3043595 -3071768 -3141592 -3065710
22558 -3065710 -3027994 -3017698 -2967730 -2972856 -2917964 -2914590 -2871133 -2813691 -2812232 -2822221 -2828778 -2800402
22546 -2800402 -2741291 -2772776 -2797712 -2827466 -2768199 -2633883 -2641089 -2725118 -2634538 -2562936 -2561458
22535 -2561458 -2608722 -2541390 -2451756 -2379675 -2343252 -2318418 -2359668 -2476725 -2520914 -2440104 -2411859
22524 -2411859 -2446472 -2467745 -2342040 -2284330 -2241001 -2229355 -2215372 -2188298 -2169092 -2156739 -2138761
22513 -2138761 -2223608 -2207265 -2174366 -2091757 -2042511 -2112647 -2107418 -2111976 -2111748 -2118244 -2058737 -1999851
$$ packed form
22592c845463J19552l9575k3520P9271M6456r665l3930J9176M6680M3520Q8580
22581c508918K2844k6120K3119J14569O8463O3404R7135K4778q9994q8361R267
22570c289814q871M8867K2545J5954J04349N492m527j5718P8128k8173o9824P5882
22558c065710L7716J0296M9968n126N4892L374M3457N7442J459r989o557K8376
22546b800402N9111l1485k4936k9754N9267J34316p206q4029R0580P1602J478
22535b561458m7264O7332Q9634P2081L6423K4834m1250j17057m4189Q0810K8245
22524b411859l4613k1273J25705N7710M3329J1646J3983K7074J9206J2353J7978
22513b138761q4847J6343L2899Q2609M9246p0136N229m558K28o496N9507N8886
$$ plain form
22501 -1999851 -1929879 -1875373 -1876610 -1916910 -1955044 -2017926 -1928493 -1900483 -1978381 -2026685 -2056264
22490 -2056264 -2020006 -1912186 -1944849 -1903748 -1809825 -1693315 -1621124 -1651297 -1747702 -1789818 -1794156
22479 -1794156 -1785724 -1793572 -1792493 -1763261 -1735036 -1737084 -1690989 -1674459 -1696365 -1623719 -1579456 -1655170
22467 -1655170 -1666099 -1592242 -1525669 -1554962 -1643923 -1691517 -1583089 -1464896 -1448572 -1545808 -1546362
22456 -1546362 -1520921 -1500103 -1479197 -1427298 -1562631 -1619344 -1561193 -1483943 -1437656 -1261696 -1175878
22445 -1175878 -1257460 -1335631 -1345818 -1360917 -1373476 -1397993 -1366457 -1371329 -1368696 -1301745 -1267068 -1277279
22433 -1277279 -1269947 -1273283 -1312179 -1346874 -1193281 -1065232 -1065150 -1123245 -1108871 -1083900 -1032400 -956574
22421 -956574 -928374 -977578 -1062179 -1063352 -1089896 -1169752 -1101692 -1059241 -1081255 -1121345 -1103897 -1067920
$$ packed form
22501a999851O9972N4506j237m0300l8134o2882Q9433K8010p7898m8304k9579
22490b056264L6258J07820l2663M1101R3923J16510P2191l0173r6405m2116m338
22479a794156Q432p848J079K9232K8225k048M6095J6530k1906P2646M4263p5714
22467a655170j0929P3857O6573k9293q8961m7594J08428J18193J6324r7236n54
22456a546362K5441K0818K0906N1899j35333n6713N8151P7250M6287J75960Q5818
22445a175878q1582p8171j0187j5099j2559k4517L1536m872K633O6951L4677j0211
22433a277279P332l336l8896l4695J53593J28049Q2n8095J4374K4971N1500P5826
22421i56574K8200m9204q4601j173k6544p9856O8060M2451k2014m0090J7448L5977
$$ plain form
22409 -1067920 -1072143 -1007943 -989036 -996988 -935816 -923845 -893280 -922118 -964992 -916202 -906427 -923261
22397 -923261 -983819 -1067200 -1074371 -1006354 -949448 -784947 -737613 -693052 -718479 -844050 -949811
22386 -949811 -931874 -883431 -824366 -775521 -719899 -670511 -645032 -605984 -652565 -727867 -668120
22375 -668120 -645247 -606485 -613905 -551291 -621797 -792417 -733651 -666935 -663363 -662244 -672409 -643786
22363 -643786 -693016 -773858 -747457 -670357 -594262 -484932 -397796 -401603 -419226 -458121 -469030
22352 -469030 -442655 -397144 -420901 -428399 -362070 -401052 -368453 -360666 -400557 -488359 -535012 -428501
22340 -428501 -354151 -326490 -324566 -303054 -294997 -251973 -271716 -312329 -302858 -240784 -231107 -305633
22328 -305633 -370224 -388333 -447215 -538455 -511479 -418703 -340438 -288768 -231569 -216522 -183437
$$ packed form
22409a067920m223O4200J8907p952O1172J1971L0565k8838m2874M8790R775j6834
22397i23261o0558q3381p171O8017N6906J64501M7334M4561k5427j25571j05761
22386i49811J7937M8443N9065M8845N5622M9388K5479L9048m6581p5302N9747
22375f68120K2873L8762p420O2614p0506j70620N8766O6716L572J119j0165K8623
22363f43786m9230q0842K6401P7100P6095J09330Q7136l807j7623l8895j0909
22352d69030K6375M5511k3757p498O6329l8982L2599P787l9891q7802m6653J06511
22340d28501P4350K7661J924K1512Q057M3024j9743m0613R471O2074R677p4526
22328c05633o4591j8109n8882r1240K6976R2776P8265N1670N7199J5047L3085
$$ plain form
22317 -183437 -77888 -48953 -28942 -16893 -36591 31877 -28428 -116868 -123317 -131628 -125112 -36511
22305 -36511 11823 1627 77723 160128 150363 110811 198456 204138 217681 219653 262473 362776
22293 362776 408343 415769 449630 534989 644025 730294 884085 1014435 1122159 1189465 1124655
22282 1124655 809536 229864 -506054 -1111192 -1376891 -1340803 -1202731 -1121474 -1052176 -967577
22272 -967577 -896219 -881476 -852322 -774923 -744926 -613438 -581636 -602203 -658158 -597459 -481330
22261 -481330 -418748 -432123 -492422 -502912 -526354 -470174 -370454 -360325 -424730 -484336 -456997
22250 -456997 -461703 -344802 -317239 -271589 -247291 -266541 -240798 -149564 -141408 -194319 -186982 -222733
22238 -222733 -158028 -65705 22130 24529 6635 -10734 -39047 -82456 -84416 -81497 -17649 -4872
$$ packed form
22317a83437J05549K8935K0011J2049j9698O8468o0305q8440o449q311O516Q8601
22305c6511M8334j0196P6096Q2405r765l9552Q7645N682J3543J972M2820J00303
22293C62776M5567P426L3861Q5359J09036Q6269J53791J30350J07724O7306o4810
22282A124655l15119n79672p35918o05138k65699L6088J38072Q1257O9298Q4599
22272i67577P1358J4743K9154P7399K9997J31488L1802k0567n5955O0699J16129
22261d81330O2582j3375o0299j0490k3442N6180R9720J0129o4405n9606K7339
22250d56997m706J16901K7563M5650K4298j9250K5743R1234Q156n2911P337l5751
22238b22733O4705R2323Q7835K399j7894j7369k8313m3409j960K919O3848J2777
$$ plain form
22226 -4872 -35950 -51138 -8306 -36581 -28428 -41727 15507 -2098 -79288 -120533 -93206 -40731
22214 -40731 118629 220906 158956 42298 -26055 -7076 24543 96127 113497 146797 123853
22203 123853 54087 -18853 -26563 3934 18651 17207 -3818 67670 117871 120577 84654 76472
22191 76472 47153 -12556 61661 143960 109825 82568 49189 126007 226522 250044 247569 261993
22179 261993 228661 222674 319859 409397 383372 365159 250696 242711 306785 360022 366391 325051
22167 325051 299287 272829 208774 148887 298016 361741 365554 340586 342093 354534 393356 484862
22155 484862 536456 447427 326682 263465 309927 236700 294146 402517 523421 503129 444750
22144 444750 469631 421669 423110 466888 398881 369266 428251 412664 375593 362057 375460 405517
$$ packed form
22226d872l1078j5188M2832k8275Q153j3299N7234j7605p7190m1245K7327N2475
22214d0731J59360J02277o1950j16658o8353J8979L1619P1584J7370L3300k2944
22203A23853o9766p2940p710L0497J4717j444k1025P1488N0201K706l5923q182
22191G6472k9319n9709P4217Q2299l4135k7257l3379P6818J00515K3522k475J4424
22179B61993l3332n987R7185Q9538k6025j8213j14463p985O4074N3237O369m1340
22167C25051k5764k6458o4055n9887J49129O3725L813k4968J507J2441L8822R1506
22155D84862N1594q9029j20745o3217M6462p3227N7446J08371J20904k0292n8379
22144D44750K4881m7962J441M3778o8007k9615N8985j5587l7071j3536J3403L0057
$$ plain form
22132 405517 464778 402666 347890 443543 456142 381208 470329 495825 457336 488750 471463
22121 471463 487552 520503 576771 681256 634601 518044 502151 521304 554263 517130 501678
22110 501678 462070 440286 457047 480749 435926 437265 521528 497759 477638 398922 383783 407971
22098 407971 425094 497255 497016 451089 466384 606239 714095 651788 580986 680068 720065
22087 720065 696124 669141 625680 611911 581228 640913 737540 712977 657469 668290 662787 714680
22075 714680 763916 785060 708764 652080 672819 658916 713760 763540 771744 742226 721270 808125
22063 808125 782162 615221 608155 661940 706489 676332 692984 687845 692699 730116 764760 718882
22051 718882 659720 711585 753131 863007 887815 947049 990674 979349 864979 777652 683296
$$ packed form
22132D05517N9261o2112n4776R5653J2599p4934Q9121K5496l8489L1414j7287
22121D71463J6089L2951N6268J04485m6655j16557j5893J9153L2959l7133j5452
22110E01678l9608k1784J6761K3702m4823J339Q4263k3769k0121p8716j5139K4188
22098D07971J7123P2161k39m5927J5295J39855J07856o2307p0802R9082L9997
22087G20065k3941k6983m3461j3769l0683N9685R6627k4563n5508J0821n503N1893
22075G14680M9236K1144p6296n6684K0739j3903N4844M9780Q204k9518k0956Q6855
22063H08125k5963j66941p066N3785M4549l0157J6652n139M854L7417L4644m5878
22051G18882n9162N1865M1546J09876K4808N9234M3625j1325j14370q7327r4356
$$ plain form
22040 683296 711006 744905 691412 737643 822549 814061 792367 792739 741874 781379 816573 769436
22028 769436 846892 873726 868817 760925 779624 823229 949162 967054 1003573 985295 878163
22017 878163 855308 881278 874004 920476 845808 805798 841596 849349 803906 873531 999178 1029497
22005 1029497 1070674 1017925 960339 873875 850776 906653 917035 921036 916340 1029256 1110260
21994 1110260 1015472 1008401 977789 920969 846966 812360 883454 894850 902179 941171 954765 976772
21982 976772 1043862 1041998 961744 889244 943632 987123 981717 991779 921527 940581 882618 934424
21970 934424 984268 914010 927341 949692 1015238 1025919 1069958 1089937 1067832 956683 946573
21959 946573 987910 1114116 1099395 1022619 1005062 986214 1031420 987404 875430 878660 939482
$$ packed form
22040F83296K7710L3899n3493M6231Q4906q488k1694L72n0865L9505L5194m7137
22028G69436P7456K6834m909j07892J8699M3605J25933J7892L6519j8278j07132
22017H78163k2855K5970p274M6472p4668m0010L5798P753m5443O9625J25647L0319
22005A029497M1177n2749n7586q6464k3099N5877J0382M001m696J12916Q1004
21994A110260r4788p071l0612n6820p4003l4606P1094J1396P329L8992J3594K2007
21982I76772O7090j864q0254p2500N4388M3491n406J0062p0252J9054n7963N1806
21970I34424M9844p0258J3331K2351O5546J0681M4039J9979k2105j11149j0110
21959I46573M1337J26206j4721p6776j7557j8848M5206m4016j11974L230O0822
$$ plain form
21948 939482 986288 1092800 1159007 1102547 1094732 1182566 1310420 1315118 1175749 1062457 1038580
21937 1038580 1053963 1002809 1080516 1129142 1112995 1090156 1086983 1162324 1166123 1197415 1128594 1050279
21925 1050279 1048587 1066690 1089617 1162022 1226547 1253299 1218687 1177905 1251181 1217834 1211649 1219590
21913 1219590 1206844 1235881 1171284 1109880 1112033 1166714 1199588 1252402 1252705 1284762 1253764 1200305
21901 1200305 1249434 1235969 1222902 1136097 1142404 1213004 1281328 1202094 1181152 1203827 1253589
21890 1253589 1267243 1250425 1244341 1302974 1311497 1325899 1250564 1188825 1225457 1168529 1121134 1075716
21878 1075716 1051045 1116456 1215468 1277114 1320219 1371889 1327651 1242212 1289015 1304019 1274377
21867 1274377 1313725 1222134 1227727 1279191 1312816 1271064 1237823 1357061 1361411 1367976 1353584 1295874
$$ packed form
21948I39482M6806J06512O6207n6460p815Q7834J27854M698j39369j13292k3877
21937A038580J5383n1154P7707M8626j6147k2839l173P5341L799L1292o8821p8315
21925A050279j692J8103K2927P2405O4525K6752l4612m0782P3276l3347o185P941
21913A219590j2746K9037o4597o1404K153N4681L2874N2814L03L2057l0998n3459
21901A200305M9129j3465j3067q6805O307P0600O8324p9234k0942K2675M9762
21890A253589J3654j6818o084N8633Q523J4402p5335o1739L6632n6928m7395m5418
21878A075716k4671O5411R9012O1646M3105N1670m4238q5439M6803J5004k9642
21867A274377L9348r1591N593N1464L3625m1752l3241J19238M350O565j4392n7710
$$ plain form
21855 1295874 1289615 1324172 1335222 1283117 1231567 1353199 1364629 1312389 1425881 1552116 1533459
21844 1533459 1461398 1407974 1342376 1360196 1363762 1395146 1437988 1436433 1419507 1430388 1438465 1418341
21832 1418341 1498812 1608418 1692380 1599716 1504098 1443205 1369783 1328897 1291820 1323263 1350884
21821 1350884 1404659 1445027 1370667 1295350 1288404 1284682 1336037 1394953 1345271 1408396 1408828 1410032
21809 1410032 1421279 1437491 1360243 1345812 1270911 1299765 1265124 1286577 1427732 1538966 1501623
21798 1501623 1403788 1243292 1245259 1278745 1382262 1368329 1371973 1412532 1451122 1552267 1492288
21787 1492288 1352812 1373906 1469141 1558281 1602168 1582435 1585401 1590712 1643553 1645526 1557796 1523751
21775 1523751 1526417 1513961 1571582 1579916 1578114 1612153 1578999 1565859 1449079 1387736 1430108 1484656
$$ packed form
21855A295874o259L4557J1050n2105n1550J21632J1430n2240J13492J26235j8657
21844A533459p2061n3424o5598J7820L566L1384M2842j555j6926J0881Q077k0124
21832A418341Q0471J09606Q3962r2664r5618o0893p3422m0886l7077L1443K7621
21821A350884N3775M0368p4360p5317o946l722N1355N8916m9682O3125M32J204
21809A410032J1247J6212p7248j4431p4901K8854l4641K1453J41155J11234l7343
21798A501623r7835j60496J967L3486J03517j3933L644M0559L8590J01145n9979
21787A492288j39476K1094R5235Q9140M3887j9733K966N311N2841J973q7730l4045
21775A523751K666j2456N7621Q334j802L4039l3154j3140j16780o1343M2372N4548
$$ plain form
21763 1484656 1572702 1594713 1641828 1592654 1518278 1542650 1556447 1556199 1492558 1450285 1438985 1475328
21751 1475328 1500720 1484560 1527952 1540432 1479694 1502940 1516319 1656830 1643153 1566999 1655765
21740 1655765 1593201 1487329 1460220 1472056 1566352 1611861 1572172 1503340 1491653 1507982 1547542
21729 1547542 1530934 1530645 1532185 1486460 1484014 1427659 1404686 1457822 1461660 1516770 1568048 1579281
21717 1579281 1500124 1483537 1507470 1577530 1613218 1649326 1657741 1664427 1702522 1663749 1725583 1807782
21705 1807782 1745571 1697045 1780852 1738348 1596063 1646588 1674599 1680839 1686736 1629237 1623717 1661757
21693 1661757 1659411 1654681 1644282 1573738 1551237 1604312 1648799 1625086 1707074 1729662 1710164 1713301
21681 1713301 1663699 1578110 1568033 1633399 1650825 1675382 1707350 1700473 1731684 1796375 1840383
$$ packed form
21763A484656Q8046K2011M7115m9174p4376K4372J3797k48o3641m2273j1300L6343
21751A475328K5392j6160M3392J2480o0738K3246J3379J40511j3677p6154Q8766
21740A655765o2564j05872k7109J1836R4296M5509l9689o8832j1687J6329L9560
21729A547542j6608k89J540m5725k446n6355k2973N3136L838N5110N1278J1233
21717A579281p9157j6587K3933P0060L5688L6108Q415O686L8095l8773O1834Q2199
21705A807782o2211m8526Q3807m2504j42285N0525K8011O240N897n7499n520L8040
21693A661757k346m730j0399p0544k2501N3075M4487k3713Q1988K2588j9498L137
21681A713301m9602q5589j0077O5366J7426K4557L1968o877L1211O4691M4008
$$ plain form
21670 1840383 1822363 1768598 1846444 1875405 1844897 1777283 1701363 1714788 1719411 1763301 1775658
21659 1775658 1817856 1817982 1797027 1755272 1718230 1744170 1798254 1804703 1771799 1774812 1819548 1810918
21647 1810918 1883095 1922151 1945721 1890202 1794169 1806045 1831590 1828398 1866963 1877251 1791268
21636 1791268 1753308 1794304 1833074 1850599 1788517 1726527 1651861 1678617 1781361 1797530 1797098
21625 1797098 1752174 1732543 1785264 1873552 1861238 1808014 1821044 1857229 1809196 1772064 1792022
21614 1792022 1882545 1961802 1944592 1829335 1823550 1877615 1943152 1991544 2029331 1932815 1855988
21603 1855988 1893554 1924479 1924096 1965820 2038091 2072130 1980499 1941467 1926161 1931603 1877947 1925324
21591 1925324 1913588 1836830 1828411 1977034 2084962 2094112 2059310 2035045 1975860 1898518 1848671
$$ packed form
21670A840383j8020n3765P7846K8961l0508o7614p5920J3425M623M3890J2357
21659A775658M2198J26k0955m1755l7042K5940N4084O449l2904L013M4736q630
21647A810918P2177L9056K3570n5519r6033J1876K5545l192L8565J0288q5983
21636A791268l7960M0996L8770J7525o2082o1990p4666K6756J02744J6169m32
21625A797098m4924j9631N2721Q8288j2314n3224J3030L6185m8033l7132J9958
21614A792022R0523P9257j7210j15257n785N4065O5537M8392L7787r6516p6827
21603A855988L7566L0925l83M1724P2271L4039r1631l9032j5306N442n3656M7377
21591A925324j1736p6758q419J48623J07928R150l4802k4265n9185p7342m9847
$$ plain form
21580 1848671 1855300 1842193 1872760 1932994 1933595 1939442 1889019 1917968 1882343 1892351 1843434 1809466
21568 1809466 1883013 1919360 1949918 1855803 1759603 1828520 1910561 1838477 1751116 1783819 1831335
21557 1831335 1919972 1979691 1932906 1947365 1923086 1924501 1952769 2021063 2038932 1988381 1953997
21546 1953997 1940666 1864403 1831262 1857748 1903686 1940407 1953602 1899153 1877503 1830985 1869232
21535 1869232 1942975 1995986 2064121 2060340 2028150 2023044 1989892 1984356 1956345 2014943 2026149 2032601
21523 2032601 2051090 2055138 1996871 2017176 2094812 2077980 2035903 2031256 2025462 2045160 2119830 2163809
21511 2163809 2147364 2168535 2052429 2074540 2151164 2116768 2067342 2107330 2154691 2138572 2136904
21500 2136904 2143416 2097744 2085153 2193594 2258549 2221485 2153212 2168833 2275308 2213351 2087804
$$ packed form
21580A848671O629j3107L0567O0234O01N847n0423K8949l5625J0008m8917l3968
21568A809466P3547L6347L0558r4115r6200O8917Q2041p2084q7361L2703M7516
21557A831335Q8637N9719m6785J4459k4279J415K8268O8294J7869n0551l4384
21546A953997j3331p6263l3141K6486M5938L6721J3195n4449k1650m6518L8247
21535A869232P3743N3011O8135l781l2190n106l3152n536k8011N8598J1206O452
21523B032601J8489M048n8267K0305P7636j6832m2077m647n794J9698P4670M3979
21511B163809j6445K1171j16106K2111P6624l4396m9426L9988M7361j6119j668
21500B136904O512m5672j2591J08441O4955l7064o8273J5621J06475o1957j25547
$$ plain form
21489 2087804 2059900 2019431 2037448 2049367 2090203 2078036 2104749 2172096 2234761 2123997 2049544
21478 2049544 2104391 2185736 2183497 2157316 2216733 2165924 2112327 2182502 2186096 2151418 2138839 2172743
21466 2172743 2190845 2210776 2224659 2236492 2213588 2121958 2077495 2113781 2103354 2059882 2158125
21455 2158125 2239868 2281368 2306368 2247069 2192090 2192138 2221747 2234476 2202932 2080001 2091350 2123474
21443 2123474 2170815 2236414 2247357 2268624 2292110 2316012 2302539 2268557 2199751 2215250 2150940
21432 2150940 2175803 2187358 2230272 2313824 2370493 2285008 2240262 2148991 2087467 2170568 2156567
21421 2156567 2160785 2162822 2247059 2258129 2256250 2275045 2278856 2274289 2208717 2216037 2277353 2342939
21409 2342939 2366711 2318874 2222103 2172233 2122996 2127489 2219572 2215503 2191955 2256044 2276772 2287824
$$ packed form
21489B087804k7904m0469J8017J1919M0836j2167K6713O7347O2665j10764p4453
21478B049544N4847Q1345k239k6181N9417n0809n3597P0175L594l4678j2579L3904
21466B172743J8102J9931J3883J1833k2904r1630m4463L6286j0427m3472R8243
21455B158125Q1743M1500K5000n9299n4979M8K9609J2729l1544j22931J1349L2124
21443B123474M7341O5599J0943K1267K3486K3902j3473l3982o8806J5499o4310
21432B150940K4863J1555M2914Q3552N6669q5485m4746r1271o1524Q3101j4001
21421B156567M218K037Q4237J1070j879J8795L811m567o5572P320O1316O5586
21409B342939K3772m7837r6771m9870m9237M493R2083m069k3548O4089K0728J1052
$$ plain form
21397 2287824 2357015 2373936 2408177 2318624 2195030 2159069 2163270 2292894 2372329 2318500 2359965
21386 2359965 2389937 2345957 2339991 2316570 2319414 2327784 2295811 2362244 2475922 2455579 2373616 2271491
21374 2271491 2256099 2317199 2291858 2348901 2427953 2481138 2488439 2279783 2275228 2400558 2501960
21363 2501960 2492375 2427475 2412305 2446419 2428298 2318957 2300835 2279538 2369930 2352060 2300365
21352 2300365 2301528 2415685 2479786 2382221 2342552 2382350 2347641 2325085 2424753 2438679 2519003
21341 2519003 2455272 2361633 2306547 2365031 2478741 2411938 2420932 2397653 2307711 2366520 2326051
21330 2326051 2374000 2550953 2570631 2537145 2448369 2438362 2505340 2514837 2459107 2392399 2410644
21319 2410644 2453529 2468944 2476487 2511212 2550958 2466539 2349476 2324131 2322868 2375095 2403136
$$ packed form
21397B287824O9191J6921L4241q9553j23594l5961M201J29624P9435n3829M1465
21386B359965K9972m3980n966k3421K844Q370l1973O6433J13678k0343q1963j02125
21374B271491j5392O1100k5341N7043P9052N3185P301k08656m555J25330J01402
21363B501960r585o4900j5170L4114j8121j09341j8122k1297R0392j7870n1695
21352B300365J163J14157O4101r7565l9669L9798l4709k2556R9668J3926Q0324
21341B519003o3731r3639n5086N8484J13710o6803Q994k3279q9942N8809m0469
21330B326051M7949J76953J9678l3486q8776j0007O6978R497n5730o6708J8245
21319B410644M2885J5415P543L4725L9746q4419j17063k5345j263N2227K8041
$$ plain form
21308 2403136 2422528 2457461 2487476 2443878 2416012 2434098 2440676 2424685 2431324 2463548 2506816 2497556
21296 2497556 2484106 2514478 2509799 2573839 2643723 2662488 2661584 2583574 2536633 2559112 2494175 2352739
21284 2352739 2353913 2433523 2571179 2642216 2599744 2597750 2619799 2592337 2587073 2592984 2543923 2531210
21272 2531210 2596734 2614034 2675609 2736575 2761497 2692562 2693193 2703478 2724244 2677670 2624065 2615232
21260 2615232 2646054 2653008 2689338 2648557 2597243 2547673 2561210 2542676 2626919 2661241 2611435
21249 2611435 2568654 2573995 2580364 2609533 2664908 2661345 2656748 2563794 2446445 2500892 2513923 2559814
21237 2559814 2513305 2457644 2530217 2502600 2547291 2716923 2726059 2644743 2605200 2586208 2589320
21226 2589320 2577948 2596108 2699440 2774675 2775209 2750052 2774134 2754170 2694163 2629678 2619543
$$ packed form
21308B403136J9392L4933L0015m3598k7866J8086O578j5991O639L2224M3268r260
21296B497556j3450L0372m679O4040O9884J8765r04p8010m6941K2479o4937j41436
21284B352739J174P9610J37656P1037m2472j994K2049k7462n264N911m9061j2713
21272B531210O5524J7300O1575O0966K4922o8935O31J0285K0766m6574n3605q833
21260B615232L0822O954L6330m0781n1314m9570J3537j8534Q4243L4322m9806
21249B611435m2781N341O369K9169N5375l563m597r2954j17349N4447J3031M5891
21237B559814m6509n5661P2573k7617M4691J69632R136q1316l9543j8992L112
21226B589320j1372J8160J03332P5235N34k5157K4082j9964o0007o4485j0135
$$ plain form
21215 2619543 2593416 2593739 2596375 2639554 2722934 2702235 2696820 2657908 2625613 2656594 2714537 2802462
21203 2802462 2851903 2800395 2779000 2756092 2725266 2733919 2797429 2779499 2756090 2793336 2764421
21192 2764421 2733751 2739378 2772587 2837938 2783448 2801879 2780133 2760236 2783406 2842909 2761053
21181 2761053 2761857 2812552 2804953 2752549 2779101 2847005 2879318 2879930 2875127 2805209 2753695 2749912 2833215
21168 2833215 2816398 2759988 2749536 2749931 2795912 2784448 2882387 2926356 2889057 2832456 2866317 2822576
21156 2822576 2727960 2767772 2876943 2833786 2726171 2631597 2643815 2766968 2867267 2842864
21146 2842864 2816241 2820615 2788740 2708666 2716417 2708627 2764794 2801821 2861751 2850940 2876177 2905444
21134 2905444 2835861 2742942 2756118 2764367 2794639 2867829 2854497 2850786 2816056 2871807 2887386 2879653
$$ packed form
21215B619543k6127L23K636M3179Q3380k0699n415l8912l2295L0981N7943Q7925
21203B802462M9441n1508k1395k2908l0826Q653O3510j7930k3409L7246k8915
21192B764421l0670N627L3209O5351n4490J8431k1746j9897K3170N9503q1856
21181B761053Q04N0695p599n2404K6552O7904L2313O12m803o9918n1514l783Q3303
21168B833215j6817n6410j0452L95M5981j1464R7939M3969l7299n6601L3861m3741
21156B822576r4616L9812J09171m3157j07615r4574J2218J23153J00299k4403
21146B842864k6623M374l1875q0074P751p790N6167L7027N9930j0811K5237K9267
21134B905444o9583r2919J3176Q249L0272P3190j3332l711l4730N5751J5579p733
$$ plain form
21122 2879653 3011931 3048101 3039290 2961493 2976608 2917718 2860714 2920963 3010403 2920688 2797716
21111 2797716 2832304 2848584 2839098 2889322 2970120 2928492 2911973 2862952 2985810 3032560 3011499
21100 3011499 3048999 2974496 2939342 2942823 2882209 2848211 2845169 2897152 2957500 2966463 2931447 2910980
21088 2910980 2938782 2983685 2926135 2939200 2941803 2933228 2989636 2922152 2874666 2947666 2883510 2959270
21076 2959270 3057239 3083980 3130471 3155110 3017628 2919946 2934274 2948362 3067131 3107452 3105695
21065 3105695 3123120 3134251 3087100 2987264 3025271 3029483 3060439 3022418 3012915 3023073 3057412 3113506
21053 3113506 3108168 3069488 3048837 3016760 3058433 3074954 3082380 3114634 3111088 3122571 3122961 3154220
21041 3154220 3215398 3207132 3117546 3077996 2978183 3001931 3075804 3066115 3066784 3019656 2984509 2999150
$$ packed form
21122B879653J32278L6170q811p7797J5115n8890n7004O0249Q9440q9715j22972
21111B797716L4588J6280r486N0224Q0798m1628j6519m9021J22858M6750k1061
21100C011499L7500p4503l5154L481o0614l3998l042N1983O0348Q963l5016k0467
21088B910980K7802M4903n7550J3065K603q575N6408o7484m7486P3000o4156P5760
21076B959270R7969K6741M6491K4639j37482r7682J4328J4088J18769M0321j757
21065C105695J7425J1131m7151r9836L8007M212L0956l8021r503J0158L4339N6094
21053C113506n338l8680k0651l2077M1673J6521P426L2254l546J1483L90L1259
21041C154220O1178q266q9586l9550r9813K3748P3873r689O69m7128l5147J4641
$$ plain form
21029 2999150 2994390 3010865 3069398 3082045 3041725 3055750 3086424 3106241 3152767 3166755 3138665
21018 3138665 3097194 3081566 3104007 3115822 3120066 3144538 3063909 3091279 3136304 3141937 3143091 3169098
21006 3169098 3193000 3206864 3241979 3152556 3099020 3143156 3186223 3147920 3113768 3180261 3209551
20995 3209551 3171969 3141596 3134634 3146606 3123476 3117260 3104854 3078087 3027959 3121016 3213007 3265838
20983 3265838 3271571 3208964 3191699 3170942 3265384 3214494 3124767 3207424 3244398 3172171 3188671
20972 3188671 3179021 3147938 3124498 3110040 3200154 3204426 3234359 3381149 3402260 3308829 3214539
20961 3214539 3214932 3230667 3262337 3280911 3259470 3285154 3281035 3248027 3249837 3256827 3218447 3222187
20949 3222187 3192703 3238542 3363828 3459334 3362980 3301274 3251683 3222874 3222077 3232021 3237337 3283009
$$ packed form
21029B999150m760J6475N8533J2647m0320J4025L0674J9817M6526J3988k8090
21018C138665m1471j5628K2441J1815M244K4472q0629K7370M5025N633J154K6007
21006C169098K3902J3864L5115q9423n3536M4136M3067l8303l4152O6493K9290
20995C209551l7582l0373o962J1972k3130o216j2406k6767n0128R3057R1991N2831
20983C265838N733o2607j7265k0757R4442n0890q9727Q2657L6974p2227J6500
20972C188671r650l1083k3440j4458R0114M272K9933J46790K1111r3431r4290
20961C214539L93J5735L1670J8574k1441K5684m119l3008J810O990l8380L740
20949C222187k9484M5839J25286R5506r6354o1706m9591k8809p97R944N316M5672
$$ plain form
20937 3283009 3345854 3484372 3529004 3383880 3277350 3299000 3384108 3359821 3272647 3336960 3360426
20926 3360426 3373491 3464559 3528153 3516319 3444884 3430286 3369842 3420970 3384329 3314494 3365881
20915 3365881 3339527 3333093 3331593 3324417 3327585 3314146 3390509 3430832 3473534 3493095 3476548 3385132
20903 3385132 3413616 3296835 3298100 3263284 3237540 3329188 3418654 3360693 3343133 3430333 3415904
20892 3415904 3423249 3518420 3532190 3407910 3309541 3287125 3337963 3358124 3397015 3461181 3431705
20881 3431705 3424077 3471757 3506132 3490745 3518907 3519014 3521729 3524374 3425735 3340433 3361000 3449016
20869 3449016 3406998 3370710 3426526 3417063 3396496 3303387 3263738 3293175 3330137 3461417 3530502
20858 3530502 3447961 3471136 3545535 3564703 3523117 3418168 3428034 3442829 3495317 3510902 3568284
$$ packed form
20937C283009O2845J38518M4632j45124j06530K1650Q5108k4287q7174O4313K3466
20926C360426J3065R1068O3594j1834p1435j4598o0444N1128l6641o9835N1387
20915C365881k6354o434j500p176L168j3439P6363M0323M2702J9561j6547r1416
20903C385132K8484j16781J265l4816k5744R1648Q9466n7961j7560Q7200j4429
20892C415904P345R5171J3770j24280r8369k2416N0838K0161L8891O4166k9476
20881C431705p628M7680L4375j5387K8162J07K715K645r8639q5302K0567Q8016
20869C449016m2018l6288N5816r463k0567r3109l9649K9437L6962J31280O9085
20858C530502q2541K3175P4399J9168m1586j04949R866J4795N2488J5585N7382
$$ plain form
20847 3568284 3647762 3652816 3586401 3553485 3500424 3502906 3538088 3609578 3585342 3493570 3488331 3638894
20835 3638894 3588256 3503849 3544695 3644254 3665356 3593037 3634401 3659870 3580238 3505319 3568822
20824 3568822 3608806 3601982 3650129 3610936 3637946 3608568 3542658 3571503 3588320 3512346 3491396
20813 3491396 3473233 3578083 3644911 3539508 3447988 3546809 3681404 3656725 3612204 3623696 3592663
20802 3592663 3554818 3539896 3502677 3465225 3477219 3492128 3473554 3540660 3518732 3491741 3638662
20791 3638662 3716617 3701786 3702874 3758411 3769849 3772108 3737139 3784838 3803817 3766219 3754546 3795398
20779 3795398 3855233 3838626 3728143 3665194 3718568 3770140 3814698 3758104 3790808 3780116 3743391
20768 3743391 3803852 3803757 3781929 3797426 3820426 3768497 3732168 3763278 3784078 3801396 3796131 3722129
$$ packed form
20847C568284P9478N054o6415l2916n3061K482L5182P1490k4236r1772n239J50563
20835C638894n0638q4407M0846R9559K1102p2319M1364K5469p9632p4919O3503
20824C568822L9984o824M8147l9193K7010k9378o5910K8845J6817p5974k0950
20813C491396j8163J04850O6828j05403r1520R8821J34595k4679m4521J1492l1033
20802C592663l7845j4922l7219l7452J1994J4909j8574O7106k1928k6991J46921
20791C638662P7955j4831J088N5537J1438K259l4969M7699J8979l7598j1673M0852
20779C795398N9835j6607j10483o2949N3374N1572M4558n6594L2704j0692l6725
20768C743391O0461r5k1828J5497K3000n1929l6329L1110K0800J7318n265p4002
$$ plain form
20756 3722129 3765728 3831154 3756946 3804742 3835586 3784865 3753639 3764993 3786430 3791254 3799846 3840391
20744 3840391 3842469 3807195 3739230 3676375 3691761 3728782 3759463 3778969 3804503 3724709 3765198
20733 3765198 3798279 3777218 3773740 3865336 3870801 3877384 3864346 3914869 3817810 3794247 3858280 3848532
20721 3848532 3817061 3825582 3826727 3816829 3819756 3852156 3836239 3848034 3915659 3939056 3908158 3914667
20709 3914667 3875445 3890804 3930373 3939074 4007862 3986672 3988212 3962851 3924555 3938025 3943916 3919228
20697 3919228 3930032 3973592 3982080 3932349 3952377 3992984 3985497 4007724 4025046 3932162 4019040 4092859
20685 4092859 4146405 4174529 4171373 4076154 4048346 4074642 4095701 4063548 4035213 4105986 4114330 4098015
20673 4098015 4105189 4110190 4086476 4036058 4034730 4028679 4054288 4116190 4080951 4026465 3998925 4007292
$$ packed form
20756C722129M3599O5426p4208M7796L0844n0721l1226J1354K1437M824Q592M0545
20744C840391K078l5274o7965o2855J5386L7021L0681J9506K5534p9794M0489
20733C765198L3081k1061l478R1596N465O583j3038N0523r7059k3563O4033r748
20721C848532l1471Q521J145r898K927L2400j5917J1795O7625K3397l0898O509
20709C914667l9222J5359L9569Q701O8788k1190J540k5361l8296J3470N891k4688
20697C919228J0804M3560Q488m9731K0028M0607p487K2227J7322r2884Q6878P3819
20685D092859N3546K8124l156r5219k7808K6296K1059l2153k8335P0773Q344j6315
20673D098015P174N001k3714n0418j328o051K5609O1902l5239n4486k7540Q367
$$ plain form
20661 4007292 4058827 4101235 4049556 4087216 4117921 4160901 4146045 4106694 4040079 4015186 4013078
20650 4013078 4065571 4081151 4094337 4076374 4094684 3999481 4029965 4130046 4141717 4089955 4147070
20639 4147070 4145073 4150245 4175313 4229612 4253209 4242559 4145565 4187973 4174289 4122082 4090560 4045863
20627 4045863 4158786 4197788 4161192 4129263 4200988 4221663 4212343 4225519 4227465 4206627 4184960
20616 4184960 4182742 4152728 4191098 4210445 4257876 4286483 4245762 4115399 4148034 4169508 4285801
20605 4285801 4389584 4373158 4385860 4333045 4340213 4332956 4312465 4236008 4232617 4231293 4308540 4276390
20593 4276390 4198301 4217483 4188968 4179368 4236240 4233075 4273700 4431521 4521229 4480904 4395000
20582 4395000 4386796 4444558 4433274 4404321 4311560 4264629 4239488 4213353 4230896 4312704 4269135
$$ packed form
20661D007292N1535M2408n1679L7660L0705M2980j4856l9351o6615k4893k108
20650D013078N2493J5580J3186j7963J8310r5203L0484J00081J1671n1762N7115
20639D147070j997N172K5068N4299K3597j0650r6994M2408j3684n2207l1522m4697
20627D045863J12923L9002l6596l1929P1725K0675r320J3176J946k0838k1667
20616D184960k218l0014L8370J9347M7431K8607m0721j30363L2635K1474J16293
20605D285801J03783j6426J2702n2815P168p257k0491p6457l391j324P7247l2150
20593D276390p8089J9182k8515r600N6872l165M0625J57821Q9708m0325q5904
20582D395000q204N7762j1284k8953r2761m6931k5141k6135J7543Q1808m3569
$$ plain form
20571 4269135 4254421 4254957 4264797 4339355 4324927 4361008 4402781 4375322 4340553 4390945 4414440 4457506
20559 4457506 4484938 4508105 4513199 4518329 4470670 4432440 4453666 4485593 4429984 4389536 4417086 4441069
20547 4441069 4416263 4452753 4484115 4483436 4520627 4515868 4467878 4485056 4518424 4606475 4682217 4609626
20535 4609626 4570299 4517690 4538206 4577768 4568861 4566190 4513112 4492303 4558633 4544123 4561031 4536139
20523 4536139 4532943 4526920 4567797 4589456 4624395 4718352 4723075 4658751 4605837 4617224 4679292 4750058
20511 4750058 4737613 4721173 4639557 4634076 4584330 4635701 4636912 4563479 4506880 4589888 4692587
20500 4692587 4718997 4695801 4662946 4703416 4677417 4635518 4625187 4577659 4562285 4581284 4589750
20489 4589750 4584219 4551350 4595578 4677029 4646513 4711337 4734097 4693235 4681152 4697183 4711634
$$ packed form
20571D269135j4714N36R840P4558j4428L6081M1773k7459l4769N0392K3495M3066
20559D457506K7432K3167N094N130m7659l8230K1226L1927n5609m0448K7550K3983
20547D441069k4806L6490L1362o79L7191m759m7990J7178L3368Q8051P5742p2591
20535D609626l9327n2609K0516L9562q907k671n3078k0809O6330j4510J6908k4892
20523D536139l196o023M0877K1659L4939R3957M723o4324n2914J1387O2068P0766
20511D750058j2445j6440q1616n481m9746N1371J211p3433n6599Q3008J02699
20500D692587K6410k3196l2855M0470k5999m1899j0331m7528j5374J8999Q466
20489D589750n531l2869M4228Q1451l0516O4824K2760m0862j2083J6031J4451
$$ plain form
20478 4711634 4772418 4818624 4807811 4769779 4771623 4707573 4687218 4806485 4804995 4764051 4709443
20467 4709443 4750207 4787574 4804003 4772919 4720923 4732634 4724120 4786374 4724679 4699720 4794399
20456 4794399 4807127 4755677 4756885 4744670 4715071 4795720 4833713 4805988 4799268 4768412 4780235 4763485
20444 4763485 4843385 4909668 4916277 4976192 4999173 4954110 4900322 4846430 4745171 4739534 4762677
20433 4762677 4746868 4880618 4972888 4933768 4876164 4881030 4954281 4968835 4944053 4878490 4830821
20422 4830821 4895463 4926473 4909375 4932495 4927001 4916043 5028601 5013707 5015110 5076096 5089573
20411 5089573 5046593 5038783 4953921 4985186 5006942 5041421 5046238 4952027 4881618 5008974 5059700
20400 5059700 5139191 5070461 5065470 5058884 5082584 5100245 5053861 4991685 4968919 4935647 4967074 4968413
$$ packed form
20478D711634O0784M6206j0813l8032J844o4050k0355J19267j490m0944n4608
20467D709443M0764L7367J6429l1084n1996J1711q514O2254o1695k4959R4679
20456D794399J2728n1450J208j2215k9599Q0649L7993k7725o720l0856J1823j6750
20444D763485P9900O6283O609N9915K2981m5063n3788n3892j01259n637K3143
20433D762677j5809J33750R2270l9120n7604M866P3251J4554k4782o5563m7669
20422D830821O4642L1010j7098K3120n494j0958J12558j4894J403O0986J3477
20411E089573m2980p810q4862L1265K1756L4479M817r4211p0409J27356N0726
20400E059700P9491o8730m991o586K3700J7661m6384o2176k2766l3272L1427J339
$$ plain form
20388 4968413 5004575 5102051 5190723 5190401 5093580 5057564 5001925 4899041 4907770 5041985 5202556
20377 5202556 5307668 5299176 5243421 5221110 5262780 5302322 5266690 5227213 5243540 5243317 5266227 5262709
20365 5262709 5189057 5177483 5274096 5318221 5361468 5457394 5380147 5318786 5263974 5298711 5379303
20354 5379303 5321149 5311238 5244101 5168092 5159749 5179072 5323977 5257207 5284966 5379447 5408718
20343 5408718 5425377 5384613 5326938 5315202 5333003 5265224 5286455 5348659 5319671 5340915 5359239
20332 5359239 5357254 5346328 5307927 5275802 5267259 5274109 5328737 5412983 5403338 5355097 5310116 5319519
20320 5319519 5380372 5455035 5464550 5452110 5431963 5400314 5435560 5503619 5571807 5609284 5603605 5567856
20308 5567856 5525062 5472509 5492567 5588606 5596024 5521954 5444562 5454638 5531465 5527195 5524023 5535560
$$ packed form
20388D968413L6162R7476Q8672l22r6821l6016n5639j02884Q729J34215J60571
20377E202556J05112q492n5755k2311M1670L9542l5632l9477J6327k23K2910l518
20365E262709p3652j1574R6613M4125M3247R5926p7247o1361n4812L4737Q0592
20354E379303n8154r911o7137p6009q343J9323J44905o6770K7759R4481K9271
20343E408718J6659m0764n7675j1736J7801o7779K1231O2204k8988K1244J8324
20332E359239j985j0926l8401l2125q543O850N4628Q4246r645m8241m4981R403
20320E319519O0853P4663R515j2440k0147l1649L5246O8059O8188L7477n679l5749
20308E567856m2794n2553K0058R6039P418p4070p7392J0076P6827m270l172J1537
$$ plain form
20296 5535560 5577037 5587752 5625299 5620560 5628435 5633897 5641504 5637584 5651704 5609059 5641951 5670305
20284 5670305 5636942 5657749 5629084 5533621 5520972 5560154 5607989 5684149 5799987 5798190 5724113
20273 5724113 5721838 5749552 5690701 5758784 5872854 5796650 5742736 5761479 5819077 5823486 5767590
20262 5767590 5723678 5785619 5783082 5722337 5763634 5806299 5805445 5743009 5728559 5773011 5800827 5794899
20250 5794899 5837452 5970850 6056856 6000336 5904385 5889188 5988452 5974793 5936118 5861287 5816731
20239 5816731 5857347 5822757 5797302 5918459 5972003 5927757 5930990 5938839 5887123 5905800 5930868
20228 5930868 5840964 5702061 5685754 5788314 5852521 5950635 6030550 6084168 6087693 6003176 5993647
20217 5993647 5997686 6067552 6102475 6081274 6029777 5974424 5964393 6032327 6060892 6100430 6151564
$$ packed form
20296E535560M1477J0715L7547m739P875N462P607l920J4120m2645L2892K8354
20284E670305l3363K0807k8665r5463j2649L9182M7835P6160J15838j797p4077
20273E724113k275K7714n8851O8083J14070p6204n3914J8743N7598M409n5896
20262E767590m3912O1941k537o0745M1297M2665q54o2436j4450M4452K7816n928
20250E794899M2553J33398Q6006n6520r5951j5197R9264j3659l8675p4831m4556
20239E816731M0616l4590k5455J21157N3544m4246L233P849n1716J8677K5068
20228E930868q9904j38903j6307J02560O4207R8114P9915N3618L525q4517r529
20217E993647M039O9866L4923k1201n1497n5353j0031O7934K8565L9538N1134
$$ plain form
20206 6151564 6093941 6103944 6026229 5987649 5947765 5814471 5818603 5921125 5999776 5884247 5885394
20195 5885394 6050506 6126702 6166499 6165068 6147000 6141927 6157822 6217126 6249567 6254332 6238343 6263568
20183 6263568 6257232 6332002 6264961 6250922 6271936 6321384 6225446 6151349 6166797 6151294 6125104
20172 6125104 6081023 6096343 6196838 6249264 6295509 6272971 6273516 6346116 6324350 6321555 6264456 6181207
20160 6181207 6205492 6259656 6246011 6346768 6375719 6273388 6288392 6352603 6323356 6337118 6375473
20149 6375473 6381369 6387149 6433266 6484642 6544527 6533738 6442441 6482534 6552152 6532986 6510412 6488836
20137 6488836 6447896 6481844 6494034 6450875 6444607 6519414 6545910 6507901 6462427 6458704 6490873 6568784
20125 6568784 6617692 6618456 6647029 6615029 6578510 6592269 6601646 6572553 6551756 6648741 6726203 6700809
$$ packed form
20206F151564n7623J0003p7715l8580l9884j33294M132J02522P8651j15529J147
20195E885394J65112P6196L9797j431j8068n073J5895N9304L2441M765j5989K5225
20183F263568o336P4770o7041j4039K1014M9448r5938p4097J5448j5503k6190
20172F125104m4081J5320J00495N2426M6245k2538N45P2600k1766k795n7099q3249
20160F181207K4285N4164j3645J00757K8951j02331J5004O4211k9247J3762L8355
20149F375473N896N780M6117N1376N9885j0789r1297M0093O9618j9166k2574k1576
20137F488836m0940L3948J2190m3159o268P4807K6496l8009m5474l723L2169P7911
20125F568784M8908P64K8573l2000l6519J3759R377k9093k0797R6985P7462k5394
$$ plain form
20113 6700809 6627395 6724648 6818891 6845062 6914927 6987220 6910151 6830567 6774713 6774108 6734909 6735876
20101 6735876 6820489 6849499 6889817 6872100 6890952 6958813 6918838 6824407 6863037 6895520 6846154
20090 6846154 6852740 6797565 6839187 6843577 6826464 6887137 6881807 6932269 6951302 6857863 6796824 6833028
20078 6833028 6911369 6955212 7018167 7091597 7026853 7015611 7053712 7041015 6966137 6905495 6935776
20067 6935776 6974555 7003688 7039885 7089891 7111607 7149995 7174708 7146212 7169103 7170501 7256404
20056 7256404 7358398 7295770 7273338 7304592 7321525 7295460 7276329 7238867 7242189 7227512 7270220
20045 7270220 7370196 7413701 7464433 7510360 7472835 7405484 7409762 7430578 7415654 7430904 7450128
20034 7450128 7456252 7404559 7408301 7378242 7452680 7550757 7598675 7680930 7709196 7689388 7619602 7582787
$$ packed form
20113F700809p3414R7253R4243K6171O9865P2293p7069p9584n5854o05l9199R67
20101F735876Q4613K9010M0318j7717J8852O7861l9975r4431L8630L2483m9366
20090F846154O586n5175M1622M390j7113O0673n330N0462J9033r3439o1039L6204
20078F833028P8341M3843O2955P3430o4744j1242L8101j2697p4878o0642L0281
20067F935776L8779K9133L6197N0006K1716L8388K4713k8496K2891J398Q5903
20056G256404J01994o2628k2432L1254J6933k6065j9131l7462L322j4677M2708
20045G270220R9976M3505N0732M5927l7525o7351M278K0816j4924J5250J9224
20034G450128O124n1693L742l0059P4438R8077M7918Q2255K8266j9808o9786l6815
$$ plain form
20022 7582787 7638559 7582961 7605104 7682109 7684638 7705214 7719392 7732983 7782255 7884471 7870994
20011 7870994 7885496 7950311 8016648 7991387 7933118 7874096 7840498 7793757 7721024 7711220 7760583
20000 7760583 7762463 7678157 7520601 7443422 7449441 7427393 7323254 7312230 7441899 7547554 7585309
19989 7585309 7601659 7706524 7790168 7834872 7825157 7689103 7603131 7600892 7647276 7682015 7750429
19978 7750429 7765775 7804542 7812537 7720941 7766682 7876678 8037120 8041369 7955291 7955235 7974381 8043358
19966 8043358 8145612 8232883 8318604 8288957 8344051 8392414 8397705 8476611 8502755 8436842 8362337
19955 8362337 8269902 8114768 8103414 8176648 8139781 8088182 7974622 7954452 7859414 7712266 7704882
19944 7704882 7748544 7741168 7757193 7818540 7819272 7863814 7943327 7970564 7943449 7965319 7940136 7996308
$$ packed form
20022G582787N5772n5598K2143P7005K529K0576J4178J3591M9272J02216j3477
20011G870994J4502O4815O6337k5261n8269n9022l3598m6741p2733r804M9363
20000G760583J880q4306j57556p7179O019k2048j04139j1024J29669J05655L7755
19989G585309J6350J04865Q3644M4704r715j36054q5972k239M6384L4739O8414
19978G750429J5346L8767P995r1596M5741J09996J60442M249q6078n6J9146O8977
19966H043358J02254Q7271Q5721k9647N5094M8363N291P8906K6144o5913p4505
19955H362337r2435j55134j1354P3234l6867n1599j13560k0170r5038j47148p384
19944G704882M3662p376J6025O1347P32M4542P9513K7237k7115K1870k5183N6172
$$ plain form
19932 7996308 8042973 8083489 8157422 8147117 8160614 8198750 8243567 8268213 8264164 8289487 8324499
19921 8324499 8429255 8487330 8471458 8398073 8425225 8547302 8577424 8455289 8368940 8356555 8339069
19910 8339069 8381659 8473848 8458571 8500052 8548204 8614576 8661315 8654284 8674748 8645945 8628262
19899 8628262 8678502 8622862 8606417 8618710 8651510 8657531 8689890 8764126 8809370 8939415 8921838
19888 8921838 8801391 8818408 8883575 8938555 8988310 8981043 9002049 8962193 8865050 8822220 8798454
19877 8798454 8836563 8880146 9063667 9129920 9111464 9093164 9082725 9030482 9003834 9096536 9154564
19866 9154564 9182860 9248867 9269714 9258228 9234289 9220733 9235585 9217066 9165812 9159096 9242533
19855 9242533 9295644 9394843 9443487 9436628 9452625 9559418 9595262 9577630 9559690 9582880 9626658
$$ packed form
19932G996308M6665M0516P3933j0305J3497L8136M4817K4646m049K5323L5012
19921H324499J04756N8075j5872p3385K7152J22077L0122j22135q6349j2385j7486
19910H339069M2590R2189j5277M1481M8152O6372M6739p031K0464k8803j7683
19899H628262N0240n5640j6445J2293L2800O021L2359P4236M5244J30045j7577
19888H921838j20447J7017O5167N4980M9755p267K1006l9856r7143m2830k3766
19877H798454L8109M3583J83521O6253j8456j8300j0439n2243k6648R2702N8028
19866I154564K8296O6007K0847j1486k3939j3556J4852j8519n1254o716Q3437
19855I242533N3111R9199M8644o859J5997J06793L5844j7632j7940K3190M3778
$$ plain form
19844 9626658 9610381 9588288 9559169 9669262 9752974 9712684 9661903 9693933 9731822 9712552 9630147
19833 9630147 9730930 9802537 9806972 9812183 9860050 9871964 9854347 9727870 9738459 9866632 9969841
19822 9969841 9963399 10049456 10106333 10042029 9936463 9871284 9888690 9966245 10006358 10017160 10103286
19811 10103286 10228881 10298873 10302009 10270320 10292781 10305451 10229938 10292484 10337163 10351657 10416320
19800 10416320 10438326 10450215 10405663 10421413 10444224 10429051 10480779 10480423 10515058 10496689 10556375
19789 10556375 10589614 10644943 10625467 10627055 10697866 10778467 10857501 10880092 10865920 10884112 10874127
19778 10874127 10885309 10857011 10921755 10992828 11032466 11057531 11037078 11051428 11079579 11103299 11169311
19767 11169311 11132549 11153968 11142147 11194918 11279679 11347808 11359048 11358960 11345585 11355299 11504823 11541929
$$ packed form
19844I626658j6277k2093k9119J10093Q3712m0290n0781L2030L7889j9270q2405
19833I630147J00783P1607M435N211M7867J1914j7617j26477J0589J28173J03209
19822I969841o442Q6057N6877o4304j05566o5179J7406P7555M0113J0802Q6126
19811A0103286J25595O9992L136l1689K2461J2670p5513O2546M4679J4494O4663
19800A0416320K2006J1889m4552J5750K2811j5173N1728l56L4635j8369N9686
19789A0556375L3239N5329j9476J588P0811Q0601P9034K2591j4172J8192r985
19778A0874127J1182k8298O4744P1073L9638K5065k0453J4350K8151K3720O6012
19767A1169311l6762K1419j1821N2771Q4761O8129J1240q8j3375R714J49524L7106
$$ plain form
19755 11541929 11494058 11537665 11585778 11738714 11773048 11690170 11633512 11661658 11593353 11554887 11553924
19744 11553924 11573538 11658142 11761063 11744210 11762186 11857041 11911517 11936543 11945871 11932537 11924861
19733 11924861 11943536 12005622 12063947 12072980 12166670 12226226 12201254 12173908 12155077 12148581 12247168
19722 12247168 12363159 12439101 12447934 12487227 12562009 12603643 12606482 12592581 12499805 12507782 12608851
19711 12608851 12841453 12921550 12917338 12995583 13072634 13102438 13156167 13222328 13178266 13185264 13258677
19700 13258677 13369615 13335176 13300035 13368299 13377047 13353561 13338989 13369770 13427272 13450339 13463973
19689 13463973 13494931 13568202 13621756 13636951 13684942 13679006 13697823 13784824 13826247 13880773 13975306
19678 13975306 14067629 14140855 14255909 14335696 14362603 14352277 14382471 14438798 14498885 14503222 14539181
$$ packed form
19755A1541929m7871M3607M8113J52936L4334q2878n6658K8146o8305l8466r63
19744A1553924J9614Q4604J02921j6853J7976R4855N4476K5026R328j3334p676
19733A1924861J8675O2086N8325R033R3690N9556k4972k7346j8831o496R8587
19722A2247168J15991P5942Q833L9293P4782M1634K839j3901r2776P977J01069
19711A2608851K32602Q0097m212P8245P7051K9804N3729O6161m4062O998P3413
19700A3258677J10938l4439l5141O8264Q748k3486j4572L0781N7502K3067J3634
19689A3463973L0958P3271N3554J5195M7991n936J8817Q7001M1423N4526R4533
19678A3975306R2323P3226J15054P9787K6907j0326L0194N6327O0087M337L5959
$$ plain form
19667 14539181 14644637 14760195 14842902 14910752 15004856 15070475 15170166 15264240 15435345 15413254
19657 15413254 15308450 15367781 15475826 15579095 15615143 15656070 15756641 15889870 16061900 16161546
19647 16161546 16131841 16119212 16130925 16094075 16040725 16024646 16017020 16129683 16177752 16134450 16116404
19636 16116404 16202108 16294639 16268583 16252480 16360494 16443270 16500002 16614323 16726680 16913608
19626 16913608 17037655 17000101 16983317 17047586 17155221 17216924 17421167 17512692 17577126 17560900
19616 17560900 17527153 17624983 17779996 17949844 18065527 18157277 18274512 18392703 18541292 18655596
19606 18655596 18759067 19001949 19228741 19382848 19425342 19456547 19498803 19470608 19552239 19636272
19596 19636272 19702200 19778330 19856567 19894576 19873287 19878359 19947361 20119467 20221456 20214397 20237951
$$ packed form
19667A4539181J05456J15558Q2707O7850R4104O5619R9691R4074J71105k2091
19657A5413254j04804N9331J08045J03269L6048M0927J00571J33229J72030R9646
19647A6161546k9705j2629J1713l6850n3350j6079p626J12663M8069m3302j8046
19636A6116404Q5704R2531k6056j6103J08014Q2776N6732J14321J12357J86928
19626A6913608J24047l7554j6784O4269J07635O1703K04243R1525O4434j6226
19616A7560900l3747R7830J55013J69848J15683R1750J17235J18191J48589J14304
19606A8655596J03471K42882K26792J54107M2494L1205M2256k8195Q1631Q4033
19596A9636272O5928P6130P8237L8009k1289N072O9002J72106J01989p059K3554
$$ plain form
19585 20237951 20405086 20628047 20813142 20989233 21048981 21164930 21379351 21530597 21713483
19576 21713483 21963751 22114720 22241783 22385790 22541070 22803245 23008466 23224901 23388622
19567 23388622 23498785 23730425 23943781 24173098 24368756 24568302 24827921 25168991 25479412
19558 25479412 25749115 25948050 26194818 26456607 26720177 26990298 27348338 27625141 27969409
19549 27969409 28238210 28510508 28780707 29155996 29613759 30037935 30318290 30655229 31037062
19540 31037062 31381671 31812114 32392865 32917530 33423831 33988500 34576349 35205440 35735740
19531 35735740 36396645 37115851 37827961 38585924 39327865 40063759 40744259 41386322 42173132
19522 42173132 43002588 44041994 45259601 46564638 47799586 49099804 50606947 52345098
$$ packed form
19585B0237951J67135K22961J85095J76091N9748J15949K14421J51246J82886
19576B1713483K50268J50969J27063J44007J55280K62175K05221K16435J63721
19567B3388622J10163K31640K13356K29317J95658J99546K59619L41070L10421
19558B5479412K69703J98935K46768K61789K63570K70121L58040K76803L44268
19549B7969409K68801K72298K70199L75289M57763M24176K80355L36939L81833
19540C1037062L44609M30443N80751N24665N06301N64669N87849O29091N30300
19531C5735740O60905P19206P12110P57963P41941P35894O80500O42063P86810
19522D2173132Q29456J039406J217607J305037J234948J300218J507143J738151
$$ plain form
19514 52345098 54345316 56666875 59122469 61794027 64906420 68540789 72751001 77768388
19506 77768388 83597834 90280059 97406875 103466871 105896638 101524457 88756439 69835319
19498 69835319 51293903 39531296 36412789 38132596 37385950 28319488 10239125 -11906908
19490 -11906908 -30584738 -40716253 -41976907 -37842231 -32445184 -27658812 -23529695 -19821783
19482 -19821783 -16575641 -13695759 -11079511 -8725734 -6795816 -5096071 -3382064 -1662186
19474 -1662186 103842 1896177 3851496 6053143 8312435 10658852 12946197 15234244
19466 15234244 17479933 19898336 22642852 25654461 28906687 32446015 36488985 41049528
19458 41049528 46208284 52170347 58979684 66615655 74672345 81933153 85253949 81076935
$$ packed form
19514E2345098K000218K321559K455594K671558L112393L634369M210212N017387
19506G7768388N829446O682225P126816O059996K429767m372181j2768018j8921120
19498F9835319j8541416j1762607l118507J719807p46646r066462j8080363k2146033
19490a1906908j8677830j0131515j260654M134676N397047M786372M129117L707912
19482a9821783L246142K879882K616248K353777J929918J699745J714007J719878
19474a662186J766028J792335J955319K201647K259292K346417K287345K288047
19466A5234244K245689K418403K744516L011609L252226L539328M042970M560543
19458D1049528N158756N962063O809337P635971Q056690P260808L320796m177014
$$ plain form
19450 81076935 67419775 46585334 25706665 11973955 7911743 9537561 8846196 -966208
19442 -966208 -20940048 -45947437 -67454163 -79448025 -81676750 -77600826 -71853739 -66682526
19434 -66682526 -62274968 -58424698 -55010737 -52012489 -49529170 -47421370 -45725682 -44282901
19426 -44282901 -42962695 -41558061 -40089659 -38591538 -37006783 -35451504 -33938872 -32594643
19418 -32594643 -31346830 -30266429 -29280886 -28381285 -27399164 -26433470 -25449954 -24517899 -23665304
19409 -23665304 -22740547 -21781830 -21030255 -20325048 -19661657 -18881106 -18090385 -17326011 -16602889
19400 -16602889 -16002104 -15406537 -14781403 -14280609 -13781412 -13308077 -12855089 -12343830 -11884372
19391 -11884372 -11560220 -11124231 -10579541 -10157349 -9828206 -9518166 -9168185 -8797323 -8399991
$$ packed form
19450H1076935j3657160k0834441k0878669j3732710m062212J625818o91365r812404
19442i66208j9973840k5007389k1506726j1993862k228725M075924N747087N171213
19434f6682526M407558L850270L413961K998248K483319K107800J695688J442781
19426d4282901J320206J404634J468402J498121J584755J555279J512632J344229
19418c2594643J247813J080401R85543Q99601R82121R65694R83516R32055Q52595
19409b3665304R24757R58717P51575P05207O63391P80551P90721P64374P23122
19400a6602889O00785N95567O25134N00794M99197M73335M52988N11259M59458
19391a1884372L24152M35989N44690M22192L29143L10040L49981L70862L97332
$$ plain form
19382 -8399991 -8005588 -7681088 -7415924 -7115369 -6754660 -6575018 -6307005 -5977616 -5676074
19373 -5676074 -5485656 -5189806 -4864858 -4595159 -4365273 -4087086 -3856493 -3609864 -3482780
19364 -3482780 -3271416 -2832913 -2578182 -2407324 -2215785 -1959944 -1713753 -1535770 -1361512
19355 -1361512 -1259101 -1201493 -1087744 -1109616 -1185609 -1191273 -1102014 -941046 -785998 -641562
19345 -641562 -426215 -172685 76345 228665 384488 478976 580976 739367 912031 1176102
19335 1176102 1402892 1553654 1689260 1804182 1894474 2112094 2294406 2397443 2537377 2758617
19325 2758617 3000159 3149072 3229795 3379651 3500058 3496974 3462391 3501426 3431712 3306500
19315 3306500 3232354 3201249 3250761 3501917 3717157 3945612 4095652 4108848 4121416 4300355
$$ packed form
19382h399991L94403L24500K65164L00555L60709J79642K68013L29389L01542
19373e676074J90418K95850L24948K69699K29886K78187K30593K46629J27084
19364c482780K11364M38503K54731J70858J91539K55841K46191J77983J74258
19355a361512J02411N7608J13749k1872p5993n664Q9259J60968J55048J44436
19345f41562K15347K53530K49030J52320J55823R4488J02000J58391J72664K64071
19335A176102K26790J50762J35606J14922R0292K17620J82312J03037J39934K21240
19325B758617K41542J48913Q0723J49856J20407l084l4583L9035o9714j25212
19315C306500p4146l1105M9512K51156K15240K28455J50040J3196J2568J78939
$$ plain form
19305 4300355 4502683 4670144 4864992 5003095 5113138 5166017 5323279 5494569 5654182 5700843
19295 5700843 5717375 5821991 5994210 6205600 6306711 6403213 6484277 6554674 6705252 6854558
19285 6854558 7010204 7060827 7150879 7333783 7501969 7698469 7801191 7940991 8044674 8158356
19275 8158356 8196676 8179349 8264763 8379191 8493068 8577341 8724983 8924410 9114201 9285648
19265 9285648 9360811 9397325 9458616 9620963 9783157 9938843 10081870 10243915 10349185 10429356
19255 10429356 10522550 10649832 10836929 11003923 11174746 11307072 11449569 11579420 11681050
19246 11681050 11800562 11936592 12033777 12042534 12170779 12420221 12662107 12766964 12922983 13100292
19236 13100292 13310181 13503398 13612160 13640284 13752199 13918525 14069974 14198245 14336946
$$ packed form
19305D300355K02328J67461J94848J38103J10043N2879J57262J71290J59613M6661
19295E700843J6532J04616J72219K11390J01111R6502Q1064P0397J50578J49306
19285F854558J55646N0623R0052J82904J68186J96500J02722J39800J03683J13682
19275H158356L8320j7327Q5414J14428J13877Q4273J47642J99427J89791J71447
19265I285648P5163L6514O1291J62347J62194J55686J43027J62045J05270Q0171
19255A0429356R3194J27282J87097J66994J70823J32326J42497J29851J01630
19246A1681050J19512J36030R7185Q757J28245K49442K41886J04857J56019J77309
19236A3100292K09889J93217J08762K8124J11915J66326J51449J28271J38701
$$ plain form
19227 14336946 14509427 14710451 14924271 14997591 15168834 15400783 15580498 15723481 15926526
19218 15926526 16188000 16307046 16447794 16647077 16877182 17070901 17310869 17554009 17767834
19209 17767834 18064217 18375144 18637774 18846778 19007670 19148917 19409282 19716095 19966851
19200 19966851 20231578 20511294 20883467 21199440 21397982 21517182 21802086 22164025 22504070
19191 22504070 22895628 23205841 23537825 23869933 24122644 24550372 24992590 25449361 25896942
19182 25896942 26407816 26843737 27287768 27840005 28409500 29034003 29615882 30196517 30834799
19173 30834799 31563925 32267330 33033879 33832604 34541457 35223303 35937103 36776114 37737206
19164 37737206 38626404 39670278 40725774 41810246 42943581 44221131 45786752 47508547
$$ packed form
19227A4336946J72481K01024K13820P3320J71243K31949J79715J42983K03045
19218A5926526K61474J19046J40748J99283K30105J93719K39968K43140K13825
19209A7767834K96383L10927K62630K09004J60892J41247K60365L06813K50756
19200A9966851K64727K79716L72173L15973J98542J19200K84904L61939L40045
19191B2504070L91558L10213L31984L32108K52711M27728M42218M56771M47581
19182B5896942N10874M35921M44031N52237N69495O24503N81879N80635O38282
19173C0834799P29126P03405P66549P98725P08853O81846P13800Q39011R61092
19164C7737206Q89198J043874J055496J084472J133335J277550J565621J721795
$$ plain form
19156 47508547 49347369 51519598 54006006 56775679 59912065 63394593 67291398 71882347
19148 71882347 77356614 83671394 90142370 94976779 95488479 90475616 80580613 68369841
19140 68369841 57167830 47549490 38870626 32137645 26528979 18473620 6745634 -6125720
19132 -6125720 -17974262 -28868388 -36451056 -37639123 -33930050 -28841171 -23972389 -19745947
19124 -19745947 -16156343 -12908347 -10055183 -7670224 -5289711 -3043151 -1000164 998899
19116 998899 3106432 5212373 7210471 9234821 11243446 13437932 15980619 18916367
19108 18916367 22443809 26333388 30729607 35660468 41311316 47818164 55234145 63439798
19100 63439798 71508951 77105149 77048929 69932565 57107515 41820145 27919081 15692373
$$ packed form
19156D7508547J838822K172229K486408K769673L136386L482528L896805M590949
19148G1882347N474267O314780O470976M834409N11700n012863r895003j2210772
19140F8369841j1202011r618340q678864o732981n608666q055359j1727986j2871354
19132f125720j1848542j0894126p582668j188067L709073N088879M868782M226442
19124a9745947L589604L247996K853164K384959K380513K246560K042987J999063
19116I98899K107533K105941J998098K024350K008625K194486K542687K935748
19108A8916367L527442L889579M396219M930861N650848O506848P415981Q205653
19100F3439798Q069153N596198n6220p116364j2825050j5287370j3901064j2226708
$$ plain form
19092 15692373 4780811 -3448843 -10337850 -20061256 -33777976 -48638128 -62373279
19085 -62373279 -74841439 -83135732 -83919642 -79393797 -73809379 -68900943 -64803245 -61143052
19077 -61143052 -57896444 -55180972 -52899473 -50933334 -49128248 -47602796 -46251703 -44913114
19069 -44913114 -43426559 -42051999 -40710936 -39401618 -38089198 -36910843 -35768215 -34615202
19061 -34615202 -33546919 -32449108 -31295141 -30400672 -29553944 -28631360 -27612173 -26539158
19053 -26539158 -25595319 -24781867 -24046808 -23272567 -22535681 -21821175 -21151703 -20488646 -19807025
19044 -19807025 -19087689 -18540446 -17938558 -17452230 -17038822 -16527975 -16056711 -15534547 -15017351
19035 -15017351 -14526102 -14050987 -13641215 -13348269 -13005306 -12676995 -12332245 -11982844 -11656897
$$ packed form
19092A5692373j0911562q229654o889007r723406j3716720j4860152j3735151
19085f2373279j2468160q294293p83910M525845N584418M908436M097698L660193
19077f1143052L246608K715472K281499J966139J805086J525452J351093J338589
19069d4913114J486555J374560J341063J309318J312420J178355J142628J153013
19061c4615202J068283J097811J153967Q94469Q46728R22584J019187J073015
19053b6539158R43839Q13452P35059P74241P36886P14506O69472O63057O81621
19044a9807025P19336N47243O01888M86328M13408N10847M71264N22164N17196
19035a5017351M91249M75115M09772K92946L42963L28311L44750L49401L25947
$$ plain form
19026 -11656897 -11277389 -10968487 -10656903 -10229560 -9866504 -9571203 -9241318 -8861229 -8689184
19017 -8689184 -8404952 -8137302 -7932237 -7586855 -7283712 -7127552 -6892212 -6650873 -6386120
19008 -6386120 -6155851 -6005521 -5745294 -5380096 -5174682 -4985253 -4781174 -4645893 -4488487
18999 -4488487 -4306958 -4113821 -3848122 -3664332 -3376708 -3188305 -3044479 -2811193 -2590635
18990 -2590635 -2303856 -2055055 -1921860 -1922283 -1963262 -1900775 -1837163 -1675425 -1475294 -1340909
18980 -1340909 -1243433 -1135031 -995773 -854523 -733879 -565968 -359602 -50778 165770 310760
18970 310760 455188 558326 672705 751552 759040 647966 528130 500909 608058 771326
18960 771326 1039458 1298126 1519390 1630921 1805366 1969216 2221814 2453802 2517830 2636135
$$ packed form
19026a1656897L79508L08902L11584M27343L63056K95301L29885L80089J72045
19017h689184K84232K67650K05065L45382L03143J56160K35340K41339K64753
19008f386120K30269J50330K60227L65198K05414J89429K04079J35281J57406
18999d488487J81529J93137K65699J83790K87624J88403J43826K33286K20558
18990b590635K86779K48801J33195m23m0979O2487O3612J61738K00131J34385
18980a340909R7476J08402J39258J41250J20644J67911K06366L08824K16548J44990
18970C10760J44428J03138J14379P8847P488j11074j19836k7221J07149J63268
18960G71326K68132K58668K21264J11531J74445J63850K52598K31988O4028J18305
$$ plain form
18950 2636135 2787883 2988530 3204047 3357214 3460072 3668430 3850965 4043713 4222231
18941 4222231 4409137 4618150 4847500 5072911 5181032 5217756 5206055 5316512 5391752 5389954
18931 5389954 5129735 4828606 4529209 4257587 4188269 4275780 4504079 4710443 4923271 5139923
18921 5139923 5355933 5561975 5832722 5987097 5998955 6184635 6455298 6738184 6919899 7047662
18911 7047662 7180009 7250434 7411069 7597600 7727979 7765361 7883204 8078093 8336231 8538060
18901 8538060 8665101 8819062 8953367 9137575 9249296 9462232 9569507 9630433 9801399 10003877
18891 10003877 10205996 10265145 10332587 10518909 10685202 10947232 11229311 11404521 11481315 11639411
18881 11639411 11865575 12100990 12233826 12333587 12462872 12633080 12818189 12975176 13173370
$$ packed form
18950B636135J51748K00647K15517J53167J02858K08358J82535J92748J78518
18941D222231J86906K09013K29350K25411J08121L6724j1701J10457P5240j798
18931E389954k60219l01129k99397k71622o9318Q7511K28299K06364K12828K16652
18921E139923K16010K06042K70747J54375J1858J85680K70663K82886J81715J27763
18911G047662J32347P0425J60635J86531J30379L7382J17843J94889K58138K01829
18901H538060J27041J53961J34305J84208J11721K12936J07275O0926J70966K02478
18891A0003877K02119N9149O7442J86322J66293K62030K82079J75210P6794J58096
18881A1639411K26164K35415J32836R9761J29285J70208J85109J56987J98194
$$ plain form
18872 13173370 13384543 13566928 13797629 13943203 14036647 14226243 14396016 14518451 14719135
18863 14719135 14924955 15051274 15192581 15416853 15629722 15865178 16052656 16260849 16581396
18854 16581396 16823411 17070935 17377898 17733660 18014421 18168531 18425486 18753630 18969473
18845 18969473 19170809 19389877 19680375 20052338 20411246 20752334 20989441 21225757 21621054
18836 21621054 21958301 22267065 22618589 23048430 23457972 23904974 24253282 24535938 24898125
18827 24898125 25320954 25717830 26131346 26531589 26998723 27414936 27951050 28603129 29184507
18818 29184507 29763689 30408124 31025272 31644439 32425467 33094864 33802705 34482328 35106286
18809 35106286 35738398 36358000 36985293 37772399 38685282 39677460 40758902 42005950 43381564
$$ packed form
18872A3173370K11173J82385K30701J45574R3444J89596J69773J22435K00684
18863A4719135K05820J26319J41307K24272K12869K35456J87478K08193L20547
18854A6581396K42015K47524L06963L55762K80761J54110K56955L28144K15843
18845A8969473K01336K19068K90498L71963L58908L41088K37107K36316L95297
18836B1621054L37247L08764L51524M29841M09542M47002L48308K82656L62187
18827B4898125M22829L96876M13516M00243M67134M16213N36114O52079N81378
18818B9184507N79182O44435O17148O19167P81028O69397P07841O79623O23958
18809C5106286O32112O19602O27293P87106R12883R92178J081442J247048J375614
$$ plain form
18800 43381564 44782538 46224723 47678772 49111176 50743690 52440787 54386151 56614069
18792 56614069 59068478 61900919 65131973 68876294 73036180 77706517 83143618 89495710
18784 89495710 97040399 105793295 115457417 124297143 127969543 121688786 103172849 74687494
18776 74687494 42374874 11568745 -15799043 -37083194 -46695533 -44400491 -36562522
18769 -36562522 -28314842 -21118056 -14842327 -9602170 -5319024 -1706074 1470381 4307688
18761 4307688 7070647 9743831 12598119 15816408 19435738 23658744 28452497 33775264
18753 33775264 39756780 46455820 54003174 62674702 72839106 84400488 96549154 106621306
18745 106621306 109021931 98272092 72750079 36327429 -3116388 -39866513 -72220375
$$ packed form
18800D3381564J400974J442185J454049J432404J632514J697097J945364K227918
18792E6614069K454409K832441L231054L744321M159886M670337N437101O352092
18784H9495710P544689Q752896R664122Q839726L672400o280757j8515937k8485355
18776G4687494l2312620l0806129k7367788k1284151r612339K295042P837969
18769c6562522Q247680P196786O275729N240157M283146L612950L176455K837307
18761D307688K762959K673184K854288L218289L619330M223006M793753N322767
18753C3775264N981516O699040P547354Q671528J0164404J1561382J2148666J0072152
18745A06621306K400625j0749839k5522013l6422650l9443817l6750125l2353862
$$ plain form
18738 -72220375 -95834473 -104553866 -99977622 -90358208 -81038179 -73046120 -66327742 -60898689
18730 -60898689 -56677389 -53541034 -50968727 -48825249 -47041721 -45518568 -43972641 -42225297
18722 -42225297 -40334965 -38340421 -36318098 -34316943 -32349418 -30299348 -28259761 -26321110
18714 -26321110 -24420563 -22675108 -21034672 -19467263 -18017806 -16675314 -15381383 -14113940
18706 -14113940 -12792295 -11409186 -9878902 -8275557 -6715913 -5309285 -4040804 -2828162
18698 -2828162 -1587824 -360431 918773 2347926 4041903 5732819 7455975 9293887
18690 9293887 11386554 13617320 15993477 18482382 21252752 24325201 27824216 31798343
18682 31798343 36327906 41469075 47544292 54511170 62099975 69016343 71205990 61604308
$$ packed form
18738g2220375k3614098q719393M576244R619414R320029P992059O718378N429053
18730f0898689M221300L136355K572307K143478J783528J523153J545927J747344
18722d2225297J890332J994544K022323K001155J967525K050070K039587J938651
18714b6321110J900547J745455J640436J567409J449457J342492J293931J267443
18706a4113940J321645J383109J530284J603345J559644J406628J268481J212642
18698b828162J240338J227393J279204J429153J693977J690916J723156J837912
18690I293887K092667K230766K376157K488905K770370L072449L499015L974127
18682C1798343M529563N141169O075217O966878P588805O916368K189647r601682
$$ plain form
18674 61604308 36232027 -874861 -37149112 -56886569 -57849681 -51755630 -45289404 -39554037
18666 -39554037 -34688758 -30647527 -27171053 -24067089 -21408196 -19158899 -17514753 -16263424
18658 -16263424 -14947573 -13397004 -11593716 -9655980 -7704286 -5788370 -4006957 -2266507
18650 -2266507 -577385 964594 2489417 4115245 6099019 8399363 11038144 13882816
18642 13882816 16934338 20407750 24195569 28289022 32712406 37721858 43505059 50036983
18634 50036983 57407990 65875201 75205423 84514095 90454743 86901535 70851283 45349333
18626 45349333 18062460 -4786036 -27023529 -55058701 -82709236 -97075714 -95366930
18619 -95366930 -87482121 -79719819 -73092576 -67523525 -63021908 -59536693 -56586156 -53817995
$$ packed form
18674F1604308k5372281l7106888l6274251j9737457r63112O094051O466226N735367
18666c9554037M865279M041231L476474L103964K658893K249297J644146J251329
18658a6263424J315851J550569J803288J937736J951694J915916J781413J740450
18650b266507J689122J541979J524823J625828J983774K300344K638781K844672
18642A3882816L051522L473412L787819M093453M423384N009452N783201O531924
18634E0036983P371007Q467211R330222R308672N940648l553208j6050252k5501950
18626D5349333k7286873k2848496k2237493k8035172k7650535j4366478J708784
18619i5366930P884809P762302O627243N569051M501617L485215K950537K768161
$$ plain form
18611 -53817995 -51305018 -49213151 -47581667 -45849267 -43853044 -41733767 -39660524 -37718271
18603 -37718271 -36023051 -34420022 -32879149 -31483552 -30169886 -28924959 -27746924 -26426412
18595 -26426412 -24800496 -22830288 -20551439 -18199703 -15769354 -13213319 -10549799 -7608162
18587 -7608162 -4350426 -685674 3555283 8244683 13655265 19436190 24585152 26055281
18579 26055281 18427460 -1042837 -28849224 -55209556 -68675327 -68616401 -63866085 -58899518
18571 -58899518 -54631456 -51085207 -48161856 -45685728 -43519695 -41661298 -40206387 -39252070
18563 -39252070 -38646601 -37964036 -37119119 -36060123 -34912598 -33873973 -32824771 -31928621 -31224650
18554 -31224650 -30529425 -29902796 -29312912 -28618854 -27824399 -27109924 -26385200 -25672849 -24908848
$$ packed form
18611e3817995K512977K091867J631484J732400J996223K119277K073243J942253
18603c7718271J695220J603029J540873J395597J313666J244927J178035J320512
18595b6426412J625916J970208K278849K351736K430349K556035K663520K941637
18587g608162L257736L664752M240957M689400N410582N780925N148962J470129
18579B6055281p627821j9470297k7806387k6360332j3465771N8926M750316M966567
18571e8899518M268062L546249K923351K476128K166033J858397J454911R54317
18563c9252070O05469O82565Q44917J058996J147525J038625J049202Q96150P03971
18554c1224650O95225O26629N89884O94058P94455P14475P24724P12351P64001
$$ plain form
18545 -24908848 -24183390 -23575950 -22962839 -22329356 -21701300 -21140151 -20577907 -20002959 -19426285
18536 -19426285 -19046978 -18521495 -17941717 -17519267 -17099775 -16653342 -16237771 -15905672 -15528943
18527 -15528943 -15101848 -14711866 -14256893 -13904529 -13616969 -13283929 -12947067 -12627077 -12224072
18518 -12224072 -11874080 -11495671 -11103332 -10601642 -10244078 -9913609 -9503467 -9105540 -8722080
18509 -8722080 -8400588 -8070944 -7681051 -7302573 -6829654 -6423328 -6069765 -5807217 -5501193
18500 -5501193 -5183758 -4835708 -4412739 -4065073 -3736604 -3361410 -2979020 -2521500 -2138744
18491 -2138744 -1803876 -1448675 -1047008 -554684 -175466 178252 579038 931390 1386634
18482 1386634 1893783 2353047 2897900 3477032 3979406 4424938 4889382 5429260 5901935
$$ packed form
18545b4908848P25458O07440O13111O33483O28056N61149N62244N74948N76674
18536a9426285L79307N25483N79778M22450M19492M46433M15571L32099L76729
18527a5528943M27095L89982M54973L52364K87560L33040L36862L19990M03005
18518a2224072L49992L78409L92339N01690L57564L30469M10142L97927L83460
18509h722080L21492L29644L89893L78478M72919M06326L53563K62548L06024
18500e501193L17435L48050M22969L47666L28469L75194L82390M57520L82756
18491b138744L34868L55201M01667M92324L79218L53718M00786L52352M55244
18482A386634N07149M59264N44853N79132N02374M45532M64444N39878M72675
$$ plain form
18473 5901935 6485504 7055655 7663452 8302656 8902879 9614478 10403527 11222361 12010317
18464 12010317 12728871 13567290 14456641 15416279 16393197 17452915 18525430 19675278 20839749
18455 20839749 21872313 22898730 24033032 25280744 26767254 28387889 30109337 31766342
18447 31766342 33440140 35215500 37401873 39972459 43071893 46748715 50920712 55501234
18439 55501234 60815755 66914531 74134735 82739122 92981346 105036173 118617421 131571097
18431 131571097 137238788 125928436 90711128 33458296 -29841270 -78389639 -102051461
18424 -102051461 -102658375 -92116194 -80533996 -70596817 -62346526 -55512732 -49690385 -44701301
18416 -44701301 -40531119 -37300656 -34844780 -32834289 -30711202 -28156967 -25122038 -21760547
$$ packed form
18473E901935N83569N70151O07797O39204O00223P11599P89049Q18834P87956
18464A2010317P18554Q38419Q89351R59638R76918J059718J072515J149848J164471
18455B0839749J032564J026417J134302J247712J486510J620635J721448J657005
18447C1766342J673798J775360K186373K570586L099434L676822M171997M580522
18439E5501234N314521O098776P220204Q604387J0242224J2054827J3581248J2953676
18431A31571097N667691j1310352l5217308n7252832o3299566m8548369k3661822
18424a02051461o06914J0542181J1582198R937179Q250291O833794N822347M989084
18416d4701301M170182L230463K455876K010491K123087K554235L034929L361491
$$ plain form
18408 -21760547 -18154931 -14231552 -9809843 -4855705 589530 6662587 13502281 21387224
18400 21387224 30780801 41707868 53629346 64291418 67492836 55376071 23106298
18393 23106298 -25890182 -76527639 -112672325 -127784071 -125309011 -115804562 -106353089
18386 -106353089 -98439156 -91879476 -86469699 -81859330 -78044475 -75169097 -73182492 -71586457
18378 -71586457 -70271891 -68883936 -67292347 -65668752 -64196782 -63004465 -61900200 -60697064
18370 -60697064 -59357224 -57816265 -56440029 -55297234 -54323335 -53311586 -52143186 -51000360
18362 -51000360 -49746805 -48542383 -47531399 -46694277 -45807324 -44918745 -44079378 -43204196 -42358773
18353 -42358773 -41635817 -40934255 -40274555 -39691288 -39098533 -38465829 -37948563 -37323441 -36728482
$$ packed form
18408b1760547L605616L923379M421709M954138N445235O073057O839694P884943
18400B1387224R393577J0927067J1921478J0662072L201418j2116765l2269773
18393B3106298m8996480n0637457l6144686j5111746K475060R504449R451473
18386a06353089P913933O559680N409777M610369L814855K875378J986605J596035
18378g1586457J314566J387955J591589J623595J471970J192317J104265J203136
18370f0697064J339840J540959J376236J142795R73899J011749J168400J142826
18362e1000360J253555J204422J010984Q37122Q86953Q88579Q39367Q75182Q45423
18353d2358773P22956P01562O59700N83267N92755O32704N17266O25122N94959
$$ plain form
18344 -36728482 -36231383 -35656159 -35132107 -34652132 -34228155 -33773570 -33384218 -33017441 -32716844
18335 -32716844 -32355275 -31939954 -31535007 -31088149 -30714860 -30429505 -30046026 -29704773 -29464423
18326 -29464423 -29223595 -28915966 -28648566 -28462957 -28176633 -27797323 -27442489 -27144041 -27034091
18317 -27034091 -26815693 -26566906 -26287590 -25989733 -25702909 -25460816 -25277577 -24993055 -24799008
18308 -24799008 -24607638 -24369484 -24184566 -24072608 -23909341 -23755673 -23585757 -23397546 -23322313
18299 -23322313 -23171369 -22966605 -22791196 -22612216 -22446117 -22273727 -22154044 -21976103 -21776870
18290 -21776870 -21686088 -21438394 -21188581 -21061564 -21002948 -20968327 -20871673 -20739891 -20572529 -20436330
18280 -20436330 -20326867 -20255536 -20133774 -20038826 -19924381 -19765350 -19608168 -19398355 -19302337 -19259513
$$ packed form
18344c6728482M97099N75224N24052M79975M23977M54585L89352L66777L00597
18335c2716844L61569M15321M04947M46858L73289K85355L83479L41253K40350
18326b9464423K40828L07629K67400J85609K86324L79310L54834K98448J09950
18317b7034091K18398K48787K79316K97857K86824K42093J83239K84522J94047
18308b4799008J91370K38154J84918J11958J63267J53668J69916J88211P5233
18299b3322313J50944K04764J75409J78980J66099J72390J19683J77941J99233
18290b1776870R0782K47694K49813J27017N8616L4621R6654J31782J67362J36199
18280b0436330J09463P1331J21762R4948J14445J59031J57182K09813R6018M2824
$$ plain form
18270 -19259513 -19170297 -19040003 -18903988 -18815690 -18672083 -18612664 -18557071 -18429056 -18338717 -18228298
18260 -18228298 -18141736 -18023732 -17953297 -17836010 -17668095 -17481831 -17330659 -17196784 -17023870 -16973164
18250 -16973164 -16935213 -16838513 -16685038 -16601444 -16573667 -16540375 -16409267 -16227457 -16212127 -16168439
18240 -16168439 -16070054 -15999090 -15862867 -15751730 -15771151 -15739411 -15526025 -15355909 -15333308 -15260647
18230 -15260647 -15137447 -15086054 -15034309 -14930271 -14845759 -14727185 -14590954 -14553507 -14510795 -14372486
$$ packed form
18270a9259513Q9216J30294J36015Q8298J43607N9419N5593J28015R0339J10419
18260a8228298Q6562J18004P0435J17287J67915J86264J51172J33875J72914N0706
18250a6973164L7951R6700J53475Q3594K7777L3292J31108J81810J5330M3688
18240a6168439R8385P0964J36223J11137j9421L1740K13386J70116K2601P2661
18230a5260647J23200N1393N1745J04038Q4512J18574J36231L7447M2712J38309
$$ [...]
##END NTUPLES=NMR SPECTRUM
##END=
