##TITLE=Analysis number 327886
Compound Code cc 34039
Project Code adrs
Chemist Name af chempharm
##JCAMPDX= 6.0         $$ Bruker NMR JCAMP-DX V2.0
##DATA TYPE= NMR SPECTRUM
##DATA CLASS= NTUPLES
##ORIGIN= Bruker BioSpin GmbH
##OWNER= nmr
$$ XWIN-NMR		Version 3.5
$$ Mon Apr 16 10:54:52 2007 GMT Daylight Time (UT+1h)  MAYBRIDGE\nmr@NMR_250MHZ
##.OBSERVE FREQUENCY= 250.131544655141
##.OBSERVE NUCLEUS= ^1H
##.ACQUISITION MODE= SIMULTANEOUS (DQD)
##.ACQUISITION SCHEME= undefined
##.AVERAGES= 16
##.DIGITISER RES= 18
##SPECTROMETER/DATA SYSTEM= dpx250
##.PULSE SEQUENCE= zg30
##.SOLVENT NAME= CDCl3
##.SHIFT REFERENCE= (INTERNAL, CDCl3, 0, 16.4437)
##AUDIT TRAIL= $$ (NUMBER, WHEN, WHO, WHERE, WHAT)
$$ ##TITLE= Audit trail, XWIN-NMR		Version 3.5
$$ ##JCAMPDX= 5.01
$$ ##ORIGIN= Bruker BioSpin GmbH
$$ ##OWNER= nmr
$$ C:\u/data/dgb/nmr/ADRS/1480/pdata/1/auditp.txt
$$ ##AUDIT TRAIL=  $$ (NUMBER, WHEN, WHO, WHERE, WHAT)
(   1,<2007-04-16 10:54:31.31 +100>,<MAYBRIDGE\nmr>,<NMR_250MHZ>,
      <created by zg, POWCHK disabled, PULCHK disabled
       configuration hash MD5:
       49 4B E0 1D 92 C2 6B 37 9F E6 65 BC 52 41 86 1D
       data hash MD5: 64K
       A3 94 92 7F 08 69 21 62 E9 D3 67 30 14 84 FE F3>)
(   2,<2007-04-16 10:54:42.49 +100>,<MAYBRIDGE\nmr>,<NMR_250MHZ>,
      <Start of raw data processing
       ef LB = 0.3 FT_mod = 6 PKNL = 1 SI = 32K 
       data hash MD5: 32K
       A2 D1 6C 70 94 35 AD 05 25 9D 9C 85 78 0C 94 5B>)
(   3,<2007-04-16 10:54:44.19 +100>,<MAYBRIDGE\nmr>,<NMR_250MHZ>,
      <apk 
       data hash MD5: 32K
       C4 D8 0D 60 5F B2 07 25 DF AC 43 21 E8 5F 1B 90>)
(   4,<2007-04-16 10:54:44.97 +100>,<MAYBRIDGE\nmr>,<NMR_250MHZ>,
      <abs ABSG = 5 
       data hash MD5: 32K
       C3 ED B6 4A F2 EC 08 23 A1 CE 0F FD 0F CC 99 7A>)
$$ ##END=
$$ 
$$ hash MD5
$$ 68 DE 0E E1 A5 95 E0 9D 8A DD CA CD 56 12 43 B3
##$RELAX= 
##$RELAX= 
##$RELAX= 
##$RELAX= 
##$RELAX= 
##$RELAX= 
##$RELAX= 
$$ Bruker specific parameters
$$ --------------------------
##$DU= <C:\u>
##$EXPNO= 1480
##$NAME= <ADRS>
##$PROCNO= 1
##$TYPE= <nmr>
##$USER= <dgb>
##$AMP= (0..31)
100 100 100 100 100 100 100 100 100 100 100 100 100 100 100 100 100 100 
100 100 100 100 100 100 100 100 100 100 100 100 100 100 
##$AQSEQ= 0
##$AQ_mod= 3
##$AUNM= <au_zg>
##$AUTOPOS= <9 >
##$BF1= 250.13
##$BF2= 250.13
##$BF3= 250.13
##$BF4= 250.13
##$BF5= 500.13
##$BF6= 500.13
##$BF7= 500.13
##$BF8= 500.13
##$BYTORDA= 1
##$CFDGTYP= 0
##$CFRGTYP= 5
##$CHEMSTR= <none>
##$CNST= (0..31)
1 1 145 1 1 1 1 1 1 1 1 1 1 1 1 1 1 1 1 1 1 1 1 1 1 1 1 1 1 1 1 1 
##$CPDPRG= <>
##$CPDPRG1= <>
##$CPDPRG2= <>
##$CPDPRG3= <>
##$CPDPRG4= <mlev>
##$CPDPRG5= <mlev>
##$CPDPRG6= <mlev>
##$CPDPRG7= <mlev>
##$CPDPRG8= <mlev>
##$CPDPRGB= <>
##$CPDPRGT= <>
##$D= (0..31)
0 1 0 0 0 0 0 0 0 0.06 0 0 0 0 0 0 0.0002 0 0 0 0 0 0 0 0 0 0 0 0 0 0 
0 
##$DATE= 1176717269
##$DBL= (0..7)
120 120 120 120 120 120 120 120 
##$DBP= (0..7)
150 150 150 150 150 150 150 150 
##$DBP07= 0
##$DBPNAM0= <>
##$DBPNAM1= <>
##$DBPNAM2= <>
$$ [...]
##$SUBNAM7= <"">
##$SUBNAM8= <"">
##$SUBNAM9= <"">
##$SW= 20.6930455092707
##$SWIBOX= (0..15)
0 0 3 0 0 0 0 0 0 0 0 0 0 0 0 0 
##$SW_h= 5175.983436853
##$TD= 65536
##$TD0= 1
##$TE= 683.16
##$TE2= 300
##$TE3= 300
##$TEG= 300
##$TL= (0..7)
0 120 120 120 120 120 120 120 
##$TP= (0..7)
150 150 150 150 150 150 150 150 
##$TP07= 0
##$TPNAME0= <>
##$TPNAME1= <>
##$TPNAME2= <>
##$TPNAME3= <>
##$TPNAME4= <>
##$TPNAME5= <>
##$TPNAME6= <>
##$TPNAME7= <>
##$TPOAL= (0..7)
0.5 0.5 0.5 0.5 0.5 0.5 0.5 0.5 
##$TPOFFS= (0..7)
0 0 0 0 0 0 0 0 
##$TUNHIN= 0
##$TUNHOUT= 0
##$TUNXOUT= 0
##$USERA1= <user>
##$USERA2= <user>
##$USERA3= <user>
##$USERA4= <user>
##$USERA5= <user>
##$V9= 5
##$VALIST= <valist>
##$VCLIST= <CCCCCCCCCCCCCCC>
##$VD= 0
##$VDLIST= <DDDDDDDDDDDDDDD>
##$VPLIST= <PPPPPPPPPPPPPPP>
##$VTLIST= <TTTTTTTTTTTTTTT>
##$WBST= 1024
##$WBSW= 4
##$XGAIN= (0..3)
0 0 0 0 
##$XL= 0
##$YL= 0
##$YMAX_a= 406896
##$YMIN_a= -362634
##$ZGOPTNS= <>
##$ZL1= 120
##$ZL2= 120
##$ZL3= 120
##$ZL4= 120
##$ABSF1= 16.44369
##$ABSF2= -4.249483
##$ABSG= 5
##$ABSL= 3
##$ALPHA= 0
##$AQORDER= 0
##$ASSFAC= 0
##$ASSFACI= 0
##$ASSFACX= 0
##$ASSWID= 0
##$AUNMP= <proc_1d>
##$AZFE= 0.1
##$AZFW= 0.1
##$BCFW= 0
##$BC_mod= 0
##$BYTORDP= 0
##$COROFFS= 0
##$CY= 12.5
##$DATMOD= 1
##$DC= 0
##$DFILT= <>
##$DTYPP= 0
##$F1P= 14.0000005364418
##$F2P= -0.99999901652339
##$FCOR= 0.5
##$FTSIZE= 32768
##$FT_mod= 6
##$GAMMA= 0
##$GB= 0
##$INTBC= 1
##$INTSCL= 1
##$ISEN= 128
##$LB= 0.3
##$LEV0= 0
##$LPBIN= 0
##$MAXI= 10000
##$MC2= 0
##$MEAN= 0
##$ME_mod= 0
##$MI= 0
##$NCOEF= 0
##$NC_proc= -2
##$NLEV= 6
##$NOISF1= 0
##$NOISF2= 0
##$NSP= 0
##$NTH_PI= 0
##$NZP= 0
##$OFFSET= 16.44369
##$PC= 1
##$PHC0= 228.8034
##$PHC1= 5.2312
##$PH_mod= 1
##$PKNL= yes
##$PPARMOD= 0
##$PSCAL= 4
##$PSIGN= 0
##$REVERSE= no
##$SF= 250.13001958535
##$SI= 32768
##$SIGF1= 0
##$SIGF2= 0
##$SINO= 400
##$SIOLD= 32768
##$SREGLST= <1H.CDCl3>
##$SSB= 0
##$STSI= 32768
##$STSR= 0
##$SW_p= 5175.98343685301
##$SYMM= 0
##$S_DEV= 0
##$TDeff= 65536
##$TDoff= 0
##$TI= <Analysis number 999999
Compound Code 99
Book Reference 9
Project Code 9>
##$TILT= no
##$TM1= 0
##$TM2= 0
##$TOPLEV= 0
##$USERP1= <user>
##$USERP2= <user>
##$USERP3= <user>
##$USERP4= <user>
##$USERP5= <user>
##$WDW= 1
##$XDIM= 32768
##$YMAX_p= 292296301
##$YMIN_p= -112955
$$ End of Bruker specific parameters
$$ ---------------------------------
##NTUPLES= NMR SPECTRUM
##VAR_NAME=  FREQUENCY,     SPECTRUM/REAL,   SPECTRUM/IMAG
##SYMBOL=    X,             R,               I
##VAR_TYPE=  INDEPENDENT,   DEPENDENT,       DEPENDENT
##VAR_FORM=  AFFN,          ASDF,            ASDF
##VAR_DIM=   32768,         32768,           32768
##UNITS=     HZ,            ARBITRARY UNITS, ARBITRARY UNITS
##FACTOR=    0.157963299565203, 1,           1
##FIRST=     4113.0603382488, 0,             0
##LAST=      -1062.92309860421, 0,           0
##MIN=       -1062.92309860421, -112955,     0
##MAX=       4113.0603382488, 292296301,     0
$$ Real data points
##PAGE= N=1
##DATA TABLE= (X++(R..R)), XYDATA
$$ [...]
$$ plain form
15450 263 -824 -5358 -4755 -1910 651 2780 -4487 -5477 -10764 -13224 -7172 -1907 2431 4238 2949
15435 2949 8122 5307 4407 8249 7221 2148 920 6870 7445 3354 -1943 -2664 4938 1705 -2745
15420 -2745 -7218 -12596 -7226 -5020 -3382 4425 8754 7153 3323 -5800 -3216 4265 4991 -2389 -5693
15405 -5693 925 4198 5681 3652 2690 1414 1098 -3550 -1109 -1722 -1266 7585 6446 4694 2867 -2687
15389 -2687 2383 4940 -1075 966 3020 3441 5180 689 198 6133 4669 8565 5916 179 -2006
15374 -2006 -6907 -3392 -14744 -12658 -8718 -2649 -1715 -2854 749 -473 485 4906 7505 6670 5249
15359 5249 2818 2442 4429 2452 3321 5118 -1508 694 -492 -3569 -9789 -7752 -6580 -1414 -746
15344 -746 -7921 -5264 -4292 -5305 -4003 -2290 -1776 -782 -3954 -7485 -465 -4002 -1428 6414 2605 -1265
$$ packed form
15450B63j087m534O03K845K561K129p267r90n287k460O052N265M338J807j289
15435B949N173k815r00L842j028n073j228N950N75m091n297p21P602l233m450
15420b745m473n378N370K206J638P807M329j601l830r123K584P481P26p380l304
15405e693O618L273J483k029r62j276l16m648K441o13M56Q851j139j752j827n554
15389b687N070K557o015K041K054M21J739m491m91N935j464L896k649n737k185
15374b006m901L515j1352K086L940O069R34j139L603j222R58M421K599q35j421
15359E249k431l76J987j977Q69J797o626K202j186l077o220K037J172N166O68
15344g46p175K657R72j013J302J713N14R94l172l531P020l537K574P842l809l870
$$ plain form
15328 -1265 -6094 -1400 -3348 -1722 2151 2532 -6 -7455 -9579 -10282 -8024 -2999 -3039 -1537 2537 3521
15312 3521 54 -1571 1665 5879 4438 -4039 -8668 -8450 -5320 -3828 -2982 -643 281 4798 1194
15297 1194 4245 764 -3280 -1163 -571 4807 6574 3416 3305 7185 10626 8576 3701 3875 -37
15282 -37 1089 4614 2334 -4093 998 2361 -2054 -2102 179 2899 -1115 2889 3052 2439 2331 -3247
15266 -3247 603 -820 -2462 315 -850 1501 2411 1225 6592 3686 -1285 3137 4088 -6335 -1413
15251 -1413 823 1263 931 -3523 -11568 -5922 -1438 -1266 -2905 -754 4943 1437 1297 5079 -1089 -2118
15235 -2118 -2484 -591 2576 4591 5786 608 -2229 -2985 -1573 -6123 -4478 -6679 -6399 -2909 -7953
15220 -7953 -5214 -1863 -362 -7473 -4912 -1281 851 2130 -5805 -6628 -4569 -5502 -1672 3906 1594
$$ packed form
15328a265m829M694j948J626L873L81k538p449k124p03K258N025m0J502M074R84
15312C521l467j625L236M214j441q477m629K18L130J492Q46K339R24M517l604
15297A194L051l481m044K117N92N378J767l158j11L880L441k050m875J74l912
15282c7J126L525k280o427N091J363m415m8K281K720m014M004J63o13j08n578
15266c247L850j423j642K777j165K351R10j186N367k906m971M422R51j0423M922
15251a413K236M40l32m454q045N646M484J72j639K151N697l506j40L782o168j029
15235b118l66J893L167K015J195n178k837p56J412m550J645k201K80L490n044
15220g953K739L351J501p111K561L631K132J279p935q23K059r33L830N578k312
$$ plain form
15205 1594 -7686 -9421 -8022 -7098 -4193 2115 4083 -1256 2664 9723 4189 -7466 -7416 -875 7516
15190 7516 4943 -3428 -6041 4190 11048 7994 4707 3491 4429 3361 5002 2711 6696 5231 1634
15175 1634 -1376 357 666 2113 -313 3051 518 -1920 1026 -5208 -8002 -2951 3228 -1576 -3893
15160 -3893 -1092 -3723 -5497 -163 2854 6911 10792 6253 4457 5635 4466 5409 7785 4437 -3956
15145 -3956 -2417 1046 715 4031 5192 2348 -1963 795 4290 3127 291 -2121 -1022 328 -402
15130 -402 4559 10787 8309 7921 9630 9920 8742 7413 6743 4873 13734 15171 9013 9756 5456 3275
15114 3275 1157 3683 254 -5045 -10128 -10043 -9967 -4515 -6388 -2610 -3264 -78 3176 3114 9807 12168
15098 12168 12314 8242 10032 10278 4699 -3071 -3154 -4086 2395 10965 12466 12458 13611 15219 9971 15646
$$ packed form
15205A594r280j735J399R24K905O308J968n339L920P059n534j1655N0O541Q391
15190G516k573q371k613J0231O858l054l287j216R38j068J641k291L985j465l597
15175A634l010J733L09J447k426L364k533k438K946o234k794N051O179m804k317
15160c893K801k631j774N334L017M057L881m539j796J178j169R43K376l348q393
15145c956J539L463l31L316J161k844m311K758L495j163k836k412J099J350p30
15130d02M961O228k478l88J709K90j178j329o70j870Q861J437o158P43m300k181
15114C275k118K526l429n299n083Q5P6N452j873L778o54L186L254o2O693K361
15098A2168J46m072J790K46n579p770q3r32O481Q570J501qJ153J608n248N675
$$ plain form
15082 15646 14533 7444 2719 1868 4416 4080 3747 813 350 -6216 -10398 -7012 -2036 3861 5013
15067 5013 3184 5284 7954 10565 12474 13193 8670 6368 793 2691 -1043 -5952 -4299 -9169 -7540
15052 -7540 -5560 -10486 -9403 -10069 -7046 -8556 -11883 -13580 -13144 -5115 -4589 -3028 -802 2729 -4203
15037 -4203 -4794 506 -3408 4479 9785 12884 17790 12822 10770 8802 9823 11148 7400 7415 5630
15022 5630 4530 5068 7188 9267 4892 4785 2336 4563 10267 7180 16857 29251 37658 44715 55999
15007 55999 61679 77611 96700 123167 169845 233654 242783 174531 98628 60575 37026 22402
14995 22402 16157 15439 8206 6689 9196 5062 -41 3402 2418 14 -546 -645 1428 -1002 -2454 1223
14979 1223 5990 2947 -3158 -5059 -5659 -5846 -11938 -12412 -12292 -8356 -2269 -452 4300 6213 6633 9267
$$ packed form
15082A5646j113p089m725q51K548l36l33k934m63o566m182L386M976N897J152
15067E013j829K100K670K611J909P19m523k302n575J898l734m909J653m870J629
15052g540J980m926J083o66L023j510l327j697M36Q029N26J561K226L531o932
15037d203n91N300l914P887N306L099M906m968k052j968J021J325l748J5j785
15022E630j100N38K120K079m375j07k449K227N704l087R677J2394Q407P057J1284
15007E5999N680J5932J9089K6467M6678O3809R129o8252p5903l8053k3549j4624
14995B2402o245p18p233j517K507m134n103L443r84k404n60r9K073k430j452L677
14979A223M767l043o105j901o00j87o092m74J20L936O087J817M752J913M20K634
$$ plain form
14963 9267 8631 1925 -9620 -12404 -9044 -2208 -6704 -12336 -6048 -361 -1145 -972 -8198 -3038 -4445
14948 -4445 -4301 -2721 3209 -2893 -1445 3241 6986 5648 1915 2151 335 -2776 -3880 -3669 -2870 -4728
14932 -4728 -2362 1175 -2701 316 4617 2880 -927 -4660 -8142 -9843 -1274 1696 3252 -51 1893
14917 1893 3418 -1675 -1044 -2212 -1735 -4321 -9124 -8777 -11219 -8382 -8252 -6662 -4265 -3478 -5621 -10848
14901 -10848 -10066 -10179 -9327 -480 657 255 5896 2796 -4373 -5939 -1389 3737 -475 -11418 -16376
14886 -16376 -14405 -7740 130 -131 -4821 -5874 3607 5706 6328 6635 2499 895 4300 2215 6066
14871 6066 5135 5810 2404 3613 1421 2277 -2107 -5323 -6798 -8008 -10747 -5930 -5716 -9762 -12627 -6827
14855 -6827 -918 -7651 -7890 -4202 -4065 -2979 4364 7238 1647 -9778 -8959 -2751 2527 3714 -6252
$$ packed form
14963I267o36o706j1545k784L360O836m496n632O288N687p84J73p226N160j407
14948d445J44J580N930o102J448M686L745j338l733K36j816l111j104K11P99j858
14932d728K366L537l876L017M301j737l807l733l482j701Q569K970J556l303J944
14917A893J525n093O31j168M77k586m803L47k442K837J30J590K397P87k143n227
14901a0848P82j13Q52Q847J137m02N641l100p169j566M550N126m212j0943m958
14886a6376J971O665P870k61m690j053R481K099O22L07m136j604L405k085L851
14871F066r31O75l406J209k192Q56m384l216j475j210k739M817K14m046k865N800
14855f827N909o733k39L688J37J086P343K874n591j1425Q19O208N278J187r966
$$ plain form
14840 -6252 -8915 -7665 -5291 -7175 -13153 -6212 -6608 -4428 -2924 -2370 -3399 -6260 -4617 717 -1117
14825 -1117 -2934 88 281 234 -2379 -13079 -13756 -11401 -2990 -1957 -625 1096 -5879 -4649 276
14810 276 2058 6016 5200 1258 2526 -1953 -352 3534 299 1046 -2275 -997 30 4431 6247
14795 6247 4343 6782 4070 -1406 -4042 -532 -3592 -9192 -7705 -4126 -1777 -6502 -5692 -1772 -5687
14780 -5687 -4681 -4684 -7319 -1247 2190 -2918 -6157 -3338 -566 -1265 -1380 -1470 -2783 7025 3701 -1887
14764 -1887 3091 5704 2390 -28 5700 -2567 -7117 -1865 -762 -3471 -5671 -15541 -13183 -2875
14750 -2875 36 -7611 -11401 -4282 -101 2114 1435 -2331 907 709 -2286 -13089 -20012 -16445 -8679
14735 -8679 -6780 -10470 -11353 -10781 -9583 -6126 -3908 2489 2952 297 -4781 -7601 -7225 -4933 844 6603
$$ packed form
14840f252k663J250K374j884n978O941l96K180J504N54j029k861J643N334j834
14825a117j817L022J93m7k613j0700o77K355Q411J033J332J721o975J230M925
14810B76J782L958q16l942J268m479J601L886l235P47l321J278J027M401J816
14795F247j904K439k712n476k636L510l060n600J487L579K349m725Q10L920l915
14780e687J006lk635O072L437n108l239K819K772o99j15r0j313R808l324n588
14764a887M978K613l314k418N728q267m550N252J103k709k200r870K358J0308
14750b875K911p647l790P119M181K215o79l766L238j98k995j0803o923L567P766
14735h679J899l690q83N72J198L457K218O397M63k655n078k820L76K292N777N759
$$ plain form
14719 6603 480 -2329 -299 -4521 -2873 -4748 -2589 -3066 -9564 -6545 -2066 -7045 -7147 -4877 886
14704 886 727 1539 4890 4704 7649 5707 2849 6893 8847 7218 -1299 -2204 -2686 -4774 -6573 -5900
14688 -5900 -742 -7757 -9326 -7039 -3030 -5576 -8599 -5258 -2885 -7730 -515 2546 2839 -2980 -5777
14673 -5777 446 6923 9980 8763 3972 -2509 -976 -2608 -4701 -352 4728 -4585 917 1011 -10841
14658 -10841 -10839 -8090 -8436 -6767 -7685 -927 3176 4383 5242 10681 10415 2770 -1170 -4447 -2178 -2850
14642 -2850 -5697 -6362 -958 4542 -1288 -6625 -14748 -9558 -5325 -3534 -4601 -5360 -5502 -2285 -7061
14627 -7061 436 6017 3171 7481 12719 4887 -4777 -1563 -361 -670 2865 3697 4422 2931 3082 5895
14611 5895 6317 6954 9208 7748 2291 1784 3181 999 -3725 -5823 -2613 2876 1355 -9825 -16443
$$ packed form
14719F603o123k809K030m222J648j875K159m77o498L019M479m979j02K270N763
14704H86j59Q12L351j86K945j942k858M044J954j629q517r05m82k088j799O73
14688e900N158p015j569K287M009k546l023L341K373m845P215L061K93n819k797
14673e777O223O477L057j217m791o481J533j632k093M349N080r313N502R4j1852
14658a0841KK749l46J669r18O758M103J207Q59N439k66p645l940l277K269o72
14642b850k847o65N404N500n830n337q123N190M233J791j067p59j42L217m776
14627g061P497N581k846M310N238p832r664L214J202l09L535Q32P25j491J51K813
14611E895M22O37K254j460n457n07J397k182m724k098L210N489j521j1180o618
$$ plain form
14596 -16443 -15626 -10052 -3174 3118 10126 4422 -2852 2529 4070 -3493 -4577 -316 1672 -2070 -1561
14581 -1561 2266 3239 -470 2145 3360 -1882 -2646 -8108 -7805 -6792 -2931 -1207 -2951 -5627 2069
14566 2069 3867 4205 -965 -8472 -11932 -11916 -4342 -3258 -2503 -768 -2522 -2336 -3550 -754 -309 -6011
14550 -6011 -5861 689 6033 8793 1272 -5151 5678 11557 7478 2639 2574 -1318 707 -869 340
14535 340 4039 3402 247 2442 3395 -3110 -1290 5876 7558 4837 3311 245 -4809 -2494 4042
14520 4042 -6330 -12024 -7181 -2322 -8066 -6950 -6637 -5121 -5896 -6360 -7138 -1215 -1190 -1174 -6257 -9600
14504 -9600 -10678 -13386 -4738 -5285 -10104 -4513 -3070 6751 3832 -1423 -7484 -2306 1771 -1243 -8918
14489 -8918 -5752 -1818 469 -538 -799 1834 3163 -500 -2743 -6643 -11817 -7055 -2181 5511 8316
$$ packed form
14596a6443Q17N574O878O292P008n704p274N381J541p563j084M261J988l742N09
14581a561L827R73l709K615J215n242p64n462L03J013L861J724j744k676P696
14566B069J798L38n170p507l460J6P574J084P55J735j754J86j214K796M45n702
14550f011J50O550N344K760p521o423J0829N879m079m839o5l892K025j576J209
14535C40L699o37l155K195R53o505J820P166J682k721j526l066n054K315O536
14520D042j0372n694M843M859n744J116L13J516p75m64p78N923K5J6n083l343
14504i600j078k708Q648n47m819N591J443R821k919n255o061N178M077l014p675
14489h918L166L934K287j007k61K633J329l663k243l900n174M762M874P692K805
$$ plain form
14474 8316 6107 6275 6608 10616 2704 -1987 -4471 -3954 81 -2596 1107 -1269 1260 5137 3378
14459 3378 -1996 1953 2490 2362 5485 7622 5581 2465 1201 77 1412 7154 7486 9339 2059
14444 2059 -10901 -11972 -9999 -10870 -7744 -2780 3217 3815 -3345 -5274 -3267 -2707 -723 -3874 -3950 -1880
14428 -1880 -1821 -1861 -1477 2666 -2458 -11078 -9199 -3 3641 7318 5132 1839 960 -384 -7359 -12121
14412 -12121 -19467 -22266 -13786 -6787 -2675 -1505 2206 3350 5593 1957 -6229 -5907 -4320 -7318 -7247
14397 -7247 -10147 -5672 -3417 -6297 -6421 -1806 79 -1733 -5677 -3342 -375 2199 3051 3032 1141 2924
14381 2924 -1477 -5833 -11797 -14914 -18575 -20333 -15733 -11580 -4519 -1551 1042 -729 -1755 2013 4789
14366 4789 7233 3355 2134 4955 1605 655 -846 -3138 -7341 -4732 -2158 -3173 343 6851 9266
$$ packed form
14474H316k209J68L33M008p912m691k484N17M035k677L703k376K529L877j759
14459C378n374L949N37j28L123K137k041l116j264j124J335N742L32J853p280
14444B059j2960j071J973q71L126M964N997N98p160j929K007N60J984l151p6K070
14428a880N9m0L84M143n124q620J879R196L644L677k186l293q79j344o975m762
14412a2121p346k799Q480O999M112J170L711J144K243l636q186L22J587k998P1
14397g247k900M475K255k880j24M615J885j812l944K335K967K574Q52j9j891J783
14381B924m401m356n964l117l661j758M600M153P061K968K593j771j026L768K776
14366D789K444l878j221K821l350r50j501k292m203K609K574j015L516O508K415
$$ plain form
14351 9266 6704 109 -4030 -7586 -2554 -3952 -9681 -9716 -15354 -17371 -10280 -3376 -1760 -5908 -3684
14336 -3684 -6735 -13132 -8888 -3418 -934 -394 -514 -3065 -3305 6034 8265 5422 3322 5908 7862
14321 7862 9579 7104 -79 -3224 -8437 -7691 -6147 1621 3781 -3107 -10158 -9186 -9404 -10177 -6426 -4731
14305 -4731 -3925 -4320 -928 2159 1887 -1604 -5019 -1867 -2612 -5676 -7568 -12254 -7350 -7055 -10400 -2364
14289 -2364 -75 -2348 -4637 -3928 750 6 5200 9277 12421 7468 7979 7709 4151 -2693 -10055 -11638
14273 -11638 -14797 -15589 -14721 -16426 -13920 -4063 -3330 -10377 -16559 -11783 -7379 -8397 -431 -2374 -6210
14258 -6210 -5065 -212 3104 4320 7147 8668 11850 8022 274 1196 -6760 -9815 60 -1671 1708
14243 1708 -1520 -8484 -4988 -6449 -7153 -11400 -7605 -8072 -9479 -5592 942 7533 7473 1766 7317 3774
$$ packed form
14351I266k562o595m139l556N032j398n729l5n638k017P091O904J616m148K224
14336c684l051o397M244N470K484N40j20k551k40R339K231k843k100K586J954
14321G862J717k475p183l145n213P46J544P768K160o888p051R72k18p73L751J695
14305d731Q06l95L392L087k72l491l415L152p45l064j892m686M904K95l345Q036
14289b364K289k273k289P09M678p44N194M077L144m953N11k70l558o844p362j583
14273a1638l159p92Q68j705K506R857P33p047o182M776M404j018P966j943l836
14258f210J145M853L316J216K827J521L182l828p748R22p956l055R875j731L379
14243A708l228o964L496j461p04m247L795m67j407L887O534O591o0n707N551l543
$$ plain form
14227 3774 -708 -2540 -5483 -3016 5963 8352 8059 6064 -4909 -8722 -9300 -7281 -3560 -7668 -12402
14212 -12402 -14118 -11661 -8089 -6342 -9726 -12638 -16199 -10900 -3228 2329 1056 -3088 -1670 45
14198 45 -949 -5034 -6224 -5346 3347 7770 2447 -1807 2361 5941 9048 9640 12121 20138 18006 13786
14182 13786 8981 6189 7027 12632 10909 7876 4316 10365 12205 13116 2614 864 2079 2591 9108
14167 9108 9106 5139 4359 4214 4233 6488 1852 1188 1165 1648 6112 5667 4019 -1647 1775 3493 6476 1098
14149 1098 -7117 -12961 -13866 2235 5654 1831 4066 13771 8036 -451 1929 1210 1493 7019 -4652
14134 -4652 -7171 -7251 -3961 -5364 -2418 -756 2405 5000 -2300 -5415 -176 4736 2192 -3705 793
14119 793 1497 -4198 -5570 -6816 -4162 -3438 -2347 -3163 786 -541 -4589 -2025 -1881 -905 2235 -591
$$ packed form
14227C774m482j832k943K467Q979K389k93j995j0973l813n78K019L721m108m734
14212a2402j716K457L572J747l384k912l561N299P672N557j273m144J418J715
14198D5r94m085j190Q78Q693M423n323m254M168L580L107N92K481Q017k132m220
14182A3786m805k792Q38N605j723l033l560O049J840R11j0502j750J215N12O517
14167I108kl967p80j45J9K255m636o64k3M83M464m45j648n666L422J718K983n378
14149A098q215n844r05J6101L419l823K235R705n735q487K380p19K83N526j1671
14134d652k519q0L290j403K946J662L161K595p300l115N239M912k544n897M498
14119G93P04n695j372j246K654P24J091q16L949j327m048K564J44R76L140k826
$$ plain form
14103 -591 -5413 -8855 -3991 -3459 -5928 -6933 -6157 -11406 -6440 -2414 -7328 -8901 -7293 -7904 -12293 -11697
14087 -11697 -13998 -13419 -7763 -4411 -2286 3191 5925 7767 2499 829 -5523 -12055 -13057 -8159 -7705
14072 -7705 -10659 -10798 -8343 -1632 -2915 -3612 -5979 -5382 -4742 3371 8571 8776 10411 14609 11098 4533
14056 4533 -6935 -6752 -6629 -5129 -6889 -7253 -1572 1487 964 -4203 -5229 -1771 894 -7346 -6285
14041 -6285 -458 1513 -5362 -1787 -540 -609 -908 -1391 -2548 2393 1647 2525 -2194 -3533 -3533 -6368 -7322
14024 -7322 -3887 -3888 501 7837 5770 3401 7231 7183 -3379 -12400 -18750 -10029 -1475 2327 3076 -4178
14008 -4178 878 3319 -1076 -698 -1568 -4609 -3780 -2397 4645 -8498 -16546 -8851 -4411 -6422 -12026
13993 -12026 -11230 -1325 6140 -551 -8532 -6248 3285 1883 -11974 -13234 -12698 -6844 -2763 -4179 -6885
$$ packed form
14103e91m822l442M864N32k469j005P76n249M966M026m914j573J608o11m389N96
14087a1697k301N79N656L352K125N477K734J842n268j670o352o532j002M898M54
14072g705k954j39K455O711j283o97k367N97O40Q113N200K05J635M198l511o565
14056D533j1468J83J23J500j760l64N681L059n23n167j026L458K665q240J061
14041f285N827J971o875L575J247o9k99m83j157M941p46Q78m719j339%k835r54
14024g322L435jM389P336k067k369L830m8j0562r021o350Q721Q554L802P49p254
14008d178N056K441m395L78q70l041Q29J383P042j3143q048P695M440k011n604
13993a2026P96R905P465o691p981K284R533j402j3857j260N36N854M081j416k706
$$ plain form
13978 -6885 -5861 -7955 -2202 2340 -7020 -7839 -6894 -1471 1824 1309 -944 -7240 -3115 448 -2578
13963 -2578 -910 3601 334 -2073 -1471 -1398 -4683 -9945 -10318 -9560 -6832 -7151 -7589 -7251 -9338 -12054 -9916
13946 -9916 -4909 149 3810 -2898 -3953 -4000 -10691 -3805 -2106 -3126 95 3950 8780 13442 13405 6171
13930 6171 2146 -845 -5250 1550 11963 13044 5968 4217 4964 8328 9399 10170 7416 893 2311
13915 2311 533 4547 6621 3959 0 -3678 -4032 -2153 -3018 -7051 -4753 -5310 -3977 1825 -297
13900 -297 -5156 -3047 760 3227 5488 13313 9260 3430 2791 -1988 3299 10865 11866 7399 7493 2596
13884 2596 -11272 -15326 -8311 -7795 -5676 -7755 -3659 2527 5151 7549 4947 53 1164 -3159 -6997
13869 -6997 -154 9530 10288 8197 3362 -1565 -3260 -6236 -5812 -2533 985 -1085 -1070 909 7079 9866
$$ packed form
13978f885J024k094N753M542r360q19R45N423L295n15k253o296M125L563l026
13963b578J668M511l267k407O02P3l285n262l73P58K728l19m38L38k087k716K138
13946i916N007N058L661o708j055m7o691O886J699j020L221L855M830M662l7p234
13930F171m025k991m405O800J0413J081p076j751P47L364J071P71k754o523J418
13915B311j778M014K074k662l959l678l54J879q65m033K298n57J333N802k122
13900b97m859K109L807K467K261P825m053n830o39m779N287P566J001m467R4m897
13884B596j3868m054P015N16K119k079M096O186K624K398k602m894J111m323l838
13869f997O843R684P58k091m835m927j695k976M24L279L518k070J5J979O170K787
$$ plain form
13853 9866 2979 718 8725 10557 1009 917 -666 845 1714 981 4267 2461 4174 7511 11781 5523
13837 5523 -1206 -8215 -5604 -910 -1395 -9755 -14441 -15534 -15626 -10503 -2612 1206 3344 10906 12709
13822 12709 6819 5889 2782 -1844 -5138 -2665 -2287 8308 10585 5972 -2309 -6423 -2336 179 2197
13807 2197 2859 1276 3567 3333 4630 4996 7765 1748 -3335 -3024 661 -3538 -5222 -2921 1456 6290
13791 6290 6262 6995 9862 10503 8502 14642 14895 4617 -1047 -11873 -18285 -17969 -15646 -19901 -13567 -1349
13775 -1349 2929 -1222 -6328 -5845 -3834 -6836 -1104 -1752 -244 1729 6622 745 3587 6235 4374
13760 4374 1332 -2416 1232 608 -939 912 2348 3924 1484 2671 7337 3185 -2602 -7940 -12113
13745 -12113 -12574 -3155 -2548 -274 -7485 -5647 -4576 -5326 -9400 -4028 -1624 -4731 -2243 788 2390
$$ packed form
13853I866o887k261Q007J832r548r2j583J511Q69p33L286j806J713L337M270o258
13837E523o729p009K611M694m85q360m686j093r2N123P891L818K138P562J803
13822A2709n890r30l107m626l294K473L78J0595K277m613q281m114M087K515K018
13807B197O62j583K291k34J297L66K769o017n083L11L685m199j684K301M377M834
13791F290k8P33K867O41k001O140K53j0278n664j0826o412L16K323m255O334J2218
13775a349M278m151n106M83K011l002N732o48J508J973M893n877K842K648j861
13760D374l042l748L648o24j547J851J436J576k440J187M666m152n787n338m173
13745a2113m61R419O07K274p211J838J071p50m074N372K404l107K488L031J602
$$ plain form
13730 2390 -4689 -6960 -3840 -4175 -3036 323 -4934 -14035 -16927 -15227 -6510 -960 -2939 -2822 161
13715 161 -5358 -6596 -4247 1287 3309 -2810 -2473 3488 7246 4944 1699 3048 5774 6719 10320
13700 10320 13785 11562 9866 6514 6489 -2844 -4162 -5243 -9326 -8565 1169 2076 3464 89 -8475
13685 -8475 -3433 2697 3825 4299 2241 5496 9332 12189 3520 -4844 -12761 -10869 1728 2960 5878
13670 5878 8878 9775 4169 2765 -3320 3762 5649 886 -5400 1104 6182 1452 -7776 -11568 -7407
13655 -7407 -6866 -1964 2364 190 -5228 -6973 -2743 -4859 117 2207 -3797 -9490 -1730 -63 -1944
13640 -1944 1578 5171 4477 3222 -709 4113 9425 11132 8713 5155 2857 5978 4840 4118 2189
13625 2189 -1525 -131 1121 2572 4991 8705 7158 3654 6413 9654 412 -2559 4778 226 -1818
$$ packed form
13730B390p079k271L120l35J139L359n257r101k892J700Q717N550j979J17K983
13715A61n519j238K349N534K022o119L37N961L758k302l245J349K726R45L601
13700A0320L465k223j696l352k5r333j318j081m083P61R734R07J388l375q564
13685h475N042O130J128M74k058L255L836K857q669q364p917J892J2597J232K918
13670E878L000Q97n606j404o085P082J887m763o286O504N078m730r228l792M161
13655g407N41M902M328k174n418j745M230k116M976K090o004n693P760J667j881
13640a944L522L593o94j255l931M822N312J707k419l558k298L121j138p22j929
13625B189l714J394J252J451K419L714j547l504K759L241r242k971P337m552k044
$$ plain form
13610 -1818 -426 2566 -432 1047 6192 6795 1980 -620 4947 4606 6696 8335 3534 -4001 -1941
13595 -1941 198 -2832 -6368 -3064 4072 4434 987 -620 1015 31 -4595 -2969 5578 3506 1745
13580 1745 -346 -7897 -14070 -11622 -8405 -7884 -7948 -8154 -3500 -3054 -2884 -2422 363 3260 3112 2272 1791
13563 1791 2986 3796 7222 3093 1896 7495 9047 9410 3104 -3977 -4704 -1101 -4058 -1077 2221
13548 2221 -1316 -3165 -1049 -3696 -6670 -8668 -3891 -2006 -5351 -5194 588 2753 4308 3442 -5800
13533 -5800 -7380 -1825 3035 4476 9958 10481 10846 4134 1268 -6745 -9697 -10091 -1422 -1203 -3046 309
13517 309 1731 4305 4234 4001 5396 784 -3285 -5291 -1851 3226 7672 4293 -4872 -8002 -10825 -6658
13501 -6658 -1322 -379 -838 -3030 -2432 496 3134 1349 -865 -1204 -4650 -3812 -829 4199 -1837 -11154
$$ packed form
13610a818J392K992k998J479N145O03m815k600N567l41K090J639m801p535K060
13595a941K139l030l536L304P136L62l447j607J635r84m626J626Q547k072j761
13580A745k091p551o173K448L217N21o4k06M654M46J70M62K785K897j48q40m81
13563A791J195Q10L426m129j197N599J552L63o306p081p27L603k957K981L298
13548B221l537j849K116k647k974j998M777J885l345J57N782K165J555q66r242
13533e800j580N555M860J441N482N23L65o712k866q013k952l94Q669K19j843L355
13517C09J422K574p1k33J395m612m069k006L440N077M446l379r165l130k823M167
13501f658N336R43m59k192N98K928K638j785k214l39l446Q38K983N028o036r317
$$ plain form
13485 -11154 -11234 -5148 604 5528 -1799 -5804 -6662 -2970 -108 -1986 -7422 -10293 -12827 -11118 -8052
13470 -8052 -3542 71 -179 954 -2435 1735 3427 1223 5786 12537 10776 8860 8536 10782 4822
13455 4822 -4204 -1265 4816 -3449 -4314 -1555 4438 6149 6366 3801 3521 1783 1324 347 -2568 -6190
13439 -6190 -4945 3751 9186 6671 6578 -2014 -1901 -8263 -12548 -5952 -2577 -3423 -5557 -5367 -8552 -8108
13423 -8108 -6450 -1250 1875 -852 175 2950 2401 246 -4193 -8405 -5411 -3401 5463 7532 5770
13408 5770 2030 5366 6203 641 -1711 2916 5492 5042 7850 12055 12795 12877 12866 11090 5013 -346
13392 -346 2422 5172 -2823 -11371 -7859 -4371 81 2523 1957 -2 -2446 -2331 3399 13728 12916
13377 12916 9660 6786 9411 7555 4630 -1583 -627 2193 5689 3994 -1787 -5943 -2675 -3482 -5828
$$ packed form
13485a1154q0O086N752M924p327m005q58L692K862j878n436k871k534J709L066
13470h052M510L613k50J133l389M170J692k204M563O751j761j916l24K246n960
13455D822r026K939O081q265q65K759N993J711K17k565k80j738m59r77k915l622
13439f190J245Q696N435k515r3q592J13o362m285O596L375q46k134J90l185M44
13423h108J658N200L125k727J027K775n49k155m439m212K994K010Q864K069j762
13408E770l740L336Q37n562k352M627K576m50K808M205P40Q2j1j776o077n359
13392c46K768K750p995q548L512L488M452K442n66j959k444J15N730J0329q12
13377A2916l256k874K625j856k925o213R56K820L496j695n781m156L268q07k346
$$ plain form
13362 -5828 -6449 -4068 -3146 -7463 -8332 1619 7871 4272 5154 6509 3415 -2078 -4132 -4754 -8845 -7244
13346 -7244 -7184 -5997 -6162 -2724 -1671 -4826 -3649 -2821 1022 2709 1512 3444 2468 8355 19453 15234
13330 15234 9635 9940 6442 5496 2491 4749 1799 -3655 -2218 -317 -2496 -2308 -33 2116 -985
13315 -985 -2662 -1609 -5539 -13522 -7841 -7089 844 4838 5461 2494 3173 4695 3514 2024 -1174 -5005
13299 -5005 -7398 -5885 -6727 -11036 -13237 -6744 -3432 -4487 -10197 -13364 -5965 6334 8441 14595 10827
13284 10827 6175 4389 4382 3775 3768 947 6881 7810 1755 601 1774 817 4863 5009 2809 -194 -1992
13267 -1992 -7440 -7903 -5527 -1304 -345 -2735 3573 4321 -3712 -11885 -15515 -13905 -8248 -1480 1955
13252 1955 1010 5116 6961 8215 -1974 -4234 -6685 -9582 -10985 -7789 -3195 -59 -166 1560 6866
$$ packed form
13362e828o21K381R22m317q69R951O252l599Q82J355l094n493k054o22m091J601
13346g244O0J187j65L438J053l155J177Q28L843J687j197J932r76N887J1098m219
13330A5234n599L05l498r46l005K258k950n454J437J901k179J88K275K149l101
13315i85j677J053l930p983N681P52P933L994O23k967O79J522j181j490l198l831
13299e005k393J513q42m309k201O493L312j055n710l167P399J2299K107O154l768
13284A0827m652j786po07pk821N934R29o055j154J173r57M046J46k200l003j798
13267a992n448m63K376M223R59k390O308P48q033q173l630J610N657O768L435
13252A955r45M106J845J254j0189k260k451k897j403L196M594L136j07J726N306
$$ plain form
13237 6866 8265 11456 8541 7951 1065 -487 7434 4809 -7791 -10164 -4798 -6194 -2167 2320 6318
13222 6318 5892 3053 1646 -272 4354 9363 13055 2792 -5340 -5484 -5511 4138 10823 9840 3036 -3079
13206 -3079 -9491 -9795 163 -2851 -2503 4721 8607 1901 3698 9240 1712 -5757 -4632 3791 2782
13191 2782 1653 -4959 900 1308 -1545 -4715 -1919 5737 15265 8620 7732 2360 985 3013 545
13176 545 342 7722 11105 10355 11405 13489 18559 20442 29997 27748 26065 26184 24708 15336 11121 5086
13160 5086 -32 -2726 1374 4005 1766 -2448 -1066 -1395 -4100 -3618 -2871 1092 4328 7796 4281
13145 4281 10186 11278 1285 3560 2654 5163 6913 913 1075 -4784 -3137 3494 2955 -2904 -5929
13130 -5929 848 13767 14117 12189 10771 9550 14979 24947 30848 30984 33366 29174 21172 15964 10767
$$ packed form
13237F866J399L191k915n90o886j552P921k625j2600k373N366j396M027M487L998
13222F318m26k839j407j918M626N009L692j0263q132j44k7R649O685r83o804o115
13206c079o412l04R958l014L48P224L886o706J797N542p528p469J125Q423j009
13191B782j129o612N859M08k853l170K796P656R528o645q88n372j375K028k468
13176E45k03P380L383p50J050K084N070J883R555k249j683J19j476r372m215o035
13160E086n118k694M100K631k239m214J382l29k705M82P47L963L236L468l515
13145D281N905J092r993K275r06K509J750o000J62n859J647O631n39n859l025
13130e929O777J2919L50j928j418j221N429R968N901J36K382m192q002n208n197
$$ plain form
13115 10767 4399 -1159 -2336 445 -7279 -18646 -13412 -9495 -3989 -5447 -7840 -10397 -8797 -548
13101 -548 2759 4790 6584 4400 -627 3228 9017 8350 -2155 759 6215 10414 8596 658 2524
13086 2524 -3981 -3784 -2579 -3626 -3784 -3273 2391 2863 484 4249 9459 15581 20001 20571 15661 9310
13070 9310 1079 -432 -500 3377 3363 1590 -1081 902 -5408 -10582 -9674 -9339 -7332 -7571 1713 4090
13054 4090 2936 3288 12993 8916 3330 5393 8554 4454 -798 -4410 3101 -4744 -1237 -580 -1306
13039 -1306 3851 518 1682 3519 3885 3036 -961 2796 5811 4482 4125 3393 2004 3985 1646 1850
13023 1850 3342 1980 -2237 -10633 -17099 -21556 -11566 -6452 -8170 762 1329 -3842 -9991 -10229 -6734
13008 -6734 -9647 -8689 -8874 -15923 -14091 -8378 -7971 -14299 -17539 -9937 -2613 -311 -5594 1424 -1000
$$ packed form
13115A0767o368n558j177K781p724j1367N234L917N506j458k393k557J600Q249
13101e48L307K031J794k184n027L855N789o67j0505K914N456M199j818p938J866
13086B524o505J97J205j047j58N11N664M72k379L765N210O122M420N70m910o351
13070I310q231j511o8L877j4j773k671J983o310n174R08L35K007k39R284K377
13054D090j154L52R705m077n586K063L161m100n252l612P511p845L507O57p26
13039a306N157l333J164J837L66q49l997L757L015j329l57p32j389J981k339K04
13023A850J492j362m217q396o466m457R990N114j718Q932N67n171o149k38L495
13008f734k913R58j85p049J832N713M07o328l240P602P324K302n283P018k424
$$ plain form
12993 -1000 -9579 -4008 -6140 -5694 -6518 -8226 -13660 -10416 -9316 -8595 -6877 -2582 3205 -1733 -2661 2364
12977 2364 3891 -2210 -1426 2058 -2079 -37 3122 4902 2034 3127 -1310 -3753 -6783 -9363 -6340
12962 -6340 -1279 3277 2736 -119 -3679 -4957 1733 2047 3398 5983 8430 6603 3861 1745 -2773
12947 -2773 -1913 3479 8583 11411 11160 -1826 -13056 -11383 -5804 -4110 -1850 -1070 -2649 2661 3583
12932 3583 3909 6615 7337 4675 6562 3526 2093 3357 3846 5252 1733 -3626 -136 1460 -87
12917 -87 4451 4224 1716 271 -1725 2504 -4617 -8860 -2641 -130 2912 9944 1125 -8105 -6757
12902 -6757 -1331 2568 -175 -8517 -14752 -5238 1908 3379 5077 3686 141 3199 2265 -5197 -4850
12887 -4850 -8921 -10233 -12463 -421 9375 -683 -6592 -5539 -896 2044 -3109 -6174 -6281 -452
$$ packed form
12993a000q579N571k132M46q24j708n434L244J100P21J718M295N787m938r28N025
12977B364J527o101P84L484m137K042L159J780k868J093m437k443l030k580L023
12962f340N061M556n41k855l560j278O690L14J351K585K447j827k742k116m518
12947b773Q60N392N104K828k51j2986j1230J673N579J694K260P80j579N310R22
12932C583L26K706P22k662J887l036j433J264M89J406l519n359L490J596j547
12917h7M538k27k508j445j996M229p121m243O219K511L042P032q819r230J348
12902f757N426L899k743q342o235R514P146J471J698j391l545L058r34p462L47
12887d850m071j312k230J2042R796j0058n909J053M643K940n153l065j07N829
$$ plain form
12873 -452 5416 5574 980 -5246 -7441 -7430 -1817 2911 4987 6983 11910 15013 18559 16362 10865 5679
12857 5679 4957 7149 458 -3145 -2051 -4353 -6215 -95 853 -255 4900 5549 -3041 -6355 8884
12842 8884 10966 8720 3713 -3257 -7351 -3761 1802 366 -7484 -7086 4590 11835 8827 4946 5654
12827 5654 2159 3167 951 2430 -44 -1341 5500 5092 3348 1497 1048 3347 6339 9728 12232
12812 12232 17483 19824 11922 9282 4496 1886 4262 -2662 -805 9946 16117 14526 14260 13253
12798 13253 8630 6315 4641 8981 6971 2216 3132 3152 -1612 -925 -897 -2647 102 354 1172 -2181
12782 -2181 -6149 -8896 -11497 -6538 -4687 -534 -781 -1484 -720 -3892 -5992 -4633 -1740 2833 -4707
12767 -4707 -5839 -3070 5807 13031 16755 10946 7571 10274 7266 3439 1113 -763 2986 2524 -2959
$$ packed form
12873d52N868J58m594o226k195J1N613M728K076J996M927L103L546k197n497n186
12857E679p22K192o691l603J094k302j862O120R48j108N155O49q590l314J5239
12842H884K082k246n007o970m094L590N563j436p850L98J1676P245l008l881P08
12827E654l495J008k216J479k474j297O841m08j744j851m49K299K992L389K504
12812A2232N251K341p902k640m786k610K376o924J857J0751O171j591k66j007
12798A3253m623k315j674M340k010m755R16K0m764O87K8j750K749K52Q18l353
12782b181l968k747k601M959J851M153k47p03P64l172k100J359K893M573p540
12767d707j132K769Q877P224L724n809l375K703l008l827k326j876L749m62n483
$$ plain form
12752 -2959 -11640 -5951 -1237 1645 4602 1460 2779 4703 -3532 -7549 1071 5047 3155 3822 3267
12737 3267 -1748 -5153 -5719 -6107 326 1384 -3233 -4380 5954 3587 3006 5060 4096 7161 7775 6562
12721 6562 2460 4704 1682 698 -2427 -5280 -1236 6006 3211 4909 10439 12369 8601 6051 7520
12706 7520 10552 10967 10883 9875 6913 5284 2758 3457 2716 11366 16903 16272 18000 15682 12906 15565
12690 15565 11450 17518 24754 33318 23450 25817 31131 30375 23518 19550 16386 17864 17542 22599 23719
12675 23719 20061 22567 25799 24761 25756 20754 12785 7418 8145 10154 15866 22383 22503 15714 11699
12660 11699 14465 21145 25591 21530 15253 13669 14711 10683 6286 5527 1717 6929 2655 1711 9535
12645 9535 8835 8487 830 -2896 -4680 1533 10516 13783 14479 15047 11726 4092 -516 -7694 -7352 -1845
$$ packed form
12752b959q681N689M714K882K957l142J319J924q235m017Q620L976j892O67n55
12737C267n015l405n66l88O433J058m617j147J0334k367n81K054r64L065O14j213
12721F562m102K244l022r84l125k853M044P242k795J698N530J930l768k550J469
12706G520L032M15q4j008k962j629k526O99p41Q650N537o31J728k318k776K659
12690A5565m115O068P236Q564r868K367N314p56o857l968l164J478l22N057J120
12675B3719l658K506L232j038R95n002p969n367P27K009N712O517J20o789m015
12660A1699K766O680M446m061o277j584J042m028m397p59l810N212m274r44P824
12645I535p00l48p657l726j784O213Q983L267O96N68l321p634m608p178L42N507
$$ plain form
12629 -1845 6284 5373 5985 6962 4296 3521 -3288 -7629 -62 3174 8804 10896 13585 10064 8518 6007
12613 6007 7399 8644 6200 4512 1344 -1186 -3874 -7330 -8587 -5325 -1041 -645 2352 -6063 -8119
12598 -8119 -5839 -3119 -2828 3164 1874 197 -5272 -6644 -5817 -1106 4041 -2065 -6230 -1099 -676
12583 -676 366 -3457 6609 13882 16977 18021 23503 25733 15963 4177 1728 8077 3001 2224 9553
12568 9553 8955 7081 905 -135 82 4824 5311 -317 -2207 713 2321 5738 9683 8295 9227 6867
12552 6867 4219 -649 -1606 3765 -155 -5454 -4640 -3784 1512 -3425 -2361 243 -491 2661 1879 1413
12536 1413 5434 5506 8286 5739 6965 607 -1031 -3560 -5683 -3391 325 -2686 -2903 3859 -782
12521 -782 -6788 3446 5188 10995 6347 2732 4441 -2865 -2620 -1102 1548 1757 -585 -3658 -9733
$$ packed form
12629a845Q129r11O12R77k666p75o809m341P567L236N630K092K689l521j546k511
12613F007J392J245k444j688l168k530k688l456j257L262M284L96K997q415k056
12598h119K280K720K91N992j290j677n469j372Q27M711N147o106m165N131M23
12583f76J042l823J0066P273L095J044N482K230r770j1786k449O349n076p77P329
12568I553n98j874o176j040K17M742M87n628j890K920J608L417L945j388R32k360
12552F867k648m868r57N371l920n299Q14Q56N296m937J064K604p34L152p82m66
12536A413M021P2K780k547J226o358j638k529k123K292L716l011k17O762m641
12521g82o006J0234J742N807m648l615J709p306K45J518K650K09k342l073o075
$$ plain form
12506 -9733 -8388 -1878 -7868 -5249 2807 -3823 -11729 -4817 -840 6254 3046 -1925 -2656 -836 2892
12491 2892 10063 15297 18180 15279 22213 35264 44259 58771 84945 110621 107656 71651 45813
12478 45813 30430 23270 12141 10080 4433 2152 2468 5295 3417 -96 -147 12457 12199 9484 5528
12463 5528 3935 5704 7218 8539 5531 1502 2795 5187 6125 8177 5720 5313 7939 15071 20022
12448 20022 14618 6512 3074 5097 4473 -1955 -6267 -5054 232 339 43 -3101 -11735 -14282 -12005
12433 -12005 -11874 -8250 -9486 -5067 614 148 -2388 -2573 4312 1212 2374 4624 7307 6662 7188 4801
12417 4801 -2306 1892 1921 3845 6642 4783 3684 302 -1140 303 844 -1912 2479 12199 18550
12402 18550 14706 9548 6307 8349 5233 3638 1692 718 -990 4004 11821 17158 12080 -377
$$ packed form
12506i733J345O510n990K619Q056o630p906O912L977P094l208m971p31J820L728
12491B892P171N234K883k901O934J3051Q995J4512K6174K5676k965l6005k5838
12478D5813j5383p160j1129k061n647k281L16K827j878l513n1J2604k58k715l956
12463E528j593J769J514J321l008m029J293K392R38K052k457m07K626P132M951
12448B0022n404q106l438K023o24o428m312J213N286J07k96l144q634k547K277
12433a2005J31L624j236M419N681m66k536j85O885l100J162K250K683o45N26k387
12417D801p107M198K9J924K797j859j099l382j442J443N41k756M391R720O351
12402A8550l844n158l241K042l116j595j946r74j708M994P817N337n078j2457
$$ plain form
12388 -377 5654 7672 10107 10464 6142 3012 7552 7937 8106 9056 10577 12433 11832 6669 13030 17956
12372 17956 19459 14777 10521 11324 10719 12756 13575 12093 12686 8820 4503 13069 9363 -1091 -7246
12357 -7246 -6897 4777 12099 16134 14399 13281 11991 7329 7335 11376 13998 16529 19340 22564 28526
12342 28526 29983 28834 25938 24941 33256 37132 43761 51169 58842 60397 69600 88320 110732 127459
12328 127459 140261 148431 132666 108754 87661 75041 65051 50646 39143 35509 36537 31903
12316 31903 29621 29003 27815 21802 17897 16998 20942 23478 23865 15404 11384 17776 21848 14771 13906
12301 13906 17065 19767 19590 26058 24248 15698 14435 10572 8882 10686 9533 9735 11871 14535 21214
12286 21214 26495 22582 18028 10722 12582 12960 15821 18195 23012 25622 21485 15787 14402 19391 23797
$$ packed form
12388c77O031K018K435L57m322l130M540L85J69R50J521J856o01n163O361M926
12372A7956J503m682m256Q03o05K037Q19j482N93l866m317Q566l706j0454o155
12357g246L49J1674P322M035j735j118j290m662OM041K622K531K811L224N962
12342B8526J457j149k896r97Q315L876O629P408P673J555R203J8720K2412J6727
12328A27459J2802Q170j5765k3912k1093j2620r990j4405j1503l634J028m634
12316C1903k282o18j188o013l905q99L944K536L87q461m020O392M072p077q65
12301A3906L159K702j77O468j810q550j263l863j690J804j153K02K136K664O679
12286B1214N281l913m554p306J860L78K861K374M817K610m137n698j385M989M406
$$ plain form
12271 23797 19549 10852 6624 7056 9616 13553 20177 19810 16601 12710 7365 2487 4025 11441 12102
12256 12102 12718 16056 18540 16216 22856 22023 17247 15997 20752 21761 17992 13724 14229 15894 19467
12241 19467 19748 13277 20520 26619 25559 22556 29337 27395 19775 16798 12901 5896 2790 8110 10709
12226 10709 21395 23997 24614 19332 14162 13017 14997 18426 22298 26814 23975 19111 13029 9576
12212 9576 10147 11483 12369 12401 13606 16379 19653 13397 19092 28015 28413 21474 23584 17072 14395 15041
12196 15041 15099 10135 9602 13158 16928 16740 16534 17900 22611 29301 30641 30506 28290 24847 26518 24569
12180 24569 22334 24589 25959 25925 26372 20757 16770 20534 26515 19975 27371 30198 32388 37167 39604
12165 39604 49154 54402 60333 68577 69517 76165 90570 102869 116713 139220 171712 208465 249179
$$ packed form
12271B3797m248q697m228M32K560L937O624l67l209l891n345m878J538P416O61
12256A2102O16L338K484k324O640q33m776j250M755J009l769m268N05J665L573
12241A9467K81o471P243O099j060l003O781j942p620k977l897p005l106N320K599
12226A0709J0686K602O17n282n170j145J980L429L872M516k839m864o082l453
12212I576N71J336Q86L2J205K773L274o256N695Q923L98o939K110o512k677O46
12196A5041N8m964n33L556L770j88k06J366M711O690J340j35k216l443J671j949
12180B4569k235K255J370l4M47n615l987L764N981o540P396K827K190M779K437
12165C9604R550N248N931Q244R40O648J4405J2299J3844K2507L2492L6753M0714
$$ plain form
12152 249179 293086 322942 346678 347578 324606 291500 254768 221749 189807 159209 138238 126075
12140 126075 118074 108970 112276 113947 110103 110241 125820 138719 138629 126057 122639 123194 119653 120587 124890
12125 124890 137858 153444 174655 197278 220129 250375 275142 300908 323474 333537 331864 305662
12113 305662 263898 215262 176170 145039 112476 91109 79499 65537 57825 51746 49837 50964
12101 50964 50538 44409 48380 50464 47323 45277 47369 54332 63244 68489 81085 97831 111645 110685
12087 110685 109795 107480 108943 107139 103308 100262 91210 82360 76385 79169 80232 80272 77593 77973 73472
12072 73472 70215 66188 63231 62677 62908 61719 63433 65430 62991 64103 73958 87681 94686 97773 99699
12057 99699 100677 101448 102807 104909 109387 113986 112530 118848 124728 123994 117294 117937 120868 116860 114534
$$ packed form
12152B49179M3907K9856K3736R00k2972l3106l6732l3019l1942l0598k0971j2163
12140A26075q001r104L306J671l844J38J5579J2899r0j2572l418N55l541R34M303
12125A24890J2968J5586K1211K2623K2851L0246K4767K5766K2566J0063j673k6202
12113C05662m1764m8636l9092l1131l2563k1367j1610j3962p712o079j909J127
12101E0964m26o129L971K084l141k046K092O963Q912N245J2596J6746J3814r60
12087A10685q90k315J463j804l831l046r052q850n975K784J063M0k679L80m501
12072G3472l257m027k957n54K31j189J714J997k439J112R855J3723P005L087J926
12057I9699R78P71J359K102M478M599j456O318N880p34o700O43K931m008k326
$$ plain form
12042 114534 112027 102103 95665 96669 94588 94148 91610 83460 84274 88527 84658 75789 70518 59589
12028 59589 58666 61417 58513 64205 74094 76755 72118 75924 86920 96512 95403 96601 98112 88184
12014 88184 81088 79063 71853 70677 63386 54978 46837 45205 43774 46293 40528 36939 38839 29109
12000 29109 22240 18168 27254 27628 25123 23838 23786 26420 24703 29067 31186 34766 33041 20842 20342
11985 20342 18340 24580 30214 27028 22280 17752 17724 19090 22947 25809 28689 26107 22265 11200 5992
11970 5992 5088 6425 7860 14120 21295 20524 21193 21086 9863 6783 6351 4989 587 5016 16052
11955 16052 20253 24986 25417 18619 14024 12318 5425 2619 10229 7376 2457 4483 11993 12110 8762
11940 8762 9988 11987 18114 25277 25411 23902 20945 18725 12125 11234 15079 19689 15178 11710 11958
$$ packed form
12042A14534k507r924o438J004k081m40k538q150Q14M253l869q869n271j0929
12028E9589r23K751k904N692R889K661m637L806J0996R592j109J198J511r928
12014H8184p096k025p210j176p291q408q141j632j431K519n765l589J900r730
12000B9109o869m072R086L74k505j285n2K634j717M364K119L580j725j2199n00
11985B0342k002O240N634l186m748m528k8J366L857K862K880k582l842j1065n208
11970E992r04J337J435O260P175p71O69j07j1223l080m32j362m402M429J1036
11955A6052M201M733M31o798m595j706o893k806P610k853m919K026P510J17l348
11940H762J226J999O127P163J34j509k957k220o600q91L845M610m511l468K48
$$ plain form
11925 11958 22929 33116 22861 17363 14386 13436 12552 13547 18452 15395 17534 21738 18969 16627
11911 16627 15939 16474 17025 14955 13486 8070 11434 12350 14621 12428 11104 9541 11957 12950 15480 13470
11895 13470 14011 16163 15747 15666 19275 18277 21068 23995 17023 13005 17716 20841 16739 20866 24466 22645
11879 22645 22784 20593 16784 18671 15304 11447 13168 12724 7285 14457 18544 19012 18463 21282 24199
11864 24199 21391 23860 22391 19799 21165 16123 19739 27284 25937 24631 23260 32057 32697 26258 19988
11849 19988 22738 25736 18802 10715 12404 15464 20606 23948 27059 32916 27442 21206 20554 23902 21430
11834 21430 25980 35276 38338 28229 25101 30672 31138 32380 33099 32612 35093 32540 32043 29295 26699
11819 26699 24741 22869 15145 24029 27094 31811 33497 33244 33578 27852 34646 37904 31813 27564 26386
$$ packed form
11925A1958J0971J0187j0255n498k977r50q84R95M905l057K139M204k769k342
11911A6627o88N35N51k070j469n416L364R16K271k193j324j563K416R93K530k010
11895A3470N41K152m16q1L609r98K791K927o972m018M711L125m102M127L600j821
11879B2645J39k191l809J887l367l857J721m44n439P172M087M68n49K819K917
11864B4199k808K469j469k592J366n042L616P545j347j306j371Q797O40o439o270
11849A9988K750K998o934q087J689L060N142L342L111N857n474o236o52L348k472
11834B1430M550R296L062j0109l128N571M66J242P19m87K481k553m97k748k596
11819B6699j958j872p724Q884L065M717J686k53L34n726O794L258o091m249j178
$$ plain form
11804 26386 24624 31002 36907 36651 44477 50977 42513 47264 50020 48712 61668 66868 63073 66157
11790 66157 62372 60256 63433 63516 61796 72647 76310 75329 67959 70961 75318 79728 79735 74656 70345 62419
11774 62419 54359 46412 42161 44222 47905 52347 56753 53524 47144 47555 47544 48652 49482 55064 59840
11759 59840 55786 59092 62390 59969 59220 70893 79098 82799 82230 85266 89097 92540 87856 82259 80972
11744 80972 94499 103790 96560 95628 98690 100960 106745 112224 117339 124947 128885 131087 124377 123446 123300
11729 123300 121188 125100 133735 138033 138830 143510 157402 171071 178215 178526 181670 188196 184018 185657
11715 185657 198835 201837 202201 214454 215362 216643 214674 220551 230653 244756 257621 269032 283255
11702 283255 295872 315229 329076 343442 358681 385957 417201 440179 467095 496683 529554
$$ packed form
11804B6386j762O378N905k56P826O500q464M751K756j308J2956N200l795L084
11790F6157l785k116L177Q3j720J0851L663r81p370L002M357M410Pn079m311p926
11774F2419q060p947m251K061L683M442M406l229o380M11j1J108Q30N582M776
11759E9840m054L306L298k421p49J1673Q205L701n69L036L831L443m684n597j287
11744H0972J3527R291p230r32L062K270N785N479N115P608L938K202o710r31j46
11729A23300k112L912Q635M298P97M680J3892J3669P144L11L144O526m178J639
11715A85657J3178L002L64J2253R08J281j969N877J0102J4103J2865J1411J4223
11702B83255J2617J9357J3847J4366J5239K7276L1244K2978K6916K9588L2871
$$ plain form
11691 529554 572334 615754 658301 709750 767693 838081 918762 1009909 1117688 1244782 1399407
11680 1399407 1585230 1794248 2033006 2316446 2648834 3044188 3507889 4065144 4711056
11671 4711056 5458403 6343564 7377554 8568218 9919533 11380075 12858418 14164550
11663 14164550 15058386 15372074 15099923 14363078 13336809 12190659 11053145 10018480 9140260
11654 9140260 8455093 7942949 7601121 7419386 7384661 7485993 7687615 7964349 8302723 8697555
11644 8697555 9155212 9684485 10315363 11046801 11863354 12755682 13688032 14610099 15488330
11635 15488330 16316781 17097341 17854153 18575090 19207611 19652069 19783263 19517336 18878437
11626 18878437 18002043 17041484 16121867 15300106 14575292 13909992 13258885 12576757 11862859
$$ packed form
11691E29554M2780M3420M2547N1449N7943P0388Q0681R1147J07779J27094J54625
11680A399407J85823K09018K38758K83440L32388L95354M63701N57255O45912
11671D711056P47347Q85161J033990J190664J351315J460542J478343J306132
11663A4164550Q93836L13688k72151p36845j026269j146150j137514j034665q78220
11654I140260o85167n12144l41828j81735l4725J01332K01622K76734L38374L94832
11644H697555M57657N29273O30878P31438Q16553Q92328R32350R22067Q78231
11635A5488330Q28451P80560P56812P20937O32521M44458J31194k65927o38899
11626A8878437q76394r60559r19617q21761p24814o65300o51107o82128p13898
$$ plain form
11617 11862859 11129376 10421472 9780197 9216838 8729147 8313134 7956233 7671059 7450627
11608 7450627 7296382 7213871 7225750 7343165 7589433 7988009 8569224 9356649 10379948 11650048
11598 11650048 13129801 14741927 16344886 17729484 18631191 18740786 17854521 16041128
11590 16041128 13692448 11288007 9162401 7435341 6096893 5076256 4284036 3663057
11582 3663057 3175292 2791513 2469483 2204515 1985694 1803282 1647659 1516271 1397194
11573 1397194 1299266 1209224 1126487 1050214 973675 881447 793780 722416 661954 609109 561599
11562 561599 526586 487744 463749 438582 412075 390470 377949 361873 345470 330157 319865
11551 319865 310999 300092 290889 280882 271109 262082 254847 243867 235235 231233 223387 211134 212788
$$ packed form
11617A1862859p33483p07904o41275n63359m87691m16013l56901k85174k20432
11608G450627j54245q2511J1879J17415K46268L98576N81215P87425J023299J270100
11598A1650048J479753J612126J602959J384598R01707J09595q86265j813393
11590A6041128k348680k404441k125606j727060j338448j020637p92220o20979
11582C663057m87765l83779l22030k64968k18821j82412j55623j31388j19077
11573A397194r7928r0042q2737p6273p6539r2228q7667p1364o0462n2845m7510
11562E61599l5013l8842k3995k5167k6507k1605j2521j6076j6403j5313j0292
11551C19865q866j0907r203j0007r773r027p235j0980q632m002p846j2253J654
$$ plain form
11538 212788 217242 214133 210601 206399 197487 186981 189434 192584 194408 186572 178926 172688 173563 167520
11524 167520 157180 155398 150657 154646 147529 140547 138850 136296 129369 136101 137184 127768 127652 123897
11510 123897 124774 123007 123873 130394 131137 123717 122226 127273 130588 132207 135060 135580 131680 133064 134179
11495 134179 124373 123398 122145 107970 99563 105227 107558 106569 108528 105282 104798 108219 110107 106318 99235
11480 99235 100848 100414 94406 94180 101924 98252 98107 101434 102838 101405 107894 109195 106708 113972 111645
11465 111645 115336 120643 119069 110371 102570 97329 98546 100679 98284 93746 88004 84756 82001 83374
11451 83374 79302 73590 68191 63650 70851 72583 68959 66317 66824 58527 53737 46233 51449 55515 55541
11436 55541 54797 50435 50399 50256 53463 48297 50951 52406 55684 58945 59361 55732 52353 44788 38394 46299
$$ packed form
11538B12788M454l109l532m202q912j0506K453L150J824p836p646o238Q75o043
11524A67520j0340j782m741L989p117o982j697k554o927O732J083r416j16l755
11510A23897Q77j767Q66O521P43p420j491N047L315J619K853N20l900J384J115
11495A34179r806r75j253j4175q407N664K331r89J959l246m84L421J888l789p083
11480I9235J613m34o008k26P744l672j45L327J404j433O489J301k487P264k327
11465A11645L691N307j574q698p801n241J217K133k395m538n742l248k755J373
11451H3374m072n712n399m541P201J732l624k642N07q297m790p504N216M066K6
11436E5541p44m362l6j43L207n166K654J455L278L261M16l629l379p565o394P905
$$ plain form
11420 46299 52752 54121 48727 47228 37330 33992 36124 32110 31342 33115 27192 29722 34053 34509 30944
11405 30944 34202 33591 29892 30753 35732 37654 35625 25986 27573 33208 30995 27557 19429 19314 22905
11390 22905 28287 27136 24683 34159 46153 46218 41798 37675 38199 39704 39637 37242 34803 34687 38066 41080
11374 41080 39415 37158 33343 31500 33808 27588 21997 23696 28972 34338 28496 32360 36714 42103
11360 42103 35537 36023 33498 27814 28672 26708 28030 28325 35560 37576 35469 30794 36470 41116 37232
11345 37232 35070 32343 33543 33213 30365 28060 28398 30701 32250 33691 32873 37309 42524 49815 46509
11330 46509 34552 36333 48092 43602 28103 24291 18784 15189 16471 16944 26879 22859 19149 16928
11316 16928 12676 11255 5691 4698 8654 10599 14028 15684 16955 20484 18712 16753 20950 13875 17184
$$ packed form
11420D6299O453J369n394j499r898l338K132m014p68J773n923K530M331M56l565
11405C0944L258o11l699Q61M979J922k029r639J587N635k213l438q128j15L591
11390B2905N382j151k453R476J1994O5m420m123N24J505o7k395k439j16L379L014
11374D1080j665k257l815j843K308o220n591J699N276N366n842L864M354N389
11360D2103o566M86k525n684Q58j964J322K95P235K016k107m675N676M646l884
11345C7232k162k727J200l30k848k305L38K303J549J441q18M436N215P291l306
11330D6509j1957J781J1759m490j5499l812n507l595J282M73R935m020l710k221
11316A6928m252j421n564r93L956J945L429J656J271L529j772j959M197p075L309
$$ plain form
11301 17184 20501 19196 21717 21071 19387 19916 22010 18721 17018 17144 15827 14334 19819 15565 11924
11286 11924 11802 16002 20621 23888 21873 15087 11340 14437 16686 18603 14452 13107 9253 4228 8439
11271 8439 12999 10695 6403 13481 18142 20798 15925 11155 14055 8885 3800 10484 20938 20505 22780
11256 22780 16913 18573 19252 19266 21332 20191 14782 19036 22570 23677 24907 22780 27718 37693 48748
11241 48748 48158 56676 69450 80291 80161 87666 96358 95556 86226 78218 71978 66473 67982 63064 55243
11226 55243 47032 42531 44068 47318 45429 35172 35049 37749 45254 45965 48318 45333 51816 61252 61122
11211 61122 63999 67176 77330 90319 92335 90540 87789 89478 93460 96599 102182 111910 112501 102051
11197 102051 89592 88538 88585 90102 89763 88509 85655 81654 81520 81943 81732 76701 67414 59776 52020
$$ packed form
11301A7184L317j305K521o46j684N29K094l289j703J26j317j493N485m254l641
11286A1924j22M200M619L267k015o786l747L097K249J917m151j345l854n025M211
11271H439M560k304m292P078M661K656m873m770K900n170n085O684J0454m33K275
11256B2780n867J660O79J4K066j141n409M254L534J107J230k127M938R975J1055
11241D8748n90Q518J2774J0841j30P505Q692q02r330q008o240n505J509m918p821
11226E5243q211m501J537L250j889j0257j23K700P505P11K353k985O483R436j30
11211F1122K877L177J0154J2989K016j795k751J689L982L139N583R728N91j0450
11197A02051j2459j054M7J517l39j254k854m001j34M23k11n031r287p638p756
$$ plain form
11182 52020 47647 46665 50604 54226 55787 52385 47572 47884 49546 53779 60285 62187 72882 85728
11168 85728 97252 98610 97633 98341 98763 90912 82999 74754 62062 49081 36141 26167 16954 10092
11154 10092 14719 12273 9566 12295 16205 16780 7717 3893 4371 7268 10697 12537 18553 16137 13110
11139 13110 11408 11622 12270 15934 11514 9966 18413 19306 11065 5414 10402 12475 17079 10873 3827
11124 3827 4374 9307 12805 7815 9096 8638 -20 1174 4692 1388 718 -4896 -9268 3648 15728
11109 15728 8435 4516 2167 4697 8505 7350 848 -4813 -5430 -10778 -7901 -5433 3066 3552 7994
11094 7994 10315 4608 -8854 -5209 -336 1948 3771 -4583 -4567 -9584 -11150 -2977 -5050 -4111 -1912
11079 -1912 -3349 -2991 -3329 -3387 -697 7227 7573 1362 -405 587 -2036 -1426 469 -1799 -3810 471
$$ packed form
11182E2020m373r82L939L622J561l402m813L12J662M233O506J902J0695J2846
11168H5728J1524J358r77P08M22p851p913q245j2692j2981j2940r974r213o862
11154A0092M627k446k707K729L910N75r063l824M78K897L429J840O016k416l027
11139A3110j702K14O48L664m420j548Q447Q93q241n651M988K073M604o206p046
11124C827N47M933L498m990J281m58q658J194L518l304o70n614m372J2916J2080
11109A5728p293l919k349K530L808j155o502n661o17n348K877K468Q499M86M442
11094G994K321n707j3462L645M873K284J823q354J6n017j566Q173k073R39K199
11079a912j437L58l38n8K690P924L46o211j767R92k623O10J895k268k011M281
$$ plain form
11063 471 925 3509 5301 6435 6659 1404 -6445 -7188 -6001 1673 9931 6044 6898 9696 12422 8347
11047 8347 2081 -6792 -5434 618 3718 3588 6789 8297 6208 6553 1685 8381 6743 3225 9310
11032 9310 11336 7689 4280 6704 10081 9176 6866 -853 -1845 -3193 -4884 -3132 1581 3430 -667
11017 -667 -5515 -2702 3034 5343 1891 1082 3021 3778 -1083 -6564 -4850 -7408 -11026 -6794 3043
11002 3043 9982 8505 -5984 -7542 -826 -2949 -1973 5997 16688 15433 11050 10523 6273 -3092 -5436
10987 -5436 -4542 -2322 1504 -969 -5898 -5419 -673 2015 6628 6530 7362 1207 -1030 -3110 2341 6047
10971 6047 6624 4079 965 -1174 -7183 -7776 -8328 -3506 -3450 4271 8784 8853 6226 4115 5822 12034
10955 12034 9599 6049 3136 3133 1551 -2723 -7657 -1416 3356 -1787 -3640 4374 5931 5762 3590
$$ packed form
11063D71M54K584J792J134K24n255p849p43J187P674Q258l887Q54K798K726m075
11047H347o266q873J358O052L100j30L201J508k089L45m868O696j638l518O085
11032I310K026l647l409K424L377r05k310p719r92j348j691J752M713J849m097
11017f67m848K813N736K309l452q09J939P57m861n481J714k558l618M232R837
11002C043O939j477j4489j558O716k123R76P970J0691j255m383n27m250r365k344
10987e436Q94K220L826k473m929M79M746K688M613r8Q32o155k237k080N451L706
10971F047N77k545l114k139o009n93n52M822N6P721M513O9k627k111J707O212
10955A2034k435l550k913lj582m274m934O241M772n143j853Q014J557j69k172
$$ plain form
10940 3590 4557 4993 6850 8547 2690 68 -2316 458 -2117 3150 1752 2519 3618 6970 5620
10925 5620 -910 2223 3170 -900 -7732 -787 2693 256 4360 549 2624 4193 1805 1652 2987
10910 2987 8481 6818 -1106 -5033 -12480 -15216 -9281 -5213 -2829 2592 3462 688 907 -1190 -985
10895 -985 -801 -1928 4938 11083 9107 5224 8848 9806 4470 -1407 -937 2046 4434 2689 4018 4353
10879 4353 11375 16484 7096 198 -90 -4951 -9613 -11183 -16038 -21295 -13710 -4073 -2873 -2103 -1633
10864 -1633 -207 3983 2716 1584 5204 8268 5464 1150 2640 -517 3945 7736 4565 3937 5552
10849 5552 6786 6843 3850 -3951 -8140 -8564 -1271 8413 4460 4905 5373 6726 8800 6890 8231 5554
10833 5554 3542 -567 -5596 3363 8244 8818 -1190 -3285 -200 -96 -3080 1001 4300 428 1985
$$ packed form
10940C590R67M36J857J697n857k622k384K774k575N267j398P67J099L352j350
10925E620o530L133R47m070o832O945L480k437M104l811K075J569k388j53J335
10910B987N494j663p924l927p447k736N935M068K384N421Q70k774K19k097K05
10895i85J84j127O866O145j976l883L624R58n336n877M70K983K388j745J329L35
10879D353P022N109r388o898k88m861m662j570m855n257P585R637J200P70M70
10864a633J426M190j267j132L620L064k804m314J490l157M462L791l171o28J615
10849E552J234N7k993p801m189m24P293R684l953M45M68J353K074j910J341k677
10833E554k012m109n029Q959M881N74j0008k095L085J04k984M081L299l872J557
$$ plain form
10818 1985 7372 8722 6769 -1338 -4823 -6657 -10380 -12550 -8498 -8942 -3518 1430 5808 4070 2591
10803 2591 -2118 -12813 -12073 -6088 -6880 -10288 -7866 -10882 -20980 -20134 -12789 -5308 -3106 -3342 -8100
10788 -8100 -12250 -8996 -6884 -3548 -724 -994 -1968 -664 -6548 -6352 -6551 -3811 1133 2172 1812 -2776
10772 -2776 1132 8280 9181 3737 2210 -5505 -6439 -4682 -4507 -10507 -10648 -8872 -3150 -4833 -4295 -7672
10756 -7672 -12180 -14548 -12252 -12385 -11754 -9369 -8304 -9902 -7909 -8342 -9876 -10831 -11013 -9453 -3492 5185
10740 5185 2926 -4960 -6418 -5901 -3046 -5779 -16818 -12518 443 709 -3312 8660 16948 12942
10726 12942 5319 3615 5139 -1560 -5485 -3282 -4020 -8457 -10051 -4346 -9254 -8066 1339 822 -5497
10711 -5497 84 5608 6098 1862 -1142 -7898 -9060 -7136 -5074 3723 10695 6544 432 -3409 1879
$$ packed form
10818A985N387J350j953q107l485j834l723k170M052m44N424M948M378j738j479
10803B591m709j0695P40N985p92l408K422l016j0098Q46P345P481K202k36m758
10788h100m150L254K112L336K824k70r74J304n884J96j99K740M944J039l60m588
10772b776L908P148R01n444j527p715r34J757J75o000j41J776N722j683N38l377
10756g672m508k368K296j33O31K385J065j598J993m33j534r55j82J560N961Q677
10740E185k259p886j458N17K855k733j1039M300J2961K66m021J1972Q288m006
10726A2942p623j704J524o699l925K203p38m437j594N705m908J188R405n17o319
10711e497N581N524M90m236l004o756j162J924K062Q797O972m151o112l841N288
$$ plain form
10696 1879 2696 -472 5508 4337 6367 5611 -1521 -8126 -5628 -3392 -9046 -7424 -3890 -2342 1588
10681 1588 1541 -901 -1077 80 2873 2277 587 -1237 -909 2846 6764 12097 13231 11190 10793 3316
10665 3316 -952 -2915 1566 10407 9544 191 -5406 -7603 -5914 -8089 -2485 -821 -3722 -4489 -5543
10650 -5543 -3137 1948 4665 3633 209 -3990 4135 12139 16019 13669 10954 10482 8155 2072 -7212
10635 -7212 -7320 -1772 -2822 -7055 -3398 -2374 -5790 -11897 -16223 -13588 -7358 -3456 4942 6883 2783
10620 2783 -456 -1672 -89 9451 9986 6254 8491 9369 8566 6256 5115 -245 -6720 -9362 -5033
10605 -5033 -1126 2454 2810 2329 4495 2764 527 -5086 -5975 -631 1432 -1317 -2032 6676 7112 3216
10589 3216 5611 -3571 -3816 -4487 -4056 1432 1774 -381 -2116 -1065 -977 1940 6667 9904 7418 5244
$$ packed form
10696A879Q17l168N980j171K030p56p132o605K498K236n654J622L534J548L930
10681A588m7k442j76J157K793n96j690j824L28L755L918N333J134k041l97p477
10665C316m268j963M481Q841q63r353n597k197J689k175N604J664k901p67j054
10650e543K406N085K717j032l424m199Q125Q004L880k350k715m72k327o083r284
10635g212j08N548j050m233L657J024l416o107m326K635O230L902Q398J941m100
10620B783l239j216J583R540N35l732K237Q78q03k310j141n360o475k642M329
10605e033L907L580L56m81K166j731k237n613q89N344K063k749p15Q708M36l896
10589C216K395r182k45o71M31N488L42k155j735J051Q8K917M727L237k486k174
$$ plain form
10573 5244 1814 -122 -1305 6856 7798 211 -5839 129 -1129 -4086 -8400 -7298 -2214 886 1241
10558 1241 -3662 -7074 -8163 -9744 -8462 -3171 4295 9296 5864 3625 71 4991 -837 -7567 -1386
10543 -1386 -4327 -8720 -6513 -7822 -6157 -11566 -15015 -13710 -5302 2806 -411 1141 11688 17178
10529 17178 9871 -1970 -5913 -5016 -2661 -5884 2468 6977 7875 3647 -2330 -2405 -6132 -9998 -7902
10514 -7902 -129 2848 -4186 -10517 -12744 -11861 -7662 -4185 -1214 -1049 -6460 -8234 -7703 -8097 -3534 -448
10498 -448 -3824 -5521 -6920 -10892 -4701 694 -3167 -8379 -9341 -6458 -5983 -4583 -1190 -2554 -5699
10483 -5699 -7509 -6711 -10750 -14547 -7636 7151 12316 9171 9723 7168 6282 1834 -4445 -4411 -6976 -5674
10467 -5674 -2973 -1738 735 -4951 -1272 4366 7758 7254 4884 -4469 -7689 -2926 -1954 -2559 -160
$$ packed form
10573E244l430j936j183Q161R42p587o050N968j258k957m314J102N084L100L55
10558A241m903l412j089j581J282N291P466N001l432k239l554M920n828o730O181
10543a386k941m393K207j309J665n409l449J305Q408Q108l217J552J0547N490
10529A7178p307j1841l943Q97K355l223Q352M509Q98m228n977p5l727l866K096
10514g902P773K977p034o331k227Q83M199L477K971J65n411j774N31l94M563L086
10498d48l376j697j399l972O191N395l861n212r62K883M75J400L393j364l145
10483e699j810P98m039l797O911J4787N165l145N52k555q86m448o279L4k565J302
10467e674K701J235K473n686L679N638L392n04k370r353l220M763R72o05K399
$$ plain form
10452 -160 807 466 2940 313 -2433 -4609 -6211 -5702 -6643 -4965 2940 1984 -3712 -5219 2515 6639
10436 6639 4284 1666 -2844 -2227 248 1664 5027 2481 -1875 -1902 -2199 -1454 -11797 -13761 -6024 -3283
10420 -3283 -2212 -4873 -8346 -3263 5411 5411 3014 3890 2555 -1212 -4385 -227 7476 8402 8567 7177
10404 7177 6746 5280 5389 8219 1867 -1944 -2862 -12320 -16241 -22386 -21379 -15435 -10901 -1812 -2835
10389 -2835 -5884 -3108 -3308 -5287 -10881 -9536 -3891 -7438 -10231 -5603 -5055 -10107 -9920 -896 -715 -7234
10373 -7234 -12352 -12124 -8233 -762 2620 -183 -2400 -5843 -9950 -14020 -19733 -13558 -3710 -4773 -2477
10358 -2477 2251 4208 -1555 -3109 -2093 5267 8928 10124 11185 14145 13741 3140 5129 16633
10344 16633 18259 14818 8131 4012 2056 -565 -4097 2592 7929 5228 2800 4211 3289 5008 10175
$$ packed form
10452a60R67l41K474k627k746k176j602N09r41J678P905r56n696j507P734M124
10436F639k355k618m510O17K475J416L363k546m356k7k97P45j0343j964P737K741
10420c283J071k661l473N083Q674%k397Q76j335l767l173M158P703R26J65j390
10404G177m31j466J09K830o352l811r18r458l921o145J007N944M534R089j023
10389b835l049K776k00j979n594J345N645l547k793M628N48n052J87R024J81o519
10373g234n118K28L891P471L382k803k217l443m107m070n713O175R848j063K296
10358b477M728J957n763j554J016P360L661J196J061K960m04j0601J989J1504
10344A6633J626l441o687m119j956k621l532O689N337k701k428J411r22J719N167
$$ plain form
10329 10175 12326 18468 17578 7631 736 3603 7397 6449 4430 425 3327 139 -807 4599 5904
10314 5904 2024 -5788 -9066 -9847 -12960 -12699 -7909 -8938 3573 6878 4062 8439 9391 4213 12831
10299 12831 11674 4051 4638 2907 7372 5351 2476 -5459 -4645 -121 -2157 -5673 -1570 2910 10380
10284 10380 6807 9369 9996 6825 8315 14349 11363 7219 11200 7148 4389 8516 10785 10737 9953
10269 9953 6711 2831 3907 1783 1595 -4819 -1320 212 5005 3477 8942 6868 7029 7402 3614
10254 3614 2074 1460 2771 6803 5721 7093 5481 7726 7904 7702 8502 7404 5803 5799 1238 430 -79
10237 -79 -27 3963 8222 8098 5782 -3385 -8365 -6958 -4062 -1300 576 1919 -2252 833 1607 -5040
10221 -5040 -5437 -1850 -1060 3353 5483 6990 5708 -1468 -5257 -4151 888 1895 4437 3761 9325
$$ packed form
10329A0175K151O142q90r947o895K867L794r48k019m005K902l188r46N406J305
10314E904l880p812l278p81l113K61M790j029J2511L305k816M377R52n178Q618
10299A2831j157p623N87j731M465k021k875p935Q14M524k036l516M103M480P470
10284A0380l573K562O27l171J490O034k986m144L981m052k759M127K269m8p84
10269I953l242l880J076k124j88o414L499J532M793j528N465k074J61L73l788
10254C614j540o14J311M032j082J372j612K245J78k02Q00j098j601mm561q08n09
10237g9N2L990M259j24k316r167m980J407K896K762J876J343m171L085P74o647
10221e040l97L587P90M413K130J507j282p176l789J106N039J007K542o76N564
$$ plain form
10206 9325 9103 7326 12406 13387 15187 13396 8733 6524 2057 -1118 1136 3162 13599 20980 9667
10191 9667 1214 -1418 4324 7068 5200 160 -3228 -3383 -4146 1362 5539 5543 1325 -5963 -3894 -4269
10175 -4269 -2376 -5724 -12683 -7135 -172 5256 9327 8379 8707 601 2233 -2872 -3273 3498 6197
10160 6197 4738 5424 5843 7397 5401 5803 993 -1297 -1922 3341 5130 5027 6915 2803 -6357 -4744
10144 -4744 1583 -1618 -4145 2895 8303 3876 3749 -528 1708 8830 14108 11693 9433 6474 482
10129 482 2496 1929 4968 2309 -2262 2022 -1177 -6467 -5399 2677 5656 -984 -477 2848 4986
10114 4986 4140 912 2815 1669 -2245 2274 -2206 -737 2818 3061 2219 -1213 -2240 -8443 -381
10099 -381 6345 17279 17334 14377 5778 4564 3180 2609 6487 10243 12461 8767 5078 7357 3824
$$ packed form
10206I325k22j777N080R81J800j791m663k209m467l175K254K026J0437P381j1313
10191I667q453k632N742K744j868n040l388j55p63N508M177Mm218p288K069l75
10175d269J893l348o959N548O963N428M071r48L28q106J632n105m01O771K699
10160F197j459O86M19J554j996M02m810k290o25N263J789j03J888m112r160J613
10144d744O327l201k527P040N408m427j27m277K236P122N278k415k260k959n992
10129D82K014n67L039k659m571M284l199n290J068Q076K979o640N07L325K138
10114D986q46l228J903j146l914M519m480J469L555K43q42l432j027o203Q062
10099c81O726J0934N5k957q599j214j384n71L878L756K218l694l689K279l533
$$ plain form
10084 3824 2558 5440 -806 -2232 -2462 478 7368 11684 9871 8536 6407 4383 -517 -2440 -3579
10069 -3579 -8213 -8915 -6268 -10580 -9746 -631 2806 3183 -2278 -1088 5265 1766 2104 4777 3335 1549
10053 1549 5525 744 -1517 -6494 -7183 998 4278 753 1326 -5662 -9257 -7982 -6292 -5422 -6293 -1436
10037 -1436 2700 1819 -3047 -1283 2830 7699 10206 7257 9765 13546 12662 13187 12441 10240 11288 12255
10021 12255 12142 10785 5041 5397 8550 6941 13770 20238 19554 22366 17236 14596 9759 7435 18791
10006 18791 18109 12039 -204 -9623 -5042 -853 -1635 -2344 -3519 129 4758 7322 8538 4229 -4426
9991 -4426 -3466 8784 12733 8917 7444 3514 3090 8211 8615 2751 -4898 -7851 2773 6210 5629
9976 5629 8081 6917 1456 -5188 -2130 3343 4991 4711 5807 3640 4453 6380 8183 9827 10407 5314
$$ packed form
10084C824j266K882o246j426k30K940O890M316j813j335k129k024m900j923j139
10069c579m634p02K647m312Q34R115L437L77n461J190O353l499L38K673j442j786
10053A549L976m781k261m977o89Q181L280l525N73o988l595J275J690Q70q71M857
10037a436M136q81m866J764M113M869K507k949K508L781q84N25p46k201J048R67
10021A2255j13j357n744L56L153j609O829O468o84K812n130k640m837k324J1356
10006A8791o82o070j2243r419M581M189p82p09j175L648M629K564J216m309q655
9991d426R60J2250L949l816j473l930m24N121M04n864p649k953J0624L437n81
9976E629K452j164n461o644L058N473J648k80J096k167Q13J927J803J644N80n093
$$ plain form
9960 5314 4783 9161 7288 7027 6852 3109 12203 20631 23684 21035 18382 19570 15719 11802 13722 6023
9944 6023 3447 10740 11261 8113 8703 17080 22436 19087 17020 13831 8509 7183 10907 9628 7160
9929 7160 8282 6671 11880 14797 11258 13554 7990 8281 7764 3359 2929 5684 468 -4844 -491 1746
9913 1746 2198 6960 8171 8337 2802 -3325 -949 4790 9365 10095 7800 9084 15213 15781 21487 22405
9897 22405 17593 14254 15306 20636 23189 21348 13798 9860 15755 18805 17010 16443 20874 18531 15547
9882 15547 19683 15235 17805 13581 13847 14866 14590 12136 14392 15756 18788 22812 17786 17242 16421 18187
9866 18187 21346 25201 31801 36490 46484 55890 65604 85165 113229 139655 148768 125927 90762
9853 90762 65028 48577 39752 24323 20917 21788 18321 14163 10489 8699 8963 9547 17192 15936 9881
$$ packed form
9960E314n31M378j873k61j75l743R094Q428L053k649k653J188l851l917J920p699
9944F023k576P293N21l148N90Q377N356l349k067l189n322j326L724j279k468
9929G160J122j611N209K917l539K296n564K91n17m405m30K755n216n312M353K237
9913A746M52M762J211J66n535o127K376N739M575P30k295J284O129N68N706R18
9897B2405m812l339J052N330K553j841p550l938N895L050j795n67M431k343k984
9882A5547M136m448K570m224K66J019k76k454K256J364L032M024n026n44q21J766
9866A8187L159L855O600M689R994R406R714J9561K8064K6426R113k2841l5165
9853I0762k5734j6451q825j5429l406Q71l467m158l674j790K64N84P645j256o055
$$ plain form
9838 9881 8760 11619 9619 15178 21632 19537 8932 8731 10693 14512 14100 10803 9663 7746 9801
9823 9801 8066 3327 4957 8177 10088 13490 14349 13169 18705 13366 7620 6311 6735 10076 3449
9808 3449 6913 9123 12888 16034 16261 16979 14340 18130 17885 17596 18095 18527 24263 21978 17102 19202
9792 19202 27082 24241 21642 24567 29813 34750 31082 32439 29964 37967 38051 28700 22165 22970 22036 19056
9776 19056 18488 14529 13084 12834 15026 22054 28099 33657 33050 36690 37519 43296 48931 52383 49554 50086
9760 50086 52665 53768 52339 52539 51997 54077 62361 63223 65776 69219 64301 61050 60795 58985 47299
9745 47299 50391 63632 60673 55532 55308 56100 50881 49085 52761 51222 53234 52831 51817 47139 49643
9730 49643 61256 65632 66036 65494 64794 61468 61762 67724 73543 85320 87832 86747 89977 87853 86569
$$ packed form
9838I881j121K859k000N559O454k095j0605k01J962L819m12l297j140j917K055
9823I801j735m739J630L220J911L402Q59j180N536n339n746j309M24L341o627
9808C449L464K210L765L146K27P18k639L790k45k89M99M32N736k285m876K100
9792A9202P880k841k599K925N246M937l668J357k475Q003Q4r351o535Q05r34k980
9776A9056n68l959j445k50K192P028O045N558o07L640Q29N777N635L452k829N32
9760E0086K579J103j429K00n42K080Q284Q62K553L443m918l251k55j810j1686
9745D7299L092J3241k959n141k24P92n219j796L676j539K012m03j014m678K504
9730D9643J1613M376M04n42p00l326K94N962N819J1777K512j085L230k124j284
$$ plain form
9715 86569 88122 85295 83959 81884 82680 76716 77025 71593 74427 79924 76652 66421 64630 66272 67593
9700 67593 66962 61793 63589 63505 55609 48731 52219 54925 51367 58222 61202 61810 64573 59783 55802 63535
9684 63535 66422 68821 69800 62502 59503 62003 70200 75999 73710 71851 71018 71195 70863 59800 56184
9669 56184 58215 55661 55200 57166 53841 51705 52395 48446 36617 39787 35818 37991 37350 39991 41753
9654 41753 38688 33076 32615 39101 40807 48352 52630 63345 67031 67698 74367 77362 64877 49567
9640 49567 41551 38452 34861 39095 48332 47218 40467 35025 27989 26462 25253 19399 22969 26789 27298
9625 27298 21913 22022 26959 28315 26142 20955 17800 21517 25023 22236 24031 25836 21894 20388 19252
9610 19252 21028 22031 26429 29658 33061 33518 30190 27823 17636 25742 33278 26483 30117 33045 28726
$$ packed form
9715H6569J553k827j336k075P96n964L09n432K834N497l272j0231j791J642J321
9700F7593o31n169J796q4p896o878L488K706l558O855K980O08K763m790l981P733
9684F3535K887K399R79p298k999K500Q197N799k289j859q33J77l32j1063l616
9669E6184K031k554m61J966l325k136O90l949j1829L170l969K173o41K641J762
9654D1753l065n612m61O486J706P545M278J0715L686O67O669K995j2485j5310
9640D9567q016l099l591M234R237j114o751n442p036j527j209n854L570L820N09
9625B7298n385J09M937J356k173n187l155L717L506k787J795J805l942j506j136
9610A9252J776J003M398L229L403M57l328k367j0187Q106P536o795L634K928m319
$$ plain form
9595 28726 29968 27456 27403 28022 28907 30571 38143 38743 35443 42222 46285 41155 40335 37291 38828 39850
9579 39850 47425 43147 42084 42763 32548 29700 26971 32372 36461 31970 29143 38258 46827 45918 42731
9564 42731 38366 45393 47582 52792 53634 50965 48259 40317 38118 38973 42263 47890 48615 47840 49220 57232
9548 57232 53574 43646 42375 43333 49311 47105 44068 47823 42903 37738 31457 38050 51103 59257 59481
9533 59481 55163 50051 46334 49071 53472 51682 56458 62506 63732 63516 69680 72347 65726 65238 68231
9518 68231 72792 71912 63801 56796 65060 77005 87020 91779 87365 78883 72012 70225 72776 77814
9504 77814 69999 73792 78962 84945 90540 89846 86273 83211 81793 81598 80200 81318 84170 85143 82734
9489 82734 79114 83456 73662 69783 73020 77848 82132 93281 100394 110807 115125 108555 107201 116758
$$ packed form
9595B8726J242k512n3O19Q85J664P572O00l300O779M063n130q20l044J537J022
9579C9850P575m278j063O79j0215k848k729N401M089m491k827R115Q569r09l187
9564D2731m365P027K189N210Q42k669k706p942k199Q55L290N627P25p75J380Q012
9548E7232l658r928j271R58N978k206l037L755m920n165o281O593J3053Q154K24
9533E9481m318n112l717K737M401j790M776O048J226k16O164K667o621m88K993
9518F8231M561q80q111p005Q264J1945J0015M759m414q482o871j787K551N038
9504G7814p815L793N170N983N595o94l573l062j418j95j398J118K852R73k409
9489H2734l620M342r794l879L237M828M284J1149P113J0413M318o570j354R557
$$ plain form
9475 116758 117942 113919 113732 113098 110966 106767 104921 106164 109271 112666 118353 117745 120198 122457 113456
9460 113456 112302 114860 114862 109058 102246 99648 108265 109760 108545 111277 118635 122340 130215 128059 124352
9445 124352 129120 135146 137384 139067 143628 146971 144242 153774 158641 151402 153756 159907 159791 163438 160764
9430 160764 165187 175167 173598 176956 182075 181832 189499 191144 191505 200966 214728 221481 225350 235253 248456
9415 248456 260119 275908 300076 327099 356216 385963 416031 455240 499260 551721 612279 691484
9403 691484 785845 894731 1020151 1164223 1322238 1493687 1684188 1889504 2111813 2358327
9393 2358327 2607969 2843141 3040993 3176109 3229666 3190908 3057985 2861827 2644909 2438495
9383 2438495 2264338 2141103 2069448 2041498 2044222 2092206 2193336 2341747 2507597 2689576
$$ packed form
9475A16758J184m023j87o34k132m199j846J243L107L395N687o08K453K259r001
9460A13456j154K558Kn804o812k598Q617J495j215K732P358L705P875k156l707
9445A24352M768O026K238J683M561L343k729R532M867p239K354O151j16L647k674
9430A60764M423R980j569L358N119k43P667J645L61R461J3762O753L869R903J3203
9415B48456J1663J5789K4168K7023K9117K9747L0068L9209M4020N2461O0558P9205
9403F91484R4361J08886J25420J44072J58015J71449J90501K05316K22309K46514
9393B358327K49642K35172J97852J35116N3557l8758j32923j96158k16918k06414
9383B438495j74157j23235p1655k7950K724M7984J01130J48411J65850J81979
$$ plain form
9373 2689576 2892653 3104746 3318472 3556970 3813757 4101275 4408394 4733000 5071876 5421379
9363 5421379 5772307 6116688 6447246 6766249 7063876 7320455 7536056 7703174 7835262 7922907
9353 7922907 7948355 7905083 7801948 7670088 7511455 7369886 7275080 7219491 7199580 7205123 7222669
9342 7222669 7256067 7305998 7374413 7458111 7541904 7617458 7692126 7807602 7970637 8164887 8372123
9331 8372123 8575846 8781710 9030321 9331096 9696279 10161047 10722685 11360493 12036114 12674673
9321 12674673 13219468 13635253 13897656 13975134 13808306 13385036 12775897 12059680 11304763 10573137
9311 10573137 9896741 9323800 8878198 8585055 8445869 8447916 8550694 8704334 8877170 9033307
9301 9033307 9130121 9149176 9119407 9092335 9100014 9156627 9240315 9330900 9425335 9523156 9653792
$$ packed form
9373B689576K03077K12093K13726K38498K56787K87518L07119L24606L38876L49503
9363E421379L50928L44381L30558L19003K97627K56579K15601J67118J32088Q7645
9353G922907K5448m3272j03135j31860j58633j41569r4806n5589j9911N543J7546
9342G222669L3398M9931O8415Q3698Q3793P5554P4668J15476J63035J94250K07236
9331H372123K03723K05864K48611L00775L65183M64768N61638O37808O75621O38559
9321A2674673N44795M15785K62403P7478j66828m23270o09139p16217p54917p31626
9311A0573137o76396n72941m45602k93143j39186K047J02778J53640J72836J56137
9301I033307R6814J9055k9769k7072P679N6613Q3688R0585R4435R7821J30636
$$ plain form
9290 9653792 9839580 10061938 10316400 10561281 10757764 10872567 10845297 10637672 10253490 9704484
9280 9704484 9064913 8437145 7887872 7458472 7161083 6984543 6902574 6877095 6840884 6757496
9270 6757496 6601074 6367694 6075709 5755855 5429936 5104233 4805280 4557229 4386268 4284126
9260 4284126 4243225 4247335 4299228 4386696 4508500 4652796 4785989 4896300 4967513 5008772 5028355
9249 5028355 5015430 4930490 4740564 4455518 4091555 3692474 3296529 2946373 2654475 2427580
9239 2427580 2256047 2122233 2018966 1930569 1846808 1766224 1676817 1573708 1459454 1337925
9229 1337925 1213828 1100665 989410 905106 840686 791097 744480 699805 668067 643199 621918
9218 621918 600805 582048 570278 561008 553446 552190 545479 536771 518624 504594 491831 478895 479936
$$ packed form
9290I653792J85788K22358K54462K44881J96483J14803k7270k07625l84182n49006
9280I704484o39571o27768n49273m29400k97389j76540q1969k5479l6211q3388
9270F757496j56422k33380k91985l19854l25919l25703k98953k48051j70961j02142
9260D284126m0901M110N1893Q7468J21804J44296J33193J10311P1213M1259J9583
9249E028355j2925q4940j89926k85046l63963l99081l95945l50156k91898k26895
9239B427580j71533j33814j03267q8397q3761q0584q9407j03109j14254j21529
9229A337925j24097j13163j11255q4304o4420m9589m6617m4675l1738k4868k1281
9218F21918k1113j8757j1770r270p562j256o711q708j8147j4030j2763j2936J041
$$ plain form
9205 479936 487168 497279 506004 509411 520534 537614 550798 558031 569883 569727 569241 570673 567897 563437
9191 563437 573861 584418 592285 607660 633772 657843 691814 735270 782711 841796 903738 977094
9179 977094 1059782 1151200 1251869 1352511 1454487 1541775 1601119 1637334 1671197 1713788 1766694
9168 1766694 1833018 1930539 2055697 2217815 2426093 2675179 2966544 3297164 3663573 4071483
9158 4071483 4502400 4940972 5335859 5598454 5668330 5545269 5280190 4945798 4575688 4197758
9148 4197758 3852584 3574776 3385569 3284797 3264720 3303976 3379952 3479351 3595954 3717491
9138 3717491 3820401 3906173 3973213 4025296 4085585 4160303 4243644 4345433 4476690 4651483 4863077
9127 4863077 5101201 5346601 5591421 5823731 6047361 6258179 6423645 6518952 6540821 6496256
$$ packed form
9205D79936P232J0111Q725L407J1123J7080J3184P233J1852j56m86J432k776m460
9191E63437J0424J0557P867J5375K6112K4071L3971M3456M7441N9085O1942P3356
9179I77094Q2688R1418J00669J00642J01976Q7288N9344L6215L3863M2591N2906
9168A766694O6324R7521J25158J62118K08278K49086K91365L30620L66409M07910
9158D071483M30917M38572L94887K62595O9876j23061k65079l34392l70110l77930
9148D197758l45174k77808j89207j00772k0077L9256P5976R9399J16603J21537
9138C717491J02910Q5772O7040N2083O0289P4718Q3341J01789J31257J74793K11594
9127D863077K38124K45400K44820K32310K23630K10818J65466R5307K1869m4565
$$ plain form
9117 6496256 6422353 6354770 6297207 6251944 6207157 6119905 5970419 5761058 5526195 5289895 5069640
9106 5069640 4848885 4626791 4413235 4213379 4036371 3873870 3753071 3683743 3666677 3699838
9096 3699838 3782294 3916508 4092787 4319159 4606449 4955026 5344556 5745405 6108862 6366552
9086 6366552 6479256 6448799 6313461 6125047 5900662 5664856 5441498 5222194 5020196 4839567
9076 4839567 4685400 4555593 4432629 4299515 4160942 4004523 3846144 3712019 3626043 3585278
9066 3585278 3580397 3569606 3501872 3357133 3166429 2971939 2802563 2683598 2632551 2641415 2694244
9055 2694244 2780598 2891391 2998789 3066123 3072890 3011857 2904815 2800247 2715206 2663028 2632583
9044 2632583 2635003 2653774 2676877 2702250 2703654 2685245 2643274 2570300 2433056 2231170 1980737
$$ packed form
9117F496256p3903o7583n7563m5263m4787q7252j49486k09361k34863k36300k20255
9106E069640k20755k22094k13556j99856j77008j62501j20799o9328j7066L3161
9096C699838Q2456J34214J76279K26372K87290L48577L89530M00849L63457K57690
9086F366552J12704l0457j35338j88414k24385k35806k23358k19304k01998j80629
9076D839567j54167j29807j22964j33114j38573j56419j58379j34125q5976m0765
9066C585278m881j0791o7734j44739j90704j94490j69376j18965n1047Q864N2829
9055B694244Q6354J10793J07398O7334O767o1033j07042j04568q5041n2178l0445
9044B632583K420J8771K3103K5373J404j8409m1971p2974j37244k01886k50433
$$ plain form
9033 1980737 1723489 1492576 1297984 1137368 1024722 943404 872930 827729 804779 786063
9023 786063 780562 801718 840949 897305 978209 1058260 1115813 1126304 1071380 966152 863202
9012 863202 789832 748955 748968 774211 821454 878353 920772 927207 880727 790866 677800 577066
9000 577066 493066 440150 406129 384206 365527 348136 337771 344553 354075 351327 334532 309048
8988 309048 300070 301176 301147 296209 283986 278085 264079 248329 235932 227763 221306 206904 198387 195343
8974 195343 189554 188791 177449 175700 177658 179722 168439 164626 161947 151426 148003 154800 164136 168752
8960 168752 169421 169528 169118 162902 164996 170353 170068 176386 178149 176742 181217 175511 163966 168332 165050
8945 165050 164351 169565 169649 171611 172968 174186 178016 186636 189376 191463 206196 208159 199670 194081 198407
$$ packed form
9033A980737k57248k30913j94592j60616j12646q1318p0474m5201k2950j8716
9023G86063n501K1156L9231N6356Q0904Q0051N7553J0491n4924j05228j02950
9012H63202p3370m0877J3K5243M7243N6899M2419O435m6480q9861j13066j00734
9000E77066q4000n2916l4021k1923j8679j7391j0365O782R522k748j6795k5484
8988C09048q978J106k9m938j2223n901j4006j5750j2397q169o457j4402q517l044
8974A95343n789p63j1342j749J958K064j1283l813k679j0521l423O797R336M616
8960A68752O69J07m10o216K094N357k85O318J763j407M475n706j1545M366l282
8945A65050o99N214Q4J962J357J218L830Q620K740K087J4733J963q489n589M326
$$ plain form
8930 198407 207842 221130 226042 225256 224120 218893 206019 187544 166487 163142 170641 184977 208437
8917 208437 231747 245626 244243 237747 239418 240351 229765 211971 199792 194147 189419 192553 199578
8904 199578 199166 196747 200798 209081 216317 224309 222554 212521 204541 197367 192626 195281 190498 191069 183223
8889 183223 180602 175757 173334 179274 173002 175116 184828 184633 186182 190864 196103 202443 214435 222633
8875 222633 233853 235048 235556 238376 228138 213775 198104 169818 143522 116254 65179 -8918
8863 -8918 -70078 -76782 -29280 60815 163282 229744 252996 259337 267079 281130 318202 361866
8851 361866 391542 407688 423171 423710 414772 396716 380071 377006 380273 386550 387962 382081 391175
8838 391175 401748 411680 420462 420490 416572 411260 411856 414907 416579 414412 414375 412040 408996 413481 413419 414660
$$ packed form
8930A98407R435J3288M912p86j136n227j2874j8475k1057l345P499J4336K3460
8917B08437K3310J3879j383o496J671R33j0586j7794j2179n645m728L134P025
8904A99578m12k419M051Q283P236P992j755j0033p980p174m741K655m783N71p846
8889A83223k621m845k423N940o272K114R712j95J549M682N239O340J1992Q198
8875B22633J1220J195N08K820j0238j4363j5671k8286k6296k7268n1075p4097
8863h918o1160o704M7502R0095J02467O6462K3252O341P742J4051L7072M3664
8851C61866K9676J6146J5483N39q938j8056j6645l065L267O277J412n881R094
8838C91175J0573R932Q782K8l918n312N96L051J672k167l7k335l044M485o2J241
$$ plain form
8822 414660 417640 423519 434346 455488 470404 490710 500077 505258 509605 527261 544967 554977 561829
8809 561829 574664 584346 598584 618848 638129 648602 648226 649160 654671 668419 685402 709268 743051
8796 743051 772416 794883 818041 839949 873665 901899 932478 953466 977709 1005259 1043646 1080552
8784 1080552 1122723 1161632 1206197 1253991 1308334 1366632 1427667 1490456 1557707 1631386 1709835
8773 1709835 1794530 1889620 1990112 2103747 2232245 2370325 2530586 2715588 2920763 3154060
8763 3154060 3413367 3711652 4051058 4425931 4825629 5281817 5820125 6479729 7298999 8330600
8753 8330600 9652501 11315397 13353054 15601807 16973214 16596506 15674694 15490814 16255384
8744 16255384 17835101 20165699 23229573 27054103 31658340 36940396 42915501 49976649
$$ packed form
8822D14660K980N879J0827K1142J4916K0306R367N181M347J7656J7706J0010O852
8809E61829J2835R682J4238K0264J9281J0473l76R34N511J3748J6983K3866L3783
8796G43051K9365K2467K3158K1908L3716K8234L0579K0988K4243K7550L8387L6906
8784A080552M2171L8909M4565M7794N4343N8298O1035O2789O7251P3679P8449
8773A709835Q4695R5090J00492J13635J28498J38080J60261J85002K05175K33297
8763C154060K59307K98285L39406L74873L99698M56188N38308O59604Q19270J031601
8753H330600J321901J662896K037657K248753J371407l76708r21812j83880P64570
8744A6255384J579717K330598L063874L824530M604237N282056N975105P061148
$$ plain form
8736 49976649 58836046 70395673 85776564 106253612 133239005 167831322 209632206
8729 209632206 255217588 291411485 292296301 249894972 189982148 138023169 100879633
8722 100879633 75779159 58780519 47047342 38797520 32885785 28505029 25052209 22160641
8714 22160641 19688299 17535608 15547094 13682125 12002923 10552805 9331597 8341166
8706 8341166 7525934 6837190 6236877 5704736 5239819 4825837 4467009 4157525 3896512 3666907
8696 3666907 3458588 3266733 3100419 2956894 2821776 2686617 2568438 2463235 2361692 2270915
8686 2270915 2185384 2093400 2004240 1909859 1819312 1744645 1686393 1620604 1550294 1489912 1440831
8675 1440831 1394518 1339492 1292407 1246836 1206202 1164644 1132595 1100442 1067804 1036084 1000457
$$ packed form
8736D9976649Q859397J1559627J5380891K0477048K6985393L4592317M1800884
8729B09632206M5585382L6193897Q84816m2401329n9912824n1958979l7143536
8722A00879633k5100474j6998640j1733177q249822n911735m380756l452820k891568
8714B2160641k472342k152691j988514j864969j679202j450118j221208r90431
8706H341166q15232o88744o00313n32141m64917m13982l58828l09484k61013k29605
8696C666907k08319j91855j66314j43525j35118j35159j18179j05203j01543r0777
8686B270915q5531r1984q9160r4381r0547p4667n8252o5789p0310o0382m9081
8675A440831m6313n5026m7085m5571m0634m1558l2049l2153l2638l1720l5627
$$ plain form
8664 1000457 967640 952953 933954 911797 891985 876376 866603 855649 837863 815603 783603 750386
8652 750386 716918 695421 678036 664861 652919 642488 632019 619533 602084 587982 581898 575827
8640 575827 566385 549842 545291 549086 555527 559440 563706 566669 569561 582603 600783 620664 636390
8627 636390 666859 719622 789627 884186 1002299 1141914 1320914 1579184 1941142 2284586
8617 2284586 2212048 1736690 1286237 1016215 878302 825183 813362 827361 861104 942217 1082050
8606 1082050 1241877 1245360 1067263 909203 828476 783610 765010 739597 703989 678529 666347
8595 666347 682635 720674 744847 729321 670940 586054 504541 444104 419267 413669 417147 423076
8583 423076 440077 475561 528410 605187 696803 756390 712280 593233 489577 429527 391476
$$ packed form
8664A000457l2817j4687j8999k2157j9812j5609r773j0954j7786k2260l2000l3217
8652G50386l3468k1497j7385j3175j1942j0431j0469j2486j7449j4102o084o071
8640E75827r442j6543m551L795O441L913M266K963K892J3042J8180J9881J5726
8627F36390L0469N2763P0005R4559J18113J39615J79000K58270L61958L43444
8617B284586p2538m75358m50453k70022j37913n3119j1821J3999L3743Q1113J39833
8606A082050J59827L483j78097j58060q0727m4866j8600k5413l5608k5460j2182
8595F66347J6288L8039K4173j5526n8381q4886q1513o0437k4837n598L478N929
8583D23076J7001L5484N2849P6777R1616N9587m4110j19047j03656o0050l8051
$$ plain form
8572 391476 367596 351051 339622 334035 328161 326578 319224 310307 289028 264853 243807 232170 223645
8559 223645 212433 203566 198886 188328 180854 189483 200705 201645 205774 211620 217414 212276 206852 196423
8545 196423 177564 155910 137367 131744 133751 135800 145153 165215 189293 225396 254577 281655
8533 281655 288996 275184 231679 182422 147597 135386 137356 147541 159938 181802 199181 202439
8521 202439 188797 173366 160735 156974 157691 151375 154761 150668 154206 150720 143287 140704 139023 131528
8507 131528 122655 113129 111860 118802 118693 111382 109327 117222 119670 120450 122077 120908 123163 125809 129140
8492 129140 126426 125702 122931 121703 122849 125104 127854 131621 131583 133373 143544 144785 150611 159006 157172
8477 157172 151295 140880 132306 129556 129124 126775 124658 129060 128598 135858 138894 138169 132537 133671 128896
$$ packed form
8572C91476k3880j6545j1429n587n874j583p354q917k1279k4175k1046j1637q525
8559B23645j1212q867m680j0558p474Q629J1222R40M129N846N794n138n424j0429
8545A96423j8859k1654j8543n623K007K049R353K0062K4078L6103K9181K7078
8533B81655P341j3812m3505m9257l4825j2211J970J0185J2397K1864J7379L258
8521B02439j3642j5431j2631l761P17o316L386m093L538l486p433k583j681p495
8507A31528q873r526j269O942j09p311k055P895K448P80J627j169K255K646L331
8492A29140k714p24k771j228J146K255K750L767l8J790J0171J241N826Q395j834
8477A57172n877j0415q574k750m32k349k117M402m62P260L036p25n632J134m775
$$ plain form
8462 128896 119947 109907 109376 107122 100694 102863 96588 101520 101322 103512 104380 103762 102597 99825 104168
8447 104168 105040 99657 99706 103653 111366 118705 118481 119096 122514 117283 117516 114845 111516 103553 101369 101704
8431 101704 105496 114797 125786 134759 140708 136615 135778 136083 131052 113804 90643 70374 57457 47254
8417 47254 42911 38395 37560 33432 32154 30705 27997 20791 23886 25015 19237 18518 22852 29531 26868
8402 26868 30953 38015 46273 43013 40246 42576 45712 46365 38076 38974 35830 35532 31637 38461 40159
8387 40159 35228 45233 52820 51909 51160 47314 44751 46961 49701 47386 46729 47283 45971 46115 43172 49669
8371 49669 58552 61454 62973 61860 57162 47030 42582 46367 48977 50041 49443 52262 58253 57193 57519
8356 57519 59462 66238 77874 85095 95892 105266 102216 99537 107017 113562 120701 124401 126230 132695
$$ packed form
8462A28896q949j0040n31k254o428K169o275M932j98K190Q68o18j165k772M343
8447A04168Q72n383M9L947P713P339k24O15L418n231K33k671l329p963k184L35
8431A01704L792R301J0989Q973N949m093q37L05n031j7248k3161k0269j2917j0203
8417D7254m343m516q35m128j278j449k708p206L095J129n778p19M334O679k663
8402B6868M085P062Q258l260k767K330L136O53q289Q98l144k98l895O824J698
8387D0159m931J0005P587r11p49l846k563K210K740k315o57N54j312J44k943O497
8371D9669Q883K902J519j113m698j0132m448L785K610J064n98K819N991j060L26
8356E7519J943O776J1636P221J0797R374l050k679P480O545P139L700J829O465
$$ plain form
8342 132695 148897 162769 177748 193237 207888 229711 267275 309755 366906 422162 492817 576261
8330 576261 662058 763398 869315 973953 1052824 1091102 1095328 1055369 975648 860582 731088
8319 731088 613640 509556 414534 334140 279559 238095 208116 182796 161234 145873 130909
8308 130909 117534 102221 92181 81618 76554 67081 59422 60656 58843 52927 56822 53786 50353
8295 50353 46304 45294 42219 39752 40797 50079 57854 56883 46077 39809 39610 35208 32185 31258 26646
8280 26646 22716 25234 30139 27844 27353 33934 43207 46826 48403 44941 40604 40119 36434 32992 28356
8265 28356 27602 29391 25894 30994 35871 31262 34313 48119 57424 58374 49320 40399 46511 48143 53075
8250 53075 56213 53357 44324 40241 33830 29147 31036 23115 21618 20721 27938 29764 29113 29834 30991
$$ packed form
8342A32695J6202J3872J4979J5489J4651K1823L7564M2480N7151N5256P0655Q3444
8330E76261Q5797J01340J05917J04638P8871L8278M226l9959p9721j15066j29494
8319G31088j17448j04084r5022q0394n4581m1464k9979k5320k1562j5361j4964
8308A30909j3375j5313j0040j0563n064r473p659J234j813n916L895l036l433
8295E0353m049j010l075k467J045R282P775r71j0806o268j99m402l023r27m612
8280B6646l930K518M905k295m91O581R273L619J577l462m337m85l685l442m636
8265B8356p54J789l497N100M877m609L051J3806R305R50r054q921O112J632M932
8250E3075L138k856r033m083o411m683J889p921j497q97P217J826o51P21J157
$$ plain form
8235 30991 35176 36691 35841 35943 36778 38941 43761 44797 48936 47426 45281 49495 55067 50605 47171
8220 47171 53561 62204 68297 72874 79271 78492 82407 85167 78139 65112 49548 49569 50159 56373 59141
8205 59141 50084 44824 43390 41550 40238 34175 36585 38395 42153 37703 36476 40696 42009 44441 44534
8190 44534 43513 47667 54417 62891 66015 70426 80125 91347 103395 110481 111692 106142 100418 90892
8176 90892 79440 62132 57579 60593 53733 47803 39589 38258 39558 43869 48513 45687 40724 39825
8162 39825 42837 48778 48109 43562 33354 30457 33113 31816 26659 30801 33528 30167 34602 40597 31635
8147 31635 32215 32961 32916 51479 68169 72247 80340 83790 82581 76692 73110 65882 55446 46133 46202
8132 46202 37129 24924 23811 23385 22575 23519 14872 11622 11447 14470 19776 22364 20884 17213 18755
$$ packed form
8235C0991M185J515q50J02Q35K163M820J036M139j510k145M214N572m462l434
8220D7171O390Q643O093M577O397p79L915K760p028j3027j5564K1N90O214K768
8205E9141r057n260j434j840j312o063K410J810L758m450j227M220J313K432R3
8190D4534j021M154O750Q474L124M411R699J1222J2048P086J211n550n724r526
8176I0892j1452j7308m553L014o860n930q214j331J300M311M644k826m963q99
8162C9825L012N941o69m547j0208k897K656j297n157M142K727l361M435N995q962
8147C1635N80P46m5J8563J6690M078Q093L450j209n889l582p228j0436r313O9
8132D6202r073j2205j113m26q10R44q647l250j75L023N306K588j480l671J542
$$ plain form
8117 18755 23226 20047 14592 17006 14441 10039 9932 12731 10012 12461 15020 10736 11435 15938 19941
8102 19941 24246 28787 30984 31327 25773 22580 25177 25461 20410 16857 14270 16449 21198 20881 18664
8087 18664 23290 16455 10731 12385 18734 23888 20846 18476 18666 17049 21562 29460 20294 13876 5059
8072 5059 4104 12711 20265 28152 24994 18598 19265 20089 16724 13398 14501 15180 19664 14218 8301 1453
8056 1453 2492 12292 9898 5299 6340 5481 8502 5969 4938 4641 7446 8955 11568 9860 7805
8041 7805 8297 14107 16522 12473 3006 -1866 3884 11740 17715 22599 20576 19174 17654 17469 21376
8026 21376 20824 12659 5896 5849 6696 6908 8842 4767 8412 12563 16592 14964 14387 11340 12711 15283
8010 15283 12223 11285 11118 1646 683 2935 7183 7925 4832 -421 -3152 -875 8134 4321 2168 2943
$$ packed form
8117A8755M471l179n455K414k565m402j07K799k719K449K559m284O99M503M003
8102A9941M305M541K197L43n554l193K597K84n051l553k587K179M749l17k217
8087A8664M626o835n724J654O349N154l042k370J90j617M513P898r166o418q817
8072E059r55Q607P554P887l158o396O67Q24l365l326J103O79M484n446n917o848
8056A453J039R800k394m599J041q59L021k533j031k97K805J509K613j708k055
8041G805M92N810K415m049r467m872N750P856N975M884k023j402j520j85L907
8026B1376n52q165o763m7Q47K12J934m075L645M151M029j628n77l047J371K572
8010A5283l060r38j67r472r63K252M248P42l093n253k731K277R009l813k153P75
$$ plain form
7994 2943 7190 637 -1962 5782 9530 12397 15990 14739 19079 20690 15355 9523 12928 14577 10734
7979 10734 7865 10641 5022 4860 3524 -1059 1377 5467 3095 11532 15777 8485 832 8407 10259
7964 10259 13553 13369 15897 6066 3694 10085 10430 8469 13027 18542 20684 9424 4879 5596 11188
7949 11188 11268 9967 11897 18812 17401 11132 9405 3536 3623 3285 3580 5103 5401 6163 10393 15991 14741
7932 14741 8985 10350 14814 12810 12003 9162 12535 17259 22975 17766 8044 14487 22358 25917 22291
7917 22291 26001 20885 13662 3972 5500 14973 10389 3532 -1825 -1099 4425 2803 3526 5028 -983
7902 -983 -571 -4214 -4533 -9173 -1148 6343 147 1069 7021 10926 9220 3893 -5918 -909 6605 5674
7886 5674 8634 7083 5372 4307 1476 4305 2250 4517 3193 926 2622 5549 9591 9379 6549
$$ packed form
7994B943M247o553k599P744L748K867L593j251M340J611n335n832L405J649l843
7979A0734k869K776n619j62j336m583K436M090k372Q437M245p292p653P575J852
7964A0259L294j84K528r831k372O391L45j961M558N515K142j1260m545P17N592
7949A1188Q0j301J930O915j411o269j727n869Q7l38K95J523K98P62M230N598j250
7932A4741n756J365M464k004q07k841L373M724N716n209r722O443P871L559l626
7917B2291L710n116p223r690J528R473m584o857n357P26N524j622P23J502o011
7902i83M12l643l19m640Q025P491o196R22N952L905j706n327r811N009P514r31
7886E674K960j551j711j065k831K829k055K267j324k267J696K927M042k12k830
$$ plain form
7871 6549 935 3920 12985 13271 12147 15295 14452 10204 10880 6852 4287 3617 4188 3280 5247 7256
7855 7256 7006 9903 1871 -3297 -6268 -5752 -820 1432 4307 1002 -1710 2167 6145 2033 384
7840 384 2839 3173 6441 9097 14276 11882 7928 5603 7591 7781 7690 11486 13009 13738 19820 21675
7824 21675 20891 16729 17100 14056 4695 1127 2830 -753 -10129 -11302 -6439 -4637 -5918 -5634 -5068 -9614
7808 -9614 -4732 -5080 -7370 -3334 -3144 -13811 -17922 -12967 -4335 -5019 -6991 -8129 -10534 -5636 -306
7793 -306 -3 -791 -4841 -3954 4132 6628 9002 4999 -1188 -8957 -6508 -7494 -7975 -6917 -6577 -13061 -9102
7776 -9102 1847 5514 8985 10293 7624 2162 3299 5347 -1960 -6932 -3851 -3715 -577 312 -1043
7761 -1043 93 4561 7041 2473 4986 1591 1359 10092 17205 18699 15186 7277 4655 418 -434
$$ packed form
7871F549n614K985R065K86j124L148q43m248O76m028k565o70N71r08J967K009
7855G256k50K897q032n168k971N16M932K252K875l305k712L877L978m112j649
7840C84K455L34L268K656N179k394l954k325J988J90r1L796J523P29O082J855
7824B1675p84m162L71l044r361l568J703l583r376j173M863J802j281K84N66m546
7808i614M882l48k290M036J90j0667m111M955Q632o84j972j138k405M898N330
7793c06L03p88m050Q87Q086K496K374m003o187p769K449r86m81J058L40o484L959
7776i102J0949L667L471J308k669n462J137K048p307m972L081J36L138Q89j355
7761a043J136M468K480m568K513l395k32Q733P113J494l513p909k622m237q52
$$ plain form
7746 -434 2651 3019 7 -2241 -1844 -2429 -8210 -2693 -17 -125 666 3447 8144 16411 16884 12569 6519
7729 6519 8946 7051 8286 10788 13857 10329 8025 5402 3984 1946 3942 1128 1462 4344 1848
7714 1848 7381 14262 14011 10553 6998 3067 2244 1753 4206 6273 9589 8923 7747 11591 8689 2487
7698 2487 3042 516 -3192 -10793 -7218 -6824 -10524 -16403 -16936 -14977 -7583 2246 278 2255 5330 5965
7682 5965 347 130 186 6921 5661 3446 9050 2903 -5095 -5392 -4450 -2987 3400 6540 6907 5097
7666 5097 -2681 -5543 -2646 6010 6740 1911 835 -358 1031 9244 13773 15340 6068 4793 2357
7651 2357 5075 7670 3843 1420 2197 -1093 2077 -3723 -4367 -949 -5094 -3266 -3244 -7731 -12450 -5318
7635 -5318 -1709 2041 4444 1961 5335 7457 1866 -1408 -624 -4873 -2656 -5168 -962 3886 -392
$$ packed form
7746d34L085L68l012k248L97n85n781N517K676j08P91K781M697Q267M73m315o050
7729F519K427j895J235K502L069l528k304k623j418k038J996k814L34K882k496
7714A848N533O881k51l458l555l931q23m91K453K067L316o66j176L844k902o202
7698B487N55k526l708p601L575L94l700n879n33J959P394R829j968J977L075O35
7682E965n618k17N6O735j260k215N604o147p998k97R42J463O387L140L67j810
7666E097p778k862K897Q656P30m829j076j193J389Q213M529J567r272j275k436
7651B357K718K595l827k423P77l290L170n800o44L418m145J828K2m487m719P132
7635e318L609L750K403k483L374K122n591l274P84m249K217k512M206M848m278
$$ plain form
7620 -392 -3292 -191 -286 -7287 -13370 -9373 -3879 3474 5333 3924 9002 11633 7335 5083 8430 12507
7604 12507 13263 12177 14655 13993 7259 2674 2764 5236 9888 7905 6843 8462 4543 -2652 -1485 8432
7588 8432 13276 13107 12385 10200 4029 5916 4605 -459 -6067 -11732 -9749 -5690 -1542 -2295 3021 1220
7572 1220 2019 216 -1227 1389 -3234 104 -1904 1677 -629 -6531 -7280 -2425 1651 3080 4863
7557 4863 7931 9822 221 3969 11417 6522 750 5791 1957 -275 -3720 -6439 -6628 -1798 -283
7542 -283 1942 2215 3724 2641 728 -3112 -5061 -6087 -5235 -7640 -6306 -4438 -2440 -5233 -1878 3647
7526 3647 -80 -1420 -1919 1348 6115 5070 534 631 -6695 -8773 -7110 -48 -4183 -2973 3105 1181
7510 1181 -2024 -5540 -6415 -4860 -6327 -4615 -3623 -2095 3440 2711 2229 -142 -4081 -4884 -5449 -4648 562
$$ packed form
7620c92k900L101r5p001o083L997N494P353J859j409N078K631m298k252L347M077
7604A2507P56j086K478o62o734m585R0K472M652j983j062J619l919p195J167R917
7588H432M844j69p22k185o171J887j311n064n608n665J983M059M148p53N316j801
7572A220P99j803j443K616m623L338k008L581k306n902p49M855M076J429J783
7557D863L068J891r601L748P448m895n772N041l834k232l445k719j89M830J515
7542b83K225K73J509j083j913l840j949j026Q52k405J334J868J998k793L355N525
7526C647l727j340m99L267M767j045m536R7p326k078J663P062m135J210O078j924
7510A181l205l516q75J555j467J712R92J528N535p29m82k371l939q03n65Q01N210
$$ plain form
7493 562 8939 5906 -302 -7288 -8049 -2222 -3597 -1928 3410 1660 -8441 -5679 -2581 -4614 -3650
7478 -3650 -8078 -9840 -6733 -5357 -4948 -4266 5429 15712 17086 16681 15509 21613 16881 12764 10772
7463 10772 8934 6437 1256 1057 6713 13308 11227 5852 -3238 -8465 -9536 -6919 -1933 7113 7335
7448 7335 8176 10270 7290 1204 2309 11061 12549 9712 7155 7672 8332 2300 336 4189 523 5250
7432 5250 2048 -7206 -9715 -5930 -3930 -5244 -42 -717 927 6805 10423 2865 2723 4956 6202
7417 6202 2452 -733 -1300 930 2844 1247 -499 -2060 -117 -3626 4229 5970 -5312 -4465 883
7402 883 1732 6812 781 5078 14056 13628 2991 -6349 -7842 -1278 4290 2407 625 -409 667
7387 667 1437 3598 7767 5973 6358 -705 -5112 -3004 555 1400 -644 -221 -3301 -4184 1704 -54
$$ packed form
7493E62Q377l033o208o986p61N827j375J669N338j750j0101K762L098k033R64
7478c650m428j762L107J376M09O82R695J0283J374m05j172O104m732m117j992
7463A0772j838k497n181j99N656O595k081n375r090n227j071K617M986R046K22
7448G335Q41K094k980o086J105Q752J488k837k557N17O60o032j964L853l666M727
7432E250l202r254k509L785K000j314N202o75J644N878L618p558j42K233J246
7417F202l750l185n67K230J914j597j746j561J943l509P855J741j1282Q47N348
7402H83Q49N080o031M297Q978m28j0637r340j493O564N568j883j782j034J076
7387F67P70K161M169j794L85p063m407K108L559Q45k044M23l080q83N888j758
$$ plain form
7371 -54 2700 7094 6235 10256 5899 2880 6537 7832 5380 3234 3545 7227 7496 5835 4580 2567
7355 2567 -3218 -801 1603 -70 2558 7990 9661 9222 14216 12350 10567 9445 9490 7271 3723 6718
7339 6718 5039 10463 7805 9868 15158 17803 8040 4599 6257 10272 9757 4869 2292 4788 6363
7324 6363 5463 2726 1855 -1934 -822 -3060 -7389 -3568 8725 9546 13508 5794 -2534 -6563 -8286
7309 -8286 -4075 3947 11389 9199 10379 6598 3272 5667 3970 654 2066 9393 13387 5533 -2182
7294 -2182 -7938 -5294 -6918 -1719 7137 6962 3932 -716 -1969 -1002 -2005 1183 -2411 -10698 -11492 -4275
7278 -4275 732 2090 7061 4157 -2951 -5195 885 3353 -376 -8806 -4468 -2281 1943 5126 6951
7263 6951 1445 -805 2851 3952 5575 5892 7092 1020 -4321 -2445 -4359 -700 6694 1141 1025
$$ packed form
7371e4K754M394q59M021m357l019L657J295k452k146L11L682K69j661j255k013
7355B567n785K417K404j673K628N432J671m39M994j866j783j122M5k219l548K995
7339F718j679N424k658K063N290K645r763l441J658M015n15m888k577K496J575
7324F363r00k737q71l789J112k238m329L821J2293Q21L962p714q328m029j723
7309h286M211Q022P442k190J180l781l326K395j697l316J412P327L994p854p715
7294b182n756K644j624N199Q856j75l030m648j253R67j003L188l594q287p94P217
7278d275N007J358M971k904p108k244O080K468l729q430M338K187M224L183J825
7263F951n506k250L656J101J623L17J200o072n341J876j914L659P394n553j16
$$ plain form
7248 1025 2553 -40 -847 -1577 4539 9360 3116 2029 8977 981 -2877 -174 -1514 -4271 -5267 -7475
7232 -7475 -7647 -4291 -7952 -19635 -18773 -7007 -7947 -5259 -4080 -871 4649 1390 -2802 -7077 -8357
7217 -8357 -5740 -5932 -357 9405 12111 9571 7287 4926 6505 12142 12641 8610 3531 -2277 -6627
7202 -6627 -2803 2539 6846 9113 6612 5773 10690 11239 7980 -1719 -4684 -9267 -12616 -4360 2991
7187 2991 2029 -4832 -10895 -4696 899 3481 6113 7443 6547 5193 2829 842 -4920 -8163 -1103
7172 -1103 7215 13827 6662 -2707 -2119 1786 318 -3079 -5462 -5717 -8619 -5950 -4004 241 4518
7157 4518 2383 2069 -774 270 99 -3299 -7366 -927 628 -820 -376 1501 -1449 -5337 -4682 -5037
7141 -5037 -8121 -10057 -8622 -11365 -4685 120 -1454 317 2508 -3070 -3457 -5920 -3187 -863 -830 -4140
$$ packed form
7248A025J528k593q07p30O116M821o244j087O948p996l858K703j340k757r96k208
7232g475j72L356l661j1683Q62J1766r40K688J179L209N520l259m192m275j280
7217h357K617j92N575R762K706k540k284k361J579N637M99m031n079n808m350
7202f627L824N342M307K267k501q39M917N49l259r699k965m583l349Q256P351
7187B991r62o861o063O199N595K582K632J330q96j354k364j987n762l243P060
7172a103Q318O612p165r369N88L905j468l397k383k55k902K669J946M245M277
7157D518k135l14k843J044j71l398m067O439J555j448M44J877k950l888O55l55
7141e037l084j936J435k743O680M805j574J771K191n578l87k463K733K324L3l310
$$ plain form
7125 -4140 520 6246 1551 -1334 4296 5657 126 -4546 944 9175 11338 4906 -5945 -5249 -4931
7110 -4931 -10090 -12466 -1899 4675 4698 7242 9885 4311 -632 -2486 -4400 -5465 -4961 -2915 3968
7095 3968 6213 8118 8525 -697 -91 4082 -2331 -7171 -10495 -6236 -2366 -857 1147 6265 4311
7080 4311 4431 1118 -5529 -11119 -10682 -4661 -1931 -1388 -4129 -604 5839 2283 -496 -2381 -4372 -7597
7064 -7597 -12887 -16172 -8994 -1848 5236 -5603 -10861 -12393 -10681 -10533 -3828 4441 7068 8196 5109
7049 5109 2035 5411 3999 -900 1902 7236 7690 6313 8492 8888 7792 6194 -3983 -9677 -10341
7034 -10341 -7611 -3811 1837 4141 726 -4447 -3101 2141 852 -1985 634 -4505 -4726 -5826 -2720
7019 -2720 2083 23 477 442 745 -121 7855 12893 15657 10510 -818 -5071 -8090 -6033 -4636 -5027
$$ packed form
7125d140M660N726m695k885N630J361n531m672N490Q231K163o432j0851O96L18
7110d931n159k376J0567O574K3K544K643n574m943j854j914j065N04K046O883
7095C968K245J905M07r222O06M173o413m840l324M259L870J509K004N118j954
7080D311J20l313o647n590M37O021K730N43k741L525O443l556k779j885j991l225
7064g597n290l285P178P146P084j0839n258j532J712J48O705Q269K627J128l087
7049E109l074L376j412m899K802N334M54j377K179L96j096j598j0177n694o64
7034a0341K730L800N648K304l415n173J346N242j289k837K619n139k21j100L106
7019b720M803k060M54l5L03q66P976N038K764n147j1328m253l019K057J397l91
$$ plain form
7003 -5027 -398 -4132 -5534 1754 2543 -3183 -806 3289 8560 4773 1962 5451 2394 558 4114
6988 4114 -4333 -8865 -11742 -11847 -12909 -13483 -2690 1806 3929 -2272 -2915 -7107 -7970 -10041 -6535 -9185
6972 -9185 -10356 -6559 -950 -1492 2065 12883 6168 246 -4698 -9367 -4741 163 1628 550 3454
6957 3454 1209 -1146 2906 535 -4879 -6027 -1649 1450 -5693 -117 11777 12555 4206 -535 2618
6942 2618 6894 9028 9278 3198 1560 8591 4869 2884 -1261 243 2380 93 -1292 -339 2538
6927 2538 5718 6816 2726 -524 -6957 -13156 -8537 -1073 6000 15949 9795 -1041 1365 4832 3563
6912 3563 3379 6451 6131 -1989 -4454 -798 3224 4697 5818 3029 5409 -2971 -9009 -7133 -8588
6897 -8588 -4424 -5117 843 4933 8138 493 -5387 -5531 -6694 -11842 -5182 -1367 -3687 -504 1690
$$ packed form
7003e027M629l734j402P288P89n726K377M095N271l787k811L489l057j836L556
6988D114q447m532k877j05j062n74J0793M496K123o201o43m192q63k071L506k650
6972i185j171L797N609n42L557J0818o715n922m944m669M626M904J465j078K904
6957C454k245k355M052k371n414j148M378L099p143N576J1894P78q349m741L153
6942B618M276K134K50o080j638P031l722j985m145J504K137k287j385R53K877
6927B538L180J098m090l250o433o199M619P464P073R949o154j0836K406L467j269
6912C563j84L072l20q120k465L656M022J473J121k789K380q380o038J876j455
6897h588M164o93N960M090L205p645n880j44j163n148O660L815k320L183K194
$$ plain form
6882 1690 -3450 -8314 -6849 -2695 -1719 2965 2082 -82 576 -2468 -5167 -4769 -1629 -11558 -17788 -9793
6866 -9793 -7223 -3388 -5012 -2061 -4491 -6224 454 2800 3158 2111 4122 7688 4878 -2925 -4937
6851 -4937 288 4082 5110 -634 -2732 -7414 -7040 -931 5682 3981 6387 5419 2534 2709 3055 1743
6835 1743 437 -2691 -3372 -263 2292 4517 2002 2976 4853 2920 5759 13122 10638 9253 6475
6820 6475 3529 -2923 -3443 1378 5589 6131 3303 3997 1233 -313 1915 -801 -1859 -9337 -11990 -11611
6804 -11611 -6238 -6687 -4065 -6717 -2377 5367 8604 6529 10134 8342 -2017 1532 -1937 -6408 -5558
6789 -5558 -3408 4369 7283 4080 3809 7152 7520 9459 12200 3304 1073 3249 4709 5816 2442
6774 2442 1994 4801 8394 6199 4682 7403 7630 15171 20414 19567 20846 23387 20288 13907 17357 24124
$$ packed form
6882A690n140m864J465M154R76M684q83k164O58l044k699L98L140r929o230P995
6866i793K570L835j624K951k430j733O678K346L58j047K011L566k810p803k012
6851d937N225L794J028n744k098m682L74O109O613j701K406r68k885J75L46j312
6835A743j306l128o81L109K555K225k515R74J877j933K839P363k484j385k778
6820F475k946o452n20M821M211N42k828O94k764j546K228k716j058p478k653L79
6804a1611N373m49K622k652M340P744L237k075L605j792j0359L549l469m471Q50
6789e558K150P777K914l203k71L343L68J939K741q896k231K176J460J107l374
6774B442m48K807L593k195j517K721K27P541N243q47J279K541l099o381L450O767
$$ plain form
6758 24124 32257 39170 41878 44532 44394 46862 46793 41046 36637 31238 25886 29417 34046 46350 53450
6743 53450 59847 67413 81077 95827 116649 140058 173130 220739 274213 349221 464484 611178
6731 611178 785913 964083 1047716 909641 650013 437491 293325 209227 154789 120643
6721 120643 97163 83915 67856 54264 41992 34866 32970 30118 32731 35618 35561 29823 25627 29383
6707 29383 35247 37670 34267 33573 30430 29072 27976 24764 21401 12770 2669 861 610 6651 7359
6692 7359 8560 10524 18017 17711 11281 3534 2103 -55 3326 5501 6985 6436 6812 10663 15036 17350
6676 17350 10263 6783 8503 5719 5290 1994 2050 2715 3289 3599 7933 14341 9956 -2981 -8131 -3951
6660 -3951 -2130 -4298 -2996 -452 -2157 -5481 -6793 -10096 -6403 -1958 3962 3058 6169 2958 -2672
$$ packed form
6758B4124Q133O913K708K654j38K468o9n747m409n399n352L531M629J2304P100
6743E3450O397P566J3664J4750K0822K3409L3072M7609N3474P5008J15263J46694
6731F11178J74735J78170Q3633j38075k59628k12522j44166q4098n4438l4146
6721A20643k3480j3248j6059j3592j2272p126j896k852K613K887n7n738m196L756
6707B9383N864K423l403o94l143j358j096l212l363q631j0101j808k51O041P08
6692G359J201J964P493l06o430p747j431k158L381K175J484n49L76L851M373K314
6676A7350p087l480J720k784m29l296N6O65N74L10M334O408m385j2937n150M180
6660c951J821k168J302K544j705l324j312l303L693M445N920r04L111l211n630
$$ plain form
6645 -2672 1892 6190 3549 1905 2718 9560 13237 7491 1454 -4644 -6146 -3780 -6486 -309 2224
6630 2224 3189 5357 1543 -493 2632 6024 8218 555 -520 -2636 -7373 -6337 -711 4354 1461
6615 1461 -5778 -13552 -11087 -6446 -5259 1084 61 -3142 -6156 -1152 -499 5476 7459 5040 8862
6600 8862 13556 14606 12594 3839 -2650 -8635 -11672 -4686 -2025 -686 -10159 -7935 -4618 2603 2141
6585 2141 6588 4312 8635 14412 9715 6101 8178 7333 3433 -2671 -7187 -6143 975 2595 1131
6570 1131 -7904 -7765 36 3862 4518 4596 5904 -1574 -402 -1895 -2050 -5578 -7007 -787 2721 -4648
6554 -4648 -6594 -6786 -9700 -4394 -2509 -4433 -3514 -12930 -13427 -14795 -7143 -5518 145 4078 2378 3102
6538 3102 4475 3401 -1497 -1498 -202 -3105 137 -678 -4547 3687 -403 -1521 -5305 -9961 -8086 -6222
$$ packed form
6645b672M564M298k641j644Q13O842L677n746o037o098j502K366k706O177K533
6630B224R65K168l814k036L125L392K194p663j075k116m737J036N626N065k893
6615A461p239p774K465M641J187O343j023l203l014N004O53N975J983k419L822
6600H862M694J050k012q755o489n985l037O986K661J339r473K224L317P221m62
6585B141M447k276M323N777m697l614K077q45l900o104m516J044P118J620j464
6570A131r035J39P801L826O56P8J308p478J172j493j55l528j429O220L508p369
6554d648j946j92k914N306J885j924R19r416m97j368P652J625N663L933j700P24
6538C102J373j074m898jJ296k903L242q15l869Q234m090j118l784m656J875J864
$$ plain form
6522 -6222 -1285 -3032 1970 7491 8210 2644 -6789 -4495 3783 3572 -226 -5146 -3104 -841 -6609
6507 -6609 -11718 -12611 -10001 -2670 3958 8842 8918 13333 11348 16263 15678 10278 4587 3476 7773 8756
6491 8756 5294 7223 11378 8787 5562 5947 8200 7332 2231 -6657 -9820 -8849 -12566 -11012 -5552 -5392
6475 -5392 -8547 -11271 -7305 -13223 -3699 2228 4521 5117 -3607 -3864 -4797 -1880 -2572 -232 2765 -573
6459 -573 -511 -3594 -6937 98 5675 7648 4886 -3793 -6707 -7111 -1596 966 -493 -2328 -3966 -4246
6443 -4246 -2748 387 2540 4912 -38 3240 10069 9743 6800 6182 6766 1946 -1283 -11175 -17338 -16734
6427 -16734 -14890 -11954 -5131 -3882 -3470 -1536 -1969 -3260 -5498 -10896 -10608 -8954 -10781 -7265 -8006 -11889
6411 -11889 -12410 -8587 -1162 -4304 -3931 -4795 -5911 -1967 -9416 -15770 -11468 -13530 -15701 -12577 -9969
$$ packed form
6522f222M937j747N002N521P19n566r433K294Q278k11l798m920K042K263n768
6507f609n109q93K610P331O628M884P6M415j985M915n85n400n691j111M297R83
6491H756l462J929M155k591l225L85K253q68n101q888l163R71l717J554N460J60
6475e392l155k724L966n918R524N927K293N96q724k57r33K917o92K340K997l338
6459e73O2l083l343P035N577J973k762q679k914m04N515K562j459j835j638k80
6443d246J498L135K153K372m950L278O829l26k943o18N84m820l229r892o163O04
6427a6734J844K936O823J249M12J934m33j291k238n398K88J654j827L516p41l883
6411a1889n21L823P425l142L73q64j116L944p449o354M302k062k171L124K608
$$ plain form
6396 -9969 -6614 -10055 -4482 -4598 342 11057 12907 7716 3158 1563 -3681 -8824 -7684 -3980 -7746
6381 -7746 -5214 -1637 -3091 -2279 1917 4282 9425 12506 12808 -953 914 8604 10949 4194 -4158
6366 -4158 -5943 -2505 -3223 883 6679 7967 4853 4513 259 -1458 1036 4142 8114 11455 6457
6351 6457 -2961 -899 892 690 -2939 -756 4035 -5916 -8671 -6336 -9306 -9713 -4684 -1555 -5457
6336 -5457 -6818 -10602 -11758 -9777 -2359 4712 9 -80 409 -501 2913 8191 3447 2479 7107 3006
6320 3006 -4578 -5575 -8241 -8160 -8567 -8173 -4774 -1766 -542 177 -3584 -2118 -2108 1402 8317 5209 2381
6303 2381 3537 1815 4655 -3363 -9969 -12654 -9514 -6645 -1979 1066 791 -632 1422 594 189 190
6287 190 5700 9992 7404 3544 3736 -3983 -7888 -7656 -4140 -2437 -6143 -4973 -6877 -4353 -3327 -1188
$$ packed form
6396i969L355l441N573j16M940J0715J850n191m558j595n244n143J140L704l766
6381g746K532L577j454Q12M196K365N143L081L02j3761J867P690K345o755q352
6366d158j785L438p18M106N796J288l114l40m254j717K494L106L972L341m998
6351F457r418K062J791k02l629K183M791r951k755K335k970m07N029L129l902
6336e457j361l784j156J981P418P071m703q9M89r10L414N278m744r68M628m101
6320C006p584r97k666Q1m07L94L399L008J224P19l761J466J0L510O915l108k828
6303B381J156j722K840q018o606k685L140K869M666L045k75j423K054q28m05J
6287A90N510M292k588l860J92p719l905K32L516J703l706J170j904K524J026K139
$$ plain form
6271 -1188 -6511 -7807 -2753 4673 3655 1666 3580 4533 3774 1246 -2782 2624 9532 109 -12909
6256 -12909 -13194 -6511 727 4806 43 -1186 -1234 -11057 -9922 -5845 -7950 -1495 2086 8576 10787
6241 10787 10441 4395 -4524 -4281 4611 4514 -304 2675 2483 -863 -6992 -3426 531 662 5365 3565
6225 3565 1248 3810 3792 2589 4217 8219 7143 586 -4027 -4188 -6108 -4480 -4125 -6984 -8116 -2479
6209 -2479 -3546 -2845 -6271 -9110 -11612 -9315 -4659 1038 5045 1946 436 -1925 244 1275 -4975
6194 -4975 -6474 -5788 -4021 2090 2211 -2031 -2802 5374 6399 -30 500 1773 -2070 133 -4041 -6724
6178 -6724 -8703 -1974 1966 4550 6339 8155 5427 2770 2967 3784 5671 9899 11991 9149 7554
6163 7554 -3605 -1644 5736 -2918 -4764 -6091 -6058 -3714 -3930 1997 -1221 -8512 -12255 -5830 -6699 -273
$$ packed form
6271a188n323j296N054P426j018j989J914R53p59k528m028N406O908r423j3018
6256a2909k85O683P238M079m763j229m8r823J135M077k105O455L581O490K211
6241A0787l46o046q919K43Q892r7m818K979j92l346o129L566L957J31M703j800
6225C565k317K562j8j203J628M002j076o557m613j61j920J628L55k859j132N637
6209b479j067P01l426k839k502K297M656N697M007l099j510k361K169J031o250
6194d975j499O86J767O111J21m242p71Q176J025o429N30J273l843K203m174k683
6178f724j979O729L940K584J789J816k728k657J97Q17J887M228K092k842j595
6163G554j1159J961P380q654j846j327L3K344k16N927l218p291l743O425q69O426
$$ plain form
6147 -273 3428 -4262 -11931 -9845 -10207 -10280 -10760 -2813 3994 838 -6683 -6191 -4550 -8536 -11573 -10544
6131 -10544 -2346 -4380 -7435 -6319 -7205 -7460 -6747 -7195 -707 -2549 -268 981 -1231 -1966 -6157 -6305
6115 -6305 -2106 -476 1971 4060 525 -2792 -3529 -4158 -1039 -2706 -2027 -1828 1389 10299 11110 8498
6099 8498 12649 11432 4222 4708 129 4130 4048 6877 8921 6805 5570 8481 6303 -261 -9489 -18475
6083 -18475 -25448 -23414 -13368 -3004 -1861 983 6518 4121 -133 -1076 499 5208 6470 3223
6069 3223 3525 4645 2495 -353 -6140 -4322 760 5679 13215 11099 4115 -1512 1625 4027 4232
6054 4232 -1810 4547 8848 6164 1293 2138 -2183 -3365 3945 309 3154 8520 13505 12087 5514
6039 5514 1266 2071 2968 -6842 -11862 -10065 -7515 -3134 -5883 -6825 -3913 4721 11525 13083 7239 5873
$$ packed form
6147b73L701p690p669K086l62p3m80P947O807l156p521M92J641l986l037J029
6131a0544Q198k034l055J116q86k55P13m48O488j842K281J249k212p35m191j48
6115f305M199J630K447K089l535l317p37o29L119j667O79J99L217Q910Q11k612
6099H498M151j217p210M86m579M001q2K829K044k116j235K911k178o564r228q986
6083a8475o973K034J0046J0364J143K844N535k397m254r43J575M709J262l247
6069C223L02J120k150k848n787J818N082M919P536k116o984n627L137K402K05
6054D232o042O357M301k684m871Q45m321j182P310l636K845N366M985j418o573
6039E514m248Q05Q97r810n020J797K550M381k749r42K912Q634O804J558n844j366
$$ plain form
6023 5873 548 -9033 -8434 -5068 -9379 -12367 -7453 -4615 619 7206 1626 -8543 -9727 -10353 -8553
6008 -8553 -6914 -4994 -3799 -11497 -9265 -6277 -2767 -2577 -5544 -3672 -6314 -9550 -6142 -3943 -8285
5993 -8285 -1366 3311 7740 6691 -4217 -1249 683 -1644 5108 7943 12069 2981 2807 4086 5511
5978 5511 3332 76 -2178 -9658 -4779 3569 1518 -10489 -9627 -10091 -4502 2985 4884 2612 -480
5963 -480 261 2558 9721 10074 11388 6064 -413 -5524 -5071 192 -1827 -1721 607 -1866 -578 -9079
5947 -9079 -9379 -9458 -10594 -4508 -1954 -57 3007 -3457 -10577 -6835 1419 2047 2946 4349 2158 5287
5931 5287 3699 -699 -4560 -8400 2789 6448 5125 -5230 -7226 462 3264 -2368 -4152 -643
5917 -643 -1715 -2899 1032 -2400 -6443 -10948 -11552 -9378 -7624 -8420 -3736 308 -7701 -9067 -8645 -7976
$$ packed form
6023E873n325r581N99L366m311k988M914K838N234O587n580j0169j184o26J800
6008h553J639J920J195p698K232K988L510J90k967J872k642l236L408K199m342
5993h285O919M677M429j049j0908K968J932k327O752K835M126r088j74J279J425
5978E511k179l256k254p480M879Q348k051j2007Q62m64N589P487J899k272l092
5963d80P41K297P163L53J314n324o477n111M53N263k019J06K328k473J288q501
5947i079l00p9j136O086K554J897L064o464p120L742Q254O28Q99J403k191L129
5931E287j588m398l861l840J1189L659j323j0355j996P688K802n632j784L509
5917f43j072j184L931l432m043m505o04K174J754p96M684M044q009j366M22O69
$$ plain form
5901 -7976 -8832 -1676 1011 662 1045 3290 -19 -7284 -11006 -8085 -8217 -6697 -9522 -7245 -3484 -2112
5885 -2112 -7585 -11304 -10777 -5621 -4358 -4837 -891 -687 474 4084 -1121 44 8460 5570 7621 7844
5869 7844 9739 8028 4832 6502 5148 4055 4807 9461 10239 5092 3298 8075 3805 -3688 -5235
5854 -5235 -695 499 -2550 -5410 -4043 -1854 -684 83 -3561 -8955 -6863 -3715 -1963 -708 3443
5839 3443 4405 -4708 -8318 -6726 -9125 -3057 3713 4419 6120 7911 2628 -9304 -11623 -4204 -2146
5824 -2146 -1095 8153 7005 8261 3590 -600 5724 6144 6675 7089 4702 5395 3138 1724 4856 7806
5808 7806 5188 7334 7485 5149 2161 4254 5072 43 -1563 207 5193 2514 -1624 3695 2965 1929
5792 1929 2292 -3031 -3480 -5201 -5947 -4867 -8673 -11598 -3748 3187 3633 -5706 -12623 -11238 -1797 733
$$ packed form
5901g976q56P156K687l49L83K245l309p265l722K921j32J520k825K277L761J372
5885b112n473l719N27N156J263m79L946K04J161L610n205J165Q416k890K051K23
5869G844J895j711l196J670j354j093P52M654P78n147j794M777m270p493j547
5854e235M540J194l049k860J367K189J170P67l644n394K092L148J752J255M151
5839C443R62r113l610J592k399O068O770P06J701J791n283j1932k319P419K058
5824b146J051R248j148J256m671m190O324M20N31M14k387O93k257j414L132K950
5808G806k618K146J51k336k988K093Q18n029j606J770M986k679m138N319p30j036
5792A929L63n323m49j721p46J080l806k925P850O935M46r339o917J385R441K530
$$ plain form
5776 733 5081 2724 1108 2532 3240 -193 3459 12517 10365 3500 -5557 -13251 -10873 -8986 -4427
5761 -4427 -3500 -14224 -16029 -10413 -5637 -2314 -4580 -8558 -2804 1997 5086 4887 -2791 -2230 2273
5746 2273 5143 10119 3337 -2408 -5207 -5918 -3575 784 5237 2381 4400 6295 4057 -1674 -1346
5731 -1346 4444 -2685 -1808 594 6556 4180 -2980 -11374 -7448 -5079 -3533 365 -413 -2729 -2417 -1868
5715 -1868 -4924 -3618 2070 4279 2838 6559 16032 12671 6993 7375 4820 4069 4918 1023 -5786 -6912
5699 -6912 -5193 -2824 -5649 -4430 -5634 -5402 -1881 -7802 -4902 690 2272 3252 -4356 -4969 -2260 -686
5683 -686 -3464 -7238 -8963 -3619 2171 3560 2283 2835 1960 -1782 -12691 -10785 -8758 -8911 -9713 -5109
5667 -5109 -4587 -3141 -1926 -11482 -12988 -3173 -2312 -221 6584 6732 5953 5838 2638 6474 9139 3614
$$ packed form
5776G33M348k357j616J424P08l433L652R058k152o865r057p694K378J887M559
5761d427R27j0724j805N616M776L323k266l978N754M801L089j99p678N61M503
5746B273K870M976o782n745k799p11K343M359M453k856K019J895k238n731L28
5731a346N790p129Q77K402N962k376p160q394L926K369J546L898p78k316L12N49
5715a868l056J306N688K209j441L721R473l361n678L82k555p51Q49l895o809j126
5699f912J719K369k825J219j204K32L521n921K900N592J582R80p608o13K709J574
5683f86k778l774j725N344N790J389j277N52q75l742j0909J906K027j53q02M604
5667e109N22J446J215r556j506R815Q61K091O805J48p79j15l200L836K665n525
$$ plain form
5651 3614 1949 2714 -10716 -15102 -14234 -8329 -6332 647 -1378 -5678 -5549 -2453 266 -5504 -6808
5636 -6808 -7185 -4089 -1841 2068 -2172 -4513 -5941 -7117 -4326 -10667 -14642 -12537 -2087 7507 5643
5621 5643 -2113 -7590 -8129 -3167 1466 1573 -1830 -1868 2407 5317 3844 -1066 -3600 -6032 -3920 -4692
5605 -4692 -2465 -2657 -1259 -9676 -12183 -10818 -8095 -7072 -6326 1120 -1142 -13356 -19646 -20442 -15544
5590 -15544 -13870 -10797 -902 4916 -285 -3146 360 3818 5744 5111 4595 225 -5971 -9407 -11101
5575 -11101 -10210 -12986 -11148 -9478 -3975 444 3593 1711 4629 3584 1238 1648 1087 1552 746 -748
5559 -748 -8304 -7653 -2770 4484 654 -3016 137 2910 -929 -5741 -4578 -8011 -3773 -3175 -3848 -4118
5543 -4118 195 4802 7604 7470 9356 3563 -2994 -4488 -13112 -15372 -14754 -12627 -6505 -8382 -6858
$$ packed form
5651C614j665P65j3430m386Q68N905J997O979k025m300J29L096K719n770j304
5636f808l77L096K248L909m240k341j428j176K791o341l975K105J0450R594j864
5621E643p756n477n39M962M633J07l403l8M275K910j473m910k534k432K112p72
5605d692K227j92J398q417k507J365K723J023P46P446k262j2214o290p96M898
5590a5544J674L073R895N818n201k861L506L458J926o33n16m370o196l436j694
5575a1101Q91k776J838J670N503M419L149j882K918j045k346M10n61M65q06j494
5559g48p556O51M883P254l830l670L153K773l839m812J163l433M238N98o73k70
5543d118M313M607K802j34J886n793o557j494q624k260O18K127O122j877J524
$$ plain form
5528 -6858 -4640 1686 7369 6563 -3923 -8522 -8391 -8498 -4160 -9784 -17373 -15589 -14660 -7194 -2385 -506
5512 -506 -618 -2768 -5044 157 11017 11242 7909 1731 -5853 -14885 -14068 -6578 -2762 -4434 -1970 -4445
5496 -4445 -5162 -4672 -1022 -3118 -7372 -11883 -3944 3533 2298 284 -2458 -3420 -5689 -8130 -4303 -2168
5480 -2168 -3082 -575 -3865 -3444 -611 -305 465 -2151 -226 -2123 931 4282 7009 4479 5585 -2265
5464 -2265 -195 10450 7241 3505 637 -6860 -12060 -8973 -10176 -7601 -3165 324 2556 -2527 -1400
5449 -1400 5731 10025 10103 708 -4019 -6479 -4497 -300 2887 5425 2411 3325 5099 5603 4886 10219
5433 10219 7193 8306 7280 1771 -2064 -6336 -12474 -12785 -9026 -7550 -10038 -16028 -11279 -3007 -2040
5418 -2040 -7412 -9704 -9697 -12828 -8826 -9521 -13010 -7482 -1749 -2810 4593 4736 6266 3745 189 -3973
$$ packed form
5528f858K218O326N683q06j0486m599J31j07M338n624p589J784R29P466M809J879
5512e06j12k150k276N201J0860K25l333o178p584r032Q17P490L816j672K464k475
5496d445p17M90L650k096m254m511P939P477j235k014k742r62k269k441L827K135
5480b168r14K507l290M21K833L06P70k616J925j897L054L351K727k530J106p850
5464b265K070J0645l209l736k868p497n200L087j203K575M436L489K232n083J127
5449a400P131M294P8r395m727k460J982M197L187K538l014R14J774N04p17N333
5433A0219l026J113j026n509l835m272o138l11L759J476k488n990M749Q272R67
5418b040n372k292Pl131M002o95l489N528N733j061P403J43J530k521l556m162
$$ plain form
5402 -3973 -5157 -5606 -10646 -4053 5705 7342 4055 1420 6980 5021 425 1139 -4737 -3819 2926 887
5386 887 -6200 -7643 -5768 -8296 -9391 -10746 -7414 -6874 -7107 -5815 -2590 1207 8386 11637 7682 5689
5370 5689 -962 3649 10564 10022 8720 2941 -3740 -3933 -1907 -2614 -9415 -7827 -3844 -1581 1445 551
5354 551 -3856 -2215 -547 -5950 -6907 -3203 -2951 -6845 -2613 -3717 690 -1566 -1320 10 -2102 -5302
5338 -5302 -6121 -942 -1911 7945 6969 1812 3643 4292 3587 1831 9443 11199 8431 8183 2985 -3897
5322 -3897 -7163 -9886 -12329 -8878 -10727 -12105 -9342 -9231 -4066 -3485 -3514 2162 12527 13153 10917 9279
5306 9279 10603 14291 13081 6468 -3720 -5927 -7978 488 2173 -716 -5417 -9117 -2401 3416 2331
5291 2331 5581 5976 9233 9795 4814 -20 -363 -651 -3603 -2872 -5652 -9748 -8054 -2549 1993 2463
$$ packed form
5402c973j184m49n040O593R758J637l287k635N560j959m596P14n876R18O745k039
5386H87p087j443J875k528j095j355L332N40k33J292L225L797P179L251l955j993
5370E689o651M611O915n42j302n779o681j93K026p07o801J588L983K263L026q94
5354E51m407J641J668n403r57L704K52l894M232j104M407k256K46J330k112l200
5338e302q19N179r69R856r76n157J831O49p05j756P612J756k768k48n198o882
5322c897l266k723k443L451j849j378K763J11N165N81k9N676J0365O26k236j638
5306I279J324L688j210o613j0188k207k051Q466J685k889m701l700O716N817j085
5291B331L250L95L257N62m981m834l43k88k952P31k780m096J694N505M542M70
$$ plain form
5275 2463 1521 -1894 -5329 -2392 -3746 -13091 -14858 -8405 -6089 -4096 -1231 -3599 -6687 -4901 -1730
5260 -1730 3485 4148 3967 -894 600 587 -6139 -3996 -6253 -4022 3053 -4755 -4775 2236 3248 5118
5244 5118 7686 984 559 2859 -3167 -7794 -7592 -4453 4751 1839 3565 6817 9515 7929 1371
5229 1371 -4682 -3715 -5872 2330 9032 8545 5151 4602 2700 -1596 1423 -1297 -2448 -5232 -6445 -7772
5213 -7772 -11257 -5505 -1397 3029 6693 6816 7047 169 555 4064 4921 -1362 -5773 -6803 -7180 -4084
5197 -4084 -925 -2989 -4119 -3177 -312 614 -6377 -6067 2776 -517 -3676 -1581 -926 -3887 -5792 -2419
5181 -2419 -1936 5958 1266 -3539 -4666 -5251 -10768 -10878 -2958 2819 2998 4085 6309 -3652 -9879 -5591
5165 -5591 -706 1047 -3044 -6506 -2092 2562 5491 4515 1797 -2804 -8632 -14037 -5381 7625 15983
$$ packed form
5275B463r42l415l435K937j354r345j767O453K316J993K865k368l088J786L171
5260a730N215O63j81m861J494j3o726K143k257K231P075p808k0P011J012J870
5244E118K568o702m25K300o026m627K02L139R204k912J726L252K698j586o558
5229A371o053R67k157Q202O702m87l394n49j902m296L019k720j151k784j213j327
5213g772l485N752M108M426L664J23K31o878L86L509Q57o283m411j030l77L096
5197d084L159k064j130R42K865R26o991L10Q843l293l159K095O55k961j905L373
5181b419M83P894m692m805j127n85n517j10P920N777J79J087K224r961o227M288
5165e591M885J753m091l462M414M654K929r76k718m601n828n405Q656J3006Q358
$$ plain form
5150 15983 13783 7657 2762 -2044 1187 -910 -2445 -1396 2074 -2470 -1222 -1847 -4319 -8780 -9437
5135 -9437 -13128 -12391 -13285 -3418 -95 4080 -379 -5544 -9247 -9002 -8529 -11911 -9851 -13949 -5305 -2517
5119 -2517 2653 3242 -769 183 4871 10007 4171 -2320 -2400 4134 11854 7430 5275 4299 2650 6223
5103 6223 1403 -4719 -2078 6457 9490 5645 4204 -4093 -5114 1107 -7739 -20349 -19745 -12000 -4652
5088 -4652 -733 539 6346 1115 -5803 -2358 -3026 -3317 -6943 2143 4765 3144 5679 4105 3246 4862
5072 4862 3444 -4306 -6182 2609 10802 9068 6090 6230 6852 3268 -205 -5722 -7633 -1639 713
5057 713 -5807 -5445 -1974 -5278 -8904 -2543 -4968 -7313 -10063 -9061 -4836 -5969 -5873 -6646 1760 -1737
5041 -1737 -3972 -6884 -16430 -17607 -8536 -1104 -461 -6560 -13537 -20197 -17096 -9569 -1889 3047 -1150
$$ packed form
5150A5983k200o126m895m806L231k097j535J049L470m544J248o25k472m461o57
5135i437l691P37q94R867L323M175m459n165l703K45M73l382K060m098Q644K788
5119b517N170N89m011R52M688N136n836o491q0O534P720m424k155r76j649L573
5103F223m820o122K641Q535L033l845j441q297j021O221q846j2610O04P745P348
5088d652L919J272N807n231o918L445o68k91l626R086K622j621K535j574q59J616
5072D862j418p750j876Q791Q193j734k978J40O22l584l473n517j911N994K352
5057G13o520L62L471l304l626O361k425k345k750J002M225j133R6p73Q406l497
5041a737k235k912r546j177R071P432O43o099o977o660L101P527P680M936m197
$$ plain form
5026 -1150 -2875 -2667 -5890 -11295 -6037 2370 4353 3751 5095 -4982 796 1367 -5592 -6726 -2341
5011 -2341 -3449 -3416 -6999 -7440 -2677 6896 12220 12762 5603 5175 6444 7711 5651 -1335 1524 6751
4995 6751 4244 1696 4188 4003 4104 4178 8036 8655 2440 -1566 3389 5621 2423 4015 6354 5343
4979 5343 -3223 -6702 -8059 -4344 -6899 -6014 -5071 -448 -6412 -8125 -8501 -3311 3756 4929 -1217 -4722
4963 -4722 -7378 -1669 -1409 -6401 -9128 -5943 -5133 -7069 -5576 -4684 -9058 -15620 -16040 -9716 -5925 -1250
4947 -1250 763 -2597 -3029 -1759 5377 9643 6538 2554 6861 8147 4099 5876 3728 -270 -1348
4932 -1348 -5325 -12848 -15320 -7835 -830 -419 -2618 1714 4749 9327 6531 5467 -1072 -12441 -6716
4917 -6716 989 2331 -1098 -1845 -13114 -11682 -10150 -8342 -1695 1448 -513 -3208 -5106 -3463 4153
$$ packed form
5026a150j725K08l223n405N258Q407J983o02J344j0077N778N71o959j134M385
5011b341j108L3l583m41M763R573N324N42p159m28J269J267k060o986K859N227
4995F751k507k548K492j85J01P4L858O19o215m006M955K232l198J592K339j011
4979E343q566l479j357L715k555Q85R43M623n964j713l76N190P067J173o146l505
4963d722k656N709K60m992k727L185Q10j936J493Q92m374o562m20O324L791M675
4947a250K013l360m32J270P136M266l105l984M307J286m048J777k148l998j078
4932a348l977p523k472P485P005M11k199M332L035M578k796j064o539j1369N725
4917f716P705J342l429p47j1269J432J532J808O647L143j961k695j898J643P616
$$ plain form
4902 4153 5740 3296 340 2931 10008 4570 -2290 -4302 1526 -3114 -8423 -10278 -2203 2902 2350
4887 2350 3543 9019 1722 -1033 -4240 -7652 -2818 3895 643 -3097 5592 8807 10648 1985 -2188
4872 -2188 2814 1587 2894 8903 5796 -676 -392 3314 4439 -1624 -13777 -13078 -3508 -307 -3274
4857 -3274 -12071 -17166 -19019 -9272 -4920 -5935 -2223 2456 -228 -3320 -5574 -6966 -5959 -6233 -5531
4842 -5531 -375 710 98 -2305 -2246 -4144 -6163 -6776 1011 10754 7169 -3628 -10674 -4693 -196 -4423
4826 -4423 99 9758 8951 2819 902 -2265 -2442 -1882 -3172 2347 1012 -5920 -9405 -8816 -4650 -4025
4810 -4025 -5457 -6584 -5514 -3180 -4745 -4527 -6761 -5517 -935 -22 1860 256 2979 8168 845
4795 845 -1693 -7517 -7896 -2681 -4050 -1537 -1817 2048 4496 363 -1311 -4837 -1694 -6558 -6522 3116
$$ packed form
4902D153J587k444k956K591P077n438o860k012N828m640n309j855Q075N105n52
4887B350J193N476p297k755l207l412M834O713l252l740Q689L215J841q663m173
4872b188N002j227J307O009l107o472K84L706J125o063j2153O99R570L201k967
4857c274q797n095j853R747M352j015L712M679k684l092k254j392J007k74P02
4842e531N156J085o12k403N9j898k019o13P787R743l585j0797p046N981M497m227
4826d423M522R659q07o132j917l167j77N60j290N519j335o932l485N89M166O25
4810d025j432j127J070K334j565K18k234J244M582R13J882j604K723N189p323
4795H45k538n824l79N215j369K513k80L865K448m133j674l526L143m864L6R638
$$ plain form
4779 3116 -159 -7090 -1320 7504 11032 4726 -844 309 -4348 -4024 3490 5390 -1106 -3856 -5876
4764 -5876 -7609 -8398 -4912 -5152 -7641 -6068 -9323 -8104 -3108 -2446 -3991 -1537 4220 11318 15334 12987
4748 12987 12680 15630 8003 5360 4563 -1787 -4319 -1245 117 5944 9045 6133 -2076 -3390 -2807
4733 -2807 3404 5376 3627 9500 2756 -5236 -13279 -14295 -6608 6653 6805 -53 -82 841 6382 4649
4717 4649 4148 -1726 -4509 -5211 -1117 5136 230 -9438 -8525 -7272 -7482 -8907 -7591 -9222 -9567 -5901
4701 -5901 -405 8882 9499 8870 11697 9644 7993 4420 7477 11691 3776 2241 1013 -1886 1201
4686 1201 299 -1540 -5381 -406 4063 990 -1195 2185 2570 2295 126 4699 2908 -507 -1554 -581
4670 -581 -152 7484 13892 15097 11499 4317 2256 -712 -3454 -8642 -17195 -13027 -6275 -11607 -10780 -13467
$$ packed form
4779C116l275o931N770Q824L528o306n570J153m657L24P514J900o496k750k020
4764e876j733p89L486k40k489J573l255J219M996O62j545K454N757P098M016k347
4748A2987l07K950p627k643p97o350k532L074J362N827L101k912q209j314N83
4733b807O211J972j749N873o744p992q043j016P687J3261J52o858k9R23N541j733
4717D649n01n874k783p02M094O253m906r668R13J253k10j425J316j631l45L666
4701e901N496R287O17o29K827k053j651l573L057M214p915j535j228k899L087
4686A201r02j839l841M975M469l073k185L380L85k75k169M573j791l415j047R73
4670e81M29P636O408J205l598p182k061k968k742n188q553M168O752n332Q27k687
$$ plain form
4654 -13467 -16731 -15292 -13633 -13077 -14684 -16659 -17309 -13412 -3173 -4285 -8102 -8186 -5412 -3197 -1527
4639 -1527 27 3147 4402 8152 3700 1648 715 4999 7253 5250 -718 -2719 -155 3895 -1055
4624 -1055 855 2118 4496 5741 7932 8885 -13 -7154 -3715 -4217 -1702 -1793 3666 1227 -1973 -5382
4608 -5382 1054 -3164 -10941 -14990 -9694 -6520 -466 7216 6698 2286 -2778 -52 3248 6390 9299
4593 9299 9447 5181 -3502 -2917 4031 8502 11938 2976 -5019 -5768 -2684 -3759 -7888 -3072 -2464 -3360
4577 -3360 -3470 -7042 -5431 -3328 -4497 -4898 -4706 3218 3570 -4448 -4220 -5441 -4710 -3151 -1787 -6537
4561 -6537 -8589 -5775 -5509 -4413 2472 1250 -2445 -4850 -6674 -24 6975 -513 -11363 -18975 -15396
4546 -15396 -6889 -3803 -1415 -1893 -4060 -2677 -3468 -3427 -3002 -6585 -6113 -10717 -6836 -2615 -2799 -367
$$ packed form
4654a3467l264J439J659N56j607j975o50L897J0239j112l817q4K774K215J670
4639a527J554L120J255L750m452k052r33M284K254k003n968k001K564M050m950
4624a055J910J263K378J245K191R53q898p141L439n02K515r1N459k439l200l409
4608e382O436m218p777m049N296L174O054P682n18m412n064K726L300L142K909
4593I299J48m266q683N85O948M471L436q962p995p49L084j075m129M816O08q96
4577c360j10l572J611K103j169m01J92P924L52q018K28j221P31J559J364m750
4561f537k052K814K66J096O885j222l695k405j824O650O999p488j0850p612L579
4546a5396Q507L086K388m78k167J383p91M1M25l583M72m604L881M221j84K432
$$ plain form
4530 -367 -2764 -5777 -6446 -484 -3103 -6164 -4968 7251 7407 2959 1945 3363 1736 88 1349
4515 1349 -4995 -4353 4267 3490 2942 5929 6695 7723 8114 6610 8388 10751 4530 1202 1851 20
4499 20 -3069 -5410 -1663 720 -1286 -6537 -3421 7869 4295 2696 4464 -979 -6139 -6400 -878
4484 -878 1282 3489 7194 -1655 -732 -3527 -3849 -1519 -3716 -4724 -7928 -7249 -1124 -8330 -17523 -16241
4468 -16241 -9911 -3925 -1445 -1622 -1446 -594 -4988 -8024 -6032 -4649 -6361 -4374 -2968 -33 -2129
4453 -2129 -7473 -8557 -5126 -570 -3561 -8302 -15605 -10755 -6151 -4874 -5524 1490 5318 7870 12322
4438 12322 11116 9283 1585 -2925 -1179 -5042 -7228 -5972 -6323 -13856 -14887 -8985 -5696 -4819 -465
4423 -465 3725 847 4477 5911 3944 -5097 -5627 4204 7925 7969 6307 8450 3855 3457 5468 4143
$$ packed form
4530c67k397l013o69N962k619l061J196J2219J56m448j014J418j627j648J261
4515A349o344O42Q620p77n48K987P66J028L91j504J778K363o221l328O49j831
4499B0l089k341L747K383k006n251L116J1290l574j599J768n443n160k61N522
4484h78K160K207L705q849R23k795l22K330k197j008l204O79O125p206r193J282
4468a6241O330N986K480j77J76Q52m394l036J992J383j712J987J406K935k096
4453b129n344j084L431M556k991m741p303M850M604J277o50P014L828K552M452
4438A2322j206j833p698m510J746l863k186J256l51p533j031N902L289Q77M354
4423d65M190k878L630J434j967r041n30R831L721M4j662K143m595l98K011j325
$$ plain form
4407 4143 6801 7941 5873 1129 -5525 -7068 1427 3524 -2519 -5034 3775 5101 3702 1200 241
4392 241 -2567 -5669 -7194 -3696 6095 1288 -4026 -8238 -9639 -11124 -10480 -3528 -7286 -3630 2747
4377 2747 1869 -2237 -3090 -5739 -12289 -17678 -16792 -10657 -7044 -7007 -7550 -5765 -8099 -9621 -3033 -10371
4361 -10371 -8555 -3080 -1141 3552 2949 2663 -3655 -11460 -11353 -11366 -11748 -9716 1563 5863 52 -5657
4345 -5657 -3852 4790 -1305 1687 4786 4841 2452 3163 2815 3191 7293 9639 844 -5768 -3612 -5175
4329 -5175 -5544 -7543 -7973 -9392 -10407 -10632 -8874 -3962 -6201 -5704 -8422 -4859 2108 3748 5723 2018
4313 2018 -710 -2910 3031 -8566 -15330 -3639 900 -3641 -2545 2118 6223 7315 2462 3207 9529
4298 9529 5796 3045 -333 4011 6414 4780 -1293 -3574 -161 2817 -748 -4844 433 -648 1637
$$ packed form
4407D143K658J140k068m744o654j543Q495K097o043k515Q809J326j399k502r59
4392B41k808l102j525L498R791m807n314m212j401j485O44O952l758L656O377
4377B747q78m106q53k649o550n389Q86O135L613L7n43J785k334j522O588p338
4361a0371J816N475J939M693o03k86o318p805J07j3l82K032J1279M300n811n709
4345e657J805Q642o095K992L099N5k389P11l48L76M102K346q795o612K156j563
4329e175l69j999m30j419j015k25J758M912k239M97k718L563O967J640J975l705
4313B018k728k200N941j1597o764J1691M539m541J096M663M105J092m853P45O322
4298I529l733k751l378M344K403j634o073k281L413K978l565m096N277j081K285
$$ plain form
4283 1637 7703 8359 5753 5182 7251 -2229 -13880 -14157 -12973 -6853 632 1659 1100 3877 10864 7259
4267 7259 879 563 5999 7656 9383 6010 4210 1125 110 5050 531 -7556 -10468 -6505 -7818
4252 -7818 -9198 -2802 1864 -4697 -1125 -1779 -2316 -6026 -4139 1689 5075 2589 2554 2186 -1294 3953
4236 3953 6560 6005 344 734 3196 236 -4355 -1086 6608 1270 1480 -298 4766 11335 11110 6896
4220 6896 6965 5399 5630 1247 -4554 -5148 -3828 3467 6936 7433 8220 2579 -4791 -4148 12 203 -4961
4203 -4961 -3967 -287 1635 -360 -2096 -11587 -9673 -1297 5874 9255 10478 10026 11691 18408 18326 11412
4187 11412 5974 6937 4761 -51 -2113 1067 -3131 1716 2654 -6679 -2450 721 3950 8544 15839
4172 15839 16973 14651 11465 12484 11420 4991 2979 1664 -2885 1231 304 -3162 -8993 -10226 -9400
$$ packed form
4283A637O066O56k606n71K069r480j1651k77J184O120P485J027n59K777O987l605
4267G259o380l16N436J657J727l373j800l085j015M940m519q087k912L963j313
4252g818j380O396M666o561L572o54n37l710J887N828L386k486l5l68l480N247
4236C953K607n55n661L90K462k960m591L269P694n338K10j778N064O569k25m214
4220F896O9j566K31m383n801n94J320P295L469M97P87n641p370O43M160J91n164
4203d961R94L680J922j995j736r491J914Q376P171L381J223m52J665O717q2o914
4187A1412n438R63k176m812k062L180m198M847R38r333M229L171L229M594P295
4172A5839J134k322l186J019j064o429k012j315m549M116r27l466n831j233Q26
$$ plain form
4157 -9400 -4333 -5215 -4780 2483 5939 3429 3975 6949 671 -5464 -3119 -2970 -6547 -14029 -6989 -5432
4141 -5432 -7585 -9985 -5178 3416 559 128 1449 43 -4456 -4617 -4812 -7396 -7254 1299 -526 445
4125 445 -7012 -8720 -699 4896 5837 3384 6432 2726 2082 2249 586 3315 6341 8187 11189 5211
4109 5211 -4302 -6277 1509 -986 -1798 -4757 -9975 -9292 -6433 -4276 -2773 -711 3316 -621 -509 2233
4093 2233 1919 4900 1677 1990 4308 4450 1860 612 4276 5286 1159 -913 1034 5821 3837 1788
4077 1788 7001 2668 -4106 -6270 -10779 -10894 -9576 -6118 -2166 -324 -3395 -3235 -5281 -8483 -8029 -5343
4061 -5343 -14267 -16344 -5782 -1785 1603 3087 2296 -7904 -8809 -2459 -3041 -3976 1544 3761 9397
4046 9397 8156 7421 6836 -2402 -11480 -14472 -11299 -120 506 -4885 -8671 -4950 -4761 -685 6186 7007
$$ packed form
4157i400N067q82M35P263L456k510N46K974o278o135K345J49l577p482P040J557
4141e432k153k400M807Q594k857m31J321j406m499j61j95k584J42Q553j825R71
4125D45p457j708Q021N595R41k453L048l706o44J67j663K729L026J846L002n978
4109E211r513j975P786k495q12k959n218O83K859K157J503K062M027l937J12K742
4093B233l14K981l223L13K318J42k590j248L664J010m127k072J947M787j984k049
4077A788N213m333o774k164m509j15J318L458L952J842l071J60k046l202M54K686
4061e343q924k077J0562L997L388J484p91j0200r05O350n82r35N520K217N636
4046I397j241p35n85r238r078k992L173J1179O26n391l786L721J89M076O871Q21
$$ plain form
4030 7007 6925 2572 -4722 -12765 -16669 -17482 -15185 -4997 -1411 -4945 -12139 -11186 -9633 -6237 1393 5716
4014 5716 6002 7071 -116 4959 4674 -4779 -6209 -10520 -12087 -10430 -9708 -12075 -11474 -7623 -3397 -5394
3998 -5394 -7247 -6511 -7273 -4240 -1089 -253 3230 5442 6898 1816 3148 369 -1288 6174 -71 -4305
3982 -4305 -924 1463 2937 5057 3274 424 -3458 -2940 -1315 -3800 -2766 -6955 -8833 -12440 -8210
3967 -8210 -6168 -3036 -346 -2242 2853 2522 -1367 -3996 -1606 2644 813 -2742 -1524 123 -4016
3952 -4016 -3925 -6370 -6765 -4595 -3672 1473 -10 -448 -865 4314 7091 1501 -7563 -9206 -9567 -12897 -11567
3935 -11567 -8259 -5067 -1110 -1196 306 139 -3308 -1179 3137 3211 2726 8957 13125 11854 8564 7371
3919 7371 7776 2013 -2329 -10042 -11369 -12618 -6269 1675 -1530 -5857 -9620 -8248 194 -1520 -5250
$$ packed form
4030G007q2m353p294q043l904q13K297J0188L586l534p194R53J553L396P630M323
4014E716K86J069p187N075k85r453j430m311j567J657P22k367O01L851M226j997
3998e394j853P36p62L033L151Q36L483K212J456n082J332k779j657P462o245m234
3982d305L381K387J474K120j783k850l882N18J625k485J034m189j878l607M230
3967h210K042L132K690j896N095l31l889k629K390M250j831l555J218J647m139
3952d016R1k445l95K170R23N145j483m38m17N179K777n590r064j643l61l330J330
3935a1567L308L192L957q6J502j67l447K129M316P4m85O231M168j271l290j193
3919G371M05n763m342p713j327j249O349P944l205m327l763J372Q442j714l730
$$ plain form
3904 -5250 -3667 -844 4475 7714 11359 10259 2672 4080 5264 2351 5681 -2680 -7757 -1540 1666
3889 1666 600 -4242 428 4603 793 595 -9178 -6600 1038 -2747 -3938 -3658 100 7420 7522 3780
3873 3780 -801 -7605 -12387 -17979 -20909 -13901 -1375 1989 4852 1481 4018 -4267 -13321 -9994 -5354
3858 -5354 -3598 475 3592 5874 4865 6693 783 -1435 -508 1545 -2396 -2450 1094 -1414 -7150 -14383
3842 -14383 -9393 -10041 -10761 -8610 -8444 -10108 -3702 957 -3650 237 3397 -831 -643 -2149 -3599 -6347
3826 -6347 -8710 -3341 -4773 -81 8377 1999 -8332 -12847 -9182 -7698 -16977 -13181 -10709 -8761 -3800
3811 -3800 -939 -8210 -12338 -10030 -4671 -754 1247 -1377 1500 2328 7816 6323 7176 4976 6964
3796 6964 9595 5393 -220 -4920 -844 -3697 -6991 1288 6290 5708 4372 7872 7710 3984 -579
$$ packed form
3904e250J583K823N319L239L645j100p587J408J184k913L330q361n077O217L206
3889A666j066m842M670M175l810j98r773K578P638l785j191K80L758P320J02l742
3873C780m581o804m782n592k930P008J2526L364K863l371K537q285r054L327M640
3858e354J756M073L117K282j009J828n910k218R27K053l941n4L544k508n736p233
3842a4383M990o48p20K151J66j664O406M659m607L887L160m228J88j506j450k748
3826f347k363N369j432M692Q458o378j0331m515L665J484r279L796K472J948M961
3811c800K861p271m128K308N359L917K001k624K877Q28N488j493Q53k200J988
3796F964K631m202n613m700M076k853l294Q279N002n82j336L500j62l726m563
$$ plain form
3781 -579 -7702 -6268 -2106 -41 8503 13679 15646 14867 4003 -1642 2020 7096 -58 -528 -2930
3766 -2930 -4166 -1923 -2539 3320 8459 7275 2775 1481 2830 -2713 -6334 -5204 -4546 -4809 -1797 9204
3750 9204 13435 9385 2430 -657 -3305 -4291 -1602 3924 5754 966 -2027 -5845 -3975 -7176 -3540
3735 -3540 -1192 -3411 -2570 -3031 -1963 -651 1755 4178 4746 2794 4237 -38 -9767 -16840 -11884 -10371
3719 -10371 -6544 276 -4963 -6632 -5371 -4503 -7088 -6234 -5587 -5334 -4551 -7079 -6059 -6592 -4573 -8109
3703 -8109 -2146 2103 855 436 194 -6042 -8764 -5930 -6946 -3477 -3855 427 7941 3674 1499 954
3687 954 2738 2442 5129 -717 -3125 2409 2266 5811 8387 5421 188 -927 -3670 -2668 -2418 -6031
3671 -6031 -2636 -3129 -743 2275 295 -2652 -6121 -8127 -8035 -7477 -790 6638 5511 -319 -1055 -4891
$$ packed form
3781e79p123J434M162K065Q544N176J967p79j0864n645L662N076p154m70k402
3766b930j236K243o16N859N139j184m500j294J349n543l621J130O58k63L012J1001
3750I204M231m050o955l087k648r86K689N526J830m788k993l818J870l201L636
3735c540K348k219Q41m61J068J312K406K423N68j952J443m275r729p073M956J513
3719a0371L827O820n239j669J261Q68k585Q54O47K53P83k528J020n33K019l536
3703h109N963M249j248m19k42o236k722K834j016L469l78M282P514m267k175n45
3687I54J784k96K687n846k408N534j43L545K576k966n233j115k743J002K50l613
3671f031L395m93K386L018j980k947l469k006R2N58O687P428j127n830p36l836
$$ plain form
3655 -4891 -3494 -4938 -9184 -2727 643 -2247 -1084 3653 858 -5222 -8183 -7160 -6984 -4400 88
3640 88 3395 -3721 -7239 -3017 -259 -4226 -1727 -4988 -4026 -7535 -6625 -909 3783 4617 793 -5313
3624 -5313 -1576 -706 -1995 2125 1957 -3902 -7071 -7898 147 6780 9220 7792 1901 -2619 5403 5522
3608 5522 4667 2543 1265 -8372 -19207 -19838 -16392 -14410 -9183 -8844 -3954 -4120 -5670 -5430 93 6077
3592 6077 3218 4240 4208 3582 2257 1995 2413 1186 -3930 1509 8658 15007 16174 7992 7582 7488 4855
3575 4855 1218 396 -3206 -6788 -2073 641 -651 2746 6660 -3777 -16122 -18482 -9642 4608
3561 4608 7665 3481 1027 4688 10048 3242 387 697 -2369 -7773 -7013 -6625 -474 2641 1299 1652
3545 1652 -4406 -11383 -5805 1810 2709 -1462 -3941 -630 -5817 -11830 -4829 -2053 -8555 -9569 -7311
$$ packed form
3655d891J397j444m246O457L370k890J163M737k795o080k961J023J76K584M488
3640H8L307p116l518M222K758l967K499l261R62l509R10N716M692Q34l824o106
3624e313L737Q70j289M120j68n859l169q27Q045O633K440j428n891m520Q022J19
3608E522q55k124j278r637j0835o31L446J982N227L39M890j66j550K40N523N984
3592F077k859J022l2o26j325k62M18j227n116N439P149O349J167q182m10r4k633
3575D855l637q22l602l582M715K714j292L397L914j0437j2345k360Q840J4250
3561D608L057m184k454L661N360o806k855L10l066n404P60L88O151L115j342L53
3545A652o058o977N578P615Q99m171k479L311n187o013P001K776o502j014K258
$$ plain form
3530 -7311 -11249 -6422 -7545 -2794 -4004 -4203 -6344 -7170 -9676 -8730 -3621 -3747 -2628 -1228 -2711 -2105
3514 -2105 172 2931 -1111 -3971 -998 -3525 -1094 -516 4744 9255 9745 8736 7587 1551 794 3172
3498 3172 955 6665 6769 3014 -2608 -3538 905 4012 410 -237 2566 1890 4796 1396 6426 4687
3482 4687 -1973 -2271 -790 -734 -1034 2307 10405 5352 2790 9720 11386 9160 9224 8222 5483 -3763
3466 -3763 -4187 -2058 -2527 3790 3994 -3373 -3939 -4314 -6275 -6687 -4237 -5756 -4020 -134 2733 -472
3450 -472 2376 -2164 -3327 5269 12391 8602 4066 2797 1877 246 -4117 2168 1090 -2567 2155
3435 2155 1087 -623 -1297 439 1591 3867 2178 1923 -1233 -3717 -3518 -2240 -1594 -4088 -5441 -6524
3419 -6524 -4333 -9131 -9486 -5442 -4679 -5324 -4768 -727 943 2264 3819 6073 2341 13320 13546 5286
$$ packed form
3530g311l938M827j123M751j210j99k141q26k506R46N109j26J119J400j483O06
3514b105K277K759m042k860K973k527K431N78N260M511M90j009j149o036p57K378
3498C172k217N710J04l755n622r30M443L107l602o47K803o76K906l400N030j739
3482D687o660k98J481N6l00L341Q098n053k562O930J666k226O4j002k739r246
3466c763m24K129m69O317K04p367n66l75j961m12K450j519J736L886K867l205
3450d72K848m540j163Q596P122l789m536j269r20j631m363O285j078l657M722
3435B155j068j710o74J736J152K276j689k55l156k484J99J278O46k494j353j083
3419f524K191m798l55M044P63o45N56M041J670J321J555K254l732J0979K26q260
$$ plain form
3403 5286 -1170 -2586 -603 2540 2205 -622 -3978 -4937 -4222 -3466 -2134 -9151 -11161 -13703 -16204 -14450
3387 -14450 -9063 -7317 -8438 -4587 -3602 -4157 1588 933 -1066 -7688 -5139 -6421 -14390 -12883 -7387
3372 -7387 -9418 -8845 -8952 -6293 379 3706 2890 -2317 -860 4292 1916 2016 -3474 -4576 2775 9760
3356 9760 10086 1661 -6556 -3812 522 1588 247 2172 1148 -5655 -16749 -10849 -1958 3769 8639
3341 8639 -463 -3314 -2156 -1347 2175 8756 4123 -6931 -6673 -139 8143 9663 9982 11566 10207
3326 10207 12791 10949 6129 2990 1254 4052 -690 335 4296 866 -2237 1516 3203 -1791 -6647
3311 -6647 -5118 793 49 -4946 -3312 -626 6640 6823 -721 -4181 1625 -3423 -6015 1574 -2975
3296 -2975 -7331 -6125 -2486 4796 756 -2069 -839 1323 252 6089 9734 8275 10172 8246 13251
$$ packed form
3403E286o456j416J983L143l35k827l356r59P15P56J332p017k010k542k501J754
3387a4450N387J746j121L851R85n55N745o55j999o622K549j282p969J507N496
3372g387k031N73j07K659O672L327q16n207J457N152k376J00n490j102P351O985
3356I760L26q425q217K744M334J066j341J925j024o803j1094N900Q891N727M870
3341H639r102k851J158Q09L522O581m633j1054K58O534Q282J520L19J584j359
3326A0207K584j842m820l139j736K798m742J025L961l430l103L753J687m994m856
3311f647J529N911p44m995J634K686P266J83p544l460N806n048k592P589m549
3296b975m356J206L639P282m040k825J230K162j071N837L645j459J897j926N005
$$ plain form
3281 13251 6221 2740 2489 3453 3420 -1133 -6963 -8650 -3987 -3086 2882 4529 -975 768 -720 -6508
3265 -6508 -4252 2433 7108 11274 5285 2657 2095 -4761 -10409 -5274 -6646 -1556 8154 6511 209
3250 209 -5996 -6709 -2319 2295 7266 9200 3636 -3008 -3567 -6876 -3822 -2320 -6855 -11724 -11667 -8064
3234 -8064 -11743 -11160 -9510 -18470 -20121 -9814 -7591 938 615 -1073 -3356 -6986 -4082 -2425 -4366
3219 -4366 213 1706 -665 -2227 -4674 -2240 -3294 560 4450 2963 2442 -2892 -7625 -9896 -7757
3204 -7757 -4517 -1801 -31 -4387 -4129 -3860 4521 7979 5254 1232 -5968 -5110 3263 8588 8905 9301
3188 9301 5302 482 -830 -957 -2675 -1399 1875 -6166 -13363 -16866 -16648 -10385 -3316 1709 -3290
3173 -3290 -7423 -7416 -5677 -9084 -7994 -3571 1775 3514 2204 7023 5953 1381 -3453 -4264 -6295 -12349
$$ packed form
3281A3251p030l481k51R64l3m553n830j687M663R01N968J647n504J743j488n788
3265f508K256O685M675M166n989k628n62o856n648N135j372N090R710j643o302
3250B09o205p13M390M614M971J934n564o644n59l309L054J502m535m869N7L603
3234h064l679N83J650q960j651J0307K223Q529l23j688k283l630K904J657j941
3219d366M579J493k371j562k447K434j054L854L890j487n21n334m733k271K139
3204g757L240K716J770m356K58K69Q381L458k725m022p200Q58Q373N325L17L96
3188I301l999m820j312j27j718J276L274q041p197l503K18O263P069N025m999
3173c290m133PJ739l407J090M423N346J739j310M819j070m572m834q11k031o054
$$ plain form
3157 -12349 -11888 -7162 -5401 -298 2473 -3184 -7856 -16093 -13168 -12534 -11354 -13161 -17888 -14807 -7187
3142 -7187 -5808 -10497 -7506 -2646 -1098 881 -1513 -7344 -10330 -8588 -5227 -873 -4327 -10325 -6560
3127 -6560 -1656 6372 4696 2760 -3579 -4197 -247 1588 3940 -838 -8834 -4342 -4681 -8695 -10093
3112 -10093 -3312 716 -3586 -215 395 -770 343 9014 11856 7600 409 -3797 -4790 -7588 -3826
3097 -3826 3118 1939 -708 -1406 -1138 144 2325 4445 8541 14882 15650 4281 -4324 -7404 -5449
3082 -5449 -3770 -2407 7515 9195 5105 1391 -994 -1881 -5202 -1340 6959 7065 5231 3426 8993
3067 8993 13075 5977 -450 -351 -1170 -1645 -227 -82 1010 3193 4672 6544 8516 6538 5633 2125
3051 2125 3894 3691 4094 -93 -9018 -5624 -3783 -3109 -6380 -2446 240 4951 5567 -4949 -2159 6998
$$ packed form
3157a2349M61M726J761N103K771n657m672q237K925O34J180j807m727L081P620
3142g187J379m689K991M860J548J979k394n831k986J742L361M354l454n998L765
3127f560M904Q028j676j936o339o18L950J835K352m778p996M492l39m014j398
3112a0093O781M028m302L371O10j165J113Q671K842m256p191m206r93k798L762
3097c826O944j179k647o98K68J282K181K120M096O341P68j1369q605l080J955
3082e449J679J363R922J680m090l714k385q87l321L862Q299J06j834j805N567
3067H993M082p098o427R9q19m75J418J45J092K183J479J872J972j978r05l508
3051B125J769k03M03m187q925L394J841O74l271L934K686M711O16j0516K790R157
$$ plain form
3035 6998 3426 -6309 -10415 -15597 -6415 -1417 -6205 -10174 -8975 -2023 -2061 -3683 -1373 883 -4476
3020 -4476 -5902 -7589 -10856 -8554 -10146 -10605 -1653 -1729 -8417 -13690 -11551 -6257 1216 9914 9526 8516
3004 8516 9939 9698 4088 3047 1336 -178 2527 1306 4470 4194 5868 212 -8857 -8657 -2057 -259
2988 -259 1706 1897 4355 12021 15365 16537 11992 971 -4141 -7948 -5714 -5616 -5172 -4242 -883 2988
2972 2988 -747 -8094 -12616 -6513 -5605 -14592 -14713 -14045 -8897 -3703 598 7529 5214 -4514 -11338 -8862
2956 -8862 -1901 -594 -5614 -7174 -6653 -4026 -1749 -3723 -3390 3806 6104 7269 -2500 -8728 -10420
2941 -10420 -5277 -10011 -14751 -8447 -3138 -9081 -19423 -10176 -8429 -6349 -11043 -10667 -9691 -8280 -9411
2926 -9411 -11562 -1857 6326 -3586 -2288 1815 9115 7251 12673 10125 3223 151 2999 3751 2990
$$ packed form
3035F998l572r735m106n182R182M998m788l969J199O952l8j622K310K256n359
3020d476j426j687l267K302j592m59Q952p6o688n273K139N294P473Q698l88j010
3004H516J423k41n610j041j711j514K705j221L164k76J674n656r069K00O600J798
2988b59J965J91K458P666L344J172m545j1021n112l807K234R8M44R30L359L871
2972B988l735p347m522O103R08q987j21O68N148N194M301O931k315r728o824K476
2956h862O961J307n020j560N21K627K277j974L33P196K298J165r769o228j692
2941a0420N143m734m740O304N309n943j0342R247J747K080m694L76R76J411j131
2926i411k151R705Q183r912J298M103P300j864N422k548o902l072K848P52p61
$$ plain form
2911 2990 -3920 3379 6874 1987 -1659 -214 -2809 -942 -1593 -12864 -14939 -6734 -1565 -89 2257
2896 2257 3591 7311 3297 911 311 -4132 -5880 -2983 6930 9304 3821 -3030 -11475 -9337 -2990
2881 -2990 3248 -2064 -5765 -4502 -3190 -3061 1925 1011 -3182 2083 7291 8750 8585 10212 7765 3073
2865 3073 998 3303 2816 -2651 -676 5200 5165 570 -2442 -2346 -5526 -3718 -6033 -4889 -4386 -1243
2849 -1243 1099 -1112 -344 -3691 -6530 -8168 -492 5247 3180 -2726 -7775 -7193 -6814 -6583 -4874 -9036
2833 -9036 -7042 269 -2268 -7473 -1128 6004 -267 -6468 -4394 4995 7894 4176 5457 10623 10774
2818 10774 3040 -181 1342 -2163 -7188 -5086 -1688 -7577 -11146 -4925 -720 138 113 693 801 4261
2802 4261 4901 7979 3239 -5897 -7871 -153 6928 6609 6016 1364 -3671 -8024 -11183 -12388 -5190 -1862
$$ packed form
2911B990o910P299L495m887l646J445k595J867o51j1271k075Q205N169J476K346
2896B257J334L720m014k386o00m443j748K897R913K374n483o851q445K138O347
2881b990O238n312l701J263J312J29M986r14m193N265N208J459j65J627k447m692
2865C073k075K305m87n467J975N876l5m595l012R6l180J808k315J144N03L143
2849a243K342k211P68l347k839j638P676N739k067n906n049N82L79K31J709m162
2833i036J994P311k537n205O345P132o271o201K074R389K899l718J281N166J51
2818A0774p734l221J523l505n025K102L398n889l569O221M205Q58k5N80J08L460
2802D261O40L078m740r136j974P718P081l19n93m652n035m353l159j205P198L328
$$ plain form
2786 -1862 -2046 -438 -1061 -8533 -8854 -11485 -6746 710 2480 6004 2386 -3096 2181 350 -4889 -11548
2770 -11548 -15060 -9599 -2716 -1810 258 -1791 2027 7150 5710 1224 -560 -1425 -4604 -7352 -9464
2755 -9464 -15794 -16398 -12244 -6236 -5310 -3673 -3464 -4216 -4048 -2305 -2979 -5297 -4595 -4721 -3419 -4924 -1098
2738 -1098 -5259 -18545 -16142 -2820 1583 -2137 2575 4010 6265 7859 3880 1197 5593 13549
2724 13549 16971 13763 12650 7358 5313 -1088 2482 6613 6953 6682 6252 2939 -5259 -4819 -7415 -5652
2708 -5652 -2365 -938 -6042 -5290 -6939 -1095 2332 4946 2914 2622 -4418 -10422 -7782 23 -1040
2693 -1040 3031 5664 2529 -5206 -4799 5949 6927 5770 2102 -1298 -4272 -5279 -2099 -5338 -4509
2678 -4509 -1950 -3721 -1658 -6552 -3028 -411 -2723 -3285 -4342 -10239 -10497 -8318 1514 6811 -4639
$$ packed form
2786a862j84J608o23p472l21k631M739P456J770L524l618n482N277j831n239o659
2770a1548l512N461O883R06K068k049L818N123j440m486j784q65l179k748k112
2755i464o330o04M154O008R26J637K09p52J68J743o74k318P02j26J302j505L826
2738a098m161j3286K403J3322M403l720M712J435K255J594l979k683M396P956
2724A3549L422l208j113n292k045o401L570M131L40k71m30l313q198M40k596J763
2708e652L287J427n104P52j649N844L427K614k032k92p040o004K640P805j063
2693a040M071K633l135p735M07J0748R78j157l668l400k974j007L180l239Q29
2678d509K559j771K063m894L524K617k312n62j057n897k58K179R832N297j1450
$$ plain form
2663 -4639 -6544 -1580 -4029 -4295 -4868 -2107 2664 -316 -8526 -17718 -17575 -8290 -4552 -8527 -12185 -10570
2647 -10570 -9270 -780 6331 5135 5546 3707 4891 3663 19 -4651 -5008 -2529 2510 2075 1352 3169
2631 3169 8019 2350 5192 7253 2576 -8710 -7682 -6218 -1203 -319 2153 4015 8545 16353 14596
2616 14596 10892 6492 -968 2803 4878 510 -5747 -1750 6105 4085 -631 -1445 6203 12261 7892
2601 7892 11665 12334 13668 13055 13596 6023 4451 1989 -3343 -6469 -8729 -1566 -1029 138 -2929 -8510
2585 -8510 -5806 -13711 -19205 -15033 -3391 -8445 -16890 -11421 -14859 -12026 -8495 -12774 -14376 -12129 -7922
2570 -7922 -5754 -4494 -154 -2615 -7436 -7361 -901 6277 14302 14250 3517 -3302 -8348 -6823 -5234 -5696
2554 -5696 -4435 -5065 -6471 -5089 -4731 -4220 -5968 -5423 -932 690 -1018 -316 -445 6481 7808 8578 5136
$$ packed form
2663d639j905M964k449k66n73K761M771k980q210r192J43R285L738l975l658J615
2647a0570J300Q490P111j196M11j839J184j228l644m670l57K479N039m35p23J817
2631C169M850n669K842K061m677j1286J028J464N015Q84K472J862M530P808j757
2616A4596l704m400p460L771K075m368o257L997P855k020m716q14P648O058m369
2601G892L773O69J334o13N41p573j572k462n332l126k260P163N37J167l067n581
2585h510K704p905n494M172J1642n054q445N469l438K833L531m279j602K247M207
2570g922K168J260M340k461m821P5O460P178Q025n2j0733o819n046J525J589m62
2554e696J261o30j406J382L58N11j748N45M491J622j708P02j29O926J327P70l442
$$ plain form
2537 5136 -5219 -2243 7001 8481 8028 11507 8806 3951 707 1603 6900 3269 -1344 -1093 -794 262
2521 262 2939 8142 8923 5833 4578 3697 1970 -5131 -5185 -6417 -4737 -1838 -8901 -5815 -1166 -2907
2505 -2907 1031 -1139 -14378 -16870 -12878 -10537 -7930 -8014 -8201 -1371 3351 5388 4446 -1917 2509 4470
2489 4470 3961 140 5446 9137 3217 -2057 -5198 -8758 -2726 -4254 -1040 2135 3172 6240 8492
2474 8492 7181 6482 4510 6799 11983 5321 2996 -146 -884 1706 5420 4635 -3323 -4641 -776 4809
2458 4809 1969 7624 17711 15294 10981 4137 7928 9738 524 -6721 -6976 -5264 -10758 -12924 -7788
2443 -7788 1805 1987 -3673 3063 9769 330 -3017 966 2409 5308 8870 10387 3511 332 -2443
2428 -2443 -4641 -8457 -11230 -15129 -13091 -8050 -5225 20 5236 7152 6154 5876 4438 6153 7702
$$ packed form
2537E136j0355K976R244J480m53L479k701m855l244Q96N297l631m613K51K99J056
2521B62K677N203P81l090j255q81j727p101n4j232J680K899p063L086M649j741
2505b907L938k170j3239k492L992K341K607q4j87O830M722K037r42o363M426J961
2489D470n09l821N306L691n920n274l141l560O032j528L214L175J037L068K252
2474H492j311o99j972K289N184o662k325l142p38K590L714p85p958j318L865N585
2458D809k840N655J0087k417m313o844L791J810r214p245k55J712n494k166N136
2443g788R593J82n660O736O706r439l347L983J443K899L562J517o876l179k775
2428b443k198l816k773l899K038N041K825N245N216J916r98k78j438J715J549
$$ plain form
2413 7702 3350 -454 -1555 756 -1862 1120 2940 9101 10814 10951 10859 5525 1061 3258 -1957 -958
2397 -958 -1667 -6686 549 3088 2011 2104 9629 7949 2681 642 -263 512 4413 -3765 -8686 -1322
2381 -1322 2703 2465 -2606 -4452 -9518 -13443 -9829 -7111 -9698 -3341 2838 2176 3736 1329 8340
2366 8340 12005 2058 -4643 -7416 -5490 -8015 -7335 113 2828 5990 6097 1655 2708 6271 6769 8503
2350 8503 8106 1098 -1324 -4811 -8335 -8968 -7861 -7276 -5884 -860 6796 10239 4653 553 3476 3663
2334 3663 4050 842 -6204 -12121 -13534 -13587 -7009 -2982 -1529 2980 -253 139 -998 -7987 -9416 -3968
2318 -3968 -3757 3084 -2053 -3156 -2604 -370 1256 1147 -7411 -11053 -10571 -9475 -5156 -1894 -3253 4541
2302 4541 13234 2092 685 4136 10999 11202 1362 -8519 -9657 -10959 -13526 -15878 -15196 -12418 -5849
$$ packed form
2413G702m352l804j101K311k618K982J820O161J713J37r2n334m464K197n215R99
2397i58p09n019P235K539j077R3P525j680n268k039r05P75L901q178m921P364
2381a322M025k38n071j846n066l925L614K718k587O357O179o62J560k407P011
2366H340L665r947o701k773J926k525O80P448K715L162J07m442J053L563M98J734
2350H503l97p008k422l487l524o33J107N85J392N024P656L443n586m100K923J87
2334C663L87l208p046n917j413n3O578M027J453M509l233L92j137o989j429N448
2318c968K11O841n137j103N52K234J626j09q558l642M82J096M319L262j359P794
2302D541Q693j1142j407L451O863K03r840r881j138j302k567k352O82K778O569
$$ plain form
2287 -5849 -8363 -9403 -5964 2512 10185 6691 6268 7844 7114 3871 6026 7833 10161 5099 3384
2272 3384 -4889 -8260 -3856 -6172 -10460 -5864 -232 -6339 -4758 -1692 -1705 8481 3308 -5447 -4949
2257 -4949 -5099 -6208 3628 10066 8119 4867 1950 -3409 -2150 -4155 -3384 4101 4533 523 -6054 -4935
2241 -4935 -2379 950 6863 9636 7152 2767 -825 -4599 -6500 -5596 -2315 -1678 1544 821 -3980 -5510
2225 -5510 -314 2132 866 -2502 -1872 -447 -1548 -6025 235 551 -4383 -8257 -6034 -1915 -6088
2210 -6088 -7986 -2433 2150 919 -3084 902 6230 7673 6031 3204 4104 255 4807 5995 12013
2195 12013 6136 3226 -297 -2734 -10811 -6808 -1261 -2623 550 -1959 4513 -233 -1064 -1576 -1747
2180 -1747 1706 2526 1147 -3050 -6733 1650 -154 -2575 -2297 41 -1100 2700 2624 -4462 -6815 -4288
$$ packed form
2287e849k514j040L439Q476P673l494m23J576p30l243K155J807K328n062j715
2272C384q273l371M404k316m288M596N632o107J581L066j3J0186n173q755M98
2257d949j50j109R836O438j947l252k917n359J259k005P71P485M32m010o577J119
2241d935K556L329N913K773k484m385l592l774j901R04L281O37L222p23m801j530
2225e510N196K446j266l368O30J425j101m477O260L16m934l874K223M119m173
2210f088j898N553M583j231m003L986N328J443j642k827R00l849M552J188O018
2195A2013n877k910l523k437q077M003N547j362L173k509O472m746q31n12j71
2180a747L453Q20j379m197l683Q383j804k421K78K338j141L800p6p086k353K527
$$ plain form
2164 -4288 2477 9708 6006 3909 5562 9581 9122 2060 2159 2901 3748 -3391 -3675 -1842 -19 6929
2148 6929 14713 12278 8017 4072 5558 1374 -4659 2978 6659 1793 -5946 -9262 -15729 -16633 -17443
2133 -17443 -13539 -15500 -16038 -10190 -7149 -932 1889 592 -4979 -2277 -246 2298 1174 653 -56
2118 -56 3234 8218 7169 7209 3715 -3700 -1099 937 -2316 -2663 -6553 -19676 -15792 -10751 -13577 -5143
2102 -5143 -1338 2381 1399 -3816 -1552 -1292 -5502 -5337 -7588 -500 5477 6104 8967 6881 3169 1433
2086 1433 3190 5859 5996 4195 2235 3050 -2140 -4199 -4121 1627 4338 1033 -2913 -4444 -6654 -4589
2070 -4589 -5205 -11756 -15829 -8377 -155 4918 11948 2143 -1661 2220 28 4622 4803 5086 4615 5567
2054 5567 3114 -4701 -3164 4136 7204 11870 18413 25441 26809 20707 9866 -1021 -6162 -1022
$$ packed form
2164d288O765P231l702k097J653M019m59p062R9P42Q47p139k84J833J823O948
2148F929P784k435m261l945J486m184o033P637L681m866p739l316o467r04q10
2133a7443L904j961n38N848L041O217K821j297n571K702K031K544j124n21p09
2118e6L290M984j049M0l494p415K601K036l253l47l890j3123L884N041k826Q434
2102e143L805L719r82n215K264K60m210J65k251P088N977O27K863k086l712j736
2086A433J757K669J37j801j960Q15n190k059P8N748K711l305l946j531k210K065
2070d589o16o551m073P452Q222N073P030r805l804L881k192M594J81K83m71R52
2054E567k453p815J537P300L068M666O543P028J368o102j0841j0887n141N140
$$ plain form
2040 -1022 500 -1448 -5344 -2720 3912 6063 632 -159 -3997 -814 -4072 -9231 -12066 -12556 -12038 -16498
2024 -16498 -9698 234 -4529 -4162 2154 6979 4905 4271 3517 9275 7488 4026 63 598 1556 84
2008 84 -8103 -17240 -17676 -9564 4445 3584 1814 39 -2546 -4524 -2512 2642 -7582 -5140 2838
1993 2838 3135 5148 2438 7655 8824 -4424 -6243 5794 9368 6211 2882 4784 6200 610 -3023
1978 -3023 4833 10896 9761 8305 2896 -514 -2975 -1024 -1922 3611 3161 -1701 -3485 2467 4100
1963 4100 441 -6981 -7024 -7001 -5125 -6701 -2901 -417 -1618 -340 1773 703 949 -232 -4811 -10344
1947 -10344 -13691 -10870 -3325 743 9359 10822 10475 4347 -1599 5526 4909 4361 -1404 -5437 3193
1932 3193 7059 4186 8344 9064 5460 7571 11082 10484 3353 968 2164 6797 -1898 -3596 -4697
$$ packed form
2040a022J522j948l896K624O632K151n431p91l838L183l258n159k835m90N18m460
2024a6498O800R932m763L67O316M825k074o34p54N758j787l462l963N35R58j472
2008H4q187r137m36Q112J4009q61j770j775k585j978K012N154j0224K442P978
1993B838K97K013k710N217J169j3248j819J2037L574l157l329J902J416n590l633
1978c023P856O063j135j456n409l410k461J951q98N533m50m862j784N952J633
1963D100l659p422m3K3J876j576L800K484j201J278K113j070K46j181m579n533
1947a0344l347K821P545M068Q616J463l47o128n946P125o17n48n765m033Q630
1932C193L866k873M158P20l604K111L511n98p131k385J196M633q695j698j101
$$ plain form
1917 -4697 -6999 -10415 -9792 -4342 -1930 -5179 -7589 -12038 -6833 -4017 1501 7797 10394 -3723 -702
1902 -702 7612 5370 920 780 -214 -5158 -91 3163 1572 2349 4229 562 -655 -1856 -5858 -6629
1886 -6629 -8746 -8258 -4549 -2106 2696 1732 -2280 -1932 3859 4939 2188 -855 -4803 -6318 -2742 5414
1870 5414 10712 8704 1000 1527 435 -2108 279 -5371 -6505 -6152 -9050 -6021 -5674 -5821 -3691 236
1854 236 2887 9177 5661 -1468 -1450 -7367 -3463 2706 4220 -226 -3135 9105 18209 15646 12651
1839 12651 10715 8825 9775 4631 -2238 -2485 -2072 -5383 -4165 -5824 -7619 -9242 -4538 -2084 3544
1824 3544 5792 4134 4072 2207 3468 -3401 -4641 -8495 -12086 -15741 -12185 -12098 -11148 -6973 -9591 -11048
1808 -11048 -14490 -14811 -9686 -2451 654 4800 2788 4921 -263 -9873 -9972 -2607 4683 6424 518
$$ packed form
1917d697k302l416O23N450K412l249k410m449N205K816N518O296K597j4117L021
1902g02Q314k242m450j40r94m944N067L254j591P77J880l667j217j201m002p71
1886f629k117M88L709K443M802r64m012L48N791J080k751l043l948j515L576Q156
1870E414N298k008p704N27j092k543K387n650j134L53k898L029L47j47K130L927
1854B36K651O290l516p129J8n917L904O169J514m446k909J2240R104k563k995
1839A2651j936j890R50n144o869k47M13l311J218j659j795j623M704K454N628
1824C544K248j658o2j865J261o869j240l854l591l655L556Q7R50M175k618j457
1808a1048l442l21N125P235L105M146k012K133n184r610r9P365P290J741n906
$$ plain form
1793 518 -1004 1631 4250 3824 3407 7169 8055 -405 -7793 -9822 -5276 187 220 -4597 -3284 -6037
1777 -6037 37 2090 -1568 -9706 -5885 1106 3331 913 1555 -964 -6880 -4303 -1346 3018 634
1762 634 116 -1441 -2164 -5763 484 8743 10484 10284 6407 2598 -1311 -4205 -7514 -14813 -16337 -11625
1746 -11625 -2709 -4510 -3678 -3578 4590 10442 4458 931 -5923 -17920 -14283 -8585 -9346 -8680 -12173
1731 -12173 -8870 -3856 -8811 -17950 -16049 -12304 -7054 -4768 -9041 -1654 2471 2819 4293 6567 6703
1716 6703 9764 11602 6980 350 -3089 5633 14967 12181 4898 804 -5774 -2131 -351 -133 -4664
1701 -4664 -6339 -10620 -9551 -14984 -15952 -10528 -2874 3724 477 -532 4293 8536 10952 4495 1499
1686 1499 -192 2144 2732 -2652 -7250 -4326 1535 -1978 -10623 -14724 -7721 8350 15188 7439 1506
$$ packed form
1793E18j522K635K619m26m17L762Q86q460p388k029M546N463L3m817J313k753
1777f037O074K053l658q138L821O991K225k418O42k519n916K577K957M364k384
1762F34n18j557p23l599O247Q259J741k00l877l809l909k894l309p299j524M712
1746a1625Q916j801Q32J00Q168N852n984l527o854j1997L637N698p61O66l493
1731a2173L303N014m955r139J901L745N250K286m273P387M125L48J474K274J36
1716F703L061J838m622o630l439Q722R334k786p283m094o578L643J780K18m531
1701d664j675m281J069n433r68N424P654O598l247j009M825M243K416o457k996
1686A499j691K336N88n384m598K924N861l513q645m101P003J6071O838p749n933
$$ plain form
1671 1506 -1491 -1471 351 1535 3410 7255 5116 3897 1710 5921 7320 3491 2323 -1123 1671
1656 1671 10080 11002 12125 19270 16904 12613 11596 1568 -3326 3185 6448 9696 9447 1741 611
1641 611 -391 -631 4403 5878 4923 1628 3986 7824 7958 10092 22081 20832 11646 4359 -908 -9656
$$ packed form
1671A506k997K0J822J184J875L845k139j219k187M211J399l829j168l446K794
1656A671Q409R22J123P145k366m291j017j0028m894O511L263L248k49p706j130
1641F11j002k40N034J475r55l295K358L838J34K134J1989j249r186p287n267q748
$$ [...]
##END NTUPLES=NMR SPECTRUM
##END=
