##TITLE=Analysis number 326610
Compound Code cc 36526
Book Reference 518/77
Project Code adrs
Chemist Name colinb
##JCAMPDX= 6.0         $$ Bruker NMR JCAMP-DX V2.0
##DATA TYPE= NMR SPECTRUM
##DATA CLASS= NTUPLES
##ORIGIN= Bruker BioSpin GmbH
##OWNER= nmr
$$ XWIN-NMR		Version 3.5
$$ Thu Feb 15 11:15:34 2007 GMT Standard Time (UT+0h)  MAYBRIDGE\nmr@NMR_250MHZ
##.OBSERVE FREQUENCY= 250.131544655141
##.OBSERVE NUCLEUS= ^1H
##.ACQUISITION MODE= SIMULTANEOUS (DQD)
##.ACQUISITION SCHEME= undefined
##.AVERAGES= 16
##.DIGITISER RES= 18
##SPECTROMETER/DATA SYSTEM= dpx250
##.PULSE SEQUENCE= zg30
##.SOLVENT NAME= CDCl3
##.SHIFT REFERENCE= (INTERNAL, CDCl3, 0, 16.522)
##AUDIT TRAIL= $$ (NUMBER, WHEN, WHO, WHERE, WHAT)
$$ ##TITLE= Audit trail, XWIN-NMR		Version 3.5
$$ ##JCAMPDX= 5.01
$$ ##ORIGIN= Bruker BioSpin GmbH
$$ ##OWNER= nmr
$$ C:\u/data/dgb/nmr/ADRS/960/pdata/1/auditp.txt
$$ ##AUDIT TRAIL=  $$ (NUMBER, WHEN, WHO, WHERE, WHAT)
(   1,<2007-02-15 11:15:11.11 +000>,<MAYBRIDGE\nmr>,<NMR_250MHZ>,
      <created by zg, POWCHK disabled, PULCHK disabled
       configuration hash MD5:
       49 4B E0 1D 92 C2 6B 37 9F E6 65 BC 52 41 86 1D
       data hash MD5: 64K
       CA 9E F7 C6 86 D2 17 F8 FA E5 5A 10 F9 4B 7E 33>)
(   2,<2007-02-15 11:15:24.27 +000>,<MAYBRIDGE\nmr>,<NMR_250MHZ>,
      <Start of raw data processing
       ef LB = 0.3 FT_mod = 6 PKNL = 1 SI = 32K 
       data hash MD5: 32K
       61 5E 09 2C 89 99 70 E4 36 A6 C6 12 5A 10 5A 0B>)
(   3,<2007-02-15 11:15:26.04 +000>,<MAYBRIDGE\nmr>,<NMR_250MHZ>,
      <apk 
       data hash MD5: 32K
       85 E0 66 C4 A8 2A 7F 36 AB EF D7 33 52 F8 67 9C>)
(   4,<2007-02-15 11:15:26.74 +000>,<MAYBRIDGE\nmr>,<NMR_250MHZ>,
      <abs ABSG = 5 
       data hash MD5: 32K
       AC C4 75 3B 0D 3E 8D 48 60 00 02 91 86 2C 64 0D>)
$$ ##END=
$$ 
$$ hash MD5
$$ 55 AC 90 98 19 8E 4D 95 52 55 F3 F8 52 5E 38 06
##$RELAX= 
##$RELAX= 
##$RELAX= 
##$RELAX= 
##$RELAX= 
##$RELAX= 
##$RELAX= 
$$ Bruker specific parameters
$$ --------------------------
##$DU= <C:\u>
##$EXPNO= 960
##$NAME= <ADRS>
##$PROCNO= 1
##$TYPE= <nmr>
##$USER= <dgb>
##$AMP= (0..31)
100 100 100 100 100 100 100 100 100 100 100 100 100 100 100 100 100 100 
100 100 100 100 100 100 100 100 100 100 100 100 100 100 
##$AQSEQ= 0
##$AQ_mod= 3
##$AUNM= <au_zg>
##$AUTOPOS= <37 >
##$BF1= 250.13
##$BF2= 250.13
##$BF3= 250.13
##$BF4= 250.13
##$BF5= 500.13
##$BF6= 500.13
##$BF7= 500.13
##$BF8= 500.13
##$BYTORDA= 1
##$CFDGTYP= 0
##$CFRGTYP= 5
##$CHEMSTR= <none>
##$CNST= (0..31)
1 1 145 1 1 1 1 1 1 1 1 1 1 1 1 1 1 1 1 1 1 1 1 1 1 1 1 1 1 1 1 1 
##$CPDPRG= <>
##$CPDPRG1= <>
##$CPDPRG2= <>
##$CPDPRG3= <>
##$CPDPRG4= <mlev>
##$CPDPRG5= <mlev>
##$CPDPRG6= <mlev>
##$CPDPRG7= <mlev>
##$CPDPRG8= <mlev>
##$CPDPRGB= <>
##$CPDPRGT= <>
##$D= (0..31)
0 1 0 0 0 0 0 0 0 0.06 0 0 0 0 0 0 0.0002 0 0 0 0 0 0 0 0 0 0 0 0 0 0 
0 
##$DATE= 1171538110
##$DBL= (0..7)
120 120 120 120 120 120 120 120 
##$DBP= (0..7)
150 150 150 150 150 150 150 150 
##$DBP07= 0
##$DBPNAM0= <>
##$DBPNAM1= <>
$$ [...]
##$SUBNAM7= <"">
##$SUBNAM8= <"">
##$SUBNAM9= <"">
##$SW= 20.6930455092707
##$SWIBOX= (0..15)
0 0 3 0 0 0 0 0 0 0 0 0 0 0 0 0 
##$SW_h= 5175.983436853
##$TD= 65536
##$TD0= 1
##$TE= 295.16
##$TE2= 300
##$TE3= 300
##$TEG= 300
##$TL= (0..7)
0 120 120 120 120 120 120 120 
##$TP= (0..7)
150 150 150 150 150 150 150 150 
##$TP07= 0
##$TPNAME0= <>
##$TPNAME1= <>
##$TPNAME2= <>
##$TPNAME3= <>
##$TPNAME4= <>
##$TPNAME5= <>
##$TPNAME6= <>
##$TPNAME7= <>
##$TPOAL= (0..7)
0.5 0.5 0.5 0.5 0.5 0.5 0.5 0.5 
##$TPOFFS= (0..7)
0 0 0 0 0 0 0 0 
##$TUNHIN= 0
##$TUNHOUT= 0
##$TUNXOUT= 0
##$USERA1= <user>
##$USERA2= <user>
##$USERA3= <user>
##$USERA4= <user>
##$USERA5= <user>
##$V9= 5
##$VALIST= <valist>
##$VCLIST= <CCCCCCCCCCCCCCC>
##$VD= 0
##$VDLIST= <DDDDDDDDDDDDDDD>
##$VPLIST= <PPPPPPPPPPPPPPP>
##$VTLIST= <TTTTTTTTTTTTTTT>
##$WBST= 1024
##$WBSW= 4
##$XGAIN= (0..3)
0 0 0 0 
##$XL= 0
##$YL= 0
##$YMAX_a= 253391
##$YMIN_a= -302842
##$ZGOPTNS= <>
##$ZL1= 120
##$ZL2= 120
##$ZL3= 120
##$ZL4= 120
##$ABSF1= 16.522
##$ABSF2= -4.171173
##$ABSG= 5
##$ABSL= 3
##$ALPHA= 0
##$AQORDER= 0
##$ASSFAC= 0
##$ASSFACI= 0
##$ASSFACX= 0
##$ASSWID= 0
##$AUNMP= <proc_1d>
##$AZFE= 0.1
##$AZFW= 0.1
##$BCFW= 0
##$BC_mod= 0
##$BYTORDP= 0
##$COROFFS= 0
##$CY= 12.5
##$DATMOD= 1
##$DC= 0
##$DFILT= <>
##$DTYPP= 0
##$F1P= 14.0000005364418
##$F2P= -0.99999901652339
##$FCOR= 0.5
##$FTSIZE= 32768
##$FT_mod= 6
##$GAMMA= 0
##$GB= 0
##$INTBC= 1
##$INTSCL= 1
##$ISEN= 128
##$LB= 0.3
##$LEV0= 0
##$LPBIN= 0
##$MAXI= 10000
##$MC2= 0
##$MEAN= 0
##$ME_mod= 0
##$MI= 0
##$NCOEF= 0
##$NC_proc= -5
##$NLEV= 6
##$NOISF1= 0
##$NOISF2= 0
##$NSP= 0
##$NTH_PI= 0
##$NZP= 0
##$OFFSET= 16.522
##$PC= 1
##$PHC0= 222.0567
##$PHC1= 30.85385
##$PH_mod= 1
##$PKNL= yes
##$PPARMOD= 0
##$PSCAL= 4
##$PSIGN= 0
##$REVERSE= no
##$SF= 250.13
##$SI= 32768
##$SIGF1= 0
##$SIGF2= 0
##$SINO= 400
##$SIOLD= 32768
##$SREGLST= <1H.CDCl3>
##$SSB= 0
##$STSI= 32768
##$STSR= 0
##$SW_p= 5175.98343685301
##$SYMM= 0
##$S_DEV= 0
##$TDeff= 65536
##$TDoff= 0
##$TI= <Analysis number 999999
Compound Code 99
Book Reference 9
Project Code 9>
##$TILT= no
##$TM1= 0
##$TM2= 0
##$TOPLEV= 0
##$USERP1= <user>
##$USERP2= <user>
##$USERP3= <user>
##$USERP4= <user>
##$USERP5= <user>
##$WDW= 1
##$XDIM= 32768
##$YMAX_p= 452236335
##$YMIN_p= -731677
$$ End of Bruker specific parameters
$$ ---------------------------------
##NTUPLES= NMR SPECTRUM
##VAR_NAME=  FREQUENCY,     SPECTRUM/REAL,   SPECTRUM/IMAG
##SYMBOL=    X,             R,               I
##VAR_TYPE=  INDEPENDENT,   DEPENDENT,       DEPENDENT
##VAR_FORM=  AFFN,          ASDF,            ASDF
##VAR_DIM=   32768,         32768,           32768
##UNITS=     HZ,            ARBITRARY UNITS, ARBITRARY UNITS
##FACTOR=    0.157963299565203, 1,           1
##FIRST=     4132.6476996994, 0,             0
##LAST=      -1043.33573715361, 0,           0
##MIN=       -1043.33573715361, -731677,     0
##MAX=       4132.6476996994, 452236335,     0
$$ Real data points
##PAGE= N=1
##DATA TABLE= (X++(R..R)), XYDATA
$$ [...]
$$ plain form
23169 12159 -92783 -18054 -111462 -273673 -266336 -27023 -60032 41708 210207 227806 -61411
23158 -61411 -166715 23747 96270 238818 306924 189398 135222 180069 164710 89470 -38847
23147 -38847 -45075 47702 53159 18287 76668 211174 201170 -5148 -56021 26981 88092 23602
23135 23602 -116685 -201368 -112364 -82588 56209 15461 -163195 -132316 -35051 -36736 127448
23124 127448 255846 288112 194433 127527 20277 -45321 -95795 -123605 -20741 -161656 -337072
23113 -337072 -315853 -250856 -224144 -29732 15542 -212735 -248339 -191274 -75093 -31878 -173662
23102 -173662 -202805 -166819 -242169 -178814 -51283 9094 49771 197033 104038 70348 -13293
23091 -13293 -97095 -138665 -169431 -81450 -143216 -165622 -45680 -15698 -245600 -138345 -25935
$$ packed form
23169A2159j04942P4729r3408j62211P337K39313l3009J01740J68499J7599k89217
23158f1411j05304J90462P2523J42548O8106j17526n4176M4847j5359p5240j28317
23147c8847o228R2777N457l4872N8381J34506j0004k06318n0873Q3002O1111o4490
23135B3602j40287q4683Q9004K9776J38797m0748j78656L0879R7265j685J64184
23124A27448J28398L2266r3679o6906j07250o5598n0474k7810J02864j40915j75416
23113c37072K1219O4997K6712J94412M5274k28277l5604N7065J16181M3215j41784
23102a73662k9143L5986p5350O3355J27531O0377M0677J47262r2995l3690q3641
23091a3293q3802m1570l0766Q7981o1766k2406J19942K9982k29902J07255J12410
$$ plain form
23080 -25935 31201 29021 -102832 -124190 71499 96063 59258 -26102 37456 10607 136739
23069 136739 325838 351903 350494 325777 217267 188836 161620 46019 -80120 -114411 -232079
23058 -232079 -282552 -142333 -52658 7268 -117276 -74340 -5305 36226 44045 16636 -65224
23047 -65224 -11105 348 33287 27844 -135883 -202220 -232220 -216828 -146082 24369 61671
23036 61671 77167 33190 -38881 -35973 -898 -59906 -81622 150748 224425 187580 29363
23025 29363 82015 152978 3040 -145941 -284987 -226106 -99114 -16021 37569 195234 91124
23014 91124 -66536 -88161 7430 -150687 -166791 -85912 -166830 -91698 -97549 -78304 -110375
23003 -110375 -108558 6460 61951 75212 -59113 -27657 38818 107718 231275 376362 323671
$$ packed form
23080b5935N7136k180j31853k1358J95689K4564l6805q5360O3558k6849J26132
23069A36739J89099K6065j409k4717j08510k8431k7216j15601j26139l4291j17668
23058b32079n0473J40219Q9675N9926j24544M2936O9035M1531P819k7409q1860
23047f5224N4119J1453L2939n443j63727o6337l0000J5392P0746J70451L7302
23036F1671J5496m3977p2071K908L5075n9008k1716K32370P3677l6845j58217
23025B9363N2652P0963j49938j48981j39046N8881J26992Q3093N3590J57665j04110
23014I1124j57660k1625R5591j58117j6104Q0879q0918P5132n851J9245l2071
23003a10375J817J15018N5491J3261j34325L1456O6475O8900J23557J45087n2691
$$ plain form
22992 323671 191100 5384 119834 290308 299106 294529 225885 207190 233212 95830 -39768
22981 -39768 -76113 -138538 -47831 32110 -38142 -84932 -105302 -97237 -15290 -23028 -68748 -17070
22969 -17070 159544 292758 285658 242254 297125 294661 262087 156264 170411 218957 127838
22958 127838 -113012 -220981 -87816 -84189 -37216 -58719 -93297 -146710 -70688 68266 28869
22947 28869 -37617 -142962 -120582 -21494 127520 1326 -89909 26595 27109 18715 -48675
22936 -48675 -27842 2470 -11314 -131703 -150327 -16646 -47603 -184480 -321386 -227111 -151725
22925 -151725 43369 151839 127559 35441 -205059 -218122 -49597 -12464 34285 107383 72630
22914 72630 81553 91695 59780 13333 -6187 74764 208791 291486 174987 70389 43282
$$ packed form
22992C23671j32571j85716J14450J70474Q798m577o8644j8695K6022j37382j35598
22981c9768l6345o2425R0707P9941p0252m6790k0370Q065Q1947p738m5720N1678
22969a7070J76614J33214p100m3404N4871k464l2574j05823J4147M8546r1119
22958A27838k40850j07969J33165L627M6973k1503l4578n3413P6022J38954l9397
22947B8869o6486j05345K2380R9088J49014j26194r1235J16504N14q394o7390
22936d8675K0833L0312j3784j20389j8624J33681l0957j36877j36906R4275P5386
22925a51725J95094J08470k4280r2118k40500j3063J68525L7133M6749P3098l4753
22914G2630Q923J0142l1915m6447j9520Q0951J34027Q2695j16499j04598k7107
$$ plain form
22903 43282 -1774 30362 172189 116708 61753 57921 52673 185046 240500 197923 260354 -7249
22891 -7249 -187400 -109034 -285590 -316579 -150626 -149245 -149510 -40908 19908 95998 24550 -105494
22879 -105494 -126561 5355 -20474 -91623 -47971 31268 15807 -245723 -339812 -109796 -14691
22868 -14691 -77431 24691 154076 -125454 -356434 -265092 -200118 -212655 -108248 59114
22858 59114 36584 122955 112892 19957 -52452 -224077 -338357 -260062 -193320 -43584 -24149
22847 -24149 -119350 -196139 -164602 -111792 -61816 33500 165434 229822 85495 124132 21622
22836 21622 -27899 -4617 5347 45265 -19842 -167275 -135863 -23520 -103974 -119269 6854
22825 6854 170765 184579 65942 -7028 -125354 -50592 -83657 -197397 -70880 3948 -50539
$$ packed form
22903D3282m5056L2136J41827n5481n4955l832n248J32373N5454m2577O2431k67603
22891g249j80151P8366j76556l0989J65953J381k65J08602O0816P6090p1448j30044
22879a05494k1067J31916k5829p1149M3652P9239j5461k61530r4089K30016R5105
22868a4691o2740J02122J29385k79530k30980R1342O4974j2537J04407J67362
22858E9114k2530Q6371j0063r2935p2409j71625j14280P8295O6742J49736J9435
22847b4149r5201p6789L1537N2810M9976R5316J31934O4388j44327L8637j02510
22836B1622m9521K3282R964L9918o5107j47433L1412J12343q0454j5295J26123
22825F854J63911J3814j18637p2970j18326P4762l3065j13740J26517P4828n4487
$$ plain form
22814 -50539 -13608 35883 113593 167789 184030 84056 -52146 -239003 -271562 -164720 -162409
22803 -162409 -257964 -155517 -122300 453 77875 109058 31639 -50457 -59893 15532 117836
22792 117836 190074 87602 70403 107403 42827 153656 203477 126552 -77 73330 63984
22781 63984 63934 11869 59095 -53139 -82602 -65928 62767 87742 129869 215296 214014 46178
22769 46178 -87850 -102552 -108578 -98599 24333 59834 41166 147438 53677 -158715 -108083
22758 -108083 -29754 75747 124024 5711 114101 -7435 30184 167510 218443 55202
22748 55202 -55556 -34835 -105810 -143279 -202839 -216196 -135123 -48161 -35719 93899 140140
22737 140140 121556 -77568 -64879 53835 20524 95380 -2316 -30320 -90559 -118780 -115474
$$ packed form
22814e0539L6931M9491P7710N4196J6241r9974j36202j86857l2559J06842K311
22803a62409r5555J02447L3217J22753P7422L1183p7419q2096r436P5425J02304
22792A17836P2238j02472j7199L7000o4576J10829M9821p6925j26629P3407r346
22781F3984n0n2065M7226j12234k9463J6674J28695K4975M2127Q5427j282j67836
22769D6178j34028j4702o026R979J22932L5501j8668J06272r3761k12392N0632
22758a08083P8329J05501M8277j18313J08390j21536L7619J37326N0933j63241
22748E5202j10758K0721p0975l7469n9560j3357Q1073Q6962J2442J29618M6241
22737A40140j8584j99124J2689J18714l3311P4856r7696k8004o0239k8221L306
$$ plain form
22726 -115474 -155608 141476 173068 30188 72027 192185 142269 83799 16723 -189319 -247568
22715 -247568 -50893 187210 48940 -71224 48017 48098 44155 -44722 -71050 80423 46044
22704 46044 48598 50343 64558 40668 95418 -5181 -16998 22665 -62863 -76476 -73306 -68605
22692 -68605 90909 195473 -1885 -91380 -183157 -146764 19343 -101862 -113190 -20607 180008
22681 180008 152482 38179 32037 129343 170005 156235 177150 82895 9900 -7330 -56862
22670 -56862 -110367 -121470 -27686 29631 -32627 126635 101122 8104 76400 49122 -131110
22659 -131110 -248319 -276285 -203872 -197406 -229845 -151319 -208081 -71557 113769 184122 65839
22648 65839 3408 -66142 52118 212733 256853 284480 274867 367813 269609 61385 26464
$$ packed form
22726a15474m0134K97084L1592j42880M1839J20158m9916n8470o7076k06042n8249
22715b47568J96675K38103j38270j20164J19241Q1l943q8877k6328J51473l4379
22704D6044K554J745J4215k3890N4750j00599j1817L9663q5528j3613L170M701
22692f8605J59514J04564j97358q9495r1777L6393J66107j21205j1328R2583K00615
22681A80008k7526j14303o142R7306M0662j3770K0915r4255p2995j7230m9532
22670e6862n3505j1103R3784N7317o2258J59262k5513r3018O8296k7278j80232
22659a31110j17209k7966P2413O466l2439P8526n6762J36524J85326P0353j18283
22648F5839o2431o9550J18260J60615M4120K7627r613R2946r8204k08224l4921
$$ plain form
22637 26464 108678 48898 50581 -37466 -191019 -419752 -518136 -523342 -344764 -199244 -127390
22626 -127390 -120531 -142158 -127744 -87458 16598 -31064 -101998 -122832 -69174 -44003 -125314
22615 -125314 -104632 -95408 -31736 41829 34438 5489 -150563 -222461 -244260 -165739 -267227
22604 -267227 -455380 -368442 -197240 -223276 -131468 -161209 -147881 -163352 -223643 -252149 -212630
22593 -212630 -182284 -285730 -353639 -443777 -479569 -248996 -97050 -310800 -303355 -205609 -124825
22582 -124825 133824 122936 68064 65589 -68260 102184 204765 183184 94146 211083 215988
22571 215988 198457 -2248 -47628 71014 78528 6573 53724 117267 208238 191155 86879
22560 86879 6036 -26799 20106 89093 -21405 -71583 -17687 15388 -28469 202344 370005
$$ packed form
22637B6464Q2214n9780J683q8047j53553k28733r8384n206J78578J45520P1854
22626a27390O859k1627J4414M0286J04056m7662p0934k0834N3658K5171q1311
22615a25314K0682R224O3672P3565p391k8949j56052p1898k1799P8521j01488
22604b67227j88153Q6938J71202k6036R1808k9741J3328j5471o0291k8506L9519
22593b12630L0346j03446o7909r0138l5792K30573J51946k13750P445R7746Q0784
22582a24825K58649j0888n4872k475j33849J70444J02581k1581q9038J16937M905
22571B15988j7531k00705m5380J18642P514p1955M7151O3543R0971j7083j04276
22560H6879q0843l2835M6905O8987j10498n0178N3896L3075m3857K30813J67661
$$ plain form
22549 370005 265400 120216 41312 22951 -107701 -209131 -118134 82820 90477 -74652
22539 -74652 -166572 -260769 -304769 -210448 -281854 -247483 -226812 5529 105493 114708 165756 66770
22527 66770 -31087 -35423 31205 115414 159807 175152 278093 116507 -72143 -138516 42777
22516 42777 158909 227517 108918 23514 85136 72521 8791 -93323 -91264 -282298 -440846
22505 -440846 -366703 -261586 -116363 20603 -62502 63411 201997 141838 148978 127017 10198
22494 10198 -54429 -128460 47015 -37099 -126032 -3162 133104 28651 -20791 33071 58992
22483 58992 112510 11809 -145229 -100138 -146484 -181643 -134556 -293105 -326468 -304530 -198890
22472 -198890 -260590 -388118 -291256 -371971 -334070 -264290 -225725 -197529 -102688 -8571 26265
$$ packed form
22549C70005j04605j45184p8904j8361j30652j01430R0997K00954P657j65129
22539g4652r1920r4197m4000R4321p1406L4371K0671K32341R9964R215N1048r8986
22527F6770r7857m336O6628Q4209M4393J5345J02941j61586j88650o6373J81293
22516D2777J16132O8608j18599q5404O1622j2615o3730j02114K059j91034j58548
22505d40846P4143J05117J45223J36966q3105J25913J38586o0159P140k1961j16819
22494A0198o4627p4031J75475q4114q8933J22870J36266j04453m9442N3862K5921
22483E8992N3518j00701j57038M5091m6346l5159M7087j58549l3363K1938J05640
22472a98890o1700j27528R6862q0715L7901O9780L8565K8196R4841R4117L4836
$$ plain form
22461 26265 64328 35656 -45704 -5226 -137722 -150926 -167907 -239524 -150095 -191187 -145785
22450 -145785 15874 269221 306215 239469 235661 299925 301887 271723 286705 264599 171945
22439 171945 126797 96669 61579 4451 5220 -74914 -35141 -146142 -225433 -168225 -200215 -201177
22427 -201177 -170750 -102437 -315092 -340422 -359408 -289738 -130933 -4460 36674 128921 86030
22416 86030 -21076 -113836 -109085 -153837 -254674 -150597 -108373 -58982 -83349 -61300 1254
22405 1254 25666 216363 170424 89454 -17954 121535 103939 -25553 -65010 112802 164963
22394 164963 -52793 -3025 -38504 -60029 -194576 -239199 -300881 -152073 -12002 49471 83639
22383 83639 115634 123686 1878 -235698 -282940 -99745 -46297 16309 -42763 -59611 -57746
$$ packed form
22461B6265L8063k8672q1360M0478j32496j3204j6981p1617Q9429m1092M5402
22450a45785J61659K53347L6994o6746l808O4264J962l0164J4982k2106r2654
22439A71945m5148l0128l5090n7128P69q0134L9773j11001p9291N7208l1990r62
22427b01177L0427O8313k12655k5330j8986O9670J58805J26473M1134R2247m2891
22416H6030j07106r2760M751m4752j00837J04077M2224M9391k4367K2049O2554
22405A254K4412J90697m5939q0970j07408J39489j7596j29492l9457J77812N2161
22394A64963k17756M9768l5479k1525j34547m4623o1682J48808J40071O1473L4168
22383H3639L1995Q052j21808k37576m7242J83195N3448O2606n9072j6848J865
$$ plain form
22372 -57746 -57429 -90299 23529 70400 176807 135932 29226 -86272 -196674 -363459 -324763
22361 -324763 -299380 -287481 -85505 85313 222771 292835 248983 113877 194111 136845 -40122
22350 -40122 -62501 -78108 -97057 -58996 -144987 -193428 -93088 -99535 235291 198557 166437
22339 166437 50250 -45764 -100539 -86481 -87301 86556 201495 103763 -143686 -269657 -205729
22328 -205729 -73238 60990 -160010 -76965 143420 115744 -34500 -134091 -41167 -14040
22318 -14040 -34303 -11861 89580 24637 45523 113942 211841 191355 80541 -4397 -72207
22307 -72207 20276 87309 46097 -167620 -226068 -263159 42843 127123 103239 66949 -115300
22296 -115300 -210822 -136010 26950 39524 151219 60505 -56314 -15773 111301 -21881
$$ packed form
22372e7746L17l2870J13828M6871J06407m0875j06706j15498j10402j66785L8696
22361c24763K5383J1899K01976J70818J37458P0064m3852j35106Q0234n7266j76967
22350d0122k2379j5607j8949L8061q5991m8441J00340o447L34826l6734l2120
22339A66437j16187r6014n4775J4058q20J73857J14939r7732k47449j25971O3928
22328b05729J32491J34228k21000Q3045K20385k7676j50244r9591R2924K7127
22318a4040k0263K2442J01441o4943K0886O8419R7899k0486j10814q4938o7810
22307g2207R2483O7033m1212k13717n8448l7091L06002Q4280k3884l6290j82249
22296a15300r5522P4812J62960J2574J11695r0714j16819M0541J27074j33182
$$ plain form
22286 -21881 -118924 -94085 -28624 -27050 -183711 -91929 177213 218184 172514 96725 28163
22275 28163 52807 184163 292102 122765 91830 23643 -65188 -126582 -58521 -41908 -43143
22264 -43143 27719 -122212 54269 169020 186023 85762 32475 124563 182183 221456 309195
22253 309195 514940 480056 398626 324980 332852 292946 237483 221918 304754 160652 131519
22242 131519 96768 44151 40003 21998 -60865 72491 201178 67477 -11905 -184688 -152418
22231 -152418 -84952 55207 -5443 -184726 -295775 -246152 -220065 -278675 25396 237879
22221 237879 161065 -21983 -115987 -193831 -149027 -89219 -114899 -55779 122102 -57792 -132543
22210 -132543 54238 79125 123050 217317 107667 -99415 -138846 29319 -41297 -108037 -166341
$$ packed form
22286b1881r7043K4839O5461J574j56661R1782K69142M0971m5670p5789o8562
22275B8163K4644J31356J07939j69337l0935o8187q8831o1394O8061J6613j235
22264d3143P0862j49931J76481J14751J7003j00261n3287R2088N7620L9273Q7739
22253C09195K05745l4884q1430p3646P872l9906n5463j5565Q2836j44102k9133
22242A31519l4751n2617m148j8005q2863J33356J28687j33701p9382j72783L2270
22231a52418O7466J40159o0650j79283j11049M9623K6087n8610L04071K12483
22221B37879p6814j83048r4004p7844M4804N9808k5680N9120J77881j79894p4751
22210a32543J86781K4887M3925R4267j09650k07082l9431J68165p0616o6740n8304
$$ plain form
22199 -166341 -64231 124678 104739 -6135 44188 -7821 71894 -31935 -27473 -114602 -2060
22188 -2060 41584 -117666 -18633 157460 207727 143845 -65980 -48128 -19382 -26218 107963
22177 107963 56949 13636 -19948 -183703 -117524 58055 73653 31425 93697 109965 251717
22166 251717 263475 163978 184285 204894 359872 177054 -56343 25986 116531 145817 206951
22155 206951 128628 96752 -65517 -128302 -194075 -322581 -257065 -254282 -126549 -286633 -364216
22144 -364216 -276460 -328625 -377567 -337312 -276225 -280704 -201551 -157976 -181717 -265716 -245844 -208435
22132 -208435 -79116 -102609 -70926 -54041 -170551 -219063 -184525 24770 193385 219454 134640
22121 134640 -82568 -185565 -205019 -299544 -331408 -216426 -47918 118391 6224 -33525
$$ packed form
22199a66341J02110J88909j9939j10874N0323n2009P9715j03829M462q7129J12542
22188b060M3644j59250R9033J76093N0267o3882k09825J7852K8746o836J34181
22177A07963n1014m3313l3584j63755O6179J75579J5598m2228O2272J6268J41752
22166B51717J1758r9497K0307K0609J54978j82818k33397Q2329R0545K9286O1134
22155B06951p8323l1876j62269o2785o5773j28506O5516K783J27733j60084p7583
22144c64216Q7756n2165m8942M0255O1087m479P9153M3575k3741q3999J9872L7409
22132b08435J29319k3493L1683J6885j16510m8512L4538K09295J68615K6069q4814
22121A34640k17208j02997j9454r4525l1864J14982J68508J66309j12167l9749
$$ plain form
22111 -33525 -13479 -11544 32535 230936 250553 148075 34609 -179640 -285071 -419949 -405330
22100 -405330 -416950 -413273 -209367 -166347 -107781 206 -121126 -244478 -299321 -104344 47797
22089 47797 160180 57472 -30286 -85310 45603 78238 144651 265515 368820 145699
22079 145699 -52236 35763 83366 -58372 -86187 -178505 -338117 -359073 -194795 -198054 -255147
22068 -255147 -231118 -71611 12602 -175176 -220742 -88811 52234 -116085 -294631 -237390
22058 -237390 -187296 -94799 -35281 -135027 -116282 -76940 -574 75164 304268 310262 180790
22047 180790 140589 -48561 -184646 -290858 -335438 -181669 -15655 -46281 -206302 -55729
22037 -55729 -43327 -127675 -134919 -246712 -304322 -257139 -224955 -156172 -79590 -53359 -187024
$$ packed form
22111c3525K0046J935M4079J98401J9617j02478j13466k14249j05431j34878J4619
22100d05330j1620L677K03906M3020N8566J07987j21332j23352n4843J94977J52141
22089D7797J12383j02708q7758n5024J30913L2635O6413J20864J03305k23121
22079A45699j97935Q7999M7603j41738k7815r2318j59612k0956J64278l259n7093
22068b55147K4029J59507Q4213j87778m5566J31931J41045j68319j78546N7241
22058b37390N0094R2497N9518r9746J8745L9342P6366P5738K29104N994j29472
22047A80790m0201j89150j36085j06212m4580J53769J66014l0626j60021J50573
22037e5729J2402q4348p244j11793n7610M7183L2184O8783P6582K6231j33665
$$ plain form
22026 -187024 -166803 -81668 2887 -67711 -73726 -28870 60846 -21420 -60007 -64810 -42598 -199435
22014 -199435 -347234 -375914 -252151 -161650 -151802 -751 110016 81857 144851 221513 187791
22003 187791 154315 106118 60856 -173654 -219594 -78742 -28331 -47131 58771 146923 58946
21992 58946 15206 48730 -61499 -81252 4110 28954 83486 222994 176766 116860 81372
21981 81372 -56535 -75824 -102430 -56398 77080 175455 78806 91866 138181 39714 -86008
21970 -86008 79888 122182 189435 135386 241081 300084 200782 126514 71795 -16477 56976
21959 56976 -15614 8813 84768 -123949 -42190 272856 397882 126054 88988 142838 88582
21948 88582 95265 45213 51322 -14271 -123154 -232471 -73261 14831 7687 12899 -1594 -73726
$$ packed form
22026a87024K0221Q5135Q4555p0598o015M4856Q9716q2266l8587m803K2212j56837
22014a99435j47799k8680J23763R0501R848J51051J10767k8159O2994P6662l3722
22003A87791l3476m8197m5262k34510m5940J40852N0411j8800J05902Q8152q7977
21992E8946m3740L3524j10229j9753Q5362K4844N4532J39508m6228n9906l5488
21981H1372j37907j9289k6606M6032J33478R8375r6649J3060M6315r8467j25722
21970h6008J65896M2294O7253n4049J05695N9003r9302p4268n4719q8272P3453
21959E6976p2590K4427P5955k08717Q1759L15046J25026k71828l7066N3850n4256
21948H8582O683n0052O109o5593j08883j09317J59210Q8092p144N212j4493p2132
$$ plain form
21936 -73726 28880 13957 149385 181068 185989 133224 141688 121709 148621 204867 124207 -100301
21924 -100301 -145279 46536 101165 -43727 -22912 -95909 -68990 -105002 -132864 -133452 -78523
21913 -78523 -121093 -29253 -77087 -179744 -120528 -149620 -121250 -176052 -56233 -93673 -178354
21902 -178354 -239631 -373579 -366923 -111547 -8256 -38458 6531 42239 -98379 -130442 -41763
21891 -41763 -11007 -5897 -120610 -182345 -219950 -283598 -182554 -111121 -21852 59493 87934
21880 87934 -13633 -66576 -18966 129656 367857 283637 191808 158553 111604 86643 126920
21869 126920 184769 85246 -20881 47370 55348 27388 -90292 31832 38169 158423 172519
21858 172519 48435 58039 5245 19877 -117493 -9097 155014 -47261 -55432 -18133 -41412
$$ packed form
21936g3726J02606j4923J35428L1683M921n2765Q464j9979K6912N6246q0660k24508
21924a00301m4978J91815N4629j44892K0815p2997K6919l6012k7862n88N4929
21913g8523m2570R1840m7834j02657N9216k9092K8370n4802J19819l7440q4681
21902a78354o1277j33948O656K55376J03291l0202M4989L5708j40618l2063Q8679
21891d1763L0756N110j14713o1735l7605o3648J01044P1433Q9269Q1345K8441
21880H7934j01567n2943M7610J48622K38201q4220r1829l3255m6949k4961M0277
21869A26920N7849r9523j06127O8251P978k7960j17680J22124O337J20254J4096
21858A72519j24084R604n2794J4632j37370J08396J64111k02275q171L7299k3279
$$ plain form
21847 -41412 -104703 -108354 77308 107553 227698 287831 245010 220146 142390 99991 28066
21836 28066 -120731 -114675 -43109 -76627 -236222 -335079 -234560 -127372 -23146 -251 -18844
21825 -18844 22327 -68363 -192680 -182129 -152028 -78173 -53391 -89345 -138752 -181192 -193807
21814 -193807 -74955 -108730 -80400 5095 32911 124892 28423 -85249 146538 190352 15667
21803 15667 12546 -60119 -20561 -3639 -35495 102335 54156 -104063 -259173 -289493 -254818
21792 -254818 -238079 -250498 -77748 -52385 -78012 -172042 -188925 -241306 -130858 -85496 -171174
21781 -171174 -149780 -264218 -223883 -72276 -160597 -97122 -244202 -254968 -132121 88539
21771 88539 133910 235251 109832 -159964 -215430 -23235 129604 177514 104973 -8931
$$ packed form
21847d1412o3291l651J85662L0245J20145O0133m2821k4864p7756m2399p1925
21836B8066j48797O056P1566l3518j59595r8857J00519J07188J04226K2895j8593
21825a8844M1171r0690j24317J0551L0101P3855K4782l5954m9407m2440j2615
21814a93807J18852l3775K8330Q5495K7816R1981r6469j13672K31787M3814j74685
21803A5667l121p2665L9558J6922l1856J37830m8179j58219j55110l0320L4675
21792b54818J6739j2419J72750K5363k5627r4030j6883n2381J10448M5362q5678
21781a71174K1394j14438M0335J51607q8321O3475j47080j0766J22847K20660
21771H8539M5371J01341j25419k69796n5466J92195J52839M7910p2541j13904
$$ plain form
21761 -8931 -109021 -160350 -177189 -171673 -235787 -195993 -82107 -17025 -46742 -38168 28861 -108633
21749 -108633 -130304 -59539 -137103 -177501 -137399 -127643 -133466 -140658 -107142 -164249 -158508 90419
21737 90419 88738 -34869 -95949 -95037 -68836 -123209 -73308 -96060 -21751 99518 -49985 -98009
21725 -98009 -146666 -171286 -116421 120371 132086 139010 -467 -53821 -230037 -312712 -290435
21714 -290435 -132622 77004 108453 -8273 -72851 -22218 152725 296300 132987 45745
21704 45745 23723 96127 101638 17043 -107418 -142899 4178 106882 70437 4662 -38306
21693 -38306 8989 22371 104205 111673 -35442 -69563 -26539 -181124 -85994 -19559 -117050
21682 -117050 -46705 151030 150475 -29136 52205 128374 108565 35051 -197425 -169450 -281046
$$ packed form
21761h931j00090n1329j6839N516o4114L9794J13886O5082k9717Q574O7029j37494
21749a08633k1671P0765p7564m0398M0102R756n823p192L3516n7107N741K48927
21737I0419j681j23607o1080R12K6201n4373M9901k2752P4309J21269j49503m8024
21725i8009m8657k4620N4865K36792J1715O924j39477n3354j76216q2675K2277
21714b90435J57813K09626L1449j16726o4578N0633J74943J43575j63313q7242
21704D5745k2022P2404N511q4595j24461l5481J47077J02704l6445o5775m2968
21693c8306M7295J3382Q1834P468j47115l4121M3024j54585R5130O6435r7491
21682a17050P0345J97735n55j79611Q1341P6169j9809p3514k32476K7975j11596
$$ plain form
21671 -281046 -221347 -95648 -47537 152227 51699 -175989 -150500 68877 221447 203522
21661 203522 104991 114536 182040 248485 284414 357091 283659 218930 41917 165663 132232
21650 132232 191668 137399 -36998 -75971 -130328 -228868 -193831 -80745 -83902 -164050 -101604
21639 -101604 -8883 61886 253635 136811 -43411 2308 43065 114123 283788 244985 209074
21628 209074 96456 -6396 57260 154543 91883 123471 141548 133653 94013 106309 79506
21617 79506 213360 417263 533462 348983 179029 125505 167197 -132560 -307283 -215108
21607 -215108 30351 230579 352618 278645 312655 149556 10892 116395 151223 177605
21597 177605 262404 189289 -7531 -131469 -163767 -69306 28945 86049 41927 -42877 -39492
$$ packed form
21671b81046N9699J25699M8111J99764j00528k27688K5489K19377J52570j7925
21661B03522r8531R545O7504O6445L5929P2677p3432o4729j77013J23746l3431
21650A32232N9436n4269j74397l8973n4357r8540L5037J13086l157q0148O2446
21639a01604R2721P0769J91749j16824j80222M5719M0757P1058J69665l8803l5911
21628B09074j12618j02852O3656R7283o2660L1588J8077p895l9640J2296k6803
21617G9506J33854K03903J16199j84479j69954n3524M1692k99757j74723R2175
21607b15108K45459K00228J22039p3973L4010j63099j38664J05503L4828K6382
21597A77605Q4799p3115j96820j23938l2298R4461R8251N7104m4122q4804L385
$$ plain form
21586 -39492 -12130 13532 -200796 -265532 -216038 -147985 -232394 -290570 -335100 -174927 10713
21575 10713 21666 -49747 7412 84429 185081 223487 227347 241350 -85956 -291705 -303922
21564 -303922 -96537 81044 194689 51946 -17333 13617 242632 276132 75275 -48133
21554 -48133 2026 56475 -44921 -196896 -226739 -253331 -230382 -133501 -269695 -209209 -77936
21543 -77936 44458 -28176 -198202 -142716 35115 134598 57440 47363 67581 -163640 -213565
21532 -213565 -214225 -323279 -243740 84327 245186 228504 32513 -102183 -87651 -148835 -155601
21521 -155601 -56708 23221 -65685 27970 46148 96165 -3832 54322 129537 80432 24896
21510 24896 -113155 -116389 -233805 -320825 -186465 -75416 -140797 -157662 -161189 -73258 110953
$$ packed form
21586c9492K7362K5662k14328o4736M9494O8053q4409n8176m4530J60173J85640
21575A0713J0953p1413N7159P7017J00652L8406L860J4003l27306k05749j2217
21564c03922K07385J77581J13645j42743o9279L0950K29015L3500k00857j23408
21554d8133N0159N4449j01396j51975k9843k6592K2949R6881j36194O0486J31273
21543g7936J22394p2634j70026N5486J77831R9483p7158j0077K0218k31221m9925
21532b13565o60j09054P9539L28067J60859j6682j95991j34696J4532o1184o766
21521a55601R8893P9929q8906R3655J8178N0017r9997N8154P5215m9105n5536
21510B4896j38051l234j17416q7020J34360J11049o5381j6865l527Q7931J84211
$$ plain form
21499 110953 317123 441179 351328 195751 220857 258764 242375 340450 322081 51235 -16827
21488 -16827 -6728 9373 21567 -25782 -82484 35326 182900 197251 194354 93192 -144613
21477 -144613 -173670 -267860 -212748 -232140 -298347 -162683 -138703 2845 253016 193892 38754
21466 38754 -21414 -7160 -98390 -207848 -82194 137014 237090 122502 4181 -16180
21456 -16180 12066 -143942 -205892 -257551 -171479 -91237 -229750 -294087 -250495 -138814 -119655
21445 -119655 -216916 -180816 -83854 6773 50755 113408 138286 -10399 -36256 -3489 -5323
21434 -5323 26635 -157747 -149848 75976 99902 -158717 -249123 -151146 -28408 -104765 16263
21423 16263 109681 124314 62758 173420 -1937 -76173 -50626 -182810 26777 206373 177148
$$ packed form
21499A10953K06170J24056q9851j55577K5106L7907j6389R8075j8369k70846o8062
21488a6827J0099J6101J2194m7349n6702J17810J47574J4351k897j01162k37805
21477a44613k9057r4190N5112j9392o6207J35664K3980J41548K50171n9124j55138
21466C8754o0168J4254r1230j09458J25654K19208J00076j14588j18321k0361
21456a6180K8246j56008o1950n1659Q6072Q0242j38513o4337M3592J11681J9159
21445a19655r7261L6100R6962R0627M3982O2653K4878j48685k5857L2767j834
21434e323L1958j84382P899K25824K3926k58619r0406R7977J22738p6357J21028
21423A6263R3418J4633o1556J10662j75357p4236K5547j32184K09587J79596k9225
$$ plain form
21412 177148 19336 -147363 15187 132938 130454 138942 -38337 -117661 -73113 -123474 35681
21401 35681 29964 20505 -150050 -201813 -174007 -37912 81429 140548 132471 28872 -103544
21390 -103544 -47688 -86400 -107023 38324 188148 208795 101532 51213 -17924 -22168 11971
21379 11971 110580 162326 116369 -18361 -126 121344 192481 161486 142122 130718 124385
21368 124385 72864 -4249 121808 133369 267586 377330 372714 68387 48350 88938 8369
21357 8369 -133521 -98405 120922 67431 86635 92187 -16166 -6431 -102778 4269 233252
21346 233252 144510 159558 199687 158914 28906 -335 28512 -54665 -81889 114467 240802
21335 240802 130452 71984 -60542 148057 239696 213562 -15590 12255 40307 159946
$$ packed form
21412A77148j57812j66699J62550J17751k484Q488j77279p9324M4548n0361J59155
21401C5681n717r459j70555n1763K7806J36095J19341N9119q077j03599j32416
21390a03544N5856l8712k0623J45347J49824K0647j07263n0319o9137m244L4139
21379A1971R8609N1746m5957j34730J8235J21470P1137l0995j9364j1404o333
21368A24385n1521p7113J26057J1561J34217J09744m616l04327k0037M0588q0569
21357H369j41890L5116K19327n3491J9204N552j08353R735r6347J07047K28983
21346B33252q8742J5048M0129m0773j30008k9241K8847q3177k7224J96356J26335
21335B40802j10350n8468j32526K08599R1639k6134k29152K7845K8052J19639
$$ plain form
21325 159946 3509 -99674 -172700 -86927 140141 171043 72990 35679 16644 -40934 -101155
21314 -101155 3502 137317 225341 212834 63077 -82766 -131976 -267041 -281678 -244036
21304 -244036 -237345 -48563 -133841 -150114 -99310 12755 -32881 -62566 5222 -99122 -96098
21293 -96098 70125 -36555 40974 45592 185738 234309 172246 -55841 -4295 -62979 37583
21282 37583 29932 168341 236184 119823 -80251 -17864 -81161 -81599 -203759 -188810 -96532
21271 -96532 -86643 -149148 -313956 -261073 -230020 -288614 -309652 -280837 -140668 108216 354974
21260 354974 423450 325977 205648 222199 228975 308694 309602 321203 266034 275772 131999 41120
21248 41120 -83490 -199051 -96541 -125717 -188921 -123053 29965 71368 -12121 48639 114370
$$ packed form
21325A59946j56437j03183p3026Q5773K27068L0902r8053l7311j9035n7578o0221
21314a01155J04657J33815Q8024j2507j49757j45843m9210j35065j4637L7642
21304b44036O691J88782q5278j6273N0804J12065m5636k9685O7788j04344L024
21293i6098J66223j06680P7529M618J40146M8571o2063k28087N1546n8684J00562
21282C7583p651J38409O7843j16361k00074O2387o3297m38j22160J4949R2278
21271i6532R889o2505j64808N2883L1053n8594k1038K8815J40169K48884K46758
21260C54974O8476r7473j20329J6551O776P9719R08J1601n5169R738j43773r0879
21248D1120j24610j15561J02510k9176o3204O5868J53018M1403q3489O0760O5731
$$ plain form
21237 114370 41034 24812 162602 155109 97878 85946 -7646 93333 200838 257046 182944
21226 182944 158015 195089 38657 -26423 -15475 129003 187610 100020 65180 46288 -69275
21215 -69275 -31485 104546 309711 375588 279390 125583 169392 263351 242012 208462 148287
21204 148287 136622 116488 205477 238926 143811 269510 192636 29344 41491 145696 229363
21193 229363 96886 70319 -16027 60198 89418 214735 196431 72894 -4844 14073 19123
21182 19123 -93307 -34320 72482 -37615 -153881 -98564 -103518 -40841 135983 251220 77261
21171 77261 -39087 -34051 -76349 -91871 25625 47566 132707 153285 77551 -222849 -111563
21160 -111563 2890 -38844 -87503 -57771 -86868 86389 271049 237198 228602 283275 304939
$$ packed form
21237A14370p3336j6222J37790p493n7231j1932r3592J00979J07505N6208p4102
21226A82944k4929L7074j56432o5080J0948J44478N8607q7590l4840j8892j15563
21215f9275L7790J36031K05165O5877r6198j53807M3809R3959k1339l3550o0175
21204A48287j1665k0134Q8989L3449r5115J25699p6874j63292J2147J04205Q3667
21193B29363j32477k6567q6346P6225K9220J25317j8304j23537p7738J8917N050
21182A9123j12430N8987J06802j10097j16266N5317m954O2677J76824J15237j73959
21171G7261j16348N036m2298j5522J17496K1941Q5141K0578p5734l00400J11286
21160a11563J14453m1734m8659K9732k9097J73257J84660l3851q596N4673K1664
$$ plain form
21149 304939 286125 311950 244134 187207 320745 254623 -33348 -136571 20429 9564 42116
21138 42116 99788 5167 27870 -74323 -146325 15393 106640 150331 151336 242954 236284 302250
21126 302250 279438 209852 136024 218188 263821 164677 18101 -100786 -3195 35304 -107201
21115 -107201 -231939 -203420 -184746 -157630 -212014 -236055 -137197 -38675 32474 -353 -83008
21104 -83008 -31972 -19096 9001 -31528 69188 30634 3489 36022 117360 158677 152619 104528
21092 104528 209642 177968 91936 52946 12419 -103668 -37861 -146192 -171224 -64744 -115609
21081 -115609 -110514 -77911 -128861 -64004 128523 161360 114618 195172 302640 213944 313797
21070 313797 442160 342541 353155 442811 310808 336397 429183 411105 139109 138756 249098
$$ packed form
21149C04939j8814K5825o7816n6927J33538o6122k87971j03223J57000j0865L2552
21138D2116N7672r4621K2703j02193p2002J61718R1247M3691J005R1618o670O5966
21126C02250k2812o9586p3828Q2164M5633r9144j46576j18887R7591L8499j42505
21115a07201j24738K8519J8674K7116n4384k4041R8858R8522P1149l2827q2655
21104h3008N1036J2876K8097m0529J00716l8554k7145L2533Q1338M1317o058m8091
21092A04528J05114l1674q6032l8990m0527j16087O5807j08331k5032J06480n0865
21081a15609N095L2603n0950O4857J92527L2837m6742Q0554J07468q8696R9853
21070C13797J28363r9619J0614Q9656j32003K5589R2786j8078k71996l53J10342
$$ plain form
21059 249098 214973 349663 408354 420973 474195 399277 504512 447323 284250 302337 327211
21048 327211 294693 412770 721508 932420 886473 636503 604752 685550 545031 352807
21038 352807 475566 762777 1075832 1417990 1707189 1637472 1596764 1637728 1463769 1129664
21028 1129664 833418 812276 858199 849968 924791 1019949 1008753 971830 918003 864500 734521
21017 734521 584474 449345 297486 278145 222921 241138 319057 359475 215406 161095 175814
21006 175814 227690 391232 334594 202127 237583 284309 282076 268596 303229 300539 397062
20995 397062 419985 260111 166592 229543 273083 313613 320040 358724 211137 120581 191388
20984 191388 200152 122334 97562 129053 153424 105564 142981 194891 145014 47215 54769 74123
$$ packed form
21059B49098l4125J34690N8691J2619N3222p4918J05235n7189j63073J8087K4874
21048C27211l2518J18077L08738K10912m5947k49970l1751Q0798j40519j92224
21038C52807J22759K87211L13055L42158K89199o9717m0708M0964j73959l34105
21028A129664k96246k1142M5923q231P4823R5158j1196l6923n3827n3503j29979
21017G34521j50047j35129j51859j9341n5224J8217P7919M0418j44069n4311J4719
21006A75814N1876J63542n6638j32467L5456M6726k233j3480L4633k690R6523
20995C97062K2923j59874r3519O2951M3540M0530O427L8684j47587r0556P0807
20984A91388Q764p7818k4772L1491K4371m7860L7417N1910m9877r7799P554J9354
$$ plain form
20972 74123 81376 118871 148167 96034 186225 239933 -5715 -37558 11858 69671 121521 184859
20960 184859 29145 384 -76971 -88304 43793 8973 -38550 -3103 81399 152147 189619
20949 189619 93252 170926 315447 244842 194200 124641 -75717 -92250 -336299 -252915 -53483
20938 -53483 -84452 -56479 195146 301253 391081 342265 177808 274572 307180 244763 117883
20927 117883 45770 -53892 -115507 -18891 97270 169930 216595 176254 -57099 -68938 51086
20916 51086 -165213 -218263 -34319 155831 -14425 -315644 -225405 51591 51379 -77806 -196285
20905 -196285 -100955 67926 153088 109603 123372 73206 -45293 104764 262970 209802 -19062
20894 -19062 21757 74380 27213 28289 35647 103772 144932 117753 207617 332736 185041 -4845
$$ packed form
20972G4123P253L7495K9296n2133R0191N3708k45648l1843M9416N7813N1850O3338
20960A84859j55714k8761p7355j1333J32097l4820m7523L5447Q4502P0748L7472
20949A89619r6367P7674J44521p0605n0642o9559k00358j6533k44049Q3384J99432
20938e3483l0969K7973K51625J06107Q9828m8816j64457R6764L2608o2417j26880
20927A17883p2113r9662o1615R6616J16161P2660M6665m0341k33353j1839J20024
20916E1086k16299n3050J83944J90150j70256l01219R0239K76996k12j29185j18479
20905a96285R5330J68881Q5162m3485J3769n0166j18499J50057J58206n3168k28864
20894a9062M0819N2623m7167J076P358O8125M1160k7179Q9864J25119j47695j89886
$$ plain form
20882 -4845 -93459 41929 163421 258857 298332 389156 435068 520504 566809 539360 557569
20871 557569 554443 364164 218481 184466 97575 153394 175838 103028 96504 94961 135087 294281
20859 294281 277018 309030 399662 390299 380642 318712 384699 405207 491116 410704 249518 148836
20847 148836 227541 153277 80969 276481 248351 348412 217062 146976 302391 249851 264251
20836 264251 280379 167668 313686 303600 245882 96555 161838 110314 27448 200589 273613
20825 273613 230316 160514 101353 280636 356423 267182 295217 301987 102212 -46491 -108472
20814 -108472 -59306 25821 204518 134791 59308 495 123379 77055 112358 186142 192567
20803 192567 209266 192685 337908 303221 146212 -52990 -51735 70394 89520 45495 12844
$$ packed form
20882d845q8614J35388J21492R5436L9475R0824M5912Q5436M6305k7449J8209
20871E57569l126j90279j45683l4015q6891N5819K2444p2810o524j543M0126J59194
20859B94281j7263L2012R0632r363r657o1930O5987K0508Q5909q0412j61186j00682
20847A48836P8705p4264p2308J95512k8130J00061j31350p0086J55415n2540J4400
20836B64251J6128j12711J46018j0086n7718j49327O5283n1524q2866J73141P3024
20825B73613m3297o9802n9161J79283P5787q9241K8035O770j99775j48703o1981
20814a08472M9166Q5127J78697o9727p5483n8813J22884m6324L5303P3784O425
20803A92567J6699j6581J45223l4687j57009j99202J255J22129J9126m4025l2651
$$ plain form
20792 12844 153454 175738 149938 214309 377573 338032 207579 426132 688205 607189 384045
20781 384045 246505 253408 249296 149764 68826 184684 290162 306076 409972 480058 543964
20770 543964 510298 410659 264391 64768 186193 328616 300478 220266 339202 323569
20760 323569 216528 223337 186656 137209 279420 336448 190544 251193 376100 210020 -19844
20749 -19844 -23140 3698 144529 165598 147678 87757 -31642 -13239 61111 -37892 6101
20738 6101 5273 33586 123797 98301 99832 208783 277411 319265 366590 277107 81648 143098
20726 143098 369218 408801 473657 434464 265156 183606 273941 374671 444217 387783 159257
20715 159257 68720 190084 304070 332634 420361 350453 279722 175359 79846 84788 175329
$$ packed form
20792A2844J40610K2284k5800O4371J63264l9541j30453K18553K62073q1016k23144
20781C84045j37540O903m112r9532q0938J15858J05478J5914J03896P0086O3906
20770E43964l3666r9639j46268j99623J21425J42423k8138q0212J18936j5633
20760C23569j07041O809l6681m9447J42211N7028j45904O0649J24907j66080k29864
20749a9844l296K6838J40831K1069j7920n9921j19399J8403P4350r9003M3993
20738F101q28K8313R0211k5496J531J08951O8628M1854M7325q9483j95459O1450
20726A43098K26120L9583O4856l9193j69308q1550R0335J00730O9546n6434k28526
20715A59257r0537J21364J13986K8564Q7727o9908p0731j04363r5513M942R0541
$$ plain form
20704 175329 417037 465083 357670 395802 362486 410157 516927 597153 454948 222638
20694 222638 76901 -68870 -37963 164362 405857 464376 413477 647823 764136 650804
20684 650804 404386 329100 336333 258442 260531 169180 176368 332615 395912 439132 433091 578228
20672 578228 550000 405721 408342 543825 627862 511568 410860 458239 630405 735154
20662 735154 616485 530535 563880 570683 553990 600912 597731 480195 375474 336228 494808
20651 494808 397220 377631 441047 422486 393177 303017 365958 479998 629975 712405 682258
20640 682258 560755 585880 562886 611642 537909 210644 221451 520510 795032 773052 664721
20629 664721 589712 566213 579973 646374 607388 589717 587345 469270 464860 483106 478264 456184
$$ packed form
20704A75329K41708M8046j07413L8132l3316M7671J06770Q0226j42205k32310
20694B22638j45737j45771L0907K02325K41495N8519n0899K34346J16313j13332
20684F50804k46418p5286P233p7891K089r1351P188J56247O3297M3220o041J45137
20672E78228k8228j44279K621J35483Q4037j16294j00708M7379J72166J04749
20662G35154j18669q5950L3345O803j6693M6922l181j17536j04721l9246J58580
20651D94808r7588j9589O3416j8561k9309r0160O2941J14040J49977Q2430l0147
20640F82258j21503K5125k2994M8756p3733l27265J0807K99059K74522k1980j08331
20629F64721p5009k3499J3760O6401l8986j7671k372j18075m410J8246m842k2080
$$ plain form
20617 456184 487708 503878 464501 538525 593223 552189 562778 478177 426332 539682 668493
20606 668493 710954 771114 698646 664036 648067 771514 861691 784153 868562 868999 773244 857743
20594 857743 788814 813816 819401 605734 702746 931563 964201 1054606 1107878 994439 1006974
20583 1006974 895747 729720 812920 1056890 1167167 1062335 952796 1048148 1135074 1262900
20573 1262900 1440282 1579587 1700213 1593026 1429729 1454741 1597144 1722591 1750009 1803664
20563 1803664 1869812 1998773 1949773 2017265 2236921 2432392 2606117 2701428 2700365 2833788
20553 2833788 3028608 3111813 3318290 3613971 4043883 4408710 4788404 5188886 5724397 6409032
20543 6409032 7008277 7689536 8255489 8780745 9519361 10595050 11647957 13059233 14928108
$$ packed form
20617D56184L1524J6170l9377P4024N4698m1034J0589q4601n1845J13350J28811
20606F68493M2461O0160p2468l4610j5969J23447R0177p7538Q4409M37r5755Q4499
20594H57743o8929K5002N585k13667R7012K28817L2638R0405N3272j13439J2535
20583A006974j11227j66027Q3200K43970J10277j04832j09539R5352Q6926J27826
20573A262900J77382J39305J20626j07187j63297K5012J42403J25447K7418N3655
20563A803664O6148J28961m9000O7492K19656J95471J73725R5311j063J33423
20553B833788J94820Q3205K06477K95681M29912L64827L79694M00482N35511O84635
20543F409032N99245O81259N65953N25256P38616J075689J052907J411276J868875
$$ plain form
20534 14928108 17187935 20204218 25023015 32533749 44532213 64942602 95330368 124036181
20526 124036181 136181236 140411242 148597035 146262208 124465353 100733057 90218198
20519 90218198 97208301 124703710 175643971 234418185 265916053 268762339 271529035
20512 271529035 266963378 228624091 170748369 123407048 97904675 92669777 106180890
20505 106180890 133680506 153451388 151484319 145717207 143361002 127410620 95784442
20498 95784442 65449907 44856759 32301378 24357803 19031688 15497673 13177495 11226313
20490 11226313 9659420 8413932 7345225 6786950 6414026 5999125 5326491 4744323 4267394
20481 4267394 3697013 3052821 2629315 2275467 2100561 1837533 1595132 1511046 1475412 1309695
$$ packed form
20534A4928108K259827L016283M818797P510734J1998464K0410389L0387766K8705813
20526A24036181J2145055M230006Q185793k334827k1796855k3732296j0514859
20519I0218198O990103K7495409N0940261N8774214L1497868K846286K766696
20512B71529035m565657l8339287n7875722m7341321k5502373n234898J3511113
20505A06180890K7499616J9770882j967069n767112k356205j5950382l1626178
20498I5784442l0334535k0593148j2555381p943575n326115l534015k320178j951182
20490A1226313j566893j245488j068707n58275l72924m14901o72634n82168m76929
20481D267394n70381o44192m23506l53848j74906k63028k42401q4086l5634j65717
$$ plain form
20471 1309695 1082556 895464 956785 912448 903933 751054 621550 688988 696197 751614 675085
20460 675085 468330 326210 265684 272648 384783 457569 354384 367838 293193 240272 212107
20449 212107 237036 264334 349375 289932 250798 442757 399063 240259 203242 284005 280252
20438 280252 -4848 -76025 -106973 -278503 -252837 -211738 -127287 -72773 -131234 -86339 12103
20427 12103 77346 -67187 -211213 -156571 -37970 143459 83199 -40604 -239777 -48172
20417 -48172 -10110 -143581 -85941 -126867 -14 16983 33200 -13646 -23876 -60584 -26119
20406 -26119 146222 133290 39092 -39949 112171 175325 334916 347689 229285 320900 316067
20395 316067 192813 230174 256204 167330 5 -43954 -105455 -21106 133575 141687 -4904
$$ packed form
20471A309695k27139j87092O1321m4337q515j52879j29504O7438P209N5417p6529
20460F75085k06755j42120o0526O964J12135P2786j03185J3454p4645n2921k8165
20449B12107K4929K7298Q5041n9443l9134J91959m3694j58804l7017Q0763l753
20438B80252k85100p1177l0948j71530K5666M1099Q4451N4514n8461M4895R8442
20427A2103O5243j44533j44026N4642J18601J81429o0260j23803j99173J91605
20417d8172L8062j33471N7640m0926J26853J6997J6217m6846j0230l6708L4465
20406b6119J72341j2932r4198p9041J52120O3154J59591J2773j18404R1615m833
20395C16067j23254L7361K6030q8874j67325m3959o1501Q4349J54681Q112j46591
$$ plain form
20384 -4904 -159898 -243921 -67390 -62248 30048 35487 17503 -54476 -56240 -33742 95575 243311
20372 243311 316923 171868 -16079 -58743 -25105 -26351 63764 27164 70641 127454 69675
20361 69675 217760 338850 129245 127510 22848 -17322 32966 128412 159177 146788 -23705
20350 -23705 6260 179535 202782 49016 -69356 -19797 158592 216200 24387 -98841
20340 -98841 -134873 -73259 -26709 -123139 -54292 -64789 -108390 -153993 -89240 94797 246826
20329 246826 150802 57487 88152 -33263 -132897 -77402 -90737 -146905 -151580 15328 -13808
20318 -13808 -33915 140240 -9486 -70998 -7581 59734 186199 301016 473495 443601 488096
20307 488096 510959 455184 478650 644202 642964 726093 682422 530831 520847 461084 445587
$$ packed form
20384d904j54994q4023J76531N142R2296N439j7984p1979j764K2498J29317J47736
20372B43311P3612j45055j87947m2664L3638j246R0115l6600M3477N6813n7779
20361F9675J48085J21090k09605j735j04662m0170N0288R5446L0765j2389j70493
20350b3705K9965J73275K3247j53766j18372M9559J78389N7608j91813j23228
20340i8841l6032O1614M6550r6430O8847j0497m3601m5603O4753J84037J52029
20329B46826r6024r3315L0665j21415r9634N5495j3335n6168m675J66908k9136
20318a3808k0107J74155j49726o1512O3417O7315J26465J14817J72479k9894M4495
20307D88096K2863n5775K3466J65552j238Q3129m3671j51591r984n9763j5497
$$ plain form
20296 445587 460940 476510 415384 646950 714395 641646 777874 1035683 952853 739119 777434
20285 777434 616769 483118 435871 367497 451385 526778 352457 130526 137063 232261 167782
20274 167782 274236 226529 170227 84954 69422 202996 176036 -32713 -32218 152275 220956
20263 220956 311755 334818 451720 487291 468283 440775 294856 138142 119846 325288 449510
20252 449510 453154 528096 670921 938641 1003464 889802 810801 680496 441089 461911 550818
20241 550818 628044 730168 820640 866255 822508 721727 615539 493382 393454 409725 314055
20230 314055 494777 513035 601132 695132 748215 771898 680999 519731 642328 825591 753471
20219 753471 671846 638566 710821 776708 828591 688382 544423 643744 749662 641051 667501
$$ packed form
20296D45587J5353J5570o1126K31566O7445p2749J36228K57809q2830k13734L8315
20285G77434j60665j33651m7247o8374Q3888P5393j74321k21931O537R5198o4479
20274A67782J06454m7707n6302q5273j5532J33574k6960k08749M95J84493O8681
20263B20956R0799K3063J16902L5571j9008k7508j45919j56714j8296K05442J24222
20252D49510L644P4942J42825K67720O4823j13662p9001j30305k39407K0822Q8907
20241E50818P7226J02124R0472M5615m3747j00781j06188j22157r9928J6271r5670
20230C14055J80722J8258Q8097R4000N3083K3683r0899j61268J22597J83263p2120
20219G53471q1625l3280P2255O5887N1883j40209j43959R9321J05918j08611K6450
$$ plain form
20208 667501 646788 636525 595885 372353 114675 21542 -37301 2454 227376 207492 120600
20197 120600 45376 155851 204505 136748 177905 277888 197422 205483 47714 56781 72042
20186 72042 191992 287682 135960 53987 152773 387182 633814 788920 772357 881337
20176 881337 762645 652058 590831 606604 843995 1046188 1049753 898521 793933 779691
20166 779691 795947 740192 506177 306847 334971 255070 212126 211097 247338 289272 50645
20155 50645 -35813 94796 136087 213096 106959 37020 74933 11608 -58130 -16144 41910
20144 41910 205507 226899 351461 340022 160585 -106517 -114565 -58925 173315 264632 143466
20133 143466 -59237 95969 153840 307670 319584 257809 15611 -130620 126633 186884
$$ packed form
20208F67501k0713j0263m0640k23532k57678r3133n8843L9755K24922j9884q6892
20197A20600p5224J10475M8654o7757M1157R9983q0466Q061j57769R067J5261
20186G2042J19950R5690j51722q1973R8786K34409K46632J55106j6563J08980
20176H81337j18692j10587o1227J5773K37391K02193L565j51232j04588j4242
20166G79691J6256n5755k34015j99330K8124p9901m2944j029L6241M1934k38627
20155E0645q6458J30609M1291P7009j06137o9939L7913o3325o9738M1986N8054
20144D1910J63597K1392J24562j1439j79437k67102q048N5640K32240R1317j21166
20133A43466k02703J55206N7871J53830J1914o1775k42198j46231K57253O0251
$$ plain form
20123 186884 166333 313323 235332 207079 286474 326259 276168 298595 382365 361952 290974
20112 290974 112277 44721 -156427 -53029 9948 113870 237554 151695 49369 89188
20102 89188 52657 115050 130060 148023 174872 104673 -84945 -17032 -23990 -61001 145877
20091 145877 141131 44994 147910 371680 328606 165865 126379 292099 259550 64686 75385
20080 75385 178238 289619 242976 200617 168983 133652 -8971 9192 149842 222096 140032
20069 140032 77878 -9096 -10254 42088 123075 48351 19866 38477 55795 95575 38546 77605
20057 77605 52799 -44315 77240 234882 392942 451412 303239 117723 142249 412998
20047 412998 535070 415880 252434 268168 472334 559026 528019 414541 253222 212060
$$ packed form
20123A86884k0551J46990p7991k8253P9395L9785n0091K2427Q3770k0413p0978
20112B90974j78697o7556k01148J03398O2977J03922J23684q5859j02326L9819
20102H9188l6531O2393J5010J7963K6849p0199j89618O7913o958l7011K06878
20091A45877m746r6137J02916K23770m3074j62741l9486J65720l2549j94864J0699
20080G5385J02853J11381m6643m2359l1634l5331j42623J8163J40650P2254q2064
20069A40032o2154q6974j158N2342Q0987p4724k8485J8611J7318L9780n7029L9059
20057G7605k4806r7114J21555J57642J58060N8470j48173j85516K4526K70749
20047D12998J22072j19190j63446J5734K04166Q6692l1007j13478j61319m1162
$$ plain form
20037 212060 315811 314416 388346 386188 549694 495045 303972 329106 364851 240400 93478
20026 93478 34464 158597 289399 335952 444516 474221 363931 245038 303626 372485 463644
20015 463644 365797 257987 208926 88498 -108367 33684 136298 170336 229115 325325
20005 325325 502674 669653 747220 700340 745326 1021439 990688 837448 917963 835561 630792
19994 630792 668297 891753 1253579 1542088 1522199 1572855 1654585 1603861 1535787 1277686 979768
19983 979768 966777 987864 884400 1131507 1150797 1072194 1096842 974228 828505 873485 645612
19972 645612 258031 -12298 132435 342338 326767 361279 451486 529883 394782 291582
19962 291582 264828 145322 38915 2775 132286 259637 325709 544529 554060 553734 558490
$$ packed form
20037B12060J03751j395P3930k158J63506n4649j91073K5134L5745j24451j46922
20026I3478n9014J24133J30802M6553J08564K9705j10290j18893N8588O8859R1159
20015D63644r7847j07810m9061j20428j96865J42051J02614L4038N8779R6210
20005C25325J77349J66979P7567m6880M4986K76113l0751j53240Q0515q2402k04769
19994F30792L7505K23456L61826K88509j9889N0656Q1730n0724o8074k58101k97918
19983I79768j2991K1087j03464K47107J9290p8603K4648j22614j45723M4980k27873
19972F45612l87581k70329J44733K09903j5571L4512R0207P8397j35101j03200
19962B91582k6754j19506j06407l6140J29511J27351O6072K18820R531l26M756
$$ plain form
19951 558490 650723 570764 438717 338172 279738 253259 274955 306091 389612 324494 450012
19940 450012 243708 23135 16296 113061 144241 218622 307624 253320 259724 306372 354967
19929 354967 440530 378356 396847 274439 223488 266394 389398 308921 481436 589973 555432
19918 555432 510326 587350 581183 553103 460192 427340 397149 407393 394143 479825 614033
19907 614033 680593 932814 966279 778297 726707 671475 648584 497380 551013 589167 670435
19896 670435 725465 689991 686327 806531 944604 856262 871245 747054 553922 587740 601035
19885 601035 573467 520019 468196 568976 691253 759520 882969 923379 844257 815401 657489
19874 657489 576527 599469 644546 712477 829329 947480 899276 716976 672348 596964 775916
$$ packed form
19951E58490R2233p9959j32047j00545n8434k6479K1696L1136Q3521o5118J25518
19940D50012k06304k20573o839R6765L1180P4381Q9002n4304O404M6648M8595
19929C54967Q5563o2174J8491j22408n0951M2906J23004q0477J72515J08537l4541
19918E55432m5106P7024o167k8080r2911l2852l0191J0244j3250Q5682J34208
19907F14033O6560K52221L3465j87982n1590n5232k2891j51204N3633L8154Q1268
19896F70435N5030l5474l664J20204J38073q8342J4983j24191j93132L3818J3295
19885F01035k7568n3448n1823J00780J22277O8267J23449M0410p9122k8856j57912
19874F57489q0962K2942M5077O7931J16852J18151m8204j82300m4628p5384J78952
$$ plain form
19863 775916 907818 753676 593840 472469 527272 718854 894076 938282 820838 789467
19853 789467 952101 1011738 760348 820516 989857 1150159 1161510 973017 1000513 1149232
19843 1149232 1153821 968202 980430 1258542 1463151 1457581 1474521 1564854 1550496 1521337 1511418
19832 1511418 1517074 1421062 1290348 1551733 1734961 1862919 2098599 2340988 2656847 2958411
19822 2958411 2951674 2968979 2942160 2951473 3182118 3496286 3868815 4255711 4578571 5013511
19812 5013511 5516782 5902361 6299850 6672514 7351468 8181422 9554822 11370335 13805993
19803 13805993 17517389 23630569 34343776 53060825 79261643 98444241 94239888
19796 94239888 76578782 62935188 60223264 70809999 95584851 124146995 131706711
$$ packed form
19863G75916J31902j54142j59836j21371N4803J91582J75222M4206j17444l1371
19853G89467J62634N9637k51390O0168J69341J60302J1351j88493K7496J48719
19843A149232M589j85619J2228K78112K04609n570J6940R0333j4358k9159r919
19832A511418N656r6012j30714K61385J83228J27958K35680K42389L15859L01564
19822B958411o737J7305k6819R313K30645L14168L72529L86896L22860M34940
19812E013511N03271L85579L97489L72664O78954Q29954J373400J815513K435658
19803A3805993L711396O113180J0713207J8717049K6200818J9182598m204353
19796I4239888j7661106j3643594k711924J0586735K4774852K8562144P559716
$$ plain form
19789 131706711 118950077 110630271 115743233 116698581 100476028 78620628 64134117
19782 64134117 61499130 71923327 94376190 113178031 105495022 78807974 53641105
19775 53641105 37358586 28082673 22259198 18352512 15516637 13729271 12488904 11615030
19767 11615030 11021782 10759833 10797441 10662028 10481305 10389694 10431398 10570847 10967651 11635280
19757 11635280 12806861 14474240 16725830 19981797 24995991 32941362 46956850 70970118
19749 70970118 99581082 110890235 97292640 77902292 67552431 70636814 88557497
19742 88557497 118453582 141198030 138106063 124623660 123902820 132670054 125739884 101268614
19734 101268614 78638284 68142896 71528421 89279348 115000405 125123842 105729301
$$ packed form
19789A31706711j2756634q319806N112962R55348j6222553k1855400j4486511
19782F4134117k634987J0424197K2452863J8801841p683009k6687048k5166869
19775E3641105j6282519r275913n823475l906686k835875j787366j240367q73874
19767A1615030n93248k61949L7608j35413j80723r1611M1704J39449L96804O67629
19757A1635280J171581J667379K251590L255967N014194P945371J4015488K4013268
19749G0970118K8610964J1309153j3597595j9390348j0349861L084383J7920683
19742H8557497K9896085K2744448l091967j3482403p20840Q767234o930170k4471270
19734A01268614k2630330j0495388L385525J7750927K5721057J0123437j9394541
$$ plain form
19727 105729301 75186221 50906523 35927980 26941914 21607014 18544577 16612081
19720 16612081 15139213 14415776 14005504 13893977 14174939 14854711 15714252 17179919 19549596
19711 19549596 23351687 30161733 42487408 63998325 93626861 112548246 104011183
19704 104011183 82660060 66885442 63132851 72409760 95543804 122260417 131235444
19697 131235444 128428609 132630935 134083796 115658767 88661229 68843337 61201275
19690 61201275 66288815 83373736 101216640 97221899 73972400 50534908 34617087
19683 34617087 25327177 19880802 16421491 14050548 12598239 11484203 10904232 10587685
19675 10587685 10378097 10215194 9956567 9969530 10035516 10304905 10545857 10686369 10962634 11682011
$$ packed form
19727A05729301l0543080k4279698j4978543q986066n334900l062437j932496
19720A6612081j472868p23437m10272j11527K80962O79772Q59541J465667K369677
19711A9549596L802091O810046J2325675K1510917K9628536J8921385q537063
19704A04011183k1351123j5774618l752591R276909K3134044K6716613Q975027
19697A31235444k806835M202326J452861j8425029k6997538j9817892p642062
19690F1201275N087540J7084921J7842904l994741k3249499k3437492j5917821
19683C4617087r289910n446375l459311k370943j452309j114036n79971l16547
19675A0587685k09588j62903k58627J2963O5986K69389K40952J40512K76265P19377
$$ plain form
19665 11682011 12670965 14330285 16790892 20358324 25858781 35592262 53479599 82869349
19657 82869349 117365635 129201744 110489853 85476628 71058382 70867321 85251973
19650 85251973 112018310 134762524 139835757 142855885 153915834 149772757 121116490
19643 121116490 89883665 70654628 65812813 75021658 94839867 106903063 93835068
19636 93835068 67551605 45172686 30942394 22516978 17470753 13914206 11368555 9551541
19628 9551541 8421690 7571732 6902408 5964425 5124743 4702283 4535161 4130066 3715473
19619 3715473 3322083 3039335 2628784 2194233 2017808 1941750 1810396 1915389 1700676 1530044
19609 1530044 1359649 993070 874272 811649 722142 603600 549425 737784 892937 840474
$$ packed form
19665A1682011R88954J659320K460607L567432N500457R733481J7887337K9389750
19657H2869349L4496286J1836109j8711891k5013225j4418246j91061J4384652
19650H5251973K6766337K2744214N073233L020128J1059949m143077k8656267
19643A21116490l1232825j9229037m841815R208845J9818209J2063196j3067995
19636I3835068k6283463k2378919j4230292q425416n046225l556547k545651j817014
19628I551541j129851q49958o69324r37983q39682m22460j67122m05095m14593
19619C715473l93390k82748m10551m34551j76425p6058j31354J04993k14713j70632
19609A530044j70395l66579j18798o2623q9507j18542n4175J88359J55153n2463
$$ plain form
19599 840474 857003 800871 609791 562281 566774 633505 481001 405001 371975 264478 230043
19588 230043 283472 120372 104171 45196 80109 55223 232175 247778 168116 252959 310754
19577 310754 282276 179991 120448 128942 218403 247672 163160 -24432 31324 85837 251995
19566 251995 490401 533883 222423 161344 250804 162957 47273 10234 -53406 -79155 83824
19555 83824 -72461 -143324 -98875 575 18593 139307 252391 139960 130080 112748 -24611
19544 -24611 -181616 -293696 -246844 -205962 -184330 -126293 -10704 -39011 -126871 -132193 -141436
19533 -141436 -269475 -242456 -27791 118873 265615 352399 226024 -12200 -91768 83375
19523 83375 138697 231165 238196 205188 314001 290233 276623 273907 -21012 -241037 -210258
$$ packed form
19599H40474J6529n6132j91080m7510M493O6731j52504p6000l3026j07497l4435
19588B30043N3429j63100j6201n8975L4913k4886J76952J5603p9662Q4843N7795
19577C10754k8478j02285n9543Q494Q9461K9269q4512j87592N5756N4513J66158
19566B51995K38406M3482l11460o1079Q9460q7847j15684l7039o3640k5749J62979
19555H3824j56285p0863M4449R9450J8018J20714J13084j12431r880j7332j37359
19544b4611j57005j12080M6852M0882K1632N8037J15589k8307q7860n322r243
19533a41436j28039K7019K14665J46664J46742Q6784j26375k38224p9568J75143
19523H3375N5322R2468P031l3008J08813k3768j3610k716k94919k20025L0779
$$ plain form
19512 -210258 -72132 -88525 -219159 -215853 -97667 89442 119666 55596 208880 76103
19502 76103 27143 140651 98404 -44731 -116670 -130485 -33465 55514 61501 -113035 -89939
19491 -89939 -95251 -180868 -313481 -346471 -213432 -114565 -53989 -142119 -207367 -199881 -109915 -173932
19479 -173932 92995 206111 34886 -152 -136835 -238136 -67651 86894 260022 425346
19469 425346 316149 314705 278100 417576 252755 210055 182504 194611 314420 420855 310357
19458 310357 271381 145964 148356 214398 192308 230692 91351 -15736 41032 318 38797
19447 38797 -153692 -338264 -307265 -182746 -138332 -196078 -98012 141935 315058 340695 277010
19436 277010 249524 252989 321149 140930 9386 133199 74615 -11724 -125486 -156829 -42858
$$ packed form
19512b10258J38126j6393j30634L306J18186J87109L0224o4070J53284j32777
19502G6103m8960J13508m2247j43135p1939j3815R7020Q8979N987j74536K3096
19491h9939n312q5617j32613l2990J33039R8867O0576q8130o5248P486Q9966o4017
19479a73932K66927J13116j71225l5038j36683j01301J70485J54545J73128J65324
19469D25346j09197j444l6605J39476j64821m2700k7551J2107J19809J06435j10498
19458C10357l8976j25417K392O6042k2090L8384j39341j07087N6768m0714L8479
19447C8797j92489j84572L0999J24519M4414n7746R8066K39947J73123K5637o3685
19436B77010k7486L465O8160j80219j31544J23813n8584q6339j13762l1343J13971
$$ plain form
19425 -42858 66974 -27290 -125479 -89031 -816 322018 273925 204071 214864 106333 229000
19414 229000 235440 123975 -27592 -37652 -6374 21530 -3472 100596 251548 -29947 -170574
19403 -170574 -279832 -310465 -86395 32351 20302 -106896 -147695 -159826 -78191 -95374 -85797
19392 -85797 -170125 -120026 124743 272191 206828 44220 -14199 -126897 -108369 -81949 -68742
19381 -68742 -78424 -33557 51393 -32880 -120825 -65945 65403 212634 155735 127152 168044
19370 168044 37172 -139367 75420 17205 -98410 -128289 -20121 14977 -118254 -253951
19360 -253951 -233817 -336540 -323962 -202755 -92031 110884 348497 330385 227736 104202
19350 104202 116548 54850 -140927 -55566 164024 229411 151697 62276 74375 10271 -49526
$$ packed form
19425d2858J09832r4264r8189L6448Q8215L22834m8093o9854J0793j08531J22667
19414B29000O440j11465j51567j0060L1278K7904k5002J04068J50952k81495j40627
19403a70574j09258l0633K24070J18746j2049j27198m0799j2131Q1635j7183R577
19392h5797q4328N0099K44769J47448o5363j62608n8419j12698J8528K6420J3207
19381f8742r682M4867Q4950q4273q7945N4880J31348J47231n6899k8583M0892
19370A68044j30872j76539K14787n8215j15615k9879J08168L5098j33231j35697
19360b53951K0134j02723J2578J21207J10724K02915K37613j8112j02649j23534
19350A04202J2346o1698j95777Q5361K19590O5387p7714q9421J2099o4104n9797
$$ plain form
19339 -49526 22088 149195 165006 199375 190959 -25049 -112869 66005 230648 113405 152304
19328 152304 -32171 -3327 5256 279617 391688 410451 329912 233440 153054 56054 197893
19317 197893 419449 462549 287706 173179 202946 260765 483795 569412 426508 244042
19307 244042 270602 320493 395827 358931 288208 320576 504396 466580 209697 356075 553237
19296 553237 708078 772070 856652 1155707 1404484 1460922 1227787 992379 785711 761431
19286 761431 661000 593629 589505 659164 662618 580840 620910 784903 744700 757982 818340
19275 818340 826573 885122 1061903 1073978 1041976 982018 887088 802864 727328 783591 665425
19264 665425 652927 810242 937268 968438 824140 620945 586955 535393 657633 790765
$$ packed form
19339d9526P1614J27107J5811L4369q416k16008q7820J78874J64643j17243L8899
19328A52304j84475K8844Q583K74361J12071J8763q0539r6472q0386r7000J41839
19317A97893K21556M3100j74843j14527K9767N7819K23030Q5617j42904j82466
19307B44042K6560M9891P5334l6896p0723L2368J83820l7816k56883J46378J97162
19296E53237J54841O3992Q4582K99055K48777N6438k33135k35408k06668k4280
19286G61431j00431o7371m124O9659L454q1778M0070J63993m0203J3282O0358
19275H18340Q233N8549J76781J2075l2002n9958r4930q4224p5536N6263j18166
19264F65425j2498J57315J27026L1170j44298k03195l3990n1562J22240J33132
$$ plain form
19254 790765 801595 598493 564341 772988 873411 999960 1253035 1578617 2145346 2265317
19244 2265317 2180991 2192090 2045675 1745613 1615761 1661514 1610361 1732786 2022069 2660636
19234 2660636 3414315 4023485 4504030 4767681 4597384 4015097 3307629 2662453 2341653
19225 2341653 2394319 2503147 2534812 2761191 3007453 3138709 3096680 3406006 3764088 3823409
19215 3823409 4125531 4670766 5325264 5873411 6417861 6823980 6522007 5805520 5065140
19206 5065140 4636050 4500061 4451050 4793575 5335826 6002619 6851574 7788383 8866001
19197 8866001 10289784 11707847 13212032 15294626 18432311 22981347 29154370 38554912
19189 38554912 53849197 80187498 128337331 213776412 330674163 395933135 342945349
$$ packed form
19254G90765J0830k03102l4152K08647J00423J26549K53075L25582N66729J19971
19244B265317q4326J1099j46415l00062j29852M5753n1153J22425K89283O38567
19234B660636P53679O09170M80545K63651j70297n82287p07468o45176l20800
19225B341653N2666J08828L1665K26379K46262J31256m2029L09326L58082N9321
19215C823409L02122N45235O54498N48147N44450M06119l01973p16487p40380
19206E065140m29090j35989m9011L42525N42251O66793Q48955R36809J077618
19197H866001J423783J418063J504185K082594L137685M549036O173023R400542
19189C8554912J5294285K6338301M8149833Q5439081J16897751O5258972n2987786
$$ plain form
19182 342945349 237654649 151244526 98688923 69240924 52086527 41690527 35403113
19175 35403113 31834710 30175905 30424661 32561409 36554490 43055529 53808415 72795200
19167 72795200 107612898 172304694 279596078 393385764 407070450 313331377 203396409
19160 203396409 126735134 82347513 57093442 41837885 32011755 25468594 21011545
19153 21011545 17734945 15357047 13382729 11886341 10581322 9155675 7833398 7063941
19145 7063941 6643587 6278573 5757876 5210741 4959764 4770653 4792274 5373953 5635880 5238295
19135 5238295 4724740 4609562 4741744 4780671 4586680 4380659 4010068 3461290 2842071 2404904
19125 2404904 2350368 2329173 2337626 2531377 2734398 2926161 3466426 3949328 4476571 4717670
$$ packed form
19182C42945349j05290700q6410123n2555603k9447999j7154397j0396000o287414
19175C5403113l568403j658805K48756K136748L993081O501039J0752886J8986785
19167G2795200L4817698O4691796J07291384J13789686J3684686r3739073j09934968
19160B03396409p6661275m4387621k5254071j5255557r826130o543161m457049
19153B1011545l276600k377898j974318j496388j305019j425647j322277p69457
19145G063941m20354l65014n20697n47135k50977j89111K1621N81679K61927l97585
19135E238295n13555j15178J32182L8927j93991k06021l70591n48778o19219m37167
19125B404904n4536k1195Q453J93751K03021J91763N40265M82902N27243K41099
$$ plain form
19115 4717670 4419008 4023695 3903380 3713587 3332243 2916541 2241252 1828159 1536285
19106 1536285 1292076 1004459 717514 512548 475790 595431 625104 681340 549373 492556
19096 492556 311720 208808 73722 47869 195821 231710 322995 479852 463445 430415
19086 430415 445130 503225 557874 537289 532398 511785 484044 431439 350456 346077 330096 403410
19074 403410 442597 303099 236110 277525 149750 111949 130155 44668 -45478 139378 165842
19063 165842 149818 319217 242926 331020 590026 565101 381276 317302 295148 288386 168864
19052 168864 35197 -30577 -180550 -162397 -21019 33763 73466 79445 169047 205269 98110
19041 98110 136086 212504 299258 314801 259568 439663 381297 222670 177625 243904 185201
$$ packed form
19115D717670k98662l95313j20315j89793l81344m15702o75289m13093k91874
19106A536285k44209k87617k86945k04966l6758J19641K9673N6236j31967n6817
19096D92556j80836j02912j35086k5853J47952L5889R1285J56857j6407l3030
19086D30415J4715N8095N4649k0585m891k0613k7741n2605q0983m379j5981P3314
19074D03410L9187j39498o6989M1415j27775l7801J8206q5487r0146J84856K6464
19063A65842j6024J69399p6291Q8094K59006k4925j83825o3974k2154o762j19522
19052A68864j33667o5774j49973J8153J41378N4782L9703N979Q9602L6222j07159
19041I8110L7976P6418Q6754J5543n5233J80095n8366j58627m5045O6279n8703
$$ plain form
19030 185201 21988 32391 66866 -6831 -233329 -148491 -98453 46125 174529 134299 117615
19019 117615 172259 114874 188362 255875 74076 -64899 -89098 -144208 -38977 104062 29901
19008 29901 166562 247843 215439 197877 95584 187692 52340 -176293 -157329 -220433 -128734
18997 -128734 -27172 -44668 -23441 64592 86307 114607 46568 18466 163899 175051 -6309
18986 -6309 126671 389982 1016059 1682046 1873861 2059336 2062650 1711570 1300013 840906
18976 840906 630581 436624 292725 259189 246417 274104 232631 257402 352508 325950 394947
18965 394947 575667 855659 1003069 1201861 1382610 1475357 1336034 971609 732280 439754
18955 439754 199702 194973 195554 225054 106728 86431 133795 -19804 -130164 -82481 90388
$$ packed form
19030A85201j63213J0403L4475p3697k26498Q4838N0038J44578J28404m0230j6684
19019A17615N4644n7385P3488O7513j81799j38975k4199n5110J05231J43039p4161
19008B9901J36661Q1281l2404j7562j02293R2108j35352k28633J8964o3104R1699
18997a28734J01562j7496K1227Q8033K1715K8300o8039k8102J45433J1152j81360
18986f309J32980K63311O26077O65987J91815J85475L314l51080m11557m59107
18976H40906k10325j93957j43899l3536j2772K7687m1473K4771R5106k6558O8997
18965C94947J80720K79992J47410J98792J80749R2747j39323l64425k39329k92526
18955D39754k40052m729N81K9500j18326k0297M7364j53599j10360M7683J72869
$$ plain form
18944 90388 280610 247420 63721 263701 444875 455386 311350 218709 279678 348553 296018
18933 296018 292332 216911 800 -200716 -217318 -285630 -183845 -272993 -295214 -90856 167994
18922 167994 194689 226267 308813 246090 123875 -143529 -175037 -1592 -19800 -41402 98405
18911 98405 27993 -15961 132800 252763 298717 243281 235826 159172 -60834 -112730 -204896
18900 -204896 -208129 8869 25775 -93980 -233979 -52110 96662 248295 252289 131660
18890 131660 84139 173748 496186 654030 520911 395595 370751 260558 247912 312203
18880 312203 197728 164107 98300 42368 19154 61865 167236 262187 346670 379250 325553
18869 325553 269500 193888 214801 130981 39004 28458 142444 116740 -21299 127967 292514
$$ packed form
18944I0388J90222l3190j83699J99980J81174J0511j44036r2641O0969O8875n2535
18933B96018l686p5421k16111k01516j6602o8312J01785q9148k2221K04358K58850
18922A67994K6695L1578Q2546o2723j22215k67404l1508J73445j8208k1602J39807
18911I8405p0412m3954J48761J19963M5954n5436p455p6654k20006n1896r2166
18900b04896l233K16998J6906j19755j39999J81869J48772J51633L994j20629
18890A31660m7521Q9609L22438J57844j33119j25316k4844j10193j2646O4291
18880C12203j14475l3621o5807n5932k3214M2711J05371R4951Q4483L2580n3697
18869C25553n6053p5612K0913q3820r1977j0546J13986k5704j38039J49266J64547
$$ plain form
18858 292514 260766 180604 280939 344864 230058 262985 337837 334874 288858 174541 211101
18847 211101 312708 311387 422969 156739 44984 82110 35064 142321 139955 231147 386299
18836 386299 331062 355277 348932 352077 475870 447575 212345 247709 581161 685522 588965
18825 588965 566079 571796 553789 600022 801311 965008 995066 1005165 978600 1015669 987612
18814 987612 816374 798081 846224 862344 1052091 1349071 1701423 2202907 2477669 2481184
18804 2481184 2665624 2933536 2915568 2756811 2736923 2723310 2718039 2730292 2815873 3089770 3583847
18793 3583847 4182201 4829393 5645084 7007381 8897737 11469872 15014201 20333978 28556939
18784 28556939 41991040 65403645 101818589 135882526 143954238 141593876 147223075
$$ packed form
18858B92514l1748q0162J00335O3925j14806L2927P4852k963m6016j14317L6560
18847B11101J01607j321J11582k66230j11755L7126m7046J07257k366R1192J55152
18836C86299n5237K4215o345L145J23793k8295k35230L5364L33452J04361r6557
18825E88965k2886N717j8007M6233K01289J63697L0058J0099k6565L7069k8057
18814I87612j71238j8293M8143J6120J89747K96980L52352N01484K74762L515
18804B481184J84440K67912j7968j58757j9888j3613n271J2253Q5581K73897M94077
18793C583847N98354O47192Q15691J362297J890356K572135L544329N319777Q222961
18784B8556939J3434101K3412605L6414944L4063937Q071712k360362N629199
$$ plain form
18777 147223075 142051352 112044138 76882486 51443622 35978054 26644131 20722472
18770 20722472 16719380 13878685 12088472 11243438 10485566 9213546 7958221 7015230
18762 7015230 6428948 6060537 6106312 6357994 7052003 7808005 8271877 8602734 8756513 8608361
18752 8608361 8020879 7294746 6598720 6174599 6142196 6199601 6614458 7102508 7789448 8686337
18742 8686337 9979206 11634704 14000633 17584750 22704584 30129894 41410083 58788393
18734 58788393 88366944 139649486 210431286 256808561 257553680 257221161 267274609 240104252
18726 240104252 176548006 117348418 78465708 55224445 40985271 31609120 25011476
18719 25011476 20233208 16770709 14121664 12132420 10592743 9516084 8546316 7930230
$$ packed form
18777A47223075n171723l0007214l5161652k5438864j5465568r333923n921659
18770B0722472m003092k840695j790213q45034p57872j272020j255325r42991
18762G015230n86282l68411M5775K51682O94009P56002M63872L30857J53779j48152
18752H608361n87482p26133o96026m24121l2403N7405M14857M88050O86940Q96889
18742H686337J292869J655498K365929L584117N119834P425310J1280189J7378310
18734E8788393K9578551N1282542P0781800M6377275P45119l32519J0053448k7170357
18726B40104252o3556246n9199588l8882710k3241263j4239174r376151o597644
18719B5011476m778268l462499k649045j989244j539677j076659r69768o16086
$$ plain form
18711 7930230 7593679 7402102 7292424 7580608 8148952 8463395 8465790 8188302 7888269 7533063
18701 7533063 6733445 5769708 4832051 4309899 4221257 4425622 4687977 4977751 5364199 5818542
18691 5818542 6651884 7827414 9641050 12193055 16224592 22202622 31721765 48247122
18683 48247122 75983391 107516775 119870653 116988261 120046994 121092783 100274417
18676 100274417 69766597 45690133 30917245 22200234 16731089 12797313 10303111
18669 10303111 8505265 7155390 6127593 5232186 4536759 4031647 3734282 3464574 3150908
18660 3150908 2876867 2889183 2890438 2980904 3000789 2960369 2878011 2717342 2358467 1933133 1634800
18649 1634800 1335999 1238625 1199675 1073644 897629 739262 584132 613759 818323 986937
$$ packed form
18711G930230l36551j91577j09678K88184N68344L14443K395k77488l00033l55206
18701G533063p99618r63737r37657n22152q8642K04365K62355K89774L86448M54343
18691E818542Q33342J175530J813636K552005M031537N978030R519143J6525357
18683D8247122K7736269L1533384J2353878k882392L058733J045789k0818366
18676A00274417l0507820k4076464j4772888q717011n469145l933776k494202
18669A0303111j797846j349875j027797q95407o95427n05112k97365k69708l13666
18660C150908k74041J2316J255R0466J9885m0420q2358j60669l58875m25334k98333
18649A634800k98801r7374l8950j26031j76015j58367j55130K9627K04564J68614
$$ plain form
18639 986937 852684 845654 725170 598985 648235 697993 529909 456057 468132 516534 465517
18628 465517 350438 329337 404586 322635 390570 272447 134878 167880 208359 300958 371861
18617 371861 361023 437490 596092 753355 881930 767967 647823 450983 179489 84892
18607 84892 206898 360095 448648 538829 552913 431017 396326 338416 305171 146579 132698
18596 132698 185159 163777 251524 471819 505365 661113 1098443 1564823 1687421 1487169
18586 1487169 1300795 1043694 847364 669146 519588 339185 279379 153994 -132427 -150640
18576 -150640 14784 281138 375233 438367 607677 680160 980400 1481983 2022299 2572603
18566 2572603 2652197 2250948 1737881 1287219 785835 456815 357087 463027 553786 421617
$$ packed form
18639I86937j34253p030j20484j26185M9250M9758j68084p3852J2075M8402n1017
18628D65517j15079k1101P5249q1951O7935j18123j37569L3002M0479R2599P0903
18617C71861j0838P6467J58602J57263J28575j13963j20144j96840k71494r4597
18607H4892J22006J53197Q8553R0181J4084j21896l4691n7910l3245j58592j3881
18596A32698N2461k1382Q7747K20295L3546J55748M37330M66380J22598k00252
18586A487169j86374k57101j96330j78218j49558j80403n9806j25385k86421j8213
18576a50640J65424K66354R4095O3134J69310P2483L00240N01583N40316N50304
18566B572603P9594m01249n13067m50662n01384l29020r9728J05940R0759j32169
$$ plain form
18556 421617 275251 36092 120056 250932 338295 312083 165740 -12781 -28997 14808
18546 14808 249665 340127 259937 163335 85855 -68168 3411 206863 253260 156389 130577
18535 130577 184991 123057 118328 -38862 76961 103478 186509 186870 146466 168482 98169 91316
18523 91316 102777 247331 254554 228108 122876 219046 228005 259621 222684 177686 210879 261732
18511 261732 340495 273152 162182 208041 61814 -98731 39049 9407 -77756 39203
18501 39203 135909 163514 121249 148715 236393 227808 184357 133587 114011 253358 332138 345519
18489 345519 353863 527020 485240 358355 45173 -33505 92321 136932 237304 317200 259913
18478 259913 191326 219110 114071 67531 165943 192618 9244 -132546 -178510 -32332 145510
$$ packed form
18556D21617j46366k39159Q3964J30876Q7363k6212j46343j78521j6216M3805
18546A4808K34857R0462q0190r6602p7480j54023P1579K03452M6397r6871k5812
18535A30577N4414o1934m729j57190J15823K6517Q3031L61m0404K2016p0313o853
18523I1316J1461J44554P223k6446j05232R6170Q959L1616l6937m4998L3193N0853
18511B61732P8763o7343j10970M5859j46227j60545J37780k9642q7163J16959
18501C9203R6706K7605m2265K7466Q7678q585m3451n0770j9576J39347P8780J3381
18489C45519Q344J73157m1780j26885l13182p8678J25826M4611J00372P9896n7287
18478B59913o8587K7784j05039m6540R8412K6675j83374j41790m5964J46178J77842
$$ plain form
18467 145510 300365 292420 166650 176949 139883 15612 -92449 -224833 -63642 159004
18457 159004 319146 281790 205402 137180 128142 197201 200268 245319 252273 263987 321868 261297
18445 261297 455786 383360 296004 180257 149942 184717 361899 425899 187583 157365 257133
18434 257133 424547 409705 440517 649555 761803 727289 629263 592702 505289 541442 588940
18423 588940 736094 708674 853067 945392 1167410 1203312 1214409 1319695 1302838 1446598
18413 1446598 1659145 1875774 2137287 2520496 2770685 3146260 3740697 4691871 5921967
18404 5921967 6792321 7052685 7040543 6824741 6523818 6386763 6719939 7472837 8328270 9791657
18394 9791657 11810676 14787448 19194795 25300734 34281769 48954603 75573398 126759270
$$ packed form
18467A45510J54855p945j25770J0299l7066j24271j08061j32384J61191K22646
18457A59004J60142l7356p6388o8222r038O9059L067M5051O954J1714N7881o0571
18445B61297J94489p2426q7356j15747l0315L4775J77182O4000k38316l0218R9768
18434B57133J67414j4842L0812K09038J12248l4514r8026l6561q7413L6153M7498
18423E88940J47154k7420J44393R2325K22018L5902J1097J05286j6857J43760
18413A446598K12547K16629K61513L83209K50189L75575N94437R51174J230096
18404E921967Q70354K60364j2142k15802l00923j37055L33176P52898Q55433J463387
18394I791657K019019K976772M407347O105939Q981035J4672834K6618795N1185872
$$ plain form
18386 126759270 222397321 359131897 443552314 391203799 269521846 167668014 106523413
18379 106523413 73027671 53554327 41327896 33991021 29988944 27806526 27381264 28593019
18371 28593019 31687155 37160434 46207634 62710851 95177671 158732591 269520408
18364 269520408 392523548 417789619 324979191 208735144 127345609 81563502 56172521
18357 56172521 40694731 30728584 24376263 19975115 16717325 14254928 12498000 10845182
18349 10845182 9289556 8337219 7795072 7483245 7467938 7722968 8385808 8508051 7718166
18340 7718166 6347825 5116614 4018385 3436835 3179001 2964736 2770964 2575551 2500480
18331 2500480 2034778 1776267 1515715 1513911 1603794 1479724 1405582 1388896 1327019 1537796
$$ packed form
18386A26759270R5638051J36734576Q4420417n2348515j21681953j01853832o1144601
18379A06523413l3495742j9473344j2226431p336875m002077k182418m25262J211755
18371B8593019L094136N473279R047200J6503217L2466820O3554920J10787817
18364B69520408J23003140K5266071r2810428j16244047q1389535m5782107k5390981
18357E6172521j5477790r966147o352321m401148l257790k462397j756928j652818
18349A0845182j555626r52337n42147l11827j5307K55030O62840J22243p89885
18340G718166j370341j231211j098229n81550k57834k14265j93772j95413p5071
18331B500480m65702k58511k60552j804Q9883j24070p4142j6686o1877K10777
$$ plain form
18321 1537796 1643119 1796573 2047408 1956722 1647965 1535878 1423791 1451900 1373403 1165601
18311 1165601 1045101 967368 789506 662949 697312 841272 936771 866860 676350 633379
18301 633379 600285 718499 905411 1159363 1153549 879364 639782 534105 394833 353836
18291 353836 428139 431686 210457 80659 196990 382506 513363 603148 548183 568166 729951
18280 729951 680052 427475 437468 608680 563276 434330 474337 581538 530772 306677 261891
18269 261891 398937 540231 594174 471728 346323 309316 447396 554357 770878 914143
18259 914143 902681 1048935 1106522 952631 729123 503338 327099 309965 249277 169406
18249 169406 201332 262877 208362 103068 101740 207613 221696 186744 229948 466133 533483
$$ packed form
18321A537796J05323J53454K50835r0686l08757j12087j12087K8109p8497k07802
18311A165601j20500p7733j77862j26557L4363J43960R5499o9911j90510m2971
18301F33379l3094J18214J86912K53952n814k74185k39582j05677j39272m0997
18291C53836P4303L547k21229j29798J16331J85516J30857Q9785n4965J9983J61785
18280G29951m9899k52577R993J71212m5404j28946M0007J07201n0766k24095m4786
18269B61891J37046J41294N3943j22446j25405l7007J38080J06961K16521J43265
18259I14143j1462J46254N7587j53891k23508k25785j76239j7134o0688p9871
18249A69406L1926O1545n4515j05294j328J05873J4083l4952M3204K36185O7350
$$ plain form
18238 533483 430154 434054 406161 461683 504361 277622 270545 206971 186599 164834 83348
18227 83348 166341 308496 249936 212595 161202 119223 41746 119481 205443 302090 465793
18216 465793 525319 473663 537218 650375 587771 787785 1234284 1573861 1639037 1637285 1572392
18205 1572392 1411006 1234311 949906 794179 546525 520446 583996 464991 207224 -36066
18195 -36066 -59007 -9876 84178 201681 274476 381774 319902 293701 202655 176626 126635
18184 126635 -113072 -100036 47350 26920 380 20858 25121 96623 157135 55979 -116077
18173 -116077 -245357 -143375 12872 139227 229789 387974 624114 669889 429126 297830
18163 297830 273380 223781 416895 559349 675447 792486 895754 907854 882068 738567
$$ packed form
18238E33483j03329L900k7893N5522M2678k26739p077o3574k0372k1765q1486
18227H3348Q2993J42155n8560l7341n1393m1979p7477P7735Q5962R6647J63703
18216D65793N9526n1656O3555J13157o2604K00014M46499L39577O5176j752o4893
18205A572392j61386j76695k84405j55727k47654k6079O3550j19005k57767k43290
18195c6066k2941M9131R4054J17503P2795J07298o1872k6201r1046k6029m9991
18184A26635k39707J3036J47386k0430k6540K0478M263P1502O0512j01156j72056
18173a16077j29280J01982J56247J26355R0562J58185K36140M5775k40763j31296
18163B97830k4450m9599J93114J42454J16098J17039J03268J2100k5786j43501
$$ plain form
18153 738567 673978 549328 575845 451732 298575 189622 387453 537738 615120 614731 623536
18142 623536 615436 727376 872020 997433 1008586 1016185 1229186 1360981 1613817 1719008
18132 1719008 1742414 1794662 1895068 2118304 2123055 2165908 2505699 2934929 3311800 3545315
18122 3545315 4089300 4704134 5544564 6636532 8366714 10872415 14318358 19145828 26293161
18113 26293161 37848118 58838182 101131695 188737129 341491245 452236335 380501047
18106 380501047 240284196 137027835 82122349 53939282 38055784 27981258 21743111
18099 21743111 17845605 14954582 12668278 10715082 9094665 7764903 6883162 6091735
18091 6091735 5470447 4943695 4486760 4135449 3838513 3566869 3131958 2534992 2130049
$$ packed form
18153G38567o4589j24650K6517j24113j53157j08953J97831J50285P7382l89Q805
18142F23536q100J11940J44644J25413J1153P599K13001J31795K52836J05191
18132A719008K3406N2248J00406K23236M751M2853L39791M29230L76871K33515
18122C545315N43985O14834Q40430J091968J730182K505701L445943M827470P147333
18113B6293161J1554957K0990064M2293513Q7605434J52754116J10745090p1735288
18106C80501047j40216851j03256361n4905486k8183067j5883498j0074526o238147
18099B1743111l897506k891023k286304j953196j620417j329762q81741p91427
18091F091735o21288n26752m56935l51311k96936k71644m34911n96966m04943
$$ plain form
18082 2130049 1920615 1900891 1863581 1720088 1565233 1610549 1425610 1312800 1176497 1231723
18072 1231723 1123752 1036272 937130 980218 1015332 1047235 883382 821031 838846 875715 857360
18061 857360 806518 761812 908515 995878 818863 690211 687067 653367 721495 550996 412805
18050 412805 592295 537849 336090 349739 216114 217936 411028 506352 461905 500027 538235
18039 538235 501906 393956 336134 248103 199211 204632 249056 155873 150243 296327 439493
18028 439493 558393 317054 379040 491830 601274 382696 156333 130842 130461 240686
18018 240686 261231 299014 315399 287531 193968 73502 306875 568433 467554 218468
18008 218468 129642 145581 54430 110313 228042 245912 184884 124550 189113 306091 348619
$$ packed form
18082B130049k09434j9724l7310j43493j54855M5316j84939j12810j36303N5226
18072A231723j07971q7480r9142M3088L5114L1903j63853o2351J7815L6869j8355
18061H57360n0842m4706J46703Q7363j77015j28652l144l3700O8128j70499j38191
18050D12805J79490n4446k01759J3649j33625J822J93092R5324m4447L8122L8208
18039E38235l6329j07950n7822q8031m8892N421M4424r3183n630J46084J43166
18028D39493J18900k41339O1986J12790J09444k18578k26363k5491l81J10225
18018B40686K0545L7783J6385k7868r3563j20466K33373K61558j00879k49086
18008B18468q8826J5939r1151N5883J17729J7870o1028o0334O4563J16978M2528
$$ plain form
17997 348619 207522 3333 19774 -25630 89923 207953 190727 185228 202272 272677 248961
17986 248961 78142 -84948 61758 329109 347580 206729 251832 190830 151306 143110 -35859
17975 -35859 -5403 162721 136976 153734 89333 145958 284617 88853 -47706 27538 128805
17964 128805 183944 306592 296137 269002 128783 26932 66454 153527 213260 259927 211844
17953 211844 52604 -6402 56955 28808 76201 245602 247224 318972 370724 243740 51362
17942 51362 75964 824 -36063 13995 94915 137081 205158 268529 255557 96434 61042
17931 61042 202169 289002 221173 73215 123195 -44109 -182456 -100454 47065 65545 34704
17920 34704 -85191 -18631 57153 33138 -96428 -37227 66065 156397 157702 166393 235554
$$ packed form
17997C48619j41097k04189J6441m5404J15553J18030j7226n499J7044P0405k3716
17986B48961j70819j63090J46706K67351J8471j40851M5103o1002l9524q196j78969
17975c5859L0456J68124k5745J6758o4401N6625J38659j95764j36559P5244J01267
17964A28805N5139J22648j0455k7135j40219j01851L9522Q7073N9733M6667m8083
17953B11844j59240n9006O3357k8147M7393J69401J622P1748N1752j26984j92378
17942E1362K4602p5140l6887N0058Q0920M2166O8077O3371j2972j59123l5392
17931F1042J41127Q6833o7829j47958M9980j67304j38347Q2002J47519J8480l0841
17920C4704j19895O6560P5784k4015j29566N9201J03292R0332J305Q691O9161
$$ plain form
17909 235554 69687 -16608 16031 200654 84950 -28507 -163280 -94670 -33487 -47240
17899 -47240 -119124 -18778 151411 141414 34371 -88242 -107490 -67773 -156348 -123269 -127299
17888 -127299 -112054 16105 88131 50228 234760 333100 249200 161565 87943 161805 199191
17877 199191 186736 5634 -65620 3836 101892 96576 131171 242235 139771 142905 60484
17866 60484 -41001 -5328 -4434 131148 67407 128190 474621 390953 251538 149019 134289
17855 134289 18254 -54851 -28358 -54163 116133 301316 382371 404750 420754 365906 252926
17844 252926 201607 57709 45951 100692 131007 17416 110038 169964 114799 122374 159171
17833 159171 256179 251671 290927 147780 25239 20370 -95913 -64774 -97028 -128441 -67132
$$ packed form
17909B35554j65867q6295L2639J84623j15704j13457j34773O8610O1183j3753
17899d7240p1884J00346J70189r997j07043j22613j9248L9717q8575L3079m030
17888a27299J5245J28159P2026l7903J84532R8340q3900q7635p3622P3862L7386
17877A99191j2455j81102p1254O9456R8056n316L4595J11064j02464L134q2421
17866F0484j01485L5673Q94J35582o3741O0783L46431q3668j39415j02519j4730
17855A34289j16035p3105K6493k5805J70296J85183Q1055K2379J6004n4848j12980
17844B52926n1319j43898j1758N4741L0315j13591R2622N9926n5165P575L6797
17833A59171R7008m508L9256j43147j22541m869j16283L1139l2254l1413O1309
$$ plain form
17822 -67132 110278 137204 114899 58446 55189 91311 24163 -19466 -2328 31260 107094 -24172
17810 -24172 -28569 -149306 -8042 106314 204053 222863 351033 534170 554498 556009 438505
17799 438505 417131 410356 311548 182657 101963 90741 -4182 -60929 -137889 -39088 10102
17788 10102 -10380 28872 289088 371012 549021 751743 785480 1280172 1777470 2054572
17778 2054572 1919208 1452272 1109221 898979 726486 379947 228621 171754 4562 -113849
17768 -113849 -109059 595 173379 169434 260722 409351 668665 1042445 1472157 1890059
17758 1890059 2074136 1676358 1080421 675499 516762 341733 265373 400433 457795 415824
17748 415824 105042 15741 145020 160915 65697 -61554 -933 217880 299308 267384 294573
$$ packed form
17822f7132J77410K6926k2305n6453l257L6122o7148m3629J7138L3588P5834j31266
17810b4172m397j20737J41264J14356R7739J8810J28170J83137K0328J511j17504
17799D38505k1374o775r8808j28891q0694j1222r4923n6747p6960R8801M9190
17788A0102k0482L9252K60216Q1924J78009K02722L3737M94692M97298K77102
17778B054572j35364m66936l43051k10242j72493l46539j51326n6867j67192j18411
17768a13849M790J09654J72784l945R1288J48629K59314L73780M29712M17902
17758A890059J84077l97778n95937m04922j58737j75029p6360J35060N7362m1971
17748D15824l10782q9301J29279J5895r5218j27251O0621K18813Q1428l1924K7189
$$ plain form
17737 294573 98681 119011 232829 199178 188940 97145 -113081 -284214 -42892 485
17727 485 -114544 -79850 73974 168070 153874 214275 136198 16422 -57204 37808 142085
17716 142085 179261 -49809 -118504 1019 -1642 -111014 -248001 -197328 -244523 -129309 -76927
17705 -76927 -19407 -76346 -196256 -182043 -138250 74500 -48096 -77471 -8620 -68318 -76376
17694 -76376 21002 182546 223539 145593 -10416 -28667 -50445 28692 -133942 -76707 -50896
17683 -50896 -163161 -90314 40629 -87157 -164460 -153506 -206920 -178429 -207102 -132220 37810
17672 37810 12908 52100 54886 175700 107071 88774 72377 66683 255812 354648 393104 184278
17660 184278 10679 -14692 -143733 -182822 -2885 19244 82281 153594 353541 153292
$$ packed form
17737B94573j95892K0330J13818l3651j0238r1795k10226j71133K41322M3377
17727D85j15029L4694J53824R4096j4196O0401p8077j19776p3626R5012J04277
17716A42085L7176k29070o8695J19523k661j09372j36987N0673m7195J15214N2382
17705g6927N7520n6939j19910J4213M3793K12750j22596k9375O8851n9698q058
17694g6376R7378J61544M0993p7946j56009j8251k1778P9137j62634N7235K5811
17683e0896j12265P2847J30943j27786p7303J0954n3414K8491k8673P4882J70030
17672C7810k4902L9192K786J20814o8629j8297j6397n694J89129R8836L8456k08826
17660A84278j73599k5371j29041l9089J79937K2129O3037P1313J99947k00249
$$ plain form
17650 153292 -640 -150214 -161418 21754 -70591 -67488 -41957 31471 -137838 -201987 33657
17639 33657 126115 88186 108517 201837 155965 203036 79010 -79468 -43711 7797 134385
17628 134385 176213 14344 -80205 -38219 52125 100122 16817 42247 109145 11219 -249026
17617 -249026 -191803 -154853 -78405 -57966 14670 123070 48894 -77069 -151045 -84234 77766
17606 77766 -44886 -56218 -18651 -145734 -178167 -115711 -148531 -77277 -67500 -143844 -246230
17595 -246230 -101512 -90472 -146266 2887 75786 -172734 -218110 -32624 -18467 13165 59914
17584 59914 -110179 -267383 -310467 -183938 -4616 103331 134090 224680 168148 -39251
17574 -39251 -39058 69692 232844 419938 333068 142065 80296 84685 70935 148281 175066
$$ packed form
17650A53292j53932j49574j1204J83172r2345L103K5531P3428j69309o4149K35644
17639C3657R2458l7929K0331R3320m5872M7071j24026j58478L5757N1508J26588
17628A34385M1828j61869r4549M1986R0344M7997q3305K5430O6898r7926k60245
17617b49026N7223L6950P6448K0439P2636J08400p4176j25963p3976O6811J62000
17606G7766j22652j1332L7567j27083l2433O2456l2820P1254R777p6344j02386
17595b46230J44718J1040n5794J49153P2899k48520m5376J85486J4157L1632M6749
17584E9914j70093j57204m3084J26529J79322J07947L0759R0590n6532k07399
17574c9251J93J08750J63152J87094q6870j91003o1769M389j3750P7346K6785
$$ plain form
17563 175066 310062 373748 220880 -37630 -141267 -172568 -174682 -356047 -396877 -238227
17553 -238227 -54609 57117 -4511 -139872 -99535 -711 54940 46377 -12050 -135666 -89198
17542 -89198 -117761 9042 -18326 149186 409382 461183 247716 43392 -109585 -166781
17532 -166781 -151915 -97951 107741 5472 -127115 -100740 -91685 -193484 -62013 15066 44310
17521 44310 9255 32522 60883 71905 36360 165801 120515 101661 -18668 12271 1995
17510 1995 82337 214265 211666 57841 -113718 -87366 -105362 -78181 -39468 60772 10685
17499 10685 -94135 -133824 -145765 -240990 -46727 -58998 -37347 -8238 -68363 -298347 -237321
17488 -237321 -69504 -184998 -182132 -207999 -159311 9989 -74386 -59192 -66246 62806 49617
$$ packed form
17563A75066J34996O3686j52868k58510j03637l1301k114j81365m0830J58650
17553b38227J83618J11726o1628j35361M0337R8824N5651q563n8427j23616M6468
17542h9198k8563J26803k7368J67512K60196N1801k13467k04324j52977n7196
17532a66781J4866N3964K05692j02269j32587K6375R055j01799J31471P7079K9244
17521D4310l5055K3267K8361J1022l5545J29441m5286j8854j20329L0939j0276
17510A995Q0342J31928k599j53825j71559K6352j7996K7181L8713J00240n0087
17499A0685j04820l9689j1941r5225J94263j2271K1651K9109o0125k29984O1026
17488b37321J67817j15494K866k5867M8688J69300q4375J5194p054J29052j3189
$$ plain form
17477 49617 -211217 -364380 -317054 -271734 -266289 -107765 75115 -62939 -184859 -128519 -68327
17466 -68327 -16675 -77025 -60808 -43889 25354 85842 121319 -65989 -65697 -43428 -51107 -106983
17454 -106983 -16133 -91064 -240404 -257188 -113782 -38952 -70149 -39111 -40377 190050 645631
17443 645631 1389143 2136875 2089748 1450438 801011 263682 145371 184390 52594 -42631
17433 -42631 -6656 -171617 -62066 -48951 2793 176335 247504 100818 71136 90455 81925
17422 81925 -25807 -43635 81328 74729 -148914 -259687 -223514 -194737 -220053 -174306 -90952
17411 -90952 -15385 113615 156215 25674 -116983 54274 255167 112177 -25683 -58118
17401 -58118 -255447 -306254 -401681 -517186 -354668 -252440 -304173 -77781 2284 -25762 -13418
$$ packed form
17477D9617k60834j53163M7326M5320N445J58524J82880j38054j21920N6340O0192
17466f8327N1652o0350J6217J6919O9243O0488L5477j87308K92K2269p679n5876
17454a06983R0850p4931j49340j6784J43406P4830l1197L1038j266K30427M55581
17443F45631P43512P47732m7127o39310o49427n37329j18311L9019j31796r5225
17433d2631L5975j64961J09551J3115N1744J73542P1169j46686k9682J9319q530
17422H1925j07732j7828J24963o599k23643j10773L6173K8777k5316M5747Q3354
17411i0952P5567J29000M2600j30541j42657J71257K00893j42990j37860l2435
17401e8118j97329n0807r5427j15505J62518J02228n1733K26392Q0065k8046J2344
$$ plain form
17390 -13418 111226 42597 -14912 26759 -68041 -132680 -212850 -195695 -269538 -447081 -450403
17379 -450403 -460627 -446179 -452182 -391809 -213346 38403 55888 -23289 2001 67078 -56271
17368 -56271 -63705 -150973 -213958 -99933 67638 69903 116267 76535 30580 83636 -48395
17357 -48395 -43631 -28251 -77033 -68276 -159754 -226029 -118541 33335 140181 87539 -72690
17346 -72690 -2782 25113 -140343 -127880 -147582 -175444 -251897 -301330 -175460 -130179 66236
17335 66236 95430 121942 286962 141776 88627 34211 -71343 3044 90412 78769 -63449
17324 -63449 -67938 -114672 -88249 -142190 -136234 -201141 -211218 -35911 89329 28373 -41482 -39357
17312 -39357 -121519 -135654 -129165 80381 125898 158222 145125 -41224 -213127 -240879 -139095
$$ packed form
17390a3418J24644o8629n7509M1671r4800o4639q0170J7155p3843j77543l322
17379d50403j0224J4448o003O0373J78463K51749J7485p9177K5290O5077j23349
17368e6271p434q7268o2985J14025J67571K265M6364l9732m5955N3056j32031
17357d8395M764J5380m8782Q757r1478o6275J07488J51876J06846n2642j60229
17346g2690O9908K7895j65456J2463j9702k7862p6453m9433J25870M5281J96415
17335F6236K9194K6512J65020j45186n3149n4416j05554P4387Q7368j1643j42218
17324f3449m489m6734K6423n3941N956o4907j0077J75307J25240o0956o9855K125
17312c9357q2162j4135O489K09546M5517L2324j3097j86349j71903k7752J01784
$$ plain form
17301 -139095 -246549 -287803 -320093 -130085 -24077 -104178 -177512 -275884 -246777 -331177 -316400
17290 -316400 -240317 -265880 -232509 -226359 -346354 -452154 -302639 -99891 -30323 -211440 -280385
17279 -280385 -160215 -89516 -167172 -170874 8437 -38256 -58473 -173276 -104117 29181 66478
17268 66478 -28730 -95696 -160212 -216145 -364095 -288946 -88602 254039 322198 185461 67323
17257 67323 -75412 -63878 -9510 -138525 -143798 70947 34905 -26856 -4352 -23600 -14313
17246 -14313 138990 153992 -13861 -103135 -151640 -93413 -100327 -6117 81844 118472 82365
17235 82365 -63795 -124868 -194372 -13163 27488 -91477 -277585 -286064 -304517 -112586 79594
17224 79594 14723 -43581 22574 -29085 -26362 87114 77617 101156 101578 -116432 -183222 -124417
$$ packed form
17301a39095j07454m1254l2290J90008J06008q0101p3334r8372K9107q4400J4777
17290c16400P6083k5563L3371O150j19995j05800J49515K02748O9568j81117o8945
17279b80385J20170P0699p7656l702J79311m6693k0217j14803O9159J33298L7297
17268F6478r5208o6966o4516n5933j47950P5149K00344L42641O8159j36737j18138
17257F7323j42735J1534N4368j29015n273K14745l6042o1761K2504j9248R287
17246a4313J53303J5002j67853q9274m8505N8227o914R4210Q7961L6628l6107
17235H2365j46160o1073o9504J81209M0651j18965j86108q479j8453J91931J92180
17224G9594o4871n8304O6155n1659K723J13476r497K3539M22k18010o6790N8805
$$ plain form
17212 -124417 -3624 -29664 -117006 28823 -10079 -61766 -18977 -44456 -13278 21518 106245
17201 106245 121326 28701 3189 -1015 138974 73872 -17140 319 -10483 -107817 -185261
17190 -185261 -136810 31038 137108 10989 3813 -41151 -100371 43847 132198 -43929 -59458
17179 -59458 -74430 -211790 -324512 -237737 -90778 -115464 -94476 47376 -18377 -105040 -63117
17168 -63117 15358 -105437 -247885 -396584 -317460 -122111 -6415 -1302 -90795 -154255 -260730
17157 -260730 -314635 -313607 -104960 -137969 -181916 -167951 -213653 -79329 44214 126814 37232
17146 37232 8024 -78746 78667 229895 92139 127426 88642 82053 -167597 -362553 -253368
17135 -253368 -186129 -288033 -220202 -211703 -216513 -216574 -161357 -221713 -251938 -250741 -426673 -361284
$$ packed form
17212a24417J20793k6040q7342J45829l8902n1687M2789k5479L1178L4796Q4727
17201A06245J5081r2625k5512m204J39989o5102r1012J7459j0802r7334p7444
17190a85261M8451J67848J06070j26119p176m4964n9220J44218Q8351j76127j5529
17179e9458j4972j37360j12722Q6775J46959k4686K0988J41852o5753q6663M1923
17168f3117P8475j20795j42448j48699P9124J95349J15696N113q9493o3460j06475
17157b60730n3905J028K08647l3009m3947J3965m5702J34324J23543Q2600q9582
17146C7232k9208q6770J57413J51228j37756L5287l8784o589k49650j94956J09185
17135b53368O7239j01904O7831Q499m810o1N5217o0356l0225J197j75932O5389
$$ plain form
17123 -361284 -152723 -62434 93196 164277 208981 274756 278582 47348 45253 60138 -14583
17112 -14583 1262 133861 148384 207565 193307 -106787 -219754 -65591 -121939 -169078 -117517
17101 -117517 49702 17283 822 -75367 -157192 -190718 -179834 -187278 -88219 -133695 -276395
17090 -276395 -243485 -69742 30358 -31959 84406 72911 -34769 -230037 -179794 56573
17080 56573 24550 45234 -11976 -84793 69720 44783 -41330 44648 27386 -154884 -53569
17069 -53569 116606 191063 -55303 -246707 -220059 -65323 -91187 -12947 -24981 -70088 -78850
17058 -78850 -3176 30353 -64244 -222855 -226411 -230214 -67298 29957 -22066 -5763 34589 -144003
17046 -144003 -198467 -259152 -315125 -46052 105183 14389 -226882 -339942 -121011 -88383
$$ packed form
17123c61284K08561R0289J55630P1081M4704O5775L826k31234k095J4885p4721
17112a4583J5845J32599J4523N9181j4258l00094j12967J54163n6348m7139N1561
17101a17517J67219l2419j6461p6189q1825l3526J0884p444R9059m5476j42700
17090b76395L2910J73743J00100o2317J16365j1495j07680j95268N0243K36367
17080E6573l2023K0684n7210p2817J54513k4937q6113Q5978j7262j82270J01315
17069e3569J70175P4457k46366j91404K6648J54736k5864P8240j2034m5107q762
17058g8850P5674L3529r4597j58611l556l803J62916R7255n2023J6303M0352j78592
17046a44003n4464o0685n5973K69073J51235r0794k41271j13060K18931L2628
$$ plain form
17036 -88383 -116232 -26388 18718 -40861 -54026 -111497 -17932 -97276 -210564 -302313 -371149
17025 -371149 -217843 205 -74207 -140068 -75868 -1154 24819 -55423 -98507 34672 112001
17014 112001 -90138 -211318 -188824 -183526 -202276 -128775 -19039 24891 -106961 -140375 -206865
17003 -206865 -355142 -399449 -348547 -543315 -514124 -451537 -324409 -212907 -202888 -202160 -25657
16992 -25657 101664 110968 91032 89723 179825 188130 286337 121115 -43001 22369 -133431
16981 -133431 -260542 -368286 -294247 -216697 -156325 -95845 -134204 -94006 -231435 -290176 -266868
16970 -266868 -327691 -259620 -220901 -143401 -45550 33851 -59575 -55548 -179665 -198437 -255620
16959 -255620 -173774 35480 -14674 80033 152141 76312 94441 79746 -97842 -147404 -163693
$$ packed form
17036h8383k7849Q9844M5106n9579j3165n7471R3565p9344j13288r1749o8836
17025c71149J53306K18048p4412o5861O4200P4714K5973q0242m3084J33179P7329
17014A12001k02139j21180K2494N298j8750P3501J09736M3930j31852l3414o6490
17003b06865j48277m4307N0902j94768K9191O2587J27128J11502J0019P28J76503
16992b5657J27321R304j9936j309R0102Q305R8207j65222j64116O5370j55800
16981a33431j27111j07744P4039P7550O0372O0480l8359M0198j37429n8741K3308
16970b66868o0823O8071L8719P7500R7851P9401r3426M027j24117j8772n7183
16959b55620Q1846K09254n0154R4707P2108p5829J8129j4695j77588m9562j6289
$$ plain form
16948 -163693 -285877 -123910 -28094 55297 88928 59130 108369 169693 212880 282916 151218
16937 151218 113215 68739 -128301 -160882 -172536 -142877 -98954 -81685 -56804 -116403 -195575
16926 -195575 -145906 -157930 -229316 -300018 -271317 -314970 -299019 -107182 47939 75247 -165403
16915 -165403 -189345 -187995 -121668 -55717 11262 52127 54788 87445 -95765 -96227 -150608 -11847
16903 -11847 40828 92887 194642 210369 314649 161741 -47752 -234957 -225605 -33750 160089
16892 160089 214885 102016 -114817 52305 147562 -6916 88574 106646 -67159 -61282 34516
16881 34516 -56110 -173022 -173282 -103819 -105976 -195740 -118428 -60871 -26987 -74332 -77477 -106664
16869 -106664 -29721 -129327 -218796 -293302 -230247 -95511 16816 -42723 -139963 -36809 -78538
$$ packed form
16948a63693j22184J61967R5816Q3391L3631k9798M9239O1324M3187P0036j31698
16937A51218l8003m4476j97040l2581j1654K9659M3923J7269K4881n9599p9172
16926a95575M9669j2024p1386p0702K8701m3653J5951J91837J55121K7308k40650
16915a65403k3942J350O6327O5951O6979M0865K661L2657j83210m62n4381J38761
16903a1847N2675N2059J01755J5727J04280j52908k09493j87205R352J91855J93839
16892A60089N4796j12869k16833J67122R5257j54478R5490J8072j73805N877R5798
16881C4516r0626j16912k60O9463k157q9764P7312N7557L3884m7345l145k9187
16869a06664P6943r9606q9469p4506O3055J34736J12327n9539r7240J03154m1729
$$ plain form
16858 -78538 -2766 -56480 -137344 -241253 -411217 -455070 -353339 -283046 -138402 -122058 -91755
16847 -91755 -19856 -130123 -220682 -186465 -150121 -131581 -81858 -184887 -92523 -19649 88804
16836 88804 96408 -15496 -14442 -48385 -39798 -13487 37168 235346 117910 -104140 -52844
16825 -52844 -71594 -152379 -184649 -258257 -244615 -202249 -251600 -335940 -328635 -191354 61378
16814 61378 235563 207611 111374 65562 -167099 -361806 -500167 -504680 -473870 -342421 -304524
16803 -304524 -256302 -174468 -1336 26209 -43102 -29068 -117313 -144279 -123628 -44253 14067
16792 14067 41573 29536 -117097 -111143 -117362 -57326 96688 155186 140041 176499 117387 -34753
16780 -34753 39700 150068 261316 317913 317335 152545 160891 -14069 -207992 -91615 14750
$$ packed form
16858g8538P5772n3714q0864j03909j69964m3853J01731P0293J44644J6344L0303
16847i1755P1899j10267r0559L4217L6344J8540M9723j03029R2364P2874J08453
16836H8804P604j11904J054l3943Q587K6311N0655J98178j17436k22050N1296
16825e2844j8750q0785l2270p3608J3642M2366m9351q4340P305J37281K52732
16814F1378J74185k7952r6237m5812k32661j94707j38361m513L0810J31449L7897
16803c04524M8222Q1834J73132K7545o9311J4034q8245k6966K0651P9375N8320
16792A4067K7506j2037j46633N954o219O0036J54014N8498j5145L6458n9112j52140
16780c4753P4453J10368J11248N6597n78j64790Q346j74960j93923J16377J06365
$$ plain form
16769 14750 -37607 -48512 -132460 -202401 -10408 123851 -161458 -230611 -213403 -80636 -114712
16758 -114712 -233852 -340307 -166431 -153114 -67286 -53648 -247855 -379448 -199864 -183144
16748 -183144 -172174 -90889 2194 58797 -14908 4817 36928 26839 21203 -161399 -374196
16737 -374196 -342854 -128372 -164252 -57544 21270 111635 199857 186171 44183 52690 -54556
16726 -54556 17161 -40604 42683 -182829 -324543 -84631 194884 244575 192316 -129347 -281509
16715 -281509 -319268 -437632 -350360 10835 158824 -19648 -123869 25856 187611 27540
16705 27540 -115603 -167180 -101856 -132077 -153874 -123144 -80673 -79296 118550 232289 308904
16694 308904 410923 465759 384174 187466 -22122 -90957 -75427 -77702 -194041 22601 85500
$$ packed form
16769A4750n2357j0905q3948o9941J91993J34259k85309o9153J7208J32767l4076
16758a14712j19140j06455J73876J3317Q5828J3638j94207j31593J79584J6720
16748a83144J0970Q1285R3083N6603p3705J9725L2111j0089n636j82602k12797
16737c74196L1342K14482l5880J06708P8814R0365Q8222j3686j41988Q507j07246
16726e4556P1717n7765Q3287k25512j41714K39912K79515M9691n2259l21663j52162
16715b81509l7759j18364Q7272L61195J47989j78472j04221J49725J61755j60071
16705B7540j43143n1577O5324l0221k1797L0730M2471J377J97846J13739P6615
16694C08904J02019N4836q1585j96708k09588o8835J5530k275j16339K16642O2899
$$ plain form
16683 85500 91373 204833 42787 -127717 -119523 -285456 -263195 -127019 -190007 -133809 -103487
16672 -103487 -114330 -172369 -51386 -11785 -53197 -125720 8203 -7407 16677 -28326 -76835
16661 -76835 -126322 -202382 -169449 -11686 -194263 -64024 116385 80242 -55210 9420 -15709
16650 -15709 -166334 -258523 -118063 -5583 -87564 -6659 -111928 3841 -75590 -195400
16640 -195400 -214158 -143662 -45259 33124 -162472 -268058 -201494 -119984 -111253 -122785 -59137
16629 -59137 -52774 -84144 -122131 -40874 28675 135665 207902 -33823 -285707 -240903 -131225
16618 -131225 39430 77761 -17252 -171295 -313114 -284011 -43366 -128520 -30619 -72461 -94672
16607 -94672 37066 -389 52821 155559 28472 -43963 -82507 -26233 -124434 -2168 107883
$$ packed form
16683H5500N873J13460j62046j70504Q194j65933K2261J36176o2988N6198L0322
16672a03487j0843n8039J20983L9601m1412p2523J33923j5610K4084m5003m8509
16661g6835m9487p6060L2933J57763j82577J30239J80409l6143j35452O4630k5129
16650a5709j50625r2189J40460J12480q1981Q0905j05269J15769p9431j19810
16640a95400j8758P0496R8403P8383j95596j05586O6564Q1510Q731j1532O3648
16629e9137O363l1370l7987Q1257O9549J06990P2237k41725k51884M4804J09678
16618a31225J70655L8331r5013j54043j41819K9103K40645q5154R7901m1842k2211
16607i4672J31738l7455N3210J02738j27087p2435l8544N6274r8201J22266J10051
$$ plain form
16596 107883 144480 234862 96686 -9176 -16423 -189024 -261896 -218259 -238226 -178119 -39005
16585 -39005 -70505 -132655 60557 166846 109863 -10491 -100590 -27987 7800 -185632 -232046
16574 -232046 -213809 -110591 17542 3040 1264 117159 128502 128127 112359 171128 34513
16563 34513 -190293 -133451 -87401 -58284 -176822 -164440 -162844 -59197 -40118 110887 231486
16552 231486 143337 -106254 -103512 -84751 -24681 76090 -152256 -327381 -228128 -227903 -335722
16541 -335722 -280756 -285707 -242643 -190263 -156809 -7559 -24830 -28941 -65921 -100253 -90294 83697
16529 83697 47435 -61041 -84622 -100325 -290554 -270800 -108966 57900 -9220 -105331 -202328
16518 -202328 -78632 -149542 -170942 -89279 4568 255171 6700 -101225 48237 634
$$ packed form
16596A07883L6597R0382j38176j05862p247j72601p2872M3637j9967O0107J39114
16585c9005l1500o2150J93212J06289n6983j20354r0099P2603L5787j93432m6414
16574b32046J8237J03218J28133j4502j776J15895J1343l75j5768N8769j36615
16563C4513k24806N6842M6050K9117j18538J2382J596J03647J9079J51005J20599
16552B31486q8149k49591K742J8761O0070J00771k28346j75125R9253K25j07819
16541c35722N4966m951M3064N2380L3454J49250j7271m111l6980l4332R959J73991
16529H3697l6262j08476k3581j5703j90229J9754J61834J66866o7120r6111r6997
16518b02328J23696p0910k1400Q1663R3847K50603k48471j07925J49462m7603
$$ plain form
16508 634 -36559 -47029 -110658 215624 196648 -114530 -216953 -172051 -198937 -278876 -108806
16497 -108806 -54250 -22488 14099 -1635 -88028 -185760 -284062 -164039 -48805 -249242 -362342
16486 -362342 -312028 -204435 -176106 -170331 -189440 -146752 -128569 -101729 -170526 -135071 131254
16475 131254 129730 -109174 -2721 176713 44445 68636 76800 123101 30651 20485 146256
16464 146256 -46817 -88356 -87976 -163451 -156330 53018 -53260 -177962 -25826 75567 262923
16453 262923 327663 240439 154714 64240 128529 -32026 -211313 -232763 -299353 -348518 -139381
16442 -139381 -161174 -119684 -204255 -66821 -10394 -2843 -33370 61387 103282 -63308 -153557
16431 -153557 -48531 -115280 -109731 -169509 -62788 -41046 -174094 -304338 -220571 -147454 -149353
$$ packed form
16508F34l7193j0470o3629L26282j8976l11178j02423M4902k6886p9939J70070
16497a08806N4556L1762L6587j5734q6393r7732r8302J20023J15234k00437j13100
16486c62342N0314J07593K8329N775j9109M2688J8183K6840o8797L5455K66325
16475A31254j524k38904J06453J79434j32268K4191Q164M6301r2450j0166J25771
16464A46256j93073m1539L80p5475P121K09348j06278j24702J52136J01393J87356
16453B62923O4740q7224q5725r0474O4289j60555j79287k1450o6590m9165K09137
16442a39381k1793M1490q4571J37434N6427P551l0527R4757M1895j66590r0249
16431a53557J05026o6749N549n9778J06721K1742j33048j30244Q3767P3117j899
$$ plain form
16420 -149353 -260815 -116545 -91232 -15418 33897 -40879 40281 227890 494963 443868 218873
16409 218873 25355 58726 99089 186119 219187 237745 82911 48666 71098 232775 183051
16398 183051 56913 166421 129537 98543 -30680 -213575 -195248 -57159 14435 13787 -3718
16387 -3718 -41258 -90977 -205723 -167558 -144981 -168815 -108246 -99430 -117917 -122934 -19038 72956
16375 72956 138199 -39443 -90169 49224 214033 115143 -48907 -36461 48389 -34714 -122484
16364 -122484 -266444 -200973 12310 75951 37766 -32661 -128300 -23100 -78901 -176589 -53693
16353 -53693 27526 -16298 -55954 -208032 -223345 -153763 -99721 -4017 36531 134840 168752
16342 168752 78216 -4342 -12300 -16606 288052 192965 73543 96286 158388 173232 150417
$$ packed form
16420a49353j11462J44270K5313P5814M9315p4776Q1160J87609K67073n1095k24995
16409B18873j93518L3371M0363Q7030L3068J8558j54834l4245K2432J61677m9724
16398A83051j26138J09508l6884l0994j29223j82895J8327J38089P1594o48j7505
16387c718l7540m9719j14746L8165K2577k3834O0569Q816j8487n017J03896R1994
16375G2956O5243j77642n0726J39393J64809r8890j64050J2446Q4850q3103q7770
16364a22484j43960O5471K13283O3641l8185p0427r5639J05200n5801r7688J22896
16353e3693Q1219m3824l9656j52078j5313O9582N4042R5704M0548R8309L3912
16342A68752r0536q2558p958m306L04658r5087j19422K2743O2102J4844k2815
$$ plain form
16331 150417 179170 143838 -20815 11828 -35485 -156815 -111291 37695 103939 -65288 -220187
16320 -220187 -280926 -22953 -18661 -37734 -31480 -1365 89782 -26803 -33618 -23806 16520 103320
16308 103320 -1898 -18438 -108786 -256186 -292548 -148860 22145 8405 -282148 -417095
16298 -417095 -396747 -390921 -357929 -366667 -343619 -135990 -59044 -52799 -167406 -147871 -64777 -3115
16286 -3115 105211 -54524 -37122 -25213 -167465 -4383 85721 81755 32863 -114084 -133841
16275 -133841 -37359 -1065 -59637 -80612 -116159 -106408 19549 42597 -123103 -153727 -152826 -33085
16263 -33085 -38333 -193719 -151816 -112507 -118697 -35330 -103 -138613 -298941 -94742 -62882
16252 -62882 -39704 827 16079 138528 35760 3368 100088 145513 292650 300800 34282
$$ packed form
16331A50417K8753l5332j64653L2643m7313j21330M5524J48986O6244j69227j54899
16320b20187o0739K57973M292j9073O254L0115R1147j16585o815R812M0326Q6800
16308A03320j05218j6540r0348j47400l6362J43688J71005j3740k90553j34947
16298d17095K0348N826L2992q738K3048K07629P6946O245j14607J9535Q3094O1662
16286c115J08326j59735J7402J1909j42252J63082R0104l966m8892j46947j9757
16275a33841R6482L6294n8572k0975l5547R751J25957K3048j65700l0624R01J19741
16263c3085n248j55386M1903L9309o190Q3367L5227j38510j60328K04199L1860
16252f2882K3178M0531J5252J22449j02768l2392R6720M5425J47137Q150k66518
$$ plain form
16241 34282 -56973 182325 267440 259956 288879 82862 -152399 -174745 -113452 -110572 -98909
16230 -98909 -52210 38956 -28838 -149704 -269273 -334594 -107384 18569 -107050 -89443 -31124
16219 -31124 -48654 109492 107323 17594 14896 101692 141126 59553 -230742 -266092 -138708
16208 -138708 -96847 1967 698 31703 72555 -123780 -183310 -134594 -26235 149605 43962
16197 43962 32807 51366 2646 -130172 -195025 -165945 -128433 20099 17244 -50257 -138609
16186 -138609 -108496 -67339 -146590 -197452 -52311 -14004 5201 65989 -62586 -176620 -250855
16175 -250855 -193482 -161986 -172892 -318785 -270318 -251139 -231225 -72015 63628 105084 -3518
16164 -3518 -62648 -144924 -242465 -281628 -308549 -199787 -174293 -425152 -425303 -266344 -201456 -149796
$$ packed form
16241C4282r1255K39298Q5115p484K8923k06017k35261k2346O1293K880J1663
16230i8909M6699R1166o7794j20866j19569o5321K27210J25953j25619J7607N8319
16219c1124j7530J58146k169q9729k698Q6796L9434q1573k90295l5350J27384
16208a38708M1861R8814j269L1005M0852j96335n9530M8716J08359J75840j05643
16197D3962j1155J8559m8720j32818o4853K9080L7512J48532k855o7501q8352
16186a38609L0113M1157p9251n0862J45141L8307J9205O0788j28575j14034p4235
16175b50855N7373L1496j0906j45893M8467J9179J9914J59210J35643M1456j08602
16164c518n9130q2276r7541l9163k6921J08762K5494k50859j51J58959O4888N1660
$$ plain form
16152 -149796 -155133 -83795 -199681 -278852 -257959 -295911 -245630 -322314 -154690 -124299 -233942
16141 -233942 -140093 25317 187297 118607 53967 -23962 -132537 -79335 89667 224162
16131 224162 235174 20084 8641 -79921 -127043 -180292 -292877 -423487 -448234 -276021 -99653
16120 -99653 -24325 -195544 -321186 -254517 -102116 -84995 -8375 22135 -145225 -77702 -129342
16109 -129342 -163013 -207711 -200108 -63503 16525 45925 49120 -118915 -163023 -46560 27335
16098 27335 -918 -13238 2862 13193 4922 95117 -9281 -186582 -212956 -188150 -156068
16087 -156068 -98007 -103236 -49957 132408 258972 77857 -626 21106 -101919 -165727 -219613
16076 -219613 -370779 -318302 -122483 -29657 -191061 -88495 24490 -20204 53521 174880
$$ packed form
16152a49796n337P1338j15886p9171K0893l7952N0281p6684J67624L0391j09643
16141b33942R3849J65410J61980o8690o4640p7929j08575N3202J69002J34495
16131B24162J1012k15090j1443q8562m7122n3249j12585j30610k4747J72213J76368
16120i9653P5328j71219j25642O6669J52401J7121P6620L0510j67360O7523n1640
16109a29342l3671m4698P603J36605Q0028K9400L195j68035m4108J16463P3895
16098B7335k8253j2320J6100J0331q271R0195j04398j77301k6374K4806L2082
16087a56068N8061n229N3279J82365J26564j81115p8483K1732j23025o3808n3886
16076b19613j51166N2477J95819R2826j61404J02566J12985m4694P3725J21359
$$ plain form
16066 174880 64272 -116857 -155062 -74761 -52433 -145944 -133766 -89130 -155858 -155593 -44274
16055 -44274 -155600 22399 196146 175283 91633 99711 44324 5306 20142 -32893 -130310
16044 -130310 -83249 -76812 -95869 -53508 -16121 -89104 -134748 -120772 123366 197855 349965
16033 349965 485441 245137 130366 32408 -48177 -72858 -39295 72696 197727 118331
16023 118331 6295 -115111 6835 73116 -86779 -282478 -259672 -306042 -7623 -85105
16013 -85105 -235632 -211411 -179610 -73756 -73960 -57945 -33030 -66761 -5997 -52941 -176266
16002 -176266 -281981 -351705 -103993 108699 166831 118934 121630 170767 149761 225346 202325
15991 202325 -20069 -133486 -196902 -327314 -276030 -232721 -150768 -90210 40902 85971 61724
$$ packed form
16066A74880j10608j81129l8205Q0301K2328r3511J2178M4636o6728K65J11319
16055d4274j11326J77999J73747k0863q3650Q078n5387l9018J4836n3035r7417
16044a30310M7061O437j9057M2361L7387p2983m5644J3976K44138P4489J52110
16033C49965J35476k40304j14771r7958q0585k4681L3563J11991J25031p9396
16023A18331j12036j21406J21946O6281j59895j95699K2806m6370K98419p7482
16013h5105j50527K4221L1801J05854k04J6015K4915l3731O0764m6944j23325
16002a76266j05715o9724K47712K12692N8132m7897K696M9137k1006P5585k3021
15991B02325k22394j13417o3416j30412N1284M3309Q1953O0558J31112M5069k4247
$$ plain form
15980 61724 -69867 -267456 -279534 -343089 -428015 -394145 -339133 -242894 -187305 -95137 -121113
15969 -121113 -133220 -161661 -102583 -155427 -282025 -248030 -73770 63105 54594 9185 -84360
15958 -84360 -186795 -59375 -42465 -163523 -305252 -173753 -44142 53285 184455 274960
15948 274960 300415 217764 6152 3209 -82099 -112645 -179632 -183546 6029 136747 116037
15937 116037 -11105 -241684 -359217 -341476 -135970 46551 -75626 -61301 42024 107283
15927 107283 -60628 -34898 78922 21476 33397 -30154 -81372 -19017 -128372 -73742 -40563
15916 -40563 -122101 -298545 -194723 -175407 -98145 123717 84178 -19897 -12619 14111 -164123
15905 -164123 -174405 -154227 -188437 -169802 -105755 -72661 10710 60064 91176 57118 -79098
$$ packed form
15980F1724j31591j97589j2078o3555q4926L3870N5012R6239N5589R2168k5976
15969a21113j2107k8441N9078n2844j26598L3995J74260J36875q511m5409r3545
15958h4360j02435J27420J6910j21058j41729J31499J29611R7427J31170R0505
15948B74960K5455q2651k11612k943q5308l0546o6987l914J89575J30718k0710
15937A16037j27142k30579j17533J7741K05506J82521j22177J4325J03325O5259
15927A07283j67911K5730J13820n7446J1921o3551n1218O2355j09355N4630L3179
15916d0563q1538j76444J03822J9316P7262K21862l9539j04075P278K6730j78234
15905a64123j0282K0178l4210J8635O4047L3094Q3371M9354L1112l4058j36216
$$ plain form
15894 -79098 14754 53310 160643 169612 96277 67258 53580 117727 136283 39939 -13754 1614
15882 1614 121219 196643 87704 140843 129376 92380 82880 -52551 -158433 -218256 -101395
15871 -101395 80326 6609 -19783 -14061 -165450 -104766 19894 247166 300265 288370 151974
15860 151974 64268 74768 285519 218922 242025 244782 113011 -12726 -65028 -157028 16406
15849 16406 -3935 13293 97639 -18509 66782 60019 -33285 119765 177673 150765 13332
15838 13332 17715 180625 168312 152081 142240 210835 210271 171741 111038 -42339 -34159 58345
15826 58345 73778 58026 -34526 -133126 -133507 7247 57596 -28035 53284 82955 122011 68696
15814 68696 -65302 49426 -10795 93506 6995 26146 8050 -44722 -137362 43123 -90148
$$ packed form
15894g9098R3852L8556J07333Q969p3335k9019j3678O4147J8556r6344n3693J5368
15882A614J19605P5424j08939N3139j1467l6996r500j35431j05882n9823J16861
15871a01395J81721p3717k6392N722j51389O0684J24660K27272N3099j1895j36396
15860A51974q7706J0500K10751o6597K3103K757j31771j25737n2302r2000J73434
15849A6406k0341J7228Q4346j16148Q5291o763r3304J53050N7908k6908j37433
15838A3332M383J62910j2313j6231r841O8595n64l8530o0703j53377Q180R2504
15826E8345J5433j5752r2552r8600l81J40754N0349q5631Q1319K9671L9056n3315
15814F8696j33998J14728o0221J04301q6511J9151j8096n2772r2640J80485j33271
$$ plain form
15803 -90148 -123090 60323 133974 -74198 -331273 -205667 -28850 10926 178575 26514
15793 26514 -34671 90536 142224 129759 84171 112654 27672 -31205 20895 136141 217850
15782 217850 78799 47129 116904 10802 -24460 94983 51905 -105311 35908 151833
15772 151833 200162 106083 115292 121597 -19955 77311 64392 -89637 -129798 -166792 -115104
15761 -115104 9939 -79302 -81754 -153480 -108174 -24176 -11847 -3872 -42963 -95474 13243
15750 13243 91849 171193 130588 20735 -30349 -15162 13177 -88404 -151638 -244299 -290181
15739 -290181 -264808 -277151 -110009 -76153 194972 216794 295617 129356 75542 128201 163548
15728 163548 99570 -5132 101823 116120 -62119 -66029 -44427 21776 136649 63385 116317
$$ packed form
15803i0148l2942J83413P3651k08172k57075J25606J76817L9776J67649j52061
15793B6514o1185J25207N1688j2465m5588K8483q4982n8877N2100J15246Q1709
15782B17850j39051l1670O9775j06102l5262J19443m3078j57216J41219J15925
15772A51833M8329r4079R209O305j41552R7266j2919j54029m0161l6994N1688
15761a15104J25043q9241k452p1726M5306Q3998J2329P975l9091n2511J08717
15750A3243P8606P9344m0605j09853n1084J5187K8339j01581o3234r2661m5882
15739b90181K5373j2343J67142L3856K71125K1822P8823j66261n3814N2659L5347
15728A63548o3978j04702J06955J4297j78239l910K1602O6203J14873p3264N2932
$$ plain form
15717 116317 -2572 64516 -111329 -261949 -306520 -229873 -111909 -275371 -245904 -167921
15707 -167921 -99670 -67479 -141032 -122595 -85370 -166611 -248485 -213503 -169473 -153328 -161600 -233842
15695 -233842 -221165 -41636 -2442 80112 29904 86427 42840 -3250 27443 48052 74418
15684 74418 46618 21992 103990 79687 -36342 -79956 -141164 -252750 -183538 -45312 -47302
15673 -47302 122620 140961 249610 181418 172518 -5153 -55090 31336 -13608 8613 49904
15662 49904 145309 89600 54394 115041 112518 131376 145882 96121 99092 132723 96552 61019
15650 61019 6976 -64472 -3034 135476 119286 29135 -81272 -193074 -157682 -48908 15571
15639 15571 -43764 -90353 -25974 -203074 -282602 -72185 -103450 -195008 -162993 -229152 -266071
$$ packed form
15717A16317j18889O7088j75845j50620m4571P6647J17964j63462K9467P7983
15707a67921O8251L2191p3553J8437L7225q1241q1874L4982M4030J6145q272p2242
15695b33842J2677J79529L9194Q2554n0208N6523m3587m6090L0693K0609K6366
15684G4418k7800k4626Q1998k4303j16029m3614o1208j11586O9212J38226j990
15673d7302J69922J8341J08649o8192q900j77671m9937Q6426m4944K2221M1291
15662D9904R5405n5709l5206O0647k523J8858J4506m9761K971L3631l6171l5533
15650F1019n4043p1448O1438J38510j6190r0151j10407j11802L5392J08774O4479
15639A5571n9335m6589O4379j77100p9528K10417l1265r1558L2015o6159l6919
$$ plain form
15628 -266071 -313454 -109640 34816 30387 -36652 -46945 -2151 109633 189953 60856 -112967
15617 -112967 -114622 -78364 66442 121286 122454 257781 258429 223920 93439 -520 166177
15606 166177 75304 -30040 -26669 90310 107679 82192 60484 118731 111413 47075 -111157
15595 -111157 -192261 -231244 -231111 -185094 -98130 -58633 105487 158987 13503 -54407 14638
15584 14638 22075 226135 117249 70000 596 -39106 -24948 -218398 -176538 -109266 -69280
15573 -69280 -21078 -76678 -18938 106213 52162 51360 133534 261819 306021 195022 176864
15562 176864 119723 -116605 -220570 -238710 -106221 -44869 -2586 185741 405359 285525
15552 285525 166323 130793 192697 51200 24769 224810 147190 -8311 -73357 -203068
$$ packed form
15628b66071m7383K03814J44456m429o7039j0293M4794J11784Q0320j29097j73823
15617a12967j655L6258J44806N4844J168J35327O48l4509j30481r3959J66697
15606A66177r0873j05344L371J16979J7369k5487k1708N8247p318o4338j58232
15595a11157q1104l8983J33M6017Q6964L9497J64120N3500j45484o7910O9045
15584A4638P437K04060j08886m7249o9404l9702J4158j93450M1860O7272L9986
15573f9280M8202n5600N7740J25151n4051q02Q2174J28285M4202j10999j8158
15562A76864n7141k36328j03965j8140J32489O1352M2283J88327K19618j19834
15552B85525j19202l5530O1904j41497k6431K00041p7620j55501o5046j29711
$$ plain form
15542 -203068 -141864 -100478 -133576 -40539 -38763 -188463 -193578 -147707 -137467 -231697 -192726 -128543
15530 -128543 31429 46090 15318 -37567 -48857 97632 246166 123661 76110 196455
15520 196455 316804 408185 223135 63631 83211 138708 104046 -31605 -104768 -102051 -59914
15509 -59914 -70077 -158631 -175284 -113276 -208381 -234847 -131265 -72168 119505 269945 103742
15498 103742 21325 23840 6813 -63413 -105499 -48992 -49401 -127064 -177583 -243493 -42850 65141
15486 65141 7763 7820 -14453 -73305 -53339 -77035 -61454 4515 26021 53332 62735 -14925
15474 -14925 -72620 -38486 236811 393657 157726 -108971 -192944 -248825 -252761 -188722 -105392
15463 -105392 -57548 41950 -9244 -141157 -164810 -121274 -120504 -79344 -125167 -52352 9124 79866
$$ packed form
15542b03068O1204M1386l3098R3037J776j49700n115M5871J0240r4230L8971O4183
15530a28543J59972J4661l0772n2885j1290J46489J48534j22505m7551J20345
15520A96455J20349R1381j85050j59504J9580N5497l4662j35651p3163K717M2137
15509e9914j0163q8554j6653O2008r5105k6466J03582N9097J91673J50440j66203
15498A03742q2417K515j7027p0226m2086N6507m09p7663n0519o5910K00643J07991
15486F5141n7378N7k2273n8852J9966k3696J5581O5969K1506K7311R403p7660
15474a4925n7695L4134K75297J56846k35931k66697q3973n5881l936O4039Q3330
15463a05392M7844R9498n1194j31913k3653M3536P70M1160m5823P2815O1476P0742
$$ plain form
15451 79866 -66658 -97898 -15352 -154292 -194324 -242257 -126448 38683 53658 109036 98562
15440 98562 122339 91141 43438 100743 137491 965 29909 -41950 -232757 -299661 -223140
15429 -223140 -244466 -332944 -295501 -258424 -217481 -99920 74048 -8622 -76478 -225072 -303617
15418 -303617 -325442 -218683 -59487 -52621 -113989 3742 96369 42718 -103370 2236 147870
15407 147870 184719 85075 45636 40186 -160717 -79172 59953 -4151 -115271 -273725 -104980
15396 -104980 57321 -12207 68869 124530 48769 -32082 -3806 -65384 -181853 -270440 -262788
15385 -262788 -72708 -32157 -95672 263007 383395 32686 -83169 -78051 -2020 70987 -75763
15374 -75763 -71703 98250 176890 20903 -67718 -34426 -7918 32903 -16567 -4416 -86704
$$ packed form
15451G9866j46524l1240Q2546j38940m0032m7933J15809J65131J4975N5378j0474
15440I8562K3777l1198m7703N7305L6748j36526K8944p1859j90807o6904P6521
15429b23140k1326q8478L7443L7077M0943J17561J73968q2670o7856j48594p8545
15418c03617k1825J06759J59196O866o1368J17731R2627n3651j46088J05606J45634
15407A47870L6849r9644l9439n450k00903Q1545J39125o4104j11120j58454J68745
15396a04980J62301o9528Q1076N5661p5761q0851K8276o1578j16469q8587P652
15385b62788J90080M0551o3515L58679J20388l50709j15855N118P6031P3007j46750
15374g5763M060J69953P8640j55987q8621L3292K6508M0821m9470J2151q2288
$$ plain form
15363 -86704 -26777 -147760 -304989 -221329 -102468 -1706 94187 107189 84656 56467 -57645
15352 -57645 85750 223280 231046 87250 9216 47969 -2686 -11294 -97341 2363 63749
15341 63749 72089 -31315 -5346 210644 219270 174734 -22413 -129288 -110799 -147902 -41816
15330 -41816 -57349 -139614 50494 116366 135678 270354 226379 131665 122387 114872 254901
15319 254901 61848 -74392 -100038 -75623 36322 117447 67712 58937 99961 8664 -103701
15308 -103701 7501 6768 -242206 -268915 -166211 -224106 -151944 -17379 57053 107229 106431
15297 106431 34650 -72775 -156569 -287351 -309400 -389875 -395126 -290562 -184607 -216921 -246048
15286 -246048 -141717 -84313 36004 -141336 -159221 -94122 -97294 -65525 -84732 -62278 -116616
$$ packed form
15363h6704N9927j20983j57229Q3660J18861J00762R5893J3002k2533k8189j14112
15352e7645J43395J37530P766j43796p8034L8753n0655q608q6047R9704O1386
15341F3749Q340j03404K5969K15990Q626m4536j97147j06875J8489l7103J06086
15330d1816j5533q2265J90108O5872J9312J34676m3975r4714r278p515J40029
15319B54901j93053j36240k5646K4415J11945Q1125m9735q775M1024r1297j12365
15308a03701J11202p33k48974k6709J02704n7895P2162J34565P4432N0176p98
15297A06431p1781j07425q3794j30782k2049q0475n251J04564J05955l2314k9127
15286b46048J04331N7404J20317j77340j7885O5099l172L1769j9207K2454n4338
$$ plain form
15275 -116616 -138992 71826 -27706 -257152 -148778 -40173 -96729 10971 217148 201139
15265 201139 294164 235029 140917 42988 19830 -113967 -272853 -247071 -128944 42842 140272
15254 140272 183177 113009 -65278 -108855 63556 74163 41269 135749 80630 81610 127385
15243 127385 133582 29360 -614 -117691 -246163 -196143 -245484 -376579 -370699 -215154 -126566
15232 -126566 14617 51218 -58442 -92545 13760 91396 -13381 -181051 -41240 -83976
15222 -83976 -152027 -161678 -142943 -25453 -29118 -37947 -113714 -175201 -62156 280352 359478 354251
15210 354251 224213 60779 109054 171788 53107 276086 254082 131117 -6790 -272855
15200 -272855 -305571 -261050 -172995 -195150 -388184 -483019 -353386 -213779 -65920 47362
$$ packed form
15275a16616k2376K10818r9532k29446J08374J08605n6556J07700K06177j6009
15265B01139R3025n9135r4112r7929k3158j33797j58886K5782J18127J71786R7430
15254A40272M2905p0168j78287m3577J72411J0607l2894R4480n5119R80M5775
15243A27385O197j04222k9974j17077j28472N0020m9341j31095N880J55545Q8588
15232a26566J41183L6601j09660l4103J06305P7636j04777j67670J39811m2736
15222h3976o8051r651J8735J17490l665q829p5767o1487J13045L42508P9126n227
15210C54251j30038j63434M8275O2734j18681K22979k2004j22965j37907k66065
15200b72855l2716M4521Q8055k2155j93034r4835J29633J39607J47859J13282
$$ plain form
15190 47362 48517 8711 81068 145059 56053 -223081 -265185 -234143 -212745 -163264 -99559 -124539
15178 -124539 -166693 -230500 -42766 -96148 -143117 -193893 -133026 8599 -22772 -192838 -223931
15167 -223931 -152245 -84929 -77482 -25672 35881 -95097 -101336 64290 239022 218114 -43155
15156 -43155 -205494 -253539 -155478 113684 160584 145601 87250 116598 110575 -63318 -128693
15145 -128693 -68875 4816 23824 106337 117970 66115 198640 130332 -94911 -157448 -154974
15134 -154974 -91022 -180342 -96559 -11844 72556 70859 8656 -246365 -407404 -171725 -58132
15123 -58132 -58254 66937 73409 -29905 -49759 -84843 -174459 -108768 37314 12694 -69793 -115561
15111 -115561 -49491 -151786 -139100 -9611 -8840 -96294 -79782 -66369 -10785 4536 -81068
$$ packed form
15190D7362J155l9806P2357O3991q9006k79134m2104L1042K1398M9481O3705k4980
15178a24539m2154o3807J87734n3382m6969n0776O0867J41625l1371j70066l1093
15167b23931P1686O7316P447N1810O1553j30978o239J65626J74732k0908k61269
15156d3155j62339m8045R8061K69162M6900j4983n8351K9348o023j73893o5375
15145a28693N9818P3691J9008Q2513J1633n1855J32525o8308k25243o2537K474
15134a54974O3952q9320Q3783Q4715Q4400j697o2203k55021j61039K35679J13593
15123e8132j22J25191O472j03314j9854l5084q9616O5691J46082k4620q2487m5768
15111a15561O6070j02295J2686J29489P71q7454J6512J3413N5584J5321q5604
$$ plain form
15100 -81068 -48261 39307 186443 450387 385641 170462 39766 151703 268248 136683
15090 136683 -181356 -137996 -33492 -147575 -163021 -56624 -1929 -11108 -54738 -6458 -103472
15079 -103472 32622 271680 198263 266424 346735 113730 55070 40719 -1320 88024 47168
15068 47168 -75595 -128002 -211610 -249604 -41884 -23749 29751 283430 264132 289268 288838
15057 288838 229488 234797 159875 68893 9993 -9864 99645 152285 100921 42944 44550 -11599
15045 -11599 5057 -96540 58845 296496 388982 311611 219442 168102 -67212 -118848 -45650
15034 -45650 -147085 -74910 -40588 -130864 -106549 21432 78887 -98371 -206495 -250560 -115752
15023 -115752 -42612 -13256 161140 190175 106411 46275 167398 185556 119581 69322 144614
$$ packed form
15100h1068L2807Q7568J47136K63944o4746k15179j30696J11937J16545j31565
15090A36683l18039M3360J04504j14083j5446J06397N4695r179m3630M8280r7014
15079a03472J36094K39058p3417O8161Q0311k33005n8660j4351m2039Q9344m0856
15068D7168j22763n2407q3608l7994K07720J8135N3500K53679j9298K5136m30
15057B88838n9350N309p4922r0982n8900j9857J09509N2640n1364n7977J606n6149
15045a1599J6656j01597J55385K37651R2486p7371r2169n1340k35314n1636P3198
15034d5650j01435P2175L4322r0276K4315J27981N7455j77258j08124m4065J34808
15023a15752P3140K9356J74396K9035q3764o0136J21123J8158o5975n0259P5292
$$ plain form
15012 144614 328661 365691 382121 428253 422605 203539 104848 87717 139001 -40410 -55876
15001 -55876 6600 71494 228686 73518 186445 291094 305019 311730 162517 142847 295169
14990 295169 377269 400295 253112 7891 -42099 -71582 -138548 -137569 31749 177176 235862
14979 235862 264264 456496 594505 481789 285527 203157 122185 196353 208052 249205 97117
14968 97117 135361 291413 360319 350099 374270 336558 199233 -42106 9307 58157 32529
14957 32529 35990 63829 -22769 -232211 -225454 -117426 115166 132761 45881 16282 38889
14946 38889 72518 11973 -57757 -43123 -61731 -96041 -26455 189354 109445 137775 192573
14935 192573 61069 73077 23424 -47564 37103 -17091 -85647 -53831 -39876 -14923 -81349
$$ packed form
15012A44614J84047L7030J6430M6132n648k19066r8691j7131N1284j79411j5466
15001e5876O2476O4894J57192j55168J12927J04649J3925O711j49213j9670J52322
14990B95169Q2100K3026j47183k45221m9990k9483o6966R79J69318J45427N8686
14979B35862K8402J92232J38009j12716j96262q2370q0972P4168J1699M1153j52088
14968I7117L8244J56052O8906j0220K4171l7712j37325k41339N1413M8850k5628
14957C2529L461K7839q6598k09442O757J08028K32592J7595q6880k9599K2607
14946C8889L3629o0545o9730J4634j8608l4310O9586K15809p9909K8330N4798
14935A92573j31504J2008m9653p0988Q4667n4194o8556L1816J3955K4953o6426
$$ plain form
14924 -81349 -76890 -103598 9453 181938 381556 128230 -234018 -172561 -66428 -91461 -94505
14913 -94505 -114182 -76366 78343 179575 147115 148030 222810 108708 104876 345166 386177
14902 386177 163787 4806 27209 -21355 -157877 -1479 -36141 -68981 -59199 -29472 -37579
14891 -37579 -182602 -200109 -221017 -105616 106040 153553 23453 -22591 190581 271801 124859
14880 124859 -25259 -13071 -122975 -240143 -477702 -519195 -378067 -136979 -139025 -146829 -86177
14869 -86177 -92186 170057 242938 250665 199134 145754 233844 234368 147750 -57519 -280173 -243610
14857 -243610 -141286 -163873 -300818 -313962 -151366 -83779 43448 43235 61185 234809 176290
14846 176290 79399 21256 -28058 733 -23233 47648 153592 81172 51334 32183 13892
$$ packed form
14924h1349M459k6708J13051J72485J99618k53326l62248O1457J06133k5033l044
14913i4505j9677L7816J54709J01232l2460R15P4780j14102l832K40290M1011
14902C86177k22390j58981K2403m8564j36522J56398l4662l2840R782K9727q107
14891c7579j45023j7507k0908J15401K11656M7513j30100m6044K13172Q1220j46942
14880A24859j50118J2188j09904j17168k37559m1493J41128K41088k046p804O0652
14869h6177o009K62243P2881P727n1531n3380Q8090N24q6618k05269k22654L6563
14857b43610J02324k2587j36945j3144J62596O7587J27227k13J7950J73624n8519
14846A76290r6891n8143m9314K8791k3966P0881J05944p2420k9838j9151j8291
$$ plain form
14835 13892 107827 159533 164306 210322 319518 378746 463902 490360 299519 132272 257909
14824 257909 168718 181954 251953 183388 317143 284004 203311 56483 47163 102145 108437
14813 108437 279175 183546 154252 262260 432067 295414 104068 61522 157364 108666
14803 108666 50507 147864 215028 191181 145772 18586 -24661 82734 90381 128787 93157
14792 93157 183050 83491 -117310 -153000 -17040 151087 137270 -15396 -131321 -88016 -95631
14781 -95631 57329 18526 -26274 -3413 -4466 28333 131078 186748 230234 54980 -3307
14770 -3307 163599 209160 36559 -40109 -85949 -213581 -214375 -194554 -127830 135356 271726
14759 271726 225762 227027 301792 284380 75790 24607 46920 161497 164399 190895 188522 34607
$$ packed form
14835A3892R3935N1706M773M6016J09196N9228Q5156K6458j90841j67247J25637
14824B57909q9191J3236O9999o8565J33755l3139q0693j46828r320N4982O292
14813A08437J70738r5629k9294J08008J69807j36653j91346m2546R5842m8698
14803A08666n8159R7357O7164k3847m5409j27186m3247J07395P647L8406l5630
14792I3157Q9893r9559k00801l5690J35960J68127j3817j52666j15925M3305p615
14781i5631J52960l8803m4800K2861j053L2799J02745N5670M3486j75254n8287
14770c307J66906M5561j72601p6668m5840j27632p94J9821O6724K63186J36370
14759B71726m5964J265P4765j7412k08590n1183K2313J14577K902K6496k373j53915
$$ plain form
14747 34607 18105 79252 117306 -38370 -141721 -192658 -135853 -136185 20534 120692 78239
14736 78239 66130 12232 210739 373587 252246 305054 219962 71863 -53334 53118
14726 53118 27042 117350 205943 199473 70527 91209 22079 67493 221410 274090 267147 268480
14714 268480 330078 392077 361576 394512 363937 249007 200891 172262 95734 73234 119021
14703 119021 111550 175852 288626 253768 157248 127405 99466 -48061 15297 -33727 -5179
14692 -5179 -6521 122352 23665 -55643 51915 -6164 -101911 213148 294079 313704 288827
14681 288827 293996 285136 222624 107565 54081 179006 61586 -104868 -101908 -77459 -86210
14670 -86210 -27363 11892 -72662 -132749 15805 119713 137426 166187 86169 -81703 -18390
$$ packed form
14747C4607j6502O1147L8054j55676j03351n0937N6805l32J56719J00158m2453
14736G8239j2109n3898J98507J62848j21341N2808q5092j48099j25197J06452
14726E3118k6076R0308Q8593o470j28946K0682o9130M5414J53917N2680o943J333
14714B68480O1598O1999l0501L2936l0575j14930m8116k8629p6528k2500M5787
14703A19021p471O4302J12774l4858r6520k9843k7939j47527O3358m9024K8548
14692e179j342J28873r8687p9308J07558n8079r5747L15059Q0931J9625k4877
14681B88827N169q860o2512j15059n3484J24925j17420j66454K960K4449q751
14670h6210N8847L9255q4554o0087J48554J03908J7713K8761q0018j67872O3313
$$ plain form
14659 -18390 67087 135301 172656 99769 -106177 -311886 -250820 -311402 -204510 -43737 40168
14648 40168 99880 111734 163994 209303 76617 165435 154374 137188 165545 25269 58355
14637 58355 154585 44143 210968 372086 254247 242222 -33118 -209813 -211145 -151659 -135225
14626 -135225 -271586 -307301 -199946 -212861 -89659 57135 -12699 -196576 -309205 -123610
14616 -123610 162737 130313 214406 190875 140094 88720 -29491 22538 124386 161514 145027
14605 145027 106549 -29597 -21127 -63164 -47332 13909 -49250 -28841 30615 176654 253505
14594 253505 218207 129519 179201 207024 159583 85462 -66451 73853 171021 72468 111518
14583 111518 229087 262636 214900 184414 148492 -81310 -76007 5778 -31661 28330 14181
$$ packed form
14659a8390Q5477O8214L7355p2887k05946k05709O1066o0582J06892J60773Q3905
14648D0168N9712J1854N2260M5309j32686Q8818j1061j7186K8357j40276L3086
14637E8355R6230j10442J66825J61118j17839j2025k75340j76695j332N9486J6434
14626a35225j36361l5715J07355j2915J23202J46794o9834j83877j12629J85595
14616a23610K86347l2424Q4093k3531n0781n1374j18211N2029J01848L7128j6487
14605A45027l8478j36146Q470m2037J5832O1241o3159K0409N9456J46039P6851
14594B53505l5298q8688M9682K7823m7441p4121j51913J40304R7168r8553L9050
14583A11518J17569L3549m7736l0486l5922k29802N303Q1785l7439N9991j4149
$$ plain form
14572 14181 64701 275068 562289 434089 299953 200603 181594 181262 229718 163488 221917
14561 221917 161678 -18505 -128167 -7213 -3856 -160072 45276 267746 492967 577417
14551 577417 378556 389286 285831 7329 -52495 113465 89205 -19544 -72323 26139
14541 26139 49052 22246 -108796 -60206 121973 305704 376600 360220 131542 139207 103825
14530 103825 59104 29256 36276 141105 60428 101073 -27615 -172824 -103410 -113610 29590
14519 29590 133519 249224 331909 255915 176179 189882 62129 -51243 -84693 -117116 -70746
14508 -70746 -52429 34507 153937 122467 125904 116525 64421 283613 252623 155193 251269 316518
14496 316518 237581 304317 188266 53938 88958 -50812 -121006 -152352 -140644 -8087 157872
$$ packed form
14572A4181N0520K10367K87221j28200j34136r9350j9009l32M8456o6230N8429
14561B21917o0239j80183j09662J20954L357j56216K05348K22470K25221Q4450
14551E77417j98861J0730j03455k78502n9824J65960k4260j08749n2779R8462
14541B6139K2913k6806j31042M8590J82179J83731P0896j6380k28678P665l5382
14530A03825m4721k9848P020J04829q0677M0645j28688j45209O9414j0200J43200
14519B9590J03929J15705Q2685p5994p9736J3703j27753j13372l3450l2423M6370
14508g0746J8317Q6936J19430l1470L437r379n2104K19192l0990r7430R6076O5249
14496C16518p8937O6736j16051j34328L5020j39770p0194l1346J1708J32557J65959
$$ plain form
14485 157872 107977 184190 266497 221664 69224 11379 -37226 -73213 74803 103282 196443
14474 196443 27827 -10630 83482 79549 -47017 -53596 153072 152853 70721 23241 79391 76455
14462 76455 104520 185063 92383 -104915 -357389 -381125 -201473 -78298 -32435 -5860 72109
14451 72109 58277 49151 -15490 47445 160732 230492 155698 -21896 43765 8328 -67909
14440 -67909 -180945 -8078 58514 142482 31109 15768 42890 81388 129148 171473 98880
14429 98880 -9356 -30411 -87075 -81660 -126649 -218895 -226416 -101644 -32463 -185658 -206766
14418 -206766 -192622 -209829 -134609 -94854 -64889 -166996 -216286 10327 180799 224870 310836
14407 310836 287830 254097 139289 97476 173928 248977 246209 381809 480604 511334 316791
$$ packed form
14485A57872m9895P6213Q2307m4833j52440n7845m8605l5987J48016K8479R3161
14474A96443j68616l8457R4112l933j26566o579K06668k19q2132m7480N6150k936
14462G6455K8065Q0543r2680j97298k52474k3736J79652J23175M5863K6575P7969
14451G2109j3832r126o4641O2935J13287O9760p4794j77594O5661l5437p6237
14440f7909j13036J72867O6592Q3968j11373j5341K7122L8498M7760M2325p2593
14429I8880j08236k1055n6664N415m4989r2246p521J24772O9181j53195k1108
14418b06766J4144j7207P5220L9755K9965j02107m9290K26613J70472M4071Q5966
14407C10836k3006l3733j14808m1813P6452P5049k768J35600R8795L0730j94543
$$ plain form
14396 316791 103945 135455 309898 216902 89700 170724 190993 -27883 -107715 -374571
14386 -374571 -416968 -267174 -221319 -141512 -124913 156769 192872 86834 6864 -45455 -101371
14375 -101371 -170910 116829 252756 330836 274214 259482 380663 423115 190560 187043 147757
14364 147757 -83805 -66913 -19062 28389 124483 88788 -25438 -98749 -35407 100523 132979
14353 132979 25677 -107924 -144306 49259 282056 351109 255127 22916 -17837 106376
14343 106376 195174 165175 37924 -119075 -208019 -232803 -178902 -8315 -16643 -70935 -197976
14332 -197976 -242795 -126506 -35015 -162296 -159983 -87872 5516 -33277 123905 229201 11480
14321 11480 -95927 4623 76700 87823 79940 81896 -23629 -57234 -98553 -175919 -84878
$$ packed form
14396C16791k12846L1510J74443r2996j27202Q1024K0269k18876p9832k66856
14386c74571m2397J49794M5855P9807J6599K81682L6103j06038p9970n2319n5916
14375a01371o9539K87739J35927P8080n6622j4732J21181M2452k32555l517l9286
14364A47757k31562J6892M7851M7451R6094l5695j14226p3311O3342J35930L2456
14353A32979j07302j33601l6382J93565K32797O9053r5982k32211m0753J24213
14343A06376Q8798k9999j27251j56999q8944k4784N3901J70587q328n4292j27041
14332a97976m4819J16289R1491j27281K313P2111R3388l8793J57182J05296k17721
14321A1480j07407J00550P2077J1123p883J956j05525l3605m1319p7366R1041
$$ plain form
14310 -84878 161388 158276 129039 26250 -73933 -239056 -134757 -69067 -20249 65427 90248
14299 90248 39256 12876 67047 -47675 -206636 -308175 -263294 -37703 -111325 -122929 -91953
14288 -91953 -109494 -136741 -177869 -129153 -76102 -57860 -10148 128088 -52932 -68485 29419
14277 29419 36450 -98272 -186129 -174585 -157167 -220456 -136849 -26929 -24613 -259375 -225386
14266 -225386 -148897 -86008 30695 -16025 -139970 -259017 -156236 78646 171947 41978
14256 41978 -95090 -135376 -81168 -24490 68194 137401 -27482 5934 122769 -83256 -221212
14245 -221212 -151948 -234803 -205513 -172474 -108605 -48115 26512 183887 220064 244527 59712
14234 59712 -90338 -139459 -102293 -243985 -413808 -237789 -742 292725 318967 138555
$$ packed form
14310h4878K46266l112k9237j02789j00183j65123J04299O5690M8818Q5676K4821
14299I0248n0992k6380N4171j14722j58961j01539M4881K25591p3622j1604L0976
14288i1953j7541k7247m1128M8716N3051J8242M7712J38236j81020j5553R7904
14277B9419P031j34722q7857J1544J7418o3289Q3607J09920K316k34762L3989
14266b25386P6489O2889J16703m6720j23945j19047J02781K34882R3301j29969
14256D1978j37068m0286N4208N6678R2684O9207j64883L3416J16835k06025j37956
14245b21212O9264q2855K9290L3039O3869O0490P4627J57375L6177K4463j84815
14234E9712j50050m9121L7166j41692j69823J76019K37047K93467K6242j80412
$$ plain form
14224 138555 48614 14880 57713 177804 213722 248066 281546 84484 57715 -111048 -257127
14213 -257127 -183917 -134009 -2639 50364 60724 129704 127608 62719 -26672 46664 52681 -133184
14201 -133184 -104856 -26590 -44630 -96548 -106073 -19499 123933 105568 -111585 -106327 -49545
14190 -49545 -73070 117899 162569 4070 -78197 -40725 9077 22686 -19549 74029 278446
14179 278446 341138 264915 46697 -17387 58775 118705 -3088 -172616 -124435 67897 334290
14168 334290 381636 284018 136414 85069 10989 7749 43827 70688 -74449 -57041 -43710
14157 -43710 -73813 15138 262526 309099 126292 254866 403293 257296 258781 141096 12665
14146 12665 -77120 -140776 -232163 -79956 99398 30857 23713 1786 78115 10581 -102668
$$ packed form
14224A38555q9941l3734M2833J20091L5918L4344L3480j97062k6769j68763j46079
14213b57127P3210M9908J31370N3003J0360O8980k096o4889q9391P3336O017j85865
14201a33184K8328P8266j8040n1918r525Q6574J43432j8365k17153N258N6782
14190d9545k3525J90969M4670j58499q2267L7472M9802J3609m2235R3578K04417
14179B78446O2692p6223k18218o4084P6162N9930j21793j69528M8181J92332K66393
14168C34290M7346r7618j47604n1345p4080l240L6078K6861j45137J7408J3331
14157d3710l0103Q8951K47388M6573j82807J28574J48427j45997J485j17685j28431
14146A2665q9785o3656r1387J52207J79354o8541p144k1927P6329o7534j13249
$$ plain form
14135 -102668 -60597 5594 -93728 -118635 8127 57508 129845 -14521 -113025 -135460 -118160
14124 -118160 23553 202934 220911 198605 124988 117208 -98822 -260050 -123634 3705
14114 3705 48929 103613 277464 245726 217292 116457 146760 276915 361436 311244 95794
14103 95794 60314 26389 -37718 -64295 23622 64900 67381 -170440 -223912 -224630 -255613 -199047
14091 -199047 -112742 43094 196369 119652 91985 14325 -24497 -99977 -143768 -68687 -5172
14080 -5172 -28470 10304 1744 -29619 -126589 -125470 -38108 75288 197395 265090 -19056 -123383
14068 -123383 14108 -28737 -37727 8620 -147600 -374757 -439584 -274559 -279462 -116698 -32620
14057 -32620 94233 183741 128922 89987 134211 -27117 -131985 13415 145105 108262 13222
$$ packed form
14135a02668M2071O6191r9322k4907J26762M9381P2337j44366r8504k2435J7300
14124a18160J41713J79381J7977k2306p3617p780k16030j61228J36416J27339
14114C705M5224N4684J73851l1738k8434j00835L0303J30155Q4521n0192k15450
14103I5794l5480l3925o4107k6577Q7917M1278K481k37821n3472p18l0983N6566
14091a99047Q6305J55836J53275p6717k7667p7660l8822p5480m3791P5081O3515
14080e172k3298L8774q560l1363r6970J119Q7362J13396J22107O7695k84146j04327
14068a23383J37491m2845q990M6347j56220k27157o4827J65025m903J62764Q4078
14057c2620J26853Q9508n4819l8935M4224j61328j04868J45400J31690l6843r5040
$$ plain form
14046 13222 -45511 -147198 38427 183558 316430 215941 69444 12685 13045 -42436 -161635
14035 -161635 -137453 -155958 -194761 9771 109863 43066 49143 138391 151981 -76104 -208761
14024 -208761 -174962 -165472 -194621 -103705 -112791 -204793 -99146 -61239 -115994 -70978 -1861 98794
14012 98794 165256 143075 143265 92998 61257 75170 132706 123736 -89449 -74514 -72394 -24045
14000 -24045 283568 387168 320402 220522 190652 129084 76533 8304 172266 170773 103174
13989 103174 78961 -1869 69491 -217431 -457592 -428986 -386972 -166397 27890 -33429 6018
13978 6018 79742 5948 -97789 -72540 -18183 -31399 40669 227036 297927 99326 16851
13967 16851 -116259 -183204 -50087 110015 77528 -33890 -102116 -27060 91429 50139 108883
$$ packed form
14046A3222n8733j01687J85625J45131J32872j00489j46497n6759L60n5481j19199
14035a61635K4182j8505l8803K04532J00092o6797O077Q9248J3590k28085j32657
14024b08761L3799R490k9149R0916r086r2002J05647L7907n4755M5016O9117J00655
14012I8794O6462k2181J90n0267l1741J3913N7536q970k13185J4935K120M8349
14000b4045L07613J03600o6766r9880k9870o1568n2551o8229J63962j493o7599
13989A03174k4213q0830P1360k86922k40161K8606M2014K20575J94287o1319L9447
13978F018P3724p3794j03737K5249N4357j3216P2068J86367P0891j98601q2475
13967A6851j33110o6945J33117J60102l2487j11418o8226P5056J18489m1290N8744
$$ plain form
13956 108883 76463 50350 -48981 -40987 64154 -318 -81666 -85339 -183828 -39404 107504
13945 107504 312675 297048 285338 266869 264213 145900 223574 305535 163762 7502 -233645
13934 -233645 -251415 -111839 -175493 -352321 -350084 -227790 17828 119129 139108 183602 171446
13923 171446 148969 51915 -197523 -58087 173411 175270 -27437 22220 201745 301654 284574
13912 284574 235172 161075 82161 137286 72271 18040 -2459 -105274 -221402 -80489 -9170
13901 -9170 3027 106556 203161 125248 128019 -63432 -31339 -17074 -59619 98688 66666
13890 66666 -33937 -55684 -117760 -105799 40117 -10847 16799 33722 23718 -106180 -225117
13879 -225117 -199536 -90211 83503 185025 300393 180574 141592 107714 88915 -61660
$$ packed form
13956A08883l2420k6113r9331P994J05141o4472q1348l673r8489J44424J46908
13945A07504K05171j5627j1710j8469k656j18313P7674Q1961j41773j56260k41147
13934b33645j7770J39576o3654j76828K237J22294K45618J01301J9979M4494j2156
13923A71446k2477r7054k49438J39436K31498J859k02707M9657J79525R9909j7080
13912B84574m9402p4097p8914N5125o5015n4231k0499j02815j16128J40913P1319
13901i170J2197J03529R6605p7913K771j91451L2093J4265m2545J58307l2022
13890F6666j00603k1747o2076J1961J45916n0964K7646J6923j0004j29898j18937
13879b25117K5581J09325J73714J01522J15368j19819l8982l3878j8799j50575
$$ plain form
13869 -61660 -172250 -129057 30301 71191 -14207 80 19753 -113414 -130522 -113543 -43413
13858 -43413 25989 244331 85789 -98501 -15676 243204 343637 159559 62234 -40013
13848 -40013 -219437 -45002 31597 -44619 -106656 -67782 -64633 -81981 36201 169519 280164
13837 280164 131454 -111059 -174581 -274520 -143255 40540 152553 -53233 -77351 -28786
13827 -28786 23989 -13107 -82205 -18187 133268 216935 109125 -80541 -223409 -263344 -153576
13816 -153576 57509 134867 119470 -1303 38763 111267 169874 140694 53140 109403 226697
13805 226697 126240 -97083 -185533 -140558 -200111 -138103 79543 142233 142043 146910 187826
13794 187826 200829 69690 48080 -43237 -26303 8361 -15307 -21726 -96704 1563 198415
$$ packed form
13869f1660j10590M3193J59358M0890q5398J4287J9673j33167j7108J6979P0130
13858d3413O9402K18342j58542j84290Q2825K58880J00433j84078r7325j02247
13848d0013j79424J74435P6599p6216o2037L8874L149j7348J18182J33318J10645
13837B80164j48710k42513o3522r9939J31265J83795J12013k05786k4118M8565
13827b8786N2775l7096o9098O4018J51455Q3667j07810j89666j42868l9935J09768
13816a53576K11085P7358j5397j20773M0066P2504N8607k9180q7554N6263J17294
13805B26697j00457k23323q8450M4975n9553O2008K17646O2690j90M867M0916
13794A87826J3003j31139k1610r1317J6934L4664k3668o419p4978R8267J96852
$$ plain form
13783 198415 137065 38915 124082 89182 237242 440312 494548 137922 40163 4344 -20800
13772 -20800 -165988 -124880 61029 218790 176016 150146 -51544 -29372 95209 104733 27323
13761 27323 -107574 -112283 -28774 82161 233116 362088 421968 451434 478142 280625 160411
13750 160411 73454 79176 168953 139471 99130 -46030 -99632 -150426 -52392 62071 32092
13739 32092 52301 -116310 91491 145829 133993 84618 35418 40477 -72836 -89027 80362
13728 80362 368024 531933 592835 368420 138185 -13774 -140836 -30540 143785 97081
13718 97081 -100485 -35434 45112 27027 73890 -43006 -189525 -210536 -150720 -31607 90131
13707 90131 106095 174977 11553 -47936 72455 147990 236958 224473 128020 141143 283853
$$ packed form
13783A98415o1350r8150Q5167l4900J48060K03070N4236l56626r7759l5819k5144
13772b0800j45188M1108J85909J57761m2774k5870k01690K2172J24581R524p7410
13761B7323j34897m709Q3509J10935J50955J28972N9880K9466K6708j97517j20214
13750A60411q6957N722Q9777k9482m0341j45160n3602n0794R8034J14463k9979
13739C2092K0209j68611K07801N4338j1836m9375m9200N059j13313j6191J69389
13728H0362K87662J63909O0902k24415k30235j51959j27062J10296J74325m6704
13718I7081j97566O5051Q0546j8085M6863j16896j46519k1011N9816J19113J21738
13707I0131J5964O8882j63424n9489J20391P5535Q8968j2485r6453J3123J42710
$$ plain form
13696 283853 405510 296539 243679 143417 142571 51090 -134379 -113502 37390 62176 34374
13685 34374 26393 60915 155065 112455 -88191 -132513 -17298 -44074 8935 205477 165914
13674 165914 97005 191314 79015 -32256 -124006 -123237 -49446 37395 -25453 -10537 -95732
13663 -95732 -201620 -163845 -25037 -68577 -42485 -24453 -7163 -33046 -90440 -92425 -158991
13652 -158991 -217391 -234586 -222668 -192964 -107846 -108890 -127756 -226573 -85334 -112104 -170419
13641 -170419 -123131 -132458 -2063 -157427 -273547 -237569 -99927 -305129 -339144 -163230
13631 -163230 -113230 -124804 21306 73392 22591 173178 331268 386971 277036 216383 160238
13620 160238 36024 23880 -26106 -106103 -134197 21966 137426 101118 189367 338618 296336
$$ packed form
13696B83853J21657j08971n2860j00262q46r1481j85469K0877J50892K4786k7802
13685C4374p981L4522R4150m2610k00646m4322J15215k6776N3009J96542l9563
13674A65914o8909R4309j12299j11271r1750P69P3791Q6841o2848J4916q5195
13663i5732j05888L7775J38808m3540K6092J8032J7290k5883n7394j985o6566
13652a58991n8400j7195J1918K9704Q5118j044j8866r8817J41239k6770n8315
13641a70419M7288r327J30395j55364j16120L5978J37642k05202l4015J75914
13631a63230N0000j1574J46110N2086n0801J50587J58090N5703j09935o0653n6145
13620A60238j24214j2144m9986p9997k8094J56163J15460l6308Q8249J49251m2282
$$ plain form
13609 296336 88367 -80487 -237904 -236155 -215860 -262121 -223347 -137125 12351 13002 -86516
13598 -86516 -49628 18883 34280 79686 48056 174074 147618 -122684 -148248 2445 92990
13587 92990 128421 105249 62344 -39353 -120368 -18166 152524 52781 3695 -217774 -187051
13576 -187051 -139913 -72329 3372 -52177 -12272 94907 241201 264381 233985 66967 93057
13565 93057 9370 -21337 -105335 -172975 -92644 76024 216616 141445 112746 149582 125173
13554 125173 -68553 -165610 -146909 -94910 45062 121597 -6170 88376 8377 -176212 -204014
13543 -204014 -163676 -35768 29199 6226 121162 179190 319489 329742 344327 431058 326013
13532 326013 293423 193787 27451 -26751 -16164 -6222 30315 -14268 -8044 -48495 -83744 -26719
$$ packed form
13609B96336k07969j68854j57417J749K0295m6261L8774Q6222J49476O51r9518
13598h6516L6888O8511J5397M5406l1630J26018k6456k70302k5564J50693R0545
13587I2990L5431k3172m2905j01697q1015J02202J70690r9743m9086k21469L0723
13576a87051M7138O7584P5701n5549L9905J07179J46294K3180l0396j67018K6090
13565I3057q3687l0707q3998o7640Q0331J68668J40592p5171k8699L6836k4409
13554A25173j93726r7057J8701N1999J39972P6535j27767R4546p9999j84589k7802
13543b04014M0338J27908O4967k2973J14936N8028J40299J0253J4585Q6731j05045
13532C26013l2590r9636j66336n4202J0587R942L6537m4583O224m0451l5249N7025
$$ plain form
13520 -26719 -55220 -70378 -5094 -120062 -161664 -73186 -106146 -92138 -49199 -108604 -90060
13509 -90060 -45583 -60442 74877 152440 108066 122357 120264 55493 -25516 19973 134958
13498 134958 31627 -45653 -15782 63963 77245 167521 120715 115468 110890 124992 100026 43345
13486 43345 105834 157241 217244 194521 36038 -65093 -141281 -200262 -143246 -98441 36296
13475 36296 118977 -19710 34090 180702 209905 194178 3370 -74840 -115515 -145086 -72080
13464 -72080 -44551 -52634 42043 98020 -101262 -78240 23293 83603 104615 27980 165358
13453 165358 98143 152237 200062 205672 109931 -104640 -264970 -245962 -25024 -20428 -50094
13442 -50094 -165504 7798 145777 199733 157118 102537 60640 -7783 13816 44613 -118283
$$ packed form
13520b6719k8501j5158O5284j14968m1602Q8478l2960J4008M2939n9405J8544
13509i0060M4477j4859J35319P7563m4374J4291k093o4771q1009M5489J14985
13498A34958j03331p7280K9871P9745J3282R0276m6806n247m578J4102k4966n6681
13486D3345O2489N1407O0003k2723j58483j01131p6188n8981N7016M4805J34737
13475C6296Q2681j38687N3800J46612K9203j5727j90808p8210m0675k9571P3006
13464g2080K7529q083R4677N5977j99282K3022J01533O0310K1012p6635J37378
13453A65358o7215N4094M7825N610r5741k14571j60330J9008K20938M596k9666
13442e0094j15410J73302J37979N3956m2615n4581m1897o8423K1599L0797j62896
$$ plain form
13431 -118283 -94554 -30793 -60734 -23454 -12101 -19333 -35287 -91680 63007 58222 -98366
13420 -98366 -224205 -200649 -214147 -185850 -90811 -69957 45579 86673 47415 -16852 38212
13409 38212 -67945 -62483 -320317 -437307 -520740 -336900 -256276 -247525 -265546 -276897 -263746
13398 -263746 -143331 -21790 -18274 -57340 -80284 -122261 -253841 -325748 -222941 -240334 -315797
13387 -315797 -244202 -159857 -14340 200633 114282 -20496 -178724 -72420 132950 166704
13377 166704 114269 145459 224375 264005 245313 201577 114678 -47539 -111479 -95556 11600
13366 11600 143403 241140 254248 262104 344378 208353 140942 -6783 99968 109129 147676
13355 147676 -14077 -118544 -58039 -46567 -44165 312515 340000 71710 62958 103197 43681
$$ packed form
13431a18283K3729O3761k9941L7280J1353p232j5954n6393J54687m785j56588
13420i8366j25839K3556j3498K8297R5039K0854J15536M1094l9258o4267N5064
13409C8212j06157N462k57834j16990q3433J83840Q0624Q751j8021j1351J3151
13398b63746J20415J21541L516l9066k2944m1977j31580p1907J02807j7393p5463
13387c15797P1595Q4345J45517K14973q6351j34778j58228J06304K05370L3754
13377A66704n2435L1190P8916L9630j8692m3736q6899j62217o3940J5923J07156
13366A1600J31803R7737J3108P856Q2274j36025o7411j47725J06751R161L8547
13355A47676j61753j04467O0505J1472K402L56680K7485k68290q752M0239n9516
$$ plain form
13344 43681 42600 156542 207697 27929 -113650 -74518 76435 169990 70007 42726 129606
13333 129606 193468 139596 24749 37246 74681 138846 46630 -49666 13832 136060 244103
13322 244103 413751 186345 170122 190928 64445 -115230 -183666 -83970 17615 134377
13312 134377 152155 223213 121134 10781 6161 134699 -73817 -191890 -94704 -29293 -56959
13301 -56959 -158149 -72653 7578 -42328 -121120 -10776 58408 52319 67068 158119 -46653
13290 -46653 -125742 50827 207687 39381 -48580 -137363 -104311 -134840 -185239 -338730 -330556
13279 -330556 -265049 -249631 -360378 -296199 -172055 -83011 -28240 143935 74280 -138605 -269679
13268 -269679 -274114 -196729 -17433 197038 109583 -67706 -110378 -42996 -128964 -49289 -83347
$$ packed form
13344D3681j081J13942N1155j79768j41579L9132J50953R3555r9983k7281Q6880
13333A29606O3862n3872j14847J2497L7435O4165r2216r6296O3498J22228J08043
13322B44103J69648k27406j6223K0806j26483j79675o8436R9696J01585J16762
13312A34377J7778P1058j02079j10353m620J28538k08516j18073R7186O5411k7666
13301e6959j01190Q5496Q0231m9906p8792J10344O9184o089J4749R1051k04772
13290d6653p9089J76569J56860j68306q7961q8783L3052l0529n0399j53491Q174
13279c30556O5507J5418j10747O4179J24144Q9044N4771J72175o9655k12885j31074
13268b69679m435P7385J79296K14471q7455j77289m2672O7382q5968P9675l4058
$$ plain form
13257 -83347 -30644 -43135 -269871 -298063 -119331 11964 184425 206063 151815 146855 96540
13246 96540 117553 -560 99149 198740 397239 370887 110451 78103 170009 212220 24793
13235 24793 -45182 61528 -58970 -125706 -36152 -118918 -120355 -53463 -23418 8628 -127645
13224 -127645 -70519 -84311 -24786 -55760 -33802 -25597 -50412 117902 133013 18594 -132522
13213 -132522 -75306 -55755 98881 302534 295366 258830 233572 151284 137056 135047 -94939
13202 -94939 -147032 -8736 -38236 33834 136138 204360 176773 70819 148931 -16023 10841
13191 10841 136330 135771 109494 34503 154252 151456 151985 145037 87095 21038 -191880 -252438
13179 -252438 -226206 -273947 -201160 -87137 73116 35271 -32920 152671 170423 138966 179766
$$ packed form
13257h3347N2703j2491k26736k8192J78732J31295J72461K1638n4248m960n0315
13246I6540K1013j18113R9709R9591J98499k6352k60436l2348R1906M2211j87427
13235B4793o9975J06710j20498o6736Q9554q2766j437O6892L0045L2046j36273
13224a27645N7126j3792N9525l0974K1958Q205k4815J68314J5111j14419j51116
13213a32522N7216J9551J54636K03653p168l6536k5258q2288j4228k009k29986
13202i4939n2093J38296k9500P2070J02304O8222k7587j05954P8112j64954K6864
13191A0841J25489n59k6277p4991J19749k796N29o948n7942o6057k12918o0558
13179b52438K6232m7741P2787J14023J60253l7845o8191J85591J7752l1457M0800
$$ plain form
13168 179766 141343 -19249 82892 139564 83553 61066 219606 146270 125364 15827 -135598
13157 -135598 -109405 -5296 9468 165142 146101 128933 158137 181975 138489 111819 132910
13146 132910 -61237 -93504 48451 118064 151828 159574 36110 -185003 -288034 -269272 -201183
13135 -201183 -192377 -201731 -72865 86441 199264 129191 135115 -7930 162111 199585 74496
13124 74496 86849 35751 -93411 -114348 -189521 -59186 151018 113014 -93847 -116499 -62707
13113 -62707 -78429 15346 -1327 59685 22063 16268 116735 249460 107002 -14346 21611
13102 21611 -8325 -57525 -30551 8592 168672 185278 114907 31118 58248 21459 54991
13091 54991 5021 -24700 -130233 -304377 -307144 -222060 -117267 526 93276 218596 114790
$$ packed form
13168A79766l8423j60592J02141N6672n6011k2487J58540p3336k0906j09537j51425
13157a35598K6193J04109J4764J55674j9041j7168K9204K3838m3486k6670K1091
13146A32910j94147l2267J41955O9613L3764P746j23464k21113j03031J8762O8089
13135b01183Q806r354J28866J59306J12823p0073N924j43045J70041L7474j25089
13124G4496J2353n1098j29162k0937p5173J30335K10204l8004k06861k2652N3792
13113f2707j5722R3775j6673O1012l7622n795J00467J32725j42458j21348L5957
13102B1611k9936m9200K6974L9143J60080J6606p0371q3789K7130l6789L3532
13091E4991m9970k9721j05533j74144k767Q5084J04793J17793R2750J25320j03806
$$ plain form
13080 114790 115481 107359 91999 210782 127939 -51034 -155707 -70045 62929 48481 66180
13069 66180 229199 98230 -104026 -267819 -264276 -96862 58542 194400 46542 -47186
13059 -47186 52709 45685 88702 83559 81670 51077 222284 386824 153721 -40994 -30398
13048 -30398 178054 245069 158434 39794 10190 -13340 -99151 -27338 103973 -99821 -106091
13037 -106091 -118028 -193443 -227096 -159533 -63125 -38173 120791 277710 328040 172904 114994
13026 114994 96095 141815 -86249 -321020 -178523 -17518 -76208 -282041 -356614 -330563
13016 -330563 -191653 -113432 -36685 -100684 -85569 -115680 -167853 -68457 -72015 -208516 -171260
13005 -171260 92619 228333 51314 44308 81392 -30656 -66727 22874 111341 199136 217188
$$ packed form
13080A14790O91q122j5360J18783q2843j78973j04673Q5662J32974j4448J7699
13069F6180J63019j30969k02256j63793L543J67414J55404J35858j47858r3728
13059d7186R9895p024M3017n143j889l0593J71207J64540k33103j94715J0596
13048c0398K08452O7015q6635j18640k9604k3530q5811P1813J31311k03794o270
13037a06091j1937p5415l3653O7563R6408K4952J58964J56919N0330j55136n7910
13026A14994j8899M5720k28064k34771J42497J61005n8690k05833p4573K6051
13016c30563J38910P8221P6747o3999J5115l0111n2173R9396l558j36501L7256
13005a71260K63879J35714j77019p006L7084j12048l6071Q9601Q8467Q7795J8052
$$ plain form
12994 217188 159134 159885 230671 151336 120128 139101 132754 16241 -120447 -64765 54618
12983 54618 42578 -153113 -269872 -153685 -32900 97869 56206 73282 236199 293128
12973 293128 235657 117412 -35092 -3498 -16093 -221067 -364992 -195178 -101974 -12622
12963 -12622 -106039 -109467 -69684 -27124 -55964 107059 230567 263466 146887 -4533 -124159
12952 -124159 -140670 -90273 -99637 -91742 -52010 -68999 -139838 -210396 -120929 -187766 -124067 -158599
12940 -158599 -143982 54623 224180 345857 322631 149238 -128373 -290054 -153738 23401
12930 23401 25394 46056 130481 54370 50521 -94315 -273033 -331866 -249935 -254128 -113918 -6699
12918 -6699 89874 89781 32385 -143863 -196095 -12 -57049 -340794 -334244 -244122 -331909 -261988
$$ packed form
12994B17188n8054P51P0786p9335l1208J8973o347j16513j36688N5682J19383
12983E4618j2040j95691j16759J16187J20785J30769m1663J7076J62917N6929
12973B93128n7471j18245j52504L1594j2595k04974j43925J69814R3204Q9352
12963a2622r3417l428L9783M2560k8840J63023J23508L2899j16579j51420j19626
12952a24159j6511N0397r364P895L9732j6989p0839p0558Q9467o6837O3699l4532
12940a58599J4617J98605J69557J21677k3226j73393k77611j61681J36316J77139
12930B3401J993K0662Q4425p6111l849j44836j78718n8833Q1931m193J40210J07219
12918f699R6573r3n7396j76248n2232J96083n7037k83745O550R0122q7787O9921
$$ plain form
12906 -261988 -126459 -45291 54507 -82153 -183840 52808 202074 252402 194071 129644
12896 129644 184986 321499 334913 296671 145041 -127595 -158961 -193296 -81248 -139448 -253923
12885 -253923 -81559 100191 -57137 62517 144377 -108375 -215314 -132597 -150292 -251493
12875 -251493 -325926 -245349 -133733 -114621 -164571 -197059 -115318 -159686 -157381 -137121 -146117 -175908
12863 -175908 -162660 -177526 -301611 -211751 -204616 -180846 -183253 -259743 -319676 -322413 -208407 -275742
12851 -275742 -305827 -244340 -223603 -208473 -17951 143426 59982 -42037 20682 37909 -51882
12840 -51882 -40368 108266 173579 118204 191171 240545 97697 15368 95076 115151 146660
12829 146660 201469 176924 142757 903 12337 -117943 63970 49020 -137189 -197796 -108205
$$ packed form
12906b61988J35529Q1168R9798j36660j01687K36648J49266N0328n8331o4427
12896A29644N5342J36513J3414l8242j51630k72636l1366l4335J12048n8200j14475
12885b53923J72364J81750j57328J19654Q1860k52752j06939Q2717j7695j01201
12875b51493p4433Q0577J11616J9112m9950l2488Q1741m4368K305K0260q996k9791
12863a75908J3248j4866j24085Q9860P135K3770k407p6490n9933k737J14006o7335
12851b75742l0085O1487K0737J5130J90522J61377q3444j02019O2719J7227q9791
12840e1882J1514J48634O5313n5375P2967M9374j42848q2329P9708K0075L1509
12829A46660N4809k4545l4167j41854J1434j30280J81913j4950j86209o0607Q9591
$$ plain form
12818 -108205 -141054 -136061 -173312 -47451 42909 111450 111257 4194 45128 198986 125334
12807 125334 -66970 -89467 -117046 -188055 -175290 -173162 -11332 169241 236670 344094 281972
12796 281972 195043 168444 83572 105518 202731 91110 -86633 -197160 -126157 -125688 -221571
$$ packed form
12818a08205l2849M993l7251J25861R0360O8541j93j07063M0934J53858p3652
12807A25334j92304k2497k7579p1009J2765K128J61830J80573O7429J07424o2122
12796B81972q6929k6599q4872K1946R7213j11621j77743j10527P1003M69r5883
$$ [...]
##END NTUPLES=NMR SPECTRUM
##END=
