##TITLE=Analysis number 327113
Compound Code cc 52446
Book Reference 464/110/2
Project Code adrs
Chemist Name chrisr
##JCAMPDX= 6.0         $$ Bruker NMR JCAMP-DX V2.0
##DATA TYPE= NMR SPECTRUM
##DATA CLASS= NTUPLES
##ORIGIN= Bruker BioSpin GmbH
##OWNER= nmr
$$ XWIN-NMR		Version 3.5
$$ Mon Mar 12 11:31:31 2007 GMT Standard Time (UT+0h)  MAYBRIDGE\nmr@NMR_250MHZ
##.OBSERVE FREQUENCY= 250.131544655141
##.OBSERVE NUCLEUS= ^1H
##.ACQUISITION MODE= SIMULTANEOUS (DQD)
##.ACQUISITION SCHEME= undefined
##.AVERAGES= 16
##.DIGITISER RES= 18
##SPECTROMETER/DATA SYSTEM= dpx250
##.PULSE SEQUENCE= zg30
##.SOLVENT NAME= CDCl3
##.SHIFT REFERENCE= (INTERNAL, CDCl3, 0, 16.522)
##AUDIT TRAIL= $$ (NUMBER, WHEN, WHO, WHERE, WHAT)
$$ ##TITLE= Audit trail, XWIN-NMR		Version 3.5
$$ ##JCAMPDX= 5.01
$$ ##ORIGIN= Bruker BioSpin GmbH
$$ ##OWNER= nmr
$$ C:\u/data/dgb/nmr/ADRS/660/pdata/1/auditp.txt
$$ ##AUDIT TRAIL=  $$ (NUMBER, WHEN, WHO, WHERE, WHAT)
(   1,<2007-03-12 11:31:08.74 +000>,<MAYBRIDGE\nmr>,<NMR_250MHZ>,
      <created by zg, POWCHK disabled, PULCHK disabled
       configuration hash MD5:
       49 4B E0 1D 92 C2 6B 37 9F E6 65 BC 52 41 86 1D
       data hash MD5: 64K
       5D 87 F1 2F EA 85 13 67 01 7A 2F 17 58 10 D4 78>)
(   2,<2007-03-12 11:31:21.69 +000>,<MAYBRIDGE\nmr>,<NMR_250MHZ>,
      <Start of raw data processing
       ef LB = 0.3 FT_mod = 6 PKNL = 1 SI = 32K 
       data hash MD5: 32K
       1E 01 FF D1 66 9E 1D 3E 02 E4 F3 C5 A3 70 95 D9>)
(   3,<2007-03-12 11:31:23.32 +000>,<MAYBRIDGE\nmr>,<NMR_250MHZ>,
      <apk 
       data hash MD5: 32K
       7F 61 94 A1 47 DA 03 C6 F4 96 DD 5A AF 78 D6 85>)
(   4,<2007-03-12 11:31:24.08 +000>,<MAYBRIDGE\nmr>,<NMR_250MHZ>,
      <abs ABSG = 5 
       data hash MD5: 32K
       60 7C A2 0F A8 CF 71 FE 1C 91 7E B2 AF 7B C5 D3>)
$$ ##END=
$$ 
$$ hash MD5
$$ D3 F3 5B CC D3 67 FB AA EC 32 8F 57 1A C3 8D 49
##$RELAX= 
##$RELAX= 
##$RELAX= 
##$RELAX= 
##$RELAX= 
##$RELAX= 
##$RELAX= 
$$ Bruker specific parameters
$$ --------------------------
##$DU= <C:\u>
##$EXPNO= 660
##$NAME= <ADRS>
##$PROCNO= 1
##$TYPE= <nmr>
##$USER= <dgb>
##$AMP= (0..31)
100 100 100 100 100 100 100 100 100 100 100 100 100 100 100 100 100 100 
100 100 100 100 100 100 100 100 100 100 100 100 100 100 
##$AQSEQ= 0
##$AQ_mod= 3
##$AUNM= <au_zg>
##$AUTOPOS= <6 >
##$BF1= 250.13
##$BF2= 250.13
##$BF3= 250.13
##$BF4= 250.13
##$BF5= 500.13
##$BF6= 500.13
##$BF7= 500.13
##$BF8= 500.13
##$BYTORDA= 1
##$CFDGTYP= 0
##$CFRGTYP= 5
##$CHEMSTR= <none>
##$CNST= (0..31)
1 1 145 1 1 1 1 1 1 1 1 1 1 1 1 1 1 1 1 1 1 1 1 1 1 1 1 1 1 1 1 1 
##$CPDPRG= <>
##$CPDPRG1= <>
##$CPDPRG2= <>
##$CPDPRG3= <>
##$CPDPRG4= <mlev>
##$CPDPRG5= <mlev>
##$CPDPRG6= <mlev>
##$CPDPRG7= <mlev>
##$CPDPRG8= <mlev>
##$CPDPRGB= <>
##$CPDPRGT= <>
##$D= (0..31)
0 1 0 0 0 0 0 0 0 0.06 0 0 0 0 0 0 0.0002 0 0 0 0 0 0 0 0 0 0 0 0 0 0 
0 
##$DATE= 1173699067
##$DBL= (0..7)
120 120 120 120 120 120 120 120 
##$DBP= (0..7)
150 150 150 150 150 150 150 150 
##$DBP07= 0
##$DBPNAM0= <>
##$DBPNAM1= <>
$$ [...]
##$SUBNAM6= <"">
##$SUBNAM7= <"">
##$SUBNAM8= <"">
##$SUBNAM9= <"">
##$SW= 20.6930455092707
##$SWIBOX= (0..15)
0 0 3 0 0 0 0 0 0 0 0 0 0 0 0 0 
##$SW_h= 5175.983436853
##$TD= 65536
##$TD0= 1
##$TE= 683.16
##$TE2= 300
##$TE3= 300
##$TEG= 300
##$TL= (0..7)
0 120 120 120 120 120 120 120 
##$TP= (0..7)
150 150 150 150 150 150 150 150 
##$TP07= 0
##$TPNAME0= <>
##$TPNAME1= <>
##$TPNAME2= <>
##$TPNAME3= <>
##$TPNAME4= <>
##$TPNAME5= <>
##$TPNAME6= <>
##$TPNAME7= <>
##$TPOAL= (0..7)
0.5 0.5 0.5 0.5 0.5 0.5 0.5 0.5 
##$TPOFFS= (0..7)
0 0 0 0 0 0 0 0 
##$TUNHIN= 0
##$TUNHOUT= 0
##$TUNXOUT= 0
##$USERA1= <user>
##$USERA2= <user>
##$USERA3= <user>
##$USERA4= <user>
##$USERA5= <user>
##$V9= 5
##$VALIST= <valist>
##$VCLIST= <CCCCCCCCCCCCCCC>
##$VD= 0
##$VDLIST= <DDDDDDDDDDDDDDD>
##$VPLIST= <PPPPPPPPPPPPPPP>
##$VTLIST= <TTTTTTTTTTTTTTT>
##$WBST= 1024
##$WBSW= 4
##$XGAIN= (0..3)
0 0 0 0 
##$XL= 0
##$YL= 0
##$YMAX_a= 253908
##$YMIN_a= -411336
##$ZGOPTNS= <>
##$ZL1= 120
##$ZL2= 120
##$ZL3= 120
##$ZL4= 120
##$ABSF1= 16.522
##$ABSF2= -4.171173
##$ABSG= 5
##$ABSL= 3
##$ALPHA= 0
##$AQORDER= 0
##$ASSFAC= 0
##$ASSFACI= 0
##$ASSFACX= 0
##$ASSWID= 0
##$AUNMP= <proc_1d>
##$AZFE= 0.1
##$AZFW= 0.1
##$BCFW= 0
##$BC_mod= 0
##$BYTORDP= 0
##$COROFFS= 0
##$CY= 12.5
##$DATMOD= 1
##$DC= 0
##$DFILT= <>
##$DTYPP= 0
##$F1P= 14.0000005364418
##$F2P= -0.99999901652339
##$FCOR= 0.5
##$FTSIZE= 32768
##$FT_mod= 6
##$GAMMA= 0
##$GB= 0
##$INTBC= 1
##$INTSCL= 1
##$ISEN= 128
##$LB= 0.3
##$LEV0= 0
##$LPBIN= 0
##$MAXI= 10000
##$MC2= 0
##$MEAN= 0
##$ME_mod= 0
##$MI= 0
##$NCOEF= 0
##$NC_proc= -3
##$NLEV= 6
##$NOISF1= 0
##$NOISF2= 0
##$NSP= 0
##$NTH_PI= 0
##$NZP= 0
##$OFFSET= 16.522
##$PC= 1
##$PHC0= 230.605
##$PHC1= 4.336857
##$PH_mod= 1
##$PKNL= yes
##$PPARMOD= 0
##$PSCAL= 4
##$PSIGN= 0
##$REVERSE= no
##$SF= 250.13
##$SI= 32768
##$SIGF1= 0
##$SIGF2= 0
##$SINO= 400
##$SIOLD= 32768
##$SREGLST= <1H.CDCl3>
##$SSB= 0
##$STSI= 32768
##$STSR= 0
##$SW_p= 5175.98343685301
##$SYMM= 0
##$S_DEV= 0
##$TDeff= 65536
##$TDoff= 0
##$TI= <Analysis number 999999
Compound Code 99
Book Reference 9
Project Code 9>
##$TILT= no
##$TM1= 0
##$TM2= 0
##$TOPLEV= 0
##$USERP1= <user>
##$USERP2= <user>
##$USERP3= <user>
##$USERP4= <user>
##$USERP5= <user>
##$WDW= 1
##$XDIM= 32768
##$YMAX_p= 315998341
##$YMIN_p= -93153
$$ End of Bruker specific parameters
$$ ---------------------------------
##NTUPLES= NMR SPECTRUM
##VAR_NAME=  FREQUENCY,     SPECTRUM/REAL,   SPECTRUM/IMAG
##SYMBOL=    X,             R,               I
##VAR_TYPE=  INDEPENDENT,   DEPENDENT,       DEPENDENT
##VAR_FORM=  AFFN,          ASDF,            ASDF
##VAR_DIM=   32768,         32768,           32768
##UNITS=     HZ,            ARBITRARY UNITS, ARBITRARY UNITS
##FACTOR=    0.157963299565203, 1,           1
##FIRST=     4132.6476996994, 0,             0
##LAST=      -1043.33573715361, 0,           0
##MIN=       -1043.33573715361, -93153,      0
##MAX=       4132.6476996994, 315998341,     0
$$ Real data points
##PAGE= N=1
##DATA TABLE= (X++(R..R)), XYDATA
$$ [...]
$$ plain form
16289 -33752 -29162 -29021 -35397 -30268 -38120 -38924 -24503 -16479 -16022 -5847 11306 16537 -12027 -28198
16275 -28198 -49424 -58470 -43763 -20923 -13912 -4619 2291 -9702 -8842 3903 3984 9806 20808 33691
16261 33691 13597 -4323 -16748 -411 -3753 -5790 314 -3961 -20814 -14080 -17302 -18088 -19337
16248 -19337 -29067 -27268 -28159 -18718 -19718 7372 18753 15453 26160 7614 -5935 -52728 -57357
16235 -57357 -42171 -22076 -8973 -15128 -17344 -11159 -15971 -25595 -9303 -14704 -8427 5946 15594
16222 15594 10110 8781 24373 16483 -10016 -9341 4901 14025 7771 -14751 -6395 24453 33980
16209 33980 57868 39249 16708 8517 -17234 -23156 -21374 -7888 16445 6194 8822 24049
16197 24049 25899 37517 29269 29705 15279 -20148 -42459 -19734 -3382 -7917 -8888 -16139 -12984
$$ packed form
16289c3752M590J41o376N129p852q04J4421Q024M57J0175J7153N231k8564j6171
16275b8198k1226r046J4707K2840P011R293O910j1993Q60J2745Q1N822J1002J2883
16261C3691k0094j7920j2425J6337l342k037O104m275j6853O734l222p86j249
16248a9337r730J799q91R441j000K7090J1381l300J0707j8546j3549m6793m629
16235e7357J5186K0095J3103o155k216O185m812r624J6292n401O277J4373R648
16222A5594n484j329J5592p890k6499O75J4242R124o254k2522Q356L0848R527
16209C3980K3888j8619k2541q191k5751n922J782J3486K4333j0251K628J5227
16197B4049J850J1618q248M36j4426l5427k2311K2725J6352m535r71p251L155
$$ plain form
16184 -12984 -12174 -19757 -16689 -11721 -8291 -1686 10395 3528 15259 1235 -22471 -48075 -51569
16171 -51569 -51873 -57722 -44648 -15146 17964 9485 -18419 -31837 -29436 208 -9615 -28476 -12549
16158 -12549 3489 10832 -740 1137 4520 2645 32637 9280 7512 -10427 -6893 -19322 -23114
16145 -23114 -24108 -35140 -34462 -41788 -26401 -22719 -32868 -34865 -23218 -24811 -20657 -9902 12524
16132 12524 2023 -12990 5865 26060 18819 14383 -3589 -2359 -22326 -26152 -28314 -12912 -8982
16119 -8982 -4814 -518 1844 773 -6242 -30962 -10332 -136 -36171 -25421 -5391 -8458 -22733
16106 -22733 -18196 -7747 12263 32829 14878 -20104 -39553 -23492 2961 7617 -2433 -6903
16094 -6903 -6722 -10004 14715 12154 -8678 -8607 10565 43319 66301 46950 9612 -15201 -37367
$$ packed form
16184a2984Q10p583L068M968L430O605J2081o867J1731j4024k3706k5604l494
16171e1569l04n849J3074K9502L3110q479k7904j3418K401K9644r823j8861J5927
16158a2549J6038P343j1572J877L383j875K9992k3357j768j7939L534j2429l792
16145b3114r94j1032O78p326J5387L682j0149j997J1647j593M154J0755K2426
16132A2524j0501j5013J8855K0195p241m436j7972J230j9967l826k162J5402L930
16119h982M168M296K362j071p015k4720K0630J0196l6035J0750K0030l067j4275
16106b2733M537J0449K0010K0566j7951l4982j9449J6061K6453M656j0050m470
16094f903J81l282K4719k561k0832P1J9172L2754K2982j9351l7338k4813k2166
$$ plain form
16081 -37367 -34318 -37516 -42240 -38903 -45720 -28233 -23512 -11349 10916 17044 7773 7739 10841 -3412
16067 -3412 -6598 7272 31072 44765 8232 9636 19253 8726 -6848 -30470 -9165 12535
16055 12535 22242 36458 25349 -1454 6829 30054 29481 11158 -6478 -34310 -56941 -54916 -55446
16042 -55446 -33967 -18140 -10818 -1475 19734 21409 -14557 -15340 -27689 -62055 -61335 -55342 -24740
16029 -24740 11358 -15136 -40402 -58918 -66259 -48449 -21549 -294 8193 -839 -12863 -8361
16017 -8361 -17776 -5058 2916 -486 2059 9715 10085 12703 6327 -2827 -23763 -18094 -8083 8583
16003 8583 7577 19139 389 -16301 -17954 -34881 -37167 -5668 -6962 -30948 -55912 -51454 -39772
15990 -39772 -41508 -7992 -6647 -12445 -8130 3185 -5611 4754 8542 -4357 -2148 -3484 1677
$$ packed form
16081c7367L049l198m724L337o817J7487M721J2163K2265O128r271l4L102j4253
16067c412l186J3870K3800J3693l6533J404R617j0527j5574k3622K1305K1700
16055A2535R707J4216j1109k6803Q283K3225n73j8323j7636k7832k2631K025n30
16042e5446K1479J5827P322R343K1209J675l5966p83j2349l4366P20N993L0602
16029b4740L6098k6494k5266j8516p341J7810K6900K1255Q487r032j2024M502
16017h361r415J2718P974l402K545P656L70K618o376r154k0936N669J0011J6666
16003H583j006J1562j8750j6690j653j6927k286L1499j294k3986k4964M458J1682
15990c9772j736L3516J345n798M315J1315q796J0365L788j2899K209j336N161
$$ plain form
15977 1677 11101 -12117 -22382 -19590 -17674 -26162 -17664 -19717 -10497 -1841 -20317 -24960 -26631 -24494
15963 -24494 -24384 -3278 15939 19040 16421 34040 50131 8245 -13458 4528 -5026 -14239 -5639
15950 -5639 -5692 19729 6673 -17403 -21207 -24223 -21377 2417 15562 13427 24542 -9016 -11671
15937 -11671 -1793 -15385 -30520 -21176 -14209 -1065 2090 2156 13810 27099 11981 2973 -24713
15924 -24713 -15065 -1626 -19811 -23404 -14519 -21530 -37939 -54199 -56961 -34645 1151 6 -5128
15911 -5128 3865 3683 7899 82 13020 29317 36614 -3188 -23778 -16967 -14718 -8864 -12443 -11434
15897 -11434 -1555 -5941 -22809 6397 35343 24988 1960 953 -4256 -21351 -38821 -36214 -34851
15884 -34851 -21145 17931 34640 2798 4137 8420 16215 -19308 -25014 -14556 14823 19542 -8223
$$ packed form
15977A677R424k3218j0265K792J916q488Q498k053R220Q656j8476m643j671K137
15963b4494J10K1106J9217L101k619J7619J6091m1886k1703J7986r554r213Q600
15950e639n3K5421j3056k4076l804l016K846K3794J3145k135J1115l3558k655
15937a1671R878j3592j5135R344O967J3144L155O6J1654J3289j5118r008k7686
15924b4713R648J3439j8185l593Q885p011j6409j6260k762K2316L5796j145n134
15911e128Q993j82M216p817J2938J6297P297l9802k0590O811K249N854l579J009
15897a1434R879m386j6868K9206K8946j0355k3028j007n209j7095j7470K607J363
15884c4851J3706L9076J6709l1842J339M283P795l5523n706J0458K9379M719k7765
$$ plain form
15871 -8223 -28810 -17521 8057 3029 -15481 -31848 -31719 -18624 -21962 -27144 -29235 -29105 -30657 -12222
15857 -12222 17755 28924 16932 10800 25411 18738 10061 3462 -12078 -34130 -25770 -11971 8115
15844 8115 -6632 -31450 -30182 -52245 -41852 -20590 -2984 -2293 19595 19884 1499 3309 -6380
15831 -6380 -29346 -17741 1140 -3728 4757 13953 24172 37856 42042 30330 -1507 -22462 -12923
15818 -12923 -15617 -13154 -12520 -22237 -3353 16444 3096 -24722 -9841 902 -5858 -29042 -31612
15805 -31612 -22759 -24474 -25066 -6144 17970 49137 30096 -3244 1375 6461 1980 19283 342
15792 342 -5576 -10263 5526 35760 20221 -2794 -9710 -9299 -38891 -45733 -39448 -14915 -10310 -14559
15778 -14559 -24877 -2549 14172 8063 -2568 -19910 -30785 -34373 -33943 -26890 -15686 2015 17076
$$ packed form
15871h223k0587J1289K5578n028j8510j6367J29J3095l338n182k091J30j552J8435
15857a2222K9977J1169j1992o132J4611o673q677o599j5540k2052Q360J3799K0086
15844H115j4747k4818J268k2063J0393K1262J7606O91K1888K89j8385J810r689
15831f380k2966J1605J8881m868Q485R196J0219J3684M186j1712l1837k0955R539
15818a2923k694K463O34r717J8884J9797j3348k7818J4881J0743o760k3184k570
15805c1612Q853j715n92J8922K4114L1167j9041l3340M619N086m481J7303j8941
15792C42n918m687J5789L0234j5539k3015o916M11k9592o842O285K4533M605m249
15778a4559j0318K2328J6721o109j0631j7342j0875l588M30P053J1204J7701J5061
$$ plain form
15765 17076 23668 10307 1471 -9878 -26038 5324 32594 34222 19252 33172 25948 859
15753 859 -20693 -18496 13515 -106 533 -22434 -40338 -27961 -41018 -28509 -29718 -31306 -30697
15740 -30697 -20023 -9451 -15025 -6858 7014 -8704 -20889 -35147 -44329 -22426 -16288 -26037 -34198
15727 -34198 -33932 -14823 16870 43258 24399 11342 142 550 -866 10469 29243 6718 -2624
15714 -2624 -4477 17659 18937 24465 40182 11856 -22068 -39265 -48153 -22660 17317 23080 12542
15701 12542 -14106 -16037 -3248 -370 -17595 -32138 -22447 -15712 -19159 -10210 -29751 -43332 -38452
15688 -38452 -25370 -13654 -22600 -29142 -9624 4706 1867 -4137 -16567 -13467 -24193 -9879 -6694
15675 -6694 -15230 -2856 10393 -2987 -10969 -18173 697 20294 3451 -12692 -27216 -39146
$$ packed form
15765A7076O592j3361q836j1349j6160L1362K7270J628j4970J3920p224k5089
15753H59k1552K197L2011j3621O39k2967j7904J2377j3057J2509j209j588O09
15740c0697J0674J0572n574Q167J3872j5718j2185j4258r182K1903O138r749q161
15727c4198K66J9109L1693K6388j8859j3057j1200M08j416J1335J8774k2525r342
15714b624j853K2136J278N528J5717k8326l3924j7197q888K5493L9977N763j0538
15701A2542k6648j931J2789K878j7225j4543R691O735l447Q949j9541j3581M880
15688c8452J3082J1716q946o542J9518J4330k839o004j2430L100j0726J4314L185
15675f694q536J2374J3249j3380p982p204J8870J9597j6843j6143j4524j1930
$$ plain form
15663 -39146 -28167 -17396 -14975 -29534 -32119 -26594 -18242 -19545 -13865 -13990 4371 17786 -6747
15650 -6747 -24124 -35878 -26818 -21149 -7075 8704 14295 12117 -16189 2802 8538 -7349 3636
15637 3636 16577 13702 35232 36552 42274 46060 44856 57578 40181 29032 39973 52132 39682
15624 39682 37316 17645 23991 34397 16148 8554 -2679 -31520 -20456 -6378 6037 -10306
15612 -10306 -24959 -17449 13635 -369 -20936 -17594 -24798 -7516 -4416 -32219 -28357 -2289 -3964
15599 -3964 -16043 -17914 -23946 -37141 -37360 -46363 -40628 -4339 22395 27030 13505 -4061 -35660
15586 -35660 -37100 -18032 9747 -8272 -19908 -16914 -6976 -27426 -27239 -31067 -15547 4622 22680
15573 22680 32542 18218 -5043 4 10639 4625 -1243 29845 24446 40957 40312 16159 -25028
$$ packed form
15663c9146J0979J0771K421j4559k585N525Q352j303N680j25J8361J3415k4533
15650f747j7377j1754R060N669J4074J5779N591k178k8306J8991N736j5887J0985
15637C636J2941k875K1530J320N722L786j204J2722j7397j1149J0941J2159j2450
15624C9682k366j9671O346J0406j8249p594j1233k8841J1064J4078J2415j6343
15612a0306j4653P510L1084j4004k0567L342p204J7282L100k7803L862K6068j675
15599c964j2079j871o032j3195k19r003N735L6289K6734M635j3525j7566l1599
15586c5660j440J9068K7779j8019j1636K994R938k0450J87l828J5520K0169J8058
15573B2680R862j4324k3261N047J0635o014n868L1088n399J6511o45k4153m1187
$$ plain form
15560 -25028 -24981 -13694 -27879 -12989 -13992 -3636 9998 16078 11403 22705 -1482 -28894 -33542
15547 -33542 -29167 -29272 -27726 705 3582 -21737 -10421 13615 5300 -1881 7568 11056 2548 -4140
15533 -4140 -6387 -20986 -41303 -29311 -17842 3680 -1221 -21111 -18265 -17810 -21191 -4158 -12011
15520 -12011 -10340 -6724 13405 2505 467 -8857 -50272 -60604 -60141 -41662 -22193 -25288 -13887
15507 -13887 -17077 -35625 -40925 -35182 -13364 13218 15998 -8121 -10950 -16393 -15624 -19467 -21696 -31955
15493 -31955 -30920 -50085 -52659 -36657 -10325 9585 13596 -8930 -20258 -12459 -7997 281 2716
15480 2716 3357 8573 474 1996 -6749 -18160 -24337 -19383 -12423 -25341 -22673 -17416 -32246 -40392
15466 -40392 -12037 -4789 -7789 -10094 11989 9288 -7378 18686 42727 34743 27820 41572 29996
$$ packed form
15560b5028M7J1287j4185J4890j003J0356J3634O080m675J1302k4187k7412m648
15547c3542M375j05J546K8431K877k5319J1316K4036q315p181R449L488q508o688
15533d140k247j4599k0317J1992J1469K1522m901j9890K846M55l381J7033p853
15520a2011J671L616K0129j0900k038r324m1415j0332M63J8479J9469l095J1401
15507a3887l190j8548n300N743K1818K6582K780k4119k829n443P69l843k229j0259
15493c1955J035j9165k574J6002K6332J9910M011k2526j1328P799M462Q278K435
15480B716O41N216q099J522q745j1411o177M954O960j2918K668N257j4830q146
15466d0392K8355P248l000k305K2083k701j6666K6064K4041p984o923J3752j1576
$$ plain form
15453 29996 1011 -323 -281 -9982 6367 7995 491 -23539 -10103 11463 13431 7837 12965 -1239
15439 -1239 -19372 -16830 -24526 -36615 -53958 -44104 -30691 -32242 -20916 -32630 -36147 791 22405
15426 22405 25964 12005 7853 16222 1095 -12180 -14024 -3764 -7767 -3606 -5797 -284 12096
15413 12096 23608 27567 33675 28591 6514 -13818 -12579 -13339 -11647 -11278 3606 639 7488 8072
15399 8072 12828 -3548 386 14170 28482 30170 23342 38018 35444 1581 3010 16477 35778
15386 35778 55826 47811 33312 2946 13709 28419 11584 -16488 -17972 -15655 -699 2122
15374 2122 -26927 -47038 -37136 -35441 -25276 -22622 -36632 -14052 -7574 -12721 -25253 9741 -905
15361 -905 -10385 3773 9541 9418 10017 -7297 -24684 -4290 12656 2464 -8193 -17008 -21447 -25164
$$ packed form
15453B9996k8985j334M2r701J6349J628p504k4030J3436K1566J968n594N128j4204
15439a239j8133K542p696j2089j7343R854J3413j551J1326j1714l517L6938K1614
15426B2405L559j3959m152Q369j5127j3275j844J0260m003M161k191N513J2380
15413A2096J1512L959O108n084k2077k0332J239p60J692L69J4884k967O849N84
15399H072M756j6376L934J3784J4312J688o828J4676k574l3863J429J3467J9301
15386C5778K0048q015j4499l0366J0763J4710j6835k8072j484K317J4956K821
15374B122k9049k0111R902J695J0165K654j4010K2580O478n147j2532L4994j0646
15361i05r480J4158N768j23N99j7314j7387K0394J6946j0192j0657q815m439l717
$$ plain form
15347 -25164 -35782 -45959 -47479 -30548 -7292 -9889 5222 8845 3297 -16735 -5467 -2701 -7376
15334 -7376 11 21185 6203 -44 9716 12075 13194 22050 25645 9535 -11947 -20049 -45566
15321 -45566 -36757 -18781 -11610 -13929 -27662 -34590 -18314 -4679 -3728 -10119 -4218 -11380 -27772
15308 -27772 -40207 -21922 -9969 -14080 -6115 5863 9507 -8916 -3295 -2480 -24429 -4305 15636
15295 15636 19820 2085 -4426 -1192 4941 4842 9917 10250 -6123 -11033 -20220 -15508 4274 17083
15281 17083 30191 17917 22871 17146 11107 -4702 11141 -11923 -4535 22561 9986 5441 -7019
15268 -7019 -13978 -17109 -11224 -14409 -17663 -33769 -47686 -27965 -25555 -50201 -33713 -5843 21245
15255 21245 5532 -28042 -32743 -22649 -2871 -3244 -4471 18240 38725 41006 25892 2071 -17197
$$ packed form
15347b5164j0618j0177j520J6931K3256k597J5111L623n548k0032J1268K766m675
15334g376P387K1174j4982o247R760K359J119Q856L595j6110k1482q102k5517
15321d5566Q809J7976P171k319j3733o928J6276J3635R51o391N901p162j6392
15308b7772j2435J8285J1953m111P965J1978L644j8423N621Q15k1949K0124J9941
15295A5636M184j7735o511L234O133r9N075L33j6373m910r187M712J9782J2809
15281A7083J3108j2274M954n725o039j5809J5843k3064P388K7096j2575m545j2460
15268g019o959l131N885l185l254j6106j3917J9721K410k4646J6488K7870K7088
15255B1245j5713l3574m701J0094J9778l73j227K2711K0485K281j5114k3821j9268
$$ plain form
15242 -17197 -2051 -4658 1914 -23517 -38764 -11126 9424 5040 19904 29856 6900 6416 35301
15229 35301 25484 -22128 -34106 -14218 -8979 -13531 -6393 -2527 -24824 -20671 -23026 -18161 -19706
15216 -19706 -22318 -25755 -8464 -14949 -42871 -46200 -31190 -5607 -14074 -14975 -9970 2694 6375
15203 6375 26545 39270 28774 23118 12271 -3858 -33708 -31701 -7891 -18552 -32997 -14858
15191 -14858 5243 24907 31074 31284 11233 9212 20149 16039 24111 30145 47241 40818 17518
15178 17518 456 -4998 6581 9188 27492 21283 12901 -20525 -22267 -2037 -1642 7288 3261
15165 3261 -27709 -26895 -17144 -2665 -2040 3470 -15255 -18388 27773 14912 -2388 -4668 -12737 -22093
15151 -22093 -28338 -17192 -15946 -10336 10981 12514 6548 9681 16053 9723 -16254 -27839 -28843
$$ packed form
15242a7197J5146k607O572k5431j5247K7638K0550m384J4864R952k2956m84K8885
15229C5301r817m7612j1978J9888N239m552P138L866k2297M153k355M865j545
15216a9706k612l437J7291o485k7922l329J5010K5583q467r01N005J2664L681
15203F375K0170J2725j0496n656j0847j6129k9850K007K3810j0661j4445J8139
15191a4858K0101J9664O167K10k0051k021J0937m110Q072O034J7096o423k3300
15178A7518j7062n454J1579K607J8304o209q382l3426j742K0230L95Q930m027
15165C261l0970Q14R751J4479O25N510j8725l133M6161j2861j7300k280q069r356
15151b2093o245J1146J246N610K1317J533n966L133O372o330k5977j1585j004
$$ plain form
15138 -28843 -13316 3905 -1522 18230 14428 -11415 -13445 -23873 -21443 -11522 -16986 -22831 -21703
15125 -21703 -37160 -20448 -17706 -11533 952 9909 10398 4817 12588 18656 5174 -6880 -29800
15112 -29800 -22869 10190 4257 2033 -11419 -4198 12600 23240 23796 25479 20580 30452 28714 18546
15098 18546 17494 17749 6663 782 -11291 -2497 3580 -2859 15397 35504 28109 15659 12561
15085 12561 15657 1994 9797 15563 12694 29263 25385 19508 15128 919 -10831 -28129 -27915
15072 -27915 -27537 -21685 -24582 -13440 -8882 -2983 -31719 -31569 -10550 8828 11242 12235 -461 4089
15058 4089 14910 13268 12193 16595 32291 32216 9999 3107 -8302 -24856 -45766 -49681 -58989 -41805
15044 -41805 -29559 -7527 5876 -3218 5333 29778 32823 37511 28739 9745 14774 27899 19973
$$ packed form
15138b8843J5527J7221n427J9752l802k5843k030j0428K430R921n464n845J128
15125b1703j5457J6712K742O173J2485Q957M89n581P771O068j3482j2054k2920
15112b9800O931L3059n933k224j3452P221J6798J0640N56J683m899R872j738j0168
15098A8546j052K55j1086n881j2073Q794O077o439J8256K0107p395j2450l098
15085A2561L096j3663P803N766k869J6569l878n877m380j4209j1750j7298K14
15072b7915L78N852k897J1142M558N899k8736J50K1019J9378K414R93j2696M550
15058D089J0821j642j075M402J5696p5k2217o892j1409j6554k0910l915r308J7184
15044d1805J2246K2032J3403r094Q551K4445L045M688q772j8994N029J3125p926
$$ plain form
15031 19973 7835 262 31059 31559 6109 -18664 -42225 -55175 -31993 -23335 -22956 -24230 -37246
15018 -37246 -40184 -44145 -48107 -29691 -14877 -2157 -3541 -8905 -9805 -34076 -9441 18876 6610
15005 6610 3429 14515 34589 50625 51737 48134 75420 143694 234240 288074 238392 124718
14993 124718 62635 25165 6189 -13674 -20191 -5392 24531 31705 31693 29684 23811 13255 3338
14980 3338 4729 -7931 -8234 5462 -11018 -3103 -1978 -2433 24160 23859 12816 8096 39061 42896
14966 42896 10326 -3653 -1174 -1814 -14732 -36090 -48899 -47567 -38060 -26250 -24748 -8907 -1700
14953 -1700 3369 12130 9958 -15464 -11434 -19309 1364 -7139 -8811 -519 15168 25784 38072
14940 38072 15855 12622 15070 -14557 -30714 -12840 -19059 -29557 -30364 -19723 1562 8849 -4794
$$ packed form
15031A9973j2138p573L0797N00k5450k4773k3561j2950K3182Q658L79j274j3016
15018c7246k938l961l962J8416J4814J2720j384n364r00k4271K4635K8317j2266
15005F610l181J1086K0074J6036J112l603K7286O8274R0546N3834m9682j13674
14993A24718o2083l7470j8976j9863o517J4799K9923P174j2k009n873j0556r917
14980C338J391j2660l03J3696j6480P915J125m55K6593l01j1043m720L0965L835
14966D2896l2570j3979K479o40j2918k1358j2809J332R507J1810J502J5841P207
14953a700N069Q761k172k5422M030p875K0673q503j672Q292J5687J0616J2288
14940C8072k2217l233K448k9627j6157J7874o219j0498q07J0641K1285P287j3643
$$ plain form
14927 -4794 -26773 -30101 -17900 -18471 -19946 -10625 -5899 -6697 6406 2052 -7771 -6142 -21724 -308
14913 -308 -3228 -39053 -45042 -29540 -12610 -14974 -20149 -19849 -7199 -12276 -4411 -10729 -9190 -22537
14899 -22537 -32410 -7498 18450 14315 531 9091 3397 449 12518 -4470 -12286 -10758 -20718
14886 -20718 -28198 -21346 -3716 7211 13484 18604 10729 12095 11631 18558 7810 12456 22895 25169
14872 25169 32469 30150 16882 3681 26976 33788 37506 51819 52871 37330 8478 -23651 -30525
14859 -30525 -32387 -32950 -8880 -11653 -13620 -9442 1271 10506 15677 5952 13525 16459 5548 -4182
14845 -4182 189 6919 24619 36432 20146 19389 8863 11841 1700 -5977 -8456 -5338 22628
14832 22628 19322 7604 30994 37774 50973 65689 80815 63521 67372 66174 34380 -8177
$$ packed form
14927d794k1979l328J2201n71j475R321M726p98J3103m354r823J629j5582K1416
14913c08k920l5825n989J5502J6930k364n175L00J2650n077P865o318J539j3347
14899b2537r873K4912K5948m135j3784Q560n694k948J2069j6988p816J528r960
14886b0718p480O852J7630J0927O273N120p875J366m64O927j0748M646J0439K274
14872B5169P300k319j3268j3201K3295O812L718J4313J052j5541k8852l2129o874
14859c0525j862n63K4070k773j967M178J0713R235N171r725P573K934j0911r730
14845d182M371O730J7700J1813j6286p57j0526K978j0141p677k479L118K7966
14832B2628l306j1718K3390O780J3199J4716J5126j7294L851j198l1794m2557
$$ plain form
14820 -8177 -15129 -4733 -15742 -23823 -42749 -44447 -32378 -29484 -20709 6850 30108 51809 25393
14807 25393 -11929 -26925 -20939 -23676 -26394 -35055 -27399 1634 -4051 -10403 -9527 21088 7563
14794 7563 -19437 -20315 -11111 -11532 -19023 -9703 9787 23738 56969 74233 60266 52001 30461
14781 30461 25245 39858 33629 27343 4146 -5542 1530 -1807 21194 12456 -602 1491 3778
14768 3778 -14685 27623 45308 53401 51401 33697 16367 606 -822 16464 37421 30427 26140
14755 26140 26625 14156 9403 99 -9198 20499 27897 5946 -6760 -10233 -12767 -7266 4075
14742 4075 13917 16535 13058 14310 4997 2157 -17731 -14223 8189 36175 29638 637 -3852 -3742
14728 -3742 1395 -707 28011 35861 16438 16207 18189 -1292 -19625 -30588 -52955 -28061 9234
$$ packed form
14820h177o952J0396j1009q081j8926j698J2069K894Q775K7559K3258K1701k6416
14807B5393l7322j4996N986k737k718q661P656K9033n685o352Q76L0615j3525
14794G563k7000q78R204m21p491R320J9490J3951L3231J7264j3967q265k1540
14781C0461n216J4613o229o286k3197r688P072l337K3001q738j3058K093K287
14768C778j8463M2308J7685Q093k000j7704j7330j5761j428J7286K0957o994m287
14755B6140M85j2469m753r304r297K9697P398k1951j2706l473k534N501J1341
14742D075R842K618l477J252r313k840j9888L508K2412K7986o537k9001m489J10
14728c742N137k102K8718P850j9423k31J982j9481j8333j0963k2367K4894L7295
$$ plain form
14715 9234 10560 15099 16079 10028 6528 4009 -1307 -17497 -36635 -41003 -18171 -8702 8909 -2907
14701 -2907 -5446 -13022 -15295 -34242 -50059 -24818 12176 28895 21741 -3845 -35350 -30294 -3509
14688 -3509 7007 13605 14156 17970 20544 27029 26277 8212 -6491 6231 10302 15464 9491 7338
14674 7338 -675 -7384 10391 9438 12306 24147 25517 1122 -19381 4138 12418 -5798 -19103
14661 -19103 -34399 -44555 -17092 8118 -48 -24760 -10670 13106 7248 4270 16760 27856
14649 27856 19429 29288 22548 20945 22342 -1957 8310 33069 23953 8906 -3375 -4323 13755
14636 13755 23039 10843 17117 31790 33761 -689 -2891 421 -3925 -2004 -15110 -8227 35064
14623 35064 22708 3839 3831 16228 14022 7162 12049 24719 26019 26383 15981 386 1440 -278
$$ packed form
14715I234J326M539R80o051l500k519n316j6190j9138m368K2832R469J7611j1816
14701b907k539p576k273j8947j5817K5241L6994J6719p154k5586l1505N056K6785
14688c509J0516O598N51L814K574O485p52j8065j4703J2722M071N162n973k153
14674G338q013o709J7775r53K868J1841J370k4395k0503K3519Q280j8216j3305
14661a9103j5296j0156K7463K5210q166k4712J4090K3776n858k978J2490J1096
14649B7856q427R859o740j603J397k4299J0267K4759r116j5047j2281r48J8078
14636A3755R284j2196O274J4673J971l4450k202L312m346J921j3106O883M3291
14623C5064j2356j8869qJ2397k206o860M887J2670J300L64j0402j5595J054j718
$$ plain form
14609 -278 10011 27568 28821 11178 -7248 -4818 -4660 -924 31161 22812 -13748 -21805 -25231 -25564
14595 -25564 -35639 -11270 -13417 -9723 -4564 1196 5308 -457 -7448 -7091 -1685 -4516 -6591 6660
14581 6660 6579 14282 9130 1637 -6781 -6770 -7825 -5223 -10297 2047 -3675 4939 -5132 -8475 15022
14566 15022 20749 4796 14847 17467 6155 -5331 -4571 6137 17978 18622 -7820 -14283 -7189
14553 -7189 -7590 -4020 24500 37991 38261 49731 39558 1026 -15185 -16022 -15667 11200 5378 22180
14539 22180 11301 -36362 -39629 -2030 13093 21974 39318 38069 28669 10415 33847 52766
14527 52766 39700 4831 20791 20301 3452 11945 18452 25293 6637 -25851 -26949 -26230 -44384
14514 -44384 -46389 -38855 -7599 -8442 -11589 22205 29459 3726 9983 -770 -3782 3897 -1577 -4356
$$ packed form
14609b78J0289J7557J253j7643j8426K430J58L736L2085q349l6560q057l426l33
14595b5564j0075K4369k147L694N159N760M112n765o991L57N406k831k075J3251
14581F660q1P703n152p493q418J1j055K602n074J2344n722Q614j0071l343K3497
14566A5022N727j5953J0051K620j1312j1486P60J0708J1841O44k6442o463P094
14553g189m01L570K8520J3491K70J1470j0173l8532j6211q37L55K6867n822J6802
14539B2180j0879m7663l267L7599J5123Q881J7344j249r400j8254K3432J8919
14527E2766j3066l4869J5960m90j6849Q493O507O841j8656l2488j098P19j8154
14514d4384k005P534L1256q43l147L3794P254k5733O257j0753l012P679n474k779
$$ plain form
14500 -4356 -24536 -33088 -47809 -25638 -17383 -11409 -10410 15222 38243 38761 22431 11989 1881
14487 1881 884 23498 14313 14196 16306 28469 33467 15330 -13799 -9104 30206 44748 46303 55702
14473 55702 49488 29835 2462 3853 29498 16143 -12908 -17525 403 -9170 -5640 1017 -17298
14460 -17298 -23704 -13494 -18449 -36831 -31506 -19013 -15218 -17917 -7617 2104 24799 23263 24006
14447 24006 37405 36840 26590 17184 14082 -13865 -30386 -6902 -12637 -26742 -16814 -5705 10649
14434 10649 -9589 -18902 9573 17050 9152 4956 29415 23285 32041 24328 -4490 -21976 -15795
14421 -15795 -4068 9799 8466 -12402 -9238 -13682 -18834 -12015 15573 22074 1592 15607 22996
14408 22996 12101 2021 22238 32090 38724 20234 21026 20692 6076 7165 11245 18322 21179 9881
$$ packed form
14500d356k0180q552j4721K2171Q255N974R99K5632K3021N18j6330j0442j0108
14487A881r97K2614r185j17K110J2163M998j8137k9129M695L9310J4542J555R399
14473E5702o214j9653k7373J391K5645j3355k9051m617J7928r573L530O657j8315
14460a7298o406J0210m955j8382N325J2493L795k699J0300R721K2695j536P43
14447B4006J3399n65j0250r406l102k7947j6521K3484n735j4105R928J1109J6354
14434A0649k0238r313K8475P477p898m196K4459o130Q756p713k8818j7486O181
14421a5795J1727J3867j333k0868L164m444n152O819K7588O501k0482J4015P389
14408B2996j0895j0080K0217R852O634j8490P92l34j4616J089M080P077K857j1298
$$ plain form
14394 9881 -17466 -17140 -11610 -21006 -19400 -25473 -33198 -24713 -38924 -20924 4488 23546 41528
14381 41528 32694 25515 18004 17077 21447 19763 21333 1020 -5644 -2436 -12758 -6694 -7743 -12761
14367 -12761 -18072 -28728 -46835 -39052 -16985 15268 51347 59670 36540 21597 22411 -535 -12338
14354 -12338 -7132 -24312 -40720 -45937 -2377 12203 27582 14031 -8140 -23857 -25766 -19230
14342 -19230 3386 31840 42829 25403 9426 -19731 -27247 -6566 8105 11599 10922 11150 11182
14329 11182 -10457 -2086 12989 44415 29988 37834 37565 2203 861 3524 3886 21348 39290
14316 39290 39903 27195 34353 39911 38506 32946 33033 39580 24691 12452 -6139 -11324 -99 -8235
14302 -8235 -16593 5988 30170 47008 35987 21656 787 1257 344 -10738 -9621 4970 44242
$$ packed form
14394I881k7347L26N530r396J606o073p725Q485j4211J8000K5412J9058J7982
14381D1528q834p179p511r27M370j684J570k0313o664L208j0322O064j049n018
14367a2761n311j0656j8107P783K2067L2253L6079Q323k3130j4943Q14k2946j1803
14354a2338N206j7180j6408n217M3560J4580J5379j3551k2171j5717j909O536
14342a9230K2616K8454J0989j7426j5977k9157p516K0681J4671L494o77K28L2
14329A1182k1639Q371J5075L1426j4427P846k69l5362j342K663L62J7462J7942
14316C9290O13j2708P158N558j405n560Q7O547j4889j2239j8591n185J1225q136
14302h235q358K2581K4182J6838j1021j4331k0869M70r13j1082J117J4591L9272
$$ plain form
14289 44242 47718 24203 -3234 -4612 12433 4089 22616 51140 48276 33681 29031 18458 9979
14276 9979 7449 6793 779 3348 33689 42357 29486 9462 -1301 -34421 -19763 3340 -11499
14263 -11499 -17450 -18746 -22018 -9844 9368 8211 25224 25111 32796 36094 40034 20159 4562
14250 4562 13758 52283 51481 23606 624 -14445 -25790 -40731 -48216 -32086 -7549 -27437 -17821
14237 -17821 -25735 -10012 3034 10909 31440 26596 20148 13255 8128 -1735 7284 19426 25198
14224 25198 41656 54005 57682 13165 -17394 -8594 8051 16738 -3318 1126 16975 27506
14212 27506 29508 29690 10366 -1071 4364 12863 59927 61564 37098 38979 34878 24997 47445
14199 47445 51892 56303 66877 71998 52734 42973 19886 1590 6058 13907 4839 -2222 6176
$$ packed form
14289D4242L476k3515k7437j378J7045q344J8527K8524k864j4595m650j0573q479
14276I979k530o56o014K569L0341Q668j2871k0024j0763l3120J4658K3103j4839
14263a1499n951j296l272J2174J9212j157J7013j13P685L298L940j9875j5597
14250D562R196L8525q02k7875k2982j5069j1345j4941p485J6130K4537j9888R616
14237a7821p914J5723J3046P875K0531m844o448o893n127r863R019J2142N772
14224B5198J6458J2349L677m4517l0559Q800J6645Q687k0056M444J5849J0531
14212B7506K002J82j9324j1437N435Q499M7064J637k4466J881m101r881K2448
14199D7445M447M411J0574N121j9264r761k3087j8296M468P849r068p061Q398
$$ plain form
14186 6176 40209 51333 60718 69758 50236 32260 34437 23965 16525 26942 13862 36819 59679
14173 59679 56847 22800 39477 51432 31120 15543 25978 45799 73125 78519 51888 52560
14161 52560 65626 67947 69922 69637 69333 76658 91620 103257 106212 81390 56621 55576 83728
14148 83728 76745 65627 47223 42318 50207 59735 46972 52950 50039 42808 45416 24622 40915
14135 40915 43567 45778 66166 89006 98293 94181 109959 130486 105972 102573 91245 44460 41801
14122 41801 42992 35326 49524 57884 45867 11501 -9904 10185 23803 39424 56796 44267
14110 44267 39736 58311 42463 24583 33034 50233 66722 77228 98814 97395 83386 106014
14098 106014 107275 65771 44339 8849 8327 33947 50154 43979 28403 13722 22465 26046 31916
$$ packed form
14186F176L4033J1124R385R040j9522j7976K177j0472p440J0417j3080K2957K2860
14173E9679k832l4047J6677J1955k0312j5577J0435J9821K7326N394k6631O72
14161E2560J3066K321J975k85l04P325J4962J1637K955k4822k4769j045K8152
14148H3728o983j1118j8404m905P889R528j2763N978k911p231K608k0794J6293
14135D0915K652K211K0388K2840R287m112J5778K0527k4514l399j1328m6785k659
14122D1801J191p666J4198Q360j2017l4366k1405K0089J3618J5621J7372j2529
14110D4267m531J8575j5848j7880Q451J7199J6489J0506K1586j419j4009K2628
14098A06014J261m1504k1432l5490n22K5620J6207o175j5576j4681Q743L581N870
$$ plain form
14085 31916 47917 58887 63905 57633 36615 35212 34763 24434 44833 52624 38134 29059 24216
14072 24216 25185 -3236 8846 4977 8957 14812 7053 23131 19814 36914 39891 25168 39202
14059 39202 39469 35870 34306 37359 43236 52256 44925 49675 54646 48087 30645 51290 68791 63406
14045 63406 55803 50851 56279 59749 30599 26272 22088 7923 17833 42040 62729 50899 63658
14032 63658 54975 18611 -13118 3734 2825 -11920 4177 12764 33415 52716 48487 41260 37343
14019 37343 43261 54205 45565 38686 11221 7231 32834 34130 27845 28692 21840 27921 47024 58425
14005 58425 57287 58632 40507 18245 20886 6754 7613 13285 30006 70020 68173 64766 62891
13992 62891 48261 40717 20223 12898 18716 30898 30049 33880 45500 34994 23455 23760 32932
$$ packed form
14085C1916J6001J0970N018o272k1018j403m49j0329K0399P791j4490r075m843
14072B4216R69k8421J2082l869L980N855p759J6078l317J7100K977j4723J4034
14059C9202K67l599j564L053N877R020p331M750M971o559j7442K0645J7501n385
14045F3406p603m952N428L470k9150m327m184j4165R910K4207K0689j1830J2759
14032F3658q683l6364l1729J6852r09j4745J6097Q587K0651J9301m229p227l917
14019C7343N918J0944q640o879k7465l990K5603J296o285Q47o852O081J9103J1401
14005E8425j138J345j8125k2262K641j4132Q59N672J6721M0014j847l407j875
13992F2891j4630p544k0494p325N818J2182q49L831J1620j0506j1539L05R172
$$ plain form
13979 32932 24763 12755 15370 12883 26039 25402 8798 10369 43470 36071 32224 27550 36700 52408
13965 52408 28989 15260 632 4375 10073 19938 9892 8204 7174 14181 17925 24658 32594
13952 32594 32931 28890 10793 16058 48572 64771 62105 63623 42895 18719 4570 4137 33255
13939 33255 24983 38534 52359 50345 34625 47866 50094 25269 10194 28585 43429 32816
13927 32816 11406 886 19299 29769 17866 7067 28615 64561 56371 26879 16600 48436
13915 48436 53988 51918 41417 27585 33116 40824 29383 25787 30632 16581 9720 30046 65970
13902 65970 68546 59914 42664 27682 37704 42930 43528 26254 32365 51231 33660 14343 24286
13889 24286 47879 37957 32002 25558 24472 29647 55183 58037 44902 25188 11981 25355 35991
$$ packed form
13979C2932q169j2008K615k487J3156o37j6604J571L3101p399l847m674R150J5708
13965E2408k3419j3729j4628L743N698R865j0046j688j030P007L744O733P936
13952C2594L37m041j8097N265L2514J6199k666J518k0728k4176j4149m33K9118
13939C3255q272J3551J3825k014j5720J3241K228k4825j5075J8391J4844j0613
13927C2816k1410j0520J8413J0470j1903j0799K1548L5946q190k9492j0279L1836
13915D8436N552k070j0501j3832N531P708j1441l596M845j4051o861K0326L5924
13902F5970K576q632j7250j4982J0022N226N98j7274O111J8866j7571j9317R943
13889B4286K3593r922n955o444j086N175K5536K854j3135j9714j3207J3374J0636
$$ plain form
13876 35991 37709 42195 36180 49623 57331 65781 44491 29166 32756 59704 59747 63450 59837 27874
13862 27874 35165 15835 9693 21992 42075 51775 53708 43348 38894 39290 39431 64294 85336
13849 85336 68070 44774 12930 22230 36808 58947 73074 65456 82211 59736 61792 71307
13837 71307 89984 91779 93146 92770 96815 100057 97056 93985 70736 51316 42975 63295 69633 60033
13823 60033 63790 69751 70598 55335 26188 10157 20495 31884 25755 29913 53644 83458 88374
13810 88374 94372 89740 82258 77677 86182 87070 101203 108299 88956 78764 89541 78095 69393
13797 69393 74259 69889 85958 91162 105862 93116 78513 107696 112506 113554 138390 108585 99828
13784 99828 120229 133027 158018 171708 185733 176787 180698 160621 142497 139817 147372 164290
$$ packed form
13876C5991J718M486o015J3443P708Q450k1290j5325L590K6948M3L703l613l1963
13862B7874P291j9330o142J2299K0083R700J933j0360m454L96J41K4863K1042
13849H5336j7266k3296l1844R300J4578K2139J4127p618J6755k2475K056R515
13837G1307J8677J795J367l76M045L242l001l071k3249j9420q341K0320O338r600
13823F0033L757N961Q47j5263k9147j6031J0338J1389o129M158K3731K9814M916
13810H8374N998m632p482m581Q505Q88J4133P096j9343j0192J0777j1446q702
13797F9393M866m370J6069N204J4700j2746j4603K9183M810J048K4836k9805q757
13784I9828K0401J2798K4991J3690J4025q946L911k0077j8124k680P555J6918
$$ plain form
13772 164290 157915 188633 220652 251598 267542 283653 325760 352826 410925 454220 516274 582617
13760 582617 671507 820006 1056142 1351811 1718221 2172255 2669571 3162749 3610977 3931674
13750 3931674 4047364 3953831 3689950 3334510 2919064 2494424 2129595 1838245 1618071 1473488
13740 1473488 1398968 1374352 1411469 1500414 1644043 1832623 2136502 2593743 3239705 4072319
13730 4072319 5014784 5987349 6909496 7671256 8127476 8172104 7796437 7114452 6250637 5320789
13720 5320789 4443276 3700111 3107471 2717906 2462081 2325490 2255402 2252792 2321656 2493645
13710 2493645 2768498 3224044 3918265 4850482 6060061 7502846 9014654 10469383 11643696
13701 11643696 12356232 12477889 11965289 10929545 9565737 8142821 6795144 5654086
$$ packed form
13772A64290o375L0718L2019L0946J5944J6111M2107K7066N8099M3295O2054O6343
13760E82617Q8890J48499K36136K95669L66410M54034M97316M93178M48228L20697
13750C931674J15690r3533k63881l55440m15446m24640l64829k91350k20174j44583
13740A473488p4520k4616L7117Q8945J43629J88580L03879M57241O45962Q32614
13730D072319R42465R72565R22147P61760M56220M4628l75667o81985q63815r29848
13720E320789q77513p43165n92640l89565k55825j36591p0088k610O8864J71989
13710B493645K74853M55546O94221R32217J209579J442785J511808J454729J174313
13701A1643696P12536J21657n12600j035744j363808j422916j347677j141058
$$ plain form
13693 5654086 4752177 4095840 3657990 3381443 3225820 3192413 3297254 3540672 3968608 4617835
13683 4617835 5537365 6855437 8536306 10479532 12488563 14357948 15802570 16579515
13675 16579515 16473650 15561370 14034779 12167726 10206203 8381649 6854513 5643449
13667 5643449 4767090 4180901 3751367 3469178 3315800 3265214 3357555 3618983 4077242 4775870
13657 4775870 5750686 7005171 8457258 9954637 11300452 12294120 12759868 12565046 11767222
13648 11767222 10570190 9113320 7606722 6236680 5100499 4210299 3524192 3054174
13640 3054174 2734507 2488963 2363142 2319413 2343283 2495118 2791928 3245344 3911823 4764688
13630 4764688 5727199 6733423 7669464 8334693 8651219 8537598 8000903 7175646 6208264
$$ packed form
13693E654086r01909o56337m37850k76547j55623l3407J04841K43418M27936O49227
13683D617835R19530J318072J680869J943226K009031J869385J444622P76945
13675A6579515j05865r12280j526591j867053j961523j824554j527136j211064
13667E643449q76359n86189m29534k82189j53378n0586R2341K61428M58259O98628
13657D775870R74816J254485J452087J497379J345815R93668M65748j94822p97824
13648A1767222j197032j456870j506598j370042j136181q90200o86107m70018
13640C054174l19667k45544j25821m3729K3870J51835K96810M53416O66479Q52865
13630D764688R62511J006224R36041O65229L16526j13621n36695q25257r67382
$$ plain form
13621 6208264 5180831 4240953 3427232 2791241 2350579 2047577 1805060 1649390 1554040
13612 1554040 1501003 1491124 1563832 1715971 1963985 2313997 2710761 3183869 3637708 4002153
13602 4002153 4212071 4238228 4083816 3759203 3321387 2839534 2371229 1917050 1541282 1244120
13592 1244120 1026929 844488 699204 588400 502416 436421 377472 357504 303963 265327
13582 265327 240214 219365 193838 181126 176545 182821 170230 159611 158480 169972 137732 126186
13570 126186 131277 129676 124198 89559 70744 100151 101861 98227 83208 76853 86754 72892 83746
13557 83746 97071 87276 77028 73059 74964 91421 84908 69771 62601 59792 56303 61370 72659
13544 72659 85511 89480 80391 75714 57195 43219 44077 33832 40094 59424 66170 49408 50685
$$ packed form
13621F208264j027433r39878q13721o35991m40662l03002k42517j55670r5350
13612A554040n3037r879P2708J52139K48014L50012L96764M73108M53839L64445
13602D002153K09918K6157j54412l24613m37816m81853m68305m54179l75768k97162
13592A244120k17191j82441j45284j10804q5984o5995n8949j9968n3541l8636
13582B65327k5113k0849k5527j2712m581O276j2591j0619j131J1492l2240j1546
13570A26186N091j601n478l4639j8815K9407J710l634j5019o355R901j3862J0854
13557H3746J3325r795j0248l969J905J6457o513j5137p170k809l489N067J1289
13544G2659J2852L969r089m677j8519j3976Q58j0245O262J9330O746j6762J277
$$ plain form
13531 50685 73332 57680 70809 80074 79529 49511 37347 18741 44150 70672 75959 54650
13519 54650 49342 63464 71799 73806 62472 36564 38748 27936 18974 46554 44524 19804 41595
13506 41595 49018 44429 48671 34551 52074 41080 19181 32736 22099 9749 19119 43384
13494 43384 37367 45156 54774 56269 48326 30905 33087 20047 13783 11200 15028 8387 25108 33666
13480 33666 52746 73118 55396 55379 74446 67682 54791 39278 42882 40014 38860 44441 57756
13467 57756 55866 61232 57020 43391 44087 44230 42747 38918 27378 44383 73067 72102 47366 45845
13453 45845 48104 24288 32603 47875 38869 46598 50568 56705 52830 60795 81737 92058 103437
13440 103437 110786 102198 81622 87815 81608 86968 54458 51352 83447 87022 69725 71303 68808
$$ packed form
13531E0685K2647j5652J3129R265n45l0018j2164j8606K5409K6522N287k1309
13519E4650n308J4122Q335K007j1334k5908K184j0812q962K7580k030k4720K1791
13506D1595P423m589M242j4120J7523j0994k1899J3555j0637j2350R370K4265
13494D3384o017P789R618J495p943j7421K182j3040o264k583L828o641J6721Q558
13480C3666J9080K0372j7722j7J9067o764j2891j5513L604k868j154N581J3315
13467E7756j890N366m212j3629O96J43j483l829j1540J7005K8684r65k4736j521
13453D5845K259k3816Q315J5272r006P729L970O137l875P965K0942J0321J1379
13440A03437P349q588k0576O193o207N360l2510l106L2095L575j7297J578k495
$$ plain form
13427 68808 73489 78939 67886 54291 42100 44703 86757 85485 62956 67426 64832 72158 82892
13414 82892 102022 93798 75889 94239 98899 91742 94351 97654 109985 121686 86060 65523 74132
13401 74132 93019 103739 106563 118691 146538 108268 89378 78067 61667 42118 16762 -12342
13389 -12342 11564 51010 53255 50898 64687 68399 75546 75653 98105 109961 106143 68551 91558
13376 91558 116641 121360 113544 115482 131828 138342 146930 154304 127168 120862 127716 121751 134755
13363 134755 134905 136596 130265 116303 90437 66394 48630 32614 67247 95598 126124 112871
13351 112871 99597 92951 92984 83405 95704 109280 128810 136032 123931 123485 147408 155476 119705
13338 119705 103933 111373 114878 97774 81590 78824 78900 74848 100576 104286 122281 124817 132921
$$ packed form
13427F8808M681N450j1053j3595j2191K603M2054j272k2529M470k594P326J0734
13414H2892J9130q224j7909J8350M660p157K609L303J2331J1701l5626k0537Q609
13401G4132J8887J0720K824J2128K7847l8270j8890j1311j6400j9549k5356k9104
13389a2342K3906L9446K245k357J3789L712P147J07K2452J1856l818l7592K3007
13376I1558K5083M719p816J938J6346O514Q588P374k7136o306O854n965J3004
13363A34755J50J691o331j3962k5866k4043j7764j6016L4633K8351L0526j3253
13351A12871j3274o646L3r579J2299J3576J9530P222j2101m46K3923Q068l5771
13338A19705j5772P440L505j7104j6184k766P6m052K5728L710J7995K536Q104
$$ plain form
13325 132921 131350 104802 85669 61175 62776 61329 75000 53035 58245 73070 50190 43910
13313 43910 73448 80935 99874 96031 88192 133689 144135 137362 125936 112239 127114 137251
13301 137251 134835 128804 128347 107879 104721 95036 80803 78651 65240 53823 32426 43503 66275
13288 66275 79692 87224 80013 70961 62489 53192 73358 84196 79146 57218 46670 30925 47063
13275 47063 65004 44995 38185 47425 42734 43360 47061 32142 32853 34777 29033 43430 56140 46515
13261 46515 44314 59873 60785 56056 49682 37496 21234 45245 71512 72771 80068 89068 98403
13248 98403 89139 90775 117105 115913 99334 116418 104318 112923 138230 128436 110016 88222 73638
13235 73638 67628 53287 44789 47988 60840 83245 94611 99081 99731 96027 88329 72077 73945
$$ packed form
13325A32921j571k6548j9133k4494J601j447J3671k1965N210J4825k2880o280
13313D3910K9538P487J8939l843p839M5497J0446o773j1426j3697J4875J0137
13301A37251k416o031m57k0468l158r685j4233k152j3411j1417k1397J1077K2772
13288F6275J3417P532p211r052q472r297K0166J0838n050k1928j0548j5745J6138
13275D7063J7941k0009o810R240m691O26L701j4919P11J924n744J4397J2710r625
13261D6515k201J5559R12m729o374j2186j6262K4011K6267J259P297R000R335
13248I8403r264J636K6330j192j6579J7084j2100Q605K5307r794j8420k1794j4584
13235G3638o010j4341q498L199J2852K2405J1366M470O50l704p698j6252J868
$$ plain form
13222 73945 84979 100422 117660 137290 134794 142418 156593 160939 147267 123295 107617 113444
13210 113444 131136 135994 126971 120104 107653 77045 82218 91381 78171 63415 75030 88292
13198 88292 109945 115123 117084 117660 134837 129860 124933 119731 109444 88127 81153 75662 71898 77688
13184 77688 77340 65006 56539 49442 61279 57333 57120 65353 84029 69056 83301 70059 88789
13171 88789 106741 130389 115570 97256 98910 119394 104786 112479 100951 91379 84804 71568
13159 71568 77864 68092 44118 54088 75318 90275 84362 77303 86901 102221 77853 48393 50024
13146 50024 84063 103987 104420 95883 102345 95480 67369 25732 21403 52141 48092 40343 55563
13133 55563 66267 85941 74215 70414 65949 45858 50959 75713 81145 82917 74917 45239 45924
$$ packed form
13222G3945J1034J5443J7238J9630k496P624J4175M346j3672k3972j5678N827
13210A13444J7692M858r023o867j2451l0608N173R163j3210j4756J1615J3262
13198H8292K1653N178J961N76J7177m977m927n202j0287k1317o974n491l764N790
13184G7688l48j2334q467p097J1837l946k13Q233J8676j4973J4245j3242J8730
13171H8789J7952K3648j4819j8314J654K0484j4608P693j1528r572o575j3236
13159G1568O296r772k3974R970K1230J4957n913p059R598J5320k4368k9460J631
13146E0024L4039J9924M33q537O462o865k8111m1637m329L0738m049p749J5220
13133E5563J0704J9674j1726l801m465k0091N101K4754N432J772q000k9678O85
$$ plain form
13120 45924 67654 57979 49473 30958 30625 44974 50964 65741 68116 66653 67047 74431 98461 101293
13106 101293 91279 88702 77413 94314 93632 81702 54608 70469 93461 92642 85812 80626 64558
13093 64558 72342 87659 86023 82366 78879 63413 71690 105510 92111 82444 91133 97215 112478
13080 112478 100446 89450 82338 106888 101565 83398 86413 96420 90013 80187 69419 86033
13068 86033 97394 112453 98567 95518 99188 118639 130746 129758 141669 132367 119922 124522 125166
13055 125166 132105 160575 153631 137724 119997 112606 120826 118083 120835 122275 115697 102560 129785
13042 129785 150978 141644 137655 141056 156524 155032 159450 161566 175283 180771 190363 205137 190263
13029 190263 167052 179186 207704 208383 205162 204591 223874 238586 252263 253673 274745 307153 313867
$$ packed form
13120D5924K1730r675q506j8515l33J4349N990J4777K375j463L94P384K4030K832
13106A01293j0014k577j1289J6901o82j1930k7094J5861K2992q19o830n186j6068
13093F4558P784J5317j636l657l487j5466Q277L3820j3399r667Q689O082J5263
13080A12478j2032j0996p112K4550n323j8167L015J0007o407r826j0768J6614
13068H6033J1361J5059j3886l049L670J9451J2107r88J1911r302j2445M600O44
13055A25166O939K8470o944j5907j7727p391Q220k743K752J440o578j3137K7225
13042A29785K1193r334l989L401J5468j492M418K116J3717N488R592J4774j4874
13029A90263k3211J2134K8518O79l221n71J9283J4712J3677J410K1072L2408O714
$$ plain form
13016 313867 309847 293798 320492 373753 409031 447200 473358 486375 522264 566968 584531 634661
13004 634661 663515 706889 764015 799618 882034 978470 1086559 1217743 1424974 1680713 1992449
12993 1992449 2398078 2938214 3597110 4459145 5640879 7154817 8811987 10338742 11563023
12984 11563023 12471499 12959813 12891730 12293289 11365840 10286047 9117615 7840943 6594619
12975 6594619 5545454 4764469 4237372 3925473 3798386 3819104 3973866 4313555 4889370
12966 4889370 5718001 6856826 8288018 9966743 11642200 13086245 14229297 15085990
12958 15085990 15481602 15268229 14625357 13816456 12982331 12206323 11653122 11526832 11769595
12949 11769595 12284132 12928265 13470647 13786557 13855265 13745025 13380817 12724502 11838322
$$ packed form
13016C13867m020j6049K6694N3261L5278L8169K6158J3017L5889M4704J7563N0130
13004F34661K8854M3374N7126L5603Q2416R6436J08089J31184K07231K55739L11736
12993A992449M05629N40136O58896Q62035J181734J513938J657170J526755J224281
12984A1563023R08476M88314o8083n98441r27449j079793j168432j276672j246324
12975F594619j049165p80985n27097l11899j27087K0718J54762L39689N75815
12966D889370Q28631J138825J431192J678725J675457J444045J143052Q56693
12958A5085990L95612k13373o42872q08901q34125p76008n53201j26290K42763
12949A1769595N14537O44133N42382L15910O8708j10240l64208o56315q86180
$$ plain form
12940 11838322 10818499 9740484 8596339 7458193 6470236 5709783 5235405 4978899 4948141
12931 4948141 5087065 5417739 5980534 6790309 7830581 9004232 10214144 11434174 12618392
12922 12618392 13682513 14483284 15089298 15580244 15941557 16139580 16302628 16522563 16772198
12913 16772198 17089220 17459481 17697552 17702154 17471063 16999368 16218166 15070816 13684736
12904 13684736 12252259 10825705 9464650 8194212 7170573 6447185 5993490 5757330
12896 5757330 5768801 6047720 6620540 7516156 8759247 10199628 11603884 12952086 14263793
12887 14263793 15451737 16355154 16879850 17094900 17084636 16719377 15959065 15141708 14589600
12878 14589600 14432858 14745640 15535473 16536709 17565712 18509706 19247603 19470108 18963433
$$ packed form
12940A1838322j019823j078015j144145j138146r87957p60453m74378k56506l0758
12931D948141J38924L30674N62795Q09775J040272J173651J209912J220030J184218
12922A2618392J064121Q00771O06014M90946L61313J98023J63048K19935K49635
12913A6772198L17022L70261K38071M602k31091m71695p81202j147350j386080
12904A3684736j432477j426554j361055j270438j023639p23388m53695k36160
12896E757330J1471K78919N72820Q95616J243091J440381J404256J348202J311707
12887A4263793J187944R03417N24696K15050j0264l65259p60312q17357n52108
12878A4589600j56742L12782P89833J001236J029003R43994P37897K22505n06675
$$ plain form
12869 18963433 17919179 16514939 14712036 12674380 10691187 8987798 7636275 6621082
12861 6621082 5866376 5378375 5093373 4993471 5137274 5550080 6276754 7346829 8748496
12852 8748496 10427168 12158076 13774211 15248258 16475041 17221321 17304061 16690618 15517141
12843 15517141 13926851 11986037 9858304 7892442 6303232 5108486 4242409 3582398
12835 3582398 3028001 2568880 2188564 1868095 1610618 1402615 1246540 1151516 1065672 995870
12825 995870 906417 839384 790570 741302 680543 630009 585209 515641 483160 450910 402142
12814 402142 360319 337722 319668 298061 275380 261333 258127 269810 295744 297803 282414 233054
12802 233054 207323 197957 202089 180751 167163 177742 192895 182437 166468 159794 157131 148648
$$ packed form
12869A8963433j044254j404240j802903k037656j983193j703389j351523j015193
12861F621082p54706m88001k85002r9902J43803M12806P26674J070075J401667
12852H748496J678672J730908J616135J474047J226783P46280Q2740o13443j173477
12843A5517141j590290j940814k127733j965862j589210j194746q66077o60011
12835C582398n54397m59121l80316l20469k57477k08003j56075r5024q5844o9802
12825I95870q9453o7033m8814m9268o0759n0534m4800o9568l2481l2250m8768
12814D02142m1823k2597j8054k1607k2681j4047l206J1683K5934K059j5389m9360
12802B33054k5731r366M132k1338j3588J0579J5153j0458j5969o674k663q483
$$ plain form
12790 148648 162078 185433 180728 164411 166337 186953 173625 157253 138246 151084 192269 204838
12778 204838 206072 216270 231545 214570 178990 147244 130936 134717 126631 133401 122228 123696
12766 123696 143977 162920 151566 117885 105472 127029 154044 174719 166234 173583 173650 173707 198937
12753 198937 195013 161664 138609 133516 126986 124714 136792 123944 130272 146624 161378 140725
12741 140725 137519 129235 125143 116051 120275 122370 127819 124056 118627 122340 128515 130253 110052 112712
12727 112712 128007 146138 175910 177097 192886 200106 191071 206801 198602 171048 142819 119519
12715 119519 132031 147093 148547 147366 139272 105672 119327 154180 159306 151064 170045 211565
12703 211565 237195 272768 282180 267960 243605 239987 199968 175436 157099 143187 126588 132886
$$ packed form
12790A48648J3430K3355m705j6317J926K0616j3328j6372j9007J2838M1185J2569
12778B04838J234J0198J5275j6975l5580l1746j6308L781q086O770j1173J468
12766A23696K0281J8943j1354l3681j2413K1557K7015K0675q485P349O7N7K5230
12753A98937l924l3349k3055n093o530k272J2078j2848O328J6352J4754k0653
12741A40725l206q284m092r092M224K095N449l763n429L713O175J738k0201K660
12727A12712J5295J8131K9772J187J5789P220r035J5730q199k7554k8229k3300
12715A19519J2512J5062J454j181q094l3600J3655L4853N126q242J8981M1520
12703B11565K5630L5573R412j4220k4355l618m0019k4532j8337j3912j6599O298
$$ plain form
12691 132886 131095 135203 169622 188911 190077 179717 200841 236736 259657 273510 246463 205520
12679 205520 212046 210501 201185 196773 148287 120134 134838 121001 92405 113624 106097 98617 87756
12666 87756 98514 106303 108522 96681 96959 87764 76666 60261 74213 65521 105832 145162 145855
12653 145855 156782 176714 197068 204384 203704 181606 172770 159848 125984 103865 104465 112214 113618
12640 113618 119840 123242 126116 150725 148830 126234 112748 104685 97080 93630 108528 146558 171736
12627 171736 165874 146496 117499 92738 92226 93422 116198 106233 86538 43654 35023 53518 52710
12614 52710 58700 84106 97707 97359 117465 146934 140713 126903 112802 107399 107707 123655 119368
12601 119368 112654 127878 122531 105485 121733 119605 105601 92921 90815 79257 90690 92697
$$ packed form
12691A32886j791M108L4419J9289J166j0360K1124L5895K2921J3853k7047m0943
12679B05520O526j545r316m412m8486k8153J4704j3837k8596K1219p527p480j0861
12666H7756J0758P789K219j1841K78r195j1098j6405J3952q692M0311L9330O93
12653A45855J0927J9932K0354P316o80k2098q836j2922l3864k2119O00P749J404
12640A13618O222L402K874K4609j895k2596j3486q063p605l450J4898L8030K5178
12627A71736n862j9378k8997k4761n12J196K2776r965j9695m2884q631J8495q08
12614E2710N990K5406J3601l48K0106K9469o221j3810j4101n403L08J5948m287
12601A19368o714J5224n347j7046J6248k128j4004j2680k106j1558J1433K007
$$ plain form
12589 92697 76568 86840 121660 144438 138519 131511 130835 128758 100801 126119 143608 172262 176965
12576 176965 144813 140519 123465 125467 141163 154392 148380 153202 172165 146930 115296 113477
12564 113477 155102 192315 194672 190460 192458 222375 219591 226631 216634 200028 203534 189142 193253
12551 193253 210457 184902 167216 148099 167416 166053 174829 178314 189692 212023 203908 217921
12539 217921 230262 220518 204989 190955 186321 199381 193905 207546 221155 216422 185369 176360
12527 176360 170707 187270 218693 242270 264661 267254 247488 246880 249063 259325 272504 275911 273765
12514 273765 259349 254610 252171 235126 202799 181342 196436 225374 274140 307595 330293 339544
12502 339544 353956 380333 409517 426203 456286 448063 440674 442813 461744 458852 439906 437458
$$ packed form
12589I2697j6129J0272L4820K2778n919p008o76k077k7957K5318J7489K8654M703
12576A76965l2152m294j7054K002J5696J3229o012M822J8963k5235l1634j819
12564A13477M1625L7213K357m212J998K9917k784P040r997j6606L506j4392M111
12551A93253J7204k5555j7686j9117J9317j363Q776L485J1378K2331q115J4013
12539B17921J2341r744j5529j4034m634J3060n476J3641J3609m733l1053r009
12527A76360n653J6563L1423K3577K2391K593j9766o08K183J0262J3179L407k146
12514B73765j4416m739k439j7045l2327k1457J5094K8938M8766L3455K2698R251
12502C39544J4412K6377K9184J6686L0083q223p389K139J8931k892j8946k448
$$ plain form
12490 437458 440729 461380 488997 510875 554486 578935 588465 589646 608018 644894 680423 678431
12478 678431 681582 678053 683297 715806 742617 758586 776465 820144 854543 895719 955535 1042279
12466 1042279 1118506 1150253 1194839 1273454 1360459 1441530 1538428 1640433 1764740 1894232 2061245
12455 2061245 2272208 2504019 2782973 3136095 3569380 4095947 4719438 5445559 6249188
12446 6249188 7104127 8030180 8947287 9937487 11121225 12693037 14998306 18454715 23768829
12437 23768829 31837042 43329757 57961745 74434687 91135322 106561827 118884026
12430 118884026 125947235 126136723 119566561 107913605 93265086 77204768 61246335
12423 61246335 47067509 35915883 27937357 22456953 18648134 15930499 13882276 12234311
$$ packed form
12490D37458L271K0651K7617K1878M3611K4449R530J181J8372L6876L5529j992
12478F78431L151l529N244L2509K6811J5969J7879M3679L4399M1176N9816Q6744
12466A042279P6227L1747M4586P8615Q7005Q1071R6898J02005J24307J29492J67013
12455B061245K10963K31811K78954L53122M33285N26567O23491P26121Q03629
12446F249188Q54939R26053R17107R90200J183738J571812K305269L456409N314114
12437B3768829Q068213J1492715J4631988J6472942J6700635J5426505J2322199
12430A18884026P063209J89488o570162j1652956j4648519j6060318j5958433
12423F1246335j4178826j1151626p978526n480404l808819k717635k048223j647965
$$ plain form
12415 12234311 10847977 9616024 8474067 7416094 6435568 5568043 4818721 4181006 3674987
12406 3674987 3308815 3015579 2739772 2490685 2277160 2082918 1921466 1765426 1621522
12397 1621522 1508781 1391803 1299887 1225288 1143466 1074855 1029094 1018504 987426 936009 924368
12386 924368 897164 876764 861386 832669 797390 752860 697256 666245 652520 628899 593509
12375 593509 573017 573390 567393 566711 582215 589589 593699 607315 625432 623502 615194 617238 611940 607304
12361 607304 610903 605100 624443 632765 665532 696304 733776 788576 847761 910375 978500 1066414
12349 1066414 1184817 1322893 1464630 1630271 1814552 2013640 2305761 2700596 3189024
12340 3189024 3813332 4636994 5766743 7298057 9310254 11800843 14641745 17430811
$$ packed form
12415A2234311j386334j231953j141957j057973r80526q67525p49322o37715n06019
12406C674987l66172k93236k75807k49087k13525j94242j61452j56040j43904
12397A621522j12741j16978r1916p4599q1822o8611m5761j0590l1078n1417j1641
12386I24368k7204k0400j5378k8717l5279m4530n5604l1011j3725k3621l5390
12375E93509k0492L73n997o82J5504P374M110J3616J8117j930q308K044n298m636
12361F07304L599n803J9343Q322L2767L0772L7472N4800N9185O2614O8125Q7914
12349A066414J18403J38076J41737J65641J84281J99088K92121L94835M88428
12340C189024O24308Q23662J129749J531314K012197K490589K840902K789066
$$ plain form
12332 17430811 19573587 20444750 19509542 17075875 14029962 11200822 9038027 7538361
12324 7538361 6565402 5953866 5625658 5579235 5756358 6247226 7101858 8307027 9875147
12315 9875147 11819439 14108783 16631751 18843639 20144806 20142413 18834018 16554611 13804165
12306 13804165 11122597 8834842 7076364 5806072 4888001 4230306 3786615 3459893 3239369
12297 3239369 3101065 2997315 2912864 2887587 2898057 2995502 3153447 3381054 3745676 4307763
12287 4307763 5088678 6111683 7517718 9360967 11643002 14337798 17210211 19685456
12279 19685456 20933283 20577101 18998320 16817665 14477721 12232809 10301162 8853880
12271 8853880 7878063 7375765 7224910 7466741 8124004 9292657 11097685 13648511 16990223
$$ packed form
12332A7430811K142776Q71163r35208k433667l045913k829140k162795j499666
12324G538361r72959o11536l28208m6423J77123M90868Q54632J205169J568120
12315I875147J944292K289344K522968K211888J301167k393j308395k279407k750446
12306A3804165k681568k287755j758478j270292r18071o57695m43691l26722k20524
12297C239369j38304j03750q4451k5277J0470R7445J57945K27607L64622N62087
12287D307763P80915J023005J406035J843249K282035K694796K872413K475245
12279A9685456J247827l56182j578781k180655k339944k244912j931647j447282
12271H853880r75817n02298j50855K41831O57263J168653J805028K550826L341712
$$ plain form
12262 16990223 21033537 25575231 30187499 34058776 35891691 34850585 31406686 26895436
12254 26895436 22348542 18317794 14948297 12260321 10227561 8783090 7781029 7150410
12246 7150410 6840325 6871099 7280951 8151462 9455499 11103390 12950623 14777716 16232215
12237 16232215 16855768 16278193 14667790 12562235 10380870 8459490 6891763 5686195
12229 5686195 4734032 4015903 3499840 3121814 2850021 2634959 2517388 2411718 2348022 2318775
12219 2318775 2315724 2359844 2417026 2558310 2807585 3220007 3860217 4775016 6046022 7813385
12209 7813385 10037720 12418713 14577930 16050246 16536417 15967188 14452565 12459934
12201 12459934 10538620 8917928 7545385 6391047 5493432 4859321 4492231 4389063 4526517
$$ packed form
12262A6990223M043314M541694M612268L871277J832915j041106l443899m511250
12254B6895436m546894m030748l369497k687976k032760j444471j002061o30619
12246G150410l10085L0774M09852Q70511J304037J647891J847233J827093J454499
12237A6232215O23553n77575j610403k105555k181365j921380j567727j205568
12229E686195r52163p18129n16063l78026k71793k15062j17571j05670o3696k9247
12219B318775l051M4120N7182J41284K49275M12422O40210R14799J271006J767363
12209G813385K224335K380993K159217J472316M86171n69229j514623j992631
12201A2459934j921314j620692j372543j154338q97615o34111l67090j03168J37454
$$ plain form
12192 4526517 4891423 5589481 6725799 8407523 10684921 13366186 15856499 17244025
12184 17244025 17088613 15630567 13409065 10977470 8738750 6914050 5557265 4560131
12176 4560131 3786738 3179155 2694649 2321223 2005946 1736458 1514637 1312020 1160861
12167 1160861 975641 818587 735898 682689 619508 532724 478390 445694 407823 384989 365239
12156 365239 327779 303917 290949 286583 266594 266432 262761 252144 216952 207265 210523 206271 203478
12143 203478 170888 138253 136024 151622 154276 161240 161711 159274 156876 151885 140293 157617 134544
12130 134544 117864 114974 125527 142648 130684 113409 122008 111561 94463 110475 129245 135681
12118 135681 118803 63955 54638 93623 108325 87292 71296 78004 83541 85839 69769 48334
$$ packed form
12192D526517L64906O98058J136318J681724K277398K681265K490313J387526
12184A7244025j55412j458046k221502k431595k238720j824700j356785r97134
12176D560131p73393o07583m84506l73426l15277k69488k21821k02617j51159
12167A160861j85220j57054q2689n3209o3181q6784n4334l2696l7871k2834j9750
12156C65239l7460k3862j2968m366j9989j62l671j0617l5192r687L258m252k793
12143B03478l2590l2635k229J5598K654O964M71k437k398m991j1592J7324k3073
12130A34544j6680k890J0553J7121j1964j7275Q599j0447j7098J6012J8770O436
12118A35681j6878n4848r317L8985J4702k1033j5996O708N537K298j6070k1435
$$ plain form
12106 48334 35762 63368 129148 189820 252946 254228 194753 144901 131194 111658 74254 52812
12094 52812 58093 57734 55026 25164 58303 76340 75920 56670 36769 41904 38943 30935 11231
12081 11231 1676 15606 25367 7742 2611 19346 42371 54529 63455 47688 21560 39309
12069 39309 51111 36375 37188 17929 8595 -3583 -12028 -16665 8739 30213 49773 41916 37324
12056 37324 26715 15853 13580 13801 7094 17583 32369 33897 43837 64913 49579 50073 43031
12043 43031 58490 52034 33093 28942 37221 30645 45102 59809 49293 44699 37858 46815 27642
12030 27642 34114 27884 19543 8234 12934 14370 30164 50284 53840 67489 80832 67560 40620
12017 40620 40384 65403 80814 100728 139441 203961 250619 310877 386214 471113 536328 587408
$$ packed form
12106D8334j2572K7606O5780O0672O3126J282n9475m9852j3707j9536l7404k1442
12094E2812N281l59k708k9862L3139J8037m20j9250j9901N135k961q008j9704
12081A1231r555J3930R761j7625n131J6735K3025J2158Q926j5767k6128J7749
12069C9309J1802j4736Q13j9259r334j2178q445m637K5404K1474J9560p857m592
12056C7324j0609j0862k273K21o707J0489J4786J528R940K1076j5334M94p042
12043D3031J5459o456j8941m151Q279o576J4457J4707j0516m594o841Q957j9173
12030B7642O472o230q341j1309M700J436J5794K0120L556J3649J3343j3272k6940
12017D0620k36K5019J5411J9914L8713O4520M6658O0258P5337Q4899O5215N1080
$$ plain form
12005 587408 644536 677868 679795 638918 552500 456120 354159 268886 221326 163876 134723
11994 134723 128886 111928 119183 110050 92188 106323 106063 81637 67114 75524 82147 66423 32392
11981 32392 25047 7784 5209 15950 12129 10529 -2425 -16859 -17794 -12654 2550 31170 18669
11968 18669 53228 60599 47274 33636 25944 49508 46468 23651 -1145 -366 6290 -3234 6064
11955 6064 -1429 -13985 -22023 -18563 -6 28234 51911 75323 64335 33212 26777 14709 13483
11942 13483 29795 38829 39875 43097 44349 43494 35207 42735 51914 34630 27800 42476 61789 79653
11928 79653 83369 92587 111590 132539 135860 124713 158435 181982 209128 257675 287299 305806
11916 305806 334719 385214 476708 605010 813180 1072909 1396953 1819901 2276972 2768437
$$ packed form
12005E87408N7128L3332J927m0877q6418r6380j01961q5273m7560n7450k9153
11994A34723n837j6958P255r133j7862J4135k60k4426j4523Q410O623j5724l4031
11981C2392p345j7263k575J0741l821j600j2954j4434r35N140J5204K8620j2501
11968A8669L4559P371j3325j3638p692K3564l040k2817k4796P79O656r524R298
11955F064p493j2556q038L460J8557K8240K3677K3412j0988l1123o435j2068j226
11942A3483J6312R034J046L222J252q55q287P528R179j7284o830J4676J9313J7864
11928G9653L716R218J9003K0949L321j1147L3722K3547K7146M8547K9624J8507
11916C05806K8913N0495R1494J28302K08170K59729L24044M22948M57071M91465
$$ plain form
11906 2768437 3231729 3580048 3761776 3762072 3578569 3248171 2813987 2351927 1899899 1491071
11896 1491071 1150911 899477 737934 613203 519567 483346 435944 378636 313358 285889
11886 285889 251432 200608 193842 183408 177990 200283 201676 188933 186090 164017 119286 101352
11874 101352 108740 118130 125923 114142 86368 59749 56167 40627 33115 60038 84164 96346
11862 96346 140111 164608 149293 126502 113895 104903 93040 100990 92652 80644 54930 28598
11850 28598 20679 35045 32905 36755 32799 5840 1056 28892 31116 35883 13941 2140 -1611
11837 -1611 -6371 1768 13901 8527 26635 54317 63301 67584 69130 67621 79963 79402 74121 79276
11823 79276 65507 74852 62107 44338 25185 43150 68722 98065 99423 99633 99360 88602 80293
$$ packed form
11906B768437M63292L48319J81728K96j83503l30398m34184m62060m52028m08828
11896A491071l40160k51434j61543j24731r3636l6221m7402n7308o5278k7469
11886B85889l4457n0824o766j0434n418K2293J393j2743k843k2073m4731j7934
11874A01352P388R390P793j1781k7774k6619l582j5540p512K6923K4126J2182
11862I6346M3765K4497j5315k2791j2607q992j1863P950q338j2008k5714k6332
11850B8598p919J4366k140L850l956k6959m784K7836K224M767k1942j1801l751
11837a611m760Q139J2133n374J8108K7682Q984M283J546j509J2342n61n281N155
11823G9276j3769R345j2745j7769j9153J7965K5572K9343J358K10k73j0758q309
$$ plain form
11810 80293 90315 119731 143947 164676 165907 138987 101030 99099 74915 53412 53533 43421
11798 43421 36622 65794 66419 65736 49279 38632 848 973 40319 61970 91902 109302 101503
11785 101503 94512 95124 95955 77569 63201 49086 23012 11560 14508 21579 15565 46158 46397
11772 46397 45243 42125 29959 27392 31128 34566 38183 34261 32446 19627 23403 6389 7381 9674
11758 9674 20184 18081 40119 73892 77267 67945 42363 40458 44897 42662 55721 60577 45295
11745 45295 7695 -28466 -33167 -15068 -6225 1620 6514 22087 53145 74705 56467 52781 60260
11732 60260 46579 54818 63086 64816 29180 9143 25199 41830 30964 37379 35367 30290 41643
11719 41643 23956 7002 7243 -10763 -10938 -3843 -22072 -9630 12110 24310 10776 10560 -15770
$$ packed form
11810H0293J0022K9416K4216K0729J231k6920l7957j931k4184k1503J21j0112
11798D3421o799K9172O25o83j6457j0647l7784J25L9346K1651K9932J7400p799
11785A01503o991O12Q31j8386j4368j4115k6074j1452K948P071o014L0593K39
11772D6397j154l118j2166k567L736L438L617l922j815j2819L776j7014R92K293
11758I674J0510k103K2038L3773L375r322k5582j905M439k235J3059M856j5282
11745D5295l7600l6161m701J8099Q843P845M894J5573L1058K1560j8238l686P479
11732F0260j3681Q239Q268J730l5636k0037J6056J6631j0866O415k012n077J1353
11719D1643j7687j6954K41j8006j75P095j8229J2442K1740J2200j3534k16k6330
$$ plain form
11706 -15770 -7490 -7544 -33165 -42107 -45558 -16134 5385 1068 -25840 -15848 -7035 -6922 -14094 -30511
11692 -30511 -5591 20777 11541 -1846 18422 43794 13627 -25949 -22886 -30491 -24525 -11857
11680 -11857 -1588 3571 15494 12097 13144 3916 4765 538 9882 17653 36146 26421 -1954 -6237
11666 -6237 -18770 -40678 -34996 -14351 -13149 -24722 -19236 -14042 -13674 17533 32270 28206 34121
11653 34121 19971 -1874 8143 5039 -776 -6262 -6728 1113 4525 -17591 -16052 7310 -14686
11640 -14686 -25508 -29561 -18279 21 -14854 -1613 -23317 -15978 5732 13552 16214 24005 32843
11627 32843 17206 13129 33610 25049 7494 -2142 1886 -6676 13873 16460 -14475 -9866 10715
11614 10715 17991 15782 27366 28242 12278 -2072 15505 19060 13433 24626 23517 25816 31263
$$ packed form
11706a5770Q280n4k5621q942l451K9424K1519m317k6908R992Q813J13p172j6417
11692c0511K4920K6368r236j3387K0268K5372l0167l9576L063p605N966J2668
11680a1857J0269N159J1923l397J047r228Q49m227R344P771J8493r725k8375m283
11666f237j2533k1908N682K0645J202j1573N486N194L68L1207J4737m064N915
11653C4121j4150k1845J0017l104n815n486m66P841L412k2116J539K3362k1996
11640a4686j0822m053J1282J8300j4875J3241k1704P339K1710P820K662P791Q838
11627C2843j5637m077K0481q561j7555r636M028q562K0549K587l0935M609K0581
11614A0715P276k209J1584Q76j5964j4350J7577L555n627J1193j109K299N447
$$ plain form
11601 31263 8672 -7452 -5558 -28934 -19546 -6384 -7287 -10311 15493 19957 1280 -3447 -15419
11588 -15419 -28309 -10858 10931 4508 -5277 -3737 -9742 -25477 -26997 -5335 -4447 3453 -1232
11575 -1232 -3499 5107 22796 39539 25294 17534 41266 26062 15637 17201 -14608 -52315 -61929
11562 -61929 -34360 -3033 -2020 3918 23259 25525 12102 -6153 -8181 -5975 17283 13434 -2075
11549 -2075 5769 8525 4955 10103 7077 19453 24981 10425 15000 22470 8904 -8833 15313
11536 15313 21271 25977 41971 35445 24207 14487 -4283 130 -4852 -25912 -15975 4857 3120
11523 3120 2468 16384 11275 28966 28589 36156 38838 26184 22215 24609 14257 25792 35201 31416
11509 31416 43385 29971 -1707 -21923 3982 42978 38703 31389 38670 40006 20839 -10111
$$ packed form
11601C1263k2591j6124J894k3376R388J3162r03l024K5804M464j8677m727j1972
11588a5419j2890J7451K1789o423r785J540o005j5735j520K1662Q88P900m685
11575a232k267Q606J7689J6743j4245p760K3732j5204j0425J564l1809l7707r614
11562f1929K7569L1327J013N938J9341K266j3423j8255k028K206K3258l849j5509
11549b075P844K756l570N148l026J2376N528j4556M575P470j3566j7737K4146
11536A5313N958M706J5994o526j1238r720j8770M413m982k1060R937K0832j737
11523C120o52J3916n109J7691l77P567K682j2654l969K394j0352J1535R409l785
11509C1416J1969j3414l1678k0216K5905L8996m275p314P281J336j9167l0950
$$ plain form
11497 -10111 -48386 -59797 -63163 -63583 -44294 -16058 -3737 -2365 -5143 8502 13770 3435 7097
11484 7097 19351 24483 12524 13428 20773 21519 -628 -6250 -24080 -15267 7041 22946 12075
11471 12075 19904 15527 13665 9517 9439 1021 -7261 -8878 -14316 -30724 -34542 -39827 -37045 -16940
11457 -16940 -3845 15109 14890 -6864 3448 -12905 -20649 1942 -6163 -221 -13305 -37941 -29217
11444 -29217 -8864 -4332 -46863 -40917 -11731 5418 22785 36395 24039 -696 -41711 -65645
11432 -65645 -51022 -19115 -16581 -19436 -10573 -6735 -18616 -8852 734 -727 2694 -13544 -25891
11419 -25891 -17608 -2383 9948 26185 32254 20076 25582 24577 30102 16782 -20264 -16598 -511
11406 -511 6561 -4439 -13401 -23117 -44710 -34419 -22485 -18038 -20891 -8524 14849 13028 -27267
$$ packed form
11497a0111l8275j1411l366m20J9289K8236J2321J372k778J3645N268j0335L662
11484G097J2254N132j1959R04P345P46k2147n622j7830Q813K2308J5905j0871
11471A2075P829m377j862m148p8q418q282j617n438j6408l818n285K782K0105
11457a6940J3095J8954k19k1754J0312j6353p744K2591q105N942j3084k4636Q724
11444b9217K0353M532m2531N946K9186J7149J7367J3610j2356k4735m1015k3934
11432f5645J4623L1907K534k855Q863L838j1881R764R586j461L421j6238j2347
11419b5891Q283J5225J2331J6237O069j2178N506j005N525j3320l7046L666J6087
11406e11P072j1000q962r716k1593J0291J1934M447k853J2367K3373j821m0295
$$ plain form
11393 -27267 -21024 -14694 -10852 -18762 -645 25687 42772 23879 -569 -1940 -21971 -22063 -7547
11380 -7547 -12454 -28619 -26370 2108 25105 44251 35976 43489 43685 33984 28790 19414 15749 21585
11366 21585 25706 22608 19703 24904 50849 38166 9967 -1672 -2175 16033 45827 75213 38396
11353 38396 23876 21580 28653 7288 -18793 -9060 -714 -6024 8562 9724 -9646 -15355 -20969
11340 -20969 -9058 7684 16252 1104 -19464 -33129 -37665 -20469 15737 8296 18136 13650 21513
11327 21513 17017 -10494 -30939 8039 31978 40824 27407 13976 26227 38293 31582 23684
11315 23684 18695 29358 23068 2575 2678 12721 -10538 -1015 -2233 -13158 -754 -14771 -18054
11302 -18054 712 -1746 107 -3155 -20747 -34517 -22044 -5198 13477 14516 18401 2166 -16332
$$ packed form
11393b7267O243O330L842p910J8117K6332J7085j8893k4448j371k0031r2J4516
11380g547m907j6165K249K8478K2997J9146q275P513J96r701n194r376l665N836
11366B1585M121l098k905N201K5945j2683k8199j1639n03J8208K9794K9386l6817
11353C8396j4520k296P073k1365k6081R733Q346n310J4586J162j9370n709n614
11340b0969J1911J6742Q568j5148k0568j3665m536J7196L6206p441R840m486P863
11327B1513m496k7511k0445L8978K3939Q846j3417j3431J2251J2066o711p898
11315B3684m989J0663o290k0493J03J0043k3259R523j218j0925J2404j4017l283
11302a8054J8766k458J853l262j7592j3770J2473J6846J8675J039L885j6235j8498
$$ plain form
11289 -16332 -6686 -19300 -12359 -16280 -32149 -23373 -7200 5506 2481 1516 -11868 -35140 -14408
11276 -14408 -10368 -2937 2848 -2977 -10624 -5684 -14713 -9206 727 6793 6654 -6784 -471 8961
11262 8961 520 -2173 9741 23244 16858 -2142 1288 -12532 -17056 -16496 -15471 -23836 -23497 17024
11248 17024 38615 37444 21110 14339 -188 13357 15608 33726 34471 36912 7460 7268 5369
11235 5369 263 18624 31248 98 -15744 -19594 -9141 -4132 -17936 -8819 18431 7753 -2077
11222 -2077 -3690 8532 27622 34102 48321 46865 25127 17309 21741 22351 29992 24634 15460 23169
11208 23169 47041 57902 31754 35844 35942 19484 4656 9558 1224 -18420 -19905 -22253 10836
11195 10836 2982 28664 45196 43149 30811 15200 5205 1964 -16882 -21617 -13506 -10114 6342
$$ packed form
11289a6332R646j2614O941l921j5869Q776J6173J2706l025r65j3384k3272K0732
11276a4408M040P431N785n825p647M940r029N507R933O066j39j3438O313R432
11262H961q441k693J1914J3503o386j9000L430j3820m524N60J025q365L39M0521
11248A7024K1591j171j6334o771j4527J3545K251J8118P45K441k9452j92j899
11235E369n106J8361J2624l1150j5842l850J0453N009j3804R117K7250j0678r830
11222b077j613J2222J9090O480J4219j456k1738p818M432O10P641n358r174P709
11208B3169K3872J0861k6148M090R8j6458j4828M902q334j9644j485k348L3089
11195A0836p854K5682J6532k047j2338j5611r995l241j8846m735Q111L392J6456
$$ plain form
11182 6342 10904 3183 -19521 -15290 -13378 -14260 -13853 -21778 2854 46401 38497 15376 21840 41321
11168 41321 25325 17655 24244 18356 3897 -10704 8333 -8917 -21888 784 18351 31092
11156 31092 19354 14928 7340 -21182 -29657 -16898 -8571 5035 27804 39951 51651 33782
11144 33782 15118 22160 21960 -1751 -1748 19554 17364 -227 17556 17396 11630 28396 35418 36232
11130 36232 47597 33372 26942 25308 46070 64259 48672 39098 49227 51763 44065 25070 13137
11117 13137 24414 32286 17736 12421 27354 18152 -7977 -12490 13975 21156 31101 37260 19206
11104 19206 15712 -857 -5907 -6921 8263 7063 -10603 -16667 -2871 -4558 7991 -12805 -13145
11091 -13145 17117 16320 12311 -9 -19956 -16686 -11318 -18214 -35952 -23587 -19526 -23092 -6054
$$ packed form
11182F342M562p721k2704M231J912q82M07p925K4632M3547p904k3121O464J9481
11168D1321j5996p670O589n888j4459j4601J9037j7250j2971K2672J7567J2741
11156C1092j1738m426p588k8522q475J2759Q327J3606K2769J2147J1700j7869
11144C3782j8664P042k00k3711LK1302k190j7591J7783j60n766J6766P022Q14
11130C6232J1365j4225o430j634K0762J8189j5587r574J0129K536p698j8995j1933
11117A3137J1277P872j4550n315J4933r202k6129m513K6465P181R945O159j8054
11104A9206l494j6569n050j014J5184j200j7666o064J3796j687J2549k0796l40
11091a3145L0262p97m009j2320j9947L270N368o896j7738J2365M061l566J7038
$$ plain form
11078 -6054 2178 -10278 -37858 -27023 -7755 -5866 -8403 -1850 -9181 -3798 33199 35023 30774
11065 30774 13875 -20361 -23265 -10016 -37112 -31733 -12201 -8046 -13878 663 44156 44697 33222
11052 33222 45207 48661 25498 15837 -6128 -39183 -46991 -26510 14427 14940 5800 -4059 225
11039 225 7892 -7382 15789 24157 11177 29478 34449 19930 2608 2844 20598 29676 18994
11026 18994 18428 33364 25335 22761 26399 13490 16248 -1315 7349 9664 3039 10472 19367 15055
11012 15055 38718 37699 12181 27163 35522 15277 9752 27261 37276 33981 34936 32862 -2858
10999 -2858 621 31865 30284 17092 -1567 16468 31858 33057 22753 4194 7578 2809 4469
10986 4469 27997 24421 24306 13924 5075 -3740 1691 20139 13966 -4969 347 26569 48728
$$ packed form
11078f054Q232j2456k7580J0835J9268J889k537O553p331N383L6997J824m249
11065C0774j6899l4236k904J3249k7096N379J9532M155n832J4541M3493N41j1475
11052C3222J1985L454k3163r661k1965l3055p808K0481M0937N13r140r859M284
11039B25P667j5274K3171Q368j2980J8301M971j4519j7322K36J7754R078j0682
11026A8994n66J4936q029k574L638j2909K758j7563Q664K315o625P433Q895m312
11012A5055K3663j019k5518J4982Q359k0245n525J7509J0015l295R55k074l5720
10999b858L479L1244j581j3192j8659J8035J5390J199j0304j8559L384m769J660
10986D469K3528l576j15j0382q849q815N431J8448o173j8935N316K6222K2159
$$ plain form
10973 48728 35128 22445 24392 21792 11538 14087 861 -23473 -36254 -32047 -22147 -10289 33839
10960 33839 39952 19322 37735 53252 56411 62370 28591 986 14585 15357 13173 27719 15056
10947 15056 26047 26743 14043 24283 33459 25664 47143 70398 55773 39986 26577 17116 22687
10934 22687 36628 37903 39334 45793 61573 49901 34678 55470 49215 19890 10417 24230 49458
10921 49458 60667 50127 39991 42075 38478 40088 58497 70842 78105 84978 91506 90282 94202
10908 94202 103155 112342 157645 207217 258632 341249 442608 638559 923893 1291236 1594635
10897 1594635 1614119 1311054 940463 682506 510832 392730 319992 251483 192886 162196
10887 162196 136929 128345 109701 112829 120388 117842 108304 73353 62750 82566 86220 106053 103618
$$ packed form
10973D8728j3600j2683J947k600j0254K549j3226k4334j2781M207R900J1858M4128
10960C3839O113k0630J8413J5517L159N959l3779k7605J3599P72k184J4546j2663
10947A5056J0991O96j2700J0240R176p795K1479K3255j4625j5787j3409r461N571
10934B2687J3941J275J431O459J5780j1672j5223K0792o255k9325r473J3813K5228
10921D9458J1209j0540j0136K084l597J610J8409J2345P263O873O528j224L920
10908I4202Q953R187M5303M9572N1415Q2617J01359J95951K85334L67343L03399
10897A594635J9484l03065l70591k57957j71674j18102p2738o8509n8597l0690
10887A62196k5267q584j8644L128P559k546r538l4951j0603J9816L654J9833k435
$$ plain form
10874 103618 70574 68295 65252 43693 25966 21329 20478 19798 25410 25836 29267 43863 59158 67039
10860 67039 43827 31189 9605 -487 6754 22382 55476 54149 49760 44567 26496 16604 50104
10847 50104 68538 50909 20248 17166 31642 50815 45376 29783 29985 46970 43625 39861 27393
10834 27393 23182 28762 55497 53916 50134 37948 27595 33620 24714 46833 41831 48245 70937
10821 70937 72685 61387 61038 48053 48833 33191 49811 68175 81160 79897 50635 27623 19086
10808 19086 20814 38680 54952 76818 102751 101288 76974 68693 59470 70620 88638 72906
10796 72906 91245 111204 102516 89192 76900 55897 53357 56104 38650 23643 21750 -3422
10784 -3422 4419 40728 52142 49566 47389 55640 48780 38107 23444 42366 52774 69938 82667
$$ packed form
10874A03618l3044k279l043k1559j7727m637q51o80N612M26L431J4596J5295P881
10860F7039k3212j2638k1584j0092P241J5628L3094j327m389n193j8071r892L3500
10847E0104J8434j7629l0661l082J4476J9173n439j5593K02J6985l345l764j2468
10834B7393m211N580K6735j581l782j2186j0353O025q906K2119n002O414K2692
10821G0937J748j1298l49j2985P80j5642J6620J8364J2985j263k9262k3012q537
10808A9086J728J7866J6272K1866K5933j463k4314q281r223J1150J8018j5732
10796G2906J8339J9959q688j3324j2292k1003k540K747j7454j5007j893k5172
10784c422P841L6309J1414k576k177Q251o860j0673j4663J8922J0408J7164J2729
$$ plain form
10771 82667 118002 119424 101197 79737 67148 54088 42088 58901 56838 63529 66041 52741
10759 52741 40875 45557 59299 50725 52683 57788 71911 74869 91124 78956 75073 57792 71421
10746 71421 65183 86936 88129 100178 114153 131382 144083 158109 171187 187852 193042 208904
10734 208904 207723 197031 146607 132387 159851 164172 149644 137308 121936 125436 102679 79265
10722 79265 64479 63341 96797 85646 51327 34755 24274 13645 -570 13740 36667 34690
10710 34690 37862 51107 43755 29848 51102 75098 92378 89766 105719 113401 109120 91536 63096
10697 63096 58625 68828 63372 60627 85136 83233 67844 45226 43230 50632 58670 57819 46257
10684 46257 18975 7062 22266 28395 50621 62864 71914 89562 80672 93624 93822 112169 121428
$$ packed form
10771H2667L5335J422j8227k1460j2589j3060j2000J6813k063O691K512j3300
10759E2741j1866M682J3742q574J958N105J4123K958J6255j2168l883j7281J3629
10746G1421o238K1753J193J2049J3975J7229J2701J4026J3078J6665N190J5862
10734B08904j181j0692n0424j4220K7464M321j4528j2336j5372L500k2757k3414
10722G9265j4786j138L3456j1151l4319j6572j0481j0629j4215J4310K2927j977
10710C4690L172J3245p352j3907K1254K3996J7280k612J5953P682m281j7584k8440
10697F3096m471J0203n456k745K4509j903j5389k2618j996P402Q038q51j1562
10684D6257k7282j1913J5204O129K2226J2243R050J7648q890J2952J98J8347R259
$$ plain form
10671 121428 95127 46420 32678 10220 4534 15162 48149 51622 61651 82862 96623 108395
10659 108395 125401 111393 101018 98982 93327 100965 131726 140459 133187 134302 129208 141075 140084
10646 140084 116544 75358 86823 97012 97957 91260 114486 115491 136753 141308 174599 208398
10634 208398 190778 177716 191163 195790 202577 224516 227033 212555 211212 201195 188411 170580
10622 170580 166414 170864 164814 143473 125040 126796 122976 144695 143569 138987 142963 152898 185045
10609 185045 223290 249610 271117 290987 290656 257091 231214 226825 203906 194150 197607 219845
10597 219845 225056 219367 211604 215977 228323 228481 231909 242701 236422 258824 280965 268052 244928
10584 244928 249404 257459 268504 275678 287769 261578 245047 249666 253191 248112 252999 254660 248831
$$ packed form
10671A21428k6301m8707j3742k2458n686J0628L2987L473J0029K1211J3761J1772
10659A08395J7006j4008j0375k036n655P638L0761Q733p272J115n094J1867r91
10646A40084k3540m1186J1465J0189R45o697K3226J005K1262M555L3291L3799
10634B08398j7620j3062J3447M627O787K1939K517j4478j343j0017j2784j7831
10622A70580m166M450o050k1341j8433J756l820K1719j126m582L976R935L2147
10609A85045L8245K6320K1507J9870l31l3565k5877m389k2919r756L457K2238
10597B19845N211n689p763M373J2346J58L428J0792o279K2402K2141j2913k3124
10584B44928M476Q055J1045P174J2091k6191j6531M619L525n079M887J661n829
$$ plain form
10571 248831 245716 255057 264179 260420 271043 288464 282231 247674 261789 261727 268181 269870 291431
10558 291431 321286 349225 376533 376185 371741 405237 412752 421856 420711 438665 477156 471044 468171
10545 468171 471176 494912 542990 557471 559669 564339 566447 601393 640845 641459 658876 701992 739175
10532 739175 783042 821630 843979 868398 860835 858862 862617 871821 897161 944607 1017576 1113527
10520 1113527 1163876 1210830 1293221 1378102 1447647 1519287 1598008 1699570 1791261 1867517 1945093
10509 1945093 2046361 2178827 2379261 2575294 2816642 3061548 3329235 3711983 4211693
10500 4211693 4887104 5720450 6639347 7502204 8106230 8534300 9020356 9772338 10839102
10491 10839102 12295035 14315407 17231331 21380894 27265944 35666651 48225494 68053902
$$ packed form
10571B48831l115R341R122l759J0623J7421o233l4557J4115o2O454J689K1561
10558B91431K9855K7939K7308l48m444L3496P515R104j145J7954L8491o112k873
10545D68171L005K3736M8078J4481K198M670K108L4946L9452O14J7417M3116L7183
10532G39175M3867L8588K2349K4419p563j973L755R204K5340M7446P2969R5951
10520A113527N0349M6954Q2391Q4881O9545P1640P8721J01562R1691P6256P7576
10509A945093J01268J32466K00434J96033K41348K44906K67687L82748M99710
10500D211693O75411Q33346R18897Q62857O04026M28070M86056P51982J066764
10491A0839102J455933K020372K915924M149563N885050Q400707J2558843J9828408
$$ plain form
10483 68053902 100508665 153073771 227972496 300024151 315998341 264427262 188272620
10476 188272620 127483779 89094391 65589465 50476950 40150935 32723480 27074492
10469 27074492 22557225 18784488 15721296 13299311 11455248 10103092 9167424 8429756
10461 8429756 7651114 6792084 5939791 5220922 4655214 4185288 3755084 3418262 3128473
10452 3128473 2892992 2673637 2445752 2260369 2076923 1891779 1747857 1623647 1523798 1444322
10442 1444322 1383259 1331552 1299216 1230937 1129985 1040834 982844 943949 889245 853340 799827
10431 799827 728001 669325 640810 621670 608622 580251 544348 543135 550915 534979 510927 480623
10419 480623 456868 431435 421066 409578 392695 370330 373466 377051 353000 338830 313257 318869
$$ packed form
10483F8053902L2454763N2565106P4898725P2051655J5974190n1571079p6154642
10476A88272620o0788841l8389388k3504926j5112515j0326015p427455n648988
10469B7074492m517267l772737l063192k421985j844063j352156r35668p37668
10461H429756p78642q59030q52293p18869n65708m69926m30204l36822k89789
10452C128473k35481k19355k27885j85383j83446j85144j43922j24210r9849p9476
10442A444322o1063n1707l2336o8279j00952q9151n7990l8895n4704l5905n3513
10431G99827p1826n8676k8515j9140j3048k8371l5903j213P780j5936k4052l0304
10419D80623k3755k5433j0369j1488j6883k2365L136L585k4051j4170k5573N612
$$ plain form
10407 318869 333069 337190 337579 311878 309705 306807 285852 290436 284092 291464 286113 272258 268063
10394 268063 248371 245833 250059 241197 227832 221824 214124 225000 215481 207915 183999 161304 154216
10381 154216 159126 145447 139760 165440 179323 174181 185256 168846 131333 103724 89100 81261
10369 81261 106237 98552 78841 79502 88358 68236 68921 96877 123522 122322 104140 99922 124180
10356 124180 140497 158392 193204 226588 223151 233309 252893 246489 208684 175242 148559 158209
10344 158209 148336 137724 140909 147447 165245 154764 127664 104157 142991 175745 168565 140604
10332 140604 103397 82005 65089 45875 46709 51790 51606 39329 41652 74665 61256 47060 66266
10319 66266 75299 69337 79964 90982 67097 66966 76608 92605 93769 71009 29480 27720 21688
$$ packed form
10407C18869J4200M121L89k5701k173k898k0955M584o344P372n351j3855m195
10394B68063j9692k538M226q862j3365o008p700J0876r519p566k3916k2695p088
10381A54216M910j3679n687K5680J3883n142J1075j6410l7513k7609j4624p839
10369H1261K4976p685j9711O61Q856k0122O85K7956K6645j200j8182m218K4258
10356A24180J6317J7895L4812L3384l437J0158J9584o404l7805l3442k6683R650
10344A58209r873j0612L185O538J7798j0481k7100k3507L8834L2754p180k7961
10332A40604l7207k1392j6916j9214Q34N081j84j2277K323L3013j3409j4196J9206
10319F6266R033n962J0627J1018k3885j31R642J5997J164k2760m1529j760o032
$$ plain form
10306 21688 34594 43942 63186 85186 63835 31359 40095 52367 46324 40624 43722 64823 96412
10293 96412 108319 113084 128037 134553 112456 98145 85763 82446 89848 102848 114261 124473
10281 124473 121856 105182 94173 88068 104921 120829 117959 117264 114860 107189 105196 101942 109972
10268 109972 108507 100044 97172 119377 129084 122452 115049 77939 70493 84823 102171 82484 84272
10255 84272 109306 130799 131727 152380 162457 159518 152350 129289 107030 113653 115969 127885 122511
10242 122511 114585 97017 90495 106849 120264 129274 134924 108807 86466 78314 75126 77928 92180
10229 92180 133983 146855 156322 162624 165242 154679 134635 130855 137917 144166 118678 105670 102479
10216 102479 117794 127445 116986 106125 91539 73816 76324 87944 73424 79891 99326 121954
$$ packed form
10306B1688J2906R348J9244K2000k1351l2476Q736J2272o043n700L098K1101L1589
10293I6412J1907M765J4953O516k2097j4311j2382l317P402J3000J1413J0212
10281A24473k617j6674j1009o105J6853J5908k870o95k404p671j993l254Q030
10268A09972j465q463k872K2205R707o632p403l7110p446J4330J7348j9687J788
10255H4272K5034K1493R28K0653J0077k939p168k3061k2259O623K316J1916n374
10242A22511p926j7568o522J6354J3415R010N650k6117k2341q152l188K802J4252
10229I2180M1803J2872R467O302K618j0563k0044l780P062O249k5488j3008l191
10216A02479J5315R651j0459j0861j4586j7723K508J1620j4520O467J9435K2628
$$ plain form
10204 121954 119599 112897 107548 103379 122490 144140 126142 84445 86443 79657 90302 98161 103139
10191 103139 110704 129233 125853 115309 109113 103836 83805 81321 118327 143240 135902 131686 157101
10178 157101 164191 159933 139535 112890 130743 143134 138635 130829 128010 142530 176124 180361 149529
10165 149529 149327 161787 153422 163263 194522 198519 196773 181296 198422 199837 209279 230273 241707
10152 241707 252095 278042 276408 288203 309253 331278 348099 377972 412113 416540 459992 536482
10140 536482 589213 632261 701652 771728 836584 867593 919726 1027343 1172341 1376409 1665031
10129 1665031 2109563 2748642 3726570 5258326 7609278 10902349 14566558 17031376 16711139
10120 16711139 13879735 10303414 7359080 5322512 3970365 3106029 2513787 2077202
$$ packed form
10204A21954k355o702n349m169J9111K1650j7998m1697J998o786J0645P859M978
10191A03139P565J8529l380j0544o196n277k0031k484L7006K4913p338m216K5415
10178A57101P090m258k0398k6645J7853J2391m499p806k819J4520L3594M237l0832
10165A49529k02J2460q365R841L1259L997j746j5477J7126J415R442K0994J1434
10152B41707J0388K5947j634J1795K1050K2025J6821K9873L4141M427M3452P6490
10140E36482N2731M3048O9391P0076O4856L1009N2133J07617J44998K04068K88622
10129A665031M44532O39079R77928J531756K350952L293071L664209K464818l20237
10120A6711139k831404l576321k944334k036568j352147q64336n92242m36585
$$ plain form
10112 2077202 1759983 1503795 1263197 1091309 991309 889369 782330 715963 655918 591045
10102 591045 517504 459061 402223 341707 327280 319474 303940 297046 270040 246503 234999 243323
10090 243323 235009 219873 201101 202717 213882 207705 192954 169344 165047 154061 131626 134264
10078 134264 131114 154876 153372 129277 140392 133894 137549 135940 129358 120707 138036 138878 116012
10065 116012 145876 174332 203847 249711 311193 401525 540225 740848 1054635 1448715 1692813
10054 1692813 1560587 1237602 924862 659479 470217 371558 326615 331992 332822 301004 252632
10043 252632 194486 127634 105745 111197 116523 104287 94478 92040 64367 66601 76883 83766 83360
10030 83360 91647 86063 69922 46501 50713 87295 99824 108684 118621 109090 92174 73235 91643
$$ packed form
10112B077202l17219k56188k40598j71888j00000j01940j07039o6367o0045o4873
10102E91045p3541n8443n6838o0516j4427p806j5534o894k7006k3537j1504Q324
10090B43323q314j5136j8772J616J1165o177j4751k3610m297j0986k2435K638
10078A34264l150K3762j504k4095J1115o498L655j609o582q651J7329Q42k2866
10065A16012K9864K8456K9515M5864O1482R0332J38700K00623L13787L94080K44098
10054A692813j32226l22985l12740k65383j89262r8659m4943N377Q30l1818m8372
10043B52632n8146o6852k1889N452N326j2236r809k438k7673K234J0282O883m06
10030H3360Q287n584j6141k3421M212L6582J2529Q860R937r531j6916j8939J8408
$$ plain form
10017 91643 81749 57506 69017 69445 90289 102182 93021 82296 88692 110088 97489 85581 57552
10004 57552 41180 56985 87304 82974 69182 61668 58441 60070 71905 55621 59604 76348 91287
9991 91287 111612 113526 99242 94431 116906 125011 136079 150320 139756 141689 145683 165910 166956
9978 166956 132998 84902 78988 76276 78349 83633 105055 114121 104828 127575 155566 149927 134349
9965 134349 130292 156103 159589 134928 126392 145173 149627 145361 137529 133645 101654 86588 103342
9952 103342 102490 93042 113520 132862 127561 123439 140275 150483 175961 172831 179426 177384 167918
9939 167918 166612 159027 138895 139397 134442 154777 167701 166038 169381 141005 114007 111456 113443
9926 113443 117064 141563 172557 188574 211048 236886 242123 247496 263259 261615 261760 248697 244315
$$ packed form
10017I1643r894k4243J1511M28K0844J1893r161j0725O396K1396j2599j1908k8029
10004E7552j6372J5805L0319m330j3792p514l227J629J1835j6284L983J6744J4939
9991I1287K0325J914j4284m811K2475Q105J1068J4241j0564J933L994K0227J046
9978A66956l3958m8096n914k712K073N284K1422R066r293K2747K7991n639j5578
9965A34349m057K5811L486k4661q536J8781M454m266p832l884l1991j5066J6754
9952A03342q52r448K0478J9342n301m122J6836J0208K5478l130O595k042r466
9939A67918j306p585k0132N02m955K0335J2924j663L343k8376k6998k551J987
9926A13443L621K4499L0994J6017K2474K5838N237N373J5763j644J45j3063m382
$$ plain form
9913 244315 267985 267265 269534 271084 261080 244315 245795 270797 303754 316245 339604 354686 373908
9900 373908 379156 403617 459949 527178 585464 631986 716667 818007 947381 1133480 1344851
9889 1344851 1595274 1915299 2288438 2728891 3219109 3642712 3966244 4157054 4251689 4292840
9879 4292840 4336688 4485176 4749992 5093296 5380709 5404563 5124346 4612340 4078189 3691210
9869 3691210 3497854 3552551 3790284 4189122 4775502 5530820 6322849 7047568 7683670 8199398
9859 8199398 8543878 8630420 8644435 8783047 9134790 9587139 10016378 10315686 10355525 10173669
9849 10173669 9829159 9367222 8892920 8470966 8050076 7661126 7430283 7456547 7763992 8261023
9839 8261023 8845445 9410998 9858316 9981646 9723968 9148860 8485387 8010400 7930260 8233536
$$ packed form
9913B44315K3670p20K269J550j0004j6765J480K5002L2957J2491K3359J5082J9222
9900C73908N248K4461N6332O7229N8286M6522Q4681J01340J29374J86099K11371
9889A344851K50423L20025L73139M40453M90218M23603L23532J90810R4635M1151
9879D292840M3848J48488K64816L43304K87413K3854k80217n12006n34151l86979
9869C691210j93356N4697K37733L98838N86380P55318P92029P24719O36102N15728
9859H199398L44480Q6542J4015J38612L51743M52349M29239K99308L9839j81856
9849A0173669l44510m61937m74302m21954m20890l88950k30843K6264L07445M97031
9839H261023N84422N65553M47318J23330k57678n75108o63473m74987q0140L03276
$$ plain form
9829 8233536 8714766 9150074 9388397 9391304 9288977 9256768 9305831 9368888 9371635 9223284 8963387
9818 8963387 8760416 8784222 9009836 9220827 9270018 9171067 8972914 8573474 7886851 7054933
9808 7054933 6299358 5840522 5711724 5967449 6641011 7670000 8875906 10066669 11003622
9799 11003622 11497636 11468365 11115646 10802428 10694354 10732634 10912990 11300866 11813649 12173792
9789 12173792 12093343 11461841 10440988 9241868 8208729 7543560 7360447 7653864 8384976
9780 8384976 9489799 10831859 12105887 13028128 13579957 13894054 13987827 13820459 13545266
9771 13545266 13517461 13842043 14387463 14834686 15068209 15110691 15066896 15054610 15034479 14866606
9761 14866606 14416682 13702456 12977505 12519086 12569926 13163184 14123717 15025012 15484894 15319632
$$ packed form
9829H233536M81230M35308K38323K907j02327l2209M9063O3057K747j48351k59897
9818H963387k02971K3806K25614K10991M9191r8951j98153l99440o86623q31918
9808G054933p55575m58836j28798K55725O73562J028989J205906J190763R36953
9799A1003622M94014k9271l52719l13218j08074L8280J80356L87876N12783L60143
9789A2173792q0449o31502j020853j199120j033139o65169j83113K93417P31112
9780H384976J104823J342060J274028R22241N51829L14097R3773j67368k75193
9771A3545266k7805L24582N45420M47223K33523M2482m3795j2286k0131j67873
9761A4866606m49924p14226p24951m58419N0840N93258R60533R01295M59882j65262
$$ plain form
9751 15319632 14682224 13873176 13028437 12255208 11748205 11650397 11990699 12581558 13164654 13700627
9741 13700627 14250491 14837250 15361459 15707442 15753450 15419629 14818770 14159358 13622357 13361481
9731 13361481 13286808 13215147 12928976 12340705 11509263 10469154 9261061 7990716 6875142
9722 6875142 6082562 5623425 5462355 5635633 6162870 6887583 7567814 7958092 7937299 7584569
9712 7584569 7065648 6655603 6463663 6434495 6452113 6397180 6233354 5875407 5218925 4456563
9702 4456563 3744682 3122380 2588532 2117325 1763260 1504218 1293929 1122380 981356 874927
9692 874927 780002 691152 632817 577314 520394 468197 426860 425694 391638 345819 313553 306984
9680 306984 310877 291514 246244 227629 248679 258421 255684 239841 246246 262260 259146 263034 247576
$$ packed form
9751A5319632o37408q09048q44739p73229n07003r7808L40302N90859N83096N35973
9741A3700627N49864N86759N24209L45983M6008l33821o00859o59412n37001k60876
9731A3361481p4673p1661k86171n88271q31442j040109j208093j270345j115574
9722F875142p92580m59137j61070J73278N27237P24713O80231L90278k0793l52730
9712G584569n18921m10045j91940k9168J7618n4933j63826l57947o56482p62362
9702D456563p11881o22302n33848m71207l54065k59042k10289j71549j41024j06429
9692H74927r4925q8850n8335n5503n6920n2197m1337j166l4056m5819l2266o569
9680C06984L893j9363m5270j8615K1050R742k737j5843O405J6014l114L888j5458
$$ plain form
9667 247576 228771 208733 222776 226034 219197 201696 183846 183600 158112 169551 144586 128491
9655 128491 122953 122533 124207 145727 176624 157151 139877 143164 126447 138028 136739 137531 150164
9642 150164 129402 133954 140540 162437 159478 136351 135517 138569 150714 140508 120051 134745 126729
9629 126729 117901 102986 124315 148852 150914 151840 140229 106819 94229 98188 96372 80138 84785
9616 84785 83269 112593 137101 122159 100839 94634 107368 139106 160019 141596 130351 122176
9604 122176 121293 146706 158080 165825 156740 163449 147598 127458 125513 135483 142716 135615 143972 173510
9590 173510 162793 129070 144672 148270 144350 151964 156324 188288 195219 180803 167029 153173 172212
9577 172212 212951 233109 236728 226037 231061 226852 234438 220099 224138 235100 232370 248265 254129
$$ packed form
9667B47576j8805k0038J4043L258o837j7501j7850k46k5488J1439k4965j6095
9655A28491n538m20J674K1520L0897j9473j7274L287j6717J1581j289P92J2633
9642A50164k0762M552O586K1897k959k3127q34L052J2145j0206k0457J4694q016
9629A26729q828j4915K1329K4537K062R26j1611l3410j2590L959j816j6234M647
9616H4785j516K9324K4508j4942k1320o205J2734L1738K0913j8423j1245q175
9604A22176q83K5413J1374P745r085O709j5851k0140j945R970P233p101Q357K9538
9590A73510j0717l3723J5602L598l920P614M360L1964O931j4416j3774j3856J9039
9577A72212M0739K0158L619j0691N024m209P586j4339M039J0962k730J5895N864
$$ plain form
9564 254129 255562 289202 345110 388488 387465 373040 372530 409567 451359 499052 516913 564260
9552 564260 620181 707799 780894 841849 920701 1035238 1195678 1429822 1709341 2072917 2474285
9541 2474285 2976306 3633800 4568503 5830718 7407026 9065001 10357949 10918946 10776648
9532 10776648 10105764 8995279 7627216 6312703 5217027 4392983 3798541 3359555 3024429
9523 3024429 2814441 2714368 2701344 2790976 3000048 3340738 3857403 4527570 5399137 6478707
9513 6478707 7671063 8787673 9643241 10096179 10162685 9950535 9463713 8661294 7641458
9504 7641458 6573755 5601724 4814944 4200039 3757689 3472079 3296206 3251914 3307827 3480655
9494 3480655 3747568 4131299 4655367 5392041 6406306 7784722 9627700 11916825 14363859
$$ packed form
9564B54129J433L3640N5908M3378j023j4425n10L7037M1792M7693J7861M7347
9552E64260N5921Q7618P3095O0955P8852J14537J60440K34144K79519L63576M01368
9541B474285N02021O57494R34703J262215J576308J657975J292948N60997j42298
9532A0776648o70884j110485j368063j314513j095676q24044n94442m38986l35126
9523C024429k09988j00073j3024Q9632K09072L40690N16665O70167Q71567J079570
9513F478707J192356J116610Q55568M52938O6506k12150m86822q02419j019836
9504G641458j067703r72031p86780o14905m42350k85610j75873m4292N5913J72828
9494C480655K66913L83731N24068P36674J014265J378416J842978K289125K447034
$$ plain form
9485 14363859 16544656 18073694 18943796 19209741 18637966 17191514 15215749 13123276 11135002
9476 11135002 9399024 8034448 7072876 6407928 5921551 5604512 5495292 5619822 6024013
9467 6024013 6667049 7617865 8960053 10677812 12689954 14790598 16631591 17858840 18556177
9458 18556177 18972966 19200351 19043496 18408401 17404884 16232649 15048096 13887474 12718774
9449 12718774 11561015 10470000 9571677 8797535 8017801 7193220 6441311 5883702 5560924
9440 5560924 5533082 5724219 6116021 6767681 7651049 8724150 9889484 11070428 12166982
9431 12166982 12984979 13358631 13360242 13118948 12701889 12164994 11448185 10540804 9515921 8503822
9421 8503822 7577445 6728798 6039249 5578511 5314607 5265428 5483705 5983962 6767823 7738350
$$ packed form
9485A4363859K180797J529038Q70102K65945n71775j446452j975765k092473j988274
9476A1135002j735978j364576r61572o64948m86377l17039j09220J24530M04191
9467F024013O43036R50816J342188J717759K012142K100644J840993J227249O97337
9458A8556177M16789K27385j56855o35095j003517j172235j184553j160622j168700
9449A2718774j157759j091015q98323p74142p79734q24581p51909n57609l22778
9440E560924k7842J91137L91802O51660Q83368J073101J165334J180944J096554
9431A2166982Q17997L73652J611k41294m17059n36895p16809r07381j024883j012099
9421H503822r26377q48647o89549m60738k63904m9179K18277N00257P83861R70527
$$ plain form
9411 7738350 8731601 9588845 10288496 10986782 11786461 12602739 13269656 13752456 14074160 14305511
9401 14305511 14483441 14510959 14281300 13839732 13326180 12694739 11779453 10536806 9093032
9392 9093032 7747916 6571377 5597150 4862307 4340646 3982498 3761586 3722428 3826761
9383 3826761 4047488 4424133 4999008 5783443 6831308 8068241 9429350 10734387 11713324
9374 11713324 12118813 12004302 11487743 10617288 9373501 7887130 6413097 5210591 4325000
9365 4325000 3681679 3203519 2862008 2581334 2382256 2215248 2106918 2053846 2067150 2224452
9355 2224452 2477239 2814347 3274840 3855955 4543791 5225207 5777186 6108410 6283352 6309298
9345 6309298 6095568 5647849 4988986 4270005 3615659 3044207 2587401 2245319 2007092 1842428
$$ packed form
9411G738350R93251Q57244O99651O98286P99679Q16278O66917M82800L21704K31351
9401A4305511J77930K7518k29659m41568n13552o31441r15286j242647j443774
9392I093032j345116j176539r74227p34843n21661l58148k20912l9158J04333
9383C826761K20727L76645N74875P84435J047865J236933J361109J305037R78937
9374A1713324M05489j14511n16559q70455j243787j486371j474033j202506q85591
9365D325000o43321m78160l41511k80674j99078j67008j08330n3072J3304J57302
9355B224452K52787L37108M60493N81115O87836O81416N51979L31224J74942K5946
9345F309298k13730m47719o58863p18981o54346n71452m56806l42082k38227j64664
$$ plain form
9335 1842428 1733514 1681705 1673674 1744467 1906495 2154755 2522014 2988440 3614236 4425508
9325 4425508 5282771 5987378 6421645 6527086 6283330 5625685 4675794 3686142 2903539 2338549
9315 2338549 1933211 1634590 1413779 1222542 1062071 920585 796274 687252 610959 565470
9305 565470 513582 443624 406332 378874 360863 356707 349044 316944 278514 250384 237690 232914
9293 232914 234042 222797 176818 116295 101322 101082 111031 93581 95495 105796 106082 98119 92939
9280 92939 117867 121980 104028 89603 78357 74543 102043 108975 105879 129102 118385 111454 96545
9267 96545 85386 71487 66830 45373 44772 73304 61801 82354 91507 103873 95660 100760 106883
9254 106883 65302 49968 41046 40364 18062 20760 53379 65045 68913 85171 81203 48605 56557
$$ packed form
9335A842428j08914n1809q031P0793J62028K48260L67259M66426O25796Q11272
9325D425508Q57263P04607M34267J05441k43756o57645r49891r89652p82603n64990
9315B338549m05338k98621k20811j91237j60471j41486j24311j09022p6293m5489
9305E65470n1888o9958l7292k7458j8011m156p663l2100l8430k8130j2694m776
9293B32914J128j1245m5979o0523j4973k40R949j7450J914J0301K86p963n180
9280I2939K4928M113j7952j4425j1246l814K7500O932l096K3223j0717o931j4909
9267I6545j1159j3899m657k1457o01K8532j1503K0553R153J2366q213N100O123
9254A06883m1581j5334q922o82k2302K698L2619J1666L868J6258l968l2598P952
$$ plain form
9241 56557 61705 77487 96779 90869 102487 84351 68961 68222 50044 58525 81419 94858 92040
9228 92040 69928 59423 34728 30753 42542 71372 74664 68302 60676 67232 97734 90000 58329
9215 58329 55584 77076 83552 89258 93521 73025 67069 68487 67681 67846 48615 49393 64138 72791
9201 72791 55984 49913 66781 69489 95557 85474 67845 53713 43755 62960 70776 57053 34254
9188 34254 5191 43706 71999 66156 70901 89424 99746 117483 120612 109182 63583 75003
9176 75003 107041 112828 130740 121654 88479 70091 80438 71528 80116 92430 80704 79479 80004
9163 80004 77247 78896 94408 95812 102328 80967 53523 63386 79793 83571 86149 89872 64850
9150 64850 65602 84624 98273 63847 64667 86430 95874 54701 36335 50206 66897 75217 70229
$$ packed form
9241E6557N148J5782J9292n910J1618j8136j5390p39j8178Q481K2894J3439k818
9228I2040k2112j0505k4695l975J1789K8830L292o362p626O556L0502p734l1671
9215E8329k745K1492O476N706M263k0496n956J418q06J65j9231P78J4745Q653
9201G2791j6807o071J6868K708K6068j0083j7629j4132r958J9205P816j3723k2799
9188C4254k9063L8515K8293n843M745J8523J0322J7737L129j1430m5599J1420
9176G5003L2038N787J7912r086l3175j8388J0347q910Q588J2314j1726j225N25
9163H0004k757J649J5512J404O516k1361k7444R863J6407L778K578L723k5022
9150F4850P52J9022J3649l4426Q20K1763R444m1173j8366J3871J6691Q320m988
$$ plain form
9137 70229 71356 61348 71337 70716 49830 59542 56618 60579 64282 95468 113273 113167 118395 121091
9123 121091 117109 121321 111140 90815 85853 101926 109102 93589 76192 66554 86190 76687 67825
9110 67825 55505 62347 84066 80203 89618 89821 86869 94725 90477 105470 121091 129243 130195 149648
9096 149648 145731 153282 119954 94800 83760 91284 86449 99797 110778 107962 98765 87492 100527
9083 100527 95069 63008 62996 82853 69557 47404 61722 97751 139425 170948 200279 214406
9071 214406 194339 166020 168565 158268 151007 128491 104035 98943 109996 115450 128212 136489 141464
9058 141464 157628 135384 120666 145638 139707 138390 129903 137152 147098 149414 168712 182669 193656
9045 193656 238804 254259 223222 207171 185826 188683 189374 180017 164424 153601 173454 191453
$$ packed form
9137G0229J127j0008R989o21k0886R712k924L961L703L1186J7805j06N228K696
9123A21091l982M212j0181k0325m962J6073P176j5513j7397r638J9636r503q862
9110F7825j2320O842K1719l863R415K03k952P856m248J4993J5621Q152R52J9453
9096A49648l917P551l3328k5154j1040P524m835J3348J0981k816r197j1273J3035
9083A00527n458l2061j2J9857j3296k2153J4318L6029M1674L1523K9331J4127
9071B14406k0067k8319K545j0297p261k2516k4456n092J1053N454J2762Q277M975
9058A41464J6164k2244j4718K4972n931j317q487P249R946K316J9298J3957J0987
9045A93656M5148J5455l1037j6051k1345K857O91r357j5593j0823J9853J7999
$$ plain form
9033 191453 152866 112711 82365 85096 98517 110191 105421 92290 86811 90680 108657 136073
9021 136073 149295 143049 147014 144074 154877 170588 195774 193368 187422 169036 179252 156855 154375
9008 154375 165512 173434 153977 163667 173880 173958 166090 169213 177123 181710 176240 169221 184738 222686
8994 222686 231158 225618 235159 211343 200835 196601 192028 205858 200898 200524 190521 192608 197092 194261
8980 194261 187490 173102 153892 150822 164472 174509 144202 142565 131694 115144 137840 159002
8968 159002 143801 167789 183345 187967 213400 241596 248273 249860 249992 237567 205769 194873 194994
8955 194994 199976 200901 193071 178097 161679 134257 129162 135531 131234 147876 161099 152517 166396
8942 166396 182988 188798 185772 160604 197038 234626 208607 199135 208481 188400 188688 205544 192221
$$ packed form
9033A91453l8587m0155l0346K731J3421J1674m770j3131n479L869J7977K7416
9021A36073J3222o246L965k940J0803J5711K5186k406n946j8386J0216k2397k480
9008A54375J1137P922j9457R690J0213P8p868L123P910M587n470p019J5517L7948
8994B22686Q472n540R541k3816j0508m234m573J3830m960l74j0003K087M484k831
8980A94261o771j4388j9210l070J3650J0037l0307j637j0871j6550K2696K1162
8968A59002j5201K3988J5556M622K5433K8196O677J587J32j2425l1798j0896J21
8955A94994M982R25p830j4974j6418k7422n095O369m297J6642J3223q582J3879
8942A66396J6592N810l026k5168L6434L7588k6019r472R346k0081K88J6856j3323
$$ plain form
8929 192221 165548 187620 202244 184115 179067 168476 178578 192969 183569 185522 193139 203916
8917 203916 202682 219426 227436 215705 215929 221546 235799 239821 238050 234142 233002 226759 227563 219532
8903 219532 214152 231628 243136 234966 231562 249637 259198 250286 232853 222702 226588 226489 231947 234562
8889 234562 232867 252660 251784 241891 240261 219965 221182 234791 238355 250650 246537 242773 227710
8876 227710 231463 247621 269677 277594 253177 238502 229383 234981 261646 284450 325584 338450
8864 338450 353673 353905 335930 322232 293545 276654 278583 278654 285632 306180 315024 330794 323218
8851 323218 283188 283301 298718 302786 288023 278019 276190 269947 289401 291303 313220 321916 315649
8838 315649 324608 347444 353874 350288 340814 346743 347246 372125 407592 397170 353033 318126 326214
$$ packed form
8929A92221k6673K2072J4624j8129n048j0591J0102J4391r400J953P617J0777
8917B03916j234J6744Q010j1731K24N617J4253M022j771l908j140o243Q04q031
8903B19532n380J7476J1508q170l404J8075R561q912j7433j0151L886r9N458K615
8889B34562j695J9793q76r893j630k0296J217J3609L564J2295m113l764j5063
8876B27710L753J6158K2056P917k4417j4675r119N598K6665K2804M1134J2866
8864C38450J5223K32j7975j3698k8687j6891J929P1O978K0548Q844J5770p576
8851C23218m0030J13J5417M068j4763j0004j829o243J9454J902K1917Q696o267
8838C15649Q959K2836O430l586r474N929N03K4879L5467j0422m4137l4907Q088
$$ plain form
8825 326214 348695 386113 393319 366379 349000 338954 353818 357200 339576 336352 351094 367873
8813 367873 382630 404558 417186 423446 419201 421855 442821 457686 477863 473579 491394 474163
8801 474163 455945 458359 459405 466671 470186 468290 475391 477658 458350 466363 476739 497080 499699
8788 499699 491937 479330 483310 488126 501558 528100 532361 545267 533415 532133 527509 524624 532074
8775 532074 530521 546431 555387 567692 594146 598778 590765 594861 620770 628528 629809 634735 636166
8762 636166 640028 653458 661085 665749 690476 738491 748799 741328 739440 740995 752783 772138 772372
8749 772372 762847 766698 782140 775242 792425 835345 850627 821093 813552 820272 831635 844112 859005
8736 859005 852783 851011 869877 881540 886959 882557 916070 944399 952884 965794 988628 1002722 1021218
$$ packed form
8825C26214K2481L7418P206k6940j7379j0046J4864L382j7624l224J4742J6779
8813C67873J4757K1928J2628O260m245K654K0966J4865K0177m284J7815j7231
8801D74163j8218K414J046P266L515j896P101K267j9308Q013J0376K0341K619
8788D99699p762j2607L980M816J3432K6542M261J2906j1852j282m624k885P450
8775E32074j553J5910Q956J2305K6454M632q013M096K5909P758J281M926J431
8762F36166L862J3430P627M664K4727M8015J0308p471j888J555J1788J9355K34
8749G72372r525L851J5442o898J7183M2920J5282k9534p541O720J1363J2477J4893
8736H59005o222j772J8866J1663N419m402L3513K8329Q485J2910K2834J4094J8496
$$ plain form
8723 1021218 1050177 1052867 1057671 1025401 1043810 1091477 1128888 1149015 1182669 1221255 1241852 1241114
8711 1241114 1265551 1289049 1274194 1280562 1298510 1316894 1329636 1335069 1326754 1327439 1373613 1404259
8699 1404259 1450092 1484799 1504411 1514092 1515447 1549090 1592049 1620755 1625269 1640530 1657359 1671495
8687 1671495 1692901 1722246 1738867 1774464 1842146 1879648 1893085 1911563 1914862 1945240 1979950 2003933
8675 2003933 2041898 2065205 2108708 2156231 2189199 2225855 2265013 2295867 2329887 2377012 2416432
8664 2416432 2481154 2501319 2532013 2568408 2636621 2691139 2716545 2741954 2804299 2841469 2882012
8653 2882012 2943358 3023721 3056122 3093895 3138571 3185700 3265884 3341009 3412936 3469671 3524954
8642 3524954 3600371 3675382 3726838 3782401 3832317 3888318 3922325 3942930 4002328 4065804 4127395
$$ packed form
8723A021218K8959K690M804l2270J8409M7667L7411K0127L3654L8586K0597p38
8711A241114K4437K3498j4855O368J7948J8384J2742N433q315O85M6174L0646
8699A404259M5833L4707J9612R681J355L3643M2959K8706M514J5261J6829J4136
8687A671495K1406K9345J6621L5597O7682L7502J3437J8478L299L0378L4710K3983
8675B003933L7965K3307M3503M7523L2968L6656L9158L0854L4020M7125L9420
8664B416432O4722K0165L0694L6395O8213N4518K5406K5409O2345L7170M0543
8653B882012O1346Q0363L2401L7773M4676M7129Q0184P5125P1927N6735N5283
8642C524954P5417P5011N1456N5563M9916N6001L4007K0605N9398O3476O1591
$$ plain form
8631 4127395 4204457 4259793 4302900 4385821 4461059 4516863 4559089 4604005 4673814 4734545 4794337
8620 4794337 4850731 4925907 4993183 5054188 5102349 5124902 5168706 5236043 5291081 5346967 5413826
8609 5413826 5461416 5492900 5502140 5513358 5542305 5575256 5599860 5626661 5634268 5628733 5632156 5632521 5628632
8596 5628632 5630192 5670173 5679035 5681435 5668752 5633932 5589603 5553640 5564101 5540739 5500697 5454364
8584 5454364 5394468 5351340 5317628 5282784 5260318 5226693 5180280 5121676 5072718 5000823 4941723
8573 4941723 4891522 4844004 4807174 4746067 4666735 4599462 4556156 4494416 4424543 4361602 4314446
8562 4314446 4269259 4211144 4145988 4081322 4006691 3950275 3896203 3850090 3785121 3716666 3648753
8551 3648753 3581206 3525597 3498369 3430711 3356483 3308387 3254281 3175593 3105082 3052762 3003177
$$ packed form
8631D127395P7062N5336M3107Q2921P5238N5804M2226M4916O9809O0731N9792
8620D794337N6394P5176O7276O1005M8161K2553M3804O7337N5038N5886O6859
8609E413826M7590L1484R240J1218K8947L2951K4604K6801P607n535L423L65l889
8596E628632J560L9981Q862K400j2683l4820m4329l5963J0461k3362m0042m6333
8584E454364n9896m3128l3712l4844k2466l3625m6413n8604m8958p1895n9100
8573D941723n0201m7518l6830o1107p9332o7273m3306o1740o9873o2941m7156
8562D314446m5187n8115o5156o4666p4631n6416n4072m6113o4969o8455o7913
8551C648753o7547n5609k7228o7658p4228m8096n4106p8688p0511n2320m9585
$$ plain form
8540 3003177 2955044 2882011 2837784 2831726 2791537 2744350 2718008 2697775 2657066 2605406 2558818 2515232
8528 2515232 2471558 2442235 2402810 2358683 2308414 2267697 2210059 2164743 2118900 2107170 2098320 2064824
8516 2064824 2025531 1989011 1941823 1878790 1854611 1841074 1788289 1751825 1728897 1708535 1714630 1708859
8504 1708859 1656684 1630701 1605666 1586636 1566580 1521824 1462413 1449263 1435868 1419590 1382784
8493 1382784 1356383 1350331 1339841 1334989 1329521 1309396 1294368 1276495 1256308 1216157 1185249 1155345
8481 1155345 1139647 1125160 1116120 1077445 1071599 1045443 1019792 992542 990186 1006266 1019974 1018326
8469 1018326 994458 966069 969908 961505 945383 947793 927787 899274 898118 887586 853846 833096
8457 833096 842465 830467 814368 805795 833442 843104 842271 805373 758615 751889 742011 753522 778156
$$ packed form
8540C003177m8133p3033m4227o058m0189m7187k6342k0233m0709n1660m6588m3586
8528B515232m3674k9323l9425m4127n0269m0717n7638m5316m5843j1730q850l3496
8516B064824l9293l6520m7188o3033k4179j3537n2785l6464k2928k0362O095n771
8504A708859n2175k5983k5035j9030k0056m4756n9411j3150j3395j6278l6806
8493A382784k6401o052j0490m852n468k0125j5028j7873k0187m0151l0908k9904
8481A155345j5698j4487r040l8675n846k6156k5651k7250k356J6080J3708j648
8469A018326k3868k8389L839q403j6122K410k0006k8513j156j0532l3740k0750
8457H33096R369j1998j6099q573K7647R662q33l6898m6758o726r878J1511K4634
$$ plain form
8444 778156 750441 713909 696776 659987 645723 640984 639667 664575 678692 664333 637663 623259
8432 623259 629556 619498 610774 617921 614850 599498 606418 630251 615575 594371 573761 571874 574002
8419 574002 553672 528609 517239 515178 521250 515815 504089 493702 487356 475645 457899 460574 456772
8406 456772 452719 438323 439314 441871 436013 417073 421702 439529 437161 432638 414471 403816 410169
8393 410169 417264 424021 411313 393533 387053 405169 409155 408884 412546 406844 412806 406116 369906 354721
8379 354721 352940 361042 375236 360211 346617 317056 302056 302482 298633 279131 277954 290432 318846
8366 318846 321829 331792 328620 305761 307575 315998 325193 312248 295020 293248 302841 301532 261271
8353 261271 246449 262595 274896 280985 277539 276433 242410 232799 258880 262995 258390 280104 291772
$$ packed form
8444G78156k7715l6532j7133l6789j4264m739j317K4908J4117j4359k6670j4404
8432F23259O297j0058q724P147l071j5352O920K3833j4676k1204k0610j887K128
8419E74002k0330k5063j1370k061O072n435j1726j0387o346j1711j7746K675l802
8406D56772m053j4396R91K557n858j8940M629J7827k368m523j8167j0655O353
8393D10169P095O757j2708j7780o480J8116L986k71L662n702N962o690l6210j5185
8379C54721j781Q102J4194j5025j3594k9561j5000M26l849j9502j177J2478K8414
8366C18846K983R963l172k2859J814Q423R195j2945j7228j772R593j309m0261
8353B61271j4822J6146J2301O089l446j106l4023r611K6081M115m605K1714J1668
$$ plain form
8340 291772 290845 265643 248829 263870 276119 292379 272485 242626 214824 243356 266560 263560
8328 263560 243777 221557 212529 208012 187378 175941 227635 234753 214146 180906 171133 170538 196740
8315 196740 216837 223878 224559 233035 237858 223767 220549 200695 180986 187751 214367 220840 223295
8302 223295 248292 258607 256410 258467 232670 191313 170915 171139 179070 202066 190812 181425 182666
8289 182666 209494 226294 180977 195800 202805 202305 158763 143141 149114 169632 169304 163228 164162
8276 164162 147065 149867 150454 130261 115155 97330 97548 92087 111397 138476 137424 135420 147205
8263 147205 154023 167038 166953 170836 190355 201124 165789 153163 159951 159305 154342 152476 138246 146286
8249 146286 130069 106855 130298 125755 112998 120338 116770 125508 127679 142207 143425 136235 125030
$$ packed form
8340B91772r27k5202j6814J5041J2249J6260j9894k9859k7802K8532K3204l000
8328B63560j9783k2220r028m517k0634j1437N1694P118k0607l3240r773n95K6202
8315A96740K0097P041O81Q476M823j4091l218j9854j9709O765K6616O473K455
8302B23295K4997J0315k197K057k5797m1357k0398K24P931K2996j1254r387J241
8289A82666K6828J6800m5317J4823P005n00m3542j5622N973K0518l28o076R34
8276A64162j7097K802N87k0193j5106j7825K18n461J9310K7079j052k004J1785
8263A47205O818J3015q5L883J9519J0769l5335j2626O788o46m963j866j4230Q040
8249A46286j6217k3214K3443m543j2757P340l568Q738K171J4528J218p190j1205
$$ plain form
8236 125030 110136 114899 115730 135258 142968 143538 117451 104170 117079 125614 139268 151252 143900
8223 143900 138687 137252 142672 133801 103942 109046 114188 113096 117083 101896 73115 92641 110064
8210 110064 115155 112029 116177 94919 77999 103098 115606 109523 116818 111928 124760 121267 109321
8197 109321 93329 100827 102641 123899 115556 82479 89364 99624 118512 112792 103505 84658 63485
8184 63485 47798 61990 73670 91174 105904 102853 98286 93651 74918 69955 70325 73271 79405
8171 79405 60761 62802 85399 105471 81038 70491 74351 71082 87121 72852 71017 69014 64138
8158 64138 88482 103182 117944 115069 91730 64805 88182 106881 100260 113067 107413 87790
8146 87790 68242 53204 61093 67611 54822 52836 71318 57738 64246 40502 41615 30921 25631
$$ packed form
8236A25030j4894M763Q31J9528P710N70k6087j3281J2909Q535J3654J1984p352
8223A43900n213j435N420q871k9859N104N142j092L987j5187k8781J9526J7423
8210A10064N091l126M148k1258j6920K5099J2508o083P295m890J2832l493j1946
8197A09321j5992P498J814K1258q343l3077O885J0260J8888n720r287j8847k1173
8184F3485j5687J4192J1680J7504J4730l051m567m635j8733m963L70K946O134
8171G9405j8644K041K2597K0072k4433j0547L860l269J6039j4269j835k003m876
8158F4138K4344J4700J4762k875k3339k6925K3377J8699o621J2807n654j9623
8146H7790j9548j5038P889O518j2789j986J8482j3580O508k3744J113j0694n290
$$ plain form
8133 25631 3203 628 27650 28364 29632 25030 35155 60234 76364 70863 56335 49756 38852
8120 38852 34616 28687 50761 63529 66644 65431 57406 57892 47553 65533 68637 60668 74917 78119
8106 78119 59037 54340 67196 48440 27169 38422 66674 69509 67045 61147 46128 38054 44406
8093 44406 49691 68667 65543 50649 60061 63147 80144 97516 107524 98262 62738 53857 66059
8080 66059 50298 22053 18871 11595 -7929 -6304 19006 44599 51893 38384 26240 8229 -19070
8067 -19070 19978 38098 61110 75711 80151 61163 37312 14841 23588 23864 24200 37731 46507
8054 46507 51080 55885 42980 31499 31978 27468 4798 8426 25053 71070 62431 36757 14754
8041 14754 3446 42602 58229 37189 19965 43811 30451 11960 9465 28661 43884 44969
$$ packed form
8133B5631k2428k575K7022P14J268m602J0125K5079J6130n501j4528o579j0904
8120C8852m236n929K2074J2768L115j213q025M86j0339J7980L104p969J4249L202
8106G8119j9082m697J2856j8756k1271J1253K8252K835k464n898j5019q074O352
8093D4406N285J8976l124j4894R412L086J6997J7372J0008r262l5524q881J2202
8080F6059j5761k8245l182p276j9524J625K5310K5593P294j3509j2144j8011k7299
8067a9070L9048J8120K3012J4601M440j8988k3851k2471Q747K76L36J3531Q776
8054D6507M573M805j2905j1481M79m510k2670L628J6627M6017q639k5674k2003
8041A4754j1308L9156J5627k1040j7224K3846j3360j8491k495J9196J5223J085
$$ plain form
8029 44969 66661 61157 34426 39984 43118 49980 38613 24183 19962 21428 20976 1519 6884 36741
8015 36741 42982 49475 59255 49965 55885 48078 54888 75225 62115 58967 67800 70631 84412 77655
8001 77655 62996 79308 75966 51139 57335 69987 47074 48593 75067 75816 50829 42656 22862
7988 22862 19811 27739 10393 29591 41197 32240 16245 15835 26851 19789 29558 24442 38151
7975 38151 62113 55077 62676 58681 51305 27849 20944 21539 13169 10482 5437 24296 38588 58634
7961 58634 71638 90441 82655 74559 65862 55587 62138 80003 55502 37497 27901 19862 51996
7948 51996 77387 65793 43713 55266 52549 39037 54616 63089 69593 64417 39784 39425 55636
7935 55636 54622 53392 42212 40836 37189 44761 42310 31694 45951 41209 52188 62943 57862
$$ packed form
8029D4969K1692n504k6731N558L134O862j1367j4430m221J466m52j9457N365K9857
8015C6741O241O493R780r290N920p807O810K0337j3110l148Q833K831J3781o757
8001G7655j4659J6312l342k4827O196J2652k2913J519K6474P49k4987q173j9794
7988B2862l051P928j7346J9198J1606q957j5995m10J1016p062R769n116J3709
7975C8151K3962p036P599l995p376k3456o905N95q370k687n045J8859J4292K0046
7961E8634J3004J8803p786q096q697j0275O551J7865k4501j8005r596q039L2134
7948E1996K5391j1594k2080J1553k717j3512J5579Q473O504n176k4633l59J6211
7935E5636j014j230j1180j376l647P572k451j0616J4257m742J0979J0755n081
$$ plain form
7922 57862 43055 23771 24067 26158 47706 41209 28333 36801 51260 64621 65233 57262 71340
7909 71340 72951 60296 40675 49564 53915 57242 69028 53983 47965 47251 56421 67816 46477
7896 46477 49370 50909 28409 9743 14931 -10901 -6047 27964 46782 74653 83520 75314 60984
7883 60984 48239 28129 2577 -15420 -11886 428 21181 22971 40207 37462 43277 45010 20346
7870 20346 35413 31243 42399 21631 13886 21729 26675 24517 23709 11446 19865 32530 35495 18382
7856 18382 6467 -4087 18805 32987 18064 32136 30974 34932 33299 15596 3783 8179 17689
7843 17689 38657 48762 16440 12565 16298 16397 8095 -11271 -13001 -15003 10847 27681 26338 24668
7829 24668 5964 -2810 -231 -6888 -2350 -10407 -3982 7171 2774 1427 -5642 -8900 -30466 -21675
$$ packed form
7922E7862j4807j9284K96K091K1548o497j2876Q468J4459J3361O12p971J4078
7909G1340J611j2655j9621Q889M351L327J1786j5045o018p14R170J1395k1339
7896D6477K893J539k2500j8666N188k5832M854L4011J8818K7871Q867q206j4330
7883F0984j2745k0110k5552j7997L534J2314K0753J790J7236k745N815J733k4664
7870B0346J5067m170J1156k0768p745P843M946k158q08j2263Q419J2665K965j7113
7856A8382j1915j0554K2892J4182j4923J4072j162L958j633j7703j1813M396R510
7843A7689K0968J0105l2322l875L733R9q302j9366j730k002K5850J6834j343j670
7829B4668j8704q774K579o657M538q057O425J1153m397j347p069l258k1566Q791
$$ plain form
7815 -21675 -8254 -2993 -7580 678 -711 8740 -3100 16623 7682 2814 -4550 14416 48982
7802 48982 50384 38734 16268 -4837 -5720 1895 3337 4094 17644 28638 27336 22014 -9777 5840
7788 5840 21004 29044 21897 5816 15764 20731 26200 15272 9914 28201 11040 -9012 -14561
7775 -14561 -18925 -9807 9189 10301 -844 -27930 -41460 -43146 -34176 -6584 15397 31967 38331
7762 38331 35385 39136 48486 29798 21314 20340 5772 -268 8734 35130 28439 18664 25152 27257
7748 27257 32831 30800 18341 16093 1854 -14961 -12369 5567 16105 -10398 -12291 -4406 -24643
7735 -24643 -35384 -12124 -9816 -3975 9711 11300 19785 2782 -4765 -4042 -24546 -4156 8513
7722 8513 20236 31779 21490 8819 25195 45082 41136 25081 8013 54 5881 3272 -8848
$$ packed form
7815b1675J3421N261m587Q258j389R451j1840J9723q941m868p364J8966L4566
7802D8982J402j1650k2466k1105q83P615J442P57J3550J0994j302n322l1791J5617
7788E840J5164Q040p147j6081R948M967N469j0928n358J8287j7161k0052n549
7775a4561m364R118J8996J112j1145k7086j3530j686Q970K7592K1981J6570O364
7762C8331k946L751R350j8688q484r74j4568o040R002K6396o691r775O488K105
7748B7257N574k031j2459k248j4239j6815K592J7936J0538k6503j893P885k0237
7735b4643j0741K3260K308N841J3686J589Q485j7003p547P23k0504K0390J2669
7722H513J1723J1543j0289j2671J6376J9887l946j6055j7068p959N827k609j2120
$$ plain form
7709 -8848 -18362 -10581 7298 3239 5927 24759 18742 -22469 -43221 -44239 -26237 -38501 -53374
7696 -53374 -28235 8971 15434 25353 15782 -15988 -28688 -12263 -1869 3801 4213 9997 2875
7683 2875 -16908 -34896 -34180 -28382 -12116 4579 -6184 -36978 -50887 -50175 -30330 -10994 -4295
7670 -4295 -10677 -18395 -22445 -27775 -45158 -30752 -14712 -14686 -11151 -7729 1055 2356 -1233 714 19166
7655 19166 27638 6636 64 11140 16151 19891 2840 -28787 -23875 -17756 -9207 -4363 2875 -4747
7641 -4747 -13821 -6193 27150 53794 26516 -3118 5675 31713 31504 2373 -19700 -2827 12108
7628 12108 -6371 11404 25731 27895 26951 23882 20984 7881 -23415 -35966 -8465 11804 29190
7615 29190 19070 19593 21985 25580 33020 17840 3887 5747 5907 -5960 -4212 19145 37451 33392
$$ packed form
7709h848r514P781J7879m059K688J8832o017m1211k0752j018J8002j2264j4873
7696e3374K5139L7206O463R919r571l1770j2700J6425J0394N670M12N784p122
7683B875j9783j7988P16N798J6266J6695j0763l0794j3909P12J9845J9336O699
7670d295o382p718m050n330j7383J4406J6040K6L535L422Q784J301l589J947J8452
7655A9166Q472k1002o572J1076N011L740j7051l1627M912O119Q549M844P238p622
7641d747r074P628L3343K6644k7278k9634Q793K6038k09k9131k2073J6873J4935
7628A2108j8479J7775J4327K164r44l069k898j3103l1296j2551K7501K0269J7386
7615B9190j0120N23K392L595P440j5180j3953J860J60j1867J748K3357J8306m059
$$ plain form
7601 33392 17462 -4443 -991 398 -3484 -16767 -25045 -5671 -2103 -13380 -8082 -4933 13264
7588 13264 6174 -14801 -21930 -20415 -5477 1886 -26284 -11828 21683 25031 11376 -12980 -4763
7575 -4763 11952 15923 26224 40419 22326 6196 -2637 -19917 -22675 -15613 18340 33125 -11240
7562 -11240 -27381 -22480 -1418 -6555 2550 -3311 -13785 5675 30063 28435 7730 -29285 -43026
7549 -43026 -38985 -43723 -42425 -14882 8158 -7003 9529 8610 -26349 -26948 -10163 16346 14546
7536 14546 -5457 -7265 -12564 -31441 -28371 -2195 4485 -5800 -2908 -6254 -4232 4342 20951
7523 20951 19794 35187 744 -9389 -8278 -7694 -15261 -8914 -23934 -32019 -18333 -10768 -2544 21432
7509 21432 53110 48041 48169 39369 32513 17568 15558 9323 -8790 -23007 -22425 -34861 -42729 -19743
$$ packed form
7601C3392j5930k1905L452J389l882j3283q278J9374L568j1277N298L149J8197
7588A3264p090k0975p129J515J4938P363k8170J4456L3511L348j3655k4356Q217
7575d763J6715L971J0301J4195j8093j6130q833j7280k758P062L3953J4785m4365
7562a1240j6141M901K1062n137R105n861j0474J9460K4388j628k0705l7015j3741
7549d3026M041m738J298K7543K3040j5161J6532r19l4959n99J6785K6509j800
7536A4546k0003j808n299j8877L070K6176O680j0285K892l346K022Q574J6609
7523B0951j157J5393l4443j0133J111N84p567O347j5020q085J3686P565Q224K3976
7509B1432L1678n069J28q800o856j4945k010o235j8113j4217N82j2436p868K2986
$$ plain form
7495 -19743 -27141 -38485 -43911 -39953 -15814 -627 15141 2060 8212 20142 11098 12136 20439
7482 20439 18049 -12331 -23738 -34667 -14455 -16347 -37470 -16064 -8124 -1071 -1688 -20357 -1447
7469 -1447 31383 22940 20815 5469 -11182 9521 -2715 6965 -12456 -1081 22227 7546 -13693
7456 -13693 -23849 -16332 -5094 16231 2493 -28100 -52464 -36311 -20901 -38773 -43848 -13926
7444 -13926 2827 19562 32724 49280 41708 12343 -23642 -34573 -31258 -18797 -17067 -8151 -14487
7431 -14487 -22001 -17056 -29749 -7614 2577 -6044 -24280 -13063 -7864 -25058 -23935 -4030 -9877
7418 -9877 -21521 -21769 -7916 17880 23559 17593 27167 50173 44295 11075 -26488 -45792 -45626 -43379
7404 -43379 -32631 -19419 -9944 2286 5336 17503 9880 13293 6640 -7828 -15814 -16002 -9693 -7699
$$ packed form
7495a9743p398j1344n426L958K4139J5187J5768j3081O152J1930r044J038Q303
7482B0439k390l0380j1407j0929K0212j892k1123K1406P940P053o17j8669J8910
7469a447L2830q443k125j5346j6651K0703j2236R680j9421J1375K3308j4681k1239
7456a3693j0156P517J1238K1325j3738l0593k4364J6153J5410j7872n075K9922
7444a3926J6753J6735J3162J6556p572k9365l5985j0931L315J2461J730Q916o336
7431a4487p514M945j2693K2135J0191q621j8236J1217N199j7194J123J9905n847
7418i877j1644k48J3853K5796N679n966R574K3006n878l3220l7563j9304J66K247
7404d3379J0748J3212R475J2230L050J2167p623L413o653j4468p986j88O309J994
$$ plain form
7390 -7699 -14423 -10078 4855 7088 5237 -6123 -14840 -23217 -27502 -18322 -22580 -20810 -33868 -38668
7376 -38668 -37823 -23615 -24526 -18368 -26816 -27397 -25167 -33884 -51520 -30269 -33765 -29583 -14729 -22103
7362 -22103 -20463 -13554 -12222 -18627 -2779 -1552 -14087 -15686 -7855 -10045 -10099 -13932 1875 -164
7348 -164 -12292 17458 15897 13873 5431 5461 19880 33526 44709 34624 6245 733 22260 13840
7334 13840 6334 3533 -16180 -41662 -24684 11856 40351 59637 36626 705 -17958 -17061 -28031
7321 -28031 -35188 -29010 -6962 16560 29733 16587 -11362 -42311 -34940 -12574 6415 21244
7309 21244 21021 -19330 -31074 -11715 11860 19382 34947 40822 28025 17568 3570 1805 6530
7296 6530 6842 15864 16878 22513 2844 -19233 -8006 5069 -5582 -16644 -16738 -5957 7682 24029
$$ packed form
7390g699o724M345J4933K233j851j1360q717q377m285R180m258J770j3058m800
7376c8668Q45J4208r11O158q448n81K230q717j7636K1251l496M182J4854p374
7362b2103J640O909J332o405J5848J227j2535j599P831k190n4l833J5807k039
7348a64j2128K9750j561k024q442L0J4419J3646J1183j0085k8379n512K1527q420
7334A3840p506k801j9713k5482J6978L6540K8495J9286k3011l5921j8663Q97j0970
7321b8031p157O178K2048K3522J3173j3146k7949l0949P371K2366J8989J4829
7309B1244k23m0351j1744J9359K3575P522J5565N875j2797j0457j3998j765M725
7296F530L12R022J014N635j9669k2077J1227J3075j0651j1062r4J0781J3639J6347
$$ plain form
7282 24029 26868 562 -17105 -19823 -42231 -53713 -38720 -16854 -10706 -26486 -34088 -35991 -36030
7269 -36030 -23154 -5775 -7577 -12304 -19768 -9934 39182 44633 40120 52990 55985 56991 32162
7256 32162 -8830 -30635 -35365 -36292 -32955 -36272 -31285 -24337 -8421 -18498 -25422 -18842 -15933 2397
7242 2397 -16888 -34448 -23396 -2513 -19115 -38738 -54642 -48868 -32564 -18138 -25829 -41673
7230 -41673 -39579 -31619 -44631 -48463 -43726 -28904 -12568 -7416 14335 24641 34556 4956 -8169
7217 -8169 -9877 -17114 -10664 -8890 6102 1860 2645 6751 -7611 -41314 -16292 3245 -12195 -17184
7203 -17184 -10603 -23475 -29536 -21903 -17555 -16819 7265 22797 22160 -2273 -12661 1867 31644
7190 31644 32917 20246 12567 16159 27085 813 -4771 -11281 9465 11963 14290 15184 -6011 -3978
$$ packed form
7282B4029K839k6306j7667k718k2408j1482J4993K1866O148j5780p602j903l9
7269c6030J2876J7379j802m727p464R834M9116N451m513J2870K995J006k4829
7256C2162m0992k1805m730r27L337l317M987O948J5916j0077o924O580K909J8330
7242B397j9285j7560J1052K0883j6602j9623j5904N774J6304J4426p691j5844
7230d1673K094P960j3012l832M737J4822J6336N152K1751J0306R915k9600j3125
7217h169j708p237O450J774J4992m242P85M106j4362l3703K5022J9537j5440m989
7203a7184O581j2872o061P633M348P36K4084J5532o37k4433j0388J4528K9777
7190C1644J273j2671p679L592J0926k6272n584o510K0746K498K327Q94k1195K033
$$ plain form
7176 -3978 -4076 -19993 -9812 -4095 -21211 -21913 -24372 -11891 -5687 -1276 -487 284 -3032 -11013 -25846
7161 -25846 -32809 -1840 20274 9654 -12964 -40601 -31602 -2661 7994 1406 -4031 2867 15715
7148 15715 7500 -11859 5094 4657 -30920 -33783 -27626 -22084 -9188 -3796 862 -13100 -5826 -5701
7134 -5701 -20567 -32867 -45629 -66483 -59147 -50762 -42767 -27819 -22864 -28974 -28828 -33384 -13315 -14976
7120 -14976 -30187 -34937 -27307 -34368 -40764 -37851 -25810 3807 9548 -5906 -20357 -28502 -39040
7107 -39040 -29071 -20530 -11338 5904 -16489 -23996 -4845 1812 -12237 -3594 1077 17450 41560
7094 41560 18602 -14441 -22002 -26905 -18194 -5674 -9721 -7027 -33249 -50742 -45697 -26584 -1401
7081 -1401 -17622 -26912 -27747 -12639 -15065 -19084 -34357 -45783 -48787 -42011 -38668 -50240 -59828 -55064
$$ packed form
7176c978r8j5917J0181N717j7116p02k459J2481O204M411P89P71l316p981j4833
7161b5846o963L0969K2114j0620k2618k7637Q999K8941J0655o588n437O898J2848
7148A5715q215j9359J6953m37l5577k863O157N542J2896N392M658j3962P274J25
7134e701j4866j2300j2762k0854P336Q385P995J4948M955o110J46m556K0069j661
7120a4976j5211m750P630p061o396K913J2041K9617N741j5454j4451q145j0538
7107c9040R969Q541R192J7242k2393p507J9151O657j4049Q643M671J6373K4110
7094D1560k2958l3043p561m903Q711J2520m047K694k6222j7493N045J9113K5183
7081a401j6221r290q35J5108k426m019j5273j1426l004O776L343j1572r588M764
$$ plain form
7067 -55064 -34586 -30932 -23390 -20789 -25867 -17377 -1970 -8742 -10676 -11635 -10296 -15305 -26945 -29222
7053 -29222 -46265 -50274 -48934 -49958 -38165 -36434 -30997 -29735 -19170 -14796 -13920 -5086 21821 29206
7039 29206 30491 40416 20633 -3309 -2148 -5866 -9298 -10 6099 23156 34914 36530 13260
7026 13260 4929 10697 11165 180 -29239 -30657 -15850 -29175 -34814 -42275 -34561 -22677 2520
7013 2520 -3765 -28346 -27779 -41935 -34769 -24824 -10044 5804 -5146 -22090 -50940 -53017 -46114
7000 -46114 -44962 -29803 -29441 -38134 -24319 -21063 -14266 5700 15379 232 -5070 8438 3834 -7912
6986 -7912 -10946 7473 14282 13272 20630 24726 11603 9127 39461 17423 6792 1256 19822
6973 19822 48062 39724 -111 -1083 14846 10378 -9042 -21629 -26303 -34583 -18586 -10987 -4867
$$ packed form
7067e5064K0478L654P542K601n078Q490J5407o772j934r59J339n009j1640k277
7053b9222j7043m009J340j024J1793J731N437J262J0565M374Q76Q834K6907P385
7039B9206J285R925j9783k3942J161l718l432R288O109J7057J1758J616k3270
7026A3260q331N768M68j0985k9419j418J4807j3325n639p461P714J1884K5197
7013B520o285k4581N67j4156P166R945J4780J5848j0950j6944k8850k077O903
7000d6114J152J5159L62q693J3815L256O797J9966R679j5147n302J3508m604j1746
6986g912l034J8419O809j010P358M096j3123k476L0334k2038j0631n536J8566
6973A9822K8240q338l9835r72J5929m468j9420j2587m674q280J5997P599O120
$$ plain form
6960 -4867 12347 34489 39736 25002 13628 35997 11648 -5630 -3463 2921 2993 -356 -3302 21957
6946 21957 11043 14174 2782 -10459 -6797 -13948 -11796 -3195 -10570 -10784 -2082 2224 3142 -971
6932 -971 11244 32193 41504 34011 -6768 -52533 -41351 -14542 -13853 -21836 -10650 9159 21521
6919 21521 22397 15239 -14777 -43501 -52087 -26901 -4089 -1352 -9859 -12020 -29526 -25685 -30929 -38178
6905 -38178 -40589 -39007 -37335 -55102 -48971 -20642 -13020 -9690 -8779 -1380 -6418 5340 29411 21337
6891 21337 6068 11056 5300 11475 18508 28246 17950 12562 17093 953 -1582 5949 17174 25948
6877 25948 25337 16581 17462 13535 3486 8000 17196 9819 -5211 2570 920 -3 -11537 -29966
6863 -29966 -39615 -34301 -16588 -28989 -18615 -33904 -50061 -27728 -30074 -62253 -60654 -18128 41548
$$ packed form
6960d867J7214K2142N247j4734j1374K2369k4349j7278K167O384P2l349k946K5259
6946B1957j0914L131j1392j3241L662p151K152Q601p375k14Q702M306R18m113
6932i71J2215K0949R311p493m0779m5765J1182K6809O89p983J1186J9809J2362
6919B1521Q76p158l0016k8724q586K5186K2812K737q507k161j7506L841n244p249
6905c8178k411J582J672j7767O131K8329P622L330R11P399n038J1758K4071q074
6891B1337j5269M988n756O175P033R738j0296n388M531j6140k535P531J1225Q774
6877B5948o11q756Q81l927j0049M514R196p377j5030P781j650r23j1534j8429
6863b9966r649N314J7713j2401J0374j5289j6157K2333k346l2179J599M2526N9676
$$ plain form
6850 41548 55581 64451 36265 16788 1134 -734 14 9377 5063 17055 19080 44825 35720
6837 35720 9970 -20386 -21645 -12678 -14501 -9713 7241 16560 15590 13143 16002 21665 33585 11942
6823 11942 18337 7632 -1725 18300 14599 8320 9154 9978 8759 11492 27086 7601 -14800 9391
6809 9391 36546 38980 6523 -9042 -368 16951 4791 -4623 -22247 -16829 -9336 13911 -2287
6796 -2287 -18591 -10140 19548 -12418 -33834 -43794 -50663 -64328 -61979 -45355 -35615 -46790 -37991
6783 -37991 -25417 -18724 18144 20107 -4539 -20305 -11214 -9293 6622 -9338 -19434 -11744 -20004
6770 -20004 -16103 -24838 -22624 -10426 -21580 -27869 -8916 -11654 -12916 -23083 -20035 -37004 -63400
6757 -63400 -36505 -24780 -33767 -34934 -21708 1337 -322 11095 30197 25643 11467 3065 -17043
$$ packed form
6850D1548J4033Q870k8186j9477j5654j868P48R363m314J1992K025K5745r105
6837C5720k5750l0356j259Q967j823M788J6954R319r70k447K859N663J1920k1643
6823A1942O395j0705r357K0025l701o279Q34Q24j219K733J5594j9485k2401K4191
6809I391K7155K434l2457j5565Q674J7319j2160r414j7624N418P493K3247j6198
6796b287j6304Q451K9688l1966k1416r960o869j3665K349J6624R740j1175Q799
6783c7991J2574O693L6868J963k4646j5766R091J921J5915j5960j0096P690q260
6770b0004L901q735K214J2198j1154o289J8953k738j262j0167L048j6969k6396
6757f3400K6895J1725q987j167J3226K3045j659J1417J9102m554j4176q402k0108
$$ plain form
6744 -17043 -13518 3555 3702 -7060 -18454 -19042 -22726 -16322 -1480 23297 40431 19477 22469
6731 22469 9336 4732 -8824 -7696 -21503 -27420 -346 2832 -19197 -2323 5458 8885 1102
6718 1102 -2309 -16813 -19486 -14984 5516 3407 -16092 -13154 -18250 -41767 -36486 -12530 -22510 -17772
6704 -17772 -23697 -16477 -5809 -7757 8278 4205 3900 -27668 -24260 -19527 -11858 -3919 -5346 1971
6690 1971 10709 49166 37525 28730 31720 7843 -7493 -6729 6134 3509 4202 -1383 -6786 10510
6676 10510 31037 22528 -4933 2122 6896 3150 23171 10814 -2367 -4268 -2066 5726 34767
6663 34767 59905 57036 35381 4696 5470 23550 20826 14994 -13612 -23660 -16681 -3499 14944
6650 14944 31328 33337 32624 19096 6853 -13819 -32573 -12282 -11412 -2391 -482 -8133 779 36593
$$ packed form
6744a7043L525J7073J47j0762j1394n88l684O404J4842K4777J7134k0954K992
6731B2469j3133m604j3556J128j3807n917K7074L178k2029J6874P781L427p783
6718A102l411j4504k673M502K0500k109j9499K938n096k3517N281K3956r980M738
6704a7772n925P220J0668j948J6035m073l05l1568L408M733P669P939j427P317
6690A971Q738L8457j1641q795K990k3877j5336P64J2863k625O93n585n403J7296
6676A0510K0527q509k7461P055M774l746K0021j2357j3181j901K202P792K9041
6663C4767K5138k869k1655l0685P74J8080k724n832k8606j0048O979J3182J8443
6650A4944J6384K009p13j3528j2243k0672j8754K0291Q70R021J909p651Q912L5814
$$ plain form
6636 36593 17131 3412 -9378 -10643 -8141 19284 15205 19897 22176 33475 35782 18813 17773
6623 17773 10114 -20747 -47523 -51628 -47953 -25367 -10888 -3665 7412 3778 -15946 -37560 -47008
6610 -47008 -40976 -10497 12403 4794 -13818 -39092 -42289 -36105 -16169 -2794 4999 47 -7095
6597 -7095 -12798 -3327 -6611 -32954 -48785 -30900 974 -905 -4815 4866 14771 10582 -20228 -32508
6583 -32508 -18064 -20301 -27993 -9170 -14 8645 7286 24071 24717 14510 -343 -1001 23583 21878
6569 21878 8775 -955 -38755 -39575 -19134 -3648 4647 15615 9881 12432 26524 32325 11196
6556 11196 5707 -7697 4556 4266 15011 52028 47830 30349 18399 559 -6514 10529 22536
6543 22536 25115 17563 22090 9800 -18096 -16227 -15508 -22142 -29977 -27184 -8479 -285 684 7784
$$ packed form
6636C6593j9462j3719j2790j265K502K7425m079M692K279J1299K307j6969j040
6623A7773p659l0861k6776m105L675K2586J4479P223J1077l634j9724k1614r448
6610d7008O032L0479K2900p609j8612k5274l197O184J9936J3375P793m952p142
6597g095n703R471l284k6343j5831J7885L1874j879l910R681R905m189l0810j2280
6583c2508J4444k237p692J8823R156Q659j359J6785O46j0207j4853o58K4584j705
6569B1878j3103r730l7800q20K0441J5486Q295J0968n734K551J4092N801k1129
6556A1196n489j3404J2253k90J0745L7017m198j7481j1950j7840p073J7043J2007
6543B2536K579p552M527j2290k7896J869P19o634p835K793J8705Q194R69P100
$$ plain form
6529 7784 6445 4262 712 -13315 -15213 -27309 -50701 -72363 -65122 -61872 -69930 -20983 -1858
6516 -1858 -3035 -13410 -14241 -24602 -1734 4058 3206 20537 8272 2781 25914 12546 4159 4208
6502 4208 -11357 11106 14071 800 -25738 -30087 -42174 -33230 -45653 -38443 -35412 -10295 2173
6489 2173 -2742 4385 -9519 -7402 14203 33698 12255 -445 -18115 -36577 -47762 -56210 -60347
6476 -60347 -33741 -1173 7818 -6628 -11658 -5812 -15404 -42745 -48018 -34195 -28482 -9076 10408
6463 10408 2088 -4900 9916 4620 -10599 -34104 -27757 -6822 -1684 24699 45104 34075 4348
6450 4348 -2540 -11724 -44730 -56933 -33337 -18116 -6708 -20607 -5289 10651 17951 3251 4195
6437 4195 1649 -13453 -30415 -27628 11120 19599 -5667 -31548 -15563 -11711 -10150 17075 5930
$$ packed form
6529G784j339k183l550j4027j898j2096k3392k1662P241L250q058M8947J9125
6516a858j177j0375q31j0361K2868N792q52J7331j2265n491K3133j3368q387M9
6502D208j5565K2463K965j3271k6538m349j2087Q944j2423P210L031K5117J2468
6489B173m915P127j3904K117K1605J9495k1443j2700j7670j8462j1185q448m137
6476f0347K6606L2568Q991j4446n030N846r592k7341n273J3823N713J9406J9484
6463A0408q320o988J4816n296j5219k3505O347K0935N138K6383K0405j1029k9727
6450D348o888r184l3006j2203K3596J5221J1408j3899J5318J5940P300j4700R44
6437D195k546j5102j6962K787L8748Q479k5266k5881J5985L852J561K7225j1145
$$ plain form
6424 5930 326 744 -7332 -20525 -7180 7949 19206 31668 31002 34386 36937 10004 16563 24387
6410 24387 18025 22513 7629 8093 27333 -2780 2585 -8283 -25960 -45313 -65919 -73755 -52276
6397 -52276 -3493 16666 17839 18048 30248 27822 -7582 -272 -3404 -10820 -30768 -29302 -7763
6384 -7763 -9686 -15795 3905 27456 16878 -3774 5790 -7379 -31244 -44794 -29393 -10320 -11986
6371 -11986 -27615 -48848 -54015 -35965 -15176 -6345 -1842 -4902 11373 -1785 -8811 -12446 -12255
6358 -12255 4981 -12496 -18017 -16283 -28726 -15581 -7672 -1745 -5087 -17638 -6675 -17834 -152
6345 -152 7928 -10101 3254 21173 29087 46575 23697 22183 26297 26209 3873 3626 -2267 5282
6331 5282 9929 17202 34615 34244 39144 38421 19976 10829 4369 11416 15586 18281 19935 11209 -6435
$$ packed form
6424E930n604M18q076j3193J3345J5129J1257J2462o66L384K551k6933O559P824
6410B4387o362M488j4884M64J9240l0113N365j0868j7677j9353k0606p836K1479
6397e2276M8783K0159J173K09J2200k426l5404P310l132p416j9948J466K1539
6384g763j923o109J9700K3551j0578k0652R564j3169k3865j3550J5401J9073j666
6371a1986j5629k1233n167J8050K0789Q831M503l060J6275j3158p026l635J91
6358a2255J7236j7477n521J734j2443J3145P909N927l342j2551J0963j1159J7682
6345a52Q080j8029J3355J7919P914J7488k2878j514M114q8k2336k47n893P549
6331E282M647P273J7413l71M900p23j8445r147o460P047M170K695J654q726j7644
$$ plain form
6316 -6435 -30653 -33614 -33596 -54032 -35037 2250 -16985 -36431 -14680 14600 -9345 -18858 -5625
6303 -5625 24547 13546 18020 10331 -7591 -20206 -2233 -354 -6131 -11505 -18135 -25166 -30323 -21642
6289 -21642 -18747 -1354 -11332 -39289 -51678 -46941 -14382 3334 -1038 -2334 -8269 -14442 327
6276 327 15149 17007 27276 30330 22693 -2133 -26633 -32170 -27246 6616 9969 -25473 -13504
6263 -13504 -9667 3674 25538 26187 7660 -6392 -744 -23654 -39818 -21280 -29504 -37344 -50985
6250 -50985 -57860 -58741 -31269 -5864 -17139 -12768 -7493 14771 15759 7002 1774 7447 7847 9830
6236 9830 2511 -14497 -10460 14266 19670 -22241 -40493 -29124 -32748 -30177 8807 5943 -4943
6223 -4943 19203 29098 38241 14124 978 502 26030 36341 26302 21212 20540 35970 14563
$$ packed form
6316f435k4218k961J8k0436J8995L7287j9235j9446K1751K9280k3945r513J3233
6303e625L0172j1001M474p689j7922j2615J7973J879n777n374o630p031n157Q681
6289b1642K895J7393r978k7957j2389M737L2559J7716m372j296n935o173J4769
6276C27J4822J858J0269L054p637k4826k4500n537M924L3862L353l5442J1969
6263a3504L837J3341K1864O49j8527j4052N648k2910j6164J8538q224p840j3641
6250e0985o875q81K7472K5405j1275M371N275K2264R88q757n228N673M00J983
6236I830p319j7008M037K4726N404m1911j8252J1369l624K571L8984k864j0886
6223d943K4146R895R143k4117j3146m76K5528J0311j0039n090o72J5430k1407
$$ plain form
6210 14563 20234 13202 12454 10474 -7908 -26393 -12327 -7028 -1741 1564 37556 36326 43764 32376
6196 32376 -224 -14750 -24609 -2494 25071 -1713 -40612 -17277 -17395 -13976 -5638 -12811 12686
6183 12686 5605 -26845 -21273 -32563 -15613 7190 27374 6512 -9449 -6202 8141 31708
6171 31708 -1338 -24194 -34168 -40470 -12429 7459 11179 13925 19660 23857 19417 28831 23209 -6298
6157 -6298 -10191 -23656 -7080 3352 15570 29136 27618 34956 35729 19429 6863 -3135 7338
6144 7338 10353 3360 -12314 -25228 -31115 -30788 -14877 9785 -767 -22628 -12169 -591 8125
6131 8125 12101 -607 -7686 5068 -16519 -11217 -19112 -24341 -36399 -34378 -19163 -17400 -17575 5906
6117 5906 17588 3300 -4609 4017 -4366 -18826 -7216 12872 -613 -25299 -28508 -8755 2590
$$ packed form
6210A4563N671p032p48j980j8382j8485J4066N299N287L305L5992j230P438j1388
6196C2376l2600j4526r859K2115K7565k6784l8899K3335j18L419Q338p173K5497
6183A2686p081l2450N572j1290J6950K2803K0184k0862j5961L247J4343K3567
6171C1708l3046k2856r974o302K8041J9888L720K746N735M197m440R414n622k9507
6157f298l893j3465J6576J0432J2218J3566j518P338P73j6300j2566r998J0473
6144G338L015o993j5674j2914n887L27J5911K4662j0552k1861J0459J1578Q716
6131H125L976j2708p079J2754k1587N302p895n229j2058K021J5215J763j75K3481
6117E906J1682j4288p909Q626q383j4460J1610K0088j3485k4686l209J9753J1345
$$ plain form
6104 2590 -13481 -18337 1813 -17522 -16547 -15543 -10208 -4491 12968 18444 2670 -18845 -35592
6091 -35592 -38186 -20334 -32395 -52300 -36813 -45390 -51436 -17728 19832 9572 10325 9864 16182
6078 16182 8380 -25790 -18581 -9914 532 1196 9708 8466 13005 16696 5778 -23109 -13217 -3722
6064 -3722 -20641 -6418 -10238 -21691 -34323 -24253 -43922 -26889 -29952 -39582 -20447 -23375 -19498
6051 -19498 -20076 3924 16092 1392 -2474 -7251 3884 -1586 -30461 -24240 -27333 -18168 -21980 -12188
6037 -12188 -19824 1220 9606 8825 7741 6751 3447 -15021 -30111 -46733 -47863 -23035 -8170 -11772
6023 -11772 -18749 -38708 -29189 -30527 -46224 -28462 -15696 -15686 -7609 8593 932 14619 45833
6010 45833 49793 42239 24627 28198 46416 55802 47384 16764 23587 6563 -15384 -8912 4989
$$ packed form
6104B590j6071m856K0150j9335R75J004N335N717J7459N476j5774k1515j6747
6091c5592k594J7852j2061j9905J5487q577o046L3708L7560j0260P53m61O318
6078A6182p802l4170P209Q667J0446O64Q512j242M539L691j0918k8887R892R495
6064c722j6919J4223l820j1453j2632J0070j9669J7033l063r630J9135k928L877
6051a9498n78K4000J2168j4700l866m777J1135n470k8875O221l093R165l812R792
6037a2188p636K1044Q386p81j084r90l304j8468j5090j6622j130K4828J4865l602
6023a1772o977j9959R519j338j5697J7762J2766J0Q077J6202p661J3687L1214
6010D5833L960p554j7612L571J8218R386q418l0620O823j7024k1947O472J3901
$$ plain form
5997 4989 3597 -933 -2459 -5885 -16556 2523 20528 27361 16890 20283 13063 960 19872
5984 19872 26096 28861 28951 27675 55671 52189 4042 10455 4711 -2154 13581 3449 -10812 19480
5970 19480 44056 45343 32370 10699 -25440 -19063 -6862 -7516 7466 21913 29284 5164 11598
5957 11598 -304 -6791 -8327 -15994 146 22996 16248 6561 16502 22960 35004 48815 51865
5944 51865 43668 27080 6585 5149 -412 -7884 -5513 -15689 -12452 -9991 -3935 6793 25585
5931 25585 28736 16373 22775 43181 48041 31276 2842 -8848 697 25351 13755 -6861 -10842
5918 -10842 2748 1680 -3292 -2058 -8569 -4911 -4553 -14093 -27160 -12899 -4810 -7421 -25351 -5144
5904 -5144 -1297 -5201 1948 6888 22229 26153 21369 1867 -35101 -23323 -19260 -22892 -22253 -17679
$$ packed form
5997D989j392m530j526l426j0671J9079J8005O833j0471L393p220j2103J8912
5984A9872O224K765R0j276K7996l482m8147O413n744o865J5735j0132j4261L0292
5970A9480K4576J287j2973k1671l6139O377J2201o54J4982J4447P371k4120O434
5957A1598j1902o487j536p667J6140K2850o748r687R941O458J2044J3811L050
5944E1865q197j6588k0495j436n561p472K371j0176L237K461O056J0728J8792
5931B5585L151j2363O402K0406M860j6765k8434j1690R545K4654j1596k0616l981
5918a0842J3590j068m972J234o511L658L58r540j3067J4261Q089k611j7930K0207
5904e144L847l904P149M940J5341L924m784j9502l6968J1778M063l632O39M574
$$ plain form
5890 -17679 -19728 -40925 -28463 -11551 -6383 -4034 -19749 -19289 -18118 -11848 723 17093 19388
5877 19388 29531 31464 27917 9900 -1509 -2879 -2746 -9070 -13968 -6016 -25586 -43875 -26502
5864 -26502 -20076 -10974 -7571 -5245 -21761 -20478 -27776 -49683 -53433 -69762 -65871 -43261 -35849 -27473
5850 -27473 -4649 9244 5036 -5810 10819 -9191 -5418 12553 -12484 -43748 -15281 6015
5838 6015 -3164 60 -38021 -34595 -765 -8545 -22115 -47123 -42865 -17360 -15139 6786 19407
5825 19407 20499 -3795 -3187 -4451 16903 17453 11826 -5282 -4888 -30750 -35004 -50857 -31675 8948
5811 8948 32004 33568 17234 -10345 -52914 -36708 -16109 -5585 -1421 -26214 -8357 21588
5799 21588 23639 22743 -12199 -18219 3402 -2011 -18601 -16660 3806 14365 14670 -358 26806
$$ packed form
5890a7679k049k1197J2462J6912N168K349j5715M60J171O270J2571J6370K295
5877A9388J0143J933l547j8017j1409j370J33o324m898P952j9570j8289J7373
5864b6502O426R102L403K326j6516J283p298k1907l750j6329L891K2610P412Q376
5850b7473K2824J3893m208j0846J6629k0010L773J7971k5037l1264K8467K1296
5838F015r179L224l8081L426L3830p780j3570k5008M258K5505K221K1925J2621
5825A9407J092k4294O08j264K1354N50n627j7108L94k5862m254j5853J9182M0623
5811H948K3056J564j6334k7579m2569J6206K0599J0524M164k4793J7857K9945
5799B1588K051q96l4942o020K1621n413j6590J941K0466J0559L05j5028K7164
$$ plain form
5786 26806 27593 16363 15580 11451 -1076 -1553 -28421 -40443 -37332 -40206 -40432 -31974 -20926 -1193
5772 -1193 9801 8696 -4152 5423 -6331 -29892 -45630 -27497 -10481 -9741 11942 47734 36769
5759 36769 22274 15505 -12774 -23581 -6836 -5374 464 -17502 -17794 -12323 -31005 -46783 -29834
5746 -29834 2723 23282 16593 2523 29447 24275 -17306 -34599 -27978 -30249 -45724 -50052 -36200
5733 -36200 4953 29860 20852 15850 2304 11750 20653 -9737 -5387 -162 14699 24184 11039
5720 11039 -7790 10091 16275 19753 10584 -21503 -20863 3866 4859 13208 5101 -11548 -23389 -25177
5706 -25177 -42284 -35502 -15329 -7078 -1982 -13406 -12104 -12737 -29328 -11002 -21828 -32775 -24715
5693 -24715 -27428 -25034 -41336 -42362 -23842 11030 6194 -20589 -5151 -8526 -20510 -20857 -9459
$$ packed form
5786B6806P87j1230p83m129j2527m77k6868j2022L111k874k26Q458J1048J9733
5772a193J0994j105j2848R575j1754k3561j5738J8133J7016P40K1683L5792j0965
5759C6769j4495o769k8279j0807J6745J462N838j7966k92N471j8682j5778J6949
5746b9834L2557K0559o689j4070K6924n172m1581j7293O621k271j5475m328J3852
5733c6200M1153K4907r008n002j3546R446Q903l0390M350N225J4861R485j3145
5720A1039j8829J7881O184L478r169l2087O40K4729R93Q349q107j6649j1841j788
5706b5177j7107O782K0173Q251N096j1424J302o33j6591J8326j0826j0947Q060
5693b4715k713K394j6302j026J8520L4872m836k6783J5438l375j1984l47J1398
$$ plain form
5680 -9459 -8203 3907 -5024 -13161 -14681 -21690 -2989 -2164 -19980 -29344 -15910 -19583 -13136 -16165
5666 -16165 -10269 802 19992 29398 2094 13162 14178 12919 33834 13199 -20995 -43603 -14982
5653 -14982 4758 3225 -2979 -3300 5858 -364 -15835 -18215 2968 20226 14389 17932 7180 3288
5639 3288 5792 -34442 -41036 -27681 -36584 -40250 -37974 -16991 15331 41791 47068 39391 31398 15724
5625 15724 1957 7642 1153 4817 -10116 -36241 -46350 -32181 -28408 -14366 -28348 -21670 -2478
5612 -2478 27247 26117 16606 2503 16242 -2744 -232 -3826 -36872 -29514 -18779 -31780 -39147
5599 -39147 -37943 -14748 -30258 -43084 -34695 -6168 14877 14452 8605 -4046 -4583 8723 961
5586 961 4302 -5342 -29687 -43540 -45861 -50943 -15576 12082 2133 -11708 -24450 -33086 -32047 -33427
$$ packed form
5680i459J256J2110q931q137j520p009J8701Q25j7816r364J3434l673O447l029
5666a6165N896J1071J9190R406k7304J1068J016j259K0915k0635l4194k2608K8621
5653a4982J9740j533o204l21R158o222j5471k380K1183J7258n837L543j0752l892
5639C288K504m0234o594J3355q903l666K276K0983L2322K6460N277p677p993j5674
5625A5724j3767N685o489L664j4933k6125j0109J4169L773J4042j3982O678J9192
5612b478K9725j130r511j4103J3739j8986K512l594l3046P358J0735j3001p367
5599c9147J204K3195j5510j2826Q389K8527K1045m25n847j2651n37J3306p762
5586I61L341r644k4345j3853k321n082L5367K7658r949j3841j2742q636J039j380
$$ plain form
5572 -33427 -45071 -30123 -15254 -25511 -44167 -56523 -60764 -73287 -59518 -20755 -24214 -10543
5560 -10543 7069 -9027 2335 -2068 -14077 -1726 29195 19284 -16135 -50838 -31200 -12558
5548 -12558 8170 13977 922 -3728 -7165 -16751 -15840 -10316 -16243 -38134 -37725 -10628 2265 -1260
5534 -1260 -26676 -35661 -35587 -21706 3355 -7706 -10653 -14267 -6665 -15709 -14749 -16760 1960 22912
5520 22912 28200 19106 12545 -10781 -28213 -17002 -242 -3570 2696 5388 -12115 -27164 -32067
5507 -32067 -21686 -31387 -31908 -11113 1710 6269 1367 -331 -12906 1995 -6972 -878 8098 13806
5493 13806 -9920 -910 -17620 -5367 -4636 6264 6811 23121 24124 14169 8439 1736 9644 11722
5479 11722 7818 20361 33663 30973 11274 15444 12929 -1831 -20663 -23872 -20399 -20115 -24998 -39372
$$ packed form
5572c3427j1644J4948J4869j0257j8656j2356m241j2523J3769L8763l459J3671
5560a0543J7612j6096J1362m403j2009J2351L0921r911l5419l4703J9638J8642
5548a2558K0728N807j3055m650l437r586R11N524n927k1891M09K7097J2893l525
5534a260k5416q985P4J3881K5061j1061k947l614P602r044R60k011J8720K0952
5520B2912N288r094o561k3326j7432J1211J6760l328O266K692j7503j5049m903
5507c2067J0381r701n21K0795J2823M559m902j698j2575J4901q967O094Q976N708
5493A3806k3726R010j6710J2253P31J0900N47J6310J003r955n730o703P908K078
5479A1722l904J2543J3302k690j9699M170k515j4760j8832l209L473K84m883j4374
$$ plain form
5465 -39372 -53542 -24535 -965 16302 12058 6593 3070 -10895 -16719 -11136 -10318 -3900 -19669
5452 -19669 -18036 -12828 18052 27588 10293 -12847 -13955 -1263 -257 -16039 -34558 -25864 -1791
5439 -1791 3750 523 19430 21034 16804 4518 4090 21456 26451 32630 23917 34316 44274 20313
5425 20313 -16429 -27128 -30518 -44556 -39760 -16391 -1857 -16184 -51530 -51160 -35282 -37469 -24431
5412 -24431 -13556 -8261 -15044 -20713 -26478 -16038 -14710 -17580 -21501 -22393 -38336 -34524 -55566 -49097
5398 -49097 -31883 -45035 -51491 -66347 -53421 -17936 728 21592 36453 52544 35417 -8569
5386 -8569 -33877 -22070 -8037 -15278 -9904 5612 8542 6109 -27172 -58669 -39956 -32648 -30605
5373 -30605 -35387 -36240 -20134 -6738 -7402 -16764 -15407 -741 1983 -10261 -1858 169 2158 -10146
$$ packed form
5465c9372j4170K9007K3570J7267m244n465l523j3965n824N583Q18O418j5769
5452a9669J633N208L0880R536j7295k3140j108J2692J006j5782j8519Q694K4073
5439a791N541l227J8907J604m230j2286m28J7366M995O179q713J0399R958k3961
5425B0313l6742j0699l390j4038M796K3369J4534j4327l5346L70J5878k187J3038
5412b4431J0875N295o783n669n765J0440J328k870l921q92j5943L812k1042O469
5398d9097J7214j3152o456j4856J2926L5485J8664K0864J4861J6091j7127m3986
5386h569k5308J1807J4033p241N374J5516K930k433l3281l1497J8713P308K043
5373c0605m782q53J6106J3396o64r362J357J4666K724j2244Q403K027J989j2304
$$ plain form
5359 -10146 -30277 -17114 2380 3038 -7965 -305 17845 12786 -25326 -41742 -49411 -37596 -10966
5346 -10966 2891 13401 19377 22526 28719 16282 1807 -8715 -16409 -44208 -24273 6750 13896
5333 13896 8870 3577 9973 -1057 -21459 -29694 -22309 -20934 -11462 -4960 13906 24537 28444 28844
5319 28844 1899 -7916 1961 -12890 -11517 6930 17145 7731 -15159 -8864 7842 17132 5895
5306 5895 20735 19211 1045 -18802 -21735 -17239 -7228 -28073 -35530 -12674 -222 12904 9787
5293 9787 8108 8107 -951 -16464 -21002 -35584 -37919 -20280 -10470 1973 25147 15 -15681 -16823
5279 -16823 832 17297 26686 10328 -1603 731 -43630 -57011 -40457 -18401 -12892 -3116 -16334
5266 -16334 -37060 -21474 6166 3502 -3280 -12519 -6531 16703 13284 -28863 -53486 -49421 -37096
$$ packed form
5359a0146k0131J3163J9494O58j1003P660J8150n059l8112j6416p669J1815K6630
5346a0966J3857J0510N976L149O193j2437j4475j0522p694k7799J9935L1023P146
5333A3896n026n293O396j1030k0402q235P385J375R472O502J8866J0631L907M00
5319B8844k6945r815R877j4851J373J8447J0215r414k2890O295J6706R290j1237
5306E895J4840j524j8166j9847k933M496J0011k0845p457K2856J2452J3126l117
5293I787j679jr058j5513m538j4582k335J7639R810J2443K3174k5132j5696j142
5279a6823J7655J6465R389j6358j1931K334m4361j3381J6554K2056N509R776j3218
5266a6334k0726J5586K7640k664o782r239N988K3234l419m2147k4623M065J2325
$$ plain form
5253 -37096 -15354 1511 -9468 -15104 -15895 -5768 15767 17625 17654 5271 -15198 -5409 15739
5240 15739 5534 -14038 -14732 -14234 -11438 -17251 -13903 -4351 -9335 10749 12183 20011 7049 21548
5226 21548 27411 22936 20391 22589 31349 15296 8474 -12658 -20259 -335 15073 14782 -4697 -10416
5212 -10416 -1065 -11304 -2622 20949 29208 35045 9581 15924 43089 55163 32838 5650 10671
5199 10671 13811 8681 20315 15908 8213 -3174 -32719 -43775 -52511 -38378 1569 28487 19496
5186 19496 5743 22923 12847 27153 8701 -13806 -16308 -14415 -11836 -15361 13530 6622 8390
5173 8390 -8836 -48298 -75703 -49543 -29979 -40363 -46976 -39967 -36052 -13807 -2247 465 11946
5160 11946 27927 37151 54906 44880 21854 13366 15686 1007 -24936 -40031 -566 9404 8474
$$ packed form
5253c7096K1742J6865j0979n636p91J0127K1535J858K9j2383k0469R789K1148
5240A5739j0205j9572o94M98K796n813L348R552m984K0084J434P828j2962J4499
5226B1548N863m475k545K198Q760j6053o822k1132p601J9924J5408k91j9479n719
5212a0416R351j0239Q682K3571Q259N837k5464O343K7165J2074k2325k7188N021
5199A0671L140n130J1634m407p695j1387k9545j1056q736J4133L9947K6918q991
5186A9496j3753J7180j0076J4306j8452k2507k502J893K579l525K8891o908J768
5173H390j7226l9462k7405K6160J9564j0384o613P009L915K2245J1560K712J1481
5160A1946J5981R224J7755j0026k3026q488K320j4679k5943j5095L9465R970r30
$$ plain form
5147 8474 5176 -9965 10144 19132 5866 5378 29958 2162 -22986 -16078 9798 -1514 6879
5134 6879 15734 17009 33060 17377 -5421 -19135 -24221 -20784 -13444 -7309 -14651 -14160 -20854 -16782
5120 -16782 -22304 -15990 -17912 -1687 -3229 -9526 -986 8980 7073 -12786 -29386 -23406 12177 27379
5106 27379 16742 9053 -2129 -1049 -6244 16145 12422 890 2695 -3937 -2222 4677 12913 -12271
5092 -12271 -13540 16717 38890 26735 17989 -1600 -3919 -15626 -19122 788 18440 24861 10804
5079 10804 124 3201 -7533 -27243 -10631 -28811 -48162 -36666 -10755 -9629 -10244 13276 20759
5066 20759 26643 26788 14475 4688 4602 2259 498 8515 20896 17430 362 651 2091 -5947 -4744
5051 -4744 -3803 14026 4023 -6332 -10169 -5815 -541 268 3489 -17457 -230 -31061 -71879 -93153
$$ packed form
5147H474l298j5141K0109Q988j3266m88K4580k7796k5148O908K5876j1312Q393
5134F879Q855J275J6051j5683k2798j3714n086L437P340O135p342M91o694M072
5120a6782n522O314j922J6225j542o297Q540R966j907j9859j6600N980L5583J5202
5106B7379j0637p689j1182J080n195K2389l723j1532J805o632J715O899Q236k5184
5092a2271j269L0257K2173j2155q746j9589k319j1707l496J9910J7652O421j4057
5079A0804j0680L077j0734j9710J6612j8180j9351J1496K5911J126o15K3520P483
5066B0759N884J45j2313r787q6k343j761Q017J2381l466j7068K89J440q038J203
5051d744R41J7829j0003j0355l837M354N274Q09L221k0946J7227l0831m0818k1274
$$ plain form
5037 -93153 -91716 -63946 -56235 -50765 -20999 -6049 3621 19041 19301 28304 4815 11872 5191 -7751
5023 -7751 7419 -88 -224 8980 13235 -962 -17244 -23370 -11793 12242 13904 -9983 -1839 21130
5009 21130 23066 13399 10546 -503 -21287 -42142 -41883 -23126 -11908 -25916 -30164 -19862 2525
4996 2525 -8075 -14557 -13172 -3639 4595 -15135 9562 32315 31000 13440 22022 19606 14274 -5782
4982 -5782 1087 8636 17083 528 -2655 -26976 -49293 -36362 -4785 -3892 -19880 -52132 -38040
4969 -38040 -18806 -22694 -24350 -8794 8903 12379 -7466 -19745 -11411 -10638 -18151 -36496 -32438
4956 -32438 -36112 -50909 -51405 -37753 706 6579 -11037 -6516 3708 7091 -3262 -6398 -10404
4943 -10404 -11239 -8953 -4273 6274 -3913 -14483 -18811 -18513 -5169 9037 4297 -6949 -12698 -7111
$$ packed form
5037i3153J437K7770P711N470K9766J4950R670J5420K60R003k3489P057o681j2942
5023g751J5170p507j36R204M255j4197j6282o126J1577K4035J662k3887Q144K2969
5009B1130J936r667k853j1049k0784k0855K59J8757J1218j4008m248J0302K2387
4996B525j0600o482J385R533Q234j9730K4697K2753j315j7560Q582k416n332k0056
4982e782O869P549Q447j6555l183k4321k2317J2931L1577Q93j5988l2252J4092
4969c8040J9234l888j656J5556J7697L476j9845j2279Q334P73p513j8345M058
4956c2438l674j4797m96J3652L8459N873j7616M521J0224L383j0353l136m006
4943a0404q35K286M680J0547j0187j0570m328K98J3344J4206m740j1246n749N587
$$ plain form
4929 -7111 1425 -14680 -13347 -15388 -23534 -22489 -33495 -39465 -56835 -55689 -37530 -19078 20452
4916 20452 5357 -27372 -48175 -39397 -35600 -26775 -18215 -9429 -12778 -6189 10861 11053 9781 -3460
4902 -3460 -22188 -27881 -660 -9617 -15986 -15348 -19117 -8452 -17420 -19140 -1795 1678 3052 9062
4888 9062 20568 15397 2182 -8693 -8056 -30759 -27600 -388 10084 8280 -2600 -2616 15434 29941
4874 29941 10704 -1926 -355 -20027 -49699 -34664 -29853 -35360 -28025 -30203 -33204 -27704 -13309
4861 -13309 -4854 -11894 -6543 9572 9539 12691 -355 -20650 -14320 2882 -6504 -12615 1177 219
4847 219 10148 4002 12738 32881 4920 -14759 -22558 -15916 1354 -424 -2966 -2341 16050 42289
4833 42289 34675 11550 2647 -14039 -27048 -26404 -9064 -25830 -42708 -43507 -10357 -606 -10589
$$ packed form
4929g111Q536j6105J333k041q146J045j1006n970j7370J146J8159J8452L9530
4916B0452j5095l2729k0803Q778L797Q825Q560Q786l349O589J7050J92j272j3241
4902c460j8728n693K7221q957o369O38l769J0665q968j720J7345L473J374O010
4888I062J1506n171j3215j0875O37k2703L159K7212J0472j804j0880j6J8050J4507
4874B9941j9237j2630J571j9672k9672J5035M811n507P335k178l001N500J4395
4861a3309Q455p040N351J6115l3L152j3046k0295O330J7202r386o111J3792r58
4847B19R929o146Q736K0143k7961j9679p799O642J7270j778k542O25J8391K6239
4833D2289p614k3125q903j6686j3009O44J7340j6766j6878p99L3150R751r983
$$ plain form
4820 -10589 -5201 21006 6585 -18522 -8938 3748 -5463 14111 27528 15304 11992 9862 -3186
4807 -3186 15932 17517 -3327 -15431 -28715 -27039 -16421 -15233 -460 -5317 3154 28446 38678
4794 38678 42643 45596 38159 17299 -17014 -13945 -10793 -26412 -39219 -39575 -13498 3199 -18378
4781 -18378 -32574 -28030 -14091 -12445 5506 9866 -13628 -30408 -30440 -29689 -19598 -447 -8045 -6355
4767 -6355 14554 26388 16800 -25249 -52442 -61752 -53550 -26327 -2037 16186 32981 41374 42574
4754 42574 24951 4808 -15180 -11594 -14956 -12613 575 -17530 -32735 -47311 -26476 -6152
4742 -6152 -4884 -5441 -9466 -20889 -42960 -15046 -13161 25 -3944 -27101 -26507 -2659 7980 21384
4728 21384 47674 45950 41831 33553 29035 17878 -9324 -29618 -30522 -2832 -4234 -7375 -8231 -15458
$$ packed form
4820a0589N388K6207j4421k5107R584J2686r211J9574J3417j2224l312k130j3048
4807c186J9118J585k0844j2104j3284J676J0618J188J4773m857Q471K5292J0232
4794C8678L965K953p437k0860l4313L069L152j5619j2807l56K6077J6697k1577
4781a8378j4196M544J3939J646J7951M360k3494j6780l2P51J0091J9151p598J690
4767f355K0909J1834r588m2049k7193r310Q202K7223K4290J8223J6795Q393J200
4754D2574j7623k0143j9988L586l362K343J3188j8105j5205j4576K0835K0324
4742f152J268n57m025j1423k2071K7914J885J3186l969k3157N94K3848J0639J3404
4728B1384K6290j724m119q278m518j1157k7202k0294r04K7690j402l141q56p227
$$ plain form
4714 -15458 -4448 12703 -1840 16715 54498 57658 54199 46532 18556 4468 -2355 6076 35534
4701 35534 44367 33812 52805 39617 3425 -18412 -16589 1277 13825 36748 42027 39646 44079
4688 44079 36213 30173 38634 23824 -10874 -20705 -22686 -16216 -20284 -4314 -19792 -22617 -26173 -21609
4674 -21609 1920 26169 33132 22440 -3854 -3608 -13640 -22849 -11486 4358 1028 10476 14748
4661 14748 34114 11504 17536 18028 18754 15536 6751 8850 10522 -8845 -17935 9566 13842 683
4647 683 -13568 -7731 -12671 -11253 -14169 -26717 -41074 -53147 -25452 6952 5274 11174 8404 -9373
4633 -9373 -43668 -29407 -5591 13360 12164 11578 5528 4239 -7637 -19317 -10032 -4688 8696
4620 8696 24904 25641 14213 11597 21874 20166 23634 11371 -4500 -1991 19538 13458 -17393
$$ packed form
4714a5458J1010J7151j4543J8555L7783L160l459p667k7976j4088o823Q431K9458
4701C5534Q833j0555J8993j3188l6192k1837J823J7866J2548K2923N279k381M433
4688D4079p866o040Q461j4810l4698r831j981O470m068J5970j5478k825l556M564
4674b1609K3529K4249O963j0692k6294K46j0032r209J1363J5844l330R448M272
4661A4748J9366k2610O032M92P26l218q785K099J672j9367r090K7501M276j3159
4647F83j4251N837m940J418k916j2548j4357j2073K7695L2404j678N900k770j7777
4633i373l4295J4261K3816J8951j196n86o050j289j1876j1680R285N344J3384
4620H696J6208P37j1428k616J0277j708L468j2263j5871K509K1529o080l0851
$$ plain form
4607 -17393 -2411 1405 -6241 -14871 -4263 -8923 -2422 396 -16566 -10580 3164 8285 9235 26626
4593 26626 41306 1201 4307 -14347 -30408 -32180 -4714 802 -19688 -22332 -11504 -10205 -22480
4580 -22480 -13480 -13183 11754 24548 -93 -14490 -22382 -5031 -15666 -15186 -18292 -17992 -2517 -7657
4566 -7657 -10300 1223 -13470 -9183 -12925 -17006 -10309 -21228 -10839 -18982 -26083 -20028 9600 16098
4552 16098 4682 25003 18979 -3055 11686 15204 30246 13697 -3547 -12500 -81 12369
4540 12369 13442 5291 -10783 -17007 -3152 19008 19038 25097 11235 -580 15180 51710 57892
4527 57892 39658 14239 -8641 477 11612 -6582 -8913 -18436 -4620 7370 4360 -2239 1026
4514 1026 166 -20890 -43439 -52589 -39876 -14953 -15264 -23609 -17554 -18465 -25816 -36602 -47406 -22687
$$ packed form
4607a7393J4982L816p646q630J0608m660O501K818j6962N986J3744N121R50J7391
4593B6626J4680m0105L106j8654j6061j772K7466N516k0490k644J0828J299j2275
4580b2480R000K97K4937J2794k4641j4397p892J7351j0635M80l106L00J5475n140
4566g657k643J1523j4693M287l742m081O697j0919J0389q143p101O055K9628O498
4552A6098j1416K0321o024k2034J4741L518J5042j6549j7244q953J2419J2450
4540A2369J073q151j6074o224J3855K2160L0O059j3862j1815J5760L6530O182
4527E7892j8234k5419k2880R118J1135j8194k331r523J3816J1990l010o599L265
4514A026q60k1056k2549r150J2713K4923l11q345O055r11p351j0786j0804K4719
$$ plain form
4500 -22687 2201 14984 22489 12745 23829 29412 29824 41065 52290 51920 18763 -677 -1191 9579
4486 9579 18689 33319 19827 509 -2085 -2854 -7773 12143 20343 4462 -13171 -8410 -9728 -9480
4472 -9480 -2427 -24213 -21026 -19878 -30207 -22378 -25256 -27878 -16198 -15541 -9347 -14711 56 1097
$$ packed form
4500b2687K4888J2783P505r744J1084N583M12J1241J1225l70l3157j9440n14J0770
4486I579R110J4630j3492j9318k594p69m919J9916Q200j5881j7633M761j318K48
4472i480P053k1786L187J148j0329P829k878k622J1680O57O194n364J4767J041
$$ [...]
##END NTUPLES=NMR SPECTRUM
##END=
