##TITLE=Analysis number 326822
Compound Code cc 52916
Book Reference 423/134/1
Project Code adrs
Chemist Name bruced
##JCAMPDX= 6.0         $$ Bruker NMR JCAMP-DX V2.0
##DATA TYPE= NMR SPECTRUM
##DATA CLASS= NTUPLES
##ORIGIN= Bruker BioSpin GmbH
##OWNER= nmr
$$ XWIN-NMR		Version 3.5
$$ Fri Feb 23 08:48:07 2007 GMT Standard Time (UT+0h)  MAYBRIDGE\nmr@NMR_250MHZ
##.OBSERVE FREQUENCY= 250.131544655141
##.OBSERVE NUCLEUS= ^1H
##.ACQUISITION MODE= SIMULTANEOUS (DQD)
##.ACQUISITION SCHEME= undefined
##.AVERAGES= 16
##.DIGITISER RES= 18
##SPECTROMETER/DATA SYSTEM= dpx250
##.PULSE SEQUENCE= zg30
##.SOLVENT NAME= CDCl3
##.SHIFT REFERENCE= (INTERNAL, CDCl3, 0, 16.4635)
##AUDIT TRAIL= $$ (NUMBER, WHEN, WHO, WHERE, WHAT)
$$ ##TITLE= Audit trail, XWIN-NMR		Version 3.5
$$ ##JCAMPDX= 5.01
$$ ##ORIGIN= Bruker BioSpin GmbH
$$ ##OWNER= nmr
$$ C:\u/data/dgb/nmr/ADRS/1900/pdata/1/auditp.txt
$$ ##AUDIT TRAIL=  $$ (NUMBER, WHEN, WHO, WHERE, WHAT)
(   1,<2007-02-23 08:47:23.43 +000>,<MAYBRIDGE\nmr>,<NMR_250MHZ>,
      <created by zg, POWCHK disabled, PULCHK disabled
       configuration hash MD5:
       49 4B E0 1D 92 C2 6B 37 9F E6 65 BC 52 41 86 1D
       data hash MD5: 64K
       2C E9 97 1B F7 43 58 40 B9 A6 3B 23 6D 5F 7C 38>)
(   2,<2007-02-23 08:47:43.79 +000>,<MAYBRIDGE\nmr>,<NMR_250MHZ>,
      <Start of raw data processing
       ef LB = 0.3 FT_mod = 6 PKNL = 1 SI = 32K 
       data hash MD5: 32K
       33 7A 3C AF FC 32 C5 61 23 8A F5 E2 7A EC 8E 0A>)
(   3,<2007-02-23 08:47:49.08 +000>,<MAYBRIDGE\nmr>,<NMR_250MHZ>,
      <apk 
       data hash MD5: 32K
       CE E1 31 78 42 BA A3 1A 6D E2 84 BE 58 EA D2 4A>)
(   4,<2007-02-23 08:47:50.55 +000>,<MAYBRIDGE\nmr>,<NMR_250MHZ>,
      <abs ABSG = 5 
       data hash MD5: 32K
       CC CC 25 03 2D F0 EF 6A 62 32 86 06 A5 E8 B6 72>)
$$ ##END=
$$ 
$$ hash MD5
$$ 5A F6 9B A7 85 B6 C4 CD 48 B8 EF 84 0F 94 A4 7B
##$RELAX= 
##$RELAX= 
##$RELAX= 
##$RELAX= 
##$RELAX= 
##$RELAX= 
##$RELAX= 
$$ Bruker specific parameters
$$ --------------------------
##$DU= <C:\u>
##$EXPNO= 1900
##$NAME= <ADRS>
##$PROCNO= 1
##$TYPE= <nmr>
##$USER= <dgb>
##$AMP= (0..31)
100 100 100 100 100 100 100 100 100 100 100 100 100 100 100 100 100 100 
100 100 100 100 100 100 100 100 100 100 100 100 100 100 
##$AQSEQ= 0
##$AQ_mod= 3
##$AUNM= <au_zg>
##$AUTOPOS= <44 >
##$BF1= 250.13
##$BF2= 250.13
##$BF3= 250.13
##$BF4= 250.13
##$BF5= 500.13
##$BF6= 500.13
##$BF7= 500.13
##$BF8= 500.13
##$BYTORDA= 1
##$CFDGTYP= 0
##$CFRGTYP= 5
##$CHEMSTR= <none>
##$CNST= (0..31)
1 1 145 1 1 1 1 1 1 1 1 1 1 1 1 1 1 1 1 1 1 1 1 1 1 1 1 1 1 1 1 1 
##$CPDPRG= <>
##$CPDPRG1= <>
##$CPDPRG2= <>
##$CPDPRG3= <>
##$CPDPRG4= <mlev>
##$CPDPRG5= <mlev>
##$CPDPRG6= <mlev>
##$CPDPRG7= <mlev>
##$CPDPRG8= <mlev>
##$CPDPRGB= <>
##$CPDPRGT= <>
##$D= (0..31)
0 1 0 0 0 0 0 0 0 0.06 0 0 0 0 0 0 0.0002 0 0 0 0 0 0 0 0 0 0 0 0 0 0 
0 
##$DATE= 1172220441
##$DBL= (0..7)
120 120 120 120 120 120 120 120 
##$DBP= (0..7)
150 150 150 150 150 150 150 150 
##$DBP07= 0
##$DBPNAM0= <>
##$DBPNAM1= <>
$$ [...]
##$SUBNAM7= <"">
##$SUBNAM8= <"">
##$SUBNAM9= <"">
##$SW= 20.6930455092707
##$SWIBOX= (0..15)
0 0 3 0 0 0 0 0 0 0 0 0 0 0 0 0 
##$SW_h= 5175.983436853
##$TD= 65536
##$TD0= 1
##$TE= 295.16
##$TE2= 300
##$TE3= 300
##$TEG= 300
##$TL= (0..7)
0 120 120 120 120 120 120 120 
##$TP= (0..7)
150 150 150 150 150 150 150 150 
##$TP07= 0
##$TPNAME0= <>
##$TPNAME1= <>
##$TPNAME2= <>
##$TPNAME3= <>
##$TPNAME4= <>
##$TPNAME5= <>
##$TPNAME6= <>
##$TPNAME7= <>
##$TPOAL= (0..7)
0.5 0.5 0.5 0.5 0.5 0.5 0.5 0.5 
##$TPOFFS= (0..7)
0 0 0 0 0 0 0 0 
##$TUNHIN= 0
##$TUNHOUT= 0
##$TUNXOUT= 0
##$USERA1= <user>
##$USERA2= <user>
##$USERA3= <user>
##$USERA4= <user>
##$USERA5= <user>
##$V9= 5
##$VALIST= <valist>
##$VCLIST= <CCCCCCCCCCCCCCC>
##$VD= 0
##$VDLIST= <DDDDDDDDDDDDDDD>
##$VPLIST= <PPPPPPPPPPPPPPP>
##$VTLIST= <TTTTTTTTTTTTTTT>
##$WBST= 1024
##$WBSW= 4
##$XGAIN= (0..3)
0 0 0 0 
##$XL= 0
##$YL= 0
##$YMAX_a= 371489
##$YMIN_a= -418115
##$ZGOPTNS= <>
##$ZL1= 120
##$ZL2= 120
##$ZL3= 120
##$ZL4= 120
##$ABSF1= 16.46353
##$ABSF2= -4.229643
##$ABSG= 5
##$ABSL= 3
##$ALPHA= 0
##$AQORDER= 0
##$ASSFAC= 0
##$ASSFACI= 0
##$ASSFACX= 0
##$ASSWID= 0
##$AUNMP= <proc_1d>
##$AZFE= 0.1
##$AZFW= 0.1
##$BCFW= 0
##$BC_mod= 0
##$BYTORDP= 0
##$COROFFS= 0
##$CY= 12.5
##$DATMOD= 1
##$DC= 0
##$DFILT= <>
##$DTYPP= 0
##$F1P= 14.0000005364418
##$F2P= -0.99999901652339
##$FCOR= 0.5
##$FTSIZE= 32768
##$FT_mod= 6
##$GAMMA= 0
##$GB= 0
##$INTBC= 1
##$INTSCL= 1
##$ISEN= 128
##$LB= 0.3
##$LEV0= 0
##$LPBIN= 0
##$MAXI= 10000
##$MC2= 0
##$MEAN= 0
##$ME_mod= 0
##$MI= 0
##$NCOEF= 0
##$NC_proc= -4
##$NLEV= 6
##$NOISF1= 0
##$NOISF2= 0
##$NSP= 0
##$NTH_PI= 0
##$NZP= 0
##$OFFSET= 16.46353
##$PC= 1
##$PHC0= 225.0282
##$PHC1= 3.078035
##$PH_mod= 1
##$PKNL= yes
##$PPARMOD= 0
##$PSCAL= 4
##$PSIGN= 0
##$REVERSE= no
##$SF= 250.130014624775
##$SI= 32768
##$SIGF1= 0
##$SIGF2= 0
##$SINO= 400
##$SIOLD= 32768
##$SREGLST= <1H.CDCl3>
##$SSB= 0
##$STSI= 32768
##$STSR= 0
##$SW_p= 5175.98343685301
##$SYMM= 0
##$S_DEV= 0
##$TDeff= 65536
##$TDoff= 0
##$TI= <Analysis number 999999
Compound Code 99
Book Reference 9
Project Code 9>
##$TILT= no
##$TM1= 0
##$TM2= 0
##$TOPLEV= 0
##$USERP1= <user>
##$USERP2= <user>
##$USERP3= <user>
##$USERP4= <user>
##$USERP5= <user>
##$WDW= 1
##$XDIM= 32768
##$YMAX_p= 332531109
##$YMIN_p= -117684
$$ End of Bruker specific parameters
$$ ---------------------------------
##NTUPLES= NMR SPECTRUM
##VAR_NAME=  FREQUENCY,     SPECTRUM/REAL,   SPECTRUM/IMAG
##SYMBOL=    X,             R,               I
##VAR_TYPE=  INDEPENDENT,   DEPENDENT,       DEPENDENT
##VAR_FORM=  AFFN,          ASDF,            ASDF
##VAR_DIM=   32768,         32768,           32768
##UNITS=     HZ,            ARBITRARY UNITS, ARBITRARY UNITS
##FACTOR=    0.157963299565203, 1,           1
##FIRST=     4118.0228963197, 0,             0
##LAST=      -1057.96054053331, 0,           0
##MIN=       -1057.96054053331, -117684,     0
##MAX=       4118.0228963197, 332531109,     0
$$ Real data points
##PAGE= N=1
##DATA TABLE= (X++(R..R)), XYDATA
$$ [...]
15659D1633J1400o082k7746q581P189j4255J7268J6601j637k3232j2587K8303
15647B8274K6218j5732l2936j1331R250l2016J176K1225k083J907k8085R17j24
15634c3340P407L6982N5500j5656k4421J745q865j9014J8512N329m613j559j2425
15621E582Q234J0777j6043j039K6998J6501q45l3258o774K1817J6123j6488p144
15608B4441M160J4164j0064j4833J7233J7502k3941p554J8127L8642P642j3119
15596G2400M226l3499k4766j7395K584K6530K1293P563m375k0281l0148m145K6425
15583B6412R601k546p606k1536N514m76J722J7710O262L0756J4380k923K7640
15570A04910J9647q725l3419m3800M930M886k7332N405L57o47N086K6848n530
$$ plain form
15659 41633 53033 46951 19205 10624 17813 3558 20826 37427 35790 12558 -29 28274
15647 28274 54492 38760 5824 -5507 3743 -28273 -27097 -5872 -7955 -6048 -34133 -33216 -33340
15634 -33340 -25933 11049 66549 50893 26472 28217 19352 338 18850 24179 19566 18007 5582
15621 5582 13816 24593 8550 7511 34509 51010 50165 16907 10133 31950 48073 31585 24441
15608 24441 28601 42765 32701 17868 35101 52603 28662 21108 39235 77877 85519 72400
15596 72400 76626 43127 18361 966 3550 30080 51373 58936 54561 34280 4132 -13 26412
15583 26412 36013 33467 25861 4325 9839 9363 11085 28795 35057 65813 80193 77270 104910
15570 104910 124557 115832 82413 38613 43543 48429 21097 26502 26859 26212 31298 58146 52616
15557E2616o810L1536j8159j4367o664R126J7175j2527K3084m765j5975k525K0426
15544G2171J9514j7558j984m79O872M604m8723q28P053j595j958K0604L971k2108
15530C9556J7547K1535m886J658J0313k2553j7143p725R614k4946L0941J4860
15518F8771j2255N304J4838n72k8667r078o651j8386K2663r78l96L121m156n111
15504B8447p824q127J6398L358j775L7272J1796l0822j3825J1166J9329K941k1700
15491D6634K709J3459l874j1437J4313J2762j873j962K531j0585p710l2500m765
15478A7702K4396j2467j2233k3021p842J734K1589K6374k4860j0887L1999J3003
15466D5487q418q60J2323M488M123M623j428n19O636j2034o638q223M815M814
$$ plain form
15557 52616 45806 77342 59183 44816 38152 47278 64453 51926 75010 70245 54270 51745 72171
15544 72171 91685 74127 72143 71664 78536 83140 34417 33589 40642 39047 37089 57693 61664 39556
15530 39556 57103 78638 73752 75410 85723 63170 46027 38302 47916 22970 53911 68771
15518 68771 56516 61820 76658 76086 47419 38341 31690 13304 35967 34989 34593 37714 33558 28447
15504 28447 20623 12496 28894 32252 30477 67749 79545 48723 34898 46064 65393 68334 46634
15491 46634 49343 62802 58928 47491 61804 74566 72693 70731 73262 62677 54967 22467 17702
15478 17702 42098 29631 17398 -5623 -13465 -11731 9858 36232 11372 485 32484 45487
15466 45487 37069 36209 48532 53020 57143 61766 60338 59819 66455 54421 47783 39560 44375 49189
15452D9189j4174j0543K6632j1477j0829j179P982J7736j0954r112J0958J5673
15440E9902j8433p708k727L606l5997K0327J5458J782n162k2216j3003R46K1871
15427A8646j0704j7581J7038J5710q11N977Q1k8224M9N785m411n588R094R898
15413A4959m851P336k1175O293K7591M946j2430M856K4949J2412K6j5332j680
15400D7900O705k8825m929N751o675n718j50k6943P374J6289j4591J759r217O66
15386a0604q813L12O861M778M193j788R22J0678q330k6830K831M206m927n609
15372c2120J0166K5521L9477J736q375J3654l9287m7216J0660K4925K1784o434
15360A4491j9365K1302J7983J7196L961m4747l448J6581j4510L632K452k4658
$$ plain form
15452 49189 35015 24472 51104 39627 28798 27619 35601 53337 42383 33271 44229 59902
15440 59902 41469 33761 31034 34640 -1357 18970 34428 36210 31048 8832 -4171 -3225 18646
15427 18646 7942 -9639 7399 23109 22298 28275 28356 132 181 5966 1555 -4033 5061 14959
15413 14959 10108 17444 -3731 2562 30153 35099 22669 27525 52474 64886 64912 49580 47900
15400 47900 54605 25780 20851 26602 19927 14209 14059 -12884 -5510 10779 -3812 -2053 -11270 -10604
15386 -10604 -19417 -19105 -12244 -7466 -3273 -5061 -4139 6539 -1791 -28621 -25790 -21584 -26511 -32120
15372 -32120 -21954 3567 43044 44780 36405 50059 10772 -36444 -25784 -859 20925 14491
15360 14491 -4874 16428 34411 51607 55568 10821 7373 23954 9444 13076 15528 -9130
15348i130j3419j2033l877K1458O691O764k3400o061J6825L5308L7375k9637p885
15335A8979k915k983k5923j7985J7975L524J3192M659L1252L173j7873l3712l4445
15322d3082j5951R793J6938K4161j1448k9794J7894J0031O362J2968j7135J0728
15310h535N030j9089J1451K0531K1751n010l8783j4924R182M848O634j2046m283
15297b3243J8484k118J5153k1362o115J9157j156K1430L153k2923j2331J7608
15285E737K8936K283k3913LJ7689p621j8478J7274O402J7580j750M38m203r83
15271C9394p844j0782j4930l903M900k050K4747K0227l1107j3925Q212q536q489
15258d086N277j4112j0616p555K3083k883P90J8561K0939j4739k8830j2215j9332
$$ plain form
15348 -9130 -22549 -34582 -38459 -17001 -10310 -3546 -26946 -33007 -16182 19126 56501 26864 18979
15335 18979 16064 13081 -12842 -30827 -12852 -9328 3864 8523 39775 42948 25075 -8637 -43082
15322 -43082 -59033 -49240 -32302 -8141 -19589 -49383 -31489 -21458 -15096 -2128 -19263 -8535
15310 -8535 -3505 -22594 -11143 9388 31139 26129 -12654 -27578 -18396 -13548 -6914 -18960 -23243
15297 -23243 -4759 -6877 8276 -13086 -19201 -44 -1200 20230 23383 460 -11871 5737
15285 5737 34673 36956 13043 13046 30735 23114 4636 21910 28312 45892 44142 44580 40377 39394
15271 39394 31550 20768 5838 1935 6835 4785 29532 49759 18652 4727 12939 4403 -4086
15258 -4086 1191 -12921 -23537 -31092 -8009 -10892 -10102 8459 29398 14659 -14171 -26386 -45718
15245d5718Q235K0610L5959K3659M425j4739m691J1712j3166r641J2528k1655
15233G518k857j3199k7470J4473L7103R369k0463k5327P589O235M708j5467q583
15220b6371K4518j064j7682J5424J2749j7037k5236k0853j909J0117p15r831L1878
15207b6012J8486K4808l142j1444N281j5867r515J9191N2239m904k6970K879j044
15194B3986J4312r614j7342L4518k2888l1344K3731L4142M603k5575m4639J956
15182a4154L607j5268Q611j0709J7349K6993Q864N955J259O02j1338r75J5550
15169C6346J5713q895j7794q824K2453n775r910m3268j4104J1372O387M012J1125
15156a162P207J1742o752j1944j654o398L793j5047j1176M419R586M298N016j3062
$$ plain form
15245 -45718 -37483 -16873 19086 42745 47170 32431 27740 39452 26286 16645 29173 7518
15233 7518 4661 -8538 -36008 -21535 15568 24937 4474 -20853 -13264 -7029 -2321 -17788 -26371
15220 -26371 -1853 -2917 -20599 -5175 7574 -9463 -34699 -55552 -57461 -47344 -48059 -57890 -26012
15207 -26012 -7526 17282 14140 2696 7977 -7890 -17405 1786 54025 49121 22151 25030 23986
15194 23986 38298 28684 11342 45860 22972 -8372 15359 49501 54104 28529 -16110 -14154
15182 -14154 -10547 -25815 -17204 -27913 -10564 16429 25293 31248 32507 33109 21771 20796 36346
15169 36346 52059 43164 25370 16546 38999 33224 23314 -19954 -34058 -22686 -16299 -12287 -1162
15156 -1162 6045 17787 11035 -909 -2563 -8961 -5168 -20215 -31391 -26972 -17386 -13088 -8072 -21134
15142b1134j2489K0148J0236L198J0995m069l8905l38L8192j547k1932J1937K480
15129c228j1579L886Q194O267r687j7083j157L2473o161J3234K93j2480j3416
15116a0444Q337m860N236J9754J0986M440Q91N768r044l3690j4300q733r802K9558
15102e903K7383m650J3249k4234l7257J1910J4416P886K574n715L183O217r500
15089d41j6065J3643K9494j3361q539K4632K7574J1761j9522r654j1982N299K0038
15076E2877j0382n421J2425n694l3044l001J0045J0735j5505j1199L637N280p783
15063B970L0068l659J0122K9658O244j7335l8078n051N825J593J65j48J58K3543
15049D6075K2057j0992k6107j3647j7936k790Q990J2834k459J2694K6639M123
$$ plain form
15142 -21134 -33623 -13475 -3239 -41 10954 6885 -32020 -32358 5834 4287 -17645 -5708 -3228
15129 -3228 -14807 -10921 -2727 3540 -6147 -23230 -24387 8086 1925 15159 15452 2972 -10444
15116 -10444 -2107 -6967 -1731 18023 29009 33449 34340 40108 31064 -2626 -16926 -25659 -35461 -5903
15102 -5903 21480 16830 30079 5845 -31412 -19502 -5086 2800 5374 -341 2842 9059 -441
15089 -441 -16506 -2863 26631 13270 4731 29363 56937 68698 49176 39522 27540 32839 52877
15076 52877 42495 37074 49499 43805 10761 7760 17805 28540 13035 1836 5473 10753 2970
15063 2970 33038 29379 39501 69159 75403 58068 19990 14939 20764 22357 22522 22374 22532 46075
15049 46075 68132 57140 31033 17386 -550 -3340 5650 18484 16025 28719 55358 59481
15037E9481j2522k5172j5657J5375K4888J3955J4116J6339k5288l6353j2233L702
15025B0631K7394K3104j1020j6831n74j003j430J3293j4668m4626j313J2659K5963
15012C1579K1612O096k4372o188j3926n89J0427l612J6662K0104O331J2738m811
14999G2051O49Q204j0775J5335J9633P535L2251O750M011N9918J12539K12208
14987E40309L47578M01805J21903l03959m07610k94225j51193o5605p1075o3655
14977E4273l0993l9888K2157L6938q244L691L669O770j465j3532l255j6599p634
14964E888j93k758o291J1777l774K0190J4844j0937m297k479o311N54L504K5179
14950D4896j3185m7992k5722j684J5389j5096J4023L6911K1682J1519j832r984
$$ plain form
15037 59481 46959 21787 6130 21505 46393 60348 74464 90803 65515 29162 16929 20631
15025 20631 48025 71129 60109 43278 42704 41701 40271 53564 38896 -5730 -7043 5616 31579
15012 31579 53191 59287 34915 28727 14801 14212 24639 21027 37689 57793 64124 76862 72051
14999 72051 72700 80904 70129 85464 105097 112632 144883 151633 155644 215562 328101 540309
14987 540309 887887 1289692 1411595 1107636 700026 405801 254608 189003 117928 54273
14977 54273 23280 -16608 5549 42487 34243 37934 41603 48373 46908 33376 30121 13522 5888
14964 5888 5695 2937 -3354 8423 4649 24839 39683 28746 24449 21970 15659 16213 19717 44896
14950 44896 31711 -16281 -42003 -43687 -28298 -43394 -29371 7540 29222 40741 38909 28925
14938B8925l5265j6453m909j352R266N610J3137j198j6420j3176J2814n846O532
14925a8335M527K0102K4794j5624j7325l1499o718J8670n592J2615J5953K1287
14913B2855p34k6326O48k1966K870K4790O329j6289J5711M4940K0176k3605K980
14900E2379J991r684j0778j8918p685J8225L0087j4199k8537q600R130R232k5917
14887c274k2075K5673j5994R742K2316m446J1302J3830m357k2890j1127j5062
14875a6362Q600j2415O266P489K2J9928J0276k0798P267n508j5560j9303J0408
14862a9690l055l5878K1501K8083J4172j0254j2255R8P896j3405j3569R557j7000
14849d3799j5899R064P597P302L1658L223j5432j8182k915K5767J1504m737O471
$$ plain form
14938 28925 -6340 -22793 -27702 -29054 -19788 -14178 -1041 -2239 -18659 -31835 -19021 -24867 -18335
14925 -18335 -13808 6294 31088 15464 -1861 -33360 -40078 -21408 -27000 -14385 1568 22855
14913 22855 22121 -4205 -3557 -25523 -22653 2137 8466 -7823 7888 52828 73004 49399 52379
14900 52379 54370 44686 33908 14990 7305 25530 55617 41418 12881 4281 13411 22643 -3274
14887 -3274 -25349 324 -15670 -5928 16388 11942 23244 37074 32717 9827 -1300 -16362
14875 -16362 -7762 -20177 -13911 -6422 -6400 13528 23804 3006 10273 4765 -10795 -30098 -19690
14862 -19690 -22745 -58623 -37122 -9039 5133 -5121 -17376 -17278 -9382 -22787 -36356 -26799 -43799
14849 -43799 -59698 -50634 -43037 -35735 -4077 -854 -16286 -34468 -37383 -11616 -112 -4849 1622
14836A622J515k0519j1400J2677j7652k3818p874J3142K1893J1807N663O857p779
14823a3866r185J10j7284J8816K0903L252J9689m067M615J4623j6915n927j2448
14810B316k423k1527j2694q982L261l7021l219Q876n41J0114J7372J4278J8870
14797a1320j8322L306p565j0997J1502J0526J5720n80l8571o617K2930L8529o778
14784A763l2546j065o802R686J7020k6810j2008R926K4327K4470l139N453L37
14771A0612J0527k6549j994J2132o301L881q819K3415J2735p130j4672j0052J02
14758b113L917m932j9251j2599J9953K0792N186J857n316j9284j2146J141L3791
14745A0996J3423J0135k2946r951m544j6435q471K4376j4300j8807r499K3464
$$ plain form
14836 1622 3137 -17382 -28782 -16105 -33757 -57575 -65449 -52307 -30414 -18607 -12944 -6087 -13866
14823 -13866 -23051 -22941 -40225 -21409 -506 2746 22435 18368 22983 37606 20691 14764 2316
14810 2316 -107 -21634 -34328 -43310 -40049 -77070 -80289 -71413 -71954 -61840 -44468 -30190 -11320
14797 -11320 -29642 -26336 -33901 -44898 -33396 -22870 -7150 -7730 -46301 -52918 -29988 8541 1763
14784 1763 -30783 -31848 -38650 -28964 -11944 -38754 -50762 -40836 -16509 7961 4822 10275 10612
14771 10612 21139 -5410 -7404 4728 -1573 2308 -6511 16904 29639 22509 7837 -2215 -2113
14758 -2113 1804 -3128 -22379 -34978 -15025 5767 10953 12810 7494 -11790 -23936 -22795 10996
14745 10996 24419 34554 11608 1657 -2887 -19322 -27793 -3417 -17717 -36524 -46023 -22559
14733b2559j0985q986k3884n17L3857K1087Q426j198j4101j5029j5056j2126K4311
14720c6760J1517k3429p478O1645M2902l7160l8248j8061J1802n748m361R758
14708c3621K5584J2593l8974q386K213n1Q718j9816O487J3663K316j5990J4257
14695c1007K9110P78m833m350j3378l011L5751j9081j2666j3790l571K7311L6027
14682B3290O056j0946J4824j534k8038l269j100j9756O4N779L826J5134Q767k2539
14668i442l8147j8267j7260K3866n160J4693J2672o837J0256J4341j3916j9412
14656e2613l239J7771P347J7415J5006K500N431n435l2196M465K5059o122l5742
14643d0353k3970J1963m738J9612K4211K2052K5325k5029l2613L69N878Q739J3068
$$ plain form
14733 -22559 -33544 -42530 -66414 -66931 -33074 -11987 -3561 -4759 -18860 -33889 -48945 -61071 -36760
14720 -36760 -25243 -48672 -56150 5495 48397 11237 -27011 -45072 -33270 -39018 -43379 -33621
14708 -33621 -8037 4556 -34418 -42804 -40591 -40642 -31924 -51740 -45253 -31590 -29274 -45264 -31007
14695 -31007 -1897 -1119 -5952 -10302 -23680 -26691 9060 -10021 -22687 -36477 -40048 -12737 23290
14682 23290 29346 18400 33224 31690 3652 383 -717 -20473 -20409 -14630 -10804 4330 13097 -9442
14668 -9442 -47589 -65856 -83116 -59250 -64410 -49717 -37045 -43882 -33626 -19285 -33201 -52613
14656 -52613 -55852 -38081 -30734 -13319 1687 4187 9618 4183 -28013 -23548 1511 -4611 -40353
14643 -40353 -64323 -52360 -57098 -37486 -13275 8777 34102 9073 -23540 -23171 -17293 -8554 4514
14630D514n109k2349K0338J7534r398q135R701L759K73o407j3619J5593n71j0206
14616d082O959N177j4927j0353J9098j779Q539N351L71J6987J1589j4139q468
14603B0323J1768j4304j397J1528Q094l4414l5984n838n071J8551K3684J1166
14591H106R959o777o441l4539J7069k2473j9845K837J9210J1907J5249J8647J4446
14578B7355j664k4829k8664k8064P587J3454J8592K27q275Q611L9646K6270k0872
14565B9374j7870j5189k1589K6636L3365M422J8857m401n830P327j2401k0788
14553B1913r85R767M541j1530J3993r809k2927M152N0P716K124J6893J6764k3280
14539B9382p016p822j6689N358J4225r540l426J1665L748j8014k5101j8097j2599
$$ plain form
14630 4514 -595 -22944 -2606 14928 5530 -2605 7096 10855 11128 4721 -8898 6695 6124 -4082
14616 -4082 2877 8054 -6873 -17226 1872 93 8632 13983 14354 31341 42930 28791 20323
14603 20323 32091 17787 16390 27918 36012 1598 -34386 -40224 -45295 -26744 -3060 8106
14591 8106 18065 11288 4847 -29692 -12623 -35096 -54941 -52104 -32894 -20987 -5738 12909 27355
14578 27355 25691 862 -27802 -55866 -48279 -34825 -16233 -16006 -24281 -15670 23976 50246 29374
14565 29374 11504 -3685 -25274 1362 34727 39149 58006 53605 47775 55102 42701 21913
14553 21913 20928 30695 35236 23706 37699 27890 4963 9115 9165 16881 19005 35898 52662 29382
14539 29382 22366 14544 -2145 3213 17438 7898 4472 16137 19885 1871 -23230 -41327 -53926
14526e3926M669J4702J5191k7444j1048K5576J1589o704N215J1638J4961K5734
14514C0153J478l7401o968L221J3889n619j6531m079n405Q75J6948K5180K9262
14501D5003k1627n2328k6755R962L837J7370M329L527j307k701L9477L138k8864
14488f939o181N722k67p491l1368P111J4599J3553j0028M281J3640j6846J9547
14475f67j4967k2073P001R178J3863m494k2479J2302K1948p618m361J0405J0625
14462H663q628J5472J2862j1279p140M105O503R110R65J6364j7888k1474k9416
14449b1781n183j5384J5800M413M845L3407q725m9850n948N1245M5910j0758k0975
14436A7016j7759l4034J8580j5715j5953J9028n70M4876j956j7900n457l0298
$$ plain form
14526 -53926 -49257 -34555 -19364 -46808 -57856 -32280 -20691 -27395 -22180 -10542 4419 30153
14514 30153 31631 -5770 -12738 -9517 4372 -1247 -17778 -21857 -27262 -26387 -9439 15741 45003
14501 45003 23376 -28952 -55707 -45745 -41908 -24538 -20209 -16682 -17989 -20690 18787 21925 -6939
14488 -6939 -13120 -7398 -7665 -15156 -46524 -39413 -24814 -11261 -21289 -17008 -3368 -20214 -667
14475 -667 -15634 -37707 -30706 -21528 -7665 -12159 -34638 -22336 -388 -8006 -12367 -1962 8663
14462 8663 35 15507 28369 17090 9950 14055 20558 29668 30633 46997 29109 7635 -21781
14449 -21781 -26964 -42348 -26548 -22135 -17290 16117 7392 -42458 -48406 2839 48749 37991 17016
14436 17016 -743 -34777 -16197 -31912 -47865 -28837 -29407 15469 13513 -4387 -9844 -40142
14424d0142j7922j4327J015J5804J3346L1482K3386N196k069m697j1010N7j9821
14411a9702J5159M0863j466j1396k1671k6868O656K695J3176R795j4463n633Q883
14398c972n879M397m101j2194m403m477O791K0883L6355J9553j5501m8821M63
14385a0906O377j3282r229m996J2876L2670N132k5718O330k4939J1994N759k2468
14372c0400o586J2301K4066p134k5144j5921M089Q753O992J0072N54K466j130
14359a7022P969L2796k5K05j442K853J132j1365j9142m1697l0307K2612J1347
14346d2086J8643K474J4346o711r028L3754J9299k354k1790L334J5539r560m4085
14333b8225l8492j8118P574J0962Q932k5279l5038J1991M4786J6490P484m030
$$ plain form
14424 -40142 -58064 -72391 -71376 -55572 -42226 -10744 12642 17838 15769 11072 62 119 -19702
14411 -19702 -4543 36320 34854 23458 1787 -25081 -18425 -15730 -2554 7241 -7222 -12855 -3972
14398 -3972 -9851 -5454 -9555 -21749 -26152 -30629 -23838 -2955 33400 52953 37452 -11369 -10906
14385 -10906 -4529 -17811 -27040 -32036 -19160 13510 18642 -7076 -746 -25685 -13691 -7932 -30400
14372 -30400 -36986 -24685 -619 -7753 -32897 -48818 -44729 -35976 -28984 -18912 -18358 -15892 -17022
14359 -17022 -9053 23743 23718 23923 22481 25334 26466 15101 -4041 -45738 -76045 -53433 -42086
14346 -42086 -23443 -20969 -6623 -13334 -22362 11392 30691 28337 6547 9881 25420 15860 -28225
14333 -28225 -66717 -84835 -77261 -66299 -57367 -82646 -117684 -105693 -60907 -44417 -36933 -40963
14321d0963M2017K2302k232m0179k1405l161o998j733L924J2686K2131m00r969
14308b3980l203L863J7732j5094k5568q470K7710L0079K4497j2543K3385j4652
14296B3756K70r677l6394j0641L6630j6659j4668J6144o14m299k4972N05j7742
14283e8361J6723J3997k548K9037K9031k5548l2847k182L963J3758K0678M147
14271I848j2907k1590J642n689J1765J0589k5993l5217j1835L4994L5015L5297
14259B5919K634m982K3322O225r230k592j9206R86k461k420J8315J0142l4054
14246A2598q179j5839k064j4691M871J9604J2821J0159j3182K6644M959j6920
14234B0781k4757q129J9483O291P786k579J3390O597j7807J0739K385l9260j1379
$$ plain form
14321 -40963 1054 23356 21124 -19055 -40460 -43621 -50619 -52352 -48428 -35742 -13611 -14011 -23980
14308 -23980 -27183 -23320 -5588 -20682 -46250 -54720 -27010 3069 27566 15023 38408 23756
14296 23756 24026 14349 -22045 -32686 3944 -12715 -27383 -11239 -11853 -16152 -41124 -40619 -58361
14283 -58361 -41638 -27641 -30189 -1152 27879 2331 -30516 -32698 -28735 -14977 5701 9848
14271 9848 -3059 -24649 -23007 -28696 -16931 -6342 -32335 -67552 -79387 -44393 -9378 25919
14259 25919 28553 23571 46893 53118 43888 41296 22090 23076 20615 18195 36510 46652 12598
14246 12598 4419 -11420 -13484 -28175 -23304 -3700 9121 19280 6098 32742 37701 20781
14234 20781 -3976 -12105 7378 13669 21455 18876 32266 38863 21056 31795 34180 -5080 -16459
14221a6459q405J2999J9120k1280Q851L4650Q59l3136j5153J7803j2256K3789
14209A1382Q615k8630j6247O196K7484P572j1826k8920k694j1766J0581M373j6287
14196d0167j489J1714R353l123j065j427O774j3862l755R531J2917K4922K309
14183A2632K1252j5007n721J1998J7643o841j4744K470Q751k121R868O917j5676
14170C1421j3511P698p397J4332l228k1678N848K0839l0148k0534J6422K21k1785
14157b1500J3674J1910k945L441n65j2050j645N308O66K1022K2815j3750k1719
14144D662k3926J0063J1287L688j4959r32J9895J3739m46l0173l682J5162J3909
14131A8287J0721j7311q230O426J6859j0799j7148N680J4274j1468j2873N441
$$ plain form
14221 -16459 -24864 -11865 7255 -14025 -5174 29476 30335 -2801 -17954 -151 -12407 11382
14209 11382 19997 -8633 -24880 -18684 8800 16372 4546 -24374 -27068 -38834 -28253 -23880 -40167
14196 -40167 -41656 -29942 -20589 -23712 -24777 -26204 -19430 -33292 -37047 -27516 -14599 10323 12632
14183 12632 33884 18877 13156 25154 42797 35956 21212 23682 32433 30312 40180 47097 31421
14170 31421 17910 25608 18211 32543 29315 7637 13485 34324 4176 -16358 64 285 -21500
14157 -21500 -7826 4084 1139 4580 4015 -8035 -9680 -4372 -3706 17316 40131 26381 4662
14144 4662 -19264 -9201 2086 5774 -9185 -10117 9778 23517 23071 -7102 -10784 4378 18287
14131 18287 29008 11697 3467 9893 26752 15953 -1195 4485 18759 7291 -5582 -141
14119a41P110p444k1441J9402K0091j2064j9218p266j1772J7623K631L581J3985
14106E077j5390j9818J6424J7729Q549J4253k1362r904K6515J5652R741k9107
14094A8359j750l005J3143J4590K1475m5542k2687j8709o83j760P151L1966R478
14081B2026J7932j0196l1572Q755L50r381L816p90N706j5583r40J4813n777N561
14067D720J6355J7325J3132k5878j9658l6760k9410R92K6464K7745J3006o151
14055A882j6949l840j4982K0652j4888J4509P484J6721n551Q099K517k3288O9
14042g565K0038j448q577J902J6389j5893l6942K4596L4467K1947q852Q925j998
14029D6989j3968m4023m5670L759K7770Q629J2528r682N258K7911K1993l775P096
$$ plain form
14119 -141 6969 -475 -21916 -2514 17577 5513 -13705 -20971 -32743 -15120 -12489 -8908 5077
14106 5077 -10313 -30131 -13707 4022 12571 26824 5462 -4442 22073 37725 47466 18359
14094 18359 16609 13604 26747 41337 62812 17270 -5417 -24126 -24809 -26569 -19418 12548 22026
14081 22026 39958 29762 -1810 6945 7295 -2086 1730 940 6646 -8937 -9877 4936 -841 4720
14067 4720 21075 38400 51532 25654 5996 -30764 -60174 -59182 -32718 -4973 8033 1882
14055 1882 -15067 -18907 -33889 -13237 -28125 -13616 -6132 10589 5038 13137 15654 -7634 -7565
14042 -7565 12473 11025 2448 4350 20739 4846 -32096 -7500 26967 48914 40062 48987 46989
14029 46989 33021 -11002 -56672 -52913 -25143 -16514 -3986 -13668 -8410 19501 41494 37719 44815
14016D4815q954k6802P402J1113K903M934l2223k8448L5033J0886J0110K099N276
14003C8144r758j4040K1539k1685l3687J4599J5858M709J3019j5347k2052k9884
13991c8585k9031J7869L1899R913j8082J2673P773n064k6729N76J3722O415J0502
13978f149J435q922q575K0487J9240M593J086k8909k252J0884J7608J2354k5900
13965F980R498N396j0970J9213Q92R316P750J6842j5377l3790p802l4256k0447
13952d6755K3683K8906J0580J2556j2515J1019N895P986k3302k3078j2559j6818
13940c4402k497j3362j0K1159R154M1583J3985j8409O848Q099j0919K0173R14
13927D2316k357l0439Q419J5303K6760j3329k2830l861L2963o938P850M960k7874
$$ plain form
14016 44815 35861 9059 16461 27574 30477 35411 3188 -25260 9773 20659 30769 32868 38144
14003 38144 28386 14346 35885 14200 -19487 -4888 10970 15679 28698 13351 -8701 -38585
13991 -38585 -67616 -49747 -17848 -7935 -26017 -13344 -5571 -10635 -37364 -36788 -23066 -16651 -6149
13978 -6149 -4714 -13636 -22211 -1724 17516 22109 23195 -5714 -7966 2918 20526 32880 6980
13965 6980 16478 21874 10904 30117 31009 40325 48075 64917 49540 15750 7948 -26308 -46755
13952 -46755 -23072 5834 16414 28970 16455 27474 33369 41355 18053 -5025 -17584 -34402
13940 -34402 -36899 -50261 -50271 -29112 -19958 21625 35610 17201 24049 32148 21229 41402 42316
13927 42316 39959 9520 17939 33242 60002 46673 23843 19982 52945 46007 53857 58817 30943
13914C0943M691k749j7973l6626j3462N484j2400K234N202O50n070J0178J3078
13901a5820j5021J933O798k570K59P124P866j9826m391J4869k077k3557K5428
13888a8985L0050n520n942j4138L951K0766N087o082J773L571L313L417j7636
13875C625q288k0426J27J2792r365J9211K474J1971L855P280J197k5511K660m282
13861b680j431j967J1198K3137L48o970o173k7745J4268K2768L037Q876K1802
13848E8468K732k0312k4392k6366k0270J2256J6600L0505K9370r724l4056k5984
13836a1173J56J5396k4419l735J3618j9362Q528J3489J9060P64k4564K1211L302
13823A2271q792k1898k426q213p089R735q949J2442K5549n701m05J3414j8242
$$ plain form
13914 30943 35634 32885 14912 -21714 -35176 -29692 -42092 -39858 -34656 -34006 -39076 -28898 -15820
13901 -15820 -30841 -28908 -22110 -24680 -24421 -17297 -9431 -29257 -33648 -18779 -20856 -44413 -18985
13888 -18985 11065 5545 -397 -14535 -10584 10182 15269 9187 10960 14531 17844 21261 3625
13875 3625 -4663 -25089 -24962 -12170 -21535 -2324 150 12121 15976 23256 24453 -1058 1602 -2680
13861 -2680 -4111 -6078 5120 28257 28605 21635 15462 -12283 1985 24753 27790 36666 58468
13848 58468 61200 40888 16496 -9870 -30140 -17884 -1284 29221 58591 48867 14811 -11173
13836 -11173 -11017 4379 -20040 -23775 -10157 -29519 -20991 -7502 11558 12322 -12242 8969 12271
13823 12271 3479 -18419 -20845 -29058 -36147 -26412 -35361 -22919 2630 -3071 -3476 9938 -8304
13810h304j1686J1470J8671l181j687J3909o334j6861m061n266J6651J7424j1229
13797I516k6290R53J7381L381k312J2088p916n495P572K6785P399J114M510l450
13783D5236J3995j6308l2386j1145K8623j7309k7523l130J5123J0714j223j0273
13771e606J9525K5282j8497j5525O562j6344Q228J7243k2059l4619R886L2027
13759F103L6134j5667j7174J3719p933K684L710j2243o166J4341Q669k5195k5030
13746b4048j9475J5984R356k328J4001J4082L2172K9985J1527j6888j798j8246
13734D4324k7238j1765J3352M190J6607L5378q268l2048o442k644k4450q467L73
13721g098J2942J1608q505J6906l658R952J5809j5532j104r41N013N647r129j6236
$$ plain form
13810 -8304 -19990 -8520 10151 6970 5283 19192 12858 -4003 -8064 -13330 3321 20745 9516
13797 9516 -16774 -15821 1560 4941 2629 14717 6801 1306 8878 35663 43062 44176 48686 45236
13783 45236 59231 42923 10537 -608 28015 10706 -16817 -19947 -4824 5890 4667 -5606
13771 -5606 13919 39201 20704 5179 11741 -4603 3625 20868 -1191 -35810 -25924 6103
13759 6103 42237 26570 9396 23115 15182 17866 21576 9333 3167 17508 26177 982 -24048
13746 -24048 -43523 -27539 -18183 -20511 -6510 7572 39744 69729 81256 64368 62570 44324
13734 44324 17086 5321 18673 22863 39470 74848 66580 34532 28090 25446 996 -7471 -7098
13721 -7098 5844 17452 8947 25853 22195 32147 47956 32424 31320 30379 35392 41039 31910 15674
13707A5674J5262N006k1589j2746l0384j506L0072J5682q104q693q594n669P048
13694h541J3897J2496j3440j2070n408K9962K2304j2583J7727P45k4596l0207
13682i714j623L272J6971j242R37j8094J2019o491P161J204N322j802j6158q983
13668a7221l0588K0925N7607k9125j5914Oj197L99K1348L5165l086l6920j0077
13655h678o38J7261J4956j1028P82K7206R662j5923j5657O400L7844J9911m6672
13642C5426l4707j2141J7319K1523j9431q509n195j6372K0331M0664J1352r647
13630D0613l1120J6336N552j683J993J9973m1087o6289J7536M2670J3781j596
13618A6679j9454p500L341J1590K4508J4416k0134k6221J3387J1097o971J2284
$$ plain form
13707 15674 30936 35942 14353 1607 -28777 -30283 -211 15471 7367 -1326 -9920 -15589 -8541
13694 -8541 5356 17852 4412 -7658 -13066 16896 39200 26617 44344 45089 20493 -9714
13682 -9714 -11337 -8065 8906 7664 8601 -9493 2526 -3965 3196 4400 9722 7920 -8238 -17221
13668 -17221 -47809 -26884 30723 1598 -14316 -14310 -15507 -15108 6240 41405 38319 1399 -8678
13655 -8678 -9316 7945 22901 11873 12655 39861 49523 33600 17943 24343 62187 82098 35426
13642 35426 719 -11422 5897 27420 7989 -520 -5715 -22087 -1756 38908 50260 40613
13630 40613 9493 25829 31381 29698 31691 51664 10577 -55712 -38176 4494 18275 16679
13618 16679 -2775 -10275 -6934 4656 29164 43580 23446 -2775 10612 21709 14738 27022
13606B7022j6223J3776k060j243K398R889o910J9451o303l4878K4046P665J73
13593C6803r895N285K63j7961J6906J4668j0875J9735K154J573K5134J627k4530
13580F0887m1270j7661J1396J0267P50R587K7498N245k3305p348j0799j6933j4548
13567f234K0172K0012K4472k1087J471j0648K040J5099m5396K639M3012J0559
13555E6111k2674k4234r189k4044K2635L1385j3921n014P23M949J7729l985r115
13542B1356J6797J8967k3122j9926J1037R190k409J5407K5971L453q850k4165
13530D3706k0043j8970J4716J9415l259j6858O999L282j415J8449M777r980m117
13517C6702k0578j1435j3805K9216J7545O846N599n48p265p153r226m650J0100
$$ plain form
13606 27022 10799 24575 22515 21272 23670 33559 26649 46100 39797 4919 28965 36630 36803
13593 36803 26908 32193 32456 14495 31401 46069 35194 54929 57083 58656 83790 85417 60887
13580 60887 19617 1956 13352 23619 24369 33956 61454 66699 43394 36046 25247 8314 -6234
13567 -6234 13938 33950 58422 37335 38806 28158 30198 45297 -99 2540 45552 56111
13555 56111 33437 9203 14 -24030 -1395 29990 16069 11055 11778 16727 34456 30471 21356
13542 21356 38153 57120 33998 14072 25109 34299 31890 47297 73268 76721 67871 43706
13530 43706 23663 4693 19409 38824 35565 18707 25706 28988 27573 46022 50799 40819 36702
13517 36702 16124 4689 -9116 20100 37645 44491 50090 49542 42277 35124 25898 21248 31348
13504C1348j8065r48K868J8198n785n957P192k269J6813L3273k6236k3436l0N497
13490C2463J6318L7072j7522j5849k0430p244J4895J4313K7053J0251l0282m057
13478E6981j259o761p579k391K3396j0585R503M408q176k074J0867N522k6405
13465D5447k2703n770K1159J2562k5801J0016J9235k7612p824J6311O580j4726
13453B6874O858K0613N080N587o412n100k2055j4058k1626K8890M4863j1130k927
13440E5457k3790j0768O880O225J9546J5234l130p07k6442k7336Q415k476J2670
13427B9778l14j3212P175L2967J6023Q341K006J1884j602J8093M462k3415k0208
13414G1978l3803M541n271m329n453q586q139K3742J3884J5620n444n865j9989
$$ plain form
13504 31348 13283 12335 15203 33401 27616 21659 28851 26582 43395 76668 50432 26996 26966 32463
13490 32463 48781 85853 68331 52482 32052 24808 39703 54016 81069 91320 61038 56981
13478 56981 55722 48961 41382 38991 62387 51802 61305 65713 57537 55463 66330 71852 45447
13465 45447 22744 16974 38133 50695 24894 34910 54145 26533 18709 35020 41600 26874
13453 26874 33732 54345 59425 65012 58600 53500 31445 17387 -4239 24651 69514 58384 55457
13440 55457 31667 20899 27779 34004 53550 68784 65654 64947 38505 11169 19584 17108 29778
13427 29778 29464 16252 23427 56394 72417 80758 82764 94648 93046 111139 115601 92186 71978
13414 71978 38175 42716 37445 33116 27663 19077 10938 34680 48564 64184 58740 52875 32886
13401C2886o117J1973q245L299j0920N244K0863l4005j2198N22k0798O459L5741
13388B4704L4614K2829n798j1886j0669l2894j4537o624J3332J7627J6141l325
13376D3514J9315k16j1763l1772q875L2085J4979p746j1333k2268j4608j782J2032
13363A1562J0490j1793l9300j9993L5829J0960m650K4161o707K5069j6401j5797
13351C430P246L6527j1823j1002L571j1261m032L0946l1468k4843j4057J4402
13339a2364K1945K3714J095L4080O087j8891N088q538p631j2174r666Q589Q693
13326D0027J00p41J54k9692k7454Q166K2971K7118N67j1346n998j1390N85K9149
13312D2216K3230J3976j0944k1145j3999j4362m427l254k426j3600J2386K2756
$$ plain form
13401 32886 26769 38742 30497 33796 22876 28120 48983 14978 2780 3302 -17496 -11037 24704
13388 24704 59318 82147 76349 64463 53794 20900 6363 -261 13071 30698 46839 43514
13376 43514 62829 62613 50850 19078 10203 42288 57267 49521 38188 15920 1312 -470 11562
13363 11562 22052 10259 -29041 -49034 -13205 -2245 -6895 17266 10559 35628 19227 3430
13351 3430 10676 47203 35380 24378 27949 16688 12656 43602 12134 -12709 -26766 -12364
13339 -12364 9581 33295 34390 68470 74557 55666 60754 52216 44585 32411 22745 31334 40027
13326 40027 40127 39386 39540 9848 -17606 -9440 13531 40649 41216 29870 23872 12482 13067 42216
13312 42216 65446 79422 68478 47333 33334 18972 14545 11291 8865 -4735 7651 30407
13300C0407j9170Q415J3531j563j8169J1807K3306q255j4638J2430K6301n095
13288E9307j2924k612L978K2525j9107j0147o960j168N355L268K2567R753k4502
13275D9333k1133M886O056M125m975m822K1948m19k4764l1122j529J7975J9086
13262C4645K4274J8942k7749j9539K720l357j2406M366J2916j1495K2300J1892
13250E7509j2855J9612Q783l0318J3034L2898J2356j4120m04K2293j0198j1922
13238H6668m2167j0461K6836K411k1681p947K185J6792p147J4565n623J6224J5676
13225H6331m1625k771j723R861J1063P369J9776J6773j1594l2478q396n61K8609
13212H0634J3352O02n499k669l89o665j5872k7886j6333j6634J9552M9424J5781
$$ plain form
13300 30407 11237 19652 33183 31620 13451 25258 48564 40309 25671 38101 64402 59307
13288 59307 46383 43771 47749 70274 51167 41020 34060 32892 38247 41515 64082 73835 49333
13275 49333 28200 33086 39142 43267 38292 33470 55418 54999 30235 -887 -2416 15559 34645
13262 34645 58919 77861 50112 30573 33293 29936 17530 21896 34812 23317 45617 57509
13250 57509 44654 64266 73049 42731 55765 88663 101019 86899 86495 108788 98590 86668
13238 86668 44501 34040 60876 63287 41606 33659 35844 52636 45489 60054 54431 70655 86331
13225 86331 44706 41935 40212 50073 61136 68505 88281 105054 93460 60982 52586 52025 80634
13212 80634 93986 94588 89089 86420 86031 79366 63494 35608 19275 2641 22193 71617 87398
13199H7398r973j7505j3883j2406p298J5323K0283O240l8531l2288K3253O418
13187B7031k243o810k723P691J7647Q54J5688L207j5147o360L2700K85l1296R055
13173D9579L5150J7898j7441l1538k7999J120Q771R666J4012j0053j8983Q701
13161C8883L725J6083K6946K9763m795j0451j0082j0022k7298R572L8672J1692
13149A12688k5336m3987r919J7052o097j0340L9743k999k4853O397K6927J6751
13137I6027j4387n540K121L1914j7726l1541l874j5083j4478M578R410J4485k5699
13124C0207k2689N200P309J3137J5142Q278m324L711k2172J220J19R532Q658K5248
13110G8576J5487k4620K101j344j6500P907j2851n010L3512K1497l7386L672M456
$$ plain form
13199 87398 77425 59920 46037 33631 26333 41656 61939 68179 29648 -2640 20613 27031
13187 27031 24788 17978 15255 22946 40593 41447 57135 60342 45195 38835 71535 71820 40524 49579
13173 49579 84729 102627 85186 53648 25649 26769 35540 45206 59218 49165 30182 38883
13161 38883 42608 58691 85637 115400 110605 100154 90072 80050 52752 62324 100996 112688
13149 112688 87352 43365 33446 50498 44401 34061 73804 70805 45952 52349 79276 96027
13137 96027 81640 76100 78221 110135 92409 60868 56994 41911 27433 32011 41421 55906 30207
13124 30207 7518 12718 20027 33164 48306 56584 52260 55971 33799 35019 35138 44670 53328 78576
13110 78576 94063 69443 71544 70200 53700 61607 48756 43746 77258 98755 61369 65041 69497
13097F9497J6737o768J128J9995j1793l3002j6053k0372j3800K0616o07J379K7902
13084E4859n362j9162q404J3675L6301J5203P331j2372J4668r8k3868j8095J150
13071E5826L0581M4252r95K847l636k3173j0634j4467J553o139J9750J0894L654
13058A10313j3160m0523L823K9929J0114j4511J0017l737n10N063L326q806r710
13045H1628k704q824j1864J6434M912j1267J0363j9559j4267K5502K4892J699
13033I6945k0682j0039J6307j755P783L89M130n570L343N665J0454K8827Q09j9923
13019A16683j8649L542m139J1077L1540j3279j2495l7005k3968J9437l98N231
13007G7577K3773O407m65j0032m08j9009k9962j5326P910j9051K6680J8774J9838
$$ plain form
13097 69497 86234 79466 80594 100589 88796 55794 39741 19369 5569 26185 25578 26957 54859
13084 54859 49497 30335 21931 35606 71907 87110 94441 82069 96737 96639 72771 54676 55826
13071 55826 86407 130659 129664 132511 128875 105702 95068 80601 82154 76015 95765 106659 110313
13058 110313 97153 56630 60453 90382 100496 85985 96002 92265 91755 96818 100144 91338 81628
13045 81628 78924 70100 58236 74670 79582 68315 78678 59119 44852 70354 95246 96945
13033 96945 76263 66224 82531 80776 88559 88948 93078 87508 90851 96516 106970 135797 136606 116683
13019 116683 98034 101576 97437 108514 140054 126775 114280 77275 53307 72744 72346 77577
13007 77577 101350 107757 107292 97260 96852 77843 47881 32555 40465 21414 48094 66868 86706
12994H6706J2937q291O776J0964J184l856J5041J9857j9994r769p125k6366l175
12981G4889K7958n937j6624L0314J1154m875N527k4354k1390L851J4773J9692
12969A14978m153L0j175K206j0704l6326P737M0135J0129Q620j0271q558J3219
12956A25867j6436j7505k762K3907K682l299N636J7379P312j5215j6445j6368
12944I4753j1665j2962K5312k25j5258K0971L6754o844j050O644J5421L1138j1355
12931A71634l123J551k5781j7274k6307j668j1757n681K0490L1083j0073o867
12919A16227m1244l0482O0J7754J8153L8681M5706M342k2901J122l642O449n588
12906A44637O938m630M55J3602k7285k6401j0329K8115J5952J5098o502O545j1778
$$ plain form
12994 86706 99643 91352 98128 109092 110276 106420 121461 141318 121324 111555 104430 78064 74889
12981 74889 102847 96910 80286 110600 121754 116879 122406 98052 76662 80513 95286 114978
12969 114978 110825 110855 109680 111886 101182 64856 72593 112728 122857 131477 121206 112648 125867
12956 125867 109431 91926 89164 113071 115753 112454 118090 135469 142781 127566 111121 94753
12944 94753 83088 70126 95438 95213 79955 100926 137680 130836 129786 136430 151851 182989 171634
12931 171634 168511 170062 144281 127007 100700 99032 87275 81594 102084 133167 123094 116227
12919 116227 74983 44501 44561 62315 80468 119149 164855 169197 146296 147418 143776 150225 144637
12906 144637 151575 146945 147400 161002 133717 107316 96987 125102 141054 156152 149650 156195 144417
12893A44417k7253K5392Q865l8818J0307L9329R817n404j9309N060R109O570P853
12880A75935k695j1279J5088J5580K1459o936J9666Q346j5560O255k6173k7175
12868A72511j5035q013j0330J1001P425L9N812j1399K2701L0827j5259J024q006
12855A83298j4846j0361J2448L2080j2838k6093j3809r876J6514J2189J4229J2712
12843A95647j3887j3164J3335J1746M942r75L0504l1604k5764J9783n219j1021
12831A74323J3725j8137J2589K7126M4644j117j5419J1819J300R213R001k297
12819B66770l0132k4953j566M1507J0376m093J506k9840k1002K9085J217J4970
12807B53845J7792l1257J0175n580j141J4317o226k2007j8296K492L4189K0783
$$ plain form
12893 144417 117164 142556 151421 112603 122910 162239 172056 166652 147343 152403 161512 168082 175935
12880 175935 173240 161961 177049 192629 214088 207152 226818 235164 219604 225859 199686 172511
12868 172511 157476 149463 139133 150134 157559 157598 163410 152011 174712 205539 190280 191304 183298
12855 183298 168452 158091 170539 202619 189781 163688 149879 140003 156517 168706 182935 195647
12843 195647 181760 168596 181931 193677 198619 197644 228148 196544 170780 190563 185344 174323
12831 174323 188048 169911 182500 209626 254270 253153 237734 249553 250853 260066 269067 266770
12819 266770 236638 211685 210119 251626 262002 257909 259415 229575 208573 237658 238875 253845
12807 253845 271637 240380 250555 244975 243834 258151 251925 229918 211622 214114 248303 269086
12795B69086p271j5185J7641N310j4021q342J2889K173r223j3988J4615M837Q724
12782B67245K6333k0106m7659m232M4123J0107k8127l148L2869N6560o63m2986
12770B90316k1151j5007j2780M935J0532m774R128k6606j4076J251K7890J5074
12758B64732P874k4667j0420J8772J7331k8157q441K6504l728j333J7715k3166
12746B53016L057J367o514m465j463J7739n277j9792k4598P639Q455o157M333
12733B27340K5846J1422J3511j3201l5400P515J3925l388J5088K4976j0994m3351
12721B33289j3157K1345J4771J4675m350L851j166j711q585r753k631J1778m660
12708B53696n6379k5095M2392J4553r271m333j3065j4955O476J0623K8012N931
$$ plain form
12795 269086 261815 246630 264271 269581 255560 247218 260107 262280 253057 239069 253684 258521 267245
12782 267245 293578 273472 225813 221581 265704 275811 247684 244536 277405 333965 333302 290316
12770 290316 269165 254158 241378 246313 256845 252071 261199 234593 220517 221768 249658 264732
12758 264732 272606 247939 237519 256291 273622 245465 237024 263528 259800 258467 276182 253016
12746 253016 256073 257440 250926 246461 244998 262737 257460 237668 213070 220709 229164 223007 227340
12733 227340 253186 264608 278119 264918 229518 237033 250958 247570 262658 287634 276640 233289
12721 233289 220132 241477 256248 270923 266573 270424 269258 267547 258962 249209 246578 258356 253696
12708 253696 197317 172222 214614 229167 219896 215563 202498 187543 194019 204642 232654 238585
12696B38585j4468l1284q775J217J0101K350j4665j849j5034j2644J5653K1000
12684A90187J9373J5231J550k001J1873N835j8900M191J1064N589l428j140p052
12671B32372k337K050k385m091p815j0952l0439K5549O065J228n27p373O554K0193
12657B28092K261j7598j0298p413N303j375j3309J0632L74J5032K1033J4221j6530
12644B30425j2264j8915j9017k79J4449J6042L5248K180j8263j6001m1240m83
12632A71882L0333J619Q768j8035j9078J0733L7922Q063o984n456J1686p278L522
12619B27697l2332q936M563L0392J5321K1209P63J0628p963o257J1900J442j7469
12606B50958k1832K0033j4781j3602k0267M345M0571K6156R416q468pJ471j3582
$$ plain form
12696 238585 224117 192833 184058 185275 195376 197726 183061 181212 166178 153534 169187 190187
12684 190187 209560 224791 226341 224340 236213 242048 223148 227339 238403 243992 240564 239424 232372
12671 232372 230035 232085 229700 225609 217794 206842 176403 201952 208017 209245 208718 201345 207899 228092
12657 228092 230353 212755 202457 195044 200347 198972 185663 196295 196669 211701 232734 246955 230425
12644 230425 218161 199246 180229 179950 194399 210441 245689 247869 229606 213605 172365 171882
12632 171882 202215 203834 212602 194567 175489 186222 224144 232207 225223 219767 231453 224175 227697
12619 227697 195365 186429 190992 221384 236705 257914 258677 269305 261342 255085 266985 268427 250958
12606 250958 229126 249159 234378 220776 200509 204854 245425 271581 280997 272529 272522 273993 260411
12593B60411j6109P672j1889o714J1288j6046O286J4941L409r834R866J2651K1570
12580B87502J4364Q849Q75P083k0702p663p426j3196r686J8894N847m739j0776
12567B69226l001j122J8116L991j0229J8686K0597N668l342l6950j7375K3744
12555B88009j451m146M2601K0322k1612j0776j8551K864J408Q522K4811R220J4462
12542C55683J6953M370M089j557K9299Q173J1946r796P861n681l579j323j651
12529D14787N893k366o348j8048k7542l606n581j8184n142r630m231J5312K3159
12516C58473j1467p792j4587p322l119j3066R104J015J377N252P279J0307k535
12503C32919j1580j4284M235q215J3375j6269O121J6068R931R439J5350P302j6094
$$ plain form
12593 260411 244302 251974 240085 233371 244659 228613 234899 249840 253249 243415 253281 265932 287502
12580 287502 301866 310715 311590 318673 297971 290308 282882 269686 260000 278894 284741 280002 269226
12567 269226 266225 265103 283219 287210 276981 295667 316264 321932 318590 281640 264265 288009
12555 288009 286558 282412 325013 345335 323723 312947 294396 297260 298668 307190 332001 341221 355683
12542 355683 372636 377006 381095 379538 408837 417010 428956 419160 427021 421340 417761 416438 414787
12529 414787 420680 418314 411966 393918 366376 362770 357189 339005 333863 324233 320002 335314 358473
12516 358473 347006 339214 324627 317305 314186 301120 310224 311239 312616 317868 325147 335454 332919
12503 332919 321339 307055 311290 303075 316450 300181 306302 322370 332301 341740 357090 364392 348298
12490C48298j5991M507q498j0956Q257P673j3044l866r717Q270P508k3037j7756
12477B81648K8944L2020K4612j1935n204n535L39l0245k754K7796K5655j8890
12465C46451j4468K2567L951L6894k128o087j9156r012M933O781K7426M89j4521
12452C84120k5344J2939L4716J8912o983r934l635K5542K4160l661k154K7476
12440D76154M988K3369O3k1169J5323M61k468l739n306J4652J5280k1129j2764
12427D83715j4027M761M696J3524K5135J1649K495M9506L7089M674J5347K491
12415F41055J3606K7300L6929M1862Q1071N6786L1747O6805O6914L7743N1087
12404A152905J908j6063k3614j3592r020R640O281J0264J0713Q290k5271j6934
$$ plain form
12490 348298 332307 336814 328316 317360 325617 333290 320246 316380 306663 314933 322441 299404 281648
12477 281648 310592 342612 367224 355289 350085 344550 344889 314644 311890 339686 365341 346451
12465 346451 331983 354550 358501 395395 393267 387180 368024 359012 363945 370726 398152 398641 384120
12452 384120 358776 371715 406431 425343 418360 408426 404791 430333 454493 450832 448678 476154
12440 476154 481142 504511 504574 483405 498728 499189 496721 492982 487676 502328 517608 496479 483715
12427 483715 469688 474449 479145 492669 517804 529453 531948 581454 618543 623217 638564 641055
12415 641055 654661 681961 718890 760752 841823 898609 930356 997161 1064075 1101818 1152905
12404 1152905 1154813 1138750 1115136 1101544 1092524 1102164 1108445 1118709 1129422 1137712 1112441 1095507
12392A095507j2911o780l5720j7476j6782j8986J2079J9790M149k0401k9457o483
12380I66529l935Q746M211o100O980K5184K7618K8582M6147O4681N7123O7694
12368A293460J20582J66621K00916J98999J32218P6770O842n4951j06513j68264
12358A866680j37147j45232j52455j18351o2097n257j466J4660K7579J2183k8731
12347A270366j6097j8802n7296l4408n8612k4453k3429k6994j7587l90k2468k3604
12335I46226k3219J8047J7108p674k9550N517K7500R510O085J1196K4111K0668
12323A025525M6614N5315L2895M338k0380k7503o7361p3688p1616n1836l1028
12312H21275j8283m3707l9872k3879j2749m450J29k8282k3863k1374j2523k1904
$$ plain form
12392 1095507 1082596 1075816 1040096 1022620 1005838 986852 998931 1018721 1022870 1002469 973012 966529
12380 966529 962594 971340 975551 969451 976431 1001615 1029233 1057815 1103962 1168643 1225766 1293460
12368 1293460 1414042 1580663 1781579 1980578 2112796 2189566 2196408 2141457 2034944 1866680
12358 1866680 1729533 1584301 1431846 1313495 1251398 1246141 1244675 1259335 1286914 1299097 1270366
12347 1270366 1254269 1235467 1178171 1143763 1085151 1060698 1037269 1010275 992688 992298 969830 946226
12335 946226 923007 941054 958162 950488 920938 926455 953955 963465 969550 980746 1004857 1025525
12323 1025525 1072139 1127454 1160349 1164687 1144307 1116804 1049443 975755 904139 852303 821275
12312 821275 802992 759285 719413 695534 682785 678335 678464 650182 626319 604945 592422 570518
12300E70518k4957K0248P07j8180N612J681p936k5142K4463j265k5124J1048l231
12287E28442k4076R345m441j2704K5789N310j6571r002j0650P801p952K3911j5520
12274D99682l7623j4578j3953k3003j8537q917j6750J1516K025J7512L7347o493
12262D28228K8236J8275j6943k4835p46J7144k635l1159j8569k704K8567J1773
12250D34632N761K5766M017l0388j0055k4568r170J8416j2007j4512J0218K1434
12238D19544J3777Q687m890J5779o250m4117j4848J7793N773k4955m1037k9497
12226C15759o853J9104L5739K2784K6367N5719O4089P989K1458J540k6316l2927
12214E04452n991j321L478j9338r963J5114m351K2466N047J510J3791j0356P554
$$ plain form
12300 570518 545561 565809 566516 548336 553948 555629 547693 522551 547014 545749 520625 531673 528442
12287 528442 504366 513711 509270 496566 522355 527665 511094 502092 491442 499243 491291 515202 499682
12274 499682 462059 447481 433528 410525 391988 383071 366321 377837 379862 397374 434721 428228
12262 428228 456464 474739 457796 432961 432215 449359 446724 415565 396996 394292 422859 434632
12250 434632 440393 466159 470176 439788 429733 405165 395995 414411 402404 387892 398110 419544
12238 419544 433321 442008 437118 452897 446647 402530 387682 405475 411248 386293 345256 315759
12226 315759 308906 328010 363749 386533 412900 468619 532708 540697 562155 563695 537379 504452
12214 504452 498461 497140 500618 481280 471317 486431 482080 504546 509593 511103 524894 514538 522092
12201E22092p775O849l6131q161K9476N950L612J8228l4391R965J8463R401j1932
12188E25646O150m954l3250l9532R691L4804M3693K5694K4669L1723L3673L3783
12176F91790N6525M9372J4779k5426q056M33k1540j2686N600q907l4741j2953
12164F94190j4685k2121J0498J8786k015p835j4468l1400l0968M042J8470j8585
12152F03909p250K1909k3883L830L4565j9776j139J6880k6031o518J5345K2043
12140F33884J3745J796j9958j5260J8382L6938L9283J7716M351N844J1655j328
12128G47048L4524K31k115J1355K4691Nj3184L0417Q393m3934l5716m4746m0577
12115F76392l5039j7599l1499k9750k406N786m345J8770K3129J2718P176J9675
$$ plain form
12201 522092 514317 521166 485035 476874 506350 512300 515912 534140 499749 509714 528177 537578 525646
12188 525646 531796 526842 493592 454060 463751 498555 542248 567942 592611 624334 658007 691790
12176 691790 748315 797687 812466 787040 778984 779417 757877 745191 750791 741884 707143 694190
12164 694190 679505 657384 667882 686668 684653 676818 662350 630950 599982 604024 622494 603909
12152 603909 596659 618568 594685 598515 633080 613304 612165 629045 603014 596496 611841 633884
12140 633884 647629 649425 629467 614207 632589 669527 708810 726526 730877 736721 748376 747048
12128 747048 781572 781803 779688 791043 815734 815739 802555 832972 841365 797431 761715 716969 676392
12115 676392 641353 623754 592255 562505 560099 565885 561540 580310 603439 616157 623333 643008
12103F43008K861J3778K1811K7612K7195M501J2362K2858M0376M8896O5405N2927
12091I83590K5582L0764Q579m924k0519j5519j5673Q454L5689K1158J4020J9331
12079A090532J2224k0697K1497J9062J9526J8908j7752O844K9975J0028O000K6042
12067A222189L5166M0606O104J6584N0818L7261N0308M9942L3675J1436k2515
12056A531574J1252L2389M3298N1552Q9996Q7960J51850K19175J85496J29740
12046B534282J04465L5718N3212M8360R0242Q8508P8442Q9830R1776Q3806M2716
12035C341357M7887N2836M2149Q1283P9133K5124l5796p4484m9950j0510N5816
12024C554845N1163M1485R6082J06284Q8429L4685k4491J826k2122m6718m4708
$$ plain form
12103 643008 645869 659647 681458 709070 736265 740766 753128 775986 816362 865258 930663 983590
12091 983590 1009172 1039936 1048515 1043591 1023072 1007553 991880 1000334 1036023 1057181 1071201 1090532
12079 1090532 1102756 1082059 1103556 1122618 1142144 1161052 1143300 1150144 1180119 1190147 1196147 1222189
12067 1222189 1257355 1297961 1304065 1320649 1371467 1408728 1459036 1508978 1542653 1554089 1531574
12056 1531574 1542826 1575215 1618513 1670065 1760061 1848021 1999871 2219046 2404542 2534282
12046 2534282 2638747 2674465 2727677 2776037 2866279 2954787 3033229 3123059 3214835 3298641 3341357
12035 3341357 3389244 3442080 3484229 3565512 3644645 3669769 3633973 3559489 3509539 3499029 3554845
12024 3554845 3606008 3647493 3743575 3849859 3938288 3972973 3948482 3950308 3928186 3881468 3836760
12013C836760o4409k8823k2434L1083Q2294J34545J86298J99710J70663J66720
12003D692407K03125K63941K72360K95165L38984L89306M05831M22780M36268
11994G720167M38374M42022M72532N40178O44157P09157P56177Q81599R74156
11985A3578519R64382Q99636P38420N26042L31525K50808L06682M62194O74753
11976A8732961R42686J298353J798210K486032L515366M982619O915925R212752
11968D9884904J1742344J4155145J5690635J4762716J0089365K271140o079496
11961A12516753j1809789j3442497j1760946q588212n283560k624167p34649O34119
11953E8907052J727242K581849L166319L322262K896256K007634R77047K71424
$$ plain form
12013 3836760 3772351 3743528 3721094 3752177 3834471 3969016 4155314 4355024 4525687 4692407
12003 4692407 4895532 5159473 5431833 5726998 6065982 6455288 6861119 7283899 7720167
11994 7720167 8158541 8600563 9073095 9613273 10257430 10966587 11722764 12604363 13578519
11985 13578519 14542901 15442537 16180957 16706999 17038524 17289332 17596014 18058208 18732961
11976 18732961 19675647 20974000 22772210 25258242 28773608 33756227 40672152 49884904
11968 49884904 61627248 75782393 91473028 106235744 116325109 118596249 112516753
11961 112516753 100706964 87264467 75503521 66915309 61631749 59007582 58272933 58907052
11953 58907052 60634294 63216143 66382462 69704724 72600980 74608614 75585661 75857085
11945G5857085J72263O72430J431687K155419K816738L356117L466863K791147
11937I2719749J500451p8297j375348j956005j746122o59312J128661L392056
11929I2925833O136004R750894J4960357K2425416L2065936M1531211M5611063
11922B65406714L8357174J8185045q521317l1057898m2090218m1488394l4322033
11915A64469073k5649034j8046844j2241745p813784m246108j455528M90554J470533
11907I6977117J377622L80805j187166k776067l800648m083093l799614l125042
11899G9963914k244454j310641n79801l73650o84863j471516k273340k705661
11891F8319988k686471k330662j732859r27831K5291J321338L355886O281546
$$ plain form
11945 75857085 76029348 76701778 78133465 80288884 83105622 86461739 89928602 92719749
11937 92719749 94220200 94141903 92766555 90810550 89064428 88405116 89533777 92925833
11929 92925833 99061837 108812731 123773088 146198504 178264440 219795651 265406714
11922 265406714 303763888 321948933 313427616 282369718 240279500 198791106 164469073
11915 164469073 138820039 120773195 108531450 100717666 96471558 95016030 95506584 96977117
11907 96977117 98354739 98735544 97548378 94772311 90971663 86888570 83088956 79963914
11899 79963914 77719460 76408819 75829018 75455368 74770505 73298989 71025649 68319988
11891 68319988 65633517 63302855 61569996 60642165 60667456 61988794 65344680 71626226
11883G1626226R895119J3339507J4717069J2206157N381039l732073j1620749
11876A11812295j5904138j6502093j4918579j2486590r887412p391937n308805
11869B9412741l718048k577161j741163j193118q21664n75817l86092l41799l78735
11860A7679144n08624o64244q63556r99869j065720j093845j045465r30421q32327
11851I675073p40901o55945n82824n36873n01046m69602m51593m65535m43411
11842D827343m29457l65625l03437k25122k05265j84760j10875l8665n6948o2241
11832B844948l567J2155J3701M2676M9682O9998J10521P2068L0251J8646m5664
11821C215415m5436n9343p2476n2853l7490J9286L2470J3285M994m8595j7709
$$ plain form
11883 71626226 81521345 94860852 109577921 121784078 127165117 123433044 111812295
11876 111812295 95908157 79406064 64487485 52000895 42113483 34721546 29412741
11869 29412741 25694693 23117532 21376369 20183251 19361587 18785770 18399678 18057879 17679144
11860 17679144 17170520 16506276 15642720 14642851 13577131 12483286 11437821 10507400 9675073
11851 9675073 8934172 8278227 7695403 7158530 6657484 6187882 5736289 5270754 4827343
11842 4827343 4397886 4032261 3728824 3503702 3298437 3113677 3002802 2964137 2907189 2844948
11832 2844948 2841381 2853536 2867237 2909913 2959595 3029593 3140114 3212182 3242433 3261079 3215415
11821 3215415 3169979 3110636 3038160 2985307 2947817 2967103 2999573 3012858 3017852 2969257 2951548
11810B951548j7287j1540j0554j7013m5498l4916r2042j45263j43138j65918k23186
11799B045193k22953k14566j87326j37383p5197j9857m719j8297l8265J3594M6230
11788A186454o182k0494j3056k592l0515m2561m1983j7404k0777m5951l2043j7710
11776H95186j4535l5194J6534j8118m9445l6072J1179R39l2707j9877k5923k3454
11764F68513J9543J0008m2049l6777k6246l9408l1678J1012M4308p352j5718l0564
11752E23592r958j2611k6263m149q448k9605J6010K7993L3099O618j2149p345
11740D96784k1889m1593J5235P16L9466L4198p6k459Q602R116m4870p921j6978
11727D68331j0778k1771n7092l4950p255l2420R619Q025q164j2211J2270K612
$$ plain form
11810 2951548 2934261 2922721 2912167 2895154 2849656 2814740 2722698 2577435 2434297 2268379 2045193
11799 2045193 1822240 1607674 1420348 1282965 1207768 1187911 1183192 1164895 1126630 1140224 1186454
11788 1186454 1180272 1159778 1146722 1144130 1113615 1071054 1029071 1011667 990890 944939 912896 895186
11776 895186 880651 845457 861991 843873 794428 758356 769535 770474 737767 717890 691967 668513
11764 668513 688056 698064 656015 619238 592992 553584 521906 532918 577226 569874 554156 523592
11752 523592 513634 501023 474760 470611 462163 432558 448568 476561 509660 516278 504129 496784
11740 496784 474895 433302 448537 449253 488719 522917 522841 520382 528984 538100 493230 485309 468331
11727 468331 457553 435782 378690 343740 336485 304065 313684 321709 313545 301334 313604 316216
11715C16216J5392J9702p691l4453l4740j6137k5886N243J9272k0985P367L860
11703B47160p318K83K8756J1416k4773l2285j5055P961K6582p029k2954J0152
11691B22896J7929r28L563P830k3009j0336J7512K3281k553j6514k9170l6308
11679A74193p689K256J2316J1132J326r284j5064n231k4255m717J1734J9398k72
11666A65843J5304J0218n879J0850m805j2103P577J2042j2274k1059K49R39J7147
11653A84049K0235O33q815K378j9053m5297K370J0878r045j5777N803J5575K238
11640A46172m122l068L128Q703K2142J718n844k368j1763o013K5249K8091j621
11627B00404j4874k5182n229R18N896N1462o135o209K2365O116j6336L839K747
$$ plain form
11715 316216 331608 351310 343619 309166 274426 258289 232403 237646 256918 235933 243300 247160
11703 247160 239842 240125 268881 280297 255524 223239 208184 216145 242727 235698 212744 222896
11691 222896 240825 239897 243460 251290 228281 217945 235457 258738 256185 239671 210501 174193
11679 174193 166504 168760 181076 192208 193534 184250 169186 163955 139700 134983 146717 166115 165843
11666 165843 181147 191365 185486 196336 191531 179428 187005 199047 186773 165714 165963 166902 184049
11653 184049 204284 204917 196102 198480 179427 134130 136500 147378 138333 122556 128359 143934 146172
11640 146172 142050 138982 142110 150813 172955 174673 168829 166461 154698 148685 173934 202025 200404
11627 200404 185530 160348 155119 156037 161933 213395 207260 201051 223416 229532 213196 217035 219782
11614B19782j9003k3434J2685j389o012K5298j768k6861n044O684j4448m999J6472
11601A77963o655k5181j4699r03q12K037J7875j6286k7602L7953K8546J0865m857
11588A78244m769j049l829r299k0323J549j2275O236L591j1052N0331j0643k7264
11575A39448J6818M7513K0140J913M151l1153l0585k5843L567M483P970K988j5056
11562A46354o760L0006j7766j7538L9030J2249o798q547j8046k9229q801K1206
11550A35360r96m476K0410J6520J832K372J2206k9051m0736o268J3873K5310K2917
11537A69273Q320j9573r859P288j3857r148N387R16K9268J9753K734K5274L6893
11524B52669O299Q992L7952N0227M5745N6314O2240M9717M5640M4378J9139l9720
$$ plain form
11614 219782 200779 177345 190030 188641 182629 207927 206159 179298 174254 180938 166490 161491 177963
11601 177963 171308 146127 131428 130525 129713 131750 149625 133339 105737 143690 172236 183101 178244
11588 178244 173475 172426 168597 159298 138975 140524 128249 134485 138076 127024 177355 166712 139448
11575 139448 156266 203779 223919 225832 229983 198830 168245 142402 145969 150452 158422 161410 146354
11562 146354 139594 169600 151834 134296 173326 185575 178777 170230 152184 122955 114154 135360
11550 135360 134364 129888 150298 166818 168650 171022 183228 154177 113441 107173 121046 146356 169273
11537 169273 177593 158020 148161 155449 141592 132444 137831 138747 168015 187768 190502 215776 252669
11524 252669 258968 267960 305912 356139 401884 458198 520438 570155 615795 660173 679312 639592
11512F39592m0309n6731k9720m4908n1522P5J6086p784j5224Q366j3354N90j7702
11499C87455j1780Q745J4822J6276K1233N8315L9259M9853L0707N658r46Q34L817
11486F24248j1037j1536o12q51m098M847K9597P3748R9989J10313J38465J86201
11474A239274J86840J26083J02526q512p7281j50821j73433j64858j79130j43521
11464G57167q6168n8889o5434k7047l600k4785k1885r339J0112K8439k1993k2388
11452D54190j0077R270M597J5528m0035K421J6736k4354l528K1419J4110L256
11440D63533K0623K921k3642j4728K1291L4570L7901N3339N7739L8807Q46k265
11428F90935k3792p3181o9154n7807o2774n3955o0993l7061j8865j280J2148k2830
$$ plain form
11512 639592 599283 542552 512832 467924 416402 416477 432563 424779 409555 417921 404567 405157 387455
11499 387455 375675 384420 399242 415518 436751 495066 534325 584178 614885 620543 619597 620431 624248
11486 624248 613211 601675 601063 600212 596114 600961 630558 704306 804295 914608 1053073 1239274
11474 1239274 1426114 1552197 1654723 1646211 1568930 1418109 1244676 1079818 900688 757167
11464 757167 670999 612110 546676 519629 516029 491244 469359 460020 470132 498571 476578 454190
11452 454190 444113 453383 457980 473508 433473 435894 452630 428276 424748 446167 460277 463533
11440 463533 484156 487077 463435 448707 469998 504568 542469 595808 653547 692354 693200 690935
11428 690935 667143 593962 524808 467001 404227 350272 289279 252218 233353 232073 244221 221391
11416B21391l9402k367r21P645k4875l1419m2882l616J5607R218m117R304M393
11403A17959o635p044p517J373o297j4436J308J2011M516J1716J5259q624j9938
11390I3651J15l6J1096Q758j923j0830m137m303j9665l2804j2884J9641L2259
11377G8938L6690m729J3044j8958k7357j3416L261Q265L295N768P3J7709L618
11364A06201L711J6107l805r053k7672l3463k428K4144j1511j7778Q353K0211
11352G3017L49p910k2704M6O037r276J5590K9555K348j5172J2402L3534K2905
11339A40721k133l4191J2438J3775o109K3744P6597N4240k2330n4918m1393k0175
11327A40266p485k8152k9146k5167M706l2472J8978L0773n478p581J0841j5865
$$ plain form
11416 221391 181989 179622 178701 186346 161471 130052 87170 83554 99161 108379 104262 113566 117959
11403 117959 111324 104280 96763 98136 91839 77403 78711 90722 95238 106954 122213 113589 93651
11390 93651 93766 93730 104826 113584 111661 100831 96694 92391 72726 39922 27038 46679 78938
11377 78938 115628 110899 123943 104985 77628 64212 67473 75738 79033 84801 84874 102583 106201
11364 106201 109912 126019 122214 113161 85489 52026 49598 73742 62231 44453 52806 73017
11352 73017 73366 65456 42752 42798 48835 39559 55149 84704 87052 71880 84282 117816 140721
11339 140721 138588 104397 116835 130610 124501 148245 224842 279082 256752 201834 160441 140266
11327 140266 132781 104629 75483 50316 55022 22550 41528 72301 66823 59242 70083 54218
11315E4218k6534J5720K510p249M9J2012J1266p262m981p856q409J131l413M797
11301C5999O959k126n11j254L0863K8346q558j0347j8833j206k500L815J5150
11288G5797M363J182j5060J632K2283N300k7810l6926j3513j7484P712J5691K0529
11275D3696R863L009p716J4354r144k8759J4362J1034L2169p03l2213j9231Q853
11262C9574r541n701J916J0958J92k00R789K9738J3268K888L062j5593k2019M891
11248F3222k713q457J898J5223N559p598J8644L133l0308M994M466N056j4292
11235E8827j7812n561J2754J9012J5105O626r40n099J1947L447J6386J0014l1481
11222I3225O59l691k8480p344J8917r468j3046m259P161Q272P978m70P804K1338
$$ plain form
11315 54218 27684 43404 45914 38665 38714 50726 61992 54730 49749 41893 33484 34615 31202 35999
11301 35999 42958 40832 40321 39067 69930 98276 89718 79371 60538 59332 56832 60647 75797
11288 75797 80160 81342 66282 67914 90197 95497 67687 30761 17248 -236 7476 23167 43696
11275 43696 53559 56568 48852 63206 54062 25303 39665 50699 82868 82165 49952 30721 39574
11262 39574 30033 24332 26248 37206 37398 37198 46987 76725 89993 92881 95943 80350 58331 63222
11248 63222 60509 52052 53950 69173 74732 67134 85778 88911 58603 63597 68063 73119 58827
11235 58827 41015 35454 48208 67220 82325 88951 88011 82912 94859 98306 114692 124706 93225
11222 93225 93884 90193 61713 54369 73286 63818 50772 46513 53674 61946 69924 69454 77258 98596
11208I8596L6576m4001m939M999n930j1965j2384J0005M818R969l1516m004o538
11195D3686j3148J4532R268k251P677K7903J7584L908j6130P424j1443O869k1318
11182G4561j7153q475O868J4991L018M1920J4136j9504l674R075J0241N081J8627
11169A49712j8797k268J3894j4024n2784l4697l4670N840M2185J460j6041K965
11157D2775J9923L925J2526R340J2161j1424j02j8203k0194j8143O090L1037N791
11144G5502k0727M1465J2728l00N036J9635K951n0655k8725K0429K3958L6300
11132A37597j685n13k6008j6259p68N012j8140M726J0381R512n445k5444P055
11119H0021M921J5809K204k8524j879M201j1209K3113N592k8018J7503P738j3721
$$ plain form
11208 98596 135172 91171 86232 91231 85301 73336 60952 70957 75775 85744 54228 50224 43686
11195 43686 30538 45070 54338 52087 59764 87667 105251 109159 93029 100453 89010 95879 74561
11182 74561 57408 48933 55801 70792 73810 115730 129866 110362 106688 115763 126004 131085 149712
11169 149712 130915 128647 142541 128517 75733 41036 6366 12206 54391 55851 39810 42775
11157 42775 62698 66623 79149 88489 100650 89226 89124 70921 50727 32584 38674 69711 75502
11144 75502 54775 96240 108968 108668 113704 133339 136290 85635 56910 77339 101297 137597
11132 137597 135912 135399 109391 93132 92364 97376 79236 83962 94343 103855 98410 72966 80021
11119 80021 84942 100751 102955 74431 72552 76753 65544 88657 94249 66231 83734 91472 77751
11106G7751N39K0434q125M074O41K0746j7996j7547k2165j6683J5111N251j2307
11093D9724J0553n60J4630n236j149j7978j0937L7794L0930P295m2756P73L7426
11080A10509J2217k9080k2744k0282O035o130L655j4663r632L217O670K1170K1
11067F0963L920J3823K5082k4946j3206j3832J1645P903m189n584j1425O341K2217
11054G8712L503q012K296o188J3100J3346J7711o284j16R556J7675k6471l837
11041A04991n799j1052k2832p610R927L988J1988K0758p72k7197m97j2562Q276
11028G1607j5738M136M913k092j2208J977K1979k0371o840q504j5200k274K6852
11015D8237J4401L686J4460N852j4596m154J388m483M688J2521L515l3152j1282
$$ plain form
11106 77751 78290 98724 90599 94673 95314 116060 98064 80517 58352 41669 56780 62031 49724
11093 49724 60277 59717 74347 69111 67962 49984 39047 76841 107771 115066 72310 73083 110509
11080 110509 122726 93646 70902 50620 56655 50525 54180 39517 29885 33102 39772 60942 60963
11067 60963 64883 78706 103788 78842 65636 51804 63449 71352 67163 61579 50154 56495 78712
11054 78712 82215 74203 76499 70311 83411 96757 114468 108184 108068 117624 135299 108828 104991
11041 104991 99192 88140 65308 57698 67625 71613 83601 104359 103587 76390 75893 63331 71607
11028 71607 55869 60005 64918 62826 50618 52595 74574 54203 47363 38859 23659 21385 48237
11015 48237 62638 66324 80784 86636 72040 67886 69274 64791 69479 82000 85515 52363 41081
11002D1081K144p101J7855Q614m860j289l552p109K3797K6956k953o08J5497r597
10988I8875j5020k756m17j4860L133L3930J8985o160j496N165p961K5068J2892
10975A49378n4788o281K1460k5581m1536k6633r048k3231K5234M9179J5786K6731
10963A00670J578N370j0647q471j8444k3737M0986K3898l262m941k6706l2089
10951D4205K215J4543K1747R448J4902k705m286j872m008k4401K5667J2826k0876
10938H7405j6637J7087K4860J2693q455k303j0445k3146j2490N193L702K4479
10926A01943J0241k6311n723M565M3945k3164k1320R469n668N513l387M112P94
10913I5009J7760j0230j959q753j273J1459j1150k6666p988J8291K1587J3799
$$ plain form
11002 41081 43225 36124 53979 62593 57733 56444 52892 45783 69580 96536 93583 92975 108472 98875
10988 98875 83855 81099 80682 65822 68955 102885 121870 115710 114214 119379 111418 136486 149378
10975 149378 94590 88309 109769 84188 42652 16019 6971 -16260 8974 58153 73939 100670
10963 100670 102248 107618 96971 88500 70056 46319 87305 111203 107941 103000 76294 44205
10951 44205 46420 60963 82710 92158 107060 104355 100069 98197 94189 69788 95455 108281 87405
10938 87405 70768 87855 112715 125408 116953 114650 104205 81059 68569 73762 77464 101943
10926 101943 112184 85873 80150 84715 128660 105496 84176 93645 87977 93490 90103 94215 95009
10913 95009 112769 102539 100580 91827 90554 102013 90863 64197 56209 74500 96087 109886
10901A09886p758k2958m484j5322j0192Q904L8478J1508k4255k0388q900L0737
10889H5256P564p610L618k0888q03J7335P042j3014r893l2268N366J5749O483
10876F3937K6805J4451J9522r536k9118k4859j8117q008L2236J9089o380r716
10864G0306Q623J5452K0931J8528o145j0907K2183J6790n2229l7198K0599j3205
10852G3728P781J5351L887L998k714n420J052j4084M596M2094j0977k0124j2756
10839H6412J4613Q774r854j94K9313J1517k6222j0762q531l0230j4613K0532J6004
10826H6759J6144R204o845J1022L633l2488k3894K0217R67O147n954J7623k8338
10813G4197j6008J3820L5035M862j6775k5938M333K685J2578K7608J9731J6570
$$ plain form
10901 109886 102128 79170 74686 59364 49172 58076 96554 108062 83807 63419 54519 85256
10889 85256 92820 85210 88828 67940 67137 84472 91514 78500 68607 36339 41705 57454 63937
10876 63937 90742 105193 124715 115179 86061 61202 43085 35077 67313 86402 80022 70306
10864 70306 78929 94381 115312 133840 127695 116788 138971 155761 103532 66334 86933 73728
10852 73728 81509 96860 100747 104745 102031 96611 97663 83579 88175 130269 119292 99168 86412
10839 86412 101025 109799 99945 99751 129064 140581 114359 103597 95066 64836 50223 70755 86759
10826 86759 102903 112107 105262 116284 119917 87429 63535 83752 84719 90866 84912 102535 74197
10813 74197 58189 72009 107044 111906 95131 69193 73526 76211 88789 116397 136128 152698
10801A52698O504P104m8628j1387L8274o997j0141J1269J1969J5706J0694k073
10789A74992m1194J436j0420k2552R192N035L0461L6175J2092k3769j5841l6171
10777A19436q446K0581J4332L3466K7335J4450Q248p272l0081l7944J4282M2821
10765B11208m479J3610J5964J1851l239J2111K5179M5896M6128O3159O9020P3705
10753E80113Q7835O8497J9797J9793J0921k876O476L2542O2355R6327J45275K27995
10741A355050L89368O79945J209286K235059L603959L429274J30305l508901l636934
10732E886411k187661j185361o68564m53482k97781k00983j48268r7741o3677
10723E82893n2073m5983m3204p2269j4914l5554K698j3606l3156j0154k8444l9461
$$ plain form
10801 152698 159202 166306 117678 106291 144565 137568 127427 138696 150665 166371 177065 174992
10789 174992 133798 135234 124814 102262 111454 116489 146950 183125 195217 171448 155607 119436
10777 119436 110990 131571 145903 179369 206704 221154 229402 222130 192049 154105 168387 211208
10765 211208 206729 220339 236303 248154 244915 257026 282205 328101 374229 437388 506408 580113
10753 580113 667948 736445 756242 776035 786956 784080 790556 823098 885453 981780 1127055 1355050
10741 1355050 1744418 2424363 3633649 5868708 9472667 12901941 13032246 9523345 5886411
10732 5886411 3698750 2513389 1844825 1391343 1093562 892579 744311 646570 582893
10723 582893 530820 484837 441633 369364 354450 318896 321594 307988 274832 264678 236234 196773
10711A96773J88O980o267m047k4047N977J76N818j5642J746J3038j8867j2671
10698A49155M334K9988m227j5685j0911J2409Q626N115n145k1195l1701K541M7051
10685A70355K5559J4279l438j0742r817k1769k7570L482J328k5527R228P737l0375
10672A02730m756J120K107J1835k367j7169K3451J1383K7394j513m172J62O383
10659A56588L7711R616n020j7204j3825O040J6261j0566k3448M980K1547M7402
10647B30082J4193P910j7985r217o887k7540j8408j3974l5777K2566L3724j5073
10635A63614k100j6733k0323J420J1137j9662j2936k501L3168L2840K5347k1410
10623A71861l3254j5482K2482K4752r649k2787j4935J1284k0787Q998M637Q544
$$ plain form
10711 196773 196961 203941 197674 193627 169580 175557 175733 181551 165909 167655 180693 161826 149155
10698 149155 153489 183477 179250 163565 152654 165063 173689 178804 173659 152464 120763 123304 170355
10685 170355 195914 210193 206755 196013 186196 164427 136857 140339 141667 116140 125368 133105 102730
10672 102730 97974 99094 101201 113036 110669 93500 116951 128334 155728 154215 150043 150205 156588
10659 156588 194299 203915 198895 181691 167866 173906 190167 179601 156153 161133 182680 230082
10647 230082 244275 252185 234200 224983 218096 190556 172148 158174 122397 144963 178687 163614
10635 163614 161514 144781 124458 125878 137015 117353 104417 101916 135084 167924 193271 171861
10623 171861 138607 123125 145607 170359 160710 137923 122988 134272 113485 122483 127120 135664
10611A35664P49k270Q26j4082j0088J4434n047p192K7513K3324j615r420J1666
10598A64462K1222j0222j1579P352j1383p416J4512l4051n370N644J2951J422
10586A47544k0311k0471J9822K2364J812O220l783j0684J1738J0361K12J6119
10574A80943j4065n792m358j65J1367K1163l727p699j4383R389m499j4506r042
10561A44626j1781K0236N038K433k2648k3353K89l115M717j6883K7116K8115m182
10548A50608n376J8830K5904O914J458j3911j8753M392M476M86K045L047r661
10535A70459K2241M1360l3130l5120J9572j452O455L20Q962q590r095j0433r382
10522A62167K7383j1286q141Q578j7933K572J2625j231r775k1871J072K1925J2234
$$ plain form
10611 135664 136413 134143 134969 120887 110799 125233 120186 112994 140507 163831 162216 152796 164462
10598 164462 185684 175462 163883 171235 159852 152436 166948 132897 127527 133171 146122 147544
10586 147544 127233 106762 126584 148948 150760 156980 153197 142513 154251 164612 164824 180943
10574 180943 166878 161086 156728 156563 167930 189093 185366 177667 163284 172673 168174 153668 144626
10561 144626 132845 153081 158119 160552 137904 114551 114840 111725 116442 99559 126675 154790 150608
10548 150608 145232 164062 189966 196880 198338 184427 165674 170066 174542 175028 177073 180120 170459
10535 170459 192700 234060 200930 165810 185382 183930 190385 190705 199667 191077 181982 171549 162167
10522 162167 189550 178264 170123 178701 160768 163340 175965 174734 164959 143088 144160 166085 178319
10509A78319j032J7355j1835j8672k104J5471K8576P774J4940j831m6694j2760
10497A67507J1446k494k256K2123M846r562k9273j1177R080L4531M616j2108N926
10484A93205k900j5101j4882J6368L4163O115l8717j1464J4995k0647k3464K7061
10472A64732J3575j020K786J2100J2135m208J2473J1054J141O679j5789j4811
10460B00847k8885p500j3718K6332k217k1879K9747K7876M1286N830k301o388
10448B49030j1599J8887j0093K2975J470j9766m1037j2047j276j77q674m722L4970
10435B17941J8177j3011J4276L4156j1514m6627q404M4222n493j6250k407R641
10423B34707J5262j5225k5480J3485O907k1985J5561J8338q567Q347J223k3574
$$ plain form
10509 178319 177287 194642 182807 164135 162031 177502 206078 213852 228792 226961 180267 167507
10497 167507 178953 176459 174203 196326 201172 191610 162337 151160 160240 194771 199387 187279 193205
10484 193205 190305 175204 160322 176690 210853 216968 178251 166787 181782 161135 137671 164732
10472 164732 178307 177287 180073 192173 204308 200100 212573 223627 224768 231447 215658 200847
10460 200847 171962 164462 150744 177076 174859 152980 182727 210603 251889 257719 255418 249030
10448 249030 237431 256318 246225 269200 270670 250904 209867 197820 196544 196367 187693 182971 217941
10435 217941 236118 223107 237383 271539 260025 213398 204994 249216 243723 227473 225066 234707
10423 234707 249969 234744 209264 222749 229656 207671 223232 241570 233003 241350 242573 218999
10411B18999o474o841p776J8059K6071K4821M375j8329j4473O971J6472k9293
10399B32582j7256L0153j0189K3550M4983Q143J3262R034o406M0628N5236K1571
10387D45291J7669L2238L2919j6068m7836n0062l2466p1872J5260J4037r689j8930
10375C10491o778m930n719r263j949k9563J1228k662p303J1234j114J2823L0347
10362C06842K4985p895k1393R22L6165n405Q837K1811P34K4709J9343L2457P7180
10349E19292J04956P4559J04246J20844Q0844N5394M5456L9960N2681l7666j31435
10338A029131j43057j28752j08804r0804p5991l4567m2962k6487m294m108M634
10327C73939J4175J1135n062k7393q969J4819N5320O618Q68j3041l077O830J5021
$$ plain form
10411 218999 212525 205684 197908 215967 242038 266859 271234 252905 238432 245403 261875 232582
10399 232582 215326 245479 235290 258840 303823 311966 325228 334262 327856 368484 423720 445291
10387 445291 462960 495198 528117 512049 464213 414151 381685 309813 325073 339110 329421 310491
10375 310491 303713 298783 293064 283801 281852 252289 263517 260855 253552 264786 263672 276495 306842
10362 306842 331827 323932 302539 303461 339626 334221 343058 364869 365603 390312 409655 442112 519292
10349 519292 624248 698807 803053 923897 1004741 1060135 1105591 1145551 1198232 1160566 1029131
10338 1029131 886074 757322 648518 557714 481723 447156 404194 377707 373413 369305 373939
10327 373939 388114 399249 394187 366794 357825 372644 427964 434582 435450 422409 419332 426162 441183
10314D41183M887K7142K1291K3367M0974M5719L1970O7138J23352J09816J36036
10303A072875J36248J29586J29952J14090Q5289L1924j7038r2822j81460k31290
10293A177354j93110j64205j03101o8475n4110n9251k5786j1214k3091J0066k3615
10282D61462k8846k3462J4388M415m279o698M557r807K614J6508l539j2658l495
10269D11160J0160L710L7569L3213L089N6666O9713Q1429Q9533J30516J18833
10258A045591J21703J24618P9352r69p3012j37705j62020j26566j12056p5032
10248F83904r0456p4834l3965J4324q276l5213k531N016j7428j2189L952P152
10236D39456l2515l0824k7050M660J0910q658k1356k512M377k1524J0661J9193
$$ plain form
10314 441183 446070 473212 494503 517870 558844 604563 636533 703671 827023 936839 1072875
10303 1072875 1209123 1338709 1468661 1582751 1668040 1699964 1682926 1590104 1408644 1177354
10293 1177354 984244 820039 716938 648463 594353 535102 509316 498102 475011 485077 461462
10282 461462 432616 409154 423542 427957 423678 416980 421537 411730 414344 430852 427313 414655 411160
10269 411160 421320 425030 462599 495812 498901 555567 625280 706709 796242 926758 1045591
10258 1045591 1167294 1291912 1371264 1370295 1297283 1159578 997558 870992 758936 683904
10248 683904 593448 518614 484649 498973 490697 455484 452953 457969 440541 428352 432304 439456
10236 439456 406941 376117 349067 353727 364637 355979 334623 332111 336488 314964 325625 344818
10224C44818Q740n587K6648L9904N001q199L3103M4004L8857N5412M0868L2704
10212F56273q527j4710o0538m6191l5059o6777k6633L621r44j6409k2066l0058
10200C31982R066l40p890k4683k1037n157J2676M964j51J5204K9592O834m1042
10187C10018m2732m001J6998L0173M5030K3588M3177M6096J9228J4229K0020k8523
10175D93301j3708k8347rq863L72j7125K780O804q140J9275K5942j9024q173M257
10161D49342J3522O426N3746K6024K5864N749R213n833m2485o179p31r548K295
10148E27405q489M575j2175j4871m186k4543K1495L3954N1571N0861L2894L8325
10136F96816J9184j1536J3965q656J44l1393k7935j9102K876l0452k8387n005
$$ plain form
10224 344818 353558 347971 374619 414523 419524 411325 444428 488432 527289 582701 623569 656273
10212 656273 647746 633036 572498 526307 491248 424471 397838 401459 400515 384106 362040 331982
10200 331982 341048 340708 332818 308135 287098 281941 294617 299581 299430 314634 344226 351060 310018
10187 310018 267286 263285 280283 310456 355486 379074 422251 468347 487575 501804 521824 493301
10175 493301 479593 451246 451237 442374 442746 425621 428401 435205 427065 446340 472282 453258 445085 449342
10161 449342 462864 469290 523036 549060 574924 580673 589886 584053 541568 535389 534658 525110 527405
10148 527405 518916 523491 511316 496445 492259 467716 489211 523165 574736 625597 658491 696816
10136 696816 716000 704464 718429 709773 709917 678524 650589 631487 634363 603911 575524 570519
10124E70519L0679J2387j7473O256K029j1906J213J8975l2277k3066k7947J0090
10112E39479K5011J2J5680J4439j0056K4574J4613j0584j6615q834j7721R024
10100E79022r627J9571J5671K2147K5333K5697N322l0773R040Q923j7510P656
10088F60472K433P706L854j2183r197Q352j6363k6122n601K2798J8823q343m3015
10075F03614l7448m2034j4721q549J8529j6977k2326L2883J7373P303J0816K6316
10063E74779L7043K4878L4511L019Q529j939J527m113J3842L0615N0751O0940
10051H34382O7579N0140J2983o720K056n1985n0993O814p390P64L915M2072K4086
10038I27703Q953J0886K7777L8295L6037N0401N453J4146L6575J4605K9820L6650
$$ plain form
10124 570519 601198 613585 596112 602368 604397 592491 593704 612679 580402 557336 529389 539479
10112 539479 564490 564502 580182 594621 584565 609139 623752 613168 596553 587719 569998 579022
10100 579022 569395 588966 604637 626784 652117 677814 683136 652363 661403 670326 652816 660472
10088 660472 662905 670611 674465 662282 653085 661437 645074 618952 613351 636149 654972 646629 603614
10075 603614 566166 524132 509411 500862 519391 502414 480088 512971 530344 537647 548463 574779
10063 574779 611822 636700 671211 674230 682759 680820 682347 678234 692076 722691 773442 834382
10051 834382 901961 952101 965084 958364 960420 908435 857442 864256 856866 857630 861545 903617 927703
10038 927703 936656 947542 975319 1013614 1049651 1100052 1105505 1119651 1156226 1170831 1200651 1237301
10026A237301K5050j0973L3410L8207L466j3574J1890J943O62k223J8500K4220
10014A367879J6190J5019O3489J22868J75699J99586J85204J17061M0694L9438
10004B343127L2845M0616O7061J33974J28253J21657J40739J42215J58360J48885
9994C457732J57100K26457K74008L15121L41624K40537R8428m2131j28240j44793
9984D795843q9854p5222o7917q4096n7540n7074k0411k5581j8240R291J24759
9973D433958K13073K62891L24004M91365O62773R24315J121269J189666J001111
9964A0624425N41398J38800k8302o2840p0423j74653m11429n69016n96486n93641
9954H797833m60976l24036k30566j76197j13005l2312L7604J05398K31237L30938
$$ plain form
10026 1237301 1262351 1251378 1284788 1322995 1326461 1312887 1324777 1326720 1327382 1325159 1343659 1367879
10014 1367879 1384069 1399088 1462577 1585445 1761144 1960730 2145934 2262995 2303689 2343127
10004 2343127 2375972 2416588 2483649 2617623 2745876 2867533 3008272 3150487 3308847 3457732
9994 3457732 3614832 3841289 4115297 4430418 4772042 5012579 5111007 5068876 4940636 4795843
9984 4795843 4705989 4630767 4562850 4478754 4421214 4364140 4343729 4318148 4299908 4309199 4433958
9973 4433958 4647031 4909922 5233926 5725291 6388064 7312379 8433648 9623314 10624425
9964 10624425 11165823 11304623 11276321 11213481 11143058 10968405 10556976 9987960 9391474 8797833
9954 8797833 8336857 8012821 7782255 7606058 7493053 7460741 7498345 7603743 7834980 8165918
9944H165918M31748N36794O20833O86087P55199Q12645R67827J171462J407789
9935A5556302J713832K162731K737278L610217M882130O562593Q736951J1277188
9927E7239222J4110758J7055008J9076301J7170167Q456589m510045j4487193
9920A14110807j7633647j6103456j2954624r505131o341491l714327j545460L88114
9912D6700785K352092M543734O806078Q786613R786523R553014Q531375P186799
9904A04247013N486046L461235J697845L01070j004081j987694k629189l146327
9896A06425918l785494m496817m718269m114112k906235j424909N92281L630050
9888H9202413P988491J4031499K2148673L2211841M2613402M9924052M7294534
$$ plain form
9944 8165918 8597666 9134460 9755293 10441380 11196579 12009224 12977051 14148513 15556302
9935 15556302 17270134 19432865 22170143 25780360 30662490 37225083 45962034 57239222
9927 57239222 71349980 88404988 107481289 124651456 133108045 128598000 114110807
9920 114110807 96477160 80373704 67419080 57913949 51572458 47858131 46312671 46700785
9912 46700785 49052877 53596611 60402689 69189302 78975825 88528839 97060214 104247013
9904 104247013 109733059 113194294 114892139 115193209 114189128 112201434 109572245 106425918
9896 106425918 102640424 98143607 93425338 89311226 86404991 84980082 85572363 89202413
9888 89202413 97190904 111222403 133371076 165582917 208196319 258120371 305414905
9881C05414905K7116204o987496l6813579m8517207m5742994l7478881k8293529
9874A28697423k0105042j3448575q146866l883923m75634K001351L359521L738249
9866I1736504L639432L535177L699284L798614L444149K432919J063868k01507
9858A13148440j284910k947019n529217q508499j0849439j1710780j0625263q297774
9850E3395539n795582l574050j710469m5141J720663L736884O105672Q931785
9842F2765301J2078753J4832596J5778109J2525908L740199p537611j5559140
9835I8624115j7830145j6244502j3379920j0471762p894046n828729m286898l227460
9827A9460653k420187j825858j396219j192548j018119q46020p35327o60786n73110
$$ plain form
9881 305414905 332531109 325543613 288730034 240212827 194469833 156990952 128697423
9874 128697423 108592381 95143806 86996940 83113017 82637383 84638734 87998255 91736504
9866 91736504 95375936 98911113 102610397 106409011 109853160 112286079 113349947 113148440
9858 113148440 111863530 108916511 103387294 94878795 84029356 72318576 61693313 53395539
9850 53395539 47599957 44025907 42315438 42270297 43990960 47727844 53833516 62765301
9842 62765301 74844054 89676650 105454759 117980667 121720866 114183255 98624115
9835 98624115 80793970 64549468 51169548 40697786 32803740 26975011 22688113 19460653
9827 19460653 17040466 15214608 13818389 12625841 11607722 10761702 10026375 9365589 8792479
9818H792479n37616m93416m06493k98549k19622j67631r0770j1623O4044J24273
9808F755076K21002K98722L82541M57903N61406N69408M83017L07588J19931j0215
9798A0146379j32333m35055p86351r89668r69841p71821o10786m73540l53596
9789D623388k57198j91813j60626q2954j9957M003O627L4059O6835R1828P4326
9778D188518O9860O0201L1773M3947M4919N8403J4911o2638j31474k05065j73453
9767C939902q9217r0739j13085j28547k00591k29070j92085j86758j61290j26335
9757B422185j28924j33430j33467m9926o333l8556j0652j955J5263q359k1873
9746A903973M59j7985l2439k741k9209m5012n7264r613m728k5914k7551n8048
$$ plain form
9818 8792479 8254863 7761447 7354954 7056405 6836783 6669152 6578382 6566759 6630803 6755076
9808 6755076 6976078 7274800 7657341 8115244 8676650 9246058 9729075 10036663 10156594 10146379
9798 10146379 10014046 9578991 8792640 7802972 6833131 6061310 5450524 4976984 4623388
9789 4623388 4366190 4174377 4013751 3930797 3910840 3914843 3921470 3955529 4022364 4114192 4188518
9778 4188518 4258378 4318579 4350352 4394299 4439218 4497621 4512532 4449894 4318420 4113355 3939902
9767 3939902 3850685 3759946 3646861 3518314 3317723 3088653 2896568 2709810 2548520 2422185
9757 2422185 2293261 2159831 2026364 1976438 1970105 1931549 1920897 1918942 1934205 1925846 1903973
9746 1903973 1904432 1886447 1854008 1851267 1822058 1777046 1719782 1710169 1705441 1679527 1651976 1593928
9734A593928l7946j9064l4692k3937k7676n946J6627L070n736K2548J4855Q621
9722A504652Q154Q630Q95k1743m7807m3155m9913m6503l3556l1811l2049J8433
9710A234227J0271j5263j4221j7927J9752J4227l9318l0482p714j220J8668J2211
9698A183211j3044L2037M149L5022q697K426L4729N1106K0007k8702l5009n8159
9686A219076q5227l3652k3140o3259j8148K6816J3832K673K8594r539o617L0815
9674A082224q217n314p044J3146K1882O696j3540m0367m4330R37l3224j1349j1477
9661I50023l3164r556J3514J9682O426q021J1897M1336M2143m306J3066N3567
9649A096607L5004P6863R6733P0691j5201q5418j01786o2599r0067n9177k4842
$$ plain form
9734 1593928 1555982 1536918 1502226 1478289 1450613 1444667 1461294 1464364 1458628 1481176 1496031 1504652
9722 1504652 1512806 1521436 1522331 1500588 1452781 1409626 1359713 1313210 1279654 1247843 1215794 1234227
9710 1234227 1244498 1229235 1215014 1197087 1216839 1231066 1191748 1161266 1153552 1152332 1171000 1183211
9698 1183211 1170167 1202204 1206353 1241375 1232678 1235104 1269833 1320939 1340946 1312244 1277235 1219076
9686 1219076 1133849 1100197 1077057 1013798 995650 1022466 1036298 1038971 1067565 1058026 1051409 1082224
9674 1082224 1074007 1068693 1061649 1074795 1096677 1103373 1089833 1049466 1005136 1006073 972849 961500 950023
9661 950023 916859 907303 920817 940499 946925 938904 950801 992137 1034280 1029974 1043040 1096607
9649 1096607 1131611 1208474 1305207 1375898 1360697 1275279 1173493 1110894 1020827 961650 936808
9638I36808j1591j1545j859R91J677J9962k4954k799O941J0362j0638m8670j0996
9625H53689J3102k1983o289J9155L147P018n857j4419j9105k6358j3572j4602
9613G73926O175l297K997K841j160k727J2820L5605J5232J8351M4962P745j8122
9600H95348k7215l0719k9785k5612j6495j0284P063J9946K0040j9654j770j0579
9588G70284j9237j0058l676k5067J0944j471n690j051M200J1573M0524J8601O830
9575G96706k9781j3973p072J2102j5250j2183K647j5826j8578J9542K5922m739
9563G39517j5570j3669k9030J6531j4508n867L496l54k411J5653L0754J922L6290
9550G62754M9270L0039K8676K3561K1073P840K2746M1904K7359J7058p2m7757
$$ plain form
9638 936808 925217 913672 911813 912804 914481 934443 909489 906690 913631 923993 913355 864685 853689
9625 853689 866791 844808 838519 857674 860821 867839 861982 847563 828458 802100 788528 773926
9613 773926 780101 776804 779801 782642 781482 778755 791575 827180 842412 860763 905725 913470 895348
9600 895348 868133 837414 807629 782017 765522 755238 762301 782247 802287 782633 780863 770284
9588 770284 751047 740989 737313 712246 723190 721719 716029 714978 719178 730751 771275 789876 796706
9575 796706 766925 752952 745880 757982 742732 730549 733196 717370 698792 718334 744256 739517
9563 739517 723947 710278 681248 697779 683271 677404 680900 680546 678135 693788 724542 726464 762754
9550 762754 812024 842063 870739 894300 915373 923213 945959 987863 1015222 1032280 1032208 984451
9538I84451o9374n5910k8067n5435k1125r874J2041k8734k7992o815j2337j5402
9526F65427N281o10k038K193J6750J0812L9700K0043J4478J2966R351J4780K7598
9513H36731L434l327k013j3930L958q250L8310M5888O4314J35796J83252K11019
9501A495182J83989J38206J8303r6123j41931j33330j54075j32991j12795j05449
9491I58986n4445k9920k9520m8417k5010j6713k1375P057m626J473k2194j3674
9479G01622K929l1242j3924Q150O3355J02164P0923O0325L8453k6697j9925l1246
9467I24887o1574j1942L0538M9594R5371J23376J69809J86864K14080J89406R5755
9456B006164K5102p0497j22400j21889j41865j65715j47356j28973j24606r0972
$$ plain form
9538 984451 915077 859167 831100 775665 754540 744666 756707 727973 699981 693166 680829 665427
9526 665427 670708 670098 668060 670253 687003 697815 737515 757558 772036 785002 794353 809133 836731
9513 836731 840165 836838 834825 820895 824853 816603 854913 900801 965115 1100911 1284163 1495182
9501 1495182 1679171 1817377 1835680 1739557 1597626 1464296 1310221 1177230 1064435 958986
9491 958986 904541 874621 845101 796684 771674 754961 733586 740643 736017 737490 715296 701622
9479 701622 704551 673309 659385 667535 730890 833054 903977 964302 1002755 976058 956133 924887
9467 924887 863313 851371 881909 931503 1026874 1150250 1320059 1506923 1721003 1910409 2006164
9456 2006164 2031266 1960769 1838369 1716480 1574615 1408900 1261544 1132571 1007965 916993
9446I16993q2342j11868p2870l5722R085j9464k5068k6876Q112J8482p380K2613
9434E93695L0780j7563k2599R677K4010R579J8462r150k1431o965j5756o858n902
9421E79979K5725L3631N8933R8901J24509J39021Q9649L3399j3065j3822n3047
9410A103813m5070l5569p6054r4963r3433q9717p1814o0640o8027m6421m003l4100
9398C84002l4888K294M891k009J5814L684m382j7086k1148J2330K2249k5192k1082
9385C19477J9333P908m277k448R06j1745M726R001k4239M465L3645J3958K0440
9372C91150M0749M4263j4750M1J4912j3681n2015q500J6840l1909n3134l6212
9360B97754L640j4957J171q044k3473j1573L351M007K5397J4467J0782J2046j861
$$ plain form
9446 916993 834651 722783 649913 614191 623276 603812 578744 551868 559980 578462 571082 593695
9434 593695 624475 606912 584313 593990 618000 627579 646041 636891 615460 608495 592739 585881 579979
9421 579979 605704 639335 698268 797169 921678 1060699 1150348 1183747 1170682 1156860 1103813
9410 1103813 1058743 1023174 947120 852157 758724 669007 597193 536553 468526 422105 418102 384002
9398 384002 349114 351408 356299 354290 370104 373788 369406 352320 331172 343502 365751 340559 319477
9385 319477 338810 346718 342441 339993 340899 329154 333880 342881 318642 323107 356752 370710 391150
9372 391150 431899 476162 461412 461453 476365 462684 410669 402169 419009 387100 333966 297754
9360 297754 301394 286437 287608 279564 256091 244518 247869 251876 277273 291740 302522 314568 312707
9347C12707P971j8367k1185j0871k229q287j9622k1792J0096J5800k0647k3833
9335A99741j5768l546J8437K7734J9140n553l2434n678K0301K241j3376k044K0201
9322B29396K1350r688N2k5499k067O636j7197k7141L4784J2706j5056k639k064
9309B03573p65J2047J0311k9020j3821K16o872J2770J2133r330j6233N033J6072
9296A96114Q263j2914l1388o035j638K034R507Q860j8917l055J1318O946o685
9283A62410O281J6589m2878k0546n70R580M1877K6887k402l3688j6274k2897j8126
9270A06243J0395K8801L7229k3278l1580J991N945j7183j700K6832j3698K1423
9258A51420j3686j7572L1298K9955l8847m5921q787R140k254J3228K8886q024
$$ plain form
9347 312707 320678 302311 281126 270255 268026 259739 240117 218325 228421 244221 223574 199741
9335 199741 183973 180427 198864 226598 245738 240185 207751 202073 222374 224615 211239 209195 229396
9322 229396 250746 241058 241110 215611 213544 220180 202983 175842 210626 223332 208276 205637 203573
9309 203573 202808 214855 225166 196146 182325 182541 175669 188439 200572 191242 175009 180042 196114
9296 196114 204377 191463 160075 154040 152402 154436 163943 172803 153886 150831 162149 169095 162410
9283 162410 168691 185280 142402 121856 121286 130866 172743 199630 197228 163540 147266 124369 106243
9270 106243 116638 145439 182668 159390 127810 129801 135746 118563 116863 143695 129997 151420
9258 151420 137734 120162 151460 181415 142568 96647 87860 97000 94746 107974 136860 128836
9246A28836o135q882K6967J4650l269K120j2427j8711m71K8918J8520j7361l0010
9233A22745K613K6091J4586j1249M351j1723j7542j9140M452l280k7934N69L2209
9220A16748j1581K234l937j4442L714L2644l899j5590K5804K4124M054j9518l5793
9207A04562L205K3342o436j9814n001K040J2014j4261j6850J4611K4644K2554
9195A44610j5032k7336m295k403k120J7578M480j1662m590j3486M959O265N138
9182A02106j5591l0337m371J0898K4365J4987P715K1869o503j0943o15k8443p756
9169G7381Q088p145k4337K6622J9390l098j0867J9547M30j163J2079K1800K6098
9156A64825k2464p454N081k600k0445l9882k4161J9934O820M831j7083n410J7249
$$ plain form
9246 128836 122701 113819 140786 155436 152167 154287 141860 123149 122678 151596 170116 152755 122745
9233 122745 125358 151449 166035 154786 159137 147414 129872 110732 115184 111904 83970 84539 116748
9220 116748 105167 107401 103464 89022 92736 125380 121481 105891 131695 155819 159873 140355 104562
9207 104562 107767 131109 124673 104859 99858 101898 113912 99651 82801 97412 122056 144610
9195 144610 129578 102242 97947 95544 93424 111002 115482 103820 99230 85744 90703 96968 102106
9182 102106 86515 56178 51807 62705 87070 102057 109772 131641 125138 114195 113580 85137 77381
9169 77381 85469 78324 53987 80609 99999 96901 86034 105581 106011 104848 116927 138727 164825
9156 164825 142361 134907 139988 137388 116943 77061 52900 72834 79654 84485 67402 61992 79241
9143G9241o69o588Q220Q381J8326J3654p259j5893o87j051j089L349J0929K2857
9129A31721l964j8073k593J0045l4698j0115K2456p749l4745r806K5236L239J2653
9116H3607j1277K257k010j1871n024j1070K3487K8529k24p807p234M194J5937
9103A01494J9223k5132k6846K714J443K5006j1516l2342p643k7053K5446L1619
9091G6413j3779j1405Q306K9499m707j6841n770O182J9479K1576J4869j7197j5913
9078I0712J0490J1521j4558l2395R590P970K6057K0254j977q046k4132l0795j2427
9065E2264Q548J0064j1272m80m618L0854j3512k5320K5519J7229k943P85j6523
9052G0595j1574m741K666k832m765m911k980q162J0918J2189J3143j799q713j0262
$$ plain form
9143 79241 78572 71984 80204 88585 106911 120565 113306 97413 96726 95675 94586 97935 108864 131721
9129 131721 127757 109684 107091 117136 82438 72323 94779 87030 52285 42479 67715 70954 83607
9116 83607 72330 74587 72577 60706 55682 44612 68099 96628 96404 88597 81363 85557 101494
9103 101494 120717 95585 68739 71453 72896 97902 86386 54044 46401 19348 44794 76413
9091 76413 62634 51229 59535 89034 84327 67486 61716 67898 87377 108953 123822 106625 90712
9078 90712 101202 112723 98165 65770 75360 83330 109387 129641 127664 119618 95486 64691 52264
9065 52264 60812 70876 59604 59124 54506 85360 71848 46528 72047 89276 86333 87118 70595
9052 70595 59021 54280 56946 54114 49349 44438 41458 33296 44214 56403 69546 67747 59034 48772
9038D8772p368m837J5084K4662q254m485J3208o468j8638K7605J5237l341k2640
9025F8537j6642l541o416j5705K1786j1885P761J6497J4080k0701l479k543L0902
9012G8651J1815j0594k7024l2345n95J7744K2444R892o368j7069o149m930O80
8999C6152K561J8640J7173r516j6006N584r125p354q796k5296j3575L3345J2576
8986C6363l117J2905J9485J856M337n490k2408n764p830P818Q965j9285J5628
8973D3463J1825l161r402r39O527r422j8028k4315m151p7r806p9K4622K3111j0629
8958A9539R334J3773j5802j7115J8387J9940J3923O053p157l009k5372j7032K0803
8945C6265M3281j5826l4981p527K227j5387M0628O406k8594l2373P823L9566J2416
$$ plain form
9038 48772 41404 36567 51651 76313 68059 63574 76782 70314 51676 79281 94518 91177 68537
9025 68537 51895 48354 41938 26233 48019 36134 43895 60392 74472 53771 50292 47749 78651
9012 78651 90466 79872 52848 20503 19908 37652 60096 69988 63620 46551 40402 35472 36152
8999 36152 38713 57353 74526 65010 49004 54588 45463 38109 29313 4017 -9558 23787 36363
8986 36363 33246 46151 65636 67492 71829 66339 43931 38167 30337 38155 47120 27835 43463
8973 43463 55288 52127 42725 41786 48313 38891 20863 -3452 -7603 -7680 -17486 -17565 7057 30168 19539
8958 19539 28873 42646 26844 9729 28116 48056 61979 68032 60875 57866 32494 15462 36265
8945 36265 79546 63720 28739 21212 23439 8052 48680 55086 26492 -5881 1942 41508 53924
8932E3924k2131K2145j2965l1061r222j1056J0361K8933J0988J1233k3313j0911
8920A6925k3239K395K0025L532j7966J0771J8702J5834m758j4313m138K6033J6746
8907F6549J2741k9741J0191j5179J5923j4471l6984j5741R830j7759K3491J0882
8895A9732j4329J1092r035j3194j2374R090K5868Q300k623K262n589K146R402
8882C0748K3701M844K7570j267k4957j1369R676l1423k086P821N179l482j1910
8869B3045J1557J5275P811k2016K0248K7242m98j0525n300r943k6735k5724q011
8856c574J4154J2617K2901J1115J353J2089j4083M7308K2454j9493l620j2302
8844I0919J8884L537n6474n162O901j0671j7111J1524L2995j7304p147r969p514
$$ plain form
8932 53924 31793 53938 40973 9912 690 -10366 -5 28928 39916 51149 27836 16925
8920 16925 -6314 -3919 16106 19638 1672 12443 31145 46979 42221 27908 23770 49803 66549
8907 66549 79290 49549 59740 44561 60484 46013 9029 -6712 3118 -14641 8850 19732
8895 19732 5403 16495 7460 -5734 -18108 -9018 16850 25150 22527 24789 19200 21346 30748
8882 30748 54449 59293 86863 85596 60639 49270 58946 27523 25437 33258 38437 34955 23045
8869 23045 34602 49877 57688 35672 55920 83162 82664 72139 66839 56896 30161 4437 -3574
8856 -3574 10580 23197 46098 57213 58566 70655 56572 103880 126334 106841 103221 90919
8844 90919 109803 113340 56866 51704 58605 47934 30823 42347 75342 58038 50891 40922 33408
8831C3408J1266J7041q77Q092j5692j9502k0424j467Q19N541J7592j3296p437
8818A5064o141k3345L2935K1069O752J3397J541o987K645J580k4127k3179N272
8805A6476j7126J634q254J9088J8165K0671k0089L737J2389j3956m017j6447n946
8792F325L0145K9000m227j4987k9956p380q243R295O529N731N349P992J8393l463
8778E0503J0615J8958Q40j3176N334k0519l8809l458J8009Q463J916j1824j8046
8765H806k653J1794J297J0108K4276P984k2256k4638P614N781Q722j0064j007
8752B5764K1948k5310P86K3296n75j5355Q884J6405j3358j7576k7001K0744j3055
8739E597r744L337L4902K8775k1148J3332j7107l0219N152q10j7054Q316k763
$$ plain form
8831 33408 44674 61715 60838 68930 53238 33736 13312 11845 12664 18205 35797 22501 15064
8818 15064 8923 -14422 18513 39582 46334 59731 61272 54285 56930 58510 34383 11204 16476
8805 16476 -650 984 -7270 11818 29983 50654 30565 34302 46691 32735 28718 12271 6325
8792 6325 36470 65470 61243 46256 16300 8920 677 9972 16501 22232 27581 35573 53966 50503
8778 50503 61118 80076 80916 67740 73074 52555 13746 10288 28297 36760 38676 26852 8806
8765 8806 6153 17947 19244 29352 53628 61612 39356 14718 22332 28113 36835 26771 25764
8752 25764 47712 22402 23188 46484 45909 30554 39438 55843 42485 24909 -2092 18652 5597
8739 5597 -4147 -810 34092 62867 41719 55051 37944 7725 12877 12067 -4987 3329 566
8726E66p9j3755p118J0892K2317M3878L3021K01K859M204l8676k2810N272k0427
8712B0345k1708J6047L0288K0478j3475j4086k033r65K9249R457j7611j5383m367
8699C6236r195j499j4865J2103pj2217P685K7110N103r238J156P642m6j8808o038
8684B5122N65Q822K4060L458n652k562o547j367k2003J7777L7796K3180l809k2645
8670G6195M599j4153l204q464j0645J5839j29J2696j2202j3335j9326l0812J228
8657a713J7816J2151J5732k9886j9471K71J6359j212P227P012k9480o535p090
8644a8819J0830R365j7167l489L0500J092l427R589j4172L230n900J3067J5414
8631C0113J1730L38k2402r392J5998K0961l541l7178o167L4446J31M664K6313
$$ plain form
8726 566 487 -13268 -20386 -9494 12823 56701 89722 89923 92782 96986 58310 35500 40772 20345
8712 20345 -1363 14684 44972 65450 51975 37889 35856 34891 64140 73597 55986 40603 36236
8699 36236 27041 25542 10677 22780 22773 10556 18241 45351 50454 41216 42372 50014 49968 31160 25122
8684 25122 25687 34509 58569 62027 56375 53813 47266 45899 23896 41673 79469 102649 98840 76195
8670 76195 80794 66641 63437 54973 44328 60167 60038 72734 60532 47197 27871 -2941 -1713
8657 -1713 16103 28254 43986 14100 -5371 -5100 11259 10047 17274 24286 -5194 -11729 -18819
8644 -18819 -7989 1376 -15791 -19280 11220 12312 8885 18474 4302 7532 1632 14699 30113
8631 30113 41843 42181 19779 10387 26385 47346 43805 6627 460 34906 35037 39701 66014
8618F6014j1791n486O656j0452k5533j3502J9283J5353n727n13j5697K1634K0577
8605F0816P641j0767K2108J6302k8401m884J1176p991o013j6510K1783J7810j1388
8592G1682N465J1640j1343M681J8193n472k1690J4292M2481J3592p286k2836j2123
8579A01276K3444J8219j3119L9597J7965j5562M665M2568K1984L021o481J4775
8567B52352L9206K6284j7876m5107o7175l5133R331k9029l0881P921j6713k2628
8555G0552l6330K795J4699J5573L5342J1672j3647k5744o901k8069m1955J108
8543i05l640K8822J9924k8833n604l843j1047k1844J8674K9799J4177j685j3572
8530B0423L829j2702j1582j1838O645J534J4883L971J0132Q75j5613K0584M118
$$ plain form
8618 66014 54223 48737 55393 44941 19408 5906 25189 40542 34815 34302 18605 40239 60816
8605 60816 68457 57690 79798 96100 67699 62815 73991 66000 59987 43477 65260 83070 71682
8592 71682 77147 88787 77444 82125 100318 94846 73156 87448 129929 143521 136235 113399 101276
8579 101276 124720 142939 129820 169417 187382 171820 176485 219053 241037 244058 237577 252352
8567 252352 291558 317842 299966 254859 187684 152551 161882 132853 101972 109893 93180 70552
8555 70552 34222 37017 51716 67289 102631 114303 100656 74912 68011 39942 -2013 -905
8543 -905 -4545 24277 44201 15368 9764 5921 -5126 -26970 -8296 21503 35680 33995 20423
8530 20423 24252 11550 -32 -11870 -5225 -3691 11192 15163 25295 26170 10557 31141 35259
8517C5259j3656R970P304j6421o805M623j276L7685N807j3405k9745r355r198
8504G87J1992K6712n966j0768O618j2418J5970K2217K8938J9069k1392k0196j9809
8491D1754Q975o211j0943k3441m524k434q136r800j527J4213J1949J5033L2411
8478E7319J5898r262o882r226P46m078J3113L2928K3031j4973q041l0748l9123
8465B0702j1463J3320K593J7953J4349j677j6293j0731J5303K463n202N170j7069
8452B9418J2091J1572J0055j8739k2525l0489O251L295N057p059o154k9795K8021
8439i001R064p02K1868P831M096j1667p747N856l5216j8686R807K4376Q201J4920
8425B3000j8050l2080K0066K3612j0586k5267R738K670J6041k1405M46K1927K6917
$$ plain form
8517 35259 21603 31573 38877 22456 15651 20274 18998 56683 62490 49085 19340 9985 787
8504 787 12779 39491 33525 22757 29375 16957 32927 55144 84082 103151 81759 61563 41754
8491 41754 50729 44518 33575 10134 5610 3176 -4960 -14760 -16287 -2074 9875 24908 57319
8478 57319 73217 63955 57073 47847 48593 44515 57628 90556 113587 98614 90573 59825 20702
8465 20702 9239 22559 25152 43105 57454 55777 39484 28753 44056 46519 41317 46487 29418
8452 29418 41509 53081 63136 44397 21872 -8617 -2366 929 5986 -1073 -7227 -37022 -9001
8439 -9001 63 -639 21229 29060 33156 21489 13742 19598 -15618 -34304 -24497 -121 8080 23000
8425 23000 4950 -27130 -7064 16548 5962 -19305 -9567 -6897 9144 -12261 -11815 10112 37029
8412C7029j8372J997L167O864j1160k7023J200K6335R52m068N143j4238q99k448
8398D479Q272k6544r957N646J7750K7619P054r856k4723k0355J6831n128M817
8385d095n587j2111m369q09k969O474M025r08J3625J8911K0870p956j5586j5603
8371f088j592J2051q346j2120J4725j089O756J9452q370m7974l4828K3810L5942
8358g671P82J2474k7504l8637m160J6964Q012L635j4717L2953L9950j5221j3207
8345f347j0232m233N774L260k302j6654o272L6155K4873j8080o839j2010j3306
8332b6213q53M38J4117J3908k2316k4387Q284J473j3644J0755o818J7256J0183
8319a7817k0599J2372K6671J6378j1059r218l2962p827L2592k0923k3276J0414
$$ plain form
8412 37029 18657 20654 23821 30685 19525 -7498 -6298 20037 20989 16921 22064 7826 6927 4479
8398 4479 12751 -13793 -23750 -18104 -354 27265 34319 24463 -260 -20615 -3784 -8912 -4095
8385 -4095 -9682 -21793 -26162 -26971 -29940 -23466 -19441 -20349 -6724 12187 33057 25101 9515 -6088
8371 -6088 -7680 4371 -3975 -16095 -1370 -2459 4297 23749 15379 -32595 -67423 -43613 -7671
8358 -7671 -6889 5585 -21919 -60556 -64716 -47752 -39740 -36105 -50822 -17869 22081 6860 -6347
8345 -6347 -16579 -20812 -15038 -11778 -14080 -30734 -37006 -851 24022 5942 -897 -12907 -26213
8332 -26213 -27066 -26628 -12511 1397 -20919 -45306 -37022 -35549 -49193 -38438 -45256 -28000 -17817
8319 -17817 -38416 -26044 627 17005 5946 -3272 -36234 -44061 -11469 -32392 -55668 -45254
8307d5254o30n626P885J8112l867j3045K6770L5941n2534l6774K905J4612J0957
8294d0548J0138r137k2185R849L0124n050q824M900n618j7422J0624L1086J2587
8281E24l111j1512j603k0124j1134J0051K2275j8020N414Q497j5382m215L3734
8268d606K7026k09j3224K0906J929l0664m0303j7865J6354J9836p925P632L6775
8255A5662K5448r381j1974P572k1035j6211k0006p680j806j5252J1862K4392J1645
8242f764K612p764k0821q896K1861J1994K1090K1965r201l5714o167J1851j3386
8229a7340q847l227L8592J5647j9681j2882k4172K7019R006l4068p962N097j9629
8216e2447R7K1563l60j0440l6441k1238J3533K2936J26j628L1813K1021j1297
$$ plain form
8307 -45254 -45884 -51510 -43625 -25513 -29380 -42425 -15655 20286 -32248 -69022 -66117 -51505 -40548
8294 -40548 -30410 -39547 -61732 -51883 -21759 -26809 -35633 -30733 -36351 -53773 -43149 -12063 524
8281 524 -2587 -14099 -15702 -35826 -46960 -36909 -14634 -32654 -27240 -18743 -34125 -38340 -4606
8268 -4606 22420 22211 8987 29893 31822 1158 -39145 -57010 -40656 -20820 -28745 -21113 15662
8255 15662 41110 31729 19755 27327 6292 -9919 -29925 -37605 -39411 -54663 -42801 -18409 -6764
8242 -6764 -4152 -11916 -32737 -41633 -19772 -7778 13312 35277 26076 -9638 -15805 -3954 -17340
8229 -17340 -26187 -29414 9178 24825 5144 -7738 -31910 -4891 4115 -29953 -37915 -32818 -52447
8216 -52447 -52350 -30787 -31147 -41587 -78028 -99266 -85733 -62797 -62671 -64299 -32486 -11465 -22762
8203b2762J2151M2919j205l2322j7545k792m959N871J4560k6628J4246J1515j6286
8190b3237j3237j022P875L006J3742n596J7605j621k0143K1883j9544k8903K1119
8177b8073R87j8342j0776o99J3103M1138J2477J2535O289k0668k2570N216n346
8164a4729p462m972N321N786m67K5488j3988j0165j1224j9040M570J9917m785
8151b5750M86p209J3682O348J3469k3293r142J8275K8508j6444m943l66j4232
8138b0611K7320N901k6220n416r396J8494K5727m775k4839q092k4470j4779J1864
8125d9292L9457K0191k035j4097j4979K3467L7849J0147k8156k6316M594j3698
8113a2868j831J6932R237J0467q12j4567m682J68J6126j2625j2667K7165J0967
$$ plain form
8203 -22762 -10611 32308 31103 -1219 -18764 -21556 -26515 -20644 -6084 -32712 -18466 -6951 -23237
8190 -23237 -36474 -37496 -29621 -26615 -12873 -18469 -864 -2485 -22628 -745 -20289 -49192 -28073
8177 -28073 -27086 -45428 -56204 -56903 -43800 -2662 9815 22350 28639 7971 -14599 -9383 -14729
8164 -14729 -22191 -27163 -21842 -16056 -16523 8965 -5023 -15188 -26412 -45452 -40882 -20965 -25750
8151 -25750 -25264 -32473 -18791 -12443 1026 -22267 -31409 -13134 15374 -1070 -6013 -6379 -20611
8138 -20611 6709 12610 -13610 -19026 -28422 -9928 15799 11024 -13815 -21907 -46377 -61156 -49292
8125 -49292 -9835 10356 8321 -5776 -20755 2712 40561 50708 22552 -3764 830 -12868
8113 -12868 -14699 2233 11470 21937 21125 6558 1876 2044 18170 5545 -7122 20043 31010
8100C1010q196n488j7147n425k5880L241p351j936J3244L1587j1151j1264J5048
8087B92r235J8551O842k042K7769N062j3352R74j7682j9811o180J0304M797L3792
8073D0081j6320J6966J8219k4905l3735k6135M384m489R013K1339K2512M2238
8061F9168J3344k4385k1746k8840j9439J9639K1548K4335k048m1276l286K0169
8049B7183K4031Q048k2536q803k445J471k2419j4871j3317L3188K6368k6354j6116
8036f572M98K7849K1890q458J4534J9224K2375k999k57N570j8250J2939L154j3109
8022G8388J201M133q655j7379j1066N468J6827L429J6693K1000j9910k3623j8088
8009D8418Q035J3144J4148R186j9621l4308O967M3516P648k5931k3111J1460P131
$$ plain form
8100 31010 22814 17326 179 -5246 -31126 -27885 -35236 -37172 -23928 7659 -3492 -14756 292
8087 292 -8943 9608 16450 14408 42177 47239 33887 34861 17179 -2632 -8812 1492 6289 40081
8073 40081 23761 40727 58946 34041 306 -25829 -21445 -25934 -16921 4418 26930 69168
8061 69168 82512 58127 36381 7541 -11898 7741 29289 53624 51576 10300 7014 27183
8049 27183 51214 59262 36726 27923 25478 26949 4530 -10341 -23658 9530 35898 9544 -6572
8036 -6572 -6074 21775 43665 35207 49741 68965 91340 88341 88084 93654 75404 88343 91497 78388
8022 78388 79589 83722 75067 57688 46622 52090 68917 72346 89039 110039 90129 66506 48418
8009 48418 56453 69597 83745 92931 73310 39002 45969 89485 97133 71202 48091 59551 66682
7996F6682q019j4731l918j5958q734J1215j4366J2383M0241j6835k1488p952L4217
7983E2737N446L084L6583K4025j952k8647l9632k5232j2086J7862J0950q153j5921
7970A9064j5908L0977O1292K2210L472l1528k7071l3060n550j0353m915k9423
7958b0793J1758K8031K1989l068M058m067N137k2485r579R169R172k2197j4575
7945g450j0971j26q239J2135J8880L4048O862o309n752L3097M1067k2046L128
7932H8324k2858j5726k9907k8577Q223J3658N051K6418K7067N1101N153n7006
7920G0921l9869k6908K7618K0574m3532j5640K5176J1314m340k611J5640j469
7908C6874J7702J870k0158k3034k6453O495N617l270n329M765N563J9591L747
$$ plain form
7996 66682 58663 43932 40014 24056 15322 26537 12171 24554 64795 47960 26472 18520 52737
7983 52737 58183 61267 97850 121875 119923 91276 51644 26412 14326 32188 43138 34985 19064
7970 19064 3156 34133 95425 117635 121107 89579 62508 29448 23898 13545 8630 -20793
7958 -20793 -9035 18996 40985 37917 41975 37908 43045 20560 10981 20150 29322 7125 -7450
7945 -7450 -18421 -18547 -26786 -14651 4229 38277 45139 38830 33078 66175 107242 85196 88324
7932 88324 65466 49740 19833 -8744 -521 13137 18188 44606 71673 122774 127927 70921
7920 70921 31052 4144 31762 52336 8804 -6836 18340 29654 25314 22703 38343 36874
7908 36874 54576 56446 36288 13254 -13199 -6704 -1087 -4357 -9686 -4921 642 20233 23980
7895B3980o621k0236J5444L296n935p225K8509J7309o515k2060n486Q820J5046
7882C8326k4924o436J1991j4095m4517k771K3742K2914j129j9723j9108J7514
7870a8216O084J0503K0817k940j2031o348n524K9709L8010j1131k4116j720r252
7857A3845K2190n744l6838J1643K9162k6423j058K5131k6329l7733L968K3023
7845e163M0417L2428K308j2649k3017r850O954k2243p704j5456o265k583L377
7832a9446j8242j3357P107L0042K2441J8574J3137k842j4716m551N156m848j3072
7819E383M560K0565k4586j0586j8891n019N544M628j775j5879L929j1027j0837
7806e3991l016j4122J7479K2627M1162Q934j7509r381q849K0018J3075j3862j7782
$$ plain form
7895 23980 17359 -2877 12567 15863 9928 2703 31212 48521 42006 19946 14460 23280 38326
7882 38326 13402 6966 18957 4862 -39655 -42426 -18684 4230 3101 -16622 -35730 -18216
7870 -18216 -12132 -1629 19188 16248 4217 -2131 -7655 22054 60064 48933 24817 23097 13845
7857 13845 36035 30291 -6547 5096 34258 7835 6777 31908 5579 -32154 -28186 -5163
7845 -5163 35254 67682 69990 57341 34324 24474 31428 9185 1481 -13975 -20240 -22823 -19446
7832 -19446 -37688 -51045 -43938 -13896 8545 27119 40256 37414 22698 18147 23303 18455 5383
7819 5383 9943 30508 5922 -4664 -23555 -28574 -23030 -18402 -20177 -36056 -32127 -43154 -53991
7806 -53991 -57007 -71129 -53650 -31023 10139 19073 1564 -7817 -16666 3352 16427 2565 -15217
7793a5217p523K2896K0251k860k9225j4535j165j4134j1932O544K5903J5001k4595
7780c0591m5287l743M6004J8557N468J6190m1081l2821J8535Q124q418L838J4089
7767c1136k4875k883M2481j3979l5190k7081k2618L4300L9474j1726m586K9845
7755b7974K4065O549j8474J119m208R792L7966j6858k8371j9517K9716J5173O351
7742A5329l9626k6511L11L0396M6455l4034j4145K688l349j1798L887j1825j9525
7729f1747j6147K7747J5249J1679j2952j9658j0887k204m455K0292J9783P166
7717b6134K1650J3195k2049l5687j4173j0896M893J7290n323Q725M508m498j7494
7704f5993J9340P296j2945L7845L0178Q163m3949m911r707K664K859n662k601
$$ plain form
7793 -15217 -22740 156 20407 17547 -11678 -26213 -27378 -41512 -53444 -46900 -20997 -5996 -30591
7780 -30591 -75878 -79621 -33617 -15060 -9592 6598 -34483 -67304 -48769 -40645 -49063 -45225 -31136
7767 -31136 -56011 -58894 -16413 -30392 -65582 -92663 -115281 -80981 -41507 -53233 -57819 -27974
7755 -27974 -3909 2640 -15834 -14715 -18923 -9131 28835 11977 -16394 -35911 -6195 8978 15329
7742 15329 -24297 -50808 -50497 -20101 26354 -7680 -21825 -19137 -22486 -34284 -30397 -42222 -61747
7729 -61747 -77894 -50147 -34898 -23219 -36171 -55829 -66716 -68920 -73375 -53083 -33300 -26134
7717 -26134 -4484 8711 -13338 -49025 -63198 -74094 -69201 -51911 -57234 -48509 -44001 -48499 -65993
7704 -65993 -46653 -39357 -52302 -14457 15721 23884 -20065 -24976 -34683 -32019 -29160 -34822 -37423
7691c7423N760K2433J9670O551q375j9725k1676l480K1375J9416k1914q659p479
7678c3526N30J0131L9437j955k4531j3929p731m1424r15K3360J0441J6218K9763
7665E869j2775l50J40j0806O804J6649J0727K9642r777j2868J488L901R637J6760
7651E5041r875k4115j7041J1131q879j6304j2856n228o915o37K7908K5512q22
7638A6920l6368p909P397N595j2748j7992P933O410J2978J6226o433l1686k1744
7625f1421J6313K7697J1919j6757O262l40m099k281O910K533J8488N817m0895
7612b9854j0836K3072K0056k1259k3076J8116J9724J1133o988j1596R660k965
7600d813o803k6467j2070R943M32m233j1134o532J6660P962J3453l603J0791J1667
$$ plain form
7691 -37423 -31663 -9230 10440 16991 8616 -11109 -32785 -36265 -14890 4526 -17388 -26047 -33526
7678 -33526 -32996 -22865 16572 14617 -9914 -23843 -31574 -72998 -73913 -50553 -40112 -23894 5869
7665 5869 -6906 -7256 -7116 -17922 -11118 5531 16258 45900 36123 23255 24743 28644 38281 55041
7651 55041 45166 21051 4010 15141 6262 -10042 -22898 -28126 -35041 -35678 -7770 17742 16920
7638 16920 -19448 -27357 -19960 -14365 -27113 -45105 -37172 -30762 -17784 -1558 -7991 -39677 -61421
7625 -61421 -45108 -17411 -5492 -22249 -15987 -16327 -20426 -22707 -15797 -13264 5224 11041 -29854
7612 -29854 -40690 -17618 2438 -18821 -41897 -23781 -4057 7076 88 -11508 -1848 -4813
7600 -4813 -11616 -38083 -50153 -40210 -39778 -44011 -55145 -61677 -45017 -37055 -23602 -27205 -16414 -4747
7586d747K1332k5485n962k0591m074q644M374j2524J0678J5373j4635j2895O15
7573e7185k174K1382j4879j4572L0854M2153l2846k4278J6847O933M65k5409J4597
7560c8112L5125O417Q730k0107J4007j2062r920k3219j4104K197Q58J3280O308
7547c0602K2171m827j0912L208Q554J5621j1635q139r723P781l228j1760j8132
7534e1623L1888K0598R810j6273j9380j7550K6794K3091k8917k4404k919K7266
7522b1619K458j5521P877J0418K5108j2947k8145J6585J5434l193j6699K1239
7510I95J4574k2807N099q147L712N021o884k1190J6399K868L622j4225p057L9757
7496A1737R678k963P491j9560J2263J1903k1331n0975q087J1501m164k555q744
$$ plain form
7586 -4747 16585 -8900 -14862 -35453 -39527 -48171 -43797 -56321 -45643 -30270 -44905 -57800 -57185
7573 -57185 -59359 -37977 -52856 -67428 -36574 5579 -27267 -51545 -34698 -27765 -27300 -52709 -38112
7560 -38112 -2987 3430 12160 -7947 6060 -6002 -15922 -39141 -53245 -51048 -50190 -36910 -30602
7547 -30602 -8431 -13258 -24170 -20962 -12408 3213 -8422 -16561 -26284 -18503 -21731 -33491 -51623
7534 -51623 -19735 863 10673 -5600 -24980 -42530 -15736 7355 -21562 -45966 -48885 -21619
7522 -21619 -19161 -34682 -26805 -16387 8721 -4226 -32371 -15786 -352 -3545 -20244 995
7510 995 15569 -7238 -2139 -10286 -6574 -1553 -8437 -29627 -13228 -10360 -6738 -20963 -28020 11737
7496 11737 21415 18452 25943 6383 18646 30549 9218 -41757 -49844 -38343 -42507 -45062 -53806
7483e3806n131n373J1039L8432R474o231P798j3671j6318Q642J1220R124J2332
7470G531j3902l1150N326J0120j692m273j2973l2869o759K4103J2165o861J4080
7457c7154K8051P457P294J2937k209l8975k3820J9256N071J1916L101q876l695
7444a9646K7262Q849j3187o356j82m312q113M90J6791j4449J2629J6425J6271
7431C2472k9554j3955j2511k253r841N861m660R276Q125R808k4675j9031r652
7418f0590n598L4464M5966j2206l7480J1259o065k6635j1112K5541L1311k0730
7406c1875k499J068j7447J1102L9438Q018j1552j20j9223r580R164J5492j5128
7393b3142j1198j3714j4859J79k2079K0887K6900k951O319J0547J9392r031r237
$$ plain form
7483 -53806 -58937 -64310 -53271 -14839 -5365 -11596 -3798 -17469 -33787 -25145 -13925 -4801 7531
7470 7531 -6371 -37521 -32195 -22075 -23767 -28040 -41013 -73882 -80641 -56538 -44373 -51234 -37154
7457 -37154 -9103 -1646 5648 18585 16376 -22599 -46419 -27163 -22092 -10176 -7075 -15951 -19646
7444 -19646 7616 16465 3278 -3078 -3260 -7572 -15685 -15195 1596 -12853 -224 16201 32472
7431 32472 2918 -11037 -23548 -25801 -35642 -29781 -34441 -25165 -17040 -7232 -31907 -50938 -60590
7418 -60590 -66188 -31724 14242 2036 -35444 -24185 -30250 -56885 -67997 -42456 -11145 -31875
7406 -31875 -34374 -33306 -50753 -39651 -213 7805 -3747 -3867 -23090 -32670 -23506 -8014 -23142
7393 -23142 -34340 -48054 -62913 -62734 -84813 -63926 -37026 -39977 -33658 -23111 -3719 -12750 -21987
7380b1987L2229M8583Q312o115m6936l2875n816q2J7202K0010O661j4711l0856
7367b6381q86Q634Q274J2386K88j5809k0143P328P691j7040m705K588j0133O3
7353d7845J0885K5801L2842R542m5594j7945L0329K3487j5644k4941k0683M986
7341c4780R039j4291j7205K9667O009J553o359j2058p605K805L6988j5643l4046
7328e5926j8111j1047n274J8397K2359J9392o257l3511l179J9728J9936J1978
7316b1515J8486o725j7999l0160m393k1414o037j4887J0663N4276J4177J7767
7304g761M641K926Q999r634j4779j0235j8612L431J4450j056p383P217J1128l0093
7290d6761P237O253J1776J3576J1107r348P884r10k6489j5353J1371j5685j9674
$$ plain form
7380 -21987 10242 58825 67137 61022 14086 -18789 -24605 -24687 -7485 12525 19186 4475 -26381
7367 -26381 -27267 -18633 -10359 2027 2315 -13494 -33637 -26309 -18618 -35658 -40363 -37775 -47908 -47845
7353 -47845 -36960 -11159 21683 31225 -14369 -32314 -1985 21502 5858 -19083 -39766 -34780
7341 -34780 -25741 -40032 -57237 -27570 -21561 -20008 -26367 -38425 -46030 -43225 -6237 -21880 -55926
7328 -55926 -74037 -85084 -90358 -71961 -49602 -30210 -36467 -69978 -73157 -53429 -33493 -21515
7316 -21515 -3029 -9754 -27753 -57913 -62306 -83720 -89757 -104644 -93981 -39705 -25528 -7761
7304 -7761 -3120 -194 8805 -829 -15608 -25843 -44455 -41024 -26574 -27630 -35013 -27796 -16668 -46761
7290 -46761 -39524 -33271 -21495 -7919 3188 -6160 1724 814 -25675 -41028 -29657 -45342 -65016
7277f5016J078m703J6903n97j3344m569N491P682R558Q210K504J0247J2243l0949
7263d5262M4q62k5601J2952J9760J3656K2415j1604j14J4642K1694l627k1820
7250c727k901L069O86k0735L28J4194M399r419j4634N127L460K3928K3626r699
7236A7702j2201r150k371n743N215K3444J067j6372j4766K794P363p755k8194
7223c8967L0262K2929k3271p854K1953K0222n77k0150k4191J9563K425k3725K442
7210a8939n751J8687J5766n146P941J2043o427J019l3258k025O734k412O065l1603
7196c7306l0304K5776o669k7154j535M7726J5391M19J8114M003n604j1139k5974
7183c4256k7354j0308o399K9109J0273k0930K2210j6463J366J8388J9714J4961
$$ plain form
7277 -65016 -63938 -68641 -51738 -52335 -65679 -70248 -64757 -57075 -47517 -39307 -36803 -26556 -14313 -45262
7263 -45262 -45218 -46080 -71681 -58729 -38969 -25313 -2898 -14502 -14616 26 21720 18093 -3727
7250 -3727 -6628 -3559 -2873 -23608 -23280 -9086 -4687 -14106 -28740 -23613 -20153 3775 27401 17702
7236 17702 5501 -3649 -6020 -11763 -6548 16896 17963 1591 -13175 -10381 -3018 -10773 -38967
7223 -38967 -8705 14224 -9047 -16901 5052 25274 24697 4547 -19644 -81 2344 -21381 -18939
7210 -18939 -24690 -6003 9763 4617 12558 24601 18174 19193 -14065 -16090 -9356 -11768 -5703 -37306
7196 -37306 -67610 -41834 -48503 -75657 -77192 -29466 -14075 -13656 4458 8461 2857 -8282 -34256
7183 -34256 -61610 -71918 -78317 -49208 -38935 -59865 -37655 -54118 -52752 -34364 -14650 311
7171C11L877j1789m967o616k2999p56R486K4593q258k1491k0003J2504Q757P954
7157b9397J1217r73o400l1685O802J8441J9665L5681k3069j8643j9334k9318K8849
7144c8164L0636k629m994j4556K62P322R425L1825j2839o766n055K8853K8461
7131E1781j1120k8036j92k9550j8856J6454J3491k738N120o98J3681j4785j4569
7118b0017l842q021J5708o145l414o455K7236L6344j0371M00j4522O165o064j0030
7104c028j8307n387J8685J4607k3528j4622M494L689K3200M969O940l284r812
7091a384m018k7634n359j5850J264J0325J5699n628M7367J3859m2487k3009K0847
7078a6008K1028j4721o07N641j7508R82q868K2246Q415k4671k3738O162j266O759
$$ plain form
7171 311 4188 -7601 -12568 -19184 -42183 -42939 -33453 -8860 -17118 -38609 -58612 -46108 -37351 -29397
7157 -29397 -18180 -19153 -25553 -57238 -50436 -31995 -12330 23351 282 -18361 -37695 -67013 -38164
7144 -38164 -7528 -10157 -15151 -29707 -29445 -22123 -12698 19127 6288 -478 -5533 23320 51781
7131 51781 40661 12625 12433 -17117 -35973 -19519 -6028 -8766 -3646 -4344 9337 -5448 -20017
7118 -20017 -23859 -31880 -16172 -22317 -25731 -32186 -4950 31394 21023 21423 6901 13066 7002 -3028
7104 -3028 -21335 -26722 -8037 6570 -16958 -31580 -27086 -23397 -197 4772 11712 8428 -1384
7091 -1384 -5402 -33036 -38395 -54245 -52981 -42656 -26957 -32585 14782 28641 -13846 -36855 -16008
7078 -16008 5020 -9701 -10308 -4667 -22175 -21193 -30061 -7815 600 -24071 -47809 -41647 -42913 -36154
7064c6154J6618j6296q380J6356Q785k2530K71kK506K9770J7787k0844k7359p091
7050d6563O68r435L2468J7396r104k2320j2538J7658R815j6622K662J7471k1961
7037d0405n378J6576J9628J5943r802l3655j7O532M888o017m949J8084J7599j8582
7023a9555k7407P693K8305o70K71k2474j2617J5729J1531J6011P508J2062l872
7010A2515j8835J6927r399J2934r746k3752j7917J2580K2605N24L525q598j6164
6997b2801k1364J1155J8778j7789J1752N803k212r234k0919j7733L158J9602K0984
6984b0820k0322j2347P516L4129L1220N539j0288j5029r485j2112k1753J1364
6972c2388j7681K1384J3979j5017j7677j077K6369K3276J5877m317q020j4217
$$ plain form
7064 -36154 -19536 -35832 -44212 -27856 -19071 -41601 -41330 -41332 -38826 -9056 8731 -12113 -39472 -46563
7050 -46563 -45895 -55330 -22862 -5466 -14570 -36890 -49428 -31770 -21955 -38577 -35915 -18444 -40405
7037 -40405 -45783 -29207 -9579 6364 -3438 -37093 -37110 -30578 -25690 -31707 -36656 -18572 -973 -19555
7023 -19555 -46962 -39269 -10964 -11634 -11363 -33837 -46454 -30725 -19194 -3183 4325 16387 12515
7010 12515 -6320 10607 1208 14142 4396 -19356 -37273 -24693 -2088 -1564 1961 -6637 -22801
6997 -22801 -44165 -33010 -14232 -32021 -20269 -14466 -16678 -25912 -46831 -64564 -61406 -41804 -20820
6984 -20820 -41142 -53489 -45973 -11844 19376 24915 14627 -402 -9887 -21999 -43752 -32388
6972 -32388 -50069 -28685 -14706 -29723 -47400 -48477 -22108 1168 17045 12728 4708 -9509
6960i509k7881j4233J2597J2694J2047J0042l851q691L7359M576j6726j7631j1157
6947b0364j636K2250J064l5680k582K7712K0906j279K660J6586k1184k5880k7094
6934d4521p698l777J010J0396L504K2138K4217j9335j6968J4942K8202r776l1522
6921b9188j6438P035r257J149K336J2685K0454N259j5935k2469r455J8819l757
6908c8762N0875N71k0146N211O484j3158j1208j513l4657J4613K4544Q279K440
6895f427j6396l3711Q958m822K5J0369L15K0713K1423l870q619m1731L13k101
6881e5561l762J3784j8057M660P117P639j1381l003J4649R45L3433J9767Q5L823
6867A4138k0712k6948L8671J232j0642J3170m089j0249K0554r654R213J3054M185
$$ plain form
6960 -9509 -37390 -51623 -39026 -26332 -14285 -4243 -8094 -16785 20574 25150 8424 -9207 -20364
6947 -20364 -22000 250 1314 -34366 -36948 -9236 11670 10391 13051 29637 8453 -17427 -44521
6934 -44521 -52219 -55996 -54986 -44590 -41086 -18948 5269 -14066 -31034 -16092 12110 2334 -29188
6921 -29188 -45626 -38591 -47848 -46699 -44363 -31678 -11224 -5965 -21900 -44369 -53824 -35005 -38762
6908 -38762 12113 12684 -7462 -2251 4233 -8925 -20133 -21646 -56303 -41690 -17146 -8867 -6427
6895 -6427 -22823 -56534 -47576 -52398 -52373 -42004 -41689 -20976 447 -3423 -12042 -53773 -53460 -55561
6881 -55561 -59323 -45539 -63596 -58936 -51819 -44180 -55561 -58564 -43915 -42970 -9537 10230 10315 14138
6867 14138 -6574 -33522 5149 6381 -4261 8909 4820 -5429 15125 5471 14684 27738 31923
6854C1923n002k7362m852K401j0263L333k1746P005M713j2409J6493K4234k2245
6841a3777o438M0460O6j8464q492k1115K024J397J7908K6499J2488j4209l240
6828A5107J225j1642l934m7908p601l4159O311M2069J0494k9521J9353J3798N535
6815b0873N498j0034J5455J0361J0915k6702p672N2262K9378o439j6728l1779
6803C642r874K2561l9571l0157M7419L502j0648J0477r167j4526j0761j9695J9182
6790c7616L3868n815k1333p863J405k922M419j4172P574L8133K1965l6536k68
6777a9161j2466P492L980K9672j8812m1830j1909K334Q699L5338K4452j0086n400
6764g697J1692K0052Q977R30k2745j4930o389j2315L8963j52k8786r553l538o826
$$ plain form
6854 31923 26921 -441 -5293 -2892 -13155 -9822 -31568 -24563 -19850 -32259 -15766 8468 -13777
6841 -13777 -20215 20245 20311 1847 -6645 -27760 -25736 -24339 -6431 20068 32556 18347 15107
6828 15107 16332 4690 756 -47152 -54753 -88912 -82601 -40532 -30038 -59559 -40206 -26408 -20873
6815 -20873 -15375 -25409 -9954 407 11322 -15380 -23052 29210 58588 52149 35421 3642
6803 3642 -6232 16329 -23242 -53399 -5980 -2478 -13126 -2649 -11816 -26342 -37103 -56798 -37616
6790 -37616 -3748 -9563 -30896 -38759 -37354 -40276 -35857 -50029 -42455 -4322 17643 -18893 -19161
6777 -19161 -31627 -24135 -20155 9517 -9295 -51125 -63034 -60700 -52001 -16663 7789 -2297 -7697
6764 -7697 3995 24047 33024 33954 11209 -3721 -10110 -22425 16538 16386 -12400 -21953 -25491 -32317
6750c2317J0014M1449M17k5305L754J5421j060k4888L741m511J4797j7816M463
6737a1841j2002J6090J635J3521M17p364J9906K5162p866j4989L518P778r357
6724B4608O071J0966j0120j976J318M415j3130j2246j0871m7k473j8560L988J6303
6710a754M377j602o362k0197J4566N162M101M7938N0167N5374R1518J04806M4786
6697C92880j2481o6023j15713p5790m6471l3823l7367q849J425q899O423p372
6685a2060j6895n16k902j9709Q116L3445M481J1296l4569j8630J7930J3197J6862
6672D6J7176M211p009j1985j9878J517q545P152J4634p066p751J5201q248k7132
6658c7677l744o536N252K6002P283l60o126l158J8344Q57j1312K8511Q611Q797
$$ plain form
6750 -32317 -22303 19146 19563 -5742 -1988 13433 12373 -12515 -8774 -13285 1512 -16304 -11841
6737 -11841 -23843 -7753 -6118 7403 7820 456 20362 45524 37658 22669 26187 33965 24608
6724 24608 30679 41645 31525 29549 30867 35282 22152 9906 -965 -1012 -3485 -22045 -18057 -1754
6710 -1754 2623 1021 -5341 -25538 -10972 -5810 -1709 46229 96396 151770 243288 348094 392880
6697 392880 380399 314376 198663 122873 76402 42579 5212 -3637 -2212 -11111 -4688 -12060
6685 -12060 -28955 -29471 -32373 -52082 -43966 -10521 -6040 5256 -29313 -47943 -30013 -16816 46
6672 46 17222 21433 14424 2439 -17439 -15922 -24467 -17315 -2681 -9747 -17498 -2297 -10545 -37677
6658 -37677 -41421 -47957 -42705 -16703 -9420 -9780 -15906 -19064 -720 137 -11175 17336 25947 34744
6644C4744q014k0530l2401j1642m239J1878J2731P153j4017p254J739k644j5288
6631d7784k2429J9808K1390J7715J8661J5722m63O835J705l0375j602n347O227
6618F3r290j9580K707L1914J772M254j7118r489M521r015o684J8788o064J6811
6604C590J1205j283j1325l0528j1880J127J4891j873j6882k215P341o643P473
6591c7002M2974R670O82j2824k5686j7252L9574R501j1358L468J6681m455j6812
6578b839k5675k987o88j1150J2864K576p533k6109J3019k5779R624K2930m32j0822
6564e3001m194R601l170p22L7086Q530J0883o826r587P000l797j1779J740l626
6550b1862q831j3817R485K9893K1082J404j0901J6964J2235k0496k6547p749K6598
$$ plain form
6644 34744 26730 6200 -26201 -37843 -42082 -30204 -17473 -10320 -24337 -31591 -29852 -32496 -47784
6631 -47784 -70213 -50405 -29015 -11300 7361 23083 22620 29455 31160 785 -817 -6164 63
6618 63 -9227 -28807 -26100 5814 7586 11840 -5278 -14767 -10246 -19261 -25945 -7157 -13221 3590
6604 3590 14795 13512 2187 -28341 -40221 -39094 -24203 -26076 -42958 -45173 -37832 -44475 -37002
6591 -37002 5972 15642 16324 3500 -22186 -39438 136 9637 -1721 1747 18428 13973 -2839
6578 -2839 -28514 -31501 -32189 -43339 -30475 -27899 -35432 -61541 -48522 -74301 -64677 -41747 -42179 -53001
6564 -53001 -57195 -47594 -50764 -51486 -14400 -5870 5013 -1813 -11400 -4400 -8197 -19976 -18236 -21862
6550 -21862 -30693 -44510 -35025 -5132 15950 17354 6453 23417 35652 15156 -11391 -19140 7458
6537G458O46k1183o064l4625m856J8633K70K197K2493J0128j2559J0641l3192
6524d0013Q469J1927j0321k0644j829M550j351O000K1385L2900J5676k7562o765
6511g578K9204J4437k2485O729j7617j1712K631r249j6259j299J191j8669O785
6498d3891K1625j8158M117K2119K341J510J3462J2991j697j6213l9204L0160J7022
6485F184m648p909R253O611O407L633J8874N646l1380L556M944j7724r585j2858
6471a8996k6082L5273L3143P327K0387J1357k2077j1491j0991j6575r830k779
6459a1334k2591k2741J0597M051J0707L583R86O846j3615j42M760K8378J2339
6446A1824l4333p671L8056M781l6420m944J5114j1997J8062p984j5167j8265L2287
$$ plain form
6537 7458 8104 -13079 -19143 -53768 -58624 -39991 -39721 -37524 -15031 -4903 -17462 -6821 -40013
6524 -40013 -31544 -19617 -29938 -50582 -52411 -47861 -49212 -43212 -21827 11073 26749 -813 -7578
6511 -7578 21626 36063 13578 20307 2690 -9022 -6391 -15640 -31899 -33198 -32007 -50676 -43891
6498 -43891 -22266 -40424 -36307 -14188 -11847 -10337 3125 16116 14419 -1794 -40998 -10838 6184
6485 6184 1536 -6373 2880 9491 15898 19531 38405 44051 12671 16227 21171 3447 -6138 -18996
6471 -18996 -45078 -9805 23338 30665 51052 62409 40332 28841 17850 1275 -8555 -11334
6459 -11334 -33925 -56666 -46069 -42018 -31311 -27728 -26742 -19896 -33511 -33653 -28893 -515 11824
6446 11824 -22509 -30180 7876 12657 -23763 -28707 -13593 -25590 -7528 -15512 -30679 -48944 -16657
6433a6657J602k568M45l6530O415K0044J757j447o833j140O111L3729J0959j2506
6419C381J9985q788n993J5914K0217j3587j8837j6751j1065P006K2872r2j9369
6406e107j1807J4559K668j3053m0135j2443j803K5889J1662m586k7204o043J0507
6393e6896j4628J7147M2193N586K0388O096l240k0042m814K1888j2379l4310j5328
6380d8339K4896K2403q192j1810j7443j7564J4817L6377J1548L716Q385O841L006
6367B8641k3259j7868n038L1641R133k4485j1693J612p204J0150J8379L934j9397
6354e454j630R038N206Q188M433J1161O300l3011k6373o458J443K5573p792j1051
6340b0427M639K3900j8764l5648R141K3635J4951l2615k3282r430K2339K0470
$$ plain form
6433 -16657 -15055 -17623 -17178 -53708 -47293 -27249 -25492 -26939 -33772 -34912 -28801 4928 15887 3381
6419 3381 23366 14578 8585 24499 44716 31129 12292 -4459 -15524 -8518 14354 14262 -5107
6406 -5107 -16914 -2355 313 -12740 -52875 -65318 -67121 -41232 -29570 -34156 -61360 -67403 -56896
6393 -56896 -71524 -54377 -12184 -6598 13790 19886 16646 -3396 -8210 13678 1299 -33011 -48339
6380 -48339 -23443 -1040 -9232 -21042 -38485 -56049 -41232 -4855 6693 10409 18794 25635 28641
6367 28641 5382 -12486 -17524 14117 23250 -1235 -12928 -11316 -18520 -8370 10009 13943 -5454
6354 -5454 -7084 1954 7160 15348 19781 30942 37242 4231 -22142 -28600 -27157 -1584 -9376 -20427
6340 -20427 -15788 8112 -10652 -46300 -37159 -13524 1427 -31188 -54470 -63900 -41561 -21091
6328b1091J507n010Q894j4559j3548M631K1029J7248q391j6596j8534J0972J2408
6315b1040r086j7224j659J0499J8353J4898j1228N436r576o678K5738N389K160
6302E982k0558n961k0205n105J3065p692J8638J323o335J5857n303q501J0920
6289a3875j266K972l339j754j1857j962K2800n547m05Q693q675l2296n901L8399
6275a4013o745r224r629Q18k3278J3838K4777N594J647q791M369m388O448J0083
6261h494j2602j0362J1841J4107J6252n751k3208m871K5283K912k2274p97M667
6248a3297j2020j8665m771L6438J1384R929j3416l1453k3862P534j0460m331L6534
6235c0456K2976m396j6620j982P555O060p741j4380R162j2263J958K7387K9437
$$ plain form
6328 -21091 -19584 -24594 -15700 -30259 -43807 -39176 -18147 -899 -9290 -25886 -44420 -33448 -21040
6315 -21040 -30126 -47350 -49009 -38510 -20157 -5259 -16487 -11051 -20627 -27305 -1567 3822 5982
6302 5982 -14576 -20537 -40742 -45847 -32782 -40474 -21836 -20513 -26848 -10991 -16294 -24795 -13875
6289 -13875 -15141 -12169 -15508 -17262 -29119 -31081 -8281 -13828 -14233 -5540 -14215 -46511 -52412 -14013
6275 -14013 -20758 -29982 -39611 -38793 -62071 -48233 -23456 -17862 -16215 -25006 -20637 -25025 -18577 -8494
6261 -8494 -21096 -31458 -19617 -5510 10742 4991 -18217 -23088 2195 5107 -17167 -17964 -13297
6248 -13297 -25317 -43982 -48753 -12315 -931 8998 -4418 -35871 -59733 -52199 -62659 -66990 -30456
6235 -30456 -7480 -11876 -28496 -30478 -22923 -16863 -24604 -38984 -29822 -42085 -40127 -12740 16697
6222A6697J8370j5936j1518N497J177k8338l005J4343N353j463M254q191j3237
6209a5997m986K4798M0088j1116m3246Q642l02p424L017m250j7627k4310P846
6196d4867K1259J095P579J7164J1802j0857k1134k115P323k0926o323K0978L2101
6183A3079K398k0676l2185j4992j5082j3021K1178l934L1641L9361L3364J792
6171D2923j8153k5308k0774J3714L010Q98o45l460K4778J4244J794M154k5764
6158A1411j2430p710k993J1898n745j2618j511J8422o973N473J1685k6702n825
6145b3618J6285l9555J1824M4819M72J4877L247k3814j5351J482K5772r077P46
6132H109J1146k5974J9356P492j3255P636j0619n067r771j5675O845J0462M285
$$ plain form
6222 16697 35067 19131 7613 13110 14287 -14051 -17056 -2713 2640 1177 5431 -2760 -15997
6209 -15997 -20983 3815 43903 32787 -10459 -1817 -2119 -9543 -6526 -10776 -28403 -52713 -44867
6196 -44867 -23608 -22513 -14934 2230 14032 3175 -17959 -20074 -12751 -33677 -40000 -19022 13079
6183 13079 15477 -5199 -37384 -52376 -67458 -80479 -59301 -63235 -31594 7767 41131 42923
6171 42923 24770 -538 -21312 -7598 -4588 -3690 -4335 -7795 16983 31227 33021 37175 11411
6158 11411 -1019 -8729 -11722 176 -5569 -18187 -19698 -1276 -8249 -2776 8909 -17793 -23618
6145 -23618 -7333 -46888 -35064 9755 10227 25104 28351 4537 -10814 -9332 16440 7363 8109
6132 8109 19255 -6719 12637 20129 6874 14510 3891 -1176 -10947 -26622 -19777 -9315 -5030
6119e030J0944J3027J9337j7743R49j697J893l7823j1123J9222P052O059N647
6106A0714m87j0503k0024J786J4356q422j166J7200j1721k6638L241J1131q587
6093b9120J7398K6594J6967J7373j2944j5795j401P593l031j0608j8665k0854
6081b6493k4894q990J0668M0N847N43J304K6239j856j3572j7829N792J2516K1454
6067i231J5062J7817j4191k7544j523j3840J3229P799N104l041R144K548J1954
6054A3287j597j6823j5192j7708k1852l217K345M9325J5604m0251j2068L10J2982
6041c4855K0605o945k7508o602L2832K4266M88k042j391J312j430P433q092j4532
6027a6461J9599L6522j0459l1092J1720J5809k7469R81R30k9028l8214J8404J8728
$$ plain form
6119 -5030 5914 18941 38278 20535 21484 19787 21680 -16143 -27266 -8044 -992 5067 10714
6106 10714 10227 -276 -20300 -18514 -4158 -12580 -13746 3454 -8267 -34905 -31664 -20533 -29120
6093 -29120 -11722 14872 31839 49212 36268 20473 19072 26665 23634 13026 -5639 -26493
6081 -26493 -51387 -60377 -49709 -49669 -43822 -43279 -41975 -15736 -17592 -31164 -48993 -43201 -30685 -9231
6067 -9231 5831 23648 9457 -18087 -19610 -33450 -20221 -12422 -7318 -10359 -1215 1333 13287
6054 13287 11690 -5133 -20325 -38033 -59885 -63102 -60757 -11432 4172 -36079 -48147 -47837 -34855
6041 -34855 -14250 -21195 -48703 -55305 -22473 1793 2281 239 -1152 160 -1270 6163 -1929 -16461
6027 -16461 3138 39660 29201 -1891 9829 25638 -1831 -850 80 -28948 -67162 -48758 -30030
6014c0030Q221m441n573J0356J2125K2833M673j6558j2163m017J2840J0144l31
6001H079o402j3853j0005m819j3230q185J434j742P454J1368k158n93J9329L648
5987i675k6080j9168j110L7424K0114p671J4973l454J29j5425j1631p266K5559
5974c281M428J8867k054K1104J4376j9036j9583l1771l4456j3030l233J9996K8751
5961a8922j8309J815R981J2156J5268R786k6832j4958k2903o587K1423K7160P334
5948c588r47J1295L851k1792J0350J810n738j0116k0371L1207K9972j5460k5459
5935a4986n435J5147p965l1482K6453R362M752J2047j411P210j2946k0496l616
5922b3366j0120J057J2876K635l1488J0230K7610R674J353n369k3259k0880J5823
$$ plain form
6014 -30030 -21809 -26250 -31823 -21467 -9342 13491 18164 1606 -10557 -14574 -1734 8410 8079
6001 8079 1677 -12176 -22181 -27000 -40230 -48415 -46981 -48723 -41269 -29901 -32059 -32652 -13323 -9675
5987 -9675 -35755 -54923 -56033 -18609 1505 -6166 8807 5353 5482 -9943 -21574 -28840 -3281
5974 -3281 1147 20014 17960 39064 53440 34404 14821 -16950 -51406 -64436 -67669 -47673 -18922
5961 -18922 -37231 -35416 -25435 -13279 1989 11775 -15057 -30015 -52918 -59505 -38082 -10922 -3588
5948 -3588 -4535 6760 10611 -11181 -831 979 -4759 -14875 -35246 -4039 25933 10473 -14986
5935 -14986 -20421 -5274 -13239 -44721 -18268 -8906 -4154 7893 6482 13692 746 -19750 -23366
5922 -23366 -33486 -32429 -19553 -16918 -48406 -38176 -10566 -892 461 -4908 -28167 -49047 -33224
5909c3224K151J4451K8876j0863k2760m313j1510j6132q0J1598L833J2422O828
5896a8723J1549K5323K2788k0742P487k2180k3611p419Q728R571M540J4486o049
5883E748m3100k6262n779K1408J4120J1376N819J2849P128J6432R875K509j3158
5870A8965k6140O695J3492j4874k6895q597J587M645K0179K0692K9048O335j9656
5857B5476p363m185P636j7323J7362M6962j655l2556j5056p648j453n010R066
5844A4253K1627J6310j6995k0866j1957Q74J687N154Q783k176N164j2474n545
5831C839m066j7461N628N745j1095p880J5302j0359J138P720J3091k119L942K1933
5817B5358K5365q441l760n112J279m3917M36J8871N438Q710j2260m595J676k6225
$$ plain form
5909 -33224 -31073 -16622 12254 1391 -21369 -25682 -37192 -53324 -53404 -41806 -37973 -25551 -18723
5896 -18723 -7174 18149 40937 20195 27682 5502 -18109 -25528 -16800 -7229 -2689 11797 5748
5883 5748 -37352 -63614 -69393 -47985 -33865 -22489 -16670 -3821 3307 19739 29614 32123 18965
5870 18965 -7175 -480 13012 -1862 -28757 -37354 -35767 -31122 -10943 9749 38797 45132 25476
5857 25476 18113 13928 21564 4241 21603 68565 66910 34354 19298 11650 10197 5187 14253
5844 14253 35880 52190 35195 14329 2372 3246 4933 10087 18870 16694 21858 9384 3839
5831 3839 -227 -17688 -12060 -6315 -17410 -25290 -9988 -20347 -19209 -11489 1602 -517 3425 25358
5817 25358 50723 42282 38522 33410 34689 -9228 -8792 10079 15517 24227 11967 7372 9048 -17177
5803a7177r666j1879j6517K9216J6987J6303k1715o07j0657K28J9153j5282k108
5790b3721K8804Q9k3223L771l608Q882L966j4601M853k4476K287K6392j4019J1866
5776a2738j3604j1646K5349K0335j9563o183j0039K1926P492m751R528R140j6365
5763a119j0553k5496j881K5887J5734j0269l2417J592L9400K0570o782j5150k2838
5750b3322m737L258l992J1136K8982j125j2039J5311J8360r978j8952p010k736
5737f844J2538P610l1641J6652k980k0938j0241J7952K4181n216j9528M1864M981
5724B8390j2337j1906k6265j3651K8691M093k0926j4802J0275J1860l5692R882
5712d2388K2525K1900L824q691p466j0354R275L5590j642k783j4135J1349J4800
$$ plain form
5803 -17177 -26843 -38722 -55239 -26023 -9036 7267 -14448 -15055 -25712 -25484 -6331 -21613 -23721
5790 -23721 5083 5172 -18051 -14280 -17888 -9006 -5040 -19641 -14788 -39264 -36977 -10585 -24604 -12738
5776 -12738 -26342 -37988 -12639 7696 -11867 -18050 -28089 -6163 1329 -3422 6106 15246 -1119
5763 -1119 -11672 -37168 -39049 -13162 2572 -7697 -40114 -38522 878 21448 14666 -484 -23322
5750 -23322 -28059 -24801 -28793 -17657 11325 10200 -1839 13472 31832 21854 2902 -4108 -6844
5737 -6844 5694 13304 -18337 -1685 -4665 -25603 -35844 -17892 6289 1073 -18455 23409 28390
5724 28390 16053 4147 -22118 -35769 -7078 -2985 -23911 -38713 -28438 -16578 -52270 -42388
5712 -42388 -19863 2037 5861 -2830 -10296 -20650 -11375 24215 22573 19790 5655 17004 31804
5699C1804j8912P61k879k231M134P469k5611K0235J0653p08j6286l3680O730O251
5685a2270j5921l413J6027J1027J8208p023k3031j441q352p948P819K4510L324
5672A516M40j5222j3341N121K8458J174P97j4372K090l322j9940L451K1976j1128
5658a2302j3701j2276o495K7932J0599j2062l044L2468J553L682k2095J0601q821
5645c961k8226L3260K9889L157k7669l3562j5500o132L493o276K4284L3775j1610
5632e078k3776J3276M075N496K4117l845m371J0615J3273j1327Q795k2889k7445
5619a9084k5205n072j1742P758K3408L8015Q097J1159J7109k3644k0798n623J922
5606c700J7043k0376j8224N678M285J1510p940j8179M2208m816r547j4695j4855
$$ plain form
5699 31804 12892 13653 10774 8543 12677 20146 -5465 14770 25423 24715 8429 -25251 -18521 -12270
5685 -12270 -28191 -31604 -15577 -4550 13658 6635 -16396 -17837 -26189 -34137 -26318 -1808 1516
5672 1516 1956 -13266 -26607 -21486 6972 8146 8943 -5429 -3339 -6661 -26601 -23150 -1174 -12302
5658 -12302 -26003 -38279 -44774 -16842 -6243 -18305 -21349 11119 12672 16354 -5741 4860 -3961
5645 -3961 -32187 1073 30962 34119 6450 -27112 -42612 -48744 -45251 -51527 -27243 6532 -5078
5632 -5078 -28854 -15578 -11503 -6007 18110 14265 9894 20509 33782 22455 31250 8361 -19084
5619 -19084 -44289 -49361 -61103 -53345 -29937 8078 16175 27334 44443 20799 1 -5622 -3700
5606 -3700 13343 -7033 -25257 -19579 -15294 -3784 -11724 -29903 12305 7489 -2058 -16753 -31608
5593c1608j7848L1880L8388m953j171k055n010L5835l6421j0927Q627k2291k3680
5580d1234j4532K6832M2521P414J1488l423j862o748o668l397O235j4592p261
5567e227R382L4064k679J2909K6080j8134l2657j7173P066j1174J1056J4434j4452
5554A3495M015j18k6902M230M266O84o286L878j1405l487j1903J5231M179J9477
5540I354L285Q374K9000J0748m5143k4284q263j2946r968Q780L9503Q730j8860
5527a690P690M117k6919q827O745O872K4003Q795n064m3415L138M0765r303k5779
5513a8872Q453L1657K4446m796k1951l39n585k0870O76j773l3756K109Q060j4452
5499d6993Q286R502J3473j2908J9724J1302j481J4542p84n945Q427K4867K4419
$$ plain form
5593 -31608 -49456 -17576 20812 15859 14688 12633 7623 43458 7037 -3890 4737 -17554 -41234
5580 -41234 -55766 -28934 13587 21001 32489 29066 27204 20456 13788 10391 16626 2034 -5227
5567 -5227 4155 38219 35540 48449 74529 56395 23738 6565 13631 2457 13513 27947 13495
5554 13495 17510 17392 -9510 -5280 -1014 -330 -6616 -2738 -14143 -17630 -29533 -14302 -10123 9354
5540 9354 12639 21013 50013 60761 15618 -8666 -16929 -29875 -39843 -31063 8440 17170 -1690
5527 -1690 6000 10117 -16802 -25629 -18884 -12012 11991 20786 15722 -27693 -24555 16210 6907 -18872
5513 -18872 -10419 21238 45684 40888 18937 18598 13013 -7857 -7181 -8954 -42710 -40601 -32541 -46993
5499 -46993 -38707 -29205 -15732 -28640 -8916 2386 905 15447 14663 8718 17145 42012 66431
5486F6431j9585j2161J605j7713j9523J4399r924J2617L0696k653j8580j6203
5474I406k178p851q229K064J1522m793K105J8644J7483j613j6967J2382K4492
5461E6467J3521l2432j5335K351N743L946k5156j7901O132k278r170R255k3048
5448b7905j7931k1809J7731j4970J3594K9895J7585K304K3684K1203n634R140
5436D6887Q507j6952j0540j3235j018q170l5604j6988K8138K2337J5438N741j3039
5423A1502l372m632j6637j23K830j41j798l4190j6907J9024l109J0635q227J0291
5409c4854J6202l1189o150P37J88K0919K7230j6164O499P50n097k862r046P990
5395b4847M5935n787Q049O240q405m711J42k81O925R531l463j2208J701l6511
$$ plain form
5486 66431 46846 34685 36290 18577 -946 13453 3529 16146 46842 44189 25609 9406
5474 9406 7228 -623 -8852 -6788 4734 -59 2046 20690 38173 36560 19593 31975 56467
5461 56467 69988 37556 22221 24572 30315 34261 9105 -8796 -2664 -4942 -14112 -4857 -27905
5448 -27905 -45836 -67645 -49914 -64884 -51290 -21395 -3810 -1506 22178 43381 37747 46887
5436 46887 55394 38442 27902 14667 13649 5479 -30125 -47113 -18975 3362 18800 24541 11502
5423 11502 8130 3498 -13139 -13262 -10432 -10573 -12371 -46561 -63468 -44444 -47553 -36918 -45145 -34854
5409 -34854 -18652 -49841 -55991 -55254 -55066 -34147 -6917 -23081 -16582 -15832 -20929 -23791 -32837 -24847
5395 -24847 21088 15301 23350 29590 21185 16474 16616 16335 23260 32791 29328 17120 18821 -17690
5381a7690j4225K116r448J6882k3342q917K4722L854J6120J0643o50m957J1405
5368F513n701O828J538M270K362k137Q834k6006m4663j7118K2861K3104Q969j233
5354a1579j4827J1054M1268k6536j178J8084k215n648j5560k3857j0913j1644
5342e3551J7534R184j2366K613J3181L206J8794J5891p077J186k7544p231J462
5329b4718J0793J2262J1780j7765l5382J3930Q931R603J7892j9601j4426k3831
5317e0532K0824k000k5002m111K3496J2715L7998Q002J062j5399R208j6866r50
5304a555R815J2499j2837j9207j7128j2631P154J3174O906j3000K397Q259l497
5291a9651k1373M2974K2051j1752M221m7921j1244P623M691J0677l321m869r278
$$ plain form
5381 -17690 -31915 -29799 -39247 -22365 -45707 -54624 -29902 -26048 -9928 715 65 -4892 6513
5368 6513 812 7640 9178 13448 15810 13673 22507 -3499 -48162 -65280 -42419 -19315 -10346 -11579
5354 -11579 -26406 -15352 25916 -620 -1798 16286 14071 8423 -7137 -30994 -41907 -53551
5342 -53551 -36017 -26833 -39199 -36586 -23405 -20199 -1405 14486 7409 8595 -18949 -26180 -24718
5329 -24718 -13925 -1663 10117 -7648 -43030 -29100 -20169 -10566 7326 -12275 -26701 -50532
5317 -50532 -29708 -31708 -56710 -60821 -37325 -24610 13388 21390 22452 7053 16261 -605 -1555
5304 -1555 8260 20759 7922 -11285 -28413 -41044 -33890 -20716 -13810 -26810 -24413 -16154 -19651
5291 -19651 -41024 1950 24001 12249 16470 -31451 -42695 -35072 -30381 -19704 -23025 -27894 -37172
5278c7172L0011j114N518m918J7863q086k8532j3683j6493J42J6482j3509r148
5265f2639L2055o85M954K0310O029o039k064K4744L19k8818j2365J7498J3822
5252G121m955q86r38j2530j678J953n339J0592K5930j4225j7997r292J2578j9195
5238b8861O43J1616o755j7562J1372J0173J073j4343n889m516R42L6909L4294
5225B9096m14l63k0266j8074N095L5428p758j7494P999R3j0096L256n649J2518
5211A3371M189j053m653J3593j7437j0679j5842O909K1589J8159J5398k0515k4055
5198a026l286o12j3143j263q686j5970J2173K5628j7626n304j228M185L9861K6312
5184D0015q052o407n792j4816j6678j0821N368J9557k0301j3258R178J84n464
$$ plain form
5278 -37172 -7161 -8275 -2757 -7675 10188 2102 -26430 -40113 -56606 -56464 -39982 -53491 -62639
5265 -62639 -30584 -31269 -26315 -6005 24 -6015 -8079 16665 16984 -11834 -24199 -6701 7121
5252 7121 2166 1280 342 -12188 -13866 -11913 -17252 -6660 19270 5045 -12952 -22244 -9666 -28861
5238 -28861 -28218 -16602 -23357 -40919 -29547 -19374 -18301 -32644 -38533 -43049 -42107 -5198 29096
5225 29096 28682 28319 8053 -10021 -4926 30502 22744 5250 13249 13342 3246 6502 853 13371
5211 13371 17560 16507 11854 25447 8010 -2669 -18511 -11602 9987 28146 43544 23029 -1026
5198 -1026 -4312 -4924 -18067 -19330 -28016 -43986 -31813 -6185 -23811 -29115 -30343 -26158 13703 40015
5184 40015 31963 25556 19764 4948 -11730 -22551 -17183 2374 -17927 -31185 -22007 -21823 -27287
5171b7287P998J7540k7263J4464K6644r563j3340Q93M0915J9928k4086j6317j1375
5158h49K9763M701J6279l2270l500p4l0779j9097j6638J3138M5772K1330j6156
5145A1620k297l813Q146p338k6399J1849J5289J2560J1279q713j9780j8242k589
5132a8428K875K5468j24P279k1159j3756j4458l7229N335M2243M145k342o110
5119b6261M162j2921J8742J9932M5719J1600l484K1708L416l4512l5542l1868
5107a9309j586j6886R999P457Q163k1959k2909J7937J3637K2942r911P947J9452
5094A4974J1137j6751k2943K3826J8723l809l274M998L9651J0572j3627q151j6590
5081C8736k2458J3J9854L534L380k6566j701m611M657r229r965r868r479K1378
$$ plain form
5171 -27287 -19289 -1749 -29012 -14548 12096 2533 -10807 -9914 31001 50929 26843 10526 -849
5158 -849 28914 33615 49894 17624 14124 14050 -16729 -35826 -52464 -39326 6446 27776 11620
5145 11620 9323 5510 13656 6318 -20081 -8232 7057 19617 30896 22183 2403 -15839 -18428
5132 -18428 -15553 9915 9791 17070 -4089 -17845 -32303 -69532 -64197 -21954 -17809 -20151 -26261
5119 -26261 -22099 -35020 -16278 3654 49373 60973 57489 79197 82613 48101 12559 -19309
5107 -19309 -20895 -37781 -27782 -20325 -12162 -34121 -57030 -39093 -25456 -2514 -12425 -4478 14974
5094 14974 26111 9360 -13583 10243 28966 25157 21883 26881 66532 77104 63477 55326 38736
5081 38736 16278 16291 36145 39679 43059 16493 14792 10181 14838 5609 -4356 -14224 -23703 -2325
5067b325j7503l8988J9631L3370L1269L579k5793k8330k4764j6441J2301L4376
5055a9618M093r691o356N611N0390J0584m1573q484J1163j6034K9882r454j0165
5042i652J9336j4575l0068J0665J0821n252j193K7240Q055Q126m682M0559j2585
5029D6795n4640l5524j3014R984L5344j9835k8192k96J4476J5072L330J8993J6153
5016H646k3164m1Q252k0235M800J4848K3126r097q252N571K5892j3687M83K4160
5002D1302j05j4337j9084j4177M062P978j0613p235K282J7177O514j459l9236
4989b6931l7671L901J2463o978J1438o153L6K1455M156K2269K6498j3452l6518
4976b5487L8900L1342K1394L922l3439k0859j9436K57l5481j8766M856L1518J9879
$$ plain form
5067 -2325 -19828 -58816 -39185 -5815 25454 29033 3240 -25090 -49854 -66295 -53994 -19618
5055 -19618 -15525 -25216 -31572 -25961 24429 35013 -6560 -15044 -3881 -19915 9967 513 -9652
5042 -9652 9684 -4891 -34959 -24294 -13473 -18725 -19918 7322 15377 23503 18821 59380 46795
5029 46795 -7845 -43369 -56383 -46399 -11055 -30890 -59082 -59378 -44902 -29830 -26500 -7507 8646
5016 8646 -14518 -14559 -6307 -26542 -21742 -6894 16232 7135 -1117 4454 30346 16659 17142 41302
5002 41302 41197 26860 7776 -6401 -2339 5639 -4974 -12209 -9927 7250 13764 12305 -26931
4989 -26931 -64602 -60701 -48238 -55216 -43778 -49931 -49895 -28440 -24284 -2015 24483 11031 -25487
4976 -25487 13413 44755 66149 70071 36632 15773 -3663 -3406 -38887 -57653 -52797 -21279 -1400
4963a400J8900k3980j0702Q674L5198k4235l773K9153o032k4525k2414N947K1584
4950B395O480j1898J5391j5506j0992J2217K4520K1422P416m879p307k3486k9388
4937a3615K0372O141J9725j8821r691J1645j5888j1454L970N425J2275R210o200
4924A3094P603J2388M768j6235k284Q644q057j8958l311j8451K629J4164n92o678
4910a1276J0789P348J1525J8168J0319J7821j3600m4674o723J029N764K3928k6648
4897C770O045j299K860j909l2318k2107K2995J1144j4802J2363K3301l5103p223
4884c2283K1965K2450j0506k0457k3728K7819K1502o922k686k0089R844q891R074
4871a2908k3251k5405j5411N0954M1122j5861k297j7038K739P318O480o860K9510
$$ plain form
4963 -1400 17500 -6480 -17182 -8508 26690 2455 -1318 27835 21803 -2722 -25136 -19189 2395
4950 2395 8875 -3023 12368 -3138 -14130 -1913 22607 44029 51445 46566 39259 15773 -13615
4937 -13615 6757 12898 32623 13802 4111 15756 -132 -11586 -7616 -2191 10084 19294 13094
4924 13094 20697 33085 37853 21618 19334 27978 19921 963 -2348 -20799 -18170 -4006 -4598 -11276
4910 -11276 -487 6861 18386 36554 46873 64694 51094 6420 -303 726 6490 30418 3770
4897 3770 9815 8516 11376 9467 -22851 -44958 -21963 -10819 -25621 -13258 10043 -25060 -32283
4884 -32283 -10318 12132 1626 -18831 -42559 -14740 6762 -160 -2846 -22935 -13091 -21982 -12908
4871 -12908 -36159 -61564 -76975 -26021 15101 -760 -3057 -20095 -17356 -10038 -3558 -10418 19092
4858A9092j7729l6633J6798M551j1933N790N399k7590o987J5301j4207m8706n551
4845a02405L3852K2365J153J0725K5410K0743P436k2656k3506j144n171j079o52
4832c4929K8280J8617j2517q432J0764J2767L8097J0381j8831k353K373n077k4709
4819A4431n582p515k8182j4206K2512J9263J5800n634q34J1775k1615j1979j059
4806a2825K3206L3138O436n3196l0817j2J4003Q725j2691J2927J9996O325l6202
4793b0987j8583J0858L176K4376n386N038J6849J7514J7668n931k7177j1427K4703
4780C0691k486j7478k3186L313R309r332k7201L6631L0939k3858L843J2708L764
4767B7657k1363j7058j550j881j8020K6001R362M167K4316o616K229j0007o830
$$ plain form
4858 19092 1363 -35270 -18472 -13921 -25854 -20064 -14665 -42255 -49242 -33941 -48148 -96854 -102405
4845 -102405 -68553 -46188 -45035 -34310 -8900 11843 19279 -3377 -26883 -28027 -33198 -34277 -34929
4832 -34929 -6649 11968 -549 -8981 1783 14550 52647 63028 44197 41844 44217 39140 14431
4819 14431 8849 1334 -26848 -41054 -18542 721 16521 10887 10053 21828 213 -11766 -12825
4806 -12825 10381 43519 49955 -3241 -34058 -34070 -20067 -11342 -24033 -11106 8890 15215 -20987
4793 -20987 -39570 -28712 -25536 -1160 -6546 -1508 15341 32855 50523 44592 17415 5988 30691
4780 30691 28205 10727 -12459 -9146 163 -9169 -36370 261 31200 7342 11185 23893 27657
4767 27657 6294 -10764 -12314 -14195 -32215 -6214 3148 7315 31631 25015 27244 17237 10407
4754A0407N731j5652j7142L2248Q826m547q958l653K228L055q321j775J3152J5158
4740C0757j5738J6873J2045k1919r362J1140J4543k5636l0666j0218M996K1390
4728a795O997k2117J6842M8139J438n343L594j5788j0081M559k4482j9752O846
4715a0943K1234J490m465J6985J992K920k6294K9283J4225k4203j3909J624J3717
4702B3656K363j0979J3272K994l681O824J6116j0797l1996J1740K6112j9368p136
4689A9120N956L302q865k2898L043R045J0394j0262j4234J3170j0177n736J4936
4676F794m339j2433J6832J0093K221K2748J7001j5259p430j6402q763M278J3775
4663B9116J2625k2928l2434k7445J6052K7196P569O297n473Q063l6709l4826R253
$$ plain form
4754 10407 16138 486 -16656 15592 24418 19871 10913 7260 9488 12543 4222 2447 15599 30757
4740 30757 15019 31892 43937 22018 12656 23796 38339 12703 -17963 -28181 -23185 -1795
4728 -1795 5202 -16915 -73 48066 49504 44161 47755 31967 21886 26445 1963 -17789 -10943
4715 -10943 10291 11781 7316 24301 26293 29213 2919 32202 46427 22224 8315 9939 23656
4702 23656 26019 15040 28312 31306 27625 34449 50565 39768 7772 19512 45624 26256 19120
4689 19120 25076 28378 19513 -3385 -342 8703 19097 8835 -5399 7771 -2406 -8142 6794
4676 6794 2455 -9978 6854 16947 19168 41916 58917 43658 36228 19826 11063 15341 29116
4663 29116 41741 18813 -13621 -41066 -25014 2182 9751 16048 10575 18638 -18071 -52897 -43644
4650d3644K0091j1684k1363m303J4972K6762K3649K619m957J8991L352j9977J2444
4637A6952J6823k0672l2296j8371O905N578O641M4722J1319p063q663k18N502
4624B7159j2544J6021M011J9951L1063J0743l1336m8553K2905L850M441Q543J1468
4611F7722j7492m1503n989j119n712p072K742L313J9387k6806k0226k945J0820
4598b4880K2048J9977Q128r225n008J3578p817k184n469l786k696o169p644L3309
4584B2162L3280j9347L850L1797l053k2137m205j9742l985M692L832l657k1140
4571B347j6785J3914J4648j424K3229J8044j7488l437k3205k2970k4355j8226
4559e5708K3262M5071K2987k0860j332K029q062j1659k085R046R057j7600L000
$$ plain form
4650 -43644 -23553 -35237 -56600 -60903 -45931 -19169 4480 7099 2142 21133 24485 4508 16952
4637 16952 33775 13103 -19193 -37564 -30659 -25081 -18440 26282 37601 30538 21875 21657 27159
4624 27159 14615 30636 34647 54598 85661 96404 65068 16515 39420 43270 47711 56254 67722
4611 67722 50230 8727 2738 1619 -4093 -11165 -8423 -5110 14277 -12529 -32755 -35700 -24880
4598 -24880 -2832 17145 25273 16048 11040 24618 16801 14617 9148 5362 2666 -3503 -11147 22162
4584 22162 55442 36095 39945 71742 68689 46552 42347 22605 18620 23312 27144 23487 2347
4571 2347 -14438 -524 14124 12700 35929 53973 36485 33048 9843 -13127 -37482 -55708
4559 -55708 -32446 12625 35612 14752 13420 15449 7387 -4272 -6357 2689 11746 -5854 -2854
4546b854K2660J6280m214r166J0662l3349j8127J0262P439J8909J0584m82o891
4533B1713j950k1332o19K5909L218j3180j2626m752k0204j3542J578r583K6591
4520a8779j6339K4949J8160k0101k3664j8400J5225N2974K0597R20r936K810J6232
4507D4648J2789m887Q193j5883j4582k0461L680K535L0751L897J7309l9255k9746
4494a012P664k3922Q91L7143O687k6125j8215Q118l117k19J6475k2080j7744j0766
4480d6222j259J7374j0348p460J664k975L817J2091J8632M963j0290k2373J1299
4467c1087N952J0400l2644J992L0040K3224L2116M449M459k5445l0026J4905o203
4454B132M480m8545l687L5845K7945J3871O490q502R831j9671o268j3172J2316
$$ plain form
4546 -2854 19806 36086 31872 22706 33368 19 -18108 -7846 -407 18502 29086 28604 21713
4533 21713 19763 -1569 -2188 23721 26939 13759 1133 -3619 -23823 -37365 -35787 -45370 -18779
4520 -18779 -35118 -10169 7991 -12110 -35774 -54174 -38949 14025 34622 35542 25606 28416 44648
4507 44648 57437 52550 60743 44860 30278 9817 13497 16032 46783 50680 67989 28734 -1012
4494 -1012 6652 -17270 -16379 20764 27451 1326 -16889 -8771 -11888 -12107 4368 -17712 -35456 -46222
4480 -46222 -47481 -30107 -40455 -47915 -46251 -49226 -45409 -33318 -14686 -9723 -20013 -42386 -31087
4467 -31087 -25135 -14735 -47379 -45387 -15347 7877 39993 44442 48901 23456 -6570 8335 2132
4454 2132 6612 -41933 -45620 -9775 18170 32041 38531 30029 39860 20189 13921 749 13065
4441A3065J750N027L324K190L16j1291j9630P79j187K175j2847J2118P826j0125
4427f510K3228J0945l7684k336m974J876L6607q025j1042J0890K2152k7776j4172
4414f821K4595o868m735m551P017K3236j1548j1944m030J7035K6464r899J459
4401C9410K666j6862k8145l975q137L246N318J4059J6452k486m264k0531n262
4388h511k2891M705j2413R785Q739J0920J113j001L283j3327l839J5602j2561
4375b0396j3069J9272J1616N705Q48J6121M512K3159J018k7078k0244m768N979
4362B675o264P466O546o90n402q20R439m013M289k2348k8042K8191J8358k3164
4348a3779M59j8113l170J6909k0091Q495J5547K8961J4825j3763J4495k081j0272
$$ plain form
4441 13065 14815 19842 23166 25356 25672 14381 -5249 -4470 -5657 -3482 -16329 -4211 3615 -6510
4427 -6510 16718 27663 -10021 -12357 -17331 -15455 21152 13127 2085 12975 35127 7351 -6821
4414 -6821 17774 10906 6171 1620 8637 31873 20325 8381 4351 21386 47850 37951 39410
4401 39410 42076 25214 -2931 -6906 -15043 -11797 -6479 7580 24032 21546 17282 -3249 -8511
4388 -8511 -31402 -26697 -39110 -29325 -20586 -9666 -8553 -9554 -6271 -19598 -23437 -7835 -20396
4375 -20396 -33465 -14193 -2577 3128 3976 20097 24609 47768 48786 21708 1464 -3304 2675
4362 2675 -3589 3877 10423 9733 4331 3511 12950 8937 13226 -9122 -37164 -8973 9385 -13779
4348 -13779 -13320 -31433 -34603 -17694 -37785 -29290 -13743 15218 30043 16280 30775 28694 18422
4335A8422N409Q731J1829j83k2631j8389p346n18n989J3873K5826L7926J1971
4322G8931J1442j7623l1005q561J6810j3049m462q825j4553J8516K6094J7204
4310G0919j8354l5527k8704m781k6338j3041K8745R178J603K1642J7178k2103
4298D17N967J7583Q805l984q592l285J4996J4837j9402j0800n941k7477k421N454
4284a3843L923j7077K6885K3487k455l1300n824Q382J0031R526K7868J6125l904
4271E1824n075J088p917j82k5054k1986K7152K4008j3450k1838j5498P60K0219
4258A4051n752J2242J4127n459k0367r470J3782k1R05J1460l5642j3966j6962
4245d1072Q255N57k100M332M574J8688m17j9151M130N859O619J8382N518j1981
$$ plain form
4335 18422 23831 32562 44391 44208 21577 3188 -4158 -4676 -10665 3208 29034 66960 78931
4322 78931 90373 72750 41745 33184 49994 36945 32483 23658 9105 27621 53715 70919
4310 70919 52565 17038 -11666 -16447 -42785 -55826 -27081 -17903 -16300 5342 22520 417
4298 417 6384 23967 32772 28788 20196 16911 31907 46744 27342 16542 10601 -16876 -19297 -13843
4284 -13843 -9920 -26997 -112 23375 20920 -10380 -16204 -7822 2209 11735 39603 55728 51824
4271 51824 46749 47837 39920 39738 14684 -7302 19850 43858 30408 8570 -6928 -6168 14051
4258 14051 8299 20541 34668 29209 8842 -628 13154 13133 14038 25498 -10144 -24110 -41072
4245 -41072 -32817 -32260 -34360 -30028 -25454 -6766 -7183 -26334 -22204 -16345 -9726 8656 14174 2193
4231B193j9064J7231P322P923J310q592J0295k765J9953L456j0298m718j4099
4218A0147j3505k8810K7948N1127J1951j1347l5906k5419K5621j9274N135M0390
4206C8058K7959l0271n7132j9856K3557p117M929O764J8581K3378K7447j2455
4194D3842j9878k3135l475J3455j7292O478j688q27L735N611K0655K0351j3116
4181C4716p222r929k2057J206J9611l532k3196m339k06k3534K5602L1013K332
4168B0465q776k9901q53J9662j477j7937n484J2688l008N944J0225k1588l965
4155b4005L5952M750J29m717K3220M7523k3042l9947k0251K5550L65pM904p06
4141B9718j9031k9800j0568K0443j2429j793K2546j0473K0678J7675Q176j003
$$ plain form
4231 2193 -16871 360 7682 15605 16915 8323 18618 15853 35806 39262 28964 24246 10147
4218 10147 -3358 -32168 -4220 46907 58858 47511 11605 -13814 11807 -7467 -2332 38058
4206 38058 66017 35746 -21386 -41242 -17685 -24802 -19873 -13109 5472 28850 56297 43842
4194 43842 23964 829 -2646 10809 -6483 -5 -1693 -2520 1215 6826 27481 47832 34716
4181 34716 27494 17565 -4492 -3286 16325 12793 -10403 -14742 -14948 -38482 -12880 18133 20465
4168 20465 11689 -18212 -19065 597 -880 -18817 -24301 -11613 -14621 -8677 1548 -20040 -24005
4155 -24005 11947 16697 16826 12109 35329 82852 59810 19863 -388 25162 25527 25520 30424 29718
4141 29718 10687 -19113 -29681 -9238 -21667 -23460 -914 -11387 9291 26966 35142 34139
4129C4139j2461l5670j1121j925N7288K0673j5897p187k6954n994m89L746J1828
4116I976K162R219j5751j0142q943K8066L4619k6214k5815K0779J6027l2008l559
4103a584j0533r925J7873K9009Q666l4557o029J4480P211R822m753j2694j682
4090E304K2483K4293k8227j0590k4112O817J534J0408m819j6937k698J1338J423
4077c783O891L290M427k3488j5914j0732J3669r084j7609K3586J5842L8496K2274
4064D7865r307j1874J0980k999o615O85j6912k1987Q327K7841L498p080Q555k439
4050B8538k8154k014K6357j4221k9468n019J2899L6582j6203J1414r421j4436
4038c146J5131o227J3153J716j2040k16J557p347o400R584J3185J2523O787J6979
$$ plain form
4129 34139 21678 -13992 -25113 -27038 30250 50923 35026 27839 885 -5109 -5598 -1852 9976
4116 9976 12138 21357 5606 -4536 -13479 14587 49206 22992 -2823 17956 33983 1975 -1584
4103 -1584 -12117 -22042 -4169 24840 33506 -1051 -7080 7400 14611 24433 19680 6986 5304
4090 5304 27787 52080 23853 13263 -10849 -4032 -2498 7910 3091 -13846 -16544 -5206 -3783
4077 -3783 3108 6398 10825 -12663 -28577 -39309 -25640 -34724 -52333 -28747 -12905 25591 47865
4064 47865 38558 26684 37664 34665 28050 28735 11823 -10164 -1837 26004 29502 22422 30977 28538
4050 28538 384 -1630 24727 10506 -18962 -23981 -11082 25500 9297 20711 11290 -3146
4038 -3146 11985 5758 18911 20627 8587 8371 9928 2581 -3819 5765 18950 31473 38260 55239
4024E5239m693R247k6352j4398k1127p509K3932m422j0977j8032l949L50K2483
4011b08O220K282j5652Q675m576P537K2614q46m996j2617L361P878o689l4309
3997b1326l8032K0197J2725J1199r155l1214O548P021J4347k111J9620O948J8516
3984A5283j2646k4511J0765J4786r950l2304j6468J9222J2359J2462J4472J5489
3972A8959j2770R878p364j2698N020k0020l9292Q196J1120R413J1706J3985J7059
3959A3192n576j4733l460J9213J0674j3457O727K4164k2893j7041K0301J6123
3947C3234j5994r629M303J3206P673o153j7499k8725l426Q243J7953J715q968
3934d067m461p051K504j311o414K2666N597O641M46k1236k2903J5834Q040N652
$$ plain form
4024 55239 50546 59793 33441 19043 -2084 -9593 14339 9917 -1060 -19092 -23041 -22691 -208
4011 -208 6012 8294 -7358 1317 -3259 4278 26892 26046 21050 8433 11794 19672 12983 -21326
3997 -21326 -59358 -39161 -26436 -15237 -24392 -55606 -49058 -42037 -27690 -29801 -10181 -3233 15283
3984 15283 2637 -21874 -11109 3677 -6273 -38577 -55045 -35823 -23464 -11002 3470 18959
3972 18959 6189 16067 8703 -3995 1025 -18995 -58287 -50091 -38971 -29558 -17852 -3867 13192
3959 13192 7616 -7117 -10577 8636 19310 5853 12580 36744 13851 -3190 17111 33234
3947 33234 17240 7611 11914 25120 32793 26640 9141 -19584 -23010 -14767 3186 4901 -4067
3934 -4067 -8528 -15579 -13075 -14386 -20800 1866 7463 14104 14550 -6686 -29589 -13755 -5715 -63
3920f3J4373J1454R71J0070k0060k6265l577K3135Q134o492q548P26q709k305
3906g156R499K853k871j4781j1361K2722J4428P948J1866j1448k3562j7024P341
3893a1546m312k548L5524j397Q755K4846l9294j7930R025J7243l041R986K9338
3880E4649l258p045j9872l632J7670p117j1186n691k2357J5745L8212J4672j9579
3867D1211j1352n810J5911P021k3468J8677M307m412m14j73j2729J0567K2924
3854F2260j2025j5249k5306j8906J9929L1244J2128L2191r570k6574k0804J3872
3842D3190j0176k2636P95j550l675j7811j6037K560O27l581J5777J7315J0836
3829A5634l6382M046J0955J2082r885j8007J3027K1868q418k4151k6792N866r269
$$ plain form
3920 -63 14310 25764 26735 36805 16745 -9520 -13097 10038 18172 11680 3132 3858 -4851 -7156
3906 -7156 2343 5196 2325 -12456 -23817 -1095 13333 21281 33147 21699 -1863 -18887 -11546
3893 -11546 -15858 -18406 17118 15721 24476 49322 10028 -7902 1123 18366 15325 25311 54649
3880 54649 51391 44346 24474 20842 38512 31395 20209 14518 -7839 7906 46118 60790 41211
3867 41211 29859 24049 39960 46981 23513 42190 46497 42085 41671 41498 28769 39336 62260
3854 62260 50235 34986 9680 -9226 10703 41947 54075 86266 76696 50122 29318 43190
3842 43190 33014 10378 11173 9623 5948 -11863 -27900 -25340 -24713 -28294 -12517 4798 15634
3829 15634 -20748 -16702 -5747 6335 -3550 -21557 -8530 13338 4920 -19231 -46023 -40157 -49426
3816d9426K1790M2286L39j5041J6702o55p428M076R332K530n932M93j2464O672
3802A3274J3490J036K5251j9512j1777k198n726Q616K014j7187j924J0402j5582
$$ plain form
3816 -49426 -27636 14650 14989 -52 16650 15995 8567 12643 21975 24505 18573 19066 6602 13274
3802 13274 26764 27800 53051 33539 21762 19564 13838 22454 24468 7281 5357 15759 177
$$ [...]
##END NTUPLES=NMR SPECTRUM
##END=
