##TITLE=Analysis number 315955
Compound Code cc 34413
Book Reference 440/120
Project Code qc-cat
Chemist Name craigr
##JCAMPDX= 6.0         $$ Bruker NMR JCAMP-DX V2.0
##DATA TYPE= NMR SPECTRUM
##DATA CLASS= NTUPLES
##ORIGIN= Bruker BioSpin GmbH
##OWNER= NMR
$$ XWIN-NMR		Version 3.5
$$ Fri Dec  9 12:17:12 2005 GMT Standard Time (UT+0h)  MAYBRIDGE\NMR@NMR_250MHZ
##.OBSERVE FREQUENCY= 250.131544655141
##.OBSERVE NUCLEUS= ^1H
##.ACQUISITION MODE= SIMULTANEOUS (DQD)
##.ACQUISITION SCHEME= undefined
##.AVERAGES= 16
##.DIGITISER RES= 18
##SPECTROMETER/DATA SYSTEM= dpx250
##.PULSE SEQUENCE= zg30
##.SOLVENT NAME= CDCl3
##.SHIFT REFERENCE= (INTERNAL, CDCl3, 0, 16.4351)
##AUDIT TRAIL= $$ (NUMBER, WHEN, WHO, WHERE, WHAT)
$$ ##TITLE= Audit trail, XWIN-NMR		Version 3.5
$$ ##JCAMPDX= 5.01
$$ ##ORIGIN= Bruker BioSpin GmbH
$$ ##OWNER= NMR
$$ C:\u/data/dgb/nmr/ADRS/13660/pdata/1/auditp.txt
$$ ##AUDIT TRAIL=  $$ (NUMBER, WHEN, WHO, WHERE, WHAT)
(   1,<2005-12-09 12:16:45.84 +000>,<MAYBRIDGE\NMR>,<NMR_250MHZ>,
      <created by zg, POWCHK disabled, PULCHK disabled
       configuration hash MD5:
       62 19 C7 07 E1 42 D1 B7 37 6C 3D D0 77 39 F9 E6
       data hash MD5: 64K
       0B 7C 3C CF 1A 24 84 FB A0 A8 05 02 01 20 8E D4>)
(   2,<2005-12-09 12:17:01.92 +000>,<MAYBRIDGE\NMR>,<NMR_250MHZ>,
      <Start of raw data processing
       ef LB = 0.3 FT_mod = 6 PKNL = 1 SI = 32K 
       data hash MD5: 32K
       02 D3 FF 5B 7B 1F E4 6A ED BF 71 0F E4 6C FD 6D>)
(   3,<2005-12-09 12:17:03.88 +000>,<MAYBRIDGE\NMR>,<NMR_250MHZ>,
      <apk 
       data hash MD5: 32K
       B0 A1 F9 9C E6 16 85 00 DB EB E0 E8 23 AD DC DF>)
(   4,<2005-12-09 12:17:04.59 +000>,<MAYBRIDGE\NMR>,<NMR_250MHZ>,
      <abs ABSG = 5 
       data hash MD5: 32K
       CB 93 7D ED 89 87 22 7B FF BE D9 11 19 EB F1 D9>)
$$ ##END=
$$ 
$$ hash MD5
$$ 96 72 D6 E9 52 FF 86 90 87 62 0C 12 EE B6 D4 46
##$RELAX= 
##$RELAX= 
##$RELAX= 
##$RELAX= 
##$RELAX= 
##$RELAX= 
##$RELAX= 
$$ Bruker specific parameters
$$ --------------------------
##$DU= <C:\u>
##$EXPNO= 13660
##$NAME= <ADRS>
##$PROCNO= 1
##$TYPE= <nmr>
##$USER= <dgb>
##$AMP= (0..31)
100 100 100 100 100 100 100 100 100 100 100 100 100 100 100 100 100 100 
100 100 100 100 100 100 100 100 100 100 100 100 100 100 
##$AQSEQ= 0
##$AQ_mod= 3
##$AUNM= <au_zg>
##$AUTOPOS= <15 >
##$BF1= 250.13
##$BF2= 250.13
##$BF3= 250.13
##$BF4= 250.13
##$BF5= 500.13
##$BF6= 500.13
##$BF7= 500.13
##$BF8= 500.13
##$BYTORDA= 1
##$CFDGTYP= 0
##$CFRGTYP= 5
##$CHEMSTR= <none>
##$CNST= (0..31)
1 1 145 1 1 1 1 1 1 1 1 1 1 1 1 1 1 1 1 1 1 1 1 1 1 1 1 1 1 1 1 1 
##$CPDPRG= <>
##$CPDPRG1= <>
##$CPDPRG2= <>
##$CPDPRG3= <>
##$CPDPRG4= <mlev>
##$CPDPRG5= <mlev>
##$CPDPRG6= <mlev>
##$CPDPRG7= <mlev>
##$CPDPRG8= <mlev>
##$CPDPRGB= <>
##$CPDPRGT= <>
##$D= (0..31)
0 1 0 0 0 0 0 0 0 0.06 0 0 0 0 0 0 0.0002 0 0 0 0 0 0 0 0 0 0 0 0 0 0 
0 
##$DATE= 1134130604
##$DBL= (0..7)
120 120 120 120 120 120 120 120 
##$DBP= (0..7)
150 150 150 150 150 150 150 150 
##$DBP07= 0
##$DBPNAM0= <>
##$DBPNAM1= <>
$$ [...]
##$SUBNAM7= <"">
##$SUBNAM8= <"">
##$SUBNAM9= <"">
##$SW= 20.6930455092707
##$SWIBOX= (0..15)
0 0 3 0 0 0 0 0 0 0 0 0 0 0 0 0 
##$SW_h= 5175.983436853
##$TD= 65536
##$TD0= 1
##$TE= 294.16
##$TE2= 300
##$TE3= 300
##$TEG= 300
##$TL= (0..7)
0 120 120 120 120 120 120 120 
##$TP= (0..7)
150 150 150 150 150 150 150 150 
##$TP07= 0
##$TPNAME0= <>
##$TPNAME1= <>
##$TPNAME2= <>
##$TPNAME3= <>
##$TPNAME4= <>
##$TPNAME5= <>
##$TPNAME6= <>
##$TPNAME7= <>
##$TPOAL= (0..7)
0.5 0.5 0.5 0.5 0.5 0.5 0.5 0.5 
##$TPOFFS= (0..7)
0 0 0 0 0 0 0 0 
##$TUNHIN= 0
##$TUNHOUT= 0
##$TUNXOUT= 0
##$USERA1= <user>
##$USERA2= <user>
##$USERA3= <user>
##$USERA4= <user>
##$USERA5= <user>
##$V9= 5
##$VALIST= <valist>
##$VCLIST= <CCCCCCCCCCCCCCC>
##$VD= 0
##$VDLIST= <DDDDDDDDDDDDDDD>
##$VPLIST= <PPPPPPPPPPPPPPP>
##$VTLIST= <TTTTTTTTTTTTTTT>
##$WBST= 1024
##$WBSW= 4
##$XGAIN= (0..3)
0 0 0 0 
##$XL= 0
##$YL= 0
##$YMAX_a= 715482
##$YMIN_a= -558731
##$ZGOPTNS= <>
##$ZL1= 120
##$ZL2= 120
##$ZL3= 120
##$ZL4= 120
##$ABSF1= 16.43506
##$ABSF2= -4.25811
##$ABSG= 5
##$ABSL= 3
##$ALPHA= 0
##$AQORDER= 0
##$ASSFAC= 0
##$ASSFACI= 0
##$ASSFACX= 0
##$ASSWID= 0
##$AUNMP= <proc_1d>
##$AZFE= 0.1
##$AZFW= 0.1
##$BCFW= 0
##$BC_mod= 0
##$BYTORDP= 0
##$COROFFS= 0
##$CY= 12.5
##$DATMOD= 1
##$DC= 0
##$DFILT= <>
##$DTYPP= 0
##$F1P= 14.0000005364418
##$F2P= -0.99999901652339
##$FCOR= 0.5
##$FTSIZE= 32768
##$FT_mod= 6
##$GAMMA= 0
##$GB= 0
##$INTBC= 1
##$INTSCL= 1
##$ISEN= 128
##$LB= 0.3
##$LEV0= 0
##$LPBIN= 0
##$MAXI= 10000
##$MC2= 0
##$MEAN= 0
##$ME_mod= 0
##$MI= 0
##$NCOEF= 0
##$NC_proc= -3
##$NLEV= 6
##$NOISF1= 0
##$NOISF2= 0
##$NSP= 0
##$NTH_PI= 0
##$NZP= 0
##$OFFSET= 16.43506
##$PC= 1
##$PHC0= 80.35506
##$PHC1= 8.614236
##$PH_mod= 1
##$PKNL= yes
##$PPARMOD= 0
##$PSCAL= 4
##$PSIGN= 0
##$REVERSE= no
##$SF= 250.130021744013
##$SI= 32768
##$SIGF1= 0
##$SIGF2= 0
##$SINO= 400
##$SIOLD= 32768
##$SREGLST= <1H.CDCl3>
##$SSB= 0
##$STSI= 32768
##$STSR= 0
##$SW_p= 5175.98343685301
##$SYMM= 0
##$S_DEV= 0
##$TDeff= 65536
##$TDoff= 0
##$TI= <Analysis number 999999
Compound Code 99
Book Reference 9
Project Code 9>
##$TILT= no
##$TM1= 0
##$TM2= 0
##$TOPLEV= 0
##$USERP1= <user>
##$USERP2= <user>
##$USERP3= <user>
##$USERP4= <user>
##$USERP5= <user>
##$WDW= 1
##$XDIM= 32768
##$YMAX_p= 282089056
##$YMIN_p= -50286
$$ End of Bruker specific parameters
$$ ---------------------------------
##NTUPLES= NMR SPECTRUM
##VAR_NAME=  FREQUENCY,     SPECTRUM/REAL,   SPECTRUM/IMAG
##SYMBOL=    X,             R,               I
##VAR_TYPE=  INDEPENDENT,   DEPENDENT,       DEPENDENT
##VAR_FORM=  AFFN,          ASDF,            ASDF
##VAR_DIM=   32768,         32768,           32768
##UNITS=     HZ,            ARBITRARY UNITS, ARBITRARY UNITS
##FACTOR=    0.157963299565203, 1,           1
##FIRST=     4110.90204050397, 0,            0
##LAST=      -1065.08139634904, 0,           0
##MIN=       -1065.08139634904, -50286,      0
##MAX=       4110.90204050397, 282089056,    0
$$ Real data points
##PAGE= N=1
##DATA TABLE= (X++(R..R)), XYDATA
$$ [...]
18653D310772l15901k61634k09819j74062j30218j10410r3976j07477j03596r3346
$$ 4310772 3994871 3733237 3523418 3349356 3219138 3108728 3014752 2907275 2803679 2710333
18643B710333o9484n3060k8355N5163J42612K61699M18840N00907L79956J40460
$$ 2710333 2640849 2587789 2559434 2614597 2757209 3018908 3437748 3938655 4318611 4459071
18633D459071L901p7050k01195l50314m07357l69486k90775k15965j30268n9946
$$ 4459071 4462972 4385922 4184727 3834413 3427056 3057570 2766795 2550830 2420562 2360616
18623B360616k3695m5802j00472j35994j57136j43474j37827j06016r7871o9422
$$ 2360616 2336921 2291119 2190647 2054653 1897517 1754043 1616216 1510200 1412329 1342907
18613A342907q2253o6332l1789k6196n0450m8172k9064k3066j7480l623J0044
$$ 1342907 1260654 1194322 1162533 1136337 1085887 1037715 1008651 985585 968105 964482 974526
18602I74526J0384R426J6278N3052R6556J04726J32720J57958J61501J08838K6271
$$ 974526 984910 994336 1010614 1063666 1160222 1264948 1397668 1555626 1717127 1825965 1852236
18591A852236K476J8906L5666O9028J56440K69711M28233N19032N08035M79453
$$ 1852236 1854712 1873618 1909284 1978312 2134752 2404463 2832696 3351728 3859763 4339216
18581D339216L42940K99l39026m91819n16212n00064m68071m03183k77970j75161
$$ 4339216 4682156 4682455 4343429 3851610 3335398 2835334 2367263 1964080 1686110 1510949
18571A510949r7387m9808m3575n6441o7814o3299o7636p2071o4951n6770m2523
$$ 1510949 1413562 1363754 1320179 1263738 1195924 1132625 1064989 992918 927967 871197 828674
18560H28674l1786k3772k8656j3292k5581l7464j1468k3664l1970n0328k9440
$$ 828674 796888 773116 744460 731168 705587 668123 656655 632991 601021 550693 521253
18549E21253K977p512k4719k6387l548J2342R916j1003k9671k7788j3115L340
$$ 521253 524230 516718 491999 465612 462064 474406 484322 473319 443648 415860 402745 406085
18537D06085P487j2725m1091l5578k091L696p055l320P256o059J086J0895L876
$$ 406085 413572 400847 359756 324178 322087 325783 318728 315408 322664 316605 317691 328586 332462
18524C32462j6266m201J4291O014l333Q270Q479r62j766P912N472J6925K0995
$$ 332462 316196 311995 326286 332300 328967 337237 345716 344754 342988 350900 356372 373297 394292
18511C94292J4371K7624K2632J3524K2867K2811M733K0923J1174k2733q709J142
$$ 394292 408663 436287 458919 472443 495310 518121 522854 543777 554951 532218 523509 524651
18499E24651j216J9661K5802J5426K8660L8134K0256N399J4832P191N996J5248
$$ 524651 523435 543096 568898 584324 612984 651118 671374 676773 691605 698796 704792 720040
18487G20040K6103L0688M7436L8259N2234N1967K7413J3229j896r597j2849N824
$$ 720040 746143 776831 824267 862526 914760 966727 994140 1007369 1005473 995876 983027 988851
18475I88851N1066M0219K1340R07K7251O6793P3766N3724N5406L2282o38J8286
$$ 988851 1039917 1080136 1101476 1102383 1129634 1196427 1270193 1323917 1379323 1411605 1410967 1429253
18463A429253M7743M8043K4680J69L417K4985M9650R0171J01526O8072O6652J08114
$$ 1429253 1476996 1525039 1549719 1549888 1553305 1578290 1627940 1718111 1819637 1887709 1954361 2062475
18451B062475J53673J63402J44009J90599K56958L12473L37284L19964K91905
$$ 2062475 2216148 2379550 2523559 2714158 2971116 3283589 3620873 3940837 4232742
18442D232742L04202L82466M20537L67407L09979M23093O49220Q58828J080609
$$ 4232742 4536944 4919410 5339947 5707354 6017333 6440426 7089646 7948474 9029083
18433I029083J384806J796053K493568L803971O214493J0305229J4760114J4026605
$$ 9029083 10413889 12209942 14703510 18507481 24721974 35027203 49787317 63813922
18425F3813922O457860J313994M032794Q556990O002458l457710q901740o334558
$$ 63813922 70271782 71585776 75618570 84175560 90178018 86720308 77818568 71484010
18417G1484010j104547L802409O593525L356229k471114k148398L503036N748964
$$ 71484010 70379463 74181872 80775397 84131626 81660512 79512114 83015150 88764114
18409H8764114j178386j0417434j2568296j0079926q705565q877848q320926o386944
$$ 88764114 87585728 77168294 64599998 54520072 45814507 36936659 28615733 22228789
18401B2228789m182921k584536j822882j565385j318270r89602p01136m43966
$$ 22228789 18045868 15461332 13638450 12073065 10754795 9765193 9064057 8620091
18393H620091k47983k86211m35294m04839j98059j51974l95246o40584o30401
$$ 8620091 8372108 8085897 7650603 7245764 7047705 6895731 6500485 5859901 5229500
18384E229500m94398m35091m38319m11944l18540k06092j30422j42359j59279
$$ 5229500 4735102 4300011 3861692 3449748 3131208 2925116 2794694 2652335 2493056
18375B493056j58671j09327o7860m6980m1432n7558n7374m4853k3617n2813p1109
$$ 2493056 2334385 2225058 2157198 2110218 2068786 2011228 1953854 1909001 1885384 1832571 1761462
18364A761462r2910r0903q3568p0777q1681o7354n3729o6069n8541o6001n2737
$$ 1761462 1668552 1577649 1494081 1423304 1341623 1274269 1220540 1154471 1095930 1029929 977192
18353I77192m7200m4083m3870l2158k4431l2670j3881j2763o528j3671k6093j4619
$$ 977192 929992 885909 842039 809881 785450 752780 738899 726136 719608 705937 679844 665225
18341F65225o432M02N93r113j2521j2593J8924J065L947J4225K1720K4960L3323
$$ 665225 658793 659195 659788 650675 638154 625561 644485 645550 649497 663722 685442 710402 743725
18328G43725L2824K9254L3915L6528M3968L5095K2709M2276N8094P7327J14851
$$ 743725 776549 805803 839718 876246 920214 955309 978018 1020294 1078388 1155715 1270566
18317A270566J54311K06299K19564J72791J20208N2531j2559q4054j18925j27452
$$ 1270566 1424877 1631176 1850740 2023531 2143739 2196270 2183711 2099657 1980732 1853280
18307A853280j20380j20679j00188p1639l2266j1082j7790l1003l3483l9310m6546
$$ 1853280 1732900 1612221 1512033 1440394 1408128 1397046 1379256 1348253 1314770 1275460 1228914
18296A228914l5072l7776j456K2108M6476K1182J3789O76J977j1221j5633j9121
$$ 1228914 1193842 1156066 1154610 1176718 1223194 1244376 1258165 1258841 1260818 1249597 1233964 1214843
18284A214843r637j01k977q482n779K4408K2514L6220O1437O8288P7963P3053
$$ 1214843 1205206 1205105 1202128 1193646 1187867 1212275 1234789 1271009 1332446 1400734 1478697 1551750
18272A551750O7633Q2728P0331P9462R9194J22585J52539J97915K30213K51577
$$ 1551750 1619383 1702111 1772442 1851904 1951098 2073683 2226222 2424137 2654350 2905927
18262B905927K82668K97353K84879K65061K14729J75604J95430K29322K04411
$$ 2905927 3188595 3485948 3770827 4035888 4250617 4426221 4621651 4850973 5055384
18253E055384K45395L89840M91710N89755P86956J180204J659557J947774J746526
$$ 5055384 5300779 5690619 6182329 6772084 7559040 8739244 10398801 12346575 14093101
18244A4093101J784730K461005K959586K123759J301164K012489L424077M862243
$$ 14093101 15877831 18338836 21298422 23422181 24723345 26735834 30159911 35022154
18236C5022154P178354J0337843J0288615Q920198J3053115J8380839J3036044
$$ 35022154 42200508 52538351 62826966 71747164 84800279 103181118 116217162
18229A16217162J037565O36632M482854j475090j1253129j2319086q552134q027873
$$ 116217162 117254727 117891359 122374213 120899123 109645994 97326908 88774774 80746901
18221H0746901r712152r032819n797233k702890k412286m308432m416032l068023
$$ 80746901 71034749 62001930 56204697 53501807 51089521 46781089 42365057 39297034
18213C9297034k787019m003015m510757l730246k815592k320757k056856j657726
$$ 39297034 36510015 32507000 27996243 24265997 21450405 19129648 17072792 15415066
18205A5415066j176079p44579m27336k06413l4043Q0754R7283K38682N67397J058762
$$ 15415066 14238987 13494408 13067072 12860659 12826616 12907370 13004653 13243335 13810732 14869494
18195A4869494J771012K674900L168521K706565K568765L685683M589212L096050
$$ 14869494 16640506 19315406 22483927 25190492 27759257 31444940 36034152 39130202
18187C9130202J219324K048459M161772M788650L423001M522475R237742J1678269
$$ 39130202 40349526 42397985 46559757 51348407 54771408 59293883 68531625 80209894
18179H0209894N950042K059701O753944R232386r95560r903750p914975n064773
$$ 80209894 86159936 88219637 94973581 104205967 103210407 93306657 85391682 80326909
18171H0326909q422557j2272136j0695966p777404o305036n251668l568621k351245
$$ 80326909 71904352 59632216 48936250 41158846 34853810 29602142 26033521 23682276
18163B3682276k411020k192861j545807j282298j660925j884476j594164j276992
$$ 23682276 21271256 19078395 17532588 16250290 14589365 12704889 11110725 9833733
18155I833733j085993r87097p99482n61737m06988l70924l33012k79156k58148
$$ 9833733 8747740 7760643 6961161 6399424 5992436 5621512 5288500 5009344 4751196
18146D751196k67934k43663j79185j25742k0900J23549K87166M29274M69518L70727
$$ 4751196 4483262 4239599 4060414 3934672 3913772 4037321 4324487 4753761 5223279 5594006
18136E594006K10409L5045j60308l15756m23414m66758m51469m08584l17019k15803
$$ 5594006 5804415 5839460 5679152 5363396 4939982 4473224 4021755 3613171 3296152 3080349
18126C080349j32723n4204m5709o1320q8401j01618j03294p8688o0517j7921K1856
$$ 3080349 2947626 2893422 2847713 2786393 2697992 2596374 2493080 2414392 2353875 2335954 2357810
18115B357810Q6442J50127K03953K89558M62879P37169J216741K219692M458413
$$ 2357810 2444252 2594379 2798332 3087890 3550769 4287938 5504679 7724371 12182784
18106A2182784P444302L603877l412152l057650j761108j972305l166693k872573
$$ 12182784 19627086 23230963 19818811 16761161 15000053 13027748 9861055 6988482
18098F988482j783385r72590n30772l41730k24108j82404j46747r9831l4393N0452
$$ 6988482 5205097 4232507 3701735 3360005 3135897 2953493 2806746 2706915 2672522 2722974
18088B722974J46821K09376K62280K66432K67736J93433K4896j81048l33335l99300
$$ 2722974 2869795 3079171 3341451 3607883 3875619 4069052 4093948 3912900 3579565 3180265
18078C180265m02005l95745l50126k76074k03626j25226p6620o9656n0811m5413
$$ 3180265 2778260 2382515 2032389 1756315 1552689 1427463 1350843 1281187 1230376 1184963
18068A184963m8638o3335p2295m6964m2900n4606n1193l9399k9658r562j2751
$$ 1184963 1136325 1072990 1000695 953731 910831 856225 805032 765633 735975 726413 713662
18057G13662k4283k8989j4760n899j6661o243l5307n0423l2485k6697k6402k2590
$$ 713662 689379 660390 645630 639731 623070 616827 581520 531097 498612 471915 445513 422923
18045D22923l2361p443p61n946Q568j4027p065q640k032r370L41j2782o550k566
$$ 422923 390562 383119 382358 376412 384980 370953 363888 355248 353216 343846 344187 331405 324855 322289
18031C22289j1201K33L374j7280j5265j0476O047R452K2746O580p003Q297J3247
$$ 322289 311088 311321 314695 297415 282150 271674 277721 287173 309919 316499 309496 317793 331040
18018C31040K1309p205j8444J111J2423q819q114M36k0273j4138n142R779k190
$$ 331040 352349 345144 326700 327811 340234 331415 323301 323737 303464 289326 284184 293963 291773
18005B91773n112q306j0428j864k891J849J4046K592j3406n626j1907m546o273
$$ 291773 286661 278355 267927 266063 263172 265021 279067 281659 268253 262627 250720 246174 239901
17992B39901q83J0744j832P23J7247J4325p468j8727j0460k846j181j0601l644
$$ 239901 239018 249762 247930 248653 265900 280225 272757 254030 243570 240724 239543 228942 225298
17979B25298M103m769j0397J309j26l315j9863j6341M299J0068j643K068K0446
$$ 225298 229401 224632 214235 215544 215418 212103 192240 175899 180198 190266 188623 190691 211137
17966B11137o213n427J0216o91m2n006O191o179N166Q089j942j3540m657J0641
$$ 211137 204924 199497 209713 209022 208980 203974 210165 203986 209152 217241 215299 201759 197102 207743
17952B07743R332l635J412k952j9266j5083P276k695o775j0259K740Q779o177
$$ 207743 217075 213440 214852 211900 192634 177551 184827 182132 175357 165098 167838 176617 170440
17939A70440j2849j4779J466j3545j2160K449j5960O742R324j5450n251J4748
$$ 170440 157591 142812 144278 130733 118573 121022 105062 111804 121128 105678 100427 115175
17927A15175Q406R698O598N392j0432q949Q340l466J708J1371J4403n484j7619
$$ 115175 123581 133279 139877 145269 134837 125888 134228 130762 132470 143841 158244 152760 135141
17914A35141r540j0774l406o803r541J6961J9554j0472L329o886N00J652O684
$$ 135141 125601 114827 111421 104618 95077 112038 131592 121120 124449 117563 118063 119715 126399
17901A26399N654R389l359L098j0377j8398j6113j5678P233J6136M178l11l965
$$ 126399 132053 141442 138083 141181 130804 112406 96293 80615 87848 103984 108162 107851 103886
17888A03886o467N260o476l489K926M516k0680n864p209J3341K2377M282j1127
$$ 103886 97419 102679 96203 92714 95640 100156 79476 73612 66403 79744 102121 106403 95276
17875I5276p531o37K632J366k9K727j6588j2653J1033Q5P825J5789l450L966k238
$$ 95276 87745 87108 89740 91106 91077 93804 77216 64563 75596 75681 83506 99295 95845 99811 97573
17860I7573r616j275k751j1365k352M599J2316p182k890J386o978m342o001P287
$$ 97573 87957 86682 83931 72566 70214 74813 87129 79947 77057 78443 71465 67123 61122 68409
17846F8409J073o218L571Q204J2633j3145j2875O104P71q027J000M445M389M752
$$ 68409 69482 63264 66835 75039 87672 74527 61652 67756 68527 60500 61500 65945 70334 75086
17832G5086j138m831n371m11l529Q999J6256J0146j1974j2613j547M177K0021
$$ 75086 73948 69117 63746 63335 59806 68805 85061 95207 83233 70620 69073 73250 93271
17819I3271m093l821Q745O589l81M46j3731j5282J229L976m646K757J2816P015
$$ 93271 89178 85357 94102 100691 100310 100756 87025 71743 72972 76948 72302 75059 87875 94890
17805I4890R546J973p064j0462K184J0361K294J68o006r812l431N792O167l857
$$ 94890 104436 106409 99345 88883 91067 101428 103722 103890 97884 88072 84641 90433 96600 92743
17791I2743o552m439J234Q658K7784J3622K3684K0478M9813P2221P5231M7370
$$ 92743 86191 81752 82986 91644 119428 133050 156734 177212 227025 299246 374477 421847
17779D21847J8714J1965M3733N1274n394l8192l5138J2142J7396K7303J5348J1819
$$ 421847 440561 452526 496259 547533 542139 503947 468809 480951 498347 525650 540998 552817
17767E52817O285J0348K6173J234m1020n8847l8674m2663m2769l9651l4907j7294
$$ 552817 559102 569450 595623 596857 555837 496990 458316 415653 372884 333233 298326 281032
17755B81032k0161k6665l0748k6452j9293J2582J7144J50n200n341J885J0220
$$ 281032 260871 234206 203458 177006 157713 170295 187439 187589 182389 177048 178933 189153
17743A89153p0R008L1692K2091K0763L5251M0616M2761J7674J9406K6351K6630
$$ 189153 189083 198091 229783 251874 272637 307888 348504 391265 408939 428345 454696 481326
17731D81326J9573J1417J2137R040J2079J3409J9769j9457k7744m0590l7337l5223
$$ 481326 500899 512316 524453 533493 545572 558981 578750 559293 531549 490959 453622 418399
17719D18399m5123m2125l6415l0465k4338j8407j8026k0582K081J6318P032j325
$$ 418399 373276 331151 294736 264271 239933 221526 203500 182918 184999 201317 208349 207024
17707B07024R588J106m932k4567j2983o285K709J459j0877j3282j6223O520J0644
$$ 207024 216612 217718 212786 188219 175236 168951 171660 173119 162242 148960 132737 139257 149901
17694A49901K2566K5137K7629K1887J6659L0577M6720L0603K4869J7620J7336
$$ 149901 172467 197604 225233 247120 263779 294356 341076 371679 396548 414168 431504
17683D31504J6439o892j2443k0984k1034l133j1165k0133o911J4257J9655J2072
$$ 431504 447943 441051 428608 407624 386590 383457 372292 352159 345248 359505 379160 391232
17671C91232L0000L8131K3509r545o325M0292O0251K8177p207l3106j3232M648
$$ 391232 421232 459363 482872 473327 467002 507294 567545 595722 588515 555409 542177 546825
17659E46825J03k0013n2726o1601o0026n7945m6832m0157k2604k0187p622J440
$$ 546825 546928 526915 474189 412588 352562 294617 247785 207628 185024 164837 157215 158655
17647A58655J0598J0240L0903P5546R2715O1060J7013Q538Q319L0846M233n6556
$$ 158655 169253 179493 210396 285942 378657 439717 456730 465268 473587 504433 508666 452110
17635D52110o0034m5750n0542l8122m1927l8944k9868k5370k4485l576m799r052
$$ 452110 392076 346326 295784 257662 215735 176791 146923 121553 97068 93492 88693 79641
17623G9641j1864J557o564r275M038M746l929j668k577O366Q33j0547k1692j2963
$$ 79641 67777 69334 62770 53495 57533 62279 58350 56682 54105 60471 61304 50757 29065 16102
17609A6102n30R923n253o119M611N148J2641j038m827o614P233L554j5709P792
$$ 16102 15572 25495 20242 14123 18734 23882 36523 35485 30658 24044 31277 34831 19122 26914
17595B6914P935O961j84j0297l513n65R467L63J021N614n082j1016J071l658O13
$$ 26914 34849 41810 41626 31329 27816 27251 36718 37081 38102 43716 38634 27618 28689 25031 25644
17580B5644j51N857N657L026L413l022j2914K980K493q216o533j034K730J98M252
$$ 25644 25493 31350 37007 40033 43446 40424 27510 30490 32983 24767 18234 17200 19930 20128 24380
17565B4380K425M720L990l773j0675m865J4260N229m781K609j6229j0516J166
$$ 24380 26805 31525 35515 31742 21067 16202 30462 35691 30910 33519 17290 6774 7940
17552G940n388N627q120k841J0269M447P693j502p099o613j69P252J957P019J6886
$$ 7940 2552 8179 59 -2782 7487 11934 19627 18125 11026 4413 4244 11496 13453 20472 37358
17537C7358J6558j2099j9561K018m539j0049P955Q45m721N966m637R61p001r88
$$ 37358 53916 41817 22256 24274 19735 9686 17641 18486 13765 19731 15094 16055 9054 8066
17523H066K0746K371k393p334k265j2734j6521j448q103M936K0495m056K074P568
$$ 8066 28812 31183 28790 21456 19191 6457 -10064 -11512 -19615 -14679 5816 1760 3834 11402
17509A1402O653l963r861j915M929Q860o713o495K1642K3801j4314k6731r922
$$ 11402 18055 14092 4231 2316 7245 16105 9392 2897 24539 48340 34026 7295 -2627
17496b627J3809J9895N680O489J398l710n055j5169k878K619n691O79L846j024
$$ -2627 11182 31077 36757 43246 44644 40934 35879 20710 17832 20451 14760 15439 19285 18261
17482A8261N564M383o326J104m422m442L770J0091J290p60o46l864j258m154j558
$$ 18261 23825 28208 21882 22986 18564 14122 17892 27983 29273 28513 27867 24003 22745 18591 17033
17467A7033M211K469k54N092Q172M455j2017n818l885M653j0047O29J2910o39
$$ 17033 21244 23713 23459 28551 36723 41178 29161 23343 19458 24111 14064 14693 27603 26964
17453B6964p529N755O46o837L759J500M468J4401o2m995O576q04L652K4368L9788
$$ 26964 19435 25190 25836 18999 22758 24258 28726 43127 43065 38070 44646 43842 47494 71862 111650
17438A11650K1296j5900k0805n656j723j2275l1160o670R665N602N335O529k291
$$ 111650 132946 117046 96241 90585 88862 76587 45427 38757 48422 54024 59359 65888 63597
17425F3597N856J9112j0062j1628n130K783J2380J2894L1054M7901O7416P0289
$$ 63597 69453 88565 78503 66875 61745 64528 76908 89802 120856 168757 236173 306462
17413C06462K5117j7873k4497k3930l7958l3260j2791r7K6012M3390O9160N9794
$$ 306462 331579 313706 289209 265279 227321 194061 181270 181173 207185 250575 319735 379529
17401C79529p385m5682k3977J604j9905j9714N438L0684O0373M8382j0869l4720
$$ 379529 372144 326462 302485 304089 284184 264470 269908 300592 360965 409347 398478 363758
17389C63758l1828l7561l5507l8884j1007J1863L7181O5711Q1091K1994m2439
$$ 363758 331930 294369 258862 219978 208971 220834 258015 323726 404817 426811 384372
17378C84372n2654l8670m3891n0099k8900j3544j9088o369r48q496m22J566n251
$$ 384372 331718 293048 249157 199058 170158 156614 137526 131157 130209 121713 121291 122857 117606
17365A17606O235m085L728o284m173k821P336J2071m353j6848K558J640l547k910
$$ 117606 123841 119756 123484 117200 113027 110206 117542 129613 125260 108412 110970 112610 109063 106153
17351A06153j1577J5064R665P676J186l063m54m594P944j1854l701k747Q64q363
$$ 106153 94576 109640 119305 126981 128167 125104 124650 120056 128000 116146 112445 109698 110562 102199
17337A02199j1322n115p162N175n017K740j862P205J1366J4927N547J2872L563
$$ 102199 90877 85762 78600 83775 78758 81498 79636 86841 98207 113134 118681 131553 135116
17324A35116O055K7149J8486J3627k4273l3291k1519k2232k5861k3778j0126Q679
$$ 135116 141171 168320 186806 200433 176160 142869 121350 99118 73257 49479 39353 48032
17312D8032J9632J0958p413P606J6535J8254J2747J5144K3717N715L236R187L784
$$ 48032 67664 78622 71209 78815 95350 113604 126351 141495 165212 170927 174163 183350 187134
17299A87134o914k837j7109k0183n212m274m576j700k917j2384q925r217J1486
$$ 187134 180220 177383 160274 140091 134879 130605 126029 124329 121412 109028 100103 90886 102372
17286A02372J8864J9693L8129M3082K0976l46J6535K9497J8777r204l5076k8261
$$ 102372 121236 140929 179058 222140 243116 242770 259305 288802 307579 298375 263299 235038
17274B35038j1586K240j8430m4334j5571K557K0277J4977N360L522J6481M4256
$$ 235038 223452 225692 207262 162928 147357 149914 170191 185168 190528 194050 210531 254787
17262B54787O4742O4100L2457Q47J1400K5682N398j5680j6652m2701k5702j3229
$$ 254787 319529 383629 416086 416933 428333 454015 459413 443733 427081 384380 358678 345449
17250C45449j0674l9911k6148j5637L863O667j4047m387R232J7521j0213j8391
$$ 345449 334775 294864 268716 253079 256942 263609 249562 245175 254407 271928 261715 243324
17238B43324k0887j4721l104P669l400P003K6859J1922j0805k1906l148K0948
$$ 243324 222437 207716 204612 212281 208881 215884 242743 254665 243860 221954 218806 239754
17226B39754K1586K6955J1926j9385j8208j6598j4121k670k3666m1376j8949r260
$$ 239754 261340 288295 300221 280836 262628 246030 231909 229239 205573 164197 145248 135988
17214A35988j887O911P36m034P227o419j271L470J3706K396K1066k675K11O288
$$ 135988 134101 141012 141748 137714 144941 138522 137251 140721 154427 156823 177889 175214 175425 181713
17200A81713K979m034J8521k313P24m988k138R180m015M918N876N507L560p488
$$ 181713 184692 180658 199179 196866 197590 192602 190464 199644 195629 200547 206423 211930 215490 208002
17186B08002R215O310J7394N229J6661L0745o234o923K2999l873R793P078J1433
$$ 208002 217217 223527 240921 246150 262811 293556 287322 280399 303398 299525 309318 316396 327829
17173C27829J1887J6856J0411K3968L0493J5620K6274L4590K1276L3978L1790
$$ 327829 339716 356572 366983 390951 421444 437064 463338 497928 519204 553182 584972
17162E84972L7738O2477R2431J05377J39472J29559P2301K7394O2069J16056J09297
$$ 584972 622710 685187 777618 882995 1022467 1152026 1224327 1251721 1313790 1429846 1539143
17151A539143L0236j0363M957N9040N4338K7242N2957Q7427J32095J50715J08766
$$ 1539143 1569379 1559016 1563973 1623013 1677351 1704593 1757550 1844977 1977072 2127787 2236553
17140B236553P0084J12199J86615K46115K55806J87818J32895K10738L39704M08366
$$ 2236553 2306637 2418836 2605451 2851566 3107372 3295190 3428085 3638823 3978527 4386893
17130D386893M23031M76395N96582P62553R57878J212506J619857K296590L497848
$$ 4386893 4809924 5286319 5882901 6645454 7603332 8815838 10435695 12732285 16230133
17121A6230133N688155R269552J3031190J2494237O179830J327878K818348O205718
$$ 16230133 21918288 31187840 44219030 56713267 62893097 64220975 67039323 73245041
17113G3245041M168501l934033r957181r888294q037651p530552p293852n893972
$$ 73245041 77413542 73479509 63522328 53634034 45596383 38065831 30771979 24878007
17105B4878007l761611j848189l63332R66536K540656M930259Q863845J3844223
$$ 24878007 21116396 19268207 18904875 19871411 22412067 27342326 36206171 50050394
17097E0050394J5303557R220905K002129J768979O010082O008895k125242j0630428
$$ 50050394 65353951 74574856 76576985 78345964 84356046 90364941 88239699 77609271
17089G7609271j2219286j0200119r441692r591119q493018o207070m140163k932626
$$ 77609271 65389985 55189866 45748174 36157055 27664037 21456967 17316804 14384178
17081A4384178k211426j653777j259918j058281r24555p61404n81216m21073l38274
$$ 14384178 12172752 10518975 9259057 8200776 7276221 6514817 5933601 5512528 5174254
17072E174254k90148k17640j31397K4082J96045K38545J10489j07609j26457j3165
$$ 5174254 4884106 4666466 4535069 4559151 4755196 4993741 5104230 4996621 4870164 4856999
17062D856999K3508j77699m03678m51429m20197m10772m09596l72122k98998k14031
$$ 4856999 4880507 4702808 4299130 3847701 3427504 3016732 2607136 2235014 1936016 1721985
17052A721985j41471j16189r5923q9669r6109r7086p1098m7090m8046n5430m6927
$$ 1721985 1580514 1464325 1368402 1278733 1182624 1085538 1014440 967350 919304 863874 816947
17041H16947k8776k1391k3039l4154m2844l4281j8748j8514j5474k2082j7042
$$ 816947 788171 766780 743741 709587 666743 632462 613714 595200 579726 557644 540602
17030E40602q948j8804k5131n020L781r172j663m448k5333l4149j3861j868q630
$$ 540602 531654 512850 487719 482699 486480 477308 475645 471197 445864 411715 397854 395986 387356
17017C87356j049j2398k0073p572o441j1716q115L746J2801J128m083k334J6954
$$ 387356 386307 373909 353836 346264 339823 328107 319992 323738 336539 337667 333584 331250 348204
17004C48204l896j939J4910O282O135K6009N693J9383M436J55P067J9706K8373
$$ 348204 344308 342369 357279 363561 369696 395705 401398 420781 425217 425372 432439 452145 480518
16991D80518j1261l7011l6966k4748k4745j3979j9717k1330k130N54K2751N759
$$ 480518 469257 432246 395280 370532 345787 331808 312091 290761 288631 289185 311936 317695
16979C17695j0621p307k7992k3758N741K5112K5992J4352K4290J8060r132l4174
$$ 317695 307074 299767 271775 248017 253758 278870 304862 319214 343504 361564 352432 318258
16967C18258m2189j3493p818k2717k3181j1681j6266N540J4807R462l135k1596
$$ 318258 276069 262576 254758 232041 208860 197179 180913 186453 201260 210722 207587 185991
16955A85991j8724k5355N582J2377P793m469Q543J3062P645J0527J4985J4348
$$ 185991 167267 141912 147494 159871 167664 163195 171738 184800 192445 202972 217957 232305
16943B32305l386j2947o64J2872P654l127L696J5005N174N383R972J0032Q460
$$ 232305 228919 215972 215308 228180 235834 232707 236403 251408 256582 261965 271937 281969 290429
16930B90429R201j0190O291J4284N839K2358L7871L3812j6901R546K2484O754
$$ 290429 299630 289440 295731 310015 315854 338212 376083 409895 392994 402540 425024 431778
16918D31778J925J0993K4829L2530K4821L1201L9666K7815K0618L1940M0489N3193
$$ 431778 433703 444696 469525 502055 526876 558077 597743 625558 646176 678116 718605 771798
16906G71798M0724K0561Q921J6420M2867J1290M364K6385L3323O2768J32695J73728
$$ 771798 812522 833083 842004 858424 901291 912581 916945 943330 976653 1039421 1172116 1345844
16894A345844J56831N8849J3624M3385M8989K567N709P9846J83353K37037J97921
$$ 1345844 1502675 1561524 1575148 1618533 1667522 1670089 1675798 1755644 1938997 2176034 2373955
16883B373955J83576K12376K11548K73135K44537J41238J86896L33309M40855
$$ 2373955 2557531 2769907 2981455 3254590 3499127 3640365 3827261 4160570 4601425
16874D601425N47455O33862O18774P41947J061067J533129K172603L168457N273697
$$ 4601425 5148880 5782742 6401516 7143463 8204530 9737659 11910262 15078719 20352416
16865B0352416R754819J7198653J8679013J187078q465035o032376m292907o198230
$$ 20352416 30107235 47305888 65984901 67171979 58706944 52674568 48381661 42183431
16857D2183431p486041m757647n61272M185785J0869890J7827248J0373595o422250
$$ 42183431 34697390 29939743 29378471 33564256 44434146 62261394 72634989 66212739
16849F6212739q066052m914306m571227o384762m593587J238605R068878J4350374
$$ 66212739 58146687 53232381 48661154 42276392 37682805 38921410 47990288 62340662
16841F2340662M173862p900039p074878m810226n556174p153528n473247j952785
$$ 62340662 66514524 58614485 51539607 46729381 41173207 34019679 28546432 26593647
16833B6593647K008608P243351J3821326J2444265l327225q673751o153430n355244
$$ 26593647 28602255 35845606 49666932 62111197 58783972 50110221 43956791 38601547
16825C8601547p420742q031341n774955l458967k293894j737652j239046q85913
$$ 38601547 31180805 23149464 17374509 13915542 11621648 9883996 8644950 7759037
16817G759037p10783o62063o38923n40430l53589j38026P4546M1901k57060l21048
$$ 7759037 7048254 6386191 5747268 5206838 4853249 4715223 4789769 4831670 4574610 4253562
16807D253562k74380k65158l81237m11400l61792k83830k30167j82184j40659
$$ 4253562 3979182 3714024 3332787 2921387 2559595 2275765 2045598 1863414 1722755
16798A722755j01246p6580k2601j1444n1425q9535r3470r0590p4249p8665o9273
$$ 1722755 1621509 1544929 1522328 1510884 1459459 1369924 1276454 1185864 1111615 1032950 963677
16787I63677n2517n0987n7607m0041m2213m4260l1348j9977k0499k3118j5345
$$ 963677 911160 860173 802566 762525 720312 676052 644704 624727 604228 581110 565765
16776E65765j8618k9769k7731l4181k2356j7910l416P812r254p422j4962J07p221
$$ 565765 547147 517378 489647 455466 433110 415200 411784 419596 410342 402920 387958 388065 380844
16763C80844k2290k224j861j2718o303p08j6760n79j8739r595r857j2216j0996
$$ 380844 358554 356330 354469 341751 335448 334740 317980 317401 298662 289067 279210 266994 255998
16750B55998J5637k806J341K721r278j6310k058J2991L741p979L0744L9808J3777
$$ 255998 271635 268829 270170 272891 263613 247303 245245 258236 261977 253998 284742 324550 338327
16737C38327m378k4529k6329l2548k1194j4383p997R174K1521P713J764j052p913
$$ 338327 333949 309420 283091 250543 229349 214966 206969 216143 237664 245377 247141 246089 238176
16724B38176k3288j4304l552N069j4016n716k20J2241J1875n443j1554j9911r046
$$ 238176 214888 200584 197032 202101 188085 182369 182149 194390 206265 200822 189268 169357 160311
16711A60311j2870k228j5204j144N46J005P131R726q141m328r164l998k0032j2308
$$ 160311 147441 145213 130009 128865 129411 130416 137547 147273 139132 134804 125640 121642 101610 89302
16697H9302n755j5779P665J5002m331n524J837P764m145m579j1131o651O469J1950
$$ 89302 83547 67768 75433 90435 86104 80580 82417 90181 86036 81457 70326 63675 70144 82094
16683H2094k088o595J110j0088K355J6642J0089j8146j3969M390L658J7185J7027
$$ 82094 80006 73411 74521 64433 66788 83430 93519 75373 61404 65794 69452 86637 103664
16670A03664M770o02j321n075j6360q046Q825J2382l049j7174r81N943Q39O441
$$ 103664 108434 107832 106511 101436 85076 77030 85855 98237 95188 78014 77033 82976 83815 90256
16656I0256n368p79N236Q109j6218j2137n177Q269Q821j3199k235Q606j356n156
$$ 90256 84888 84109 89345 97454 81236 69099 63922 72191 81012 67813 65578 74184 72828 67672
16642F7672J5518J9056R912n116k522j330J2208k429j3879j3347m047M602k0290
$$ 67672 83190 102246 112158 107042 104520 103190 115398 112969 99090 85743 81696 86298 66008
16629F6008j0671j6299J0571J4366r186p101p83J2737n997K365P005k672L679
$$ 66008 55337 39038 49609 63975 54789 47688 46905 59642 53645 56010 63015 60343 64022
16616F4022J6669P271l714j0432p162m271j3823Q268N327K564j653J937J643r973
$$ 64022 80691 87962 84248 73816 66654 62383 48560 56828 62155 64719 63066 65003 66646 56673
16602E6673L639n58J617J63k0232L3j543k928k435O131K9104P271q469J0885L299
$$ 56673 60312 59754 61371 61534 41302 41335 39792 36864 34429 40560 69664 76935 68466 79351 82650
16587H2650k096p022k4471o524P10R389L733J116K2874q69M268J0742M334n153
$$ 82650 80554 73532 49061 42537 43247 52636 56369 57485 80359 79490 83758 94500 98834 93681
16573I3681p197O131O989J1257K2274L6243M8552N8035P2739M7318K3938J2333
$$ 93681 86484 92615 99604 110861 133135 169378 217930 275965 348704 396022 419960 432293
16561D32293L2279M0232J4511m5728o9016n9622n5751m8275l5517k8873j8312
$$ 432293 464572 504804 519315 473587 404571 344949 289198 240923 205406 176533 158221
16550A58221j5248p721o953K7094M0704N5963P5194N9462J5259L577K3158K5376
$$ 158221 142973 135252 128299 155393 196097 252060 327254 386716 401975 405552 428710 454086
16538D54086M167m2534n4303m8979l8976m5244m3554k9372k7608k1731q621k455
$$ 454086 458253 415719 361416 312437 273461 228217 184663 155291 127683 105952 97331 94876
16526I4876j0128k3206p88o239j4608J8464J5376n762j1228l152N823N303l976
$$ 94876 84748 61542 60754 54515 39907 58371 73747 67985 56757 53605 59428 64731 60755
16513F0755j0357L326J666o515K284r839N849K382Q452p333j1823N583q734m964
$$ 60755 50398 53724 55390 48875 51159 41320 47169 49551 58003 50670 38847 44430 35696 30732
16499C0732J737k636j2633K55Q682J4248M919O331N583k030j1348o185j1567P500
$$ 30732 32469 29833 17200 17455 26137 40385 45304 51635 57218 55188 43840 37655 26088 33588
16485C3588R107P285L296J248q710j0482j1461k771L367P241J0496p05j1787r835
$$ 33588 42695 49980 53276 54524 45814 35332 23871 21100 24467 31708 42204 41499 29712 19877
16471A9877R499J5469j02j7800p83N126L42r734J866M61J1083k667k783M994O048
$$ 19877 29376 44845 44743 26943 26160 31286 31628 21894 23760 24221 35304 32637 29854 34848 40896
16456D0896K643k4431k427J4627J0087L614o563j3416L922n81q08l000L070j586
$$ 40896 43539 19108 16681 31308 41395 45009 38446 25030 28952 28371 27563 24563 27633 26047
16442B6047J1004M363m281j4721r281R257M395m247j7457N622J7391j3370r136
$$ 26047 37051 41414 37133 22412 13131 22388 26783 22536 5079 10701 28092 14722 5586
16429E586Q743J666J671j667J6331J3324j8966o343o861l661Q761j065m282N410
$$ 5586 14329 15995 17666 15999 32330 45654 26688 20345 13484 9823 18584 17519 13237 18647
16415A8647J958N774K139M003n615l935M629k288J130L129P913m221j1239j00
$$ 18647 20605 26379 28518 32521 26906 22971 27600 25312 26442 29571 37484 33263 22024 21924
16401B1924Q267j647j8518p751Q299J0866J3805N428j4L893q460o476p641M515
$$ 21924 30191 28544 10026 2275 10574 21440 35245 40673 40659 44552 36092 29616 21975 26490
16387B6490j2564l426J05P856p118n681L711o099J1084L006M905o117j3433m763
$$ 26490 13926 10500 10605 18461 11343 5662 9373 3274 14358 17364 22269 16152 2719 -2044
16373b044J1254J3756k659l731P532J2599Q804M687n387o645n198n691k1575q870
$$ -2044 9210 22966 20307 16576 24108 36707 45511 50198 44811 38166 32968 27277 5702 -3168
16359c168Q360l335l549j46O106J6559l338j1068J587J589k829L346Oq870j5263
$$ -3168 5192 1857 -1692 -1838 4268 20827 17489 6421 8008 9597 6768 10114 10120 1250 -14013
16344a4013J5822K7955J0061P169j3354j2031m031p769j0838n465O721J2988J8387
$$ -14013 1809 29764 39825 46994 33640 21609 17578 9809 -1029 -6494 227 13215 31602
16331C1602P418j2425o233l167L268P690N33L87Q405n521N599O108M6p167j1142
$$ 31602 39020 26595 20362 17195 20463 28153 28686 29073 37478 31957 37556 43664 43710 36543 25401
16316B5401j3788J2367J2053J3228J1584K8523L2750L9885N9190P9697M0960j4893
$$ 25401 11613 23980 36033 49261 60845 89368 122118 162003 221193 300890 341850 326957
16304C26957k6777k3186k6857l8878k7436j0840R634L6054O4379P4459R580l0473
$$ 326957 300180 276994 250137 211259 183823 172983 182617 218671 283050 357509 367089 336616
16292C36616l4624k3840k3501l0013p73K9541O3643M2185k0267m0008l2791j2966
$$ 336616 301992 278152 254651 224638 223865 253406 317049 359234 338967 298959 266168 253202
16280B53202k4484l3742j0409R922K0664L3288N7287K0106j4331k9024l7496m2471
$$ 253202 228718 194976 184567 194489 215153 248441 305728 325834 311503 282479 244983 202512
16268B02512m5756m1801k4901j6795m067j4181j3093Q759M443J774o909j1498
$$ 202512 156756 114955 90054 73259 69192 55011 41918 50677 55120 56894 49985 38487
16256C8487k297j3363l383M656P336q101p875p906J3757M266J258m221K749M932
$$ 38487 36190 22827 19444 24100 31436 23335 15460 7554 21311 25577 26835 22614 25363 30295
16242C0295M35r307j7520J506r791j3623J4077K422n653M717m62m078J4179O86
$$ 30295 30730 21423 3903 5409 -4382 -18005 -3928 -1506 -7159 -2442 -2904 -6982 7197 7883
16228G883l679p291J883L175N937k184L317N244p279j3311K683J2718n509j1404
$$ 7883 4204 -3087 -1204 1971 7908 5724 9041 14285 7006 -6305 -3622 9096 3587 -7817
16214g817m619l714M598K9187J9926n757o244n149k193n015p527j7568m798M490
$$ -7817 -12436 -16150 -11552 17635 37561 31804 25560 20411 18218 13203 5676 -11892 -16690 -12200
16200a2200O13J3212J4899n092R277r947J558P213r609m221o723M84o071J0964
$$ -12200 -11587 1625 16524 11432 20709 10762 12320 19533 9924 5703 -1020 -536 -6607 4357
16186D357J0923m602k884Q084J0523K677r579q648L512j4473j3628P608O293N102
$$ 4357 15280 10678 7794 15878 26401 29078 19499 10851 14363 -110 -13738 -6130 163 5265
16172E265P291m251o91N136j087j0478o028N38J498M339l093L768J0738j530J215
$$ 5265 12556 8305 7614 12750 11663 1185 -4843 -4305 -2807 1532 -1561 2207 12945 11415 12630
16157A2630q330o004K753M561p822L31Q497m79P928K752p237m078M732J566j0048
$$ 12630 4300 -1704 1049 5610 -2212 -1881 6616 6137 14065 16817 9580 5502 10234 11800 1752
16142A752p96k74J3996M886n530R944l54j0629j748L672L98j6653m841L384R017
$$ 1752 956 682 14678 19564 14034 23978 23624 12995 11247 14919 15317 -1336 -6177 -2793 6224
16127F224M226L647j4107p8J7641O949Q891o209r460j0822m058j16J6998j0036
$$ 6224 10450 14097 -10 -88 17553 24502 33393 27184 17724 6902 2844 2728 19726 9690
16113I690K515Q792q606q697J247o880k834k253J549J090j652M804m494Q30K221
$$ 9690 12205 20997 12391 3694 4941 -1939 -4773 -7026 -5477 -4387 -6039 -1235 -5729 -4899 -2678
16098b678M42o067n640N349m99L693J4422J353p008J0015m204L007o932j636K836
$$ -2678 -2236 -8303 -13943 -8594 -9093 -5400 9022 10375 3367 13382 9178 12185 5253 3617 6453
16083F453o314K55O139K020j2266k07P837L142O123j1920r430j0008J7116m6j6465
$$ 6453 139 394 6533 8553 -3713 -3920 3917 7059 13182 1262 -8168 -18176 -1060 -1106 -17571
16068a7571L482K087j494k585L393J0874J423j2284l012M831Q108r708j4932L953
$$ -17571 -14089 -12002 -13496 -16081 -12688 -1814 -391 -12675 -15687 -10856 -2748 -12456 -27388 -23435
16054b3435Q078j7532J6902J4958M476r299J0401R252n190j2714j4364L477O340
$$ -23435 -15357 -32889 -15987 -1029 3447 -5852 4549 13801 8611 -4103 -18467 -14990 -8650
16041h650N657J2619P983N658k408q131m864Q240m453j2432o771k165L561J7232
$$ -8650 -2993 9626 17609 23267 20859 12728 7864 16104 11651 -781 -7552 -9717 -6156 11076
16027A1076K3167O866p324r041o634N098r109k81m521q779p345Q619L921p474
$$ 11076 34243 41109 33785 24744 18110 23208 14099 13818 9297 518 -6827 1792 5713 -1761
16013a761R950L854j0979r622r89K4289j1647j9386M90p645j1027J0755k913k29
$$ -1761 8189 12043 1064 -8558 -9547 14742 3095 -16291 -15801 -23446 -34473 -23718 -26631 -26860
15999b6860J3159Q270l59N031O67K351K837m079p27K87R847J2097r407r068j0396
$$ -26860 -13701 -5431 -5790 -759 -92 2259 5096 1017 290 577 10424 22521 13114 4046 -6350
15984f350M535J7418L721r158M370O995o397P464r105p398K091L127J6095j5864
$$ -6350 -1815 15603 19324 10166 14536 21531 15134 22598 13493 6095 8186 11313 27408 11544
15970A1544j7060P608J5310J665j183p445R455N52L50L079r534j2628p760L020
$$ 11544 -5516 2092 17402 19067 17884 10439 19894 20446 20796 23875 14341 1713 -6047 -3027
15956c027m843l600N194j483o184j991O143k833r771O542J1836K301q047j0582
$$ -3027 -7870 -11470 -6276 -7759 -13943 -15934 -9791 -12624 -22395 -15853 -4017 -1716 -9763 -20345
15942b0345k91L967j8331L710J0697J1508k469J984L78p682J3862Q387k812l089
$$ -20345 -20636 -16669 -35000 -31290 -20593 -9085 -11554 -9570 -9192 -16874 -3012 5375 2563 -526
15928e26k338O920L315j1705l205K908l727N840m443j2150R794L862q910R069
$$ -526 -2864 4056 7371 -4334 -7539 -4631 -8358 -2518 -6961 -19111 -9317 -5455 -14365 -5296
15914e296Q098Q471j0235q723P722J3320n974j0646n11k2889j6433R262L560P908
$$ -5296 2802 11273 1038 -7685 37 13357 7383 -3263 -3774 -26663 -43096 -33834 -30274 -22366
15900b2366Q018M837N31R599N08j5610n888J2642K548M873l529O39j157O981K337
$$ -22366 -14348 -9511 -8980 619 1127 -14483 -20371 -7729 -5181 -308 -3837 -3198 -4355 2626 4963
15885D963k808m412J4235J578j2162k98K891r698j0740J1868l557l997P337m641
$$ 4963 2155 -2257 11978 13556 1394 1096 3987 -5711 -16451 -4583 -8140 -12137 -4800 -9441
15871i441j2570m518M097k848R385L825O340O225O29O327K281K28j9865j3718
$$ -9441 -22011 -26529 -22432 -25280 -15895 -12070 -5730 495 1124 7451 9732 9960 -9905 -23623
15857b3623O817r176q414Q604J7855J9824K596k940m174k763n648J2040J2329
$$ -23623 -16806 -25982 -34396 -25792 -7937 11887 14483 11543 7369 4606 -1042 10998 23327
15844B3327j869j0472j5442j5611k782m201J193J6507P358m393p2J4086R40q152
$$ 23327 21458 10986 -4456 -20067 -22849 -27050 -25857 -9350 -1992 -6385 -6457 7629 8569 417
15830D17l577r817J785j584Q560m652n424m663J3536p08k838R742O263m130j2478
$$ 417 -3160 -12977 -11192 -12776 -4216 -8868 -14292 -18955 -5419 -6127 -8965 777 7040 2910 -9568
15815i568p80Q056J2242M157j3319o030n597J7201J3222j73M177r907r159M667
$$ -9568 -10348 -2292 9950 14107 788 -5242 -10839 6362 19584 19411 23588 13681 4522 9189
15801I189L246j5100j777P670O584K942J6853j0485j3253k836j0790P446j077
$$ 9189 12435 -2665 -4442 3228 9812 12754 29607 19122 5869 3033 -7757 -311 -1388
15788a388j1236j4166k400K5008R875J9451P283k69j1579Q018p248q359l662p204
$$ -1388 -12624 -26790 -29190 -4182 5693 25144 32427 32158 20579 28597 21349 12990 9328 2124
15774B124K587J4864l146j3097O928J0463j2533r996p41j0938Q489Q681Q15L680
$$ 2124 4711 19575 16429 3332 10260 20723 8190 -1806 -2547 -13485 -4996 3685 4500 8180
15760H180n864j7860N631O325p682o797Q311Q598R796J3640K196n442j8010J5
$$ 8180 2316 -15544 -9913 -3588 -11270 -18067 -9756 -1158 8638 22278 24474 19032 1022 1037
15746A037M291K012j4014r579m365r450m519J0661P697j91N167k41q34P431j462
$$ 1037 5328 7340 -6674 -16253 -20618 -30068 -34587 -23926 -16229 -16420 -11253 -11494 -12328 -4897 -6359
15731f359o124L747J3188J0054J42k315m134J785O594q966j6485M373N182O857
$$ -6359 -12483 -8736 4452 14506 14648 12333 8199 9984 16578 7612 -8873 -4500 682 7539
15717G539q397o52l049o627k380l892j163O658p90P441Q349K2765N643q702j4689
$$ 7539 -858 -1510 -4559 -11186 -13566 -17458 -18621 -11963 -12753 -5312 3037 25802 31445 22743 8054
15702H054k0596j3317j96m562J1642J7554j766j1121O291P678J478q476j880k994
$$ 8054 -12542 -25859 -26055 -30617 -18975 -1421 -3187 -14308 -8017 -339 1139 -7337 -9217 -12211
15688a2211m155l448l517l3J9566J5391P743J613k297j8801n525l583K290J1608
$$ -12211 -16366 -19814 -23331 -23364 -3798 11593 19336 20949 18652 -149 -5674 -9257 -6967 4641
15674D641N77j417j0744L09J4475O027N739j492n101q715j2738K935K568P535
$$ 4641 5218 3801 -6943 -6634 7841 13868 19607 18115 13014 4299 -8439 -5504 -2936 4599
15660D599p647o34J4140P734q897m512O585J0781j1890r520N162Q303K356m176
$$ 4599 -3048 -3682 10458 18192 9295 4783 11368 22149 10259 739 5901 14204 16560 12384
15646A2384r188J796K6l298r675m009K299P864L794l21O895r191o643J1334R674
$$ 12384 3196 4992 5018 1720 -7955 -11964 -9665 -1801 1993 1672 8567 -624 -7267 4067 13741
15631A3741j5565k522J5079r850k7655O899J5123J1593R792n054o225m585P274
$$ 13741 -1824 -4346 10733 883 -26772 -19873 -4750 6843 16635 11581 5356 771 8045
15618H045J8120j2827j5725j3385N337N314j074P093N808Q570j4225k2158k145
$$ 8045 26165 13338 -2387 -15772 -10435 -5121 -6195 898 6706 15276 1051 -21107 -23252
15605b3252N078m560J1051N730J1075N581j5598j7141M670J5743j359l479J2863
$$ -23252 -18174 -22734 -11683 -5953 5122 10703 -4895 -22036 -17366 -1623 -2982 -6461 6402
15592F402M052n929k218r095j2045M586K259J0666K61k624O374j197m864m038
$$ 6402 10454 4525 2307 -6788 -18833 -14247 -11988 -1322 -1061 -3685 2689 1492 -3372 -7410
15578g410l307q804q594J4015P421L021J1634P28j764l449j1574J987J4676J3001
$$ -7410 -10717 -19521 -28115 -14100 -6679 -3658 7976 8704 6940 3491 -8083 -6096 8580 21581
15564B1581l198J186L796j3918j969j0186J3378J0620j537k9217j1111M652N453
$$ 21581 18383 19569 23365 9447 7478 -2708 10670 21290 19753 -9464 -20575 -15923 -10470
15551a0470j862p211J1856J9594m696j8754K443n551j2949J1060Q403r861j6948
$$ -10470 -12332 -19543 -7687 11907 7211 -11543 -9100 -14651 -27600 -16540 -8137 -17998 -34946
15538c4946l896J8225J9890O371m411m25J0286N216k104o331j2851j0408P191
$$ -34946 -38842 -20617 -727 5644 1233 808 11094 16310 14206 7875 -4976 -15384 -8193
15525h193p865q851O699L469J0087Q12j0622q714J1714J2914R999n314r083L472
$$ -8193 -16058 -24909 -18210 -14741 -4654 -3842 -14464 -23178 -11464 1450 11449 6135 -2948 524
15511E24N937M79j5526o851k502J6262K4263N749r275k1307K330l851q488O438
$$ 524 6461 6940 -8586 -15437 -17939 -1677 22586 28335 19060 -2247 83 -3768 -12256 -5818
15497e818j1616j036j2998L686Q923J663R293J2417j1616n267j1597m182J0137
$$ -5818 -17434 -18470 -31468 -27782 -18859 -17196 -7903 4514 -7102 -12369 -23966 -28148 -18011
15484a8011J544M509Q333k315K940n619n461K576J2930K7860m223j1316K631p060
$$ -18011 -16467 -11958 -3625 -5940 -3000 -8619 -14080 -11504 1426 29286 25063 13747 16378 9318
15470I318N121l860j0214j0635m718m650n588L794J2552O261M904n841J4322R07
$$ 9318 14439 10579 365 -10270 -14988 -19638 -25226 -21432 -8880 -2619 2285 -3556 10766 11673
15456A1673j7489r312n468J1084R208L713J2936o673n117K699P813j0862j7834
$$ 11673 -5816 -15128 -20596 -9512 -304 3409 16345 9672 4555 7254 15067 4205 -13629
15443a3629J1005Q685K908O986j0556k6995o725n14K337J1060J0117j772J009
$$ -13629 -2624 6061 8969 15955 5399 -21596 -28321 -28835 -26498 -15438 -5321 -7093 -6084
15430f084o561j1236r89N369K993P220R367q546j2985R84P802M515p037p361O887
$$ -6084 -12645 -23881 -24870 -19501 -16508 -9288 79 -8467 -21452 -20468 -12666 -8151 -15188 -22549 -15662
15415a5662K3838J4022j0902j3087p631m695J122O573k10R695K409m458j8376
$$ -15662 8176 22198 11296 -1791 -9422 -14117 -12995 -6422 -6632 3063 5472 1014 -17362
15402a7362p322R77R119N71o119J0248J1976Q73p494o862j205J5345Q28j2188
$$ -17362 -24684 -23707 -14588 -14017 -20136 -9888 2088 2961 -4533 -11395 -12600 2745 3573 -8615
15388h615K130o83p843j3390j2434O238J5906K146J5324L605j1807K686j2149
$$ -8615 -6485 -7168 -15011 -28401 -40835 -34597 -18691 -16545 -1221 2384 -9423 -6737 -18886
15375a8886n312J2187J9810j1293p261J945q633k521Q766L676l812m557N581L989
$$ -18886 -24198 -12011 7799 -3494 -10755 -8810 -17443 -19964 -11198 -7522 -11334 -15891 -10310 -6321
15361f321j663o175L920o31Q3n790J0345j0186n919J1416J3740n70j285k8329
$$ -6321 -7984 -14159 -10239 -10870 -10787 -16577 -6232 -16418 -22337 -10921 2819 2249 964 -27365
15347b7365j1868Q869r100L065J163K531J4476K894O212j1893R549J9020l202
$$ -27365 -39233 -30364 -39464 -36399 -35236 -32705 -18229 -15335 -9123 -21016 -11467 7553 4351
15334D351l454j3201m414Q520k120P357J37j4488L213P276J1893n761n840j657
$$ 4351 897 -12304 -16718 -8198 -10318 -2961 -2824 -17312 -14099 -6823 5070 -691 -6531 -8188
15320h188o675J0810J2841l971k62j3199o997L713J793K403l563O593J1185L764
$$ -8188 -14863 -4053 8788 4817 4555 -8644 -15641 -11928 -10135 -7732 -11295 -4702 6483 10247
15306A0247r580L533N314J1642N378k783M682l071l630j3164M816L597N31Q555
$$ 10247 667 4200 9514 21156 26534 23751 28433 25362 21732 8568 13384 16981 17512 26067
15292B6067l499p770J2735R472l330Q766q613m441M150r7l211L608n995j1710
$$ 26067 22568 14798 27533 37005 33675 42441 33828 29387 33537 33440 30229 33837 27842 16132
15278A6132O962M374K581q307l598J4778m438j4025k646P36q233M121r621L068
$$ 16132 23094 27468 30049 21742 18144 32922 28484 14459 11813 12549 4316 8437 -1184 1884
15264A884l670j112m876N625J875K360l860l121O175J1515j1727k5809L7M300
$$ 1884 -1786 -2898 -7774 -2149 -274 2086 -1774 -4895 1280 12795 1068 -24741 -24704 -20404
15250b0404L498J3715R127q777l269J052n363M867L922m160O454n543r538j3804
$$ -20404 -16906 -3191 5936 -2841 -6110 -5058 -10421 -5554 -1632 -5792 662 -4881 -14419 -28223
15236b8223Q600K7634J605m715n345r226K434K928k42Q336J016J152o963L455
$$ -28223 -19623 8011 9616 4901 -444 -9670 -7236 -4308 -4550 3786 4802 5954 -1009 2446
15222B446n370o144j234k258O793J6901j0695j3147k916k966J4245p819p042L179
$$ 2446 -2924 -9068 -10302 -12560 -5767 11134 439 -12708 -15624 -18590 -4345 -12164 -19206 -16027
15208a6027K023M922q334J375N056l98R746l521o849q091m083K29L967L721R474
$$ -16027 -14004 -9082 -17416 -16041 -10985 -11383 -1637 -5158 -12007 -20098 -24181 -23952 -19985 -16264 -6790
15193f790k723q391j756r070q574J7284K1978m9o800n203J3608P230p994k0480
$$ -6790 -9513 -17904 -19660 -28730 -37304 -20020 1958 1909 -4891 -10094 3514 10744 2750 -17730
15179a7730J3913P899j1818q704L538J7108O813m076j3175l847L295P992N897
$$ -17730 -3817 4082 -7736 -16440 -12902 4206 11019 6943 -6232 -10079 -6784 1208 7105
15166G105O416K288j2040k4712n905P043J0189J0637n466K617o27j5825p806n429
$$ 7105 13521 15809 3769 -20943 -26848 -19805 -9616 1021 -4445 -1828 -2455 -18280 -26086 -31515
15152c1515n544o271J9033J0715k579K947l713k982J5683P583j2708k74n762j654
$$ -31515 -37059 -43330 -24297 -13582 -16161 -13214 -16927 -19909 -4226 3357 -9351 -9625 -15387 -17041
15138a7041m758J182m422M643k428k476r646J143K580J698n729O707K198L629
$$ -17041 -21799 -20617 -25039 -20396 -22824 -25300 -34946 -33803 -31223 -29525 -35254 -28547 -26349 -22720
15124b2720L448K363P41l984K348J1037K400j5112m351M582N83J938P087O948
$$ -22720 -19272 -16909 -16168 -20152 -17804 -6767 -4367 -19479 -23830 -19248 -18665 -16727 -9640 -2692
15110b692P114q761r870l041J7257J4563Q783j5157j1927J3007R824m766q300
$$ -2692 4422 -4339 -14209 -17250 7 14570 23353 8196 -3731 9276 19100 14334 6034
15097F034j0219M565P350j3132j3665o272j614J0665J5132N076p0N678L956k855
$$ 6034 -4185 380 7730 -5402 -19067 -25339 -26953 -16288 -1156 3920 3850 9528 13484 10629
15083A0629n540j6170j4766O005n92K735Q884J1732j4216O394N216r829m894P661
$$ 10629 5089 -11081 -25847 -19842 -20434 -17699 -8815 2917 -11299 -4905 311 -9518 -14412 -6751
15069f751L236J0471O2j3067j8580r140n245l691R449j44J9537J7479J070j7755
$$ -6751 -3515 6956 7018 -6049 -24629 -33769 -39014 -42705 -33256 -33400 -13863 3616 4686 -13069
15055a3069j4447l809j293n086R78k423O677Q570k314l767N058J552R224m543
$$ -13069 -27516 -31325 -32618 -37704 -36726 -39149 -32472 -23902 -26216 -29983 -24925 -23373 -14149 -18692
15041a8692K427k93q309l293n258j724M793J673J0405K753n316J3136J0854J0432
$$ -18692 -16265 -16558 -24867 -28160 -33418 -35142 -30349 -28676 -18271 -15518 -20834 -7698 3156 13588
15027A3588j1606p890r544p456N757J683m084O287J1163Q720K2578j1382j7491
$$ 13588 1982 -5908 -15452 -22908 -17151 -15468 -19552 -13265 -2102 6618 29196 17814 323
15014C23j5155q08K017N523J1778P359N024m174j1814Q42j503r175J675j964n549
$$ 323 -14832 -15640 -13623 -8100 3678 11037 16061 11887 73 915 -588 -9763 -8088 -10052 -15601
14999a5601m331p16O645N652M573j716M344K977j0527p899j239J7506J0422j2994
$$ -15601 -19932 -20648 -14003 -8351 -3778 -5494 -1150 1827 -8700 -16599 -17838 -332 10090 -2904
14985b904J9879O492j6234Q480J7307J4159J6245K0919M6106N7520J12744K20055
$$ -2904 16975 23467 7233 15713 33020 47179 63424 84343 130449 187969 300713 520768
14973E20768K93084J4498j50501q4792n7827j12543j41593j00752n3592l1031
$$ 520768 813852 828350 677849 593057 535230 422687 281094 180342 126750 95719
14963I5719k3983j7354l196l724j7612L75j118j8808j2226J0159J3167j4812r427
$$ 95719 71736 54382 51186 47462 29850 30225 29107 10299 -1927 8232 21399 6587 -2840
14950b840m244o801J011P735K4896j5085k1370k689L225K351K848R188K07q336
$$ -2840 -7084 -13885 -12874 -5139 19757 4672 -16698 -19387 -16162 -13811 -10963 -1775 -1568 -9904
14936i904n399l391M11l634n772M661p953q772P048J7431L957R69N168O780J3014
$$ -9904 -15303 -18694 -18283 -21917 -27689 -23028 -30981 -39753 -32705 -15274 -11317 -10348 -5180 1600 14614
14921A4614j543j2064m090j1992N723J7764L722l962J275j0845j4222J044J4576
$$ 14614 13071 1007 -3083 -15075 -9352 8412 12134 8172 9447 -1398 -15620 -14576 0
14908@J731j1312K841l632P026k434j4907p094K379J4671J0850P348n025r038
$$ 0 1731 -9581 -6740 -10372 -3346 -5780 -20687 -27781 -25402 -10731 119 7467 2442 -6596
14894f596j0593m422R589R400L188o715q349j7659J059K295L103O847O957M943
$$ -6596 -17189 -21611 -12022 -2622 566 -6149 -14498 -32157 -31098 -28803 -25700 -18853 -11896 -6953
14880f953k480n325L494R265J80m888k532M456O37j2756j1233R050J9129K240
$$ -6953 -9433 -14758 -11264 -1999 -1819 -6707 -9239 -4783 -4146 -16902 -28135 -19085 44 2284
14866B284j2008p209n099q093r099n01K193k083N76J0584o479J2933J3877Q954
$$ 2284 -9724 -16933 -22032 -30125 -39224 -39725 -37532 -39615 -39039 -28455 -34934 -22001 -8124 830
14852H30m756j273J916J1820P277l923q715p90o861j8211m6K753l632j2964o246
$$ 830 -3926 -5199 -3283 8537 15814 11891 3176 2386 -4475 -22686 -22732 -19979 -23611 -36575 -42821
14837d2821K5382J8604J2436O441q675q728j6033k986M321L58J209m1j1345N092
$$ -42821 -17439 1165 13601 20042 11367 2639 -13394 -16380 -12059 -11701 -10492 -10533 -21878 -16786
14823a6786N907k221K92O344Q999O883m644j4411j4543J3639M4j6401M414o930
$$ -16786 -10879 -13100 -12808 -6464 2535 9418 4774 -9637 -24180 -10541 -10497 -26898 -22484 -29414
14809b9414m013K47L833R666n341k446l74J5809J2644O324q165K425L645k508
$$ -29414 -33427 -33180 -29347 -19681 -25022 -27468 -27842 -12033 611 6935 -1230 1195 4840 2332
14795B332j0098j077m31o066n180o649O899N237J1158O475M421R735K640p104
$$ 2332 -7766 -8843 -9274 -15340 -20520 -27169 -20270 -15033 -3875 2600 7021 16756 19396 12292
14781A2292j2293p390q863p346R069k167l372M949M036m720q48R02O254O624m059
$$ 12292 -1 -7391 -16254 -23600 -14531 -16698 -20070 -15121 -11085 -15805 -16653 -15751 -9497 -2873 -6932
14766f932O111J833r099J1670P694J991j9805n048J2394l532l548J214J3252j0439
$$ -6932 -821 1012 -8087 3583 11277 13268 -6537 -11585 809 -2723 -6271 -5057 8195 -2244
14752b244j0221r546o092J4117J2303r146n26M169J0034O308K044p842j6829k593
$$ -2244 -12465 -22011 -28103 -13986 -1683 -10829 -11355 -7186 2848 9156 11200 3358 -13471 -16064
14738a6064K068K575O977k075N292M355M876q186J860L294j641N049k274n246
$$ -16064 -13996 -11421 -4444 -6519 -1227 3128 8004 -182 1678 4972 3331 8380 6106 860
14724H60l178J940P992J0325p614r543j6429m590J5445O925P370p19k3857j2523
$$ 860 -2318 -378 7614 17939 10325 782 -15647 -20237 -4792 2133 9503 8784 -15073 -27596
14710b7596L0190J8848k509j1124J171J237P90p110J165j4299q762J228M638p125
$$ -27596 2594 21442 18933 7809 8980 10217 11007 3897 5062 -9237 -17999 -16771 -12133 -19258
14696a9258j0127p486J56q0J0749j234K247R421O974L173r479o158l648m106J2179
$$ -19258 -29385 -36871 -36715 -36795 -26046 -27280 -25033 -15612 -8638 -5465 -14944 -21102 -24750 -28856 -16677
14681a6677M41l371n540K483M48j0525k86O173M13k211N815J2482J1577J907m311
$$ -16677 -16236 -19607 -25147 -22664 -22216 -32741 -33027 -26854 -26441 -28652 -22837 -10355 1222 3129 -1182
14666a182k627K990k793j8874J80R850r749R848l86K884M304k830r679j8762p528
$$ -1182 -3809 -819 -3612 -22486 -22306 -12456 -22205 -12357 -12743 -9859 -5555 -8385 -18064 -36826 -44354
14651d4354J2739N167J3691L317o296O41k334N557k453l484Q233J1874J797m830
$$ -44354 -31615 -26448 -12757 -9440 -15736 -15095 -17429 -11872 -14325 -17809 -9576 2298 4095 -735
14637g35M798M25j2957N746J835P304Q755j9313l078K643k09K932p421J1996M033
$$ -735 4063 4488 -8469 -2723 -888 6416 15171 -4142 -7220 -4577 -4786 -1854 -9275 2721 6754
14622F754j0693m661R793p519R439J1189j5051k027L943q216K838j606M509R336
$$ 6754 -3939 -8600 1193 -6326 3113 14302 -749 -2776 1167 -7049 -4211 -5817 -1308 8028
14608H028R258P485K330r368O223r969p95j915r768L550J95m218j0645j650J0473
$$ 8028 17286 24771 27101 17733 23956 13987 13192 11277 1509 5059 5254 1036 -9609 -11259 -786
14593g86k499K157J307n331j1285r618R005j090m766Q365J2981M080N990J0593
$$ -786 -3285 -1128 179 -5152 -16437 -26055 -17050 -18140 -22906 -14541 -1560 2520 8510 19103
14579A9103p604p099r0J0670j0660p668N460R171L891p015j3937j3306M216K489
$$ 19103 11499 4400 4310 14980 4320 -3348 2112 11283 15174 8159 -5778 -19084 -14868 -12379
14565a2379L139m562r924R25K1376J0625o115j6191r996J032j1365J5031J3229
$$ -12379 -9240 -13802 -23726 -22801 -1425 9200 3085 -13106 -23102 -22070 -33435 -18404 -5175
14552e175m505L594r961l063J2866l692q777m110N766J9163K2871k1724k7179
$$ -5175 -9680 -6086 -16047 -19110 -6244 -9936 -18713 -22823 -17057 2106 24977 3253 -23926
14539b3926J1257O005J452j0718R336J4983j4902r929L273O450l430J1385k581
$$ -23926 -12669 -6664 -5212 -15930 -6594 8389 -6513 -16442 -13169 -6719 -10149 1236 -1345
14526a345q748r907M690M261L585j8674O255N462J0954J100j6452R62M158Q821
$$ -1345 -10093 -20000 -15310 -11049 -7464 -26138 -19883 -14421 -3467 -2367 -18819 -17857 -13699 -4878
14512d878p262j7256L101J04J2696k2321o254J3227N569r629o257K678K144L583
$$ -4878 -12140 -29396 -26295 -26191 -13495 -35816 -42070 -28843 -23274 -32903 -39160 -36482 -34338 -30755
14498c0755J1593J4919M909p59m275n608R18J7331j2386j5185J064q0m523m283
$$ -30755 -19162 -4243 666 -93 -4368 -9976 -9058 8273 -4113 -19298 -18234 -18314 -22837 -27120
14484b7120J354J47n48R995L426J1823l023J01J1414r719q024M464R689p832j1702
$$ -27120 -25766 -25619 -26167 -16172 -12746 -923 -3946 -3845 7569 -2150 -10174 -5710 3979 -3853 -15555
14469a5555N356O847J5617k1174j7304q106J2503K275R742o140Q361n302j0864
$$ -15555 -10199 -3352 12265 -8909 -26213 -34319 -21816 -19541 -9799 -15939 -7578 -12880 -23744
14456b3744J680L449J6805o806o947Q244J2733K387m596o899j5370k0646P059
$$ -23744 -22064 -18615 -1810 -8616 -15563 -7319 5414 7801 3205 -3694 -19064 -39710 -32651
14443c2651K7312Q931Q744N49p99q800j002p008m659k983q303Q911J3741Q767
$$ -32651 -5339 3592 12336 12885 12086 3286 2284 -4724 -9383 -12366 -20669 -11758 1983 10750
14429A0750j894q772j5524r978K30J728M550k702J3250J3986K464l285N508n62
$$ 10750 8856 84 -15440 -25418 -25188 -23460 -18910 -21612 -8362 5624 8088 4803 10311 9749
14415I749j089r349J323j354j2009J863P567N004M53o021k501O90r73R486J0793
$$ 9749 8660 -689 634 -720 -12729 -10866 -3299 1705 2158 -3863 -6364 -5674 -6647 2839 13632
14400A3632p563k031J3192K29J962j7958j2605l691J2739Q077n556m822P304N430
$$ 13632 6069 4038 17230 17459 19421 1463 -11142 -14833 -2094 5983 427 -4395 2909 8339
14386H339r50o249k112n979N592k454j489j47K584Q149j122O74J003J463J3325
$$ 8339 7389 1140 -972 -6951 -1359 -3813 -5302 -5449 -2865 5284 4162 4836 5839 7302 20627
14371B0627j8800j5597j181j0620m345J3099L834J0273M828k751O515l548L363
$$ 20627 1827 -13770 -14951 -25571 -29916 -16817 -12983 -2710 2118 -633 5882 2334 5697
14358E697p433P447L945j8675j7226J554k97l907J0842k974j6411J1374J3395
$$ 5697 -1736 5711 9656 -9019 -26245 -24691 -24988 -28895 -18053 -21027 -37438 -26064 -12669
14345a2669m077J730M65n495r660Q934J466k32j2654R449J0192R9n177N28j1913
$$ -12669 -16746 -15016 -14551 -20046 -29706 -20772 -19306 -19538 -32192 -22743 -12551 -12452 -17629 -17101 -29014
14330b9014q232N432J2021J4097J6203N92l084n561q398R254R610l983p367j7296
$$ -29014 -37246 -31814 -19793 -5696 10507 11099 8015 2454 -5944 3310 12920 8937 1570 -15726
14316a5726r991R45o982P18J265j3308Q070K1580J6345o847n710m299L195J0808
$$ -15726 -25717 -24772 -31754 -31036 -29771 -43079 -35009 -13429 2916 -3931 -9641 -13940 -10745 63
14302F3m945j3158j3776k641J0673J2924L935K050r262r896J1190K178j0883J0584
$$ 63 -4882 -18040 -31816 -34457 -23784 -10860 -6925 -4875 -14137 -24033 -12843 -10665 -21548 -10964
14288a0964P283l643J3544Q377p122L794n782n611M873J9165m390N965K372m912
$$ -10964 -3681 -7324 6220 14597 7475 11269 5487 -124 4749 23914 19524 25489 27861 22949
14274B2949J5552J1564L048J3617J5767K3006L7142M8635L8131L6332K3955K0265
$$ 22949 38501 50065 53113 66730 82497 105503 142645 191280 229411 265743 289698 309963
14262C09963L2587M4790L3794J4401N074J3827K2594L967j546j1976j4615k0633
$$ 309963 342550 387340 421134 435535 440609 454436 477030 480997 479451 467475 452860 432227
14250D32227k9545k7922l8698k1965k1083m0146m6523l1303j9885j9707k3971
$$ 432227 402682 374760 336062 314097 293014 252868 206345 175042 155157 135450 111479
14239A11479j0774P4j1148j6840j2535K983j0327j5150j0732O870j0794J621J6213
$$ 111479 100705 100779 89631 72791 60256 63239 52912 37762 27030 33900 23106 24727 40940
14226D0940J0374m065M849q86q109j5271j456o030J0469m466q222m606m626j17
$$ 40940 51314 47249 52098 51212 43103 27832 26376 20346 30815 26349 18127 13521 8895 8778
14212H778P548L078O182j463P53m21j0163j510o551m626N396N534l233j5932j5685
$$ 8778 16326 19404 25586 24123 24876 24455 14292 12782 6231 1605 7001 12535 9302 -6630 -22315
14197b2315l544P084j0488L94Q323J5535N6M86n072L334Q326R097n240j748Q630
$$ -22315 -25859 -18775 -29263 -28869 -20546 -5011 -4955 -4469 -9541 -6207 2119 11216 5976 4228 12858
14182A2858K766j264j959p822O778l995j538j2263r270j4387R459J6660n739j6500
$$ 12858 15624 14360 12401 4579 11357 7362 5824 -6439 -15709 -30096 -20637 -3977 -9716 -26216
14168b6216M27M874K874J3124j940p501K160o907M49M809Q87P08j2268l274l590
$$ -26216 -25789 -20915 -18041 -4917 -6857 -14358 -12198 -19105 -18656 -13847 -12960 -12252 -24520 -27794 -31384
14153c1384J0980O004P289L127K065r188l956Q499l766L705K941n685l112M344
$$ -31384 -20404 -14400 -7111 -3984 -1919 -11107 -15063 -6564 -10330 -6625 -3684 -9369 -12481 -8137
14139h137o037K871K681j0422J0340P22j95j2099j2501R789O843m456m662J8079
$$ -8137 -14174 -11303 -8622 -19044 -8704 -7982 -8177 -20276 -32777 -22988 -16145 -20601 -25263 -7184
14125g184N732o097r253n468k381J1148J1042K651j1306M989j202j2670l311M607
$$ -7184 -1452 -7549 -16802 -22270 -24651 -13503 -2461 190 -11116 -6127 -7329 -19999 -23310 -18703
14111a8703Q235J57k590k117n425R43L554J0299r406P447N909n90j816k688N359
$$ -18703 -10468 -10311 -12901 -15018 -20443 -19500 -15946 -5647 -15053 -7606 -1697 -2287 -4103 -6791 -1432
14096a432j012j034n315M06l407j3967k235P425J0119k685J41J349q768Q928K198
$$ -1432 -2444 -3478 -8793 -8387 -11794 -25761 -27996 -20571 -10452 -13137 -12996 -11647 -20415 -11487 -9289
14081i289M896J1204l96p578l331O00k755N629j9076L822K0616q28r073M012j3766
$$ -9289 -4393 6811 6415 -1163 -4494 -3894 -6649 -1020 -20096 -16274 4342 3514 -5559 -1547 -15313
14066a5313q217J5268M759l068j6112K286N923m96o608p816N37K689J1127K681
$$ -15313 -23530 -8262 -3503 -6571 -22683 -20397 -14474 -14970 -21578 -29394 -28857 -26168 -15041 -12360
14052a2360j5160j2921J3734P639J6604k505p04o86k682m330K703q515O93k308
$$ -12360 -27520 -40441 -26707 -19068 -2464 -4969 -5673 -6359 -9041 -13371 -10668 -19183 -18490 -20798
14038b0798N157R986o463M396r133K616J472j517o144q884J995m160o006J1377
$$ -20798 -15641 -5655 -12118 -7722 -16855 -14239 -12767 -14284 -20428 -29312 -27317 -31477 -37483 -26106
14024b6106J1276J8394Q872j2257m942n293n823R610O616P865N470l281Q871L761
$$ -26106 -14830 3564 12436 179 -4763 -10056 -15879 -6269 347 8212 13682 10401 19272 23033
14010B3033q400o9j0114n188J3006R538j474j0032R786J0723P264jp015J753J0116
$$ 23033 14633 14564 4450 -738 12268 21806 20332 10300 20086 30809 38073 38072 31057 32810 42926
13995D2926P377M770k28j1440j3492N002j1845m238o047k0294p681J4617Q843
$$ 42926 50303 55073 54845 43405 29913 34915 23070 18832 12785 -7509 -15190 -573 8270
13982H270m344n82r611j2907o55J1559J388Q300N52j448j920P057M038j0753q133
$$ 8270 3926 3344 -6267 -19174 -19829 -8270 -6882 1418 1970 522 -1398 5659 9697 -1056 -9189
13967i189r089l381Q82J2227n152n64J2963l157j0315q449K847o886n115L558
$$ -9189 -18278 -21659 -20777 -8550 -13702 -14266 -1303 -4460 -14775 -23224 -20377 -27263 -32378 -28820
13953b8820P270J2764J7907Q272j0981p999o936N038J7050N622j3394r840m274
$$ -28820 -21550 -8786 9121 17393 6412 -1587 -8523 -3485 13565 19187 5793 -4047 -8321
13940h321j580M7J3239N41J673L456j9974p328K784L767L446J0858J460o891J885
$$ -8321 -9901 -9854 3385 3926 5599 9055 -10919 -18247 -15463 -11696 -8250 2608 4068 -2823 -938
13925i38l985j353O841K091k140n251P069m2j465j7121J190J1169J2615r583k0762
$$ -938 -4923 -6276 565 2656 516 -4735 2334 2292 827 -16294 -15104 -3935 8680 -903 -21665
13910b1665m786N459J4074p6O457Q04k536R383N047p822k0341l318P327n205N905
$$ -21665 -26451 -20992 -6918 -6994 -537 267 -2269 7114 12161 4339 -16002 -19320 -11993 -17198 -11293
13895a1293k498j6558J337L851R64J3877J0518J547P728O209j398j4668j5166
$$ -11293 -13791 -30349 -29012 -25161 -24197 -10320 198 1745 9473 15682 14284 -384 -15550
13882a5550o171k64R880J7299M914l497l891l2N288J442p26O855r594j6821r005
$$ -15550 -21721 -21985 -12105 5194 10108 6611 2720 2688 7976 9418 8692 15547 5953 -10868 -19873
13867a9873J2528P753J1000n604j0266O45J3003Q595n85j0724q022N84K1370Q904
$$ -19873 -7345 408 11408 5804 -4462 -3817 9186 17781 17196 6472 -1550 -966 20404 29308
13853B9308J2114J0373L902J3647K1273J8217R029J1961K2555P484k350j45j0183
$$ 29308 41422 51795 55697 69344 90617 108834 117863 129824 152379 159863 157513 157368 147185
13840A47185j0653p858Q083j398k0114r437j1043j1395m730p186j7782n962J327
$$ 147185 136532 128674 136757 135359 115245 105808 94765 83370 78640 71454 53672 47710 49037
13827D9037j899m906m608j3670J931j0998m44J1669K271q599N05j1358j4620j554
$$ 49037 47138 42232 37624 23954 25885 14887 14443 26112 28383 19784 20289 8931 -5689 -7243
13813g243N536p625l592o727R762j95J58j401K997p094j1877N524J4843K8397
$$ -7243 -1707 -9332 -12924 -19651 -9889 -10084 -9926 -11327 -8330 -15424 -27301 -21777 -6934 21463
13799B1463n10q596j597N371j4861j47M200n225J350O514l197p949p493N328J7058
$$ 21463 20953 12357 10760 16131 1270 1123 5323 98 1448 7962 4765 -3184 -10677 -5349 11709
13784A1709J0268m857n797j820n483o470n295m384P476R51l468l778K668j2387
$$ 11709 21977 17120 11323 9503 4020 -2450 -7745 -12129 -4653 -3702 -7170 -10948 -8280 -20667
13770b0667p464M877J6242r673o616N366K737l581p758M289O588J2445j095R128
$$ -20667 -28131 -23254 -7012 -16685 -23301 -17935 -15198 -18779 -26537 -22248 -15660 -3215 -4310 4818
13756D818J62j0232J875O247N485o749p674L153P832m973M277J991K1p757j0325
$$ 4818 4980 -5252 -3377 2870 8355 1606 -6068 -2915 4917 -56 4221 6212 6233 -1524 -11849
13741a1849m466k0337M831R428q679L756N115O098m09o32O709J0583L358n398
$$ -11849 -16315 -36652 -31821 -22393 -31072 -27316 -22201 -16103 -16512 -17144 -10435 148 3506 -1892
13727a892j2410J0200M438L37N915j3868p620J1809J719j066p365j055N683R236
$$ -1892 -14302 -4102 336 673 6588 -7280 -14900 -3091 -1372 -2438 -9803 -10858 -5175 4061
13713D061o020L442j1846Q115J4750l079r5k470J642j1058J5113M256r570N399
$$ 4061 -1959 1483 -10363 -2248 12502 9423 9328 6858 8500 -2558 12555 16811 7241 12640
13699A2640L546P433P817n105P196j884o701j2259r593o777M601L053M064O30
$$ 12640 16186 23619 31436 26331 33527 31643 24942 12683 3090 -3687 914 3967 8031 8661
13685H661p255o803K52M72J2958K3787J1983p190j4259n3j0272k772J1898L229
$$ 8661 1406 -5397 -5145 -4673 8285 32072 44055 36865 22606 22553 12281 9509 21407 24636
13671B4636j270o85J560J2327j2428N735J2434J276j47K83K929J4056j181k470
$$ 24636 23366 22681 24241 36568 24140 29875 42309 43585 43438 43721 46650 60706 59525 57055
13657E7055J490l117j180j2402J573Q518L021M013P586m863p032j2918o842j1115
$$ 57055 58545 55428 54248 41846 43419 51937 54958 58971 66557 61694 54662 41744 34902 23787
13643B3787r869J937r230M829K986p339o387j3152J0704J3014K280M837M971m056
$$ 23787 13918 15855 6625 11454 14440 7101 714 -12438 -1734 11280 13560 18397 23368 19312
13629A9312m730j975j0467L03P063j535j6860j1727K3067P678j2641Q767M775
$$ 19312 14582 12607 2140 2443 9506 7971 -8889 -20616 2451 10129 -2512 6255 11030
13616A1030l059M638j1971J2544J6134J30r844p514q404m434N336n031q466j0633
$$ 11030 7971 12609 638 13182 29316 29446 19602 12088 3684 -750 4586 -445 -8911 -19544
13602a9544J0046K05Q458r141l776j984P483J5046J7635R080k872p334o194L758
$$ -19544 -9498 -9293 -835 -9976 -13752 -15736 -8253 6793 24428 33508 30636 23302 17108 20866
13588B0866o617o443P704N267m216r373n850L262k117j40M39J7665O840o920q412
$$ 20866 14249 7806 15510 20777 16561 7188 1338 4600 2483 2343 2782 20447 27287 20367 11955
13573A1955k518j0855J473J0429j88o48j1310O12n94J330l041p425P016N528M528
$$ 11955 9437 -1418 55 10484 10296 9648 -1662 -1050 -1644 -314 -3355 -10780 -3764 1764 6292
13558F292J084L494j2837N888Q753L743k556R068J1082J6472n941m369m05R924
$$ 6292 7376 10870 -1967 3921 12674 16417 13861 22929 34011 50483 44542 40173 39768 49692
13544D9692L378j1186j74L562l045m915k328L954n741j665j3634l058N815J4989
$$ 49692 53070 41884 41710 45272 42227 37312 34984 38938 33197 31532 17898 14840 20655 35644
13530C5644m9k0338k025j2901J906q299P715J8343O655n687j8626k761l528M776
$$ 35644 35595 15257 13232 331 2237 -6062 1653 19996 26651 20964 2338 -423 -3951 825
13516H25Q893J2726N714k498q181J2173Q593m525J4779J3187L54j9959q132j9399
$$ 825 9718 22444 28158 25660 17479 29652 38245 33720 48499 61686 62040 42081 33949 14550
13502A4550j3727L73m882Q581J0270K775J4448j478m913K871J015O277o604j880
$$ 14550 823 1196 -3686 4895 15165 17940 32388 30910 25997 28868 29883 36160 29556 27676
13488B7676M572j0607q731O546j6039j6007j0539Q886l408L418L944J5054J5506
$$ 27676 32248 21641 12910 19456 3417 -12590 -23129 -14243 -17651 -14233 -10289 4765 20271
13475B0271j409j3585J150N661M436m761j9166k2637N913l998P085J3346o213
$$ 20271 18862 5277 6427 12088 16524 11763 -7403 -30040 -24127 -28125 -21040 -7694 -13907
13462a3907j3756M25J5760J3529m162l332N899M178N98j105P270P183J850J3616
$$ -13907 -27663 -27238 -11478 2051 -2111 -5443 456 4634 5232 4127 11397 18580 20430 34046
13448C4046k461J376J1302P991j2332n728r453n597k638n144l465k450M664n961
$$ 34046 31585 32961 44263 52254 39922 34194 24741 19144 16506 11362 7897 5447 10111 4150
13434D150R178J8619k381o01j4485q338J640k074j335j33L260J5204J2868j0316
$$ 4150 13328 31947 29566 28965 14480 6142 7782 5708 4373 4240 7500 22704 35572 25256
13420B5256j7356m037r573K784P381r714o570l16J0789K523Q22p637j4701k344
$$ 25256 7900 3863 -5710 -2926 4455 -5259 -11829 -12145 -1356 1167 1989 -5648 -20349 -22693
13406b2693J5J7080L464j90l22N735o19j0976o034Q905J4133P42j0212M148P792
$$ -22693 -22678 -5598 -2134 -2324 -2646 3089 2470 -8506 -14540 -5635 8498 9240 -972 3176 10968
13391A0968L339n099l876J199K1596P881r432j2942p648O654J4872K6377K6301
$$ 10968 14307 9208 5332 6531 28127 36008 26576 13634 5986 12640 27512 53889 80190
13378H0190J8147J4271j0135j4274q851n9j0883k7049k1667o806P186j0736J3902
$$ 80190 98337 112608 102473 88199 79348 79289 68406 41357 19690 12884 20070 9334 23236
13365B3236J804k20p787j9279q26k215j0423L338r063N407N0o962N89m566r92
$$ 23236 25040 24820 17033 -2246 -3072 -5287 -15710 -12372 -21435 -16028 -15978 -22940 -22351 -26917 -27909
13350b7909R453k707K10J0655J1827N586p713J263J4792J315j3027j2964l413
$$ -27909 -18456 -21163 -20953 -10298 1529 7115 -598 665 15457 16772 3745 -9219 -12632
13337a2632J101j0702O497L24K407P541k78j58n349j272j2131n182J1853J9565
$$ -12632 -11531 -22233 -15736 -15412 -13005 -5464 -5742 -5900 -11249 -12521 -24652 -29834 -17981 1584
13323A584P223m506j1163j4948l598K5385N281N638J826O010l217k301l020K786
$$ 1584 8807 4301 -6862 -21810 -25408 -23 5258 10896 12722 18732 15515 13214 10194 12980
13309A2980n179J4604K3241R641j8402M834K3408q779o906K774j7046K950P839
$$ 12980 7801 22405 45646 55287 36885 41719 65127 56348 49442 52216 35170 38120 45959
13296D5959R337j7377k2584l930q05L49K889M53L876j7408j1747K881O837O309
$$ 45959 55296 37919 15335 11405 10600 10949 13838 14291 18167 759 -10988 -8107 -1270 5039
13282E039L706J1053P278o383j7891m441J1742p195j5967N358J951r355J5M012
$$ 5039 8745 19798 27076 20693 2802 -1639 10103 2908 -13059 -7701 -5750 -15105 -15090 -11078
13268a1078j724k468M514J0220P671j932p189N822J4262o440P271n654j2393K083
$$ -11078 -12802 -15270 -10756 -536 7135 5203 -1986 3836 18098 11658 18929 13275 882 2965
13254B965M310j1960j056J099J2652J7428j0608k034P865O952n732J0649O076
$$ 2965 7275 -4685 -5741 -4642 8010 25438 14830 12796 20661 27613 21881 32530 38606
13241C8606N190o140j8374K071N876j7440j3135j80J0858Q149K568k787l382Q938
$$ 38606 43796 37656 19282 21353 27229 9789 -3346 -3526 7332 15481 18049 15262 11880 20818
13227B0818o931J1026j658n597Q946J7432M894J293Q234m667j6113r539K467J3960
$$ 20818 13887 24913 23255 17658 26604 44036 48930 50223 58457 53790 37677 28138 30605 44565
13213D4565P089r141l962j425p500j0502r869l444M237j428r95J496O942q731
$$ 44565 51654 42513 38551 37126 29626 19124 9255 5811 10048 8620 7625 9121 16063 7332
13199G332k0114j4038Q67P92N166J0305J0704J950L1237J6899J2476J225p551
$$ 7332 -12782 -26820 -25953 -25161 -19995 -9690 1014 2964 34201 51100 63576 64801 57250
13186E7250P589n793j1922K533O171q986J3112K1336L0092J5350m049J5932J8333
$$ 57250 64839 59046 47124 49657 55828 46842 59954 81290 111382 126732 122683 138615 156948
13173A56948M042m608K0567K0305J2198L7159P7217J03668J32078J42033J70487
$$ 156948 160990 156382 176949 197254 209452 246611 323828 427496 559574 701607 872094
13162H72094J76031J67528J65304J16651M4774o826m8581p6434j17802j54229
$$ 872094 1048125 1215653 1380957 1497608 1542382 1535556 1486975 1410541 1292739 1138510
13152A138510j74344j48964j40062j30763j07587o0557m3107k3295j0755l4740
$$ 1138510 964166 815202 675140 544377 436790 376233 333126 309831 299076 264336
13142B64336j0823P494J1175k4323j9457k6256l8525j6728j8514j4750j4018j1559
$$ 264336 253513 261007 272182 247859 228402 202146 163621 146893 128379 113629 99611 88052
13130H8052q906o922P666L250K153k2944j5356J5741O342o975k104P897J9424
$$ 88052 79146 72224 79890 83140 85293 62349 46993 62734 69076 62101 59997 67894 87318
13117H7318J904n587K093K1775J3937J943N434K1800Q747l693k354J8877R666
$$ 87318 89222 83635 85728 107503 121440 123383 128817 150617 159364 155671 153317 172194 181860
13104A81860R670Q477Q179O070K2066L7822K3966J8646M6542O6957J04114J31558
$$ 181860 191530 200007 208186 214256 236322 274144 298110 316756 363298 430255 534369 665927
13092F65927J53629K15586K95836M06628N23765O15095O08641N14210L37593R6986
$$ 665927 819556 1035142 1330978 1737606 2261371 2876466 3485107 3999317 4336910 4433896
13082D433896j44072l44050m64642n36675n17589m65160l96194l21094k47050
$$ 4433896 4289824 3945774 3481132 2944457 2426868 1961708 1565514 1244420 997370
13073I97370j87086j54848j27456q0919n1925m4132l8524l7791j9593j9844k0420
$$ 997370 810284 655436 527980 447061 395136 351004 312480 274689 255096 235252 214832
13062B14832q654j8110j5547j6552p924M096n762j4031m637j956m33K575k375
$$ 214832 206178 188068 172521 155969 148045 152141 146379 132348 127711 125755 125322 127897 125522
13049A25522o756O231o675o437k068n617j8782j5602P925P601K2294R803O358
$$ 125522 118766 124997 118322 111885 109817 104200 85418 69816 77741 85342 107636 117439 123797
13036A23797Q972P887J7466J7787K6018L1668L1505L4849N2934O4480Q9608J12873
$$ 123797 132769 140656 158122 175909 201927 233595 265100 299949 352883 417363 506971 619844
13024F19844J58281K04935K10289J94138J39941M9559m6476j28748j68152j79300
$$ 619844 778125 983060 1193349 1387487 1527428 1576987 1530511 1401763 1233611 1054311
13014A054311j78228j73198j34858j07829q9921o6510m7179k6088k2475j3636
$$ 1054311 876083 702885 568027 460198 370277 303767 256588 230500 208025 194389
13004A94389j4223k0452j5040j527O775P790j766K092R091J2730J1665m663M749
$$ 194389 180166 159714 144674 143147 149922 157712 155946 158038 167129 179859 191524 186861 191610
12991A91610J3005J614M389q043N519O119M514j4582q370K628l577k0082j7664
$$ 191610 204615 206229 210618 202575 208094 214213 218727 204145 195775 198403 194826 174744 157080
12978A57080q395l789n461j7260j2950j7136o234P024j649N619K805rn302p854
$$ 157080 148685 144896 139435 122175 109225 92089 85855 92879 91230 96849 99654 99645 94343 86489
12964H6489m180j8444j5198k529k504n787J856j9024j2413J2768J5141m10r832
$$ 86489 82309 63865 48667 46138 43634 37847 39703 20679 8266 21034 36175 35765 25933
12951B5933n147R619M572L969m498Q623J6241M566j567J7407n508j0982j2228
$$ 25933 20786 30405 34977 38946 34448 43071 59312 63878 62311 79718 74210 63228 51000
12938E1000k789O735J5179L240p694n091q576k7005j3887M65p038j4421Q3O245
$$ 51000 48211 54946 70125 73365 65671 60580 52004 24999 11112 11577 4539 -9882 -9799 -3554
12924c554Q907J2965n675M084K1160O929q516N189O453j502J1949M378j099J4579
$$ -3554 5353 18318 12643 16727 37887 44816 36300 41489 47942 46440 58389 62767 61668 76247
12910G6247J9379K2144M677m532n117p063J4199R122j6654L484N773j2068O575
$$ 76247 95626 117770 122447 117915 112798 105735 119934 129056 112402 115886 121659 109591 116166
12897A16166j999L632Q308R178P755M251N101P308j3938k8000M79Q72n015r553
$$ 116166 114167 117799 126107 135285 143040 147291 152392 159700 145762 117762 118241 119113 114098 104545
12883A04545Q614K5197L1836J9317Q543K5434M4717K3340J7180K1372K5414L6443
$$ 104545 113159 138356 170192 189509 198052 223486 268203 291543 308723 330095 355509 391952
12871C91952L7195M4618M3466K6932J7783J4945L195m3015n3242l4134o2661p3970
$$ 391952 429147 473765 517231 544163 561946 576891 580086 537071 483829 449695 387034 313064
12859C13064n6306n1174p1485n7764k6100j9872o544L060j4719l514J8649N292
$$ 313064 256758 205584 134099 76335 50235 30363 23819 26879 12160 8646 27295 32587
12847C2587J1673J5242M280M884R848J6643K4803J0452m59R044p285K476J813
$$ 32587 44260 59502 63782 68666 78514 95157 119960 130412 129953 138997 131712 134188 136001
12834A36001j0488p03J3062J4441J6597J0677J4410J7793K5822K5285J0623J1764
$$ 136001 125513 124810 137872 152313 168910 179587 193997 211790 237612 262897 273520 285284
12822B85284O568K0394Q124L0421J8466K669J1806J2377L672J9011K760r833n93
$$ 285284 291852 312246 320370 350791 369257 371926 383732 396109 399781 418792 421552 411719 411126
12809D11126K2393Q788N305J3179J4488J6015K0252J2705K9333J3126J4015J4574
$$ 411126 433519 442307 447612 460791 475279 491294 511546 524251 553584 566710 580725 595299
12797E95299K5242K8783L7131K5686M2796L7268M4038N0591M7294L6860M6157
$$ 595299 620541 649324 686455 712141 754937 792205 836243 886834 934128 970988 1017145
12786A017145L9400L5500L6665L6533L3498L2945K8705L1972O0070P6674Q4912
$$ 1017145 1056545 1092045 1128710 1165243 1198741 1231686 1260391 1292363 1352433 1429107 1514019
12775A514019R2304J18400J25610J42596J55952J75071J74402J93707J99563K19878
$$ 1514019 1606323 1724723 1850333 1992929 2148881 2323952 2498354 2692061 2891624 3111502
12765C111502K17084K33336K61104K80176L30930L88754M79295N68045O96209
$$ 3111502 3328586 3561922 3823026 4103202 4434132 4822886 5302181 5870226 6566435
12756F566435Q50970J074881J346991J656720J950250K193731K424804K698575
$$ 6566435 7417405 8492286 9839277 11495997 13446247 15639978 18064782 20763357
12748B0763357L099881L750462M745742O376734R286047J4060172J9987521K5007972
$$ 20763357 23863238 27613700 32359442 38736176 48022223 62082395 82069916 107077888
12740A07077888K8882594L1349150L2189077L0885652K6364053J8397184O943458
$$ 107077888 135960482 167309632 199498709 230384361 256748414 275145598 282089056
12733B82089056l434374j2721493k0071352k6268813l0114937l1489933k9922786
$$ 282089056 278654682 265933189 245861837 219593024 189478087 157988154 128065368
12726A28065368k5671936k0918739j6584326j2751641r323778o640505m853453
$$ 128065368 102393432 81474693 64890367 52138726 42814948 36174443 31320990
12719C1320990l733030l024589k579833k250072k017912j818394j631538j434121
$$ 31320990 27587960 24563371 21983538 19733466 17715554 15897160 14265622 12831501
12711A2831501j253263j085624r49925q24619p25013o38854n60962n01807m38846
$$ 12831501 11578238 10492614 9542689 8718070 7993057 7354203 6793241 6291434 5852588
12702E852588l87289l51863k92745k60930k52584k16353j93872j76115j49376
$$ 5852588 5465299 5113436 4820691 4559761 4307177 4090824 3896952 3720837 3571461
12693C571461j39098j30532j19862j19688j22467j21962p7494k7681k5356p7410
$$ 3571461 3432363 3301831 3181969 3062281 2939814 2817852 2740358 2712677 2687321 2609911
12683B609911j43090j16845j09902j22576j26241j20521j18368o8792n7404p1060
$$ 2609911 2466821 2349976 2240074 2117498 1991257 1870736 1752368 1683576 1626172 1555112
12673A555112o9729m1346l6561m5019m0815k7914l6799l8565m8765k4323l5590
$$ 1555112 1485383 1444037 1407476 1362457 1321642 1293728 1256929 1218364 1169599 1145276 1109686
12662A109686l5532k8050l4168l0848j8472m466m208J038L555K5317N2842N6785
$$ 1109686 1074154 1046104 1011936 981088 962616 958150 953942 954980 958535 983852 1036694 1093479
12650A093479O5455L8338J8005J0616k1588m0590n6585n6213n2342m8814m4804
$$ 1093479 1158934 1197272 1215277 1225893 1204305 1163715 1107130 1050917 998575 949761 904957
12639I04957m6886l1863l1165l7116l5526L302n976l6853l4260j906Q941P170
$$ 904957 858071 826208 795043 757927 722401 725703 719727 682874 648614 646708 655649 662819
12627F62819j18k649k275n27R577R052L125P996J7349K2837L0898N0640O1551
$$ 662819 662701 660052 657777 657250 666827 675879 679004 687000 704349 727186 758084 808724 870275
12614H70275Q3413O4099j6160n8701m8503o7893p8363r0279r8725r3615q2221
$$ 870275 953688 1017787 1001627 942926 894423 826530 748167 657888 559163 465548 383327
12603C83327n9276m2376k6448k7419j8617j3547p182m466j925n33J7749L7712
$$ 383327 324051 281675 255227 227808 209191 195644 188462 183996 182071 181538 199287 236999
12591B36999L0037J0147O301J6459O691K1216K1919J4198L3802N2000O4237K4439
$$ 236999 267036 277183 283484 299943 306634 327850 349769 363967 397769 449769 514006 538445
12579E38445j4835j5106j271J651j5119j5660k7808n4631k4608n664k3791k1622
$$ 538445 523610 508504 507233 508884 493765 478105 450297 395666 371058 365394 341603 319981
12567C19981k007K3687Q745L014J5824J316J7018J9559O506P782J5082J3742K5280
$$ 319981 317974 341661 350406 353420 369244 370560 387578 407137 413643 421425 436507 450249 475529
12554D75529L0017J327L671J9560J1304R492L322R865J8708L2850L8981K3038
$$ 475529 505546 506873 510544 530104 541408 550900 554222 564087 582795 615645 654626 677664
12542F77664K9125M2991P0728J38749R3182m1520p1691n2909m3459q1435p6080
$$ 677664 706789 749780 820508 959257 1052439 1010919 939228 886319 842860 761425 685345
12531F85345o6535m4608l1435l8773k4378j1217K291Q061K1287M709j0375j4241
$$ 685345 618810 574202 542767 503994 479616 468399 470690 478751 500038 504747 494372 480131
12519D80131j3889p745Q0q869j3107n866J4649R833K020o063k2243j5654k1730
$$ 480131 466242 458497 458577 449708 436601 430735 445384 455217 457237 451174 428931 413277 391547
12506C91547j2132m574L352J8990J5433m679j2510N307L4327L5222J6048k3981
$$ 391547 379415 374841 378193 397183 412616 407937 395427 400734 435061 470283 486331 462350
12494D62350l8647k9889l3001l8547k6716j9677j0036L714k565r338j1925j2990
$$ 462350 423703 393814 360813 322266 295550 275873 265837 269551 266986 257648 245723 232733
12482B32733r496k910m209q037j0801n596o397j84J5649J6065m478M66r604r847
$$ 232733 223237 220327 216118 208081 197280 191684 185287 185103 200752 216817 212339 212805 203201 193354
12468A93354j727j9063N653N912r448j6068j4867M326j045j1636N402J4351k358
$$ 193354 191627 172564 178217 184129 174681 158613 143746 148072 147027 135391 140793 155144 152786
12455A52786j2726r379j1812P46Q080J7320K24j1308j3240o154L369k224O812
$$ 152786 140060 130681 118869 119615 127695 145015 145239 133931 120691 114537 117906 115682 122494
12442A22494r450O210J4925j840o136J955J1183J1181O517J6426k203L921L996
$$ 122494 113044 119254 134179 132339 126203 128158 139341 150522 157039 173465 171262 175183 179179
12429A79179j743m860J3164K2186Q792J9727P691O465J0441K4750L8256N0426
$$ 179179 177436 172576 185740 207926 216718 236445 244136 250601 261042 285792 324048 374474
12417C74474R8687J25315J29618M8826k4723m9480m1294o4843o6167m5324k3353
$$ 374474 473161 598476 728094 776920 752197 702717 661423 596580 530413 485089 461736
12406D61736k3326j1043K508J4887K5619K9374R080j0454Q919L2394K5310J2532
$$ 461736 438410 427367 429875 444762 470381 499755 508835 498381 507300 539694 565004 577536
12394E77536K3552L2139J4487J0035L565j505j3728l049J3406K3809L1150N8793
$$ 577536 601088 633227 647714 657749 661314 659809 646081 643032 656438 680247 711397 770190
12382G70190R7716J61880K17150K02119J37221N9376j8075r4015j51246j64594
$$ 770190 867906 1029786 1246936 1449055 1586276 1645652 1627577 1533562 1382316 1217722
12372A217722j44421j43671j14724r5579n3870k5223n004J6578K2090J1581q653
$$ 1217722 1073301 929630 814906 719327 665457 640234 635230 651808 673898 685479 676826
12361F76826k6090m7239m3429k3363j2246N451q68k6950k7935q172j9022j9968
$$ 676826 650736 603497 560068 536705 524459 529910 529042 502092 474157 465985 446963 426995
12349D26995j2315k761q29K0790M1732Q0555J04414J06184N1044j4062o2918p6132
$$ 426995 414680 411919 411090 431880 473612 554167 658581 764765 815809 801747 738829 662697
12337F62697r7998r8737q4968o0775m8863l2757j2458j7158k9693k169L367M330
$$ 662697 564699 465962 380994 320219 271356 238599 226141 208983 179290 177121 180488 184818
12325A84818R373m123p680R338J162R231J7673K7949K9594J6550L2865O0790O6212
$$ 184818 194191 190068 182388 191726 192888 202119 219792 247741 277335 293885 326750 387540 453752
12312D53752J02926J14478J37821J95481J87049J65266J41436J00870M4951l9775
$$ 453752 556678 671156 808977 1004458 1191507 1356773 1498209 1599079 1644030 1604255
12302A604255o4858q4139j30411j64017j89454j82020j54165j34748j00909p2805
$$ 1604255 1539397 1455258 1324847 1160830 971376 789356 635191 500443 399534 326729
12292C26729m2180j9401k4182j9616p549k3126j5710q944l118L089j7090K124
$$ 326729 284549 265148 240966 221350 213801 190675 174965 166021 162903 165992 148902 151026
12280A51026O165q532l141O295J566j167k200n582o362J912K216q387q240l610
$$ 151026 157191 148659 145518 151813 153379 152212 150012 144430 138068 139980 142196 133809 125569 121959
12266A21959l6n258p247k2279k2479J3304J7374K193j6625j8751n170n649J957
$$ 121959 121923 116665 109418 87139 64660 77964 95338 97531 80906 62155 56985 51336 53293
12253E3293n283j7674M370J7112J527j7352l989J0747Q888L744p259P29J1650
$$ 53293 48010 30336 34706 51818 53345 35993 32004 42751 51639 55383 48124 48853 60503
12240F0503J0124R74r045l082j7189K334J9903J3245m258m973j1255r449n031
$$ 60503 70627 71601 62556 59474 42285 44619 64522 77767 73509 68536 57281 47832 42801
12227D2801n1J5640Q241L300j914j1258j109N917p844j1001J613M944N734o765
$$ 42801 42750 58390 66631 69931 68017 56759 55650 61567 53723 42722 44335 49279 55013 48248
12213D8248j8726l651j055J6660J921N807K246m097J559j2627M296Q004l155P993
$$ 48248 29522 25871 24816 41476 43397 49204 51450 47353 48912 36285 40581 48585 45430 53423
12199E3423p90q988q024K853L975j6446m720N610K465k23p91l00k295K207N83
$$ 53423 52633 43645 35621 38474 42449 26003 21283 26893 29358 29135 28344 28044 25749 27956 28539
12184B8539M928q506l616J1228K1779L378j0014q306l214k78j2074P426J533P934
$$ 28539 33467 24961 21345 32573 54352 57730 47716 39410 36196 35918 23844 31270 32803 40737
12170D0737Ol601j5475j181j663R479J476p323l070j1520J6184M167P206O921
$$ 40737 40743 37142 21667 20486 18823 28302 29778 22455 19385 7865 24049 28216 35422 42343
12156D2343J492N857R136n599j8294j2183o336K365m654l949L268R799l674K137
$$ 42343 43835 49692 58828 53229 34935 22752 16416 18781 14127 10178 13446 23245 19571 21708
12142B1708M692J3265o13q408j8253P626R744P071m805m215j6914q859q99J6320
$$ 21708 26400 39665 39052 30644 12391 20017 29761 36832 32027 27812 10898 2039 1140 17460
12128A7460J3018M438j680j2340j3221k576K162O153r630p000p264m262J0759
$$ 17460 30478 34916 33236 20896 7675 5099 7261 13414 3784 -3216 -10480 -14742 -3983
12115c983J0275m587O052R402j001q164l87m798J8902K3888p276j0458j6037l556
$$ -3983 6292 1705 7757 17159 16158 7994 7607 2809 21711 45599 38323 27865 11828 8272
12101H272J277J4645N647n741j636k104J565L249n286k779o442l895j803Q055
$$ 8272 9549 24194 29841 24100 22464 20360 21925 25174 19888 17109 10667 6772 4969 13024
12087A3024l136q015J6096J6039o384j1108q328N090R694j921k199K534j5418
$$ 13024 9888 1873 17969 34008 27624 16516 8188 13278 22972 21051 18852 21386 5968
12074E968n450P210M52N176N043N498j264m639N546n438j1054N988P168j0923
$$ 5968 518 7728 8180 13356 18399 23897 22633 17994 23540 18102 7048 13036 20204 9281
12060I281N567m354P006P619q177M553J1499k017N3O223k149M422q064q364k12
$$ 9281 14848 10494 17500 25119 16942 21495 32994 30977 31030 37253 35104 39526 31462 23098 22886
12045B2886p465o67l386o11r556k553J8208L258J072n723J0272J3721N45l886
$$ 22886 15421 14754 11368 10757 1201 -1352 16856 20114 21186 15463 25735 39456 40001 36115
12031C6115N523j712n191r375k8656M342N022j99M081n080n439O965K661L323
$$ 36115 41638 39926 34735 25360 -3296 1046 6068 5869 9950 4870 -569 6396 9057 12380
12017A2380r048j5971J6092K2747j2318p441K50n888J0004O863N781m38J924M186
$$ 12380 3332 -12639 3453 26200 13882 6441 6691 803 10807 17670 23451 23013 24937 29123
12003B9123l620m651j1339j3286k989J8683O249k309l336J782M38J0905M292j6788
$$ 29123 25503 20852 9513 -3773 -6762 11921 18170 15861 12525 14307 14745 25650 29942 13154
11989A3154Q086m53n87r759L48L216M270j2674r205L15P2m039j4463j1084O167
$$ 13154 21240 20787 20200 10441 10789 14005 18275 5601 -3604 -3289 -3217 -7256 -21719 -32803 -26636
11974b6636K724J346M71J1656J7082R828K07Q676m185n991j6705o760J5884K756
$$ -26636 -23912 -22566 -22095 -10439 6643 16471 16678 25354 21169 15178 -1527 -8287 7597 10353
11960A0353J3621J0290p746j9387N51K548r494L58q064M890P927Q360K666O026
$$ 10353 23974 34264 26518 7131 7682 10230 736 1094 -6970 -2080 5847 14207 16873 22899
11946B2899j792K638j0105J69K8n1N084L230p826o905n605m862n705J4814J3337
$$ 22899 21107 23745 13640 13809 13837 13786 18870 22100 14274 7369 1764 -3098 -8803 6011 19348
11931A9348k000l303o422J393l346K050m567p950J5161Q827K927j0371P625J4617
$$ 19348 17348 14045 7623 9016 5670 7720 3153 -4797 10364 19191 22118 11747 19372 33989
11917C3989j3309j2774L054L358K169P688K3191K949m713j9875m264J0773j4418
$$ 33989 20680 7906 10960 14318 16487 24175 47366 50315 45602 25727 21463 32236 17818
11904A7818j6189j112J0057M292q545p07J2254J927m577M516K411P458j482P005
$$ 17818 1629 517 10574 14866 6321 5614 17868 19795 15218 19734 22145 29603 28121 35126
11890C5126J860r902j0914p007J3938J3387o771j2980j5682O85J4307o554J904
$$ 35126 36986 27084 16170 9163 23101 36488 29717 16737 1055 1740 16047 9493 11397
11877A1397o80j9116q052M27Q726J679L164r036r210M471P25K013J6749K9793
$$ 11397 10717 -8399 -16451 -16024 -7298 -5619 -2455 -11491 -20701 -16230 -15505 -13492 3257 33050
11863C3050o738o818r205o785j3976j1249K589P648J2494L5k479m26k455P02o148
$$ 33050 26312 19494 10289 3504 -10472 -21721 -19132 -11484 1010 1045 -1434 -1860 -4315 -3613 -9761
11848i761J3795J3191j0679o726n315m421p140J1654J5538K946m298k669j404
$$ -9761 4034 17225 6546 -180 -5495 -9916 -17056 -5402 10136 13082 8784 6115 4711
11835D711Q524N231l24j1165L185j2086j4009k374k05J525P806m744J0097R533
$$ 4711 13235 18466 18142 6977 10162 -1924 -15933 -18307 -18512 -16987 -9181 -13925 -3828 5705
11821E705O905K876K43J721j0726q965J2554J1564j0979n276m052j9890j5431
$$ 5705 12610 15486 15729 17450 6724 -2241 10313 21877 10898 5622 1570 -18320 -33751
11808c3751Q627J323R557J4619k100k672L062m779O384J2106K932o689j4045P390
$$ -33751 -25124 -23801 -14244 375 -1725 -4397 -1335 -6114 270 12376 15308 8619 -5426 1964
11794A964o526n641j586j643M018J3967N504k428j4553r541J4631L78p754l317
$$ 1964 -4562 -10203 -11789 -13432 -9414 4553 10057 7629 -6924 -16465 -1834 -1456 -9210 -12527
11780a2527j1074R074J0280J2131j5208j7373j1372J4778J3776L505j1058j1321
$$ -12527 -23601 -14527 -4247 7884 -7324 -24697 -36069 -21291 -7515 -4010 -15068 -26389
11768b6389Q56R019N056j0820N546J0076n264J4031k883q45O107N446m083j6977
$$ -26389 -25533 -16514 -11458 -22278 -16732 -6656 -11920 2111 -772 -1617 4490 9936 5853 -11124
11754a1124j3710J6255J9740m44j2570r331M694n184K152J5062j158l751k1209
$$ -11124 -24834 -8579 11161 10717 -1853 -11184 -6490 -11674 -9522 5540 4382 631 -20578
11741b0578Q943K3667j4129j8625O85l287J4887M235k069N74j675l827J016O082
$$ -20578 -11635 12032 -2097 -20722 -20037 -23324 -8437 -4202 -6271 -5697 -7372 -11199 -10183 -4101
11727d101L070r414J177J0140m955R841K190q68p48p743o200j2848L6J5533N360
$$ -4101 -1031 -10445 -9268 872 -4083 5758 7948 7080 6332 -1411 -7611 -20459 -20423 -4890 470
11712D70J626j540M438o121p45N881q588o907J9204n562o482P651r91L541j7120
$$ 470 2096 556 4994 -1127 -1872 4009 -4579 -11486 7718 2156 -4326 3325 2334 5875 -11245
11697a1245j563R328n995J0506J5744P842J977j4461m480L71M810n963j245Q681
$$ -11245 -12808 -3480 -9475 1031 16775 24617 26594 12133 7653 8024 12834 6871 5626 14307
11683A4307m151L814q954j2308q200J0690J3390J942n045j0076J986L681L033
$$ 14307 10156 13970 5016 -7292 -15492 -4802 8588 10530 5485 -4591 -2605 1076 4109
11670D109m39j164l790q763R531Q540N824O086j1288j551Q234p331P915J3728
$$ 4109 3670 2506 -1284 -10047 -516 8024 13848 19934 8646 7095 15329 7998 15913 29641
11656B9641o067R43J3011p191n754p858N453q891n492k479j0697l151Q607p659
$$ 29641 23574 24517 37528 30337 24583 16725 22178 13287 7795 5316 -5381 -8532 75 -7584
11642g584o642J6221J1996p821o160J302J1458N490r794q989P359q063j5076J0590
$$ -7584 -14226 1995 13991 6170 10 1312 12770 18260 8466 -523 6836 -1227 -16303 -5713
11628e713J0810K389n051L102M03M310O364N59K019n325j7918o255J0012p426
$$ -5713 5097 7486 2435 5537 5940 10250 16614 17173 19192 13867 -4051 -10306 -294 -7720
11614g720L610n428J132p395o59J678Q990M164k477j1799J1077K2651J0983p984
$$ -7720 -4110 -9538 -8406 -15801 -16460 -14782 -5792 -1628 -4105 -15904 -4827 17824 28807 20823
11600B0823j2156O974R948P123l933q894j0332m713m895M669j7801K793J9163
$$ 20823 8667 15641 25589 32712 28779 19885 9553 4840 -55 4614 -13187 -10394 8769
11587H769m176k274l937n483J2907Q929p621j0710m767j4815k958P378L711P023
$$ 8769 4593 2319 -1618 -7101 5806 14735 7114 -3596 -8363 -23178 -26136 -18758 -15047 -8024
11573h024k057R127J0618k805P74N781m21p585r850M499P368L777Q515J340k0993
$$ -8024 -10081 -954 9664 6859 7633 13414 12993 5408 -4442 57 7425 11202 19717 21057 64
11558F4L337K369j6897j1634J3120P12j662Q325R272m635m420O59l0j432p903
$$ 64 3401 5770 -11127 -22761 -9641 -8929 -10591 -2266 7006 2371 -2049 -1390 -1420 -2852 -10755
11543a0755m753K367l306M892J4598M352m872j6594J739P989J15o317J2787q796
$$ -10755 -15508 -13141 -16447 -11555 3043 7395 2523 -14071 -12332 -4343 -4228 -10545 2242 -6554
11529f554M469L213p336n861K4045N764k306Q695Q19q19j1473o163j055j746r389
$$ -6554 -2085 1128 -6208 -12069 11976 17740 15434 24129 24948 24129 12656 6493 5438 3692 -5697
11514e697n340J302J9177K342j0139j1331j090j862l098J2428P150o85J3163K3930
$$ -5697 -11037 -9735 9442 11784 1645 -9686 -10776 -12638 -15736 -3308 3842 3157 16320 40250
11500D0250j190j2885j6153p246j2990k527R625K2979J9799p895k0497j3413j5497
$$ 40250 39060 26175 10022 2776 -10214 -12741 -3116 19863 39662 31767 11270 -2143 -17640
11487a7640o329J0524N158j1848L154q94K597K0763J0163r851j8743r063J1899
$$ -17640 -23969 -13445 -8287 -20135 -16981 -17875 -15278 5485 15648 5797 -12946 -22009 -10110
11474a0110J0375J0011o129p155L989R036o644r257j80J136n249L360j193J9171
$$ -10110 265 10276 4147 -3008 981 10017 3373 -5884 -6064 -4928 -10177 -6817 -8010 11161
11460A1161J4476q872l359k685j4450p540j0003L196Q89m463L839J9339J0536
$$ 11161 25637 16765 13406 10721 -3729 -11269 -21272 -18076 -17187 -21650 -17811 1528 12064
11447A2064n898j0789j0874P805R295L052N072L059L429J301l222K842M818K12
$$ 12064 6166 -4623 -15497 -7692 1603 4655 9727 12786 16215 17516 14294 17136 21954 22166
11433B2166o681j6703J796M059l614n569q434q608J068R032N68n932J5922P388
$$ 22166 15485 -1218 578 4637 1023 -4546 -12980 -21588 -20520 -11488 -10920 -16852 -930 6458
11419F458j912k974o79R958L497j8896L081M72j2638k64J0352n544m827q526n584
$$ 6458 4546 1572 893 10851 14348 -4548 -1467 -995 -13633 -13897 -3545 -9089 -13916 -22442 -28026
11404b8026Q165J4385J0846j481p915p485j0153R693J4732J3539j4206l002O388
$$ -28026 -19861 -5476 5370 3889 -4026 -11511 -21664 -11971 2761 16300 2094 -908 5480
11391E480J0055L301j55m280p997j274K383P430K817l564r490j0986Q9l548J50
$$ 5480 15535 18836 18681 14401 6404 5130 7513 14943 17760 14196 4706 -6280 -6191 -9739 -9589
11376i589J2334O702r425N228K790q805q937K1414J0468j494n414o787j1432J464
$$ -9589 2745 9447 22 5250 8040 -765 -9702 11712 22180 20686 15272 8485 -2947 -1483
11362a483m928l553R851O213L276K143J715K856p193Q638r638j1777k222R769
$$ -1483 -6411 -9964 -113 6100 9376 11519 13234 16090 8897 17535 7897 -3880 -6102 3667
11348C667J0981J32q368j3897r223o298l47L659J1169J4630R94j3741p196q154
$$ 3667 14648 14780 6412 -7485 -16708 -23006 -23353 -19694 -8525 6105 7099 -6642 -13838 -21992
11334b1992L009M784J1205R148k015J794n92n919J589J2830j6106J25J582O56
$$ -21992 -18983 -14199 -2994 6154 4139 5933 5341 -578 1011 13841 -2265 -2140 -558 98
11320I8q15o475N361k267j3712N338j149k101K669J0327K4100O687k1086j1943
$$ 98 -717 -7192 -1831 -4098 -17810 -12472 -13621 -15722 -13053 -2726 21374 28061 6975 -4968
11306d968R261j0175k2427M858l627J552O897J3733o709j1985O255m278L539N213
$$ -4968 4293 -5882 -28309 -23451 -27078 -25526 -18629 -4896 -11605 -23590 -17335 -21613 -18074 -12861
11292a2861R424m087O728k0009q266p014J7014J7849n744o683N098q1L487m737
$$ -12861 -3437 -7524 -796 -20805 -29071 -36085 -19071 -1222 -6966 -13649 -8551 -8632 -5145 -9882
11278i882Q928O417l468j1527l114M714R484J163O459J3016M027M872k4690j3827
$$ -9882 -954 5463 1995 -9532 -12646 -7932 1552 2715 9174 22190 26217 31089 6399 -7428
11264g428m512j217O85j67J2647K4870L495j0053n085L548o079j4473l82J3085
$$ -7428 -11940 -13157 -12472 -12639 8 24878 28373 18320 13235 16783 10704 -3769 -4151 8934
11250H934N216j736n64M259R469o47Q203n672m645o665l011j1756r691Q31J4171
$$ 8934 14150 12414 11850 16109 25578 24931 33134 27462 22817 16152 13141 1385 -8306 -7475 6696
11235F696L672p387m299M30Q890m23j4597j268J1021j5468q822l842n218n080
$$ 6696 10368 2981 -1318 -888 8002 7579 -7018 -8286 2735 -12733 -21555 -25397 -30615 -35695
11221c5695K0183K0463K424n894j9601r255P364J3183n3J351l150M107J4241n887
$$ -35695 -15512 4951 7375 1481 -18120 -27375 -20011 -6828 -6881 -5530 -8680 -4573 9668 3781
11207C781l630r064q644o310Q289Q058J134L60j0621J061q60O062O346k430n54
$$ 3781 151 -8913 -17557 -23867 -15578 -7520 -6386 -6026 -16647 -15586 -16446 -10384 -4038 -6468 -7022
11192g022J2587l85r458o205L602L099J0906j849m018m506j294J657N400j989
$$ -7022 5565 5180 -4278 -10483 -6881 -3782 7124 5275 1257 -3249 -4543 -2886 2514 525
11178E25m141j484J2523L848m202m037Q357j1900N51O526j0546p290J1450J4468
$$ 525 -3616 -5100 7423 11271 7069 3032 11389 -511 40 6566 -3980 -11270 180 14648
11164A4648N797j3906r520q879l865o64Q255J7245l62J0616J0956j0351n278k044
$$ 14648 20445 6539 -2981 -11860 -15725 -16389 -8134 9111 8749 19365 30321 19970 14692 12648
11150A2648O711M47j40m389M570L483j344O722k278j9365P936k523k1231l457
$$ 12648 19359 19806 19666 15277 19847 23330 21986 28708 26430 7065 15001 12478 -8753 -12210
11136a2210j8345j1963L584J2005J4642O145K677n39m141M960j627m359Q213m928
$$ -12210 -30555 -42518 -38934 -26929 -12287 -6142 -3465 -4004 -8145 -3185 -4812 -9171 -958 -5886
11122e886j1480n381j929K205J1348K532j36R034J4669R620M307j3472j5954J673
$$ -5886 -17366 -22747 -24676 -22471 -11123 -8591 -8727 307 14976 24596 28903 15431 -523 1150
11108A150j0752q872P591Q186l169N453m432L294j666j5454j522O567Q558J684
$$ 1150 -9602 -18474 -10883 -2697 -5866 -413 -4845 -1551 -3217 -18671 -20193 -13626 -5068 -3384
11094c384m228k362R829j573n562J565o219o272J338j0435j8930J2432J1506J0132
$$ -3384 -7612 -9974 -145 -1718 -7280 -5715 -11934 -18206 -16868 -27303 -46233 -33801 -22295 -12163
11080a2163O529K040R906N319p615j0052n28K523O439n351P022J3535M080q925
$$ -12163 -5634 -3594 6312 11631 4016 -6036 -6564 -4041 2398 -2953 4069 17604 21684 12759
11066A2759j680N753l554j1892p861O235K639k966j3819P286j919k409o926K350
$$ 12759 11079 16832 13278 1386 -6475 -240 2399 -567 -14386 -7100 -9019 -11428 -18354 -16004
11052a6004m226r628J4182L75L199P41K88K043J3108J061m626j1643l112J530
$$ -16004 -20230 -29858 -15676 -15301 -12102 -11361 -11073 -9030 4078 5139 513 -11130 -14242 -12712
11038a2712k011J0346Q304N573j8073j0073N676N840k327q873J0253L220r404
$$ -12712 -14723 -4377 3927 9500 -8573 -18646 -12970 -7130 -9457 -18330 -8077 -4857 -14261
11025a4261L915J734j2078J1803O735k624J4329P345j54j6192j8200j1497J0937
$$ -14261 -10346 -8612 -20690 -8887 -2152 -4776 9553 16898 16744 552 -17648 -29145 -18208
11012a8208K2972j210r999J379q224K767M808l061l557L201R510J063q11k157
$$ -18208 4764 3554 -6445 -5066 -13290 -10523 -5715 -8776 -12333 -9132 378 1441 630 -1527
10998a527M165r377j2322n49m870Q489O332K923R503J3439J246K325l437j5146
$$ -1527 2638 -6739 -19061 -19610 -24480 -15991 -9659 -6736 2767 16206 17452 19777 16340 1194
10984A194J611o238J585o548N059M204Q744k55K527K3O128l961m142o046m159
$$ 1194 2805 -3433 -1848 -8396 -3337 867 9611 9356 11883 11906 18034 14073 9931 3885 -274
10969b74Q686p725r494J15O357L859L557K628p607n329k267J2424L997J7931J4120
$$ -274 8412 687 -8807 -8692 -2335 1524 5081 7709 102 -5227 -7494 4930 8927 26858 40978
10954D0978j3834j7772q833j1953m566l755K444J2260J680P933J485m293q502
$$ 40978 27144 9372 539 -11414 -15980 -19735 -17291 -5031 -3351 4582 6067 1774 -6728
10941f728j591J2262r03Q719k024k2882j1569J997J8900J7258N642n483j968J8664
$$ -6728 -8319 3943 3040 11759 9735 -13147 -24716 -22719 -3819 13439 19081 13598 11630 30294
10927C0294P110k0277j0588P9L061P664p331j2010M441l434R66J0028J2209Q183
$$ 30294 37404 17127 6539 6618 9679 17343 10012 -1998 2443 -991 -25 10003 22212 30395
10913C0395o250p474q62r324N371J4706Q001q003k586r818Q758k085p477K426
$$ 30395 24145 16671 15809 6485 11856 26562 34563 26560 23974 14156 22914 20829 13352 15778
10899A5778R975p817K036j3271q174R742J0896J938m168O08M426M045R921M953
$$ 15778 25753 17936 19972 6701 -1473 8269 19165 21103 16935 17543 21969 26014 35935 40888
10885D0888k879q129j060N696M74j7654k309j0125j0319N740L200o79Q001R968
$$ 40888 38009 29880 28820 34516 34990 17336 15027 4902 -5417 323 3523 2844 10845 20813
10871B0813k826m165n473M411J4134l753l735n723j403N487M138j45j3846j1372
$$ 20813 17987 13822 8349 12760 26894 23141 19406 13683 12280 17767 21905 21760 7914 -3458
10857c458P003J4241M504M599o280l753j806n169p909r302L79Q902J314J1682
$$ -3458 3545 17786 22290 26889 20609 16856 15050 9881 1972 -7330 -6951 1951 3265 14947
10843A4947q563j1643k359L313m187j0797J94J3307J887R765p363j0015K388J0358
$$ 14947 6384 -5259 -7618 -4305 -8492 -19289 -19095 -5788 -3901 5864 -1499 -11514 -9126 1232
10829A232r771j109L822j464K746l201K723Q361k719q498L09J2378J2111J455
$$ 1232 -8539 -9648 -5826 -7290 -4544 -7745 -5022 3339 620 -7878 -7569 4809 16920 18375
10815A8375k540o712j5406j516p433j2551k729J2488J8735M944j3145j3438O113
$$ 18375 15835 9123 -6283 -7799 -15232 -27783 -30512 -18024 711 5655 -7490 -20928 -14815
10802a4815K2194o082o587M95J023M119J885K807j792j0882o565M402J4332N875
$$ -14815 7379 1297 -5290 -4795 -3772 347 2232 5039 3247 -7635 -14200 -9798 4534 10409
10788A0409K959N965K502o594j8259r949k512n557O183n232j1026M698M481l47
$$ 10409 13368 19333 21835 15241 -3018 -12967 -15479 -21036 -14853 -20085 -31111 -26413 -21932 -22279
10774b2279Q638Q849J1039K001o943L090m51j7263j392P224J1388J534n558m752
$$ -22279 -13641 -4792 6247 8248 1305 4395 3944 -13319 -14711 -7487 3901 5435 -123 -4875
10760d875M488Q008n044J761p959N732P246o887k618J0628p227j9835O400J3824
$$ -4875 -387 7621 2577 4338 -3621 2111 9357 2470 -148 10480 3253 -16582 -10182 3642
10746C642m632m041q16j3234m101J4682J2614k654K807l039r527L675J0363Q142
$$ 3642 -990 -5031 -5847 -19081 -23182 -8500 4114 1460 4267 1228 -8299 -4624 5739 13881
10732A3881L819M785q675j3547q062n248N191O832Q586M010j5372o351r07N918
$$ 13881 17700 22485 13810 263 -7799 -13047 -7856 -1024 7562 11572 -3800 -10151 -11058 -5140
10718e140o541j4051L196N361j0544m795J3312J0307m836o623k341J630j984O291
$$ -5140 -11681 -25732 -22536 -17175 -27719 -32514 -19202 -8895 -13731 -20354 -22695 -21065 -23049 -16758
10704a6758K3926J3776n87L129n131q791O613m039K561L329j5296j47p777M079
$$ -16758 7168 20944 20357 23486 18355 9564 16177 12138 14699 18028 2732 2585 -5192 -1113
10690a113K845q701l458K962q699o394M725M75L213R638j0680p621R170n516J350
$$ -1113 1732 -6969 -10427 -7465 -16164 -22558 -17833 -17358 -14145 -4507 -15187 -22808 -13638 -19154 -17804
10675a7804J2069l998P96p417J349L858p043m765j0314N396M654J3085n268o766
$$ -17804 -5735 -9733 -8937 -16354 -15005 -11147 -18190 -22955 -33269 -27873 -23219 -10134 -15402 -22168
10661b2168N881N088n256p00j4072k552R949P72j979N220J947p444j0709k410
$$ -22168 -16287 -11199 -16455 -17155 -31227 -33779 -23830 -23058 -25037 -19817 -17870 -25314 -36023 -38433
10647c8433m907K25J8605K155J2251J1612m158o741j349K25k256q71L09K865O375
$$ -38433 -43340 -43115 -24510 -22355 -10104 1508 -2650 -9391 -10740 -10515 -12771 -13642 -13333 -10468 -4093
10632d093J0374M044l604o830J452o02R737Q324j3978n503r703j268J4039L596
$$ -4093 6281 10325 6721 -109 1343 741 10478 18802 4824 -679 -10382 -11650 2389 5985
10618E985o506N121M561J6095N363p925J697n986R9o905r961j4273K266O642m330
$$ 5985 -521 4600 9161 25256 30619 22694 24391 18405 18504 11599 1638 -12635 -10369 -3727 -8057
10603h057n146L42N969M356O203n086m853o235N27N077J3614q097L506J7310l887
$$ -8057 -13203 -12861 -6892 -2536 3667 -1419 -6272 -12507 -11980 -6903 6711 -1386 2120 19430 15543
10588A5543j1693J251K636j3591Q595M826j383j432R76Q845M855K4589O871L105
$$ 15543 3850 5101 7737 -5854 2741 7567 6184 4752 5728 14573 19428 44017 50888 53993
10574E3993O511L691N380j288J198p40o549J161K196k4817p135J1735k099j789
$$ 53993 60504 64195 69575 68287 69485 68745 62196 63357 65553 40736 33601 45336 43237 41448
10560D1448r901K607R691q267o342N70k0312q190k157N249j8469o892J3522l092
$$ 41448 31547 34154 43845 35578 29236 29806 9494 1304 -853 4396 -14073 -20965 -7443 -10535
10546a0535n082J2898J3367N472M28R625L580j7792j2220k64j65K4278j972j3184
$$ -10535 -15617 -2719 10648 16120 16548 26173 29753 11961 -259 -523 -688 23590 21618 8434
10532H434R154q9j6418N761L189n31q06j5906j7406m969N769K079J5616P136l549
$$ 8434 17588 17499 1081 6842 10031 9500 8694 -7212 -24618 -29587 -23818 -21739 -6123 1013 -2536
10517b536r068p043J2039Q826l948r927R635K1786K933r773r484n875J6038J6034
$$ -2536 -11604 -18647 -6608 2218 -1730 -11657 -2022 19764 22697 12924 3440 -2435 13603 29637
10503B9637J9951J3358J0290Q133K386l91j1301p612N207r079r428j2539j3066
$$ 29637 49588 62946 73236 81369 83755 83364 72063 64451 69658 60579 51151 38612 25546
10490B5546j2195N048O222p919q793M512k346p072r333j504M575P759m306k964
$$ 25546 13351 18399 24621 16702 7909 12421 10075 3003 -6330 -7834 -3259 4500 194 -2770
10476b770R032J0548P957j5r84n876k699R149r543l376K629r725n184N051m89
$$ -2770 6262 16810 24767 24752 23768 17892 15193 24342 14799 11423 14052 4327 -857 4194 3705
10461C705N4M1j5393j0151O217M806P616M379O28r93M849L970R677K379j1370
$$ 3705 3759 3800 -11593 -21744 -15527 -10721 -3105 1274 1902 909 5758 9728 19405 21784 10414
10446A0414q059p216j1034K065J9720J57j3875j4867j106J1995J9786n358j4808
$$ 10414 2355 -4861 -15895 -13830 5890 6047 -7828 -22695 -23801 -11806 7980 2622 -12186
10433a2186q468R75k114P049J0211N306m102j2738r363l080J8191J0555k765q525
$$ -12186 -20654 -19679 -21793 -14744 -4533 773 -3329 -16067 -25430 -28510 -10319 236 -2529 -11054
10419a1054J1542L086R92J0057n975j2559J2780J9874J3204K9529K4786Q467k310
$$ -11054 488 3574 4566 14623 8648 -3911 8869 28743 41947 71476 96262 104729 102419
10406A02419j2164o659K0502j854L373m217O935J621O91j0605q684r096M695L128
$$ 102419 90255 83596 104098 102244 105617 101400 108335 109956 110647 100042 91358 82262 86957 90085
10392I0085k0031j0499L729j607o482j2160p960k4459j2082l598N032J2472Q924
$$ 90085 70054 59555 63284 61677 55195 43035 35075 10616 -1466 -5064 -32 12440 21364
10379B1364K142j03j2669M556Q553r205j6631q672J5536J2691q761k771j318j2626
$$ 21364 23506 23403 10734 15290 23843 14638 -1993 -10665 4871 17562 8801 6030 4712 -7914
10365g914K227m85j922j962j0541M573J5840J1127J4762j3535j3197Q464o554
$$ -7914 -5687 -6172 -8094 -10056 -20597 -16024 -184 10943 25705 12170 -1027 7437 883
10352H83p395m242k701J2097Q852J2459J2960R306p341j4065p981Q88M399O642
$$ 883 -6512 -10754 -13455 -1358 7494 19953 32913 42219 34878 20813 12832 13720 18119 24761
10338B4761m056J962J209q110k343L49J144O426P74q719o268O922j6926n650J0585
$$ 24761 20705 22667 23876 15766 13423 13772 14916 21342 22116 13397 7129 14051 -2875 -8525 2060
10323B060M211p608k461j0806o329J662R954K2536N698m543R761n136j0138m491
$$ 2060 6271 -1337 -3798 -14604 -20933 -19271 -9317 13219 18917 14374 24135 18999 8861 4370
10309D370J351R35o025k280J286q15J271j0131L391J884J0915J1146J420j806
$$ 4370 5721 6656 631 -1649 -363 -1178 93 -10038 -6647 -4763 6152 17298 18718 16912
10295A6912k083j87q385L995N717l019O960J4491o497j2701j4647j5256J4242
$$ 16912 14829 14642 6257 10252 15969 12950 19910 34401 27904 15203 556 -14700 -458
10282d58Q090j0731r71p65m805R909p999k045l658K701k289L088K277N830o586
$$ -458 7632 -3099 -4070 -4835 -9640 269 -7730 -9775 -13433 -10732 -13021 -9933 -7656 -1826 -8412
10267h412m156p587J025L042P621p360J4515n731j6479j3138K756J2890M745j095
$$ -8412 -12568 -20155 -19130 -16088 -8467 -15827 -1312 -7043 -23522 -36660 -33904 -21014 -16269 -17364
10253a7364O014K684l615J572N061L670j502K577j1652p722k13J2671M079q389
$$ -17364 -11350 -8666 -12281 -10709 -5648 -1978 -3480 -903 -12555 -20277 -20490 -7819 -3740 -12129
10239a2129P466J5185n048l045p772n282O956P699m73j314P743k643l435k537
$$ -12129 -4663 10522 5474 2429 -5343 -10625 -3669 4030 3557 2243 9986 7343 3908 1371
10225A371q322N752L407l977k961J3336k458p475l306l525L823n37K721L761l756
$$ 1371 -6951 -1199 2208 -1769 -4730 8606 6148 -1327 -4633 -8158 -4335 -4872 -2151 1610 -2146
10210b146N940n796j8292J851n434m815J6146J1660o209q263n934J6817n215l046
$$ -2146 3794 -2002 -20294 -18443 -23877 -28692 -12546 -886 -7095 -15358 -21292 -4475 -9690 -12736
10196a2736R092Q386r435p511M991k053L567l660r280K72m16L058L945N808m49
$$ -12736 -3644 4742 -4693 -12204 -7213 -9266 -5699 -9359 -18639 -18367 -18783 -15725 -11780 -5972 -6421
10181f421k58N517r284j065n270o218J1414k999J837J7411n029k120K161R589
$$ -6421 -6679 -1162 -10446 -11511 -16781 -22999 -11585 -14584 -12747 4664 -365 -2485 -324 9265
10167I265O434j96j0562k038k666K730R186o378m840j0883J174O577k01j1834
$$ 9265 15699 15503 4941 2903 237 2967 12153 5775 935 -9948 -8774 -2197 -2398 -14232
10153a4232l350J0151l143m428J0085O41k177n570J3473J3031P31k504J601m787
$$ -14232 -17582 -7431 -10574 -15002 -4917 -4276 -6453 -12023 1450 14481 15212 12708 14309 9522
10139I522l589j474L488K47j4520j5582j723O467J8466j881r506Q429n615j0105
$$ 9522 5933 4459 7947 8194 -6326 -21908 -23631 -17164 1302 -579 -10085 -1656 -7271 -17376
10125a7376J288k185k866J1171J3051Q0j2934j7542p407K346l869P815j018l419
$$ -17376 -16088 -18273 -21139 -9968 3083 3163 -9771 -27313 -34720 -32374 -36243 -28428 -29446 -32865
10111c2865K659O832P274J451M701J2187n292j1884l01j629o548M700m988p15
$$ -32865 -30206 -23374 -16100 -14649 -9948 2239 -3053 -14937 -15238 -16867 -23415 -18715 -23703 -24418
10097b4418O158P009n594r818K1144m513j666j599N176j1461n723N685m309k641
$$ -24418 -18260 -11251 -16845 -26663 -5519 -10032 -11698 -13297 -8121 -19582 -25305 -19620 -23929 -26570
10083b6570K51l122j192P48J1680l383K1171J1744j411q015j7757l285L579q046
$$ -26570 -26319 -29441 -30633 -29885 -18205 -21588 -417 11327 9916 1901 -15856 -19141 -15562 -23608
10069b3608P577O584O349j642Q414L227r939O316l06q316Q696K533k235M293q887
$$ -23608 -16031 -9447 -3098 -4740 3674 6901 -3038 3278 2972 -5344 3352 5885 3650 7943 -944
10054i44j014J4014P038k960P9j7979j8652q200M880J3067L218N589L309N00j6274
$$ -944 -1958 12056 19094 16134 16213 -1766 -20418 -28618 -23738 -10671 -7453 -1864 1445 1945 -14329
10039a4329k28R641k832J3265J6189L523O804R462Q719l718j9813j1872r662p165
$$ -14329 -14557 -4916 -7748 5517 21706 25229 32033 41495 50214 46496 26683 14811 5149 -2016
10025b016j581o945L658K678k133M42M014j975k97Q053r494l235n113Q519j578
$$ -2016 -3597 -10542 -6884 -4206 -6339 -5897 -1883 -3858 -4155 3898 -5596 -8831 -13944 -5425 -7003
10010g003N964P236j691j2912j4065j1372K183L893J6042q55J520k156L642J2096
$$ -7003 -1039 6197 4506 -8406 -22471 -33843 -31660 -27767 -11725 -12580 -11060 -13216 -9574 2522
9996B522J3560n400q716J069J428q031J560N168k925j2396Q68K574J1399J6662
$$ 2522 16082 10682 1966 3035 4463 -3568 -2008 3160 235 -12161 -11293 -8719 2680 19342
9982A9342p681O329J0431j0204r270L770j0573P636J7440j2755k4537j2543J9791
$$ 19342 11661 17990 28421 18217 8947 12717 2144 9780 27220 14465 -10072 -22615 -2824
9969b824K87k700o965O488P870J1415l979q585k983o897R40K6010p638k4333r897
$$ -2824 -2537 -5237 -12202 -5714 2156 13571 9592 1007 -1976 -8873 -7933 18077 10439 -13894 -23791
9954b3791O332P406L714J1104q372N502o725J415Q836J3683L362R18k13K1895
$$ -23791 -17459 -10053 -6339 4765 -3607 1895 -4830 -3415 5421 19104 22466 23384 23171 45066
9940D5066K0605M422K561J685O28P687J5868Q978k452j4070n759L17j2018q965
$$ 45066 65671 70093 72654 74339 74967 82654 98522 107500 105048 90978 85219 85536 73518 64553
9926F4553j1686j3189L673j0748q372p325j9687j123P430K203l44j6012L079Q489
$$ 64553 52867 39678 43351 32603 24231 16906 -2781 -3904 3526 5729 5385 -10627 -7548 941
9912I41R535l303O454K128n892J981k144o727k175j5639M285J5431J4228L300
$$ 941 10476 7173 13627 15755 9863 11844 9700 2973 798 -14841 -10556 4875 19103 22403
9898B2403j391j235j6856J4656O121j2299m569l080P268J3328n241j8203l647
$$ 22403 21012 19777 2921 17577 23698 11399 6830 3750 11018 24346 19105 902 -2745
9885b745R034P058j2494m483M696P226J6760O049l100j8663m762R414p285j1051
$$ -2745 6289 13347 853 -3630 1066 8292 25052 31101 28001 9338 4576 13990 6705 -4346
9871d346P363k036J2072O182K043q908k033O13r254P996R775k617j3725j4809
$$ -4346 3017 981 13053 19235 21278 12370 10337 10950 1696 9692 19467 16850 3125 -11684
9857a1684r930J2794L212J3849L301m70n893K0092J3112L283n633P075J8904L62
$$ -11684 -21614 -8820 -5608 8241 11542 11072 5179 25271 38383 41666 36033 43108 62012 62374
9843F2374j019L75L321k45l700l3325j1693q689j1391R199r884M925l724k61K088
$$ 62374 61355 61730 65051 64806 61106 27781 16088 7399 -3992 5207 -4677 248 -3476 -3737 -1649
9828a649k943l973P09k718J034L621m600J3441J6388l372M479p279q540n52P24
$$ -1649 -4592 -8565 -7856 -10574 -9540 -5919 -10519 2922 19310 15938 20417 13138 4598 4046 4770
9813D770m061p683J0654L683P871j0712L066J4471J3219l640j487L52M179q482
$$ 4770 709 -6974 3680 7363 15234 4522 7588 22059 35278 31638 30151 30503 34682 26200
9799B6200m379K215q131n700P757M791R451L992p239N302m144j5554r059j785
$$ 26200 21821 24036 15905 10205 17962 22753 32204 36196 28957 34259 30115 14561 5502 3717
9785C717m358J0146o426j4789o405J6336M581q507K560j3393o632n477K1087K044
$$ 3717 -641 9505 3079 -11710 -18115 -1779 2802 -5705 -3145 -16538 -23170 -28647 -7560 -5516
9771e516J3753P687J0231j823l986L277n499J775m73j0286J2557L541J725r593
$$ -5516 8237 15924 26155 24332 20346 23623 18124 19899 19426 9140 21697 25238 26963 17370
9757A7370p739R466q239j2785M600R485j4761j8215L633M916k781K840m941Q01
$$ 17370 9631 19097 10858 -1927 2673 12158 -2603 -20818 -17185 -12269 -15050 -12210 -17151 -16350
9743a6350J0012P085j07N558K697j883K464k341k4041j0515J913j117j239M251
$$ -16350 -6338 747 640 6198 8895 7012 9476 7135 -16906 -27421 -25508 -26625 -27864 -23613
9729b3613J5028J2848N568n237L99J336r134J9882M447M708j2897j642J3595J5874
$$ -23613 -8585 4263 9831 4594 4993 6329 -2805 17077 21524 26232 13335 11693 25288 41162
9715D1162q329j1951M437p920p572M405k89j0119l795p600M080K4312J0622j1835
$$ 41162 32833 20882 25319 17399 9827 14232 13943 3824 29 -7571 -3491 20821 31443 19608
9701A9608j9241O382J2142n701j0921O057n809l098j058L36R926M681j4903m092
$$ 19608 367 6749 18891 13190 2269 8326 2517 -581 -1639 -1303 8623 13304 -1599 -5691
9687e691K1014J1256M475l782K147J0545J0113J1984R869O87J0273J1591J1191
$$ -5691 15323 26579 31054 27272 29419 39964 50077 62061 71930 72617 82890 94481 105672
9674A05672K1288K0050Q756j7444q648m399R900j0313j6090j2958m948j4379p169
$$ 105672 126960 147010 155766 138322 129674 125275 135175 124862 108772 95814 90866 76487 69318
9661F9318n219j5136j8405n559J787J0032J6559o089k9092p678M297N682J2668
$$ 69318 64099 48963 30558 24999 26786 36818 53377 47288 18196 10518 14815 20497 33165
9648C3165R36J2710L584j2353j2765j1560J1375J838Q406j890m540O019m879M211
$$ 33165 34101 46811 50395 38042 25277 13717 25092 26930 35336 33446 28906 34925 30046 34257
9634C4257j983M291q13L445l587o113M513N433k166R735R063o622k6491m529K0209
$$ 34257 32274 36565 35752 39197 35610 29497 34010 39443 37277 47012 56075 49453 22962 18433 38642
9619C8642N449m04K933J6085R757m443m148q817M165q685M40j853p73K878O315
$$ 38642 44091 43687 46620 62705 72462 68019 63871 55054 59219 50534 50974 49121 48348 51226 57541
9604E7541j4972o797K850J990O392M268L836o07j6222K240R734K801N52K340J4601
$$ 57541 42569 35772 38622 40612 47004 51272 55108 54501 38279 40519 50253 53054 53606 55946 70547
9589G0547J4997N053O27J9695K0128J993j6406K720M770l050j125J3086N363L5851
$$ 70547 85544 90597 91224 110919 131047 133040 116634 119354 124124 121074 119949 133035 138398 174249
9575A74249P0227P7572L1925r138j2485k081j1444l0239m6389k8454k1555k8298
$$ 174249 244476 322048 353973 344835 332350 330269 318825 288586 242197 213743 192188 163890
9563A63890j0078j189J2376L1202K4837J8872L4680M6666L1457J9554Q736j6488
$$ 163890 153812 152623 164999 196201 221038 239910 274590 321256 352713 372267 381003 364515
9551C64515o12k280r313j3644p279n786P363j3226j1390j3908l998J3456l46P649
$$ 364515 363903 361623 352310 338666 331387 325601 332964 319738 308348 294440 290442 303898 303552 311201
9537C11201J3507L2482O2288J01017J59535J75149Q4656k7076o6423p0273r1145
$$ 311201 324708 357190 419478 520495 680030 855179 939835 912759 846336 776063 684918
9526F84918j07386r4736q3901o6201k4166J805R873N642j438k3551N881K0659
$$ 684918 577532 482796 398895 332694 308528 310333 320206 325848 324410 300859 306740 327399
9514C27399J7360J2713K1382K5252R945K0366J6103J62j7176m2076m3486o1083
$$ 327399 344759 357472 378854 404106 414051 434417 450520 450682 433506 391430 347944 286861
9502B86861m4646k1726j7595j9544n286O292J1509R618J4375L6657K7335K7303
$$ 286861 242215 220489 202894 183350 178064 184356 195865 205483 219858 256515 283850 311153
9490C11153L3128K2116k9275m9620k9276m352k2498l1171k3273r084j6182j0157
$$ 311153 344281 366397 337122 287502 258226 253874 231376 200205 176932 167848 151666 141509
9478A41509O998J4726O164q466K78J4575O316l068Q030L137r007j0690k2398l2779
$$ 141509 148507 163233 169397 160931 161209 175784 182100 179032 187062 190199 181192 170502 148104 115325
9464A15325n506K231j575p811q827o896J9091M441l925j934l773K666q761o170
$$ 115325 109819 112050 110475 102664 93837 86941 106032 110473 106548 104614 100841 103507 94746 88576
9450H8576q287N601J4939J7079P483Q075J287m321Q69J2116J1556J0005R077J2377
$$ 88576 80289 85890 100829 117908 125391 133466 134753 130432 131301 143417 154973 164978 174055 186432
9436A86432J9553K4701K587r464o242j555j3709j8793j8841j0564j6680j3719
$$ 186432 205985 230686 233273 223809 217567 216012 202303 183510 164669 154105 137425 123706
9424A23706l213p671m308n000l476k969L184L451P799j0304j2736J118m998L384
$$ 123706 120493 112822 108514 103514 100038 97069 100253 103704 111503 101199 88463 89581 84583 87967
9410H7967N931j12n365N546J1527N858N926Q066K1499K4922J0226o365Q913M746
$$ 87967 93898 93786 88421 93967 105494 111352 117278 125344 146843 171765 181991 175626 184539 189285
9396A89285L441j3793j0966m724j6027j9473j5803p825l449k2352j1678J2862
$$ 189285 192726 178933 167967 163243 147216 127743 111940 104115 100666 78314 66636 79498
9384G9498P239k2953j0161R582j947J6989N447k202m494l108l944n90K778k332
$$ 79498 86737 63784 53623 63205 61258 78247 83694 81492 76998 73890 69946 69356 72134 69802
9370F9802N67J0203J5173R95j3669J818J1576P359P933k273l202q174k824j0107
$$ 69802 70369 80572 95745 96740 83071 84889 96465 103824 111757 109484 106282 98108 95284 85177
9356H5177q903J0129R70o205n215N908k077L2576J2635o287m069j767j4506O09
$$ 85177 76274 86403 87373 81168 75953 81861 79784 112360 124995 118708 114639 112872 98366 98975
9342I8975L336M408n509n338N250L322q348p360j5415l349J5916J0969n829j2721
$$ 98975 102311 106719 101210 95872 101122 104444 96096 88736 73321 69972 85888 96857 91028 78307
9328G8307q892n405K562J0213K710Q437K0921O943J1107R265J8809L874M164m552
$$ 78307 69415 64010 66572 76785 79495 87932 108853 115796 126903 136168 154977 158851 163015 158463
9314A58463k0039l071m147K230o546M356J41P863P360J0492K420j4324K815m754
$$ 158463 138424 135353 131206 133436 126890 131246 131387 139250 146610 157102 159522 145198 148013 143259
9300A43259j4556N075L293N731R876J2256n979k475J6225Q752k762J782J0264
$$ 143259 128703 133778 137071 142802 152678 164934 158955 156480 172705 181457 178695 180477 190741
9287A90741J1718K1704K362P89K0281M3994P5012R7144J17105J04051O1869J4694
$$ 190741 202459 224163 226525 227314 247595 291589 366601 463745 580850 684901 746770 761464
9275G61464l5476n8623o1773o8139o5076m8513j6705r238k56K3329M2897N9827
$$ 761464 725988 667365 605592 537453 472377 423864 407159 397921 397665 420994 463891 523718
9263E23718Q2649R1952O1614K8735M766l334m643k6254j9806k9626k8618j3187
$$ 523718 606367 698319 759933 788668 793434 790100 785457 759203 739397 709771 681153 667966
9251F67966j3993l130N688K610K2411O0680J13449J66529K30204K59297K21753
$$ 667966 653973 650843 656531 659141 681552 742232 855681 1022210 1252414 1511711 1733464
9240A733464Q5093m6226j28441j86490j82746j67970j57029j21587p9367m0417
$$ 1733464 1818557 1772331 1643890 1457400 1274654 1106684 949655 828068 748701 708284
9230G08284j693j0645j7529J4748L9807K3688Q980K8195M8132M1685N099k2601
$$ 708284 706591 695946 678417 693165 732972 756660 765640 793835 841967 883652 888751 866150
9218H66150l6389o5289o7016q1535o4627l5897j3064q591j7961J7281N5583O9213
$$ 866150 829761 764472 697456 615921 551294 515397 502333 493742 475781 493062 548645 617858
9206F17858R9576R4580N7835k672l9599m4405o0414p9881r0033p6936n0039j7651
$$ 617858 717434 812014 869849 867177 827578 783173 722759 642878 552845 475909 425870 408219
9194D08219k9201l1771k4215L227P71M960j1082j0898J1075Q820r754L311J4045
$$ 408219 379018 347247 323032 326259 327030 331990 320908 310010 321085 329905 320151 323462 337507
9181C37507N20N941R081j755L326K5278O960n513j1567j6875m054J5606Q145l744
$$ 337507 338027 343968 353049 351294 354620 379898 386858 381345 369778 352903 348849 364455 372600 368856
9167C68856p793J598J4950N296k440L009j1548k1205l331L297J6201j7705j1456
$$ 368856 361063 362661 377611 382907 380467 383476 371928 350723 347392 350689 366890 349185 337729
9154C37729q876R442O120P945q475j2316R07J919p512J977R23P527n476o600J0979
$$ 337729 328853 338295 344415 352360 343885 331569 332476 334395 326883 328860 329783 337310 331834 325234 336213
9139C36213N797j80R456J2260J6082P7j724L298q6O712K615q271j0658L916O957
$$ 336213 342010 341830 351286 363546 379628 379705 377981 381279 381193 387905 390520 382249 371591 375507 382464
9124C82464J7978rk382N669L15K834k246k16J0087J1290l779j3755P988Q780J0140
$$ 382464 400442 400433 398051 403720 404035 406869 404623 404407 414494 425784 422005 408250 416238 425018 435158
9109D35158O300m564P136J3307N526K391J0507J24n78K1900L8925J8561k696j940
$$ 435158 441458 436894 444030 457337 462863 465254 475761 475885 475307 497207 536132 554693 551997 550057
9095E50057J0864J3363J1588m46J6768J8683J0494O113L420K1294K4208K4482
$$ 550057 560921 574284 585872 585426 602194 620877 631371 637484 640904 662198 686406 710888
9083G10888J6879J1575Q23Q888L1868L9665M0280M8034L3137p16n059o141j2589
$$ 710888 727767 739342 740165 749053 780921 820586 860866 908900 942037 941321 936262 930121 917532
9070I17532k601M746N022O314l51J3642K6748K4411J285R858J9449J2873J9709
$$ 917532 914931 919677 924699 931013 930662 944304 971052 995463 996748 1006606 1026055 1038928 1058637
9057A058637J0678J2126K7319K5665J017K322R323J4151k543q754k408O013n835
$$ 1058637 1069315 1081441 1108760 1134425 1135442 1137764 1147087 1161238 1158695 1149941 1147533 1153546 1147711
9044A147711j9818J5563K4336j039j2704J7216J8753O912R929K4539J8835J4496
$$ 1147711 1127893 1143456 1167792 1166753 1154049 1171265 1190018 1196930 1206859 1231398 1250233 1264729
9032A264729N298K8104K8992J8374L3721L6394K8876K6469L4103K1637K3255K1322
$$ 1264729 1270027 1298131 1327123 1345497 1379218 1415612 1444488 1470957 1505060 1526697 1549952 1571274
9020A571274L6730M4157L3703L5851L8473M3166L2492L8495N9420O4702L8886
$$ 1571274 1608004 1652161 1685864 1721715 1760188 1803354 1835846 1874341 1933761 1998463 2037349
9009B037349M5200M7581N4512M6992N5076O0401P0596N9704Q0407O4749O8862
$$ 2037349 2082549 2130130 2184642 2231634 2286710 2347111 2417707 2477411 2557818 2622567 2691429
8998B691429P4835O6098P7216Q7429R4858R0477R9895J04811R8105R4200J02099
$$ 2691429 2766264 2832362 2909578 2997007 3091865 3182342 3282237 3387048 3485153 3579353 3681452
8987C681452J06423J25923J31280J22381J35637J18491J46869J65795J65678J66955
$$ 3681452 3787875 3913798 4045078 4167459 4303096 4421587 4568456 4734251 4899929 5066884
8977E066884J57677J75645K02621K12563K18321K23429K44170K63086K92505K99803
$$ 5066884 5224561 5400206 5602827 5815390 6033711 6257140 6501310 6764396 7056901 7356704
8967G356704L02729L29048L52154L84785M05342M16688M62620N02083N27769N72170
$$ 7356704 7659433 7988481 8340635 8725420 9130762 9547450 10010070 10512153 11039922 11612092
8957A1612092O18507O56671P23152P73938Q30970Q93429R61841J040187J161506
$$ 11612092 12230599 12887270 13610422 14384360 15215330 16108759 17070600 18110787 19272293
8948A9272293J252672J369068J491091J639146J821884K003000K185071K418801
$$ 19272293 20524965 21894033 23385124 25024270 26846154 28849154 31034225 33453026
8940C3453026K662033K952925L254063L604682L998047M383529M824367N267603
$$ 33453026 36115059 39067984 42322047 45926729 49924776 54308305 59132672 64400275
8932F4400275N722035O171719O563631O858536P046949P016135O736089O156479
$$ 64400275 70122310 76294029 82857660 89716196 96763145 103779280 110515369 116671848
8924A16671848N242534M007267K542348Q99384q08120k393853l795027m955365
$$ 116671848 121914382 125921649 128463997 129363381 128555261 126161408 122366381 117411016
8916A17411016n814380o383901o655809o720201o588576o342263n972023n564250
$$ 117411016 111596636 105212735 98556926 91836725 85248149 78905886 72933863 67369613
8908F7369613n134517m714199m299635l924200l583881l263677k965380k699875
$$ 67369613 62235096 57520897 53221262 49297062 45713181 42449504 39484124 36784249
8900C6784249k447291k229800k053917j886074j730560j568892j450440j343426
$$ 36784249 34336958 32107158 30053241 28167167 26436607 24867715 23417275 22073849
8892B2073849j242383j141914j062967r72643r09376q34773p82590p28205o67565
$$ 22073849 20831466 19689552 18626585 17653942 16744566 15909793 15127203 14398998 13731433
8883A3731433o43105n94580n55822n24155m83157m57818m22038l99354l80407
$$ 13731433 13088328 12493748 11937926 11413771 10930614 10472796 10050758 9651404 9270997
8874I270997l80551l53796l19317k96476k96095k69948k62046k59700k37807k33410
$$ 9270997 8890446 8536650 8217333 7920857 7624762 7354814 7092768 6833068 6595261 6361851
8864F361851k10006j97081j90006j60595j62872j71811j71350j46300j50275j38427
$$ 6361851 6151845 5954764 5764758 5604163 5441291 5269480 5098130 4951830 4801555 4663128
8854D663128j27820j26652j19224j09044j21686j18289j11046j03545r7583q6343
$$ 4663128 4535308 4408656 4289432 4180388 4058702 3940413 3829367 3725822 3628239 3541896
8844C541896q7897p6839q0039q4590q2609p9420p4634m7595n3003n1479o2378
$$ 3541896 3453999 3377160 3297121 3212531 3129922 3050502 2975868 2928273 2875270 2823791 2761413
8833B761413p0147n6001n6438n5155m1905m4510l8533l3572l8495l8663n6565
$$ 2761413 2691266 2635265 2578827 2523672 2481767 2437257 2398724 2365152 2326657 2287994 2231429
8822B231429m1031k0349l7498m5041m1451k7120l1963k4779k2821l2165k1422
$$ 2231429 2190398 2170049 2132551 2087510 2046059 2018939 1986976 1962197 1939376 1907211 1885789
8811A885789j8840k7881m0169l7029k7163j9185o442j0766l3272j8644r224l3936
$$ 1885789 1866949 1839068 1798899 1761870 1734707 1715522 1709080 1698314 1665042 1646398 1637174 1603238
8799A603238m0837l4334l6228k9964l5152k9950l0783l0928k3475k4232j6282
$$ 1603238 1562401 1528067 1491839 1461875 1426723 1396773 1365990 1335062 1311587 1287355 1271073
8788A271073k4315k7644k7998k2420j8666n917j6815k2605j03j2693j1055o057
$$ 1271073 1246758 1219114 1191116 1168696 1150030 1144113 1127298 1104693 1104590 1091897 1080842 1074785
8776A074785k39p474j9099k5006j1046j3114j3658j93o582j0599j3437j0160r128
$$ 1074785 1074546 1067072 1047973 1022967 1011921 998807 985149 984956 978374 967775 954338 944178 935050
8763I35050j7140n825J641r316r645o580k1784k0439j9282j7757k266M575p436
$$ 935050 917910 912085 913726 904410 894765 888185 866401 845962 826680 808923 806657 811232 803796
8750H03796j9714j6151j1622K458K571q972O943m93n823o16K64q901q434J880
$$ 803796 784082 767931 756309 758767 761338 752366 759309 758816 752993 752377 752641 743740 735306 737186
8736G37186o1J0367j766j2229P177o96L234k6571p402N219J188m810k314j4047
$$ 737186 737125 747492 745726 733497 740674 739978 743212 716641 709239 714458 715646 710836 708522 694475
8722F94475n307R858j1256p815j8683j1707j0579K624J0891R819l040j2130q385
$$ 694475 689168 699026 687770 679955 661272 649565 638986 641610 652501 662320 659280 647150 638765
8709F38765p986J58K947l465j1209j2316k2553o996M767j2027M281R248N242j5812
$$ 638765 630779 630937 633884 630419 619210 606894 584341 577345 582112 570085 574366 583614 588856 573044
8695E73044j8537J507j469J1788L860k271j285j016L04o857L2n068j4022j977
$$ 573044 554507 556014 554545 566333 570193 567922 566637 565621 565925 559068 559100 554032 540010 538033
8681E38033K0555R631K990J8218O080J4705q563Q07m14j2686j5509k9041n826
$$ 538033 558588 568219 571209 589427 595507 610212 601649 602456 602042 589356 573847 544806 538980
8668E38980l149l0281r203J1038j599j1952j056r478j7273j9928j4510P685N366
$$ 538980 535831 505550 496347 507385 505786 493834 492778 483300 466027 446099 431589 439274 444640
8655D44640R01k832J599Q623k6158k2136m142r744L589M352J898K6316J4080N691
$$ 444640 445541 442709 444308 452931 426773 404637 400495 390751 394340 398692 400590 426906 440986 446677
8641D46677l125k0673q567N572L179j1124p503J163L817K561j048j2308j9499
$$ 446677 443552 422879 414312 419884 423063 411939 404436 405599 409416 411977 410929 398621 379122
8628C79122q978L468J0354j3717J2567M527k541o239r7n209O168m467o866Q08
$$ 379122 370144 373612 383966 370249 382816 387343 384802 378563 378466 373257 379425 374958 368092 368900
8614C68900l999P19M706K505L093J2409J8489l709j8544m319k249R161n717j73
$$ 368900 364901 365620 370326 372831 375924 388333 406822 403113 384569 380250 378001 387162 381445 381272
8600C81272J4336J3218L692j4897o947r803p075o664p212M126R390m780m10K1819
$$ 381272 395608 408826 412518 397621 390674 380871 373796 367132 359920 364046 373436 368656 368246 390065
8586C90065M413o601o297o759j631n059k5260j9053j6340r740j3520j0715M607
$$ 390065 394478 387877 381580 374821 373190 368131 342871 323818 307478 297738 284218 273503 278110
8573B78110K438l490j6487o313j4141o224J5034P69j0299m466m500M535M615O994
$$ 278110 280548 277058 260571 254258 240117 233893 248927 249696 239397 234931 230431 234966 239581 246575
8559B46575m08r609M097P667n581l383j2076j994k312j8983K657L969m732L304
$$ 246575 246167 236558 240655 248322 242741 239358 227282 225288 222976 203993 206650 210619 205887 209191
8545B09191P292N690P174Q248o93j1547q539l558r539Q483K465J193j302M540
$$ 209191 216483 222173 229347 237595 236902 225355 216816 213258 203719 212202 214667 215860 214558 219098
8531B19098J6678L0604K3622M3337L4305N12j8965p716k9042m5510l5570o411
$$ 219098 235776 266380 290002 333339 367644 368156 349191 341475 312433 266923 231353 224942
8519B24942M310J708j6731j3456L158O775Q881j3438L511o633R879M331R788J112
$$ 224942 229252 230960 214229 200773 203931 210706 219587 206149 209660 203027 212906 217237 227025 228137
8505B28137L725P78J3828K951R576m347n145O929j5249r911l079q535J87N850
$$ 228137 231862 232640 246468 249419 258995 254648 249503 256432 241183 231272 228193 219658 219845 225695
8491B25695P319J6171N9466O3439p232m9409m7589k5765k4854j1035j6738j155
$$ 225695 233014 249185 308651 372090 364858 315449 267860 242095 217241 206206 189468 188313
8479A88313o628q980o006j2888K410K967l09K073K2816J8843o997k741O704L336
$$ 188313 181685 172705 166699 153811 156221 159188 158879 160952 183768 202611 195614 192873 199577 202913
8465B02913k540O308L1453J8876j0549k6553j0742n454k1663o886j5829p160m885
$$ 202913 200373 206681 238134 257010 246461 219908 209166 203712 182049 175163 159334 152174 147289
8452A47289m710J3067Q519j0798n081J0689j250j0288p642J521j15j6462r599
$$ 147289 142579 155646 164165 153367 148286 158975 157725 147437 139795 141316 141201 124739 115140
8439A15140O491O575R291J8615J7141K0613k26j8550j9788q009J53m429l672n06
$$ 115140 121631 128206 137497 156112 173253 193866 193640 175090 155302 147293 147446 143017 139345 138839
8425A38839O078R265j3740q140J113K300J064q400o289N136k288k3172O194P581
$$ 138839 144917 154182 140442 132302 133415 135715 136779 128379 122090 127226 124938 101766 107960 115541
8411A15541O717q000r460q25J986R933K58p127l844mk454j1557p49J1430K3785
$$ 115541 122258 114258 104798 103973 105959 115892 116150 109023 105179 105175 102721 91164 90415 101845 125630
8396A25630K2966K3588P638j9409k2058k0739p636N189N527O363P278p364m355
$$ 125630 148596 172184 179822 160413 138355 117616 109980 115169 120696 127059 134337 126973 122618
8383A22618J940K220q043n045P33l693j719O239K2610l137j1040j0148q4n431
$$ 122618 124558 126778 118735 113690 114423 110730 109011 115250 137860 134723 123683 113535 113451 108020
8369A08020j0370m050J3428Q601j8465j1389k602J6585k794L593J900R898O651
$$ 108020 97650 93600 107028 115629 97164 85775 83173 99758 96964 100557 102457 112355 119006
8356A19006P321n819J507O708m211j2541J274J4477k0537j7975m759j195j4977
$$ 119006 126327 120508 122015 128723 124512 111971 113245 127722 107185 89210 84451 83256 68279
8343F8279J749P80M710J028K956J9019K716p787P101J5886O70k776j9646L584
$$ 68279 70028 70808 75518 76546 79502 98521 101237 93450 100551 116437 117107 114331 94685 98269
8329I8269k526j471J2183m828j9940P278J1876J539r36j2700o955j079m837n905
$$ 98269 95743 94272 106455 101627 81687 88965 100841 102380 101444 88744 81789 80710 75873 69968
8315F9968P45R20M925l490K137P693j0136m356J4142J7706j3076l050m318j142
$$ 69968 70713 71633 76558 73068 75205 82898 72762 68406 82548 100254 87178 84128 79810 78668
8301G8668J4015J2636k63r617L151J580m861R25Q492O650j1591o337J3202j2574
$$ 78668 92683 105319 105056 95439 98590 100170 95309 96234 104726 111376 99785 93448 106650 94076
8287I4076q639J039n316p561O219l729k0J4306M796j2333o276k121o947J111R760
$$ 94076 85437 86476 81160 73599 79818 76089 76069 90375 95171 82838 76562 74441 67494 68605 78365
8272G8365k285Q848r346n377J1982J2312n119k484k591n68k502r65N005P489p371
$$ 78365 76080 84928 75582 70205 82187 94499 89380 86896 84305 83737 81235 80270 85275 92764 85393
8257H5393o974r162r564O409j942J0075m429N536j050p908L543J0728M237J1489
$$ 85393 78419 69257 59693 66102 64160 74235 69806 75342 74292 66384 69927 80655 84892 96381
8243I6381p40K7125j1431q753m747On492l190j4213k09K182P948K798j0389j2536
$$ 96381 95641 122766 111335 102582 97835 97841 92349 89159 74946 74737 76919 84867 87665 77276 64740
8228F4740l105l70J1206J0055J1506J5227L071j0403k3919j1208r327M969Q948
$$ 64740 61635 61265 72471 82526 94032 109259 112330 101927 78008 66800 57473 62442 71390
8215G1390o897p966J1490J7767K0398O41o607J105m184n775o566j580O219k004
$$ 71390 64493 56527 68017 85784 106182 106823 100216 101321 97137 91362 84796 83216 89435 87431
8201H7431N835L464P296J7616J8651M825k695M348P308m513k0473j9207k2567
$$ 87431 93266 96730 104026 121642 140293 145118 142423 146771 154079 149566 129093 109886 87319
8188H7319L590J2039P333l930k4174r821O189n906l323q475k778J1246M86P998
$$ 87319 90909 102948 110281 106351 82177 72356 78545 72639 69316 60841 58063 69309 69795 77793
8174G7793L947R028K731k04j1640r105J7449J0675J4557r179n0L663M193m196
$$ 77793 81740 90768 93499 93295 81655 72550 89999 100674 115231 106052 106002 109665 113858 109662
8160A09662q367N021j494J0718j17l286k514r894m564Q870J1738O877J8569r317
$$ 109662 101295 106316 104822 115540 115423 112137 109623 99729 95165 104035 115773 122650 141219 131902
8146A31902p208L377P778m382O729M51O533J900o823n159r339m334Q985k572K906
$$ 131902 124694 128071 135849 131467 138196 138647 145180 147080 140257 135098 125759 121425 130410 127838 130744
8131A30744q269J0507Q606j3769p573Q480N627n642l23p176q062J1448J2444J2538
$$ 130744 122475 132982 141588 127819 120246 128726 134353 128711 128388 121212 113150 124598 137042 149580
8117A49580J222J538n640l941l623p031P33j5117p033j2414K009L710O022N04
$$ 149580 150802 152340 146700 142759 139136 132105 132838 117721 110688 98274 100283 103993 110015 110519
8103A10519r295j1314J3432J662J1837J8993M395J5559J843o897P143R977J3571
$$ 110519 101224 89910 103342 105004 116841 135834 140229 155788 157631 150734 157877 167854 181425
8090A81425k92J8799K4509K7340K0016J6029L1863L1247n116k3242j3819j353
$$ 181425 181133 199932 224441 251781 271797 287826 319689 350936 345820 322578 308759 307406
8078C07406j1476k5978J844N125j038k932l412R23q076l43n546j5835k3856k5056
$$ 307406 295930 269952 271796 276921 275883 272951 269539 270462 262386 262043 256497 240662 216806 191750
8064A91750j9614j152j7155j9250m945M643J1226O692N413j705r561q079J4933
$$ 191750 172136 170984 153829 134579 129634 134277 145503 152195 157608 155903 146342 138263 153196
8051A53196O49K629n831j5900P316J0424Q693J2333L5334N0487N2019M2539M5416
$$ 153196 153845 156474 150643 134743 142059 152483 161176 173509 208843 259330 311349 353888 399304
8038C99304M8886L6231J1392j0804k9368k8988k5163j0698l1632m4479k8866p689
$$ 399304 448190 484421 495813 485009 455641 426653 401490 390792 359160 314681 285815 278126
8026B78126j8278k2174j7774k1519q560o672j1015j0557k0660j8551Q179J5976
$$ 278126 259848 237674 219900 198381 189821 183149 172134 161577 140917 122366 130545 146521
8014A46521M757j1152n99r802l92J0226J793l129m849n12J605J4120J275N919
$$ 146521 151278 140126 139527 129725 129333 139559 141352 138223 133374 132862 134467 148587 149862 155781
8000A55781L182N97k261P792Q989K7932J2103O497M765j0338K416P130J888l523
$$ 155781 158963 159560 157299 165091 174080 202012 214115 220612 225377 215039 217455 224585 226473 222950
7986B22950k0437j5672k3893j3266n556N979k453j49K988q449j5153j6097j1133
$$ 222950 202513 186841 162948 149682 144126 150105 147652 147503 150491 142042 126889 110792 99659
7973I9659J304p804N158p608Q818J912o202L600M483j0372q910P102o763N123
$$ 99659 100963 93159 98317 90709 99527 101439 95237 98837 103320 92948 84038 91140 84377 89500
7959H9500K2000j1965o788R45l108j2523q706K1077j82K949j7752O74r343L467
$$ 89500 111500 99535 92747 93692 90584 78061 69355 90432 90250 93199 75447 76121 66778 70245
7945G0245K887j1591Q327O800j625j832L820J4181n60R567j0949j0935l497j1428
$$ 70245 73132 61541 69868 76668 75043 73211 77031 91212 90652 100219 89270 78335 74838 63410
7931F3410p421O924J1149N511J4311j0649j6010j1628J5185K354k8067j5482r039
$$ 63410 55989 62913 74062 79573 93884 83235 67225 55597 70782 73136 45069 29587 20548
7918B0548P786O803M111O19J4579O842j0137o727L119Q00J3759J0375m883p419
$$ 20548 28334 35137 39248 39867 54446 61288 51151 44424 47543 48343 62102 72477 67594 60175
7904F0175J2382p71M94J278j069n745l042M160l672J0948m485N290K631K271q277
$$ 60175 72557 71786 72280 73558 72489 66744 63702 67862 64190 75138 70653 75943 78574 80845 72568
7889G2568J772K622o961j6786q144L526J963j792P589N439L590K330l826n224
$$ 72568 74340 76962 70001 53215 45071 48597 50560 48768 56357 61796 65386 67716 63890 58666
7875E8666j2393r706Q311J64j863M168j5803K979L95K101N052K70n732M296k66
$$ 58666 46273 36567 44878 45042 43179 47347 31544 34523 34918 37019 42071 42341 36609 40905 40639
7860D0639j800j85m134Q504J5605M748n353r705p560m828m531N215J309k930k784
$$ 40639 38839 38654 34520 43024 58629 63377 58024 48319 40759 35931 31400 36615 37924 34994 32210
7845C2210O422J3831L940n46j766j747j7800O168J0015K360O363j9952m538p104
$$ 32210 38632 52463 56403 55857 54091 52344 34544 40712 50727 53087 59450 39498 34960 27856
7831B7856K759K259k581Q18m050o48R034q291r725K421q73l85L698m813K536J1825
$$ 27856 30615 32874 30293 31111 27061 26413 35447 27156 17431 19852 18979 18594 22292 17479 20015 31840
7815C1840J0169K204P329m378j7962q373m68j4737l927J0668J2j4564J505J1608
$$ 31840 42009 44213 51542 47164 29202 20829 20361 5624 1697 12365 12377 -2187 -682 10926
7801A0926O750j6354m43k851O038L743J8724l189r336l967j1203J9794J0519P999
$$ 10926 17676 1322 879 -1972 4066 7809 26533 23344 14008 10041 -1162 18632 29151 37150
7787C7150M910J387O873j044k0543k833J131K115M530p698R97k036K391P145M767
$$ 37150 42060 43447 50320 49276 28733 25900 27031 29146 33676 25978 26975 24939 27330 34475 39242
7772C9242j1765o577o143l357N339Q054n041j3514J429J3221m077J866N422K574
$$ 39242 27477 20900 14757 11400 16739 24793 19752 6238 7667 20888 16811 18677 24099 26673
7758B6673P801J8800m741j8125o444j19l350o726l788J262r113j805Q718o388
$$ 26673 34474 53274 48533 30408 23964 23845 20495 13769 9981 11243 2130 325 9043 2655
7744B655l524J4120J688J1369n463N358O801M661p426p133P807L958J855K625
$$ 2655 -869 13251 14939 26308 20845 26203 33004 37665 30239 23106 30913 34871 36726 39351
7730C9351q459j5487j6915O972K0861K2716J4204j61j2550j2959j5716m567R750
$$ 39351 30892 15405 -1510 5462 26323 49039 63243 63082 50532 37573 21857 17290 27040
7717B7040Q351N862j2754j336n424p643n556P492N253N309L693M374k0R269j8363
$$ 27040 35391 41253 28499 27163 21739 14096 8540 16032 21285 26594 30287 34661 34641 43910 25547
7702B5547j6098l949j0641l048N991Q583q0Q989J0572M762M318J888r50j4327
$$ 25547 9449 5500 -5141 -8189 -2198 6385 6305 15294 25866 30628 34946 36834 35884 21557
7688B1557L142j087j290l393O663k493k078K884r963J283O406k431k562r84n905
$$ 21557 24699 23612 22322 18929 25592 23099 21021 23905 13942 15225 21631 19200 16638 15654 9749
7673I749J295L102M683L462R20K537J115p332P835N664j0090j2811J232k545k596
$$ 9749 11044 14146 18829 22291 23211 25748 26863 19531 27366 33030 22940 10129 11361 8816 6220
7658F220P125P548k140l634R717k559j220J825j050r817L693J4418o722l272Q860
$$ 6220 13345 20893 18753 15119 24836 22277 21057 22882 21832 12015 15708 30126 23404 20132 28992
7643B8992O19J091j4568j5740L51J2681P444O66j264l871R338J0438k751j3921
$$ 28992 29611 30702 16134 394 745 13426 20870 21536 20272 16401 25739 36177 33426 19505
7629A9505j6387L818J1310L382J0145P322m92n875j0636L403P662n067J16L631
$$ 19505 3118 6936 18246 21628 31773 39095 38603 32728 22092 25495 33157 28090 28206 31837
7615C1837k036q839l110l700O703P188o553r308j36m117n679j3659j1524J1131
$$ 31837 29801 20962 17852 14152 20855 28043 21490 12182 12046 7929 2250 -11409 -22933 -11802
7601a1802Q95p208J7491R182N955j996m677p04q730j091k432J128J6889J0361
$$ -11802 -10907 -18115 -624 8558 14513 12517 7840 7136 -1594 -2685 -5117 -3989 12900 23261
7587B3261k689J997O197Q083r889j679N516k846j6635l370J3110P689K781N431
$$ 23261 20572 22569 28766 36849 26960 25281 30797 27951 11316 7946 21056 28745 31526 36957
7573C6957r207j1993P597O482r090k843n315j2314l159j8177J0809J4362l893
$$ 36957 27750 15757 23354 29836 20746 17903 12588 274 -2885 -21062 -10253 4109 216
7560B16P978l716J9763J4064K395j6900j0095J050l819o573L023J6660P314j7324
$$ 216 8194 4478 24241 38305 40700 23800 13705 14755 10936 4363 7386 24046 31360 14036
7546A4036r717j450l123Q349J1351N448P080m956l013l756J60n022j783J4135
$$ 14036 4319 2869 -254 8095 19446 24894 31974 27018 24005 20249 20409 15387 13604 27739
7532B7739m96j34o345j0618p727m446J0882m530J2007O550K5k393l173r504l826
$$ 27739 27243 27109 20764 10146 2419 -2027 8855 4325 16332 22882 22907 20514 17341 7837 4011
7517D011J2059M780m442r448r052K395J0813L192q745J938l990N72k549Q212J88
$$ 4011 16070 20850 16408 6960 -2092 303 11116 14308 5563 7501 3511 4083 1534 9746 9934
7502I934J286J33J727m020p165r067M386J543n736M032M710Q824M190k2563N991
$$ 9934 11220 11353 13080 9060 1895 -7172 -2786 -1243 -6979 -2947 1763 10587 14777 -7786 -1795
7487a795J4652l150Q154J6829R441j4374J386r402r90J3213q106k2449j7338Q964
$$ -1795 12857 9707 17861 34690 44131 29757 31143 21741 20751 33964 25858 3409 -13929 -4965
7473d965K6685R377p021n255m181j3920j1259J3197J0694J0004m340j1803J1325
$$ -4965 21720 31097 24076 18821 14640 720 -10539 2658 13352 23356 19016 7213 18538
7460A8538l695j6489J5666M900l545R39L682j1703j2538J286Q012r56o879J4431
$$ 18538 14843 -1646 14020 18920 15375 16314 19996 8293 -4245 -2959 5053 4097 -2782 11649
7446A1649J1928K608n816J220p406m205J3987j1146r928O820P8Q806l649k715
$$ 11649 23577 26185 20369 21589 14183 9978 23965 12819 2891 9711 9789 18595 14946 12231
7432A2231o307k350j3587l309M354o566J309O032m85K940O721q014q77n13Q647
$$ 12231 5924 3574 -10013 -13322 -8968 -15534 -14225 -8193 -8678 -5738 983 -7031 -7908 -8421 226
7417B26R865k173L559p109o542J0804M214M024N428J796j0656j0398P598K707
$$ 226 10091 7918 11477 4368 -2174 8630 12844 16868 22296 24092 13436 3038 10636 13343
7403A3343j9529J618J1029O093O765m115n74l334r501J281K560L743j778m544
$$ 13343 -6186 -4568 6461 12554 19319 15204 14630 11296 1795 3076 5636 9379 7601 3057
7389C057J309J2057L730j3809o861Q149J8742R587m826o730K1895L599k6936j3147
$$ 3057 4366 16423 20153 6344 -517 7632 26374 35961 31135 24405 46300 49899 22963 9816
7375I816p745q423J0060J4598J1531n559p462K832J670m249L861m812q463l756
$$ 9816 2071 -6352 3708 18306 29837 24278 16816 19648 21318 17069 20930 16118 7655 3899
7361C899M644m631J832J3976j0528j987m842J282j162o134J6238O128r109P022
$$ 3899 8543 3912 5744 19720 9192 7205 2363 3645 2483 -3651 12587 18715 9606 16628
7347A6628n917L96J2998M387r590n633j790j4668j1303M11K1470J2374l233o127
$$ 16628 10711 11107 24105 28492 18902 13269 11479 -3189 -14492 -14081 7389 19763 16530 10403
7333A0403j0458K696J754R980J79J301O845r428J259J42l748O197r47M153J0557
$$ 10403 -55 2641 4395 14375 14554 15855 22700 13272 14531 14673 10925 17122 16175 20328 30885
7318C0885J0574j4923j7821r204N310J5861q036k948J4923n336p345O15Q050n766
$$ 30885 41459 26536 8715 -489 4821 20682 12646 9698 24621 19285 11940 12555 20605 14839
7304A4839j6044j0834J3261R133O221j1677n864R336J4949O230M585o230J609
$$ 14839 -1205 -12039 1222 10355 16576 4899 -965 8371 23320 29550 34135 27905 29514
7291B9514M262q920K350j9421k2274J0597J7320O749p928p018J4500J3386n612
$$ 29514 33776 24856 27206 7785 -14489 -3892 13428 20177 12249 5231 19731 33117 27505
7278B7505j0027o905r942J216n509K273R464J2904L742p534j8068k999p17O432
$$ 27505 17478 10573 631 1847 -3662 -1389 8075 20979 24721 17187 -881 -3880 -4597 1835
7264A835r48Q205J2323N644N202p983j4214r141o628M609L629N90n647J889K742
$$ 1835 887 9092 21415 27059 32261 24278 10064 923 -5705 -1096 2533 3123 -2524 -635 2107
7249B107n692J1582J7059o229k430r133j1922P86k885Q118N386J1057l602L790
$$ 2107 -3585 7997 25056 18827 16397 7264 -4658 -3872 -6757 1361 6747 17804 14202 17992
7235A7992j6800j2456j425P873m312O364N217j13k974Q89l950P429M503l670J365
$$ 17992 1192 -11264 -12689 -4816 -9128 -2764 2453 2340 -634 255 -3695 3734 8237 4567 5932
7220E932k134o547O749M877K170J7251J7764K583o756l927q112l368j2834N105
$$ 5932 3798 -2749 4000 8877 11047 28298 46062 48645 41889 37962 29850 26482 13648 18753
7206A8753p701l566j717m925K720J6774k12o111J04n729n822p67J642j1846o669
$$ 18753 11052 7486 5769 844 3564 20338 20126 14015 14119 8390 2568 1801 3443 -8403 -15072
7191a5072l740K705J8869n958q367M907J436k381N675J1326O794k310j3674k2408
$$ -15072 -18812 -16107 2762 -3196 -11563 -6656 -5220 -7601 -1926 9400 16194 13884 210 -22198
7177b2198M51J9900J6634n818j4955J3354K530j9317j4852J4519K0358J9077p68
$$ -22198 -21747 -1847 14787 8969 -5986 7368 9898 -9419 -24271 -9752 10606 29683 28915
7164B8915o62m289n710n775r710k628j1062j07Q699J1276j39j0457J1543O761
$$ 28915 28253 23964 18254 12479 2769 141 -10921 -11028 -2329 8947 8808 -1649 9894 16655
7150A6655Q71k225Q29j0110q929n835K078L243O753N424M024N862n868O233q015
$$ 16655 17526 15301 16130 6020 -2909 -8744 -6666 -3423 3330 8754 12778 18640 12772 19005 10990
7135A0990k2714R643J1251k279p793J0726n550M580j965K195j14j7366j1603J4299
$$ 10990 -11724 -2081 9170 6891 -902 9824 4274 8854 6889 9084 8970 -8396 -19999 -5700
7121e700Q341o570o555J3212O823J0597R491L964j5776q977K80J652k761o579
$$ -5700 2641 -3929 -10484 2728 9551 20148 29639 33603 17827 8850 9130 10782 8021 1442
7107A442N505o124m972k464J2418N174N860m971J131J8719n204k966N531L805
$$ 1442 6947 823 -4149 -6613 5805 10979 16839 11868 12999 31718 26514 23548 29079 32884
7093C2884j9446k0082p154L955P770J0652K838P427n367l445j790q25m253o393
$$ 32884 13438 -6644 -13798 -9843 -2073 8579 11417 18844 13477 10032 8242 7417 3164 -3229
7079c229m142J3657R840r16j600N511m522r553m69l869p516L984J4153J891l400
$$ -3229 -7371 6286 16126 15210 13610 19121 14599 5046 4577 708 -6808 -2824 11329 13220 9820
7064I820p109J105R949L11j145L889r100R540j0429j9907J333Q801P543L703M888
$$ 9820 2711 3816 13765 14076 12931 16820 7720 17260 6831 -13076 -11743 -2942 4601 8304 13192
7049A3192j910n21J3739R258j842j4982j1559j0682N596r91j1343L007R261P614
$$ 13192 11282 10761 24500 33758 31916 16934 5375 -5307 289 -702 -12045 -9038 223 7837
7035G837M986n40r800j729L885k295J2294l745o333j486r79r525P249K351l463
$$ 7837 12823 12283 2483 754 4639 2344 14638 10893 4560 3074 2095 -7430 -181 2170 -1293
7020a293n259l749Q883J2991J865M509M351o339R57q633j1561k8173p49K5848
$$ -1293 -6552 -10301 -1418 11573 13438 17947 22298 15959 16916 8283 -3278 -31451 -32200 -6352
7006f352J179J82L264r947n931N015J6656K54L387N190p028j953J0564J2192j3440
$$ -6352 -5173 -4991 -1727 -11674 -17605 -12590 4066 4320 7707 12897 5869 3916 14480 26672 13232
6991A3232l3783P744L3625l967j4901M919q572n846J9498J170k199k932J582j850
$$ 13232 -20551 -12807 20818 16851 1950 6869 -1703 -7549 11949 13119 10920 7988 9570 7720
6977G720O77R918j3557j4053M116J0181k825j717P02o668N80j925L638N571O091
$$ 7720 8397 18315 4758 -9295 -5179 5002 2177 460 1162 -5506 -4926 -6851 -3213 2358 8449
6962H449R799p756j3033k99O972M251O150L786j0087o387Q329M729j0534r733
$$ 8449 18248 10492 -2541 -2840 4132 8383 14533 18319 8232 1845 10174 14903 4369 -5364
6948e364J714o571l629J5345L0339J3242r929p829n688P736p402o991q505o683
$$ -5364 -3650 -10221 -13850 1495 31834 45076 35147 27318 21630 29366 21964 14973 6468 -215
6934b15m498p452o181M091M490j0785L250J2081R869m409j0521J1982J4987P813
$$ -215 -4713 -12165 -18346 -14255 -9765 -20550 -17300 -5219 4650 241 -10280 1702 16689 24502
6920B4502k693l253j3864J928N161j0957j4303N769k004j1047m994q2Q801P54
$$ 24502 21809 18556 4692 6620 11781 824 -13479 -7710 -9714 -20761 -25755 -25837 -17036 -16282
6906a6282J4771M933R770K648N732k443m780j1773N091l807o834j3180j0247j8732
$$ -16282 -1511 3422 13192 15840 21572 19129 14349 2576 7667 3860 -2974 -16154 -26401 -45133
6892d5133n153K391J5932J4828J8115J6659o027j1788J1302Q896n986o991l595
$$ -45133 -50286 -47895 -31963 -17135 980 17639 11612 -176 11126 20022 14036 7045 3450
6879C450k34R406J038j566L423n437L310J3234j79k0204k573O409j6338j0009
$$ 3450 3216 12622 13660 12094 15517 10080 13390 26624 26445 6241 3668 10077 -6261 -16270
6865a6270Q671J1389j45l507M221L892J397n197L11M278N250J661J424P909P878
$$ -16270 -7599 3790 3645 138 4359 8251 9648 4451 4762 9040 14290 15951 17375 25284 33162
6850C3162o810k7058j2671k260J0246N813K971l483J853j332j1692n541l908K976
$$ 33162 26352 -706 -13377 -15637 -5391 422 3393 -90 1763 431 -11261 -16802 -20710 -17734
6836a7734k731k043J6000M800J648R945k2189o455J9937J1591k631M62j742k116
$$ -17734 -20465 -22508 -6508 -1708 -60 9885 -12304 -18759 1178 12769 10138 10600 8858 6742
6822F742k748j416J1824L67q698l450O800J465R265K065j51P26r044k4893p267
$$ 6742 3994 2578 14402 14769 6071 2621 9421 10886 20151 22216 22065 22791 13747 -11146 -18413
6807a8413J2930j0850p744J0190J999K144j654Q291p600j3084R76J4713O955n946
$$ -18413 -5483 -16333 -24077 -13887 -11888 -9744 -11398 -3107 -10707 -23791 -22815 -8102 -1147 -7093
6793g093k086o458r00n027J322J5738J5023M674J6664l426n849K511p475j8279
$$ -7093 -9179 -15637 -16537 -21564 -20242 -4504 10519 15193 31857 28431 22582 25093 17618 -661
6779f61r565Q902o536j0539o915P64O046J4325J0361n385o411N916L09j143P181
$$ -661 -10226 -1324 -7860 -18399 -25314 -24550 -18504 -4179 6182 797 -5614 302 611 -532 6649
6764F649P631M18P026J3291O496j0380l3950j0339L370M237P624J7691M608P438
$$ 6649 14280 14698 21724 35015 41511 31131 -2819 -13158 -9788 -5551 2073 19764 24372 31810
6750C1810K8488J7964K1269M1542O3062R5681Q5044L3245j3473m6380m5079o2945
$$ 31810 60298 78262 99531 141073 204135 299816 384860 418105 404632 358252 313173 250228
6738B50228n7442n5862l5712j9107j1986k282l561o262o570j2168k1274m95n268
$$ 250228 192786 136924 101212 82105 70119 67837 64276 58014 51444 39276 18002 17507 12239
6725A2239L387k699k249L698J557j0103Q406J5785j3113j6700N52k695O524J6477
$$ 12239 15626 12927 10678 14376 15933 5830 14236 30021 16908 208 760 -1935 4589 21066
6711B1066n566j1871O071J0561j693K460l890q525k010M743J773j078K794O883
$$ 21066 15500 3629 9700 20261 18568 21028 17138 8613 6603 11346 13119 12041 14835 21718
6697B1718l491k488p501N405J0255j3570j0501O269P79l94J604l922P017L929
$$ 21718 18227 15739 8238 13643 23898 10328 -173 6096 6875 6481 8085 4163 11180 15109
6683A5109o67q69r571m391j639q350J3267J0551q563K328l658N192m425l212p475
$$ 15109 14442 13573 4002 -389 -2028 -10378 2889 13440 4877 7205 3547 8739 4314 1102 -6373
6668f373O5J182M368K735O120M217J0673r870p323R466r552J104j1639O601J1964
$$ -6373 -6308 -5126 -758 1977 8097 12314 22987 13117 5794 15260 5708 6812 -4827 1774 13738
6653A3738q024q221m049J686J2562N03o618k319K937j097l497q252M838k056J0501
$$ 13738 5714 -2507 -6556 -4870 7692 8195 1577 -742 2195 1098 -2399 -10651 -5813 -7869 2632
6638B632K237j0147O14M851Q904L530j820k052n327j842j2853n500j0781P342
$$ 2632 4869 -5278 -4664 187 9091 12621 10801 8749 3422 1580 -11273 -16773 -27554 -20212
6624b0212N614K043n881j0224O21O481K4978J1091j6431p695P716Q611J3021R097
$$ -20212 -14598 -12555 -18436 -28660 -28039 -21558 3420 14511 -1920 -9615 -1899 6712 19733 28830
6610B8830n208j1815o534j673q899j4803L342J3647M941j043j1974N664Q067R993
$$ 28830 23622 11807 5273 3600 -5299 -20102 -16760 -3113 1828 785 -11189 -5525 2542 12535
6596A2535j221j1376N76J3793l456j4004p486n73K13K807J1307l203j4033j4404
$$ 12535 11314 -62 514 14307 10851 -3153 -10639 -11212 -10999 -8192 3115 -88 -14121 -28525
6582b8525Q472K0070J2618j784J101r266r308M465j681O002p943J559L642J951
$$ -28525 -20053 17 12635 10851 11952 2686 -6622 -2157 -3838 2164 -5779 -4220 -578 1373
6568A373r608m455o98j365K79O72J1100R14J562j2448m886N529O60j0626R509
$$ 1373 -8235 -12690 -13388 -14753 -14474 -13802 -2702 -1788 -226 -12674 -17560 -12031 -11371 -21997 -12488
6553a2488R785O376m205N890N525L377L237j1829j2283q119O990J3098M124k209
$$ -12488 -2703 3673 -532 5358 10883 14260 17497 5668 -6615 -14734 -7744 5354 9478 7269
6539G269k830N320N379l288k811J0224p060j3082O954M030j61r61M221j4541j5609
$$ 7269 4439 9759 15138 11850 9039 19263 12203 -879 6075 10105 9944 8983 13204 -1337 -16946
6524a6946p459J5534J2643m183j0826l755K128J030J425J0061K366K429j0776
$$ -16946 -24405 -8871 3772 -411 -11237 -14992 -12864 -11834 -10409 -348 2018 4447 -6329
6511f329n67R91k88J5668K586r568j043J3255J009k0454q701O802K325J6290J7905
$$ -6329 -6896 -5905 -6193 9475 12061 2493 1450 14705 15714 -4740 -13441 -6639 -4314 11976 29881
6496B9881m42o563p364j809J525k496j63L047l940j724O553r906j2800R696o185
$$ 29881 29439 22876 15512 13703 15228 12732 12569 15616 11676 9952 16505 6599 -6201 3495 -2690
6481b690K66k300l287Q995M144L067n549R869k138m394k132j9340l084M917J2356
$$ -2690 -2424 -4724 -8011 984 5128 8195 2646 12515 10377 5983 3851 -15489 -18573 -13656 -1300
6466a300L315n716n100k751N56j074P786J2901J7467M999j0109j6838Q136M81
$$ -1300 2015 -3701 -8801 -11552 -10996 -12070 -4284 8617 26084 31083 20974 4136 12272 12753
$$ [...]
##END NTUPLES=NMR SPECTRUM
##END=
