##TITLE=Analysis number 316071
Compound Code cc 34414
Book Reference 440/118
Project Code adrs
Chemist Name craigr
##JCAMPDX= 6.0         $$ Bruker NMR JCAMP-DX V2.0
##DATA TYPE= NMR SPECTRUM
##DATA CLASS= NTUPLES
##ORIGIN= Bruker BioSpin GmbH
##OWNER= NMR
$$ XWIN-NMR		Version 3.5
$$ Thu Dec 15 08:56:19 2005 GMT Standard Time (UT+0h)  MAYBRIDGE\NMR@NMR_250MHZ
##.OBSERVE FREQUENCY= 250.131544655141
##.OBSERVE NUCLEUS= ^1H
##.ACQUISITION MODE= SIMULTANEOUS (DQD)
##.ACQUISITION SCHEME= undefined
##.AVERAGES= 16
##.DIGITISER RES= 18
##SPECTROMETER/DATA SYSTEM= dpx250
##.PULSE SEQUENCE= zg30
##.SOLVENT NAME= CDCl3
##.SHIFT REFERENCE= (INTERNAL, CDCl3, 0, 16.522)
##AUDIT TRAIL= $$ (NUMBER, WHEN, WHO, WHERE, WHAT)
$$ ##TITLE= Audit trail, XWIN-NMR		Version 3.5
$$ ##JCAMPDX= 5.01
$$ ##ORIGIN= Bruker BioSpin GmbH
$$ ##OWNER= NMR
$$ C:\u/data/dgb/nmr/ADRS/13900/pdata/1/auditp.txt
$$ ##AUDIT TRAIL=  $$ (NUMBER, WHEN, WHO, WHERE, WHAT)
(   1,<2005-12-15 08:55:31.76 +000>,<MAYBRIDGE\NMR>,<NMR_250MHZ>,
      <created by zg, POWCHK disabled, PULCHK disabled
       configuration hash MD5:
       62 19 C7 07 E1 42 D1 B7 37 6C 3D D0 77 39 F9 E6
       data hash MD5: 64K
       2D 8F BB D3 5E 83 C2 EF 36 B5 F7 DA 19 51 4E 6E>)
(   2,<2005-12-15 08:55:54.24 +000>,<MAYBRIDGE\NMR>,<NMR_250MHZ>,
      <Start of raw data processing
       ef LB = 0.3 FT_mod = 6 PKNL = 1 SI = 32K 
       data hash MD5: 32K
       F2 66 AF 02 48 5B D6 25 21 D1 97 90 6E 26 10 F2>)
(   3,<2005-12-15 08:55:57.79 +000>,<MAYBRIDGE\NMR>,<NMR_250MHZ>,
      <apk 
       data hash MD5: 32K
       F7 17 DB 79 33 87 0B DE 29 41 62 44 F6 C6 33 98>)
(   4,<2005-12-15 08:55:59.21 +000>,<MAYBRIDGE\NMR>,<NMR_250MHZ>,
      <abs ABSG = 5 
       data hash MD5: 32K
       E3 BB 20 F9 CC 4D 23 C0 8A 1A B5 B8 C1 59 B0 9D>)
$$ ##END=
$$ 
$$ hash MD5
$$ 9E 84 B7 58 6A B4 20 16 F1 35 1E 4B 7D 83 F1 0E
##$RELAX= 
##$RELAX= 
##$RELAX= 
##$RELAX= 
##$RELAX= 
##$RELAX= 
##$RELAX= 
$$ Bruker specific parameters
$$ --------------------------
##$DU= <C:\u>
##$EXPNO= 13900
##$NAME= <ADRS>
##$PROCNO= 1
##$TYPE= <nmr>
##$USER= <dgb>
##$AMP= (0..31)
100 100 100 100 100 100 100 100 100 100 100 100 100 100 100 100 100 100 
100 100 100 100 100 100 100 100 100 100 100 100 100 100 
##$AQSEQ= 0
##$AQ_mod= 3
##$AUNM= <au_zg>
##$AUTOPOS= <1 >
##$BF1= 250.13
##$BF2= 250.13
##$BF3= 250.13
##$BF4= 250.13
##$BF5= 500.13
##$BF6= 500.13
##$BF7= 500.13
##$BF8= 500.13
##$BYTORDA= 1
##$CFDGTYP= 0
##$CFRGTYP= 5
##$CHEMSTR= <none>
##$CNST= (0..31)
1 1 145 1 1 1 1 1 1 1 1 1 1 1 1 1 1 1 1 1 1 1 1 1 1 1 1 1 1 1 1 1 
##$CPDPRG= <>
##$CPDPRG1= <>
##$CPDPRG2= <>
##$CPDPRG3= <>
##$CPDPRG4= <mlev>
##$CPDPRG5= <mlev>
##$CPDPRG6= <mlev>
##$CPDPRG7= <mlev>
##$CPDPRG8= <mlev>
##$CPDPRGB= <>
##$CPDPRGT= <>
##$D= (0..31)
0 1 0 0 0 0 0 0 0 0.06 0 0 0 0 0 0 0.0002 0 0 0 0 0 0 0 0 0 0 0 0 0 0 
0 
##$DATE= 1134636928
##$DBL= (0..7)
120 120 120 120 120 120 120 120 
##$DBP= (0..7)
150 150 150 150 150 150 150 150 
##$DBP07= 0
##$DBPNAM0= <>
##$DBPNAM1= <>
$$ [...]
##$SUBNAM7= <"">
##$SUBNAM8= <"">
##$SUBNAM9= <"">
##$SW= 20.6930455092707
##$SWIBOX= (0..15)
0 0 3 0 0 0 0 0 0 0 0 0 0 0 0 0 
##$SW_h= 5175.983436853
##$TD= 65536
##$TD0= 1
##$TE= 294.16
##$TE2= 300
##$TE3= 300
##$TEG= 300
##$TL= (0..7)
0 120 120 120 120 120 120 120 
##$TP= (0..7)
150 150 150 150 150 150 150 150 
##$TP07= 0
##$TPNAME0= <>
##$TPNAME1= <>
##$TPNAME2= <>
##$TPNAME3= <>
##$TPNAME4= <>
##$TPNAME5= <>
##$TPNAME6= <>
##$TPNAME7= <>
##$TPOAL= (0..7)
0.5 0.5 0.5 0.5 0.5 0.5 0.5 0.5 
##$TPOFFS= (0..7)
0 0 0 0 0 0 0 0 
##$TUNHIN= 0
##$TUNHOUT= 0
##$TUNXOUT= 0
##$USERA1= <user>
##$USERA2= <user>
##$USERA3= <user>
##$USERA4= <user>
##$USERA5= <user>
##$V9= 5
##$VALIST= <valist>
##$VCLIST= <CCCCCCCCCCCCCCC>
##$VD= 0
##$VDLIST= <DDDDDDDDDDDDDDD>
##$VPLIST= <PPPPPPPPPPPPPPP>
##$VTLIST= <TTTTTTTTTTTTTTT>
##$WBST= 1024
##$WBSW= 4
##$XGAIN= (0..3)
0 0 0 0 
##$XL= 0
##$YL= 0
##$YMAX_a= 548202
##$YMIN_a= -444857
##$ZGOPTNS= <>
##$ZL1= 120
##$ZL2= 120
##$ZL3= 120
##$ZL4= 120
##$ABSF1= 16.522
##$ABSF2= -4.171173
##$ABSG= 5
##$ABSL= 3
##$ALPHA= 0
##$AQORDER= 0
##$ASSFAC= 0
##$ASSFACI= 0
##$ASSFACX= 0
##$ASSWID= 0
##$AUNMP= <proc_1d>
##$AZFE= 0.1
##$AZFW= 0.1
##$BCFW= 0
##$BC_mod= 0
##$BYTORDP= 0
##$COROFFS= 0
##$CY= 12.5
##$DATMOD= 1
##$DC= 0
##$DFILT= <>
##$DTYPP= 0
##$F1P= 14.0000005364418
##$F2P= -0.99999901652339
##$FCOR= 0.5
##$FTSIZE= 32768
##$FT_mod= 6
##$GAMMA= 0
##$GB= 0
##$INTBC= 1
##$INTSCL= 1
##$ISEN= 128
##$LB= 0.3
##$LEV0= 0
##$LPBIN= 0
##$MAXI= 10000
##$MC2= 0
##$MEAN= 0
##$ME_mod= 0
##$MI= 0
##$NCOEF= 0
##$NC_proc= -5
##$NLEV= 6
##$NOISF1= 0
##$NOISF2= 0
##$NSP= 0
##$NTH_PI= 0
##$NZP= 0
##$OFFSET= 16.522
##$PC= 1
##$PHC0= 82.75835
##$PHC1= 7.832455
##$PH_mod= 1
##$PKNL= yes
##$PPARMOD= 0
##$PSCAL= 4
##$PSIGN= 0
##$REVERSE= no
##$SF= 250.13
##$SI= 32768
##$SIGF1= 0
##$SIGF2= 0
##$SINO= 400
##$SIOLD= 32768
##$SREGLST= <1H.CDCl3>
##$SSB= 0
##$STSI= 32768
##$STSR= 0
##$SW_p= 5175.98343685301
##$SYMM= 0
##$S_DEV= 0
##$TDeff= 65536
##$TDoff= 0
##$TI= <Analysis number 999999
Compound Code 99
Book Reference 9
Project Code 9>
##$TILT= no
##$TM1= 0
##$TM2= 0
##$TOPLEV= 0
##$USERP1= <user>
##$USERP2= <user>
##$USERP3= <user>
##$USERP4= <user>
##$USERP5= <user>
##$WDW= 1
##$XDIM= 32768
##$YMAX_p= 517400718
##$YMIN_p= -430149
$$ End of Bruker specific parameters
$$ ---------------------------------
##NTUPLES= NMR SPECTRUM
##VAR_NAME=  FREQUENCY,     SPECTRUM/REAL,   SPECTRUM/IMAG
##SYMBOL=    X,             R,               I
##VAR_TYPE=  INDEPENDENT,   DEPENDENT,       DEPENDENT
##VAR_FORM=  AFFN,          ASDF,            ASDF
##VAR_DIM=   32768,         32768,           32768
##UNITS=     HZ,            ARBITRARY UNITS, ARBITRARY UNITS
##FACTOR=    0.157963299565203, 1,           1
##FIRST=     4132.6476996994, 0,             0
##LAST=      -1043.33573715361, 0,           0
##MIN=       -1043.33573715361, -430149,     0
##MAX=       4132.6476996994, 517400718,     0
$$ Real data points
##PAGE= N=1
##DATA TABLE= (X++(R..R)), XYDATA
$$ [...]
22585C7791n1862j3108L4540j3865m2569M7745R6576M5387p9935n7255l8661r0824
22573a26040M3504N3200o500j49449L251J43125L0277N385O784K1007M518k3339
22561E723k2210j48953q2288L5330J39128N5272j55506M8004K3702J00289M8074
22550D6565n7263K5046M2614O9176R9J784N2164j03999p2542N7013M4054r8158
22538F553m1501K7491m9805k1972O5823P237M696m9274j5065n2058j6026K8330
22526a05571J05770K8882l8688j9254l9213J02155L0771o4031j17308o6618O3856
22515a19249Q5537O9710m9768L7801M6385m958M3752J1005q0999m5150m2129k8011
22503g6074j6350p3173j3241J42861R9893m5932m1897J0665J2553P169l9984j7787
$$ y = [37791, -14071, -27179, 7361, -6504, -49073, -1328, 95248, 140635, 60700, 3445, -35216, -126040, -82536, -29336, -35836, -185285, -182034, -38909, -8632, -3247, 3537, 24544, 29062, 5723, -16487, -165440, -247728, -212398, -73270, -17998, -173504, -125500, -101798, -1509, 46565, -10698, 14348, 56962, 126138, 126237, 128021, 180185, 76186, 3644, 60657, 104711, 6553, -34948, -7457, -57262, -79234, -13411, -6174, -1478, -50752, -65817, -117875, -133901, -105571, 199, 29081, -9607, -28861, -68074, 34081, 64852, 821, -116487, -183105, -119249, -33712, 35998, -13770, 24031, 70416, 65458, 109210, 120215, 39216, -5934, -48063, -76074, -92424, -165597, -178838, -35977, 63916, 17984, -23913, -13248, -695, 6474, -33510, -51297]
22491e1297k0728o5618N8876L5194l5987K3717M0977k9601j4419n3548K7292j2930
22479i8072P3840O2289q0636j15488p2423j08728J88360K16502m6066q4227l8235
22468a02884k232L1379l211l4076k9809J3883O1032J01884L8781m9630l975j7626
22456C516l6486n6543n1862L778J6134O6260N9651n0922J3363L3533O7253N6653
22444A24328r8079J4254l6813j2884k3547j5138L6926J7466l2694J2506J25793
22433A12118J854o0101n6802o4854q3125J0162R6772K0495k1804o9372L0554R4780
22421A0677J1186L4790n5472l3463o859K4651O360l8750N9763M8004j4980N2930
22409I8837j65r4754q5788J08724N9774j00196m5925L0406n1583l7147N0889J4787
$$ y = [-51297, -72025, -137643, -78767, -43573, -79560, -55843, -14866, -44467, -58886, -112434, -85142, -98072, -24232, 38057, -42579, -158067, -230490, -339218, -150858, 65644, 19578, -64649, -102884, -105116, -73737, -76948, -111024, -140833, -126950, -65918, 35966, 74747, 25117, 21142, 3516, -32970, -89513, -141375, -137597, -121463, -55203, 4448, -46474, -33111, 422, 67675, 124328, 26249, 40503, 3690, -9194, -32741, -47879, -10953, 6513, -26181, -13675, 112118, 113972, 53871, -2931, -67785, -150910, -140748, -43976, -23481, -45285, -114657, -84103, 10677, 21863, 56653, 1181, -32282, -39141, -14490, -8130, -46880, 12883, 60887, 45907, 98837, 98672, 3918, -81870, 26854, 86628, -13568, -59493, -29087, -80670, -117817, -66928, -52141]
22397e2141M6921M095j2458J432P3529P0006j09706o5771N9751K5257P2615m7504
22385F6026m9934L4565n1686q8489N7031Q9404L9270k7404Q7075n3674m4534k1685
22373C5965m8022j9273l4880p4310o1789L2220L3067j00049P3455O2273L0571
22362g0772M1617K3219k4173k6353L7069m7847l0498N2871M0185N3341n4142K9583
22350B4100N4802q3568o5028q8786j6483J13942M9149P4734N9120l3466j37885
22339d9369l3381n5383M9162J87220j788m6103n9286r5296Q9335O6129k6354m6386
22327b1500p5559N2049O700j08855q1638J10214Q5199l0685K3829J9327k8951
22316d9870J0136O6924m4788j8574N4435l5371j61870L3757J31262m6393p5899
$$ y = [-52141, -5220, -1125, -13583, -12151, 61378, 131384, 21678, -44093, 15658, 40915, 113530, 66026, 16092, 50657, -1029, -89518, -32487, 56917, 96187, 68783, 155858, 102184, 57650, 35965, -12057, -31330, -66210, -140520, -202309, -170089, -137022, -237071, -163616, -101343, -70772, -29155, -5936, -30109, -56462, -19393, -67240, -97738, -44867, -4682, 48659, -5483, 24100, 78902, -4666, -69694, -158480, -174963, -61021, -11872, 62862, 121982, 88516, -49369, -82750, -138133, -88971, 98249, 96461, 50358, -8928, -104224, -14889, 51240, 24886, -21500, -97059, -45010, -38310, -147165, -228803, -118589, -33390, -64075, -40246, -20919, -49870, -39734, 27190, -17598, -36172, 18263, -17108, -178978, -145221, -13959, -60352, -136251]
22305a36251r8817k5408L0335J12458L7983l4092r672J15562P8861L3011k6236
22294G7734j36174j06519P1868N8285J0551q0444p186J1718Q5463n288N2675N1686
22282H4369N2968o6807j00717j9018J9611N899q4472O8125M7745J844p5107R2992
22270B7432M5397L5500k4179J4727q0009j06209M162N7404o7997r7335J6246m8099
22258b22960J22635N0410M4917n9311K0097j3639Q3598K3270k522Q49m1254l8031
22246c1941K5934Q0225M9955l183j20688j5351M3770o9243J4164P3837l6406n5819
22234d4746L5297L86r3023k3485N3886Q6960O6345J1329p0948N3239j9500j2249
22222D3491Q4383j7053p3356p7701p4934n5114P277J7566K4513P0062N3076J12539
$$ y = [-136251, -235068, -260476, -230141, -117683, -79700, -113792, -123464, -7902, 70959, 103970, 77734, -58440, -164959, -93091, -34806, -24255, -104699, -111885, -100167, -14704, -19992, 32683, 84369, 137337, 70530, -30187, -49205, -29594, -23695, -108167, -40042, 7703, 9547, -65560, 27432, 72829, 108329, 84150, 98877, 18868, -87341, -83179, -25775, -93772, -191107, -174861, -222960, -100325, -49915, -4998, -64309, -44212, -57851, 25747, 49017, 46495, 47344, 6090, -31941, -6007, 74218, 124173, 120990, 302, -15049, 28721, -40522, -26358, 47479, 11073, -44746, -9449, -9063, -102086, -125571, -71685, 15275, 81620, 92949, 22001, 75240, 55740, 43491, 127874, 110821, 37465, -40236, -115170, -170284, -163007, -145441, -120928, -50866, 2210, 114749]
22210A14749l3379K186o958k1323l9764n7317J3128J2413p0730j13328L1404K6633
22198a42286R6893N1157k4180L981j5819l5327q975M6281K5669P1703p9128R260
22186g71k0877O7567M7953k9503q429l4519l2791j04630o6633Q7631K2125p9598
22174a52475m5723P0086P2278Q5650O4558m7535q7621j452N2484r903j4632q2190
22162i6475k0600J5446K3719J8223J0814J3739N2621M7864K2108r6276J9501O7802
22150G8486m026l612o5113o2633k248q1487l4526O3294R0948n2196m062O9253
22138g922L1786J7874l0496k609r4978J2732m5273l1941J00086j3601o8328o6268
22126a98938J14260R5051N471o1440K0134K190L5043R7279L9161j16504o8824
$$ y = [114749, 81370, 83556, 76598, 55275, 15511, -41806, -28678, -16265, -86995, -200323, -168919, -142286, -45393, 5764, -18416, -14435, -30254, -65581, -74556, -28275, -2606, 69097, -10031, -771, -21648, 45919, 93872, 64369, 55940, 21421, -11370, -116000, -182633, -95002, -72877, -152475, -198198, -128112, -55834, 29816, 94374, 46839, -40782, -42234, 10250, 347, -14285, -96475, -117075, -101629, -77910, -59687, -48873, -35134, 17487, 65351, 87459, -8817, 10684, 78486, 74460, 70848, 5735, -56898, -59146, -140633, -175159, -111865, -20917, -73113, -77175, -7922, 23864, 41738, 11242, 8633, -86345, -73613, -118886, -150827, -50741, -64342, -132670, -198938, -84678, 10373, 15844, -45596, -25462, -23272, 11771, 109050, 148211, 31707, -37117]
22115c7117Q487P5527M8458l0581n6117p4361N6920Q1747l3133l9982N1355M2350
22103I3553o9711q8443k6975o1968l79J13648O3486k8045n1110L1799M3499k2973
22091c619J03097R582j57541J02302M0918n3805k1760K8817R90L6488M7046n2553
22079G9962o0352O795m941p703o0870l6197L6973O9549J932K7303j4663p036N9790
22066I0542l0999q3146r3608l6415J15121P0471K0505n0540o9638n2246J45365
22055B5412P9985r5689j8601J1599L164o2970j7685L0663N1818M507q9116K7084
22043d9829J5810n5381j9022O6338J23974L3381j3262k4611k0121l4691n490j5446
22031A650n3061L8139n0699q3961n0302J2198M9589O0983l667k8777K0734K6048
$$ y = [-37117, -28630, 46897, 95355, 64774, 8657, -65704, -8784, 72963, 39830, -152, 51203, 93553, 23842, -64601, -91576, -153544, -153923, -40275, 23211, -4834, -55944, -24145, 19354, -3619, 99478, 109060, -48481, 53821, 94739, 40934, 19174, 47991, 48981, 85469, 132515, 79962, 19610, 26405, 21464, 13761, -47109, -83306, -46333, 23216, 25148, 52451, 37788, 30752, 90542, 59543, -23603, -117211, -153626, -38505, 31966, 52471, 1931, -67707, -119953, 25412, 105397, 9708, -8893, 2706, 5870, -57100, -74785, -44122, 7696, 12203, -76913, -49829, -34019, -89400, -108422, -42084, 81890, 115271, 102009, 77398, 57277, 22586, 17096, 1650, -51411, -13272, -63971, -147932, -198234, -186036, -136447, -75464, -79131, -107908, -87174, -61126]
22019f1126Q5213J24763J8214j33929j57596J115P9398q4950J61Q6906M7288M1386
22007D6843l5486N4318N3230n5881q1576o3701o773k868M968R0035N4993P3649
21995A31751n4127r6110k600K8419N1713k3757p9780O088n7631M9212K97o4533
21983a11058J9959P2301J4259j7256q109k272Q5599M8871n2793Q9803N1079o1463
21971A28920m2778o3439m3909j10221j2429K4907l4383m3268o084K0352R4355
21960h7977J39161J1066K594N7218k5546n5646j28155O8858K7685J35078p3692
21949G0644n3842J4692o8951J41460M3337j05653q5516o1149J09216O5456J3313
21938H3007j39558l7450R4646k5397P2456O2269j25675k1168J4639J4719M4492
$$ y = [-61126, 24087, 148850, 167064, 33135, -124461, -123346, -43948, -128898, -128737, -41831, 5457, 46843, 11357, 65675, 118905, 63024, -18552, -82253, -89026, -91894, -86926, 3109, 58102, 131751, 77624, -18486, -21086, 7333, 59046, 35289, -44491, -38403, -96034, -46822, -46525, -111058, -91099, -18798, -4539, -21795, -29904, -32176, 53423, 102294, 49501, 139304, 190383, 128920, 86142, 22703, -21206, -131427, -143856, -118949, -153332, -196600, -202684, -182332, -87977, 51184, 62250, 64844, 122062, 96516, 40870, -87285, -18427, 9258, 144336, 70644, 16802, 31494, -37457, 104003, 147340, 41687, -43829, -104978, 4238, 69694, 83007, -56551, -94001, 645, -24752, 47704, 109973, -15702, -36870, -22231, -7512, 36980]
21927C6980l6424K3285k6713l3564R304q1948J4409J25226k6605L3335P118M1358
21915H5761o6261j6652k819k7913j9914N9514L3312j21905q2766M390k9650Q5624
21903i9279Q9414K4270j25338m8795J4530M1699N0888j347J7132K0056J7571K3639
21891B4440P15P7776o5344j17624J3346J12236p452k9239q1746r6695M1791m077
21879a31873M372K9134K4391O3943R4885k4624o5488l0910K8834o2803o4892K6661
21867a08370M1470m2877N3318O2241J09335q375j3191j01646m1338J1204N0986
21856A2757n5298K4941k2693N4745J40670N9456o7220q6743o5950m2636J3426
21845c4545K4737k3539q6977r785J04140L306m7600O59N0469N8993n251p601P103
$$ y = [36980, 556, 23841, -2872, -36436, -27132, -109080, -94671, 30555, 3950, 37285, 44403, 85761, 19500, 2848, 29, -27884, -47798, 11716, 45028, -76877, -159643, -155253, -184903, -99279, -9865, 14405, -110933, -159728, -145198, -103499, -52611, -53958, -36826, -16770, 801, 24440, 25155, 102931, 37587, -80037, -66691, 45545, 38093, 8854, -72892, -169587, -127796, -131873, -127501, -98367, -73976, -10033, 84852, 60228, -5260, -36170, -7336, -70139, -135031, -108370, -66900, -109777, -56459, 5782, 115117, 106742, 93551, -8095, -49433, -38229, 12757, -42541, -17600, -40293, 14452, 155122, 214578, 147358, 60615, -5335, -47971, -34545, -9808, -33347, -120324, -130109, -25969, -22663, -70263, -69604, -19135, 39858, 34607, 27006, 34109]
21832C4109j1177p4891n3269k4058l133M0191j4023j3523L7906m3055J9347K6780
21820g8796Q99M8804O980q006K4414n2985J05461m7790O600k8022J432l4048J8895
21807c6162m7883q209Q9606K3881j22882l4779O7766j4901Q4996k802K1691L6762
21795E7084p6455K6379k9326J02774k4880p035q364j39219r1733m9390J05768
21784a34397O2945k2367o4491R792M4652M5091K7731J16947N2110j18519j4146
21773E348M3949n6637l4051j2609n2979R5839M4021j13917M806L7794O0792Q3771
21761A06127l9048m3959L6659P2827P7412l4026q5409L9128L4789m0263q0160
21750D4077o5134q5269R7561Q7759J1821o5070l1331l01m1852O7486n3545j0346
$$ y = [34109, 22932, -51959, -105228, -129286, -132419, -92228, -106251, -119774, -81868, -124923, -105576, -78796, -77897, -29093, -22113, -30119, -5705, -58690, 46771, -1019, 5581, -22441, -21009, -55057, -36162, -84045, -92254, -2648, 21233, -101649, -136428, -68662, -83563, 1433, -1369, 20322, 57084, -19371, 7008, -22318, 80456, 55576, 48541, 40177, -99042, -190775, -240165, -134397, -71452, -93819, -158310, -148518, -103866, -58775, -31044, 85903, 138013, 19494, 5348, 49297, -7340, -41391, -54000, -106979, -11140, 32881, -81036, -76230, -38436, 22356, 106127, 67079, 23120, 59779, 132606, 210018, 175992, 90583, 129711, 164500, 124237, 44077, -21057, -106326, -8765, 78994, 90815, 25745, -5586, -5887, -47739, 19747, -33798, -44144]
21738d4144N6315j04357n2578M0842P0684p007j7412J8465l4122j0148P0621l3098
21726d5939j04228l0243N1379K8818K3968L5742j6420L8608k7673n9499k825J85055
21714G6743O2208q5085j24260l7125j4993q1449K4986J45547J22421j0597p2496
21703E900j19825m5017L4368J18976o263o3915k9265O770k2213J0870R2713Q373
21691h528J1791L7252O4818o289o4672j46814l0848J2659M9514P257P3085M6297
21679D5522Q2638j01067j6966q1710j30384n3654K3636P002M4713k3609L0540
21668a73339N2034M1135R8514L7722l022j04223K0311K5855L845L946p864m728
21656i814P2645O7547K8740k5403r6750K2953n5732p2358j66845m7613J37950
$$ y = [-44144, 12171, -92186, -144764, -103922, -33238, -40245, -57657, -39192, -73314, -83462, -12841, -45939, -150167, -180410, -129031, -100213, -76245, -40503, -56923, -18315, -45988, -105487, -108312, 76743, 138951, 53866, -70394, -107519, -122512, -203961, -178975, -33428, 88993, 78396, 5900, -113925, -158942, -124574, -5598, -11861, -75776, -105041, -98271, -120484, -109614, -16901, -8528, 3263, 40515, 105333, 99044, 34372, -112442, -143290, -130631, -81117, -73860, -775, 45522, 128160, 27093, 10127, -71583, -201967, -255621, -231985, -224983, -180270, -203879, -173339, -121305, -80170, 18344, 56066, 53044, -51179, -30868, -5013, -1168, 2778, -5086, -9814, 62831, 130378, 159118, 133715, 36965, 59918, 4186, -68172, -235017, -282630, -144680]
21645a44680K9889R5468L0347n3728P440j4476m154M467M1735P3446p2996L7972
21633C0730K6862J6812j6415m2255J2485J2211j3184K7129K7533q0848l0094O163
21621b2871k8751M150Q191j8988j4203K6217J887J1542K15560P60r8840n5198
21609B9456M270n5846N4918m5980n7760O0294O4965O1491P5277l4822q5568m0133
21597C0562R6752m7920j20695l6245K9648J5906Q373M6608J781k1283k6871n6948
21585h0332j0375n121l7289k55K8392J6494j22632l4778K1350P5803P8639l3544
21573a03648K7819k2527m2061R7593O3682q298p2316N938N1126l466k8430J13860
21561G9272O7105q4958p1729J0281N7091L3409o8895p0206q0980J05301Q0169
$$ y = [-144680, -114791, -19323, 11024, -42704, -35264, -49740, -53894, -49427, -7692, 65754, -7242, 30730, 57592, 74404, 57989, 15734, 28219, 40430, 27246, 54375, 81908, 1060, -29034, -22871, -51622, -47472, -39281, -58269, -72472, -46255, -44368, -32826, 182734, 183494, 84654, 29456, 33726, -22120, 32798, -13182, -70942, -10648, 54317, 115808, 191085, 156263, 70695, 30562, 127314, 79394, -41301, -77546, -47898, -31992, -23619, 22989, 24770, 3487, -23384, -80332, -90707, -95828, -133117, -133372, -104980, -88486, -211118, -245896, -224546, -148743, -70104, -103648, -75829, -98356, -140417, -42824, 20858, 12560, -59756, -53818, -2692, -6158, -34588, 79272, 146377, 61419, -10310, -29, 57062, 90471, 21576, -48630, -129610, -24309, 55860]
21550E5860l9481o682n2006o484J190M8727q5774n0941j4695j7320l7448K8812
21538a76242K0800J1172L7366P5190o7967n3542J6686m9618R7426M3401M4559
21527g69j7175L0221N3473l9997k9884k3502l8971J5879j5417P602O5161O5823
21515G2444l0113l9789k9666p6819j7432N9125K469k6529M6228O4446l1260r6202
21503a03098o9688l1000j9504R5537P0087K9977j21187n5841N0043N2211P8105
21492b4358R155n0545K37J26461j1045m9466m6315K6557N1655k3736r431O2802
21480F1971P8009r3386k4801J22909L9258o7472j46320n8756M434J10017o3175
21469c7312o0038J00260L032l1961p7458j22568n9264M3689O2852R1807O617o7488
$$ y = [55860, 16379, 9697, -42309, -48793, -47603, 1124, -84650, -135591, -150286, -167606, -205054, -176242, -155442, -144270, -106904, -31714, -99681, -153223, -136537, -186155, -88729, -45328, -769, -17944, 12277, 65750, 25753, -4131, -27633, -66604, -50725, -66142, -58540, 6621, 72444, 42331, 2542, -27124, -103943, -121375, -62250, -59781, -86310, -40082, 24364, -6896, -103098, -172786, -203786, -223290, -127753, -57666, -27689, -148876, -204717, -154674, -102463, -24358, -15203, -65748, -65511, 60950, 49905, 439, -45876, -19319, 32336, 8600, -831, 61971, 139980, 46594, 21793, 144702, 183960, 116488, -29832, -88588, -84154, 25863, -37312, -97350, 2910, 5942, -26019, -103477, -226045, -285309, -241620, -178768, -86961, -80344, -147832]
21457a47832k6357N0717k6388L6400l1372k9736O7591j2498K1815P097O613p9161
21445a63111J9903P4089P2190m6640o7080p7535q020J05915L8689L7277M6693
21434C2370O447o6503q71j08058r1501L7276J31440O924Q010J9764J0222k0038
21422c4518m6819l3616K7111P8575n6701p3580P2022P2821j6840o0531L8992J25473
21410I2389o252j06652n3553P7996P3199l4972l2715j0627o3524M1949M5190l4646
21398a2218j11214l0113M6638m2534J4907J50813N3785k9875p7615l3683L4165
21387c6944m8044m4607l2957J03613J13473k0517l2966j3076k6773n7831j00331
21376a96960N2133J0011n2075K3220n501M5688K2997p3323L9113O9595J8657Q213
$$ y = [-147832, -174189, -123472, -149860, -113460, -144832, -174568, -106977, -119475, -97660, -90563, -83950, -163111, -143208, -69119, 3071, -43569, -110649, -188184, -196204, -90289, -51600, -14323, 32370, 38817, -27686, -28557, -136615, -228116, -190840, -59400, -52476, -44466, -24702, -14480, -34518, -81337, -114953, -87842, -9267, -65968, -139548, -67526, 5295, -11545, -72076, -33084, 92389, 86137, -20515, -74068, 3928, 77127, 42155, 9440, -1187, -64711, -22762, 22428, -12218, -123432, -153545, -106907, -149441, -134534, 16279, 70064, 40189, -37426, -71109, -36944, -84988, -129595, -162552, -58939, 54534, 34017, 1051, -12025, -38798, -96629, -196960, -144827, -134816, -186891, -163671, -169172, -123484, -100487, -173810, -134697, -65102, -46445, -38232]
21364c8232J50657J2722p7643l1706o9008l8182j106Q0517P2904M5419J6471r444
21352A13369j779K3172J5971o3904j21771n4715R9977J0768k9745j6948o3062
21341h8667M5115k8427j27527O09K1599L4335n065J12321J61443j6086o9262K2948
21329F3336p403r4087q8134O7104J3466P4937J46734l6937j0508Q5452n8782J9726
21317A74904m4539j2838k5604o0710p5207N141N5643O7327Q4584n936j21355j24021
21305h2611j9989N6563K4068M5128J5357K2904l4100M646Q200J5281N7893L1790
21293A45130q8395m9377n5612l4115O4887K2662j2480n9883N6191L7907j7796
21282I119K2457J4450q0234n7366O3077O650L0116N4916n1841l1611j2893O6394
$$ y = [-38232, 112425, 125147, 47504, 15798, -53210, -91392, -92498, -11981, 60923, 106342, 122813, 113369, 111590, 134762, 150733, 86829, -34942, -89657, 10320, 21088, -8657, -25605, -88667, -43552, -71979, -199506, -198897, -177298, -142963, -148028, -35707, 125736, 109650, 40388, 63336, 55933, -38154, -126288, -59184, -45718, 29219, 175953, 139016, 128508, 213960, 155178, 174904, 130365, 117527, 91923, 31213, -43994, -38853, 16790, 84117, 168701, 162765, 41410, -82611, -102600, -46037, -21969, 23159, 38516, 61420, 27320, 31966, 40166, 55447, 113340, 145130, 56735, 7358, -48254, -82369, -17482, 5180, -7300, -67183, -10992, 26915, 9119, 31576, 46026, -34208, -91574, -28497, -21847, 8269, 63185, 11344, -20267, -33160, 33234]
21270C3234p245o5934R944M1885P0795m5670j00479m1666K650K5422K3480j4785
21258f8369k8162n6519J7678k0977J3491l8591P1365O8722L7066O9949L4638J7688
21246A17979n3578p7650q4664l6186M7341p392j51891m9101O6010l8293J539L3705
21234b32181K74Q1754o620N8159L3576k432m6343J2304R5543O407L9804J07604
21222A47849r553n6748O548q7292j23838r2592O7055K5613J49088P011p5372o6111
21210a08342L5183R5711p146p7601j55140o8802M8529J19477P6083N0002k3862
21199a5908o2492l3688M2999J33889L3809k9691O9784j592m1978o744n9130K5861
21187E5119o6134m3945Q066k0708O2259P3687K4868p1850K9730n1538n3580k930
$$ y = [33234, 25989, -39945, -30001, 11884, 82679, 37009, -63470, -105136, -102486, -77064, -53584, -68369, -96531, -153050, -135372, -156349, -142858, -181449, -110084, -41362, -4296, 65653, 100291, 117979, 64401, -13249, -97913, -134099, -86758, -94150, -246041, -295142, -229132, -267425, -265886, -232181, -231907, -150153, -156773, -98614, -65038, -67470, -113813, -101509, -5966, 441, 40245, 147849, 138296, 81548, 88096, 804, -123034, -215626, -148571, -122958, 26130, 33141, -42231, -108342, -73159, 22552, 15406, -62195, -217335, -286137, -237608, -118131, -42048, 7954, -15908, -78400, -112088, -69089, 64800, 98609, 68918, 138702, 137110, 95132, 88388, 29258, 55119, -11015, -54960, -46894, -67602, -5343, 68344, 93212, 21362, 51092, -446, -54026, -56956]
21175e6956O6536J3569J509M646m6278J9904j136k8072l8418L9712m0416R2334
21163B6934M8050J0662m128n5069m3005n4401M4236P8269o547j09097k3826N6288
21151c1634l931q3479M4221N4156K6150k6915K4739R4242k341j30007p3860m6162
21139a54821M6816N8618m8937n3249M339O4649P4725P4177l1009n4500L6328M5669
21127F2805P0047J6611j08786n7978m914K4329L9668q2829l903l3765K6482M132
21115d8101J07546P3480n8084M5875o0317o9228J477K5646L3611Q2560j1684o4601
21103E8180M1401N1095k2300n7302o8341k9947L4363M2781r136j25825K7525n596
21091f3102k1715l3265M4766M4732l1226n0237j04869Q1670O3643J3499N2104
$$ y = [-56956, 9580, 23149, 24658, 29304, -16974, 2930, 1794, -26278, -64696, -24984, -65400, 26934, 74984, 85646, 81518, 26449, -16556, -70957, -26721, 51548, 45001, -64096, -87922, -31634, -35565, -119044, -74823, -20667, 5483, -21432, 3307, 97549, 95208, -34799, -108659, -154821, -108005, -49387, -98324, -151573, -147234, -82585, -7860, 66317, 35308, -19192, 17136, 62805, 132852, 149463, 40677, -17301, -22215, 2114, 41782, -41047, -44950, -78715, -52233, -48101, 59445, 132925, 74841, 120716, 60399, -8829, -7352, 18294, 51905, 134465, 122781, 58180, 99581, 150676, 128376, 71074, 2733, -27214, 7149, 49930, 40794, -85031, -57506, -63102, -84817, -118082, -73316, -28584, -59810, -110047, -214916, -133246, -69603, -56104, -4000]
21080d000L492m8706O048R5689K0564K9851N9864L378o3910n1801L2502p9765
21068C206j3380n567Q072J8696j2551o5437l719k3931k5274L8120m370L0792j1561
21055f6904j7508n9241J5958q52N235j0943j0340J31944J22005n8322p1998r072
21043c0038L098L4716k4932k320n0456O3579m6167j36018o707N1273N1921P9328
21031a2723N0190J1135k9611j0311n1821k2850k2983J04479J31979o2670l8290
21020D6524r8651m9295k778J8709M2275o197j8561k2774j5791J2812J207N9623
21008c2897p909o34K9451n1328n0258P5349N1575r193l8268K6232l0817k0607
20996e9304m4204L0429L5056R5018o820q6258l4917l9136O829K1973R4742L0571
$$ y = [-4000, -508, -49214, -43166, 52523, 73087, 102938, 162802, 166180, 102270, 50469, 82971, 3206, -10174, -15741, -7669, 11027, -1524, -66961, -70680, -94611, -119885, -81765, -86135, -55343, -66904, -84412, -143653, -127695, -128547, -123312, -134255, -144595, -12651, 109354, 51032, -20966, -30038, -26940, 7776, -17156, -19476, -69932, -6353, -52520, -188538, -195245, -143972, -92051, -12723, 37467, 48602, 18991, 8680, -43141, -65991, -88974, 15505, 147484, 84814, 46524, -52127, -101422, -104200, -85491, -43216, -49413, -67974, -90748, -106539, -93727, -92520, -32897, -40806, -41440, -11989, -63317, -113575, -38226, 13349, 4156, -34112, -7880, -38697, -59304, -103508, -73079, -38023, 56995, 50175, -36083, -71000, -110136, -103307, -81334, 13408, 43979]
20984D3979j93226m8810P1339l935K9167M9627p3663K1271J5553K9615K7197N6518
20972B4632j3071m4852L2071J4562r2801J5657R0841q4135l6782O827m6203N0053
20960h3201J57307J6234j13959R7374l6685K1451k870J035P2054o0084o1987Q1895
20948H8564M2588p5422p0956k8767l3689L739k5956M8030O124l9878K1452R2205
20936B8034P0768k3087m8615P6213p695m5618r1049r3693O5153O0790l3589r4803
20924a37191p5679L4831L3826q2485l53J13657L3022K392N2676l5709l8555l0498
20912a30066j4321M9584J4566n3809n598K9157L0252L7642l3316R6946k1271o6836
20900f7070j249m0477L5612k2149J8277l7633j73460k3526L8031K0776R4410P9812
$$ y = [43979, -149247, -198057, -126718, -130653, -101486, -51859, -125522, -104251, -88698, -59083, -31886, 24632, 11561, -33291, -1220, 13342, -79459, -63802, 27039, -57096, -93878, -87051, -133254, -83201, 74106, 90340, -23619, 73755, 37070, 58521, 55651, 56686, 128740, 68656, 6669, 88564, 131152, 55730, -15226, -43993, -77682, -73943, -99899, -51869, -45745, -85623, -64171, 28034, 98802, 75715, 27100, 103313, 95618, 50000, -41049, -134742, -69589, -8799, -42388, -137191, -212870, -178039, -144213, -226698, -227051, -113394, -80372, -77980, -25304, -61013, -99568, -130066, -144387, -94803, -80237, -134046, -139644, -110487, -80235, -42593, -75909, 21037, -234, -67070, -68319, -108796, -73184, -95333, -77056, -114689, -288149, -311675, -273644, -252868, -158458, -78646]
20888g8646O8936r9260j8960Q1218J3736N274K0278K4881n2028l8995K9864J5636
20876b8066m667L3501Q607P7620O6834p3486l5071R1587j6367q8525j13739k4258
20864a06030J12930L8258m5104k8297r610N2522P8638J8222K7284K1148J26k2943
20852A37144l6846M3669p9097k1738K3640L5520p370m6064j12382k172n3532R549
20840a09679M4744O2238k5265q4943J0767Q2526O1121j0086o0885k4506N0242
20829c726k0056L8205J007Q072l1001M9992o020k4646n2175N222R64K6966J26509
20816A19313K5984n6675p5902J9421q0953m268K2131q4019l0993K7520Q5693J0455
20804b2293K7336L8719q3993m5094j0785L6670R6305M5375k793r6445J8042K9264
$$ y = [-78646, -9710, -108970, -127930, -46712, -32976, -27702, -7424, 17457, -34571, -73566, -43702, -28066, -32733, 768, 9375, 86995, 153829, 80343, 45272, 136859, 120492, 31967, -81772, -106030, 6900, 45158, 54, -28243, -37853, 14669, 93307, 111529, 138813, 159961, 160087, 137144, 100298, 143967, 64870, 43132, 66772, 102292, 94922, 48858, -63524, -65696, -119228, -109679, -64935, -2697, -27962, -112905, -102138, -19612, 41509, 31423, -29462, -53968, -3726, -23782, 14423, 15430, 23502, -7499, 42493, 36473, 11827, -40348, -35126, -34162, -7196, 119313, 145297, 88622, 12720, 32141, -48812, -53080, -30949, -114968, -145961, -118441, -32748, -22293, 5043, 43762, -40231, -85325, -96110, -59440, 36865, 82240, 79447, -16998, 1044, 30308]
20792C0308j44098q0846J01144J11189J2923j23022j2713Q7883J8020L5076P20
20781C6584l9524n5688k1165j3653J20452N0564J0225J6454k523j16195n0282
20770f4751J1055j2380l5812k88j8931j2996M5253J22094K3355q1470k7386J9239
20758c3018L4341j5668n2957N495N7164R6389l558p8556m6501N5837K8055o7459
20746b0436l0494l9844K6940N4739r8255j14826l1565Q7260P1729j6536P599N5905
20734d7784m1628l8684J22191L9491j9905l7851P346K9693o816J8912L1788l8337
20722A8416l5291K6483L1929M2551P4779q4967j75277k9814N1621J22550J56219
20711A99199k7341p0288n1742o6869o5706q8516j5298N0605N7806R5561R1184
$$ y = [30308, -113790, -194636, -93492, 17697, 30620, -92402, -105115, -17232, 788, 35864, 36584, -2940, -58628, -79793, -93446, 27006, 77570, 87795, 104249, 101726, -14469, -64751, -53696, -66076, -101888, -102176, -121107, -134103, -88850, 33244, 56599, -24871, -52257, -33018, 1323, -14345, -67302, -61807, -4643, 91746, 88188, 9632, -36869, 18968, 47023, -20436, -50930, -90774, -63834, -9095, -107350, -222176, -253741, -166481, -94752, -111288, -103689, -47784, -89412, -128096, -5905, 33586, 13681, -24170, -16824, 12869, 6053, 24965, 56753, 18416, -16875, 9608, 41537, 84088, 158867, 73900, -101377, -131191, -79570, 42980, 199199, 171858, 101570, 49828, -17041, -82747, -171263, -186561, -135956, -78150, 17411, 108595]
20700A08595K3997j10530n0127k9765l2256M0039o5612l1110k9588M7962P0392
20689e8003k1247q280J980K0959r118q9587j2040K2451J0087L9128J1297n0243
20677a42616l0284O5123J48289J3563n7763p668l8552k5670j2482l7181o9873
20666a95114J8858R1187P4400m9785J6984L7156M7o3615j09887M1937J0220J40718
20654A3106J60184n5495q8288Q2718j28871r3653n89K8208L616j7438M8135l323
20642e1690p176o0793o5564N9243L8138J4280K4061j3838O4026l548m1160m4941
20630h8962M135N1216K6257q9188m1986J06834K8749j1336O6201j0226j4754q9877
20618f2937k1671N4605o2408k6304K5534P7909J9552l1255K7514k4467j14342
$$ y = [108595, 132592, 22062, -28065, -57830, -90086, -50047, -115659, -146769, -176357, -128395, -58003, -79250, -87530, -85550, -64591, -73709, -163296, -175336, -152885, -142798, -103670, -92373, -142616, -172900, -107777, 40512, 54075, -3688, -11356, -49908, -75578, -88060, -125241, -195114, -176256, -85069, -10669, -60454, -43470, -6314, -6267, -69882, -179769, -137832, -127612, 13106, 173290, 117795, 29507, 112225, -16646, -110299, -110888, -82680, -79064, -96502, -48367, -51690, -58866, -119659, -185223, -125980, -87842, -73562, -49501, -63339, 687, -2861, -44021, -88962, -84827, -33611, -7354, -96542, -138528, -31694, -2945, -14281, 51920, 41694, 26940, -62937, -84608, -30003, -92411, -118715, -93181, -15272, 4280, -26975, 539, -23928, -138270]
20607a38270m171L2645L7970q98Q566L2039J7059p0484L5922N7524j6716P4690
20595F5876M4084K8769R216j45091q9076O2541J12955J48308q577o7900j25423
20584C5682j13331K9983J43103K7448m6811l9228P7015k3585j06856L3727K5362
20573D2509P0086j10028l5893K041j4225L6767m2340j9294n3447l4052N155J07919
20561d4802P5908M651j95m9467J4227k84n9200n4326M8372P4370o4462m5409m434
20548a05051L7452j2134L0784M8440M3718J5815r6438m5138L0710l1038L688K8301
20536e0891O9522M0592m8212j9752O5939K8902n7560p4061k1129K3362L4652p2796
20524h1432N6351M4075J0450L9276n0980n6335J5425O3020Q1963L9833k5965o4742
$$ y = [-138270, -142441, -109796, -71826, -72724, -64158, -32119, -15060, -85544, -49622, 7902, -8814, 65876, 109960, 138729, 147945, 2854, -86222, -23681, 89274, 237582, 229005, 161105, 35682, -77649, -47666, 95437, 122885, 76074, 36846, 113861, 90276, -16580, 17147, 42509, 112595, 2567, -33326, -31285, -45510, -8743, -51083, -70377, -123824, -157876, -152721, -44802, 31106, 35757, 35562, -13905, 322, 38, -59162, -113488, -65116, 9254, -55208, -100617, -105051, -67599, -79733, -48949, -509, 43209, 59024, -37414, -82552, -51842, -82880, -79192, -50891, 18631, 59223, 11011, -8741, 57198, 86100, 28540, -45521, -66650, -43288, -8636, -81432, -25081, 18994, 29444, 68720, 17740, -38595, -23170, 39850, 121813, 161646, 135681, 70939]
20512G0939k2623j4565K5699n5042m7112L3063K6335j7054n6600P7876P9342n5181
20500D5077p1811o6663P0806k1805N605N0406N1693o7874n2796p3246q319L837
20488a35090Q76J6675P715J9285J8588o9347K5896J5541q4681M6507J15366N2790
20476C0121O3736R2544j16834r5035N5222M1539j29662k1325M0377R1460R9318
20465A51461N246p1392q5983J1206P6669j16317l0929k0745J31597l1448m9014
20454b9649J3867J644p4180K2272M5956n8017q4879k3762J43353P2813j1441m1234
20442b3257l7101k5648n5029J1929P3144L5865J19301M1511P7247j0886p5227
20431A31849j07357n4666M9180O6804l2954n6843m7250N7809j2128O6750L9835
$$ y = [70939, 48316, 33751, 59450, 4408, -42704, -9641, 16694, -360, -56960, 20916, 100258, 45077, -26734, -93397, -22591, -44396, -38791, 11615, 63308, -4566, -57362, -130608, -138927, -135090, -134214, -117539, -109824, -90539, -71951, -141298, -115402, -99861, -184542, -138035, -22669, 30121, 93857, 186401, 69567, -25468, 29754, 71293, -58369, -79694, -39317, 52143, 151461, 156707, 85315, -668, 10538, 87207, -29110, -60039, -80784, 50813, 19365, -29649, -15782, -14138, -88318, -66046, -20090, -78107, -162986, -186748, -43395, 29418, 17977, -23257, -60358, -86006, -141035, -129106, -55962, -20097, 99204, 140715, 217962, 207076, 131849, 24492, -30174, 19006, 85810, 52856, -3987, -51237, 6572, -5556, 61194, 101029]
20420A01029K0867K9288j6673n0795m4457K6414M9552R6358J5256k41231j73676
20409a88068j2971P9150k5240O311q371J2342L6491p3408m7172r54l307r355N0464
20396a84088N7022K4119J6606K4472R7928k8643p6088K3126l7236l503K5425K9222
20384c1638N6217J8780j24668m6964M8153n0025m6844R3527j643k4508O3972L6442
20372i199j7310N2303K6433J2752L4030O5075r399j10517k3466j6825o4001q2907
20360a43031L3011J58856O432J242p9518r139O1292N1617n5930m7332j2810M8742
20348A3432R8334K919m5012l4782r943l4143j4185J9947m3622k5331j8428j482
20336i2296n1431J5367N1497K1421l7923J2694L2419N9797M6942n0864j02579
$$ y = [101029, 121896, 151184, 134511, 83716, 39259, 65673, 115225, 211583, 226839, -14392, -188068, -201039, -121889, -147129, -140818, -149189, -136847, -100356, -173764, -220936, -221890, -225197, -234552, -184088, -127066, -102947, -86341, -61869, 36059, 7416, -68672, -45546, -82782, -86285, -60860, -31638, 24579, 43359, -81309, -128273, -80120, -130145, -176989, -83462, -85105, -109613, -45641, -9199, -26509, 25794, 52227, 64979, 99009, 164084, 154685, 44168, 20702, 3877, -60124, -143031, -110020, 48836, 55268, 56510, -23008, -32147, 29145, 80762, 24832, -22500, -35310, 13432, 111766, 114685, 69673, 34891, 24948, -9195, -23380, -3433, -47055, -72386, -90814, -92296, -143727, -128360, -76863, -55442, -93365, -80671, -48252, 11545, 58487, 7623, -94956]
20325i4956J3681N8545K4828j7398k775n8676M8351K8147J03824N5260j6964K7466
20313A69333j23366p9093o0839J7962J4878J28459Q9364j1681p4292p050p819
20302E5856j8981m7268j17757r9463L3753J55482J9225n9681m6105J6366J7949
20291i0624N4326P5469J5412n3072o477O0891k4144l3890P949p7951N350J8469
20279d8292l303m1271r4883K8984R7554P4660L2781j01186j10910P1395Q3665
20268a0806L0571K1817L7823l131j02109P2521J0714j41612K398J06972k2632
20257B526q1269m7372M24Q3379J28208J7835J1837l5989k1697l5581o5919j4150
20245e7768J5059J9639J5980J0668l7709k6927m038P236P9518n0553l1909K9637
$$ y = [-94956, -81275, -22730, 2098, -15300, -18075, -76751, -28400, -253, 103571, 158831, 141867, 169333, 45967, -33126, -93965, -76003, -61125, 67334, 156698, 145017, 70725, 63675, 55856, 36875, -10393, -128150, -227613, -193860, -38378, -19153, -78834, -124939, -108573, -90624, -36298, 39171, 54583, 1511, -4966, 55925, 31781, -2109, 5840, -72111, -66761, -48292, -51595, -92866, -187749, -158765, -61211, 13449, 46230, -54956, -165866, -94471, -10806, 19765, 41582, 79405, 76274, -25835, 46686, 57400, -84212, -81814, 25158, 2526, -78743, -126115, -125691, -42312, 85896, 103731, 115568, 79579, 57882, 22301, -43618, -57768, -42709, -23070, -7090, 3578, -34131, -61058, -65096, -57860, 21658, -28895, -60804, -31167]
20233c1167l8782o8449O8900j9250N1213O6069K1623m0592j2942m7197K800l7160
20221h4934J4911n0105L9056K0915m3762j3104K3985M0074j7751j1129J2016L5592
20209c4236R2350n9652j30186P6981J49073K1073p1282r0042o9871J8830J02931
20198E969L97O791L6745M6542M7383j00110o5238o5372K507m7042k1319L5065
20186a17682M8147j4001n8685p6174L1459R7684M6202L0977k9320O8977K230N4995
20174H4809j8502J6930N4849l9571R326J0556J3929r2690P753l4523j6831J7950
20162A3985N9721k7629o960L8M5942k3326N9788J6677j7742m1253j10429l9628
20150g0816Q828Q6324M3270J4064K1383p1329j44958m821O9312k1577n7564J07835
$$ y = [-31167, -69949, -138398, -69498, -88748, -37535, 28534, 50157, 9565, -3377, -50574, -47774, -84934, -70023, -120128, -81072, -60157, -103919, -117023, -93038, -52964, -70715, -81844, -69828, -34236, 58114, -1538, -131724, -54743, 94330, 115403, 44121, -45921, -115792, -96962, 5969, 6366, 13157, 49902, 96444, 143827, 43717, -21521, -86893, -84386, -131428, -152747, -117682, -69535, -83536, -142221, -218395, -186936, -89252, -43050, -12073, -41393, 27584, 29814, 84809, 66307, 83237, 138086, 98515, 107841, 118397, 132326, 39636, 47389, 12866, -3965, 13985, 73706, 46077, 39117, 39155, 85097, 61771, 121559, 138236, 120494, 79241, -31188, -70816, -61988, 24336, 67606, 81670, 103053, 31724, -113234, -118055, -48743, -70320, -127884, -20049]
20138b0049J70001o8793m9254Q3043m1764K42j37926k3817R6172M4030O1693P8068
20126A91646m6362o8255o4121J7142o7844O8928M0663p6315l581q681P561P6201
20114F6982j232J9435p210j7487N4526m7466j37739o300J18257R3242m3036l4811
20102E7161l4760o6039k8915L5433O5681M8197k1938n0308L607O089p0482p069
20090f3343P9362m112j0327o0905k4957K4971q6360p883O7300m6801J7695j3919
20078a29279J5938K6193m3423O4198O1029l8299J4690O0732L4637k7621L523k1697
20066B0621N6549Q2055j2864q7850j07045p4895L4712J17206R7681J00106J9576
20055B45852J7878p8285m7232q9209k649M8384N15k6161N973n8063K1936L265
$$ y = [-20049, 149952, 81159, 31905, 114948, 73184, 73426, -64500, -88317, 7855, 51885, 113578, 191646, 145284, 77029, 12908, 30050, -37794, 31134, 71797, -4518, -8099, -16780, -9219, 66982, 65750, 85185, 77975, 60488, 115014, 67548, -70191, -76491, 41766, 135008, 91972, 57161, 22401, -43638, -72553, -37120, 28561, 76758, 54820, 4512, 8119, 14208, -56274, -63343, 16019, 11907, 1580, -59325, -84282, -59311, -145671, -153554, -86254, -133055, -115360, -129279, -113341, -87148, -130571, -66373, -5344, -43643, -28953, 31779, 66416, 38795, 42318, 20621, 77170, 159225, 146361, 58511, -48534, -123429, -88717, 28489, 126170, 226276, 245852, 263730, 185445, 138213, 49004, 46355, 94739, 95254, 69093, 75066, 17003, 38939, 42204]
20043D2204q6205m8921N0548O9676n4522K805M4167k6087M176L4754q812p3305
20031d9522j43k6858q8580N6040O6629R9505k7602p8446k1721p4104m3528M3927
20019a44403J42808N2901p3129q5316r2049P2818N1017K6427M4665o7593j4173
20008h6027n8058N2459J23259j03655N8840Q0417J6745J8660k4755m1752K6857
19997F2990n881k8563l409j5091M9965j0388o7141k8465j00592L6214N2214J7804
19985d0343k6252j2132L9976M6553J17224j6302p1155p5755o7546r584R5692j2459
19973c2083K4394Q8038J4986k9273k0700j6812m2752J843k2912M2409Q6416L8353
19961A31907o2134J7286M0075K7506O33K1077L0062k5300r8361J3006k8180j08585
$$ y = [42204, -44001, -92922, -42374, 27302, -27220, -24415, 19752, -6335, -2159, 32595, 23783, -49522, -49665, -76523, -165103, -109063, -42434, 57071, 29469, -48977, -70698, -144802, -188330, -144403, -1595, 51306, -21823, -107139, -199188, -126370, -75353, -48926, -4261, -71854, -86027, -144085, -91626, 31633, -72022, -13182, 67235, 83980, 102640, 77885, 36133, 62990, 57109, 28546, 25137, 10046, 60011, 49623, -17518, -45983, -146575, -110361, -58147, -40343, -66595, -78727, -38751, 7802, 125026, 108724, 37569, -38186, -105732, -115316, -19624, -32083, -7689, 80349, 95335, 66062, 45362, 28550, -14202, -12359, -35271, 7138, 93554, 131907, 69773, 87059, 127134, 154640, 155273, 176350, 206412, 181112, 82751, 95757, 67577, -41008]
19949d1008l7652M7676J3019m016m6405J7595l2559j8734O6427L3584M0808m8350
19937i615k2721n067p3698k3225j6495M3469J06930J11776j03628j06626L7382
19926f1518m6632r8007l586K9434P5842Q8730J9592l0345K7494Q0314M4558J3138
19914A39014o763m5903l8307k2328M086m3033J188L3585k7074j18673k0114O6849
19902g7473N2436j6021m6496M916j6929O0339J00559Q505O1598L9448j1670M9509
19890B08721k5341k6970N7745k3301m0571N5700j02905q0777j7695Q2104O734
19879I3444j3451m3991p7793M1773j4212l4284l5785L6404J3116P0467N8641k06
19867I4123j73284j9167L5565Q5891K1480m6617r3781q558K084Q3121M0492N122
$$ y = [-41008, -78660, -30984, -17965, -21981, -68386, -50791, -83350, -102084, -35657, -2073, 38735, -9615, -32336, -37403, -111101, -134326, -150821, -107352, -422, 111354, 7726, -98900, -61518, -108150, -206157, -209743, -180309, -104467, -15737, 3855, -26490, 1004, 81318, 125876, 139014, 132251, 86348, 48041, 25713, 29799, -13234, -12046, 21539, -5535, -124208, -144322, -77473, -25037, -41058, -87554, -82638, -99567, -39228, 61331, 69836, 131434, 170882, 159212, 208721, 183380, 156410, 214155, 190854, 150283, 205983, 103078, 22301, 4606, 86710, 93444, 79993, 36002, -41791, -18, -14230, -48514, -84299, -47895, -34779, 35688, 94329, 94123, -79161, -98328, -62763, 23128, 44608, -2009, -95790, -104348, -102264, -19143, 21349, 26471]
19855B6471j34280j9191N3003J2662Q3851M69k7743j38N6863p3436P0944o0886
19843a1411p8967M094j24118n3961Q5576O7497Q9873O9410p5181M4412P302j7292
19831G234P1141q8321r1093R8109O3701O027l7145k6703k003Q1670k4326l7060
19819B1231O5400P4370J0772p2535j40981j1151P7919Q7286O985o6496p6229K2426
19807a003K1628L5001n2848o7967o6024j6464J9204J7088J1446Q9070R961P305
19795F397m6157m6546n9628Q2485P1412q8811K8398N2330J4427L5723P2270N7402
19783A79702l2922n5426K3667J979K2071n3189m753l5658K8986L4405l2466J0729
19771H7125m6882p0850O7316Q5261Q927j731l4503K4671j488N8691l9004L959
$$ y = [26471, -107809, -127000, -73997, -61335, 22516, 22985, -4758, -4896, 51967, -21469, 49475, -11411, -90378, -86284, -210402, -264363, -178787, -111290, -21417, 47993, -27188, 17224, 24526, 7234, 78375, -9946, -101039, -2930, 60771, 66798, 29653, 2950, 947, 82617, 58291, 21231, 86631, 161001, 171773, 99238, -41743, -52894, 25025, 112311, 119296, 52800, -23429, -1003, 20625, 55626, 2778, -65189, -131213, -147677, -128473, -111385, -99939, -10869, -908, 6397, -39760, -86306, -145934, -63449, 7963, -80848, -52450, -120, 14307, 50030, 122300, 179702, 146780, 91354, 115021, 117000, 139071, 85882, 81129, 45471, 74457, 108862, 76396, 87125, 40243, -30607, 36709, 121970, 130897, 129166, 94663, 119334, 117846, 176537, 137533, 141492]
19759A41492o5208r3161L0365O0238K4201n7834j48037j0770J09670Q130J01474
19748A00560N8283m0580k6805l5963l2549n7025j3044K9933m5507O9799K5945
19737C3047K0079l4900O6263O8465J07993p3070j96616m284K3944j05072l3783
19726a27934j0791P3577J00971J01133J01166p7507q4402N1566O3293O4820m6589
19715B09303m937q0405j05804Q902O78J9343L4282N7293j05438J7587M95o1199
19703i900q1658m262j2594O3865M8743j1533p7752L3705O5501K1748m0823r332
19691a4292M1571Q1980q3743j11302Q0159P4539m5150l920O3001l879k4128J0046
19679F4882j0044K9815j06828k639K8721L9437K1508n455o9840L4095k5302j18914
$$ y = [141492, 76284, -16877, 13488, 73726, 97927, 40093, -107944, -118714, -9044, -914, 100560, 158843, 118263, 91458, 55495, 22946, -34079, -47123, -17190, -62697, 7102, 33047, 53126, 18226, 84489, 152954, 260947, 187877, -8739, -13023, 10921, -94151, -127934, -138725, -65148, 35823, 136956, 238122, 160615, 76213, 127779, 191072, 255892, 209303, 204366, 123961, 18157, 27059, 27737, 47080, 81362, 138655, 33217, 50804, 51299, -9900, -91558, -95820, -108414, -44549, 4194, -7339, -85091, -51386, 14115, 35863, -4960, -14292, 27279, 109259, 25516, -85786, -5627, 68912, 23762, 19842, 82843, 78964, 54836, 64882, 54838, 84653, -22175, -24814, 3907, 43344, 64852, 59397, -10443, 23652, -1650, -120564]
19667a20564k6783J3533L7339J10256P7196l9873L285R1838l4974n570n596q0208
19655A9879m3328j4647J5271m4064l5840J182O3613J35969j9617P713L8566p4584
19643E0113L9154N3012M5816o4034p1977J03210j8098n2764n3870K0050M0255
19632I0867L5786M4878n220O3052J7014m6581m6599m2233o2159K6188Q5185L7909
19620A98087n6615J1845K0702k02q099m2013o2679k4070J8078L7084J0842n4155
19608D8805j47055L642K11344J9154l7801o2656m7582L6157m2271r0079N5825
19597e2517N1794m1589n2490L2968k617m5811J14104M3107P2301K4267N1397R5965
19585B90879o2993j28306K188o6194k2840j33798k350R214m9888J09756R1149
$$ y = [-120564, -147347, -133814, -96475, 13781, 90977, 51104, 54389, 146227, 111253, 105683, 100087, 19879, -23449, -38096, -22825, -66889, -102729, -101547, -37934, 98035, 78418, 86131, 124697, 50113, 89267, 142279, 188095, 124061, 52084, 155294, 137196, 84432, 30562, 50612, 90867, 126653, 171531, 166311, 229363, 246377, 199796, 153197, 110964, 48805, 74993, 160178, 198087, 141472, 153317, 174019, 173817, 165718, 123705, 61026, 36956, 55034, 92118, 102960, 48805, -98250, -94608, 116736, 135890, 98089, 35433, -12149, 24008, -18263, -108342, -52517, -723, -42312, -94802, -61834, -64451, -110262, 3842, 46949, 119250, 143517, 194914, 290879, 227886, 99580, 101768, 35574, 12734, -121064, -123414, -114200, -164088, -54332, 36817]
19574C6817n7762k3521l956K5289J25126j1378p4075N7565L0649j0462q3911q0758
19562g0377J1097J6180Q1926N2132M3840P5704l5139k278Q3015o5477q7150j58519
19550e5046L7688O8174l3616r444k8725j05288J9882J05981Q551J0864J9790N628
19538D4439L2411K3276J9457J09514p1886q0718J9227j1227K5290l2458j11020
19527c3695N0476J260J6300p8675m7451R0639l6735J19369M625L485m1869N7253
19515A04982R4503j9556j56613p9871o5686j3949l494K4071K3093N8005N1712
19504A7197L2357q6132p9199m6360k9318P5693J10703m804L1218L920n705m7842
19492b8272j23589R7984J61663Q739j7912q5152r0115k8640k8233M5058O9808
$$ y = [36817, -20945, -44466, -48422, -23133, 101993, 90615, 16540, 74105, 104754, 94292, 10381, -70377, -59280, -43100, 38826, 90958, 134798, 210502, 175363, 173085, 256100, 190623, 103473, -55046, -17358, 50816, 17200, 7756, -20969, -126257, -106375, -394, 8157, 19021, 38811, 44439, 76850, 100126, 119583, 229097, 157211, 76493, 95720, 84493, 109783, 77325, -33695, 16781, 18041, 34341, -44334, -91785, -1146, -37881, 81488, 86113, 89598, 47729, 104982, 199485, 179929, 23316, -56555, -122241, -136190, -139684, -115613, -92520, -34515, 17197, 49554, -36578, -115777, -162137, -191455, -115762, -5059, -9863, 21355, 25275, 19570, -28272, -151861, -53877, 107786, 116525, 98613, 13461, -76654, -105294, -133527, -88469, -18661]
19481a8661M3619o9143L4458R2996j1255r975q025l9082O6621P0639O5002K491
19469B19685j38098p7691o7244k6455o525Q2744J01451N5785l0103o6345n4842
19458g638L5858P021o5687l7141p9474k6295j6341J06888n439J9123K1059N9281
19446A1215j9543M083M4015o511o9563K5099l3507L4992N231N1833J6954J1451
19434G5749M6720o3856m5337n2854K8868M8978P6318m4476M9537j5938k9034J1998
19422H6673K9457j7312l5441P2110L3969o359p434J13158j3040r6797j33056q1909
19410e5981j7701J4290P3877N7050Q069j3723n7561o0894Q8088Q7093K4038k0547
19398A26098j10935m9419P6545q65L5800j19341r4292J49198J86408O8433p3345
$$ y = [-18661, 24958, -44185, -9727, 83269, 72014, 62039, 54014, 14932, 81553, 152192, 217194, 219685, 81587, 3896, -63348, -89803, -96328, -13584, 87867, 143652, 113549, 47204, -7638, 28220, 35241, -30446, -67587, -147061, -173356, -189697, -82809, -88248, -69125, -48066, 11215, -8328, -4245, 39770, 33259, -36304, -11205, -44712, -9720, -4489, 47344, 64298, 75749, 122469, 58613, 13276, -39578, -10710, 38268, 114586, 70110, 119647, 103709, 74675, 86673, 116130, 98818, 63377, 135487, 169456, 163097, 155663, 268821, 255781, 158984, 25928, -55981, -73682, -59392, 14485, 71535, 79604, 65881, 8320, -52574, 35514, 122607, 146645, 126098, 15163, -34256, 42289, 41424, 77224, -42117, -136409, 12789, 199197, 267630, 194285]
19387A94285n5041j4913p8288O8471l4811K2707R3560K3613J0636j48595j4246
19376F7378K4063J9787O2076O877k2724o4004p8968l0625J6047k8033k7494K9964
19364b5656R644P2584n6597n0602Q201J18107l992K9923j8395M6262k9899p5942
19352B3638k9943J07492J22092l8353j39349m0454l9310j1918M9315L435J4332
19341B0977L5026k8000m7698L2112j02488N1160R3661j6794m0916J10571R8257
19330B05868o215p696M9534k7618j13909k8345L3724l6777k5148q2900N7747M0841
19318E9106j6600K380j0894K7762M9356j4592m7353l0826L6198q829q0100m2468
19306g6860J6639J43558J04791n5060l2090q1651j02101r46Q0973O7363l4471
$$ y = [194285, 139244, 124331, 46043, 114514, 79703, 102410, 195970, 219583, 230219, 81624, 67378, 91441, 111228, 173304, 180181, 157457, 93453, 14485, -16140, -93, -28126, -55620, -25656, -16012, 56572, -25, -50627, -42426, 75681, 71689, 101612, 83217, 129479, 99580, 23638, -6305, 101187, 223279, 184926, 45577, 5123, -34187, -46105, 3210, 6645, 20977, 56003, 28003, -19695, 12417, -90071, -38911, 54750, 37956, -2960, 107611, 205868, 199653, 191957, 241491, 213873, 99964, 71619, 105343, 68566, 43418, -39482, 18265, 59106, 42506, 44886, 33992, 61754, 111110, 96518, 49165, 18339, 54537, 45708, -34392, -76860, -60221, 83337, 188128, 133068, 100978, 19327, -82774, -83720, -2747, 64616, 30145]
19295C0145j05222M7234k1710o3968Q2776J29138K4461p0958j3275J09164k4940
19284A22845l8982j9888R4422M4881p5075n2130M4740l4425j6273L0659P0039
19273A70813K1452K7748k7665j32986l9263J433K4645k1129m9700k0450j9097
19262f4199L8058O1969L7854m4853n4868k0170K5031j0040l7596m0653P4492P9394
19250D4419N2674J9527n753m5064r346P4730o3188M5827r875m2716M0067L3843
19238A35145k7978P720N034p9388k6224p093l233O325R5494O7252L6565k3565
19226A86054j04251j09419Q7843R5277o3242l3534p1226J7488k3935j9798O6181
19215B7438K9738J5733r7161K767M3512j590m5300j2871P7354R2377q833o2604
$$ y = [30145, -75077, -27843, -49553, -113521, -30745, 98393, 122854, 51896, 38621, 147785, 122845, 83863, 63975, 158397, 203278, 128203, 76073, 120813, 86388, 70115, 100774, 170813, 192265, 220013, 192348, 59362, 20099, 21532, 46177, 25048, -24652, -45102, -64199, -26141, 35828, 73682, 28829, -26039, -46209, -21178, -31218, -68814, -109467, -34975, 44419, 97093, 116620, 110867, 65803, 56457, 131187, 67999, 113826, 103951, 61235, 101302, 135145, 107167, 114887, 119921, 40533, 14309, 7216, 3983, 10308, 105802, 173054, 209619, 186054, 81803, -27616, 60227, 155504, 92262, 58728, -12498, 4990, -18945, -38743, 27438, 57176, 72909, -24252, -21485, 22027, 20437, -24863, -37734, 39620, 131997, 123164, 60560]
19203F0560L8001j2313m9966k4215N8862m8298j5104J904n5998j24991l3489J20856
19191h4191J17875O5621J51105r2330j04692K6431K279m3402J2424Q8592j1809
19180A27903j32463j6539M2495J6498K3216K2546K3434l4334Q4016J0289l8426
19169A28635K5231j1419j33611p7398K2832Q5312O6242J12289m5394m015M1184
19158B09888j22382r3258J5440M4699M4387K5634J01951n4858o8264l1357M6094
19147A17974J3732m1774k5061l2104o1134M017M2672N4015J8783j1006r625J3813
19135H4302p445M487m357M3692J1687o6086r950J5117p734j05027M450N5695k4870
19122f039L5896N4269O7005J15383n3756n9819j0222l8097J0682K5893q809j13678
$$ y = [60560, 98561, 86248, 36282, 12067, 70929, 22631, 7527, 9431, -46567, -171558, -205047, -84191, 33684, 99305, 250410, 158080, 53388, 79819, 82098, 38696, 51120, 139712, 127903, -4560, -21099, 21396, 37894, 61110, 83656, 107090, 72756, 156772, 167061, 128635, 153866, 142447, 8836, -68562, -45730, 39582, 105824, 218113, 172719, 168704, 209888, 87506, -5752, 9688, 54387, 98774, 124408, 226359, 171501, 103237, 71880, 117974, 131706, 89932, 64871, 32767, -28367, -24350, 18322, 72337, 91120, 80114, 70489, 84302, 76857, 81344, 76987, 120679, 132366, 66280, 56330, 71447, 63713, -41314, -36864, 18831, -6039, 29857, 84126, 151131, 266514, 212758, 152939, 142717, 104620, 115302, 141195, 132386, 18708]
19110A8708l8952M9623N7790K0168N4962K2392j30453q5273Q341O1628L0724m897
19098F4761o1004N4983N9216l4711m6355p49J0231Q465J15251L4152n3045r5054
19086E6141j32443k1971J22409Q160p0209O13N4884J23517Q8190P5284l8918k34808
19074C0849m7011J00656j8415o2276O8346P3743J2512q245K0691J4789K0014q604
19062A97049J5174K7705o396l0714m5887m5657k7134o7704j884J19598L2272O9122
19050B35544n2487L0557N948j40084j6488n6602J7748N8351J9129N1116j3231
19039A39501M5040N1843J0186o6360N7252k691m5473P4157P7206q472l2598q5462
19027B14129K4206k4424k7231k1824J6241J7260L9055M3207l3410J826k4817J1960
$$ y = [18708, -20244, 29379, 87169, 107337, 162299, 184691, 54238, -31035, -22694, 38934, 69658, 64761, 3757, 58740, 117956, 83245, 36890, 36141, 46372, 54837, 170088, 204240, 151195, 56141, -76302, -98273, 24136, 32296, -37913, -37300, 17584, 141101, 229291, 304575, 265657, 30849, -16162, 84494, 66079, 3803, 72149, 145892, 158404, 150159, 170850, 185639, 205653, 197049, 212223, 239928, 233532, 202818, 156931, 111274, 84140, 16436, 14552, 134150, 166422, 235544, 183057, 213614, 219562, 79478, 62990, 6388, 24136, 82487, 101616, 152732, 139501, 184541, 236384, 246570, 180210, 237462, 234771, 189298, 263455, 340661, 332189, 299591, 214129, 238335, 213911, 186680, 164856, 181097, 198357, 237412, 280619, 247209, 249035, 224218, 236178]
19015B36178J01679N7490O8197n0731o230J05512R2448J96140J53763L1168Q7676
19004A073290O8041J76282Q379j14047L8633O0666K4548p4054m3895q3083P6339
18993A211099J28439K57374J50914J44139Q553j15029o7105j33021k9234q8139
18983A467990p0285P0439J6828j02238j8051Q7925J26734R9318Q1671p4524p0760
18972A615047N677J48485K24944N5142R75L6574Q9785J27021J35914n3066j26893
18961B259605o2363J84460J80871q7443l06447j70133j78891j35677j69835j86221
18951A327926n4507j4570J33183J11405J21388J07321J16509J51394J44290p1185
18941B073154l4787o5613j17213k09824q9439J3381l5373M3211R6324q4139j11246
$$ y = [236178, 337857, 395347, 463544, 412813, 406583, 512095, 604543, 800683, 954446, 985614, 1073290, 1141331, 1317613, 1325992, 1211945, 1250578, 1311244, 1335792, 1261738, 1217843, 1134760, 1211099, 1339538, 1596912, 1747826, 1891965, 1900518, 1785489, 1718384, 1585363, 1556129, 1467990, 1397705, 1468144, 1484972, 1382734, 1364683, 1452608, 1579342, 1678660, 1760331, 1685807, 1615047, 1620724, 1769209, 1994153, 2049295, 2050270, 2086844, 2176629, 2303650, 2439564, 2386498, 2259605, 2197242, 2381702, 2562573, 2475130, 2168683, 1998550, 1819659, 1683982, 1514147, 1327926, 1273419, 1258849, 1392032, 1503437, 1624825, 1732146, 1848655, 2000049, 2144339, 2073154, 2038367, 1972754, 1855541, 1645717, 1556278, 1569659, 1534286, 1577497, 1673821, 1589682, 1478436]
18930A478436r5602j19971q4503j85900r3270o0297o6229j2678j00281j22966
18920E36739j69713p1723K1060l0947k929N6701P0968p533n9608l0444j412k5294
18908B85865Q8197K3496o6620o9270k6196O0701L4004j5756K5594J5640O684r7763
18896B64576l6300K035k0278p5602k504N5566K5236m4214M8828J0902o6054N4937
18884B17128J200J00915M9153j1183q2330j2227O9395K2771o442j826R635j0015
18872C46174m5105l6702K697M8093k0657l7183J5064N321q1406k1306N2733Q2957
18860C10680K4564j51297r8371L0183M1522L0844n793K7371N4871k9148M3274
18849B78700K7323l6433n6500J37189J01794j30114r1815l5260m4892M3547L8959
$$ y = [1478436, 1382834, 1262863, 1178360, 992460, 899190, 838893, 772664, 759986, 659705, 536739, 367026, 295303, 316363, 285416, 282487, 339188, 410156, 402623, 343015, 312571, 311159, 285865, 374062, 397558, 330938, 261668, 235472, 296173, 330177, 314421, 340015, 355655, 362339, 264576, 228276, 230311, 210033, 134431, 131927, 187493, 212729, 168515, 217343, 228245, 162191, 217128, 218328, 319243, 368396, 357213, 274883, 262656, 332051, 354822, 348380, 346554, 356189, 346174, 301069, 264367, 267064, 315157, 294500, 257317, 272381, 277702, 196296, 174990, 227723, 310680, 335244, 183947, 85576, 115759, 157281, 188125, 182332, 209703, 264574, 235426, 278700, 306023, 269590, 213090, 350279, 452073, 321959, 230144, 194884, 149992, 193539, 232498]
18838B32498K8500R4789J38850o29j41157K6387l821j9997j2468r8207J0217l558
18826B51404m7782O8981m3902r3926J2662R529O0286K1023n8485O4629O4654J5012
18814C24085p9105n9703N8936o5664M9016M3763m5354n368j2600J4410r225N9997
18802B73188J8592M6324M7701O182L338p0316p8365K465r542p9421o9820N1711
18790A42037J07466M4571k874p348o4975L419j2223l0126L7573q163Q1710N6635
18778C47702M0991j744K0970M5926k7607o5316O8153J3659p7673L212J5341J40069
18766E23683K27781K37860K16188k1606j17912j30875k5439n5666o1918j18442
18756F73654J3117m798l83O5830J9161J1620Q5397P5041l3154j42828j83122k3126
$$ y = [232498, 260998, 355787, 494637, 494008, 352851, 379238, 375417, 355420, 342952, 244745, 254962, 251404, 203622, 272603, 228701, 134775, 147437, 156966, 217252, 238275, 179790, 244419, 309073, 324085, 244980, 185277, 244213, 178549, 227565, 271328, 225974, 220606, 208006, 222416, 213191, 273188, 291780, 338104, 385805, 391987, 395325, 325009, 246644, 249109, 239567, 160146, 90326, 142037, 249503, 294074, 291200, 283852, 218877, 222296, 210073, 179947, 217520, 209357, 291067, 347702, 388693, 386949, 407919, 453845, 426238, 360922, 429075, 442734, 365061, 368273, 383614, 523683, 751464, 989324, 1205512, 1183906, 1065994, 935119, 909680, 854014, 792096, 673654, 686771, 681973, 681590, 747420, 766581, 778201, 863598, 938639, 905485, 762657, 579535, 556409]
18744E56409k822m4856p6398r6772J9747J9418l0739r797L3230n812L4183o0466
18732C35325P9768Q1966J9895n8848q5409J5331J1394p274K3794k2125M2903R2478
18720E29198L2397l0428k0051n8760m5270P0864J58006Q8770N7512l3476L3545
18709G82307L9565J34407K60468L33796M43069L87981K26311M1111N4839L05347
18699C009201M37866J89637N7520K9837J76002K44122q6196l48086k19812n8445
18689C431646J29148l8152k92379m01858m12565k42378k14805k09219l02574q5523
18679A361341r5106j41371r4735j28961j8733O4664Q851l7742M5511Q5189j68688
18668H80220j27423Q8370K3511n2798q241J5066j4411o2739j35830l6756J47387
$$ y = [556409, 553587, 508731, 432333, 335561, 355308, 374726, 343987, 334190, 367420, 361608, 395791, 335325, 415093, 497059, 516954, 458106, 372697, 388028, 399422, 392148, 415942, 393817, 436720, 529198, 561595, 531167, 511116, 452356, 407086, 477950, 635956, 724726, 782238, 748762, 782307, 821872, 956279, 1216747, 1550543, 1993612, 2381593, 2607904, 2649015, 2703854, 3009201, 3447067, 3636704, 3694224, 3724061, 3900063, 4144185, 4057989, 3709903, 3490091, 3431646, 3560794, 3522642, 3230263, 2828405, 2415840, 2173462, 1958657, 1749438, 1446864, 1361341, 1266235, 1124864, 1030129, 901168, 882435, 947099, 955950, 918208, 963719, 1048908, 880220, 752797, 841167, 864678, 811880, 803639, 818705, 804294, 741555, 605725, 568969, 716356]
18657G16356N1908K1364K3442m7498J6760o80j4058M5290M0197J472j00290r9543
18645F54720M6411k0011o7433R7346L8171J7693Q685m0692r3493j29962o150P0786
18633E76071J18116O9360Q362K214O4335P8545Q2504L0547L1844J5521L8858K8036
18621A144313L7460l9176j7204K8207j0529j3824J4247j7731J8929M4686n5212
18610A134166J17181q1857j62170p2319K4246k4L4345Q3031J62011O4663L9374
18599A342647M1875J73556J02959L0148k9043o0674J1491L7433o8090l204r4635
18588A484463j11140Q6961j902m5118K7223J54993J12260P9288L6742o3365Q598
18577A769003P955P6866M6693Q394R348l4619j59303j5186M6872L3552q598j16393
$$ y = [716356, 768264, 789628, 813070, 765572, 782332, 781652, 767594, 812884, 853081, 854553, 754263, 654720, 701131, 681120, 613687, 711033, 749204, 766897, 775582, 734890, 641397, 511435, 505285, 576071, 694187, 763547, 771909, 774123, 838458, 917003, 999507, 1030054, 1061898, 1077419, 1116277, 1144313, 1181773, 1142597, 1125393, 1153600, 1143071, 1129247, 1143494, 1125763, 1144692, 1189378, 1134166, 1251347, 1169490, 1007320, 935001, 959247, 959223, 993568, 1076599, 1238610, 1303273, 1342647, 1384522, 1558078, 1661037, 1691185, 1662142, 1601468, 1612959, 1650392, 1582302, 1579098, 1484463, 1373323, 1460284, 1458382, 1413264, 1440487, 1595480, 1707740, 1787028, 1823770, 1760405, 1769003, 1776958, 1853824, 1900517, 1908911, 1918259, 1883640, 1724337, 1709151, 1756023, 1789575, 1780977, 1664584]
18565A664584j42773M5048J97788J19784N5724L8860N4152O1391N6318R1167k110
18554B239933N6238M0289K7491K5658N2158J69424Q420Q314J21818J45688J9782
18543B915213N4952J13658J68433K69391L48880R9171J03900K23500J98733J57632
18533D653463K23769L24487L57476L67248N25799P80643Q92254R55952J095395
18524A0176486Q36044Q37268R02266J280408J562399K103203K905193M357955
18516B4961222O172052P807208Q013523O127311L131105O33785o36665r66931
18508E5242610r18498m30065R38847L787865Q185915J4532071K4700268M0315596
18500A46354609N9437589P4699989P6354880N8983818L0968943N880439j2561615
$$ y = [1664584, 1521811, 1566859, 1764647, 1884431, 1940155, 1979015, 2033167, 2094558, 2150876, 2242043, 2239933, 2296171, 2336460, 2363951, 2389609, 2441767, 2611191, 2619611, 2627925, 2749743, 2895431, 2915213, 2970165, 3083823, 3252256, 3521647, 3870527, 3969698, 4073598, 4297098, 4495831, 4653463, 4877232, 5201719, 5559195, 5926443, 6452242, 7232885, 8125139, 9081091, 10176486, 11012530, 11849798, 12752064, 14032472, 15594871, 17698074, 20603267, 24961222, 31133274, 38940482, 46954005, 53081316, 56212421, 56846206, 56209541, 55242610, 54324112, 53894047, 54832894, 58620759, 66806674, 81338745, 106039013, 146354609, 205792198, 280492187, 356847067, 415830885, 446799828, 452680267, 440118652]
18493D40118652k7459869m1266323n0934066n1855017m4569129l2066690j8007295
18486A73960263n503795K318009L265215j881404q492119j3047228j5428828j6757563
18478A18432550j7595942j7315563j5260427j1965376q420515n222014l019339
18471C9633374j477536o92662l60961k96228k27009j0250J52532N99982J547861
18462C8869103L140371N442000Q778827J3825900J9649559K3778441K3378043
18455A36862244J6887551P469270R8603l003227k751566P4811O215614J6392728
18447A78246028K9971473M5049313N9302538O9389875O8443786M9391690J4329072
18440E14123775k1487131m4379924n4843604n8983827o0701943n9019038n1151591
$$ y = [440118652, 412658783, 371392460, 320458394, 268603377, 224034248, 191967558, 173960263, 168456468, 170774477, 174039692, 172158288, 163666169, 150618941, 135190113, 118432550, 100836608, 83521045, 68260618, 56295242, 47874727, 42652713, 39633374, 38155838, 37463176, 37102215, 36805987, 36578978, 36568728, 36721260, 37321242, 38869103, 42009474, 47451474, 56230301, 70056201, 89705760, 113484201, 136862244, 153749795, 161219065, 161317668, 158314441, 155562875, 155637686, 161853300, 178246028, 208217501, 253266814, 312569352, 381959227, 450403013, 499794703, 514123775, 492636644, 448256720, 393413116, 334429289, 273727346, 214708308, 163556717]
18433A63556717l8988569k6417807j5985656q346456k695977J229564K832642
18426G5184458J869675j178391m167503n978379o719604p020992p243900o929274
18418C7816090o074689m738909l410289k363722j672272j331887j203298r84234
18410A6036790q60899o43307o93582j090823j160168r89223q14384n34631l73025
18401H876748k94005r4979L13898M29115L23603M90k56174k42331j62360j97171
18391H696834m33171n26339l08667r2132J64572Q8758k74241k28230K0065K54407
18381G361856M14282L60061K96339O39532J112935J352394J070014M75868j00139
18372A2983142l15779k35291j84426m35650o49135n43883l41902j8560K30269
$$ y = [163556717, 124568148, 98150341, 82164685, 73818229, 71122252, 72351816, 75184458, 77054133, 75875742, 71708239, 65729860, 59010256, 51989264, 44745364, 37816090, 31741401, 27002492, 23592203, 21228481, 19556209, 18224322, 17021024, 16036790, 15175891, 14532584, 13839002, 12748179, 11588011, 10598788, 9784404, 9249773, 8876748, 8582743, 8487764, 8801662, 9230777, 9554380, 9554870, 9298696, 9056365, 8894005, 8696834, 8263663, 7737324, 7428657, 7336525, 7501097, 7589855, 7315614, 7087384, 7107449, 7361856, 7776138, 8136199, 8432538, 9072070, 10185005, 11537399, 12607413, 13083281, 12983142, 12667363, 12432072, 12247646, 11811996, 11162861, 10618978, 10277076, 10258516, 10488785]
18363A0488785K65648M29986N45817M19043K70761K51764K49050M34840N46842
18354A3902536P84293R73330R74847J298224J826009K460845L181078M259974
18346B9661136N778845Q317443J2650498K1474848L6790776N1828822M6351671
18339B12854039J8571311n16647Q135704K9802980L9178112J7751222j5119852
18332C10656869j9439929N340642K7360778J8644433j4702898l1280328j4558435
18325B82021132J2752271K3122531K91188l4011428m3722877l2572243k4280522
18318A83600052k6504327l2367587l1260217k2921393j4830795r754376o763060
18311C9198297n073514l815788l112875k648104k179346j869872j638827j512382
$$ y = [10488785, 10754433, 11184419, 11730236, 12149279, 12420040, 12671804, 12920854, 13355694, 13902536, 14686829, 15660159, 16635006, 17933230, 19759239, 22220084, 25401162, 29661136, 35439981, 43757424, 56407922, 77882770, 114673546, 166502368, 212854039, 231425350, 230908703, 239044407, 268847387, 308025499, 325776721, 310656869, 291216940, 296557582, 323918360, 342562793, 327859895, 296579567, 282021132, 294773403, 317895934, 318187122, 284175694, 240452817, 207880574, 183600052, 157095725, 124728138, 93467921, 70546528, 55715733, 45961357, 39198297, 34124783, 30308995, 27196120, 24548016, 22368670, 20498798, 18859971, 17347589]
18303A7347589j242014j088518j050620j022818r28916o93467m86868m87510n21175
18294I825683o53211m53967l44546m19004o55722p48520n40446j54816j11465
18285E743986j54600r9296N4537L30108M08799J96990p9527l04809k88687l35486
18275E472015m73894m56633n51374n37044l59014l67134j57878O726P0062r4639
18265B551193j42108j68937j80450j24666j06997j21519j11864r0670q7062l5851
18255A381069o9001L8887L6047K3124m1768J0542j5200m3506k329j9959k7090
18244A270816J43411J07602j19554J23882K08391K2897j4854J9571L7030j65346
18234A633846j44248P616J05732J4105J45203K41096L92146N60058M99312L26196
$$ y = [17347589, 16105575, 15017057, 13966437, 12943619, 12014703, 11321236, 10834368, 10346858, 9825683, 9172472, 8718505, 8373959, 7954955, 7299233, 6550713, 6010267, 5855451, 5743986, 5589386, 5490090, 5544627, 5874735, 6283534, 6480524, 6400997, 6096188, 5807501, 5472015, 4998121, 4541488, 3990114, 3453070, 3094056, 2726922, 2569044, 2575770, 2645832, 2551193, 2409085, 2240148, 2059698, 1935032, 1828035, 1706516, 1594652, 1503982, 1416920, 1381069, 1312068, 1350955, 1387002, 1410126, 1368358, 1378900, 1363700, 1320194, 1317865, 1297906, 1270816, 1414227, 1521829, 1402275, 1526157, 1734548, 1757445, 1742591, 1762162, 1799192, 1633846, 1489598, 1497214, 1602946, 1617051, 1762254, 2003350, 2395496, 2955554, 3454866, 3781062]
18224C781062J88758n3773j52154r0381j75070l49555l57541k21713k31059l23220
18214B015354k33470o3915O9469K1443o680K4016j9386M0211K1254n8324n4210
18203A755762m3818K5278K18056L38937L66579O78439P50899N99742M23133O4041
18193E177048j56884l22144k81343m43542n90453m90417m62454l95917j67801
18184A866093J2362J50582P1950P127m4615j28173k04810j88697k57236k35053
18174A049530k16147j04226J04844J68058L0397J14528J70612K38278J95661P3259
18164A824794L3265k5531j16963j04417j1929n1679K4369K00118K26337K20332
18154B218696j0760l3489K0141J549o3150J46459J23291J55320L45931N35650
$$ y = [3781062, 3969820, 3916047, 3763893, 3673512, 3498442, 3148887, 2791346, 2569633, 2338574, 2015354, 1781884, 1717969, 1787438, 1808881, 1802201, 1826217, 1806831, 1847042, 1868296, 1809972, 1755762, 1711944, 1737222, 1955278, 2294215, 2660794, 3339233, 4090132, 4689874, 5113007, 5177048, 5020164, 4698020, 4416677, 3973135, 3382682, 2892265, 2429811, 2033894, 1866093, 1878455, 2029037, 2100987, 2108114, 2063499, 1935326, 1730516, 1541819, 1284583, 1049530, 833383, 729157, 834001, 1002059, 1032456, 1146984, 1317596, 1555874, 1751535, 1824794, 1858059, 1832528, 1715565, 1611148, 1599219, 1547540, 1571909, 1772027, 1998364, 2218696, 2207936, 2174447, 2194588, 2196137, 2132987, 2279446, 2402737, 2558057, 2903988, 3439638]
18144C439638O98556P93432O70627L49923L4161l17398n97071n62766n78536n61539
18134C369027n12151l34872j46669j11710n2916q835Q8825K06482K34937J29142
18124B861260Q7744Q654J81756K86119L33553M37120N48348O26678P08129R53892
18114G033253J392118J949236K765361L960690O186480J1119026K1986538L8461660
18106I4854362L6554568K318619j9789533j3775793p212754q948136j7710138
18099F6291195k2021578j5116389q468290m924229l165266k093697j567908j165319
18091G768519q74520p88395o87859o26461n02372l65380l73997l66641l29717
18082B853177j62322j95758k35653k06187k63670k23859j46292r7687J12878R8236
$$ y = [3439638, 4138194, 4931626, 5602253, 5952176, 5986337, 5668939, 5071868, 4509102, 3930566, 3369027, 2856876, 2522004, 2375335, 2263625, 2210709, 2201874, 2290699, 2497181, 2732118, 2861260, 2949004, 2957658, 3139414, 3425533, 3759086, 4196206, 4744554, 5371232, 6079361, 7033253, 8425371, 10374607, 13139968, 17100658, 23287138, 34406164, 56392702, 94854362, 131408930, 133727549, 113938016, 100162223, 92949469, 84001333, 66291195, 44269617, 29153228, 20684938, 15760709, 12595443, 10501746, 8933838, 7768519, 6893999, 6105604, 5417745, 4791284, 4288912, 3923532, 3549535, 3182894, 2853177, 2690855, 2495097, 2259444, 2053257, 1789587, 1565728, 1419436, 1321749, 1434627, 1532863]
18072A532863n1987j48735j2897p8391j09074j31439j02690q4288j0603l7796
18062G64963o1621j08000k3826K6861K9333M1151j34603j16447N2304M55l3055
18051D37515j1107p3714k4048M2121m3574K2277j2773K6966Q2591K5908r5810
18040C76352k6908N9565M0167j07815N5226L7413M0905O7012M115j02626p7101
18029C66305p3728j22575m5751K7083N9613j3442O3411j0042q6094r0746O4922
18018A38956O8247N1035M0833J34670J27771K3552n2700J01520K40788N8159j18604
18007H14227L3052J15879M6144J3910K2149J6092J66673J00489L916P9205J4696
17996A426432m3667L7222J31311J36546Q5550K2143p6888O7006K04459k7702p3224
$$ y = [1532863, 1480876, 1332141, 1319244, 1240853, 1131779, 1000340, 897650, 813362, 802759, 764963, 703342, 595342, 571516, 598377, 627710, 668861, 534258, 417811, 470115, 470570, 437515, 426408, 352694, 328646, 370767, 327193, 349470, 336697, 363663, 446254, 472162, 376352, 349444, 409009, 449176, 341361, 396587, 434000, 474905, 541917, 546032, 443406, 366305, 292577, 170002, 124251, 151334, 210947, 197505, 260916, 250874, 164780, 74034, 138956, 207203, 258238, 299071, 433741, 561512, 585064, 532364, 633884, 874672, 932831, 814227, 847279, 963158, 1009302, 1023212, 1045361, 1061453, 1228126, 1328615, 1332531, 1411736, 1426432, 1382765, 1419987, 1551298, 1687844, 1773394, 1795537, 1718649, 1785655, 1990114, 1962412, 1889188]
17985A889188r6551j64687j87637j60842j67824j88782n2750j27784n9639n6475
17975F26217j31891J42353J03547P9968m5548K5974n6888N1113N8914o7561N6354
17964H42552n7077n3990j6150Q4539J05677Q1037k7084L8590Q9405Q7089P1584
17953A246172L9803L9821p057R9198N9643N019P8126J81272J74786J38029R234
17942B064046j32917j60108j03057k01532k35657j60953l4707M6006J9027Q9093
17932A189241J84934K04208R3537l4981J8093K9857l7524j03747j49266k53308
17922A141044k38261j75052j29035R5462M072j11239l3101K5960M245n2476M0152
17911E71771P0892j7733r3866p8637l0663K0590m9752r572p6309r3545q5123L4089
$$ y = [1889188, 1792637, 1627950, 1440313, 1279471, 1111647, 922865, 870115, 742331, 682692, 626217, 494326, 636679, 740226, 820194, 774646, 800620, 743732, 794845, 853759, 786198, 842552, 785475, 731485, 715335, 799874, 905551, 986588, 959504, 998094, 1087499, 1174588, 1246172, 1285975, 1325796, 1318739, 1417937, 1477580, 1482599, 1560725, 1741997, 1916783, 2054812, 2064046, 1931129, 1771021, 1667964, 1466432, 1230775, 1069822, 1035115, 1081121, 1100148, 1189241, 1374175, 1578383, 1671920, 1636939, 1655032, 1684889, 1647365, 1543618, 1394352, 1141044, 902783, 727731, 598696, 694158, 698230, 586991, 553890, 579850, 584095, 531619, 571771, 642663, 624930, 531064, 452427, 421764, 442354, 392602, 383030, 306721, 213176, 128053, 162142]
17899A62142o5097n6114J2865K8645P6354O490P527J2090j2064j4229L5567o140
17887A88036o6229p9342K4436j31104P6138M470o9139L356J25837N4634j542l4769
17875I4782R3727l5871m4311L7057p949R4091n7336m2438l6110m361l3811l4246
17863B3224K4246N5457m5481j26954M5330M4215K434J02677O8068n1194n9130
17852H2892m664P8749K4474J0263m0318j75787o5201L0045Q5721j2650K8123L0730
17840G2377J7016n561N2958k0643m018N0805O2286r7062n4550k9591n5436Q8894
17828G7475L5763k0286n6649K3996N6440p8129p8647L0104J20788M0401q9790
17817F1466j4063j6612J08842l7827j58350n612J73792J19440K2011j24522l1548
$$ y = [162142, 97045, 40931, 53796, 82441, 158795, 165285, 172812, 184902, 172838, 158609, 194176, 188036, 121807, 42465, 66901, -64203, 11935, 16405, -52734, -49378, 76459, 131093, 129551, 94782, 188509, 152638, 108327, 145384, 137435, 231526, 174190, 131752, 95642, 91281, 57470, 23224, 47470, 102927, 57446, -69508, -24178, 20037, 22471, 125148, 193216, 142022, 82892, 78228, 156977, 181451, 191714, 151396, -24391, -89592, -59547, 26174, 13524, 41647, 72377, 89393, 83832, 136790, 116147, 112129, 162934, 225220, 128158, 73608, 44017, -11419, 77475, 113238, 92952, 36303, 60299, 116739, 38610, -40037, -9933, 110855, 151256, 61466, 47403, 30791, 139633, 101806, -56544, -62156, 111636, 231076, 253087, 128565, 97017]
17806I7017L6988O5980J6372m3207J8133J2202l8517P8998k3680m3357m0711K1410
17794A57628J9217q9726n9173J2188P4780Q0380J0794k1978m4941n9989R317P0417
17782A58914k6461j744O3229L0180n7090n673o2949r443O1752L7800M4730k4682
17770B08563L938j00601J1309j2688l7636O1235K3259N6723m4038j6229P3637
17759B27472J04905P8041k0485P4659k0359Q6277N6485J60747K27752K00431K81626
17748A457551K33548n9030q6260m7242q5924j26609j47674j04697K9342k0181
17738A042824K2463R6824L2471J74112J23955J04884R5346N2482m1547q1782j86266
17727A435766l9612J15151J4022j53192k5021j34168p5068j53304k54823j61336
$$ y = [97017, 134005, 199985, 216357, 173150, 191283, 203485, 164968, 243966, 220286, 176929, 136218, 157628, 176845, 87119, 27946, 40134, 114914, 195294, 206088, 184110, 139169, 79180, 88497, 158914, 132453, 130709, 193938, 224118, 167028, 161355, 98406, 88963, 150715, 188515, 233245, 208563, 212501, 111900, 123209, 110521, 72885, 134120, 157379, 214102, 170064, 153835, 227472, 332377, 410418, 389933, 464592, 444233, 530510, 586995, 747742, 975494, 1175925, 1457551, 1691099, 1632069, 1545809, 1498567, 1412643, 1286034, 1138360, 1033663, 1063005, 1042824, 1065287, 1162111, 1194582, 1368694, 1492649, 1597533, 1692879, 1745361, 1703814, 1622032, 1435766, 1396154, 1511305, 1525327, 1372135, 1347114, 1212946, 1137878, 984574, 729751, 568415]
17717E68415j8903P7123J4374j44187N5071Q6512J9830J661o5807j7936p826O4896
17705F33223J29958R7120R7348O7838N8977Q2991P7635O2802K84714K65714K15265
17694B073585J77718K52509M30876J78058J52032k2634j67983j02681Q2702J05724
17684C159906l1629j29575j16535J4572K17582O3120p8660k26589r3891j79063
17674B599238m24671m06551k61409j96867k51002j65886m4155j876p6388j49778
17664F20655j26604j36776J4074j8750o0696L0564K1903J1766o251q1052J01707
17653C70540J1915n7069j44593M9781L6301K5920J5750n3950j42333J4174O0014
17642A86450M4218M8767k2496j5670n2442N5535M5732K5850J9349k8371j04151
$$ y = [568415, 549512, 626635, 641009, 496822, 551893, 638405, 658235, 659896, 594089, 576153, 568327, 633223, 763181, 860301, 957649, 1025487, 1084464, 1167455, 1245090, 1307892, 1592606, 1858320, 2073585, 2251303, 2503812, 2934688, 3112746, 3264778, 3242144, 3074161, 2971480, 3054182, 3159906, 3128277, 2998702, 2882167, 2896739, 3114321, 3177441, 3098781, 2872192, 2778301, 2599238, 2174567, 1768016, 1506607, 1309740, 1058738, 892852, 848697, 846821, 770433, 620655, 494051, 357275, 371349, 352599, 291903, 322467, 344370, 356136, 349885, 268833, 370540, 382455, 325386, 180793, 230574, 266875, 292795, 308545, 254595, 112262, 126436, 186450, 230668, 279435, 256939, 241269, 188827, 244362, 290094, 315944, 335293, 306922, 202771]
17631B02771j44275p7475O2305L6025r404K8688J1894J01513n7642m0556p5472
17620C8372l3818J59297L3800j07754n7326k6619l6422n1665K4861L3784Q5540
17609F2050K6575o6370l2688R2172P1832R3772P7960p8047k1310q9317j1530K5811
17597A50910O6632O9381j6477p9393j4514o7503j10132o517M4097R3052p6363
17586E3173m6919P7155J02110o927j3457r4999n1431o397L6632P8448J24660k8035
17574B24013r6J4306P2088K2645j27197j80126M1639J06079P726q0310o4463q6271
17562d9967j7147N2411J24061K8987q48l5168j2030k290q5782M9832J02484O819
17550A61362k6454p4364M5523L9312j244Q6567m6467n2216O4294j7323o7719J2518
$$ y = [202771, 58496, -18979, 43326, 79351, 69947, 98635, 110529, 212042, 154400, 113844, 38372, 4554, 163851, 197651, 89897, 32571, 5952, -30470, -82135, -57274, -23490, 62050, 88625, 22255, -10433, 81739, 153571, 247343, 325303, 247256, 225946, 136629, 125099, 150910, 217542, 286923, 270446, 191053, 176539, 109036, -1096, -7613, 36484, 129536, 53173, 6254, 83409, 185519, 178592, 165135, 70136, 18705, 12308, 48940, 127388, 252048, 224013, 223917, 238223, 310311, 332956, 205759, 25633, 67272, 173351, 181077, 100767, 36304, -49967, -67114, -14703, 109358, 138345, 137497, 102329, 90299, 88009, 2227, 52059, 154543, 161362, 134908, 60544, 106067, 145379, 144135, 230702, 184235, 132019, 196313, 178990, 111271, 123789]
17538A23789M6056L1952L0211R2050R386n9737J2105l987j50697O348J30178K6371
17526B94025r7238O1073M3916j9813q7535N934P8324K0945n049J2137M4191Q6128
17514D37038l7131r8815M5569L5583n4731j36424K3526J16200M7630o501N4369
17503D26313P4678J17524J9639M3933l3353l8551n936k5247n9608J1859L1118
17492E62369p4816o2457j75604j8456J7550n8673k219k2263L262M2990m888j1555
17480A95240N2941M9874M673j27941l1409K8135M93L6387K6978L4014J3960J2727
17468B96072M2180J4284j25311l7278J04124k2369o7234m4167J4687L1048Q9436
17457B95472K6221m1131L1479Q4357J19856j7907j04161j71488j08754M4770L6859
$$ y = [123789, 169845, 201797, 232008, 324058, 333444, 273707, 285812, 281825, 131128, 137476, 267654, 294025, 196787, 257860, 301776, 281963, 194428, 200362, 278686, 299631, 294582, 306719, 350910, 437038, 399907, 301092, 346661, 382244, 327513, 191089, 214615, 330815, 378445, 371944, 426313, 500991, 618515, 638154, 682087, 648734, 610183, 604247, 579000, 519392, 531251, 562369, 487553, 425096, 249492, 231036, 248586, 189913, 187694, 165431, 168693, 211683, 206795, 195240, 248181, 298055, 302728, 174787, 143378, 171513, 172006, 208393, 235371, 269385, 283345, 296072, 338252, 352536, 227225, 189947, 294071, 271702, 204468, 160301, 174988, 206036, 295472, 321693, 280562, 312041, 396398, 516254, 498347, 394186, 222698, 113944, 158714, 195573]
17446A95573Q1741J40161Q8282J34671M1424R5751J99782P2298j84114j19909
17436G45660m4395m9791m9774j07398L0151L6514J6110J91Q682L2864p9998n3106
17424D85710n5509k7481k7420R0253J1775O2303N0292k5748J4032j3028J4193
17413E79372m1879l69M7O7717m9127q6033J3940M8303J1326O8149J14836P3396
17401G99678P2720J79192Q4900J5840k9880j13050j18626j01633k0657J5801Q0700
17390H64985n140P9114J79342J89033K59091K15429J89338J55447J41779K33578
17380B501996K15799l5209j14823k81535k40797j05315l7662j7954j10299n3058
17370A721143L3999O9590J09622J89435K02235K99607L77900K60980J96173J67831
$$ y = [195573, 277314, 417475, 505757, 640428, 681852, 777603, 977385, 1049683, 865569, 745660, 701265, 651474, 601700, 494302, 524453, 560967, 577077, 577268, 585950, 618814, 538816, 485710, 430201, 402720, 375300, 465553, 477328, 539631, 589923, 564175, 578207, 565179, 579372, 537493, 537124, 537171, 604888, 555761, 469728, 483668, 531971, 543297, 611446, 726282, 799678, 872398, 1051590, 1136490, 1152330, 1122450, 1009400, 890774, 789141, 768484, 784285, 864985, 859845, 938959, 1118301, 1307334, 1566425, 1781854, 1971192, 2126639, 2268418, 2501996, 2717795, 2682586, 2567763, 2286228, 2045431, 1940116, 1902454, 1884500, 1774201, 1721143, 1755142, 1824732, 1934354, 2123789, 2326024, 2625631, 3003531, 3264511, 3460684, 3628515]
17360C628515J11544q4495j30626k66778l60535k25720o6090j17293o5280R3545
17350B516787J44370j4563n6453l6945J1506K0777r7843J882J72012Q6043m3898
17339B703675k18244j27010K073n51n1863q7770J43003J17485K72211L98202N1499
17328C202710o9630j74059j25331j22026j64262j66069j62153j02920p8149O2144
17318B100255K47502j2730j48840j69687j75254J09986J89676O0975l6236N8324
17308B223971K5090J79569J55838J02524K47425L52101O02023P12297M47882J53105
17298E201825J0949N0400p2579k42846k55356k61861m6055P3826J65585K10651
17288D834539K60516K98176L10224J80867K08047J15764m3083J06723K02076J54600
$$ y = [3628515, 3740059, 3655564, 3524938, 3258160, 2897625, 2671905, 2605815, 2488522, 2423242, 2516787, 2661157, 2646594, 2590141, 2553196, 2564702, 2585479, 2487636, 2489518, 2661530, 2747573, 2703675, 2485431, 2358421, 2360494, 2359943, 2308080, 2220310, 2363313, 2480798, 2753009, 3151211, 3202710, 3133080, 2959021, 2833690, 2711664, 2547402, 2381333, 2219180, 2116260, 2038111, 2100255, 2347757, 2335027, 2186187, 2016500, 1841246, 1951232, 2140908, 2201883, 2165647, 2223971, 2249061, 2428630, 2584468, 2686992, 2934417, 3286518, 3888541, 4600838, 5048720, 5201825, 5212774, 5263174, 5190595, 4947749, 4692393, 4430532, 4384477, 4458303, 4623888, 4834539, 5095055, 5393231, 5703455, 5884322, 6092369, 6208133, 6165050, 6271773, 6473849, 6628449]
17278F628449K85357N00305Q33944J082525J339781J773038K152250J915193J804796
17269A8315638J896995K585638L920953N961792Q954590J1043479Q868942L143622
17261F4691649p77478j075670o3055m8391m99855N68039L623148P538749J2416279
17252H6373415J9990831L3829264N8200840R0865080J09640119Q5669221L2831948
17245E17400718l837635j4794366k4130228m4669628o4335586o6894116n4906910
17238B43832249l9388068k4620284q845834N919768J1269027K234997j1159933
17231A79241922j6840551j6065330j5889991j8258702k0267062j8366792j3364472
17224F0189022q683132n736539l943980k821611j760636j009825l24619J61094
$$ y = [6628449, 6913806, 7414111, 8248055, 9330580, 10670361, 12443399, 14595649, 16510842, 18315638, 20212633, 22798271, 26719224, 32681016, 41635606, 52679085, 61548027, 64691649, 63914171, 62838501, 62775446, 62727055, 62227200, 62795239, 66418387, 73957136, 86373415, 106364246, 140193510, 198394350, 289259430, 398899549, 484568770, 517400718, 513563083, 498768717, 474638489, 429968861, 365633275, 298739159, 243832249, 204444181, 179823897, 170978063, 176897831, 188166858, 190401855, 179241922, 162401371, 146336041, 130446050, 112187348, 91920286, 73553494, 60189022, 51505890, 45769351, 41825371, 39003760, 37243124, 36233299, 35908680, 36069774]
17216C6069774L16588L92190O25037J127451K130684L422512N499898R337776
17208E8921910J5515452K3927773K9158027K3530876R033030j755934l405989
17201A54925145j156230M4767J872044R320228K3171512L7379487M8741342O2460745
17193C36759040P6654101O9486595K5231620k9045959n3689005n2002871m9811451
17186C23582070n5956072o1245267n4123141l8302039k3918746j4647165q959407
17179F6430233m470331k13625L390837M161388N07484m231701o058017n622412
17171E3893856n471186o056709o503153n941823m521431l437473k758917k199073
17163A7004091j791120j524542j319479j136833j050812q23640n89588o21991
$$ y = [36069774, 36386362, 36778552, 37403589, 38531040, 40661724, 44084236, 49584134, 58921910, 74437362, 98365135, 127523162, 151054038, 160087068, 158331134, 154925145, 153768915, 153813682, 155685726, 165005954, 188177466, 225556953, 274298295, 336759040, 413413141, 482899736, 508131356, 479085397, 425396392, 373393521, 323582070, 267625998, 206380731, 152257590, 113955551, 90036805, 75389640, 66430233, 61959902, 61746277, 65137114, 69298502, 69805986, 65574285, 59516268, 53893856, 48422670, 42365961, 35862808, 29920985, 25399554, 21962081, 19203164, 17004091, 15212971, 13688429, 12368950, 11232117, 10181305, 9357665, 8768077, 8146086]
17155H146086o02959o08977l56704m09967m30891m03934l93449l92152k67294
17146D279759j67302r6510j04494k38907j17720l9019j42410j68316j25421o1624
17136C018036J51963M06319N67891M05944j01480k15289L8642K16564L68179q589
17126D848180l94115k71673N8255K63211L15025r2719m44339k71802J11017K65704
17116D386744L45673k28729n95380n22672l76793l19734k70876m36472l78280
17107A603481k74714q2219j26942q2323O2221p43N5377j26832o6587j17168n6457
17096G87094r6389j00621K7775j63924j35140K195M4704m9956l446L3383J11460
17085D57135O3225M4514J15454M6642j533m2411m2520M5129J02989M8098K7775
$$ y = [8146086, 7543127, 6934150, 6577446, 6167479, 5736588, 5332654, 4939205, 4547053, 4279759, 4112457, 4015947, 3911453, 3672546, 3554826, 3515807, 3373397, 3205081, 3079660, 3018036, 3169999, 3576318, 4144209, 4550153, 4448673, 4233384, 4272026, 4488590, 4856769, 4848180, 4454065, 4182392, 4240647, 4503858, 4818883, 4726164, 4281825, 4010023, 4121040, 4386744, 4732417, 4503688, 3908308, 3385636, 3008843, 2689109, 2418233, 1981761, 1603481, 1328767, 1246548, 1119606, 1037283, 1099504, 1098761, 1154138, 1027306, 960719, 843551, 787094, 690705, 590084, 617859, 453935, 318795, 320990, 365694, 315738, 312292, 345675, 457135, 520360, 564874, 680328, 726970, 725437, 683026, 640506, 685635, 788624, 836722, 864497]
17074H64497M1091j2540M206L3065N5453J8346o1958r0392j18246j38026L4676
17063F30172J3627O689o4612m164O941j29364J2012R9205j1378L8285M2992l0503
17051F09902Q546Q2903J485K3310r666J0285n146N1628m8083o2929m4246r8393
17039E19596r9134k03287j52092k7967K8794J53069R672O5305J5047L3144O6686
17028D08833J3083j12674j67585k7291r555l0665k0064m4655N6029N3776M2899
17017A62131k562L5642o765k0716J01405L5875o5675l9210P3499P8584l2026J7537
17005C37719P8146J58851N8788K3540M6396l5563M2203J55400P0411O2651P3487
16994A072029m1527n3700M4882m5944o0743R975O6645n9929j22116m7499J2525
$$ y = [864497, 905588, 893048, 897254, 930319, 985772, 1004118, 942160, 851768, 733522, 595496, 630172, 643799, 650488, 585876, 581712, 588653, 459289, 471301, 570506, 559128, 597413, 640405, 609902, 618448, 701351, 702836, 726146, 716480, 726765, 721619, 773247, 725164, 662235, 617989, 519596, 420462, 217175, 65083, 37116, 65910, 218979, 228651, 293956, 309003, 342147, 408833, 421916, 309242, 141657, 114366, 104811, 74146, 54082, 9427, 65456, 119232, 162131, 159569, 195211, 188446, 167730, 269135, 305010, 239335, 200125, 273624, 352208, 320182, 337719, 415865, 574716, 633504, 657044, 703440, 667877, 710080, 865480, 935891, 998542, 1072029, 1030502, 976802, 1021684, 975740, 914997, 924972, 991617, 931688, 809572, 762073, 774598]
16983G74598m1154M6288J07641N8913R8341N0507J04323j2787O8462J68730M0946
16972A464808n4516q3527o9750J5079J25503O9890q0473k62M7775j2629M8992
16961A470890M1158j30926k3731J12060K28371K89088L04790J69335j12033k83841
16951B065161k01194M1072N9166j29381k38013j81169J98547N09781L74028j7681
16941B480317k47069k67671k65258J14180J68113k22826j56463j748K7993J20316
16931A749884J44843k7856k16212j20061R9889K09510n9123k28022p3192P773
16921A487433M3540J5081j10298j29825j2297K8365j3792Q4018J45908J34635
16911A672768J55153J33223O5406l9767L3842J96961J70576J8841N031L422O9442
$$ y = [774598, 733444, 779732, 887373, 946286, 1044627, 1095134, 1199457, 1186670, 1255132, 1423862, 1464808, 1410292, 1326765, 1257015, 1272094, 1397597, 1467487, 1387014, 1386752, 1434527, 1421898, 1470890, 1512048, 1381122, 1357391, 1469451, 1697822, 1986910, 2291700, 2461035, 2349002, 2065161, 1863967, 1905039, 1964205, 1834824, 1596811, 1415642, 1614189, 2123970, 2497998, 2480317, 2233248, 1965577, 1700319, 1814499, 1982612, 1759786, 1603323, 1601575, 1629568, 1749884, 1894727, 1866871, 1650659, 1530598, 1630487, 1839997, 1780874, 1552852, 1479660, 1487433, 1530973, 1546054, 1435756, 1305931, 1293634, 1321999, 1308207, 1392225, 1538133, 1672768, 1827921, 1961144, 2026550, 1986783, 2020625, 2217586, 2388162, 2407003, 2412034, 2415456, 2484898]
16900B484898K03754K05914k3932j05936k4198K5335n8123j04234j4824j14780
16890B473874m3956O428R6775K01087L48809M67153N13399R36141J601329J891418
16880H492457J367050L07164k00928o2836L4025l33593p79422r76460p04906l06042
16870F836509q310K41703M95416M47283J76858K6496n4824J06106Q8921j00871
16860H255287j63699M5652K49172L77583O13178Q98948J190858J642560K100132
16851A5209671K374599K783682L806105N698038Q863394J4430970K0491526J9009238
16843I2667223P845551L16935M510713J3667520J8033363P630653j0460481j6639701
16835A17571776j1529892o964353p194525r527819q052591k047191M059387R999497
$$ y = [2484898, 2688652, 2894566, 2870634, 2764698, 2740500, 2765835, 2707712, 2603478, 2588654, 2473874, 2429918, 2436346, 2533121, 2734208, 3083017, 3550170, 4063569, 4999710, 6601039, 8492457, 9859507, 10166671, 9965743, 9902907, 9936932, 9603339, 8823917, 7847457, 7142551, 6836509, 6828199, 7069902, 7565318, 8012601, 8189459, 8215955, 8161131, 8267237, 8356158, 8255287, 8091588, 8137240, 8386412, 8763995, 9377173, 10276121, 11466979, 13109539, 15209671, 17584270, 20367952, 24174057, 29872095, 38735489, 53166459, 73657985, 92667223, 100512774, 100829709, 105340422, 119007942, 137041305, 144671958, 134211477, 117571776, 106041884, 99077531, 91883006, 82355187, 74302596, 72255405, 76314792, 86314289]
16827H6314289J8188115L2518727N7088725Q4281688Q0670831L3376847m905962
16820C87533260L790162L5623991N2671169K2147044l4706414n3690624k9129172
16813C84239416N641908L7967792M6049799l428944n9523493n6948513l1935306
16806C22062659k2794002l1039980m1278004k4618489J1064270N2789589P1641830
16799C37827873K5320745l4762161m0440013k4342880k0977948l1889334m3594119
16792A67142163l2167339r275811O470713J995910j2016424j3649738q637093
16785I9862381o699589q314951j0854697o745047K752241J5088398K2397895R605874
16777A17092505j0077065j3126861q588445p511596j0786024j5473985j3525393
$$ y = [86314289, 104502404, 137021131, 194109856, 278391544, 359062375, 392439222, 387533260, 391323422, 426947413, 479618582, 501765626, 467059212, 413368588, 384239416, 389881324, 427849116, 473898915, 470469971, 410946478, 353997965, 322062659, 299268657, 268228677, 226950673, 202332184, 213396454, 266186043, 337827873, 363148618, 328386457, 287946444, 263603564, 242625616, 210736282, 167142163, 134974824, 125699013, 132169726, 134165636, 122149212, 108499474, 99862381, 93162792, 84847841, 73993144, 67248097, 70000338, 85088736, 107486631, 117092505, 107015440, 93888579, 85300134, 77788538, 67002514, 51528529, 38003136]
16770C8003136q501895m955582l055162k194058j695073j328725j248200j213704
16762A3810737j240815j195584r83764p68454n99069k97406l2423k35166m89949
16753G968107m57544k82772k63420m56188o00849n22537k12168j11529M680M1449
16743E107229L490r4137j95432k48063k91993k83800k90227m29712m19377k59267
16733B598711j15062j37873j90820j01310o9422L4659k9589n7133p2103M1596
16723A901654n1715r2307j18197j95476j53487n7085j37267r2566Q6626P1834
16713A162014L0326M2385O4028N0315O9902K33523J95433J23594L992L504P8526
16702B057542J03656K72805J63694L8826j72564l20497l61938j99160o2495q4969
$$ y = [38003136, 29501241, 24545659, 21490497, 19296439, 17601366, 16272641, 15024441, 13810737, 12569922, 11374338, 10390574, 9622120, 9023051, 8725645, 8693222, 8458056, 7968107, 7510563, 7227791, 6964371, 6508183, 5907334, 5384797, 5172629, 5061100, 5065780, 5107229, 5110719, 5016582, 4821150, 4573087, 4281094, 3997294, 3707067, 3277355, 2857978, 2598711, 2483649, 2345776, 2154956, 2053646, 1984224, 2018883, 1989294, 1932161, 1860058, 1901654, 1849939, 1757632, 1639435, 1443959, 1290472, 1233387, 1096120, 1003554, 1090180, 1162014, 1192340, 1234725, 1298753, 1349068, 1418970, 1652493, 1847926, 1971520, 1975512, 1979016, 2057542, 2161198, 2434003, 2597697, 2636523, 2463959, 2143462, 1781524, 1582364, 1519869, 1434900]
16692A434900r6223q8863r9297p5828L7132J44918K18820L21622J93154n5709
16682A934626j64363j51234j22010j28015o8717k23957j65921k14302k14907j83355
16672B97845p7263Q2657m5975o6000l3049n0560M508n4339m7643j66004r7256
16661b53079P0440J80354P0651j0276j31983q3810m9271N9300J24086J3284j2630
16650b2934p4442r0579N414Q1156L3474l0126n0836Q6678R1216L1992J1582K5051
16638I7646N6293l1403n2982o8175p3893N7868J06723Q8160O7042M8956n0718
16627B45517l946L122M6400N8303M3099K3239R1076J83489O8067j56334j32793
16616D69239p3941L5972L536K832n39K6752j9186n1400r9191k6165l924K1332
$$ y = [1434900, 1338677, 1249814, 1150517, 1074689, 1111821, 1256739, 1475559, 1797181, 1990335, 1934626, 1770263, 1619029, 1497019, 1369004, 1300287, 1076330, 910409, 696107, 481200, 297845, 220582, 303239, 257264, 191264, 158215, 107655, 112163, 57824, 10181, -155823, -253079, -182639, -2285, 68366, 58090, -73893, -157703, -206974, -147674, -23588, -10304, -22934, -97376, -187955, -182541, -101385, -67911, -98037, -148873, -62195, 29021, 61013, 72595, 97646, 153939, 122536, 69554, 1379, -72514, -14646, 92077, 180237, 247279, 296235, 245517, 241571, 244693, 291093, 349396, 392495, 415734, 506810, 690299, 758366, 602032, 469239, 395298, 431270, 434806, 437638, 437099, 463851, 444665, 393265, 294074, 267909, 263985, 285317]
16604B85317P4920K1801k3982q1597m9949M8652J31660o738n8171j5009n8483
16593B68421q1191k5146o1377L4802J19916J25393J7024o7016J9976m5918Q597
16582C13481K0974K4830Q361N5535l8734m6708J897r53O4292P355l6898l6622
16570C36810m6126j4950o5975j08158R4146N1606L277m676o5341o7350k6808k1310
16558F5145K0470M5979m4730q9123n9104P131K6099J04884J2699j9488j097r675
16546E9190J2077N34R6515m8412j08855n213L2851K2175Q3221m4864K1061j8296
16534A01984m958m6257j24144p3197J8317J24503N3217j0821K2560R5572O9854
16523B26630j6332n2504j17047j2941L2064Q5992K4158l0560K8304p3897Q008
$$ y = [285317, 360237, 382038, 358056, 276459, 226510, 275162, 406822, 400084, 341913, 326904, 268421, 187230, 162084, 100707, 135509, 255425, 380818, 397842, 330826, 350802, 304884, 313481, 334455, 359285, 367646, 423181, 384447, 337739, 339636, 338683, 402975, 410330, 373432, 336810, 290684, 275734, 209759, 101601, 195747, 247353, 250630, 245954, 180613, 113263, 86455, 65145, 85615, 131594, 86864, -2259, -61363, -54232, -28133, 76751, 89450, 69962, 68865, 59190, 71267, 71801, 168316, 119904, 11049, 5836, 38687, 60862, 144083, 99219, 120280, 101984, 97026, 50769, -73375, -146572, -128255, -3752, 49465, 38644, 61204, 156776, 226630, 210298, 157794, 40747, 27806, 59870, 145862, 170020, 139460, 167764, 93867, 101875]
16512A01875l304p3505j2034j378p0807J19374Q6398j01563j58585k229Q9556
16501b6202K3586J11559N9132l1066r4586M3824k249k1946L896j1234K2657O808
16489H4179l2429o6698p0527L0167o4578m7881N4621K3132O4977K4674R6858m16
16477I6079o5084k3272M9328L6250P331k4458j7326n6170l3778L4791k0405l3978
16465e0692n7626m4860J42317P1474q206r2039j2535j09343J01197J05999k6484
16454A9202K910m6825j29823M2643J28186K7911R425J0832Q407K806q175l7771
16442B9728j11540j5344k9996O2978J08468J6175r0103l3591o9691k5088K5141
16431a32863R3435L2655K0079J0242l2298r042l0202k6785J2080M1244L1440j14817
$$ y = [101875, 98571, 25066, 13032, 11654, -59153, 60221, 146619, 45056, -113529, -115758, -26202, -2616, 108943, 168075, 137009, 42423, 86247, 83998, 62052, 65948, 54714, 77371, 84179, 51750, -14948, -85475, -55308, -119886, -167767, -113146, -90014, -25037, -363, 96495, 96079, 30995, 7723, 57051, 93301, 100632, 76174, 58848, 2678, -31100, 3691, -16714, -50692, -108318, -153178, -10861, 60613, 52407, -39632, -52167, -161510, -60313, 45686, 19202, 22112, -24713, -154536, -111893, 16293, 44204, 53629, 64461, 72868, 75674, 67499, 29728, -81812, -97156, -127152, -64174, 44294, 60469, -29634, -63225, -132916, -158004, -132863, -39428, -6773, 13306, 23548, -8750, -17792, -47994, -74779, -62699, -21455, 9985, -104832]
16419a04832M9425R1649L3321l8782k2257Q0963K9028k7500j11386r1183j25491
16408b37045Q0127J56108M2886n7149m5716M4280O3058p7419o4252M1053K9758
16397b4311L3693o87N3389Q446m7992k3327q3084q4843J02794K0577N5744O2403
16385G2802j1506R4908O3182j05397q7413l1761N2236j423l8613j71619p4497
16374b39101J1232J76861J7798j10759Q692m1540M5285O4749O459j0107M4598
16363b5833J1315K6313R5454P5960l2214p9823J035J7888m5263m2539M8128k3387
16351B7034M856R0737r2964j16045n8977n102J4357M6505O5035J9293J6218J3043
16339B3990J4280k0297j0259L9508m2012m2077l0314p6581j1001M5887P6627N4193
$$ y = [-104832, -55407, 36242, 69563, 30781, 8524, 89487, 118515, 91015, -20371, -111554, -237045, -156918, -810, 42076, -15073, -60789, -16509, 46549, -30870, -95122, -54069, -24311, 9382, 8695, 62084, 70530, 22538, -789, -83873, -168716, -65922, -45345, 10399, 72802, 61296, 156204, 219386, 113989, 26576, -5185, 47051, 45628, 7015, -164604, -239101, -227869, -51008, -33210, -143969, -135277, -176817, -131532, -66783, -60324, -70431, -25833, -14518, 11795, 107249, 183209, 150995, 71172, 72207, 90095, 44832, 2293, 50421, 27034, 31890, 122627, 29663, -86382, -145359, -150461, -136104, -89599, -24564, -5271, 10947, 23990, 38270, 17973, 7714, 47222, 5210, -36867, -67181, -143762, -154763, -108876, -32249, 21944]
16327B1944O4484m8993m31M620l8317O56L2815K2805k5473m723j2766j17763J03204
16314B062P4759m4946m0071J575N8596L6881Q0995q7519j80891m1403R9115N9603
16302A8756M0203n5250q373M5114O1348J7451J3245O8357O4476O5385J74049K36932
16290G41693K85571K79162J36144P4639O2921J44559K2345l5610k33756k19026
16280A258642j58834r0582j58521j88760r7120m1289p9538l7252N3889M9857J14895
16269F25387L06829K67705R8850p34Q9056J91157K84848J25503L1118M7207r107
16258B057819j83187l03624k17133n3027j12512k25883r7082J05386J13658Q1642
16248A166057J63206J1868j96349q5772m1517o6220j2833O134M5271J85730K0079
$$ y = [21944, 86428, 37435, 37004, 41624, 3307, 3963, 36778, 59583, 34110, 29387, 16621, -101142, 2062, 76821, 31875, -8196, -6621, 51975, 88856, 169851, 82332, -98559, -139962, -40847, 18756, 58959, 3709, -4664, 40450, 101798, 119249, 132494, 200851, 265327, 330712, 504761, 741693, 1027264, 1306426, 1442570, 1517209, 1580130, 1724689, 1747034, 1711424, 1477668, 1258642, 1099808, 1009226, 850705, 661945, 564825, 523536, 443998, 406746, 460635, 510492, 625387, 932216, 1199921, 1298771, 1298037, 1387093, 1578250, 1863098, 1988601, 2019719, 2066926, 2057819, 1874632, 1571008, 1353875, 1300848, 1188336, 962453, 865371, 970757, 1084415, 1166057, 1329263, 1341131, 1144782, 1059010, 1017493, 951273, 938440, 944574, 989845, 1175575, 1195654]
16237A195654o2537j32661j66397n6942k6870j53447m1492j9694L7440K21842
16227G94896K48746J08356j80411j96549q6794r7327J8381j40766j87929k9016
16217B51587k9691p7793j11117Q7592k6082j26190K9153K3585P980Q8901j9028
16206I8897r7988l5423K0551O6945p2543j38361k3094M3509J21859P4414K4978
16195H3744j2171J0298m0355m0924j25918q3967q974Q555J43083O1239J01418
16184I6028n7326j06424k1681P7287L960m8405N2734k0199R311L6124J764m6595
16172b3422K4684n582r5708k8456P5003L6343j5516l9933m9568J178M9465R3333
16160B1821l560Q353o4198q0723l9343m7229M0944O9507P8430K5717j03628K667
$$ y = [1195654, 1133117, 1000456, 834059, 777117, 750247, 596800, 555308, 535614, 573054, 794896, 1043642, 1151998, 971587, 775038, 688244, 590917, 609298, 468532, 280603, 251587, 221896, 144103, 32986, 120578, 94496, -31694, -2541, 21044, 29024, 117925, 98897, 909, -34514, -13963, 52982, -19561, -157922, -181016, -137507, -15648, 58766, 83744, 71573, 81871, 41516, 592, -125326, -209293, -218267, -209712, -66629, -5390, 96028, 38702, -67722, -89403, -12116, -8156, -56561, -3827, -24026, -14715, 21409, 23173, -23422, 1262, -4320, -100028, -128484, -53481, -17138, -32654, -72587, -122155, -120977, -71512, 21821, 18261, 26614, -37584, -118307, -157650, -204879, -163935, -94428, -15998, 9719, -93909, -91242]
16148i1242J83344M75n9709j11343o6032O3491J2038j9786K0394J05699j14418
16137g7089q3490N3501J36638N3380O658q8093q5935j2931l510J13553J6417k01135
16125a72036n5966J9469M2657O660J5904J01744J0664r5271K1542O6617M1398
16114C382m532K6728j5607o5869L7639q081l3889n7162l8056j3188J7736J19624
16102c1275k1453k8564J1988p533l8593r761l0715L6897Q4836Q5662P7809j7127
16090A12171n7279k8188J0297O956M1210P9535J6834l4287j28825j41400J3762
16079a09214M9928n7245Q4046N2725o0699p6669m8880k9479j0118k0341k6283
16068b52229J50427J31828P846k2059N3464k6632k5619l338o7227J06105J34314
$$ y = [-91242, 92102, 92577, 32868, -78475, -144507, -81016, -68978, -88764, -68370, 37329, -77089, -160579, -107078, 29560, 82940, 89598, 1505, -84430, -97361, -100871, 12682, 29099, -172036, -228002, -208533, -165876, -159216, -143312, -41568, -30904, -126175, -104633, -38016, 3382, -1150, 25578, 9971, -55898, -18259, -26340, -60229, -117391, -155447, -168635, -150899, -31275, -52728, -81292, -69304, -76837, -115430, -125191, -155906, -119009, -34173, 51489, 129298, 112171, 54892, 26704, 37001, 43957, 85167, 164702, 181536, 147249, 18424, -122976, -109214, -59286, -116531, -32485, 20240, -40459, -117128, -166008, -195487, -205605, -225946, -252229, -101802, 30026, 37872, 15813, 69277, 42645, 17026, 13688, -53539, 52566, 186880]
16057A86880m175o785j6254q3963n5238j33198m5594j2610M5480m6449j49764
16046c21670j2629L2619J1244J52047m3129o6857k4603J34347L8763k7655j1967
16035a39490l8485k942m731K4140J52196p6608K955P2600Q8816j6208m8261M4785
16023E8767K8431p7898m3844l2766q1752k1862J7501r835J9547n4045P8342R3805
16011b5609l7846m2155q466P2085K7861j7328k0766J3129N7962o7363j06309k993
15999a57798O3124J14350M6548j2298q545n7829L0979k4879j05154N5077J7843
15988c8582j20707N135M4511n2035K4091J0446j7556Q6983P3455n2345q7839K0620
15976a03823J03631l9654M0852J6609L0438P4636j29148p2966k2682O4727O6062
$$ y = [186880, 182705, 175920, 159666, 75703, 20465, -112733, -158327, -170937, -125457, -171906, -321670, -334299, -301680, -290436, -138389, -181518, -248375, -272978, -138631, -99868, -127523, -139490, -177975, -180917, -185648, -161508, -9312, -85920, -82965, -10365, 78451, 62243, 13982, 58767, 87198, 9300, -34544, -67310, -149062, -170924, -153423, -163258, -143711, -197756, -119414, -25609, -63455, -105610, -114076, -41991, -14130, -31458, -52224, -39095, 18867, -48496, -154805, -157798, -94674, 19676, 66224, 53926, 45381, -12448, 18531, -6348, -111502, -56425, -38582, -159289, -154154, -109643, -161678, -137587, -127141, -144697, -57714, 15741, -36604, -124443, -103823, -192, -39846, 1006, 17615, 48053, 122689, -6459, -79425, -102107, -37380, 28682]
15965B8682J1207R5748K6242o0591p2387j3986m3841k8306l8966N7392o269l3726
15953g8801k1828L7410N6504q9760K3770o8147k6947R938M3592k6307J20431K2972
15941B827P566K8055j9705o7639j09663j40095r2266l9229L1648Q4136N3467l1510
15929b92408Q0629Q477R1863J32417m9067j9252o9729o6968k083R2071L498q3397
15917a73949O0714L855N3282L30K3277P5625j3125n6041M6842r718q136O3428
15905F6384P740O505r0322n4760o0614l645L0678J03336k5162n4645n9521J7147
15893a16879j6617L9047j9295R9208Q1809J757m387J2556K6948q4825j35007J3396
15881a02289p6132j1905J25404N4391K2916l7614J0798M1752m4833N8635J2850
$$ y = [28682, 39889, 135637, 161879, 101288, 28901, 14915, -28926, -57232, -96198, -38806, -45075, -78801, -100629, -63219, -6715, -96475, -72705, -140852, -167799, -157861, -114269, -140576, -20145, 2827, 10393, 38448, 18743, -48896, -158559, -298654, -390920, -430149, -398501, -314365, -260898, -292408, -211779, -203302, -111439, 20978, -28089, -47341, -117070, -184038, -186121, -94050, -90552, -173949, -113235, -109380, -56098, -55768, -32491, 43134, 30009, -26032, 20810, 11092, 2956, 66384, 74124, 80629, -9693, -64453, -125067, -128712, -98034, 5302, -19860, -74505, -134026, -116879, -133496, -94449, -113744, -14536, 67273, 69030, 64643, 77199, 104147, 19322, -115685, -102289, -178421, -190326, -64922, -10531, 12385, -25229, -14431, 27321, -17512, 41123, 53973]
15870E3973q214N4749J3338r5903J4706J1557N7726k15p171j01626p4211m3065
15858a24356l275R1138n6432l6173O5157K1455Q7047m0240K130Q8032k73k1105
15846G3105Q806j08078k2121k2198J5650k0670K931o840p1414m9329O1993J0413
15834a27752j07182R205J33563P9496O7760k8844K794K0928j19195q5122m233
15823a58582L7719J10966P2280j05396p0105P524J1258M5139J9311o537O2751
15812B6328K5543K7527M7801l654p4183O810L545j3995l445j01399j01853l5796
15800a96771K5579R4931l103j572L9744o4134j5577K9543J5396K9838K5136M233
15788a6757j3497P3690O4417r3418l5825m7776L3947J9265J401p371R940M2803
$$ y = [53973, 45759, 100508, 113846, 17943, 32649, 44206, 101932, 101717, 94546, -7080, -81291, -124356, -127631, -36493, -92925, -129098, -63941, -42486, 44561, 4321, 6451, 94483, 94210, 73105, 81911, -26167, -48288, -70486, -54836, -75506, -72575, -79415, -150829, -200158, -138165, -127752, -234934, -225729, -92166, -12670, 55090, 26246, 29040, 49968, -69227, -154349, -158582, -120863, -9897, 62383, -43013, -113118, -105594, -94336, -49197, -29886, -36423, 26328, 51871, 79398, 127199, 123545, 49362, 56172, 59717, 45722, 42277, -59122, -160975, -196771, -171192, -76261, -79364, -80936, -41192, -105326, -120903, -91360, -75964, -46126, -20990, -16757, -30254, 43436, 107853, 14435, -21390, -69166, -35219, -15954, -14553, -21924, -11984, 30819]
15776C0819L9386o4003n6436Q4434J5355O3915q718o3446n6934n8626j4971P28
15764h8497j8688p1686P73j3545L3072J22536M8774O1274P1926j1908j8067p3068
15752D2896k0014J4648P6496j03071j5699l9750R309O884m7244n3839j8936J4163
15740a34157N145n032O3864L7819L9885n2233j14526N430Q2960l4937o0594j8862
15728a85238l7747N9406O6465J3150o0322l8485P0938P7655P3646J3924m6362
15717G030m3792J03768j13431j52569J13158N7751O2290k5498k9334M4317L6026
15706E9716R068n7850L8708N1691L6857k6058J3626L3439O4881j26334l9124l7338
15694B1282l9954L3614m1382j02615l6249K05421k7102j15865k6666m962Q2161
$$ y = [30819, 70205, 6202, -50234, 34200, 49555, 113470, 104752, 41306, -15628, -74254, -89225, -88497, -107185, -178871, -178098, -191643, -158571, -36035, 12739, 74013, 145939, 134031, 115964, 42896, 22882, 37530, 114026, 10955, -4744, -44494, -35185, -28301, -75545, -129384, -148320, -134157, -129012, -134044, -70180, -32361, 7524, -44709, -159235, -153805, -70845, -105782, -166376, -185238, -222985, -163579, -97114, -83964, -144286, -182771, -111833, -34178, 39468, 53392, 7030, -36762, 67006, -46425, -198994, -85836, -28085, 34205, 8707, -20627, 23690, 59716, 68784, 10934, 49642, 101333, 138190, 112132, 125758, 159197, 224078, 97744, 58620, 21282, -18672, 14942, -26440, -129055, -165304, 40117, 13015, -102850, -129516, -134478, -52317]
15683e2317J36636L2632L402p1675l2118o2086j534o8773m4029Q654L5299O8470
15671d7439m5863j02075K5781J67466J5446O1920o987j20214Q8275M6624q3679
15660g45P432j9854j45395n5672o251N9701L623J7921O3912Q4429n318M8972M222
15647E6977q9223j00931K179J35349Q0200l7300j37918R849M1335Q077l7722R615
15635e9513o3789k1796N5472N7538l9633p5297r7379N2488Q9376M5342l5816j12798
15623b05805r308L94K335J5202L1901l7663L127N8806j1634O6002L0477N8507
15611B341j5886j17498j12881O2734O8647O0072o7979l7624L0821M3921k2352
15600a05684O7139J2465m4453r3852r262l5714J32643J33672N9007N195r507R5648
$$ y = [-52317, 84319, 116951, 120353, 48678, 16560, -45526, -47060, -115833, -159862, -151208, -115909, -47439, -93302, -195377, -169596, -2130, 13316, 75236, 68249, -51965, 36310, 82934, -745, 6687, -13167, -158562, -214234, -220485, -160784, -157161, -139240, -75328, 9101, 3783, 52755, 56977, -32246, -133177, -130998, 4351, 84551, 47251, -90667, -80818, -39483, -31406, -69128, -59513, -123302, -145098, -89626, -32088, -71721, -147018, -244397, -191909, -102533, -57191, -93007, -205805, -215113, -214719, -212384, -197182, -165281, -202944, -199817, -141011, -152645, -86643, -56166, 2341, -13545, -131043, -243924, -181190, -112543, -52471, -120450, -158074, -127253, -83332, -105684, -38545, -26080, -70533, -164385, -173647, -209361, -76718, 56954, 115961, 121156, 111649, 207297]
15588B07297O8788j27466r3948k4759j9775n1693o0129o32O929Q6803l5530K2817
15576b1298J01187J3593o3994K9900k2231r2450O1318N4049M7129n9385o0245
15565a2427l8850r355Q33O1195k90J31656J7214m3616p9399L6058r5n1616q8994
15552g7686j8537r372M8656j520Q182K5500J0863j3947o6621j36453p1796J22481
15540a80250P8430N9489O1913r296p2352L1308L3617J10022m5529j24810L888
15529e3570N6802J7724K7377k223r3315M859L3448o937j06366o2322L5000M72
15517a49051P4292q912l2247J3914J246J24231O0058K7558m768k9949j4998r1110
15505b9736o693J0191j151J2024q903N1087J6059j29442M4641K34Q533O6189o4589
$$ y = [207297, 276085, 148619, 54671, 29912, 10137, -41556, -101685, -102317, -95388, -8585, -44115, -21298, 79889, 93482, 29488, 59388, 37157, -55293, 6025, 60074, 107203, 47818, -12427, -51277, -60632, -59799, 1396, 1106, 132762, 149976, 106360, 26961, 63019, 62924, 11308, -77686, -96223, -105595, -56939, -58459, -50277, -24777, -13914, -27861, -94482, -230935, -302731, -180250, -101820, -42331, 19582, 10286, -62066, -30758, 2859, 112881, 67352, -57458, -53570, 3232, 20956, 48333, 46110, -47205, -42346, -8898, -15835, -122201, -184523, -149523, -149051, -74759, -83671, -115918, -102004, -100758, 23473, 83531, 111089, 106321, 76372, 61374, -29736, -36429, -26238, -27389, -15365, -24268, 26819, 42878, -86564, -41923, -41689, -33156, 33033, -31556]
15492c1556l6392j5783m6506k7694N0771j9140p4255J05858J1451K7046P1837
15481A5637N1602q4k6552k3044o3872n5290p9095O9647J04157P989p7927j9886
15469i6718J41022N5513l3316j42822R7399K399n2108l2763k4436P1757L3547
15458A9474j2893j2851l7721N9685K2281p7650J8181P2857o5551j24757l7890
15447a76835M0787l710P282L82K6348j7306L039k6794m1018P0283m1818M4905
15435a14455K9271L2901k4336j7359Q177n6431r7421K1906J44430j5207j6048
15424a04572J37558N2049j3548k1179j18797n1737J1223K6439n1471R0298J33083
15413H9346r7946r8219m3045j12457M4532L2689K3694M8901J21805J69897Q034
$$ y = [-31556, -67948, -83731, -130237, -157931, -107160, -126300, -200555, -94697, -83246, -56200, 15637, 67239, 67155, 40603, 17559, -46313, -101603, -180698, -111051, -6894, 1095, -76832, -96718, 44304, 99817, 66501, -76321, 21078, 23477, -28631, -61394, -85830, -14073, 19474, 6581, -6270, -43991, 15694, 37975, -39675, -21494, 51363, -14188, -138945, -176835, -136048, -139758, -132476, -132094, -105746, -123052, -120013, -146807, -187825, -117542, -159360, -114455, -85184, -52283, -76619, -93978, -85801, -142232, -239653, -217747, -73317, -88524, -104572, 32986, 85035, 71487, 50308, -68489, -120226, -109003, -82564, -134035, -43737, 89346, -8600, -106819, -149864, -262321, -217789, -185100, -161406, -112505, 9300, 179197, 187231]
15402A87231r4902p4803j7195O092l3253M5554N1603r8298l3690J1382o2244j32126
15390b44649M7418O1579J00710R8542J6120K6713l1498p9547r7177M7055M9155
15379e579J6827j2131o2763p2916o9951P2069P895M8859K0732k5567k4190j00860
15367b07575k2364J59070J36672K8542l1463o1432l8775Q0540P1910o2387J4136
15356F6874K0337j01010p6619m8768j7942J20980L6813L7451J8853q2097N3289
15345B8161K654J2670j483k7319m0036O1271n320n9472P044m2833j9087O7115
15333a6635K8091J00137K6325K4153l8943l860l7780j42173M88O2514M0879J0127
15321E3323L1980j08542n4718j01665O1640J01562J0224M2910J06630l2596r2145
$$ y = [187231, 92329, 17526, 331, 6423, -26830, 18724, 70327, -27971, -61661, -50279, -112523, -244649, -197231, -135652, -34942, 63600, 79720, 106433, 74935, -4612, -101789, -54734, -5579, 11248, -883, -63646, -136562, -206513, -134444, -126549, -77690, -56958, -82525, -106715, -207575, -229939, -70869, 65803, 94345, 62882, 1450, -37325, 43215, 115125, 52738, 66874, 87211, -13799, -90418, -139186, -157128, -36148, 665, 38116, 56969, -25128, 28161, 30815, 43485, 42002, 14683, -25353, 35918, 30598, -28874, -21830, -64663, -83750, -16635, 11456, 111593, 137918, 162071, 123128, 119268, 81488, -60685, -60197, 2317, 43196, 53323, 85303, -23239, -77957, -179622, -117982, -16420, -6196, 36714, 143344, 110748, 18603]
15310A8603m8903p4680J3066J18351J02707L6311j5709r976k7446l2861k0235
15299E9228k9285R4040k1141j06609n3824k5974N1767Q0891P6288j7619j23697
15288a5935m6343n417M8051l8069m5863P0676k018k4918J8368r7453k445N5045
15276h6321J8010p7229J2226J99698j267J5330m1943l938P4473p8030q1632J72413
15264A21790L6795k1137j58321j6954O6981L4626O2341j7236j3912m3690q0622
15253b9339p349m3864n01m172l1129R0977Q7076l9014m9482L5370n50k0051l2753
15240d4781j15326l3613n0684J24156J13171N7221K3050N54q3271p6800K8816
15229e7507l3103N8917J0268p6917p6661k8793m3611L4040K7563J40815j7830
$$ y = [18603, -30300, -104980, -91914, 26437, 129144, 165455, 149746, 139770, 112324, 79463, 59228, 29943, 123983, 102842, -3767, -57591, -83565, -31798, 49093, 125381, 107762, -15935, -62278, -67695, -19644, -57713, -103576, -32900, -34918, -59836, -41468, -138921, -141366, -86321, -68311, -145540, -133314, 66384, 65117, 80447, 38504, 34566, 109039, 31009, -50623, 121790, 158585, 137448, -20873, -37827, 29154, 63780, 126121, 108885, 94973, 51283, -29339, -36688, -80552, -81053, -85225, -116354, -25377, 61699, 22685, -26797, 8573, 8023, -12028, -44781, -160107, -193720, -244404, -120248, -7077, 50144, 73194, 73748, -9523, -86323, -57507, -90610, -31693, -21425, -98342, -175003, -203796, -247407, -213367, -185804, -44989, -62819]
15218f2819p4180l3422P1221J1153k9791m6245l0927M6170R8190P5132P8313r4171
15206H624j3261k0707j13560l6054j421P1998R4486l7139M4238J28807L0006l0411
15194A25606k3064j55438m5029R9783M0963j8025j2340j60292J1219j233M0347
15183i7503j839j3261j7669K7216O0291J8058p4613J767P8030j4300q808j8128
15171f0759Q921L8433J2717P310k0936m3416K6837o9859r8039K1853M051M5021
15159a27866N2222O7215N7383K7322j15836j49173L7839J2831m5428L5380O5768
15148h2343o0460m2058J00433N2635R1412L8135q1158l0837o395K5549m8216q96
15136d4199J1859M1291J3643l2160M2667O2170j2799l2453K6938j3322p5156j7827
$$ y = [-62819, -136999, -170421, -99200, -88047, -117838, -164083, -195010, -148840, -50650, 24482, 102795, 8624, -4637, -25344, -138904, -174958, -176379, -104381, -9895, -47034, -2796, 126011, 156017, 125606, 102542, -52896, -97925, 1858, 42821, 24796, 12456, -147836, -136617, -137850, -97503, -99342, -112603, -130272, -103056, -42765, -24707, -99320, -97553, -19523, -33823, -42631, -60759, -51838, -13405, -688, 6622, -14314, -57730, -30893, -100752, -198791, -176938, -172887, -127866, -75644, -8429, 48954, 76276, -39560, -188733, -150894, -138063, -183491, -148111, -82343, -142803, -184861, -84428, -31793, 59619, 97754, 16596, -14241, -20636, 4913, -43303, -44199, -32340, 8951, 22594, -9566, 33101, 95271, 82472, 50019, 76957, 63635, -11521, -29348]
15124b9348q718J4170L9288J4127j368K4900L2593j36424r0945O156O9565l8365
15112a04369j08082j2247l3008N6129P1437j4044O0844R912J8437J1417L0877
15101a2697M1950K6107J7456O3982q1470K8483k597O9582N6785o5339m3230M6411
15089A45423m3474l3884J5474o3879p0412J11483O9450L1853o1022n8888K9824
15078G1948Q5903k7557j0970q7489p9754M032o634n7981N0927R9048J5988j5386
15066D2075p2959m2484l2894r9986q1260L2453R2516J03686J4981l8564j4225
15055i6661O5121L0667q1988l3274P9761Q9867r680j323N2749p3686k4543K1297
15043A8307M3855J4953R8627K29n2080m0330r4054k3722O6087R6096m8232p2825
$$ y = [-29348, -38066, -23896, 15392, 29519, 28151, 53051, 85644, -50780, -141725, -135569, -66004, -104369, -212451, -224698, -257706, -201577, -130140, -144184, -83340, -73428, -54991, -43574, -12697, 29253, 55360, 72816, 136798, 55328, 83811, 81214, 150796, 207581, 142242, 99012, 145423, 101949, 68065, 83539, 19660, -50752, 60731, 130181, 162034, 101012, 42124, 71948, 157851, 130294, 119324, 31835, -47919, -43887, -50521, -108502, -57575, 41473, 57461, 42075, -30884, -73368, -106262, -206248, -287508, -255055, -162539, -58853, -43872, -82436, -96661, -31540, -873, -82861, -116135, -36374, 53493, 43813, 42490, 95239, 21553, -2990, 18307, 62162, 77115, 175742, 175971, 123891, 83561, -10493, -34215, 31872, 127968, 79736, 6911]
15031F911M5583k8265n4570j02613o7812P9093J1323k6212J09346R7197Q917j28451
15019d9553r0159Q9306N1288K8389q080o7242O5335M4635n1535q0030L0404M2362
15007E120N5370J0618J6839m3755M1031M5574J22712O2392m0674o3528m0804O8327
14995B39222j33019j21627m3901K583J5861K6724M8479L5319Q137O4589j21712
14984B0655j04573J703j0149K0223K3698J660l0947P64M9635J0875k4166N0591
14972I969M665n084O6614l5866L1779K5630k3503r2236N0493k486M4247n2434
14960B1788q8219n6499p7799P1496l546L520L7465P4384M1421j2284J02843j6588
14948I7982j58732M6148Q2043J0582L9609k126r9083N60K2961k7550j5331k8379
$$ y = [6911, 52494, 24229, -30341, -132954, -200766, -121673, -110350, -136562, -27216, 69981, 78898, -49553, -139712, -50406, 882, 29271, 21191, -46051, 19284, 63919, 12384, -67646, -37242, 5120, 60490, 71108, 87947, 44192, 85223, 130797, 253509, 315901, 275227, 211699, 170895, 239222, 106203, -15424, -59325, -56742, -40881, -14157, 34322, 69641, 77778, 142367, 20655, -83918, -82215, -92364, -72141, -48443, -46783, -77730, -76966, -27331, -16456, -40622, 9969, 14634, 9550, 76164, 40298, 72077, 97707, 74204, -18032, 32461, 29975, 74222, 21788, -66431, -122930, -200729, -129233, -132779, -129259, -91794, -17410, 24011, 11727, 114570, 97982, -60750, -14602, 67441, 78023, 117632, 115506, 16423, 16983, 39944, 12394, -2937, -31316]
14936c1316k5682Q300j06413P553R3516O2032N5766K1748J4554l0025l1960k1215
14924A6858M0867j55831p6249R8350L2723M985R411L8093M5929l942j8363N149
14912C7980J4071J658n7562M8130M3852N228m6114l6353j8313J3682O0838J2492
14900G9589o3265k3349j5539O2355m5322L335l4013l2648Q3638P2990p1316m5323
14888b8868N5076R2946l1529R6792L4332j07395L2990n9991n5011m1669Q610Q5435
14876H1718N2638j08036o6589N3016j897k9310o8922j5457R4532M4434m3777n1116
14864e8766K6492l971J4805J03500k8840j30094o2391k9628p5401j3173R7854
14853a59613J51165j11820n7368Q4627J27654K8822j5424p0634r4339L1997M2640
$$ y = [-31316, -56998, -48698, -155111, -147558, -54042, 7990, 63756, 85504, 100058, 70033, 38073, 16858, 57725, -98106, -174355, -76005, -43282, -38297, -28886, 9207, 55136, 51194, 32831, 37980, 52051, 53709, -3853, 44277, 88129, 93357, 47243, 10890, -7423, 6259, 67097, 79589, 16324, -7025, -22564, 39791, -5531, -2196, -36209, -68857, 14781, 87771, 16455, -28868, 26208, 119154, 87625, 184417, 218749, 111354, 144344, 84353, 29342, -12327, -3717, 81718, 134356, 26320, -40269, 12747, 10850, -18460, -87382, -102839, -8307, 36127, -7650, -58766, -32274, -36245, -21440, 82060, 53220, -76874, -139265, -168893, -244294, -257467, -159613, -8448, -120268, -177636, -93009, 34645, 63467, 48043, -22591, -116930, -84933, -42293]
14842d2293K5366o3963n4293p659N5968J02536n7430k6846n3364L1779P0989p0099
14830h9309q3314J4468K7000j0051k8440M6553J9814K0594J06073J61275p8323
14819A06340j95362k010J29697j1249j26791P1640J82497l939r954k1905O0809
14808A79773l7355q4228o1447q966J5017N5344l9172j20271N4758J56730o458
14797A03725q8741j2111j1771J9644p9120O646j18879P440J62156M5691n0489
14786a5809j1654j06562m4486K466M237m0706j4133J21056J43083R8558J0227
14775A46277r6013p3556k208l109N2521L6903k2004K060J6141K2335j3078n965
14763F0304j8544J0848j650m1523L7134L3193l0640O1078J8569n1472p4433k1497
$$ y = [-42293, -16927, -80890, -135183, -142842, -86874, 15662, -41768, -68614, -121978, -90199, -19210, -89309, -172623, -158155, -131155, -141206, -169646, -123093, -103279, -82685, 23388, 184663, 106340, -89022, -91032, 38665, 27416, -99375, -27735, 154762, 150823, 140869, 118964, 179773, 142418, 58190, -3257, -12223, 2794, 58138, 18966, -101305, -46547, 110183, 103725, 14984, 2873, -8898, 10746, -68374, -61728, -180607, -173167, -11011, 34680, -15809, -27463, -134025, -178511, -176045, -171808, -212514, -226647, -105591, 37492, 136050, 146277, 50264, -23292, -25500, -28609, 23912, 60815, 38811, 40871, 57012, 79347, 66269, 60304, 41760, 52608, 50958, 9435, 46569, 79762, 49122, 110200, 128769, 77297, 2864, -18633]
14751a8633o7835J2085J29849O1962k6890q5533l1248k9091O8128J03588m7835
14740F8547q1400L2983P8795P4175R2247m0343j05288j2833l1466r3946n3023
14729g1552J02013J1756r1978O297N479N6028M632j3977N5415j2639l4311Q9628
14717A06791j9718j23257p9452P6550N6318R6550L8767q1747o4539K530N379n6078
14705d1906M084r447n5294M887R4569O6156m2252p7527O3900J36317p7433j77605
14693a11551P653P1590P6673J29924j15857m0910J05758J0173q8004m6983j2092
14682a3626j2974l468N304L8839q349N343l8511j2878k120n0552n9431l303P9644
14669g6082J23632J2815n7057n2768n0969k312M6327R0046J3484Q51m5150J0503
$$ y = [-18633, -86468, -74383, 55466, 117428, 90538, 5005, -26243, -55334, 12794, 116382, 68547, -12853, 20130, 98925, 173100, 265347, 225004, 119716, 106883, 75417, -18529, -71552, 30461, 42217, -49761, -43464, -37985, 18043, 22675, 8698, 64113, 51474, 17163, 106791, 87073, -36184, -115636, -39086, 17232, 113782, 152549, 70802, 6263, 8793, 14172, -41906, -37822, -47269, -102563, -97676, -3107, 63049, 20797, -56730, 7170, 143487, 66054, -111551, -103898, -32308, 44365, 174289, 58432, 17522, 123280, 133453, 45449, -1534, -13626, -26600, -30068, -24764, 14075, 5726, 11069, -27442, -40320, -42440, -92992, -152423, -155726, -76082, 47550, 60365, 3308, -49460, -100429, -102741, -56414, 33632, 47116, 47967, 2817, 13320]
14657A3320L1744n805n993m6306o6767j52382K2785M4145L0673L3784J4191k5994
14645a12605J03401N1753o6658m2212l5506m0401n1489j3683J70078J41183m0485
14634F3376m1977m6349j09091M8613J7423P5887J2921n537q8604l5976J9556L5137
14622e4621J6903J2347M2234n6765k6366J1325j7575L2661R7603j3770N0254j32085
14610c7855j09318l10O4333O2896n7210n2767K8267P7394r562L3510o0399O7131
14598F110j8304J3795j6492P4052j2635n2901M7295k8554k2987O3011n1276k3194
14586b2080Q2840j13540o7260K0212n748j9154P2457O0834j35821J1889N7899
14575e7472m6425J87759m8674k9587j05634q8293M484J19855M7779o7985k2721
$$ y = [13320, 45064, 39259, 33266, -13040, -79807, -232189, -209404, -165259, -134586, -100802, -86611, -112605, -9204, 42549, -24109, -66321, -101827, -142228, -193717, -207400, -37322, 103861, 63376, 21399, -24950, -134041, -85428, -68005, 7882, 20803, 15266, -73338, -109314, -89758, -54621, -37718, -25371, 16863, -39902, -66268, -54943, -72518, -39857, 57746, 43976, 94230, -37855, -147173, -147483, -83150, -20254, -77464, -130231, -101964, -24570, -34132, -622, -61021, 6110, -12194, 1601, -14891, 59161, 46526, -6375, 40920, 12366, -10621, 52390, 1114, -22080, 60760, -52780, -120040, -99828, -105576, -124730, -52273, 8561, -127260, -115371, -57472, -103897, 83862, 35188, 5601, -100033, -188326, -183842, -63987, -16208, -84193, -106914]
14564a06914K6853O815n5021j27707R2572o997k3435J09369J32996M8265r938
14553H6858j4615O5052k5715j12460J953P3354n4328o2855j7651M1491l3322n5618
14541a07856N6618j952Q1254r707k4931Q3779K4774j26083K1429n0238q0091L1193
14529a01811L4629R4979J12691k2167j11390l8533P7597J5349L8733k2082M8172
14518A26167p3267n5777K7508k0159L1563J05568j13658o3691k6440m1470m6865
14507a50521p0048n2322P8955P6679O9652mn0356J75044J1722j09673J0886M8708
14495C8722k6159j2935Q5899n5001k5072O4542m6850K119J3055o0112o0074J8152
14483f3714p4133K8997K1089l3876N6649P6049P7672r5606l664P0635R1470j1028
$$ y = [-106914, -80061, -73246, -128267, -255974, -163402, -170399, -193834, -84465, 48531, 96796, 86858, 72243, 137295, 111580, -880, 1073, 74427, 20099, -42756, -60407, -18916, -52238, -107856, -51238, -53190, 28064, 18357, -6574, 77205, 101979, -24104, -2675, -52913, -133004, -101811, -67182, 27797, 140488, 118321, 6931, -31602, 45995, 61344, 100077, 77995, 126167, 52900, -2877, 24631, 4472, 36035, 141603, 27945, -35746, -62186, -103656, -150521, -220569, -272891, -193936, -117257, -47605, -47609, -97965, 77079, 88801, -20872, -9986, 38722, 12563, -372, 85527, 30526, 5454, 69996, 23146, 25265, 38320, -21792, -81866, -63714, -137847, -108850, -87761, -121637, -64988, 11061, 88733, -6873, -10537, 60098, 151568, 140540]
14471A40540j38573P0255K4119q131J230o441k7817l9975k4606J11832N1448j4710
14459A39171J34237j01494k20633J02072J88650j08232r5716k3921k7874L7315
14449B3575O8096N1404M08q6635m8792r646J6418J8656K0213r5546k3256n0852
14437a15957j993R312p059j6816j9298k9108L6145Q4457Q9956l937J9720j14216
14425f8794j20874k7217m453J11996O6664N0669K8838O60O1070l6454r0350M0296
14413A2051L9305Q010R185l8964J0734j9042j7484P68L6706p569o6599m3142P3288
14400b753N0227j2309R7053J06065n3873m0213r9857Q713K7957m677j00263r5798
14388a19728l6575O7755M5022N2678j45198M9148R9570L9366p9109k2436P4437
$$ y = [140540, 1967, 72222, 96341, 88210, 89440, 82999, 55182, 15207, -9399, 102433, 153881, 139171, 273408, 171914, -48719, 53353, 242003, 133771, 38055, 14134, -13740, 23575, 91671, 143075, 143483, 56848, 8056, -1590, 14828, 33484, 53697, -41849, -65105, -115957, -117950, -108638, -115697, -132513, -151811, -180919, -144774, -60317, 29639, 25702, 45422, -68794, -189668, -216885, -221338, -109342, -42678, 7991, 36829, 37489, 98559, 62105, -28245, 12051, 51356, 59366, 68551, 29587, 40321, 21279, 3795, 4563, 41269, 33700, -32899, -76041, -2753, 47474, 35165, 132218, 238283, 184410, 144197, 44340, 53053, 81010, 76333, -23930, -119728, -156303, -88548, -43526, 9152, -136046, -86898, 12672, 52038, -27071, -49507, 24930]
14377B4930Q228l4871K8668J4249L917O4848L6474j23349p5753J3264O138l744
14365c7001j5438J2544m160J46192M1926K9959p7972r8708j2376M5274n538J1272
14353C5974j09069p0078o6638L1158J08951K3742L4120R6854j4559n0885n1214
14342c1644j5116n5902J8993K9365k5197l7826L2496J2628Q7361M2102K2557N8019
14330A37836n848q8853J2688L5206J279M706N6535k9180j33632N042K4817j20047
14318i9451k9053J34066q86m7563L1776L979j23758K6031J3749j248j8391j2590
14306a23339K2857l6244P6560R1629p946k2695o0136m0777K8155L2130j0186N5248
14294E256R3772k280r8689r2762K7504K5747o306J6096M9268q7796j5752l1871
$$ y = [24930, 33158, -1713, 26955, 41204, 45121, 109969, 146443, 23094, -52659, -39395, -33257, -37001, -52439, -39895, -44055, 102137, 144063, 174022, 96050, -2658, -15034, 30240, 24702, 35974, -73095, -143173, -209811, -178653, -69702, -45960, -11840, 85014, 70455, 19570, -31644, -46760, -102662, -83669, -54304, -79501, -117327, -84831, -72203, 15158, 57260, 79817, 137836, 131988, 43135, 55823, 91029, 92308, 97014, 153549, 124369, -9263, -4221, 20596, -99451, -128504, 5562, 4676, -42887, -11111, -7132, -130890, -104859, -91110, -92358, -110749, -123339, -100482, -136726, -60166, 31463, 23517, 822, -59314, -100091, -71936, -39806, -49992, 5256, 99028, 96748, -1941, -94703, -67199, -41452, -47758, -31662, 17606, -70190, -85942, -117813]
14282a17813n4250O3128O5411J45293m084q2933o5313n6809J25076M6414j4995
14271D9125l5337n1509o097L5964P813n7058o0669l9697P5189L073k3141o3998
14259a66342L2560P2643L1709M2833k2497k0128K6822K5485N3345n9418q6263
14248f9251M2628M9144J04250j1572j3241p2609m3495j0614j5740K3619L179M4938
14236C1236M0971J06582o6303j5320j95893q4280M3416J38796J18096N0092r0684
14225G6709m9036J1260M486N5257j9725p1209j07508k1322M5889O2366J77053
14214A64220M5310k0817m2368k42M2540o8817r6297m2719J1569J6621k9384m3949
14202f4333J78N2925j804J8283J4199j7632Q581M7046j11861j87341j0000M0367
$$ y = [-117813, -172063, -108935, -43524, 101769, 97685, 14752, -50561, -107370, 17706, 64120, 49125, 13788, -37721, -43818, -7854, -41, -57099, -117768, -157465, -82276, -79203, -102344, -166342, -133782, -61139, -29430, 13403, -9094, -29222, -2400, 23085, 76430, 17012, -69251, -26623, 22521, 126771, 115199, 101958, 29349, -14146, -24760, -40500, -16881, -13702, 31236, 72207, 178789, 112486, 97166, -98727, -183007, -139591, -795, 117301, 167393, 76709, 27673, 38933, 43419, 98676, 78951, 7742, -99766, -121088, -75199, -12833, 164220, 209530, 188713, 146345, 146103, 188643, 119826, 23529, -19190, -7621, 9000, -20384, -64333, -64155, -11230, -13034, 5249, 19448, 1816, 10397, 57443, -54418, -241759, -251759, -211392]
14190b11392N4212Q558o171R801o14J31900O6995L0199p3457J631N692L2166k0209
14177B9311j3971R0490R576L3242k8918o4000n066L5372j7066L1314R6458j07693
14165H9049j29753O8907k9589n2852n0340J4193L5695M2769M2538R3710N9804
14154A84131l195j9315m4060n5710r9317K2068l8712P4995R0998j0204q3349n66
14142A7764N4902m6591K21l0077o6014j9623M4798k0222J9000J3074m907J7824
14130a9851q4145n7362k1973k709P1990K6487L728j0695n3721O109k3910L6617
14118a29435M9791O4042q223j02068J5925Q6501N4500l3952o8257o5052m0691
14107a76919L7726J13070O4574J782l8024j34443K8888O2136j7688k0473J09495
$$ y = [-211392, -157180, -148622, -154793, -144992, -145606, -13706, 53289, 83488, 10031, 11662, 17354, 49520, 29311, 15340, 105830, 115406, 148648, 119730, 55730, 50664, 86036, 68970, 100284, 196742, 89049, -40704, 28203, -1386, -54238, -104578, -90385, -54690, -11921, 30617, 124327, 184131, 180936, 161621, 117561, 61851, -37466, -15398, -54110, 20885, 111883, 101679, 18330, 17764, 72666, 26075, 26296, -3781, -69795, -89418, -44620, -64842, -45842, -32768, -37675, -19851, -103996, -161358, -183331, -186040, -114050, -87563, -83835, -94530, -148251, -142142, -166052, -129435, -79644, -15602, -23825, -125893, -109968, -23467, 31033, -2919, -71176, -136228, -176919, -139193, -26123, 38451, 40233, 2209, -132234, -103346, -41210, -58898, -79371, 30124]
14096C0124K8870K2610l038l7144m616o1876n5438m6588J14493J51855K1821q1541
14084G9532n3727k3170M2874P8578m98K8615o4656o4194M7983r036J4176o2544
14072A3933L8891O621j08302J3800K9192n2898J6138O8868M0147n6626l8294N821
14060b2709O805J08117L4134j17968k8983P300m8886l7960O438P8635N1362k7119
14048I166K7731j4860P9247J2609l462j6331q308m4524j10392J7671N1738n0397
14036e0112M102N6810K9647o226L4793m1388k3417l0353m0776n7508j0493M3592
14024i1329K4424P9619J00937K7130k5349m5194L4169N8647j06402j40067r4825
14013a78240N0551J09380N2701P0770O3782N3852K6300p0747p2501n5491K5156
$$ y = [30124, 58994, 81604, 78566, 41422, 36806, -25070, -80508, -127096, -12603, 139252, 161073, 79532, 25805, 2635, 45509, 124087, 123589, 152204, 87548, 23354, 71337, 62301, 76477, 13933, 52824, 59445, -48857, -35057, -5865, -58763, -42625, 26243, 66390, 9764, -28530, -22709, -15904, 92213, 126347, 8379, -20604, -13304, -62190, -100150, -93712, -15077, 36285, 9166, 36897, 22037, 101284, 113893, 110431, 94100, 85792, 41268, -69124, -51453, 285, -50112, -46010, 10800, 40447, 34221, 69014, 27626, 4209, -26144, -66920, -124428, -134921, -91329, -66905, 12714, 113651, 140781, 115432, 70238, 104407, 163054, 56652, -83415, -178240, -127689, -18309, 34392, 105162, 168944, 222796, 249096, 178349, 105848, 50357, 75513]
14002G5513N9742K3041n9261j09813p7166L3664P7624K3944L7632Q154P3213k4904
13990A41383l4095n9703M460o2137j7091l222K3348N0501q775k5199o55J22775
13978A31590k4044k4048M0735K156k1716j0144m3063m8474m5190J03990m7310
13967A4482r6400K2730l7327L4674n4424p972L0464j4303J29473N9269m0845K3481
13955F3302J4383j40661k0859O2279P6566k604L1781k5523p1471R3287K0571L057
13943A04108q2948J1283J4856q6270K2236P4975J14204L4196M8865O1685J9491
13932C36681r2539q7912K4263L4124Q455j22150j40294Q964k4078M5003J03962
13921I4479Q1185l3506k26136L4998P1840P1778j2466o9975m1116P5627Q1510
$$ y = [75513, 135255, 158296, 99035, -10778, -87944, -54280, 23344, 47288, 84920, 93074, 166287, 141383, 107288, 47585, 52045, -10092, -27183, -30405, -7057, 43444, 34669, 9470, 8815, 131590, 107546, 83498, 124233, 126389, 104673, 94529, 51466, 2992, -42198, 61792, 14482, -81918, -59188, -96515, -61841, -116265, -124237, -93773, -108076, 21397, 80666, 39821, 63302, 77685, -62976, -83835, -21556, 55010, 52406, 84187, 58664, -12807, 80480, 101051, 104108, 21160, 32443, 47299, -38971, -16735, 58240, 172444, 206640, 255505, 317190, 336681, 244142, 156230, 180493, 214617, 223072, 100922, -39372, -30408, -54486, -9483, 94479, 175664, 142158, -83978, -48980, 22860, 94638, 82172, 12197, -28919, 46708, 128218]
13910A28218K9190m991M1545N964j10196r702j2562m4074j47342l0476J54744
13899C18L6865q6381k6591M3299O3102k9850M46l512l704J22355O247o3259m7352
13886A1983R050n58K7033k0987N5228q3962n5613N7567n0319j7376M6928p0092
13874i1118l0383N0061O7573M7385j7115m9482p7516J03591J23253m2407j6549
13863F7293J5640K5997n9260m1444p1944o1762J16399J24755P75k5118P4255L0917
13851A96503o0157l4802m2016o7323o9786N472N9856L0958n7791M5421M4569q5177
13839c4273J8484Q5498M6398K0903m9948m6157m1506J4581K9041R7438L1467l8395
13827A33531J9056L237j05560m7882l2342K6875N0454n4918m0262M5313O0683
$$ y = [128218, 157408, 152417, 193962, 199926, 89730, 80028, 67466, 23392, -123950, -154426, 318, 37183, -49198, -75789, -32490, 30612, 762, 1208, -2304, -6008, 116347, 122594, 59335, 11983, 21033, 20475, 47508, 26521, 81749, -2213, -57826, -259, -50578, -67954, -21026, -91118, -121501, -71440, -3867, 43518, 26403, -23079, -100595, 2996, 126249, 83842, 67293, 82933, 108930, 49670, 8226, -63718, -125480, -9081, 115674, 116449, 91331, 165586, 196503, 136346, 101544, 59528, -7795, -77581, -72109, -12253, 18705, -39086, 6335, 50904, -34273, -15789, 69709, 116107, 137010, 87062, 40905, -601, 13980, 43021, 140459, 171926, 133531, 152587, 155824, 50264, 2382, -29960, -3085, 47369, -7549, -47811, -2498, 58185]
13816E8185K2471o247k2056M9367J19384j2135M5786J1755K1688l7300l1777j76295
13804D2826q4044K6812L1776N6720L0523o8815p1071k7425L1142M4522J282q260
13792E988O9267r7703j0343l4529M6109P2736Q4573m3253j58525j05054O2141
13781a08593Q8527l7797m6322q2425l9656O8691J7615K5787m7950J175J24242
13770c6706J6333k2240q175l6276N5525O5933r389k5241N3262J40013k4377j18340
13758E0322N2763l987p3647o8142O0211J19310m623m7640r8473n3667P9405k1664
13746i832l7762j3085O4439J04532N6403M3726j08079q5421q8861K656N8076P9861
13734F6653J18756L4177l3298j00501J332J16921K1776k1285l9370j8628o5521
$$ y = [58185, 80656, 74409, 52353, 101720, 221104, 208969, 254755, 266510, 288198, 250898, 219121, 42826, -41218, -14406, 17370, 74090, 104613, 35798, -35273, -62698, -31556, 12966, 14248, 5988, 75255, -22448, -32791, -67320, -21211, 51525, 136098, 92845, -65680, -170734, -108593, -20066, -57863, -104185, -186610, -226266, -157575, -139960, -114173, -162123, -160948, -36706, -20373, -42613, -50788, -87064, -31539, 34394, 25005, -236, 53026, 193039, 168662, 50322, 103085, 99098, 25451, -42691, 17520, 136830, 132207, 84567, -13906, -67573, 11832, -9832, -47594, -60679, 3760, 108292, 164695, 208421, 100342, 14921, -73940, -71284, -13208, 66653, 185409, 219586, 186288, 85787, 87119, 204040, 225816, 204531, 165161, 146533, 81012]
13723H1012m4871K8549l3310N822L9027M8211k3421M963k584k1482m622k6994
13711E0300j8723j2642J6945m3149J2707p2476N9813R7316M1879J7383P6694L3234
13699B59281n5916j29872l0675P243j3959J3494K0939j171R388n3254q1178L6359
13687a9321O9518K8396l7355k1792K5020n4422K5826l2717j23829L5640J97116
13676I2080l6341p6817q8712R250K25p581O2256P8711M7343q734L3395M9449L766
13663A58290L9966o3263J5275J5503r0387P9325l6170j31595j8199Q289Q8774
13652F5808k9188N1115J44384K8115r1654o7779k817L1797k5030N1209o8913j59873
13640g2826q740K7956n220q2118O4170J37991j7164n2482N3276m2680n4469k7255
$$ y = [81012, 36141, 64690, 31380, 37202, 76229, 124440, 101019, 105982, 103398, 81916, 77294, 50300, 31577, 18935, 35880, -7269, 5438, -67038, -7225, 90091, 131970, 149353, 226047, 259281, 203365, 73493, 42818, 50061, 36102, 49596, 70535, 69364, 78752, 25498, -55680, -19321, 50197, 78593, 41238, 19446, 44466, -9956, 15870, -16847, -140676, -105036, 92080, 55739, -21078, -109790, -100540, -100315, -107896, -45640, 33071, 80414, 71680, 105075, 154524, 158290, 198256, 134993, 150268, 165771, 75384, 154709, 118539, -13056, -31255, -22966, 65808, 36620, 87735, 232119, 260234, 168580, 100801, 97984, 129781, 104751, 155960, 87047, -72826, -81566, -53610, -58830, -140948, -76778, 61213, 44049, -8433, 44843, 2163, -52306, -79561]
13628g9561O0127M2714M545J3617Q8896p6043o9343P0820R2854L2070j1680k7710
13616A41306K3387M3169j5217K3670K8202n1709j37932r9348k0888J20689M8598
13605A03927m4938N9066p9373n9536q0680o2081N1181Q9457n489N7705R2125l3935
13593H7429p3168R801k5982N0669K0691j1264J3300P0837j0043n1666K8199p016
13581A01787j33231L6441q322l4940N6956k0800K0244M060J6538L7341L783j2756
13569F7101r74P8439K1729J8774M357k5382l6011N8389N0090Q5804n7329j16375
13557A48612l2496K3221L3359l3544M888o9925L393R6553m7362m9324N2762N6696
13545A86833r0605n5994O3815Q3647j5077m8512n7355m3913N4062j5917K2056
$$ y = [-79561, -19434, 23280, 27825, 41442, 130338, 54295, -15048, 55772, 148626, 180696, 169016, 141306, 164693, 207862, 192645, 216315, 244517, 192808, 54876, -44472, -65360, 55329, 103927, 58989, 118055, 38682, -20854, -101534, -163615, -112434, -22977, -28466, 29239, 121364, 87429, 14261, 24062, -1920, 48749, 69440, 58176, 71476, 142313, 132270, 80604, 108803, 101787, -31444, 4997, -3325, -38265, 18691, -2109, 18135, 22195, 38733, 76074, 79857, 67101, 66127, 144566, 166295, 185069, 189426, 164044, 128033, 186422, 236512, 322316, 264987, 148612, 116116, 139337, 172696, 139152, 144040, 74115, 77508, 174061, 126699, 77375, 130137, 186833, 96228, 40234, 104049, 187696, 172619, 124107, 66752, 22839, 76901, 60984, 83040]
13534H3040N2106L8927L7440j04547q6929l9220n1878K6582O3588M5044K4406
13523H8559k6278M4187m951J1933l5137r189J966M4428L0467Q519P7099J620J10770
13510C43993o4681r9581o400l9000o336M7841M0171l6461K5823m4273R35l2950
13498A29081P4985R5760m6796j27526K9313J10270j2651p6803n7065m7699r2950
13487b2081O0664P0091l6690k5458M0274Q1109q3924k7484J08535Q1669N1245
13476B97950l9167p4297r5575k4259l1870n1966o5485Q2756O0975K9141L841n0401
13464D1643O8750P1658q9258j32369J39174J02531j9442j15080K9821K9552j8326
13453A08654L259O0188N9323L8561l1906k8466K3121l2261j8042m913N4791J5953
$$ y = [83040, 135146, 174073, 211513, 106966, 20037, -19183, -71061, -44479, 19109, 64153, 88559, 62281, 106468, 101517, 113450, 78313, 69124, 71090, 115518, 145985, 154504, 231603, 233223, 343993, 279312, 179731, 173331, 134331, 127995, 175836, 216007, 179546, 205369, 161096, 162031, 129081, 204066, 299826, 253030, 125504, 154817, 265087, 252436, 175633, 118568, 70869, -22081, 38583, 108674, 71984, 46526, 86800, 167909, 83985, 56501, 165036, 246705, 297950, 258783, 184486, 88911, 64652, 32782, -19184, -84669, -1913, 59062, 88203, 92044, 41643, 110393, 182051, 92793, -39576, 99598, 202129, 182687, 67607, 97428, 126980, 108654, 111913, 172101, 231424, 269985, 238079, 209613, 232734, 200473, 182431, 177518, 232309, 248262]
13441B48262j7514P677p8605l0659J2717j2488O952J4964r1396r0390Q6607J0758
13429F6885L0852r214k5540o0776n2251O8466P0060J2444J15034Q4203j18155
13418A82008o7719k0535J6080L968N7471R1958M0675j1786m4501p3764j07799
13407F6056O5335O2474J22739J4871j2855q850n9137j4639N1837j9139j32679
13396A36013n0496O5980O7243n950l2991K8989n738J9459j15532m6755L6600J6459
13384A13281J9864J23765j02383r3004Q8372J1092k2708L2622k5069N7469Q7204
13373B90505k600q6754o294J08854O5917j8332j24413l0572n6311J895Q6698O7434
13361B96027M472j80758n9123J6681J56494K6042J5310N4667n8805n1080J4875
$$ y = [248262, 230748, 238425, 159820, 129161, 141878, 129390, 136342, 151306, 59910, -30480, 56127, 66885, 97737, 88523, 62983, 2207, -50044, 18422, 88482, 100926, 215960, 300163, 182008, 114289, 93754, 109834, 113802, 171273, 263231, 303906, 292120, 247619, 173855, 66056, 131391, 193865, 316604, 331475, 318620, 309770, 250633, 235994, 287831, 268692, 136013, 85517, 151497, 218740, 212790, 179799, 208788, 203050, 222509, 106977, 60222, 96822, 113281, 133145, 256910, 154527, 61523, 149895, 160987, 138279, 170901, 145832, 203301, 290505, 287905, 201151, 194857, 303711, 369628, 351296, 226883, 196311, 140000, 141895, 228593, 296027, 300499, 119741, 60618, 77299, 233793, 259835, 275145, 329812, 271007, 219927, 234802]
13350B34802k1002R932N6044n1092M0998Q3070J9734L8814n8430j22615p510r765
13338B12980k1099l3163k4299l5789M8949O0269J03634K7290N15q7428J8209n6623
13326B13445m3480M3721K3322j271K5647l950O8023N5966N140q102q0771K6348
13314C24038l4115m7972M0905R2134n3040n7190p7896P3666j559P8564R5690k9982
13302D03243r2960k5492j9740J1182m5667N0246R6590p5509j1401j5158Q3816
13291C59150M5131q1068p9094J2042k3790o6569L6175L6173n204k9464L9322P992
13279B50796k1533l5400L2094j5314k4600P436k2361n4258J30122Q1699J01714
13268D30395o3534l3067M9803J3448m1646q0436l0048q0121o0480M3471M6132
$$ y = [234802, 213800, 223732, 279776, 228684, 269682, 352752, 372486, 411300, 352870, 230255, 222745, 212980, 191881, 158718, 134419, 98630, 147579, 207848, 311482, 338772, 339287, 251859, 270068, 213445, 169965, 213686, 237008, 235737, 261384, 257434, 325457, 381423, 386563, 378461, 297690, 324038, 289923, 241951, 282856, 374990, 321950, 264760, 186864, 260530, 258971, 337535, 433225, 403243, 310283, 284791, 265051, 276233, 230566, 280812, 377402, 301893, 290492, 275334, 359150, 404281, 323213, 244119, 256161, 232371, 165802, 201977, 238150, 232946, 203482, 242804, 250796, 229263, 193863, 225957, 210643, 186043, 193479, 171118, 116860, 246982, 328681, 430395, 366861, 333794, 383597, 397045, 355399, 274963, 244915, 164794, 104314, 147785, 193917]
13257A93917M8025j1983L6825j3723K5060J8624K9954J22646O424q081j1788j21148
13245C14752o3106l1564l9655m0718J004K7445k6653N3978Q0706m80j16652J14474
13233B73531p709M4206K8558j6714N4324J2274m1254j5896J0232J6945p8481L810
13221B83826K6593N6669k6683J3753N4924m5128n3157L281O318m0329K2650O8239
13209C70956P7083k7007m4110o5809p0922L1771r193j3227n3972j07147L7485
13198A25908O6932q087K0211n265K2708O2545J1345l4935M0165o875k9454l0528
13186B34670O6754N957l17Q0117L1918N2032j205K2168o2884o4830m6902P7691
13174C95169O4360L5352m8420k5143R4257k9466m9188n1964q5009q515O7859R1256
$$ y = [193917, 241942, 229959, 266784, 253061, 278121, 296745, 326699, 449345, 455769, 447688, 435900, 314752, 251646, 220082, 180427, 139709, 140713, 168158, 141505, 195483, 276189, 275709, 159057, 273531, 265822, 310028, 338586, 321872, 376196, 388470, 347216, 331320, 341552, 358497, 280016, 283826, 310419, 367088, 340405, 354158, 409082, 363954, 310797, 314078, 320396, 280067, 302717, 370956, 448039, 421032, 376922, 311113, 240191, 271962, 262769, 249542, 195570, 88423, 125908, 192840, 184753, 204964, 199699, 222407, 284952, 296297, 261362, 301527, 294652, 265198, 234670, 301424, 307381, 307064, 387181, 419099, 471131, 469926, 492094, 429210, 364380, 317478, 395169, 459529, 494881, 446461, 421318, 515575, 486109, 436921, 384957, 299948, 291433, 359292, 450548]
13162D50548l6380l0713J1422j2295j982k8996L9116n5545k8580o6968m926J3923
13150B48624l9810K3145P9156J8880m9843k3176M3618K5830M4090O08K383L2463
13138D05968M245j07994L4860N9604J16834R9101q7067l3658R0206j7177J2100
13127E77022M3788N6984o0117j12765j04248j1995n092Q5999L1623m5742K9294
13116D84751l1119l0421J61332J6400o4589p3908q5954j3653J9140m761L7689
13105D14907N0874M8101j00739l3459R9502J34380K2627J5259m1745k9667P475
13094E87515j158j1076j35369M4105M5369r1398K9494P958l4152N0599N4932M0110
13082E86929L0413n5631N5253N014n2767o7230j19115l8653L4814J46485L9217
$$ y = [450548, 414168, 383455, 394877, 382582, 380600, 351604, 390720, 335175, 306595, 239627, 234701, 248624, 208814, 231959, 311115, 329995, 280152, 256976, 300594, 326424, 370514, 371122, 373505, 405968, 410213, 302219, 337079, 396683, 513517, 612618, 525551, 491893, 582099, 564922, 577022, 620810, 677794, 617677, 504912, 400664, 388669, 383577, 469576, 501199, 455457, 484751, 453632, 423211, 584543, 600943, 536354, 462446, 376492, 362839, 381979, 377218, 414907, 465781, 513882, 413143, 379684, 479186, 613566, 636193, 651452, 609707, 580040, 587515, 586357, 575281, 439912, 484017, 529386, 437988, 467482, 475440, 441288, 491887, 546819, 586929, 617342, 561711, 616964, 621978, 569211, 501981, 382866, 344213, 379027, 525512, 564729]
13071E64729l6416l3980j5964l8437K9070P5103J2676n2819O5026L4230L2112
13060F35330P2013k9119O4623r1660k7215r288j4645n5449j5138o817j1704P9194
13048E90125l8883j14552o84J22889J1219M0600N1163j0992j43565j7313L4456
13037E24463O1317o1441o4822N4301J44594P2691o4938l5463R36P0195K5079j14208
13025F12704j9633m1695J1069K7782m9381P936J07304Q6446M0795m0422k4499
13014G18406j22099l5079Q6365O7418J0600k744m6343k781o1961N52L6052M36
13002F48822j7578m9780j39230j04334j0685R2650J24287Q8587J48179K9526j1170
12991G99274l5366n4362j5466M286R1897k6626L6392J45785J6897p4563j45105
$$ y = [564729, 528313, 494333, 478369, 439932, 469002, 544105, 556781, 503962, 568988, 603218, 635330, 707343, 678224, 742847, 651187, 623972, 614684, 600039, 544590, 529452, 522635, 510931, 590125, 551242, 436690, 436006, 558895, 570114, 610714, 661877, 650885, 507320, 490007, 524463, 585780, 524339, 459517, 513818, 658412, 731103, 666165, 630702, 631638, 701833, 726912, 612704, 593071, 551376, 562445, 590227, 540846, 548782, 656086, 742532, 783327, 742905, 718406, 596307, 561228, 647593, 715011, 725611, 722867, 676524, 673743, 611782, 612334, 648386, 648822, 631244, 581464, 442234, 337900, 327215, 419865, 544152, 632739, 780918, 810444, 799274, 763908, 709546, 694080, 698366, 790263, 763637, 800029, 945814, 962711, 888148, 743043]
12980G43043r21P9130L3580P7180M8167o4676j37581j21854J22139R9601L0563
12969I08371k2772l8930N9572L1906o7261j20922n1267r3976j7142M6887l0273
12958F04193K7445J7629k5866L9976P3575J95925l3428n1045J9654J5373N0579
12947I34010N9124l3975q9842O2138M2768j7869o9741l4952M5973l6811K7814
12936H88637P4302O5424K0787J3340L5604P3j17028j02283p552J16125k3423m2522
12924I21484K5985R510L2716P9054O1027O8928k5585j37946q8035j0882K3315
12913I59571l9389N6337M2946P7412k7885k2914J1672n8719l349l4527j0045J7937
12901I69047J8932J2094j6587j5074J08986J02238j5983p1096J7655O3745K0007
$$ y = [743043, 742122, 821252, 854832, 932012, 980179, 915503, 777922, 656068, 778207, 877808, 908371, 885599, 846669, 906241, 938147, 870886, 749964, 698697, 604721, 587579, 634466, 604193, 631638, 649267, 623401, 663377, 736952, 932877, 899449, 848404, 868058, 883431, 934010, 993134, 959159, 869317, 931455, 974223, 956354, 886613, 851661, 897634, 860823, 888637, 962939, 1028363, 1049150, 1062490, 1098094, 1098167, 981139, 878856, 871304, 987429, 964006, 921484, 947469, 956979, 989695, 1068749, 1129776, 1198704, 1173119, 1035173, 947138, 936256, 959571, 920182, 976519, 1019465, 1096877, 1068992, 1046078, 1057750, 999031, 995682, 961155, 951110, 969047, 987979, 1000073, 983486, 968412, 1077398, 1179636, 1163653, 1092557, 1110212, 1173957, 1193964]
12890A193964p5377l2507k9571k5234R2881P3154p153L1764K5078L8556j4271
12879A271284p7032K1577K5988n2328R673L9110J18966j7905o0347j61623k006
12868A115357Q5706l5033M6705J93797J08416r309j0051r6999L7498J16430n066
12857A547451j6989o9979o5477O1681Q3785k0369l6110r4830L5621J13998l3547
12846A505235k6327k2043J17706M8062M7098n4824k1681n2242l3756J8003l4612
12835A490619N8618O1015R31J5929j2729L7974K9619M5560k8332q5260m1919K4031
12823A596056j1702M028M8967R336O3895J7073J20859M208l8206J2515m3629n8204
12811A725196K0202j0264m4853R4646O1125L0125j2537m8452P1094J29778N2162
$$ y = [1193964, 1118587, 1086080, 1056509, 1031275, 1124156, 1197310, 1190157, 1221921, 1246999, 1285555, 1271284, 1194252, 1215829, 1241817, 1189489, 1199162, 1238272, 1357238, 1339333, 1278986, 1117363, 1115357, 1201063, 1166030, 1212735, 1406532, 1514948, 1505639, 1495588, 1398589, 1436087, 1552517, 1547451, 1530462, 1460483, 1395006, 1456687, 1540472, 1520103, 1483993, 1389163, 1424784, 1538782, 1505235, 1478908, 1456865, 1574571, 1622633, 1669731, 1614907, 1593226, 1540984, 1507228, 1525231, 1490619, 1549237, 1610252, 1611183, 1627112, 1614383, 1652357, 1681976, 1727536, 1699204, 1613944, 1572025, 1596056, 1584354, 1588382, 1637349, 1646685, 1710580, 1727653, 1848512, 1852720, 1814514, 1827029, 1783400, 1725196, 1745398, 1735134, 1690281, 1784927, 1846052, 1876177, 1863640, 1815188, 1886282, 2016060, 2068222]
12800B068222o1603M2650K9666j9005k5149m4508L02L4943N6012L1596p6650J1125
12788B047601m228l956R3694N3359q8130j5699P6015J10884O7020Q4871R7915
12777B519346o9098J2495R4117P1052o8157L8145J14148J17086J77767K33588
12767C240489L01633M10290M60122L12742K21384O738o1867j75488k60072l02904
12757D153067k90582k79507k08727j36350r3175k29903r5751J45120J19187o1991
12747C021388n3722j0221K8765m222J48J11998L9361M468L9786N11J1673o5355
12735C124578M2408J37356N9550L3773k9747n768L3070R2117J15909N5853o3343
12724C595756J79Q442k1735l7890P4369K10385Q2267j959O4929R3401l01o534
$$ y = [2068222, 2006619, 2049269, 2078935, 2059930, 2034781, 1990273, 1990575, 2025518, 2081530, 2113126, 2036476, 2047601, 2043373, 2039417, 2133111, 2186470, 2098340, 2082641, 2158656, 2269540, 2336560, 2421431, 2519346, 2450248, 2462743, 2556860, 2627912, 2559755, 2597900, 2712048, 2829134, 3006901, 3240489, 3542122, 3952412, 4412534, 4725276, 4946660, 4953398, 4891531, 4716043, 4455971, 4153067, 3862485, 3582978, 3374251, 3237901, 3144726, 2914823, 2819072, 2964192, 3083379, 3021388, 2967666, 2957445, 2986210, 2981988, 2982136, 3094134, 3133495, 3137963, 3177749, 3178260, 3189933, 3124578, 3166986, 3304342, 3363892, 3397665, 3367918, 3362150, 3395220, 3487337, 3603246, 3659099, 3595756, 3595935, 3604377, 3582642, 3544752, 3619121, 3829506, 3911773, 3909814, 3974743, 4068144, 4067843, 4061309]
12712D061309j2304P602P6769L6865j6493Q84J8427R19O0930L7640J34774J58553
12700D565875J4822l9736P3667J09269Q2319L9579J3741O7655M4710J14689N0929
12689E137519j6674n708J38721J17595L9163J21712J18268N3829L6243L2241M6107
12678E819016J47326J31201P8321M8176M5375O5815P5865R6095Q4652K0869M7530
12667F660241R9337J58191R9650O5299Q2604J34507K0315Q2943J14997R8890M5771
12656G662745k893J10613K50062K10004J51222Q4507P9188J16951J25716N3570
12646H841685Q8190J22357J26872N4611J67895J40635Q2184J27511J98403K10552
12636A0160895J17961M5666K02181K93134J55118J04849J74472J72398K76677
$$ y = [4061309, 4049005, 4056607, 4133376, 4170241, 4153748, 4154632, 4173059, 4173978, 4234908, 4272548, 4407322, 4565875, 4580697, 4540961, 4614628, 4723897, 4806216, 4845795, 4859536, 4927191, 4971901, 5086590, 5137519, 5120845, 5115137, 5253858, 5371453, 5410616, 5532328, 5650596, 5704425, 5740668, 5772909, 5819016, 5966342, 6097543, 6175864, 6224040, 6269415, 6335230, 6411095, 6507190, 6591842, 6612711, 6660241, 6759578, 6917769, 7017419, 7082718, 7165322, 7299829, 7320144, 7403087, 7518084, 7616974, 7662745, 7659852, 7770465, 8020527, 8230531, 8381753, 8466260, 8545448, 8662399, 8788115, 8841685, 8929875, 9052232, 9179104, 9233715, 9401610, 9542245, 9624429, 9751940, 9950343, 10160895, 10278856, 10324522, 10526703, 10819837, 10974955, 11079804, 11254276, 11426674, 11703351]
12627A1703351K11847J35122K77821J75697J13285J30629J24395L19689L24191
12618A3516027K66611J47665J89715K64497L23493L28246L71528K98673K70443
12609A5976898L27348K31078L17404M34226L33948M25223N12761N02090M01729
12600A9462705L91608M21814M23418L97716M65737L08805L99624M79281N20642
12591B3271350M40319M36302N60901O28193O70183O07406N23904O90936O83976
12582B8513470O46754O37661O92209P50137Q20605R31049R93779R05687Q70343
12573C5761694Q88759J016218R67053J045882J055315J165443J228349J234113
12565D4362826J363779J503066J412570J529154J672095J888116J879506J619197
$$ y = [11703351, 11915198, 12050320, 12328141, 12503838, 12617123, 12747752, 12872147, 13191836, 13516027, 13782638, 13930303, 14120018, 14384515, 14708008, 15036254, 15407782, 15706455, 15976898, 16304246, 16535324, 16852728, 17286954, 17620902, 18046125, 18558886, 19060976, 19462705, 19854313, 20276127, 20699545, 21097261, 21562998, 21871803, 22271427, 22750708, 23271350, 23711669, 24147971, 24708872, 25337065, 26007248, 26614654, 27138558, 27829494, 28513470, 29160224, 29797885, 30490094, 31240231, 32060836, 32991885, 33985664, 34891351, 35761694, 36650453, 37666671, 38633724, 39679606, 40734921, 41900364, 43128713, 44362826, 45726605, 47229671, 48642241, 50171395, 51843490, 53731606, 55611112, 57230309]
12557E7230309J592415J738012J833933J863371J892864J934261K110374K094134
12549G2289673K215977K300237K390414K540680K737137K862822K878939K909910
12541I3125789L050581L106728L203024L371553L359462L409540L667591L675895
12533A19970163L661820L583591L649951L731947L742248L640281L590318L505566
12525A49075885L442137L346462L118547L012118K858511K499849K184305K085955
12517A71623769J777981J323134Q78545M86499K27625j78801n47138p87481j100146
12508A73703987j545524j761150k000931k396955k671911k787166k980906l152539
12500A54406905l235115l351298l378144l515686l638478l582122l600669l490798
$$ y = [57230309, 58822724, 60560736, 62394669, 64258040, 66150904, 68085165, 70195539, 72289673, 74505650, 76805887, 79196301, 81736981, 84474118, 87336940, 90215879, 93125789, 96176370, 99283098, 102486122, 105857675, 109217137, 112626677, 116294268, 119970163, 123631983, 127215574, 130865525, 134597472, 138339720, 141980001, 145570319, 149075885, 152518022, 155864484, 158983031, 161995149, 164853660, 167353509, 169537814, 171623769, 173401750, 174724884, 175603429, 176089928, 176317553, 176138752, 175591614, 174804133, 173703987, 172158463, 170397313, 168396382, 165999427, 163327516, 160540350, 157559444, 154406905, 151171790, 147820492, 144442348, 140926662, 137288184, 133706062, 130105393, 126614595]
12492A26614595l449880l472421l430767l335389l220892l275306l285555l337802
12484I9806583l115772l065363k914926k787952k656784k652690k543951k493569
12476G7575576k333093k240280k169872k090697k057932j964455j933404j785914
12468F0999929j702593j651123j552541j528660j480562j476582j334521j277305
12460D8996042j277542j247249j071582r96310j125355j045637r96959r99938
12452D0235470j008090r40324q29769q36884p84963p97862o88599o67902p42455
12443C2938622o48275o32969o94306o39026o14570n26527n36998n93756n43707
12434B7508488n16568n25831n26851m15152m30696m51230m96921m83008m14807
$$ y = [126614595, 123164715, 119692294, 116261527, 112926138, 109705246, 106429940, 103144385, 99806583, 96690811, 93625448, 90710522, 87922570, 85265786, 82613096, 80069145, 77575576, 75242483, 73002203, 70832331, 68741634, 66683702, 64719247, 62785843, 60999929, 59297336, 57646213, 56093672, 54565012, 53084450, 51607868, 50273347, 48996042, 47718500, 46471251, 45399669, 44403359, 43278004, 42232367, 41235408, 40235470, 39227380, 38287056, 37457287, 36620403, 35835440, 35037578, 34348979, 33681077, 32938622, 32290347, 31657378, 30963072, 30324046, 29709476, 29182949, 28645951, 28052195, 27508488, 26991920, 26466089, 25939238, 25524086, 25093390, 24642160, 24145239, 23662231, 23247424]
12425B3247424l23097l29124m33748l11090l38680l65600l22041m11647l34237
12416B0078160k28078k30061j91983l22981k74539k92103k93299k42674j99678
12407A7802764l86528m15176l42292k71864j59040k70491k27188l07558j91101
12398A5231526j44260k58996k27822l17212l01620j97945k51768k46844k34242
12389A3050817l13452k77487j61821j55988j10881j82918j64319k92872l42872
12380A1048207k16254k36896j36577j40925j49268k01259j12754q8240j43408
12371I622626j23656j11594j59188j63214k37074j55353j11758j23353k07550
12362H229886n9991J963n6844j89440q5876j53626j94227r4964j24786m7641j72202
$$ y = [23247424, 22924327, 22595203, 22161455, 21850365, 21511685, 21146085, 20824044, 20412397, 20078160, 19850082, 19620021, 19428038, 19105057, 18830518, 18538415, 18245116, 18002442, 17802764, 17416236, 17001060, 16658768, 16386904, 16227864, 15957373, 15730185, 15422627, 15231526, 15087266, 14828270, 14600448, 14283236, 13981616, 13783671, 13531903, 13285059, 13050817, 12737365, 12459878, 12298057, 12142069, 12031188, 11848270, 11683951, 11391079, 11048207, 10831953, 10595057, 10458480, 10317555, 10168287, 9967028, 9854274, 9766034, 9622626, 9498970, 9387376, 9228188, 9064974, 8827900, 8672547, 8560789, 8437436, 8229886, 8169895, 8171858, 8115014, 7925574, 7839698, 7686072, 7491845, 7396881, 7272095, 7224454, 7052252]
12351G052252j22320m4566n5070J9452L1982k13852k28960r6953p5363j20793
12341F145809j48340N1070o196n3239p9042p0188m3811p2963n5517k6703m6775
12330E594105j56589q6153M9916q04n7621m9557j25261j29188l6810m2826j17234
12319D841978m1526M4214r39p6298n4268j01375n6509n9405r2451n3839o5729
12308D283853O8946Q049q1439j09232r3341M6792J4920q6444j00750K9991L9588
12297D020933j9372o3469p8914l7509j4462M9420m6726j32838m5470N7877K9507
12286C718977r84k3204J4642M9464j3819j22318q5060r9393j2141l5789k2983
12275C367392P8856k8261l7148q2349K4583J4719R5679J09635J73031L45782M04718
$$ y = [7052252, 6929932, 6885366, 6830296, 6849748, 6881730, 6667878, 6438918, 6341965, 6266602, 6145809, 5997469, 6048539, 6042343, 5989104, 5910062, 5839874, 5796063, 5723100, 5667583, 5640880, 5594105, 5437516, 5351363, 5401279, 5400475, 5342854, 5293297, 5168036, 5038848, 5002038, 4959212, 4841978, 4800452, 4844666, 4843727, 4767429, 4713161, 4611786, 4555277, 4495872, 4403421, 4349582, 4283853, 4352799, 4360848, 4279409, 4170177, 4076836, 4123628, 4138548, 4052104, 3951354, 3981345, 4020933, 4001561, 3938092, 3859178, 3821669, 3807207, 3856627, 3809901, 3677063, 3631593, 3689470, 3718977, 3717993, 3694789, 3709431, 3758895, 3745076, 3622758, 3537698, 3438305, 3426164, 3390375, 3367392, 3446248, 3417987, 3380839, 3298490, 3323073, 3337792, 3433471, 3543106, 3716137, 4061919, 4466637]
12264D466637M93078L87641J52462j15919l32490l51948l24462k96579k80205
12255C798215l21309j71576p0722r5614j14342j35991k8540O858j32o2271j56134
12244B648442m7883r0633j35078k718P5924O469r347J2332K9949l7090r2914o2035
12232B295418M8877N0928j11157j19685k0557k7850N2732J07631l6435o5701n4066
12221B120135j980L2070j37387o0576N7167j9563q6864m3898m9852m3207l0820
12210A735225L7918k0844O7369N4985j0945k952m6030M9658j356p3510p8036p5973
12198A635509o4182j8719N7998P4518K2448l3751k9004k9936R3165l4014l5918
12187A638114m551J627j6412P274Q9488p7052p3103n3054m7972O4818l1803N7418
$$ y = [4466637, 4959715, 5347356, 5499818, 5383899, 5051409, 4699461, 4374999, 4078420, 3798215, 3476906, 3305330, 3234608, 3138994, 3024652, 2888661, 2860121, 2866979, 2866847, 2804576, 2648442, 2600559, 2509926, 2374848, 2372130, 2448054, 2454523, 2445176, 2457508, 2487457, 2450367, 2357453, 2295418, 2344295, 2395223, 2284066, 2164381, 2143824, 2115974, 2168706, 2276337, 2239902, 2174201, 2120135, 2118155, 2150225, 2012838, 1952262, 2009429, 1989866, 1903002, 1859104, 1809252, 1766045, 1735225, 1773143, 1752299, 1819668, 1874653, 1863708, 1860756, 1814726, 1864384, 1863028, 1789518, 1711482, 1635509, 1571327, 1552608, 1610606, 1685124, 1707572, 1673821, 1644817, 1614881, 1708046, 1674032, 1638114, 1633563, 1635190, 1618778, 1626052, 1715540, 1638488, 1565385, 1512331, 1464359, 1529177, 1497374, 1554792]
12175A554792k0877K9371P9269o9436n1215j05710o2200P4897O9993m2231J6895
12164A473548n0197J3661Q4934K8759j16621m7772p8531o8353K702R2566p7551
12153A257145R535K7315q6231L4043P8797L4147R3990P564J7411J7714k4858j2639
12141A453933k7778o6414n2408k681K5046O9456p15j65240o9866N0402L1507p6173
12129A169069r8304J20615P7776p0829k7128J01745K9169m5192o6323L0309m0419
12118A180488j2963M0021N565q831r8464j34399k022j3416K93J8899n2763L3672
12106I56080Q9763L228k4409J4808p565j9129j14218k8394M529p0657l3174R3761
12094H64623O3728p6662n1465J16102J19429k6041M653m8541N136K9052L45o693
$$ y = [1554792, 1533915, 1563286, 1642555, 1573119, 1521904, 1416194, 1353994, 1428891, 1498884, 1456653, 1473548, 1423351, 1437012, 1521946, 1550705, 1434084, 1386312, 1307781, 1239428, 1242130, 1334696, 1257145, 1266680, 1293995, 1207764, 1241807, 1320604, 1354751, 1448741, 1456305, 1473716, 1491430, 1466572, 1453933, 1426155, 1359741, 1307333, 1304652, 1329698, 1399154, 1398439, 1233199, 1163333, 1213735, 1245242, 1169069, 1070765, 1191380, 1269156, 1198327, 1171199, 1272944, 1302113, 1256921, 1190598, 1220907, 1180488, 1167525, 1207546, 1213111, 1204280, 1105816, 971417, 969395, 955979, 956272, 975171, 922408, 956080, 1045843, 1049071, 1024662, 1039470, 1031905, 1012776, 898558, 870164, 874693, 804036, 770862, 864623, 928351, 851689, 800224, 916326, 1035755, 1009714, 1014367, 965826, 970962, 1000014, 1000359, 993666]
12082I93666j9723R2998m581q7472q2826o3679j3841o315p030r875j8263L5131
12070H08190R334J0056k8375M1420N0486r5256M538M1879O4431l9756j39554n7374
12058F70019k74K3994R3988R7413l1788j307L6304j15q3746j4866J22875l0450
12046H82047o8775j5547j15960n6005J02005Q9487q3162q1838L990P1117j8096
12035G09263n2517j8311N3373J36216j1805p737J9165j8031j30584j03567J40387
12024G15852N0543k7814J2757P3797p0132r6149j9519K0636J5997N6178P2887
12013H05033J9395K7488K1327p5812r4343j15604j7174J42971l4155k5945o1423
12002E91758O5550L2227k3169r929m2200N0465J6941O3887j2922J5720n1556m8835
$$ y = [993666, 973943, 1066941, 1062360, 974888, 892062, 828383, 814542, 808227, 801197, 791322, 773059, 808190, 817524, 827580, 799205, 840625, 891111, 795855, 800393, 842272, 906703, 866947, 727393, 670019, 669745, 693739, 787727, 885140, 853352, 852045, 888349, 888234, 804488, 789622, 912497, 882047, 813272, 797725, 681765, 625760, 727765, 817252, 734090, 652252, 656242, 727359, 709263, 656746, 638435, 691808, 828024, 816219, 808482, 827647, 809616, 679032, 575465, 715852, 766395, 738581, 751338, 825135, 755003, 658854, 639335, 659971, 675968, 732146, 805033, 824428, 851916, 873243, 797431, 703088, 587484, 570310, 713281, 679126, 653181, 591758, 657308, 689535, 666366, 656437, 614237, 664702, 681643, 745530, 732608, 748328, 696772, 647937]
11990F47937N9527j7667r3734j82034J3586R8138L4755J2075K6597l594J7671
$$ y = [647937, 707464, 689797, 596063, 414029, 427615, 525753, 560508, 572583, 599180, 595586, 613257]
$$ [...]
##END NTUPLES=NMR SPECTRUM
##END=
