##TITLE=Analysis number 313910
Compound Code cc 34446
Book Reference 451/37
Project Code adrs
Chemist Name evam
##JCAMPDX= 6.0         $$ Bruker NMR JCAMP-DX V2.0
##DATA TYPE= NMR SPECTRUM
##DATA CLASS= NTUPLES
##ORIGIN= Bruker BioSpin GmbH
##OWNER= NMR
$$ XWIN-NMR		Version 3.5
$$ Tue Sep 27 14:30:35 2005 GMT Daylight Time (UT+1h)  MAYBRIDGE\NMR@NMR_250MHZ
##.OBSERVE FREQUENCY= 250.131544655141
##.OBSERVE NUCLEUS= ^1H
##.ACQUISITION MODE= SIMULTANEOUS (DQD)
##.ACQUISITION SCHEME= undefined
##.AVERAGES= 16
##.DIGITISER RES= 18
##SPECTROMETER/DATA SYSTEM= dpx250
##.PULSE SEQUENCE= zg30
##.SOLVENT NAME= CDCl3
##.SHIFT REFERENCE= (INTERNAL, CDCl3, 0, 16.522)
##AUDIT TRAIL= $$ (NUMBER, WHEN, WHO, WHERE, WHAT)
$$ ##TITLE= Audit trail, XWIN-NMR		Version 3.5
$$ ##JCAMPDX= 5.01
$$ ##ORIGIN= Bruker BioSpin GmbH
$$ ##OWNER= NMR
$$ C:\u/data/dgb/nmr/ADRS/10030/pdata/1/auditp.txt
$$ ##AUDIT TRAIL=  $$ (NUMBER, WHEN, WHO, WHERE, WHAT)
(   1,<2005-09-27 14:30:16.47 +100>,<MAYBRIDGE\NMR>,<NMR_250MHZ>,
      <created by zg, POWCHK disabled, PULCHK disabled
       configuration hash MD5:
       62 19 C7 07 E1 42 D1 B7 37 6C 3D D0 77 39 F9 E6
       data hash MD5: 64K
       27 43 9C 74 99 8F 2B 63 28 FC 81 08 78 BE 86 C5>)
(   2,<2005-09-27 14:30:27.96 +100>,<MAYBRIDGE\NMR>,<NMR_250MHZ>,
      <Start of raw data processing
       ef LB = 0.3 FT_mod = 6 PKNL = 1 SI = 32K 
       data hash MD5: 32K
       74 30 5D C1 C4 54 38 33 2B F2 65 89 E3 B6 4B E0>)
(   3,<2005-09-27 14:30:29.85 +100>,<MAYBRIDGE\NMR>,<NMR_250MHZ>,
      <apk 
       data hash MD5: 32K
       80 68 BA 89 B3 0A 8E 65 75 86 71 71 7B 56 D9 4E>)
(   4,<2005-09-27 14:30:30.56 +100>,<MAYBRIDGE\NMR>,<NMR_250MHZ>,
      <abs ABSG = 5 
       data hash MD5: 32K
       3D AE 64 F9 A8 AE 00 E8 98 D7 D4 82 25 00 BC 9F>)
$$ ##END=
$$ 
$$ hash MD5
$$ 59 05 D9 9A 3C CF 47 75 A6 5B 2B 69 75 9F 99 95
##$RELAX= 
##$RELAX= 
##$RELAX= 
##$RELAX= 
##$RELAX= 
##$RELAX= 
##$RELAX= 
$$ Bruker specific parameters
$$ --------------------------
##$DU= <C:\u>
##$EXPNO= 10030
##$NAME= <ADRS>
##$PROCNO= 1
##$TYPE= <nmr>
##$USER= <dgb>
##$AMP= (0..31)
100 100 100 100 100 100 100 100 100 100 100 100 100 100 100 100 100 100 
100 100 100 100 100 100 100 100 100 100 100 100 100 100 
##$AQSEQ= 0
##$AQ_mod= 3
##$AUNM= <au_zg>
##$AUTOPOS= <29 >
##$BF1= 250.13
##$BF2= 250.13
##$BF3= 250.13
##$BF4= 250.13
##$BF5= 500.13
##$BF6= 500.13
##$BF7= 500.13
##$BF8= 500.13
##$BYTORDA= 1
##$CFDGTYP= 0
##$CFRGTYP= 5
##$CHEMSTR= <none>
##$CNST= (0..31)
1 1 145 1 1 1 1 1 1 1 1 1 1 1 1 1 1 1 1 1 1 1 1 1 1 1 1 1 1 1 1 1 
##$CPDPRG= <>
##$CPDPRG1= <>
##$CPDPRG2= <>
##$CPDPRG3= <>
##$CPDPRG4= <mlev>
##$CPDPRG5= <mlev>
##$CPDPRG6= <mlev>
##$CPDPRG7= <mlev>
##$CPDPRG8= <mlev>
##$CPDPRGB= <>
##$CPDPRGT= <>
##$D= (0..31)
0 1 0 0 0 0 0 0 0 0.06 0 0 0 0 0 0 0.0002 0 0 0 0 0 0 0 0 0 0 0 0 0 0 
0 
##$DATE= 1127827815
##$DBL= (0..7)
120 120 120 120 120 120 120 120 
##$DBP= (0..7)
150 150 150 150 150 150 150 150 
##$DBP07= 0
##$DBPNAM0= <>
##$DBPNAM1= <>
$$ [...]
##$SUBNAM7= <"">
##$SUBNAM8= <"">
##$SUBNAM9= <"">
##$SW= 20.6930455092707
##$SWIBOX= (0..15)
0 0 3 0 0 0 0 0 0 0 0 0 0 0 0 0 
##$SW_h= 5175.983436853
##$TD= 65536
##$TD0= 1
##$TE= 294.16
##$TE2= 300
##$TE3= 300
##$TEG= 300
##$TL= (0..7)
0 120 120 120 120 120 120 120 
##$TP= (0..7)
150 150 150 150 150 150 150 150 
##$TP07= 0
##$TPNAME0= <>
##$TPNAME1= <>
##$TPNAME2= <>
##$TPNAME3= <>
##$TPNAME4= <>
##$TPNAME5= <>
##$TPNAME6= <>
##$TPNAME7= <>
##$TPOAL= (0..7)
0.5 0.5 0.5 0.5 0.5 0.5 0.5 0.5 
##$TPOFFS= (0..7)
0 0 0 0 0 0 0 0 
##$TUNHIN= 0
##$TUNHOUT= 0
##$TUNXOUT= 0
##$USERA1= <user>
##$USERA2= <user>
##$USERA3= <user>
##$USERA4= <user>
##$USERA5= <user>
##$V9= 5
##$VALIST= <valist>
##$VCLIST= <CCCCCCCCCCCCCCC>
##$VD= 0
##$VDLIST= <DDDDDDDDDDDDDDD>
##$VPLIST= <PPPPPPPPPPPPPPP>
##$VTLIST= <TTTTTTTTTTTTTTT>
##$WBST= 1024
##$WBSW= 4
##$XGAIN= (0..3)
0 0 0 0 
##$XL= 0
##$YL= 0
##$YMAX_a= 625287
##$YMIN_a= -729555
##$ZGOPTNS= <>
##$ZL1= 120
##$ZL2= 120
##$ZL3= 120
##$ZL4= 120
##$ABSF1= 16.522
##$ABSF2= -4.171173
##$ABSG= 5
##$ABSL= 3
##$ALPHA= 0
##$AQORDER= 0
##$ASSFAC= 0
##$ASSFACI= 0
##$ASSFACX= 0
##$ASSWID= 0
##$AUNMP= <proc_1d>
##$AZFE= 0.1
##$AZFW= 0.1
##$BCFW= 0
##$BC_mod= 0
##$BYTORDP= 0
##$COROFFS= 0
##$CY= 12.5
##$DATMOD= 1
##$DC= 0
##$DFILT= <>
##$DTYPP= 0
##$F1P= 14.0000005364418
##$F2P= -0.99999901652339
##$FCOR= 0.5
##$FTSIZE= 32768
##$FT_mod= 6
##$GAMMA= 0
##$GB= 0
##$INTBC= 1
##$INTSCL= 1
##$ISEN= 128
##$LB= 0.3
##$LEV0= 0
##$LPBIN= 0
##$MAXI= 10000
##$MC2= 0
##$MEAN= 0
##$ME_mod= 0
##$MI= 0
##$NCOEF= 0
##$NC_proc= -3
##$NLEV= 6
##$NOISF1= 0
##$NOISF2= 0
##$NSP= 0
##$NTH_PI= 0
##$NZP= 0
##$OFFSET= 16.522
##$PC= 1
##$PHC0= -76.84766
##$PHC1= 4.161399
##$PH_mod= 1
##$PKNL= yes
##$PPARMOD= 0
##$PSCAL= 4
##$PSIGN= 0
##$REVERSE= no
##$SF= 250.13
##$SI= 32768
##$SIGF1= 0
##$SIGF2= 0
##$SINO= 400
##$SIOLD= 32768
##$SREGLST= <1H.CDCl3>
##$SSB= 0
##$STSI= 32768
##$STSR= 0
##$SW_p= 5175.98343685301
##$SYMM= 0
##$S_DEV= 0
##$TDeff= 65536
##$TDoff= 0
##$TI= <Analysis number 999999
Compound Code 99
Book Reference 9
Project Code 9>
##$TILT= no
##$TM1= 0
##$TM2= 0
##$TOPLEV= 0
##$USERP1= <user>
##$USERP2= <user>
##$USERP3= <user>
##$USERP4= <user>
##$USERP5= <user>
##$WDW= 1
##$XDIM= 32768
##$YMAX_p= 518430166
##$YMIN_p= -142784
$$ End of Bruker specific parameters
$$ ---------------------------------
##NTUPLES= NMR SPECTRUM
##VAR_NAME=  FREQUENCY,     SPECTRUM/REAL,   SPECTRUM/IMAG
##SYMBOL=    X,             R,               I
##VAR_TYPE=  INDEPENDENT,   DEPENDENT,       DEPENDENT
##VAR_FORM=  AFFN,          ASDF,            ASDF
##VAR_DIM=   32768,         32768,           32768
##UNITS=     HZ,            ARBITRARY UNITS, ARBITRARY UNITS
##FACTOR=    0.157963299565203, 1,           1
##FIRST=     4132.6476996994, 0,             0
##LAST=      -1043.33573715361, 0,           0
##MIN=       -1043.33573715361, -142784,     0
##MAX=       4132.6476996994, 518430166,     0
$$ Real data points
##PAGE= N=1
##DATA TABLE= (X++(R..R)), XYDATA
$$ [...]
$$ plain form
16584 15494 19761 31152 41537 56402 65373 69455 65699 68825 73897 88880 115421 159369 197560
16571 197560 237241 293813 329454 360110 378272 386575 395495 379221 362010 322179 271187 224754
16559 224754 181464 154608 136005 121691 109720 110109 124901 154641 183624 215892 247253 291108
16547 291108 326143 340842 350468 341051 315979 285248 254775 216697 165425 114901 76911 60083
16535 60083 40011 18733 17573 9867 1894 -16109 -23091 -32184 -30582 -16214 -5670 -18376 -20463
16522 -20463 -17150 -4568 12010 9285 -2520 -19104 -25365 -21681 -17709 -26568 -34824 -53319 -41714
16509 -41714 -38157 -38164 -39283 -40288 -45846 -41565 -34634 -28561 -21618 -16295 -21564 -30758 -40085 -43980 -41265
16494 -41265 -38788 -37825 -33830 -36903 -28858 -34456 -51776 -49374 -39849 -25180 -40787 -42487 -31573 -39434
$$ packed form
16584A5494M267J1391J0385J4865Q971M082l756L126N072J4983K6541M3948L8191
16571A97560L9681N6572L5641L0656J8162Q303Q920j6274j7211l9831n0992m6433
16559B24754m3290k6856j8603j4314j1971L89J4792K9740K8983L2268L1361M3855
16547B91108L5035J4699R626r417k5072l0731l0473l8078n1272n0524l7990j6828
16535F0083k0072k1278j160p706p973j8003o982r093J602J4368J0544j2706k087
16522b0463L313J2582J6578k725j1805j6584o261L684L972q859q256j8495J1605
16509d1714L557pj119j005n558M281O931O073O943N323n269r194r327l895K715
16494d1265K477R63L995l073Q045n598j7320K402R525J4669j5607j700J0914p861
$$ plain form
16480 -39434 -35576 -29862 -26410 -24697 -22540 -17766 -35732 -40694 -50491 -41141 -34584 -43461 -46336 -32085
16466 -32085 -21920 -22366 -28374 -27174 -32984 -41843 -43162 -49802 -46437 -35260 -21492 -16776 -19190 -26049
16452 -26049 -27093 -33545 -34425 -44137 -50630 -44651 -30559 -25098 -25006 -33210 -45504 -32984 -24317 -22994
16438 -22994 -24887 -26576 -31135 -44015 -42977 -34992 -27697 -27957 -32850 -27471 -32842 -35062 -23453 -19977
16424 -19977 -14933 -19589 -16440 -16869 -28070 -18232 -6633 -24248 -36535 -36164 -32739 -20445 -29571 -25308
16410 -25308 -24970 -41663 -38870 -45039 -47795 -39161 -23774 -27228 -32944 -40557 -42555 -45606 -38511 -30494
16396 -30494 -30078 -24228 -21766 -25385 -26477 -41382 -49189 -48644 -48437 -43706 -38460 -35695 -17246 -9914 -6955
16381 -6955 -10166 8071 -2241 -16434 -6031 -2379 -5579 -7362 -20346 -29553 -34196 -30113 -20857
$$ packed form
16480c9434L858N714L452J713K157M774j7966m962r797R350O557q877k875J4251
16466c2085J0165m46o008J200n810q859j319o640L365J1177J3768M716k414o859
16452b6049j044o452q80r712o493N979J4092N461R2q204j2294J2520Q667J323
16438b2994j893j689m559j2880J038P985P295k60m893N379n371k220J1609L476
16424a9977N044m656L149m29j1201R838J1599j7615j2287L71L425J2294r126M263
16410b5308L38j6693K793o169k756Q634J5387l454n716p613j998l051P095Q017
16396c0494M16N850K462l619j092j4905p807N45K07M731N246K765J8449P332K959
16381f955l211J8237j0312j4193J0403L652l200j783j2984r207m643M083R256
$$ plain form
16368 -20857 -23208 -29465 -19150 -20634 -19402 -29045 -38396 -32470 -31372 -33172 -34166 -27365 -23437 -23249 -19054
16353 -19054 -17100 -20292 -24924 -31563 -37657 -31670 -28040 -20017 -25370 -38573 -39999 -41922 -46625 -43274
16339 -43274 -25721 -12793 -9304 -20619 -23891 -24328 -27608 -19333 -10676 -17000 -13814 -20418 -28394 -39808
16325 -39808 -44350 -32394 -14845 -557 17280 23506 26552 23473 29290 27899 13373 20555 32766
16312 32766 50261 64327 72528 108074 159331 215921 258525 284139 316056 304219 254987 213630
16300 213630 193816 180294 172483 173960 214134 262788 306105 306046 301485 270924 231523 203240 193880
16287 193880 195952 213300 252380 276480 262966 250830 229846 205619 185671 156451 142405 145703
16275 145703 176360 199364 219908 226992 232739 212783 183533 134426 92399 66875 51626 44755
$$ packed form
16368b0857k351o257J0315j484J232r643r351N926J098j800r94O801L928J88M195
16353a9054J954l192m632o639o094N987L630Q023n353j3203j426j923m703L351
16339d3274J7553J2928L489j1315l272m37l280Q275Q657o324L186o604p976j1414
16325c9808m542J1956J7549J4288J7837O226L046l079N817j391j4526P182J2211
16312C2766J7495J4066Q201L5546N1257N6590M2604K5614L1917j1837m9232m1357
16300B13630j9814j3522p811J477M0174M8654M3317n9m561l0561l9401k8283r360
16287A93880K072J7348L9080K4100j3514j2136k0984k4227j9948k9220j4046L298
16275A45703L0657K3004K0544P084N747j9956k9250m9107m2027k5524j5249o871
$$ plain form
16263 44755 42502 43295 26526 19532 30490 8022 -3429 -4207 -14704 -16882 -17711 -13246 -19647 -11452
16249 -11452 -13998 -22919 -25556 -35784 -36684 -32326 -29043 -23157 -14881 -9546 -15124 -11473 -20276 -17386
16235 -17386 -8529 -18250 -34900 -34826 -32967 -30619 -14960 -18776 -34040 -31852 -10589 -9490 -26924 -34850
16221 -34850 -37177 -33196 -14397 -7587 -13270 -16953 -17949 -24085 -28925 -30716 -27519 -31843 -50479 -78422
16207 -78422 -71261 -58527 -56459 -55371 -44804 -37516 -32409 -38785 -36072 -27587 -22873 -31135 -31654 -25689
16193 -25689 -33193 -26877 -34620 -47983 -60680 -61898 -50926 -39726 -43816 -41801 -34191 -26818 -22414
16180 -22414 -8160 7130 11540 -5279 -19011 -30668 -37830 -25424 -21676 -17962 -19942 -9171 -1118
16167 -1118 -7491 -12325 -23415 -42686 -42688 -33197 -20560 -27517 -24966 -23498 -22175 -28794 -27367 -33565 -27555
$$ packed form
16263D4755k253P93j6769o994J0958k2468j1451p78j0497k178q29M465o401Q195
16249a1452k546q921k637j0228r00M358L283N886Q276N335n578L651q803K890
16235a7386Q857r721j6650P4J859K348J5659l816j5264K188K1263J099j7434p926
16221c4850k327L981J8799O810n683l683r96o136m840j791L197m324j8636k7943
16207g8422P161J2734K068J088J0567P288N107o376K713Q485M714q262n19N965
16193b5689p504O316p743j3363j2697j218J0972J1200m090K015P610P373M404
16180b2414J4254J5290M410j6819j3732j1657p162J2406L748L714j980J0771Q053
16167a118o373m834j1090j9271kR491J2637o957K551J468J323o619J427o198O010
$$ plain form
16152 -27555 -20931 -27709 -26219 -24016 -26047 -24270 -30163 -23236 -13554 -13603 -25615 -28172 -29995 -36727 -32872
16137 -32872 -29859 -27759 -25024 -26133 -33976 -30355 -34843 -31406 -31723 -42074 -54508 -40210 -30957 -36598
16123 -36598 -33645 -33438 -37721 -39153 -40968 -48185 -43115 -38980 -53549 -54809 -48597 -42854 -36982 -42451
16109 -42451 -47385 -36529 -39261 -46066 -40378 -22893 -21060 -24920 -18817 -19211 -13842 -23723 -33687 -25625
16095 -25625 -24726 -33695 -37187 -38411 -29217 -27788 -39111 -41978 -38691 -37077 -30714 -18777 -7302 -10512
16081 -10512 -4631 -103 -7738 -12538 -11888 -21808 -27312 -31189 -25610 -28467 -30032 -37206 -39181 -30006 -29572
16066 -29572 -24969 -18640 -26322 -31003 -29301 -28599 -30988 -35978 -37738 -32025 -38780 -45536 -48872 -43571 -28475
16051 -28475 -6515 -1395 -1382 -3775 -10851 -4750 -2969 -15038 -15379 -27214 -35556 -28883 -27502 -29041
$$ packed form
16152b7555O624o778J490K203k031J777n893O927R682m9j2012k557j823o732L855
16137c2872L013K100K735j109p843L621m488L437l17j0351j2434J4298R253n641
16123c6598K953K07m283j432j815p217N070M135j4569j260O212N743N872n469
16109d2451m934J0856k732o805N688J7485J833l860O103l94N369r881r964Q062
16095b5625Q99q969l492j224R194J429j1323k867L287J614O363J1937J1475l210
16081a0512N881M528p635m800O50r920n504l877N579k857j565p174j975R175M34
16066b9572M603O329p682m681J702P02k389m990j760N713o755o756l336N301J5096
16051b8475K1960N120J3k393p076O101J781j2069l41j1835q342O673J381j539
$$ plain form
16037 -29041 -40108 -46614 -38866 -28336 -29154 -19446 -20300 -27408 -35998 -40102 -51469 -41929 -17398 -22045
16023 -22045 -18476 -10511 -12336 -22910 -21632 -16719 -14750 -21976 -20862 -22464 -26785 -22021 -26534 -31573
16009 -31573 -23841 -32250 -32655 -35936 -37124 -37028 -31058 -27848 -20135 -15792 -9581 -18646 -28327 -38090 -40600
15994 -40600 -34734 -43591 -42818 -33290 -31915 -30655 -27244 -22549 -21143 -25019 -19535 -25211 -32306 -25962 -22296
15979 -22296 -19317 -20499 -31637 -34778 -37322 -31853 -39378 -44287 -46617 -37618 -26418 -14167 -28198
15966 -28198 -37306 -44507 -49756 -45804 -26731 -27869 -39065 -51308 -63486 -56248 -60561 -39060 -25910
15953 -25910 -27207 -29949 -32130 -31783 -28526 -20239 -13568 -8971 -16675 -32840 -39064 -36549 -30105 -27665
15939 -27665 -40831 -43572 -36567 -33968 -35656 -37882 -34812 -29421 -41880 -47306 -51211 -57004 -40687 -39091
$$ packed form
16037b9041j1067o506P748J0530q18R708q54p108q590m104j1367R540K4531m647
16023b2045L569P965j825j0574J278M913J969p226J114j602m321M764m513n039
16009c1573P732q409m05l281j188R6N970L210P713M343O211r065r681r763k510
15994d0600N866q857P73R528J375J260L411M695J406l876N484n676p095O344L666
15979b2296K979j182j1138l141k544N469p525m909k330Q999J1200J2251j4031
15966b8198r108p201n249L952J9073j138j1196j2243j2178P238m313K1501J3150
15953b5910j297k742k181L47L257Q287O671M597p704j6165o224K515O444K440
15939b7665j3166k741P005K599j688k226L070N391j2459n426l905n793J6317J596
$$ plain form
15925 -39091 -44773 -42833 -33334 -25545 -17784 -19714 -20360 -19876 -28097 -27951 -21768 -18382 -4178 -14938 -21489
15910 -21489 -14189 -2691 -9707 -20808 -24210 -29420 -32153 -23333 -11625 -17321 -40509 -41802 -38293
15897 -38293 -49667 -43698 -30127 -21980 -24574 -41148 -47029 -33727 -20531 -13046 -13607 -17897 -24630
15884 -24630 -39136 -32739 -16904 -14909 -20615 -29805 -21765 -24250 -21839 -20759 -19679 -34523 -41395 -20374
15870 -20374 -7343 -13289 -18334 -15588 -14503 -20915 -21993 -15524 -20321 -12971 -21581 -29290 -21918 -16226
15856 -16226 -22305 -24308 -28883 -42224 -23253 -25949 -42557 -36255 -29133 -23616 -15709 -3698 -12091
15843 -12091 -16739 -21302 -28391 -21747 -23275 -29090 -44232 -50908 -34381 -24543 -29032 -40672 -35509 -47031
15829 -47031 -52394 -35877 -32317 -34490 -21315 -26415 -24920 -23115 -17376 -31713 -42208 -45307 -47533
$$ packed form
15925c9091n682J940R499P789P761j930o46M84q221J46O183L386J4204j0760o551
15910b1489P300J1498p016j1101l402n210k733Q820J1708n696k3188j293L509
15897c8293j1374N969J3571Q147k594j6574n881J3302J3196P485n61m290o733
15884b4630j4506O397J5835J995n706r190Q040k485K411J080J080j4844o872K1021
15870b0374J3031n946n045K746J085o412j078O469m797P350q610p709P372N692
15856a6226o079k003m575j3341J8971k696j6608O302P122N517P907J2011q393
15843a2091m648m563p089O644j528n815j5142o676J6527R838m489j1640N163j1522
15829d7031n363J6517L560k173J3175n100J495J805N739j4337j0495l099k226
$$ plain form
15816 -47533 -37562 -30208 -23537 -19589 -14726 -21572 -25630 -30936 -33340 -18457 -20388 -22147 -24575 -20699
15802 -20699 -17138 -21365 -24454 -22205 -23395 -38172 -35342 -46759 -58427 -56741 -53980 -62570 -52856 -47873
15788 -47873 -42807 -20975 -1740 -13591 -25547 -15030 -21975 -29958 -33965 -37805 -35710 -29636 -12936
15775 -12936 -8514 -4005 -14323 -19948 -22035 -15196 -11321 -21042 -17165 -11562 -22711 -30439 -28413 -30942
15761 -30942 -42469 -37568 -39205 -37632 -47548 -33952 -21809 -21598 -7408 -17381 -34892 -39543 -36599
15748 -36599 -45900 -31652 -12706 -3491 -9716 -6935 -10236 -8761 -21728 -25513 -20503 -33409 -36066
15735 -36066 -35435 -18523 -1265 483 3000 1524 6269 1570 800 -4540 -7827 -5390 -17479 -33377
15721 -33377 -29396 -28923 -29954 -30514 -28794 -18479 -16262 -28771 -32136 -20044 -22285 -22826 -15458 -18623
$$ packed form
15816d7533R971P354O671L948M863o846m058n306k404J4883j931j759k428L876
15802b0699L561m227l089K249j190j4777K830j1417j1668J686K761q590R714M983
15788d7873N066K1832J9235j1851j1956J0517o945p983m007l840K095O074J6700
15775a2936M422M509j0318n625k087O839L875r721L877N603j1149p728K026k529
15761c0942j1527M901j637J573r916J3596J2143K11J4190r973j7511m651K944
15748c6599r301J4248J8946R215o225K781l301J475j2967l785N010j2906k657
15735c6066O31J6912J7258J748K517j476M745m699p70n340l287K437j2089j5898
15721c3377L981M73j031n60J720J0315K217j2509l365J2092k241n41P368l165
$$ plain form
15707 -18623 -29736 -30060 -25316 -11938 -2151 -17094 -25407 -27499 -22940 -19842 -26807 -26685 -16942 -27574
15693 -27574 -27756 -20901 -27664 -31010 -19557 -13919 -24359 -24725 -21525 -23155 -20669 -23068 -26425 -27941
15679 -27941 -24679 -23761 -35882 -51891 -44569 -22352 -17307 -32546 -48309 -40940 -37906 -36203 -41115
15666 -41115 -38062 -35653 -34663 -44630 -49420 -49387 -42861 -55989 -42882 -23973 -17857 -33280 -34378 -23766
15652 -23766 -23941 -28674 -35430 -36792 -34961 -35456 -34028 -36961 -44691 -44447 -39974 -41814 -41469 -38385 -31894
15637 -31894 -45516 -52992 -56992 -38827 -37867 -39821 -40388 -38300 -42210 -37709 -46726 -39646 -24349 -22287
15623 -22287 -28534 -30722 -37254 -36819 -43151 -31575 -6037 -9428 -30199 -33096 -20361 -23064 -33870
15610 -33870 -39317 -33107 -36240 -34782 -39507 -39739 -34556 -36356 -25264 -14515 -19794 -10252 -8055 -17152
$$ packed form
15707a8623j1113l24M744J3378R787j4943q313k092M559L098o965J22R743j0632
15693b7574j82O855o763l346J1453N638j0440l66L200j630K486k399l357j516
15679b7941L262R18j2121j6009P322K2217N045j5239j5763P369L034J703m912
15666d1115L053K409R90r967m790L3O526j3128J3107J8909O116j5423j098J0612
15652b3766j75m733o756j362J831m95J428k933p730K44M473j840L45L084O491
15637c1894j3622p476m000J8165R60j954n67K088l910M501r017P080J5297K062
15623b2287o247k188o532M35o332J1576K5538l391k0771k897J2735k703j0806
15610c3870n447O210l133J458m725k32N183j800J1092J0749n279R542K197r097
$$ plain form
15596 -17152 -29831 -24629 -19895 -24653 -35332 -29789 -42360 -47675 -38930 -28855 -14247 -13666 -14630 -15428
15582 -15428 -28497 -45295 -45792 -38605 -38965 -44242 -37884 -21984 -14790 -11641 -21877 -30901 -19270 -18404
15568 -18404 -21499 -27133 -17489 -14590 -9576 -7872 -35026 -35078 -12877 -5968 -9447 -25487 -29525 -32406
15554 -32406 -40505 -35173 -18473 -7820 -6329 -1069 -5635 -3052 -9098 -16377 -27748 -32813 -31130 -19956
15540 -19956 -21558 -35280 -27983 -6417 1257 -2278 -6680 -17600 -24241 -23396 -12184 -9885 -548 2422
15526 2422 -4650 -7130 -15756 -35228 -36736 -28914 -20307 -28167 -40771 -29036 -21096 -27905 -38194 -48224
15512 -48224 -25883 -7109 -17978 -31446 -33024 -21699 -21280 -11268 4606 8213 -5790 -30989
15500 -30989 -48934 -58001 -52713 -38514 -39261 -41766 -28989 -24466 -15491 -18852 -40782 -43176 -29880
$$ packed form
15596a7152j2679N202M734m758j0679N543j2571n315Q745J0075J4608N81r64p98
15582a5428j3069j6798m97P187l60n277O358J5900P194L149j0236r024J1631Q66
15568a8404l095n634R644K899N014J704k7154n2K2201O909l479j6040m038k881
15554c2406q099N332J6700J0653J491N260m566K583o046p279j1371n065J683J1174
15540a9956j602j3722P297K1566P674l535m402j0920o641Q45J1212K299R337K970
15526B422p072k480q626j9472j508P822Q607p860j2604J1735P940o809j0289j0030
15512d8224K2341J8774j0869j3468j578J1325M19J0012J5874L607j4003k5199
15500c0989j7945r067N288J4199p47k505J2777M523Q975l361k1930k394J3296
$$ plain form
15487 -29880 -19444 -31113 -37128 -31475 -23430 -27454 -39858 -30978 -17064 -6924 -19531 -31120 -25705
15474 -25705 -28790 -32705 -45328 -40963 -36863 -31013 -32159 -34043 -20664 -25139 -32380 -28672 -20785 -17368
15460 -17368 -28839 -39670 -37940 -48339 -57131 -51476 -56518 -50288 -32979 -16764 -30789 -35317 -26588
15447 -26588 -19589 -11060 -25933 -22858 -18912 -15069 -13226 -17052 -27184 -21339 -26979 -24314 -12293 -12474
15433 -12474 -17768 -17746 -17974 -19182 -24991 -25438 -24776 -22520 -18486 -17398 -23149 -16534 -4836 5011 847
15418 847 -5912 -2879 -8918 -16078 -26760 -24826 -31280 -20996 -17395 -20073 -20406 -28350 -17954 4684
15404 4684 7868 9281 25 -12338 -6354 4124 3286 -1487 -8603 -12937 -12676 -1613 -12108 -18783
15390 -18783 -18639 -14360 -17718 -18801 -16408 -18360 -17510 -11285 -14475 -9406 -5166 -5953 -7000 -3670 -11451
$$ packed form
15487b9880J0436j1669o015N653Q045m024j2404Q880J3914J0140j2607j1589N415
15474b5705l085l915j2623M365M100N850j146j884J3379m475p241L708P887L417
15460a7368j1471j0831J730j0399q792N655n042O230J7309J6215j4025m528Q729
15447b6588O999Q529j4873L075L946L843J843l826j0132N845n640K665J2021j81
15433a2474n294K2k28j208n809m47O62K256M034J088n751O615J1698R847m164
15418H47o759L033o039p160j0682J934o454J0284L601k678l33p944J0396K2638
15404D684L184J413r256j2363N984J0478q38m773p116m334K61J1063j0495o675
15390a8783J44M279l358j083K393j952Q50O225l190N069M240p87j047L330p781
$$ plain form
15375 -11451 -18829 -2605 1453 -481 -22108 -33792 -34815 -24055 -25451 -21267 -14039 -15902 -16066 -30424
15361 -30424 -32527 -29653 -26545 -28234 -30141 -30315 -24390 -22887 -25922 -19150 -25142 -31169 -29153 -22375 -34836
15346 -34836 -43089 -41134 -31005 -20345 -9287 -14097 -24584 -24500 -18563 -11353 -4484 -17738 -24644 -34097
15332 -34097 -32211 -30556 -26402 -22885 -18837 -34458 -49629 -46629 -39948 -40426 -46953 -31886 -16713 -12770
15318 -12770 -8975 -10367 -6316 -7843 -14967 -18123 -17676 -12505 -14034 -9955 -20942 -19310 -11506 -3491
15304 -3491 -10194 -14991 -13955 -12673 -27072 -28497 -27577 -25059 -20012 -25784 -27397 -23618 -34117 -32102
15290 -32102 -30819 -26683 -14719 -11486 -3860 -6045 -19062 -29553 -36977 -37410 -27876 -25762 -19889 -16154
15276 -16154 -23292 -24838 -32140 -37530 -37965 -34843 -29783 -29994 -22610 -24722 -25203 -22250 -23843 -30729 -36365
$$ packed form
15375a1451p378J6224M058j934k1627j1684j023J0760j396M184P228j863j64j4358
15361c0424k103K874L108j689j907j74N925J503l035O772n992o027K016O778j2461
15346c4836q253J955J0129J0660J1058m810j0487Q4N937P210O869j3254o906r453
15332c4097J886J655M154L517M048j5621j5171L000O681m78o527J5067J5173L943
15318a2770L795j392M051j527p124l156M47N171j529M079j0987J632P804Q015
15304c491o703m797J036J282j4399j425R20K518N047n772j613L779j0499K015
15290c2102J283M136J1964L233P626k185j3017j0491p424m33R534K114N873L735
15276a6154p138j546p302n390m35L122N060k11P384k112m81K953j593o886n636
$$ plain form
15261 -36365 -27625 -16448 -23146 -8038 -13883 -10449 -9782 -17137 -31346 -28700 -27127 -27082 -27588 -21832 -17475
15246 -17475 -22144 -16992 -5917 -7685 -21051 -31691 -21805 -15079 -15500 -17039 -21701 -13536 -13137 -26902
15232 -26902 -15099 -12246 -11721 -13324 -8972 -11507 -3710 4693 7286 -2281 -4479 -13907 -20027 -14264
15218 -14264 -1576 -7132 -17680 -24889 -22437 -15487 -25364 -23980 -20060 -22076 -31552 -23102 -16754 -26573
15204 -26573 -35312 -36923 -49767 -53185 -47610 -46781 -33423 -27571 -38220 -39347 -35087 -32542 -36605 -31736
15190 -31736 -27156 -26713 -27925 -32749 -40374 -39696 -31398 -30611 -30773 -14134 -3510 -8563 -21316 -34924
15176 -34924 -27473 -21237 -18163 -15128 -14725 -13239 -3671 -1480 -7001 -1589 -2432 -14853 -11916 -19187 -20477
15161 -20477 -24364 -30583 -27030 -23118 -15797 -17882 -28234 -35933 -34617 -28128 -28615 -26541 -34469 -26204
$$ packed form
15261c6365Q740J1177o698J5108n845L434O67p355j4209K646J573M5n06N756M357
15246a7475m669N152J1075j768j3366j0640R886O726m21j539m662Q165L99j3765
15232b6902J1803K853N25j603M352k535P797Q403K593r567k198r428o120N763
15218a4264J2688n556j0548p209K452O950r877J384L920k016r476Q450O348r819
15204b6573q739j611j2844l418N575Q29J3358N852j0649j127M260K545m063M869
15190c1736M580M43j212m824p625O78Q298P87j62J6639J0624n053j2753j3608
15176c4924P451O236L074L035M03J486R568K191n521N412q43j2421K937p271j290
15161b0477l887o219L553L912P321k085j0352p699J316O489m87K074p928Q265
$$ plain form
15147 -26204 -25197 -27371 -30177 -29077 -24445 -22442 -17584 -12035 -8369 -838 11533 3298 -12708 -12091
15133 -12091 -14214 -22257 -19990 -13836 -26966 -31050 -28492 -22200 -30091 -23761 -7966 -6265 -9687 -21430
15119 -21430 -17842 -26406 -26724 -24706 -20460 -12626 -5634 -18919 -28835 -26579 -23996 -17872 -7204 -8326
15105 -8326 -9344 -6255 -13928 -29723 -32208 -16252 -11637 -13946 -29857 -38618 -26857 -9196 -9665 -19945
15091 -19945 -14460 -11675 -33130 -28348 -8852 9807 18112 -6222 -23341 -12545 3231 6471 -6820
15078 -6820 -6145 -2193 -1973 -2059 -9676 -23576 -28043 -25236 -17472 -6717 5716 2315 6107 -913 -11686
15063 -11686 -9555 -669 -5852 -8771 -7219 4626 4862 9847 -2043 -955 3604 -985 -3978 -6162
15049 -6162 -8573 -2990 -3231 -6321 -6339 -7146 -9373 -19945 -21199 -9730 -19300 -36597 -33389 -26709 -25580
$$ packed form
15147b6204J007k174k806J100M632K003M858N549L666P531J2371q235j6006O17
15133a2091k123q043K267O154j3130m084K558O292p891O330J5795J701l422j1743
15119b1430L588q564l18K018M246P834O992j3285r916K256K583O124J0668j122
15105h326j018L089p673j5795k485J5956M615k309j5911q761J1761J7661m69j0280
15091a9945N485K785k1455M782J9496J8659Q305k4334j7119J0796J5776L240j3291
15078f820O75L952K20q6p617j3900m467K807P764J0755J2433l401L792p020j0773
15063a1686K131Q886n183k919J552J1845K36M985j1890J088M559m589k993k184
15049f162k411N583k41l090j8q07k227j0572j254J1469r570j7297L208O680J129
$$ plain form
15034 -25580 -39190 -38294 -30035 -17718 -10332 -13677 -17470 -12857 -16413 -15567 -20492 -24975 -14669 -19012
15020 -19012 -14576 -10691 -20160 -24363 -23284 -20141 -7883 -7117 -18499 -16825 -2328 4285 6741 13558
15006 13558 28709 26088 4581 2913 -372 7864 5579 -4594 5421 18281 17022 5449 3527
14993 3527 15104 28206 54574 81735 83011 88946 99099 106503 129245 139124 148044 182031 225809
14980 225809 297264 414656 604148 802950 953214 1052890 1041806 847321 620706 456760
14970 456760 325346 219118 154657 116450 87972 68442 52212 37651 27880 16306 14937
14959 14937 5729 -12816 -19514 -30000 -37331 -39694 -41981 -41104 -25339 -12603 13181 20525 6992
14946 6992 -8438 -32676 -39046 -32601 -32617 -21168 -34464 -30140 -24503 -28761 -27219 -27128 -20168 -14978 -14413
$$ packed form
15034b5580j3610Q96Q259J2317P386l345l793M613l556Q46m925m483J0306m343
15020a9012M436L885r469m203J079L143J2258P66j1382J674J4497O613K456O817
15006A3558J5151k621k1507j668l285Q236k285j0173J0015J2860j259j1573j922
14993C527J1577J3102K6368K7161J276N935J0153P404K2742R879Q920L3987M3778
14980B25809P1455J17392J89492J98802J50264R9676j1084j94485k26615j63946
14970D56760j31414j06228o4461l8207k8478j9530j6230j4561r771j1574j369
14959A4937r208j8545o698j0486p331k363k287Q77J5765J2736K5784P344j3533
14946F992j5430k4238o370O445j6J1449j3296M324N637m258J542R1O960N190N65
$$ plain form
14931 -14413 -1980 15221 16966 6777 3170 -14047 -18962 -7407 -13572 -11265 -9824 -7814 -8071
14918 -8071 -11151 -5481 -2459 -15461 -19015 -18938 -18672 -16675 -17948 4006 6805 -1647 -7065 -12842 -12887
14903 -12887 -15569 -13038 -19647 -18027 -9736 -7477 -6746 -2109 -5501 -17196 -24556 -24883 -22380 -11742
14889 -11742 -19586 -21918 -24719 -25899 -6917 -377 -2372 -2726 -6779 -15543 -6371 5649 9829 15639
14875 15639 27004 14593 -1021 -2645 -4825 -21647 -38238 -37147 -27990 -22597 -17063 -17824 -18879
14862 -18879 -17318 -27480 -48629 -53479 -59714 -58055 -47509 -41500 -26731 -26362 -21370 -21398 -38196 -44179
14848 -44179 -30279 -8058 -8275 -11756 -11741 -13200 -19230 -28187 -36790 -27440 -18342 -27482 -30388 -12753
14834 -12753 -17387 -28951 -29936 -25012 -16310 -7285 -4674 -14603 -20638 -20024 -18803 -12742 -23976 -29072
$$ packed form
14931a4413J2433J7201J745j0189l607j7217m915J1555o165K307J441K010k57
14918h071l080N670L022j3002l554P7K66J997j273K1954K799q452n418n777m5
14903a2887k682K531o609J620Q291K259P31M637l392j1695p360l27K503J0638
14889a1742p844k332k801j180J8982O540j995l54m053q764R172J2020M180N810
14875A5639J1365j2411j5614j624k180j6822j6591J091R157N393N534p61j055
14862a8879J561j0162k1149m850o235J659J0546O009J4769L69M992k8j6798n983
14848d4179J3900K2221k17l481J5j459o030q957q603R350R098r140k906J7635
14834a2753m634j1564r85M924Q702R025K611r929o035O14J221O061j1234n096
$$ plain form
14820 -29072 -35198 -24886 -7946 -4881 3839 15238 9416 4591 -2391 9143 4589 -8157 -16154
14807 -16154 -12161 -24055 -39108 -38724 -30203 -25518 -33543 -36564 -35166 -44767 -40331 -32806 -36290 -35166
14793 -35166 -40246 -29576 -32487 -34752 -36393 -31302 -7293 11385 4013 -11087 -16717 -4925 2293
14780 2293 -6519 -14219 -28871 -32749 -28609 -34333 -25966 -25590 -14176 -15177 -24696 -30684 -16996 -3454
14766 -3454 -8799 -13467 -6794 -15141 -20440 -35377 -46670 -45035 -38157 -26346 -23274 -22032 -15170 -10419
14752 -10419 -11007 -13024 -14853 -15675 -17125 -13606 -17671 -26599 -18349 -8881 6674 -4476 -10303 -2923
14738 -2923 -13127 -16407 -1114 -5526 -12187 -12931 -15745 -13946 -8344 -29420 -35695 -34932 -33864 -25888
14724 -25888 -11173 -22501 -38551 -38674 -21746 -20707 -26607 -24925 -13536 -11298 -15166 -18455 -18453 -22057
$$ packed form
14820b9072o126J0312J6940L065Q720J1399n822m825o982J1534m554j2746p997
14807a6154L993j1894j5053L84Q521M685q025l021J398r601M436P525l484J124
14793c5166n080J0670k911k265j641N091K4009J8678p372j5100n630J1792P218
14780B293q812p700j4652l878M140n724Q367L76J1414j001r519n988J3688J3542
14766c454n345m668O673q347n299j4937j1293J635O878J1811L072J242O862M751
14752a0419n88k017j829q22j450L519m065q928Q250R468J5555j1150n827P380
14738b923j0204l280J5293m412o661p44k814J799N602k1076o275P63J068P976
14724b5888J4715j1328j6050j23J6928J039n900J682J1389K238l868l289Kl604
$$ plain form
14710 -22057 -18497 -28111 -32359 -33932 -38930 -42452 -22967 -715 3967 -11722 -19237 -12666 -6033 8204
14696 8204 -4839 -9555 -12125 -14758 -20338 -19702 -24275 -34720 -21591 -12853 6496 -946 -20518 -30534
14682 -30534 -26482 -30106 -26845 -14721 -561 -918 578 2764 2804 5315 -8490 -27010 -22082 -13142
14668 -13142 -11296 -16935 -18943 -24530 -22353 -37933 -36544 -24447 -29059 -23590 -9352 -7597 -12168 -24707
14654 -24707 -25498 -22735 -9174 -8963 -10864 -14066 -11760 -13992 -21898 -13016 -12746 -21205 -14552 -16932 -21639
14639 -21639 -16646 -16293 -29924 -37037 -30566 -36998 -47015 -44603 -39923 -29000 -16607 -13808 -11997 -9621
14625 -9621 -15544 -11538 -22392 -19428 -25101 -13419 1957 -1996 -7959 -17395 -19321 -24704 -8105 -15
14611 -15 -9887 -12198 -6626 -5799 -10401 -8675 -10932 -21385 -20306 -13833 -9641 -3853 8773 6315 -9527
$$ packed form
14710b2057L560r614m248j573m998l522J9485K2252M682j5689p515O571O633J4237
14696H204j3043m716k570k633n580O36m573j0445J3129Q738J9349p442j9572j0016
14682c0534M052l624L261J2124J4160l57J496K186M0K511j3805j8520M928Q940
14668a3142J846n639k008n587K177j5580J389J2097m612N469J4238J755m571j2539
14654b4707p91K763J3561K11j901l202K306k232p906Q882K70q459O653k380m707
14639b1639M993L53j3631p113O471o432j0017K412M680J0923J2393K799J811K376
14625i621n923M006j0854K964n673J1682J5376l953n963r436j926n383J6599Q090
14611a5r872k311N572Q27m602J726k257j0453J079O473M192N788J2626k458j5842
$$ plain form
14596 -9527 -6779 -693 -15415 -15741 -10448 -2669 -8671 -15653 -11447 -6020 1671 8995 2076 -12101
14582 -12101 -25982 -22386 -9427 542 1603 1525 -5627 -4480 -8849 -9745 -11728 -6997 -12304 -13967 -9592
14567 -9592 -16684 -7320 4889 1606 -20069 -21617 -8362 -6739 -12774 -10482 -19915 -29189 -27644 -22238
14553 -22238 -22174 -22743 -16612 -20468 -24011 -19198 -17651 -17855 -18691 -15534 -25042 -38410 -42247 -30879 -13297
14538 -13297 -10809 -6491 -6504 -9855 -11316 -1984 -700 -8438 -20050 -18770 -15521 -16778 -15572 -22270 -29784
14523 -29784 -20220 -13001 -14183 -5491 9831 23490 20318 88 -17577 -23942 -25515 -20389 -26545
14510 -26545 -28971 -27406 -32593 -30383 -21639 -6690 -4844 -7030 -2807 8383 2246 4464 6413 5311
14496 5311 -3215 3273 11940 3291 -8682 -17344 -14492 -15857 -8936 -8411 -18961 -18571 -24756 -33929 -35184
$$ packed form
14596i527K748O086j4722l26N293P779o002o982M206N427P691P324o919j4177
14582a2101j3881L596J2959R969J061p8p152J147m369q96j983M731n307j663M375
14567i592p092R364J2209l283k1675j548J3255J623o035K292r433r274J545N406
14553b2238O4n69O131l856l543M813J547k04q36L157r508j3368l837J1368J7582
14538a3297K488M318j3l351j461R332J284p738j1612J280L249j257J206o698p514
14523b9784R564P219j182Q692J5322J3659l172k0230j7665o365j573N126o156
14510b6545k426J565n187K210Q744J4949J846k186M223J1190o137K218J949j102
14496E311q526O488Q667q649j1973q662K852j365O921N25j0550L90o185r173j255
$$ plain form
14481 -35184 -15539 -1045 -5460 -8453 -19823 -6837 70 -6578 -17715 -7339 9531 515 -6338
14468 -6338 6077 9026 14079 23104 9871 -2559 -11950 -1552 10778 9323 13441 9811 4786
14455 4786 -10329 -29908 -31621 -26852 -14710 -11451 -9362 7712 6709 -4576 5720 931 -1464
14442 -1464 -1172 17892 6546 -1045 -6042 -20835 -28369 -22285 -12867 -14 2880 -1769 10038 15414
14428 15414 11428 1247 11241 16371 24570 29721 26042 19430 15284 876 1459 5000 4626 5746
14414 5746 9801 10 1427 -2578 -7403 -5166 -11730 -21072 -4769 5506 15712 10286 -5869 -19965
14400 -19965 -20710 -18774 -17671 -14945 -9356 9878 -1719 -13838 -24122 -19882 -16211 -19437 -7083
14387 -7083 -10746 -22371 -29314 -31524 -29380 -16822 3227 -4559 1277 2746 -7415 -8950 -4883 -4095
$$ packed form
14481c5184J9645J4494m415k993j1370J2986O907o648j1137J0376J6870r016o853
14468f338J2415K949N053R025j3233j2430r391J0398J2330j455M118l630n025
14455D786j5115j9579j713M769J2142L259K089J7074j003j1285J0296m789k395
14442a464K92J9064j1346p591m997j4793p534O084R418J2853K894m649J1807N376
14428A5414l986j0181R994N130Q199N151l679o612m146j4408N83L541l74J120
14414E746M055r791J417m005m825K237o564r342J6303J0275J0206n426j6155j4096
14400a9965p45J936J103K726N589J9234j1597j2119j0284M240L671l226J2354
14387g083l663j1625o943k210K144J2558K0049p786N836J469j0161j535M067P88
$$ plain form
14373 -4095 -3037 1038 6740 16143 18269 10857 3602 3294 2537 -801 -1873 -216 -1840 4670 2563
14358 2563 1560 532 -10095 -19871 3825 25228 12129 -1974 -9236 -7258 -16632 -13064 6698
14345 6698 758 -8417 -17087 -21518 -18293 -4453 -6119 -9054 -10084 -7499 -4855 8285 6020 159
14331 159 -17 -1343 -920 -2815 1315 -6423 -9979 -3785 -5541 -14954 -6134 9169 8667 -5284 -5128
14316 -5128 -1802 -364 -8090 -14313 3646 4509 8106 -998 -5807 -2609 -560 1725 623 -5241 -13723
14301 -13723 -18720 -17640 -10460 -11986 -7914 -8094 -7534 1003 -3467 -17114 -7737 -7399 -17193 -7529 6732
14286 6732 13787 -2040 -12339 -24038 -31274 -24898 -7649 -9079 -13998 -7594 -176 -4315 -9473 -11504
14272 -11504 -13619 -8285 -10816 -7581 -12830 -8293 -142 10029 8613 1744 -11626 -5706 -8111 -19960
$$ packed form
14373d095J058M075N702R403K126p412p255l08p57l338j072J657j624O510k107
14358B563j003j028j0627r776K3696K1403j3099j4103p262J978r374L568J9762
14345F698n940r175q670m431L225J3840j666k935j030K585K644J3140k265n861
14331A59j76j326M23j895M130p738l556O194j756r413Q820J5303n02j3951J56
14316e128L326J438p726o223J7959Q63L597r104m809L198K049K285j102n864q482
14301a3723m997J080P180j526M072j80N60Q537m470j3647R377L38r794R664J4261
14286F732P055j5827j0299j1699p236O376J7249j430m919O404P418m139n158k031
14272a1504k115N334k531L235n249M537Q151J0171j416o869j3370N920k405j1849
$$ plain form
14258 -19960 -16655 -10088 -12486 -8676 -4512 5881 7294 -3099 4986 17772 11916 15390 14221 10773
14244 10773 9698 7329 11334 4453 7523 13589 18563 23588 14090 10877 14308 15330 13468 -3676
14230 -3676 -12146 -7401 -9642 -3099 -1134 -2825 7530 14387 8087 1350 14805 18119 2830 -13465
14216 -13465 -12998 -6484 -10349 -10444 -6360 7098 16304 -3762 -23115 -18867 -11199 -19593 -22337 -5207
14202 -5207 -8878 -17983 -15353 -10623 -8532 2597 1337 6061 11188 7620 9292 14994 10972 10216 11041
14187 11041 17720 16878 4686 -6703 -3325 -6315 -14907 -11177 6515 4333 -5402 -8738 -12228 -7111
14173 -7111 719 656 -6263 817 -5019 -6129 -5194 8904 5413 3034 -7957 -9423 3162 3969 6422
14158 6422 13860 14503 11237 1584 -8429 -4791 1632 -2195 -16334 -19830 -22254 -22301 -17570 1829 3188
$$ packed form
14258a9960L305O567k398L810M164J0393J413j0393Q085J2786n856L474j169l448
14244A0773j075k369M005o881L070O066M974N025r498l213L431J022j862j7144
14230c676q470M745k241O543J965j691J0355O857o300o737J3455L314j5289j6295
14216a3465M67O514l865r5M084J3458R206k0066j9353M248P668q394k744J7130
14202e207l671r105K630M730K091J1129j260M724N127l568J672N702m022p56Q25
14187A1041O679q42j2192j1389L378k990q592L730J7692k182r735l336l490N117
14173g111P830o3o919P080n836j110R35J4098l491k379j0991j466J2585Q07K453
14158F422P438O43l266r653j0013L638O423l827j4139l496k424m7M731J9399J359
$$ plain form
14143 3188 5548 13699 29318 18738 -13988 -30425 -38076 -27799 -29265 -29181 -26658 -23327 -17560 -7993
14129 -7993 10444 3931 5058 -5675 -9212 -346 2449 -308 11327 8664 -3798 8068 9967
14116 9967 12601 4158 -18270 -12416 1770 3788 9097 17598 21291 30793 25941 12707 17835 20765
14102 20765 14665 13170 7897 -1859 -7463 -2561 4984 11158 21921 22174 5555 -441 -348 -958 1794
14087 1794 2126 -13994 -4621 4670 10300 8500 12795 13001 18820 8332 -5323 -4521 -5939 -6465 -6017
14072 -6017 -7749 -9097 -7691 21399 39000 36084 21382 11216 -4768 -6876 -3441 10397 13560
14059 13560 15088 19227 23386 11423 7040 11936 9191 1835 446 9150 21869 16617 11619 16271
14045 16271 22859 22685 26236 12042 -2765 -10753 -7134 7550 29840 38330 44066 34834 52056
$$ packed form
14143C188K360Q151J5619j0580l2726j6437p651J0277j466Q4K523L331N767R567
14129g993J8437o513J127j0733l537Q866K795k757J1635k663j2462J1866J899
14116I967K634q443k2428N854J4186K018N309Q501L693R502m852j3234N128K930
14102B0765o100j495n273r756n604M902P545O174J0763K53j6619n996R3o10K752
14087A794L32j6120R373R291N630j800M295K06N819j0488j3655Q02j418n26M48
14072f017j732j348J406K9090J7601k916j4702j0166j5984k108L435J3838L163
14059A3560J528M139M159j1963m383M896k745p356j389Q704J2719n252m998M652
14045A6271O588j74L551j4194j4807p988L619J4684K2290Q490N736r232J7222
$$ plain form
14032 52056 52585 42845 39312 28044 26741 31445 33401 26716 27837 37278 53271 51740 54711 55025
14018 55025 63534 87491 88457 93644 101588 111718 122228 129251 137471 145339 154293 169313 192580
14005 192580 192350 197403 233993 277333 303484 326843 346764 378892 407018 450848 511201 573433
13993 573433 636848 723913 814750 925564 1083491 1281402 1525450 1800651 2078011 2370160
13983 2370160 2657736 2914483 3076871 3150788 3135020 3033058 2840872 2571732 2255888 1936166
13973 1936166 1627981 1352224 1089903 849983 667210 540051 454129 386066 320883 261475
13963 261475 231651 207513 183863 157795 142431 125767 103021 107020 101545 91025 72441 51010
13951 51010 44627 49127 57325 54538 53886 50481 40122 33624 37507 49202 40764 23838 21662 14779
$$ packed form
14032E2056N29r740l533j1268j303M704J956o685J121R441J5993j531K971L14
14018E5025Q509K3957R66N187P944J0130J0510P023Q220P868Q954J5020K3267
14005A92580k30N053L6590M3340K6151K3359J9921L2128K8126M3830O0353O2232
13993E73433O3415Q7065R0837J10814J57927J97911K44048K75201K77360K92149
13983B370160K87576K56747J62388P3917j5768j01962j92186k69140l15844l19722
13973A936166l08185k75757k62321k39920j82773j27159q5922o8063o5183n9408
13963B61475k9824k4138k3650k6068j5364j6664k2746L999n475j0520j8584k1431
13951E1010o383M500Q198k787o52l405j0359o498L883J1695q438j6926k176o883
$$ plain form
13937 14779 6065 -6536 -2243 -2097 -8201 -7000 4469 19932 15855 6556 18416 30712 38302
13924 38302 20731 -518 -7186 -26 -9591 -13203 -15538 -6914 -2145 989 9934 7194 2151 -381
13910 -381 -419 11163 5086 14547 18056 -1348 -7248 1964 -478 -3896 9622 7120 -513 -352 3224
13895 3224 1845 -3160 -14390 -13963 -1938 3195 -7258 -20701 -24066 -19089 -14625 -1923 -3284 5447
13881 5447 14233 5573 8090 5310 830 3418 5041 4658 -11632 -12133 -12266 -5323 -3395 952 10121
13866 10121 8741 156 -5478 -12932 -18730 1047 3510 -15801 -23454 -14947 -13006 -7498 995 -15298
13852 -15298 -24032 -20117 -6543 7944 20587 20571 9108 -1879 4337 1134 -2006 10550 19129
13839 19129 20679 22484 38887 35296 15323 13296 16715 19014 13446 768 -4793 -2664 6791 6991
$$ packed form
13937A4779q714j2601M293J46o104J201J1469J5463m077r299J1860J2296P590
13924C8302j7571k1249o668P160r565l612k335Q624M769L134Q945k740n043k532
13910c81l8J1582o077R461L509j9404n900R212k442l418J3518k502p633J61L576
13895C224j379n005j1230M27J2025N133j0453j3443l365M977M464J2702j361Q731
13881E447Q786q660K517k780m480K588J623l83j6290n01j33O943J928M347R169
13866A0121j380q585n634p454n798J9777K463j9311p653Q507J941N508Q493j6293
13852a5298q734L915J3574J4487J2643j6j1463j0987O216l203l140J2556Q579
13839A9129J550J805J6403l591j9973k027L419K299n568j2678n561K129R455K00
$$ plain form
13825 6991 13543 24112 23377 10075 9786 15832 9232 6071 8795 2608 19088 15769 9680 15072
13811 15072 5810 8493 9995 10608 -2006 6201 12416 9524 5438 773 846 2857 2571 7434 662
13796 662 6496 4041 2309 2627 -1690 -7331 -51 8628 19284 14814 6939 -1860 8034 15253 11507
13781 11507 14123 14607 -1720 -8933 -3111 6047 -3249 -8584 -6445 1924 127 -183 10888 22416
13767 22416 26075 23988 20440 14398 14967 23449 19473 19021 22845 13861 11473 26601 31624 32181 27280
13752 27280 26403 32207 34498 35018 35669 35685 26714 12179 4383 3057 7597 8530 13784 19963 20281 27221
13736 27221 23828 31333 36827 37607 38148 31983 23209 20284 23931 32123 39301 48370 52081 53707 59048
13721 59048 53251 54006 62542 58357 47256 39625 36549 29865 25427 32447 37700 42376 39829 34093
$$ packed form
13825F991O552J0569p35j3302k89O046o600l161K724o187J6480l319o089N392
13811A5072r262K683J502O13j2614Q207O215k892m086m665P3K011k86M863o772
13796F62N834k455j732L18m317n641P280Q679J0656m470p875q799R894P219l746
13781A1507K616M84j6327p213N822R158r296n335K139Q369j797l10J1071J1528
13767B2416L659k087l548o042N69Q482l976m52L824q984k388J5128N023N57m901
13752B7280q77N804K291N20O51J6q971j4535p796j326M540R33N254O179L18O940
13736B7221l393P505N494P80N41o165q774k925L647Q192P178R069L711J626N341
13721E9048n797P55Q536m185j1101p631l076o684m438P020N253M676k547n736
$$ plain form
13707 34093 37904 32872 43555 54804 55615 46919 45243 37953 25557 11949 23101 26420 19793
13694 19793 22903 34321 24532 18046 11373 11534 28741 24082 11434 2796 11765 12007 8984 5892
13680 5892 9180 10575 -4074 4282 21727 23884 19681 21287 9708 -516 1533 13058 26705
13667 26705 20731 13843 15556 16582 15083 11542 19032 21177 20038 15992 24047 23171 10654 4920
13653 4920 9383 25484 35325 25212 18837 29125 40749 38653 43439 37847 17092 10522 18713
13640 18713 19373 9561 -2840 432 578 1206 5429 25516 31886 20018 9301 12262 8411 4005
13626 4005 12967 12816 21880 26555 14948 17080 22377 11850 4417 5461 3750 11753 12636 20892 16438
13611 16438 14809 10101 14645 20070 17560 14281 22206 25936 22982 9481 10510 18440 13567 8113
$$ packed form
13707C4093L811n032J0683J1249Q11q696j676p290j2396j3608J1152L319o627
13694A9793L110J1418r789o486o673J61J7207m659j2648q638Q969K42l023l092
13680E892L288J395j4649Q356J7445K157m203J606j1579j0224K049J1525J3647
13667B6705n974o888J713J026j499l541P490K145j139m046Q055q76j2517n734
13653D920M463J6101R841j0113o375J0288J1624k096M786n592k0755o570Q191
13640A8713O60r812j2401L272J46O28M223K0087O370j1868j0717K961l851m406
13626D005Q962j51R064M675j1607K132N297j0527p433J044j711Q003Q83Q256m454
13611A6438j629m708M544N425k510l279P925L730k954j3501J029P930m873n454
$$ plain form
13597 8113 10613 3874 4045 18297 46323 33017 23546 15569 27958 28556 38319 39675 29355 25282
13583 25282 20661 30395 34082 48527 34968 30207 20443 7647 8607 15289 20609 28431 14474 1789
13569 1789 -5166 -12309 -12248 2419 -4859 -12509 -2374 9407 2489 1586 -2171 -584 -15195 -24751
13555 -24751 -22221 -18528 -20576 -13331 -3775 -4195 -10422 -3526 12081 10042 303 -2269 2358 -2873
13541 -2873 3659 21375 33546 30345 28101 45612 38910 26402 34082 33558 22241 25508 40677
13528 40677 34833 19012 19909 25002 32668 33440 30203 33629 42396 37637 21763 7784 7008 1286
13514 1286 -926 4847 12587 23224 33226 32944 35514 33936 42258 33788 33216 38767 27339 14086
13500 14086 18708 28889 32569 28551 10035 14980 11930 9865 5378 4257 18348 28044 26479 16910
$$ packed form
13597H113K500o739J71J4252K8026j3306r471p977J2389N98R763J356j0320m073
13583B5282m621R734L687J4445j3559m761r764j2796R60O682N320P822j3957j2685
13569A789o955p143O1J4667p278p650J0135J1781o918r03l757J587j4611r556
13555b4751K530L693k048P245R556m20o227O896J5607k039r739k572M627n231
13541b873O532J7716J2171l201k244J7511o702j2508P680n24j1317L267J5169
13528D0677n844j5821Q97N093P666P72l237L426Q767m759j5874j3979p76n722
13514A286k212N773P740J0637J0002k82K570j578Q322q470n72N551j1428j3253
13500A4086M622J0181L680m018j8516M945l050k065m487j121J4091R696j565r569
$$ plain form
13486 16910 11700 17957 2772 -595 4653 14020 25773 17943 14785 15328 16920 16216 16867 4628
13472 4628 -9151 -6866 3119 16079 17052 14023 6410 -4295 -15088 -17477 -3337 6944 11539
13459 11539 21488 23623 17388 8975 -2311 -8360 1288 14753 28033 20680 21807 25963 24273 19586
13445 19586 14718 14873 14852 10644 12983 1504 9220 20286 13581 7776 10303 11203 11018 26974 32768
13430 32768 31853 35816 35754 19111 19376 32828 28694 19150 13677 17976 22404 15475 10851 14329 18674
13415 18674 23159 23046 33600 46469 45933 28799 13371 6584 7278 16858 12077 11784 8857 4309
13401 4309 6170 26644 26621 8585 23323 47415 50499 44371 46216 40799 23536 21820 22763 42727
13387 42727 55354 48560 48397 58848 60633 48824 43549 44936 59644 70921 70319 87496 106020
$$ packed form
13486A6910n210O257j5185l367N248R367J1753p830l158N43J592p04O51j2239
13472D628j3779K285R985J2960R73l029p613j0705j0793k389J4140J0281M595
13459A1539R949K135o235q413j1286o049R648J3465J3280p353J127M156j690m687
13445A9586m868J55k1m208K339j1479P716J1066o705n805K527R00j85J5956N794
13430C2768r15L963o2j6643K65J3452m134r544n473M299M428o929m624L478M345
13415A8674M485j13J0554J2869n36j7134j5428o787O94R580m781k93k927m548
13401D309J861K0474k3j8036J4738K4092L084o128J845n417j7263j716R43J9964
13387D2727J2627o794j63J0451J785j1809n275J387J4708J1277o02J7177J8524
$$ plain form
13374 106020 120215 129122 142855 159936 175964 208968 232298 264624 269066 266724 256260 237712
13362 237712 229332 220174 206220 180203 172003 172300 171610 183620 205185 217845 231962 252742 262989
13349 262989 271770 276090 279626 266503 247623 230537 215745 191842 164245 147992 138487 113911
13337 113911 92434 82689 93052 95289 95821 93002 94939 80173 57135 63515 55073 42672 21798
13324 21798 19251 37970 56802 55998 48431 43740 50314 53702 56495 57489 67895 74466 64174 60826
13310 60826 60666 63703 57560 62987 64939 67534 76469 70191 61504 51318 63290 85600 94783 86430
13296 86430 80892 85373 90779 94265 92610 96262 96082 109121 131926 150626 163395 196159 234026
13283 234026 268272 286377 303045 306246 308400 315623 306113 288006 276317 259564 234210 216443
$$ packed form
13374A06020J4195Q907J3733J7081J6028L3004K3330L2326M442k342j0464j8548
13362B37712q380r158j3954k6017q200K97o90J2010K1565J2660J4117K0780J0247
13349B62989Q781M320L536j3123j8880j7086j4792k3903k7597j6253r505k4576
13337A13911k1477r745J0363K237N32k819J937j4766k3038O380q442j2401k0874
13324B1798k547J8719J8832q04p567m691O574L388K793R94J0406O571j0292l348
13310F0826j60L037o143N427J952K595Q935o278q687j0186J1972K2310R183q353
13296H6430n538M481N406L486j655L652j80J3039K2805J8700J2769L2764L7867
13283B34026L4246J8105J6668L201K154P223r510j8107j1689j6753k5354j7767
$$ plain form
13271 216443 210093 214446 213263 217602 215737 236848 260388 289040 309839 319641 324720 322945 320424
13258 320424 300231 268259 237921 200794 183542 160545 136496 107029 89507 90828 79926 62844
13246 62844 62782 75487 71098 65801 51625 43673 56009 59152 61938 51766 36640 28190 24467 46064
13232 46064 55531 52925 50995 46515 47705 50200 50964 35233 33493 31284 39537 40031 42964 44598 38516
13217 38516 44999 44277 42459 43205 43970 42708 45584 52999 54159 60256 65272 63150 64948 62224 52488
13202 52488 41309 45487 54673 62844 52573 52735 55881 63346 76831 68010 42853 38637 42472 55488
13188 55488 49035 46643 47007 49453 49024 53003 63304 62998 59139 52779 42375 59457 69854 73685
13174 73685 88647 101336 109625 113639 112621 99840 84196 88055 95420 72401 66565 78625 74243
$$ packed form
13271B16443o350M353j183M339j865K1111K3540K8652K0799R802N079j775k521
13258C20424k0193l1972l0338l7127j7252k2997k4049k9467j7522J321j0902j7082
13246F2844o2J2705m389n297j4176p952J2336L143K786j0172j5126q450l723K1597
13232D6064R467k606j930m480J190K495P64j5731j740k209Q253M94K933J634o082
13217C8516O483p22j818P46P65j262K876P415J160O097N016k122J798k724r736
13202E2488j1179M178R186Q171j0271J62L146P465J3485q821k5157m216L835J3016
13188E5488o453k392L64K446m29L979J0301l06l859o360j0404J7082J0397L831
13174G3685J4962J2689Q289M014j018j2781j5644L859P365k3019n836J2060m382
$$ plain form
13161 74243 69296 69417 60722 58379 57497 67880 78698 86256 95169 83422 84384 94228 96247 98921
13147 98921 106138 119791 110954 104230 95094 90493 97512 101202 104946 102265 91829 83010 105515 110073
13133 110073 110469 113538 110540 110371 113851 101340 93186 103929 111656 118169 126478 127978 138927 140188
13119 140188 131776 135311 135949 124308 126034 132708 136459 129448 120987 125568 130553 127637 118706 124272
13105 124272 126074 128023 135411 147113 142579 125476 107166 121946 129686 129242 126993 134342 134042 122289
13091 122289 120564 107729 115997 134175 138231 136234 119682 116270 115016 113017 116492 121218 134776
13078 134776 149334 143271 144718 137979 121680 119321 115214 125734 134446 139414 137638 137648 129594 131969
13064 131969 141120 132950 124843 128878 138056 149256 153825 157853 151156 143626 145343 141715 153079 152644
$$ packed form
13161G4243m947J21q695k343q82J0383J0818P558Q913j1747R62R844K019K674
13147I8921P217J3653q837o724r136m601P019L690L744k681j0436q819K2505M558
13133A10073L96L069k998j69L480j2511q154J0743P727O513Q309J500J0949J261
13119A40188q412L535O38j1641J726O674L751p011q461M581M985k916q931N566
13105A24272J802J949P388J1702m534j7103j8310J4780P740m44k249P349l00j1753
13091A22289j725j2835Q268J8178M056j997j6552l412j254j999L475M726J3558
13078A34776J4558o063J447o739j6299k359m107J0520Q712M968j776J0q054K375
13064A31969R151q170q107M035R178J1200M569M028o697p530J717l628J1364m35
$$ plain form
13050 152644 141811 125775 133115 135143 141402 143509 147291 143419 141981 137507 143633 147895 138264 122413
13036 122413 113144 115438 132172 142319 136548 124904 116305 121240 129816 137912 137356 134586 129944 116188
13022 116188 124699 140181 147468 141465 134409 133404 140326 137519 121895 112486 117249 112039 131008
13009 131008 146740 143146 145395 143228 147658 158010 154909 152508 164319 172362 169962 167480 173917
12996 173917 169118 163400 154207 163944 187033 194752 201271 197140 205089 228688 240694 253157 275241
12983 275241 290883 322772 358767 380433 406796 433808 483785 572364 665097 781976 900254
12972 900254 1011808 1133607 1249633 1320395 1347983 1342670 1297491 1217797 1097781 961369 840429
12961 840429 726077 591982 486413 406868 340544 297329 268073 238223 211450 190872 161904
$$ packed form
13050A52644j0833j6036P340K028O259K107L782l872j438m474O126M262r631j5851
13036A22413r269K294J6734J0147n771j1644q599M935Q576Q096n56k770m642j3756
13022A16188Q511J5482P287o003p056j005O922k807j5624r409M763n210J8969
13009A31008J5732l594K249k167M430J0352l101k401J1811Q043k400k482O437
12996A73917m799n718r193R737K3089P719O519m131P949K3599J2006J2463K2084
12983B75241J5642L1889L5995K1666K6363K7012M9977Q8579R2733J16879J18278
12972I00254J11554J21799J16026P0762K7588n313m5179p9694j20016j36412j20940
12961H40429j14352j34095j05569p9545o6324m3215k9256k9850k6773k0578k8968
$$ plain form
12950 161904 132535 124123 120577 121244 114102 111798 118099 120321 116687 116616 104369 98018 93409 109308
12936 109308 120807 125151 123292 121198 107530 108821 106844 88899 85917 91826 101422 112445 114835
12923 114835 117934 113160 114809 104827 86199 88154 94564 95088 100838 102141 104601 109324 100246 94323
12909 94323 81611 65858 69099 75054 77488 75317 74568 74191 76589 77604 83746 82288 71017 69931
12895 69931 68929 63642 68809 82613 78303 78847 81006 81016 94070 97404 112947 119520 117327 106991
12881 106991 109973 116146 114681 114187 113711 102390 96740 88238 84092 93886 105488 96429 82901 76034
12867 76034 77277 86134 95548 92897 103766 107632 110924 115904 116455 103716 91619 84094 78768 78481
12853 78481 84986 92720 82982 88816 93969 88855 84343 87259 91443 79665 75225 90675 104338 101707
$$ packed form
12950A61904k9369q412l546O67p142k304O301K222l634p1j2247o351m609J5899
12936A09308J1499M344j859k094j3668J291j977j7945k982N909R596J1023K390
12923A14835L099m774J649r982j8628J955O410N24N750J303K460M723r078n923
12909I4323j2712j5753L241N955K434k171p49l77K398J015O142j458j1271j086
12895F9931j002n287N167J3804m310N44K159J0J3054L334J5543O573k193j0336
12881A06991K982O173j465m94m76j1321n650q502m146R794J1602r059j3528o867
12867G6034J243Q857R414k651J0869L866L292M980N51j2739j2097p525n326k87
12853G8481O505P734r738N834N153n114m512K916M184j1778m440J5450J3663k631
$$ plain form
12839 101707 95186 103698 114238 116383 83487 73440 85770 91712 96931 108291 106941 92884 97081
12826 97081 107398 105348 93149 82432 86176 91541 91830 103625 113794 112549 109821 130591 155646
12813 155646 162090 162629 172321 176957 185775 203810 213009 230461 245062 261084 275583 279804 279247
12800 279247 274606 264419 246973 255781 264193 258255 235211 224642 211338 194921 192247 185573 184057
12787 184057 173283 172204 175790 188576 196461 201658 206991 204557 214831 232653 230323 218780 219304
12774 219304 231430 243509 232038 222728 218545 217575 210081 199662 195135 184779 184529 198493 199700
12761 199700 214918 226925 212947 223355 237829 234358 241384 245672 252537 249976 245104 246871 256180
12748 256180 265805 272456 266781 257106 243132 230051 227701 230755 218962 218478 204089 182301 153585
$$ packed form
12839A01707o521Q512J0540K145l2896j0047J2330N942N219J1360j350j4057M197
12826I7081J0317k050j2199j0717L744N365K89J1795J0169j245k728K0770K5055
12813A55646O444N39R692M636Q818J8035R199J7452J4601J6022J4499M221n57
12800B79247m641j0187j7446Q808Q412n938k3044j0569j3304j6417k674o674j516
12787A84057j0774j079L586J2786P885N197N333k434J0274J7822k330j1543N24
12774B19304J2126J2079j1471r310m183r70p494j0419m527j0356k50J3964J207
12761A99700J5218J2007j3978J0408J4474l471P026M288O865k561m872J767R309
12748B56180R625O651n675r675j3974j3081k350L054j1793m84j4389k1788k8716
$$ plain form
12735 153585 144876 144086 137167 123198 129311 134430 147802 150125 142893 154598 161300 160279 148091
12722 148091 149509 157317 170316 179887 186387 187806 185703 191033 180773 185187 188884 193215 201618 183349
12708 183349 172107 182574 177300 159839 165088 168620 168364 189556 192682 197612 209579 225661 211770
12695 211770 211548 224690 225700 224183 235186 231468 245835 268015 280164 296763 315594 338799
12683 338799 365259 404628 428876 464153 507380 551522 596118 639934 679067 720945 763813
12672 763813 768181 770707 766358 741737 713363 686683 655717 638964 619015 596202 595440 579431
12660 579431 576242 559933 549855 551344 565800 553363 530920 540932 556158 550695 559579 569320
12648 569320 565015 563670 574846 580088 589265 613002 651221 691612 711627 722764 725413 742600
$$ packed form
12735A53585q709p90o919j3969O113N119J3372K323p232J1705O702j021j2188
12722A48091J418P808J2999R571O500J419k103N330j0260M414L697M331Q403j8269
12708A83349j1242J0467n274j7461N249L532k56K1192L126M930J1967J6082j3891
12695B11770k22J3142J010j517J1003l718J4367K2180J2149J6599J8831K3205
12683C38799K6460L9369K4248L5277M3227M4142M4596M3816L9133M1878M2868
12672G63813M368K526m349k4621k8374k6680l0966j6753j9949k2813p62j6009
12660E79431l189j6309j0078J489J4456j2437k2443J0012J5226n463Q884R741
12648E69320m305j345J1176N242R177K3737L8219M0391K0015J1137K649J7187
$$ plain form
12636 742600 759392 772535 795285 793131 805224 826052 853896 880266 901419 933763 963009 994937
12624 994937 1019179 1036638 1059572 1090795 1129492 1152683 1191852 1237842 1274898 1308363 1341592
12613 1341592 1384575 1444000 1500238 1555960 1620953 1691665 1745489 1804187 1887126 1987688 2091825
12602 2091825 2193900 2285268 2412425 2538281 2662627 2795861 2969531 3159281 3339523 3549007
12592 3549007 3786599 4029360 4296154 4579396 4903499 5257455 5652042 6098866 6603722
12583 6603722 7143979 7735891 8385007 9084129 9851221 10686574 11593263 12554079 13585548
12574 13585548 14681641 15861264 17162292 18610253 20260004 22144638 24320257 26798075
12566 26798075 29594311 32715257 36120945 39788005 43751853 48152112 53263202 59539743
$$ packed form
12636G42600J6792J3143K2750k154J2093K0828K7844K6370K1153L2344K9246L1928
12624I94937K4242J7459K2934L1223L8697K3191L9169M5990L7056L3465L3229
12613A341592M2983N9425N6238N5722O4993P0712N3824N8698Q2939J00562J04137
12602B091825J02075R1368J27157J25856J24346J33234J73670J89750J80242K09484
12592C549007K37592K42761K66794K83242L24103L53956L94587M46824N04856
12583F603722N40257N91912O49116O99122P67092Q35353R06689R60816J031469
12574A3585548J096093J179623J301028J447961J649751J884634K175619K477818
12566B6798075K796236L120946L405688L667060L963848M400259N111090O276541
$$ plain form
12558 59539743 67657475 78398571 92464061 110251472 131547551 155383593 180102097
12551 180102097 203635207 223628786 237858609 244616040 242952839 232895845 215586883
12544 215586883 193010762 167387256 140946824 115708844 93146902 74197335 59122921
12537 59122921 47569896 38879194 32357596 27391739 23511234 20358602 17709240 15416918
12529 15416918 13398784 11625418 10079518 8729600 7589407 6640446 5859145 5234040
12521 5234040 4723315 4290463 3916514 3609690 3344626 3116501 2909388 2727611 2564803
12512 2564803 2427349 2288972 2169374 2048486 1943067 1857076 1778961 1684328 1597357 1528842
12502 1528842 1456734 1383942 1315956 1260141 1204100 1147737 1107631 1065699 1029135 1005619 959152
$$ packed form
12558E9539743Q117732J0741096J4065490J7787411K1296079K3836042K4718504
12551A80102097K3533110J9993579J4229823O757431j663201j0056994j7308962
12544B15586883k2576121k5623506k6440432k5237980k2561942j8949567j5074414
12537E9122921j1553025q690702o521598m965857l880505l152632k649362k292322
12529A5416918k018134j773366j545900j349918j140193r48961p81301o25105
12521E234040n10725m32852l73949l06824k65064k28125k07113j81777j62808
12512B564803j37454j38377j19598j20888j05419q5991p8115r4633q6971o8515
12502A528842p2108p2792o7986n5815n6041n6363m0106m1932l6564k3516m6467
$$ plain form
12491 959152 919417 885139 848108 822076 804360 801838 770341 725406 687585 660259 630095 610591
12479 610591 586258 567586 558052 529970 526685 504051 474887 467923 468654 477331 471165 446813 431074
12466 431074 433094 431128 415199 402105 391006 390897 368094 355740 348789 332174 327524 330961 323420
12453 323420 322223 317750 315044 317965 320854 317317 317955 313082 306183 306936 308583 286969 266907 252032
12439 252032 252197 237525 227584 232745 220130 197737 174837 154620 153367 148825 130365 102753 86902
12426 86902 65248 27836 13140 -5048 -18085 -9132 20502 37973 59012 84170 111848 151859
12414 151859 171207 212210 241995 264830 278790 307874 327116 334301 357567 378159 401514 419111
12402 419111 446888 480861 508791 527348 551317 590070 640906 677391 712921 756628 821789
$$ packed form
12491I59152l9735l4278l7031k6032j7716k522l1497m4935l7821k7326l0164j9504
12479F10591k4333j8672r534k8082l285k2634k9164o964P31Q677o166k4352j5739
12466D31074K020j966j5929j3094j1099j09k2803j2354o951j6615m650L437p541
12453C23420j197m473k706K921K889l537O38m873o899P53J647k1614k0062j4875
12439B52032J65j4672r941N161j2615k2393k2900k0217j253m542j8460k7612j5851
12426H6902k1654l7412j4696j8188j3037Q953K9634J7471K1039K5158K7678M0011
12414A51859J9348M1003K9785K2835J3960K9084J9242P185K3266K0592K3355J7597
12402D19111K7777L3973K7930J8557K3969L8753N0836L6485L5530M3707O5161
$$ plain form
12391 821789 885777 968035 1051654 1147991 1239285 1312209 1380958 1452593 1509222 1560084 1642391
12380 1642391 1735533 1852926 2001040 2175062 2400416 2672902 2996391 3404115 3894024 4463612
12370 4463612 5079712 5735812 6373226 6938358 7372041 7646804 7725257 7625138 7320850 6837274
12360 6837274 6221572 5530396 4802085 4095926 3436328 2859755 2362091 1950225 1601495
12351 1601495 1325118 1108606 931522 797789 685284 586725 511566 465613 413357 357347
12341 357347 309886 266254 235500 220614 207965 193281 164436 134120 116896 125302 112645 101308
12329 101308 80289 58465 48048 47303 44073 50924 67271 72487 72414 67260 73225 80724 77022 66222
12315 66222 58304 43906 37297 44917 46483 48127 50900 50642 60037 73187 59005 54953 56985 48837
$$ packed form
12391H21789O3988Q2258Q3619R6337R1294P2924O8749P1635N6629N0862Q2307
12380A642391R3142J17393J48114J74022K25354K72486L23489M07724M89909N69588
12370D463612O16100O56100O37414N65132M33683K74763P8453j00119l04288m83576
12360F837274o15702o91176p28311p06159o59598n76573m97664m11866l48730
12351A601495k76377k16512j77084j33733j12505r8559p5159m5953n2256n6010
12341C57347m7461m3632l0754j4886j2649j4684k8845l0316j7224Q406j2657j1337
12329A01308k1019k1824j0417p45l230O851J6347N216p3n154N965P499l702j0800
12315F6222p918j4398o609P620J566J644K773k58R395J3150j4182m052K032q148
$$ plain form
12301 48837 48430 44703 47240 38996 28072 36184 33486 31213 43131 36841 27202 23526 19784 16737
12287 16737 24467 34270 22600 14197 21078 31385 26610 27307 35994 48112 44095 29717 41344
12274 41344 35050 15242 3944 20073 23582 9843 6969 8768 29951 48282 50024 43388 34185
12261 34185 30727 12892 6684 17460 15617 25184 28356 17828 -3714 -20675 -19189 510 17429
12248 17429 14975 9543 17650 26583 31612 30715 21092 25285 28999 26588 31764 36383 54580 70433
12234 70433 65829 74915 86823 90355 110308 129383 161914 214655 252769 275006 293785 295595
12222 295595 288117 271553 230477 199976 171046 133853 120537 111563 110607 138226 149998 161626
12210 161626 178198 184737 179429 189552 211208 230495 261840 299965 328351 360234 400153 452555
$$ packed form
12301D8837m07l727K537q244j0924Q112k698k273J1918o290r639l676l742l047
12287A6737P730R803j1670q403O881J0307m775O97Q687J2118m017j4378J1627
12274D1344o294j9808j1298J6129L509j3739k874J799K1183J8331J742o636r203
12261C4185l458j7835o208J0776j843R567L172j0528k1542j6961J486J9699J6919
12248A7429k454n432Q107Q933N029q97r623M193L714k411N176M619J8197J5853
12234G0433m604R086J1908L532J9953J9075L2531N2741L8114K2237J8779J810
12222B95595p478j6564m1076l0501k8930l7193j3316q974r56K7619J1772J1628
12210A61626J6572O539n308J0123K1656J9287L1345L8125K8386L1883L9919N2402
$$ plain form
12198 452555 505336 552523 600230 641347 672748 674281 643492 607682 558975 500873 435929 369064
12186 369064 297433 235181 195021 152447 117706 96257 84007 78014 65223 56567 55498 50246
12174 50246 27759 7786 10217 5285 6002 22623 44530 53019 41383 35510 51172 50495 43497
12161 43497 50390 40343 33843 40793 49546 45741 46274 68978 82377 91116 92355 93698 99256 111855
12147 111855 112986 126392 138564 155654 169533 178126 192984 217744 243682 271150 300671 336921
12135 336921 381091 430421 497298 576503 663467 759648 852351 946563 1057904 1167075 1249631
12124 1249631 1320266 1388791 1409645 1380202 1311504 1222886 1111353 973972 830615 710294
12114 710294 602176 522115 442568 393598 385033 385887 373642 369146 359098 346968 346362 320505
$$ packed form
12198D52555N2781M7187M7707M1117L1401J533l0789l5810m8707n8102o4944o6865
12186C69064p1631o2252m0160m2574l4741k1449j2250n993j2791q656j069n252
12174E0246k2487j9973K431m932P17J6621K1907Q489j1636n873J5662o77o998
12161D3497O893j0047o500O950Q753l805N33K2704J3399Q739J239J343N558J2599
12147A11855J131J3406J2172J7090J3879Q593J4858K4760K5938K7468K9521L6250
12135C36921M4170M9330O6877P9205Q6964R6181R2703R4212J11341J09171Q2556
12124A249631P0635O8525K0854k9443o8698q8618j11533j37381j43357j20321
12114G10294j08118q0061p9547m8970q565Q54j2245m496j0048j2130o06k5857
$$ plain form
12102 320505 275531 237172 204207 161866 116843 83061 64123 52748 46440 45455 43227 36073
12090 36073 43090 39248 32983 22788 18983 2132 -9401 661 11275 -1535 -26641 -46280
12078 -46280 -48230 -42838 -42705 -29645 -19550 -17637 -24051 -24306 -2607 18766 20928 26426 22331 18569
12064 18569 7006 6989 15538 21625 12691 379 -5630 4614 14647 22808 37928 44363 47234 48561
12050 48561 52698 80281 97947 116784 143477 175521 196476 221707 220313 202976 175659 159909
12038 159909 154118 133576 110976 92825 92314 69326 60048 68667 77456 62971 68485 77393 90827
12025 90827 80063 51536 45291 42179 34871 26501 18910 17346 23278 16952 8471 6290 6608 3280
12011 3280 -9734 -5736 -3706 -9452 1740 15049 10416 8563 2540 563 7891 7959 -1976 1128
$$ packed form
12102C20505m4974l8359l2965m2341m5023l3782j8938j1375o308r85k228p154
12090C6073P017l842o265j0195l805j6851j1533J0062J0614j2810k5106j9639
12078d6280j950N392J33J3060J0095J913o414k55K1699K1373K162N498m095l762
12064A8569j1563j7Q549O087q934j2312o009J0244J0033Q161J5120O435K871J327
12050D8561M137K7583J7666J8837K6693L2044K0955K5231j394j7337k7317j5750
12038A59909n791k0542k2600j8151n11k2988r278Q619Q789j4485N514Q908J3434
12025I0827j0764k8527o245l112p308q370p591j564N932o326q481k181L18l328
12011C280j3014L998K030n746J1192J3309m633j853o023j977P328O8r935L104
$$ plain form
11997 1128 -3930 -2611 -7406 -9801 -6271 -4192 -9898 -5788 -7535 -5806 -1343 -4130 -7453 -10670 -10184
11982 -10184 -14709 -11866 -536 -452 -5176 -9997 -9628 -7580 -13690 -8098 -7453 1213 1233 10601 7244 3444
11966 3444 13006 19551 27182 22305 13697 4214 -8471 -10130 3200 9625 10377 7609 8287 4385 -935
11951 -935 -2109 3832 11297 1883 -6150 -7849 -10356 -5686 4814 17942 21533 23786 8369 1492
11937 1492 18645 14309 7349 3646 9872 5769 -10223 -5721 5394 10528 7663 3999 -4166 1547
11923 1547 9874 723 -10943 -17559 -17843 -16121 -4670 -2417 -1025 1104 965 -12670 -7497 3979
11909 3979 183 -2226 -2780 -132 -3965 990 12334 7875 4017 12280 22411 32269 44655 59630
11895 59630 75959 56322 39335 16289 4648 4922 -140 -2362 -2006 -3500 -3594 -15575 -8563 -3416
$$ packed form
11997A128n058J319m795k395L530K079n706M110j747J729M463k787l323l217M86
11982a0184m525K843J1330Q4m724m821L69K048o110N592O45Q666K0R368l357l800
11966C444R562O545P631m877q608r483j2685j659J3330O425P52k768O78l902n320
11951i35j174N941P465r414q033j699k507M670J0500J3128L591K253j5417o877
11937A492J7153m336o960l703O226m103j5992M502J1115N134k865l664q165N713
11923A547Q327r151j1666o616k84J722J1451K253J392K129j39j3635N173J1476
11909C979l796k409n54K648l833M955J1344m459l858Q263J0131R858J2386J4975
11895E9630J6329j9637j6987k3046j1641K74n062k222L56j494r4j1981P012N147
$$ plain form
11881 -3416 -13179 -14113 -13034 -10548 789 7494 -1671 -10998 -16334 -12529 -10078 -11354 -8718 -652 7965
11866 7965 21694 25543 2943 -118 8820 15505 15038 10507 -6667 -17677 -5139 -6731 -11993 -8441
11852 -8441 -918 4621 2121 446 8626 32333 33201 25442 13920 16631 24252 16933 23547 26263
11838 26263 17427 24664 19052 10632 687 298 -11539 -31198 -25625 -17227 -35283 -34379 -19650 -12416
11824 -12416 -8010 -10854 -15077 -25238 -14587 -1656 -3562 -11922 -6018 5198 2446 -4414 -3560 474
11810 474 9807 17309 11064 -5939 -25478 -31130 -22263 -15933 -17221 -9379 -567 806 -12150 -23223
11796 -23223 -27855 -28882 -19548 -25898 -73 5744 -7291 -6796 -1599 -14290 -17068 -9896 6072 605
11782 605 3487 4437 1278 -7759 -5196 6794 17810 17042 8521 3233 12360 10990 1338 2118 7963
$$ packed form
11881c416r763r34J079K486J1337O705r165r327n336L805K451j276K636Q066Q617
11866G965J3729L849k2600l061Q938O685m67m531j7174j1010J2538j592n262L552
11852h441P523N539k500j675Q180K3707Q68p759j1522K711P621p319O614K716
11838B6263q836P237n612q420r945l89j1837j9659N573Q398j8056R04J4729P234
11824a2416M406k844m223j0161J0651J2931j906q360N904J1216k752o860Q54M034
11810D74R333P502o245j7003j9539n652Q867O330j288P842Q812J373j2956j1073
11796b3223m632j027R334o350K5825N817j3035M95N197j2691k778P172J5968n467
11782F05K882R50l159r037K563J1990J1016p68q521n288R127j370r652P80N845
$$ plain form
11767 7963 1306 -4234 7601 21622 25596 20079 14407 4509 -15901 -24640 -21477 -1064 6445 15909
11753 15909 19949 16805 15617 9777 -16535 -17342 -3607 8898 9145 -4762 -16138 -13002 -6628 -2723
11739 -2723 -1099 -1830 -5517 -15709 -21152 -14375 -504 -9186 -14627 -19598 -13054 -16930 -34335 -32000
11725 -32000 -33349 -36353 -15595 -6267 596 3574 2965 509 -1131 13596 12282 63 -4140 -5176
11711 -5176 -16687 -29063 -24621 -15833 -11379 -14293 -19153 -8317 1388 11278 19683 21206 21355 13492
11697 13492 13132 15809 10242 2136 7270 8939 -8690 -11671 10926 18122 9396 -4883 -10335 -4039
11683 -4039 1467 6742 8381 6114 14337 13341 2393 4201 -1195 1266 -2763 -12321 -880 11184
11669 11184 4210 -4908 -10708 -6840 -13091 -9799 11506 7832 -15813 -17830 -16737 -7254 -3138 -6848
$$ packed form
11767G963o657n540J1835J4021L974n517n672r898k0410q739L163K0413P509R464
11753A5909M040l144j188n840k6312q07J3735J2505K47j3907j1376L136O374L905
11739b723J624p31l687j0192n443O777J3871q682n441m971O544l876j7405K335
11725c2000j349l004K0758R328O863K978o09k456j640J4727j314j2219m203j036
11711e176j1511j2376M442Q788M454k914m860J0836R705R890Q405J523J49p863
11697A3492l60K677n567q106N134J669j7629k981K2597P196q726j4279n452O296
11683d039N506N275J639k267Q223r96j0948J808n396K461m029r558J1441J2064
11669A1184o974r118n800L868o251L292K1305l674k3645k017J093R483M116l710
$$ plain form
11655 -6848 -2325 -9957 -14526 -15847 -14403 1441 5199 -398 5858 26093 34386 31122 26991 28326
11641 28326 31921 23748 4644 1853 12885 20447 21318 14926 15883 25843 21002 8562 4443 -4719
11627 -4719 -13189 -1071 4060 3817 5215 982 -5459 -16239 -14266 -1116 -356 4791 10775 11017 -121
11612 -121 -7168 2420 6071 479 412 15638 26533 32201 30478 12353 7652 5113 -934 2721 9322
11597 9322 13460 12654 16461 30522 39392 42856 37756 21033 11343 6973 11471 15691 28504 26841
11583 26841 18729 9012 13473 28284 27154 5552 -6122 9185 22372 24677 17768 14508 178
11570 178 1370 1156 -8985 1440 13548 19397 9649 14278 24817 20193 -2022 5851 11805 19177
11556 19177 25133 16778 9037 12027 16062 13941 1687 2206 12365 16040 2714 1595 6324 14280
$$ packed form
11655f848M523p632m569j321J444J5844L758n597O256K0235Q293l264m131J335
11641B8326L595q173j9104k791J1032P562Q71o392R57R960m841j2440m119r162
11627d719q470J2118N131k43J398m233o441j0780J973J3150P60N147N984K42j1138
11612a21p047R588L651n592o7J5226J0895N668j723j8125m701k539o047L655O601
11597I322M138q06L807J4061Q870L464n100j6723r690m370M498M220J2813j663
11583B6841q112r717M461J4811j130k1602j1674J5307J3187K305o909l260j4330
11570A78J192k14j0141J0425J2108N849r748M629J0539m624k2215P873N954P372
11556A9177N956q355p741K990M035k121j2254N19J0159L675j3326j119M729P956
$$ plain form
11542 14280 16351 17301 12261 10282 15246 10275 -4921 -395 9471 12061 16480 28154 41475 37864
11528 37864 46547 41547 34422 37542 38062 25432 17071 8670 7440 16438 22442 7147 -55 10614
11514 10614 10877 10523 23494 33149 24089 13678 21191 25309 24651 12852 15916 19922 29558 38967
11500 38967 46690 46530 45052 35136 28354 20373 18999 18911 18281 13241 27347 38945 45047 32772 40829
11485 40829 54460 48700 46809 46737 49764 48445 36560 30171 34276 47844 64128 63988 62703 42089
11471 42089 43352 44839 50681 63158 72139 81449 73225 59500 64966 75816 72221 69679 68514 71352
11457 71352 72614 87497 90686 99832 120240 130747 140889 148484 166294 164802 162841 157323 169263
11444 169263 182641 200241 203337 217343 225441 238943 266379 297326 317117 335640 371711 413454
$$ packed form
11542A4280K071R50n040j979M964m971j5196M526R866K590M419J1674J3321l611
11528C7864Q683n000p125L120N20j2630q361q401j230Q998O004j5295p202J0669
11514A0614K63l54J2971R655r060j0411P513M118o58j1799L064M006R636R409
11500C8967P723j60j478r916o782p981j374q8o30n040J4106J1598O102j2275Q057
11485D0829J3631n760j891p2L027j319j1885o389M105J3568J6284j40j285k0614
11471D2089J263J487N842J2477Q981R310q224j3725N466J0850l595k542j165K838
11457G1352J262J4883L189R146K0408J0507J0142P595J7810j492j961n518J1940
11444A69263J3378J7600L096J4006Q098J3502K7436L0947J9791J8523L6071M1743
$$ plain form
11432 413454 430515 443366 476711 513990 570086 637086 696782 772679 858054 953294 1055232
11421 1055232 1152083 1269272 1431635 1618099 1855462 2175389 2597288 3130333 3736645 4322784
11411 4322784 4776561 4964031 4838741 4428627 3857814 3244061 2663260 2165672 1750236
11402 1750236 1412087 1160468 973583 838771 729747 633794 558773 489560 416818 361797
11392 361797 316667 284294 264025 235724 206295 181305 166401 156185 135272 120349 126760 130818
11380 130818 117950 115085 126116 126747 117208 100577 86878 86961 99964 77460 61887 71467 67684
11367 67684 64681 61126 50378 46021 49173 62315 51745 43570 42967 53241 67139 74015 72853
11354 72853 65090 60122 65076 55667 48301 61151 77861 67559 57108 56848 47141 39923 44708 35553
$$ packed form
11432D13454J7061J2851L3345L7279N6096O7000N9696P5897Q5375R5240J01938
11421A055232R6851J17189J62363J86464K37363L19927M21899N33045O06312N86139
11411D322784M53777J87470j25290m10114n70813o13753n80801m97588m15436
11402A750236l38149k51619j86885j34812j09024r5953p5021o9213p2742n5021
11392C61797m5130l2373k0269k8301k9429k4990j4904j0216k0913j4923O411M058
11380A30818j2868k865J1031O31r539j6631j3699Q3J3003k2504j5573R580l783
11367F7684l003l555j0748m357L152J3142j0570q175o03J0274J3898O876j162
11354G2853p763m968M954r409p366J2850J6710j0302j0451k60r707p218M785r155
$$ plain form
11340 35553 31813 37538 44071 47540 52317 45753 45342 26949 23616 19361 7411 7213 21930 20178
11326 20178 9226 10927 12077 28099 50268 49543 42051 42467 44305 54937 47343 49121 52602 52741
11312 52741 44989 33907 31821 25165 12916 15314 25857 16387 22442 33561 27802 19347 31686
11299 31686 33914 30404 35406 46928 50265 41788 31447 31350 19990 14876 24707 26631 22033 19779
11285 19779 21111 28742 35880 38919 34328 20269 22151 32157 39792 43792 44132 43685 44057 44043 42624
11270 42624 58633 56396 43720 42091 42817 44249 42908 39307 50462 53320 51346 57539 59275 59109
11256 59109 56250 58465 49824 38833 47084 58458 65004 81133 80028 70821 59437 48717 46344
11243 46344 36552 32032 18647 26380 40166 45752 60999 55307 47048 46122 44431 45083 42055 40075
$$ packed form
11340C5553l740N725O533L469M777o564m11j8393l333m255j1950j98J4717j752
11326B0178j0952J701J150J6022K2169p25p492M16J838J0632p594J778L481J39
11312E2741p752j1082k086o656j2249K398J0543r470O055J1119n759q455J2339
11299C1686K228l510N002J1522L337q477j0341r7j1360n114R831J924m598k254
11285A9779J332P631P138L039m591j4059J882J0006P635M000L40m47L72j4j419
11270D2624J6009k237j2676j629P26J432j341l601J1155K858j974O193J736j66
11256E9109k859K215q641j0991Q251J1374O546J6129j105r207j1384j0720k373
11243D6344r792m520j3385P733J3786N586J5247n692q259r26j691O52l028j980
$$ plain form
11229 40075 37603 45418 57283 57732 47955 57589 60237 53498 54044 59442 67647 53374 52181 49461
11215 49461 54561 64586 71898 63164 61232 50907 32546 37988 52222 53176 53352 50100 52189 53451
11201 53451 49397 50895 66901 70764 65382 70644 73087 56628 50571 52924 61815 83318 94524
11188 94524 93670 89424 81918 88610 92919 87366 72751 62164 67483 85154 87451 86286 88684 98155
11174 98155 99435 105982 105361 100384 95490 85880 86088 91032 97020 99916 103663 99851 91837 90917 99115
11159 99115 105432 106142 113395 112112 113094 110944 98385 106042 126890 122078 116537 106719 108923 116194
11145 116194 104201 99419 93526 81192 81804 74258 71341 83627 101773 89041 83804 91488 102013
11132 102013 94505 83925 92734 88825 82512 85503 91213 88206 91049 85487 77519 67301 56820
$$ packed form
11229D0075k472P815J1865M49r777R634K648o739N46N398Q205j4273j193k720
11215D9461N100J0025P312q734j932j0325j8361N442J4234R54J76l252K089J262
11201E3451m054J498J6006L863n382N262K443j6459o057K353Q891K1503J1206
11188I4524q54m246p506O692M309n553j4615j0587N319J7671K297j165K398R471
11174I8155J280O547o21m977m894r610K08M944N988K896L747l812q014r20Q198
11159I9115O317P10P253j283R82k150j2559P657K0848m812n541r818K204P271
11145A16194j1993m782n893j2334O12p546k917J2286J8146j2732n237P684J0525
11132A02013p508j0580Q809l909o313K991N710l007K843n562p968j0218j0481
$$ plain form
11119 56820 59552 67373 70643 69403 79087 77351 67597 71110 71086 67833 72354 70832 61813 60964 65913
11104 65913 59628 59708 57095 67337 73979 64893 53070 49617 46304 45784 54368 58135 60498 59931 68729
11089 68729 75740 67037 56654 71159 70893 64489 61665 56597 44572 50100 62193 67871 66566 69414
11075 69414 71968 63384 73009 70285 75329 78678 77877 86280 85412 79821 72657 71246 50791 40006
11061 40006 55260 67865 71125 69646 66830 68418 74059 60994 62210 73929 76950 80016 86050
11048 86050 64907 51742 51601 53842 51004 57897 73056 68138 68986 74097 68603 77854 84491 87894
11034 87894 87875 91194 73600 65655 63890 74182 72968 78030 90942 104876 114597 124226 122679 114762
11020 114762 111944 103382 100371 109552 111536 95383 87112 79616 75934 68507 82689 89285 92162 95632
$$ packed form
11119E6820K732P821L270j240R684j736r754L513k4l253M521j522r019q49M949
11104F5913o285Q0k613J0242O642r086j1823l453l313n20Q584L767K363n67Q798
11089F8729P011q703j0383J4505k66o404k824n068j2025N528J2093N678j305K848
11075F9414K554q584R625k724N044L349q01Q403q68n591p164j411k0455j0785
11061D0006J5254J2605L260j479k816J588N641j3065J216J1719L021L066O034
11048H6050k1143j3165j41K241k838O893J5159m918Q48N111n494R251O637L403
11034H7894j9L319j7594p945j765J0292j214N062J2912J3934R721R629j547p917
11020A14762k818q562l011R181J984j6153q271p496l682p427J4182O596K877L470
$$ plain form
11006 95632 97902 88261 84392 99058 109008 122652 122018 97995 92531 103034 119120 124159 110602
10993 110602 107053 104918 111001 107868 94415 92243 97830 99196 107843 105392 94884 90598 96878 101796
10979 101796 103363 114035 135035 155733 157446 150994 149844 146237 143978 144114 151051 154806 153193 150926
10965 150926 138959 133343 143691 141122 145160 143418 147698 147209 142003 148876 162329 179270 178654 157715
10951 157715 159265 175821 200859 216026 227516 245099 254733 251169 256290 274528 288477 310938
10939 310938 322720 331910 374157 414955 449749 498790 547482 597448 645767 748462 901478
10928 901478 1100497 1391094 1781977 2203795 2563714 2811623 2827941 2577000 2144746 1701970
10918 1701970 1327158 1031316 809170 636362 515771 432016 381553 334837 295671 258887
$$ packed form
11006I5632K270r641l869J4666R950J3644o34k4023n464J0503J6086N039j3557
10993A10602l549k135O083l133j3453k172N587J366Q647k451j0508m286O280M918
10979A01796J567J0672K1000K0698J713o452j150l607k259J36O937L755j613k267
10965A50926j1967n616J0348k569M038j742M280m89n206O873J3453J6941o16k0939
10951A57715J550J6556K5038J5167J1490J7583R634l564N121J8238J3949K2461
10939C10938J1782R190M2247M0798L4794M9041M8692M9966M8319J02695J53016
10928I01478J99019K90597L90883M21818L59919K47909J6318k50941m32254m42776
10918A701970l74812k95842k22146j72808j20591q3755n0463m6716l9166l6784
$$ plain form
10908 258887 239839 226495 223341 213798 182048 159829 158280 157365 154310 162126 152840 145108 148765
10895 148765 160151 155710 142055 125766 137071 145001 155749 158240 154220 144276 140718 132105 128850
10882 128850 123321 139669 140731 134590 127069 126693 136506 155367 166953 164063 161975 168738 161704 160530
10868 160530 162710 151756 155540 154165 143396 131812 118230 117796 118070 115322 116382 123167 128819 129418
10854 129418 134177 123375 116871 115348 115929 109962 111400 106463 113213 108203 111625 127430 146328 149356
10840 149356 151722 157543 159342 155522 162080 179016 164305 154156 146165 153929 170430 168969 167163
10827 167163 167476 165785 159010 156059 166780 159044 143676 145138 151378 148893 146826 150554 150957 142467
10813 142467 148087 154080 150013 137150 136334 136001 138925 148051 156008 155751 165622 166555 180645 184921 175576
$$ packed form
10908B58887j9048j3344l154r543l1750k2219j549r15l055P816r286p732L657
10895A48765J1386m441j3655j6289J1305P930J0748K491m020r944l558q613l255
10882A28850n529J6348J062o141p521l76R813J8861J1586k890k088O763p034j174
10868A60530K180j0954L784j375j0769j1584j3582m34K74k748J060O785N652N99
10854A29418M759j0802o504j523N81n967J438m937O750n010L422J5805J8898L028
10840A49356K366N821J799l820O558J6936j4711j0149p991P764J6501j461j806
10827A67163L13j691o775k951J0721p736j5368J462O240k485k067L728M03q490
10813A42467N620N993m067j2863q16l33K924R126P957k57R871R33J4090M276r345
$$ plain form
10798 175576 172209 177489 167073 157985 161193 149169 147724 145582 137743 148918 151604 158836 151851
10785 151851 154635 161512 157894 132839 134867 141855 143726 151304 144870 149253 169532 186941 199833
10772 199833 188716 193537 197133 206807 237887 263603 291482 318848 342941 372293 391781 403420
10760 403420 415823 424351 423873 429500 429985 424285 420400 395559 368850 350414 333571 318012 309655
10747 309655 301939 288268 288434 296314 282851 279416 266644 260428 262275 257358 255116 269897 289928
10734 289928 288226 294428 307137 310703 316475 306812 307259 308098 315255 329433 343508 354448 350457 358848
10720 358848 362870 352277 366402 373687 364057 347543 334342 328805 354332 386703 395504 404907 408581
10707 408581 401576 407761 428485 440616 448560 439408 426636 422773 419160 407223 377650 342544 298688
$$ packed form
10798A75576l367N280j0416r088L208j2024j445k142p839J1175K686P232o985
10785A51851K784O877l618k5055K028O988J871P578o434M383K0279J7409J2892
10772A99833j1117M821L596R674L1080K5716K7879K7366K4093K9352J9488J1639
10760D03420J2403Q528m78N627M85n700l885k4841k6709j8436j6843j5559q357
10747C09655p716j3671J66P880j3463l435j2772o216J847m917k242J4781K0031
10734B89928j702O202J2709L566N772r663M47Q39P157J4178J4075J0940l991Q391
10720C58848M022j0593J4125P285r630j6514j3201n537K5527L2371Q801R403L674
10707D08581p005O185K0724J2131P944r152j2772l863l613j1937k9573l5106m3856
$$ plain form
10694 298688 271557 251895 246889 234866 219785 205891 219084 221616 233253 253792 261196 261092
10682 261092 269339 268645 264569 264152 266633 274846 274996 269529 276980 293391 295365 300763 302565 301653 313775
10667 313775 320225 327428 318605 295635 295308 278283 264436 266979 291314 318371 338771 360730 370577
10654 370577 373268 371744 358732 359238 356239 368701 391208 407024 420524 432561 431038 441294 460027
10641 460027 479019 505992 539459 573770 621335 681256 754546 836290 943882 1065388 1182461
10630 1182461 1282761 1342217 1345863 1324829 1270515 1202527 1136098 1072082 1006792 953806 909549
10619 909549 882099 875990 870584 850471 829175 832485 830713 816539 805153 808328 823042 829336 832430
10606 832430 841988 857566 877382 906144 943883 984345 1012797 1042471 1072927 1107097 1134826 1163715
$$ packed form
10694B98688k7131j9662n006j2023j5081j3894J3193K532J1637K0539P404j04
10682B61092Q247o94m076m17K481Q213J50n467P451J6411J974N398J802r12J2122
10667C13775O450P203q823k2970l27j7025j3847K543K4335K7057K0400K1959R847
10654C70577K691j524j3012N06k999J2462K2507J5816J3500J2037j523J0256J8733
10641D60027J8992K6973L3467L4311M7565N9921P3290Q1744J07592J21506J17073
10630A182461J00300N9456L646k1034n4314o7988o6429o4016o5290n2986m4257
10619I09549k7450o109n406k0113k1296L310j772j4174j1386L175J4714O294L094
10606H32430R558J5578J9816K8762L7739M0462K8452K9674L0456L4170K7729K8889
$$ plain form
10594 1163715 1182883 1196517 1221901 1233248 1258541 1299302 1331824 1370405 1429553 1498178 1555906
10583 1555906 1619462 1685185 1720885 1750823 1783701 1809508 1856049 1902539 1947876 1999067 2039291
10572 2039291 2084665 2131172 2186200 2232787 2289652 2362694 2432830 2493702 2582053 2667307 2763715
10561 2763715 2881433 3003913 3150657 3298774 3449902 3613186 3792499 3995799 4210239
10552 4210239 4435656 4690220 4973553 5272408 5604260 5975818 6381543 6824324 7307020
10543 7307020 7831257 8412756 9063970 9774282 10565861 11440341 12408665 13495239 14682610
10534 14682610 15936804 17260660 18664161 20175550 21809805 23509972 25306865 27286472
10526 27286472 29529967 32060421 34820051 37750433 40945149 44539690 48610963 53334421
$$ packed form
10594A163715J9168J3634K5384J1347K5293M0761L2522L8581N9148O8625N7728
10583A555906O3556O5723L5700K9938L2878K5807M6541M6490M5337N1191M0224
10572B039291M5374M6507N5028M6587N6865P3042P0136O0872Q8351Q5254R6408
10561B763715J17718J22480J46744J48117J51128J63284J79313K03300K14440
10552D210239K25417K54564K83333K98855L31852L71558M05725M42781M82696
10543G307020N24237N81499O51214P10312P91579Q74480R68324J086574J187371
10534A4682610J254194J323856J403501J511389J634255J700167J796893J979607
10526B7286472K243495K530454K759630K930382L194716L594541M071273M723458
$$ plain form
10518 53334421 58961935 65525536 72852427 80610401 88652729 98020963 111120547 131006292
10510 131006292 161527686 207780050 273928959 354770463 431982450 490766166 518430166
10503 518430166 497117282 429601648 346256335 269609249 205107436 154137301 116518970
10496 116518970 89586589 70275066 56136614 45519092 37421273 31197182 26456908
10489 26456908 22908952 20199944 18034787 16180140 14423983 12716482 11175307 9854677
10481 9854677 8741527 7805050 7039769 6405541 5879338 5424585 5013611 4674800 4388251
10472 4388251 4131428 3901695 3681410 3486969 3300763 3125677 2960580 2817911 2691827
10463 2691827 2575922 2461401 2369644 2266849 2162016 2053414 1963574 1888623 1811470 1733450
$$ packed form
10518E3334421N627514O563601P326891P757974Q042328R368234J3099584J9885745
10510A31006292L0521394M6252364O6148909Q0841504P7211987N8783716K7664000
10503E18430166k1312884o7515634q3345313p6647086o4501813n0970135l7618331
10496A16518970k6932381j9311523j4138452j0617522q097819o224091m740274
10489B6456908l547956k709008k165157j854647j756157j707501j541175j320630
10481I854677j113150r36477p65281o34228n26203m54753m10974l38811k86549
10472D388251k56823k29733k20285j94441j86206j75086j65097j42669j26084
10463B691827j15905j14521r1757j02795j04833j08602q9840p4951p7153p8020
$$ plain form
10453 1733450 1673423 1609459 1542791 1483052 1430761 1377011 1316269 1270957 1243481 1220567 1190850
10442 1190850 1154731 1115566 1083956 1058454 1027701 988974 979798 975958 975326 971439 974918 991045
10430 991045 1008673 1023534 1045660 1075469 1136152 1228980 1323900 1451509 1614052 1776505 1912110
10419 1912110 2038919 2099686 2095396 2025924 1907715 1744747 1554222 1395856 1266574 1144968
10409 1144968 1051959 977687 915808 875749 844995 821097 793606 757443 728514 718663 706652
10398 706652 679030 659955 639957 627434 622304 623423 644696 683623 731532 799931 902022 1010037
10386 1010037 1089600 1183798 1277903 1339367 1345647 1297803 1201788 1072553 933230 787652 671255
10375 671255 576598 522207 486812 456836 448171 430831 407237 393321 387515 367259 346125 330965
$$ packed form
10453A733450o0027o3964o6668n9739n2291n3750o0742m5312k7476k2914k9717
10442A190850l6119l9165l1610k5502l0753l8727r176l840o32l887L479J6127
10430I91045J7628J4861K2126K9809O0683R2828R4920J27609J62543J62453J35605
10419A912110J26809O0767m290o9472j18209j62968j90525j58366j29282j21606
10409A144968r3009p4272o1879m0059l0754k3898k7491l6163k8929r851j2011
10398G06652k7622j9075j9998j2523n130J119K1273L8927M7909O8399J02091J08015
10386A010037P9563R4198R4105O1464O280m7844r6015j29235j39323j45578j16397
10375F71255r4657n4391l5395k9976q665j7340k3594j3916n806k0256k1134j5160
$$ plain form
10363 330965 303252 278288 269375 262099 260706 264557 272376 262482 247386 234927 229432 215138 225738
10350 225738 256422 279273 287043 271866 258366 241070 212244 175511 141424 129739 138079 139065
10338 139065 129246 121298 113884 117099 114216 117361 130950 127086 109400 96495 99759 91597 87924
10325 87924 92031 100151 105010 102940 113071 131118 144525 141112 131868 139262 149064 121311 74417
10312 74417 15104 -27641 -52028 -83354 -112675 -130204 -126095 -125380 -126124 -133402 -141328 -142784 -124441
10299 -124441 -92740 -67155 -44114 -29933 -39162 -39982 -15891 -5132 -5171 -17562 -22353 -7655 -494
10286 -494 -6730 -13186 -658 -12294 -19779 -14914 -10172 -10453 -2089 8322 15027 10492 16440 34917
10272 34917 52390 43450 31375 31831 35006 43366 55501 62000 69358 76850 87207 90061 91551 111668
$$ packed form
10363C30965k7713k4964q913p276j393L851P819r894j5096j2459n495j4294J0600
10350B25738L0684K2851P770j5177j3500j7296k8826l6733l4087j1685Q340R86
10338A39065r819p948p414L215k883L145J3589l864j7686j2905L264q162l673
10325H7924M107Q120M859k070J0131J8047J3407l413r244P394R802k7753m6894
10312G4417n9313m2745k4387l1326k9321j7529M109P15p44p278p926j456J8343
10299a24441L1701K5585K3041J4181r229q20K4091J0759l9j2391m791J4698P161
10286d94o236o456J2528j1636p485M865M742k81Q364J0411O705m535N948J8477
10272C4917J7473q940j2075M56L175Q360J2135O499P358P492J0357K854J490K0117
$$ plain form
10258 111668 114136 99704 106087 102221 105729 91135 85287 82667 81452 65638 55054 56005 63904
10245 63904 65816 77379 85753 95764 91607 97145 115234 134273 140791 137556 126785 144576 171556
10232 171556 169491 160345 176279 193696 203693 190875 188684 189067 193683 206529 216123 251091 288987
10219 288987 302992 314832 324311 342210 369206 411182 440343 492202 570385 680026 807669
10208 807669 953031 1089108 1188107 1242708 1207154 1122459 1018324 918022 834591 777154 743882
10197 743882 730784 733149 749334 795869 837878 883781 946148 1001317 1082802 1160793 1241587 1343590
10185 1343590 1450850 1583005 1730557 1898410 2094892 2288241 2507099 2752866 3045860
10176 3045860 3382665 3779501 4293602 4991548 5928881 7144377 8657879 10420346 12258084
$$ packed form
10258A11668K468j4432O383l866L508j4594n848k620j215j5814j0584R51P899
10245F3904J912J1563Q374J0011m157N538J8089J9039O518l235j0771J7791K6980
10232A71556k065r146J5934J7417R997j2818k191L83M616J2846R594L4968L7896
10219B88987J4005J1840R479J7899K6996M1976K9161N1859P8183J09641J27643
10208H07669J45362J36077R8999N4601l5554q4695j04135j00302q3431n7437l3272
10197G43882j3098K365J6185M6535M2009M5903O2367N5169Q1485P7991Q0794J02003
10185A343590J07260J32155J47552J67853J96482J93349K18858K45767K92994
10176C045860L36805L96836N14101O97946R37333J215496J513502J762467J837738
$$ plain form
10167 12258084 13889150 14999620 15342715 14779177 13398922 11567706 9614842 7800135
10159 7800135 6232019 4985912 3996029 3221276 2641233 2182075 1838077 1573125 1362390
10150 1362390 1192041 1053129 946564 842041 743657 648778 577767 521382 465163 415508
10140 415508 363335 339987 325424 304320 283060 273915 259990 244833 239301 234209 214463 212706
10128 212706 192775 186596 183415 190812 190836 177075 173634 176422 163523 162603 171445 161698 149512 146891
10114 146891 159663 165677 174000 188544 192447 200535 218244 235667 256038 267929 279030 309636
10102 309636 353580 415870 479836 540405 573859 589294 608256 608990 596932 592154 590614 601860
10090 601860 613501 635112 657869 717062 818763 983226 1226274 1575990 1994315 2385664
$$ packed form
10167A2258084J631066J110470L43095n63538j380255j831216j952864j814707
10159G800135j568116j246107r89883p74753n80043m59158l43998k64952k10735
10150A362390j70349j38912j06565j04523r8384r4879p1011n6385n6219m9655
10140D15508n2173k3348j4563k1104k1260r145j3925j5157n532n092j9746j757
10128B12706j9931o179l181P397K4j3761l441K788j2899r20Q842r747j2186k621
10114A46891J2772O014Q323J4544L903Q088J7709J7423K0371J1891J1101L0606
10102C09636M3944O2290O3966O0569L3454J5435J8962P34j2058m778j540J1246
10090F01860J1641K1611K2757N9193J01701J64463K43048L49716M18325L91349
$$ plain form
10080 2385664 2667896 2773431 2632967 2265135 1818158 1413755 1080083 815360 621055
10071 621055 476267 373739 300021 250249 212184 175753 145728 132971 131784 127591 122080 95119
10059 95119 76252 65354 78300 71690 50788 53894 47619 28598 29444 38479 43316 42488 37025 29677
10045 29677 32115 29265 26743 21717 2930 -3569 -8548 3287 835 -9547 -945 7965 19469
10032 19469 32019 39208 40610 42028 57268 68254 61630 46278 43324 41236 35626 51235 71168
10019 71168 79242 88653 94329 105821 130053 133701 144894 147174 143956 156187 166888 149752 135194
10006 135194 125669 115760 113805 124853 116900 107550 100446 110376 111516 100566 96528 103073 116563
9993 116563 117538 133368 141475 143000 155564 179698 202169 224364 238919 280270 334328 404129
$$ packed form
10080B385664K82232J05535j40464l67832m46977m04403l33672k64723j94305
10071F21055j44788j02528p3718m9772l8065l6431l0025j2757j187m193n511k6961
10059I5119j8867j0898J2946o610k0902L106o275j9021Q46R035M837q28n463p348
10045B9677K438k850k522n026j8787o499m979J1835k452j0382Q602Q910J1504
10032A9469J2550P189J402J418J5240J0986o624j5352k954k088n610J5609J9933
10019G1168Q074R411N676J1492K4232L648J1193K280l218J2231J0701j7136j4558
10006A35194r525r909j955J1048p953r350p104R930J140j0950m038O545J3490
9993A16563R75J5830Q107J525J2564K4134K2471K2195J4555M1351N4058O9801
$$ plain form
9981 404129 483395 608183 765947 904979 1013374 1072409 1071851 985011 852901 705616 565935
9970 565935 441731 347414 285831 239221 198544 161521 131798 106295 88057 74582 67461 69878
9958 69878 70328 64886 58227 49448 44535 42215 22274 14443 11455 14027 8255 4396 -10007 -8917
9944 -8917 -914 3137 7001 6809 680 8786 23936 25684 20244 712 -2188 5897 5880 8971 5989
9929 5989 814 4565 5460 16782 15825 19236 252 -7135 11819 9177 13135 13609 7907 17552 13913
9914 13913 16966 12730 15460 13433 8875 7188 14100 3561 -5209 10096 12515 7781 -355 -476
9900 -476 -8986 -760 -3636 -118 -5334 -4479 -994 -1592 -2318 3309 14031 21999 17996 7439 2805
9885 2805 4945 1232 2296 9051 5139 4948 9009 5059 8503 2434 6569 16786 22970 11781 10009
$$ packed form
9981D04129P9266J24788J57764J39032J08395N9035n58q6840j32110j47285j39681
9970E65935j24204r4317o1583m6610m0677l7023k9723k5503j8238j3475p121K417
9958F9878M50n442o659q779m913k320j9941p831k988K572n772l859j4403J090
9944h917Q003M051L864j92o129Q106J5150J748n440j9532k900Q085j7L091k982
9929E989n175L751Q95J1322r57L411j8984p387J8954k642L958M74n702R645l639
9914A3913L053m236K730k027m558j687O912j0539q770J5305K419m734q136j21
9900d76q510Q226k876L518n216Q55L485n98p26N627J0722P968m003j0557m634
9885B805K140l713J064O755l912j91M061l950L444o069M135J0217O184j1189j772
$$ plain form
9870 10009 -6903 -7287 7435 -794 -14790 -17779 -9193 -3968 -6893 1622 7458 5651 2414 3396
9856 3396 9591 13767 -503 -9152 -6422 1550 -801 7287 5195 9963 -3227 -11772 -5866 -11171
9842 -11171 1123 10747 9330 8298 6257 240 -1246 -3602 -9984 -6978 8693 14512 9343 10508
9828 10508 5681 12869 18637 19290 -1840 -9377 3678 15872 20192 20602 17540 19369 18937 17074 17938
9813 17938 13237 2484 14953 19234 17458 18750 13700 127 11517 14566 17182 10959 -4786
9800 -4786 4764 9811 15679 17384 9982 18665 24979 17852 1479 -6776 -8394 -14640 -14800 -6611 6462
9785 6462 13067 6797 8485 12965 1493 -4646 6312 22640 19426 4946 2270 14155 29585
9772 29585 28171 9277 11374 15220 18678 13485 25171 41108 53289 51158 45828 39542 20910
$$ packed form
9870A0009j6912l84J4722q229j3996k989Q586N225k925Q515N836j807l237R82
9856C396O195M176j4270q649K730P972k351Q088k092M768j3190q545N906n305
9842a1171J2294R624j417j032k041o017j486k356o382L006J5671N819n169J165
9828A0508m827P188N768O53k1130p537J3055J2194M320M10l062J829m32j863Q64
9813A7938m701j0753J2469M281j776J292n050j3573J1390L049K616o223j5745
9800d786R550N047N868J705p402Q683O314p127j6373q255j618o246j60Q189J3073
9785F462O605o270J688M480j1472o139J0958J6328l214j4480k676J1885J5430
9772B9585j414j8894K097L846L458n193J1686J5937J2181k131n330o286j8632
$$ plain form
9759 20910 19312 15937 11072 5250 -853 -1948 9679 25001 27691 37045 45926 48151 59897 55290
9745 55290 52401 65906 83908 86366 75288 67457 70845 73762 75627 74719 57621 46269 38242 28172
9731 28172 28661 40165 31529 29923 31943 40653 47535 56543 54990 46202 34171 11267 1993 -2802
9717 -2802 -355 -563 14286 18417 19585 6778 524 5161 11643 16934 21784 31559 31062 25459 11886
9702 11886 19312 17196 3725 -3777 5902 12434 14909 10364 11363 11168 15547 16673 29253 37675 31493
9687 31493 22386 27363 33145 25290 25494 30017 36949 39885 36489 37822 32059 17396 13966 28212
9673 28212 30986 26479 15603 5896 -6883 -3042 -2230 -1502 4391 1713 5846 4887 8674 5771 9960
9658 9960 3447 3673 29225 29526 26737 26631 21526 16931 16277 24652 20747 6005 8160 10168 10128 22731
$$ packed form
9759B0910j598l375m865n822o103j095J1627J5322K690R354Q881K225J1746m607
9745E5290k889J3505J8002K458j1078p831L388K917J865r08j7098j1352q027j0070
9731B8172M89J1504q636j606K020Q710O882R008j553q788j2031k2904r274m795
9717b802K447k08J4849M131J168j2807o254M637O482N291M850R775m97n603j3573
9702A1886P426k116j3471p502R679O532K475m545R99j95M379J126J2580Q422o182
9687C1493r107M977N782p855K04M523O932K936l396J333n763j4663l430J4246
9673B8212K774m507j0876r707j2779L841Q12P28N893k678M133r59L787k903M189
9658I960o513K26K5552L01k789j06n105m595o54Q375l905j4742K155K008m0J2603
$$ plain form
9642 22731 34707 33643 28449 19108 19163 13459 12610 24444 17355 21132 20403 24993 22437 22252 26964
9627 26964 33050 23190 16131 16907 15445 16043 12555 8275 11554 30927 46199 39698 30360 18039
9613 18039 18191 14636 12174 14778 15596 12973 11294 9092 12381 16482 21865 20558 25700 26630 11563
9598 11563 8293 18533 16152 11279 15045 23945 13976 23335 29487 26804 23173 26183 13136 11223
9584 11223 -1097 -5585 -7542 -2135 13692 21934 23152 23475 23489 27042 27887 31772 34269 27167 34458
9569 34458 26127 26354 25889 30473 27480 23048 28376 40958 38659 31733 24185 8728 1170 -759 1503
9554 1503 13289 25949 35023 40828 32377 18181 16902 25529 31731 28910 26746 26653 28589 32524 27560
9539 27560 25993 27505 20187 18543 28681 29704 24866 35656 40852 45771 49902 51288 47753 39362
$$ packed form
9642B2731J1976j064n194r341N5n704q49J1834p089L777p29M590k556j85M712
9627B6964O086r860p059P76j462N98l488m280L279J9373J5272o501r338j2321
9613A8039J52l555k462K604Q18k623j679k202L289M101N383j307N142R30j5067
9598A1563l270J0240k381m873L766Q900r969R359O152k683l631L010j3047j913
9584A1223j2320m488j957N407J5827Q242J218L23J4L553Q45L885K497p102P291
9569C4458q331K27m65M584k993m432N328J2582k299o926p548j5457p558j929K262
9554A503J1786J2660R074N805q451j4196j279Q627O202k821k164r3J936L935m964
9539B7560j567J512p318j644J0138J023m838J0790N196M919M131J386l535q391
$$ plain form
9525 39362 38517 39188 42625 31624 24772 25682 31305 29727 9302 5192 8725 2576 12321 21567 27637
9510 27637 35399 36515 42624 37954 36297 33498 49213 59022 49784 43848 40698 38433 26304 21447
9496 21447 30423 48680 57049 45574 45455 50153 45814 41756 37147 30207 26748 22532 28509 40466
9482 40466 49364 54604 54643 58262 50642 63000 61754 62515 65034 46040 30444 27557 36145 39610 54353
9467 54353 56659 44277 44406 44700 47271 52454 56950 55070 53678 43574 36451 47205 58107 60749
9453 60749 53339 51139 55455 39870 47309 51479 43523 39699 40939 37358 36539 34589 28295 26011 19015
9438 19015 14128 13712 18940 28845 33123 34780 34636 29124 24216 33348 37362 51586 41255 39605 37179
9423 37179 34488 21315 20825 44896 46632 35483 22161 23684 22723 28371 46935 57332 61070 48143
$$ packed form
9525C9362q45O71L437j1001o852R10N623j578k0425m110L533o149R745R246O070
9510B7637P762J116O109m670j657k799J5715R809r238n936l150k265j2129m857
9496B1447Q976J8257Q369j1475j19M698m339m058m609o940l459m216N977J1957
9482D0466Q898N240L9L619p620J2358j246P61K519j8994j5596k887Q588L465J4743
9467E4353K306j2382J29K94K571N183M496j880j392j0104p123J0754J0902K642
9453F0749p410k200M316j5585P439M170p956l824J240l581q19j950o294k284o996
9438A9015m887m16N228R905M278J657j44n512m908R132M014J4224j0331j650k426
9423C7179k691j3173m90K4071J736j1149j3322J523r61N648J8564J0397L738j2927
$$ plain form
9409 48143 46566 51426 53660 49009 43201 34023 42769 58923 52284 42010 40850 49343 56822 63200
9395 63200 69274 66142 53422 46149 30165 30932 26061 30086 35208 29422 19347 19216 35762 41683
9381 41683 48237 57625 65893 67357 60117 41414 43111 41001 40921 46346 54147 39193 27074 17209
9367 17209 19901 35626 34365 51115 69774 67481 64215 53571 44932 58577 66355 69304 65775
9354 65775 47870 45136 57097 58523 45161 41467 32863 39923 47169 51116 58042 62027 58178 60886
9340 60886 53254 56749 58062 71703 73099 71964 76580 70570 65585 74273 76459 81232 75611 64201
9326 64201 66494 62478 61797 62032 62233 65108 61585 68619 68318 60663 56628 49542 41668 45060 46653 49569
9310 49569 52698 56838 61312 60567 56086 61010 64646 78223 80586 72695 63238 52996 52839 63056
$$ packed form
9409D8143j577M860K234m651n808r178Q746J6154o639j0274j160Q493P479O378
9395F3200O074l132j2720p273j5984P67m871M025N122n786j0075j31J6546N921
9381D1683O554R388Q268J464p240j8703J697k110q0N425P801j4954j2119r865
9367A7209K692J5725j261J6750J8659k293l266j0644q639J3645P778K949l529
9354F5775j7905k734J1961J426j3362l694q604P060P246L947O926L985l849K708
9340F0886p632L495J313J3641J396j135M616o010m985Q688K186M773n621j1410
9326F4201K293m016o81K35K01K875l523P034l01p655m035p086p874L392J593K916
9310D9569L129M140M474p45m481M924L636J3577K363p891r457j0242j57J0217
$$ plain form
9296 63056 72267 63861 81680 77988 66558 60747 72744 75591 76610 77680 84981 83093 84443 86045
9282 86045 76453 71453 70752 86150 76437 69139 66818 67774 58451 52335 55942 58468 61409 70799 66254
9267 66254 71211 67696 59750 59016 61062 72204 81039 81824 90521 93848 81193 82541 81818 71089 71129
9252 71129 76532 77696 71144 78357 85150 88644 87015 92581 96114 88712 80651 89112 107612 115455
9238 115455 117391 101476 91576 82457 80411 85079 97951 93821 72191 73508 82756 79589 86663 97189
9224 97189 89974 93084 105713 113512 102783 90583 108620 120786 127663 121604 115256 111067 115444
9211 115444 118062 110612 114201 109224 114941 120731 120712 128698 129941 130604 129672 127600 121750 114470 104359
9196 104359 93791 90678 99882 96515 77979 83840 82465 106976 115356 108174 94923 104677 117623
$$ packed form
9296F3056R211q406J7819l692j1430n811J1997K847J019J070P301j888J350J602
9282H6045r592n000p01J5398r713p298k321R56r323o116L607K526K941R390m545
9267F6254M957l515p946p34K046J1142Q835P85Q697L327j2655J348p23j0729M0
9252G1129N403J164o552P213O793L494j629N566L533p402q061Q461J8500P843
9238A15455J936j5915r900r119k046M668J2872m130k1630J317R248l167P074J0526
9224I7189p215L110J2629P799j0729j2200J8037J2166O877o059o348m189M377
9211A15444K618p450L589m977N717N790j9P986J243O63r32k072n850p280j0111
9196A04359j0568l113R204l367j8536N861j375K4511Q380p182j3251R754J2946
$$ plain form
9183 117623 129313 137708 143332 138127 133647 115553 102073 86429 94556 97057 95334 102555 105145
9170 105145 108122 109994 114504 108621 106866 111699 115697 101105 106536 112400 101042 89936 110481
9157 110481 114125 112051 119606 120048 126937 130378 128756 123371 121204 122334 128267 118666 115767 118528 128246
9142 128246 132661 116681 104234 101028 114609 134637 134489 125291 120941 118875 112573 112092 116350 119591
9128 119591 114330 114868 118314 122675 129581 139714 151382 142983 135891 126829 140969 152409 150816 149288
9114 149288 134458 134751 134619 124943 120939 124129 118215 131347 138066 151326 165239 177138 164418
9101 164418 168624 170535 169221 166113 159572 149077 150964 163799 167108 151829 150669 146407 153972 163488
9087 163488 156160 160674 161770 158765 165503 186728 195235 197021 201207 202242 201806 186382 172290 162765
$$ packed form
9183A17623J1690Q395N624n205m480j8094j3480j5644Q127K501j723P221K590
9170A05145K977J872M510n883j755M833L998j4592N431N864j1358j1106K0545
9157A10481L644k074P555M42O889L441j622n385k167J130N933r601k899K761R718
9142A28246M415j5980j2447l206J3581K0028j48r198m350k066o302m81M258L241
9128A19591n261N38L446M361O906J0133J1668q399p092r062J4140J1440j593j528
9114A49288j4830K93j32r676m004L190n914J3132O719J3260J3913J1899j2720
9101A64418M206J911j314l108o541j0495J887J2835L309j5279j160m262P565R516
9087A63488p328M514J096l005O738K1225Q507J786M186J035m36j5424j4092r525
$$ plain form
9073 162765 174902 182615 185120 186662 185714 174755 163141 164300 166347 180245 188769 186613 178600 190303
9059 190303 202483 200780 191325 185252 185960 185731 194204 200877 205199 212317 210072 203528 197726 192466 196049
9044 196049 187008 182743 199738 202279 205467 205931 207085 195950 196946 213326 225215 225789 231448 223782
9030 223782 224342 223916 221599 238632 232558 224733 223906 229220 231496 241562 247272 247507 256739 257458 247129
9015 247129 252993 255302 249592 256358 267375 268900 264421 268868 268838 266365 267698 278854 279826 285707 287664
9000 287664 285963 290555 298535 302689 291080 289998 288357 299714 311333 315982 314387 318177 318308 313462
8986 313462 316721 323028 328792 343501 348999 341617 331623 332241 343392 342604 339807 336532 330768 322693
8972 322693 335178 360683 359348 350947 365622 377561 385259 391084 390596 382410 379877 377343 381061 369135
$$ packed form
9073A62765J2137P713K505J542r48j0959j1614J159K047J3898Q524k156q013J1703
9059A90303J2180j703r455o073P08k29Q473O673M322P118k245o544n802n260L583
9044A96049r041m265J6995K541L188M64J154j1135R96J6380J1889N74N659p666
9030B23782N60m26k317J7033o074p825q27N314K276J0066N710K35R232P19j0329
9015B47129N864K309n710O766J1017J525m479M447l0k473J333J1156R72N881J957
9000B87664j701M592P980M154j1609j082j641J1357J1619M649j595L790J31m846
8986C13462L259O307N764J4709N498p382r994O18J1151p88k797l275n764q075
8972C22693J2485K5505j335q401J4675J1939P698N825m88q186k533k534L718j1926
$$ plain form
8958 369135 374791 407486 421553 421881 419594 425682 439944 437349 441370 441382 442012 452590 458621 443448
8944 443448 428282 428527 435182 439780 443515 453707 452884 454966 454046 472305 474697 478085 481206 482980
8930 482980 489280 478502 470958 484667 486366 490499 490134 490847 500910 502851 498511 502380 498888 490274
8916 490274 499131 515397 521178 524996 536368 532519 530682 544364 553340 555892 563616 579182 590951
8903 590951 593771 597224 608344 607894 604335 598232 596059 613148 634865 642435 652525 658231 671334
8890 671334 682460 687213 688155 668450 667098 691341 718301 731864 739753 742628 761908 788954 806358
8877 806358 818191 821658 827625 835910 842899 869848 878864 891945 913381 922336 940870 966850 989729
8864 989729 992252 1005014 1010389 1026011 1065625 1100692 1113858 1128495 1125297 1133249 1147758 1162837
$$ packed form
8958C69135N656L2695J4067L28k287O088J4262k595M021J2O30J0578O031j5173
8944D43448j5166K45O655M598L735J0192q23K082r20J8259K392L388L121J774
8930D82980O300j0778p544J3709J699M133l65P13J0063J941m340L869l492q614
8916D90274Q857J6266N781L818J1372l849j837J3682Q976K552P724J5566J1769
8903E90951K820L453J1120m50l559o103k173J7089K1717P570J0090N706J3103
8890F71334J1126M753R42j9705j352K4243K6960J3563P889K875J9280K7046J7404
8877H06358J1833L467N967Q285O989K6949R016J3081K1436Q955J8534K5980K2879
8864I89729K523J2762N375J5622L9614L5067J3166J4637l198P952J4509J5079
$$ plain form
8852 1162837 1184835 1209523 1234619 1243628 1252392 1257412 1282531 1319390 1332112 1344033 1367424 1380309
8840 1380309 1395017 1420785 1448255 1459761 1488051 1529800 1563470 1598779 1624708 1633817 1659432 1702840
8828 1702840 1751432 1776436 1823924 1879704 1925216 1964607 2006472 2043164 2086224 2142506 2185589
8817 2185589 2224218 2281199 2342382 2410398 2467788 2527816 2590055 2651435 2703745 2761106 2830001
8806 2830001 2903986 2994295 3073252 3147766 3237642 3334419 3427996 3533604 3647480 3763683 3872757
8795 3872757 3997126 4128395 4267186 4410423 4574967 4747972 4903150 5079337 5269931 5467943
8785 5467943 5675996 5888942 6105892 6329787 6569326 6847174 7125825 7411986 7717054 8039541
8775 8039541 8385057 8748366 9137394 9549913 9981534 10445543 10943468 11456723 11999679 12576653
$$ packed form
8852A162837K1998K4688K5096R009Q764N020K5119L6859J2722J1921K3391J2885
8840A380309J4708K5768K7470J1506K8290M1749L3670L5309K5929R109K5615M3408
8828A702840M8592K5004M7488N5780M5512L9391M1865L6692M3060N6282M3083
8817B185589L8629N6981O1183O8016N7390O0028O2239O1380N2310N7361O8895
8806B830001P3985R0309P8957P4514Q9876R6777R3577J05608J13876J16203J09074
8795C872757J24369J31269J38791J43237J64544J73005J55178J76187J90594J98012
8785E467943K08053K12946K16950K23895K39539K77848K78651K86161L05068L22487
8775H039541L45516L63309L89028M12519M31621M64009M97925N13255N42956N76974
$$ plain form
8765 12576653 13199233 13864442 14564630 15302044 16080142 16893267 17750960 18665022 19620943
8756 19620943 20652043 21733945 22864576 24050958 25303540 26595215 27924454 29284114
8748 29284114 30663678 32046234 33425368 34775569 36084429 37318032 38449418 39439641
8740 39439641 40312098 41030444 41549532 41852005 41922435 41767844 41375075 40750639 39939059 38950295
8730 38950295 37788546 36515472 35159020 33694933 32174775 30651263 29130276 27613041
8722 27613041 26141592 24721521 23356610 22057485 20819100 19642849 18538278 17514938
8714 17514938 16553291 15649982 14796784 13991118 13236340 12546434 11904218 11311118 10761143
8705 10761143 10244776 9754356 9294267 8860363 8447723 8059675 7701697 7363176 7038403
$$ packed form
8765A2576653O22580O65209P00188P37414P78098Q13125Q57693R14062R55921
8756A9620943J031100J081902J130631J186382J252582J291675J329239J359660
8748B9284114J379564J382556J379134J350201J308860J233603J131386R90223
8740C9439641Q72457P18346N19088L02473P0430j54591l92769o24436q11580r88764
8730C8950295j161749j273074j356452j464087j520158j523512j520987j517235
8722B7613041j471449j420071j364911j299125j238385j176251j104571j023340
8714A7514938r61647r03309q53198q05666p54778o89906o42216n93100n49975
8705A0761143n16367m90420m60089m33904m12640l88048l57978l38521l24773
$$ plain form
8696 7038403 6742756 6482288 6223293 5972576 5749547 5544747 5344455 5139109 4951027 4767335
8686 4767335 4599321 4437776 4266539 4118189 3984853 3842233 3724352 3618860 3505269 3388746
8676 3388746 3283105 3181120 3093309 3015071 2933683 2845621 2761900 2671347 2579481 2499585 2447076
8665 2447076 2389061 2315929 2256148 2208525 2159959 2101592 2048443 2002735 1949934 1910789 1872712
8654 1872712 1820420 1778982 1741694 1704196 1666849 1622147 1588406 1552819 1520610 1491386 1459509
8643 1459509 1431037 1374670 1331986 1315138 1295005 1273718 1256918 1239675 1225628 1210567 1183099
8632 1183099 1161172 1146149 1128180 1093743 1068447 1055308 1043568 1023904 1023091 1001674 988520 963323
8620 963323 934579 920392 891888 877808 866798 856853 853547 843950 830634 817369 798119 779151
$$ packed form
8696G038403k95647k60468k58995k50717k23029k04800k00292k05346j88082j83692
8686D767335j68014j61545j71237j48350j33336j42620j17881j05492j13591j16523
8676C388746j05641j01985q7811p8238q1388q8062q3721r0553r1866p9896n2509
8665B447076n8015p3132n9781m7623m8566n8367n3149m5708n2801l9145l8077
8654A872712n2292m1438l7288l7498l7347m4702l3741l5587l2209k9224l1877
8643A459509k8472n6367m2684j6848k0133k1287j6800j7243j4047j5061k7468
8632A183099k1927j5023j7969l4437k5296j3139j1740j9664q13k1417j3154k5197
8620I63323k8744j4187k8504j4080j1010r945l306r597j3316j3265j9250j8968
$$ plain form
8608 779151 757174 733433 728476 724806 707014 700128 684567 662225 655516 650445 647858 648230 645406
8595 645406 628248 609978 596139 590907 588850 570200 551663 546590 546667 545232 520400 514509 515393 496508
8581 496508 485161 483363 494123 509119 513094 492480 484815 473909 457106 464052 451989 430448
8569 430448 421991 422201 413352 404696 397561 381633 381069 386838 387870 394358 383794 357493 346649 342416
8555 342416 356933 359087 358555 353111 345011 338812 332290 319650 297416 280875 270867 266091 258209
8542 258209 267900 272456 257194 250394 254807 260106 252336 251297 256690 262607 237797 234290 223461 218240
8528 218240 221899 225662 235472 236429 230619 232287 239061 249464 237886 227497 226820 231793 235227 222658
8514 222658 206506 197591 196316 203140 203883 197766 196680 205868 200933 192940 199441 206802 205342 215905
$$ packed form
8608G79151k1977k3741m957l670j7792o886j5561k2342o709n071k587L72k824
8595F45406j7158j8270j3839n232k057j8650j8537n073P7j435k4832n891Q84j8885
8581D96508j1347j798J0760J4996L975k0614p665j0906j6803O946j2063k1541
8569D30448q457K10q849q656p135j5928n64N769J032O488j0564k6301j0844m233
8555C42416J4517K154n32n444q100o199o522j2640k2234j6541j0008m776p882
8542B58209R691M556j5262o800M413N299p770j039N393N917k4810l507j0829n221
8528B18240L659L763R810R57n810J668O774J0403j1578j0389o77M973L434j2569
8514B22658j6152q915j275O824P43o117j086R188m935p993O501P361j460J0563
$$ plain form
8500 215905 211327 198231 190761 195415 197810 201309 196870 186828 170778 173145 175816 182459 178239 171304
8486 171304 175776 179407 184119 190725 189333 181579 171266 173334 172611 162354 158393 162824 164898 157198
8472 157198 146151 142606 145587 135820 134089 139797 140305 149307 148730 144895 155683 178223 179325 166168
8458 166168 158926 140735 137078 124344 102545 102112 111345 101870 100849 93357 79504 81957 83039 92875
8444 92875 96785 96349 104358 106818 107428 112421 114621 109466 96790 98674 100946 102548 105590 112563 111026
8429 111026 104612 102213 89029 87296 99709 89354 78685 80508 87000 93855 97390 105456 108335
8416 108335 98848 89370 103877 100525 93608 84073 87859 88578 92831 91380 85431 82458 76215 58355
8402 58355 56583 63725 81226 84834 73739 61604 62341 60045 56790 59389 68344 81626 86578 81845
$$ packed form
8500B15905m578j3096p470M654K395L499m439j0042j6050K367K671O643m220o935
8486A71304M472L631M712O606j392p754j0313K068p23j0257l961M431K074p700
8472A57198j1047l545K981r767j731N708N08R002n77l835J0788K2540J102j3157
8458A66168p242j8191l657j2734k1799m33R233r475j021p492j3853K453J082R836
8444I2875L910m36Q009K460O10M993K200n155j2676J884K272J602L042O973j537
8429A11026o414k399j3184j733J2413j0355j0669J823O492O855L535Q066K879
8416A08335r487r478J4507l352o917r535L786P19M253j451n949k973o243j7860
8402E8355j772P142J7501L608j1095j2135P37k296l255K599Q955J3282M952m733
$$ plain form
8388 81845 79697 72950 77342 71284 70227 68437 66900 68182 66182 76092 76577 68141 70000 64455 51995
8373 51995 61585 70093 75834 74282 67551 53862 38183 34993 45675 60014 57144 53622 49382 40719
8359 40719 32850 37683 42703 47472 46986 41566 30055 23623 33393 41764 39673 44713 55105 57208
8345 57208 61579 58132 56234 53162 46467 35720 37455 49932 56057 56525 56396 51214 57577 67953
8331 67953 63565 54242 39526 39589 39491 24206 13056 22826 30406 44134 41534 43733 41083 50361 48064
8316 48064 28828 21649 32059 34287 33598 25320 13746 29595 43262 40548 43230 47622 61354
8303 61354 65977 52565 47572 39522 42788 33919 39267 44460 49845 54236 47770 60805 51394 52255
8289 52255 63790 65345 64436 60129 51137 28142 14662 30523 22784 12120 17703 28096 39923
$$ packed form
8388H1845k148o747M392o058j057j790j537J282k000R910M85q436J859n545j2460
8373E1995R590Q508N741j552o731j3689j5679l190J0682J4339k870l522m240q663
8359D0719p869M833N020M769m86n420j1511o432R770Q371k091N040J0392K103
8345E7208M371l447j898l072o695j0747J735J2477O125M68j29n182O363J0376
8331F7953m388r323j4716O3r8j5285j1150R770P580J3728k600K199k650R278k297
8316D8064j9236p179J0410K228o89q278j1574J5849J3667k714K682M392J3732
8303F1354M623j3412m993q050L266q869N348N193N385M391o466J3035r411Q61
8289E2255J1535J555r09m307q992k2995j3480J5861p739j0664N583J0393J1827
$$ plain form
8276 39923 41082 34752 22742 25408 28242 29180 24391 34281 37800 29236 34911 2732 1114 12273
8262 12273 25431 24251 20338 30964 40810 33834 20046 17813 7159 16299 24282 12312 6638
8249 6638 13655 28518 30614 32018 25208 22469 14486 4092 5138 19755 15566 7812 3918 13587
8235 13587 25260 30367 26638 26820 25324 24920 37019 33853 22522 12478 22443 21387 24552 31026
8221 31026 25421 10071 17484 16429 7896 9585 4392 786 13396 20968 20798 19618 25718 31057
8207 31057 32264 31104 20147 30459 37870 43540 46410 31737 21488 18584 11672 25244 41801
8194 41801 38466 27085 21324 17800 23203 25426 18106 25583 21466 22434 45267 52658 29957 12117
8180 12117 9785 21575 26854 19261 9894 9679 1283 1249 10577 13168 10071 16829 25329 29315 20127
$$ packed form
8276C9923J159o330j2010K666K834R38m789R890L519q564N675l2179j618J1159
8262A2273J3158j180l913J0626R846o976j3788k233j0654R140P983j1970n674
8249F638P017J4863K096J404o810k739p983j0394J046J4617m189p754l894R669
8235A3587J1673N107l729J82j496m04J2099l166j1331j0044R965j056L165O474
8221C1026n605j5350P413j055q533J689n193l606J2610P572j70j180O100N339
8207C1057J207j160j0957J0312P411N670K870j4673j0249k904o912J3572J6557
8194D1801l335j1381n761l524N403K223p320P477m117R68K2833P391k2701j7840
8180A2117k332J1790N279p593r367k15q396l4R328K591l097O758Q500L986r188
$$ plain form
8165 20127 25389 23729 23979 25609 20197 24520 23503 18499 10482 9984 15372 27791 50643 67648
8151 67648 69753 57599 44646 40357 47859 43043 36274 31241 35094 38086 34745 23009 39803 45559
8137 45559 52859 50570 53897 34737 32019 32381 44182 45525 57165 50496 48120 65244 73747 64942
8123 64942 58064 66574 65316 57940 54231 58832 63159 54700 56311 60638 44087 41584 33405 23953
8109 23953 27299 51653 58282 53800 49220 52273 58106 68904 71755 68349 52190 59222 70123 66601
8095 66601 79591 76857 74006 79738 78076 86836 114330 144798 147247 145370 155927 152880 158946 166300
8081 166300 156460 160194 160868 165189 158652 147573 136435 129533 123558 125850 124673 114928 101635 91062
8067 91062 86674 73954 72487 77914 78408 86408 81031 80706 86916 99250 92055 83583 79189 80265 77598
$$ packed form
8165B0127N262j660K50J630n412M323j017n004q017m98N388J2419K2852J7005
8151F7648K105j2154j2953m289P502m816o769n033L853K992l341j1736J6794N756
8137D5559P300k289L327j9160k718L62J1801J343J1640o669k376J7124Q503q805
8123F4942o878Q510j258p376l709M601M327q459J611M327j6551k503q179r452
8109B3953L346K4354O629m482m580L053N833J0798K851l406j6159P032J0901l522
8095F6601J2990k734k851N732j662Q760K7494L0468K449j877J0557l047O066P354
8081A66300r840L734O74M321o537j1079j1138o902n975K292j177r745j3293j0573
8067I1062m388j2720j467N427M94Q000n377l25O210J2334p195q472m394J076k667
$$ plain form
8052 77598 69451 70483 77850 92430 113164 128785 125358 138383 167542 186620 207430 230990 234666
8039 234666 221677 215777 218500 202289 191949 184624 186081 168193 141099 121432 129344 125992 104976
8026 104976 94413 97810 95845 91040 87178 91182 90320 68412 42748 43916 54085 56606 63962 66729
8012 66729 58396 47463 49488 46395 46199 46362 51989 47661 44815 53586 70540 75305 66746 73767 81641
7997 81641 88917 103457 88727 75551 66354 68586 73426 75311 77607 81820 66751 58694 46436
7984 46436 33401 33617 28302 30342 27805 20685 20491 26977 27869 28027 45123 53533 48364 42248 39999
7969 39999 49118 49090 37453 25340 9967 13284 10355 13111 21127 32805 30228 17291 16187 32878
7955 32878 45583 35695 37516 46403 44759 35543 40781 35562 39274 40832 47426 51944 27363 17418
$$ packed form
8052G7598q147J032P367J4580K0734J5621l427J3025K9159J9078K0810K3560L676
8039B34666j2989n900K723j6211j0340p325J457j7888k7094j9667P912l352k1016
8026A04976j0563L397j965m805l862M004q62k1908k5664J168J0169K521P356K767
8012F6729q333j0933K025l093j96J63N627m328k846Q771J6954M765q559P021P874
7997H1641P276J4540j4730j3176r197K232M840J885K296M213j5069q057j2258
7984D6436j3035K16n315K040k537p120j94O486Q92J58J7096Q410n169o116k249
7969C9999R119k8j1637j2113j5373L317k929K756Q016J1678k577j2937j104J6691
7955C2878J2705r888J821Q887j644r216N238n219L712J558O594M518k4581r945
$$ plain form
7941 17418 20977 19164 16343 4475 5785 4958 -5524 4648 12691 1447 -10724 -12664 8948
7928 8948 18652 18316 13429 14335 3549 2996 11921 18124 13930 -17499 -14236 -2247 5440 15155 22498
7913 22498 24454 32876 38887 36782 41653 33330 25770 20717 23288 17749 25222 17349 10365 11701 26690
7898 26690 33090 26639 21062 23972 17097 -1417 -3180 -11423 -21886 -13138 -14559 -25474 -24384 -8534
7884 -8534 9741 22602 35231 38100 23017 6622 5417 -114 -10265 -6029 -5483 -9883 -6683 -18506
7870 -18506 -28387 -13651 -5654 -15253 -17266 -20281 -21774 -22166 -26050 -22484 -15470 -11272 -9784 -8316 -15102
7855 -15102 -10220 3436 21031 10618 -5614 1885 -3004 -11075 -10752 1640 9024 12654 13100 20025
7841 20025 36602 34093 11354 2183 -6418 -6014 3390 4191 1774 -12252 -3284 891 -1455 -1138 -5461
$$ packed form
7941A7418L559j813k821j1868J310q27j0482J0172Q043j1244j2171j940K1612
7928H948R704l36m887R06j0786n53Q925O203m194l1429L263J1989P687R715P343
7913B2498J956Q422O011k105M871q323p560n053K571n539P473p873o984J336J4989
7898B6690O400o451n577K910o875j8514j763q243j0463Q748j421j0915J090J5850
7884h534J8275J2861J2629K869j5083j6395j205n531j0151M236N46m400L200j1823
7870a8506r881J4736P997r599k013l015j493l92l884L566P014M198J488J468o786
7855a5102M882J3656J7595j0413j6232P499m889q071L23J2392P384L630M46O925
7841B0025J6577k509k2739r171q601M04R404Q01k417j4026Q968M175k346L17m323
$$ plain form
7826 -5461 -13278 -3104 10767 974 -7293 -8227 -9204 -8534 967 2393 -1550 -11849 -22087 -26068 -20885
7811 -20885 -29903 -43423 -46254 -37455 -34246 -22273 -20542 -22214 -17014 -8684 -4980 -10163 -8821 -23160
7797 -23160 -24772 -27675 -26840 -8211 -12003 -12393 -18622 -20101 -15495 -16579 -22298 -14151 -10725 -4185 -704
7782 -704 -3873 -10911 -9100 759 -545 -17421 -21634 -5870 6437 878 -15670 -27354 -26582 -26237
7768 -26237 -23834 -15712 -15012 -18117 -17172 -25362 -13180 -6176 -14153 -18289 -17093 -15464 -11412 -7831 -6912
7753 -6912 -10620 -17759 -21801 -9414 -17769 -14031 -4528 -11649 -7148 -5091 -1409 -20464 -30640 -22853
7739 -22853 -12972 -3168 -15858 -31402 -32911 -20271 -28649 -38462 -30456 -23607 -17707 -21962 -26098 -31800
7725 -31800 -29733 -22323 -22822 -17391 -16790 -23324 -29027 -22802 -8069 3947 -7806 -18018 -8749 -16709
$$ packed form
7826e461p817J0174J3871r793q267r34r77O70R501J426l943j0299j0238l981N183
7811b0885r018j3520k831Q799L209J1973J731j672N200Q330L704n183J342j4339
7797b3160j612k903Q35J8629l792l90o229j479M606j084n719Q147L426O540L481
7782g04l169p038J811R859j304j6876m213J5764J2307n559j6548j1684P72L45
7768b6237K403Q122P00l105R45q190J2182P004p977m136J196J629M052L581R19
7753f912l708p139m042J2387q355L738R503p121M501K057L682j9055j0176P787
7739b2853R881R804j2690j5544j509J2640q378r813Q006O849N900m255m136n702
7725c1800K067P410m99N431O01o534n703O225J4733J2016j1753j0212R269p960
$$ plain form
7711 -16709 -15492 -10530 -6247 -4600 -6409 -6001 -17533 -18736 -12003 -893 904 -19337 -20840 -4866
7697 -4866 1187 -4705 -849 7245 113 -21434 -21709 -10664 800 -1770 -4783 -15204 -28799 -29830
7683 -29830 -20249 -15466 -14326 -12935 2836 8178 6708 2772 -5509 -9634 -9813 -6110 -14109 -17501 -13394
7668 -13394 -25163 -19635 -10614 -2863 4512 -5214 -10775 -22165 -25295 -18872 -10330 -6714 -7389 -22946
7654 -22946 -21962 -19594 -20463 -26531 -10422 10326 7491 1338 -20269 -22958 -13246 -8608 -14968 -19877
7640 -19877 -17072 -4241 -7721 -8857 -18021 -26105 -37139 -32073 -20013 -2611 8499 10510 11549
7627 11549 9264 -7989 -26188 -31654 -20734 -19392 -13541 -15198 -15802 -17700 -14749 -20764 -22931 -27625
7613 -27625 -13666 -10958 -25273 -27382 -18411 -5597 -5054 -14524 -12487 -2322 3824 -7294 -23666
$$ packed form
7711a6709J217M962M283J647j809M08j1532j203O733J1110J797k0241j503J5974
7697d866O053n892L856Q094p132k1547k75J1045J1464k570l013j0421j3595j031
7683b9830R581M783J140J391J5771N342j470l936q281m125j79L703p999l392M107
7668a3394j1769N528R021P751P375r726n561j1390l130O423Q542L616o75j5557
7654b2946R84K368q69o068J6109K0748k835o153k1607k689R712M638o360m909
7640a9877K805J2831l480j136r164q084j1034N066J2060J7402J1110K011J039
7627A1549k285j7253j8199n466J0920J342N851j657o04j898K951o015k167m694
7613b7625J3959K708j4315k109Q971J2814N43r470K037J0165O146j1118j6372
$$ plain form
7600 -23666 -22387 -24185 -29411 -18062 -8845 -10751 -19067 -7872 -18181 -26782 -32147 -34392 -19395 -12185
7586 -12185 -16202 -21586 -26659 -14265 -1933 4385 -4444 -9466 -22231 -16367 -4890 -8971 -11291 4812
7572 4812 7360 -580 -3625 -9673 -13289 -23343 -17977 -24467 -25959 -21763 -14630 -10289 -4940 -8880 -26761
7557 -26761 -23240 -36432 -34451 -32183 -24518 -25755 -24746 -27617 -24307 -30045 -27523 -17603 -14522 -25861
7543 -25861 -33228 -35833 -40182 -38015 -26823 -10307 -6485 -28 2751 7865 5132 -9677 -18783 -10642
7529 -10642 -7835 -11594 -17029 -24651 -20696 -12031 -3928 -11046 -2958 9431 2728 2137 102 48 -6787
7514 -6787 -4045 -5397 3099 -733 3365 -6514 -12810 -8733 2920 13888 13328 10765 -3459 -11331
7500 -11331 -6883 -16338 -22624 -11466 -5484 -6471 -7441 -11530 -3868 -16005 -22625 -20388 -10917 -15758 -27245
$$ packed form
7600b3666J279j798n226J1349R217j906q316J1195j0309q601n365k245J4997P210
7586a2185m017n384n073J2394J2332O318q829n022j2765N864J1477m081k320J6103
7572D812K548p940l045o048l616j0054N366o490j492M196P133M341N349l940j7881
7557b6761L521j3192J981K268P665j237J009k871L310n738K522R920L081j1339
7543b5861p367k605m349K167J1192J6516L822O457K779N114k733j4809r106Q141
7529a0642K807l759n435p622L955Q665Q103p118Q088J2389o703n91k035n4o835
7514f787K742j352Q496l832M098r879o296M077J1653J0968n60k563j4224p872
7500a1331M448r455o286J1158N982r87r70m089P662j2137o620K237R471m841j1487
$$ plain form
7485 -27245 -30533 -28842 -17779 -11252 -6597 -15745 -24699 -23028 -17534 -12918 -7089 -10213 -2660 -2885 -3262
7470 -3262 7253 2434 -2409 1901 -1723 -6884 -44 -3909 -13366 -12866 -20303 -21657 -10932 -8728 -11958
7455 -11958 -10352 5733 -4977 -25591 -32443 -28709 -19468 -13808 -21030 -10674 -21220 -34361 -33840
7442 -33840 -32892 -31691 -39048 -38719 -27900 -12803 -12185 -16757 -17787 -21057 -16024 -8593 -13115 -17036 -18926
7427 -18926 -5045 344 6015 4626 3193 -8771 -13458 -16725 -5739 -6923 -15539 -33638 -39683 -24154
7413 -24154 -13658 -17916 -11865 -8987 -5989 -10264 -9899 -3 -4031 -673 -2145 -4931 -13773 -17078 -4315
7398 -4315 -294 -828 -22731 -51788 -37251 -26044 -17110 -11194 -15755 -14891 -21064 -23841 -19917 -11871
7384 -11871 -17893 -23966 -17140 -16163 -21952 -17214 -22416 -29779 -25925 -28807 -29879 -11905 -14205 -15848 -23812
$$ packed form
7485b7245l288J691J1063O527M655r148q954J671N494M616N829l124P553k25l77
7470c262J0515m819m843M310l624n161O840l865r457N00p437j354J0725K204l230
7455a1958J606J6085j0710k0614o852L734R241N660p222J0356j0546j3141N21
7442c3840R48J201p357L29J0819J5097O18m572j030l270N033P431m522l921j890
7427a8926J3881N389N671j389j433j1964m687l267J0986j184q616j8099o045J5529
7413b4154J0496m258O051K878K998m275L65R896m028L358j472k786q842l305J2763
7398d315M021n34k1903k9057J4537J1207Q934N916m561Q64o173k777L924Q046
7384a1871o022o073O826R77n789M738n202p363L854k882j072J7974k300j643p964
$$ plain form
7369 -23812 -32396 -39192 -30313 -20966 -9227 -2124 -9492 -11038 -16614 -18489 -6600 -16330 -24059 -23196
7355 -23196 -16690 -26337 -37572 -28049 -26347 -35745 -34219 -15638 -15938 -23311 -24772 -28697 -26162 -10987
7341 -10987 -10135 -26486 -33087 -18970 -21893 -14787 -9284 -14578 -17720 -20296 -5245 -1712 5828 2908
7327 2908 -10415 -23965 -33512 -31050 -21733 -17102 -25596 -29668 -29423 -27378 -17436 -22903 -26719 -28979 -21530
7312 -21530 -20510 -1987 -5970 -14559 -27603 -43912 -44120 -27502 -23012 -16293 -5194 -4819 -19797 -18461
7298 -18461 -8516 -4568 -9585 -12569 -14275 -18683 -13522 -6041 -4078 -16497 -25585 -27956 -31075 -26403
7284 -26403 -25568 -24804 -17540 -26160 -29941 -21462 -14356 -7859 -2618 -6799 -5257 447 8905 -2149 -6991
7269 -6991 -6571 -11976 -15798 -11997 -11455 -13515 -10138 3933 -2351 -6072 -11115 -10284 -18614 -30973 -23191
$$ packed form
7369b3812q584o796Q879R347J1739P103p368j546n576j875J1889r730p729Q63
7355b3196O506r647j1235R523J702r398J526J8581l00p373j461l925K535J5175
7341a0987Q52j6351o601J4117k923P106N503n294l142k576J5051L533P540k920
7327B908j3323j3550r547K462R317M631q494m072K45K045R942n467l816k260P449
7312b1530J020J8523l983q589j3044j6309k08J6618M490O719J1099L75j4978J336
7298a8461R945L948n017k984j706m408N161P481J963j2419r088k371l119M672
7284b6403Q35P64P264q620l781Q479P106O497N241m181J542N704Q458j1054m842
7269f991M20n405l822L801N42k060L377J4071o284l721n043Q31q330j2359P782
$$ plain form
7254 -23191 -10959 -11578 -28112 -37498 -35145 -34281 -34777 -28370 -26552 -33200 -34699 -35378 -30222 -25807 -23396
7239 -23396 -30708 -33127 -27167 -20363 -22852 -28742 -5914 1379 6098 7110 10290 -7839 -20059 -21085
7225 -21085 -22011 -29585 -24378 -20180 -13957 -2165 8218 27459 12842 4833 1820 -3129 -10559 -16621
7211 -16621 -30668 -42136 -30250 -27645 -31932 -31121 -16388 -8345 -9093 -12191 -13061 -22573 -22922 -26842 -26136
7196 -26136 -12188 -6586 -11119 -14149 -27585 -29591 -19046 -11180 -3454 -15289 -17193 -21800 -2993
7183 -2993 22058 19165 233 -17027 -17393 -22767 -22833 -13902 -871 4980 3234 -14379 -28015 -21169
7169 -21169 -7942 -10319 -14927 -17905 -19213 -15692 -12378 -11314 -12312 -2639 843 -12579 -24925 -24174
7155 -24174 -22098 -27613 -35299 -26159 -22816 -29270 -25693 -13850 -8007 -9600 -14829 -13485 -105 2494
$$ packed form
7254b3191J2232o19j6534r386K353Q64m96O407J818o648j499o79N156M415K411
7239b3396p312k419N960O804k489n890K2828P293M719J012L180j8129j2220j026
7225b1085r26p574N207M198O223J1792J0383J9241j4617q009l013m949p430o062
7211a6621j4047j1468J1886K605m287Q11J4733Q043p48l098q70r512l49l920P06
7196b6136J3948N602m533l030j3436k006J0545P866P726j1835j904m607J8807
7183b993K5051k893j8932j7260l66n374o6Q931J3031N851j746j7613j3636O846
7169b1169J3227k377m608k978j308L521L314J064r98R673L482j3422j2346P51
7155b4174K076n515p686R140L343o454L577J1843N843j593n229J344J3380K599
$$ plain form
7141 2494 -4088 -6999 -25406 -35047 -39552 -24884 -6890 -10726 -7774 -9764 -18747 -18053 -10841 -4958
7127 -4958 -1836 -982 6805 -9807 -22732 -33692 -39378 -37120 -25110 -20573 -23796 -23454 -1814 877
7113 877 -7747 2728 3586 -588 -16905 -15679 -11 5391 -1413 13411 23073 8935 1482 -1361
7099 -1361 -6447 -14250 -19979 -16760 -19354 -10150 -9595 -15563 -18572 -23461 -18774 -18419 -8169 1642 4195
7084 4195 -6957 -13767 -821 -1578 -6157 -8646 -4504 -6468 -8581 4884 11334 8302 4311 -5419
7070 -5419 -10778 -23574 -32031 -22568 -8898 -11070 -11225 -12436 -24010 -17112 2692 -1653 -16815 -21827
7056 -21827 -19980 -14546 -21535 -10991 -4681 -7393 -2649 -17045 -22086 -21590 -22244 -19643 -16682 -11046 -23792
7041 -23792 -21032 -16354 -30155 -40129 -46037 -32324 -11738 -2931 -6880 -19420 -16724 -13679 -24489
$$ packed form
7141B494o582k911j8407r641m505J4668J7994l836K952j990q983O94P212N883
7127d958L122Q54P787j6612j2925j0960n686K258J2010M537l223L42K1640K691
7113H77q624J0475Q58m174j6317J226J5668N402o804J4824R662j4138p453k843
7099a361n086p803n729L219k594R204N55n968l009m889M687L55J0250R811K553
7084D195j1152o810J2946p57m579k489M142j964k113J3465O450l032l991r730
7070e419n359j2796q457R463J3670k172j55j211j1574O898J9804m345j5162n012
7056b1827J847N434o989J0544O310k712M744j4396n041M96o54K601K961N636j2746
7041b3792K760M678j3801r974n908J3713K0586Q807l949j2540K696L045j0810
$$ plain form
7028 -24489 -20572 -16921 -18641 -19143 -15634 -17524 -6311 -814 -3249 4757 1556 -11984 -21050 -26370
7014 -26370 -18469 -24264 -27546 -18467 -14282 -10383 -25237 -33055 -22622 -18813 -14232 4820 6237 -2750
7000 -2750 3869 -1860 -13729 -21024 -25702 -38708 -35942 -28063 -18205 -12504 -15761 -8952 -4523 -5387 -8394
6985 -8394 -9501 -23277 -25283 -22277 -8806 1268 -10515 -6075 -2614 -4143 -8590 -9490 -6181 -1319
6971 -1319 -6071 -20688 -23808 -19193 -14791 -15077 -5878 -5547 -12455 -20524 -30383 -25132 -15247 -29147 -34555
6956 -34555 -25457 -26009 -20287 -10693 -4404 2264 10981 11140 2190 -10905 -20184 -35371 -26937 -14008
6942 -14008 7174 1242 -9020 -21206 -18340 -19225 -15505 -4659 -9467 -11533 -11397 -18399 -19747 -8187
6928 -8187 55 8147 1043 -13041 -10542 -10787 -13333 -9298 -3350 3555 -4151 -15433 -11423 -1613 4436
$$ packed form
7028b4489L917L651j720n02L509j890J1213N497k435Q006l201j3540r066n320
7014b6370P901n795l282R079M185L899j4854p818J0433L809M581J9052J417q987
7000b750O619n729j1869p295m678j3006K766P879R858N701l257O809M429q64l007
6985h394j107j3776k006L006J3471J0074j1783M440L461j529m447r00L309M862
6971a319m752j4617l120M615M402k86R199L31o908q069r859N251R885j3900n408
6956c4555R098n52N722R594O289O668Q717J59q950j3095r279j5187Q434J2929
6942a4008K1182n932j0262j2186K866q85L720J0846m808k066J36p002j348J1560
6928h187Q242Q092p104j4084K499k45k546M035N948O905p706j1282M010R810O049
$$ plain form
6913 4436 -7857 -12969 -14072 -14046 -9827 -7646 -16236 -14687 -11056 -5502 3753 1877 2189 686 -2583
6898 -2583 3804 -3920 -4218 -5303 -12060 -4430 3093 -12520 -24049 -26920 -27714 -27187 -24201 -17943 -17574
6883 -17574 -20839 -18450 -8227 -4079 7692 10080 12514 12190 -5459 -18148 -21490 -18917 -12337 -16230
6869 -16230 -19206 -18733 -24397 -22908 -17215 -6948 10812 13372 1851 -1418 2577 -17094 -31021 -18984
6855 -18984 -17205 -16689 -18615 -17114 -15746 -13556 -7902 -1583 -13549 -9674 -16344 -22347 -7453 -5933
6841 -5933 -1118 11085 10031 9934 5358 3609 5892 -5451 -1502 853 -748 -3551 -8402 -12637 -18392
6826 -18392 -1847 -124 -6918 -13160 -14691 -25748 -34161 -30713 -37330 -35752 -30731 -26250 -23463 -23717
6812 -23717 -29551 -23654 -11701 -1001 -2918 -17858 -26527 -20482 -7345 -14630 -23086 -22538 -18839 -23502
$$ packed form
6913D436j2293n112j103K6M219K181q590J549L631N554R255j876L12j503l269
6898b583O387p724k98j085o757P630P523j5613j1529k871p94N27K986O258L69
6883a7574l265K389J0223M148J1771K388K434l24j7649j2689l342K573O580l893
6869a6230k976M73n664J489N693J0267J7760K560j1521l269L995j9671j3927J2037
6855a8984J779N16j926J501J368K190N654O319j1966L875o670o003J4894J520
6841e933M815J2203j054r7m576j749K283j1343L949K355j601k803m851m235n755
6826a8392J6545J723o794o242j531j1057q413L448o617J578N021M481K787k54
6812b3717n834N897J1953J0700j917j4940q669O045J3137p285q456N48L699m663
$$ plain form
6798 -23502 -24883 -25686 -11234 -11152 -12344 -779 1124 -3597 -6884 -13984 -12544 -20394 -25097 -23244 -25374
6783 -25374 -24236 -24717 -16605 -20814 -21023 -15918 -14706 -16695 -4522 -13314 -13107 3744 15890 14694 13536
6768 13536 5505 2953 2830 -2159 484 -2350 -9094 -8361 8414 13277 5272 -1086 6267 14860 23352
6753 23352 15127 11764 -7637 -16280 -7061 -3376 2336 4556 4185 6904 2704 -2467 -14514 -19956
6739 -19956 -17959 -14110 -19823 -15163 -6638 72 -13863 -33733 -34367 -31883 -39410 -23649 6843 3014
6725 3014 -11199 -12219 -21414 -19357 -8601 -15970 -25768 -24117 -18588 -12314 -28298 -34062 -34992 -20869
6711 -20869 -12938 -18248 -4853 -14966 -23959 -20790 -4365 -23558 -33697 -21776 -12072 3329 3581
6698 3581 374 1420 -13059 -16544 -16914 -17398 -5696 560 202 -2495 -3683 -231 -13241 -11172 -11695
$$ packed form
6798b3502j381q03J4452Q2j192J1565J903m721l287p100J440p850m703J853k130
6783b5374J138m81Q112m209k09N105J212j989J2173q792K07J6851J2146j196j158
6768A3536q031k552j23m989K643k834o744P33J6775M863q005o358P353Q593Q492
6753B3352q225l363j9401q643R219L685N712K220l71K719m200n171j2047n442
6739a9956J997L849n713M660Q525O710j3935j9870o34K484p527J5761L0492l829
6725C014j4213j020r195K057J0756p369r798J651N529O274j5984n764r30J4123
6711b0869P931n310J3395j0113q993L169J6425j9193j0139J1921R704J5401K52
6698C581l207J046j4479l485l70m84J1702O256l58k697j188L452j3010K069n23
$$ plain form
6683 -11695 -20858 -11681 -11372 -6828 4949 3924 -4323 -8291 95 1953 7653 12569 4243 -7381
6669 -7381 -26323 -34763 -20086 -4142 3265 7054 -12248 -11384 -14389 -16330 -32061 -28801 -23201 -15401
6655 -15401 -7579 3678 12538 7028 -1426 -15976 -18177 2986 7906 -1612 -10848 3178 -658 5104
6641 5104 8477 10999 -2635 -16716 -14389 -5733 -7055 -11435 -12631 -15620 -7266 -3777 -4693 -3109 -18682
6626 -18682 -27983 -23170 -18775 -26740 -20963 -4642 1634 -2537 -17472 -15010 -19064 -25566 -18146 -13550
6612 -13550 -1174 704 -2267 -8358 -14357 -13738 -12395 -29554 -25876 -3752 19723 16912 1572 -13017
6598 -13017 -16657 -2925 1525 -1956 3729 -3694 -14538 -15269 -17515 -26858 -23940 -12265 -14108 -3186
6584 -3186 -5525 -12390 358 5288 12480 8752 -4047 -1649 2062 2089 -8981 -16372 -29665 -41549
$$ packed form
6683a1695r163R177L09M544J1777j025q247l968Q386J858N700M916q326j1624
6669g381j8942q440J4677J5944P407L789j9302Q64l005j941j5731L260N600P800
6655a5401P822J1257Q860n510q454j4550k201K1163M920r518r236J4026l836N762
6641E104L373K522j3634j4081K327Q656j322m380j196k989Q354L489r16J584j5573
6626a8682r301M813M395p965N777J6321O276m171j4935K462m054o502P420M596
6612a3550J2376J878k971o091n999O19J343j7159L678K2124K3475k811j5340j4589
6598a3017l640J3732M450l481N685p423j0844p31k246r343K918J1675j843J0922
6584c186k339o865J2748M930P192l728j2799K398L711K7j1070p391j3293j1884
$$ plain form
6570 -41549 -39721 -21585 -1678 -1748 -11936 -16708 -14317 -14187 -16964 -27496 -31201 -24003 -21710 -27884
6556 -27884 -25606 -16819 -22316 -25285 -14394 -20697 -24973 -22022 -17724 -7998 -8638 -11193 -1744 -1789 527
6541 527 -5747 -6335 -18058 -20886 -16227 -18093 -16882 -19847 -11665 -12173 -10888 1994 414 -3534 -5841
6526 -5841 -8624 1927 -7487 -13778 -11188 -8252 -11045 -6418 -9525 -17056 -20776 -23482 -32586 -33014 -23498
6511 -23498 -19233 -17051 -3619 5054 -2333 -17728 -39805 -42064 -23862 -18330 -23849 -31251 -33495 -44967
6497 -44967 -43609 -40287 -34607 -23679 -4303 -8681 -25133 -15909 -8946 -12146 -20217 -14290 -19789 -22380
6483 -22380 -31229 -28122 -31148 -38153 -38883 -29399 -21227 -9766 4048 1629 -10359 -11237 -6393 -21413
6469 -21413 -31399 -22785 -15626 -18547 -24722 -24815 -25237 -18344 -2565 -4995 -25413 -36614 -45684 -42218 -33242
$$ packed form
6570d1549J828J8136J9907p0j0188m772K391J30k777j0532l705P198K293o174
6556b7884K278Q787n497k969J0891o303m276K951M298R726o40k555R449m5K316
6541E27o274n88j1723k828M659j866J211k965Q182n08J285J2882j580l948k307
6526e841k783J0551r414o291K590K936k793M627l107p531l720k706r104m28R516
6511b3498M265K182J3432Q673p387j5395k2077k259J8202N532n519p402k244j1472
6497d4967J358L322N680J0928J9376m378j6452R224O963l200q071N927n499k591
6483b2380q849L107l026p005p30R484Q172J1461J3814k419j1988q78M844j5020
6469b1413r986Q614P159k921o175r3m22O893J5779k430k0418j1201r070L466Q976
$$ plain form
6454 -33242 -36340 -45821 -39291 -27417 -24157 -29242 -30637 -26005 -15688 -4095 -4092 2305 -10039 -24595
6440 -24595 -18890 -5068 499 1096 -8926 -11079 -7991 -1721 -13411 -4409 -7120 -20090 -27488 -20643
6426 -20643 -16306 -14178 -9567 -17478 -35562 -28895 -10262 2274 -2864 -624 -2231 1275 1329 -98
6412 -98 3858 -3316 -1228 1965 -223 7987 7813 7768 -2445 209 -1441 -1988 -3998 -7806 707 4619
6396 4619 -8030 -13208 -11427 -13401 -16461 -15542 -10681 -13679 -13010 6130 -8167 -21782 -23965 -17682
6382 -17682 6138 21486 15287 1620 -6081 -13404 -15537 -2133 -2922 -10015 -11041 -5303 2686 5976
6368 5976 13569 14564 13734 4560 -6294 -6929 -1975 8530 10528 14086 16957 13307 -5214 1198 -4860
6353 -4860 -10177 -5344 -1103 3295 1002 -10872 -16723 -13564 -17136 -14614 -9318 -4961 -16853 -19275
$$ packed form
6454c3242l098r481O530J1874L260n085j395M632J0317J1593LO397j2344j4556
6440b4595N705J3822N567N97j0022k153L088O270j1690R002k711j2970p398O845
6426b0643M337K128M611p911j8084O667J8633J2536n138K240j607L506N4j427
6412i8L956p174K088L193k188Q210j74m5j0213K654j650n47k010l808Q513L912
6396D619j2649n178J781j974l060R19M861k998O69J9140j4297j3615k183O283
6382a7682K3820J5348o199j3667p701p323k133J3404p89p093j026N738P989L290
6368E976P593R95q30r174j0854o35M954J0505J998L558K871l650j8521O412o058
6353d860n317M833M241M398k293j1874n851L159l572K522N296M357j1892k422
$$ plain form
6339 -19275 -11880 -2031 -4321 -2791 -10081 -18649 -7939 2471 -5103 -12704 -18557 -27930 -36108 -33945
6325 -33945 -15792 -897 8416 9921 -612 -9034 -10051 -2400 -6907 965 9274 12408 20715 11320
6311 11320 -990 -5894 -21397 -23529 -16095 -5858 -2300 -3706 -4347 -3820 -7552 -17728 -15244 -16313
6297 -16313 -22336 -26114 -17716 -9277 -8235 -3981 -281 -4038 -5180 2422 13548 11027 -4721 4676
6283 4676 13624 2002 -8351 -8528 -9416 -14408 -15848 -27593 -27354 -19441 -15533 -8437 -4052 -19283 -29060
6268 -29060 -26868 -21964 -15354 -16568 -22492 -6605 -1937 -13807 -16668 -4105 -1216 -5036 -13355 -21300
6254 -21300 -18914 -14936 6672 12576 524 6537 16343 9879 845 4964 -11613 -21432 -14161 -5386
6240 -5386 -13514 -28952 -39181 -38291 -20738 -9503 -9476 -30027 -35024 -26921 -15272 -3434 -8764 -13008
$$ packed form
6339a9275P395R849k290J530p290q568J0710J0410p574p601n853r373q178K163
6325c3945J8153J4895R313J505j0533q422j017P651m507P872Q309L134Q307r395
6311A1320j2310m904j5503k132P434J0237L558j406o41N27l732j0176K484j069
6297a6313o023l778Q398Q439J042M254L700l757j142P602J1126k521j5748R397
6283D676Q948j1622j0353j77q88m992j440j1745K39P913L908P096M385j5231r777
6268b9060K192M904O610j214n924J5887M668j1870k861J2563K889l820q319p945
6254b1300K386L978K1608N904j2052O013R806o464r034M119j6577r819P271Q775
6240e386q128j5438j0229Q90J7553J1235K7k0551m997Q103J1649J1838n330m244
$$ plain form
6226 -13008 -6630 -4494 -3553 -9354 -9348 205 4353 4516 2516 391 -3483 175 -6273 -18049 -34728
6211 -34728 -31786 -19122 -23092 -23639 -16184 -16483 -19686 -16459 -14093 -16310 -15861 -6703 -1276 -2072 -15552
6196 -15552 -22656 -22195 -21786 -25095 -28310 -19788 -14186 -21579 -26720 -35755 -29899 -17259 -16968 -15399 -25065
6181 -25065 -38285 -26304 -7642 -9791 -14949 -2527 -11658 -10415 -3941 -10944 -27866 -22929 -13844
6168 -13844 -7887 -20830 -9938 -11109 -9641 2320 5680 1780 -577 652 10554 14114 8539 2636
6154 2636 -5632 -62 -958 363 7344 2383 96 2804 2755 -10928 -18761 -21719 -21969 -21635 -25088 -28514
6138 -28514 -23428 -34603 -39991 -31563 -18422 -4103 -4423 -13224 -8096 -10699 -15723 -5820 150 -4359
6124 -4359 -599 -5488 -12731 3343 1627 12774 3039 -5619 -13093 -30610 -16051 1545 -4169 -8413
$$ packed form
6226a3008O378K136R41n801OR553M148J63k000k125l874L658o448j1776j6679
6211c4728K942J2664l970n47P455k99l203L227K366k217M49R158N427p96j3480
6196a5552p104M61M09l309l215Q522N602p393n141r035N856J2640K91J569r666
6181b5065j3220J1981J8662k149n158J2422r131J243O474p003j6922M937R085
6168a3844N957j2943J0892j171J468J1961L360l900k357J229R902L560n575n903
6154B636q268N570q96J321O981m961k287K708m9j3683p833k958k50L34l453l426
6138b8514N086j1175n388Q428J3141J4319l20q801N128k603n024R903N970m509
6124d359L760m889p243J6074j716J1147r735q658p474j7517J4559J7596n714m244
$$ plain form
6110 -8413 -19418 -14856 595 13679 1716 -11977 -1302 -1207 2849 2086 -375 -418 -4543 -5877 3664
6095 3664 -3217 -7149 -15333 -30048 -22752 -20097 -18812 -24903 -12145 -19169 -22664 -12134 -8540 -914
6081 -914 3363 -17500 -12705 -17679 -17609 -11248 -4951 7582 7609 -2746 -2184 5205 5511 5873 6539 18772
6065 18772 22726 14527 9251 15467 24455 19676 18718 19594 6729 -1575 -1491 858 3958 11993 13180
6050 13180 8926 -361 -4119 5532 10693 11715 18021 20773 20569 6111 -9554 -5096 -1818 752
6036 752 -13601 -9245 897 -1536 -19352 -12102 -16155 -20004 -27964 -24462 -8864 -1422 -7590 -17487
6022 -17487 -15672 -9408 -9071 -2240 -10177 -16119 -26052 -22777 -19784 -16185 -11381 -18296 -20726 -27373 -24284
6007 -24284 -17873 -18014 -24366 -9386 3496 21555 15211 6339 3304 -1300 11458 18020 13656 12936
$$ packed form
6110h413j1005M562J5451J3084j1963j3693J0675R5M056p63k461m3m125j334R541
6095C664o881l932q184j4715P296K655J285o091J2758p024l495J0530L594P626
6081i14M277k0863M795m974P0O361O297J2533K7j0355N62P389L06L62O66J2233
6065A8772L954q199n276O216Q988m779r58Q76j2865q304Q4K349L100Q035J187
6050A3180m254r287l758R651N161J022O306K752k04j4458j5665M458L278K570
6036G52j4353M356J0142k433j7816P250m053l849p960L502J5598P442o168r897
6022a7487J815O264L37O831p937n942r933L275K993L599M804o915k430o647L089
6007b4284O411j41o352J4980J2882J8059o344q872l035m604J2758O562m364p20
$$ plain form
5993 12936 10771 3548 329 -6357 -1429 -1383 -11054 -11557 -16030 -29969 -23278 4165 20504 -2294
5979 -2294 -4218 893 888 16664 15181 7213 3780 4098 14276 13491 -9602 -11465 -13783 -13772 -11714 -11994
5963 -11994 -7 -1468 1205 -3844 -3329 -241 10251 2806 -7809 -7819 -3877 -16509 -22431 -12445
5949 -12445 -11146 -4574 -15845 -17208 -13024 7391 9371 10461 11256 3874 -15610 -19364 -23928 -6511
5935 -6511 16097 22763 25034 28300 7241 3211 1348 9390 15893 -2298 -14735 -27374 -21789 -4358
5921 -4358 4066 -5318 -14914 -14184 -24407 -23777 -192 7795 5016 -7220 -7256 -4680 -861 -4193 -4605
5906 -4605 -10204 -14625 5162 23002 17231 9860 2477 -986 -1648 -11944 -17903 -11809 -12735 -8284 -6572
5891 -6572 -3121 143 6845 8113 6501 -2171 292 9476 10975 -2487 -9235 -638 13680 14573 9893
$$ packed form
5993A2936k165p223l219o686M928M6r671n03m473j3939O691K7443J6339k2798
5979b294j924N111nJ5776j483p968l433L18J0178p85k3093j863k318J1K058k80
5963a1994J1987j461K673n049N15L088J0492p445j0615j0L942j2632n922R986
5949a2445J299O572j1271j363M184K0415J980J090P95p382j9484l754m564J7417
5935f511K2608O666K271L266k1059m030j863Q042O503j8191j2437j2639N585J7431
5921d358Q424r384r596P30j0223O30K3585P987k779j2236l6K576L819l332m12
5906d605n599m421J9787J7840n771p371p383l463o62j0296n959O094r26M451J712
5891f572L451L264O702J268j612q672K463R184J499j3462o748Q597J4318Q93m680
$$ plain form
5876 9893 7290 -4633 -9958 -3337 3754 2497 139 -7524 1963 5368 579 -9121 -18208 -11752 -2130
5861 -2130 1088 448 -668 -3913 3047 -4796 -17298 -17647 -11825 -11987 1648 11260 -2148 -11696 -7587
5846 -7587 1743 7590 9212 14026 9042 -5163 -7045 -9323 -15190 -21271 -13937 -7125 -1972 -2001 -1567
5831 -1567 2087 -6470 -2560 16448 17788 14590 18770 16887 6227 -9253 -15224 -8924 3931 -1716
5817 -1716 6835 22772 24623 28901 21746 14277 8197 6481 2226 -734 2801 3284 8766 4327 -7154
5802 -7154 -1714 6825 -4719 -7932 -9727 670 -13693 -13727 -9084 -12237 -13058 -22056 -10865 -3478 1958
5787 1958 -2278 -15752 -10617 -2157 -13689 -13625 -1733 -8496 -5233 -2562 3514 -5822 -4407 1283 1733
5772 1733 13742 22384 25396 21760 9780 -5147 -13482 -16461 -14386 -7666 -22848 -25862 -25284 -19418
$$ packed form
5876I893k603j1923n325O621P091j257k358p663R487L405m789r700r087O456R622
5861b130L218o40j116l245O960p843j2502l49N822j62J3635R612j3408r548M109
5846g587R330N847J622M814m984j4205j882k278n867o081P334O812N153k9M34
5831a567L654q557L910J9008J340l198M180j883j0660j5480n971O300J2855n647
5817a716Q551J5937J851M278p155p469o080j716m255k960L535M83N482m439j1481
5802g154N440Q539j1544l213j795J0397j4363l4M643l153q21q998J1191P387N436
5787A958m236j3474N135Q460j1532O4J1892o763L263K671O076r336J415N690M50
5772A733J2009Q642L012l636j1980j4927q335k979K075O720j5182l014N78N866
$$ plain form
5758 -19418 -14009 -12895 -21050 -21616 -3886 4425 1448 -3764 -13652 -12205 -8928 -24358 -36492 -32163
5744 -32163 -38868 -43493 -28945 -20960 -6658 8422 -1949 -3179 2207 6165 122 -7312 -25304
5731 -25304 -32024 -24203 -13098 -9733 -6683 78 140 -6740 -18479 -8000 -1759 1716 129 -4448
5717 -4448 -8900 -18503 -19336 -7941 3106 6268 -417 -9705 -16658 -18913 -18641 -18358 -19390 -13242 -19479
5702 -19479 -26670 -13657 -10776 -14981 -6977 -3589 -3194 -4891 -5979 -4294 -4800 -5923 -5020 -13554 -19152
5687 -19152 -15785 -6001 -2131 4888 -588 -10780 -4067 -12535 -13425 -308 -5005 -10993 -5693 4358
5673 4358 7687 1312 1649 -3458 -12555 -19941 -24299 -10694 9445 6101 2401 4183 6592 5588 8376
5658 8376 5676 7700 -2294 -12605 -5668 3138 9110 1215 404 2671 -7595 -13179 -6831 -8457 -92
$$ packed form
5758a9418N409J114q155n66J7730Q311k977n212r888J447L277j5430j2134M329
5744c2163o705m625J4548P985J4302J5080j0371j230N386L958o043p434j7992
5731b5304o720P821J1105L365L050O761O2o880j1739J0479O241L475j587m577
5717d448m452r603q33J1395J1047L162o685r288o953k255K72K83j032O148o237
5702a9479p191J3013K881m205Q004L388L95j697j088J685n06j123R03q534n598
5687a9152L367R784L870P019n476j0192O713q468q90J3117m697n988N300J0051
5673D358L329o375L37n107r097p386m358J3605K0139l344l700J782K409j004K788
5658H376k700K024r994j0311O937Q806N972p895q11K267j0266n584O348j626Q365
$$ plain form
5643 -92 -16 -5020 4261 16921 4672 -20807 -13872 -1782 -5768 -13076 -16145 -17799 -24792 -27526 -17539
5628 -17539 -12972 -11010 -13108 -21238 -15015 -324 11751 9302 -5507 -9345 -4787 9593 4450 -6610
5614 -6610 -3218 8686 6417 6027 -6704 -9905 -6524 -8642 -8581 -4310 -2084 -5006 -603 8084 8667
5599 8667 8880 1773 -18397 -29294 -17750 -14818 -15432 -4057 21715 26482 17516 4556 -1805 -6302
5585 -6302 -9283 -6850 -8112 -1884 848 4024 4251 6486 -1589 1580 5255 9781 4447 -6785 -13274
5570 -13274 -11358 -7548 -5664 -6881 -18139 -4630 20311 18035 2521 -2533 6444 -5623 -27566
5557 -27566 -40731 -41412 -26283 -17300 -16250 -25568 -15240 2109 5954 2667 6150 5719 410 10696
5543 10696 1534 -273 -8264 -5134 6950 -1427 -12454 2666 12704 10220 -3586 -3399 -5000 5096
$$ packed form
5643i2P6n004R281J2660j2249k5479O935J2090l986p308l069j654o993k734R987
5628a7539M567J962k098q130O223J4691J2075k449j4809l838M558J4380n143j1060
5614f610L392J1904k269l90j2731l201L381k118O1M271K226k922M403Q687N83
5599H667K13p107k0170j0897J1544K932o14J1375K5772M767q966j2960o361m497
5585f302k981K433j262O228K732L176K27K235q075L169L675M526n334j1232o489
5570a3274J916L810J884j217j1258J3509K4941k276j5514n054Q977j2067k1943
5557b7566j3165o81J5129Q983J050r318J0328J7349L845l287L483m31n309J0286
5543A0696r162j807p991L130J2084q377j1027J5120J0038k484j3806J87j601J0096
$$ plain form
5529 5096 9234 9214 2198 8943 6559 8119 5970 -17158 -24163 -10852 -3586 4598 17324 17922 9571
5514 9571 3982 -4924 -16280 -7780 -6991 -18137 -18862 -20383 -22929 -17258 -23575 -27053 -18083 -1255 6035
5499 6035 7449 -4740 -12317 -25753 -22374 -6067 -2406 -8723 -15800 -12477 -5091 -11956 -17883 -15854
5485 -15854 -12889 -13866 -6532 -4040 7927 8805 12369 6587 -3458 -7414 -7047 15372 28643 5094
5471 5094 -13984 -17414 -3423 315 2630 -4549 -6391 -9520 -13204 -4187 -9310 -7654 -10090 -6634
5457 -6634 -9043 -14350 -2061 -1918 3659 10228 9541 -2106 -12417 -10802 6043 -9752 -22244 -26501
5443 -26501 -8048 9797 8862 -990 -14029 -16761 -13395 -10767 -7341 -3582 -12022 -9919 -1565 8512
5429 8512 2037 -6344 4284 5291 7984 2597 -8493 -6122 2896 7567 9759 -10142 -21370 -24303
$$ packed form
5529E096M138k0p016O745k384J560k149k3128p005J3311P266Q184J2726N98q351
5514I571n589q906j1356Q500P89j1146p25j521k546N671o317l478Q970J6828P290
5499F035J414j2189p577j3436L379J6307L661o317p077L323P386o865n927K029
5485a5854K965r77P334K492J1967Q78L564n782j0045l956L67K2419J3271k3549
5471E094j9078l430J3991L738K315p179j842l129l684R017n123J656k436L456
5457f634k409n307J2289J43N577O569o87j1647j0311J615J6845j5795j2492m257
5443b6501J8453J7845r35r852j3039k732L366K628L426L759q440K103Q354J0077
5429H512o475q381J0628J007K693n387j1090K371R018M671K192j9901j1228k933
$$ plain form
5415 -24303 -21226 -22053 -13135 -7338 -9558 -16071 -21086 -11687 3907 11788 17410 7624 4230 -796 -5436
5400 -5436 -4115 -3593 -18943 -22762 -11792 -3243 -3924 -17515 -11524 2869 -7842 -6333 -8705 -4071
5386 -4071 4468 7752 10104 17258 18518 30465 28676 13038 6315 2007 3469 3654 -6415 528
5372 528 -8876 -2459 5879 12779 10850 -631 -12250 -12365 -9954 -2588 3923 7165 15111 6354 -16909
5357 -16909 -24230 -11716 -4300 10901 7525 -5909 1375 5981 742 -170 -5954 -11165 -19077 -24511
5343 -24511 -18808 -6914 -4314 -3312 788 9238 19868 23941 21035 17423 9649 4899 18074 26628
5329 26628 24229 13443 10651 2204 -575 -3915 8361 2260 -3577 -8290 -9367 -15728 -6318 -4670
5315 -4670 -9365 -13254 -12826 -5521 23556 24008 6358 -1451 -5385 -6847 735 15984 26873 14159
$$ packed form
5415b4303L077q27Q918N797k220o513n015R399J5594P881N622r786l394n026m640
5400e436J321N22j5350l819J0970Q549o81j3591N991J4393j0711J509k372M634
5386d071Q539L284K352P154J260J1947j789j5638o723m308J462J85j0069O943
5372E28r404O417Q338O900j929j1481j1619j15K411P366O511L242P946q757k3263
5357a6909p321J2514P416J5201l376j3434P284M606n239r12n784n211p912n434
5343b4511N703J1894K600J002M100Q450J0630M073k906l612p774m750J3175Q554
5329B6628k399j0786k792q447k779l340J2276o101n837m713j077o361R410J648
5315d670m695l889M28P305K9077M52j7650p809l934j462P582J5249J0889j2714
$$ plain form
5301 14159 1318 -450 13643 21871 3889 -11650 -15207 -5196 -13342 -22525 -15484 -22303 -18167
5288 -18167 -7125 10950 12786 22722 27543 17044 18124 15973 11642 7741 6743 -2833 -5974 4541
5274 4541 11865 11487 788 5912 4294 -7503 -2188 16796 20443 13171 5987 50 -15583 -23635
5260 -23635 -14164 -18068 -15445 -7304 54 1696 15355 -2062 -13680 -14043 -5890 -1465 1155 -4591
5246 -4591 1849 2619 -10274 -12853 -20218 -19663 -24597 -17245 -21573 -16166 -22735 -9774 9171 1425 -9602
5231 -9602 -16135 -19622 -18604 -11714 -7204 -12154 -15446 -17082 -17258 -3695 2687 -3212 -6953 -8967 -4039
5216 -4039 -17909 -10583 -918 2804 7927 4158 2600 250 -7397 -6199 -755 5819 9037 6026 -917
5201 -917 -5691 -5686 -2472 -1785 -3626 -8716 -1980 2488 224 9171 16358 20977 14213 8113 -2838 6030
$$ packed form
5301A4159j2841j768J4093Q228j7982j5539l557J0011q146r183P041o819M136
5288a8167J1042J8075J836R936M821j0499J080k151m331l901r98r576l141J0515
5274D541P324l78j0699N124j618j1797N315J8984L647p272p184n937j5633q052
5260b3635R471l904K623Q141P358J642J3659j7417j1618l63Q153M425K620n746
5246d591O440P70j2893k579p365N55m934P352m328N407o569J2961J8945p746j1027
5231i602o533l487J018O890M510m950l292j636j76J3563O382n899l741k014M928
5216d039j3870P326R665L722N123l769j558k350p647J198N444O574L218l011o943
5201i17m774NL214O87j841n090O736M468k264Q947P187M619o764o100j0951Q868
$$ plain form
5185 6030 28533 11980 -10783 -20369 -8262 6728 -5106 -25456 -31433 -23725 -12664 -3512 -5380
5172 -5380 -8428 -4124 5230 9309 4770 -1135 3398 -3891 2576 -1995 -10993 -17545 -15200 -8338 7832
5157 7832 15281 19203 5292 -4083 6700 2365 -10951 -17755 -15580 -7612 4632 15962 4919
5144 4919 -13997 -15768 -4857 -3987 -2050 1896 8171 8120 7997 11984 3497 4947 -3836 2355 12753
5129 12753 6591 3187 1112 1980 4781 -4636 -5937 2161 1908 8833 13423 13215 18531 18166 15041 14141
5113 14141 8558 8266 6041 -2046 4696 2798 8256 13866 -5219 -19066 -8320 -11254 -17873 -16105
5099 -16105 -6568 4931 9295 36 -1730 -3139 7234 9917 26991 22312 6997 -3555 -15805
5086 -15805 -20384 -18142 -18413 -5843 -1630 -1851 -11465 -13559 -15909 -9508 216 7928 9557 10235 12473
$$ packed form
5185F030K2503j6553k2763r586J2107J4990j1834k0350n977P708J1061R152j868
5172e380l048M304R354M079m539n905M533p289O467m571q998o552K345O862J6170
5157G832P449L922j3911r375J0783m335j3316o804K175P968J2244J1330j1043
5144D919j8916j771J0911Q70J937L946O275n1j23L987q487J450q783O191J0398
5129A2753o162l404k075Q68K801r417j301Q098k53O925M590k08N316l65l125r00
5113A4141n583k92k225q087O742j898N458N610j9085j3847J0746k934o619J768
5099a6105R537J1499M364r259j766j409J0373K683J7074m679j5315j0552j2250
5086a5805m579K242k71J2570M213k21r614k094k350O401R724P712J629O78K238
$$ plain form
5071 12473 9017 -1993 -12399 -17652 -12668 -15687 -18404 -12825 -11983 -6629 -9812 -8210 -11452 -9330
5057 -9330 568 -903 14474 10491 2445 -8400 -7274 -9039 -4096 10650 8603 14502 19658 12474
5043 12474 3059 3868 12748 1225 -8013 -14111 -15246 -7562 -5962 1879 -9318 -4737 189 -5338
5029 -5338 -8635 -15744 -27930 -28504 -21923 -11950 -1032 5813 13682 12476 -2266 -18760 -22631 -5176
5015 -5176 3057 -9706 -477 10769 -2583 -7571 -4783 1271 183 8371 3325 10813 4219 -14761
5001 -14761 -19557 -5397 404 -6423 -761 1252 -6430 -3905 3373 3493 3953 -4698 -17319 -5679
4987 -5679 3794 -2655 -5543 -10400 -12901 -9360 -1137 8616 4061 -3111 -441 5730 3119 801 -10326
4972 -10326 -11228 -7255 -9118 -16839 -11624 1154 3589 136 -2910 -6196 -9483 -1508 -16447 -20635
$$ packed form
5071A2473l456j1010j0406n253M984l019k717N579Q42N354l183J602l242K122
5057i330R898j471J5377l983q046j0845J126j765M943J4746k047N899N156p184
5043A2474r415Q09Q880j1523r238o098j135P684J600P841j1197M581M926n527
5029e338l297p109j2186n74O581R973J0918O845P869j206j4742j6494l871J7455
5015e176Q233j2763R229J1246j3352m988K788O054j088Q188n046P488o594j8980
5001a4761m796J4160N801o827N662K013p682K525P278J20M60q651j2621J1640
4987e679R473o449k888m857k501L541Q223R753m555p172K670O171k611k318j1127
4972a0326r02L973j863p721N215J2778K435l453l046l286l287P975j4939m188
$$ plain form
4958 -20635 -26909 -15571 -30274 -23845 -8644 6863 7890 6920 13212 11262 6552 10813 8640 5484
4944 5484 9362 22353 19919 19872 21868 13849 10062 10603 12194 -4777 -419 1966 -7619 -13019 -17491
4929 -17491 -11668 -15767 -11065 -1796 5815 17224 10720 12426 6285 15334 25834 14207 13585 13874
4915 13874 2997 9020 6696 11495 19889 13208 -2978 -17576 -14335 -3025 -6184 -12292 -16649 -19266
4901 -19266 -19601 -16463 -5950 -3660 -926 4558 11316 8670 10064 13752 15385 7470 -9431 -19631
4887 -19631 -22106 -22269 -19705 -6275 -1925 -10416 -2732 -843 -3096 -4486 8249 14633 9704 -2176
4873 -2176 -6277 -4584 611 11226 1988 -1745 5155 8621 1031 -14981 -12118 -338 9964 7013
4859 7013 -1814 -8908 4355 13408 1132 -743 2525 -1590 -11283 -6601 -11454 -13280 -5777 -13595
$$ packed form
4958b0635o274J1338j4703O429J5201J5507J027r70O292j950m710M261k173l156
4944E484L878J2991k434m7J996q019l787N41J591j6971M358K385r585n400m472
4929a7491N823m099M702R269P611J1409o504J706o141R049J0500j1627o22K89
4915A3874j0877O023k324M799Q394o681j6186j4598L241J1310l159o108m357k617
4901a9266l35L138J0513K290K734N484O758k646J394L688J633p915j6901j0200
4887a9631k475j63K564J3430M350q491P684J889k253j390J2735O384m929j1880
4873b176m101J693N195J0615r238l733O900L466p590j6012K863J1780J0302k951
4859G013q827p094J3263R053j2276j875L268m115r693M682m853j826P503p818
$$ plain form
4845 -13595 -13637 2293 24203 30621 11879 -3684 -4446 519 8218 -220 -4984 -5344 -2977 1962 250
4830 250 -3834 6363 6924 1312 -3011 7547 924 4758 2533 -5531 -2875 -4157 -2233 -13168 -9670
4815 -9670 -12330 -15397 -9184 -8071 -3137 16035 35610 35656 20920 11437 12554 19876 13802 21397 30756
4800 30756 18452 17286 12058 9408 10069 12409 6775 -3796 -9618 4895 12434 1713 7745 1024
4786 1024 10097 20857 11924 -287 4260 124 2361 460 -10010 -14615 -15427 -9241 420 -9133
4772 -9133 -13946 -13198 -9377 -17307 -16015 4111 6114 -2598 -2344 9265 14646 11487 17360 11955 -3566
4757 -3566 -7546 -11635 481 8253 14718 27125 41467 36384 29529 14121 -3254 6381 14005 -3029
4743 -3029 -13946 -15183 -19652 -25357 -25662 -33899 -20901 -547 2969 -6727 -18497 -18170 -14622 -20690
$$ packed form
4845a3595m2J5930K1910O418j8742j5563p62M965P699q438m764l60K367M939j712
4830B50m084J0197N61n612m323J0558o623L834k225q064K656j282J924j0935L498
4815i670k660l067O213J113M934J9172J9575M6j4736r483J117P322o074P595R359
4800C0756j2304j166n228k650O61K340n634j0571n822J4513P539j0721O032o721
4786A024R073J0760q933j2211M547m136K237j901j0470m605q12O186R661r553
4772i133m813P48L821p930J292K0126K003q712K54J1609N381l159N873n405j5521
4757c566l980m089J2116P772O465J2407J4342n083o855j5408j7375R635P624j7034
4743c029j0917j237m469n705l05q237J2998K0354L516r696j1770L27L548o068
$$ plain form
4729 -20690 -18293 -11905 -13184 -9814 -12111 -21062 -12411 870 -6216 -12076 -9538 -13518 -10239 -16221
4715 -16221 -13639 8497 60 -2546 -17447 -22499 -16965 -4827 5704 568 -2951 -14478 -12266
4702 -12266 -7552 -11895 -16045 -5134 915 -1407 -31 3884 3977 8067 14650 11187 8354 13342 6622
4687 6622 4679 28418 30316 13511 -1559 -8254 2828 7911 16309 13042 21929 25802 22110 4547
4673 4547 10441 17486 17583 15978 19131 7803 -8020 -6131 7377 5204 578 8805 5763 -8255
4659 -8255 -12430 -13667 -6399 -5161 -14551 -16130 -22782 -13018 -3719 -8335 -1027 11109 4739 -5798
4645 -5798 -6275 -11624 -10753 -5363 -8146 -16551 -23219 -18079 -14442 -534 15317 7165 -4942 9111
4631 9111 14982 10698 6678 205 -1529 -3620 -6445 -18175 -21312 -17882 -13824 -8398 -2564 2016 -6986
$$ packed form
4729b0690K397O388j279L370k297q951Q651J3281p086n860K538l980L279n982
4715a6221K582K2136q437k606j4901n052N534J2138J0531n136l519j1527K212
4702a2266M714m343m150J0911O049k322J376L915R3M090O583l463k833M988o720
4687F622j943K3739J898j6805j5070o695J1082N083Q398l267Q887L873l692j7563
4673D547N894P045R7j605L153j1328j5823J889J3508k173m626Q227l042j4018
4659h255m175j237P268J238r390j579o652R764R299m616P308J2136o370j0537
4645e798m77n349Q71N390k783q405o668N140L637J3908J5851q152j2107J4053
4631I111N871m284m020o473j734k091k825j1730l137L430M058N426N834M580r002
$$ plain form
4616 -6986 -12082 -10337 -4021 -9571 -10307 -11073 -5880 -4489 -1952 -5514 -4911 -9038 -6559 -17298 -18365
4601 -18365 -15408 -3511 -6999 -2664 3506 5308 12557 15268 4760 535 1472 5373 4982 -5022
4587 -5022 -9332 3495 16481 14522 -834 4268 10021 4192 7896 12203 7334 6885 5100 -6278
4573 -6278 -3699 8760 -2498 4767 10134 7916 4502 2922 16443 23453 25611 14201 6910 14427
4559 14427 16053 18663 12945 -488 -14106 -18614 -20478 -10714 505 6491 5198 -1071 -16819 -6739
4545 -6739 8948 3287 420 2422 -12311 -9621 -1378 9664 16757 11405 3477 -5497 -3810 2970
4531 2970 -7723 -10173 -2925 -3061 -19305 -20747 -17322 -11865 -7603 -9845 -2964 5903 13888 4267 3286
4516 3286 -382 556 2725 5585 3974 5904 6678 156 -6602 -7373 6489 13198 1953 -10046 -17650
$$ packed form
4616f986n096J745O316n550p36p66N193J391K537l562O03m127K479j0739j067
4601a8365K957J1897l488M335O170J802P249K711j0508m225R37L901l91j0004
4587e022m310J2827J2986j959j5356N102N753n829L704M307m869m49j785j1378
4573f278K579J2459j1258P265N367k218l414j580J3521P010K158j1410p291P517
4559A4427J626K610n718j3433j3618m508j864R764J1219N986j293o269j5748J0080
4545f739J5687n661k867K002j4733K690Q243J1042P093n352p928q974J687O780
4531B970j0693k450P248j36j6244j442L425N457M262k242O881Q867P985r621r81
4516C286l668R38K169K860j611J930P74o522o758p71J3862O709j1245j1999p604
$$ plain form
4501 -17650 -13475 -937 756 1400 13851 17315 2489 -363 5177 3576 7398 -4187 -8407 -4766
4487 -4766 5122 -7373 -17951 -22496 -20679 -20889 -17925 1984 -8907 -16228 -22601 -19873 -25614 -17149
4473 -17149 -10679 -17143 -17910 -5961 -2173 8926 21126 22466 14927 10043 3460 2782 5334 13504
4459 13504 -562 -6625 -15 3537 -1263 -12519 -10521 -2207 3763 10533 13114 26014 23374 20165
4445 20165 13424 2931 -354 4167 6677 900 -6911 -21248 -19266 -13262 -10869 -7265 8504 13019
4431 13019 9105 8241 3928 7357 10410 -3897 6106 27499 10970 -8405 -15466 -17216 -12780 -10376
4417 -10376 -14481 -18187 -9696 -4041 -11834 -4525 8557 16562 18124 8245 -5755 -4393 -6191 -9724
4403 -9724 -17094 -18612 -30561 -41185 -32789 -20308 -3527 770 4801 7509 8398 -137 9838 6896
$$ packed form
4501a7650M175J2538J693O44J2451L464j4826k852N540j601L822j1585m220L641
4487d766R888j2495j0578m545J817k10K964J9909j0891p321o373K728n741Q465
4473a7149O470o464p67J1949L788J1099J2200J340p539m884o583o78K552Q170
4459A3504j4066o063O610L552m800j1256J998Q314N970O770K581J2900k640l209
4445B0165o741j0493l285M521K510n777p811j4337J982O004K393L604J5769M515
4431A3019l914q64m313L429L053j4307J0003K1393j6529j9375p061j750M436K404
4417a0376m105l706Q491N655p793P309J3082Q005J562r879j4000J362j798l533
4403i724p370j518j1949j0624Q396J2481J6781M297M031K708Q89q535R975k942
$$ plain form
4389 6896 -13090 -21118 -30278 -22665 -16233 -22567 -30641 -24767 -17885 -23383 -14492 -5086 3617 -4165 -11828
4374 -11828 -12970 -8466 486 16140 25847 18956 8359 -7602 -7120 -8985 -7546 10594 10465 4429
4360 4429 2807 2642 8224 28696 32706 18133 15616 16390 17948 13561 5763 2123 -1287 10764 13075
4345 13075 7537 668 -4785 3897 -5807 332 14176 19367 14967 22711 6749 -14214 -2684 -6596
4331 -6596 -4765 -3312 -3424 1715 2941 7875 19415 21168 8003 6285 10759 -4681 -11184 -4842
4317 -4842 -2816 -3484 -20669 -15716 -4247 3441 -11573 -21684 -24476 -19968 -22581 -18244 -14881 -7555
4303 -7555 2494 6697 13631 11682 -3606 -13124 -5884 6001 -4370 -25370 -21030 -7173 4948
4290 4948 -13337 -27411 -25613 -15057 -10182 -4746 -1786 -4178 -969 -12778 -4750 19509 18565 20171
$$ packed form
4389F896j9986q028r160P613O432o334q074N874O882n498Q891R406Q703p782p663
4374a1828j142M504Q952J5654R707o891j0597j5961M82j865J439J8140j29o036
4360D429j622j65N582K0472M010j4573k517P74J558m387p798l640l410J2051K311
4345A3075n538o869n453Q682r704O139J3844N191m400P744j5962k0963J1530l912
4331f596J831J453j12N139J226M934J1540J753j3165j718M474j5440o503O342
4317d842K026o68j7185M953J1469P688j5014j0111k792M508k613M337L363P326
4303g555J0049M203O934j949j5288r518P240J1885j0371k1000M340J3857J2121
4290D948j8285j4074J798J0556M875N436K960k392L209j1809Q028K4259r44J606
$$ plain form
4276 20171 26634 29217 24289 16157 -8620 -15385 -11828 -8046 -20429 -22676 -21134 -1829 15763 19279
4262 19279 12043 6558 -1588 -5313 465 1639 -12656 -11625 10097 9000 5528 -3848 -10212 -8700
4248 -8700 -1714 11022 15644 18855 20753 14575 10381 9844 12478 19908 16848 9359 7400 2879 2352
4233 2352 3996 9658 9546 1784 -3682 1235 2827 -7834 -17051 -8403 6877 5174 -3535 -6508 -3807
4218 -3807 -4647 -3574 1993 9069 836 -200 1122 -637 -8629 -16601 -17338 -13560 -7427 -5607 -1338
4203 -1338 10086 4119 1402 -3549 -1688 5096 6178 13908 30851 28975 27500 17813 794 -6989
$$ packed form
4276B0171O463K583m928q132k4777o765L557L782j2383k247J542J9305J7592L516
4262A9279p236n485q146l725N778J174j4295J031K1722j097l472r376o364J512
4248h700O986J2736M622L211J898o178m194n37K634P430l060p489j959m521n27
4233B352J644N662j12p762n466M917J592j0661r217Q648J5280j703q709k973K701
4218c807q40J073N567P076q233j036J322j759p992p972p37L778O133J820M269
4203a338J1424n967k717m951J861O784J082P730J6943j876j475r687j7019p783
$$ [...]
##END NTUPLES=NMR SPECTRUM
##END=
