##TITLE=Analysis number 319779
Compound Code cc 35914
Book Reference 472/113/3
Project Code adrs
Chemist Name victoriam
##JCAMPDX= 6.0         $$ Bruker NMR JCAMP-DX V2.0
##DATA TYPE= NMR SPECTRUM
##DATA CLASS= NTUPLES
##ORIGIN= Bruker BioSpin GmbH
##OWNER= nmr
$$ XWIN-NMR		Version 3.5
$$ Fri May 26 12:09:59 2006 GMT Daylight Time (UT+1h)  MAYBRIDGE\nmr@NMR_250MHZ
##.OBSERVE FREQUENCY= 250.131544655141
##.OBSERVE NUCLEUS= ^1H
##.ACQUISITION MODE= SIMULTANEOUS (DQD)
##.ACQUISITION SCHEME= undefined
##.AVERAGES= 16
##.DIGITISER RES= 18
##SPECTROMETER/DATA SYSTEM= dpx250
##.PULSE SEQUENCE= zg30
##.SOLVENT NAME= CDCl3
##.SHIFT REFERENCE= (INTERNAL, CDCl3, 0, 16.522)
##AUDIT TRAIL= $$ (NUMBER, WHEN, WHO, WHERE, WHAT)
$$ ##TITLE= Audit trail, XWIN-NMR		Version 3.5
$$ ##JCAMPDX= 5.01
$$ ##ORIGIN= Bruker BioSpin GmbH
$$ ##OWNER= nmr
$$ C:\u/data/dgb/nmr/ADRS/5340/pdata/1/auditp.txt
$$ ##AUDIT TRAIL=  $$ (NUMBER, WHEN, WHO, WHERE, WHAT)
(   1,<2006-05-26 12:09:37.61 +100>,<MAYBRIDGE\nmr>,<NMR_250MHZ>,
      <created by zg, POWCHK disabled, PULCHK disabled
       configuration hash MD5:
       84 BC 41 DB A1 6E 1D 46 DA 25 12 A5 C1 ED C5 3A
       data hash MD5: 64K
       22 CF 1E 6B 64 9A DB 29 27 7E C3 50 D0 2A 78 FA>)
(   2,<2006-05-26 12:09:50.15 +100>,<MAYBRIDGE\nmr>,<NMR_250MHZ>,
      <Start of raw data processing
       ef LB = 0.3 FT_mod = 6 PKNL = 1 SI = 32K 
       data hash MD5: 32K
       A3 29 49 8D 33 B3 B1 48 01 6B D4 0D BB DD 8B 53>)
(   3,<2006-05-26 12:09:51.72 +100>,<MAYBRIDGE\nmr>,<NMR_250MHZ>,
      <apk 
       data hash MD5: 32K
       2D 4F 92 C1 28 A0 14 F8 02 5C E6 71 1B 4E BF BA>)
(   4,<2006-05-26 12:09:52.47 +100>,<MAYBRIDGE\nmr>,<NMR_250MHZ>,
      <abs ABSG = 5 
       data hash MD5: 32K
       7B 41 E5 DA 1C 3A 35 03 83 E2 68 3D 98 67 43 8C>)
$$ ##END=
$$ 
$$ hash MD5
$$ DA DA 94 98 70 3C B4 84 0E 50 86 62 8A 7E 55 0B
##$RELAX= 
##$RELAX= 
##$RELAX= 
##$RELAX= 
##$RELAX= 
##$RELAX= 
##$RELAX= 
$$ Bruker specific parameters
$$ --------------------------
##$DU= <C:\u>
##$EXPNO= 5340
##$NAME= <ADRS>
##$PROCNO= 1
##$TYPE= <nmr>
##$USER= <dgb>
##$AMP= (0..31)
100 100 100 100 100 100 100 100 100 100 100 100 100 100 100 100 100 100 
100 100 100 100 100 100 100 100 100 100 100 100 100 100 
##$AQSEQ= 0
##$AQ_mod= 3
##$AUNM= <au_zg>
##$AUTOPOS= <23 >
##$BF1= 250.13
##$BF2= 250.13
##$BF3= 250.13
##$BF4= 250.13
##$BF5= 500.13
##$BF6= 500.13
##$BF7= 500.13
##$BF8= 500.13
##$BYTORDA= 1
##$CFDGTYP= 0
##$CFRGTYP= 5
##$CHEMSTR= <none>
##$CNST= (0..31)
1 1 145 1 1 1 1 1 1 1 1 1 1 1 1 1 1 1 1 1 1 1 1 1 1 1 1 1 1 1 1 1 
##$CPDPRG= <>
##$CPDPRG1= <>
##$CPDPRG2= <>
##$CPDPRG3= <>
##$CPDPRG4= <mlev>
##$CPDPRG5= <mlev>
##$CPDPRG6= <mlev>
##$CPDPRG7= <mlev>
##$CPDPRG8= <mlev>
##$CPDPRGB= <>
##$CPDPRGT= <>
##$D= (0..31)
0 1 0 0 0 0 0 0 0 0.06 0 0 0 0 0 0 0.0002 0 0 0 0 0 0 0 0 0 0 0 0 0 0 
0 
##$DATE= 1148641776
##$DBL= (0..7)
120 120 120 120 120 120 120 120 
##$DBP= (0..7)
150 150 150 150 150 150 150 150 
##$DBP07= 0
##$DBPNAM0= <>
##$DBPNAM1= <>
$$ [...]
##$SUBNAM7= <"">
##$SUBNAM8= <"">
##$SUBNAM9= <"">
##$SW= 20.6930455092707
##$SWIBOX= (0..15)
0 0 3 0 0 0 0 0 0 0 0 0 0 0 0 0 
##$SW_h= 5175.983436853
##$TD= 65536
##$TD0= 1
##$TE= 295.16
##$TE2= 300
##$TE3= 300
##$TEG= 300
##$TL= (0..7)
0 120 120 120 120 120 120 120 
##$TP= (0..7)
150 150 150 150 150 150 150 150 
##$TP07= 0
##$TPNAME0= <>
##$TPNAME1= <>
##$TPNAME2= <>
##$TPNAME3= <>
##$TPNAME4= <>
##$TPNAME5= <>
##$TPNAME6= <>
##$TPNAME7= <>
##$TPOAL= (0..7)
0.5 0.5 0.5 0.5 0.5 0.5 0.5 0.5 
##$TPOFFS= (0..7)
0 0 0 0 0 0 0 0 
##$TUNHIN= 0
##$TUNHOUT= 0
##$TUNXOUT= 0
##$USERA1= <user>
##$USERA2= <user>
##$USERA3= <user>
##$USERA4= <user>
##$USERA5= <user>
##$V9= 5
##$VALIST= <valist>
##$VCLIST= <CCCCCCCCCCCCCCC>
##$VD= 0
##$VDLIST= <DDDDDDDDDDDDDDD>
##$VPLIST= <PPPPPPPPPPPPPPP>
##$VTLIST= <TTTTTTTTTTTTTTT>
##$WBST= 1024
##$WBSW= 4
##$XGAIN= (0..3)
0 0 0 0 
##$XL= 0
##$YL= 0
##$YMAX_a= 393196
##$YMIN_a= -603254
##$ZGOPTNS= <>
##$ZL1= 120
##$ZL2= 120
##$ZL3= 120
##$ZL4= 120
##$ABSF1= 16.522
##$ABSF2= -4.171173
##$ABSG= 5
##$ABSL= 3
##$ALPHA= 0
##$AQORDER= 0
##$ASSFAC= 0
##$ASSFACI= 0
##$ASSFACX= 0
##$ASSWID= 0
##$AUNMP= <proc_1d>
##$AZFE= 0.1
##$AZFW= 0.1
##$BCFW= 0
##$BC_mod= 0
##$BYTORDP= 0
##$COROFFS= 0
##$CY= 12.5
##$DATMOD= 1
##$DC= 0
##$DFILT= <>
##$DTYPP= 0
##$F1P= 14.0000005364418
##$F2P= -0.99999901652339
##$FCOR= 0.5
##$FTSIZE= 32768
##$FT_mod= 6
##$GAMMA= 0
##$GB= 0
##$INTBC= 1
##$INTSCL= 1
##$ISEN= 128
##$LB= 0.3
##$LEV0= 0
##$LPBIN= 0
##$MAXI= 10000
##$MC2= 0
##$MEAN= 0
##$ME_mod= 0
##$MI= 0
##$NCOEF= 0
##$NC_proc= -4
##$NLEV= 6
##$NOISF1= 0
##$NOISF2= 0
##$NSP= 0
##$NTH_PI= 0
##$NZP= 0
##$OFFSET= 16.522
##$PC= 1
##$PHC0= 175.4496
##$PHC1= -0.9882115
##$PH_mod= 1
##$PKNL= yes
##$PPARMOD= 0
##$PSCAL= 4
##$PSIGN= 0
##$REVERSE= no
##$SF= 250.13
##$SI= 32768
##$SIGF1= 0
##$SIGF2= 0
##$SINO= 400
##$SIOLD= 32768
##$SREGLST= <1H.CDCl3>
##$SSB= 0
##$STSI= 32768
##$STSR= 0
##$SW_p= 5175.98343685301
##$SYMM= 0
##$S_DEV= 0
##$TDeff= 65536
##$TDoff= 0
##$TI= <Analysis number 999999
Compound Code 99
Book Reference 9
Project Code 9>
##$TILT= no
##$TM1= 0
##$TM2= 0
##$TOPLEV= 0
##$USERP1= <user>
##$USERP2= <user>
##$USERP3= <user>
##$USERP4= <user>
##$USERP5= <user>
##$WDW= 1
##$XDIM= 32768
##$YMAX_p= 465852368
##$YMIN_p= -252709
$$ End of Bruker specific parameters
$$ ---------------------------------
##NTUPLES= NMR SPECTRUM
##VAR_NAME=  FREQUENCY,     SPECTRUM/REAL,   SPECTRUM/IMAG
##SYMBOL=    X,             R,               I
##VAR_TYPE=  INDEPENDENT,   DEPENDENT,       DEPENDENT
##VAR_FORM=  AFFN,          ASDF,            ASDF
##VAR_DIM=   32768,         32768,           32768
##UNITS=     HZ,            ARBITRARY UNITS, ARBITRARY UNITS
##FACTOR=    0.157963299565203, 1,           1
##FIRST=     4132.6476996994, 0,             0
##LAST=      -1043.33573715361, 0,           0
##MIN=       -1043.33573715361, -252709,     0
##MAX=       4132.6476996994, 465852368,     0
$$ Real data points
##PAGE= N=1
##DATA TABLE= (X++(R..R)), XYDATA
$$ [...]
15753D7520l2979o291N5844K7403j0531N177k0563j8973k0121k1759J5864R352
$$ 47520 14541 8250 64094 91497 80966 86143 65580 46607 26486 4727 20591 29943
15741B9943M896o370l585O780k7942Q283J6538L3303N1007L74m4043k15Q244R2772
$$ 29943 34839 28469 24884 31664 3722 12005 28543 61846 112853 113227 69184 68969 77213 169985
15727A69985P1510j3415p1707k1200j1021L751k5353K0643m5334k764N58k4015
$$ 169985 241495 228080 156373 135173 124152 127903 102550 123193 77859 75095 75653 51638
15715E1638N386M3922K4312l1737j8424K5576O6737J1168l6389m248L4668n8457
$$ 51638 57024 100946 125258 93521 75097 100673 167410 178578 142189 137941 172609 114152
15703A14152K6861N960k9260j9342J7585O798L6218K2244m8288k6883K8761O3255
$$ 114152 141013 146973 117713 98371 115956 122754 158972 181216 132928 106045 134806 198061
15691A98061l1889l4947l6521K4041K2423m0299m8520j8621j3239J7148j4718
$$ 198061 166172 131225 94704 118745 141168 100869 52349 33728 20489 37637 22919
15680B2919l3648m2083K5677P1959k7768k1085j3267K4178N9227L4780l1565K4431
$$ 22919 -10729 -52812 -27135 44824 17056 -4029 -17296 6882 66109 100889 69324 93755
15668I3755K473l8075q025R189n0744l7242m023J33J6158K3574J403j5081K0496
$$ 93755 96228 58153 50128 59317 8573 -28669 -32692 -32559 -16401 7173 8576 -6505 13991
15655A3991J1589M4645J2761K0974l666n4835j9385K4771J6139n139o8728l0051
$$ 13991 25580 70225 82986 103960 100294 45459 26074 50845 66984 61845 -6883 -36934
15643c6934J2350J1343l558m93l932k5262L1019Q945k3038N2271l814k7622j0662
$$ -36934 -24584 -13241 -16799 -17292 -21224 -46486 -15467 -6522 -29560 22711 18897 -8725 -19387
15630a9387O6445j1751L9048N1646j4462l6247p443j473P352L2255O0561p5930
$$ -19387 47058 35307 74355 126001 111539 75292 67849 66376 73728 105983 166544 90614
15618I0614J4836K620k073k7595M423M3826J8698k5713l3445n0436K1628l2389
$$ 90614 105450 108070 105997 78402 82825 126651 145349 119636 86191 35755 57383 24994
15606B4994k1631J3590J7679k7356L1859M8750J1571o648p7478m0259K6463P7002
$$ 24994 3363 16953 34632 7276 39135 87885 99456 92808 15330 -24929 1534 78536
15594G8536N3631j3099n0959l4721J0452o587j1039R190j2051j1824M4704m0454
$$ 78536 132167 119068 68109 33388 43840 37253 26214 35404 23353 11529 56233 15779
15582A5779K139J7753R404p6934k9623L6376k8636j1409N4055O7598J7825j2770
$$ 15779 17918 35671 45075 -31859 -61482 -25106 -53742 -65151 -11096 56502 74327 61557
15570F1557m3298l2663M0392K8100k6356m2126K1256l1674R382R4506l1453o7931
$$ 61557 18259 -14404 25988 54088 27732 -14394 6862 -24812 -15430 79076 47623 -20308
15558b0308l1947P4238Q810l9731p269Q7305O7614o1883l9934n378j9188l7766
$$ -20308 -52255 21983 30793 -8938 -16207 71098 138712 76829 36895 31517 12329 -25437
15546b5437q3609k9765N1775O1696j6700q042k2379K3119N0210Q5500p4234n1336
$$ -25437 -109046 -138811 -87036 -25340 -42040 -50082 -72461 -49342 868 86368 12134 -39202
15534c9202j1305j1034L0530O0165l2987o5031J5151R3214N3429m6151p9566k047
$$ -39202 -50507 -61541 -31011 29154 -3833 -68864 -53713 39501 92930 46779 -32787 -34834
15522c4834j8582j7091j5715K3753j5107l1820L9884J12113O472j7446j7822O634
$$ -34834 -53416 -70507 -86222 -62469 -77576 -109396 -69512 42601 49073 31627 13805 20439
15510B0439m2753j8865J2870j6777N3619Q6143M4971n1253k368j6694M8983J8923
$$ 20439 -22314 -41179 -28309 -45086 8533 94676 139647 88394 86026 69332 118315 137238
15498A37238l5209k0764k0747N758J5029j5724L6003M1235k9489j6073j0163k3067
$$ 137238 102029 81265 60518 66276 81305 65581 101584 142819 113330 97257 87094 64027
15486F4027n884j9912J8864M4160q701J1952L0066n5969l1344k0557m0953J625
$$ 64027 58143 38231 57095 101255 92554 104506 134572 78603 47259 26702 -14251 -12626
15474a2626L9500O1354O4496L824l0195n8491m3616L2376J0247l9828p032k908
$$ -12626 26874 88228 152724 156548 126353 67862 24246 56622 66869 27041 20009 17101
15462A7101J9128Q10J0681M9276J4981K782l6276k3589J877j0694j5919n4747
$$ 17101 36229 37039 47720 96996 111977 114759 78483 54894 56771 46077 30158 -24589
15450b4589m3665N9889N3750j213M6253j6695k3149O2309l3151m3118j4767l1251
$$ -24589 -68254 -8365 45385 44172 90425 73730 50581 112890 79739 36621 21854 -9397
15438i397l1087N621j4960J0842O0024J2725j9128n2249k4253O700k2125j4163
$$ -9397 -40484 -34863 -49823 -38981 21043 33768 14640 -37609 -61862 -55162 -77287 -91450
15426i1450N5798K9133k3653n7373L5458J39046J08060k1153m5589p4697K1982
$$ -91450 -35652 -6519 -30172 -87545 -52087 86959 195019 173866 128277 53580 75562
15415G5562l8810k0070k3485j9561m0295N1614m7352j1770L3805m552j7806j8024
$$ 75562 36752 16682 -6803 -26364 -66659 -15045 -62397 -74167 -40362 -44914 -62720 -80744
15403h0744q76M2655R146l6957M4280L4832k3478M796Q325M2515j7540K7165N9084
$$ -80744 -81620 -38965 -29819 -66776 -22496 12336 -11142 -6346 1979 44494 26954 54119 113203
15390A13203j9003k1164n8455q6793M9142O8960o1156K0623O5319M3269m5305
$$ 113203 94200 73036 14581 -72212 -23070 45890 -15266 5357 70676 113945 68640
15379F8640L57L0373N3891j4927o6127n6102O7425L912l3203l5631k1940N060
$$ 68640 68997 99370 153261 138334 72207 16105 83530 87442 54239 18608 -3332 1728
15367A728M5960J7248L8016j5792P996k5088m9129k4843P291N1142L3493q283
$$ 1728 47688 64936 102952 87160 95156 70068 20939 -3904 3387 54529 88022 79739
15355G9739K8795j0612p2317j319O2989j4577n9751J0579P2326L8392K0963n5618
$$ 79739 108534 97922 25605 24286 87275 72698 12947 23526 95852 134244 155207 99589
15343I9589l7869q4709p1941N7374J5039K4963k5749K4790K3998K4704M9109k2498
$$ 99589 61720 -22989 -94930 -37556 -22517 2446 -23303 1487 25485 50189 99298 76800
15331G6800j5659O269p1976L5495K754q9429l4184k5442l891J4103K1268L5021
$$ 76800 61141 67410 -4566 30929 33683 -55746 -89930 -115372 -119263 -105160 -83892 -48871
15319d8871O0743L612J1356K0818K0326J9686j9762l0699J0979k5242k7168J8501
$$ -48871 11872 15484 26840 47658 67984 87670 67908 37209 48188 22946 -4222 14279
15307A4279R42M8236J9080l8549P019R272L9836L2559k5954r1509l3167M8586
$$ 14279 15221 63457 82537 43988 51007 60279 100115 132674 106720 15211 -17956 30630
15295C0630O2529P9495p4781q2821N8201j8069o069O3664J6465J9468n1038l4402
$$ 30630 93159 172654 97873 15052 73253 55184 49115 112779 129244 148712 97674 63272
15283F3272k0978O652M7354R9584k5284j43660M1589J4946m0023p703L6347M050
$$ 63272 42294 48946 96300 195884 170600 26940 68529 83475 43452 35749 72096 76146
15271G6146j0961L7670K4676l2730k4079m370L5260o929m1758q436J565n5748
$$ 76146 65185 102855 127531 94801 70722 66352 101612 94683 52925 44489 46054 -9694
15259i694m9078R401j1338J6757N5766K372k7389o4658l0698N8589L7944R121
$$ -9694 -58772 -49371 -60709 -43952 11814 14186 -13203 -77861 -108559 -49970 -12026 -2905
15247b905K52l3045J3440K6479P250J4877k8810Q201N8571l1504O163p2306n7089
$$ -2905 -2653 -35698 -22258 4221 11471 26348 -2462 5739 64310 32806 38969 -33337 -90426
15234i0426M5321J23813j5904q781M8696k2965P239M2108J2999M2724K4m8600
$$ -90426 -45105 78708 62804 54023 102719 79754 86993 129101 142100 184824 184848 136248
15222A36248j21906o172N0024K5520K6214n4918J0682J2917o3069j6470J9828
$$ 136248 14342 8170 58194 83714 109928 55010 65692 78609 15540 -930 18898
15211A8898L1554K5455j6791o0891n0065J6281M6656L2810p5715p4026l6187Q632
$$ 18898 50452 75907 59116 -1775 -51840 -35559 11097 43907 -31808 -105834 -142021 -133389
15199a33389J22534K6025j6701k7145J1586M7590K969J3063N4679k7671p3644
$$ -133389 -10855 15170 -1531 -28676 -17090 30500 33469 46532 101211 73540 -104
15188a04m4512K216J4653l3407L0013Q571k510J5517j4076L422l2552K1249M2514
$$ -104 -44616 -42400 -27747 -61154 -31141 -22570 -25080 -9563 -23639 -20217 -52769 -31520 10994
15175A0994k9672J6809J8006M3054j9065j0450j3517J7147J4534N836J12n7474
$$ 10994 -18678 -1869 16137 59191 40126 29676 16159 33306 47840 53676 53788 -3686
15163c686l6992Q4085P6999N0904o4543o2983l9081k5413j5090L7180N8374K7362
$$ -3686 -40678 43407 120406 171310 106767 43784 4703 -20710 -35800 1380 59754 87116
15151H7116M1381n1447l1933l0395j0850m2953J7972P6572L8191m1510o0471l6920
$$ 87116 128497 77050 45117 14722 3872 -39081 -21109 55463 93654 52144 -8327 -45247
15139d5247M1568N8151P391j4773j0617K0597k6434k5532j602O2078j9519l4382
$$ -45247 -3679 54472 61863 47090 36473 57070 30636 5104 3502 65580 46061 11679
15127A1679J571q606j5539O2616N4291k0996k228J008l820m7550k509O8299o769
$$ 11679 13250 4644 -10895 51721 106012 85016 82788 83796 79976 32426 29917 98216 91447
15114I1447l0564p48J2608k514k1366k6423k7407j8554J4741L6589Q744J3838
$$ 91447 60883 60135 72743 70229 48863 22440 -4967 -23521 -8780 27809 36553 50391
15102E0391J14n2360j2420J2196j5886J4414J82K4770L2062j7961J6573J6510
$$ 50391 50505 -1855 -14275 -2079 -17965 -3551 -3369 21401 53463 35502 52075 68585
15090F8585l2513j4605j8522p9091R111P6822R1570l5415k0488l5111N3920K3902
$$ 68585 36072 21467 2945 -76146 -67035 9787 101357 65942 45454 10343 64263 88165
15078H8165J4865L5102K6413q0214q7244n553R0990L3596p319n234M0343j4351
$$ 88165 103030 138132 164545 84331 -2913 -8466 82524 116120 108801 103567 143910 129559
15066A29559m3395K9280K2977n6447J7847J2393m8403j5061k43K1689j6635K0538
$$ 129559 86164 115444 138421 81974 99821 112214 63811 48750 48507 70196 53561 74099
15054G4099K037l9066o1907K3511j3471N196j1707m1860K2958O5509j0584n301
$$ 74099 76136 37070 -24837 -1326 -14797 -9601 -21308 -63168 -40210 25299 14715 9414
15042I414N20K344J2968j6448M405j8874J4722R6234j1637M7206J474j4153o4110
$$ 9414 9934 12278 25246 8798 13203 -5671 9051 105285 93648 140854 142328 128175 64065
15029F4065l2727q797l3124m0531L4393O2978m6998j08004n0052N9563M2905j2101
$$ 64065 31338 22541 -10583 -51114 -16721 46257 -741 -108745 -158797 -99234 -56329 -68430
15017f8430j1268L719K4835o698k1872K2052R247J0490J3163M6311K279J0142
$$ -68430 -79698 -75979 -51144 -57842 -79714 -57662 -48415 -37925 -24762 21549 23828 33970
15005C3970R3417N0851o9378l7669M6110l8912o7279j530M2951O751p4493L3516
$$ 33970 127387 178238 108860 71191 117301 78389 11110 9580 52531 59282 -15211 18305
14993A8305M4013n4926j613M952n0955o2640K1642Q360K6766p688M6838J0407
$$ 18305 62318 7392 5779 10731 -40224 -102864 -81222 -72862 -46096 -53784 -6946 3461
14981C461l7178L7132J699p26o874k8933k0086k0709M948K7823k8118l8120M9758
$$ 3461 -33717 3415 5114 4388 -2486 -31419 -51505 -72214 -67266 -39443 -67561 -105681 -55923
14968e5923J3633M8622K0962m8334q9253k9125N7904M8547k3876K221N2201K4645
$$ -55923 -42290 6332 27294 -21040 -110293 -139418 -81514 -32967 -56843 -54622 -2421 22224
14956B2224l3347n4208n3609N8780R8669R089n1334r022l1249J4103K8875O1081
$$ 22224 -11123 -65331 -118940 -60160 38509 47598 -3736 -12758 -44007 -29904 -1029 60052
14944F0052l1245n8751K0408K3827K2767l3420l9165M1605M5435j1331O1554L2765
$$ 60052 28807 -29944 -9536 14291 37058 3638 -35527 6078 51513 40182 101736 134501
14932A34501J9367j4648m6445J2296m9370n5930O0634j19M0666J3014o419n9263
$$ 134501 153868 139220 92775 105071 55701 -229 60405 60286 100952 113966 107547 48284
14920D8284n0858K5946M0400N811k179j8931l2264m2526J8426m001O827r943k9434
$$ 48284 -2574 23372 63772 69583 67404 48473 16209 -26317 -7891 -11892 -5065 -15008 -44442
14907d4442P661k410N6270N673j7948N4122k2002J4846O1165O356j5708k463o8310
$$ -44442 -36781 -39191 17079 22752 4804 58926 36924 51770 112935 119291 103583 101120 32810
14894C2810J8366j8138o0131J8827N5689n0409p441M6164J17265M469j29473n0931
$$ 32810 51176 33038 -27093 -8266 47423 -2986 -10427 35737 153002 157471 27998 -22933
14882b2933K9946M8355M91l617K8114J3181K211j6744m7310N312M854l7209j19662
$$ -22933 7013 55368 55859 52242 80356 93537 95748 79004 31694 37006 41860 4651 -115011
14869a15011j7819N0455R3224L3287j571j1154n3449l4876l0682O51K5161N9053
$$ -115011 -132830 -82375 10849 44136 42565 31411 -22038 -56914 -87596 -86945 -61784 -2731
14857b731p90j1450j0699M2449L060R625j6322k3507j6212L098K0761O1378J0320
$$ -2731 -3521 -14971 -25670 16779 19839 29464 13142 -10365 -26577 -23479 -2718 58660 68980
14844F8980k9660J2776O2390j292p1058k6814K1024N75p69L1449k324m9729q3626
$$ 68980 39320 52096 114486 113194 42136 15322 36346 36921 36152 67601 65277 15548 -68078
14831f8078q286O0905N2754n8149j2908J9956j0958K2036m018K1040o825L0421
$$ -68078 -76364 -15459 37295 -20854 -33762 -13806 -24764 -2728 -6746 14294 7469 37890
14819C7890Q904o182L4893M646Q703J6066j2675k6163K1584J0334n2426K648J3445
$$ 37890 46794 40612 75505 80151 88854 104920 92245 66082 87666 98000 45574 48222 61667
14806F1667L6658j8103j43l8660j2669M1856n7201n7261l5155o5301L6714M1768
$$ 61667 98325 80222 80079 41419 28750 70606 13405 -43856 -79011 -144312 -107598 -65830
14794f5830l4235K2989Q7920O2854k9389m1915L7233M0244k8600O632k1935m9892
$$ -65830 -100065 -77076 10844 73698 44309 2394 39627 79871 51271 57903 35968 -13924
14782a3924m9292j2260m0689O562O90N3493Q7217N8572j3702l0253l4832j8197
$$ -13924 -63216 -75476 -116165 -109603 -108913 -55420 31797 90369 76667 46414 11582 -6615
14770f615J8896j3780L8000K529L1986r967m4101l0767l6964K96K5351o960p179
$$ -6615 12281 -1499 36501 39030 71016 61049 16948 -13819 -50783 -50487 -25136 -32096 -39275
14757c9275P816P6905L3066N2724J1909o7401r6502K888n8258M8046N8833M7538
$$ -39275 -31459 45446 78512 131236 143145 75744 -20758 -17870 -76128 -28082 30751 78289
14745G8289n3162q153K2978k8874L4586R696p219l3666J8941J19433K078l0760
$$ 78289 25127 16974 39952 11078 45664 55360 48141 14475 33416 152849 154927 124167
14733A24167o941l9958n2153l1681R75k0900r264L1720M5883j929k3627p2826
$$ 124167 117226 77268 25115 -6566 -5591 -26491 -35755 -4035 41848 39919 16292 -56534
14721e6534k674k7604j851K4455P9227j3826M7749O4979k7035m7210k79k7224
$$ -56534 -59208 -86812 -88663 -64208 15019 1193 48942 113921 86886 39676 39397 12173
14709A2173j3276M5056l737m5519k1941p096k895j1142J2777m168q860L6752K2146
$$ 12173 -1103 43953 40216 -5303 -27244 -34340 -37235 -48377 -35600 -39768 -48628 -11876 10270
14696A0270K1283P621p618L7130K0393p2386m280k2288k7765n6037R431L8213
$$ 10270 31553 39174 31556 68686 89079 16693 12413 -9875 -37640 -93677 -84246 -46033
14684d6033K0595R886j3197L063n4324o4445J7510O4062K8366k1195m5507K66
$$ -46033 -25438 -15552 -28749 -25686 -80010 -144455 -126945 -62883 -34517 -55712 -101219 -100953
14672a00953K2793K4323m3894o0788K0070M1733m811O3222M9588M5070p1297l513
$$ -100953 -78160 -53837 -97731 -158519 -138449 -96716 -101527 -38305 11283 56353 -14944 -18457
14660a8457R327k4437L0810l4644n9714L448J7317L8595J09N2588O6933l3101
$$ -18457 -9130 -33567 -2757 -37401 -97115 -93667 -76350 -37755 -37646 14942 81875 48774
14648D8774m9311k2256r403q126Q751P981k8436M3935R4459n7624j198L6006J7017
$$ 48774 -537 -22793 -32196 -40322 -31571 -23590 -52026 -8091 86368 28744 27546 63552 80569
14635H0569m9323m6491R164L6559l4713k1944j0709k5885K4873K3002J3753o3593
$$ 80569 31246 -15245 -6081 30478 -4235 -26179 -36888 -62773 -37900 -14898 -1145 -64738
14623f4738M2338k5472q3608k9451N1678P6188O2386m0822r0687k9618P0755k5677
$$ -64738 -22400 -47872 -131480 -160931 -109253 -33065 29321 -11501 -102188 -131806 -61051 -86728
14611h6728J508L6080M3174L3425m5447k0985K65M9025K9896n2419m4247N1076
$$ -86728 -85220 -49140 -5966 27459 -17988 -38973 -38708 10317 40213 -12206 -56453 -5377
14599e377M6396M8514J7957l6551m617l7329J2760R294j966m021M3256M9683j41
$$ -5377 41019 89533 107490 70939 66322 28993 41753 51047 49081 45060 88316 137999 137858
14586A37858k8527P003l0316L1647m9759o6097m8782M4836M6310o2597M8812J01903
$$ 137858 109331 116334 86018 117665 67906 1809 -46973 -2137 44173 -18424 30388 132291
14574A32291k2725o0778m2337K0272L2958L21m2701m147l54L2562M285l6483p8837
$$ 132291 109566 48788 6451 26723 59681 60002 17301 13154 12800 45362 49647 13164 -65673
14561f5673j4348J1348k4636J6239M8963M979m3049K9765J3953k0492j166K9723
$$ -65673 -80021 -68673 -93309 -77070 -28107 -23128 -66177 -36412 -22459 -42951 -44117 -14394
14549a4394j1769J8534L9938J0908o934o684l6172k9141j582P523L5972j3707
$$ -14394 -26163 -7629 32309 43217 36283 29599 -6573 -35714 -37296 -29773 6199 -7508
14537g508m0496j5834q148N021O6926P9701J9795j7524j6729k7398L1134J4107
$$ -7508 -48004 -63838 -71986 -66965 -39 79662 99457 81933 65204 37806 68940 83047
14525H3047j7000l6808r4189J1163M3790J5050K5055q766m0432K0154J8696m265
$$ 83047 66047 29239 -64950 -53787 -9997 5053 30108 21342 -19090 1064 19760 15495
14513A5495J9884Q066j0252o7255k8758L2367K0261L0138K2018m3807K088K6644
$$ 15495 35379 43445 33193 -34062 -62820 -30453 -10192 19946 41964 -1843 245 26889
14501B6889l3388m5871j1511M0941P9473M4651n1403k3896N4522Q4512k7966m1340
$$ 26889 -6499 -52370 -63881 -22940 56533 101184 49781 25885 80407 164919 136953 95613
14489I5613k2459r7380m8290n082N7392K8954K322L6605J0323j0915j3873k1758
$$ 95613 73154 -24226 -72516 -77598 -20206 8748 11070 47675 57998 47083 33210 11452
14477A1452q489k2221Q340L3073J2857M686J0421K0780K076M6973m0297m4082
$$ 11452 2963 -19258 -10918 22155 35012 39698 50119 70899 72975 119948 79651 35569
14465C5569K6724q548l0874o3113n3710J8053O6267J6722n8951l4643J330N8560
$$ 35569 62293 53745 22871 -40242 -93952 -75899 -9632 7090 -51861 -86504 -85174 -26614
14453b6614r067k3031m613j1918K0909q400N2001M5097L0953L9162J8304K3735
$$ -26614 -35681 -58712 -63325 -75243 -54334 -62734 -10733 34364 65317 104479 122783 146518
14441A46518J0297m9503r9279n6901M6016P7497M7765L0566o0767N91M807L3734
$$ 146518 156815 107312 8033 -48868 -2852 74645 122410 152976 92209 92800 97607 131341
14429A31341k0620j17l134k8146K487n092j4634l9040j8107K9434N3568L4825
$$ 131341 110721 110604 107470 79324 81811 76719 62085 23045 4938 34372 87940 122765
14417A22765m2765l7219n4503O37K5065L5921o297k5996k6887l4466j2231O1884
$$ 122765 80000 42781 -11722 -11085 13980 49901 43604 17608 -9279 -43745 -55976 5908
14405E908L0225l6688J0005K4924k1964k9742L4074L4746p67N665n6771n601M7858
$$ 5908 36133 -555 9450 34374 12410 -17332 16742 51488 50721 56386 -385 -5986 41872
14392D1872k5145o5063j5269Q5085N3720j8195p9357k8650J98J2758l3326k9977
$$ 41872 16727 -48336 -63605 21480 75200 57005 -22352 -51002 -50804 -38046 -71372 -101349
14380a01349q22l411K9559K3499J6827l3249k2784O337L978L3479N5446j9149
$$ -101349 -102171 -105582 -76023 -52524 -35697 -68946 -91730 -85393 -81415 -47936 7510 -11639
14368a1639k4622n071M663M9966k6127j6388n8363k5247L8691j1171N2381L5033
$$ -11639 -36261 -41332 -36669 13297 -12830 -29218 -87581 -112828 -74137 -85308 -32927 2106
14356B106n575J7773K2460k1799j1757m0830l3528r695j5203m1486K2154M133
$$ 2106 -3469 14304 36764 14965 3208 -37622 -71150 -80845 -96048 -137534 -115380 -111247
14344a11247J2382N1583K2716M494J3239p8116m0699K7300K6234O5882O9227j6038
$$ -111247 -98865 -47282 -24566 -20072 -6833 -84949 -125648 -98348 -72114 -6232 62995 46957
14332D6957M86K4736k6157J1694q0677k1299M4380R714K2850j03688J6803P919
$$ 46957 47443 72179 46022 57716 -22961 -44260 120 9834 32684 -71004 -54201 -46282
14320d6282M1806k7428L7208O1858J7239j5905o1053m9008q769k441j4425N7771
$$ -46282 -4476 -31904 5304 67162 84401 68496 7443 -41565 -50334 -52775 -67200 -9429
14308i429L0263j5395L1585M5177N1739l3122l0342n1051L8554O3353k6319l8735
$$ -9429 20834 5439 37024 82201 133940 100818 70476 19425 57979 121332 95013 56278
14296E6278l9204P145K7993P3726J2781n4823k9939o0731p3516o455K7251K3257
$$ 56278 17074 24219 52212 125938 138719 83896 53957 -6774 -80290 -86745 -59494 -36237
14284c6237m0699L9273j3192J6334O8843L5869J490q163n8347k0271K2485J3583
$$ -36237 -76936 -37663 -50855 -34521 34322 70191 71681 63518 5171 -15100 7385 20968
14272B0968n2039P624L9491o0542k0776J2723l2280J5418J9715K5912N1115m0918
$$ 20968 -31071 -23447 16044 -44498 -65274 -52551 -84831 -69413 -49698 -23786 27329 -13589
14260a3589K6882l052L0988L745J8284l6844n9543p5129L4684O533J7764N6056
$$ -13589 13293 10241 41229 44974 63258 26414 -33129 -108258 -73574 -67041 -49277 6779
14248F779k2582j8241J2999J6559q192j0948O4754L932K2750K0474j8193m7335
$$ 6779 -15803 -34044 -21045 -4486 -12678 -23626 41128 45060 67810 88284 70091 22756
14236B2756r65J7150K6292J6774p3631q2669r560O2022M1569j7579k8177P595
$$ 22756 21791 38941 65233 82007 8376 -74293 -83853 -21831 19738 2159 -26018 -18423
14224a8423n5149O9924J7944J7471L6029n3646O441K8666j1899j1418o9654m8722
$$ -18423 -73572 -3648 14296 31767 67796 14150 20591 49257 37358 25940 -43714 -92436
14212i2436M6235N6298l6571k91j44k060J7020k4800R762k8554o1092J10597R4342
$$ -92436 -46201 10097 -26474 -26765 -26909 -28969 -11949 -36749 -26987 -55541 -116633 -6036 88306
14199H8306j0607n9256j7030k7559k5880m4501K9611N6305K8379n0815m9600O5770
$$ 88306 77699 18443 1413 -26146 -52026 -96527 -66916 -10611 17768 -33047 -82647 -16877
14187a6877R493k6669k9843l6035k982k2619P1352K5387L7062k6880k2385l6425
$$ -16877 -7384 -34053 -63896 -99931 -102913 -125532 -54180 -28793 8269 -18611 -40996 -77421
14175g7421K1320j7711N91K2293N8659j0652N539K8311j4580j3883k893k3233
$$ -77421 -56101 -73812 -73221 -50928 7731 -2921 2618 30929 16349 2466 -427 -23660
14163b3660L0333L9284K5749n154o0873m836J49l4331m1199N2301O9639J6671
$$ -23660 6673 45957 71706 66552 5679 843 992 -33339 -74538 -22237 47402 64073
14151F4073j048o7708O4743K1704j2824L3667n4046K5269j1524k1107k3835j414
$$ 64073 63025 -4683 60060 81764 68940 102607 48561 73830 62306 41199 17364 15950
14139A5950J9482q957K7758J2883n6199l7645j4340K5295M6342K4688k6853L6751
$$ 15950 35432 26475 54233 67116 10917 -26728 -41068 -15773 30569 55257 28404 65155
14127F5155K3946k3793J3823k737j5800M5184n0089q3146m8610k3702J5510N79
$$ 65155 89101 65308 79131 76394 60594 105778 55689 -27457 -76067 -99769 -84259 -83680
14115h3680q253m803n205M9178O7909L6849l6708q1715J7328j0615k4900K80M3207
$$ -83680 -91933 -96736 -101941 -52763 15146 51995 15287 -66428 -49100 -59715 -84615 -84335 -41128
14102d1128p957p308L4124k2222j9013m060l3675M6132O9958K5978K1992n2614
$$ -41128 -49085 -56393 -22269 -44491 -63504 -67564 -101239 -55107 14851 40829 62821 10207
14090A0207l3303l027N219j6281L0543M2996N995L4770o5539n937L3627j5722
$$ 10207 -23096 -26123 -20904 -37185 -6642 36354 42349 77119 11580 5643 39270 23548
14078B3548K4352K7755J746j6317j8889M2134j7443p4592J1011O801j6703o3786
$$ 23548 47900 75655 77401 61084 42195 84329 66886 -7706 3305 10106 -6597 -70383
14066g0383l9126K8471K1699R335J9647N2012l8472j9652n473R521k7453K121
$$ -70383 -109509 -81038 -59339 -50004 -30357 21655 -16817 -36469 -41942 -32421 -59874 -57753
14054e7753k8575L7417P1211n699n3270j6399l9282m5076L7729O8195N4693J6123
$$ -57753 -86328 -48911 22300 16601 -36669 -53068 -92350 -137426 -99697 -31502 23191 39314
14042C9314N532k534M3433j8418m0546m7400q817M6681J1364J2993n6855j00839
$$ 39314 44846 42312 85745 67327 26781 -20619 -29436 17245 28609 41602 -15253 -116092
14030a16092l1P2668N3720J6029m6557l3478k3621J7324j4960l0137L9377M484
$$ -116092 -116123 -43455 10265 26294 -20263 -53741 -77362 -60038 -74998 -105135 -65758 -61274
14018f1274j790J9599k930j1700J3588L6431Q200p750M7088O8551l6356m1023
$$ -61274 -63064 -43465 -46395 -58095 -44507 -8076 124 -7626 39462 108013 71657 30634
14006C0634n4145N0499k354L572J604k48l856m4671P00J7033Q2484J432n4839
$$ 30634 -23511 26988 24634 28206 29810 29562 25706 -18965 -18265 -1232 81252 82684 27845
13993B7845j6364m7420n1657K7285K3690J5408J9583L0531M1354M6344m14n8706
$$ 27845 11481 -35939 -87596 -60311 -36621 -21213 -1630 28901 70255 116599 116185 57479
13981E7479j0789n0249K8927N3957J5810o5860k4237j9963J1928j2896L6521j929
$$ 57479 46690 -3559 25368 79325 95135 29275 5038 -14925 -2997 -15893 20628 18699
13969A8699J7124k9884m2609J2469K8221Q0879J7615m3312k9475n3199n6711j5812
$$ 18699 35823 5939 -36670 -24201 4020 84899 102514 59202 29727 -23472 -80183 -95995
13957i5995M9188J06261K2933n5687k6782O4896n5032o9832j0170J5416j5156
$$ -95995 -46807 59454 82387 26700 -82 64814 9782 -60050 -70220 -54804 -69960
13946f9960k6360k0233L3779J47636L3180l3713l269j6062l1714J3582k5414m6592
$$ -69960 -96320 -116553 -82774 64862 98042 64329 61060 44998 13284 26866 1452 -45140
13934d5140o559J8255k8781k4004K6381J8124M1401M9350k2009k2707j5444k814
$$ -45140 -51699 -33444 -62225 -86229 -59848 -41724 -323 49027 27018 4311 -11133 -13947
13922a3947M797K2971j7285J983p2n8936o2642J9136L9892J3816j8771k152Q598
$$ -13947 -9150 13821 -3464 -1481 -1553 -60489 -123131 -103995 -64103 -50287 -69058 -71210 -62612
13909f2612N9431M3145O3747J0997m8763n4379o836q831n5718L2183N5252M626
$$ -62612 -3181 39964 103711 114708 65945 11566 4730 -4101 -59819 -27636 27616 32242
13897C2242K5536m5766l1517J8212l1919k6901N9085J4599j9966L464M0688J5204
$$ 32242 57778 12012 -19505 -1293 -33212 -60113 -1028 13571 -6395 -2931 37757 52961
13885E2961n329l1866M3124m147m3296j0995l5661J0402O9463k2279q3724k1151
$$ 52961 47632 15766 58890 54743 11447 452 -35209 -24807 44656 22377 -61347 -82498
13873h2498R8312K1468L1989l1450K5747M6107j09515n3585k0859j3334J4663
$$ -82498 15814 37282 69271 37821 63568 109675 160 -53425 -74284 -87618 -72955
13862g2955R312J5533O3791P3093l016K177m2700J3819o07j1685J2528l2680o323
$$ -72955 -63643 -48110 15681 88774 85758 87935 45235 59054 58447 46762 59290 26610 20287
13849B0287o34j4083k0816m7528l0239K9647J7119K1124J5992P3724m2835l5092
$$ 20287 19653 5570 -15246 -62774 -93013 -63366 -46247 -25123 -9131 64593 21758 -13334
13837a3334P7093L8235J7209o2130j3584M3702R041k0551p4335l1417k4138l5659
$$ -13334 63759 101994 119203 57073 43489 87191 96232 75681 1346 -30071 -54209 -89868
13825h9868p2485J2522M3757M5574j9926K0260p598j1974L2130P9470k0397O220
$$ -89868 -162353 -149831 -106074 -60500 -80426 -60166 -67764 -79738 -47608 31862 11465 17685
13813A7685J4827o8778j7430M5659J0520k6736l9713K5982k3402m983N8499M2376
$$ 17685 32512 -36266 -53696 -8037 2483 -24253 -63966 -37984 -61386 -66369 -7870 34506
13801C4506j388L817J0174l0270k371o4427j6646J1843J4865J1910l2162r866
$$ 34506 33118 36935 47109 16839 14468 -49959 -66605 -54762 -39897 -27987 -60149 -70015
13789g0015k932L1083K4273O356K1173k5784j0417p6143k6069K1575J7060P8263
$$ -70015 -72947 -41864 -17591 -11235 9938 -15846 -26263 -102406 -128475 -106900 -89840 -11577
13777a1577k01j0850O9986L7288n0351r480m5464m38N2364K8018j5583o488o494
$$ -11577 -11778 -22628 47358 84646 34295 24815 -20649 -21087 31277 59295 43712 37224 30730
13764C0730j1699o4974n9446L9172R0333J8243j1848m5643k285M5311L6385k3601
$$ 30730 19031 -45943 -105389 -66217 24116 42359 30511 -15132 -17417 27894 64279 40678
13752D0678n531P644j4457m7432J3318j4598o388l660K166j3360M6574N9314n2407
$$ 40678 35147 42791 28334 -19098 -5780 -20378 -26766 -30426 -28260 -41620 4954 64268 11861
13739A1861O18O4791j0623o488k3937m0124L0740L3089n0138j7094j1118L60Q3703
$$ 11861 12479 77270 66647 60159 36222 -3902 26838 59927 9789 -7305 -18423 -18063 65640
13726F5640N9709n3154j6272K6465k4337j5530J6639l7817j0800K7703R361O38
$$ 65640 125349 72195 55923 82388 58051 42521 59160 21343 10543 38246 47607 48245
13714D8245R917r567j8474j264k7102J0762L392k2200j31J2904l1942J2046q937
$$ 48245 58162 48595 30121 28857 1755 12517 15909 -6291 -6422 6482 -25460 -13414 -22351
13701b2351K2298J2705j0047j480L0189L1624l3351j943K303M0779K3276j1808
$$ -22351 -53 12652 2605 1125 31314 62938 29587 27644 29947 70726 94002 82194
13689H2194p681M865j2627J2000K2346k3730l5606J3787M9149J3915p8122j09948
$$ 82194 74513 79378 66751 78751 101097 77367 41761 55548 104697 118612 40490 -69458
13677f9458o263J9510J1122j269j1577K8786P1303L3227m4375j02940o702K2621
$$ -69458 -75721 -56211 -45089 -46358 -57935 -29149 42154 75381 31006 -71934 -78636 -56015
13665e6015L7454O4411O141n2523j2726L3673M524L0934L8990J3432P003k4511
$$ -56015 -18561 45850 51991 -532 -13258 20415 24939 55873 94863 108295 115298 90787
13653I0787l6318k1597O014l85m5690k0292L4598R491K8411K8343L9876M8021
$$ 90787 54469 32872 38886 38501 -7189 -27481 7117 16608 45019 73362 113238 161259
13641A61259J3024q7664q9733j8873K1478K4247P699j1027k140j8864k6330m6621
$$ 161259 174283 86619 -3114 -21987 -509 23738 31437 20410 18270 -594 -26924 -73545
13629g3545L8488J6837J3254N3405J09l4587k7409N621J1394K498k0201M7241
$$ -73545 -35057 -18220 -4966 48439 48548 13961 -13448 -7827 3567 6065 -14136 33105
13617C3105l4516N633N326K8632N1654l949j2089k2642k3972o44L621l6181J0581
$$ 33105 -1411 4222 9548 38180 89834 85885 73796 51154 27182 26538 30159 -6022 4559
13604D559K1378K6247j3209k7086K6566J2796k3888k0446J7188k2727j3196K379
$$ 4559 25937 52184 38975 11889 38455 51251 27363 6917 24105 1378 -11818 -9439
13592i439J6495O6290K2548J2357K0028l302l8464l1018J9543L3485m7468p2636
$$ -9439 7056 73346 95894 108251 128279 124977 86513 55495 75038 108523 61055 -11581
13580a1581r3698M8117O7846L2806O1867k3962l1256J290N583o5523J1392J5025
$$ -11581 -105279 -57162 10684 43490 105357 81395 50139 51429 57012 -8511 2881 17906
13568A7906K8786K5334K9970k0472o9792k1256K7735J6356l9577M177J00246m7397
$$ 17906 46692 72026 101996 81524 11732 -9524 18211 34567 -5010 -833 99413 52016
13556E2016j10809n1793J0486K9557K3802J5107J0675J9184o646n7820m7276J3540
$$ 52016 -58793 -110586 -100100 -70543 -46741 -31634 -20959 -1775 -8421 -66241 -113517 -99977
13544i9977M5016N3026L6089J5567r4746j17880J5646N8333L0060p047N4406O7181
$$ -99977 -54961 -1935 34154 49721 -45025 -162905 -147259 -88926 -58866 -65913 -11507 55674
13532E5674j8664K2673K284k0185K5576m8728l3047O1437O9636o406k9036k4209
$$ 55674 37010 59683 61967 41782 67358 18630 -14417 47020 116656 110250 81214 57005
13520E7005m2133n5111l2901K7650k1056O363K0590k9777O54J21184L7789O978
$$ 57005 14872 -40239 -73140 -45490 -66546 -60183 -39593 -69370 -68716 52468 90257 97235
13508I7235L3938p2668k2825l9104o1480P8476O0543l0260m8314k2964j0745k0101
$$ 97235 131173 58505 35680 -3424 -64904 13572 74115 43855 -4459 -27423 -38168 -58269
13496e8269p7205L0564N2709L4222L2402L4550q0431m7180K1709m9576M0189L5359
$$ -58269 -135474 -104910 -52201 -17979 14423 48973 -31458 -78638 -56929 -106505 -66316 -30957
13484c0957J9140K8391N9179m5482q2945n5237m071k702J8151K7139J02273J4121
$$ -30957 -11817 16574 75753 30271 -52674 -107911 -111982 -114684 -96533 -69394 32879 47000
13472D7000l7177K8063l9082j11258m7428Q2556j1807J612J2887J3395r203j0123
$$ 47000 9823 37886 -1196 -112454 -159882 -77326 -89133 -87521 -74634 -61239 -70442 -80565
13460h0565m733L6074K6304N3751Q2598k3169j26507M309N3850j7828k510N9251
$$ -80565 -85298 -49224 -22920 30831 113429 90260 -36247 -31938 21912 4084 1574 60825
13448F0825n6969n8038l2194M4278J5822R0158N948o3356n860o251l5400j2787
$$ 60825 3856 -54182 -86376 -42098 -26276 63882 69830 6474 614 -5637 -41037 -53824
13436e3824J6001q906j4967N154M5535M9842l1155k4723j6446j2106O839r102
$$ -53824 -37823 -46729 -61696 -56542 -11007 38835 7680 -17043 -33489 -45595 -38756 -47858
13424d7858n7998m3595Q8625J7202K5019o0295m3293L9237J5999N5570P2194N2073
$$ -47858 -105856 -149451 -60826 -43624 -18605 -78900 -122193 -82956 -66957 -11387 60807 112880
13412A12880l3467O927n2343n5500m8206L1244j9279L5465Q5415l2546K0671m7609
$$ 112880 79413 86340 33997 -21503 -69709 -38465 -57744 -22279 63136 30590 51261 3652
13400C652J1081L4968k6693O039L5108p612J0382N0849l8122n0328l8840k6930
$$ 3652 14733 49701 23008 29047 64155 56543 66925 117774 79652 29324 -9516 -36446
13388c6446j7028K6981L4300k4143n7530J6918O6440L4926j11024l6655j7845
$$ -36446 -53474 -26493 7807 -16336 -73866 -56948 9492 44418 -66606 -103261 -121106
13377a21106N313K7914L3429J4726l4054K6255L9766j1k2035l5003J53K3057M469
$$ -121106 -115793 -87879 -54450 -39724 -73778 -47523 -7757 -7768 -29803 -64806 -64653 -41596 -37127
13364c7127N0060P384J7802J6896p2773j6939M9272k7427m0470J246J4652n907
$$ -37127 12933 20317 38119 55015 -17758 -34697 14575 -12852 -53322 -52076 -37424 -43331
13352d3331R533j1218k6326L4221N3994O6131n986r2817n6533k0860R1332L692
$$ -43331 -33798 -45016 -71342 -37121 16873 83004 77018 -15799 -72332 -93192 -1860 1832
13340A832n61P7446K1471o4545m0971l8105J1295k1756K4391K6058N3519k8640
$$ 1832 1271 78717 100188 35643 -5328 -43433 -32138 -53894 -29503 -3445 50074 21434
13328B1434m0859j6110N220n1313k9076M2819m626j1666L8767M6367K2252M0648
$$ 21434 -19425 -35535 -30315 -81628 -110704 -67885 -72511 -84177 -45410 957 23209 63857
13316F3857K7379l8099j398l2876l3125K7122O813M0822L342n830j7394J1494
$$ 63857 91236 53137 51739 18863 -14262 12860 19673 60495 63837 58007 40613 52107
13304E2107J9891l7134l4773N4279j7753q25J0346N2351K5958l3154k8008k3409
$$ 52107 71998 34864 91 54370 36617 35792 46138 98489 124447 91293 63285 39876
13292C9876M8682L2933p8738o7765J3750R4190M006j09662k2513M7916P697M1754
$$ 39876 88558 121491 42753 -25012 -11262 82928 86934 -22728 -45241 2675 10372 52126
13280E2126J7030k4522p814j4067q0614j134N3305K7191M6911l597k3119l4334
$$ 52126 69156 44634 36820 22753 -57861 -58995 -5690 21501 68412 64815 41696 7362
13268G362J4494j9112k8179k6637J8282K9966J6069K9721L7384l246l0916m8649
$$ 7362 21856 2744 -25435 -52072 -33790 -3824 12245 41966 79350 76104 45188 -3461
13256c461K200p505m5484m333Q1257O8855L8726p783r091l8631p0596L1120n577
$$ -3461 -1261 -8766 -54250 -58583 22674 91529 130255 122472 113381 74750 4154 35274 29697
13243B9697m712j7617j5058j1884q6091J0486M0862L8005L7932M5661J4200q069
$$ 29697 24985 7368 -7690 -19574 -105665 -95179 -54317 -16312 21620 67281 81481 73412
13231G3412m7625n9766j4877N6404L8746L5042n5263q0868J8805M3499K3143j7694
$$ 73412 25787 -33979 -48856 7548 46294 81336 26073 -54795 -35990 7509 30652 12958
13219A2958k1039j6208L2436M3922m2799k4237l9426M6943M9282k3390L1389j3119
$$ 12958 -8081 -24289 8147 52069 9270 -14967 -54393 -7450 41832 18442 49831 36712
13207C6712m8740k063L7676L5588k6320M1302N4907q3654q4056O4260L9490r1170
$$ 36712 -12028 -14091 23585 59173 32853 74155 129062 45408 -38648 25612 65102 -26068
13195b6068J3298J3754j9459j0625M2489N1798l2755j0144O8632J4467q0007k7895
$$ -26068 -12770 984 -18475 -29100 13389 65187 32432 22288 90920 105387 25380 -2515
13183b515j918K5368L6695L8759l0754j4562o0761m2040P0864r387j9858o011
$$ -2515 -4433 20935 57630 96389 65635 51073 -9688 -51728 19136 9749 -10109 -16120
13171a6120J3702K9259l4526j7364j4431J1512Q4959L524l6917k3733m537j2490
$$ -16120 -2418 26841 -7685 -25049 -39480 -27968 56991 60515 23598 -135 -4672 -17162
13159a7162k4278N0856K6385o271O9697L4079l1645J7712l4615k3317J8611m0144
$$ -17162 -41440 9416 35801 29530 99227 133306 101661 119373 84758 61441 80052 39908
13147C9908p8487L2088N1141Q776r041L2563Q087o7781k3906k4868N951J6778
$$ 39908 -38579 -6491 44650 53426 44385 76948 85035 17254 -6652 -31520 -25569 -8791
13135h791N7195P3371l5342j2897L2192j3546j4268j1959j0155L5229k8936o0636
$$ -8791 48404 121775 86433 73536 105728 92182 77914 65955 55800 91029 62093 1457
13123A457J3355O9010K3218M3059m2660o2548m7689K7230J8025r907K2847J8675
$$ 1457 14812 83822 107040 150099 107439 44891 -2798 24432 42457 32550 55397 74072
13111G4072N0695o0294j6490l9123J8907N4279l5452k3595N766M3877N2453m6394
$$ 74072 124767 64473 47983 8860 27767 82046 46594 22999 28765 72642 125095 78701
13099G8701P573M9354M3609N6511n1795p0513K2531m636n0456p8492l6691m769
$$ 78701 86274 135628 179237 235748 183953 113440 135971 131335 80879 2387 -34304 -39073
13087c9073J0711K1043j0527J5688O4523K7038k0492N488o8896o7332j0542K6503
$$ -39073 -28362 -7319 -17846 -2158 62365 89403 68911 74399 5503 -61829 -72371 -45868
13075d5868N7033N9724J0197J3805q978K2600O9038n0672p7376j5001J5144o613
$$ -45868 11165 70889 81086 94891 85913 108513 177551 126879 49503 34502 49646 43033
13063D3033j4186j741R516m0184K9586K161M0327M4218K758j2325n0855n498L5242
$$ 43033 28847 27106 36622 -3562 26024 28185 68512 112730 115488 103163 52308 46810 82052
13050H2052M3805n0050k2592L0413M3725k9687o7445m7251j8525L2668J08156
$$ 82052 125857 75807 53215 83628 127353 97666 30221 -17030 -35555 -2887 105269
13039A05269K8655l5826j3235K8892q289K6610L4090n6819k8088j6774j5825p49
$$ 105269 133924 98098 84863 113755 105466 132076 166166 109347 81259 64485 48660 47911
13027D7911j005O034M0202k1958K8401L5098L2604J1238j8850p5941m7335J016
$$ 47911 46906 52940 93142 71184 99585 134683 167287 178525 159675 83734 36399 37415
13015C7415N133J8021N0233k1004o6192J3683N4818M5721j3214K847O1972l6826
$$ 37415 42548 60569 110802 89798 23606 37289 92107 137828 124614 127461 189433 152607
13003A52607p7452L0578m1673K9876L6425M907r865l346K5418p1077k1583L4295
$$ 152607 75155 105733 64060 93936 130361 135268 125403 122057 147475 76398 54815 89110
12991H9110j8037j8712n2325j6471J8677k7405M0494K549l3624J0509K1104M9491
$$ 89110 71073 52361 36 -16435 2242 -25163 15331 17880 -15744 -5235 15869 65360
12979F5360L7880N5409k344o2462R370J009J694P864m7288o400L233p150J0818
$$ 65360 103240 158649 156305 93843 103213 104222 105916 113780 66492 60092 63325 56175 66993
12966F6993k4562n578K9442n9995j6604R9935K1721l9412l0459m8867m0738K9814
$$ 66993 42431 36853 66295 6300 -10304 89631 111352 71940 41481 -7386 -48124 -18310
12954a8310O8456J0986m0946K7671P355n894N8042J488l2368L0148J6393n878
$$ -18310 50146 61132 20186 47857 55212 49318 107360 108848 76480 106628 123021 117143
12942A17143l8686M0274P0025m3721o065k8054K6574N7938J0212j9876j5031k3628
$$ 117143 78457 118731 188756 145035 138970 110916 137490 195428 205640 185764 170733 147105
12930A47105j5452J1146J2190n1893j3873k4213J6023K2982L4816K7194k9565
$$ 147105 131653 142799 154989 103096 89223 65010 81033 104015 138831 166025 136460
12919A36460o4884J8027M1752r825j0536O814N7236M1650n574k0004j8576L0756
$$ 136460 71576 89603 131355 121530 110994 117808 175044 216694 211120 191116 172540 203296
12907B03296K0703m9885l1011j6895J7528o445L9399M5821j9865n388M2839l3357
$$ 203296 223999 174114 143103 126208 143736 137291 176690 222511 202646 197258 240097 206740
12895B06740q7319K0000L4911O3495j3663j2552K039l2938j10525J0913L5714
$$ 206740 119421 139421 174332 237827 224164 211612 213651 180713 70188 81101 116815
12884A16815K6489Q331J1832l9642l7523l6971Q340O2812L7504K4439K9968k683
$$ 116815 143304 151635 163467 123825 86302 49331 57671 120483 157987 182426 212394 209711
12872B09711N6904j6592q3714p8634q2587K3323L4608O8956N9113k3086j2181
$$ 209711 266615 250023 166309 87675 5088 28411 63019 131975 191088 168002 155821
12861A55821J056j7667K2355j649m7023q45k979p9517L8067O5546J5152P2410
$$ 155821 156877 139210 161565 159916 112893 112048 109069 29552 67619 133165 148317 220727
12849B20727L9245l6834m9036k1892j9478M424J5880j1335L2309J24N1164m4470
$$ 220727 259972 223138 174102 152210 132732 137156 153036 141701 174010 174134 225298 180828
12837A80828m0746M9747M2960l2187k8572K5987k8314p1218M2164J7764K4827
$$ 180828 140082 189829 232789 200602 172030 198017 169703 98485 140649 158413 183240
12826A83240k4138j1367K9458L7437L8420j9443r4176m1673o322Q551O4178N828
$$ 183240 159102 147735 177193 214630 253050 233607 139431 97758 91436 99987 164165 169993
12814A69993o2145K5422k909N8492l315L6084J7745m7180r034k5886J6480L2250
$$ 169993 107848 133270 130361 188853 185538 221622 239367 192187 183153 157267 173747 205997
12802B05997k9557n7810k9745k7720P4031M3314k6422K410Q9763l071K3564N7336
$$ 205997 176440 118630 88885 61165 135196 178510 152088 154498 244261 241190 264754 322090
12790C22090n7441k0145k025L1588k4882k3641K7633m1697l1358J9095j9843K6904
$$ 322090 264649 244504 242479 274067 249185 225544 253177 211480 180122 199217 179374 206278
12778B06278L440K1439K5079K9681k2194n0724J9236N4047Q744l7254k3226n4755
$$ 206278 209718 231157 256236 285917 263723 212999 232235 286282 295026 257772 234546 179791
12766A79791K0772M4838M2006l3012k4550K7533J2744q337j2058q1689J5596K4841
$$ 179791 200563 245401 287407 254395 229845 257378 270122 261785 249727 168038 183634 208475
12754B08475p074L8313P778j9872J4882L9521q732K262J3421j142k4347k2657
$$ 208475 201401 239714 247492 227620 242502 282023 273291 275553 288974 287832 263485 240828
12742B40828K0941M5806N62l855J8611L6026k3621j1806K5036k2615N764L1661
$$ 240828 261769 307575 308137 304282 322893 358919 335298 323492 348528 325913 331677 363338
12730C63338L0762j4751k2027l3416m2916P3P4510N1168j3584k6655J2930o4677
$$ 363338 394100 379349 357322 323906 280990 281063 355573 406741 393157 366502 379432 314755
12718C14755j4087L7501j4008j8315m5744J8720J2069L8546L4823k0623k0507
$$ 314755 300668 338169 324161 305846 260102 278822 290891 329437 364260 343637 323130
12707C23130L8121M408j5206k3374P95K0378l0586J8916J19495P5340l5662m2701
$$ 323130 361251 365659 350453 327079 327874 348252 317666 336582 456077 531417 495755 453054
12695D53054n5685j237P362M0755J2030j8140N113o7047l5991k5333k7590K321
$$ 453054 397369 396132 403494 444249 456279 438139 443252 376205 340214 314881 287291 289612
12683B89612J9609r87R1840K3031j4739O2290j5716o2529l938j3970R317N0304
$$ 289612 309221 308234 400074 423105 408366 470656 454940 392411 388473 374503 383820 434124
12671D34124L0527m8348o1819J0067k4096K505k767n4531J0583N3191Q8063L4023
$$ 434124 464651 416303 354484 364551 340455 342960 340193 285662 296245 349436 437499 471522
12659D71522n790J012M9750l631j8580R121R674k2119n7955J0551j144p0829j0779
$$ 471522 465732 466744 516494 512863 494283 503404 513078 490959 433004 443555 442411 371582 360803
12646C60803M979K8477L5401K6061L7515o864n8739K4957M1464J4026K5309O4340
$$ 360803 365782 394259 429660 455721 493236 486372 427633 452590 494054 508080 533389 597729
12634E97729l2575o6892K4759m196n664P370j9489M9873L2011j19065n9417M7448
$$ 597729 565154 498262 523021 518825 513161 520531 501042 550915 582926 463861 404444 451892
12622D51892O4943K2815K2831l4694J4322M6310P3027M5675L5480o967l0247o6006
$$ 451892 516835 539650 562481 527787 542109 588419 661446 707121 742601 735634 705387 639381
12610F39381j8883p6853K3909N491N6938O3045K4424O1359J5178j3521j2549j0781
$$ 639381 620498 543645 567554 573045 629983 693028 717452 778811 793989 780468 767919 757138
12598G57138J3456l1051l3861M1152O393o0208k2313L3729M5696J7583J1224k4576
$$ 757138 770594 739543 705682 746834 753227 693019 670706 704435 750131 767714 778938 754362
12586G54362L6806l4016j7930J8805M6600L8779N0032o1699r0123j2976K9753
$$ 754362 791168 757152 739222 758027 804627 843406 893438 831739 741616 728640 758393
12575G58393K7216J2109j7272K9590L7325K5509P3714L4452n422J2163o0562n6264
$$ 758393 785609 797718 780446 810036 847361 872870 946584 981036 975614 987777 927215 870951
12563H70951k5136O5544R3398j164j1999j8397K9150L3910L7073O2237Q9390J09018
$$ 870951 845815 911359 1004757 1003593 991594 973197 1002347 1036257 1073330 1135567 1224957 1333975
12551A333975R6227M4100J3685l9506o1108q7213r5521N0061K1410n3375n220
$$ 1333975 1430202 1474302 1487987 1448481 1387373 1300160 1204639 1254700 1276110 1222735 1217515
12540A217515j7611L7192O092K5211K3062q7714p4770L2201K989j6011M5155N4222
$$ 1217515 1199904 1237096 1243188 1268399 1291461 1203747 1128977 1161178 1164167 1148156 1193311 1247533
12528A247533J6548L9981q611p527M9325J3710J173j218L0549p254j3741J782
$$ 1247533 1264081 1304062 1295451 1287924 1337249 1350959 1352132 1350914 1381463 1374209 1360468 1362250
12516A362250O0839K2430N1693Q9430M2951J2389J32594J64334K23104K76263
$$ 1362250 1423089 1445519 1497212 1586642 1629593 1641982 1774576 1938910 2162014 2438277
12506B438277J30364N6912M3246j61105k70776j73429p5343m3784n0068n745O6636
$$ 2438277 2568641 2625553 2668799 2507694 2236918 2063489 1988146 1944362 1894294 1888549 1955185
12495A955185k6650k991O8324K2499j9007J9366K2317k5906j5205m5716m3688
$$ 1955185 1928535 1925544 1993868 2016367 1997360 2016726 2039043 2013137 1997932 1952216 1908528
12484A908528L5537M8285J8753L7119N7788K2162K2052L4025K2545N1335j0833
$$ 1908528 1944065 1992350 2011103 2048222 2106010 2128172 2150224 2184249 2206794 2258129 2247296
12473B247296n543N0319J12378J4586J0626P0690J14205R6049J58564K40145K18920
$$ 2247296 2241753 2292072 2404450 2419036 2429662 2500352 2614557 2710606 2869170 3109315 3328235
12462C328235J64471J17621P7240n8062k08969k09828j09252o8670p7926M4380
$$ 3328235 3492706 3610327 3687567 3629505 3420536 3210708 3101456 3032786 2954860 2999240
12452B999240N1275L3323Q8336l8694K4948O2660O0390N944q746K1062l5446k2499
$$ 2999240 3050515 3083838 3172174 3133480 3158428 3221088 3281478 3287422 3278676 3299738 3264292 3241793
12440C241793L2079P6354N3920M2102J00101P7231M2619O5878J9882O7219Q4289
$$ 3241793 3273872 3350226 3404146 3446248 3546349 3623580 3666199 3732077 3751959 3819178 3903467
12429C903467P1089K9638R6600Q8459N2359O1694Q6593Q6282P5968J24855J83750
$$ 3903467 3974556 4004194 4100794 4189253 4241612 4303306 4389899 4476181 4552149 4677004 4860754
12418D860754J32180N3415J07424M5013L7286O9567M6383M309r720J17216J14828
$$ 4860754 4992934 5046349 5153773 5198786 5236072 5305639 5352022 5356331 5346611 5463827 5578655
12407E578655R4057R6094J17734J10963P9288Q1158M3382J08733N9413J02121
$$ 5578655 5672712 5768806 5886540 5997503 6076791 6157949 6201331 6310064 6369477 6471598
12397F471598J01083Q6585J18292J84051J49924J49816J61866J24630Q0402J59717
$$ 6471598 6572681 6659266 6777558 6961609 7111533 7261349 7423215 7547845 7628247 7787964
12387G787964J85751J28194P0131J29844J49699J31896J88299K55582J97436J86505
$$ 7787964 7973715 8101909 8172040 8301884 8451583 8583479 8771778 9027360 9224796 9411301
12377I411301K03134J95860K06519J96483K20592K33415J87439K72237L07052
$$ 9411301 9614435 9810295 10016814 10213297 10433889 10667304 10854743 11126980 11434032
12368A1434032K37414J64622K12629K15401K45257K78344K87078K26235K56274
$$ 11434032 11671446 11836068 12048697 12264098 12509355 12787699 13074777 13301012 13557286
12359A3557286K89379L05903L21711L01885L27233L31407L04022K66072L09890
$$ 13557286 13846665 14152568 14474279 14776164 15103397 15434804 15738826 16004898 16314788
12350A6314788L04298L12686K94726K97259L28746L78546L94300L38950L60167
$$ 16314788 16619086 16931772 17226498 17523757 17852503 18231049 18625349 18964299 19324466
12341A9324466L11955L29806L37567L42340L42229L01690K98865L45845L18443
$$ 19324466 19636421 19966227 20303794 20646134 20988363 21290053 21588918 21934763 22253206
12332B2253206L16405L25981K68397K53654K88329K31688K69102K23054K27423
$$ 22253206 22569611 22895592 23163989 23417643 23705972 23937660 24206762 24429816 24657239
12323B4657239J92972K08530J99861J21323J48457J31961Q3886P5876J07385N545
$$ 24657239 24850211 25058741 25258602 25379925 25528382 25660343 25744229 25820105 25927490 25933035
12313B5933035M657l5774n31o5075m7186N6312l4637j29086j03334o9997r9468
$$ 25933035 25937692 25901918 25901387 25836312 25789126 25845438 25810801 25681715 25578381 25508384 25408916
12302B5408916j18025j76751k05312j51568k75187k17259k10091k09915k63719
$$ 25408916 25290891 25114140 24908828 24757260 24482073 24264814 24054723 23844808 23581089
12293B3581089k65548k84213l05910k91473k87384k51985k60780k94858k96146
$$ 23581089 23315541 23031328 22725418 22433945 22146561 21894576 21633796 21338938 21042792
12284B1042792k69329k84588k62559k57251k84557k88605k38351k69019k68692
$$ 21042792 20773463 20488875 20226316 19969065 19684508 19395903 19157552 18888533 18619841
12275A8619841k78896k63945k43140k61868k98588l08270k54925k15787k42181
$$ 18619841 18340945 18077000 17833860 17571992 17273404 16965134 16710209 16494422 16252241
12266A6252241k92779l41708l18559k42793k33749j81811k23873k99748k61998
$$ 16252241 15959462 15617754 15299195 15056402 14822653 14640842 14416969 14117221 13855223
12257A3855223j34322j73172k48271k30266j81879j93337j80828k17705j59377
$$ 13855223 13720901 13547729 13299458 13069192 12887313 12693976 12513148 12295443 12136066
12248A2136066k48084k49321j58684k14916k60567j85031j60806j07451j39986
$$ 12136066 11887982 11638661 11479977 11265061 11004494 10819463 10658657 10551206 10411220
12239A0411220j13012j07437j59831p2578k07103k56598k16851j18098q0285r1120
$$ 10411220 10298208 10190771 10030940 9958362 9751259 9494661 9277810 9159712 9079427 8988307
12229H988307n4964j24356k27986j96361j02857j26385j02573j44403j29514m7917
$$ 8988307 8933343 8808987 8581001 8384640 8281783 8155398 8052825 7908422 7778908 7730991
12219G730991r8883j31254r3530j02611j12013j16110r4459j21550j20982j11849
$$ 7730991 7632108 7500854 7407324 7304713 7192700 7076590 6982131 6860581 6739599 6627750
12209F627750j75487p9860p4924m9542k3011m8837p7307j07656q5395j14932j04444
$$ 6627750 6452263 6372403 6297479 6247937 6224926 6176089 6098782 5991126 5905731 5790799 5686355
12198E686355n2800r0799j28018j54130j04876j4237r4282l3232p478p2618Q706
$$ 5686355 5633555 5542756 5414738 5260608 5155732 5141495 5047213 5013981 5006503 4933885 4942591
12187D942591n9994o8929q5026m0507o2299p4406o3024j43533m3640q1598J3303
$$ 4942591 4882597 4813668 4728642 4688135 4625836 4551430 4488406 4344873 4301233 4219635 4232938
12176D232938J2426o3735l1392K5853j20089j13856m6453j23971l8156j2869j0708
$$ 4232938 4245364 4181629 4150237 4176090 4056001 3942145 3895692 3771721 3733565 3720696 3709988
12165C709988p5132L034N0707l6449n1630j12087r7732j04531l4630l636K7535
$$ 3709988 3634856 3637890 3688597 3652148 3600518 3488431 3390699 3286168 3251538 3247902 3275437
12154C275437o2215p5362m1188l4710k3590K831q3994k5345K0344k3549k0266
$$ 3275437 3213222 3137860 3096672 3061962 3038372 3041203 2957209 2931864 2952208 2928659 2908393
12143B908393K7214l3822m0089K623m5973r7841r2050k6358n5624m9277m194j0360
$$ 2908393 2935607 2901785 2861696 2864319 2818346 2720505 2628455 2602097 2546473 2497196 2493002 2482642
12131B482642L5725k028L794p0086K4234M0936k2172n4721n3419j4762m4659n4175
$$ 2482642 2518367 2516339 2520133 2450047 2474281 2515217 2493045 2438324 2384905 2370143 2325484 2271309
12119B271309L8240m1704m4033m3586K2538O831p8305J002K6075l528M5927K828
$$ 2271309 2309549 2267845 2223812 2180226 2202764 2209595 2131290 2132292 2158367 2154839 2200766 2203594
12107B203594m1322L5931M6474J8469O3623L640q262O2509L9468o2007J2396K0859
$$ 2203594 2162272 2198203 2244677 2263146 2326769 2330409 2322147 2384656 2424124 2362117 2374513 2395372
12095B395372o7113k499k0271p5163n3687r620m9150k9205p619k3865o9770M0509
$$ 2395372 2328259 2325760 2305489 2230326 2176639 2167019 2117869 2088664 2081045 2057180 1987410 2027919
12083B027919o0451k7550N8110k0564O3823n433L1445L748l848n2925n8352r312
$$ 2027919 1967468 1939918 1998028 1977464 2041287 2035854 2067299 2071047 2067199 2014274 1955922 1946610
12071A946610O9438J13764J04548O2122p0952m0125m6439p3123j02446m2479Q1522
$$ 1946610 2016048 2129812 2234360 2296482 2225530 2185405 2138966 2065843 1963397 1920918 2002440
12060B002440K4840n3011p451O03r23n072n8886o2066l9165r835J9580J0451M9973
$$ 2002440 2027280 1974269 1966818 1967421 1966498 1961426 1902540 1840474 1801309 1791474 1811054 1821505 1871478
12047A871478k8219n6329l7325j2187k5879p1407j8682k8054k5575L1005P3904
$$ 1871478 1843259 1786930 1749605 1737418 1711539 1640132 1621450 1593396 1567821 1598826 1672730
12036A672730Q7293K6278k9771n2459l6529O429m5087j05222q5949l4376m4035
$$ 1672730 1760023 1786301 1756530 1704071 1667542 1673971 1628884 1523662 1437713 1403337 1359302
12025A359302k539j1893q024J2290p2934k0673P108K669n3090m189o0256j9010
$$ 1359302 1356763 1344870 1336846 1349136 1276202 1255529 1262637 1265306 1212216 1208027 1147771 1128761
12013A128761l6988k0278M9986k830k6960J7984k5464l0736m5684l7927J1697
$$ 1128761 1091773 1071495 1121481 1118651 1091691 1109675 1084211 1053475 1007791 969864 981561
12002I81561L2932l3954m7196j90N866N6575P402m2533o1952L6042J5277l507
$$ 981561 1014493 980539 933343 933153 939019 995594 1002996 960463 898511 934553 949830 946323
11990I46323L4767K5453k2623n9025J1562k1327K360J5645M6050J5765n4518j2770
$$ 946323 981090 1006543 983920 924895 936457 915130 917490 933135 979185 994950 940432 927662
11978I27662p4611Q260Q6573J3330n0918o8011j8181J5572r169J0698Q095k4080
$$ 927662 853051 861311 947884 961214 910296 842285 824104 839676 830507 841205 849300 825220
11966H25220K0159l05k1891L221j5841L694O5570J2500L6676k3563m5293m2011
$$ 825220 845379 845074 823183 826404 810563 814257 879827 892327 929003 905440 860147 818136
11954H18136k456k1140M308l5819K1359J0668K340J2252L9105K2946m8725l1509
$$ 818136 815680 794540 798848 763029 784388 795056 797396 809648 848753 871699 822974 791465
11942G91465J807K9422p728m2704J732p894l1109k5229J9056k2798O4914k582
$$ 791465 793272 822694 814966 772262 773994 766100 734991 709762 728818 706020 770934 768352
11930G68352m698k0263j6267k5304q1957J7483R2157N211J7031k8065l4421O98
$$ 768352 763654 743391 727124 701820 619863 637346 729503 734714 751745 723680 689259 689957
11918F89957L8777j7551J4021J9582P366J1482O993j8887k3999L720K9874J2878
$$ 689957 728734 711183 725204 744786 752152 763634 770627 751740 727741 731461 761335 774213
11906G74213o902P692m4658k9256m7136m2703j5972Q457N3046O9435M6699J7498
$$ 774213 767311 775003 730345 701089 653953 611250 595278 603735 656781 726216 772915 790413
11894G90413N0022J8411k5407p4035j8677L8236k387j8594n9212m7745k0761O2972
$$ 790413 840435 858846 833439 759404 740727 778963 776576 757982 698770 651025 630264 693236
11882F93236P6908n5664k2082l3134j0016M2143l0308J3086n517J7133M5535J6903
$$ 693236 770144 714480 692398 659264 649248 691391 661083 674169 668652 685785 731320 748223
11870G48223j8599N917J6764N913k7944L3052P600O286J134q7055j424q689q0256
$$ 748223 729624 735541 752305 758218 730274 763326 770926 777212 778346 691291 689867 681178 600922
11857F00922K3695L6512j4026L3278R798n9931m8114J0067L8986k4328J2509k4880
$$ 600922 624617 661129 647103 680381 690179 630248 582134 592201 631187 606859 619368 594488
11845E94488K1106M972n6567k4760k0799k6643j1839O3385L4921M9231L4235k8443
$$ 594488 615594 620566 563999 539239 518440 491797 479958 543343 578264 627495 661730 633287
11833F33287l0901P9730n99p7656p1549j8543l7629L1019K1279M747L0780J7578
$$ 633287 602386 682116 681517 603861 532312 513769 476140 507159 528438 533185 563965 581543
11821E81543q206n0202J7149n4559j6935O9904N4389M5120l1920J0080M865r0844
$$ 581543 573337 523135 540284 485725 468790 538694 593083 638203 606283 616363 621228 530384
11809E30384j5749J4215k466o1488N389N1158J3171K1793J7512j9606q374j0695
$$ 530384 514635 528850 526384 464896 470285 521443 534614 556407 573919 554313 545939 535244
11797E35244J9570J0601K9885L6749O1183K0365O8334J6978K0234R7146O412J4133
$$ 535244 554814 565415 595300 632049 693232 713597 781931 798909 819143 916289 922701 936834
11785I36834o1644j19191l3323j5090J2139k3048k5915L2495M5373q344j3913
$$ 936834 875190 755999 722676 707586 719725 696677 670762 703257 748630 740286 726373
11774G26373J2173l5998J0828O2601N4445n4446j7387J0065l4050L9267J00124
$$ 726373 738546 702548 713376 775977 830422 775976 758589 768654 734604 773871 873995
11763H73995j7979p5733p0659j1643M3025Q8469O6365j4837n4919j1600k1265
$$ 873995 856016 780283 709624 697981 741006 829475 895840 881003 826084 814484 793219
11752G93219M7113N7681K3179m7365M7649J01939O9902j9915Ol8137J9024O2557
$$ 793219 840332 898013 921192 873827 921476 1023415 1093317 1073402 1073408 1035271 1054295 1116852
11740A116852Q334r675l8252l0050l191L3874O4979P4399k2287N7998J9709j6428
$$ 1116852 1125186 1115511 1077259 1047209 1044018 1077892 1142871 1217270 1194983 1252981 1272690 1256262
11728A256262J1310P0888J2364K1914L3012M1714K2118N3721L7164n660l1026
$$ 1256262 1267572 1338460 1350824 1372738 1405750 1447464 1469582 1523303 1560467 1554807 1523781
11717A523781L4206J03854j5595O0284R9226K9878R898O9042J30746O6897Q4328
$$ 1523781 1557987 1661841 1646246 1706530 1805756 1835634 1845532 1914574 2045320 2112217 2196545
11706B196545J12299J16335R4141R4203J15190J54403K26063K81727L20010K83486
$$ 2196545 2308844 2425179 2519320 2613523 2728713 2883116 3109179 3390906 3710916 3994402
11696C994402L08897L52767M36339N31239N90849O48511P71963R05934J107425
$$ 3994402 4303299 4656066 5092405 5623644 6214493 6863004 7634967 8540901 9648326
11687I648326J317492J578594J900015K343641K951448L625439M650745N937640
$$ 9648326 10965818 12544412 14444427 16788068 19739516 23364955 28015700 33953340
11679C3953340P472050R167885J0647547J1564907J1311001R766064O728045K575464
$$ 33953340 41425390 50593275 61240822 72805729 84116730 93882794 100610839 103186303
11671A03186303j881063n775404q260420r063065q400349p037709n384675l720934
$$ 103186303 101305240 95529836 87269416 78206351 69806002 62768293 57383618 53662684
11663E3662684k225897r66607K45422J264777K187664K968512L611549M026621
$$ 53662684 51436787 50470180 50715602 51980379 54168043 57136555 60748104 64774725
11655F4774725M321620M454161M278645M000272L822551L626361L562505L826360
$$ 64774725 69096345 73550506 77829151 81829423 85651974 89278335 92840840 96667200
11647I6667200M335155M942702N590103N891532N537785M405307K390369j28634
$$ 96667200 101002355 105945057 111535160 117426692 122964477 127369784 129760153 129631519
11639A29631519k662263m605838n747311n910325n219365m057933k884567j911677
$$ 129631519 126969256 122363418 116616107 110705782 105486417 101428484 98543917 96632240
11631I6632240j207041r90011j271677j810367k418028l031786l425504l548790
$$ 96632240 95425199 94435188 93163511 91353144 88935116 85903330 82477826 78929036
11623G8929036l466005l214553k721022j992760r76341K91938J898589L698648
$$ 78929036 75463031 72248478 69527456 67534696 66558355 66850293 68748882 72447530
11615G2447530N559388P579357R436279J0518268J0395961Q739303N619116J337165
$$ 72447530 78006918 85586275 95022554 105540822 115936783 124676086 130295202 131632367
11607A31632367l382798p717301j0787292j2100918j1802770j0614755q977874
$$ 131632367 128249569 120532268 109744976 97644058 85841288 75226533 66248659
11600F6248659p328750o050109m931183l975646l370439k863415k422323k153195
$$ 66248659 58919909 52869800 47938617 43962971 40592532 37729117 35306794 33153599
11592C3153599j937367j782191j565205j437923j329092j184125j021691r07860
$$ 33153599 31216232 29434041 27868836 26430913 25101821 23917696 22896005 21988145
11584B1988145q44137p98239o69045p43806p12774o58635n72683n52574n41421
$$ 21988145 21144008 20345769 19676724 18932918 18220144 17561509 16988826 16436252 15894831
11575A5894831n16987m50642m92921m40099m28667m63785m13030l39088l36156
$$ 15894831 15377844 14927202 14434281 13994182 13565515 13101730 12688700 12349612 12013456
11566A2013456m06315l63216k85835k60464k36017k40660l41085k78471k76963
$$ 12013456 11607141 11243925 10958090 10697626 10461609 10220949 9879864 9601393 9324430
11557I324430k22475k35520k31345k58939k23732j95583j77714j50590j17160
$$ 9324430 9101955 8866435 8635090 8376151 8152419 7956836 7779122 7628532 7511372
11548G511372j63118k10892k20133j42713j88116j55959j29022k19892j99090
$$ 7511372 7348254 7137362 6917229 6774516 6586400 6430441 6301419 6081527 5882437
11539E882437j73208k01733p4198j18789j03309j07144k12349j31048m9734j09209
$$ 5882437 5709229 5507496 5433298 5314509 5211200 5104056 4891707 4760659 4710925 4601716
11529D601716j01588j41031m8432j08658j73363j32100o2206p3437n6363o1762
$$ 4601716 4500128 4359097 4310665 4202007 4028644 3896544 3834338 3760901 3704538 3642776
11519C642776m8060j11708j23762k334l2358j1165r6172j01175j23960j06988
$$ 3642776 3594716 3483008 3359246 3356912 3324554 3313389 3217217 3116042 2992082 2885094
11509B885094m3941N5710k8052p8695o2535n5290L3857r707m5035k3136j8897
$$ 2885094 2841153 2896863 2868811 2790116 2727581 2672291 2706148 2696441 2651406 2628270 2609373
11498B609373j876N985o7177m0063L2452l0307o7916j00395p5686m1893j535j04936
$$ 2609373 2607497 2613482 2546305 2506242 2538694 2508387 2440471 2340076 2264390 2222497 2220962 2116026
11486B116026r6643q4332n9736p1997j3867P730J5018m0552o1075o1351o6809
$$ 2116026 2019383 1935051 1875315 1803318 1789451 1797181 1812199 1771647 1710572 1649221 1582412
11475A582412n0680J0130m0364m7911j9904m8525p2223m5745j5810M052q679l9150
$$ 1582412 1531732 1541862 1501498 1453587 1433683 1385158 1312935 1267190 1251380 1255432 1246753 1207603
11463A207603k4928j1588k6767Q52K1719p672j2951L6769J7702j00903j8609j6933
$$ 1207603 1182675 1171087 1144320 1145172 1166891 1159219 1146268 1183037 1200739 1099836 1081227 1064294
11451A064294J7361l9236o5335n3616K8755K984j146k9215j6734J6241L6177k9199
$$ 1064294 1081655 1042419 977084 923468 952223 955207 954061 924846 908112 924353 960530 931331
11439I31331l6301Q267M387n0217K9116n6188o1506K3545J0620k5718m873L0883
$$ 931331 895030 903297 907684 857467 886583 830395 768889 792434 803054 777336 772463 803346
11427H03346L5602k6850J8034R223j3572m5664p3999l5230M2657L7450L7585m953
$$ 803346 838948 812098 830132 839355 825783 780119 706120 670890 713547 750997 788582 783629
11415G83629j7258J624K0415K556m2259l8778l0774k3389k6023m319n895j4250
$$ 783629 766371 767995 788410 790966 748707 709929 679155 655766 629743 625424 619529 605279
11403F05279j2978l8752r325j1208J6889Q3078j4889o7177n966J2926K4360m4135
$$ 605279 592301 553549 544224 533016 549905 632983 618094 550917 544951 557877 582237 538102
11391E38102l0975O5116M7813n1554n3947l9973N3108P3006l0575N510K4713l5386
$$ 538102 507127 572243 620056 568502 514555 474582 527690 600696 570121 575631 600344 564958
11379E64958l1675k20K2901j754l1354K3895l2278m0871M3099O6016n801J5920
$$ 564958 533283 533063 555964 554210 522856 546751 514473 473602 516701 582717 576916 592836
11367E92836J2366n2032n8862K1633J0407k4712k9336m3869l115K9630L7422M6361
$$ 592836 605202 553170 494308 515941 526348 501636 472300 428431 425316 454946 492368 538729
11355E38729K4406J4623m8831m7929r959K4997M0399j1503n0694k3033o4760l7919
$$ 538729 563135 577758 528927 480998 471039 496036 536435 524932 474238 451205 386445 348526
11343C48526K7306J7822L3518m9879K1779k3371J5745m368K5904Q475k4126j34
$$ 348526 375832 393654 427172 377293 399072 375701 391446 387078 412982 421457 397331 397197
11331C97197K9637K1956j0535J617R803j1842m3136l3467n105m2650J050J8567
$$ 397197 426834 448790 438255 439872 449675 437833 394697 361230 356125 313475 314525 333092
11319C33092P342k8594K3546J7530K880K6606K4725l3858j4603J3909j5731l7614
$$ 333092 340434 311840 335386 352916 355796 382402 407127 373269 358666 372575 356844 319230
11307C19230j873M6654K5503l4094r0143K2317L9709k6605o911N7641K0153k7095
$$ 319230 317357 364011 389514 355420 265277 287594 327303 300698 293787 351428 371581 344486
11295C44486j8162k4118o1575n0826L3111M8209M377k7759L5813M2535m3964K1632
$$ 344486 326324 302206 240631 189805 222916 271125 275502 247743 283556 326091 282127 303759
11283C03759K5113m952J6264j1668o5951o2037q375L1129M4922O6576o165q6675
$$ 303759 328872 323920 340184 328516 262565 200528 192153 223282 268204 334780 328615 241940
11271B41940j7771j851M2010R2003K4528o6231J644n9804m498j382k1570K9164
$$ 241940 224169 222318 264328 356331 380859 314628 316272 256468 251970 250588 229018 258182
11259B58182k969K0546M0167k969L6018n8040K9156L8221N9804K9491K162M6954
$$ 258182 255213 275759 315926 312957 348975 290935 320091 358312 418116 447607 449769 496723
11247D96723N5984J0154k701K3703J6745Q6554O5518J1830P757l0544n1463k0216
$$ 496723 552707 562861 560160 583863 600608 687162 752680 764510 772267 741723 690260 670044
11235F70044q8383j07016k1000J7707L6807j375J4494j4803N2323M1798m7292
$$ 670044 581661 474645 453645 471352 508159 506784 521278 506475 558798 600596 553304
11224E53304m5532M0081J44673M9581P9628J6442j5879l762O2557O8607L0616
$$ 553304 507772 547853 692526 742107 821735 838177 822298 818536 881093 949700 980316
11213I80316p3581q8545j4432K8941N7820R9579m4288n6452l2265k3948l6971
$$ 980316 906735 818190 803758 832699 890519 990098 945810 889358 857093 833145 796174
11202G96174O091l911l4450p355N8876O2911l133m4170j4946l6305J5000n0346
$$ 796174 802265 798354 763904 756549 815425 878336 875203 831033 816087 779782 794782 744436
11190G44436n5438J6128L4368O728m596O936j521m357P176N0746L9918J1784P2514
$$ 744436 688998 705126 739494 746222 741626 748562 747041 742684 749860 800606 840524 852308 924822
11177I24822K1273k8857P901n1273o5788p2048o0945j3215n1247o3740R515K2997
$$ 924822 946095 917238 925139 873866 808078 736030 675085 661870 610623 546883 556398 579395
11165E79395m5972l2297L8888K1921l7983j2089Q915m33q3987j9168n0196j2696
$$ 579395 533423 501126 540014 561935 523952 511863 520778 520345 436358 417190 366994 354298
11153C54298L8178J9832L4917L4979r13j1700j4151K5759n3937l7628k7347k2914
$$ 354298 392476 412308 447225 482204 481291 469591 455440 481199 427262 389634 362287 339373
11141C39373j6286l1448m4388j6453R333M5006M9794P6855n5225r9729J144K2731
$$ 339373 323087 291639 247251 230798 240131 285137 334931 411786 356561 256832 257976 280707
11129B80707j9556j6508M3926k7878k4208P7152J5286j8893N3383M533O911l1103
$$ 280707 261151 244643 288569 260691 236483 313635 328921 310028 363411 367944 374855 343752
11117C43752l7315m5776K7134K3768k3884k3246K7853J00755K8903K2903P8827
$$ 343752 306437 260661 287795 311563 287679 264433 292286 393041 421944 444847 523674
11106E23674M9714J27561Q7987P5422N6519q885q4221j8442k3253j05415j02555
$$ 523674 573388 700949 788936 864358 920877 911992 827771 809329 786076 680661 578106
11095E78106j9800k5740o1099o2478N7347J12117J882K665n684J6840L7114K2406
$$ 578106 558306 532566 471467 408989 466336 578453 580335 583000 577316 594156 631270 653676
11083F53676K1571J0131l3830O1247N2075j6756m095J1698J8935N9362R5056M687
$$ 653676 675247 685378 651548 712795 764870 748114 744019 755717 774652 834014 929070 933757
11071I33757m0886o555J3101j7865l6344m1954m3854k7865L6965l9010l920N02
$$ 933757 892871 886316 899417 881552 845208 803254 759400 731535 768500 729490 725570 726072
11059G26072P087L9568R586o9k9651l0519q0145M3069J642r9914J9474K2275l3364
$$ 726072 733159 772727 782313 782244 752593 722074 641929 684998 686640 586726 606200 628475 595111
11046E95111n6237k0946L2783Q8237N1551N159N6198N5463J8281l8469M1013M2289
$$ 595111 538874 517928 550711 638948 690499 695658 751856 807319 825600 787131 828144 870433
11034H70433r1598p8631n144p6785r9004q8757m0764j0346j5337M7995o428Q888
$$ 870433 778835 700204 695060 618275 519271 430514 389750 379404 364067 412062 405634 414522
11022D14522L433L1220q210j5837j1115M9869l0500m7617m9734j4667o8521n0779
$$ 414522 417955 449175 440965 425128 414013 463882 433382 385765 336031 321364 252843 202064
11010B02064L6952L4765J6587j8060O123j0238l8009j2809M5956Q622j5429J2524
$$ 202064 239016 273781 290368 272308 278431 268193 230184 217375 263331 271953 256524 269048
10998B69048o133l5728L0185O3030K9248J5056l5397j5711K7782P029j4132k4736
$$ 269048 262915 227187 257372 320402 349650 364706 329309 313598 341380 348409 334277 309541
10986C09541n1343m6393L7597j7279r9212O4692L7058J7570l6747l8362L5792
$$ 309541 258198 211805 249402 232123 132911 197603 234661 252231 215484 177122 212914
10975B12914N2274J2659J8654k0590J4637l8021Q471M7831k7280K6681p164p3451
$$ 212914 265188 277847 296501 275911 290548 252527 260998 308829 281549 308230 301066 227615
10963B27615j3851o388j4182l2188J1107L9336K0947q69k6967K114M1710J8722
$$ 227615 213764 207376 193194 161006 172113 211449 232396 231527 204560 206674 248384 267106
10951B67106Q843J3525M1115L1036m2031o5841r035o8745j2685N0832R7096J1632
$$ 267106 275949 289474 330589 361625 319594 253753 244718 175973 163288 214120 311216 322848
10939C22848m3703j9148M116M5249j2948K0966R786L3317N121J315j8167n513
$$ 322848 279145 259997 264113 309362 296414 317380 327166 360483 365604 366919 348752 343239
10927C43239l7032k2307n891j8433j531O6916J7335l5717J0534L0728J3084k6039
$$ 343239 306207 283900 278009 259576 258045 324961 342296 306579 317113 347841 360925 334886
10915C34886O538K2661o3191q3206l0308J6607O3107N5589O5596j5208L1922L9846
$$ 334886 341424 364085 300894 217688 187380 203987 267094 322683 388279 373071 404993 444839
10903D44839m771k5073l2266R598J7917k3399j4014p763k932J9999J9501L1364
$$ 444839 440068 414995 382729 392327 410244 386845 372831 365068 362136 382135 401636 433000
10891D33000m766k5920N6913R799r522l559m4811l9206m7987K618O0908j4579
$$ 433000 428234 402314 459227 469026 459504 455945 411134 371928 323941 326559 387467 372888
10879C72888J4674n592L51m4750j9369P2524k3458L2011q669m24l7318n2591Q537
$$ 372888 387562 381970 382321 337571 318202 390726 367268 399279 390610 390186 352868 300277 308814
10866C08814M2412M5688J850l2476o7955L4822M3411k7612J6289p373k074r1586
$$ 308814 351226 396914 398764 366288 298333 333155 376566 348954 365243 357870 355796 264210
10854B64210n0072j702L0279k3764j0701n696M3033M5762n297j6119j6618P36
$$ 264210 214138 212436 242715 218951 208250 202554 245587 291349 286052 269933 253315 254051
10842B54051L632j148P619j705J6163L8781L276j5200k8817Q092j8931O448J0833
$$ 254051 257683 256535 264154 262449 278612 317393 320669 305469 276652 284744 265813 272261 283094
10829B83094N872K4344L5443n638l5989J1821L2226L7788j1885K555j4281k0880
$$ 283094 288966 313310 348753 343115 307126 318947 351173 388961 377076 379631 365350 344470
10817C44470o918K9607K1240K076k7632j4861p081L1824N8720L5681J0719M6088
$$ 344470 337552 367159 388399 390475 362843 347982 340901 372725 431445 467126 477845 523933
10805E23933N0145m318J035P6098N0369P8468P3962O0886M7893l1016K791m666
$$ 523933 574078 569760 570795 646893 697262 775730 849692 910578 958471 927455 930246 925580
10793I25580k4733j0539m1455m3482k8935L434K7268M1751r027l3382j2833R560
$$ 925580 900847 890308 848853 805371 776436 779870 807138 848889 839862 806480 793647 803207
10781H03207p2386J9882L5185J2197r014L76K795L0882M096l0120l937M4103K5417
$$ 803207 730821 750703 785888 798085 789071 789447 792242 823124 827220 797100 793163 837266 862683
10768H62683O1575Q0813L9935l1171m6406j445N388J4137J8622M0654L6257N961
$$ 862683 924258 1005071 1045006 1013835 967429 965984 971372 985509 1004131 1044785 1081042 1087003
10756A087003M8789m162J6835K2037K2102K1057J09703J77442R1727K34694L58746
$$ 1087003 1135792 1131630 1148465 1170502 1192604 1213661 1323364 1500806 1592533 1827227 2185973
10745B185973K59974J54886J25910M6196k89271k87686j33615j8754M8679R0100
$$ 2185973 2445947 2600833 2726743 2772939 2483668 2195982 2062367 2043613 2092292 2182392
10735B182392J43341K41830L38471L87807L73624K42269J28416n009k26290l84269
$$ 2182392 2325733 2567563 2906034 3293841 3667465 3909734 4038150 4033141 3806851 3422582
10725C422582l39074k22831j30170j23568P722N1903o33L493P3145R3561J77891
$$ 3422582 3083508 2860677 2730507 2606939 2614661 2666564 2665931 2669424 2742569 2836130 3014021
10714C014021J52605J39457J92073K21668J89276J54686K44417L77347L48607
$$ 3014021 3166626 3306083 3498156 3719824 3909100 4063786 4308203 4685550 5034157
10705E034157L41475N63429O20794O34905P38964Q55401J040458J198462J282658
$$ 5034157 5375632 5939061 6559855 7194760 7933724 8789125 9829583 11028045 12310703
10696A2310703J679354K046387K553057L203636L989137N092263O507325Q221612
$$ 12310703 13990057 16036444 18589501 21793137 25782274 30874537 37381862 45603474
10688D5603474J0126969J1903429J3220292J3335356J1827707Q606363M126894
$$ 45603474 55730443 67633872 80854164 94189520 106017227 114623590 118750484
10681A18750484j112583o063148r496826j0770079j0310459q723350o607513m543026
$$ 118750484 117637901 111574753 102077927 91307848 80997389 72274039 65666526 61123500
10673F1123500k685817j096056K39467J239942K031671K765430L279792L492987
$$ 61123500 58437683 57341627 57581094 58821036 60852707 63618137 66897929 70390916
10665G0390916L357055K987103K440151J950810J541803J529827J933640K722394
$$ 70390916 73747971 76735074 79175225 81126035 82667838 84197665 86131305 88853699
10657H8853699L773746M995740O212610P046714P311783O911488N699929L600767
$$ 88853699 92627445 97623185 103835795 110882509 118194292 125105780 130805709 134406476
10649A34406476R16716j907542m181357n736961o250199n931712n104979m138768
$$ 134406476 135323192 133415650 129234293 123497332 117247133 111315421 106210442 102071674
10641A02071674l353060k809305k631591k842643l293515l773264m184637m236404
$$ 102071674 98718614 95909309 93277718 90435075 87141560 83368296 79183659 74947255
10633G4947255l976134l498850k844127j981631j154880o8999J289659K792533
$$ 74947255 70971121 67472271 64628144 62646513 61491633 61422634 62712293 65504826
10625F5504826M480721O405719Q234832R534528R886363Q633327N962051K001940
$$ 65504826 69985547 76391266 84626098 94160626 104046989 112680316 118642367 120644307
10617A20644307k760302p325381j0367137j1480400j0995901r541703p995975
$$ 120644307 117884005 110558624 100191487 88711087 77715186 68173483 60177508
10610F0177508o563571n382662m366424l625573l019550k578075k168616j914906
$$ 60177508 53613937 48231275 43864851 40239278 37219728 34641653 32473037 30558131
10602C0558131j689341j576713j408772j254579j174354j110157r02728q42479
$$ 30558131 28868790 27292077 25883305 24628726 23454372 22344215 21441487 20599008
10594B0599008q03301p76178o98175n83817o46768p36734n86212m86864m61662
$$ 20599008 19795707 19019529 18321354 17737537 17090769 16354035 15767823 15280959 14819297
10585A4819297m31564m26770m58469m91255l98425m02945m08718l31640l23418
$$ 14819297 14387733 13960963 13502494 13011239 12612814 12209869 11801151 11469511 11146093
10576A1146093k73602k36429k57303l19901k62705k76969k64124k57250k46247
$$ 11146093 10872491 10636062 10378759 10058858 9796153 9519184 9255060 8997810 8751563
10567H751563j40064j72983j17664j08664k29459k77692k71901k45441j80713
$$ 8751563 8611499 8438516 8320852 8212188 7982729 7705037 7433136 7187695 7006982
10558G006982j99835j65289j52499j94788k15182j23335j71730j30841k24958
$$ 7006982 6807147 6641858 6489359 6294571 6079389 5956054 5784324 5653483 5428525
10549E428525j83662p6567o5925j34306k03669r7660r9771n7142j20077j81607
$$ 5428525 5244863 5168296 5102371 4968065 4764396 4666736 4566965 4509823 4389746 4208139
10539D208139j03698m1742o7500j57747r6952n5872j574o9323q4733q2012o3382
$$ 4208139 4104441 4062699 3995199 3837452 3740500 3684628 3683054 3613731 3528998 3446986 3383604
10528C383604p1297j12608j16397o6985k2942o6111j42959p6696m7905n7461j9219
$$ 3383604 3312307 3199699 3083302 3016317 2993375 2927264 2784305 2707609 2659704 2602243 2583024
10517B583024k2555J2429k4325n5433o8801p8238p3011o6745K8742N2308M9371
$$ 2583024 2560469 2572898 2548573 2493140 2424339 2346101 2273090 2206345 2235087 2287395 2336766
10506B336766k5093q5140j14862n1914m7867j19082r4545r258R139O756j5128
$$ 2336766 2311673 2226533 2111671 2059757 2011890 1892808 1798263 1789005 1798144 1804900 1789772
10495A789772n2699P92m0572o3589j27441q6688L2098l3287K6008j01444j3993
$$ 1789772 1737073 1737865 1697293 1633704 1506263 1419575 1451673 1418386 1444394 1342950 1328957
10484A328957k3602j15483l8076K9679M948n3044o0255m7690m7739j6485r091
$$ 1328957 1305355 1189872 1151796 1181475 1186423 1133379 1073124 1025434 977695 961210 952119
10473I52119N781K5556l6150k3115l2743k0002O981l8489o3073M3513L2609R491
$$ 952119 957900 983456 947306 924191 891448 871446 878427 839938 776865 820378 852987 862478
10461H62478J30167R0315n383j8341m2783l6524L4306M8489n236o5687O391M9099
$$ 862478 992645 1082960 1077577 1059236 1016453 979929 1014235 1062724 1057488 991801 998192 1047291
10449A047291j7451q1787J549O6575l6470m0813k6785M1369k4984O388P6052P5656
$$ 1047291 1029840 948053 949602 1016177 979707 938894 912109 953478 928494 934882 1010934 1086590
10437A086590N8367r80k3741q983L337R270N4190k4709o6262k5631m803K7107
$$ 1086590 1144957 1143977 1120236 1111253 1114590 1123860 1178050 1153341 1087079 1061448 1056645 1083752
10425A083752n212l4905l4810J0134J6908k7857o4427J589O4163Q1187P94j3768
$$ 1083752 1078540 1043635 1008825 1018959 1035867 1008010 943583 945172 1009335 1090522 1091316 1077548
10413A077548j0348M5206q745m7820N4265O1137j2546k4572N758K5432l5199L593
$$ 1077548 1067200 1112406 1103661 1055841 1110106 1171243 1158697 1134125 1139883 1165315 1130116 1133709
10401A133709J0242L1817K2310M0860J11984n2756k8770J0196L9324n989Q323
$$ 1133709 1143951 1175768 1198078 1238938 1350922 1298166 1269396 1279592 1318916 1312927 1321250
10390A321250J7583q0059m8697M139N3065K5315O8397m1385m846M8516L3403k4030
$$ 1321250 1338833 1258774 1210077 1214216 1267281 1292596 1360993 1319608 1314762 1363278 1396681 1372651
10378A372651M940k0208M2551M8123k81j9097K8769Q2086N6496O3939m6915j0721
$$ 1372651 1377591 1357383 1399934 1448057 1447776 1428679 1457448 1539534 1596030 1659969 1613054 1602333
10366A602333R3635J31303Q8465M3708K3195Q6712J8493K2988L6706l219P773
$$ 1602333 1695968 1827271 1915736 1959444 1982639 2069351 2087844 2110832 2147538 2144319 2152092
10355B152092J23552R0169M5159R5258J33848J15388Q9353J25746Q8755J03135
$$ 2152092 2275644 2365813 2410972 2506230 2640078 2755466 2844819 2970565 3059320 3162455
10345C162455J04503J24279K38818L32630L45836L89735M74012N20913M90241
$$ 3162455 3266958 3391237 3630055 3962685 4308521 4698256 5172268 5693181 6183422
10336F183422O76300Q90752J154718J247373J510590J759379J896674J876668
$$ 6183422 6859722 7750474 8905192 10152565 11663155 13422534 15319208 17195876
10328A7195876J880358J906165J726366J816506K377388L422299M813317O414986
$$ 17195876 19076234 20982399 22708765 24525271 26902659 30324958 35138275 41553261
10320D1553261Q693192J2163677J7965345K7475582M2809638O3932668Q1684000
$$ 41553261 50246453 62410130 80375475 107851057 150660695 214593363 296277363
10313B96277363P7949335N5147011L3376227L102432n5140241r6634049q4045195
$$ 296277363 374226698 429373709 462749936 465852368 410712127 314078078 230032883
10306B30032883n5552459l5328451k3572622j6679214j2265010r103150o873251
$$ 230032883 174480424 139151973 115579351 98900137 86635127 77531977 70658726
10299G0658726n324805m196577l397657k983850k856759k828787k753335k916806
$$ 70658726 65333921 61137344 57739687 54755837 51899078 49070291 46316956 43400150
10291D3400150l059944k766791k238318j796618j511697j291672j259151j198259
$$ 43400150 40340206 37573415 35335097 33538479 32026782 30735110 29475959 28277700
10283B8277700j140589r80567q47334q38651r35340r08654r06106r17041q20274
$$ 28277700 27137111 26156544 25309210 24470559 23535219 22626565 21720459 20803418 19983144
10274A9983144p01858o17800n14060n84482n49298n05665l96642l21335m29942
$$ 19983144 19281286 18663486 18149426 17564944 17015646 16509981 16113339 15792004 15362062
10265A5362062m47223m19041m12027l87033l38835k72912l16423k45076k17819
$$ 15362062 14914839 14495798 14083771 13696738 13357903 13084991 12768568 12523492 12305673
10256A2305673k51347l40716l45225l29992l08955l18636l08318l12684l05343
$$ 12305673 12054326 11713610 11368385 11038393 10729438 10410802 10102484 9789800 9484457
10247I484457k41030k54836k42181k46148k64929k75660k04005j02097j74291
$$ 9484457 9243427 8988591 8746410 8500262 8235333 7959673 7755668 7653571 7479280
10238G479280k16788k04605j99093j90304j63837j68806j87311j36518j76246
$$ 7479280 7262492 7057887 6858794 6668490 6504653 6335847 6148536 6012018 5835772
10229E835772j85898p3872j938k8976j50960j63907j08616q4260j18819k11958
$$ 5835772 5649874 5576002 5574064 5545088 5394128 5230221 5121605 5037345 4918526 4706568
10219D706568j22472q1293r0627p2086r2971j29020j33287m8647o9573q0550j18675
$$ 4706568 4584096 4502803 4412176 4340090 4247119 4118099 3984812 3936165 3866592 3786042 3667367
10208C667367n8625m2243o3715L2204P3702n0381n8261k12n341r3679o9280j16968
$$ 3667367 3608742 3566499 3502784 3534988 3608690 3558309 3500048 3499836 3494495 3400816 3331536 3214568
10196C214568l3451R135q9920q4394l4002l5731m8584m8244l1771k1372l8939
$$ 3214568 3181117 3190252 3100332 3015938 2981936 2946205 2897621 2849377 2817606 2796234 2757295
10185B757295k8914p4219r4819j49140j34290j30566j34465j16628j28091m2128
$$ 2757295 2728381 2654162 2559343 2410203 2275913 2145347 2010882 1894254 1766163 1724035
10175A724035m6680q1097n5000j04784p7269j7592j7298l3552J3387K1596o5576
$$ 1724035 1677355 1596258 1541258 1436474 1359205 1341613 1324315 1290763 1304150 1325746 1260170
10164A260170j37361q6732L720O6277P8605N2653M9658N432j3863j6977j44693
$$ 1260170 1122809 1036077 1039797 1106074 1184679 1237332 1286990 1292422 1278559 1261582 1116889
10153A116889j16773J7663L9100O2510r900p2445q220m8200r223l5857J0127Q2376
$$ 1116889 1000116 1017779 1056879 1119389 1109489 1037044 1028824 980624 971401 935544 945671 1028047
10141A028047k7934p0976m5668L3735O3224K9919m1931j11736j9590j560J5688
$$ 1028047 1000113 929137 883469 917204 980428 1010347 968416 856680 837090 835530 851218
10130H51218K3833L6304p7885k5239L2841r16m1549l272L5283R5110m3918n1821
$$ 851218 875051 911355 833470 808231 841072 840156 798607 795335 830618 925728 881810 829989
10118H29989k6409K1040K12n7127p105l2770j6931l1723l1899m061n1274j8839
$$ 829989 803580 824620 824832 767705 760600 727830 710899 679176 647277 643216 591942 573103
10106E73103l58M3889L4656m4571j7598M9548L9789l0534P237m6532J5055N7540
$$ 573103 572745 616634 651290 606719 589121 638669 678458 647924 655161 608629 623684 681224
10094F81224J5674k3007o1482N3153K7177n6836l4609M8219k3544n721l6564P724
$$ 681224 696898 673891 612409 665562 692739 635903 601294 649513 625969 620248 583684 591408
10082E91408m4760j0645J7886j3891K2252l1688K3576K0784k1208O0188l1182
$$ 591408 546648 536003 553889 539998 562250 530562 554138 574922 553714 613902 582720
10071E82720l3707M6910m9473L7569Q5991m904k5409o3359K3510J4290J7080M304
$$ 582720 549013 595923 546450 584019 670010 665106 639697 576338 599848 614138 631218 635522
10059F35522K9511j9668m7182m1632l3844K2122J3779J3991m1953n1609J6249
$$ 635522 665033 645365 598183 556551 522707 544829 558608 572599 530646 479037 495286
10048D95286J13104R0664J1259n601j2679j6478j20575j20082M9806j1419n1741
$$ 495286 608390 699054 710313 704712 692033 675555 554980 434898 484704 473285 421544
10037D21544K5877J990n417o7054j8914L3842M3263o8146J7116J7978K2297O393
$$ 421544 447421 449411 443994 376940 358026 391868 435131 366985 384101 402079 424376 430769
10025D30769O6489J4532m1770K8034l7160n6980m410j2120k3317l7998l2880L0281
$$ 430769 497258 511790 470020 498054 460894 403914 399504 387384 364067 326069 293189 323470
10013C23470o5040n181M0753j8358L2938K7684P1567k8822l3877O663M3136M0009
$$ 323470 258430 253249 294002 275644 308582 336266 407833 379011 345134 351797 394933 434942
10001D34942j6467n0448J616N7996k1566m5747k9618K4549J7236l3354J9191p67
$$ 434942 418475 368027 369643 427639 406073 360326 330708 355257 372493 339139 358330 357563
9989C57563J2066k0509l2037L5848m1726M8984P7632k9327j9423K8395N7852Q052
$$ 357563 369629 349120 317083 352931 311205 360189 437821 408494 389071 417466 475318 483370
9977D83370n8256l7630L1711J5996K848Q329o318K0355L6676J8222N7907l4449
$$ 483370 425114 387484 419195 435191 438039 446368 440050 460405 497081 515303 573210 538761
9965E38761k9006p7137k6430K5640o3881k3330P1612K7519K5180J4780j146q120
$$ 538761 509755 432618 406188 431828 367947 344617 416229 443748 468928 483708 482562 474442
9953D74442j2392n8500J920k7731o5209K728l2001L2015N4967N1031P4361J4638
$$ 474442 462050 403550 405470 377739 312530 315258 283257 315272 370239 421270 495631 510269
9941E10269k8703l653J5358k7239J0860L3193J3709l271j00554l8083Q148J9186
$$ 510269 481566 477913 493271 466032 476892 510085 523794 520523 419969 381886 390034 409220
9929D09220P9508j5639o151L2169m0163k4756k3941R860k0524k4081k5710N2309
$$ 409220 488728 473089 466938 499107 458944 434188 410247 420107 399583 375502 349792 402101
9917D02101K3585m5820N5471M8792O4585N883M05M115J393j0515J274M7605o0575
$$ 402101 425686 379866 435337 484129 548714 554597 555002 559117 560510 549995 551269 598874 538299
9904E38299K370j7276l190k0707O186o40O6068O1187P1707Q3364Q5083J13799
$$ 538299 540669 523393 520203 499496 505682 505042 571110 632297 704004 787368 872451 986250
9892I86250J67312L26825L24907L59533K79207J87615M9593r7797k34834m13727
$$ 986250 1153562 1480387 1805294 2164827 2444034 2631649 2681242 2583445 2348611 1934884
9882A934884l26786j90208j74853j23443q8149r6336p9784j4428P359o2868o6613
$$ 1934884 1608098 1417890 1243037 1119594 1031445 935109 855325 840897 848256 785388 718775
9871G18775l0282M360m933k3001j8801k5432n0424K4269R4901m693p6484j0354
$$ 718775 688493 692853 687920 664919 646118 620686 570262 594531 689432 684739 608255 597901
9859E97901k382l8264l4840j0563K3205O5896j3143n1144M5477M7581L3131l5264
$$ 597901 595519 557255 522415 511852 535057 600953 587810 536666 582143 629724 662855 627591
9847F27591k5699M7347N287j2751M5833j3789l3348n6440N4001L8139N612k7872
$$ 627591 601892 649239 654526 641775 687608 673819 640471 584031 638032 676171 681783 653911
9835F53911l9306m6693J0063O8825k4577K4051k5564o916m9409J8063Q1790J3160
$$ 653911 614605 567912 577975 646800 622223 646274 620710 613794 564385 582448 664238 677398
9823F77398p674o0585R924O1844k6768m5867J0886O9947j27n9418l313K1381l2966
$$ 677398 669724 609139 619063 680907 654139 608272 619158 689105 688978 629560 626247 647628 614662
9810F14662J5448M7234m272l7225n6146k0223P898J3842j9937k1543M7030J3518
$$ 614662 630110 677344 673072 635847 579701 559478 567376 581218 561281 539738 586768 600286
9798F00286J4559M0862K6262M8848j4770p0378o5435j3807R6998K63P163k5279
$$ 600286 614845 655707 681969 730817 716047 645669 580234 566427 663425 663688 670851 645572
9786F45572M411O517o400o3745O347L2267Q3007K7058j2936r444n9420k6737K5664
$$ 645572 649983 656500 650100 586355 592702 624969 707976 735034 722098 712654 653234 626497 652161
9773F52161P2888o75N170n0670m7456k2722k717K2572J01776Q8281O4762K6409
$$ 652161 725049 724374 729544 678874 631418 608696 605979 628551 730327 818608 883370 909779
9761I09779L8237L8781L4768K3612L3014J7314q0279j22483r1698l4702J6339
$$ 909779 948016 986797 1021565 1045177 1078191 1095505 1015226 892743 801045 766343 782682
9750G82682O992Q572k1098R0262L4964m1041k3994r118K7297K7152n0805p175
$$ 782682 789674 798246 777148 867410 902374 861333 837339 828221 855518 882670 831865 824690
9738H24690J7869k5545K8513Q2210K9419j7723l8576j2817m2330n0566k4124K0852
$$ 824690 842559 817014 845527 927737 957156 939433 900857 888040 845710 795144 771020 791872
9726G91872N9302K891l7309J4005o492K7570J04220N7120m9237l9562k1615j7796
$$ 791872 851174 854065 816756 830761 824269 851839 956059 1013179 963942 924380 902765 884969
9714H84969M0636L0726j0712K5157n7475k8657M5996K9828K9852M4298M4467o281
$$ 884969 925605 956331 945619 970776 913301 884644 930640 960468 990320 1034618 1079085 1072804
9702A072804K5830j9373N660p2440j6896M824k19L6102J6009k8164M9483l969
$$ 1072804 1098634 1079261 1084921 1012481 995585 1000409 1000190 1036292 1052301 1024137 1073620 1069651
9690A069651o664k8005k7439l85P0031L7924l7122k4967O7570K7636K2197k2231
$$ 1069651 1062987 1034982 1007543 1007158 1077189 1115113 1077991 1053024 1120594 1148230 1170427 1148196
9678A148196K75j1463J262Q5079M5118k6634n9870K2498M430K062L4301k6945
$$ 1148196 1148471 1137008 1138270 1223349 1268467 1241833 1181963 1204461 1208891 1210953 1245254 1218309
9666A218309N986l2510l0537L6850J28140O6808k5310K8897j522l1383p1305m5807
$$ 1218309 1224295 1191785 1161248 1198098 1326238 1393046 1367736 1396633 1395111 1363728 1292423 1246616
9654A246616O1488P8028M9319J9750L115k7229j849J9160j208L5558L9872P3218
$$ 1246616 1308104 1386132 1435451 1455201 1458316 1431087 1429238 1448398 1447190 1482748 1522620 1595838
9642A595838J4438r6117o763N8347M1006j4150n3605O0445J5155k1142L0898N3628
$$ 1595838 1610276 1514159 1507396 1565743 1606749 1592599 1538994 1599439 1614594 1593452 1624350 1677978
9630A677978l288k4182j0781M9531K6397M8834L3426J3412m4519K3882R7369Q7283
$$ 1677978 1674690 1650508 1639727 1689258 1715655 1764489 1797915 1811327 1766808 1790690 1888059 1975342
9618A975342J1728j7329O498P5448K0662L1470M5503j0348n8614M2983L4173o900
$$ 1975342 1987070 1969741 1976239 2051687 2072349 2103819 2149322 2138974 2080360 2123343 2157516 2150616
9606B150616K8350M6800L9967j5973n988P014J5701L9547K6352M2776Q8388P0327
$$ 2150616 2178966 2225766 2265733 2249760 2243772 2250786 2266487 2306034 2332386 2375162 2463550 2533877
9594B533877K8420N1941j262l643J2087L9742N5636Q4346J4384j3906L8761Q7124
$$ 2533877 2562297 2614238 2612976 2609333 2621420 2661162 2716798 2801144 2815528 2801622 2840383 2927507
9582B927507j4088J8232J06734K5745O2043J6904N2984L9414Q1907Q5615J4781
$$ 2927507 2913419 2931651 3038385 3064130 3126173 3143077 3196061 3235475 3317382 3402997 3417778
9571C417778J908K0116J05016Q2062K7433O9455O7673L7618J9591j576L5200L9930
$$ 3417778 3419686 3439802 3544818 3626880 3654313 3723768 3791441 3829059 3848650 3847074 3882274 3922204
9559C922204O8003Q3270O0060O0945Q1266N8554O1499Q7863O8951K1936J38247
$$ 3922204 3990207 4073477 4133537 4194482 4275748 4334302 4395801 4483664 4552615 4574551 4712798
9548D712798R1984K5300N8688R3502J24549J22018L9654O6781P5963J16028J11750
$$ 4712798 4804782 4830082 4888770 4982272 5106821 5228839 5268493 5335274 5411237 5527265 5639015
9537E639015J45342J03422N6144L4047J01617J11691J23863J13559N8117J04032
$$ 5639015 5784357 5887779 5943923 5977970 6079587 6191278 6315141 6428700 6486817 6590849
9527F590849R9786J25038J52045J73532J65626J36425P9306J83832J07433P1136
$$ 6590849 6690635 6815673 6967718 7141250 7306876 7443301 7522607 7706439 7813872 7885008
9517G885008J72214J39625J38079J31621J19152J09736J65029J18157J36297J71454
$$ 7885008 8057222 8196847 8334926 8466547 8585699 8695435 8860464 8978621 9114918 9286372
9507I286372J80938J77983J68245J85112K44647J73644J44232Q0079N7026J59143
$$ 9286372 9467310 9645293 9813538 9998650 10243297 10416941 10561173 10641252 10698278 10857421
9497A0857421J68480K16458J95296J72509J89318J46124J08543J73344J10193
$$ 10857421 11025901 11242359 11437655 11610164 11799482 11945606 12054149 12227493 12337686
9488A2337686R9548J63795J65080J08016J25036Q1509J06648J29647Q7718Q9462
$$ 12337686 12437234 12601029 12766109 12874125 12999161 13080670 13187318 13316965 13404683 13494145
9478A3494145J23148J23115R0265N7035M1510P7773M4099N8842M9747J8651J331
$$ 13494145 13617293 13740408 13830673 13887708 13929218 14006991 14051090 14109932 14159679 14178330 14179661
9467A4179661Q195l1701k2810L38n3116j03873j5831j0239n3346n2292l3189j9977
$$ 14179661 14187856 14156155 14133345 14133683 14080567 13976694 13960863 13950624 13897278 13844986 13811797 13791820
9455A3791820o5653q4089j00268r0956j59756k18482q2911r8921j61393j23759
$$ 13791820 13726167 13642078 13541810 13450854 13291098 13072616 12989705 12890784 12729391 12605632
9445A2605632p8599j66387j26943j06683j53992j72555j30796m7392j03279k08738
$$ 12605632 12527033 12360646 12233703 12127020 11973028 11800473 11669677 11622285 11519006 11310268
9435A1310268j92418j56039k39965p5934j39060j77674j78085j61985j21048j04808
$$ 11310268 11117850 10961811 10721846 10645912 10506852 10329178 10151093 9989108 9868060 9763252
9425I763252j20898j27770j48704j06652j75318j78193j08870p4175j41451j12089
$$ 9763252 9642354 9514584 9365880 9259228 9083910 8905717 8796847 8722672 8581221 8469132
9415H469132j17688j11356j38303k05505j59424j13216j36208j25080j56605p5489
$$ 8469132 8351444 8240088 8101785 7896280 7736856 7623640 7487432 7362352 7205747 7130258
9405G130258m6070j05193p5865j50217j49831r5455j68717j30652j07131p0077
$$ 7130258 7084188 6978995 6903130 6752913 6603082 6507627 6338910 6208258 6101127 6031050
9395F031050r4885q4978r1850n6838n7784j42774p1341q6519l8710q5029j23875
$$ 6031050 5936165 5851187 5759337 5702499 5644715 5501941 5430600 5344081 5305371 5220342 5096467
9384E096467m8857o0540q1541o1653p2823j00959j49687o5895o0976l2588k2527
$$ 5096467 5047610 4987070 4905529 4843876 4771053 4670094 4520407 4454512 4393536 4360948 4338421
9373D338421n4998n9713l3635m3048p2275p0399r6091j30204k4239O2103r886
$$ 4338421 4283423 4223710 4190075 4147027 4074752 4004353 3908262 3778058 3753819 3815922 3806036
9362C806036p0583r8934j8159m2487l8306k6162o8618l1914m250n9566j23632
$$ 3806036 3735453 3636519 3618360 3575873 3537567 3511405 3442787 3410873 3406623 3347057 3223425
9351C223425j58454n3236j0380J5916n6545n4685n9448j09405L314J1107n9222
$$ 3223425 3064971 3011735 3001355 3017271 2960726 2906041 2846593 2737188 2740502 2751609 2692387
9340B692387j2553p609o9501p3821o2854j479j6030l2004n4246o3867l4410l9274
$$ 2692387 2679834 2672225 2602724 2528903 2466049 2464570 2448540 2416536 2362290 2298423 2264013 2224739
9328B224739k89R174J9485n0737p8294l5400j4659K9130k1518j6138m9269r502
$$ 2224739 2224450 2233624 2253109 2202372 2124078 2088678 2074019 2103149 2081631 2065493 2016224 2006722
9316B006722l3873L8549n1674l9129j01629m6730k3116K0206Q3586M4281l5040
$$ 2006722 1972849 2011398 1959724 1920595 1818966 1772236 1749120 1769326 1852912 1897193 1862153
9305A862153j3490l0238m8402m8375o1357l976J9713j9690m7185l4132o5067q314
$$ 1862153 1848663 1818425 1770023 1721648 1660291 1656315 1676028 1656338 1609153 1575021 1509954 1501640
9293A501640J5978L5037J1282j7022R853k338n1052l2833j2716K1919m0505j6226
$$ 1501640 1517618 1552655 1563937 1546915 1556768 1554430 1503378 1470545 1457829 1479748 1439243 1423017
9281A423017j6888n4987p4377k6796k6346J357N9820l1766n2197m3530l997M4315
$$ 1423017 1406129 1351142 1276765 1249969 1223623 1224980 1284800 1253034 1200837 1157307 1153310 1197625
9269A197625M1144k9897r5653m6700O0047j7507m5681r945L1342r215J0856K5362
$$ 1197625 1238769 1208872 1113219 1066519 1126566 1109059 1063378 1053433 1084775 1075560 1086416 1111778
9257A111778k5487p2940l0896J6171m5113j6321j6309j4284J1581J3922m5172
$$ 1111778 1086291 1013351 982455 998626 953513 937192 920883 906599 918180 932102 886930
9246H86930m5370K2461k019o2571j373R555j6401m6764n750K9462L1977L4283
$$ 886930 841560 864021 862002 799431 798058 807613 791212 744448 738698 768160 800137 834420
9234H34420J8807N8107q13k2675q1214k8056M8910k0797l1256K4604K7941l6540
$$ 834420 853227 911334 910521 887846 806632 778576 827486 806689 775433 800037 827978 791438
9222G91438r7618j8766N9962K8942l4086j2873M3708j5111p206k5130m7665J119
$$ 791438 693820 675054 735016 763958 729872 716999 760707 745596 738390 713260 665595 666714
9210F66714J2305J9950N4270j5748J4343o6213o8729m575K3830j729n221m0954
$$ 666714 679019 698969 753239 737491 751834 685621 616892 612317 636147 634418 629197 588243
9198E88243o4802j9391O5762N4134n5116m4705P3001k1916l3761M076M3465l9619
$$ 588243 523441 504050 569812 623946 568830 524125 597126 575210 541449 545525 588990 549371
9186E49371n8630Q0211J8142o774p0656M740j7476K3263N4843N4509K026p095
$$ 549371 490741 570952 589094 582320 511664 516404 498928 522191 577034 631543 633569 626474
9174F26474j04759p0727L4193N3767P1210m1421q9315K659K3504n0097n2110P7141
$$ 626474 521715 450988 485181 538948 610158 568737 479422 482081 505585 455488 403378 480519
9162D80519M0985J5866j3587p4400j6343M4309J3740j9611m3904o7527n1407N192
$$ 480519 521504 537370 523783 449383 433040 477349 491089 471478 427574 360047 308640 313832
9150C13832J57077O4255K325j4976p2136p6446j521Q7609M472m5147K8241K7160
$$ 313832 470909 535164 537489 522513 450377 373931 372410 460019 464491 419344 447585 474745
9138D74745k4548J053j8297n3786m4719K5416R858n3682K0449Q782j4533Q0325
$$ 474745 450197 451250 432953 379167 334448 359864 369722 316040 336489 345271 330738 411063
9126D11063M7415N8056l840j7288K4067j7016k7484p2773m3575k2276M8559K957
$$ 411063 458478 516534 512694 495406 519473 502457 474973 402200 358625 336349 384908 387865
9114C87865l1839m8183l1843J2180J1188k364m871L7527N181m5554j5746K7497
$$ 387865 356026 307843 276000 288180 299368 297004 292133 329660 334841 289287 273541 301038
9102C01038n921Q7327M7727M804m2595m7606M6348k0438n3702L8938K367K6864
$$ 301038 295117 382444 430171 434975 392380 344774 391122 370684 316982 355920 358287 385151
9090C85151j5654l0759j1334J0973O309l5460j2354Q5438K1103m8725p6476l589
$$ 385151 369497 338738 327404 338377 344686 309226 296872 382310 403413 354688 278212 274623
9078B74623j0304K3264K7724l359l7536n1555j2330M4992j2168K3062Q0342J6205
$$ 274623 264319 287583 315307 311948 274412 222857 210527 255519 243351 266413 346755 362960
9066C62960p8529j24222k7964K8461m6156L342L0444p918J7227O1629L2098J2185
$$ 362960 284431 160209 132245 160706 114550 117892 148336 140418 157645 219274 251372 263557
9054B63557J966M6442M1503o4376j1741O1162m3788m371j745j7167K0741j2188
$$ 263557 265523 311965 353468 289092 277351 338513 294725 290354 288609 271442 292183 279995
9042B79995r0461n8917l012J7260J9467k5388K5753J06740P3395l8898n094n3452
$$ 279995 189534 130617 127605 144865 164332 138944 164697 271437 344832 305934 300840 247388
9030B47388q084M0662J5671L6637k8825o3455l3144L2910M3574l7918j13145m247
$$ 247388 239304 279966 295637 332274 303449 239994 206850 239760 283334 245416 132271 128024
9018A28024M0353J9982O184n3327J257P6004L1826j9917q2572k5742J8721M2393
$$ 128024 168377 188359 194543 141216 142473 218477 250303 230386 147814 122072 140793 183186
9006A83186M3381p3930r054O0087J6088K0170K1514k8907o6041m1338K5451O3215
$$ 183186 226567 152637 143583 203670 219758 239928 261442 232535 166494 125156 150607 213822
8994B13822J387k4217m5461K3058l0562K2917O0389M493o1104n8677L4671m6578
$$ 213822 215209 190992 145531 168589 138027 160944 221333 225826 164722 106045 140716 94138
8982I4138K5220J13549L4132o0356o0145K0814M889N3789k2261m5777Q714k7959
$$ 94138 119358 232907 267039 206683 146538 167352 172241 226030 203769 157992 166706 138747
8970A38747K282J4866j0107k450k6861J0704r329K0758N648p081J144K0086K1806
$$ 138747 141029 155895 145788 143338 116477 127181 117852 138610 144258 137177 138321 158407 180213
8957A80213P4214R271j6724l6962o1519n055N3702N978J3278L0390o1748o833
$$ 180213 254427 263698 246974 210012 148493 143438 197140 203118 216396 246786 185038 178205
8945A78205r501L7051j8631j2297n1904j5539J2413L5643O5241L454n1209j3005
$$ 178205 168704 205755 187124 174827 122923 107384 119797 155440 220681 224135 172926 159921
8933A59921p498O309p7682m4096j0908N0223J7591o8832j448M1900J3908k226
$$ 159921 152423 158732 81050 36954 26046 76269 93860 25028 23580 65480 79388 77162
8921G7162j9997j0041M2384L7345P856j2209n5289l034P5946k3902k7038L9699
$$ 77162 57165 47124 89508 126853 134709 122500 67211 64177 140123 116221 89183 128882
8909A28882L6348N8544N5144m9061J327l8001l9860J5000n225o6666J8775J7165
$$ 128882 165230 223774 278918 229857 231184 193183 153323 168323 163098 96432 115207 132372
8897A32372L8885M5727p655n2836o624J8924k7172o8371j5496J7629J7146N698
$$ 132372 171257 216984 209329 156493 149869 168793 141621 73250 57754 75383 92529 98227
8885I8227J1647m0178L3884J6897k194m1202j6606o489J8466j3109j9832L3444
$$ 98227 109874 69696 103580 120477 118283 77081 60475 53986 72452 59343 39511 72955
8873G2955K0008M6580n266K5095O5575m2688j0635L2161o9346j8419j0555M1587
$$ 72955 92963 139543 134277 159372 224947 182259 171624 203785 134439 116020 105465 147052
8861A47052K9215m3783o0729J7015L7696N700j5216m5602j3536j8753L1510M5513
$$ 147052 176267 132484 71755 88770 126466 132166 116950 71348 57812 39059 70569 116082
8849A16082M288k942m5906m7009K4240k5644m734j2318M9665P0656J6732j7992
$$ 116082 120370 117428 71522 24513 48753 23109 18375 6057 55722 126378 143110 125118
8837A25118j6858L493Q430k1834l0494N4211O0307J2337n3770j08049j8432j7877
$$ 125118 108260 111753 120183 98349 67855 122066 182373 194710 140940 32891 14459 -3418
8825c418Q549M1698L1117K7959o6294k6108L8645P2295l0179l7542L8863M5407
$$ -3418 5131 46829 77946 105905 39611 13503 52148 124443 94264 56722 95585 140992
8813A40992L8996r86l5065l4057M1887K6042KK9846k168m4897k7751j2543K7961
$$ 140992 179988 179002 143937 109880 151767 177809 177811 207657 205489 160592 132841 120298 148259
8800A48259l475m2810N102k1999o5946k3416L1818O1933K9921j5715J0883J8092
$$ 148259 144784 101974 107076 85077 19131 -4285 27533 89466 119387 103672 114555 132647
8788A32647j5276M2783J3750k0295R343l1679L788K784k7805o457l7369K8656
$$ 132647 117371 160154 173904 153609 162952 131273 135061 137845 110040 103583 66214 94870
8776I4870o993K1385k2785o8480k4536K4646P4339J5145K1995k0882l671K1211
$$ 94870 87877 109262 86477 17997 -6539 18107 92446 107591 129586 108704 105033 126244
8764A26244j9471l4761K4605O0228j5569N024l835K1281k944r3o5151l9454m2607
$$ 126244 106773 72012 96617 156845 141276 146300 142465 163746 160802 160709 95558 56104 13497
8751A3497j9222n3601J0722K6006L5233J1956K9253N2481j3793l5142N239L2634
$$ 13497 -5725 -59326 -48604 -22598 12635 24591 53844 106325 92532 57390 62629 95263
8739I5263l2754n3353j7326M6320P853k0969O1418M4190n9246j0159J1508j7110
$$ 95263 62509 9156 -8170 38150 46003 25034 86452 130642 71396 61237 72745 55635
8727E5635j9090L1126L3945l5120q601M4928K0156N2272L6523k9220j7088O698
$$ 55635 36545 67671 101616 66496 57895 102823 122979 175251 211774 182554 165466 172164
8715A72164J6885L016n9824J7633O398n2245k8939k763M1191L5675k8913n9931
$$ 172164 189049 192065 132241 149874 156272 104027 75088 72325 113516 149191 120278 60347
8703F0347j1574K2063L2601m0424l3928q22L8192l7496J5598J16258k1646p0711
$$ 60347 48773 70836 103437 63013 29085 28263 66455 28959 44557 160815 139169 68458
8691F8458l8994o5383o3087l337N4166Q9665K600o1673L806K5690O9172O061l0094
$$ 68458 29464 -35919 -99006 -102343 -48177 41488 44088 -17585 -13779 11911 81083 87144 57050
8678E7050O1158O2588n2920q1883k8521j1425J6818J6267O0595N2903L7944j0813
$$ 57050 118208 180796 127876 45993 17472 6047 22865 39132 99727 152630 190574 179761
8666A79761j7034n972N6724n4986r7572j7016j6990L9300M8480K229K9732J999
$$ 179761 162727 156755 213479 158493 60921 43905 26915 66215 114695 116924 146656 148655
8654A48655O332M7186m6275k7371j4490J6350j8921k4560j5799k8969k9868k91
$$ 148655 154987 202173 155898 128527 114037 130387 111466 86906 71107 42138 12270 11979
8642A1979M6178J02304L444j6096o563n3767Q4054R234q4313k7554K3447p744
$$ 11979 58157 160461 163905 147809 141246 87479 171533 180767 96454 68900 92347 84603
8630H4603J993M0068j4749L061m8698k3888L2372O2730Q0658J9378r2177m0055
$$ 84603 86596 126664 111915 114976 66278 42390 74762 137492 218150 237528 145351 105296
8618A05296L353N4412L965l1903Q4230N9217J26112J68452K33021K41952J57631
$$ 105296 108649 163061 167026 135123 219353 278570 404682 573134 806155 1048107 1205738
8607A205738J58970J1596l15842l28148j62843k6102p9783k9392q2041j7502j6119
$$ 1205738 1364708 1376304 1060462 732314 569471 543369 463586 434194 352153 334651 318532
8596C18532o0327m8331O193j5649K6307k3906l8229L53M6847L6422K2007j2307
$$ 318532 258205 209874 216067 200418 226725 202819 164590 164943 211790 248212 270219 257912
8584B57912k9356p7702k5183k8730L0617N6491P9648L6717K0942N4940K2045K0878
$$ 257912 228556 150854 125671 96941 127558 184049 263697 300414 321356 376296 398341 419219
8572D19219r77L3999P6634P8839N4708K65692N02470N23977K55609J86720J29005
$$ 419219 418242 452241 528875 607714 662422 928114 1430584 1954561 2210170 2396890 2525895
8561B525895l20698o54754m29365k40818j63294j43940j18698J7164M9709k3074
$$ 2525895 2205197 1550443 1121078 880260 716966 573026 454328 471492 521201 498127
8551D98127r4555l0178L1140N662j4797r1395k7588m804m3309K3665M7576k1035
$$ 498127 403572 373394 404534 410196 395399 304004 276416 271612 228303 251968 299544 278509
8539B78509k2312L3890O7569K0587n6720o9124l1804Q6877j5588L8604J9732M006
$$ 278509 256197 290087 357656 378243 321523 252399 220595 307472 291884 330488 350220 354226
8527C54226l688J5222O6274N2043P9001J81558K09658J93975J07619M5902j7981
$$ 354226 350538 365760 432034 484077 563078 744636 954294 1148269 1255888 1301790 1283809
8516A283809k52228l32353k11369j01307n5086j6178L807m3039l5157p147k4226
$$ 1283809 1031581 699228 487859 386552 331466 315288 319095 276056 240899 233752 209526
8505B09526J5098J8283K8141K810p3939l4405N094P7505Q947n6302k3475o124
$$ 209526 224624 242907 271048 273858 199919 165514 170608 248113 257060 200758 177283 171159
8493A71159L1748J9794K0863L4552l3753m9778j5754O7059J7575j8871o747k6318
$$ 171159 202907 222701 243564 278116 244363 194585 178831 245890 263465 244594 237847 211529
8481B11529N651J658o1219o6660j7237L8668K2852J7338K2868L308o486l5485
$$ 211529 217180 218838 157619 90959 73722 112390 135242 152580 175448 178756 172270 136785
8469A36785J8563P583n3750n2756l1839M0863L5833R46O9406O1456j5678k2184
$$ 136785 155348 162931 109181 56425 24586 65449 101282 102228 171634 233090 217412 195228
8457A95228r632N234K3864j5871k0496j01098p6845l2455k5855p139N4252N4758
$$ 195228 185596 190830 214694 198823 178327 77229 384 -32071 -57926 -65065 -10813 43945
8445D3945M6551k4660M2459N3447J5054m5347k4084J9943l8336m2269k7492j8127
$$ 43945 90496 65836 108295 161742 176796 131449 107365 127308 88972 46703 19211 1084
8433A084k2148L6306M9266J6300Q712K4706J9882m5988o287N3877n8476o9233
$$ 1084 -21064 15242 64508 80808 89520 114226 134108 88120 81833 135710 77234 8001
8421H001L0157q6444j0655O860O7288K2481j7078K9141J3581N039J3058L2095
$$ 8001 38158 -48286 -58941 -52081 15207 37688 20610 49751 63332 68371 81429 113524
8409A13524j145n8690K773O9674M2874J6985l7816k7239j0761K5215l9578K0868
$$ 113524 112379 53689 56462 126136 169010 185995 148179 120940 110179 135394 95816 116684
8397A16684M6586l2749m6375M6180j8944n0444l2857j6786l2378M7296L5938K4541
$$ 116684 163270 130521 84146 130326 111382 60938 28081 11295 -21083 26213 62151 86692
8385H6692n023o303M2216K5116J9151l5229m2897J0510o814r419n6553m2510J8059
$$ 86692 81669 75366 117582 142698 161849 126620 83723 94233 87419 78000 21447 -21063 -3004
8372c004O101J9662l3961n3564n971M0034P6067l1026l5887q221J9552K9313K8820
$$ -3004 3097 22759 -11202 -64766 -70737 -30703 45364 14338 -21549 -29770 -10218 19095 47915
8359D7915O3980J6116k6020k0578m309l1424m8890l2758l516K1272j230P271L8451
$$ 47915 111895 128011 101991 81413 77104 45680 -3210 -35968 -39484 -18212 -19442 -12171 26280
8346B6280M0871J9858M9973k0590q4246K359l1800N537R1868l8234m3623j0944
$$ 26280 67151 87009 136982 116392 32146 34505 2705 8242 100110 61876 18253 7309
8334G309m0545n2137j6850K6280N1942k3354m000J2619N957L7660J7231k8321
$$ 7309 -33236 -85373 -102223 -75943 -24001 -47355 -51355 -38736 -32779 4881 22112 -6209
8322f209M080J3758N134M0752l3184k1188J7868J6170l0025k3189k9464j96M1216
$$ -6209 -2129 11629 16763 57515 24331 3143 21011 37181 7156 -16033 -45497 -45693 -4477
8309d477M097J0552k0769k5701j6231J1215j6819R130P9073J6593J6766j9677
$$ -4477 -380 10172 -10597 -36298 -52529 -41314 -58133 -49003 30070 46663 63429 43752
8297D3752M4981o731m5473m7838m4908L8798p2358j7474M5684N5309M0109M856
$$ 43752 88733 82002 36529 -11309 -56217 -17419 -89777 -107251 -61567 -6258 33851 38707
8285C8707m1887m3353m9066M2165M3327k9822J8032P340k0484R08N4629J135m5872
$$ 38707 -3180 -46533 -95599 -53434 -10107 -39929 -21897 -14557 -35041 -34133 20496 21631 -24241
8272b4241J0810M6430J0263L0604J8717J0326l4373k3839K9256m473O837N2398
$$ -24241 -13431 32999 43262 73866 92583 102909 68536 44697 73953 69480 76317 128715
8260A28715k2524n2932o3447j7968l5426N9683Q4331j2044k1658M1896n0393p842
$$ 128715 106191 53259 -10188 -28156 -63582 -3899 80432 68388 46730 88626 38233 30391
8248C0391R212J1170k6981J5416M1161j6164j8430M5485m2601m4288L9322j3004
$$ 30391 39603 50773 23792 39208 80369 64205 45775 91260 48659 4371 43693 30689
8236C0689p6001m1813M6328K9417l4182m3o566L4101J1056J9368K3075N3135M2821
$$ 30689 -45312 -87125 -40797 -11380 -45562 -45605 -52171 -18070 -7014 12354 35429 88564 131385
8223A31385N794o1457n3232M97k0684n9763j5204p95O6131J6595N4092M0822J2912
$$ 131385 137179 75722 22490 22987 2303 -57460 -72664 -73459 -7328 9267 63359 104181 117093
8210A17093m1596J1059Q264l629K7957O3584M0592K2093j13585q0353l2326k1627
$$ 117093 75497 86556 94820 91191 119148 182732 223324 245417 131832 51479 19153 -2474
8198b474l429K9379k8344j171k418k4905J8227K6660l3504O814M2808L2899K2535
$$ -2474 -5903 23476 -4868 -6039 -8457 -33362 -15135 11525 -21979 -15165 27643 60542 83077
8185H3077k8820l2816K1213j4930m832J3159N4062m623n1194l0902k1018J1696
$$ 83077 54257 21441 42654 27724 22892 36051 90113 85490 34296 3394 -17624 -5928
8173e928j3403l0913M999l8456j7146L2336l2366j1180P1179L9107M6156p024
$$ -5928 -19331 -50244 -45245 -83701 -100847 -68511 -100877 -112057 -40878 -1771 44385 37361
8161C7361k773L1041L1335J0545n0866r9415j221M2992j0742K1495p623j3793
$$ 37361 34588 65629 96964 107509 56643 -42772 -43993 -1001 -11743 9752 2129 -11664
8149a1664j3503K886L3091k581j9833n8609K1306M7538M3103L405k3857K897M9866
$$ -11664 -25167 -22281 10810 8229 -11604 -70213 -48907 -1369 41734 45139 21282 24179 74045
8136G4045j1065r888r056m377j5864n3748n645L8974J9462J7609K4113j3405j4983
$$ 74045 62980 53092 44036 39659 23795 -29953 -35598 3376 22838 40447 64560 51155 36172
8123C6172l6352K9096l4070J9199N0328n9209l7629j2803P8008l7340k4269O5471
$$ 36172 -180 28916 -5154 14045 64373 5164 -32465 -45268 32740 -4600 -28869 36602
8111C6602K1005l0555j9633J0298k640L0150M9616m6341n8584J5134L2643P3598
$$ 36602 57607 27052 7419 17717 15077 45227 94843 48502 -10082 5052 37695 111293
8099A11293K9733n6227m9915J7452m5256M1983O089k1193l4423r3181l645Q6745
$$ 111293 141026 84799 34884 52336 7080 49063 55152 33959 -464 -93645 -97290 -10545
8087a0545M0237l240o6570J8863k878P550m249j2781J3812o973j0609L8436r348
$$ -10545 29692 26452 -40118 -21255 -24133 -16583 -20832 -33613 -19801 -26774 -37383 1053 -8295
8074h295m4436O65P9121J5844p1679j9662O9191K4402O3048M1953M6845J1369
$$ -8295 -52731 -52066 27055 42899 -28780 -48442 20749 45151 108199 150152 196997 208366
8062B08366m7023r7898j23972L23K2377K7981j4204K4559M1380J6355o0399j9844
$$ 208366 161343 63445 -60527 -60204 -37827 -9846 -24050 509 41889 58244 -2155 -21999
8050b1999J9581Q9304j3480o7901O5479M8220j3734j5529L6716Q0185n5847K4810
$$ -21999 -2418 86886 73406 5505 70984 119204 105470 89941 126657 206842 150995 175805
8038A75805l3453o5711J1278k2407J7082K1343K9835j4044l0207q87L8123j0486
$$ 175805 142352 76641 87919 65512 82594 103937 133772 119728 89521 88634 126757 116271
8026A16271m8775o5235K501O3011o0595j0112m3327k5755r128J07398K6827n8048
$$ 116271 67496 2261 4762 67773 7178 -2934 -46261 -72016 -81144 26254 53081 -4967
8014d967K0717J4123L5226j7477k9595j2897k4493J3964M1767J442m0765N080
$$ -4967 15750 29873 65099 47622 18027 5130 -19363 -5399 36368 37810 -2955 2125
8002B125l0886q98P5665r208l3523j7670O241L682K5855j2897j386M5746j9115
$$ 2125 -28761 -29659 46006 36798 3275 -14395 -8154 -4472 21383 8486 7100 52846 33731
7989C3731k2312M04J872k0312K2523r460J1719K5579P3171J3012n0009j7522j6868
$$ 33731 11419 11823 13695 -6617 15906 6446 18165 43744 116915 129927 79918 62396 45528
7976D5528j9829K0980M0423o3213p5157J8293K3145o141R224R2876j87k5230J7089
$$ 45528 25699 46679 87102 23889 -51268 -32975 -9830 -15971 -6747 86129 85942 60712 77801
7963G7801m4926L9204Q333O777O1694j6170n5978m0434m0163M919O528L9674J19
$$ 77801 32875 72079 80412 87189 148883 132713 76735 36301 -3862 1057 7585 47259 47378
7950D7378J9766O3667K3710n8118m0735k4103Q289O4772M2435k031J9686J6329
$$ 47378 67144 130811 154521 96403 55668 31565 39854 104626 147061 145030 164716 181045
7938A81045p1869m3351Q840L3512R632j7261p6441j8653Q488K6194l5061J3055
$$ 181045 109176 65825 74665 108177 117809 100548 24107 5454 13942 40136 5075 18130
7926A8130P590l8665j9406L3617L101k8232p417K1597k3580J3076M9722M783K9045
$$ 18130 25720 -12945 -32351 1266 4367 -23865 -31282 -9685 -33265 -20189 29533 34316 63361
7913F3361q2011j3582P7176K3210p0337m8350L3599J3049k9534j6638R19M8486
$$ 63361 -18650 -32232 44944 68154 -2183 -50533 -16934 -3885 -33419 -50057 -49138 -652
7901f52k8395j7738k7835R4351r352j1643O4221J0053M7272m3532J4228j6204
$$ -652 -29047 -46785 -74620 19731 10379 -1264 62957 73010 120282 76750 90978 74774
7889G4774J0339L0432j9866j11450o2402n984P9O7718O9471l1348p1843K8411
$$ 74774 85113 115545 95679 -15771 -78173 -84157 -84078 -16360 53111 21763 -50080 -21669
7877b1669L9801j6193m8853m9490K8326K7586j8434j3837L0781N9665J1395n3501
$$ -21669 18132 1939 -46914 -96404 -68078 -40492 -58926 -72763 -41982 17683 29078 -24423
7865b4423k5754N1103J8476q61J0685K549O4205K7373Q057k5531o2703l0413L7571
$$ -24423 -50177 926 19402 18541 29226 31775 95980 123353 131410 105879 43176 12763 50334
7852E0334N1697j7344q460L78p312k1051k5845K2121J9632j2145J5306Q914l0669
$$ 50334 102031 84687 76227 76605 69293 48242 22397 44518 64150 52005 67311 76225 45556
7839D5556J0866K5083K6079n2262l7635J4428J4968K6849p1431j4882R498l1197
$$ 45556 56422 81505 107584 55322 17687 32115 47083 73932 2501 -12381 -2883 -34080
7827c4080N933j0944O479l3714L3608M5135K7976K7149o9565m332j3141O206N976
$$ -34080 -28147 -39091 -32612 -66326 -32718 12417 40393 67542 -2023 -6355 -19496 -13290 -7314
7814g314J2661L8071J6746N430Q17j2580n6476K8783K6582r704k016j8982J4742
$$ -7314 5347 43418 60164 65594 66411 53831 -2645 26138 52720 43016 41000 22018 36760
7801C6760j8313j7409j9593r731J1790J8283k8175J1204P6780r21n1929k8468
$$ 36760 18447 1038 -18555 -28286 -16496 1787 -26388 -15184 61596 60675 8746 -19722
7789a9722J9962N4361o4475p1103N6106M9300j0462o60m581k7193P3301R542P212
$$ -19722 240 54601 -9874 -80977 -24871 24429 13967 13307 8726 -18467 54834 64376 71588
7776G1588k2861l8297K6722O521n4398q4897O193O231O1955K2429P569J1621K232
$$ 71588 48727 10430 37152 43673 -10725 -95622 -89429 -83198 -21243 1186 8755 20376 22608
7763B2608K2154q614k5787l3857J4777O484J5480n8366q758P9826K8383j5326
$$ 22608 44762 36148 10361 -23496 -8719 -2235 13245 -45121 -53879 25947 54330 39004
7751C9004N643J3719n1771N06K5820L6785L0943k8555l6705L888j7819K6618P5435
$$ 39004 44647 58366 6595 7101 32921 69706 100649 72094 35389 39277 21458 48076 123511
7738A23511j5240o6059p3111N7315K7226Q157k6835n1533K8938l253M6138K1746
$$ 123511 108271 42212 -30899 26416 53642 61799 34964 -16569 12369 9116 55254 77000
7726G7000l7540k5052k404l5154j2200r41j6854j7785J5455L8916K0416M9996
$$ 77000 39460 14408 12004 -23150 -35350 -36291 -53145 -70930 -55475 -16559 3857 53853
7714E3853L8671j000k3082k2694L6984M8881k1102o4024M3431K2713o9838o7629
$$ 53853 92524 91524 68442 45748 82732 131613 110511 46487 89918 112631 42793 -24836
7702b4836j5890J0960J0111J02591j3770n7230m7399m2169o3998J3840M0388J1545
$$ -24836 -40726 -29766 -19655 82936 69166 11936 -35463 -77632 -141630 -127790 -87402 -75857
7690g5857M1484J8239n138M9522J0159n804O6064j8593o2057l068Q957o3380J7533
$$ -75857 -34373 -16134 -21272 28250 38409 32605 98669 80076 18019 14951 23908 -39472 -21939
7677b1939R041l7543K0582J4584q3207K1856O7342J02146R658K2215j6420r6263
$$ -21939 -12898 -50441 -29859 -15275 -98482 -76626 -9284 92862 102520 124735 108315 12052
7665A2052o4495Q257P4395K7845M8102L135m3943p3030k9462l9092J9006N6810
$$ 12052 -52443 -44186 30209 58054 106156 109291 65348 -7682 -37144 -76236 -57230 -420
7653d20J6373n0456n3239k164l5204P0281N0144O4843O0944j5899n3507m1195
$$ -420 15953 -34503 -87742 -89906 -125110 -54829 -4685 60158 121102 105203 51696 10501
7641A0501L7315l1715J5810K3461J5186m744l1265k6052J1598l9268J2322J1443
$$ 10501 47816 16101 31911 55372 70558 65814 34549 8497 20095 -19173 -6851 4592
7629D592j461J881j2307Q839m6998L3799j5102q4917r993J22496J2258q316q008
$$ 4592 3131 5012 -7295 1544 -45454 -11655 -26757 -111674 -121667 829 13087 4771 -3237
7616c237J7428O8479J3827k2854k5918J9786J7995q0498m1503M7808M6941l060
$$ -3237 14191 82670 96497 73643 47725 67511 85506 5008 -36495 11313 58254 55194
7604E5194n6345j4598O3547k7662K3165L1944l2779k484L6774N7636K550o8649
$$ 55194 -1151 -15749 47798 20136 43301 75245 42466 39982 76756 134392 136942 68293
7592F8293m3793p2412n8581O270K8266L050M9962K9620k458P32l2549J2719L7060
$$ 68293 24500 -47912 -106493 -100223 -71957 -68907 -18945 10675 8217 8949 -23600 -10881 26179
7579B6179p329m3444k3829O186o586K7876j4695P7407q201p8858K3120K3426N239
$$ 26179 18850 -24594 -48423 -42237 -48823 -20947 -35642 41765 33564 -45294 -22174 1252 6491
7566F491p885l6973m8291K755k5717J0631N0910M2614k103m1518K5367M6067r342
$$ 6491 -1394 -38367 -86658 -83903 -109620 -98989 -48079 -5465 -7568 -49086 -23719 22348 13006
7553A3006p8689o9901M9619N3600M4762Q316j0604M0887J8710l1553q7909k4300
$$ 13006 -65683 -135584 -85965 -32365 12397 20713 10109 50996 69706 38153 -49756 -74056
7541g4056J4403L850O8813k0521l7978J4720n3113k6098N8623Q2874n7189n9921
$$ -74056 -59653 -55803 13010 -7511 -45489 -30769 -83882 -109980 -51357 31517 -25672 -85593
7529h5593j5069J6591k1037L3843O0305j8668k5230K2581M4958K4837L146k1377
$$ -85593 -100662 -84071 -105108 -71265 -10960 -29628 -54858 -32277 12681 37518 40664 19287
7517A9287P123j0132k5862m4577J3218O1426k1931L0953l854m2426M1156M1886
$$ 19287 26410 16278 -9584 -54161 -40943 20483 -1448 29505 25651 -16775 24381 66267
7505F6267o2541l2902o29Q4755O540n8202m0985K6284L6548M9019N70O2689m8027
$$ 66267 3726 -29176 -29805 54950 61490 3288 -37697 -11413 25135 74154 74724 137413 89386
7492H9386k6685K8992O643n7384o1905k4776O3762K1968o6957j8157N0092K1692
$$ 89386 62701 91693 98336 40952 -20953 -45729 18033 40001 -26956 -45113 4979 26671
7480B6671n2935k1539K0531k1638q645J0906j8613k225O3891M2211J56n6561N177
$$ 26671 -26264 -47803 -27272 -48910 -57555 -46649 -65262 -67487 -3596 38615 38771 -17790 -12613
7467a2613J5000k2218j2179J5524M7533j9646q588j9599N775J9795J930n03l9474
$$ -12613 2387 -19831 -32010 -16486 31047 11401 2813 -16786 -11011 8784 10714 10211 -29263
7454b9263k8949K3751n141l6607k4450k3883N8210K7298K6986J2140K579J5170
$$ -29263 -58212 -34461 -39602 -76209 -100659 -124542 -66332 -39034 -12048 92 2671 17841
7442A7841j8474n7675k2304P8681L1803M074n2064L7516L445l9882J4954L6043
$$ 17841 -633 -58308 -80612 -1931 29872 33946 -18118 19398 22843 -17039 -2085 33958
7430C3958J266j7883l8955Q725K3265J2373J01211l3906o3391n7041n6528L3947
$$ 33958 35224 17341 -21614 -12889 10376 22749 123960 90054 26663 -30378 -86906 -52959
7418e2959J5309J6617n001o789l909J2420n84p672Q013p373n7155O5296R623o9582
$$ -52959 -37650 -21033 -26034 -32823 -36732 -24312 -24896 -32568 -24555 -31928 -89083 -23787 -14164 -83746
7404h3746O8596O6314k3278L141N4319p638L27k1498j6849j7494L4353J826m7090
$$ -83746 -15150 51164 27886 31027 85346 77708 78035 56537 39688 22194 56547 58373 11283
7391A1283K2992K1055k8686m4330n98m3711M4609Q261J446K0812m2403L9802M1156
$$ 11283 34275 55330 26644 -17686 -18284 -61995 -17386 -9125 -7679 13133 -29270 10532 51688
7378E1688m0775m9780L2050L7294j018K6680K4553J6491l8497p0687m5320k4886
$$ 51688 10913 -38867 -6817 30477 29459 56139 80692 97183 58686 -12001 -57321 -82207
7366h2207q290n0238O2484r894M9201K1763J2964l4174L9972L7279l2930k2073
$$ -82207 -90497 -140735 -78251 -88145 -38944 -17181 -4217 -38391 1581 38860 5930 -16143
7354a6143k4429L6023M0519m9570L1617n6143m1312q851l4927L9411N0598J02286
$$ -16143 -40572 -4549 35970 -13600 18017 -38126 -79438 -88289 -123216 -83805 -33207 69079
7342F9079P8603l3878m8248r430l7408K7420k7021k4407P9575J5405o5939k6122
$$ 69079 147682 113804 65556 56126 18718 46138 19117 -5290 74285 89690 23751 -2371
7330b371P200Q566m8829p3006r254L1581R214N7410O8400n8978l8999J1574J787
$$ -2371 4829 13395 -35434 -108440 -117694 -86113 -76899 -19489 48911 -10067 -49066 -37492 -35705
7317c5705j2459N3677k564k4867o0127J6874K0102j0786O6390J00004j2006n5286
$$ -35705 -48164 5513 2949 -21918 -82045 -65171 -45069 -55855 10535 110539 98533 43247
7305D3247l7629k4864k2424J6882L1823M6248J1894l1252j919L9621K0718j1353
$$ 43247 5618 -19246 -41670 -24788 7035 53283 65177 33925 32006 71627 92345 80992
7293H0992l3793R058J2328o1965m0368J7035P5803L4218J3266m5933m4654M3689
$$ 80992 47199 56257 68585 6620 -33748 -16713 59090 93308 106574 60641 15987 59676
7281E9676K089J7017m4727l2033J9282m1549P868L840N1303M0632l1760n2463
$$ 59676 61765 78782 34055 2022 21304 -20245 -12377 -8537 42766 83398 51638 -825
7269h25k5388l924k8751n0266J3365J17194J8589q5612k3492L9044J15493M7007
$$ -825 -26213 -30137 -58888 -109154 -95789 21405 39994 -45618 -69110 -30066 85427 132434
7257A32434O068j735j8191k8805n8920M857n391K0348k9036r139J0662n8525l1901
$$ 132434 138502 136767 118576 89771 30851 35708 30317 50665 21629 12490 23152 -35373 -67274
7244f7274J0129J9236K5123M1099L6417m7360k9382o717K7256k8709r872m065
$$ -67274 -57145 -37909 -12786 28313 64730 17370 -12012 -18729 8527 -20182 -30054 -34119
7232c4119M4365K015j9625n1661j4591j3500K0923J15099K8363J5410n7118j12033
$$ -34119 10246 12261 -7364 -59025 -73616 -87116 -66193 48906 77269 92679 35561 -76472
7220g6472m1074K9534J8966K2200M515k9860J9388O2999J2519n595m943j9271
$$ -76472 -117546 -88012 -69046 -46846 -42331 -72191 -52803 10196 22715 17120 12177 -7094
7208g094M320L6713k3865k9634m9568l1025O775j3755L9938k3449Q79j1002M0156
$$ -7094 -2774 33939 10074 -19560 -69128 -100153 -93378 -107133 -67195 -90644 -89765 -100767 -60611
7195f0611K2711l2448K5306J0856j2303j1250Q557N92m6162K3699M7716O3666
$$ -60611 -37900 -70348 -45042 -34186 -46489 -57739 -49182 -48590 -94752 -71053 -23337 40329
7183D0329L2186K4731j2544q4389q462n1389Q667p690K8277P4315J2394k5303
$$ 40329 72515 97246 84702 313 -8149 -59538 -50871 -58561 -30284 44031 56425 31122
7171C1122j3797r040K9573K7581k7003q3112j4911M6765J33809l1764r3434p77
$$ 31122 17325 8285 37858 65439 38436 -44676 -59587 -12822 120987 89223 -4211 -4988
7159d988k1335j4273O8965J3350n4058n2095o378N2252K0243M1818J9415j9771
$$ -4988 -26323 -40596 28369 41719 -12339 -64434 -70812 -18560 1683 43501 62916 43145
7147D3145j8943J1845M2220J6403k6557n3483l8921j7174Q171R981J3279P5340
$$ 43145 24202 36047 78267 94670 68113 14630 -24291 -41465 -33294 -23313 -10034 65306
7135F5306j619k2718n6201M032K0824J975N408j6376q756j4711K4726L8025j1165
$$ 65306 63687 40969 -15232 -11200 9624 11599 17007 631 -8125 -22836 1890 39915 28750
7122B8750m1317L9441M2500q7790l9030M3244m396n233m9074n542p520r569l3212
$$ 28750 -12567 26874 69374 -18416 -57446 -14202 -18598 -23831 -72905 -78447 -85967 -95536 -128748
7109a28748N6752Q919j2838L2322M5436j8892j2191q910Q992K1706K5002M5982
$$ -128748 -71996 -63077 -75915 -43593 1843 -17049 -29240 -38150 -29158 -7452 17550 63532
7097F3532k6243M422o5422q0568N7928M803m0871K6839K1813M1476k6740j4318
$$ 63532 37289 41711 -23711 -104279 -46351 -41548 -82419 -55580 -33767 7709 -19031 -33349
7085c3349L4083m1223J6665K1345k2291o130J9206N1980K4632k2388J0111O2730
$$ -33349 734 -40489 -23824 -2479 -24770 -30900 -11694 40286 64918 42530 52641 115371
7073A15371o0818k969N17j8562m3674k1946Q134K8504L0932Q0711O1465n9846
$$ 115371 54553 51584 52101 33539 -10135 -32081 -23947 4557 35489 116200 177665 117819
7061A17819o7702J1148n1672J7211J08110j1862p8765n8609j9785K3126n953l46
$$ 117819 50117 61265 9593 26804 134914 123052 44287 -14322 -34107 -10981 -16934 -17280
7049a7280K978n954L4930K4498j0405q287J8582J934l5393K7686O8053j1887p609
$$ -17280 -14302 -20256 14674 39172 28767 20480 39062 40996 5603 33289 101342 89455 81846
7036H1846K1132j7483n3402J126k7570m486l5603J476P7081L897p6472n6011j1044
$$ 81846 102978 85495 32093 33219 5649 1163 -34440 -32964 44117 48014 -28458 -84469 -95513
7023i5513m428L4785J9829m9711k9526N5212M7277L7437k9167p9994m0122J8626
$$ -95513 -99941 -65156 -45327 -95038 -124564 -69352 -22075 15362 -13805 -93799 -133921 -115295
7011a15295O8848J9619l1444J802N4895L7958l4953Q938K9768j884k2004k984
$$ -115295 -46447 -26828 -58272 -56470 -1575 36383 1430 10368 40136 38252 16248 13264
6999A3264L1967J5156N1236q984q5403o9529q5106K2069L5844M6245j0874m6040
$$ 13264 45231 60387 111623 102639 17236 -52293 -137399 -115330 -79486 -33241 -44115 -90155
6987i0155k3854J9319N7144P8917J3534j0708k1705j5068r523k5186k9491K1033
$$ -90155 -114009 -94690 -37546 41371 54905 44197 22492 7424 -2099 -27285 -56776 -35743
6975c5743N052l2306J8470l8594l0305Q9890J5500m8621k0484R0890Q437j8333
$$ -35743 -30691 -62997 -44527 -83121 -113426 -23536 -8036 -56657 -77141 13749 22186 3853
6963C853K2630o358K4491j7935L2506K5849P325m2245M161l0113N3317P8244J6275
$$ 3853 26483 20125 44616 26681 59187 85036 92361 50116 54277 24164 77481 155725 172000
6950A72000k5901p1960l5012j20380l5630P0342N7627N167o990K3361K553l3417
$$ 172000 146099 74139 39127 -81253 -116883 -46541 11086 16253 9263 32624 35177 1760
6938A760j3037K6298j0291m1153K2080m7429m2841J462o618M476Q2080K1806j5326
$$ 1760 -11277 15021 4730 -36423 -14343 -61772 -104613 -103151 -109769 -105293 -23213 -1407 -16733
6925a6733J2767n926k8238l2124L1336O5267j5718l8451m7964k642N3456q981
$$ -16733 -3966 -9892 -38130 -70254 -38918 26349 10631 -27820 -75784 -78426 -24970 -33951
6913c3951M5532J6803o7835M0837N0138k4037l367L327J7821n385o7483m4520
$$ -33951 11581 28384 -39451 1386 51524 27487 24120 27447 45268 39883 -27600 -72120
6901g2120M805K1462K9601j852m8777P9L9301J4624j9J4065J2385N5832O5437
$$ -72120 -67315 -45853 -16252 -18104 -66881 -66802 -27501 -12877 -12896 1169 13554 69386 134823
6888A34823o7990q9679k7382r176l3580J3693K9955j2607j2244J3835k0875J0343
$$ 134823 66833 -22846 -50228 -59404 -92984 -79291 -49336 -61943 -74187 -60352 -81227 -70884
6876g0884N2550K8826q307Q953M0458n609k1870n7710K558P5443L0087j5249l3953
$$ -70884 -18334 10492 2185 11138 51596 45987 24117 -33593 -31035 44408 74495 59246 25293
6863B5293J7165J650p5665n1702m4618J0159O8299L5656O404K3908m9123l5042
$$ 25293 42458 44108 -31557 -83259 -127877 -117718 -49419 -13763 -7359 16549 -32574 -67616
6851f7616N9575J4164k3112l8262k1013L2425l704K1204q513n1948O7523N6601
$$ -67616 -8041 6123 -16989 -55251 -76264 -43839 -47543 -26339 -34852 -86800 -19277 37324
6839C7324L6594J2126j0940J4456o3461q9486K526K4749P6677J8892j6970M813
$$ 37324 73918 86044 75104 89560 26099 -63387 -60861 -36112 40565 59457 42487 47300
6827D7300l6539k003j9191J2917O6611q257r6569l7411O746J0070n2946O8931
$$ 47300 10761 8758 -10433 2484 69095 60838 -35731 -73142 -66396 -56326 -109272 -40341
6815d0341J57594M3944l9098m5659q0989n0631K040K4537M6661N8088K5845j44053
$$ -40341 117253 161197 122099 76440 -4549 -55180 -53140 -28603 18058 76146 101991 -42062
6803d2062j02789M254j1267K5411N8453K358J9695J8051P3006K4728P81m8107
$$ -42062 -144851 -140597 -151864 -126453 -68000 -65642 -45947 -27896 45110 69838 70619 22512
6791B2512o4585L1026N4429o3973k8633K189O1898J8903l1412N307M0853k1228
$$ 22512 -42073 -11047 43382 -20591 -49224 -47035 14863 33766 2354 7661 48514 27286
6779B7286p9212l4625L7140O7471J0525q242m0300J1002J7419o6397l7265O7399
$$ 27286 -51926 -86551 -49411 18060 28585 20343 -19957 -8955 8464 -57933 -95198 -27799
6767b7799M4469J630l082k1411l2413l8343P5855N3215n3474j746m4028j7814
$$ -27799 16670 18300 15218 -6193 -38606 -76949 -1094 52121 -1353 -3099 -47127 -64941
6755f4941M7354r337R340l7027l8247k5440Q929N4390O5564J77p135r8l8611k6376
$$ -64941 -17587 -26924 -17584 -54611 -92858 -118298 -109369 -54979 10585 10762 3627 3529 -35082 -61458
6741f1458M4779k8599J4439K1227m098q091P6423j49K289l6957m1013k4386k4631
$$ -61458 -16679 -45278 -30839 -9612 -13710 -21801 54622 54473 56762 19805 -21208 -45594 -70225
6728g0225J2332k1099n882N9186K6327L4116K1055L1695K3146q2438o127j9752
$$ -70225 -57893 -78992 -84874 -25688 639 34755 55810 87505 110651 28213 22086 2334
6716B334K5812N7892L193q8394k8468J3835N2506k1266K3793P8898M968o752n3955
$$ 2334 28146 86038 89231 837 -27631 -13796 38710 17444 41237 120135 125103 118351 64396
6703F4396k7799K5893n029m7257J0777j783l3513n7682K1486J7754J9383L7434
$$ 64396 36597 62490 57461 10204 20981 19198 -14315 -71997 -50511 -32757 -13374 24060
6691B4060O2794L119m0573n7051q1875L8408M4970J5495L348q945k318j3498J5224
$$ 24060 86854 89973 49400 -7651 -89526 -51118 -6148 9347 12695 3750 1432 -12066 3158
6678C158J8114M9507M8393k7172q193q0009n3972J6475N513l1929O17L79J0146
$$ 3158 21272 70779 119172 92000 83807 3798 -50174 -33699 -28186 -60115 -59498 -59119 -48973
6665d8973K7446k1636J9962L0896O1203L7567p7815l0401j68n10L2045K4418n9788
$$ -48973 -21527 -43163 -23201 7695 68898 106465 28650 -1751 -1919 -2429 29616 54034 -5754
6652e754L429M5207L4890R059R792l6891p7262j3894k9904Q250L8447n603j6524
$$ -5754 -2325 42882 77772 86831 96623 59732 -17530 -31424 -61328 -53078 -14631 -20234 -36758
6639c6758j2974M3363j3524j7489K6489L9539m662n5538M3576J8055R187k2167
$$ -36758 -49732 -6369 -19893 -37382 -10893 28646 23984 -31554 12022 30077 39264 17097
6627A7097K239O154n0130M3563P432l745N603J0543k6671m7079j950M3826L9677
$$ 17097 19336 25490 -24640 18923 26355 22610 28213 38756 12085 -34994 -36944 6882 46559
6614D6559n2836k3559k6990l1595N219K0893J0333r388m0263K5103Q2541M9116
$$ 46559 -6277 -29836 -56826 -88421 -83202 -62309 -51976 -61364 -101627 -76524 6017 55133
6602E5133m7186l9426J1655J9036P0465m773q0926n8267R190O0709K9145J1683
$$ 55133 7947 -31479 -19824 -788 69677 64904 -16022 -74289 -65099 -4390 24755 36438
6590C6438O0876j3814o3483j2386j529l0953J2370O6336N7321m8312l8916j4641
$$ 36438 97314 83500 20017 7631 6102 -24851 -12481 53855 111176 62864 23948 9307
6578I307m0885l6822R386L2962L306m498L1962J4896j8461L439j8198l265l506
$$ 9307 -31578 -68400 -59014 -26052 -22746 -27244 4718 19614 1153 4592 -13606 -16871 -20377
6565b0377j8990J3050m4680L665M028K6625j8195j171L6193J9009J1619k0510
$$ -20377 -39367 -26317 -70997 -67332 -63304 -36679 -54874 -56045 -19852 -843 10776 -9734
6553i734J13k87j4164L9787q186k1302m1079j814K1627p447P2591K9514j5220
$$ -9734 -9621 -9908 -24072 15715 7529 -13773 -54852 -56666 -35039 -42486 30105 59619 44399
6540D4399n5035j7561q099o6839K247N9855K7287j0146L0056O4081R886q2638
$$ 44399 -10636 -28197 -36296 -103135 -100888 -41033 -13746 -23892 6164 70245 80131 -2507
6528b507o6865m5932N71M1196M6752J5710K1779J5078j7845L5514Q11k1191l0767
$$ -2507 -69372 -115304 -114733 -73537 -26785 -11075 10704 25782 7937 43451 44262 23071 -7696
6515g696M149J4874K3093J3315n5973l9750L5577J2081m3641Q3771N5280l7605
$$ -7696 -3547 11327 34420 47735 -8238 -47988 -12411 -330 -43971 39800 95080 57475
6503E7475n5973p454j9044O4633M9490q2630l5858J259k727l5787n051L2069k1339
$$ 57475 1502 -5952 -24996 39637 89127 6497 -29361 -28102 -30829 -66616 -71667 -39598 -60937
6490f0937J0577L7084J0698m9129m3177K8570M9115M1663P3643j12872o0388k4229
$$ -60937 -50360 -13276 -2578 -51707 -94884 -66314 -17199 24464 98107 -14765 -75153 -99382
6478i9382L5345N0165n9974M2043L347r799o80K7118k8533n2282o754K2736P8454
$$ -99382 -64037 -13872 -73846 -31803 -28456 -38255 -38935 -11817 -40350 -92632 -99386 -76650 1804
6465A804K8509o580J4723m3355P030M760M0105p302q4787k3075m2998M3252M9528
$$ 1804 30313 23733 38456 -4899 2131 6891 46996 39694 -45093 -68168 -111166 -67914 -18386
6452a8386K0843n8294j2407L6491j0752N2721N7696P532O362l5984o6388M881
$$ -18386 2457 -55837 -68244 -31753 -42505 10216 67912 75444 81806 45822 -20566 -15685
6440a5685K9138L6812J771J5928l3433l3184k3011R195K3625l6665J0522r917
$$ -15685 13453 50265 52036 67964 34531 1347 -21664 -12469 11156 -25509 -14987 -24904
6428b4904o6002j6307j1197P2981O8914k2778k2854k5037L9202P6409j9909R252
$$ -24904 -90906 -107213 -118410 -45429 23485 707 -22147 -47184 -7982 68427 48518 57770
6416E7770k6210p2966l763N3238l3391J4197J653j0909r231j4178J7355l4852
$$ 57770 31560 -41406 -45169 8069 -25322 -11125 -9472 -20381 -29612 -43790 -26435 -61287
6404f1287j2954n588M165K4574J4934J4304k2439j5237J5280k2297N940M180O7332
$$ -61287 -74241 -79829 -75664 -51090 -36156 -21852 -44291 -59528 -44248 -66545 -60605 -56425 10907
6391A0907M2673K861j9947k5474m3681l2779Q661l1644K678K7182j777k9359k6890
$$ 10907 53580 56441 36494 11020 -32661 -65440 -56779 -88423 -85745 -58563 -60340 -89699 -116589
6378a16589K1259K1803J3300O1776M3766K5063j1298j1583M854j587q905n014
$$ -116589 -95330 -73527 -60227 1549 45315 70378 59080 47497 52351 50764 41859 36845
6366C6845R095j3578L934P86j0221J2102J3610N4255L841k9956l731J0674j07862
$$ 36845 45940 32362 36296 37082 26861 38963 52573 106828 110669 80713 76982 87656 -20206
6353b0206J286P0179K9448p257M4487M4259j9006k3044o3148p6652J1409m4731
$$ -20206 -18920 51259 80707 73450 117937 162196 143190 120146 56998 -19654 -8245 -52976
6341e2976K0180M7199l0246K0911J9988J853j0665N3954L4067n750l9020p968
$$ -52976 -32796 14403 -15843 5068 25056 26909 16244 70198 104265 98515 59495 51527
6329E1527J6668j4300Q942m9631o4150M0590N8653k891j3863n745j7655m918j6476
$$ 51527 68195 53895 62837 13206 -50944 -10354 48299 45408 31545 25800 8145 3227 -13249
6316a3249j1659r108J4067l4655l1716K1282M2143K2368N711j2335m472L418M2422
$$ -13249 -24908 -34016 -19949 -54604 -86320 -65038 -22895 -527 5184 -7151 -11623 -8205 34217
6303C4217R696n5975m6053n683j5627j0961P1300L9664k3425k4359k2383M4099
$$ 34217 43913 -12062 -58115 -63798 -79425 -90386 -19086 20578 -2847 -27206 -49589 -5490
6291e490O5396m1922o257j3186N182n7760m934j1707L696L1810k4392k4197M419
$$ -5490 59906 17984 11727 -1459 3723 -54037 -58971 -70678 -66982 -35172 -59564 -83761 -79342
6278g9342k7618J1194Q6806L9817L263k0425k5317n494o710L1098L0668M3275
$$ -79342 -106960 -95766 -8960 30857 34120 13695 -11622 -17116 -23826 7272 37940 81215
6266H1215N2006k0309m9848l1979o2782K9760m2452o4838L5553J5162r28K9994
$$ 81215 133221 112912 63064 31085 -31697 -1937 -44389 -109227 -73674 -58512 -59440 -29446
6254b9446K91j1402K3130P43J2171j3478j2256l4794j4741L9156O9968J6792n1049
$$ -29446 -29155 -40557 -17427 -16684 -4513 -17991 -30247 -65041 -79782 -40626 29342 46134 -4915
6241d915n0776k2903l462j069k1242K7691L5266J5092j9003k310m798M12k0652
$$ -4915 -55691 -78594 -82056 -83125 -104367 -76676 -41410 -26318 -45321 -47631 -52429 -52017 -72669
6228g2669l6813K14J2709j1798q384K3308k2624j836m153L3429O3194J2085n2130
$$ -72669 -109482 -109268 -96559 -108357 -116741 -93433 -116057 -117893 -122046 -88617 -25423 -13338 -65468
6215f5468K6315K7227N1154k5417K5263J0573P4499P2848n3417o4450J9635j3954
$$ -65468 -39153 -11926 39228 13811 39074 49647 124146 196994 143577 79127 98762 84808
6203H4808p8405n3210N6230L8931J1772N0333k9747k5274k7611m8550k4908J2755
$$ 84808 6403 -46807 9423 48354 60126 110459 80712 55438 27827 -20723 -45631 -32876
6191c2876K6539J7702N6548l0103n7924n7666K0755L9290k2556j2754n4216j4162
$$ -32876 -6337 11365 67913 37810 -20114 -77780 -57025 -17735 -40291 -53045 -107261 -121423
6179a21423n587N0940J2479l1136J0724R721K3479Q5324L8229q6073k9829K6540
$$ -121423 -127010 -76070 -63591 -94727 -84003 -74282 -50803 34521 72750 -13323 -43152 -16612
6167a6612N0712k4194q3930j0880J08278M2737K8992M5105M6942p7476j05720
$$ -16612 34100 9906 -74024 -84904 23374 66111 95103 140208 187150 109674 3954
6156C954J576L5150J8154j1287K3155J394L124k1628j12719j3301O189j4499K5998
$$ 3954 5530 40680 58834 47547 70702 72096 75220 53592 -59127 -72428 -66239 -80738 -54740
6143e4740J8031j2567q0510J012K3732K2500J7230l9638j6110K0278K2292k9988
$$ -54740 -36709 -49276 -129786 -128774 -105042 -82542 -65312 -104950 -121060 -100782 -78490 -108478
6131a08478L8944N7729K6686k533o533N8315M4805m9526m2163j3155K1925m5954
$$ -108478 -69534 -11805 14881 12348 5815 64130 108935 59409 17246 4091 26016 -19938
6119a9938p5807l9644J8879J09013N967K0125l0674L86M1377N302o1075K25M4836
$$ -19938 -95745 -135389 -116510 -7497 -1530 18595 -12079 -11693 29684 34986 -26089 -25864 18972
6106A8972J0785m17M0800m3627j2789K8806M693J4327R318Q389m3567J209l7827
$$ 18972 29757 29340 70140 26513 13724 42530 47223 61550 70868 79257 35690 36899 -928
6093i28m0833j8164j0166K5235J139P996r239j2410k1960J1020k0439L3911Q977
$$ -928 -41761 -59925 -70091 -44856 -43717 -35721 -44960 -57370 -79330 -68310 -88749 -54838 -45861
6080d5861l6005j6922J1733K8337J3271J3942K4900J5237o5043p6681J8717K5462
$$ -45861 -81866 -98788 -87055 -58718 -45447 -31505 -6605 8632 -56411 -133092 -114375 -88913
6068h8913K6655Q2140J944K860n6238j7314M5832J0225n7019l0292O8061J7962
$$ -88913 -62258 19882 21826 24686 -31552 -48866 -3034 7191 -49828 -80120 -12059 5903
6056E903L0727L6360n9390r4110K6200O2896k5645L2207N971K2240l857m5910
$$ 5903 36630 72990 13600 -80510 -54310 8586 -17059 15148 21119 43359 39502 -6408
6044f408N112K5702K2992k9921m8554o5715q83O2770K9657l636O564J6865l4884
$$ -6408 -1296 24406 47398 17477 -31077 -96792 -97675 -34905 -5248 -8884 -2320 14545 -20339
6031b0339K692l2031m7721J4137j5945P847M1370L2447J4427J7902j9359J8092
$$ -20339 -17647 -49678 -97399 -83262 -99207 -91360 -49990 -17543 -3116 14786 -4573 13519
6019A3519J4666o3958J8516J3156L331l6527k568j381L1091k9333K2741l1377
$$ 13519 28185 -35773 -17257 -4101 -770 -37297 -39865 -41246 -10155 -39488 -16747 -48124
6007d8124j5284n202j8429j1056J801O7030J3679N4817K1414N520N121J4811K2961
$$ -48124 -63408 -68610 -87039 -98095 -96294 -29264 -15585 39232 60646 66166 71287 86098 109059
5994A09059M7580k6770j7773l6223o9314j6397j3438n7338L651K6336L523k8461
$$ 109059 156639 129869 112096 75873 6559 -9838 -23276 -80614 -76963 -50627 -47104 -75565
5982g5565O027K1356R182K8508k9060r85L7287N2487J6162k5030n5407Q1137O8157
$$ -75565 -69538 -48182 -39000 -10492 -39552 -40537 -3250 49237 65399 40369 -15038 66099 134256
5969A34256p1002n1063l99N9831J5095j6402P613j4630k4581l5220m3510J5864
$$ 134256 63254 12191 11792 71623 86718 70316 77929 63299 38718 3498 -40012 -24148
5957b4148L708l1981L8212O4856L2477j1575p38M892j4859K3512l3204O140j9936
$$ -24148 -20440 -52421 -14209 50647 83124 71549 70811 75703 60844 84356 51152 57292 37356
5944C7356j01780p427j4486L3292M0413P800l4983N0078J6259N249r466q038P480
$$ 37356 -64424 -71851 -86337 -53045 -12632 -4832 -39815 10263 26522 31771 22305 14267 21747
5931B1747L0003N422l1641P2009M2186k9873l9624p5646m4728l3702j4358R1951
$$ 21747 51750 57172 25531 97540 139726 109853 70229 -5417 -50145 -83847 -98205 -6254
5919f254Q6406j9608k3525o1365l8347K0195N302J5241k2549k53L2520j8507J3041
$$ -6254 80152 60544 37019 -24346 -62693 -42498 -37196 -21955 -44504 -44757 -12237 -30744 -17703
5906a7703J8036P073j7842j0703m1769k7386j2521N9544l1276l7026P1246Q683
$$ -17703 333 7406 -10436 -21139 -62908 -90294 -102815 -43271 -74547 -111573 -40327 -31644
5894c1644k8487j3636k7524j1370O9600l412j1969n119L4405m6506L6309M9717
$$ -31644 -60131 -73767 -101291 -112661 -43061 -46473 -58442 -63561 -29156 -75662 -39353 10364
5882A0364K219l0682j8501k4642k1064K0309P0380j4248k4795j3970q603n9558
$$ 10364 12583 -18099 -36600 -61242 -82306 -61997 8383 -5865 -30660 -44630 -53233 -112791
5870a12791J9504L8568l1768p1161P2385N9204l0565j5670P6455j5100L8471l694
$$ -112791 -93287 -54719 -86487 -157648 -85263 -26059 -56624 -72294 4161 -10939 27532 23838
5858B3838J8458J9370J6553l464j1847l5651L8069j0197l0375j3811l439K9568
$$ 23838 42296 61666 78219 74755 62908 27257 65326 55129 24754 10943 7504 37072
5846C7072P66o8460p6667J9813L3735j629K5413K1607p027N0151r549m9862o5237
$$ 37072 37838 -30622 -107289 -87476 -53741 -55370 -29957 -8350 -15377 34774 25225 -24637 -89874
5833h9874m0077k3473K9533O1397M1520K4447p8548j673P0353K668p440Q449j7508
$$ -89874 -129951 -153424 -123891 -62494 -20974 3473 -75075 -76748 -6395 -3727 -11167 -2718 -20226
5820b0226m8693J2832m9107j6722Q283J9053p1213J3917L0559L6974L0203L3671
$$ -20226 -68919 -56087 -105194 -121916 -113633 -94580 -165793 -151876 -121317 -84343 -54140 -20469
5808b0469k8576J0028L0604l2802L1046M7156l2123n5438p8971j5262P5346j9977
$$ -20469 -49045 -39017 -8413 -41215 -10169 36987 4864 -50574 -129545 -144807 -69461 -89438
5796h9438K384J0293Q222n216N5738P592l0742J20653J3416q8122j00823L1807
$$ -89438 -87054 -76761 -68539 -73755 -18017 -10425 -41167 79486 92902 4780 -96043 -64236
5784f4236K5866O6658N5216m9155m4184J5381K533l1013q118k0858M6483k0363
$$ -64236 -38370 28288 83504 34349 -9835 5546 8079 -22934 -31052 -51910 -5427 -25790
5772b5790n5492j8854k3044N2720K0096o379N7118K5891j4757Q517P999J5588
$$ -25790 -81282 -100136 -123180 -70460 -50364 -56743 375 26266 11509 20026 28025 43613
5760D3613K3909j06776m9855K6000j3611r225Q976l129j6961o5404O4922J10440
$$ 43613 67522 -39254 -89109 -63109 -76720 -85945 -76969 -80098 -97059 -162463 -97541 12899
5748A2899l4523j6119K2307k1526o0746l8006p927N2058J14141L690q24L4781
$$ 12899 -21624 -37743 -15436 -36962 -97708 -135714 -143641 -91583 22558 26248 25424 60205
5736F0205N8594L5513j9560l4160j1769k1089j63956k0162K8460M7412n68p042
$$ 60205 118799 154312 134752 100592 88823 67734 -96222 -116384 -87924 -40512 -41080 -48122
5724d8122o1565k035K7042J7125o0128J4976K6458K2750P828l7280P5542N6746
$$ -48122 -109687 -111722 -84680 -67555 -127683 -112707 -86249 -63499 -55671 -92951 -17409 39337
5712C9337R363k9426n6838J1168J6548n888j631J8000M9296j5868p8928N799K0272
$$ 39337 48700 19274 -37564 -26396 -9848 -15736 -17367 633 49929 34061 -44867 -39068 -18796
5699a8796p593L3031P0680l063j4652J4859J9691l5528l7851j1198m130J645l4016
$$ -18796 -26389 6642 77322 74259 59607 74466 94157 58629 20778 9580 5450 7095 -26921
5686b6921l0001l4477j3193m0096O4530P6993k8509J8950N8990j448O893j5385
$$ -26921 -56922 -91399 -104592 -144688 -80158 -3165 -31674 -12724 46266 44818 51711 36326
5674C6326J2679J9055o0641l7831J45993M4538j2p233l4313r2954o5585M2761
$$ 36326 49005 68060 7419 -30412 115581 160119 160107 152874 118561 25607 -39978 2783
5662B783N3012j2307k5553P317l7374l6977q116q572J9963P028j6750K9889N9606
$$ 2783 55795 43488 17935 25252 -12122 -49099 -57215 -65787 -45824 -38796 -55546 -25657 33949
5649C3949l914K9996L8867j5126k7569l8858k1367J4742R86R685p203K1009m4239
$$ 33949 30035 60031 98898 83772 56203 17345 -4022 10720 11706 21391 14188 35197 -9042
5636i042K0683R929N3210k3221k5384l9660J8383J2826J877k2059o9567M897Q6631
$$ -9042 11641 21570 74780 51559 26175 -13485 4898 17724 19601 -2458 -72025 -67128 19503
5623A9503k0102o2126N411P9390M0749n088o5543n8778l3768N3970k8891k5658
$$ 19503 -599 -62725 -57314 22076 62825 57737 -7806 -66584 -100352 -46382 -75273 -100931
5611a00931j3382N1553M0880l1325j8395J8906J5870j1692m4879m6131K0581N2179
$$ -100931 -114313 -62760 -21880 -53205 -71600 -52694 -36824 -48516 -93395 -139526 -118945 -66766
5599f6766P5766K9655K4414J0610j0230m3161m2926j2995K0605o218N7353J7781
$$ -66766 9000 38655 63069 73679 63449 20288 -22638 -35633 -15028 -21246 36107 53888
5587E3888K0266o728n8802j0882m3801M6604M662Q524k1027Q6810M6419o5379
$$ 53888 74154 67426 8624 -2258 -46059 545 5207 13731 -7296 79514 125933 60554
5575F0554o4095j9398K452k04K790j5518j2992j9278L336k6590N35K5843j2029
$$ 60554 -3541 -22939 -20487 -20691 -17901 -33419 -46411 -65689 -62353 -88943 -88408 -62565 -74594
5562g4594L5168N1166J9645l092m4949n5133J7070J0351M9884l3654o040N8841
$$ -74594 -39426 11740 31385 28293 -16656 -71789 -54719 -44368 5516 -28138 -34178 24663
5550B4663k254r827l3021o103M2227L506l526J9318q4992J3511O1529k6827m008
$$ 24663 22409 12582 -20439 -26542 15685 19191 15665 34983 -50009 -36498 25031 -1796 -5804
5537e804L8201o7918n1774j60L2809N2600L9406J734J7759k5141o6402o295p785
$$ -5804 32397 -35521 -87295 -87455 -54646 -2046 37360 39094 56853 31712 -34690 -40985 -48770
5524d8770l3181N5860L2247n612q63j6151n9404O533L1640n4054N2011L5180J5408
$$ -48770 -81951 -26091 6156 544 -319 -16470 -75874 -69341 -37701 -91755 -39744 -4564 10844
5511A0844k2127R833j2946n4030k6435j2980l4761M3636K2199j984M4944l3341
$$ 10844 -11283 -1450 -14396 -68426 -94861 -107841 -142602 -98966 -76767 -78751 -33807 -67148
5499f7148k4849P2476Q16m4215J7303K9194J5508k228o551J6525J2877K767q167
$$ -67148 -91997 -19521 -18705 -62920 -45617 -16423 -915 -3143 -9694 6831 19708 22475 14308
5486A4308K3301K2789j6140l284M4418k4480q9150l7327L4787J8052m5043l5815
$$ 14308 37609 60398 44258 40974 85392 60912 -28238 -65565 -30778 -12726 -57769 -93584
5474i3584O7509Q9637L0614J7729k2311o1546L4941K0535l0671m8181k4654p7921
$$ -93584 -26075 63562 94176 111905 89594 28048 62989 83524 52853 4672 -19982 -97903
5462i7903N5049Q5541O2537k0121o6377K270p634l6586L3627K1785J5126K2034
$$ -97903 -42854 42687 105224 85103 18726 20996 13362 -23224 10403 32188 47314 69348
5450F9348K8158j9080n8487l8152m9958k1263K5412J01631M4937l2922m1606K6012
$$ 69348 97506 78426 19939 -18213 -68171 -89434 -64022 37609 82546 49624 8018 34030
5438C4030J0144n3849K3946N8326O611n0768k8353l9540J1569L3232j1612l3006
$$ 34030 44174 -9675 14271 72597 79208 28440 87 -39453 -27884 5348 -6264 -39270
5426c9270M5985J4773k7271m7226O972M1645N9451j5959m3739L4447K0042j5213
$$ -39270 6715 21488 -5783 -53009 -46037 -4392 55059 39100 -4639 29808 49850 34637
5414C4637J7859K3356l9626l654k281M0165q2208j05069O2456O1720J8586m1058
$$ 34637 52496 75852 36226 32572 30291 70456 -11752 -116821 -54365 7355 25941 -15117
5402a5117l5064J615K1737j7969p03N9807M2497K1687n890j9156j8002o179J5194
$$ -15117 -50181 -48566 -26829 -44798 -45501 14306 56803 78490 72600 53444 35442 29263 44457
5389D4457L4539L1141L825k5622P765l7200n3570q0615k6012l37o088M4589O9449
$$ 44457 78996 110137 113962 88340 96105 58905 5335 -75280 -101292 -101629 -107717 -63128 6321
5376F321j7615l6298M6528N127o5476N526J9335L0785j2765o4349m1614j2796
$$ 6321 -11294 -47592 -1064 4063 -61413 -55887 -36552 -5767 -18532 -82881 -124495 -137291
5364a37291L8396N4406k2471K7810N6365L5292j0663o968O7127l2032l761n8424
$$ -137291 -98895 -44489 -66960 -39150 17215 52507 41844 34876 102003 69971 66210 7786
5352G786l4554J609k4546M164m897N270J2179K8762P1631L6526n3860o1495k1437
$$ 7786 -26768 -25159 -49705 -45541 -50438 -45168 -32989 -4227 67404 103930 50070 -11425 -32862
5339c2862J2481m941J7498O1735r052m8498m0982r284L2172L7670l7122p840K5641
$$ -32862 -20381 -25322 -7824 53911 44859 -3639 -44621 -53905 -21733 15937 -21185 -29025 -3384
5326c384k7687m170j6971j9336J769Q676N7316L010m9010l1419l0986L5258P5633
$$ -3384 -31071 -35241 -52212 -71548 -69779 -61103 -3787 -777 -49787 -81206 -112192 -76934 -1301
5313a301k4469n3954o6977j4426J16246K3987j399l8230n4974N5077P0010l5435
$$ -1301 -25770 -79724 -146701 -161127 -44881 -20894 -22293 -60523 -115497 -60420 9590 -25845
5301b5845l4658k2518K7822N6389j8448M453l5825n5239n0283M738M3236M8936
$$ -25845 -60503 -83021 -55199 1190 -17258 -12805 -48630 -103869 -154152 -149414 -106178 -57242
5289e7242M2365K0465L8328j1309m4041j1363J1123j9419P0377j9428j12089K7899
$$ -57242 -14877 5588 43916 32607 -11434 -22797 -11674 -31093 39284 19856 -92233 -64334
5277f4334M8428M6044P022l9738r921N2407l4733J9773L081q1789j0755K1043
$$ -64334 -15906 30138 37160 -2578 -12499 39908 5175 24948 28029 -53760 -64515 -43472
5265d3472O3554j1042n9055M2749P3175J5992k0072k7667q711j7685J2837k2935
$$ -43472 20082 9040 -50015 -7266 65909 81901 61829 34162 25451 7766 20603 -2332
5253b332l6858j0801N5251J0052m0380L113J1408j0299j4017j7337m2447r641
$$ -2332 -39190 -49991 5260 15312 -25068 -21955 -10547 -20846 -34863 -52200 -94647 -104288
5241a04288P4205J11765j9311q447n6315m3351N5782j2895l2791J1695P3122P081
$$ -104288 -30083 81682 62371 53924 -2391 -45742 10040 -2855 -35646 -23951 49171 56252
5229E6252q272L3942k616k3809p8672q0298P590M2584K3268N2162L4877J282K2025
$$ 56252 47980 81922 79306 55497 -23175 -103473 -95883 -53299 -30031 22131 57008 58290 80315
5216H0315l2093p6301k7088k3571K1002k3203R769N2500M0921k2849l5152k5288
$$ 80315 48222 -28079 -55167 -78738 -57736 -80939 -71170 -18670 22251 -598 -35750 -61038
5204f1038o9122m5309K6795M6400j5297K6558P3062O7817j3161l1034J9353k1154
$$ -61038 -130160 -175469 -148674 -102274 -117571 -91013 -17951 49866 36705 5671 25024 3870
5192C870J1487j205J8347L9999k9943m2459l8077P893O3859l626k7621J489n2896
$$ 3870 15357 14152 32499 72498 42555 96 -37981 -30088 33771 30145 2524 4013 -48883
5179d8883J2204N9829p255o834l7930j2577M2647Q66J1935J4260o745l5046k3762
$$ -48883 -36679 23150 15895 9061 -28869 -41446 1201 2067 14002 28262 21517 -13529 -37291
5166c7291K1249N8526P5162O841p0894l3526J4505Q598j8283M4718o9190k6164
$$ -37291 -16042 42484 117646 124487 53593 20067 34572 43170 24887 69605 415 -25749
5154b5749L95j1129L4734J02554p848l4534n2015k9197L416L4224l176N12k4284
$$ -25749 -25354 -36483 -1749 100805 92957 58423 6408 -22789 -19373 14851 11675 12187 -12097
5141a2097r309J354R254M251k9463o310K6149P421p3149K5979M8651n2712O325
$$ -12097 -21406 -20052 -10798 -6547 -36010 -42320 -16171 -8750 -81899 -55920 -7269 -59981 -53656
5128e3656M3854k9053k184M2340M6033l8009n53k3859j4051r059R6432K9093n5937
$$ -53656 -9802 -38855 -41039 1301 47334 9325 8772 -15087 -29138 -38197 58235 87328 31391
5115C1391p3316k6781K1037j684P5222n1401l9776N6647O3693N2324j05917j8684
$$ 31391 -41925 -68706 -47669 -49353 25869 -25532 -65308 -8661 55032 107356 1439 -17245
5103a7245N2414k246k1624l1877q664M6656L4192K1378l2628l1316o9788L985
$$ -17245 35169 32923 11299 -20578 -29242 17414 51606 72984 40356 9040 -60748 -56763
5091e6763k225m6096L1188N6170k134O760n3165R091L2955M9439L7069J0183r1836
$$ -56763 -58988 -105084 -73896 -17726 -19860 -13100 -66265 -57174 -24219 25220 62289 72472 -19364
5078a9364o2273K3426L7053J7956J8057K9692m4544j247M3686k3068q76M154l0745
$$ -19364 -81637 -58211 -21158 -3202 14855 44547 3 -1244 42442 19374 18498 22652 -8093
5065h093j910l482k6909M2356O8868j2777m9850p2859k4068N1154L8373j3715
$$ -8093 -10003 -13485 -40394 1962 70830 58053 8203 -64656 -88724 -37570 803 -12912
5053a2912k1967L8878K0971M3307N485L7783k9502n0656m3943k0071L2535L258
$$ -12912 -34879 3999 24970 68277 73762 111545 82043 31387 -12556 -32627 -92 3166
5041C166l5372l8557M4653K4186Q9573M1988r4146q4831Q217L7070l2862l8721
$$ 3166 -32206 -70763 -26110 -1924 87649 129637 35491 -49340 -41123 -4053 -36915 -75636
5029g5636j5553n8382j1474L6388J0091j8578K0892O5515N4523K2375n4819L3482
$$ -75636 -91189 -149571 -161045 -124657 -114566 -133144 -112252 -46737 7786 30161 -24658 8824
5017H824J0203k3468J859Q0887M6743j23014m5236M2043M5555l9662l6624J6277
$$ 8824 19027 -4441 -2582 78305 125048 2034 -43202 -1159 44396 4734 -31890 -15613
5005a5613J9302J6598q574m1858L5493l9416o2775J8314M7021P3693L7738j4556
$$ -15613 3689 20287 11713 -30145 5348 -34068 -96843 -78529 -31508 42185 79923 65367
4993F5367n8440o6996N4828M4357o413M4048q108j49076l8700M323M3941K3053
$$ 65367 6927 -60069 -5241 39116 32703 76751 68643 -80433 -119133 -114810 -70869 -47816
4981d7816M7797j2558K1167N885K7181M4083k580P767m7985j090J1343l9120K555
$$ -47816 -19 -12577 8590 14475 41656 85739 83159 90926 42941 41851 53194 14074 16629
4968A6629j1916l280M580l1415m135J6354l8376M0088K0932L4381r0117j8163
$$ 16629 4713 1433 6013 -25402 -29537 -13183 -51559 -11471 9461 43842 -46275 -64438
4956f4438O1714Q1532o610k4752o7573n4597M195r615K859M3807Q2392R277J1190
$$ -64438 -2724 78808 72198 47446 -20127 -74724 -70529 -80144 -77285 -33478 48914 58191 69381
4943F9381m1008q3610l5174P8862J1290k4329j4100J776j4463L7163M1898J1707
$$ 69381 28373 -55237 -90411 -11549 -259 -24588 -38688 -36912 -51375 -14212 27686 39393
4931C9393M301l876k6637l3381J4703M2017m819j9304m3001j6641L5238q640P57
$$ 39393 43694 39818 13181 -20200 -5497 36520 31701 12397 -30604 -47245 -12007 -20647 -19890
4918a9890K9423N8186L755l8512m4897k0574L4732O544m2719l8176m3703K2528
$$ -19890 9533 67719 71474 32962 -11935 -32509 2223 8767 -33952 -72128 -115831 -93303
4906i3303M1180K9401J5343J5353k1666N176K5809N790L6347l3258l2879k2510
$$ -93303 -52123 -22722 -7379 7974 -13692 -8516 17293 23083 59430 26172 -6707 -29217
4894b9217n945N2308L6892l4149j2114n175o579j148j489l9424M3508P7519k2987
$$ -29217 -35162 17146 54038 19889 7775 2600 -3979 -5127 -6616 -46040 -2532 74987 52000
4881E2000q2788m3279j1306O516J0534L2949P3897R656n1428J8618K8385l9385
$$ 52000 -30788 -74067 -85373 -78857 -68323 -35374 38523 48179 -3249 15369 43754 4369
4869D369J5914N795m3055O923l4373j5173R6950N1894o4745o451l5160m6856J2774
$$ 4369 20283 26078 -16977 -10054 -44427 -59600 37350 89244 24499 18048 -17112 -63968 -51194
4856e1194O5272K1450j5244n669K4899k6020l3512j1633N5286O404qr825j8004
$$ -51194 14078 35528 20284 14615 39514 13494 -20018 -31651 23635 30039 30031 20206 2202
4843B202Q914L6501o2774o7593L3312L8233M6717j6208m980K5867j5947m2839
$$ 2202 11116 47617 -15157 -82750 -49438 -11205 35512 19304 14324 40191 24244 -18595
4831a8595N2169n311k3392M2337k5518q3233K6002P4785J7538K3081J7095L7851
$$ -18595 33574 28263 4871 47208 21690 -61543 -35541 39244 56782 79863 96958 134809
4819A34809k6269l8680O366l7550K7479J0621j9470k4455l0077l1015k3696j5510
$$ 134809 108540 69860 76226 38676 66155 76776 57306 32851 2774 -28241 -51937 -67447
4807f7447J9938P0633m990p2185L5202N8354J2623k1112l8698p355l0729p6546
$$ -67447 -47509 23124 18134 -54051 -18849 39505 52128 31016 -7682 -15037 -45766 -122312
4795a22312N767Q2633N7480N1794r8437l2006O5260l6234J8916p80J942p475O4450
$$ -122312 -116545 -33912 23568 75362 -23075 -55081 10179 -26055 -7139 -7919 -5977 -13452 50998
4782E0998L1604Q6943R05j23938M760P5855k1037J273m7171m3158k5120J0118
$$ 50998 82602 169545 170450 46512 51272 127127 106090 107363 60192 17034 -8086 2032
4770B032M4579K1479J6812K8942Q314k3734M06m5838q4576o0936Q001N792j3627
$$ 2032 46611 68090 84902 113844 122158 98424 98830 52992 -31584 -92520 -84519 -78727 -92354
4757i2354L8413M7313k2218j7423k3921n0319n1269N533O253J128k4529j896P6337
$$ -92354 -53941 -6628 -28846 -46269 -70190 -120509 -171778 -166245 -159992 -158864 -183393 -185289 -108952
4744a08952R8235k622N7979J7456J0773k8620r286p998K1420J4770l1463M223
$$ -108952 -10717 -13339 44640 62096 72869 44249 34963 26965 48385 63155 31692 35915
4732C5915k7508j5075m1424J913j8192Q052J3700M7888l6752L4375j8123n3280
$$ 35915 8407 -6668 -48092 -46179 -64371 -56319 -42619 5269 -31483 2892 -15231 -68511
4720f8511l9914j7861N9355M0503n8471k1245q471J3386Q3129L9410l0350k1495
$$ -68511 -108425 -126286 -66931 -26428 -84899 -106144 -114615 -101229 -18100 21310 -9040 -30535
4708c0535K853m368o7615j6985M020N520q6L0192N7545L3202j2917L3842M1527
$$ -30535 -27682 -32050 -99665 -116650 -112630 -107110 -107196 -77004 -19459 13743 826 34668 76195
4695G6195k7396q1724j05424o068L4132M5939J3968O4003N8816l2055j1828J9262
$$ 76195 48799 -32925 -138349 -144417 -110285 -64346 -50378 13625 72441 40386 28558 47820
4683D7820r730n0044N6971K771p636k9213O089J8124j2180J0659J3039j4013j5781
$$ 47820 38090 -11954 45017 47788 40152 10939 17028 35152 22972 33631 46670 32657 16876
4670A6876K0519J9427J499K2137o338k0939m2407m3203M803m6263L4510N7412
$$ 16876 37395 56822 58321 80458 74120 53181 10774 -32429 -27626 -73889 -39379 18033
4658A8033n884L8468J7490l9922J1407p21j2512K2392J8112K6829m5428n3430
$$ 18033 12149 50617 68107 28185 39592 38871 26359 48751 66863 93692 48264 -5166
4646e166K2376L2905k8871j4906K2019j847m9927M549N5762K6561p4066n5905
$$ -5166 17210 50115 21244 6338 28357 26510 -23417 -18868 36894 63455 -10611 -66516
4634f6516K4643N2488L0256k5018j0454M4974k7629K0556j6638p0685l1497K0046
$$ -66516 -41873 10615 40871 15853 5399 50373 22744 43300 26662 -44023 -75520 -55474
4622e5474K2101K5901M2853l66M0587K3004l641n8734l6119o69j2294l7706p640
$$ -55474 -33373 -7472 35381 35015 75602 98606 94965 36231 112 -557 -12851 -50557 -58197
4609e8197M9039M2373p235k9411n7909o3115P04L9928J5397p14O6063n190r022
$$ -58197 -9158 33215 25980 -3431 -61340 -124455 -123751 -83823 -68426 -69140 -3077 -8267 -17289
4596a7289N195M4667J7275j9372n0797K0791J0223j0634L8183R3388m8365j2851
$$ -17289 -12094 32573 49848 30476 -20321 470 10693 59 38242 131630 83265 70414
$$ [...]
##END NTUPLES=NMR SPECTRUM
##END=
