##TITLE=Analysis number 317983
Compound Code cc 38004
Book Reference 437/66
Project Code adrs
Chemist Name wendyb
##JCAMPDX= 6.0         $$ Bruker NMR JCAMP-DX V2.0
##DATA TYPE= NMR SPECTRUM
##DATA CLASS= NTUPLES
##ORIGIN= Bruker BioSpin GmbH
##OWNER= nmr
$$ XWIN-NMR		Version 3.5
$$ Thu Mar  9 13:57:11 2006 GMT Standard Time (UT+0h)  MAYBRIDGE\nmr@NMR_250MHZ
##.OBSERVE FREQUENCY= 250.131544655141
##.OBSERVE NUCLEUS= ^1H
##.ACQUISITION MODE= SIMULTANEOUS (DQD)
##.ACQUISITION SCHEME= undefined
##.AVERAGES= 16
##.DIGITISER RES= 18
##SPECTROMETER/DATA SYSTEM= dpx250
##.PULSE SEQUENCE= zg30
##.SOLVENT NAME= CDCl3
##.SHIFT REFERENCE= (INTERNAL, CDCl3, 0, 16.522)
##AUDIT TRAIL= $$ (NUMBER, WHEN, WHO, WHERE, WHAT)
$$ ##TITLE= Audit trail, XWIN-NMR		Version 3.5
$$ ##JCAMPDX= 5.01
$$ ##ORIGIN= Bruker BioSpin GmbH
$$ ##OWNER= nmr
$$ C:\u/data/dgb/nmr/ADRS/410/pdata/1/auditp.txt
$$ ##AUDIT TRAIL=  $$ (NUMBER, WHEN, WHO, WHERE, WHAT)
(   1,<2006-03-09 13:56:48.87 +000>,<MAYBRIDGE\nmr>,<NMR_250MHZ>,
      <created by zg, POWCHK disabled, PULCHK disabled
       configuration hash MD5:
       84 BC 41 DB A1 6E 1D 46 DA 25 12 A5 C1 ED C5 3A
       data hash MD5: 64K
       7D A9 5C BE 27 9D B7 7A 1F 10 B9 5F 86 53 41 2A>)
(   2,<2006-03-09 13:57:02.48 +000>,<MAYBRIDGE\nmr>,<NMR_250MHZ>,
      <Start of raw data processing
       ef LB = 0.3 FT_mod = 6 PKNL = 1 SI = 32K 
       data hash MD5: 32K
       06 DC C9 65 00 7B 34 D7 97 1E 5E F3 25 1F 66 78>)
(   3,<2006-03-09 13:57:04.13 +000>,<MAYBRIDGE\nmr>,<NMR_250MHZ>,
      <apk 
       data hash MD5: 32K
       31 5A 00 7D C1 FA A2 B1 6D 48 38 EE D0 0B 98 77>)
(   4,<2006-03-09 13:57:04.87 +000>,<MAYBRIDGE\nmr>,<NMR_250MHZ>,
      <abs ABSG = 5 
       data hash MD5: 32K
       69 F0 2D A2 9E 96 67 19 F4 EC 0A A1 27 01 AA 3E>)
$$ ##END=
$$ 
$$ hash MD5
$$ AC 49 FB F2 AB 41 DC 89 A9 64 5D 9D C8 DA 4B 91
##$RELAX= 
##$RELAX= 
##$RELAX= 
##$RELAX= 
##$RELAX= 
##$RELAX= 
##$RELAX= 
$$ Bruker specific parameters
$$ --------------------------
##$DU= <C:\u>
##$EXPNO= 410
##$NAME= <ADRS>
##$PROCNO= 1
##$TYPE= <nmr>
##$USER= <dgb>
##$AMP= (0..31)
100 100 100 100 100 100 100 100 100 100 100 100 100 100 100 100 100 100 
100 100 100 100 100 100 100 100 100 100 100 100 100 100 
##$AQSEQ= 0
##$AQ_mod= 3
##$AUNM= <au_zg>
##$AUTOPOS= <34 >
##$BF1= 250.13
##$BF2= 250.13
##$BF3= 250.13
##$BF4= 250.13
##$BF5= 500.13
##$BF6= 500.13
##$BF7= 500.13
##$BF8= 500.13
##$BYTORDA= 1
##$CFDGTYP= 0
##$CFRGTYP= 5
##$CHEMSTR= <none>
##$CNST= (0..31)
1 1 145 1 1 1 1 1 1 1 1 1 1 1 1 1 1 1 1 1 1 1 1 1 1 1 1 1 1 1 1 1 
##$CPDPRG= <>
##$CPDPRG1= <>
##$CPDPRG2= <>
##$CPDPRG3= <>
##$CPDPRG4= <mlev>
##$CPDPRG5= <mlev>
##$CPDPRG6= <mlev>
##$CPDPRG7= <mlev>
##$CPDPRG8= <mlev>
##$CPDPRGB= <>
##$CPDPRGT= <>
##$D= (0..31)
0 1 0 0 0 0 0 0 0 0.06 0 0 0 0 0 0 0.0002 0 0 0 0 0 0 0 0 0 0 0 0 0 0 
0 
##$DATE= 1141912607
##$DBL= (0..7)
120 120 120 120 120 120 120 120 
##$DBP= (0..7)
150 150 150 150 150 150 150 150 
##$DBP07= 0
##$DBPNAM0= <>
##$DBPNAM1= <>
$$ [...]
##$SUBNAM7= <"">
##$SUBNAM8= <"">
##$SUBNAM9= <"">
##$SW= 20.6930455092707
##$SWIBOX= (0..15)
0 0 3 0 0 0 0 0 0 0 0 0 0 0 0 0 
##$SW_h= 5175.983436853
##$TD= 65536
##$TD0= 1
##$TE= 293.16
##$TE2= 300
##$TE3= 300
##$TEG= 300
##$TL= (0..7)
0 120 120 120 120 120 120 120 
##$TP= (0..7)
150 150 150 150 150 150 150 150 
##$TP07= 0
##$TPNAME0= <>
##$TPNAME1= <>
##$TPNAME2= <>
##$TPNAME3= <>
##$TPNAME4= <>
##$TPNAME5= <>
##$TPNAME6= <>
##$TPNAME7= <>
##$TPOAL= (0..7)
0.5 0.5 0.5 0.5 0.5 0.5 0.5 0.5 
##$TPOFFS= (0..7)
0 0 0 0 0 0 0 0 
##$TUNHIN= 0
##$TUNHOUT= 0
##$TUNXOUT= 0
##$USERA1= <user>
##$USERA2= <user>
##$USERA3= <user>
##$USERA4= <user>
##$USERA5= <user>
##$V9= 5
##$VALIST= <valist>
##$VCLIST= <CCCCCCCCCCCCCCC>
##$VD= 0
##$VDLIST= <DDDDDDDDDDDDDDD>
##$VPLIST= <PPPPPPPPPPPPPPP>
##$VTLIST= <TTTTTTTTTTTTTTT>
##$WBST= 1024
##$WBSW= 4
##$XGAIN= (0..3)
0 0 0 0 
##$XL= 0
##$YL= 0
##$YMAX_a= 310861
##$YMIN_a= -433139
##$ZGOPTNS= <>
##$ZL1= 120
##$ZL2= 120
##$ZL3= 120
##$ZL4= 120
##$ABSF1= 16.522
##$ABSF2= -4.171173
##$ABSG= 5
##$ABSL= 3
##$ALPHA= 0
##$AQORDER= 0
##$ASSFAC= 0
##$ASSFACI= 0
##$ASSFACX= 0
##$ASSWID= 0
##$AUNMP= <proc_1d>
##$AZFE= 0.1
##$AZFW= 0.1
##$BCFW= 0
##$BC_mod= 0
##$BYTORDP= 0
##$COROFFS= 0
##$CY= 12.5
##$DATMOD= 1
##$DC= 0
##$DFILT= <>
##$DTYPP= 0
##$F1P= 14.0000005364418
##$F2P= -0.99999901652339
##$FCOR= 0.5
##$FTSIZE= 32768
##$FT_mod= 6
##$GAMMA= 0
##$GB= 0
##$INTBC= 1
##$INTSCL= 1
##$ISEN= 128
##$LB= 0.3
##$LEV0= 0
##$LPBIN= 0
##$MAXI= 10000
##$MC2= 0
##$MEAN= 0
##$ME_mod= 0
##$MI= 0
##$NCOEF= 0
##$NC_proc= -4
##$NLEV= 6
##$NOISF1= 0
##$NOISF2= 0
##$NSP= 0
##$NTH_PI= 0
##$NZP= 0
##$OFFSET= 16.522
##$PC= 1
##$PHC0= 178.8383
##$PHC1= 4.228989
##$PH_mod= 1
##$PKNL= yes
##$PPARMOD= 0
##$PSCAL= 4
##$PSIGN= 0
##$REVERSE= no
##$SF= 250.13
##$SI= 32768
##$SIGF1= 0
##$SIGF2= 0
##$SINO= 400
##$SIOLD= 32768
##$SREGLST= <1H.CDCl3>
##$SSB= 0
##$STSI= 32768
##$STSR= 0
##$SW_p= 5175.98343685301
##$SYMM= 0
##$S_DEV= 0
##$TDeff= 65536
##$TDoff= 0
##$TI= <Analysis number 999999
Compound Code 99
Book Reference 9
Project Code 9>
##$TILT= no
##$TM1= 0
##$TM2= 0
##$TOPLEV= 0
##$USERP1= <user>
##$USERP2= <user>
##$USERP3= <user>
##$USERP4= <user>
##$USERP5= <user>
##$WDW= 1
##$XDIM= 32768
##$YMAX_p= 303488806
##$YMIN_p= -462253
$$ End of Bruker specific parameters
$$ ---------------------------------
##NTUPLES= NMR SPECTRUM
##VAR_NAME=  FREQUENCY,     SPECTRUM/REAL,   SPECTRUM/IMAG
##SYMBOL=    X,             R,               I
##VAR_TYPE=  INDEPENDENT,   DEPENDENT,       DEPENDENT
##VAR_FORM=  AFFN,          ASDF,            ASDF
##VAR_DIM=   32768,         32768,           32768
##UNITS=     HZ,            ARBITRARY UNITS, ARBITRARY UNITS
##FACTOR=    0.157963299565203, 1,           1
##FIRST=     4132.6476996994, 0,             0
##LAST=      -1043.33573715361, 0,           0
##MIN=       -1043.33573715361, -462253,     0
##MAX=       4132.6476996994, 303488806,     0
$$ Real data points
##PAGE= N=1
##DATA TABLE= (X++(R..R)), XYDATA
$$ [...]
15219A04472k5125l7757J6207M9569n6252m3504K4175K5403j32091k9603P0710
15208c3796L8382l0920L7416P8119o9006j16413l9260R6682m6468P619J68767
15197I1122k8467r957M0654l3470P3114m1721o0092j02357K6509J04067l0985
15186B8417k9941j4060m3437m8209M2000k8902n2114m5409N0884L6025k5905n0394
15174a81045O2605M6706r9665j01258P8086Q9327Q8051J21146L0125L6958o5095
15163A05941j28574O4126L1062N0174o8758l1726k8965l3637O5088J9937m0086
15152D582m9141J4515O1041J2457q280j23836K373j4500J08962o2453m9172K6996
15140g6456P4279L4981N65J0758q180K0588n016l9513k3788J7846N9167k7652
$$ plain form
15219 104472 79347 41590 57797 107366 51114 7610 31785 57188 -74903 -104506 -33796
15208 -33796 4586 -26334 11082 89201 20195 -96218 -135478 -38796 -85264 -77645 91122
15197 91122 62655 52698 93352 59882 132996 91275 31183 -71174 -44665 59402 28417
15186 28417 -1524 -15584 -59021 -107230 -65230 -94132 -146246 -191655 -140771 -104746 -130651 -181045
15174 -181045 -118440 -71734 -171399 -272657 -194571 -105244 -17193 103953 134078 171036 105941
15163 105941 -22633 41493 72555 122729 53971 22245 -6720 -40357 24731 44668 4582
15152 4582 -44559 -30044 30997 43454 35174 -88662 -86289 -100789 8173 -54280 -103452 -76456
15140 -76456 -2177 32804 33369 44127 35947 56535 51519 12006 -11782 6064 65231 37579
15128C7579l563m3619o8609J8636o903k3062K5423M5389R21r5223q4735M6462
15116a51304O9344P6334P2691l1674n7913k439k6113m2585Q5997J14069m852j21549
15104a9994M6092O5174n970l1143j27867p5243K8590P4778O7283K4313p993q521
15092B9499m6589J9415n94p8950r6347J01664N5940j1024j5624N2844l1174q3300
15080a04240N1229J12737O1729r8003o5123o500N4180N0203k2358n7720J0088
15069a3778p9435k4488j505j29219O8502J60420R5826l8701r1887l8784M0258
15058e2791J40181n2453J1147R0058n4795j2799l7882o1733r9170R528l620N7663
15046f6666P5073O0060o8853L1493j4700k3514K5735N0106J12742j7698q3273
$$ plain form
15128 37579 34016 -9603 -78212 -59576 -66479 -89541 -64118 -18729 -17808 -113031 -197766 -151304
15116 -151304 -81960 -5626 67065 35391 -22522 -24961 -51074 -93659 -7662 106407 101555 -19994
15104 -19994 26098 91272 85302 54159 -73708 -148951 -120361 -45583 21700 46013 38020 29499
15092 29499 -17090 2325 1731 -77219 -173566 -71902 -15962 -26986 -42610 10234 -20940 -104240
15080 -104240 -53011 59726 121455 23452 -41671 -48171 6009 56212 33854 -23866 -13778
15069 -13778 -93213 -117701 -119206 -248425 -179923 -19503 76323 37622 -54265 -93049 -52791
15058 -52791 87390 34937 46084 136142 81347 68548 30666 -31067 -130237 -120709 -124329 -66666
15046 -66666 8407 68467 -386 31107 16407 -7107 18628 68734 181476 163778 80505
15035H0505P427M9024q5657r278p3503K28n7851q9843k6723J05582P4957P2133
15023D7001M3735l3802L4046J00214o5767j36780j55918R5769r098k8476K5547
15012h3529K3337j45939Q139P7698q9877m527J13054R5979O7881q343n0090J5602
15000A9385m0227J002q434K4980K1769N7959n1213k6211q637k2193q777J00435
14988E9838O8228P896l6235q2439J6292r9450m6070j9530P9119N7193j37056r5914
14976b28128j448J23988J21194N0735M5189n2994j86826k3369J2408q151J03568
14965d3834P593p1547J8546r220n1152q825l9637n4812K096J14633K2189j22535
14953b36505l2710J04782R3718J32538Q6223l4622o3595L2757N9167r5130o4031
$$ plain form
15035 80505 87932 136956 51299 42021 -31482 -31254 -89105 -178948 -205671 -100089 -25132 47001
15023 47001 90736 56934 90980 191194 125427 -11353 -167271 -71502 -80600 -109076 -83529
15012 -83529 -60192 -206131 -197992 -120294 -210171 -214698 -101644 -5665 62216 53873 3783 19385
15000 19385 -20842 -19840 -28274 -3294 18475 76434 25221 -990 -9627 -31820 -40597 59838
14988 59838 128066 135962 99727 17288 33580 -65870 -111940 -131470 -52351 4842 -132214 -228128
14976 -228128 -229576 -105588 15606 66341 111530 58536 -128290 -151659 -139251 -147402 -43834
14965 -43834 -36241 -107788 -89242 -98462 -149614 -158439 -198076 -252888 -250792 -136159 -113970 -236505
14953 -236505 -269215 -164433 -70715 61823 148046 113424 49829 82586 141753 46623 -17408
14942a7408p9767R1795m0463j16776k6504n649J25800j814o5697N0934N4009l0825
14930f2365K9668N8906L0307j11617o4344j2221J34999K4891J3662K4582r0713
14919b4245j54165J7961R2644m271j5891P7248N2322l1013j4630k4303R695J3029
14907e619k0068m8693O1900R6137M4693K4108p2991j13271Q6927n878l4216m9574
14895c6545q4141K5677r429J9044K8821P3764N474r2309L8749K525o6533P6873
14883a8030N6504K1304M0929k6787j9918m1799o5829N7861J09136o1013j68767
14872a16409j0125J33060L2688P6337M4812j1999j69337l3610L2389M7852J9940
14861D5598K3979m6269j4919j06924m0261J14196L8496Q1500p9404l8054J1034
$$ plain form
14942 -17408 -97175 -5380 -45843 -162619 -189123 -194772 -68972 -70786 -136483 -85549 -31540 -62365
14930 -62365 -32697 26209 56516 -55101 -119445 -131666 3333 28224 41886 66468 -24245
14919 -24245 -178410 -160449 -67805 -72076 -87967 -10719 41603 10590 -4040 -28343 -18648 -5619
14907 -5619 -25687 -74380 -12480 83657 128350 152458 79467 -33804 53123 47245 13029 -36545
14895 -36545 -120686 -95009 -104438 -85394 -56573 17191 22665 -69644 -30895 -28370 -94903 -18030
14883 -18030 38474 59778 100707 73920 54002 12203 -53626 4235 113371 52358 -116409
14872 -116409 -126534 6526 39214 115551 160363 148364 -20973 -54583 -22194 25658 45598
14861 45598 69577 23308 8389 -98535 -138796 -24600 13896 95396 15992 -22062 -11028
14850a1028o8510N9349J07442Q5772P706m7880o846K4901o4976k2614j4935q6746
14838c8365N747M0839K7637r2983j33537K0542L5738K5963O6600J7462j34095
14827a58452K5925P8221n486q253Q9202o1012j0994M7929r8282o3350L8357K3578
14815a02617j0376j30541j1945R2511J50357j8456j19341k8502K3081J86975N2612
14804H3758q7201k028R424L5443m3633n5779j7053J848K4345K242J5760j843J19929
14791H5212j06542J6532l9965k8005Q8352L1560J8385K5132j1403l5474p079m1481
14779d776L370Q6640J5431M6357J09585n4086p7209j03181k8627J224q7231l4169
14767a26672K7720P9453J6193l1897k4462N7658O2457L6415j1137l730j9204L7250
$$ plain form
14850 -11028 -79538 -20189 87253 173025 180731 132851 126005 150906 85930 63316 48381 -38365
14838 -38365 -32618 8221 35858 -57125 -190662 -170120 -134382 -108419 -41819 -24357 -158452
14827 -158452 -132527 -54306 -59792 -68045 21157 -39855 -50849 -2920 -101202 -164552 -126195 -102617
14815 -102617 -112993 -243534 -255479 -162968 -12611 -31067 -150408 -178910 -155829 31146 83758
14804 83758 -3443 -5471 3953 39396 -4237 -60016 -77069 -75221 -50876 -48634 -32874 -34717 85212
14791 85212 -21330 -4798 -44763 -72768 15584 47144 65529 90661 79258 43784 36705 -4776
14779 -4776 -1406 85234 100665 147022 256607 202521 125312 22131 -6496 -5272 -92503 -126672
14767 -126672 -98952 -19499 -3306 -35203 -59665 -2007 60450 96865 85728 81998 62794 100044
14755A00044O7932J3993j81290q3625K6463M8287M6205k4123j197P6031K0693
14744A09413p6694p4044J11737O6105l4609j53156j31708l6627J41124K09581
14734A31122Q944K1574O5296o174j48292l1086j9154Q1670K3136r8064q6835l5193
14722i3056M4712J07339M7919k7670L363p6788j7013L3428L9667j2314L4333r1055
14710g135P5253N2401o5568M6434J45874k939l7018j12730n9439R3180l3414k4162
14698G0737j18007m2979m0265P5359R2473j5904n3509K2037J9643P83R3389K4648
14686A28405j9937q1939m9382K5782r683K036N149l4717n6475k9584q6847l1966
14674b39158m032O6194j6318J18849J00342o4827k3967O0218j0058k9283J9749
$$ plain form
14755 100044 167976 181969 679 -82946 -56483 -8196 38009 13886 12689 88720 109413
14744 109413 32719 -41325 70412 136517 101908 -51248 -182956 -219583 -78459 131122
14734 131122 140066 161640 226936 220762 72470 41384 22230 103900 127036 28972 -57863 -93056
14722 -93056 -48344 58995 106914 79244 82607 5819 -11194 22234 61901 49587 83920 -7135
14710 -7135 68118 120519 54951 101385 247259 244320 207302 94572 35133 128313 94899 70737
14698 70737 -47270 -90249 -130514 -55155 37318 21414 -32095 -10058 9585 10368 103757 128405
14686 128405 108468 26529 -22853 2929 -6754 -4718 431 -34286 -90761 -120345 -207192 -239158
14674 -239158 -243190 -176996 -193314 -74465 25877 -38950 -62917 -2699 -12757 -42040 -22291
14663b2291N7061n3465j9623O636o5957k7682J11088J24437L0928r3426r3928
14652d6222N3909k2186J23297M0851o9192l4295k399l3661j3551n7448m9859o8164
14640a78920M0061P6836Q3498P3866p4618k6163R2448j51665j32392J02474O3533
14629c1042Q026q725Q2599R5088l2507J49o9149m8342r129l0920n5055K9190K3836
14616d5981m3022m8178j8661L7942P882Q6381O9543N8457J2925r504o1842j23788
14604g7846n2614O2216j16699L6010L5224N7087L7372J64249L5661l5676o6317
14593G8667R5120J4905j58739l7376m372J0293l826j0374m8685p681J9328L0839
14581b1901K9001n114p872l3437n7854p5572m3741o200J05470J48609k1712O0356
$$ plain form
14663 -22291 34770 -18695 -38318 -31682 -97639 -125321 -14233 110204 141132 47706 -46222
14652 -46222 7687 -14499 108798 149649 80457 46162 43763 10102 -3449 -60897 -110756 -178920
14640 -178920 -138859 -62023 21475 95341 20723 -5440 87008 -64657 -197049 -94575 -31042
14629 -31042 -23016 -31741 50858 145946 113439 113588 44439 -3903 -13032 -43952 -99007 -69817 -45981
14616 -45981 -89003 -137181 -155842 -117900 -110018 -23637 45906 104363 117288 107784 45942 -77846
14604 -77846 -130460 -68244 -184943 -148933 -113709 -56622 -19250 144999 180660 144984 78667
14593 78667 173787 188692 29953 -7423 -11795 -1502 -5328 -15702 -64387 -72068 -52740 -21901
14581 -21901 7100 1986 -5886 -39323 -97177 -172749 -216490 -222690 -117220 31389 9677 70033
14569G0033P7146j7310j6081o7144l7609k6379m3814P9573R8810k0205K5199k5873
14557I6346j4845Q970O031j03556r1052K5792O4679J20139l7860Q148P4486j5167
14545A42111l7328p124j08532l7425K1253J7560o0950J16576J11479l604q3912
14534G0104m2896n4693J06775L4099R751j527l5606N1852k5625p5635j1745J03196
14522A28050p263j50200r908n4367k934J34435Q0023l8639m9294o8032J5441O1003
14510C8315L7604O4664k6311p7196n5943J8878J44124J15231j17634l7278o6936
14499C7518k13115l4673J48867J04577O8361l3490l439K583j30890m9179P2630
14488c0250L0338J63844k0600p9404L7853R38j02642p1148k4611N9170R0359J8411
$$ plain form
14569 70033 147179 129869 113788 46644 9035 -17344 -61158 18415 117225 97020 122219 96346
14557 96346 81501 90471 96502 -7054 -98106 -72314 -7635 112504 74644 82792 157278 142111
14545 142111 104783 97659 -10873 -48298 -27045 -9485 -70435 46141 157620 154016 70104
14534 70104 27208 -27485 79290 113389 123140 121613 86007 137859 112234 36599 24854 128050
14522 128050 120787 -29413 -39321 -93688 -96622 37813 117836 79197 29903 -38129 -22688 38315
14510 38315 75919 140583 114272 37076 -18867 11 144135 259366 141732 104454 37518
14499 37518 -175597 -210270 -61403 43174 111535 78045 74606 77189 -53701 -102880 -30250
14488 -30250 88 163932 143332 63928 101781 102719 77 -71071 -95682 -36512 53847 72258
14476G2258j06934P5281J9094l880Q760K93j14745K1008J5203k062L3311M0323
14464E7910j9957q6304n4799J7752N3603P482r8354q9475M7981N6163K5947J37054
14452E5003J04747j3844R3602M3840p1566o0833j12847p2917l6278P6241Q5447
14441I0595n0246j00740j07335l753J07196Q5319L4703k4099P5055J12766q7670
14430A31791m1788n9914q525o4211r5813P783M5804J03427R9413j069K95j0425
14418A06768l5977l4899p6797r0244J01024L9460q8006r4625k2358J58996J68845
14407A32187N9971m6280r7136j65672K8891J53147o4856r3768M9145O0080J5812
14396C1521j0339l9644O491J0426q8569J266P6526R5689n5133K9056l4093l9450
$$ plain form
14476 72258 -34676 40605 59699 55819 64579 64872 -49873 -28865 -13662 -15724 17587 57910
14464 57910 37953 -48351 -103150 -85398 -31795 -24313 -122667 -212142 -164161 -107998 -82051 55003
14452 55003 159750 145906 239508 283348 211782 150949 38102 -34815 -71093 5148 90595
14441 90595 40349 -60391 -167726 -171479 -64283 21036 55739 31640 106695 219461 131791
14430 131791 90003 30089 21564 -42647 -138460 -130677 -84873 18554 117967 116898 117193 106768
14418 106768 70791 35892 -40905 -131149 -30125 9335 -78671 -173296 -195654 -36658 132187
14407 132187 192158 145878 48742 -116930 -88039 65108 252 -93516 -44371 15709 31521
14396 31521 21182 -18462 -11971 -1545 -90114 -88848 -12322 83367 28234 57290 23197 -16253
14384a6253O163R2567P5095m3543m3677j59001K713P8552p7526j401q6654N7188
14372a15777J9079J06514M5828n7978m1376j313l4176Q4042O5881j500M8845j00441
14360A7628n5700l3963m4903O290O8970J19689j990l233j5310p9477j19857L9867
14348a01989J01105k6366m2365J05057Q1155j7057M9583L8557j6610j0915l4070
14337A26085Q0578N4858p2084j26473m8827p7439J8827L4854N0099L5480K8700
14326A04658j1709j25797K5287Q6019K0732l0004o8015j4278j292P1879M0387
14315I7867m2175L579m2195j5302J2907k8329N2950J939l0812Q3606O1601l5130
14303A20506p3999p344J5717q4690J0124Q5593l1508L1649q288j02488n7953l5216
$$ plain form
14384 -16253 -10090 82477 157572 114029 70352 -88649 -85936 -7384 -84910 -86311 -172965 -115777
14372 -115777 -96698 9816 55644 -2334 -43710 -45023 -79199 4843 70724 69224 118069 17628
14360 17628 -38072 -72035 -116938 -110648 -41678 78011 76021 72788 57478 -21999 -141856 -101989
14348 -101989 -884 -27250 -69615 35442 116597 99540 149123 187680 171070 160155 126085
14337 126085 206663 261521 189437 62964 14137 -63302 -44475 -9621 40478 75958 104658
14326 104658 92949 -32848 -7561 78458 99190 69186 1171 -13107 -14399 57480 97867
14315 97867 55692 59271 17076 1774 14681 -13648 39302 41241 10429 94035 155636 120506
14303 120506 46507 39163 54880 -29810 -19686 65907 34399 66048 57760 -44728 -102681 -137897
14291a37897J06057P1126p78Q9862N3366j059J4055j84042l8437l2956L9541j656
14279b2818M5150N8716j7090J3779j8084k3524j25858p6519O7276k1952J03455
14268a7469J16922K1760l1367o0033k0010l6536j6787Q2502O6742J6818L5695
14257A58237p4382o2944J8242N6492j6066O5663J2869n5794p4199j23514L0911
14246f4485J2027j08153j2999P6733m4159L6066J16250R572K5256K0017K462j1010
14234E7577o7286K6450O0822K5557o9828q236n9946j4334K7662l3140L5575Q2160
14222F3033m4923k0344J26872J31668q4687j14824L3762l8757M58k5026q7982
14211f0750l0113L588L5682O1840N5849K8870p8071j24843k2513J11553K8750
$$ plain form
14291 -137897 -31840 39286 38508 128370 181736 180677 194732 10690 -27747 -60703 -21162 -22818
14279 -22818 22332 81048 63958 77737 59653 36129 -89729 -166248 -98972 -120924 -17469
14268 -17469 99453 121213 89846 29813 9803 -26733 -43520 38982 105724 122542 158237
14257 158237 83855 20911 39153 95645 79579 145242 158111 102317 28118 -95396 -64485
14246 -64485 -52458 -160611 -173610 -96877 -141036 -104970 11280 20852 46108 66125 68587 57577
14234 57577 -9709 16741 77563 103120 33292 25056 -34890 -49224 -21562 -54702 -19127 63033
14222 63033 18110 -2234 124638 256306 171619 56795 90557 51800 52258 27232 -60750
14211 -60750 -90863 -87275 -51593 10247 66096 94966 16895 -107948 -130461 -18908 9842
14200I842j7926m408j1997m9926N5323M473j9117o082j0901M6545N3166K7554
14188G6546n3177n3850q3877N6536P1006k1540l5230M0124O6068O6166k9239l8204
14176F1329l5795R7825m2195m7433K6964P8246J7696m1282j03117m8714J6990
14165a9486k2912O9571J4406q4526j5273J0328o1813q0806k439P0021R848L196
14153a09885R5720J9527K3237q3917l8383k7193P4075J07208J26475K7381j3576
14142B00669j24406j31783q3531O700m9408J27201P8818K6339J6157p7924r7244
14131a08412O2o093P4984p6095o6468m3257J7803J72847O7134J7054q8540r1853
14119a30834J9534J38358R1595j59728p0838j9352m5663L5486R6464L68m2819
$$ plain form
14200 9842 -8084 -12492 -24489 -74415 -19092 -14619 -33736 -39818 -50719 -4174 48992 76546
14188 76546 23369 -30481 -114358 -57822 13184 -8356 -43586 -3462 62606 128772 99533 61329
14176 61329 25534 123359 81164 33731 60695 138941 156637 115355 12238 -36476 -19486
14165 -19486 -42398 27173 41579 -42947 -58220 -47892 -109705 -190511 -192950 -122929 -113081 -109885
14153 -109885 -14165 5362 28599 -55318 -93701 -120894 -46819 60389 186864 214245 200669
14142 200669 76263 -55520 -139051 -132351 -181759 -54558 24260 50599 66756 -11168 -108412
14131 -108412 -108350 -114443 -39459 -115554 -182022 -225279 -207476 -34629 32505 49559 -38981 -130834
14119 -130834 -111300 27058 118653 -41075 -111913 -131265 -176928 -141442 -44978 -44610 -87429
14108h7429k2807J29750J6075o988O6745j327L1218r9001j3172Q3673M949k7894
14096G3792Q531P3227N7574l2647p0015L6533J4169l1255j0802o1261J31683N3683
14084B43212j31822j8453J5840N2200o1343L933J0898m4366n5441r963l4732j6769
14072d6806J19313R8223n0090m7266l0155J7130j34756q8133R734Q7297j4624
14061h0133J12345m2292q1089o639L8642O2430N1837o5456J31745j5657j52723
14050d6990q6975O1021L3787J948J9757o7210m0884O3736R7681K0135k8386o1445
14038c3825J5698K9750l5833Q9376j1631l2164j6493m0940J6056j5785K6662N7279
14026D8150O9736k8952q1498j14714J5830J03024K0989l9654K7269j9296j5303
$$ plain form
14108 -87429 -110236 19514 35589 28601 95346 94019 125237 26236 13064 96737 101686 73792
14096 73792 82323 155550 213124 180477 110462 146995 161164 129909 119107 57846 189529 243212
14084 243212 111390 92937 108777 160977 99634 103567 114465 70099 14658 4695 -30037 -46806
14072 -46806 72507 170730 120640 73374 43219 60349 -74407 -162540 -152806 -65509 -80133
14061 -80133 32212 -10080 -91169 -97808 -59166 3264 55101 -10355 121390 105733 -46990
14050 -46990 -133965 -72944 -39157 -37209 -17452 -84662 -125546 -61810 35871 56006 27620 -33825
14038 -33825 -18127 11623 -24210 65166 53535 21371 4878 -36062 -20006 -35791 -9129 48150
14026 48150 117886 88934 7436 -107278 -91448 11576 32565 -7089 20180 884 -14419
14015a4419l9322P42M8399l5028K1227J3857n4190L2857N4229L9781j2278k1015
14003C4840O7435N422Q796j6996j08308r991n745j66M2553L9521o5446q3997R0060
13990b022N6553k2593m9721J4318j2700L9157N2677n7393o7734p3025J9146O9579
13978c3758j4160o4165N0710o1071l176N5428j3806j0539R0676Q6685J41507l7338
13966A86993j55234r7962K7439j8042J4607M32J8965k1811J4993J9899r2631M3773
13954e8579J25006m418J0252J6892L4770j39107j07518j33832K5494Q6152M0446
13943a04442L640K5947j714L1512L85J54646J9767j83089j58398L1369O5851N5307
13931e9219P9168P7442o0833j3583J3179j029n3573J1307R744l194J3587q9458
$$ plain form
14015 -14419 -53741 -52999 -4600 -39628 -18401 -4544 -58734 -25877 28352 68133 55855 34840
14003 34840 102275 107697 116493 99497 -8811 -18802 -24547 -24713 17840 57361 -8085 -92082 -2022
13990 -2022 54531 31938 -17783 -3465 -16165 22992 75669 18276 -49458 -122483 -103337 -33758
13978 -33758 -47918 -112083 -61373 -122444 -125620 -70192 -83998 -94537 -3861 82824 224331 186993
13966 186993 31759 -66203 -38764 -56806 -42199 -41767 -22802 -44613 -29620 -9721 -102352 -58579
13954 -58579 66427 62009 72261 89153 123923 -15184 -122702 -256534 -231040 -144888 -104442
13943 -104442 -100802 -74855 -76569 -45057 -44672 109974 129741 -53348 -211746 -180377 -114526 -59219
13931 -59219 19949 97391 36558 22975 36154 35125 -18448 -7141 2603 -591 12996 -76462
13919g6462O5959K7324j2201j5848Q2447J34890n9274j39332o3258k3666J30242
13908E0821m0332n8968J784J3759l84N8640n2052L3468m1811J0037K6831m1584
13896c9791o7680L9260J08665m7898o4332m522r437k968P3634Q9859P9047M0012
13884A93849p1381K518q6100r5820k4303J4830q4441P7104R5844R8236n2524j09265
13872d1453p3952m5972Q332N6627J70427R3731n2119L0874j05380L6636J3247
13861I0998O9363N3450K2943j325j15411j31876O1277K7173J8048L9655j04004
13850C0291o9986J652j7119M0702N6299N1488M6131J2964j11664l1636o8144k2636
13838h1658J5230p2040K6548J40762M4348k7373n5851k8504r8161j6646M1072
$$ plain form
13919 -76462 -10503 16821 4620 -11228 71219 206109 146835 7503 -55755 -79421 50821
13908 50821 10489 -48479 -46695 -32936 -33320 25320 -26732 6736 -35075 -25038 1793 -39791
13896 -39791 -107471 -68211 40454 -7444 -71776 -76298 -85735 -88703 -15069 74790 153837 193849
13884 193849 122468 124986 38886 -56934 -81237 -66407 -150848 -73744 22100 120336 67812 -41453
13872 -41453 -115405 -161377 -153045 -96418 74009 167740 115621 146495 41115 77751 90998
13861 90998 160361 213811 236754 235429 120018 -11858 49419 76592 94640 134295 30291
13850 30291 -39695 -38043 -55162 -14460 41839 93327 139458 152422 40758 9122 -59022 -81658
13838 -81658 -66428 -138468 -111920 28842 73190 45817 -10034 -38538 -136699 -153345 -112273
13827a12273L5942P7159J78459L4898q3657Q269M2725p0152J4217L3357p6101
13816H2843P07L3012n4926O5935j02386l5802O506R0827L7178o6250K0177o6305
13804A1516j15316n6338P2485J04607N2076Q1774k6721k4085P492o67L3435N198
13792A45456o3852j18117j34056M203N6934O7463O1699N8788j11363n0771j0164
13781i3780j1413j6401K0400R7067j4599k2824M4239k3119n0453N1529M7329o1682
13769c3707l0004o0420q5988K1612J01404J0442n5603R247p829k4094k4686L3100
13757a46526L2250J3738j4927m0717N9250L9093O1394J00215j5290j52324J7262
13746d6582R3489P3225p792P2670j01324j29909M8115M6347n7899l2216L5268
$$ plain form
13827 -112273 -76331 828 179287 214185 130528 138797 181522 111370 125587 158944 82843
13816 82843 83550 116562 61636 127571 25185 -10617 -4111 86716 123894 57644 77821 11516
13804 11516 -103800 -160138 -87653 16954 69030 150804 124083 99998 107490 106823 140258 145456
13792 145456 81604 -36513 -170569 -166366 -109432 -41969 19730 78518 -32845 -83616 -93780
13781 -93780 -105193 -121594 -101194 -4127 -18726 -41550 2689 -20430 -70883 -19354 27975 -33707
13769 -33707 -63711 -124131 -210119 -188507 -87103 -76661 -132264 -123017 -130846 -154940 -179626 -146526
13757 -146526 -114276 -100538 -115465 -156182 -96932 -57839 3555 103770 88480 -63844 -46582
13746 -46582 46907 120132 112340 185010 83686 -46223 1892 48239 -9660 -41876 -6608
13735f608O5777j3656N2300P1450j38218N3337L7539j26340r482L3983l055l521
13723A3506r996m8992l1878K8207Q2458K5296J23826k534l0316o8208J484K4499
13711A07352j23777m4714J06221L4720o804k0339q1261P7198n9098l1240O4976
13700B3234n4731q871J0006R3398Q4599M6216j13561n0401J4966j6400n5962J07552
13688H0045P3459p0500j15361q3090N2938N3002J68941o7774j44539j03984M705
13677a52158J3526L7931O4572j01762J9884Q9843P5834K8091j05616o7894R1196
13666f553J34687N8553j19907j14019K029O9154N63m9011M7143M1978O5816P400
13654A37833L1973M7934q51m4927j69316j48669k788k2672M1015Q6310M228N7738
$$ plain form
13735 -6608 59169 45513 97813 169263 31045 84382 121921 -4419 -13901 20082 17027 13506
13723 13506 3510 -45482 -77360 -49153 33305 58601 182427 179893 149577 81369 82853 107352
13711 107352 -16425 -61139 45082 79802 72998 52659 -28602 48596 -10502 -41742 23234
13700 23234 -31497 -40368 -30362 63036 147635 193851 80290 29889 44855 28455 -27507 80045
13688 80045 153504 83004 -32357 -115447 -62509 -9507 159434 91660 -52879 -156863 -152158
13677 -152158 -138632 -100701 -36129 -137891 -118007 -28164 47670 75761 -29855 -97749 -6553
13666 -6553 128134 186687 66780 -47239 -45210 23944 24507 -24504 22639 64617 130433 137833
13654 137833 169806 217740 216889 171962 2646 -146023 -148811 -171483 -130468 -44158 -39930 17808
13642A7808Q9388n6155q7760O653q461K0487p0790J2954L6204j21585l7830J54787
13630d4300P2861J2012J1685o9048O2381J55447M6465j67105j33083M5259L3801
13619B6375N6866P4196j4980j13404j39000m5138Q1518R129O4978M9156P1000
13608A20696m4791M7643J6907j4051p8877m6402M323N6450l302N6519J9276J20523
13596B54914j1064j18165j7169j2927j40361j06859K4165L8264M1792L1965J7039
13585A594j9097J0543L7402N9057k9219o1365O205K738K084M302j6771K0474j846
13572A6101P1519l2011M8410n987P1393l5975p8093j9527M3024J4509m4132o6653
13560a7422R3540o0668j77584k3117M0674M7286Q9917J2334M7804J17809o2008
$$ plain form
13642 17808 107196 51041 -36719 -30066 -38527 -18040 -88830 -75876 -39672 -161257 -199087 -44300
13630 -44300 28561 40573 52258 -16790 45591 201038 247503 80398 -52685 -7426 26375
13619 26375 83241 157437 142457 29053 -109947 -155085 -73567 -64438 540 49696 120696
13608 120696 75905 123548 140455 126404 47527 1125 5448 61898 58596 115115 134391 254914
13596 254914 243850 125685 108516 95589 -44772 -151631 -127466 -89202 -47410 -15445 1594
13585 1594 -17503 -6960 30442 89499 60280 -1085 5120 7858 9942 14244 -2527 17947 16101
13572 16101 87620 55609 104019 98032 169425 133450 55357 35830 78854 93363 49231 -17422
13560 -17422 76118 15450 -162134 -185251 -144577 -97291 -7374 4960 52764 170573 108565
13549A08565j14814K8616n0282J1504N8419O6927o2464r8556N5279M7469N1206
13538A01869n3019k8866k4109J19789M162p571P3757L9869J5192j26427j7216
13527I7430M6984l8765l687N3674J7924n1460r2264J0546p757p3K07o252l4068
13514g561M9580J24126N502M228k0721j10144k1340M5534k7122m1853L2306M3677
13502G6212k6533q1581o9177J0503l2727L1268n9623P001M8987K1856N5719q309
13490b6404o2437k1127L539Q6499k9715q834L809M8036J18038J2102n8523l8643
13478B6340M0605J31291l343J1848j1736L4875k8698o113n8430M8941j5723q9640
13466H0217q2903k6794Q7515L0953q4297P2159J4985j00225k0173l509Q4744N0432
$$ plain form
13549 108565 -6249 22367 -27915 -16411 42008 108935 46471 -52085 3194 50663 101869
13538 101869 48850 19984 -4125 115664 119826 112255 186012 225881 241073 114646 97430
13527 97430 144414 105649 101962 155636 173560 122100 29836 40382 32625 32552 32759 26507 -7561
13514 -7561 42019 166145 171647 175875 155154 45010 23670 69204 42082 229 32535 76212
13502 76212 49679 -31902 -101079 -90576 -123303 -92035 -151658 -144657 -95670 -73814 -18095 -26404
13490 -26404 -88841 -109968 -106429 -19930 -49645 -58479 -54670 -6634 111404 123506 64983 26340
13478 26340 66945 198236 194893 206741 195005 229880 201182 195069 136639 185580 169857 80217
13466 80217 -2686 -29480 58035 88988 4691 76850 91835 -8390 -28563 -32072 52672 103104
13454A03104R51j27030j561J08898O7857K7684j76139n0865L5403j1705l5861
13443e9264n271J5952Q5371J1325L743o0370l6042P6366P4392p0820M6729K1795
13431A03906j05504p6591l239R9315N1208j39055m4843M3982j1827j18663L4240
13420a67071R3000N3367J00620J3985r4569l0236l9023J732K4953j9785Q0399
13409A7372N9895J1094r23l0451q5327k1268o8450K0136J6442K0107O2698k5317
13397b3992N1324n6409N9373O2100p0301r0802M1561O8783O2905j35000p2412
13386a02870J05265M9783q2583n9424J08755K8571m9519m6255K3501O9636M4371
13375H9231Q113J3530q1568j39022J2896K0001L0116J02644J5926J0696l6228
$$ plain form
13454 103104 104055 -22975 -24536 84362 152219 179903 3764 -47101 -11698 -23403 -59264
13443 -59264 -64535 -48583 36788 48113 51856 -8514 -44556 31810 106202 35382 82111 103906
13431 103906 -1598 -78189 -81428 17887 69095 -69960 -114803 -70821 -82648 -201311 -167071
13420 -167071 -74071 -20704 79916 93901 -668 -30904 -69927 -68195 -43242 -63027 17372
13409 17372 77267 88361 87438 56987 -28340 -49608 -118058 -97922 -81480 -61373 1325 -23992
13397 -23992 27332 -29077 30296 92396 22095 -68707 -27146 41637 104542 -30458 -102870
13386 -102870 2395 52178 -30405 -89829 18926 47497 -2022 -48277 -24776 44860 89231
13375 89231 97344 110874 29306 -109716 -96820 -76819 -46703 55941 71867 82563 46335
13364D6335n6884L593K6352Q3862O753r0446l0870k3907N4060j11972q1807m0193
13352b15124m001J3571j3225N5337K5886p406P6966L153O9563J25188q884J0383
13340A31407O5426o7293p4710K1444l6382N946Q8342r8969j9250N7839K1759J6134
13328A11693l9740R8229N0356L744L0624J3352n9717p7578j59437M4409L2127
13317D8062o33O0055J3417R0166n911k4358k19268q2844J21473L8809o4900j9020
13305d4952J10687L7698n4454K9226j4883n9449n7342p9265J06624P8488N0415
13294A02793p2650K6042J186K0447J0954m3086o52L552K0876M1858M3337L1863
13282A86520o7565r6774j46269o9212N2287R2429j5246N5064j09437J8301M2440
$$ plain form
13364 46335 -10549 -6956 19396 103258 110011 19565 -11305 -35212 18848 -93124 -174931 -215124
13352 -215124 -219125 -205554 -218779 -163442 -137556 -144962 -67996 -64843 4720 129908 121024 131407
13340 131407 196833 129540 54830 76274 39892 45838 134180 35211 15961 73800 95559 111693
13328 111693 71953 170182 220538 224282 254906 268258 208541 130963 -28474 15935 48062
13317 48062 47429 107484 120901 211067 205156 180798 -38470 -121314 159 38968 -25932 -44952
13305 -44952 65735 103433 48979 78205 63322 3873 -53469 -132734 -26110 52378 102793
13294 102793 30143 56185 57371 77818 88772 45686 45034 48586 69462 111320 154657 186520
13282 186520 118955 22181 -124088 -193300 -141013 -48584 -63830 -8766 -118203 -99902 -57462
13271e7462L051j9317O2012Q8611q4158j40348L1512N8914l838o1628N6658Q0275
13259A4282J0230m9294O847l4727M6639O3453l2886q2972Q511J47143J71597K6694
13247B95517j56986n2869O6368j23984L2141K9884J4022K3461r7967O9117J41062
13236B39766M1989m5207l7975k939n6819l1942Q7596n6191k8473n2975p9165J5589
13224f746J27621O6457m4178q3039j00113N8515N4940o877j049p0680P2330J1140
13212G8321K9521j09793q3046P5322K6280j4728J4091o5084p8132n1654K5755
13201a53147M9915M0885j5613L060J19953J23828M239o3165j839j4667m7337L2166
13189G8278K5847L5991n8238J05313N202P1036k8993j15812n7656r4252k3472
$$ plain form
13271 -57462 -54411 -73728 -11716 76895 -7263 -147611 -116099 -57185 -61023 -122651 -65993 14282
13259 14282 24512 -24782 -17935 -52662 -6023 57430 24544 -58428 -49917 97226 268823 295517
13247 295517 138531 85662 152030 28046 60187 90071 104093 127554 29587 98704 239766
13236 239766 281755 236548 198573 195634 138815 106873 194469 138278 109805 56830 -22335 -6746
13224 -6746 120875 187332 143154 60115 -39998 18517 73457 66580 65531 -5149 67181 78321
13212 78321 107842 -1951 -84997 -9675 16605 1877 15968 -49116 -127248 -178902 -153147
13201 -153147 -103232 -62347 -77960 -74900 45053 168881 173120 109955 108116 93449 46112 78278
13189 78278 104125 140116 81878 187191 192393 263429 234436 118624 60968 -33284 -56756
13178e6756M9724J0571O9080j3881j0128R7760O7785n9008j09659J1803m6958
13167A0333M3974N5068n011k6916q9636j08860J2051P2714L3084J19699J0989
13156A27489j52286p3720r381O279K6605J72976Q5987l0385K8364k2776r3727
13145F5425j23706L7433J6538J6487K4740n7156m5219q914N0520J19617J659k5064
13133G2360r2502M5313M5707o2096j7663K7589J5208O5886K3909j53933m8369
13122g8591R5719J38103n8984m1232p0887q9303Q9361Q9666m8504p8091q6837
13111a39580l5970J3827l1831P8420Q0704M2513L1529J0098J00043l3609k0280
13100I5864l113O758o8311j9521J18064K4888o1092M8599P1173q3040j0484L0274
$$ plain form
13178 -56756 -7032 3539 72619 58738 48610 146370 214155 155147 45488 57291 10333
13167 10333 54307 109375 104364 77448 -12188 -121048 -108997 -36283 -3199 116500 127489
13156 127489 -24797 -98517 -107898 -101619 -75014 97962 183949 153564 181928 159152 65425
13145 65425 -58281 -20848 -4310 12177 36917 -20239 -65458 -74372 -23852 95765 97424 72360
13133 72360 -20142 25171 70878 8782 -8881 18708 33916 99802 123711 -30222 -78591
13122 -78591 17128 155231 96247 55015 -15872 -105175 -15814 73852 25348 -52743 -139580
13111 -139580 -175550 -161723 -193554 -115134 -34430 8083 39612 49710 149753 116144 95864
13100 95864 92751 99509 31198 11677 129741 154629 93537 142136 213309 130269 119785 150059
13088A50059j09478M2469J11966l4753n3441K679k8658q2305K5512M9950l202
13077G0798k5022L4383l2273J3103O0396O9691j4623L2439q774K6453n2255j03913
13065G0403j15114J9211J06564R5421k8134L9828Q714j03392j17849N2325J40221
13054A68198Q0404J5315l8581L1139n3030M3405N7265m8420Q0034P3098j39587
13043B69240j76480n8340J1300O7198O7531m0413N2089Q7336l7265p1602N5328
13032B25922L7110M487o0332p2198K362n5716P493L8261L6783j8687l2250J6323
13020A29558J6098o4460K141M2573l6824M0393O9154p045p5323p4509J6902P098
13008F5756J72983q997j01387q1971j00006j18050j471N4153L7949L8918N5367
$$ plain form
13088 150059 40581 83050 195016 160263 106822 109501 80843 -1462 24050 74000 70798
13077 70798 45776 80159 47886 60989 121385 191076 176453 208892 200118 226571 174316 70403
13065 70403 -44711 -25500 81064 176485 148351 188179 196893 93501 -24348 27977 168198
13054 168198 248602 263917 225336 256475 203445 246850 304115 255695 335729 408827 269240
13043 269240 92760 34420 45720 112918 180449 140036 192125 279461 242196 170594 225922
13032 225922 263032 267519 207187 134989 137351 81635 89128 127389 164172 145485 113235 129558
13020 129558 145656 81196 83337 125910 89086 129479 198633 191588 116265 41756 58658 65756
13008 65756 238739 229742 128355 46384 -53622 -171672 -173143 -118990 -81041 -42123 13244
12997A3244J49578J0724l1726p2128L0611J6599N9465K3404r9331o1042L9215
12986G8613n8256r3663M3308M0502M5956m4875N166k6945m5280r032K7093M0254
12974B841M5057J9969L4497L9808M4184K7019m3880j14m2914m9577j6074j00306
12962c9490O2084J64139M638j08141m1724k9666l7482k7788L0745N4890o2N7003
12950H9146N2808l6253P2518N6120j63748j39734q5827K0567Q4837q456N9040
12939A018J18842L9430q5941J9778J6879j23388j9815Q6605Q7469o6538p2524
12928A815j4328J6503M1349M8145R8089Q0675j36567j11688M0995L2173M0074
12917A37235q2288P160L7491l0125j9608p665k5907q9620p7931n811N2217J9335
$$ plain form
12997 13244 162822 173546 141820 69692 100303 116902 176367 199771 100440 39398 78613
12986 78613 20357 -73306 -29998 10504 56460 11585 16751 -10194 -55474 -64506 -37413 2841
12974 2841 47898 67867 102364 142172 186356 213375 169495 169381 126467 76890 60816 -39490
12962 -39490 22594 186733 191371 83230 41506 11840 -25642 -53430 -22685 32205 32143 89146
12950 89146 141954 105701 178219 234339 70591 -69143 -154970 -134403 -49566 -58022 1018
12939 1018 119860 159290 73349 93127 110006 -13382 -33197 53408 140877 74339 1815
12928 1815 -12513 3990 45339 93484 191573 272248 135681 23993 64988 97161 137235
12917 137235 54947 62107 99598 69473 49865 42200 16293 -73327 -151258 -157069 -104852 -85517
12905h5517M8633J41756l475n4363l4286k89M6895m7105J6524M5758k1849k2555
12893C0127K0675P2873J16735o6111q1818j3822n1646k0372j8813K9924Q6124
12882A03876J08155L8839L652n6394m3459p7167k5182Q6016p8571l7627J56294
12871A78432R4297L4584n502p7656p5437K934p6475q4933j0942j2605M2773Q1705
12859I1175L5580k7146l6091m309L600L6521m7852P9637n0972q0160L9882M3904
12847H3769L0503R7037k906o7994m8409K4780J3596m233n8302L4359L6531l8014
12835A00717j09223j8448J43762O9713q4053o9511j9474P6169N1287j8498k5899
12824I6542O5035R261J3979j10330K9686Q9396M4870K9001m7276r462N2056r4769
$$ plain form
12905 -85517 -36884 104872 101397 47034 12748 12459 59354 12249 28773 74531 52682 30127
12893 30127 50802 123675 240410 174299 92481 78659 27013 6641 -12172 17752 103876
12882 103876 212031 250870 254522 198128 154669 77502 52320 138336 59765 22138 178432
12871 178432 272729 307313 301811 224155 148718 151652 75177 -9756 -20698 -33303 9470 91175
12859 91175 126755 99609 63518 59209 62809 99330 51478 131115 80143 -17 39865 83769
12847 83769 114272 211309 208403 140409 92000 116780 130376 126143 67841 102200 138731 100717
12835 100717 -8506 -26954 116808 186521 102468 32957 13483 89652 140939 122441 96542
12824 96542 161577 170838 184817 74487 104173 193569 238439 267440 220164 210702 262758 167989
12812A67989j42866l3510o5312j23313N1930J25010N4725J38380Q4410M3724j36597
12801A64570q3597O044J5711k4052J6342J0071J476q1384k8595j8114N467J28177
12789A12116l365p4785J0789L1695k262K8335n6164j4820M1967m079J41232J16431
12777C27090n7053r0515l0866M2246j4867p8533p7338Q0116N697l6667N9202P9404
12765B07916k5591l4233N5991m1512r1202n1702l7644J53064J10110J2771j03370
12754A54598m6213q2666j14624L7876M1428J2450j5885j0762M3487P8196M6226
12743A44111l3022n1304K5242l372K1188m4460L2367N6288J4746M6814m7090o2778
12731I8730J7162L1991L0961l6872p0469L4095J9826K5061p9438m9260j0681J19179
$$ plain form
12812 167989 25123 -8387 -73699 -197012 -145082 -20072 34653 173033 257443 301167 164570
12801 164570 80973 87017 102728 78676 95018 105089 106565 25181 -3414 -21528 -16061 112116
12789 112116 108751 33966 44755 76450 74188 102523 46359 31539 73506 69427 210659 327090
12777 327090 270037 179522 148656 190902 176035 97502 20164 100280 105977 69310 128512 207916
12765 207916 182325 148092 204083 162571 71369 19667 -17977 135087 245197 257968 154598
12754 154598 108385 25719 -88905 -51029 -9601 2849 -13036 -23798 19689 97885 144111
12743 144111 111089 59785 85027 81655 102843 58383 90750 147038 161784 208598 161508 98730
12731 98730 115892 147883 178844 141972 71503 105598 125424 150485 71047 21787 11106 130285
12719A30285m684P8948M1015l0194j15713Q0047K5202r4524O3191R2191j06944
12708A58820q2094n3423k1588j7409l5221J66100J24485K5913p4882j13485l5363
12697D1853J22459J26731N2473J07432l6411j25458p0340k6952R316n8937M4547
12686A86713N1667J547J740k0317M4042K0561n9664n8491J49518L2579j36703
12675B13192m81k3261m6341O0630N445j2479l3099j4043J43307O0889K9886N7365
12663D41010R0152J25575J02694O6377p5386l7429n5418q6263n0449K7014L0572
12652E78449J01148N78n7303r5298P182K0160k7706k6694q2197k7748L4839J22205
12640E47615J18429K8499p8670m8808n7347l4072P3716n6664O99J28006O9609
$$ plain form
12719 130285 125601 204549 245564 215370 99657 179704 204906 110382 173573 265764 158820
12708 158820 76726 23303 1715 -15694 -50915 115185 239670 265583 190701 77216 41853
12697 41853 164312 291043 343516 450948 414537 289079 218739 191787 201103 142166 186713
12686 186713 238380 239927 241667 221350 265392 285953 226289 167798 317316 349895 213192
12675 213192 212711 189450 143109 203739 209184 196705 163606 149563 292870 353759 383645 441010
12663 441010 531162 656737 759431 825808 750422 712993 657575 571312 520863 547877 578449
12652 578449 679597 680175 622872 527574 534756 554916 527210 500516 418319 390571 425410 547615
12640 547615 666044 694543 615873 567065 509718 475646 549362 492698 493397 621403 691012
12629F91012l0945m2993M121R6427O3737O9026L7536K2639J65289J90112P3067
12618A339028R594j04280j7091l3853j82002p6719n097q4301j29127k04527l5
12607E11590M9844N5987k0923m2271p7608N1600l5280j45187j8014J05129Q2806
12596E17673q808N6510q1884p1148n3007J9715L1546o801l6783q7962J28648k2936
12584C84763r921O9267m0833r041J34094J09770Q6327K8845N5990j7830j45761
12573F45670q702k2644j05439M205n0682j08092K1300J19431j12948j10763J24337
12562C95673J21826n8753n0896k9924j8105M1580K3860K2048m0179o3223j0159
12551C33748p7208m9423j07592l4265l5298N3685K09333l2534m0077o8388J10114
$$ plain form
12629 691012 660067 617074 621195 717622 781359 850385 887921 910560 1075849 1265961 1339028
12618 1339028 1348622 1244342 1227251 1193398 1011396 934677 929580 845279 716152 511625 511590
12607 511590 561434 617421 596498 554227 476619 528219 492939 347752 329738 434867 517673
12596 517673 508865 565375 483491 412343 359336 379051 410597 403796 367013 279051 407699 384763
12584 384763 374842 444109 403276 394235 528329 638099 724426 753271 809261 791431 645670
12573 645670 636968 614324 508885 513090 462408 354316 375616 495047 382099 271336 395673
12562 395673 517499 458746 407850 377926 359821 401401 425261 447309 407130 343907 333748
12551 333748 256540 207117 99525 65260 29962 83647 292980 260446 220369 151981 262095
12540B62095Q1010M8429J4099p5365N664J9486M3175J0278k0369n390J0657L014
12528C96783j8431l9268M6649P9569n0242O437J6925r052J6368o953l9828n627
12516C93330n7240M3735N1604r4285p8659P7661q554l772j6863j08609n0517M9403
12504A97234O0502M610L4571R2977R726q4966p6118k9459k4926J3952J24176R759
12492C32038M8310p9466p1773m7589K0199K0395l6622L3326J16224K4718n8794
12481C00966L7236j4400j08110r3421M9460P8897L0761K0565N1387q121o3912
12470B81308p6152L860J6546K9414q4695O7021N0362Q2101j2968j11355L7347
12459B82789N7628p3939m929M6741R993k5344O0707J33967J69425k6877j30437
$$ plain form
12540 262095 343105 391534 405633 330268 335932 355418 398593 408871 388502 383112 393769 396783
12528 396783 378352 339084 385733 465302 415060 421497 438422 429370 445738 438785 398957 393330
12516 393330 336090 379825 431429 337144 258485 336146 327592 323820 306957 198348 147831 197234
12504 197234 257736 262346 296917 389894 399620 314654 238536 209077 184151 198103 322279 332038
12492 332038 380348 300882 229109 181520 201719 222114 185492 218818 335042 359760 300966
12481 300966 338202 323802 215692 122271 171731 250628 281389 301954 353341 345220 281308
12470 281308 205156 209016 225562 254976 170281 237302 287664 369765 356797 245442 282789
12459 282789 340417 266478 261549 308290 318283 292939 353646 487613 657038 630161 499724
12448D99724r7916j50349K1078L5300O4318l4769m4197L5330M4960M5655K4353
12437D43487P092o6597M8652Q765P5185j061o5451N068O5419Q226j08889K8613
12425D48509R9252l2575P2318p8912n3990N7836M8736J8541k6889J8523m2775
12414E28574j61179r3890P2914k4812O5038P9905J18332J3859k9732J739k4308
12403E46440L0553J549p6400m4473r4007k6952O6318Q5619n8354o6634L9785M2860
12391D46304o7156J13156N0199k7981N3665j26889j46621l6381O7676J62034J26316
12380F14322o1412j30111k1904L1810k0046J6609j38347m03L0519J19953O4008
12369E04998j00297o0092P3869L6794j44875p098P3355N0784R677J6186L8078
$$ plain form
12448 499724 401808 251459 272537 307837 372155 337386 293189 328519 373479 419134 443487
12437 443487 450579 383982 432634 441399 516584 515523 450072 455140 520559 528785 419896 448509
12425 448509 547761 515186 587504 508592 454602 512438 561174 579715 552826 571349 528574
12414 528574 367395 273505 346419 321607 386645 466550 584882 598741 569009 570748 546440
12403 546440 576993 578542 502142 457669 363662 336710 403028 488647 430293 363659 403444 446304
12391 446304 379148 492304 542503 514522 568187 441298 294677 258296 325972 488006 614322
12380 614322 552910 422799 400895 432705 412659 429268 290921 290518 321037 440990 504998
12369 504998 404701 344609 418478 455272 310397 303299 376654 427438 437115 453301 491379
12358D91379K6106j3068r5969K4008J3301J3864K5663p1389n5408N4822L7917
12347D51226R2046j2310j37314j1190L8706N2886J6063R0885O9082q081M3568
12336F85567j1267j09538n842J7463M4786k9829q0285K9402L1818L9631J34652
12325G46558j07497j06083M3124o6084n7037O5384O5866P6868J84497J04639P6674
12314A026909n539k4885O3633J07009N2491q2234q1338N3992M9862q172o1587
12303A090141J6202J29771J48747R4771J25480M281Q2101J61219P2981O2807J24311
12292B112812J40362Q9068N2640J23395J14156L5041l6536l2358K3408M578j65978
12281B460588j71780K0647M1061j1804J17524J42212R3397J00969K21946J36115
$$ plain form
12358 491379 517485 504417 408448 432456 445757 459621 485284 413895 358487 413309 451226
12347 451226 543272 530962 393648 382458 421164 474050 490113 580998 650080 641999 685567
12336 685567 674300 564762 558920 576383 621169 591340 511055 540457 572275 611906 746558
12325 746558 639061 532978 576102 510018 452981 518365 584231 661099 845596 950235 1026909
12314 1026909 1021370 996485 1060118 1167127 1219618 1137384 1056046 1110038 1159900 1151728 1090141
12303 1090141 1106343 1236114 1384861 1479632 1605112 1609393 1691494 1852713 1925694 1988501 2112812
12292 2112812 2253174 2342242 2394882 2518277 2632433 2667474 2630938 2598580 2621988 2626566 2460588
12281 2460588 2288808 2309455 2350516 2338712 2456236 2598448 2691845 2792814 3014760 3150875
12271C150875o0033Q7616O615r7658j22358l4033n3022m4269J9439N0774K525
12260B906471j8430J30358Q4537J36265J79774K81715K72193L21076L69291L99128
12250E062378M37777L93363L76129M34321M17255L25024L64679L79212M63887
12241H654025O60054O44451N84077P39020P81264O49893O37745N86983N25859
12232A4463371L41368L60184P08701R08612J065229J600606K299364L279147M533605
12223B9560187O024945P999906J0200627J1710430J1718750R623778N014726n93183
12215I1260166n485195q290636q630324p322917n342172l358245j786540n48967
12207E0495170J91948Q46918J639909K308139K510726K106218J502964O33020
$$ plain form
12271 3150875 3090842 3178458 3185073 3087415 2965057 2931024 2878002 2833733 2853172 2903946 2906471
12260 2906471 2888041 3018399 3102936 3239201 3418975 3700690 3972883 4293959 4663250 5062378
12250 5062378 5500155 5893518 6269647 6703968 7121223 7446247 7810926 8190138 8654025
12241 8654025 9314079 9958530 10542607 11281627 12062891 12712784 13350529 13937512 14463371
12232 14463371 14804739 15164923 15873624 16782236 17847465 19448071 21747435 25026582 29560187
12223 29560187 35585132 43585038 53785665 65496095 77214845 86838623 91853349 91260166
12215 91260166 85774971 77484335 68854011 61531094 56188922 52830677 51044137 50495170
12207 50495170 50687118 51534036 53173945 55482084 57992810 60099028 61601992 62235012
12199F2235012P454l20727J87100R25156J867848K911405L400126L339455K709909
12190G7262738J545888L07771m54332p98357l11668O55519J922628L698511O019432
12181H9848130R281751J3821014J9698526K5999865L0166185K8702614J9929449
12174B37447534N323132j0350068k1722240k6589583k5591209k1550052j6794425
12167A20173089j2443245q965875o154143l820868j950812n63876J44059k8394
12159H6389935r91026k292060l400217l943810l816953l087045k067230j129513
12151F5662081l81996q8249l67710j146143j931842k424110k396105j948904j304682
12142E3672340p66219j73705N67144J427121L131981N576452Q130311J0018333
$$ plain form
12199 62235012 62242466 61921739 62108839 63033995 64901843 67813248 71213374 74552829 77262738
12190 77262738 78808626 79116397 78662065 77863708 77552040 78207559 80130187 83828698 89848130
12181 89848130 99129881 112950895 132649421 158649286 188815471 217518085 237447534
12174 237447534 242770666 232420598 210698358 184108775 158517566 136967514 120173089
12167 120173089 107729844 98763969 92609826 88788958 86838146 86274270 86418329 86389935
12159 86389935 85398909 83106849 79706632 75762822 71945869 68858824 66791594 65662081
12151 65662081 65280085 65191836 64824126 63677983 61746141 59322031 56925926 54977022 53672340
12142 53672340 52906121 52732416 53299560 54726681 57858662 63435114 71565425 81583758
12134H1583758J0034184P257069J920261m115744r170313j1644343j1887466j0814558
12126E3162848r015710p110412n425622l997136k999488k212952j728746j209290
12118A9463492q58023p71913n81231n64514p07463q05797q94538j030119q16976
12109A2432918q16687p77415o94192o79387n21074m36662m29077m23343m70289
12100G184792o38922n53118m69022m62736m32669l51084l23989j19753j15344
12091C718155j34427j53296j40165l1614j40449q5591o6010m8936r1974O7639
12081B893332j478M7930J46252L9588J6665j01192l6410j08553j24553m9277q8952
12070B633352r2597N3766p2076l2057L7137m6587Q488O1120O1740J6842m2252
$$ plain form
12134 81583758 91617942 98875011 100795272 96679528 87509215 75864872 63977406 53162848
12126 53162848 44147138 37036726 31611104 27613968 24614480 22401528 20672782 19463492
12118 19463492 18605469 17833556 17252325 16687811 15980348 15174551 14280013 13249894 12432918
12109 12432918 11616231 10838816 10144624 9465237 8944163 8507501 8078424 7655081 7184792
12100 7184792 6545870 5992752 5523730 5060994 4628325 4277241 3953252 3833499 3718155
12091 3718155 3583728 3430432 3290267 3258653 3118204 3032613 2966603 2917667 2825693 2893332
12081 2893332 2891854 2939784 3086036 3125624 3142289 3041097 3004687 2896134 2771581 2722304 2633352
12070 2633352 2540755 2594521 2522445 2490388 2527525 2480938 2489426 2550546 2612286 2629128 2586876
12059B586876p7657k3473l7457j53260j90751l00693j98085j32472p3365m1311
12049A358352N3472O5117J44486J4760q8404o0125o2852O369m7483o5345J7598
12038A335945J0430M9066M0535p6581r0699K9401L9406K915j10642o393j49766
12027A073617o1660j6229n0592M8120P3265r3549j04286j28372l7414Q8131L6742
12016H27773p7438p4387p2299j304q866R1754l8703K4294L5843k9541j12421j56071
12004D08634j2840J31636Q7518J08395q1934j04457m4964K6732K1855R4983K4347
11993F59905n2100k4340K6473L2845k2245l0035O0240m0884j51546q5771l3157
11982C39385m691J0261K770O4056O6538j07267n5832j27364j55131N7691j6438
$$ plain form
12059 2586876 2509219 2485746 2448289 2295029 2104278 1803585 1605500 1473028 1399663 1358352
12049 1358352 1411824 1476941 1621427 1636187 1547783 1487658 1424806 1431175 1383692 1318347 1335945
12038 1335945 1346375 1395441 1435976 1359395 1268696 1298097 1337503 1340418 1229776 1223383 1073617
12027 1073617 1011957 995728 945136 993256 1066521 972972 868686 740314 702900 791031 827773
12016 827773 750335 675948 603649 602345 593479 685233 646530 670824 706667 677126 564705 408634
12004 408634 395794 527430 614948 723343 641409 536952 491988 518720 540575 635558 659905
11993 659905 607805 583465 609938 642783 620538 590503 650743 609859 458313 372542 339385
11982 339385 334694 344955 347725 411781 478319 371052 315220 187856 32725 90416 73978
11971G3978j898J09326n4254r7830n226j5055N091n3770q3887L3099J24399J1092
11959D5065j30971j10464R6630R3265M5594k6908O8302m578o8027l7877J0028
11948a9941K0195K6539l7305l8864L2206n4945l795m603r3198M6114J9375P493
11936a00729J20197l741n2099j4358P3138L514n9754l181m1125J5046j4968J8420
11924e9640L8396J3941l0300P9754J18627q858M3074m7659j18285L0507J03895
11913A63452l4964j00086N708k720j4033r3137l5256O1794O6391Q7865q8952j41652
11901a25590M5786j3170j36956j91495N4993K12677L5001j1943J10546k1107p9522
11890a20780K3800n9584M3506J56218J050K6376k1140n9694n7192K9069p5939
$$ plain form
11971 73978 72080 181406 127152 29322 24096 9041 14132 -39638 -123525 -90426 33973 45065
11959 45065 -85906 -196370 -99740 -6475 39119 12211 80513 75935 7908 -29969 -19941
11948 -19941 254 26793 -10512 -49376 -17170 -72115 -75910 -80513 -173711 -127597 -108222 -100729
11936 -100729 19468 15727 -36372 -50730 22408 25922 -33832 -37013 -78138 -63092 -78060 -59640
11924 -59640 -21244 -7303 -37603 42151 160778 151920 194994 147335 29050 59557 163452
11913 163452 128488 28402 34110 31390 17357 -75780 -111036 -49242 17149 105014 16062 -125590
11901 -125590 -79804 -92974 -229930 -421425 -366432 -153755 -118754 -130697 -20151 -41258 -120780
11890 -120780 -96980 -156564 -113058 43160 44210 70586 49446 -10248 -67440 -38371 -114310
11879a14310n8916n9350K4755J6851J5132P3168P0790n7439Q1578L6578p3545
11868d4708o7071k0622J32059O7861j10315n0130O254O4377J41585P9591j29514
11857F9367k2742M1699r0603J3360L2579j5865j915l5195n0094J09811R3652p5411
11845F8643m5726l3675N637J13587j8487J0846O3841k6234n7588p4700L4039k7490
11833A2693j05590j10097n7318N6152M0169J02121K8578q3720M4888J44100n687
11822F6289n1428j1189P323Q2622n8988j48585J1073J06679N1737R9463Q852r2671
11810G1177j10455j6603P6732k9404J6863k6156j1492N2417P3962l6833o9417
11799i209O8516k026n0288n7216L0248J2541L1826n4823l0108L0044J9683m0528
$$ plain form
11879 -114310 -173226 -232576 -207821 -190970 -175838 -102670 -31880 -89319 -7741 28837 -44708
11868 -44708 -111779 -132401 -342 67519 -42796 -92926 -86672 -22295 119290 198881 69367
11857 69367 46625 88324 -2279 11081 43660 27795 25880 -9315 -59409 50402 144054 68643
11845 68643 22917 -10758 -5121 108466 89979 100825 164666 138432 80844 6144 40183 12693
11833 12693 -92897 -202994 -260312 -204160 -163991 -61870 -33292 -117012 -72124 71976 66289
11822 66289 14861 3672 10995 93617 34629 -113956 -102883 3796 55533 154996 163848 71177
11810 71177 -39278 -55881 20851 -8553 8310 -17846 -29338 23079 97041 60208 -9209
11799 -9209 59307 57281 6993 -50223 -19975 -7434 24392 -30431 -60539 -30495 -10812 -51340
11787e1340j27100j16570K2432J74962J02566J1526r5210K8008R9878K6288n5320
11776B0120M3041O4544L8602j198o3744M2445J75676J59355M5708K6608q7063
11765D64094m9002m5r2626l1383l269O4603n656j31787r5290j39q986K9235R9401
11752B39150J00156M9201n8702r3694m8263j04982K5056L4687j313N2958N8080
11741B52334O119K3865J13247m8962M2586k9580m8661K3810J50561J24607M3154
11730F53080L6223M4198P5633O2574R0096J69969Q9639Q4689j30238j66196q9064
11719I20603J421j26618r8750j21370p5041p2047l6411j8782j47898J4511K8123
11708B67741P3436J8650p9947o4469K5847J2723p4029q7777O1Q2307l0465r8303
$$ plain form
11787 -51340 -178440 -295010 -272578 -97616 4950 16476 -78734 -50726 49152 75440 20120
11776 20120 63161 127705 166307 165109 101365 143810 319486 478841 524549 551157 464094
11765 464094 415092 415047 322421 291038 287769 352372 346716 214929 119639 119500 110514 139749 239150
11752 239150 339306 388507 329805 236111 187848 82866 107922 142609 141296 194254 252334
11741 252334 258453 282318 395565 346603 389189 359609 310948 334758 485319 609926 653080
11730 653080 689303 733501 809134 871708 961804 1131773 1221412 1306101 1175863 1009667 920603
11719 920603 922024 795406 696656 575286 500245 428198 391787 373005 225107 239618 267741
11708 267741 341177 359827 279880 215411 241258 253981 179952 92175 92236 174543 144078 45775
11696D5775m2309J5640R5108J2743K9882K0839m8959M1734R5335J05422K5046
11685C96256o6556Q2323L1222j4683l6955k4579K2829k7276L2981l4247o7919
11674B93396j28940r6945r8059J7915L6912j5523m2766j2971N8621l3309R4866
11663G3197Q7600k6572k2201j39600j5834L5850k6060k8505K6448k2583M7612
11652a0648p6530q7738M5964J63362Q0418r1j04578o1027j4314j583p8190P3342
11640g1613Q0798O130N441L2374L5921o1348M7519l9980l1790p9891L6075p1159
11628a11523j07464R1386J4570J58499m5832r6030o932M2783R7085K3252l9407
11617B0387J8938P6957J17163o8908O4620o5585j09869r0028n8646k7047O8685
$$ plain form
11696 45775 3466 19106 114214 126957 156839 177678 128719 170453 265788 371210 396256
11685 396256 329700 412023 443245 428562 391607 367028 389857 362581 395562 361315 293396
11674 293396 164456 67511 -30548 -12633 24279 8756 -34010 -46981 11640 -21669 73197
11663 73197 160797 134225 112024 -27576 -43410 -7560 -33620 -62125 -35677 -58260 -10648
11652 -10648 -87178 -174916 -128952 34410 114828 114737 10159 -50868 -65182 -66765 -144955 -71613
11640 -71613 9185 15315 20756 53130 89051 27703 75222 35242 3452 -76439 -40364 -111523
11628 -111523 -218987 -127601 -113031 45468 -364 -96394 -103326 -60543 36542 59794 20387
11617 20387 39325 116282 233445 164537 229157 163572 53703 -36325 -94971 -122018 -53333
11606e3333J4226m866R6831J22157P0o2146m4784j14212M3999k5553o5393J42
11594i2862J04068O2272r1471o1497o8743R121L6550k4420N1949Q8269j5732q4276
11582h6772J23448Q8078k5366j4257J3791r0098q759K0524K0753Q214n7362k7386
11570c5192M4587J528L306l6401P4150K180r7813r3387K0331N9614j729l8686
11558i7512l2018O2929M6012r906K7367Q7452J11199j0175j05107o5812q7279
11547g2850k2491M4193k6749r4035M0344O1510J8237M1682J12064M8758M2710
11536A93373K304q4037p8255M920j1484J6602N5750J16275Q5972m1896n3638n5229
11524A50657k4168j9140l2482q461j9229j6132R552M4527j22841r9288l8632j2176
$$ plain form
11606 -53333 -39107 -43973 52858 175015 175085 112939 68155 -46057 -2058 -27611 -93004 -92862
11594 -92862 11206 73478 -17993 -79490 -148233 -139112 -102562 -126982 -75033 13236 -2496 -86772
11582 -86772 36676 124754 99388 85131 98922 8824 65 20589 41342 49556 -7806 -35192
11570 -35192 9395 10923 14229 -22172 51978 54158 -43655 -137042 -116711 -57097 -58826 -97512
11558 -97512 -129530 -66601 -20589 -30495 -3128 84324 195523 185348 80241 14429 -72850
11547 -72850 -95341 -51148 -77897 -171932 -131588 -70078 -51841 -10159 101905 150663 193373
11536 193373 195677 111640 33385 38305 26821 43423 99173 215448 301420 259524 205886 150657
11524 150657 126489 107349 74867 66406 47177 31045 40597 85124 -37717 -137005 -175637 -187813
11512a87813Q0498M5640l3542J0529L4945J0210o807J0549l2512m5314L438m8103
11500a58282N7153J01945J6357l3715j8908j645K4824m2725J4799K546K1350O1478
11488D5177m7024n3052p1122k8621P2822j1814l1580J2M318J59304O8749K1201
11476A28370K8852n4909r4845m9938K192J13806k0493j37901J9605L7909K6596
11465g56p2073j3859k8918l7197J2929k0336N2160j9003L4374K9757j3741q1631
11453a58294K6135N6666N3908m6617L8073r0148j2275Q8538R8947P996r1490j05746
11441a34307J6118L9341k8524M5620p060J23972O2898o6356l5651J6889n8216
11430b5276j21633O8412K3418Q6926N05L7095j09466Q7356K3658p6080m0899o3489
$$ plain form
11512 -187813 -107315 -61675 -95217 -84688 -49743 -39533 -46340 -35791 -68303 -113617 -110179 -158282
11500 -158282 -101129 816 17173 -16542 -35450 -37095 -12271 -54996 -40197 -37651 -16301 45177
11488 45177 -1847 -54899 -126021 -154642 -81820 -93634 -125214 -125202 -120884 38420 107169 128370
11476 128370 157222 102313 7468 -42470 -40278 73528 53035 -84866 -65261 -27352 -756
11465 -756 -72829 -86688 -115606 -152803 -139874 -160210 -108050 -127053 -92679 -62922 -76663 -158294
11453 -158294 -132159 -75493 -21585 -68202 -30129 -120277 -132552 -44014 54933 62929 -28561 -134307
11441 -134307 -118189 -78848 -107372 -61752 -68812 55160 118058 51702 16051 32940 -25276
11430 -25276 -146909 -78497 -55079 31847 32352 69447 -40019 47337 70995 -5085 -45984 -109473
11418a09473j5836n3j46019j7990J60500N1041N3800O0541l8508o980L1656p8471
11406e5792O0281J6764k2661j5946k5383p9134j03139K9547J36700O7284j1282
11395b761m2523M456o9561m3291n408L0150L1313N0400L2876k7086o3565k2070
11383a27070l9180K4344N8655M2586k1842l7209M7927O4993O4409J09222o2825
11372A24010j378l0163l2038M2487J47953R9796J07971J45252j2275j26800k03276
11361B61539j45668j35787j18738N4037Q2492M7100o4747m8358K0990L7122q219
11350a8237k0315M048K5167k1137K3047N8005n4817p4202r1494J7142l0272N9524
11338a23541J9288k6889p6284L4982L7049J20170J21868P628m0470j78103j32245
$$ plain form
11418 -109473 -125309 -125362 -271381 -289371 -128871 -77830 -24030 36511 -1997 -8977 22679 -55792
11406 -55792 4489 21253 -1408 -17354 -42737 -121871 -225010 -195463 -58763 8521 -2761
11395 -2761 -45284 -40828 -110389 -153680 -159088 -128938 -97625 -47225 -14349 -41435 -105000 -127070
11383 -127070 -166250 -141906 -83251 -40665 -62507 -99716 -51789 13204 77613 186835 124010
11372 124010 122632 92469 60431 102918 250871 350667 458638 603890 591615 464815 261539
11361 261539 115871 -19916 -138654 -84617 -2125 44975 -19772 -68130 -47140 -10018 -18237
11350 -18237 -38552 -34504 -9337 -30474 -7427 50578 -4239 -78441 -169935 -152793 -183065 -123541
11338 -123541 -104253 -131142 -207426 -172444 -135395 -15225 106643 114271 73801 -104302 -236547
11327b36547J20450J15975n7348l7686R9516Q0047N5802p7874q229J063n5021
11316A48q8165p8799l5230q3134J23285J14414m5873j04361j07068Q4638J08435
11305a11710L988J01173R5845L0149j3194j71821m4783j8461N0011j041O9967
11294i877K8734L6043P2058j1426p1129k5297N1221j5169l6255j9925o2696R4970
11282C1252J01720j34806r3240O3807Q4315k3326q751r3010j36074K2314J25766
11271f0033O6467K8121Q9993J46145R8890J3763n1904N970J4602N7218J0881p6902
11259C43211k6146o0002j42536N0902K753j09870k5388N925l6583L4374R9659
11248A36299N8302j2725p8996p5770j1907P3056L2209J5802q9718n8611q9406
$$ plain form
11327 -236547 -116097 -122 -57470 -95156 4360 84407 140209 62335 54106 55169 148
11316 148 -88017 -166816 -202046 -285180 -161895 -47481 -93354 -197715 -304783 -220145 -111710
11305 -111710 -107722 -6549 89296 119445 106251 -65570 -110353 -128814 -78803 -79844 -9877
11294 -9877 18857 54900 126958 115532 44403 19106 70327 55158 18903 -1022 -63718 31252
11282 31252 132972 -1834 -95074 -31267 53048 29722 20971 -72039 -208113 -185799 -60033
11271 -60033 6434 34555 124548 270693 369583 383346 331442 337412 352014 409232 420113 343211
11259 343211 317065 257063 114527 165429 168182 58312 32924 38849 2266 36640 136299
11248 136299 194601 181876 102880 27110 15203 88259 120468 136270 46552 -12059 -101465
11237a01465J548K4660L4137N3470M510Q214N9795m9958l6529K2927L7713O4400
11225A23422k4862k7307M5545m1402k7927l2876r2565r332o9254n4369k9363M6813
11213a93477J26681K0103m6747n0958O6446N4959p5900k2091n709j1587O2966
11202g5314r9203J47676P0161p9297R5236J27479l7364j05047j2391o2049q210
11191c8323J5976o7306j80218k5722M7635Q5131K4430Q5848K5634o0874j5182
11180a02971N7515J57252J11088k7124j23494m8414m1697j19778m495N3414n8789
11169a47493j4998J6455R8333P1427L4282m7302q087O0266n0685j501L0047k1532
11157A9212j08806k5813M4150J5377Q7027j0724j08505M9710j0467J15226R7008
$$ plain form
11237 -101465 -99917 -75257 -41120 12350 16860 25074 84869 34911 -1618 21309 59022 123422
11225 123422 98560 71253 116798 75396 47469 14593 -77972 -87304 -156558 -210927 -240290 -193477
11213 -193477 -66796 -46693 -93440 -144398 -77952 -22993 -98893 -120984 -126693 -138280 -75314
11202 -75314 -174517 -26841 43320 -35977 59259 186738 149374 44327 31936 -30113 -38323
11191 -38323 -22347 -89653 -269871 -295593 -247958 -162827 -138397 -52549 -26915 -87789 -102971
11180 -102971 -45456 111796 222884 195760 72266 23852 -17845 -137623 -142118 -88704 -147493
11169 -147493 -162491 -146036 -47703 23724 58006 10704 2617 62883 12198 10697 40744 19212
11157 19212 -89594 -115407 -71257 -55880 31147 20423 -88082 -38372 -48839 66387 163395
11146A63395k3202M7q8810n7296p2276O1694R1667q8645n9427K1279P4667O4486
11134H7579n9600p6814p94j0448L3265o1890k4341Q8128K4657j1853J7091l0803
11122b5823j08040J52098L1027j60279M5481P0676O9091P1598j00267o5996L3061
11111A2627L8256j7850j6579R8665M5446j20625m5949o1374n6157J3898R469R3859
11099f314R3509M5979l721n5032m4720M6699m5472l0022k8251m3956o0931R1543
11087d0689J47607q2449j55141J14326J12308l1424n9028k903n5671j370q1185
11076a35619k4151P8276l7043L3518J42830R4679m2912n2496l3217p1443N0556
11065B978J8090j5748J7215J00786K6207j52537J2985l8501p7325k0723m0390
$$ plain form
11146 163395 140193 140240 51430 -5866 -78142 -16448 75219 -13426 -72853 -51574 23093 87579
11134 87579 27979 -48835 -49629 -60077 -26812 -88702 -113043 -24915 -258 -12111 4980 -25823
11122 -25823 -133863 18235 49262 -111017 -65536 5140 74231 145829 45562 -20434 12627
11111 12627 50883 33033 16454 115119 160565 39940 -6009 -67383 -123540 -109642 -100173 -6314
11099 -6314 87195 133174 129453 74421 29701 76400 30928 906 -27345 -71301 -132232 -40689
11087 -40689 106918 24469 -130672 -16346 95962 64538 5510 2607 -53064 -54434 -135619
11076 -135619 -159770 -81494 -118537 -85019 57811 152490 109578 57082 23865 -47578 2978
11065 2978 21068 5320 22535 123321 149528 -3009 9976 -28525 -105850 -126573 -166963
11054a66963l1338M3007O4266L8325Q1268M1901p7141K6357J53513j2505m4435
11043A16255m9997j65594o0139J93946K02898j543p9642K0139M9535k8199r1357
11032A06302j01652N1872M1648m6122M5999K053k2684o7762q2525M1547l0209
11021f1533M8538R7945L8261L4792k4412j49716O3888j7824m7486J1523K1789
11010A5765N3935k1290n3539o399K0730L0487M9168m4025N2832N7348k4975P2909
10998B02946M2309q7029j39214k335L6306L3123j6027l1887l8279m2056p7809
10987a19952l5949M0272L9782O2008M994K2789n0790p7963J10018O762l4086n825
10975c7940l3210J3056k9865J3087J0657q5116j4157l6002L6305O8541m520j9005
$$ plain form
11054 -166963 -198301 -155294 -91028 -52703 28565 70466 -6675 19682 173195 160690 116255
11043 116255 66258 -99336 -159475 34471 237369 235826 156184 176323 225858 197659 106302
11032 106302 4650 56522 98170 52048 98047 100100 77416 9654 -72871 -31324 -61533
11021 -61533 -12995 84950 123211 158003 133591 -16125 47763 29939 -17547 -6024 15765
11010 15765 69700 48410 -5129 -11528 9202 39689 88857 44832 97664 155012 130037 202946
10998 202946 245255 158226 19012 16677 52983 86106 70079 38192 -87 -42143 -119952
10987 -119952 -155901 -115629 -75847 -13839 -8845 13944 -36846 -114809 -4791 1971 -32115 -37940
10975 -37940 -71150 -58094 -87959 -74872 -64215 -149331 -163488 -199490 -163185 -94644 -99164 -118169
10963a18169N2867K8078n5375L7884O4288l6162j09707M4453J07850l7648l3753
10952e5394q589K2329M910n9992J23305j9451Q629o6566n2835o0126J3452J9553
10940a30775J08218N6319Q1812J19616l2166q6069o3039r1749o3886J67219m374
10929F1126m6439L9456J30418N2210M0980j7336j99271J1481n8718n6589j0328
10918e3010k4552R53J08580j8481K6597N2441l7704l4771k9604L020J21690m74
10906A14685J8075l5792k2863j0595l0196k6826l701j06902R632P9072k4918p1937
10894a12266P5462K0881m4452q6234k0466O8954O7593j46870q951M7975O8033
10883g0341M8504O7897N600l4531o5680k762M4931K352J6038L0438m5607o5668
$$ plain form
10963 -118169 -65302 -37224 -92599 -54715 9573 -26589 -136296 -91843 16007 -21641 -55394
10952 -55394 -63983 -41654 -36744 -96736 26569 7118 15747 -50819 -103654 -163780 -150328 -130775
10940 -130775 -22557 33762 115574 235190 203024 116955 53916 -37833 -101719 65500 61126
10929 61126 14687 54143 184561 236771 277751 260415 61144 72625 13907 -42682 -53010
10918 -53010 -77562 -76609 31971 13490 40087 92528 54824 20053 -9551 -6531 115159 114685
10906 114685 132760 96968 74105 63510 33314 6488 2787 -104115 -94483 -15411 -40329 -112266
10894 -112266 -36804 -15923 -60375 -146609 -167075 -98121 -30528 -177398 -186349 -138374 -70341
10883 -70341 -21837 46060 51660 17129 -48551 -51313 -6382 -4030 12008 42446 -3161 -68829
10871f8829J02969K116m6961k1008l0830j06893p6119J861M6545J11985Q9291
10860D127L3394p2648o757J4228p7421R2338j35j18275l6478l9889N9719O7943
10848g9854k2281N5506Q71N3378L8758q3115j10149j14244O2743N69K2194R3102
10836h2522J29722j37666r0816L6933k550p13J14883J3678j18151L0571K36304
10825A29673M6908l5840q7716O9446K1322O188k4998q6290m3996J4922r392L8207
10813C8434l5040k4504N6987j8349m9746K9113j2121m6811l3223n608J01342O2670
10801F3144r8999o7109k9654M9493R3332k215j15572k9776L8801p667Q5760L1942
10789A1480j5772P6052P2931L634p3402O061j2004n8412J1568m5079k7532Q6760
$$ plain form
10871 -68829 34140 36256 -10705 -31713 -62543 -169436 -245555 -243694 -197149 -85164 4127
10860 4127 37521 -35127 -41884 -27656 -105077 -12739 -12874 -131149 -167627 -207516 -147797 -79854
10848 -79854 -102135 -46629 -45758 7620 46378 -36737 -146886 -261130 -198387 -197818 -175624 -82522
10836 -82522 47200 -90466 -181282 -144349 -146899 -147612 -32729 -19051 -137202 -106631 129673
10825 129673 176581 140741 53025 122471 143793 149981 124983 38693 -5303 9619 227 38434
10813 38434 3394 -21110 35877 17528 -32218 -3105 -15226 -62037 -95260 -100868 474 63144
10801 63144 -35855 -102964 -132618 -83125 10207 7992 -107580 -137356 -98555 -106222 -20462 11480
10789 11480 -4292 71760 144691 148325 74923 80984 68980 10568 22136 -22943 -50475 36285
10777C6285J40095O5009r8205q4788n9191R4536N434l4769j32809j1753O0000
10766b0156R3861j7603j679L5665l3694k210L9498o8946N5602O3976q6749l6542
10754B1023L3669j12980j07825m5731Q0153J5883Q3448P3089K7966q1592p4509
10743h7406q4869N5693P8481l0704l6779J45167J04887K5610K4834j5282l9132
10732A40500m5262n1242J6400N0291k6385o2111L9931k5456k0783q5491p3340
10721a42948L7221K4775j902N3458l1066k2383R6203J6003p6092m5630P6102M0184
10709B3925M0668j6243K6964M3853j14661r0960J24002R9877l061p3911r4552
10698c4099k7446R9620N698K8555J06693J1434m7835q4951Qq01K6755p8402m0779
$$ plain form
10777 36285 176380 241389 143184 58396 -795 93741 99175 64406 -68403 -80156 -20156
10766 -20156 73705 56102 54423 90088 56394 54184 93682 24736 80338 144314 57565 21023
10754 21023 54692 -58288 -166113 -211844 -131691 -115808 -32360 40729 68695 -12897 -87406
10743 -87406 -172275 -116582 -38101 -68805 -105584 39583 144470 170080 194914 179632 140500
10732 140500 95238 43996 60396 110687 84302 22191 62122 36666 15883 -69608 -142948
10721 -142948 -105727 -80952 -82854 -29396 -60462 -82845 13358 29361 -46731 -92361 -16259 23925
10709 23925 64593 48350 75314 119167 4506 -86454 37548 137425 134364 60453 -34099
10698 -34099 -61545 38075 43773 72328 179021 190455 142620 57669 57677 56876 83631 5229 -35550
10685c5550K261p896m0646M6637P3780q3113j14468K7993O7353l2973J23497L624
10673C0499R884n3483L25j6767Q5695O4745L2662j6312k662j35775q5362J24537
10661C7986L1123L7686J290k3277J644j5253j52110m6262J30175J08318l5050
10650G6270n2927Q922m986r8802k1546p3525P8656R5408L1436L8321L4071N3896
10638A65194k2779j20325p5027O9125o1351O5222L9938j09851l5283m6553J04985
10627b6705l674J3581P8477M8126J0892n5709j31249N5849P3839O530l0313j9582
10615B0062Q3290j32005j33282k8585j2329J7882J25064l5188J38860J3932j62621
10604a04920M5645K9020P4063Q3939R6714J4390m0099o1071M123j3483l3565n8788
$$ plain form
10685 -35550 -33289 -41185 -81831 -35194 38586 -44527 -158995 -131002 -63649 -96622 26875 30499
10673 30499 40383 -13100 -12775 -29542 56153 120898 153560 137248 134586 -1189 -86551 37986
10661 37986 69109 106795 108085 84808 86452 71199 -80911 -127173 3002 111320 76270
10650 76270 23343 32265 27279 -71523 -93069 -166594 -87938 7470 38906 77227 111298 165194
10638 165194 142415 22090 -52937 16188 -45163 20059 59997 -49854 -85137 -131690 -26705
10627 -26705 -30379 -16798 61679 109805 120697 64988 -66261 -10412 63427 69957 39644 20062
10615 20062 103352 -28653 -161935 -190520 -202849 -184967 -59903 -95091 43769 57701 -104920
10604 -104920 -59275 -30255 43808 127747 224461 238851 198752 137681 141804 128321 94756 35968
10592C5968M4948K6964p9580N2656k7912o8202J7457P3743l9407m0021p905M0870
10580B9579R872l5635o4544m1277p1663j5950O5030J82472L4680l8701K367o6487
10568a0257L7032O7253N1364k0978l2803j7977J2818j8191j099r1445K8652L1425
10556C5794J05970k2398O1344k4337j34659j1713R0981N5453J1948q0424o8075
10545A9884n4164L6712J04744o2137o753q3725Q4001O6588r0889O1082N7991q673
10533A24661O8671o0073j56863j22073p8820J8539J38280N5631k8917M072j012
10522c7904P9870J10646m0351K4660R6608n4837J1610L3856m6221j47968l6346
10511f377P1189N6045J23886K5298l4501j02098q1238k9774j2219j0950J43196
$$ plain form
10592 35968 80916 107880 28300 80956 53044 -15158 2299 76042 36635 -3386 -11291 29579
10580 29579 39451 3816 -60728 -102005 -173668 -189618 -124588 57884 92564 53863 56230 -10257
10568 -10257 26775 94028 145392 124414 91611 73634 86452 68261 67162 -24283 4369 35794
10556 35794 141764 119366 180710 156373 21714 10001 100982 156435 168383 87959 19884
10545 19884 -34280 2432 107176 45039 38286 -45439 38562 105150 14261 75343 133334 124661
10533 124661 193332 133259 -23604 -145677 -224497 -205958 -67678 -12047 -40964 -36892 -37904
10522 -37904 41966 152612 112261 136921 233529 178692 190302 224158 177937 29969 -6377
10511 -6377 64812 120857 244743 270041 235540 133442 52204 22430 10211 -739 142457
10500A42457K4351j63035j46995K2933J01893R4024k5839j85161r7962N4892R8889
10489g9553O9353O3524k2169K8164N2630p095o4284n4031J283l0710L5981R9596
10477I2689R6470p1114q8415M4704O8085k4774j01211K3974o6386K7261P0962
10466G2245j7851q8498L2088O3426O4229p4591L1298r0630K4830P4910L2945O9517
10454A93918L6207P3757j7753j15703n3415m5776O7105P6807j33411q0355L9547
10443D0928K5144M3026n4952k9196N8695O7053k3191N6451R914R848r6491q5281
10431B1948M4504M8263j3094r3883P3467k1675j31706Q050J15276j2549o5579
10420b6978J7474J2206k6165p997J06841n592n7583n7155L9452N9399J9078K7638
$$ plain form
10500 142457 166808 3773 -143222 -120289 -18396 75628 49789 -135372 -233334 -178442 -79553
10489 -79553 -10200 53324 31155 59319 111949 104854 40570 -13461 -12178 -42888 -6907 92689
10477 92689 189159 118045 29630 74334 142419 117645 16434 40408 -25978 1283 72245
10466 72245 54394 -34104 -2016 61410 125639 51048 82346 -8284 16546 91456 124401 193918
10454 193918 230125 303882 286129 170426 117011 71235 138340 215147 81736 1381 40928
10443 40928 66072 109098 54146 24950 83645 150698 127507 183958 193872 203720 107229 21948
10431 21948 66452 114715 101621 7738 81205 59530 -72176 -64126 51150 38601 -26978
10420 -26978 -9504 2702 -23463 -31460 75381 69789 12206 -44949 -5497 53902 72980 100618
10408A00618n7414j9076Q325P0266P6655o9117j44335m4887l6446j1741J21242
10397e910P4986j2493l9811m3849O2053k9246l3194R6335M8626p7342r3630q7932
10385a41407J5033J25265J31828O3060l6429n8833N4012j45544j09005l0845J3023
10374a19842Q9222M798J2008O4580n0578k7459k0108m7906R8445J21885J13453
10363B38498o1214J730O5242j24407j1202O8466K8682o3169L3402n239q461m9321
10351A13007l3735k4757o4054l6518j53031m5717J32939L8631J8191J27023J7763
10340H9742j5416K8135j6412j5493P7185O9882r6843L3279J6981K9393L9514K4378
10328B64325m9324P547j15250k6660O3229N1944L4136l0606N1961n1809k7186
$$ plain form
10408 100618 43204 24128 32453 102719 179374 110257 -34078 -78965 -115411 -127152 -5910
10397 -5910 69076 56583 16772 -27077 34976 5730 -27464 68871 117497 40155 -53475 -141407
10385 -141407 -126374 -1109 130719 193779 157350 98517 152529 6985 -102020 -132865 -119842
10374 -119842 -30620 -25822 -13814 50766 188 -27271 -47379 -95285 3160 125045 238498
10363 238498 177284 179014 244256 119849 108647 177113 205795 142626 176028 170789 162328 113007
10351 113007 79272 54515 -9539 -46057 -199088 -244805 -111866 -73235 -55044 71979 89742
10340 89742 74326 102461 86049 70556 147741 217623 120780 154059 171040 200433 239947 264325
10328 264325 215001 222548 107298 80638 143867 195811 229947 199341 251302 199493 172307
10317A72307j6317q5185n1638K0688P9549K707M7713M2710J05642n76K4313j3829
10305C28084p3049J3385j8464j08681L0490n4648J2769L0244L016q048J25782
10294B80880O8601L8844Q6360J21319J19822k8834k3267J10173J37614N7792l2445
10283I36859j71195j55142j83215l1812N3477r527L4395m1666l2285j5520k3501
10272C60868K4723l7744j0030J06813J72521n4549j10691p2086k7255m0815m792
10261C06963l8852k5489N7845L7556M84m2966R834O9774L8647K5745J25088J04770
10249F69399J29281J21339J00729J88680J86744J22634p5056j67141j17096p5216
10239A084297k41723k53304k0174p9571r8919p016J5869K2305k7917O1544l93
$$ plain form
10317 172307 155990 70805 19167 39855 119404 122111 169824 212534 318176 317600 341913 328084
10305 328084 255035 268420 249956 141275 171765 117117 129886 160130 163146 155098 280880
10294 280880 349481 388325 474685 596004 715826 686992 663725 773898 911512 969304 936859
10283 936859 765664 610522 427307 395495 448972 439445 473840 432174 399889 384369 360868
10272 360868 385591 347847 337817 444630 617151 562602 451911 379825 352570 311755 306963
10261 306963 268111 242622 300467 338023 338507 295541 305375 375149 413796 439541 564629 669399
10249 669399 798680 920019 1020748 1209428 1396172 1518806 1443750 1276609 1159513 1084297
10239 1084297 842574 589270 569096 489525 390606 383590 399459 421764 393847 455391 454998
10228D54998K9772J07170o7063j29668M121N5640k9505r3008J02514J04204j9764
10217E19411m8810m394P4446r6726j18047k3286m3319k2032l1710P0840J56497
10206D32870R0819K20683J54534R7618J87524K3358P682j23346k08940j13403
10196G69399k44762p6754m367l8735m2120Q1057J2564j2937j05889M3117l8614
10185C41959m0206N4370j893m8074P248Q5834L8410J2874m084j00203n42J6912
10173C62605m5548j9350N6806O2383j31991n9830J3014Q0326P4039j02006L960
10162B94408K3984J15171n9316L4319J42992J58949k2517q3981j22519r1705K6997
10151D16782n5173p0588M1848P794N1983R6242k9576j13555n6322J7156L5794
$$ plain form
10228 454998 484770 591940 524877 395209 399330 454970 425465 332457 434971 539175 519411
10217 519411 470601 466207 540653 443927 325880 302594 259275 237243 205533 276373 432870
10206 432870 523689 744372 898906 996524 1184048 1207406 1215088 1091742 882802 769399
10196 769399 524637 447883 443516 404781 362661 443718 456282 443345 337456 380573 341959
10185 341959 301753 356123 354230 306156 313404 399238 437648 450522 446438 346235 345693 362605
10173 362605 317057 297707 354513 416896 284905 225075 238089 318415 392454 290448 294408
10162 294408 318392 433563 374247 408566 551558 710507 687990 604009 481490 389785 416782
10151 416782 361609 291021 332869 340663 392646 488888 459312 345757 289435 306591 342385
10140C42385q1834o7257l8926j3238j439N5525O3291J86518n2181o5110J8959
10129C46693m5712O2947L0088L4857p0353K0638L6956K8161m2205j9573P8407
10118D60904J9791o5324o352K6105N0500J4871J1227L4608k8521m9317n5128k8354
10106C85010K5531m3053r998l8720j32913J00571J37232p5566j66867K7997J56958
10095C66182K8815m7373m1100j5740n9646J3705J18421r092r0017n2738R1575
10084C02992Q2275J8324P462K4627N3789k7063n914p734J9691o3103Q6308K2339
10072E13993o8363N1655j1380N3436O0019K0028K9449K8612J20647r4542M5254
10061G48808O8550J6615k1350J14323L7107L06913L40181M64791Q69236J802451
$$ plain form
10140 342385 260551 193294 154368 141130 139691 195216 258507 445025 392844 327734 346693
10129 346693 300981 363928 394016 428873 358520 379158 416114 444275 402070 382497 460904
10118 460904 480695 415371 409019 435124 485624 500495 511722 546330 517809 468492 413364 385010
10106 385010 410541 367488 357490 318770 185857 286428 423660 348094 181227 209224 366182
10095 366182 394997 347624 306524 290784 231138 244843 363264 354172 264155 211417 302992
10084 302992 385267 403591 411053 435680 489469 462406 456492 448758 468449 405346 491654 513993
10072 513993 445630 497285 485905 539341 599360 619388 648837 677449 798096 703554 748808
10061 748808 817358 833973 812623 926946 964053 1270966 1611147 2075938 2945174 4747625
10051D747625L567356O127831L460273P6835l973295n301592k961914j540116
10043D203003q79033p49548n78161k79913k34120l18780j94523n1662K4184Q159
10033I49606O9707r5761j68205j51240q5024K1991L4748m797n8140o7219q223
10022D37443J08883K874j07483j32214j14022O1209L670l3657K4523L5852J21936
10011D09014K3680j1804J9179k4215j8118J10850p331M9882j04182k6716J1061
10000D31300R7589Q66L7836j14192n205J42014j4024N0198r1580j05837r7784
9989C31181M3280Q9841q2617j5411K8700J6671k667J3517l6190M0161N6708N4121
9977E37295m1079R498R5J931Q344j01573J6841Q2300O281n6281Q8200J73676N4410
$$ plain form
10051 4747625 8314981 14442812 17903085 17979920 14006625 8705033 5743119 4203003
10043 4203003 3323970 2574422 1996261 1716348 1482228 1163448 968925 917263 941447 949606
10033 949606 1019313 923552 755347 604107 519083 541074 575822 571025 512885 445666 437443
10022 437443 546326 549200 441717 309503 195481 256690 260360 226703 251226 287078 409014
10011 409014 432694 420890 440069 415854 397736 508586 501255 551137 446955 420239 431300
10000 431300 528889 529755 567591 453399 448194 590208 576184 626382 534802 428965 331181
9989 331181 374461 464302 381685 366274 394974 411645 408978 422495 386305 426466 483174 537295
9977 537295 496216 505714 505809 507740 516084 414511 431352 513652 519933 463652 551852 725528 779938
9964G79938L9335k246p1488m7504J9941J33982J0622k7941J5690P9865K21136
9953A151330M0519J2997P1753J38278M8908O1885J50763L07705K54093K27272
9943B465503J19161J8403o4131J57055J97050K40418K70943K70846J33161l2658
9933C775751q7931j04482J5284m9754o5590j90545p3558r2375n4172l3905r9224
9922B939499r956M5574J7271P9592J68442M27200P97543R19061R67105J142653
9912G493984J040678P22576K85480m1173k74499m03801l90576m35389m73883l47355
9902G176042m73609l77941l72258j67948q9692j65586l58898j15125O5223J93099
9892E313307L51042M10673M16386M28926O68351P82812O14575P47324R32632J072020
$$ plain form
9964 779938 819273 817027 745539 698035 717976 851958 862580 834639 850329 930194 1151330
9953 1151330 1191849 1204846 1276599 1414877 1463785 1525670 1676433 1984138 2238231 2465503
9943 2465503 2584664 2603067 2538936 2695991 2893041 3133459 3404402 3675248 3808409 3775751
9933 3775751 3687820 3583338 3598622 3548868 3483278 3292733 3219175 3126800 3072628 3038723 2939499
9922 2939499 2929543 2975117 2992388 3071980 3240422 3667622 4465165 5384226 6351331 7493984
9912 7493984 8534662 9257238 9542718 9501545 9227046 8823245 8432669 7997280 7523397 7176042
9902 7176042 6702433 6324492 5952234 5784286 5694594 5529008 5170110 5054985 5120208 5313307
9892 5313307 5664349 6075022 6491408 6920334 7588685 8371497 8986072 9733396 10666028 11738048
9882A1738048J196288J463577K072531K924329M230820O160980Q460699J1709886
9874D9957158J6171220K0518648K0183061J1666470j378197j3015855j7769706
9867H6332799j5946316j2502644r225919o431549m180699k239507o11031J027825
9859C6222959K671863M786979P189135Q616546Q861420Q322121O737204M920726
9851H8328953L275388K237750K031213J702179O11734r04050k459870m222631
9843I0600666n602327o047886n361386m224088l080328j829569J41690L399199
9835F7995971Q178064J4893095K3858614L5127136M8431782N5286003M0941486
9828B94712151Q776655k5649361m7143722m7606566l8496093k8855001k0425225
$$ plain form
9882 11738048 12934336 14397913 16470444 19394773 23625593 29786573 38247272 49957158
9874 49957158 66128378 86647026 106830087 118496557 117118360 104102505 86332799
9867 86332799 70386483 57883839 48657920 42226371 38045672 35806165 35195134 36222959
9859 36222959 38894822 43681801 50870936 59487482 68348902 76671023 83408227 88328953
9851 88328953 91604341 93842091 95873304 97575483 98187217 97283167 94823297 90600666
9843 90600666 84998339 78950453 73589067 69364979 66284651 64455082 64596772 67995971
9835 67995971 76174035 91067130 114925744 150052880 198484662 253770665 294712151
9828 294712151 303488806 277839445 230695723 183089157 144593064 115738063 95312838
9821I5312838j3734723q544573m470694j171115J408370L035683M025396M794571
9813H0655753M680432M326157L834431K802981J122694m84800r29653p81459j185965
9804I4040571k900330n974243q877283j0326286r888049q063697n928065m212038
9796C7870580k740097j292228J63065J789160L854728O359575R773752J3934230
9788F9712765J7574701J6844905Q770970l202730j3733966j8110197j6567294
9781F1289154j3183312r834075p495142n485202m059108l109911k300853j760943
9773A4060608j321661j100676r62621q76777p21408p81609p98029o31431o05944
9764F260452m26015l45913j83126K8290O6873m2943J11254J29472J36053J03700
$$ plain form
9821 95312838 81578115 73033542 68562848 67391733 68800103 71835786 75861182 80655753
9813 80655753 85336185 89662342 93496773 96299754 97422448 96937648 96007995 95226536 94040571
9804 94040571 91140241 85165998 76288715 65962429 56074380 48010683 42082618 37870580
9796 37870580 35130483 33838255 34001320 35790480 39645208 46004783 55778535 69712765
9788 69712765 87287466 104132371 112903341 109700611 95966645 77856448 61289154
9781 61289154 48105842 38271767 30776625 25291423 21232315 18122404 15821551 14060608
9773 14060608 12738947 11638271 10675650 9798873 9077465 8295856 7497827 6866396 6260452
9764 6260452 5834437 5488524 5305398 5333688 5400561 5357618 5468872 5598344 5734397 5838097
9754E838097J83023L77526N23578O74811O72559M47373L81265P4781l80712p12057
9744H080244q77905q77747r32594p98812n69968n69313l88027k35566k09766o2683
9734B557863q7645j4710j0407N4128Q3925J35190O5871J47680P3298k3901p701
9723B973591l58j14412j02013j43993j58920n4307k5890j16248k8606j7698j36536
9712B074610j37417l18099k61465r7263m2553j72435k43411j31938j47222r513
9702E13294R7137l4529N0572J10254o6312j73331j57336p1103j3935J00976Q8278
9691D43965k6706r2576r5424O774J32804l0607j70720j19937p3557q8815R0161
9680b4638J35013N7673J12133r517m7943M8147o6822n4681q414j5245M312Q0146
$$ plain form
9754 5838097 6021120 6398646 6922224 7597035 8269594 8716967 9098232 9173013 8792301 8080244
9744 8080244 7202339 6324592 5391998 4593186 4023218 3453905 3065878 2830312 2620546 2557863
9734 2557863 2470218 2455508 2445101 2499229 2583154 2718344 2784215 2931895 3005193 2981292 2973591
9723 2973591 2973233 2858821 2756808 2612815 2453895 2399588 2373698 2257450 2228844 2211146 2074610
9712 2074610 1937193 1619094 1357629 1260366 1217813 1045378 801967 670029 522807 513294
9702 513294 610431 575902 626474 736728 670416 497085 339749 268646 254711 355687 443965
9691 443965 417259 324683 229259 236033 368837 338230 167510 47573 -25984 -114799 -24638
9680 -24638 110375 168048 280181 270664 222721 270868 204046 149365 140951 125706 130018 210164
9668B10164p215n056r7611l9113j9726l7695k823J09983J3685L104M9910M9667
9656B27274J2415l4429J27021N3797l9661j02307K4743L5016o9279k306j1490
9645B20794L2775M1407j30356j8171J06233K3941O4627j50364r0605m3875p2458
9634a6052N0416K5226l5822m8177r7551n0420N8066J36165P2989o5449n8530R1812
9622F2673k7131r9855n3018K111j2597J2903K0033o10P7817P9038r3025l4672
9610f6333J39435P8331j3274j18530r4490o6245J1210N361N638O9003M6579K2107
9598A8792P2603N5510j45162j31469J6952M5972q4446k4919J12916N318q8706
9587a46639n9067K1568N4300m2905K5962M7069m5177l0395P1834Q1355j1128l1136
$$ plain form
9668 210164 202949 197893 100282 61169 41443 3748 925 110908 124593 127697 177607 227274
9656 227274 239689 205260 332281 386078 346417 244110 268853 303869 234590 232284 220794
9645 220794 253569 294976 164620 146449 252682 276623 341250 190886 100281 56406 -16052
9634 -16052 34364 59590 23768 -24409 -121960 -172380 -114314 21851 94840 29391 -29139 62673
9622 62673 35542 -64313 -117331 -115220 -127817 -114914 -94881 -95491 -17674 61364 -31661 -66333
9610 -66333 73102 151433 138159 19629 -74861 -141106 -129896 -124535 -118897 -49894 -3315 18792
9598 18792 91395 146905 1743 -129726 -112774 -66802 -151248 -176167 -63251 -57933 -146639
9587 -146639 -205706 -184138 -129838 -172743 -146781 -99712 -144889 -175284 -103450 -22095 -33223 -64359
9575f4359L5292J3107j60068l1385J8495o6003M0262K0433k8580j00602k8650
9564c52058M7088L6515l680O5062P6087N2351N6774k3902L4924K5966r6241q8204
9552a69318M7326J2019Q6331K5828k09086p1043K8319P1287L7016K2820J7083
9541a01418m3459O920N369j03814o5709O2718N5652l9193O7239J4228R408o9227
9529b01286N4299J06926Q4573M9857o7694k3632J11941K2463j47108q9020q714
9518a07395L072m3318k037N7665k4942j2432q67K325o0422L8098Q7264l1504r8787
9505a93280j29530J53352j2007R6482J9888J8200n0057J5095L7148O3079J50555
9494A68925j7430K0697p8240m1953l6930j6895m4196l0697N5321M1574m5860q0218
$$ plain form
9575 -64359 -29067 -15960 -176028 -207413 -188918 -254921 -214659 -194226 -222806 -323408 -352058
9564 -352058 -304970 -268455 -272135 -207073 -130986 -78635 -21861 -45763 -10839 15127 -81114 -169318
9552 -169318 -121992 -109973 -23642 2186 -206900 -277943 -249624 -178337 -141321 -118501 -101418
9541 -101418 -144877 -137957 -132588 -236402 -302111 -239393 -183741 -222934 -155695 -141467 -132059 -201286
9529 -201286 -146987 -40061 44512 94369 26675 3043 114984 137447 -9661 -98681 -107395
9518 -107395 -104323 -147641 -149678 -92013 -116955 -129387 -130254 -127929 -188351 -150253 -62989 -94493 -193280
9505 -193280 -322810 -169458 -181465 -84983 -65095 -46895 -96952 -81857 -44709 18370 168925
9494 168925 151495 172192 93952 51999 15069 -1826 -46022 -76719 -21398 20176 -25684 -105902
9482a05902J1191N4475J9675j2891m5719o9369k6552N7552K0747j4180l698Q4087
9470c0584r6876l7589J01678L1771j23251Q170L4083K2778K5966M2875J0604J5679
9458E304O5013J12791K4503j5279J54910K84324K05445L4712J10453L0101l9782
9447I72495r3102j98082k09038r1703q2790o2695j09239j60182O1817K0418p1353
9436b3454J7566M8915l8156K2126R5853k9742j6312l132j0482l5782J5847K2467
9424F5714R2458J8854r6004j12123K0583j6196l0983J83020J14128K4211O1665
9413C25327J32535J0447O1468J40770J55490J47795J49655k091o1371m530r0228
9402I65267k04543j15371j16381j10827q4876J9268q2251l6490n9327P1831M9715
$$ plain form
9482 -105902 -94711 -40236 -20561 -33452 -79171 -148540 -175092 -117540 -96793 -110973 -114671 -30584
9470 -30584 -127460 -165049 -63371 -31600 -154851 -146681 -112598 -89820 -63854 -20979 -10375 5304
9458 5304 70317 183108 207611 192332 347242 631566 837011 871723 982176 1012277 972495
9447 972495 879393 681311 472273 380570 297780 235085 125846 -34336 27481 47899 -23454
9436 -23454 -5888 43027 4871 26997 122850 93108 76796 73664 63182 27400 43247 65714
9424 65714 158172 177026 81022 -31101 -10518 -26714 -57697 125323 239451 263662 325327
9413 325327 457862 468309 529777 670547 826037 973832 1123487 1121396 1060025 1055495 965267
9402 965267 760724 645353 528972 418145 333269 352537 270286 233796 174469 246300 296015
9391B96015p6249q8234j70901l8552J27537M5137n7146O5678n2619o2871K4689
9380A2484J8825K8172l9365k7919j2556M2757N3913M4885Q8324m1093J3839j20
9368A82146J40429J22331J57705J34254p5246n1120P5821K9149j55792j31411
9358D28266q8112j12107o8226q2000q8659N5250M7061m5672L446P4841m413o5192
9346E4483p9256p583M4083k2248n1433m9106J06R0025k2820n2368K232P6893J7019
9333B7j58530j4688J19773Q2894N574P3929q8536l5302Q5990Q1486M9140N6461
9321B58218P9616j2464Q214M9929p8822q7739j85860p8271m5605P714K0905O9128
9309D963O3415m2437J5422K8451m6402j07729J291P2936j9722o6840p8935M2794
$$ plain form
9391 296015 219766 131532 -39369 -77921 49616 94753 37607 103285 50666 -12205 12484
9380 12484 31309 59481 20116 -7803 -20359 22398 76311 121196 209520 168427 182266 182146
9368 182146 322575 444906 602611 736865 661619 610499 686320 715469 559677 428266
9358 428266 340154 228047 159821 77821 -10838 44412 91473 45801 49247 124088 119675 54483
9346 54483 -24773 -32356 11727 -10521 -61954 -111060 -110954 -20929 -43749 -96117 -93885 -16992 27
9333 27 -158503 -173191 -53418 29476 35050 108979 20443 -14859 71131 152617 201757 258218
9321 258218 337834 325370 333584 383513 304691 216952 31092 -47179 -92784 -85070 -64165 4963
9309 4963 68378 25941 41363 69814 23412 -84317 -83026 -10090 -29812 -96652 -175587 -132793
9297a32793M8894J7070R0095K8982j06535N2100m7952L8699L9468o1642l8632
9286g2246p7846k4360P2818J26198Q6826l3038k51572l1373L1917P0222N3290
9275d9164P9076p3927l3238J44221N4584n4247o5800J6872J77507k2606j20995
9264E2283l2497M0963M868j12455k1139R336m582J24556p8685n3366L6450N4999
9252B0731K6839j8685j9443j6689j9442l7207M0396J39723M187K1334n8875p1437
9240A1432J5330o1749L4501O3359M4563j2477q5395Q129N1674k1152l3684N7778
9228G2309j6436l5274N282o5460m7021R5792R9049M7686M5530j6457o1751o8097
9216E5152J11171P488o2393q5053K1644L2190N6110N5388q0745l3199N32n6462
$$ plain form
9297 -132793 -83899 -66829 23266 52248 -54287 -2187 -50139 -11440 28028 -33614 -72246
9286 -72246 -150092 -174452 -101634 24564 111390 78352 -173220 -204593 -172676 -102454 -49164
9275 -49164 29912 -44015 -77253 66968 121552 67305 1505 18377 195884 173278 52283
9264 52283 19786 60749 65617 -46838 -67977 -58641 -63223 61333 -17352 -70718 -34268 20731
9252 20731 47570 28885 9442 -7247 -26689 -63896 -23500 116223 120410 141744 82869 11432
9240 11432 26762 -34987 -486 62873 107436 94959 9564 17693 69367 48215 14531 72309
9228 72309 55873 20599 25881 -39579 -86600 9192 108241 155927 201457 185000 123249 55152
9216 55152 166323 173811 111418 26365 48009 80199 136309 191697 110952 77753 78285 21823
9204B1823Q28N9400K1459J544q985K1206J6364J2230p7762r3896L4619L1561J1443
9191E1834P1077n7757k6492K1419j2311M2013N3929n1823p2007P1543O5871Q6869
9179B44165P1117J07613J7265j06217l2935O9444M7762k4145L2407n2121k0587
9168C53768L6908K7467K9952r1245k9792K3513N3386M4315K6875j2062L8825j0104
9156D91806p015J33438R2750q609K3833r71k5811J31547J64250J64952J12684
9145A272854J34713K54366J35587J93298J98954L52138O56848P29869P32839J237833
9135E899299J628946K134317L053298M454052N948177O032368L913701K76687
9127C3340845l493487n412271n215432m235170l242120k385353j813220j326899
$$ plain form
9204 21823 22651 82051 103510 105054 96069 117275 133639 145869 68107 -25789 8830 40391 51834
9191 51834 122911 65154 38662 60081 47770 89783 143712 91889 19882 91425 157296 244165
9179 244165 315282 422895 440160 333943 301008 370452 418214 394069 426476 374355 353768
9168 353768 390676 418143 448095 356850 327058 350571 403957 448272 475147 463085 501910 491806
9156 491806 484791 618229 710979 702370 726203 725232 699421 830968 995218 1160170 1272854
9145 1272854 1407567 1661933 1797520 1990818 2189772 2541910 3198758 3928627 4661466 5899299
9135 5899299 7528245 9662562 12715860 17169912 23118089 29150457 33064158 33340845
9127 33340845 29847358 24435087 19219655 14984485 11742365 9357012 7543792 6216893
9119F216893r71137p75720n78628n54633n10240k39786l08082k22080k14744j93418
9109A648425q9483l7849p9962k56584l41747j57969j08907N4392J9801k2725q1177
9098E46215j6898k3512P989p1237l0926O0448p2629l0777J12905J9212j47088
9087C53702j6240N3798n8141j9203m1008l2931m3615O5927n370k3379p3769k5375
9075A34396m0867J32804R8049j10347j04085j4741K9585n9098r8784p9478N7913
9064e4653L9172J155p37k6864J3996r7290k9789J82528L4924O5167j9699K7464
9052A35374p4674j61553J3689J46869m6032j2964p0812k9321l0754n7873l0677
9041b18728M4075P8768R0960N253j40415j3075L4260L9022L3638M7192k8849m2681
$$ plain form
9119 6216893 5245756 4470036 3891408 3336775 2826535 2586749 2278667 2056587 1841843 1648425
9109 1648425 1558942 1521093 1441131 1184547 842800 684831 575924 630316 650117 627392 546215
9098 546215 529317 505805 513794 442557 411631 472079 399450 368673 481578 500790 353702
9087 353702 337462 391260 333119 313916 272908 239977 196362 262289 256919 233540 159771 134396
9075 134396 93529 226333 324382 214035 109950 95209 124794 65696 -33088 -112566 -54653
9064 -54653 -15481 -14326 -15063 -41927 -27931 -125221 -155010 27518 62442 127609 107910 135374
9052 135374 60700 -100853 -87164 59705 13673 709 -70103 -99424 -130178 -188051 -218728
9041 -218728 -174653 -95885 -4925 328 -140087 -153162 -118902 -79880 -46242 950 -27899 -70580
9029g0580j25182k0355L2606O60m4616r523R4227J43144P6481q3419j1819l697
9017b2073N545J2765k09n7299q29M8004P0449J6681j10786J614L8185j9387k0818
9004c8158R3803K8487m2560n2011M1035j9305K7732p0127r1905R1808M851r4275
8992a20625P7929J94835o2819k3578k6819q5577j10171L1456K8344P6532J1513
8981h980J7366q7886K8015K4977o4931M3031P2905J6568j15282j9582Q5635O9427
8969F1263m1432o7458J5607o2219j4672j6427j1561N6062j6014M2497k0537m69
8957g5360m3212K1318R3126K4160M6227o099J9806q0764j0784n8061M3260J03957
8945G7574n0860j47033N1075O276m6468p150M4599j9611M0969N8313L2117L5017
$$ plain form
9029 -70580 -195762 -216117 -183511 -182851 -227467 -236990 -142763 381 76862 -6557 -18376 -22073
9017 -22073 -16528 -3763 -3972 -61271 -62100 -14096 56353 73034 -37752 -36138 2047 -17340 -38158
9004 -38158 55645 84132 41572 -10439 30596 11291 39023 -31104 -123009 -31201 -26350 -120625
8992 -120625 -42696 152139 89320 65742 38923 -46654 -156825 -125369 -97025 -20493 -8980
8981 -8980 8386 -79500 -51485 -26508 -91439 -48408 24497 41065 -74217 -93799 -8164 61263
8969 61263 19831 -47627 -32020 -94239 -108911 -125338 -136899 -80837 -96851 -54354 -74891 -75360
8957 -75360 -118572 -97254 -4128 20032 66259 60160 79966 -798 -11582 -69643 -26383 77574
8945 77574 26714 -120319 -69244 -62968 -109436 -116586 -71987 -91598 -50629 7684 39801 74818
8933G4818n6402q2888M325J3883R4581L8881j61837n6088j8162L9505L9701L2710
8921c6973Q4758M1974l3915m6636L8059L829L2827l5271k0588q0963L5265J6774
8909h60l1085q66l6787p5839n2749R5999R5025O712N6036M2219j9214J4284N367
8896I8242j69370L1055Q0325R996j0316j27549K4622J11093n3370l2147q8755
8885a26174O9362P2926L6829j685r8621m4471J2938p3529P0389J81548Q7965l6786
8873A50691j24345K7992K5359p218J765j08151j12916L5649L3275O5324O8292
8862E5717R0912Q0438J04993P1749j665m2853m8237k9412j47856m2761N8878j54
8850A49749p3103j60077m9382J08794J33235M0568K5335N3450j9321j7639p3126
$$ plain form
8933 74818 18416 -64472 -60147 -46264 48317 87198 -74639 -130727 -148889 -109384 -69683 -36973
8921 -36973 47785 89759 55844 9208 47267 51096 83923 48652 28064 -52899 -17634 -860
8909 -860 -31945 -32811 -69598 -145437 -198186 -102187 -7162 -450 55586 97805 78591 92875 98242
8896 98242 -71128 -40073 40252 50248 39932 -87617 -62995 48098 -5272 -37419 -126174
8885 -126174 -56812 16114 52943 51258 -47363 -91834 -78896 -152425 -82036 99512 187477 150691
8873 150691 26346 54338 79697 72479 74244 -33907 -146823 -111174 -77899 -12575 55717
8862 55717 146629 227067 332060 403809 402144 359291 311054 281642 133786 91025 149903 149749
8850 149749 76646 -83431 -132813 -24019 109216 149784 175119 228569 209248 191609 118483
8839A18483r0280j6292K8207P6409N0025k5879o7565O395k2438O8249p4305n5229
8827d220q146L9050p0275r5864L3778L6594O399J2587J31607o1627o0346P2525
8815C2062O892k5424r4380j3246N328l4148L1425R4165J32150J13137l2754j32000
8803H3207l3935Q425K2175j4780n2220o769L5188J5485n9158k6778P1545J8568
8791F0953k2105L3458K8264Q664M1470P3968k9l9771n8987K6507j8935m6078j24226
8778c6847p4696J01303N4188k3941l2927O410M4426j1930N954k0579N2040K1952
8766H5353j2050j7834r0889j09432K2289M9055J03200J99145J0137p6805m6907
8755A15262k941k9149n6345L6961M5057m3733o2747O4495M9444M0707N1489o6980
$$ plain form
8839 118483 28203 11911 40118 116527 166552 140673 73108 79503 57065 125314 51009 -4220
8827 -4220 -12366 26684 -43591 -139455 -105677 -69083 -62684 -50097 81510 19883 -40463 32062
8815 32062 38954 13530 -80850 -94096 -88768 -122916 -91491 2674 134824 247961 215207 83207
8803 83207 49272 57697 79872 65092 12872 6103 41291 56776 -2382 -29160 42385 60953
8791 60953 38848 72306 100570 109234 150704 224672 224643 184872 125885 152392 133457 87379 -36847
8778 -36847 -111543 -10240 43948 20007 -12920 -6510 37916 25986 31940 11361 63401 85353
8766 85353 73303 55469 -35420 -144852 -122563 -73508 29692 228837 238974 162169 115262
8755 115262 112321 83172 26827 63788 108845 65112 2365 66860 116304 157011 208500 141520
8743A41520J9288M321j5774O1957r6845m1904k3247L5071N6691J09365J9884n5868
8731B14459n4918K2871M631p8848q4865j15331M2867K16134J23151K0252m1849
8720B68554q157n2275j24012n901k1442J0043K3911l8445O1322Q3510O8657o0188
8708B05577p4632j53864L074J22539J61722j0389r61L602m4167n0249J09253J1292
8696B82797p0186m6186l3268M504j07472O3317M5191O2008K3655q2990L9418J0755
8684A91543p972N552R0754j1216q5609J2632q4278L2975J1211k9928K4950L6979
8672A87593l563j8733o2206K3181L8796l1882k8862l3213L1869m0731L6789J29937
8660B28975J6007j80036l2291J29408J73022J10577o8372j51858m0577K8996J0367
$$ plain form
8743 141520 160808 165129 149355 211312 114467 72563 49316 84387 141078 250443 270327 214459
8731 214459 159541 182412 187043 108195 23330 -92001 -49134 167000 290151 310403 268554
8720 268554 260397 208122 84110 78209 56767 66810 90721 52276 113598 197108 265765 205577
8708 205577 130945 -22919 -19845 102694 264416 254027 253066 256668 212501 162252 271505 282797
8696 282797 212611 166425 133157 137661 30189 93506 138697 200705 224360 141370 180788 191543
8684 191543 183571 189123 279877 268661 183052 195684 111406 144381 155592 125664 150614 187593
8672 187593 184030 165297 103091 126272 165068 133186 104324 71111 102980 62249 99038 228975
8660 228975 244982 64946 32655 162063 335085 445662 377290 225432 184855 213851 224218
8649B24218n6797m1820n7398l5548P5075J01217m1635n1558J30105O3272m6558
8638B62573n675o049n4565r0519p9584j6569M9775J5773p7157J53327Q4437k1929
8626B13838p9867l917R47o0792m14Q2420M9186N6558K3039J180r389l882l7779
8613B31128L5035J17065L0616p2259p1642p3235J04061Q1506m8519J7062L2952
8602C83770k8335m2015q6754j4248J26794k7013J3447j61K2951K3013L3959k1503
8590C83905J45844l0760k7909j850M9144j094J1609r6318o0395O4247M9996q3812
8578D02607j62344k6084o5391p5610J5598J4312n6706L5119N273n5192o990q6163
8566f1571k15395m278K0021R6006J0530O8140l2484k9601M3714P5700R1428O5348
$$ plain form
8649 224218 167421 125601 68203 32655 107730 208947 167312 115754 245859 309131 262573
8638 262573 256898 250849 196284 105765 26181 9612 59387 75160 -1997 151330 235767 213838
8626 213838 133971 130054 131001 70209 69795 152215 201401 257959 280998 282178 272789 268907 231128
8613 231128 266163 383228 413844 341585 269943 196708 300769 382275 333756 350818 383770
8602 383770 355435 313420 226666 212418 339212 312199 325646 325485 348436 371449 405408 383905
8590 383905 529749 498989 471080 469230 518374 517280 528889 432571 372176 436423 486419 402607
8578 402607 240263 214179 148788 73178 88776 103088 46382 81501 86774 31582 24592 -61571
8566 -61571 -276966 -281244 -261223 -165217 -154687 -86547 -119031 -148632 -104918 -29218 62210 127558
8554A27558l890l1383L9712p351q2311j40953L1530Q7382r1640M200L8089j1583
8542d0640j2399M1279l0878p9525Q61L2530m668O4741Q9685p5567q1153Q933K7500
8529e9301O6861J19568j28445J3277m0871q8335m2185M9068J03992R8195m2002
8518D9822k1218n1547K7241N1147M3499J2849J8955k1407j02751q9748o6057n5893
8506b05108R8143N058K0083M5316K2231M7313m451N4461M9459N097j37207l4684
8494c4289l9725o7589o940J55067J41630k4814j37265o5379q3435J3786J25385
8483b3568j8907O5270K3862j15987P5925J14841m7446p4703o0044L8166J89470
8472A66879m757j59309j38280p1092K0585M0685P0872J2306Q084Q8363Q761l0421
$$ plain form
8554 127558 123668 92285 131997 124646 42335 -98618 -67088 20294 -71346 -67146 -29057 -40640
8542 -40640 -53039 -11760 -42638 -122163 -121302 -88772 -93440 -28699 60986 -14581 -95734 -86801 -59301
8529 -59301 7560 127128 -1317 11960 -28911 -117246 -159431 -110363 -6371 91824 49822
8518 49822 28604 -22943 4298 55445 98944 111793 130748 109341 6590 -83158 -149215 -205108
8506 -205108 -106965 -101907 -81824 -36508 -14277 33036 28585 83046 132505 137602 395 -34289
8494 -34289 -74014 -141603 -148543 6524 148154 123340 -13925 -79304 -162739 -148953 -23568
8483 -23568 -42475 22795 46657 -69330 6595 121436 73990 -713 -60757 -22591 166879
8472 166879 162122 2813 -135467 -206559 -185974 -145289 -74417 -62111 -54027 34336 43097 12676
8460A2676L1466O2887N4458p4231j37810o7435j7990L8506J35644q7316l7197
8449h6342M8782n6157r258M06J51788O3580m4386j2523O9921n5879j18002N2062
8437C992l631J6666J13907N7873j18149p5360j5280m7657n5867Q5065P8449r568
8425C0440j6881k4240K2927m4104L604M280n6743R9469R674P7133L7287o776Q704
8412A44774p6204Q0902Q2789N5110n8773j6767j31718L9789Q9838n4143n5053
8401A00544m9014L4177J800J8054L3542m4694l6125R166K3148J3568p2833O4244
8389I5577j9710j0775l6706Q3257J4411j06363l1762Q9835J023q1668M3350J05168
8377A45637j54897j37334o3627N2666K8198J7903L3915j714P544L0647n5169r2571
$$ plain form
8460 12676 44142 107029 161487 87256 -50554 -117989 -135979 -97473 38171 -49145 -86342
8449 -86342 -37560 -93717 -102975 -102569 49219 112799 68413 55890 125811 69932 -48070 3992
8437 3992 361 17027 130934 188807 70658 -4702 -19982 -67639 -123506 -38441 40008 30440
8425 30440 13559 -10681 12246 -31858 -28254 -23974 -80717 18752 28426 105559 142846 136070 144774
8412 144774 68570 149472 232261 287371 228598 211831 80113 119902 209740 155597 100544
8401 100544 51530 85707 87507 105561 139103 94409 58284 67450 90598 104166 31333 95577
8389 95577 75867 65092 28386 111643 126054 19691 -12071 77764 78787 -2881 40469 145637
8377 145637 -9260 -146594 -210221 -157555 -129357 -111454 -77539 -79253 -71709 -41062 -96231 -188802
8365a88802P1174J09691L9609m5951K1915Q1241M9950o2203q4147k7020l1950
8354f6493o6457l1938J7426k5758P1857k2603R260N3153J0016L8512N8686j1975
8342C3686j23114j9432L8181Q7144p591q4953K7180L2938L8349M1003J0235p9631
8330f005j35453j4779O3141J6567n4856P0750P8190r527M5927n2306R1040M6767
8318A39456J5003l057o0410m3993O3299p2246O6416O6036m5225n3025r3807n2056
8306g3609O1611Q4306l6570q6608j44791p394J18079J883j17680j2758R4012L7247
8294h2272m945R8652K1110n3878j12321J027J19847R4437q0286j6507O819Q8005
8282G9688P8949m8639q4026J1096q217l2977r9020p7934O4455q4578Q7252Q0964
$$ plain form
8365 -188802 -117628 -7937 31672 -14279 7636 88877 138827 76624 -7523 -34543 -66493
8354 -66493 -132950 -164888 -147462 -173220 -101363 -123966 -114706 -61553 -51537 -13025 45661 33686
8342 33686 -89428 -108860 -70679 16465 8874 -76079 -48899 -15961 22388 63391 73626 -6005
8330 -6005 -141458 -156237 -93096 -76529 -131385 -60635 17555 8028 53955 1649 92689 139456
8318 139456 154459 151402 90992 46999 110298 38052 104468 170504 125279 72254 -21553 -73609
8306 -73609 -11998 72308 35738 -50870 -195661 -203055 -84976 -83093 -200773 -213531 -119519 -82272
8294 -82272 -87217 11435 32545 -21333 -133654 -132627 -12780 81657 1371 -15136 -8317 79688
8282 79688 158637 109998 25972 37068 28851 -4126 -103146 -181080 -116625 -201203 -113951 -32987
8270c2987L6190o7728p1860O8770N4108M7531n9746r9167l1033O4596n4549Q6764
8258e9111M8065o4861j10963J18297J07540l6166p6172P3961R6325p9073r0137
8247g2295R163N7239m9780p8303o1417j7763K7865J28585K3558J1305q7659l9259
8235a48761M4962K2019j3199m2754O9332J2210P3561R5597l1010j15619m7491
8224h1153q6767N579N7319K923j0282L1754K0915M2212N8447o899K9399L4345
8212I7792Q9998o7375o5436m2449p3079l9955R607N18J9071m4417O9969J14896
8200F9140p5959K1381l6922L2661j7148K297p8723l8075M3730N3724N4423J00104
8188A30633M946p5401o3343K3457K6548n0902p923j2298L5440P7017L911k5888
$$ plain form
8270 -32987 3203 -64525 -136385 -67615 -13507 34024 -25722 -124889 -155922 -91326 -145875 -59111
8258 -59111 -11046 -75907 -186870 -68573 38967 2801 -73371 590 96915 17842 -72295
8247 -72295 -63132 -5893 -55673 -133976 -195393 -213156 -185291 -56706 -33148 -21843 -109502 -148761
8235 -148761 -103799 -81780 -94979 -137733 -68401 -56191 17370 112967 81957 -33662 -81153
8224 -81153 -167920 -162341 -105022 -102099 -112381 -80627 -59712 -17500 40947 34048 63447 97792
8212 97792 187790 120415 54979 12530 -60549 -100504 -90897 -90379 -71308 -115725 -45756 69140
8200 69140 -6819 14562 -22360 10301 -6847 -4550 -83273 -121348 -77618 -23894 30529 130633
8188 130633 135579 60178 -3165 20292 46840 -4062 -11985 -24283 11157 88174 92085 66197
8176F6197j4285j06695M246k5634q3114R472J12599K0100k0418M48J2287J1328
8164a3469r4893q24J26465J8054m7302K3704N5828l9327L7001P1173O0697j6387
8152A80720j8245P4251n984r0344k3126j9912r2011R504k486k4007n5229j03513
8140a70382M976N5259Q8364M1641K2330P314K8515q4211n0772M5343J05446m5573
8128D8250K2247O8967k5878k1231l1560m2419M1618P3661M8494K8098l5600J0220
8116A84867P9147L5395m7252j4893J7290p9630p9651p7546j3599R2533K3373L3027
8104A53061J4444r619M8920j4850j25016m003m9958M6033Q0889J3790o2190m9744
8092D1757j752M141k9655r7331O5246Q2952P6678k3522Q896L500L594R9586M0720
$$ plain form
8176 66197 51912 -54783 -50537 -76171 -159285 -149813 -37214 -17114 -37532 -37084 -24797 -13469
8164 -13469 -108362 -109186 17279 35333 -11969 11735 67563 28236 65237 136410 197107 180720
8152 180720 162475 236726 230742 140398 117272 97360 5349 14853 12367 -11640 -66869 -170382
8140 -170382 -165406 -110147 -21783 19858 42188 49502 78017 -6194 -56966 -11623 93823 48250
8128 48250 70497 139464 113586 92355 60795 18376 59994 133655 182149 210247 174647 184867
8116 184867 264014 299409 252157 237264 254554 174924 95273 17727 4128 96661 120034 153061
8104 153061 167505 157886 206806 191956 66940 62937 12979 59012 139901 153691 91501 41757
8092 41757 40005 44146 14491 -82840 -17594 65358 142036 118514 127410 130910 134504 234090 274810
8079B74810r9644o3711j7119M3232J59367R8650M9767P548p6639j14812m9516
8068B11933m4796j8966q27m3245l3412l0052J1174l9531o2911M1735J701q9121
8056i6318o8903r890N5803J21165J82893M3590l4971j14488K2053j335Q6025J29279
8044C14903k7755j4523O299K7991k5248l31M3270r7014p644K6743l110O0428o1161
8031B42848n2038L9477O7524K3925K6792n8231q8126K4013j0227k0039M5371O8186
8019C09475L3988m0348Q3885P0728k9284p6825k8753j4803L8692L2067P9333j8985
8007D39170k0302m5735O6559O4002j3824Q4475L3717J1342P5149m853j09785j13096
7995D66819q2183m2393O4900K8214J32018R8539Q737r3952l2513p8291n4770j09201
$$ plain form
8079 274810 175166 111455 94336 137568 296935 395585 445352 452900 376261 261449 211933
8068 211933 167137 148171 147344 104099 70687 40635 51809 12278 -50633 -8898 -7197 -96318
8056 -96318 -165221 -175111 -119308 1857 184750 228340 193369 78881 100934 99599 185624 314903
8044 314903 287148 272625 278924 306915 281667 281336 324606 227592 219948 246691 243581 304009 242848
8031 242848 190810 230287 297811 321736 348528 290297 202171 226184 215957 195918 241289 309475
8019 309475 343463 303115 387000 457728 428444 351619 322866 308063 346755 378822 458155 439170
8007 439170 418868 373133 439692 503694 489870 574345 608062 619404 694553 689700 579915 466819
7995 466819 384636 342243 407143 435357 567375 665914 674651 580699 548186 469895 415125 305924
7983C05924j09404J0953j23964l0422K7494L0425m5402o2012J7095M3735l7684
7972B6738J0279J8941N0368J00566M2892N6887p7824Q5016O4436L5302J7811j9541
7960D11871J37583N9621n2008m0807J45762j446p7985j28942j55505K548J00847
7949D01539N4338q8291O2575J7173p4155l6930m8870R2823l8027j37757q3483
7938A20935r7809J8573o1744n9472J45719N0394k1569m9577L9209M3279M3912
7927A71850n7603j34230M7968n5725L3369L957m389P7853J20458P4626k531J3788
7915B89391L855K0479N9139r8934q6419m1302n899l1455M0012N1722j5597j42560
7903D2432j9733R8935L1023M1180Q652k0809p5119J4972J10444K3375p408m4602
$$ plain form
7983 305924 196520 207473 83509 53087 80581 111006 65604 3592 20687 64422 26738
7972 26738 37017 55958 106326 206892 249784 306671 228847 313863 378299 413601 431412 411871
7960 411871 549454 609075 557067 516260 662022 660576 582591 453649 298144 300692 401539
7949 401539 455877 367586 430161 447334 373179 336249 287379 380202 342175 204418 120935
7938 120935 23126 41699 -20045 -79517 66202 116596 95027 45450 84659 127938 171850
7927 171850 114247 -19983 27985 -27740 5629 9586 5197 83050 203508 278134 275603 289391
7915 289391 293246 313725 372864 273930 187511 146209 140310 108855 148867 200589 184992 42432
7903 42432 22699 121634 152657 193837 202489 181680 106561 121533 231977 255352 247944 203342
7891B03342r4782p1822l9683O7675M9445m7249J8101J7441L5518p802R2207K4870
7879B47261m8968n1401l6662K9346J286j6734J54089N742p0803j55731p1077k1576
7867c5228o728r894J6826N324K3997m2743K6549m0524N222K6552m1135M0971k6122
7854e6933j16731K5336N9629k7477O4901l2959m6842l3869o3716J2576J9438P2070
7842a24577Q1975P2010l4717j31668J916J9771l56L8266R8262L871J8110j5476
7830B7387j11120o643M6863J9931q4420M6785J21547L2974j08252j41994L1938
7819a25004J12718J6365p3462R730m1806j22K2992l1716J8546K9750n9934J17954
7807c989j9811o9077p9744R486J7843M9035n7066p4744K5931o6037r1760O1168
$$ plain form
7891 203342 108560 36738 -2945 64730 114175 66926 85027 102468 137986 130184 222391 247261
7879 247261 198293 146892 110230 139576 140862 124128 278217 283959 213156 57425 -13652 -35228
7867 -35228 -41956 -51850 -35024 -29700 -5703 -48446 -21897 -62421 -57199 -30647 -71782 -30811 -56933
7854 -56933 -173664 -148328 -88699 -116176 -51275 -84234 -131076 -164945 -228661 -216085 -196647 -124577
7842 -124577 -42602 29408 -5309 -136977 -135061 -115290 -115646 -77380 20882 24753 42863 27387
7830 27387 -83733 -90376 -43513 -23582 -108002 -61217 60330 93304 -14948 -156942 -125004
7819 -125004 -12286 4079 -69383 -59653 -101459 -101581 -78589 -110305 -91759 -62009 -121943 -3989
7807 -3989 -23800 -92877 -172621 -163135 -145292 -96257 -153323 -228067 -202136 -268173 -359933 -298765
7795b98765K13689M7591K651l5688n3767O5440J04197J7509M8654o6812k1131
7784B3568L2340r2911j03712J7913N8055K842K271l4792o7953r4720J7447J11711
7772a27941J65136N0302r0798l7893K4875k1050r8376l7522M3223P5005K6386
7761b8653J6389n0890n748l615m0977j05535j9435K0739P3980J6892j00278n325
7749b32456P5877L5866L4580j18135K6226M6741m2628m4713j2878J24047P1076
7738c6397m7465N750N8457M8796P6654o1026l6938k8994r19l7133p2971N0216
7726h1970L7908L6188J24890J10199q4217o2066N7823n3064j16299q8260o6952
7715a85820l1294J9524O4666L7807M9299R4647m8395j08244j89599o7010K1593
$$ plain form
7795 -298765 -85076 -37485 -34834 -70522 -124289 -58849 45348 62857 111511 44699 23568
7784 23568 55908 -37003 -140715 -122802 -64747 -61905 -59634 -94426 -162379 -257099 -239652 -127941
7772 -127941 37195 87497 -3301 -41194 -16319 -37369 -135745 -173267 -130044 -55039 -28653
7761 -28653 -12264 -63154 -68902 -72517 -113494 -219029 -238464 -217725 -143745 -126853 -227131 -232456
7749 -232456 -156579 -120713 -86133 -204268 -178042 -131301 -173929 -218642 -231520 -107473 -36397
7738 -36397 -83862 -78112 -19655 29141 105795 44769 7831 -21163 -22082 -59215 -132186 -81970
7726 -81970 -44062 -7874 117016 227215 142998 80932 138755 85691 -30608 -118868 -185820
7715 -185820 -217114 -197590 -132924 -95117 -45818 48829 434 -107810 -297409 -364419 -342826
7704c42826R8619J61275J7394M7393k80K9138J0724J3121L3154N0962L6016l8386
7692A16304p203j17312j05074M358O5879L3793J0780n168K6854M5630J8842n3158
7680C4525n4548r5712m4604N2150J08158J02438p8550r6453j0707M2361L7066
7669c876N5758k3874k9973j42400J8232N4957p8815l5737N8255L1313K380L3504
7657f0276K3908r2706r2563k6057N3332L0880Q3114J2474j1637K0051O3431K2180
7645B6131j6197l6617m3856J7638R6807p801N7745n2104J6904M6189k3766o622
7633G4451K2740l3502j03654R069P0089k8989K5492j73855q2894O7205K5295k4574
7621a53127n860K5056K8134M0908k1579p4415l5949n8872K9136M4278k3130O7353
$$ plain form
7704 -342826 -244207 -82932 -65538 -18145 -18425 10713 21437 34558 67712 118674 154690 116304
7692 116304 109101 -8211 -113285 -108927 -43048 -9255 1525 -3643 23211 68841 87683 34525
7680 34525 -20023 -115735 -160339 -108189 -31 102407 23857 -72596 -83303 -40942 -3876
7669 -3876 51882 28008 -1965 -144365 -126133 -71176 -149991 -185728 -127473 -96160 -93780 -60276
7657 -60276 -36368 -129074 -221637 -247694 -194362 -163482 -80368 -67894 -79531 -59480 3951 26131
7645 26131 9934 -26683 -70539 -52901 43906 36105 93850 41746 58650 104839 81073 74451
7633 74451 97191 63689 -39965 -30896 39193 10204 35696 -138159 -221053 -153848 -128553 -153127
7621 -153127 -158987 -133931 -105797 -64889 -86468 -160883 -196832 -255704 -226568 -182290 -205420 -138067
7609a38067J01614p5874K3795K6423K4190P625M8237J0933k1784l9992p1311r9345
7597b03556J03071J67409J59r7063m0096n0564j7348K1228P5692Q7166p5669j9490
7585d9061N0696o8263n3298P232N4070J15150L8937p7052o6776M7337K0741J6844
7573C6557P5046N6600P834j30927r7706p5574N7512Q3283m2079l8066M1167J1001
7561a5352k4234N699l0506J0967m1805l6589K889M0832N0173L6391j37662m9631
7549a88828N1888M2078m4413N3280M6236j8109N5522l3048o4298l0322R2699J21212
7537H3897m9705L405J932J1868J24029J3627l7376r4445o1807o1604J45064L0761
7525A09646q1938L3192J1121k4684j16976p5798N2755Q0593O4262k0647k8407
$$ plain form
7609 -138067 -36453 -112327 -88532 -62109 -37919 -30294 17943 28876 7092 -32900 -104211 -203556
7597 -203556 -100485 66924 67083 -29980 -70076 -120640 -137988 -116760 -41068 46098 -29571 -49061
7585 -49061 1635 -66628 -119926 -112694 -58624 56526 95463 18411 -48365 -1028 19713 36557
7573 36557 111603 168203 176037 45110 -52596 -128170 -70658 12625 -29454 -67520 -26353 -15352
7561 -15352 -39586 -33887 -64393 -53426 -95231 -131820 -128931 -88099 -37926 -1535 -139197 -188828
7549 -188828 -136940 -94862 -139275 -85995 -39759 -57868 -2346 -35394 -99692 -130014 -37315 83897
7537 83897 34192 37597 39529 51397 175426 189053 151677 57232 -4575 -66179 78885 109646
7525 109646 27708 60900 72021 47337 -69639 -145437 -92682 -12089 52173 31526 3119
7514C119j3067r7643O1011J24509m3521k1908l0634K0793K1009l5282M0216J40997
7502A69599j6908r379N188j03354r8886l7039J25067J21969r694k4601q8879J7479
7490E0562l2666q615m7447N6748L6686L4281O7974O4317K1679j60841j05164m0514
7478f3000o8197k6199N1525K8241J7109M1805o0997J1528R0403L2292M8438L754
7466A06702j1348m6457j91536l7827Q5765J45918J0956k4584M2402L7817k5265
7455I2543J8748m8491j20208q2778N2443J679Q4180J4721j22225K6070N6045N1334
7443B4061k9752k1558R809R8363J01117o156r306j11419r5917j7363j19181n9777
7431b37079P9371J26426L4147k1521m5098l23N9926P973l7393L0844J8411K7867
$$ plain form
7514 3119 -9948 -107591 -46580 77929 34408 12500 -18134 2659 23668 -11614 28602 169599
7502 169599 152691 143312 148500 45146 -53740 -90779 34288 156257 146563 121962 33083 50562
7490 50562 17896 9281 -38166 18582 55268 89549 157523 221840 243519 82678 -22486 -63000
7478 -63000 -131197 -157396 -105871 -77630 -60521 -18716 -79713 -68185 22218 54510 102948 106702
7466 106702 95354 48897 -142639 -180466 -94701 51217 62173 37589 79991 117808 92543
7455 92543 111291 62800 -57408 -140186 -87743 -86064 -1884 12837 -109388 -83318 -27273 24061
7443 24061 -5691 -27249 -17440 80923 182040 175884 166578 55159 -40758 -58121 -177302 -237079
7431 -237079 -157708 -31282 2865 -18656 -63754 -64077 -4151 3822 -33571 -2727 15684 43551
7419D3551K1052l5678o6250J1964n1022p498N095J4327l3055j865L9038M5945
7407a4396p61K7934k724j3216q5018L7742J67849l3823o3745j2270k6504M8082
7395B9150l7078r8862p662o3749K7709M3028q0966P1020R8823j3833k776l6344
7383g1540j1414Q1256L3676m3295L4066M4786p6340o4752j5868m909q1115q9225
7371b64674P7649m8757J08346L3232j8582k2206M5102N8851J11120l0356n7264
7360g539J2555P6657l4091j25751K3470O3612l6469o2387P2949j2892p8055p786
7348a15727N9614k5076Q696M9983Q8742J45852o9100j06853j6589j0544l9975
7337c0977K7788N6375k3953j5717k3064l6705M4680J16872j16072k2851J2480
$$ plain form
7419 43551 64603 28925 -37325 -25361 -76383 -83881 -78786 -64459 -97514 -99379 -60341 -14396
7407 -14396 -15157 12777 10053 -3163 -88181 -50439 117410 83587 19842 7572 -18932 29150
7395 29150 -7928 -106790 -114452 -178201 -150492 -107464 -188430 -117410 -18587 -32420 -35196 -71540
7383 -71540 -82954 -1698 31978 -11317 22749 67535 -8805 -73557 -89425 -94334 -175449 -264674
7371 -264674 -187025 -235782 -127436 -94204 -112786 -134992 -89890 -31039 80081 49725 -7539
7360 -7539 5016 81673 47582 -78169 -54699 8913 -27556 -89943 -16994 -29886 -107941 -115727
7348 -115727 -56113 -81189 -72493 -22510 66232 212084 142984 36131 19542 8998 -30977
7337 -30977 -3189 53186 29233 13516 -9548 -46253 -1573 115299 -773 -23624 -11144
7326a1144o9672o7790l5931N8566O2635L9345N2064O8408M362o8122p5948l0916
7314g4143J03787J04954J29829p3633j42685N880J743r2693o0535l3687j652R2273
7302d0562q622q579l6927k9607j0558N3429M4291J8851R5432P5189p3066o9409
7290I862l8405p8075q701R502m2196j9670k7319J52031L1798k1729N5373j02072
7278g9601m270N9634P630J5836K9115K2892k162j18951o3233o6278j7224p657
7266b24269M259R875N2130R1005L7785P524L646K6485m6663L7067J8031j7521
7254f46o5003j4913k8705L7758k417L1513l0202p19P7804R138O0600J0998j9204
7241F6002n7730j0681j1960n1727k4996k9710N0923O0440J05790O2703n3378M049
$$ plain form
7326 -11144 -80816 -148606 -184537 -125971 -63336 -23991 28073 96481 100843 32721 -43227 -74143
7314 -74143 29644 134598 264427 190794 48109 53989 55732 -36961 -97496 -131183 -132835 -40562
7302 -40562 -49184 -57763 -94690 -124297 -134855 -81426 -37135 -18284 77148 152337 79271 9862
7290 9862 -28543 -106618 -115319 -105817 -148013 -167683 -195002 -42971 -11173 -32902 22471 -79601
7278 -79601 -83871 -24237 -16607 -771 28344 51236 49074 -69877 -133110 -199388 -216612 -224269
7266 -224269 -220010 -210135 -158005 -67000 -29215 -21691 -18045 8440 -38223 -1156 16875 -646
7254 -646 -65649 -80562 -109267 -71509 -73926 -42413 -72615 -73334 4470 13608 74208 85206 66002
7241 66002 8272 -2409 -14369 -66096 -91092 -120802 -69879 -9439 96351 159054 105676 109725
7229A09725l7048Q06L6722L5924l3359n9367n1953M3035l8894q2387j0654l073
7217i0523K3355J01744k0532n2574j13943O057J46664Q022r6807N4047M6204r276
7205B438k9000N3201l811M2940l9252j32651j0867N6046R6001j6799R0553j1482
7193I7317p3417O0375L243n0838m9614m3967J29M391Q0878m2701r4047k2156o7764
7180a98171J7795O6050L5775N6262o4758m9042J1194P3954j7889N6975L1723M2900
7168F2768n8825N5845j8800M1192K1155k1035j9290L3772j0817o9832J5817Q2091
7156A14041q8305j378O7498p5575j35795Q7847Q0858L9934k6763j41447p432J03431
7144A6914l5649j44399q7806L3153L8538P8329P2407M8485k8828J11010J35719
$$ plain form
7229 109725 72677 73483 110205 146129 112770 53403 1450 44485 5591 -76796 -87450 -90523
7217 -90523 -67168 34576 14044 -38530 -152473 -146416 248 8270 -88537 -34490 11714 2438
7205 2438 -26562 26639 22828 65768 26516 -106135 -117002 -60956 35045 18246 108799 97317
7193 97317 23900 84275 87518 36680 -12934 -56901 -56772 -52381 28497 -14204 -108251 -130407 -198171
7180 -198171 -180376 -114326 -78551 -22289 -87047 -136089 -124895 -50941 -68830 -11855 19868 62768
7168 62768 3943 59788 40988 82180 103335 82300 63010 96782 85965 16133 31950 114041
7156 114041 25736 24358 91856 16281 -119514 -31667 49191 89125 62362 -79085 -86517 16914
7144 16914 -18735 -163134 -250940 -217787 -179249 -100920 -28513 19972 -8856 102154 237873
7133B37873R792o4726o4867k7304o2349K2163l8011o7316L2890L3111j07073p097
7121a02914J50706J31157l1271j9042L1215r4444j4004j5017k3415l0752l5473
7110e3254Q6015N242K9543j1171j18254k9857p953L2655q0753K742Q4372J8710
7098d1963m3690p3268P826J18865J1877m3767O5787R2644p6660o0623j05428M562
7086a43838R6620j6352k5740J6824N610L2613q484K7281L7154l0333j6696L9975
7074A4634R199p3705j5132O6241P5781j5010q1891j11537l3900J24930J21903
7063H1513J8376j09882p7636p3396L6620M1122R9897L6482K3408j03513O0382
7052C3373K7645j51067j9127M3464Q795n1286M5190J8165k9888n3362o4367K4314
$$ plain form
7133 237873 247665 182939 118072 90768 28419 50582 12571 -54745 -21855 11256 -95817 -102914
7121 -102914 47792 178949 147678 128636 159851 65407 51403 36386 12971 -17781 -53254
7110 -53254 32761 38003 67546 56375 -61879 -91736 -99689 -67034 -147787 -145045 -60673 -41963
7098 -41963 -85653 -158921 -151095 -32230 -20353 -64120 1667 94311 17651 -42972 -148400 -143838
7086 -143838 -47218 -63570 -89310 -72486 -66876 -34263 -42747 -15466 21688 -8645 -25341 14634
7074 14634 23833 -49872 -65004 1237 77018 62008 -19883 -131420 -165320 -40390 81513
7063 81513 99889 -9993 -87629 -161025 -124405 -83283 16614 53096 76504 -27009 33373
7052 33373 61018 -90049 -109176 -65712 -56917 -108203 -63013 -44848 -74736 -128098 -192465 -168151
7040a68151J582Q6448P3674n8664o1524R8502r69j12776o4063M3906K10754J8044
7028F6763O956R7485r0662j42037l4589q6641O0003P8594N1255O2838M0693l1175
7016G9483j27610m0549N0380j5559p3512Q182J9743l4901L553P7592M7198N9383
7004E3383p0416j00902j8364j0121j1984P9208K8841o5589j07077L3129L4596
6993a55296K4949O1928Q5214q8708p4733L2365k1467P4675J7710M676l0317r8705
6981a67709p6855P5144Q5610j9754k9886N6116J12454M9955N8669r2311M4873
6970I6306R1560k2493o4103n1719O6493p1285j38883q1951O8767P2474J144R7993
6958F4303l6596j78457j8339N0369j2249p306L543j8152K4385Q6111O3867J9944
$$ plain form
7040 -168151 -166569 -80121 -6447 -65111 -126635 -28133 -29102 -141878 -205941 -162035 48719 66763
7028 66763 73719 171204 80542 -61495 -96084 -182725 -122722 -44128 7127 69965 110658 79483
7016 79483 -48127 -88676 -38296 -53855 -127367 -119185 -99442 -134343 -130790 -53198 -6000 53383
7004 53383 -17033 -117935 -136299 -146420 -158404 -79196 -50355 -115944 -223021 -189892 -155296
6993 -155296 -130347 -68419 16795 -71913 -146646 -114281 -135748 -61073 -43363 -38687 -69004 -167709
6981 -167709 -244564 -169420 -83810 -103564 -133450 -77334 35120 85075 143744 51433 96306
6970 96306 187866 165373 101270 49551 116044 44759 -94124 -176075 -107308 -34834 -33690 64303
6958 64303 27707 -150750 -169089 -118720 -130969 -138275 -134732 -152884 -128499 -42388 21479 41423
6946D1423L4747L1853Q173K2351q4091k0111q395j7891K6314l5889p5608N2791
6934b4333K2285n9959J6105l3838p0388M7478K6136K1238n4766L5964O3591M1210
6922C0723J06793o4779j09068Q5074M6335j2172j20222j1451Q8695K5231j4622
6911E0537K6132J3863L1466j32184q4784o7016L2138N3115M8898M7274L9115J9267
6899G7821o9266K4360L5344q9560o3817J14768M6151j26951j07352K9068P9949
6888d9485q8880j6698J6287P0180R814l4474M0782o1086R7112r5225p0763M806
6876a77630Q0749l1302o2385J8026L5005l5712p869J01076P3777M4875p8829q0108
6864a20327L1769P244m7808o0429K5371k9714N595J10470R7330K9817L7237o8965
$$ plain form
6946 41423 76170 108023 116196 138547 54456 34345 25950 8059 34373 -1516 -77124 -24333
6934 -24333 -2048 -62007 -45902 -79740 -150128 -102650 -76514 -55276 -110042 -74078 -10487 30723
6922 30723 137516 72737 -36331 48743 95078 82906 -37316 -48767 39928 65159 50537
6911 50537 76669 90532 121998 -10186 -94970 -161986 -129848 -76733 -27835 19439 58554 77821
6899 77821 8555 32915 68259 -21301 -85118 29650 75801 -51150 -158502 -129434 -49485
6888 -49485 -138365 -155063 -138776 -68596 -58782 -93256 -52474 -113560 -16448 -111673 -182436 -177630
6876 -177630 -96881 -128183 -190568 -172542 -137537 -173249 -181118 -80042 -6265 38610 -40219 -120327
6864 -120327 -88558 -81314 -129122 -189551 -164180 -193894 -188299 -77829 19501 49318 86555 17590
6852A7590m6989K6753O5639J1873j00880j8319O6284p8504O856K048n540K8835
6840b4354n0416Q8471P3661o0954j20681L9292L5800j0387J7838k7215l9781R1237
6828A2511M0573R7250L0388q2558l3744j3962o847p0552n3043l1529J8897N4060
6816c8556n0662k7151k2521P468j0880J78430k9964r9579n9015Q1546N8405J14111
6804A01632k0929k6304l4067o6612L9537O9247K1799r7197M9283m7259Q7505N9569
6792A36204m3634j06366J0176O2814m8185O9266J3886o914Q3014L0043j61199
6781C9105j57190r5755o2161J50303J11733J3558j24822k8759j2601K2933J3265
6770a30391J604P9507J57681L1761M4442n1498k0027j3895l3221q9862N7033n0581
$$ plain form
6852 17590 -29399 -2646 62993 74866 -26014 -44333 21951 -56553 -49697 -47649 -53189 -24354
6840 -24354 -74770 13701 87362 26408 -94273 -54981 -19181 -29568 -11730 -38945 -78726 12511
6828 12511 53084 150334 180722 98164 64420 50458 43611 -26941 -79984 -111513 -92616 -38556
6816 -38556 -89218 -116369 -138890 -131422 -142302 36128 6164 -93415 -152430 -70884 -12479 101632
6804 101632 80703 54399 20332 -46280 -6743 62504 84303 -12894 36389 -10870 76635 136204
6792 136204 92570 -13796 -3620 59194 11009 80275 94161 87247 170261 200304 39105
6781 39105 -118085 -213840 -276001 -125698 -13965 -407 -125229 -153988 -166589 -143656 -130391
6770 -130391 -128787 -49280 108401 140162 184604 133106 113079 99184 65963 -23899 33134 -17447
6758a7447j23829K6224M0172l2193P8768n0272j02914K8997L0164L752N331R7076
6746a6171M8105r0253o6735K7722L3807l1670p5839K0419J02489j7862j6142J14973
6734C2843R5990P6712j00277j21522o1742K0702m9738L9294P997r3647o8769N8568
6722a63589l168j2218M398P7642L0290N2559k9596J608j08919m4520P2266N2666
6710g0581j2124j05641J06317J43617J5715o5245R499o2234L3629O5469m612P2275
6698A26084l8203n2752O0893N2323j04111j22565o2916M9258R6890M5210J1739
6687F1850K6588L9118J00995n9845j03053p4766M9875n8848Q9600O0203j08916
6676B2801M7634Q3129J8738j9365K0415r5168l2146n828K9198L0031q8792m1064
$$ plain form
6758 -17447 -141276 -115052 -74880 -107073 -28305 -78577 -181491 -152494 -122330 -118578 -113247 -16171
6746 -16171 31934 -58319 -125054 -97332 -63525 -95195 -171034 -150615 -48126 -65988 -82130 32843
6734 32843 128833 205545 105268 -16254 -77996 -57294 -107032 -67738 -59741 -153388 -222157 -163589
6722 -163589 -166757 -178975 -174577 -96935 -66645 -14086 -43682 -42074 -150993 -195513 -123247 -70581
6710 -70581 -82705 -188346 -82029 61588 77303 12058 21557 -40677 -7048 58421 53809 126084
6698 126084 87881 35129 96022 148345 44234 -78331 -141247 -91989 4901 50111 61850
6687 61850 88438 127556 228551 168706 65653 -9113 40762 -18086 71514 131717 22801
6676 22801 70435 153564 172302 152937 173352 78184 46038 40210 69408 99439 10647 -30417
6664c0417L4177k9625J4900R8744O7246L6633r7398o2828j56975o6471L1130M9265
6652a11619l7886K3206P8622o8094p6453Q0150R9796N5486J13550Q9753j3290
6641B33221l537p6795j10439p3304p741n6892q9638p825J10942O1805l7309n1648
6629a09160Q518P2507l0002j5876M5534l3136N6316K6347P220o5426p0770j0227
6617a18155p2834m0061k5863k2527k1994M0322O5214P9495K9469o0615J6423r524
6605a40650J1573L8988J2830j2151k4397K9079R9182K6842k2148n2970m3639q3720
6593a61181q915J45512L0417L5863R5747k0625k5048M4335N3883M1508l8695q9463
6581A03338l659k6860j4278p213P7606N3004J7814M500m4564r1227r7619j33948
$$ plain form
6664 -30417 3760 -25865 -10965 87779 155025 191658 94260 31432 -125543 -192014 -160884 -111619
6652 -111619 -149505 -126299 -47677 -115771 -192224 -112074 -12278 43208 156758 246511 233221
6641 233221 229684 152889 42450 -30854 -38595 -95487 -185125 -192950 -82008 -20203 -57512 -109160
6629 -109160 -100642 -28135 -58137 -74013 -28479 -61615 -5299 21048 28268 -37158 -107928 -118155
6617 -118155 -190989 -231050 -256913 -279440 -301434 -261112 -195898 -116403 -86934 -147549 -131126 -140650
6605 -140650 -129077 -90089 -77259 -89410 -113807 -84728 14454 41296 19148 -33822 -77461 -161181
6593 -161181 -170096 -24584 5833 41696 137443 116818 91770 136105 189988 231496 192801 103338
6581 103338 99679 72819 58541 51328 128934 181938 199752 204252 159688 68461 -29158 -163106
6569a63106k0541M2828p937m1291K0929J12443J09129L8257O3337n9059k6593
6558F8396J3674L4747p5886l8166L6997j032O7371k9280j15793M6980L7323o8844
6546b3513j9400N5927n8507k4981K8113J7282N3898N7837j303j0336M362p747
6534G1632k9968q478L8517K0666J6858j43742O6707O4049o3755O1699n8172m134
6522C1879K7673N570j08624l3328M871Q9636K2498j09559o9557K4031P1189J5355
6510b8366L1128k5861J44861k5153o9088L9316J3892O9862N4193j03167m7692
6499E3925J1843p8036p3734k1627M6358k236K1648M0655o5945l4196k9162J09118
6487b1389K4366o1333n1136L9397J67652M8534M4196l5299M660k2778m1921q3493
$$ plain form
6569 -163106 -183647 -140819 -148756 -190047 -169118 -56675 52454 90711 154048 94989 68396
6558 68396 82070 116817 40931 2765 39762 38730 106101 76821 -38972 8008 45331 -23513
6546 -23513 -42913 13014 -45493 -70474 -42361 -25079 28819 86656 85353 75017 79379 71632
6534 71632 41664 33186 71703 92369 109227 -34515 32192 96241 32486 94185 36013 31879
6522 31879 59552 65122 -43502 -76830 -71959 17677 40175 -69384 -138941 -114910 -43721 -28366
6510 -28366 2762 -23099 121762 96609 27521 66837 80729 150591 204784 101617 53925
6499 53925 65768 -12268 -86002 -107629 -61271 -63507 -41859 -1204 -67149 -101345 -130507 -21389
6487 -21389 2977 -58356 -109492 -70095 97557 146091 190287 154988 159648 136870 94949 11456
6475A1456L1336R992M7996N6435j56624j09670j4250K9162Q5348J4092p6354k6182
6463i7263O4755K9934o8266m0305q965L9886N1328L3566l0048o3342m434p9323
6451a72477j3966J32401Q7463O6194l048o945j24811j2126J933k0525N0542j7094
6439c2459n8833j8869P249J17825j0374J4898L7081l1372m0350k4277l1017q9384
6427a59882O7365P9588M4813M5607m0135r6593j8043j5199M219O7533l620O227
6415a8120N9220n2644L4097k34N1565N7637J4382j4954p5697q7590n0377K6321
6403e6394q0868M4777O8450K032L0535J59543j02490r1214k2197l2215N6657P0481
6391D7097J8379q5214m9389l1281M4485O0870l413R5784M2079M000p4069o5488
$$ plain form
6475 11456 42792 52784 100780 157215 591 -109079 -123329 -94167 -8819 5273 -71081 -97263
6463 -97263 -32508 -2574 -70840 -111145 -120110 -80224 -28896 4670 -25378 -88720 -93154 -172477
6451 -172477 -186443 -54042 33421 99615 96567 89622 -35189 -47315 -45382 -65907 -15365 -32459
6439 -32459 -91292 -110161 -102912 14913 4539 19437 56518 25146 -15204 -39481 -70498 -159882
6427 -159882 -92517 -12929 31884 77491 37356 -59237 -77280 -92479 -88260 -20727 -24347 -18120
6415 -18120 41100 -11544 22553 22319 73884 131521 145903 130949 55252 -32338 -82715 -56394
6403 -56394 -137262 -92485 -24035 -22003 8532 168075 65585 -25629 -47826 -80041 -23384 47097
6391 47097 65476 -19738 -69127 -100408 -55923 4947 1534 97318 139397 143397 69328 3840
6379C840p468j329O6431K2160k9055J9666p744M6705M0710K212J4814n2194r5380
6366B3368m1733n2298P5878N1081M4777m6284r8204N383O2080M0256l1003r4097
6354f0796j2529j47465L692J60441J53542m2471p0058k4772p7665p6834p3251
6343b68166K8183R4943r0406p5979L1922P8262J12265q6384J3158O0145l6301
6332a38358K6771Q7315N2618M0938O0323l698l1779p1946l5911N8569k7818j10955
6320i3931r1978O4184j9141r6896N1349P1808r1471l0197l1675J43196O9877P3036
6308A8161n1939N0001J2876o9454L3701M9443J4232q688o6552N7346P1591j5034
6296I5684o00k236q0996o2836o6225k00520k5448J21564R4147p0395m8137M9932
$$ plain form
6379 3840 -3628 -4957 61474 83634 54579 74245 66501 113206 153916 156128 170942 118748 23368
6366 23368 -18365 -70663 5215 56296 101073 54789 -43415 -38032 24048 64304 33301 -60796
6354 -60796 -73325 -220790 -217098 -56657 96885 54414 -15644 -40416 -118081 -194915 -268166
6343 -268166 -239983 -145040 -235446 -311425 -279503 -201241 -88976 -175360 -162202 -102057 -138358
6332 -138358 -111587 -24272 28346 69284 129607 125909 94130 22184 -13727 44842 17024 -93931
6320 -93931 -185909 -121725 -140866 -237762 -186413 -114605 -206076 -236273 -267948 -124752 -54875 18161
6308 18161 -33778 16223 29099 -40355 -6654 42789 57021 48333 -18219 39127 110718 95684
6296 95684 95084 92848 11852 -50984 -117209 -317729 -343177 -221613 -127466 -197861 -245998 -196066
6284a96066N3153K2816L7502L7539j1966n5770k4941n3102m600M2337J04791Q7928
6272C9621M1844m2261n2151R269j2634o9321N6013J05666J8575j14268K4630L8469
6260D3452p7211l7717p8427l7107P0971j8385j3700R2008J07685J8613m9877k5009
6248d704l4865Q2803Q355k7132q2771o0624J14337M0413n4369K7030j4553K8341
6236B2261p7577r0631m6643N7210N8665J42131J05841J8836l17810j88654L6022
6225b80349J14385R3635J04526J08471q6469j9672J32694k7444l5895Q817l3913
6214G8786P1294p6741j43695n2899R8573l933p4687l3774O8330L6151o545J4552
6202b4588k6894j08540n0982J52163N3397l8625p2707J2647m453m845J17211Q5114
$$ plain form
6284 -196066 -142913 -120097 -82595 -45056 -57022 -112792 -137733 -190835 -195435 -153098 -48307 39621
6272 39621 81465 39204 -12947 -3678 -16312 -85633 -29620 76046 94621 -19647 4983 43452
6260 43452 -33759 -71476 -149903 -187010 -116039 -134424 -148124 -56116 51569 70182 20305 -4704
6248 -4704 -39569 43234 51589 24457 -58314 -118938 -4601 35812 -18557 8473 -6080 22261
6236 22261 -55316 -145947 -192590 -135380 -76715 65416 171257 190093 -127717 -316371 -280349
6225 -280349 -165964 -72329 32197 140668 54199 34527 167221 139777 103882 112699 78786
6214 78786 150080 73339 -70356 -123255 -24682 -28615 -103302 -137076 -68746 -32595 -39140 -24588
6202 -24588 -51482 -160022 -211004 -58841 -5444 -44069 -116776 -104129 -108582 -113427 3784 88898
6190H8898m6394o2386n0171o5347l2033n7615O7040N1291J5711k4170N3397m8482
6178a10261q0377P6431J19091P8142j01544p1571M5300k9986K0592k9955j02933
6167a87071M1357R6898O4197k7871o6621q003R276L9924Q318n0106k4041P6301
6155b7442J37953k3342L596n4100L9258j8415j02612o1783o950m554k1432J20301
6143a9522L6679k7821l7108j133m8428n5267N2490j2716l6486N289j4929q480
6131a67432L233K9148O7532K7351q418J0305O9405n6191p6298O5242L8257J03964
6119A06098M0532L6896N2308j8217m4399k5654j10890j44916n1795O8194M7652
6108d4191O9958l0603k4639J2237q7974P0262Q1427l2869j10922M2799N5628m6146
$$ plain form
6190 88898 42504 -19882 -70053 -135400 -167433 -225048 -158008 -106717 -91006 -115176 -61779 -110261
6178 -110261 -190638 -114207 4884 83026 -18518 -90089 -44789 -74775 -54183 -84138 -187071
6167 -187071 -145714 -48816 15381 -12490 -79111 -87114 -77838 -37914 -29596 -79702 -103743 -27442
6155 -27442 110511 87169 90765 36665 75923 57508 -45104 -106887 -113837 -118391 -139823 -19522
6143 -19522 17157 -10664 -47772 -48905 -97333 -152600 -100110 -112826 -149312 -144023 -158952 -167432
6131 -167432 -164199 -135051 -67519 -40168 -48586 -38281 31124 -25067 -101365 -36123 2134 106098
6119 106098 146630 183526 235834 217617 173218 147564 36674 -108242 -160037 -91843 -44191
6108 -44191 25767 -4836 -29475 -17238 -105212 -34950 46477 13608 -97314 -54515 1113 -45033
6096d5033n5359M019J20821J42801L5671n1040o9720j1658q6667r7209j0440r729
6084a33543L0693J49318N281q2961l8772O2219k0977j6757j7795m88L3714O692
6072b3376J35934l4818m9929k1768P9028O5469o123j14944k751n518o351L4806
6060D9659q6943K111K3941L5707N1975n5705R218N7710j32748j06770M795J08971
6048c8079Q1267m6434J4509o627o4314l6173J11798J11333r6409J7735O5323m7313
6036F6616o7791J5582p866M2993K0640J7330J259o1089m0435K1020l8689j02797
6024a33227O6720q385r7951Q4083N9420n3913K3702l6710L0475k7609N6858L7725
6012A188L7328J34437k3455j17328J1985l8946R1111R1256r5610n7877k9496j17587
$$ plain form
6096 -45033 -100392 -96373 24448 167249 202920 151880 82160 70502 -16165 -113374 -123814 -133543
6084 -133543 -102850 46468 51749 -31212 -69984 -7765 -28742 -45499 -63294 -63782 -30068 -23376
6072 -23376 112558 77740 27811 6043 85071 150540 144417 29473 26722 21204 14853 49659
6060 49659 -37284 -35173 -11232 24475 76450 20745 29963 87673 -45075 -151845 -147050 -38079
6048 -38079 43188 -3246 11263 4636 -59678 -95851 15947 127280 30871 48606 113929 66616
6036 66616 -1175 14407 6541 49534 70174 87504 88763 27674 -12761 8259 -30430 -133227
6024 -133227 -66507 -74892 -172843 -88760 -29340 -83253 -59551 -96261 -65786 -93395 -36537 1188
6012 1188 38516 172953 149498 32170 44155 5209 96320 187576 91966 34089 4593 -112994
6000a12994j18008N5651M0404P302O7052j7436k1885L789o440k1570l3566M4895
5988a12806k1351p5078k88L5260K8609K9825J29045M5203o1403l5899P3908k8103
5976F922j66675J6358Q4081N2176Q3370J02264M2382M2966q7709j14158K6688
5965H8665j6606m8775j60369j03630R4803O9521l852l21L5542L1871P783l8489
5953d3857m8625k7514J04777N8320j8350R9930J8980l6412q4245j9489J5388M3787
5941F2690m505J4988p5673J4283m1367r3783M8943L9331p3878k1319N9734J2532
5929e8024L6170J23747P36r8404Q8840Q1204j03249r6673o057L5087K1873J07986
5917A33236L5352r7200m9957L9677k2235j55989m0677J6627J5461J08405o755
$$ plain form
6000 -112994 -231002 -175351 -134947 -127645 -60593 -78029 -99914 -96125 -102565 -124135 -157701 -112806
5988 -112806 -134157 -209235 -209523 -174263 -145654 -115829 13216 58419 -2984 -38883 35025 6922
5976 6922 -159753 -143395 -59314 -7138 76232 178496 220878 263844 176135 61977 88665
5965 88665 72059 23284 -137085 -240715 -145912 -76391 -80243 -80564 -45022 -13151 -5368 -43857
5953 -43857 -92482 -119996 -15219 43101 24751 124681 143661 107249 23004 3515 18903 62690
5941 62690 58185 73173 -2500 11783 -29584 -123367 -74424 -35093 -108971 -130290 -70556 -58024
5929 -58024 -21854 101893 102629 4225 93065 174269 71020 -25653 -31710 3377 25250 133236
5917 133236 168588 71388 21431 61108 38873 -117116 -157793 -141166 -125705 -17300 -24055
5906b4055r2736K4461L1395N7120Q2411J0744Q075n0983q5754J04217m7166o5641
5894d7912K725o5402r4914M401J412k527o3251O3329J32516J14467K3557L9091
5882A07492m9305o6330p7113q5814L767K9658j8489J0244M4958L8047K3040K4567
5870a5278J08451p3086n5902m1393q4607l9265R2898J41262M3642l6238P0372
5859A10856j4173j03993O3591l0774L5136j42673n7064J59258Q8437n5519j12614
5848e9532q821L9132J09703K0663q999M801M8534m4819n6486m264j56538j30112
5836b46738p6574N6347L9997P9888l4109N8984k6893m7838J54824O9236M4551
5825G1675O4080M5244j6948l4853q0655o3366m2110k1223q3695j5852m5353R0050
$$ plain form
5906 -24055 -116791 -92330 -60935 -3815 78596 89340 97415 46432 -39322 64895 17729 -47912
5894 -47912 -45187 -110589 -205503 -201102 -199690 -202217 -265468 -202139 -69623 44844 68401 107492
5882 107492 58187 -8143 -85256 -171070 -167303 -137645 -156134 -145890 -100932 -62885 -39845 -15278
5870 -15278 93173 20087 -35815 -77208 -161815 -201080 -108182 33080 76722 40484 110856
5859 110856 96683 -7310 56281 25507 60643 -82030 -139094 20164 108601 53082 -59532
5848 -59532 -68353 -29221 80482 101145 92146 96947 145481 100662 44176 39912 -116626 -246738
5836 -246738 -323312 -266965 -226968 -147080 -181189 -122205 -149098 -196936 -42112 27124 71675
5825 71675 135755 180999 164051 129198 48543 -14823 -56933 -78156 -161851 -177703 -223056 -133006
5813a33006O8316N6633n974l9554P1566L6457j02823r597j1919o7056k2030J10522
5801d8465J10366M1378M4172l2523p1806l1843J06691K1549q9219j60271J0744
5790i9227P9905J44633n9346r4671j6459k4158P67J06700p6182k1232K792K8447
5778b8031m6607K2457k5762j15139N3573M3994N5806P6356N3035P1856l1524o8308
5766F1706p5601m2232K9374R4462R4733M041k8864l1572K4537P5495r8897j01633
5754E549l2316k1461L1135J5093O2975P953j9727j33870p8629R2465R6065O0142
5742H5374m1665j09987R628j0202j5841Q7774J00933J1891o0586J3231J1191j61378
5730g9637j23176o9579O9916O932L6114J2273l762J02653N0843L6981K717P097
$$ plain form
5813 -133006 -64690 -8057 -14031 -53585 17981 54438 -48385 -57982 -69901 -136957 -158987 -48465
5801 -48465 61901 103279 147451 114928 43122 11279 117970 139519 50300 -109971 -99227
5790 -99227 -19322 125311 65965 -28706 -45165 -69323 -68556 38144 -38038 -59270 -56478 -28031
5778 -28031 -74638 -52181 -77943 -193082 -139509 -95515 -39709 36647 89682 161538 130014 61706
5766 61706 -13895 -56127 -26753 67709 162442 166483 137619 106047 130584 206079 107182 5549
5754 5549 -26767 -48228 -17093 -2000 60975 68928 49201 -84669 -163298 -70833 25232 85374
5742 85374 43709 -66278 -56650 -66852 -82693 5081 106014 117905 57319 70550 81741 -79637
5730 -79637 -202813 -272392 -202476 -195544 -159430 -147157 -150919 -48266 2577 39558 42275 49372
5718D9372K6785L6581p1250J8635L2455k0506j30328O2521n56r510l4660O4893
5706B4432K6367k9609J567J9651j40194o5110J10942J8347p1529j8326J21086
5695b376l9091L0633P7738J88j32302K9878N5809L3610k4809k1772N0193k9816
5683B7883M6412p3473k1156M2799l1012L6620j5576o1091N427M9861K2859p842
5671B1711k5760p9036p498O4410o9415L4823l8214K3568j3677N1713N4493K343
5659A9461M5602o0571j59448N499Q537L1585N1099l6770k2050K7498R7956j7221
5647h823K5241J62890J8249m1929p2914o3406l8511N9613K6541O0169j5012p8680
5635C3428o8413J38581l0082q9634Q0907M6975j30922k5491n910N068J00328L8426
$$ plain form
5718 49372 76157 112738 41488 60123 92578 72072 -58256 4265 3709 -5801 -40461 24432
5706 24432 50799 21190 22757 42408 -97786 -162896 -51954 -33607 -105136 -123462 -2376
5695 -2376 -41467 -10834 66904 67092 -65210 -35332 20477 54087 29278 7506 57699 27883
5683 27883 74295 822 -20334 22465 -8547 28073 12497 -48594 -43167 6694 29553 21711
5671 21711 -4049 -83085 -90583 -26173 -95588 -60765 -98979 -75411 -89088 -37375 17118 19461
5659 19461 65063 4492 -154956 -149457 -140920 -109335 -58236 -95006 -117056 -89558 8398 -8823
5647 -8823 16418 179308 197557 155628 82714 19308 -19203 40410 66951 127120 112108 33428
5635 33428 -34985 103596 73514 -16120 64787 111762 -19160 -44651 -50561 -45493 54835 93261
5623I3261R822m2093j1952j09915m4583P009J4428N3011K3390J3328j99049n0225
5611b43568Q9401N5713L8719q1597L3145L6813q5634k6262R2877P0705O4703N9108
5599A04123M910j34483m9544k1031p4733q65n7526K4296P1654J27375k5354R158
5587b2020M3674j3524l9528L1309l5512P1599L7507j7379l1800n3056P0994L1264
5575G3528p9206l4282R013M5690j3139J28583N2473n3173l221J1063j9303o9231
5563D8795R151L0603n4501j2754n03p2654p7689O2034M6867O0056k4181O9342
5551H4566j11669O2805L7856j58121o7635K209J57511J57857k6426k7861j6103
5540I4989j48731l0879R1411J22124M1175m4655o6738q1887r506L9099M0006j36625
$$ plain form
5623 93261 103083 60990 49038 -60877 -105460 -98451 -84023 -31012 -7622 5706 -193343 -243568
5611 -243568 -154167 -98454 -59735 -141332 -108187 -71374 -157008 -183270 -90393 -19688 45015 104123
5599 104123 109033 -25450 -74994 -96025 -170758 -171623 -229149 -204853 -133199 -5824 -31178 -22020
5587 -22020 21654 8130 -31398 -89 -35601 35998 73505 56126 24326 -28730 42264 73528
5575 73528 -5678 -39960 -30947 14743 1604 130187 182660 129487 126266 137329 118026 48795
5563 48795 57946 88549 34048 21294 20791 -51863 -129552 -67518 -20651 39405 15224 84566
5551 84566 -27103 35702 73558 -84563 -152198 -149989 7522 165379 138953 111092 94989
5540 94989 -53742 -84621 6790 128914 170089 125434 58696 -23191 -32697 6402 46408 -90217
5528i0217m5722J32774M6820n3000p3958l7583J07348R7670K6396L488R4670n1034
5516A57652j67257L295n8412p0266R306j2684J1994j3792p500K529M591k2624
5504a63168R9524L1572q4253k8142R6707R1716l4405l9498J4341Q7409L4872q2044
5492B4631o7654j22573R5130J96946J03266J2159m3819j26220k3441m5176l1822
5481b8573K3780p753m2401k1826k6628L2381O2937K4856r6872o0660l4783L2266
5469a43276J6088k414O1254K1027m3369O6976J40011p5102l8816n2711p3036O900
5457a16468J22235Q9709n2197p4589R885J8265N2873j11105j5923O2903J0233
5446d179k7904Q9202J88017r4196r0813p2735j22161L9161L8301K768k3188J22007
$$ plain form
5528 -90217 -135939 -3165 43655 -9345 -83303 -120886 -13538 84132 110528 114016 208686 157652
5516 157652 -9605 -6310 -64722 -134988 -125682 -138366 -126372 -140164 -147664 -145135 -140544 -163168
5504 -163168 -63644 -32072 -116325 -144467 -47760 43956 9551 -29947 -15606 71803 106675 24631
5492 24631 -43023 -165596 -70466 126480 229746 241905 198086 71866 48425 3249 -28573
5481 -28573 -4793 -12546 -54947 -76773 -103401 -71020 -8083 16773 -80099 -140759 -175542 -143276
5469 -143276 -127188 -129602 -68348 -47321 -90690 -23714 116297 41195 2379 -50332 -123368 -116468
5457 -116468 5767 95476 43279 -31310 -21425 -3160 49713 -61392 -77315 -14412 -4179
5446 -4179 -32083 57119 245136 150940 60127 -12608 -134769 -95608 -57307 -54539 -77727 44280
5434D4280N031o0496l7623l713N2774M4846J7319m8052k2463N670Q3329j4960
5422F5942J6777n5219l8605K055M910K7655N153O398M136O7890m0328j5856n1534
5409f26J0092R314R8420j1027q8146q8606j23500K6714L4441O5398j5960l7116
5397a20602k116M9367O298n6808j232J39614J12720O1935p4421n9934r8918o664
5385e0761M6039j00264k2806M7634M9984L8939k6792j7837p4771K7960m2374j5557
5373a40606K1811J04976p741J3883P8215o7420k9646M4200O8215k8405p7851J2001
5361h368k723M7930K3304O4881j0316j06923N2071O1882k2487k7881q5314l3867
5349d7811j9621L7015J0949q6508k6422n2865L7378N3276J3527k4712L2289o396
$$ plain form
5434 44280 49311 -11185 -48808 -52521 253 45099 62418 14366 -8097 -2427 80902 65942
5422 65942 82719 27500 -11105 -9050 -4140 23515 28668 35066 39202 107092 66764 50908 -626
5409 -626 9466 18780 117200 106173 18027 -70579 -194079 -167365 -132924 -67526 -83486 -120602
5397 -120602 -122718 -73351 -67053 -123861 -125093 14521 127241 189176 114755 54821 -44097 -50761
5385 -50761 -4722 -104986 -127792 -80158 -30174 8765 -18027 -35864 -110635 -82675 -125049 -140606
5373 -140606 -118795 -13819 -21560 -7677 70538 3118 -26528 17672 85887 57482 -20369 -8368
5361 -8368 -11091 36839 60143 125024 114708 7785 59856 121738 99251 71370 -13944 -47811
5349 -47811 -67432 -30417 -19468 -105976 -132398 -185263 -147885 -94609 -81082 -105794 -73505 -79901
5337g9901o1282J490l6297n6531L7894K16847J8092L6756N6806N7050k7950R565
5325A72539n5982j0530J20431l2560n4117l2564j02900n5112Q606P2394o2756
5314c2551Q697J47758R28j62721o5618L2300R8238l08N5432O7408L7445J5865
5302B02873Q3902o9306N279q2461j1822j6646o6958j21093n315p464J5966j15589
5290a88634m4624R7866N9258k3923L0265N5831L3791L7789J9273O4426L9514k9723
5278A51109p5094L9967q446j20285l5730N9329M6493J6257P3732l5308q1440k2106
5266H478m5752Q317o2181K3311Q0910J6860O3461l5299j28653J9744j15305M0192
5254a25917L6340n204P5544J21307O6477j6626j7096q2976K4434L3609R93L433
$$ plain form
5337 -79901 -141183 -139693 -175990 -232521 -194627 22220 40312 77068 133874 190924 162974 172539
5325 172539 116557 106027 226458 193898 139781 107217 4317 -50795 -42189 30205 -32551
5314 -32551 -23854 123904 124832 -37889 -103507 -71207 27031 26723 82155 149563 187008 202873
5302 202873 286775 217469 222748 140287 128465 111819 44861 -76232 -81547 -89011 -73045 -188634
5290 -188634 -233258 -135392 -76134 -100057 -69792 -13961 19830 57619 76892 141318 180832 151109
5278 151109 76015 115982 107536 -12749 -48479 10850 57343 73600 147332 112024 30584 8478
5266 8478 -37274 -28957 -91138 -67827 13083 29943 93404 58105 -70548 -50804 -166109 -125917
5254 -125917 -89577 -94781 -19237 102070 168547 151921 134825 51849 76283 109892 110885 114318
5242A14318K882N9323O9678m7552r8566j0836Q9655j06498j74314p1693j5481
5231a89084K3499O5501O8312R6077o827o6621m6221P48J18598J24271L060n971
5219A85342p9803K5945K6961Q577M8207m2829P4037j47521q2305k5818j3105R9676
5207G7364O2636l7539l3544K1108O4584J00399m5904l1467o403n7719M3799k9932
5195A27382j1813j16924l6463K3057n3133K2660R4367N0735L6669j20852O944
5184B2629m086K5251l7446Q1396O2817k3162j42028p6368j168K5168J7321Q2631
5172C2955O6921o612o1944j6894j00347P2390M3137r5863n2801m1153K4940J17033
5160a8238M1655K0706o5057k1641k9064J5756M3825O4323l7060n1036J2488N2837
$$ plain form
5242 114318 117200 176523 246201 198649 100083 89247 178902 72404 -101910 -173603 -189084
5231 -189084 -165585 -100084 -31772 64305 57478 -9143 -55364 -54616 63982 188253 191313 185342
5219 185342 105539 131484 158445 167022 215229 172400 246437 98916 16611 -9207 -22312 77364
5207 77364 140000 102461 68917 90025 154609 255008 209104 177637 171234 113515 157314 127382
5195 127382 115569 -1355 -37818 -14761 -67894 -45234 49133 99868 136537 15685 22629
5184 22629 18543 43794 6348 87744 150561 127399 -14629 -90997 -92165 -66997 -49676 32955
5172 32955 99876 93264 31320 14426 -85921 -13531 29606 -66257 -119058 -160211 -135271 -18238
5160 -18238 23417 44123 -20934 -42575 -71639 -55883 -12058 52265 15205 -35831 -23343 29494
5148B9494N7946l3926N5653l4664m9055n8621j41709O4385N2609l000N4997j6766
5136b2657n9112j23516L1172J40084M4998P4090j3151j10708N7754L1307j0130
5125D0131Q7266l5681l9320l3928n5859M4095K4895o4956J476L0521N1718p2640
5113b2282M0902Q3378n66j29848r1895l7035J6414J5262J5434O64l5995O7648
5101g7919J00116J52927q4017j55121N9579L6641j19216J5897N2785j26499Q3121
5090f1706O4711J16289k1758O100n5163O72n6410N8594p2009k6401L4955K2234
5078A0108P1867m0624K01J5611n845N541r817L321J8936J3028N426k1558K3755
5065H9950p1198o0467M313j1231n1251k6768O3253k2474J11105P3254P9969q5599
$$ plain form
5148 29494 87440 53514 109167 74503 25448 -33173 -174882 -110497 -57888 -60888 -5891 -22657
5136 -22657 -81769 -205285 -174113 -34029 10969 85059 71908 -38800 18954 50261 40131
5125 40131 127397 91716 52396 18468 -37391 6704 31599 -33357 -31881 -1360 50358 -22282
5113 -22282 18620 101998 101432 -28416 -120311 -157346 -140932 -125670 -110236 -109572 -145567 -77919
5101 -77919 22197 175124 91107 -64014 -4435 32206 -87010 -71113 -18328 -144827 -61706
5090 -61706 3005 119294 97536 103636 48473 49145 -7265 51329 -20680 -47081 -12126 10108
5078 10108 81975 41351 41552 57163 51318 56859 47042 50363 69299 82327 87753 66195 89950
5065 89950 18752 -41715 -37402 -48633 -99884 -126652 -63399 -85873 25232 98486 178455 92856
5053I2856j9254L7079j18827n1044k4969l6345J0035J9614l2461L5343K5980N522
5041e6471J122O8978r8278n8659M9894R1437P8343J586k5423J3108p2410j01173
5029a07946l7741O7897N2821K9907m2736Q9439Q475Q055j5396m477k7988n0317
5017c0007Q0056K0562J6792L5782m4830r2460P8935j43j08602R9705J466K7478
5005H4734K4803Q554k3731j03048j00651k9756l3082m8043j0821P2204J12761
4994d6076r480m918R0524J26640k1468j05606J2298P5252o5147j18259l7252J2332
4982i1160J60832K4174L9417p8385j00436l5024q967O6759o1995m6359J0106q018
4970a29056l0929L3001O1250J00896k8151o3708q1650R6915m9979O2581J59959
$$ plain form
5053 92856 73602 110681 -8146 -59190 -84159 -120504 -110469 -90855 -123316 -87973 -61993 -56471
5041 -56471 -55349 13629 -84649 -143308 -93414 -1977 76366 77952 52529 65637 -6773 -107946
5029 -107946 -145687 -77790 -24969 4938 -37798 51641 60116 68171 52775 48298 20310 -30007
5017 -30007 50049 70611 87403 123185 78355 -14105 64830 64687 -43915 55790 57256 84734
5005 84734 109537 118091 94360 -8688 -109339 -139095 -172177 -220220 -231041 -158837 -46076
4994 -46076 -55556 -60474 30050 156690 135222 29616 41914 117166 52019 -66240 -103492 -91160
4982 -91160 69672 93846 133263 54878 -45558 -80582 -89549 -22790 -84785 -131144 -121038 -129056
4970 -129056 -159985 -126984 -65734 35162 7011 -56697 -138347 -41432 -91411 -28830 131129
4959A31129o578j57637l7758l7941L7197j0949l7214L486J02024J38946j25209
4948e04r7226R0103m184k1109N8524j3750P9615K3012o9839j0308J0723n1058
4936f001Q1921O5352q131p2302k10132L4687J38084j9922l9138O2990r444j7269
4924F95p6622n6385J15339Q3708Q460n9723j2191O0842j4200l8342L2751l975
4912D0357J2942l3196j42425J9494M5807m1148Q1471o6549n4404J6363l0015N9716
4900i1587J21425j5187n2611j993p5807p4205N7217l087o043N6638K0953K3616
4888d0671j8733K240N8575p2599q9434L265O3085j1288P616Q9249k2128R5122
4876F4299l7663p4932q7079R1245R693J0714o1495o9847K6916N9434P013p084
$$ plain form
4959 131129 124551 -33086 -70844 -108785 -71588 -82537 -119751 -116265 -14241 124705 -504
4948 -504 -97730 -7627 -11811 -32920 25604 11854 91469 114481 44642 34334 45057 -6001
4936 -6001 75920 141272 133141 60839 -149293 -114606 23478 3556 -35582 27408 17964 695
4924 695 -75927 -132312 -16973 66735 75195 15472 3281 64123 49923 11581 44332 40357
4912 40357 53299 20103 -122322 -102828 -57021 -98169 -16698 -83247 -137651 -121288 -151303 -91587
4900 -91587 29838 14651 -37960 -39953 -115760 -189965 -132748 -135835 -141878 -85240 -64287 -40671
4888 -40671 -59404 -57164 1411 -71188 -160622 -157357 -94272 -105560 -97944 -8695 -30823 64299
4876 64299 26636 -48296 -135375 -44130 -34437 -23723 -85218 -155065 -128149 -68715 -61702 -68786
4864f8786l2197n136J19384J19437M1884L4896m9413q0516p5472r915m9777l2124
4852h7735P1022k976L1798k8336M6341J0563k7472K1332R1028M6253j71639j10790
4840a10611j2108m373O2964M7128k8224J1187K7299j27879r234L9051j8719k6151
4828a49670l0197J461P7628Q7044o345m6663l9509J55008N1568k0369n210p5898
4816a152p04J14463j5858n7084N2808J4112j5823l2374l2525j6357l968j2964
4804g426q341j5083o2048l8364k239N3509Q7501J9370j04066J9975k0742L3414
4792d4540L2308o7197j0852R2481N1010k4278p6879j9688M1392J5061L1678J3389
4780C3885J2423k9282M0558P3827N3048j8069n003o0052j83632n6394P2410M0348
$$ plain form
4864 -68786 -100983 -106119 13265 132702 174586 209482 160069 79553 4081 -5834 -55611 -87735
4852 -87735 -16713 -19689 12109 -16227 30114 40677 13205 34537 125565 171818 179 -110611
4840 -110611 -122719 -127092 -64128 -17000 -45224 -34037 -6738 -134617 -143851 -104800 -123519 -149670
4828 -149670 -179867 -178406 -100778 -13734 -20079 -66742 -106251 48757 100325 79956 74746 -1152
4816 -1152 -1856 112607 96749 39665 92473 106585 90762 58388 25863 9506 5538 -7426
4804 -7426 -15767 -30850 -92898 -131262 -133501 -79992 7509 26879 -77187 -57212 -77954 -44540
4792 -44540 -12232 -79429 -90281 2200 53210 28932 -47947 -67635 -26243 -11182 20496 33885
4780 33885 46308 17026 57584 131411 184459 166390 161387 101335 -82297 -138691 -66281 -25933
4768b5933j5787N6012J5065l2189j6392r3146M2884R8941Q4812k9576j7245l6752
4756C0694J3649m3466j06370L0311O2783o8924O3609R5174q2897q467m0238o548
4744f0690K3777n8322K4456l3664N3065J31689R4686n1608m5167R2344m8305q0648
4732D1613o6203J3863m7265L9865O2795O10k9059P0296J5129p5307o4717n39P6811
4719C7892J20074K6942k2532j14138j10276l8120J2800j1836K7073j0296n9622
4708a42039M3608m9651m2528j4257P1669J90923J24307k9777l6704J4432r3805
4697C6178q3211p9214p535M9423O2725J01374P1369l0026m65O1490j01753j2914
4685F7441J1233q3519L9957Q2223k12685o9355J01479K00019R3733m8962j36481
$$ plain form
4768 -25933 -41720 14292 29357 -2832 -19224 -112370 -69486 29455 114267 84691 67446 30694
4756 30694 44343 877 -105493 -75182 -12399 -81323 -17714 77460 -5437 -13904 -54142 -60690
4744 -60690 -36913 -95235 -70779 -104443 -51378 80311 174997 123389 78222 170566 122261 41613
4732 41613 -24590 -10727 -57992 -18127 44668 45278 16219 86515 101644 26337 -38380 -38919 37892
4719 37892 157966 184908 162376 48238 -62038 -100158 -87358 -99194 -72121 -82417 -142039
4708 -142039 -98431 -148082 -190610 -204867 -133198 57725 182032 152255 115551 129983 36178
4697 36178 -47033 -126247 -133782 -84359 -21634 79740 151109 121083 120618 182108 80355 67441
4685 67441 78674 -4845 35112 117335 -95350 -164705 -63226 136793 230526 181564 45083
4674D5083n9590J27010Q8186j9806j63006q9377o0420q3439M6748R8183J9155
4663e1273k976r056n7632j20866K3867N3842M4035J15742M1875l4984N7031P4970
4651A34575m8553j35613o554R5053O787Q30q4783K7811R4102k5446n1023k0887
4639a3701K1332m3510r8145K7980P039M7318K505M7259l4479P9239m4955o5342
4627f7460R9961Q6190M3059o5849j42990m1274N9233M2764Q1540N7250N2221k0201
4615A84444P331q3809j72184j3924J16194p980j52455j0143J18266N6959j4559
4604B8140J191L5446m9264r4335P4185K5017L7007P5022o012p9508o3964l9503
4592e6578M1744J7704q5388N1374J0997j4227r2588O982Q8108R361L5915j5757
$$ plain form
4674 45083 -14507 112503 200689 180883 17877 -71500 -131920 -215359 -168611 -70428 -51273
4663 -51273 -54249 -63305 -120937 -241803 -217936 -164094 -120059 -4317 37558 2574 59605 134575
4651 134575 86022 -49591 -56145 38908 45695 46525 -38258 -10447 83655 58209 7186 -13701
4639 -13701 7631 -35879 -134024 -106044 -99005 -51687 -49182 -1923 -36402 42837 -2118 -67460
4627 -67460 32501 118691 161750 95901 -47089 -88363 -29130 13634 95174 152424 204645 184444
4615 184444 191775 107966 -64218 -78142 38052 30072 -122383 -132526 -14260 42699 28140
4604 28140 29331 64777 15513 -78822 -4637 20380 57387 132409 126397 46889 -17075 -56578
4592 -56578 -14834 2870 -82518 -31144 -20147 -34374 -126962 -119980 -31872 -22511 13404 -2353
4580b353L4660L4201M0965K3844L7532J111j01890j21571M7689M6183N1507J2545
4568A04423L1835q0977j2036n1495L1481n541j7774n3265O5801Q2540K8966o4400
4556E9558o6379l3328O5815Q7381J6126m9545j23520N523P6000J04577n3830j34845
4544d6467j53807j4845J00982Q4291r6376J5733L2339k7494M6319j3740k5232
4533i8297J3819J00786M273n5564J241j4907o636k5484P466l9742K9208K9935
4521e3902r875l5816K6264N5883K065l0818j4584r359m4720L8011J46603J9096
4509H8848j6332l6808m3888m6004L047r8320K2344L8111l9567L1120O9444M6850
4497A8845j4145P4130o6677Q4236l3685l3168K3622j24090o4068O5464J9300m8473
$$ plain form
4580 -2353 32307 66508 107473 131317 168849 169960 68070 -53501 -5812 40371 91878 104423
4568 104423 136258 55281 43245 -8250 23231 17690 -84 -53349 12452 94992 123958 59558
4556 59558 -6821 -40149 25666 113047 129173 79628 -43892 -38369 37631 142208 88378 -46467
4544 -46467 -200274 -215119 -114137 -29846 -126222 -110489 -78150 -105644 -59325 -73065 -98297
4533 -98297 -84478 16308 20581 -34983 -33742 -48649 -55285 -80769 -73303 -113045 -83837 -53902
4521 -53902 -63777 -99593 -73329 -17446 -15381 -46199 -60783 -70142 -114862 -76851 69752 88848
4509 88848 72516 35708 -8180 -54184 -51137 -149457 -127113 -89002 -128569 -97449 -28005 18845
4497 18845 4700 78830 12153 96389 62704 29536 53158 -70932 -135000 -69536 -50236 -98709
4485i8709k8460Q3016N0425J0403K6192N107O2085O3667N4022K8500j6478p3693
4473A66077n1898q5502j1108k036j8717J33156J16962K4965l5141M65L548j11553
4461A29218j16906p5163o162N1982J4272K9011P5265J3701p0360n2278L3699P8896
4449A05175k6071o6946Q7460k0418r7950J64967R7769j07382j71694m5669M7601
4438c3158N1289r4599K2088K3914N4840Q7628K0613k1420n990K9278q449o5949
4426F0085j38462L8648k0332q8867Q596P7196j4240o4294K3071Q5593N6674m7322
4414b3654j3245j4198l7170k9338M0789J0379O7282O7065o0735K8990r161J8219
4402D5223l5014R0993L399J5547J05686N0503j24464J8205P801l2446k315P606
$$ plain form
4485 -98709 -127169 -44153 6272 16675 42867 47974 110059 173726 227748 256248 239770 166077
4473 166077 114179 28677 17569 15533 -3184 129972 246934 271899 236758 237223 240771 129218
4461 129218 12312 -62851 -69013 -17031 -2759 26252 101517 115218 44858 -7420 26279 105175
4449 105175 79104 12158 99618 79200 -18750 146217 243986 136604 -35090 -80759 -33158
4438 -33158 18131 -76468 -54380 -30466 24374 112002 132615 111195 105205 134483 126034 60085
4426 60085 -78377 -39729 -60061 -148928 -140332 -63136 -77376 -141670 -118599 -33006 23668 -23654
4414 -23654 -36899 -51097 -88267 -117605 -76816 -66437 845 67910 7175 36165 27004 45223
4402 45223 10209 101202 104601 120148 225834 276337 151873 170078 177879 145433 143118 150724
4390A50724j26540k1505J03861j16322R81O6035L9883r5818n5665r347M3029R5371
4378G4687O3207L5630o1945k0919n2364j9247m3634M9862q5263p0164K4308L3263
4366g2579R8734J05891j1971L231j6534p3234K1523r0115m9647j2985J355Q3589
4354a2742J26979N6612l9043j4550P2590j8308j36287j04927q9418j8376J4089
4343a63381R6567O4967k990j19721m1204K7587O3684P9140J08238k3583q1452
4332G852n5647n4787P0092M5180J15975K959r4929q2433r247j317R4959M0771
4320G9428p6147K5858R2412j8436l46o4938J4151J0205N794j878j5215M7121M5743
4307A43752l4766k4910p0537N7304m7068K2649K8799j29002K2187p730r3770K332
$$ plain form
4390 150724 24184 2679 106540 -9782 -8801 57234 97117 1299 -54366 -63713 -20684 74687
4378 74687 137894 173524 111579 90660 38296 19049 -24585 25277 -59986 -130150 -105842 -72579
4366 -72579 26155 132046 120075 123306 106772 33538 55061 -35054 -84701 -97686 -96331 -12742
4354 -12742 114237 170849 131806 117256 189846 171538 35251 -69676 -159094 -177470 -163381
4343 -163381 -66814 -1847 -4837 -124558 -165762 -138175 -74491 4649 112887 89304 7852
4332 7852 -47795 -102582 -32490 12690 128665 131624 36695 -45738 -54985 -56302 38657 79428
4320 79428 3281 29139 121551 103115 102769 37831 51982 62187 67981 66103 50888 98009 143752
4307 143752 108986 84076 13539 70843 23775 46424 75223 -53779 -31592 -39322 -133092 -130760
4295a30760o726R599J30720K0723m7442q4039j427O9856Q0972l6447k7966r6935
4283a19872Q0965J30160J02309j11271j06028K6816L2558l4558r3462o792k8220
4272a27395N9471M5085j17261p2262Q9338J02759J56708K425l8304j5329k1661
4261F3574o2125N5485Q9313j18538o0003p0715l4800J67835N5536k0937n4444
4250A0181j12248l6127l8854R103m9610Q7438N7683N0848r874J8627k742j7356
4238c2931K369M0924J29721n0645k69j04554l8811O3012L1751M510n2607p8611
4226h6141J0233P2365N9430m8117j513M5889K7652n5908j34028K0377R1261m4616
4214d3116k1267p7584O4221P342M046m1785J32001J21911n2871j43080M9464P0478
$$ plain form
4295 -130760 -137486 -127887 2833 23556 -23886 -107925 -109352 -39496 41476 5029 -22937 -119872
4283 -119872 -38907 91253 193562 82291 -23737 3079 35637 1079 -92383 -99175 -127395
4272 -127395 -67924 -22839 -140100 -212362 -123024 -20265 136443 138868 100564 85235 63574
4261 63574 1449 56934 146247 27709 -32294 -103009 -137809 30026 85562 64625 10181
4250 10181 -102067 -138194 -177048 -167945 -217555 -130117 -72434 -21586 -31460 -12833 -15575 -32931
4238 -32931 -30562 10362 140083 89438 89169 -15385 -54196 8816 40567 45077 -7530 -86141
4226 -86141 -75908 -3543 55887 7770 6257 52146 79798 23890 -110138 -89761 1500 -43116
4214 -43116 -64383 -141967 -77746 -70404 -66358 -108143 23858 145769 92898 -50182 -718 69760
$$ [...]
##END NTUPLES=NMR SPECTRUM
##END=
