##TITLE=Analysis number 316191
Compound Code cc 38010
Book Reference 358/181
Project Code adrs
Chemist Name mikem
##JCAMPDX= 6.0         $$ Bruker NMR JCAMP-DX V2.0
##DATA TYPE= NMR SPECTRUM
##DATA CLASS= NTUPLES
##ORIGIN= Bruker BioSpin GmbH
##OWNER= nmr
$$ XWIN-NMR		Version 3.5
$$ Wed Jan  4 08:47:15 2006 GMT Standard Time (UT+0h)  MAYBRIDGE\nmr@NMR_250MHZ
##.OBSERVE FREQUENCY= 250.131544655141
##.OBSERVE NUCLEUS= ^1H
##.ACQUISITION MODE= SIMULTANEOUS (DQD)
##.ACQUISITION SCHEME= undefined
##.AVERAGES= 16
##.DIGITISER RES= 18
##SPECTROMETER/DATA SYSTEM= dpx250
##.PULSE SEQUENCE= zg30
##.SOLVENT NAME= CDCl3
##.SHIFT REFERENCE= (INTERNAL, CDCl3, 0, 16.4477)
##AUDIT TRAIL= $$ (NUMBER, WHEN, WHO, WHERE, WHAT)
$$ ##TITLE= Audit trail, XWIN-NMR		Version 3.5
$$ ##JCAMPDX= 5.01
$$ ##ORIGIN= Bruker BioSpin GmbH
$$ ##OWNER= nmr
$$ C:\u/data/dgb/nmr/ADRS/14140/pdata/1/auditp.txt
$$ ##AUDIT TRAIL=  $$ (NUMBER, WHEN, WHO, WHERE, WHAT)
(   1,<2006-01-04 08:46:26.21 +000>,<MAYBRIDGE\nmr>,<NMR_250MHZ>,
      <created by zg, POWCHK disabled, PULCHK disabled
       configuration hash MD5:
       62 19 C7 07 E1 42 D1 B7 37 6C 3D D0 77 39 F9 E6
       data hash MD5: 64K
       80 98 18 CA 59 4B 5B 60 21 F1 0E 13 60 C8 D2 B4>)
(   2,<2006-01-04 08:46:44.20 +000>,<MAYBRIDGE\nmr>,<NMR_250MHZ>,
      <Start of raw data processing
       ef LB = 0.3 FT_mod = 6 PKNL = 1 SI = 32K 
       data hash MD5: 32K
       6C 91 14 6C B8 77 CB 1C 0E 72 67 5D BC 09 84 6D>)
(   3,<2006-01-04 08:46:49.40 +000>,<MAYBRIDGE\nmr>,<NMR_250MHZ>,
      <apk 
       data hash MD5: 32K
       12 F1 25 88 06 C9 51 7A 49 45 96 3E 64 DE 75 A5>)
(   4,<2006-01-04 08:46:51.24 +000>,<MAYBRIDGE\nmr>,<NMR_250MHZ>,
      <abs ABSG = 5 
       data hash MD5: 32K
       F1 95 9D 9F 1E 34 06 70 2F 1B CA DD 82 5A 1F 8D>)
$$ ##END=
$$ 
$$ hash MD5
$$ 45 BA 60 5A 15 4D ED D0 B3 C8 21 74 9D E9 D2 E4
##$RELAX= 
##$RELAX= 
##$RELAX= 
##$RELAX= 
##$RELAX= 
##$RELAX= 
##$RELAX= 
$$ Bruker specific parameters
$$ --------------------------
##$DU= <C:\u>
##$EXPNO= 14140
##$NAME= <ADRS>
##$PROCNO= 1
##$TYPE= <nmr>
##$USER= <dgb>
##$AMP= (0..31)
100 100 100 100 100 100 100 100 100 100 100 100 100 100 100 100 100 100 
100 100 100 100 100 100 100 100 100 100 100 100 100 100 
##$AQSEQ= 0
##$AQ_mod= 3
##$AUNM= <au_zg>
##$AUTOPOS= <3 >
##$BF1= 250.13
##$BF2= 250.13
##$BF3= 250.13
##$BF4= 250.13
##$BF5= 500.13
##$BF6= 500.13
##$BF7= 500.13
##$BF8= 500.13
##$BYTORDA= 1
##$CFDGTYP= 0
##$CFRGTYP= 5
##$CHEMSTR= <none>
##$CNST= (0..31)
1 1 145 1 1 1 1 1 1 1 1 1 1 1 1 1 1 1 1 1 1 1 1 1 1 1 1 1 1 1 1 1 
##$CPDPRG= <>
##$CPDPRG1= <>
##$CPDPRG2= <>
##$CPDPRG3= <>
##$CPDPRG4= <mlev>
##$CPDPRG5= <mlev>
##$CPDPRG6= <mlev>
##$CPDPRG7= <mlev>
##$CPDPRG8= <mlev>
##$CPDPRGB= <>
##$CPDPRGT= <>
##$D= (0..31)
0 1 0 0 0 0 0 0 0 0.06 0 0 0 0 0 0 0.0002 0 0 0 0 0 0 0 0 0 0 0 0 0 0 
0 
##$DATE= 1136364379
##$DBL= (0..7)
120 120 120 120 120 120 120 120 
##$DBP= (0..7)
150 150 150 150 150 150 150 150 
##$DBP07= 0
##$DBPNAM0= <>
##$DBPNAM1= <>
$$ [...]
##$SUBNAM7= <"">
##$SUBNAM8= <"">
##$SUBNAM9= <"">
##$SW= 20.6930455092707
##$SWIBOX= (0..15)
0 0 3 0 0 0 0 0 0 0 0 0 0 0 0 0 
##$SW_h= 5175.983436853
##$TD= 65536
##$TD0= 1
##$TE= 293.16
##$TE2= 300
##$TE3= 300
##$TEG= 300
##$TL= (0..7)
0 120 120 120 120 120 120 120 
##$TP= (0..7)
150 150 150 150 150 150 150 150 
##$TP07= 0
##$TPNAME0= <>
##$TPNAME1= <>
##$TPNAME2= <>
##$TPNAME3= <>
##$TPNAME4= <>
##$TPNAME5= <>
##$TPNAME6= <>
##$TPNAME7= <>
##$TPOAL= (0..7)
0.5 0.5 0.5 0.5 0.5 0.5 0.5 0.5 
##$TPOFFS= (0..7)
0 0 0 0 0 0 0 0 
##$TUNHIN= 0
##$TUNHOUT= 0
##$TUNXOUT= 0
##$USERA1= <user>
##$USERA2= <user>
##$USERA3= <user>
##$USERA4= <user>
##$USERA5= <user>
##$V9= 5
##$VALIST= <valist>
##$VCLIST= <CCCCCCCCCCCCCCC>
##$VD= 0
##$VDLIST= <DDDDDDDDDDDDDDD>
##$VPLIST= <PPPPPPPPPPPPPPP>
##$VTLIST= <TTTTTTTTTTTTTTT>
##$WBST= 1024
##$WBSW= 4
##$XGAIN= (0..3)
0 0 0 0 
##$XL= 0
##$YL= 0
##$YMAX_a= 740205
##$YMIN_a= -643311
##$ZGOPTNS= <>
##$ZL1= 120
##$ZL2= 120
##$ZL3= 120
##$ZL4= 120
##$ABSF1= 16.44765
##$ABSF2= -4.245522
##$ABSG= 5
##$ABSL= 3
##$ALPHA= 0
##$AQORDER= 0
##$ASSFAC= 0
##$ASSFACI= 0
##$ASSFACX= 0
##$ASSWID= 0
##$AUNMP= <proc_1d>
##$AZFE= 0.1
##$AZFW= 0.1
##$BCFW= 0
##$BC_mod= 0
##$BYTORDP= 0
##$COROFFS= 0
##$CY= 12.5
##$DATMOD= 1
##$DC= 0
##$DFILT= <>
##$DTYPP= 0
##$F1P= 14.0000005364418
##$F2P= -0.99999901652339
##$FCOR= 0.5
##$FTSIZE= 32768
##$FT_mod= 6
##$GAMMA= 0
##$GB= 0
##$INTBC= 1
##$INTSCL= 1
##$ISEN= 128
##$LB= 0.3
##$LEV0= 0
##$LPBIN= 0
##$MAXI= 10000
##$MC2= 0
##$MEAN= 0
##$ME_mod= 0
##$MI= 0
##$NCOEF= 0
##$NC_proc= -3
##$NLEV= 6
##$NOISF1= 0
##$NOISF2= 0
##$NSP= 0
##$NTH_PI= 0
##$NZP= 0
##$OFFSET= 16.44765
##$PC= 1
##$PHC0= 83.46814
##$PHC1= 6.145889
##$PH_mod= 1
##$PKNL= yes
##$PPARMOD= 0
##$PSCAL= 4
##$PSIGN= 0
##$REVERSE= no
##$SF= 250.130018594407
##$SI= 32768
##$SIGF1= 0
##$SIGF2= 0
##$SINO= 400
##$SIOLD= 32768
##$SREGLST= <1H.CDCl3>
##$SSB= 0
##$STSI= 32768
##$STSR= 0
##$SW_p= 5175.98343685301
##$SYMM= 0
##$S_DEV= 0
##$TDeff= 65536
##$TDoff= 0
##$TI= <Analysis number 999999
Compound Code 99
Book Reference 9
Project Code 9>
##$TILT= no
##$TM1= 0
##$TM2= 0
##$TOPLEV= 0
##$USERP1= <user>
##$USERP2= <user>
##$USERP3= <user>
##$USERP4= <user>
##$USERP5= <user>
##$WDW= 1
##$XDIM= 32768
##$YMAX_p= 285774318
##$YMIN_p= -57004
$$ End of Bruker specific parameters
$$ ---------------------------------
##NTUPLES= NMR SPECTRUM
##VAR_NAME=  FREQUENCY,     SPECTRUM/REAL,   SPECTRUM/IMAG
##SYMBOL=    X,             R,               I
##VAR_TYPE=  INDEPENDENT,   DEPENDENT,       DEPENDENT
##VAR_FORM=  AFFN,          ASDF,            ASDF
##VAR_DIM=   32768,         32768,           32768
##UNITS=     HZ,            ARBITRARY UNITS, ARBITRARY UNITS
##FACTOR=    0.157963299565203, 1,           1
##FIRST=     4114.0512278085, 0,             0
##LAST=      -1061.93220904451, 0,           0
##MIN=       -1061.93220904451, -57004,      0
##MAX=       4114.0512278085, 285774318,     0
$$ Real data points
##PAGE= N=1
##DATA TABLE= (X++(R..R)), XYDATA
$$ [...]
15900A46660n6860l4050k1390l468r519j4605J755k152P747N232L666j2105q672
15887B239j5729J003m8O339J4076j3433j5569J7942J1809j0858N820j0922K039
15874e292M579J043q01j8074n90N038l334m60N866q46Q394p156o353j0251r70
15859b9207R518M537n440j652J1971j4938j6481k505J7806j1011p091J6189R303
15846a9001J2683J4744q906k2107L464J2995n786J2843P840j2116k514K10L688
15833a963j3647l401q54J1079R558k2918o771J0036J0191r293q34o428K158J2561
15819a0526Q697N6Q943J008m675K86O790r613p818o310n689K773q725N49J8937
15804e317R851r306k0456k854J0k419J737L836N770R391L816P700k1600j2764
$$ plain form
15900 146660 89800 55750 34360 30892 21373 6768 8523 6371 14118 19350 23016 10911 2239
15887 2239 -13490 -12487 -12535 -6196 7880 -5553 -21122 -3180 8629 -2229 3591 -7331 -5292
15874 -5292 -713 330 -471 -18545 -19135 -14097 -17431 -17891 -12025 -12871 -4477 -11633 -17986 -28237 -29207
15859 -29207 -19689 -15152 -20592 -22244 -10273 -25211 -41692 -44197 -26391 -37402 -44493 -28304 -19001
15846 -19001 -6318 8426 -480 -22587 -19123 -6128 -11914 929 8769 -3347 -5861 -5651 -1963
15833 -1963 -15610 -19011 -19865 -8786 772 -22146 -28917 -18881 -8690 -17983 -18817 -25245 -23087 -10526
15819 -10526 -1829 -1773 7170 8178 3503 3789 10579 966 -6852 -13162 -18851 -16078 -24803 -24254 -5317
15804 -5317 4534 -4772 -25228 -28082 -28072 -30491 -28754 -24918 -19148 -9757 -5941 1759 -19841 -32605
15790c2605L605J855K1774k945j3029j1941o40M519J3367R420p638o822O153J1571
15776c356j559M428j1508M727l220j5713L015J342J1673P809Q807n808J0511j922
15762I226j1438j579q794m647L757J1432m241L114J637j3533q00N567j6855O493
15748b0661N700J4631J8729j6611k3169p203P08N271M146n956K096o548r641Q112
15734c0396J2551O246K045q143p677J645j4297O564P753K074j0094j7643m705
15721e4077R656J4141Q233j654P908K763m60l22P92p479l303N497J568N980K3492
15706A2735j094l403j3730k025k560o287j1979L494n963k548J4979Q899Q367R842
15692H727j7730j6992J458q614l928K823j969P643L541m261J608m035K621K265
$$ plain form
15790 -32605 -29000 -27145 -5371 -8316 -21345 -33286 -33926 -29407 -16040 -6620 -14258 -21080 -14927 -3356
15776 -3356 -4915 -487 -11995 -7268 -10488 -26201 -23186 -21844 -10171 -2362 6445 637 11148 9226
15762 9226 -2212 -3791 -12585 -17232 -13475 -2043 -6284 -3170 -1533 -15066 -15866 -10299 -27154 -20661
15748 -20661 -14961 -330 18399 1788 -21381 -28584 -27876 -22605 -18459 -24415 -22319 -28867 -38508 -30396
15734 -30396 -17845 -11599 -9554 -17697 -25374 -23729 -38026 -31462 -23709 -21635 -31729 -49372 -54077
15721 -54077 -44421 -30280 -22047 -23701 -15793 -13030 -13490 -13812 -13020 -20499 -23802 -18305 -16737 -10757 12735
15706 12735 11641 8238 -5492 -7517 -10077 -16364 -28343 -24849 -30812 -33360 -18381 -9482 -1115 8727
15692 8727 -9003 -25995 -24537 -33151 -37079 -34256 -36225 -28582 -25041 -29302 -27694 -31729 -29108 -26843
15678b6843J3829o45j461J7951N759j0669R894j252j5845r848q516N858J1146
15665a0642O467m890o201k672M909J1864r13r339r989l744J3555K314l30j400
15651a1011o29J5356N595J291O462j3471n153j898J551m965q55R436M678o517
15637a30m034J2528j2296j6812j1575p852N915J6421O207K926l52n404k878Q647
15623h689O701O28j149m589o172j026l955n016q279N898K2311J846r894o759m287
15608b2431L054P178L270n388N944R817O898P300r056j1525k721k491J3835J9342
15594B3026r081r293j034K398O558k263j6042p361J6572Q032Q817m425j1601j2223
15580g920Q8p900J3464J1054q886k589k174k4459j9764j582J4600J7623j4876
$$ plain form
15678 -26843 -13014 -13659 -15120 2831 8590 -2079 7815 6563 -9282 -19130 -27646 -21788 -10642
15665 -10642 -4175 -9065 -15266 -17938 -13029 -1165 -2078 -11417 -21406 -25150 -11595 -9281 -9611 -11011
15651 -11011 -11640 3716 9311 10602 17064 3593 -1560 -3458 -1907 -6872 -7727 1709 6387 -130
15637 -130 -4164 8364 -3932 -20744 -32319 -40171 -34256 -17835 -11628 -8702 -9054 -14458 -17336 -8689
15623 -8689 -1988 -1360 -2509 -7098 -13270 -14296 -18251 -23267 -31546 -25648 -3337 -1491 -11385 -18144 -22431
15608 -22431 -19377 -12199 -8929 -14317 -8373 1444 8342 15642 6586 -4939 -7660 -10151 3684 23026
15594 23026 13945 4652 3618 6016 12574 10311 -5731 -13092 3480 11512 20329 15904 4303 -7920
15580 -7920 -7832 -15732 -2268 8786 -100 -2689 -4863 -29322 -49086 -50668 -36068 -18445 -33321
15567c3321m122J2359J9132o458q837J1749O991j724p126l258p26o918J3140J0114
15553I95n699k916m097K582O766P698p793q006J0044J7765J2397P85m447L304
15539B9378J6690J4691j758l482K1163Q108j264K839Q703K5251O1968P0628P8623
15526C31538J00983J77782K69230L65171M77384M87639K96328k9889l28844m71289
15516A676033m73063l70681k64796j74408j09283q0878n8916l2716k0274j2315
15506G8703k5172r89P602K045l756q932j3939j06Q761N567m907j0696Q559j214
15492D1526q31M039Q388J3928k4p451J2101L486J8996O191R437N981L1721M6997
15478A94485N0956N5591R5169J55607K41807L52235M44061M58613L31304L7674
$$ plain form
15567 -33321 -37443 -25084 -5952 -12410 -21247 -9498 -2507 -4231 -11357 -14615 -15341 -22259 -9119 995
15553 995 -4704 -7620 -11717 -9135 -2369 5329 -2464 -10470 -426 17339 29736 30521 26074 29378
15539 29378 46068 60759 59001 55519 76682 84790 83526 86365 95068 120319 182287 252915 331538
15526 331538 432521 610303 879533 1244704 1722088 2209727 2506055 2476166 2147322 1676033
15516 1676033 1202970 832289 567493 393085 283802 202924 144008 111292 91018 78703
15506 78703 53531 52542 60144 62189 58433 49501 35562 35456 44217 49784 44877 34181 42740 41526
15492 41526 40695 44734 53122 67050 67026 59575 71676 75162 94158 100349 109786 115767 147488 194485
15478 194485 245441 301032 396201 551808 793615 1145850 1589911 2048524 2379828 2417502
15468B417502k60806m45702m60055l74120k75119j88346j15585p9002n5490l4578
15458A28699k8865k9898k7119j9752R450J671r13r12j0590k0577l88o740n350
15445a1284O6P444p36p668k577J6786l128j7453j8238m897O784J146J284J0294
15431b2177j433K985q14K185p697j72n701j7921J1685J3045P537N971R922N10
15417b075P507m19K801Q113l509N32j0237m128j854o991J7155J0879q530p934
15403A310n681N38l329k682R148j401N04l349P498p024O68J0498L555j4649j1337
15388a5733J8399R426j2747r933m169j4176N713n03K181M975J722l906Q31J0286
15374g634P886p896N43L205n522j0644K985L617q369r034j675Q495N434J3306
$$ plain form
15468 2417502 2156696 1710994 1250939 876819 601700 413354 297769 218767 163277 128699
15458 128699 99834 69936 42817 23065 32515 34186 33273 32361 21771 1194 806 -5934 -11284
15445 -11284 -11218 -3774 -4510 -12178 -14755 2031 -1097 -18550 -36788 -41685 -34901 -33755 -32471 -22177
15431 -22177 -23610 -20625 -21439 -19254 -26951 -27123 -32824 -50745 -39060 -26015 -18478 -12507 -2585 -2075
15417 -2075 5432 5013 7814 15927 12418 12950 2713 -1415 -3269 -10260 6895 17774 9244 1310
15403 1310 -4371 -3833 -7162 -9844 -696 -2097 -1593 -4942 2556 -4468 -3800 6698 10253 -4396 -15733
15388 -15733 2666 12092 -655 -10588 -14757 -28933 -23220 -23723 -21542 -16567 -14845 -18751 -17920 -7634
15374 -7634 252 -7644 -7101 -3896 -9418 -20062 -17077 -13460 -21829 -30863 -32538 -24043 -18609 -5303
15360e303j1230J0944m865j7668p149N704J1733J5355K967m564p507j4755K508
15347b3830R226J1289N54J465j3216RQ002P802j4026q218K32J5334P561o31k749
15332a196O328n842p789j3037P274j382k051j387j3103N144J0324J0012m868k534
15318a4107j3460j5251Q732J7282J8395m429m717j165j261k606l71R16L126K934
15304e982m930M234M449j1796N794p794m859J2998J2388p762J927J072K156O06
15290B501q022j2488K883M402o524J7907n654j7950P042O795l809J0182P168o078
15276a645o728k8p49j2768j0576P981P912l696l954K522J7720O911K46M863m611
15261C400q992r889K0361r89j0298j6324K262O276L034j6551r318L079M739J4191
$$ plain form
15360 -5303 -16533 -5589 -10454 -28122 -35271 -29567 -17834 -2479 488 -4076 -11583 -26338 -23830
15347 -23830 -14604 -3315 -2761 -1296 -14512 -14503 -6501 1301 -12725 -20943 -20711 -5377 2184 1553 -1196
15332 -1196 5132 -710 -8499 -21536 -14262 -15644 -17695 -19082 -32185 -27041 -16717 -6705 -11573 -14107
15318 -14107 -27567 -42818 -34086 -16804 1591 -2838 -7555 -8720 -9981 -12587 -12958 -12042 -8916 -5982
15304 -5982 -10912 -6678 -2229 -14025 -8231 -16025 -20884 -7886 4502 -3260 -1333 -261 1895 2501
15290 2501 -5521 -18009 -15126 -10724 -17248 659 -4995 -22945 -15903 -9108 -12917 -2735 4433 -1645
15276 -1645 -8373 -8401 -9150 -21918 -32494 -24513 -16601 -20297 -24251 -21729 -4009 2902 3148 8011 3400
15261 3400 -5592 -15481 4880 3891 -6407 -22731 -20469 -14193 -11159 -27710 -37028 -33949 -29210 -15019
15247a5019J5380p494k267m239L908J5270o117j2772l624N723K649K138J937J0890
15233F363O111j2386k4765K178K133M083J7571p85k4171j1579R250J6069K1559
15220A1631l340j5059J0149q354j4113j2245K310J4622j803o750K083J2024p288
15207a6133J669J3532n808p806j8404q857N258k278L136J5269P911M273j130j158
15193a0526M964r61j713o101q360r412N313J2163J1835l253q533j7196K612K2737
15179f431j653m322R48l402l223J69N740n295j0940q187Q557Q849J2185j621j4736
15164b3362j6810l424Q461m046n319L656r19Q890R279P562J0808O903k7417j8175
15150d3913n951J2585K4504j0066n089K486K564k627J650P820k12P196O921p675
$$ plain form
15247 -15019 361 -7133 -9400 -13639 -9731 5539 -578 -13350 -16974 -11251 -8602 -6464 -4527 6363
15233 6363 12474 88 -24677 -22499 -20366 -16283 1288 503 -23668 -35247 -25997 -9928 11631
15220 11631 8291 -6768 3381 -4973 -19086 -31331 -29021 -14399 -16202 -22952 -20869 -8845 -16133
15207 -16133 -14464 -932 -6740 -14546 -32950 -41807 -36549 -38827 -35691 -20422 -12511 -8238 -9368 -10526
15193 -10526 -5562 -6523 -8236 -14337 -22697 -32109 -26796 -14633 -2798 -6051 -14584 -31780 -29168 -6431
15179 -6431 -8084 -12406 -11458 -14860 -18083 -17914 -12174 -17469 -28409 -36596 -28039 -19190 -7005 -8626 -23362
15164 -23362 -40172 -43596 -35135 -39181 -44500 -40844 -41763 -32873 -23594 -16032 -5224 1679 -25738 -43913
15150 -43913 -49864 -37279 -12775 -22841 -27930 -25444 -22880 -25507 -23857 -16037 -16249 -9053 -2132 -9807
15136i807q019K510J829l428k874M38n29m781j363K137J1726N943j2013L265J4567
15121c99Q095K897j0754j799j1622j4825m361J2174J3115l556J826P283n388Q52
15107f462j0586K91K247K706m06r861o114n317R708L392Q556J2170N176N724k422
15092H802L878J524K706R19r62o030j3440q461N439j608O26o581k372j91n607
15077b1358l08M846J1566N657k779n413k249J6135O569j3573k91J2739q65k547
15063H129P403q04m066n189m782P223j1715R605N523j7655q836j2063r758R724
15049b7261R891R025q294n173J1026o308j654k387M791M378j779r729l911L426
15035b3959k04q85M397K812l707o344J2951l75R693k508l966p235o55K355M328
$$ plain form
15136 -9807 -17826 -15316 -13487 -16915 -19789 -19351 -19880 -24661 -26024 -23887 -12161 -6218 -18231 -14966 -399
15121 -399 7696 10593 -161 -1960 -13582 -28407 -32768 -20594 -7479 -11035 -9209 -1926 -7314 -6462
15107 -6462 -17048 -16757 -14510 -11804 -12210 -22071 -28185 -33502 -23794 -20402 -11846 324 5500 11224 8802
15092 8802 12680 14204 16910 17829 16867 10837 -2603 -11064 -5625 -7233 -6607 -13188 -15560 -15751 -21358
15077 -21358 -21666 -16820 -5254 403 -2376 -7789 -10038 6097 12666 -907 -1198 11541 10676 8129
15063 8129 15532 14728 10662 5473 691 7914 -3801 5804 11327 -6328 -15164 -27227 -36985 -27261
15049 -27261 -17370 -8345 -16639 -21812 -10786 -17094 -18748 -21135 -16344 -11966 -13745 -23474 -27385 -23959
15035 -23959 -24163 -25048 -20651 -17839 -21546 -27890 -14939 -15314 -5621 -8129 -12095 -19330 -19985 -17630 -13302
15020a3302l991j4298k39M248O595O323m383K169j0057q012J2339R658L295L120
15006f535r827m16o45j3866j0339J0549L537R094J2380p432p820o939j0275j567
14992d0101L471L107J8868o198O334K218k709k860o713K151k562l20p244K115
14978c0443J0668m061j283J4844K213M156L632r494m318k566n14j0615N239J5365
14964g177K966R808Q235K33k1485p653O700q66j413n480J591M567j4945k377Q3
14949b7213K5413J5045q048p203k348j0033P481O597k0080r34J2156J3281N927
14936A0041N05L096p475o480j0689M704K790m836P970J1782j00j190j3267n67
14922c716N831k385o95q39N340j1941j4508m149R83m823p854J2658J6696l127
$$ plain form
15020 -13302 -17293 -31591 -31830 -27582 -20987 -14664 -19047 -16878 -26935 -34947 -22608 -12950 -9655 -6535
15006 -6535 -16362 -16778 -17423 -31289 -41628 -31079 -27542 -18448 -6068 -13500 -21320 -28259 -38534 -40101
14992 -40101 -36630 -33523 -14655 -20853 -14519 -12301 -15010 -17870 -24583 -22432 -24994 -25314 -32558 -30443
14978 -30443 -19775 -23836 -25119 -10275 -8062 -3906 -274 -9768 -14086 -16652 -17166 -27781 -22542 -7177
14964 -7177 -4211 5597 13832 14065 -7420 -15073 -8373 -9239 -10652 -16132 -14541 -9974 -24919 -27296 -27213
14949 -27213 -1800 13245 5197 -2006 -4354 -14387 -6906 -309 -20389 -21323 -9167 4114 10041
14936 10041 10546 13642 6167 -313 -11002 -6298 -3508 -8344 -374 11408 11308 10118 -3149 -3716
14922 -3716 2115 -270 -965 -1804 3536 -8405 -22913 -27062 -26079 -30902 -38756 -26098 -9402 -12529
14908a2529n602l754j271M643k657N8o44r57j2063o723Q600j545j130N27J214
14893c3833K19R10l58m079Q429o51j889J2800J4146j005k510K873K115M721K423
14878D311K896K24L910J243j3014q348M256O152k766j1132j696M979j592K676
14864g901M721k715j0841j3388R739J6855p342J60Q788q01L209R37o08l986M330
14849A157J5181k040j048j9537q52k772m753L334J9203R17j5022j1444R609L755
14835d312j6115m449m470k00J0321J0379q857n281J8879J3716n968R659R635j396
14821B1541k704j2169j5667k435k849j0923Q944r79k424L930k826O43J3710P628
14807C420M230j331r131j3151j1404J2416o813k014q757J876L378l491j237Q484
$$ plain form
14908 -12529 -18131 -21885 -23156 -18513 -21170 -21112 -21756 -22713 -34776 -41499 -32899 -34444 -35574 -35047 -33833
14893 -33833 -33614 -32704 -33062 -37141 -28712 -29363 -31252 -18452 -4306 -5311 -7821 -4948 -2833 1888 4311
14878 4311 7207 7431 11341 12584 -430 -8778 -4522 1630 -1136 -12268 -13964 -8985 -10577 -7901
14864 -7901 -3180 -5895 -16736 -30124 -20385 -3530 -10872 -10712 -1924 -2725 484 1421 813 -3173 1157
14849 1157 16338 14298 13250 -6287 -7139 -9911 -14664 -11330 7873 8790 -6232 -17676 -8067 -4312
14835 -4312 -20427 -24876 -29346 -29546 -19225 -8846 -17703 -22984 -4105 9611 3643 13302 22937 21541
14821 21541 18837 6668 -8999 -11434 -14283 -25206 -16262 -17241 -19665 -15735 -18561 -17918 -4208 3420
14807 3420 7650 6319 -2812 -15963 -27367 -14951 -21764 -23778 -32535 -30659 -27281 -30772 -32009 -23525
14793b3525j337J8696p707k737P033Q135j8043j5289Q131L867R439j709j185K0894
14779D663P874j1915m528r594j0175M392J3999O44n944l542k93k830l751k928
14765b3928j0905Q938R053j132O952k700L794r78p575K593k700o146M207k167
14751b2694K956N904L664r164q922p834M523P54J0453L92p817P514J2813N746
14737a712K728q796j2946j2364Q624M305m318J2263K644J5709O258J130q657j470
14723C398l476J4j4315L988O942j5068k4348K063J1115k748j4055Q726M391J727
14709c1646K660J1573p659j7000R591Q431n808J2110J0240n985k732P51n844J976
14695a9342J2702K265o439q047J0294M536Q890j770k541j613K82q481j3463l468
$$ plain form
14793 -23525 -24862 -6166 -13873 -16610 -9577 -1442 -19485 -34774 -26643 -22776 -13337 -15046 -16231 4663
14779 4663 12537 622 -3906 -13500 -23675 -19283 -5284 -4640 -10584 -14126 -14419 -17249 -21000 -23928
14765 -23928 -34833 -25895 -16842 -17974 -11022 -13722 -9928 -10906 -18481 -15888 -18588 -24734 -20527 -22694
14751 -22694 -19738 -13834 -10170 -19334 -28256 -36090 -31567 -30813 -20360 -19968 -27785 -20271 -7458 -1712
14737 -1712 1016 -7780 -20726 -33090 -24466 -20161 -24479 -12216 -9572 6137 12395 13525 4868 3398
14723 3398 -78 -64 -14379 -10391 -3449 -18517 -42865 -40802 -29687 -32435 -46490 -37764 -33373 -31646
14709 -31646 -28986 -17413 -25072 -42072 -32481 -24050 -29858 -17748 -7508 -13493 -16225 -15474 -21318 -19342
14695 -19342 -6640 -4375 -10814 -18861 -8567 -4031 4859 3089 548 -1065 -783 -9264 -22727 -26195
14681b6195L007J7704J4223n884K424r97n307l1P605o164j3627l750J9299J0712
14667A3019j344j910J6345j803j2925j1026P267l259p795J144l698k3305k522
14654c1812Q031l583j526K537R702J385O025k642j0427M74L677l492K580K415
14640a6656j4752P669Q642p929q337J032k122m285J7805K3300k194r360j3748
14627b0935L879k217P859M501K596L036j2217m569J1992k816P064M937O000j404
14613G706q071L023P795J0999j2492q768M983q226l056L412k895P0j322p983l556
14598a8381K576O226O509J0481j6752j2036K6285J5354k814j538k632r720o02
14585B956O667O591j0561j6536j5862j7462J1156J5811n329J2356J2378J0419
$$ plain form
14681 -26195 -23188 -5484 8739 2855 5279 4282 -1025 -1056 6549 385 -13242 -16992 2307 13019
14667 13019 11675 9765 26110 24307 11382 356 7623 4364 -3431 -2287 -5985 -29290 -31812
14654 -31812 -23781 -27364 -28890 -26353 -16651 -15266 -9241 -11883 -22310 -21836 -18159 -21651 -19071 -16656
14640 -16656 -31408 -23739 -15097 -23026 -31363 -30331 -32453 -36738 -18933 4367 2173 -7187 -20935
14627 -20935 -17056 -19273 -11414 -6913 -4317 -1281 -13498 -18067 -6075 -8891 -1827 3110 9110 7706
14613 7706 -365 2658 10453 21452 8960 192 5175 -3051 -6107 -2695 -5590 -5520 -6842 -14825 -18381
14598 -18381 -15805 -9579 -3070 7411 -9341 -21377 4908 20262 17448 15910 13278 3558 2956
14585 2956 9623 16214 5653 -10883 -26745 -44207 -33051 -17240 -22569 -10213 2165 12584
14573A2584Q811j3380n563j6649J699p770j1573J4918K4515O091j3992L85q053
14560g977O340J2225j369j0687M115j35r798N248p127o923M104N244p402L379
14546a0763M742P958Q133k225K709n456j2261N082M432k018k309n860r055j537
14532a8428m236k275O146K0219K458l720J0280o778r293O424q90j7338J08j1847
14518b9170j5619K91J8109J7978L932o420M348O290j266O503p087r791R029N632
14504B759k476m78k799P498Q364j7710j6028m768m732P885m656M832N961O439
14490i909O480j1344j4681N47r559n813J533P946J4998J3555J0518j4223j154
14477a1106j2746p18J0133P786L778p468p811J252j2483j6866J462J8922l224
$$ plain form
14573 12584 21395 8015 2452 -14197 -12498 -20268 -31841 -16923 7592 13683 -309 76 -7977
14560 -7977 -1637 10588 9219 -1468 2647 2512 -7286 -2038 -9165 -16088 -11984 -6740 -14142 -10763
14546 -10763 -6021 1937 10070 7845 10554 5098 -7163 -2081 2351 333 -1976 -7836 -16891 -18428
14532 -18428 -22664 -24939 -18793 1426 3884 164 10444 3666 -5627 797 -93 -17431 -17323 -29170
14518 -29170 -44789 -44498 -26389 -8411 -4479 -10899 -6551 -261 -1527 4976 -2111 -11902 -2873 2759
14504 2759 283 -195 -2994 4504 12868 -4842 -20870 -25638 -30370 -22485 -27141 -22309 -16348 -9909
14490 -9909 -3429 -14773 -29454 -28907 -38466 -44279 -42746 -34800 -19802 -6247 4271 -9952 -11106
14477 -11106 -23852 -24570 -14437 -6651 -2873 -10341 -18152 -16900 -29383 -46249 -44787 -25865 -29089
14464b9089J549J4921k054j8143R463J1034N139m729p596j560Q055J8651q188
14451b547O631O201j1181o347J2427Q831j151j2900J07Q783j2394j6118J3586
14438f072j160K287O820k855J290p497m813m081m59j837p047k719J7471O182k795
14423g285j3313p080N354J6270J507l006k192j8J2005M587o007J159m144K0235
14409A8072P429j8844Q71P787p70j1194q058R675J730o764L238N85J458j0213
14395d998r8O683m644j6312k575P779J7326J1089J560k563k430p199p118j3903
14381a7403l307N241O729P111m856q495q575J2966l286O624O580k982p332n041
14367a6026O427K531M837K570L364l715m64K834q725j1649M647q351j742r49P957
$$ plain form
14464 -29089 -27540 -12619 -14673 -32816 -23353 -12319 -7180 -11909 -19505 -21065 -13010 5641 -2547
14451 -2547 4084 10285 -896 -7243 5184 14015 12864 -36 71 8854 -3540 -19658 -6072
14438 -6072 -7232 -4945 1875 -980 310 -7187 -12000 -16081 -16540 -18377 -25424 -28143 -10672 -4490 -7285
14423 -7285 -20598 -27678 -22324 -6054 -4547 -7553 -9745 -9763 2242 6829 822 1981 -2163 18072
14409 18072 25501 6657 7528 15315 14545 3351 -4707 4968 6698 -66 3172 3757 5215 -4998
14395 -4998 -5096 1587 -3057 -19369 -21944 -14165 3161 14250 15810 13247 10817 3618 -3500 -17403
14381 -17403 -20710 -15469 -8740 -1629 -6485 -14980 -23555 -10589 -13875 -7251 -671 -3653 -10985 -16026
14367 -16026 -9599 -7068 -2231 339 3703 -12 -476 2358 -6367 -18016 -13369 -21720 -23462 -24411 -16454
14352a6454Q535L512n00m438j1314l976k144J9999J5976O632m022m860o117r86
14338a57j0748O973J0434j005P48L596j933r944k492K834l464j133o99j1068M629
14323a3429J1706M252J030R390M998j4272r192N885K155K561m89o584j3553P836
14309g706J4747J889K221j2433j420R319P676J568L484N403p650N738l669m369
14295A4798o638l229J3302l954o834j812q85k526k4276o462P249J851J60L946
14281a5310J9393j474l103o546Q387l036j1084L080R070O147J0249J01j4550K119
14267C443k009j7185j4252J6240M693L160J0922l389M876J2520J6423J4293j5008
14254C4727k6557j7003O157j567l19M06r093J471N27Q693m78q143p551Q508L653
$$ plain form
14352 -16454 -7919 -4407 -4907 -9345 -20659 -24635 -26779 -6780 9196 15828 11806 6946 829 -157
14338 -157 -10905 -3932 6502 5497 6245 9841 7908 -2036 -4528 -1694 -5158 -6291 -6990 -18058 -13429
14323 -13429 -1723 2529 3559 12949 17947 3675 -5517 368 2523 5084 4595 -1989 -15542 -7706
14309 -7706 7041 8930 11151 -1282 -2702 6617 14293 15861 19345 24748 17098 22836 19167 14798
14295 14798 8160 4931 18233 14279 7445 5633 4748 2222 -22054 -28516 -21267 -19416 -19256 -15310
14281 -15310 4083 2609 -494 -7040 1347 -1689 -12773 -9693 -623 5524 15773 15874 1324 3443
14267 3443 1434 -15751 -30003 -13763 -9070 -5910 5012 1623 6499 19019 35442 49735 34727
14254 34727 8170 -8833 -2676 -4243 -4562 -4156 -13249 -11778 -11251 -2558 -3036 -11179 -18730 -10222 -6569
14239f569j460k584o303r392M219J1097j816p6K788N525K47j0508J3435J0966
14225I569N151j8262L776O502j0774j416r266k504o025p764K1046J0466l066m539
14211g106l767M105M366K209k064Q777N108l660r163p025M405K581p691j1369
14197b0294M514O170J021P20l18M035J72J5093j7q509o243J356j75M686M09L811
14181F431O439q940j7536j3561j127L445l274M086O645L897n818l167O450L948
14167a2082J4739N281m091n922r805j0094j0859k350M042P790O070N169n53j825
14153a4490J26R820J389J0637l937K647L895N232l388l322j3272j5352p163n029
14139c2207J4302L405L543n447Q502L04p47J444N849L362j3693M756M638K131
$$ plain form
14239 -6569 -8029 -10613 -16916 -26308 -22089 -10992 -12808 -12884 -10096 -4571 -4324 -14832 -1397 9569
14225 9569 14720 -3542 234 6736 -4038 -5454 -14720 -17224 -23249 -31013 -9967 499 -2567 -7106
14211 -7106 -10873 -6768 -2402 -193 -2257 6520 11628 7968 -1195 -8220 -3815 -1234 -8925 -20294
14197 -20294 -15780 -9610 -8589 -7869 -8187 -4152 -3980 11113 11096 2587 -3656 -2300 -2475 2211 2620 6431
14181 6431 12870 3930 -13606 -27167 -28294 -24849 -28123 -24037 -17392 -13495 -19313 -22480 -16030 -12082
14167 -12082 2657 7938 3847 -2075 -11880 -21974 -32833 -35183 -31141 -23351 -17281 -12112 -12665 -14490
14153 -14490 -14364 -4544 -3155 7482 3545 6192 10087 15319 11931 8609 -4663 -20015 -27178 -32207
14139 -32207 -17905 -14500 -10957 -16404 -7902 -7598 -8345 -6901 -1052 2310 -11383 -6627 -1989 142
14125A42k778K866m086L54p832M665Q944n93r352j3400p209O349J1140M014O811
14110C5m66j0297m704N954P206J503M73p699n004r67M155O165K14p008J1300J0538
14094A1398m279n069n159O220J150l167j2085j1903Nk228R915J3571p316r140
14080a8087J0021n545N321o350J0060J3445R22m563J706n118L087O863l992o903
14066H67n704R170N739r927l019l891L602L602R061J3012m471n552K217r917p772
14051b983N763K50r475m743k417P238K334l496L190J647o770M148o465J9836J5322
14036B3379r612k7208r246J41n799k739o314M906K68J713J5740O330L47J4281
14022F187K0446R816r287j637n156n898r062j0496J4629q548O355O439j9624k900
$$ plain form
14125 142 -2636 230 -3856 -3502 -11334 -6669 2275 1682 -7670 -21070 -28279 -21930 -10790 -6776 35
14110 35 -431 -10728 -15432 -9478 -2272 -769 -296 -7995 -12999 -13966 -9811 -3646 -3432 -10440 860 11398
14094 11398 7119 2050 -3109 3111 4261 1094 -10991 -22894 -22889 -25117 -15202 -1631 -8947 -18087
14080 -18087 -8066 -13611 -8290 -14640 -4580 8865 9787 5224 6930 1812 4899 11762 7770 867
14066 867 -4837 4333 10072 145 -2874 -6765 -3163 439 9500 22512 18041 12489 14706 4789 -2983
14051 -2983 2780 3030 -6445 -11188 -13605 -6367 -4033 -7529 -4339 -2692 -9462 -5314 -11779 8057 23379
14036 23379 13767 -13441 -22687 -22546 -28345 -31084 -37398 -32492 -32224 -30511 -14771 -8441 -8094 6187
14022 6187 26633 36449 27162 25525 20369 14471 5409 -5087 9542 994 7349 13788 -5836 -8736
14008h736O562p370l587K146L523J471M082Q834Q64j206l369l795J0978Q310r850
13993H857p443L808m042J444m879J5558M328j4619j1996l910J171N095o89J4558
13979G241p045k602k187R296N662P128J912j309J706J2868p318n395k10j6541
13965C206l679J1705n847q246K279R181P025m113k2624J3385m377j3362J0489
13952d978m384m721R871P52n998j777M420J0646R803o650l405o649q071J475J1246
13937A580K882p006N531L822n0k205k767J1260K273o714k632J952J1539K08j4521
13922E152o135L210j013J0932L219j2596j5894j2778O967K871J4389k656r37J0741
13908E472p353K56q408r657l455J5746J066N871m924j82r642R588m54M321O491
$$ plain form
14008 -8736 -2174 -9544 -13131 -10985 -7462 -5991 -1909 6925 7789 6583 3214 -581 10397 18707 8857
13993 8857 1414 5222 1180 2624 -2255 13303 17631 3012 -8984 -12894 -11723 -6628 -7317 7241
13979 7241 196 -2406 -4593 4703 10365 17493 19405 18096 19802 32670 25352 19957 19747 3206
13965 3206 -473 11232 5385 -2861 -582 8599 15624 11511 -11113 2272 -2105 -15467 -4978
13952 -4978 -9362 -14083 -4212 -3460 -9458 -11235 -6815 3831 13634 6984 3579 -3070 -11141 -9666 1580
13937 1580 4462 -2544 2987 6809 6759 4554 1787 13047 15320 8606 5974 7926 19465 19673 5152
13922 5152 -983 2227 1214 12146 15365 2769 -13125 -25903 -18936 -16065 -1676 -4332 -5269 5472
13908 5472 -1881 -1625 -10033 -19690 -23145 -7399 -6333 -462 -5386 -5568 -15210 -5622 -6076 -1755 4736
13893D736J581J638q91j432j4731N814K205M529K0425J7099r690j8330J209j52
13879A4010j1657j0036K317K447K218r039j0666l360J209J0782J6063q159R369
13866E498j6652k5281L032J4905J6585K409j5213O267p14l399j33m379P101m841
13852a4815j1744J4002J8228q743j8833K145J3258N359m653m107J4431J1493l785
13839A2236j3638j4847p828o110l597k481O913P974J0430J6353o67m868J6269
13826A6139J468j2845n332O788j736j7639m608M692p053j1125l513J6065J1397
13813g302K331k617j2020j90M420j99P751P706P418Q01m542m203K916P153j3778
13798d355j6073m469k639R716K679M424n781m58O289J816p624r702Q414L394J2394
$$ plain form
13893 4736 6317 7955 7064 5632 -9099 -3285 -1080 3449 23874 40973 31283 12953 14162 14010
13879 14010 2353 -7683 -5366 -2919 -701 -9740 -20406 -23766 -22557 -11775 4288 -3871 5498
13866 5498 -11154 -36435 -33403 -18498 -1913 496 -14717 -8450 -9164 -12563 -12696 -17075 -9974 -14815
13852 -14815 -26559 -12557 5671 -3072 -21905 -19760 -6502 -1143 -5796 -9903 4528 16021 12236
13839 12236 -1402 -16249 -24077 -30187 -33784 -36265 -29352 -21378 -10948 5405 4738 -130 16139
13826 16139 17607 4762 -570 6218 4482 -13157 -17765 -13073 -20126 -31251 -34764 -18699 -7302
13813 -7302 -4971 -7588 -19608 -19798 -15378 -15577 -7826 -120 7298 8099 3557 -646 2270 9423 -4355
13798 -4355 -20428 -24897 -27536 -17820 -15141 -10717 -16498 -16956 -10667 -8851 -16475 -26177 -17763 -14369 -1975
13783a975M56m412N915M76J0157M801j1369l944M012K980R012l090K289j405k694
13768A1209r529n432o487p165O920K0913J4079M718k403k438o532Q88K709L694
13754B5144o695j943J087l651L497K719J559N265Q78r771J3881M81k3845n155
13740C451j2447P477Q217M282K165n584L04p973k16Q585l129M61k830k857K9l180
13724c245n835M261K236Q405J2450o137n072J5863k74k7173j426N784J4230J09
13710A4176q977j7892j2604J5789K0493p281j7382m467K320M034J3701O326K271
13697A0507r514k867N2J1638R953j5252p749l379J1311R976M430P04R4r131j0290
13682D83l974o049Q026J0860j7939j6192J9939J9221r79N251j1580j106j671j0635
$$ plain form
13783 -1975 -1519 -5931 -16 460 10617 15418 4049 105 4117 7097 16109 13019 15308 13903 11209
13768 11209 1680 -3752 -10239 -17404 -10484 10429 24508 29226 26823 24385 17853 18741 21450 25144
13754 25144 18449 16506 17593 13942 17439 20158 21717 26982 27860 18089 31970 32451 8606 3451
13740 3451 -8996 -1519 6698 10980 13145 7561 7865 -108 -324 8261 5132 5593 2763 -94 -65 -3245
13724 -3245 -9080 -4819 -2583 5822 18272 12135 7063 22926 22652 -4521 -5947 -163 14067 14176
13710 14176 5199 -12693 -25297 -9508 10985 3704 -13678 -18145 -15825 -11791 1910 8236 10507
13697 10507 993 -1874 -1822 9816 19769 4517 -3232 -6611 4700 14676 19106 19810 19904 10773 483
13682 483 -3491 -9540 -1514 9346 -8593 -24785 -4846 14375 13396 18647 7067 5961 4290 -6345
13668f345j1084m316O773R858L726m802O158P071O173r912L431k580m142p415
13654g406o099K737M233J3895j0413o10J739R159q545j2897J91J196j0655J0724
13640a2751R534Q930J1r981k318p974Q928J1062o492l664J86L379j626R881r85
13625F120r679m081K246O436J1776j535j9340J651L594j2141j559J1079l657J8588
13611I498J3432J968j5738j5488o273J3671M878j037p42M471p011m907m463R219
13597A478n968p283J969J386kj6714K447J9220J6909q103k0475N07J1768k470
13583e331j2938R249J4878j2488o41J3419P213m202k347r072N336O61j0770M754
13569b279P583j60R716N947j685p665k845j0104j3654o105M729K595O121K698
$$ plain form
13668 -6345 -17429 -21745 -14972 -5114 -1388 -6190 -32 7039 13212 3300 6731 4151 9 -7406
13654 -7406 -13505 -10768 -6535 7360 -3053 -3663 -1924 7235 -1310 -14207 -14016 -12820 -23475 -12751
13640 -12751 -3217 5713 5724 -4257 -6575 -14549 -5621 5441 -1051 -4715 -4529 -1150 -2776 7105 6120
13625 6120 -3559 -7640 -5394 1042 12818 11283 -8057 -6406 -2812 -14953 -16512 -5433 -9090 9498
13611 9498 22930 24898 9160 -6328 -12601 1070 5948 4911 4169 8640 1629 -3278 -7741 1478
13597 1478 -4490 -11773 -9804 -8418 -8420 -25134 -22687 -3467 13442 5339 -15136 -14629 -2861 -5331
13583 -5331 -18269 -9020 5858 -6630 -7271 6148 13361 9159 6812 -2260 3076 3737 -7033 -2279
13569 -2279 5304 5144 14860 20807 19122 11457 8612 -1492 -15146 -21251 -16522 -13927 -7806 -5108
13555e108r682N522j1052o373Q300j016J2964N327k524j4036J083J522k111M616
13541a2568L178J0016J0424r17j7102J066j2770m135J3984J312L412L100Q515
13528G515M097M105j903O852L295k312r112k856M922L243L717Q694q146o480m263
13513A1368l886m815o597J031Q064o975m546j0701J3723J8435k83k1114q874J1506
13499c664Q537l453R55j0877l176R714q463j408R43R775l841j3386J3808J5388
13485A0852M529l690l556p2m398R502R766j4263q864M416K62k562k751l996l518
13470h343J1349o42J4310l483j2754Q526N646o987J37r87N281N997j2183q525
13456b658n762L066n781O859K5033l968k2809J844J4741o016j6186j0549J0488
$$ plain form
13555 -5108 -14790 -9268 -20320 -26693 -18393 -19409 -6445 -1118 -3642 -17678 -16595 -15073 -17184 -12568
13541 -12568 -9390 626 11050 10133 -6969 -5903 -18673 -22808 -8824 -7512 -4100 -1000 7515
13528 7515 11612 15717 13814 20666 23961 21649 12537 9681 14603 17846 21563 30257 22111 15631 11368
13513 11368 7482 2667 -3930 -2899 5165 -1810 -6356 -17057 -3334 15101 14818 -6296 -15170 -3664
13499 -3664 4873 1420 2375 -8502 -11678 -1964 -10427 -11835 -10892 -1117 -4958 -18344 -4536 10852
13485 10852 15381 11691 8135 8063 3665 13167 22933 8670 -194 4222 4484 1922 -829 -4825 -8343
13470 -8343 3006 2364 16674 13191 437 8963 14609 7622 7759 6772 12053 18050 5867 -2658
13456 -2658 -8420 -5354 -11135 -4276 20757 16789 -6020 -4176 10565 4549 -11637 -22186 -11698
13443a1698K8072J6024p029o839j0489j2202M717Q330p736k0121Q056P643k0845
13430b4117J1045J1039P650J2900J1893L273j0055n193q392o208L490Q03n739
13417B389J8904J540p749j176L828j2674j1727L957L257J247J885N669n979r22
13403B449K646L592J4978M681J439j3348r918N552l394J2900M48j2134P75N043
13389A5709M214m050O141p38k538j60j1495l451j2657L487J4281R534P864Q750
13375C4891j3591j503o756j0991n617O19J7593O374o629j1328l579O306R428j780
13361A3437Q420J0799j707m769l106n380o179r540J4063M326q555j6076Q670J333
13347E736k918J1006k530o479j2476P523J5178P519O6j2135n793k484J2765k62
$$ plain form
13443 -11698 16374 32398 25369 18530 8041 -4161 556 8886 1150 -18971 -10915 -3272 -24117
13430 -24117 -13072 -2033 5617 18517 30410 33683 23628 18435 10043 3835 7325 8128 2389
13417 2389 21293 22833 15084 13908 17736 5062 -6665 -2708 549 1796 3681 9350 3371 2449
13403 2449 5095 8687 23665 28346 29785 16437 6519 12071 8677 21577 22025 9891 10666 15709
13389 15709 19923 15873 22014 21276 18738 18578 7083 3632 -9025 -5538 8743 18277 26141 34891
13375 34891 21300 19797 13041 2050 -3567 -2948 14645 21019 14390 3062 -517 5789 15217 13437
13361 13437 21857 32656 30949 26180 23074 17694 11515 1975 16038 20364 11809 -4267 4403 5736
13347 5736 2818 13824 11294 4815 -7661 -138 15040 22559 22625 10490 4697 2213 14978 14716
13333A4716J0361R685k721o022J073k62o079j0584K388L064R687N013r51p820
13319B1548k266o287j0499n038J1180n005j855P304K813p749J0660Q89m283N787
13305A7199j188p573K1950J1823p107j8415j1427j690L399K999j0027k732L308
13292E19L270J1518J1319j4406j171l377k462J2206l507M772R650k048L780o065
13278B3998j3165j0327L485P173J3172J8364M364q988r614n731k0808q751J069
13265e759R116J3736j284J882l395j5234p46l54K7329J0058k856j1691j2778J39
13251H163n954n034J8022J2342o744k423P030l502l651q577L84M023P232q206
13237A3105m317J1052j0993R9J029o701k272J8003o772M878J3135R280j0260p252
$$ plain form
13333 14716 25077 34762 32041 26019 27092 26830 20751 10167 12555 15619 25306 30319 29368 21548
13319 21548 19282 12995 2496 -2542 8638 3633 1778 9082 11895 4146 14806 15695 11412 17199
13305 17199 16011 8438 30388 42211 35104 16689 5262 3572 6971 9970 -57 -2789 519
13292 519 3789 15307 26626 12220 11049 7672 5210 17416 13909 18681 28331 26283 30063 23998
13278 23998 10833 506 3991 11164 24336 42700 47064 38076 28462 22731 1923 -6828 -5759
13265 -5759 3357 17093 15809 17691 14296 -938 -1684 -2038 25291 35349 32493 20802 8024 8163
13251 8163 2209 -2825 15197 27539 20795 18372 25402 21900 18249 9672 10056 14079 21311 13105
13237 13105 8788 19840 8847 8946 9975 3274 1002 19005 12233 17111 30246 39526 29266 22014
13223B2014M819o880r844N124j935L095j654r140K752J3079M985J366j3172N993
13209B0602J271O840O068j3401j0954m421j5331j1273J4733j991m961J5599J3628
13196A6409q100R357J4042P508j8153j3249M504Q93J3977J6876p453k967k4568
13183I076n586N271m864N037K1489J0897k9979l2846p816Q505J5816q24L585O635
13169D396p725n717J1850R413J8046Q207j0920n724J083Q98O655J85J335j3474
13155A8508r160r421j609K635Q073l486r021j3850J0422Q742J1013j0106n234
13142b494J2335n06R75k100M396J0087j081n110O712J8204m252o657J681n915
13128B6275j311K854j538r598r121J340K405p525J293n21K1416J2748n101j6614
$$ plain form
13223 22014 26833 19953 10109 15233 13298 16393 14739 5599 8351 21430 26415 27781 14609 20602
13209 20602 21873 28713 34781 21380 10426 6005 -9326 -20599 -5866 -7857 -12818 2781 16409
13196 16409 8309 17666 31708 39216 21063 7814 12318 13211 27188 44064 36611 33644 9076
13183 9076 3490 8761 3897 8934 30423 41320 11341 -21505 -29321 -20816 -5000 -5824 -2239 4396
13169 4396 -3329 -9046 2804 12217 30263 38470 27550 21826 22909 23807 30462 30647 31982 18508
13155 18508 9348 -73 -1682 953 9026 5540 -3481 -17331 -6909 1833 12846 2740 -2494
13142 -2494 9841 9335 10310 8210 12606 22693 21612 16502 23214 41418 37166 30509 32190 26275
13128 26275 24964 27818 26280 16682 7561 8901 11306 3781 5074 4553 25969 38717 33616 17002
13114A7002j6497P867K193r892j614J1417k547l972o298j1260P680J4139L008
13101A1226m90m344O540J0354R993p874o95Q247p036j0457p283m333k292J0123
13087A1679p17q732J39K0920J3731o209j5540n740j399l67J6336j547L92K0766
13073D3712o102k0917R346K452p577k348P410k869L381n9O487o712j420n752M573
13058B3605L232J0030n733m755p895m240Q805Q79J35k412J678L494j848j0106
13044A4869K778j111N77O906N262M832j860J3386o538j3394k3884n145J1512J0070
13030A8260l132J0240j281m448L354j4705P050J998M999L253R373K712j636k620
13016C3417J4060l918k667j5130j1201J306J8889o692j1149M991J006j1295P45
$$ plain form
13114 17002 505 8372 10565 673 -941 10476 7929 3957 -2341 -13601 -5921 8218 11226
13101 11226 10736 6392 12932 23286 33279 25405 24710 32957 25921 15464 8181 3848 1556 11679
13087 11679 10962 2230 2369 23289 37020 30811 15271 9531 8132 7765 24101 22554 22946 43712
13073 43712 37610 16693 26039 28491 20914 18566 25976 23107 26488 26429 32916 26204 24784 19032 23605
13058 23605 26837 36867 31134 26379 18484 14244 23049 23928 24063 21651 23329 26823 24975 14869
13044 14869 17647 16536 17113 24019 29281 34113 32253 45639 39101 25707 1823 -3322 8190 18260
13030 18260 15128 25368 24087 19639 22993 8288 15338 17336 22335 25588 34961 37673 36037 33417
13016 33417 47477 43559 40892 25762 14561 15867 34756 28064 16915 21906 22912 11617 12362
13003A2362l441P342J0145M551j266r300L339p801M569J1337R341p822j0053n553
12989A7750K996l256l267O540J0507j6596o319L214k319J1705m233l690q910J528
12975E650N344l232k368J1251J0597Q059l724k213M150l955m220M517P824l769
12961C3911k1346o807M526N063J0929j5016j8120J4834L231M795J5339q507o738
12948A6094M632O658K675n72k1878J508K346P338N771J8180L295j2576j1641J4109
12934C5939N851r719j1658j965J3129J0589o363K464j0983j949P102o393m005
12921B2039M88j727q734J2716r59K77k862O106N172j2158L500Q973J0686j2409
12907C1108o144j391M007l254r658J471N455M383p349k912k07l340J311J0119
$$ plain form
13003 12362 8921 16263 26408 30959 29693 20393 23732 15931 20500 31837 41178 33356 23303 17750
12989 17750 20746 17490 14223 20763 31270 14674 8355 11569 9250 20955 16722 13032 4122 5650
12975 5650 10994 7762 5394 16645 27242 35301 31577 29364 33514 29559 25339 29856 37680 33911
12961 33911 12565 5758 10284 15347 26276 11260 -6860 7974 11205 16000 31339 22832 16094
12948 16094 20726 27384 30059 29487 7609 9117 11463 18801 24572 42752 46047 33471 21830 35939
12934 35939 41790 32071 20413 18448 31577 42166 35803 38267 27284 25335 32437 26044 22039
12921 22039 22527 20800 12066 24782 23823 24100 21238 27344 32516 20358 23858 32831 43517 31108
12907 31108 24964 23573 27580 24326 14668 16139 21594 25977 18628 15716 15509 12169 13480 23599
12893B3599N225m807L812k572n157J4641J3233o381P651k155j4767j844j700Q35
12879B9613K2K1936Q080k6575j6765k106R654O616K765R316r777p106J736p913
12865A9496j4467L838r435J0897J4497M677L650P982J533O868j779j9299j3964
12852A4494J0593L442M2O489k392Q564N997L489Q991M5j526K898q15m703p620
12837D7988j5325k015P846L410j844r975n184K101K079N100L82n504J8025J5939
12823F3023L291J380q69j2355r861r851K5100M631j1525j1751p064J0494j014
12810D3629J870p53Q057j7391l007J6542M657j362k0119n249j160k225P096Q907
12796C9492j729J0525Jj7728J781O692k753N433J430r355r051J2960J739l088
$$ plain form
12893 23599 28824 24017 27829 25257 20100 34741 47974 41593 49244 47089 32322 30478 28778 29613
12879 29613 29635 51571 59651 33076 16311 14205 23859 30475 33240 42556 32779 25673 27409 19496
12865 19496 5029 8867 -568 10329 24826 29503 33153 41135 42668 49536 47757 28458 14494
12852 14494 25087 28529 28571 35060 32668 41232 47229 50718 59709 59754 58228 61126 60311 55608 47988
12837 47988 32663 30648 38494 41904 40060 30085 24901 27002 29081 34181 34563 29059 47084 63023
12823 63023 66314 67694 66825 54470 44609 34758 59858 64489 52964 41213 34149 44643 43629
12810 43629 45499 44746 52803 35412 32405 48947 53604 52242 32123 26874 25714 23489 30585 39492
12796 39492 37763 48288 48289 30561 32342 39034 36281 41714 43144 33789 24738 37698 39437 36349
12782C6349J5868o093O787N415N022o031M31J7878k50M286j4078j541N291q221
12768F1113k1120p572M131j815K942J453J282P121K293o11p835p48l566N429J4288
12753E6785p58O192O468m590j2047j4611R544l358j579O178J8377K078j1946k947
12739E3786j026K663j935M531r554p81J2398m981j1908P240o834J380P901m718
12725D8162j2617J3011J5410o23K689q594J2248q081q428r77J0980k014l882m606
12711E2678J723L583j3016q19J0942N728O168K041m623J2413j2485K204o335p78
12697E9424K458P419k466j3990R985N852j0055l661J56k181l042M65J473L551
12683E5388J3276M954k026j0029j198M698P250J372j009j4232n535K0857n45J693
$$ plain form
12782 36349 52217 46124 52911 58326 63348 57317 57748 75626 75376 79662 65584 64043 69334 61113
12768 61113 39993 32421 36552 34737 37679 39132 40414 47535 49828 49217 41382 40634 37068 42497 56785
12753 56785 56027 62219 68687 64097 52050 37439 46983 43625 42046 48224 66601 68679 56733 53786
12739 53786 52760 55423 53488 58019 48465 47684 60082 55101 43193 50433 43599 44979 52880 48162
12725 48162 35545 48556 63966 63343 66032 57438 69686 61605 53177 52200 63180 61166 57284 52678
12711 52678 54401 57984 44968 44149 55091 60819 66987 69028 64405 76818 64333 66537 60202 59424
12697 59424 61882 69301 66835 52845 62830 68682 58627 54966 55122 52941 49899 50364 51837 55388
12683 55388 68664 73618 71592 61563 60365 65063 72313 73685 72676 58444 52909 73766 73221 74914
12669G4914L266r063j2689n130J3871K2965p708p849O84l99O94R582j564n558
12655G6016n216r133o769J273m063M105J5201J5560J165J0275K0148J9809K0185
12642A58556K5557P529r695j3775p267k3726m4513j0018m568O474K2483M905j2229
12629I9713O186O778j3671j3156k638J7009J8328J2656Q374m232K092p166j1391
12616A18882J2857K6949J6198J5166J7822O981r175k1434n863k2280j8192p329
12604A30582n101J7083q491O76N602p79r201K60l593l789j364n061m328J1369
12590A23865K472q84L449K0373J0550O205K8672M7058P0139Q6944P1456J5894
12578D86193l2535o2961p8325n8236n0424k8500j8956r305j6494O05J931P248
$$ plain form
12669 74914 78180 69117 56428 51298 65169 88134 80426 72577 73261 72862 73556 83138 81574 76016
12655 76016 70800 61667 54898 56171 52108 56213 71414 86974 88139 98414 118562 138371 158556
12642 158556 184113 191642 181947 168172 160905 137179 92666 82648 78080 84554 107037 111942 99713
12629 99713 105899 112677 99006 85850 83212 100221 118549 131205 139579 135347 137439 130273 118882
12616 118882 131739 158688 174886 190052 207874 214855 205680 184246 178383 156103 137911 130582
12604 130582 125481 142564 134073 134749 140351 139572 130371 130631 127038 123249 121885 116824 112496 123865
12590 123865 126337 125453 128902 149275 159825 166030 194702 241760 311899 398843 470299 486193
12578 486193 453658 390697 312372 254136 203712 175212 156256 146951 130457 131062 132993 140241
12566A40241q372j2786m272P790J0382j0342j8160K924L218L248M714J627K2342
12553A42554K3266J3695K0090L5593M8557P1406Q0706J9248n0131m9236l4426
12542C21322j8997K3028L6984N7915J12849J96005K29059J01773r7364j88338
12532G74236k02329j45230q6194n2892l3375j6481k6377j7209K0489k193l405
12521B09040J2748R705Q956O878J8351K2615L1244L9075L0385M2265O2641O2517
12509E56420N6136O9146P6632R2322J12297J70540K09581J18021r9366k12385
12499A149344k06973j40189o4186r401L0968Q0529J42861K00745J65427j5517
12489A333608j60929k20099j74947j16637q8445m3733j4197N793k0369j8062O058
$$ plain form
12566 140241 131869 119083 114811 122601 132983 122641 104481 107405 110623 113871 118585 120212 142554
12553 142554 165820 179515 199605 235198 283755 355161 435867 455115 404984 355748 321322
12542 321322 302325 325353 362337 420252 533101 729106 958165 1059938 962574 774236
12532 774236 571907 426677 340483 287591 254216 237735 211358 194149 214638 212445 209040
12521 209040 221788 231493 240449 247327 265678 288293 319537 358612 388997 431262 493903 556420
12509 556420 612556 681702 758334 850656 962953 1133493 1343074 1461095 1361729 1149344
12499 1149344 942371 802182 737996 728595 759563 840092 982953 1183698 1349125 1333608
12489 1333608 1172679 952580 777633 660996 572551 528818 514621 520414 500045 481983 488041
12478D88041J0141m987J5325K9766J5376K9194M4125P9706J05047J13943R8289
12467A023966J20032J10511Q8002N7593J0484M259Q731O0729J16132J22416o4421
12456A658434k14250k64699k23037j30431p5919l8942M460L3411O0614O2073j3576
12445H58138n0849q3456r0666o6315n3301k5283j8179k1767p284j979P886l655
12433D43290k974m396L314J2089J0690O230K0589L8690M9262J7089J2300L0044
12421F36217n677k0206j9306l2912k0411J445J8001L7100N073n9536o9283o9885
12409D00620p1954l7912j7344j4520j9623k5954k6903l843O423J505m168k516
12397A83811M976p758L373K2721M843j0843k492N29N047J0146K274k2103p878
$$ plain form
12478 488041 498182 493195 508520 538286 553662 582856 626981 706687 811734 925677 1023966
12467 1023966 1143998 1254509 1342511 1400104 1410588 1414847 1423578 1484307 1600439 1722855 1658434
12456 1658434 1444184 1179485 956448 826017 750098 711156 715616 749027 809641 871714 858138
12445 858138 807289 723833 633167 566852 513551 488268 470089 448322 441038 439059 446945 443290
12433 443290 440316 435920 439234 451323 462013 468243 488832 527522 576784 593873 606173 636217
12421 636217 630540 610334 591028 558116 537705 539150 557151 594251 599324 539788 470505 400620
12409 400620 328666 290754 273410 258890 239267 213313 186410 182567 188990 190495 186327 183811
12397 183811 188787 181029 184402 207123 211966 201123 198631 199160 204207 214353 216627 194524 186646
12384A86646n924m589j897R902K343j1335O866N025j3922L467J4147Q129k132
12371A96726k1789r396O351p42K0317J5981j6812L805R850k2821k588J1642k015
12358A88509J653J1384j1998p851k027J0873J4397P815m642q050R030N882P29
12345B15704q934J4987L052Q558J1030J759j0410n975j2529o282O14l65k75j524
12331B09410J2936J3776N0M765N762m219Q792m017o949j422N161J5149Q115j7354
12317B49955m716Q947K0327p689L14O59R680L270m945L178k305J6781J2304Q352
12303C14112J701L034K232l787M341M427o228J773m338J4356J6442o565q653J365
12289C34212j8758p929j958J2410N628J846k780j7494J0459J4746K3438M724j329
$$ plain form
12384 186646 180722 176133 174236 184138 186481 175146 182012 187037 173115 176582 190729 198858 196726
12371 196726 174937 165541 171892 171150 191467 207448 190636 194441 204291 181470 178882 190524 188509
12358 188509 190162 201546 189548 181697 179670 190543 204940 212755 208113 200063 209093 214975 215704
12345 215704 206770 221757 224809 233367 244397 246156 235746 229771 217242 210960 211574 211209 210934 209410
12331 209410 222346 236122 236172 240937 246699 242480 251272 247255 240306 238884 244045 259194 267309 249955
12317 249955 245239 254186 274513 266824 267138 267797 277477 280747 275802 278980 276675 293456 305760 314112
12303 314112 315813 318847 321079 317292 321633 326060 319832 321605 317267 331623 348065 341500 332847 334212
12289 334212 315454 307525 305567 317977 323605 325451 322671 305177 315636 330382 353820 358544 357215
12276C57215K758k894J0940R144Q373J096L207o191m784N364P084q708j2115k384
12262C68105K943Q778l120j3575O726J6300J0614j3872k1039r34K7141J6053j5689
12249C88431j183p69j1259L552J3308L860R62q748r86K959P383J0018m963j4247
12235C88318j1215R586J0313J9718K2962R24q581o935j118J008O875J1523j069
12222D42309J293L353q22R63J4135N619k348j9144O661N842J0045j267r021j505
12208D56113Q365K1313J5457n508o99p227J7J2777L332N828J9315r506j1317J5693
12194E23953K8036N53n823k30m016k21P316M316o119M911L376J1885L1947K3213
12180F23097J8484J5171R190K3268J9608J9911L583J7928L1965K1108J8766J4171
$$ plain form
12276 357215 359973 357079 368019 377163 385536 386632 389839 383648 378864 384228 391312 382604 370489 368105
12262 368105 371048 379826 376706 363131 369857 386157 396771 382899 361860 360926 388067 404120 388431
12249 388431 387248 386479 375220 378772 392080 395940 396902 388154 387168 390127 397510 407528 402565 388318
12235 388318 377103 386689 397002 416720 439682 440606 432025 425090 423972 424980 431855 443378 442309
12222 442309 443602 446955 446133 447096 461231 466850 464502 445358 452019 457861 467906 466639 457618 456113
12208 456113 464478 485791 501248 495740 495041 487814 487831 500608 503940 509768 529083 519577 508260 523953
12194 523953 551989 552542 546719 546489 542473 542252 549568 553884 547765 552676 556052 567937 599884 623097
12180 623097 641581 656752 665942 689210 708818 728729 732312 750240 782205 803313 822079 836250
12168H36250R629O099m51j0940k514J3747O624N682J4338K1156J3482K0939K9524
12155I63565J5257K7972J9110J4700J8075K0802K1096K9785L9218M6419P0132
12144A286131Q3593J07273R2212J01150J16008J13550J10159J15221R3422O4776
12134B283495M0477K8879M410J0066K1160J863q933l2686l5307k3084K00L2567
12122B323107N9182Q4551J18864R8862P6860L2112J699k6944k5322l8647k7517
12111B676807j0023J6591N9336Q9851Q6222Q3702R6928R3940J21999J69268K03735
12100C688356K46037L08789L71595M04139M40173M50214M31055M20449M16712
12091G177519M13031M19992M30125M74777N26245N98968O63709P18280P70218
$$ plain form
12168 836250 845879 851978 851527 840587 838073 851820 858444 864126 878464 899620 913102 934041 963565
12155 963565 978822 1006794 1025904 1040604 1058679 1079481 1100577 1130362 1169580 1215999 1286131
12144 1286131 1369724 1476997 1569209 1670359 1786367 1899917 2010076 2125297 2218719 2283495
12134 2283495 2323972 2352851 2357261 2367327 2388487 2390350 2381417 2348731 2313424 2290340 2290540 2323107
12122 2323107 2382289 2466840 2585704 2684566 2761426 2793538 2795237 2768293 2742971 2704324 2676807
12111 2676807 2666784 2683375 2742711 2832562 2918784 3002486 3099414 3193354 3315353 3484621 3688356
12100 3688356 3934393 4243182 4614777 5018916 5459089 5909303 6340358 6760807 7177519
12091 7177519 7590550 8010542 8440667 8915444 9441689 10040657 10704366 11422646 12192864
12082A2192864P78062P68613P46336P17219P15224P93316R52884J240995J629398
12073B0534911K102538K720927L439578M353775N556283P011274Q499565R623721
12065F3842572R739428Q156658M709007N6912m363009p221816q019379p131690
12057E9768683n375350l455749j797664n21226L87110J080622J644659K062176
12049E3793261K272814K145041J645032R24200K77706l9615J03419O64098J499208
12040F3285164K359806L002802L158412K784131K012219J149731N20565L59547
12032G8632377P77518J711702L000615M462998O137555Q396318J1595557J5874976
12024A30589616K0525573K3859875K3454886J7474369O422860o485721j7171722
$$ plain form
12082 12192864 12970926 13739539 14485875 15203094 15918318 16711634 17664518 18905513 20534911
12073 20534911 22637449 25358376 28797954 33151729 38708012 45719286 54218851 63842572
12065 63842572 73582000 81738658 86447665 86504577 82141568 74919752 66900373 59768683
12057 59768683 54393333 50937584 49139920 48618694 49005804 50086426 51731085 53793261
12049 53793261 56066075 58211116 59856148 60780348 61058054 61018439 61121858 61785956 63285164
12040 63285164 65644970 68647772 71806184 74590315 76602534 77752265 78272830 78632377
12032 78632377 79409895 81121597 84122212 88585210 94722765 103119083 114714640 130589616
12024 130589616 151115189 174975064 198429950 215904319 222327179 215841458 198669736
12017A98669736k3022934k3875684k1260743j7137170j2880112r147157o136860
12010H5209076l799257j991706p48789p1094r721n78215j558650k584104l293910
12001G0573630l448453k988881k156733j249932n14970j09628j85613o71603j313304
11992E7934513j765242j859876j563641j032229m32777R5496O40370J372032K559001
11983E5947647M228162O183552P850337Q228836O536492K713277k294870o910368
11975H2483065r912594j0950759j0450747r031284p281163n564798m094413k947024
11967B2250283k087444j484841j031095p52825o03291n62549n86727o30884p12989
11958A3797638p85025q14854q15301p65348p06533o54450n87068n09349m56345
$$ plain form
12017 198669736 175646802 151771118 130510375 113373205 100493093 91345936 85209076
12010 85209076 81409819 79418113 78669324 78598230 78588509 78010294 76451644 73867540 70573630
12001 70573630 67125177 64136296 61979563 60729631 60214661 60105033 59919420 59247817 57934513
11992 57934513 56169271 54309395 52745754 51713525 51280748 51376244 52016614 53388646 55947647
11983 55947647 60175809 66359361 74209698 82438534 88975026 91688303 89393433 82483065
11975 82483065 72570471 61619712 51168965 42137681 34856518 29291720 25197307 22250283
11967 22250283 20162839 18677998 17646903 16894078 16290787 15728238 15141511 14510627 13797638
11958 13797638 13012613 12197759 11382458 10617110 9910577 9256127 8669059 8159710 7703365
11949G703365m23041m10432m06415m38274m34257m34158m24550l88726l28979
11940D014533k84796k23243j75543j45077j24831r6090o3128l5322k8883j088
11930B836532K6448M3332M1542M9013N4251M1083L1873j6518m5748o1564o7287
11919B932957q6935o3266m4774l9446j0230j8472L599j5684k7181k4887j2337
11908B593344p190k2495m4954n4559p0924j11617j16217j31415j28576j22066
11898A783331j24545j11969r0020r0124o8903m8595m6344m6473k5993k9577n458
11887A095330p92j790p553j7425l0824m5512m1512l8035l7121n1625m2072k488
11875G78581J973L407l0231k8216l4661l2308k2780j3901k2596l0628l8738k2506
$$ plain form
11949 7703365 7280324 6869892 6463477 6025203 5590946 5156788 4732238 4343512 4014533
11940 4014533 3729737 3506494 3330951 3185874 3061043 2964953 2901825 2866503 2837620 2836532
11930 2836532 2862980 2906312 2947854 2996867 3051118 3092201 3124074 3107556 3061808 3000244 2932957
11919 2932957 2846022 2782756 2737982 2698536 2688306 2669834 2673433 2657749 2630568 2605681 2593344
11908 2593344 2586154 2563659 2518705 2464146 2393222 2281605 2165388 2033973 1905397 1783331
11898 1783331 1658786 1546817 1456797 1366673 1297770 1249175 1202831 1156358 1130365 1100788 1095330
11887 1095330 1094538 1092748 1085195 1067770 1036946 991434 949922 911887 874766 823141 781069 778581
11875 778581 780554 783961 753730 725514 690853 658545 635765 621864 599268 568640 529902 507396
11863E07396j9267k5470l656j3005j5749k707J2035P901j4270k6013n977j6436
11851C84782k0501j6459q144L88o3j2167k3219j9263j4788L4L562j2804j2564
11838B48794q686L955q693j080O480M36q081l531j1573p617J69j2694p613Q376
11824A98642L040J792o049N400r534o224j873l949l053P077J9271p171j5515j1755
11810A70099r575j0155N557P716m134J0850j6019k0876o855j1959n758O35M344
11797A13870k092K563J3307m081m944M122J1426N8j4645j3757L850J267J2663
11784A23607m964k799j3735m902J4131N989q014n757L009J3836J142k3634k1647
11771G6262J1910N259L853O565j5972J989J497P939r506k397o366j1749m8O465
$$ plain form
11863 507396 488129 462659 459003 445998 430249 427542 439577 447478 433208 407195 401218 384782
11851 384782 364281 347822 339678 340066 340003 327836 304617 285354 270566 270600 274162 261358 248794
11838 248794 240108 244063 235370 234290 240770 241206 233125 229594 218021 210404 210573 197879 190266 198642
11824 198642 201682 203474 197425 202825 193291 187067 185194 181245 178192 185269 204540 197369 181854 170099
11810 170099 160524 150369 155926 163642 159508 170358 154339 133463 126608 114649 108891 109526 113870
11797 113870 111778 114341 127648 123567 118623 122745 134171 134229 119584 105827 109677 110944 123607
11784 123607 118643 115844 102109 97207 111338 117327 109313 103556 106565 120401 121543 97909 76262
11771 76262 88172 93431 97284 103849 87877 89866 91363 99302 89796 87399 81033 69284 69236 75701
11757G5701R229o823l001R742r143L09J445Q80J016K491M361p39O9p278j2364
11742F5895k167K0825j489j2869J1353J5246J70k991j496O165J62p762j0609o709
11728G3724p669m131q089j1032j5041R758K430j3436K3699J7713r46K351p463
11715F1868J694m254n39L262J3460K4099J2731p114j7609l238O099o902l299q247
11701G2011R28n370l04n47o747j652J447M481J010k395m301n866N537J3917j025
11686G1124j6173p503o238j0340K2057J4521o480j9539n666m059L040Q040L269
11673D6053o966l017J6997J0740p807j3581m974P432l260p856P755l209p55K0262
11659E7814k490j523l110O235r320q664J0732M922j825k816M337N976q185N54
$$ plain form
11757 75701 84930 78107 75106 84848 75705 76014 77459 78339 79355 81846 86207 85468 85537 78259 65895
11742 65895 63728 84553 83064 70195 81548 96794 96964 93973 92477 98642 98804 91042 80433 73724
11728 73724 66055 61924 53835 42803 27762 37520 39950 26514 50213 67926 66980 69331 61868
11715 61868 63562 59308 58769 62031 75491 99590 112321 105207 87598 84360 90459 83557 80258 72011
11701 72011 72939 67569 67265 66718 59971 58319 59766 64247 65257 62862 58561 52695 58232 72149 71124
11686 71124 54951 47448 41210 30870 52927 67448 60968 41429 35763 31704 34744 42784 46053
11673 46053 39087 36070 53067 63807 56000 42419 37445 44877 41617 33761 41516 38307 37552 57814
11659 57814 55324 53801 50691 56926 47606 38942 49674 54596 52771 49955 54292 60268 52083 52637
11645E2637o621J004J737o266n687P685M77l001K765M416O050O280k672L225j1434
11630E0595j5793N077O622K0100L2960K4713N175Q255J6251K4109K9665J7324
11618B25053K3143L4712M2126M0319L7520K4724K5352q513k9153k2749k3732l1025
11606C37777l0602L658j7176k3024o358L132o14k939K539k141J2249Q536K6649
11593C11686K6256K1672K3205J4756K3883J0352p11J1635M823J4100K954O028
11581D70639K454j3281j1497J1757K2181M8036O1671P8016J14746J15668J08037
11570A008427Q8564N4651p858o5938q9752j13128j15519j11165p5978n2267o2032
11559D58005p1551l5653j7810r790j628j124j3755J967J4405n551J943J7723J819
$$ plain form
11645 52637 46016 47020 48757 42491 36804 44489 44966 41965 44730 49146 55196 61476 58804 62029 50595
11630 50595 34802 39879 46501 66601 99561 124274 129449 137704 153955 178064 207729 225053
11618 225053 248196 282908 325034 365353 402873 427597 452949 444436 415283 392534 368802 337777
11606 337777 307175 310833 293657 270633 264275 267407 266793 263854 266393 264252 276501 285037 311686
11593 311686 337942 359614 382819 397575 421458 431810 431099 442734 447557 461657 464611 470639
11581 470639 473093 459812 448315 460072 482253 530289 591960 669976 784722 900390 1008427
11570 1008427 1096991 1151642 1143784 1077846 988094 874966 759447 648282 572304 520037 458005
11559 458005 386454 350801 332991 323201 321573 320449 306694 308661 323066 317515 319458 337181 339000
11546C39000m806m504k0982q471J1416K3291N440r101K027J2262J406l44M592
11533C51226J3997K1501J8763J5632K2431J8615Q607n435m0618k5125l2238n3967
11521C13389m1188m6367l1860j6691l0726k615r522k6021j3446m048m758k5420
11509F0727J2628Q229p305m020P534Q933q253j8913j8614M894J0119P223k851
11496F0331o403r606Kj4998r144Q19L804Q489q530k0615J556J3284J3956Q796
11482D1741J874j0872j1258J97j3873j616l963l5P623J2520M414J483j55P599
11468C5679P73J373q993j0962j1058J4856M310j5802j1771J0382Q325m354M305
11455A7063k544n494O861j888n060j431Q88J586R319p196m810R037J978m695m898
$$ plain form
11546 339000 334194 329690 308708 300237 311653 334944 340384 331283 333310 345572 346978 346634 351226
11533 351226 365223 386724 405487 421119 443550 462165 470772 465337 424719 399594 367356 313389
11521 313389 272201 225834 193974 177283 146557 143942 134420 108399 94953 90905 86147 60727
11509 60727 73355 81584 74279 70259 77793 86726 78473 59560 40946 45840 55959 63182 60331
11496 60331 53928 44322 44324 29326 20182 21001 24805 33294 24764 4149 5705 18989 32945 41741
11482 41741 43615 32743 21485 21682 7809 6193 2230 2195 9818 22338 26752 28235 28080 35679
11468 35679 36452 37825 28832 17870 6812 21668 25978 10176 -1595 8787 17112 12758 17063
11455 17063 14519 9025 15886 13998 8938 7507 8395 9981 19300 12104 7294 16331 18309 13614 8716
11440H716R989Q216j3036L76Q438n025j3154m509J0708N903j568o85P583J1397
11426C3349l689r532n709P870J816N162n073j4466p403r253j8624Q772M230J2424
11412a26J6682O180p225j9119j3709J7100O308J5201k102j4299O193j01j9418
11399h435M65M468L23k491J7087L93j1844k7172j961J3410O672o126q05J0635
11385e381J3857r749m16M958P790l756J2973L286n107K576l672o621l923l882
11371B933J380J0412M904O379n19j2956k3923m238L350M745O472q195K46J2920
11357C910K278j8627K573J4037L967j415K46j632J3051n573q695j809J8632O49
11343B1592l82J357l146j5052m840m504j1632l186L208k015Q298P182Q564k94
$$ plain form
11440 8716 18705 26921 13885 14261 22699 17674 4520 11 10719 16622 15054 14369 21952 33349
11426 33349 29660 20128 14419 22289 24105 29267 24194 9728 2325 -6928 -25552 -16780 -12550 -126
11412 -126 16556 22736 15511 -3608 -17317 -217 6091 21292 19190 4891 11084 10983 -8435
11399 -8435 -7970 -3502 -3179 -5670 11417 11810 -34 -27206 -29167 -15757 -9085 -15211 -16016 -5381
11385 -5381 8476 -1273 -1689 3269 11059 7303 20276 23562 18455 21031 17359 10738 6815 2933
11371 2933 4313 14725 19629 26008 25489 12533 -11390 -15628 -12278 -7533 -1061 -9256 -9010 3910
11357 3910 6188 -12439 -9866 4171 8138 6723 6969 5337 18388 12815 4120 2311 20943 21592
11343 21592 21210 22567 19421 4369 -471 -4975 -16607 -19793 -16585 -18600 -10302 -3120 5444 5150
11329E150p883j0822O177J8930M746n914o054j0827O294K85k131M944j857L798
11315D836L638O979j425J273O0o038j5824o224R62R814k574j0143n318J3157Q726
11300A899J0155J3125P881J1738j4793j9984P832j1366n727p482j8780L028J7330
11287e144J4752J5807j1794k4983N673J2873l284r566o249J3476q52O763L544
11274A1016K993j8547o966N797j0031R27J1581j537M501K548o557n589Q579Q318
11260G033k657k516j1156J5k265p951J2819K3338J1923p297j0991M790L331m952
11246A3464k513Q586n136m694P573m693q375j4169m39K231q25j447J1452q86J091
11231A220p373m042L766L899o530M077R453P467k821l731j478j2327p874j064
$$ plain form
11329 5150 -2733 -13555 -7378 11552 16298 10384 4330 -6497 -203 82 -2049 2895 1038 4836
11315 4836 8474 15453 14028 15301 15361 9323 -6501 -12725 -11763 -1949 -4523 -14666 -19984 -6827 1899
11300 1899 12054 25179 33060 44798 30005 10021 17853 6487 760 -6722 -25502 -22474 -5144
11287 -5144 9608 25415 13621 -11362 -5689 7184 3900 -5666 -11915 1561 709 7472 11016
11274 11016 14009 -4538 -11504 -5707 -15738 -14811 -3230 -4767 -266 2282 -4275 -9864 -1285 7033
11260 7033 4376 1860 -9296 -9281 -11546 -19497 -6678 16660 28583 21286 10295 15085 18416 13464
11246 13464 10951 19537 14401 9707 17280 12587 4212 -9957 -10396 -8165 -8990 -10437 1015 129 1220
11231 1220 -6153 -10195 -6429 -2530 -9060 -4983 4470 11937 9116 5385 3907 -8420 -16294 -17358
11217a7358J1940n465L132l899N697L688k705j251K082l76j0097J511K150P811
11203c140j3862j4068K264M987m506O563J8695K2280L545j4693k054k295j3790
11190a0074J179M278Q284J0161J516k298n636q686J284K712n163j870N450R60
11176B097J0795n296r49j1751R952k770j2630n615K834N03R776J595K34O626m326
11161A075P048k061M55j6509o115N124q12q03j983J120M09j364J755O335j1583
11146a7909Q11r10l224J6507j719j176K1491N763n593q017n359K745J100j425
11132C085k933J1757m970L178n683L782N503j906n444l278P746l262o139n026
11118c590m838O660J4417J2519j4350j1979j0852j0111n393J2732j825j6169M103
$$ plain form
11217 -17358 -5418 -10883 -7751 -11650 -5953 -2265 -4970 -6221 -4139 -4515 -14612 -13101 -10951 -3140
11203 -3140 -17002 -31070 -28806 -23819 -28325 -21762 -3067 19213 22758 8065 6011 3716 -10074
11190 -10074 -8895 -4617 3667 13828 15344 13046 7410 -1276 8 2720 -2443 -4313 1137 2097
11176 2097 12892 7596 6647 -5104 4848 2078 -10552 -16167 -13333 -12830 -3054 -1459 -1225 5401 1075
11161 1075 8123 6062 6517 -9992 -16107 -10983 -11795 -12598 -14581 -13461 -13052 -14416 -12661 -6326 -17909
11146 -17909 -17098 -18008 -21232 -4725 -6444 -7620 13871 19634 14041 6024 665 3410 4510 3085
11132 3085 152 11909 6939 10117 4434 8216 13719 11813 6369 3091 10837 7575 1436 -3590
11118 -3590 -8428 -1768 12649 25168 10818 -1161 -12013 -22124 -27517 -14785 -16610 -32779 -28676
11105b8676K1986K278m273k774J6532J1859n499J5032J5024j0769j3129j5933
11093A658q280L256R512J1379J467k427O048N248p097p841j1018n378M17P164
11079D108Q197l230m54M766l751m496L521Q44J46l872q20k185J1813j697n470
11064G420n572m280J1830P956J3580K202r08l070j3419j1553j1944P321J4380
11051A3943r257k729p689J52j650N918J5073J562j1371n927o86M871j4555j2244
11037b4589P780J8341J5633n965j5031j5164k502J2205n134k671J5466R411q413
11024f33m562m222N359J8193J477p228O729p92k983r407o924R090O00j1700m537
11009a1540O514o146M522j386n098N9J8262J5944k2837p602O102l090J79p917
$$ plain form
11105 -28676 -6690 -4412 -8685 -11459 5073 16932 11433 26465 41489 30720 17591 1658
11093 1658 -6622 -3366 6146 17525 18992 16565 22613 27861 20764 12923 1905 -3473 -3056 4108
11079 4108 12305 9075 8621 13387 9636 5140 8661 9505 9651 5779 4959 2774 14587 12890 7420
11064 7420 1848 -2432 9398 17354 30934 33136 32228 29158 15739 4186 -7758 -437 13943
11051 13943 4686 1957 -5732 -5580 -7230 -1312 13761 15323 3952 -1975 -2661 2210 -12345 -24589
11037 -24589 -16809 1532 17165 11200 -3831 -18995 -21497 -9292 -14426 -17097 -1631 7780 -633
11024 -633 -5195 -9417 -4058 14135 15612 8384 15113 14321 11338 1931 -4993 4097 4697 -7003 -11540
11009 -11540 -5026 -11172 -6650 -8036 -13134 -13075 5187 21131 -1706 -9308 -3206 -6296 -6117 -14034
10995a4034J907J6733j4731P973R104k122R80J2136N802q05j422j1887k888k591
10981D155J4974O693j3873n886R99k904n586M694j1320M050N694O123m899j181
10967A733J6351J6524K946r435j1354m636R20j2050l663K1949k017r68K02m819
10953A1683r836j3777k410J9846L232J2208k996k0174j3153N806O122J2729k679
10940F601K014N911P113j8532o088J0485k034p399O454J3273J729j0787o548m6
10926B146k692p127J017N704R844Q185j3543K991N936J1425L947j1330o795P294
10912A7002J7369R29R533j636m181N516l856j9138j0778N838J1431L153k954j1468
10898A6760m963p8j1796q073M396L694r246q071N667M493Q849P713K208K039N592
$$ plain form
10995 -14034 -12127 4606 -10125 -2152 6952 4830 5810 17946 23748 22943 21521 9634 6746 4155
10981 4155 19129 25822 11949 6063 7062 4158 -1428 3266 -8054 -4004 1690 7813 2914 1733
10967 1733 18084 34608 37554 28119 16765 12129 13049 999 -2664 19285 17268 16300 16502 11683
10953 11683 1847 -11930 -14340 5506 8738 20946 17950 -2224 -15377 -9571 -3449 9280 6601
10940 6601 8615 14526 21639 3107 -2981 7504 5470 -1929 4525 17798 19527 8740 2192 2146
10926 2146 -546 -7673 -6656 -952 8892 17077 3534 6525 12461 23886 27833 16503 9708 17002
10912 17002 34371 35300 44833 43197 39016 44532 40676 21538 10760 16598 28029 31182 28228 16760
10898 16760 11797 11719 -77 -8150 -3754 -60 -9306 -17377 -11710 -7217 1632 9345 11553 13592 19184
10883A9184O605K514q642j0706M808P104M32j287p809n740P040j461j0987j2207
10869a1152Q912J8978j2287l466M059M743J314O846m232M841N483j312M74j2673
10855A0528j1956R43l343O286j007K151O468M102j895m432k232n734N186O193
10841A1258L01O621m820q278p233O080j4345j068J2154k356k673m756J057J652
10827f406L960L952J4455k2j309K516n210n811N108o62m789O659J3564j2788r136
10812D081n273j599L140Q27L367M489J3159R596m757j2091P018K157p733o739
10798I642O112N036K733j2714r760j2537L595P817k023k248n2J405J4106R001
10784B0113l113n446J010P753L382m824q0M07N247m046l76L027q638k790K931
$$ plain form
10883 19184 25789 28303 19661 8955 13763 20867 21299 20012 12203 6463 13503 12042 1055 -11152
10869 -11152 -2240 16738 4451 985 5044 9787 11101 17947 13715 18556 24039 22727 23201 10528
10855 10528 -1428 -485 -3828 2458 1451 3602 10070 14172 12277 7845 5613 -121 5065 11258
10841 11258 11559 18180 13360 5082 -2151 3929 -10416 -11484 670 -1686 -4359 -9115 -8058 -6406
10827 -6406 -2446 1506 15961 15939 14630 17146 11936 6125 11233 10571 5782 12441 26005 13217 4081
10812 4081 -1192 -2791 349 1176 4543 9032 22191 31787 27030 14939 21957 24114 16381 9642
10798 9642 15754 20790 23523 10809 1049 -11488 -7893 -76 -2099 -4347 -4399 -2994 11112 20113
10784 20113 17000 11554 12564 20317 23699 18875 18795 19202 24449 20403 20027 23054 14416 11626 14557
10769A4557K48o298j414r321k061J1555N003M310q500q133N887J1460O904n625
10755A8572j8228L651O730J782m997n17M466k453j2456r54l75L72j781M32k629
10740h385O59P675P376r062p665J1783l470l905k966k288O34J1263n279q024M588
10725g066M468l981Q73r566J0077J0846M093j827L853J4612O070j8079j3148j3922
10711a2697O496Q044R26O543L163M538R422j9088j4172J404J8450J43m690k86
10697H196Q509j2725k499n672k367Q050M690J10k430l249J2135n932j2109M036
10683a257j023P23j339R28J6466M425m790K910l693J0836P844N46l024J7650j1300
10668C5902j683j7072r435J6258p233J628J182M529O171l673L392q048p229R4
$$ plain form
10769 14557 14805 8507 7093 -2228 -4289 7266 12269 16579 8079 -54 5833 17293 24197 18572
10755 18572 344 3995 10725 12507 7510 6993 11459 9006 -3450 -4404 -4779 -4407 -6188 -5756 -8385
10740 -8385 -7726 -51 7325 -1737 -9402 2381 -1089 -4994 -7960 -10248 -9614 1649 -3630 -11654 -7066
10725 -7066 -2598 -6579 -5706 -15272 -5195 5651 9744 7917 11770 26382 32452 14373 1225 -12697
10711 -12697 -6201 1843 2769 9312 12475 17013 26435 7347 -6825 -5421 13029 13172 8482 8196
10697 8196 16705 3980 1481 -4191 -6558 1492 6182 6292 3862 613 12748 6816 -5293 -1257
10683 -1257 -2280 -1557 -2896 -1968 14498 18923 14133 17043 13350 24186 32030 32576 29552 47202 35902
10668 35902 34219 17147 7712 23970 16737 18365 19547 24076 30247 26574 29966 21918 14689 14783
10654A4783K391P370o61j5037j2459P092n424J043L785J1548J1872J7376J19j1170
10640C2628j201n304q36o900p709o99N012l315j1505l856K35q54M444M979M710
10625I829K845l066q419J0039K1477L399j903j0613n481o138P92R476K874k626
10611B2485J6318P325l997p044j1666p736L243P684j9639j5531J6823P859J3146
10598B9270J0824k531n109o278o705Q01k466j3213j3774m97O250Q935J5994J3499
10584C5000j925o040l683o452j5238l282O458M538m673N24m983J6569r546o97
10570F570K5578M831j6613q128n56O960J1261j2753J8698J1359r613r971l7J3
10556B7599o612J5294K2054j4731j969K606l886j3013q48P755p034m483n619l280
$$ plain form
10654 14783 17174 24544 23883 8846 -3613 3479 -1945 -902 2883 14431 26303 43679 43798 32628
10640 32628 31427 26123 25287 18387 10678 9979 14991 11676 171 -3685 -3450 -4304 140 5119 9829
10625 9829 12674 9608 1189 11228 32705 36104 34201 23588 18107 11969 12761 22237 25111 22485
10611 22485 38803 46128 42131 35087 23421 15685 18928 26612 6973 -8558 8265 16124 29270
10598 29270 40094 37563 32454 26176 19471 20272 17806 4593 -9181 -9678 -3428 5507 21501 35000
10584 35000 33075 27035 23352 16900 1662 -1620 4838 9376 4703 5227 244 16813 7267 6570
10570 6570 32148 36979 20366 12238 11682 18642 29903 17150 35848 47207 37594 27623 27586 27599
10556 27599 20987 36281 58335 43604 41635 44241 40355 27342 26494 34249 27215 22732 17113 13833
10542A3833Q525M670J975J013n89j732Q827j4410q3j2170O13J0827M02J747J7661
10527D1109p212j2332N139J1616J458n992l653j914J964K198K012j263M629j62
10513C7597p605P397K507k376Q350j8059o331o690O529L565P71J939k738r610
10499A5246O10K0510q752n554q41m675j5703Q855M968N639L887J0022N148j6716
10485B2644j7233R350J6009q700k835J5219j432j0848l608N436N086p396L038
10472B4730k67L648R108J4419l646o230j611O287j6547j0912J767r662p061j159
10458B864L838k495J4042J907j55O60M24L609K185O444J3438m608m65m88j2990
10443B8210l613j775L938j3534q425J6884J3321j0459R813K2977K862j2510o991
$$ plain form
10542 13833 22358 27028 29003 30016 29427 27695 36522 22112 22029 9859 10472 21299 21701 23448 41109
10527 41109 33897 21565 26704 38320 39778 33786 30133 28219 30183 32381 34393 33130 37759 37597
10513 37597 29992 37389 39896 37520 45870 27811 21480 14790 21319 24884 25655 27594 24856 15246
10499 15246 15856 36366 27614 22060 21219 16544 841 9696 14664 20303 24190 34212 39360 22644
10485 22644 5411 14761 30770 22070 19235 34454 33022 22174 18566 24002 29088 21692 24730
10472 24730 24463 28111 37219 51638 47992 41762 40151 46438 29891 18979 20746 11084 4023 2864
10458 2864 6702 4207 18249 20156 20001 20661 21085 24694 26879 33323 46761 42153 41688 41200 28210
10443 28210 24597 22822 26760 13226 4801 21685 35006 24547 34360 57337 60199 47689 40698
10430D0698p371j7449k430J5455O383p689Q092j592j3909J5921Q012r536J378
10417C5963Q400j4376P293J291m397k666k920J0164r305J335r991l258K969N051
10403B5553N619K473r548J1404L237J283O39R17P878j683p988k2168O464J1356
10389C5436j958N874r563j5933l151J0544J2515j852O49M789J3474j548j0028
10376C9248L653J2178O105r650l32M59l441m09q584p450n995J6371J0775K605
10362E5533k295j4724r305J560l833j4437j055J2281O349Q50K849N326N669j0287
10348C4481L201M05k991j0577n010J468K1573P055m694K291J2729j253l214r494
10334D5970r97m129j3755J154J2329J4561O077n192j3228k476M727j4984R243
$$ plain form
10430 40698 33327 15878 13448 28903 35286 27597 35689 34097 20188 36109 44121 34585 35963
10417 35963 44363 29987 37280 38571 34174 31508 28588 38752 29447 30782 20791 17533 20502 25553
10403 25553 31172 33645 24097 35501 38738 40021 40660 41577 49455 47772 39784 17616 24080 35436
10389 35436 33478 39352 29789 13856 10705 21249 33764 31912 32561 37350 50824 49276 39248
10376 39248 42901 55079 61184 51534 51202 51661 48220 47811 39227 31777 25782 42153 52928 55533
10362 55533 53238 38514 29209 30769 26936 12499 11444 23725 30074 30924 33773 39099 44768 34481
10348 34481 37682 38087 35096 24519 19509 20977 42550 49605 44911 47202 59931 58678 55464 45970
10334 45970 44973 40844 27089 28243 40572 55133 61210 56018 42790 40314 45041 30057 39300
10321C9300J7344P48M116q342O22N658J2834j6592m295j692j85R362O256m971
10307F0163M98n690l593K2899M911k0373j2276j2095n842M051O870R368J0156
10294E9047J4126j790q159j2379l364P519J4101m611o711q851k36M664L867l818
10280E3405P416J2328J2380J3493j0164N187j091r562k0792q563r920j3515p127
10267B3475J8851J9769R114q624q509M616k0754P258K3189M012m935R121O851
10254H3434l153l81K783J8901K5711L0094K9059K9231K4187K8786N002j4557j9985
10241B39112k7484k4530j8844l3143k6185j0835o751O500p67q688J8977N132q581
10228A03913k513l498K081n791L577Q840l135P876L660n534j908P491J1504L1318
$$ plain form
10321 39300 56644 57392 61508 53166 53788 59446 72280 55688 51393 49701 49516 58878 65134 60163
10307 60163 60661 54971 51378 74277 79188 58815 46539 34444 28602 32653 39523 48891 59047
10294 59047 73173 71383 63224 50845 47481 55000 69101 64490 57779 48928 48692 53356 57223 53405
10280 53405 60821 73149 85529 99022 88858 94045 92954 83392 62600 54037 44117 30602 23475
10267 23475 42326 62095 71209 62585 54076 58692 37938 45196 68385 72397 67462 76583 83434
10254 83434 80281 79900 82683 101584 127295 157389 186448 215679 239866 268652 273654 259097 239112
10241 239112 211628 187098 168254 135111 108926 98091 91340 97840 97073 88385 107362 112494 103913
10228 103913 101400 97902 99983 94192 97769 106609 103474 111350 115010 109476 107568 115059 126563 157881
10214A57881R899J1018J6075K3319K2057M2655O3159P8574R2047R3837O6893M8157
10202G25571K9522K6433M4258J6264n9243j13048j25815j16824q6057o2199l9661
10191B39201k2430k0322j3293l783o604K188N968r589k4380n774R906J9554K0761
10178A91403J5314J409M362P964O285Q330J5305J6439J4774J6597K4308L9388
10166C61878N6595P6932J11980J11540J28779J14659J01397Q6113P5900M0300
10156A266073l0298o6936j54606j81965j63450j38267r6379o2530k2309k7546
10146C21787l5936k3967J779l358j9520j9459J466Q385M278j1176j2516j0724
10134B01039m458J46j845J6532J8366J4993P421J7895K1975L91q22J9351M4390
$$ plain form
10214 157881 167780 178798 194873 218192 240249 282904 346063 424637 516684 610521 677414 725571
10202 725571 755093 781526 825784 842048 782805 669757 543942 427118 341061 278862 239201
10191 239201 216771 196449 183156 179373 172769 174957 180925 171336 146956 141182 151088 170642 191403
10178 191403 206717 208126 212488 220452 226737 235067 250372 266811 281585 298182 322490 361878
10166 361878 418473 495405 607385 718925 847704 962363 1063760 1149873 1225773 1266073
10156 1266073 1235775 1168839 1014233 832268 668818 530551 434172 371642 349333 321787
10146 321787 285851 261884 263663 260305 240785 221326 222792 231177 235455 224279 211763 201039
10134 201039 196581 196727 194882 211414 229780 244773 252194 270089 292064 292455 291633 310984 355374
10121C55374P0381Q1724Q3266J17391J48149J32486Q5248P582o5147j12896j39193
10110G64365j37352j20095r3249n0850l4434k8769l2623k9755p999o798r942k0751
10098A91748j5355k796o925R91O903J5287J235k744m908j0353q412k876K0963
10085A82758K5010m143j4199n000m131L815K3816K8856J9457L3655M3637N0237
10073C83768N1977K5635J10k5553k0768n2179n2364l3515j8177r838k935k829
10061B43332j2443l799n084q457K245j2952k0710r331M550J1058M312N296O588
10048B04605J0899K024L77N169j0976P263J2703P203j7630r642k774J666J4274
10035B25161p089P698M858R721M612j3246j389R493J7086J2472m548k068j1952
$$ plain form
10121 355374 425755 507479 590745 708136 856285 988771 1074019 1081601 1016454 903558 764365
10110 764365 627013 506918 413669 362819 328385 299616 266993 237238 229239 222441 212499 191748
10098 191748 176393 173597 166672 167663 174566 189853 191088 188344 183436 173083 164671 161795 182758
10085 182758 207768 203625 189426 184426 180295 184110 207926 236782 256239 289894 333531 383768
10073 383768 435745 461380 461490 435937 415169 362990 310626 277111 258934 249096 246161 243332
10061 243332 230889 227090 222006 213549 215794 202842 182132 172801 177351 188409 192721 198017 204605
10048 204605 215504 217528 217905 223074 212098 219361 232064 239267 221637 211995 209221 210887 225161
10035 225161 218072 225770 230628 240349 244961 231715 230326 239819 256905 269377 264829 262761 250809
10022B50809K919L681J1439N35n323P268R203n103N892R359M135j4706j3749J321
10008B67680O653j6770q086J9634J1580J1362Q577K0887K2401P07q13j8220k0592
9995C05000o848o871n172j466o924L275J8038J0797Q800p118j4413P195L78j1895
9981B92776J075N837O789L687R084P493n522j0877l141r708k716J5490J9717N336
9967C35320P275j364k1445l479J954p367K278j475L683J605J2839K939j0845j2426
9953C09492J2936K3209N855n744L021o926j689Q10R523J8054L16j6128j1927K181
9939C42983L066J0791M205J0863K240J1532P099J256r900M355m954o824L668M640
9925C85020J3310N835j2170P50J0388n030p229P292R892J1917O661o585j2292
$$ plain form
10022 250809 253728 257409 268848 269383 264060 271328 280531 275428 281320 290679 294814 280108 266359 267680
10008 267680 274333 257563 249477 269111 280691 292053 300630 321517 343918 344625 343812 325592 305000
9995 305000 298152 291281 286109 284643 277719 280994 299032 309829 318629 311511 297098 304293 304671 292776
9981 292776 293851 299688 306477 310164 319248 326741 321219 310342 307201 297493 294777 310267 329984 335320
9967 335320 342595 341231 319786 316307 318261 310894 313172 311697 315380 316985 329824 332763 321918 309492
9953 309492 322428 345637 351492 345748 348769 341843 340154 340964 350487 368541 368857 352729 340802 342983
9939 342983 346049 356840 361045 371908 374148 385680 392779 394035 384135 388490 383536 376712 380380 385020
9925 385020 398330 404165 391995 392745 403133 398103 390874 398166 408058 419975 426636 420051 407759
9912D07759R085m428j8048k0073j3294k585J9045O920P691Q658K2985L8701Q021
9899D70437J5207J1162O132o210O192j2254k3609q924j702q655j3498Q935J8656
9886D61869L6733K1690J7506j5591j7017r47L591j422J2855L1350L4043L9580
9874F24240L6084J9578J5691J3820L1272K4962R697J4447J7629K0848O1756J00349
9862I90373J08538J35200J72408K20992K50245K38496J86089J06498N6087P0493
9852B535419J28839K03367K17681J82654R1577k2621q9756j00584r2468p7735
9842B976373j04620j20190r7026r7171p8994n0926j2439L8833J22487J89690K83090
9831C049107L97247N52798P25397R26395J071255J017678P40230L81896J4950
$$ plain form
9912 407759 416844 412416 394368 374295 361001 358416 377461 384381 392072 400730 423715 462416 470437
9899 470437 485644 496806 502938 496728 502920 490666 467057 458133 456431 447776 434278 443213 461869
9886 461869 498602 520292 537798 522207 505190 504243 507834 506412 519267 550617 584660 624240
9874 624240 660324 679902 695593 709413 740685 765647 775344 789791 807420 828268 890024 990373
9862 990373 1098911 1234111 1406519 1627511 1877756 2116252 2302341 2408839 2464926 2535419
9852 2535419 2664258 2867625 3085306 3267960 3359537 3336916 3247160 3146576 3054108 2976373
9842 2976373 2871753 2751563 2654537 2557366 2478372 2427446 2415007 2453840 2576327 2766017 3049107
9831 3049107 3446354 3999152 4724549 5650944 6722199 7739877 8480107 8862003 8876953
9822H876953k65376l82986m28779m80570n08369m71037l52893k65542k21721k01831
9812E297849j75134j38890p9874j3645M5896J03837K13480L46085M83749O13034
9802F696387P21754P86210Q43662R00756R92582J161872J394883J749492K296815
9793A7544413L039506M040226N454169P411906J0001058J3356790J7090677J9000720
9785I6939465J4585852K463317r932063j6509784j6957521j3906884j0217552
9778D6464830o940403m275041k130564l43637J231876K738967M419187O378451
9770D7543666Q127569Q691597P924513O674677N090172L128457J702793J338401
9762I0221845J268108O07170m98323j612336k920532m572182n604519n203596
$$ plain form
9822 8876953 8611577 8228591 7799812 7319242 6810873 6339836 5986943 5721401 5499680 5297849
9812 5297849 5122715 4983825 4903951 4890306 4936202 5040039 5253519 5599604 6083353 6696387
9802 6696387 7418141 8204351 9048013 9948769 10941351 12103223 13498106 15247598 17544413
9793 17544413 20583919 24624145 30078314 37490220 47491278 60848068 77938745 96939465
9785 96939465 111525317 113988634 104056571 87546787 70589266 56682382 46464830
9778 46464830 39524427 35249386 33118822 32775185 34007061 36746028 41165215 47543666
9770 47543666 55671235 64362832 72287345 78962022 84052194 87180651 88883444 90221845
9762 90221845 91489953 92097123 91598800 89986464 87065932 82493750 76889231 71685635
9754G1685635l915820k593534j304790M79831L132333O887886J2121621J9166857
9746A05660019K7870865L7658833M6749973M5505361K2329267j2732530l7776841
9739B35264947m6797445m2749892l3333197k3785364j5630466r288524m523001
9732E9157058r31069J720761L407503M406735M982335M974332M482537L787331
9724H5987523K935167J674134j43379j422406j365768r87357j747201l803812
9716H1126901o512930q846095r559597q582117o689458m715241k996996j496550
9708C1727917o2286J432387L107156N089787P546294J0636224J4092866J6214373
9700H9784718J3425757L448654q516720j5847891j7319296j4935305j1540870
$$ plain form
9754 71685635 67769815 65176281 63871491 64351322 67483655 74371541 86493162 105660019
9746 105660019 133530884 171189717 217939690 263445051 285774318 273041788 235264947
9739 235264947 188467502 145717610 112384413 88599049 72968583 63680059 59157058
9732 59157058 58225989 59946750 63354253 67760988 72743323 77717655 82200192 85987523
9724 85987523 88922690 90596824 90453445 89031039 87665271 86677914 84930713 81126901
9716 81126901 74613971 65767876 56208279 47626162 40936704 36221463 33224467 31727917
9708 31727917 31665631 33098018 36205174 41294961 48841255 59477479 73570345 89784718
9700 89784718 103210475 106659129 98142409 82294518 64975222 50039917 38499047
9693C8499047q495013o052033m216583k936066k089683j519203j145296r35904
9685A1109266q08024p40267o66865o34200n68739n17447m19974k73552o8448J79225
9675F590975M55429P57290J030375J100833O95489k7523n72246p75975o17170
9666H637477l06544J3007K36992L40803L24673J93542m0934l52941o70921q48536
9656G526618q48225p43126n81251m18176l01610k21551j63678j17207p8354o7824
9646C985616o5284p3946r1775q5296p4869m6864r523K5643N1599N6773N3107J7410
9634C742591j0618o208K1084J11274K13279K20303j2937k79436m70228n15503
9624C013601m49703l56921k63327k00021j53975j31199j13336j10144j07941q4652
$$ plain form
9693 38499047 30004034 23952001 19735418 16799352 14709669 13190466 12045170 11109266
9685 11109266 10301242 9560975 8894110 8259910 7691171 7173724 6753750 6480198 6411750 6590975
9675 6590975 7046404 7803694 8834069 9934902 10630391 10602868 10030622 9254647 8637477
9666 8637477 8330933 8343940 8580932 8921735 9246408 9439950 9399016 9046075 8375154 7526618
9656 7526618 6678393 5935267 5354016 4935840 4634230 4412679 4249001 4131794 4053440 3985616
9646 3985616 3920332 3846386 3754611 3669315 3594446 3547582 3538059 3563702 3615301 3672074 3725181 3742591
9634 3742591 3731973 3725765 3746849 3858123 4071402 4291705 4278768 3999332 3529104 3013601
9624 3013601 2563898 2206977 1943650 1743629 1589654 1458455 1345119 1234975 1127034 1042382
9614A042382p3490q1309o6611n6752l0251k3671j2446r370n326n757k4739k3229
9602F29431k1492k1350l128M133m113L170p47J270j7111j1411k726k0385m5247
9589D90294l0405k6516l1806l3709k3205j8691q998j8065r484J232J002O63L888
9576B96200K561J3832l077j5403k718j3595k4749j6580q275j6970j2439R629J0561
9563B18977O656p659j5211k0079k5287p158Q151Q901L878k115l185N819n658r196
9549A56834j1533m620m972m25j1566M319o953k3604j1206m075p157K204J8286
9536I5532M674n245J137J879K849l277n525p199J3734J662q244o470N151j29m975
9521H5554K789N243j6744l115M233j1811L211J817o694j6068J1185K4274l318
$$ plain form
9614 1042382 968892 887583 820972 764220 733969 710298 697852 688482 683156 677399 652660 629431
9602 629431 607939 586589 583461 587594 583481 586651 585904 587174 570063 558652 555926 535541 490294
9589 490294 459889 433373 401567 367858 344653 325962 316964 298899 289415 290647 291649 292312 296200
9576 296200 298761 312593 309516 294113 291395 277800 253051 236471 228196 211226 198787 208416 218977
9563 218977 225633 217974 202763 182684 157397 150239 158390 167291 171169 169054 165869 171688 166030 156834
9549 156834 145301 140681 135709 135284 123718 128037 121084 97480 86274 82199 75042 77246 95532
9536 95532 100206 94961 96098 97977 100826 97549 92024 84825 98559 100221 91977 85507 90658 90529 85554
9521 85554 88343 93586 76842 73727 77960 66149 69360 71177 64483 48415 59600 83874 80556
9508H0556j3495j4676Q764P624M38o69J5418M136j5279j3607N760J9251Q341j0917
9494H1645j1474M948j6285k057o495m09J1413K529R35m738q423Q32m265q771j3890
9479B5495P608J1684O708J74K872M860j1163r058k61J0863n612j1762l987n315
9465B3106k400M852j072o811J917K083Q154J4509J692r059K887J2611N245M354
9451F2068j508r129p478o451R525j7284p694R13K941r579L061k931O252n100o234
9436A1372j231Q099J8792p67K3483J2720q351j0258l667j1016M088J419j8176
9423B6507j2397J382j481Q541K5077K1618J0357J665j3443J4771K5410K6659K1801
9410A56467L9391K5021L0834L4142K0785k960j4143k7323m0410m7774l1321k0490
$$ plain form
9508 80556 67061 52385 61149 68773 69211 68542 83960 88096 72817 59210 64970 84221 92562 81645
9494 81645 70171 75119 58834 56777 50282 49873 61286 63815 64750 60012 51589 52421 48156 39385 25495
9479 25495 33103 44787 51495 51669 54541 59401 48238 39180 38919 49782 44170 32408 28421 23106
9465 23106 20706 25558 24486 17675 19592 21675 29829 44338 46030 36971 39858 52469 57714 62068
9451 62068 60560 51431 43953 37502 47027 29743 22049 22962 25903 16324 19385 16454 22706 17606 11372
9436 11372 10141 18240 37032 36265 59748 72468 64117 53859 50192 39176 43264 44683 26507
9423 26507 14110 15492 14011 22552 47629 69247 79604 81269 67826 82597 108007 134666 156467
9410 156467 195858 220879 251713 285855 306640 303680 289537 262214 221804 174030 142709 122219
9398A22219j9268k3917p856j51o970J3543M237o301o625q317J0732J1514k437
9385H0403L680K234o998K778N200J209P465J1897J5777J6559J6611J8530K3974
9372A99319J1392K5395M3014N9866R3135J20668J68108J74891J07530N2286k9309
9361A026295q3075j18160j27106j19159j07795q7949n2911m9387j9454J418o403
9350B56314r346M51K050N194R907K5953L3426N0881M9277O5711J08963J26632
9338G25413J62887K34265L62177O07411R85521J535097J803927P45125q51970
9329F309853j577251j505691r81332n46109k69757q3249L6110Q3239N0732p719
9319A508826o2366j04981j41399j48067j64325j56268j26567j20299r6887p2513
$$ plain form
9398 122219 102951 79034 71178 71027 64057 77600 81837 75536 68911 60594 71326 82840 80403
9385 80403 84083 86317 79319 82097 87297 88506 95971 107868 123645 140204 156815 175345 199319
9372 199319 210711 236106 279120 338986 432121 552789 720897 895788 1003318 1055604 1026295
9361 1026295 943220 825060 697954 578795 471000 383051 330140 280753 261299 262717 256314
9350 256314 246968 247419 249469 254663 264570 290523 323949 374830 424107 489818 598781 725413
9338 725413 888300 1122565 1484742 2092153 3077674 4612771 6416698 7161823 6309853
9329 6309853 4732602 3226911 2245579 1699470 1429713 1346464 1382574 1465813 1516545 1508826
9319 1508826 1446460 1341479 1200080 1052013 887688 731420 604853 484554 387667 315154
9309C15154m8198k9360j5804j1916j2656l8961k5865O069L205K716j0043k0044
9297A14297r807J0461Q063n589j636O179J6435l994n723M680K922J9072K2288
9284A77648L8365O4223P7192Q9623J12661R1663O6495k124l4041k3807k6005m3621
9272E88272o6243q9403o8755q1371p1182m4533l1207k1690j4118k367j1866q799
9260G6738m891r729n368M792L098j3116l907N828m711N369l378k048N469R059
9246F3205j3311r006j7126o427q873J4598J7287K0595K1437L2778L3054j20J870
9233A49961M767M305P544j8904l6835j8433k0311j4003K661k435j5992j4274J632
9220B9683P305j620p415k790R943j994j8859L722R986K646j3150j244j430K320
$$ plain form
9309 315154 266956 237596 221792 209876 197220 158259 132394 138463 141668 144384 134341 114297
9297 114297 104490 114951 123014 117425 115789 121968 138403 134409 128686 133366 136288 155360 177648
9284 177648 216013 280236 357428 447051 559712 651375 717870 715746 681705 657898 631893 588272
9272 588272 522029 432626 363871 282500 211318 166785 135578 113888 99770 97403 85537 76738
9260 76738 71847 62118 56750 61542 64640 51524 47617 53445 48734 54103 50725 48677 54146 63205
9246 63205 49894 40888 23762 17335 8462 23060 40347 60942 82379 115157 148211 148091 149961
9233 149961 154728 159033 166577 147673 110838 92405 72094 58091 60752 58317 42325 28051 29683
9220 29683 36988 35368 27953 25163 35106 33112 14253 17975 27961 30607 17457 16213 14783 17103
9206A7103J604l557K558k317l372m375n040n685J218P082q060k751K727M109j5918
9191a4674L123R918L272j0631l848K4721L149j4763j5991M292k165n747Q141j968
9177a3171k741j347J0659J7453l947j2095j4866N120L211r32l113l94M933R221
9163b009J4109N483m711J272j6992r826Q476m207m14j106R30O091M81k046R491
9148E022P358r966k0300j5063P291O735J354K101J0828J4912l486j7665p67K5076
9134A3430O640j7119n805r13L075q602J36k428m897J0322J2858q333l79P072r970
9119d913j154j3156l468J0819N17Q419J5415p263o637j0288l639O696M862m934
9105h724J45j5437m575o846n609J0671O423J880M540L28n61J1251R009M165o937
$$ plain form
9206 17103 18707 15150 17708 15391 12019 7644 2604 -3081 -1863 5219 -2841 -5592 -2865 1244 -14674
9191 -14674 -11551 -1633 1639 -8992 -12840 11881 15030 267 -15724 -11432 -13597 -19344 -11203 -13171
9177 -13171 -15912 -17259 -6600 10853 6906 -5189 -20055 -14935 -11724 -12656 -15769 -16163 -11230 -2009
9163 -2009 12100 17583 12872 14144 -2848 -12674 -4198 -8405 -8819 -9925 -8995 -2904 -2423 -4469 5022
9148 5022 12380 2414 -17886 -32949 -25658 -18923 -17569 -15468 -4640 10272 6786 -10879 -11646 13430
9134 13430 20070 2951 -2854 -3767 -692 -9294 -9158 -11586 -16483 -6161 6697 -1636 -2015 5057 -4913
9119 -4913 -6067 -19223 -22691 -11872 -11355 -2936 12479 5216 -1421 -11709 -15348 -8652 -3790 -8724
9105 -8724 -8579 -24016 -28591 -35437 -41046 -30375 -23952 -22072 -17532 -17204 -17765 -6514 2495 6660 -277
9090b77k712J5742M737j7040j7053l61N970j819O227Q817O766l919j1461L993
9076b390n780j0791N603j3805r82N246M720L251J473J547r46k0602l192J4928
9062b1720R527M416J3505P340j8198j3509o506J1180N345O878K259O473j8955
9049a1965K872O417q155n701j154p868n269p32M763J3073R305j0156L560K70O334
9034d406l950o39p598K993J5604J3036k464k1359j0382n920m536o365J171O418
9020b8397l578k055K138O350J8467J905j1370j3329Q163R613p823j0568K112K300
9006b6072n229m558J3737R644j6465k99J1480j5460O628Q606Q039J207m110m282
8992a7134P02M009n855o022N493J2280Q064O925m068r202L498k226j5143r305
$$ plain form
9090 -277 -2989 12753 17490 450 -16603 -16964 -10994 -12813 -6586 2231 8997 5078 -6383 -2390
9076 -2390 -8170 -18961 -13358 -27163 -28145 -22899 -18179 -14928 -13455 -11908 -12854 -33456 -36648 -21720
9062 -21720 -12193 -7777 5728 13068 -5130 -18639 -25145 -13965 -8620 -1742 517 6990 -11965
9049 -11965 -9093 -2676 -10831 -16532 -17686 -25554 -30823 -31555 -26792 -13719 -4414 -14570 -11010 -10740 -4406
9034 -4406 -8356 -8995 -16593 -13600 2004 15040 12576 -8783 -19165 -25085 -29621 -35986 -34815 -28397
9020 -28397 -31975 -34030 -31892 -25542 -7075 -5170 -16540 -29869 -21706 -12093 -19916 -30484 -28372 -26072
9006 -26072 -31301 -35859 -22122 -12478 -28943 -29242 -17762 -33222 -26594 -17988 -9949 -8742 -12852 -17134
8992 -17134 -16432 -12423 -18278 -24300 -18807 -6527 1537 8462 4394 -4808 -1310 -3536 -18679 -27984
8978b7984P851Q940o08R789J3020k43q185L865j0048j6771Q930K499j6087j0121
8964c5153J2631J5619J1439Q117o905l653o362n930m484n400R274j506j0874J1072
8950a2115Q452P680j546J934j1054Q324j623j3415k1365n246n588K795J2074R740
8936b0953Q88J0163J3130k135J33o286j00K725l353l865L247K252m761o229r59
8921a6103K670J6785O340O389k23n644m437j6277r055J0691J265l696r378J1918
8907h755O334j6460n322q748m971P683k719M838J443J797J3104J0164n000l689
8893a0301k010O001R287j208o993q187p234n800OQ801j2381Q731O783r740O117
8878a8128J2493j1267K454m926N372r221l925p343K094J2478J2607n067M308q040
$$ plain form
8978 -27984 -20133 -11193 -11801 -2012 11008 10765 2580 6445 -3603 -20374 -11444 -8945 -25032 -35153
8964 -35153 -22522 -6903 4536 12653 5748 2095 -4267 -10197 -14681 -20081 -10807 -12313 -23187 -12115
8950 -12115 -3663 4017 2471 4405 -6649 1675 52 -13363 -34728 -39974 -45562 -42767 -30693 -20953
8936 -20953 -20065 -9902 3228 1093 1226 -5060 -5160 -2435 -5788 -9653 -6406 -4154 -8915 -15144 -16103
8921 -16103 -13433 3352 9692 16081 15858 10214 5777 -10500 -19555 -8864 -7599 -11295 -20673 -8755
8907 -8755 -2421 -18881 -24203 -32951 -37922 -30239 -32958 -28120 -26677 -24880 -11776 -1612 -6612 -10301
8893 -10301 -12311 -6310 2977 1769 -5224 -13411 -20645 -26445 -26439 -17638 -30019 -21288 -14505 -24245 -18128
8878 -18128 -5635 -16902 -14448 -19374 -14002 -23223 -27148 -34491 -32397 -19919 -7312 -12379 -8071 -16111
8864a6111m144j146o216J519O090J2207J7444J425n118n031Q89j3443q917m579
8850b5131k6L76o295J4363J2040m904J836M216p316l308J2903K723k792l002J041
8835c276J1637j0510M253o669j793J1710J346m116m57j979j555L444m407L97j1020
8820a2995O567l458K173p098p845J0378m338q903Q811Q288O756m174j2170k2006
8806d0014k767R922J806J4798L561R94q389l669l370J1217R805P214J811m426
8792a507P95r887M8m082l868P710o917j3499O330R307J56M073Q429J1623n141
8777C570j438P69q26J2724m560p352j0390p085L053J6302O279l76L34r12J345
8762A1437r924l04j8665K959J3528N465r538j490j3071P11J4342O545l58K365
$$ plain form
8864 -16111 -20255 -21401 -27617 -26098 -20008 -7801 9643 11068 5950 919 1808 -11635 -20552 -25131
8850 -25131 -25157 -24781 -31076 -16713 -4673 -9577 -7741 -3525 -10841 -14149 -1246 1477 -1315 -4317 -3276
8835 -3276 8361 -2149 2104 -4565 -6358 5352 6698 2582 2125 146 -1409 2035 -2372 -1975 -12995
8820 -12995 -6428 -9886 -7713 -14811 -22656 -12278 -16616 -25519 -16708 -8420 -1664 -5838 -18008 -40014
8806 -40014 -42781 -32859 -31053 -16255 -12694 -11700 -20089 -23758 -27128 -15911 -6106 1108 2919 -1507
8792 -1507 -712 -10599 -10551 -14633 -18501 -10791 -17708 -31207 -24877 -15570 -15414 -11341 -2912 8711 3570
8777 3570 2132 2901 2075 14799 10239 2887 -7503 -14588 -11535 4767 11046 10670 11004 10092 11437
8762 11437 1513 1209 -17456 -14497 -969 4496 -5042 -6532 -19603 -18892 -4550 1995 1637 4002
8748D002k180j0960J2179j5098r514J055R486n253n850q259L584K0147K1633r075
8734E897j6058j2832r54j250L700J4160M098j1248J50K668J646J1964J8613J6835
8720C7389N08p761o231P63K3970K9026J1978J6273J9229M0738O9792J20557J59735
8707E15966J23786j4397j20730j50516j21588p5164n5360l4139q863J9N358K72
8695F4644m962o897q366n641r173o282J1667J575K713k04K4389K4108J8117K6268
8681A31956L8891L1836M6533P8624J16794K01648L10030K88909m835k43244k93700
8670G03442k35165j70983j02699m4626l2116k2107j1282j6963r677q048m405n865
8658C9506j0318p029J570q625k99K4143N747k36R394J3449J8120R072J8751L4897
$$ plain form
8748 4002 1822 -9138 3041 -12057 -21571 -20516 -11030 -16283 -22133 -30392 -26808 -6661 14972 5897
8734 5897 -10161 -22993 -23947 -25197 -21497 -7337 -3239 -14487 -14337 -11669 -10023 1941 20554 37389
8720 37389 37897 30136 23905 24668 48638 77664 89642 105915 125144 165882 235674 356231 515966
8707 515966 639752 625355 504625 354109 232521 157357 101997 67858 58995 59014 64372 64644
8695 64644 59682 52785 44419 38778 29605 23323 34990 36565 39278 39074 63463 87571 105688 131956
8681 131956 170847 202683 249216 327840 444634 646282 956312 1245221 1240386 997142 703442
8670 703442 468277 297294 194595 149969 117853 95746 84464 67501 57824 49776 45371 39506
8658 39506 29188 22159 23729 15104 14805 38948 44695 44459 53853 67302 85422 94494 113245 148142
8644A48142N7699R3647J44868J50123K0105r2716j33192j32217q3456n1655j9404
8633A01944p597m265R02N14p949k69K039L977M239k405j506P972K1547K5652N3659
8618A98454O3659R5292J66668K84891M81657O25351K98067k94745n44997n15541
8608H58756l26927j85259j09843o2520k2720k2653k6954j2004J386m587n072n271
8596G6332N054k691K325R366m257n627j1656k186p211p378J9890J7799r578J0997
8582I1179J6902K7199K7232L0252K7672K8674M2922N1748R0672J44795K48641
8571H27888M39150P63297J212611J045431j96776r09433j091899p93856m61482
8562H34931k70614j66244r8088o6789l3434l0240k2252o361l705j0520j2225K573
$$ plain form
8644 148142 205841 299488 444356 594479 614584 521868 388676 256459 173003 121348 101944
8633 101944 94347 90082 90984 91498 83549 83280 85319 89296 93535 91130 89624 97596 119143 144795 198454
8618 198454 262113 357405 524073 808964 1290621 1915972 2214039 1919294 1374297 858756
8608 858756 531829 346570 236727 174207 151487 128834 101880 89876 91262 86675 81603 76332
8596 76332 81386 78695 81020 90386 86129 80502 68846 66660 59449 52071 71961 89760 80182 91179
8582 91179 108081 135280 162512 192764 220436 249110 292032 343780 434452 579247 827888
8571 827888 1267038 2030335 3242946 4288377 4091601 3182168 2090269 1296413 834931
8562 834931 564317 398073 299985 233196 199762 169522 147270 140909 137204 126684 114459 117032
8550A17032j8943j0437o161r081j0531J783q875p150k178J910Q706J5566J7637
8537H9278n651O790K191K193J3785L933K4708M8809O3003R8744J53310K90069
8525G91162M93940N85581K05157l00038n20217m79569k98137j73109q4717n3739
8515A66314l4339k8297l2017j3106m787J512k122j868J096r660p051n695r530
8502B0450r036p565j735M852M99o794k1311q546Q002O378J4077k135K370P096
8488F602n997r280Q240M666k319p500O00N447N638j771j1432M796m566l374J1261
8473A011J266N538k546j422l750j243L371j326j2931j227J5121K031J0216j261
8459A2848M544m044r509p258O072R878k092p53k583m994N208J6568q995k6314
$$ plain form
8550 117032 98089 87652 81491 72410 61879 63662 54787 47637 45459 47369 56075 71641 89278
8537 89278 83627 90417 92608 94801 108586 112519 137227 186036 249039 347783 501093 791162
8525 791162 1285102 1870683 2075840 1775802 1255585 776016 477879 304770 220053 166314
8515 166314 131975 103678 71661 58555 53768 55280 53158 51290 52386 42726 35675 29980 20450
8502 20450 11414 3849 2114 6966 7465 671 -20640 -29186 -21184 -14806 -729 -2864 -494 6602
8488 6602 605 -8675 -435 4231 1912 -5588 -4988 459 6097 4326 -7106 -2310 -6876 -10250 1011
8473 1011 2277 7815 5269 3847 97 -1146 2225 899 -12032 -13259 1862 3893 14109 12848
8459 12848 17392 13348 3839 -3419 2653 12531 10439 9686 7103 2109 7317 23885 14890 -11424
8445a1424M066J1356j810J1743M985j1403p426r161K744K150N905K208l991p020
8431g078k163r72p672j3408M331J2554P463J1357J2076N036j8848j7732N526J5142
8417E612n881j0895O733o380N538k086p328n603j0272Q240J0939r159q356j427
8403c0325l277K15j5085J0198Q715R792K0143O44r766m053K775M634o188j196
8389a2774J0645P08o8m84j534j0958j1098j1328M197J1671k261J4732j190j2298
8375b2040J406m780J320L888K0202O507L398j5801m999P285L804j198o297j5794
8361b3099J1321J5490M427K205n87J2064k505j4854k788j149j2491m551M030L784
8347h703M349J605j1938Q883J647L996O981j2545m844J2927K390j7011r114J9432
$$ plain form
8445 -11424 -7358 3998 2188 13931 18916 7513 87 -9074 -6330 -4180 1725 3933 -58 -7078
8431 -7078 -9241 -10213 -17885 -31293 -26962 -14408 -6945 4412 16488 21524 2676 -15056 -9530 5612
8417 5612 -269 -11164 -4431 -10811 -5273 -7359 -14687 -20290 -30562 -22322 -11383 -20542 -28898 -30325
8403 -30325 -33602 -33387 -48472 -38274 -29559 -19767 376 1020 -8746 -12799 -10024 -5390 -11578 -12774
8389 -12774 -2129 -1421 -1489 -1973 -3507 -14465 -25563 -36891 -32694 -21023 -23284 -8552 -9742 -22040
8375 -22040 -20634 -25414 -24094 -20206 -4 6503 9901 -5900 -10899 -3614 190 -1008 -7305 -23099
8361 -23099 -11778 3712 8139 10344 9757 21821 19316 4462 1674 525 -11966 -16517 -12487 -8703
8347 -8703 -4354 -2749 -14687 -5804 -4157 -161 6820 -5725 -10569 2358 4748 -12263 -21377 -1945
8333a945J2394j8679J27O091m086L730r810L804J3393J037m440o978j6505p316
8319b9183j432R027N07j49O690M037L612q000P140J5974N936r155m512k084P450
8304E858r420m745J3253j0845j2903j441J759k434O28J3406J0333p666P13j4765
8290a8269j0733Q550P714J1453l971m990m937m29R441n745N728J1493r84m254
8276F7m690M734m90j788p909N191J1646N980o656j0682q61q20J3726M974K764
8261A5186r922o37p248p924r83l522r799O288J3471K862j136j5559j1845j427
8247c2195r51O962J3916N243M573p984P320q140n105O757l844L132Q181M344m060
8232a851P913R096N74q195J376K585q072l150j0959m960N14L770P665j7100j457
$$ plain form
8333 -1945 10449 -8230 -8103 -2012 -6098 -2368 -12178 -8374 5019 6056 1616 -5362 -21867 -29183
8319 -29183 -30615 -21588 -21081 -21230 -14540 -10503 -6891 -14891 -7751 8223 14159 5004 492 -1592 5858
8304 5858 -3562 -8307 4946 -5899 -18802 -20243 -18484 -20918 -20290 -6884 3449 -4217 -3504 -18269
8290 -18269 -29002 -20452 -12738 -1285 -5256 -10246 -15183 -15612 -6171 -11916 -6188 5305 4321 67
8276 67 -4623 111 -379 -2167 -10076 -4885 6761 12741 6085 -4597 -5458 -6278 7448 12422 15186
8261 15186 5264 4627 -2621 -10545 -11528 -15050 -24849 -18561 -5090 -2228 -3364 -18923 -30768 -32195
8247 -32195 -33146 -26184 -12268 -7025 -2452 -10436 -3116 -11256 -16361 -9604 -13448 -10316 -2135 2209 -1851
8232 -1851 6062 15158 15732 7537 8913 11498 3426 276 -10683 -15643 -15129 -11359 -3694 -20794 -22251
8217b2251J9267J3332m901J1059n293r511k0000j5427N414J8081K197P071M781
8204C819m469j614K020q071j1823P228P870m329J261N389m546m465o116K407Q514
8189f925N723Q076j426r830o676k760K55p489l757m721J0951j385o199J5549N867
8174d747k351r545r846J1218K5366m483k279L739J555n578M72n880k953J4782
8160I470j320j1720j0701o136J350K358L716J3718l986j681o465p228r272p41
8146b8638J4208j619j0701j567Q259r44J4253J797r206N325P264o322J398Q541
8132B048j4899j1173K75j484J2702M746L72K4784k251n773J120j1638K002n93
8118B38r582r701J389J5533l798J610n455q990k543j9174k31J5089l506P40J4547
$$ plain form
8217 -22251 -2984 10348 5447 16506 11213 1702 -18298 -33725 -28311 -10230 -8033 -962 3819
8204 3819 -650 -2264 -244 -8315 -20138 -12910 -5040 -9369 -8108 -2719 -7265 -11730 -17846 -15439 -6925
8189 -6925 -1202 6874 5448 -4382 -11058 -13818 -13563 -21052 -24809 -29530 -18579 -19964 -26163 -10614 -4747
8174 -4747 -7098 -16643 -26489 -15271 10095 5612 3333 7072 8627 3049 3521 -2359 -5312 9470
8160 9470 8150 -3570 -14271 -20407 -19057 -16699 -12983 735 -3251 -4932 -11397 -18625 -27897 -28638
8146 -28638 -14430 -16049 -26750 -28317 -20058 -21002 -6749 -4952 -14158 -8833 -1569 -7891 -6493 2048
8132 2048 -12851 -24024 -23749 -25233 -12531 -7785 -7413 17371 15120 9347 10467 -1171 831 238
8118 238 -9344 -19045 -17656 -2123 -5921 -4311 -9766 -18756 -21299 -40473 -40704 -25615 -29121 -28381 -13834
8103a3834M863k561k497Q678k098l489J1408K327l247J4r697n001L771O240n758
8088a0881j2800N687n562k944J805j077k970J0623n933j148N653R326M467k744
8074h498l742j0976K383Q258R969n603j6140j574L409J326M317J108J635K331
8060a1797O216j0010M904N339l328j0889m53N636o171M428k101J1572k383q787
8046a7824p051P421J562m891J1172J3422l302j447o895m153N563k08M376J3770
8032A1515J7290J119j8741j2792p034O060K946L732O843l762J527K055J502r620
8018B640l2511n341R153o2L821k849J0406J2370q931o535J0709M535j1586J15
8004a4066O261m92j4668j7504j0826P93O177J62K0432Q799K655o30k951k196l573
$$ plain form
8103 -13834 -8971 -11532 -14029 -5351 -7449 -10938 470 2797 -450 -436 -10133 -15134 -11363 -5123 -10881
8088 -10881 -23681 -17994 -23556 -26500 -24695 -25772 -28742 -18119 -24052 -25200 -19547 -10221 -5754 -8498
8074 -8498 -12240 -23216 -20833 -12575 -2606 -8209 -24349 -25923 -22514 -21188 -16871 -15763 -14128 -11797
8060 -11797 -5581 -15591 -10687 -5348 -8676 -19565 -20018 -14382 -20553 -16125 -18226 -6654 -9037 -17824
8046 -17824 -24875 -17454 -15892 -20783 -9611 3811 509 -938 -7833 -11986 -6423 -6631 -2255 11515
8032 11515 28805 29924 11183 -1609 -8643 -2583 363 4095 10938 7176 8703 10758 12260 2640
8018 2640 -29871 -35212 -26059 -26121 -22300 -25149 -14743 -2373 -11304 -17839 -7130 -2595 -14181 -14066
8004 -14066 -7805 -8297 -22965 -40469 -51295 -50502 -44325 -44163 -23731 -14932 -12277 -12907 -15858 -18054 -21627
7989b1627L360O793O375O604l415p061j3096q912o918o000J4850J3798P371K686
7975e192l426n731l671L640M741K355l711q202j3160Q507Q345K656J4825m505
7961b529j7722J2574k690q342J1710J7187n322k0300j936J3580k553n234o173
7948a7750J745J2580P252r002R268J604p827o749J632q08n638k691j794j0667
7934b8845J3504K1763N895m747j698j6298j2911K225P937K507J3786n31K667l969
7920A285Q129j900L324K609j1675K730M965R371l016R6q348L615M927K021l543
7905A4590K513j9967O003P270K156j9774m457k043P428O631N531l571m341j6847
7891a8878n518O080N347j562j5097J1209O620k974j961K037N536J912p848N132
$$ plain form
7989 -21627 -18267 -11474 -5099 1505 -1910 -8971 -22067 -30979 -37897 -43897 -29047 -15249 -7878 -5192
7975 -5192 -8618 -14349 -18020 -14380 -9639 -7284 -10995 -19197 -32357 -23850 -15505 -12849 1976 -2529
7961 -2529 -20251 -7677 -10367 -18709 -6999 10188 4866 -15434 -17370 -3790 -6343 -11577 -17750
7948 -17750 -16005 -3425 3827 -5175 4093 5697 -2130 -8879 -7247 -8055 -13693 -16384 -18178 -28845
7934 -28845 -15341 6422 12317 7570 5872 -10426 -23337 -21112 -13175 -10668 3118 2587 5254 1285
7920 1285 9414 7514 10838 13447 1772 4502 9467 18838 15822 15918 7570 11185 16112 18133 14590
7905 14590 17103 -2864 3139 10409 12565 -7209 -11666 -13709 -6281 350 5881 2310 -2031 -18878
7891 -18878 -24396 -18316 -12969 -14531 -29628 -18419 -11799 -14773 -16734 -14697 -9161 -7249 -15097 -9965
7877i965J2336o23p976l570m125n305q39N677J875P322J561j0971o273R015K352
7862i509J0979m61j3538N36K845k876m653j0888L569M463Q213K392M251n593J0798
7847E28j806n221j71n077j578j247L957J142l70N972L071j695r652j2199l579
7832b7925O264J1547o25J1618L059P195p313j6746J765m630l261j4461J3107O171
7818a4235J1019k784q750J271P700J361K420J1195L676k642q564j0167j4686K235
7804b0951P888l495J0299l48o096n31Q486J2817J0245P713r274J787n834j1128
7790A578p000J1899J2592q477q096n766L637l468n517J99J0632j870n272k132
7776g061k967j26Q362J1685M719k554j8791r635m263K197m861q617R231J7274
$$ plain form
7877 -9965 2371 1748 -6228 -9798 -13923 -19228 -20067 -14390 -12515 -5193 -3632 -14603 -20876 -11861 -9509
7862 -9509 1470 1009 -12529 -11993 -9148 -12024 -16677 -27565 -23996 -19533 -11320 -8928 -4677 -10270 528
7847 528 -1278 -6499 -6670 -11747 -13325 -14572 -10615 -9473 -9843 -3871 -800 -2495 -12147 -24346 -27925
7832 -27925 -21661 -10114 -10739 879 3938 11133 3820 -12926 -11161 -15791 -19052 -33513 -20406 -14235
7818 -14235 -3216 -6000 -14750 -13479 -5779 -4418 -1998 9197 12873 10231 1667 -8500 -23186 -20951
7804 -20951 -13063 -16558 -6259 -6607 -12703 -13234 -4748 8069 18314 26027 16753 18540 12706 1578
7790 1578 -5422 6477 19069 10592 2496 -3270 367 -3101 -8618 -8419 2213 343 -4929 -7061
7776 -7061 -10028 -10154 -1792 9893 14612 12058 -6733 -16368 -20631 -18434 -23295 -31912 -22681 -5407
7762e407J1596q535o932M815N765Q060j3569q077N540K765M392O827J264R329
7748A7833J325j2345j2293l645O948J309R451n644n35j2503k362r83r445o906
7734b9795k269O228L534l893m972J1514L726l89q792J3091K43l616k177o372L545
7719b0394P214l732j004J411j2495n704R52O523j968l046K6309R067k800j906
7705a573n056j8728k879p438j3076J2864K5145k757O144K720N749k303K016O82
7691A510k237R1N837O407p859M83J1733j6740j1509n676r030R715l685l886P861
7676a6985J7321P377p871j2848R581J3815P981l474r712q492j1761l325J1427
7663f966N166K528J7795Q857j5910j292L757r329j8076j6019J8520J6755M497
$$ plain form
7762 -5407 6189 -2346 -9278 -4463 1302 9362 -4207 -12284 -6744 -3979 413 7240 8504 17833
7748 17833 19158 6813 -5480 -9125 -2177 -868 8583 2939 2404 -10099 -12461 -13444 -22889 -29795
7734 -29795 -32064 -25836 -22302 -26195 -31167 -19653 -15927 -16316 -25108 -12017 -11774 -15390 -17567 -23939 -20394
7719 -20394 -13180 -16912 -17916 -16505 -29000 -34704 -33752 -27229 -29197 -32243 -5934 3133 333 -1573
7705 -1573 -6629 -25357 -28236 -35674 -48750 -35886 -10741 -13498 -7354 -4634 1115 -1188 828 1510
7691 1510 -727 -636 5201 11608 3749 4232 15965 -775 -12284 -17960 -26990 -17275 -20960 -24846 -16985
7676 -16985 336 7713 -158 -13006 -3425 10390 18371 14897 5185 -3307 -15068 -18393 -6966
7663 -6966 -1800 728 18523 27380 11470 10178 13935 4606 -13470 -29489 -10969 5786 10283
7650A0283N182n452o770L368r349J1053L973q633l797j0756n623n058L009M148
7636a4422M430P287J1711q159q90m412M580k857Q571M990k205j0818n425L102
7622d517J792m558j585J241J4171J4909p91Kj2646L957Q86m018q087p152N068
7607a328q33J0741k431r897j3797L646Q352J109K343J1069M130p866k2949j6157
7593c3868l886q194J0133J7567L283j4586M117M814o258l828M366n286N631J8291
7579g704n633n679L29L444M462n560l659K820N641q57j1177o15n74J0195j319
7564a5886j993R520M828K508j6087j2427K040J3176M57j2190J548P903L559M828
7550h216L861J0018N796Q1n433O43J1074L196j605k5341j2966j4627O254L365
$$ plain form
7650 10283 15465 10013 3243 6611 -2738 8315 12288 3655 -142 -10898 -16521 -21579 -18570 -14422
7636 -14422 -9992 -2705 9006 847 -43 -4455 125 -2732 5839 10829 8624 -2194 -7619 -4517
7622 -4517 -2725 -7283 -8868 -7627 6544 21453 20662 20664 8018 11975 12861 8843 756 -6396 -1328
7607 -1328 -2161 8580 6149 -3748 -17545 -13899 -5547 -4438 -2095 8974 13104 5238 -17711 -33868
7593 -33868 -37754 -45948 -35815 -18248 -14965 -29551 -25434 -20620 -26878 -30706 -26340 -31626 -25995 -7704
7579 -7704 -13337 -19016 -18687 -15243 -10781 -16341 -20000 -17180 -11539 -12396 -23573 -24188 -24762 -14567 -15886
7564 -15886 -17879 -8359 -3531 -1023 -17110 -29537 -27497 -14321 -13864 -26054 -24506 -16603 -13044 -8216
7550 -8216 -4355 5663 11459 11540 6107 6750 17824 21020 19415 -5926 -18892 -33519 -27265 -23900
7536b3900o962J0830j485R892O646j8973j2081O805Q193q413O163J4375J7800
7523H890N57r424k574L644P23j2874j4673j1075J2371K9179R701j2331l950r90
7509b826l521O860J3871J280p221J00L236r526j5130j0904m509J4141J0533O97
7495b919j263P800k166O24k188J775n694j453R675j2707M320R508j1721l8K3848
7480A7401N28n314j0573R44K039J2885k558q656p093j0548j0995J0476J0084J3920
7466A2540J5179L253o13O930M893j9114j6192q558n567k337J4252J2304j0882
7453F088J3087p426j4655j6765O111j1122r045J4638P361J5791M464j7930j3528
7440b2931k376o017J2988J175O349J3650Q908r319j0039N508J512j1592k875m44
$$ plain form
7536 -23900 -30862 -20032 -21517 -11625 -4979 -23952 -36033 -29228 -21035 -29448 -23285 -8910 8890
7523 8890 9447 23 -2551 1093 1816 -11058 -25731 -36806 -24435 4744 14445 2114 -1836 -2826
7509 -2826 -6347 513 14384 15664 8443 8543 11779 2253 -12877 -23781 -28290 -14149 -3616 -2919
7495 -2919 -4182 3618 1452 2076 -112 1663 -4031 -5484 4191 -8516 -4196 5312 -6409 -6447 17401
7480 17401 17929 12615 2042 2986 5025 17910 15352 6696 -397 -10945 -21940 -11464 -1380 12540
7466 12540 27719 30972 30359 37289 42182 23068 6876 -1682 -7249 -9586 4666 16970 6088
7453 6088 19175 11749 -2906 -19671 -13560 -24682 -33727 -19089 -11728 4063 8527 -9403 -22931
7440 -22931 -25307 -31324 -18336 -17161 -10812 2838 11746 2427 -7612 -2104 -592 -12184 -15059 -15503
7426a5503m602n103j1917R252J1886M509N281j0721k510L475N408J686J233j042
7412h668J0401k334k6369N417L146J5263J50j2447r196j7620r418O781M220J1177
7398b9497J2598J5242k905r644J390L341M155M305M082o152n194N850l310J2613
7384F874O829N274l617j5895p052q305j0558N025O763m164n673k612J0771K673
7370a3667K383O937n725j1273J6568J5299J3558j6051l2160p229J0185K586M600
7357a3989J6372m151o112j1440l282L655n014J7760J080r542L924Q666J0077p290
7343G14j7783k717m53o92R175Q578j0438o205J5199q475O26L951J4868J498k931
7328D915L358P426J22K007K090o827l198O65j023J649L537n869L462r267J244
$$ plain form
7426 -15503 -20105 -25208 -37125 -27873 -15987 -11478 -6197 -16918 -19428 -15953 -10545 -8859 -7626 -8668
7412 -8668 1733 -601 -26970 -21553 -18407 -3144 -2994 -15441 -24637 -42257 -51675 -44894 -40674 -29497
7398 -29497 -16899 -1657 -4562 -14206 -12816 -9475 -5320 -1015 3067 -3085 -8279 -2429 -5739 6874
7384 6874 13703 18977 15360 -535 -7587 -15892 -26450 -21425 -14662 -18826 -24499 -27111 -16340 -13667
7370 -13667 -11284 -4347 -10072 -21345 -4777 10522 24080 8029 -24131 -31360 -21175 -18589 -13989
7357 -13989 2383 -1768 -7880 -19320 -22602 -18947 -23961 -6201 -5121 -14663 -10739 -2073 8004 714
7343 714 -17069 -19786 -20239 -20931 -11756 -3178 -13616 -19821 -4622 -13097 -12471 -8520 6348 7846 4915
7328 4915 8273 15699 15821 17828 19918 13091 9893 10558 9535 11184 14721 8852 12314 3047 4291
7313D291P880P231j7597r539n395J82P20J5526O757l139M681k2165q077P601J0979
7298f4m973n203r310o434N386O273M868Q885M779j1469P824J3363K755m924Q269
7283B0025j1840j0413J7059J7991q919K632j4595j7812L075q925j1852N130P667
7270a0777K012p422J326J0391J2196M274p883j0180p831M238Q961r61J777m761
7256d640j3817q233J6005k652j3698J2352K1365p264n592m859P87k72j0525r634
7242c0677R40N747K1713O746j1628j6217n423O880J2092J6695O973N235R551L269
7228C1896j4521j8356n58N287R665q738j7525r420Q193P776Q452m563j2354j0219
7214b4985l724J7755R518j5640J41j244Q261m131M656q68j5577m950Q684R434
$$ plain form
7313 4291 12171 19402 1805 -7734 -13129 -12947 -12227 3299 10056 6917 11598 -10567 -18644 -11043 -64
7298 -64 -5037 -10240 -19550 -25984 -20598 -14325 -9457 -572 4207 -7262 562 13925 16680 11756 20025
7283 20025 8185 -2228 14831 32822 23903 26535 11940 -5872 -2797 -11722 -23574 -18444 -10777
7270 -10777 -8765 -16187 -14861 -4470 7726 12000 4117 -6063 -13894 -9656 -695 -1656 121 -4640
7256 -4640 -18457 -26690 -10685 -13337 -27035 -14683 6682 -582 -6174 -11033 -10246 -10518 -21043 -30677
7242 -30677 -29737 -23990 -2277 4469 -7159 -23376 -28799 -21919 -9827 6868 13841 19076 28627 31896
7228 31896 17375 -981 -1539 3748 13413 4675 -12850 -22270 -14077 -6301 2151 -2412 -14766 -24985
7214 -24985 -28709 -10954 -1436 -17076 -16935 -18179 -9918 -14049 -9393 -10261 -25838 -30788 -22104 -12670
7200a2670j101j5077n717j236M161k287J8477P002l160J168j0875l996J0810J4267
7186b34K616j2646k8874R33J2337O214L224R642J3580k196j3666p868L46O907
7172i685o661J1851R825K573p465j4963j2567M857L60N642K619M415k128Q830
7158b497J0591k796j8368q872o734P010n321k989L157P86J0722m857J0717o934
7144a6385r641j781P890l289O91J37P548M305J0624j2679k439O595R479j4998
7130a3943j229J7060K1970l0j3381N283K339o901k730m890k711r678m976j011
7116a4828n679J1730J5115j2616r254p89L72Q628L697K856r697j1793J4488J1085
7102C315K768o585j9288P42J681o665J3072J2524K880j063m880l311m720j0427
$$ plain form
7200 -12670 -13771 -28848 -34565 -35801 -31640 -33927 -15450 -8448 -11608 -10440 -21315 -25311 -14501 -234
7186 -234 2382 -10264 -39138 -38205 -25868 -19654 -16430 -6788 6792 4596 -9070 -16938 -16592 -9685
7172 -9685 -16346 -4495 5330 7903 438 -14525 -27092 -22235 -21875 -16233 -13614 -9199 -11327 -2497
7158 -2497 8094 5298 -13070 -21942 -28676 -21666 -26987 -29976 -26819 -26033 -15311 -20168 -9451 -16385
7144 -16385 -26026 -27807 -19917 -23206 -22515 -22378 -14830 -10525 99 -12580 -15019 -8424 1055 -13943
7130 -13943 -15172 1888 23858 23828 10447 15730 18069 11168 8438 3548 837 -8841 -13817 -14828
7116 -14828 -20507 -8777 6338 -6278 -15532 -16321 -15949 -7321 -3624 -768 -10465 -22258 -7770 3315
7102 3315 6083 -502 -19790 -19048 -17367 -24032 -10960 1564 4444 3381 -1499 -4810 -9530 -19957
7088a9957M939N691m973o027K081O742L322K517n952j7631k144J2334R611m568
7074a4015j562l43O308l46m973L812q755J667P535l593N243j194J041l080O24
7059a1631N552j242j395N989o885n480o58L979M423o974O355J2892M351j0682
7045a406m275p283j1476J2246J1622L047n767j6828O203k532kl700Q019J4823
7031B691P952q80P754m71o005k1310k3086j01N316J116l09J6800L376m455K528
7016i084l236P759r210N09O206R540L11N564p870j6362q52J245O960N799P065
7001D344r38k119j9963R67J0116l72N978L538J0611N157l523L393N639l237j3072
6986F519J035o788p921R495M968k493k831Q701m703j2903p922n457R584O280m74
$$ plain form
7088 -19957 -15018 -9327 -14300 -20327 -18246 -11504 -8182 -5665 -11617 -29248 -31392 -19058 -9447 -14015
7074 -14015 -15577 -15920 -9612 -9958 -14931 -11119 -19874 -18207 -10672 -14265 -9022 -10216 -9175 -12255 -11631
7059 -11631 -6079 -7321 -8716 -2727 -9612 -15092 -15750 -11771 -7348 -14322 -7967 4925 9276 -1406
7045 -1406 -5681 -12964 -24440 -12194 -572 2475 -3292 -20120 -13917 -16449 -16451 -20151 -12132 2691
7031 2691 10643 9763 17517 17046 11041 -10269 -33355 -33456 -28140 -27024 -27333 -10533 -7157 -11612 -9084
7016 -9084 -12320 -4561 -13771 -13262 -7056 2484 2795 8359 489 -15873 -16725 -15480 -8520 -2721 4344
7001 4344 3406 1287 -18676 -17709 -7593 -7965 -1987 1551 12162 17319 13796 17189 22828 19591 6519
6986 6519 7554 766 -7155 2340 7308 4815 1984 10685 5982 -6921 -14843 -20300 -10716 -4436 -4910
6971d910m319j7921J893J3022J365p142n627R036J3567R431n200p531p909J083
6957a1162J81O853n782o963l344J0467N157L030j0236O180N897J157q775L792
6943c548L839Q753j1727j9720n268O031K3498J7130j2973l352l086j508m751j0682
6929a7364K644P529j0437j0148j0498n583J2430Q484J6920M071m266J1515p99
6916D498p505P416Q905l883K204N413P17j1810j6617Q226O429n789m773k604n473
6901a4646J697L165J0937o89p132K002m237Q349j5051j4239r75J3351l3j3115
6887c0616M206J1247M639K240n43K667n669j0806M292N493K692m879O346J4813
6873F122J1596l410J303p16o17o175Q668J004k86m049m347j9609j2575l030j045
$$ plain form
6971 -4910 -9229 -27150 -25257 -12235 -10870 -18012 -23639 -14603 -1036 8395 3195 -4336 -12245 -11162
6957 -11162 -10981 -4128 -9910 -16873 -20217 -9750 -4593 -1563 -11799 -5619 278 1435 -7340 -3548
6943 -3548 291 9044 -2683 -22403 -27671 -21640 1858 18988 6015 2663 -423 -1931 -6682 -17364
6929 -17364 -14720 -7191 -17628 -27776 -38274 -43857 -31427 -22943 -6023 -1952 -6218 5297 4498
6916 4498 -3007 4409 13314 9431 11635 17048 17765 5955 -10662 -2436 3993 -1796 -6569 -9173 -14646
6901 -14646 -12949 -9784 1153 464 -6668 -4666 -8903 -554 -15605 -29844 -30819 -17468 -17501 -30616
6887 -30616 -26410 -15163 -10524 -8284 -8827 -6160 -11829 -22635 -18343 -12850 -10158 -15037 -8691 6122
6873 6122 17718 14308 15611 14895 14278 8103 16771 17775 17489 13440 9093 -10516 -23091 -26121 -27166
6858b7166K0584K181p053o319R783Q860j315L664o404n502l925K369K915J3320
6844E992K13j2429O739P815L482k030K097L12j1776o804k017N208M428m31l185
6829b386j68Q956j39j4645q937m131p656O055O190N964Q722J3951L877n381q459
6814A813r203O856K858l16r196l783J2495J578K317L54M328K992o669k078r076
6799d730P468J943j013j4845p352j347L038J0942K766r893o517J26M499J2514
6785b401Q658J6405J608k953j4967n795j6541J8021J1128N359j2156o996j0388
6772a1018O600N790J4886P733k0500j4418M071k440L727j136P4q076K303J1641
6758g63j0574P451J4109J046l916K015P598j340j2035n158K5707J5308M79j1543
$$ plain form
6858 -27166 -6582 -4401 -11454 -17773 -7990 870 -445 3219 -3185 -8687 -12612 -10243 -7328 5992
6844 5992 6205 -6224 515 8330 11812 9782 11879 12191 415 -6389 -8406 -3198 1230 799 -2386
6829 -2386 -2554 6402 6263 -8382 -17319 -21450 -29106 -23051 -16861 -10897 -2175 11776 15653 10272 1813
6814 1813 -7390 -534 2324 2008 -7188 -10971 1524 3102 5419 5773 10101 13093 6424 4346 -4730
6799 -4730 2738 4681 3668 -11177 -18529 -19876 -16838 -5896 -3130 -13023 -19540 -19414 -14915 -2401
6785 -2401 6257 22662 24270 21317 6350 555 -15986 2035 13163 18522 6366 -630 -11018
6772 -11018 -4418 1372 16258 23991 3491 -10927 -6856 -9296 -5569 -6705 -6631 -14707 -12404 -763
6758 -763 -11337 -3886 10223 11269 7353 9368 16966 15626 3591 -1567 24140 39448 39927 28384
6744B8384m252n529P85j6324k3085O925K4427J2234M11J6368m674K0837L4291
6731I0798J5873K4162M0878N0750P9477J44809K21892K48686J44150p7357k19896
6720G64222k38159j71436j09178o8367n0332k4290k9323j3284o693j477m013n23
6708D7147k3032k0148J4073M695p786l330K360K5896N267m928j3636m355M458
6695B6681j1435r04n510N894R220Q954l077o994r088k4781j188O118P196J7251
6681A8337K275m656j9363K048K280j593k250p303l868M37J1801Q926j99j683j931
6666C258K0119O955q675K661m342j5860m681p267j758l32M719M577M683q95j484
6651A678N40l758J088O152K533m047J861r58j1240M631J2975O563o35L38m884
$$ plain form
6744 28384 24132 18603 19388 3064 -20021 -13096 11331 23565 23976 40344 35670 56507 90798
6731 90798 106671 130833 171711 222461 301938 446747 668639 917325 1061475 984118 764222
6720 764222 526063 354627 245449 177082 126750 102460 73137 59853 53160 51683 47670 47147
6708 47147 24115 3967 18040 22735 14949 11619 13979 39875 45142 40214 26578 22223 26681
6695 26681 15246 14342 8832 14726 23946 32900 29823 22829 13741 -11040 -12228 -6110 1086 18337
6681 18337 20612 15956 -3407 -1359 921 -672 -2922 -10225 -14093 -13656 -1855 7071 6872 5189 3258
6666 3258 23377 30332 21657 24318 19976 4116 -565 -7832 -9590 -9922 -5203 -626 4057 3162 1678
6651 1678 2218 -1540 -452 5700 8233 4186 6047 5089 -6151 -1520 11455 18018 17383 17721 12837
6636A2837j4549J6541L117M87k5078m463O899q805j0005Q029J8394R259R282p462
6622A4483m772k674q617N731j5095q19O127j2066m575k315j17J1261O649K424
6608d375n540o033M56J2660L312P190K411o725j2428j704k966m789J384J3339
6594c808P917j29r528N483R93k483j3089m327Q137j053j880j0324N58M800R803
6579h930P935l66n373j858O352L842o796p993J228J805J310o102l278Q811O592
6564b821j43J853j846n819q845o160M179J1793P225P319k381o259Q378J571m017
6549D027j4679n210R249M677j1641K014k921j419K473j857M705N839Q855m664
6535e52l659m891j030O979j584j3076L088P158J5449j306l18p819Q253L682r453
$$ plain form
6636 12837 -1712 14829 17946 18433 -6645 -11108 -4209 -13014 -23019 -14990 3404 12663 21945 14483
6622 14483 9711 7037 -1580 4151 -10944 -11763 -5636 -17702 -22277 -24592 -24709 -13448 -6799 -4375
6608 -4375 -9915 -15948 -15492 -2832 480 7670 10081 3356 -9072 -10776 -13742 -18531 -17147 -3808
6594 -3808 4109 3980 -5548 -65 928 -1555 -14644 -18971 -10834 -11887 -13767 -24091 -23533 -18733 -8930
6579 -8930 -995 -1361 -6734 -8592 -2240 1602 -5194 -13187 -11959 -10154 -8844 -14946 -18224 -9413 -2821
6564 -2821 -2964 -1111 -2957 -8776 -17621 -23781 -19602 -7809 -584 6735 4354 -1905 6473 8044 4027
6549 4027 -10652 -15862 -6613 -1936 -13577 -11563 -14484 -15903 -13430 -15287 -10582 -4743 4112 -552
6535 -552 -4211 -9102 -10132 -3153 -4737 -17813 -14725 -7567 7882 6576 6258 -1561 6692 10374 921
6520I21J327l325N741N850J674k253o833n558j585L805P854j163L551l003k218
6505D785Q07J2633M602j3980m679j0539j2516j694p075j337J0662k915r773J6124
6491a4895J8231N654K398m375k495l486M320j5366O71K1114j0509k1261j591J2846
6477h744M533P972R518m079q397k587m788J7402K329n912j655j6507n400P444
6463h871n079N265l392N660l208Q150Q451N37j8482k102J1495J0648J0148k997
6449A6223j6941p707n390N035M389k395R583l125r008j0924p08P86L741Q782J1393
6434C734j6739j6532Q43J7878L1144J2579J0030j1911k0414R65N898l986q354
6421E135N947J3546m918j4222j1011R97n044m292L108O279M98K182r391J1851
$$ plain form
6520 921 2248 -1077 4664 10514 12188 9935 3102 -2456 -4041 -236 7618 6455 10006 7003 4785
6505 4785 5592 18225 22827 8847 4168 -6371 -18887 -20581 -27656 -28993 -18331 -21246 -31019 -14895
6491 -14895 3336 8990 11388 7013 4518 1032 5352 -10014 -9343 11771 1262 -19999 -21590 -8744
6477 -8744 -4211 3761 13279 9200 803 -1784 -6572 10830 13159 7247 5592 -10915 -16315 -8871
6463 -8871 -13950 -8685 -12077 -6417 -9625 -1475 6976 7513 -10969 -13071 -1576 9072 19220 16223
6449 16223 -718 -8425 -13815 -8780 -4391 -6786 2797 -328 -9336 -20260 -20968 -20182 -16441 -7659 3734
6434 3734 -13005 -29537 -28694 -10816 20328 32907 42937 31026 10612 11577 17475 13489 5135
6421 5135 11082 24628 19710 5488 -5523 -4526 -9570 -13862 -10754 -4475 -3977 -1795 -11186 665
6407F65N986J1819M611m334j1294k718l891N968Q701j660j2807N883m306n114
6393b491L987p757j2513L950J0777m77j0566o225k910j171Q250M920q563P056
6379a3733j555P376J6410J698j177o208J265p890j1676L299l234l462K2301P747
6365A1161K428j471q497q63r34o819o274J231P632L37J090N019M749J720r468
6350A041p921M566L453l114n925j0042k192J0026J0351p32j1264R07J034M816
6336d996J61M631n420R149o109o892R595L271M570N728q502r773L76P133m530
6321a608o29K0560n34q909p223j1136m83j214n068j2792N52O828J0283J0189L836
6306B652N220P477P463j2190p424n930r855k957J6886q795j2851L216J6355N141
$$ plain form
6407 665 6651 18470 23081 18747 7453 4735 844 6812 15513 13853 1046 6929 2623 -2491
6393 -2491 1496 -6261 -18774 -14824 -4047 -4524 -15090 -21315 -24225 -25396 -17146 -12226 -20789 -13733
6379 -13733 -15288 -7912 8498 10196 9019 2811 4076 -3814 -15490 -12191 -15425 -18887 3414 11161
6365 11161 13589 12118 3621 2758 1824 -4995 -11269 -10038 -2406 -2069 -979 4040 8789 10509 1041
6350 1041 -6880 -2314 1139 -1975 -7900 -17942 -20134 -10108 243 -489 -11753 -10846 -9812 -4996
6336 -4996 -4835 -204 -5624 3525 -2584 -9476 119 3390 7960 13688 5186 -4587 -4211 2922 -1608
6321 -1608 -2237 18323 17789 8880 1657 -9479 -9962 -11176 -16244 -29036 -28484 -21656 -11373 -1184 2652
6306 2652 7872 15349 22812 10622 3198 -2732 -12587 -15544 1342 -7453 -20304 -17088 -733 4408
6292D408N452N993P37n150P087J2460n315p227j7481k1234j4918k786J8936J6365
6278b673p136N390m026J303J3205O166p134j8183k75Q371M380m823l440K505K773
6263c597R204J2848L528O928j452j3434j3019J95j922N316m537M208J257p454
6249a931o934P73L905M972q118j271J2990R941Q899J709l882q162j0921o189k95
6234d514r674p389r10l119p742J1389Q597j3657k980j213N037J2727J140M237
6220h071K044n115J280M690k847R454k199M856l477k338q893q641P74K384L069
6205a3030l377Q12L841m020m274O550J0013R070L001j6860j1281m874L57K402
6191b1670k402L062l74J2277J0961N893m017l443O827J0872R915j5849j5136L105
$$ plain form
6292 4408 9860 15853 16590 11440 18527 30987 25672 18445 964 -20270 -35188 -37974 -19038 -2673
6278 -2673 -9809 -4419 -8445 -7142 6063 12229 5095 -13088 -13363 -4992 -612 -5435 -8875 -6370 -3597
6263 -3597 5607 18455 21983 28911 27459 14025 1006 1201 -721 4595 58 4266 5523 -1931
6249 -1931 -8865 -8092 -4187 785 -7333 -8604 4386 14327 23226 24935 21053 12891 1970 -4219 -4514
6234 -4514 -14188 -21577 -22487 -25606 -33348 -21959 -13362 -27019 -29999 -31212 -26175 -13448 -12308 -8071
6220 -8071 -6027 -11142 -9862 -5172 -8019 1435 -764 4092 615 -1723 -10616 -19257 -18483 -16099 -13030
6205 -13030 -16407 -15595 -11754 -15774 -20048 -13498 -3485 5585 8586 -8274 -19555 -24429 -24072 -21670
6191 -21670 -24072 -21010 -21384 -9107 1854 7747 3730 287 7114 17986 27901 12052 -3084 21
6177B1o937j622r147m377L642M527L59L313N032L366K226j3681m347R205l501
6162a1921K89j499J9296P219j213n792K925o143o190p80q440O314N79j675j397
6147h428q942j6826J786l90J0723J3212N904N696l252l161k448J1177k731Q20
6133C140J378q909n661p10k946R255J9008K79j5073p384j004n869P143P466k474
6118b361k319N465Q41J3152o301j049K2125N097n913L826j2000j8784j2114J4523
6104D188j602Q494J1383j1957j3427j0584j0721P562J5083l942o163J2522J7334
6091A8170O414J854p814p275n300R45j722L882J775O53M245K247r192k720k688
6076C474o523k369J0387M399j1431j0676j1622N51m092R906J235K687J10K925
$$ plain form
6177 21 -6916 -8538 -17685 -22062 -18420 -13893 -13534 -10221 -5189 -1823 403 -13278 -17625 -8420 -11921
6162 -11921 -11632 -13131 6165 13384 12171 6379 9304 3161 -3029 -3809 -12249 -5935 -5356 -7031 -8428
6147 -8428 -17370 -34196 -32410 -32800 -22077 -8865 -2961 2735 -517 -3678 -6126 5051 2320 3140
6133 3140 4518 -4391 -10052 -10762 -13708 -4453 14555 14834 -239 -7623 -8627 -14496 -7353 113 -2361
6118 -2361 -4680 785 1626 14778 8477 7428 29553 34650 28737 32563 20563 1779 -10335 4188
6104 4188 2586 11080 22463 10506 -2921 -13505 -24226 -16664 -1581 -5523 -11686 836 18170
6091 18170 24584 26438 18624 11349 6049 6994 5272 9154 10929 11582 15827 18074 8882 6162 3474
6076 3474 -3049 -5418 4969 9368 -2063 -12739 -24361 -23810 -27902 -17996 -16761 -14074 -13964 -11039
6062a1039K771l63M640R261K289J933n189j528Q969n68q510k2972j933Q018K0168
6047E947p036p742L365j3206O108J9680K319k3508n248K7326J5805o367o31M136
6033B0948q879o884j712j3126j881n744m895M146O118M226J383l380R6j126K933
6018g777l61J3781J208j2222l286p047j563R826J3426J7721R248J053k9577j4910
6004a0480J5928n27P07O455j4766m855J3161J1993p723j0178R739K2948N33J895
5990C4830j1114q382j9212k769r919p365k302J4719J6230j43k844R12j744n053
5976d156P74r510N216J2614K978o746p773M120N824Q753O285n949q873K826R531
5961A5914L79M582o554j1406j0703m089K578M084k932K152L405j6174j940J0833
$$ plain form
6062 -11039 -8268 -8631 -3991 5270 7559 9492 4303 2775 11744 11176 2666 -20306 -22239 -14221 5947
6047 5947 -1089 -8831 -5466 -18672 -12564 7116 9435 -14073 -19321 8005 23810 17443 16812 20948
6033 20948 12069 5185 3473 -9653 -11534 -17278 -22173 -18027 -11909 -7683 -6300 -9680 -9584 -10710 -7777
6018 -7777 -8138 5643 6851 -5371 -8657 -15704 -17267 -7441 5985 23706 32954 34007 4430 -10480
6004 -10480 5448 4921 5628 12083 -2683 -7538 5623 17616 9893 -285 9454 32402 32935 34830
5990 34830 23716 15334 -3878 -6647 -16566 -23931 -26233 -11514 4716 4573 1729 2641 897 -4156
5976 -4156 -3382 -12892 -7676 4938 7916 1170 -6603 -2483 3341 12094 18379 12430 3557 6383 15914
5961 15914 16293 20875 14321 2915 -7788 -11877 -9299 -5215 -8147 -5995 -2590 -18764 -20704 -9871
5947i871N689K99O775j7890N457k00l891j2475j3596M328N90J2386J769N627R449
5932e554n028J364q940P731J4562J1074m883j4466j1142P421J4333M801q257J0137
5918A3153j691q154m119q313m85O807N003L101j1720j1503J2581J41q738q513
5904b2450J1346J5653K527p835J088O127n291j3837J894P995K655o03m248J2231
5890G252L910r165n332M74q018Q066K589j837J2979o060n794L381O05k317n33
5875B00q405L273R938J794j685L623j0684n706J981j686O547O845J931o796Q111
5860I281O789m295j7557M489M04O268M640J8259j0545l009j2582k5725P056K0267
5846C740M669q05J5564J1904j4301k1880q679L479N386L624r400l312J5853J4734
$$ plain form
5947 -9871 -4182 -3883 2892 -14998 -9541 -9741 -13632 -26107 -39703 -35375 -34785 -22399 -20630 -15003 -5554
5932 -5554 -10582 -9218 -18158 -10427 4135 15209 10326 -4140 -15282 -7861 6472 11273 3016 13153
5918 13153 11462 3308 -811 -9124 -9609 -2802 2201 5302 -6418 -17921 -5340 -5199 -13937 -22450
5904 -22450 -11104 4549 7076 -759 329 6456 1165 -12672 -10778 -2783 -128 -731 -4979 7252
5890 7252 11162 1997 -3335 -2861 -10879 -2813 -224 -2061 10918 4858 -936 2445 3050 733 200
5875 200 -8205 -4932 5006 6800 5115 8738 -1946 -7652 -5671 -7357 -810 6035 7966 1170 9281
5860 9281 16070 11775 -5782 -1293 -889 5379 10019 28278 17733 14724 2142 -23583 -16527 3740
5846 3740 8409 7604 23168 35072 20771 -1109 -9788 -6309 -923 2701 -6699 -10011 5842 20576
5832B0576l540j3880r588K97j544k53J3618J2393k857q28P411l235j2328q508
5818b266m959O460O401p807j2943k645o208Q445L646j180L678K622o103l712n564
5803b2135q366o967J3885J4953R766o503j4429O160J931J0810N740k0480p435
5790b3070J6168O077N040J6733j321j2108o030k531O112Q86r692R4K022o241J5057
5775G196P967p888j888j938Q00o591r547P5J4384Q832M539J1967K485k3913j7893
5760a1413k2637j1415m445K1061K2131J1634J221J2505N722k76n377J894n384
5747A5221K321R296J467j0040o358L711P258J742l251j748r351k987p81j1253
5733d753n623O466J123L60P297N780j338j0232l682N805N22j257l700o032j195
$$ plain form
5832 20576 17036 3156 -6432 -6135 -7679 -7932 5686 18079 15222 14394 21805 18570 6242 -2266
5818 -2266 -7225 -765 5636 -2171 -15114 -17759 -23967 -15522 -11876 -13056 -9378 -6756 -12859 -16571 -22135
5803 -22135 -30501 -37468 -23583 -8630 1136 -5367 -19796 -13636 -11705 -895 4845 -15635 -23070
5790 -23070 -6902 -825 4215 20948 19627 7519 1489 -1042 5070 5956 -3736 -3642 -1620 -7861 7196
5775 7196 15163 7275 5387 3449 4249 -2342 -11889 -11814 2570 11402 15941 27908 30393 6480 -11413
5760 -11413 -34050 -45465 -49910 -28849 -6718 4916 6137 18642 24364 24088 18711 20605 15221
5747 15221 17542 26838 28305 18265 11907 15618 22876 24618 21367 19619 10268 7281 6500 -4753
5733 -4753 -10376 -3910 -2787 -2427 4870 10650 9312 -920 -4602 1203 1725 468 -3232 -9264 -10459
5718a0459K6137Q462q132m027m499N04J916n231j4846j1316J0011M987q494j669
5704a6656J3715P822P962Q651k780r857j707n78P735k254n479j624r968k244j642
5689h904M044O915J0382N797j4248q585P234j740o112Q136P350n72J092N642r773
5674F658m991P924O710j0647k4351p510J4361N293o606r429n324n79p43P080J5979
5659f175M908l158P845R491n976j5706j2613k037J3192O023P050n982L015J983
5645A860j0449o214L463M477K220o03J0931J208J2422J3897l266j146n639j7288
5631E873j5341p842L004J5446j71L561N907P082j1141O890J21q273O953j0496
5617A573j2271M680p891N825j81O136M634m105n585j150J0729m54k7513L953m43
$$ plain form
5718 -10459 15678 24140 16008 11981 7482 7986 9902 4671 -10175 -21491 -11480 -6493 -14987 -16656
5704 -16656 -2941 4881 12843 21494 18714 8857 7150 6572 14307 12053 6574 4950 -5018 -7262 -8904
5689 -8904 -4860 2055 12437 18234 3986 -4599 2635 895 -5217 2919 10269 9697 10789 16431 6658
5674 6658 1667 9591 16301 5654 -18697 -26207 -11846 -6553 -13159 -22588 -27912 -28491 -29234 -22154 -6175
5659 -6175 -1267 -4425 3420 12911 6935 -8771 -21384 -23421 -10229 -4206 2844 -3138 -123 1860
5645 1860 -8589 -14803 -11340 -6863 -4643 -5246 5685 6893 19315 33212 29946 28800 23161 5873
5631 5873 -9468 -17310 -14306 1140 969 4530 10437 17519 6378 13268 13389 5116 12069 1573
5617 1573 -10698 -6018 -13909 -8084 -8265 -2129 2505 -1600 -7185 -8335 2394 1940 -25573 -21620 -22063
5602b2063O902l947K074J3471R679q653p978J2436l621l613n102J3370n878j825
5588d748J3478P652O547k085j7463p666l689o648L803O595j41q050l494L7J6053
5573A81J8455k82O141Q036J205j7525j6915m722j2835l443K643Q314K0630j440
5559H443q751l564l38k818J077j45l542L767L392k833L380n643R541N988M236
5544A2190J2266j3212l967P242K575q412m927o92J558j7730K868M682j393L095
5530c857n88j617P850P768m256n958Q269n00k164p098n303P93j561N949L39j1001
5514a2935P768P755p011n559q986m19O72J877R987j74q968n474m667j703J9677
5499h160Q116R713J1907N51j4857l483L74K660p099j52L693l857j7751m692N447
$$ plain form
5602 -22063 -15161 -19108 -17034 -3563 6116 -2537 -10515 1921 -1700 -5313 -10415 2955 -2923 -4748
5588 -4748 8730 16382 22929 20844 3381 -4285 -7974 -14622 -10819 -4224 -4365 -12415 -15909 -15872 181
5573 181 18636 18354 24495 32531 33736 16211 -704 -5426 -18261 -21704 -19061 -10747 9883 8443
5559 8443 -308 -3872 -4210 -7028 -5951 -6096 -9638 -5871 -2479 -5312 -1932 -7575 1966 7954 12190
5544 12190 24456 11244 7277 14519 17094 8682 3755 3063 4621 -13109 -10241 -5559 -6952 -3857
5530 -3857 -4445 -6062 1788 9556 5300 -658 7611 7111 4947 -2151 -7454 -6661 -8222 -2273 -1934 -12935
5514 -12935 -5167 2588 -4423 -9982 -18968 -19387 -18715 -16838 -6851 -7025 -15993 -21467 -26134 -27837 -8160
5499 -8160 -44 9669 21576 22127 7270 3787 4161 6821 -278 -430 3263 -594 -18345 -23037 -17590
5484a7590r707k376Q311J0082J7343J3809p712k4562l352J8341P265J3M112N75
5470A4552j400j114j2038q447J7014J198k273j875L039n452j3044m798O246M029
5456d363o632P93J6731R603q091j4994n085J3160O617L933k280J282l487n596
5442A591r662k4j3183l056Q819N741O096J4870N42m413n265R627M939J0220j3139
5427A3703j2855N073J7054j54n205n832n020k862M686o739J876P324R981j5498
5413E532J611J5757p868J0348Q147j0269p385K764k769Q837J970j5776j3184P743
5399E458N850j0804j7297N305p343L737J5864K122k451p68O650r25j123r330k349
5384g404P202J3313K581j2946j675N683L735J2572r150j30r412j6807j0673P626
$$ plain form
5484 -17590 -27297 -29673 -21362 -11280 6063 19872 12160 -12402 -15754 2587 9852 9865 13977 14552
5470 14552 13152 12038 0 -8447 8567 9765 7492 5617 8656 3204 -9840 -14638 -8392 -4363
5456 -4363 -10995 -10202 6529 16132 8041 -6953 -12038 1122 7739 11672 9392 10674 7187 1591
5442 1591 -8071 -8095 -21278 -24334 -15515 -9774 -3678 11192 11734 7321 2056 11683 16622 26842 13703
5427 13703 848 5921 22975 22821 17616 11784 6764 3902 8588 1849 3725 11049 21030 5532
5413 5532 7143 22900 15032 25380 33527 23258 15873 18637 15868 24705 26675 10899 -2285 5458
5399 5458 11308 504 -16793 -11488 -18831 -15094 770 2892 441 -327 6323 5398 4275 -5055 -7404
5384 -7404 -202 13111 15692 2746 1071 6754 10489 23061 13911 13781 4369 -12438 -23111 -15485
5370a5485J1284J1912L647O31j131j2630L939n64k791j2782L606l704J0649K338
5356a081k0947N377Q841J09l851K141P940J2841K02O277N781j3802j1706m343
5342f221n277n308J391N51J9436J6503J5986O906j5782p989q286j7875K45J0031
5328D311P60q951L989P621Q070J628k063r873m07p23j3651j4507J320J2639L226
5313f611n571m147n909M532J5188Q272l10J913j5276j079n502J642Q609k022j1059
5298a7330l735M053J0025J4030m540j1522L755j292j0527m374R701J5717R752
5285A3713q365o03o83O960M064n895O46Q712j0230q144l029M812q452l787M080
5270f201M409o831j0287N010K626O923P808Q43r504m179R644J2734l464j897j2951
$$ plain form
5370 -15485 -4201 7711 11358 11989 10858 -1772 2167 1603 -1188 -13970 -10364 -14068 -3419 -1081
5356 -1081 -22028 -16651 -7810 -7701 -11552 -9411 -1471 11370 11572 17849 23630 9828 -1878 -6221
5342 -6221 -11498 -16806 -15415 -14864 4572 21075 37061 43967 28185 20196 11910 -5965 -5720 4311
5328 4311 5071 -3880 109 7730 15800 17428 15365 5492 5085 4362 -9289 -23796 -22476 -9837 -6611
5313 -6611 -12182 -16329 -22238 -17706 -2518 5754 5444 7357 -7919 -8998 -14500 -12858 -4249 -6271 -17330
5298 -17330 -21065 -17012 -6987 7043 2503 -9019 -5264 -6556 -17083 -21457 -11756 3961 13713
5285 13713 5348 4745 4062 11022 15086 9191 9837 18549 8319 175 -2854 1958 -6494 -10281 -6201
5270 -6201 -1792 -8623 -18910 -13900 -11274 -4351 3457 4300 -5204 -9383 261 12995 9531 7634 -5317
5255e317j4614j3467J0995j445J702J1169R876P484o30K94M593O284p648p783
5241A493L963J8111M172j6356j818j9581k327J579n776J1473J2628o136k925q479
5227i979M227M465q740j2087j1168J1890R287P636p32N491K249R02N051Q85N743
5212A5120q67j3240j4220N56J3579J081j034N99j2003o422J512J307R436k209
5198f805j0368o847n138J2261K2724J023j2680L569j54r522J962M694J3089j020
5184F788q102j1152o78N331j185M655k061J24n957k825l300O225K0062M279O56
5169A2860q167N400j1387l618J1344o423p593l624j0840m095M549J1098N915k599
5155g180J8605j0860p738O719j890M292O200l988j784m003j3058m015j1651L876
$$ plain form
5255 -5317 -19931 -33398 -22403 -23848 -22146 -10977 -1101 6383 5753 6047 10640 16924 9276 1493
5241 1493 5456 23567 27739 11383 9565 -10016 -12343 -10764 -16540 -5067 7561 1425 -1500 -9979
5227 -9979 -5752 -1287 -10027 -22114 -33282 -21392 -12105 -4469 -5201 290 2539 3441 8492 9377 15120
5212 15120 14253 1013 -13207 -12651 928 2009 975 1574 -10429 -16851 -15339 -14032 -4596 -6805
5198 -6805 -17173 -24020 -29158 -16897 5827 6850 -5830 -2261 -2415 -11937 -9975 -5281 7808 6788
5184 6788 -1314 -12466 -13144 -7813 -8998 -4343 -6404 -6280 -12237 -15062 -18362 -12137 7925 12204 12860
5169 12860 4693 10093 -1294 -4912 6432 9 -7584 -11208 -22048 -26143 -21594 -10496 -4581 -7180
5155 -7180 11425 565 -7173 -454 -2344 1948 8148 4160 2376 -1627 -14685 -18700 -30351 -26475
5141b6475J5151R124m218P685j947J0355k794m895l749p171M131L563o808N008
5127c040P15q750O184J4094P084j036j8145L771l129R321k81j7153m695P238K365
5112e457j4411j289O551K3163Q936P349n682n601Q753k877p99M392j2440j8896
5098h308j4451L004N385K521R5P600N635l265p935J0925K99j08L708O815k502
5083I418l819p816j0191J0367K0599o513k781j258O016m565M336J774m419j445
5069I703R343M061q319n164k123p743r721q294J376J3069q899k319P451K24N932
5054a423J513M944R052L937J5534K087j8848o781n455R154j0152n789j0804N557
5040g474J4372j162j4104j0008P625K2589J083L872j0136j3194J1979L746J371
$$ plain form
5141 -26475 -11324 -2200 -6418 1267 -680 9675 6881 1986 -1763 -8934 -4803 -1240 -8048 -3040
5127 -3040 -2325 -11075 -4891 9203 16287 15251 -2894 877 -2252 7069 6788 -10365 -15060 -7822 -5457
5112 -5457 -19868 -21157 -14606 8557 17493 24842 19160 13559 22312 19435 18636 23028 10588 -8308
5098 -8308 -22759 -19755 -14370 -11849 -11754 -4154 1481 -1784 -9719 1206 1505 1397 5105 11920 9418
5083 9418 5599 -2217 -12408 -2041 18558 12045 9264 8006 14022 9457 13793 15567 11148 9703
5069 9703 19046 23107 14788 9624 7501 -242 -9963 -18257 -16881 -3812 -12711 -15030 -7579 -7355 -1423
5054 -1423 90 5034 14086 18023 33557 35644 16796 10015 4560 13714 3562 -2227 -13031 -7474
5040 -7474 6898 5736 -8368 -18376 -10751 11838 12921 16793 6657 -6537 5442 9188 10559
5027A0559K995p365k398K366M41J114R494m790p038M583J1677o526p672k649j1474
5012f683j5307r99r664L451R973O57N154J1661m120K407j345q022r030K0354J0305
4997H792j7542K3Q450P573Q315k894p866j7655r52J4059K526N865q11r999j0417
4982a2533o736k362R277J4243n701M994J628P807m888l38p548P478l042n782L259
4967b44K141L232O08O925N121M731o181n124n981J920P764j2856O720Q553K034
4952A9363q465j317L776M185o13o360r225q323K779N568P127K808j5670r36l877
4937i180p13L982P639J809N679l393o550N112K591q794o450R055Q569J0121O266
4922B5743j2666j55r74q474j595O091j834l897l82j2078j1478J6962O717n886
$$ plain form
5027 10559 13554 6189 3791 6157 6598 7712 17206 12416 5378 9961 21638 15112 7440 4791 -6683
5012 -6683 -21990 -22989 -32653 -29202 -19229 -18572 -13418 -1757 -5877 -3470 -4815 -12837 -21867 -1513 8792
4997 8792 -8750 -8727 -277 7296 15611 12717 4851 -12804 -13756 303 2829 8694 7883 -2116 -12533
4982 -12533 -19269 -21631 -12354 1889 -3812 1182 2810 10617 5729 5391 -2157 5321 2279 -3503 -244
4967 -244 1897 5129 5737 12662 17783 22514 16333 11209 5228 7148 14912 2056 8776 17329 19363
4952 19363 10898 9581 13357 17542 16929 10569 1344 -6979 -4200 1368 8495 11303 -4367 -5303 -9180
4937 -9180 -9893 -5911 1728 3537 9216 5823 -727 4385 6976 -1818 -8268 787 9356 19477 25743
4922 25743 13077 12922 11948 3474 1879 7970 6136 2239 1857 -10221 -21699 -4737 1980 -3906
4908c906j0457j104Q4R670j0945n519J0329J3149q379N058l343l742Q826p631
4894g910r683o171M739q86o126p414J2273O928n96N917K766M854Q97p839j2464
4879b0715K17R473J3589P840n156r432n872J2630m66l213N510J6888n333r585
4865F375j7532j6427O4L586J743m32J5021P558j130r492J0616L398j433J2779
4851A4694J077K377j188J929j6441l357N29j428p756O295J4978r698j3524N621
4837e892L880J3893J4005j1333n776J6336P615k5607j3205l75n47J9019j311m040
4823F662j6370q298N240k150j146L297P544k282J2963Q140q565m229J502l273
4809i65j866r83l306K436O56r523O914J3322k10m537L549J6788n933P595L230
$$ plain form
4908 -3906 -14363 -15467 -15383 -5713 -16658 -22177 -11848 1301 -7078 -2020 -5363 -9105 -279 -7910
4894 -7910 -17593 -23764 -19025 -19911 -26037 -33451 -21178 -14250 -14846 -8929 -6163 -1309 -412 -8251 -20715
4879 -20715 -20498 -11025 2564 10404 5248 -4184 -10056 2574 2108 -1105 4405 21293 15960 6375
4865 6375 -11157 -27584 -27520 -23934 -22191 -22623 -7602 -44 -1174 -10666 -50 3348 1915 14694
4851 14694 15771 18148 16960 18889 2448 -909 -380 -1808 -9564 -3269 11709 2011 -11513 -5892
4837 -5892 -2012 11881 25886 14553 8777 25113 32728 7121 -6084 -6459 -7006 12013 10702 6662
4823 6662 -9708 -18006 -12766 -14916 -16062 -12765 -5221 -7503 5460 13600 5035 806 2308 -965
4809 -965 -2831 -3814 -7120 -4684 -4028 -13551 -6637 6685 6475 1938 5487 22275 16342 23937 27167
4794B7167o871r324r382o548O709J5511J2741p275j1898j0634R64K909K243q438
4780b126j518L426o209j6140k782Q705Q251J3146j884n803R17N360Q075N857J8712
4765C5987O214j5879j9209q871J5583p16m447m802j3174j742K552L942k59J2595
4751G774K058m214M79M604q748m622p389o416J0506N841m89r344p529J3930J2707
4736I148L232m281m535j6527k723N054j9208R57J7587Q101l224M048j773j3625
4722a7769P746J2764Q504K19n161n642j0752N496Q648J0127L968O127p644k1788
4708e157k357O8J4931j992l411L40j7627L788Q193J2471l565J795m562p81l172
4693a038j3931M448P382j3331n136J4212J5661N199N273l771L863K087p107j0050
$$ plain form
4794 27167 20296 10972 1590 -4958 1751 17262 30003 22728 10830 196 1160 4069 6312 -2126
4780 -2126 -3644 -218 -6427 -22567 -25349 -16644 -8393 4753 2869 -2934 -2017 3343 11418 17275 35987
4765 35987 42201 26322 7113 -1758 13825 13109 8662 3860 -9314 -11056 -8504 -4562 -4821 7774
4751 7774 9832 5618 6097 10701 1953 -2669 -10058 -16474 -5968 -127 -616 -9960 -17489 -3559 9148
4736 9148 12380 8099 3564 -12963 -15686 -10632 -29840 -28883 -11296 -3195 -6419 -2371 -4144 -17769
4722 -17769 -10023 2741 11245 11464 6303 661 -10091 -4595 4053 14180 18148 24275 16631 -5157
4708 -5157 -7514 -7446 7485 5493 2082 2422 -15205 -11417 -3224 9247 5682 7477 2915 2134 -1038
4693 -1038 -14969 -10521 -3139 -16470 -21606 -7394 8267 13466 18739 14968 18831 20918 13811 3761
4679C761N522R116J525m691k75M589j3203j2934k371Q930q536j3529n903K2335
4665e664P31L890N101J1107M030p974J558k131k158Q787q939m550J022Q103L559
4650A6472m391j730L570o44k016l360J38M914K545n672p774o627J165r010r532
4635b1952N005q40J6741N526k938J3489M981j2439q264K691M780n643N838l282
4621C693r718k817L664J1653l599m265P386O429j8365k772J0084J7302j0327m101
4607D247j9371L15N77L239O505r57P214O429j3795j2298p862O557R637L118j6808
4592b3253L861P335M482P193J7069N036r791j0670k124p344o322J758O444O557
4578B31J8739L770n959j4266j6375q589M052J0253k63k051R422J2269O580m21
$$ plain form
4679 3761 9283 18399 19924 15233 14958 19547 6344 -6590 -8961 -31 -8567 -22096 -27999 -5664
4665 -5664 -4933 -1043 4058 15165 19195 11221 12779 10648 8490 17277 8338 3788 4810 12913 16472
4650 16472 12081 10351 13921 13277 11261 7901 8039 12953 15498 9826 2052 -4575 -3410 -12420 -21952
4635 -21952 -16947 -17787 -1046 4480 1542 15031 20012 7573 -691 2000 6780 1137 6975 3693
4621 3693 -6025 -8842 -5178 6475 2876 -1389 5997 12426 -5939 -8711 1373 18675 8348 4247
4607 4247 -15124 -14809 -14232 -10993 -4488 -5445 1769 8198 -5597 -17895 -25757 -19200 -9563 -6445 -23253
4592 -23253 -19392 -12057 -7575 -382 16687 21723 11932 1262 -862 -8206 -14528 -12770 -6326 231
4578 231 18970 22740 16781 2515 -13860 -22449 -18397 -8144 -8407 -10458 -1036 11233 17813 17392
4564A7392k1887J1772J2383K75q849k754p934o517J383L953Q460p698J272m913
4550c662l813k588o946q23P370J1049l889o98J0744k221j4008j426J1599k165
4536a477j462L978q163j699K147P794q183k032O899N652J0819P368l464r384j2761
4521c968l724j4517l377k326P824q86j512Q714O094m131J1144M16j6497m857M892
4506a6711j020K37j2178O414J406J6390N933j0750l652L565J8639l387m19P584
4492A2051N669j8493j0537j0864J809P803M891m075o7P454J738j724R400M127
4478I182P324l787M832P29j6059n795j754J0093o160o334R388Q756j1348k0226
4464b1159J508M511n04J1766m364o933J7668J2234o748r553K61K719j890J848
$$ plain form
4564 17392 -4495 7277 19660 19935 11086 8332 398 -6119 -4736 -783 7677 -21 1251 -3662
4550 -3662 -7475 -10063 -17009 -17832 -10462 587 -3302 -4000 6744 4523 -9485 -10911 688 -1477
4536 -1477 -2939 1039 -7124 -8823 -6676 1118 -7065 -9097 -2198 3454 14273 21641 18177 8793 -3968
4521 -3968 -7692 -22209 -25586 -27912 -20088 -20974 -22486 -13772 -7678 -11809 -665 -249 -16746 -21603 -16711
4506 -16711 -17731 -17494 -29672 -23258 -21852 -5462 471 -10279 -13931 -10366 8273 4886 4467 12051
4492 12051 17720 -773 -11310 -22174 -20365 -12562 -7671 -11746 -11813 -4359 -2621 -4345 5055 9182
4478 9182 16506 12719 17551 18280 2221 -3574 -5328 4765 -1395 -7729 1659 10415 -933 -21159
4464 -21159 -19651 -15140 -15644 -3878 -8242 -15175 2493 14727 7979 -1574 -1313 1406 -484 1364
4450A364p435K480q914O453J6598p421q809l099l203p97P632m457m99K874l078
4435a0311M575J2579m645j1930J3777N505o357J887M469o696J649M711O37m013
4421E837R613O386j038j0937j2573O104q094o375M358J0821j5817j0795P750J3555
4407a205R55J0004j3395R33K884J978Q33M689L530o978J0315q088k2855k381J3438
4392e343N193n406m66J1013P593M604m126j0255j402j675m070O827O335p257j0583
4377i018p674J5396J9718r815k1141l915P491O911N117J0075j493m701J4141j3772
4363G320n887l065N599j867m191j0367K079J2820O417L60P300K493R857m068o619
4348A8181n08j2026p914N349R567O244J668j3343N545N669J794j3810r305j0633
$$ plain form
4450 1364 -6071 -3591 -12505 -6052 10546 3125 -5684 -8783 -11986 -12783 -5151 -9608 -10107 -7233 -10311
4435 -10311 -5736 6843 2198 -9732 4045 9550 3193 5080 9549 2853 4502 9213 9850 5837
4421 5837 15450 21836 20798 9861 -2712 3392 -4702 -11077 -6719 4102 -11715 -22510 -14760 -1205
4407 -1205 -250 9754 -3641 -2708 176 2154 2987 7676 11206 4228 14543 6455 -16400 -18781 -5343
4392 -5343 -150 -5556 -6022 4991 12584 17188 13062 2807 1405 -270 -4340 2487 8822 1565 -9018
4377 -9018 -16692 -1296 18422 8607 -12534 -16449 -8958 -2047 3070 13145 11652 6951 21092 7320
4363 7320 1433 -1632 3967 2100 -2091 -12458 -10379 2441 8858 9218 16518 19011 28868 24800 18181
4348 18181 17673 5647 -2267 3082 12649 18893 20561 7218 12763 18432 20226 6416 -2889 -13522
4334a3522q337j2844J7959J2785n78N157J4999k23j740R331O681l124k0768r522
4320c746N221k336j3393L845O700n030M136J3224q246k0022j04J7922k682M877
4306C66Q050J730j2788j4701J067J811n349Q68k750P909J3343K230L320L479o979
4291A606j1654l966j150K448J3076m069R306J2455n454O279M353k369p460j1964
4277A437m975j482r575J4237O467l957m221L924r147k0148n995J4237P289L712
4263h197N451k188N212R452O06j7055r13k631O70K167o098J1827k507q387R419
4248c172M638K173k0852L177P08j942M833k695k398Q385O360q044K118O250q349
4233h810R10J3637l971n260m042O932j1119j8505j3386Q625J5320J4899j123l116
$$ plain form
4334 -13522 -21859 -34703 -16744 -3959 -4537 620 15619 15396 13656 22987 29668 26544 5776 -3746
4320 -3746 1475 -861 -14254 -10409 -3709 -8739 -4603 8621 375 -19647 -19751 -1829 -4511 366
4306 366 8416 10146 -2642 -17343 -16276 -14465 -19814 -18946 -21696 -13787 -444 1786 5106 8585 1606
4291 1606 -10048 -14014 -15164 -12716 360 -3709 5597 18052 12598 18877 23230 20861 13401 1437
4277 1437 -3538 -5020 -14595 -358 6109 2152 -2069 1855 -7292 -27440 -33435 -19198 -11909 -8197
4263 -8197 -2746 -4934 278 9730 10336 -6719 -7632 -10263 -9593 -7426 -13524 -1697 -4204 -12591 -3172
4248 -3172 1466 3639 -17213 -14036 -13328 -15270 -10437 -13132 -15530 -7145 -785 -8829 -6711 -461 -8810
4233 -8810 -7900 5737 1766 -3494 -7536 -604 -11723 -30228 -43614 -34989 -19669 -4770 -5893 -9009
4219i009J3437J6345O963j2847m330K443L17j4000J269Q771O470M873K989l942
4205A9749j3717n203K528Q677L924n973P247P224k1245r286R090K4450m936k709
4191A9820r902j6060p766R812l924l197m218J2859J4140j3901J2837R673J331
4178B1504N741o697j512N761R54k444J132o342k2377l324J0221L175N170k362
4164H600q842q756Q902J5850J4894n620j1732j0823n760q643P074J6141J0837
4151B2122m639j3961r330l622P85m085J0919P531o756q698r150J0474j104o642
4137a6156k650J287P937r666L090J1504m60J1357Q238M380Q126O94N980j3355
4123B0306j7756j469j2092L78J5984n628j4693j5636R955J5089K757M00J0292
$$ plain form
4219 -9009 4428 20773 27736 14889 10559 13002 13319 -681 588 9359 15829 20702 23691 19749
4205 19749 6032 829 3357 12034 15958 9985 17232 24456 3211 -6075 3015 27465 22529 19820
4191 19820 9918 -6142 -13908 -4096 -8020 -11217 -15435 -2576 11564 -2337 10500 20173 21504
4178 21504 27245 20548 19036 24797 25751 23307 24439 18097 -4280 -7604 2617 5792 10962 8600
4164 8600 -242 -8998 -96 15754 30648 25028 13296 2473 -3287 -11930 -4856 11285 22122
4151 22122 17483 3522 -5808 -9430 -8645 -12730 -1811 5720 -1036 -9734 -18884 -8410 -9514 -16156
4137 -16156 -18806 -17519 -9582 -19248 -16158 -4654 -5114 6243 14481 18861 26987 27681 33661 20306
4123 20306 2550 1081 -11011 -10633 5351 -277 -14970 -30606 -20651 -5562 -2805 -2405 7887
4110G887R210m684J250J4423l651j3702j1086m173J0281N699k834o023j2858J0686
4096D25J2387l72o924m268p308R089J1659N857N410O483q689k3361j3563Qj978
4081a5145J587N570j329m320L666N659P291M015j1454O158N307q329O047L910
4067H633J3044J3304p849N70M825r926N101j911l927l311O794K552j6979j5462
4053d542j1252L937M831R608J4675J1965M453J269m614j3557j526n438j1000j0344
4039a1535l556k77J7762q747j032m441N151J650k706R915m525j1663J5181R572
4025A0749j0873n784K734j6228o023P629O070q527P522q598N757L70j600J2367
4011d435J5618O83O285l469q244j3264K644j666M449j1716M042O443j130M347
$$ plain form
4110 7887 17097 12413 13663 28086 24435 10733 -353 -4526 5755 11454 8620 2597 -10261 425
4096 425 12812 12440 5516 1248 -6060 3029 14688 20545 25955 32438 23749 388 -13175 -13167 -15145
4081 -15145 -13558 -7988 -9317 -13637 -9971 -4312 2979 6994 -4460 1698 7005 -1324 4723 8633
4067 8633 21677 34981 27132 27702 32527 22601 27702 25791 21864 18553 25347 27899 10920 -4542
4053 -4542 -15794 -11857 -7026 2582 17257 29222 33675 34944 30330 16773 15247 9809 -1191 -11535
4039 -11535 -15091 -15368 2394 -6353 -7385 -11826 -6675 -5025 -7731 2184 -2341 -14004 1177 10749
4025 10749 -124 -5908 -3174 -19402 -25425 -17796 -11726 -20253 -12731 -21329 -15572 -15202 -16802 -4435
4011 -4435 11183 11866 18151 14682 6438 -6826 -4182 -5848 -1399 -13115 -9073 -2630 -3760 587
3997E87M282k826O691N763m205j159n336j225l275p154R305J063j9162L346J0334
3982b971R219p132m81J1458o941K514r063j5885P877J4434O543R222o336o293
3968F165l376l627j1166o252J0644L499K225J333j1586j372J0032M619q847j1467
3954a9176J2926J3370k618q905O406J1772L583n574j0605m372M691K851m529J241
3940A061J1573O319q798n525o6J3049j447j8881j5686J7591J5496o863l333j767
3926B723n574P868O642n288J5133L87j5212j643Q625o521q42R93q289P532j0614
3911d080j3789K452l403J846J841m167k066P671R142j815r158l252L019J705J2437
3896a617n791j91L138L843l442q103K941R426P949k381L992o178j3031J9131O328
$$ plain form
3997 587 4869 2043 8734 14497 10292 9133 3797 2572 -703 -7857 1448 2511 -16651 -13305 -2971
3982 -2971 6248 -884 -1365 10093 3152 5666 -3397 -19282 -11405 3029 9572 18794 12458 6165
3968 6165 2789 -838 -12004 -18256 -7612 -4113 -1888 -555 -12141 -13513 -3481 1138 -7709 -19176
3954 -19176 -6250 7120 4502 -4403 2003 13775 17358 11784 1179 -3193 1498 4349 -180 1061
3940 1061 12634 18953 10155 4630 4564 17613 16166 -2715 -18401 -810 14686 7823 4490 2723
3926 2723 -2851 5017 11659 6371 21504 21891 6679 5036 13661 7140 6298 7291 -998 6534 -4080
3911 -4080 -17869 -15417 -18820 -16974 -15133 -19300 -21366 -13695 -4553 -6368 -15526 -18778 -15759 -14054 -1617
3896 -1617 -7408 -7599 -4461 -618 -4060 -12163 -9222 204 8153 5772 9764 3586 -9445 9686 16014
3881A6014j6084n597o835K232k165P825J3347R63L666J2974P01j2993j5393J371
3867B6m58l773n388L681J2762l575k618J0721j555N964k177j1437K530J2581q018
3852I266k340j736j2915j1756J2303N043J2946j0721Q327l651Q556Q114j1226
3839A0210j4217m969O179L658m713Q026J7534j2387q110J704J24k142N955o891
3825c9J3078j5202N245Q999N187p443j0753l826j0280N388N881J2623p466j052
3811C40P834K389J1469R418j0791j1564k41q044J30L135m397j4626k804P595J863
3796h294j6017O835Q604n136J357p618l426J0593m101R743J076J919K774j23L02
3781a512R060Q793J3598K627L203j8181j0904J1284N438m740j027k357l729P250
$$ plain form
3881 16014 -70 -5667 -12502 -10270 -12435 -4610 8737 9700 13366 26340 27041 14048 -1345 26
3867 26 -432 -4205 -9593 -5912 6850 3275 657 11378 9823 15787 13610 2173 4703 17284 9266
3852 9266 6926 5190 -7725 -19481 -7178 -2135 10811 90 8417 4766 13322 21436 10210
3839 10210 -4007 -8976 -2797 861 -3852 4174 21708 9321 1211 2915 3039 897 6852 -39
3825 -39 13039 -2163 3082 12081 17268 9825 -928 -4754 -15034 -9646 -3765 8858 1392 340
3811 340 8174 10563 22032 31450 20659 9095 8854 810 940 4075 -322 -14948 -17752 -10157 -8294
3796 -8294 -24311 -17476 -8872 -14008 -12651 -20269 -23695 -13102 -17203 -7460 -6384 -4465 -1691 -1814 -1512
3781 -1512 7548 16341 29939 32566 35769 17588 6684 17968 23406 18666 17639 15282 11553 18803
3767A8803q343o510K481j1135j3312J4881Q121k240p003M512J6668J3391L207
3754C3521n258j6183q126R133r437p422n956K370Q807K501j394J68K16R679J9068
3739C1687l629o079P929J007o113j3552o574P134N820P948L820j3193o628J80
3725I757n240O06L050N049l02j4818o576N193k092j7453n80J034O990O681J4262
3710E561J1136q737K928p88M569R992j0001m558j433K458O440J2253M320j1977
3696B2163k0150r478o235O251R063R312L865o885p467K966K670k378Q20N966n313
3681E170L650K30n997r635o979O594J4332M990L526o235J995j2657j0853J1336
3667e33P194p136r032N868L082m936Q036R829J1190j2947q929q386o27P938J2002
$$ plain form
3767 18803 10460 3950 6431 -4704 -18016 -3135 4986 2746 -4257 255 16923 30314 33521
3754 33521 28263 12080 3954 13087 3650 -3772 -9728 -7358 1449 3950 2556 2724 2940 12619 31687
3739 31687 28058 21979 29908 30915 24802 11250 4676 11810 17630 25578 29398 16205 9577 9757
3725 9757 4517 5123 8173 13222 12920 -1898 -8474 -3281 -5373 -22826 -23406 -22372 -15382 -8701 5561
3710 5561 16697 7960 10888 10100 14669 24661 14660 10102 8669 11127 17567 29820 34140 22163
3696 22163 2013 -7465 -13700 -7449 1614 10926 14791 7906 439 3405 6075 3697 4517 10483 5170
3681 5170 8820 9050 3053 -6582 -13561 -6967 7365 12355 15881 9646 11641 -1016 -11869 -533
3667 -533 6661 -475 -9507 -3639 -557 -5493 2543 12372 23562 10615 1686 -6700 -7327 611 12613
3652A2613L986j2313q149O941L292J473J0322L71o504L97j277l740O965n221j4597
3637e441N393J4489r098q556K3p63K965K486L958J469N123M237k292J0970j2412
3622A2551j0926n728L036Q443j5512q777O048J5101q380P838Q434J123l235P687
3608A7703o657p554o141q953n639j103J998J2025K79r974l211J2609J5522j067
3594I837p539r82L625J819O474j0476k7741p842J2650J1557n081j0409O019L479
3580a4610M869J1128Q197J823qm805J1072L104n491m128m887j7571k287J0716
3566b878J803o748p753K664J1481J0868Q683m149n272j133k442j5274k650R689
3552c111Q042M582j081j1361m945P401J6084l906j8243L489Q872n55L039j1516
$$ plain form
3652 12613 16599 4286 -3863 3078 6370 7843 18165 18536 12032 12429 11152 7412 14377 9156 -5441
3637 -5441 -48 14441 5343 -3213 -3190 -3953 -988 1498 5456 6925 12048 16285 13993 24963 12551
3622 12551 1625 -4103 -1067 7376 -8136 -16913 -10865 4236 -4144 3694 12128 13251 10016 17703
3608 17703 11046 3492 -2649 -11602 -17241 -18344 -16346 -4321 -4042 -14016 -17227 -4618 10904 9837
3594 9837 2298 1316 4941 6760 13234 2758 -24983 -32825 -20175 -8618 -13699 -24108 -18089 -14610
3580 -14610 -9741 1387 9584 11407 11399 6594 17666 20770 15279 11151 6264 -11307 -13594 -2878
3566 -2878 -1075 -7823 -15576 -12912 -1431 9437 18120 13971 8699 7566 5124 -10150 -12800 -3111
3552 -3111 4931 9513 8432 -2929 -7874 -473 15611 11705 -6538 -3049 5823 5268 8307 -3209
3538c209p919Q112K0452R34n16L350j3501l799l557j615N37N261L050N060Q081
3523B0721K75J55k903j3506k4061l37J2664J2277k16J1642L882j2316k339r107
3509c169j6434J1551K6030L057j5929m209p703qJ0423N2N082P793J3482j921j0098
3494A7999N2p208m856O521O417l973r807k0051j609P909J4262L168o485p306J0119
3479E152M669j5200n682J5377J954J15K516J736m33M470p123p77J837n81L083
3464A1113l591K458M671M904N402q103n837n602l628l44O583J1280j1846j7088
3450i628j213J2698K062Q119N803L134q869j1801m876J4946J4685o349q898n35
3436I278k80N061R854m638q974n696l200J3157J0829r197j7041p627o794R61o523
$$ plain form
3538 -3209 -11128 -3016 17436 18370 17854 21204 7703 3904 347 -1268 -731 4530 7580 12640 20721
3523 20721 20996 21151 18248 4742 -19319 -19656 -6992 5285 5069 16711 20593 8277 5938 -3169
3509 -3169 -19603 -8052 17978 21035 5106 897 -6806 -6814 3609 3661 8743 16536 30018 28097 17999
3494 17999 18051 10843 5987 12508 18925 14952 5145 -14906 -16515 -8606 5656 8824 2339 -4967 5152
3479 5152 9821 -5379 -11061 4316 6270 6385 8901 10637 10204 14674 7551 6774 8611 8030 11113
3464 11113 7522 9980 14651 19555 24957 16854 11017 5415 1787 1443 8026 19306 7460 -9628
3450 -9628 -10841 1857 3919 12038 17841 20975 12106 305 -4571 10375 25060 18711 9813 9278
3436 9278 8998 14059 23913 19275 10301 4605 1405 14562 25391 16194 -847 -8474 -15268 -14307 -20830
3421b0830j730Q092q380k24K233M537N706K164m347p821J3980P023R96N340m012
3406B727j1510p478L433L006J6137O202j523k397l053K951j74K399m129j6001
3392i410M211J284M551N944j936J991K422j1809m583J0011M879j0511l89J1573
3378H228R676j7359j4585q243O269J1915l823J2133N011q457k0496j6350j645
3365c7726J3346K1340R193O117o560r209R36K666l083j3171k328J1960M101r01
3351c319m776r97J4257Q053J2873q381k2341j0032m26J7942L915j192j960p607
3337c991l116J323J2647j1825j0871J3709M164O123j2571m79p647j4428l57K1162
3323f157K6253M371m094j9112K347j504L923O819p69r887P279K799J0909J148
$$ plain form
3421 -20830 -22560 -14468 -22848 -23072 -20839 -16302 -10596 -8432 -12779 -20600 -6620 403 1399 6739 2727
3406 2727 -8783 -16261 -12828 -9822 6315 12517 10994 8597 5544 8495 8321 10720 6591 -9410
3392 -9410 -5199 -3915 636 6580 4644 6635 9057 -2752 -7335 2676 7555 -2956 -3345 8228
3378 8228 17904 545 -14040 -22283 -16014 -4099 -7922 4211 9222 765 -19731 -36081 -37726
3365 -37726 -24380 -3040 6153 12270 5710 -3499 -2563 103 -2980 -16151 -18479 -6519 -2418 -3319
3351 -3319 -8095 -9092 5165 13218 26091 17710 -4631 -14663 -15089 2853 6768 5576 3616 -3991
3337 -3991 -7107 -5784 6863 -4962 -15833 -2124 2040 8163 -4408 -4887 -12534 -26962 -27319 -6157
3323 -6157 20096 24467 20373 1261 3608 2104 6027 12846 12077 2190 9469 12268 23177 24325
3309B4325N479q551q796K697P917q803L394k62j1720R267R932R134J166O138p909
3294C3408j4847n069j1648m13J1662L904n342k794o482o81Q773j604O901J0527
3280B6295L291R339j3570j3350R250J0501j2280j5994m985R342j739n455j2064
3267a1419P024r30N769Q496j957J111j736j2650N677M598K794j721O404o651j2841
3252h032r295O182L772L107Q418Q178m490p333L852N419m391j8892R438J6147
$$ plain form
3309 24325 29804 21253 12457 15154 23071 14268 17662 17400 5680 14947 24879 34013 35179 41317 33408
3294 33408 18561 13492 1844 1431 13093 16997 11655 8861 2379 1698 10471 8867 15768 26295
3280 26295 29586 38925 25355 12005 21255 31756 19476 3482 -1503 7839 6100 645 -11419
3267 -11419 -4395 -5325 444 8940 6983 8094 6358 -6292 -615 3983 6777 5056 11460 4809 -8032
3252 -8032 -17327 -11145 -7373 -4266 4152 12330 7840 507 4359 9778 5387 -13505 -4067 12080
$$ [...]
##END NTUPLES=NMR SPECTRUM
##END=
