##TITLE=Analysis number 318970
Compound Code cc 38101
Book Reference 407/119
Project Code adrs
Chemist Name andyw
##JCAMPDX= 6.0         $$ Bruker NMR JCAMP-DX V2.0
##DATA TYPE= NMR SPECTRUM
##DATA CLASS= NTUPLES
##ORIGIN= Bruker BioSpin GmbH
##OWNER= nmr
$$ XWIN-NMR		Version 3.5
$$ Wed Apr 26 09:19:57 2006 GMT Daylight Time (UT+1h)  MAYBRIDGE\nmr@NMR_250MHZ
##.OBSERVE FREQUENCY= 250.131544655141
##.OBSERVE NUCLEUS= ^1H
##.ACQUISITION MODE= SIMULTANEOUS (DQD)
##.ACQUISITION SCHEME= undefined
##.AVERAGES= 16
##.DIGITISER RES= 18
##SPECTROMETER/DATA SYSTEM= dpx250
##.PULSE SEQUENCE= zg30
##.SOLVENT NAME= DMSO
##.SHIFT REFERENCE= (INTERNAL, DMSO, 0, 16.522)
##AUDIT TRAIL= $$ (NUMBER, WHEN, WHO, WHERE, WHAT)
$$ ##TITLE= Audit trail, XWIN-NMR		Version 3.5
$$ ##JCAMPDX= 5.01
$$ ##ORIGIN= Bruker BioSpin GmbH
$$ ##OWNER= nmr
$$ C:\u/data/dgb/nmr/ADRS/3190/pdata/1/auditp.txt
$$ ##AUDIT TRAIL=  $$ (NUMBER, WHEN, WHO, WHERE, WHAT)
(   1,<2006-04-26 09:19:21.53 +100>,<MAYBRIDGE\nmr>,<NMR_250MHZ>,
      <created by zg, POWCHK disabled, PULCHK disabled
       configuration hash MD5:
       84 BC 41 DB A1 6E 1D 46 DA 25 12 A5 C1 ED C5 3A
       data hash MD5: 64K
       5B 5A 81 F0 CD 64 F6 40 DD 5A A0 D4 56 B8 CE BD>)
(   2,<2006-04-26 09:19:45.73 +100>,<MAYBRIDGE\nmr>,<NMR_250MHZ>,
      <Start of raw data processing
       ef LB = 0.3 FT_mod = 6 PKNL = 1 SI = 32K 
       data hash MD5: 32K
       6D 7E 31 DD D2 29 B5 0C F5 E9 F6 BD 10 87 B6 29>)
(   3,<2006-04-26 09:19:47.81 +100>,<MAYBRIDGE\nmr>,<NMR_250MHZ>,
      <apk 
       data hash MD5: 32K
       16 25 AB EA 51 C6 40 4A 40 EC 8F E3 50 75 EF 5E>)
(   4,<2006-04-26 09:19:48.61 +100>,<MAYBRIDGE\nmr>,<NMR_250MHZ>,
      <abs ABSG = 5 
       data hash MD5: 32K
       54 99 4C AC BA 44 91 68 38 9A 92 FF 48 79 DA 5D>)
$$ ##END=
$$ 
$$ hash MD5
$$ 95 3A 49 58 1B BF 2F 82 E5 7B 88 B6 B9 56 76 45
##$RELAX= 
##$RELAX= 
##$RELAX= 
##$RELAX= 
##$RELAX= 
##$RELAX= 
##$RELAX= 
$$ Bruker specific parameters
$$ --------------------------
##$DU= <C:\u>
##$EXPNO= 3190
##$NAME= <ADRS>
##$PROCNO= 1
##$TYPE= <nmr>
##$USER= <dgb>
##$AMP= (0..31)
100 100 100 100 100 100 100 100 100 100 100 100 100 100 100 100 100 100 
100 100 100 100 100 100 100 100 100 100 100 100 100 100 
##$AQSEQ= 0
##$AQ_mod= 3
##$AUNM= <au_zg>
##$AUTOPOS= <3 >
##$BF1= 250.13
##$BF2= 250.13
##$BF3= 250.13
##$BF4= 250.13
##$BF5= 500.13
##$BF6= 500.13
##$BF7= 500.13
##$BF8= 500.13
##$BYTORDA= 1
##$CFDGTYP= 0
##$CFRGTYP= 5
##$CHEMSTR= <none>
##$CNST= (0..31)
1 1 145 1 1 1 1 1 1 1 1 1 1 1 1 1 1 1 1 1 1 1 1 1 1 1 1 1 1 1 1 1 
##$CPDPRG= <>
##$CPDPRG1= <>
##$CPDPRG2= <>
##$CPDPRG3= <>
##$CPDPRG4= <mlev>
##$CPDPRG5= <mlev>
##$CPDPRG6= <mlev>
##$CPDPRG7= <mlev>
##$CPDPRG8= <mlev>
##$CPDPRGB= <>
##$CPDPRGT= <>
##$D= (0..31)
0 1 0 0 0 0 0 0 0 0.06 0 0 0 0 0 0 0.0002 0 0 0 0 0 0 0 0 0 0 0 0 0 0 
0 
##$DATE= 1146039558
##$DBL= (0..7)
120 120 120 120 120 120 120 120 
##$DBP= (0..7)
150 150 150 150 150 150 150 150 
##$DBP07= 0
##$DBPNAM0= <>
##$DBPNAM1= <>
$$ [...]
##$SUBNAM7= <"">
##$SUBNAM8= <"">
##$SUBNAM9= <"">
##$SW= 20.6930455092707
##$SWIBOX= (0..15)
0 0 3 0 0 0 0 0 0 0 0 0 0 0 0 0 
##$SW_h= 5175.983436853
##$TD= 65536
##$TD0= 1
##$TE= 295.16
##$TE2= 300
##$TE3= 300
##$TEG= 300
##$TL= (0..7)
0 120 120 120 120 120 120 120 
##$TP= (0..7)
150 150 150 150 150 150 150 150 
##$TP07= 0
##$TPNAME0= <>
##$TPNAME1= <>
##$TPNAME2= <>
##$TPNAME3= <>
##$TPNAME4= <>
##$TPNAME5= <>
##$TPNAME6= <>
##$TPNAME7= <>
##$TPOAL= (0..7)
0.5 0.5 0.5 0.5 0.5 0.5 0.5 0.5 
##$TPOFFS= (0..7)
0 0 0 0 0 0 0 0 
##$TUNHIN= 0
##$TUNHOUT= 0
##$TUNXOUT= 0
##$USERA1= <user>
##$USERA2= <user>
##$USERA3= <user>
##$USERA4= <user>
##$USERA5= <user>
##$V9= 5
##$VALIST= <valist>
##$VCLIST= <CCCCCCCCCCCCCCC>
##$VD= 0
##$VDLIST= <DDDDDDDDDDDDDDD>
##$VPLIST= <PPPPPPPPPPPPPPP>
##$VTLIST= <TTTTTTTTTTTTTTT>
##$WBST= 1024
##$WBSW= 4
##$XGAIN= (0..3)
0 0 0 0 
##$XL= 0
##$YL= 0
##$YMAX_a= 385736
##$YMIN_a= -487796
##$ZGOPTNS= <>
##$ZL1= 120
##$ZL2= 120
##$ZL3= 120
##$ZL4= 120
##$ABSF1= 16.522
##$ABSF2= -4.171173
##$ABSG= 5
##$ABSL= 3
##$ALPHA= 0
##$AQORDER= 0
##$ASSFAC= 0
##$ASSFACI= 0
##$ASSFACX= 0
##$ASSWID= 0
##$AUNMP= <proc_1d>
##$AZFE= 0.1
##$AZFW= 0.1
##$BCFW= 0
##$BC_mod= 0
##$BYTORDP= 0
##$COROFFS= 0
##$CY= 12.5
##$DATMOD= 1
##$DC= 0
##$DFILT= <>
##$DTYPP= 0
##$F1P= 14.0000005364418
##$F2P= -0.99999901652339
##$FCOR= 0.5
##$FTSIZE= 32768
##$FT_mod= 6
##$GAMMA= 0
##$GB= 0
##$INTBC= 1
##$INTSCL= 1
##$ISEN= 128
##$LB= 0.3
##$LEV0= 0
##$LPBIN= 0
##$MAXI= 10000
##$MC2= 0
##$MEAN= 0
##$ME_mod= 0
##$MI= 0
##$NCOEF= 0
##$NC_proc= -6
##$NLEV= 6
##$NOISF1= 0
##$NOISF2= 0
##$NSP= 0
##$NTH_PI= 0
##$NZP= 0
##$OFFSET= 16.522
##$PC= 1
##$PHC0= 158.1381
##$PHC1= 5.287192
##$PH_mod= 1
##$PKNL= yes
##$PPARMOD= 0
##$PSCAL= 4
##$PSIGN= 0
##$REVERSE= no
##$SF= 250.13
##$SI= 32768
##$SIGF1= 0
##$SIGF2= 0
##$SINO= 400
##$SIOLD= 32768
##$SREGLST= <1H.DMSO>
##$SSB= 0
##$STSI= 32768
##$STSR= 0
##$SW_p= 5175.98343685301
##$SYMM= 0
##$S_DEV= 0
##$TDeff= 65536
##$TDoff= 0
##$TI= <Analysis number 999999
Compound Code 99
Book Reference 9
Project Code 9>
##$TILT= no
##$TM1= 0
##$TM2= 0
##$TOPLEV= 0
##$USERP1= <user>
##$USERP2= <user>
##$USERP3= <user>
##$USERP4= <user>
##$USERP5= <user>
##$WDW= 1
##$XDIM= 32768
##$YMAX_p= 453290728
##$YMIN_p= -815672
$$ End of Bruker specific parameters
$$ ---------------------------------
##NTUPLES= NMR SPECTRUM
##VAR_NAME=  FREQUENCY,     SPECTRUM/REAL,   SPECTRUM/IMAG
##SYMBOL=    X,             R,               I
##VAR_TYPE=  INDEPENDENT,   DEPENDENT,       DEPENDENT
##VAR_FORM=  AFFN,          ASDF,            ASDF
##VAR_DIM=   32768,         32768,           32768
##UNITS=     HZ,            ARBITRARY UNITS, ARBITRARY UNITS
##FACTOR=    0.157963299565203, 1,           1
##FIRST=     4132.6476996994, 0,             0
##LAST=      -1043.33573715361, 0,           0
##MIN=       -1043.33573715361, -815672,     0
##MAX=       4132.6476996994, 453290728,     0
$$ Real data points
##PAGE= N=1
##DATA TABLE= (X++(R..R)), XYDATA
$$ [...]
$$ plain form
17338 114460 212760 50414 -98365 95159 148825 26304 180627 -98455 -256698 -160855
17328 -160855 70391 118267 75166 57772 207765 341562 231988 430996 372963 492467
17318 492467 284220 27324 -10508 178400 201059 -2054 -231936 -159947 62516 80811
17308 80811 201708 73393 118696 -31821 -252187 -67630 207860 352554 251498 77107
17298 77107 75923 160022 212776 343224 379065 157648 -22414 96157 62417 -323335 -369198
17287 -369198 -421237 -486071 -144967 -160741 -352175 -292347 -235270 -239129 -307206 -341819 -391385
17276 -391385 -308876 -60881 150173 31903 53602 47314 -26060 -40402 91760 99693 234277
17265 234277 385594 421159 502335 254674 361459 450957 335736 270176 477545 435864
$$ packed form
17338A14460R8300j62346j48779J93524N3666j22521J54323k79082j58243R5843
17328a60855K31246M7876m3101j7394J49993J33797j09574J99008n8033J19504
17318D92467k08247k56896l7832J88908K2659k03113k29882P1989K22463J8295
17308H0811J20897j28315M5303j50517k20366J84557K75490J44694j01056j74391
17298G7107j184Q4099N2754J30448L5841k21417j80062J18571l3740l85752m5863
17287c69198n2039o4834L41104j5774j91434N9828N7077l859o8077l4613m9566
17276c91385Q2509K47995K11054j18270K1699o288p3374j4342J32162P933J34584
17265B34277J51317L5565Q1176k47661J06785Q9498j15221o5560K07369m1681
$$ plain form
17255 435864 586361 974974 949970 1010802 1001786 960084 914843 966420 987674 837326 600832
17244 600832 679972 736245 616967 743403 674866 568445 525588 422561 416987 518353 496059
17233 496059 469992 565739 639014 603601 479203 46939 -107777 37580 -59780 -4140 79970
17222 79970 25551 204512 64121 -6304 -134528 -224150 -110238 242995 326606 24218
17212 24218 -120491 -59943 147420 135524 23195 45132 86854 192063 326366 312017 471419
17201 471419 683556 750479 849185 983160 1029266 1006932 946681 1025018 1001096 855295 873840
17190 873840 678884 598735 582186 478078 442456 352668 357424 555832 524630 295191 306612
17179 306612 240681 404711 383981 390965 240455 257108 97986 123284 207707 297123 243916
$$ packed form
17255D35864J50497L88613k5004O0832r016m1702m5241N1577K1254j50348k36494
17244F00832P9140N6273j19278J26436o8537j06421m2857j03027n574J01366k2294
17233D96059k6067R5747P3275l5413j24398m32264j54716J45357r7360N5640Q4110
17222G9970n4419J78961j40391p0425j28224q9622J13912L53233Q3611l02388
17212B4218j44709O0548K07363j1896j12329K1937M1722J05209J34303j4349J59402
17201D71419K12137O6923R8706J33975M6106k2334o0251P8337k3922j45801J8545
17190H73840j94956q0149j6549j04108l5622q9788M756J98408l1202k29439J1421
17179C06612o5931J64030k0730O984j50510J6653j59122K5298Q4423Q9416n3207
$$ plain form
17168 243916 152640 73608 89338 183535 -7631 -98133 -257187 -87626 262735 101701
17158 101701 -199522 -174039 -115501 -171013 -290048 -49924 157018 76213 120222 120514 75803
17147 75803 154585 359699 190961 -276804 -460799 -367957 -303658 -352717 -180159 206734
17137 206734 400170 338972 311181 263862 151536 317476 262940 321792 156264 45740
17127 45740 201080 184510 170089 202685 180226 143838 236259 93329 -26385 -98838 -207029
17116 -207029 -165987 -196434 -129195 7352 178267 175853 122796 307514 413838 242076 170206
17105 170206 174616 84100 -89344 -80193 -67111 -168554 -20435 136461 19514 140632 239683
17094 239683 343422 73836 -129894 149523 457358 460677 246824 197255 5514 -121421
$$ packed form
17168B43916r1276p9032J5730R4197j91166r0502j59054J69561L50361j61034
17158A01701l01223K5483N8538n5512j19035K40124K06942q0805M4009K92m4711
17147G5803P8782K05114j68738m67765j83995R2842O4299m9059J72558L86893
17137B06734J93436o1198k7791m7319j12326J65940n4536N8852j65528j10524
17127D5740J55340j6570j4421L2596k2459l6388R2421j42930j19714p2453j08191
17116b07029M1042l0447O7239J36547J70915k414n3057J84718J06324j71762p1870
17105A70206M410r0516j73444R151J3082j01443J48119J56896j16947J21118R9051
17094B39683J03739k69586k03730K79417L07835L319k13853m9569j91741j26935
$$ plain form
17084 -121421 -7334 107105 119100 178434 216802 226039 360043 346603 369169 374397 346529
17073 346529 285429 326479 132292 104643 154509 339498 534573 380127 52058 25858
17063 25858 83177 133069 305057 284296 198412 190115 143338 22742 -26034 5433 41443
17052 41443 109103 167242 -72015 -103335 75129 -221352 -463576 -401953 -173854 -328551
17042 -328551 -379076 -183168 -340 138246 89325 158453 252710 256609 107486 47203 36739
17031 36739 104844 271333 355581 -2386 34439 347737 189937 42237 -288960 -280115 -151885
17020 -151885 -254570 -150903 -381159 -276650 -24553 102694 225945 16507 8240 145189
17010 145189 277224 362375 141556 -64189 -323375 -297952 -29957 221114 171137 -160446
$$ packed form
17084a21421J14087J14439J1995N9334L8368R237J34004j3440K2566N228k7868
17073C46529o1100M1050j94187k7649M9866J84989J95075j54446l28069k6200
17063B5858N7319M9892J71988k0761q5884q297m6777j20596m8776L1467L6010
17052D1443O7660N8139k39257l1320J78464k96481k42224O1623K28099j54697
17042c28551n0525J95908J82828J38586m8921O9128R4257L899j49123o0283j0464
17031C6739O8105J66489Q4248l57967L6825L13298j57800j47700l31197Q845J28230
17020a51885j02685J03667k30256J04509K52097J27247J23251k09438q267J36949
17010A45189J32035Q5151k20819k05745k59186K5423K67995K51071m9977l31583
$$ plain form
17000 -160446 -286392 -216685 -77697 -90841 -193306 -147927 -317218 -270539 -148470 69387
16990 69387 216010 217468 185149 179987 3840 -54711 -120731 -48249 32725 194468 246648
16979 246648 182303 -137634 -340091 -441905 -560744 -475524 -313808 -454003 -462880 -202138
16969 -202138 -74480 -58663 -164831 66290 212047 223146 292478 189514 111498 111587 -14814
16958 -14814 116288 172119 97012 37848 128623 97526 -17653 -14338 -132292 -250933 -62622
16947 -62622 121522 184701 216410 161453 53915 101073 329253 239060 102917 52135 -250650
16936 -250650 -270945 -25012 23983 144605 265937 268062 192477 40330 -137270 -322387
16926 -322387 -209873 -48926 86735 262473 356735 154601 -151046 -171391 -103502 18716
$$ packed form
17000a60446j25946O9707J38988j3144j02465M5379j69291M6679J22069K17857
16990F9387J46623J458l2319n162j76147n8551o6020P2482Q0974J61743N2180
16979B46648o4345l19937k02457j01814j18839Q5220J61716j40195q877K60742
16969b02138J27658J5817j06168K31121J45757J1099O9332j02964p8016Q9j26401
16958a4814J31102N5831p5107n9164R0775l1097j15179L315j17954j18641J88311
16947f2622J84144O3179L1709n4957j07538M7158K28180r0193j36143n0782l02785
16936b50650k0295K45933M8995J20622J21332K125p5585j52147j77600j85117
16926c22387J12514J60947J35661J75738R4262k02134l05647k0345O7889J22218
$$ plain form
16916 18716 201224 82869 -8191 35696 -128708 40734 177373 -161648 -196168 -119006
16906 -119006 -274911 -224839 243541 351720 331050 308855 106321 73064 3292 44008 -188517
16895 -188517 -248256 -227437 -283705 -176635 126458 280035 230193 124641 -77451 17833
16885 17833 25270 -28738 -219121 -240220 59877 96806 -194213 -237588 -168949 -87141 -90867
16874 -90867 -61713 -58751 -260294 -347260 -297034 -312195 -58862 -76933 94548 273931 350162
16863 350162 340221 37674 -77004 -230402 -272031 -252544 -25370 -17521 -325526 -549664 -504835
16852 -504835 -406963 -227718 -73303 55888 -85640 -87365 122442 235405 -74317 -255822
16842 -255822 -451103 -394543 -327980 -336395 -284243 -213989 -232831 -76753 75403 33434 35832
$$ packed form
16916A8716J82508j18355r1060M3887j64404J69442J36639l39021l4520P7162
16906a19006j55905N0072M68380J08179k0670k2195k02534l3257o9772M0716k32525
16895a88517n9739K0819n6268J07070L03093J53577m9842j05552k02092R5284
16885A7833P437n4008j90383k1099L00097L6929k91019m3375O8639Q1808l726
16874i0867K9154K962k01543q6966N0226j5161K53333j8071J71481J79383P6231
16863C50162r941l02547j14678j53398m1629J9487K27174P849l08005k24138M4829
16852e04835R7872J79245J54415J29191j41528j725K09807J12963l09722j81505
16842b55822j95281N6560O6563q415N2152P0254j8842J56078J52156m1969K398
$$ plain form
16831 35832 -57111 -7561 69043 -193612 -239653 -219349 -329407 -251049 -34482 -25721 -171227
16820 -171227 -189204 -217959 -83184 100841 147291 -96510 -315460 -450010 -425388 -379029
16810 -379029 -352483 -356850 -313089 -333486 -303872 -186090 -103063 -25634 42919 -96125 31876
16799 31876 -12102 -73800 165 77260 134936 105072 -195572 -362670 -187706 41506 182012
16788 182012 105409 17820 67457 -57402 22120 175048 149316 92988 47022 71032 -90325
16777 -90325 -225402 -403230 -146193 -85543 -64932 -37855 141314 147014 72178 26712 126772
16766 126772 145925 59427 106483 -318117 -455668 -325912 -82752 -26693 -57686 -70775 10165
16755 10165 -41836 -91 122942 155358 -41763 -53585 -141083 -329888 -344413 -180072 -76662
$$ packed form
16831C5832r2943M9550P6604k62655m6041K0304j10058P8358K16567Q761j45506
16820a71227j7977k8755J34775J84025M6450k43801k18950j34550K4622M6359
16810c79029K6546m367M3761k0397K9614J17782Q3027P7429O8553j39044J28001
16799C1876m3978o1698P3965P7095N7676k9864l00644j67098J74964K29212J40506
16788A82012p6603q7589M9637j24859P9522J52928k5732n6328m5966K4010j61357
16777i0325j35077j77828K57037O0650K0611K7077J79169N700p4836m5466J00060
16766A26772J9153q6498M7056m24600j37551J29756K43160N6059l0993j3089Q0940
16755A0165n2001M1745J23033L2416j97121j1822q7498j88805j4525J64341J03410
$$ plain form
16744 -76662 131628 22055 45050 51557 130435 96840 115710 127555 38139 129005 215576
16733 215576 -16798 -78388 86660 -42521 -155448 -372063 -345152 -310649 -166837 90439
16723 90439 331623 346483 376882 90743 22174 35960 -85322 -119118 -11193 -194548 -281257
16712 -281257 -363313 -407383 -393571 -356307 -197268 -44454 -135710 -13738 66339 -55378 -6409
16701 -6409 -6267 -132808 -20840 -46795 25722 248721 397554 302977 19367 -23961 -188312
16690 -188312 -136536 105398 128059 141270 145538 67649 -105201 -45264 194731 336454 300085
16679 300085 235121 153784 105599 205194 183488 4992 -74063 -344184 -359510 -74313 -122178
16668 -122178 -87949 -9157 -87121 -111273 -160219 -215402 -305418 -580255 -678922 -499719 -228786
$$ packed form
16744g6662K08290j09573K2995O507P8878l3595J8870J1845q9416R0866Q6571
16733B15576k32374o1590J65048j29181j12927k16615K6911L4503J43812K57276
16723I0439K41184J4860L0399k86139o8569J3786j21282l3796J07925j83355q6709
16712b81257q2056m4070J3812L7264J59039J52814r1256J21972Q0077j21717M8969
16701f409J42j26541J11968k5955P2517K22999J48833r4577k83610m3328j64351
16690a88312N1776K41934K2661J3211M268p7889j72850N9937K39995J41723l6369
16679C00085o4964q1337m8185R9595k1706j78496p9055k70121j5326K85197m7865
16668a22178L4229P8792p7964k4152m8946n5183r0016k74837r8667J79203K70933
$$ plain form
16657 -228786 -96915 -132291 -162018 -166657 -65805 -97029 -331821 -407731 -394392 -154503 43159
16646 43159 -74156 -36755 108687 144738 -25443 46269 -2714 23312 133303 55331 1207
16635 1207 109780 111564 151938 113158 52128 -116525 -53208 172666 194962 -23708 -206717
16624 -206717 -401294 -531574 -536008 -577938 -661828 -767927 -641632 -447671 -276120 -235501
16614 -235501 -98483 -296145 -325956 -405637 -372343 -335480 -210206 -94768 38166 110055
16604 110055 -145407 -146307 -287385 -280246 -193417 -75085 -20252 -147029 -151026 -8074 66532
16593 66532 -187434 -279691 -124964 84551 36574 45589 190337 140402 -88775 -72514 -155185
16582 -155185 -103822 -70564 -38625 22974 -254132 -254402 -144536 -55645 -51683 114880 268647
$$ packed form
16657b28786J31871l5376k9727m639J00852l1224k34792p5910J3339K39889J97662
16646D3159j17315L7401J45442L6051j70181P1712m8983K6026J09991p7972n4124
16635A207J08573J784M0374l8780o1030j68653O3317K25874K2296k18670j83009
16624b06717j94577j30280m434m1930q3890j06099J26295J93961J71551M0619
16614b35501J37018j97662k9811p9681L3294L6863J25274J15438J32934P1889
16604A10055k55462r00j41078P139Q6829J18332N4833j26777l997J42952P4606
16593F6532k53966r2257J54727K09515m7977R015J44748m9935k29177J6261q2671
16582a55185N1363L3258L1939O1599k77106k70J09866Q8891L962J66563J53767
$$ plain form
16571 268647 234860 -44605 -97935 -64317 97528 86008 -58151 -184619 -124965 -123191 -46728
16560 -46728 100941 38531 137045 94362 -105343 -136196 -141249 -107833 12104 113434 143203
16549 143203 253365 35555 -338691 -225771 -106201 -61111 732 130656 166207 148971
16539 148971 119718 130506 302745 425302 433721 266595 74991 -3415 -159572 -204757 -139686
16528 -139686 -89748 -85033 -53574 -88338 49648 279714 427292 366323 84210 -183580 -28918
16517 -28918 106961 119920 144348 141326 -191518 -320628 -197536 -165106 -188917 -117773 -17483
16506 -17483 189638 155245 -76458 -229061 -123239 -27002 56730 -116746 -183661 -22503
16496 -22503 58890 170294 107010 223336 126865 -68773 -57537 -145647 -180047 -171982 -281657
$$ packed form
16571B68647l3787k79465n3330L3618J61845j1520j44159j26468N9654J774P6463
16560d6728J47669o2410R8514m2683j99705l0853n053L3416J19937J01330K9769
16549A43203J10162k17810l74246J12920J19570M5090O1843J29924L5551j7236
16539A48971k9253J0788J72239J22557Q419j67126j91604p8406j56157m5185O5071
16528a39686M9938M715L1459l4764J37986K30066J47578o0969k82113k67790J54662
16517b8918J35879J2959K4428l022l32844j29110J23092L2430k3811P1144J00290
16506a7483K07121l4393k31703j52603J05822R6237Q3732j73476o6915J61158
16496b2503Q1393J11404o3284J16326r6471j95638J1236q8110l4400Q065j09675
$$ plain form
16485 -281657 -309697 -267130 -60408 -217381 -107438 45649 -62308 -178234 -80238 -58578
16475 -58578 -99939 -306255 -332889 -215731 -385170 -416320 -341125 -132539 -94338 -126214 -64573
16464 -64573 -139137 -73847 136193 328875 369505 194283 -73030 -57793 28292 -101356 38689
16453 38689 66690 -173227 -17602 -220726 -381721 -319814 -253192 -259665 -183545 -90031 172474
16442 172474 320719 254896 129966 133517 180729 244764 129410 -139082 -177159 -30034 193798
16431 193798 289274 216248 -120786 -188251 -60018 -42485 -175828 54224 188383 157725
16421 157725 140110 108914 -115210 -660 125538 220911 91771 146691 107173 86179 -1645
16410 -1645 -77786 -34617 -179213 -323302 -392391 -347206 -247972 -96812 -148822 -15657 -204542
$$ packed form
16485b81657k8040M2567K06722j56973J09943J53087j07957j15926R7996K1660
16475e8578m1361k06316k6634J17158j69439l1150P5195K08586L8201l1876O1641
16464f4573p4564O5290K10040J92682M0630j75222k67313J5237Q6085j29648J40045
16453C8689K8001k39917J55625k03124j60995O1907O6622o473P6120R3514K62505
16442A72474J48245o5823j24930L551M7212O4035j15354k68492l8077J47125K23832
16431A93798R5476p3026l37034o7465J28233J7533j33343K30052J34159l0658
16421A57725j7615l1196k24124J14550J26198R5373j29140N4920l9518k0994q7824
16410a645p6141M3169j44596j44089o9089M5185R9234J51160n2010J33165j88885
$$ plain form
16399 -204542 -139622 68363 89982 -54117 -144892 -206251 -125865 -92503 -19194 -134987 -246980
16388 -246980 -276583 -575478 -596210 -415335 -221974 -213136 -286818 -337989 -331009 -317069 -168354
16377 -168354 37285 -50787 -292159 -228781 -59616 107199 20270 -76678 53883 121774
16367 121774 105484 102848 108339 28974 138296 196084 114724 -51475 -189815 -173914 -113817
16356 -113817 -58552 46118 105283 115463 107596 -172519 -163481 -106796 -205133 -218371 -121607
16345 -121607 199352 158247 200277 168406 52480 -118771 -227464 -54458 9430 214253
16335 214253 261875 198103 295156 240635 130537 111036 51251 -220467 -41980 -45931 151960
16324 151960 311584 328000 321260 335735 140878 6968 -65419 -27118 50720 51542 -18722
$$ packed form
16399b04542O4920K07985K1619j44099r0775o1359Q0386L3362P3309j15793j11993
16388b46980k9603k98895k0732J80875J93361Q838p3682n1171O980J3940J48715
16377a68354K05639q8072k41372O3378J69165J66815q6929r6948J30561O7891
16367A21774j6290k636N491p9365J09322N7788q1360j66199j38340J5901O0097
16356a13817N5265J04670N9165J0180p867k80115R038N6685r8337j3238R6764
16345a21607L20959m1105M2030l1871j15926j71251j08693J73006O3888K04823
16335B14253M7622o3772R7053n4521j10098j9501n9785k71718J78487l951J97891
16324A51960J59624J6416o740J4475j94857j33910p2387L8301P7838Q22p0264
$$ plain form
16313 -18722 -187026 -263939 -339678 -312810 -200593 -206002 -193619 -207948 -204472 -228251 -191881 -265085
16301 -265085 -69699 93914 -105004 -235683 44941 22640 -4403 45006 211108 29550
16291 29550 -283547 -397556 -222998 -122665 -101258 -19973 101531 186837 60107 -7550
16281 -7550 -192917 -348306 -152986 85800 226924 239686 42662 -69434 -168260 -242815
16271 -242815 -391812 -427595 -52181 47535 11504 -18061 -111496 -79298 -77969 -48815 -41137
16260 -41137 -41951 -46241 -147487 -329680 -526362 -547885 -464910 -395662 -270807 -108133 41287
16249 41287 78713 2414 121788 149165 86603 -51472 -157425 -283857 -338355 -297501 -87562
16238 -87562 -226235 -266360 -184998 -129732 -16430 39359 -966 -264659 -182452 -130517 -239219
$$ packed form
16313a8722j68304p6913p5739K6868J12217n409J2383j4329L476k3779L6370p3204
16301b65085J95386J63613j98918j30679K80624k2301k7043M9409J66102j81558
16291B9550l13097j14009J74558J00333K1407Q1285J21504Q5306j26730o7657
16281g550j85367j55389J95320K38786J41124J2762j97024j12096r8826p4555
16271b42815j48997l5783L75414R9716l6031k9565r3435L2198J329K9154P678
16260d1137q14m290j01246j82193j96682k1523Q2975O9248J24855J62674J49420
16249D1287L7426p6299J19374K7377o2562j38075j05953j26432n4498M0854K09939
16238h7562j38673m0125Q1362N5266J13302N5789m0325k63693Q2207N1935j08702
$$ plain form
16227 -239219 -265522 -147613 -121777 -111155 -126313 -265740 -337315 -266038 -337921 -262412 -222012
16216 -222012 -98115 -40679 -115498 -140336 -42098 -55498 20910 -12658 -161353 -215657 -300050
16205 -300050 -311336 -187325 -140430 16935 4897 55805 -38906 -142037 -90515 -82428 -278442
16194 -278442 -184955 -127827 14367 -109010 -84373 -212389 -259583 -189746 -94229 -76755 80535
16183 80535 247474 218765 16229 -102431 -259692 -316268 -75107 228420 310728 164363
16173 164363 -46011 -116788 -128447 -277307 -59057 -49274 -6218 214864 152701 113315 51463
16162 51463 40886 171343 74338 -44991 18528 77111 167457 154960 117818 -31139 -5654
16151 -5654 -71158 -165211 -463679 -718634 -485707 -330696 -305691 -168487 -272302 -360375 -94895
$$ packed form
16227b39219k6303J17909K5836J0622j5158j39427p1575P1277p1883P5509M0400
16216b22012J23897N7436p4819k4838R8238j3400P6408l3568j48695n4304q4393
16205c00050j1286J24011M6895J57365j2038N0908r4711j03131N1522Q087j96014
16194b78442R3487N7128J42194j23377K4637j28016m7194O9837R5517J7474J57290
16183H0535J66939k8709k02536j18660j57261n6576K41161L03527Q2308j46365
16173A64363k10374p0777j1659j48860K18250R783M3056K21082o2163l9386o1852
16162E1463j0577J30457r7005j19329O3519N8583R0346j2497l7142j48957K5485
16151e654o5504r4053k98468k54955K32927J55011K5005J37204j03815q8073K65480
$$ plain form
16140 -94895 -71034 -234870 -274357 -320622 -128945 -9455 226140 282629 208441 242903 140739
16129 140739 -51723 -9627 -85061 -167177 -237245 -328161 -40881 178428 133179 110940 154834
16118 154834 104926 43801 -21971 77301 13535 79222 -212184 -423853 -157869 160364 237198
16107 237198 -40086 78876 106598 -73553 -225456 30266 224343 74192 102723 71246
16097 71246 -94520 -32969 -308381 -472290 -473328 -209521 -132037 -90683 -70858 -208872 -487340
16086 -487340 -693188 -676889 -559026 -190886 35764 -64288 -86705 -20154 -1624 205460
16076 205460 195817 -16202 120054 346782 324792 197133 143148 43913 -90727 -53169 29418
16065 29418 59430 85939 111853 -73165 -130931 39151 -108657 -65098 -133342 -294360 -223562
$$ packed form
16140i4895K3861j63836l9487m6265J91677J19490K35595N6489p4188L4462j02164
16129A40739j92462M2096p5434q2116p0068r0916K87280K19309m5249k2239M3894
16118A54834m9908o1125o5772R9272o3766O5687k91406k11669K65984L18233P6834
16107B37198k77284J18962K7722j80151j51903K55722J94077j50151K8531l1477
16097G1246j65766O1551k75412j63909j038K63807P7484M1354J9825j38014k78468
16086d87340k05848J6299J17863L68140K26650j00052k2417O6551J8530K07084
16076B05460r643k12019J36256K26728k1990j27659n3985r9235j34640L7558Q2587
16065B9418L0012K6509K5914j85018n7766J70082j47808M3559o8244j61018P0798
$$ plain form
16054 -223562 -148025 -27936 95866 96449 285872 395548 256345 275884 300612 188701 -22244
16043 -22244 -244129 -201119 -92615 -78818 93674 147091 71903 70499 12005 -46397 -132404
16032 -132404 -39327 89638 155793 146362 175252 242384 325375 276924 330061 330611 260140 352903
16020 352903 373917 205093 186373 15310 -183027 -127571 1025 4001 1909 11533 10176
16009 10176 -40955 -8206 -108436 -39440 90263 82076 98431 187793 120342 71229 50161
15998 50161 38136 30326 -24930 -209333 -244822 -242917 -136264 -62086 188512 193654 154397 136550
15986 136550 31551 -102982 -252042 -345328 -202119 -349909 -402382 -126490 32904 139901
15976 139901 328704 374605 89428 2902 2511 45901 -32700 -206822 -354096 -493455 -464566
$$ packed form
16054b23562P5537J20089J23802N83J89423J09676j39203J9539K4728j11911k10945
16043b2244k21885M3010J08504J3797J72492N3417p5188j404n8494n8402q6007
16032a32404R3077J28965O6155r431K8890O7132Q2991m8451N3137N50p0471R2763
16020C52903K1014j68824j8720j71063j98337N5456J28596K976k092R624j357
16009A0176n1131L2749j00230O8996J29703q187J6355Q9362o7451m9113k1068
15998E0161j2025p810n5256j84403l5489J905J06653P4178K50598N142l9257j7847
15986A36550j04999j34533j49060r3286J43209j47790n2473K75892J59394J06997
15976A39901J88803M5901k85177q6526l91M3390p8601j74122j47274j39359K8889
$$ plain form
15965 -464566 -368897 -216242 -50581 -48710 7228 16419 148174 315543 200706 -3664 -91371
15954 -91371 -47098 111573 113052 22839 -46040 32266 99909 59694 -58793 -21796 -110969
15943 -110969 -365424 -545989 -650190 -442114 -222291 -42536 -70457 -124032 -63649 -94937
15933 -94937 -314305 -403817 -377363 -559819 -507925 -39932 163926 201568 -53757 -111199 -54586
15922 -54586 41992 102701 -5055 -23734 88289 67569 143937 98291 192177 151988 195299
15911 195299 -121108 -111538 17935 -52570 -256315 -326032 -521220 -295305 -275364 -499645
15901 -499645 -591996 -477000 -364392 -218847 -263061 -277756 -190417 -55544 8632 15169 -122817
15890 -122817 -127678 -30786 8885 31582 98200 211512 366827 281551 143928 192343 357274
$$ packed form
15965d64566R5669J52655J65661J871N5938R191J31755J67369j14837k04370q7707
15954i1371M4273J58671J479r0213o8879P8306O7643m0215j18487L6997q9173
15943a10969k54455j80565j04201K08076K19823J79755k7921n3575O0383l1288
15933i4937k19368q9512K6454j82456N1894M67993K03858L7642k55325n7442N6613
15922e4586R6578O0709j07756j8679J12023k0720P6368m5646R3886m0189M3311
15911A95299l16407R570J29473p0505k03745o9717j95188K25915J9941k24281
15901d99645r2351J14996J12608J45545m4214j4695Q7339J34873O4176O537j37986
15890a22817m861R6892L9671K2697O6618J13312J55315q5276j37623M8415J64931
$$ plain form
15879 357274 384711 182643 55516 -5210 -168737 -235618 -161754 -244849 -39063 59403 156403
15868 156403 264843 373270 119613 121032 25577 65319 158342 259065 262171 73869 -70242
15857 -70242 -131923 -97516 -54712 9700 -103226 -55877 -41122 -47543 -341474 -194329 -140036
15846 -140036 35376 201040 188790 150479 140794 -33748 -14555 301204 575808 629480 364521
15835 364521 233659 69791 212042 121740 61265 233299 38055 -173968 -227032 -326005
15825 -326005 -314557 -86310 76960 55065 7576 63929 124964 51586 102168 210877 150462
15814 150462 32819 36170 -54462 -311515 -242412 -294353 -145349 -24867 55155 -60209 -108722
15803 -108722 -65274 50090 -35348 3619 216955 240710 86084 164474 49542 43717 22558
$$ packed form
15879C57274K7437k02068j27127o0726j63527o6881P3864q3095K05786R8466R7000
15868A56403J08440J08427k53657J419r5455L9742R3023J00723L106j88302j44111
15857g0242o1681L4407M2804O4412j12926M7349J4755o421k93931J47145N4293
15846a40036J75412J65664j2250l8311r685j74542J9193L15759K74604N3672k64959
15835C64521j30862j63868J42251r0302o0475J72034j95244k12023n3064r8973
15825c26005J1448K28247J63270k1895m7489N6353O1035p3378N0582J08709o0415
15814A50462j17643L351r0632k57053O9103n1941J49004J20482Q0022j15364m8513
15803a08722M3448J15364q5438L8967K13336K3755j54626P8390j14932n825k1159
$$ plain form
15792 22558 -141357 -78977 31010 122723 240854 200071 220099 118200 100821 -133279 -180567
15781 -180567 -101816 94633 155059 39013 -30378 -9084 -120664 -11636 117568 190473
15771 190473 304690 586537 598721 162305 -17215 -165881 -222974 -333294 -442841 -240943
15761 -240943 -229277 -182442 -264271 -233467 -157757 -120175 3247 -147118 -249317 36572 181955
15750 181955 22135 -184042 -177737 -86178 -36470 99463 359966 275541 187286 43328 51943
15739 51943 -61853 7363 -73710 -208431 41760 439779 227005 3206 17760 76451
15729 76451 164431 84549 136100 -36085 -15415 143307 -59627 -136362 -27919 -75615 -98535
15718 -98535 -163699 -252293 -171914 -105650 7526 41829 12512 70341 -98807 -296962 -405347
$$ packed form
15792B2558j63915O2380J09987R1713J18131m0783K0028j01899j7379k34100m7288
15781a80567P8751J96449O0426j16046o9391K1294j11580J09028J29204P2905
15771A90473J14217K81847J2184m36416j79520j48666n7093j10320j09547K01898
15761b40943J1666M6835q1829L0804P5710L7582J23422j50365j02199K85889J45383
15750A81955j59820k06177O305R1559M9708J35933K60503q4425q8255j43958Q615
15739E1943j13796O9216q1073j34721K50191L98019k12774k23799J4554N8691
15729G6451Q7980p9882N1551j72185K0670J58722k02934p6735J08443m7696k2920
15718i8535o5164q8594Q0379O6264J13176L4303k9317N7829j69148j98155j08385
$$ plain form
15707 -405347 -490789 -360941 -514680 -544935 -227158 -180496 -142754 123303 83732 -136378
15697 -136378 -199605 282581 592045 751515 490108 -25128 -75537 62405 16847 157016
15687 157016 190633 61598 55975 87002 44508 -228476 -357744 -140760 -48284 -221540 -333831
15676 -333831 -357924 -363502 -599267 -442791 -209933 -283880 -378158 -180982 -68977 -68640 -83049
15665 -83049 -250966 -357914 -156256 -243533 -126966 -112718 -150742 9713 97581 21442 69790
15654 69790 -47945 -172463 -70772 -68320 -21879 -128333 -108154 41266 30390 93624 313937
15643 313937 268506 195342 205398 268523 288324 174455 -9823 -304967 -287571 -288694 -178732
15632 -178732 -195246 -332058 -307104 -223045 -88926 -33552 -59899 -232274 -340669 -139582
$$ packed form
15707d05347q5442J29848j53739l0255L17777M6662L7742K66057l9571k20110
15697a36378o3227M82186L09464J59470k61407n15236n0409J37942m5558J40169
15687A57016L3617j29035n623L1027m2494k72984j29268K16984R2476j73256j12291
15676c33831k4093n578k35765J56476K32858p3947r4278J97176J12005L37j4409
15665h3049j67917j06948K01658q7277J16567J4248l8024J60455Q7868p6139M8348
15654F9790j17735j24518J01691K452M6441j06454K0179J49420j0876O3234K20313
15643C13937m5431p3164J0056O3125J9801j13869j84278k95144J7396j123J09962
15632a78732j6514j36812K4954Q4059J34119N5374k6347j72375j08395K01087
$$ plain form
15622 -139582 80141 140766 -23054 113419 47939 -142281 -50798 -32721 -84808 -217138
15612 -217138 -505791 -560621 -478445 -443438 -290402 -226027 -253818 -256867 -119361 -29659 -12169
15601 -12169 104893 126864 12747 -74640 -109047 -70 148568 42541 -182176 -68986
15591 -68986 -87261 -70237 -26413 -201843 -260018 -73330 47104 -80106 -382800 -282292
15581 -282292 -73404 -57267 25191 173613 197219 191175 91155 88632 -36968 -89856 -228457
15570 -228457 -115184 -38088 -216075 -378360 -328600 -513914 -474331 -324202 -301240 -315412
15560 -315412 -462916 -173654 6262 -112796 -217201 -108601 -125105 -6839 101191 214855
15550 214855 318392 175591 232146 266696 110680 58231 -110040 -134125 -149360 -157966 -81203
$$ packed form
15622a39582K19723O0625j63820J36473o5480j90220R1483J8077n2087j32330
15612b17138k88653n4830Q2176L5007J53036O4375k7791l049J37506Q9702J7490
15601a2169J17062K1971j14117q7387l4407J08977J48638j06027k24717J13190
15591f8986j8275J7024M3824j75430n8175J86688J20434j27210l02694J00508
15581b82292K08888J6137Q2458J48422K3606o044j00020k523j25600n2888j38601
15570b28457J13273P7096j77987j62285M9760j85314L9583J50129K2962j4172
15560c15412j47504K89262J79916j19058j04405J08600j6504J18266J08030J13664
15550B14855J03537j42801N6555L4550j56016n2449j68271k4085j5235q606P6763
$$ plain form
15539 -81203 50 77807 180355 20177 -142090 -116602 -96251 -42555 -109081 -138066 -268772
15528 -268772 -490558 -628355 -519429 -353015 -359363 -305160 -151916 -76174 -195861 -248947
15518 -248947 -317006 -227357 -291630 -220366 -122785 -128532 -267892 -219057 4006 -56363 -117901
15507 -117901 86922 115866 77160 127906 275252 146852 13901 -19029 111553 204077
15497 204077 161098 -137363 -348199 -346681 -199345 -162996 -251099 -341547 -431018 -382802 -437048
15486 -437048 -314288 -238059 -156857 -29241 -43256 -28 -57555 -212441 -163361 -174730 -48052
15475 -48052 -34446 -55628 -52985 -30045 35948 47124 -145920 -162269 64028 174127 103576
15464 103576 86144 -5773 -29881 -6311 -19821 -176961 -151231 29940 25284 -60563 -205645
$$ packed form
15539h1203Q1253P7757J02548j60178j62267K5488K0351N3696o6526k8985j30706
15528b68772k21786j37797J08926J66414o348N4203J53244P5742j19687n3086
15518b48947o8059Q9649o4273P1264R7581n747j39360M8835K23063o0369o1538
15507a17901K04823K8944l8706N0746J47346j28400j32951l2930J30582R2524
15497B04077m2979k98461k10836J518J47336L6349q8103r0448q9471M8216n4246
15486d37048J22760P6229Q1202J27616j4015M3228n7527j54886M9080j1369J26678
15475d8052J3606k1182K643K2940O5993J1176j93044j6349K26297J10099p0551
15464A03576j7432r1917k4108K3570j3510j57140K5730J81171m656q5847j45082
$$ plain form
15453 -205645 -246735 -210584 -9784 -129024 -383767 -351380 -265548 -276767 -195831 -81423 98899
15442 98899 62700 -96053 -248143 -77605 -10695 -17238 90683 78255 20351 107342 123700
15431 123700 247649 278856 267734 339961 274565 86187 50963 126204 6429 -47588 157615
15420 157615 -29538 -185662 -248109 -250424 -218372 -194510 -294303 -275465 -263789 -252386 -336348
15409 -336348 -179258 85858 47996 -85956 -78129 -20644 32061 -171039 -36653 258642
15399 258642 143477 104830 -59071 -260390 -325559 -282078 -59167 37711 95404 -40219
15389 -40219 19053 42136 70034 -78151 -111200 -71719 -109284 71408 15000 -103995 -102781
15378 -102781 -67567 -23632 -19838 3755 26454 -57297 -384778 -314146 2685 22775 -354963
$$ packed form
15453b05645m1090L6151K00800j19240k54743L2387Q5832j1219Q0936J14408J80322
15442I8899l6199j58753j52090J70538O6910o543J07921j2428n7904Q6991J6358
15431A23700J23949L1207j1122P2227o5396j88378l5224P5241j19775n4017K05203
15420A57615j87153j56124o2447k315L2052K3862r9793J8838J1676J1403q3962
15409c36348J57090K65116l7862j33952P827N7485N2705k03100J34386K95295
15399B58642j15165l8647j63901k01319o5169M3481K22911R6878N7693j35623
15389d0219N9272K3083K7898j48185l3049L9481l7565J80692n6408j18995J214
15378a02781L5214M3935L794K3593K2699q3751l27481P0632L16831K0090l77738
$$ plain form
15367 -354963 -457284 -557886 -385927 -364096 -439225 -314219 -27751 -75901 -149690 -168729
15357 -168729 35610 51619 130931 115169 -26890 40060 -61856 -160846 -112961 -173507 -205316
15346 -205316 -83485 6364 -193220 -201027 -171015 -128711 -84215 -65418 -159632 -22095 306552
15335 306552 242310 -52678 -224752 -164435 -274469 -176096 -274319 -549544 -545747 -726133 -736574
15324 -736574 -659060 -375137 -125837 -47773 65685 14365 -99054 -93460 -137256 -4253 -46531
15313 -46531 -111382 -69928 -10072 -117704 -167950 -84051 -22138 -99659 -159626 -134926 -131624 -174591
15301 -174591 -142768 -184653 -248972 -310413 -288596 -194407 -233032 -383606 -139392 -6338 -129805
15290 -129805 -80128 149586 335067 105584 -14379 123289 115111 59707 63369 66744 56405
$$ packed form
15367c54963j02321j00602J71959K1831p5129J25006K86468m8150p3789j9039
15357a68729K04339J6009P9312j5762j42059O6950j01916r8990M7885o0546l1809
15346b05316J21831Q9849j99584p807L0012M2304M4496J8797r4214J37537L28647
15335C06552o4242k94988j72074O0317j10034R8373r8223k75225L797j80386j0441
15324g36574P7514K83923K49300P8064J13458n1320j13419N594m3796J33003m2278
15313d6531o4851M1454N9856j07632n0246Q3899O1913p7521n9967K4700L302m2967
15301a74591L1823m1885o4319o1441K1817R4189l8625j50574K44214J33054j23467
15290a29805M9677K29714J85481k29483j19963J37668q178n5404L662L375j0339
$$ plain form
15279 56405 74994 161060 240987 200139 203854 124229 83169 169836 298220 300440 27111 -292917
15267 -292917 -281742 -20234 175499 188445 166225 4323 27835 100573 117364 72387 -74957
15256 -74957 -75177 11164 -29698 -30275 64677 76331 -8558 24480 181037 198295 -9474 -300205
15244 -300205 -444264 -477400 -444464 -379644 -279673 -161213 -138279 -245230 -169489 -55343 -46487
15233 -46487 69331 169230 38192 -229195 -109564 132318 71255 -27658 -146881 -110210
15223 -110210 -66757 -94773 72893 5020 -48870 -95355 -32533 158542 299533 35891 -399455
15212 -399455 -486957 -323921 -15832 -56660 -115843 17670 38661 9737 -136535 -237246
15202 -237246 -259528 4108 46262 129296 51123 44601 108067 141632 113644 117504 78141 45055
$$ packed form
15279E6405J8589Q6066P9927m0848L715p9625m1060Q6667J28384K220k73329l20028
15267b92917J1175K61508J95733J2946k2220j61902K3512P2738J6791m4977j47344
15256g4957k20Q6341m0862n77R4952J1654q4889L3038J56557J7258k07769k90731
15244c00205j44059l3136L2936O4820R9971J18460K2934j06951P5741J14146Q856
15233d6487J15818R9899j31038k67387J19631K41882o1063r8913j19223L6671
15223a10210M3453k8016J67666o7873n3890m6485O2822J91075J40991k63642m35346
15212c99455q7502J63036L08089m0828n9183J33513K0991k8924j46272j00711
15202b37246k2282K63636M2154Q3034p8173o522O3466L3565k7988L860l9363l3086
$$ plain form
15190 45055 98698 45100 165137 182314 134211 108400 98263 8440 -103036 -84934 38617
15179 38617 -65707 -352792 -226554 -150692 -323938 -320242 -326012 -153842 35173 -89683 6668
15168 6668 5258 -11185 111043 88765 12759 51779 56622 80340 -24776 -90798 98119 191571
15156 191571 249949 27171 28031 89345 -195831 -199913 -44495 40501 61415 169377 286790
15145 286790 187810 248423 34399 -199878 -64969 130422 53643 14115 104336 119170 210724
15134 210724 216660 246053 120822 138636 39486 -95725 129531 93531 149010 117969 85991
15123 85991 32906 -85962 -142139 -77501 -243770 -338590 -336971 -150695 99048 49908 63542
15112 63542 -76852 -214225 -292903 -500019 -350338 -44146 -34020 -78995 -158518 -208553 -225790
$$ packed form
15190D5055N3643n3598J20037J7177m8103k5811j0137q9823j11476J8102J23551
15179C8617j04324k87085J26238P5862j73246L696n770J72170J89015j24856R6351
15168F668j410j6443J22228k2278p6006L9020M843K3718j05116o6022J88917R3452
15156A91571N8378k22778Q60O1314k85176m082J55418Q4996K0914J07962J17413
15145B86790r8980O0613k14024k34277J34909J95391p6779l9528R0221J4834R1554
15134B10724N936K9393j25231J7814r9150j35211K25256l6000N5479l1041l1978
15123H5991n3085j18868n6177O4638j66269r4820J619J86276K49743m9140J3634
15112F3542j40394j37373p8678k07116J49681L06192J0126m4975p9523n0035j7237
$$ plain form
15101 -225790 -5528 -44476 22212 198227 228231 191457 95788 139398 -22612 200100 216588
15090 216588 143479 146875 99711 -116537 -83886 -29094 3534 212545 187325 -16455 -204377
15079 -204377 -117728 -336357 -504027 -314660 -282525 -413480 -374088 -351655 -424863 -250882
15069 -250882 -11911 -128603 -83091 40639 154102 177034 167728 117780 202664 24563 -179256
15058 -179256 -189349 30759 21837 -133521 -218260 -91129 3302 -133027 -283786 -461026
15048 -461026 -528601 -561831 -356666 -245580 -304444 -359836 -87868 -197348 -340583 -288615
15038 -288615 -159228 5083 119588 98647 -85993 -110829 -89295 -150400 310296 389477
15028 389477 13668 -145442 -68796 -234403 -403818 -253481 -61797 -217572 -291089 -51122
$$ packed form
15101b25790K20262l8948O6688J76015L0004l6774r5669M3610j62010K22712J6488
15090B16588p3109L396m7164k16248L2651N4792L2628K09011k5220k03780j87922
15079b04377Q6649k18629j67670J89367L2135j30955L9392K2433p3208J73981
15069b50882K38971j16692M5512J23730J13463K2932r306m9948Q4884j78101k03819
15058a79256j0093K20108q922j55358q4739J27131R4431j36329j50759j77240
15048d61026o7575l3230K05165J11086n8864n5392K71968j09480j43235N1968
15038b88615J29387J64311J14505k0941j84640k4836K1534o1105M60696P9181
15028C89477l75809j59110P6646j65607j69415J50337J91684j55775p3517K39967
$$ plain form
15018 -51122 -98805 -158422 -171243 -107788 88883 213819 186363 54670 21506 -44739 153221
15007 153221 303033 209183 134721 359334 584791 477239 457598 298110 278123 274572 181071
14996 181071 -55640 -82602 9601 119279 69587 -66796 -131283 -204927 -78855 95769
14986 95769 165700 149711 -3803 -109241 -43831 -126051 -308275 -168008 -57079 -109028 -356631
14975 -356631 -218960 -75648 -172729 -215459 -43604 -185142 -358418 -323594 -220839 51538
14965 51538 34241 -228994 -354304 -69488 -83547 -120592 -82155 216744 251224 -51977 -300328
14954 -300328 -182595 -27278 -14402 197674 196450 109354 -83489 -311646 -478840 -446082
14944 -446082 -286872 -181830 -249249 -358191 -165015 -174130 -116227 -82083 -19871 136097 197132
$$ packed form
15018e1122m7683n9617j2821O3455J96671J24936k7456j31693l3164o6245J97960
15007A53221J49812r3850p4462K24613K25457j07552j9641j59488j9987l551r3501
14996A81071k36711k6962R2203J09678m9692j36383o4487p3644J26072J74624
14986I5769O9931j5989j53514j05438O5410q2220j82224J40267J10929n1949k47603
14975c56631J37671J43312r7081m2730J71855j41538j73276L4824J02755K72377
14965E1538j7297k63235j25310K84816j4059l7045L8437K98899L4480l03201k48351
14954c00328J17733J55317J2876K12076j224q7096j92843k28157j67194L2758
14944d46082J59210J05042o7419j08942J93176r115N7903L4144O2212J55968O1035
$$ plain form
14933 197132 74517 117720 134252 89591 25767 22007 -104350 -164070 -137149 28092 59040
14922 59040 111270 12769 -95590 -212969 -322514 -308489 -279853 -155461 -243223 -325014 -260013
14911 -260013 -281455 -311790 -276125 -54576 32390 206691 84696 -40150 -17978 149643
14901 149643 162684 112467 -96430 -106247 -177266 -72414 6449 -19928 97718 22710 135397
14890 135397 121903 89342 134440 195385 187760 259850 268997 72464 -121466 -343670 -408274
14879 -408274 -297545 -206141 -264440 -161326 -440280 -455842 -381849 -51723 254182 193931
14869 193931 11365 -57 -85089 -80011 100415 449858 538831 314570 343057 346851 83207
14858 83207 -72885 26114 -114432 -175188 -131836 -178328 -299186 -224246 -133651 -188146 -95573
$$ packed form
14933A97132j22615M3203J6532m4661o3824l760j26357n9720K6921J65241L0948
14922E9040N2230r8501j08359j17379j09545J4025K8636J24392q7762q1791O5001
14911b60013k1442l0335L5665K21549Q6966J74301j21995j24846K2172J67621
14901A49643J3041n0217k08897r817p1019J04852P8863k6377J17646p5008J12687
14890A35397j3494l2561M5098O0945p625P2090R147j96533j93930k22204o4604
14879d08274J10729R1404n8299J03114k78954j5562P3993L30126L05905o0251
14869A93931j82566j1422q5032N078J80426L49443Q8973k24261K8487L794k63644
14858H3207j56092R8999j40546o0756M3352m6492j20858P4940R0595n4495R2573
$$ plain form
14847 -95573 54946 -1127 58975 235733 273366 141669 173683 114934 -99754 -113910 -36308
14836 -36308 66356 57544 150803 69592 -24285 -18336 -59129 131141 211527 108175 -33063
14825 -33063 -213883 -154961 -171816 -32415 -14441 -16597 173972 196119 162958 256721 215749
14814 215749 -38692 15077 217929 59521 -53725 49357 -105868 -325940 -318661 -213144
14804 -213144 -258389 -101955 -52863 -4706 160938 97242 72328 201796 280888 98357 -9173
14793 -9173 75685 64998 67137 72172 -66605 -270063 -297698 -121291 -146846 -308027 -221405
14782 -221405 -67496 163823 262729 129591 39243 71134 -24552 -143436 62467 202901
14772 202901 201120 1441 -267736 -308126 -226281 -275537 -767982 -617116 -288019 -269522 46331
$$ packed form
14847i5573J50519n6073O0102J76758L7633j31697L2014n8749k14688j4156P7602
14836c6308J02664q812R3259q1211r3877N949m0793J90270Q0386j03352j41238
14825c3063j80820N8922j6855J39401J7974k156J90569K2147l3161R3763m0972
14814B15749k54441N3769K02852j58408j13246J03082j55225k20072P279J05517
14804b13144m5245J56434M9092M8157J65644o3696k4914J29468P9092j82531j07530
14793i173Q4858j0687K139N035j38777k03458k7635J76407k5555j61181Q6622
14782b21405J53909K31319R8906j33138r0348L1891r5686j18884K05903J40434
14772B02901j781j99679k69177m0390Q1845m9256m92445J50866L29097J8497L15853
$$ plain form
14761 46331 -1111 65478 42293 -84841 131894 49042 -205301 -278456 118266 243445 -10879
14750 -10879 -86941 119945 397822 513355 438121 388293 293410 44637 -46910 87538 230362
14739 230362 248518 236421 275996 51500 -2740 -52158 -139260 -40233 162442 285178 217895
14728 217895 204109 263790 25378 -156189 -78440 -260094 -237881 85522 193115 88440
14718 88440 71861 -57845 -195026 -171799 -93959 -203364 -77002 100670 255165 168938
14708 168938 104235 -21203 -31889 -118547 -122783 -36649 3824 -203100 -247130 -125193 -288596
14697 -288596 -335805 -213358 -187125 -310621 -245684 -77427 -162246 -127141 -9539 166444
14687 166444 124196 62844 220208 298306 331871 41092 4005 47569 67989 -53617 -123993
$$ packed form
14761D6331m7442O6589k3185j27134K16735q2852k54343p3155L96722J25179k54324
14750a0879p6062K06886K77877J15533p5234m9828r4883k48773r1547J34448J42824
14739B30362J8156j2097L9575k24496n4240m9418q7102R9027K02675J22736o7283
14728B17895j3786N9681k38412j81567P7749j81654K2213L23403J07593j04675
14718H8440j6579j29706j37181K3227P7840j09405J26362J77672J54495q6227
14708A68938o4703j25438j0686q6658m236Q6134M0473k06924m4030J21937j63403
14697b88596m7209J22447K6233j23496O4937J68257q4819L5105J17602J75983
14687A66444m2248o1352J57364P8098L3565k90779l7087M3564K0420j21606p0376
$$ plain form
14676 -123993 -136730 43407 51720 -29423 -232868 -372391 -276579 -199510 39948 100463 114341
14665 114341 57089 306024 290420 114933 -1657 147143 132368 -146726 -233124 -255169
14655 -255169 -197236 -213899 -88317 -138683 -41709 -5219 -229164 -303855 -293275 -246364 -76621
14644 -76621 97326 236067 -8069 561 -23827 -49705 1763 -33187 50558 163301 127779
14633 127779 81975 -71339 -154904 -192369 -36400 -68379 76929 67506 -130379 -153860 -183828
14622 -183828 -24216 177305 -264436 -610281 -363663 -227292 -112261 139974 115322 -58922
14612 -58922 -270942 -181905 -160527 -281615 -345503 -449885 -307715 -176525 -48040 -85843
14602 -85843 -82781 -131094 18694 -27148 22663 43295 -138186 -215113 -115293 157196 601905
$$ packed form
14676a23993j2737J80137Q313q1143k03445j39523R5812P7069K39458O0515J3878
14665A14341n7252K48935j5604j75487j16590J48800j4775k79094q6398k2045
14655b55169N7933j6663J25582n0366R6974L6490k23945p4691J0580M6911J69743
14644g6621J73947J38741k44136Q630k4388k5878N1468l4950Q3745J12743l5522
14633A27779m5804j53314q3565l7465J55969l1979J45308r423j97885k3481k9968
14622a83828J59612K01521m41741l45845K46618J36371J15031K52235k4652j74244
14612e8922k12020Q9037K1378j21088o3888j04382J42170J31190J28485l7803
14602h5843L062m8313J49788m5842M9811K0632j81481p6927R9820K72489M44709
$$ plain form
14591 601905 684372 415731 213054 343445 541533 416627 238728 143518 42546 -70116
14581 -70116 -23446 18790 -268311 -323000 -316057 -171207 76404 192136 -7028 -98051 187258
14570 187258 288451 289215 172531 109884 121286 209411 93420 -77329 -72818 -117041 -188270
14559 -188270 -132280 -31309 -4533 -143484 -53964 110512 81600 -205020 -369328 -310665
14549 -310665 -429245 -581649 -465335 -372909 -291071 -263500 -22431 156127 11565 -44897
14539 -44897 -219812 -270960 -71331 23619 38893 5144 160083 172461 35212 60023 91907
14528 91907 -25699 -135382 -265813 -133232 151663 205370 351493 281043 13112 -129252
14518 -129252 -213534 -139010 -13590 1226 135278 17391 -192107 -188566 -292475 -106714
$$ packed form
14591F01905Q2467k68641k02677J30391J98088j24906j77899r5210j00972j12662
14581g0116M6670M2236k87101n4689O943J44850K47611J15732j99164r1023K85309
14570A87258J01193P64j16684o2647J1402Q8125j15991j70749M511m4223p1229
14559a88270N5990J00971K6776j38951Q9520J64476k8912k86620j64308N8663
14549c10665j18580j52404J16314R2426Q1838K7571K41069J78558j44562n6462
14539d4897j74915n1148J99629R4950J5274l3749J54939J2378j37249K4811L1884
14528I1907j17606j09683j30431J32581K84895N3707J46123p0450k67931j42364
14518a29252q4282P4524J25420J4816J34052j17887k09498L541j03909J85761
$$ plain form
14508 -106714 21134 200565 111473 -147300 -81806 -1248 -4089 104884 71891 96369 63958
14497 63958 -9399 -64815 -38073 -116200 -51913 194027 196946 200125 164488 303565 205517 95110
14485 95110 79640 246005 341601 561478 476332 292271 147763 -96209 -57038 68926
14475 68926 107155 23364 -54823 -92184 -241438 -349145 -112106 162456 23743 -183864
14465 -183864 -193965 -198041 -47709 -84025 -72533 -13475 81745 150758 18830 128779 230585
14454 230585 247910 324967 173173 -49034 -79503 -169079 -386878 -254308 -33408 57551
14444 57551 66515 95854 98695 119709 364163 335456 83153 11837 -196711 -161928 -135638
14433 -135638 -196435 -131924 -111051 -151394 -174551 -180559 -161451 -195793 -201331 -208454 -247758 -65235
$$ packed form
14508a06714J27848J79431q9092k58773O5494Q0558k841J08973l2993K4478l2411
14497F3958p3357n5416K6742p8127O4287K45940K919L179l5637J39077r8048j10407
14485I5110j5470J66365R5596K19877q5146j84061j44508k43972L9171J25964
14475F8926L8229q3791p8187l7361j49254j07707K37039K74562j38713k07607
14465a83864j0101m076J50332l6316J1492N9058R5220O9013j31928J09949J01806
14454B30585J7325P7057j51794k22207l0469q9576k17799J32570K20900R0959
14444E7551Q964K9339K841K1014K44454k8707k52303p1316k08548L4783K6290
14433a35638o0797O4511K0873m0343k3157o008J9108l4342n538p123l9304J82523
$$ plain form
14421 -65235 -35081 -202311 -77952 127912 118552 -90160 47010 -29632 -95265 -97764 -97705 -110732
14409 -110732 -199919 -151379 -187733 -116814 113264 80419 7687 74742 25196 -16018 -81747
14398 -81747 -237478 -146258 -120217 -29772 -52320 83937 25900 -123782 -193987 -206142 -271714
14387 -271714 -173173 -111104 -147692 -331968 -394537 -330184 -249569 -176749 -64642 41050 127861
14376 127861 -13966 10468 -276776 -228340 -73990 29246 44387 -61012 -96152 -58340
14366 -58340 -105388 -159779 -90945 24510 3420 118278 66979 -57530 -173045 -229175 -191512
14355 -191512 -202409 -144781 -94331 -5983 169474 150318 213082 77148 -19032 -60087 -101062
14344 -101062 -295570 -269250 -185427 -216938 -78842 162320 -137565 -398571 -369933 -357655
$$ packed form
14421f5235L0154j67230J24359K05864r360k08712J37170p6642o5633k499N9j3027
14409a10732q9187M8540l6354P0919K30078l2845p2732O7055m9546m1214o5729
14398h1747j55731R1220K6041R0445k2548J36257n8037j49682p0205j2155o5572
14387b71714R8541O2069l6588j84276o2569O4353Q0615P2820J12107J05692Q6811
14376A27861j41827K4434k87244M8436J54350J03236J5141j05399l5140L7812
14366e8340m7048n4391O8834J15455k1090J14858n1299j24509j15515n6130L7663
14355a91512j0897N7628N0450Q8348J75457j9156O2764j35934r6180m1055m0975
14344a01062j94508K6320Q3823l1511J38096K41162k99885k61006K8638J2278
$$ plain form
14334 -357655 -477881 -515103 -308379 41022 65896 77754 -177651 -549981 -435161 -508611
14324 -508611 -512902 -282736 -196603 -293191 -118786 -76743 -20999 193106 367427 293711 252056
14313 252056 168487 72074 29938 115811 44119 -76794 -37648 126657 26506 -114182 -82318
14302 -82318 -33605 -34067 90845 4823 -238948 -395187 -468209 -507853 -363805 -506677 -632948
14291 -632948 -629672 -422437 -127385 -188490 -305492 -113580 1719 27043 -50306 -79236 -193652
14280 -193652 -243954 -64102 -34440 -51603 167760 66604 -219101 -14113 -114753 -135968
14270 -135968 -137388 -108065 -7987 38472 58528 7489 -36323 -239667 -416053 -427354 -137813
14259 -137813 -348832 -373630 -449087 -276964 -271750 -380596 -394745 -519587 -465950 -142607 173674
$$ packed form
14334c57655j20226l7222K06724L49401K4874J1858k55405l72330J14820p3450
14324e08611m291K30166Q6133r6588J74405M2043N5744K14105J74321p3716m1655
14313B52056q3569r6413m2136Q5873p1692j20913L9146J64305j00151j40688L1864
14302h2318M8713m62J24912q6022k43771j56239p3022l9644J44048j42872j26271
14291f32948L276K07235K95052o1105j17002J91912J15299K5324p7349k8930j14416
14280a93652n0302J79852K9662j7163K19363j01156k85705K04988j00640k1215
14270a35968j420K9323J00078M6459K0056n1039m3812k03344j76386j1301K89541
14259a37813k11019k4798p5457J72123N214j08846j4149j24842N3637L23343L16281
$$ plain form
14248 173674 303945 291223 219047 188545 158697 247634 259343 6923 94462 253444 181590
14237 181590 53248 -54889 178674 235859 14715 -97286 101319 152961 100095 9407
14227 9407 -132538 -181876 -108775 1032 100989 35909 228437 174143 -6568 31633 -30164
14216 -30164 -129918 -219251 -341088 -327969 -214700 -34485 -88646 -373443 -448289 -291658 -235170
14205 -235170 -124596 -136469 -169501 -65074 90792 196161 225626 169703 50162 79659
14195 79659 93384 145331 224935 179006 231197 264666 186490 127106 -211173 -182178 55008
14184 55008 151408 -75796 -230814 -256478 63395 32386 -174835 31103 -75358 -294236
14174 -294236 -158033 -125588 -113243 19534 49609 226159 260185 141225 2466 52267
$$ packed form
14248A73674J30271j2722p2176l0502k9848Q8937J1709k52420Q7539J58982p1854
14237A81590j28342j08137K33563N7185k21144j12001J98605N1642n2866r0688
14227I407j41945m9338P3101J09807R9957o5080J92528n4294j80711L8201o1797
14216c0164r9754q9333j21837J3119J13269J80215n4161k84797p4846J56631N6488
14205b35170J10574j1873l3032J04427J55866J05369K9465n5923j19541K9497
14195G9659J3725N1947P9604m5929N2191L3469p8176n9384l38279K8995K37186
14184E5008R6400k27204j55018k5664L19873l1009k07221K05938j06461k18878
14174b94236J36203L2445J2345J32777L0075J76550L4026j18960j38759M9801
$$ plain form
14164 52267 104270 989 69015 445652 573234 440925 286320 71390 171108 358447
14154 358447 259895 30396 85698 -8278 -25413 -90728 -420033 -311995 -239690 -186819 -118034
14143 -118034 -189791 -24478 100930 -61062 -210958 -282490 -173059 -72896 -96776 -292558
14133 -292558 -189407 -23466 15969 -206506 -386702 -258267 -199892 -333629 -120898 115779
14123 115779 310709 -6568 -94574 -48981 78545 31129 61603 100005 174217 87112 -33940
14112 -33940 -229 207419 112042 -112579 -272103 -453420 -279988 52222 -32990 -136172
14102 -136172 7001 44717 -69103 38609 -80641 -104379 78761 65899 148988 264320
14092 264320 314286 101841 77902 231921 242126 -15996 51208 -45759 59914 -60235
$$ packed form
14164E2267N2003j03281O8026L76637J27582j32309j54605k14930R9718J87339
14154C58447r8552k29499N5302r3976j7135o5315l29305J08038P2305N2871O8785
14143a18034p1757J65313J25408j61992j49896p1532J09431J00163k3880j95782
14133b92558J03151J65941L9435k22475j80196J28435N8375j33737K12731K36677
14123A15779J94930l17277q8006M5593J27526m7416L0474L8402P4212q7105j21052
14112c3940L3711K07648r5377k24621j59524j81317J73432L32210q5212j03182
14102a36172J43173L7716j13820J07712j19250k3738J83140j2862Q3089J15332
14092B64320M9966k12445k3939J54019J0205k58122O7204r6967J05673j20149
$$ plain form
14082 -60235 8583 260764 159196 111657 81546 -1739 -18621 -135947 -74365 -111238 -48849
14071 -48849 68523 254569 143563 -34951 -170711 -120538 -130636 -4040 102817 -74899
14061 -74899 -206091 -189430 -163232 -154935 -252406 -227464 -149549 -80200 140828 92644 51076
14050 51076 215608 25412 3765 204639 54842 -163991 -115418 -150063 -313915 -224136
14040 -224136 -75251 -171953 -94070 -51216 -101339 -27271 49753 68073 118632 97995 -83406
14029 -83406 -413662 -376070 -372742 -480614 -542378 -433410 -333092 -244058 -316178 -241003 -6745
14018 -6745 -39998 -81904 131611 210859 310586 434562 480793 312419 115137 -128005 29184
14007 29184 133634 -166333 -237951 -33341 92266 147776 122201 159524 165094 97304 92228
$$ packed form
14082f0235O8818K52181j01568m7539l0111q3285j6882j17326O1582l6873O2389
14071d8849J17372J86046j11006j78514j35760N0173j0098J26596J06857j77716
14061g4899j31192J6661K6198Q297r7471K4942P7915O9349K21028m8184m1568
14050E1076J64532j90196k1647K00874j49797k18833M8573l4645j63852Q9779
14040b24136J48885r6702P7883M2854n0123P4068P7024J8320N0559k0637j81401
14029h3406l30256L7592L328j07872o1764J08968J00318Q9034p2120P5175K34258
14018f745l3253m1906K13515P9248R9727J23976M6231j68374j97282k43142J57189
14007B9184J04450k99967p1618K04610J25607N5510k5575L7323N570o7790n076
$$ plain form
13996 92228 41238 -77904 64942 285303 103615 20063 172014 83721 -146290 -258543
13986 -258543 -23181 -28761 156157 174842 -13420 -137191 -315757 -35276 166600 141052
13976 141052 134293 137186 120403 50385 11878 34494 -120558 -103264 91374 155268 182426
13965 182426 130133 70205 54055 119937 192423 -36285 79795 101345 152628 116251 177070
13954 177070 68754 -136514 -201905 -195435 -348626 -442726 -178342 -34943 109 110723
13944 110723 66617 -48786 -94084 -140952 -156084 -76323 45346 93331 -58810 54352 44603
13933 44603 -115922 -96174 14744 152318 -16424 -163047 16729 103837 254860 38197
13923 38197 57754 147882 212403 20961 -224137 -223351 -216888 -229701 -293248 -363319 -418684 -513085
$$ packed form
13996I2228n0990j19142J42846K20361j81688q3552J51951q8293k30011j12253
13986b58543K35362n580J84918J8685j88262j23771j78566K80481K01876k5548
13976A41052o759K893j6783p0018l8507K2616j55052J7294J94638O3894K7158
13965A82426n2293n9928j6150O5882P2486k28708J16080K1550N1283l6377O0819
13954A77070j08316k05268o5391O470j53191r4100K64384J43399L5052J10614
13944A10723m4106j15403m5298m6868j5132P9761J21669M7985j52141J13162r749
13933D4603j60525J9748J10918J37574j68742j46623J79776Q7108J51023k16663
13923C8197J9557R0128O4521j91442k45098P86O463j2813o3547p0071n5365r4401
$$ plain form
13911 -513085 -443493 -167730 23058 100177 -78273 151817 162924 192735 228360 24902
13901 24902 58036 -129217 -173646 -163900 -178092 -46842 8652 -57535 54728 20414 -106224
13890 -106224 -113240 27316 -130120 -151685 -148553 44548 89491 -145398 -169182 -118429 -45154
13879 -45154 -68122 67620 257187 226892 -7572 -194119 -437762 -266852 -191263 -150183
13869 -150183 -56126 -130108 -233997 -126696 -58364 49706 158244 -7190 -6253 80602 230143
13858 230143 370067 271333 123887 -155580 -178496 -31459 -10282 64582 -46880 -272299
13848 -272299 -135167 -168184 -118182 -77212 -25077 172041 81115 15580 61066 111933 42241
13837 42241 134562 144996 177265 330638 264324 170538 55495 13921 85462 733 46754
$$ packed form
13911e13085O9592K75763J90788P7119j78450K30090J1107K9811L5625k03458
13901B4902L3134j87253m4429R746j4192J31250N5494o6187J12263l4314j26638
13890a06224p016J40556j57436k1565L132J93101M4943k34889k3784N0753P3275
13879d5154k2968J35742J89567l0295k34464j86547k43643J70910P5589M1080
13869a50183R4057p3982j03889J07301O8332J08070J08538j65434R37Q6855J49541
13858B30143J39924r8734j47446k79467k2916J47037K1177P4864j11462k25419
13848b72299J37132l3017N0002M0970N2135J97118r0926o5535M5486N0867o9692
13837D2241R2321J0434L2269J53373o6314r3786j15043m1574P1541q4729M6021
$$ plain form
13826 46754 114121 108702 68884 161288 168206 169235 68034 -34368 187258 330838 243919
13815 243919 53304 -99380 -179822 -215613 -87737 115723 59502 -2647 42874 -19442 -207194
13804 -207194 -19442 5366 -96219 -219080 -123830 84249 194969 304362 290968 181843
13794 181843 39385 15050 -45256 -182165 -37299 192220 365901 341682 140671 4857
13784 4857 58450 126297 79842 -46291 -138426 -193778 -219431 -145576 -30893 196744 117746
13773 117746 201435 60631 77586 2993 -198897 -109220 1547 114034 94710 167004 308924
13762 308924 123761 -14174 99387 145505 147865 -99582 -87063 118655 214810 266780 190531
13751 190531 -111126 -278029 -283672 -152437 -344326 -35438 267227 -71579 -329264 -205314
$$ packed form
13826D6754O7367n419l9818R2404O918J029j01201j02402K21626J43580q6919
13815B43919j90615j52684q0442l5791J27876K03460n6221o2149M5521o2316j87752
13804b07194J87752K4808j01585j22861R5250K08079J10720J09393j3394j09125
13794A81843j42458k4335o0306j36909J44866K29519J73681k4219k01011j35814
13784D857N3593O7847m6455j26133r2135n5352k5653P3855J14683K27637p8998
13773A17746Q3689j40804J6955p4593k01890Q9677J10767J12487j9324P2294J41920
13762C08924j85163j37935J13561M6118K360k47447J2519K05718R6155N1970p6249
13751A90531l01657j66903n643J31235j91889L08888L02665l38806k57685J23950
$$ plain form
13741 -205314 -53539 -134453 -44331 -47060 98266 298927 320663 177982 74538 -45878
13731 -45878 -50988 39652 199613 203156 -28616 -92945 -82707 -329131 -242826 4288 172749
13720 172749 169326 121677 111599 254142 226670 262953 138040 331362 481236 295099 23385
13709 23385 129706 108153 -26413 69213 99752 43644 164221 199727 368508 261277 153861
13698 153861 -6471 -46330 -103988 195718 229920 -28003 -62368 -92969 -13265 125348 421998
13687 421998 481236 379176 166260 263804 122889 63571 32479 81639 19775 127859 222320
13676 222320 351605 196335 209605 148781 -72792 -63746 -9296 210242 212385 10196 12806
13665 12806 223492 389864 240164 36085 -59904 -50209 -72396 1000 135059 62522 -111341
$$ packed form
13741b05314J51775q0914R0122k729J45326K00661K1736j42681j03444j20416
13731d5878n110R0640J59961L543k31772o4329J0238k46424Q6305K47114J68461
13720A72749l423m7649j0078J42543k7472L6283j24913J93322J49874j86137k71714
13709B3385J06321k1553j34566R5626L0539n6108J20577L5506J68781j07231j07416
13698A53861j60332l9859n7658K99706L4202k57923l4365l0601P9704J38613K96650
13687D21998N9238j02060k12916R7544j40915n9318l1092M9160o1864J08084R4461
13676B22320J29285j55270J3270o0824k21573R046N4450K19538K143k02189K610
13665A2806K10686J66372j49700k04079r5989R695k2187P3396J34059p2537j73863
$$ plain form
13654 -111341 -34086 -52954 -68061 -152377 -59035 226230 357716 374826 323091 188763 348137
13643 348137 626949 576460 629112 665012 502605 240875 165411 193495 217702 276073 215441
13632 215441 205900 95869 56427 107493 207408 225039 305744 317859 140122 94636 134217
13621 134217 199727 271884 376865 458220 376830 174481 272740 432681 378070 279673 283180
13610 283180 316071 182350 131084 -35042 -166117 -55357 -120155 50096 193884 162801
13600 162801 83645 75485 -19193 1725 -46095 -103863 -188921 27622 176692 205400 171489
13589 171489 190131 217555 300837 174894 9231 148907 89097 54588 36104 222200 227736
13578 227736 24757 235 -57029 -206438 -137644 -44879 70934 209723 -12058 -152138
$$ packed form
13654a11341P7255j8868j5107q4316R3342K85265J31486J7110n1735j34328J59374
13643C48137K78812n0489N2652L5900j62407k61730p5464K8084K4207N8371o0632
13632B15441r541j10031l9442N1066R9915J7631Q0705J2115j77737m5486L9581
13621A34217O5510P2157J04981Q1355q1390k02349R8259J59941n4611r8397L507
13610B83180L2891j33721n1266j66126j31075J10760o4798J70251J43788l1083
13600A62801p9156q160r4678K0918m7820n7768q5058K16543J49070K8708l3911
13589A71489J8642K7424Q3282j25943j65663J39676n9810l4509j8484J86096N536
13578B27736k02979k4522n7264j49409O8794R2765J15813J38789k21781j40080
$$ plain form
13568 -152138 19206 -26416 123894 85699 132489 438642 582053 663328 487049 141608
13558 141608 23959 89027 126000 160725 -29225 -98767 -28758 37685 -33185 -7745 181854
13547 181854 203073 -66607 -163980 -108618 -108481 -54094 178916 389702 377041 280357 331294
13536 331294 462566 454634 329812 264240 359892 402811 276125 178063 324489 255914 192875
13525 192875 170113 186635 235704 119096 11714 -22585 233814 223132 -32533 19094 232638
13514 232638 103756 94887 163430 -20868 -156076 -141403 -293070 -349219 -39687 108898
13504 108898 266141 305298 322538 396103 297579 291223 477756 588588 350462 208353 355302
13493 355302 403704 229704 64163 79319 339167 305430 153267 59588 47888 15341 -83613
$$ packed form
13568a52138J71344m5622J50310l8195M6790L06153J43411Q1275j76279l45441
13558A41608j17649O5068L6973L4725j89950o9542P0009O6443p0870K5440J89599
13547A81854K1219k69680r7373N5362J37N4387K33010K10786j2661r6684N0937
13536C31294J31272p932j24822o5572R5652M2919j26686r8062J46426o8575o3039
13525A92875k2762J6522M9069j16608j07382l4299K56399j0682k55665N1627K13544
13514B32638j28882q869O8543j84298j35208J4673j51667n6149L09532J48585
13504A08898J57243L9157J7240P3565r8524o356J86533J10832k38126j42109J46949
13493C55302M8402j74000j65541J5156K59848l3737j52163r3679j1700l2547r8954
$$ plain form
13482 -83613 -196631 -89780 85028 95960 171217 174685 -7053 -8215 53136 102850 204446
13471 204446 64000 -142798 -129528 4571 193969 443981 455565 289025 436640 602756
13461 602756 653731 512140 237528 296789 555247 643417 502480 489205 350372 -53136
13451 -53136 -200611 -27949 114351 -31072 -42217 -109070 -76295 68887 -46289 -306888
13441 -306888 -406740 -274733 -89580 561 -32212 125991 415115 447366 495540 555423 619964
13430 619964 658870 485619 250764 252182 314674 424321 607674 775424 596002 539527
13420 539527 413671 222745 493061 427249 -37902 -91366 173348 174600 187944 150725 173501
13409 173501 330779 360308 307638 235623 372592 330550 252387 107318 -166964 -262786 -90220
$$ packed form
13482h3613j13018J06851J74808J0932P5257L468j81738j162O1351M9714J01596
13471B04446j40446k06798J3270J34099J89398K50012J1584j66540J47615J66116
13461F02756N0975j41591k74612N9261K58458Q8170j40937j3275j38833m03508
13451e3136j47475J72662J42300j45423j1145o6853L2775J45182j15176k60599
13441c06888r9852J32007J85153R0141l2773J58203K89124L2251M8174N9883O4541
13430F19964L8906j73251k34855J418O2492J09647J83353J67750j79422n6475
13420E39527j25856j90926K70316o5812m65151n3464K64714J252J3344l7219K2776
13409A73501J57278K9529n2670p2015J36969m2042p8163j45069k74282r5822J72566
$$ plain form
13398 -90220 -248781 -189676 25167 76422 106232 74098 1071 -71808 103813 457807 490498
13387 490498 256408 346262 399361 423174 270511 181801 135862 62755 29144 13127 13411
13376 13411 2683 241151 527303 496380 358796 268977 323162 67377 -169545 -133679 55085
13365 55085 61296 168878 182967 203091 84039 94105 261529 329257 265970 98826 129315
13354 129315 176923 -31279 -107236 72858 217986 201773 219695 182947 -8550 -169966
13344 -169966 -237305 -236879 -242187 -35065 131268 89637 122352 322948 390304 166631 269461
13333 269461 295602 102662 105881 -75479 -175977 -18755 99653 -76428 -154295 -172313
13323 -172313 -91173 65304 -837 42422 25894 -94444 -68548 11811 -26101 -208438 -105252
$$ packed form
13398i0220j58561N9105K14843N1255K9810l2134p3027p2879J75621L53994L2691
13387D90498k34090Q9854N3099K3813j52663q8710m5939p3107l3611j6017K84
13376A3411j0728K38468K86152l0923j37584q9819N4185k55785k36922L5866J88764
13365E5085O211J07582J4089K0124j19052J0066J67424O7728o3287j67144L0489
13354A29315M7608k08202p5957J80094J45128j6213J7922l6748j91497j61416
13344a69966o7339M26n308K07122J66333m1631L2715K00596O7356k23673J02830
13333B69461K6141j92940L219j81360j00498J57222J18408j76081p7867j8018
13323a72313Q1140J56477o6141M3259j6528j20338K5896Q0359l7912j82337J03186
$$ plain form
13312 -105252 231924 325225 108277 122048 366249 417488 352601 181808 233285 192850 164785
13301 164785 132304 66998 42390 185399 314382 267683 220983 87027 154766 460773 461070
13290 461070 334649 397615 329287 364940 445104 506902 514723 631956 402309 214948 218453
13279 218453 280519 151901 -2018 168833 3103 36032 537 45325 392696 600912
13269 600912 650977 403140 260940 278369 354088 295217 268705 270866 272569 69978 25569
13258 25569 136526 -73835 18696 89327 146854 305440 393187 297495 169162 159598 254388
13247 254388 86981 141027 251270 415015 423580 331078 401601 231058 -4747 297931
13237 297931 438008 393226 269516 301424 165402 138158 237964 377342 466679 497750 458811
$$ packed form
13312a05252L37176R3301k16948J3771K44201N1239o4887j70793N1477m0435k8065
13301A64785l2481o5306k4608J43009J28983m6699m6700j33956O7739L06007K97
13290D61070j26421O2966o8328L5653Q0164O1798P821J17233k29647j87361L505
13279B18453O2066j28618j53919J70851j65730L2929l5495M4788L47371K08216
13269F00912N0065k47837j42200J7429P5719n8871k6512K161J703k02591m4409
13258B5569J10957k10361R2531P0631N7527J58586Q7747r5692j28333r564R4790
13247B54388j67407N4046J10243J63745Q565r2502P0523j70543k35805L02678
13237B97931J40077m4782j23710L1908j36022k7244R9806J39378Q9337L1071l8939
$$ plain form
13226 458811 302435 173008 195120 334133 272000 337772 244448 -80662 -111041 -40594 -25380
13215 -25380 -62739 -41792 -67623 53443 250554 358047 451839 446909 418647 307829 264913
13204 264913 277051 370417 339436 418003 259091 -75825 20989 157592 293077 375253 395631
13193 395631 326522 230101 191503 168723 138689 50594 -17443 85528 35365 -85464 -11398
13182 -11398 -219369 22762 270394 363622 226258 14463 51758 383652 515463 511786
13172 511786 158967 148894 250155 96740 57515 139947 92380 51428 274028 352899 139999
13161 139999 89876 187929 16447 85353 511983 392811 417080 461877 447619 299611 162998
13150 162998 110260 87037 121939 165171 169838 162786 -4364 -116989 -163478 -198112 -46951
$$ packed form
13226D58811j56376j29427K2112J39013o2133O5772r3324l25110l0379P0447J5214
13215b5380l7359K0947k5831J21066J97111J07493R3792m930k8262j10818m2916
13204B64913J2138R3366l0981P8567j58912l34916R6814J36603J35485Q2176K0378
13193C95631o9109r6421l8598k2780l0034q8095o8037J02971n0163j20829P4066
13182a1398k07971K42131K47632R3228j37364k11795L7295L31894J31811l677
13172E11786l52819j0073J01261j53415l9225Q2432m7567m0952K22600P8871k12900
13161A39999n0123R8053j71482O8906M26630j19172K4269M4797j4258j48008j36613
13150A62998n2738k3223L4902M3232M667p052j67150j12625m6489l4634J51161
$$ plain form
13139 -46951 12210 17298 -1921 108321 170279 472140 373813 257262 338817 229335 305007
13128 305007 289205 192547 256291 280319 344883 519201 519308 454851 374577 216224 244323
13117 244323 325860 373343 420644 176726 22418 5273 385598 561593 584938 397526
13107 397526 583156 581739 448547 371634 263386 49490 15823 271699 339620 464046
13097 464046 320064 244452 305265 192607 49504 190995 421300 504996 321892 129454
13087 129454 269786 273333 377342 517600 363873 228451 241013 274921 391759 292443
13077 292443 353304 573236 784240 893998 832798 576987 376097 484532 400616 269801
13067 269801 107524 113681 283867 490872 225613 197031 386866 313087 258590 440855
$$ packed form
13139d6951N9161N088j9219J10242O1958L01861r8327j16551Q1555j09482P5672
13128C05007j5802r6658O3744K4028O4564J74318J07o4457q0274j58353K8099
13117B44323Q1537M7483M7301k43918j54308j7145L80325J75995K3345j87412
13107C97526J85630j417j33192p6913j08248k13896l3667K55876O7921J24426
13097D64046j43982p5612O0813j12658j43103J41491K30305Q3696j83104j92438
13087A29454J40332L547J04009J40258j53727j35422J2562L3908J16838r9316
13077B92443O0861K19932K11004J09758o1200k55811k00890J08435q3916j30815
13067B69801j62277O157J70186K07005k65259k8582J89835p3779n4497J82265
$$ plain form
13057 440855 416471 538662 496180 343936 441195 625846 509961 340895 275555 443030
13047 443030 372934 276337 479190 676170 710593 612229 740412 676895 539617 343363
13037 343363 431125 586010 549049 388229 191566 193232 216037 177392 441893 575589 614615
13026 614615 456122 243254 226090 173056 122380 3059 249907 500475 364043 237417
13016 237417 346900 394861 464767 504959 379037 275964 339554 567255 510579 479230 461718
13005 461718 318660 387215 568004 672613 355752 397241 392827 562276 887538 1003198
12995 1003198 902964 549853 230201 279578 515468 643284 563905 442109 410977 333461
12985 333461 326448 580284 814329 846994 844237 714498 632551 800062 885240 875021 710898
$$ packed form
13057D40855k4384J22191m2482j52244R7259J84651j15885j69066o5340J67475
13047D43030p0096r6597K02853J96980L4423r8364J28183o3517j37278j96254
13037C43363Q7762J54885l6961j60820j96663J666K2805l8645K64501J33696L9026
13026F14615j58493k12868j7164n3034n0676j19321K46848K50568j36432j26626
13016B37417J09483M7961O9906M0192j25922j03073O3590K27701n6676l1349j7512
13005D61718j43058O8555J80789J04609l16861M1489m414J69449L25262J15660
12995A003198j00234l53111l19652M9377K35890J27816p9379j21796l1132p7516
12985C33461p013K53836K34045L2665k757j29739q1947J67511Q5178j0219j64123
$$ plain form
12974 710898 605197 463668 563833 599839 516584 461603 303092 370816 495993 607733
12964 607733 596050 412932 482110 526172 636468 661404 615815 505437 558972 603472 504528
12953 504528 572570 681503 760468 629249 320372 480883 685957 696410 531763 842908
12943 842908 915550 801237 551511 522120 617601 639705 666890 776011 630325 640375 553615
12932 553615 625774 729063 610919 482788 490413 563799 564469 698668 792906 1047060 929580
12921 929580 617289 641778 620709 574184 652764 795270 794419 969661 1064025 1030152 923536
12910 923536 787172 708870 589372 755471 807853 807725 892765 971552 891496 711831 537754
12899 537754 469878 514015 543488 585276 680802 554934 454053 269529 350455 534779 535382
$$ packed form
12974G10898j05701j41529J00165L6006q3255n4981j58511O7724J25177J11740
12964F07733j1683j83118O9178M4062J10296K4936m5589j10378N3535M4500r8944
12953E04528O8042J08933P8965j31219l08877J60511K05074J0453j64647L11145
12943H42908P2642j14313k49726k9391R5481K2104K7185J09121j45686J0050q6760
12932E53615P2159J03289j18144j28131P625P3386O70J34199R4238K54154j17480
12921I29580l12291K4489k1069m6525P8580J42506q51J75242R4364l3873j06616
12910I23536j36364p8302j19498J66099N2382j28Q5040P8787q0056j79665j74077
12899E37754o7876M4137K9473M1788R5526j25868j00881j84524Q0926J84324O03
$$ plain form
12888 535382 570310 737362 711110 601651 675975 628460 789736 746562 409060 429061 416088
12877 416088 414147 488203 688279 835336 872536 743711 624708 563972 689804 794704
12867 794704 773070 802995 861763 767705 756316 895947 938681 924699 759906 669766 739073
12856 739073 915813 911973 663743 590393 622697 773728 906032 895336 817361 780968 589856
12845 589856 523629 426750 713244 780371 612446 456701 512873 755662 952282 956732 816164
12834 816164 842650 633929 344939 451481 469300 560323 669383 747606 870361 609496
12824 609496 276013 373271 680681 803002 784244 861941 876873 705405 681424 829981
12814 829981 775239 1020998 1001087 722592 613499 489064 533845 636713 795076 889214
$$ packed form
12888E35382L4928J67052k6252j09459P4324m7515J61276m3174l37502K0001j2973
12877D16088j941P4056K00076J47057L7200j28825j19003o0736J25832J04900
12867G94704k1634K9925N8768r4058j1389J39631M2734j3982j64793r0140O9307
12856G39073J76740l840k48230p3350L2304J51031J32304j0696p7975l6393j91112
12845E89856o6227r6879K86494O7127j67925j55745N6172K42789J96620M450j40568
12834H16164K6486k08721k88990J06542J7819R1023J09060P8223J22755k60865
12824F09496l33483R7258L07410J22321j8758P7697J4932j71468k3981J48557
12814H29981n4742K45759j9911k78495j09093j24435M4781J02868J58363R4138
$$ plain form
12804 889214 810908 602772 562000 574837 581243 718880 590875 740366 821123 632067 515214
12793 515214 375004 441872 496750 532694 586144 492489 460027 593628 741164 920602 1108778
12782 1108778 1078531 996049 810557 725188 626499 716927 635503 436115 481473 684549 807558
12771 807558 702781 681899 755995 921081 950890 1002563 1075440 990513 1029406 1250850 1332724
12760 1332724 1211136 1058882 1027080 1065022 1030737 1176006 1296357 1226149 1267112 1410140
12750 1410140 1381006 1223909 1320851 1466158 1454526 1431891 1471998 1600550 1825591 1808465
12740 1808465 1686499 2060615 2447901 2803401 2917493 2844885 2714628 2559880 2368979 2188266
12730 2188266 2100256 2230819 2339992 2513081 2413008 2279107 2139694 2104450 2250776 2329315
$$ packed form
12804H89214p8306k08136m0772J2837O406J37637j28005J49491Q0757j89056j16853
12793E15214j40210O6868N4878L5944N3450r3655l2462J33601J47536J79438J88176
12782A108778l0247q2482j85492q5369r8689R0428q1424j99388M5358K03076J23009
12771H07558j04777k0882P4096J65086K9809N1673P2877q4927L8893K21444Q1874
12760A332724j21588j52254l1802L7942l4285J45269J20351p0208M0963J43028
12750A410140k9134j57097R6942J45307j1632k2635M0107J28552K25041j7126
12740A808465j21966L74116L87286L55500J14092p2608j30257j54748j90901j80713
12730B188266q8010J30563J09173J73089j00073j33901j39413l5244J46326P8539
$$ plain form
12720 2329315 2256168 2353707 2204386 2138348 2394742 2423712 2529017 2671380 2720640 2642786
12710 2642786 2552198 2657072 2954352 3160250 3231340 3394627 3084729 3029454 3056186 3029324
12700 3029324 3057755 3140927 3042339 2935692 2935936 3084530 3232093 3276754 3169303 3061002 2880333
12689 2880333 2915572 2903969 2924254 2879123 2787708 2721756 2833165 3039724 2890066 2777576
12679 2777576 2680279 2606857 2554805 2625641 2558078 2494155 2673507 2752675 2775844 2631915 2600092
12668 2600092 2556678 2580917 2619907 2582054 2492331 2609762 2377525 1960871 2092766 2227253
12658 2227253 2230598 2121522 2154355 2087426 2102055 2085633 2194422 2224005 2204417 1958641 1781242
12647 1781242 1755753 1652606 1745641 1831164 1880082 1972559 1920522 2041056 1915963 1874585 2070410
$$ packed form
12720B329315p3147R7539j49321o6038K56394K8970J05305J42363M9260p7854
12710B642786r0588J04874K97280K05898P1090J63287l09898n5275K6732k6862
12700C029324K8431Q3172r8588j06647K44J48594J47563M4661j07451j08301j80669
12689B880333L5239j1603K0285m5131r1415o5952J11409K06559j49658j12490
12679B777576r7297p3422n2052P0836o7563o3923J79352P9168K3169j43929l1823
12668B600092m3414K4239L8990l7853q9723J17431k32237m16654J31895J34487
12658B227253L345j09076L2833o6929J4629j6422J08789K9583j9588k45776j77399
12647A781242k5489j03147R3035Q5523M8918R2477n2037J20534j25093m1378J95825
$$ plain form
12636 2070410 1946363 1651377 1409599 1357849 1775670 1883734 2026515 1989002 1670326 1525701
12626 1525701 1399450 1411191 1480949 1487978 1403613 1369585 1452490 1475744 1481781 1463457 1551229
12615 1551229 1629721 1841005 1593972 1371937 1332928 1585304 1444834 1261887 1201793 1285956
12605 1285956 1408038 1518591 1494532 1482904 1388832 1516890 1617576 1579601 1723685 1705953
12595 1705953 1561431 1567787 1657677 1654083 1639861 1661808 1707786 1836964 1954782 1888526 1763061
12584 1763061 1588659 1616932 1551428 1539496 1658151 1566195 1692178 1889017 1618260 1452286
12574 1452286 1634041 1616170 1509370 1387839 1541114 1527748 1554941 1603249 1409633 1311313
12564 1311313 1436778 1514012 1626475 1561016 1607459 1630215 1533766 1557298 1411252 1628849
$$ packed form
12636B070410j24047k94986k41778n1750M17821J08064J42781l7513l18676j44625
12626A525701j26251J1741O9758P029q4365l4028Q2905K3254O037j8324Q7772
12615A551229P8492K11284k47033k22035l9009K52376j40470j82947o0094Q4163
12605A285956J22082J10553k4059j1628r4072J28058J00686l7975J44084j7732
12595A705953j44522O356Q9890l594j4222K1947M5978J29178J17818o6256j25465
12584A763061j74402K8273o5504j1932J18655r1956J25983J96839k70757j65974
12574A452286J81755j7871j06800j21531J53275j3366K7193M8308j93616r8320
12564A311313J25465P7234J12463o5459M6443K2756r6449K3532j46046K17597
$$ plain form
12554 1628849 1717620 1759350 1731452 1697201 1818023 1891634 1732487 1527517 1668540 1812982
12544 1812982 1866778 1806039 1833769 2059721 1914453 1661283 1747968 1895468 1710233 1403550
12534 1403550 1669902 1993853 2038481 1928323 1792242 1719368 1650548 1340011 1477893 1657540
12524 1657540 1532940 1466964 1638382 1764244 1662408 1604552 1545253 1595065 1864834 1980931
12514 1980931 1891015 1801109 1788419 1904093 1963158 1936059 1841307 2027097 2074368 2178518 2341291
12503 2341291 2230566 2082567 2138812 2111929 2177480 2364570 2272638 2040741 2066888 2272053
12493 2272053 2173176 2265841 2609012 2653155 2638354 2633241 2475361 2664184 2788740 2735902 2844719
12482 2844719 2835422 2659103 2785308 2960767 3014004 3072652 3199789 3183998 3021664 2900681
$$ packed form
12554A628849Q8771M1730k7898l4251J20822P3611j59147k04970J41023J44442
12544A812982N3796o0739K7730K25952j45268k53170Q6685J47500j85235l06683
12534A403550K66352L23951M4628j10158j36081p2874o8820l10537J37882J79647
12524A657540j24600o5976J71418J25862j01836n7856n9299M9812K69769J16097
12514A980931q9916q9906j2690J15674N9065k7099r4752J85790M7271J04150J62773
12503B341291j10725j47999N6245k6883O5551J87090r1932k31897K6147K05165
12493B272053r8877R2665L43171M4143j4801n113j57880J88823J24556n2838J08817
12482B844719r297j76319J26205J75459N3237N8648J27137j5791j62334j20983
$$ plain form
12472 2900681 2794934 2700848 2588363 2856441 3064900 3071592 3033211 3069211 3001525 3062514 3174549
12461 3174549 3216373 3347568 3615966 4037034 4087055 3845293 3673088 3673076 3990011 4385657
12451 4385657 4601351 4650224 4913219 5092475 5092482 4984058 4936117 5164205 5311763 5393610 5611183
12440 5611183 5826283 6023157 6049754 6155034 6333163 6361396 6432621 6686309 6803840 6867414
12430 6867414 6955422 6816646 6930414 7132413 7145062 7264314 7415071 7478855 7499394 7724930
12420 7724930 7979471 7880039 7793959 7908622 7895654 8012097 8310161 8223557 8405300 8344555
12410 8344555 8209861 8552540 8850494 8831508 8935961 9136950 9363037 9482193 9471545 9481814
12400 9481814 9479133 9549604 10079397 10457402 10469943 10308082 10239384 10247851 10311667 10466363 10316830
$$ packed form
12472B900681j05747r4086j12485K68078K08459O692l8381L6000o7686O0989J12035
12461C174549M1824J31195K68398M21068N0021k41762j72205j2L16935L95646
12451D385657K15694M8873K62995J79256Pj08424m7941K28088J47558Q1847K17573
12440E611183K15100J96874K6597J05280J78129K8233P1225K53688J17531O3574
12430F867414Q8008j38776J13768K01999J2649J19252J50757O3784K0539K25536
12420G724930K54541r9432q6080J14663j2968J16443K98064q6604J81743o0745
12410H344555j34694L42679K97954j8986J04453K00989K26087J19156j0648J0269
12400I481814k681P0471N29793L78005J2541j61861o8698Q467O3816J54696j49533
$$ plain form
12389 10316830 10557437 10703545 10714558 10949918 11160458 11141198 11099735 11104058 11104209 11287982 11532636
12378 11532636 11532557 11334388 11422616 11619900 11907337 11938375 11858380 11977610 12220475 12263496 12456262
12367 12456262 12699503 12759154 13010102 13390758 13725846 13929378 14187076 14377138 14723845
12358 14723845 15098252 15379961 15824975 16004209 15952443 16257614 16632125 17022293 17528300
12349 17528300 18065769 18406777 18653787 19020312 19573463 20307569 21000430 21659055 22520107
12340 22520107 23193943 24052100 25521687 26776598 27931633 29173471 30778229 32466390
12332 32466390 34180708 35949080 38128718 40568901 43260373 46317737 49842116 53737743
12324 53737743 57974255 62661838 68178885 74318726 81547565 89642496 98717597 109305669
$$ packed form
12389A0316830K40607J46108J1013K35360K10540j9260m1463M323J51J83773K44654
12378A1532636p9j98169Q8228J97284K87437L1038p9995J19230K42865M3021J92766
12367A2456262K43241N9651K50948L80656L35088K03532K57698J90062L46707
12358A4723845L74407K81709M45014J79234n1766L05171L74511L90168N06007
12349A7528300N37469L41008K47010L66525N53151P34106O92861O58625Q61052
12340B2520107O73836Q58157J469587J254911J155035J241838J604758J688161
12332C2466390J714318J768372K179638K440183K691472L057364L524379L895627
12324E3737743M236512M687583N517047O139841P228839Q094931R075101J0588072
$$ plain form
12316 109305669 121218361 134538034 149333299 165766946 183713254 202530426 221607212
12309 221607212 240554158 258384210 274266042 287549518 297206309 303691845 306978040
12302 306978040 306768079 303886038 299180250 293347120 287049049 281220326 276412332 272643457
12294 272643457 270178475 269118333 269661455 271398809 274566487 279133082 285027242 292539016
12286 292539016 301331843 311448368 322223727 333663375 345521755 357445112 369353788
12279 369353788 380925144 391970130 402193171 411785017 420540107 428184394 434839967
12272 434839967 440388477 445130882 448721012 451557447 453125980 453290728 452282670 449507152
12264 449507152 445306622 440021364 433545047 426160014 418035167 409220717 400467061 391779184
$$ packed form
12316A09305669J1912692J3319673J4795265J6433647J7946308J8817172J9076786
12309B21607212J8946946J7830052J5881832J3283476R656791O485536L286195
12302C06978040k09961k882041m705788n833130o298071n828723m807994l768875
12294B72643457k464982j060142N43122J737354L167678M566595N894160P511774
12286B92539016Q792827J0116525J0775359J1439648J1858380J1923357J1908676
12279C69353788J1571356J1044986J0223041R591846Q755090P644287O655573
12272D34839967N548510M742405L590130K836435J568533J64748j008058k775518
12264D49507152m200530n285258o476317p385033q124847q814450q753656q687877
$$ plain form
12256 391779184 383356573 375820354 369318689 363873209 359661791 356348673 354241951 353298346
12248 353298346 353126301 353587565 354865629 356433384 357986194 359222298 359384391 358831846
12240 358831846 356619534 352441839 346164787 337591259 326879571 314179090 299969933
12233 299969933 284585931 268601878 252545184 237013750 222134902 208199048 195364600
12226 195364600 183832774 173264082 163549288 154730710 146874245 139340423 132485170 126712166
12218 126712166 121536474 116274950 111180811 106680978 102595143 98963366 95305403 91688364
12210 91688364 88231539 85171125 82556672 79972723 77642851 75195313 73001088 71120652
12202 71120652 69294796 67446062 65700014 63845033 62259123 60776070 59221995 57892812
$$ packed form
12256C91779184q422611p536219o501665n445480m211418l313118k106722r43605
12248C53298346j72045M61264J278064J567755J552810J236104J62093n52545
12240C58831846k212312m177695o277052q573528j0711688j2700481j4209157
12233B99969933j5384002j5984053j6056694j5531434j4878848j3935854j2834448
12226A95364600j1531826j0568692r714794q818578p856465p533822o855253n773004
12218A26712166n175692n261524n094139m499833m085835l631777l657963l617039
12210I1688364l456825l060414k614453k583949k329872k447538k194225j880436
12202G1120652j825856j848734j746048j854981j585910j483053j554075j329183
$$ plain form
12194 57892812 56817654 55736134 54593730 53090987 51879612 50979091 50239743 49256263
12186 49256263 48160845 46923577 46134028 45629040 44990992 44207795 43552087 42835323 41938988
12177 41938988 41201510 40462125 39698014 38902193 38237644 37634645 37342528 36659400 36095780
12168 36095780 35625045 35056061 34651090 34110391 33740482 33139596 32656912 32243015 31818269
12159 31818269 31272433 30803229 30725117 30615527 30088651 29676688 29415268 29025901 28496994
12150 28496994 28212602 27991807 27558975 27210220 26861162 26920875 26808022 26292255 25853791
12141 25853791 25479607 25414646 25031800 24578849 24410527 24174780 23883877 23669608 23459625
12132 23459625 23446878 23481133 23182241 22787602 22488359 22109662 21766174 21593338 21392076 21362912
$$ packed form
12194E7892812j075158j081520j142404j502743j211375r00521p39348r83480
12186D9256263j095418j237268p89549n04988o38048p83197o55708p16764q96335
12177D1938988p37478p39385p64111p95821o64549o02999k92117o83128n63620
12168C6095780m70735n68984m04971n40699l69909o00886m82684m13897m24746
12159C1818269n45836m69204p8112j09590n26876m11963k61420l89367n28907
12150B8496994k84392k20795m32832l48755l49058N9713j12853n15767m38464
12141B5853791l74184o4961l82846m52951j68322k35747k90903k14269k09983
12132B3459625j2747L4255k98892l94639k99243l78697l43488j72836k01262k9164
$$ plain form
12122 21362912 21138645 20888614 20461078 20376808 20483835 20351267 19943464 19523343 19235823
12113 19235823 19005149 18680574 18623623 18626868 18312565 18074011 17675431 17321069 17118512 16965516
12103 16965516 16749416 16529045 16455900 16547057 16319771 16162325 15964453 15960496 15639635 15280349
12093 15280349 15066940 14899059 14700873 14646858 14526873 14337324 14167456 14191579 14274624 14073576
12083 14073576 13863540 13823237 13761348 13528817 13534564 13551899 13310802 13118752 13068408 13292342
12073 13292342 13365926 13105754 13093549 13154278 13261969 13056525 12958777 13161470 13228083 13041202
12063 13041202 12884571 12876928 12825988 12520681 12572155 12755410 13002158 12867110 12642993 12699595
12053 12699595 12574398 12521821 12882362 12896507 12799274 12839037 12865916 12985378 12906980 12920590
$$ packed form
12122B1362912k24267k50031m27536q4270J07027j32568m07803m20121k87520
12113A9235823k30674l24575n6951L245l14303k38554l98580l54362k02557j52996
12103A6965516k16100k20371p3145R1157k27286j57446j97872l957l20861l59286
12093A5280349k13409j67881j98186n4015j19985j89549j69868K4123Q3045k01048
12083A4073576k10036m0303o1889k32531N747J7335k41097j92050n0344K23934
12073A3292342P3584k60172j2205O0729J07691k05444r7748K02693O6613j86881
12063A3041202j56631p643n0940l05307N1474J83255K46748j35048k24117N6602
12053A2699595j25197n2577L60541J4145r7233L9763K6879J19462p8398J3610
$$ plain form
12043 12920590 13065655 13003809 13045640 13107755 13164250 13240203 13273837 13409119 13517442 13345046
12033 13345046 13260069 13173117 13148134 13221266 13341243 13419665 13579618 13845789 13927348 13766544
12023 13766544 14050291 14276583 14233053 13928059 13895917 13902901 13812464 13788061 14115355 14390868
12013 14390868 14648284 14744122 14740424 14798847 14964329 14926730 15038722 15118650 15298477 15428830
12003 15428830 15559744 15817589 15886558 15868005 15977839 16146375 16261917 16366938 16320050 16122137
11993 16122137 16242983 16647100 16837464 16964991 17064343 17353737 17288989 17229856 17353085 17580222
11983 17580222 17784147 17980794 18160693 18352858 18497227 18655439 18848157 18805852 18543484
11974 18543484 18827448 19097947 19144061 19268998 19461262 19811852 20111622 20327230 20442510
$$ packed form
12043A2920590J45065o1846M1831O2115N6495P5953L3634J35282J08323j72396
12033A3345046q4977q6952k4983P3132J19977P8422J59953K66171Q1559j60804
12023A3766544K83747K26292m3530l04994l2142O984r0437k4403L27294K75513
12013A4390868K57416R5838l698N8423J65482l7599J11992P9928J79827J30353
12003A5428830J30914K57845O8969j8553J09834J68536J15542J05021m6888j97913
11993A6122137J20846M04117J90364J27527R9352K89394o4748n9133J23229K27137
11983A7580222K03925J96647J79899J92165J44369J58212J92718m2305k62368
11974A8543484K83964K70499M6114J24937J92264L50590K99770K15608J15280
$$ plain form
11965 20442510 20459381 20496428 20453375 20544300 20692495 20679116 20904766 21149228 21110438 21180609
11955 21180609 21502263 21771354 21719148 21918671 22057863 22108391 22071437 22117772 22226801 22239306
11945 22239306 22470411 22747353 23036224 23255728 23474767 23557723 23601263 23720693 23817262 24041631
11935 24041631 24295702 24124699 23938562 24201280 24498848 24724070 24845630 24854353 24943295 24993076
11925 24993076 24943875 24876380 24876925 25198506 25276111 25320281 25193339 25062322 25376467 25262449
11915 25262449 25049942 25055466 25169086 25252200 25012362 25025702 25302250 25172116 25166108 25223743
11905 25223743 25183012 24757493 24655195 24632696 24831589 24862619 24581396 24518780 24451043 24404636
11895 24404636 24134379 23991401 23983874 24051789 23870383 23806525 23731645 23518966 23213374 22921411
$$ packed form
11965B0442510J6871L7047m3053R0925J48195j3379K25650K44462l8790P0171
11955B1180609L21654K69091n2206J99523J39192N0528l6954M6335J09029J2505
11945B2239306K31105K76942K88871K19504K19039Q2956M3540J19430R6569K24369
11935B4041631K54071j71003j86137K62718K97568K25222J21560Q723Q8942M9781
11925B4993076m9201o7495N45L21581P7605M4170j26942j31017L14145j14018
11915B5262449k12507N524J13620Q3114k39838J3340K76548j30134o008N7635
11905B5223743m0731m25519j02298k2499J98893L1030k81223o2616o7737m6407
11895B4404636k70257j42978p527O7915j81406o3858p4880k12679l05592k91963
$$ plain form
11885 22921411 22948536 22681629 22613165 22654880 22367930 22290749 22230901 22125063 22222593 22331603
11875 22331603 22149578 22049498 22119497 21958181 21755314 21781589 21950191 21880802 21703471 21449887
11865 21449887 21312497 21223998 21071249 20662962 20474535 20262757 20062258 20000128 20017939 20113614
11855 20113614 19659895 19481561 19411724 19331507 19024540 18707872 18641452 18592271 18764266 18737351
11845 18737351 18412875 18170507 18237015 18140072 17834937 17679711 17694229 17681043 17535488 17433446
11835 17433446 17310114 17161016 17007339 16855635 16640224 16408865 16305479 16356298 16166413
11826 16166413 16065105 16021649 15686438 15393224 15243225 15201479 15208238 14975226 14849199 14830949
11816 14830949 14837940 14337044 13925876 13816021 13604563 13426990 13328983 13232020 13189392 13143183
$$ packed form
11885B2921411K7125k66907o8464M1715k86950p7181n9848j05838R7530J09010
11875B2331603j82025j00080O9999j61316k02867K6275J68602o9389j77331k53584
11865B1449887j37390q8499j52749m08287j88427k11778k00499o2130J7811R5675
11855B0113614m53719j78334o9837q0217l06967l16668o6420m9181J71995k6915
11845A8737351l24476k42368O6508r6943l05135j55226J4518j3186j45555j02042
11835A7433446j23332j49098j53677j51704k15411k31359j03386N0819j89885
11826A6166413j01308m3456l35211k93214j49999m1746O759k33012j26027j8250
11816A4830949O991n00896m11168j09855k11458j77573r8007r6963m2628m6209
$$ plain form
11806 13143183 13170383 12986203 12885541 12902101 12638323 12456989 12550124 12317243 11979520 11675998
11796 11675998 11466265 11373020 11305389 11203542 10929393 10691644 10707086 10676183 10625274 10584163
11786 10584163 10570396 10251322 9952653 9548529 9429940 9354113 9403601 9226731 9126630 9424325
11776 9424325 9168566 8920969 8669260 8724919 8783335 8539557 8282879 8101804 7974293 7693410
11766 7693410 7618227 7889638 7968970 7916446 7892892 7692795 7506325 7447835 7446030 7413020 7138156
11755 7138156 6935060 7041707 7102991 7001140 7090595 7002216 6759451 6587567 6500564 6680924
11745 6680924 6879130 6727035 6578435 6644100 6553775 6212032 6155210 6355884 6316332 6075585
11735 6075585 6100954 6279608 6277815 6136999 6082763 6065452 6187071 6169006 5947844 5856595 5671524
$$ packed form
11806A3143183K7200j84180j00662J6560k63778j81334R3135k32881l37723l03522
11796A1675998k09733r3245o7631j01847k74149k37749J5442l0903n0909m1111
11786A0584163j3767l19074k98669m04124j18589p5827M9488j76870j00101K97695
11776I424325k55759k47597k51709N5659N8416k43778k56678j81075j27511k80883
11766G693410p5183K71411P9332n2524k3554k00097j86470n8490j805l3010k74864
11755G138156k03096J06647O1284j01851Q9455q8379k42765j71884q7003J80360
11745F680924J98206j52095j48600O5665r0325l41743n6822K00674l9552k40747
11735F075585K5369J78654j793j40816n4236j7311J21619j8065k21162r1249j85071
$$ plain form
11724 5671524 5678076 5669028 5597273 5368664 5255096 5402514 5293822 5155141 4904014 4762952
11714 4762952 4765310 4842403 4916802 4866961 4837491 4721426 4697528 4591389 4407026 4286379 4125582
11703 4125582 4006687 4105779 4227553 4323530 4472113 4434452 4504492 4519161 4585270 4725258
11693 4725258 4797050 4596363 4271073 4001724 4011290 4162252 4173986 4146243 4293928 4177883
11683 4177883 4035375 4130984 4252779 4214365 3987315 3682457 3704315 3882610 3947309 4014613
11673 4014613 4003760 3972358 3973230 4026609 4034481 3978992 3931594 3864632 3724778 3588953 3649049
11662 3649049 3682576 3604965 3340376 3256536 3054532 2959900 2894492 3194423 3429231 3253115
11652 3253115 2880934 3062372 3177656 3205268 3262878 3301703 3323670 3383525 3346105 3263526 3402037
$$ packed form
11724E671524O552r048p1755k28609j13568J47418j08692j38681k51127j41062
11714D762952K358P7093P4399m9841k9470j16065k3898j06139j84363j20647j60797
11703D125582j18895R9092J21774R5977J48583l7661P0040J4669O6109J39988
11693D725258P1792k00687l25290k69349R566J50962J1734k7743J47685j16045
11683D177883j42508R5609J21795l8414k27050l04858K1858J78295O4699O7304
11673D014613j0853l1402Q72N3379P872n5489m7398o6962j39854j35825O0096
11662C649049L3527p7611k64589q3840k02004r4632o5408K99931K34808j76116
11652C253115l72181J81438J15284K7612N7610L8825K1967N9855l7420q2579J38511
$$ plain form
11641 3402037 3340460 3270309 3272317 3403252 3209302 3284968 3469236 3537863 3391247 3160987
11631 3160987 2790165 2558018 2507762 2426133 2515388 2867316 2783690 2611783 2582450 2679587
11621 2679587 2683779 2548930 2799192 3042617 2956115 2726901 2708109 2585966 2496275 2407422
11611 2407422 2302409 2400429 2285083 2070087 2165992 2118851 2352625 2362477 2525029 2481250
11601 2481250 2260762 2172718 2255862 2285967 2365092 2287982 2012457 2181620 2290906 2186987
11591 2186987 2218025 2510180 2427910 2253798 2159431 2007809 2012353 2203591 2388435 2398508
11581 2398508 2377507 2214491 2033297 1801148 1765295 2002636 1980365 2020418 2123398 2071575
11571 2071575 1791308 1853143 1703747 1866020 1998481 2035878 2097245 1989602 2069721 2137696
$$ packed form
11641C402037o1577p0151K008J30935j93950P5666J84268O8627j46616k30260
11631C160987l70822k32147n0256q1629Q9255L51928q3626j71907k9333R7137
11621B679587M192j34849K50262K43425q6502k29214j8792j22143q9691q8853
11611B407422j05013R8020j15346k14996R5905m7141K33774R852J62552m3779
11601B481250k20488q8044Q3144L0105P9125p7110k75525J69163J09286j03919
11591B186987L1038K92155q2270j74112r4367j51622M544J91238J84844J0073
11581B398508k1001j63016j81194k32149l5853K37341k2271M0053J02980n1823
11571B071575k80267O1835j49396J62273J32461L7397O1367j07643Q0119O7975
$$ plain form
11561 2137696 1992051 2024082 1998231 1865305 1846031 1886358 1694090 1611501 1614770 1671241 1792402
11550 1792402 1684682 1591141 1635749 1524138 1372272 1619507 1831687 1607041 1611581 1620649
11540 1620649 1805649 1986520 1809139 1560354 1401830 1388704 1466866 1380203 1214236 1140552
11530 1140552 1225113 1370098 1386810 1346125 1263433 1320537 1516180 1793518 1801854 1490095 1424976
11519 1424976 1717184 1734305 1537722 1403088 1318591 1303065 1428593 1543124 1495730 1373454
11509 1373454 1328269 1350571 1188207 1198589 1387040 1540661 1612704 1654641 1558831 1118391
11499 1118391 1034244 1105137 1169948 1112344 1198876 1263307 1257321 1182225 1184781 1238514 1419976
11488 1419976 1532045 1524261 1328097 1162436 1028683 885039 1081366 1128223 1052822 1167903
$$ packed form
11561B137696j45645L2031k5851j32926j9274M0327j92268q2589L269N6471J21161
11550A792402j07720r3541M4608j11611j51866K47235K12180k24646M540R068
11540A620649J85000J80871j77381k48785j58524j3126P8162q6663j65967p3684
11530A140552Q4561J44985J6712m0685q2692N7104J95643K77338Q336l11759o5119
11519A424976K92208J7121j96583j34634q4497j5526J25528J14531m7394j22276
11509A373454m5185K2302j62364J0382J88451J53621P2043M1937r5810m40440
11499A118391q4147P0893O4811n7604Q6532O4431n986p5096K556N3733J81462
11488A419976J12069p784j96164j65661j33753j43644J96327M6857p5401J15081
$$ plain form
11478 1167903 1133327 1171925 1172332 961880 709994 852470 1300161 1731656 1731504 1574692 1340917
11467 1340917 1382938 1323445 1305212 1240176 1312112 1382787 1269879 1368509 1243776 1176990 1230482
11456 1230482 1220907 1218610 1147436 958142 869162 1029977 1269604 1240359 1088031 1087099 1054591
11445 1054591 1163574 1151419 963655 986352 1189068 1218634 958578 760607 840962 813838
11435 813838 790702 801577 888139 899140 913393 1025295 1278124 1330579 1390158 1287670 1020208
11424 1020208 963372 1131135 1217410 1103902 1227443 1332998 1280343 1088445 1054988 859877
11414 859877 1038248 1123694 1205891 1201548 1272189 1248005 1245008 1144600 989242 925127 852712
11403 852712 941625 1018819 1023418 891896 771047 703560 732360 659438 844918 930743 953107
$$ packed form
11478A167903l4576L8598M07k10452k51886J42476M47691M31495j52j56812k33775
11467A340917M2021n9493j8233o5036P1936P0675j12908R8630j24733o6786N3492
11456A230482r575k297p1174j89294q8980J60815K39627k9245j52328r32l2508
11445A054591J08983j2155j87764K2697K02716K9566k60056j97971Q0355k7124
11435H13838k3136J0875Q6562J1001J4253J11902K52829N2455N9579j02488k67462
11424A020208n6836J67763Q6275j13508J23541J05555n2655j91898l3457j95111
11414H59877J78371Q5446Q2197m343P0641k4184k997j00408j55358o4115p2415
11403H52712Q8913P7194M599j31522j20849o7487K8800p2922J85480Q5825K2364
$$ plain form
11392 953107 893228 967376 931645 1108020 1069133 940069 948089 1046369 992682 1116406 1278233
11381 1278233 1232326 1098952 1142484 1360695 1209520 1033724 809047 892484 1096500 1159732
11371 1159732 1243483 1151823 1142307 1139754 1231692 1333804 1378653 1253093 1125026 1206271 1067749
11360 1067749 905005 865892 839462 637187 605318 937582 1101053 1048332 978290 1072705
11350 1072705 999793 1015351 945934 995568 1090290 1187183 1006028 884349 763656 771652 1011475
11339 1011475 1162014 1389036 1459225 1449743 1371527 1294197 1035553 971851 831522 952958
11329 952958 892896 854518 811110 710167 461151 384047 544799 672641 830312 1077686
11319 1077686 964096 877489 742744 561777 662981 806402 688270 679751 570691 612392
$$ packed form
11392I53107n9879P4148l5731J76375l8887j29064Q020R8280n3687J23724J61827
11381A278233m5907j33374M3532K18211j51175j75796k24677Q3437K04016O3232
11371A159732Q3751r1660r516k553R1938J02112M4849j25560j28067Q1245j38522
11360A067749j62744l9113k6430k02275l1869L32264J63471n2721p0042R4415
11350A072705p2912J5558o9417M9634R4722R6893j81155j21679j20693P996K39823
11339A011475J50539K27022P0189r482p8216p7330k58644o3702j40329J21436
11329I52958o0062l8378m3408j00943k49016p7104J60752J27842J57671K47374
11319A077686j13590q6607j34745j80967J01204J43421j18132q519j09060M1701
$$ plain form
11309 612392 683520 776033 685956 604333 663883 683330 731928 566455 567000 940595 996552
11298 996552 938970 857463 560398 510814 393599 364423 428548 559615 712108 769075 573344
11287 573344 649779 782768 667884 690374 950968 1235964 1108322 909900 804621 922827
11277 922827 1120774 1108686 821873 666715 399584 422645 566447 470066 400326 451461
11267 451461 344754 405372 733892 921588 763352 538933 307563 83664 381456 540835
11257 540835 624862 707044 695893 766547 772254 958457 935965 662655 598820 480771 544376
11246 544376 635851 596737 619226 801210 701713 447161 209075 237235 267777 367125 387380
11235 387380 503917 436286 319460 366666 326926 180393 242767 393712 513856 484872
$$ packed form
11309F12392P1128R2513r0077q1623N9550J9447M8598j65473N45L73595N5957
11298I96552n7582q1507k97065m9584j17215k9176O4125J31067J52493N6967j95731
11287E73344P6435J32989j14884K2490K60594K84996j27642j98422j05279J18206
11277I22827J97947j2088k86813j55158k67131K3061J43802r6381o9740N1135
11267D51461j06707O0618L28520J87696j58236k24419k31370k23899K97792J59379
11257E40835Q4027Q2182j1151P0654N707J86203k2492k73310o3835j18049O3605
11246E44376R1475l9114K2489J81984r9497k54552k38086K8160L0542R9348K0255
11235C87380J16537o7631j16826M7206l9740j46533O2374J50945J20144k8984
$$ plain form
11225 484872 434527 451893 737262 865025 944508 877337 753604 647971 630201 731036
11215 731036 777035 603669 609324 711895 693075 485581 346356 292089 495107 504581 354562
11204 354562 298503 307776 483680 537389 475040 386477 439192 490151 466494 526925 471172
11193 471172 521194 537419 552587 599801 552881 565525 597364 513975 486518 528641 653285
11182 653285 662715 641463 662719 845235 695910 556545 500911 483315 402299 551622 412173
11171 412173 364192 546901 427597 356944 250688 215622 293004 211204 505306 519526 427063
11160 427063 436121 311816 485313 572009 556437 600682 633783 807751 693796 563658 596691
11149 596691 338038 249759 25718 127615 333609 592062 611489 524176 389602 424524
$$ packed form
11225D84872n0345J7366K85369J27763P9483o7171j23733j05633j7770J00835
11215G31036M5999j73366N655J02571j8820k07494j39225n4267K03018R474j50019
11204C54562n6059R273J75904N3709o2349q8563N2715N0959k3657O0431n5753
11193D71172N0022J6225J5168M7214m6920J2644L1839q3389k7457M2123J24644
11182F53285R430k1252K1256J82516j49325j39365n5634j7596q1016J49323j39449
11171D12173m7981J82709j19304p0653j06256l5066P7382q1800K94102J4220r2463
11160D27063R058j24305J73497Q6696j5572M4245L3101J73968j13955j30138L3033
11149E96691k58653q8279k24041J01897K05994K58453J9427q7313j34574L4922
$$ plain form
11139 424524 535836 743564 682603 608952 612323 513573 498510 540120 591325 591580 524319 489710
11127 489710 364708 369005 380949 456365 367464 483143 733191 712726 622835 586140 658812
11116 658812 718069 467309 440379 526032 694870 839738 792940 729621 512631 562206 643973
11105 643973 705543 737723 552875 383991 309990 359214 317427 295013 332445 461473 533974
11094 533974 628516 787396 863005 892368 708302 598921 388763 258182 491178 407416
11084 407416 212806 100463 320857 358694 356195 616301 482753 245549 314716 464201
11074 464201 452713 452367 406054 346254 127744 234394 414160 351823 466577 597881 491180
11063 491180 632804 869971 860252 597718 359018 441321 616731 578072 501553 398214
$$ packed form
11139D24524J11312K07728o0961p3651L371r8750j5063M1610N1205K55o7261l4609
11127D89710j25002M297J1944P5416q8901J15679K50048k0465q9891l6695P2672
11116F58812N9257k50760k6930Q5653J68838J44868m6798o3319k16990M9575Q1767
11105F43973O1570L2180j84848j68884p4001M9224m1787k2414L7432J29028P2501
11094E33974R4542J58880P5609K9363j84066j09381k10158j30581K32996q3762
11084D07416j94610j12343K20394L7837k499K60106j33548k37204O9167J49485
11074D64201j1488l46m6313n9800k18510J06650J79766o2337J14754J31304j06701
11063D91180J41624K37167r719k62534k38700Q2303J75410l8659p6519j03339
$$ plain form
11053 398214 357501 419773 687795 778636 666441 575719 510732 436674 705792 704608 782037
11042 782037 1024052 1111027 1076214 954860 1112576 1103286 1008751 1010765 1252194 1270713 1362766
11031 1362766 1324642 1244072 1392610 1802643 2047626 1946021 1907834 1834135 1897110 2118962
11021 2118962 1996975 1864528 1788859 2165760 2112728 1946850 2104057 2358072 2573845 2537610
11011 2537610 2602768 2421851 2261828 2001437 1804683 1870001 1861001 1690374 1799489 2196283
11001 2196283 2435515 2110141 1997596 1855591 1648814 1704163 1643727 1407374 1314375 1411831
10991 1411831 1715909 1591181 1456568 1258381 1073996 1040093 1248659 1188726 987136 1027525
10981 1027525 880623 625790 712483 811518 871678 857434 880981 1025808 939751 929322 737671
$$ packed form
11053C98214m0713O2272K68022R0841j12195r0722o4987p4058K69118j184P7429
11042G82037K42015Q6975l4813j21354J57716r290r4535K014K41429J8519R2053
11031A362766l8124q0570J48538M10033K44983j01605l8187p3699O2975K21852
11021B118962j21987j32447p5669L76901n3032j65878J57207K54015K15773l6235
11011B537610O5158j80917j60023k60391j96754O5318r000j70627J09115L96794
11001B196283K39232l25374j12545j42005k06777N5349o0436k36353r2999R7456
10991A411831L04078j24728j34613j98187j84385l3903K08566n9933k01590M0389
10981A027525j46902k54833Q6693R9035O0160j4244K3547J44827q6057j0429j91651
$$ plain form
10970 737671 778820 861304 756696 591230 720163 799694 530841 309825 486193 645474
10960 645474 469139 432081 651329 860179 606065 473388 523993 535884 369892 248742
10950 248742 95226 225498 305472 267608 421883 608851 734230 816813 785794 607517
10940 607517 323067 6028 142720 444113 566364 441469 279686 246702 201777 355603
10930 355603 633266 663422 501453 329111 259150 453856 631694 826043 963011 811286
10920 811286 462071 140786 160416 311166 448468 461533 437300 514438 380257 351973
10910 351973 588576 660040 514981 408293 304817 396434 477049 762717 879785 724864
10900 724864 728987 695926 687810 499918 420033 558709 529489 357290 233530 91735 -106074
$$ packed form
10970G37671M1149Q2484j04608j65466J28933P9531k68853k21016J76368J59281
10960F45474j76335l7058K19248K08850k54114j32677N0605J1891j65992j21150
10950B48742j53516J30272P9974l7864J54275J86968J25379Q2583l1019j78277
10940F07517k84450l17039J36692L01393J22251j24895j61783l2984m4925J53826
10930C55603K77663L0156j61969j72342o9961J94706J77838J94349J36968j51725
10920H11286l49215l21285J9630J50750J37302J3065k4233P7138j34181k8284
10910C51973K36603P1464j45059j06688j03476R1617Q0615K85668J17068j54921
10900G24864M123l3061q116j87892p9885J38676k9220j72199j23760j41795j97809
$$ plain form
10889 -106074 51519 79679 206827 338320 517113 576112 386983 379028 518705 584229
10879 584229 780184 719572 472225 180133 182318 385929 188657 148571 234989 421004
10869 421004 752822 719786 702175 563372 431758 633907 723874 580183 560961 524556
10859 524556 367187 314075 460954 387461 347748 361185 378530 453417 581812 837837 810592
10848 810592 698546 654729 573395 546031 579938 605621 274782 -22208 144990 368629
10838 368629 400684 199061 290405 186616 243739 386047 371336 318114 157166 251939 347022
10827 347022 284937 293801 352261 567294 573661 665530 590048 292002 86820 83391 245946
10816 245946 446208 527491 352821 336907 532923 517301 391009 465566 546512 368004
$$ packed form
10889a06074J57593K8160J27148J31493J78793N8999j89129p955J39677O5524
10879E84229J95955o0612k47347k92092K185K03611j97272m0086Q6418J86015
10869D21004L31818l3036j7611j38803j31614K02149Q9967j43691j9222l6405
10859E24556j57369n3112J46879p3493l9713J3437J7345P4887J28395K56025k7245
10848H10592j12046m3817q1334k7364L3907K5683l30839k96990J67198K23639
10838C68629L2055k01623R1344j03789N7123J42308j4711n3222j60948R4773R5083
10827C47022o2085Q864N8460K15033O367R1869p5482k98046k05182l429J62555
10816B45946K00262Q1283j74670j5914J96016j5622j26292P4557Q0946j78508
$$ plain form
10806 368004 174258 287445 309547 392770 343707 342305 419073 398667 485361 608322 937942
10795 937942 1010005 679361 370537 207707 134529 117639 176138 239209 168430 218111 75949
10784 75949 221631 377189 611076 554247 51025 45475 309980 490445 697896 719718
10774 719718 589506 617774 770916 951755 746649 716008 703859 652633 508232 322578
10764 322578 304079 289411 627062 932117 947297 715777 636288 683128 696475 806532 1144550
10753 1144550 1267246 993664 971720 1094680 1120661 1178488 1218790 1074908 1256520 1348263
10743 1348263 1250215 1512824 1464915 1598620 1447440 1363708 1627612 1655793 1602230 1711284
10733 1711284 1787135 1931090 2163152 2223701 2313106 2245974 2233871 2362007 2193778 2114444
$$ packed form
10806C68004j93746J13187K2102Q3223m9063j402P6768k0406Q6694J22961L29620
10795I37942P2063l30644l08824j62830p3178j6890N8499O3071p0779M9681j42162
10784G5949J45682J55558K33887n6829n03222n550K64505J80465K07451K1822
10774G19718j30212K8268J53142J80839k05106l0641j2149n1226j44401j85654
10764C22578j8499j4668L37651L05055J5180k31520p9489M6840J3347J10057L38018
10753A144550J22696k73582k1944J22960K5981N7827M0302j43882J81612R1743
10743A348263r8048K62609m7909J33705j51180q3732K63904K8181n3563J09054
10733A711284P5851J43955K32062O0549Q9405o7132j2103J28136j68229p9334
$$ plain form
10723 2114444 2403837 2627346 2829929 2901027 2855959 2973476 3201690 3496375 3677081 3428337
10713 3428337 2952706 2758174 2807212 2875020 3100672 3248856 3502330 3403633 3523461 3646697
10703 3646697 3839380 3996160 3815474 3628539 3388961 3293551 3512580 3440846 3187100 3017861
10693 3017861 2900508 2911790 2850873 2786677 2828250 2618063 2500965 2375916 2235585 2129467
10683 2129467 2038768 2071631 2080345 2192981 2354626 2205960 1991155 2007021 2025175 2146862
10673 2146862 1946299 1802319 1786474 1978553 2092233 1936091 1949784 1899275 1896161 1939807
10663 1939807 2178868 2042660 1988277 2146796 2351141 2359847 2293033 2311258 2524231 2723232
10653 2723232 2510018 2534501 2721842 3288800 4065331 4648863 4940876 5204422 5486853 5814433
$$ packed form
10723B114444K89393K23509K02583P1098m5068J17517K28214K94685J80706k48744
10713C428337m75631j94532M9038O7808K25652J48184K53474r8697J19828J23236
10703C646697J92683J56780j80686j86935k39578r5410K19029p1734k53746j69239
10693C017861j17353J1282o0917o4196M1573k10187j17098j25049j40331j06118
10683B129467r0699L2863Q714J12636J61645j48666k14805J5866J8154J21687
10673B146862k00563j43980j5845J92079J13680j56142J3693n0509l114M3646
10663A939807K39061j36208n4383J58519K04345Q706o6814J8225K12973J99001
10653B723232k13214K4483J87341N66958P76531N83532K92013K63546K82431L27580
$$ plain form
10643 5814433 6240084 6117269 5543357 5353211 5172902 5104169 5012404 4852850 4927031 4926609
10633 4926609 4885499 5150912 5837623 6391995 7101235 8157338 9256733 10323707 11212451
10624 11212451 11978480 12953619 14019545 15212422 16250965 17339283 18762773 20848133
10616 20848133 24286324 29109597 35541897 43951577 54717139 67492875 80551457 92243792
10608 92243792 102404227 111947957 120760411 128323498 132816297 135004740 138276860 146261114
10600 146261114 161204321 181263730 202499762 220838913 236071053 250261349 263322862
10593 263322862 271237468 270176702 261598782 253950222 255422456 269237351 291769604 315023641
10585 315023641 333541785 347771116 359812812 368461852 367818067 351945394 323760826
$$ packed form
10643E814433M25651j22815n73912j90146j80309o8733r1765j59554P4181m22
10633D926609m1110K65413O86711N54372P09240J056103J099395J066974Q88744
10624A1212451P66029R75139J065926J192877J038543J088318J423490K085360
10616B0848133L438191M823273O432300Q409680J0765562J2775736J3058582J1692335
10608I2243792J0160435R543730Q812454P563087M492799K188443L272120P984254
10600A46261114J4943207K0059409K1236032J8339151J5232140J4190296J3061513
10593B63322862P914606j060766q577920p648560J472234J3814895K2532253K3254037
10585C15023641J8518144J4229331J2041696Q649040o43785j5872673k8184568
$$ plain form
10578 323760826 295487006 277406417 272062296 275087169 280587092 284427261 286321897 287189233
10570 287189233 285527144 276991889 258224956 232223381 206983028 188832273 178202839
10563 178202839 172793787 169861060 167070171 163653179 159482379 153675020 144538011 131573016
10555 131573016 115978914 100699944 88146689 78353170 70778949 65172984 61112008
10548 61112008 57344771 53899286 50873161 48518336 46359713 44348692 42832518 41157425
10540 41157425 39614491 38293495 37133293 36009643 34971656 33952743 32926771 31862624
10532 31862624 30902935 30141743 29223836 28481149 27634635 26940537 26104846 25462675 24829415
10523 24829415 24244768 23797557 23196725 22499738 21839099 21360695 21014907 20551659 20121324
$$ packed form
10578C23760826k8273820j8080589n344121L024873N499923L840169J894636Q67336
10570B87189233j662089q535255j8766933k6001575k5240353j8150755j0629434
10563A78202839n409052k932727k790889l416992m170800n807359r137009j2964995
10555A31573016j5594102j5278970j2553255r793519p574221n605965m060976
10548F1112008l767237l445485l026125k354825k158623k011021j516174j675093
10540D1157425j542934j320996j160202j123650j037987j018913j025972j064147
10532C1862624r59689p61192r17907p42687q46514o94098q35691o42171o33260
10523B4829415n84647m47211o00832o96987o60639m78404l45788m63248m30335
$$ plain form
10514 20121324 19722541 19296174 18545337 17931426 17484513 17225532 17108636 16584718 15981882
10505 15981882 15697695 15438130 15084822 14782509 14432449 14208350 13929119 13597350 13202537
10496 13202537 13019721 12678010 12246141 12273865 12201546 11990936 11652502 11393534 11478628 11397839
10486 11397839 11177524 10901128 10836838 10762233 10719972 10421997 10140558 10121152 10208877 10157495
10476 10157495 9835223 9771328 9635092 9681303 9837366 9808562 9673276 9502093 9496214 9668327
10466 9668327 9593811 9442288 9467405 9426518 9294976 9396265 9673058 9699524 9591490 9281771
10456 9281771 9184430 8941962 8590876 8431178 8558336 8533626 8162576 7874098 7814246 7825303
10446 7825303 7797752 7663333 7353749 7154106 6995304 6835766 6641534 6703431 6610822 6470177
$$ packed form
10514B0121324l98783m26367p50837o13911m46913k58981j16896n23918o02836
10505A5981882k84187k59565l53308l02313l50060k24099k79231l31769l94813
10496A3202537j82816l41711m31869K7724p2319k10610l38434k58968Q5094q0789
10486A1397839k20315k76396o4290p4605m2261k97975k81439j9406Q7725n1382
10476A0157495l22272o3895j36236M6211J56063k8804j35286j71183n879J72113
10466I668327p4516j51523K5117m0887j31542J01289K76793K6466j08034l09719
10456I281771r7341k42468l51086j59698J27158k4710l71050k88478n9852J1057
10446G825303k7551j34419l09584j99643j58802j59538j94232O1897r2609j40645
$$ plain form
10436 6470177 6245181 6123005 5811035 5506583 5254116 4963582 4832831 4760742 4641623 4600191
10426 4600191 4522025 4490776 4267280 4141234 4003918 4005214 4204700 4177198 3827587 3676877
10416 3676877 3839164 3870539 3624450 3514699 3454353 3203696 3107548 3051427 3082355 2851733
10406 2851733 2723910 2605368 2691200 2825093 2788907 2461794 2238494 2348227 2245617 2202071
10396 2202071 2326728 2453019 2427424 2335798 2499505 2795110 2806253 2744783 2669388 2634018
10386 2634018 2435095 2333789 2543918 2583345 2382524 2358970 2357375 2366543 2466461 2373265 2529362
10375 2529362 2536341 2409062 2316563 2311010 2154632 2062590 2040948 2017579 2133857 2366658 2192788
10364 2192788 2053554 1951775 1908077 2036791 1915645 1768805 1743437 1816410 1863080 1890196
$$ packed form
10436F470177k24996j22176l11970l04452k52467k90534j30751p2089j19119m1432
10426D600191p8166l1249k23496j26046j37316J296J99486k7502l49611j50710
10416C676877J62287L1375k46089j09751o0346k50657r6148n6121L0928k30622
10406B851733j27823j18542Q5832J33893l6186l27113k23300J09733j02610m3546
10396B202071J24657J26291k5595r1626J63707K95605J1143o1470p5395l5370
10386B634018j98923j01306K10129L9427k00821k3554j595R168R9918r3196J56097
10375B529362O979j27279r2499n553j56378r2042k1642k3369J16278K32801j73870
10364B192788j39234j01779m3698J28714j21146j46840k5368P2973M6670K7116
$$ plain form
10354 1890196 1768261 1515500 1454667 1603703 1584619 1733957 1772203 1645744 1655267 1768702
10344 1768702 1702919 1539041 1366366 1408397 1383496 1517457 1507427 1382240 1341854 1212882
10334 1212882 1165785 1047350 1095165 1001250 896920 1065001 1194279 1341831 1341429 1453695
10324 1453695 1366537 1268634 1270939 1331859 1430924 1549251 1551035 1291908 1022171 1069739 1196845
10313 1196845 1347981 1258276 1054615 1143449 1366849 1359002 1309495 1254374 1229097 1052443 937020
10302 937020 1030351 1168840 915614 615812 555536 762110 906868 945075 814340 877870
10292 877870 748460 881441 990924 991881 1080979 989292 961510 885847 863912 1053001 993807
10281 993807 1156063 1344554 1391012 1341770 1037634 1100439 1266340 1429186 1487913 1659585
$$ packed form
10354A890196j21935k52761o0833J49036j9084J49338L8246j26459R523J13435
10344A768702o5783j63878j72675M2031k4901J33961j0030j25187m0386j28972
10334A212882m7097j18435M7815r3915j04330J68081J29278J47552m02J12266
10324A453695q7158r7903K305O0920R9065J18327J784k59127k69737M7568J27106
10313A196845J51136q9705k03661Q8834K23400p847m9507n5121k5277j76654j15423
10302I37020R3331J38489k53226k99802o0276K06574J44758L8207j30735O3530
10292H77870j29410J32981J09483R57Q9098r1687k7782p5663k1935J89089n9194
10281I93807J62256J88491M6458m9242l04136O2805J65901J62846N8727J71672
$$ plain form
10271 1659585 1657525 1608256 1874914 2363886 2698058 3334814 4128131 5118547 6491763 7694117
10261 7694117 8895847 9835391 10665899 11402210 11975800 11802246 11349600 10584358 9733193
10252 9733193 8745967 7260602 6194668 5307029 4509435 3862485 3410521 2949891 2588955
10243 2588955 2521618 2500980 2168619 1791093 1754031 1797282 1696157 1673882 1719871 1613575
10233 1613575 1569959 1792429 1810946 1437967 1371494 1231871 1137905 1240939 1109714 978307
10223 978307 1081841 1169103 1167975 1213830 1160130 973483 872374 807939 771011 865069 876483
10212 876483 816132 723152 666032 590433 602099 499984 493532 655004 846532 809154 563571
10201 563571 430928 419725 712356 873099 1037382 959367 831903 768438 677810 824183
$$ packed form
10271A659585k060m9269K66658M88972L34172O36756P93317R90416J373216J202354
10261G694117J201730R39544Q30508P36311N73590j73554m52646p65242q51165
10252I733193r87226j485365j065934q87639p97594o46950m51964m60630l60936
10243B588955o7337k0638l32361l77526l7062M3251j01125k2275M5989j06296
10233A613575m3616K22470J8517l72979o6473j39623r3966J03034j31225j31407
10223I78307J03534Q7262j128M5855n3700j86647j01109o4435l6928R4058J1414
10212H76483o0351r2980n7120p5599J1666j02115o452J61472J91528l7378k45583
10201E63571j32643j1203K92631J60743J64283p8015j27464o3465r0628J46373
$$ plain form
10191 824183 866368 1015170 1119931 1019198 977977 750844 595489 301325 234300 523863
10181 523863 723302 794494 771298 916961 859015 915627 970453 1247053 1164437 1155175 1230427
10170 1230427 1170092 1136715 1142226 1129455 1136174 993932 1018921 1141473 1294126 1402273 1551978
10159 1551978 1807039 2013451 2098706 2089042 1912701 1958287 1977693 1947270 2194768 2424604
10149 2424604 2496401 2400422 2292675 2104766 2151981 2082587 1925147 1826775 1736875 1822428 1713586
10138 1713586 1679766 1856871 1882117 1658718 1823288 2145445 2149607 2025393 1886685 1616818
10128 1616818 1573435 1687429 1720024 1543000 1626956 1367155 1285087 1384760 1468007 1460466 1341038
10117 1341038 1175444 1114753 1098829 1022458 824961 640924 612655 912654 987184 759050
$$ packed form
10191H24183M2185J48802J04761j00733m1221k27133j55355k94164o7025K89563
10181E23863J99439P1192k3196J45663n7946N6612N4826K76600q2616r262P5252
10170A230427o0335l3377N511j2771O719j42242K4989J22552J52653J08147J49705
10159A551978K55061K06412Q5255r664j76341M5586J9406l0423K47498K29836
10149B424604P1797r5979j07747j87909M7215o9394j57440r8372q9900Q5553j08842
10138A713586l3820J77105K5246k23399J64570L22157M162j24214j38708k69867
10128A616818m3383J13994L2595j77024Q3956k59801q2068R9673Q3247p541j19428
10117A341038j65594o0691j5924p6371j97497j84037k8269K99999P4530k28134
$$ plain form
10107 759050 805022 817476 667206 644066 715061 867740 794700 705609 840041 684212 523889
10096 523889 556015 410150 388710 482466 648945 716008 776229 493425 477780 779381 805092
10085 805092 652949 530163 466177 400254 378697 503093 623211 443735 488225 508660
10075 508660 283568 248945 85872 41695 242117 524812 505722 480789 312824 339727
10065 339727 296238 460944 398210 226315 379760 341330 494012 445144 350602 274394 216300
10054 216300 252910 213915 342219 610966 601583 476100 478642 575881 442563 339232 453398
10043 453398 449352 415081 439371 452488 462803 682783 658847 549748 727512 975977 1018405
10032 1018405 1046043 924651 845495 820014 715293 581981 499510 236717 265330 376846
$$ packed form
10107G59050M5972J2454j50270k3140P0995J52679p3040q9091J34432j55829j60323
10096E23889L2126j45865k1440R3756J66479O7063O0221k82804j5645L01601K5711
10085H05092j52143j22786o3986o5923k1557J24396J20118j79476M4490K0435
10075E08660k25092l4623j63073m4177K00422K82695j9090k4933j67965K6903
10065C39727m3489J64706o2734j71895J53445l8430J52682m8868r4542p6208n8094
10054B16300L6610l8995J28304K68747r383j25483K542R7239j33318j03331J14166
10043D53398m046l4271K4290J3117J0315K19980k3936j09099J77764K48465M2428
10032A018405K7638j21392p9156k5481j04721j33312q2471k62793K8613J11516
$$ plain form
10022 376846 142554 44425 146556 275462 466641 547793 395752 265626 189759 360321
10012 360321 289186 448022 490802 331764 250727 379717 340467 411988 467291 416535 304675
10001 304675 302680 479108 495682 513960 390474 370357 420712 439845 460202 545691 476136
9990 476136 262717 200009 308229 272614 270093 463959 652622 578470 351261 110590 200016
9979 200016 362752 242820 81542 93948 259000 147761 54982 -20610 13432 157404
9969 157404 472334 778675 681006 468440 550535 584387 452678 385528 465329 320839 254569
9958 254569 230846 160994 193913 257636 436191 479215 392412 554438 664321 550275 382781
9947 382781 227992 290875 316077 402752 458267 488839 608102 748584 936543 847441 772545
$$ packed form
10022C76846k34292r8129J02131J28906J91179Q1152j52041j30126p5867J70562
10012C60321p1135J58836M2780j59038q1037J28990l9250P1521N5303n0756j11860
10001C04675j995J76428J6574J8278j23486k0117N0355J9133K0357Q5489o9555
9990D76136k13419o2708J08220l5615k521J93866J88663p4152k27209k40671Q9426
9979B00016J62736j19932j61278J2406J65052j11239r2779p5592L4042J43972
9969A57404L14930L06341r7669k12566Q2095L3852j31709o7150P9801j44490o6270
9958B54569k3723o9852L2919O3723J78555M3024q6803J62026J09883j14046j67494
9947C82781j54789O2883K5202Q6675N5515L0572J19263J40482J87959q9102p4896
$$ plain form
9936 772545 761633 829685 595214 350927 587753 806205 953456 876934 714136 555657
9926 555657 569468 448885 258289 306782 355760 318828 400025 577579 566024 444557 526004
9915 526004 719903 805105 496341 203325 358823 531876 521550 513004 261467 146931
9905 146931 67729 28628 189808 298703 237796 72128 -131375 -61148 169616 575296
9895 575296 602886 560157 557841 481824 410319 400140 358518 472788 467236 326982 160030
9884 160030 -62437 -175570 -134850 68511 301256 437413 349292 81297 238269 414285
9874 414285 180107 210530 365339 423891 397396 490908 409762 468535 557883 638512 698369
9863 698369 784713 709445 593585 694662 663332 492720 372532 285649 280832 308335 131064
$$ packed form
9936G72545j0912O8052k34471k44287K36826K18452J47251p6522j62798j58479
9926E55657J3811j20583j90596M8493M8978l6932Q1197J77554j1555j21467Q1447
9915E26004J93899Q5202l08764k93016J55498J73053j0326q546k51537j14536
9905A46931p9202l9101J61180J08895o0907j65668k03503P0227K30764M05680
9895E75296K7590m2729k316p6017p1505j0179m1622J14270n552j40254j66952
9884A60030k22467j13133M0720K03361K32745J36157q8121k67995J56972J76016
9874D14285k34178L0423J54809N8552k6495R3512q1146N8773Q9348Q0629N9857
9863F98369Q6344p5268j15860J01077l1330j70612j20188q6883m817K7503j77271
$$ plain form
9852 131064 247521 336252 310089 321191 481045 446609 386529 188622 196297 475213 760407
9841 760407 1066096 996054 674375 599481 642721 543873 572923 553950 447406 521512 471731
9830 471731 290552 406484 433970 478850 424455 406372 675411 609764 429826 464978 386943
9819 386943 423125 432482 315502 173425 51168 121585 352088 512418 570053 403185 323224
9808 323224 316109 434482 450471 353944 428980 439101 388700 278895 138539 432143 508902
9797 508902 544926 544410 398064 371699 316481 476779 341806 352955 435907 293117 217100
9786 217100 309457 210773 163327 81958 254308 325093 338800 301044 139443 137630 514303
9775 514303 591983 562370 515804 405988 469903 785159 722500 597007 608032 796733 785304
$$ packed form
9852A31064J16457Q8731k6163J1102J59854l4436o0080j97907P675K78916K85194
9841G60407L05689p0042l21679p4894M3240r8848K9050j8973j06544P4106m9781
9830D71731j81179J15932K7486M4880n4395j8083K69039o5647j79938L5152p8035
9819C86943L6182R357j16980j42077j22257P0417K30503J60330N7635j66868p9961
9808C23224p115J18373J5989r6527P5036J0121n0401j09805j40356K93604P6759
9797E08902L6024n16j46346k6365n5218J60298j34973J1149Q2952j42790p6017
9786B17100R2357r8684m7446q1369J72350P0785J3707l7756j61601j813L76673
9775E14303P7680k9613m6566j09816O3915L15256o2659j25493J1025J88701j1429
$$ plain form
9764 785304 528135 608725 567583 381341 177462 153353 519241 765613 828554 749995 613489
9753 613489 692625 651172 369905 205504 231009 429671 502993 514890 478662 394507 345637
9742 345637 236342 345731 300311 390159 429185 364576 431215 368697 312305 445940 567886
9731 567886 568980 524090 432645 411859 463820 500313 574194 678446 812848 873499 564284
9720 564284 315266 607954 631100 605645 645505 375165 268765 550978 533259 371861
9710 371861 394298 407046 261302 332312 528729 408090 251029 322571 377832 449745 676989
9699 676989 720147 422671 443697 473942 708446 708968 782782 728261 771342 897558 826816
9688 826816 737365 880576 1011714 797614 713303 828564 662571 487440 500964 730457
$$ packed form
9764G85304k57169Q0590m1142j86242k03879k4109L65888K46372O2941p8559j36506
9753F13489P9136m1453k81267j64401K5505J98662P3322J1897l6228q4155m8870
9742C45637j09295J09389m5420Q9848L9026o4609O6639o2518n6392J33635J21946
9731E67886J094m4890r1445k0786N1961L6493P3881J04252J34402O0651l09215
9720E64284k49018K92688K3146k5455L9860k70340j06400K82213j7719j61398
9710C71861K2437J2748j45744P1010J96417j20639j57061P1542N5261P1913K27244
9699F76989M3158k97476K1026L0245K34504N22P3814n4521M3081J26216p0742
9688H26816q9451J43211J31138k14100q4311J15261j65993j75131J3524K29493
$$ plain form
9678 730457 871731 922972 786666 976031 1053998 950698 947506 800252 966606 1001141 836598
9667 836598 785870 880500 975360 984347 767006 553615 349078 370951 595216 834845 926103
9656 926103 1202124 1457129 1751138 1668016 1640054 1836160 2486561 4036689 5966361 7743112
9646 7743112 8428083 8563153 8890087 9615228 10218622 9627102 7199979 4944267 3632048
9637 3632048 2823753 2557873 2393924 2082132 1987130 1884431 1741847 1771288 1995953 2132772
9627 2132772 1986712 1734501 1578263 1514565 1670964 1942263 1941890 1721461 1669468 1605623 1303666
9616 1303666 1090078 1051900 1234236 1222034 1229327 1308701 1415473 1516418 1498830 1635453 1504569
9605 1504569 1409936 1391657 1476605 1592093 1407624 1098124 1270644 1433674 1339599 1474021
$$ packed form
9678G30457J41274N1241j36306J89365P7967j03300l192j47254J66354L4535j64543
9667H36598n0728R4630R4860Q987k17341k13391k04537K1873K24265K39629R1258
9656I26103K76021K55005K94009q3122k7962J96106O50401J550128J929672J776751
9646G743112O84971J35070L26934P25141O03394n91520k427123k255712j312219
9637C632048q08295k65880j63949l11792r5002j02699j42584K9441K24665J36819
9627B132772j46060k52211j56238o3698J56399K71299l73k20429n1993o3845l01957
9616A303666k13588l8178J82336j2202P293P9374J06772J00945j7588J36623j30884
9605A504569r4633j8279Q4948J15488j84469l09500J72520J63030r4075J34422
$$ plain form
9595 1474021 1586974 1548020 1432158 1200378 1201674 1205481 1234958 1419213 1577106 1420400 1337849
9584 1337849 1295900 1060503 1117167 1185747 1201728 1243403 1392057 1342833 1391265 1368412 1253061
9573 1253061 1212286 1173985 1073118 893238 959441 1054127 1203362 1597808 1713089 1809670
9563 1809670 1781294 1849736 2029951 2176692 2042850 1965449 1987300 1896143 1997712 2011783 1904190
9552 1904190 1860927 1873305 1902334 1908750 1801377 1635567 1641136 1540642 1613883 1616899 1575694
9541 1575694 1716303 1794100 1876510 1949060 1777745 1524499 1534466 1602224 1480228 1518277 1607762
9530 1607762 1741929 1821944 1874911 1862294 1664072 1699310 1670073 1838636 2044461 2036664 1827241
9519 1827241 1898783 2023904 1900015 1837291 1854084 1997245 2101459 1925893 1861132 1873045
$$ packed form
9595A474021J12953l8954j15862k31780J296L807K9477J84255J57893j56706q2551
9584A337849m1949k35397N6664O8580J5981M1675J48654m9224M8432k2853j15351
9573A253061m0775l8301j00867j79880O6203R4686J49235L94446J15281R6581
9563A809670k8376O8442J80215J46741j33842p7401K1851r1157J01569J4071j07593
9552A904190m3263J2378K9029O416j07373j65810N569j00494P3241L016m1205
9541A575694J40609P7797Q2410P2550j71315k53246R967O7758j21996L8049Q9485
9530A607762J34167Q0015N2967j2617j98222L5238k9237J68563K05825p797k09423
9519A827241P1542J25121j23889o2724J6793J43161J04214j75566o4761J1913
$$ plain form
9509 1873045 1908048 2058591 1931589 1851432 1778726 1957235 2098692 2307748 2411736 2413587
9499 2413587 2232675 2051528 2276822 2269799 2327035 2372836 2346973 2311107 2351509 2436185 2514303
9488 2514303 2707225 2630278 2620653 2448757 2304895 2514033 2397586 2426029 2466169 2586639
9478 2586639 2550516 2713226 2704481 2529689 2489564 2657448 2565488 2377594 2454189 2442784 2352197
9467 2352197 2387734 2461775 2580456 2606694 2694665 2513618 2518365 2525219 2573069 2758357 2872822
9456 2872822 2881357 2928057 2665693 2691772 2917378 3134838 3124852 2902971 2763349 2683279 2604171
9445 2604171 2842058 3033561 2873623 2848884 2766799 2701568 2733836 2879441 2992727 3044497
9435 3044497 2924777 2913261 2846435 2716961 2658884 2842620 2903170 2634578 2548175 2665192
$$ packed form
9509A873045L5003J50543j27002q0157p2706J78509J41457K09056J03988J851
9499B413587j80912j81147K25294p023N7236M5801k5863l5866M0402Q4676P8118
9488B514303J92922p6947r625j71896j43862K09138j16447K8443M0140J20470
9478B586639l6123J62710q745j74792m0125J67884r1960j87894P6595j1405r0587
9467B352197L5537P4041J18681K6238Q7971j81047M747O854M7850J85288J14465
9456B872822Q535M6700k62364K6079K25606K17460r986k21881j39622q0070p9108
9445B604171K37887J91503j59938k4739q2085o5231L2268J45605J13286N1770
9435C044497j19720j1516o6826j29474n8077J83736O0550k68592q6403J17017
$$ plain form
9425 2665192 2695844 2820536 2993277 3139925 3134149 2961405 2828897 3045933 3278630 3182809
9415 3182809 3047075 2714724 2711061 2865251 2933034 3042347 2965702 2847323 2666932 2467141
9405 2467141 2242152 2153918 2197517 2332656 2325059 2548312 2620992 2685547 2627364 2605425 2615811
9394 2615811 2563377 2376415 2373793 2401148 2531698 2486310 2438913 2569838 2653989 2702487 2702142
9383 2702142 2659688 2610668 2736801 2884044 2653248 2628623 2587041 2501795 2572772 2511580 2696222
9372 2696222 2928376 2739576 2656456 2641861 2442398 2181398 2128333 2475319 2571495 2503296
9362 2503296 2724508 2700610 2374260 2087434 1990151 2288779 2538572 2672993 2720582 2628310
9352 2628310 2473312 2423151 2414877 2453302 2699221 2884700 2930186 2786436 2752858 2660930 2575194
$$ packed form
9425B665192L0652J24692J72741J46648n776j72744j32508K17036K32697r5821
9415C182809j35734l32351l663J54190O7783J09313p6645j18379j80391j99791
9405B467141k24989q8234M3599J35139p597K23253P2680O4555n8183k1939J0386
9394B615811n2434j86962k622K7355J30550m5388m7397J30925Q4151M8498l45
9383B702142m2454m9020J26133J47243k30796k4625m1582q5246P0977o1192J84642
9372B696222K32154j88800q3120j4595j99463k61000n3065L46986R6176o8199
9362B503296K21212k3898l26350k86826r7283K98628K49793J34421M7589r2272
9352B628310j54998n0161q274L8425K45919J85479M5486j43750l3578r1928q5736
$$ plain form
9341 2575194 2866375 3083588 3102164 3246284 3250827 3030801 3018621 3140258 3140498 3098726 2880876
9330 2880876 2779241 2930401 3234392 3225431 3270668 3180302 3362397 3612376 3695772 3787782 3818685
9319 3818685 3675269 3861075 3676790 3733619 4012600 3937416 3838332 3940841 4148698 4230973
9309 4230973 4257233 4245884 4228747 4117860 4235821 4545628 4648346 4628258 4477127 4291462
9299 4291462 4419823 4603164 4877226 4853324 4824088 4693220 4847443 4951452 4853132 4716977
9289 4716977 4763544 4942698 5147528 5276217 5638398 5649156 5722242 5811394 5907725 5919212 5918260
9278 5918260 6015081 5939111 5947079 6150191 6275345 6617939 6843872 6954671 7138690 7200339
9268 7200339 7345757 7567136 7723852 8026623 8393235 8483603 8874677 9331567 9821909 10017980
$$ packed form
9341B575194K91181K17213J8576J44120M543k20026j2180J21637K40m1772k17850
9330B880876j01635J51160L03991q961M5237r0366J82095K49979Q3396R2010L0903
9319C818685j43416J85806j84285N6829K78981p5184r9084J02509K07857Q2275
9309D230973K6260j1349j7137j10887J17961L09807J02718k0088j51131j85665
9299D291462J28361J83341K74062k3902k9236j30868J54223J04009r8320j36155
9289D716977M6567J79154K04830J28689L62181J0758P3086Q9152R6331J1487r52
9278E918260R6821p5970P968K03112J25154L42594K25933J10799J84019O1649
9268G200339J45418K21379J56716L02771L66612R0368L91074M56890M90342J96071
$$ plain form
9258 10017980 10821285 11646154 12152443 12825630 13708779 14307947 14842094 15133833 15679335
9249 15679335 16161231 16313519 16424465 16720885 16808157 16957134 17258565 17865001 18429128 18972153
9239 18972153 19566829 20541873 21715668 22871862 23948672 24833835 25705912 26755333 28153221
9230 28153221 29491129 30414967 31281447 32313944 33580670 34956222 36543060 38065424
9222 38065424 39663620 41237781 42795228 44362270 45450240 46404378 47513486 48463776
9214 48463776 49081643 49585919 50374545 51123871 51906610 52443218 53098818 54100878 55332105
9205 55332105 56538088 58077681 59596203 61082124 62682896 64382949 65933999 67559530
9197 67559530 69565070 71480395 73301265 75102745 77130813 79199124 81400492 83776943
$$ packed form
9258A0017980Q03305Q24869N06289O73187Q83149N99168N34147K91739N45502
9249A5679335M81896J52288J10946K96420Q7272J48977L01431O06436N64127N43025
9239A8972153N94676R75044J173795J156194J076810Q85163Q72077J049421J397888
9230B8153221J337908R23838Q66480J032497J266726J375552J586838J522364
9222C8065424J598196J574161J557447J567042J087970R54138J109108R50290
9214D8463776O17867N04276P88626P49326P82739N36608O55600J002060J231227
9205E5332105J205983J539593J518522J485921J600772J700053J551050J625531
9197F7559530K005540J915325J820870J801480K028068K068311K201368K376451
$$ plain form
9189 83776943 86188066 88651158 91069627 93183671 94875594 96790302 98708978 100607525
9181 100607525 102088143 103784050 105497445 107348031 109017601 110708569 112275871 113809221
9173 113809221 115390534 117231756 118917208 120905531 122704791 124169290 125991293 127779538
9165 127779538 129172591 130239750 131321556 132264884 133111531 133930032 134660193 135349969 136113506
9156 136113506 137235197 138651952 140527558 142772366 145391905 148448361 151861247 155404286
9148 155404286 159323762 163213228 167173818 170827617 174165014 177532618 180599187 183445699
9140 183445699 186100565 188208530 190392199 192540821 194820404 196984053 198943592 200609078
9132 200609078 202688457 205053089 207547534 210427339 214008312 218565155 224034049 230163741
$$ packed form
9189H3776943K411123K463092K418469K114044J691923J914708J918676J898547
9181A00607525J480618J695907J713395J850586J669570J690968J567302J533350
9173A13809221J581313J841222J685452J988323J799260J464499J822003J788245
9165A27779538J393053J067159J081806R43328Q46647Q18501P30161O89776P63537
9156A36113506J121691J416755J875606K244808K619539L056456L412886L543039
9148A55404286L919476L889466L960590L653799L337397L367604L066569K846512
9140A83445699K654866K107965K183669K148622K279583K163649J959539J665486
9132B00609078K079379K364632K494445K879805L580973M556843N468894O129692
$$ plain form
9124 230163741 236911091 244391658 252342226 260449730 268910133 277389864 285675194 294017547
9116 294017547 302222532 310192875 317120854 323400504 328892070 333573914 337262656 340110198
9108 340110198 342170222 343279537 343603604 343068671 342351415 341045054 339579867 337911770
9100 337911770 336227350 334405373 333035188 331717731 330564407 329685243 329243008 329258043 329839824
9091 329839824 330682289 331891965 333274697 334603377 335867160 337274720 338824571 340255987
9083 340255987 341979322 343596903 345136683 346767383 348175688 349451676 350283246 350785957
9075 350785957 351181394 351349132 351444042 351452781 351267969 351073603 350746001 350079022 349195422 348180604
9065 348180604 346803969 345296943 343716323 341888133 339824861 337686050 335466118 333395249
$$ packed form
9124B30163741O747350P480567P950568Q107504Q460403Q479731Q285330Q342353
9116B94017547Q204985P970343O927979O279650N491566M681844L688742K847542
9108C40110198K060024J109315L24067n34933p17256j306361j465187j668097
9100C37911770j684420j821977j370185j317457j153324q79164m42235J5035N81781
9091C29839824Q42465J209676J382732J328680J263783J407560J549851J431416
9083C40255987J723335J617581J539780J630700J408305J275988Q31570N02711
9075C50785957L95437J67738R4910Q739j84812j94366l27602o66979q83600j014818
9065C48180604j376635j507026j580620j828190k063272k138811k219932k070869
$$ plain form
9057 333395249 331516389 330078635 329182515 328522443 328235131 328503240 329305590 330411971 331851123
9048 331851123 333449907 334949385 336385339 337314792 337649920 337252091 335992189 333879045
9040 333879045 331069621 327584416 322881404 317445441 311503325 305212972 299000106 293028345
9032 293028345 287245802 281708469 276392495 270899314 266049663 261640338 257633865 253692702
9024 253692702 250321388 247353576 244552183 241648959 238923859 236568848 233922441 231382193
9016 231382193 228972385 226509385 224115196 221590016 219203176 216390869 213815543 211024950
9008 211024950 207864662 204416329 200679919 196984906 192956002 188624250 183995922 179355977
9000 179355977 174697948 169746137 164835588 160074872 155494682 150872793 146361273 142323260
$$ packed form
9057C33395249j878860j437754q96120o60072k87312K68109Q02350J106381J439152
9048C31851123J598784J499478J435954R29453L35128l97829j259902k113144
9040C33879045k809424l485205m703012n435963n942116o290353o212866n971761
9032B93028345n782543n537333n315974n493181m849651m409325m006473l941163
9024B53692702l371314k967812k801393k903224k725100k355011k646407k540248
9016B31382193k409808k463000k394189k525180k386840k812307k575326k790593
9008B11024950l160288l448333l736410l695013m028904m331752m628328m639945
9000A79355977m658029m951811m910549m760716m580190m621889m511520m038013
$$ plain form
8992 142323260 138596466 134934274 131433626 128076898 125178393 122242707 119778959 117522009
8984 117522009 115293776 113153457 111125769 109234708 107186364 105267929 103412613 101471468
8976 101471468 99425516 97203867 94987167 92845886 90665008 88232263 85832804 83291470
8968 83291470 80763594 78186524 75839300 73673041 71172207 68850082 66752601 64757992
8960 64757992 62539167 60483392 58462777 56417440 54677395 53043346 51360809 49949940
8952 49949940 48445936 46950319 45541118 44175825 42947450 41942360 40872098 39889066
8944 39889066 38810860 37768762 36987750 36207611 35289248 34461695 33983096 33163221 32464421
8935 32464421 31987765 31487713 30907361 30449732 29846502 29295183 29008244 28555980 27847973
$$ packed form
8992A42323260l726794l662192l500648l356728k898505k935686k463748k256950
8984A17522009k228233k140319k027688j891061k048344j918435j855316j941145
8976A01471468k045952k221649k216700k141281k180878k432745k399459k541334
8968H3291470k527876k577070k347224k166259k500834k322125k097481j994609
8960F4757992k218825k055775k020615k045337j740045j634049j682537j410869
8952D9949940j504004j495617j409201j365293j228375j005090j070262r83032
8944C9889066j078206j042098p81012p80139r18363q27553m78599q19875o98800
8935C2464421m76656n00052n80352m57629o03230n51319k86939m52264p08007
$$ plain form
8926 27847973 27281065 26953904 26441742 25836642 25329622 25049045 24781243 24478914 24140973
8917 24140973 23470861 23127913 23172044 22801487 22411791 22005092 21552742 21192338 20842219 20785058
8907 20785058 20312811 19837731 19717080 19687012 19374416 18949079 18519720 18286115 18076277 17733279
8897 17733279 17328679 17049145 16912794 16837276 16369972 16225042 16079058 15708173 15416023 15107412
8887 15107412 14875390 14714723 14500891 14281207 14240801 14121217 13836000 13568221 13289775 13164615
8877 13164615 13063430 12878296 12571020 12254815 12194241 11960322 11759207 11413835 11390726 11259046
8867 11259046 10999286 10489091 10199014 10187892 10171734 10149514 10061267 10078863 10026183 9730958
8857 9730958 9468099 9291627 8983631 9049440 9140958 9071752 8845401 8600775 8497385 8532063
$$ packed form
8926B7847973n66908l27161n12162o05100n07020k80577k67802l02329l37941
8917B4140973o70112l42948M4131l70557l89696m06699m52350l60404l50119n7161
8907B0785058m72247m75080j20651l0068l12596m25337m29359k33605k09838l42998
8897A7733279m04600k79534j36351p5518m67304j44930j45984l70885k92150l08611
8887A5107412k32022j60667k13832k19684m0406j19584k85217k67779k78446j25160
8877A3164615j01185j85134l07276l16205o0574k33919k01115l45372k3109j31680
8867A1259046k59760n10195k90077j1122j6158k2220q8247J7596n2680k95225
8857I730958k62859j76472l07996O5809R1518o9206k26351k44626j03390L4678
$$ plain form
8847 8532063 8544451 8595262 8498370 8382802 8177484 7923510 7728541 7592958 7533535 7635204
8837 7635204 7709953 7572895 7442924 7178490 7107757 7180675 7312376 7104654 7247862 7401086
8827 7401086 7635607 7694830 7626673 7611813 7607662 7553129 7302339 6881188 6457122 6367634 6350682
8816 6350682 6216065 6416776 6208083 5983029 5877052 5488139 5387433 5569600 5365339 5213411
8806 5213411 5233869 5299015 5275232 5120241 5053442 5175727 5176658 5171019 5311360 5133564 5090426
8795 5090426 4808479 4611280 4528825 4614718 4760102 4751668 4740302 4656629 4558787 4559749 4617223
8784 4617223 4610679 4705257 4735350 4455844 4214849 3971821 4110355 4302990 4422610 4356976
8774 4356976 4307413 4338404 4248503 4263767 4255998 4191633 4160834 4070163 3772696 3789347 3841128
$$ packed form
8847H532063J2388N0811r6892j15568k05318k53974j94969j35583n9423J01669
8837G635204P4749j37058j29971k64434p0733P2918J31701k07722J43208J53224
8827G401086K34521N9223o8157j4860m151n4533k50790m21151m24066q9488j6952
8816F350682j34617K00711k08693k25054j05977l88913j00706J82167k04261j51928
8806E213411K0458O5146k3783j54991o6799J22285R31n639J40341j77796m3138
8795E090426k81947j97199q2455Q5893J45384q434j1366q3673r7842R62N7474
8784D617223o544R4578L0093k79506k40995k43028J38534J92635J19620o5634
8774D356976m9563L0991q9901J5264p769o4365l0799r0671k97467J6651N1781
$$ plain form
8763 3841128 3721940 3718151 3625055 3673374 3809317 3896298 3676228 3586230 3630086 3719427 3680862
8752 3680862 3821013 3778811 3780080 3976879 3971177 3674494 3666952 3558782 3635211 3547661 3182245
8741 3182245 2965132 2965699 3137919 3235623 3134577 2890850 2753816 2859830 2851552 2922163 2971527
8730 2971527 2823657 2754964 2752905 2828738 2701652 2625245 2748188 2877527 2986323 2937492 2849709
8719 2849709 2892806 3093104 3151049 3233033 3020693 2852762 2802398 2945463 2965321 2804407
8709 2804407 2765884 2717171 2607037 2567169 2678454 3036365 2945224 2850781 2839892 2837771 2591150
8698 2591150 2617056 2697108 2617234 2630775 2751571 2995022 3146882 3159236 3107587 2932173 2763782
8687 2763782 2714109 2764575 2835738 3012532 3065213 2777487 2863888 3091382 2994977 2917091 2990092
$$ packed form
8763C841128j19188l789r3096M8319J35943Q6981k20070q9998M3856Q9341l8565
8752C680862J40151m2202J269J96799n702k96683p542j08170P6429q7550l65416
8741C182245k17113N67J72220R7704j01046k43727j37034J06014q278P0611M9364
8730B971527j47870o8693k059P5833j27086p6407J22943J29339J08796m8831q7783
8719B849709M3097K00298N7945Q1984k12340j67931n0364J43065J9858j60914
8709B804407l8523m8713j10134l9868J11285L57911r1141r4443j0889k121k46621
8698B591150K5906Q0052p9874J3541J20796K43451J51860J2354n1649j75414j68391
8687B763782m9673N0466P1163J76794N2681k87726Q6401K27494r6405p7886P3001
$$ plain form
8676 2990092 3021514 3007932 3116346 3423864 3315896 3269605 3156914 3159049 2912898 2835581 3216203
8665 3216203 3310965 3088970 3172397 3433547 3305523 3152151 3087155 3081585 3111028 3154667 2957761
8654 2957761 2920254 3000645 3084698 3220571 3266189 3337514 3324653 3172602 3117940 3133600 3212855
8643 3212855 3251875 3248434 3256746 3206938 3233340 3290860 3254256 2932576 2715004 2702757 2843403
8632 2843403 2843666 2901656 2977493 2980714 3083973 3286424 3149353 2843496 2838812 2808971 2684960
8621 2684960 2681439 2493630 2716634 2874346 3018326 3129574 3224943 3157726 2976288 3009858
8611 3009858 2903193 2920091 2870121 2869031 2766379 2602884 2491201 2614957 2581938 2415908
8601 2415908 2614370 2881566 3102657 2993496 2845573 2678977 2687600 2876829 3256948 3346820
$$ packed form
8676B990092L1422j3582J08414L07518j07968m6291j12691K135k46151p7317L80622
8665C216203R4762k21995Q3427K61150j28024j53372o4996n570K9443M3639j96906
8654B957761l7507Q0391Q4053J35873M5618P1325j2861j52051n4662J5660P9255
8643C212855L9020l441Q312m9808K6402N7520l6604l21680k17572j2247J40646
8632B843403K63N7990P5837L221J03259K02451j37071l05857m684k9841j24011
8621B684960l521j87809K23004J57712J43980J11248R5369o7217j81438L3570
8611C009858j06665J6898m9970j090j02652j63495j11683J23756l3019j66030
8601B415908J98462K67196K21091j09161j47923j66596Q623J89229L80119Q9872
$$ plain form
8591 3346820 3332129 3413652 3357911 3382232 3209609 3155049 3253796 3260006 3154634 3180956 3325124
8580 3325124 3190629 3056472 2968605 2853495 2729662 2484693 2415383 2457917 2421765 2414897 2424512
8569 2424512 2618917 2624285 2485643 2236843 2084670 2309049 2626543 2460004 2157208 2088181
8559 2088181 1835207 1613903 1799406 1949322 2238065 2055415 1839835 1648945 1412561 1404664
8549 1404664 1557686 1706978 1624377 1575493 1374267 1404341 1539000 1425326 1314364 1417419
8539 1417419 1469838 1250059 1240386 872264 613856 675399 927005 1249231 1230653 1151264 901877
8528 901877 704021 881005 986355 1197590 1297645 1351797 1317397 1281283 1177607 1174624 1217471
8517 1217471 1270730 1240479 1111548 1206596 1280072 1325460 1343997 1295473 1015320 918136 960444
$$ packed form
8591C346820j4691Q1523n5741K4321j72623n4560R8747O210j05372K6322J44168
8580C325124j34495j34157q7867j15110j23833k44969o9310M2534l6152o868R615
8569B424512J94405N368j38642k48800j52173K24379L17494j66539l02796o9027
8559B088181k52974k21304J85503J49916K88743j82650k15580j90890k36384p897
8549A404664J53022J49292q2601m8884k01226L0074J34659j13674j10962J03055
8539A417419N2419k19779r673l68122k58408O1543K51606L22226j8578p9389k49387
8528I01877j97856J76984J05350K11235J00055N4152l4400l6114j03676k983M2847
8517A217471N3259l0251j28931R5048P3476M5388J8537m8524k80153r7184M2308
$$ plain form
8506 960444 806356 798825 783813 769442 849650 817085 947588 926926 685562 736583 833412
8495 833412 903683 811031 952444 888340 929855 933247 916677 757187 646272 562126 528667
8484 528667 693830 725730 684938 853992 975655 857735 753136 576811 448247 620023
8474 620023 871850 912463 691468 729155 644923 762042 838379 854062 558503 588359 628664
8463 628664 495268 380607 490787 667555 681597 795985 954925 926513 580710 539692
8453 539692 852115 682172 492936 699483 847160 715128 580781 385659 340696 541840
8443 541840 932968 1100218 867269 661909 535062 619726 641032 636205 714270 737173 881645
8432 881645 1068786 1032294 933809 849433 706412 325005 317921 384344 440258 496125 649276
$$ packed form
8506I60444j54088p531j5012j4371Q0208l2565J30503k0662k41364N1021R6829
8495H33412P0271r2652J41413o4104M1515L392j6570j59490j10915q4146l3459
8484E28667J65163L1900m0792J69054J21663j17920j04599j76325j28564J71776
8474F20023K51827M0613k20995L7687q4232J17119P6337J5683k95559K9856M0305
8463F28664j33396j14661J10180J76768J4042J14388J58940k8412l45803m1018
8453E39692L12423j69943j89236K06547J47677j32032j34347j95122m4963K01144
8443E41840L91128J67250k32949k05360j26847Q4664K1306m827P8065K2903J44472
8432H81645J87141l6492r8485q4376j43021l81407p084O6423N5914N5867J53151
$$ plain form
8421 649276 553265 569363 791525 778146 664474 830565 680435 664482 842149 1051444
8411 1051444 1021695 863251 842259 742535 669680 743436 913198 867185 756189 802236 895786
8400 895786 735758 530518 630546 572058 368638 323432 354651 406901 384998 365404 337690
8389 337690 443766 704411 526083 281384 302854 298505 360636 380795 441440 444275 786672
8378 786672 1013109 926779 899508 702349 643515 506577 505472 561043 345499 234011 428208
8367 428208 552579 469912 574205 621114 488299 491591 555294 684970 924893 1096661 910950
8356 910950 807946 695924 496712 402666 551201 421310 211537 447968 493353 496348
8346 496348 582416 507840 797099 931314 719713 612867 616766 685891 564211 487039 439898
$$ packed form
8421F49276r6011J6098K22162j3379j13672J66091j50130j5953J77667K09295
8411A051444k9749j58444k0992r9724p2855P3756J69762m6013j10996M6047R3550
8400H95786j60028k05240J00028n8488k03420m5206L1219N2250k1903j9594k7714
8389C37690J06076K60645j78328k44699K1470m349O2131K0159O0645K835L42397
8378G86672K26437q6330k7271j97159n8834j36938j105N5571k15544j11488J94197
8367D28208J24371q2667J04293M6909j32815L292O3703J29676K39923J71768j85711
8356I10950j03004j12022j99212r4046J48535j29891k09773K36431M5385K995
8346D96348Q6068p4576K89259J34215k11601j06846L899O9125j21680p7172m7141
$$ plain form
8335 439898 264171 234066 394323 550659 675018 762709 756556 579941 540047 571200 384196
8324 384196 220706 20475 103104 311140 490879 603483 664356 633736 511286 421511
8314 421511 580253 455113 470776 565223 600064 369426 414628 477337 424847 414604 328997
8303 328997 379804 292233 395899 521408 613723 387775 382189 330965 314529 512899 493684
8292 493684 291873 402161 371645 340597 215708 322955 462607 437787 458621 492437 205368
8281 205368 -143261 -344089 -198342 218029 509191 583833 377517 355325 46059 -67950
8271 -67950 80380 182802 407472 326034 187093 280343 367696 320719 126101 107642 242924
8260 242924 296157 516518 508983 609819 500414 649517 509013 497495 728243 636143 649136
$$ packed form
8335D39898j75727l0105J60257J56336J24359Q7691o153j76615l9894L1153j87004
8324C84196j63490k00231Q2629K08036J79739J12604O0873l0620j22450q9775
8314D21511J58742j25140J5663R4447L4841k30638M5202O2709n2490j0243q5607
8303C28997N0807q7571J03666J25509R2315k25948n586n1224j6436J98370j9215
8292D93684k01811J10288l0516l1048j24889J07247J39652k4820K0834L3816k87069
8281B05368l48629k00828J45747M16371K91162P4642k06316k2192l09266j14009
8271f7950J48330J02422K24670q1438j38941R3250Q7353m6977j94618j8459J35282
8260B42924N3233K20361p535J00836j09405J49103j40504j1518K30748r2100J2993
$$ plain form
8249 649136 804544 711954 569497 417666 364594 442578 463303 243843 49901 6257 21101
8238 21101 128840 149640 47722 198464 401281 481365 227534 119879 72874 269312
8228 269312 414650 564991 582641 473662 491424 527933 528088 600970 392561 62621 35700
8217 35700 -3804 -159358 -132093 -48383 63894 215917 153842 -6014 112491 541039 838085
8206 838085 956410 778983 453289 392582 308554 390188 375831 469031 569162 437966 347646
8195 347646 259909 341846 186480 -69597 38377 310087 424488 201623 61794 84719
8185 84719 21306 10089 27048 387236 283959 595 1642 -24376 -148044 -53710 -57147
8174 -57147 212581 297386 335463 158339 16837 19106 208436 282857 432060 274579 24623
$$ packed form
8249F49136J55408r2590j42457j51831n3072P7984K0725k19460j93942m3644J4844
8238B1101J07739K0800j01918J50742K02817Q0084k53831j07655m7005J96438
8228B69312J45338J50341J7650j08979J7762L6509J55P2882k08409l29940k6921
8217C5700l9504j55554K7265Q3710J12277J52023o2075j59856J18505M28548K97046
8206H38085J18325j77427l25694o0707q4028Q1634j4357R3200J00131j31196r0320
8195C47646q7737Q1937j55366k56077J07974K71710J14401k22865j39829K2925
8185H4719o3413j1217J6959L60188j03277k83364J047k6018j23668R4334l437
8174e7147K69728Q4805L8077j77124j41502K269J89330P4421J49203j57481k49956
$$ plain form
8163 24623 177143 179859 -44284 -182095 -271746 -234033 -213835 39566 117568 369841 411374
8152 411374 322978 485703 324054 312428 496070 338122 49209 73890 -6003 23057 -38465
8141 -38465 -154824 -3146 74063 219983 310174 139034 206226 186722 291691 342994 422777
8130 422777 504587 529575 482968 213009 219995 186960 50309 77853 148498 400040 304324
8119 304324 -68444 -313556 -307753 46911 338602 465503 322899 36023 -17278 112082
8109 112082 146454 95946 33908 -276386 -329935 -147524 -190247 -280840 -344608 -381831 -375243
8098 -375243 -64589 36388 -112009 -113906 -66368 66355 265209 284075 281962 306113 116859
8087 116859 146208 44310 153962 273955 106996 84261 233507 303747 383788 439310 319683
$$ packed form
8163B4623J52520K716k24143j37811q9651L7713K0198K53401P8002K52273M1533
8152D11374q8396J62725j61649j1626J83642j57948k88913K4681p9893K9060o1522
8141c8465j16359J51678P7209J45920R0191j71140O7192j9504J04969N1303P9783
8130D22777Q1810K4988m6607k69959O986l3035j36651K7544P0645K51542r5716
8119C04324l72768k45112N803L54664K91691J26901j42604k86876n3301J29360
8109A12082L4372n0508o2038l10294n3549J82411m2723r0593o3768l7223O588
8098c75243L10654J00977j48397j897M7538J32723J98854J8866k113K4151j89254
8087A16859K9349j01898J09652J19993j66959k2735J49246P0240Q0041N5522j19627
$$ plain form
8076 319683 113303 191845 134118 188932 99555 137466 153786 140924 -62315 -1465 114784
8065 114784 226890 130395 137429 222330 168913 109358 170330 237312 197598 248379 408511
8054 408511 525140 582867 549596 628321 466200 294449 184011 239758 118031 106928 63900
8043 63900 25641 158460 276237 383902 225973 -48122 -120099 -3473 179406 205374
8033 205374 179020 396869 441741 173180 -23247 27685 249574 330798 241445 143947 242642
8022 242642 372901 471942 404199 415484 521296 238377 221260 355212 593196 338786
8012 338786 114462 349295 586981 819594 777055 687086 467370 589972 865373 794822
8002 794822 602737 546585 650902 755323 770117 655634 547040 580179 724486 855553
$$ packed form
8076C19683k06380P8542n7727N4814q9377L7911J6320j2862k03239O0850J16249
8065A14784J12106r6495P034Q4901n3417n9555O0972O6982l9714N0781J60132
8054D08511J16629N7727l3271P8725j62121j71751j10438N5747j21727j1103m3028
8043F3900l8259J32819J17777J07665j57929k74095p1977J16626J82879K5968
8033B05374k6354K17849M4872k68561j96427N0932K21889Q1224q9353r7498R8695
8022B42642J30259R9041o7743J1285J05812k82919j7117J33952K37984k54410
8012C38786k24324K34833K37686K32613m2539q9969k19716J22602K75401p0551
8002G94822j92085n6152J04317J04421J4794j14483j08594L3139J44307J31067
$$ plain form
7992 855553 643975 356573 401422 362500 444149 471230 498324 617063 749331 857061 938198
7981 938198 938784 1141355 1300787 1587178 1818163 2068338 2190746 2289297 2334790 2258973 1931714
7970 1931714 1709812 1681232 1382867 1167813 1260418 1189052 1238924 1219617 1311689 1256276 1240826
7959 1240826 1219425 1122246 843445 688036 717905 540102 451577 428732 339264 503446 793627
7948 793627 734690 513686 548223 611005 645457 873399 838887 998590 976599 982989 1242378
7937 1242378 1396005 1426402 1687417 2043184 2284494 2334384 2158333 2079218 2068202 1864883
7927 1864883 1740124 1390002 939669 813913 760856 782726 806122 652223 467077 300357
7917 300357 498228 658758 541703 397462 411114 458491 490910 518562 585749 622404 711755
$$ packed form
7992H55553k11578k87402M4849l8922Q1649K7081K7094J18739J32268J07730Q1137
7981I38198N86K02571J59432K86391K30985K50175J22408R8551M5493p5817l27259
7970A931714k21902k8580k98365k15054R2605p1366M9872j9307R2072n5413j5450
7959A240826k1401r7179k78801j55409K9869j77803q8525k2845q9468J64182K90181
7948G93627n8937k21004L4537O2782L4452K27942l4512J59703k1991O390K59389
7937A242378J53627L0397K61015L55767K41310M9890j76051p9115j1016k03319
7927A864883j24759l50122m50333j25756n3057K1870K3396j53899j85146j66720
7917C00357J97871J60530j17055j44241J3652M7377L2419K7652O7187L6655Q9351
$$ plain form
7906 711755 598899 768744 751641 554866 488767 469183 358978 36785 307757 441008
7896 441008 548946 550913 521118 402168 495800 630772 579220 434384 300476 380989 511728
7885 511728 653319 565507 499082 491512 403832 552081 436027 373824 509728 481427 480268
7874 480268 442494 436741 556108 368097 398696 438127 317353 97514 -140591 -164230 -39079
7863 -39079 113303 161075 190398 290475 94059 -104134 -17922 16024 208586 156303 6034
7852 6034 -131588 -224427 -195272 -33412 -2525 116552 78309 -116618 75222 -25387 -21816
7841 -21816 114189 242462 445477 268939 161606 34707 -34270 -14739 200824 62550
7831 62550 124341 189845 -50208 -88699 -42473 -102808 -180482 24954 88318 42236 -18620
$$ packed form
7906G11755j12856J69845j7103j96775o6099j9584j10205l22193K70972J33251
7896D41008J07938J967k9795j18950R3632J34972n1552j44836j33908Q0513J30739
7885E11728J41591q7812o6425p570q7680J48249j16054o2203J35904k8301j159
7874D80268l7774n753J19367j88011L0599L9431j20774k19839k38105k3639J25151
7863c9079J52382M7772K9323J00077j96416j98193Q6212L3946J92562n2283j50269
7852F034j37622r2839K9155J61860L0887J19077l8243j94927J91840j00609L571
7841b1816J36005J28273K03015j76538j07333j26899o8977J9531K15563j38274
7831F2550O1791O5504k40053l8491M6226o0335p7674K05436O3364m6082o0856
$$ plain form
7820 -18620 -204657 -322535 -384436 -334765 -244452 -94858 -25912 -14341 -60701 -227662 -259778
7809 -259778 -312096 -340546 -292663 51102 160532 136358 58524 -47883 -42008 28762 289049
7798 289049 303814 154601 102903 15109 -211323 -284951 -315427 -258673 -89451 175491 151892
7787 151892 136534 -39020 -13900 -160398 -275232 -223261 -216725 -463249 -516287 -414320 -380235
7776 -380235 -46846 -42959 -222016 -215478 -159496 -155559 -185900 -52254 -7654 156532 483237
7765 483237 432580 238880 77516 -64066 74526 11464 -38221 -110517 -29568 -66164 -324960
7754 -324960 -281841 -99211 69363 -62532 -182125 -117036 -56728 5864 -28204 91924 190163
7743 190163 39823 1926 -191203 -243879 -215054 -95006 -123687 -108766 -203880 32620 204208
$$ packed form
7820a8620j86037j17878o1901M9671R0313J49594O8946J1571m6360j66961l2116
7809b59778n2318k8450M7883L43765J09430k4174p7834j06407N875P0770K60287
7798B89049J4765j49213n1698q7794k26432p3628l0476N6754J69222K64942k3599
7787A51892j5358j75554K5120j46498j14834N1971O536k46524n3038J01967L4085
7776c80235L33389L887j79057O538N5982L937l0341J33646M4600J64186L26705
7765D83237n0657j93700j61364j41582J38592o3062m9685p2296Q0949l6596k58796
7754c24960M3119J82630J68574j31895j19593O5089O0308O2592l4068J20128R8239
7743A90163j50340l7897j93129n2676K8825J20048k8681J4921r5114K36500J71588
$$ plain form
7732 204208 146921 -129949 -59871 -2766 100353 125690 -51034 -94101 32202 61857 69884
7721 69884 113767 24941 83929 -1474 139120 179980 70089 92502 275247 411234 416326
7710 416326 329268 367221 332325 143043 104323 99476 112733 103514 81511 41623 -135269 -171774
7698 -171774 -1819 -5426 -21000 -26762 88308 282475 259459 -7064 -94301 -35383 -9444
7687 -9444 34054 43086 -151141 -186751 -241489 -154295 3224 -94396 -306161 -188419 -151328
7676 -151328 -169261 -37209 11218 119420 -74928 -242637 -272189 -262700 -361596 -210232 -261088
7665 -261088 -352538 -307189 -468050 -293989 -155698 -124159 -31210 -50101 -147649 -219885 -108003
7654 -108003 64791 20831 122528 -135510 -374766 -262670 -150600 5122 -110955 -178717
$$ packed form
7732B04208n7287k76870P0078N7105J03119K5337j76724m3067J26303K9655Q027
7721F9884M3883q8826N8988q5403J40594M0860j09891K2413J82745J35987N092
7710D16326q7058L7953l4896j89282l8720m847J3257r219k2003l9888j76892l6505
7698a71774J69955l607j5574n762J15070J94167k3016k66523q7237N8918K5939
7687i444M3498R032j94227l5610n4738Q7194J57519r7620k11765J17742L7091
7676a51328j7933J32052M8427J08202j94348j67709k9552R489r8896J51364n0856
7665b61088r1450M5349j60861J74061J38291L1539R2949j8891r7548p2236J11882
7654a08003J72794m3960J01697k58038k39256J12096J12070J55722j16077o7762
$$ plain form
7644 -178717 -15831 227257 371340 335275 57102 -236688 -271452 -327579 -402601 -245308
7634 -245308 -191047 -57949 52302 42124 -226914 -371962 -480822 -390024 -203939 -233494
7624 -233494 -203064 -69116 77349 15919 41373 -53512 -33943 -110278 219406 466977 310804
7613 310804 171319 206295 171207 -37266 -330358 -137775 -16823 -7306 109383 6438
7603 6438 99060 -74307 -302086 -340379 -460844 -265299 -286999 -327483 -179045 175336 326435
7592 326435 202812 -69513 -45592 274169 256414 -15881 -31797 -181111 -248925 -122937
7582 -122937 -53158 6524 -3473 -69041 -327502 -221948 -98438 -242927 -96379 -7265 -42425
7571 -42425 -47104 -52135 -36109 -92805 -12165 214350 289197 57258 -260278 -293895 -154677
$$ packed form
7644a78717J62886K43088J44083l6065k78173k93790l4764n6127p5022J57293
7634b45308N4261J33098J10251j0178k69038j45048j08860R0798J86085k9555
7624b33494L0430J33948J46465o1430K5454r4885J9569p6335L29684K47571j56173
7613C10804j39485L4976l5088k08473k93092J92583J20952R517J16689j02945
7603F438R2622j73367k27779l8293j20465J95545k1700m0484J48438L54381J51099
7592C26435j23623k72325K3921L19761j7755k72295j5916j49314o7814J25988
7582a22937O9779N9682r997o5568k58461J05554J23510j44489J46548Q9114l5160
7571d2425m679n031J6026n6696Q0640K26515P4847k31939l17536l3617J39218
$$ plain form
7560 -154677 86274 183161 187287 228720 183183 282574 235820 -108 -108025 -125811 -392928
7549 -392928 -410468 -125620 102568 145925 -103843 -143774 -182960 -39537 -4601 -27889 -321950
7538 -321950 -394193 -89962 -2479 7324 71756 62553 -164620 -239754 -151854 -122294 -158594 -282070
7526 -282070 -499583 -421958 -201848 -236866 -232786 -242265 -191804 -230059 -234625 -180932 -101600 -126485
7514 -126485 19863 141644 201380 30278 -38084 -76167 -159734 -191827 -114513 -111769 53448
7503 53448 -129352 -300387 -204830 -261023 -186251 -197248 -75904 161065 86974 -8026 -162533
7492 -162533 -259583 -323926 -202517 21375 80347 -82862 -441907 -409986 -313699 -182537 -192070
7481 -192070 -215326 -116594 -81221 -52504 -163732 -60301 -83112 -231475 -121292 -124755 -216154
$$ packed form
7560a54677K40951R6887M126M1433m5537R9391m6754k35928j07917j7786k67117
7549c92928j7540K84848K28188M3357k49768l9931l9186J43423L4936k3288k94061
7538c21950p2243L04231Q7483R803O4432r203k27173p5134Q7900K9560l6300j23476
7526b82070k17513P7625K20110l5018M080r479N0461l8255m566N3693P9332k4885
7514a26485J46348J21781N9736j71102o8362l8083q3567l2093P7314K744J65217
7503E3448j82800j71035R5557n6193P4772j0997J21344K36969p4091r5000j54507
7492a62533r7050o4343J21409K23892N8972j63209l59045L1921R6287J31162r533
7481a92070k3256R8732L5373K8717j11228J03431k2811j48363J10183l463r1399
$$ plain form
7470 -216154 -190139 -80429 -3395 172790 69807 -59019 -272447 -147625 -312647 -296218
7460 -296218 -15223 28340 31296 157170 190733 40831 15589 62061 173240 142351 263556
7449 263556 70889 -132282 -340557 -450582 -393265 -341990 -420989 -368681 -76011 16744 -11556
7438 -11556 67471 -8433 -59016 87595 87082 92855 3660 -71363 -24537 -153812 -14648 183936
7426 183936 298298 172082 80866 -48868 -20003 -76500 3770 53912 32361 -104514 -20266
7415 -20266 173836 256265 180118 79429 197549 201588 103462 -90853 57933 183833 141798
7404 141798 266229 76215 -107721 -197316 -277673 -185426 -91189 57807 126085 -140154 -334927
7393 -334927 -486536 -449670 -176073 58174 66209 124751 241593 137868 -192006 -337275
$$ packed form
7470b16154K6015J09710P7034J76185j02983j28826k13428J24822j65022J6429
7460b96218K80995M3563K956J25874L3563j49902k5242M6472J11179l0889J21205
7449B63556j92667k03171k08275j10025N7317N1275p8999N2308K92670R2755k8300
7438a1556P9027p5904n0583J46611n13N773q9195p5023M6826j29275J39164J98584
7426A83936J14362j26216r1216j29734K8865n6497Q0270N0142k1551j36875Q4248
7415b0266J94102Q2429p6147j00689J18120M039r8126j94315J48786J25900m2035
7404A41798J24431j90014j83936q9595q0357R2247R4237J48996O8278k66239j94773
7393c34927j51609L6866K73597K34247Q035N8542J16842j03725l29874j45269
$$ [...]
##END NTUPLES=NMR SPECTRUM
##END=
