##TITLE=Analysis number 318696
Compound Code cc 38306
Book Reference 468/55
Project Code adrs
Chemist Name colinb
##JCAMPDX= 6.0         $$ Bruker NMR JCAMP-DX V2.0
##DATA TYPE= NMR SPECTRUM
##DATA CLASS= NTUPLES
##ORIGIN= Bruker BioSpin GmbH
##OWNER= nmr
$$ XWIN-NMR		Version 3.5
$$ Mon Apr 10 13:16:11 2006 GMT Daylight Time (UT+1h)  MAYBRIDGE\nmr@NMR_250MHZ
##.OBSERVE FREQUENCY= 250.131544655141
##.OBSERVE NUCLEUS= ^1H
##.ACQUISITION MODE= SIMULTANEOUS (DQD)
##.ACQUISITION SCHEME= undefined
##.AVERAGES= 16
##.DIGITISER RES= 18
##SPECTROMETER/DATA SYSTEM= dpx250
##.PULSE SEQUENCE= zg30
##.SOLVENT NAME= CDCl3
##.SHIFT REFERENCE= (INTERNAL, CDCl3, 0, 16.522)
##AUDIT TRAIL= $$ (NUMBER, WHEN, WHO, WHERE, WHAT)
$$ ##TITLE= Audit trail, XWIN-NMR		Version 3.5
$$ ##JCAMPDX= 5.01
$$ ##ORIGIN= Bruker BioSpin GmbH
$$ ##OWNER= nmr
$$ C:\u/data/dgb/nmr/ADRS/2410/pdata/1/auditp.txt
$$ ##AUDIT TRAIL=  $$ (NUMBER, WHEN, WHO, WHERE, WHAT)
(   1,<2006-04-10 13:15:45.47 +100>,<MAYBRIDGE\nmr>,<NMR_250MHZ>,
      <created by zg, POWCHK disabled, PULCHK disabled
       configuration hash MD5:
       84 BC 41 DB A1 6E 1D 46 DA 25 12 A5 C1 ED C5 3A
       data hash MD5: 64K
       45 AE C4 2F A0 1D CD 1C 38 AC 93 0F AB 34 3D 63>)
(   2,<2006-04-10 13:16:02.76 +100>,<MAYBRIDGE\nmr>,<NMR_250MHZ>,
      <Start of raw data processing
       ef LB = 0.3 FT_mod = 6 PKNL = 1 SI = 32K 
       data hash MD5: 32K
       B5 4C 23 EF 08 59 FE 90 14 6B 9D A9 8B 78 A4 7A>)
(   3,<2006-04-10 13:16:04.48 +100>,<MAYBRIDGE\nmr>,<NMR_250MHZ>,
      <apk 
       data hash MD5: 32K
       CF 55 7C AF 33 F2 DD 8E 54 1F D6 5D 60 FB 87 DB>)
(   4,<2006-04-10 13:16:05.28 +100>,<MAYBRIDGE\nmr>,<NMR_250MHZ>,
      <abs ABSG = 5 
       data hash MD5: 32K
       EE 1F 69 49 AD 92 EC 5C 96 E8 5A 9A 6F 8A 47 80>)
$$ ##END=
$$ 
$$ hash MD5
$$ D3 C2 A4 E5 D2 BE 1E EF 8A 0E 7A F6 28 2D 0B 94
##$RELAX= 
##$RELAX= 
##$RELAX= 
##$RELAX= 
##$RELAX= 
##$RELAX= 
##$RELAX= 
$$ Bruker specific parameters
$$ --------------------------
##$DU= <C:\u>
##$EXPNO= 2410
##$NAME= <ADRS>
##$PROCNO= 1
##$TYPE= <nmr>
##$USER= <dgb>
##$AMP= (0..31)
100 100 100 100 100 100 100 100 100 100 100 100 100 100 100 100 100 100 
100 100 100 100 100 100 100 100 100 100 100 100 100 100 
##$AQSEQ= 0
##$AQ_mod= 3
##$AUNM= <au_zg>
##$AUTOPOS= <45 >
##$BF1= 250.13
##$BF2= 250.13
##$BF3= 250.13
##$BF4= 250.13
##$BF5= 500.13
##$BF6= 500.13
##$BF7= 500.13
##$BF8= 500.13
##$BYTORDA= 1
##$CFDGTYP= 0
##$CFRGTYP= 5
##$CHEMSTR= <none>
##$CNST= (0..31)
1 1 145 1 1 1 1 1 1 1 1 1 1 1 1 1 1 1 1 1 1 1 1 1 1 1 1 1 1 1 1 1 
##$CPDPRG= <>
##$CPDPRG1= <>
##$CPDPRG2= <>
##$CPDPRG3= <>
##$CPDPRG4= <mlev>
##$CPDPRG5= <mlev>
##$CPDPRG6= <mlev>
##$CPDPRG7= <mlev>
##$CPDPRG8= <mlev>
##$CPDPRGB= <>
##$CPDPRGT= <>
##$D= (0..31)
0 1 0 0 0 0 0 0 0 0.06 0 0 0 0 0 0 0.0002 0 0 0 0 0 0 0 0 0 0 0 0 0 0 
0 
##$DATE= 1144671343
##$DBL= (0..7)
120 120 120 120 120 120 120 120 
##$DBP= (0..7)
150 150 150 150 150 150 150 150 
##$DBP07= 0
##$DBPNAM0= <>
##$DBPNAM1= <>
$$ [...]
##$SUBNAM7= <"">
##$SUBNAM8= <"">
##$SUBNAM9= <"">
##$SW= 20.6930455092707
##$SWIBOX= (0..15)
0 0 3 0 0 0 0 0 0 0 0 0 0 0 0 0 
##$SW_h= 5175.983436853
##$TD= 65536
##$TD0= 1
##$TE= 295.16
##$TE2= 300
##$TE3= 300
##$TEG= 300
##$TL= (0..7)
0 120 120 120 120 120 120 120 
##$TP= (0..7)
150 150 150 150 150 150 150 150 
##$TP07= 0
##$TPNAME0= <>
##$TPNAME1= <>
##$TPNAME2= <>
##$TPNAME3= <>
##$TPNAME4= <>
##$TPNAME5= <>
##$TPNAME6= <>
##$TPNAME7= <>
##$TPOAL= (0..7)
0.5 0.5 0.5 0.5 0.5 0.5 0.5 0.5 
##$TPOFFS= (0..7)
0 0 0 0 0 0 0 0 
##$TUNHIN= 0
##$TUNHOUT= 0
##$TUNXOUT= 0
##$USERA1= <user>
##$USERA2= <user>
##$USERA3= <user>
##$USERA4= <user>
##$USERA5= <user>
##$V9= 5
##$VALIST= <valist>
##$VCLIST= <CCCCCCCCCCCCCCC>
##$VD= 0
##$VDLIST= <DDDDDDDDDDDDDDD>
##$VPLIST= <PPPPPPPPPPPPPPP>
##$VTLIST= <TTTTTTTTTTTTTTT>
##$WBST= 1024
##$WBSW= 4
##$XGAIN= (0..3)
0 0 0 0 
##$XL= 0
##$YL= 0
##$YMAX_a= 343857
##$YMIN_a= -567602
##$ZGOPTNS= <>
##$ZL1= 120
##$ZL2= 120
##$ZL3= 120
##$ZL4= 120
##$ABSF1= 16.522
##$ABSF2= -4.171173
##$ABSG= 5
##$ABSL= 3
##$ALPHA= 0
##$AQORDER= 0
##$ASSFAC= 0
##$ASSFACI= 0
##$ASSFACX= 0
##$ASSWID= 0
##$AUNMP= <proc_1d>
##$AZFE= 0.1
##$AZFW= 0.1
##$BCFW= 0
##$BC_mod= 0
##$BYTORDP= 0
##$COROFFS= 0
##$CY= 12.5
##$DATMOD= 1
##$DC= 0
##$DFILT= <>
##$DTYPP= 0
##$F1P= 14.0000005364418
##$F2P= -0.99999901652339
##$FCOR= 0.5
##$FTSIZE= 32768
##$FT_mod= 6
##$GAMMA= 0
##$GB= 0
##$INTBC= 1
##$INTSCL= 1
##$ISEN= 128
##$LB= 0.3
##$LEV0= 0
##$LPBIN= 0
##$MAXI= 10000
##$MC2= 0
##$MEAN= 0
##$ME_mod= 0
##$MI= 0
##$NCOEF= 0
##$NC_proc= -5
##$NLEV= 6
##$NOISF1= 0
##$NOISF2= 0
##$NSP= 0
##$NTH_PI= 0
##$NZP= 0
##$OFFSET= 16.522
##$PC= 1
##$PHC0= 169.6135
##$PHC1= 6.662678
##$PH_mod= 1
##$PKNL= yes
##$PPARMOD= 0
##$PSCAL= 4
##$PSIGN= 0
##$REVERSE= no
##$SF= 250.13
##$SI= 32768
##$SIGF1= 0
##$SIGF2= 0
##$SINO= 400
##$SIOLD= 32768
##$SREGLST= <1H.CDCl3>
##$SSB= 0
##$STSI= 32768
##$STSR= 0
##$SW_p= 5175.98343685301
##$SYMM= 0
##$S_DEV= 0
##$TDeff= 65536
##$TDoff= 0
##$TI= <Analysis number 999999
Compound Code 99
Book Reference 9
Project Code 9>
##$TILT= no
##$TM1= 0
##$TM2= 0
##$TOPLEV= 0
##$USERP1= <user>
##$USERP2= <user>
##$USERP3= <user>
##$USERP4= <user>
##$USERP5= <user>
##$WDW= 1
##$XDIM= 32768
##$YMAX_p= 449149518
##$YMIN_p= -277813
$$ End of Bruker specific parameters
$$ ---------------------------------
##NTUPLES= NMR SPECTRUM
##VAR_NAME=  FREQUENCY,     SPECTRUM/REAL,   SPECTRUM/IMAG
##SYMBOL=    X,             R,               I
##VAR_TYPE=  INDEPENDENT,   DEPENDENT,       DEPENDENT
##VAR_FORM=  AFFN,          ASDF,            ASDF
##VAR_DIM=   32768,         32768,           32768
##UNITS=     HZ,            ARBITRARY UNITS, ARBITRARY UNITS
##FACTOR=    0.157963299565203, 1,           1
##FIRST=     4132.6476996994, 0,             0
##LAST=      -1043.33573715361, 0,           0
##MIN=       -1043.33573715361, -277813,     0
##MAX=       4132.6476996994, 449149518,     0
$$ Real data points
##PAGE= N=1
##DATA TABLE= (X++(R..R)), XYDATA
$$ [...]
17973A547793N379n288r1094j3959K0851l8457J3092j8224n5649n5852M336P6615
17961A389543P8931p0998o9953L067K7025k2579k6505q5372l6276J7527L7335
17950A241745o9278p1892j6937k2984P7633J2499J6580K6948j0093K8358k1336
17939A191243j2764K6984Q1235J0377K6215R1329L8333N0057j09740j94381q5154
17928A113734r4704r0278q2262p0675K8150k8756j28203q595o2914l1460p380
17917E36657j3240K0724R2984p5937k0308q199l800L0835k6659K0465N8362M9645
17905F61529K7844M3593K2661r1733j920p159m7873o9568J02983L119m6025O491
17893F03942o1155l1584P9627J17413l725J5164L5918J01361K56303R7607k8143
$$ y = [1547793, 1553172, 1547884, 1456790, 1442831, 1463682, 1425225, 1438317, 1420093, 1364444, 1308592, 1312928, 1389543, 1468474, 1397476, 1327523, 1330590, 1357615, 1335036, 1308531, 1223159, 1186883, 1204410, 1241745, 1172467, 1100575, 1083638, 1060654, 1138287, 1150786, 1167366, 1194314, 1184221, 1212579, 1191243, 1178479, 1205463, 1286698, 1297075, 1323290, 1414619, 1452952, 1503009, 1393269, 1198888, 1113734, 1019030, 928752, 846490, 775815, 803965, 775209, 647006, 638411, 575497, 544037, 536657, 523417, 544141, 637125, 561188, 540880, 532681, 528881, 559716, 533057, 553522, 611884, 661529, 689373, 732966, 755627, 663894, 661974, 654815, 606942, 537374, 640357, 643476, 597451, 603942, 542787, 511203, 590830, 708243, 704518, 719682, 755600, 856961, 1113264, 1210871, 1182728]
17882A182728n4983L517Q3753J3687P642j28425j36625q5107p4213l8865r8072
17871F75037R44M5352j2901l0530l7950j24346j4264j4306l7136J3702J0209O737
17859D80548O0390o3531r0327L2011J7732M0773O1076N0265M3317m3801j4838
17848E73615l8347j2955o2894k0074J7414r290m2590J9461L6195P7430Q6600l5010
17836E89555j6774P1558J95534K00113J85029R260k06541k30354k30265j02252
17826D64863J4202M2745k5452o0547r5280q8885L419J09113Q5177j8220l8578
17815C92557J6541K3863l0731j5515k1580n0186o8637j760J0128P7355L3636o1247
17803C04424n0658q0308j7634R4935J06691J5378o730N4804L0381j03325j22561
$$ y = [1182728, 1127745, 1131262, 1215015, 1228702, 1236344, 1107919, 971294, 886187, 811974, 773109, 675037, 675981, 721333, 708432, 677902, 639952, 515606, 501342, 487036, 449900, 463602, 473811, 480548, 540938, 477407, 387080, 419091, 436823, 477596, 538672, 588937, 632254, 588453, 573615, 535268, 522313, 459419, 439345, 456759, 447469, 404879, 424340, 460535, 537965, 624565, 589555, 572781, 644339, 839873, 1039986, 1225015, 1234275, 1027734, 797380, 567115, 464863, 479065, 521810, 496358, 435811, 340531, 251646, 255065, 364178, 449355, 431135, 392557, 409098, 432961, 402230, 386715, 365135, 314949, 246312, 244552, 254680, 332035, 365671, 304424, 253766, 173458, 155824, 250759, 357450, 372828, 366098, 420902, 451283, 347958, 225397]
17792B25397J0100n54M4768M5144K3795j5582j0492L7334m9831p2805j2175K5063
17780B50162Q2469J6275m6759L5546k2583o1912m6134j5853m3173L5423J4729
17769A98190K7594M3570n0097l7315j1233M2052j05970n9193K0443J30968J80193
17758C79202L2719r5913o1996O2350k3859p3398k2664J06751J28064J06293l985
17747E33564o5740j22910o0259n5931N7493j2439p9666R118J10795k3817n9534
17736B30674L1639M2983j876o0533p275l5835l0215K3544M7969J4099N5890M2618
17724C53682L0935M7085j3276m7884m5417p5208J0686k8514q735O7000Q5190r072
17712C66472M027j1438q3155l4039l8865m8270j2249n430m4089O6740K9676n5855
$$ y = [225397, 235497, 234943, 279711, 324855, 348650, 333068, 322576, 359910, 310079, 237274, 225099, 250162, 332631, 348906, 302147, 337693, 315110, 253198, 207064, 191211, 148038, 183461, 198190, 225784, 269354, 219257, 181942, 170709, 212761, 106791, 47598, 68041, 199009, 379202, 411921, 316008, 254012, 316362, 292503, 219105, 196441, 303192, 431256, 537549, 533564, 467824, 344914, 284655, 228724, 286217, 273778, 194112, 203230, 314025, 290208, 230674, 262313, 305296, 303420, 242887, 235612, 199777, 169562, 193106, 241075, 255174, 311064, 353682, 384617, 431702, 418426, 370542, 325125, 249917, 260603, 232089, 223354, 290354, 375544, 366472, 370499, 359061, 275906, 241867, 203002, 154732, 142483, 137053, 92964, 159704, 189380, 133525]
17700A33525k5067j3170R967M4556l5262L0348M9645K3294p7346n3756R1802O3853
17688B42389L0487K6439K561j6194L0o0660q5587N638o9018l4748K5264P815N0513
17675A24929M4285Q3350O3242N2849o773K2918k9115j04493l0420j7409k2675
17664A80688l8871k7993P2737R6797J6057q70n1809M3624n867q687M493j22441
17652A57858N7015N1283j3444n1628K150J8240m4445O1503L5849J2373m8807J5559
17640B53506n4412j2625J7905m4016q373M720P9540J04450n3915n4282r410M4519
17628B67607q112L430O8075j5858r7993n0033k9465j2692N8034j2300J6715O2761
17616B50169j2027j2111j4851P1498N0980n2466K4534k507q3898p4735m6323J0159
$$ y = [133525, 108458, 95288, 105255, 149811, 114549, 144897, 194542, 217836, 140490, 86734, 178536, 242389, 272876, 299315, 301876, 285682, 285712, 225052, 139465, 145103, 76085, 41337, 66601, 74416, 124929, 169214, 252564, 315806, 368655, 361882, 384800, 355685, 251192, 220772, 203363, 180688, 141817, 113824, 186561, 283358, 299415, 298545, 246736, 290360, 284493, 275806, 280299, 157858, 214873, 266156, 252712, 201084, 203234, 221474, 177029, 238532, 274381, 286754, 237947, 253506, 199094, 186469, 204374, 160358, 151985, 156705, 236245, 340695, 286780, 232498, 223088, 267607, 259495, 262925, 331000, 315142, 217149, 167116, 137651, 124959, 182993, 170693, 187408, 250169, 238142, 226031, 211180, 282678, 333658, 281192, 305726, 303219, 219321, 144586, 98263, 108422]
17604A08422R0409P0912j9691l4770j0111m7681P4941R1214n4807N6554k3156
17593C02236J3321k0630p3514m2152L8958l4462r7610j1428Q4351N3559O3363
17582B75992j6556L794J4535N4831j1399l5384n7608j6580j4778Q873M1176j11016
17570A35880O012O3160K3788l0105k3859n8586k9402P4841J6110p769j092l1716
17558A37262M5823N8092m5280m0722N0517K5787J9385L7333k9324m7991P681P53
17546B19316K8026P5975q5292k8013J4502l3646n0793J0065K204j5468K5148N6374
17534B18398L162o6111K1889j8162j859Q8752n340o8345r194M9510p855K3592
17522B28437L3433J734o5899L5030m6570j9585K766P6278L9939J0888L5534l1935
$$ y = [108422, 198831, 269743, 250052, 215282, 205171, 157490, 232431, 323645, 268838, 325392, 302236, 315557, 294927, 221413, 179261, 218219, 183757, 86147, 74719, 159070, 212629, 275992, 259436, 263230, 277765, 332596, 321197, 285813, 228205, 211625, 196847, 205720, 246896, 135880, 141892, 205052, 228840, 198735, 174876, 116290, 86888, 161729, 177839, 170070, 168978, 137262, 183085, 241177, 195897, 155175, 205692, 231479, 250864, 288197, 258873, 210882, 218563, 219316, 247342, 323317, 238025, 210012, 224514, 190868, 140075, 150140, 152344, 136876, 162024, 218398, 221560, 155449, 177338, 159176, 157317, 246069, 240729, 172384, 163190, 212700, 204845, 228437, 261870, 263604, 197705, 232735, 186165, 166580, 169346, 245624, 285563, 296451, 331985, 300050]
17510C00050m2285M9894m4410q2041J3663L2245J2230k7808M1623m896j9872M3434
17498B71827k2580n1383P074K8776M8285N7343N6572O7162q82k5329n1112l2170
17486C53583K9024o0808R476o0125k8861L946J6611N4263l80l4058P0639O0458
17474D13768L1589l5953j07014k4916j8395J3575J520j4681m0028j1092P0595
17463B78968J3307K0727n3784p4203K6365Q438L3900M068N7437p89l3733j990
17451B78711J3874m378j0718L3750q56J4452O3060J35878J15457J47336R5676
17440H82242j16196j75729p4404q2842m9857j08066j5385M4191O06Q674M9069
17429C62303J06585R333o9738o7438O3649k4622p0025J5318M0718j9966R2672
$$ y = [300050, 257765, 307659, 263249, 181208, 194871, 227116, 239346, 211538, 253161, 248265, 228393, 271827, 249247, 197864, 204938, 233714, 281999, 339342, 395914, 463076, 462194, 436865, 385753, 353583, 382607, 321799, 331275, 271150, 242289, 246235, 262846, 317109, 316729, 282671, 353310, 413768, 445357, 409404, 302390, 277474, 259079, 272654, 274174, 259493, 219465, 208373, 278968, 292275, 313002, 259218, 185015, 211380, 219818, 253718, 257786, 315223, 314434, 280701, 278711, 292585, 288207, 277489, 311239, 310383, 324835, 387895, 523773, 639230, 786566, 882242, 766046, 590317, 515913, 433071, 383214, 275148, 259763, 303954, 304560, 313234, 362303, 468888, 478221, 408483, 341045, 404694, 380072, 310047, 325365, 366083, 346117, 438789]
17418D38789M2492o2602q9849J3709M6015l1850K4494K3556q2990p6783K8512
17407B73493K8878k7991K0706P5137L89j9426N050k4139J4862M6207K3529q0843
17395C35852K7957n2137L522Q7988K4445m6055m3011L3651o0782r290M356n2526
17383B53970k9033K3588l3789M1965K4256k7753n6183n0825L4364J3449r305N7732
17371B42436L0656J2666N5802m4172m5203o797M1855P660j8590K5949K5392o457
17359C21197l5731M3976N0054J6887Q2900L1170o4878m1320O4907O7681k0498
17348E16345r8501r4324R550N1365M0740K5367q5489m8526P8433N4158j4568J9577
17336D54127N6743M4311j8313l4600j04765O3879J6157j09715p3915O9125K5073
$$ y = [438789, 481281, 418679, 328830, 342539, 388554, 356704, 381198, 404754, 321764, 244981, 273493, 302371, 274380, 295086, 370223, 370612, 351186, 356236, 332097, 346959, 393166, 416695, 335852, 363809, 311672, 315194, 403182, 427627, 381572, 338561, 372212, 311430, 302140, 306496, 253970, 224937, 248525, 214736, 256701, 280957, 253204, 197021, 146196, 180560, 194009, 184704, 242436, 273092, 285758, 341560, 297388, 252185, 245388, 287243, 294903, 276313, 302262, 327654, 321197, 285466, 329442, 379496, 396383, 479283, 510453, 445575, 404255, 469162, 536843, 516345, 417844, 323520, 333070, 384435, 425175, 450542, 365053, 316527, 394960, 449118, 434550, 454127, 510870, 555181, 536868, 502268, 397503, 461382, 477539, 367824, 293909, 363034, 388107]
17325C88107K8589O8402L0498J19012J28651K37157J49888L5928p322K7481K032
17314A208423o7397j68082j12268q2872n3198n9081l9838n3254K2430j9755l2151
17303E42957K2591N5820J189k4784o583K9267K7262p2858o8574J521J6589R159
17291E33556l4014K3128K8746l1336J7795N2720m8092M435M0082k6444L1360L1477
17279F23413N41p076R5517J8817l9630m9360k4272M73K4082P7312J26334J34295
17267I80446J22622J53272P1663o4878j8338j07428l6740j49217k22411j115O0924
17256G88800N0987n0685k8613j0155l6824N8966j1448k9176j0088O7853K1039
17245H10656L4353J2921m586o6122o4755O4446N1017J06656J24616J02099J22329
$$ y = [388107, 416696, 485098, 515596, 634608, 763259, 1000416, 1150304, 1186232, 1178910, 1206391, 1208423, 1141026, 972944, 860676, 777804, 724606, 665525, 625687, 572433, 594863, 575108, 542957, 565548, 621368, 622557, 597773, 591190, 620457, 647719, 574861, 506287, 507808, 524397, 533556, 499542, 522670, 551416, 520080, 537875, 590595, 542503, 546938, 587020, 560576, 591936, 623413, 623954, 616878, 712395, 731212, 691582, 642222, 617950, 618423, 642505, 719817, 846151, 980446, 1103068, 1256340, 1328003, 1263125, 1244787, 1137359, 1100619, 951402, 728991, 727876, 788800, 839787, 789102, 760489, 750334, 713510, 772476, 761028, 731852, 721764, 789617, 810656, 845009, 857930, 853344, 787222, 722467, 786913, 837930, 944586, 1069202, 1171301, 1293630]
17234A293630J90130K93672N37773Q33466J246587J939933K386043K298482J844958
17225A2864674J421507R47246k49871k104310k718302k191085j462907q16915
17217E690037l01744m0786J81535M51244R62642J531221J956592K030039J371479
17208A3832259L41877l44645n74595j045430j437333j646381j450537j124527
17200F550688q15318o38726m64410l34540k92288k81205j56182o2602K1242j4332
17190C512327l0356r046L7297J11188K42052M73434P29168J211216J867330K448864
17180A0593474K419675J515006O37885K36448o08552j859862k385219j956075
17172H592780j355690q12166l89865j04135K43576N65677J064532J592792J963890
$$ y = [1293630, 1483760, 1777432, 2315205, 3148671, 4395258, 6335191, 8721234, 11019716, 12864674, 14286181, 15233427, 14983556, 12879246, 10160944, 7969859, 6506952, 5690037, 5388293, 5347507, 5529042, 5980286, 6942928, 8474149, 10430741, 12460780, 13832259, 14174136, 13829491, 13254896, 12209466, 10772133, 9125752, 7675215, 6550688, 5735370, 5096644, 4632234, 4297694, 4005406, 3724201, 3568019, 3505417, 3526659, 3512327, 3481971, 3472925, 3510222, 3621410, 3863462, 4336896, 5066064, 6277280, 8144610, 10593474, 13013149, 14528155, 15166040, 15402488, 14793936, 12934074, 10548855, 8592780, 7237090, 6424924, 6035059, 5930924, 6174500, 6740177, 7804709, 9397501, 11361391]
17163A1361391J774867P90576j33111Q0666J129756K391765K988078K471179N40633
17154B3395800j609873k217976k004710j948073k125916k073631j757566j293915
17146H364140r35629p02775n60913m21563l25472k66061k30547k64349k00873
17137D455958j25566j25610r3802j57273j68837j21415o6384J4098j47871j41564
17127C321734q4977n489r3131p78K1124M9574p6721P467J13979J44275J43229
17116C540286J75592J80859J79270L02648M86372O18661J137325J678800J855436
17107A0155249J177413k75892j065812o02816R9592P81960Q86885J75614j179076
17098A0153117j785288j591797j139849p32471n06054l43704l18536k25058k06027
$$ y = [11361391, 13136258, 13926834, 13793723, 13874389, 15004145, 17395910, 20383988, 22855167, 23395800, 21785927, 19567951, 17563241, 15615168, 13489252, 11415621, 9658055, 8364140, 7428511, 6725736, 6164823, 5743260, 5417788, 5151727, 4921180, 4656831, 4455958, 4330392, 4204782, 4110980, 3953707, 3784870, 3663455, 3597071, 3611169, 3463298, 3321734, 3236757, 3231268, 3138137, 3137359, 3158483, 3208057, 3131336, 3138803, 3252782, 3397057, 3540286, 3715878, 3896737, 4076007, 4378655, 4865027, 5483688, 6621013, 8299813, 10155249, 11332662, 11056770, 9990958, 9388142, 9487734, 10269694, 11156579, 11332193, 10153117, 8367829, 6776032, 5636183, 4903712, 4397658, 4053954, 3735418, 3510360, 3304333]
17089C304333j87807j28940j15199o6151p8124n3440m7156j22716j09131m7195
17079B348474l9786l3378l9921j3508l4980j6605o829N7471O4077J09274J26377
17068B520666L4553q7272j36672J1881j30781k00732j44199o3930n2349j04578
17058A646587j09746q2924l8742O548P6798M4359o6648p2517j3166n8621k9809
17047A302119O305R067Q4508J5990o580j47333j23555l8060L0641K127J1068n1236
17035A095061l3689j5017l3904K0606k7039k8859J0194l4164J363J3849o0163
17024I08238j3647m4459P70Q2176N6093l2101r9320k2193n484j9921k7328K544
17012G85368m9457k0208l7103k3124J6605K9713Q7150n5989m9916M516M2304R0387
$$ y = [3304333, 3116526, 2987586, 2872387, 2806236, 2728112, 2674672, 2627516, 2504800, 2395669, 2348474, 2308688, 2275310, 2235389, 2221881, 2186901, 2170296, 2163467, 2220938, 2285015, 2394289, 2520666, 2555219, 2467947, 2331275, 2343156, 2212375, 2011643, 1867444, 1803514, 1751165, 1646587, 1536841, 1453917, 1415175, 1421723, 1498521, 1542880, 1476232, 1403715, 1390549, 1331928, 1302119, 1308424, 1317491, 1401999, 1417989, 1411409, 1264076, 1140521, 1102461, 1133102, 1135229, 1146297, 1095061, 1061372, 1046355, 1012451, 1033057, 1006018, 977159, 987353, 953189, 954552, 968401, 908238, 894591, 850132, 850902, 933078, 989171, 957070, 857750, 835557, 830073, 810152, 782824, 785368, 735911, 715703, 678600, 655476, 672081, 701794, 788944, 732955, 683039, 687555, 729859, 820246]
17000H20246L8504r920O9229J03748N31K2266n9308l8224k7519l9430p2340j02784
16988G04999M107n5049l7099O5347j0995q8735p101K2997J5275K8040n724l6772
16976E99290j7588l8887o7087j6788q1361n555n08M8370O2535L5384l9051m4835
16964D33919k5739M5414k3710M6788Q9289O502p222l2134N7970n45o2964q2082
16952D45486r551o4738M874N3890M6226Q929J07537J48695R1435K1531j2392k3500
16940H18422l1986J9599N8611Q2266J4938j14924n2288K3158O2440J7311o1444
16929H36103N054R0419j2809Q3529N6681m9403j3219L6353n7866j21823j12870
16918G40149L5167r198n4509j78351j13318J3129M972Q2039J03673K5950m7027
$$ y = [820246, 858750, 848830, 918059, 1021807, 1022338, 1044604, 985296, 947072, 919553, 880123, 807783, 704999, 709106, 654057, 616958, 682305, 671310, 582575, 575474, 598471, 613746, 641786, 636062, 599290, 581702, 542815, 475728, 458940, 377579, 372024, 371516, 419886, 482421, 517805, 478754, 433919, 408180, 453594, 429884, 476672, 565961, 572463, 565241, 533107, 591077, 590532, 527568, 445486, 435935, 371197, 376071, 429961, 476187, 485116, 592653, 741348, 832783, 854314, 841922, 818422, 786436, 806035, 864646, 946912, 961850, 846926, 794638, 817796, 880236, 897547, 836103, 841157, 931576, 918767, 1002296, 1058977, 1009574, 996355, 1032708, 974842, 853019, 740149, 775316, 766118, 711609, 533258, 419940, 433069, 438041, 520080, 623753, 649703, 602676]
16907F02676P6681N841L0496l9527p7874K4658q3915K6172M8214n108l3123J4168
16895E89359J45671P0205k4213n1376k5438O6294P0037j9103j2282M0236K8197
16884H77587l37n657P2814P1627l0000o0215M744L0216R4979L2704M6419L420
16872A138301M8082m1405l9400J06124J5499q4037n2855r3497j10208p8386K8476
16861H36694k6418k0779j0873J1529J3902N7673K5300J1888K8389k3397J32429
16850A036337j3453K1519Q8966k0600J9688J0740j8293l504L7792N8690R5451
16839A313333L7441k1539q768N9594J34978J42782K09455J20331J78824L19090
16829B485521K80877J26805J34997J81340J85408Q3157O1432J26556K53146M23408
$$ y = [602676, 679357, 685198, 715694, 676167, 598293, 622951, 539036, 565208, 613422, 608314, 575191, 589359, 735030, 805235, 781022, 729646, 704208, 770502, 840539, 821436, 809154, 849390, 877587, 877250, 871593, 944407, 1016034, 986034, 925819, 930563, 960779, 1055758, 1088462, 1134881, 1138301, 1186383, 1144978, 1105578, 1211702, 1227201, 1143164, 1090309, 996812, 886604, 808218, 836694, 810276, 789497, 778624, 790153, 804055, 861728, 887028, 898916, 927305, 903908, 1036337, 1022884, 1044403, 1133369, 1112769, 1132457, 1143197, 1124904, 1121400, 1159192, 1217882, 1313333, 1350774, 1329235, 1320467, 1380061, 1515039, 1657821, 1867276, 1987607, 2166431, 2485521, 2766398, 2893203, 3028200, 3209540, 3394948, 3478105, 3539537, 3666093, 3919239, 4342647]
16819D342647N15668O66961R85559J260526J799985K630788L957938O283484J0093934
16810C2537490J5881512K3390755K9462725K9340768K1231437J0544131M308880
16803A66697698j182266j2333673k4583591k8278808k3701538j6845977j1250993
16796D8520852p501666n237244l811621l100290k477058j931068j544369j304509
16788B1613027j023656q83642o40653n88795o00117o07501n88704m59999m96950
16779A5723010m70473k99719k18134k02119k13258j53943j87147j95461j84038
16770A3598718k80870k05601k01502r1769J78328K67223M98807R27707J347224
16761A6038265J948728L039367M929056P882383J2587099J9218520K5884202K8814132
$$ y = [4342647, 4858315, 5525276, 6510835, 7771361, 9571346, 12202134, 16160072, 22443556, 32537490, 48419002, 71809757, 101272482, 130613250, 151844687, 162388818, 166697698, 165515432, 153181759, 128598168, 100319360, 76617822, 59771845, 48520852, 41019186, 35781942, 31970321, 28870031, 26392973, 24461905, 22917536, 21613027, 20589371, 19705729, 19065076, 18476281, 17876164, 17268663, 16679959, 16219960, 15723010, 15252537, 14952818, 14734684, 14532565, 14319307, 14165364, 13978217, 13782756, 13598718, 13317848, 13112247, 12910745, 12818976, 12997304, 13264527, 13763334, 14691041, 16038265, 17986993, 21026360, 25955416, 33837799, 46424898, 65643418, 91527620, 120341752]
16753A20341752K3776205J2870995M100508l32732p450643j9081874k6273614
16746A07950597k4563438j8268999j2347473q269280n709792m174247l111022
16739C1506346k524914k074103j691907j349250j107014q56172o82735n93133
16731B0627118n88462n46460n64216p53033p06534o26049o17399n98603n32243
16722A5094119n55114m68819l38513l26290l68161l67522l02196k16078k83425
16713A1868001k64834j89673j85067k18687j86944k22618j72494j92854l51170
16704I883660k00106j92502k39531j42056k52550k70733k20887k66368k18035
16695G880892k00642j71568p8433m3336p5572m1566k6766p4462m8558j23772j40346
$$ y = [120341752, 144117957, 156988952, 161089460, 160756728, 153306085, 134224211, 107950597, 83387159, 65118160, 52770687, 44501407, 38791615, 34617368, 31506346, 28981432, 26907329, 25215422, 23866172, 22759158, 21902986, 21220251, 20627118, 20038656, 19492196, 18927980, 18174947, 17468413, 16842364, 16224965, 15626362, 15094119, 14539005, 14070186, 13731673, 13405383, 13037222, 12669700, 12367504, 12151426, 11868001, 11603167, 11413494, 11228427, 11009740, 10822796, 10600178, 10427684, 10234830, 9883660, 9683554, 9491052, 9251521, 9109465, 8856915, 8586182, 8365295, 8098927, 7880892, 7680250, 7508682, 7430249, 7386913, 7311341, 7269775, 7243009, 7168547, 7119989, 6996217, 6855871]
16684F855871n4016q4493j58511j44311j5502l4365n4207j06724r6976q2854k3020
16673F000892o3159j36555r7166j44122k4844L8759k4722p2870p4544r3140k6394
16662E282135m1153j5881L3892M8365j9434k0556o0294k9783j94203k02449q5787
16651D694852L0906L5431M5161J19971K80664M26590O29473P25582P63230O33622
16641H385482L68033J67197j4503j69639m38095n86425o91157o06041m38931l53933
16631E621988l17348k04535q9075j08336j63103j03454q729P862j00807r4561
16621D439902j34137j31234j10708j97875j38694j5847j4617m2264Q655M7308
16611C710489R1955K19833K57914J70858J57921J89316K26036J65160J16469K02469
$$ y = [6855871, 6801855, 6717362, 6558851, 6414540, 6399038, 6364673, 6310466, 6203742, 6106766, 6023912, 6000892, 5937733, 5801178, 5704012, 5559890, 5535046, 5573805, 5549083, 5476213, 5401669, 5308529, 5282135, 5240982, 5225101, 5258993, 5307358, 5287924, 5267368, 5207074, 5177291, 4983088, 4780639, 4694852, 4725758, 4761189, 4806350, 4926321, 5206985, 5633575, 6263048, 6988630, 7751860, 8385482, 8753515, 8920712, 8906209, 8736570, 8298475, 7712050, 7020893, 6414852, 5975921, 5621988, 5304640, 5100105, 5011030, 4902694, 4739591, 4636137, 4627408, 4635270, 4534463, 4439902, 4305765, 4174531, 4063823, 3865948, 3727254, 3711407, 3696790, 3654526, 3663181, 3710489, 3802444, 4022277, 4280191, 4451049, 4608970, 4798286, 5024322, 5189482, 5305951, 5508420]
16601E508420Q9722J78629L58609M96084O78631J010150J350339J872717K738079
16592A4281380M047453O126401R731982J5715821K4587337L3254194L4875679
16585A42620247K3478193O386075R70782n61705j4062362l1250506l2562832k3535533
16577G1482359j5334568r871588o635244m610883l412382k621663k315861j912039
16569B4768131j419845j032534q92083o68209p11725o60746n16354m75495n45494
16560A7845646n49305n44556m85663l81566k33823j40946k04071j94980j41229
16551A4969507j273J52323K99317O77758R33474J504141K495617L982333O753366
16542C1766563J1493204J9135106K8563619L4331245K9013998J1980060J47451
$$ y = [5508420, 5598142, 5776771, 6135380, 6631464, 7310095, 8320245, 9670584, 11543301, 14281380, 18328833, 24455234, 34187216, 49903037, 74490374, 107744568, 142620247, 166098440, 172484515, 173455297, 172893592, 158831230, 127580724, 95017892, 71482359, 56147791, 46276203, 39640959, 35030076, 31617694, 28996031, 26680170, 24768131, 23348286, 22315752, 21423669, 20755460, 20043735, 19382989, 18866635, 18391140, 17845646, 17296341, 16751785, 16266122, 15884556, 15650733, 15509787, 15305716, 15110736, 14969507, 14968234, 15120557, 15419874, 16097632, 17031106, 18535247, 21030864, 25013197, 31766563, 43259767, 62394873, 90958492, 125289737, 154303735, 166283795, 166431246]
16535A66431246j44356o542779k3245033l1862945k5955677j7357054j1096623
16528E0226779p324811n113750l715100k797908k270029j911497j561264j338447
16520B4193973j054878q92343o86661o72789p12750o45925o77985p52960p31253
16511A7366429o85273p12454n24489l69078l36812m26754m87230l85846l12382
16502A3126111m15836m58131l90393l10747l09297l68142k92542k68201k43278
16493A0069544k08929j97065k16185k50805j61103j57925j86507k23257k07963
16484H259805j74671j56481j88581k15411j31993o3316l5586j36023k29153j02925
16474F825665l2569p5380j27752j15594j96136r9974r6768l6948p7322r4656j09456
$$ y = [166431246, 166286890, 159744111, 136499078, 104636133, 78680456, 61323402, 50226779, 42901968, 37788218, 34073118, 31275210, 29005181, 27093684, 25532420, 24193973, 23139095, 22246752, 21560091, 20887302, 20174552, 19528627, 18850642, 18097682, 17366429, 16681156, 15968702, 15444213, 15075135, 14738323, 14311569, 13824339, 13438493, 13126111, 12710275, 12252144, 11861751, 11551004, 11241707, 10873565, 10581023, 10312822, 10069544, 9860615, 9663550, 9447365, 9196560, 9035457, 8877532, 8691025, 8467768, 8259805, 8085134, 7928653, 7740072, 7524661, 7392668, 7329352, 7293766, 7157743, 6928590, 6825665, 6793096, 6717716, 6589964, 6474370, 6278234, 6178260, 6081492, 6044544, 5967222, 5872566, 5763110]
16463E763110o0880j15988p6379p9739M531K0306q4705q3782q0245p7674k5345
16452E103210j20941j39429j57004k16090n6232k5420j08790k19064j34331j02225
16442C823684j31986n4837k4316K1494l2183n0057j7196n3616o3887o5125o0470
16431C291505N5671j1691o7253j28884p7638l3942r091L3030m6878r8866j39516
16420B766447q283M7606J146K6211K5672o6006o3136J3338P3166k3826j227J5819
16408B806927n2772o7698l5279l8061p8356j17314j38878p3191m6319j49398j10089
16397A899572j32011r0774j12283j57316K1506k7809N7784O6782J04242L5827
16387A665520L3246O36p8303p5291o0528p7086J3974Q5157K1118K0772k0067J3919
$$ y = [5763110, 5702230, 5586242, 5509863, 5430124, 5434655, 5454961, 5370256, 5286474, 5206229, 5128555, 5103210, 4982269, 4842840, 4685836, 4469746, 4413514, 4388094, 4279304, 4060240, 3925909, 3823684, 3691698, 3636861, 3612545, 3634039, 3601856, 3551799, 3534603, 3480987, 3417100, 3351975, 3291505, 3347176, 3335485, 3268232, 3139348, 3061710, 3027768, 3018677, 3051707, 3004829, 2905963, 2766447, 2758164, 2805770, 2806916, 2833127, 2858799, 2792793, 2729657, 2742995, 2816161, 2792335, 2791108, 2806927, 2754155, 2686457, 2651178, 2613117, 2534761, 2417447, 2278569, 2205378, 2159059, 2009661, 1899572, 1767561, 1676787, 1564504, 1407188, 1428694, 1400885, 1458669, 1525451, 1629693, 1665520, 1698766, 1699402, 1621099, 1545808, 1485280, 1408194, 1422168, 1507325, 1528443, 1549215, 1529148, 1543067]
16375A543067K0071j21841j15883j6345L2015K4881k5151K5966n3305q5745p1529
16364A156201k382L1282j2696m475J8487l3116l8771l1317M7068J0472k589m1103
16352A097061j43449j84564j13150n2838J7065q2881p515M5672M9036J0617k5353
16341F09701O702J0894Q3777M1135N115l2663N1743k0364l3960o57J758j6241
16329G06940k0890j9281j22662j9943J7525J5068M9700J1268k0800J3989M0460
16318F51374p561J8034R2242l0105K0284N3788n7471m0958j6653j7019j10072
16307E55883q2266K6864j1145o3128n620R4690N9587J9799p1310m3708o0560O24
16295D19710J4150N9284j417O1781J31477J54980M6823J22869J16013L8139K7188
$$ y = [1543067, 1563138, 1441297, 1325414, 1309069, 1341084, 1365965, 1340814, 1366780, 1313475, 1227730, 1156201, 1153819, 1185101, 1172405, 1167930, 1186417, 1153301, 1114530, 1083213, 1130281, 1140753, 1138164, 1097061, 953612, 769048, 655898, 603060, 620125, 537244, 529729, 575401, 624437, 635054, 609701, 616403, 627297, 711074, 752209, 757324, 724661, 776404, 756040, 722080, 721423, 723181, 706940, 686050, 666769, 544107, 524164, 541689, 556757, 606457, 617725, 596925, 610914, 651374, 643813, 661847, 754089, 723984, 744268, 798056, 740585, 699627, 682974, 665955, 555883, 473617, 500481, 489336, 426208, 420588, 515278, 574865, 594664, 523354, 479646, 419086, 419710, 433860, 493144, 491727, 553508, 684985, 839965, 886788, 1009657, 1125670, 1163809, 1190997]
16284A190997k3979k10368j52436j10329q2569m8145n4319j7455Q129K7770M887
16273E32183n7288L5548Q2349L1600j43061m1214Q485n023k0032p9862J8944L1216
16261C93845j4178m725R8376O434j07356p1997m502k587m8159l1584M0999K0524
16249B75090k4363J1270L3751k3991J4214j05055K2204J13113j2286K0928J36877
16238D61752J55719J03577N9714J58897J09202J0903l3649l6778k9445j29442
16228H30450q5636j71888p3691k3877O58k1458j07766L986O3201m8897K8141M5586
16216D38809k0922r6246k2979P860Q090M6479j1283l8018j3537j8717J9983l7893
16204B61626k1195L8422M7831N017P4992R7910l4746k4904L7121j2387K5293j1826
$$ y = [1190997, 1167018, 956650, 804214, 693885, 611316, 563171, 508852, 491397, 499526, 527296, 532183, 474895, 510443, 592792, 624392, 481331, 440117, 448602, 443579, 423547, 343685, 362629, 393845, 379667, 374942, 473318, 479752, 372396, 300399, 295897, 293310, 245151, 213567, 254566, 275090, 250727, 261997, 295748, 271757, 285971, 180916, 203120, 316233, 303947, 324875, 461752, 617471, 721048, 780762, 939659, 1048861, 1059764, 1026115, 989337, 959892, 830450, 744814, 572926, 499235, 475358, 476016, 454558, 346792, 350778, 413979, 365082, 393223, 438809, 417887, 321641, 298662, 306522, 314612, 361091, 349808, 311790, 298253, 279536, 299519, 261626, 240431, 278853, 326684, 331701, 406693, 504603, 469857, 444953, 482074, 469687, 494980, 483154]
16192D83154o933o6930k7990p0759q6808n1030O852r7352n3711L7830P0933P114
16180A44370J8530n7851J07374N4555k9805j9624L3817J146n6863K376J784K3921
16168B23730L9620l2275M1309J7232P2777J662l7668l902o4604m7364M1712M804
16156B57033M2366K4053j7202K6725l6423j4996k7533M4736j3490l6877J7806
16145B66198j1978r271L0326M5383J5032O2651j6294R1003K03073J30368J21518
16134I28009K06178J78924K83881M59385P59719J030191J323771J448434J179619
16125G798111O01149j43970m24823n1705M39393P84628N29133j55429r65117j377442
16115G033928j324348j076816p60408n19617l47319j91362j48413k11278r1927
$$ y = [483154, 476221, 409291, 381301, 310542, 223734, 172704, 179556, 82204, 28493, 66323, 137256, 144370, 162900, 105049, 212423, 266978, 237173, 217549, 251366, 252512, 195649, 198025, 199809, 223730, 263350, 231075, 272384, 289616, 362393, 364055, 326387, 322485, 257881, 210517, 252229, 257033, 299399, 323452, 306250, 332975, 296552, 281556, 254023, 298759, 285269, 248392, 266198, 254220, 244949, 275275, 320658, 335690, 398341, 382047, 473050, 676123, 806491, 928009, 1134187, 1313111, 1596992, 2056377, 2816096, 3846287, 5170058, 6618492, 7798111, 8399260, 8255290, 7830467, 7778762, 8218155, 9002783, 9531916, 9376487, 8411370, 7033928, 5709580, 4632764, 3872356, 3352739, 3005420, 2814058, 2665645, 2454367, 2362440]
16106B362440j33150j07328n6963j04907p0151j17986j36756p3415r9519n6781
16096A405484N054M2886m2756k6634P3521N8109J4729J1130M9859O5701L0867
16085A687950J05548J36602K62557L84956O45983Q98555J195250J393608J338465
16076H049474Q10218K8636n20393l14325O6052M39267N90924J42699o37880j236018
16066G418654j321402j063236p98768n39818m18768l21845j99108j27802q7690
16057B540217j06563l7003l5799j48228l7056m1041q8350O3893J10298O8011J8607
16046B306986j5795m6165j12429j20821q6521j25531k39311j49777l3893n7442
16036A319301j51861j09041k7242L6846l6529k6472n1804j35519J0706M0215J40729
$$ y = [2362440, 2229290, 2121962, 2064999, 1960092, 1889941, 1771955, 1635199, 1561784, 1462265, 1405484, 1410538, 1453424, 1410668, 1384034, 1457555, 1515664, 1530393, 1541523, 1591382, 1657083, 1687950, 1793498, 1930100, 2192657, 2577613, 3223596, 4122151, 5317401, 6711009, 8049474, 8859692, 8888328, 8367935, 8053610, 8119662, 8558929, 9149853, 9292552, 8654672, 7418654, 6097252, 5034016, 4235248, 3695430, 3276662, 2954817, 2755709, 2627907, 2540217, 2433654, 2396651, 2360852, 2212624, 2175568, 2134527, 2046177, 2110070, 2220368, 2288379, 2306986, 2291191, 2245026, 2132597, 2011776, 1925255, 1799724, 1560413, 1410636, 1376743, 1319301, 1167440, 1058399, 1031157, 1068003, 1031474, 1005002, 953198, 817679, 828385, 868600, 1009329]
16025A009329M1149m5783r0184j27492q6954M1757J08932Q177j13302L366j563
16014G47432n1303m3137M7318j727j3939O4575J4929m1701l8532L0653N9537R6815
16002H70920K09060J12134J19684P4405n769K4867m3692j00774j18037r5329m1674
15991A005795O5658K41o8451q5999j08393n5075N522o2473l4614j6147l1387l4568
15979E80109m4230p0834M4637P527k1741m560k6856m3856n8961j5468j6600r7893
15967B31274J2978M5501O6122q086l8069m2142M1540J7485K1718L1090l5782j4828
15955C28801J19456K044n9234k1382j08664L0918M8428j87J0334M7506m1455N6362
15943D12927N7962n785Q4871j3518q3234k2655m5689n481J137p5051j6678M8914
$$ y = [1009329, 1050478, 1004695, 914511, 787019, 700065, 741822, 850754, 858931, 745629, 748995, 747432, 696129, 652992, 700310, 698583, 684644, 749219, 764148, 722447, 683915, 714568, 774105, 870920, 1079980, 1192114, 1311798, 1386203, 1380434, 1405301, 1361609, 1260835, 1142798, 1047469, 1005795, 1071453, 1071694, 1003243, 917244, 808851, 753776, 759298, 696825, 662211, 646064, 614677, 580109, 535879, 465045, 509682, 517209, 495468, 490908, 464052, 420196, 361235, 345767, 329167, 231274, 244252, 289753, 355875, 347789, 309720, 267578, 309118, 326603, 348321, 379411, 343629, 328801, 448257, 450301, 391067, 369685, 261021, 291939, 340367, 340180, 350514, 398020, 356565, 412927, 470889, 465104, 549975, 536457, 453223, 430568, 384879, 379398, 380535, 305484, 288806, 337720]
15931C37720J1610J3254N1353l3330n4324l1405M0980P483J3217r244J5453n8571
15919C04196o3748l8796m7950m1908L579J03908M6037p896m5987j03683n4087
15908E3665m924O478k5106L1005N1523Q2817N871j3813j5006O7896P495j9746
15896B28155j3564n7326j2702M5864k6393m0437M7J987n572M6099K9187l0096
15884A65249q8586o6918l9202j6625J00564J7120k5595j1651J8289K7784L4437
15873A14866l11P169n0153q5862P3186P4300o5065k56K3328Q9462K7931r8969
15861A09626m7140l6781m00K6199k1155j6069J1437J703L1215J5880r8k4216J6164
15848F6365N746m0206m0498P5686m1935k9604o3982M311K7306O7018m3278k8427
$$ y = [337720, 349330, 362584, 413937, 380607, 326283, 294878, 335858, 343341, 356558, 347314, 362767, 304196, 240448, 201652, 153702, 111794, 115373, 219281, 265318, 257422, 211435, 107752, 53665, 48741, 55219, 30113, 61118, 112641, 195458, 201329, 187516, 172510, 240406, 247901, 228155, 214591, 157265, 144563, 190427, 164034, 123597, 123644, 125631, 120059, 166158, 195345, 165249, 76663, 9745, -29457, -46082, 54482, 71602, 46007, 34356, 52645, 80429, 114866, 114555, 121724, 71571, -14291, 58895, 133195, 68130, 67874, 91202, 180664, 208595, 109626, 62486, 25705, 25305, 51504, 30349, 14280, 25717, 27420, 58635, 74515, 74417, 50201, 66365, 72111, 31905, -8593, 67093, 25158, -4446, -68428, -64117, -36811, 30207, -13071, -41498]
15836d1498L5293m993p699K3063j6526j544M5756J1930j00638n0354N0260N3089
15824c861L9382J6226m47J0089L4097j2178N594j6772j26880L5969M7298N0164
15812G8681k0765N1075m4985o3945K7659J886J3516K9626j138K7447P508L7908
15800A44473j9925p3826j9688J5207J7686M360l9643l9143p7321N2535l1851Q1467
15788A4331P0296M8612p1121r8541j7396N9328n6491j9712P1650Q4444n253k1689
15776E8458o1768k9880O4328p154o485P960k0924p9830P6798R7969j4511j4587
15764G0374p3028l2870P3805m6132q7320K2091M9245m6166L7588O5213m9378j6524
15752c3102L2800j3939l5817J1454J04678M3318n9870m2025M6529q7509j0007
$$ y = [-41498, -6205, -11198, -18897, 4166, -12360, -13904, 31852, 43782, -56856, -107210, -56950, -3861, 35521, 51747, 51300, 61389, 95486, 83308, 88902, 72130, -54750, -18781, 28517, 78681, 57916, 108991, 64006, 61, 27720, 29606, 43122, 72748, 71610, 99057, 106565, 144473, 124548, 50722, 31034, 46241, 63927, 68287, 28644, -10499, -87820, -35285, -67136, 14331, 84627, 133239, 62118, -36423, -53819, 5509, -50982, -70694, 956, 85400, 80147, 58458, -3310, -33190, 31138, 23984, 17499, 25459, 4535, -75295, 1503, 99472, 84961, 70374, -2654, -35524, 38281, -7851, -95171, -73080, -23835, -70001, -32413, 32800, -16578, -33102, -302, -14241, -50058, -38604, 66074, 109392, 49522, 7497, 54026, -33483, -43490]
15741d3490M8641n3790n1087J4823J48769Q533r0567j3804j4509j6892j8242M408
15729g7207P1463L5374K0310l2673j00741j8925P841N150K3412L0013L5686j321
15717a618k209m6848J3908k8696j0468N0398L7913K1081L9463m760k2972n3002
15705g810l2094M1953n235m7724K7205M0476m3471J6474K0294j6013K6019O6660
15693H6734L1546o7822q3836q1872l6579m4469L9311L8983R7497P4946P684l9586
15681B2537o6199l6024r997M7418J1347j4777M0512k0069m4434K8599K4624o8668
15669h5131l2962O3660L3546p3491o816J03910P3064J0238k8809k599j9618j4399
15657B0593n335O4585m575j14398j8479R2217O8036l5068k7080j0583o2299l6210
$$ y = [-43490, 5151, -48639, -99726, -84903, 63866, 72399, -18168, -31972, -46481, -63373, -81615, -77207, -5744, 29630, 49940, 17267, -83474, -102399, -94558, -89408, -65996, -35983, -297, -1618, -3827, -50675, -36767, -65463, -75931, -25533, 12380, 33461, 72924, 68164, 45192, -7810, -39904, 2049, -3186, -50910, -23705, 16771, -26700, -10226, 10068, -5945, 20074, 86734, 118280, 50458, -33378, -115250, -151829, -196298, -156987, -118004, -20507, 54439, 62123, 22537, -43662, -79686, -89683, -42265, -30918, -45695, -5183, -25252, -69686, -41087, -16463, -85131, -118093, -54433, -20887, -94378, -101194, 2716, 75780, 86018, 57209, 54610, 34992, 20593, 15258, 79843, 75268, -39130, -57609, 34608, 102644, 67576, 40496, 29913, -32386, -68596]
15645f8596K5067Q0671J3005N268q4646q7839k5632R9625M9319K8589o7579j6088
15633d8836J9073q9929p4825K4161k1758r062L9224k5575l1019J7039j3764K9156
15621a86115J27733L7553M3204m0876k878L4706n4943n0439l2554m9033M0903
15610a32739J21040N3148k0042K3507m926k2718j5275o960p3557J0056R6770M5673
15598G3977l6790k5441l4413J0398M9544n7464l3061k6792K5578j09893p6197
15587b40554P3180R8988j0000P5638O2072K3621n0795m4904k1982j7862L0485
15576b2113p806L7980O9767j3139j330k3360q7001m763N9493J1849n246k4665
15564a0334N1578k6596j1362j4349l6181j4534P9249M7196l1526l0826j8550L9766
$$ y = [-68596, -43529, 37142, 50147, 55415, -29231, -117070, -142702, -43077, 6242, 34831, -32748, -48836, -29763, -119692, -194517, -170356, -192114, -201176, -161952, -187527, -218546, -201507, -215271, -186115, -58382, -20829, 22375, -18501, -21379, 13327, -41616, -92055, -124609, -173642, -132739, -11699, 41449, 21407, 44914, 39988, 17270, 1995, -4965, -78522, -68466, 28304, 73977, 37187, 11746, -22667, -12269, 37275, -20189, -53250, -80042, -54464, -164357, -240554, -167374, -68386, -78386, -2748, 59324, 82945, 32150, -12754, -34736, -52598, -22113, -29919, 8061, 77828, 64689, 63359, 39999, -47002, -51765, 7728, 19577, 14331, -10334, 41244, 14648, 3286, -11063, -47244, -61778, 17471, 64667, 33141, 2315, -16235, 23531]
15552B3531O389p511o2264j0598O7135Q0030p354j3517m7087l1919P5506n7521
15540A4820Q369P6397j4905n8291K8299M4261q0347l2272L1137n2727O799q331
15528c6791O448r284P2191k7532L6445n35O772K9494j2938j1014l6459m1410l4858
15515e9471r6765m1831M0614R3153p011j02134k7282J1072J5912K6337Q574k4052
15503a62884N7729L8464N1512N7765J7886M1523r0048r6649m3929O4289J19415
15492E5073M7243n2840j12450p2078k8022M8752Q3949L0194l9523m1753J6614
15481f4841L6308P1022Q047k3181O254K375q7175j7762M3478P5384L6850k6458
15469F0301L8104M397j6280j21122l8639O2850j5081j3543M8687M9169j3247J1411
$$ y = [23531, 29920, 22409, -39855, -50453, 16682, 96712, 89358, 75841, 28754, -3165, 72341, 14820, 23189, 99586, 84681, 26390, 54689, 98950, 18603, -13669, 17468, -35259, -28460, -36791, -30343, -39627, 32564, 5032, 41477, 40942, 47714, 77208, 64270, 53256, 16797, -24613, -59471, -156236, -198067, -157453, -64300, -71311, -173445, -200727, -189655, -173743, -147406, -138832, -162884, -105155, -66691, -15179, 42586, 60472, 101995, 11947, -84702, -128631, -64342, 55073, 102316, 49476, -62974, -135052, -163074, -114322, -30373, -179, -39702, -81455, -64841, -28533, 42489, 50536, 27355, 33609, 35984, -51191, -68953, -25475, 49909, 86759, 60301, 98405, 102802, 86522, -34600, -73239, -10389, -25470, -39013, 9674, 58843, 45596, 57007]
15457E7007O3833j0146p3315j8355L6331J9585l404m5942n0927J3482K4198n7558
15445d5211k5229J13238K3205N5718n0212j60015K0348k638R662M2576M218o063
15433b0403M416N744j07128K5647O7661K6265J373K2276n1139l1085O4517K7494
15421C5638Q1288k438j6458j14780j05003O8693N9538j2178K4417o200J6130J8672
15409D7319k1036o9402N4076k8431l6019p5922o3971J1675J1364j0709j4098Q4714
15397a10440K755p7918P3756R1941k2230j01594j2467J6449k6348j197K2805L3673
15385a10815p183K3397Q599m478o5756P6799M4989p7242k6710m2455Q8218M9683
15373d2954l7634J0446R4945r142l5183L7099K2669m2815m6136P7237O5013o2931
$$ y = [57007, 120840, 110694, 37379, 19024, 55355, 74940, 71536, 25594, -25333, -11851, 12347, -45211, -70440, 42798, 66003, 121721, 71509, -88506, -68158, -70796, -61134, -18558, -14340, -20403, -15987, -10243, -117371, -91724, -24063, 2202, 3575, 25851, -25288, -56373, 8144, 35638, 116926, 114488, 98030, -16750, -121753, -53060, 6478, -5700, 18717, 12517, 28647, 47319, 26283, -43119, 10957, -17474, -53493, -129415, -193386, -181711, -170347, -181056, -195154, -110440, -107685, -185603, -111847, -19906, -42136, -143730, -156197, -139748, -166096, -167293, -144488, -110815, -117998, -94601, -86002, -90480, -156236, -79437, -34448, -111690, -138400, -180855, -92637, -42954, -80588, -70142, 24803, 15661, -19522, 17577, 40246, -2569, -48705, 28532, 93545, 30614]
15361C0614l1687k5490o9947K6956M8070n03r9422M4293R2555k5561m4121L4509
15349a9734k1349J4970j704k8613J6036Q3588M9227m0080r6725J3868R4528k87
15337F3725q4282K1100P222q5013k9283J3821l9248k0945K8032O2207j3604N4423
15325b1845K4835j3888p4755J2815K127O1424J00940o0734o8733O025o3627k0927
15313a16343p623k0637O2723n8M7733J7305q3460N2113L7576L3626L7036j9554
15301D0437l8854p6368o0018L6504M0752o6683j6732M9628R6304m6265J7921O7379
15289D4005N361k5529Q69m6928l0789N1853o528r9025j4390M4800K304r229o209
15276h9435J5329k4071n5199k6192M9984N5124L3222j9444p0438l3702M7216J2740
$$ y = [30614, -1073, -26563, -96510, -69554, -21484, -21987, -121409, -77116, 15439, -10122, -54243, -19734, -41083, -26113, -27817, -56430, -40394, 43194, 92421, 52341, -44384, -30516, 64012, 63725, -20557, 543, 7765, -77248, -106531, -92710, -131958, -152903, -124871, -62664, -76268, -21845, 2990, -10898, -85653, -72838, -70711, -9287, 91653, 30919, -37814, -31789, -95416, -116343, -123966, -144603, -81880, -81938, -34205, -16900, -100360, -48247, -10671, 22955, 59991, 40437, 1583, -74785, -134803, -98299, -57547, -124230, -140962, -91334, 4970, -41295, -23374, 44005, 49366, 23837, 24706, -22222, -53011, -1158, -7686, -106711, -121101, -76301, -73997, -83226, -89435, -74106, -98177, -153376, -179568, -129584, -74460, -41238, -60682, -131120, -164822, -117606, -104866]
15264a04866q118k2221Q69P6153J96o7895M1054J09011J22182m6586q0352m1670
15252b2243N3859m4193M0149j5552j4925O8043n4905o9012J2912M0003l9593k4658
15240g0115N4378N7186L0983N2442m4259o9953k4049J1760j48899k4593J35298
15229c9821P6237k3675m2808n8067N7620K7280m0347Q893j1263M8993Q198r582
15217A658m8225O4129L0407j8204k6361J2214L7631J2047q1128k9483J1521K3439
15205a0355q2432P7906Q0247p747o4539O9337Q1159l5961r5385r1037m6040m083
15193a28930M3197O1332j6658o2447n5247p5018k1419K3683l6404O0594Q5666
15182a21651J36444K9454K9667k5884k8703K6623n011n5376J2882J4396N248L6069
$$ y = [-104866, -112984, -135205, -134336, -58183, -57987, -125882, -84828, 24183, 146365, 99779, 19427, -22243, 31616, -12577, 27572, 12020, -2905, 65138, 10233, -58779, -45867, -5864, -45457, -70115, -15737, 41449, 72432, 124874, 80615, 10662, -13387, -1627, -150526, -175119, -39821, 36416, 12741, -30067, -88134, -30514, -3234, -43581, -34688, -45951, 3042, 11240, 1658, -46567, 17562, 47969, 29765, 3404, 15618, 53249, 65296, -15832, -45315, -33794, -10355, -92787, -14881, 65366, 57619, -6920, 62417, 143576, 107615, 12230, -78807, -124847, -128930, -85733, -24401, -41059, -103506, -158753, -233771, -255190, -231507, -267911, -207317, -121651, 14793, 44247, 73914, 48030, 19327, 45950, 40939, -14437, -1555, 12841, 18089, 54158]
15170E4158j2906L5403L9258M3450N3359n9395k3491N315o3027p7369J4804J2817
15158B2376K1114j8661Q6638n4489r7563M3750M5616j6880r4140j4158k2691L1983
15146f7105M4269q35o278m3668j0910N7896l2662O4553m2242n0861l0391p7228
15134a95462k2010l5377J0658R4437N480M0797O5244M9003L1471J3190j4638m3915
15122a122q3096m8559J0601N5061M0504N6763l1571J281L5416N5195j7212o0822
15110A2439p162q9137q7740o3268k4555K6433N7828j4515N603R2366Q0943j6702
15098b7467Q2941n7594l8118n4902k7789K9076L2858J9023K0929m9338M6153l7418
15086f1646o8409k3713k070R2021L4699J9371N4550M7807r7563j13971j7287K2637
$$ y = [54158, 41252, 76655, 115913, 159363, 212722, 153327, 129836, 135151, 72124, -5245, 9559, 22376, 43490, 24829, 111467, 56978, -40585, 3165, 48781, 31901, -62239, -76397, -99088, -67105, -22836, -23671, -29949, -73617, -84527, -26631, -59293, 5260, -36982, -87843, -118234, -195462, -217472, -252849, -242191, -147754, -142274, -101477, -36233, 12770, 44241, 57431, 42793, -1122, -84218, -132777, -122176, -67115, -26611, 30152, -1419, -138, 35278, 90473, 73261, 12439, 5277, -83860, -171600, -234868, -259423, -232990, -175162, -189677, -184074, -91708, -10765, -27467, 55474, -2120, -40238, -95140, -122929, -93853, -60995, -41972, -21043, -70381, -24228, -61646, -130055, -153768, -155838, -63817, -29118, -9747, 44803, 92610, -4953, -118924, -136211, -113574]
15074a13574Q3550r871J2533J00613L8652P837j2816K4862J2072q7775o6836j982
15062a2735p8140J277Q4593j5611o0116n5843n5652j640K6034N0687L6748P5514
15050d884R9923p0880j03926N8168K6027l4299j9173n749j7234k2855N1703L368
15038c9811k6890M0105j3950j5313J1058M774n7451p0572m7501P5181R2387M0837
15026g146o7293r8132N0426P4470M1386k8478K6657J5430m1152k9189K943J2954
15014d7124J3176L009k6653k9257K7664K1594L0594l7822m1330M78K2303K8417
15002c4951J3763j8581n8529n0920O0173n501K5609J2969K5881K7160R593m3610
14990c6944j7259m0956K8408R3309J6295j6737l4509q4213K8880L3327l1818J0512
$$ y = [-113574, -30024, -39895, -27362, 73251, 111903, 119740, 106924, 131786, 143858, 56083, -10753, -12735, -90875, -89598, -5005, -20616, -80732, -136575, -192227, -193867, -167833, -117146, -80398, -4884, 95039, 24159, -79767, -21599, 4428, -29871, -49044, -54793, -72027, -94882, -43179, -39811, -66701, -26596, -40546, -55859, -44801, -40027, -97478, -168050, -215551, -140370, -47983, -7146, -74439, -172571, -122145, -47675, -6289, -34767, -8110, 7320, -33832, -63021, -60078, -47124, -33948, -30939, -57592, -86849, -59185, -37591, -6997, -44819, -86149, -85671, -63368, -34951, -21188, -39769, -98298, -149218, -89045, -94546, -68937, -55968, -30087, -2927, 6666, -36944, -54203, -95159, -66751, 26558, 42853, 26116, -8393, -92606, -63726, -30399, -62217, -51705]
14978e1705J4994j762j2861K2161j3115l1808R6579j020l3612n3563l695P557
14966f1850M9145J4270J03517R002j6456p3910j08031j02124L0520J08671O9221
14955B1975p6367p1369N3812P1512R1594M4321m912n5382j8779P2821N1227q127
14943A72326q5973j32866M8759K0896L9675n1166m2940k6390m3947m1882p4344
14932b17852r684p941k4245N390O8479l5604l6880R1210J05731J0799L1033L0302
14920A0738l6050m662l8479p0940O7557N0015j1154j2718L8117n011j1664k7594
14908e1845m3273P0752O2173j4484l174k0556j0753M4812M9190k8773n1167m6756
14896d3854j1541k9594J06598N7940O8791o847q2980m0464L6875O3393l7918l718
$$ y = [-51705, -36711, -38473, -51334, -29173, -42288, -74096, 22483, 21463, -12149, -65712, -69407, -61850, -12705, 1565, 105082, 114084, 97628, 23718, -84313, -186437, -155917, -47246, 21975, -54392, -125761, -71949, -437, 91157, 135478, 130566, 75184, 56405, 129226, 180453, 172326, 86353, -46513, 2246, 23142, 62817, 11651, -31289, -57679, -101626, -143508, -217852, -227536, -235477, -259722, -254332, -185853, -221457, -258337, -167127, -61396, -50597, -19564, 10738, -25312, -29974, -68453, -139393, -71836, -21821, -32975, -45693, -7576, -12587, -24251, -51845, -95118, -24366, 37807, 23323, 20149, -407, -11160, 33652, 82842, 54069, 2902, -43854, -55395, -84989, 21609, 79549, 148340, 141493, 58513, 18049, 54924, 118317, 80399, 76681]
14884G6681q420K8062o1087r7389l0214N5555M8692n7384m2078L5045P7610R2290
14872A17363J6911n9320r1712l9664O838P2933K1657p0994n8479k756K8846K6402
14860c1975L0649L9073p5098q2385n1538r97N1476O2238o758l0281L0596J1168
14848e3832j213L562q3180k3435J1866J0806n1143Q228J52089K4882k4022n7907
14836h3299j34j0100k8182P2482L9019L7447l4241n0965k5400m7169K5461N0208
14824e4873M8883k2756K783P5346l6075n9646N5316l2456m2940k3756l9237L8943
14812i0468L4656k9256m1269L4187Q5511N0076R187m346n3460m434j11728p0521
14800a91865O8138K2217j9799k911j0990k430N7250O6339K0098k7696k5029o0510
$$ y = [76681, 68261, 96323, 35236, -62153, -92367, -36812, 11880, -45504, -87582, -52537, 25073, 117363, 134274, 74954, -16758, -56422, -49584, 23349, 45006, -25988, -84467, -87223, -58377, -31975, -1326, 37747, -37351, -119736, -171274, -172271, -120795, -58557, -65315, -95596, -65000, -53832, -55045, -51483, -134663, -158098, -146232, -135426, -186569, -178341, -26252, -1370, -25392, -83299, -83433, -93533, -121715, -49233, -10214, 27233, -7008, -57973, -83373, -130542, -105081, -54873, -5990, -28746, -25963, 49383, 13308, -46338, 8978, -23478, -66418, -90174, -129411, -90468, -55812, -85068, -126337, -92150, -6639, 43437, 52624, 48278, -5182, -9616, -121344, -191865, -123727, -101510, -121309, -124220, -135210, -137640, -80390, -14051, 6047, -21649, -46678, -107188]
14788a07188J7787L4663l317J5518M7558l688J6412j021o7482k9127N0304K3311
14776f270k9843P944l4327K933n3874L2149K2607N2037Q5615p0917p7719K4531
14764d5134M8056r423k6129N3621Q087j14105k9322k3790j3043N0711P9393p501
14752b8579q73J11230O156p4654j025L5201k8177L8600M9233p4953R828O7008
14740A08995J4295j2010j8109n8287j4706K7691j7348L1852K3878l1586r0743
14729c6078J4454j674n2554k9981K909N2715N0124O9835J6303j5452q0288o3849
14717g3536k1590J3613L174m6950p625k4222m6772O4834J15338J1691L2896k3825
14705b974n077J07633M0169l1872n4267j4197j0678n9305m3654j4655K426K8898
$$ y = [-107188, -89401, -54738, -58055, -42537, 5021, 1333, 17745, 16724, -50758, -79885, -29581, -6270, -36113, -28169, -62496, -59563, -113437, -81288, -58681, -6644, 78971, 8054, -69665, -45134, 2922, -6501, -32630, 20991, 29078, -85027, -114349, -138139, -151182, -100471, -21078, -28579, -29452, 81778, 87934, 13280, 12255, 47456, 19279, 57879, 107112, 32159, 41987, 108995, 123290, 111280, 93171, 34884, 20178, 47869, 30521, 62373, 86251, 54665, -36078, -21624, -23298, -75852, -105833, -102924, -50209, -85, 69750, 86053, 70601, -9687, -73536, -95126, -81513, -78339, -125289, -132914, -157136, -203908, -139074, -23736, -12045, 20851, -2974, -8051, 99582, 139751, 107879, 53612, 39415, 28737, -30568, -74222, -88877, -86451, -57553]
14693e7553R6753Q0226j22110j4346J7771J4313Q6918j7448P691N219o6910k1916
14681H608m42m8857j1451k3853j3086k0428j3370J1298J18421o862O9720k2441
14669D7257j5988L4692P8426j6035j11534m0826l8561l675j0696j4219p3027j0790
14657a74976j5157R1897P6038M3449P369j1845j6583K6700K5170j2859k9946q1071
14645g1814M476L7165K9071l1406k3028N3598k0194l4433J8498K5321l3710k6035
14633g2491n5317k9503M4464J03133k3302L4643j9630l8896n5342N4027K3989
14622c4225k1261K8726P968l370Q566P993j816j2798O7130j6759p8040j3830L1381
14609c0335m4665k1336R8542K7908q5825m8570M8625p083n0599N1470R7566N7776
$$ y = [-57553, 39200, 119426, -2684, -17030, 741, 15054, 101972, 84524, 92215, 97434, 30524, 8608, 8166, -40691, -52142, -75995, -89081, -109509, -122879, -111581, 6840, -22, 69698, 47257, 31269, 65961, 144387, 128352, 16818, -24008, -62569, -66244, -76940, -91159, -164186, -174976, -190133, -98236, -22198, 21251, 28620, 16775, 192, 26892, 52062, 39203, 9257, -71814, -67338, -30173, -1102, -32508, -55536, -1938, -22132, -56565, -38067, -12746, -46456, -72491, -127808, -157311, -112847, -9714, -33016, 1627, -18003, -56899, -112241, -58214, -34225, -55486, -26760, -18792, -22162, -13596, -5603, -7419, -20217, 46913, 30154, -47886, -61716, -30335, -75000, -96336, 2206, 30114, -55711, -104281, -55656, -62739, -113338, -61868, 35698, 93474]
14597I3474k565m4166j3531j6914j15431o774N6658N7670p097j765l7905K1112
14585a7234J5314j1529j3604o4664k3590Q7599L4063M4324m6356p9784j7273L4559
14573e8175k5248j08259L2440J36740M4305j0131j744o8991K4253j1306J3532
14562c2584L8422q7181j0572L6659j2858L3556J7178K6785m010n5257l282j9529
14550g2673N7883J2290M5674M0542J0198m8510o3585M3844n9325p420k3539Q23
14538f3798Q584N9010P5867o3555o8688j8897O897O3980O1213L5637o0824M4910
14526H0336L4140j3381K1084n8553n4777k2200k1450N2181L7128j02785k4019
14515g2296O3483K7822K3183K3895j4109p2494l3718j4323j6298K9935M9866K6883
$$ y = [93474, 90909, 46743, 33212, 16298, -99133, -105907, -49249, 8421, 1324, -441, -38346, -17234, -1920, -13449, -27053, -91717, -115307, -27708, 6355, 50679, 4323, -75461, -92734, -58175, -83423, -191682, -159242, -22502, 21803, 11672, 9928, -59063, -34810, -46116, -32584, 5838, -81343, -91915, -55256, -68114, -34558, -17380, 9405, 5395, -49862, -53144, -72673, -14790, -2500, 43174, 83716, 93914, 45404, -18181, 25663, -33662, -41082, -64621, -63798, -55214, 3796, 79663, 16108, -52580, -71477, -64580, -600, 60613, 96250, 35426, 80336, 114476, 101095, 122179, 63626, 8849, -13351, -34801, 17380, 54508, -48277, -72296, -8813, 19009, 42192, 66087, 51978, -20516, -54234, -68557, -84855, -54920, -5054, 21829]
14503B1829K7079R3J9852p1188k5421J3696L1213R717j7294M4504p7994o7381
14491i1295k220j8282M3126N3547K3881k8842n8119l4364j3519j6684P3054p0360
14479a40077j3567K2428J08830r992q2930L9947O9447K4550j5633j19961K271
14468a14687K1351n115L7689N1506J5330j5015L1406l1646o6365m7711M6240k3422
14456a00439q7685k1557Q6495R4787o2426k2301Q908m9707M162L9200K8205J163
14444h1195N6774O6502J4912j6560n8669j7808J415O2225O213L4221M069l8361
14432C3738J0054k3399n8375k948O718L8930j5457P1349j559K9784j7143j2525
14420E9167M1706j7170j006o8140q3488p1368m2324J29101L7379L5592k4679o7284
$$ y = [21829, 48908, 49001, 68853, -2335, -27756, -14060, 17153, 26870, 9576, 54080, -23914, -91295, -93515, -111797, -68671, -15124, 8757, -20085, -78204, -112568, -126087, -142771, -69717, -140077, -153644, -131216, -22386, -32378, -115308, -75361, -5914, 18636, 3003, -116958, -114687, -93336, -98451, -60762, -9256, 6074, -8941, 22465, -9181, -75546, -123257, -77017, -100439, -188124, -209681, -123186, -28399, -90825, -113126, -104218, -153925, -149763, -110563, -82358, -81195, -24421, 42081, 56993, 40433, -18236, -36044, -34629, 27596, 33809, 68030, 72099, 33738, 43792, 20393, -37982, -40930, -34212, 4718, -10739, 60610, 59051, 88835, 71692, 59167, 100873, 83703, 82697, 14557, -68931, -140299, -182623, -53522, -16143, 19449, -5230, -72514]
14408g2514K418k2763K8239N5186J26167L0211r5413n091J9657L745J7987j6327
14396G1502j08773k6034m5110J2058N4821L5992l0616q213J8084j9583L4380R8317
14384H6825j0951k5593J8699K114p1697l7399M801q0610k1312J12135j5290j7706
14372e5984K4332L938K5218n43j8378j4443m5097n843K0580K3846j083J22768
14360G9311m1904m9718k3757N5638N6339j2666n027K8443J1316n2915p4385o5607
14348i4932l7646O0103P3915q273R507o5705L3084L5216j5256j6308k2750K9421
14336a9624J3558L8905l0803K8895m3083R677m6081n5501p87K6567J3386L5335
14324b9556Q3286p632M377o7616k0245P2367J3745p5610j25210l0171J0853j5801
$$ y = [-72514, -70096, -92859, -64620, -9434, 116733, 146944, 51531, 46440, 66097, 69842, 87829, 71502, -37271, -63305, -108415, -96357, -41536, -5544, -36160, -44373, -26289, -45872, -11492, 86825, 75874, 50281, 68980, 71094, -603, -38002, -33201, -113811, -135123, -22988, -38278, -55984, -31652, -27714, -2496, -3039, -21417, -35860, -80957, -86800, -66220, -42374, -43457, 79311, 37407, -12311, -36068, 19570, 75909, 63243, 58216, 86659, 97975, 45060, -29325, -94932, -132578, -72475, 1440, -6833, 2674, -63031, -29947, 5269, -9987, -26295, -49045, -19624, -6066, 32839, 2036, 30931, -12152, -2475, -48556, -104057, -104844, -78277, -64891, -29556, 53730, 46098, 50475, -17141, -37386, 34981, 48726, -26884, -152094, -182265, -171412, -187213]
14312a87213N5223J03775k9577k4135m3724L4227j1506j8045J4468N5213k39J8839
14300c2694j9776O634J6546O8011O3671n8542o1711j2588m237n8154K8667M9129
14288a5044O225n1547q3749r805K8844J2170o1460l3430J10036O9097M1146n1633
14276c9150L4041M6748K4603O317l6315m6522n0638p6376N5449L3666k931j1556
14264f2664j2232o8692o0461M5262J02195L2540n4034o7821L7260j9008m0120
14253a67775J05500k6558k61M0585L8890J0408l286n6489L1456P6564l8348r9034
14241h8348r9499P6626O1916j06838k128J12223K6306J082J4528J6369o1938p0183
14229a19884o3378Q2857R3548M3j8910K0068o626o7174k3648J2547O2894k2854
$$ y = [-187213, -131990, -28215, -57792, -81927, -125651, -91424, -102930, -120975, -106507, -51294, -51533, -32694, -52470, -45836, -29290, 38721, 102392, 43850, -17861, -30449, -34686, -92840, -64173, -15044, -8819, -60366, -144115, -153920, -125076, -112906, -174366, -207796, -97760, -28663, 12483, -39150, -5109, 41639, 66242, 72559, 36244, -10278, -60916, -137292, -81843, -48177, -51108, -62664, -74896, -143588, -204049, -158787, -56592, -24052, -78086, -145907, -108647, -127655, -167775, -62275, -88833, -89094, -48509, -9619, 789, -2497, -58986, -27530, 49034, 10686, -88348, -187847, -111221, -49305, -156143, -158271, -46048, -19742, -18660, -4132, 12237, -49701, -119884, -183262, -100405, -6857, -6814, -25724, -5656, -12282, -79456, -103104, -90557, -27663, -50517]
14217e0517J4511R0838P363j3435j202j49544l4869O685n8031k7802L9430K9704
14205a46869k6098n219l7018J20869P3767j6208l3234o840N7851O12n0187p2065
14193a40639J6936N0555P084N9963Q086j7023l037R7375j9447m9269P4430m8653
14181C6361k313q1776K95K487l632J257J7081L1897k329Q662L2187m6601m286
14168a0710M7201m9464O2494k4114o7292K9829k5043k1995n4932r1709O3469L7941
14156a04325O7884j8797n3332Q658j5614L4085Q8471Q28k2891L9222M3483l1889
14144C5783m6374L0776j3908q6200R405L2865M9138L1740n3319l2828J2584O3684
14132C3346N993r877o029l5109P259l7550k1247j1941K9921R2848j846m7306n2655
$$ y = [-50517, -36006, 54832, 62195, 48760, 47558, -101986, -136855, -130170, -188201, -216003, -176573, -146869, -172967, -178186, -215204, -94335, -20568, -36776, -70010, -76850, -18999, -18387, -68574, -140639, -123703, -73148, -66064, -6101, 1985, -15038, -18075, 79300, 59853, 10584, 85014, 36361, 34048, -47728, -47433, -44946, -48578, -47321, -30240, 1657, -672, 7990, 40177, -6424, -10710, 36491, -12973, 49521, 25407, -41885, -12056, -37099, -59094, -114026, -205735, -142266, -104325, -36441, -55238, -108570, -99912, -115526, -81441, 7030, 7858, -15033, 24189, 67672, 35783, -10591, 20185, 6277, -79923, -70518, -37653, 11485, 43225, -10094, -42922, -30338, 33346, 39339, 29462, 23433, -11676, -4417, -41967, -63214, -75155, -45234, 47614, 45768, -1538, -54193]
14119e4193m5160n562P2177K3576N512L9761M8284p748j55775l0031J25817O2270
14107G8928n0556l9832k9895p1970K6409n837K9667J3010m0828o915J4614K4567
14095e8638M977L7870o9933m2234Q0358o772l0956Q22k0377l55P8846m3397j1613
14082h1402O4587P7123L9090j04804p4851n5889R3550J03343O010K9655J2331
14071A08743r8312m6143k632m6332J1378N9592j0177l0669K1036M3203j0347o8628
14059f9288j5547L2555j9880j9204J4059j4105N0028N6968M6601K4853O7465K7317
14047A81822l7762o5642j016j0288L4458J3620O718m6089l7296O508N9464l8398
14035F6099j06855l9060l8039p805p3512L0640J29443N3896k0537m8195m2956
$$ y = [-54193, -99353, -104915, -32738, -9162, -3650, 36111, 84395, 76647, -79128, -109159, 16658, 78928, 28372, -11460, -41355, -113325, -86916, -92753, -63086, -50076, -90904, -97819, -83205, -58638, -53661, -15791, -85724, -127958, -47600, -54372, -85328, -84506, -104883, -105238, -26392, -69789, -81402, -16815, 60308, 99398, -5406, -80257, -136146, -42596, 60747, 66757, 96412, 108743, 10431, -35712, -38344, -84676, -73298, -13706, -23883, -54552, -33516, 9687, -660, -69288, -84835, -52280, -72160, -91364, -77305, -91410, -41382, 15586, 62187, 87040, 154505, 181822, 144060, 78418, 77402, 67114, 101572, 115192, 121910, 75821, 38525, 45033, 104497, 66099, -40756, -79816, -117855, -125660, -199172, -168532, -39089, 14807, -5730, -53925, -96881]
14024i6881q299q3940J2840N0273J14266N317n6097L1278J0476j2538J2763m0481
14012f1023J846O1511K0423j5973n3564K1357M0285Q939m9924k5396l6653o0617
14000a48789k1558J41875J27909O2555l3423n6058j3602m9415N8500Q2459N182
13989A55635j3298k7487l1541q6022l6366l603J3085j6425l4439M055R0891L3418
13977D7903k6935K7890k3836N690j8552J1553m3424j06875M8079N3877J5728K1546
13965A2644n0367q2276o279N8205P0946M325n3946o693J4808J6282O4410j09728
13953f7669o7780K7756j5415k1404p212K5842Q5478M5917L6882N9358p1646p5296
13941d5189j5760l720o029N9320J03340r727K8056k7965r0893L1545P6049j18293
$$ y = [-96881, -105180, -189120, -176280, -126007, -11741, -6424, -62521, -31243, -20767, -33305, -20542, -61023, -59177, 2334, 22757, 6784, -46780, -25423, 14862, 23801, -26123, -51519, -88172, -148789, -170347, -28472, 99437, 161992, 128569, 72511, 58909, 9494, 67994, 150453, 155635, 142337, 114850, 83309, -2713, -39079, -42682, -29597, -46022, -80461, -76406, 14485, 47903, 20968, 48858, 25022, 30712, 12160, 23713, -19711, -126586, -78507, -24630, -8902, 12644, -37723, -119999, -126278, -68073, 2873, 7198, -46748, -53441, -38633, -22351, 42059, -67669, -135449, -107693, -123108, -144512, -151724, -125882, -40404, 5513, 42395, 101753, 30107, -45189, -60949, -64669, -70698, -11378, 91962, 82235, 110291, 82326, -8567, 22978, 99027, -19266]
13929a9266L10N1406l0985l0973j47923o8870K8311L9908L2302O0582p6914M3905
13917a18207Q6758l0236m2730p4822O387L7311P2563N3652N9986M8861j4129r9010
13905a3616j1108l6216m9426q6267K3608R6806J00271K6018K1514J3179k2192
13894F2571l538L4948q4249m4114J872l3003l866K3328k500L5582j1118J5115
13882h972J5521N679L4683n1375n2114m3606j9964L4445l2786k921L0165n094
13870i6339M420P6672N4182O2262k1664j796o603l5664k7612K3764o7897j9247
13858e5522j1935j3513K9457K6578L7573M299o9298l5950L4795K5074L0829J6473
13846A8860m9422N70m8071k9309l9376O156R7698N0032o7707m1550n6835j8163
$$ y = [-19266, -18956, 32450, 1465, -29508, -177431, -246301, -217990, -178082, -145780, -85198, -162112, -118207, -31449, -61685, -104415, -179237, -172850, -135539, -62976, -9324, 50662, 99523, 85394, -13616, -24724, -60940, -110366, -196633, -173025, -76219, 24052, 50070, 71584, 84763, 62571, 59033, 93981, 9732, -34382, -32510, -65513, -69379, -46051, -48551, -12969, -24087, -8972, 6549, 12228, 46911, -4464, -56578, -100184, -120148, -85703, -118489, -121410, -91245, -96339, -91919, -15247, 38935, 101197, 79533, 77737, 71134, 35470, 7858, 31622, -36275, -55522, -67457, -80970, -51513, -24935, 12638, 16937, -52361, -88311, -53516, -28442, 2387, 18860, -30562, -29992, -78063, -107372, -146748, -140592, -42894, 7138, -60569, -102119, -158954, -177117]
13834a77117k653m0734M9989n757M5462P1669K7155L8308M0883M1756L2455k8797
13822I2619j2360l8287p238o0973l3769l0166M0388m2965J9222N4133n5724q5644
13810a60764P1517J49993N7295Q479n2123l0716o5328j661l1070L286L3095m8448
13798f6445n8324j1131K7888M9387j3332K4934K3233q4002j5452j3648k2593O1527
13786i7958J8029J8537j0712N0662M5317k3943Q110Q917p080M2076J4377l4113
13774C2219j0917J9985K3023j4416m7325m2524k7547J18576m2916n8992R9062
13763D8228K1427k7415k1748j2268m938p3980m2019M2709p1662k6400M1061N0410
13751g6595J1387K5844L6051N390J593Q19m6766P810M5160K5293l1868j0594K940
$$ y = [-177117, -179770, -220504, -170515, -176272, -130810, -59141, -31986, 6322, 47205, 88961, 121416, 92619, 80259, 41972, 34734, -26239, -60008, -90174, -49786, -92751, -73529, -19396, -75120, -160764, -89247, 60746, 118041, 126520, 74397, 43681, -21647, -23308, -54378, -51092, -17997, -66445, -124769, -135900, -108012, -58625, -71957, -47023, -23790, -107792, -123244, -136892, -159485, -97958, -79929, -61392, -72104, -21442, 23875, -68, 8042, 16959, 9879, 51955, 66332, 32219, 21302, 41287, 64310, 49894, 2569, -39955, -67502, 51074, 8158, -50834, 48228, 69655, 42240, 20492, 8224, 3286, -70694, -112713, -70004, -141666, -168066, -127005, -76595, -65208, -39364, -3313, 2077, 3670, 4489, -42277, -34467, 10693, 35986, 4118, -6476, -3536]
13738c536N3629k6928J2188j7431M9227J3046K750l4396M0566L1834N7023l9820
13726A38152j19532j19189O1153K5001m4012n3403M7154O9275N7225j06951q6969
13715a32096Q4172Q0231M3615j3684m2808k776K2345K5886j0346n8641p786o0628
13703g2516N6007J3393J5228l6986o4037M6117J6894J9450N1151n3461r6686n1477
13691a56923n8755M2897N6868M0905J8562j9264P2461Q8396M912p7856K8200J167
13679D1570k8491J0080j7464m2696J0793R3369L6384N969k5440k0167n5038J7447
13667B6316q317r5263j5146L0198J365O134R527M8972o5588r9751O1120k1653
13655a22086j1083L8782Q464K4964l8132O115k2725K3824L9446j6555q735N1078
$$ y = [-3536, 50093, 23165, 35353, 17922, 67149, 80195, 82945, 48549, 89115, 120949, 177972, 138152, 18620, -100569, -39416, -14415, -58427, -111830, -64676, 4599, 61824, -45127, -132096, -47924, 32307, 75922, 62238, 19430, 16654, 38999, 64885, 54539, -4102, -11888, -72516, -16509, -3116, 12112, -24874, -88911, -42794, -25900, -6450, 44701, -8760, -105446, -156923, -215678, -172781, -115913, -75008, -56446, -75710, -3249, 85147, 90059, 12203, 40403, 41570, 13079, 23159, 5695, -37001, -26208, 67161, 103545, 109514, 84074, 63907, 8869, 26316, 17999, -77264, -92410, -62212, -60847, -54713, -45186, 3786, -61802, -161553, -100433, -122086, -133169, -94387, -85923, -60959, -99091, -92976, -115701, -91877, -52431, -68986, -77721, -26643]
13643b6643M4684O5011P420l4965o1836P662m4135q4431l4769k9715L3474J7434
13631a40809K2632O4604Q9654l3789M128K7569n7402n4566l1600j9839J7265R86
13619a11167m894R715l5080L2981L431K4130L9118O0125J4658k2306P1981K1790
13607A04482o024o2482j8596k946o3652N3367N8152j2208l3022p0296j9233O8982
13595c476m9210q0087K7124L9822n600N451m5352n513K1905P0889l5908k9072
13583h9027k244j3827M1548K296N2112P7680L9389l3845m9018J4798m3512m4421
13571d8071J2881j606j9935n44K6322O2238J4516n826q762n9114l3130Q2336J50272
13558A71577K9821o0337q5929j9113l8083k4034K0926N9785j4413O2055R99o3176
$$ y = [-26643, 18041, 83052, 90472, 55507, -6329, 1333, -42802, -127233, -162002, -191717, -158243, -140809, -118177, -53573, 36081, 2292, 6420, 33989, -23413, -77979, -109579, -129418, -112153, -111167, -116061, -106346, -141426, -108445, -105014, -80884, -41766, 18359, 33017, 10711, 82692, 104482, 98458, 35976, 17380, 14434, -49218, 4149, 62301, 50093, 17071, -53225, -72458, -3476, -52686, -132773, -105649, -65827, -71427, -65976, -111328, -116841, -94936, -24047, -59955, -89027, -91271, -105098, -63550, -61254, -9142, 68538, 107927, 74082, 25064, 39862, -3650, -48071, -35190, -36796, -56731, -57275, -30953, 31285, 45801, 39975, 31213, -27901, -61031, 21305, 171577, 201398, 141061, 55132, 36019, -2064, -26098, -5172, 54613, 40200, 102255, 103254, 40078]
13546D0078j6771N4972J9205j3349k5724n5830l613M0029L9814K3034N1890J1550
13534A65285l4589r8229r9107l1303Q733L8118K2404M7857K2304M215K6573M2652
13522A14913m3613n5508r948J8828P2190P3955P9824Q7311J03910J2313q6478
13511C67697j37269r1986P097J00546l1873r4846O5353N9074p3558j02200k4117
13500D3918p5212l5175K345N8926J6092n421K7496J0533Q028o8165J1101K0919
13488A5385l8580P042o3271k2801R8089J01580r9859l3856O1835J6293K6770K7150
13476I5777J3398R498K1638l2442j8958N3321J27495N2114P1492o3091k5712K2578
13464C27108k7878k4967L1300Q3215M5808O5453n3411j65729r6382k3205J0421
$$ y = [40078, 23307, 78279, 97484, 84135, 58411, 2581, -1032, 38997, 78811, 101845, 153735, 165285, 130696, 32467, -66640, -97943, -89210, -51092, -28688, 19169, 41473, 45688, 72261, 114913, 71300, 15792, 5844, 24672, 96862, 170817, 250641, 337952, 441862, 454175, 367697, 230428, 138442, 145539, 246085, 214212, 119366, 184719, 243793, 170235, 68035, 43918, -31294, -66469, -64124, -5198, 10894, 5473, 32969, 43502, 51530, -16635, -5534, 15385, -23195, -16153, -79424, -102225, -4136, 97444, -2415, -36271, 25564, 41857, 68627, 95777, 109175, 118673, 140311, 107869, 88911, 142232, 269727, 321841, 393333, 330242, 304530, 327108, 299230, 274263, 305563, 388778, 434586, 500039, 446628, 280899, 184517, 161312, 171733]
13453A71733Q879n5969q6937o8150J3394O3161L0116N368o1199j2395R661J9006
13441C6668N5003l1667r9229K5456j1727L132o046j8476n8712o41O8475M6587
13429H823L6135O7463L2079P8176M1081l0078o864j3625m5567L564N3047P440
13417B31674k2457O4942Q1379n4k1161j12099r3740P0855K2172q5459m6274l1479
13405E8299k6920n0761l6901l2390J0797J09770P8952J9644L2341p3l6956K8327
13393A54129m671n6904l4645L9333O3574K6988K5578l9471k6299j3334k0275O5957
13381A79960O6967k3157K3287j1926l5241J6152K1053P770l5280m5764L0405l3221
13369A61005j1631K1419R0180M7197m88o4513q5643j1988l3992o8440m61J627
$$ y = [171733, 180612, 124643, 37706, -30444, -17050, 46111, 76227, 81595, 20396, 8001, 17662, 36668, 91671, 60004, -39225, -13769, -25496, -22364, -28410, -46886, -105598, -106239, -37764, 8823, 44958, 112421, 144500, 222676, 263757, 233679, 226815, 213190, 167623, 171187, 224234, 231674, 209217, 274159, 355538, 355484, 334323, 222224, 128484, 199339, 221511, 136052, 89778, 58299, 31379, -19382, -56283, -88673, -77876, 31894, 110846, 130490, 162831, 162758, 125802, 154129, 149458, 92554, 57909, 97242, 160816, 187804, 213382, 173911, 147612, 134278, 114003, 179960, 246927, 223770, 247057, 235131, 199890, 216042, 237095, 244865, 209585, 163821, 194226, 161005, 149374, 170793, 260973, 308170, 307682, 243169, 157526, 145538, 111546, 43106, 42645, 44272]
13357D4272l836l510L0551J9024l244p760l7707o3874J3210M3037m7215n6603
13345g3655Q2164Q9200K0083K2582K5676l6101m5664l4595N626p222N9774k4949
13333H2919k9708N9350o0228o3512j6575R2434P8811J8408o1738K4974j1052k4247
13321H9836L710M5284q1073k436K2264j0933L2546K4345J46691P4379K6954k7598
13309C43969r6187n0596l7616M0298M8082k1710j4031q0559m0201J8979J1529
13298A21957j2177l39l429L9742N4379j3202j7632n330j6470J5135K0566J0336
13286A93536P305N3664k71j9395L6066j6608q0236k6812j9158O2466n83J41416
13274C31390J12495l404j25777l7288k5150J563L7808M9836N2312Q423J12p3505
$$ y = [44272, 40436, 36926, 67477, 86501, 83257, 75497, 37790, -26084, -12874, 30163, -17052, -73655, 8509, 97709, 117792, 140374, 166050, 129949, 84285, 49690, 55316, 48094, 107868, 82919, 53211, 112561, 52333, -11179, -27754, 64680, 143491, 161899, 100161, 125135, 114083, 89836, 93546, 138830, 57757, 55321, 77585, 66652, 99198, 123543, 270234, 344613, 371567, 343969, 247782, 197186, 159570, 199868, 247950, 226240, 212209, 131650, 91449, 110428, 121957, 109780, 109441, 106012, 145754, 200133, 186931, 169299, 163969, 147499, 162634, 183200, 193536, 200841, 254505, 254234, 234839, 270905, 254297, 174061, 147249, 128091, 190557, 189974, 331390, 443885, 440481, 314704, 277416, 252266, 253829, 291637, 341473, 393785, 402208, 402320, 328815]
13262C28815j14044N6065P1075q8778k832r959n432J31019r061j05389M2364K9102
13250C22945N664K0456j9643l3524l2493l7181n279J2596M8193k4940K3321J8550
13238B98665n683K4380J32261n9638m1565K0796N4224o484k0809q4221j11824
13227B00102M9656L8731K8304M2765N3343j20667n2461l581M3823L8258j12427
13216B05846J8155M3847r428o3025j045J70669L8113m8468L4925O4105j7318o2377
13204C73999l2613q4346J0176L2160l4445m9381K6849J6465n1352p1177p387O1484
13192A90432J5648r0554j1636M0479Q7208L2155o2056K8547k9858p2557m3747
13181H4061P3557j928j6592Q777P0499l2818J3099K4734k5549M101j00805l6992
$$ y = [328815, 214771, 270836, 341911, 253133, 250301, 240342, 234910, 365929, 356868, 251479, 293843, 322945, 328609, 349065, 329422, 295898, 263405, 226224, 220945, 233541, 281734, 256794, 280115, 298665, 292982, 317362, 449623, 389985, 348420, 369216, 423440, 416956, 396147, 311926, 200102, 249758, 288489, 316793, 359558, 412901, 292234, 239773, 236192, 280015, 318273, 205846, 224001, 267848, 258420, 195395, 194350, 365019, 403132, 354664, 389589, 453694, 436376, 373999, 341386, 257040, 267216, 299376, 264931, 215550, 242399, 258864, 207512, 136335, 128948, 190432, 206080, 115526, 103890, 144369, 231577, 263732, 201676, 230223, 200365, 127808, 84061, 157618, 155690, 139098, 147875, 218374, 185556, 198655, 223389, 197840, 201941, 101136, 64144]
13169F4144Q5001L6721L8876J4419L1171k273q104m4800K8928J3472q2946O2103
13157B36712L5962K1179O0430k6243n5971m3068M4013O6030J3229m1849J7861
13146C28285j1271m9331K9151M728o1638J9415n0601l053J5450J014L2976j1600
13134B43525k2988q459L6852J04413O1037q8189j4153J08293J5515j6737O2478
13123D81587j3191p6568n7256N6305N8474K1426M8170K484Q0475J34450J63737
13112I00093K30965K57873K94153J96527M2132q3018k14506k67708k38691j80307
13102I37513m8360j5464n7929r1542j14245J02993N9037L5065K3475R6901O7943
13091I95387M2684R2206L4915L8298O2364J23909Q6962J31475O1343J11023J15042
$$ y = [64144, 149145, 185866, 224742, 239161, 270332, 268059, 259955, 215155, 244083, 257555, 174609, 236712, 272674, 293853, 354283, 328040, 272069, 229001, 273014, 339044, 352273, 310424, 328285, 317014, 267683, 296834, 301562, 239924, 259339, 208738, 205685, 221135, 222149, 255125, 243525, 220537, 212078, 248930, 353343, 414380, 326191, 312038, 420331, 435846, 419109, 481587, 468396, 391828, 334572, 390877, 449351, 470777, 518947, 521431, 601906, 736356, 900093, 1131058, 1388931, 1683084, 1879611, 1921743, 1838725, 1624219, 1356511, 1117820, 937513, 889153, 873689, 815760, 724218, 609973, 712966, 772003, 807068, 830543, 927444, 995387, 1038071, 1130277, 1165192, 1203490, 1265854, 1389763, 1476725, 1608200, 1669543, 1780566, 1895608]
13080A895608K10344J90346M6398q4257j78352k20400j64565n1574p5929o4039
13070A503580N1882N857r5375j49864j39701k1367j9577n7806K3296J9107R424
13059A129456n5198l1421m7645L4652K3182o4478M6476Q5488J48034J76897L41066
13048A786509K79207K06676P932j46499k71535k02408j59246j66210j24807n2626
13038A156993j03898J8737r6915r1710K6394l8588l6534p2714m8786n1383l6374
13027F25222N260J2846o6371m0742q163K6220L7963J9933j0629q3760l3145R40
13015D85574n179R7723O8452k3238q6500l6247p011K4983j7780k1302K9935L8723
13003E48133l8892p6916l5168k8566l9832j0467K3224j4543p56l9841M5984N0595
$$ y = [1895608, 2105952, 2296298, 2342696, 2258439, 2080087, 1859687, 1695122, 1643548, 1567619, 1503580, 1555462, 1561319, 1465944, 1316080, 1176379, 1155012, 1135435, 1077629, 1100925, 1120032, 1129456, 1074258, 1042837, 995192, 1029844, 1053026, 988548, 1035024, 1120512, 1268546, 1445443, 1786509, 2065716, 2272392, 2280324, 2133825, 1862290, 1659882, 1500636, 1334426, 1209619, 1156993, 1053095, 1071832, 974917, 883207, 909601, 871013, 834479, 761765, 712979, 661596, 625222, 630482, 643328, 576957, 536215, 528052, 554272, 592235, 612168, 601539, 517779, 484634, 485574, 480395, 578118, 646570, 623332, 536832, 500585, 493574, 518557, 500777, 479475, 509410, 548133, 509241, 432325, 397157, 368591, 328759, 318292, 341516, 326973, 326217, 286376, 332360, 382955]
12991C82955n6722q865j6409P2661Q483k8333k5528q5566l781K5770L9183o9861
12979B33987j7690J57127J3186p1581M1905k2685p8891q1454L4101J28614n5597
12968B81022m6992k8077j3768R5873M5860m7198k2509m98L1840M0785J3283l2783
12956C16838L3731n8745J2803q039l7534M7333L5107K0390j4399K2707l9500m7318
12944B83374N780J3443J3348j5433r0470o244M4629K7024j4701O3185M4709M2533
12932D11177l2136r2020J7620O1478j7644k5114L5076N5820L7232L5151K2146
12921E08786K0561K6610n4012M5840P331J5673J43959J29623n728j41891q5937
12910F10815m1671j5426r276j4373P835N115J0342M4449l4798j13877L9018M3861
$$ y = [382955, 326233, 317368, 300959, 373620, 382103, 353770, 328242, 242676, 238895, 264665, 303848, 233987, 216297, 373424, 386610, 315029, 356934, 334249, 255358, 173904, 208005, 336619, 281022, 234030, 205953, 192185, 288058, 333918, 286720, 264211, 263713, 295553, 336338, 349621, 316838, 350569, 291824, 304627, 296588, 259054, 306387, 341494, 361884, 347485, 370192, 330692, 283374, 289154, 302597, 315945, 300512, 210042, 203798, 248427, 275451, 260750, 323935, 368644, 411177, 379041, 287021, 304641, 366119, 348475, 323361, 358437, 414257, 451489, 486640, 508786, 529347, 555957, 501945, 547785, 555116, 570789, 714748, 844371, 838643, 696752, 610815, 569144, 553718, 544442, 530069, 537904, 543019, 553361, 597810, 563012, 449135, 488153, 532014]
12898E32014o55K0503M7170Q417k3954K5310L8973K3177L9762K8940j5885j9351
12886G04421p3659p3884L2370J7118K305K4243p3958n873O8950J7398J6242n866
12874F49807M7996m476o5201j16059M197Q2753j0576N6630N4349Q3712J1269o6076
12862G28325j97453k7184P181J17166J29093q0644j9963L7246M3205N9459N3898
12851H50329J61475J43744J26869m2039k9951N8599j8545n1726n5549N9931O4011
12840A267148p0192j77196q9480j6294l0495M1180N1897L9021K294k5806l9445
12829I52632o9581Q1837J43299M7496L3023K1994J4338M586O0542Q5486J13018
12818A488670O8640J5332j00134p1406q4438l2162M2014m7730J0252m4850J4535
$$ y = [532014, 531359, 551862, 599032, 607449, 583495, 608805, 647778, 670955, 710717, 739657, 723772, 704421, 630762, 556878, 589248, 606366, 608671, 632914, 558956, 553083, 622033, 639431, 655673, 649807, 697803, 693327, 628126, 512067, 516264, 599017, 588441, 645071, 699420, 783132, 794401, 728325, 530872, 503688, 510869, 628035, 757128, 676484, 656521, 693767, 736972, 796431, 850329, 1011804, 1155548, 1282417, 1240378, 1210427, 1269026, 1250481, 1198755, 1143206, 1203137, 1267148, 1196956, 1019760, 930280, 913986, 883491, 924671, 976568, 1015589, 1017883, 992077, 952632, 883051, 964888, 1108187, 1155683, 1188706, 1210700, 1225038, 1229624, 1290166, 1375652, 1488670, 1557310, 1572642, 1472508, 1401102, 1316664, 1284502, 1326516, 1278786, 1289038, 1244188, 1258723]
12807A258723m8013l537J6893O621o5479L6015M9376N5673N1463l6276q3135K6346
12795A264670J52115J36831J01293R0062J37032J50141K66108K47932K25943K22540
12785B994667J37117p8604j43191j12120m2285m2916l9628l3828o8228n2064o0330
12774B458590J0800m6634r3380m6075p3532m4898L5647J40156J24282J36904L7161
12763B639021O6204R9303J63193P8623O5880N8208m23L1662k6457P4602Q5809
12752C335625J17284J17096J39394O3814j3562k6966o5203j6250n0452j4022O5316
12741C652074l3767q4586m7835J3999L9587j786p573n0302j4939P8083J00432
12730C643387J11965Q2444J83933J20401J34512J21693k1085k4904Q9652J44068
$$ y = [1258723, 1210710, 1207173, 1224066, 1230687, 1165208, 1201223, 1250599, 1306272, 1357735, 1321459, 1238324, 1264670, 1416785, 1553616, 1654909, 1744971, 1882003, 2032144, 2298252, 2546184, 2772127, 2994667, 3131784, 3053180, 2909989, 2797869, 2755584, 2712668, 2673040, 2639212, 2570984, 2518920, 2458590, 2469390, 2422756, 2329376, 2283301, 2209769, 2164871, 2200518, 2340674, 2464956, 2601860, 2639021, 2705225, 2804528, 2967721, 3046344, 3112224, 3170432, 3170009, 3201671, 3175214, 3249816, 3335625, 3452909, 3570005, 3709399, 3773213, 3759651, 3732685, 3667482, 3651232, 3600780, 3586758, 3652074, 3618307, 3533721, 3485886, 3499885, 3539472, 3537686, 3530113, 3479811, 3464872, 3542955, 3643387, 3755352, 3837796, 4021729, 4142130, 4276642, 4398335, 4377250, 4352346, 4441998, 4586066]
12720D586066J84940J35913R8932R5553k462J8421N2527K5126J00682J20352K37755
12709E653805K45144J78101K84300L98928N90796P87622J005043J130657J257742
12700A1532138J209240Q27756L10580j19948m46841o21467o02913m57748l70957
12691A1259840k23830R005K41858L59675M97906O92272R28635J136456J259129
12682A6160946J353428J521785J876321K394752K755753L147195L556315L389764
12674C6156259L062231K614613K203511K138261K472731K966125M037730N991504
12666F1642965Q839674J3251091J9567946K8203102L8479824M7291669M8863475
12659B66139746L6967697J1815592j6879952l5242087l9228011l4304103k6322321
$$ y = [4586066, 4771006, 4906919, 5005851, 5101404, 5098942, 5117363, 5169890, 5195016, 5295698, 5416050, 5653805, 5898949, 6077050, 6361350, 6760278, 7351074, 8138696, 9143739, 10274396, 11532138, 12741378, 13569134, 13879714, 13759766, 13312925, 12691458, 12088545, 11630797, 11259840, 11036010, 11045015, 11286873, 11646548, 12144454, 12836726, 13765361, 14901817, 16160946, 17514374, 19036159, 20912480, 23307232, 26062985, 29210180, 32766495, 36156259, 39218490, 41833103, 44036614, 46174875, 48647606, 51613731, 55651461, 61642965, 70482639, 83733730, 103301676, 131504778, 169984602, 217276271, 266139746, 303107443, 314923035, 298043083, 262800996, 223572985, 189268882, 162946561]
12652A62946561j8685204j2337755p445001l806048r53212J576799L988563O053030
12644A31337733P254868O872715M803980K970841L516894P168762J2998455J9174610
12636A96098858K3896674K5640264K4991385K4281452K6334941L1354270L4410094
12629C87007938K8595977R455802j7140251l5874364l8675317l0827457k0070068
12622B82472260j0557074l774729l34022j54710l059474p864274j2504246j4443412
12614B29780319j2680687q749802n073002l732118m958316p414720q854669p635752
12606A70681253m628612j065620L277361R574569J8106817K9371076M2303912
12599B67620756N3692242N7704198M7997944K2134378j4074487m5254078n7401266
$$ y = [162946561, 144261357, 131923602, 124478601, 120672553, 119719341, 121296140, 125284703, 131337733, 138592601, 145465316, 150269296, 153240137, 156757031, 163925793, 176924248, 196098858, 219995532, 245635796, 270627181, 294908633, 321243574, 352597844, 387007938, 415603915, 425059717, 407919466, 372045102, 333369785, 302542328, 282472260, 271915186, 268140457, 267806435, 267651725, 264592251, 256727977, 244223731, 229780319, 217099632, 208349830, 203276828, 199544710, 194586394, 187171674, 178317005, 170681253, 166052641, 164987021, 168264382, 177838951, 195945768, 225316844, 267620756, 321312998, 379017196, 427015140, 449149518, 435075031, 389820953, 332419687]
12592C32419687n2009738m1007820l0618222k2068459j5970356j2070950r783561
12585A48890581q488144p676857p083769o306671n393650m697808m229793l796759
12577A01217130l540762l595039l593195l509122l279579k900837k547939k284101
12569G5966556j873354j795389j786798j723505j659972j542307j387593j053707
12561F3143931n66723p6106K14995O51662R94116J094781O71261j84203j318713
12552F4625001k275808k758344k918634k938304k789821k366151k008214j860002
12544D4709723j547141j296399j157065r55704q00369q83721q28293q91385q80529
12535C5469117q75865p97149o85615o51125p76386p23231o64889o80903o42195
$$ y = [332419687, 280409949, 239402129, 208783907, 186715448, 170745092, 158674142, 148890581, 140402437, 132725580, 125641811, 119335140, 113941490, 109243682, 105013889, 101217130, 97676368, 94081329, 90488134, 86979012, 83699433, 80798596, 78250657, 75966556, 74093202, 72297813, 70511015, 68787510, 67127538, 65585231, 64197638, 63143931, 62577208, 62501102, 62716097, 63367759, 64361875, 65456656, 66127917, 65943714, 64625001, 62349193, 59590849, 56672215, 53733911, 50944090, 48577939, 46569725, 44709723, 43162582, 41866183, 40709118, 39753414, 38953045, 38069324, 37241031, 36349646, 35469117, 34593252, 33796103, 33110488, 32459363, 31682977, 30959746, 30294857, 29613954, 28971759]
12526B8971759n22513n48393n11256m82028n46323n72659m81046m44636l89486
12517B4473419l56440m07085m03782l74689l29806l52562m24329l46817k86724
12508B1191185l86074l48419k80380k14859k01505k14675k48332j99511k30687
12499A8866743l43096k82389k58193k67996l59932k67509k80863l13750k36838
12490A6256177k15154k89841k81916k61004k11264k08578j83491j98266k12074
12481A4194589j69570j48586m5048M4867J39335N4355k0603j3824j29212k55122
12471A3651181k85649l59508l56963l43385k06559j77891j89399k51677k05786
12462A1274364k76579k50718k71588k54955k40034k57304j33321j17925k20558
$$ y = [28971759, 28449246, 27900853, 27389597, 26907569, 26361246, 25788587, 25307541, 24862905, 24473419, 24116979, 23709894, 23306112, 22931423, 22601617, 22249055, 21824726, 21477909, 21191185, 20805111, 20456692, 20176312, 19961453, 19759948, 19545273, 19296941, 19097430, 18866743, 18523647, 18241258, 17983065, 17715069, 17355137, 17087628, 16806765, 16493015, 16256177, 16041023, 15751182, 15469266, 15208262, 14996998, 14788420, 14604929, 14406663, 14194589, 14025019, 13876433, 13831385, 13876252, 14015587, 14069942, 14049339, 14035515, 13906303, 13651181, 13365532, 13006024, 12649061, 12305676, 12099117, 11921226, 11731827, 11480150, 11274364, 10997785, 10747067, 10475479, 10220524, 9980490, 9723186, 9589865, 9471940, 9251382]
12453I251382k09007j48161j35163j66028j71973k14822k08904j90831j38929
12444G667564k16982j81877p4970k42951j73643r8112j82609r8520k4600K2347
12434F395647k0579j21288l3282O8215O32q9379j14568j07110o6397J230p9892
12423E833229j83205j24819n4800O223r3671n5461o6300j13571m4788p1858j04924
12412D926055j89684j47552j05733j82656j64800j06148o3261j67612K6639P2508
12402C897756O0175J19806P5839L0733m4867j06270n8630L9227K940r1493q9316
12391C835900k8154m7734J7348M4671j1797r8288j28056n9196r0084n3311L9894
12380C421193o8741o8197R22k3999o2956o3548j5511l6636j8650l7038p8020j12196
$$ y = [9251382, 9042375, 8894214, 8759051, 8593023, 8421050, 8206228, 7997324, 7806493, 7667564, 7450582, 7268705, 7193735, 6950784, 6777141, 6679029, 6496420, 6397900, 6373300, 6395647, 6375068, 6253780, 6220498, 6288713, 6289345, 6199966, 6085398, 5978288, 5911891, 5913121, 5833229, 5650024, 5525205, 5470405, 5476628, 5382957, 5327496, 5261196, 5147625, 5102837, 5030979, 4926055, 4736371, 4588819, 4483086, 4300430, 4135630, 4029482, 3966221, 3798609, 3825248, 3897756, 3957931, 4077737, 4153576, 4184309, 4139442, 4033172, 3974542, 4013769, 4016709, 3925216, 3835900, 3807746, 3760012, 3777360, 3822031, 3810234, 3711946, 3583890, 3524694, 3434610, 3381299, 3421193, 3352452, 3284255, 3285177, 3261178, 3198222, 3134674, 3119163, 3082527, 3063877, 3026839, 2948819, 2836623]
12368B836623p2513l1543j288J103M4243M0885N7493l4878L8888Q5543P4277P7071
12356C115904J21737M5400l0776j30007k06809j32284j43079r1657m5336o5265
12346B437828N0207k6898r215k7129j9073j1209k9605k3372m2318l5416m6034
12335B217766K0163Q8350J912j5752J1957l7021K9929K4448Q7185J57191O1622
12324B647750l3722j8166J7074k3162j02913p3419n6105o6424o5256j05399m1847
12313B078411o4004n7439j1226J13777j01K3861M7936k6127K0341M072Q3952J23795
12301B337248R6277R0718J73767K17813J72905J66961K59595K99640L49327K51058
12291D415309K20390R6701q101M9635j6793j62678k42235k27476j41947p9301
$$ y = [2836623, 2764110, 2732567, 2731279, 2732382, 2776625, 2817510, 2875003, 2840125, 2879013, 2964556, 3038833, 3115904, 3237641, 3283041, 3252265, 3122258, 2915449, 2783165, 2640086, 2548429, 2503093, 2437828, 2488035, 2461137, 2451922, 2424793, 2405720, 2394511, 2364906, 2341534, 2299216, 2263800, 2217766, 2237929, 2326279, 2328191, 2312439, 2324396, 2287375, 2317304, 2341752, 2428937, 2586128, 2647750, 2614028, 2595862, 2612936, 2589774, 2486861, 2413442, 2357337, 2290913, 2225657, 2120258, 2078411, 2014407, 1956968, 1945742, 2059519, 2059418, 2083279, 2131215, 2105088, 2125429, 2129501, 2213453, 2337248, 2433525, 2524243, 2698010, 2915823, 3088728, 3255689, 3515284, 3814924, 4164251, 4415309, 4635699, 4732400, 4724299, 4773934, 4757141, 4594463, 4352228, 4124752, 3982805, 3903504]
12281C903504k4967k21854k01617o9797p3166n9204r517K1067N6716m1679M3866
12270C323352j96J08494J36848J11840N3627R6000J49575j179M1546L1295L4559
12259D085761L8321J41437R3953M690n6293m2389n4980K127M606N5393r3926j87959
12247C990741j23627R8837j2378q9521r739j1890O465r8053r3136P1524J23050
12236C852273K01827J41716L6379Q3142J51607R6726p1089M1782O8231J8157K8871
12225D649622K1390J4386O5787N2158L3700m1183J4582L8440N5338o8542o7874
12214D767804K9194P2435L9391l2178P4222J60038J76875O2065J10136J10714
12204E570696J41911J90864K30820J40246K13053K78015L75625L83802L93153
$$ y = [3903504, 3878537, 3656683, 3455066, 3385269, 3312103, 3252899, 3243382, 3264449, 3321165, 3279486, 3323352, 3323156, 3431650, 3568498, 3680338, 3733965, 3829965, 3979540, 3978361, 4019907, 4051202, 4085761, 4124082, 4265519, 4359472, 4364162, 4307869, 4265480, 4210500, 4212627, 4217233, 4272626, 4178700, 3990741, 3867114, 3965951, 3953573, 3864052, 3854313, 3842423, 3848888, 3750835, 3657699, 3729223, 3852273, 4054100, 4195816, 4232195, 4315337, 4466944, 4563670, 4492581, 4534363, 4602594, 4620751, 4649622, 4671012, 4685398, 4751185, 4803343, 4837043, 4795860, 4810442, 4848882, 4904220, 4835678, 4767804, 4796998, 4869433, 4908824, 4876646, 4950868, 5110906, 5287781, 5349846, 5459982, 5570696, 5712607, 5903471, 6134291, 6274537, 6487590, 6765605, 7141230, 7525032, 7918185]
12195G918185M20550M06668M36899N20922O96172P81525P64556Q88450J059919
12186A3893846J113228J292123J526185J729779J868699K030548K304810K618091
12178B8377309K987610L582432M714808O419704Q923675J2729710J8691177K7241351
12170A13667776L8246068N0524734N9681270N8748377M2526771J2943875j9370944
12163C56967927m1379470m8481758m3802852l3634665k2867041j3866306p265552
12156A45670283k545488Q74195K917729K991602J191188j314212k168735m41997
12148A47174565L502567Q499569J3438098J7388471J8204942J4618285P764243
12141B30590740J822654J068189P238423J8385662L0400479L9080119M0663068
$$ y = [7918185, 8338735, 8745403, 9182302, 9703224, 10399396, 11180921, 11945477, 12833927, 13893846, 15007074, 16299197, 17825382, 19555161, 21423860, 23454408, 25759218, 28377309, 31364919, 34947351, 39662159, 46081863, 55005538, 67735248, 86426425, 113667776, 151913844, 202438578, 262119848, 320868225, 363394996, 376338871, 356967927, 315588457, 267106699, 223303847, 189669182, 166802141, 152935835, 145670283, 143124795, 143998990, 146916719, 149908321, 151099509, 149785297, 147616562, 147174565, 150677132, 159176701, 172614799, 190003270, 208208212, 222826497, 230590740, 232413394, 233481583, 240720006, 259105668, 289506147, 328586266, 369249334]
12134C69249334L2587570J6441439k173552j6180112k2468600k4171274k5075636
12127C28209169k6452328k7394907k6458028k3090771j7761421j2050524p058896
12120A87942294l673406k698324m090298o858137q833723q384401n893174k496148
12112A45014683J104949M791121Q992392J4304396K1312200K9468094L7377966
12105B62365801M1593344L6806835J9436228o974026l0540301m1477450m0430980
12098B40779451l3659407k6087361j9859975j5110771j1941412r826893q496324
12091A15797308p462226o426071n470430m540106l942899l412383l092960k860481
12083G8589752k623494k466958k152940j792982j501449j129143q45679n67759
$$ y = [369249334, 401836904, 418278343, 416104791, 399924679, 377456079, 353284805, 328209169, 301756841, 274361934, 247903906, 224813135, 207051714, 195001190, 187942294, 184268888, 181570564, 177480266, 170622129, 161788406, 153404005, 147510831, 145014683, 146119632, 150910753, 159903145, 174207541, 195519741, 224987835, 262365801, 303959145, 340765980, 360202208, 353228182, 322687881, 281210431, 240779451, 207120044, 181032683, 161172708, 146061937, 134120525, 124293632, 115797308, 108335082, 101909011, 96438581, 91898475, 87955576, 84543193, 81450233, 78589752, 75966258, 73499300, 71346360, 69553378, 68051929, 66922786, 66077107, 65509348]
12075F5509348k36026Q788J85285k5924l94350r12829j499594k224467k604659
12066E7805572k617223k486723k296373k050785j846802j548980j243735j315162
12058D2399789j195665j078825r97905r67336r34494q36774q13657q05807p38403
12049C4030923o07632o35772o11653o04504o03449m98707m31437m71850n18906
12040B9047013m73306m20033m21737n92315n49248n13506m58493n03185n32357
12031B4582833n11794m41428m46689l92572l63784l83531l34577k42209l15616
12022B1150633l17185k65462k61261l16005l98464l34980j56197j20896k64067
12013A8716116k52867k89934k69594j45477k63446j62300j74519j92325k09558
$$ y = [65509348, 65273322, 65282110, 65467395, 65441471, 65047121, 64134292, 62634698, 60410231, 57805572, 55188349, 52701626, 50405253, 48354468, 46507666, 44958686, 43714951, 42399789, 41204124, 40125299, 39127394, 38160058, 37225564, 36388790, 35575133, 34769326, 34030923, 33423291, 32787519, 32175866, 31571362, 30967913, 30469206, 30037769, 29565919, 29047013, 28573707, 28153674, 27731937, 27139622, 26590374, 26076868, 25618375, 25115190, 24582833, 24071039, 23629611, 23182922, 22790350, 22426566, 22043035, 21708458, 21466249, 21150633, 20833448, 20567986, 20306725, 19990720, 19592256, 19257276, 19101079, 18980183, 18716116, 18463249, 18173315, 17903721, 17758244, 17494798, 17332498, 17157979, 16965654, 16756096]
12004A6756096k23843l32624l26664k38807k36805k63408k93895l15865k62732
11995A4261453k63829l61631k53192k12426j58175m7956j25005k27942k25547
11986A2385750j31601j14055k49719j60224q1076j68819j66891k19137l02690
11977A0791538j95031j62357k23598j02493j30959j00999l9035j75894k07614
11968I453558j61465j70420j96597j81132j77044j45381j12896j06403j44135
11959H058085k20532k38077p1217o1043j24232j30193k27142j71279j08444j6516
11949F689410j31931j92663k04253k89719j16446j13917j41423p9035n9601L5216
11939E395638K9719o6799n1659j342j581p2018l9513k0084l5886k0454o4664q3429
$$ y = [16756096, 16532253, 16199629, 15872965, 15634158, 15397353, 15133945, 14840050, 14524185, 14261453, 13997624, 13635993, 13382801, 13170375, 13012200, 12964244, 12839239, 12611297, 12385750, 12254149, 12140094, 11890375, 11730151, 11649075, 11480256, 11313365, 11094228, 10791538, 10596507, 10434150, 10210552, 10108059, 9977100, 9876101, 9837066, 9661172, 9453558, 9292093, 9121673, 8925076, 8743944, 8566900, 8421519, 8308623, 8202220, 8058085, 7837553, 7599476, 7528259, 7467216, 7342984, 7212791, 6985649, 6814370, 6705926, 6689410, 6557479, 6364816, 6160563, 5870844, 5754398, 5640481, 5499058, 5420023, 5360422, 5395638, 5425357, 5358558, 5306899, 5305557, 5303976, 5231958, 5192445, 5172361, 5136475, 5116021, 5051357, 4967928]
11927D967928o9922j12585j34054n776n561j46036j17446j16058o1960p1684j28936
11916C997910j44027j69038j30892l1618l7209K3684Q1374j4824R997M6664O220
11905C638241m4398o073J9251K7437o0063r3229m5800m6702p0971j8470o1732
11894C237491r6480k2954o5893k0983l4380n7218J523j5048l7564j7601k2744
11883B848149k6619q291j00563o828L5994l2834m3943m4599o7550J453m8741m1737
11871B463891m9934j1181n7932J9950J7030R440n466o417j14796L264k0924j7063
11859B229862o3798L3477p4000m6534K2232K6661k2320J6599k2377o6175O1767
11848B095394R4114q942n0044l7668k6111k072k6952Q1856N0159M136K6289k1183
$$ y = [4967928, 4898006, 4785421, 4651367, 4645591, 4640030, 4493994, 4376548, 4260490, 4198530, 4126846, 3997910, 3853883, 3684845, 3553953, 3522335, 3485126, 3508810, 3590184, 3575360, 3585357, 3632021, 3638241, 3593843, 3587770, 3607021, 3634458, 3574395, 3481166, 3435366, 3388664, 3317693, 3299223, 3237491, 3141011, 3118057, 3052164, 3031181, 2996801, 2939583, 2941106, 2926058, 2888494, 2870893, 2848149, 2821530, 2813239, 2712676, 2705848, 2741842, 2709008, 2665065, 2620466, 2552916, 2554369, 2505628, 2463891, 2413957, 2402776, 2344844, 2364794, 2381824, 2391264, 2385798, 2379381, 2264585, 2267849, 2246925, 2229862, 2166064, 2199541, 2125541, 2079007, 2101239, 2127900, 2105580, 2122179, 2099802, 2033627, 2095394, 2189508, 2180566, 2130522, 2092854, 2066743, 2064671, 2037719, 2119575, 2169734, 2173870, 2200159, 2178976]
11836B178976M7173k0583J5726Q3118Q0696J44130O0817N3386l889K6671L7196
11825B703417Q5282R3563R5797J20158J85001K08464K80203K67322K85961L19377
11815D644545L77489N07152O24046P74282Q27210R32581J069175J245585J258924
11806A2260989J350521J277279J026501P39616L14333n3284m56317n46755o03378
11797A5309505o26884m60119m07863k56499j85718L2297K02430K35319L96129
11788A4238597L87372L16618L32393L62758L91294M55499M49980M64703M78336
11779A7877550N30082O05556O54185N85265O00914N23658L77188J12081q0837
11770B1785642k31617l52882m07745m47169n25314m80661m87091m71271m23828
$$ y = [2178976, 2226149, 2205566, 2221292, 2304410, 2385106, 2529236, 2590053, 2643439, 2639550, 2666221, 2703417, 2788699, 2882262, 2978059, 3098217, 3283218, 3491682, 3771885, 4039207, 4325168, 4644545, 5022034, 5529186, 6153232, 6927514, 7754724, 8687305, 9756480, 11002065, 12260989, 13611510, 14888789, 15915290, 16654906, 16969239, 16915955, 16459638, 15912883, 15309505, 14682621, 14222502, 13814639, 13558140, 13372422, 13404719, 13607149, 13842468, 14238597, 14625969, 14942587, 15274980, 15637738, 16029032, 16484531, 16934511, 17399214, 17877550, 18407632, 19013188, 19667373, 20252638, 20853552, 21377210, 21754398, 21866479, 21785642, 21554025, 21201143, 20793398, 20346229, 19820915, 19340254, 18853163, 18381892, 17958064]
11761A7958064m69546m05669l79043l90566m33153l45059l58004l36401r278j9379
11751A4811966P5027L17242L84786M42298M72432N32460M65616K91764O4673k28963
11741A7629301m76185p74310q16932q09304r30728q41661p26539p32904n90773
11732A0929965l75215k51889j39539k24992k86781m64223n86169m77999m49410
11723G673748l64430l97492k54581j78474k14391j43894j97713j52818q1824j02467
11713E585664j42008j02412j29108j07812J3573j3287j7616L7791Q5358J5998
11703E226141n5360L7550N9700K4101m2746k762L4237n3356j18732j11216j64004
11692D833553j87797j98370j25412j88850j74698n8756j16432j27757q1945l2901
$$ y = [17958064, 17488518, 17082849, 16703806, 16313240, 15880087, 15535028, 15177024, 14840623, 14831345, 14811966, 14886993, 15204235, 15589021, 16031319, 16503751, 17036211, 17501827, 17793591, 17858264, 17629301, 17153116, 16378806, 15561874, 14752570, 13821842, 12980181, 12253642, 11520738, 10929965, 10554750, 10302861, 10163322, 9938330, 9651549, 9187326, 8601157, 8123158, 7673748, 7309318, 6911826, 6657245, 6478771, 6264380, 6120486, 5922773, 5769955, 5688131, 5585664, 5443656, 5341244, 5212136, 5104324, 5117897, 5104610, 5086994, 5124785, 5210143, 5226141, 5170781, 5208331, 5268031, 5292132, 5249386, 5246624, 5280861, 5227505, 5108773, 4997557, 4833553, 4645756, 4447386, 4321974, 4133124, 3958426, 3899670, 3783238, 3655481, 3573536, 3540635]
11682C540635k0631n7621l7899k2596q9032r7362K2770K7094J8299m1798l1633
11671C210226L3756J06075J77743J60340R1408L5119j9666j16632j92170l32793
11661C153406k60895j97743j35611j21414n8692o9252q0802k2823j4342l3865
11651B157967K6772k7630r1914p4326l2094K9832J9908j5304o3855J6546J238
11640A947140n3777n9050l8428l6971N1184j5938j34251n7908r6100l4135M3584
11629A515350O1801l207p6056j26176j06495k8246J00886L9246p2048m3380K5417
11618A287092k1724m3683k2238k1673j32240l1954J04872P3976M4166N6895p2931
11607A220558j32414o6737p7805n6305j9767K2501K1433o4138n8350K8679n9362
$$ y = [3540635, 3520004, 3462383, 3424484, 3401888, 3312856, 3215494, 3238264, 3265358, 3283657, 3241859, 3210226, 3243982, 3350057, 3527800, 3688140, 3779548, 3814667, 3795001, 3678369, 3486199, 3153406, 2892511, 2694768, 2559157, 2437743, 2379051, 2309799, 2228997, 2206174, 2191832, 2157967, 2184739, 2157109, 2065195, 1990869, 1958775, 1988607, 2008515, 1993211, 1929356, 1945902, 1947140, 1893363, 1834313, 1795885, 1758914, 1810098, 1794160, 1659909, 1602001, 1505901, 1471766, 1515350, 1577151, 1573944, 1497888, 1371712, 1265217, 1236971, 1337857, 1377103, 1305055, 1261675, 1287092, 1265368, 1221685, 1199447, 1177774, 1045534, 1013580, 1118452, 1192428, 1236594, 1293489, 1220558, 1088144, 1021407, 943602, 887297, 867530, 890031, 911464, 847326, 788976, 817655, 758293]
11596G58293n743P4021M007M835l0263j6417j2583J7693M7985N0523m3847q2445
11584G66059o1521j499j0418k8464N6260K9236p0704j0074K7690n1800n7539K2486
11572F09712O4191N616o565n5348m1965p5601j4042L7371L1151J20043o5r2449
11560E82049l1466J9405L919J5984J1083p838j0826K2444j7707k7548k6691p1877
11548D60931o1580o953k8044l0556k2310J6587K6220j8503m652k2455l2840M8176
11536C24021P9357k739j3903j1972J5766K5836k593N284M918K4338j0961l0883
11524D06469m8304L1470k8379j6843L7924o4337q989K3225P8474K2595k4112k5312
11512C83881l3544m053J4432o2754J2498r224L768J7801M0029K4405m9776p251
$$ y = [758293, 752550, 826571, 830578, 835413, 805150, 788733, 776150, 793843, 841828, 892351, 848504, 766059, 704538, 703039, 692621, 664157, 720417, 749653, 678949, 668875, 696565, 644765, 587226, 609712, 673903, 679519, 672954, 617606, 575641, 500040, 485998, 523369, 554520, 674563, 674498, 582049, 550583, 569988, 573907, 589891, 600974, 593136, 582310, 604754, 587047, 559499, 532808, 460931, 399351, 392398, 364354, 333798, 311488, 328075, 354295, 335792, 331140, 308685, 275845, 324021, 403378, 400639, 386736, 374764, 390530, 416366, 413773, 419057, 423975, 448313, 437352, 406469, 358165, 389635, 361256, 344413, 382337, 318000, 309011, 332236, 410710, 433305, 409193, 383881, 350337, 346284, 360716, 297962, 310460, 301236, 305004, 322805, 362834, 387239, 337463, 330212]
11500C30212J5087j5256m3380r193N7594K3886n4997L265l2373J5883M8391j4035
11488C25084J2218l4480j7200L333j0488k8122k5465k9815L4503O2127M1329N7338
11476C90362j8404m2769M6012r5328j0223R215j4273Q553N0036K5921m9589l7534
11464B61979Q0244j8634o0194J1467K3511m6924J2664L8183q7165M0929k1979
11453B34081r497M4650J1535J9412n4931n4420k472O7755J5025l8513p9322N5602
11441B08905R4593p9109k8704l6781J8849N6178N2398j8520o0205P76K114K791
11429B13285m3174M70J7462J7026K726n2180o7155J5680N0387k7879M5761L3183
11417B05592k3744k6437q095O07k9109K019Q3894J07867q1238o9468M9525j3102
$$ y = [330212, 345299, 330043, 286663, 277470, 335064, 358950, 303953, 307218, 274845, 290728, 339119, 325084, 337302, 302822, 285622, 288955, 278467, 250345, 224880, 195065, 229568, 291695, 333024, 390362, 371958, 329189, 375201, 279873, 269650, 278865, 264592, 273145, 323181, 349102, 299513, 261979, 342223, 323589, 263395, 274862, 298373, 251449, 264113, 302296, 215131, 256060, 234081, 224584, 269234, 280769, 300181, 245250, 190830, 188358, 256113, 271138, 232625, 153303, 208905, 303498, 224389, 195685, 158904, 177753, 233931, 286329, 267809, 207604, 208380, 210494, 213285, 170111, 170581, 188043, 205069, 207795, 155615, 88460, 104140, 154527, 126648, 172409, 205592, 181848, 155411, 147316, 147923, 118814, 120833, 204727, 312594, 231356, 161888, 211413, 198311]
11405A98311J1940M7747n4019k9443R2261K3418p8209n4524l1483N0596m8389
11394A28206r0630J0656R749R0276K7067j0881J2374j7831O047L0958Q2012M6303
11382C24306j9961m689j33352j11855M591Q4703L5478j0412m9860L1679L9234
11371A89862J6050l10N3508L425o5553L5515j1007m011Q3283o0182O3645L8413
11359C42638m6092n5461p4183j8638P6754j2300n6498l8866P644O8366N3841K2265
11347B69470l1801j6196J1292P3035N9824m1484K5949J5764K4438k1584p79m8187
11335C19741p4646q1654k536P3966O1297q257P53P027m3383q2734j25950q1432
11323c7808K2550R0473M3997L1710R9653O2356r6310l0172n0561m1748M0823M2745
$$ y = [198311, 210251, 257998, 203979, 174536, 266797, 290215, 212006, 157482, 125999, 176595, 128206, 37576, 48232, 57981, 148257, 175324, 164443, 176817, 158986, 165033, 195991, 278003, 324306, 304345, 299656, 166304, 54449, 59040, 143743, 179221, 168809, 118949, 150628, 189862, 205912, 205602, 259110, 262535, 196982, 232497, 221490, 217479, 300762, 240580, 304225, 342638, 296546, 241085, 166902, 148264, 225018, 212718, 156220, 117354, 124998, 193364, 247205, 269470, 237669, 221473, 232765, 305800, 365624, 324140, 350089, 365853, 390291, 368707, 367928, 319741, 245095, 163441, 160905, 234871, 296168, 287911, 288664, 295691, 252308, 169574, 43624, -37808, -15258, 75215, 119212, 150922, 250575, 312931, 216621, 186449, 135888, 94140, 134963, 177708]
11311A77708o1428r5236l0712K7342O2029M5450K4658N4778K3987k8341k2791
11300A77444M694L7874K2391J5812q9168L2824l6427j7354K593l3281J6858Q6066
11288B20326K7370k9139J9241j4997j40943l7448L1831N133M1255P1805m6433
11277A48001k0806N3828M9335l1807o4749m4229P4487j112L4173j8688j18903
11266E9530J050j9896O5773K3398m636p9162N1913J12300N7447o821l285L6445
11254B94056m2746j15126m3875J3822k5051L3279N736L5284Q623m1677n322J1500
11242A28503j6869L0853J129o504J8437q6757p9572Q9274P2418M621r733K4023
11230A69823Q4509J1067n2101j33070j07878n2734n5491N7905P4810L2718k111
$$ y = [177708, 116280, 21044, -9668, 17674, 79703, 125153, 149811, 204589, 228576, 200235, 177444, 182138, 220012, 242403, 258215, 169047, 201871, 165444, 148090, 150683, 117402, 134260, 220326, 247696, 218557, 237798, 222801, 81858, 44410, 76241, 81374, 122629, 194434, 148001, 127195, 181023, 230358, 198551, 133802, 89573, 164060, 162948, 197121, 178433, 59530, 60580, 40684, 106457, 129855, 125219, 46057, 97970, 210270, 267717, 260896, 257611, 294056, 251310, 136184, 92309, 106131, 81080, 114359, 120095, 155379, 164002, 122325, 117003, 128503, 111634, 142487, 143616, 137112, 155549, 68792, -10780, 78494, 150912, 155533, 145800, 169823, 254332, 265399, 213298, 80228, -27650, -80384, -135875, -77970, -3160, 29558, 27447]
11219B7447k7377j5892k5330J4789J2788K7496r482j4189M6428j5926L9043r305
11207E0490K1804K8357J6817m5785R224k9255J0272P2542K7876k2712L7328P6017
11195B52975k573p8268K9639Q412K1957n8846m8859j8519L8503M4407j0231o5780
11183A12817r1532k7735M2612j888l2595O742M5736K7114o875n5775k6930L325
11171d984k3534N9764P3413J5842r2946n3091L4960M7662M4824n0265k7174j8886
11159E585K6499l3688q902L5066R284j7408r5942l4262L6936N4257m8816o095
11147g7486M1617M714m9328j2780j5022K0275j0238N4140P6236N5620J9550o8700
11135C8598K1269l7266J2678O826J9517J6849p0740m3478j58Q6757O7794M662
$$ y = [27447, 70, -15822, -41152, -26363, -13575, 13921, 4439, -9750, 36678, 20752, 59795, 50490, 72294, 100651, 117468, 71683, 80907, 51652, 61924, 134466, 162342, 139630, 176958, 252975, 250402, 172134, 201773, 210185, 232142, 173296, 124437, 105918, 144421, 188828, 178597, 112817, 21285, -6450, 36162, 34274, 1679, 8421, 54157, 81271, 74396, 18621, -8309, -4984, -28518, 31246, 104659, 120501, 27555, -25536, 9424, 57086, 101910, 51645, 24471, 5585, 32084, -1604, -10506, 24560, 33844, 16436, -79506, -113768, -76832, -22575, -71391, -77486, -35869, -31155, -80483, -93263, -108285, -88010, -98248, -44108, 32128, 87748, 107298, 38598, 59867, 22601, 35279, 42105, 61622, 78471, 7731, -35747, -35905, 50852, 118646, 123308]
11123A23308M052L1592N7263o0722r6261k7912K7328o5905K8058K3222J9746Q1048
11111A44817O4539j2232L2905j7287p1164p5190O679M574n4486O4175L1185r985
11099A08530K4687o9188j9634J116k1107o800M2852N3353j3892J1148m43k4083
11087H6539m207j9457k121m1647k1538j4779L7437N7556K2047J6720K0007k745
11075A33812o8139K0097M7204n1050m633L389O171J3023J9422k2416M704q6986
11063A4598j6051k840P1664k2657n9896R928J5464K4125O5381O586m332p1254
11051C0716m1767K2251J29172K0548K88p4328r4703M6849L1747l6538R236M947
11039D8418J4822K1955M5124n8305j05844L7504N7283N6330J2096N4193j843q596
$$ y = [123308, 127360, 158952, 216215, 155493, 59232, 31320, 58648, -7257, 20801, 44023, 63769, 144817, 209356, 197124, 230029, 212742, 141578, 66388, 73067, 77641, 23155, 87330, 118515, 108530, 133217, 64029, 44395, 45511, 24404, 17604, 60456, 113809, 99917, 111065, 110622, 86539, 82332, 62875, 60754, 19107, -2431, -17210, 20227, 77783, 99830, 116550, 136557, 133812, 65673, 85770, 132974, 81924, 77291, 80680, 86851, 99874, 119296, 96880, 101584, 14598, -1453, -4293, 67371, 44714, -15182, -5254, 10210, 34335, 99716, 106302, 101970, 30716, -11051, 11200, 140372, 160920, 161208, 86880, -7823, 39026, 70773, 34235, 43471, 48418, 63240, 85195, 130319, 72014, -33830, 3674, 60957, 117287, 129383, 183576, 181733, 173137]
11027A73137J0922r0305q2011R696n7800O515L5708j1552L5159M512L826K0807
11015E8614o994J4373k2947m5212P0098N463J2091l7866l3423M4720k4283p1878
11003c7244l1194R552L7181k9751L6932J41854K4864j19662o1623M5426P5971
10992I2306K8969k3745P946M7097L6k1427l0582l499O8154l5015m9312m9364m9465
10979a7901M7006N7641l8018m2890K0665N29r924k8850k1154p599R1773J24988
10967A76266m5347n360j52785p1899R6236R5351Q7532q683l4348q831O0407N5680
10955B44219j11372L528P50o7735M1271O89n6630q841P7428P509l3194j4221n1707
10942C1694n957P843j371l0115p4061l4934J04817R0297O754r4273N1008R9066
$$ y = [173137, 184059, 93754, 11743, 21439, -36361, -29846, 5862, -5690, 29469, 33981, 37807, 58614, 51620, 65993, 43046, -2166, 67932, 73395, 85486, 47620, 14197, 58917, 34634, -37244, -68438, -58886, -21705, -51456, -14524, 127330, 152194, 32532, -29091, 16335, 92306, 121275, 97530, 105476, 152573, 152609, 131182, 100600, 97101, 165255, 130240, 80928, 31564, -17901, 29105, 86746, 48728, 5838, 26503, 27032, 17108, -11742, -32896, -40495, 51278, 176266, 130919, 125559, -27226, -99125, -2889, 92462, 179994, 171311, 136963, 128132, 188539, 244219, 132847, 136375, 137125, 69390, 110661, 111350, 54720, 45879, 123307, 130816, 97622, 83401, 31694, 25737, 33580, 32209, 2094, -71967, -106901, -2084, 88213, 94967, 694, 51702, 150768]
10930A50768J7241k2738m982p8187n2605l688j4293K4555J9242n2998J7205n877
10918f357L9589m27N6739K1205M6173k3469m4663p6925M0647K1541K1529m8996
10906D6586l0869P6330M0503n8237k2258J5698l9692l5680K3620r228O562J7340
10894C0675J6094K2909P3910J7650p942l4968l7561n6913L7673o115J9026N6775
10882A31213L141m3927j1893r184n3443l8662O9172K740N624M4149J8250r6518
10870B0662k5203M6402R565J6712Q1983k6253r8734n9852p4248j2982R576O6789
10858d5583J8732M2182L7061L973l0243o551j322Q5450O2188o9792p7421M3593
10846F2267Q0246r413o1087l6714J2686k3977j9270m9799Q5883P8133n6971j48858
$$ y = [150768, 168009, 145271, 140289, 62102, 9497, 5809, -8484, 16071, 35313, -17685, -480, -6357, 33232, 32805, 89544, 110749, 156922, 133453, 88790, 11865, 52512, 74053, 95582, 46586, 15717, 92047, 132550, 74313, 52055, 67753, 28061, -7619, 16001, 6773, 13335, 30675, 46769, 69678, 143588, 161238, 153296, 118328, 80767, 23854, 61527, 55412, 74438, 131213, 134354, 90427, 78534, 69350, 15907, -22755, 46417, 49157, 54781, 98930, 117180, 20662, -4541, 41861, 51426, 68138, 150121, 123868, 25134, -34718, -108966, -121948, -112372, -45583, -26851, 15331, 52392, 56365, 26122, 19571, 18249, 103699, 165887, 96095, 18674, 62267, 142513, 133100, 72013, 35299, 47985, 24008, 4738, -45061, 40822, 118955, 61984, -86874]
10834h6874n6990J22869R9062O050j9656j36539m6174L3258Q7751P3391k7026
10823D9122j5463q491m2824M7572J0142K6999M937l7614J6185N5413j5967m6126
10811D3885J5832L2532O995l2039m8147M750Q5719Q7501R293j16415q1890K0744
10799B8760J32720M0802r0455n4488l516q959l8910M3219L2279J1591L7861p1274
10787E9630q6006Q2028R456j5763M2290L7231J4173K0260r9414n3658K3393N1526
10775H5146M3575o4079m5606N0167p9676r0704K6792M7862R0552N2955M8322o2776
10763A02530m0806j5483M20m0688l5967M3072N9055L9175k9352r1363j5132Q891
10751a5648K0714J8040J705j2574M8885N4289RP604n2146l0368o4274j227K6502
$$ y = [-86874, -143864, -20995, 78067, 84117, 64461, -72078, -118252, -84994, 2757, 76148, 49122, 33659, 25168, -17656, 29916, 40058, 67057, 71994, 34380, 50565, 105978, 90011, 43885, 59717, 92249, 99244, 67205, 19058, 23808, 109527, 197028, 206321, 89906, 8016, 28760, 161480, 202282, 111827, 57339, 53823, 44864, 5954, 49173, 81452, 93043, 130904, 59630, -26376, 55652, 65108, 49345, 91635, 128866, 143039, 163299, 63885, 10227, 33620, 85146, 128721, 64642, 19036, 69203, -10473, -101177, -74385, -26523, 64029, 116984, 165306, 102530, 61724, 46241, 46661, 5973, -29994, 13078, 72133, 111308, 81956, -9407, -24539, -15648, 5066, 23106, 24811, 12237, 61122, 115411, 115420, 123024, 70878, 40510, -23764, -24991, 1511]
10738A511l0805L8772O1477N0159o6151j0466J0444k6553q1994N4486K3945K0951
10726D5776J2956P3165l1687L7995P909j16613l9827k4697o2584k9658O5648P6188
10714A4571J1083k9534M4644J0417k1682M1094M8513j1691N0461l0819j04401
10703B2656L9027L3902q7165n7319j2672m5448N9921K827K8595J6087o334l5480
10691d1403n2464Q3014P6215O0524M110O7875k5683j2297R544j8318q6407o093
10679E8617M368j010q9108l8676m868p1098j8097L9368M0087O8848J05609n4477
10667C9563p5808N3493M7158j2898o5769J3594L0239Q7266m5300l2370p3908N057
10655b9683O16l6081l7629O6363P2849M4293N964j5217J051M3632K7076L177j2689
$$ y = [1511, -29294, 9478, 70955, 121114, 54963, 44497, 54941, 28388, -53606, 880, 24825, 45776, 58732, 131897, 100210, 138205, 146114, 29501, -10326, -35023, -97607, -127265, -61617, 14571, 25654, -3880, 40764, 51181, 29499, 70593, 119106, 107415, 157876, 127057, 22656, 61683, 95585, 8420, -48899, -61571, -107019, -47098, -44271, -15676, 411, -5923, -41403, -93867, -10853, 65362, 125886, 129996, 197871, 172188, 159891, 169435, 151117, 64710, 58617, 62985, 61975, -27133, -65809, -70677, -141775, -159872, -120504, -80417, -11569, 94040, 39563, -36245, 17248, 64406, 51508, -14261, -667, 29572, 116838, 71538, 39168, -34740, -29683, -29067, -65148, -102777, -36414, 36435, 80728, 86692, 71475, 72526, 116158, 143234, 146411, 133722]
10642A33722l4690j2080k5012j437J6112n1596p0674j9859J961J4850K2987L8299
10630A2583Q2272K3060K8394j4072k2402n6124M4172j5063o1627n4718M4601M2192
10618E3268K7372Q6138j2054m7082q8580o161J6269r5862K3000L5619q719K5514
10606H722N9869J4427M589k6084k672j8612n130k8388M907J127j3816Q4886J18304
10593B02129j953K4354o8161k3944j0297o6080P58n5385P838L3910r931k0514
10581A2724N9757j3526q553q6500q543R7780m372l1575q770Q363L8341m9823K1598
10568B6901P8913L3832Q816m3105l1671N1262J0746k0234j2861L680K4070J9362
10556A49711j0817l4867n6870j38100L0033J21180j2147p085J08986O3956q8285
$$ y = [133722, 99032, 86952, 61940, 60503, 76615, 25019, -45655, -65514, -63553, -48703, -25716, 12583, 94855, 117915, 146309, 132237, 109835, 53711, 97883, 82820, 21193, -33525, 11076, 53268, 80640, 166778, 154724, 107642, 19062, 12901, 29170, -66692, -43692, -8073, -16792, 8722, 68591, 83018, 87607, 61523, 58851, 40239, 35109, 6721, 11628, 12755, -1061, 83825, 202129, 200176, 224530, 156369, 132425, 122128, 56048, 56806, 1421, 9259, 43169, 33238, 12724, 72481, 58955, 50402, -36098, -44641, 53139, 48767, 17192, 8422, 16785, 55126, 5303, 26901, 105814, 139646, 148462, 105357, 73686, 124948, 135694, 115460, 102599, 106279, 130349, 149711, 138894, 104027, 47157, -90943, -60910, 60270, 48123, 41038, 150024, 213980, 125695]
10545A25695j2590o563L2845J7618k4996j00368M2255N9181m1960m34j5085n3668
10533B1930n3886k5028Q6571O2923M0023m1336o0519L2911L0076k6397J2750J9320
10521I9338j2469k3145p902Q372L8636P6955J5798q39p1935m4774M1791j753o5068
10508E3005j6851l4944k6948L1332J1043J9070M7184k772k6447l3524q991K6657
10496C7814N9032R8820o0347p2909q034L770M9593o1323n1375l5405P1577o394
10484B4819o3038P314k32J08555m7955l490J5639j9848M7872l4282p4316K4486
10472a4476P009J8141P7879m9616j956M1131M0524l0873l9885J4876k6083K0398
10460E7069J6113M7653M1782L8103Q501n5872j9190r517m1451k7527j2180p9696
$$ y = [125695, 113105, 106542, 139387, 157005, 132009, 31641, 73896, 133077, 91117, 90683, 75598, 21930, -31956, -56984, 29587, 92510, 132533, 91197, 30678, 63589, 93665, 67268, 80018, 99338, 86869, 63724, 55822, 64194, 102830, 179785, 195583, 194744, 122809, 78035, 119826, 118073, 53005, 36154, 1210, -25738, 5594, 16637, 35707, 82891, 80119, 53672, 20148, 11157, 37814, 96846, 195666, 135319, 62410, 54376, 58146, 107739, 46416, -4959, -40364, 31213, 24819, -38219, -30905, -31137, 77418, 29463, 25973, 41612, 21764, 69636, 35354, -38962, -14476, -7467, 10674, 88553, 38937, 36981, 78112, 118636, 87763, 47878, 62754, 36671, 57069, 73182, 120835, 162617, 200720, 209221, 153349, 134159, 124642, 83191, 55664, 43484, -36212]
10448c6212K4406P8287O1944M6127l233P782m974K0755M709l1799m8832n2591
10436F6369n8427k7560O4955j5517k2466m2999M1500N6167l3146k4588R06o2386
10424e7192p2530O3610K00531P8444K3859k4945l6729n4437l7859p0119p18l0990
10412a9075J2741J01058M5494J7099L6820q8929K6555R8268p9069J733L8390n0206
10400A40879q3497j5632k4360O2913m9777p2221J26639L2132m978k0722J3005
10389A04381n2015J6010Q0877K2606r320r2863n2739n6623O0095J3119j0648j1907
10377A0973l0638K1397L3750k8366k1345L2791P1288Q0277j7817j1791n3616Q510
10365I5413j3948k8316K4743j12537J8805M5101M1089j2899m5739J4654O8993
$$ y = [-36212, -11806, 66481, 128425, 174552, 171319, 179101, 174127, 194882, 199591, 167792, 118960, 66369, 7942, -19618, 45337, 29820, 7354, -35645, 5855, 62022, 28876, 4288, 5194, -57192, -129722, -66112, 134419, 212863, 236722, 211777, 175048, 120611, 82752, 12633, 11915, -19075, -6334, 94724, 140218, 157317, 194137, 105208, 131763, 230031, 150962, 152695, 191085, 140879, 57382, 41750, 17390, 80303, 30526, -41695, 84944, 117076, 112098, 91376, 104381, 52366, 68376, 149253, 171859, 162539, 69676, 16937, -39686, 20409, 33528, 22880, 10973, -19665, 1732, 35482, 7116, -14229, 18562, 89850, 170127, 152310, 140519, 86903, 95413, 81465, 53149, 77892, -34645, -15840, 29261, 70350, 57451, 11712, 26366, 95359]
10354I5359M9249o339L8297k3951j2285o6455q1307l9957M7809P4325K4376J175
10342A00296k9273m3481j7758n717o4688M3161O0605M687j3386L1515K2626p755
10330H0832O6191l0813l0818l3917n9304M060O6732J6597n530P2405p6749j6500
10318E3186q374J0466Q2366j0977K31L4762M1903r4852J9652n540j2600J7221
10306A27444K2452n1019K974Q919M0456M9069J2089M3417Q9224N6940M6489j3003
10294D35451O6932j7929m3768l9578o9710K3152J00060m3461M0418L6162M7458
10283E35187P9972o6913r9196l4010K956K8504P460o5740o5925r6737j11373L0544
10271A44729L4076J6109n5315K2977j1794j9624m0880p6893J9228L5587J362q415
$$ y = [95359, 144608, 138269, 176566, 152615, 140330, 73875, -7432, -47389, 420, 74745, 99121, 100296, 71023, 27542, 9784, 4067, -60621, -17460, 43145, 47832, 34446, 65961, 88587, 80832, 147023, 116210, 85392, 51475, -7829, -3769, 62963, 79560, 74030, 146435, 69686, 53186, 44812, 55278, 137644, 126667, 126898, 161660, 203563, 108711, 128363, 122823, 110223, 127444, 149896, 98877, 101851, 110770, 151226, 200295, 212384, 255801, 345025, 401965, 448454, 435451, 502383, 484454, 440686, 401108, 331398, 354550, 454610, 411149, 451567, 487729, 535187, 615159, 548246, 449050, 415040, 417996, 446500, 453960, 388220, 322295, 225558, 114185, 144729, 178805, 194914, 139599, 162576, 150782, 131158, 90278, 13385, 32613, 68200, 69562, 61147]
10259F1147n7126l0597N1802K3730L2680O255M8409Q2202K4978k9737l8350j7294
10247A58099r1485l7551J9791j4430P1882L8094r8672J6352j5661l6635L0001
10236C9785R096L8012R2116N1109L3790p631j33233K049q123j3199L7590l8j9517
10223A21806k4060j5376K2518k4753o5042M2223M4995O8497P3991N766r4272m3677
10211A12616j4621O844K8621l4176l8478p0490q1216M761Q6876k8135J2032l1745
10199d7111P7628n1558j0222m919J6715L0906j1058j3381K7720J143K4563l7171
10187C255M1156K2609j120p3968n7417J20282J67599K0602o9561j7088n6115j1424
10175H8810N4942K4829m5864l3004r9925k0786J8326J2298m556m2546L5749L280
$$ y = [61147, 4021, -26576, 25226, 48956, 81636, 87891, 136300, 218502, 243480, 213743, 175393, 158099, 66614, 29063, 48854, 34424, 106306, 144400, 45728, 62080, 46419, 9784, 39785, 48881, 86893, 179009, 230118, 263908, 256277, 123044, 125093, 116970, 103771, 141361, 141323, 121806, 97746, 82370, 104888, 80135, 15093, 57316, 102311, 170808, 244799, 250565, 156293, 112616, 97995, 104839, 133460, 99284, 60806, -9684, -90900, -86139, 737, -27398, -15366, -47111, 30517, -21041, -31263, -36182, -19467, 11439, 381, -13000, 14720, 15863, 40426, 3255, 44411, 67020, 65900, -8068, -65485, 54797, 222396, 242998, 173437, 156349, 100234, 88810, 143752, 168581, 122717, 89713, -10212, -30998, -12672, -374, -4930, -47476, -11727, -8447]
10163h447k2740L6834N9476O7756Q389n0551o2419p352M8745k2487n0011q2514
10151h5321M0917M6250N3394J6386p9590r0245L7116J04948k4414L562k8648j9041
10139b4686R283m78M0490p8554k277n5772o852M1390j1561l739J5477j26m6687
10126a24092J1262J27172M9757M5515L5717o4498l9390m7015j1593K4487k8397
10115b1075P929L2583o5255K4789k2819L0779L7812J7778K8563O2676q037K36
10103A25959l9066M5043m2621k9810k8328k0695m6844j1061J7448m2841k4540
10092i7356k1759r044K2140N3473R1099J1322J8007J207m1381L5302L0673j0133
10080H3550L0406k306L2463M1186Q623j11362m6210J2261J05687L7085q1407o4837
$$ y = [-8447, -31187, 5647, 65123, 132879, 141268, 90717, 28298, 20946, 69691, 47204, -2807, -85321, -44404, 1846, 55240, 71626, -7964, -98209, -61093, 43855, 19441, 23003, -5645, -24686, -15403, -15881, 24609, -53945, -56222, -111994, -118846, -77456, -89017, -92756, -77279, -77405, -124092, -112830, 14342, 64099, 109614, 145331, 80833, 41443, -5572, -17165, 7322, -21075, -13146, 19437, -45818, -21029, -43848, -13069, 24743, 42521, 71084, 133760, 125723, 125959, 86893, 131936, 89315, 59505, 31177, 10482, -36362, -47423, -29975, -72816, -97356, -119115, -128159, -106019, -52546, 38553, 49875, 67882, 69089, 27708, 63010, 93683, 83550, 113956, 111650, 144113, 185299, 193922, 82560, 36350, 48611, 154298, 191383, 109976, 45139]
10068D5139j616j9377m4789N2505L2211J8954L6809r727o809P2289o6061j9503
10056I0025N7016k8755l6859m3430j8678p035m9212L3793M5836L958L17k4963
10044B2013j117j0640M8676Q5558N792p6600J6557K5326N5012J95o7132n9550
10032D4090j2957O8101q1377m6241p640P0028Q1113m6150q5171k6047J6989N14
10020b4748m8778m5827L6531O1526N1090j0618p3956n6214N9250j627l808O2273
10008E094K5959l1831K1056l8639r003Q259l7620m2653K9734P1106m0168n861
9996d4567K66j1745N504J4755M3014M9452P930j7110L8678Q383j5256K5238Q7797
9983A92339p226m9469o5274j3698J998j00473n4204J4575m4248O304O5983L954
$$ y = [45139, 43523, 24146, -20643, 31862, 64073, 83027, 119836, 110109, 103300, 175589, 109528, 90025, 147041, 118286, 81427, 37997, 19319, 12284, -36928, -3135, 42701, 46659, 46976, 22013, 20896, 10256, 58932, 144490, 150282, 73682, 90239, 115565, 170577, 170772, 103640, 44090, 31133, 99234, 17857, -28384, -36024, 34004, 115117, 68967, -16204, -42251, -25262, -24748, -73526, -119353, -82822, -21296, 29794, 19176, -54780, -110994, -51744, -53371, -57179, 5094, 31053, -778, 20278, -18361, -27364, -19105, -56725, -99378, -69644, 1462, -38706, -44567, -44301, -56046, -50542, -35787, 7227, 56679, 64609, 47499, 86177, 94560, 79304, 104542, 192339, 185113, 135644, 70370, 56672, 58670, -41803, -96007, -81432, -125680, -119376, -53393, -49439]
9971d9439l2653l7906L2007J14071P5137K8492r1225j913K4508m320M0234q592
9959H8401k4573m1275Q53k0797r7624J1534N3456j6883K3152p3882M8964O1773
9947A3099p5154k2862P5630P5825o2448L8517R7894j141m1392m9721K68m6029
9935B486l3275r951m8522K2319l7632M5554N0735o0672R1453M4816n7589k3621
9923a3899J6470L481l4052j2792N0827P3185k1629l2734m0097m2030L2037o93
9911b1926M5894o37m1015J3773l8504j039O1588J3154L0621L158q9264q676N7463
9898B4590J3774k5023L7611l7955m3958K9782J9963K7252K5027J24735m289R74
9886A92483m3420l2395l3786j804K9047q463k669K2293j6700p477Q1K89m7358
$$ y = [-49439, -82092, -119998, -87991, 26080, 101217, 129709, 38484, 36571, 61079, 56759, 96993, 88401, 63828, 22553, 23406, 2609, -95015, -83481, -30025, -46908, -23756, -97638, -48674, 13099, -62055, -84917, -9287, 66538, 4090, 42607, 140501, 139360, 97968, 48247, 48515, 2486, -30789, -40740, -89262, -66943, -104575, -59021, -8286, -68958, 22495, 67311, 9722, -13899, 2571, 6052, -28000, -40792, 10035, 83220, 61591, 28857, -11240, -53270, -21233, -21926, 23968, 23331, -17684, -3911, -42415, -43454, 18134, 31288, 61909, 65067, -24197, -32873, 24590, 38364, 13341, 50952, 12997, -30961, -1179, 18784, 46036, 71063, 195798, 191509, 192483, 149063, 116668, 82882, 81078, 110125, 101662, 98993, 121286, 104586, 97109, 97190, 97479, 50121]
9873E0121q1789n7887R2551M3344M1505l2146k1122l3264k3341J6501m9934l8016
9861i3477M2389M3291m6204L650N5890K5678o42k6560M9211L0138O6886K5030
9849A75280m6885k8731K1218j0958J2316k5919o8007l2788M929L4823J16729O5997
9837B18004p6157q8945m5905K4014N288J1818N5298J1391K8101J6699n3532L2566
9825A38640j06879r0174R949P5359o5157l4286Q4765M2027l4187l0266J4673P7897
9813H2361O4673k2053o5745K7178o1523n6832N0053J4026J1353k2653L5550m394
9801E1994N0262K2162o318J2771m2693k8514N5220M4811L3717j4149j11425p3241
9789e403j6032k1492K695P9517O0533l1841N112L4418J0028K2890q5358O015O5909
$$ y = [50121, -31668, -89555, 2996, 46340, 87845, 55699, 34577, 1313, -22028, -5527, -55461, -93477, -51088, -7797, -54001, -50351, 5539, 31217, 30575, 4015, 53226, 83364, 150250, 175280, 128395, 99664, 120882, 109924, 122240, 96321, 28314, -4474, 455, 35278, 152007, 218004, 141847, 52902, 6997, 31011, 36299, 48117, 103415, 114806, 142907, 159606, 106074, 138640, 31761, -58413, -48464, 26895, -38262, -72548, 12217, 54244, 20057, -10209, 4464, 82361, 147034, 124981, 59236, 86414, 24891, -31941, 18112, 32138, 43491, 20838, 56388, 51994, 102256, 124418, 118100, 130871, 88178, 59664, 114884, 159695, 193412, 179263, 67838, -5403, -21435, -42927, -40232, 39285, 99818, 67977, 73089, 107507, 117535, 140425, 55067, 61082, 126991]
9776A26991N4376o4237r6371k8146P595Q7175l0963j3510k26K7672O189l7657
9764C8888L0467o6755r267K8151R6915M3245n2492n2579K5168m847M451k9047
9752E2298j1266r5801n8249k5455M6981M6533m6475K4604j8757J6409J41609p341
9740F5090j02147M2811R4456o4573r0143k408k1969j192l0577O0973N2217m2654
9728d0116l8184L9884K8545K9306o771K9769L1028K1289K5828j385j03836p2512
9716e7155K1645K9408K6081J1025J2774J085L5980r6446o4264L8989P9889L8134
9704G7145l4163J2477K5143k3253M7834l434k2291j6275Q08m4702M0948O6587
9692A26824j0637l9068N6605p2135r1675L768J7599N466k4730p511O5581r389
$$ y = [126991, 181367, 117130, 20759, -7387, 208, 87383, 56420, 42910, 42684, 70356, 76545, 38888, 69355, 2600, -6667, 21484, 118399, 161644, 109152, 56573, 81741, 76894, 81345, 52298, 41032, -54769, -113018, -138473, -91492, -44959, -91434, -66830, -85587, -69178, 72431, 65090, -37057, 5754, 100210, 35637, -54506, -56914, -78883, -80075, -110652, -49679, 2538, -40116, -78300, -38416, -9871, 19435, 12664, 42433, 73461, 94750, 120578, 119193, 15357, -57155, -35510, -6102, 19979, 31004, 43778, 44863, 80843, -15603, -79867, -40878, 39011, 77145, 42982, 55459, 80602, 57349, 105183, 101749, 79458, 63183, 63991, 19289, 60237, 126824, 116187, 77119, 133724, 61589, -30086, -26318, -8719, -3253, -27983, -35494, 30087, 20698]
9680B0698j1566J8582K8817J8309K708l7180l9317k8670J6643q423K27N4058L2752
9667F7638L0438R608k5863n2676n7869L5750n1619M0164P259k5798K7341M1966
9655D6339Q360L0703K524M8175k3342m6173J5117p857r6497j1056O7411J4913
9643D8617J1912m0917q7581l2442N6272k0990k8018q0593P0902Q5991M1230p4013
9631d9630m124M134K1597L5401J8648l5082n1020O913Q9536L7214l9112l2369
9619B106Q4303J5475k8810j4884q490n3941J4286M546K1087J32k5260J2958K110
9606B5618N326r8363L2112J41405M3785o0030m479k6562P929q83j7335J0817n9260
9593H0N149m7128n6376l3762R3860K2829j2844J025K9185M0410N7520O927l1214
$$ y = [20698, 9132, 27714, 56531, 74840, 77548, 40368, 1051, -27619, -10976, -19399, -19172, 34886, 67638, 98076, 107684, 81821, 29145, -28724, 7026, -44593, -4429, 2830, -22968, 4373, 46339, 54699, 85402, 87926, 136101, 112759, 66586, 81703, 73846, -22651, -33707, 33704, 48617, 60529, 19612, -67969, -100411, -44139, -65129, -93147, -173740, -102838, -16847, 24383, -49630, -53754, -49620, -28023, 7378, 26026, -9056, -60076, -53163, 36373, 73587, 34475, 2106, 86409, 101884, 73074, 58190, 49700, -4241, 10045, 14591, 35678, 35810, 10550, 23508, 25618, 30944, -67419, -35307, 106098, 149883, 89853, 85374, 58812, 66741, 65858, 48523, 59340, 80, 5229, -41899, -98275, -132037, -38177, -15348, -28192, -27167, 2018, 42428, 99948, 106875, 75661]
9580G5661m0937j16908j9399K4175j8929M2354K4140J3773M9504l9682J2841Q0003
9568H6596l6113k0611L7472m1925K6419L9856J0835M2806O4853l5832p9886m4950
9556D9520n5193k2741L9001r1012l4973N9039N5891M8692M7574l4353j6461j9596
9544B5388N297M8850n2905p0582j0497K5108Q006k4297l8425k9408O948P5540
9532c0977M2364N2445k9894n2279l9964Q5579L8764j7347j3618o2736m8973N591
9520g1045P9219m4012q5489L8957k7991O037J9463J2314L9633L1009k2926O6441
9508D1610N3986K3986k6492o6407q8410m001r0525k2155J23386K6247k52j2645
9496d1672M8778K7578J6701L8314O0820n6496j2137l2055K6688L9311k8677K9503
$$ y = [75661, 34724, -82184, -101583, -77408, -96337, -53983, -29843, -16070, 33434, -6248, 6593, 86596, 50483, 29872, 67344, 25419, 51838, 91694, 102529, 145335, 210188, 174356, 94470, 49520, -5673, -28414, 10587, -80425, -115398, -56359, -468, 48224, 95798, 61445, 44984, 25388, 30685, 79535, 26630, -43952, -54449, -29341, -21335, -45632, -84057, -113465, -106517, -30977, 11387, 63832, 33938, -18341, -58305, 27274, 66038, 48691, 35073, -27663, -76636, -71045, 8174, -35838, -121327, -82370, -110361, -104324, -84861, -72547, -32914, -1905, -24831, 41610, 95596, 119582, 93090, 26683, -61727, -65728, -156253, -178408, -55022, -28775, -29027, -41672, 7106, 34684, 51385, 89699, 150519, 94023, 81886, 49831, 76519, 115830, 87153, 116656]
9484A16656p4207p2590q869p5189Q0206Q3146J9941M083l7022k7842J1905q1404
9472f1186L0504J06668M4994j0712r1810M9993m1431q9015k699j1417k4250M9742
9460e0619J3007O8539L7935J05l7414r3331k3361p1717J9338O1869M5139J0767
9448a9743P5748Q521J8879K2138L838l912q0943J2817N973o788q1754l0108K4157
9435e1177j0538m534K4527N2212O9777N2496o21j06490j26267L5065O6221L3422
9423C4093N8128P69k7268K9511o030p0958l589P005J5000m2949L3760m56m0382
9410a3366J0531K0767j0983K7376N0451P0977J4269r827r9527P039K5346L8679
9398A31732L7934j8134o5853l1279m7116p4440K2014M8814m0054m045N7331K2871
$$ y = [116656, 42449, -30141, -39010, -114199, -33993, 49153, 69094, 73177, 36155, 8313, 20218, -61186, -30682, 75986, 120980, 110268, 18458, 68451, 27020, -61995, -64694, -76111, -100361, -50619, -37612, 30927, 68862, 68967, 31553, -61778, -85139, -156856, -137518, -75649, -30510, -19743, 56005, 64526, 83405, 105543, 109381, 105469, 24526, 37343, 43316, 36528, -45226, -75334, -51177, -61715, -66249, -41722, 10490, 80267, 132763, 132142, 25652, -100615, -65550, 671, 34093, 92221, 92990, 65722, 95233, 89203, 18245, 14656, 21661, 36661, -6288, 27472, 27016, -13366, -2835, 17932, 6949, 34325, 84776, 155753, 170022, 160195, 60668, 67707, 93053, 131732, 169666, 151532, 85679, 54400, 7284, -67156, -45142, 3672, -36382, -40427, 16904, 39775]
9386C9775N606l0063j2667O001J7534j4727K9388O6291l4566k1813j3242Q814
9374D6331o6028N8518K4139q962J6534K4200l1554J528n7983p6413O288j651J4819
9361e0234Q1799L3258q0836l4111O1502N8936M9039L6724l4510m928M926k4299
9349I7266r1218m8620p408n501j1903L657L2106O4649P1186l3839o3250o8702
9337f1577P654M7438N025N2238K4385K2146K2073J5208q791J5405R285n3898o4180
9324C2411k8929O9302J22835K0265J6088o0731j58258n5538L6786K3937Q3994
9313A02162p539n5303q7179j00200K0805J63558L9952r1258M5281j6809k4062
9302a0592O964N2633m807M093k8445j6931o966J6670J2592m993j1490k7546p7335
$$ y = [39775, 45381, 15318, 2651, 8652, 26186, 11459, 40847, 107138, 72572, 50759, 37517, 46331, -19697, 38821, 62960, 53998, 70532, 94732, 63178, 64706, 6723, -69690, -63402, -65053, -50234, 31565, 64823, -16013, -50124, 11378, 70314, 119353, 156077, 121567, 116639, 121565, 97266, 6048, -42572, -49980, -55481, -67384, -63727, -31621, 33028, 104214, 70375, 7125, -61577, -53923, -6485, -1460, 50778, 75163, 97309, 119382, 134590, 125799, 141204, 150489, 96591, 32411, 3482, 72784, 195619, 215884, 231972, 171241, 12983, -42555, -5769, 18168, 102162, 94623, 39320, -47859, -148059, -127254, 36304, 76256, -15002, 30279, 13470, -10592, -3628, 49005, 44198, 48291, 19846, 2915, -4051, 12619, 25211, 20218, 8728, -18818, -96153]
9289i6153N787R9029N9613m1598j4469j7917L8263j4675j4923o790q475O9286
9277E6978O7852K4584n378q1526o432k107o3936l796M600N4083P4128n4034l4282
9264C0734O6484R0793J18772j03342k01654J5849Q3666m0135L3189j8048m8741
9253B7567J096J5139P3036P9318j0957k7054m2400l7791O0527k8632K5238o047
9241A29040j8564l7269Q69k051M6304L0849J41019J1213j59455m0771J0007R803
9229A20994p9935j0705O7615k6794n2650J3755O9764N8780P2988M9203k3364p7943
9217A81708P4669N3308l9067j6555L9391K5984J21188J55400J86815M54052N12742
9206A749635R86932J886908K756102K813287Q93237k634238k845979j814817j049840
$$ y = [-96153, -90366, 8663, 68276, 26678, 12209, -5708, 32555, 17880, 2957, -3833, -12308, 56978, 124830, 149414, 144036, 62510, 56078, 53971, -9965, -13761, -9161, 44922, 119050, 65016, 30734, 97218, 188011, 306783, 203441, 1787, 17636, 101302, 61167, 94356, 76308, 27567, 28663, 43802, 116838, 196156, 185199, 158145, 115745, 77954, 138481, 109849, 135087, 129040, 110476, 73207, 74076, 72025, 118329, 149178, 290197, 301410, 141955, 101184, 111191, 120994, 41059, 30354, 97969, 71175, 18525, 32280, 102044, 160824, 233812, 283015, 259651, 181708, 256377, 309685, 270618, 254063, 293454, 319438, 440626, 596026, 782841, 1236893, 1749635, 2736567, 4623475, 7379577, 10192864, 11086101, 8451863, 5605884, 3791067, 2741227]
9197B741227n90415k50157k06029j46541j15498q2390j83766j39216m6239K031
9187I83007n7285r2846K4950j7739l0238l9637j14967J5866k6425M9517o6989
9176F27214j55343m2598J03718L5094q0253n83L2833j36113r0284q9144K4131
9165B28672P7103o1248p9562k6615R661m1446O2825N2511p949O416J05195N4047
9153C79610O285L5214k2606m0620k8073j07788q1788j2890L7388J8613j1954k5567
9141A45824R900l3518J4751m2668P218K6175R947j8865O574N7222K2334l3245
9129A71649j0591k6994L5812J8087L0796J865n2470L098L4148J6178k520L978
9117B23036j0994o5625M9469l9183l9772J2188L525J2054K8843j5454n4445k2306
$$ y = [2741227, 2150812, 1900655, 1694626, 1548085, 1432587, 1350197, 1166431, 1027215, 980976, 983007, 925722, 832876, 857826, 840087, 809849, 770212, 655245, 671111, 644686, 694203, 627214, 471871, 429273, 532991, 568085, 487832, 487249, 520082, 383969, 293685, 204541, 228672, 305775, 244527, 164965, 138350, 148011, 106565, 169390, 221901, 213952, 220368, 325563, 379610, 385895, 421109, 398503, 357883, 329810, 222022, 140234, 127344, 164732, 183345, 171391, 145824, 155724, 122206, 136957, 94289, 101507, 127682, 137629, 118764, 125338, 182560, 204894, 171649, 161058, 134064, 169876, 187963, 218759, 220624, 168154, 171252, 205400, 221578, 219058, 223036, 212042, 146417, 195886, 156703, 116931, 129119, 132644, 144698, 173541, 158087, 103642, 81336]
9105H1336n37Q7968K179j2888K2272O665p056n3906l5199l486R9222R4852K1283
9092C02705n1541r0464n574p1317l1835L3578k5173J2582k7096m5307N191L1248
9080C6997J9359l1477p213M2817Q285m5623N9226n5102j6753j3912p833M0635
9068B9406N0400J7546l2913m9035Q459K7201O2782L6346p4159j16570k0513K9696
9056c1354L7809K9720K123j0869L0828o15K1903M303K6623M5840K7976l6730j8359
9043A29198p7244l5962L0214O9044J1595k1277p9987M2745K4524J1558m865m4039
9031E5504L549L3215M7755l2121l5502l510K3925j3450o0547l1411m9725L8804
9019b3514J01443l2599n9068k4305N3730J4499k9541l5175N2265q946q1059M1177
$$ y = [81336, 80799, 168767, 170946, 158058, 180330, 186995, 179939, 126033, 90834, 87348, 186570, 281422, 302705, 251164, 160700, 155126, 83809, 51974, 85552, 60379, 72961, 45865, 558, 5749, 36997, 56356, 24879, 17666, 60483, 68768, 23145, 82371, 27269, 10516, -3396, -11229, 29406, 79806, 97352, 64439, 15404, 23863, 51064, 113846, 150192, 76033, -40537, -61050, -31354, 6455, 36175, 38298, 27429, 58257, 57642, 79545, 83848, 110471, 156311, 184287, 147557, 129198, 51954, 15992, 46206, 115250, 126845, 105568, 25581, 68326, 92850, 104408, 99543, 55504, 59053, 92268, 140023, 107902, 72400, 68890, 92815, 79365, 18818, -12593, -62318, -23514, 77929, 45330, -13738, -38043, 15687, 30186, 645, -34530, 17735, 8789, -72270, -31093]
9007c1093O8633N9177k6855P227J180L2076j0530L3040k7391q3643j8004M5872
8995D9689M156L335o3688K4560K9278K1935o1926r5698m2516O5624O5172M7615
8983D7536k288J7451o9653k217N6304l9247k6198N1722n2891r879L1916n661J8704
8970A5599N5258O7871N7627j12628m5634P7075P53k6905n4576p9460r085J36451
8958H2346q47k2723j0962J4387O269J9653j2431p8502J2841M5677R717K8016J2915
8945A06356P5085j0576j3238k3764q5275l2840p0220J5194K0083L0925n289n7389
8933e0948j5220o8484l1210N6066N3751r786K0456N4354L7758j5533N5019k9674
8921E6549K338n7767p8147N2710O5668k8823r792O0500J6992j5446j6926k6861
$$ y = [-31093, 37540, 96717, 69862, 77089, 78269, 110345, 99815, 132855, 105464, 21821, 3817, 49689, 53845, 57180, -6508, 18052, 47330, 69265, 7339, -88359, -130875, -65251, -79, 47536, 45248, 62699, -6954, -9171, 47133, 7886, -18312, 33410, -19481, -29360, 2556, -3105, 15599, 70857, 138728, 196355, 83727, 38093, 115168, 115921, 89016, 34440, -45020, -54105, 82346, 81499, 58776, 47814, 62201, 68470, 88123, 75692, -2810, 10031, 55708, 65425, 93441, 106356, 181441, 170865, 157627, 133863, 48588, 15748, -54472, -39278, -19195, 11730, 6441, -50948, -66168, -134652, -165862, -109796, -56045, -65831, -45375, 8979, 46737, 31204, 86223, 56549, 58887, 1120, -77027, -24317, 41351, 12528, 2736, 63236, 80228, 64782, 47856, 20995]
8909B0995L4173l2073m7874k6775J6132j4954m6601M8111N0477J6007k8620n1242
8897f2244J5370L1859L4298N6197M409K535m1922n1535O2201O9498l9692J1750
8885I2724R996j9301o571n1914j0525R676O7813L468K8174J5440J2182K3873O1017
8872B36052r0677n2942l4232L1869j7221n0854J2571J2197j7594R7232O6258j6447
8860A76212K0803M433j7071j2794j5284j6443K0257K2062n8984M6112O2809K6109
8848B58221k4771p4718J088j0884j39715j05944K3637P5451L9354j1871M144P8116
8836A12108L0440j9059J1883L2079J9904q100J10897J69777O6330q7041j23704
8825C15514n0288k1879P5901J77728J70416l241j77501n1899o7638l2524j9252
$$ y = [20995, 55168, 23095, -24779, -51554, -35422, -50376, -96977, -48866, 1611, 17618, -11002, -62244, -46874, -15015, 19283, 75480, 79889, 82424, 40502, -11033, 51168, 120666, 80974, 92724, 102720, 83419, 76848, 24934, 14409, 24085, 91898, 95366, 123540, 138980, 151162, 175035, 236052, 145375, 92433, 58201, 90070, 72849, 21995, 34566, 46763, 29169, 126401, 192659, 176212, 197015, 201448, 184377, 171583, 156299, 139856, 160113, 182175, 123191, 169303, 232112, 258221, 233450, 158732, 159820, 148936, 9221, -96723, -73086, 2365, 41719, 29848, 33992, 112108, 142548, 123489, 135372, 167451, 187355, 179255, 290152, 459929, 526259, 439218, 315514, 265226, 243347, 319248, 496976, 667392, 664151, 486650, 434751, 367113, 334589, 315337]
8814C15337j798m8534o1507j225O3468m9115l2512J054j6861o9023m1227J36475
8802A94532J24659k9881m0812L951k7276n1621J3843j9754j8264J7275P3117l2696
8790B07073k3741l6454J07353J19958L6449J53569K95880K88615q7901k31149
8780H29652k04698m7077Q6555K07176J81150k3046k56084k24633j06149r7635
8770C45211j8414q4719o9825k6814l3536M0677l5790m9554k4018P0996L0464n040
8758A39638R68J397M2086j5753m9930m8978j0340N828R5539Q717j7973l1709m2027
8745G7463k4719M3166P7862K1737N6410J16887J17574N1687r8731q3347n5831
8734C00158K4718O5279P0158J35441r022j72991r9810J807q5135k4463Q0530N5018
$$ y = [315337, 313539, 265005, 203498, 202273, 265741, 216626, 184114, 185168, 168307, 99284, 58057, 194532, 319191, 289310, 248498, 252449, 225173, 173552, 187395, 167641, 149377, 166652, 239769, 207073, 183332, 146878, 254231, 374189, 410638, 564207, 860087, 1148702, 1060801, 829652, 624954, 577877, 664432, 871608, 1052758, 1029712, 773628, 548995, 442846, 345211, 326797, 242078, 172253, 145439, 111903, 152580, 116790, 67236, 43218, 114214, 144678, 139638, 140606, 142003, 184089, 168336, 118406, 69428, 59088, 64916, 160455, 169172, 151199, 119490, 77463, 52744, 95910, 173772, 195509, 251919, 368806, 486380, 538067, 439336, 355989, 300158, 324876, 390155, 460313, 595754, 586732, 413741, 313931, 315738, 230603, 206140, 286670, 341688]
8722C41688n0876N2133J4994J7349m0312Q275L7222o6208j41808K1676k622o1085
8710A30426l1037R1037N2873o6771r2852k7981M237R693K3461J215j3812J14887
8698A95376M7866J0494q4779p582O1253J6854l8708l5641J340K3704J5943K6286
8686B32406k7118j7250n2263l3021O137K0413N9141R839J45438J02769L5235M7902
8674E29628o3844j33714n0234n5358j5256M4045L7147m6663q6829n0475q1551
8663B6896M4186L7194N9456L1128J2943k3809q0452n341P8646j19470j2249K1943
8651G1071L0064m214j09402N2072N5697M0324r416k6372l9211K2931J8552q427
8639I3669M0665P7713L42m5964l6100Q649J33936O9041j2469K9323k867o1691
$$ y = [341688, 290812, 342945, 357939, 375288, 334976, 343251, 380473, 314265, 172457, 194133, 191511, 130426, 99389, 190426, 243299, 176528, 83676, 55695, 59932, 69625, 93086, 94301, 80489, 195376, 243242, 253736, 168957, 161375, 222628, 239482, 200774, 165133, 166473, 190177, 206120, 232406, 205288, 188038, 135775, 102754, 108891, 129304, 188445, 198284, 343722, 446491, 481726, 529628, 465784, 332070, 281836, 226478, 211222, 255267, 292414, 245751, 158922, 108447, 26896, 71082, 108276, 167732, 198860, 211803, 187994, 107542, 102201, 180847, 61377, 49128, 71071, 101135, 96921, -12481, 39591, 95288, 135612, 126196, 99824, 60613, 83544, 102096, 93669, 134334, 212047, 212389, 166425, 130325, 138974, 272910, 341951, 329482, 358805, 355938, 294247]
8627B94247m8015m3667N315p5206m8041K845O5757p3947m2895P5359J3642o7352
8615E8042K003m8116O3755J15805Q2088Q886m0681n1060k3940n8155p567M9278
8603A50338N0219N5997L9435ll3147o650N4919r980N9411K8406n9558J8482J2866
8590C60735k8459L5774J2945m7874k2341M3584k221l9549k5788k5301o179k3247
8578B32079l2009j8373O863k1673l6613k2352j3463j8313j1901P1822K6506r7291
8566F5282n4159J404O8626L8385j1853J8786K5672K0347P1312J5390j6867n2514
8554A89811j10879l8045n4152L769k5999J3123l2766P4488O1072Q7314q9363j03151
8542b4778O9094N7251k8527m1185k169O6266m355q5906M6368M3750K169k4798
$$ y = [294247, 246232, 202565, 207880, 132674, 84633, 87478, 153235, 79288, 36393, 111752, 125394, 58042, 60045, 11929, 75684, 191489, 273577, 282463, 241782, 190722, 166782, 108627, 101060, 150338, 200557, 256554, 295989, 295986, 262839, 256189, 311108, 301128, 360539, 388945, 329387, 347869, 360735, 332276, 368050, 380995, 333121, 310780, 354364, 352143, 312594, 286806, 261505, 255326, 232079, 200070, 181697, 188560, 166887, 130274, 107922, 94459, 76146, 64245, 136067, 162573, 65282, 11123, 12527, 81153, 119538, 107685, 126471, 152143, 172490, 243802, 259192, 242325, 189811, 78932, 40887, -13265, -9496, -35495, -22372, -55138, 19350, 80422, 167736, 78373, -24778, 44316, 101567, 73040, 31855, 29686, 95952, 91597, 5691, 52059, 95809, 97978, 73180]
8530G3180k8863l4928k0306L0477K1331l2083q5932j5563R5564K4566p3466P3643
8518B7620N6862l4203l6880O810Q9879J20328K0793q8992j55999J9536O760L6254
8506F8768J00787K1981K750K2197p3361l8998N1345L4437J940m8964p3983j3902
8494E4997J3795L0241k1884p9397l5875k7782L1375Q9922M0285p9917o1238n518
8482e0996m0896L9756O9493n009l315L4900P361n9079m6571p5587K3793Q4439
8470b1711J5306j18R8278M623j3705N739o8791k1498N0421K7868J6096K7361q9089
8457C0780Q856N8573k1775n0067J2587l7714K0344Q961m4203l6835m0410l129
8445i4032L9544K9618o323j3882k2914O0797M0587J9544k373o0314k4719N8732
$$ y = [73180, 44317, 9389, -10917, 19560, 40891, 8808, -77124, -92687, 2877, 27443, -46023, 27620, 84482, 50279, 13399, 20209, 110088, 230416, 251209, 162217, 6218, 25754, 32514, 68768, 169555, 191536, 194286, 216483, 143122, 104124, 155469, 189906, 191846, 142882, 68899, 54997, 68792, 99033, 77149, -2248, -38123, -65905, -34530, 55392, 95677, 15760, -45478, -50996, -91892, -52136, 17357, 12348, 9033, 43933, 51294, -7785, -54356, -129943, -106150, -21711, -6405, -6523, 91755, 96378, 82673, 88412, 19621, -1877, 48544, 76412, 92508, 119869, 30780, 39636, 98209, 76434, 26367, 38954, 1240, 21584, 30545, -13658, -50493, -90903, -94032, -54488, -24870, -31193, -45075, -67989, -7192, 33395, 52939, 50566, -9748, -34467, 24265]
8433B4265k0582J5482M2690R9092q5148K1177O2146j7783r5450l8307K6411N9704
8421I3697L9894p813j15267m5647M2362L6152K8495K111N1958Q2069l4061l8837
8409A35113k8622q2904N6723O5791l4369j06909m1487O5074l5129o3906k4893
8398i5518J2569P799K3602q489O695L3955k755n5427K2290M7904l7711m7648J0380
8385h2354J04992M5325p5346l4672K1302K0893N9932J7915p2991p6092K1251N5637
8373E792L4907M951m0240o4336l3376K9295O4871N8514j8317l1288l8534O974
8361b0787R4155M9170k6423m460J3057j3319K622k9718K4959j553j9558J8488
8349H6633K5143l5891m3023p9287l2231M3205M9808l6826l1361K7402j9696M3026
$$ y = [24265, 3683, 19165, 61855, 160947, 75799, 96976, 159122, 141339, 45889, 7582, 33993, 93697, 133591, 125778, 10511, -35136, 7226, 43378, 71873, 73984, 125942, 208011, 173950, 135113, 106491, 23587, 80310, 146101, 111732, 4823, -36664, 28410, -6719, -70625, -95518, -82949, -75150, -51548, -60037, -53342, -19387, -22142, -77569, -55279, -7375, -45086, -92734, -82354, 22638, 67963, -7383, -42055, -20753, 140, 60072, 77987, 4996, -71096, -49845, 5792, 40699, 45650, 5410, -58926, -92302, -63007, 1864, 60378, 42061, 10773, -27761, -20787, 73368, 122538, 96115, 91655, 104712, 91393, 94015, 64297, 89256, 87703, 68145, 86633, 111776, 75885, 32862, -46425, -78656, -35451, 14357, -22469, -53830, -26428, -46124, -3098]
8337c098N2830J17808N6070o8641m1333M416o6408n3366m5729L7711M9395l1361
8325H294m6090J5956O5888K8365n3268r9310k8027P0012M4190Q8506J0763l9311
8313F5968Q136M4917L7471j2400j3543k2303n0041p3737l6298O1059J3432j16430
8301i3769j27732N9330R4098J20077P4795J4209n7389j20403p5187L268O8413
8290d0290R921R445O7772J5754o4741m3301j7092j0228O5780l4464j5608k9136
8278h6188J4753j1165K3423Q5354K8123o0508k2342K3175j373k2824P631J44464
8266A22523k0666q2938l3504K8351n688J589J971P220p760q934q467l7061L370
8253c9994N544o037K366J0883l6310p5414j1725L857K8355P3276R417K1232l9940
$$ y = [-3098, 49732, 167540, 223610, 154969, 113636, 118052, 51644, -1722, -47451, -9740, 39655, 8294, -37796, -21840, 44048, 72413, 19145, -80165, -108192, -38180, 6010, 94516, 105279, 65968, 74104, 119021, 156492, 144092, 130549, 108246, 58205, -15532, -51830, 9229, 22661, -93769, -221501, -162171, -68073, 52004, 126799, 141008, 83619, -36784, -111971, -108703, -40290, -30369, -20924, 46848, 62602, -2139, -45440, -62532, -72760, -6980, -41444, -57052, -86188, -71435, -82600, -59177, 26177, 54300, -6208, -28550, -5375, -6748, -29572, -21941, 122523, 101857, 18919, -14585, 13766, 8078, 9667, 11638, 18858, 11098, 2164, -6303, -43364, -39994, -34450, -40487, -38121, -27238, -63548, -138962, -150687, -146830, -118475, -45199, -35782, -14550, -54490]
8240e4490l1051j7003J15601O8463j14666P643L4378K2003K5808n6502k3329m1857
8228f5002L198J7796J04709J19801o2654p3411q6334o1956k2908j2727O5694M3641
8216c0153n728p3915J0174L9650M3365r790j0863O3233K2377L8774p8105L0551
8204C9570R355m251k9562K6042j1912k3962k1066n988o696k3622p343l38K0222
8191c9551M9277Q6406n6294j22091l6347Q9731O5395L5531p02J7950R0750K924
8179A82979J5515j6598o6737n7202n0579l1452L9790j7175m701l6438M749j7441
8167e5290K0132O3251J16639p8053J0451L7868K7393m4057o1810n6983k1476L799
8155c8136k4954J0463N9160K6553o349J9636J9118k1736k9546K7172M3020L3604
$$ y = [-54490, -85541, -102544, 13057, 81520, -33146, -25503, 8875, 30878, 56686, 184, -23145, -65002, -61804, -44008, 60701, 180502, 117848, 44437, -41897, -103853, -126761, -139488, -73794, -30153, -35881, -109796, -99622, -59972, -16607, -26397, -37260, 25973, 48350, 87124, 9019, 39570, 48925, 44674, 15112, 41154, 29242, 5280, -15786, -21774, -28470, -52092, -59435, -59773, -39551, 9726, 96132, 39838, -82253, -118600, -28869, 36526, 72057, 71355, 89305, 180055, 182979, 198494, 181896, 115159, 57957, 7378, -24074, 15716, -1459, -6160, -42598, -37849, -55290, -35158, 28093, 144732, 66679, 77130, 114998, 142391, 98334, 36524, -20459, -41935, -38136, -63090, -52627, 6533, 33086, 26737, 46373, 65491, 43755, 14209, 41381, 84401, 118005]
8143A18005M174j16194m7772J3405L6840K769o0136j1738O7985M0143l4945q945
8131C591N3075p3733n0706k3259L2808L6008K340J9910M8695J1600j0085J4462
8119F4706k2131n3134l2576J7181L0091N1744M3508n4701L55P8152J9248o2281
8107H0162l0899Q1231n1683j03156q6134J2034l181m8136P3564R7554N4807p459
8095F8704N9685Q829k9424J4493L8955l1016j1311M71j7199o7376N3856L8581
8083A27248p2568j50477j959N0981P7975P7695j0943q359J08324J1996r3155L0657
8071A47415M8884l4428k8730m4496l0483L6557R4566O6016o4074j26733J1590
8060G6084k461j4827o9713k4445l442l8626N4812M0135O5623n4161p9175m2544
$$ y = [118005, 122179, 5985, -41787, -28382, 8458, 11227, -48909, -60647, 7338, 47481, 12536, 3591, 56666, -17067, -67773, -91032, -58224, -22216, -19876, 34, 48729, 60329, 50244, 64706, 42575, -10559, -43135, -25954, 4137, 55881, 99389, 44688, 45043, 123195, 142443, 80162, 49263, 130494, 78811, -24345, -110479, -98445, -101626, -149762, -76198, 21356, 76163, 68704, 128389, 137218, 107794, 122287, 161242, 130226, 118915, 119386, 102187, 34811, 88667, 127248, 54680, -95797, -97756, -46775, 31200, 108895, 97952, 89593, 197917, 209913, 116758, 147415, 196299, 161871, 133141, 88645, 58162, 94719, 189285, 255301, 191227, 64494, 76084, 73623, 58796, -10917, -35362, -38804, -77430, -22618, 17517, 83140, 28979, -50196, -92740]
8048i2740Q0595N7933J6878l1667p7722K1410K1242p244j4968K2442O2800k8899
8036C0060m0789P9738J09897K850J4992q0153l2369K4157K1112K6082n5120n7561
8024D2896k7603m8464m3699L2794J06256O0902J015n3934K542L3092N2516M0815
8012A99128K6725k8685O5822L2134o8134r4244n4326m0232j03042n682N5600L6039
8000B1103j8263L6647n388p742j4441L2869N3038J01087j0099j2047o3730J2141
7988A25175j2607q210n0905p4922L376M0827r737O7814O3092L5845K8388m6204
7976A61932m1506l286P974j9997j9645k3944q2136P7034Q9755K0134r679m900
7964A51736r7257N841J7181l3981J6521L4621O4441Q2262m4518q870L987j31947
$$ y = [-92740, -12145, 45788, 62666, 30999, -46723, -25313, -4071, -11315, -26283, -3841, 58959, 30060, -10729, 69009, 178906, 181756, 196748, 116595, 84226, 108383, 129495, 155577, 100457, 42896, 15293, -33171, -76870, -44076, 62180, 123082, 124097, 70163, 72705, 105797, 158313, 199128, 225853, 197168, 262990, 295124, 226990, 132746, 78420, 38188, -64854, -70536, -14936, 21103, 2840, 39487, 34099, 26357, 11916, 44785, 97823, 198910, 188811, 176764, 113034, 125175, 112568, 104358, 53453, -21469, -18093, 22734, 12997, 80811, 143903, 179748, 208136, 161932, 120426, 117140, 125114, 105117, 85472, 61528, -20608, 56426, 146181, 166315, 156636, 151736, 54479, 60320, 77501, 43520, 60041, 94662, 159103, 241365, 196847, 187977, 191964, 60017]
7952F0017K3710N1659P773j7608J8998l3145k4822R860L0342l7164L6653O5887
7940A92160n7410o0349j772K4323J9864r322O4779m6535n8803p4313R284Q1369
7928H3275N4857l4843l2750j0174M1593J17117j2274m3536J9909Q948R429J6406
7916B17957n3444j2145j8174M3107J0953J0220J0476l3657K6480k659l7978M0461
7904B01597q4474m8531l1288Q4442J8179r6013J2228Q8864l1828q4913K3770l1336
7892B0697q1446P584O9616M9077N4650m5867n6801j692L0988J4099N5013o9094
7880D6824j08944L9733L7386N846P4934O7441K8925M705o0172j24245j4134J00308
7868I8607m1087k1203L4015M7727L2770k9845r574K627j607p3937n0271n1413
$$ y = [60017, 83727, 135386, 143159, 125551, 144549, 111404, 86582, 96442, 126784, 89620, 126273, 192160, 134750, 74401, 72629, 96952, 116816, 107494, 172273, 125738, 66935, -7378, 1906, 83275, 138132, 103289, 70539, 60365, 101958, 219075, 206801, 163265, 183174, 192122, 201551, 217957, 164513, 152368, 134194, 177301, 188254, 198474, 208950, 175293, 201773, 199114, 161136, 201597, 117123, 68592, 37304, 121746, 139925, 43912, 56140, 145004, 113176, 28263, 52033, 20697, -60749, -53165, 16451, 65528, 120178, 74311, 17510, 15818, 46806, 60905, 115918, 46824, -62120, -22387, 14999, 20845, 95779, 163220, 192145, 196850, 136678, 12433, -1701, 98607, 57520, 36317, 70332, 118059, 150829, 120984, 111410, 114037, 112430, 38493, -11778, -63191]
7856f3191J06610P8840j662q0379J3897J5318r193o0179M3052o7114J6037M3787
7844C5823l485L1999Q6437J3055J5221m1568Q385n6609j8543L6738M6297j7042
7832A36708n2534o7664j106j8604o5626R298P2908n8570n0647K3093J6357M6934
7820i453Q4342L3017o1538R903l5789O5984L7533j2379k4846n554j4254J3813
7808H0779p1050p5333l3394J260m1785k7170J9774R5262R4028m2056l7256K6563
7796a0378n176j1485k9784J3064M3017M3227J2206n8019m0709p586L5222L5875
7784A9474J4017o3502n3642N4973J25834o935p8387J9695N2881k4631l5914m667
7772A9196k542m3082L9036J22123K043J8002o006j3184n7548M072J09689o7191
$$ y = [-63191, 43419, 122259, 120597, 40218, 54115, 69433, 60240, 61, 43113, -24001, -7964, 35823, 32338, 64337, 150774, 163829, 179050, 137482, 145867, 89258, 70715, 107453, 153750, 136708, 84174, 16510, 15404, -3200, -68826, -59528, 13380, -45190, -95837, -72744, -56387, -9453, 74889, 107906, 46368, 56271, 20482, 86466, 123999, 111620, 86774, 81220, 66966, 80779, 9729, -65604, -98998, -97738, -139523, -166693, -146919, -51657, 42371, 315, -36941, -10378, -15554, -27039, -56823, -43759, -742, 42485, 54691, -3328, -44037, -51623, -16401, 19474, 33491, -30011, -83653, -28680, 97154, 90219, 11832, 31527, 84408, 59777, 23863, 19196, 16654, -26428, 12608, 134731, 136774, 154776, 148770, 135586, 78038, 82110, 191799, 124608]
7760A24608j27973n32P52P753o2280m8418K3474k1086j9963L9956O3689n3145
7748g3165j34850N448J16858O0060L4808M8623k6445l5622O3974O026m7881j9318
7736a484n3431L1482J06195O504j0528o8200n789m6074m6151m701N5223l9488
7724g6442K6901J43532J1038j672K6302l8630j89022o4787K4256L4498P8649n2155
7712g7532m7331R4557J04668J2725k2966l660j08222j11475J0479K2161K4393
7701a02203L1446o59L1894k5337J7195L4663O8860R7833L6168n4086n9680q6229
7689a0135j6033M4800P5041J04196m3424r6628l8547Q7132K9682n9499o1328o6903
7677e1646N8992K5272N5802q994K2509o4564q4158r3979j8255R9323M5702m9151
$$ y = [124608, -3365, -3897, -3145, 4608, -57672, -106090, -82616, -103702, -123665, -83709, -20020, -73165, -208015, -202567, -85709, -25649, 9159, 57782, 31337, -4285, 59689, 65715, 17834, -1484, -54915, -23433, 82762, 89266, 78738, 10538, 4749, -41325, -87476, -92177, -36954, -76442, -49541, 93991, 105029, 103357, 129659, 91029, -97993, -162780, -138524, -104026, -25377, -77532, -124863, -30306, 74362, 87087, 64121, 60461, -47761, -159236, -148757, -126596, -102203, -70757, -71416, -39522, -64859, -47664, -13001, 55859, 153692, 189860, 135774, 76094, -10135, -26168, 18632, 93673, 197869, 154445, 57817, 19270, 106402, 136084, 76585, 15257, -51646, 7346, 32618, 88420, 79426, 101935, 37371, -46787, -140766, -159021, -59698, -13996, -63147]
7665f3147o5113L8379M1812J8464k459Q545r722K4355J0065j15861Q2916J77112
7653A45346K3940l1585n4662o3999M64L8920J5722n0989j1730r02P380l621J1040
7640B5324q6833j10596O5039M8573J5100L4850L2904J9287P0475M8121n0088p4542
7628C7614j1089N4862P080n7024q6075j15647j432M6894M4255M5074o0893j9134
7616a15515j773R0316K5204L8924j6085J1859N456j3760m1672q3301k3858J4787
7604a09418N024n6520N6201L5351N6826K2245P640k2461k0060k6742K1963n1432
7592h1383L165O9646j8953l8348O2068k2931L5354P151m0302M4781N0498K823
7580G3569p8020n6709J6096K8339O4959j7739j02924k0363j0691R209M4207k5730
$$ y = [-63147, -128260, -89881, -48069, -29605, -32064, -23519, -33241, -8886, 1179, -114682, -31766, 145346, 169286, 137701, 83039, 19040, 19504, 58424, 74146, 23157, 11427, 10525, 17905, 14284, 25324, -61509, -172105, -107066, -58493, -43393, -8543, 24361, 43648, 114123, 162244, 112156, 37614, 26525, 81387, 88467, 31443, -54632, -170279, -171711, -124817, -80562, -35488, -96381, -115515, -117288, -26972, -1768, 37156, 21071, 32930, 38386, 24626, -17046, -100347, -124205, -109418, -104394, -160914, -104713, -69362, -12536, 9709, 17349, -5112, -25172, -51914, -29951, -81383, -78218, -8572, -27525, -65873, -3805, -26736, 8618, 15769, -24533, 20248, 70746, 73569, -4451, -61160, -45064, -16725, 48234, 30495, -72429, -92792, -103483, -94274, -50067, -75797]
7568g5797L1953r65J8779K3334m4467L3281L4110n061l3769m2900n222K4417j0241
7555e2548k2891k9790L5650P7138j0007j5336P5789R1804M835n6398o2730l0679
7543D837L0786L2871K1909m4440j1782l892j7500N8808p0852q4936k9913J03973
7531a0131r554n868M2391M2941n4341O294k7149m6468m4381j091J02893N1359
7519D6895J1752j1436l2443j29156k1854J24705R2372L76j08798L91O115L9657
7507A8576k7861L0447J2075K5390M048k4913j40901l4713J18393L4372q4130J3546
7495e5671J6077N901l3665j4235P78N7273O6658l4212J5339j4199j5894l4797
7483d0647J7914j4250o2005l9675M2129K733K865M2549r117p4855k0111J15209
$$ y = [-75797, -43844, -44809, -26030, -2696, -47163, -13882, 20228, 15167, -18602, -61502, -66724, -42307, -52548, -75439, -105229, -69579, 7559, -2448, -17784, 58005, 149809, 154644, 98246, 35516, 4837, 35623, 68494, 90403, 45963, 34181, 30289, 12789, 71597, 745, -84191, -114104, -10131, -19685, -25553, 16838, 59779, 5438, 11732, -15417, -61885, -106266, -107357, -4464, 46895, 58647, 47211, 14768, -114388, -136242, -11537, 80835, 81211, -27587, -27196, -21081, 18576, -9285, 21162, 33237, 58627, 62675, 37762, -103139, -137852, -19459, 14913, -69217, -55671, -39594, -33693, -67358, -81593, -80815, -23542, 43116, 8904, 24243, 10044, -5850, -40647, -22733, -36983, -98988, -138663, -96534, -93801, -90936, -48387, -57504, -132359, -152470, -37261]
7471c7261K319j0506K509n159L360k5616k06L7051N2836L8260j170p5764m358
7458b3705N5243O4212J6364m345p7463p2276J1125R9998j5605o3261K696J7806
7446A0789k0207m6620l1739j2483N549J20614M5566n6262M1738P5015L9820p6410
7434I5370j52741j2182K4483l323J1231J03991k9605o2968j7052J2702m414k8974
7422f3482K601M8570K8017n2479L4855O5704l4214m5314q735n4663l683Q1673
7410a150J8547J9216r5451N0709j2998R067k1930q940J708R6746O8763J3161k671
7397A34777k1894k4777m9259J0613q08J4387k5347k4390o3241r5717O0815Q162
7385g6679l6517M5952Q4653j9844o1891m274J9953K6567M6434L2378m9666r6304
$$ y = [-37261, -34942, -45448, -42939, -48098, -44738, -70354, -70560, -33509, 19327, 57587, 56417, -19347, -23705, 31538, 95750, 112114, 107769, 30306, -41970, -30845, 69153, 53548, -9713, -7017, 10789, -9418, -56038, -87777, -100260, -94711, 25903, 71469, 15207, 56945, 131960, 171780, 95370, -57371, -69553, -45070, -48393, -37162, 66829, 37224, -25744, -42796, -30094, -34508, -63482, -60881, -12311, 15706, -36773, -1918, 63786, 29572, -15742, -24477, -79140, -82823, -1150, 17397, 36613, -58838, -8129, -21127, -12060, -33990, -42930, -41222, 55524, 124287, 137448, 134777, 112883, 88106, 38847, 49460, 48652, 63039, 37692, 13302, -49939, -145656, -84841, -76679, -113196, -67244, 17409, -2435, -64326, -68600, -48647, -22080, 24354, 56732, 7066, -89238]
7373h9238l1214m1178P318O0644N5890P7131M2718q5898L2808R8371j8309k7043
7361H2000L4361m3188o3876j6262k3730N780K4171K9463j6295K4338O2566j8273
7349H1055j4286n459J6727o6490j21159J1236Q1904k9213K7620N437P674K3755
7337A8801k8269m9742J50L912N8393K3869J3619o4284n7902n8364m6403m8720
7325b34940k05K7920J30378R6351p3935p9837Q149J9736R393J8057K7948o7141
7313a18126m6755K1090M4125N98m6711J5912Q6996M444J7468L1794m0287l5557
7301f5009P37P934L2624J4670k8539L2305k7432p0256J2411P4667q720j737K7328
7288I83n5836k126L0395N5516k9862r2566k3920n043P3759R343K2948Q0209p0380
$$ y = [-89238, -120452, -161630, -154312, -93668, -37778, 39353, 82071, -3827, 28981, 127352, 109043, 82000, 116361, 73173, 9297, -6965, -30695, -24915, -744, 28719, 12424, 36762, 99328, 81055, 66769, 61310, 78037, 11547, -109612, -98376, -16472, -45685, -18065, -12628, -4954, 18801, -9468, -59210, -59060, -55148, 3245, 27114, 40733, -23551, -81453, -139817, -186220, -234940, -235145, -207225, -76847, 19504, -54431, -134268, -126119, -106383, -96990, -78933, -50985, -118126, -164881, -143791, -99666, -99068, -145779, -129867, -42871, -38427, -20959, 10835, -29452, -65009, -64272, -56338, -23714, -9044, -37583, -5278, -32710, -102966, -90555, -15888, -24608, -26345, 983, -54853, -56979, -26584, 28932, -930, -93496, -117416, -122459, -48700, -39357, -16409, 63800, -6580]
7275f580p2311o626R1551j63J2732J9505J8337q0774L8837J16389K7647p3859
7263H4685k9249L3713k4227n2317q1051M617j5505o2144J9339L4672l631P3483
7251a7615M5423K7550l9618p0676O649L3597m3722m5307L9981m1449m8693j6042
7239a69922K3297M1845P8198M1780j4098O2548P1683j06176o2232k3441j2051
7228f8569P964k8282K6673Q7969k1539j7011J5402r5803R444J09951J9214m4792
7216F21L7045J3976M4094q2594j9653L9502k1346k9128M1818R3802L5370P741
7204A61248l1913m154o5360k7735M9187K3634L6021l352k5887q6683K5195L00
$$ y = [-6580, -78891, -85517, 6034, 5871, 18603, 38108, 56445, -24329, 14508, 130897, 158544, 84685, 55436, 89149, 64922, 12605, -68446, -63829, -79334, -141478, -122139, -87467, -91098, -17615, 27808, 55358, 15740, -54936, -48287, -14690, -58412, -103719, -63738, -105187, -153880, -169922, -146625, -104780, -26582, 15198, 1100, 63648, 135331, 29155, -33077, -56518, -68569, -60605, -88887, -62214, 25755, 4216, -12795, 2607, -93196, -83752, 26199, 45413, 621, 37666, 51642, 95736, 13142, -6511, 32991, 11645, -17483, 24335, 118137, 153507, 161248, 129335, 125181, 59821, 32086, 81273, 104907, 140928, 137576, 111689, 25006, 50201, 50501]
$$ [...]
##END NTUPLES=NMR SPECTRUM
##END=
