##TITLE=Analysis number 317415
Compound Code cc 38313
Book Reference 468/39
Project Code qc-cat
Chemist Name colinb
##JCAMPDX= 6.0         $$ Bruker NMR JCAMP-DX V2.0
##DATA TYPE= NMR SPECTRUM
##DATA CLASS= NTUPLES
##ORIGIN= Bruker BioSpin GmbH
##OWNER= nmr
$$ XWIN-NMR		Version 3.5
$$ Mon Feb 20 11:52:04 2006 GMT Standard Time (UT+0h)  MAYBRIDGE\nmr@NMR_250MHZ
##.OBSERVE FREQUENCY= 250.131544655141
##.OBSERVE NUCLEUS= ^1H
##.ACQUISITION MODE= SIMULTANEOUS (DQD)
##.ACQUISITION SCHEME= undefined
##.AVERAGES= 16
##.DIGITISER RES= 18
##SPECTROMETER/DATA SYSTEM= dpx250
##.PULSE SEQUENCE= zg30
##.SOLVENT NAME= CDCl3
##.SHIFT REFERENCE= (INTERNAL, CDCl3, 0, 16.522)
##AUDIT TRAIL= $$ (NUMBER, WHEN, WHO, WHERE, WHAT)
$$ ##TITLE= Audit trail, XWIN-NMR		Version 3.5
$$ ##JCAMPDX= 5.01
$$ ##ORIGIN= Bruker BioSpin GmbH
$$ ##OWNER= nmr
$$ C:\u/data/dgb/nmr/ADRS/16250/pdata/1/auditp.txt
$$ ##AUDIT TRAIL=  $$ (NUMBER, WHEN, WHO, WHERE, WHAT)
(   1,<2006-02-20 11:51:20.47 +000>,<MAYBRIDGE\nmr>,<NMR_250MHZ>,
      <created by zg, POWCHK disabled, PULCHK disabled
       configuration hash MD5:
       84 BC 41 DB A1 6E 1D 46 DA 25 12 A5 C1 ED C5 3A
       data hash MD5: 64K
       3E 9C F3 16 49 43 D0 BC 0C A1 91 BF E0 D2 0A 3C>)
(   2,<2006-02-20 11:51:40.79 +000>,<MAYBRIDGE\nmr>,<NMR_250MHZ>,
      <Start of raw data processing
       ef LB = 0.3 FT_mod = 6 PKNL = 1 SI = 32K 
       data hash MD5: 32K
       11 81 CD 72 D5 9B A3 7D 11 A0 00 C1 B1 C9 FD 8F>)
(   3,<2006-02-20 11:51:44.95 +000>,<MAYBRIDGE\nmr>,<NMR_250MHZ>,
      <apk 
       data hash MD5: 32K
       02 B6 5C B1 38 67 D8 96 50 67 D7 3E DB 3F 98 C3>)
(   4,<2006-02-20 11:51:46.29 +000>,<MAYBRIDGE\nmr>,<NMR_250MHZ>,
      <abs ABSG = 5 
       data hash MD5: 32K
       60 05 5F 11 4B DD E3 41 32 16 AD 3D 8C 75 83 FF>)
$$ ##END=
$$ 
$$ hash MD5
$$ EF C3 4C E4 AB 90 AD EE 9B 9D 95 1F DF 2C 65 2B
##$RELAX= 
##$RELAX= 
##$RELAX= 
##$RELAX= 
##$RELAX= 
##$RELAX= 
##$RELAX= 
$$ Bruker specific parameters
$$ --------------------------
##$DU= <C:\u>
##$EXPNO= 16250
##$NAME= <ADRS>
##$PROCNO= 1
##$TYPE= <nmr>
##$USER= <dgb>
##$AMP= (0..31)
100 100 100 100 100 100 100 100 100 100 100 100 100 100 100 100 100 100 
100 100 100 100 100 100 100 100 100 100 100 100 100 100 
##$AQSEQ= 0
##$AQ_mod= 3
##$AUNM= <au_zg>
##$AUTOPOS= <16 >
##$BF1= 250.13
##$BF2= 250.13
##$BF3= 250.13
##$BF4= 250.13
##$BF5= 500.13
##$BF6= 500.13
##$BF7= 500.13
##$BF8= 500.13
##$BYTORDA= 1
##$CFDGTYP= 0
##$CFRGTYP= 5
##$CHEMSTR= <none>
##$CNST= (0..31)
1 1 145 1 1 1 1 1 1 1 1 1 1 1 1 1 1 1 1 1 1 1 1 1 1 1 1 1 1 1 1 1 
##$CPDPRG= <>
##$CPDPRG1= <>
##$CPDPRG2= <>
##$CPDPRG3= <>
##$CPDPRG4= <mlev>
##$CPDPRG5= <mlev>
##$CPDPRG6= <mlev>
##$CPDPRG7= <mlev>
##$CPDPRG8= <mlev>
##$CPDPRGB= <>
##$CPDPRGT= <>
##$D= (0..31)
0 1 0 0 0 0 0 0 0 0.06 0 0 0 0 0 0 0.0002 0 0 0 0 0 0 0 0 0 0 0 0 0 0 
0 
##$DATE= 1140436278
##$DBL= (0..7)
120 120 120 120 120 120 120 120 
##$DBP= (0..7)
150 150 150 150 150 150 150 150 
##$DBP07= 0
##$DBPNAM0= <>
##$DBPNAM1= <>
$$ [...]
##$SUBNAM7= <"">
##$SUBNAM8= <"">
##$SUBNAM9= <"">
##$SW= 20.6930455092707
##$SWIBOX= (0..15)
0 0 3 0 0 0 0 0 0 0 0 0 0 0 0 0 
##$SW_h= 5175.983436853
##$TD= 65536
##$TD0= 1
##$TE= 293.16
##$TE2= 300
##$TE3= 300
##$TEG= 300
##$TL= (0..7)
0 120 120 120 120 120 120 120 
##$TP= (0..7)
150 150 150 150 150 150 150 150 
##$TP07= 0
##$TPNAME0= <>
##$TPNAME1= <>
##$TPNAME2= <>
##$TPNAME3= <>
##$TPNAME4= <>
##$TPNAME5= <>
##$TPNAME6= <>
##$TPNAME7= <>
##$TPOAL= (0..7)
0.5 0.5 0.5 0.5 0.5 0.5 0.5 0.5 
##$TPOFFS= (0..7)
0 0 0 0 0 0 0 0 
##$TUNHIN= 0
##$TUNHOUT= 0
##$TUNXOUT= 0
##$USERA1= <user>
##$USERA2= <user>
##$USERA3= <user>
##$USERA4= <user>
##$USERA5= <user>
##$V9= 5
##$VALIST= <valist>
##$VCLIST= <CCCCCCCCCCCCCCC>
##$VD= 0
##$VDLIST= <DDDDDDDDDDDDDDD>
##$VPLIST= <PPPPPPPPPPPPPPP>
##$VTLIST= <TTTTTTTTTTTTTTT>
##$WBST= 1024
##$WBSW= 4
##$XGAIN= (0..3)
0 0 0 0 
##$XL= 0
##$YL= 0
##$YMAX_a= 510368
##$YMIN_a= -649961
##$ZGOPTNS= <>
##$ZL1= 120
##$ZL2= 120
##$ZL3= 120
##$ZL4= 120
##$ABSF1= 16.522
##$ABSF2= -4.171173
##$ABSG= 5
##$ABSL= 3
##$ALPHA= 0
##$AQORDER= 0
##$ASSFAC= 0
##$ASSFACI= 0
##$ASSFACX= 0
##$ASSWID= 0
##$AUNMP= <proc_1d>
##$AZFE= 0.1
##$AZFW= 0.1
##$BCFW= 0
##$BC_mod= 0
##$BYTORDP= 0
##$COROFFS= 0
##$CY= 12.5
##$DATMOD= 1
##$DC= 0
##$DFILT= <>
##$DTYPP= 0
##$F1P= 14.0000005364418
##$F2P= -0.99999901652339
##$FCOR= 0.5
##$FTSIZE= 32768
##$FT_mod= 6
##$GAMMA= 0
##$GB= 0
##$INTBC= 1
##$INTSCL= 1
##$ISEN= 128
##$LB= 0.3
##$LEV0= 0
##$LPBIN= 0
##$MAXI= 10000
##$MC2= 0
##$MEAN= 0
##$ME_mod= 0
##$MI= 0
##$NCOEF= 0
##$NC_proc= -3
##$NLEV= 6
##$NOISF1= 0
##$NOISF2= 0
##$NSP= 0
##$NTH_PI= 0
##$NZP= 0
##$OFFSET= 16.522
##$PC= 1
##$PHC0= 243.9694
##$PHC1= 2.099075
##$PH_mod= 1
##$PKNL= yes
##$PPARMOD= 0
##$PSCAL= 4
##$PSIGN= 0
##$REVERSE= no
##$SF= 250.13
##$SI= 32768
##$SIGF1= 0
##$SIGF2= 0
##$SINO= 400
##$SIOLD= 32768
##$SREGLST= <1H.CDCl3>
##$SSB= 0
##$STSI= 32768
##$STSR= 0
##$SW_p= 5175.98343685301
##$SYMM= 0
##$S_DEV= 0
##$TDeff= 65536
##$TDoff= 0
##$TI= <Analysis number 999999
Compound Code 99
Book Reference 9
Project Code 9>
##$TILT= no
##$TM1= 0
##$TM2= 0
##$TOPLEV= 0
##$USERP1= <user>
##$USERP2= <user>
##$USERP3= <user>
##$USERP4= <user>
##$USERP5= <user>
##$WDW= 1
##$XDIM= 32768
##$YMAX_p= 287241578
##$YMIN_p= -119253
$$ End of Bruker specific parameters
$$ ---------------------------------
##NTUPLES= NMR SPECTRUM
##VAR_NAME=  FREQUENCY,     SPECTRUM/REAL,   SPECTRUM/IMAG
##SYMBOL=    X,             R,               I
##VAR_TYPE=  INDEPENDENT,   DEPENDENT,       DEPENDENT
##VAR_FORM=  AFFN,          ASDF,            ASDF
##VAR_DIM=   32768,         32768,           32768
##UNITS=     HZ,            ARBITRARY UNITS, ARBITRARY UNITS
##FACTOR=    0.157963299565203, 1,           1
##FIRST=     4132.6476996994, 0,             0
##LAST=      -1043.33573715361, 0,           0
##MIN=       -1043.33573715361, -119253,     0
##MAX=       4132.6476996994, 287241578,     0
$$ Real data points
##PAGE= N=1
##DATA TABLE= (X++(R..R)), XYDATA
$$ [...]
$$ plain form
18430 2038212 2029614 2045838 2084110 2170665 2345407 2585964 2946670 3433761 4072744 4998974
18420 4998974 6355539 8420100 11750564 17086704 25018871 34507357 41931997 43849179
18412 43849179 40637627 35697663 33006745 34698032 39908275 44600895 44391853 38681014
18404 38681014 30085283 21793414 15599768 11533600 8906296 7131523 5900902 5020578
18396 5020578 4373829 3889677 3514221 3266343 3060380 2927848 2801757 2692205 2599101 2530607
18386 2530607 2453508 2420570 2368110 2304880 2213983 2118574 2013881 1904190 1797536 1720077 1706754
18375 1706754 1741759 1812515 1974884 2170589 2426504 2778421 3323053 4149236 5325518 7153368
18365 7153368 10077237 14794289 22100586 31470714 39711113 42423809 38426144 30330207
$$ packed form
18430B038212q598J6224L8272Q6555J74742K40557L60706M87091O38983R26230
18420D998974J356565K064561L330464N336140P932167R488486P424640J917182
18412D3849179l211552m939964k690918J691287N210243M692620k09042n710839
18404C8681014q595731q291869o193646m066168k627304j774773j230621q80324
18396E020578o46749m84152l75456k47878k05963j32532j26091j09552r3104o8494
18386B530607p7099l2938n2460o3230r0897r5409j04693j09691j06654p7459j3323
18375A706754L5005P0756J62369J95705K55915L51917N44632Q26183J176282J827850
18365G153368K923869M717052P306297R370128Q240399K712696l997665q095937
$$ plain form
18357 30330207 21768942 15075406 10618804 7843138 6038757 4785993 3894208 3261373
18349 3261373 2800789 2483972 2230067 2001483 1804656 1632979 1482693 1359053 1243083
18340 1243083 1208412 1185607 1189309 1169622 1156772 1129330 1076533 995647 896555 813049 754968
18329 754968 717051 699703 638544 560419 503696 464937 454430 422942 350326 334525 320890
18318 320890 305971 279027 247734 239294 234951 194166 192690 206775 196705 180681 182776 180944
18306 180944 171266 153944 114566 138016 147306 191364 187336 205229 199605 197904 249287 265995
18294 265995 227733 189331 176985 176558 175335 182299 183841 179421 177319 160698 159988 166676 175364 168863
18280 168863 216047 263009 332442 381506 366728 352807 308158 273623 232607 165435 117791
$$ packed form
18357C0330207q561265o693536m456602k775666j804381j252764q91785o32835
18349C261373m60584l16817k53905k28584j96827j71677j50286j23640j15970
18340A243083l4671k2805L702j9687j2850k7442n2797q0886r9092q3506n8081
18329G54968l7917j7348o1159p8125n6723l8759j0507l1488p2616j5801j3635
18318C20890j4919k6944l1293q440m343m0785j476J4085j0070j6024K095j832
18306A80944r678j7322l9378K3450R290M4058m028J7893n624j701N1383J6708
18294B65995l8262l8402j2346m27j223O964J542m420k102j6621p10O688Q688o501
18280A68863M7184M6962O9433M9064j4778j3921m4649l4535m1016o7172m7644
$$ plain form
18269 117791 110554 102742 82350 92683 95109 121663 158877 146519 141872 111391 118662 126509 138442
18256 138442 145044 141800 130634 131039 104261 99013 75314 54717 68595 75918 106853 136558 166495
18243 166495 202662 232206 261325 269571 229654 189768 163565 150820 153088 154381 153398 113635
18231 113635 67062 67479 45945 62644 135972 187045 210783 165143 110324 69621 68403 53728
18219 53728 51739 48815 48418 49732 41054 64863 76790 76151 63322 44810 72297 85789 73984
18206 73984 36728 45091 83083 104936 103703 98195 97628 106528 143296 167126 233919 306536 392158
18193 392158 457927 472158 428840 370865 371536 382711 342300 283934 239200 203819 176735 183182
18181 183182 164186 119014 95396 79600 65323 75543 99891 102466 102114 84280 76700 93106
$$ packed form
18269A17791p237p812k0392J0333K426K6554L7214j2358m647l0481P271P847J1933
18256A38442O602l244j1166M05k6778n248k3699k0597J3878P323L0935K9705K9937
18243A66495L6167K9544K9119Q246l9917l9886k6203j2745K268J293r83l9763
18231A13635m6573M17k1534J6699P3328N1073K3738m5640n4819m0703j218j4675
18219E3728j989k924l97J314q678K3809J1927o39j2829j8512K7487J3492j1805
18206G3984l7256Q363L7992K1853j233n508n67Q900L6768K3830O6793P2617Q5622
18193C92158O5769J4231m3318n7975O71J1175m0411n8366m4734l5381k7084O447
18181A83182j8996m5172k3618j5796j4277J0220K4348K575l52j7834p580J6406
$$ plain form
18169 93106 126374 160439 166821 127225 95435 86602 105393 105040 94130 104752 104148 134567 175299
18156 175299 217687 229106 239301 246598 278789 290160 304007 323586 352710 383017 421106 454480
18144 454480 504726 549997 580212 649544 645867 601187 516460 400027 334341 273240 249654
18133 249654 246624 206862 193033 215627 284608 305151 347198 391407 428932 476939 505847 544708
18121 544708 613611 730380 857710 991195 1164401 1358292 1651244 2000270 2516330 3276855
18111 3276855 4376798 6079481 8956601 14253173 24457096 40749488 52368563 49667170
18103 49667170 38413317 24984940 15359769 10092039 7196013 5445765 4298324 3541774
18095 3541774 3015388 2619529 2275184 1979452 1758528 1572018 1388175 1247323 1105559
$$ packed form
18169I3106L3268L4065O382l9596l1790q833J8791l53j0910J0622o04L0419M0732
18156A75299M2388J1419J0195P297L2191J1371J3847J9579K9124L0307L8089L3374
18144D54480N0246M5271L0215O9332l677m4680q4727j16433o5686o1101k3586
18133B49654l030l9762j3829K2594O8981K0543M2047M4209L7525M8007K8908L8861
18121E44708O8903J16769J27330J33485J73206J93891K92952L49026N16060P60525
18111C276855J099943J702683K877120N296572J0203923J6292392J1619075k701393
18103D9667170j1253853j3428377r625171n267730k896026j750248j147441p56550
18095C541774n26386l95859l44345k95732k20924j86510j83843j40852j41764
$$ plain form
18086 1105559 979108 878719 799489 741086 694453 628486 581998 578470 568156 510330 438060
18075 438060 400839 367847 318394 295320 273555 278760 251993 233143 198099 165331 162418 151611
18063 151611 154533 159138 123944 89021 92666 106926 86583 68713 44454 39802 83670 102890
18051 102890 111128 80956 61084 65303 28353 37189 41012 51653 61452 52194 53433 59199 37043
18038 37043 15662 29835 62169 83752 51935 26220 5403 24344 34192 23426 47571 63194
18026 63194 50207 46001 69763 87473 94145 86993 77819 57811 47623 48067 54122 61028 55647
18013 55647 42633 55389 68636 35074 21290 19480 37338 24040 -2004 31570 50535 45528
18001 45528 31385 34924 47506 46370 48515 37597 28805 28604 11981 10985 27061 16557 11977
$$ packed form
18086A105559j26451j00389p9230n8403m6633o5967m6488l528j0314n7826p2270
18075D38060l7221l2992m9453k3074k1765N205k6767j8850l5044l2768k913j0807
18063A51611K922M605l5194l4923L645J4260k0343j7870k4259m652M3868J9220
18051A02890Q238l0172j9872M219l6950Q836L823J0641R799r258J239N766k2156
18038C7043k1381J4173L2334K1583l1817k5715k0817J8941R848j0766K4145J5623
18026F3194j2987m206K3762J7710O672p152r174k0008j0188M44O055O906n381
18013E5647j3014J2756J3247l3562j3784j810J7858j3298k6044L3574J8965n007
18001D5528j4143L539J2582j136K145j0918q792k01j6623r96J6076j0504m580
$$ plain form
17988 11977 2331 6293 18295 27136 18320 23485 71022 113891 110149 85579 62010 91751 84154
17975 84154 75076 73365 55144 40728 37295 73185 94667 102217 111926 118175 104736 69053 66375
17962 66375 54164 48647 58068 62189 65226 80724 90604 103516 154176 222638 216749 183861 143108
17949 143108 125482 137639 136212 124556 114174 112449 108915 101128 98111 73549 68467 38689 48791
17936 48791 88759 91386 67251 62388 81074 93018 84177 81423 64489 59507 48105 55709 56717
17923 56717 85886 91476 79749 106936 116565 92241 97041 81074 64970 30306 65288 67024
17911 67024 74928 118383 130432 168283 217605 241894 243678 245433 226034 201065 200166 222781 280461
17898 280461 289304 264750 212698 184088 159615 120826 70062 71712 57123 43368 36912 47793
$$ packed form
17988A1977r646L962J2002Q841q816N165M7537M2869l742k4570k3569K9741p597
17975H4154r078j711j8221j4416l433L5890K1482P550R709O249j3439l5683k678
17962F6375j2211n517R421M121L037J5498R880J2912N0660O8462n889l2888m0753
17949A43108j7626J2157j427j1656j0382j725l534p787l017k4562n082k9778J0102
17936D8791L9968K627k4135m863J8686J1944q841k754j6934m982j1402P604J008
17923E6717K9169N590j1727K7187R629k4324M800j5967j6104l4664L4982J736
17911F7024P904M3455J2049L7851M9322K4289J784J755j9399k4969q99K2615N7680
17898B80461Q843k4554n2052k8610k4473l8789n0764J650j4589j3755o456J0881
$$ plain form
17886 47793 45673 51968 51700 81653 64861 65123 47725 6595 -18378 -34723 -29056 22105 38279
17873 38279 19479 -6213 -30045 -20678 1508 2840 -235 2076 6548 2851 -19698 28421 64941
17860 64941 74940 76217 86657 76466 94405 126857 185859 218274 222198 199934 139439 126720
17848 126720 159591 160421 133389 84743 55034 43008 43423 45977 29307 7004 -19140 -32211
17836 -32211 -61960 -40417 -29867 -8223 -9606 -30027 -23440 14207 37657 46155 37231 51094
17824 51094 91448 94542 43041 -3693 28388 31961 18635 6329 -6024 10193 25181 10719
17812 10719 -10803 -21050 -18325 12915 -14353 -19527 21177 22620 13165 10013 12158 20843 16235
17799 16235 3112 6294 6114 -9736 -13621 -19526 7468 19944 29381 21792 -10971 -11144 -1592 16295
$$ packed form
17886D7793k120O295k68K9953j6792K62j7398m1130k4973j6345N667N1161J6174
17873C8279j8800k5692k3832R367K2186J332l075K311M472l697k2549M8119L6520
17860F4941R999J277J0440j0191J7939L2452N9002L2415L924k2264o0495j2719
17848A26720L2871Q30k7032m8646k9709j2026M15K554j6670k2303k6144j3071
17836c2211k9749K1543J0550K1644j383k0421O587L7647K3450Q498q924J3863
17824E1094M0354L094n1501m6734L2081L573j3326j2306j2353J6217J4988j4462
17812A0719k1522j0247K725L1240k7268n174M0704J443r455l152K145Q685m608
17799A6235j3123L182j80j5850l885n905K6994J2476R437p589l2763j73R552J7887
$$ plain form
17785 16295 16057 -10115 -25171 -29931 -14324 -4013 -5606 -4916 12262 21400 5157 -2054 -18927
17772 -18927 -8919 13909 23869 9312 12126 13326 12365 15839 6328 6105 -6196 -8640 2604 -12278
17758 -12278 -19274 -20066 -6890 -23656 -19200 -10548 -16272 -14319 5256 201 -28811 -32658 -28135 6563
17744 6563 44460 25566 15768 7397 -4334 -13854 -38560 -8168 7504 -11214 -31466 -15158
17732 -15158 -22604 -25569 -7363 1777 -10209 -2096 2801 -4709 22511 10481 -4046 -2523 -8809
17719 -8809 -9316 8313 4528 8724 -6235 -26391 -42224 -60403 -64792 -46553 -20338 -1572 17984
17706 17984 22214 1904 16092 9910 -6371 -13640 -19883 -13144 10622 26998 35703 7710 7233
17693 7233 30197 36748 21593 -1101 1091 -2356 -16903 -30826 -43400 -47186 -43178 -26848 -7608
$$ packed form
17785A6295k38k6172j5056m760J5607J0311j593O90J7178R138j6243p211j6873
17772a8927J0008K2828R960j4557K814J200r61L474r511k23j2301k444J1244j4882
17758a2278o996p92J3176j6766M456Q652n724J953J9575n055k9012l847M523L4698
17744F563L7897j8894r798q371j1731r520k4706L0392J5672j8718k0252J6308
17732a5158p446k965J8206R140j1986Q113M897p510K7220j2030j4527J523o286
17719h809n07J7629l785M196j4959k0156j5833j8179m389J8239K6215J8766J9556
17706A7984M230k0310J4188o182j6281p269o243O739K3766J6376Q705k7993m77
17693G233K2964O551j5155k2694K192l447j4547j3923j2574l786M008J6330J9240
$$ plain form
17680 -7608 18014 14418 12318 7871 -3287 -11463 -9938 -5378 -3982 -5984 -14861 -19471 4062 -6566
17666 -6566 21698 58147 66937 54062 42848 67821 78702 123175 178555 247691 325632 404863
17654 404863 491582 632857 771843 810285 795148 807968 856653 870713 763779 655602 569985
17643 569985 458567 379733 297416 230843 183679 163520 133056 103840 88291 73748 64272
17632 64272 65844 36458 6958 15909 16638 31070 41806 31720 12978 -6557 1178 11284 5261
17619 5261 -5262 7614 5192 3048 -5383 -7210 6079 12719 14472 17340 21245 497 -15397
17606 -15397 -15433 -13908 -6183 32121 48838 53115 44658 41783 45247 51626 39595 52772 93601 137631
17592 137631 149474 153115 179595 224662 283047 283860 233015 209408 173142 180439 174777 118961
$$ packed form
17680g608K5622l596k100m447j1158q176J525M560J396k002q877m610K3533j0628
17666f566K8264L6449Q790j2875j1214K4973J0881M4473N5380O9136P7941P9231
17654D04863Q6719J41275J38986L8442j5137J2820M8685J4060j06934j08177q5617
17643E69985j11418p8834q2317o6573m7164k0159l0464k9216j5549j4543r476
17632F4272J572k9386k9500Q951P29J4432J0736j0086j8742j9535P735J0106o023
17619E261j0523J2876k422k144q431j827J3289O640J753K868L905k0748j5894
17606a5397l6J525P725L8304J6717M277q457k875L464O379j2031J3177M0829M4030
17592A37631J1843L641K6480M5067N8385Q13n0845k3607l6266P297n662n5816
$$ plain form
17580 118961 60903 13847 6044 10867 45148 31449 -823 20600 19224 25124 44103 21152
17568 21152 10788 25794 25851 41317 56073 32697 13810 12227 24756 13309 16694 563 7578
17555 7578 22982 50108 84339 78480 82991 104769 117125 131701 154425 179320 219745 242921
17543 242921 239368 225863 226217 240496 234077 201170 176296 125787 96312 71651 55124 61023
17531 61023 77127 90637 52012 31324 23592 17608 7715 -9322 -5231 13769 29976 5868
17519 5868 -8684 -15940 -11629 -25843 -33147 -36544 -25312 -50157 -28287 -2589 16390 5518 -7699
17506 -7699 -26004 -31510 -4525 5394 18800 16909 2246 -10773 -1007 18471 37428 33751 16000
17493 16000 18839 40035 46777 41574 27888 7358 -8581 -10613 -17786 949 13289 6034 5896
$$ packed form
17580A18961n8058m7056p803M823L4281j3699l2272K1423j376N900J8979k2951
17568B1152j0364J5006N7J5466J4756k3376j8887j583J2529j1447L385j6131P015
17555G578J5404K7126L4231n859M511K1778J2356J4576K2724K4895M0425K3176
17543B42921l553j3505L54J4279o419l2907k4874n0509k9475k4661j6527N899
17531F1023J6104J3510l8625k0688p732n984r893j7037M091J9000J6207k4108
17519E868j4552p256M311j4214p304l397J1232k4845K1870K5698J8979j0872j3217
17506g699j8305n506K6985R919J3406j891j4663j3019R766J9478J8957l677j7751
17493A6000K839K1196O742n203j3686k0530j5939k032p173J8735J2340p255j38
$$ plain form
17480 5896 32394 49925 27464 -557 -38457 -32375 -4699 -614 12951 29527 27651 43420
17468 43420 47842 30509 20437 14426 4602 1942 28805 18719 -2814 12589 32840 36568 39171
17455 39171 48723 41278 24531 14828 14593 12644 2307 14444 17174 15138 52878 79743 100932
17442 100932 108553 141931 232040 293256 322327 307786 244847 187321 158692 139222 103747 84144
17430 84144 76036 71737 77742 80430 86355 80704 83205 62287 44994 59962 70690 86287 83108
17417 83108 97728 114337 164510 216799 249773 281173 311079 323494 323205 323157 301241 291209 266503
17404 266503 253468 253747 201229 152861 117308 98774 109668 72120 53746 74482 123651 150604
17392 150604 151145 104453 92234 84833 77518 69967 57546 52454 34726 29154 51402 66341 82898
$$ packed form
17480E896K6498J7531k2461k8021l7900O082K7676M085J3565J6576j876J5769
17468D3420M422j7333j0072o011r824k660K6863j0086k1533J5403K0251L728K603
17455C9171R552p445j6747r703k35j949j0337J2137K730k036L7740K6865K1189
17442A00932P621L3378R0109O1216K9071j4541o2939n7526k8629j9470l5475j9603
17430H4144q108m299O005K688N925n651K501k0918j7293J4968J0728J5597l179
17417H3108J4620J6609N0173N2289L2974L1400K9906J2415k89m8k1916j0032k4706
17404B66503j3035K79n2518m8368l5553j8534J0894l7548j8374K0736M9169K6953
17392A50604N41m6692j2219p401p315p551j2421n092j7728n572K2248J4939J6557
$$ plain form
17379 82898 92042 91241 85346 75434 48887 55549 55195 69022 53268 20417 9134 10150 35504
17366 35504 49749 80174 99783 122063 161337 201959 243824 239174 248867 237542 252189 269598
17354 269598 241879 229524 202097 179690 158270 137804 137345 136747 90474 57305 54613 43018
17342 43018 37926 27962 44000 43135 42515 50604 36570 39305 34213 35742 26206 14623 -1558 -7346
17328 -7346 -6953 12363 33382 39247 66575 69766 53553 78151 88444 66420 39210 24578 57035
17315 57035 70181 49015 30965 9473 16639 25199 53019 68666 46992 -2715 -3331 -9653 -18421
17302 -18421 -1851 25220 41420 30983 8245 9093 24235 18926 8435 22652 29048 34600 41026
17289 41026 44429 49278 40971 26317 25619 40092 53996 74911 81859 55738 49537 58258 52446
$$ packed form
17379H2898R144q01n895r912k6547O662l54J3827j5754l2851j1283J016K5354
17366C5504J4245L0425J9609K2280L9274M0622M1865m650R693j1325J4647J7409
17354B69598k7719j2355k7427k2407k1420k0466m59n98m6273l3169k692j1595
17342D3018n092r964J6038q65o20Q089j4034K735n092J529r536j1583j6181n788
17328g346L93J9316K1019N865K7328L191j6213K4598J0293k2024k7210j4632L2457
17315E7035J3146k1166j8050k1492P166Q560K7820J5647k1674m9707o16o322q768
17302a8421J6570K7071J6200j0437k2738Q48J5142n309j0491J4217O396N552O426
17289D1026L403M849q307j4654o98J4473J3904K0915O948k6121o201Q721n812
$$ plain form
17276 52446 21449 25580 53464 30591 23495 42858 68114 93455 135914 114458 78307 54053
17264 54053 57770 73974 68795 32177 56970 26220 20290 39912 54252 43680 45855 55436 36238
17251 36238 40930 30948 13165 43844 39516 53926 64887 19476 -16817 -7040 22962 16547 3635
17238 3635 -16043 -12890 10777 25019 24033 19206 44765 53721 38715 22846 20340 35488 24577
17225 24577 27154 60554 60267 47095 45248 31728 25882 8441 28934 47068 49611 37645 25068
17212 25068 48755 82231 60391 47290 40230 35343 19473 14154 34024 51992 69378 90959
17200 90959 95771 90058 99969 109495 103734 107565 135243 199357 253845 265047 256028 245635 248187
17187 248187 249137 248347 229424 174371 138491 105494 106828 108260 89017 79229 73541 94066 114758
$$ packed form
17276E2446l0997M131K7884k2873p096J9363K5256K5341M2459k1456l6151k4254
17264E4053L717J6204n179l6618K4793l0750n930J9622J4340j0572K175R581j9198
17251C6238M692r982j7783L0679m328J4410J0961m5411l6293R777L0002o415j2912
17238C635j9678L153K3667J4242r86m827K5559Q956j5006j5869k506J5148j0911
17225B4577K577L3400k87j3172j847j3520n846j7441K0493J8134K543j1966j2577
17212B5068K3687L3476k1840j3101p060m887j5870n319J9870J7968J7386K1581
17200I0959M812n713R911R526n761L831K7678O4114N4488J1202r019j0393K552
17187B48187R50p90j8923n5053l5880l2997J334J432j9243r788n688K0525K0692
$$ plain form
17174 114758 95066 79437 90466 97211 86556 94867 119714 133026 129647 145016 166862 194785
17162 194785 243124 279466 276704 295842 300691 292416 335143 354869 336375 318308 282034 265215
17150 265215 266802 285400 345558 416793 473306 515150 540885 576762 635867 683301 679886 722189
17138 722189 745847 768603 789767 760899 686946 636079 566811 499976 460597 391822 315939
17127 315939 269170 250259 249259 269629 290437 331186 355142 371191 392560 430949 463804 518301
17115 518301 553559 538588 514541 519027 565896 615433 632012 625103 616666 638613 658020 686350
17103 686350 724789 784316 880103 971123 1040447 1129454 1271631 1403856 1519855 1665494 1812432
17092 1812432 2022159 2320548 2700947 3195160 3866860 4771707 6044942 7865345 10598425
$$ packed form
17174A14758j9692j5629J1029O745j0655Q311K4847J3312l379J5369K1846K7923
17162A94785M8339L6342k762J9138M849q275M2727J9726j8494j8067l6274j6819
17150B65215J587J8598O0158P1235N6513M1844K5735L5877N9105M7434l415M2303
17138G22189K3658K2756K1164k8868p3953n0867o9268o6835l9379o8775p5883
17127C15939m6769j8911j000K0370K0808M0749K3956J6049K1369L8389L2855N4497
17115E18301L5258j4971k4047M486M6869M9537J6579o909q437K1947J9407K8330
17103F86350L8439N9527R5787R1020O9324Q9007J42177J32225J15999J45639J46938
17092A812432K09727K98389L80399M94213O71700R04847J273235J820403K733080
$$ plain form
17083 10598425 14395124 19036093 24137030 29863430 36362145 42506176 46808173 49090756
17075 49090756 50111662 49857974 47312923 42426392 36493629 30509063 24837221 19627410
17067 19627410 15134946 11612595 9095772 7329327 6107219 5255858 4629840 4112392
17059 4112392 3706245 3404301 3192464 2980788 2815527 2706190 2641290 2618839 2585227 2542670
17049 2542670 2543885 2539776 2564099 2644293 2806144 3069153 3409725 3884247 4606394 5660783
17039 5660783 7220557 9532871 12889375 17154967 21880932 27096712 33090839 39117529
17031 39117529 43528905 45844893 46790931 46711972 44774512 40578248 35101311 29437683
17023 29437683 24066466 19124112 14766013 11257134 8675920 6907356 5664081 4769666
$$ packed form
17083A0598425L796699M640969N100937N726400O498715O144031M301997K282583
17075D9090756J020906k53688k545051m886531n932763n984566n671842n209811
17067A9627410m492464l522351k516823j766445j222108q51361o26018n17448
17059D112392m06147l01944k11837k11676j65261j09337o4900k2451l3612m2557
17049B542670J215m109K4323Q0194J61851K63009L40572M74522P22147J054389
17039E660783J559774K312314L356504M265592M725965N215780N994127O026690
17031C9117529M411376K315988R46038p8959j937460m196264n476937n663628
17023B9437683n371217m942354m358099l508879k581214j768564j243275q94415
$$ plain form
17015 4769666 4108103 3601270 3222217 2928473 2637806 2383726 2174006 2005351 1849840
17006 1849840 1727048 1588764 1458836 1340189 1207473 1118627 1027310 948800 882821 811937
16996 811937 769011 720238 650123 625474 620132 602561 571064 545688 497944 499954 458038 413357
16984 413357 408939 420491 452949 472793 484581 537470 612085 631366 617131 629743 591785 536262
16972 536262 486722 419920 381437 370147 335458 319144 330279 348063 350433 322723 307503 315581
16960 315581 306745 293364 285613 307966 342487 341276 342076 337311 354800 370329 356639 333409 333152
16947 333152 367274 359177 337299 370804 404500 422263 432891 438718 445218 462390 471735 511664
16935 511664 553870 573332 584763 617083 640128 673211 735628 812775 903108 1007544 1124824
$$ packed form
17015D769666o61563n06833l79053k93744k90667k54080k09720j68655j55511
17006A849840j22792j38284j29928j18647j32716q8846r1317p8510o5979p0884
16996H11937m2926m8773p0115k4649n342j7571l1497k5376m7744K010m1916m4681
16984D13357m418J1552L2458J9844J1788N2889P4615J9281j4235J2612l7958n5523
16972E36262m9540o6802l8483j1290l4689j6314J1135J7784K370k7710j5220Q078
16960C15581q836j3381p751K2353L4521j211Q00m765J7489J5529j3690k3230k57
16947C33152L4122q097k1878L3505L3696J7763J0628N827O500J7172R345L9929
16935E11664M2206J9462J1431L2320K3045L3083O2417P7147R0333J04436J17280
$$ plain form
16924 1124824 1242714 1356690 1483862 1645207 1839929 2046582 2285889 2595654 3065587
16915 3065587 3696321 4594343 5904262 7849996 10681997 14562226 19449324 25096239
16907 25096239 31341733 37744252 43473635 47688449 50048388 50692784 49609802 46530030
16899 46530030 41746483 35996869 29986679 24187716 18937311 14568114 11182452 8714908
16891 8714908 7015309 5834450 4966356 4338730 3877565 3529739 3271562 3053940 2881371
16882 2881371 2694898 2540403 2410558 2266166 2164039 2087632 2001496 1958358 1930276 1914085
16872 1914085 1908504 1925535 1957353 2015180 2099229 2193913 2310444 2467894 2721617 3080514 3600996
16861 3600996 4347096 5426361 6979533 9295002 12602629 16926866 21998170 27640756
$$ packed form
16924A124824J17890J13976J27172J61345J94722K06653K39307L09765M69933
16915C065587O30734Q98022J309919J945734K832001L880229M887098N646915
16907B5096239O245494O402519N729383M214814K359939O44396j082982l079772
16899D6530030m783547n749614o010190n798963n250405m369197l385662k467544
16891H714908j699599j180859q68094o27626m61165l47826k58177k17622j72569
16882B881371j86473j54495j29845j44392j02127p6407q6136m3138k8082j6191
16872A914085n581J7031L1818N7827Q4049R4684J16531J57450K53723L58897N20482
16861C600996P46100J079265J553172K315469L307627M324237N071304N642586
$$ plain form
16853 27640756 33615280 39235298 43655455 46364238 47386143 46829448 44521423 40476041
16845 40476041 35263940 29597703 24017011 18869778 14494043 11057307 8525578 6731988
16837 6731988 5437472 4533899 3883898 3426637 3094076 2831790 2588175 2381135 2191028
16828 2191028 2029774 1862900 1712018 1600067 1466329 1370500 1242777 1096923 1007506 926124
16818 926124 824286 745677 688246 621471 599447 580357 561574 527786 509696 467368 406075
16807 406075 346528 320934 299549 283309 271597 260507 236677 237392 241043 218622 212658 227666
16795 227666 236717 220239 217975 182079 186275 196429 191061 172413 174482 172778 178910 146919 122877
16782 122877 137595 139973 115386 74991 69872 82834 114624 113701 80430 89730 89706 84576 100339
$$ packed form
16853B7640756N974524N620018M420157K708783J021905n56695k308025m045382
16845D0476041n212101n666237n580692n147233m375735l436736k531729j793590
16837F731988j294516r03573o50001m57261l32561k62286k43615k07040j90107
16828B191028j61254j66874j50882j11951j33738r5829j27723j45854q9417q1382
16818I26124j01838p8609n7431o6775k2024j9090j8783l3788j8090m2328o1293
16807D06075n9547k5594k1385j6240j1712j1090k3830P15L651k2421n964J5008
16795B27666R051j6478k264l5896M196J0154n368j8648K069j704O132l1991k4042
16782A22877J4718K378k4587m0395n119J2962L1790r23l3271R300k4n130J5763
$$ plain form
16769 100339 119986 137725 145447 149755 148732 161134 163341 142950 102761 67915 67011 104119 120922
16756 120922 137997 153621 143030 119610 92496 86334 56769 53464 86141 81543 79002 50932
16744 50932 48029 50769 61883 71956 64203 72529 66412 58056 81918 73357 78113 70025 42312
16731 42312 3376 2889 10773 63440 73851 41513 29679 25533 31905 30005 39232 32813 20046
16718 20046 9794 9020 28245 29465 24365 21510 10 -13387 -30889 -21129 -8331 7968 44738
16705 44738 48730 26326 17286 30844 35886 48702 75345 71472 80619 57538 63119 58781 32807
16692 32807 37790 22057 20765 -21102 -35772 -22787 -12503 24879 40875 25515 7559 14025
16680 14025 13880 11538 13867 44495 45496 29495 23308 35751 44342 32610 18475 5780 5636
$$ packed form
16769A00339J9647J7739P722M308j023J2402K207k0391m0189l4846r04L7108J6803
16756A20922J7075J5624j0591k3420k7114o162k9565l305L2677m598k541k8070
16744E0932k903K740J1114J0073p753Q326o117q356K3862q561M756q088k7713
16731D2312l8936m87P884N2667J0411l2338j1834m146O372j900R227o419j2767
16718B0046j0252p74J9225J220n100k855k1500j3397j7502R760J2798J6299L6770
16705D4738L992k2404r040J3558N042J2816K6643l873R147k3081N581m338k5974
16692C2807M983j5733j292m1867j4670J2985J0284L7382J5996j5360j7956O466
16680A4025j45k342K329L0628J001j6001o187J2443Q591j1732j4135j2695j44
$$ plain form
16667 5636 17029 43654 6985 -16740 -16901 -10996 -2913 9665 9044 14058 -1811 5236 11858 -3225
16653 -3225 4002 -456 11905 31963 22783 26436 45483 66746 70974 39680 -13053 -4625 3871
16640 3871 17032 49416 52178 42016 57719 78464 63500 37306 -18615 -15901 379 55077
16628 55077 47481 17908 -13378 -29793 -10175 32728 55375 68688 49532 8188 -23183 1773
16616 1773 2375 9150 9667 10376 -4794 12227 10830 -1909 -16334 -38876 -38455 -37503 -28077 -42482
16602 -42482 -35384 -23282 -1336 10037 19599 27129 14084 6056 28433 43278 39434 31982 77386
16589 77386 96780 79843 45575 31263 26343 2050 29135 101283 134517 165973 232199 258094
16577 258094 299688 338798 325662 312649 294790 230294 160175 105591 100119 90004 95578 96596
$$ packed form
16667E636J1393K6625l6669k3725j61N905Q083J2578o21N014j5869P047O622j5083
16653c225P227m458J2361K0058r180L653J9047K1263M228l1294n2733Q428Q496
16640C871J3161L2384K762j0162J5703K0745j4964k6194n5921K714J6280N4698
16628E5077p596k9573l1286j6415J9618M2903K2647J3313j9156m1344l1371K4956
16616A773O02O775N17P09j5170J7021j397j2739j4425k2542M21R52R426j4405
16602d2482P098J2102K1946J1373R562P530j3045q028K2377J4845l844p452M5404
16589G7386J9394j6937l4268j4312m920k4293K7085P2148L3234L1456O6226K5895
16577B58094M1594L9110j3136j3013j7859o4496p0119n4584n472j0115N574J018
$$ plain form
16565 96596 90341 117587 148108 156418 191896 202849 181780 182559 209242 199432 208093 224079 216430
16552 216430 166775 139331 122498 98382 66126 38297 16238 25950 29595 14645 22284 33782
16540 33782 22704 -3352 374 9795 22812 25073 19452 38586 41053 55580 53443 76403 126640
16527 126640 180898 239151 306286 326382 363502 361842 359123 392483 361131 298376 261780 238480
16515 238480 253353 258156 270380 281997 288928 300291 279942 266749 275083 250108 195615 169553
16503 169553 186467 156908 135265 134976 105198 60610 61585 64247 68931 69368 73398 56923 24922
16490 24922 8080 -5555 -9024 -6197 870 -6802 -6270 15260 25332 20776 26983 7793 13868
16477 13868 40922 27384 16823 13139 24775 16430 22798 9956 152 -15214 -6325 -973 -22498
$$ packed form
16565I6596o255K7246L0521Q310L5478J0953k1069P79K6683r810Q661J5986p649
16552B16430m9655k7444j6833k4116l2256k7829k2059R712L645j4950P639J1498
16540C3782j1078k6056L726R421J3017K261n621J9134K467J4527k137K2960N0237
16527A26640N4258N8253O7135K0096L7120j660k719L3360l1352o2755l6596k3300
16515B38480J4873M803J2224J1617O931J1363k0349j3193Q334k4975n4493k6062
16503A69553J6914k9559k1643k89k9778m4588R75K662M684M37M030j6475l2001
16490B4922j6842j3635l469K827P067p672N32K1530J0072m556O207j9190O075
16477A3868K7054j3538j0561l684J1636q345O368j2842r804j5366Q889N352k1525
$$ plain form
16464 -22498 -26714 -45693 -34233 -3377 13406 31626 50080 48869 35346 42324 32799 19780
16452 19780 24939 5093 148 13568 14795 35623 10237 -16779 -22556 7437 36777 41069 38525
16439 38525 25573 30655 -117 -23666 -2636 -2408 -12909 -21219 -32428 -24240 -26867 -22272 -29388
16426 -29388 -43826 -25919 -36466 -25066 2335 -655 10585 43040 35471 14321 17300 7426
16414 7426 -14785 -13726 -8538 12120 35481 25919 20868 15521 1151 5548 11535 -10575 10466
16401 10466 23379 61871 74145 69798 76333 96436 130179 175640 194909 211952 211343 215004 226243
16388 226243 204769 193840 182260 143268 119376 93531 61087 57894 74809 69164 29296 -11557
16376 -11557 -19451 -851 4746 9879 3078 17448 19690 19786 19601 25722 46376 44615 29286 19050
$$ packed form
16464b2498m216j8979J1460L0856J6783J8220J8454j211j3523O978r525j3019
16452A9780N159j9846m945J3420J227K0828k5386k7016n777K9993K9340M292k544
16439C8525j2952N082l0772k3549K1030K28j0501q310j1209Q188k627M595p116
16426b9388j4438J7907j0547J1400K7401k990J1240L2455p569k1150K979r874
16414G426k2211J059N188K0658K3361r562n051n347j4370M397N987k2110K1041
16401A0466J2913L8492J2274m347O535K0103L3743M5461J9269J7043o09L661J1239
16388B26243k1474j0929j1580l8992k3892k5845l2444l193J6915n645l9868m0853
16376a1557p894J8600N597N133o801J4370K242R6j85O121K0654j761j5329j0236
$$ plain form
16362 19050 1601 11085 5510 -24239 -27708 -15194 16419 29124 40482 52924 40401 56871
16350 56871 54624 38644 10072 35145 44933 56198 82667 101029 114207 118446 153703 223288
16338 223288 254830 249989 267140 295848 286897 221166 190832 158719 119201 88604 82869 66563
16326 66563 60711 51346 24651 19487 40953 51461 67476 32955 -22859 -32728 -16665 -13510 -16556
16313 -16556 -31146 -40611 -55277 -55862 -45796 -22787 -14356 -7298 -5418 3556 27006 24762 -5245
16300 -5245 -17576 -6764 -14458 -49117 -76553 -30418 1756 -22428 -22512 -8130 9065 3219 -4566
16287 -4566 -20977 -51097 -50030 -54532 -41011 -17390 2893 -19378 -58945 -61279 -42116 -15808
16275 -15808 -966 -11199 -8936 8537 -8702 -18393 -11434 26173 18385 -5398 -19594 -19036 -21579
$$ packed form
16362A9050j7449R484n575k9749l469J2514L1613J2705J1358J2442j2523J6470
16350E6871k247j5980k8572K5073R788J1265K6469J8362J3178M239L5257O9585
16338B23288L1542m841J7151K8708q951o5731l0334l2113l9518l0597n735j6306
16326F6563n852r365k6695n164K1466J0508J6015l4521n5814r869J6063L155l046
16313a6556j4590r465j4666n85J0066K3009Q431P058J880Q974K3450k244l0007
16300e245j2331J0812p694l4659k7436M6135L2174k4184q4J4382J7195n846p785
16287d566j6411l0120J067m502J3521K3621K0283k2271l9567k334J9163K6308
16275a5808J4842j0233K263J7473j7239r691O959L7607p788k3783j4196N58k543
$$ plain form
16262 -21579 -30064 -27721 -34170 -9144 14966 26991 3451 -23947 -10349 38550 40650 22440
16250 22440 -44 -25728 -36993 -22651 -10365 16445 40134 46343 7425 -7668 -13465 -13715
16238 -13715 -15526 -22117 -17223 -14337 14534 36005 30053 5863 3118 11493 -3001 -34607 -51161
16225 -51161 -13740 10315 -16276 -46398 -47418 -36602 -5573 -438 5880 3596 -25357 -25835 -16846
16212 -16846 -21129 -6373 -14151 -8431 -4625 786 4067 23233 13530 18205 46984 33294 -4442
16199 -4442 9807 50250 37669 6927 -19655 -10323 -9576 -4892 19789 9567 4719 61 -7089
16186 -7089 15147 11727 17991 30698 48728 50202 74374 43974 38693 30593 15618 10083 17500
16173 17500 50246 89165 118630 116607 132376 184297 275774 385911 491963 547487 508031
$$ packed form
16262b1579q485K343o449K5026K4110J2025k3540k7398J3598M8899K100j8210
16250B2440k2484k5684j1265J4342J2286K6810K3689O209l8918j5093n797k50
16238a3715j811o591M894K886K8871K1471n952k4190k745Q375j4494l1606j6554
16225e1161L7421K4055k6591l0122j020J0816L1029N135O318k284k8953m78Q989
16212a6846m283J4756p778N720L806N411L281J9166r703M675K8779j3690l7736
16199d442J4249M0443j2581l0742k6582R332P47M684K4681j0222m848m658p150
16186g089K2236l420O264J2707J8030J474K4172l0400n281q100j4975n535P417
16173A7500L2746L8919K9465k023J5769N1921R1477J10137J06052N5524l9456
$$ plain form
16162 508031 411797 301868 194351 104123 62445 73159 84282 85157 81689 53502 57911 59548
16150 59548 45363 35982 28940 25657 33260 49755 55670 48749 16326 6319 19131 24899 39274
16137 39274 32141 7541 -4529 -3338 2745 34712 72754 71125 74028 62121 37077 40631 24344
16124 24344 1664 17393 6912 36763 93982 144628 182200 212261 271112 369978 475655
16113 475655 512199 506275 418506 288144 198654 140387 105917 80548 98827 115175 133730
16102 133730 154748 198041 260121 279980 276492 275756 241924 213020 171882 142992 75289 45343
16090 45343 29592 26848 42711 37634 20195 37953 50467 54804 67846 64918 71616 37570 30816
16077 30816 8394 -3155 -7603 -44904 -28978 -10541 -9670 4654 -1161 5059 20112 27094 4618
$$ packed form
16162E08031r6234j09929j07517r0228m1678J0714J1123Q75l468k8187M409J637
16150E9548j4185r381p042l283P603J6495N915o921l2423j0007J2812N768J4375
16137C9274p133k4600j2070J191O083L1967L8042j629K903j1907k5044L554j6287
16124B4344k2680J5729j0481K9851N7219N0646L7572L0061N8851R8866J05677
16113D75655L6544n924q7769j30362q9490n8267l4470k5369J8279J6348J8555
16102A33730K1018M3293O2080J9859l488p36l3832k8904m1138k8890o7703k9946
16090D5343j5751k744J5863n077j7439J7758J2514M337J3042k928O698l4046o754
16077C0816k2422j1549m448l7301J5926J8437Q71J4324n815O220J5053O982k2476
$$ plain form
16064 4618 6768 25913 -17194 -49402 -49737 -14651 -24734 -43027 -27232 -28845 -13403 18927 73832
16051 73832 119491 177017 243508 302901 294752 259765 210078 165570 137744 96605 73254 75883
16039 75883 61877 37682 38068 63462 60695 30941 7367 3370 24008 42819 40047 29090 6661
16026 6661 25329 63279 59851 61775 55931 52659 45214 43207 35432 58701 28324 5062 11947
16013 11947 46617 77991 71941 41889 -10502 11015 24951 36833 16743 9456 1464 5992
16001 5992 3107 9049 12541 1261 42435 60033 31973 41000 45796 37817 36057 33209 40742 38247
15987 38247 56960 97615 149854 236806 270748 270816 293429 285949 242147 196663 159168 105974
15975 105974 81669 69967 68808 77432 64325 51702 48962 56343 53699 22293 -9000 7110
$$ packed form
16064D618K150J9145m3107l2208l35L5086j0083j8293J5795j613J5442L2330N4905
16051G3832M5659N7526O6491N9393q149l4987m9687m4508k7826m1139k3351K629
16039G5883j4006k4195L86K5394k767k9754k3574l997K0638J8811k772j0957k2429
16026F661J8668L7950l428J924n844l272p445k007p775K3269l0377k3262O885
16013A1947L4670L1374o050l0052n2391K1517J3936J1882k0090p287p992M528
16001E992k885N942L492j1280M1174J7598k8060R027M796p979j760k848P533k495
15987C8247J8713M0655N2239Q6952L3942O8K2613p480m3802m5484l7495n3194
15975A05974k4305j1702j159Q624j3107j2623k740P381k644l1406l1293J6110
$$ plain form
15963 7110 -13112 -25722 -4658 17683 6947 -19502 -18067 -9677 -1483 -23015 -38302 -38215 -40886
15950 -40886 -10624 -5711 -17127 -23634 -21951 -18349 -8410 -19813 -5610 16007 29602 41389 72259
15937 72259 88763 137517 204802 236545 260829 279074 243114 202908 150281 86062 32278 14171
15925 14171 -7376 -23059 4903 25828 24301 23523 14623 11460 747 617 -389 -13279 -4458
15912 -4458 175 10556 7760 11258 17893 1761 -8796 28563 19186 -7611 -32024 -22999 -23676
15899 -23676 -57668 -56532 -15533 -27100 -3408 10623 22006 37216 44425 72317 53022 31295
15887 31295 -899 -27211 -25320 -8366 19868 31760 41909 44899 53853 42196 31629 24030
15875 24030 5092 8085 4968 -13289 -4743 -16909 -3720 1451 1352 21382 38201 39907 44817
$$ packed form
15963G110k0222j2610K1064K2341j0736k6449J435Q390Q194k1532j5287Q7k671
15950d0886L0262M913j1416o507J683L602R939j1403J4203K1617J3595J1787L0870
15937G2259J6504M8754O7285L1743K4284J8245l5960m0206n2627o4219n3784j8107
15925A4171k1547j5683K7962K0925j527p78q900l163j0713j30j006j2890Q821
15912d458M633J0381k796L498O635j6132j0557L7359r377k6797k4413R025o77
15899b3676l3992J136M0999j1567K3692J4031J1383J5210P209K7892j9295k1727
15887C1295l2194k6312J891J6954K8234J1892J0149K990Q954j1657j0567p599
15875B4030j8938K993l117j8257Q546j2166J3189N171r9K0030J6819J706M910
$$ plain form
15862 44817 46581 43618 24793 21084 -3068 -7755 -6840 -18265 -24390 -16179 -3830 -13842 -8694
15849 -8694 3650 14885 23404 24761 -1002 6737 -31792 -49991 -40895 -28364 -13317 -1291 15525
15836 15525 45890 51156 56701 67310 62238 49179 30404 17570 13094 11553 -12252 -20990 -13660
15823 -13660 -18941 925 -9086 -18044 -13858 -856 -21092 -9107 -5550 12343 -26691 -54225
15811 -54225 -27938 -635 -4834 17974 40737 18064 -17577 -30961 -18668 -27029 -14334 23476
15799 23476 45244 4951 14304 38087 15766 -11869 -41304 -32673 -10004 -9739 5306 61701
15787 61701 84743 79916 85231 60094 59570 37728 10221 -108 2086 11429 35267 24762 1536
15774 1536 -6834 -2456 -6742 -22545 -26252 -49984 -55060 -25290 -1673 -10761 -31225 -28424 2675
$$ packed form
15862D4817J764k963j8825l709k4152m687R15j1425o125Q211J2349j0012N148
15849h694J2344J1235Q519J357k5763P739l8529j8199R096J2531J5047J2026J6816
15836A5525L0365N266N545J0609n072j3059j8775j2834m476j541k3805q738P330
15823a3660n281J9866j0011q958M186J3002k0236J1985L557J7893l9034k7534
15811e4225K6287K7303m199K2808K2763k2673l5641j3384J2293q361J2695L7810
15799B3476K1768m0293R353K3783k2321k7635k9435Q631K2669K65J5045N6395
15787F1701K3042m827N315k5137n24k1842k7507j0329K194R343K3838j0505k3226
15774A536q370M378m286j5803l707k3732n076K9770K3617r088k0464K801L1099
$$ plain form
15761 2675 15968 26884 41954 44762 22353 7716 21828 36629 36583 37531 9867 4228 47762
15748 47762 55244 40538 11742 4962 -17130 -7283 9288 12092 11340 33646 37271 18423 11567
15735 11567 -2781 -43250 -52313 -3420 29264 43155 36317 16262 -37857 -58177 -55699 -51469
15723 -51469 -16780 -24463 -28404 -2080 -6607 -9141 844 -731 -17563 -16785 -30659 -8713 18096
15710 18096 29910 18188 5858 4121 2719 3762 9792 8228 -914 -1447 -5474 7684 23289
15697 23289 4293 5347 16965 42164 42675 34702 37898 5445 -12546 -28502 -6773 -10471 -34275
15684 -34275 -34934 -24075 -6234 -4081 15058 12954 -18554 -42426 -28873 -15881 -14975 -27497 -36105
15671 -36105 -10777 16993 17280 7721 -23837 -26501 -5043 15140 -10897 115 -15322 -37074
$$ packed form
15761B675J3293J0916J5070K808k2409j4637J4112J4801m6R48k7664n639M3534
15748D7762P482j4706k8796o780k2092R847J6571K804p52K2306L625j8848o856
15735A1567j4348m0469r063M8893L2684J3891o838k0055n4119k0320K478M230
15723e1469L4689p683l941K6324m527k534R985j575j6832P78j3874K1946K6809
15710A8096J1814j1722j2330j737j402J043O030j564r142n33m027J3158J5605
15697B3289j8996J054J1618K5199N11p973L196l2453j7991j5956K1729l698k3804
15684c4275o59J0859J7841K153J9139k104l1508k3872J3553J2992R06j2522q608
15671c6105K5328K7770K87r559l1558k664K1458K0183k6037J1012j5437k1752
$$ plain form
15659 -37074 -44650 -62835 -26196 -17043 -21044 -14880 -33855 -45136 -36296 -32569 -9275 28608 20417
15646 20417 23082 17883 18669 23219 18092 6967 -15850 -31518 -3611 11931 15464 11314 -6143
15633 -6143 -13554 -29317 -21227 -22391 -43935 -37778 -43708 -58236 -85953 -52976 -15287 -4541 2973
15620 2973 14950 11570 12272 4815 -19360 -6563 7155 -1109 -32765 -58665 -58234 -34962 -9848
15607 -9848 -34616 -43662 -46074 -43282 -49434 -51869 -45082 -4792 9659 -1449 -20793 -17774 -21108
15594 -21108 -33355 -1327 19647 10188 -31773 -21224 -30579 -41368 -5465 4352 -2194 1531 -22576
15581 -22576 -48848 -53700 -71706 -60025 -60719 -47524 -29305 -16111 -17276 -28956 -13169 598
15569 598 1381 -5919 -27646 -28516 -33570 -19713 4448 -5882 -7406 -19073 -13101 -30975 -30467 -41565
$$ packed form
15659c7074p576j8185L6639R153m001O164j8975j1281Q840L727K3294L7883q191
15646B0417K665n199P86M550n127j1125k2817j5668K7907J5542L533m150j7457
15633f143p411j5763Q090j164k1544O157n930j4528k7717L2977L7689J0746P514
15620B973J1977l380P02p457k4175J2797J3718q264l1656k5900M31K3272K5114
15607i848k4768r046k412K792o152k435O787M0290J4451j1108j9344L019l334
15594b1108j2247L2028K0974r459m1961J0549r355j0789L5903R817o546L725k4107
15581b2576k6272m852j8006J1681o94J3195J8219J3194j165j1680J5787J3767
15569E98P83p300k1727q70n054J3857K4161j0330j524j1667N972j7874N08j1098
$$ plain form
15555 -41565 -41618 -39626 -29032 -3803 20652 -487 -5805 -6040 -244 34395 28671 13522 5226 12516
15541 12516 24040 7700 -19309 -25481 -10907 -2116 -11103 -15232 -14091 -30639 -45301 -44595 -41762
15528 -41762 -18458 -9037 4666 -3240 -9630 -9263 -28398 -16456 3808 28500 41530 34847 48961
15515 48961 21022 -37131 -26102 -4039 9414 19975 13031 -22422 -16684 -16092 -18311 -17267 -14604
15502 -14604 -17679 -20812 -19437 -28850 -6942 13873 31526 21838 9361 -16544 -43602 -43589 -51798
15489 -51798 -48024 -52839 -57198 -24593 -20727 -48159 -68015 -60421 -77518 -45770 -26238 -28511 -29325
15476 -29325 -16003 -33862 -50010 -49593 -24913 16066 692 -13643 -10982 -13028 -245 16521
15464 16521 27388 13133 12463 20932 12168 2161 -41301 -20231 16224 4070 6715 -14454 -1470
$$ packed form
15555d1565n3J992J0594K5229K4455k1139n318k35N796L4639n724j5149q296P290
15541A2516J1524j6340k7009o172J4574Q791q987m129J141j6548j4662P06K833
15528d1762K3304R421J3703p906o390L67j9135J1942K0264K4692J3030o683J4114
15515D8961k7939n8153J1029K2063J3453J0561o944l5453N738N92k219J044K663
15502a4604l075l133J375r413K1908K0815J7653r688j2477k5905k7058J3q209
15489e1798L774m815m359L2605L866k7432j9856P594j7097L1748J9532k273q14
15476b9325J3322j7859j6148M17K4680M0979j5374j4335K661k046J2783J6766
15464A6521J0867j4255o70Q469q764j0007m3462K1070L6455j2154K645k1169J2984
$$ plain form
15451 -1470 -8172 -23165 -7967 -13074 -16389 -7923 -4508 -7304 -14855 3173 10326 -7735 9325
15438 9325 19020 12316 12198 19666 39953 41665 43504 49969 40198 15190 4660 -12617 -21281 -17956
15424 -17956 20513 27271 5868 -4862 -3413 -15741 12646 14515 24550 13276 -24726 -50414
15412 -50414 -41865 -5548 4651 -1714 8515 2360 -27920 -31834 -17888 -20077 -21614 -10472 -4569
15399 -4569 -20212 -24457 -22974 -12449 -6962 -8438 -23708 -17185 -40023 -30184 -18503 4636 10352
15386 10352 49 9709 25971 25402 37113 31037 23282 6861 -31157 -32794 -52595 -59078 -47111
15373 -47111 -48845 -34159 -11016 16944 37451 34208 7325 -18974 -3522 18976 19499 3283
15361 3283 -34350 -17660 17425 27880 15298 -4395 -8006 -24759 -16311 -16141 -15911 650 -19270
$$ packed form
15451a470o702j4993J5198n107l315Q466L415k796p551J8028P153j8061J7060
15438I325R695o704j18P468K0287J712J839O465r771k5008j0530j7277q664L325
15424a7956L8469O758k1403j0730J449j2328K8387J869J0035j1274l8002k5688
15412e0414Q549L6317J0199o365J0229o155l0280l914J3946k189j537J1142N903
15399d569j5643m245J483J0525N487j476j5270O523k2838R839J1681K3139N716
15386A0352j0303R660J6262n69J1711o076p755j6421l8018j637j9801o483J1967
15373d7111j734J4686K3143K7960K0507l243k6883k6299J5452K2498N23j6216
15361C283l7633J6690L5085J0455j2582j9693l611j6753Q448J70K30J6561j9920
$$ plain form
15348 -19270 -66767 -75044 -58995 -33185 -20731 -1771 -5637 -10208 -11324 -27824 4466 32387
15336 32387 34886 7130 -30253 -55189 -25828 -10587 -12196 3639 40706 14391 5168 41241
15324 41241 51665 34601 7492 798 38519 32889 8968 -16304 -13170 -14586 -23711 -12341 1391
15311 1391 -14167 -37402 -39935 -19997 -1913 18747 20575 18508 25007 31187 14894 10538 -13617
15298 -13617 1394 9896 36686 21434 7529 -1342 -5084 18620 20858 10844 9837 7975 -37
15285 -37 -7227 -18857 -15189 13959 37985 8686 -18304 6121 7406 -9481 -46890 -86443 -59993
15272 -59993 -23145 -23036 -39259 -19241 14992 8662 3153 3077 11006 20552 12053 7859 -8381 -34273
15258 -34273 -30007 -3175 10539 -17478 -1477 6308 4219 11972 -14442 -24521 -30681 -9498 18738
$$ packed form
15348a9270m7497q277J6049K5810J2454J8960l866m571j116j6500L2290K7921
15336C2387K499k7756l7383k4936K9361J5241j609J5835L7067k6315r223L6073
15324D1241J0424j7064k7109o694L7721n630k3921k5272L134j416r125J1370J3732
15311A391j5558k3235k533J9938J8084K0660J828k067O499O180j6293m356k4155
15298a3617J5011Q502K6790j5252j3905q871l742K3704K238j0014j007j862q012
15285c7p190j1630L668K9148K4026k9299k6990K4425J285j6887l7409l9553K6450
15272e9993L6848J09j6223K0018L4233o330n509p6P929R546q499m194j6240k5892
15258c4273M266K6832J3714k8017J6001P785k089P753k6414j0079o160K1183K8236
$$ plain form
15245 18738 28825 4037 -5867 5072 11497 5301 2928 3411 5247 9575 -12124 -5255 17689
15232 17689 23078 6956 24918 3881 17127 8018 -15557 -6206 24550 23893 49199 43227 15266
15219 15266 20153 17864 1210 -36268 -26012 -5164 9137 20093 4074 4489 -4061 -34634 -48442
15206 -48442 -28006 -34648 -32648 -16345 15841 21453 8565 40086 52540 45716 15597 -4768
15194 -4768 -13612 -15539 -17927 -17673 -22380 -35079 -11157 5928 -3444 -20364 -29173 -22638 7908 28381
15180 28381 36603 18812 -9958 -55890 -84754 -66800 -35253 -38375 -40222 -27644 -9980 -11960
15168 -11960 -36729 -22930 12637 19834 43100 23797 294 1530 32731 31697 5673 -276
15156 -276 -8529 -31493 -11106 19359 16279 -30353 -45001 -26908 -19568 1507 -11767 1400 4086
$$ packed form
15245A8738J0087k4788r904J0939O425o196k373M83J836M328k1699O869K2944
15232A7689N389j6122J7962k1037J3246r109k3575R351L0756o57K5306n972k7961
15219A5266M887k289j6654l7478J0256K0848J4301J0956j6019M15q550l0573j3808
15206d8442K0436o642K000J6303L2186N612j2888L1521J2454o824l0119k0365
15194d768q844j927k388K54m707j2699K3922J7085r372j6920q809O535L0546K0473
15180B8381Q222j7791k8770m5932k8864J7954L1547l122j847J2578J7664j980
15168a1960k4769J3799L5567P197K3266j9303k3503J236L1201j034k6024n949
15156b76q253k2964K0387L0465l080m6632j4648J8093P340K1075j3274J3167K686
$$ plain form
15143 4086 -5141 12117 3408 -3657 847 -22920 -40317 -51760 -69115 -62237 -66336 -61353 -43105
15130 -43105 -37307 -33815 -23681 -36560 -26125 -4368 26400 9023 -4531 -23694 -19129 -1565
15118 -1565 1438 -15258 -13027 -44060 -47125 -50429 -51869 -39792 -35424 -3660 9031 -17570 -33640
15105 -33640 -39294 -35158 -16081 -11907 -34971 -44738 -24977 -16487 -24547 -43860 -35826 -7699 1996
15092 1996 -100 -9282 1084 31252 17136 6291 170 18572 25340 11388 -14107 498 16203
15079 16203 30705 21546 -13368 -39249 -21851 -14241 3167 9621 5041 4737 1007 -14907 -21113
15066 -21113 -19086 -31454 -32884 -38644 -37791 2267 19573 -1401 -13456 -218 -5902 -8019 -32103
15053 -32103 -19655 11751 25537 13885 13978 13071 7707 13378 904 -10047 -7864 -6723 -10248 -15309
$$ packed form
15143D086r227J7258q709p065M504k3767j7397j1443j7355O878m099M983J8248
15130d3105N798L492J0134j2879J0435K1757L0768j7377j3554j9163M565J7564
15118a565L003j6696K231l1033l065l304j440J2077M368L1764J2691k6601j6070
15105c3640n654M136J9077M174k3064r767J9761Q490q060j9313Q034K8127R695
15092A996k096r182J0366L0168j4116j0845o121J8402O768j3952k5495J4605J5705
15079A6203J4502r159l4914k5881J7398P610J7408O454m580l04l730j5914o206
15066b1113K027j2368j430n760Q53M0058J7306k0974j2055J3238n684k117k4084
15053c2103J2448L1406J3786j1652R3r07n364N671j2474j0951K183J141l525n061
$$ plain form
15039 -15309 -24320 -5034 -2824 -10345 -14114 -38706 -54060 -38377 -19931 4 4003 7210 12141
15026 12141 31638 31425 20597 421 -41783 -41571 -17621 -19041 -22280 -40958 -33377 -10045 2556
15013 2556 -6028 -2380 -35773 -24176 -38504 -16272 -8662 -49200 -53553 -19981 -3870 12903 17935
15000 17935 20436 717 -3430 2343 22371 7583 -6743 -11247 -12921 15325 14927 -16733 -25699
14987 -25699 -52710 -47228 -7369 11459 26805 36487 -1572 -41862 -33508 -6291 -27876 -33234
14975 -33234 -17541 -8245 -34975 -31966 -31641 -24427 -28463 -33750 -10043 -20747 -30969 -16588 13560
14962 13560 10212 -22065 -18429 -6564 24254 6418 -29065 -29169 6394 18757 -1244 -18093
14950 -18093 7043 27743 33348 26922 -600 -1666 1269 18247 30509 12765 -7274 -7503 -23661
$$ packed form
15039a5309r011J9286K210p521l769k4592j5354J5683J8446J9935L999L207M931
15026A2141J9497k13j0828k0176m2204K12K3950j420l239j8678P581K3332J2601
15013B556q584L648l3393J1597j4328K2232P610m0538m353L3572J6111J6773N032
15000A7935K501j9719m147N773K0028j4788j4326m504j674K8246l98l1660q966
14987b5699k7011N482L9859J8828J5346R682l8059m0290Q354K7217k1585n358
14975c3234J5693R296k6730L009L25P214m036n287K3707j0704j0222J4381L0148
14962A3560l348l2277L636J1865L0818j7836l5483j04L5563J2363k0001j6849
14950a8093K5136K0700N605o426k7522j066K935J6978J2262j7744k0039k29j6158
$$ plain form
14937 -23661 -11452 10277 5390 -20433 -26351 -826 4253 11357 -1740 -1175 6334 -17036 -7705
14924 -7705 33241 38036 66285 88325 60606 47587 46052 25222 6550 1264 -4998 -20701 -29332
14911 -29332 -37169 -33763 -10958 -7747 9659 18273 17941 48555 24736 -2049 -8052 -3217 16746
14898 16746 35885 37404 43098 24077 29155 14597 -3455 -3162 23497 33214 1230 -21843 -6901
14885 -6901 17768 -14079 -18458 -22509 -24909 -7317 -17195 -44517 -80254 -70776 -56200 -42100 -26100
14872 -26100 -10684 -18017 -25986 -21028 -10552 -25704 -36684 -48832 -35657 -23546 -24923 -14698
14860 -14698 -18101 -36755 -51156 -27791 1750 9693 21523 29472 1729 -646 607 6175 -12949
14847 -12949 -34845 10143 22705 14566 19544 49972 62779 40974 25339 28454 21663 22601 15637
$$ packed form
14937b3661J2209K1729m887k5823n918K5525N079P104j3097N65P509k3370R331
14924g705M0946M795K8249K2040k7719j3019j535k0830j8672n286o262j5703q631
14911b9332p837L406K2805L211J7406Q614l32L0614k3819k6785o003M835J9963
14898A6746J9139J519N694j9021N078j4558j8052K93K6659R717l1984k3073J4942
14885f901K4669l1847m379m051k400J7592r878k7322l5737R478J4576J4100J6000
14872b6100J5416p333p969M958J0476j5152j0980j2148J3175J2111j377J0225
14860a4698l403j8654j4401K3365K9541P943J1830P949k7743k375J253N568j9124
14847a2949k1896M4988J2562q139M978L0428J2807k1805j5635L115o791R38o964
$$ plain form
14834 15637 7874 -23507 -26276 -15509 -16574 -3788 21769 38188 29023 32688 26104 44537 39549
14821 39549 11572 -15531 -2886 11005 31640 14329 7892 -11868 -20404 -9860 20159 25273
14809 25273 17278 13689 -5972 -16920 -37648 -40357 -35121 -37551 -20911 -2400 23152 35370 57622
14796 57622 31649 16312 26580 40392 48607 16721 1771 2906 -28379 -5133 13449 17657
14784 17657 2851 2579 7335 29622 19047 10542 26935 21416 36939 51910 30553 -1494 -30771
14771 -30771 -21312 -22021 -26984 -10950 13196 28602 11127 5918 3923 7955 7721 4763 -5881 -25025
14757 -25025 -30555 -3775 3785 -10913 -50514 -54668 -46565 -34967 -1960 5299 -22034 -38313 -38655
14744 -38655 -3451 8647 5731 10230 6711 4294 16584 14447 15240 14813 12095 32554 48779 36476
$$ packed form
14834A5637p763l1381k769J0767j065J2786K5557J6419r165L665o584J8433m988
14821C9549k7977k7103J2645J3891K0635j7311o437j9760q536J0544L0019N114
14809B5273p995l589j9661j0948k0728k709N236k430J6640J8511K5552J2218K2252
14796E7622k5973j5337J0268J3812Q215l1886j4950J135l1285K3246J8582M208
14784A7657j4806k72M756K2287j0575q505J6393n519J5523J4971k1357l2047k9277
14771c0771R459p09m963J6034K4146J5406j7475n209j995M032k34k958j0644j9144
14757b5025n530K6780P560j4698l9601m154Q103J1598L3007P259k7333j6279l42
14744c8655L5204J2098k916M499l519k417J2290k137P93m27k718K0459J6225j2303
$$ plain form
14730 36476 19829 -158 16776 18004 31559 28638 36335 41958 62800 54395 26755 -16948 -6644
14717 -6644 18295 18328 33426 18671 -9208 -8099 8885 18095 36824 55386 51568 30803 18491
14704 18491 3812 14458 41351 39995 36178 28463 9732 9629 16239 17804 32899 29244 34909
14691 34909 25333 8549 -5566 18389 37890 51476 45951 42038 44789 16625 -15213 -10141 -21631
14678 -21631 -9006 -10639 8854 19951 9515 -5673 -2891 14976 7900 24212 12844 24380
14666 24380 56288 48425 11808 15922 8433 -12437 -3590 21386 45503 81491 86142 96465 94475
14653 94475 53980 49359 63050 61493 64474 42464 26537 32749 26599 42834 51413 34716 11419
14640 11419 19090 7266 40069 54113 46324 63412 68886 75306 96704 75042 61036 67453 53490
$$ packed form
14730C6476j6647j9987J6934J228J3555k921P697N623K0842q405k7640m3703J0304
14717f644K4939L3J5098j4755k7879J109J6984R210J8729J8562l818k0765j2312
14704A8491j4679J0646K6893j356l817p715j8731j03O610J565J5095l655N665
14691C4909r576j6784j4115K3955J9501J3586n525l913K751k8164l1838N072j1490
14678b1631J2625j633J9493J1097j0436j5188K782J7867p076J6312j1368J1536
14666B4380L1908p863l6617M114p489k0870Q847K4976K4117L5988M651J0323j990
14653I4475m0495m621J3691j557K981k2010j5927O212o150J6235Q579j6697k3297
14640A1419P671j1824L2803J4044p789J7088N474O420K1398k1662j4006O417j3963
$$ plain form
14627 53490 59107 65429 45920 43245 71581 67995 41262 17454 19795 35658 56674 69662 75468
14614 75468 62944 54227 53072 37951 33198 39586 29767 36030 49362 50820 41960 67187 71900
14601 71900 49920 34234 27393 19380 5260 5423 14863 47810 72059 62978 21663 8017 26156
14588 26156 9300 8051 -7092 -25642 381 19176 39396 58094 44777 20442 -7021 -8896
14576 -8896 -16930 -14075 -28644 -30957 -14725 14068 14378 18999 15311 -2746 11897 23864 45768
14563 45768 52360 31279 37972 45352 41547 57480 75205 41835 53275 69907 57017 24091
14551 24091 36529 59086 41762 25449 16562 35428 30005 43051 32958 -7163 -23319 12206
14539 12206 1853 -2279 31387 51144 23222 -1649 -18351 -24619 20061 39829 25485 8097
$$ packed form
14627E3490N617O322j9509k675K8336l586k6733k3808K341J5863K1016J2988N806
14614G5468j2524q717j155j5121m753O388r819O263J3332J458q860K5227M713
14601G1900k1980j5686o841q013j4120J63R440L2947K4249r081m1315j3646J8139
14588B6156j6856j249j5143j8550K6023J8795K0220J8698j3317k4335k7463j875
14576h896q034K855j4569k313J6232K8793L10M621l688j8057J4643J1967K1904
14563D5768O592k1081O693P380l805J5933J7725l3370J1440J6632j2890l2926
14551B4091J2438K2557j7324j6313q887J8866n423J3046j0093m0121j6156L5525
14539A2206j0353m132L3666J9757k7922k4871j6702o268M4680J9768j4344j7388
$$ plain form
14527 8097 -13006 23 28372 47630 37708 18398 53566 44871 20240 27996 33230 13038 3352
14514 3352 32469 32073 31979 29499 32545 21889 -3554 -6466 -15846 -14831 14893 14404 9673 14066 22969
14499 22969 23661 27189 19120 -1197 -29253 -5491 -13724 -21428 -32848 -20741 -12575 -23420 -11296
14486 -11296 17252 -40 -3146 24144 31238 28387 216 -6049 -2714 -2887 1164 -20238 -47947
14473 -47947 -45369 -351 10268 -8598 -14741 13736 7863 8397 14005 5154 21400 31371 13091
14460 13091 -7835 -13644 -29037 -43499 -41797 -32558 -41821 -28878 23051 44565 22301 24731 8881
14447 8881 8743 1519 -13552 -9087 6768 -6222 -2326 -73 15436 7759 19023 35251 56421
14434 56421 67098 100384 79369 45709 39514 41807 50022 29464 22939 -3551 -9739 834 -17861
$$ packed form
14527H097k1103J3029K8349J9258r922j9310L5168q695k4631P756N234k0192r686
14514C352K9117l96r4k480L046j0656k5443k912r380J015K9724m89m731M393Q903
14499B2969O92L528q069k0317k8056K3762q233p704j1420J2107Q166j0845J2124
14486a1296K8548j7292l106K7290P094k851k8171o265L335j73M051k1402k7709
14473d7947K578M5018J0619j8866o143K8477n873N34N608q851J6246R971j8280
14460A3091k0926n809j5393j4462J702R239r263J2943N1929K1514k2264K430j5850
14447H881j38p224j5071M465J5855j2990L896K253J5509p677J1264J6228K1170
14434E6421J0677L3286k1015l3660o195K293Q215k0558o525k6490o188J0573j8695
$$ plain form
14421 -17861 -36075 -16617 2976 -7980 -19614 -45314 -46627 -50721 -75059 -33424 6996 -7777
14409 -7777 -22730 -23424 -37117 -51606 -38088 -26899 -7919 19829 23231 -3818 -29802 -15847
14397 -15847 -7371 -23288 -46500 -20359 -10010 603 22855 12882 13359 -10220 -19290 -4961 17326
14384 17326 21875 24827 16327 1074 8854 -29970 -54935 -25417 -7046 -7651 -8321 -6857 -14588 -21492
14370 -21492 -8924 19623 -1344 -17492 -6391 -876 9766 8988 -6648 -7923 28954 37349 10079
14357 10079 9166 14426 32305 30733 24245 3792 -12665 26713 63376 50398 38199 21332 -3792
14344 -3792 -9077 9385 28843 22317 17941 5237 9501 2278 475 -9931 -8208 -19342 -15134
14331 -15134 -956 11967 14500 14073 20062 17952 -3551 -6752 30461 22225 8817 20216 55558
$$ packed form
14421a7861j8214J9458J9593j0956j1634k5700j313m094k4338M1635M0420j4773
14409g777j4953o94j3693j4489J3518J1189J8980K7748L402k7049k5984J3955
14397a5847Q476j5917k3212K6141J0349J0613K2252r973M77k3579r070J4329K2287
14384A7326M549K952q500j5253P780l8824k4965K9518J8371o05o70J464p731o904
14370b1492J2568K8547k0967j6148J1101N515J0642p78j5636j275L6877Q395k7270
14357A0079r13N260J7879j572o488k0453j6457L9378L6663j2978j2199j6867k5124
14344c792n285J8462J9458o526m376j2704M264p223j803j0406J723j1134M208
14331a5134J4178J2923K533m27N989k110k1503l201L7213q236j3408J1399L5342
$$ plain form
14318 55558 76310 43820 34522 45327 43294 34154 28538 36288 36911 35820 34287 36038 32932 50993
14304 50993 35234 3511 2377 23013 25247 14243 25265 29258 3625 -15672 -6057 10429
14292 10429 7847 170 1170 11646 11246 37268 26596 27669 64684 86209 91736 69727 38452
14279 38452 31071 46800 42045 12329 26124 29939 28272 31909 45480 48097 54045 41038 31801
14266 31801 32738 15406 -169 27078 31729 45279 44794 25651 23802 12724 -15698 -12502 14847
14253 14847 21270 11575 2291 -8766 -10046 -2862 14155 18104 10043 3327 21562 42000 49857
14240 49857 35320 32959 65699 78168 69051 63939 13525 -3705 24563 61488 72690 59904
14228 59904 47712 44587 71972 80917 65342 74978 68972 53329 57066 52883 24008 29956 47704
$$ packed form
14318E5558K0752l2490r298J0805k033r140n616P750O23j091j533J751l106J8061
14304E0993j5759l1723j134K0636K234j1004J1022L993k5633j9297R615J6486
14292A0429k582p677J000J0476m00K6022j0672J073L7015K1525N527k2009l1275
14279C8452p381J5729m755k9716J3795L815j667L637J3571K617N948j3007r237
14266C1801R37j7332j5575K7247M651J3550m85j9143j849j1078k8422L196K7349
14253A4847O423r695r284j1057j280P184J7017L949q061o716J8235K0438P857
14240D9857j4537k361L2740J2469r117n112n0414j7230K8268L6925J1202j2786
14228E9904j2192l125K7385Q945j5575R636o006j5643L737m183k8875N948J7748
$$ plain form
14215 47704 43115 21620 3375 27852 50710 55136 43205 50599 70303 62153 39837 9999
14203 9999 -25650 -36321 -28526 -28872 -32600 -32976 -24128 -34007 -37301 -26303 18017 21250 7631 12714
14189 12714 1666 -13385 -24247 -12164 13970 34900 34046 17862 577 -5856 -20692 -33200
14177 -33200 -22203 -13572 14678 29544 23513 53333 23126 -8322 -5392 -3811 8887 26091
14165 26091 5769 -4168 -335 1812 18154 47473 58895 60306 64011 41317 7951 11412 22138
14152 22138 31454 37232 43158 11721 -14154 -14261 6039 40368 57896 66528 70736 41875 3366
14139 3366 -6964 -17098 11950 24970 -9177 -7521 1530 24181 23281 13240 16848 27273 58490
14126 58490 57358 54368 -13398 -37633 -14838 14060 25583 32782 10243 3213 2164 6523 1091
$$ packed form
14215D7704m589k1495j8245K4477K2858M426j1931P394J9704q150k2316k9838
14203I999l5649j0671P795l46l728l76Q848r879l294J0998M4320L233j3619N083
14189A2714j1048j5051j0862J2083K6134K0930q54j6184j7285o433j4836j2508
14177c3200J0997Q631K8250J4866o031K9820l0207l1448K930J581J2698J7204
14165B6091k0322r937L833K147J6342K9319J1422J411L705k2694l3366L461J0726
14152B2138R316N778N926l1437k5875j07K0300L4329J7528Q632M208k8861l8509
14139C366j0330j0134K9048J3020l4147J656R051K2651r00j0041L608J0425L1217
14126E8490j132k990o7766k4235K2795K8898J1523P199k2539p030j049M359n432
$$ plain form
14113 1091 16466 30587 13640 3047 10164 32362 32074 34115 23031 6416 -3978 -21701 3096
14100 3096 5018 -461 -1549 -11233 -28745 -8350 -10984 -15890 -15372 -30966 -19918 -2333 492 30680
14086 30680 56822 36533 1265 -23036 -21364 -15926 -1136 22086 29323 14068 -11605 -16888
14074 -16888 -9453 -9256 3558 5922 -10268 -22970 -10539 37655 62607 37296 25455 56763
14062 56763 44990 10401 7854 33183 41999 14759 8670 45528 60785 44966 42225 26253
14050 26253 37689 36413 19895 26297 -4581 12438 57763 75669 40498 11951 2645 -1754
14038 -1754 1801 18262 43654 51383 70006 52488 47194 65326 47848 37524 52055 50427 35561
14025 35561 36714 44462 72248 74561 51182 36962 24956 25774 37652 12929 30851 24834 5315
$$ packed form
14113A091J5375J4121j6947j0593P117K2198k88K041j1084j6615j0394j7723K4797
14100C096J922n479j088r684j7512K0395k634m906N18j5594J1048J7585K825L0188
14086C0680K6142k0289l5268k4301J672N438J4790K3222P237j5255k5673n283
14074a6888P435J97J2814K364j6190j2702J2431M8194K4952k5311j1841L1308
14062E6763j1773l4589k547K5329Q816k7240o089L6858J5257j5819k741j5972
14050B6253J1436j276j6518O402l0878J7019M5325J7906l5171k8547r306m399
14038a754L555J6461K5392P729J8623j7518n294J8132j7478j0324J4531j628j4866
14025C5561J153P748K7786K313k3379j4220j2006Q18J1878k4723J7922o017j9519
$$ plain form
14012 5315 -17332 9688 20701 46049 71440 61778 46659 19838 -7771 14747 5833 -18489
14000 -18489 6984 6248 23135 53868 52824 35053 43982 59355 47100 56880 54949 62422 72366
13987 72366 78712 62111 24875 19954 14160 21089 17806 8050 13516 6510 24071 24121 8970 574
13973 574 -14473 4182 22388 57655 97492 87472 106638 125429 105332 109707 109328 108136 65373
13960 65373 49106 16878 -7880 3649 -7873 17945 22957 10116 31114 46534 19194 27172
13948 27172 27172 12992 19421 1155 -25078 -21904 -24989 -7524 -7774 -809 8840 16363 -21898 -13436
13934 -13436 -7834 -17618 -21286 3816 27282 18717 7879 9062 -12512 -22854 5386 38252 55140
13921 55140 50998 45940 56412 79041 66471 62931 49000 21714 49597 71780 36659 -17792
$$ packed form
14012E315k2647K7020J1013K5348K5391r662j5119k6821k7609K2518q914k4322
14000a8489K5473p36J6887L0733j044j7771Q929J5373j2255R780j931P473R944
13987G2366O346j6601l7236m921n794O929l283r756N466p006J7561N0j5151q396
13973E74j5047J8655J8206L5267L9837j0020J9166J8791k0097M375l79j192m2763
13960F5373j6267l2228k4758J1529j1522K5818N012j2841K0998J5420k7340P978
13948B7172%j4180O429j8266k6233L174l085J7465k50O965R649P523l8261Q462
13934a3436N602r784l668K5102K3466q565j0838J183k1574j0342K8240L2866J6888
13921E5140m142n058J0472K2629j2570l540j3931k7286K7883K2183l5121n4451
$$ plain form
13909 -17792 -39889 -20758 -7188 2313 9133 30610 18238 28824 28176 28526 41293 69056 107364
13896 107364 89072 55599 18888 23747 15015 -12470 14271 37736 25409 14306 13609 16606
13884 16606 17144 -3414 -9205 -10922 -1269 12937 -3692 -27287 -23230 -2471 8023 14160 10885
13871 10885 3613 -33 1325 -4635 24447 16952 14620 40042 33047 7405 -20577 -11912 -131
13858 -131 -9919 -10691 13487 31606 54509 72808 87119 44204 27201 21180 40117 51076 39541
13845 39541 27516 25834 49656 63905 79171 50252 35069 46369 59095 59289 44483 6077
13833 6077 -9256 -8850 -20888 2025 26046 -4453 3535 36943 15534 -8133 -4204 4631 23129
13820 23129 33758 30210 13113 -14749 -15174 14178 43386 75278 87214 90906 49106 30813
$$ packed form
13909a7792k2097J9131J3570R501O820K1477j2372J0586o48L50J2767K7763L8308
13896A07364j8292l3473l6711M859q732k7485K6741K3465j2327j1103o97K997
13884A6606N38k0558n791j717R653J4206j6629k3595M057K0759J0494O137l275
13871A0885p272l646J358n960K9082p495k332K5422o995k5642k7982Q665J1781
13858a31r788p72K4178J8119K2903J8299J4311m2915j7003o021J8937J0959j1535
13845C9541j2025j682K3822J4249J5266k8919j5183J1300J2726J94j4806l8406
13833F077j5333M06j2038K2913K4021l0499P988L3408k1409k3667L929Q835J8498
13820B3129J0629l548j7097k7862m25K9352K9208L1892J1936L692m1800j8293
$$ plain form
13808 30813 55260 61220 63476 60253 53408 50856 50012 35486 47116 41229 37302 60542 59070 25117
13794 25117 -12856 144 20028 46012 35397 12011 22371 5911 13651 8268 1849 -5509
13782 -5509 12491 4427 -4485 27715 50347 64079 71000 72979 63487 42815 38655 27297 15995
13769 15995 54638 75083 103707 91050 56997 42002 42577 42292 8150 16032 50106 61569 33367
13756 33367 41465 5731 -16740 14316 21914 13673 544 7688 -36 13033 35368 51296 55320
13743 55320 42874 40833 55987 62524 81369 108035 103925 84246 49778 53035 45808 61947 78703
13730 78703 67830 95114 72980 23962 -10029 -9519 13640 35843 39774 13388 10016 10675 9542
13717 9542 10242 -791 10445 39141 31368 52873 59527 69901 64663 66917 78801 68033 50002
$$ packed form
13808C0813K4447N960K256l223o845k552q44j4526J1630n887l927K3240j472l3953
13794B5117l7973J3000J9884K5984j0615k3386J0360j6460P740n383o419p358
13782e509J8000q064q912L2200K2632J3732O921J979r492k0672m160j1358j1302
13769A5995L8643K0445K8624j2657l4053j4995N75k85l4142P882L4074J1463k8202
13756C3367Q098l5734k2471L1056P598q241j3129P144p724J3069K2335J5928M024
13743E5320j2446k041J5154O537J8845K6666m110j9679l4468L257p227J6139J6756
13730G8703j0873K7284k2134m9018l3991N10K3159K2203L931k6386l372O59j133
13717I542P00j1033J1236K8696p773K1505O654J0374n238K254J1884j0768j8031
$$ plain form
13704 50002 51709 47013 24732 12303 30338 22210 8182 -3586 -4571 5475 -1987 -30729 -9799
13691 -9799 20466 28573 46905 43309 39892 55964 46797 45108 75554 53513 29130 28930 38710
13678 38710 56806 41144 24184 12100 24862 35983 27709 30281 9755 12676 10797 34555
13666 34555 53284 66073 53454 50990 35722 7582 1898 27981 41762 37040 38392 6701
13654 6701 -1442 36696 46768 63405 69195 21606 -7576 14277 25651 34993 70492 80065 89937
13641 89937 103124 89622 66329 38738 39704 50839 40282 50259 43591 24479 30665 33505 53501
13628 53501 29648 31741 68442 51733 65799 89943 63568 37763 23308 12409 6834 5280
13616 5280 29557 43058 52180 59619 27233 22234 33722 20888 23076 24712 25800 23067 18083
$$ packed form
13704E0002J707m696k2281j2429J8035q128j4028j1768r85J0046p462k8742K0930
13691i799L0265Q107J8332l596l417J6072r167j689L0446k2041k4383k00R780
13678C8710J8096j5662j6960j2084J2762J1121q274K572k0526K921j879K3758
13666C4555J8729J2789j2619k464j5268k8140n684K6083J3781m722J352l1691
13654F701q143L8138J0072J6637N790m7589k9182K1853J1374R342L5499R573R872
13641H9937J3187j3502k3293k7591R66J1135j0557R977o668j9112O186K840J9996
13628E3501k3853K093L6701j6709J4066K4144k6375k5805j4455j0899n575j554
13616E280K4277J3501R122P439l2386m999J1488j2834K188J636J088k733m984
$$ plain form
13603 18083 8777 37769 69383 87814 52371 34438 29377 45382 35953 26652 30950 33948 31763
13590 31763 40583 39259 30732 32032 44198 54472 71817 80965 74633 46615 37124 17833 9557
13577 9557 6975 21374 19042 47333 63758 80211 80332 71018 36335 30031 38400 79713 76434
13564 76434 68778 61498 80375 98084 112662 127707 112220 99993 99348 81734 73083 69125 73055
13551 73055 37057 22446 37132 82796 84844 55289 43493 67711 71034 95445 117888 125049
13539 125049 99649 65700 47086 45204 60378 94324 80690 69562 94964 109514 108833 84296
13527 84296 66498 30262 29753 54233 75389 88440 91184 82688 86486 73074 47993 40021 47143
13514 47143 59675 56981 89689 99023 94591 79049 72472 77106 74913 72410 83165 98166 74396
$$ packed form
13603A8083r306K8992L1614J8431l5443j7933n061J6005r429r301M298K998k185
13590C1763Q820j324q527J300J2166J0274J7345R148o332k8018r491j9291q276
13577I557k582J4399k332K8291J6425J6453J21r314l4683o304Q369M1313l279
13564G6434p656p280J8877J7709J4578J5045j5487j2227o45j7614q651l958L930
13551G3055l5998j4611J4686M5664K048k9555j1796K4218L323K4411K2443P161
13539A25049k5400l3949j8614j882J5174L3946j3634j1128K5402J4550o81k4537
13527H4296j7798l6236n09K4480K1156J3051K744q496L798j3412k5081p972P122
13514D7143J2532k694L2708R334m432j5542o577M634k193k503J0755J5001k3770
$$ plain form
13501 74396 37671 38131 56931 71691 72566 49213 46849 65595 103311 104810 97837 101959 86777
13488 86777 67179 76141 72389 28055 32070 66108 91106 88118 99889 82486 59406 68112 65334
13475 65334 37133 38205 43862 25528 46724 60343 60968 51290 43550 52315 74900 66057 63107
13462 63107 54603 57860 58870 61682 70512 77060 80378 87818 83992 65858 60636 68208 73205 58648
13448 58648 45204 60926 58786 47932 48544 55661 37756 70495 101529 125187 123886 125965 121246
13435 121246 107480 78709 78997 73028 83985 86617 124002 119089 99144 66973 53650 66146
13423 66146 81234 125117 106017 76161 64053 57061 57552 55447 51423 51935 62172 71517 36979
13410 36979 1756 41624 52557 39927 35072 19414 3993 25231 27131 71561 76429 58956
$$ packed form
13501G4396l6725M60J8800J4760Q75k3353k364J8746L7716J499o973M122j5182
13488H6777j9598Q962l752m4334M015L4038K4998k988J1771j7403k3080Q706k778
13475F5334k8201J072N657j8334K1196J3619O25r678p740Q765K2585q843k950
13462F3107q504L257J010K812Q830O548L318P440l826j8134n222P572M997j4557
13448E8648j3444J5722k140j0854O12P117j7905L2739L1034K3658j301K079m719
13435A21246j3766k8771K88n969J0957K632L7385m913j9945l2171j3323J2496
13423F6146J5088M3883j9100k9856j2108o992M91k105m024N12J0237R345l4538
13410C6979l5223L9868J0933j2630m855j5658j5421K1238J900M4430M868j7473
$$ plain form
13398 58956 57031 88854 83621 72483 81868 84352 107492 99937 74200 85159 74021 82783 78313
13385 78313 86185 101994 97631 97437 117400 115142 97248 88178 64266 55478 28615 54273 64582
13372 64582 39071 50298 47509 83732 106405 82502 60313 63890 48865 64404 69091 70888
13360 70888 43392 53644 97405 89647 77590 67107 46064 29558 37911 60838 72295 99707
13348 99707 114399 99750 111730 127485 120774 136839 125703 127947 96851 75037 86704 90962
13336 90962 95034 126537 166280 166623 126735 107657 94411 116435 119220 116452 124954 125955 121443
13323 121443 106144 98366 99695 82112 88246 98405 76645 64633 53818 60268 113462 116439
13311 116439 126276 120969 127313 123838 99080 68037 61793 66573 73581 104599 121630 118937 130095
$$ packed form
13398E8956j925L1823n233j1138R385K484K3140p555k5737J0959j1138Q762m470
13385G8313P872J5809m363j94J9963k258j7894r070k3912q788k6863K5658J0309
13372F4582k5511J1227k789L6223K2673k3903k2189L577j5025J5539M687J797
13360G0888k7496J0252M3761p758j2057j0483k1043j6506Q353K2927J1457K7412
13348I9707J4692j4649J1980J5755o711J6065j1136K244l1096k1814J1667M258
13336I0962M072L1503L9743L43l9888j9078j3246K2024K785k768Q502J001m512
13323A21443j5299p778J329j7583O134J0159k1760j2012j0815O450N3194K977
13311A16439R837n307O344l475k4758l1043o244M780P008L1018J7031k693J1158
$$ plain form
13298 130095 142289 158375 157318 156466 165081 174014 164148 156918 127884 151129 149659 175792 198463
13285 198463 194761 200116 193776 221446 222718 229304 238376 213173 194362 188784 190763 197758 209940
13272 209940 221561 246506 248082 253930 268765 264090 246649 241632 240338 223555 204799 217186
13260 217186 217147 231674 222914 221207 225975 258502 276271 230817 188202 196368 178081 158497 180732
13247 180732 218989 247734 255329 238020 229373 239551 225464 188805 181582 158487 138068 155643
13235 155643 147145 165186 150418 138145 135443 134590 140489 148150 150528 145276 163584 172890 177357
13222 177357 177131 193420 155972 111259 121200 120930 102256 110324 145988 127634 117899 132488 152960
13209 152960 152382 142497 132622 130334 134615 136155 152468 146441 116174 125872 131270 145181 144596 114703
$$ packed form
13298A30095J2194J6086j057q52Q615Q933r866p230k9034K3245j470K6133K2671
13285A98463l702N355o340K7670J272O586R072k5203j8811n578J979O995J2182
13272B09940J1621K4945J576N848J4835m675j7441n017j294j6783j8756J2387
13260B17186l9J4527q760j707M768L2527J7769m5454m2615Q166j8287j9584K2235
13247A80732L8257K8745P595j7309q647J0178j4087l6659p223k3095k0419J7575
13235A55643q498J8041j4768j2273k702q53N899P661K378n252J8308R306M467
13222A77357k26J6289l7448m4713R941k70j8674Q068L5664j8354r735J4589K0472
13209A52960n78r885r875k288M281J540J6313o027l0267R698N398J3911n85k9893
$$ plain form
13195 114703 94163 123283 116233 124166 124993 152842 145363 140901 120540 115082 132397 130598 129417
13182 129417 123474 119646 133869 137573 152991 175160 153336 153264 161110 163353 149323 147036 128310
13169 128310 148283 192758 182330 135787 133268 151230 148466 144974 160973 172746 162398 175100
13157 175100 197963 213559 237339 261454 238756 232898 234089 284297 329309 395153 481701 566501
13145 566501 642752 669370 655189 634053 578718 496708 435790 419241 394171 359992 334721
13134 334721 317464 321202 341337 357443 349471 370104 396473 407090 391646 417630 431151 476478
13122 476478 523901 549770 565654 607399 640152 700870 725326 741640 779335 784841 800795 774004
13110 774004 720086 683333 643141 623722 606155 570948 546016 497341 479099 488700 484248 462904
$$ packed form
13195A14703k0540K9120p050P933Q27K7849p479m462k0361n458J7315j799j181
13182A29417n943l828J4223L704J5418K2169k1824p2P846K243j4030k287j8726
13169A28310J9973M4475j0428m6543k519J7962k764l492J5999J1773j0348J2702
13157A75100K2863J5596K3780K4115k2698n858J191N0208M5012O5844Q6548Q4800
13145E66501P6251K6618j4181k1136n5335q2010o0918j6549k5070l4179k5271
13134C34721j7257L738K0135J6106p972K0633K6369J0617j5444K5984J3521M5327
13122D76478M7423K5869J5884M1745L2753O0718K4456J6314L7695N506J5954k6791
13110G74004n3918l6753m0192j9419j7567l5207k4932m8675j8242R601m452k1344
$$ plain form
13098 462904 459219 445442 420329 428966 441916 438554 439872 454795 457145 461059 450530 464666 538342
13085 538342 621752 708881 815162 890801 892398 869511 792245 699912 631310 546698 498850
13074 498850 457320 421416 404040 376457 371064 377644 389811 381508 353003 350348 375181 390900
13062 390900 421162 465189 512407 592018 688427 783916 926621 1073013 1197735 1294345 1331368
13051 1331368 1296384 1233817 1167630 1054736 896581 763858 660275 568604 533647 489986
13041 489986 437184 396701 358425 342421 321170 289487 263109 252803 253285 243158 231988 205838
13029 205838 210384 214017 236049 256966 256800 245970 248921 242378 225559 219878 215070 224926 227572
13016 227572 213411 228679 229026 210984 211993 223916 211185 216060 226621 213524 216961 233293
$$ packed form
13098D62904l685j3777k5113Q637J2950l362J318J4923K350L914j0529J4136P3676
13085E38342Q3410Q7129J06281P5639J597k2887p7266r2333o8602q4612m7848
13074D98850m1530l5904j7376k7583n393O580J2167q303k8505k655K4833J5719
13062C90900L0262M4027M7218P9611R6409R5489J42705J46392J24722R6610L7023
13051A331368l4984o2567o6187j12894j58155j32723j03583r1671l4957m3661
13041D89986n2802m0483l8276j6004k1251l1683k6378j0306M82j0127j1170k6150
13029B05838M546L633K2032K0917j66j0830K951o543j6819n681m808R856K646
13016B27572j4161J5268L47j8042J009J1923j2731M875J0561j3097L437J6332
$$ plain form
13004 233293 247967 247121 242350 250292 228730 220367 182134 191543 199205 209667 220690 215156 209735
12991 209735 194333 179828 182635 208030 245794 248981 256490 282506 272249 259427 245954 226640
12979 226640 215512 222062 230676 211405 219256 231837 203540 186771 201275 203582 229979 233480
12967 233480 211902 213970 232386 252595 251792 240303 224124 207232 241119 238734 252752 269380
12955 269380 285931 259841 248891 258034 258003 257848 238990 255515 280624 292662 310029 327590 303797
12942 303797 281607 278805 277492 278474 252043 277764 306073 317578 337151 315900 302164 285606
12930 285606 282324 305233 314940 332125 342448 324703 318313 311418 351135 357970 357937 341174 364220
12917 364220 397174 385728 382906 413556 437284 449913 456917 494476 537544 584478 634769 723235
$$ packed form
13004B33293J4674q46m771P942k1562q363l8233R409P662J0462J1023n534n421
12991B09735j5402j4505K807K5395L7764L187P509K6016j0257j2822j3473j9314
12979B26640j1128O550Q614j9271P851J2581k8297j6769J4504K307K6397L501
12967B33480k1578K068J8416K0209q03j1489j6179j6892L3887k385J4018J6628
12955B69380J6551k6090j0950R143l1j55j8858J6525K5109J2038J7367J7561k3793
12942C03797k2190k802j313R82k6431K5721K8309J1505J9573k1251j3736j6558
12930B85606l282K2909R707J7185J0323j7745o390o895L9717O835l3j6763K3046
12917C64220L2954j1446k822L0650K3728J2629P004L7559M3068M6934N0291Q8466
$$ plain form
12905 723235 792305 862343 915873 906036 874999 838063 763911 690418 592213 505937 474006 459558
12893 459558 459896 505243 532413 520900 507850 514987 565339 588217 562848 543800 539869 543305
12881 543305 507753 485097 469838 452706 472693 478042 476785 489496 475752 448167 439083 441345
12869 441345 435224 403388 407044 417008 408789 421631 448394 470591 479900 475361 488930 508041 497045
12856 497045 457559 459642 472782 477455 478713 454394 444208 458360 464327 467953 435253 420451
12844 420451 431533 446904 445518 423053 401453 418785 439246 435325 406755 391349 414351 439311
12832 439311 444992 458933 472064 493587 529806 545973 567830 601831 628469 665443 714808 728815
12820 728815 739746 762740 766814 728987 682794 684669 663432 621980 591868 552908 545226 564335
$$ packed form
12905G23235O9070P0038N3530r837l1037l6936p4152p3493r8205q6276l1931j4448
12893D59558L38M5347K7170j1513j3050P137N0352K2878k5369j9048l931L436
12881E43305l5552k2656j5259j7132J9987N349j257J2711j3744k7585r084K262
12869D41345o121l1836L656R964q219J2842K6763K2197R309m539J3569J9111j0996
12856D97045l9486K083J3140M673J258k4319j0186J4152N967L626l2700j4802
12844D20451J1082J5371j386k2465k1600J7332K0461l921k8570j5406K3002K4960
12832D39311N681J3941J3131K1523L6219J6167K1857L4001K6638L6974M9365J4007
12820G28815J0931K2994M074l7827m6193J875k1237m1452l0112l8960p682J9109
$$ plain form
12808 564335 563105 543913 496870 488284 495405 544758 581162 593028 572112 554120 560911 628712
12796 628712 662889 659079 656334 651601 654176 624800 587827 567568 561816 566313 549503 537446 548112
12783 548112 545131 549832 552528 593132 583609 566662 580124 607593 624964 608187 604262 674995
12771 674995 722280 741271 768337 817527 858567 878886 878581 876281 879472 886694 873170 902045
12759 902045 929352 964465 1000229 1032654 1050324 1029754 1042315 1035175 1042497 1035976 1046044 1090999
12747 1090999 1096083 1092453 1101333 1157498 1194487 1218977 1243320 1291185 1324488 1369705 1420769 1449957
12735 1449957 1514473 1597945 1640185 1669977 1741131 1808542 1875308 1973368 2066992 2152146 2224873
12724 2224873 2284820 2375982 2451528 2532096 2653965 2826936 3071324 3285994 3515645 3775615
$$ packed form
12808E64335j230j9192m7043q586P121M9353L6404J1866k0916j7992O791O7801
12796F28712L4177l810k745m733K575k9376l6973k0259n752M497j6810j2057J0666
12783E48112k981M701K696M0604r523j6947J3462K7469J7371j6777l925P0733
12771F74995M7285J8991K7066M9190M1040K0319l05k300L191P222j3524K8875
12759I02045K7307L5113L5764L2425J7670k0570J2561p140P322o521J0068M4955
12747A090999N084l630Q880N6165L6989K4490K4343M7865L3303M5217N1064K9188
12735A449957O4516Q3472M2240K9792P1154O7411O6766R8060R3624Q5154P2727
12724B224873N9947R1162P5546Q0568J21869J72971K44388K14670K29651K59970
$$ plain form
12714 3775615 4079344 4445190 4871274 5381366 5938034 6552549 7288387 8199304 9356505
12705 9356505 10794288 12681663 15191202 18583065 23291688 29830499 38957353 51369445
12697 51369445 67088978 84506417 99634478 107536821 105661250 95439888 80904402
12690 80904402 66092110 53484683 43877037 37104622 32695677 30134297 29046116 29114398
12682 29114398 30188498 32202319 34890675 37711778 40091252 41778795 43329359 45708498
12674 45708498 49859508 56140585 64243336 73335154 82459339 91355219 100697252 111390746
12666 111390746 123359032 134173079 139465911 136271001 125560542 111310744 97754284
12659 97754284 87360491 80587395 76869182 75108624 74102391 72670517 69988969 65842167
$$ packed form
12714C775615L03729L65846M26084N10092N56668O14515P35838R10917J157201
12705I356505J437783J887375K509539L391863M708623O538811R126854J2412092
12697E1369445J5719533J7417439J5128061P902343j875571j0221362j4535486
12690H0904402j4812292j2607427r607646o772415m408945k561380j088181O8282
12682B9114398J074100K013821K688356K821103K379474J687543J550564K379139
12674D5708498M151010O281077Q102751R091818R124185Q895880R342033J0693494
12666A11390746J1968286J0814047N292832l194910j0710459j4249798j3556460
12659I7754284j0393793o773096l718213j760558j006233j431874k681548m146802
$$ plain form
12651 65842167 60878053 56331931 53222406 51836592 51591820 51545110 51019881 50211936 49764374
12642 49764374 50307835 52243970 56009217 62425437 72484960 87627851 109312164 138449111
12634 138449111 174424404 213734014 249058989 273099691 284576727 287241578 283059301
12627 283059301 270810825 250158538 223610506 193857925 162438133 131346209 103425195
12620 103425195 80868390 64198763 52382192 43971104 37784830 33006938 29124254
12613 29124254 25967241 23343727 21129122 19245251 17560272 16095697 14776355 13576596
12605 13576596 12513607 11564146 10704134 9894252 9137121 8444795 7852606 7298072 6808767
12596 6808767 6415644 6082839 5834446 5615266 5400267 5130180 4812597 4455344 4097435
$$ packed form
12651F5842167m964114m546122l109525j385814k44772m6710n25229q07945m47562
12642D9764374N43461J936135L765247O416220J0059523J5142891K1684313K9136947
12634A38449111L5975293L9309610L5324975K4040702J1477036K664851m182277
12627B83059301j2248476k0652287k6548032k9752581l1419792l1091924k7921014
12620A03425195k2556805j6669627j1816571q411088o186274m777892l882684
12613B9124254l157013k623514k214605j883871j684979j464575j319342j199759
12605A3576596j062989r49461q60012q09882p57131o92326n92189n54534m89305
12596F808767l93123l32805k48393k19180k14999k70087l17583l57253l57909
$$ plain form
12587 4097435 3767934 3506571 3294763 3139614 3003157 2907176 2783812 2638914 2511187 2386847
12577 2386847 2287938 2235782 2270089 2309204 2339009 2291859 2232445 2121562 1945339 1765408 1621314
12566 1621314 1521782 1406445 1296481 1205065 1162068 1125235 1083844 1055588 1042796 1027266 1000252
12555 1000252 988499 965548 968963 938603 913271 909179 888232 872266 860475 863167 854753 852760
12543 852760 859835 853465 839834 836942 776165 706578 659513 648520 645410 638815 609997 602402 572463
12530 572463 563789 548634 547882 577127 564692 518388 491128 469787 485923 529104 553465 587157
12518 587157 616057 658160 700829 747017 822523 924133 1039493 1099063 1125761 1106375 1058753
12507 1058753 950968 836874 759250 660003 578073 548644 529806 524645 504218 468862 444983
$$ packed form
12587D097435l29501k61363k11808j55149j36457r5981j23364j44898j27727j24340
12577B386847r8909n2156L4307L9115K9805m7150n9414j10883j76223j79931j44094
12566A621314r9532j15337j09964r1416m2997l6833m1391k8256j2792j5530k7014
12555A000252j1753k2951L415l0360k5332m092k0947j5966j1791K692q414j993
12543H52760P075o370j3631k892o0777o9587m7065j0993l110o595k8818p595k9939
12530E72463q674j5155p52K9245j2435m6304k7260k1341J6136M3181K4361L3692
12518E87157K8900M2103M2669M6188P5506J01610J15360N9570K6698j9386m7622
12507A058753j07785j14094p7624r9247q1930k9429j8838n161k0427l5356k3879
$$ plain form
12496 444983 399351 388638 413218 427669 398560 374343 349497 354961 370467 374206 369656 382288
12484 382288 397842 403897 427891 429805 454033 497781 494929 489762 451460 418315 386619 371440
12472 371440 377515 394845 390131 384159 400584 395199 423081 426225 463143 531910 619536 713636
12460 713636 805155 858355 861105 813095 753782 658652 606735 587979 538585 512676 500083 544515
12448 544515 586404 581106 624020 675469 719847 765938 807775 852835 873442 838962 793216 748595
12436 748595 707763 714355 779236 853135 911489 977423 999869 1004780 1008266 975929 914976 877147
12424 877147 848934 835439 846406 880979 912511 943617 983462 1040029 1102412 1140776 1194772
12413 1194772 1186961 1168246 1140409 1110530 1084623 1086109 1079326 1031001 1012972 1036318 1030363 1049970
$$ packed form
12496D44983m5632j0713K4580J4451k9109k4217k4846N464J5506L739m550J2632
12484C82288J5554O055K3994J914K4228M3748k852n167l8302l3145l1696j5179
12472C71440O075J7330m714n972J6425n385K7882L144L6918O8767Q7626R4100
12460G13636R1519N3200K750m8010n9313r5130n1917j8756m9394k5909j2593M4432
12448E44515M1889n298M2914N1449M4378M6091M1837M5060K0607l4480m5746m4621
12436G48595m0832O592O4881P3899N8354O5934K2446M911L486l2337o0953l7829
12424H77147k8213j3495J0967L4573L1532L1106L9845N6567O2383L8364N3996
12413A194772p811j8715k7837k9879k5907J486o783m8325j8029K3346n955J9607
$$ plain form
12401 1049970 1123672 1161077 1121865 1006491 871772 780166 741741 737967 739601 739954 735304 739590
12389 739590 745143 709842 663242 669162 694044 725381 785195 844030 906122 963136 976421 931409
12377 931409 830716 726828 624534 541016 477414 446730 466075 486415 496689 467930 444178
12366 444178 428005 405046 375088 374403 375000 368159 355343 331394 310489 321329 346259 341934 339442
12353 339442 319639 280502 288377 294266 302891 274042 242932 269073 299162 306613 294267 275043
12341 275043 292620 326802 343966 349337 362708 380918 359502 379097 402783 407412 453858 515846
12329 515846 588141 642038 687478 738899 804658 846528 893118 921387 888052 804632 707987
12318 707987 624174 559697 509164 458563 448642 461815 449951 429333 399220 392141 387746 382103
$$ packed form
12401A049970P3702L7405l9212j15374j34719r1606l8425l774J634L53m650M286
12389G39590N553l5301m6600N920K4882L1337N9814N8835O2092N7014J3285m5012
12377I31409j00693j03888j02294q3518o3602l0684J9345K0340J0274k8759k3752
12366D44178j6173k2959k9958o85N97o841j2816k3949k0905J0840K4930m325k492
12353C39442j9803l9137P875N889Q625k8849l1110K6141L0089P451j2346j9224
12341B75043J7577L4182J7164N371J3371J8210k1416J9595K3686M629M6446O1988
12329E15846P2295N3897M5440N1421O5759M1870M6590K8269l3335q3420r6645
12318G07987q3813o4477n0533n0601r921J3173j1864k0618l0113p079m395n643
$$ plain form
12306 382103 375357 384462 394407 399722 408995 424680 421022 428572 435888 416549 396255 388271 398605
12293 398605 386483 381633 392994 427863 451439 461410 500301 512694 495951 442887 440877 477802
12281 477802 497171 506413 507381 541162 530945 512399 534670 560880 580359 595828 621925 661666
12269 661666 658874 682013 707026 724115 720910 722086 704418 685063 704051 772361 839795 874243
12257 874243 892551 938649 960043 950584 981158 1015512 1010533 1018969 1062015 1062748 1096275 1171738
12245 1171738 1213250 1231521 1267124 1305655 1356971 1417883 1496214 1572719 1636713 1702593 1788510
12234 1788510 1885799 1951297 2032991 2111316 2206128 2324239 2436476 2557880 2707321 2911337
12224 2911337 3145704 3425154 3735807 4101421 4475524 4873481 5346974 5936755 6643380
$$ packed form
12306C82103o746R105R945N315R273J5685l658P550P316j9339k0294p984J0334
12293C98605j2122m850J1361L4869K3576R971L8891J2393j6743n3064k010L6925
12281D77802J9369R242R68L3781j0217j8546K2271K6210J9479J5469K6097L9741
12269F61666k792K3139K5013J7089l205J176j7668j9355J8988O8310O7434L4448
12257H74243J8308M6098K1394r459L0574L4354m979Q436M3046P33L3527P5463
12245A171738M1512J8271L5603L8531N1316O0912P8331P6505O3994O5880Q5917
12234A788510R7289O5498Q1694P8325R4812J18111J12237J21404J49441K04016
12224B911337K34367K79450L10653L65614L74103L97957M73493N89781P06625
$$ plain form
12215 6643380 7487692 8541806 9915606 11645413 13762735 16430898 19892466 24654096
12207 24654096 31345631 40759076 53869872 71171552 91917933 113081100 129360835
12200 129360835 135858164 130826626 116745298 98507581 80672064 65993945 55270292
12193 55270292 48188702 44047447 42199987 42011600 42904856 44128882 44816513 44658803 44056574
12184 44056574 43853328 44923008 47790180 52509655 58538947 64644404 69331977 71702326
12176 71702326 72071655 72125126 74088365 79613186 89177163 101770277 115042743 125769960
12168 125769960 131147009 130311240 124583767 116387342 107463530 98376299 88967734 79132112
12160 79132112 69335220 60456404 53245878 48092439 44854930 43033946 41780971 40163304
$$ packed form
12215F643380Q44312J054114J373800J729807K117322K668163L461568M761630
12207B4654096O691535R413445J3110796J7301680K0746381K1163167J6279735
12200A29360835O497329n031538j4081328j8237717j7835517j4678119j0723653
12193E5270292p081590m141255j847460j88387Q93256J224026O87631j57710o02229
12184D4056574k03246J069680K867172M719475O029292O105457M687573K370349
12176G1702326L69329N3471J963239N524821R563977J2593114J3272466J0727217
12168A25769960N377049q35769n727473q196425q923812r087231r408565r835622
12160G9132112r796892q878816p210526n153439l237509j820984j252975j617667
$$ plain form
12152 40163304 37775481 34857354 32081657 30092315 29274795 29748041 31663979 35232796
12144 35232796 40819386 48910258 59760530 73192754 87752908 100073322 105828884
12137 105828884 102495844 91210631 75863161 60466829 47403221 37333573 29867127
12130 29867127 24443257 20516044 17592924 15282261 13350487 11685172 10231148 9000748
12122 9000748 7993835 7118434 6400255 5802860 5319304 4917732 4585429 4301912 4040444
12113 4040444 3783959 3535997 3344057 3130596 2944092 2802551 2723585 2703045 2714325 2736887
12103 2736887 2822091 2928918 3000985 3005999 2913751 2774785 2602773 2398043 2185609 1974946
12093 1974946 1797527 1602306 1489828 1383813 1296362 1258857 1216110 1176038 1158125 1125655
$$ packed form
12152D0163304k387823k918127k775697j989342q17520M73246J915938L568817
12144C5232796N586590Q090872J0850272J3432224J4560154J2320414N755562
12137A05828884l333040j1285213j5347470j5396332j3063608j0069648p466446
12130B9867127n423870l927213k923120k310663j931774j665315j454024j230400
12122I000748j006913q75401p18179n97395m83556m01572l32303k83517k61468
12113D040444k56485k47962j91940k13461j86504j41541p8966k0540J1280K2562
12103B736887Q5204J06827P2067N014r2248j38966j72012k04730k12434k10663
12093A974946j77419j95221j12478j06015q7451l7505m2747m0072j7913l2470
$$ plain form
12083 1125655 1094790 1078528 1086921 1099892 1111048 1141404 1167476 1203511 1232909 1211203 1199191
12072 1199191 1192195 1159061 1176914 1214600 1275530 1359349 1455557 1522243 1560840 1596953 1616022
12061 1616022 1614157 1662134 1656666 1561248 1418554 1289445 1176461 1076918 1008449 947425 898042
12050 898042 878391 832909 813809 786018 771923 777758 777988 793295 792370 787986 817652 898689 1014758
12037 1014758 1133119 1207981 1238452 1220945 1181704 1100171 1020242 982504 980437 988813 971236
12026 971236 936041 860658 821766 762242 698970 642464 596599 566187 559471 551308 519886 506859
12014 506859 519872 496939 446092 383547 320189 241054 217101 205876 169526 169617 210954 248065
12002 248065 292893 333124 356477 422476 483158 520140 499649 455629 391243 333911 262311
$$ packed form
12083A125655l0865j6262Q393J2971J1156L0356K6072L6035K9398k1706j2012
12072A199191o996l3134J7853L7686O0930Q3819R6208O6686L8597L6113J9069
12061A616022j865M7977n468r5418j42694j29109j12984r9543o8469o1024m9383
12050H98042j9651m5482j9100k7791j4095N835K30J5307r25m384K9666Q1037J16069
12037A014758J18361P4862L0471j7507l9241q1533p9929l7738k067Q376j7577
12026I71236l5195p5383l8892n9524o3272n6506m5865l0412o716q163l1422j3027
12014E06859J3013k2933n0847o2545o3358p9135k3953j1225l6350R1M1337L7111
12002B48065M4828M0231K3353O5999O0682L6982k0491m4020o4386n7332p1600
$$ plain form
11991 262311 236179 199320 142875 101993 86156 85001 62695 43595 54462 48973 47996 27955
11979 27955 10738 -681 -7164 13739 19954 24997 37651 10019 -7787 -10110 -11970 22289 61331
11966 61331 70001 18224 -2770 46767 73611 61709 36462 -14730 -13464 -33399 -36020 -51392
11954 -51392 -61591 -88779 -99881 -68785 -54980 -40777 -43830 -72225 -93984 -61890 -64210 -64399
11942 -64399 -56930 -38253 -26929 -47101 -44703 -18395 -2611 5073 9540 19861 25301 14867 -11735
11929 -11735 -54713 -57982 -29574 -46496 -20911 -27394 -62218 -75215 -55539 -40517 -44017 -46477
11917 -46477 1683 12856 12067 5420 -2629 -32265 -49619 -17309 -4965 -9169 -21198 -30498 -43390
11904 -43390 -63589 -44206 -18069 32568 26317 14396 5611 12069 22459 23043 17988 -5212 20314
$$ packed form
11991B62311k6132l6859n6445m0882j5837j155k2306j9100J0867n489r77k0041
11979B7955j7217j1419o483K0903O215N043J2654k7632j7806k323j860L4259L9042
11966F1331Q670n1777k0994M9537K6844j1902k5247n1192J266j9935k621j5372
11954e1392j0199k7188j1102L1096J3805J4203l053k8395k1759L2094k320j89
11942f4399P469J8677J1324k0172K398K6308J5784P684M467J0321N440j0434k6602
11929a1735m2978l269K8408j6922K5585o483l4824j2997J9676J5022l500k460
11917d6477M8160J1173p89o647q049k9636j7354L2310J2344m204j2029r300j2892
11904d3390k0199J9383K6137N0637o251j1921q785O458J0390N84n055k3200K5526
$$ plain form
11891 20314 24776 15707 3846 -1930 10167 11656 14893 -8093 -16943 -6330 20187 31667 -9923
11878 -9923 -21390 -35633 -35236 -16152 -38311 -35774 -21055 8571 20151 31997 39014 38426 34058
11865 34058 16464 -13522 -50027 -45147 -22525 -15714 -26951 -13354 -42141 -53126 -50349 -31693
11853 -31693 -5877 -16468 -34064 -33161 -14538 -3226 -2816 -12461 -7840 -12851 -36676 -60711 -60350
11840 -60350 -40411 -30692 -23621 -17426 1218 -27372 -34753 799 8264 -14689 -19579 1521 -2123
11827 -2123 847 -8495 6053 -2476 -3627 8395 -17082 -32460 -25549 6946 -2535 -20725 -10782
11814 -10782 -10312 -12933 13953 30548 16096 -14667 -15929 12225 71811 63917 47413 54019 47612
11801 47612 46969 45569 41968 38928 30110 42984 55215 62272 67698 73736 87513 98237 61157
$$ packed form
11891B0314M462r069j1861n776J2097J489L237k2986q850J0613K6517J1480m1590
11878i923j1467j4243L97J9084k2159K537J4719K9626J1580J1846P017n88m368
11865C4058j7594k9986l6505M880K2622O811j1237J3597k8787j0985K777J8656
11853c1693K5816j0591j7596R03J8623J1312M10r645M621n011k3825k4035L61
11840f0350J9939R719P071O195J8644k8590p381L5552P465k2953m890K1100l644
11827b123K970r342J4548q529j151J2022k5477j5378O911L2495r481j8190R943
11814a0782M70k621K6886J6595j4452l0763j262K8154N9586p894j6504O606o407
11801D7612o43j400l601l040q818J2874J2231P057N426O038J3777J0724l7080
$$ plain form
11788 61157 36296 16356 -11522 -7460 -7095 -10505 5688 32218 34511 22804 26396 39062 50281
11775 50281 54328 95873 99326 140507 195219 256755 350183 445518 514933 576328 618111 631742
11763 631742 623031 586151 524491 442885 396085 388202 418461 418091 404915 437351 505206 544068
11751 544068 538464 522452 534935 538120 526237 511938 489672 496811 517108 512936 511944 519065 544823
11738 544823 588614 639478 686427 724345 767617 796021 825856 850709 838357 856426 873660
11727 873660 869706 838311 780925 725241 637135 550311 499678 456557 437886 448360 491559 535369
11715 535369 578935 606890 615496 578918 501458 478081 473927 442763 423648 488409 575874 632695
11703 632695 652389 630560 575945 501299 434272 410045 395983 369585 367473 358905 341098 304855
$$ packed form
11788F1157k4861j9940k7878M062L65l410J6193K6530K293j1707L592J2666J1219
11775E0281M047M1545L453M1181N4712O1536R3428R5335O9415O1395M1783J3631
11763F31742q711l6880o1660q1606m6800p883L0259l70j3176L2436O7855L8862
11751E44068n604j6012J2483L185j1883j4299k2266P139K0297m172r92P121K5758
11738E44823M3791N0864M6949L7918M3272K8404K9835K4853j2352J8069J7234
11727H73660l954l1395n7386n5684q8106q6824n0633m3121j8671J0474M3199M3810
11715E35369M3566K7955Q606l6578p7460k3377m154l1164j9115O4761Q7465N6821
11703F32695J9694k1829n4615p4646o7027k4227j4062k6398k112q568j7807l6243
$$ plain form
11691 304855 291916 269199 278661 280625 283491 248795 219109 204838 181864 142413 107052 103778
11679 103778 82661 70383 81769 47800 8803 -3138 6887 94 -4257 6847 -6461 17933
11667 17933 12736 -13662 -33253 -21071 -4375 -5564 -6793 -40687 -30056 -4979 3943 27693
11655 27693 25358 7311 -10272 -11324 4194 5253 -2719 -14596 -16754 3996 32556 16961 5275
11642 5275 18021 5791 -35876 -52669 -46669 -24872 11075 11730 -7693 -30496 -54107 -54121 -21734
11629 -21734 1915 -1662 -33324 -29564 -4536 9795 -6604 -2367 -17430 -16851 201 -9724 -20575
11616 -20575 -2872 5003 21040 20579 23811 19465 12583 341 -17287 -28106 -29863 -52380 -15368
11603 -15368 2060 -1598 6902 -6132 -20965 -9540 -21038 -30998 -16935 -19420 -28215 -18539 -13634
$$ packed form
11691C04855j2939k2717R462J964K866l4696k9686j4271k2974l9451l5361l274
11679A03778k1117j2278J1386l3969l8997j1941J0025o793m351J1104j3308K4394
11667A7933n197k6398j9591J2182J6696j189j229l3894J0631K5077Q922K3750
11655B7693k335j8047j7583j052J5518J059p972j1877k158K0750K8560j5595j1686
11642E275J2746j2230m1667j6793O000K1797L5947O55j9423k2803k3611j4L2387
11629b1734K3649l577l1662L760K5028J4331j6399M237j5063N79J7052r925j0851
11616b0575J7703P875J6037m61L232m346o882j2242j7628j0819j757k2517L7012
11603a5368J7428l658Q500j3034j4833J1425j1498r960J4063k485q795R676M905
$$ plain form
11590 -13634 -11880 11048 21446 50950 48552 34135 -5775 -15985 6710 12597 22448 3743
11578 3743 -40686 -43306 -50482 -34338 -18074 -30925 -29600 -20832 -8424 12060 31535 28868 15215
11565 15215 -15189 -9452 -2113 -12768 -25770 -28621 -5802 13514 -3419 11980 -3017 -8014
11553 -8014 -3565 -7099 4746 -27 -8975 18880 1273 -7353 5274 -7834 -7463 19259 22330
11540 22330 4570 -6101 -9290 -14034 -28632 -47274 -57239 -64257 -51900 -54324 -72703 -69002 -68962
11527 -68962 -61885 -54401 -63996 -43707 -34432 -33259 -60424 -32023 11102 -3090 -12933 17760 45799
11514 45799 45386 26340 66870 97042 103079 117682 148899 173059 178324 178479 172984 176511 181325
11501 181325 186926 162948 146473 128185 110233 121999 142875 127283 77430 16765 -11696 -283
$$ packed form
11590a3634J754K2928J0398K9504k398j4417l9910j0210K2695N887R851j8705
11578C743m4429k620p176J6144J6264j2851J325Q768J2408K0484J9475k667j3653
11565A5215l0404N737P339j0655j3002k851K2819J9316j6933J5399j4997m997
11553h014M449l534J1845m773q948K7855j7607q626J2627j3108L71K6722L071
11540B2330j7760j0671l189m744j4598j8642r965p018J2357k424j8379L701M0
11527f8962P077P484r595K0289R275J173k7165K8401M3125j4192r843L0693K8039
11514D5799m13j9046M0530L0172O037J4603L1217K4160N265J55n495L527M814
11501A81325N601k3978j6475j8288j7952J1766K0876j5592m9853o0665k8461J1413
$$ plain form
11489 -283 16194 15380 66070 97772 71428 73358 115317 146934 174682 189766 181252 164356 141906
11476 141906 118489 86562 37776 11990 20017 20195 43002 39644 12921 1465 20876 40257
11464 40257 47372 45632 65629 69522 54065 75368 124888 148819 147240 103060 63524 51785
11452 51785 59900 27993 -16559 -24081 -38452 -17984 -22195 -19211 -24262 -23571 -18148 -16629 -3289
11439 -3289 7597 6046 -19475 -55003 -56649 -42727 -53656 -32611 -9438 -7164 -29934 -28361 -36916
11426 -36916 -52443 -28755 -33998 -40885 -33371 -24852 -18070 -24 37745 46207 28018 3475 -6138
11413 -6138 -11706 -34933 -64635 -67528 -81432 -72247 -42927 -29873 -32497 -46526 -62003 -72022 -55827
11400 -55827 -52531 -53382 -42288 -32822 -2570 11954 -5071 -34644 -39609 -14390 -29735 -27879 -15551
$$ packed form
11489b83J6477q14N0690L1702k6344J930M1959L1617K7748J5084q514j6896k2450
11476A41906k3417l1927m8786k5786Q027J78K2807l358k6723j1456J9411J9381
11464D0257P115j740J9997L893j5457K1303M9520K3931j579m4180l9536j1739
11452E1785Q115l1907m4552p522j4371K0468m211K984n051O91N423J519J3340
11439c289J0886j551k5521l5528j646J3922j0929K1045K3173K274k2770J573q555
11426c6916j5527K3688n243o887P514Q519O782J8046L7769Q462j8189k4543r613
11413f138n568k3227k9702k893j3904R185K9320J3054k624j4029j5477j0019J6195
11400e5827L296q51J1094R466L0252J4524j7025k9573m965K5219j5345J856J2328
$$ plain form
11387 -15551 -17514 -40582 -40214 -58555 -69613 -50349 -21043 -20936 -26522 -29564 -44739 -42289 -50411
11374 -50411 -51474 -44045 -42391 -32308 -26995 -22006 -22557 -50579 -42866 -52635 -51816 -47028 -29088 -11014
11360 -11014 -12200 -28560 -30556 -18377 -8671 -36501 -65068 -59717 -37895 -43337 -64090 -67122 -37043
11347 -37043 -34680 -40528 -26657 -25927 -33514 -41583 -56840 -67221 -45794 -36090 -45033 -50697 -54743 -58687
11333 -58687 -77183 -83011 -71130 -31768 593 -10872 -7054 -5822 -12902 -44477 -66129 -67498 -59120
11320 -59120 -54487 -53966 -31767 -12727 -24096 -41340 -7928 -9389 -34065 -41732 -32180 -39654 -36570
11307 -36570 -21581 -13271 -5100 -23157 -37520 -54818 -39835 -12384 -17455 -6628 -25823 -23062
11295 -23062 -21431 -40971 -27064 -32989 -46804 -47493 -70860 -61922 -44767 -45298 -38563 -56755 -42772
$$ packed form
11387a5551j963k3068L68j8341j1058J9264K9306J07n586l042j5175K450q122
11374e0411j063P429J654J0083N313M989n51k8022P713r769Q19M788J7940J8074
11360a1014j186j6360j996J2179R706k7830k8567N351K1822n442k0753l032L0079
11347c7043K363n848J3871P30p587q069j5257j0381K1427R704q943n664m046l944
11333e8687j8496n828J1881L9362L2361j1465L818J232p080l1575k1652j369Q378
11320e9120M633N21K2199J9040j1369j7244L3412j461k4676p667R552p474L084
11307c6570J4989Q310Q171j8057j4363j7298J4983K7451n071J0827j9195K761
11295b3062J631j9540J3907n925j3815o89k3367Q938J7155n31O735j8192J3983
$$ plain form
11282 -42772 -48350 -41823 -24113 -17034 -2663 7523 -22955 -17265 -11332 -25531 -17666 -33075 -27013
11269 -27013 -20603 -3608 8161 9073 -9472 -44071 -51121 -39427 -36886 -39196 -47041 -64116 -70384
11256 -70384 -80383 -82526 -48035 -26256 -17237 -2800 -5107 -8408 -20824 -35711 -50670 -49823 -36819
11243 -36819 -17951 -2093 -1585 31732 39351 30460 -8732 -40152 -21889 -7512 -13027 -30955 -41251
11230 -41251 -26886 -39603 -48027 -31136 -18363 -25088 -10302 -6954 -20551 -29127 -25321 -31982 -16903
11217 -16903 -19385 -25624 -40420 -28394 -13887 -12371 -821 9524 -5837 -31265 -19680 -7691
11205 -7691 -24375 -15095 5125 2501 149 67 14879 14398 26855 26168 17376 10532 -20637 -6431
11191 -6431 1697 13586 30902 39269 92361 129541 181152 270056 371229 460791 489399 469890
$$ packed form
11282d2772n578O527J7710P079J4371J0186l0478N690N933j4199P865j5409O062
11269b7013O410J6995J1769R12j8545l4599p050J1694K541k310p845j7075o268
11256g0384r999k143L4491K1779R019J4437k307l301j2416j4887j4959Q47J3004
11243c6819J8868J5858N08L3317P619q891l9192l1420J8263J4377n515j7928j0296
11230d1251J4365j2717q424J6891J2773o725J4786L348j3597q576L806o661J5079
11217a6903k482o239j4796J2026J4507J516J1550J0345j5361k5428J1585J1989
11205g691j6684R280K0220k624k352q2J4812m81J2457o87q792o844l1169J4206
11191f431Q128J1889J7316Q367N3092L7180N1611Q8904J01173Q9562K8608j9509
$$ plain form
11179 469890 385809 319873 250954 163143 121858 90842 99247 122001 141197 139382 116420 129205
11167 129205 153422 169146 173547 194570 203742 204388 188425 189001 206257 210965 228875 278023 336365
11154 336365 372264 439949 492183 520165 522910 446108 372266 324421 282397 262895 263208 280205
11142 280205 268515 248747 238497 214317 167278 140152 131417 119667 92573 48629 17783 646
11130 646 19440 45231 95293 127669 174821 220500 314463 423685 501490 526381 434013 327082
11118 327082 231676 173626 145503 115448 89479 60360 16749 5630 -2052 13697 38458 29494
11106 29494 -15000 -46376 -34053 -14254 14700 10029 -10654 -13553 -29007 -24538 -9783 -17023
11094 -17023 -5029 6689 -419 -40530 -82522 -74960 -56492 -21964 -4122 -8200 -6595 -20514
$$ packed form
11179D69890q4081o5936o8919q7811m1285l1016Q405K2754J9196j815k2962J2785
11167A29205K4217J5724M401K1023R172O46j5963N76J7256M708J7910M9148N8342
11154C36365L5899O7685N2234K7982K745p6802p3842m7845m2024j9502L13J6997
11142B80205j1690j9768j0250k4180m7039k7126q735j1750k7094m3944l0846j7137
11130F46J8794K5791N0062L2376M7152M5679R3963J09222P7805K4891r2368j06931
11118C27082r5406n8050k8123l0055k5969k9119m3611j1119p682J5749K4761q964
11106B9494m4494l1376J2323J9799K8954m671k0683k899j5454M469J4755p240
11094a7023J1994J1718p108m0111m1992P562J8468L4528J7842m078J605j3919
$$ plain form
11082 -20514 -22430 24551 15236 8396 8347 33413 22449 16632 27038 22486 9814 7956 18119
11069 18119 7883 -7081 -9083 6597 8593 40261 63660 26579 -23208 -54095 -62847 -47107
11057 -47107 -37035 -63210 -59937 -47903 -54608 -45906 -26791 -35749 -36334 -10444 22278 6774 -12589
11044 -12589 -10971 -31040 -30030 -12998 -1370 13178 11626 -11391 -41920 -42801 -5730 6624 2149
11031 2149 12757 33954 25660 37423 20397 -2676 -3671 29571 36588 35529 53416 33987 22413
11018 22413 30920 19229 34322 18587 -1685 -1547 10150 44340 61329 32123 7386 15082
11006 15082 2577 -15792 -15916 -2653 -9256 -22822 -15881 -6031 3909 7247 46044 35395 -5123
10993 -5123 -19483 -37686 -48305 -55628 -74380 -88134 -76326 -52297 -30506 -33070 -24235 -55837
$$ packed form
11082b0514j916M6981r315o840m9K5066j0964n817J0406m552j2672j858J0163
11069A8119j0236j4964k002J5680J996L1668K3399l7081m9787l0887q752J5740
11057d7107J0072k6175L273J2034o705Q702J9115q958n85K5890L2722j5504j9363
11044a2589J618k0069J010J7032J1628J4548j552k3017l0529q81L7071J2354m475
11031B149J0608K1197q294J1763j7026k3073r95L3242P017j059J7887j9429j1574
11018B2413Q507j1691J5093j5735k0272J38J1697L4190J6989k9206k4737P696
11006A5082j2505j8369j24J3263o603j3566O941R850R940L338L8797j0649m0518
10993e123j4360j8203j0619p323j8752j3754J1808K4029K1791k564Q835l1602
$$ plain form
10981 -55837 -98692 -92737 -68106 -62625 -53035 -23289 -42577 -47636 -20450 -402 -17022 -21857 -8209
10968 -8209 15496 37054 6869 -18375 -25469 -15191 -21773 2201 3099 -13819 -23939 -38882 -28913
10955 -28913 -13706 -18724 -34434 -12007 2677 -29029 -44451 -37115 -18895 12172 15147 -12324
10943 -12324 -16777 -28383 -34857 -26745 -17465 -11267 -13907 -15820 994 31046 -14030 -35365 -28643
10930 -28643 -31517 -2061 20511 18522 6925 -1639 -15962 -8529 26224 47720 31986 34638 16688
10917 16688 13773 15072 16489 17282 17528 33759 36357 39664 47807 70298 62433 58472 52473 59026
10903 59026 66307 49091 41065 22712 18062 39334 66141 86720 81720 40440 47511 27430 -1654
10890 -1654 -29350 -52681 -80463 -82556 -59169 -46187 -37517 -31659 -26081 -32420 -31592 -26633 -969
$$ packed form
10981e5837m2855N955K4631N481R590K9746j9288n059K7186K0048j6620m835J3648
10968h209K3705K1558l0185k5244p094J0278o582K3974Q98j6918j0120j4943R969
10955b8913J5207n018j5710K2427J4684l1706j5422P336J8220L1067K975k7471
10943a2324m453j1606o474Q112R280O198k640j913J6814L0052m5076k1335O722
10930b8643k874K9456K2572j989j1597q564j4323P433L4753K1496j5734K652j7950
10917A6688k915J299J417P93K46J6231K598L307Q143K2491p865l961n999O553
10903E9026P281j7216q026j8353m650K1272K6807K0579n000m1280P071k0081k9084
10890a654k7696k3331k7782k093K3387J2982Q670N858N578o339Q28M959K5664
$$ plain form
10877 -969 9051 12504 -22073 -20476 1069 13266 4695 3117 -20235 -2348 8601 14144 -484
10864 -484 -23814 -40223 -33664 -40938 -44837 -41576 -23987 -19729 -31123 -28166 -35028 -27547 -5797 -2667
10850 -2667 -23772 -20684 -8017 2017 -7724 -49070 -72642 -53272 -36102 -36385 -4254 53005 60585
10837 60585 51682 30180 40924 36881 34580 23561 11278 26820 39923 -4664 -1014 43388
10825 43388 51333 48720 38236 21715 16244 13227 -452 -13211 -14685 557 12460 14019 23676
10812 23676 30567 39360 35012 22088 3506 -2275 -5240 5907 9928 34282 55321 56377 56756
10799 56756 53300 48781 77881 77719 41574 12961 12272 14494 7275 11895 13186 43035 49851 30972
10785 30972 18790 18020 6958 -36874 -51311 -39329 -31357 -15905 -5502 -2925 -19877 -23001 -23550
$$ packed form
10877i69J0020L453l4577J597K1545J2197q571j578k3352J7887J0949N543j4628
10864d84k3330j6409O559p274l899L261J7589M258j1394K957o862P481K1750L130
10850b667k1105L088J2667J0034r741m1346k3572J9370J7170k83L2131N7259P580
10837F0585q903k1502J0744m043k301j1019j2283J5542J3103m4587L650M4402
10825D3388P945k613j0484j6521n471l017j3679j2759j474J5242J1903J559R657
10812B3676O891Q793m348j2924j8582n781k965J1147M021K4354K1039J056L79
10799E6756l456m519K9100j62l6145k8613o89K222p219M620J291K9849O816j8879
10785C0972j2182p70j1062m3832j4437J1982P972J5452J0403K577j6952l124n49
$$ plain form
10772 -23550 -14104 2562 20540 44440 29181 -2321 3801 20286 5709 8151 23416 8021
10760 8021 12127 21298 27989 14945 -31439 -18200 11098 14492 -8484 -6465 819 -1480 22601
10747 22601 36553 17514 9346 14258 37749 28053 1476 15426 30087 48612 56919 57523 31817
10734 31817 16208 21768 -1084 -23182 -38843 -46205 -13436 -18942 -18666 -9362 -23722 -24649 -19222
10721 -19222 -33827 -32284 -14331 -9195 -31448 -30186 5909 11232 22629 30064 16179 -3919 1186
10708 1186 -4219 21070 69650 91695 115995 121387 99539 89553 73735 46734 74062 85789
10696 85789 67165 62582 43668 69512 72252 72589 42870 21731 21752 33723 49650 74786 108590
10683 108590 106657 83599 41503 26177 14206 16559 16629 35690 74181 62358 68246 107062 88311
$$ packed form
10772b3550R446J6666J7978K3900j5259l1502O122J6485j4577K442J5265j5395
10760H021M106R171O691j3044m6384J3239K9298L394k2976K019P284k299K4081
10747B2601J3952j9039q168M912K3491r696k6577J3950J4661J8525Q307O04k5706
10734C1817j5609N560k2852k2098j5661p362L2769n506K76R304j4360r27N427
10721a9222j4605J543J7953N136k2253J262L6095N323J1397P435j3885k0098N105
10708A186n405K5289M8580K2045K4300N392k1848r986j5818k7001K7328J1727
10696H5789j8624m583j8914K5844K740L37k9719k1139K1J1971J5927K5136L3804
10683A08590j933k3058m2096j5326j1971K353P0J9061L8491j1823N888L8816j8751
$$ plain form
10670 88311 53457 35082 18823 46216 31571 11231 23121 36580 27656 9214 -1380 -20250
10658 -20250 -26819 -10435 -7658 12902 18404 -1895 -16279 -40063 -48953 -20767 2203 26195
10646 26195 34074 27386 48063 68108 68035 45283 25880 -3511 -10174 20791 29526 27517 26572 13353
10632 13353 14061 22251 33536 22342 11543 20675 37032 53355 42409 25482 18850 6891 -18785
10619 -18785 -24435 -6011 9575 25567 6506 7067 5406 9692 24719 40249 54301 64912 62967
10606 62967 103475 120570 101862 107000 127915 124019 134204 141503 164586 156336 132517 99018
10594 99018 88505 104261 106976 110613 102921 78695 60184 71240 94382 93776 106220 177277 252244
10581 252244 310535 337507 354007 367206 393336 468300 579440 731460 1020019 1552867 2380396
$$ packed form
10670H8311l4854j8375j6259K7393j4645k0340J1890J3459q924j8442j0594j8870
10658b0250o569J6384K777K0560N502k0299j4384k3784q890K8186K2970K3992
10646B6195P879o688K0677K0045p3k2752j9403k9391o663L0965Q735k009r45j3219
10632A3353P08Q190J1285j1194j0799R132J6357J6323j0946j6927o632j1959k5676
10619a8785n650J8424J5586J5992j9061N61j661M286J5027J5530J4052J0611j945
10606F2967M0508J7095j8708N138K0915l896J0185P299K3083q250k3819l3499
10594I9018j0513J5756K715L637p692k4226j8511J1056K3142o06J2444P1057P4967
10581B52244N8291K6972J6500J3199K6130P4964J11140J52020K88559N32848Q27529
$$ plain form
10570 2380396 3094841 3080179 2506572 1743016 1129790 743473 513571 396594 299337 260344
10560 260344 220285 173559 144220 121039 102680 113622 111143 102061 90250 66790 27379 2952
10548 2952 37199 49452 18298 43653 62822 47905 9656 7752 26063 54670 30093 12636
10536 12636 14680 17364 36601 46741 48472 28697 33873 48432 43882 42584 27672 21499 30256
10523 30256 33065 18624 3249 39524 61060 37301 38734 19950 18777 37995 53207 75391
10511 75391 85246 68873 14648 -12248 -8876 -10192 16329 5579 8962 -6527 -15806 -22078 -7899
10498 -7899 -27350 -25292 -33249 -16097 -5906 10734 39429 48416 30488 22369 -9437 -43407 -55341
10485 -55341 -30621 292 10957 37349 50531 25986 19625 30717 20512 19978 2727 -10476
$$ packed form
10570B380396P14445j4662n73607p63556o13226l86317k29902j16977r7257l8993
10560B60344m0059m6726k9339k3181j8359J0942k479r082j1811k3460l9411k4427
10548B952L4247J2253l1154K5355J9169j4917l8249j904J8311K8607k4577j7457
10536A2636K044K684J9237J0140J731j9775N176J4559m550j298j4912o173Q757
10523C0256K809j4441j5375L6275K1536k3759J433j8784j173J9218J5212K2184
10511G5391R855j6373n4225k6896L372j316K6521j0750L383j5489r279o272J4179
10498g899j9451K058p957J7152J0191J6640K8695Q987j7928q119l1806l3970j1934
10485e5341K4720L0913J0665K6392J3182k4545o361J1092j0205n34j7251j3203
$$ plain form
10473 -10476 3634 -6072 6255 9756 4218 22635 36438 24857 5770 -14802 3554 24227
10461 24227 35932 40982 -594 -12507 11729 9808 19495 21666 20498 2049 544 -2061 12690
10448 12690 512 -30139 -36691 -11826 -14745 -13038 2574 30597 578 -9150 8801 12949 13905
10435 13905 7599 24763 35153 19314 14176 22560 7882 1224 11968 11256 14254 37961 61880
10422 61880 45508 32861 32767 47076 65351 76330 59890 24636 41891 28217 26598 34114 57111
10409 57111 70160 57882 48253 63556 85317 63205 67305 67356 69649 59525 37151 39897 38386
10396 38386 31721 54237 45444 7004 -6470 27739 41136 12793 12596 7562 22245 42850 35597
10383 35597 19842 31187 37742 46368 22398 9519 23793 25420 34409 18565 6524 -16363
$$ packed form
10473a0476J4110r706J2327L501n538J8417J3803j1581j9087k0572J8356K0673
10461B4227J1705N050m1576j1913K4236j921R687K171j168j8449j505k605J4751
10448A2690j2178l0651o552K4865k919J707J5612K8023l0019r728J7951M148R56
10435A3905o306J7164J0390j5839n138Q384j4678o658J0744p12K998K3707K3919
10422F1880j6372j2647r4J4309J8275J0979j6440l5254J7255j3674j619P516K2997
10409E7111J3049j2278r629J5303K1761k2112M100N1K293j0124k2374K746j511
10396C8386o665K2516q793l8440j3474L4209J3397k8343j97n034J4683K0605p253
10383C5597j5755J1345O555Q626k3970j2879J4274J627Q989j5844j2041k2887
$$ plain form
10371 -16363 -27221 -268 -174 -6362 -6866 -25483 -30070 -20998 -21420 -4083 9771 2558 -14785 -15119
10357 -15119 -21976 -22503 -3428 1051 12028 18862 12156 27549 29786 17713 23881 3415 -25713
10344 -25713 -38286 -28484 -8132 -17262 -24765 7880 37761 58444 40899 25472 24243 14112
10332 14112 37366 59942 38700 5268 -16791 -9155 -20183 10905 23728 14169 5467 24513
10320 24513 48202 77752 73229 65292 88648 130927 159885 152357 146036 137211 155100 163693 159718
10307 159718 121910 84682 41196 65375 75978 59902 62088 32883 16087 21237 22446 29836
10295 29836 40696 31863 24670 11895 22014 14025 326 -15887 -19707 -8030 15269 24303 28717
10282 28717 25522 43996 28862 25918 66460 62224 46283 33512 53974 62322 67743 70243 78621
$$ packed form
10371a6363j0858K6953R4o188n04j8617m587R072m22J7337J3854p213j7343l34
10357a5119o857n27J9075M479J0977O834o706J5393K237j2073O168k0466k9128
10344b5713j2573R802K0352r130p503L2645K9881K0683j7545j5427j229j0131
10332A4112K3254K2576k1242l3432k2059P636j1028L1088J2823r559q702J9046
10320B4513K3689K9550m523p937K3356M2279K8958p528o321q825J7889Q593l975
10307A59718l7808l7228m3486K4179J0603j6076K186k9205j6796N150J209P390
10295B9836J0860q833p193j2775J0119p989j3699j6213l820J1677K3299R034M414
10282B8717l195J8474j5134k944M0542m236j5941j2771K0462Q348N421K500Q378
$$ plain form
10269 78621 75460 76378 70097 50061 43022 19815 7108 18063 17257 1922 16581 27863 37872
10256 37872 44296 45012 50671 38726 15181 -14254 -21674 -23254 -14282 12451 38812 37021 -5742
10243 -5742 -27638 -38357 -27951 11119 30323 49380 71990 51229 67216 69240 40615 43901
10231 43901 45637 56773 68026 75259 94448 82828 88800 119578 120227 108101 85882 50718 31097
10218 31097 22394 13414 34748 17990 12613 36684 66927 85621 74947 89244 116147 140652
10206 140652 155611 164593 165493 175368 251025 387661 538518 736529 957369 1142196 1290838
10195 1290838 1472292 1642805 1653627 1532755 1394302 1248323 1103443 926022 712586 531308
10185 531308 434222 371625 350975 331962 311561 271398 228100 218000 239806 244261 239564 228546
$$ packed form
10269G8621l161R18o281k0036p039k3207j2707J0955q06j5335J4659J1282J0009
10256C7872O424P16N659j1945k3545k9435p420j580Q972K6733K6361j791m2763
10243e742k1896j0719J0406L9070J9204J9057K2610k0761J5987K024k8625L286
10231D3901J736J1136J1253P233J9189j1620N972L0778O49j2126k2219l5164j9621
10218C1097q703q980K1334j6758n377K4071L0243J8694j0674J4297K6903K4505
10206A40652J4959Q982R00R875P5657J36636J50857J98011K20840J84827J48642
10195A290838J81454J70513J0822j20872j38453j45979j44880j77421k13436j81278
10185E31308r7086o2597k0650j9013k0401m0163m3298j0100K1806M455m697j1018
$$ plain form
10173 228546 206119 177003 175311 164324 166186 143984 123721 146377 178093 179873 171611 162085
10161 162085 174318 160048 137206 114052 108878 105110 90897 88182 72777 48782 33158 43627
10149 43627 44329 40544 31697 40991 46063 14820 22198 43197 46403 44087 26313 24253 13940 19162
10135 19162 22649 28821 14506 17541 36261 13229 22414 35681 30265 26284 21609 29341 23730
10122 23730 27175 50954 65569 35110 1198 18222 50255 69848 57855 35168 56578 65228
10110 65228 50007 49858 52603 61275 53794 51686 79357 115132 86431 74913 70683 38804 35192
10097 35192 44813 87285 109041 96502 87315 103222 109005 105703 138193 148110 128013 100919 112237
10084 112237 127964 92850 58007 62893 78814 96700 96181 103430 106966 87092 74734 84845
$$ packed form
10173B28546k2427k9116j692j0987J862k2202k0263K2656L1716J780q262r526
10161A62085J2233j4270k2842k3154n174l768j4213k715j5405k3995j5624J0469
10149D3627P02l785q847R294N072l1243P378K0999L206k316j7774k060j0313N222
10135A9162L487O172j4315L035J8720k3032R185J3267n416l981m675P732n611
10122B3730L445K3779J4615l0459l3912J7024L2033J9593j1993k2687K1410Q650
10110F5228j5221j49K745Q672p481k108K7671L5775k8701j1518m230l1879l612
10097C5192R621M2472K1756j2539r187J5907N783l302L2490R917k0097k7094J1318
10084A12237J5727l5114l4843M886J5921J7886n19P249L536j9874j2358J0111
$$ plain form
10072 84845 98384 102272 77771 69704 82867 75941 72762 68525 33121 25063 46382 66490 68642
10059 68642 68938 74268 95783 88196 88430 105849 102478 104104 106797 136631 159456 175456 196659
10046 196659 225806 275424 348336 482880 650286 877855 1270696 1978071 3392676 5402264
10036 5402264 6386399 5668712 4137589 2578826 1576049 1078146 817241 639161 500578
10027 500578 419385 352014 282795 263137 253940 215658 195868 181069 191809 191752 172473 150725
10015 150725 122619 96620 95446 94459 104969 109100 75172 45446 12908 914 7039 24392
10003 24392 25264 35257 42591 26351 51619 47800 33619 45649 42650 49928 67289 47151 35033
9990 35033 12201 15385 33491 26434 18521 30002 45913 33226 43491 50988 51989 58441 35623
$$ packed form
10072H4845J3539L888k4501q067J3163o926l179m237l5404q058K1319K0108K152
10059F8642K96N330K1515p587K34J7419l371J626K693K9834K2825J6000K1203
10046A96659K9147M9618P2912J34544J67406K27569L92841P07375J414605K009588
10036E402264R84135p17687j531123j558763j002777m97903k60905j78080j38583
10027E00578q1193o7371o9219j9658r197l8282j9790j4799J0740n7j9279k1748
10015A50725k8106k5999j174r87J0510M131l3928k9726l2538j1994O125J7353
10003B4392Q72R993P334j6240K5268l819j4181J2030k999P278J7361k0138j2118
9990C5033k2832L184J8106p057p913J1481J5911j2687J0265P497J001O452k2818
$$ plain form
9977 35623 41148 49082 55830 36716 65158 90471 83514 73246 50840 34701 9256 453 -1013
9964 -1013 -338 9370 22644 7251 6733 27764 22311 13593 13732 -13376 -18119 12469 10517 9416
9950 9416 33136 70207 45448 22392 50459 86885 77628 39338 15513 24577 56774 68198
9938 68198 93844 136638 136551 95987 105525 107726 78382 71921 87635 72113 63922 65433 70419 72442
9924 72442 70016 55364 56308 67964 53477 45492 61104 60224 48740 71048 78632 84221 86608 69274
9910 69274 60311 48931 46280 62389 67294 59327 56721 51120 66365 83208 59922 37471 49532
9897 49532 86743 71280 56688 49857 22240 33150 19451 1945 -10153 6627 4189 17004
9885 17004 45173 59824 73784 57100 54643 98153 104187 70587 53771 52996 76958 74983 78599
$$ packed form
9977C5623N525P934O748j9114K8442K5313o957j0268k2406j6139k5445q803j466
9964a013O75R708J3274j5393n18K1031n453q718J39k7108m743L0588j952j101
9950I416K3720L7071k4759k3056K8067L6426r257l8290k3825R064L2197J1424
9938F8198K5646M2794q7m0564R538K201k9344o461J5714j5522q191J511M986K023
9924G2442k426j4652R44J1656j4487p985J5612q80j1484K2308P584N589K387j7334
9910F9274q963j1380k651J6109M905p967k606n601J5245J6843k3286k2451J2061
9897D9532L7211j5463j4592o831k7617J0910j3699j7506j2098J6780k438J2815
9885A7004K8169J4651J3960j6684k457M3510O034l3600j6816p75K3962j975L616
$$ plain form
9872 78599 52126 41387 50161 51211 55328 47112 25141 30369 63195 64827 44489 58939 79145
9859 79145 85662 64522 53364 53402 66407 86008 105584 88926 101936 103330 80975 57233 55484
9846 55484 77093 82921 102643 118803 107699 102315 83246 59482 66878 84322 93474 117839 126420
9833 126420 95592 85510 111381 99558 99793 122095 106198 76073 60669 79407 85184 77139
9821 77139 73239 59544 60056 71099 82332 87938 86422 71752 69786 88270 98790 110399 102317
9808 102317 79635 96213 122335 122180 118252 110809 120449 113681 94920 127334 152290 127083 141526
9795 141526 147076 143326 145285 124061 120849 118296 103228 102195 86560 95861 86987 47799 37294
9782 37294 41300 59798 57878 72885 106054 116954 117523 86968 70542 94639 119022 118306 117557
$$ packed form
9872G8599k6473j0739Q774J050M117q216k1971N228L2826J632k0338J4450K0206
9859G9145O517k1140j1158L8J3005J9601J9576j6658J3010J394k2355k3742j749
9846E5484K1609N828J9722J6160j1104n384j9069k3764P396J7444R152K4365Q581
9833A26420l0828j0082K5871j1823K35K2302j5897l0125j5404J8738N777q045
9821G7139l900j3695N12J1043J1233N606j516j4670j966J8484J0520J1609q082
9808A02317k2682J6578K6122j55l928p443R640o768j8761L2414K4956k5207J4443
9795A41526N550l750J959k1224l212k553j5068j033j5635R301q874l9188j0505
9782C7294M006J8498j920J5007L3169J0900N69l0555j6426K4097K4383p16p49
$$ plain form
9769 117557 123529 165385 167598 159809 150848 136880 144157 145676 129882 112040 98928 100566 122500
9756 122500 115410 137684 141339 101802 91943 104612 143298 165692 138140 110945 102798 126987
9744 126987 125240 135577 156486 113758 85191 58759 66311 83158 73516 55284 68847 85449
9732 85449 59514 63173 113368 154094 143192 105487 110349 121362 134919 145303 139675 111193
9720 111193 97667 128946 149769 128398 117694 117285 106243 84224 85146 106824 126637 106569
9708 106569 105838 134462 124621 122680 129793 125133 121884 124721 129445 135992 150612 149990 134456 154735
9694 154735 147617 137435 150603 139307 154486 151208 133456 99075 108792 145418 162239 163110 163211
9681 163211 155318 200784 219160 230660 237257 223484 208322 181333 193506 196203 158287 128956
$$ packed form
9769A17557N972M1856K213p789q961j3968P277J519j5794j7842j3112J638K1934
9756A22500p090K2274L655l9537r859J2669L8686K2394k7552k7195q147K4189
9744A26987j747J0337K0909m2728k8567k6432P552J6847r642j8232J3563J6602
9732H5449k5935L659N0195M0726j0902l7705M862J1013J3557J0384n628k8482
9720A11193j3526L1279K0823k1371j0704m09j1042k2019R22K1678J9813k0068
9708A06569p31K8624r841j941P113m660l249K837M724O547J4620o22j5534K0279
9694A54735p118j0182J3168j1296J5179l278j7752l4381R717L6626J6821Q71J01
9681A63211p893M5466J8376J1500O597j3773j5162k6989J2173K697l7916k9331
$$ plain form
9669 128956 141241 132013 153024 187342 209145 231842 214645 218254 235058 232229 211761 199837
9657 199837 194583 197089 218929 246328 240006 226356 207948 165461 130494 116975 125352 183271
9645 183271 186455 170100 127601 115428 132775 126991 107208 112169 136396 124974 126259 132711 140786
9632 140786 145238 172073 195293 208569 219973 209154 166997 187487 172557 158345 134018 138748
9620 138748 156661 167215 174344 166804 147286 141571 167811 200671 204351 180671 151043 124661
9608 124661 144292 139064 135258 148940 154004 150705 175620 205617 214797 205268 201091 189207 200338
9595 200338 256466 277081 250180 216261 225776 232315 243785 231428 216756 194052 212556 233857
9583 233857 203805 208519 231382 239730 230438 225106 225471 217938 213244 227318 225319 208487 218773
$$ packed form
9669A28956J2285r228K1011L4318K1803K2697j7197L609J6804k829k0468j1924
9657A99837n254K506K1840K7399o322j3650j8408m2487l4967j3519Q377N7919
9645A83271L184j6355m2499j2173J7347n784j9783M961K4227j1422J285O452Q075
9632A40786M452K6835K3220J3276J1404j0819m2157K0490j4930j4212k4327M730
9620A38748J7913J0554P129p540j9518n715K6240L2860L680k3680k9628k6382
9608A24661J9631n228l806J3682N064l299K4915K9997R180r529m177j1884J1131
9595B00338N6128K0615k6901l3919R515O539J1470j2357j4672k2704J8504K1301
9583B33857l0052M714K2863Q348r292n332L65p533m694J4074j999j6832J0286
$$ plain form
9570 218773 221423 215127 198052 200531 246377 270328 240564 201859 193737 208369 207999 188791 192709
9557 192709 202949 226468 229598 226346 248506 281391 286060 277163 279898 261446 250030 250896 224139
9544 224139 220964 241946 247707 243987 247317 239717 219581 226684 244630 249599 235640 220601 225746
9531 225746 229152 247453 256443 271892 267539 276337 272143 258884 259154 272522 262204 251454 268165
9518 268165 277431 268110 268604 266019 243973 241802 257130 263877 250719 241258 259439 280444 268796
9505 268796 247498 263258 296994 293947 302561 302041 278348 274654 276207 307067 335806 347719 326537
9492 326537 305171 314187 338232 333005 348338 354592 373984 362957 340914 314046 314223 307286 312817
9479 312817 332381 332304 359148 370145 355019 351005 376960 386388 370003 352995 380087 409342 422605
$$ packed form
9570B18773K650o296j7075K479M5846K3951k9764l8705q122J4632l70j9208L918
9557A92709J0240K3519L130l252K2160L2885M669q897K735j8452j1416Q66k6757
9544B24139l175K0982N761l720L330p600k0136P103J7946M969j3959j5039N145
9531B25746L406J8301Q990J5449m353Q798m194j3259K70J3368j0318j0750J6711
9518B68165R266r321M94k585k2046k171J5328O747j3158r461J8181K1005j1648
9505B68796k1298J5760L3736l047Q614n20k3693l694J553L0860K8739J1913k1182
9492C26537k1366R016K4045n227J5333O254J9392j1027k2043k6868J77o937N531
9479C12817J9564p7K6844J0997j5126m014K5955R428j6385j7008K7092K9255J3263
$$ plain form
9466 422605 428269 394671 404526 416055 392355 379744 396238 406240 410797 408382 422699 418800 427458
9453 427458 457571 473596 467153 477489 459565 471125 487945 500629 475852 468406 492964 515782
9441 515782 518362 486996 465507 488359 495166 513029 522269 542747 551462 574163 580793 566681 573672
9428 573672 580923 575860 553866 563702 590672 563881 543204 555642 575176 609112 602309 576362
9416 576362 569552 578631 586657 609355 601015 588002 598951 596577 583083 578223 566488 589829 604881
9403 604881 623700 644404 641095 680569 685727 655833 653617 673996 693425 715640 714827 725641 759832
9390 759832 747547 734417 752751 715694 717319 737700 771321 786595 793378 807047 803761 789797
9378 789797 808682 821118 845147 842080 865402 890657 914259 910110 886923 877248 864566 871872
$$ packed form
9466D22605N664l3598R855J1529k3700j2611J6494J0002M557k415J4317l899Q658
9453D27458L0113J6025o443J0336j7924J1560J6820J2684k4777p446K4558K2818
9441E15782K580l1366k1489K2852O807J7863R240K0478Q715K2701O630j4112O991
9428E73672P251n063k1994R836K6970k6791k0677J2438J9534L3936o803k5947
9416E76362o810R079Q026K2698q340j3013J0949k374j3494m860j1735K3341J5052
9403F04881J8819K0704l309L9474N158k9894k216K0379J9429K2215q13J0814L4191
9390G59832j2285j3130J8334l7057J625K0381L3621J5274O783J3669l286j3964
9378G89797J8885J2436K4029l067K3322K5255K3602m149k3187r675j2682P306
$$ plain form
9366 871872 867110 880320 894867 942363 973610 966681 949880 938550 931979 926414 933950 965464 1002449
9353 1002449 1007581 1016117 987657 972468 997319 1031606 1051311 1081690 1113926 1121536 1149328 1142088
9341 1142088 1134118 1181115 1200203 1200087 1180166 1183373 1211651 1231215 1233843 1236505 1256556 1267441 1289811
9328 1289811 1301558 1324746 1376369 1396623 1401859 1427575 1455421 1492979 1533775 1584988 1604171 1638488
9316 1638488 1647710 1644690 1690577 1727092 1731128 1733741 1738922 1778222 1786350 1811596 1827754 1850663 1867189
9303 1867189 1871796 1897901 1919555 1945941 1963879 1964336 1972853 2005701 2043303 2071102 2123438 2149060
9291 2149060 2158964 2161270 2187037 2212812 2254285 2307016 2341432 2368420 2428147 2479731 2530149 2579212
9279 2579212 2649462 2715137 2763395 2813879 2846366 2874170 2915858 2982833 3055496 3107536 3150767
$$ packed form
9366H71872m762J3210J4547M7496L1247o929j6801j1330o571n565P536L1514L6985
9353A002449N132Q536k8460j5189K4851L4287J9705L0379L2236P610K7792p240
9341A142088p970M6997J9088j16j9921L207K8278J9564K628K662K0051J0885K2370
9328A289811J1747K3188N1623K0254N236K5716K7846L7558M0796N1213J9183L4317
9316A638488R222l020M5887L6515M036K613N181L9300Q128K5246J6158K2909J6526
9303A867189M607K6105K1654K6386J7938M57Q517L2848L7602K7799N2336K5622
9291B149060R904K306K5767K5775M1473N2731L4416K6988N9727N1584N0418M9063
9279B579212P0250O5675M8258N0484L2487K7804M1688O6975P2663N2040M3231
$$ plain form
9268 3150767 3201854 3272287 3365278 3464384 3532993 3617955 3704426 3801558 3881335 3985687 4069862
9257 4069862 4160531 4259234 4350318 4421145 4511004 4602009 4722349 4823432 4936426 5095176 5256940
9246 5256940 5408497 5554806 5698853 5865903 6020212 6181101 6337883 6496664 6692795 6871850
9236 6871850 7035247 7202039 7388911 7628183 7883205 8146422 8396167 8611888 8869765 9138056
9226 9138056 9422913 9732453 10053061 10384021 10744100 11126723 11521331 11932359 12375837 12822545
9216 12822545 13275544 13772352 14259725 14772519 15339543 15916372 16498383 17116573 17767810
9207 17767810 18445536 19150166 19902705 20668928 21446284 22211707 23022922 23846817 24723605
9198 24723605 25615400 26485095 27363347 28260907 29158152 30021338 30885922 31693830 32479994
$$ packed form
9268C150767N1087P0433R2991R9106O8609Q4962Q6471R7132P9777J04352Q4175
9257D069862R0669R8703R1084P0827Q9859R1005J20340J01083J12994J58750J61764
9246E256940J51557J46309J44047J67050J54309J60889J56782J58781J96131J79055
9236F871850J63397J66792J86872K39272K55022K63217K49745K15721K57877K68291
9226I138056K84857L09540L20608L30960L60079L82623L94608M11028M43478M46708
9216A2822545M52999M96808M87373N12794N67024N76829N82011O18190O51237
9207A7767810O77726P04630P52539P66223P77356P65423Q11215Q23895Q76788
9198B4723605Q91795Q69695Q78252Q97560Q97245Q63186Q64584Q07908P86164
$$ plain form
9189 32479994 33228169 33907372 34535982 35110595 35614393 36005498 36289581 36461945 36539025 36565911
9179 36565911 36465749 36228810 35931137 35560842 35095210 34526121 33914380 33284948 32578981
9170 32578981 31780519 30942496 30098949 29247999 28379660 27491562 26601214 25741483 24855318
9161 24855318 23994913 23164011 22351460 21560632 20771172 20023312 19284889 18563504 17860897
9152 17860897 17209128 16600330 16029144 15428466 14862861 14354959 13842467 13375393 12930059
9143 12930059 12491341 12056248 11626490 11217330 10827239 10458216 10073459 9730745 9382278
9134 9382278 9076414 8782072 8509337 8255745 7987024 7726463 7480585 7222917 7024805 6858141
9124 6858141 6653439 6436181 6222174 6021005 5852006 5694062 5569925 5459304 5324458 5153063
$$ packed form
9189C2479994P48175O79203O28610N74613N03798L91105K84083J72364P7080K6886
9179C6565911j00162k36939k97673l70295m65632n69089o11741o29432p05967
9170C2578981p98462q38023q43547q50950q68339q88098q90348q59731q86165
9161B4855318q60405q30902q12551p90828p89460p47860p38423p21385p02607
9152A7860897o51769o08798n71186o00678n65605n07902n12492m67074m45334
9143A2930059m38718m35093m29758m09160l90091l69023l84757l42714l48467
9134I382278l05864k94342k72735k53592k68721k60561k45878k57668j98112j66664
9124F858141k04702k17258k14007k01169j68999j57944j24137j10621j34846j71395
$$ plain form
9114 5153063 4974538 4818748 4693008 4598240 4481638 4369075 4269385 4160313 4021703 3914905
9104 3914905 3838709 3746311 3670775 3576695 3511901 3448055 3370323 3274111 3187947 3147825 3119117
9093 3119117 3055514 2968013 2873194 2803157 2756032 2710277 2654146 2611995 2559447 2485248 2437744
9082 2437744 2385169 2326936 2281344 2266884 2231725 2196884 2142586 2092313 2061882 2076883 2058705
9071 2058705 1981260 1906596 1835954 1788090 1788683 1791285 1751494 1691477 1686025 1679086 1661563 1632329
9059 1632329 1609507 1586697 1540978 1471915 1439323 1447485 1452952 1427104 1415887 1388100 1356468 1336517
9047 1336517 1318543 1324688 1305437 1269500 1246230 1210446 1133620 1113941 1131687 1127493 1102073 1092388
9035 1092388 1089527 1077244 1080951 1058125 1008228 974263 972754 971566 998946 994319 954024 920022
$$ packed form
9114E153063j78525j55790j25740r4768j16602j12563r9690j09072j38610j06798
9104C914905p6196r2398p5536r4080o4794o3846p7732r6212q6164m0122k8708
9093C119117o3603q7501r4819p0037m7125m5755n6131m2151n2548p4199m7504
9082B437744n2575n8233m5592j4460l5159l4841n4298n0273l0431J5001j8178
9071B058705p7445p4664p0642m7864N93K602l9791o0017n452o939j7523k9234
9059A632329k2822k2810m5719o9063l2592Q162N467k5848j1217k7787l1632j9951
9047A336517j7974O145j9251l5937k3270l5784p6826j9679J7746m194k5420r685
9035A092388k861j2283L707k2826m9897l3965j509j188K7380m627m0295l4002
$$ plain form
9023 920022 900101 917460 917261 929070 922145 885745 861744 829585 819722 833195 850674 839388
9011 839388 819233 776295 748716 733027 724820 760859 768340 767607 749315 728920 721440 701353 682214
8998 682214 663589 645233 652758 656488 650965 653524 648498 648540 631788 644030 649394 630327 609574
8985 609574 614983 601977 570113 555544 542740 550280 539446 538087 511129 502751 503916 491441 487987
8972 487987 475128 486598 467553 469252 499314 511173 511006 471604 450937 456677 452738 442696 444437
8959 444437 438572 422887 399555 404797 418285 429535 421622 416065 407153 402674 386285 410300 419294
8946 419294 402980 377348 357466 346349 374550 393240 395976 352408 335426 327658 316745 348182
8934 348182 363756 350531 343788 366860 351348 350008 364360 330472 314274 354059 349762 330890
$$ packed form
9023I20022j9921J7359j99J1809o925l6400k4001l2159r863J3473J7479j1286
9011H39388k0155m2938k7579j5689q207L6039P481p33j8292k0395p480k0087j9139
8998F82214j8625j8356P525L730n523K559n026M2j6752J2242N364j9067k0753
8985F09574N409j3006l1864j4569j2804P540j0834j359k6958q378J165j2475l454
8972D87987j2859J1470j9045J699L0062J1859j67l9402k0667N740l939j0042J741
8959D44437n865j5685k3332N242J3488J1250p913n557q912m479j6389K4015Q994
8946D19294j6314k5632j9882j1117K8201J8690K736m3568j6982p768j0913L1437
8934C48182J5574j3225o743K3072j5512j340J4352l3888j6198L9785m297j8872
$$ plain form
8922 330890 319511 326168 313959 320890 348667 355994 338514 291746 283697 293297 314070 330015 322831
8909 322831 317262 330670 356911 363915 366188 359197 370558 378977 353729 350011 318489 320415 348339
8896 348339 360034 369281 369604 365988 347468 338321 303256 308015 354510 325881 342582 365123 393626
8883 393626 383472 396980 442119 491676 517197 553156 604924 679167 770166 859839 924077 1043730
8871 1043730 1158296 1271525 1424176 1674125 2097497 2803617 3908060 5658877 8372731
8862 8372731 11595372 13527141 12943437 10512832 7578749 5232451 3714330 2784201 2157813
8853 2157813 1757114 1485990 1285861 1149934 1052752 997836 943606 846576 789426 726341 638653
8842 638653 535093 476531 460641 459292 424717 403451 406475 423569 439295 431852 410242 362196
$$ packed form
8922C30890j1379O657j2209O931K7777P327j7480m6768q049R600K0773J5945p184
8909C22831n569J3408K6241P004K273o991J1361Q419k5248l718l1522J926K7924
8896C48339J1695R247L23l616j8520r147l5065M759M6495k8629J6701K2541K8503
8883C93626j0154J3508M5139M9557K5521L5959N1768P4243R0999Q9673O4238J19653
8871A043730J14566J13229J52651K49949M23372P06120J104443J750817K713854
8862H372731L222641J931769n83704k430605k934083k346298j518121r30129o26388
8853B157813m00699k71124k00129j35927r7182n4916n4230r7030n7150o3085q7688
8842F38653j03560n8562j5890j349l4575k1266L024J7094J5726p443k1610m8046
$$ plain form
8830 362196 292702 241912 252118 243710 265791 255667 240538 234262 209933 185504 174090 195397
8818 195397 199110 189446 192829 203213 202531 178341 166061 183379 196257 173748 176749 176532 170437
8805 170437 180068 199027 180558 173145 167922 145244 145020 161204 140028 127263 133958 120437 106833
8792 106833 119260 122620 96312 98139 98521 112464 121723 114273 87838 74573 105608 128485 134768
8779 134768 134356 122659 107119 113299 120409 119544 136430 143789 129685 144585 185546 184804 164659
8766 164659 154504 143063 122476 111604 104101 95243 73823 94100 111982 109308 91320 98989
8754 98989 106001 76248 82974 111725 106520 88588 87832 75690 38234 46548 80653 107255 125775
8741 125775 97608 83973 97862 93111 57556 77740 92841 96302 120929 103509 75413 70909
$$ packed form
8830C62196o9494n0790J0206q408K2081j0124j5129o276k4329k4429j1414K1307
8818A95397L713r664L383J0384o82k4190j2280J7318J2878k2509L001k17o095
8805A70437R631J8959j8469p413n223k2678k24J6184k1176j2765O695j3521j3604
8792A06833J2427L360k6308J827L82J3943R259p450k6435j3265L1035K2877O283
8779A34768m12j1697j5540O180P110q65J6886P359j4104J4900M0961p42k0145
8766A64659j0155j1441k0587j0872p503q858k1420K0277J7882k674j7988P669
8754I8989P012k9753O726K8751n205j7932p56j2142l7456Q314L4105K6602J8520
8741A25775k8167j3635J3889m751l5555K0184J5101L461K4627j7420k8096m504
$$ plain form
8729 70909 88354 101504 116763 115767 98444 87295 74497 67218 89432 112450 104305 83683 74032
8716 74032 95679 97948 115933 134377 133006 110359 86524 78850 86283 63649 75338 88465 84139
8703 84139 78555 83582 97658 125042 116532 90150 90401 108898 106045 125321 119187 105753 88647
8690 88647 74600 53493 76059 93811 95234 99049 102579 99053 111868 100998 103527 127670 110608
8677 110608 92359 72144 83485 101167 101979 77295 60709 57876 71330 73184 95868 135162
8665 135162 132830 117153 97566 99908 103804 98015 84523 74338 55457 86200 103894 80944
8653 80944 72483 83574 111520 114691 64419 86915 130159 140575 153655 166442 140164 136684
8641 136684 126137 95325 72424 79878 93376 101008 111709 142587 144467 137797 108985 113979 124179
$$ packed form
8729G0909J7445J3150J5259r96j7323j1149j2798p279K2214K3018q145k0622r651
8716G4032K1647K269J7985J8444j371k2647k3835p674P433k2634J1689J3127m326
8703H4139n584N027J4076K7384q510k6382K51J8497k853J9276o134j3434j7106
8690H8647j4047k1107K2566J7752J423L815L530l526J2815j0870K529K4143j7062
8677A10608j8249k0215J1341J7682Q12k4684j6586k833J3454J854K2684L9294
8665A35162k332j5677j9587K342L896n789j3492j0185j8881L0743J7694k2950
8653H0944q461J1091K7946L171n0272K2496M3244J0416J3080J2787k6278l480
8641A36684j0547l0812k2901P454J3498P632J0701L0878J880o670k8812M994J0200
$$ plain form
8628 124179 129767 149383 146272 130799 115827 98059 96644 85004 99077 111912 103104 90924
8616 90924 85452 86591 98508 94023 86328 102634 103560 138097 139085 137882 124696 130631 116068 89488
8602 89488 120779 142430 137568 146365 149563 176189 205419 227459 238230 244518 252971 250962 277098
8589 277098 348269 396001 398193 408272 397966 438440 459245 503000 551649 579084 575035 546128
8577 546128 511160 449316 416992 380072 325677 279763 273789 268547 235447 185770 169820 157490
8565 157490 130718 102075 88183 87515 103835 79618 62318 65733 78756 86549 101267 91925 107812
8552 107812 117201 104902 73572 39632 53049 54153 23233 -9322 -10674 -935 32925 19392
8540 19392 37991 37876 50276 57895 5340 41565 46039 55787 77036 61408 50592 47975 41755
$$ packed form
8628A24179N588J9616l111j5473j4972j7768j415j1640J4073J2835q808j2180
8616I0924n472J139J1917m485p695J6306R26L4537R88j203j3186N935j4563k6580
8602H9488L1291K1651m862Q797L198K6626K9230K2040J0771O288Q453k009K6136
8589B77098P1171M7732K192J0079j0306M0474K0805M3755M8649K7435m049k8907
8577E46128l4968o1844l2324l6920n4395m5914n974n242l3100m9677j5950j2330
8565A57490k6772k8643j3892o68J6320k4217j7300L415J3023P793J4718r342J5887
8552A07812R389j2299l1330l3940J3417J104l0920l2555j352R739L3860j3533
8540A9392J8599j15J2400P619n2555L6225M474R748K1249j5628j0816k617o220
$$ plain form
8527 41755 24845 78627 119927 122069 140662 136593 102370 77898 70860 67962 55381 44926 58916
8514 58916 54117 61973 51642 34661 17537 28084 28003 24334 6268 626 1180 13059 -13060 -33025
8500 -33025 -21446 4028 4338 -34 -8281 -37737 -30233 -19700 -1667 14665 29963 5897 9448
8487 9448 1982 17399 23115 -687 -12545 -25999 5074 32761 30975 51743 19076 -20427 -9736
8474 -9736 38525 55884 52265 54015 31722 1991 1363 29291 48112 52301 60321 69055 79796
8461 79796 91803 97770 78672 70316 71023 50993 50222 44646 30893 32021 13168 -2729 5618 13406
8447 13406 8713 29216 28193 37375 62564 70211 62924 80166 69944 27092 -5453 29248 47773
8434 47773 49998 38677 30611 24832 56535 96218 102441 85557 76028 64558 40847 39764 42304
$$ packed form
8527D1755j6910N3782M1300K142J8593m069l4223k4472p038k898j2581j0455J3990
8514E8916m799P856j0331j6981j7124J0547q1l669j8066n642N54J1879k6119j9965
8500c3025J1579K5474L10m372q247k9456P504J0533J8033J6332J5298k4066L551
8487I448p466J5417N716k3802j1858j3454L1073K7687j786K0768l2667l9503J0691
8474i736M8261J7359l619J750k2293k9731o28K7928J8821M189Q020Q734J0741
8461G9796J2007N967j9098q356P07k0030p71n576j3753J128j8853j5897Q347P788
8447A3406m693K0503j023R182K5189P647p287J7242j0222m2852l2545L4701J8525
8434D7773K225j1321q066n779L1703L9683O223j6884r529j1470k3711j083K540
$$ plain form
8421 42304 19482 -19990 17971 14126 3870 11359 18823 35381 67532 57176 38046 28600 33948
8408 33948 45674 57442 68438 77246 65652 36068 20658 19138 7899 -15664 -19887 -3776
8396 -3776 -1611 -538 -10153 -15003 -14238 9162 6003 -17130 -28412 -35916 -13973 -601 -2373 -16691
8382 -16691 -26022 -4241 21439 26240 4486 2620 107 -10657 -26879 -6899 15655 33475 52811
8369 52811 44026 3578 -25066 -30698 -40337 -16400 -26805 -36163 92 13254 1517 -6514 -10435
8356 -10435 18075 23258 28528 41687 42906 42166 59380 69860 29622 -3317 -8731 -24686 -4721
8343 -4721 1502 9271 -16538 -9864 11049 12054 -3525 -20697 6690 35542 35673 12754 15272
8330 15272 9477 11044 -8595 -17056 -31173 -34423 -36923 12342 4430 7388 -6707 -10900 4443
$$ packed form
8421D2304k2822l9472L7961l845j0256P489P464J6558L2151j0356j9130r446N348
8408C3948J1726J1768J0996Q808j1594k9584j5410j520j1239k3563m223J6111
8396c776K165J073r615m850P65K3400l159k3133j1282p504K1943J3372j772j4318
8382a6691r331K1781K5680M801k1754j866k513j0764j6222J9980K2554J7820J9336
8369E2811q785m0448k8644n632r639K3937j0405r358L6255J3162j1737q031l921
8356a0435K8510N183N270J3159J219p40J7214J0480m0238l2939n414j5955J9965
8343d721O223P769k5809O674K0913J005j5579j7172K7387K8852J31k2919K518
8330A5272n795J567j9639q461j4117l250k500M9265p912K958j4095m193J5343
$$ plain form
8317 4443 9558 13709 -11738 -28891 -47817 -36957 -24097 -42834 -37333 -29983 -48670 -45243 -19958
8304 -19958 -7274 -11900 -10332 12173 4312 -9012 3289 21553 22314 33976 33807 18867 4266
8291 4266 -6455 -4239 -13087 5030 21678 4203 -17137 11824 8701 6242 -6962 -19652 -17474
8278 -17474 -16368 -9598 -25251 -17897 -7918 -5656 11831 25269 30038 35789 31709 41434 40358 10093
8264 10093 -21679 -5647 -14044 -11198 -7217 -39357 -59437 -34065 18553 11838 6617 8575 22061
8251 22061 31662 21764 10230 -12168 -30389 -29155 -18779 -7913 13874 23878 16402 15166 34800
8238 34800 21880 -10775 -25928 -6002 -5452 -158 -7599 5819 7930 -3448 -10571 -13459 -13774 -2986
8224 -2986 19534 57869 79611 53897 53727 38319 8569 8053 6251 11572 25784 23457 11264
$$ packed form
8317D443N115M151k5447j7153j8926J0860J2860j8737N501P350j8687L427K5285
8304a9958J2684m626J568K2505p861j3324J2301J8264P61J1662j69j4940j4601
8291D266j0721K216q848J8117J6648j7475k1340K8961l123k459j3204j2690K178
8278a7474J106O770j5653P354R979K262J7487J3438M769N751m080R725j076l0265
8264A0093l1772J6032q397K846L981l2140k0080K5372N2618o715n221J958J3486
8251B2061R601r898j1534k2398j8221J234J0376J0866K1787J0004p476j236J9634
8238C4800j2920l2655j5153J9926N50N294p441J3418K111j1378p123k888l15J0788
8224b986K2520L8335K1742k5714j70j5408k9750n16j802N321J4212k327j2193
$$ plain form
8211 11264 19196 38663 28168 31359 23030 -620 4563 -3133 -2782 -37343 -69931 -68184 -40683
8198 -40683 -37024 -26423 -14402 -8696 -9034 -39302 -47584 -44668 -43167 -25782 -5937 -183 -6855 19138
8184 19138 29323 909 -7235 -4873 16072 28728 2310 -1966 2249 -3729 -5393 26231 67820
8171 67820 79796 48922 41017 49554 27381 -10436 -22603 -2015 9032 5336 3737 -6507 -24455
8158 -24455 10118 16459 2456 1757 -9897 -31418 -23347 -12519 6951 4827 -4235 15588 17150
8145 17150 35918 44395 27128 9007 5732 6060 1939 13144 10292 28194 24274 35063 51577
8132 51577 65280 69775 57839 39671 18375 17204 41943 56302 28347 -6186 12516 39112
8120 39112 29301 30771 39116 33019 13046 -3083 -10425 10915 31405 58759 58531 48611 48751 55410
$$ packed form
8211A1264P932J9467j0495L191q329k3650N183p696L51l4561l2588J747K7501
8198d0683L659J0601J2021N706l38l0268q282K916J501J7385J9845N754o672K5993
8184A9138J0185k8414q144K362K0945J2656k6418m276M215n978j664L1624M1589
8171F7820J1976l0874p905Q537k2173l7817j2167K0588J1047l696j599j0244j7948
8158b4455L4573O341j4003o99j1654k1521Q071J0828J9470k124r062J9823J562
8145A7150J8768Q477j7267j8121l275L28m121J1205k852J7902l920J0789J6514
8132E1577J3703M495j1936j8168k1296j171K4739J4359k7955l4533J8702K6596
8120C9112r811J470Q345o097j9973j6129p342K1340K0490K7354k28r920J40O659
$$ plain form
8106 55410 42021 26723 9893 40752 34437 19002 26328 26438 34242 40786 5944 3822 10441
8093 10441 21040 19911 50286 34209 5728 39938 39618 -1820 3276 5988 1057 -13071 4017
8080 4017 3830 -8801 -9657 -30269 -41899 -53704 -49185 -27329 -8458 18694 33036 17937 14391
8067 14391 25336 24094 30040 -59 -15409 3712 28293 38856 35353 27714 17558 16576 23664
8054 23664 30446 28292 27966 44471 21915 -4042 19390 21218 12134 19545 11924 18883 27077 21548
8040 21548 7330 31312 46136 60535 48500 28164 20119 15044 56362 27952 26051 63109
8028 63109 78131 67564 34053 11909 -8745 -22078 14133 27984 3137 14310 20300 50312
8016 50312 39349 22301 3352 11504 37307 33069 47510 46949 29089 24872 9800 -13127 -21686
$$ packed form
8106E5410j3389j5298j6830L0859o315j5435P326J10P804O544l4842k122O619
8093A0441J0599j129L0375j6077k8481L4210l20m1438N096K712m931j4128J7088
8080D017j87j2631q56k0612j1630j1805M519K1856J8871K7152J4342j5099l546
8067A4391J0945j242N946l0099j5350J9121K4581J0563l503p639j0156r82P088
8054B3664O782k154l26J6505k2556k5957K3432J828r084P411p621O959Q194n529
8040B1548j4218K3982J4824J4399j2035k0336q045n075M1318k8410j901L7058
8028F3109J5022j0567l3511k2144k0654j3333L6211J3851k4847J1173N990L0012
8016E0312j0963j7048j8949Q152K5803m238J4441n61j7860m217j5072k2927q559
$$ plain form
8003 -21686 21311 15755 -6153 3819 7273 24721 14956 8072 29269 34588 47745 49163 48701 68753
7989 68753 91396 86755 97432 119973 125187 109581 111289 103583 88167 90316 65606 43811 22618
7976 22618 15523 53811 57536 16730 -24171 -3064 17371 34811 26112 17357 17576 16241 11602
7963 11602 31528 65673 74721 68593 57587 65008 72468 60717 59617 58639 79848 59925 40233
7950 40233 38413 57220 72961 93354 93916 93696 95126 72879 58777 47266 57165 59713 91259
7937 91259 94438 79688 65644 57023 72018 64871 67180 45170 58342 63850 59626 86727 88823
7924 88823 82476 53059 27547 1855 -24344 -16414 16483 30793 35313 22478 24147 6412 17562
7911 17562 32039 58298 53693 34905 17816 21408 47024 45641 16182 429 24273 33918 27467
$$ packed form
8003b1686M2997n556k1908R972L454J7448r765o884K1197N319J3157J418m62K0052
7989F8753K2643m641J0677K2541N214j5606J708p706j5416K149k4710k1795k1193
7976B2618p095L8288L725m0806m0901K1107K0435J7440q699q755K19j335m639
7963A1602J9926L4145R048o128j1006P421P460j1751j100r78K1209j9923j9692
7950D0233j820J8807J5741K0393N62k20J430k2247j4102j1511R899K548L1546
7937I1259L179j4750j4044q621J4995p147K309k2010J3172N508m224K7101K096
7924H8823o347k9417k5512k5692k6199P930L2897J4310M520j2835J669j7735J1150
7911A7562J4477K6259m605j8788j7089L592K5616j383k9459j5753K3844R645o451
$$ plain form
7898 27467 19119 22639 11942 24041 42457 23183 -1315 15624 16740 25835 29060 42517 47683
7885 47683 31573 32249 5836 -21147 -974 26785 50417 48502 43348 29636 26194 37170 22074
7872 22074 13154 17280 -14 -704 3982 27382 8206 -7173 3640 15596 9890 4898 4149 -26115
7858 -26115 -34732 -26330 1198 22362 23964 13941 19262 6306 -15470 -6561 29864 16475 16081
7845 16081 37899 16856 -5231 -7492 -28558 -56112 -47173 -38548 -16246 -22988 -8211 2927 15467
7832 15467 15222 15251 33150 19746 9732 -12167 -6647 4048 36135 42936 21066 -467 -3838
7819 -3838 11889 7549 15920 5491 -18928 -12850 -10848 -11881 -20712 -27470 -19276 -30930 -59924 -71087
7805 -71087 -60689 -19087 -1142 205 -15071 -22439 -441 8653 -6192 -20724 -21555 -6614 -16454
$$ packed form
7898B7467q348L520j0697J2099J8416j9274k4498J6939J116R095L225J3457N166
7885D7683j6110O76k6413k6983K0173K7759K3632j915n154j3712l442J0976j5096
7872B2074q920M126j7294o90M686K3400j9176j5379J0813J1956n706m992p49l0264
7858b6115q617Q402K7528K1164J602j0023N321j2956k1776Q909L6425j3389l94
7845A6081K1818k1043k2087k261k1066k7554Q939Q625K2302o742J4777J1138J2540
7832A5467k45K9J7899j3404j0014k1899N520J0695L2087O801k1870k1533l371
7819c838J5727m340Q371j0429k4419O078K002j033q831o758Q194j1654k8994j1163
7805g1087J0398M1602J7945J347j5276p368K1998R094j4845j4532q31J4941r840
$$ plain form
7792 -16454 -34002 -34209 11666 25545 1283 -15799 -40305 -59140 -48984 -29591 -9013 4410
7780 4410 -9795 -32043 -35334 -37971 -20743 -26616 -77320 -74703 -25274 -12298 -15359 -34932 -38619
7767 -38619 -45953 -35304 -10865 -25956 -52616 -51745 -28771 -20670 -22653 -25334 -26092 -8357 -36843
7754 -36843 -31331 10605 -5760 -37843 -13944 9221 37425 39866 37503 33683 11037 6268 -7380
7741 -7380 -13482 -5299 -311 -2682 -12169 3488 13040 -10374 -21327 -29559 -24345 -3186 18295 17802
7727 17802 -6376 -29796 -14191 -13126 -4603 -2246 -17817 -14512 -1868 24124 21811 -8137 -17776
7714 -17776 -12624 6197 -7391 -49318 -52946 -62745 -75043 -46615 -46902 -35380 -34585 -7772 -5004
7701 -5004 -5096 -7912 -374 19662 10291 -5235 -34530 -41373 -32530 -42604 -11334 27237 12710 -15891
$$ packed form
7792a6454j7548k07M5875J3879k4262j7082k4506j8835J0156J9393K0578J3423
7780D410j4205k2248l291k637J7228n873n0704K617M9429J2976l061j9573l687
7767c8619p334J0649K4439j5091k6660Q71K2974Q101j983k681p58J7735k8486
7754c6843N512M1936j6365l2083K3899K3165K8204K441k363l820k2646m769j3648
7741g380o102Q183M988k371r487J5657R552k3414j0953q232N214K1159K1481m93
7727A7802k4178k3420J5605J065Q523K357j5571L305J2644K5992k313k9948r639
7714a7776N152J8821j3588m1927l628r799j2298K8428k87J1522P95K6813K768
7701e004r2k816P538K0036r371j5526k9295o843Q843j0074L1270L8571j4527k8601
$$ plain form
7687 -15891 -27129 -31329 -28736 -27282 -26808 -20098 -2419 12593 -3129 -16621 -9614 13485 10731
7674 10731 13403 39115 31753 -8396 -23791 -7701 -1002 267 3187 -1804 7663 30563 48820
7661 48820 34677 10178 1316 -2012 -22542 -35640 -36983 -31597 -14808 29659 43948 30792 13384
7648 13384 12579 11826 -3649 4324 17091 22698 13764 -311 -2643 214 11127 9298 -1484 -14762
7634 -14762 -1433 -24294 -29186 -41291 -51636 -26512 -26353 2056 17957 6741 16510 6772 -17981
7621 -17981 -22931 -51007 -45275 -38222 2861 19213 17814 40488 64665 45683 30826 21464 -9753
7608 -9753 -8289 -14512 -8728 -7851 -6200 37236 64372 74397 46779 29926 13103 12224 45011 19532
7594 19532 -3797 -26523 -35883 -48841 -39767 -45473 -37073 -20990 -26251 -38901 -45818 -63515 -50078
$$ packed form
7687a5891j1238m200K593J454M74O710J7679J5012j5722j3492P007K3099k754
7674A0731K672K5712p362m0149j5395J6090O699J269K920m991R467K2900J8257
7661D8820j4143k4499q862l328k0530j3098j343N386J6789M4467J4289j3156j7408
7648A3384q05p53j5475P973J2767N607q934j4075k332K857J0913j829j0782j3278
7634a4762J3329k2861m892j2105j0345K5124J59K8409J5901j1216R769r738k4753
7621a7981m950k8076N732P053M1083J6352j399K2674K4177j8982j4857r362l1217
7608i753J464o223N784Q77J651M3436K7136J0025k7618j6853j6823q79L2787k5479
7594A9532k3329k2726r360j2958R074n706Q400J6083n261j2650o917j7697J3437
$$ plain form
7581 -50078 -58655 -60786 -45404 -27694 -34933 -25906 -13506 -4741 -8158 -21515 -24732 -47657 -43225
7568 -43225 -48561 -36809 -48807 -84121 -88068 -55039 -46014 -27732 1593 -10564 4626 5419 5895
7555 5895 13348 -15579 -11230 -9535 -29980 -76771 -69472 -41569 -34278 -28200 -21682 -23906 -23123 -42401
7541 -42401 -47445 -39075 -34458 -5241 -16655 -11121 1061 -5821 -19229 4622 -4822 -18048 12040
7528 12040 14316 -1864 -40048 -47976 -25981 -20599 -42011 -43641 -15490 -30603 -41509 -43846 -54006
7515 -54006 -53924 -25441 -11779 -38332 -49910 -34609 -26822 -4196 18819 10489 -11455 -4017 -5067
7502 -5067 -13613 7153 -7163 -11331 16457 19153 32114 25662 36434 30954 7638 -18193 -21947
7489 -21947 -33035 -51754 -55171 -18321 -25648 -5154 -2372 4692 -3301 4414 -19144 -36216 -17294
$$ packed form
7581e0078q577k131J5382J7710p239R027J2400Q765l417j3357l217k2925M432
7568d3225n336J1752j1998l5314l947L3029R025J8282K9325j2157J5190P93M76
7555E895P453k8927M349J695k0445m6791P299K7903P291O078O518k224P83j9278
7541d2401n044Q370M617K9217j1414N534J2182o882j3408K3851r444j3226L0088
7528A2040K276j6180l8184p928K1995N382k1412j630K8151j5113j0906k337j0160
7515e4006Q2K8483J3662k6553j1578J5301P787K2626K3015q330k1944P438j050
7502e067q546K0766j4316m168K7788K696J2961o452J0772n480k3316k5831l754
7489b1947j1088j8719l417L6850p327K0494K782P064p993P715k3558j7072J8922
$$ plain form
7476 -17294 -19428 -43709 -57488 -32119 -23330 -2716 17275 12058 1214 -26761 -18638 -3835 8854
7463 8854 10702 21662 14575 14254 -16352 -22645 -25738 -14809 -33867 -58282 -56719 -33586 -21181
7450 -21181 -12127 -24986 -30213 -22632 -11490 -4923 490 -24829 -35962 -45464 -74905 -73477 -55618
7437 -55618 -23636 5555 18866 -11537 -15141 -12032 -23608 -17750 -20410 3080 12962 -10566 -21899
7424 -21899 -37832 -51029 -37809 -11586 -35858 -59266 -28603 -24705 -27006 -24878 -17782 -22175 -41282
7411 -41282 -35890 -25865 -26137 -27730 -41052 -48653 -42895 -30553 -23927 1857 20400 29057 -10102
7398 -10102 -6480 -9198 -25376 -39876 -48756 -49369 -56206 -72561 -83083 -51298 -25158 -20497 1878
7385 1878 6655 -5762 -40910 -54524 -52845 -48538 -38732 -55981 -43459 -39643 -47163 -33557 -18901
$$ packed form
7476a7294k134k4281j3779K5369Q789K0614J9991n217j0844k7975Q123J4803J2689
7463H854J848J0960p087l21l0606o293l093J0929j9058k4415J563K3133J2405
7450b1181R054j2859n227P581J1142O567N413k5319j1133r502k9441J428J7859
7437e5618L1982K9191J3311l0403l604L109j1576N858k660K3490R882k3528j1333
7424b1899j5933j3197J3220K6223k4272k3408L0663L898k301K128P096m393j9107
7411d1282N392J0025k72j593j3322p601N758J2342O626K5784J8543Q657l9159
7398a0102L622k718j6178j4500q880o13o837j6355j0522L1785K6140M661K2375
7385A878M777j2417l5148j3614J679M307R806j7249J2522L816p520J3606J4656
$$ plain form
7372 -18901 14574 21674 -10010 -12352 -2894 4133 -21813 -44434 -18897 -5583 -17389 -33031 -48282
7359 -48282 -41488 -42699 -38465 -51515 -50410 -15591 -1112 13592 8375 -24743 -54120 -54098 -35988
7346 -35988 -29911 -45048 -30052 -6626 -27989 -34767 -38094 -32978 -36201 -5386 8753 -7337 4064
7333 4064 1830 19847 16686 14863 -491 -30037 -60565 -63716 -70860 -76818 -46481 -47136 -45961 -22784
7319 -22784 -32574 -12941 2071 -5239 11579 32612 7221 -29262 -56463 -52407 -29653 -29511 -25063
7306 -25063 -13291 -7231 -18454 -19847 -16027 -5574 -22085 -46734 -30540 -40511 -26688 -3500 -22719
7293 -22719 -24819 5265 -42672 -36210 -5046 -1164 -29547 -38763 -29716 -38021 -33283 -4636 12246
7280 12246 -3804 -14491 -8619 -20909 -22659 3149 25073 25284 42892 41083 12241 -10524 -28124
$$ packed form
7372a8901L3475P100l1684k342R458P027k5946k2621K5537J3314j1806j5642j5251
7359d8282O794j211M234j3050J105L4819J4479J4704n217l3118k9377K2J8110
7346c5988O077j5137J4996K3426k1363o778l327N116l223L0815J4139j6090J1401
7333D064k234J8017l161j823j5354k9546l0528l151p144n958L0337o55J175K3177
7319b2784r790J9633J5012p310J6818K1033k5391l6483k7201M056K2754J42M448
7306b5063J1772O060j1223j393L820J0453j6511k4649J6194r971J3823K3188j9219
7293b2719k100L0084m7937O462L1164L882k8383r216R047q305M738K8647J6882
7280A2246j6050j0687N872j2290j750K5808K1924K11J7608j809k8842k2765j7600
$$ plain form
7267 -28124 -1328 -3967 -14168 -10219 -43179 -37418 -26233 -34072 -32117 -37645 -40893 -56234 -61211
7254 -61211 -41920 -40682 -16885 -4634 -12004 -13684 -8802 -15012 -10293 -11299 -25334 -10242 2855
7241 2855 1273 -12402 24171 5731 -22041 -13663 -12476 -5833 -8048 -31461 -30950 -51597 -46992 -53031
7227 -53031 -63338 -61830 -57395 -41277 -40410 -41907 -65441 -62155 -56446 -55440 -51858 -34336 -18853 -7536
7213 -7536 2787 -14747 -27265 -36581 -28712 -46077 -65166 -68298 -56924 -42587 -9732 -16784 -14980
7200 -14980 -12524 -18606 -10782 19759 10911 -2577 -14880 6304 34372 45612 4924 -5031 -28721
7187 -28721 -76997 -84373 -56851 144 42858 56946 15691 -9888 -21114 -14649 -944 828
7175 828 3071 -10067 -13379 1216 3098 -28014 -36502 -10270 -6376 -5694 -1030 2253 -835 -9068
$$ packed form
7267b8124K6796k639j0201L949l2960N761J1185p839J955n528l248j5341m977
7254f1211J9291J238K3797J2251p370j680M882o210M719j006j4035J5092J3097
7241B855j582j3675L6573j8440k7772Q378J187O643k215k3413N11k0647M605o039
7227e3031j0307J508M435J6118Q67j497k3534L286N709J006L582J7522J5483J1317
7213g536J0323j7534j2518r316P869j7365j9089l132J1374J4337L2855p052J804
7200a4980K456o082P824L0541q848j3488j2303K1184K8068J1240m0688r955k3690
7187b8721m8276p376K7522N6995M2714J4088m1255k5579j1226O465J3705J772
7175H28K243j3138l312J4595J882l1112q488K6232L894O82M664L283l088q233
$$ plain form
7161 -9068 12521 27101 13116 17844 2415 -7678 -5131 -13225 -40618 -32879 -15378 -8958 -18463
7148 -18463 -33502 -42747 -60408 -41719 -26102 -257 -10538 -19420 -41282 -27056 8200 41863
7136 41863 32132 23715 38571 46972 32135 -11755 -31188 -7594 23486 17616 25187 25099 -2797
7123 -2797 -18860 -23113 -23930 -29673 11991 12142 14501 -15860 -30549 -41648 -35964 -30943 -22360 2697
7109 2697 17873 38898 38544 13118 -15060 -14348 -10893 14929 -1172 -15693 -12289 -1272 7009
7096 7009 10484 13936 9569 -6406 -3061 -10895 -1961 17538 22179 8475 -17075 -24207 -21190 -34368
7082 -34368 -62199 -48218 -20776 26121 23721 -6516 -37802 -61780 -35319 -20049 -27413 -71775
7070 -71775 -102781 -100457 -93113 -93618 -109671 -104539 -91975 -78957 -81547 -56260 -22241 -19787 -26414
$$ packed form
7161i068K1589J4580j3985M728j5429j0093K547q094k7393P739J7501O420r505
7148a8463j5039r245j7661J8689J5617K5845j0281q882k1862J4226L5256L3663
7136D1863r731q417J4856Q401j4837m3890j9433K3594L1080n870P571q8k7896
7123b797j6063m253q17n743M1664J51K359l0361j4689j1099N684N021Q583K5057
7109B697J5176K1025l54k5426k8178P12L455K5822j6101j4521L404J1017Q281
7096G009L475L452m367j5975L345p834Q934J9499M641j3704k5550p132L017j3178
7082c4368k7831J3981K7442M6897k400l0237l1286k3978K6461J5270p364m4362
7070g1775l1006K324P344n05j6053N132J2564J3018k590K5287L4019K454o627
$$ plain form
7057 -26414 -24181 -31189 -25386 -5636 2622 26557 9177 3600 1103 -12297 -27454 -17234 -9534
7044 -9534 -19216 -6783 -23499 -20071 -27624 -33845 -44272 -36881 -15331 -5852 -21639 -12702 -5313 -2685
7030 -2685 6647 -3899 22173 41195 22297 3569 778 24840 23822 4784 -4275 14303 4782
7017 4782 -24398 -28662 -24163 -22090 -10009 -18823 -28048 -18172 13652 29002 39614 36978 31834 25268
7003 25268 362 -2237 6399 3376 5873 30933 37256 32394 15868 14235 11696 544 34468
6990 34468 37515 12141 19728 32518 14603 1101 13785 44685 26036 17272 -14426 -14918 -26365
6977 -26365 -52564 -75582 -71876 -64181 -26083 2464 5953 2138 -4885 -13938 5139 1717 -510
6964 -510 372 -2217 16422 37647 24502 9971 24545 29846 12691 -6265 -13827 -28006 -37145
$$ packed form
7057b6414K233p008N803J9750Q258K3935j7380n577k497j3400j5157J0220P700
7044i534r682J2433j6716L428p553o221j0427P391K1550R479j5787Q937P389K628
7030b685R332j0546K6072J9022j8898j8728k791K4062j018j9038r059J8578r521
7017D782k9180m264M499K073J2081q814r225R876L1824J5350J0612k636n144o566
7003B5268k4906k599Q636l023K497K5060O323m862j6526j633k539j1152L3924
6990C4468L047k5374P587J2790j7915j3502J2684L0900j8649q764l1698m92j1447
6977b6365k6199k3018L706P695L8098K8547L489l815p023r053J9077l422k227
6964e10Q82k589J8639K1225j3145j4531J4574N301j7155j8956p562j4179r139
$$ plain form
6951 -37145 -49586 -42209 -35935 -23696 -47727 -38428 5266 11666 1226 5763 -3543 5052 -782
6938 -782 7545 20747 17583 20944 16019 29669 31445 29463 32498 49054 34734 -3554 -22690 -11066
6924 -11066 -19325 -10096 37255 39637 25129 19811 10592 -2400 -20218 -29064 -14744 15530 27296
6911 27296 12074 -5695 -2685 -32612 -36243 -52280 -37973 -18443 7625 5321 -8111 14792
6899 14792 17346 22116 24356 11230 -6249 -33240 -59962 -79030 -71247 -51006 -48052 -34010 -3119
6886 -3119 -13591 -21202 -15341 -23087 -2371 12732 27067 35848 35394 11021 43474 50333 1617
6873 1617 -10830 -8850 -13529 -12215 -14267 -7133 -4674 -14403 16533 20755 -9370 1798 17178 -15099
6859 -15099 720 -17869 -29476 -30524 -42635 -46731 -34942 -3024 11146 15640 33113 22550
$$ packed form
6951c7145j2441P377O274J2239k4031R299M3694O400j0440M537r306Q595n834
6938g82Q327J3202l164L361m925J3650J776j982L035J6556j4320l8288j9136J1624
6924a1066q259R229M7351K382j4508n318r219j2992j7818q846J4320L0274J1766
6911B7296j5222j7769L010k9927l631j6037J4307J9530K6068k304j3432K2903
6899A4792K554M770K240j3126j7479k6991k6722j9068P783K0241K954J4042L0891
6886c119j0472p611N861p746K0716J5103J4335Q781m54k4373L2453O859m8716
6873A617j2447J980m679J314k052P134K459r729L0936M222l0125J1168J5380l2277
6859a5099J5819j8589j1607j048j2111m096J1789L1918J4170M494J7473j0563
$$ plain form
6847 22550 8058 -23705 -18803 -29313 -12414 4366 22789 29859 40639 56476 35220 15719
6835 15719 -7439 -10288 -16363 -30994 -38108 2853 492 -1135 -12366 -25737 -34103 -15383 11046
6822 11046 6332 27526 6648 -27688 -52672 -58807 -46982 -35354 2773 -6083 -16289 -33137
6810 -33137 -19539 -14225 -5216 5626 -8187 -8704 -13883 -5320 196 13967 29258 -9391 -1348
6797 -1348 39240 41369 23967 5035 15203 36122 33834 8129 1879 -9037 -18608 -13827 11203
6784 11203 6390 -5110 3213 -10935 -22574 6011 9484 3425 -7623 -17052 3427 53465 49008
6771 49008 -1865 -17661 -32635 -3543 8817 -13654 -5039 18131 3999 -16372 -36516 -49327
6759 -49327 -18736 -15809 -21806 -19132 -19433 -12119 -32166 -47166 -32971 7080 9557 -7067 -14385
$$ packed form
6847B2550j4492l1763M902j0510J6899J6780J8423P070J0780J5837k1256j9501
6835A5719k3158k849o075j4631p114M0961k361j627j1231j3371q366J8720K6429
6822A1046m714K1194k0878l4336k4984o135J1825J1628L8127q856j0206j6848
6810c3137J3598N314R009J0842j3813n17n179Q563N516J3771J5291l8649Q043
6797a348M0588K129j7402j8932J0168K0919k288k5705o250j0916r571M781K5030
6784A1203m813j1500Q323j4148j1639K8585L473o059j1048r429K0479N0038m457
6771D9008n0873j5796j4974K9092J2360k2471Q615K3170j4132k0371k0144j2811
6759d9327L0591K927n997K674l01P314k0047j5000J4195M0051K477j6624p318
$$ [...]
##END NTUPLES=NMR SPECTRUM
##END=
