##TITLE=Analysis number 319227
Compound Code cc 38346
Book Reference 468/65
Project Code adrs
Chemist Name colinb
##JCAMPDX= 6.0         $$ Bruker NMR JCAMP-DX V2.0
##DATA TYPE= NMR SPECTRUM
##DATA CLASS= NTUPLES
##ORIGIN= Bruker BioSpin GmbH
##OWNER= nmr
$$ XWIN-NMR		Version 3.5
$$ Thu May  4 13:33:08 2006 GMT Daylight Time (UT+1h)  MAYBRIDGE\nmr@NMR_250MHZ
##.OBSERVE FREQUENCY= 250.131544655141
##.OBSERVE NUCLEUS= ^1H
##.ACQUISITION MODE= SIMULTANEOUS (DQD)
##.ACQUISITION SCHEME= undefined
##.AVERAGES= 16
##.DIGITISER RES= 18
##SPECTROMETER/DATA SYSTEM= dpx250
##.PULSE SEQUENCE= zg30
##.SOLVENT NAME= CDCl3
##.SHIFT REFERENCE= (INTERNAL, CDCl3, 0, 16.522)
##AUDIT TRAIL= $$ (NUMBER, WHEN, WHO, WHERE, WHAT)
$$ ##TITLE= Audit trail, XWIN-NMR		Version 3.5
$$ ##JCAMPDX= 5.01
$$ ##ORIGIN= Bruker BioSpin GmbH
$$ ##OWNER= nmr
$$ C:\u/data/dgb/nmr/ADRS/3810/pdata/1/auditp.txt
$$ ##AUDIT TRAIL=  $$ (NUMBER, WHEN, WHO, WHERE, WHAT)
(   1,<2006-05-04 13:32:23.77 +100>,<MAYBRIDGE\nmr>,<NMR_250MHZ>,
      <created by zg, POWCHK disabled, PULCHK disabled
       configuration hash MD5:
       84 BC 41 DB A1 6E 1D 46 DA 25 12 A5 C1 ED C5 3A
       data hash MD5: 64K
       08 91 EA 09 4B 20 58 F8 21 E4 84 57 20 05 66 2E>)
(   2,<2006-05-04 13:32:37.63 +100>,<MAYBRIDGE\nmr>,<NMR_250MHZ>,
      <Start of raw data processing
       ef LB = 0.3 FT_mod = 6 PKNL = 1 SI = 32K 
       data hash MD5: 32K
       B8 60 12 10 82 AB 14 97 4E 53 4B 54 93 74 DA 8F>)
(   3,<2006-05-04 13:32:39.39 +100>,<MAYBRIDGE\nmr>,<NMR_250MHZ>,
      <apk 
       data hash MD5: 32K
       5D 09 E1 42 C6 CC 91 08 5B 95 0B BB 9B 96 A8 54>)
(   4,<2006-05-04 13:32:40.25 +100>,<MAYBRIDGE\nmr>,<NMR_250MHZ>,
      <abs ABSG = 5 
       data hash MD5: 32K
       6C A6 61 FE C7 CF 4D 7A D3 A8 DA 66 B4 94 1D 7C>)
$$ ##END=
$$ 
$$ hash MD5
$$ BF C7 55 8E B6 AF 0F 7F 6F 9C F9 11 3B CA BA 3D
##$RELAX= 
##$RELAX= 
##$RELAX= 
##$RELAX= 
##$RELAX= 
##$RELAX= 
##$RELAX= 
$$ Bruker specific parameters
$$ --------------------------
##$DU= <C:\u>
##$EXPNO= 3810
##$NAME= <ADRS>
##$PROCNO= 1
##$TYPE= <nmr>
##$USER= <dgb>
##$AMP= (0..31)
100 100 100 100 100 100 100 100 100 100 100 100 100 100 100 100 100 100 
100 100 100 100 100 100 100 100 100 100 100 100 100 100 
##$AQSEQ= 0
##$AQ_mod= 3
##$AUNM= <au_zg>
##$AUTOPOS= <35 >
##$BF1= 250.13
##$BF2= 250.13
##$BF3= 250.13
##$BF4= 250.13
##$BF5= 500.13
##$BF6= 500.13
##$BF7= 500.13
##$BF8= 500.13
##$BYTORDA= 1
##$CFDGTYP= 0
##$CFRGTYP= 5
##$CHEMSTR= <none>
##$CNST= (0..31)
1 1 145 1 1 1 1 1 1 1 1 1 1 1 1 1 1 1 1 1 1 1 1 1 1 1 1 1 1 1 1 1 
##$CPDPRG= <>
##$CPDPRG1= <>
##$CPDPRG2= <>
##$CPDPRG3= <>
##$CPDPRG4= <mlev>
##$CPDPRG5= <mlev>
##$CPDPRG6= <mlev>
##$CPDPRG7= <mlev>
##$CPDPRG8= <mlev>
##$CPDPRGB= <>
##$CPDPRGT= <>
##$D= (0..31)
0 1 0 0 0 0 0 0 0 0.06 0 0 0 0 0 0 0.0002 0 0 0 0 0 0 0 0 0 0 0 0 0 0 
0 
##$DATE= 1146745942
##$DBL= (0..7)
120 120 120 120 120 120 120 120 
##$DBP= (0..7)
150 150 150 150 150 150 150 150 
##$DBP07= 0
##$DBPNAM0= <>
##$DBPNAM1= <>
$$ [...]
##$SUBNAM7= <"">
##$SUBNAM8= <"">
##$SUBNAM9= <"">
##$SW= 20.6930455092707
##$SWIBOX= (0..15)
0 0 3 0 0 0 0 0 0 0 0 0 0 0 0 0 
##$SW_h= 5175.983436853
##$TD= 65536
##$TD0= 1
##$TE= 295.16
##$TE2= 300
##$TE3= 300
##$TEG= 300
##$TL= (0..7)
0 120 120 120 120 120 120 120 
##$TP= (0..7)
150 150 150 150 150 150 150 150 
##$TP07= 0
##$TPNAME0= <>
##$TPNAME1= <>
##$TPNAME2= <>
##$TPNAME3= <>
##$TPNAME4= <>
##$TPNAME5= <>
##$TPNAME6= <>
##$TPNAME7= <>
##$TPOAL= (0..7)
0.5 0.5 0.5 0.5 0.5 0.5 0.5 0.5 
##$TPOFFS= (0..7)
0 0 0 0 0 0 0 0 
##$TUNHIN= 0
##$TUNHOUT= 0
##$TUNXOUT= 0
##$USERA1= <user>
##$USERA2= <user>
##$USERA3= <user>
##$USERA4= <user>
##$USERA5= <user>
##$V9= 5
##$VALIST= <valist>
##$VCLIST= <CCCCCCCCCCCCCCC>
##$VD= 0
##$VDLIST= <DDDDDDDDDDDDDDD>
##$VPLIST= <PPPPPPPPPPPPPPP>
##$VTLIST= <TTTTTTTTTTTTTTT>
##$WBST= 1024
##$WBSW= 4
##$XGAIN= (0..3)
0 0 0 0 
##$XL= 0
##$YL= 0
##$YMAX_a= 367891
##$YMIN_a= -568300
##$ZGOPTNS= <>
##$ZL1= 120
##$ZL2= 120
##$ZL3= 120
##$ZL4= 120
##$ABSF1= 16.522
##$ABSF2= -4.171173
##$ABSG= 5
##$ABSL= 3
##$ALPHA= 0
##$AQORDER= 0
##$ASSFAC= 0
##$ASSFACI= 0
##$ASSFACX= 0
##$ASSWID= 0
##$AUNMP= <proc_1d>
##$AZFE= 0.1
##$AZFW= 0.1
##$BCFW= 0
##$BC_mod= 0
##$BYTORDP= 0
##$COROFFS= 0
##$CY= 12.5
##$DATMOD= 1
##$DC= 0
##$DFILT= <>
##$DTYPP= 0
##$F1P= 14.0000005364418
##$F2P= -0.99999901652339
##$FCOR= 0.5
##$FTSIZE= 32768
##$FT_mod= 6
##$GAMMA= 0
##$GB= 0
##$INTBC= 1
##$INTSCL= 1
##$ISEN= 128
##$LB= 0.3
##$LEV0= 0
##$LPBIN= 0
##$MAXI= 10000
##$MC2= 0
##$MEAN= 0
##$ME_mod= 0
##$MI= 0
##$NCOEF= 0
##$NC_proc= -4
##$NLEV= 6
##$NOISF1= 0
##$NOISF2= 0
##$NSP= 0
##$NTH_PI= 0
##$NZP= 0
##$OFFSET= 16.522
##$PC= 1
##$PHC0= 168.1716
##$PHC1= 3.649048
##$PH_mod= 1
##$PKNL= yes
##$PPARMOD= 0
##$PSCAL= 4
##$PSIGN= 0
##$REVERSE= no
##$SF= 250.13
##$SI= 32768
##$SIGF1= 0
##$SIGF2= 0
##$SINO= 400
##$SIOLD= 32768
##$SREGLST= <1H.CDCl3>
##$SSB= 0
##$STSI= 32768
##$STSR= 0
##$SW_p= 5175.98343685301
##$SYMM= 0
##$S_DEV= 0
##$TDeff= 65536
##$TDoff= 0
##$TI= <Analysis number 999999
Compound Code 99
Book Reference 9
Project Code 9>
##$TILT= no
##$TM1= 0
##$TM2= 0
##$TOPLEV= 0
##$USERP1= <user>
##$USERP2= <user>
##$USERP3= <user>
##$USERP4= <user>
##$USERP5= <user>
##$WDW= 1
##$XDIM= 32768
##$YMAX_p= 425775024
##$YMIN_p= -154723
$$ End of Bruker specific parameters
$$ ---------------------------------
##NTUPLES= NMR SPECTRUM
##VAR_NAME=  FREQUENCY,     SPECTRUM/REAL,   SPECTRUM/IMAG
##SYMBOL=    X,             R,               I
##VAR_TYPE=  INDEPENDENT,   DEPENDENT,       DEPENDENT
##VAR_FORM=  AFFN,          ASDF,            ASDF
##VAR_DIM=   32768,         32768,           32768
##UNITS=     HZ,            ARBITRARY UNITS, ARBITRARY UNITS
##FACTOR=    0.157963299565203, 1,           1
##FIRST=     4132.6476996994, 0,             0
##LAST=      -1043.33573715361, 0,           0
##MIN=       -1043.33573715361, -154723,     0
##MAX=       4132.6476996994, 425775024,     0
$$ Real data points
##PAGE= N=1
##DATA TABLE= (X++(R..R)), XYDATA
$$ [...]
$$ plain form
16103 -18182 8907 11523 -25254 -57214 -49090 -44111 -31127 -25484 -16070 26607 29565 65550 27725
16090 27725 -21354 -51993 -36555 -13697 -14826 -41665 -20490 -43515 -48324 -28487 -3170 -2902
16078 -2902 -9429 -3813 7754 36881 -10246 -44892 -52905 -23529 -6757 -19531 -34123 -66782
16066 -66782 -68630 -71317 -60647 -46606 -25111 -34814 -18898 -3838 14110 -13399 23807 31086
16054 31086 38237 28871 16509 -14536 -82667 -80204 -81068 -41713 -65387 -76837 -81912 -80265 -72684
16041 -72684 -68305 -11253 3160 -1024 1147 24264 40153 14914 -24243 -20668 -6055 -11549 -49618
16028 -49618 -40434 -43553 -37634 -39663 -23906 9985 5737 -18827 -22206 -42760 -45404 -2251 35772
16015 35772 69580 84198 45141 -956 -35568 -39774 -45193 -54330 -33802 6535 -199 -11145
$$ packed form
16103a8182K7089K616l6777l1960Q124M979J2984N643R414M2677K958L5985l7825
16090B7725m9079l0639J5438K2858j129k6839K1175k3025m809J9837K5317K68
16078b902o527N616J1567K9127m7127l4646q013K9376J6772j2774j4592l2659
16066f6782j848k687J0670J4041K1495r703J5916J5060J7948k7509L7206P279
16054C1086P151r366j2362l1045o8131K463q64L9355k3674j1450n075J647P581
16041g2684M379N7052J4413m184K171K3117J5889k5239l9157L575J4613n494l8069
16028d9618R184l119N919k029J5757L3891m248k4564l379k0554k644M3153L8023
16015C5772L3808J4618l9057m6097l4612m206n419r137K0528M0337o734j0946
$$ plain form
16003 -11145 -2417 3693 -8234 -15483 12213 40906 31655 55434 40905 23713 4992 7596 -9567
15990 -9567 13545 22512 14914 10925 -21234 -36859 -36652 -35153 -52179 -48020 -47851 -52113 -34538 -67662
15976 -67662 -60145 -28537 -14982 -51415 -71349 -71666 -91475 -53192 -20727 -10073 16836 12074
15964 12074 3621 -12832 -21476 291 26775 40140 2938 -31575 -41850 -24903 -33027 -5876
15952 -5876 20117 7539 -11097 14508 29141 8026 -7960 -24697 7127 -9757 -10839 3975
15940 3975 28333 22132 -12558 -29256 -34034 -33293 -64431 -56689 -46999 -24363 11187 21502 6746
15927 6746 -13972 -16547 -30862 -25409 -7727 -8111 -69865 -47769 -7908 -35092 -49733 -21187 5692
15914 5692 25903 -2407 -38140 -41901 -2842 21529 2 -49049 -51503 -57249 -50164 -38779 -7462
$$ packed form
16003a1145Q728O110j1927p249K7696K8693r251K3779j4529j7192j8721K604j7163
15990i567K3112Q967p598l989l2159j5625K07J499j7026M159J69m262J7575l3124
15976f7662P517L1608J3555l6433j9934l17j9809L8283L2465J0654K6909m762
15964A2074q453j6453q644K1767K6484J3365l7202l4513j0275J6947q124K7151
15952e876K5993j2578j8636K5605J4633k1115j5986j6737L1824j6884j082J4814
15940C975K4358o201l4690j6698m778P41l1138P742R690K2636L5550J0315j4756
15927F746k0718k575j4315N453J7682l84o1754K2096L9861k7184j4641K8546K6879
15914E692K0211k8310l5733l761L9059K4371k1527m9051k454n746P085J1385L1317
$$ plain form
15901 -7462 4372 -63470 -71638 -53908 -56474 -51969 -76947 -64477 4958 34250 30061 4164 -9258
15888 -9258 -9068 28354 57735 64867 25920 12275 15578 41843 12087 -1820 -22138 11131 13606
15875 13606 8127 28144 43976 1583 -34927 -27945 -16322 7955 31256 64467 74862 95980
15863 95980 68331 32422 34555 550 -39250 -35964 -35537 -29660 -23601 -28677 -56161 -20667 21580
15850 21580 8745 13182 28198 30433 -18362 -20551 -35533 -48498 -46334 -60798 -44815 -47396 -12880
15837 -12880 18230 -735 -24798 -69937 -46317 -7039 -10464 -18864 -29847 -56347 -53859 -46205
15825 -46205 -63599 -60340 -41130 -32784 -40204 -39564 -39808 -37093 -34183 -15325 744 -11911 -20973 -23824
15811 -23824 -13235 -46251 -30894 -19946 -58822 -81326 -59296 -3528 15762 -6551 -18307 -8271
$$ packed form
15901g462J1834o7842q168J7730k566M505k4978J2470O9435K9292m189k5897j3422
15888i258J90L7422K9381P132l8947j3645L303K6265k9756j3907k0318L3269K475
15875A3606n479K0017J5832m2393l6510O982J1623K4277K3301L3211J0395K1118
15863I5980k7649l5909K133l4005l9800L286M27N877O059n076k7484L5494M2247
15850B1580j2835M437J5016K235m8795k189j4982j2965K164j4464J5983k581L4516
15837a2880L1110j8965k4063m5139K3620L9278l425q400j0983k6500K488P654
15825d6205j7394L259J9210Q346p420O40k44K715K910J8858J6069j2655r062k851
15811b3824J0589l3016J5357J0948l8876k2504K2030N5768J9290k2313j1756J0036
$$ plain form
15799 -8271 3677 13405 -12168 -3265 17620 19652 -12154 -38584 -54497 -28666 -22136 -21679 -30281
15786 -30281 -19760 25064 43650 37911 -25845 -41632 -18287 -28006 -59822 -69131 -55632 -30497
15774 -30497 -28350 -25023 -23782 -5375 26022 40344 33498 17281 -12721 4959 -567 21853 55723
15761 55723 74346 18207 8241 42662 53656 11827 -36707 -33744 -8841 -32543 -58690 -68116
15749 -68116 -36896 15288 26832 15696 -17995 -17437 -18396 -20473 -12936 -3713 14965 -23567 -32650
15736 -32650 -9880 23858 4624 -32447 -34453 9331 -16295 -9121 -20726 -25122 -25940 -11063 -14353
15723 -14353 4639 38469 58030 46301 33356 55797 44851 11137 -41259 -62605 -71601 -40373
15711 -40373 14735 48828 31702 50412 47551 9703 8565 7337 8764 -6084 -1407 -16795 -35580
$$ packed form
15799h271J1948R728k5573Q903K0885K032l1806k6430j5913K5831O530M57q602
15786c0281J0521M4824J8586n739o3756j5787K3345r719l1816r309J3499K5135
15774c0497K147L327J241J8407L1397J4322o846j6217l0002J7680n526K2420L3870
15761E5723J8623n6139r966L4421J0994m1829m8534K963K4903k3702k6147r426
15749f8116L1220N2184J1544j1136l3691N58r59k077P537R223J8678l8532r083
15736c2650K2770L3738j9234l7071k006M3784k5626P174j1605m396q18J4877l290
15723a4353J8992L3830J9561j1729j2945K2441j0946l3714n2396k1346q996L1228
15711d0373N5108L4093j7126J8710k861l7848j138j228J427j4848M677j5388j8785
$$ plain form
15698 -35580 -55358 -37005 -10541 -30478 -67191 -78298 -7118 31718 44157 19715 -11216 -13386
15686 -13386 -42954 -9933 28819 11547 -5632 -9580 -2996 -6093 -21990 -24771 -34691 -26274 -5669
15673 -5669 -651 -32392 -42708 -28950 -12582 -10817 -19080 -49440 -67436 -36484 -35455 -48994 -93070
15660 -93070 -90045 -55422 -28292 -59969 -62403 -26287 -34147 -28133 -7609 -2013 28024 605 -33428
15647 -33428 -48507 -29992 19448 15823 -11151 -843 8710 28637 15610 15594 -9007 -22617 8335
15634 8335 33994 13177 -10214 -18214 -59161 -103741 -98472 -103378 -66569 -4888 21805 18825 9843
15621 9843 -9163 -47926 -72289 -38715 -52181 -41532 -37530 -30547 -5586 -43616 -45211 -16224
15609 -16224 -50070 -38710 -37695 -69658 -76769 -77029 -69693 -51480 -14533 -9847 15332 29060 85
$$ packed form
15698c5580j9778J8353K6464j9937l6713j1107P1180L8836J2439k4442l0931k170
15686a3386k9568L3021L8752j7272j7179l948O584l097j5897k781r920Q417K0605
15673e669N018l1741j0316J3758J6368J765q263l0360j7996L0952J029j3539m4076
15660i3070L025L4623K7130l1677k434L6116p860O014K0524N596L0037k7419l4033
15647c3428j5079J8515M9440l625k6974J0308R553J9927j3027j6k4601j3610L0952
15634H335K5659k0817k3391q000m0947m4580N269m906L6809O1681K6693k980q982
15621I843j9006l8763k4363L3574j3466J0649M002O983K4961l8030j595K8987
15609a6224l3846J1360J015l1963p111k60P336J8213L6947M686K5179J3728k8975
$$ plain form
15596 85 -33375 -28 23994 4934 -26784 -49025 -52900 -52789 -17872 -18198 -21298 2884 29023
15583 29023 45880 48988 42447 22067 39598 30610 12844 -538 19605 30246 10802 34334
15571 34334 27437 29781 24893 21949 24866 29069 29405 41204 46165 40381 19361 34038 40665 36340
15557 36340 27677 12436 -11188 -8013 -29797 -19357 -28784 4505 26631 34736 50360 69311
15545 69311 71120 22582 -3431 -35651 -52715 -44605 -55632 -86888 -62659 -16036 29643 40139
15533 40139 12252 3788 -940 457 41630 40999 35207 -12583 -34703 -2025 45679 41575 23447
15520 23447 -8530 -30752 -21842 -11239 8771 30627 25553 -2632 -19276 -20333 -21094 17346 6479
15507 6479 -802 25993 39992 63024 45082 24060 -37295 -41004 -23213 -35507 -53395 -67627
$$ packed form
15596H5l3460L3347K4022j9060l1718k2241l875J11L4917l26l100K4182K6139
15583B9023J6857L108o541k0380J7531q988j7766j3382K0143J0641j9444K3532
15571C4334o897K344m888k944K917M203L36J1799M961n784k1020J4677O627m325
15557C6340q663j5241k3624L175k1784J0440r427L3289K2126Q105J5624J8951
15545F9311J809m8538k6013l2220j7064Q110j1027l1256K4229M6623M5679J0496
15533D0139k7887q464m728J397M1173o31n792m7790k2120L2678M7704m104j8128
15520B3447l1977k2222Q910J0603K0010K1856n074k8185j6644j057p61L8440j0867
15507F479p281K6795J3999K3032j7942k1022o1355l709J7791j2294j7888j4232
$$ plain form
15495 -67627 -41224 22107 31714 -12302 -34472 -27807 -55273 -49052 -18564 5761 5677 8221 12741
15482 12741 4925 -475 29071 43524 31546 23483 -8704 -34137 -44654 -26883 -31778 -55351
15470 -55351 -45164 -54308 -42657 -56171 -20695 12970 -1002 -19920 -52769 -20911 -7376 1586
15458 1586 3828 -4381 17205 -19918 -51288 -61279 -44410 -30324 -31337 -29088 -8369 -20379 -16707
15445 -16707 -1470 -24192 -77280 -98028 -107018 -71502 -46665 -33317 -6133 7111 -7921 -38084
15433 -38084 -23686 -4607 -5609 -27615 -31634 -53502 -84069 -82522 -30828 5873 11311 -14331
15421 -14331 -36481 -70014 -40455 -16462 -6524 28315 42815 44902 43286 43723 7338 -15911 -60488
15408 -60488 -78950 -82424 -64681 -17531 -5875 -18663 20181 46221 44222 15389 816 33355
$$ packed form
15495f7627K6403O3331R607m4016k2170O665k7466O221L0488K4325q4K544M520
15482A2741p816n400K9546J4453j1978q063l2187k5433j0517J7771m895k3573
15470e5351J0187r144J1651j3514L5476L3665j3972j8918l2849L1858J3535Q962
15458A586K242q209K1586l7123l1370r991J6869J4086j013K249K0719j2010L672
15445a6707J5237k2722n3088k0748q990L5516K4837J3348K7184J3244j5032l0163
15433c8084J4398J9079j002k2006m019k1868l0567J547N1694L6701N438k5642
15421a4331k2150l3533K9559K3993R938L4839J4500K087j616M37l6385k3249m4577
15408f0488j8462l474J7743M7150J1656j2788L8844K6040j999k8833j4573L2539
$$ plain form
15396 33355 50069 54148 47440 60125 50944 49205 59266 44720 -2966 -34484 -33789 -40306 -34195
15383 -34195 -42760 -45570 -56404 -44418 -14724 18151 32717 11103 -25421 -36781 -15634 -19144
15371 -19144 -1545 8903 -15797 -31113 -3478 14126 27881 -4022 261 4346 7832 3831
15359 3831 -418 -18117 1548 10081 14738 -19868 -43941 -8812 13849 27890 3797 -22106
15347 -22106 -65443 -50041 2082 32231 3307 -27413 -13611 14474 24870 36670 22227 14674
15335 14674 16039 13286 -6020 1130 25985 17698 27780 -6608 -23234 -13267 -1190 16896 32426
15322 32426 30477 9111 -3748 -25736 12668 92727 82431 22794 -7314 -2040 -40028 -60605
15310 -60605 -21051 16959 -16678 -30425 -11785 -502 -30127 -49288 -48454 -6085 33906 -3690
$$ packed form
15396C3355J6714M079o708J2685r181j739J0061j4546m7686l1518O95o517O111
15383c4195q565k810j0834J1986K9694L2875J4566k1614l6524j1360K1147l510
15371a9144J7599J0448k4700j5316K7635J7604J3755l1903M283M085L486m001
15359C831m249j7699J9665Q533M657l4606k4073L5129K2661J4041k4093k5903
15347b2106m3337J5402N2123L0149k8924l0720J3802K8085J0396J1800j4443p553
15335A4674J365k753j9306P150K4855q287J0082l4388j6626R967J2077J8086J5530
15322C2426j949k1366j2859k1988L8404Q0059j0296n9637l0108N274l7988k0577
15310f0605L9554L8010l3637j3747J8640J1283k9625j9161Q34M2369L9991l7596
$$ plain form
15298 -3690 2313 13632 45072 49228 39021 55293 55005 36056 -8124 -4539 19367 13499 -8821
15285 -8821 -20050 -2373 22414 11337 25743 3161 -17254 4435 2951 28927 16286 -11354
15273 -11354 1295 21283 7545 20013 53389 33550 795 -5247 6839 24762 18416 15527
15261 15527 -14148 -43066 -47435 -7977 4798 -20005 -1686 32751 -8610 -35485 -15288 -2226
15249 -2226 3623 -31026 -20790 -7398 10837 -2175 -14971 -139 -4907 -23147 4953 28705
15237 28705 32764 16766 -2721 -25045 -45908 -48722 -42084 -36729 -11162 -25221 -41399 -37818 4050
15224 4050 61304 67396 55888 42659 32319 18379 -32625 -15152 25895 7532 -7113 9629
15212 9629 53889 35730 8109 3605 26060 29792 16804 13125 32028 62458 50946 289
$$ packed form
15298c690O003J1319L1440M156j0207J6272k88j8949m4180L585K3906n868k2320
15285h821j1229J7677K4787j1077J4406k2582k0415K1689j484K5976j2641k7640
15273a1354J2649J9988j3738J2468L3376j9839l2755o042J2086J7923o346k889
15261A5527k9675k8918m369L9458J2775k4803J8319L4437m1361k6875K0197J3062
15249b226N849l4649J0236J3392J8235j3012j2796J4832m768j8240K8100K3752
15237B8705M059j5998j9487k2324k0863k814O638N355K5567j4059j6178L581M1868
15224D050N7254O092j1508j3229j0340j3940n1004J7473M1047j8363j4645J6742
15212I629M4260j8159k7621m504K2455L732j2988l679J8903L0430j1512n0657
$$ plain form
15200 289 2504 28931 8496 -9029 8882 -11128 -3011 -31493 -30964 19311 8265 837 32357
15187 32357 52509 58398 4282 -5421 -8163 -27942 2306 9126 22222 15802 1040 4568 20921
15174 20921 27124 31655 30503 59775 59209 25045 28115 23949 36229 75462 44229 15681 -10958
15161 -10958 -13743 -43968 -60147 -41746 -57253 -36951 -1433 -5333 -21340 -47150 -48607 -54328
15149 -54328 -41143 -9328 -41589 -28972 -19483 -41689 -39980 -30599 4622 21731 35552 39116
15137 39116 41952 67195 16410 -4487 -8711 -5765 -24045 -41314 -59559 -77310 -79622 -96152
15125 -96152 -72099 -8231 2865 -28931 -9392 -3540 19123 42667 57053 61705 28046 1879
15113 1879 -21615 9651 39504 58057 30488 16531 6506 -42552 -40274 11709 1684 -19381
$$ packed form
15200B89K215K6427k0435j7525J7911k0010Q117k8482N29N0275j1046p428L1520
15187C2357K0152N889n4116r703k742j9779L0248O820J3096o420j4762L528J6353
15174B0921O203M531j152K9272n66l4164L070m166J2280L9233l1233k8548k6639
15161a0958k785l0225j6179J8401j5507K0302L5518l900j6007k5810j457n721
15149e4328J3185L1815l2261J2617R489k2206J709R381L5221J7109J3821L564
15137C9116K836K5243n0785k0897m224K946j8280j7269j8245j7751k312j6530
15125i6152K4053O3868J1096l1796J9539N852K2663K3544J4386M652l3659k6167
15113A879k3494L1266K9853J8553k7569j3957j0025m9058K278N1983j0025k1065
$$ plain form
15101 -19381 -23880 -32461 -34183 -37397 3407 51197 40461 4447 -13281 -26580 -41887 -30822
15089 -30822 -9331 -16689 10957 29190 4584 -23065 -32111 -29456 -27516 -46172 -17820 8278
15077 8278 -16750 -29250 -38404 -18835 9395 -2641 -14850 -5055 31908 45173 108 -75030
15065 -75030 -60935 -24696 -20920 -10947 -33234 -68879 -86986 -52451 -72221 -86431 -75543 -47737
15053 -47737 -4528 40122 36615 -13901 20765 44059 -7524 -20079 -23527 9094 12415 44050
15041 44050 50390 36843 62755 76743 55521 51595 26894 14745 20312 28083 59170 49912 42121
15028 42121 33020 51886 44402 10603 -21650 -65545 -66590 -64749 -65767 -60864 -22320 -16599 -1194
15015 -1194 26555 10889 14012 16854 10423 -1879 19314 16017 29577 13688 -4049 -11545 -31259
$$ packed form
15101a9381m499q581j722l214M0804M7790j0736l6014j7728j3299j5307J1065
15089c0822K1491p358K7646J8233k4606k7649r046K655J940j8656K8352K6098
15077H278k5028j2500r154J9569K8230j2036j2209R795L6963J3265m5065p5138
15065g5030J4095L6239L776R973k2287l5645j8107L4535j9770j4210J0888K7806
15053d7737M3209M4650l507n0516L4666K3294n1583j2555l448L2621L321L1635
15041D4050O340j3547K5912J3988k1222l926k4701j2149N567P771L1087r258p791
15028D2121r101J8866p484l3799l2253m3895j045J841j018M903L8544N721J5405
15015a194K7749j5666L123K842o431j2302K1193l297J3560j5889j7737p496j9714
$$ plain form
15002 -31259 -22755 -19330 -7364 -11976 -2359 17497 22482 -10374 -14828 -36001 -23577 22205 35702
14989 35702 -1763 -10753 -11744 -11169 -15617 -15004 -17852 -11815 -34926 -37184 -10834 -6050 -3500 17988
14975 17988 27557 37835 37186 28563 28431 12028 -18467 -26890 14450 6737 10052 4086 -12100 -48464
14961 -48464 -30061 -20700 -34205 -44935 -40651 -29417 -63747 -59684 -62986 -85692 -70239 -50103
14949 -50103 -49490 -33510 -31385 -31357 19706 36199 8739 -40967 -54672 -31253 -27830 -27393 -7168
14936 -7168 27935 43335 67080 82707 69044 73785 65997 53570 29667 19790 -2372 21772
14924 21772 35375 -18018 -16701 -15024 3303 4940 37837 54795 36903 -4239 -2135 21993
14912 21993 13963 23215 41944 40119 48897 18429 -7288 -19967 -15699 -11922 -14250 -41201 -64035
$$ packed form
15002c1259Q504L425J1966m612R617J9856M985l2856m454k1173J2424M5782J3497
14989C5702l7465q990r91N75m448O13k848O037k3111k258K6350M784K550K1488
14975A7988R569J0278o49q623j32j6403l0495q423M1340p713L315n966j6186l6364
14961d8464J8403R361j3505j0730M284J1234l4330M063l302k2706J5453K0136
14949e0103O13J5980K125K8N1063J6493k7460m9706j3705K3419L423M37K0225
14936g168L5103J5400K3745J5627j3663M741p788j2427k3903r877k2162K4144
14924B1772J3603n3393J317J677J8327J637L2897J6958j7892m1142K104K4128
14912B1993q030R252J8729j825Q778l0468k5717j2679M268L777k328k6951k2834
$$ plain form
14899 -64035 -62286 -75063 -36356 -18902 7184 60902 29393 8551 22323 12906 -13621 -32333
14887 -32333 1359 41965 50271 68278 19015 -8700 -13509 -24715 -34919 -18830 23658 29594
14875 29594 -1035 -11897 -4913 -43440 -64313 -47380 -27033 -43187 -73172 -56691 -46754 -34267
14863 -34267 -19920 -2770 7729 -9235 258 128 -21348 -543 11091 20859 58742 46398
14851 46398 -2770 -50894 -29290 20567 28337 16494 14539 20962 10552 -3676 7575 19327
14839 19327 11384 6349 25330 1983 -9431 13573 75518 37326 -3625 -17449 12209 29311
14827 29311 38243 23986 33126 12391 -44416 -29972 859 845 36101 29150 3709 33133 59404
14814 59404 46144 38985 58690 69719 53013 14497 12788 43002 36898 43979 58415 93337
$$ packed form
14899f4035J749j2777L8707J7454K6086N3718l1509k0842J3772r417k6527j8712
14887c2333L3692M0606Q306J8007m9263k7715m809j1206j0204J6089M2488N936
14875B9594l0629j0862O984l8527k0873J6933K0347j6154k9985J6481R937J2487
14863c4267J4347J7150J0499j6964R493j30k1476K0805J1634R768L7883j2344
14851D6398m9168m8124K1604M9857P770j1843j955O423j0410j4228J1251J1752
14839A9327p943n035J8981k3347j1414K3004O1945l8192m0951j3824K9658J7102
14827B9311Q932j4257R140k0735n6807J4444L0831j4L5256o951k5441K9424K6271
14814E9404j3260p159J9705J1029j6706l8516j709L0214o104P081J4436L4922
$$ plain form
14802 93337 103162 71228 10805 -37579 -11182 33151 34770 14291 -12956 -9102 3290 13332
14790 13332 21779 41390 75167 104270 78795 7956 -39444 -50156 -65360 -64954 -77798 -111876
14778 -111876 -59564 5427 21549 -3256 4029 11495 -15748 -41595 -33043 -17997 -8349 -1389
14766 -1389 7811 -29525 -22497 -1973 6798 -7040 -41103 -28675 -15991 -2881 27001 -13932
14754 -13932 -52336 -106085 -64986 -39139 -43897 -58336 -59720 -45239 -33096 -42903 -38298 -17721
14742 -17721 -3490 20754 22577 32899 53954 34543 2173 -12690 -7922 18760 33767 57957
14730 57957 30025 25552 25946 -8733 -1454 -27040 -65689 -65664 -52758 -23679 10898 -9914 5074
14717 5074 13545 14017 -12690 -35196 -36907 -35805 -19128 -6060 3361 11082 37371 43062 23515
$$ packed form
14802I3337R825l1934o0423m8384K6397M4333J619k0479k7247L854J2392J0042
14790A3332Q447J9611L3777K9103k5475p0839m7400j0712j5204M06j2844l4078
14778a11876N2312O4991J6122k4805P285P466k7243k5847Q552J5046R648O960
14766a389R200l7336P028K0524Q771j3838l4063J2428J2684J3110K9882m0933
14754a3932l8404n3749M1099K5847m758j4439j384J4481J2143r807M605K0577
14742a7721J4231K4244J823J0322K1055j9411l2370j4863M768K6682J5007K4190
14730E7957k7932m473L94l4679P279k5586l8649K5J2906K9079L4577k0812J4988
14717E074Q471M72k6707k2506j711J102J6677J3068R421P721K6289N691j9547
$$ plain form
14704 23515 -8785 -13740 -1172 -23957 -8791 -7864 -930 -2642 2134 -5056 3629 72314 44094
14691 44094 -41932 -63699 -16343 35164 72747 112091 97845 78915 39194 54163 17696 -34052
14679 -34052 -64066 -73806 -22972 -25805 -40779 -51530 -43696 -21247 -18057 -3942 6075 12608 -8743
14666 -8743 -26665 -44398 -45093 -28834 -27409 -46407 -63277 -40287 -29034 -35174 -13518 6523 -25449
14653 -25449 -5799 -2288 -28521 -36356 -53238 -31480 25157 11827 139 -10690 771 40387
14641 40387 49449 8975 -23997 -23716 5309 -10066 23811 50026 61876 47493 7872 37377
14629 37377 70566 72228 72547 47416 36723 52607 68483 90904 96831 82642 71756 47448
14617 47448 4612 645 -3390 -23539 -26544 -59707 -43716 -33577 -12883 3807 21825 18680
$$ packed form
14704B3515l2300m955J2568k2785J5166R27O934j712M776p190Q685O8685k8220
14691D4094q6026k1767M7356N1507L7583L9344j4246j8930l9721J4969l6467n1748
14679c4052l0014r740N0834k833j4974j0751P834K2449L190J4115J0017O533k1351
14666h743j7922j7733o95J6259J425j8998j6870K2990J1253o140K1656K0041l1972
14653b5449J9650L511k6233p835j6882K1758N6637j3330j1688j0829J1461L9616
14641D0387R062m0474l2972K81K9025j5375L3877K6215J1850j4383l9621K9505
14629C7377L3189J662L19k5131j0693J5884J5876K2421N927j4189j0886k4308
14617D7448m2836l967m035k0149l005l3163J5991J0139K0694J6690J8018l145
$$ plain form
14605 18680 2874 13638 8451 -6409 -5809 -13913 4008 27055 23992 23458 11594 14708 25944
14592 25944 34441 7808 -26952 -25113 -45633 -7540 8251 -22091 -31031 -75625 -93897 -72572
14580 -72572 -52363 -14231 26246 42410 63995 86856 81482 27750 -14206 -18307 -21609 -38886
14568 -38886 -44336 -23708 -14877 35054 8765 10400 42327 25488 -24645 -59141 -59440 -53077 -28692
14555 -28692 -7976 -3225 -29995 -29788 -73667 -58522 -49053 -14164 -23202 -25768 -22600 -4633 11565
14542 11565 58241 53851 11997 -43698 -50445 -34790 -24764 -50732 -6277 37685 23787 2647
14530 2647 2027 41711 52599 68335 68079 15314 -3258 -12923 24898 60149 23160 380 -1571
14517 -1571 -25115 -50002 -35554 -12865 12561 -1140 -13248 19670 12129 10265 -16666 -24207
$$ packed form
14605A8680j5806J0764n187j4860O00q104J7921K3047l063n34j1864L114J1236
14592B5944Q497k6633l4760J839k0520L8093J5791l0342q940m4594j8272K1325
14580g2572K0209L8132M0477J6164K1585K2861n374n3732m1956m101l302j7277
14568c8886n450K0628Q831M9931k6289J635L1927j6839n0133l4496k99O363K4385
14555b8692K0716M751k6770K07m3879J5145R469L4889r038k566L168J7967J6198
14542A1565M6676m390m1854n5695o747J5655J0026k5968M4455M3962j3898k1140
14530B647o20L9684J0888J5736k56n2765j8572r665L7821L5251l6989k2780j951
14517a571k3544k4887J4448K2689K5426j3701j2108L2918p541j864k6931p541
$$ plain form
14505 -24207 -11465 17276 40120 8204 35741 85036 77634 40454 35864 19674 19722 31249 52149
14492 52149 46322 68123 66668 22295 -2812 13 13534 16172 8227 60571 78482 65113 47952
14479 47952 24829 8956 16298 18038 -11556 -32219 3273 36022 32363 30818 33417 12488 -15428
14466 -15428 -22828 -43668 -33914 -25811 -2402 -52531 -51665 -18409 -39852 -43605 -59983 -71707 -69098
14453 -69098 -16720 15921 11438 -42368 -59903 -36365 -14608 -35482 -52377 -35614 -7510 -24454
14441 -24454 -16883 -14088 -2036 8338 29736 -364 2932 -1509 -4773 3302 320 -2313 -7770
14428 -7770 -38356 -22997 3181 16830 20585 2994 -6347 -27142 -58520 -51292 -40742 10565
14416 10565 42499 8368 25312 42375 24918 14375 -2689 -7520 -2542 10147 9341 -48068
$$ packed form
14505b4207J2742K8741K2844l1916K7537M9295p402l7180m590j6190M8J1527K0900
14492E2149n827K1801j455m4373k5107K825J3521K638p945N2344J7911j3369j7161
14479D7952k3123j5873P342J740k9594k0663L5492L2749l659j545K599k0929k7916
14466a5428p400k0840R754Q103K3409n0129Q66L3256k1443l753j6378j1724K609
14453f9098N2378L2641m483n3806j7535K3538K1757k0874j6895J6763K8104j6944
14441b4454P571K795J2052J0374K1398l0100L296m441l264Q075k982k633n457
14428g770l0586J5359K6178J3649L755j7591r341k0795l1378P228J0550N1307
14416A0565L1934l4131J6944J7063j7457j0543j7064m831M978J2689q06n7409
$$ plain form
14404 -48068 -26761 -4592 15253 7506 12511 -5234 -27251 -38281 -22404 22046 36787 32819
14392 32819 35689 68287 64127 45123 40819 -9553 -20265 -25793 -13412 -19662 17595 17804 6822
14379 6822 12851 12577 30654 35999 16577 -3598 -33667 -39353 -40012 -33791 -30855 -841 -31702 -60645
14365 -60645 -74576 -3075 28642 41952 47956 59398 60307 12249 -16157 14743 24382 35540
14353 35540 32423 8473 -5581 27462 -856 -8577 -20786 -12697 3493 -22479 -36477 -23763
14341 -23763 -35198 -7320 -5432 16840 26021 53068 23120 32049 41755 32864 57501 84796 107624
14328 107624 64555 12526 -14332 -13567 -34986 -34263 -22036 -33110 6624 37337 31836 59252
14316 59252 39926 -6108 -8642 -23465 -24113 -17071 -2752 -14188 10362 -1938 27764 46761
$$ packed form
14404d8068K1307K2169J9845p747N005j7745k2017j1030J5877M4450J4741l968
14392C2819K870L2598m160j9004m304n0372j0712n528J2381o250L7257K09j0982
14379F822O029k74J8077N345j9422k0175l0069n686o59O221K936L0014l0861k8943
14365f0645j3931P1501L1717J3310O004J1442R09m8058k8406L0900R639J1158
14353C5540l117k3950j4054L3043k8318p721j2209Q089J6190k5972j3998J2714
14341b3763j1435K7878J888K2272R181K7047k9948Q929R706q891K4637K7295K2828
14328A07624m3069n2029k6858P65k1419P23J2227j1074L9734L0713n501K7416
14316E9252j9326m6034k534j4823o48P042J4319j1436K4550j2300K9702J8997
$$ plain form
14304 46761 41147 38955 58699 70042 52837 24216 31510 29107 21990 14870 25182 50216 51389
14291 51389 64993 49587 36833 17655 2322 -10370 -33042 -25290 -30431 -19236 -20649 -25787
14279 -25787 -69930 -43653 -23040 7329 -6987 -329 34197 41455 12394 47645 47926 -1899
14267 -1899 -23967 -3185 -444 68177 67353 92089 94792 58615 27173 17652 52412 73962 31389
14254 31389 -16708 -26643 -42242 -55602 -34287 -13512 13396 2504 -15892 -36726 -36791 -24710
14242 -24710 -26498 -20412 2969 6320 -28253 -47601 -36124 -29539 -13563 -33917 -2877 35569
14230 35569 10156 -35269 -87772 -89961 -51785 -38107 -7164 23593 42688 4865 9341 773
14218 773 -29295 -13775 -21328 -25271 6894 20109 34147 6327 -11339 -51071 -41275 -2507 16607
$$ packed form
14304D6761n614k192J9744J1343j7205k8621P294k403p117p120J0312K5034J173
14291E1389J3604j5406j2754j9178j5333j2692k2672P752n141J1195j413n138
14279b5787m4143K6277K0613L0369j4316O658L4526P258k9061L5251K81m9825
14267a899k2068K0782K741O8621q24K4736K703l6177l1442r521L4760K1550m2573
14254C1389m8097r935j5599j3360K1315K0775K6908j0892j8396k0834o5J2081
14242b4710j788O086K3381L351l4573j9348J1477O585J5976k0354L1040L8446
14230C5569k5413m5425n2503k189L8176J3678L0943L0757J9095l7823M476q568
14218G73l0068J5520p553l943L2165J3215J4038k7820j7666l9732R796L8768J9114
$$ plain form
14205 16607 -13852 2897 20947 2482 22037 29805 35771 52461 52376 82625 26473 1374 5891
14192 5891 40770 26110 -20500 -36696 -44022 -75647 -84356 -74819 -20156 6755 -635 -3387 11268
14179 11268 23405 11155 -14496 -2589 24857 -18705 -29623 -32189 -12167 5080 14977 -15079
14167 -15079 -21445 -4188 -10916 -13617 -6338 27165 41599 41156 34190 29864 23401 26139 12630 -2567
14153 -2567 1847 13542 8255 16595 38436 8487 13624 9059 -21020 -23333 -27621 -23030 -12618
14140 -12618 14207 37347 29866 28015 24608 16076 8893 48071 47279 564 -28655 -1934 10365
14127 10365 38770 52771 81358 48426 12931 -31896 -24496 -4688 1203 -3617 27499 53016
14115 53016 67656 94972 100615 53367 37591 36392 25754 29989 34998 21089 -10789 25790
$$ packed form
14205A6607l0459J6749J8050j8465J9555P768N966J6690q5L0249n6152k5099M517
14192E891L4879j4660m6610j6196p326l1625q709R537N4663K6911p390k752J4655
14179A1268J2137j2250k5651J1907K7446m3562j0918k566K0022J7247R897l0056
14167a5079o366J7257o728k701P279L3503J4434m43o966m326o463K738j3509j5197
14153b567M414J1695n287Q340K1841k9949N137m565l0079k313m288M591J0412
14140a2618K6825K3140p481j851l407q532p183L9178p92m6715k9219K6721J2299
14127A0365K8405J4001K8587l2932l5495m4827P400J9808N891m820L1116K5517
14115E3016J4640K7316N643m7248j5776j199j0638M235N009j3909l1878L6579
$$ plain form
14103 25790 32697 39095 38126 51021 24294 6037 17496 22748 32747 55637 74241 27960 -1597
14090 -1597 11413 30458 51218 48924 29672 19639 -4960 2777 50102 41271 32919 18454 -12169
14077 -12169 -12325 -3122 11133 23540 -10999 -4013 -1590 8851 13578 14628 3419 -13401 20617
14064 20617 38042 13474 35581 62697 26414 -6542 6189 -5008 -9247 19539 -5781 -46353
14052 -46353 -16652 -42272 -48232 -20633 27746 48168 46961 22636 46778 17624 -9564 -1012
14040 -1012 32820 56029 41194 36284 28513 17861 27673 41581 32044 78030 95536 84461 59776
14027 59776 46396 56804 38834 32994 29402 11126 11179 54487 78845 40718 -4067 -8147 25559
14014 25559 -11357 -9113 34826 83575 85185 88801 98807 45543 -16108 -39866 -48946 -1097
$$ packed form
14103B5790O907O398r69J2895k6727j8257J1459N252R999K2890J8604m6281k9557
14090a597J3010J9045K0760k294j9252j0033k4599P737M7325q831q352j4465l0623
14077a2169j56R203J4255J2407l4539O986K423J0441M727J050j1209j6820L4018
14064B0617J7425k4568K2107K7116l6283l2956J2731j1197m239K8786k5320m0572
14052d6353K9701k5620n960K7599M8379K0422j207k4325K4142k9154k7188Q552
14040a012L3832K3209j4835m910p771j0652R812J3908r537M5986J7506j1075k4685
14027E9776j3380J0408j7970n840l592j8276N3M3308K4358l8127m4785m080L3706
14014B5559l6916K244M3939M8749J610L616J0006n3264o1651k3758r080M7849
$$ plain form
14002 -1097 14634 4543 -19725 -6022 10547 31582 44602 22011 2218 142 74077 62824
13990 62824 51639 53729 37632 -1089 -27527 -5939 18844 43376 13786 -33919 -19346 22711
13978 22711 60264 39347 16325 9382 -13309 -18305 -4856 20820 15398 28193 14519 4942
13966 4942 -19445 -24081 -8573 30014 31599 -4724 -7873 -8220 11855 26294 6457 19715 10573
13953 10573 29530 27435 7000 2323 27416 26087 -11386 -40962 -78 52512 69481 44900
13941 44900 8951 -14695 -21758 -3310 12070 4117 26741 28543 31453 58384 9856 -16965
13929 -16965 23994 31597 3964 46324 38773 29758 34140 11363 -23462 -27607 -14788 8776 25768
13916 25768 57013 67503 53165 23490 3510 -8744 35004 33031 2607 -2636 43583 55911
$$ packed form
14002a097J5731j0091k4268J3703J6569K1035J3020k2591j9793k076P3935j1253
13990F2824j1185K090j6097l8721k6438K1588K4783K4532k9590m7705J4573M2057
13978B2711L7553k0917k3022o943k2691m996J3449K5676n422J2795j3674r577
13966D942k4387m636J5508L8587J585l6323l149l47K0075J4439j9837J3258r142
13953A0573J8957k095k0435m677K5093j329l7473k9576M0884N2590J6969k4581
13941D4900l5949k3646p063J8448J5380p953K2624J802K910K6931m8528k6821
13929a6965M0959P603k7633M2360p551r015M382k2777l4825m145J2819K3564J6992
13916B5768L1245J0490j4338k9675j9980j2254M3748j973l0424n243M6219J2328
$$ plain form
13904 55911 101413 116161 87778 51576 39599 30630 12970 51622 36857 20194 -53199 -67089
13892 -67089 -37333 -27276 -28525 14514 53986 7992 -18979 -6613 -27644 -45822 -8139 13754
13880 13754 27068 16344 15981 9502 30158 69899 77261 75621 59979 56284 24022 -4355 -28799
13867 -28799 1495 63718 70492 36190 11637 13594 42681 5774 -37492 -42979 -8383 27732
13855 27732 30649 19092 9954 -35140 -37055 -28056 -21300 -35036 -16661 19600 59756 16202 -19520
13842 -19520 -39147 -29017 24747 47767 18829 58193 58713 60106 72082 70266 51252 9056
13830 9056 -7171 4616 5111 8878 -21758 -13222 40202 46282 36181 44387 43995 54611 71180
13817 71180 44584 36850 44331 34982 34958 22205 -19021 -17714 28051 19774 23391 30697 66221 59940
$$ packed form
13904E5911M5502J4748k8383l6202j1977q969j7660L8652j4765j6663p3393j3890
13892f7089K9756J0057j249M3039L9472m5994k6971J2366k1031j8178L7683K1893
13880A3754J3314j0724l63o479K0656L9741P362j640j5642l695l2262k8377k4444
13867b8799L0294O2223O774l4302k4553J957K9087l6907m3266n487L4596L6115
13855B7732K917j1557r138m5094j915Q999O756j3736J8375L6261M0156m3554l5722
13842a9520j9627J0130N3764K3020k8938L9364N20J393J1976j816j9014m2196
13830I056j6227J1787M95L767l0636Q536N3424O080j0101Q206l92J0616J6569
13817G1180k6596p734P481r349k4j2753m1226J307M5765q277L617P306L5524o281
$$ plain form
13803 59940 41176 6450 1076 21436 26677 894 -16656 709 -5497 -12412 1697 -23960
13791 -23960 -18984 17542 14728 -3562 16308 17775 4880 1996 14242 34513 28528 13775 24665
13778 24665 16744 13494 5709 -2686 7470 42794 81629 93301 54030 38984 44335 34620 12864
13765 12864 39657 73184 68051 51917 26146 9999 32894 61227 52929 50150 36261 38121
13753 38121 61215 42018 32478 60008 46222 58318 52810 39914 21396 19045 23823 5075
13741 5075 -9386 -3589 49454 29824 1059 17985 -10502 -55752 -40978 1536 -19767 -14985
13729 -14985 -4250 -6158 -1614 10719 2115 13469 57440 72628 71698 68847 44742 11581 14037
13716 14037 34211 47978 54482 93550 95453 102006 67223 38582 -5373 -19170 19935 110147
$$ packed form
13803E9940j8764l4726n374K0360N241k5783j7550J7365o206o915J4109k5657
13791b3960M976L6526k814j8290J9870J467j2895k884J2246K0271n985j4753J0890
13778B4665p921l250p785q395J0156L5324L8835J1672l9271j5046N351r715k1756
13765A2864K6793L3527n133j6134k5771j6147K2895K8333q298k779j3889J860
13753C8121K3094j9197r540K7530j3786J2096n508j2896j8518k351M778j8748
13741E075j4461N797N3043j9630k8765J6926k8487m5250J4774M2514k1303M782
13729a4985J0735j908M544J2333q604J1354M3971J5188r30k851k4105l3161K456
13716A4037K0174J3767O504L9068J903O553l4783k8641m3955j3797L9105R0212
$$ plain form
13704 110147 119026 78648 84737 44882 27483 65038 54308 41508 22765 44968 27740 63370
13692 63370 85629 96211 89572 72983 69182 27879 8029 -6243 48177 77726 53027 59469
13680 59469 36894 3153 6775 24874 12271 76998 115883 61989 22321 7056 15962 51709
13668 51709 61442 46746 37439 2825 -21904 -14663 -28678 -35273 -20381 -9669 260 -4717 -26797
13655 -26797 -55104 -28016 20398 30586 17951 36875 50765 28948 369 -25083 9758 46772
13643 46772 65780 48724 58329 39562 15048 19771 32326 21319 -10152 -5319 -4768 18213 28058
13630 28058 48950 43105 29731 10806 -11573 14479 22161 -1667 21218 28312 23606 15381 29333
13617 29333 15180 31048 4969 -1036 7123 10710 1237 -965 30920 45823 24680 17465 37226
$$ packed form
13704A10147Q879m0378O089l9855j7399L7555j0730j2800j8743K2203j7228L5630
13692F3370K2259J0582o639j6589l801m1303j9850j4272N4420K9549k4699O442
13680E9469k2575l3741L622J8099j2603O4727L8885n3894l9668j5265Q906L5747
13668E1709R733j4696r307l4614k4729P241j4015o595J4892J0712R929m977k2080
13655b6797k8307K7088M8414J0188j2635J8924J3890k1817k8579k5452L4841L7014
13643D6772J9008j7056R605j8767k4514M723J2555j1007l1471M833N51K2981R845
13630B8058K0892n845j3374j8925k2379K6052P682k3828K2885P094m706q225J3952
13617B9333j4153J5868k6079o005Q159L587r473k202L1885J4903k1143p215J9761
$$ plain form
13604 37226 47848 46861 107936 124973 82698 35443 -8283 -40297 -8376 13542 18364 52918
13592 52918 60025 27312 13494 19036 -1725 29897 70366 80674 61297 50577 73843 57097
13580 57097 56707 68200 95897 138629 127314 90178 63955 51231 41437 46237 2725 -26893
13568 -26893 32201 34951 53566 73070 83568 83476 60313 82552 67796 45516 32656 1288
13556 1288 32879 42631 60397 39223 31424 58418 75182 32287 37521 48492 42677 49771 11385
13543 11385 8242 -14464 -17580 -21482 -20150 -39881 -41612 2949 20298 40969 67268 47479 78319
13530 78319 79263 91298 80245 20000 -3712 -30616 -44728 -35042 -37957 -33372 -11795 10571 34882
13517 34882 53521 52748 85967 77480 18891 2563 -22987 -8055 -8427 8672 43144 51931 48847
$$ packed form
13604C7226J0622r87O1075J7037m2275m7255m3726l2014L1921K1918M822L4554
13592E2918P107l2713j3818N542k0761L1622M0469J0308j9377j0720K3266j6746
13580E7097l90J1493K7697M2732j1315l7136k6223j2724r794M800m3512k9618
13568b6893N9094K750J8615J9504J0498r2k3163K2239j4756k2280j2860l1368
13556A288L1591R752J7766k1174p799K6994J6764m2895N234J0971n815P094l8386
13543A1385l143k2706l116l902J332j9731j731M4561J7349K0671K6299j9789L0840
13530G8319R44J2035j1053o0245k3712k6904j4112R686k915M585K1577K2366K4311
13517C4882J8639p73L3219q487n8589j6328k5550J4932l72J7099L4472Q787l084
$$ plain form
13504 48847 63457 71917 27994 18010 42074 35994 62643 75478 37382 26928 34175 24961 39437
13491 39437 46358 43005 45103 43446 67307 79444 115919 100563 106896 110333 99521 78257 52999
13478 52999 42849 14965 -6687 24130 3734 -22500 -10828 -13084 -20417 -44657 -42586 -7506
13466 -7506 26495 38957 92879 64911 35843 33634 56017 32350 12146 30001 17805 36286
13454 36286 8878 32223 60660 56181 56241 63086 87053 64560 61762 67066 75059 97152 114542
13441 114542 70211 68466 115842 150884 179282 190508 143607 93848 107304 161067 180129 165966
13429 165966 114835 98619 74923 49111 38184 21637 7112 1537 15994 28311 32099 19788
13417 19788 14563 62138 101835 149496 126853 126974 123871 75298 50707 49357 53396 77298 81004
$$ packed form
13504D8847J4610Q460m3923r984K4064o080K6649J2835l8096j0454P247r214J4476
13491C9437O921l353K098j657K3861J2137L6475j5356O333L437j0812k1264k5258
13478E2999j0150k7884k1652L0817k0396k6234J1672k256p333k4240K071L5080
13466g506L4001J2462N3922k7968k9068k209K2383k3667k0204J7855j2196J8481
13454C6286k7408K3345K8437m479O0O845K3967k2493k798N304P993K2093J7390
13441A14542m4331j745M7376L5042K8398J1226m6901m9759J3456N3763J9062j4163
13429A65966n1131j6216k3696k5812j0927j6547j4525n575J4457J2317L788j2311
13417A9788n225M7575L9697M7661k2643J21l103m8573k4591j350M039K3902L706
$$ plain form
13404 81004 90819 116291 94390 88565 61959 45644 58934 51335 36629 28598 32250 55728 48738
13391 48738 36776 44125 44594 61982 32436 18799 51901 72534 78967 72572 82897 65380 77323
13378 77323 112601 96176 69965 32691 50635 80326 63446 50550 56713 75951 90547 40455
13366 40455 11696 -321 18669 16534 18996 49209 52844 56770 73754 91505 105573 122231
13354 122231 113081 95462 78932 81989 85053 64969 49971 48985 51062 42531 28536 28148 34747
13341 34747 21296 15479 9607 21897 53397 72704 72358 62697 58154 57709 41316 -2050 23871
13328 23871 80176 95699 88010 94108 120929 130967 123145 110721 125562 101230 86047 68831
13316 68831 98557 127678 121686 120450 107798 74839 71681 86925 115129 122786 91154 67015
$$ packed form
13404H1004R815K5472k1901n825k6606j6315J3290p599j4706q031L652K3478o990
13391D8738j1962P349M69J7388k9546j3637L3102K0633O433o395J0325j7517J1943
13378G7323L5278j6425k6211l7274J7944K9691j6880j2896O163J9238J4596n0092
13366D0455k8759j2017J8990k135K462L0213L635L926J6984J7751J4068J6658
13354A22231r150j7619j6530L057L064k0084j4998r86K077q531j3995l88O599
13341C4747j3451n817n872J2290L1500J9307l46r661m543m45j6393m3366K5921
13328B3871N6305J5523p689O098K6821J0038p822j2424J4841k4332j5183j7216
13316F8831K9726K9121n992j236j2652l2959l158J5244K8204P657l1632k4139
$$ plain form
13304 67015 28254 44429 42322 84733 78671 58436 44193 45020 48416 69423 68030 35237 19139
13291 19139 58097 91317 98135 123305 120599 97918 103691 151551 162182 144682 150425 136446
13279 136446 132255 91646 86854 111855 73430 59157 56803 72070 98150 116676 107623 111084
13267 111084 106803 94313 89229 67458 60533 61830 68259 82350 39578 58506 91659 115824
13255 115824 111296 91707 91821 110691 101862 124806 114436 125659 124625 131121 138860 103201 108592
13242 108592 156809 157450 117963 85569 102984 117058 116819 115414 117004 121321 149963 184584 157926
13229 157926 120189 121251 146942 163425 171290 161513 135672 108055 72912 79318 87519 122452
13217 122452 132171 127636 89906 94301 109848 105033 106680 120866 120867 92874 91375 118520 113193 89537
$$ packed form
13304F7015l8761J6175k107M2411o062k0235j4243Q27L396K1007j393l2793j6098
13291A9139L8958L3220O818K5170k706k2681N773M7860J0631j7500N743j3979
13279A36446m191m0609m792K5001l8425j4273k354J5267K6080J8526r053L461
13267A11084m281j2490n084k1771o925J297O429J4091m2772J8928L3153K4165
13255A15824m528j9589J14J8870q829K2944j0370J1223j034O496P739l5659N391
13242A08592M8217O41l9487l2394J7415J4074k39j405J590M317K8642L4621k6658
13229A57926l7737J062K5691J6483P865r777k5841k7617l5143O406Q201L4933
13217A22452R719m535l7730M395J5547m815J647J4186Jk7993j499K7145n327k3656
$$ plain form
13203 89537 106124 80314 67004 108171 132646 119251 93477 113045 109664 130749 147475 153832
13191 153832 163953 177016 175508 178291 181345 148708 124782 109574 100954 113066 111169 108096 89213
13178 89213 122094 154153 133006 157719 184921 182920 172232 191266 183696 175740 177739 165001
13166 165001 153496 153731 149009 173444 172728 166438 189115 172464 182951 153672 168581 154124 149448
13153 149448 112393 117114 130376 101638 124169 158996 162076 158603 170120 160621 152575 194528
13141 194528 242861 296294 400971 495503 561004 630513 721811 730738 723867 642107 575925 511873
13129 511873 503998 462724 429589 386218 389560 379868 339255 324811 331454 356747 405300 442975
13117 442975 481450 486542 507988 526792 550589 578602 632665 651619 663746 695005 735698 792887
$$ packed form
13203H9537J6587k5810j3310M1167K4475j3395k5774J9568l381K1085J6726O357
13191A53832J0121J3063j508K783L054l2637k3926j5208q620J2112j897l073j8883
13178H9213L2881L2059k1147K4713K7202k001j0688J9034p570p956J999j2738
13166A65001j1505K35m722K4435p16o290K2677j6651J0487k9279J4909j4457m676
13153A49448l7055M721J3262k8738K2531L4827L080l473J1517r499q046M1953
13141A94528M8333N3433J04677R4532O5501O9509R1298Q927o871q1760o6182o4052
13129E11873p875m1274l3135m3371L342r692m0613j4444O643K5293M8553L7675
13117D42975L8475N092K1446J8804K3797K8013N4063J8954J2127L1259M0693N7189
$$ plain form
13105 792887 846385 884140 935349 925665 881301 797530 770885 716753 705498 714141 643297 601447
13093 601447 552635 550360 532474 524870 509022 485531 490682 491243 491748 506279 474132 469534 483239
13080 483239 501270 490822 514648 549754 610487 680869 806566 873184 880991 900079 867341
13069 867341 751176 639729 611301 581034 491662 455739 464020 472499 492880 480600 410542
13058 410542 357704 341677 347515 333090 309715 272218 272973 274222 287683 283321 309521 266745
13046 266745 235139 246154 233012 267700 303414 259731 234796 234530 252615 280070 265117 274620
13034 274620 279961 236657 226199 220834 254499 260996 206376 177639 192662 222542 215551 212994
13022 212994 207196 199058 182249 197017 207036 189150 171653 186459 220153 240284 214409 190781
$$ packed form
13105G92887N3498L7755N1209r684m4364q3771k6645n4132j1255Q643p0844m1850
13093F01447m8812k275j7886p604j5848k3491N151N61N05J4531l2147m598J3705
13080D83239J8031j0448K3826L5106O0733P0382J25697O6618P807J9088l2738
13069H67341j16165j11447k8428l0267q9372l5923Q281Q479K0381j2280p0058
13058D10542n2838j6027N838j4425k3375l7497P55J249J3461m362K6200m2776
13046B66745l1606J1015j3142L4688L5714m3683k4935k66J8085K7455j4953R503
13034B74620N341m3304j0458n365L3665O497n4620k8737J5023K9880o991k557
13022B12994n798q138j6809J4768J0019j7886j7497J4806L3694K0131k5875k3628
$$ plain form
13010 190781 210916 227246 222013 191952 165757 152119 157086 189896 193140 193878 174111 167346 165657
12997 165657 163988 195112 197013 178519 215326 215588 172827 188981 208680 236573 264971 244080
12985 244080 245189 263950 244485 216851 183436 179755 154435 161057 173683 169086 180246 200850
12973 200850 249643 279189 265863 210616 204572 177783 154003 133593 150426 168261 184086 200979
12961 200979 202196 190587 235921 269440 269458 259094 276461 260626 263670 263587 238019 250068 275056
12948 275056 280584 269607 242946 241630 209508 192201 218915 245352 281512 357876 414630 409743
12936 409743 362481 387174 421269 384934 362097 379998 367514 336115 343809 310226 313447 328926
12924 328926 308708 282149 296743 326544 346258 348791 343380 335170 378729 378573 382813 402185 414881
$$ packed form
13010A90781K0135J6330n233l0061k6195j3638M967L2810L244P38j9767o765j689
12997A65657j669L1124J901j8494L6807K62m2761J6154J9699K7893K8398k0891
12985B44080J109J8761j9465k7634l3415l681k5320O622J2626m597J1160K0604
12973B00850M8793K9546j3326n5247o044k6789k3780k0410J6833J7835J5825J6893
12961B00979J217j1609M5334L3519J8j0364J7367j5835L044q3k5568J2049K4988
12948B75056N528j0977k6661j316l2122j7307K6714K6437L6160P6364N6754m887
12936D09743m7262K4693L4095l6335k2837J7901j2484l1399P694l3583L221J5479
12924C28926k0218k6559J4594K9801J9714K533n411q210M3559j56M240J9372J2696
$$ plain form
12911 414881 427373 452604 489370 518950 521094 508752 493684 465615 470901 526901 538016 581701
12899 581701 627786 695582 830729 966449 1090230 1200875 1316242 1397262 1416925 1376369
12889 1376369 1290417 1183735 1044836 912755 797215 749398 733305 681556 626866 614748
12879 614748 600726 604246 596913 587711 624429 603440 544072 497151 461441 486891 506818 500072
12867 500072 457041 429430 439366 396839 354171 359930 375485 410137 453700 455385 444878 448079
12855 448079 447012 412304 394334 411136 415361 384791 351471 310119 333240 362517 388326 405084
12843 405084 391940 362314 351754 355540 377239 358284 318972 332528 360102 345574 352616 374391
12831 374391 392281 390683 396252 418165 388107 388491 403531 383391 424300 419010 373912 404828
$$ packed form
12911D14881J2492K5231L6766K9580K144j2342j5068k8069N286N6000J1115M3685
12899E81701M6085O7796J35147J35720J23781J10645J15367Q1020J9663m0556
12889A376369q5952j06682j38899j32081j15540m7817j6093n1749n4690j2118
12879F14748j4022L520p333r202L6718k0989n9368m6921l5710K5450J9927o746
12867E00072m3031k7611R936m2527m2668N759J5555L4652M3563J685j0507L201
12855D48079j067l4708j7970J6802M225l0570l3320m1352K3121K9277K5809J6758
12843D05084j3144k9626j0560L786K1699j8955l9312J3556K7574j4528P042K1775
12831C74391J7890j598N569K1913l0058L84J5040k0140M0909n290m5098L0916
$$ plain form
12819 404828 411236 428134 443773 472436 473865 499131 522522 520652 529938 579421 598510 556384
12807 556384 507905 550021 551565 508004 528428 536012 553071 529965 523147 516021 506585 513834 547154
12794 547154 553702 542074 566424 560298 523081 456282 460658 501518 532105 551976 537580 559234
12782 559234 558324 562745 562958 585416 623687 606014 572153 606715 619178 589382 555139 587313
12770 587313 631756 635642 627293 593394 578981 631603 637995 653990 662974 701024 699686 684156
12758 684156 711167 733019 737755 729350 746728 785914 862547 881434 914159 954674 957931 937643
12746 937643 941585 930480 949687 977473 972274 972712 1034641 1062946 1083824 1112142 1132679 1168442
12734 1168442 1156730 1183991 1227865 1251918 1273047 1370185 1495505 1576428 1629342 1704962 1761122
$$ packed form
12819D04828O408J6898J5639K8663J429K5266K3391j870R286M9483J9089m2126
12807E56384m8479M2116J544m3561K0424P584J7059k3106o818p126r436P249L3320
12794E47154O548j1628K4350o126l7217o6799M376M0860L0587J9871j4396K1654
12782E59234r10M421K13K2458L8271j7673l3861L4562J2463k9796l4243L2174
12770E87313M4443L886q349l3899j4413N2622O392J5995Q984L8050j338j5530
12758F84156K7011K1852M736q405J7378L9186P6633J8887L2725M0515L257k0288
12746I37643L942j1105J9207K7786n199M38O1929K8305K0878K8318K0537L5763
12734A168442j1712K7261M3874K4053K1129R7138J25320Q0923N2914P5620N6160
$$ plain form
12723 1761122 1799139 1823824 1867241 1880787 1913065 2028176 2109153 2205191 2338151 2438929 2552039
12712 2552039 2645664 2813774 2986906 3121539 3291900 3540750 3844585 4179198 4551636 4967544
12702 4967544 5459511 5972723 6526630 7195604 7984049 8968483 10226774 11874619 14081317
12693 14081317 17026396 21069944 26672185 34552977 45286945 59073872 75084591 90824323
12685 90824323 102907115 108231034 105355142 95715757 83209237 71427139 61925830 54864094
12677 54864094 49802797 46206223 43826596 42619390 42509377 43422969 45104714 47205627
12669 47205627 49271151 51061047 52644110 54529906 57601417 62570999 69546440 77987519
12661 77987519 87165412 96508528 106126517 116536492 128020639 139379017 148097038 151610354
$$ packed form
12723A761122L8017K4685M3417J3546L2278J15111Q0977R6038J32960J00778J13110
12712B552039R3625J68110J73132J34633J70361K48850L03835L34613L72438M15908
12702D967544M91967N13212N53907O68974P88445R84434J258291J647845K206698
12693A4081317K945079M043548N602241P880792J0733968J3786927J6010719J5739732
12685I0824323J2082792N323919k875892r639385j2506520j1782098r501309p061736
12677E4864094n061297l596574k379627j207206j10013R13592J681745K100913
12669D7205627K065524J789896J583063J885796L071511M969582O975441Q441079
12661G7987519R177893R343116R617989J0409975J1484147J1358378Q718021L513316
$$ plain form
12653 151610354 148213777 138730252 126802463 116205368 108733654 104199555 101562673 99718521
12645 99718521 97694550 94868206 90991548 86146352 81039325 76597025 73402942 71471689
12637 71471689 70157729 68675300 66726119 64452415 62456045 61480378 61870340 63975697
12629 63975697 68390897 75967328 87369899 102812811 121171789 139448538 153141534
12622 153141534 158402053 153408900 139327871 120667151 102732668 88126306 76865779
12615 76865779 68098327 61030639 55175112 50341844 46464106 43324908 40671646 38358734
12607 38358734 36337990 34539368 32932729 31481063 30194354 29056880 28045969 27104529
12599 27104529 26247576 25400798 24599708 23858443 23137534 22419599 21720015 21066293 20495944
$$ packed form
12653A51610354l396577r483525j1927789j0597095p471714m534099k636882j844152
12645I9718521k023971k826344l876658m845196n107027m442300l194083j931253
12637G1471689j313960j482429j949181k273704j996370r75667L89962K105357
12629F3975697M415200P576431J1402571J5442912J8358978J8276749J3692996
12622A53141534N260519m993153j4081029j8660720j7934483j4606362j1260527
12615G6865779q767452p067688n855527m833268l877738l139198k653262k312912
12607C8358734k020744j798622j606639j451666j286709j137474j010911r41440
12599B7104529q56953q46778q01090p41265p20909p17935o99584o53722n70349
$$ plain form
12590 20495944 19940556 19383167 18827380 18338056 17907399 17459264 17100376 16721477 16355374
12581 16355374 15976880 15605235 15255853 14924683 14576545 14269483 13974868 13710424 13431219
12572 13431219 13128155 12850382 12623861 12341664 12109263 11857512 11607734 11368771 11119695
12563 11119695 10947180 10739186 10554435 10377877 10186706 10023659 9854559 9664704 9496886
12554 9496886 9301900 9073600 8879619 8702387 8585691 8471502 8351840 8224615 8096014
12545 8096014 7933820 7803958 7674350 7520845 7413594 7294824 7181825 7073392 6972511
12536 6972511 6892631 6855217 6794105 6701331 6649464 6537263 6397188 6276550 6163316 6073661
12526 6073661 5967451 5893731 5795619 5752474 5704936 5644278 5597312 5591779 5603777 5582232 5569732
$$ packed form
12590B0495944n55388n57389n55787m89324m30657m48135l58888l78899l66103
12581A6355374l78494l71645l49382l31170l48138l07062k94615k64444k79205
12572A3431219l03064k77773k26521k82197k32401k51751k49778k38963k49076
12563A1119695j72515k07994j84751j76558j91171j63047j69100j89855j67818
12554I496886j94986k28300j93981j77232j16696j14189j19662j27225j28601
12545H096014j62194j29862j29608j53505j07251j18770j12999j08433j00881
12536F972511p9880l7414o1112r2774n1867j12201j40075j20638j13234q9655
12526F073661j06210p3720r8112m3145m7538o0658m6966n533J1998k1545j2500
$$ plain form
12515 5569732 5556341 5584660 5567131 5536090 5551927 5573981 5570541 5578680 5655817 5737396 5842629
12504 5842629 5988503 6153409 6285681 6447271 6611695 6776972 6863373 6942109 7070612 7299095
12494 7299095 7582874 7972458 8483877 9087452 9793937 10632250 11649454 12794716 14064621
12485 14064621 15534336 17269968 19407529 22146447 25811993 30901750 38212569 48982953
12477 48982953 64351503 84785134 109827775 137890260 165882106 189756607 206278387
12470 206278387 213257413 209244325 194701699 172958348 148220643 123460151 100888481
12463 100888481 82629712 69280641 60019285 53497361 48685936 44961324 41889134 39196835
12455 39196835 36759794 34507708 32378194 30424961 28646787 27048883 25647421 24421594
$$ packed form
12515E569732j3391K8319j7529l1041J5837K2054l440Q139P7137Q1579J05233
12504E842629J45874J64906J32272J61590J64424J65277Q6401P8736J28503K28483
12494G299095K83779L89584N11419O03575P06485Q38313J017204J145262J269905
12485A4064621J469715J735632K137561K738918L665546N089757P310819J0770384
12477D8982953J5368550K0433631K5042641K8062485K7991846K3874501J6521780
12470B06278387O979026m013088j4542626k1743351k4737705k4760492k2571670
12463A00888481j8258769j3349071r261356o521924m811425l724612l072190k692299
12455C9196835k437041k252086k129514j953233j778174j597904j401462j225827
$$ plain form
12447 24421594 23337264 22402991 21547936 20757949 20074310 19392441 18715325 18103622 17581441
12438 17581441 17049930 16571237 16113969 15649989 15176737 14698089 14292934 13911772 13536392
12429 13536392 13109859 12680706 12376996 12082738 11783319 11489664 11224348 10986206 10749870
12420 10749870 10500335 10215617 9984379 9816308 9600954 9368775 9130282 8923794 8721771
12411 8721771 8559151 8406390 8228585 8053305 7842739 7679708 7534323 7397276 7248715
12402 7248715 7056943 6918145 6838984 6738647 6629294 6542166 6415449 6279147 6169859 6067598
12392 6067598 5930294 5800781 5706094 5641960 5539715 5388528 5276334 5151566 5060988 4980526
12382 4980526 4880430 4773360 4653892 4561253 4472716 4403153 4334943 4271526 4165852 4097946
$$ packed form
12447B4421594j084330r34273q55055p89987o83639o81869o77116o11703n22181
12438A7581441n31511m78693m57268m63980m73252m78648m05155l81162l75380
12429A3536392m26533m29153l03710k94258k99419k93655k65316k38142k36336
12420A0749870k49535k84718k31238j68071k15354k32179k38493k06488k02023
12411H721771j62620j52761j77805j75280k10566j63031j45385j37047j48561
12402G248715j91772j38798p9161j00337j09353q7128j26717j36302j09288j02261
12392F067598j37304j29513r4687o4134j02245j51187j12194j24768r0578q0462
12382D980526j00096j07070j19468r2639q8537o9563o8210o3417j05674o7906
$$ plain form
12372 4097946 4095043 4041041 3965609 3877827 3814500 3761044 3653409 3601617 3521751 3481984 3429978
12361 3429978 3386184 3379318 3301939 3203064 3182643 3113820 3061745 3012318 2971310 2926334 2880813
12350 2880813 2880086 2874053 2855025 2853694 2826357 2798675 2749549 2693287 2614381 2527522 2458022 2449390
12338 2449390 2438945 2356739 2293277 2235701 2164581 2099133 2060955 2015240 1995172 1970330 1939622
12327 1939622 1903756 1882323 1867531 1863297 1884667 1851705 1770727 1760248 1782417 1754265 1678368
12316 1678368 1637002 1622700 1603761 1619306 1624319 1634447 1627977 1608810 1598495 1588630 1569082 1568293
12304 1568293 1612460 1683096 1726021 1795997 1876301 1913825 1936994 1914927 1849270 1766460 1659002
12293 1659002 1608808 1560812 1495998 1477134 1464703 1459861 1426063 1377078 1380411 1391253 1348813 1330908
$$ packed form
12372D097946k903n4002p5432q7782o3327n3456j07635n1792p9866l9767n2006
12361C429978m3794o866p7379r8875k0421o8823n2075m9427m1008m4976m5521
12350B880813p27o033j9028j331k7337k7682m9126n6262p8906q6859o9500q632
12338B449390j0445q2206o3462n7576p1120o5448l8178m5715k0068k4842l0708
12327A939622l5866k1433j4792m234K1370l2962q0978j0479K2169k8152p5897
12316A678368m1366j4302j8939J5545N013J0128o470j9167j0315r865j9548p89
12304A568293M4167P0636M2925O9976Q0304L7524K3169k2067o5657q2810j07458
12293A659002n0194m7996o4814j8864j2431m842l3798m8985L333J0842m2440j7905
$$ plain form
12281 1330908 1291634 1242910 1223534 1174721 1149507 1175017 1176866 1161338 1147100 1170739 1201141
12270 1201141 1174238 1106476 1063782 1075217 1106332 1149554 1127741 1131117 1118765 1067405 1058233 1071608
12258 1071608 1104682 1175778 1151479 1131051 1175750 1165462 1122382 1115710 1136739 1180076 1206210
12247 1206210 1195497 1190421 1218640 1243409 1271758 1300845 1302262 1288063 1271935 1272819 1317580 1344701
12235 1344701 1383764 1412711 1403443 1423946 1424127 1423680 1451022 1519433 1600405 1637977 1651047 1684454
12223 1684454 1714872 1717488 1695703 1721662 1801808 1834065 1896876 2020167 2080941 2175627 2263266
12212 2263266 2290920 2363333 2458884 2557633 2687552 2829655 2988948 3160191 3296055 3474530
12202 3474530 3679124 3898536 4157366 4437987 4742158 5108108 5565728 6051423 6603951
$$ packed form
12281A330908l9274m8724j9376m8813k5214K5510J849j5528j4238K3639L0402
12270A201141k6903o7762m2694J1435L1115M3222k1813L376j2352n1360r172J3375
12258A071608L3074P1096k4299k0428M4699j0288m3080o672K1029M3337K6134
12247A206210j0713n076K8219K4769K8349K9087J417j4199j6128Q84M4761K7121
12235A344701L9063K8947r268K0503J81m47K7342O8411Q0972L7572J3070L3407
12223A684454L0418K616k1785K5959Q0146L2257O2811J23291O0774R4686Q7639
12212B263266K7654P2413R5551R8749J29919J42103J59293J71243J35864J78475
12202C474530K04594K19412K58830K80621L04171L65950M57620M85695N52528
$$ plain form
12193 6603951 7196594 7829947 8672423 9715691 10985137 12573818 14576363 17164524 20638404
12184 20638404 25368327 31915582 41123095 53695303 69991706 89225176 108865303
12177 108865303 125184742 134245617 133672235 123925165 108573781 92145278 77954249
12170 77954249 67319224 60397286 56699015 55669719 56693618 58957632 61490696 63308119
12162 63308119 63821834 63121474 62054261 61834107 63353892 66852853 71845599 77416263
12154 77416263 82376943 85758558 87474993 88589389 90846923 95910977 104616621 116291849
12146 116291849 128965101 140030025 147078738 148861681 145688915 139191428 131358899 123250383
12138 123250383 114965514 106482979 98013674 90261111 83959547 79500965 76688795 74912997
$$ packed form
12193F603951N92643O33353Q42476J043268J269446J588681K002545K588161L473880
12184B0638404M729923O547255R207513J2572208J6296403J9233470J9640127
12177A08865303J6319439R060875n73382r747070j5351384j6428503j4191029
12170G7954249j0635025o921938l698271j029296J023899K264014K533064J817423
12162F3308119N13715p00360j067213k20154J519785L498961M992746N570664
12154G7416263M960680L381615J716435J114396K257534N064054Q705644J1675228
12146A16291849J2673252J1064924P048713J782943l172766o497487p832529q108516
12138A23250383q284869q482535q469305p752563o301564m458582k812170j775798
$$ plain form
12130 74912997 73381612 71468108 68820895 65482259 62027218 59056025 57105536 56399751
12122 56399751 57129837 59619679 64190284 71241799 81059372 93345373 106503174 117888556
12114 117888556 124469745 123916427 115837897 102496215 87765184 74722707 64490235
12107 64490235 56949944 51646923 48022368 45608639 43911486 42480922 40975203 39152673
12099 39152673 36945739 34585568 32279559 30261803 28502526 27031182 25840525 24828812
12091 24828812 23941361 23152290 22446462 21767221 21083252 20488267 19923954 19377868 18924853
12082 18924853 18517780 18086370 17699944 17339501 17036531 16795008 16606132 16470375 16445369
12073 16445369 16581796 16979639 17749972 18776202 20119832 21672794 23250366 24627134
$$ packed form
12130G4912997j531385j913504k647213l338636l455041k971193j950489p05785
12122E6399751P30086K489842M570605P051515R817573J2286001J3157801J1385382
12114A17888556O581189n53318q078530j3341682j4731031j3042477j0232472
12107F4490235p540291n303021l624555k413729j697153j430564j505719j822530
12099C9152673k206934k360171k306009k017756j759277j471344j190657j011713
12091B4828812q87451p89071p05828o79241o83969n94985n64313n46086m53015
12082A8924853m07073m31410l86426l60443l02970k41523j88876j35757k5006
12073A6445369J36427L97843P70333J026230J343630J552962J577572J376768
$$ plain form
12065 24627134 25496816 25736956 25279227 24160876 22547227 20692861 18811994 17130842
12057 17130842 15714059 14593220 13721768 13103783 12615704 12205698 11856798 11559562 11353310
12048 11353310 11198126 11033607 10853934 10667221 10493477 10283621 10053189 9787253 9481795
12039 9481795 9150112 8821260 8515862 8259754 8021690 7800472 7618552 7456301 7304056
12030 7304056 7169477 6992253 6798573 6665115 6527579 6391655 6219777 6064221 5928079
12021 5928079 5836556 5722752 5624488 5510281 5448333 5306347 5212719 5146127 5034784 4906441
12011 4906441 4790550 4707274 4591431 4506255 4423485 4335582 4229685 4199805 4162734 4059071
12001 4059071 4006764 3942481 3814275 3710002 3668514 3645901 3613028 3625551 3648811 3593739 3503922
$$ packed form
12065B4627134Q69682K40140m57729j118351j613649j854366j880867j681152
12057A7130842j416783j120839q71452o17985m88079m10006l48900k97236k06252
12048A1353310j55184j64519j79673j86713j73744k09856k30432k65936l05458
12039I481795l31683l28852l05398k56108k38064k21218j81920j62251j52245
12030G304056j34579j77224j93680j33458j37536j35924j71878j55556j36142
12021E928079r1523j13804r8264j14207o1948j41986r3628o6592j11343j28343
12011D906441j15891q3276j15843q5176q2770q7903j05897k9880l7071j03663
12001D059071n2307o4283j28206j04273m1488k2613l2873J2523K3260n5072q9817
$$ plain form
11990 3503922 3395960 3372837 3320902 3248859 3161831 3047549 2945152 2885280 2829878 2772953 2708486
11979 2708486 2649841 2583092 2510137 2475035 2474636 2457328 2365058 2302623 2282546 2268702 2220672 2180590
11967 2180590 2157384 2132262 2090818 2048335 2015862 2019513 2010684 1962123 1920127 1878915 1884942 1838993
11955 1838993 1766646 1733035 1698432 1673835 1636980 1600327 1564618 1513361 1500058 1475699 1435111
11944 1435111 1443937 1437119 1376366 1341467 1346960 1316012 1309871 1298751 1254261 1181022 1181241 1189280 1198151
11931 1198151 1197557 1157203 1136466 1124970 1102274 1032106 996940 991620 955283 925216 896550 875213
11919 875213 902244 923711 881808 837219 808075 796937 832047 832627 851979 834027 787609 755717
11907 755717 744548 732592 700743 699108 707404 717054 739178 770174 734077 706529 718092 690851
$$ packed form
11990C503922j07962k3123n1935p2043q7028j14282j02397n9872n5402n6925o4467
11979B708486n8645o6749p2955l5102l99j7308r2270o2435k0077j3844m8030m0082
11967B180590k3206k5122m1444m2483l2473L651q829m8561m1996m1212O027m5949
11955A838993p2347l3611l4603k4597l6855l6653l5709n1257j3303k4359m0588
11944A435111Q826o818o0753l4899N493l0948o141j1120m4490p3239K19Q039Q871
11931A198151n94m0354k0737j1496k2696p0168l5166n320l6337l0067k8666k1337
11919H75213K7031K1467m1903m4589k9144j1138L5110N80J9352j7952m6418l1892
11907G55717j1169j1956l1849j635Q296R650K2124L0996l6097k7548J1563k7241
$$ plain form
11895 690851 641510 616332 646926 605829 630460 614656 587366 593599 572786 561903 541295 525184
11883 525184 497033 478852 502339 493392 490487 482205 465398 448374 455284 442091 431192 427931
11871 427931 453979 435194 409884 383509 353817 386276 418019 394252 392553 357955 325191 297356
11859 297356 286837 284301 278120 292983 310730 325228 347050 340201 359524 375703 394108 380044
11847 380044 385418 370464 335819 331943 314031 277798 247674 240627 222893 225723 235961 207268
11835 207268 210563 237972 240457 240074 268066 275366 231239 220571 229388 269213 286390 277620 277615 287422
11821 287422 310994 329149 381711 335649 302139 271591 252532 280722 259941 261153 272930 256243
11809 256243 236155 227573 236281 237512 255373 242732 209128 181082 188316 208347 226874 236984
$$ packed form
11895F90851m9341k5178L0594m1097K4631j5804k7290O233k0813j0883k0608j6111
11883E25184k8151j8181K3487q947k905q282j6807j7024O910j3193j0899l261
11871D27931K6048j8785k5310k6375k9692L2459L1743k3767j699l4598l2764k7835
11859B97356j0519k536o181J4863J7747J4498K1822o849J9323J6179J8405j4064
11847C80044N374j4954l4645l876j7912l6233l0124p047j7734K830J0238k8693
11835B07268L295K7409K485l83K7992P300m4127j0668Q817L9825J7177q770nR807
11821B87422K3572J8155N2562m6062l3510l0548j9059K8190k0781J212J1777j6687
11809B56243k0088q582Q708J231J7861j2641l3604k8046P234K0031J8527J0110
$$ plain form
11797 236984 241229 237537 234428 206601 166374 168021 172032 152728 149083 109830 40909 32964 13684
11784 13684 10434 26734 16748 47022 63523 73627 81267 75301 68218 97574 83642 76936 104460
11771 104460 117331 143178 108577 81256 66828 78117 84656 98352 79793 43702 10435 38410
11759 38410 80934 91620 119644 81157 81216 140673 191669 201231 150122 179377 208378 277235
11747 277235 340798 382489 452282 518388 596249 668367 712272 748705 737653 700828 597926
11736 597926 498903 451147 396796 334781 315236 314186 295895 353012 374738 375885 366574 340204
11724 340204 342349 355827 366538 394105 423010 449421 465302 485501 562156 621966 589998 539575
11712 539575 561348 655631 721317 756225 789888 791734 773458 742709 693559 615573 611268 582959
$$ packed form
11797B36984M245l692l109k7827m0227J647M011j9304l645l9253o8921p945j9280
11784A3684l250J6300r986L0274J6501J0104P640n966p083K9356j3932o706K7524
11771A04460J2871K5847l4601k7321j4428J1289O539J3696j8559l6091l3267K7975
11759C8410M2524J0686K8024l8487N9N9457N0996R562n1109K9255K9001O8857
11747B77235O3563M1691O9793O6106P7861P2118M3905L6433j1052l6825j02902
11736E97926r9023m7756n4351o2015j9545j050j8291N7117K1726J147r311k6370
11724C40204K145J3478J0711K7567K8905K6411J5881K0199P6655N9810l1968n0423
11712E39575K1773R4283O5686L4908L3663J846j8276l0749m9150p7986m305k8309
$$ plain form
11700 582959 569779 532687 486758 456066 417032 435601 467362 453815 422295 371981 350123
11689 350123 345037 333755 336686 295472 306752 410482 480369 500544 548743 590413 641176 673391
11677 673391 618771 539132 486626 437589 427622 378506 329346 286474 252904 277438 272597 247457
11665 247457 199560 159180 131780 154807 168013 141720 126623 127897 98904 62121 74153 102540
11653 102540 63965 42750 88413 133791 166301 179616 144070 126145 98039 94512 116648 150850
11641 150850 135509 108852 149226 211529 182053 108773 34947 -749 8594 24892 71834 57329
11629 57329 7488 -12515 -14038 28357 71137 102770 70290 39764 42707 69070 52608 27653
11617 27653 36057 47148 31764 9138 8813 16786 16295 9247 19291 -3403 -16456 -19696 16576
$$ packed form
11700E82959j3180l7092m5929l0692l9034J8569L1761j3547l1520n0314k1858
11689C50123n086j1282K931m1214J1280J03730O9887K0175M8199M1670N0763L2215
11677F73391n4620p9639n2506m9037r967m9116m9160m2872l3570K4534m841k5140
11665B47457m7897m0380k7400K3027J3206k6293j5097J274k8993l6783J2032K8387
11653A02540l8575k1215M5663M5378L2510J3315l5546j7925k8106l527K2136L4202
11641A50850j5341k6657M0374O2303k9476p3280p3826l5696R343J6298M6942j4505
11629E7329m9841k0003j523M2395M2780L1633l2480l0526K943K6363j6462k4955
11617B7653Q404J1091j5384k2626l25P973m91p048J0044k2694j3053l240L6272
$$ plain form
11604 16576 31197 20137 -21117 -21872 21070 36865 39246 -8911 -16886 -34546 -19153 -11169 -27239
11591 -27239 -10871 16294 4042 -5218 -2377 -7568 -8244 -40959 2288 25949 44724 63992 32281
11578 32281 56028 61462 20364 19144 23086 7171 -3242 -6202 -2914 -53567 -25783 10556 22436
11565 22436 20149 -4166 -54168 -47297 -2770 10006 49836 77994 104611 67127 42848 36448
11553 36448 -6572 -18276 9762 38906 36936 57307 91203 62468 22575 40342 24664 10822
11541 10822 -4927 -7949 -26891 -28717 -37144 13783 34934 14165 7002 -2498 13911 -17174 -25566
11528 -25566 -14938 2281 -6734 -11815 33915 22493 8002 16601 14703 17782 26021 25248 30266
11515 30266 13657 16563 -8008 8935 35527 34606 31432 24324 10057 -13084 11052 19047 7861
$$ packed form
11604A6576J4621j1060m1254p55M2942J5795K381m8157p975j7660J5393P984j6070
11591b7239J6368K7165j2252r260K841n191o76l2715M3247K3661J8775J9268l1711
11578C2281K3747N434m1098j220L942j5915j0413k960L288n0653K7784L6339J1880
11565B2436k287k4315n0002O871M4527J2776L9830K8158K6617l7484k4279o400
11553C6448m3020j1704K8038K9144j970K0371L3896k8735l9893J7767j5678j3842
11541A0822j5749l022j8942j826q427N0927K1151k0769p163r500J6409l1085q392
11528b5566J0628J7219r015n081M5730j1422j4491Q599j898L079Q239p73N018
11515C0266j6609K906k4571J6943K6592r21l174p108j4267k3141K4136P995j1186
$$ plain form
11502 7861 12015 968 17674 59374 63627 29946 -3939 17687 17693 19350 43995 76822 75229
11489 75229 18013 -24904 -33700 -51800 -43130 -30813 -25252 -21437 9759 40134 55352 37571
11477 37571 -2676 -32188 -22040 5268 6137 5693 -34239 -26300 -24146 -17786 -30205 -49434 -51011
11464 -51011 -48726 -24298 -3570 56398 74448 72899 44734 62169 87711 75297 41150 40169
11452 40169 88782 51121 -6019 -36511 -16443 -5340 8214 12561 -8707 9178 -19004 -52021
11440 -52021 -83133 -83812 -55075 -19612 -6704 -30868 -25931 -23423 -21925 -36433 -814 -34468 -33461
11427 -33461 -26802 -19822 -15039 -31347 -54611 -33981 935 21928 40938 49627 7007 -17520
11415 -17520 -25576 -34701 -40427 -12972 20476 20539 39598 38518 17834 11575 26865 -12225 -6243
$$ packed form
11502G861M154j1047J6706M1700M253l3681l3885K1626OJ657K4645L2827j593
11489G5229n7216m2917q796j8100Q670J2317N561L815L1196L0375J5218j7781
11477C7571m0247k9512J0148K7308Q69m44l9932P939K154O360j2419j9229j577
11464e1011K285K4428K0728N9968J8050j549k8165J7435K5542j2414l4147r81
11452D0169M8613l7661n7140l0492K0068J1103J3554M347k1268J7885k8182l3017
11440e2021l1112o79K8737L5463J2908k4164M937K508J498j4508L5619l3654J007
11427c3461O659O980M783j6308k3264K0630L4916K0993J9010Q689m2620k4527
11415a7520q056r125n726K7455L3448O3J9059j080k0684o259J5290l9090N982
$$ plain form
11402 -6243 -8812 -2265 7790 -13142 -30541 -19266 -21751 10597 38436 8890 -6178 -30225
11390 -30225 -38689 -54300 -48741 -29109 -8001 -6465 -3039 3228 -61464 -95336 -91520 -64917 -49742
11377 -49742 -47940 -68046 -66046 -23602 -6239 -30162 7994 2561 -14040 -4683 -23435 -31047 -22258
11364 -22258 12105 15621 -17 -26062 -39699 -42235 -73337 -62206 -63622 -44127 -48260 -41541 9404
11351 9404 48667 61257 36828 12673 25376 20441 -39009 -53255 -36995 14093 17443 56355
11339 56355 54380 23928 14098 -10557 -27453 -17436 -28516 -28688 -31326 -14854 15522 30218 3136
11326 3136 -3816 -33337 -31495 -51400 -38758 -47715 -48538 12001 39531 46122 41974 31007 -7984
11313 -7984 -23016 -30003 -63136 -77569 -48641 -20976 -1584 -23131 -13295 17540 18044 -1978 -8819
$$ packed form
11402f243k569O547J0055k0932j7399J1275k485L2348K7839k9546j5068k4047
11390c0225q464j5611N559J9632K1108J536L426O267o4692l3872L816K6603J5175
11377d9742J802k0106K000M2444J7363k3923L8156n433j6601R357j8752p612Q789
11364b2258L4363L516j5638k6045j3637k536l1102J1131j416J9495m133O719N0945
11351I404L9263J2590k4429k4155J2703m935n9450j4246J6260N1088L350L8912
11339E6355j975l0452r830k4655j6896J0017j1080j72k638J6472L0376J4696k7082
11326C136o952k9521J842j9905J2642q957q23O0539K7530O591m148j0967l8991
11313g984j5032o987l3133j4433K8928K7665J9392k1547R836L0835N04k0022o841
$$ plain form
11300 -8819 5141 -14897 -20200 20732 -24326 -71038 -53968 -17128 -7821 3407 8405 -82 -13359
11287 -13359 53625 103619 94494 73184 76968 52959 1066 -21027 -1905 20018 11126 -5406
11275 -5406 -16424 6504 24305 6616 29364 17894 28847 19993 61034 120876 121533 59642
11263 59642 33462 20090 6215 3758 13972 11834 -20233 -1177 26950 42815 83570 41427
11251 41427 30380 8412 -3462 -32116 -11218 17607 53397 67247 67979 50942 74706 97837
11239 97837 86558 65652 73145 63689 69343 75667 115315 99111 60645 55692 66281 90146 109478
11226 109478 120914 108809 85568 63865 37625 16611 22489 29549 29818 6956 2278 -8624
11214 -8624 -15779 -4390 -9979 2143 7001 4424 -11760 13006 65391 91320 74054 62399 34134
$$ packed form
11300h819J3960k0038n303M0932m5058m6712J7070L6840R307J1228M998q487j3277
11287a3359O6984M9994r125k1310L784k4009n1893k2093J9122K1923q892j6532
11275e406j1018K2928J7801j7689K2748j1470J0953q854M1041N9842O57o1891
11263E9642k6180j3372j3875k457J0214k138l2067J9056K8127J5865M0755m2143
11251D1427j1047k1968j1874k8654K0898K8825L5790J3850P32j7037K3764K3131
11239I7837j1279k0906P493r456N654O324L9648j6204l8466m953J0589K3865J9332
11226A09478J1436j2105k3241k1703k6240k1014N878P060K69k2862m678j0902
11214h624p155J1389n589J2122M858k577j6184K4766N2385K5929j7266j1655k8265
$$ plain form
11201 34134 43528 17404 -10325 18936 52524 85794 97918 63771 72984 80738 46994 53403
11189 53403 44006 -9211 -15290 10485 27997 52874 48903 52382 59993 22267 7745 47761 23124
11176 23124 34902 19020 13974 39500 63717 84030 72841 75476 56868 80531 82365 95793
11164 95793 102424 125988 100712 100352 93155 52114 44628 68437 84997 80836 65023 26848 -19745
11151 -19745 -35484 -71 607 1090 6131 -1695 15445 21918 18105 39012 88492 87051 88625 78980
11137 78980 41494 8571 9285 80712 95653 57781 43292 38677 47402 44169 49737 51599 87953
11124 87953 56835 -5756 -545 49012 75224 86360 50482 17842 -5515 70461 65330 81456
11112 81456 71474 18909 -7234 5098 -15171 14275 37672 77454 86255 79200 68189 69570
$$ packed form
11201C4134R394k6124k7729K9261L3588L3270J2124l4147R213P754l3744O409
11189E3403r397n3217o079K5775J7512K4877l971L479P611l7726j4522M0016k4637
11176B3124J1778j5882n046K5526K4217K0313j1189K635j8608K3663J834J3428
11164I5793O631K3564k5276l60p197m1041p486K3809J6560m161j5813l8175m6593
11151a9745j5739L5413O78M83N041p826J7140O473l813K0907M9480j441J574r645
11137G8980l7486l2923P14P1427J4941l7872j4489m615Q725l233N568J862L6354
11124H7953l1118o2591N211M9557K6212J1136l5878l2640k3357P5976n131J6126
11112H1456r982n2565k6143J2332k0269K9446K3397L9782Q801p055j1011J381
$$ plain form
11100 69570 71403 98675 120400 125669 97985 73853 54609 36867 41666 76583 62458 66129
11088 66129 97039 76396 19860 -5982 -4982 3679 -15649 -33547 75 40814 60505 99770
11076 99770 72211 44226 23092 23563 24912 -26260 -54180 -51552 -51111 -29373 -21421 -47066 5190
11063 5190 10882 14020 68142 104216 79991 73593 63384 33924 21874 27786 13787 -4644 -7453
11050 -7453 -19225 -26786 -11094 40286 130570 178624 222857 259104 261768 253566 240548 185849
11038 185849 174950 140245 133853 129371 142913 141699 138001 133273 91685 35473 6907 50948
11026 50948 78148 43072 66321 73070 56139 26088 33079 73841 111089 113629 106794 131234
11014 131234 204634 245560 267910 298833 316374 279646 241580 216108 160284 121507 120996 113388
$$ packed form
11100F9570J833K7272K1725N269k7684k4132j9244j7742M799L4917j4125L671
11088F6129L0910k0643n6536k5842J000Q661j9328j7898L3622M0739J9691L9265
11076I9770k7559k7985k1134M71J349n1172k7920K628M41K1738P952k5645N2256
11063E190N692L138N4122L6074k4225o398j0209k9460j2050N912j3999j8431k809
11050g453j1772p561J5692N1380R0284M8054M4233L6247K664q202j3018n4699
11038A85849j0899l4705o392m482J3542j214l698m728m1588n6212k8566M4041
11026E0948K7200l5076K3249O749j6931l0051O991M0762L7248K540o835K4440
11014A31234P3400M0926K2350L0923J7541l6728l8066k5472n5824l8777n11p608
$$ plain form
11002 113388 123494 119288 127002 134204 108066 87810 111239 117677 108049 104152 91319 70234 71828
10989 71828 84430 118716 125789 88524 95015 127673 118645 103086 75766 61150 23025 34254
10977 34254 55360 35376 29043 29596 51477 58710 56514 59488 65879 100385 96719 98556 162287
10964 162287 169392 138749 93666 92299 76780 64558 52279 40725 53221 43387 46112 87344
10952 87344 83917 67830 97054 107110 105571 102206 79851 66429 89546 104471 92285 71555
10940 71555 99568 138829 184361 230622 247939 205452 196994 228349 267116 302133 400044 536435
10928 536435 688216 910779 1257272 1666366 2059105 2272647 2285470 1969842 1540437 1195001
10918 1195001 926121 749243 649602 558220 472836 434050 423157 396005 371337 339895 319570
$$ packed form
11002A13388J0106m206P714P202k6138k0256K3429O438r628l897j2833k1085J594
10989G1828J2602L4286P073l7265O491L2658r028j5559k7320j4616l8125J1229
10977C4254K1106j9984o333N53K1881P233k196K974O391L4506l666J837O3731
10964A62287P105l0643m5083j367j5519j2222j2279j1554J2496r834K725M1232
10952H7344l427j6087K9224J0056j539l365k2355j3422K3117J4925j2186k0730
10940G1555K8013L9261M5532M6261J7317m2487q458L1355L8767L5017R7911J36391
10928E36435J51781K22563L46493M09094L92739K13542J2823l15628m29405l45436
10918A195001k68880j76878r9641r1382q5384l8786j0893k7152k4668l1442k0325
$$ plain form
10907 319570 301519 321890 304772 265050 280222 277459 265090 300606 323479 308449 299238 273503
10895 273503 240735 224777 199894 131614 115152 112706 130795 150464 162534 169323 195713 178826
10883 178826 175101 193959 197090 220048 234426 242312 220150 192749 147578 98675 104406 119815
10871 119815 111400 73152 50203 65874 132566 188905 206730 189734 191405 156611 142000 124978
10859 124978 127746 119690 134185 152854 159032 142774 151473 165856 151179 165968 159129 170310
10847 170310 206660 184509 130585 119185 197368 169058 155288 140994 140038 142383 186941 221881
10835 221881 224846 222761 187686 149994 187067 203137 209530 195148 193151 197564 208845 210854 193196
10822 193196 185025 176210 173687 181876 154871 172762 230959 232363 195093 159483 141863 149962 153654
$$ packed form
10907C19570j8051K0371j7118l9722J5172k763j2369L5516K2873j5030r211k5735
10895B73503l2768j5958k4883o8280j6462k446J8089J9669J2070O789K6390j6887
10883A78826l725J8858L131K2958J4378P886k2162k7401m5171m8903N731J5409
10871A19815q415l8248k2949J5671O6692N6339J7825j6996J671l4794j4611j7022
10859A24978K768q056J4495J8669O178j6258Q699J4383j4677J4789o839J1181
10847A70310L6350k2151n3924j1400P8183k8310j3770j4294r56K345M4558L4940
10835B21881K965k085l5075l7692L7073J6070O393j4382j997M413J1281K009j7658
10822A93196q171q815k523Q189k7005J7891N8197J404l7270l5610j7620Q099L692
$$ plain form
10809 153654 161425 164993 148248 142756 161412 166578 163279 213811 239242 226401 242606 259050
10797 259050 241960 248065 276996 220744 207120 187120 150617 153849 131131 150989 184348 187782
10785 187782 166596 133884 124348 118624 138194 162105 136971 120300 124302 142860 137680 143479
10773 143479 128221 162233 181380 200749 237936 257067 281830 283797 318433 300440 262084 274430
10761 274430 327244 422742 474447 518803 533233 493399 419358 398861 340943 287000 279825 235453
10749 235453 177884 177626 191626 210660 237558 263266 264853 235505 190164 179837 189858 203911
10737 203911 233348 248516 240105 228071 216391 191591 218199 254579 242703 224378 214475 189806
10725 189806 161301 148789 128737 164319 150892 169918 219694 195368 200305 232790 257252 211467
$$ packed form
10809A53654P771L568j6745n492J8656N166l299N0532K5431j2841J6205J6444
10797B59050j7090O105K8931n6252j3624k0000l6503L232k2718J9858L3359L434
10785A87782k1186l2712r536n724J9570K3911k5134j6671M002J8558n180N799
10773A43479j5258L4012J9147J9369L7187J9131K4763J967L4636j7993l8356J2346
10761B74430N2814R5498N1705M4356J4430l9834p4041k0497n7918n3943p175m4372
10749B35453n7569k58J4000J9034K6898K5708J587k9348m5341j0327J0021J4053
10737B03911K9437J5168q411j2034j1680k4800K6608L6380j1876j8325r903k4669
10725A89806k8505j2512k0052L5582j3427J9026M9776k4326M937L2485K4462m5785
$$ plain form
10713 211467 170196 196461 236128 216636 216919 201445 182701 215737 226213 232026 231859 235604 219192
10700 219192 208388 239639 247983 251783 233033 183462 132226 119404 144839 213740 208648 173653
10688 173653 134971 94610 91441 108649 129823 127359 170359 195136 204412 220437 218936 243348
10676 243348 251387 269992 264950 262486 271588 259613 221627 199958 219542 186360 189085 232081
10664 232081 331035 350309 362603 362018 374051 363801 365353 365670 392808 475596 493883 486358 474382
10651 474382 430812 388933 330274 325218 309972 320458 339329 387506 381760 368690 380125 393153
10639 393153 361994 350877 376744 413115 394005 357979 322765 301462 307293 320102 306041 278278
10627 278278 244953 215000 241932 282662 300516 307543 292498 284360 282341 284914 288497 312814
$$ packed form
10713B11467m1271K6265L9667j9492K83j5474j8744L3036J0476N813j67L745j6412
10700B19192j0804L1251Q344L800j8750m9571n1236j2822K5435O8901n092l4995
10688A73653l8682m0361l169J7208K1174k464M3000K4777R276J6025j501K4412
10676B43348Q039J8605n042k464R102j1975l7986k1669J9584l3182K725M2996
10664B32081R8954J9274J2294n85J2033j0250J552L17K7138Q2788J8287p525j1976
10651D74382m3570m1879n8659n056j5246J0486J8871M8177n746j3070J1435J3028
10639C93153l1159j1117K5867L6371j9110l6026l5214k1303N831J2809j4061k7763
10627B78278l3325k9953K6932M0730J7854P027j5045q138k019K573L583K4317
$$ plain form
10615 312814 309430 342270 370016 361608 383670 383969 401632 426837 453283 467728 460302 474308
10603 474308 466870 470184 457865 493003 510098 531599 613414 642821 633468 623290 619637 646310
10591 646310 699234 724749 751866 751562 734335 754509 743098 732777 688683 664344 704654 738493
10579 738493 796424 821932 865020 915294 937566 944651 937835 977400 1046294 1110327 1171213 1182011
10567 1182011 1196705 1245013 1287639 1278954 1251470 1262465 1260453 1266895 1362070 1427766 1468136 1538494
10555 1538494 1598380 1660194 1706271 1757076 1861753 2004818 2127671 2249626 2404434 2529909
10545 2529909 2576008 2582899 2630313 2718708 2831888 2986850 3233286 3437046 3639297 3912287
10535 3912287 4144981 4337646 4604359 4887512 5212114 5626727 6141788 6773027 7575298
$$ packed form
10615C12814l384L2840K7746q408K2062K99J7663K5205K6446J4445p426J4006
10603D74308p438L314j2319L5138J7095K1501Q1815K9407r353j0178l653K6673
10591F46310N2924K5515K7117l04j7227K0174j1411j0321m4094k4339M0310L3839
10579G38493N7931K5508M3088N0274K2272P085o816L9565O8894O4033O0886J0798
10567A182011J4694M8308M2626q685k7484J0995k012O442R5175O5696M0370P0358
10555A538494N9886O1814M6077N0805J04677J43065J22853J21955J54808J25475
10545B529909M6099O891M7414Q8395J13180J54962K46436K03760K02251K72990
10535C912287K32694J92665K66713K83153L24602M14613N15061O31239Q02271
$$ plain form
10526 7575298 8592860 9765817 11027108 12246607 13490988 14684632 15758675 17010134
10518 17010134 18789164 21341454 24904070 29720797 36082037 44723642 56789636 74412300
10510 74412300 101473052 144050195 207751653 287966499 364144221 415654658 425775024
10503 425775024 379171991 297314781 221113298 166667305 131037572 107808297 92151293
10496 92151293 81246807 73491989 67722377 63067515 58897011 55035789 51456763 48304988
10488 48304988 45544658 43062331 40737976 38480950 36447519 34710268 33188973 31853330
10480 31853330 30613729 29425821 28269698 27210426 26277258 25464226 24690978 23946121 23227871
10471 23227871 22556610 21987616 21401134 20742675 20084400 19398090 18776215 18186824 17574771
$$ packed form
10526G575298J017562J172957J261291J219499J244381J193644J074043J251459
10518A7010134J779030K552290L562616M816727O361240Q641605J2065994J7622664
10510G4412300K7060752M2577143O3701458Q0214846P6177722N1510437J0120366
10503D25775024m6603033q1857210p6201483n4445993l5629733k3229275j5657004
10496I2151293j0904486p754818n769612m654862m170504l861222l579026l151775
10488D8304988k760330k482327k324355k257026k033431j737251j521295j335643
10480C1853330j239601j187908j156123j059272r33168q13032p73248p44857p18250
10471B3227871o71261n68994n86482o58459o58275o86310o21875n89391o12053
$$ plain form
10462 17574771 17067943 16674977 16290546 15886603 15440688 15054391 14706232 14372604 14019181
10453 14019181 13681759 13362261 13040850 12729575 12456114 12184817 11900636 11636855 11395880
10444 11395880 11098686 10827335 10533296 10285979 10066283 9822783 9592875 9367102 9178499
10435 9178499 8996817 8797589 8625810 8539709 8463037 8329184 8170847 7990138 7816787 7646609
10425 7646609 7471359 7315095 7179782 7038307 6869907 6701889 6561511 6425539 6255031
10416 6255031 6111505 5996469 5900689 5813130 5712892 5610561 5521386 5425521 5378903 5303104
10406 5303104 5216530 5101813 5005992 4889165 4757424 4655099 4605398 4583376 4506688 4420496
10396 4420496 4353340 4269390 4208389 4146130 4065605 4007416 3923721 3853941 3819617 3749188 3671830
$$ packed form
10462A7574771n06828l92966l84431m03943m45915l86297l48159l33628l53423
10453A4019181l37422l19498l21411l11275k73461k71297k84181k63781k40975
10444A1395880k97194k71351k94039k47317k19696k43500k29908k25773j88603
10435I178499j81682j99228j71779q6101p6672j33853j58337j80709j73351j70178
10425G646609j75250j56264j35313j41475j68400j68018j40378j35972j70508
10416F255031j43526j15036r5780q7559j00238j02331q9175r5865m6618p5799
10406E303104q6574j14717r5821j16827j31741j02325m9701k2022p6688q6192
10396D420496o7156q3950o1001o2259q0525n8189q3695o9780l4324p0429p7358
$$ plain form
10385 3671830 3605319 3583523 3552334 3538485 3484738 3489419 3478550 3464312 3367813 3265853 3114835
10374 3114835 2963597 2871634 2788811 2759404 2726608 2687571 2663133 2611157 2544989 2469362 2388080
10363 2388080 2328921 2290857 2265964 2251937 2223877 2186957 2148048 2116624 2084970 2046934 2007414
10352 2007414 1970324 1928133 1826909 1765215 1763339 1717680 1612033 1622546 1632997 1620436 1617264
10341 1617264 1586707 1550810 1540033 1504008 1426722 1401977 1373405 1353286 1362598 1331974 1341075 1360296
10329 1360296 1376908 1380509 1353165 1343524 1351311 1346225 1346969 1331541 1306332 1294605 1253506 1232035
10317 1232035 1221167 1181251 1158460 1144055 1074766 1062029 1052857 1023199 978723 951754 963400
10306 963400 978006 934551 887851 887043 888827 880095 861703 857108 814408 850911 874718 875712 849746
$$ packed form
10385C671830o6511k1796l1189j3849n3747M681j0869j4238r6499j01960j51018
10374C114835j51238r1963q2823k9407l2796l9037k4438n1976o6168p5627q1282
10363B388080n9159l8064k4893j4027k8060l6920l8909l1424l1654l8036l9520
10352B007414l7090m2191j01224o1694j876m5659j05647J0513J0451j2561l172
10341A617264l0557l5897j0777l6025p7286k4745k8572k0119R312l0624R101J9221
10329A360296J6612L601k7344r641P787n086P44j5428k5209j1727m1099k1471
10317A232035j0868l9916k2791j4405o9289j2737r172k9658m4476k6969J1646
10306I63400J4606m3455m6700q08J784q732j8392m595m2700L6503K3807R94k5966
$$ plain form
10293 849746 833714 856624 927719 957971 930919 924644 896637 910470 942045 927098 925455 882028
10281 882028 858101 859742 876643 878042 889713 887460 880000 914358 943769 929879 916610 947468
10269 947468 999197 1035012 1089503 1103071 1133532 1169279 1217016 1300685 1382405 1513589 1635070
10258 1635070 1746575 1889577 2072471 2259964 2460589 2626265 2793040 3010874 3324587
10249 3324587 3771940 4412054 5338036 6628699 8525720 11371913 15923977 22936928 32460557
10240 32460557 43202615 52381300 57147247 55550380 47623962 37029126 27533983 20753182
10232 20753182 16415575 13632276 11707865 10400760 9502924 8854281 8335111 7889103 7465036
10223 7465036 7048071 6659568 6280886 5912692 5576354 5293312 5055804 4872167 4639565
$$ packed form
10293H49746j6032K2910P1095L0252k7052o275k8007J3833L1575j4947j643m3427
10281H82028k3927J641J6901J399J1671k253p460L4358K9411j3890j3269L0858
10269I47468N1729L5815N4491J3568L0461L5747M7737Q3669Q1720J31184J21481
10258A635070J11505J43002J82894J87493K00625J65676J66775K17834L13713
10249C324587M47353O40114R25982J290663J897021K846193M552064P012951R523629
10240C2460557J0742058R178685M765947j596867p926418j0594836r495143o780801
10232B0753182m337607k783299j924411j307105q97836o48643n19170m46008m24067
10223G465036m16965l88503l78682l68194l36338k83042k37508j83637k32602
$$ plain form
10214 4639565 4392423 4220862 4083754 3981152 3860499 3723384 3578039 3448728 3352357 3254866
10204 3254866 3129651 3056143 3002467 2928897 2819831 2729059 2637345 2565592 2529879 2456468 2380029
10193 2380029 2298913 2231676 2224752 2198540 2131059 2072409 2032571 1993636 1956784 1944137 1907988
10182 1907988 1889374 1841202 1789312 1757645 1714770 1694845 1661801 1625009 1574771 1533225 1479851
10171 1479851 1444426 1416619 1363504 1318170 1302202 1282725 1257450 1244300 1265199 1261513 1204081
10160 1204081 1207403 1174028 1120814 1104038 1107934 1088932 1077048 1076894 1090449 1154785 1247294 1326549
10148 1326549 1395845 1416286 1419524 1398522 1336004 1258412 1202102 1180744 1137583 1157995 1233461
10137 1233461 1240258 1153782 1037546 971306 933520 914642 884812 841186 792046 819684 822773
$$ packed form
10214D639565k47142j71561j37108j02602j20653j37115j45345j29311r6371r7491
10204C254866j25215p3508n3676p3570j09066r0772r1714p1753l5713p3411p6439
10193B380029q1116o7237o924k6212o7481n8650l9838l8935l6852j2647l6149
10182A907988j8614m8172n1890l1667m2875j9925l3044l6792n0238m1546n3374
10171A479851l5425k7807n3115m5334j5968j9477k5275j3150K0899l686n7432
10160A204081L322l3375n3214j6776L896j9002j1884j54J3555O4336R2509P9255
10148A326549O9296K0441L238k1002o2518p7592n6310k1358m3161K0412P5466
10137A233461O797q6476j16236o6240l7786j8878k9830m3626m9140K7638L089
$$ plain form
10126 822773 801874 746604 696994 678030 664998 647271 631824 608504 550662 523998 538984
10115 538984 535320 550507 586615 610100 611434 555264 543222 575933 538294 483042 454273 439458
10103 439458 434057 443754 453226 421534 404561 398726 408625 429183 418666 392196 388915 452527 514535
10090 514535 510150 524649 603309 674838 784315 984113 1236539 1602865 2019286 2316692
10080 2316692 2447892 2374595 2054115 1675718 1377050 1125867 968761 871156 794429 738138
10070 738138 693175 692619 683366 631280 612784 606963 590099 572997 534465 524328 517517 493099
10058 493099 449678 407950 404356 389511 348051 329013 345098 342736 337067 320784 342418 345351
10046 345351 326487 306344 243719 248713 314209 329885 310421 252220 218998 282464 326634 333737
$$ packed form
10126H22773k0899n5270m9610j8964j3032j7727j5447k3320n7842k6664J4986
10115E38984l664J5187L6108K3485J334n6170j2042L2711l7639n5252k8769j4815
10103D39458n401R697R472l1692j6973n835R899K0558j0517k6470l281O3612O2008
10090E14535m385J4499P8660P1529J09477J99798K52426L66326M16421K97406
10080B316692J31200p3297l20480l78397k98668k51183j57106r7605p6727n6291
10070G38138m4963n56r253n2086j8496n821j6864j7102l8532j0137o811k4418
10058D93099m3421m1728l594j4845m1460j9038J6085k362n669j6283K1634K933
10046C45351j8864k0143o2625M994O5496J5676j9464n8201l3222O3466M4170P103
$$ plain form
10034 333737 332818 311680 314822 269034 220384 212242 251017 275695 269762 254071 235624 255683
10022 255683 262347 252686 217812 231692 245775 282514 267739 248846 268292 352202 307971 243573
10010 243573 211761 229849 245944 235053 226304 210789 203703 171559 182450 224949 217409 217224
9998 217224 188422 162425 144236 197023 196187 194048 186108 182494 180789 234074 177609 114646 93759
9985 93759 105204 148638 184504 159012 167703 177153 181379 184001 175912 160878 131986 118459 130487
9972 130487 135952 153064 211256 246458 268158 280996 260102 226542 223368 250825 246839 218444
9960 218444 219703 206188 174148 159271 140646 157913 164118 154757 136949 124681 127454 153747
9948 153747 173270 169687 159657 137059 107347 109606 119944 123488 99169 111717 127425 149153
$$ packed form
10034C33737r19k1138L142m5788m8650q142L8775K4678n933j5691j8447K0059
10022B55683O664r661l4874J3880J4083L6739j4775j8893J9446Q3910m4231o4398
10010B43573l1812J8088J6095j0891q749j5515p086l2144J0891M2499p540j85
9998B17224k8802k5997j8189N2787q36k139p940l614j705N3285n6465o2963k0887
9985I3759J1445M3434L5866k5492Q691R450M226K622q089j5034k8892j3527J2028
9972A30487N465J7112N8192L5202K1700J2838k0894l3560l174K7457l986k8395
9960B18444J259j3515l2040j4877j8625J7267O205r361j7808j2268K773K6293
9948A53747J9523l583j0030k2598k9712K259J0338L544k4319J2548J5708K1728
$$ plain form
9936 149153 169265 208717 206256 169068 169000 177339 163103 147572 143952 149410 161890 161179 150800
9923 150800 148941 126620 110990 106922 122283 132890 127647 153574 133216 153969 177599 191566
9911 191566 166758 161336 135099 128993 110063 84353 99766 115598 114043 130924 146356 156170
9899 156170 131300 174802 180766 203711 204532 165022 116138 88272 87615 112232 117695 108787 84066
9886 84066 70996 100817 126516 148805 138177 134109 150904 208065 220238 179259 190613 181053
9874 181053 147368 156197 169690 172307 192312 196380 189376 183041 144114 150725 119907 106288 120274
9861 120274 119231 129363 128291 131236 170356 207343 196885 144782 91337 118418 107675 100663
9849 100663 121223 135062 107917 104345 119636 124778 136146 189933 235891 245294 245893 227708 213893
$$ packed form
9936A49153K0112L9452k461l7188o8Q339j4236j5531l620N458J2480p11j0379
9923A50800j859k2321j5630m068J5361J0607n243K5927k0358K0753K3630J3967
9911A91566k4808n422k6237o106j8930k5710J5413J5832j555J6881J5432R814
9899A56170k4870M3502N964K2945Q21l9510m8884k7866o57K4617N463q908k4721
9886H4066j3070K9821K5699K2289j0628m068J6795N7161J2173m0979J1354r560
9874A81053l3685Q829J3493K617K0005M068p004o335l8927O611l0818j3619J3986
9861A20274j043J0132j072K945L9120L6987j0458n2103n3445K7081j0743p012
9849A00663K0560J3839k7145l572J5291N142J1368N3787M5958R403N99j8185j3815
$$ plain form
9836 213893 197584 165643 161348 185166 219926 215575 218311 161547 115770 115876 144602 180409 159132
9823 159132 151523 167595 238169 301363 343385 364695 342165 320853 341807 349034 368827 382798
9811 382798 384409 348139 340499 325607 316580 274486 246788 241261 239351 205213 212703 237932 222129
9798 222129 194259 157023 178424 206813 214349 200906 220413 264046 299471 270929 244719 245309
9786 245309 213101 223748 255995 270174 274366 256571 234660 211687 228483 258913 269998 266358
9774 266358 268123 243923 259636 256488 242459 277386 295875 277629 247607 239896 245371 232098
9762 232098 242095 229700 255146 270108 280516 299189 280842 256712 238160 234932 243723 273190
9750 273190 300941 290812 250557 245194 237728 276785 281415 293633 301860 274146 228229 252103
$$ packed form
9836B13893j6309l1941m295K3818L4760m351K736n6764m5777J06K8726L5807k1277
9823A59132p609J6072P0574O3194M2022K1310k2530k1312K0954P227J9793J3971
9811C82798J611l6270p640j4892r027m2094k7698n527j910l4138P490K5229j5803
9798B22129k7870l7236K1401K8389P536j3443J9507M3633L5425k8542k6210N90
9786B45309l2208J0647L2247J4179M192j7795k1911k2973J6796L0430J1085l640
9774B66358J765k4200J5713l148j4029L4927J8489j8246l0022p711N475j3273
9762B32098R997j2395K5446J4962J0408J8673j8347k4130j8552l228Q791K9467
9750B73190K7751j0129m0255n363p466L9057M630J2218Q227k7714m5917K3874
$$ plain form
9738 252103 289958 281947 276179 296373 378007 406214 400288 384172 377865 389700 337859 292807
9726 292807 291322 326503 396741 391838 358000 378846 385531 404987 400015 352492 310195 330575
9714 330575 356211 359751 370529 342090 327319 332231 322555 314848 337956 359302 352934 350761 368661
9701 368661 358026 350176 364307 348381 348412 399690 421946 442000 409426 433663 447601 418856
9689 418856 412401 403542 422521 450136 448600 419990 402220 372048 361621 406085 428432 461657
9677 461657 477205 476395 481330 477213 495551 495412 463913 439284 469157 482957 473322 491516 514355
9664 514355 511592 525127 523284 537080 513642 527687 563303 597236 579808 583303 575384 553565
9652 553565 567951 611666 584161 575098 578373 615017 617847 610566 598945 599818 654894 667454 632267
$$ packed form
9738B52103L7855q011n768K0194Q1634K8207n926j6116o307J1835n1841m5052
9726B92807j485L5181P0238m903l3838K0846O685J9456m972m7523m2297K0380
9714C30575K5636L540J0778k8439j4771M912r676p707K3108K1346o368k173J7900
9701C68661j0635p850J4131j5926L1N1278K2256K0054l2574K4237J3938k8745
9689D18856o455q859J8979K7615j536k8610j7770l0172j0427M4464K2347L3225
9677D61657J5548q10M935m117J8338j39l1499k4629K9873J3800r635J8194K2839
9664E14355k763J3535j843J3796k3438J4045L5616L3933j7428L495p919k1819
9652E53565J4386M3715k7505r063L275L6644K830p281j1621Q73N5076J2560l5187
$$ plain form
9639 632267 637334 656140 671081 673825 685396 673732 693574 707275 736431 749190 736760 732189
9627 732189 714836 767892 768629 787503 805660 799564 798740 835752 850037 865945 862226 869986 904708
9614 904708 925354 921648 913852 940002 957998 961375 944686 1010795 1030697 997852 989784 1012882
9602 1012882 1014029 1004045 1024821 1066558 1077425 1089824 1119127 1163560 1135746 1124572 1127853 1114770
9590 1114770 1141009 1237220 1300486 1279184 1274934 1295193 1314755 1323334 1345520 1327013 1354009 1386199
9578 1386199 1425980 1417265 1451829 1513512 1544512 1537427 1524315 1541364 1570787 1607367 1589593 1583737
9566 1583737 1596322 1637861 1720688 1738183 1763574 1798920 1799036 1867147 1944644 1967469 1996019 2026274
9554 2026274 2043071 2068651 2092368 2136119 2202774 2268428 2290013 2328542 2415680 2487436 2536012
$$ packed form
9639F32267N067J8806J4941K744J1571j1664J9842J3701K9156J2759j2430m571
9627G32189j7353N3056P37J8874J8157o096q24L7012J4285J5908l719P760L4722
9614I04708K0646l706p796K6150J7996L377j6689O6109J9902l2845q068K3098
9602A012882J147r984K0776M1737J0867J2399K9303M4433k7814j1174L281j3083
9590A114770K6239R6211O3266k1302m250K0259J9562Q579K2186j8507K6996L2190
9578A386199L9781q715L4564O1683L1000p085j3112J7049K9423L6580j7774n856
9566A583737J2585M1539Q2827J7495K5391L5346J16O8111P7497K2825K8550L0255
9554B026274J6797K5580K3717M3751O6655O5654K1585L8529Q7138P1756M8576
$$ plain form
9543 2536012 2601041 2643751 2660760 2712799 2737902 2777328 2857824 2917353 2947933 3031235 3129660
9532 3129660 3193729 3228954 3300017 3360719 3452193 3529916 3616063 3692571 3785398 3861345 3979972
9521 3979972 4099424 4226113 4315347 4386879 4461219 4551577 4680062 4787929 4888956 5038941
9511 5038941 5207368 5357469 5537987 5695868 5859701 6000622 6136497 6296164 6456843 6631897
9501 6631897 6843068 7038395 7265739 7496185 7732973 7977595 8211031 8432068 8699648 8952675
9491 8952675 9202136 9485134 9776799 10059663 10360738 10637380 10976098 11346495 11684536 11989609
9481 11989609 12328725 12693400 13068540 13409763 13776286 14154932 14550629 14910380 15287556
9472 15287556 15668895 16065084 16414443 16734479 17057457 17370847 17635314 17918251 18196427
$$ packed form
9543B536012O5029M2710J7009N2039K5103L9426Q0496N9529L0580Q3302R8425
9532C129660O4069L5225P1063O0702R1474P7723Q6147P6508R2827P5947J18627
9521C979972J19452J26689Q9234P1532P4340R0358J28485J07867J01027J49985
9511E038941J68427J50101J80518J57881J63833J40921J35875J59667J60679J75054
9501F631897K11171J95327K27344K30446K36788K44622K33436K21037K67580K53027
9491H952675K49461K82998K91665K82864L01075K76642L38718L70397L38041L05073
9481A1989609L39116L64675L75140L41223L66523L78646L95697L59751L77176
9472A5287556L81339L96189L49359L20036L22978L13390K64467K82937K78176
$$ plain form
9463 18196427 18452266 18678462 18866121 19020583 19157451 19269359 19368217 19411367 19423492 19403885
9453 19403885 19375426 19362985 19242946 19084635 18985340 18827610 18642074 18386897 18148397 17912597
9443 17912597 17672408 17463140 17236545 16929494 16630054 16343170 16024158 15709994 15408425
9434 15408425 15125323 14824172 14516449 14196731 13884060 13626725 13348578 13059609 12793720
9425 12793720 12549889 12321227 12057114 11792445 11525701 11274119 11021724 10829002 10615371
9416 10615371 10390529 10142818 9884531 9681375 9502725 9323239 9154923 8942420 8761354
9407 8761354 8559690 8349885 8193831 8071718 7932674 7798346 7655795 7503411 7354393 7153235
9397 7153235 6956060 6825481 6742871 6635835 6490416 6393396 6277427 6151234 6061249 5977686
$$ packed form
9463A8196427K55839K26196J87659J54462J36868J11908R8858M3150J2125j9607
9453A9403885k8459j2441j20039j58311r9295j57730j85536k55177k38500k35800
9443A7912597k40189k09268k26595l07051k99440k86884l19012l14164l01569
9434A5408425k83102l01151l07723l19718l12671k57335k78147k88969k65889
9425A2793720k43831k28662k64113k64669k66744k51582k52395j92722k13631
9416A0615371k24842k47711k58287k03156j78650j79486j68316k12503j81066
9407H761354k01664k09805j56054j22113j39044j34328j42551j52384j49018k01158
9397G153235j97175j30579q2610j07036j45419r7020j15969j26193q9985q3563
$$ plain form
9387 5977686 5880380 5736555 5553010 5438016 5381964 5331190 5229239 5105448 5008657 5005190 4970364
9376 4970364 4900426 4789986 4653017 4526125 4450361 4418708 4354765 4298194 4197699 4097276
9366 4097276 4014996 3953548 3872089 3801291 3769420 3756537 3685251 3617752 3549491 3481860 3411931
9355 3411931 3350685 3319046 3272445 3237701 3214902 3180081 3128612 3088565 3055375 3029984 2962566
9344 2962566 2880292 2797435 2737077 2704660 2694957 2665563 2653591 2611917 2581583 2534805 2514936 2485847
9332 2485847 2470551 2394317 2313950 2315992 2295298 2251879 2209982 2157223 2118633 2111230 2063512 2032547
9320 2032547 2016139 1954475 1909997 1863290 1885925 1869822 1861915 1858724 1811256 1776313 1719630 1691542
9308 1691542 1660695 1638831 1605810 1593172 1585166 1519953 1482303 1527582 1529906 1485894 1479781 1504910
$$ packed form
9387E977686r7306j43825j83545j14994n6052n0774j01951j23791r6791l467l4826
9376D970364o9938j10440j36969j26892p5764l1653o3943n6571j00495j00423
9366D097276q2280o1448q1459p0798l1871j2883p1286o7499o8261o7631o9929
9355C411931o1246l1639m6601l4744k2799l4821n1469m0047l3190k5391o7418
9344B962566q2274q2857o0358l2417r703k9394j1972m1674l0334m6778j9869k9089
9332B485847j5296p6234q0367K042k0694m3419m1897n2759l8590p403m7718l0965
9320B032547j6408o1664m4478m6707K2635j6103p907l191m7468l4943n6683k8088
9308A691542l0847k1864l3021j2638q006o5213l7650M5279K324m4012o113K5129
$$ plain form
9296 1504910 1451079 1397147 1372605 1374711 1354859 1346241 1330365 1308644 1292620 1280057 1254063 1244927
9284 1244927 1221486 1219269 1195127 1176867 1165464 1173317 1176691 1141246 1107140 1079474 1091435 1079384
9272 1079384 1027186 1024653 1049138 1064472 1030741 1002407 1009572 1019179 986418 961015 956992 944532
9260 944532 959345 941031 909450 891403 896061 828528 798986 814311 799776 781181 787813 792517
9248 792517 790193 791982 808777 795075 792497 809292 822572 802365 779470 766797 728331 695575
9236 695575 690247 696745 693127 708897 688862 683399 637705 632230 622308 571998 562104 559788 583736
9223 583736 570145 578499 606643 590600 569626 578653 573732 545255 554211 533871 510644 526789
9211 526789 528795 522254 523399 532137 536546 531850 529698 526657 523615 543176 509477 479667 473150 471367
$$ packed form
9296A504910n3831n3932k4542K106j9852q618j5876k1721j6024j2563k5994r136
9284A244927k3441k217k4142j8260j1403P853L374l5445l4106k7666J1961j2051
9272A079384n2198k533K4485J5334l3731k8334P165R607l2761k5403m023j2460
9260I44532J4813j8314l1581j8047M658o7533k9542J5325j4535j8595O632M704
9248G92517k324J789J6795j3702k578J6795J3280k0207k2895j2673l8466l2756
9236F95575n328O498l618J5770k0035n463m5694n475r922n0310r894k316K3948
9223E83736j3591Q354K8144j6043k0974R027m921k8477Q956k0340k3227J6145
9211E26789K006o541J145Q738M409m696k152l041l042J9561l3699k9810o517j783
$$ plain form
9197 471367 427430 410477 421074 434170 443818 438314 446005 460552 440896 466373 479122 462667
9185 462667 468528 454077 458197 449087 424580 416604 378058 380742 365696 386984 409745 399588 366663
9172 366663 359389 366737 389296 404868 395783 380661 350786 366571 325699 320064 336508 336476 314579
9159 314579 319710 286249 280716 317214 331348 293803 258543 249460 248355 300720 337547 356845
9147 356845 383093 342738 325345 363166 366948 298649 288817 261678 265016 255120 239766 220516
9135 220516 204763 194988 200290 198649 252619 299081 290794 275432 250823 241352 235355 219965 219944
9122 219944 251916 251264 235607 234377 225000 220546 228864 257789 271547 272523 264794 242530 248515 268578
9108 268578 252755 209994 228006 251014 238302 264716 305070 304887 266650 251018 224068 190769
$$ packed form
9197D71367m3937j6953J0597J3096R648n504P691J4547j9656K5477J2749j6455
9185D62667N861j4451M120r110k4507p976l8546K684j5046K1288K2761j0157l2925
9172C66663p274P348K2559J5572r085j5122k9875J5785m0872n635J6444l2k1897
9159C14579N131l3461n533L6498J4134l7545l5260r083j105N2365L6827J9298
9147C56845K6248m0355j7393L7821L782o8299r832k7139L338r896j5354j9250
9135B20516j5753r775N302j641N3970M6462q287j5362k4609r471n997j5390k1
9122B19944L1972o52j5657j230r377m454Q318K8925J3758R76p729k2264N985K0063
9108B68578j5823m2761J8012K3008j2712K6414M0354j83l8237j5632k6950l3299
$$ plain form
9096 190769 213297 273870 303918 323727 338286 303395 229626 182984 174658 209876 233430 233065
9084 233065 231078 238951 242016 219772 216793 219235 221397 237796 285829 284983 268062 243870 208558
9071 208558 224198 186591 162716 179341 229861 270872 236291 201056 170671 190824 190770 182968
9059 182968 187647 209594 239263 218681 197611 181950 177582 188576 186168 202233 214261 197023
9047 197023 178586 191179 199968 232001 213995 165515 119646 168615 188396 157564 137101 165278
9035 165278 184992 167128 164028 149688 134292 153915 195086 176565 196024 205771 213759 166663
9023 166663 126814 163862 186455 172364 162102 166053 186166 218690 186688 191558 199241 183415
9011 183415 168883 152833 128366 90761 78005 86699 58601 54535 90092 118881 160546 171222
$$ packed form
9096A90769K2528O0573L0048J9809J4559l4891p3769m6642q326L5218K3554l65
9084B33065j987P873L065k2244k979K442K162J6399M8033q46j6921k4192l5312
9071B08558J5640l7607k3875J6625N0520M1011l4581l5235l0385K0153n4p802
9059A82968M679K1947K9669k0582k1070j5661m368J0994k408J6065J2028j7238
9047A97023j8437J2593Q789L2033j8006m8480m5869M8969J9781l0832k0463K8177
9035A65278J9714j7864l100j4340j5396J9623M1171j8521J9459R747P988m7096
9023A66663l9849L7048K2593j4091j0262L951K0113L2524l2002M870P683j5826
9011A83415j4532j6050k4467l7605j2756Q694k8098m066L5557K8789M1665J0676
$$ plain form
8999 171222 160618 136576 142505 135180 111389 95574 118574 133269 151733 176482 159115 140694
8987 140694 153978 163574 135109 111327 114448 120223 160123 166996 172676 175097 141370 133678 142324
8974 142324 97914 51769 61443 76618 69627 58188 74184 84542 109633 86900 58361 77827
8962 77827 112815 143545 154990 146371 104245 67386 84789 85767 68535 52960 10440 -2768
8950 -2768 23739 31955 43129 80646 86019 89783 88648 119114 112106 70985 56899 80523 71242
8937 71242 68701 42434 33992 58528 60246 39737 36605 49498 23655 6096 21345 52768 41946
8924 41946 55904 73651 79649 42542 40331 18276 23152 33948 52839 37668 -30075 -57381
8912 -57381 -19668 59071 87178 90747 76224 75777 123151 113294 45346 21300 48893 62673 78503
$$ packed form
8999A71222j0604k4042N929p325k3791j5815K3000J4695J8464K4749j7367j8421
8987A40694J3284R596k8465k3782L121N775L9900O873N680K421l3727p692Q646
8974A42324m4410m6145R674J5175o991j1439J5996J0358K5091k2733k8539J9466
8962G7827L4988L0730J1445q619m2126l6859J7403R78j7232j5575m2520j3208
8950b768K6507Q216J1174L7517N373L764j135L0466p008m1121j4086K3624r281
8937G1242k541k6267q442K4536J718k0509l132J2893k5843j7559J5249L1423j0822
8924D1946J3958J7747N998l7107k211k2055M876J0796J8891j5171o7743k7306
8912e7381L7713P8739K8107L569j4523m47M7374r857o7948k4046K7593J3780J5830
$$ plain form
8899 78503 92993 84637 95416 106530 73742 34347 59942 70017 53906 -2721 447 -2209
8887 -2209 -88 13336 14126 16165 39445 28591 36437 85671 73785 37374 49704 69516 70264
8874 70264 77424 70920 60679 76933 105463 90662 66267 65189 75842 63582 59910 61402 48649
8861 48649 33458 22323 62101 70396 65223 36803 9504 4428 30792 25697 5400 -1657 40566
8848 40566 68982 102830 123343 85530 50293 26435 20636 14291 7083 19325 11074 22873 36529
8835 36529 73361 114206 106514 106099 84424 28995 26404 34569 17500 46509 62244 52119 63490
8822 63490 75048 106791 77135 47385 60581 11267 -25160 3843 297 17904 31251 43259
8810 43259 29979 55786 52894 40250 78635 115893 82041 39243 58563 68202 49627 38922
$$ packed form
8899G8503J4490q356J0779J1114l2788l9395K5595J0075j6111n6627L168k656
8887b209K121J3424P90K039K3280j0854P846M9234j1886l6411J2330J9812P48
8874G0264P160o504j0241J6254K8530j4801k4395j078J0653j2260l672J492j2753
8861D8649j5191j1135L9778Q295n173k8420k7299n076K6364n095k0297p057M2223
8848D0566K8416L3848K0513l7813l5237k3858n799o345p208J2242q251J1799J3656
8835C6529L6832M0845p692m15k1675n5429k591Q165j7069K9009J5735j0125J1371
8822F3490J1558L1743k9656k9750J3196m9314l6427K9003l546J7607J3347J2008
8810D3259j3280K5807k892j2644L8385L7258l3852m2798J9320R639j8575j0705
$$ plain form
8798 38922 65711 60098 54779 71211 115791 104682 69176 35484 37555 79033 66514 43373
8786 43373 55205 31117 6079 20846 53432 50984 25224 9905 8777 22492 28673 60727
8774 60727 20826 3964 -36579 -40965 -35131 -4199 36640 44812 35962 22966 -36312 -37316 -19300
8761 -19300 11200 21890 36934 62606 53829 40722 51316 52548 39647 36494 74065 90271
8749 90271 81135 70238 76237 101713 141083 124678 99351 86189 91545 135215 150957 120485
8737 120485 111634 107635 81197 33788 33787 66865 79630 91268 98194 41395 31980 31332 -619 -17914
8723 -17914 10226 45132 88305 95602 97446 50316 37228 40844 83582 72875 71618 101460 62018
8710 62018 77591 96497 60433 74677 62916 31914 8158 -28909 26368 80665 95020 83087
$$ packed form
8798C8922K6789n613n319J6432M4580j1109l5506l3692K071M1478j2519k3141
8786D3373J1832k4088k5038J4767L2586k448k5760j5319j128J3715O181L2054
8774F0727l9901j6862m0543m386N834L0932M0839Q172q850j2996n9278j004J8016
8761a9300L0500J0690J5044K5672q777j3107J0594J232j2901l153L7571J6206
8749I0271r136j0897N999K5476L9370j6405k5327j3162N356M3670J5742l0472
8737A20485q851l999k6438m7409jL3078J2765J1638O926n6799r415o48l1951j7295
8723a7914K8140L4906M3173P297J844m7130j3088L616M2738j0707j257K9842l9442
8710F2018J5573J8906l6064J4244j1761l1002k3756l7067N5277N4297J4355j1933
$$ plain form
8698 83087 105805 99886 87663 110445 84446 21319 -13289 10372 84143 108596 117513 102104
8686 102104 64857 50109 -21458 3256 34068 61841 47312 14755 16258 32369 27904 73359
8674 73359 75702 68328 93670 77850 46479 60338 48768 27867 17633 19213 37185 22740
8662 22740 39612 39781 23997 -8357 -28344 -27392 -17710 -17911 -15091 9693 20738 6798 1439 39282
8648 39282 74084 78592 72179 83611 89836 88685 51256 16129 54668 63647 51074 53193 15169
8635 15169 -2031 6039 21664 52444 69545 26695 5670 19982 60329 48579 34506 25655
8623 25655 35680 63763 42171 25400 6626 -12974 -3911 29234 52023 41787 37403 34969
8611 34969 39068 37507 50413 41223 47397 42603 27734 58581 80992 121614 150893 129275 105223
$$ packed form
8698H3087K2718n919j2223K2782k5999o3127l4608K3661P3771K4453Q917j5409
8686A02104l7247j4748p1567K4714L0812K7773j4529l2557J503J6111m465M5455
8674G3359K343p374K5342j5820l1371J3859j1570k0901j0234J580J7972j4445
8662B2740J6872J69j5784l2354j9987R52R682k01K820K4784J1045j3940n359L7843
8648C9282L4802M508o413J1432O225j151l7429l5127L8539Q979j2573K119l8024
8635A5169j7200Q070J5625L0780J7101m2850k1025J4312M0347j1750j4073q851
8623B5655J0025K8083k1592j6771j8774j9600R063L3145K2789j0236m384k434
8611C4969M099j561J2906r190O174m794j4869L0847K2411M0622K9279k1618k4052
$$ plain form
8598 105223 85460 72141 63703 26190 34675 35823 28960 51423 51163 15719 -1387 -14428 -7107
8585 -7107 8090 28568 36542 43707 54808 50261 27092 -93 -7575 15601 27067 46330 68806
8572 68806 51400 33620 23144 10874 -24595 -44438 3313 16998 -13344 -26418 -31468 -49114
8560 -49114 -39091 4612 26870 37128 65128 36911 -21631 -3709 -18549 -9282 35807 41710
8548 41710 19521 5437 23666 59264 83366 93789 123174 148047 138754 116735 76365 52203
8536 52203 10517 -31303 -37079 -66076 -47548 -49272 -62629 -54669 -39249 18278 6547 -3385 17522
8523 17522 15904 -1698 4243 13271 33826 26425 32922 27520 16846 1459 40810 54544 14230
8510 14230 4141 -26132 -38388 -23373 -17242 -13835 10434 -9872 -46112 -44171 -34025 11383
$$ packed form
8598A05223j9763j3319q438l7513Q485J148o863K2463k60l5444j7106j3041P321
8585g107J5197K0478P974P165J1101m547k3169k7185p482K3176J1466J9263K2476
8572F8806j7406j7780j0476j2270l5469j9843M7751J3685l0342j3074n050j7646
8560d9114J0023M3703K2258J0258K8000k8217n8542J7922j4840R267M5089N903
8548D1710k2189j4084J8229L5598K4102J0423K9385K4873r293k2019m0370k4162
8536E2203m1686m1820n776k8997J8528j724j3357P960J5420N7527j1731r932K0907
8523A7522j618j7602N941R028K0555p401O497n402j0674j5387L9351J3734m0314
8510A4230j0089l0273j2256J5015O131L407K4269k0306l6240J941J0146M5408
$$ plain form
8498 11383 536 -13575 -17797 13370 92016 89186 47501 35270 20113 30577 14974 -12454
8486 -12454 -10762 18148 38486 19800 -39346 -78705 -58228 -13563 -14178 -31585 -17708 -6341
8474 -6341 -16114 -34557 -6568 -1636 10122 58058 83653 51000 -5576 -58775 -28288 -14291
8462 -14291 12979 -993 577 14998 15189 7292 -3022 -5090 -10139 -38359 -6321 32017 13707
8449 13707 3499 13203 11304 -7062 -30513 17323 62843 71207 38436 14197 36778 59350
8437 59350 102145 74950 61767 59346 53865 -2155 -4461 6445 -23906 -60656 -23362 -31365 -99348
8424 -99348 -91261 -67625 -12852 13438 -2583 -13696 -24859 -6046 2968 7393 -4720 13431
8412 13431 11940 1529 10294 -5390 -10705 7926 45822 73917 34821 156 -32566 -13957
$$ packed form
8498A1383j0847j4111m222L1167P8646k830m1685j2231j5157J0464j5603k7428
8486a2454J692K8910K0338j8686n9146l9359K0477M4665o15j7407J3877J1367
8474f341r773j8443K7989M932J1758M7936K5595l2653n6576n3199L0487J3997
8462a4291K7270j3972J570J4421J91p897j0314k068n049k8220L2038L8338j8310
8449A3707j0208R704j899j8366k3451M7836M5520Q364l2771k4239K2581K2572
8437E9350M2795k7195j3183k421n481n6020k306J0906l0351l6750L7294q003o7983
8424i9348Q087K3636N4773K6290j6021j1113j1163J8813R014M425j2113J8151
8412A3431j491j0411Q765j5684n315J8631L7896K8095l9096l4665l2722J8609
$$ plain form
8400 -13957 -10815 -11062 1106 -6256 -35553 -30544 -10524 8064 10338 22232 35084 55078 58636
8387 58636 34063 -3775 -28236 -29577 -34968 -36419 -39952 -61392 -47121 -59777 -14771 -33589 -39471
8374 -39471 -44513 -61127 -61601 -54620 -18325 6442 41430 112928 92183 36361 11543 -909 25961
8361 25961 9389 -11189 -14709 -32424 -10009 41587 31318 22270 12089 1772 -26557 -4906
8349 -4906 7843 -9356 1968 25811 55364 16323 10620 -6904 20180 23000 -20347 -39912
8337 -39912 -40412 -34115 2741 13887 23843 -14024 3737 7442 23916 76850 86400 88293 93434
8324 93434 81508 71232 48224 33284 4400 -31232 -33778 5565 11790 29811 48158 83733
8312 83733 151310 223773 319287 446198 559113 589084 536549 420982 304152 214505 193633
$$ packed form
8400a3957L142k47J2168p362k9297N009K0020J8588K274J1894J2852J9994L558
8387E8636k4573l7838k4461j341n391j451l533k1440J4271j2656M5006j8818n882
8374c9471n042j6614m74O981L6295K4767L4988P1498k0745n5822k4818j2452K6870
8361B5961j6572k0578l520j7715K2415N1596j0269r048j0181j0317k8329K1651
8349d906J2749j7199J1324K3843K9553l9041n703j7524K7084K820m3347j9565
8337c9912n00O297L6856J1146R956l7867J7761L705J6474N2934R550J893N141
8324I3434j1926j0276k3008j4940k8884l5632k546L9343O225J8021J8347L5575
8312H3733O7577P2463R5514J26911J12915K9971n2535j15567j16830q9647k0872
$$ plain form
8301 193633 181804 209705 156135 102696 117232 93082 42816 38357 102943 107272 101910 74499
8289 74499 81721 79795 71035 42261 66970 90378 89420 65568 68876 55620 29269 17002 33593
8276 33593 48238 66747 90435 87981 100630 163814 227198 307325 404198 509236 584498 610013
8264 610013 543245 418133 297126 236793 175348 106026 99726 129738 173034 160341 148655
8253 148655 101607 72575 61071 38175 11536 28940 50397 47719 6249 6093 52550 44994
8241 44994 51458 39793 29955 40258 47083 59866 60391 67379 59427 23193 -8261 609 19387
8228 19387 2668 24315 44786 44332 47203 64039 39312 -12754 -34653 -19955 -24072 -1968 -1825
8215 -1825 -11575 1552 10030 32963 32852 5612 15811 -2928 -44673 -64311 -64913 -28693 -20264
$$ packed form
8301A93633j1829K7901n3570n3439J4536k4150n0266m459O4586M329n362k7411
8289G4499P222j926q760k8774K4709K3408r58k3852L308j3256k6351j2267J6591
8276C3593J4645J8509K3688k454J2649O3184O3384Q0127R6873J05038P5262K5515
8264F10013o6768j25112j21007o0333o1445o9322o300L0012M3296j2693j1686
8253A48655m7048k9032j1504k2896k6639J7404K1457k678m1470j56M6457p556
8241D4994O464j1665r838J0303O825J2783N25O988p952l6234l1454Q870J8778
8228A9387j6719K1647K0471m54K871J6836k4727n2066k1899J4698m117K2104J43
8215a825r750J3127Q478K2933j11k7240J0199j8739m1745j9638o02L6220Q429
$$ plain form
8202 -20264 -10678 27207 31785 34255 26930 18407 26897 23203 49921 38748 1 28453 55634
8189 55634 14944 -16846 -16897 4059 18508 -1098 27189 18307 56914 51926 29642 26845 31466
8176 31466 37507 59726 47990 52259 48992 16972 -17507 -41037 -88315 -71556 -13308 3181
8164 3181 5270 -32916 -2646 33268 26377 22785 18325 -11780 -25560 -28197 -29990 -11290 -26850
8151 -26850 -15573 -20355 -23106 -54698 -37469 -19677 -10468 19487 56533 48183 32356 12501 -4870
8138 -4870 26672 68670 79957 75049 40844 50972 72744 88607 110700 140520 152721 143739
8126 143739 149541 154870 126428 84400 82287 95078 109697 100317 78700 90374 80143 68924
8114 68924 58726 26228 36290 768 -9441 3186 9611 -9155 -22872 -34325 -35200 -9551
$$ packed form
8202b0264R586L7885M578K470p325q523Q490l694K6718j1173l8747K8452K7181
8189E5634m0690l1790n1K0956J4449j9606K8287q882L8607m988k2284k797M621
8176C1466O041K2219j1736M269l267l2020l4479k3530m7278J6759N8248J6489
8164C181K089l8186L0270L5914o891l592m460l0105j3780k637j793J8700j5560
8151b6850J1277m782k751l1592J7229J7792R209K9955L7046q350j5827j9855j7371
8138d870L1542M1998J1287m908l4205J0128K1772J5863K2093K9820J2201q982
8126A43739N802N329k8442m2028k113J2791J4619r380k1617J1674j0231j1219
8114F8924j0198l2498J0062l5522j0209J2627O425j8766j3717j1453q75K5649
$$ plain form
8102 -9551 32607 49742 32967 44800 90941 105193 85257 67367 92227 56299 11056 31754
8090 31754 65889 71637 137766 174003 165804 190492 267738 309439 333604 359742 342823 281411
8078 281411 238037 220537 204581 179763 159456 151025 160110 153247 132551 113417 88931 119626
8066 119626 122629 102428 79953 52509 36374 41310 61124 73805 86939 48682 23062 23971
8054 23971 32811 28267 2646 4447 53460 102876 98005 94371 74227 59105 97566 146016 226073
8041 226073 256136 266333 251213 227400 222777 245576 232334 245807 227715 181972 144099 131015
8029 131015 110955 142243 123100 109925 126005 98082 61100 74711 88984 93824 101407 73303
8017 73303 69668 56450 56889 54765 32488 42618 55386 52249 76891 111937 84638 99195 104120
$$ packed form
8102i551M2158J7135j6775J1833M6141J4252j9936j7890K4860l5928m5243K0698
8090C1754L4135N748O6129L6237q199K4688P7246M1701K4165K6138j6919o1412
8078B81411m3374j7500j5956k4818k0307q431R085o863k0696j9134k4486L0695
8066A19626L003k0201k2475k7444j6135M936J9814J2681J3134l8257k5620R09
8054B3971Q840m544k5621J801M9013M9416m871l634k0144j5122L8461M8450Q0057
8041B26073L0063J0197j5120k3813m623K2799j3242J3473j8092m5743l7873j3084
8029A31015k0060L1288j9143j3175J6080k7923l6982J3611J4273M840P583k8104
8017G3303l635j3218M39k124k2277J0130J2768l137K4642L5046k7299J4557M925
$$ plain form
8004 104120 95209 95002 88534 122172 122298 105350 130484 134392 134381 135673 131829 156413 163535 160319
7990 160319 145333 57359 39841 62284 84270 90392 96376 106993 70676 78303 74267 87353
7978 87353 93081 85125 75617 72596 35254 20619 16806 40777 57531 13806 14300 28095 43430
7965 43430 90799 88307 67061 52301 27769 23257 71428 48081 56878 48954 34430 81983 114812
7952 114812 104786 85277 47945 16206 26020 7792 29982 54657 88998 111618 71575 64245
7940 64245 63579 42284 77618 81035 35837 14215 43209 74644 45369 17115 10726 31230 34858
7927 34858 19471 2482 -9413 488 21627 60743 63594 54061 64993 56550 12917 -17166 -18191
7914 -18191 17677 62560 46117 30012 19331 8387 -26470 6769 30363 43105 14149 7770
$$ packed form
8004A04120q911k07o468L3638J26j6948K5134L908j1J292l844K4584P122l216
7990A60319j4986q7974j7518K2443K1986O122N984J0617l6317P627m036J3086
7978H7353N728p956r508l021l7342j4635l813K3971J6754m3725M94J3795J5335
7965D3430M7369k492k1246j4760k4532m512M8171k3347Q797p924j4524M7553L2829
7952A14812j0026j9509l7332l1739R814j8228K2190K4675L4341K2620m0043p330
7940F4245o66k1295L5334L417m5198k1622K8994L1435k9275k8254o389K0504L628
7927C4858j5387j6989j1895R901K1139L9116K851r533J0932q443m3633l0083j025
7914a8191L5868M4883j6443j6105j0681j0944l4857L3239K3594J2742k8956o379
$$ plain form
7902 7770 -4173 3910 79541 66618 41237 25092 15382 -20951 -49398 -9613 27467 18942 -2793
7889 -2793 -6198 21529 21147 26124 40568 79754 79712 9741 -29798 -21197 54725 48492 26347 50104
7875 50104 75425 90520 93129 88869 66922 28627 -5586 -21674 -22274 -48373 -35049 9416 30897
7862 30897 42266 5542 -18859 -3319 994 28928 21130 22445 -158 -19549 7781 -2002 7759
7849 7759 17571 -19540 -71509 -39829 -31231 -27661 -2937 -1239 35448 39148 31127 29836 26806 3358
7835 3358 -314 -61183 -55441 14838 54929 43826 -6994 20 7665 27017 17257 234 -35496
7822 -35496 -65074 -84325 -92497 -86339 -83237 -122106 -105633 -101679 -127838 -86271 -24229 -13768 -7137
7809 -7137 32288 38621 31361 47219 58804 61783 73742 41509 14850 10742 9086 -12307 -37286
$$ packed form
7902G770j1943Q083P5631j2923k5381j6145r710l6333k8447L9785L7080q525k1735
7889b793l405K7727l82M977J4444L9186m2o9971l9539Q601P5922o233k2145K3757
7875E0104K5321J5095K609m260k1947l8295l4213j6088o00k6099J3324M4465K1481
7862C0897J1369l6724k4401J5540M313K7934p798J315k2603j9391K7330r783R761
7849G759R812l7111n1969L1680Q598L570K4724J698L6687L700q021j291l030k3448
7835C358l672o0869N742P0279M0091j1103n0820P014P645J9352r760j7023l5730
7822c5496k9578j9251q172O158L102l8869J6473L954k6159M1567O2042J0461O631
7809g137L9425O333p260J5858J1585K979J1959l2233k6659m108j656k1393k4979
$$ plain form
7796 -37286 -1903 -2483 -26264 -22658 5637 -14665 -31783 -28322 -32015 -33210 -15101 -4345 -20759
7783 -20759 -28527 -21023 -6240 -4971 8850 11617 -10170 -21121 14321 17301 15356 -10092 -51133
7770 -51133 -36771 -17728 20873 42838 24999 7425 -3434 -22176 -13841 15138 38248 40413
7758 40413 29905 31450 16377 3059 -1875 -15723 -24111 -15691 -48653 -35659 -55690 -61623 -61386
7745 -61386 -41271 -18921 -28740 -20430 -73596 -93467 -15082 7832 10613 30214 45844 26218
7733 26218 -2778 -14956 -55524 -64797 -17026 -9080 -38322 -52275 -24156 -59344 -53285 -26142
7721 -26142 -23991 -6312 -39863 -67188 -12638 8863 9867 -783 2534 -5824 -58416 -39124 -25314
7708 -25314 -25788 17464 51434 -1537 -50966 -44300 -25335 23420 30169 24198 64560 60178 11731
$$ packed form
7796c7286L5383n80k3781L606K8295k0302j7118L461l693j195J8109J0756j6414
7783b0759p768P504J4783J269J3821K767k1787j0951L5442K980j945k5448m1041
7770e1133J4362J9043L8601K1965j7839j7574j0859j8742Q335K8979K3110K165
7758D0413j0508J545j5073j3318m934j3848q388Q420l2962J2994k0031n933K37
7745f1386K0115K2350r819Q310n3166j9871P8385K2914K781J9601J5630j9626
7733B6218k8996j2178m0568r273M7771P946k9242j3953K8119l5188O059K7143
7721b6142K151J7679l3551k7325N4550K1501J004j0650L317q358n2592J9292J3810
7708b5314m74M3252L3970n2971m9429O666J8965M8755O749n971M0362m382m8447
$$ plain form
7695 11731 -13468 37795 9930 3907 8353 18779 27049 38616 34274 54110 28740 -35554 -59543
7682 -59543 -63138 -71439 -26948 -15860 6914 -10648 -11598 49479 64807 39244 19728 -8509 -34623
7669 -34623 -11661 30166 64283 30800 -28449 -5683 12499 32435 24442 13121 1006 1715
7657 1715 11526 32703 31560 -5945 22434 58860 45147 -22100 -14642 -19387 -36368 8336 -7802
7644 -7802 -59927 -45082 -68702 -55924 -20537 13508 -16915 -30990 -37499 -38676 -15373 -15578 -39451
7631 -39451 -53083 -62283 -73299 -54803 -46344 -46274 -36040 -26992 -52435 -27988 3102 -54603 -38478
7618 -38478 -14207 -22696 -29009 -28649 18617 26650 9183 -19311 -21927 -10674 -23429 -70782 -50227
7605 -50227 -47242 -40789 -42236 -45550 -30037 14294 -2265 8348 28845 3751 -36226 -31725 -48824
$$ packed form
7695A1731k5199N1263k7865o023M446J0426Q270J1567m342J9836k5370o4294k3989
7682e9543l595q301M4491J1088K2774j7562r50O1077J5328k5563j9516k8237k6114
7669c4623K2962M1827L4117l3483n9249K2766J8182J9936p993j1321j2115P09
7657A715R811K1177j143l7505K8379L6426j3713o7247P458m745j6981M4704j6138
7644g802n2125J4845k3620J2778L5387L4045l0423j4075o509j177K3303k05k3873
7631c9451j3632r200j1016J8496Q459P0J0234R048k5443K4447L1090n7705J6125
7618c8478K4271q489o313L60M7266Q033j7467k8494k616J1253j2755m7353K0555
7605e0227K985O453j447l314J5513M4331j6559J0613K0497k5094l9977M501j7099
$$ plain form
7592 -48824 -37936 -11293 -970 -8954 -45874 -68696 -36218 -47938 -39140 -34105 -49627 -25839
7580 -25839 -30020 3431 69629 89791 47131 23958 7441 6241 18626 -45477 -88514 -64628
7568 -64628 -10608 -32489 -54793 -28417 21760 -20891 -82656 -98191 -72837 -85354 -92107 -41679
7556 -41679 -8656 -42207 -46091 -35232 -9354 86 -25273 -42712 -38885 1547 12057 14279 29136
7543 29136 31199 -45335 -51595 17091 45965 42802 29904 26281 -2378 2271 10499 -1417 5487
7530 5487 -14211 3535 -4753 -8492 7151 7117 14150 12696 16968 78935 112597 31280 -4603 -1989
7516 -1989 3925 4779 16390 25268 41836 51536 44053 28766 -90 -33294 -53645 -39036 -8539
7503 -8539 -9516 -56133 -66058 -1210 5030 -24356 -54631 -64580 -42168 -33692 -48214 -57207 -57929 4331
$$ packed form
7592d8824J0888K6643J0323p984l6920k2822L2478j1720Q798N035j5522K3788
7580b5839m181L3451O6198K0162m2660k3173j6517j200J2385o4103m3037K3886
7568f4628N4020k1881k2304K6376N0177m2651o1765j5535K5354j2517o753N0428
7556d1679L3023l3551l884J0859K5878R440k5359j7439L827M0432J0510K222J4857
7543B9136K063p6534o260O8686K8874l163j2898l623k8659M649Q228j1916O904
7530E487j9698J7746q288l739J5643l4P033j454M272O1967L3662q1317l5883K614
7516a989N914Q54J1611Q878J6568R700p483j5287k8856l3204k0351J4609L0497
7503h539r77m6617r925O4848O240k9386l0275r949K2412Q476j4522q993p22O2260
$$ plain form
7489 4331 25556 -2225 -48376 -70068 -76815 -68476 -47536 -64494 -54477 -47674 -73655 -54700 -36593
7476 -36593 -83931 -104545 -65958 -17865 -1803 22781 5789 -34100 -66803 -57079 -42242 -42907
7464 -42907 -15100 -24031 -34154 -3242 -15995 -16527 7262 -17224 -27002 -60389 -21317 -10670 -7323
7451 -7323 -960 7290 17485 39775 52525 -5556 -54295 -74136 -51922 14980 53772 27367
7439 27367 1362 -42595 -42212 -17017 -4020 -18463 -44940 -64678 -83372 -79899 -41397 -45083 -76848
7426 -76848 -64828 -32507 18708 -6500 -19964 -1073 -26585 -50173 -12541 -6408 -33507 -47549
7414 -47549 -67277 -47079 -21123 -35750 -18369 -13587 -34161 -45250 -45631 -44610 -87824 -87944 -50048
7401 -50048 -63621 -58937 -20396 -23819 -56002 -13513 -30251 -67543 -53476 -64294 -62202 -30233
$$ packed form
7489D331K1225k7781m6151k1692o747Q339K0940j6958J0017O803k5981J8955J8107
7476c6593m7338k0614L8587M8093J6062K4584j6992l9889l2703R724J4837o65
7464d2907K7807q931j0123L0912j2753n32K3789k4486r778l3387L9072J0647L347
7451g323O363Q250J0195K2290J2750n8081m8739j9841K2214O6902L8792k6405
7439B7367k6005m3957L83K5195J2997j4443k6477j9738j8694L473L8502l686l1765
7426g6848J2020L2321N1215k5208j3464J8891k5512k3588L7632O133k7099j4042
7414d7549j9728K0198K5956j4627J7381M782k0574j1089l81J021m3214j20L7896
7401e0048j3573M684L8541l423l2183M2489j6738l7292J4067j0818K092L1969
$$ plain form
7389 -30233 7275 23241 17690 18812 -4763 -59129 -83724 -89399 -63285 -8701 2638 -907 4509
7376 4509 2150 18745 -8644 28174 38077 6633 4791 -2196 -25734 -25490 -46721 -52516 -77702
7363 -77702 -64266 -92799 -74652 -55782 -62176 -106530 -105445 -68142 -35075 -3631 -9687 -66213
7351 -66213 -26660 2069 3425 -50360 -47467 -38584 -73868 -98386 -50651 -21712 -11547 -9907 45002
7338 45002 44114 15164 1038 -22377 -3826 3573 -10736 -35411 -53111 -68159 -42528 -5416
7326 -5416 5452 -556 -19577 -37168 -32057 -49721 -71615 -74313 -60086 -28903 -15504 -26782 -13767
7313 -13767 -28838 -34082 -22499 23887 85751 70290 48482 47818 38435 18746 -7508 -44460 -67544
7300 -67544 -31415 3564 17103 -16841 2739 25712 -1100 15084 29110 12624 -52065 -90156
$$ packed form
7389c0233L7508J5966n551J122k3575n4366k4595n675K6114N4584J1339l545N416
7376D509k359J6595k7389L6818R903l1444j842o987k3538K44k1231n795k5186
7363g7702J3436k8533J8147J8870o394m4354J085L7303L3067L1444o056n6526
7351f6213L9553K8729J356n3785K893Q883l5284k4518M7735K8939J0165J640N4909
7338D5002q88k8950j4126k3415J8551P399j4309k4675j7700j5048K5631L7112
7326e416J0868o008j9021j7591N111j7664k1894k698J4227L1183J3399j1278J3015
7313a3767j5071n244J1583M6386O1864j5461k1808o64r383j9689k6254l6952k3084
7300f7544L6129L4979J3539l3944J9580K2973k6812J6184J4026j6486o4689l8091
$$ plain form
7288 -90156 -65509 -54808 -40051 -45240 -50413 -71207 -30101 40075 22612 -6795 -47432 -15007
7276 -15007 5617 -30245 -12451 -24892 -44197 -25043 -9344 -19056 -8516 -20751 -30299 -31718
7264 -31718 -27501 16519 8632 -8672 -36929 -48055 -22404 184 -2599 -38504 -62911 -38471
7252 -38471 -34654 -22846 -39932 -21810 -31920 -47220 -21074 17780 9348 3509 -27329 -18353 2892
7239 2892 13722 -37411 -73422 -63389 -39394 -30218 -28636 -34746 -28738 -49635 -37818 -9384 -27927
7226 -27927 -32287 -8108 -39125 -62358 -81429 -69482 -55425 -40618 -25914 -25403 -14148 -13768 -40942
7213 -40942 -17524 -9031 -21908 -28526 -23574 3072 -8988 3691 23027 -12867 -41028 -47343 -29860
7200 -29860 -26845 -27163 6707 22686 40291 40584 45458 17632 98 -1977 13715 -7664 -2531
$$ packed form
7288i0156K4647J0701J4757n189n173k0794M1106P0176j7463k9407m0637L2425
7276a5007K0624l5862J7794j2441j9305J9154J5699r712J0540j2235r548j419
7264c1718M217M4020p887j7304k8257j1126K5651K2588k783l5905k4407K4440
7252c8471L817J1808j7086J8122j0110j5300K6146L8854q432n839l0838Q976K1245
7239B892J0830n1133l6011J0033K3995R176J582o110O008k0897J1817K8434j8543
7226b7927m360K4179l1017k3233j9071J1947J4057J4807J4704N11J1255L80k7174
7213d0942K3418Q493j2877o618M952K6646j2060J2679J9336l5894k8161o315J7483
7200b9860L015l18L3870J5979J7605K93M874k7826j7534k075J5692k1379N133
$$ plain form
7187 -2531 49005 29164 17859 18574 -21241 -26945 -10352 15067 38705 51203 45364 40898 21548
7174 21548 23768 15654 14705 31467 -897 -34134 -66668 -60150 -7592 14109 -6739 -58062 -53586
7161 -53586 -6178 6348 2358 -12196 -37034 -30233 4075 26586 24770 24891 -2536 14977 39090
7148 39090 15700 -10381 -8643 -22164 11399 -8467 -54477 -23474 -3525 -43617 -35298 -13619
7136 -13619 22055 -26383 -93626 -64829 -48399 -31531 17333 -21751 -56891 -85354 -51198 -38648
7124 -38648 -36713 -46271 -34911 -6083 -5845 -57794 -87745 -75480 -77013 -71829 -61215 -83609 -54150
7111 -54150 -32468 -23336 -33447 -59348 -54618 -13289 21855 33808 -10241 -62071 -65856 -47501
7099 -47501 -25435 -13032 -9239 -27694 -48680 -42449 -38175 -44345 -46046 -42247 -36333 -42609 -85827
$$ packed form
7187b531N1536j9841j1305P15l9815n704J6593K5419K3638J2498n839m466j9350
7174B1548K220q114r49J6762l2364l3237l2534O518N2558K1701k0848n1323M476
7161e3586M7408J2526l990j4554k4838O801L4308K2511j816J21k7427J7513K4113
7148C9090k3390k6081J738j3521L3563j9866m6010L1003J9949m0092Q319K1679
7136a3619L5674m8438o7243K8797J6430J6868M8864l9084l5140k8463L4156J2550
7124c8648J935r558J1360K8828K38n1949k9951J2265j533N184J0614k2394K9459
7111e4150K1682R132j0111k5901M730M1329L5144J1953m4049n1830l785J8355
7099d7501K2066J2403L793j8455k0986O231M274o170j701L799N914o276m3218
$$ plain form
7086 -85827 -77624 -64280 -39478 -61755 -71819 -40728 27333 52209 13294 -10289 -7706 -4556
7074 -4556 -22755 -7515 -13670 -16327 -24924 -38484 -27627 -18510 -42805 -61955 -42240 -26478 -30219
7061 -30219 -49939 -12956 20014 -6251 -15983 -32399 -16428 -3186 -33078 -4982 4492 -18294
7049 -18294 -32595 -44283 -24517 -27478 -2804 45758 79615 66743 60053 47173 12507 -10213
7037 -10213 -37041 -23392 -11804 -20587 -38941 -54673 -55354 -56212 -62067 -40030 -17948 -4819 2041
7024 2041 -16253 -3281 -3576 -15209 -20488 -38723 -54189 -12412 -8996 -39461 -25523 -22729 -38169
7011 -38169 -52644 -45549 -84451 -71178 -32353 15810 47093 -7185 -7482 -46850 -77785 -58441
6999 -58441 -36516 -8532 -22612 -19376 -7480 -10934 -37112 -34607 -27021 2584 24997 725 -48886
$$ packed form
7086h5827Q203J3344K4802k2277j0064L1091O8061K4876l8915k3583K583L150
7074d556j8199J5240o155k657q597j3560J0857R117k4295j9150J9715J5762l741
7061c0219j9720L6983L2970k6265r732j6416J5971J3242k9892K8096R474k2786
7049a8294j4301j1688J9766k961K4674M8562L3857j2872o690j2880l4666k2720
7037a0213k6828J3649J1588q783j8354j5732o81q58n855K2037K2082J3129O860
7024B041j8294J2972k95j1633n279j8235j5466M1777L416l0465J3938K794j5440
7011c8169j4475P095l8902J3273L8825M8163L1283n4278k97l9368l0935J9344
6999e8441K1925K7984j4080L236J1896l454k6178K505P586K9605K2413k4272m9611
$$ plain form
6986 -48886 -53875 -43939 -51677 -49261 -29693 -25503 -36570 -23549 -44610 -64903 -69632 -55545 -36780
6973 -36780 -13969 19038 -9747 -12701 -3710 13634 -2342 -26696 -1506 35269 63926 73660
6961 73660 48628 3505 5242 8009 -5135 6289 13464 -715 -3931 12171 699 10696 26483
6948 26483 17027 -20849 -32731 -939 45114 55858 7614 -33226 -37198 -17581 -22101 7306
6936 7306 43947 56584 -841 809 3065 5378 -16216 -57611 -85390 -63909 -24554 -20971 -21023
6923 -21023 -5955 -18444 -34376 -35407 -14790 6183 7427 14218 -6770 -39870 -38861 -23568 -39403
6910 -39403 -19352 -38682 -26020 -26505 -36009 -22810 12519 -11111 -12798 -20194 -22042 -26211 -24791
6897 -24791 -39259 -8413 -4426 -63103 -80866 -70488 -56039 -12802 10787 -7499 -36134 -21076
$$ packed form
6986d8886m989R936p738K416J9568M190j1067J3021k1061k0293m729J4087J8765
6973c6780K2811L3007k8785k954Q991J7344j5976k4354K5190L6775K8657R734
6961G3660k5032m5123J737K767j3144J1424P175j4179l216J6102j1472R997J5787
6948B6483r456l7876j1882L1792M6053J0744m8244m0840l972J9617m520K9407
6936G306L6641J2637n7425J650K256K313k1594m1395k7779K1481L9355L583n2
6923b1023J5068j2489j5932j031K0617K0973J244O791k0988l3100J009J5293j5835
6910c9403K0051j9330J2662m85r504J3199L5329k3630j687p396j848m169J420
6897b4791j4468L0846L987n8677j7763J0378J4449M3237K3589j8286k8635J5058
$$ plain form
6885 -21076 19446 38763 60203 52132 53730 46862 43942 42714 38372 3624 25390 8038 -6927
6872 -6927 10000 41 -16619 -31033 -45303 -82587 -108064 -97806 -90279 -51318 -49399 -58002 -51535
6859 -51535 -42306 -43525 -54219 -66502 -86441 -88014 -51059 99 13566 3655 1397 40378 31607
6846 31607 -2274 -29987 -20203 -24821 -32138 -29980 -56115 -36695 -30812 -20447 -4141 10571 -39891
6833 -39891 -75286 -46716 1326 7785 -8838 -30581 -76757 -78298 -32990 17212 2588 2596 -14542
6820 -14542 -39794 -36734 -29405 -42932 -18530 -13200 -30591 -8691 -6867 4748 259 -6289 907
6807 907 -34971 -69037 -33826 -15582 4559 21285 52569 74226 31515 -5172 -47285 -63778
6795 -63778 -49482 -59895 -54841 -42638 -15436 10589 -9088 -26632 -27754 -11913 -15634 -9409 -24071
$$ packed form
6885b1076M0522J9317K1440q071J598o868k920j228m342l4748K1766j7352j4965
6872f927J6927r959j6660j4414j4270l7284k5477J0258P527L8961J919q603O467
6859e1535R229j219j0694j2283j9939j573L6955N1158J3467r911k258L8981q771
6846C1607l3881k7713R784m618p317K158k6135J9420N883J0365J6306J4712n0462
6833c9891l5395K8570M8042O459j6623k1743m6176j541M5308N0202j4624Qj7138
6820a4542k5252L060P329j3527K4402N330j7391K1900J824J1615m489o548P196
6807I07l5878l4066L5211J8244K0141J6726L1284K1657m2711l6687m2113j6493
6795f3778J4296j0413N054J2203K7202K6025j9677j7544j122J5841l721O225j4662
$$ plain form
6782 -24071 -44300 -40245 -15460 -7228 3540 17114 25633 43077 4409 -26194 -14491 -9640 -42405
6769 -42405 -9218 9288 35292 23007 -2386 2727 -6324 21870 49262 44003 40664 9571 -18544
6756 -18544 -23282 -60441 -59169 -56007 -44491 -29628 -1782 2583 11907 -13680 -43569 16252 48932
6743 48932 35574 62137 81886 35535 -22238 -28644 -17176 -14157 -30655 -12268 10236 -1559
6731 -1559 -12163 55250 75454 33766 31501 19979 9841 40771 53302 63874 49286 39446
6719 39446 7099 -58117 -60974 -40247 -76763 -52958 -41293 -26977 -5042 17952 -19287 -10770
6707 -10770 32965 16422 -12844 -18760 -2255 -406 4866 -3784 -26589 -32853 -12061 -13181 9626
6694 9626 30092 26184 -11529 -514 -6831 -40980 -53051 -70969 -65750 -48799 -44875 -6252 39876
$$ packed form
6782b4071k0229M055K4785Q232J0768J3574Q519J7444l8668l0603J1703M851l2765
6769d2405L3187J8506K6004j2285k5393N113r051K8194K7392n259l339l1093k8115
6756a8544m738l7159J272L162J1516J4863K7846M365R324k5587k9889N9821L2680
6743D8932j3358K6563J9749m6351n7773o406J1468L019j6498J8387K2504j1795
6731a559j0604O7413K0204m1688k265j1522j0138L0930J2531J0572j4588r840
6719C9446l2347o5216k857K0727l6516K3805J1665J4316K1935K2994l7239Q517
6707a0770M3735j6543k9266n916J6505J849N272q650k2805o264K0792j120K2807
6694I626K0466l908l7713J1015o317l4149j2071j7918N219J6951L924L8623M6128
$$ plain form
6681 39876 66893 -4388 -26158 9812 -13495 -17576 4413 -653 16882 46417 23458 21377
6669 21377 56733 76561 67247 30853 -10806 -30804 -1305 -28907 -75193 -96366 -41843 13032
6657 13032 -13404 -51105 -61607 -26782 -126 804 40488 45595 56149 55725 3911 7203 21863
6644 21863 48388 34823 9380 1872 33233 54864 42577 13512 -12658 -6618 6122 18138
6632 18138 5082 -5840 -29029 -6230 15696 41761 11880 -29332 -24261 -13306 -3965 -21090
6620 -21090 -53430 -30204 -22012 -7890 -15800 -17171 -60412 -60784 2622 28073 -19546 -37946 -24559
6607 -24559 -51120 -44355 1363 -13535 -50371 -41384 -3971 -24136 -1651 50428 44590 -2018
6595 -2018 -48905 -60197 -13173 -5657 -28972 -39612 -55051 -35313 1028 32993 -8186 -45503
$$ packed form
6681C9876K7017p1281k1770L5970k3307m081K1989n066J7535K9535k2959k081
6669B1377L5356J9828r314l6394m1659j9998K9499k7602m6286k1173N4523N4875
6657A3032k6436l7701j0502L4825K6656R30L9684N107J0554m24n1814L292J4660
6644B1863K6525j3565k5443p508L1361K1631j2287k9065k6170O040J2740J2016
6632A8138j3056j0922k3189K2799K1926K6065k9881m1212N071J0955R341j7125
6620b1090l2340K3226Q192J4122p910j371m3241l72O3406K5451m7619j8400J3387
6607b4559k6561O765M5718j4898l6836Q987L7413k0165K2485N2079n838m6608
6595b018m6887j1292M7024P516k3315j0640j5439J9738L6341L1965m1179l7317
$$ plain form
6583 -45503 -37319 5715 7151 11872 -9451 -2167 6888 -12728 -13531 -29484 -21729 3186 -9643
6570 -9643 -29221 -50896 -48098 -32262 2774 -7927 3766 19527 12590 -39697 -82539 -122927
6558 -122927 -97949 -48751 -17454 -45622 -19810 -32424 -58517 -50572 -16732 6452 -4080 -27824
6546 -27824 -29362 -12566 32704 39105 47412 39953 38689 50215 19110 -9509 -8959 -1061 -30250
6533 -30250 -25548 6880 54752 38821 16472 -13775 -38092 -48592 -45161 -26117 -36616 -31739
6521 -31739 -42734 -49149 -16073 -7435 29595 33868 41477 35189 23665 3308 -10495 -30863 -7446
6508 -7446 -12314 -11504 -4641 -17167 -14867 -45177 -61835 -26196 -38365 -67577 -51162 -46676 -73646
6495 -73646 -67875 -65979 -47320 -23406 -28261 -57580 -46973 -30290 36982 43599 -632 -20569 -13415
$$ packed form
6583d5503Q184M3034J436M721k1323P284R055j9616q03j5953P755K4915j2829
6570i643j9578k1675K798J5836L5036j0701J1693J5761o937n2287m2842m0388
6558a22927K4978M9198L1297k8168K5812j2614k6093P945L3840K3184j0532k3744
6546b7824j538J6796M5270O401Q307p459j264J1526l1105k8619N50P898k9189
6533c0250M702L2428M7872j5931k2349l0247k4317j0500L431J9044j0499M877
6521c1739j0995o415L3076Q638L7030M273P609o288j1524k0357j3803k0368K3417
6508g446m868Q10O863j2526K300l0310j6658L5639j2169k9212J6415M486k6970
6495g3646N771J896J8659K3914m855k9319J0607J6683O7272O617m4231j9937P154
$$ plain form
6482 -13415 -8615 -31066 -14062 -8131 -4435 2895 9663 -1757 7182 -28759 -33978 -49644 -48943 -30957
6468 -30957 -29704 -27547 7449 72552 106090 64817 49994 38302 21993 -427 -4330 -12666 4545
6455 4545 17293 27214 18565 15323 -22658 -78031 -71238 -75822 -52938 -22891 -17104 -72758 -80560
6442 -80560 -32456 -17062 -15148 -30707 -17603 8497 -13748 -66489 -64746 -47047 -4421 28229
6430 28229 42414 30068 -6210 12401 5028 -42241 -58856 -43388 -23459 -13672 -40018 -60695
6418 -60695 -39427 721 -16494 -23034 -28749 -26494 -5485 5796 -10872 1618 2343 4062 -39148
6405 -39148 -52195 -67022 -62820 -26122 -10480 -54542 -70822 -39349 -28822 -8724 -19645 -26776
6393 -26776 -61775 -57971 -36176 -51713 -35564 -2460 -23902 2015 32318 48933 62995 36789
$$ packed form
6482a3415M800k2451J7004N931L696P330O768j1420Q939l5941n219j5666P01J7986
6468c0957J253K157L4996O5103L3538m1273j4823j1692j6309k2420l903q336J7211
6455D545J2748R921q649l242l7981n5373O793m584K2884L0047N787n5654p802
6442h0560M8104J5394J914j5559J3104K6100k2245n2741J743J7699M2626L2650
6430B8229J4185j2346l6278J8611p373m7269j6615J5468J9929R787k6346k0677
6418f0695K1268M0148j7215o540n715K255K1009J1281j6668J2490P25J719m3210
6405c9148j3047j4827M202L6698J5642m4062j6280L1473J0527K0098j0921p131
6393b6776l4999L804K1795j5537J6149L3104k1442K5917L0303J6615J4062k6206
$$ plain form
6381 36789 42870 25816 28714 13353 -2681 -26443 -41477 -833 46152 78441 80346 13962
6369 13962 -25533 -20109 805 1015 -10920 11080 16546 14329 -3515 -7833 5946 10014 -24450
6356 -24450 -36796 -20280 -35235 -44269 -33128 -19392 -7462 -30571 -29610 -15316 -23391 -4644 32429
6343 32429 17738 -4565 -14707 -21416 -2947 -48330 3869 42320 26215 18741 2188 -29224
6331 -29224 -19768 -4489 -31799 -71322 -85662 -36748 -25619 1159 30926 -7359 -33365 -35951
6319 -35951 -20439 -28632 -32637 -18339 5237 3192 -2517 5645 -17888 -32185 -20811 -25084 -61128
6306 -61128 -58913 -12059 36871 71290 37366 19147 27333 10745 39201 52422 29230 14725
6294 14725 -12811 -11994 -39778 -35331 -7079 20039 11148 -8531 -8068 -11990 -20504 -28925 -35513 -7286
$$ packed form
6381C6789O081j7054K898j5361j6034k3762j5034M0644M6985L2289J905o6384
6369A3962l9495N424K0914K10j1935K2000N466k217j7844m318J3779M068l4464
6356b4450j2346J6516j4955r034J1141J3736J1930k3109R61J4294q075J8747L7073
6343C2429j4691k2303j0142o709J8469m5383N2199L8451j6105p474j6553l1412
6331b9224R456J5279k7310l9523j4340M8914J1129K6778K9767l8285k6006k586
6319c5951J5512q193m005J4298K3576k045n709Q162k3533j4297J1374m273l6044
6306f1128K215M6854M8930L4419l3924j8219Q186j6588K8456J3221k3192j4505
6294A4725k7536Q17k7784M447K8252K7118q891j9679M63l922q514q421o588K8227
$$ plain form
6280 -7286 34115 27481 16610 -22108 -19242 19183 2720 -4866 -32562 -59898 -74705 -65054 -51790
6267 -51790 -60946 -48028 -38464 -56784 -53672 -40603 -5878 -17348 -31722 -43121 -64760 -39096
6255 -39096 -27014 -10550 4152 500 15958 -10106 -38404 -51848 -8745 -3222 -21678 -44500
6243 -44500 -81270 -89974 -61207 -34267 -20656 -42603 -13617 -23929 -17829 -10466 -2856 6632 -8447
6230 -8447 10048 6207 -11501 -18028 18397 29460 12907 25036 29893 10419 -21714 -20020 -16450
6217 -16450 -9327 -10620 -291 66158 97048 29631 4113 -654 -52720 -49053 -40973 -20230 -11965
6204 -11965 23102 46480 22946 11364 13789 -24773 -32597 -30768 -12869 -4517 19965 20044 601
6191 601 -13109 -25467 -22731 -28973 2255 -1792 -34279 -39498 -14240 -4825 14933 17025 -17784
$$ packed form
6280g286M1401o634j0871l8718K866L8425j6463p586k7696k7336j4807R651J3264
6267e1790r156J2918R564j8320L112J3069L4725j1470j4374j1399k1639K5664
6255c9096J2082J6464J4702l652J5458k6064k8298j3444M3103N523j8456k2822
6243d4500l6770q704K8767K6940J3611k1947K8986j0312O100P363P610R488j5079
6230h447J8495l841j7708o527L6425J1063j6553J2129M857j9474l2133J694L570
6217a6450P123j293J0329O6449L0890o7417k5518m767n2066L667Q080K0743Q265
6204a1965L5067K3378k3534j1582K425l8562p824J829J7899Q352K4482P9j9443
6191F01j3710j2358K736o242L1228m047l2487n219K5258R415J9758K092l4809
$$ plain form
6178 -17784 -17997 -45920 -42150 -27210 -37 4542 -8229 -13226 7729 2337 989 -4390 -23043
6165 -23043 -44923 -53760 -47963 -5629 11433 -9618 -65660 -82581 -65169 -57954 -67341 -66500 -68942
6152 -68942 -56305 -31398 -44023 -72964 -44531 -15985 -67885 -89947 -84532 -54111 -8131 -7828
6140 -7828 9117 -2111 13042 -2055 -19895 -15503 -27964 -40214 -26987 -45039 -15771 50529
6128 50529 80442 48325 -4621 -11557 31396 38937 25154 42125 48944 26185 10032 -20109
6116 -20109 -21778 -992 32822 46404 14737 -45377 -90704 -78545 -74573 -70222 -34165 -40684 -56903
6103 -56903 -74871 -81743 -65936 -38924 -12198 -23197 -43741 -71945 -66813 -35763 1392 16507
6091 16507 13639 -35797 -78144 -35237 -30439 -54314 -72479 -63091 -69619 -89289 -49855 -52811 -61317
$$ packed form
6178a7784k13k7923L770J4940K7173M579j2771m997K0955n392j348n379j8653
6165b3043k1880q837N797M2334J7062k1051n6042j6921J7412P215r387Q41k442
6152f8942J2637K4907j2625k8941K8433K8546n1900k2062N415L0421M5980L03
6140g828J6945j1228J5153j5097j7840M392j2461j2250J3227j8052K9268O6300
6128E0529K9913l2117n2946o936M2953P541j3783J6971O819k2759j6153l0141
6116b0109j669K0786L3814J3582l1667o0114m5327J2159L972M351L6057o519j6219
6103e6903j7968o872J5807K7012K6726j0999k0544k8204N132L1050L7155J5115
6091A6507k868m9436m2347M2907M798k3875j8165R388o528j9670L9434k956q506
$$ plain form
6078 -61317 -56686 -27153 -8822 -34368 -17790 -30610 -41418 11719 71086 59458 47749 72406
6066 72406 36748 16222 2052 -29026 -42779 -25599 9508 25282 39507 24618 -9437 -14950
6054 -14950 9216 55062 46585 -9407 -11981 -38958 -25572 3883 -5788 36212 32333 -5926 -29647
6041 -29647 -21028 -13865 -11807 -3211 -27395 -38886 -13405 24327 13603 -1354 19595 21109 40855
6028 40855 40276 30684 6546 -29090 -43644 -27370 -24947 -23462 -10448 9018 -21776 -62626 -54788
6015 -54788 -54343 -39048 -38709 -59465 -86607 -79931 -54055 -5579 12773 760 27204 32095 -829
6002 -829 -15853 -17063 -13669 -5323 20500 15416 40947 43896 73498 74726 40442 3569 25852
5989 25852 1461 -35510 -40206 -2264 -29514 -60745 -27624 345 4776 -3163 -11196 302 6400
$$ packed form
6078f1317M631K9533J8331k5546J6578j2820j0808N3137N9367j1628j1709K4657
6066G2406l5658k0526j4170l1078j3753J7180L5107J5774J4225j4889l4055n513
6054a4950K4166M5846q477n5992k574k6977J3386K9455r671M2000l879l8259k3721
6041b9647Q619P163K058Q596k4184j1491K5481L7732j0724j4957K0949J514J9746
6028D0855n79r592k4138l5636j4554J6274K423J485J3014J9466l0794m0850P838
6015e4788M45J5295L39k0756k7142O676K5876M8476J8352j2013K6444M891l2924
6002h29j5024j210L394Q346K5823n084K5531K949K9602J228l4284l6873K2283
5989B5852k4391l6971m696L7942k7250l1231L3121K7969M431p939q033J1498O098
$$ plain form
5976 6400 -2812 -34823 -78495 -134024 -113071 -63608 -37062 -54758 -91203 -120153 -88964 -32007
5964 -32007 24875 21375 -16412 12501 13619 10779 1222 4864 14584 35917 74318 42764 30129
5951 30129 22586 14722 19648 -35297 -66619 -40826 -10129 21698 60035 76777 71071 41576 -28636
5938 -28636 -72817 -74113 -48717 -46518 -27232 -12794 19300 49298 11169 -15063 16970 14068
5926 14068 5753 36717 43507 32409 25042 16196 -3469 -16969 -55885 -79003 -20440 9213 18020
5913 18020 -2718 -25224 -5162 -14024 -16214 -11256 -43339 -47445 -27149 -3036 10953 -6423 -8913
5900 -8913 1777 48087 36935 201 -996 22488 56868 49625 39037 28601 24972 13353 -46568
5887 -46568 -60357 -24155 -30515 -9092 10877 13764 -9327 -2541 -17197 -29226 -23271 -21539 -11237
$$ packed form
5976F400r212l2011m3672n5529K0953M9463K6546j7696l6445k8950L1189N6957
5964c2007N6882l500l7787K8913J118k840r557L642R720K1333L8401l1554j2635
5951C0129p543p864M926n4945l1322K5793L0697L1827L8337J6742n706k9495p0212
5938b8636m4181j296K5396K199J9286J4438L2094K9998l8129k6232L2033k902
5926A4068q315L0964O790j1098p367q846j9665j3500l8916k3118N8563K9653Q807
5913A8020k0738k2506K0062q862k190M958l2083m106K0296K4113J3989j7376k490
5900h913J0690M6310j1152l6734j197K3484L4380p243j0588j0436l629j1619n9921
5887d6568j3789L6202o360K1423J9969K887k3091O786j4656j2029N955J732J0302
$$ plain form
5874 -11237 40910 89039 61909 13860 22979 7072 -10297 -43060 -50544 -21507 -13232 25575
5862 25575 33582 -15189 -25358 -27036 -21139 -6398 -22678 -16067 -21403 -37477 -23941 -8333 -7588
5849 -7588 -4644 -2896 -12899 -22614 -32206 -32575 -27273 -59294 -67681 -39738 -26321 -16061 -17418 17955
5835 17955 69869 61249 42513 41798 2852 4469 -402 -44780 -42568 -22774 -35209 -19972 1662
5822 1662 6355 17427 7538 48115 21977 33524 40830 29737 -17949 -60389 -54508 -59056 -51305
5809 -51305 -35229 -18677 -34553 -34567 -8172 9845 -4031 4585 -37716 -66969 -31499 -26514 -25720
5796 -25720 -27478 -16485 -21635 -20305 -10361 1174 4818 7748 5124 -14150 -35013 -33221 -2074
5783 -2074 2001 26020 -8084 -3364 20940 5837 -17713 -5055 14934 15675 -23418 -50248 -35142
$$ packed form
5874a1237N2147M8129k7130m8049R119j5907j7369l2763p484K9037Q275L8807
5862B5575Q007m8771j0169j678N897J4741j6280O611n336j6074J3536J5608P45
5849g588K944J748j0003r715r592l69N302l2021q387K7943J3417J0260j357L5373
5835A7955N1914q620j8736p15l8946J617m871m4378K212J9794j2435J5237K1634
5822A662M693J1072r889M0577k6138J1547P306j1093m7686m2440N881m548P751
5809e1305J6076J6552j5876j4K6395J8017j3876Q616m2301k9253L5470M985P94
5796b5720j758J0993n150J330R944J1535L644K930k624j9274k0863J792L1147
5783b074M075K4019l4104M720K4304j5103k3550J2658J9989P41l9093k6830J5106
$$ plain form
5770 -35142 -8258 -51325 -71300 -56322 -48489 -36573 -32093 -16168 -15199 3403 -5341 -27504 9
5757 9 21264 -2315 -46294 -49162 -35508 -14218 15078 -21388 -17744 4527 -10415 -29136 -31535
5744 -31535 -15776 -32754 -47867 -50080 -89296 -133070 -113112 -54469 -45754 -50351 -57740 -26232 521
5731 521 12212 6918 736 -6503 -31210 -64067 -48983 -6101 31208 39505 29274 -1700 15861
5718 15861 49217 26536 7262 8502 -706 4503 -24283 -1392 10927 -4057 -54817 -75483
5706 -75483 -99565 -69581 -11623 14986 45813 42815 52582 38701 27533 15036 15578 -4002 2429
5693 2429 10326 31704 46725 43192 34388 5357 -2701 -36084 -63953 -5342 -18264 -56444 -66809
5680 -66809 -76914 -90993 -39324 -3183 35448 12865 -21947 -609 19353 11959 -16099 -26670
$$ packed form
5770c5142K6884m3067j9975J4978P833J1916M480J5925R69J8602q744k2163K7513
5757IK1255k3579m3979k868J3654K1290K9296l6466L644K2271j4942j8721k399
5744c1535J5759j6978j5113k213l9216m3774J9958N8643Q715m597p389L1508K6753
5731E21J1691n294o182p239k4707l2857J5084M2882L7309Q297j0231l0974J7561
5718A5861L3356k2681j9274J240r208N209k8786K2891J2319j4984n0760k0666
5706g5483k4082K9984N7958K6609L0827k998R767j3881j1168j2497N42j9580O431
5693B429P897K1378J5021l533q804k9031q058l3383k7869N8611j2922l8180j0365
5680f6809j0105j4079N1669L6141L8631k2583l4812K1338J9962p394k8058j0571
$$ plain form
5668 -26670 -32304 -3728 -28941 -60874 -63135 -18135 28089 -29606 -55137 -18559 12034 36947
5656 36947 41503 25769 3931 -5956 -11956 -22049 -5075 17048 20015 16844 15205 -3939 23658
5643 23658 40804 42733 29059 54531 61166 46300 12337 5948 2393 -6265 -8227 -3771 8380
5630 8380 36396 32102 -18394 -7484 6153 27849 22906 -5295 -9347 1310 -19268 -42868 23748
5617 23748 21169 -32625 -52747 9574 30519 60811 29519 17340 69082 100456 64793 40063
5605 40063 7996 -48692 -91248 -85895 -65687 -31792 -7505 39160 57068 59818 39933 3865
5593 3865 -18472 -4484 -166 -42241 -43123 -21321 -99584 -113709 -49793 -7001 -12368 -59847 -104436
5580 -104436 -98389 -37942 -15411 -9234 -18834 -50675 -42600 -26040 -6022 -16792 -19206 8385 -24541
$$ packed form
5668b6670n634K8576k5213l1933k261M5000M6224n7695k5531L6578L0593K4913
5656C6947M556j5734k1838r887o000j0093J6974K2123K967l171j639j9144K7597
5643B3658J7146J929j3674K5472O635j4866l3963o389l555q658j962M456J2151
5630H380K8016m294n0496J0910J3637K1696m943k8201m052J0657k0578k3600O6616
5617B3748k579n3794k0122O2321K0945L0292l1292j2179N1742L1374l5663k4730
5605D0063l2067n6688m2556N353K0208L3895K4287M6665J7908K750j9885l6068
5593C865k2337J3988M318m2075q82K1802p8263j4125O3916M2792n367m7479m4589
5580a04436O047O0447K2531O177r600l1841Q075J6560K0018j0770k414K7591l2926
$$ plain form
5567 -24541 -18223 -25434 -43532 -5797 -25439 -41383 -8524 -996 -31724 -51934 -65144 -70957 -87899
5554 -87899 -81624 -79653 -56127 -8929 12694 15474 21733 20803 -684 -4179 -20197 -34997 -33050
5541 -33050 -5701 20084 24415 15445 7010 1102 -15201 -3334 16497 -18017 -13934 18929 18929 -14796
5527 -14796 -18693 21325 44354 7775 4471 320 19671 7478 -14739 -34170 -19079 22839
5515 22839 23979 36269 5386 -10531 11381 17490 -930 15412 20336 29519 23259 46731 36821
5502 36821 26391 11321 44884 57896 63025 22651 -20104 -21003 -44852 -30796 -21084 -68950 -76826
5489 -76826 -77058 -50180 -30851 -25135 -16347 -34802 -52891 -74824 -74296 -69406 -87572 -51552 -24089
5476 -24089 -29481 -50220 -42999 -34929 -5227 -20030 -1427 -4695 -7304 -22462 -19163 -27091 -57392
$$ packed form
5567b4541O318p211j8098L7735j9642j5944L2859P528l0728k0210j3210n813j6942
5554h7899O275J971K3526M7198K1623K780O259r30k1487l495j6018j4800J947
5541c3050K7349K5785M331q970q435n908j6303J1867J9831l4514M083L2863%l3725
5527a4796l897M0018K3029l6579l304m151J9351j2193k2217j9431J5091M1918
5515B2839J140J2290l0883j5917K1912O109j8420J6342M924R183o260K3472r910
5502C6821j0430j5070L3563J3012N129m0374m2755q99k3849J4056R712m7866p876
5489g6826k32K6878J9329N716Q788j8455j8089k1933N28M890j8166L6020K7463
5476b4089n392k0739P221Q070K9702j4803J8603l268k609j5158L299p928l0301
$$ plain form
5463 -57392 -30505 2936 34412 13838 -10799 -22030 -41065 -64609 -65394 -70010 -64707 -54137 8086
5450 8086 14368 -6127 -32534 -25346 -55901 -63232 -66592 -106908 -87080 -52381 -72755 -54879 -60261
5437 -60261 -46179 -13278 -134 -19766 -15803 -45981 -61541 -47362 -30038 -25815 -15756 -7557
5425 -7557 16603 18471 10177 -4326 -2967 -26319 -72394 -52353 -13229 38055 17537 32735 27367
5412 27367 32081 19691 -16773 -3341 -405 -15924 -27854 -41788 -28484 -15516 -40692 -50727
5400 -50727 -76688 -50049 -33892 -27491 -20779 9360 6202 -2045 -37860 -80805 -83928 -47402 -18956
5387 -18956 35200 51014 -11644 -27391 23919 21131 -13407 -8352 -17869 38040 64577 49844
5375 49844 16673 -31012 -46756 -65020 -37394 -4906 -27927 -12265 -35749 -30399 32105 57869
$$ packed form
5463e7392K6887L3441L1476k0574k4637j1231j9035k3544p85m616N303J0570O2223
5450H086O282k0495k6407P188l0555p331l360m0316J9828L4699k0374J7876n382
5437f0261J4082L2901J3144j9632L963l0178j5560J4179J7324M223J0059Q199
5425g557K4160J868q294j4503J359k3352m6075K0041L9124N1284k0518J5198n368
5412B7367M714j2390l6464J3432K936j5519j1930j3934J3304J2968k5176j0035
5400e0727k5961K6639J6157O401O712L0139l158q247l5815m2945l123L6526K8446
5387a8956N4156J5814o2658j5747N1310k788l4538N055r517N5909K6537j4733
5375D9844l3171m7685j5744j8264K7626L2488k3021J5662k3484N350O2504K5764
$$ plain form
5363 57869 94795 109923 69939 35363 24084 16717 -17254 -16332 -23772 -10969 -34523 -54860 -13778
5350 -13778 7923 15591 -5207 1117 3832 23720 13139 -15661 -35081 -41025 -24383 7346 -773
5337 -773 11395 23975 50648 87173 72767 55084 657 -56183 -52677 -36205 -9910 -20983
5325 -20983 -49326 -60369 -48836 -6912 35582 55459 50864 60239 -5556 -17007 12592 21074
5313 21074 19999 26639 38557 -9831 -22818 11354 35124 45910 25784 19557 -48745 -64996
5301 -64996 -34316 -9192 812 44732 65813 26350 16161 -1046 8913 29083 14487 15482
5289 15482 47176 36638 19366 20389 16451 26041 33386 68211 80914 43449 -26084 -39459 20971
5276 20971 71343 71200 47362 30934 4296 2962 45927 68899 50259 21815 44395 37441 60397
$$ packed form
5363E7869L6926J5128l9984l4576j1279p367l3971R22p440J2803k3554k0337M1082
5350a3778K1701P668k0798O324K715J9888j0581k8800j9420n944J6642L1729q119
5337g73J2168J2580K6673L6525j4406j7683n4427n6840L506J6472K6295j1073
5325b0983k8343j1043J1533M1924M2494J9877m595R375o5795j1451K9599Q482
5313B1074j075O640J1918m8388j2987L4172K3770J0786k0126o227o8302j6251
5301f4996L0680K5124J0004M3920K1081l9463j0189j7207R959K0170j4596R95
5289A5482L1694j0538j7272J023l938R590P345L4825J2703l7465o9533j3375O0430
5276B0971N0372j43k3838j6428k6638j334M2965K2972j8640k8444K2580o954K2956
$$ plain form
5263 60397 37124 26787 -3947 -30824 -39295 -25040 9326 66 -13170 -16527 -12061 9017 145
5250 145 -56606 -27480 -18709 -49105 -48184 -50494 -26436 1381 -12620 -39536 -63405 -55716 11043
5237 11043 63047 55940 13542 -113 6800 23655 51003 40018 13147 47218 50884 49557 42748
5224 42748 22303 23816 14587 10358 25269 25570 1042 -21126 -17374 -5215 22096 15133 -39412
5211 -39412 -29794 12343 -2356 -6374 9533 25592 56650 72774 68789 27339 -20280 2377
5199 2377 41752 16259 -35378 -84285 -60862 -6864 -20310 -15080 -11427 28212 35148 11054 16971
5186 16971 -6179 -16451 -26564 -32989 -12956 18297 17489 -10126 -38770 -23335 -3014 13274
5174 13274 -4083 -21099 -26915 -31590 -40172 -72279 -75141 -62957 -23256 -2658 -14632 -14523 -21020
$$ packed form
5263F0397k3273j0337l0734k6877q471J4255L4366r260j3236l357M466K1078q872
5250A45n6751K9126Q771l0396R21k310K4058K7817j4001k6916k3869P689O6759
5237A1043N2004p107m2398j3655O913J6855K7348j0985k6871L4071L666j327o809
5224D2748k0445J513r229m229J4911L01k4528k2168L752J2159K7311o963n4545
5211c9412R618M2137j4699m018J5907J6059L1058J6124l985m1450m7619K2657
5199B377L9375k5493n1637m8907K3423N3998j3446N230L653L9639O936k4094N917
5186A6971k3150j0272j0113o425K0033L1253q08k7615k8644J5435K0321J6288
5174A3274j7357j7016n816m675q582l2107k862J2184L9701K0598j1974J09o497
$$ plain form
5161 -21020 -6776 -2654 -4952 -2251 -5896 -14168 -33413 -38410 -8046 5796 9142 -11646 27690
5148 27690 71689 89117 86589 84203 69822 63793 58999 26125 2828 7063 -9555 31479 56292
5135 56292 33437 -7373 -52868 -56061 -70458 -53432 -5906 3990 28482 18300 40753 66822
5123 66822 51563 28229 6794 19685 4613 -23081 -32880 -18020 -42767 -24310 4655 11420
5111 11420 -13792 -14157 -19458 -18575 -10857 9523 33691 33575 8556 -4809 12926 35790 22567
5098 22567 1104 1815 6661 -3669 -36289 -54377 -41971 -31562 -46667 -23943 -6652 -22866
5086 -22866 -40798 -38601 -9120 6173 20300 46037 42884 48788 30141 -8881 -38700 -6793
5074 -6793 17887 20880 13830 13317 14596 8924 52809 59260 39016 36025 11398 -9087 -9337 15693
$$ packed form
5161b1020J4244M122k298K701l645q272j9245m997L0364J3842L346k0788L9336
5148B7690M3999J7428k528k386j4381o029m794l2874k3297M235j6618M1034K4813
5135E6292k2855m0810m5495l193j4397J7026M7526R896K4492j0182K2453K6069
5123F6822j5259k3334k1435J2891j5072k7694r799J4860k4747J8457K8965O765
5111A1420k5212l65n301Q83P718K0380K4168j16k5019j3365J7735K2864j3223
5098B2567k1463P11M846j0330l2620j8088J2406J0409j5105K2724J7291j6214
5086b2866j7932K197K9481J5293J4127K5737l153N904j8647l9022k9819L1907
5074f793K4680K993p050n13J279n672M3885O451k0244k991k4627k0485k50K5030
$$ plain form
5060 15693 31987 56136 75686 95073 57926 -2111 -11936 -24505 -57890 -55161 -35869 3792
5048 3792 24651 36652 37380 142 15544 1271 -19580 3363 51656 71015 49187 32754
5036 32754 -5725 -19658 -317 -4527 -29879 -34561 -20998 15079 -2561 -43220 -9342 33546
5024 33546 8588 2932 -806 14989 25350 68742 71943 30529 -4954 11996 -12873 -52452
5012 -52452 -40101 -21871 -16396 -614 -5234 12522 20114 -32853 -26187 -19552 -45517 -63357 -24626
4999 -24626 9924 -26612 -36083 -16865 -15339 -6990 -23381 -38532 -26317 -11510 -37163 -69562
4987 -69562 -79238 -45880 -28184 -27964 -12601 34581 42344 22942 24959 1338 -9545 18790 -12627
4974 -12627 -61959 -55121 -42807 -52631 -26250 7054 -14369 -47199 -76679 -13142 4944 -11080
$$ packed form
5060A5693J6294K4149J9550J9387l7147o0037r825j2569l3385K729J9292L9661
5048C792K0859J2001P28l7238J5402j4273k0851K2943M8293J9359k1828j6433
5036C2754l8479j3933J9341m210k5352m682J3563L6077j7640m0659L3878M2888
5024C3546k4958n656l738J5795J0361M3392L201m1414l5483J6950k4869l9579
5012e2452J2351J8230N475J5782m620J7756P592n2967O666O635k5965j7840L8731
4999b4626L4550l6536r471J9218J526Q349j6391j5151J2215J4807k5653l2399
4987f9562r676L3358J7696K20J5363M7182P763j9402K017k3621j0883K8335l1417
4974a2627m9332O838J2314r824K6381L3304k1423l2830k9480O3537J8086j6024
$$ plain form
4962 -11080 17724 7418 11130 -1005 -2559 39212 26698 -10085 -16123 -19859 -4868 24911 -8483
4949 -8483 -35527 -30773 -29619 -26956 19365 33858 44436 37234 19500 8097 -4718 -18531 -37435
4936 -37435 -50621 -68542 -43155 -3451 -26429 -70008 -86838 -83659 -70858 -95269 -25240 19019
4924 19019 -12055 -35041 -48733 -50876 -56798 -61162 -58427 -65028 -52476 -31121 15120 22025 26634
4911 26634 17169 -18527 -39867 -32335 1512 22381 53201 76769 42607 44592 39655 14762 -16505
4898 -16505 -49448 -62744 -57491 -50755 -38662 -37441 -38809 -39879 5549 45315 20455 27697 60193
4885 60193 48620 19041 48159 87351 61224 -604 -37630 -48347 -36641 -27178 -10448 -31614
4873 -31614 -37048 22638 44429 16615 -14058 -41785 -32548 -35581 -39746 -6223 5738 32050 121
$$ packed form
4962a1080K8804j0306L712j2135j554M1771j2514l6783o038l736J4991K9779l3394
4949h483k7044M754J154K663M6321J4493J0578p202j7734j1403j2815j3813j8904
4936c7435j3186j7921K5387L9704k2978m3579j6830L179J2801k4411P0029M4259
4924A9019l1074k2986j3692k143n922m364K735o601J2552K1355M6241O905M609
4911B6634r465l5696k1340P532L3847K0869L0820K3568l4162J985m937k4893l1267
4898a6505l2943j3296N253O736J2093J221j368j070M5428L9766k4860P242L2496
4885F0193j1573k9579K9118L9192k6127o1828l7026j0717J1706R463J6730k1166
4873c1614n434N9686K1791k7814l0673k7727R237l033m165L3523J1961K6312l1929
$$ plain form
4860 121 -48131 -100480 -73995 -59287 -23644 -21701 -2629 28789 36909 33598 34075 -2719 -42114
4847 -42114 -58775 -48326 -57983 -79992 -63979 -60792 -74945 -58877 -49721 -25097 55477 56398 34080
4834 34080 13789 -15857 -33070 -64663 -27404 13736 -17299 -49475 -48046 -53198 -53943 -53733 -33718
4821 -33718 -38764 -36475 -3539 -5029 -21108 -38164 -36494 -32671 -4332 28309 -11752 14715 -11764
4808 -11764 -23699 -55654 -68356 -58879 -39958 -12427 20835 -8254 -36593 -7194 49744 61017
4796 61017 19371 4206 45899 36092 40755 25404 5657 948 -5563 9183 38506 38554 22651
4783 22651 4217 12393 20829 29073 31475 1269 4111 25036 37262 27836 -1629 -36278 -10283
4770 -10283 -21812 -31569 17731 79847 86604 80774 28081 12356 14175 15088 9235 -6894 1891
$$ packed form
4860A21m8252n2349K6485J4708L5643J943J9072L1418Q120l311M77l6794l9395
4847d2114j6661J0449r657k2009J6013L187j4153J6068R156K4624Q0574R21k2318
4834C4080k0291k9646j7213l1593L7259M1140l1035l2176J429n152p45K10K0015
4821c3718n046K289L2936j490j6079j7056J670L823K8339L2641m0061K6467k6479
4808a1764j1935l1955j2702R477J8921K7531L3262k9089k8339K9399N6938J1273
4796F1017m1646j5165M1693r807M663j5351j9747m709o511J4746K9323M8j5903
4783B2651j8434Q176Q436Q244K402l0206K842K0925J2226r426k9465l4649K5995
4770a0283j1529r757M9300O2116O757n830n2693j5725J819R13n853j6129Q785
$$ plain form
4757 1891 -7678 -29980 -36709 20989 39709 40377 39199 2657 -1868 33212 19473 -9218 -34002
4744 -34002 -4181 -17585 -57594 -54306 -32176 -5975 -20617 -27963 -31178 -20909 -33532 -40272 -7907
4731 -7907 24696 4371 -6680 -6719 -34499 -48274 -42767 -19159 14820 -1811 -20452 13069 22051
4718 22051 48500 31432 -6662 -230 -948 6684 -6360 -24516 -17136 -16681 -11152 -17909 21230 49046
4704 49046 -1824 -25265 -15141 -17605 -16350 1177 43449 35759 16757 -3625 -10507 -17769 -16119
4691 -16119 5299 29366 8783 -60881 -67374 -31661 -19897 10298 8858 -23075 -35220 -56915
4679 -56915 -26478 15402 4794 7194 8784 3687 40659 29882 -6100 -21989 -22873 -7474 11572
4666 11572 -25048 -68449 -46269 -39300 -12903 -30637 -6627 25491 1976 -20781 -38896 -58778
$$ packed form
4757A891r569k2302o729N7698J8720O68j178l6542m525L5080j3739k8691k4784
4744c4002K9821j3404m0009L288K2130K6201j4642p346l215J0269j2623o740L2365
4731g907L2603k0325j1051l9k7780j3775N507K3608L3979j6631j8641L3521Q982
4718B2051K6449j7068l8094O432p18P632j3044j8156P380M55N529o757L9139K7816
4704D9046n0870k3441J0124k464J255J7527M2272p690j9002k0382o882p262J650
4691a6119K1418K4067k0583o9664o493L5713J1764L0195j440l1933j2145k1695
4679e6915L0437M1880j0608K400J590n097L6972j0777l5982j5889q84J5399J9046
4666A1572l6620m3401K2180O969K6397j7734K4010L2118k3515k2757j8115j9882
$$ [...]
##END NTUPLES=NMR SPECTRUM
##END=
