##TITLE=Analysis number 316654
Compound Code cc 40809
Book Reference 440/134
Project Code adrs
Chemist Name craigr
##JCAMPDX= 6.0         $$ Bruker NMR JCAMP-DX V2.0
##DATA TYPE= NMR SPECTRUM
##DATA CLASS= NTUPLES
##ORIGIN= Bruker BioSpin GmbH
##OWNER= nmr
$$ XWIN-NMR		Version 3.5
$$ Mon Jan 23 14:16:05 2006 GMT Standard Time (UT+0h)  MAYBRIDGE\nmr@NMR_250MHZ
##.OBSERVE FREQUENCY= 250.131544655141
##.OBSERVE NUCLEUS= ^1H
##.ACQUISITION MODE= SIMULTANEOUS (DQD)
##.ACQUISITION SCHEME= undefined
##.AVERAGES= 16
##.DIGITISER RES= 18
##SPECTROMETER/DATA SYSTEM= dpx250
##.PULSE SEQUENCE= zg30
##.SOLVENT NAME= CDCl3
##.SHIFT REFERENCE= (INTERNAL, CDCl3, 0, 16.522)
##AUDIT TRAIL= $$ (NUMBER, WHEN, WHO, WHERE, WHAT)
$$ ##TITLE= Audit trail, XWIN-NMR		Version 3.5
$$ ##JCAMPDX= 5.01
$$ ##ORIGIN= Bruker BioSpin GmbH
$$ ##OWNER= nmr
$$ C:\u/data/dgb/nmr/ADRS/15090/pdata/1/auditp.txt
$$ ##AUDIT TRAIL=  $$ (NUMBER, WHEN, WHO, WHERE, WHAT)
(   1,<2006-01-23 14:15:31.02 +000>,<MAYBRIDGE\nmr>,<NMR_250MHZ>,
      <created by zg, POWCHK disabled, PULCHK disabled
       configuration hash MD5:
       62 19 C7 07 E1 42 D1 B7 37 6C 3D D0 77 39 F9 E6
       data hash MD5: 64K
       3D 57 DA 0D 3A 4B 1D 03 79 2E 3B D7 B0 E3 12 94>)
(   2,<2006-01-23 14:15:50.76 +000>,<MAYBRIDGE\nmr>,<NMR_250MHZ>,
      <Start of raw data processing
       ef LB = 0.3 FT_mod = 6 PKNL = 1 SI = 32K 
       data hash MD5: 32K
       30 65 85 5D BE 43 D0 4C 3D F5 8F 40 E0 59 96 F4>)
(   3,<2006-01-23 14:15:52.85 +000>,<MAYBRIDGE\nmr>,<NMR_250MHZ>,
      <apk 
       data hash MD5: 32K
       D1 99 C8 1E DB 7A BC 93 AC DB 50 FE B3 A2 5B C3>)
(   4,<2006-01-23 14:15:53.66 +000>,<MAYBRIDGE\nmr>,<NMR_250MHZ>,
      <abs ABSG = 5 
       data hash MD5: 32K
       5C FD 56 AE 17 BA 33 1B CD 91 FA 51 0B F7 04 22>)
$$ ##END=
$$ 
$$ hash MD5
$$ 08 D4 57 C0 65 48 2C F7 DC 0B E3 A5 2B 1A 10 B1
##$RELAX= 
##$RELAX= 
##$RELAX= 
##$RELAX= 
##$RELAX= 
##$RELAX= 
##$RELAX= 
$$ Bruker specific parameters
$$ --------------------------
##$DU= <C:\u>
##$EXPNO= 15090
##$NAME= <ADRS>
##$PROCNO= 1
##$TYPE= <nmr>
##$USER= <dgb>
##$AMP= (0..31)
100 100 100 100 100 100 100 100 100 100 100 100 100 100 100 100 100 100 
100 100 100 100 100 100 100 100 100 100 100 100 100 100 
##$AQSEQ= 0
##$AQ_mod= 3
##$AUNM= <au_zg>
##$AUTOPOS= <40 >
##$BF1= 250.13
##$BF2= 250.13
##$BF3= 250.13
##$BF4= 250.13
##$BF5= 500.13
##$BF6= 500.13
##$BF7= 500.13
##$BF8= 500.13
##$BYTORDA= 1
##$CFDGTYP= 0
##$CFRGTYP= 5
##$CHEMSTR= <none>
##$CNST= (0..31)
1 1 145 1 1 1 1 1 1 1 1 1 1 1 1 1 1 1 1 1 1 1 1 1 1 1 1 1 1 1 1 1 
##$CPDPRG= <>
##$CPDPRG1= <>
##$CPDPRG2= <>
##$CPDPRG3= <>
##$CPDPRG4= <mlev>
##$CPDPRG5= <mlev>
##$CPDPRG6= <mlev>
##$CPDPRG7= <mlev>
##$CPDPRG8= <mlev>
##$CPDPRGB= <>
##$CPDPRGT= <>
##$D= (0..31)
0 1 0 0 0 0 0 0 0 0.06 0 0 0 0 0 0 0.0002 0 0 0 0 0 0 0 0 0 0 0 0 0 0 
0 
##$DATE= 1138025729
##$DBL= (0..7)
120 120 120 120 120 120 120 120 
##$DBP= (0..7)
150 150 150 150 150 150 150 150 
##$DBP07= 0
##$DBPNAM0= <>
##$DBPNAM1= <>
$$ [...]
##$SUBNAM7= <"">
##$SUBNAM8= <"">
##$SUBNAM9= <"">
##$SW= 20.6930455092707
##$SWIBOX= (0..15)
0 0 3 0 0 0 0 0 0 0 0 0 0 0 0 0 
##$SW_h= 5175.983436853
##$TD= 65536
##$TD0= 1
##$TE= 294.16
##$TE2= 300
##$TE3= 300
##$TEG= 300
##$TL= (0..7)
0 120 120 120 120 120 120 120 
##$TP= (0..7)
150 150 150 150 150 150 150 150 
##$TP07= 0
##$TPNAME0= <>
##$TPNAME1= <>
##$TPNAME2= <>
##$TPNAME3= <>
##$TPNAME4= <>
##$TPNAME5= <>
##$TPNAME6= <>
##$TPNAME7= <>
##$TPOAL= (0..7)
0.5 0.5 0.5 0.5 0.5 0.5 0.5 0.5 
##$TPOFFS= (0..7)
0 0 0 0 0 0 0 0 
##$TUNHIN= 0
##$TUNHOUT= 0
##$TUNXOUT= 0
##$USERA1= <user>
##$USERA2= <user>
##$USERA3= <user>
##$USERA4= <user>
##$USERA5= <user>
##$V9= 5
##$VALIST= <valist>
##$VCLIST= <CCCCCCCCCCCCCCC>
##$VD= 0
##$VDLIST= <DDDDDDDDDDDDDDD>
##$VPLIST= <PPPPPPPPPPPPPPP>
##$VTLIST= <TTTTTTTTTTTTTTT>
##$WBST= 1024
##$WBSW= 4
##$XGAIN= (0..3)
0 0 0 0 
##$XL= 0
##$YL= 0
##$YMAX_a= 676961
##$YMIN_a= -897402
##$ZGOPTNS= <>
##$ZL1= 120
##$ZL2= 120
##$ZL3= 120
##$ZL4= 120
##$ABSF1= 16.522
##$ABSF2= -4.171173
##$ABSG= 5
##$ABSL= 3
##$ALPHA= 0
##$AQORDER= 0
##$ASSFAC= 0
##$ASSFACI= 0
##$ASSFACX= 0
##$ASSWID= 0
##$AUNMP= <proc_1d>
##$AZFE= 0.1
##$AZFW= 0.1
##$BCFW= 0
##$BC_mod= 0
##$BYTORDP= 0
##$COROFFS= 0
##$CY= 12.5
##$DATMOD= 1
##$DC= 0
##$DFILT= <>
##$DTYPP= 0
##$F1P= 14.0000005364418
##$F2P= -0.99999901652339
##$FCOR= 0.5
##$FTSIZE= 32768
##$FT_mod= 6
##$GAMMA= 0
##$GB= 0
##$INTBC= 1
##$INTSCL= 1
##$ISEN= 128
##$LB= 0.3
##$LEV0= 0
##$LPBIN= 0
##$MAXI= 10000
##$MC2= 0
##$MEAN= 0
##$ME_mod= 0
##$MI= 0
##$NCOEF= 0
##$NC_proc= -4
##$NLEV= 6
##$NOISF1= 0
##$NOISF2= 0
##$NSP= 0
##$NTH_PI= 0
##$NZP= 0
##$OFFSET= 16.522
##$PC= 1
##$PHC0= 240.0743
##$PHC1= 5.095618
##$PH_mod= 1
##$PKNL= yes
##$PPARMOD= 0
##$PSCAL= 4
##$PSIGN= 0
##$REVERSE= no
##$SF= 250.13
##$SI= 32768
##$SIGF1= 0
##$SIGF2= 0
##$SINO= 400
##$SIOLD= 32768
##$SREGLST= <1H.CDCl3>
##$SSB= 0
##$STSI= 32768
##$STSR= 0
##$SW_p= 5175.98343685301
##$SYMM= 0
##$S_DEV= 0
##$TDeff= 65536
##$TDoff= 0
##$TI= <Analysis number 999999
Compound Code 99
Book Reference 9
Project Code 9>
##$TILT= no
##$TM1= 0
##$TM2= 0
##$TOPLEV= 0
##$USERP1= <user>
##$USERP2= <user>
##$USERP3= <user>
##$USERP4= <user>
##$USERP5= <user>
##$WDW= 1
##$XDIM= 32768
##$YMAX_p= 490458229
##$YMIN_p= -108605
$$ End of Bruker specific parameters
$$ ---------------------------------
##NTUPLES= NMR SPECTRUM
##VAR_NAME=  FREQUENCY,     SPECTRUM/REAL,   SPECTRUM/IMAG
##SYMBOL=    X,             R,               I
##VAR_TYPE=  INDEPENDENT,   DEPENDENT,       DEPENDENT
##VAR_FORM=  AFFN,          ASDF,            ASDF
##VAR_DIM=   32768,         32768,           32768
##UNITS=     HZ,            ARBITRARY UNITS, ARBITRARY UNITS
##FACTOR=    0.157963299565203, 1,           1
##FIRST=     4132.6476996994, 0,             0
##LAST=      -1043.33573715361, 0,           0
##MIN=       -1043.33573715361, -108605,     0
##MAX=       4132.6476996994, 490458229,     0
$$ Real data points
##PAGE= N=1
##DATA TABLE= (X++(R..R)), XYDATA
$$ [...]
24455c6801j9502J4331L0220M1858L1633j6201j9600k144m102R976m155l680p480
24442A4353J1369k0421j562J9008J8512k1521j1045K8817J701k0290j8282l1285
24430c0646J5283J9212q344L778j020L6775Q223j5611j2817k8664j5544L0925
24418A550R209j6395j4936J4041J7788J139J6865K2143J7207j1449l3572P97p663
24405A6724R053j8320N307J236J987l156k290m808j086p164k3293m908j4876m157
24391d9751K4225L2549K3296k2145j6258p83J1487j2498j0433k2904K708K6934
24379a3573J5350l9419J4950M053J4255K8397J2800n921j6612j5512k0584j1819
24367c3635J0076J5822p034r286o498k0415L001L2850r852L5575K1049k8672j5559
$$ plain form
24455 -36801 -56303 -41972 -11752 30106 61739 45538 25938 23794 19692 29668 25513 21833 14353
24442 14353 25722 5301 3739 22747 41259 19738 8693 37510 39211 18921 639 -30646
24430 -30646 -15363 3849 -4495 -717 -1737 35038 43261 27650 14833 -13831 -29375 1550
24418 1550 10759 -5636 -20572 -6531 11257 12396 29261 51404 68611 57162 23590 24387 16724
24405 16724 25777 7457 12764 14000 15987 12831 10541 5733 4647 -2517 -25810 -30718 -45594 -49751
24391 -49751 -25526 7023 30319 8174 -8084 -8867 2620 -9878 -20311 -43215 -40507 -13573
24379 -13573 1777 -37642 -22692 -18639 -4384 24013 36813 30892 14280 -1232 -21816 -33635
24367 -33635 -23559 -7737 -14771 -24057 -30555 -50970 -47969 -15119 -24971 10604 31653 2981 -12578
24354a2578J032r369K6777K5767j5316j3791Q762Q222L319N475j1486n570k5044
24341a3800J5554m895j1584j054n658K2406l8317J1491N1697J8331j2358p640
24329B4173m765o426k5034j9417J9320j6374r423K2068K3485L2380L0440j6915
24317E3512k8663k1755l388k429r342k0009M993K808p895j304q690l711J469p544
24303e1948o153J267O465J1248J5854m649P399J4942p851N08J3709l7097l0848
24290f7154j087J5483J9581L1433J0281j0210o443K772k2441r001K0608q76O252
24277a0802J7551J2518J4669J2783j680P114Q737J3960j4681j447k7276o387l295
24264B1764K107r665o487N543o8j2356P21n397j3515l478L776j9903o221N671
$$ plain form
24354 -12578 -11546 -20915 5862 31629 16313 2522 11284 19506 22825 28300 16814 11244 -13800
24341 -13800 1754 -3141 -14725 -15779 -21437 969 -37348 -25857 25840 44171 31813 24173
24329 24173 19408 12982 -12052 -31469 -12149 -28523 -37946 -15878 7607 39987 70427 53512
24317 53512 24849 3094 -294 -2723 -12065 -32074 -27081 -24273 -32168 -33472 -42162 -45873 -44404 -51948
24303 -51948 -58101 -56834 -50369 -39121 -23267 -27916 -20517 -5575 -13426 -12918 791 -36306 -67154
24290 -67154 -68241 -52758 -33177 -1744 8537 -1673 -8116 -5344 -27785 -36786 -16178 -17054 -10802
24277 -10802 6749 19267 33936 46719 45039 52153 60890 74850 60169 58722 31446 25059 21764
24264 21764 23871 14206 7719 13262 13194 838 1559 -3838 -17353 -20831 -17055 -36958 -43179 -37508
24250c7508o727L0753R388J7717K4816J0205n241J193L68k0305l5003J1224Q613
24237I493J6163J2950J500j8388j0876n440j2627k449j224K7048J7187q415k6879
24224a957p756k026L0228J2854J908J3519j0782k6534P437M804q784j0429n354
24211b872L10J0012k376j9623j843O843j735L3619J1972J399J1888o188R315j0949
24197C9772j6257o369k7079Q598J7494j887m360J0955m0534J7423K8518N831k0368
24184A1737j3511o022N198R841k1426J5911K1739r894l7143K448J4591J1189P049
24171A1707k08J3071j250m487l0966l7385K8188L723j6702Q734L7362J4050J3236
24158C9073m441m2554n980K1252j0296p977l890k0456K6076K1773r07j016L385
$$ plain form
24250 -37508 -44235 -13482 -4094 13623 38439 48644 43403 44596 44964 24659 -10344 880 9493
24237 9493 25656 38606 40106 21718 10842 5402 -7225 -9674 -10898 16150 33337 24922 -1957
24224 -1957 -9713 -11739 18489 31343 33251 46770 35988 9454 16891 21695 12911 2482 -2872
24211 -2872 -2562 7450 5074 -14549 -16392 -9549 -11284 22335 34307 35706 47594 41406 50721 39772
24197 39772 23515 17146 -9933 -1335 16159 14272 9912 20867 -19667 -2244 26274 32105 11737
24184 11737 -1774 -7796 -2598 7243 -14183 1728 23467 13573 -23570 -21122 -6531 4658 11707
24171 11707 11499 24570 23320 18833 -12133 -49518 -21330 -17607 -34309 -25575 11787 25837 39073
24158 39073 34632 -7922 -13902 7350 -2946 -10923 -14813 -35269 -9193 12580 11673 10657 14042
24145A4042K3820k0808m3565j480K7446J9334Q718O495j711Q973j1475j3773O901
24132B2917j5221l455K2374l298n465o578J6591q657k0189K4502J8554l763k2047
24119A6265j4359j7721j3112q8J3992Q075K4464j4168j2451R867m712k3261j1430
24106c8639q799J1067L6347j9849K6494J3575J4789R233k334n9151m1093N158
24094e3202O057L1194J3790J67j1857M308K2991q560j6585K5895L2783m2380n3910
24081d9309J4657M3714L0021O222m2093j6565L8403J5847j4053q519K545l2477
24069a1607j1259N587j5448R747J3697m624j6134L027J2070j7538j0324K2728
24057b0078o206j1570Q331K3372K0822m0378j7343K5892K3447J7656k342R561
$$ plain form
24145 14042 37862 17054 -26511 -27991 -545 18789 27507 34002 32291 41264 29789 16016 22917
24132 22917 7696 4241 26615 23317 17852 11274 27865 19208 -981 23521 42075 38312 16265
24119 16265 1906 -15815 -28927 -29015 -15023 -6948 17516 3348 -9103 764 -3948 -27209 -38639
24106 -38639 -47438 -36371 -24 -19873 6621 20196 34985 44218 41884 -17267 -58360 -53202
24094 -53202 -47145 -15951 -2161 -1994 -13851 -9543 13448 4888 -11697 14198 46981 4601 -49309
24081 -49309 -34652 9062 39083 45305 3212 -13353 25050 40897 26844 18325 20870 -11607
24069 -11607 -22866 -17279 -32727 -22980 -9283 -13907 -30041 -27014 -14944 -32482 -42806 -20078
24057 -20078 -26284 -37854 -29523 -6151 14671 -25707 -43050 -17158 6289 23945 21603 31164
24045C1164l173J2337j4595j9044o903K3211j0202n218j4800l680P129Lr574J630
24031a1715J511k1924N242J1448J4226N658l282l0442j8682J9215J8595N418j5768
24018b0500N267J2688m980j6930m908J3985K171J6940J2433k1362l3050J4851
24006b3395k233R496p534K8755n611j2844j3061l928J6581K119p392O681M408
23993g958o467r404m3599J907J5251J6457k612R968M349J9817J971j4014j3722
23980b8056J5788K185k3276n223R281M5376L750O284l947q283j6865o192P328
23967a850j0602P948Q873N3486R990j6924k4768J4652j6463k631q636k3775Q199
23954b501J3904K468j0695n292m102k1370j1882l499J9377L0885L3230N848k1001
$$ plain form
24045 31164 27991 40328 25733 6689 -214 22997 12795 7577 -7223 -10903 -3774 -3771 -13345 -11715
24031 -11715 -10204 -32128 -26886 -15438 -1212 4446 1164 -29278 -47960 -28745 -10150 -4732 -20500
24018 -20500 -15233 -2545 -7525 -24455 -29363 -15378 -13207 3733 16166 -5196 -38246 -23395
24006 -23395 -25628 -16132 -23666 5089 -522 -13366 -26427 -30355 -13774 -11655 -19047 -12366 -7958
23993 -7958 -14425 -23829 -67428 -65521 -50270 -33813 -36425 -26457 -22108 -2291 -320 -14334 -28056
23980 -28056 -12268 -10083 -33359 -38582 -29301 16075 19825 26109 22162 13879 -2986 -9178 -1850
23967 -1850 -12452 -4504 4369 57855 67845 50921 26153 40805 24342 21711 13075 -10700 -2501
23954 -2501 11403 13871 3176 -2116 -6218 -27588 -39470 -42969 -23592 7293 40523 46371 25370
23941B5370j4623J4971J1435O853J0535k0646q627l5725m7809K4742J2196l4562
23929e5890K0491J0596j4040R878k217Q545K4388M355j7638K2885J97k580n6k5344
23915a6430O804K2866j4758k1400J1744K4742J0769K0743j764j7739r559K3734
23903C9752m809k8424M510M786k420J5208L45j3992L831j3895j2493j6797q64
23890b5262Q852J5988J992J6795P959j9312j5018J5048N85K997n100m587k0531
23877a9594J3218j1324K6998J4884j5169k420K0844j5102k2584L7680J6494j7297
23865B6628p157P84M418j3376k5933j8717K763J3899k5166R566K2521k900J211
23852a1459J6814k133M3520J835r392o761j7836j9082K7701J5231J837k682J0759
$$ plain form
23941 25370 10747 25718 37153 44006 54541 33895 25268 -10457 -58266 -33524 -21328 -55890
23929 -55890 -35399 -24803 -38843 -28965 -31182 -22637 1751 6106 -11532 11353 11550 8970 8914 -16430
23915 -16430 -9626 13240 -1518 -22918 -11174 13568 24337 45080 43316 25577 16018 39752
23903 39752 34943 6519 11029 15815 13395 28603 28948 14956 18787 4892 -7601 -24398 -25262
23890 -25262 -16410 -422 1570 18365 26324 7012 -8006 7042 7627 10624 5524 937 -19594
23877 -19594 -6376 -17700 9298 24182 9013 6593 27437 12335 -10249 27431 43925 26628
23865 26628 19471 20255 24673 11297 -14636 -33353 -30590 -16691 -41857 -32291 -9770 -12670 -11459
23852 -11459 5355 3222 46742 48577 39185 32424 14588 -4494 23207 38438 40275 37593 48352
23839D8352q076l8380j4491p262K3673J4635l724J974k9754J064K2114p257j9010
23826a6142J679J8819K5327j364l5144k345K1388j5099l7791o131l730J7083K3639
23813i811r03q348j8794R878Q848K2128k7404l7857k0897J4112K3569K7539J7122
23800h18m132q792K0181L862j5822J6393J5703Q652K952m74j4443j4433L600Q290
23786B0719L0255J3689p272j3787l0664j2299j1859j351M174o195j9953k1078
23774e5621k4305J1328J1418J4441M5411j2150M156j3479O390K7561Q986l4506
23762a0370k4564j5794J7159J8499L0812j6059q866P529J056K191K3030j3940
23750A0683K2297K2955j5994j3162j6867k9315l3250J927L1090K0057J6624p659
$$ plain form
23839 48352 40276 1896 -12595 -19857 3816 18451 14727 16701 -13053 -11989 10125 2868 -16142
23826 -16142 -14463 4356 29683 28319 -6825 -9170 12218 -2881 -40672 -46803 -50533 -33450 -9811
23813 -9811 -10714 -19062 -37856 -27978 -19130 2998 -24406 -62263 -83160 -69048 -45479 -17940 -818
23800 -818 -4950 -13742 6439 10301 -5521 10872 26575 35227 38179 37705 23262 8829 12429 20719
23786 20719 50974 64663 57391 43604 12940 641 -11218 -12569 -8395 -14590 -34543 -55621
23774 -55621 -79926 -68598 -57180 -42739 2672 -9478 -5322 -18801 -12411 15150 24136 -10370
23762 -10370 -34934 -50728 -33569 -15070 15742 -317 -9183 -1654 -598 1593 24623 10683
23750 10683 32980 55935 39941 26779 9912 -19403 -52653 -50726 -19636 421 17045 9386
23738I386j9892R726j587p880M368r338K042J3065j462j5029l7358Q121L0649
23725a5189o960k5365J4290M985p862j6j764L179j8904k580L8445J3761R665R496
23711A5181k8756j1378q09M1064K5855o040k0490j3235j6465N04k2720J0510K124
23698b4655K0969J6482j2559l0932J204K697J0040J2161J321J913k284n806j1719
23685b1168p560K3574p196J2983O615k0603m469L011j6385m424K1232j099J0302
23672e187O604J0226L510O75n360n82P064J2306k9110k6133J6562L456N264q98
23658a603j3835Q872o813k2520K893j0369P347K7615R985n9k061K0110n818q02
23644A2942k857M629j3058j4297L808Q554P918n64R974Q252N79j533k2994k3066
$$ plain form
23738 9386 -10506 -780 -2367 -10247 -5879 -15217 -13175 -110 -1572 -16601 -53959 -45838 -15189
23725 -15189 -22149 -47514 -33224 -28239 -36101 -36117 -37881 -34702 -53606 -56186 -17741 -3980 5685 15181
23711 15181 -13575 -24953 -25762 15302 41157 35117 14627 1392 -15073 -14569 -37289 -26779 -24655
23698 -24655 -3686 12796 237 -30695 -29491 -26794 -16754 -4593 -3272 -1359 -3643 -9449 -21168
23685 -21168 -28728 -5154 -12350 633 7248 -13355 -17824 -14813 -31198 -35622 -14390 -15489 -5187
23672 -5187 1417 11643 15153 15828 10468 9886 16950 29256 146 -25987 -9425 -5969 -705 -1603
23658 -1603 -15438 -6566 -13379 -35899 -33006 -43375 -36028 -8413 1572 1513 -548 19562 13744 12942
23644 12942 10085 14714 1656 -12641 -8833 -279 7639 7075 17049 25301 25880 24347 1353 -21713
23630b1713k8875l367J3370K0599M1619k8834l1888p333k0353m167R064K453J6476
23617d2949O450K0095K5072J2743L286p004Q748m013k010N519J0715l2953r993
23604f294L701K1862K3169j1498O374N474k5635j2442k154l1889j5203K4586J3200
23591f749O290R560J313j9190k2498J8728J2131n449m605P657K168m113l266k324
23577a0347j1098Q354j1848k9555j877r374K8240L8896K1441L886k5159k8392
23565b6833j0416m738j3158J0178J0135L735j169J2884R525J1248j3529K133L1099
23552B1094J6021j5169l150j7719k040j7050M85l0310L429L1709p221K0012j0453
23539a0362j450J3690m249l6562l66j150J1024l633M236q746R647L4528M2766
$$ plain form
23630 -21713 -50588 -53955 -40585 -19986 21633 -7201 -39089 -46422 -66775 -70942 -61878 -59425 -42949
23617 -42949 -36499 -16404 8668 21411 24697 17693 26441 22428 20418 25937 36652 3699 -6294
23604 -6294 -2593 19269 42438 30940 37314 42788 17153 4711 2557 -29332 -44535 -19949 -6749
23591 -6749 -459 9101 10414 -8776 -31274 -12546 -415 -5864 -10469 -2812 -644 -4757 -8023 -10347
23577 -10347 -21445 -13091 -24939 -54494 -56371 -65745 -37505 1391 22832 26718 1559 -26833
23565 -26833 -37249 -41987 -55145 -44967 -34832 -31097 -32266 -19382 -9857 1391 -12138 -10005 21094
23552 21094 37115 21946 18796 1077 -963 -18013 -17528 -47838 -44409 -12700 -19921 91 -10362
23539 -10362 -11812 1878 -2371 -38933 -39299 -40449 -29425 -33058 -28822 -37568 -27921 6607 49373
23526D9373P184j7684j4788N054K0411m1711m2924p087J4170R992n765r643M7894
23513A4476J36k789J0128j0664k518J987r535j2088J0240J8712k5086M046J6951
23500A3996j1235j0028j2746k3203j2194M141R133K5552L521J4065J8608P80J5208
23487C5598k9425k5022o45J5280J3117K3805P22m434r697j4833j6855k4993K4812
23474a2570P082j4227J9424l2336j3229J1351L1439J4140k120p627k1827o97L5894
23461A4697N29Q343l945j792K1252j9763k6819k235J4357K2096J3528q105j4239
23448A7904J8433j591p878j0597j0164J9225J6225j3994j4649J7259j888l7926
23436i641K860j6312J664N767n93J4433L2033m531j1280m884k9675k4867o905
$$ plain form
23526 49373 56557 38873 24085 29139 49550 7839 -35085 -42172 -28002 -18010 -23775 -33418 14476
23513 14476 14612 11823 21951 11287 8769 10756 1221 -10867 -627 18085 -7001 -2955 13996
23500 13996 2761 -7267 -20013 -43216 -55410 -51269 -42136 -16584 -13063 1002 19610 20390 35598
23487 35598 6173 -18849 -19494 -4214 8903 32708 33430 28996 19299 4466 -12389 -37382 -12570
23474 -12570 -5488 -19715 -291 -32627 -45856 -34505 -3066 11074 8954 1327 -20500 -21197 14697
23461 14697 15226 23569 19624 17832 39084 19321 -7498 -9733 4624 26720 40248 32143 17904
23448 17904 36337 34746 26868 16271 6107 25332 41557 27563 12914 30173 28285 -9641
23436 -9641 -6781 -23093 -21429 -15662 -16255 -1822 30211 25680 14400 9516 -20159 -45026 -51931
23423e1931J4204J9627N383n668J663J8662J8409o746q323J1111J318L586k0108
23410A187q988j9608j8217j706J8273L606k4280j4857L8923J1190L7722K6255
23398D9500l5559p019j2858q657k4993J9813L3515J0487J5578j6977J5944k2394
23386A6380r27l476q667o890j1143J1036K9171j3053n259l4603p080J5536J2868
23373f107K5913J3222L9392j9533j6176J6187l1880l6767k5997J1271K0711j1722
23361b1486r522j741J910k008j916J732K3390j7568m7752K2746M5100L7104j8675
23348A1314j9169j3235J703K0352K5253K1235O21k9233l0808J386L860n532Q883
23335c370L747L0723P025L087j7262l0223j9284l203L851N982k7898M724J372
$$ plain form
23423 -51931 -37727 -18100 -12717 -18385 -16722 1940 20349 13603 5280 16391 17709 21295 1187
23410 1187 -7801 -27409 -45626 -47332 -29059 -25453 -49733 -64590 -25667 -14477 23245 49500
23398 49500 13941 6922 -5936 -14593 -39586 -19773 13742 24229 39807 22830 38774 16380
23386 16380 15453 11977 3310 -3580 -14723 -3687 25484 12431 7172 -27431 -34511 -18975 -6107
23373 -6107 19806 33028 72420 52887 36711 52898 21018 -15749 -41746 -30475 -9764 -21486
23361 -21486 -31008 -32749 -30839 -32847 -34763 -33031 -9641 -27209 -74961 -52215 -7115 29989 11314
23348 11314 -7855 -21090 -19387 965 26218 47453 48074 18841 -11967 -10581 -6721 -12253 -3370
23335 -3370 377 31100 38125 41212 23950 -6273 -25557 -28760 -24909 -18927 -46825 -42101 -40729
23322d0729M2708M8819k2323m7425j5918M3802L0315k2592p190K313k9502L106
23310a4616J2508k3395J7262J9463j3344o637L322J5735k612O748Q08J2830r894
23297A8178l123R598l370K85L924l5272j2374N516k0680K811P483J1423K1241
23284E640J5213O543r279j4782j9505j3745J6491M1435L999k5706N581n926j0744
23271d785K2379j0196j762J5670n118P87q712N992P369o482l729R000o691k8138
23257a4416J9100j4223k0396j5493J600J1409r341O851L0468j755j5931M062M805
23244a3260J515J3054L4321P103l5016k14J4958k3773O671R94o542K699n531L950
23230I29k105j4243k3263j2471O935J0163K5567J8166j591j0764k694m2752O432
$$ plain form
23322 -40729 1979 50798 28475 -18950 -34868 8934 39249 16657 9467 11780 -17722 -14616
23310 -14616 -2108 -25503 -8241 11222 -2122 -8759 -5437 10298 7686 14434 15242 28072 18178
23297 18178 15055 24653 21283 21568 25492 -9780 -22154 -16638 -37318 -34507 -27024 -15601 5640
23284 5640 20853 27396 18117 3335 -16170 -29915 -13424 28011 32010 6304 11885 5959 -4785
23271 -4785 17594 7398 5636 21306 16188 16975 8263 14255 21624 15142 11413 20413 13722 -14416
23257 -14416 4684 -9539 -29935 -45428 -43828 -32419 -41760 -34909 -4441 -6196 -22127 -18065 -13260
23244 -13260 -11745 1309 35630 42733 7717 7503 22461 -1312 5359 6353 -189 2510 -3021 929
23230 929 -1176 -15419 -38682 -51153 -44218 -34055 -8488 9678 8087 -2677 -5371 -48123 -41691
23217d1691K0483M878r863k578J9343Q09k2696n90J6869K7435k0588p722J7032
23204A121J2029r294K1963L4094l4823k6857j5528P258J5864J1316k4724k4477
23192c2058j9026j3284J1074R129J4277K560o737o807r78K2189M1255j7749l3671
23179b9826j0291k257O061J2775J5217J004j6584Q7K0544J5152J4873m1306j1460
23166b6011L2408Q729M183j5407j6035J0279j5192j3225K5356K3362L651J0319
23154C2417K658l3127k7407k0725K3424L3621Q913K719R379p528j1760k5616L058
23141i974L7990J6507k9169j5458m559K532J6513J8474L638l6317k5061J2025
23129a2859J0965K7211K1095J4048m177K4837l5l8279m295J4914m0228j0034R180
$$ plain form
23217 -41691 -21208 -16330 -26193 -28771 -9428 -8619 -31315 -31905 -15036 12399 -8189 -15911 1121
23204 1121 13150 3856 25819 59913 25090 -1767 -17295 -10037 5827 17143 -7581 -32058
23192 -32058 -51084 -64368 -53294 -44165 -29888 -27328 -34065 -40872 -41850 -19661 21594 3845 -29826
23179 -29826 -40117 -42374 -36313 -23538 -8321 -7317 -23901 -23814 -3270 11882 26755 -14551 -26011
23166 -26011 6397 15126 19309 3902 -12133 -1854 -17046 -30271 -4915 18447 22098 32417
23154 32417 35075 1948 -25459 -46184 -22760 10861 19774 22493 31872 24344 12584 -13032 -9974
23141 -9974 28016 44523 15354 -104 -4663 -2131 14382 32856 36494 177 -24884 -12859
23129 -12859 -1894 25317 46412 60460 56283 81120 81085 42806 38511 53425 13197 3163 12343
23116A2343M602M569j8048j0517k3489j0824J1127J1678j909J1058J5888k5132
23104a8654M058q104j7382J2930l128J4930K8675K3061k844p366q950l8186p63
23091b1723q313J2388L0623o729K459o436l4321k2528k620K8358J4043O012M669
23078d118m938J175o42m0816j4528m798L8160L3180J7181j3176l4652j340K5083
23065d229l24j8352j0132J9263J3061K6166Q874K2048j0467j0713J2310o349l4641
23052F515l342k362k5883j0351R482J2068l0412k2182J8998o074O740r246k5464
23039h1513Q79N249K3454K6488J8249K911J2853L2486J9636j7453n521J145l002
23026C5861k2173j5199p756J254L556J430j2940k936j2808R838J414m1m782N747
$$ plain form
23116 12343 16945 21514 3466 -7051 -30540 -41364 -30237 -18559 -20468 -9410 6478 -18654
23104 -18654 -14596 -22700 -40082 -27152 -30280 -15350 13325 36386 33542 26176 17226 -20960 -21723
23091 -21723 -30036 -17648 12975 6246 8705 2269 -32052 -54580 -57200 -28842 -14799 -8787 -4118
23078 -4118 -9056 -7881 -8523 -49339 -63867 -68665 -30505 2675 19856 6680 -27972 -29312 -4229
23065 -4229 -4553 -22905 -33037 -13774 -713 25453 34327 56375 45908 35195 47505 41156 6515
23052 6515 3173 811 -25072 -35423 -25941 -13873 -44285 -66467 -47469 -53543 -46803 -56049 -81513
23039 -81513 -80634 -75385 -51931 -25443 -7194 -4283 8570 41056 60692 43239 37718 38863 35861
23026 35861 13688 -1511 -9267 -8013 -4457 -3027 -15967 -18903 -31711 -21873 -20459 -20500 -25282 -19535
23012a9535O229J220J8068j9734m184R703J0817L8481n174m363L369k8521j3667
22999g291k4704J2586p386O131o492J0946j1990k0191J1740O498k396J0862J6728
22986d959r91j1353K595R366j2284q812M761J0973k0220R734R839o906J4436L5083
22972C1262Q987j8719j8649n941K3315J1169m843k4402K0698K5587l0756k7737
22960a0029J1270k7472j5482l990K9432J0238l1056p866j1611K1319k6228j0988
22948g2463M4499L2100j3417l4192O033K72J9616l804P953J5558l3678J1718J4834
22935d971K2138n758L011m045k8426n30Q645K1543K3297j3809L600o434m5826
22922b7565n448o93J6313n629j7297j1287K3641K6497o680J2477L925J6906J2443
$$ plain form
23012 -19535 -13306 -12086 5982 -13752 -17936 -8233 2584 41065 35891 31528 34897 6376 -7291
22999 -7291 -31995 -19409 -26795 -20664 -27156 -16210 -28200 -48391 -36651 -30153 -32549 -21687 -4959
22986 -4959 -5950 -17303 -14708 -5342 -17626 -26438 -21677 -10704 -30924 -21190 -11351 -18257 -3821 31262
22972 31262 40249 21530 2881 -3060 20255 31424 26581 2179 22877 48464 17708 -10029
22960 -10029 1241 -26231 -41713 -45703 -16271 -6033 -37089 -44955 -56566 -35247 -61475 -72463
22948 -72463 -27964 4136 -9281 -43473 -37440 -37168 -17552 -21356 -13403 2155 -31523 -19805 -4971
22935 -4971 17167 11409 14420 10375 -18051 -18581 -9936 11607 34904 21095 24695 18261 -27565
22922 -27565 -33013 -33706 -17393 -23022 -40319 -51606 -27965 -1468 -8148 4329 8254 25160 37603
22909C7603J478J0729l7861k0886j2558m1912k6822P12J6030n215O506K0010J5443
22896c6743k447J9589K3631k8536k3060r160K8245J9562j4756j0848J1219K6699
22884C395J414j4938n445J5486K4117J038o129k5351k4866J4875L796j4747L838
22871b3517j2727J7894K4277J8428K809j4640m76K21N767j3565J2133K8395N947
22858E0946m7045o183K2722J6422p831q554o234m5855j2701J8655Q246K2389L722
22845H699p852K1j3787p608J366K3593O825P94N00j5488k5483K7358K1664j7678
22831B924j9937j196j0924J4849Q695j687M727m103o269M289J6931J0946N164
22818B4409O84j633j8791P175P334k1848j8155j0093J1986j3340j7521J1787n825
$$ plain form
22909 37603 39081 49810 11949 -8937 -21495 -63407 -90229 -89517 -73487 -78702 -72196 -52186 -36743
22896 -36743 -39190 -19601 4030 -24506 -47566 -56726 -28481 -8919 -23675 -34523 -23304 3395
22884 3395 4809 -10129 -15574 -88 24029 25067 18938 -6413 -31279 -16404 -12608 -27355 -23517
22871 -23517 -36244 -18350 5927 24355 27164 12524 12048 12269 18036 4471 16604 44999 50946
22858 50946 3901 -2282 20440 36862 29031 20477 14243 -31612 -44313 -25658 -17412 4977 8699
22845 8699 847 868 -12919 -20527 -19161 4432 11257 12051 12551 -2937 -28420 -1062 20602 2924
22831 2924 -17013 -18209 -29133 -14284 -5589 -7276 -2549 -6652 -12921 -8632 8299 19245 24409
22818 24409 25093 23460 4669 11844 19178 -2670 -20825 -30918 -18932 -32272 -49793 -38006 -43831
22805d3831j784K3044K2744M085j2856N838K5875N069l278p949j5596J2284k7519
22792a3874Q878n435m406L8356j5621m8173j48p172K3254J3747R531o667M450
22779c280j1119m277J34L1j0208k564N735L5338K272k5032l967J4525P812k4667
22765a9267l2316J8248K7215J6162M902J9802j6016o563j0259K0262p688j1697
22753B785l321j6120n143j1243J712q749K8388M006o803o705j844L37k6675J1012
22739c8363J9160l036l163p497l166o835K312j1844O243K8158K5614r774q357
22726a0548J4953m390n728J0133J6487O49l8807j2096M633J4155J7089J2257k279
22713A6508K920k8815r484K1464r439l2446j4405K2912J6542k7261j4783J7804
$$ plain form
22805 -43831 -45615 -22571 173 4258 -8598 -2760 23115 28184 24906 16957 1361 13645 -13874
22792 -13874 -4996 -10431 -14837 23519 7898 -40275 -40423 -47595 -24341 -10594 -1063 -7730 -3280
22779 -3280 -14399 -18676 -18542 -18511 -28719 -31283 -25548 9790 12062 -12970 -16937 -2412 5400 -19267
22765 -19267 -51583 -33335 -6120 10042 14944 34746 18730 12167 1908 22170 14482 2785
22753 2785 -536 -16656 -21799 -33042 -31330 -40079 -11691 -7685 -14488 -21193 -23037 -22700 -49375 -38363
22739 -38363 -19203 -22239 -25402 -32899 -36065 -42900 -40588 -52432 -46189 -18031 7583 -2191 -10548
22726 -10548 4405 15 -5713 4420 20907 21556 -17251 -29347 -24714 -10559 6530 18787 16508
22713 16508 19428 -9387 -18871 2593 -6846 -39292 -53697 -30785 -14243 -41504 -56287 -38483
22701c8483K7153l1893k2276K2122K0371k813n110m746K4154R496l2732M991J8794
22688a0972M99r796J367m195J7912j6091J1374K1835K1800k0190n10M57j818J6564
22674B8236n691r732k4346J728J0238O952J3823k5553k9784j1993P320j7855J5237
22661d1420L5375L2109m204n374J3339j1785j2694J4686J6937j1808p876o949
22649A0336n431K728K4713j7190l505k506j1513L210o466J0854j3664j8216J8043
22636h607L653O476l921q318J3854J2475k0951P269O757j6780j1410k2558p14
22623d2775p065M175j295L5510J8609O393k587j0901j5884k379J8556k2423j2845
22610c4911K553l3394j6075R525J4143J6564J9601K9841M1403J5684j7507k0965
$$ plain form
22701 -38483 -11330 -43223 -65499 -43377 -23006 -25819 -30929 -35675 -11521 -2025 -34757 -29766 -10972
22688 -10972 -10473 -20269 -18902 -23097 -5185 -21276 -9902 11933 33733 13543 13033 13490 11672 28236
22674 28236 22545 12813 -11533 -9805 433 7385 21208 -4345 -34129 -46122 -38802 -56657 -41420
22661 -41420 -6045 26064 21860 16486 29825 18040 5346 20032 36969 25161 17285 10336
22649 10336 4905 7633 32346 15156 11651 9145 -2368 842 -5624 5230 -8434 -26650 -8607
22636 -8607 -4954 1522 -2399 -10717 3137 15612 -5339 1930 8687 -8093 -19503 -42061 -42775
22623 -42775 -49840 -45665 -46960 -11450 7159 13552 10965 64 -15820 -18199 357 -22066 -34911
22610 -34911 -32358 -65752 -81827 -72302 -58159 -41595 -21994 7847 49250 64934 47427 26462
22598B6462p099j2128J4805j7532m0376r460j7011K5524O405O908K0601N520p06
22585A913l7670j1570L0529P327q520Q52L1157J803k7447k2262r118j3052j9053
22572g5111l348P171M1273L1839L4560l706R286j1293k5831r794J8212l43j1003
22559A912j910J3673J5457Q016j6973j8856p409k8296j3500K2851K0215J5195
22547A0375P575p919L486k870o075J3310L303j4382M175J2480n468L081j8522
22534B549j5436j9805k3866j5642K5279K961j4426J1020j213m952K0077J413l1409
22521f3450J9874J8478O542j7624K2067j8808O767N93j6110j7603K8931L553K7014
22508B24K8502k3511l1401J7217K2012j466K5735K4999j6220m955j4960J891M556
$$ plain form
22598 26462 19363 7235 22040 4508 -35868 -45328 -62339 -36815 -30410 -23502 -2901 2619 1913
22585 1913 -35757 -47327 -16798 -9471 -17991 -17139 14018 15821 -11626 -33888 -43006 -56058 -75111
22572 -75111 -78459 -71288 -30015 1824 36384 32678 41964 30671 4840 -4954 13258 12915 1912
22559 1912 2 13675 29132 37148 20175 1319 -6090 -34386 -47886 -25035 -4820 10375
22547 10375 17950 10031 13517 10647 4572 17882 21185 6803 10978 23458 17990 21071 2549
22534 2549 -12887 -32692 -56558 -72200 -46921 -43960 -58386 -47366 -48579 -53531 -33454 -32041 -63450
22521 -63450 -43576 -25098 -18556 -36180 -14113 -32921 -26154 -25561 -41671 -59274 -30343 -26790 224
22508 224 28726 5215 -26186 -8969 13043 11577 37312 62311 46091 41136 26176 28067 32623
22495C2623j1423R195J174j4120j5684l1424O981j4361J7928J6505M961j1704
22483i349N272m245n259J1807J2988K284K7404R280j6300k7036o465K6545k2516
22470D410j3135J8014J8821k625o829n094j1488J1643R374N460k5002k3675R478
22457a0648K7914M100j1253j5113j3335n099J0280j8683r262R224j0687j2235
22445e4797J9778J2301j3392l923r293K6206L3907m876l3889j492M801J2409K0736
22432H476j504l2059J074J9769l8232k736M6995m040j3228J2713M242r257j9366
22419b7153q805L1663J3044r638r332m887K170p675l4449Q383K1717q891Q7J155
22405c2611Q483P584r482m892j6665n373L8646J8754K0916j8026M009J9095n025
$$ plain form
22495 32623 21200 30395 31569 17449 1765 -29659 -22678 -37039 -19111 -2606 2355 -9349
22483 -9349 -4077 -8322 -13581 -1774 11214 13498 40902 50182 33882 6846 381 26926 4410
22470 4410 -8725 9289 28110 25485 18656 13562 2074 13717 23091 28551 3549 -20126 -10648
22457 -10648 17266 21366 10113 -5000 -18335 -23434 -13154 -31837 -41099 -31875 -42562 -54797
22445 -54797 -35019 -22718 -36110 -40033 -49326 -23120 10787 5911 -27978 -29470 -24669 -12260 8476
22432 8476 6972 -25087 -24013 -4244 -42476 -45212 1783 -2257 -15485 -2772 1470 -7787 -27153
22419 -27153 -35958 -4295 8749 -889 -10221 -15108 -12938 -20613 -55062 -46679 -24962 -33853 -33766 -32611
22405 -32611 -24128 -16544 -26026 -30918 -47583 -52956 -14310 4444 25360 7334 11343 30438 25413
22392B5413j5986k7248j982k8157K195L1212K6389j5699k081j7954j2777j6670
22380e3345j3385m088J7838J4961r29M652P164P094K7874L347o743k0090r852
22367b5502n982k8028K9531m255k5288J1513L0684R651k6262m474L4987K8024
22355B4599K5014j5674m2150m5973J018L0269K1326N398J5366r220k3816j3818
22343b7661J9734P96j755J6083j1479j8832K864L4616P267k6392q827N081j3274
22330b1779n832M70J5801J5598k0926j9112J0750n13J2553n44j2114M7322j801
22317A9873l385k216j6633j7838J0685L1518J8444k20l3457k8554J7861J3219
22305I297J084m776k2783j7597j5355j938m91j5404j738K6137J0368K197L7186
$$ plain form
22392 25413 9427 -17821 -19803 -47960 -45765 -14553 11836 -3863 -5944 -23898 -36675 -53345
22380 -53345 -66730 -70818 -52980 -38019 -38948 -34296 -27132 -20038 7836 11183 4440 -15650 -25502
22367 -25502 -31484 -59512 -29981 -34236 -59524 -48011 -17327 -7676 -33938 -38412 -3425 24599
22355 24599 49613 33939 -8211 -54184 -53166 -22897 -1571 3827 19193 9973 -13843 -27661
22343 -27661 -7927 -7131 -8886 7197 -4282 -23114 -20250 14366 21633 -4759 -13586 -8505 -21779
22330 -21779 -27611 -27141 -11340 4258 -16668 -35780 -25030 -25543 -12990 -13534 -25648 21674 19873
22317 19873 16488 14272 -2361 -20199 -9514 22004 40448 40228 6771 -21783 -3922 9297
22305 9297 10381 5605 -17178 -34775 -50130 -52068 -52559 -67963 -69701 -43564 -33196 -30999 6187
22292F187J1578j1826l4346J754K1181j8096j3617P151J3413n091L621L1183J9421
22279C2513k6821m1003j9567L5943J8307j6904M7J9346r703K5217O43J5795j7203
22266A6610Q03o324j0746j529J1707k2638J5187q62k0177K052J7717k4435j5412
22253c8047K0902k2299J8641J7616j293q855P854j2411j0750R276K3530O061l132
22240G093k8878l665o190N753J0724J063L4496K4500j6802k5015n5361J4430L6122
22227a730j5559l0355j0303J3597L4236K3876k2481p658J1524O645k8208j8843
22215d5259J2237q902j3465l3990L3295L5105L5810O926j0271j3243n258k2841
22203b9856J9990J1466L843m541m946l7047j2686J4766P8j289R015J8745j433
$$ plain form
22292 6187 17765 5939 -28407 -26653 -5472 -23568 -37185 -30034 -16621 -21712 -18091 13092 32513
22279 32513 5692 -35311 -54878 -18935 -628 -17532 -17485 1861 -7842 17375 18018 33813 16610
22266 16610 17413 11089 343 -1186 10521 -12117 3070 2208 -17969 -15917 1800 -22635 -38047
22253 -38047 -17145 -39444 -20803 -3187 -4480 -13335 -5481 -17892 -28642 -19366 4164 10225 7093
22240 7093 -21785 -25450 -31640 -25887 -15163 -14100 20396 44896 28094 3079 -52282 -37852 -1730
22227 -1730 -17289 -47644 -57947 -44350 -10114 13762 -8719 -16377 -4853 1792 -26416 -45259
22215 -45259 -33022 -41924 -55389 -89379 -56084 -20979 14831 21757 11486 -1757 -7015 -29856
22203 -29856 -9866 1600 5443 902 -4044 -41091 -53777 -39011 -38933 -40222 -31207 -12462 -13895
22190a3895K3933J3615j150k606l025j403j8975k2775k9962q705M552l713J2677
22177e1432j2550j7887L4513K4984R876p953k2192K8041J5689L508R142L548L3292
22164E0579m104j9301P090j1709l2765L877J7667K1167j4218m1157l1635j140
22152e5649K9680Q273J7287K4010k9347l5159M530J9032J9942j939n889l6903
22140d2132M802L8556J33O769R94k785j4599k7277J789j5488j8169K0120J6124
22127c1163L5192K2482l324j7942k3121p815J0536q862O651K6069J8078k3215
22115C566m581j1853l787J616m466J6277j031L2418J7937j0525m547M261k7490
22102G795Q094L6184j1838k1986o579q238n315k1010j5294j3839R867L0013M7537
$$ plain form
22190 -13895 10038 23653 22503 19897 16872 15469 -3506 -26281 -56243 -64948 -60396 -64109 -51432
22177 -51432 -63982 -81869 -47356 -22372 -12496 -20449 -42641 -14600 1089 4597 13739 17287 50579
22164 50579 46475 27174 34264 22555 -10210 -6333 11334 32501 18283 -22874 -54509 -55649
22152 -55649 -25969 -17696 -409 23601 -5746 -40905 -36375 -17343 2599 660 -5229 -42132
22140 -42132 -37330 1226 1359 8128 9122 6337 -8262 -35539 -33750 -49238 -67407 -47287 -31163
22127 -31163 4029 26511 23187 5245 -17876 -25691 -15155 -24017 -17366 8703 26781 3566
22115 3566 -1015 -12868 -16655 -15039 -19505 -3228 -4259 28159 46096 35571 31024 35285 7795
22102 7795 15889 52073 40235 18249 11670 3432 -1883 -22893 -38187 -52026 -42159 -12146 35391
22089C5391K547k7875N913M7405j3331l9196j3438k1697j2671J8404J7234J1138
22077I824j1031j3005J859l727J9158K8272n555j4479k5027K443J6718J1038M406
22064B0894J5133M820k1578k7279q798k419J9372P018j438j821n241n339J3507
22051F831K1480q019q271j2323j6812l735K913K4906m147J1265K7731N785l2119
22038A5485p754q61k9695m109n12j3783J9195J3620J1279K937j9756P377P602
22025A025K5074K8917o04k4456p926k0046N792Q481j0064j5468P080K0948J4685
22012C3438k9049l7676j8666Q090M2191J1083m810p561N529J878K0425m745L275
21999B3402n487j0932k1352j931K098K1201k412j5020l5024J0587J3208J1986
$$ plain form
22089 35391 37938 10063 15976 63381 50050 10854 -2584 -24281 -36952 -18548 -1314 9824
22077 9824 -1207 -14212 -12353 -16080 3078 31350 25795 11316 -13711 -11268 5450 16488 20894
22064 20894 36027 40847 19269 -8010 -16808 -19227 145 7163 5725 3904 -1337 -6676 6831
22051 6831 28311 20292 12021 -302 -17114 -20849 -17936 6970 2823 14088 41819 47604 15485
22038 15485 7731 6870 -22825 -26934 -27446 -41229 -22034 -8414 2865 5802 -13954 -6577 1025
22025 1025 26099 55016 54412 29956 22030 1984 7776 16257 6193 -9275 -2195 18753 33438
22012 33438 4389 -33287 -51953 -43863 -1672 9411 4601 -2960 2569 4447 24872 20127 23402
21999 23402 17915 6983 -14369 -16300 -14202 6999 4587 -10433 -45457 -34870 -21662 -9676
21987i676K2632k3479j9760K563j6330k345Q852J3230Q620k0555L971K7279j7728
21974b2726j1387k671J7827J4499L235m905M722k355o948k97o083L5604n340j5393
21960b218j8695J1965o021l456L248R156J1930L5014R22k9968J2113m606j850
21947A7534R848j360k9503L001J3798P589J7600p398k1517K440m9769o723P151
21934c7309J655K3346K5671j100q792j1258j0403j9992J4241O005j8400j6079
21922e2415K7145J8090j0969L88j1335J2902m847J5862j2158r670K2346j5628
21910b0289L751J7448j2807k240k448q837r734j3640k3687K0409K439o931j609
21897e8175M18L461K0778o227J1590n759K026p490J0351K1040j6237J7662Q103
$$ plain form
21987 -9676 12956 -10523 -30283 -27720 -44050 -46395 -37543 -24313 -15693 -36248 -32277 -4998 -22726
21974 -22726 -34113 -36784 -18957 -4458 -1223 -6128 -1406 -3761 -10709 -11006 -17089 18515 13175 -2218
21960 -2218 -20913 -8948 -14969 -18425 -15177 -6021 5909 40923 41845 11877 23990 19384 17534
21947 17534 27382 26022 -3481 -480 13318 20907 38507 31109 9592 12032 -37737 -44460 -37309
21934 -37309 -35654 -12308 13363 12263 3471 -7787 -18190 -38182 -23941 -17936 -36336 -52415
21922 -52415 -25270 -7180 -18149 -17761 -29096 -16194 -21041 -5179 -17337 -27007 -4661 -20289
21910 -20289 -16538 910 -11897 -14137 -16585 -25422 -35156 -48796 -72483 -52074 -49635 -56566 -58175
21897 -58175 -57757 -54296 -33518 -39745 -28155 -33914 -31888 -39378 -29027 -7987 -24224 -6562 1541
21884A541r795J611L4854J0777l5275j0983J3100O150K475L056j9557k9785L211
21871b8620J2685J023K2428M389k5180n5852J2105N700l8021R51M2009l451K192
21858d7642M058L7962J4990l5817q193j067R15R167m147n955J0135L437J3249
21845h908K4951n516q001N328k8565j386K9878o695k7696J6931J9089J0618k6587
21832f559N951k52n66l6302L622K2762K2215Q913L0319q392k5628j9156j7651
21819b0724N273J109n651r880o461n606L7813K9311j6221J833J0327l862r029
21806H232k8798P093L308J3710M591j7121q26m704k5069n039K0181K8552J2549
21793A6659j0485J8494K8572L143l0309k7166j7716j9484J8853O015o198N970
$$ plain form
21884 1541 -8254 -6643 28211 38988 3713 -7270 5830 11980 14455 17511 -2046 -31831 -28620
21871 -28620 -15935 -14912 7516 11905 -13275 -69127 -57022 -51322 -89343 -88392 -46383 -49834 -47642
21858 -47642 -43584 -5622 9368 -26449 -34642 -35709 -34794 -25627 -29774 -35729 -25594 -22157 -8908
21845 -8908 16043 10527 2526 7854 -20711 -22097 7781 1086 -26610 -9679 9410 20028 -6559
21832 -6559 -608 -860 -1426 -37728 -34106 -11344 10871 19784 50103 41711 16083 -3073 -20724
21819 -20724 -15451 -14342 -19993 -29873 -36334 -41940 -4127 25184 8963 10796 21123 17261 8232
21806 8232 -20566 -13473 -10165 3545 8136 -8985 -9811 -14515 -39584 -44623 -24442 4110 16659
21793 16659 6174 24668 53240 56383 26074 -1092 -18808 -38292 -19439 -13424 -19622 -13652
21781a3652l921k7313j6349J9291M0961Q853N626j3296L156j3058p753J7243J0031
21768I819Q54K960J8816r446m8330L321K7638k0372k3004J9349J5742N162j8196
21755a5687j3951r801P976q851K971m870J4302J2871Q10J2983l499r988q122J804
21741b1052k506j8826N909n895j4984J3255N199p376L8983P468k1378J306l947
21728b3844K137j6967k496J3394j958k0875j1074K8150N031N780J8742j1229p707
21715b2916j0054R40k944K4199k041J361J3730j8273j6902r02L0171j1925j4775
21702c0331l205J4221M3350L6843k2904j8722J6434n503n160k6258l8052l1912
21690g1199P354J7101M4760J4456k5896j3000j0741J9177N670j1244J6213P89
$$ plain form
21781 -13652 -17573 -44886 -61235 -41944 -983 7870 13496 200 3356 -9702 -17455 -212 9819
21768 9819 10673 13633 32449 23003 -25327 -22006 5632 -14740 -37744 -18395 -2653 2509 -15687
21755 -15687 -29638 -39439 -31463 -40314 -37343 -42213 -27911 -15040 -14230 -1247 -4746 -14734 -22856 -21052
21741 -21052 -23558 -42384 -36475 -42370 -57354 -44099 -38900 -46276 -7293 175 -21203 -19897 -23844
21728 -23844 -21707 -38674 -41170 -27776 -29734 -50609 -61683 -33533 -28502 -22722 -3980 -15209 -22916
21715 -22916 -32970 -32030 -34974 -10775 -12816 -11455 2275 -15998 -32900 -33802 -3631 -15556 -30331
21702 -30331 -33536 -19315 24035 60878 37974 19252 35686 30183 25023 -1235 -39287 -71199
21690 -71199 -63845 -46744 -1984 12472 -13424 -26424 -37165 -17988 -12318 -23562 -7349 -6560
21678f560L3630M737k3302r916q303K3407M421n684j9249j0340J6821k2408k3481
21665d6227n617K139J9530J7581q28K010j3351K3908K6095k959n942q37r436m6459
21651d0393k0201Q400n712j353K8977J5225j8863k0738j4635K6733L6275J8150
21639A1865j0274k0663j0998j690j0900j80M990M787K1903J7632K243k055q250
21626a590j895L0248J1139j3934o519j0218j6152l6384j3878M706q453j3757J0813
21613f5874J2570J4701j292k2117J2641K4695K6597K5787m918l431j5638k5355
21601b1634j3264J3839L0152O158k4929J6080K182k447L5083p74p146l4033L782
21588C049J7040K6715r322j3088J162J1883K417o1397m9456J1324L7604J0707
$$ plain form
21678 -6560 27070 31807 8505 -1411 -9714 13693 18114 12430 -6819 -17159 -338 -22746 -46227
21665 -46227 -51844 -49705 -30175 -12594 -13422 -11412 -24763 -855 25240 22281 16339 15502 6066 -40393
21651 -40393 -60594 -52194 -57906 -59259 -30282 -15057 -33920 -54658 -69293 -42560 -6285 11865
21639 11865 1591 -19072 -30070 -31760 -42660 -42840 -37850 -33063 -11160 6472 8715 6660 -1590
21626 -1590 -3485 26763 37902 23968 17449 7231 -8921 -45305 -59183 -54477 -62930 -76687 -65874
21613 -65874 -53304 -38603 -39895 -62012 -49371 -24676 1921 27708 22790 19359 3721 -21634
21601 -21634 -34898 -21059 9093 15251 -9678 6402 8584 6137 41220 40446 33300 -733 3049
21588 3049 20089 46804 37482 24394 25556 37439 39856 -21541 -70997 -59673 -22069 -11362
21576a1362O250j9169n942J3707J3483M726k8440r230J3266r373J4011J4421n968
21563i620j9731o430J0768P598j9858K7531Q667J2933L545j374J3613Q604N00
21550C6746l4448k3053J4086O357K467k0J2736l2835k5593j4550L8212J2344r841
21537a7392O183K300M479j1932r164Q08K038J8419N875P545O898q224j5579P925
21523A79j4408k9838k7382K3501k518O790N2211Q977j2901j5492J0604j3394j4896
21510b8567J893j0430J9699j5636k3467J282P286J4361M2914o958j5551K552K6803
21497A6181R590k1533K799J0749j5830j8545j9851m086J6875j077l2460j3290
21485g0478J9752K1760J2635n77j4918r611M754n311o400j0781j97K2630K2996
$$ plain form
21576 -11362 -5112 -24281 -30223 -16516 -3033 1693 -26747 -35977 -22711 -32084 -18073 -3652 -9620
21563 -9620 -29351 -35781 -25013 -17415 -37273 -9742 -1075 11858 15403 14029 27642 36246 36746
21550 36746 2298 -20755 -6669 -312 2155 2135 14871 -17964 -43557 -58107 -19895 -7551 -17392
21537 -17392 -11209 -8909 -4430 -16362 -25526 -24718 -22680 -4261 1614 9159 16057 7833 -7746 179
21523 179 -14229 -44067 -71449 -47948 -50466 -43676 8535 17512 4611 -10881 -277 -13671 -28567
21510 -28567 -26674 -37104 -17405 -33041 -56508 -55226 -47940 -33579 9335 2377 -13174 -10622 16181
21497 16181 25771 4238 7037 17786 1956 -16589 -36440 -40526 -23651 -24728 -57188 -70478
21485 -70478 -50726 -28966 -16331 -16908 -31826 -41437 -36683 -41994 -48394 -59175 -59372 -36742 -13746
21472a3746q220N178L056r732k2862J2196K7222K665M40P635Q202J6858r831Q589
21458B7650J3799m499r329J490J888k091l7154l229J5047j6947r080M868J7516
21445g1K6535p748l4124l0405L8057K366k949O234j175r315Q928L941p031L1773
21431B5016j260k5968J87M393j7366k216j1966J6500P201k3150k301J2635R603
21418h692K186n231p771m281k954J7115K2113K3780j4790j0247j3552j8181L0843
21405A0338p298j623J2511n621j217J942K718j643m563n15J5491p161j5621n881
21391h143O0747j5319j5398k6355k216m959J625k712j2949J8323O63J6050j4408
21378e051p633o57j0239P213k66R829J5937N79P156Q999j7088O83l8027M450j1287
$$ plain form
21472 -13746 -21966 -16788 -13732 -23464 -46326 -34130 -6908 -4243 -3803 3832 12034 28892 19061 27650
21458 27650 41449 36950 27621 29111 30999 28908 -8246 -11475 3572 -13375 -22455 -17587 -71
21445 -71 26464 18716 -15408 -45813 -7756 -5390 -8339 -2105 -3280 -12595 -3667 274 -6757 25016
21431 25016 23756 -2212 -2025 2368 -14998 -17214 -29180 -12680 -5479 -28629 -30930 -18295 -8692
21418 -8692 -6506 -11737 -19508 -23789 -26743 -9628 12485 36265 21475 11228 -2324 -20505 10338
21405 10338 3040 1417 13928 8307 7090 9032 11750 10107 5544 5029 20520 13359 -2262 -8143
21391 -8143 52604 37285 21887 -4468 -6684 -11643 -10018 -12730 -25679 -7356 -6693 9357 -5051
21378 -5051 -12684 -13341 -23580 -16367 -16633 -6804 9133 9712 16868 25867 8779 9462 -28565 -24115 -35402
21363c5402j8951J4917k037l053l281N399k822K170J9212J0535P020J0548R404
21350A3659j3165k0327m57j883k3638K94j2242L2889m031l780p392j0347q044
21337e8464j7883K1731L7119K6440q46k7974K193J138k6639j2710J3509K4312
21325a8074j0857k5495j0859K0770R422K5518Q859j6254q693j9230l30J77K5115
21312a9931J000m88q386Q125j0324M615K9472k053R756L372p964j712j3406N922
21298b002J6976J0117j1945o830P516J5253K364J648j9042k5105r031j743l6121
21285e7945n946J1563L3877K0132M518k6174P85P814o508M728K4435K0425j3018
21272A8686j1067J3911k8179j1930K35R158R151j2654j7404r697M3248M356k7103
$$ plain form
21363 -35402 -54353 -39436 -41473 -44526 -47807 -42408 -45230 -43060 -23848 -13313 -6293 4255 13659
21350 13659 494 -19833 -20290 -22173 -45811 -45517 -57759 -24870 -28901 -32681 -40073 -50420 -58464
21337 -58464 -76347 -54616 -17497 8943 8097 -19877 -17684 -16546 -43185 -55895 -42386 -18074
21325 -18074 -28931 -54426 -65285 -44515 -35093 -9575 -716 -16970 -25663 -44893 -45223 -45046 -19931
21312 -19931 -18931 -19419 -27805 -19680 -30004 -25389 4083 2030 11786 15158 7194 5482 -7924 -2002
21298 -2002 14974 25091 13146 6316 13832 29085 31449 33097 14055 -11050 -20081 -21824 -57945
21285 -57945 -63891 -52328 -18451 1681 6199 -19975 -19190 -11376 -17884 -13156 11279 31704 18686
21272 18686 7619 21530 -6649 -18579 -18344 -9186 -35 -12689 -30093 -39790 3458 7814 -19289
21259a9289N716J3279l221j2880R487J5950J9571l1787J891J543J5139q273r822
21246b696J196J7545J511j239J5898K5819k6849r687m232m959K622k8711k0564
21233c4346O276J0840O515j5941J3452K2013J7632j2199j2428k9477k2363K0907
21221b9119K9590q619j1435J6587K3992o130J3448L319p025k7630M724j541p285
21208g124K50k3090j9652J1435J9964j1134L0442K9262P684j122o679j9777o1844
21195e1385q677R610J6361J7367L962K1134J8246k1491j7287K852j0177k3643
21183d3128q894L3644J2573J1565l3879j5389K0562K904Q439k0359k0632K2474
21171c0120J0703J8835L58m520n591k7480j2080J9081Q994R37K4854K2649q352
$$ plain form
21259 -19289 -13573 -294 -3515 -16395 -6908 9042 28613 -3174 -1283 260 15399 7126 -2696
21246 -2696 -1500 16045 17556 16317 32215 58034 31185 21498 17266 12307 14929 -13782 -34346
21233 -34346 -28070 -17230 -10715 -26656 -13204 8809 26441 14242 1814 -27663 -50026 -29119
21221 -29119 471 -8148 -19583 -2996 20996 14866 28314 31633 24608 -3022 1702 161 -7124
21208 -7124 -6874 -29964 -49616 -38181 -18217 -29351 1091 30353 38037 36915 30236 10459 -51385
21195 -51385 -60062 -50452 -34091 -16724 -12762 8372 26618 5127 -12160 -9308 -19485 -43128
21183 -43128 -52022 -18378 -5805 5760 -28119 -43508 -22946 -20042 -11603 -31962 -52594 -30120
21171 -30120 -19417 -582 -224 -4744 -10335 -37815 -49895 -30814 -21820 -20883 3971 26620 18268
21158A8268k0635k7484J6305R985j6268l4862k69K8599L9154N014k0439N811K0980
21145B4159j6301l9230k5467K4734K1787j3230M939J8629q791J8553q847k7787
21133b6852j4658j0239K8960K237q412J4294J3878r019J2344j4130q103k16K5170
21120E254K9630j9146q253Q695m2043j2464K2461J7862j3454J6304K4000P272
21108C6118q682k8355R778j6924j0291k165J8677J7167J5070l7859j1627K2186
21096C093k1610j0862k6940j7009J008R55J5164O883K4512J9651Q314J589L058
21083G806P517J9880N905M304J597j4308k9928k3002P203J6382K0133j6613K907
21070I783p502k0280K3401L8735j1566m105Q265J6304J022l911m2247r100m60
$$ plain form
21158 18268 -2367 -29851 -13546 -3561 -19829 -54691 -54960 -26361 12793 17807 -2632 3179 24159
21145 24159 7858 -31372 -56839 -32105 -10318 -23548 -18609 20 -8771 9782 935 -26852
21133 -26852 -41510 -51749 -22789 -20552 -28964 -14670 -792 -9811 2533 -11597 -19700 -19916 5254
21120 5254 34884 15738 7485 16180 -25863 -38327 -15866 1996 -11458 4846 28846 36118
21108 36118 27436 -919 8859 -8065 -18356 -20521 -1844 15323 30393 -7466 -19093 3093
21096 3093 -18517 -29379 -56319 -73328 -72320 -71365 -56201 -49318 -24806 -5155 3159 4748 7806
21083 7806 15323 35203 41108 45412 47009 32701 2773 -20229 -13026 3356 23489 6876 9783
21070 9783 2281 -17999 5402 44137 32571 28466 36731 53035 54057 50146 7899 -1201 -1661
21057a661L811P598M980O334k3980J9996K8266j2710j7909j4723k3447k6085j0498
21044f0028K1703K8598R785J5502M09R253J7861Q94j6487j7017k841J1688J103
21031B0423j4568l278M919J401J0008j4206j5772o832q135j004L532n407Q882
21018b0037j3672j1597J1886J9846j3693o575l333L571K9981M0162J0027n664
21006D0902k096n006j4269J1487K211O887j6748j5601J4253k0834l9990m904R862
20993c3846O053l3785J5731L0317K3188l557l0038q454J9936P641k9612l171L515
20980c6082J5542j253n537M5413P2912j7851l7474j7071m3898J753Q283j4417
20968b9680q659L015K3988J3686P346J0618P880j6071j2743j6923O56n892J1187
$$ plain form
21057 -1661 2150 9748 14728 21062 -2918 17078 45344 32634 14725 2 -23445 -49530 -60028
21044 -60028 -38325 -9727 58 15560 15969 25222 43083 43977 27490 10473 7632 19320 20423
21031 20423 5855 2577 7496 8897 18905 4699 -11073 -17905 -26040 -27044 -23512 -28919 -20037
21018 -20037 -33709 -45306 -33420 -13574 -27267 -33842 -37175 -33604 -3623 36539 46566 40902
21006 40902 38806 33800 19531 31018 33229 40116 23368 7767 22020 1186 -38804 -43708 -33846
20993 -33846 -27793 -61578 -45847 -15530 7658 4101 -25937 -34391 -14455 -6814 -36426 -39597 -36082
20980 -36082 -20540 -21793 -27330 18083 90995 73144 35670 18599 -25299 -23546 -15263 -29680
20968 -29680 -38339 -35324 -11336 2350 9696 20314 28194 12123 -620 -17543 -16887 -22779 -11592
20955a1592K7094j8745j1987j0342M224J0509n878j5508k2553J3148N743J5761
20943b0126L8938k447j287K7820l3504m657J5697J7051j0189n811k0460j7697
20931a6672k0406M937J1277j611J0136M131q631J6999L53j1598J1195K9500n822
20918B3788q45L953l1513L582J1523J1371l7749q966N677q025J2050j6003k3756
20905e4913j2644j3453L9769J6096j675k1246R206O924j1535J0596L0597o34p956
20892a0868O345j470k4427j2013L2751K5297l343j5765o912N735Q153J6461K3266
20879D3210l3859j4457j6802j6985J5493K1747q600k2140P402p333k2745j5439
20867g0508J5596L236j5344j2203N189R518J2381J7196l513k3420L2982R259P797
$$ plain form
20955 -11592 15502 -3243 -15230 -25572 -21348 -10839 -16717 -32225 -54778 -41630 -35887 -20126
20943 -20126 18812 16365 15078 42898 9394 4737 20434 37485 27296 21485 1025 -16672
20931 -16672 -37078 -32141 -20864 -22475 -12339 -8208 -16839 160 513 -11085 110 29610 23788
20918 23788 22943 26896 -4617 -1035 10488 21859 -15890 -24856 -19179 -27204 -15154 -31157 -54913
20905 -54913 -67557 -81010 -41241 -25145 -26820 -48066 -38860 -31936 -43471 -32875 -2278 -2912 -10868
20892 -10868 -4523 -5993 -30420 -42433 -9682 15615 12272 -3493 -10405 -4670 3483 19944 43210
20879 43210 9351 -5106 -21908 -38893 -23400 -1653 -10253 -32393 -24991 -32324 -55069 -70508
20867 -70508 -54912 -51676 -67020 -79223 -74034 -64516 -52135 -34939 -38452 -61872 -28890 -19631 -11834
20854a1834k0776L426J7651J1565P688k971q085k5868j6480n654K8693L7913O409
20841B1677j8897j4446K9504M541j9458j6560k3870J0681L007J5068Q863j1974
20829a1864j7138J3478L346J7662K628O466j3165j8704j131j6098K022K912J6709
20816a2877P291R751O55j069m70l18k952L3359J8589k4286J8748J1116l888j1782
20802D1867j5029k5235K4370J693j8619k255O365l1661R139r653n459j7916M7050
20789D657M1786J8380k4115l8851j5661j3573j2015K4097m647J5038J0722O552
20777A2370l0882k1209J0471m32J3713p002N741K8592k114j0338l441K129j7546
20764a9948j4909J3741k783n146O575k632L3891n472m7152k4392Q493R292J9956
$$ plain form
20854 -11834 -32610 -29184 -11533 32 7720 4749 -3336 -29204 -45684 -51338 -22645 15268 21677
20841 21677 2780 -11666 17838 22379 2921 -13639 -37509 -26828 -23821 -8753 110 -11864
20829 -11864 -29002 -15524 -12178 5484 8112 14578 1413 -17291 -18422 -34520 -32498 -29586 -12877
20816 -12877 -5586 4165 4820 3751 3281 2963 11 33370 51959 27673 46421 57537 53649 41867
20802 41867 26838 1603 25973 27666 9047 6792 13157 -18504 -9365 -19018 -24477 -42393 4657
20789 4657 46443 64823 40708 1857 -13804 -27377 -39392 -15295 -19942 -4904 5818 12370
20777 12370 -18512 -39721 -29250 -29682 -15969 -22971 -17230 11362 9248 -1090 -4531 -2402 -19948
20764 -19948 -34857 -21116 -23899 -29045 -22470 -25102 8789 3317 -43835 -68227 -59734 -50442 -30486
20751c0486L2370K2140j1581J4147k5736k9440J205K3927J8721K408r561R590
20739A7704r538j5098k48q153K3124L3232k0615q568J8634m530l8759j2396K3512
20726a699J3461l8144j5080M9510L0174l7170j8031R954J2020m283k473J1853
20714A0092j4448j7850k055J8598k555L083P571J4675j4730r766J5915q174k856
20701b500p039k3915K5941K4527j613k0588p993L019J099L023m206P945n00n910
20687h710N190l2917r649J3812K9341K9173p450J1207J2223j858K893k8874j1702
20674B679Q902K9899j3031k0908j8844r7j6086M3585K4283l7882k5385Q380R293
20661e212n719K024K8106p001o715r89j0140J0756K109J7158K2828J7412m221
$$ plain form
20751 -30486 1884 24024 12443 26590 854 -28586 -27381 -3454 15267 17675 8114 17704
20739 17704 8166 -6932 -7180 -15333 7791 41023 20408 11840 30474 25944 -12815 -25211 -1699
20726 -1699 11762 -26382 -41462 8048 38222 1052 -16979 -7025 4995 712 -1761 10092
20714 10092 -4356 -22206 -24261 -5663 -8218 -5135 2436 17111 2381 -7385 8530 356 -2500
20701 -2500 -9539 -33454 -7513 17014 15401 -5187 -13180 -10161 -9062 -6039 -10245 -2300 -2800 -8710
20687 -8710 -3520 -36437 -46086 -32274 -2933 26240 18790 29997 42220 40362 43255 14381 2679
20674 2679 11581 41480 28449 7541 -11303 -11400 -27486 16099 40382 2500 -22885 -14505 -5212
20661 -5212 -10931 -8907 19199 12198 5483 4494 -5646 5110 7219 24377 47205 64617 60396
20648F0396j5539m2441M634N752J650j7199m916J2776M7566M5468k1053l3375
20636D3719l2220j2951N162K8576k4395L704r368q860l2861n077j553k692l037
20623e1853j4638J5492P763o320J7943J1850Q800j086J2325K74K1858j3249j0347
20610a188p808j2473L8667J5957q392O455r15m0775m810l287o157L4584L0255
20597D0113j8967k8863j8951k135M698M680p528o353L268j0392j2710N64n928
20584e8504N796l0638P537K7438j7216K6553l253R417J0472K316J4444K5380k444
20571A7298k1604l2925l111J4934k8780j1974K0236n209K8107J6027j7303M549
20559a9755q827j5878j7852k294N0344q41m466J2308O436j554k949N977j7383
$$ plain form
20648 60396 44857 2416 7050 12802 14452 -2747 -7663 5113 52679 98147 77094 43719
20636 43719 11499 -1452 3710 32286 7891 11595 2227 -6633 -39494 -44571 -46124 -48816 -51853
20623 -51853 -66491 -50999 -43236 -49556 -31613 -19763 -10963 -12049 276 550 22408 9159 -1188
20610 -1188 -8996 -21469 17198 33155 24763 31218 30303 -10472 -15282 -18569 -24726 9858 40113
20597 40113 21146 -7717 -26668 -28803 -24105 -19425 -26953 -33306 -30038 -40430 -53140 -52576 -58504
20584 -58504 -52708 -83346 -75809 -48371 -65587 -39034 -42287 -32870 -22398 -20082 -5638 19742 17298
20571 17298 -4306 -37231 -40342 -25408 -54188 -66162 -45926 -51135 -23028 -7001 -24304 -19755
20559 -19755 -28582 -44460 -62312 -64606 -14262 -15103 -19569 -7261 -825 -2379 -5328 649 -16734
20546a6734j7744K0122n17K2032q472o229o849m379Q575M644j1277j1961l458
20533c2247J6280j9432j3324K2501Q811K7595k637l2787n49N063j282j1148q346
20520d1502J9914J3306j577R885R378o888N214R333K1126o825m3669m509l390
20507b0204L7694P443K0943r581l6062L3j8796k6148M630M1054r623l4950O587
20494c6980J3321j4165J8266K2610j1040J6181L0864k4900l479j9612l3850K484
20482d0300K1400K5103j4352J2975K2965m8j946q475j2027J682J967J888m935
20469E897L130k7755j6726R45J7232K8717j5477j8377J2934k2667M650L5555r845
20456a787j3585j4906o464J4228K400Q67N067J540J8072L2209J1126k519q454
$$ plain form
20546 -16734 -34478 -14356 -14873 7159 -1313 -7542 -14391 -18770 -10195 -5551 -16828 -28789 -32247
20533 -32247 -15967 -35399 -48723 -26222 -17411 10184 7547 -25240 -25789 -20726 -22008 -33156 -41502
20520 -41502 -21588 -8282 -9859 26 9404 2516 7730 17063 38189 31364 -12305 -16814 -20204
20507 -20204 17490 24933 45876 36295 233 266 -18530 -44678 -40048 1006 -8617 -43567 -36980
20494 -36980 -23659 -37824 -19558 3052 -7988 8193 39057 14157 10678 -8934 -42784 -40300
20482 -40300 -18900 6203 -8149 4826 27791 27743 25797 17322 5295 6977 8944 10832 5897
20469 5897 9027 -18728 -35454 -34509 -17277 11440 -4037 -22414 -9480 -32147 -27497 8058 -1787
20456 -1787 -15372 -30278 -36742 -22514 -20114 -19247 -14180 -12640 5432 37641 48767 46248 37794
20443C7794J4170J5186p649j5542M374k069r689l839j779j5420n1080m648J7419
20430b2772J3495P023J1143N479n893j5792l298J534N719k5241l325l752J26P441
20416b8113J9360q61n030r548L192j847J5553J223J4645k5783N985J6672k1704
20403a6256J2P804K0313j8043j5956K349L8131o83r486j1253k1187k5430k139
20390e1824K1026J5098K3759k4459J2393J8572L741j233j8686l4202k3090K8173
20378c0732J7604o212l349q766k315j042Q701m690k181Q352j67M017J2901k3285
20364c1164K1636J0267l3336j5198M509M8319n84j2511j1417M340P106K1596J3558
20351B7121j0794j5118m064k828M7891j7167l1686l711n594o274p714k1951J5446
$$ plain form
20443 37794 51964 67150 59501 43959 48333 46264 36575 32736 30957 15537 -35543 -40191 -22772
20430 -22772 -9277 -2254 8889 14368 8475 -7317 -10615 -9081 -3362 -28603 -31928 -35680 -35554 -28113
20416 -28113 -8753 -9614 -14644 -24192 -21000 -22847 -7294 -6071 8574 -17209 -11224 5448 -16256
20403 -16256 -16244 -8440 11873 -6170 -22126 -19777 18354 17671 8185 -3068 -24255 -49685 -51824
20390 -51824 -30798 -15700 8059 -16400 -4007 14565 18306 17073 -1613 -35815 -58905 -30732
20378 -30732 -13128 -19340 -22689 -31455 -33770 -34812 -26111 -30801 -32982 -24630 -24797 -20780 -7879 -31164
20364 -31164 -9528 739 -32597 -47795 -43286 5033 4449 -8062 -19479 -15139 -8033 13563 27121
20351 27121 16327 1209 -2855 -5683 42208 25041 -6645 -10356 -15950 -22224 -29938 -51889 -36443
20338c6443K305o5J6641N304M67J4356k008k3016m802r413K626K6625K3922K1194
20324C7693l063j065J6996j5821k4847j5624N560K1018K925j9884j2675J696K7864
20311B0773K667j487j6943j598O453j5718j621K570r272k911J7307P230j9487
20298a2037j6833O614k2324K497J4495K8524J9014J3603j2851j4331N867O246
20286A8484l045j0924o372o62J3331J8687j0432j4173k6989j254Q914k341j0023
20273b6799J7767J4203j0227j6637L3819J8267r700l944l205R047m8051O153L060
20260a6247N933L1223k1879k0782O16M0787J326o095l4042N51r582k7289K1462
20247c4018J5987n611j1715j8963j9083K4118J0205L1073j9489l2601M615M0118
$$ plain form
20338 -36443 -34138 -34203 -17562 -12258 -11791 2565 557 -22459 -27261 -36674 -34048 -7423 16499 37693
20324 37693 34630 33565 50561 34740 9893 -5731 -171 20847 23772 3888 -8787 -7091 20773
20311 20773 23440 21953 5010 3412 9865 -5853 -7474 -4904 -14176 -17087 220 7450 -12037
20298 -12037 -28870 -22256 -44580 -42083 -27588 936 19950 33553 20702 6371 12238 18484
20286 18484 15439 4515 -1857 -2519 10812 29499 19067 4894 -22095 -23349 -14435 -16776 -26799
20273 -26799 -9032 5171 -5056 -21693 12126 30393 20693 16749 13544 22591 -25460 -19307 -16247
20260 -16247 -10314 20909 -970 -21752 -21136 19651 20977 14882 -19160 -18609 -28191 -55480 -34018
20247 -34018 -18031 -23642 -35357 -54320 -73403 -49285 -39080 -8007 -27496 -60097 -55482 -15364
20235a5364M6923J713j9965L113q378p249k1288j6496K187k4479j1696m402J1128
20222f4253M8279p689p825J7840j5465n117K169J8936K051l609j2022P371L389
20209a5945O293P722j421r539K2371Q701j5999L3337K263l1438m957J5288r604
20196G072j0922j7234j9061J5901Q498J3668L170Q144J5015K3047j6289l0345
20184F64j9382j2832J0619q666J6021J0160n62l1021k5671L021P281K904K0676
20171b6788J4132J9066J4263l2003j3047k0k2300k2299N1138L4082j2262r539
20159e577j3216m706N91j0249J784M2858K3710J6134p463k0483j9673K1353p851
20146A7212k7148j7157J9768O229K521Q394j7927J0028K2134Q897o1829k3102
$$ plain form
20235 -15364 31559 33272 13307 16420 8042 793 -20495 -36991 -34804 -59283 -70979 -75381 -64253
20222 -64253 -15974 -23663 -31488 -13648 -29113 -34230 -32061 -13125 -11074 -14683 -26705 -19334 -15945
20209 -15945 -9652 -1930 -3351 -12890 9481 18182 2183 35520 37783 6345 1388 16676 7072
20196 7072 -3850 -21084 -40145 -24244 -15746 -2078 1092 9236 24251 47298 31009 664
20184 664 -18718 -31550 -20931 -29597 -13576 -3416 -3978 -34999 -60670 -57649 -50368 -47464 -26788
20171 -26788 -12656 6410 20673 -11330 -24377 -24397 -46697 -68996 -17858 16224 3962 -5577
20159 -5577 -18793 -23499 -22908 -33157 -31373 11485 35195 51329 43866 23383 3710 25063 17212
20146 17212 -9936 -27093 -7325 -1096 1425 9819 -8108 1920 24054 32951 -28878 -51980
20134e1980K8410K4110j0181m588J3613K09r904j8494M975J0734o322K2841P046
20121A0469J6471K0284j8843p001j5465l365j3821O283k465J079Q373J4503J0411
20108B6913m4857j3912J5285m0535l2069J0997J4195P837L569K7876L8216J1087
20096B4602l7350l7818j3033N763O866k11N919R427K0262J5536R9K043j8224j8474
20082c4593k0912J4919M5431L4505J7029j5474k4122m232q024N271L7975J8154
20070F5927o434k4127k0471L761J128m763p419j0313N906L3265J9091n234k0639
20057B9678k4797l4655K2979Q683J4866p27l930j0242J5698K9417q847l2721j4574
20044i172N406J2917J4523J171N413K3164j9913k0486l039p285j2796n272O196
$$ plain form
20134 -51980 -23570 540 -9641 -14229 -616 -407 -10311 -28805 -23830 -13096 -19418 3423 10469
20121 10469 26940 47224 28381 21380 5915 2550 -11271 -4988 -7453 -6374 1999 16502 26913
20108 26913 -17944 -31856 -16571 -57106 -89175 -78178 -63983 -56146 -52577 -24701 13515 24602
20096 24602 -12748 -50566 -63599 -57836 -50970 -51181 -45262 -35835 -15573 -37 62 2105 -16119 -34593
20082 -34593 -55505 -40586 4845 39350 56379 40905 16783 12551 4527 9798 47773 65927
20070 65927 59493 35366 14895 18656 19784 15021 7602 -2711 3195 36460 55551 50317 29678
20057 29678 4881 -29774 -6795 1888 16754 16027 12097 1855 17553 46970 38123 5402 -9172
20044 -9172 -3766 9151 23674 24845 30258 53422 33509 13023 9984 2699 -10097 -15369 -9173
20031i173P643M075m2519j4225l58J0559M995J0129J9156K0938j9544m8307K5621
20018c1010K0816l0330K2K2863J1264L068R919J4704p250p605N379k1007P601
20005a566L375J2905K5549q033K096Q20L2209K2930l4447k8384K0065L911J6133
19992F7563k435k9221k4854n5520n893K7882M980J2005k985J7014Q905J277p701
19979A1017r996R028k0494m179M795r07k1721j9968J4524J7803O008o370J1654
19966h806J3269J9767J9199q457N387j9669k9650k7741J2736M860m62J1374Q525
19953C32j3591k134K7310J7929k5662m949R805J7111K3993k15q06l2864j0270
19940E989P927O844J1855J5602j8504m0106j790N045K4059o743j5744O383N7333
$$ plain form
20031 -9173 -1530 2545 -39974 -54199 -54557 -43998 -39003 -28874 -9718 11220 -8324 -56631 -31010
20018 -31010 -10194 -40524 -40502 -17639 -6375 -3307 6612 21316 14066 6461 11840 -9167 -1566
20005 -1566 1809 14714 40263 32230 34326 35146 67355 90285 55838 27454 47519 51430 67563
19992 67563 65128 35907 11053 -44467 -50360 -22478 -17498 -5493 -8478 8536 17441 18718 11017
19979 11017 1021 10049 -10445 -14624 -9829 -10736 -32457 -52425 -37901 -20098 -14090 -20460 -8806
19966 -8806 4463 24230 43429 34972 40359 20690 -8960 -36701 -23965 -19105 -19567 -8193 332
19953 332 -13259 -15393 11917 29846 4184 -765 9040 26151 50144 49929 49123 16259 5989
19940 5989 13916 20760 32615 48217 29713 -10393 -12183 -7138 16921 10178 -5566 817 58150
19927E8150M3365m3112k5726J0543K87j5385q021k817r416r469K9333L402l6636
19914e502K284N828k8779J5720O0793L3849k7104m3217j3959j382o278K7030n149
19901A4134k7915k4678J6853J8928K6376J4553k2801n1501r93J3700q891L179
19889b9056J9565J25r14j5728J5700J9368l010k85Q066R28m3303o971K8817J7447
19875A0749J6666j570j7265j7916L572r00j299k5860J208r26J4810K125j0155
19862b6761k8633k6842P606L2671N737r887j2280m056J0677J8396L1106k1315
19850b3581J8126J0861K4294j8770q49j2212j5548P057L835J8175K0935k7827
19838D496l0138p908J6784P930P959m031j0358k189K0432J7941K3416l0168j1473
$$ plain form
19927 58150 101515 58403 32677 43220 43507 28122 20101 17284 7868 -1601 27732 31134 -5502
19914 -5502 -3218 2610 -26169 -10449 50344 84193 57089 13872 -87 -1469 -7747 19283 14134
19901 14134 -13781 -38459 -21606 -2678 23698 38251 15450 -36051 -37044 -23344 -32235 -29056
19889 -29056 -9491 -9366 -10280 -26008 -10308 9060 6050 5765 13831 14759 -28544 -35515 -6698 10749
19875 10749 27415 25845 8580 -9336 -5764 -6664 -7963 -33823 -32615 -33541 -18731 -16606 -26761
19862 -26761 -55394 -82236 -74630 -41959 -36222 -46109 -58389 -62445 -51768 -33372 -2266 -23581
19850 -23581 -5455 5406 29700 10930 10081 -2131 -17679 -10622 -6787 11388 32323 4496
19838 4496 -25642 -33550 -16766 -8836 -877 -4908 -15266 -17455 2977 20918 44334 14166 2693
19825B693R807J1727j5255o438L895K020O31J9089J0751k1492m526m532j4967
19812f597J7391N5421k0052k5612j5917j9439n494L3420J0655M278j5923J2196
19800B4327k474J552P815k3230j5853j3102j0845K20K0312J9545O185j3350K0141
19787B1243J606m458J3609K6128k7514p019l0660l6984J9250L3081j0222O985
19775E045j9175O241K3428L750n5372k1280M9M592o167j7985K2804K9364K5272
19762E66J209r533R709j3735r704K6636J9810l3525R57M3109m420k4240j1939
19749e100j8413M399k800j0340J597L539L3572k918k1436J60K494K756O306k806
19735h990J7225r001k1136K2994L2838K029j3533j7105j9308K2920Q839q135k1622
$$ plain form
19825 2693 12500 24227 8972 2534 6429 8449 9080 28169 38920 17428 12902 8370 -6597
19812 -6597 10794 66215 46163 20551 4634 -14805 -20299 13121 23776 28054 12131 24327
19800 24327 21853 23405 31220 7990 -7863 -20965 -31810 -31590 -11278 8267 14452 1102 21243
19787 21243 22849 18391 32000 58128 30614 23595 -7065 -44049 -24799 8282 -1940 5045
19775 5045 -14130 -7889 15539 19289 -36083 -57363 -57314 -52722 -58889 -76874 -54070 -24706 566
19762 566 1775 -7758 1951 -11784 -21488 5148 24958 -8567 -7610 35499 31079 6839 -5100
19749 -5100 -23513 -19114 -21914 -32254 -30657 -27118 6454 3536 -17900 -17740 -15246 -12490 -6184 -8990
19735 -8990 8235 -766 -21902 1092 33930 35959 22426 5321 -13987 8933 17772 9637 -11985
19722a1985K0133K1662K1627j2692l0783k6978j5979J162M0180J8521j5770K2581
19710C1679K299l658l6278k5955L3802K5670J56p645P853J8930l7803j7752j2260
19697b0962k9761j3554Q148L7664N612J1424O036k696j7864j1245j850O689L5299
19684A2940K3833j4447n177J233j5005j071j424j0718L0001L914r424O024L899
19671B4578k326r924R450n38Q775J2183r820j8483j257j020K5524Q599j2943n510
19657B7288J1392J3466J2079k1487J4057Q877n643o979j0566p855q600J0621n857
19644C0793L630j227j6304M583q870k3993n934J4868Q544L025K784J2497K1983
19631D6379N310k7654j6257J7138J1648J2813j0026r710j9173p169N161N768o622
$$ plain form
19722 -11985 8148 29810 51437 38745 7962 -19016 -34995 -33833 6347 24868 9098 31679
19710 31679 33978 30320 -5958 -31913 1889 27559 27715 20070 27923 46853 9050 -8702 -20962
19697 -20962 -50723 -64277 -56129 -18465 -12853 -1429 4607 1911 -15953 -27198 -29048 -22359 12940
19684 12940 36773 22326 17149 18382 3377 2306 882 -9836 20165 24079 14655 20679 24578
19671 24578 22252 12328 21778 21240 30015 42198 32378 13895 12638 11618 37142 45741 32798 27288
19657 27288 38680 52146 64225 42738 56795 65672 60029 53050 42484 34629 26029 36650 30793
19644 30793 34423 33196 16892 21475 12605 -11388 -17322 -2454 6090 9115 11899 24396 46379
19631 46379 51689 24035 7778 24916 36564 49377 39351 29641 10468 3299 8460 14228 7606
19618G606K5325q611l2741K5835J3265L587J3461K2698R938j2544j4228L081k1070
19605C5602n325J7010J2497P855k1546o698k0126j9229O36K0174K2166J5611J135
19592E9762K38l4302l2760P847K5051Q791m461Q658o83j4308q986N599m567J982
19578A7861r682K3269K3837n180k6622l0269O462L131k458R342J0168K0731K9454
19565G0044K371j7526r572l975O910q249M445K2081K6426m515m8346l2097K757
19552A0754L829K2120o86o574k819p529L2094J8309o953m032K302j7770o03K8929
19538G1371O109k6271k0593J3246K1057k4914k1437Q825j2956K9602L765k2430
19526B5374m168r763K2714O771J5809K442L4850M760m3586l3277p650J72J1797
$$ plain form
19618 7606 32931 24320 -8421 17414 30679 34266 47727 70425 80363 67819 53591 56672 35602
19605 35602 30277 47287 59784 67639 46093 39395 19269 40 676 20850 43016 58627 59762
19592 59762 60000 25698 -7062 785 25836 34627 30166 38824 38141 23833 14847 20446 15879 17861
19578 17861 8179 31448 55285 50105 23483 -6786 -324 2807 349 9691 19859 40590 70044
19565 70044 72415 54889 45317 41342 48252 40003 44448 66529 92955 88440 40094 7997 10754
19552 10754 14583 36703 36017 29443 26624 19095 51189 69498 62545 58513 60815 43045 42442 71371
19538 71371 77480 51209 30616 43862 64919 40005 18568 27393 14437 44039 47804 25374
19526 25374 21206 11443 34157 40928 56737 59179 94029 98789 55203 21926 14276 14448 26245
19513B6245M7682J7600J5394j6859j5791L62j5668j4610j4792q116n363J3138
19501B9222k119J5982J0887j6240J0343L9588O965l7868m746j7911L671l546N595
19488C9823L387l1832j1920J6457J5837J0789J456m762j3886L865k2391O983k684
19475A1122m27J6426o819j8342j4672L1901K6129M166j195k4501k5654K287Q77
19462A298J9848L0633L692q38k5805R219K1513k3064k3998k2133j5651L2612L1275
19449C8601m267k062P883k2143j5422r771q914j0856K1777P704q983R30K1653
19436A6130J7654m955k4524Q120o085J0701L9074K22R699j3595k6281K5871J2638
19423F4669O051k4909J3451j6384l5562o392L256K1728L1302l66j3968R579J703
$$ plain form
19513 26245 73927 91527 106921 90062 74271 74633 58965 44355 29563 21447 16084 29222
19501 29222 27103 43085 53972 37732 48075 87663 94628 56760 52014 34103 37774 34228 39823
19488 39823 43210 11378 -542 15915 31752 42541 43997 39235 25349 29214 6823 13806 11122
19475 11122 10695 27121 20302 1960 -12712 19189 45318 49484 48289 23788 -1866 421 1298
19462 1298 21146 51779 55471 54633 28828 38047 59560 36496 12498 -9635 -25286 7326 38601
19449 38601 34334 32272 40155 18012 2590 -7181 -16095 -26951 -5174 2530 -6453 -5523 16130
19436 16130 33784 28829 4305 12425 6340 17041 56115 56337 66036 52441 26160 52031 64669
19423 64669 70720 45811 59262 42878 7316 924 4180 25908 57210 56844 42876 52455 54158
19410E4158j6173j2026J1572L0208J8095j6090k0063K1014l854r816O010J1672
19398G4707O429q6j0460n626K071l9894j3817q670k8991R679K9457j0115j8088
19385a3404j263N897q369K7696L2229j9986q195J4048M151k1092Q508L367L845
19372B7432j3574k8432K6659M6647k1422P406k533K4597p845mJ583k1585M781
19359D3710L861N342O494L879k30j0884j3570m692j6858j4877k4209L386K2321
19346C673K3219k9474K349L8816R061r056n706J0548L166j0380k4493j107L9689
19333E0305P763N726o184k8546Q60K4036K590M246J0843J3370j9000m3235q973
19320A3801k82J5048N771j8060Q644j5177q977J334k4394o624J2734L7738M534
$$ plain form
19410 54158 37985 25959 37531 67739 85834 69744 49681 70695 66841 57025 63035 74707
19398 74707 81136 81050 70590 64964 67035 27141 13324 4654 -24337 -14658 14799 4684 -13404
19385 -13404 -14667 -8770 -17139 10557 42786 22800 14605 28653 32804 11712 20220 23587 27432
19372 27432 13858 -14574 12085 58732 37310 44716 42183 66780 58935 58931 60514 38929 43710
19359 43710 47571 52913 59407 63286 63056 52172 38602 33910 17052 2175 -22034 -18648 3673
19346 3673 26892 -2582 -233 38583 47644 38588 32882 43430 46596 36216 11723 10616 50305
19333 50305 58068 63794 57610 29064 29924 53960 56550 60796 71639 85009 66009 22774 13801
19320 13801 13519 28567 34338 16278 24922 9745 768 2102 -22292 -28916 -16182 21556 26090
19307B6090q351J7967k63K33k0996o104J6882m288K229M278j3160N511J1508L4780
19293F6316k545k9023M261J0291J2843N390K2736L279l6624k0450M496Q984j9198
19280C0756M729L6243R065k4044K0377J1984l500r558J4609j8524q351j3661P393
19267E7518J1263K938j3068j7322j0435J1915o955j3824J5086M6112M355p576
19255H0007K988J2038o63q836k2706K2011n580j3882P278J72m0424j0084P431
19242B9750R086K4894Q629k807l794P694Q451K5170L1238K153j1940k8015k7795
19229G2714j6865O821m061j0732j1299l59L548J0354m307r944J717o612p298n080
19215A8597o874K7599Q760j1005J664q61L793J4451N271r942K626m940j0632N744
$$ plain form
19307 26090 17739 35706 35443 35676 14680 8576 25458 21170 23399 27677 14517 20028 31536 66316
19293 66316 63771 34748 39009 49300 62143 67533 90269 93548 56924 36474 40970 49954 30756
19280 30756 35485 71728 80793 56749 77126 89110 85610 76052 90661 72137 63786 50125 57518
19267 57518 68781 71719 58651 41329 30894 42809 35854 22030 37116 83228 87583 80007
19255 80007 82995 95033 94370 85534 62828 84839 79259 65377 72655 72827 32403 22319 29750
19242 29750 38836 63730 72359 69552 65758 73452 81903 107073 138311 140464 128524 100509 72714
19229 72714 55849 62670 58609 47877 36578 36219 39767 50121 45814 35870 37587 30975 23677 18597
19215 18597 11723 39322 48082 37077 38741 37880 41673 56124 61395 51453 54079 49139 38507 44251
19201D4251K666J4518K4298j6845m560l123k8381N942K6462n805O34j56J1934
19188G1835J4673O159j517j8417R417J598j6467M835J2229J2051p992J5699R203
19175A13306j0371o599K3719M3206q388j6690J1158P770p326q514j5336j0918
19163A15017n849q095J5264J9988R769j7315K1429M0897j4352j0223R34L1119
19151A98583J180j3379j668K984L181M3974O0926L6280P266N3697P2651J14187
19139E79862J89245K47138K77492K63331J94612J41412R8273J14577J17040J85186
19129B408168K29822J71680k0098k03150k97738k70625j06292k8998q1814k27283
19119A573672l31438l00549k37197j83224j24165o9659l1323j2105k3087j3463
$$ plain form
19201 44251 46917 61435 85733 68888 64328 61205 32824 38766 65228 59423 60057 59901 71835
19188 71835 86508 92667 91150 72733 82150 83748 67281 72116 84345 96396 88404 104103 113306
19175 113306 102935 96336 120055 163261 154873 138183 149341 157111 149785 141271 125935 115017
19163 115017 109168 101073 116337 136325 146094 128779 150208 191105 176753 166530 167464 198583
19151 198583 199763 186384 184716 187700 190881 234855 295781 332061 339327 393024 465675 579862
19139 579862 769107 1016245 1293737 1557068 1751680 1893092 1991365 2105942 2222982 2408168
19129 2408168 2637990 2809670 2789572 2586422 2288684 2018059 1911767 1882769 1800955 1573672
19119 1573672 1242234 941685 704488 521264 397099 327440 296117 284012 260925 247462
19109B47462j235J1974n959o572k5724R927L463O138L4180J3291j329k8221j637
19096B55758K6257J2962L3319L2567O3705P7330J00880J44132J38472J01552K2388
19085A009322j1036p8892j28463p7804k9290L8258O5922N5418j8041j4237j5955
19074G95202o1660r9233j41085j13847q4036l9671k4164l6756k7545k2039O048
19063A51214M695m511j8855j9588r160K2570L2205o358j9943j072l489l2622L1306
19050A26392P833j4493j2411P48j6796o269P490J2557K1030K5578J6143M679j2147
19037A60334j9309Q093J0808j0939k5535J5550j2390k5158M263J0406N1864K6565
19025A94552K6605K0925J4051K1985L9469N9257J27841J60517P5669k2463j4369
$$ plain form
19109 247462 246227 258201 252242 245670 219946 229873 233336 239474 273654 286945 285616 257395 255758
19096 255758 282015 294977 328296 360863 424568 501898 602778 746910 885382 986934 1009322
19085 1009322 998286 919394 790931 713127 683837 722095 788017 843435 825394 811157 795202
19074 795202 733542 634309 493224 379377 295341 255670 231506 194750 167205 145166 151214
19063 151214 155909 151398 132543 112955 103795 126365 158570 152212 132269 131197 127708 95086 126392
19050 126392 134225 119732 107321 108069 91273 85004 92494 105051 126081 151659 167802 172481 160334
19037 160334 141025 149118 159926 148987 123452 139002 126612 101454 105717 116123 167987 194552
19025 194552 221157 242082 256133 278118 317587 376844 504685 665202 740871 718408 704039
19014G04039P1525N4768m8150j04543j24784m5536J7973N5307J17237K22284J95921
19003A116041k9391k12903k56519j89831j15281m9448j6439r471n731P84k5230
18992B06581j5667j0977p617R037J8278k266M779J0883L2073L762j54l473j727
18979B43512J4927K9825M9568Q0399Q6833R9474J07958J2982r1925j21542q5902
18968D26109P981L3924P2344Q2438J36540J43228O445j3213K9341M3661l6058
18957I32740n8894k7804L1536O644j35458j82317j56079p0645o6069n6115K00
18946B17739K3331j7726p427Q977O939j5397J2169K608q642l896m848j0455J6848
18933B20220j1717l4144N940o343j4260l540n674o845k0916n748K1342M4548j1599
$$ plain form
19014 704039 775564 830332 782182 677639 552855 507319 525292 580599 697836 920120 1116041
19003 1116041 1086650 873747 617228 427397 312116 262668 246229 236758 231027 231811 206581
18992 206581 190914 179937 172320 181357 199635 197369 202148 213031 245104 248866 248712 245239 243512
18979 243512 258439 288264 337832 418231 505064 604538 712496 725478 633553 512011 426109
18968 426109 434090 468014 540358 622796 759336 902564 909009 895796 925137 968798 932740
18957 932740 873846 846042 877578 884222 748764 566447 410368 339723 273654 217539 217739
18946 217739 241070 223344 215917 224894 231833 216436 228605 231213 222571 218675 213827 203372 220220
18933 220220 208503 174359 180299 173956 159696 156156 150482 143637 122721 116973 138315 182863 171264
18920A71264J1641o034k0985K555j3293k7563J6112O157J8985K0822J6893l2953
18908A63601n393J1949K0223P135k2871m233N239J7717P852L4038N8j1212J3499
18895B37602o08l211n860Q845J0780O458Q333q863R634L359j8322l1524k4315
18882A92308J2200j4360K3207L1147L2463P784l732l7227k4328r184j7358j4073
18870A78847J2563K0693j687J2450Q405p816M82J8916l456L03j0825j7518j5956
18857A95401K1549L8242K8047J488m955K197L1515m9925k7400K367q1k1633l4111
18844A82701J1146q3j2288J0593J0358m285P29M088K6819J1473j7710o200l4339
18831A83002r138K2751R26K864J1710q659r261J2868l3046j5791p914Q986N444
$$ plain form
18920 171264 182905 176871 155886 158441 145148 117585 133697 139854 158839 179661 196554 163601
18908 163601 158208 170157 190380 197515 174644 170411 175650 193367 201219 235257 235315 224103 237602
18895 237602 236994 233783 227923 236768 247548 254006 262339 253476 263110 266469 248147 216623 192308
18882 192308 204508 190148 213355 244502 276965 284749 281017 243790 219462 210278 192920 178847
18870 178847 191410 212103 210416 222866 231271 223455 223937 242853 239397 239700 228875 211357 195401
18857 195401 216950 255192 283239 284727 279772 281969 313484 263559 236159 238526 238445 216812 182701
18844 182701 193847 193764 181476 192069 202427 198142 198871 202959 229778 241251 223541 217341 183002
18831 183002 173864 196615 197541 200405 212115 203456 194195 207063 174017 158226 150312 159298 164742
18818A64742j2277K5127L5149L2954k705k748O201q896J087j8536l4819j3128
18806A72151L236J8073K271p92J1992K8538k8186k9806n4078r276J6804K9839
18794A60766L9117N373R971o783k7543K2447L9778M8643O541k908J8565K5545
18782C39512P036p711j1361L7623M1682J7144l322m8715m6364j0574j993K7405
18770C40362P1512K9268j1129L560J4292J5433N7623J04908P2821J4535j2579
18759G00606k5706m0985k6276k5480o157N8068P4764L3499L1738K2609P1852O5610
18747I34142J6690o4083o6135l1777K2296L4425K6625J451O2206K5969k5378o2323
18735H74108m6034n3236o1907k4397K6041M5768J3359j8730N1727P2492P1506
$$ plain form
18818 164742 152465 177592 212741 245695 242990 240242 246443 237547 238634 220098 185279 172151
18806 172151 175387 193460 195731 194939 206931 235469 207283 177477 123399 114123 130927 160766
18794 160766 199883 205256 215227 208444 180901 203348 243126 291769 298310 295402 313967 339512
18782 339512 346548 338837 327476 365099 406781 423925 420603 371888 325524 314950 312957 340362
18770 340362 411874 441142 430013 433573 447865 463298 520921 625829 698650 713185 700606
18759 700606 674900 633915 607639 582159 576002 634070 708834 742333 774071 796680 868532 934142
18747 934142 950832 886749 820614 788837 811133 845558 872183 873634 935840 961809 936431 874108
18735 874108 828074 774838 712931 688534 714575 760343 773702 754972 806699 879191 950697
18724I50697L7386l6034j1690L6498J5428k2146p1069p5466p4102l4238l1341
18713F83923q279N8560O2091L2550M2383L2293J8193M8716J02367Q7207N1392
18702A211396K6420L4379M6809P9786R3086J00145J01624L7595l9572q5649r1596
18691A514423m6955O1600J08537J09653N8621J0706l7628k5464L3148J41061K75118
18680B202820L68667L27658J70047J11779P6047j29559k28104k52107j52060m3500
18670B451688N6036J60299K39754L35678M93248P04978Q05139O19169L43119L42650
18660F551758N43325M89454J71439j61987l2856M35136P51101N70418J67638j90723
18650I294703j57074Q1770M14449R10270J245199J165549Q61435M63308N48643
$$ plain form
18724 950697 988083 952049 940359 976857 992285 970139 899070 823604 749502 715264 683923
18713 683923 675644 734204 796295 828845 871228 903521 921714 970430 1072797 1160004 1211396
18702 1211396 1237816 1272195 1319004 1398790 1491876 1592021 1693645 1731240 1691668 1606019 1514423
18691 1514423 1467468 1529068 1637605 1747258 1805879 1816585 1778957 1753493 1786641 1927702 2202820
18680 2202820 2571487 2899145 3069192 3180971 3257018 3127459 2899355 2647248 2495188 2451688
18670 2451688 2507724 2668023 2907777 3243455 3736703 4441681 5246820 5865989 6209108 6551758
18660 6551758 7095083 7584537 7755976 7593989 7561133 7996269 8747370 9317788 9485426 9294703
18650 9294703 9137629 9219399 9633848 10544118 11789317 12954866 13816301 14279609 14828252
18641A4828252R70170J615995K594885L983644O114444R644141J5267028K1511226
18633G6529785K1531283J2384418K276075M15096O080461M686488l792666j2353805
18625A07757135p962183L602425Q819990J241761j1153933j7285663j0673782
18618G4345750J735832J3689911J4855085K955846j2376539k3786483k1488624
18611D9930778j4848849q257274m288044k152925j007031n57064m86073m93276
18603A7840242j64236K54120K24366j71909m28026j40185L55671R41013J546655
18594B0257711K204074K826310L393608M315235O169732R690141J6257271K6121384
18586I1235466L5638306L5016215K3517456K93995k1956268l4078013k9088556
$$ plain form
18641 14828252 15798422 17414417 20009302 23992946 30107390 39751531 55018559 76529785
18633 76529785 98061068 110445486 112721561 113136657 119217118 123903606 120110940 107757135
18625 107757135 99794952 103397377 112217367 113459128 102305195 85019532 74345750
18618 74345750 76081582 89771493 104626578 107582424 95205885 71419402 49930778
18611 49930778 35081929 26824655 22536611 20383686 19376655 18819591 18333518 17840242
18603 17840242 17676006 17930126 18154492 17982583 17554557 17414372 17770043 18711056 20257711
18594 20257711 22461785 25288095 28681703 32996938 39166670 48856811 65114082 91235466
18586 91235466 126873772 161889987 185407443 185701438 163745170 129667157 100578601
18579A00578601j5696591m58507J3421227K2121326J7206094M773271n316611
18572A36628810j305370L249018m936043j9983745l0186441k6615511j8325449
18565C8525269j0673144o269126m051517k840982j996627j348785q19255m45207
18557A0080626k69024l31210n50835o37727n59621l80371j76008j7774J33897
18548G291953J32816J39122J87511J75160J10612j2519r8937O268K03133L19179
18538H454298K61387J15793J31100J93962L67307N41325O66636P07667P47609
18529A2187084Q65330J013282J191245J356061J565683J934119K393878K856671
18521B5363353K872089K050999J513445J793941K598037L744712N194610P157227
$$ plain form
18579 100578601 84882010 84423503 97844730 119966056 137172150 141945421 136628810
18572 136628810 135323440 138572458 133636415 113652670 83466229 56850718 38525269
18565 38525269 27852125 21582999 17531482 14690500 12693873 11345088 10525833 10080626
18557 10080626 9811602 9480392 8929557 8291830 7732209 7351838 7175830 7158056 7291953
18548 7291953 7424769 7563891 7751402 7926562 8037174 8024655 7925718 7931986 8135119 8454298
18538 8454298 8715685 8831478 8962578 9156540 9523847 10065172 10731808 11439475 12187084
18529 12187084 13052414 14065696 15256941 16613002 18178685 20112804 22506682 25363353
18521 25363353 28235442 30286441 31799886 33593827 36191864 39936576 45131186 52288413
18513E2288413J0180063J5259947K3300876L4365431M4015252M5967078M2085817
18506B67462877L6402077L4212158K6013435K9603933M1381089M0398391J2510956
18499D87984916l4622439n8745462n0183449j5765833J2384040J4862537j3391665
18492C42522645m1633459o9470809o9574854n3142491l3694752j9526276j1624579
18485D3855425p356662m960440l434327k468225j938868j503261p37945K23418
18477B1679115R61258J027083M80173k06333l27255L55004J336028J941144J734500
18468B8980717J024175K11909j08987K3586Q72898K155324L836294O216710R860452
18459E3073078J5977881K5087220L2268738J8611469j3116693k2128797j5091888
$$ plain form
18513 52288413 62468476 77728423 101029299 135394730 179409982 225377060 267462877
18506 267462877 303864954 338077112 364090547 393694480 435075569 475473960 487984916
18499 487984916 453362477 394617015 344433566 328667733 341051773 355914310 342522645
18492 342522645 300889186 231418377 161843523 108701032 75006280 55480004 43855425
18485 43855425 36498763 31538323 28103996 25635771 23696903 22193642 21455697 21679115
18477 21679115 22640373 23667456 24147629 23941296 23614041 23969045 25305073 27246217 28980717
18468 28980717 30004892 30216801 30107814 30131400 31004298 33159622 36995916 43212626 53073078
18459 53073078 69050959 94138179 126406917 145018386 131901693 109772896 94681008
18452I4681008K230359K0851704L4567627K9360341M959472M018053P109595j0538598
18444A87239561k2422582j3547799K111815k53979k6288701l5561915l1151298
18437F0125102j9958300j1360977o693646m235472k847921k074900j701414j363151
18429I889321r77699q09008o70862n91250m53854l70339l90267m31308m73775
18420D720959l87677k56451j66344k63657l24550k80334j88523j64557j63706
18411B525160j30830q7338j32234j27704o6824l1350J6254L4128L0342J2105J7970
18400B059679R9980J99354L73756O80269J012701R72638L44187m52578j128661
18391D161325j158473q76410n42234l26140j65373r7468p8554j03201j15679n8122
$$ plain form
18452 94681008 96911367 117763071 152330698 181691039 186650511 190668564 197778159 187239561
18444 187239561 164816979 151269180 153380995 153127016 126838315 91276400 60125102
18437 60125102 40166802 28805825 22112179 17876707 15028786 12953886 11252472 9889321
18429 9889321 8911622 8102614 7431752 6840502 6386648 6016309 5626042 5194734 4720959
18420 4720959 4333282 4076831 3910487 3646830 3322280 3041946 2853423 2688866 2525160
18411 2525160 2394330 2306992 2174758 2047054 1980230 1948880 1965134 1999262 2029604 2041709 2059679
18400 2059679 2159659 2359013 2732769 3413038 4425739 5398377 5742564 5289986 4161325
18391 4161325 3002852 2126442 1584208 1258068 1092695 995227 916673 813472 697793 639671
18381F39671o8056m2293p039N437K3678N1474M6621J6090K4235N2868N6181Q8477
18369H87344Q2155N4889M3193J9817K2033N5180O4688M6202L2279O6093Q7617
18358A461490J18601J65280K12123J13836J6211j53810l08553l25131k53734j12244
18348I34069j07260j22010r7675k0561M1721M1255J9887k9024l8156j1180L9946
18337F51012O7840K9195j4591j3545k5538p221j1215M933k0706l0658k5813o692
18325E97001L3230O1515P0351L1104J2683K5128Q392M1428J00864N3205M5807
18314A080708L7009L4532L6576L9072K5617k7114l5582k0783j4480J0769M5104
18303A211428K9164O283l3938k8461K7043K2842m0033n6449k8584K4758K7321
$$ plain form
18381 639671 571615 529322 522283 527720 551398 602872 649493 665583 689818 742686 798867 887344
18369 887344 969499 1024388 1067581 1087398 1109431 1164611 1229299 1275501 1307780 1373873 1461490
18358 1461490 1580091 1745371 1957494 2071330 2087541 1933731 1625178 1300047 1046313 934069
18348 934069 826809 704799 607124 586563 628284 669539 689426 660402 622246 611066 651012
18337 651012 718852 748047 733456 719911 694373 687152 675937 680870 660164 629506 603693 597001
18325 597001 630231 691746 762097 793201 805884 831012 839404 880832 981696 1034901 1080708
18314 1080708 1117717 1152249 1188825 1227897 1253514 1226400 1190818 1170035 1155555 1166324 1211428
18303 1211428 1240592 1246875 1212937 1184476 1211519 1234361 1194328 1137879 1109295 1134053 1161374
18292A161374J2673r44J7713P6372P5406K6243N3386O3120J6849k66J2778O9191
18280A583895P7571Q2343J25722J52865Q0549Q6720J24127J29681J01095J12687
18270B657255J66357J76926J82548J30316Q6389M7539Q7021J54265K57363L00754
18260D246733K95709K88159L21314L58866M43529N20759P17822J032786J427164
18251I652841J855015K276306K983523M311609O793227J0493248J3407977J0216415
18243F1990161L600529k193287r179783j0169352p168742j949360L733779R736167
18235D8400112J3915233J0083952K312526m133136j3295915j5652968j2979860
18228B8649944q431302m640652k481197j400644q74660n78590m75965m05779k80434
$$ plain form
18292 1161374 1174047 1173103 1190816 1267188 1342594 1368837 1422223 1485343 1502192 1501926 1514704 1583895
18280 1583895 1661466 1743809 1869531 2022396 2102945 2189665 2313792 2443473 2544568 2657255
18270 2657255 2823612 3000538 3183086 3313402 3399791 3447330 3534351 3688616 3945979 4246733
18260 4246733 4542442 4830601 5151915 5510781 5954310 6475069 7192891 8225677 9652841
18251 9652841 11507856 13784162 16767685 21079294 27872521 38365769 51773746 61990161
18243 61990161 65590690 63397403 54217620 44048268 36879526 34930166 38663945 48400112
18235 48400112 62315345 72399297 74711823 70578687 57282772 41629804 28649944
18228 28649944 20218642 15577990 13096793 11696149 10821489 10242899 9766934 9361155 9080721
18219I080721n7233K40018M46837O26799P36206P87295P13508O54717P79886R95026
18209A5003780J343971J885942K654437L703326M782027N918984Q156955J2371505
18201E5820927J9789706K9428373L3102788K1103929P975721q823042k5033588
18194A33364814k5779791j8831100o982895N703510J7427036K1790955J1964146
18187A38656675J782831j0010728k0447317j9037011j5536006j1505071r933926
18180E3969447j1576854j0411683p884076m978477k901147j741557j001328m83957
18172A2990368j84553J12668M20765P18029O38888L81838M05783N74943R47725
18163A7006454J380049J898280K562314L522072M399829M139642L278940L719509
$$ plain form
18219 9080721 9023488 9263506 9710343 10337142 11073348 11860643 12574151 13228868 14008754 15003780
18209 15003780 16347751 18233693 20888130 24591456 29373483 35292467 43449422 55820927
18201 55820927 75610633 105039006 138141794 159245723 167221444 158398402 133364814
18194 133364814 107585023 88753923 81771028 87474538 104901574 126692529 138656675
18187 138656675 140439506 130428778 109981461 90944450 75408444 63903373 53969447
18180 53969447 42392593 31980910 24096834 19118357 16217210 14475653 13474325 12990368
18172 12990368 12805815 12918483 13339248 14057277 14696165 15078003 15483786 16058729 17006454
18163 17006454 18386503 20284783 22847097 26369169 30768998 34908640 38187580 41907089
18155D1907089N601144R263596J5513151K4577158L2601818K8638497J5297876
18148A73400329K114914j0280132l908780J4601760K9233465J0162164k4982918
18141A90340802l2661297k0168339J326045J4158309J3263523J3884861J4057905
18134A94201809J6762088R334640k6476207m9304401m7550123l3250266j8699890
18127D5017650j0282953o314487m433635l244299k147558j405413j025729p08292
18119A5455284l54020n4110K42416N66039J113665J825096K394082K219386J527730
18110B4935568Q24772J111248K202808M086733P531756J3702933K0490733J8129494
18102I3016045j189192m953516L442034K0045165L2923897K9869952J4334895
$$ plain form
18155 41907089 47508233 56771829 72284980 96862138 129463956 158102453 173400329
18148 173400329 175515243 165235111 161326331 175928091 205161556 215323720 190340802
18141 190340802 157679505 137511166 138837211 152995520 166259043 180143904 194201809
18134 194201809 210963897 220298537 193822330 144517929 96967806 63717540 45017650
18127 45017650 34734697 28420210 23986575 20742276 18594718 17189305 16163576 15455284
18119 15455284 15101264 15047154 15289570 15855609 16969274 18794370 21188452 23407838 24935568
18110 24935568 25760340 26871588 29074396 33161129 40692885 54395818 74886551 93016045
18102 93016045 91826853 86873337 90315371 110360536 143284433 173154385 187489280
18095A87489280j8612138l6222485l1592150j6545511J186676J8561538L3998559
18088A38263769L2406444n068602l7000541m2158032l1803074j8567975j0386148
18081B5685841o137111l772927k335732j485246j037469q81385p81665o39503
18073H614803m13173j34346j8372m4886p6776l745K32932M12008K92777L7368
18063H898590o5675l4886N6971K79519O59257R70759J114636J372605K388702
18054A5640478M370524P756844J2679278J6378832R397639p395910j3517882j1522773
18046C3787030n174431J323672P312527J1215402N689756q096952j3232229j1913641
18038B0911134p581516m205526k456551j552049j014854o58119m53042l37117
$$ plain form
18095 187489280 168877142 132654657 101062507 84516996 85703672 104265210 138263769
18088 138263769 170670213 165601611 128601070 86443038 54639964 36071989 25685841
18081 25685841 19548730 15775803 13440071 11954825 10917356 10035971 9254306 8614803
18073 8614803 8201630 8067284 8048912 8004026 7927250 7923505 8156437 8568445 8861222 8898590
18063 8898590 8832915 8798029 8855000 9134519 9793776 10764535 11879171 13251776 15640478
18054 15640478 20011002 27767846 40447124 56825956 66223595 58827685 45309803 33787030
18046 33787030 28612599 29936271 37248798 48464200 54153956 46057004 32824775 20911134
18038 20911134 13329618 9124092 6667541 5115492 4100638 3442519 2989477 2652360
18030B652360k79199k20957j60305m1970O2386J13795L5068q4603k36260k63384
18020A576931j64990p9077N5489R5566M7713p8040q9099n7953q4483q5346r4915
18009A041796o3797k7715M260K1874N0092M9705L3638n2519r0686q5748q8635
17998G92265l9173K7264K8367N773L4328K8183k6423q9659k9962k4286K7861N0052
17986G84590L014l6556m0357R10R9506J58625K10219J84426N3521M0246Q8227
17975A546371Q4193l587j11768p9906k219Q2131J8685j3298n505j01611j75452
17964A238034j95415j05149n2635K6169K5878m3932n4370j9382j068J2553r012
17953H21671k1205M586L479O1205J2153m9237j8974n7568n4742m4806N092L2896
$$ plain form
18030 2652360 2373161 2152204 1991899 1949929 2012315 2126110 2161178 2076575 1840315 1576931
18020 1576931 1411941 1332864 1388353 1483919 1531632 1453592 1364493 1306540 1222057 1136711 1041796
18009 1041796 977999 950284 954544 976418 1026510 1076215 1109853 1057334 966648 880900 792265
17998 792265 753092 780356 808723 814496 848824 877007 850584 760925 730963 706677 734538 784590
17986 784590 787604 751048 710691 711601 811107 969732 1179951 1364377 1417898 1458144 1546371
17975 1546371 1630564 1626977 1515209 1435303 1433084 1515215 1533900 1520602 1515097 1413486 1238034
17964 1238034 1042619 937470 884835 911004 936882 892950 838580 819198 818130 830683 821671
17953 821671 800466 805052 808531 869736 881889 832652 813678 756110 701368 656562 661654 694550
17941F94550N1155K6210l7934l8633m2434k5087j2632J0293L4106J18269J75785
17930I53648J33931L3464n6723o3054K0207P6625P9990o06m7580k0574j4121n1961
17918A043246m4761p299Q1246J3239p1023j31284j37341n2238j4720m8093l1149
17907E99823n674J2447L7427J3655j3277q6379r9346M858M5998L5512j3140j7096
17895E14808K4771J9953J6315K0836l4812p8177o2394J2432J1466M6161L7092
17884E28451r140n0326l7745j3305K4073K7637K6090O7432Q3498R4517K00554
17873I41736J99111J41105Q9099O5146N2903R3829J96345K57907J69638k1974
17863B184845j72161k41656j68009j39410p8484n2441j47928j94418j67789j42789
$$ plain form
17941 694550 745705 771915 733981 695348 652914 627827 615195 625488 659594 777863 953648
17930 953648 1087579 1121043 1064320 1001266 1021473 1098098 1178088 1177482 1129902 1109328 1095207 1043246
17918 1043246 998485 991186 1072432 1085671 1014648 883364 746023 693785 679065 630972 599823
17907 599823 594149 606596 644023 657678 644401 558022 458676 463534 509532 545044 531904 514808
17895 514808 539579 559532 575847 596683 561871 483694 421300 433732 445198 491359 528451
17884 528451 519311 468985 431240 417935 442008 469645 495735 563167 646665 741182 941736
17873 941736 1140847 1281952 1371051 1436197 1489100 1582929 1779274 2037181 2206819 2184845
17863 2184845 2012684 1771028 1603019 1463609 1385125 1332684 1184756 990338 822549 679760
17853F79760j29183o3292l9960o1490k1296l468k1899L028l997J3715j1222J109
17841C41805Q046J1577J6962K829L563j9473l5737l2468m2166j89N398P192N169
17828B72508j2834q094k2259k9040j3254l6059m1923O698K7667k3774j1144K54
17816A08746J6971J549m01J986o47k0634k598j0142P59R751K6995K4760J0840
17803A67935j8901r989K7412l693J3569K254j1000q26o865L0199L37k3547K779
17790A69664k998k4117m7697l0668J0948j3725m645J6698L0479M8031L1276j4396
17778A68850j3854n181j1138P171o110J4266l537K892J4755K0808k938j0213j5841
17765A59930m2270l546J4064n960Q607K0653r062k1139j6182P432j5883J6312
$$ plain form
17853 679760 550577 487285 447325 385835 364539 361071 339172 342200 338203 351918 340696 341805
17841 341805 349851 361428 378390 381219 384782 365309 329572 297104 254938 254749 260147 267339 272508
17828 272508 259674 251580 229321 200281 187027 150968 109045 115743 143410 119636 108492 108746
17816 108746 125717 127266 126865 128851 128204 107570 104972 94830 95589 105340 132335 157095 167935
17803 167935 149034 139045 166457 162764 176333 178587 167587 166761 159896 190095 190432 166885 169664
17790 169664 166666 142549 94852 64184 75132 61407 56762 73460 103939 151970 183246 168850
17778 168850 154996 149815 138677 145848 139738 154004 150467 153359 168114 188922 185984 175771 159930
17765 159930 117660 114114 128178 122218 130825 151478 142416 121277 105095 112527 96644 112956
17753A12956P284o586o639j9131r605J9637J2516J6731o601l6282k4881J0494
17741F9893L2734J1108P088J4287j4808O567N8509L9748L8714M0824P0768J13835
17729D89267J26922N2467J5348q12p3456m2349k7203n59N1087Q4874L3293K381
17717G11260o9595r8119j17428j02735n3306l8379l8994o074j7581q038J3166
17706A74177k481o399K029l3922q394M457r464j8848K3859o53l0014j6693K267
17693G9921K5910M0172N256J1941Q73L0093L5149K7692N9230Q4706J06400P2430
17681E79773N2454K9121O106j968K9037P0638R2344Q5240j9075j02983j34950
17670F85737n9801j5384P660O473j5949p5399r4912j32116q5191m6326l9057j0444
$$ plain form
17753 112956 120240 113654 107015 87884 78279 97916 110432 127163 120562 84280 59399 69893
17741 69893 102627 113735 120823 135110 120302 126869 185378 225126 263840 304664 375432 489267
17729 489267 616189 668656 684004 683192 609736 567387 540184 539625 590712 675586 708879 711260
17717 711260 641665 543546 426118 323383 270077 231698 192704 186630 169049 161011 174177
17706 174177 171696 165297 167326 133404 125010 129467 120003 101155 125014 124361 94347 77654 79921
17693 79921 105831 146003 151259 163200 164073 194166 229315 257007 316237 400943 507343 579773
17681 579773 632227 661348 667454 665486 694523 765161 857505 942745 923670 820687 685737
17670 685737 625936 610552 618212 624685 608736 533337 438425 306309 221118 174792 135735 125291
17658A25291J13M0577N631K62r462j9067l0112K8618L6303j6687o911J3803P8020
17645B46379O3435P3557R9068J46001J35406K9193o8920o2226k9639M8158J15257
17634G95669M9906o6016j01280p2015j4099n623l1435n7657j00388l9591K687
17623C60158M4130K8673k0513J017o1003n9109k2026m8957m3913j0159k3524j0422
17611A34352J48K4872K8614J5138K2565K957J4372k725l855J8291J8249M8685
17599C21663N4010R3702J44016J71269J80526M5531L7487J15380J45159O9972
17589A378715j8185j07359j36287j12834o3187q4621j47061j48465j15164r8154
17579C47398q2238n6881j4232k1881K3619j2316l3599k2382L444L8399j7488j3424
$$ plain form
17658 125291 125404 165981 171612 171874 162412 143345 113233 141851 178154 161467 154556 168359 246379
17645 246379 309814 383371 482439 628440 763846 793039 724119 661893 632254 680412 795669
17634 795669 845575 779559 678279 606264 592165 586542 555107 497450 397062 357471 360158
17623 360158 404288 432961 412448 413465 352462 293353 271327 222370 178457 168298 144774 134352
17611 134352 134500 159372 187986 203124 225689 228646 243018 240293 236438 254729 272978 321663
17599 321663 375673 469375 613391 784660 965186 1010717 1048204 1163584 1308743 1378715
17589 1378715 1360530 1253171 1116884 1004050 940863 856242 709181 560716 445552 347398
17579 347398 265160 208279 194047 172166 195785 183469 149870 127488 130932 169331 151843 138419
17567A38419j9919m275J5436J8161J9694J1155R451j8913L2060J1236r960N5960
17555B58505K7835J6034k8021r261M3340L7826Q1995J01849J39778J52125O2330
17544H84335l6855o6632k8795P0740J03088L1619j08473j48874j23611o1424l4091
17533D81027j4844l6878n3472n4499m4409l3027l9265n0845l6310j4897l0346
17522G2235L7309L7270J7587N121J6429O873K1214J4376K1847J4922J456k4669
17510B41970j1185M296l4445J5107j2659n3511k509K5699O744o4343K6812P5714
17498B17690N6775M2670L322k8158l1732j1382N2990L4926k991j5049k5092j7083
17486B76886l5825m1358r249J1094N057m887m7303o3558l9874J3537J9431l5497
$$ plain form
17567 138419 118500 114225 129661 147822 167516 178671 188122 169209 201269 212505 202545 258505
17555 258505 286340 302374 274353 265092 308432 346258 428253 530102 669880 822005 884335
17544 884335 847480 780848 752053 822793 925881 957500 849027 700153 576542 515118 481027
17533 481027 466183 429305 375833 321334 276925 243898 204633 153788 117478 102581 72235
17522 72235 109544 146814 164401 169522 185951 192824 214038 228414 250261 265183 266639 241970
17510 241970 230785 235081 200636 215743 203084 149573 147064 172763 179507 115164 141976 217690
17498 217690 274465 317135 320457 292299 260567 249185 302175 337101 334110 319061 293969 276886
17486 276886 241061 199703 190454 201548 206605 201718 154415 90857 50983 64520 83951 48454
17474D8454L368L9276o691J7201j0202k443P109Q252J8827K0697j4448n303O99
17461A24796L7005L3470j010K353j3089j7610J8103R735k0059p746K090l482J4502
17448A79058L6804J7660l2904m1988n581j5627j6451K7997J6180N331M8278P3476
17436B92233N2292q144q2500j09328r0304l5272K543Q828l999Q045K6085R790
17424G0269L742j2170L189J526k5039k1796L656K8999j5776j1454l3984l1015
17412c9853m996L5444K6374L181M80p864J851J4334J2259P236K285J662P119Q108
17398F7620k4994N693j5950k2212J1171J3493M80O338K357k7384k3914k3487R379
17385b1410J6410m423r671n22K5228O689J035Q429j1659j2534p825j337k0387
$$ plain form
17474 48454 51822 91098 84407 101608 91406 88963 96072 104324 123151 143848 129400 124097 124796
17461 124796 161801 195271 194261 196614 183525 165915 184018 193753 173694 165948 168038 164556 179058
17448 179058 215862 233522 200618 158630 153049 137422 120971 148968 165148 170479 218757 292233
17436 292233 344525 336381 253881 144553 54249 18977 21520 30348 26349 34394 60479 70269
17424 70269 74011 61841 65030 66556 41517 19721 23377 52376 36600 25146 -8838 -39853
17412 -39853 -44849 -9405 16969 20150 20630 12766 14617 28951 41210 48446 50731 52393 59512 67620
17398 67620 42626 48319 32369 10157 21328 34821 35301 41639 43996 16612 -7302 -30789 -21410
17385 -21410 -5000 -9423 -19094 -19616 5612 12301 13336 21765 10106 -2428 -10253 -11590 -31977
17372c1977J6801p260j7357m975l0082J4282J2213J184L1016p902k2970j3903
17360f0930j84O196K3049P164j0960M907J6685j6996J765O317J9424l288n3097
17347e9948R311L5726O109q454j2125l799O507J5267K060J0824p350j5748k5772
17334d7392m746q266O805J5099K5729n651P522q90J7291j6268N00j4912j5498
17321d0677K7823k872k257j8477k087p807r554J1834k179o2J9447o050q530p838
17307d9286j9388J2127K1556L2195L1479j668j1683J1011L044k1150j5455j5883
17295b3101q097J1285L6164j254l5420l1174J3052J9973K03J1566J4966M061j3924
17282a700j8436l179k931o684k1505j1841J26M218L2917k164k540K464K367j0437
$$ plain form
17372 -31977 -15176 -22436 -39793 -44768 -74850 -60568 -48355 -47171 -16155 -24057 -47027 -60930
17360 -60930 -61114 -54918 -31869 -24705 -35665 -30758 -14073 -31069 -29304 -22987 -3563 -6851 -59948
17347 -59948 -50637 -14911 -8802 -17256 -29381 -33180 -26673 -11406 -9346 1478 -5872 -21620 -47392
17334 -47392 -52138 -60404 -53599 -38500 -12771 -18422 -10900 -11790 5501 -10767 -10267 -25179 -40677
17321 -40677 -12854 -15726 -17983 -36460 -38547 -46354 -55908 -44074 -46253 -46315 -26868 -32918 -41448 -49286
17307 -49286 -68674 -56547 -34991 -2796 28683 27015 15332 26343 29387 8237 -7218 -23101
17295 -23101 -31198 -19913 16251 14997 -20423 -51597 -38545 -18572 -18369 -6803 8163 12224 -1700
17282 -1700 -20136 -23315 -26246 -32930 -54435 -66276 -66150 -61932 -29015 -31179 -33719 -31255 -28888 -39325
17268c9325n2367n058K3553n358M591K9441K7053k041l4071j923L7833K6026R892
17255A8246K1890L8532N109m5809k1443L879m0445m0678O064n849r49M3281L311
17242a4861m966r394k2701K6951m226o643m273M909K2831n076O962M866k3011
17229b8632m818m059O772J8765j6112j6458K3063L1928j7788j9841m978J2257
17217a9901m258J2298J2705K2806j8244j566j6265m5599o783L5120K6815J5274
17205A2402k1754j47M3393O590l0415m808J9918n669j2631r955k1975R654N099
17192a0298R282o905o879k1435j2157K5916K9697J422j5288n532j2944J4998J8368
17179H245j9539j0737K356J2795K615j2110J3231R888M66j0133O116J3641O575
$$ plain form
17268 -39325 -91692 -96750 -73197 -78555 -73964 -44523 -17470 -19511 -53582 -55505 -17672 8354 18246
17255 18246 40136 78668 83777 37968 16525 20404 -20041 -60719 -54655 -60504 -61453 -18172 -14861
17242 -14861 -19827 -29221 -51922 -24971 -29197 -35840 -40113 -35204 -12373 -17449 -10487 -5621 -28632
17229 -28632 -33450 -37509 -30737 -11972 -28084 -44542 -21479 10449 -7339 -27180 -32158 -19901
17217 -19901 -24159 -11861 844 23650 5406 3840 -12425 -58024 -64807 -29687 -2872 12402
17205 12402 -9352 -9499 33894 40484 10069 5261 25179 19510 6879 -3076 -25051 -15397 -10298
17192 -10298 -1016 -7921 -14800 -36235 -48392 -22476 7221 8643 -6645 -12177 -25121 -10123 8245
17179 8245 -11294 -22031 -19675 -6880 -4265 -16375 -3144 6744 7210 -2923 3193 16834 23409
17166B3409L2875j762K3409J468k3901j8105J1230K6990m910k0645m453j4165
17154C1440j4739k493j9904r420n288J1910k2367O815L599J727J6239J6803L403
17141A7725O129r712m2526J2144j4135j02J1786K1587Q153Q225K4410p303n4966
17128a8585k2588K3441Q208O113j0146j3079j0446J3519L9729j997j2496p194
17116e521j5849q397N557L775j2038o206K3621j376K145J0768J7984J1133j879
17103B3717Q773r225k3365l3433K885J5963L1527m785N14k4013k8113n951m448
17090d9954j963J4374K4880m0676j4722K6369L8086L835k885m029K9867L1732
17078E4914k5177n3426R411j5116k024L122j1504j7500J3245k0834O436K5930
$$ plain form
17166 23409 56284 54522 77931 79399 55498 37393 48623 75613 70703 50058 45605 31440
17154 31440 16701 14208 -5696 -15116 -20404 -8494 -30861 -24046 -20447 -18720 -2481 14322 17725
17141 17725 23854 14142 -28384 -16240 -30375 -30477 -18691 2896 11049 19274 43684 36381 -18585
17128 -18585 -41173 -17732 -9524 -3411 -13557 -26636 -37082 -23563 16166 14169 1673 -5521
17116 -5521 -21370 -29767 -24210 -20435 -32473 -38679 -15058 -16434 -14289 -3521 14463 25596 23717
17103 23717 32490 23265 -100 -33533 -30648 -14685 16842 12057 12571 -11442 -39555 -45506 -49954
17090 -49954 -51917 -37543 -12663 -53339 -68061 -41692 -3606 229 -2656 -6685 23182 54914
17078 54914 29737 -23689 -14278 -29394 -31418 -28296 -39800 -57300 -44055 -64889 -58453 -32523
17066c2523N77j1697J0020R004J938n905P830J9156N14k3351N84O338o623J0595
17052a3543P170m697r762O924N341j3177K3326M735j6794m971l253k5465l1700
17039g5866K8427J8787j557J6981k687O214K3917R188n980j0043l8651N19R065
17026b1686J2089m0619o519J3706O940K1515o167k7391M301K5601Q605k1655j4925
17013d6205l701J4247J8505n598K834J9810P947o379o096j2255P166J0592O084
17000F951R699J7239J9083q761j6974M10j8925J0538R600j0943k6718P061j2815
16987a4555O183J5221j5586j7674K0250O19R677m336o122J1226J6736k3428k3520
16974b5309n246k5027o311L3472N106j3001L1444N9789J3998m8613k2862N198
$$ plain form
17066 -32523 -31946 -43643 -33623 -24619 -22681 -28586 -20756 -1600 -1086 -24437 -23853 -17515 -24138 -13543
17052 -13543 -6373 -11070 -20832 -13908 -8567 -21744 1582 6317 -10477 -15448 -18701 -44166 -75866
17039 -75866 -47439 -28652 -30209 -13228 -15915 -9701 14216 23404 17424 7381 -31270 -30751 -21686
17026 -21686 -9597 -50216 -56735 -43029 -36089 -14574 -20741 -48132 -43831 -18230 -9625 -31280 -46205
17013 -46205 -49906 -35659 -17154 -22752 -19918 -108 7839 1460 -4636 -16891 -9725 867 6951
17000 6951 16650 33889 52972 44211 27237 27647 8722 19260 28860 17917 -8801 -1740 -14555
16987 -14555 -8372 6849 -8737 -26411 -6161 -5542 4135 -201 -6323 4903 21639 -1789 -25309
16974 -25309 -30555 -55582 -61893 -28421 -23315 -36316 -4872 54917 68915 20302 -2560 2638
16962B638J9675L1084Q964j7032o465Q647K7274j1620m5129k9636j756m1939k5748
16949h1043K1800J0566O718K3877J7395J7878N892l7476l5636L6967L582R302
16937a78L4229J3471J754P180j9810k8037k058L1486P14j648j111Q456j4118l895
16923B6435K8090L4312K8636L5029M6590M6823M8258K1502N6433Q7718J08673
16912E68499l6483n6173n5108k316Q6683O1066m3942r0275j03240m9005l7328
16901B42378l0226r559m2475m5458n0363q162m666o2953J5736n19k2418j833r513
16888c0031J547J7036O295N37k9872J2039K2414J7556j8123m370k1434m1166Q038
16875e9534J6374p354o703j1417L8319K0535j5232k2303p311J8525J1832R153
$$ plain form
16962 2638 22313 53397 62361 45329 38864 47511 74785 63165 18036 -11600 -13356 -55295 -81043
16949 -81043 -59243 -48677 -41959 -18082 -687 17191 23083 -14393 -50029 -13062 -9480 -178
16937 -178 34051 47522 49276 56456 36646 8609 6551 38037 38751 37103 35992 44448 30330 26435
16923 26435 54525 88837 117473 152502 199092 245915 294173 315675 372108 459826 568499
16912 568499 532016 475843 420735 418419 505102 566168 522226 431951 328711 279706 242378
16901 242378 212152 202593 160118 114660 64297 56135 51469 -11484 4252 3733 -18685 -20518 -30031
16888 -30031 -28484 -11448 -5153 -4616 -34488 -22449 -35 17521 -602 -4972 -26406 -67572 -59534
16875 -59534 -43160 -50514 -57217 -68634 -30315 -9780 -25012 -47315 -54626 -36101 -24269 -15116
16863a5116J225l1648k072J5335O700L3741J082N954L5038M598l9787j0930j0402
16850f282J5045k1078j3562K0954J4199j2674n332j894J9003L682m3407o995O415
16837c1926L4530j850l730J2122J6126o357m34l798m995P801J9148q954k2014
16824E669J2774O53j6318k2071P590J3042r738K2315K4733q558l0842o391Q377
16811A235K3711m648l4811j9359l3389j153J3946L0921J7339j999m4025j4062
16799f6294L4661O769J2723L001m920L897J7375m166j7487j0401j7697R692M298
16786b8549J0219P001K963j1937j0767j0264l346o186k4545J3336P873J7564p83
16773c7421j5898k3659j7050J6800L4374K8908L4560J9425k3526j2642k949K0067
$$ plain form
16863 -15116 -13891 -45539 -47611 -32276 -25576 8165 9247 15201 50239 54837 15050 4120 -6282
16850 -6282 8763 -12315 -25877 -4923 9276 -3398 -8730 -10624 8379 12061 -31346 -38341 -31926
16837 -31926 2604 754 -2976 9146 25272 18915 18481 14683 9688 17489 36637 27683 5669
16824 5669 18443 19096 2778 -19293 -11703 1339 -8399 13916 38649 30091 -751 -7142 1235
16811 1235 24946 20298 -14513 -33872 -67261 -68414 -54468 -23547 -6208 -8207 -52232 -66294
16799 -66294 -31633 -24864 -12141 -9140 -14060 -10163 7212 3046 -14441 -24842 -42539 -32847 -28549
16786 -28549 -18330 -11329 -8366 -20303 -31070 -41334 -44680 -50866 -75411 -62075 -54202 -36638 -37421
16773 -37421 -53319 -76978 -94028 -77228 -42854 -13946 20614 40039 16513 3871 922 20989
16761B0989L5516o643l5409j7690K7789j3825j6855J4820J1204k6883R802R337
16749A2152j8945k2743K2128K1775k7316Q804K2278J2872N47O410l6976j1901
16737a0915o065J4459o054j2776j343J1174L0090J2288l2355l1263J2486K4406
16725D132m497J0421P000M519q858Kp369J5155J1794j020k7328k2512P877j1923
16711b2607k6498O948J2197R529J9141j3921k4998j7505o147P88l781J5119j2213
16698f3948J2689J789J5050l4665N253L0442j4235j6483N000J8409Q161k868j126
16685c6532K4312J4725L189j9578N465j4001k4307J5763L1907P994K435o230M898
16672A0040M888j1836K321j7792k2400j063K6408J424j9902j7088m018L1211J321
$$ plain form
16761 20989 56505 49862 14453 -3237 24552 10727 -6128 8692 19896 -6987 2815 12152
16749 12152 -6793 -29536 -7408 14367 -12949 -4145 18133 31005 31552 37962 986 -10915
16737 -10915 -16980 -2521 -8575 -21351 -22694 -11520 18570 30858 -1497 -32760 -20274 4132
16725 4132 -365 10056 17056 21575 12717 12719 5350 20505 32299 31279 3951 -18561 -10684 -22607
16711 -22607 -49105 -42157 -29960 -20431 -1290 -15211 -40209 -57714 -63861 -63073 -66854 -51735 -63948
16698 -63948 -51259 -49470 -34420 -69085 -63832 -33390 -47625 -64108 -59108 -40699 -32538 -35406 -36532
16685 -36532 -12220 2505 5694 -13884 -8419 -22420 -46727 -30964 943 8937 11372 5142 10040
16672 10040 14928 3092 5413 -12379 -34779 -35842 -9434 -8010 -27912 -45000 -49018 -17807 -16486
16659a6486k4199n1379j6541M1372Q631j6995K1624J8028N444L820J1196L214
16647a2271k684j6816J3365J6906J6210L6271o67k3418j4939r690n981j8467j889
16634b4070j1272K2738Q47J880J3017k3654J1954M072l2644j2182l810Q522J1465
16621c3137j2518J3324j7762K4115J0901j8647m802J7641k0861n606M2467J6441
16609A1556j2484j9763J8594K060j2793k8187J5706M49K0886L7875k317j7515
16597A4067j6521j6075j7807K656M0583R887k7888l843K1867J245o542L861m0403
16584c4913j1288K1247m180q927P835J1623j892K5792J5595K7405j3351l9761
16572d815m7171k5887J0423K3377L4913K504K1156K6787k0454j7712K812M797
$$ plain form
16659 -16486 -40685 -92064 -108605 -67233 -58602 -75597 -53973 -35945 -30501 -26681 -15485 -12271
16647 -12271 -14955 -31771 -18406 -1500 14710 50981 50314 26896 11957 2267 -3714 -22181 -24070
16634 -24070 -35342 -12604 -11757 -9877 3140 -20514 -8560 -4488 -37132 -49314 -53124 -44602 -33137
16621 -33137 -45655 -32331 -50093 -25978 -15077 -33724 -38526 -20885 -41746 -47352 -4885 11556
16609 11556 -928 -20691 -2097 -37 -12830 -41017 -25311 -24862 -3976 33899 31582 14067
16597 14067 -2454 -18529 -36336 -33680 6903 16790 -11098 -14941 6926 8171 1629 5490 -34913
16584 -34913 -46201 -24954 -29134 -38061 -30226 -18603 -20495 5297 20892 48297 34946 -4815
16572 -4815 -51986 -77873 -67450 -44073 -9160 -6656 14500 41287 20833 3121 5933 10730
16560A0730O224n026j991l5047n264j6398j2714L1390J3121j4168j0974l998j1146
16547e5261L111l19j3106L8762K2773o365j1770k1791O592K0088k000M3257P263
16534C1234j1099k1290k312p64r049Q221J852P430j729k1142J5297N119j7186
16521a5418l0553k5235Q474O721j4707L836O577J5497L3938J1252M85o719p238
16508a3090J1856K2958j1169j9119q899k0167m4235o068L0206K8805j868k000
16496c2790J1208j0469J9625J4746j6761k6162j2638m469j9868j7096k177K0753
16484g6098M3722J602k0158M066l2956j1028K1070L6255K7428j7274k0425p486
16472e1282J9150K1481p37q967k5839K6471K2960M127k224o651l3654k8405j399
$$ plain form
16560 10730 16954 11928 9937 -25110 -30374 -46772 -59486 -28096 -14975 -29143 -40117 -44115 -55261
16547 -55261 -52150 -52469 -65575 -26813 -4040 -10405 -22175 -43966 -37374 -17286 -19286 23971 31234
16534 31234 20135 -1155 -3467 -4231 -13280 -5059 -3207 4223 2494 -18648 -3351 1768 -15418
16521 -15418 -45971 -71206 -62732 -56011 -70718 -66882 -60305 -44808 -10870 382 867 -5852 -13090
16508 -13090 -1234 21724 10555 -8564 -17463 -37630 -81865 -87933 -57727 -28922 -30790 -32790
16496 -32790 -21582 -32051 -12426 2320 -14441 -40603 -53241 -57710 -77578 -94674 -96851 -76098
16484 -76098 -32376 -30774 -50932 -46866 -79822 -90850 -69780 -33525 -6097 -23371 -43796 -51282
16472 -51282 -32132 -10651 -11388 -20355 -46194 -19723 3237 7364 5140 -1511 -35165 -63570 -64969
16459f4969K2001K5583k8281j3199L3055Q725K360J1818m3945l2107L0834K6827
16447b1298J2302M602J0746N414j6020k309J592M599R783o773M374l496k4211
16434b0695o449K5416K6911q028l7003j1163J2554J4894K3523j2672l4422P04
16422b6430L3811Q167j0100j3914j5244m012K9174L4891k0121m6127N33J7859
16410a1513r250o97P390R716k0827k8837l327m164K2044J2714j6533J8518j5448
16397d0214q065J0629M374L8789Q654k996n571k7217O683Q114n639o186j1328
16384b9973k1800p135J7168J4443q88j3648R524l271Q975L7787K513k896k2k7798
16370a7021J5920K6624q735l032l913m644j2228n447J4496J0791K54J0572K1726
$$ plain form
16459 -64969 -42968 -17385 -45666 -58865 -25810 -17085 -14725 -2907 -46852 -78959 -48125 -21298
16447 -21298 -8996 -4394 6352 11766 -4254 -6563 -4971 -372 9411 2638 7012 3516 -20695
16434 -20695 -27144 -1728 25183 17155 -19848 -31011 -18457 -3563 19960 7288 -27134 -26430
16422 -26430 7381 15548 5448 -8466 -23710 -27722 1452 36343 16222 -29905 -29372 -11513
16410 -11513 -20763 -21460 -14070 -4354 -25181 -54018 -57345 -61509 -39465 -26751 -43284 -24766 -40214
16397 -40214 -48279 -37650 -33276 5513 14167 11171 5600 -21617 -14934 -6820 -12459 -18645 -29973
16384 -29973 -51773 -58908 -41740 -27297 -28185 -41833 -32309 -35580 -26605 11182 13695 10799 10777 -17021
16370 -17021 -1101 25523 16788 13756 9843 5199 -7029 -12476 2020 12811 13065 23637 45363
16357D5363k6566k2045J2824j3373j5112J4502J770j9008j3305O624j394K9319
16345d01M967J1310j36j9188o990j0589N965J3451J2366k5999l0831m210O179
16332d4106L0365L5826j1338k5093q619j2221m55K6411o988j0997Q458K6950j3397
16319e204p79K214k0742k0537j9968K7963K1826L700Q178j4615L355o640J468
16306a9781j3737Q170J52J1248K297o249J2492j168k2277K948R81L098M472j0686
16292b8040o16K304J5944k4393j3191Q422m686k3987K4182J8837J5832k776p035
16279a9203j0719j7690K0186J6981K165J1375K516l5373j1182l171m658L5622
16267a3151N738m296k66O466n279q246k4021j3511K2580P221j6928J1308P344
$$ plain form
16357 45363 18797 -3248 9576 -3797 -18909 -4407 -2637 -21645 -34950 -28326 -29720 -401
16345 -401 4566 15876 15740 -3448 -10438 -21027 -15062 -1611 10755 -15244 -46075 -50285 -44106
16332 -44106 -13741 22085 10747 -14346 -22965 -35186 -35641 -9230 -16218 -27215 -18757 8193 -5204
16319 -5204 -5983 -3769 -24511 -45048 -65016 -37053 -15227 -11527 -3349 -17964 -14609 -21249 -19781
16306 -19781 -33518 -25348 -25196 -13948 -11651 -17900 -5408 -6576 -28853 -25905 -24924 -21826 -17354 -28040
16292 -28040 -28656 -26352 -10408 -34801 -47992 -39570 -44256 -68243 -44061 -25224 -9392 -12168 -19203
16279 -19203 -29922 -47612 -27426 -10445 -8280 3095 5611 -29762 -40944 -44115 -48773 -13151
16267 -13151 -7413 -11709 -11975 -5509 -10788 -19034 -43055 -56566 -33986 -26765 -43693 -32385 -25041
16254b5041j984R664Q823l5J7831m841l1238o550m654j4438J7999j7402j921L365
16240e0422R74R428r603J9959m521k844k175K2952J8884p983l3147K5068M9394
16227C5964J7544k1019j6587J6081j662m0988j2890L0865M1027J1326k0926n7960
16215a9225k7615J1260N612N902K2557K944m174J3311k2785P551m172l72R114
16202i2J4913L796k9481m207r367m299j6612K9911o01m1104M276L4103L6734q884
16188I086j6253j1690J3738M247k478r249n740K2368J9109P449P308j332j9364
16175A7199l4884k9538n921k525J2677K1303L0164k233j9849m170m274M4568K2213
16162D4730J5077k6340l1787j5917O529R684R422J4077p960j5817j011j9653k491
$$ plain form
16254 -25041 -27025 -17361 -8538 -8573 9258 4417 -26821 -33371 -38025 -52463 -34464 -51866 -53787 -50422
16240 -50422 -49448 -40020 -49623 -29664 -34185 -37029 -39204 -16252 2632 -5351 -38498 -13430 35964
16227 35964 53508 32489 15902 31983 30321 -10667 -23557 7308 48335 59661 38735 -19225
16215 -19225 -46840 -35580 -29968 -24066 -1509 1435 -2739 10572 -12213 -4662 -8834 -9206 -92
16202 -92 14821 18617 -10864 -15071 -24438 -28737 -45349 -15438 -16039 -57143 -52867 -18764 17970 9086
16188 9086 -7167 -18857 -5119 -872 -3350 -12599 -18339 4029 23138 30587 37895 36563 17199
16175 17199 -17685 -47223 -53144 -55669 -42992 -21689 8475 6242 -13607 -17777 -22051 22517 44730
16162 44730 59807 33467 1680 -14237 -7708 1976 11398 25475 17515 1698 687 -18966 -21457
16149b1457J8739Q581p574n59k7285o713K9829P333K5375j6453j1008O480J0536
16136A5824m4643J5915L9899K2590j4356j4863N551J754j0527J3266M8325n819
16124G2916j0715M020j8899k5986J6967K3373k8051k2202l4117P650K859R903
16112b282o554J2242K9814J7071o842r134q123M444k5797j0480n584j097J0455
16099a867l923n041Q678L0392N171k912r152r720j8843j3092j5802j296K3357
16086a4050J4869q569R642j647K187R5k805o12j7445k1582j3600N15J6308J3264
16072b3430M423L489l740M597J712l893j2524j2657Q946K2617K1637M196m277
16059A1096j3198J5930L944j6793r128N404J948J2066j3605k622j0895M924m303
$$ plain form
16149 -21457 -2718 5863 -1711 -2270 -29555 -36268 -6439 894 26269 9816 -1192 5288 15824
16136 15824 -28819 -12904 26995 49585 35229 20366 25917 27671 17144 30410 78735 72916
16124 72916 62201 66221 47322 21336 38303 61676 33625 11423 -22694 -15044 -12185 -2282
16112 -2282 -8836 3406 33220 50291 43449 34315 26192 30636 4839 -5641 -11225 -12322 -1867
16099 -1867 -5790 -10831 -2153 28239 33410 30498 21346 11626 -7217 -20309 -36111 -37407 -14050
16086 -14050 819 -7750 1892 245 2432 2527 -278 -890 -18335 -39917 -53517 -53002 -36694 -23430
16072 -23430 -19007 -15518 -19258 -14661 -12949 -16842 -29366 -42023 -33077 -10460 11177 15373 11096
16059 11096 -2102 13828 17772 979 -8149 -2745 -797 11269 -2336 -4958 -15853 -10929 -15232
16046a5232O9J6842L39J4434o998m2429k1998K7560L4441J288j6044j3108o823
16033b7659K5152J7842q517k382M329j6650k5577J562K6212J0605L479O776k2151
16020f979l9986J241P084j300R820J5616o744j8814J7469L0233L974q377J7920
16007B1157p193j0663J9730p691l3410j5391J7578L3496J6781m0551k3425K4991
15995d591r9J2107j5654q388J5657o163k7412r908Q643n432J5470K2848J610O569
15981E257J757j0251q543q956j5811J1125L971k603j2114j7719r4J7408K3758
15968a2815K2031J2401L620L2000j1637N407m078r685q576j5230M766j0596l881
15955C727k3346l198O53J6424o880l682Q493K7542L632l6711o268J728m252j2484
$$ plain form
16046 -15232 -15163 1679 2018 16452 9454 -32975 -54973 -27413 7028 8316 -7728 -20836 -27659
16033 -27659 -2507 15335 6818 4436 8765 -7885 -33462 -31900 -5688 4917 8396 15172 -6979
16020 -6979 -46965 -45724 -38640 -39940 -30120 -14504 -21248 -40062 -22593 7640 11614 3237 21157
16007 21157 13964 3301 23031 15340 -18070 -33461 -15883 17613 34394 -6157 -29582 -4591
15995 -4591 -4690 7417 -8237 -16625 -968 -7131 -34543 -44451 -35808 -41240 -25770 -2922 -1312 5257
15981 5257 7014 -3237 -11780 -20736 -36547 -25422 -21451 -24054 -36168 -53887 -53981 -36573 -12815
15968 -12815 9216 21617 25237 57237 45600 51007 46929 37244 28668 13438 18204 7608 3727
15955 3727 -19619 -22817 -22164 -5740 -12620 -16302 -7809 19733 23365 -13346 -19614 -17886 -22138 -34622
15941c4622k9159J771K331O425L5427J9155J8217m71j3946l5160J063R565J257
15928a8147K3632L293J1386n414M33J0183l1648j5809r034J1216J0835J4812q286
15915b548m2393l1773M0J9881J2916N0482P846m556j1228K034L670P301L6575
15902D8247k8179j1356K322J8914j4180j5181m904l961j0264k9488n671K297K9608
15889b1796K3158j6589j0729K9631P842k1315j9696j3143n482K4307q786r590
15877d2188j0208L4756K0843n539j022j0737J0157L2516j5124l4464O409M9335
15865C4734k6533l4909q266N312K0516J1699j7668q667K846L7877L7409j5437
15853C8913m4815k6119L618O657K9835J9749R542k2773l4366K528K184J1006q125
$$ plain form
15941 -34622 -63781 -62010 -59679 -53254 -17827 1328 19545 19074 5128 -30032 -28969 -19404 -18147
15928 -18147 5485 8778 20164 14750 15183 25366 -6282 -22091 -31125 -19909 -9074 5738 -2548
15915 -2548 -44941 -76714 -76674 -56793 -43877 6605 14451 9895 -1333 701 4371 11672 48247
15902 48247 20068 8712 11034 29948 15768 587 -4317 -8278 -18542 -48030 -53701 -51404 -21796
15889 -21796 1362 -15227 -25956 3675 11517 -9798 -29494 -42637 -48119 -23812 -32598 -42188
15877 -42188 -52396 -17640 3203 -2336 -3358 -14095 -3938 28578 13454 -21010 -14601 34734
15865 34734 8201 -26708 -34974 -29662 -9146 2553 -15115 -23782 -20936 16941 54350 38913
15853 38913 -5902 -32021 -28403 -21746 8089 27838 37380 14607 -19759 -17231 -15047 -4041 -12166
15840a2166J0665l330m3881q31K1649J9009k677l1682j3650K8199J8997k931N214
15827g415PR006q114k1599J8015K1545j3701k3136P895K1912p062j1918J495j0943
15813b4013j9609k8149K3570K2005k3704k861K8898M7451Q126j0464n647j5715
15801a12m8122j0208L65J4572Q869J4311J9212l528q314k0993L161J9397O744
15788d646Q229j6441k3979j1153K5425l956r737m006k0192M72J8354N234j6560
15775e2956q804L414o60K1343j4715r384J3988l6194L655K7568P350j7681k0600
15762h3676K926J9890L7271J5264K7229r734j8381J097n363J7110j107L511p917
15749a880q986l199k2897m795m005p308J2995m5J1581j561k4394Q423L7067J0117
$$ plain form
15840 -12166 -1501 -4831 -48712 -49543 -27894 -8885 -11562 -43244 -56894 -28695 -9698 -12629 -7415
15827 -7415 -7408 1598 -6516 -28115 -10100 11445 -2256 -25392 -17497 4415 -2647 -14565 -13070 -24013
15813 -24013 -43622 -71771 -48201 -26196 -49900 -52761 -23863 23588 31714 21250 15603 -112
15801 -112 -48234 -58442 -58077 -43505 -34636 -20325 -1113 -4641 -12955 -33948 -30787 -11390 -4646
15788 -4646 3583 -12858 -36837 -47990 -22565 -26521 -36258 -40264 -60456 -59984 -41630 -36396 -52956
15775 -52956 -61760 -58346 -59006 -37663 -52378 -61762 -47774 -83968 -80313 -52745 -45395 -63076 -83676
15762 -83676 -80750 -60860 -23589 -8325 18904 9170 -9211 -8114 -13477 3633 2526 6037 -1880
15749 -1880 -10866 -14065 -36962 -41757 -45762 -53070 -40075 -40120 -28539 -30100 -54494 -46071 -9004 1113
15735A113k3152J0694J4804R858J5177j1452k3618J29J1657j3378o07N14j7899
15722b6160M675K5644j83J2088O618o659l1066l824r226p980J8023j57J1043r560
15708a6724l5314j126j267o696o242k5159j1383J7979M3701K9745O657q508j0234
15695b4571L861l3089K0301M0654K372j4467k1760l2318J4806M654j3493M749
15683d8301N298Q404m621j498J1513J2610L16J7530j3670j4928J4758j2645m538
15670b9772Q934m325l420j6633k2113K1650J0525N276P449k2554m023R060J1390
15657b8556j617J7773P919r522N735p968N870O453J047K180L813J3729j7221k8082
15643b8447L909K5840k5563K1208J143J9274j5773j5003o284j71J742L568j4159
$$ plain form
15735 1113 -22039 -11345 3459 13317 28494 17042 -6576 -6447 5210 -8168 -8775 -8261 -26160
15722 -26160 -21485 4159 3976 16064 22682 16023 -15043 -18867 -28093 -36073 -18050 -18207 -7164 -16724
15708 -16724 -52038 -53164 -54431 -61127 -67369 -92528 -103911 -85932 -42231 -12486 -5829 -14337 -24571
15695 -24571 -20710 -53799 -33498 7156 9528 -4939 -26699 -59017 -44211 -39557 -53050 -48301
15683 -48301 -43003 -34599 -39220 -40718 -29205 -16595 -16279 1251 -12419 -27347 -12589 -25234 -29772
15670 -29772 -20838 -25163 -28583 -45216 -67329 -45679 -35154 -29878 -22429 -44983 -49006 -39946 -28556
15657 -28556 -30173 -12400 -4481 -14003 -8268 -16236 -10366 -3913 -2866 -686 3127 16856 -365 -28447
15643 -28447 -24538 1302 -24261 -3053 -1910 17364 1591 -13412 -19696 -19867 -18125 -14557 -28716
15630b8716l540j1264r124M0340M2679J3804k2213j9456j811m53M956k1019j8398
15617c4215j1906j9188M766J1544J912R270J2564k5271r364L1297J0576J1388
15605f627j1678j4820k7325R454J9952k263r302j3427J0057K1908J746l1126k2817
15592g6268k7472K283P436j866Q512K5793K4515K8019n504q134J9616L996l4938
15579c4012m5295M531L3820L5395p155k2306j1800l044N307L1108J4958p890J4178
15566G795J5707j0078l974J4093N594K0302j952k2268l3983k2392L8217J8793
15554B5854j2513l4040p46J3262J622k6078R610r521N492R282M121J6581k9300
15541b6374j5169q548n236Q123p20r52J5054J8737l822p262k250k5842k05J5990
$$ plain form
15630 -28716 -32256 -43520 -52644 -12304 30375 44179 21966 2510 699 246 5202 -15817 -34215
15617 -34215 -46121 -65309 -60543 -48999 -47087 -37817 -25253 -50524 -59888 -28591 -18015 -6627
15605 -6627 -18305 -33125 -60450 -50996 -31044 -33307 -42609 -56036 -45979 -24071 -22325 -53451 -76268
15592 -76268 -103740 -101457 -94021 -95887 -87375 -61582 -37067 -9048 -14552 -22686 -3070 926 -34012
15579 -34012 -79307 -74776 -40956 -5561 -12716 -35022 -46822 -49866 -44559 -13451 1507 -6383 7795
15566 7795 23502 13424 9450 23543 29137 49439 47487 25219 -8764 -31156 7061 25854
15554 25854 13341 -20699 -21445 -8183 -6561 -32639 -23029 -32550 -27058 -17776 -13655 2926 -26374
15541 -26374 -41543 -50091 -55327 -47204 -47924 -48876 -33822 -15085 -18907 -26169 -28419 -54261 -54466 -38476
15527c8476J7977R89N565p99j290k2989J5984K1866K2124o487j6124j4339n685
15514b1684p935k0715o587K4434J6012r524k6533K6772J5770M392j2126K5812
15502H088k2885j1848p113J903R614O548q470k4539j4379p93L2093K0561j7316
15489b8536N280J3807J8355K9018m459l2544k2463Q689Q275K9762j7425k3848
15477a6089J7798J6161j262j7986j3689M601j8907k736J5682k0657L25J9409P346
15464a0004O808k1756j9485J794K1379q140m152j3388N098j1282J0972L4953L6473
15451B9270j4907j9289R878k1176J3556K5817j5424r313l535L844j4678p276p476
15438c0709J7699N814r81j8809j4680l652J2377O236J2906J0209r48o495p819
$$ plain form
15527 -38476 -20499 -19510 -13945 -14744 -16034 -39023 -23039 -1173 20951 14464 -1660 -15999 -21684
15514 -21684 -29619 -50334 -56921 -32487 -16475 -25999 -52532 -25760 -9990 -5598 -17724 8088
15502 8088 -14797 -26645 -33758 -31855 -22241 -15693 -24163 -48702 -63081 -63874 -31781 -11220 -28536
15489 -28536 -23256 -9449 8906 37924 33465 921 -21542 -12853 -4578 25184 7759 -16089
15477 -16089 1709 17870 16608 -1378 -15067 -10466 -29373 -32109 -16427 -37084 -36759 -17350 -10004
15464 -10004 -3196 -24952 -44437 -42643 -21264 -29404 -33556 -46944 -41846 -53128 -42156 -7203 29270
15451 29270 14363 -4926 4952 -16224 -2668 23149 7725 -1588 -5123 -1279 -15957 -23233 -30709
15438 -30709 -13010 -7196 -8177 -26986 -41666 -45318 -32941 -26705 -13799 -3590 -4538 -11033 -18852
15425a8852N517K7598j2699j2510q167k5647n760P877r099l0463L780J5162n991
15412f9254K0878K1758J9296k1887j1878J1531J2501K1228J537k8343L901r077
15400b7809l4014q091K932L7659K6464J4171j4382N042r542j7765J5303M91J6877
15387G336n094J1483k2107q176J7620J7910m835k0201j0801J643m0770j2350J9688
15374d8654J5863J2354J4004R129p016k4043r532k464J5969J8841L4417Q224m4573
15361g481n2484j5189K1475J7231q609L485L0581K2089M310L611m6023j587J4916
15348a3675k2487o600j11J0015q800j1436J0141R326J5831J4200J4081L93J1011
15335B1889k1046j2522J0032j2460k1355m901J5640K307J5829K1708l073r040
$$ plain form
15425 -18852 -13335 14263 1564 -10946 -19113 -44760 -50520 -42643 -51742 -82205 -78425 -63263 -69254
15412 -69254 -48376 -26618 -7322 -29209 -41087 -29556 -17055 4173 5710 -22633 -18732 -27809
15400 -27809 -61823 -69914 -66982 -29323 -2859 11312 -3070 1972 -7570 -25335 -10032 -9541 7336
15387 7336 2242 13725 -8382 -16558 1062 18972 14137 -6064 -16865 -15222 -55992 -68342 -48654
15374 -48654 -32791 -20437 -6433 2696 -4320 -28363 -37895 -40359 -24390 -5549 28868 37092 -7481
15361 -7481 -59965 -75154 -53679 -36448 -45057 -41572 -10991 11098 15408 19019 -27004 -28591 -13675
15348 -13675 -36162 -42762 -42873 -32858 -41658 -53094 -42953 -33627 -17796 -3596 10485 10878 21889
15335 21889 843 -11679 -1647 -14107 -35462 -40363 -24723 -22416 -6587 15121 12048 3008
15323C008j0512q874j4952J2902k89J473J0009J0552J9349j8013l4592J2704O189
15310a1046J1569O531J2660N276k1035j2495J3268K817k6813J0429K0355m784
15298F732p001k3326j9338J2794J4075L3k837j0662J3662K3053R564n099r521
15285B129L119J2694k3834j1907p836k367K525p74J6807J6695n284j6364J441
15272a2956J7612K1660j7375j2278j5299P32q594P564j32q507l179k1620R606
15259d2766K2314L0997j6602j8047P646r982j7488m744k62N300j7623j5957L2678
15246d4536P495P342N053k1103j4931M5610K2990l629j700m571J3394q106p045
15233c737k0266j8663K237L6213m01j9958m095M108J5265n246P970p636l7205
$$ plain form
15323 3008 -7504 -16378 -31330 -18428 -18717 -17244 -7235 3317 22666 4653 -29939 -17235 -11046
15310 -11046 523 7054 19714 24990 3955 -8540 4728 7545 -19268 -8839 11516 6732
15298 6732 -269 -23595 -42933 -30139 -16064 -16031 -18868 -29530 -15868 7185 16749 11650 2129
15285 2129 5248 17942 -5892 -17799 -25635 -28002 -25477 -26251 -9444 7251 1967 -14397 -12956
15272 -12956 4656 26316 8941 -3337 -18636 -17904 -26498 -18934 -19066 -27573 -30752 -52372 -42766
15259 -42766 -20452 10545 -6057 -24104 -16458 -26440 -43928 -48672 -48934 -43634 -61257 -77214 -44536
15246 -44536 -37041 -29699 -24646 -45749 -60680 -15070 7920 4291 2591 -1980 11414 3308 -3737
15233 -3737 -24003 -42666 -40429 -4216 -4617 -24575 -28670 -24562 -9297 -14543 -6573 -14209 -51414
15220e1414q227O057N469j264J3194j952l21J44K0950J5614q19N775k7807m7210
15206g1811j1583J4899K3220M445q716M746J3643j9144L7206K5939J9040r263
15194B2621r844J1380k0712l6596k3909k014L4434K3323j8166J9135L0181K0384
15182E0217j3009k1389j4267K7370K9968K175J0256M6041K7280J0747j5678k9017
15170A10694l5986j4880l217j0256k18Q878J025J6282J6757j9214j9778j1219
15158C8868o498J3824K8408K4733j4869m716k1493l3805o879J4456M3931L7102
15146A13062m723K3447k821k5443M842m4284l1760J9366K0821L0594M5108J6680
15134A64889R946K0580q149j5814n6914l9845j4632J2832J3127K4291K1419L7505
$$ plain form
15220 -51414 -59641 -53584 -48115 -49379 -36185 -38137 -38458 -38314 -17364 -1750 -2569 3206 -24601 -71811
15206 -71811 -83394 -68495 -45275 -40830 -49546 -44800 -31157 -50301 -13095 12844 31884 22621
15194 22621 12777 24157 3445 -33151 -57060 -59074 -24640 -1317 -19483 -348 29833 50217
15182 50217 37208 15819 1552 28922 58890 61065 71321 117362 144642 155389 139711 110694
15170 110694 74708 59828 56611 46355 46137 55015 56040 72322 89079 69865 50087 38868
15158 38868 32370 46194 74602 99335 84466 79750 58257 24452 17573 32029 75960 113062
15146 113062 108339 131786 128965 103522 108364 64080 32320 51686 72507 103101 148209 164889
15134 164889 174835 195415 187266 171452 114538 74693 60061 72893 86020 110311 131730 169235
15122A69235o024m5656n4148m1906m4004j9369K0002K868L895J6219R436J9178
15110B9726q24k5319j171j8901m381K344L0708K8059J5828j7271J2348R991m790
15097E6347Q867l0086m355k5994j5969J4787J5303N191K1842J9387j9332m2983
15085C005k4577J027j0372o84r241J1157J0053J7809K2157j473N006k569k3468
15072b170j490M938m090O518K3966R129j3782K0720r415l48j3808j7160k2030
15059a9022j5203Q456L0109Q170J1716N506Q673j1393j1547J1043L550J1014k2418
15046A8654k0446m175k7188K2954K853p845j8822K6812O096R607j8319r321N971
15033a3169j9113J309P096K191O356J5923L067O917R564k2439J4859K2360j4046
$$ plain form
15122 169235 163211 117555 63407 21501 -22503 -41872 -21870 -19002 -15107 1112 10548 29726
15110 29726 28902 3583 2412 -16489 -20870 -18526 12182 40241 56069 38798 51146 61137 56347
15097 56347 65214 35128 30773 4779 -11190 3597 18900 24091 45933 65320 45988 3005
15085 3005 -21572 -20545 -30917 -31601 -40842 -29685 -19632 -1823 20334 18861 23867 21298 -2170
15072 -2170 -3660 1278 -2812 3706 27672 36801 23019 43739 34324 33976 20168 3008 -19022
15059 -19022 -34225 -25769 4340 12510 24226 29732 38405 27012 15465 26508 30058 41072 18654
15046 18654 -1792 -5967 -33155 -10201 -7348 -15193 -34015 -7203 -1107 8500 -9819 -19140 -13169
15033 -13169 -32282 -30973 -23877 -21686 -15330 593 3660 10577 20141 -2298 12561 34921 20875
15020B0875l0306j7438K2168j397k3560m0883k4852K4469L7852J7725n13Q992
15008f868l399J886J059l3897r118K1579J1714J844J608j5981l8603k9429n585
14995a03190L3064K9945k8879j1383J2005M081k2954J4707K8264J4879q446j9058
14983e6965J7398K0241n066j1385r656l7696J8257M3660J7189q565n111j9726
14971c7425r942L876Q05K2785L1633J873L676k3939j9998N915j864n821K7984
14958d42M1212k7130k9472J2410J9374r259j8308k0191Q047l151k455J7444K9944
14945A8023k852l0558p311J6897n7m900J7888o289k2r999j5342k4671j149J7440
14931c2902n162L0560J6629j6310j1309p590n235Q566J5891J8361j0411p538L3780
$$ plain form
15020 20875 -9431 -26869 -4701 -6098 -29658 -70541 -95393 -70924 -33072 -15347 -15860 -6868
15008 -6868 -10267 -8381 -7322 -41219 -50337 -28758 -17044 -15200 -13592 -29573 -68176 -97605 -103190
14995 -103190 -70126 -40181 -69060 -80443 -68438 -64357 -87311 -72604 -44340 -29461 -37907 -56965
14983 -56965 -39567 -19326 -24392 -35777 -45433 -83129 -64872 -21212 -4023 -12588 -17699 -37425
14971 -37425 -47367 -43491 -42686 -19901 11732 13605 17281 -6658 -26656 -20741 -22605 -28426 -442
14958 -442 40770 13640 -15832 -3422 15952 6693 -11615 -31806 -23759 -26910 -29365 -11921 18023
14945 18023 15171 -15387 -22698 -5801 -5858 -10758 7130 841 819 -9180 -24522 -49193 -50342 -32902
14931 -32902 -38064 -7504 9125 -7185 -18494 -26084 -31319 -22753 -6862 11499 1088 -6450 27330
14918B7330P227k8874K863K0229M2229J6080K0676J7413m98j5417j7763k4240
14906F7255k6858j3207K0791L5832R733O862J9954J2679k1781n1818l6724q145
14894A4573k134m774l4027j2919K004J8574J8378K688r247J0583K6389K4658p723
14881D7023l5503j3800o108J2565n639j0061J1433j6720j3831J4137J3460l83
14869c427j3175J9716m055J0049K5616p859l4302k210r495o024K5661j291j0457
14856a1253j1388J3265m148p238K6577Q424O57N288N651j4201q855r267p858j9922
14842c4268P446K2614Q814j8950k1681P423J0466j2487q645j5161k3276J8672
14830e9033Q97m933P08l792l305M6161L8900J9260j6715j9480r926R194l1267
$$ plain form
14918 27330 34557 5683 8546 28775 71004 87084 107760 125173 124675 109258 91495 67255
14906 67255 40397 27190 47981 83813 93546 100408 120362 133041 111260 59442 22718 14573
14894 14573 12439 7665 -26362 -39281 -37277 -18703 -325 2363 -6884 3699 30088 54746 47023
14881 47023 11520 -2280 -8388 4177 -1462 -11523 -90 -16810 -30641 -16504 -3044 -3427
14869 -3427 -16602 3114 -941 9108 34724 26865 -7437 -9647 -19142 -25166 495 -796 -11253
14856 -11253 -22641 -9376 -13524 -20762 5815 14239 14896 20184 25835 11634 2779 -6488 -14346 -34268
14842 -34268 -26822 -4208 4606 -14344 -36025 -28602 -18136 -30623 -39268 -54429 -77705 -59033
14830 -59033 -58136 -63069 -62361 -66153 -69458 -23297 15603 34863 18148 -1332 -11258 -2064 -33331
14817c3331r585N664Q919k79J0008r920K633O397k249j6408L0499N542j747l3444
14803c7301j549K7877K5410k6617m988n655j5457j9583R460P545K5045Q557J1849
14790D593K5771K1096J3321l809J7943J6101K8826M7275J5513j4117j8024J7289
14778A71778o126K5105K0119k6113k8080k0395j1809L786K4638J4607j7450m3080
14766A06980M1344N811j5600l8974l7265Q474Q149K60l1726k9674j7839k8995
14754b9055n225j3656J2791J411k6k5040Q965J9402J55K5900L0305k4056j7541
14741a5670J2366Q87j4000j0280J8307j3581j4390K929J0159l0699P393J3262
14729c3317j530N659J529N932J4405J8818L407k5098m581J18l5462j6394J8950
$$ plain form
14817 -33331 -42916 -37252 -28333 -28612 -18604 -28524 -25891 -19494 -21743 -38151 -7652 -2110 -3857 -37301
14803 -37301 -38850 -10973 14437 -12180 -17168 -22823 -38280 -57863 -48403 -40858 -15813 -7256 4593
14790 4593 30364 51460 64781 60972 78915 95016 123842 171117 186630 172513 154489 171778
14778 171778 165652 190757 210876 184763 156683 136288 124479 128265 152903 167510 150060 106980
14766 106980 148324 154135 138535 99561 62296 70770 78919 79179 47453 17779 -60 -29055
14754 -29055 -34280 -47936 -35145 -33734 -33760 -58800 -49835 -30433 -30278 -4378 25927 1871 -15670
14741 -15670 -3304 -2417 -16417 -26697 -8390 -21971 -36361 -33432 -23273 -53972 -46579 -33317
14729 -33317 -34847 -29188 -27659 -21727 -7322 11496 14903 -10195 -14776 -14658 -50120 -66514 -47564
14716d7564J8993k1582k0576j0577L2890K9639j4695j7630L845m300Q625k655
14704d5587l559J6242k1068Q145J3361R029j0272l411Q566L0359J4904K1882j50
14691C8441j9964k0649j0789n258O279k500J1577k6724q353K9056J3477K0598
14679B5191J9403j9593k4341J623l529l08J9730Q350j2046j8895j3826J5909k6330
14666b8662k373P438k762j4K0549j616j3664J5052K1790m557N929J3355J1524
14653D1989K324j3835j7347j3361j7071R574p359l1798p83R072L572n947Q330
14640c2640N701J976q119L977m41r595J0639K7916N283M45j3676j4024k8482l469
14626e4509J4283K8254L757j3189N016K8146J5421k4226k1017P460j1582q806
$$ plain form
14716 -47564 -28571 -50153 -70729 -81306 -48416 -18777 -33472 -51102 -47257 -51557 -42932 -45587
14704 -45587 -49146 -32904 -53972 -45827 -32466 -23437 -33709 -37120 -28554 1805 16709 38591 38441
14691 38441 18477 -2172 -12961 -18219 -11940 -14440 -2863 -29587 -37940 -8884 4593 25191
14679 25191 44594 25001 660 2283 -1246 -1554 18176 26526 14480 -4415 -18241 -2332 -28662
14666 -28662 -31035 -23597 -26359 -26373 -5824 -7440 -21104 -6052 15738 11181 17110 30465 41989
14653 41989 44313 30478 13131 -230 -17301 -7727 -15086 -46884 -47667 -38595 -35023 -40970 -32640
14640 -32640 -26939 -24963 -33082 -29105 -29546 -39141 -28502 -586 4697 5142 -8534 -22558 -51040 -54509
14626 -54509 -40226 -11972 -8215 -21404 -16388 11758 27179 2953 -18064 -10604 -22186 -30992
14614c0992K756j7172j9339l697J7807K5356J9557L4371J5950o643l9188J3728
14602A2494R410m7510j5989l117K0834J3540P34Q795k7495k141n522O424L7931
14589H388k3332k6971J4259J6992m197j314q600l7881j14P791J031K4021j60J1117
14575a8970m222l076k0575P714q406J4700l408j8125K0011R686k3480J5610K3939
14562h602K1281k4063L690J3044K330l2540j9710Q775N674j4036k1733m768M0074
14549c0584L5438j5180J8025L5333P546j0699k3086j3013J2238j49L632j270O645
14536B4876j4730m964r676m332J2845J7440k316j0710R395Q073j3171Q855K660
14523B4245j9818J5127J6376j1618k0071j1518j6964j3506P262J6266q150k223
$$ plain form
14614 -30992 -28236 -45408 -64747 -68444 -50637 -25281 -5724 28647 44597 37954 -1234 12494
14602 12494 21904 -25606 -41595 -44712 -23878 -10338 -9604 -809 -28304 -30445 -35967 -29543 8388
14589 8388 -14944 -41915 -27656 -10664 -14861 -16175 -24775 -62656 -62770 -54979 -53948 -29927 -30087 -18970
14575 -18970 -23192 -26268 -46843 -39129 -47535 -32835 -36243 -54368 -34357 -24671 -48151 -32541 -8602
14562 -8602 12679 -11384 -7694 5350 7680 -24860 -44570 -35795 -30121 -44157 -65890 -70658 -30584
14549 -30584 4854 -10326 7699 43032 50578 39879 16793 3780 16018 15869 19501 18231 24876
14536 24876 10146 5182 -4494 -8826 4019 21459 19143 8433 17828 25901 12730 21585 24245
14523 24245 4427 19554 35930 24312 4241 -7277 -24241 -37747 -30485 -14219 -22369 -24592
14511b4592j3160m86J7906N558K2485j1323j5480M230O210K759j2333J798r078
14498b5506N885L0604J0709j8378m589m024j1762j3148k2077J2574J2738N187
14486b1787O837j256j341L701l0475q69K6243J922M914l151j6625j2466J4722
14473b9631K2220K3471j867N192p421Q251L048k162j275j4685j5772j7628k9809
14460e8068l892K956r22K1316K7250R733q248j1085k3662L404k957K4147K3887
14447C859M131k6910J2253n530L0712m742j3429o462J7641k2125n275o739k868
14434b5484J8209o650k6298r398J2531K4823n60J2753L969K3969L0617j3279l7802
14421G400j0318p945m3328m77J1468J0998n30P139K524K0150J2150K2277k429
$$ plain form
14511 -24592 -37752 -38238 -20332 -14774 7711 -3612 -19092 -14862 -8652 -5893 -18226 -16428 -25506
14498 -25506 -19621 10983 21692 3314 -1275 -5299 -17061 -30209 -52286 -39712 -26974 -21787
14486 -21787 -14950 -16206 -17547 -13846 -44321 -45190 -18947 -17025 -12111 -15262 -31887 -44353 -29631
14473 -29631 -7411 16060 14193 19385 11964 20215 23263 21101 19826 5141 -10631 -28259 -58068
14460 -58068 -61960 -59004 -59926 -38610 -11360 -1627 -9875 -20960 -44622 -41218 -44175 -20028 3859
14447 3859 7990 -18920 -6667 -12197 18515 13773 344 -6118 11523 -10602 -15877 -22616 -25484
14434 -25484 -7275 -13925 -40223 -49621 -37090 -12267 -12827 -74 3895 27864 58481 45202 7400
14421 7400 -2918 -10863 -54191 -54668 -43200 -32202 -32732 -25593 -23069 -2919 9231 31508 29079
14408B9079m1077r268J0693j6160j9637n731K1731N755k862p311J7968K713m00
14395a4507K1901L7462J6283j7192l9553j2966M27Q876K2924K0345j354j1667
14383C0979j7110k6365l492j0368J8657J5961K7145j4705M990K4580k6586m4139
14371b0453J7164J957k1489j3740J0636J2545j4040k7357M597J4486N921K1897
14359g876K886j9289J3041L085L36j3671J4075J6140j8958m264j566J0076l2603
14346c8588j3503K755J9315K577m65r748j3389L7873M3517r764L403N907m675
14333B5215k635K0711k8736l4128j5536J9267j0965o943J9346K5616j7059m303
14321a0150k850M809R957j5291k3284N565N635N865j3549J7641M4101j0420l3268
$$ plain form
14408 29079 -11998 -21266 -10573 -26733 -46370 -52101 -30370 -24615 -27477 -34788 -16820 -14107 -14507
14395 -14507 7394 44856 61139 43947 4394 -8572 -8145 731 23655 44000 42646 30979
14383 30979 13869 -12496 -15988 -26356 -7699 8262 35407 20702 25692 50272 23686 -20453
14371 -20453 -3289 -1332 -22821 -36561 -25925 -13380 -27420 -54777 -50180 -35694 -29773 -7876
14359 -7876 -4990 -24279 -11238 -8153 -7817 -21488 -7413 8727 -10231 -14495 -16061 -5985 -38588
14346 -38588 -52091 -49336 -30021 -27444 -27909 -37657 -51046 -13173 30344 20580 23983 29890 25215
14333 25215 22580 43291 14555 -19573 -35109 -15842 -26807 -33750 -14404 11212 -5847 -10150
14321 -10150 -13000 -8191 1766 -13525 -36809 -31244 -25609 -19744 -33293 -15652 28449 18029 -15239
14308a5239j6190M66L87m387n001l1282J8863K7431J4163j1862j180p096K7671
14295c256L6171L750n556n667K586J8269J1835m0384l9097Q297n675j3682J7313
14282a5096J9025L012l666q087k0640k6433q62j2289J1123J6699r680L301O044
14269c7549J7960M7J2770K920l85Q031J5842J8788j8381K4175R811l725k7523
14256B2781j5046M134J9280K3553K1222j7129k6010q617L850M635Q57L2356K9748
14243I5614q841k1063J7697J7313J4619J3316M9194M1751M5681L1849j0912N500
14231B91718j643l876L0826m384k7524m882m862n109l3681j6354L0311M9720J677
14218C01937K4197M8746R833k2828R104j4248m5526k1079m2060n8235j6881l7808
$$ plain form
14308 -15239 -31429 -30963 -30576 -34963 -39964 -71246 -52383 -24952 -10789 -22651 -23831 -30927 -3256
14295 -3256 32915 36665 31109 25442 28028 46297 58132 17748 -21349 -13052 -18727 -32409 -15096
14282 -15096 3929 6941 3275 -4812 -25452 -51885 -52747 -65036 -53913 -37214 -46894 -43593 -37549
14269 -37549 -19589 -19542 -6772 -3852 -4237 3794 19636 38424 20043 44218 54029 50304 22781
14256 22781 7735 11869 31149 54702 75924 58795 32785 24168 28018 32653 33510 65866 95614
14243 95614 86773 65710 83407 100720 115339 128655 177849 219600 265281 297130 286218 291718
14231 291718 290075 286199 317025 312641 285117 280235 275373 270264 236583 220229 250540 300260 301937
14218 301937 326134 374880 384713 361885 370989 356741 311215 290136 248076 189841 172960 135152
14206A35152k4923l1583l2672n201n260j3218k0219J7983J090J4056j3133k3833
14194a761J5118J488n726J1647L9763n128k4736j9881J131k3711k0311p897M2168
14181B164L5322J1855p848o126j2217j8733j0786Q423j0503K362j1235j8051J4745
14168b0628p136j2246K7417J3166P587J9974k7501m326J9796L705J2485m673j8741
14155H879j3462J764K431q003k168j0203Q472j8641J2673K5074K5608J398k7580
14142F242j1812J2425O289J3249j394k0205l9343k3889M1345K4322m221K5323
14130B8331r687l1726j8623m307K1917j4914o929o91J2610J4059j4285n37K2126
14117b656N139k2510m019J8895O420j0117j9873P577j2929Q834N283J2288M351
$$ plain form
14206 135152 110229 78646 45974 40773 35513 22295 2076 20059 21149 35205 22072 -1761
14194 -1761 13357 14845 9119 20766 60529 55401 30665 10784 11915 -11796 -32107 -40004 2164
14181 2164 37486 49341 41493 35367 23150 4417 -6369 2054 -8449 -6087 -17322 -35373 -20628
14168 -20628 -27764 -40010 -12593 573 8160 28134 633 -3693 16103 19808 32293 27620 8879
14155 8879 -4583 -2819 -388 -8391 -10559 -20762 -12290 -30931 -18258 6816 32424 33822 6242
14142 6242 -5570 6855 13144 26393 24999 4794 -34549 -58438 -17093 7229 3008 28331
14130 28331 18644 -13082 -31705 -36012 -14095 -29009 -35938 -36629 -24019 -9960 -24245 -24782 -2656
14117 -2656 2483 -20027 -24046 -5151 1269 -8848 -28721 -21144 -34073 -25239 -19956 -7668 -3317
14104c317L212N966j0960M3227M420j7570j8356J6378k951K714p685l175J4903
14091B6806r005L394N310j8780M745J9147k3815l1508P326K7161m898O466J4220
14078B6569J9614L4636j3735m1585k8951j1815P257M019L764L491o073L1921Q664
14065C7776l941j0207m578N775M861r9k298J9241j9075Q92l676r085j3933l6401
14051c4748J2866L7j1588p89J1740j5635m247k272M0691J8491K491k7370q70j2531
14037b3734O418K4417P318j32l1171L474j663l5111O572M0544J0541n285j1544
14024i356j2548K0356M461N804J9928p872K0873L905J7086J8849O831j6047m32
14011G1838k1636m5410O965J9010m493J0034K1874j8458Q787j2041l2303L04j2276
$$ plain form
14104 -3317 -105 5861 -5099 38128 42548 24978 6622 23000 20049 22763 15078 11903 26806
14091 26806 17801 21195 26505 7725 12470 31617 7802 -23706 -16380 10781 5883 12349 26569
14078 26569 46183 80819 67084 25499 -3452 -15267 -8010 -3991 -227 3264 -2809 29112 37776
14065 37776 33835 23628 19050 24825 29686 29587 27289 46530 27455 28347 24671 15586 1653 -34748
14051 -34748 -21882 -21845 -33433 -34222 -22482 -38117 -42364 -44636 -3945 14546 17037 -10333 -11203 -23734
14037 -23734 -17316 7101 14419 14287 -16884 -13410 -15073 -50184 -43612 -3068 7473 2188 -9356
14024 -9356 -21904 -1548 2913 8717 28645 20773 41646 45551 62637 81486 88317 72270 71838
14011 71838 50202 4792 11757 30767 26274 36308 58182 39724 48511 36470 4167 4471 -7805
13998g805P524K8131J9227j328j730O288M523j7479j3681r195Q175O289N501J9604
13984E4044O48q792l279l524J3569l825M028L134O360r993K310K1518j3889l1188
13970C1121q157l7185J7214K7308p673k5388l546J8514R093M320j0379o828P350
13957A5764J891o310K432J0187M062j0861k548K444j2017j659J2383r479k7734
13944b1445o050K7189L1175k3135l0921n772J9656J8175n248p108Q973R974R663
13931B5126M2366J9747r354k7519m1231j6286J7947K5025L76k0426J514J6893
13919C4178K2224P874j5632l7814j8333l0449j4768j516J1665R82R688L147k20
13906b8974K2680k8598n574o881N793N9184J1829m324K8445J7899o077j7109k6800
$$ plain form
13998 -7805 -281 27850 47077 45749 44019 50307 54830 37351 23670 14475 22650 28939 34440 54044
13984 54044 54692 45900 42621 39097 52666 48841 52869 56003 62363 52370 54680 76198 62309 31121
13970 31121 22964 -14221 2993 30301 22628 -2760 -6306 12208 21301 25621 15242 8414 15764
13957 15764 17655 11345 13777 23964 28026 17165 14617 17061 5044 3385 15768 6289 -21445
13944 -21445 -27495 -306 30869 7734 -23187 -28959 -9303 8872 3624 -3484 5489 15463 25126
13931 25126 67492 87239 77885 50366 9135 -7151 10796 35821 36197 15771 17285 34178
13919 34178 56402 64276 48644 10830 -7503 -37952 -52720 -54236 -42571 -41589 -31901 -28754 -28974
13906 -28974 -6294 -34892 -40466 -47347 -41554 17630 29459 25135 53580 71479 65402 48293 21493
13893B1493j1072q22j8739R801J293p89J619Q80P581k0563J194M3743L1635k234
13879F5020j5675q101m252j0272l813P331j3736j516o038q252n298r708p387L4599
13865A2902K3858o619l1074j8493K962j1729J2107K3824L35K830O242l9229j6885
13852c8969J361Q613J8494j422l038P577L2639M709r835j5959j7233J091K7197
13839A5225L2853p344k6347j4019M686K0464j1320j7496j1793p917k520K050J4725
13826h753M5150J617l3755n950L8205Q754o704n600j9982O466K1890J4357L09
13813E6004p174j6097k7106l2217J395J3985K2036j4833m0946j1689K4286p499
13801c9855Q6K2499K4831o233k9372q718M079J1252R90L0724K1615j3819m1463
$$ plain form
13893 21493 10421 9599 -9140 661 1954 1165 2784 3664 11245 -9318 -8124 35619 67254 65020
13879 65020 49345 41244 36992 26720 22907 30238 16502 14986 8948 696 -4602 -14310 -21697 12902
13865 12902 36760 30141 -933 -19426 -16464 -28193 -16086 7738 8073 10903 17145 -22084 -38969
13852 -38969 -37608 -28995 -10501 -11923 -14961 -7384 25255 29964 20129 4170 -13063 -11972 15225
13839 15225 48078 40734 14387 368 5054 25518 14198 -3298 -15091 -23008 -25528 -23478 -8753
13826 -8753 36397 38014 4259 -1691 36514 45268 38564 32964 12982 19448 41338 55695 56004
13813 56004 48830 32733 5627 -26590 -25195 -11210 10826 -4007 -44953 -56642 -32356 -39855
13801 -39855 -39769 -17270 7561 1328 -28044 -36762 -32683 -21431 -20441 10283 31898 18079 -23384
13788b3384J3564K6518k63J4144j8267k9395L3810K9736m590m3881j1891J8287
13776D388k710P033j4555J518J5178K953k3756j889K5160n38P095R183k0082j3594
13762d616q225O141L5865K4178j9318j2926n612j060M09l5519k2009J5557L9058
13749A1923L4451K765k0910R203J331K5579J5073j3268m2640m3930l042L1870
13737H405J586l2203J2806P177j3816J5800O075l834k4978K5746Q641J302J7079
13724B9786R456L0230Q501j9856J921j8530j610j4902r285K2420L6066L620m725
13711G3092j9722k7832O759M0581N740k4573j1666k1760m1664j3399m675J1350
13699b7769K5639J1664J8736j9040k2354K6310J3752k558j9946j5325j0605R372
$$ plain form
13788 -23384 -9820 16698 16435 30579 12312 -17083 16727 46463 41873 -2008 -13899 4388
13776 4388 1678 8711 -5844 -4326 10852 13805 -9951 -11840 13320 12782 19877 29060 8978 -4616
13762 -4616 -12841 -6700 29165 53343 34025 21099 15487 14427 14836 -20683 -42692 -27135 11923
13749 11923 46374 49139 28229 37432 38763 64342 79415 66147 23507 -20423 -23465 8405
13737 8405 9991 -22212 -9406 -2229 -16045 -245 5830 1996 -22982 2764 11405 12707 29786
13724 29786 39242 69472 77973 58117 60038 41508 39898 24996 15711 38131 74197 77817 73092
13711 73092 53370 25538 32297 72878 78618 54045 42379 20619 -21045 -34444 -39119 -27769
13699 -27769 -2130 9534 28270 9230 -13124 13186 26938 24380 4434 -10891 -21496 -12124
13687a2124K3385L3450k2892k5160O026j4562r9L7842K549o899L983r967J7790
13674C3322J8782j7686k333K1642j95Q893J7960p305j1642P271k2664J4559J2820
13661G3424r853M828k6229K3606K4171k0208j9278J8704N011k5396M352L66J3887
13648F7385L5141K5796M278k8987l9089k569j1136j4093K1254J3414j8851j2217
13636D0326n403p732L8359L0595L4460M1612J9856m1332o7415l2695l238r900
13624C7493L4814J094l0901J2770K6501k74Q288j07j4855k6569K616n303J0185
13611E5752K0678j9175k2587J6070j661O563P590M3766J8378j2183l7399k0765
13599E5027J0013L7009L716k366k2311j6113J9073L4773J183k7911K765J8629
$$ plain form
13687 -12124 11261 44711 21819 -3341 2685 -11877 -11976 25866 28415 21516 25499 15532 33322
13674 33322 52104 34418 32085 53727 53532 62425 80385 73080 61438 68709 46045 60604 73424
13661 73424 63571 68399 42170 65776 89947 69739 50461 69165 74176 48780 53132 53498 67385
13648 67385 102526 128322 132600 103613 64524 61955 50819 36726 57980 71394 52543 40326
13636 40326 34923 27191 65550 96145 130605 172217 192073 150741 83326 50631 47393 37493
13624 37493 72307 73401 42500 55270 81771 81497 89785 89678 74823 48254 50870 45567 55752
13611 55752 76430 57255 34668 50738 49077 55640 63230 106996 125374 113191 75792 55027
13599 55027 65040 102049 105765 103399 81088 64975 84048 118821 120004 92093 94858 113487
13587A13487J8971J8388M934R481J7112J2984J9393j679k7293R917L8003R274
13575B42972J8173K1962P174r815r408L2261N8570L9145O6448R1530P7685R2108
13563G28805J06675R4004J23444J26223J89708K99411M62191O77914J049541J541835
13553E399751J944330J716634P10950p31004j756926j963635j617874j092112
13545B610114o75641m22728k92936j94437j30104r4652o8788m1632l9333m1734
13535F08129k0888q086P526j5109j0700K4870L4493J7443N0355Q9039P5934J07850
13523I60856J38941J26157J33571J75199J95068K41541L01843L93990M94083O98245
13513C859494J090507J807674K779228L821347M291293L058375M8482l082647
$$ plain form
13587 113487 132458 150846 155780 165261 182373 195357 214750 213071 185778 195695 233698 242972
13575 242972 261145 283107 290281 280466 271058 303319 361889 401034 467482 559012 636697 728805
13563 728805 835480 929484 1052928 1179151 1368859 1668270 2130461 2808375 3857916 5399751
13553 5399751 7344081 9060715 9771665 9040661 7283735 5320100 3702226 2610114
13545 2610114 1934473 1511745 1218809 1024372 894268 799616 730828 689196 649863 608129
13535 608129 587241 579155 586681 571572 560872 585742 620235 637678 688033 777072 853006 960856
13523 960856 1099797 1225954 1359525 1534724 1729792 1971333 2273176 2667166 3161249 3859494
13513 3859494 4950001 6757675 9536903 13358250 17649543 20707918 20756400 17673753
13505A7673753m577105m181054k955738j826260j111157o90362m48826k96358
13497A586893j99909j61507j65552j48491j41519q9229k4127j337k6073j7696
13487F11453n5871k9162L3236R830R998K7168L1170K5694K7569O8813Q4509Q5527
13475I29934J06688J44230J75862K23598L03853N13472P91576J236851J748649
13466F174713K047579J751204N75976r90149k026951k146367j696842j138146
13458B551017p12090m41143k56200j65261j61307j32353j19944j33245p2312m6044
13448C11118k7531j3905j6742k3114m5335n2601l0904N706K0767R224j0258j4196
13436A12229j81P059M740N379m003o048Q273J2987L900m1324k9159J5111K6965
$$ plain form
13505 17673753 13096648 8915594 5959856 4133596 3022439 2332077 1883251 1586893
13497 1586893 1386984 1225477 1059925 911434 769915 680686 656559 655222 629149 611453
13487 611453 555582 526420 559656 569486 579484 606652 637822 663516 691085 759898 844407 929934
13475 929934 1036622 1180852 1356714 1580312 1884165 2397637 3189213 4426064 6174713
13466 6174713 8222292 9973496 10549472 9559323 7532372 5386005 3689163 2551017
13458 2551017 1838927 1397784 1141584 976323 815016 682663 562719 429474 357162 311118
13448 311118 283587 269682 252940 229826 184491 131890 100986 106692 127459 136683 126425 112229
13436 112229 112048 119107 123847 129226 125223 119175 127448 140435 144335 103011 73852 88963 115928
13423A15928N795j6471k7986k1772l687m075j1742j6587j1317L3023J7122J4496
13411G2727q27j5339k395k7688K272K4361K2438J271k3478O122J107J4805k452
13398G2924l767J584J7742j1540K908J7320j8354n778j2722J2848o086K8310K2535
13385A17924k79j0654k8354j8716K978j4375l5925j218K971J7270J419M312r003
13372B8350J4048j3323r599O24K9995L6472M51M25O007j4733k7750k7905J7036
13359D0098j100P237O087j1592Q498J4298J3635Q744p20J0328k0081Q598p609
13346G6421j8831J7320q650q160J531j2820J4512J6519J1040J177J2128j797j2457
13333H7933K3875J5916M227O739l1766N372K1701r996j1094k0733k258j6773j0122
$$ plain form
13423 115928 121723 105252 77266 55494 51807 47732 35990 19403 8086 41109 58231 72727
13411 72727 71900 56561 54166 26478 28750 53111 75549 76820 53342 59464 60571 75376 72924
13398 72924 69157 70741 88483 76943 79851 97171 78817 73039 60317 73165 67079 95389 117924
13385 117924 117645 106991 78637 59921 62899 48524 12599 11381 14352 31622 33041 37353 28350
13372 28350 42398 29075 19476 20100 50095 86567 87018 87443 93450 78717 50967 23062 40098
13359 40098 38998 46235 52322 40730 49228 63526 77161 85905 85185 95513 75432 84030 76421
13346 76421 57590 74910 66260 58100 59631 46811 61323 77842 88882 90059 102187 100390 87933
13333 87933 111808 127724 131951 138690 106924 112296 133997 124001 112907 92174 89916 73143 63021
13320F3021J0442J1165P783q164K9449m296l0970N000K9219J9111K7875j2443
13308A47192j1818k989J622J1581j7819k0997P099L4542K9874K0047K2807J4497
13296B35638K308K0434M3893N0431L2769L8009O3399J24144J78990J56258J55639
13285A101912J32579P1776q1651j54890j73501j56316j00113j07927r6189p4627
13275C61053o4956l7397j9791K7014r14k403j0344j3335P540J348J5931K6839
13263B90585l297J9227J2143J9642K3013P00J5354K0217K3988M3874M9709N4429
13251E69584J14787J87524J88724K38116L33743M14550L81196K34308m7258k86163
13241B329111m04934m01291l60241k37696j67450j33140q0677n1903o0958n3546
$$ plain form
13320 63021 73463 84628 92411 84247 113696 109400 78430 83430 112649 131760 159635 147192
13308 147192 135374 132385 134007 145588 127769 106772 113871 148413 178287 198334 221141 235638
13296 235638 237946 258380 302273 352704 385473 423482 486881 611025 790015 946273 1101912
13285 1101912 1234491 1306267 1224616 1069726 896225 739909 639796 531869 435680 361053
13275 361053 296097 258700 238909 265923 265009 262606 252262 238927 246467 247815 263746 290585
13263 290585 287288 306515 318658 338300 361313 362013 377367 397584 421572 465446 515155 569584
13251 569584 684371 871895 1060619 1298735 1632478 2047028 2428224 2662532 2615274 2329111
13241 2329111 1924177 1522886 1162645 924949 757499 624359 543682 491779 430821 377275
13231C77275l5152l521o450k1761k5889j6211J3021J6844J614J5100l6983j2081
13219B65806O936J6377J8367M841m2969j9658J5254M7500O7471P3232J01504J17877
13207F72538J54344J77263J99132J43612P1818n0785k04174k35855j97976j50157
13197E79760j03949q2279m8956m0146k2846l676k0589j8345j9646m2114l4116
13186A43098N807M632Q555K0207l33j1978j9711K723k1014k8253k6494o877o88
13173F9674L2703J8302L523o890J1876o501k385J0415J981J4040K3498K609m2977
13160A29868j3185J7011K3795j4567L117K6836J1057N883k2513N045J2455Mq209
13147A76597l1414Q722r009j1989j4378J795L013K4262Q402M816J838M368o11
$$ plain form
13231 377275 342123 338602 332152 310391 284502 268291 281312 298156 299770 314870 277887 265806
13219 265806 272742 289119 307486 312327 269358 249700 264954 312454 379925 453157 554661 672538
13207 672538 826882 1004145 1203277 1346889 1418707 1367922 1163748 927893 729917 579760
13197 579760 475811 393532 344576 304430 281584 277908 257319 238974 219328 177214 143098
13186 143098 148905 153537 162092 182299 181966 169988 150277 153000 131986 103733 77239 70362 69674
13173 69674 102377 120679 124202 117312 129188 122687 120302 130717 132698 146738 170236 172845 129868
13160 129868 116683 133694 157489 142922 146039 172875 183932 189815 167302 172347 184802 184806 176597
13147 176597 145183 153905 144896 132907 118529 120324 123337 147599 156001 160817 162655 167023 166412
13134A66412k0592l5203J2102N973J7515L1650n190j4978R340L6764L4094R328
13122B47215J9518N991L075J7662J9945R00K739m7677J5606J1100J7046J4031
13110C27151k515m161L398k8989m4344k3896K432K5162l1749l5185r202k1875
13098A56227K705J5569K6782K0411J349K937k3802n674J1053K7571M5862L1538
13086C12528o873m0783J761M8116O3905M5037O187j5611m1144l6343j9138L792
13074C21434l4982j8408J2859K9060J9080J3699P20j1228j3501k630l269l3382
13062B79452j8507j3572J1098J7347K0829N427k5812j6011j1190Q135P693J5949
13050B80838m3281j5925l916j36Q027J1202L4785O439n817n42J7294J3134K364
$$ plain form
13134 166412 145820 110617 122719 128692 146207 177857 172667 157689 167029 203793 237887 247215
13122 247215 266733 272724 275799 293461 313406 314306 317045 269368 284974 296074 313120 327151
13110 327151 324636 320475 323873 294884 250540 226644 229076 254238 222489 187304 178102 156227
13098 156227 158932 174501 201283 221694 223043 225980 202178 196504 207557 235128 280990 312528
13086 312528 305655 264872 266633 314749 378654 423691 429878 414267 373123 336780 317642 321434
13074 321434 286452 268044 280903 309963 329043 342742 343462 332234 318733 316103 312834 279452
13062 279452 260945 247373 258471 275818 296647 302074 276262 260251 249061 257196 264889 280838
13050 280838 237557 221632 217716 217580 225607 236809 271594 278033 272216 271674 288968 302102 304466
13037C04466l6687j9141O686J010l0566k2108j3457L674j3993l4727o221l693
13025A35243L9558L6637Q219k00j5844K0757P062J0539J6632K5767J5707R894
13013C09971j7765l0354j6198k1835l4183m0393m6519r587K2363M1126O314P448
13001A70388m53o292k7126m4045l7666n807Q83k78N948L26L3852O4675N7967J4149
12987B26521J5243j4034k5947j8378K499K5117k647K573J6799K5917K1924L4409
12975C09996Q047J5143L2877J0982j0322K1507p94m3496l0123K6903J8603L9650
12963C98973L7478M8661J7858J9414Q91J5225O206n561j0786m2575l2365O871
12951D60290R6886J17082Q5483N4019L2127J0637m6293m1129O813J5700K880K0151
$$ plain form
13037 304466 267779 248638 255324 256334 225768 203660 190203 193877 179884 145157 138936 135243
13025 135243 174801 211438 219657 219457 203613 224370 231432 241971 258603 284370 300077 309971
13013 309971 292206 261852 245654 223819 189636 149243 102724 93137 115500 156626 162940 170388
13001 170388 169935 163643 136517 92472 54806 48999 49882 49604 55552 55878 89730 154405 212372 226521
12987 226521 241764 227730 201783 183405 185904 211021 208374 210947 227746 253663 275587 309996
12975 309996 318043 333186 366063 377045 366723 388230 387436 343940 313817 340720 359323 398973
12963 398973 436451 485112 502970 522384 523275 538500 544706 539145 528359 485784 453419 460290
12951 460290 557176 674258 759741 813760 845887 856524 810231 769102 775915 791615 794495 814646
12939H14646N2527M6006N0280M4889P0182M3563J4365j1441p84Q378j2448l350
12927A116813k2322K2969L5435L8132N5570J01343R0022Q8904O1030K4812m015
12916A608693o229M4588L019j3568L257L5789N3606P0890N0824M2172N9703M8587
12904B001331N2932m395K3206O2822R5415N4521Q5194J40398J47761J17830N6260
12893B833275L1796J1993K685j9975p328l312K3305O5439M7534M4042J05371J00435
12881C235260J41173J51345J30107J02852J35351J72044J49297J43808J42389
12872D503626J62461J69009J79684K35914K96890L02574L00506L48344L93117
12863F892125M55778M63665N09123N61898O54917P47132Q47973R06669J016010
$$ plain form
12939 814646 867173 913179 963459 1008348 1078530 1122093 1136458 1125017 1124233 1132611 1120163 1116813
12927 1116813 1094491 1117460 1152895 1191027 1246597 1347940 1437962 1526866 1587896 1612708 1608693
12916 1608693 1602464 1647052 1650071 1636503 1639760 1675549 1729155 1800045 1850869 1893041 1952744 2001331
12904 2001331 2054263 2049868 2073074 2135896 2231311 2285832 2371026 2511424 2659185 2777015 2833275
12893 2833275 2865071 2877064 2879749 2859774 2852446 2849134 2872439 2937878 2985412 3029454 3134825 3235260
12881 3235260 3376433 3527778 3657885 3760737 3896088 4068132 4217429 4361237 4503626
12872 4503626 4666087 4835096 5014780 5250694 5547584 5850158 6150664 6499008 6892125
12863 6892125 7347903 7811568 8320691 8882589 9537506 10284638 11132611 12039280 13055290
12854A3055290J201490J373856J623036J869500K084804K283934K506856K921748
12846B8920514L520348M359112N524286P150978R366492J2446980J6843772K2767863
12838A10900345K9795184L5550327L4692903K1723936j679154k4258400l5981421
12831A70743720l6088077k9718812k2106364j5841082j1345900q214326n992247
12824D1436912m316612l003271j999117j336084q62655n85064l47176J0115M06411
12815B9403459Q38604J301843J821227K442461L031970L589979M138643M617445
$$ plain form
12854 13055290 14256780 15630636 17253672 19123172 21207976 23491910 25998766 28920514
12846 28920514 32440862 36799974 42324260 49475238 58841730 71288710 88132482 110900345
12838 110900345 140695529 176245856 210938759 232662695 230983541 206725141 170743720
12831 170743720 134655643 104936831 82830467 66989385 55643485 47429159 41436912
12824 41436912 37120300 34117029 32117912 30781828 29919173 29334109 28986933 28997048 29403459
12815 29403459 30242063 31543906 33365133 35807594 38839564 42429543 46568186 51185631
$$ [...]
##END NTUPLES=NMR SPECTRUM
##END=
