##TITLE=Analysis number 316995
Compound Code cc 41446
Book Reference 467/6
Project Code adrs
Chemist Name benw
##JCAMPDX= 6.0         $$ Bruker NMR JCAMP-DX V2.0
##DATA TYPE= NMR SPECTRUM
##DATA CLASS= NTUPLES
##ORIGIN= Bruker BioSpin GmbH
##OWNER= nmr
$$ XWIN-NMR		Version 3.5
$$ Thu Feb  2 15:34:37 2006 GMT Standard Time (UT+0h)  MAYBRIDGE\nmr@NMR_250MHZ
##.OBSERVE FREQUENCY= 250.131544655141
##.OBSERVE NUCLEUS= ^1H
##.ACQUISITION MODE= SIMULTANEOUS (DQD)
##.ACQUISITION SCHEME= undefined
##.AVERAGES= 16
##.DIGITISER RES= 18
##SPECTROMETER/DATA SYSTEM= dpx250
##.PULSE SEQUENCE= zg30
##.SOLVENT NAME= CDCl3
##.SHIFT REFERENCE= (INTERNAL, CDCl3, 0, 16.522)
##AUDIT TRAIL= $$ (NUMBER, WHEN, WHO, WHERE, WHAT)
$$ ##TITLE= Audit trail, XWIN-NMR		Version 3.5
$$ ##JCAMPDX= 5.01
$$ ##ORIGIN= Bruker BioSpin GmbH
$$ ##OWNER= nmr
$$ C:\u/data/dgb/nmr/ADRS/15570/pdata/1/auditp.txt
$$ ##AUDIT TRAIL=  $$ (NUMBER, WHEN, WHO, WHERE, WHAT)
(   1,<2006-02-02 15:34:17.86 +000>,<MAYBRIDGE\nmr>,<NMR_250MHZ>,
      <created by zg, POWCHK disabled, PULCHK disabled
       configuration hash MD5:
       84 BC 41 DB A1 6E 1D 46 DA 25 12 A5 C1 ED C5 3A
       data hash MD5: 64K
       A9 1B D4 BE 37 E9 72 A6 D2 85 D1 8E 25 61 9C 97>)
(   2,<2006-02-02 15:34:28.70 +000>,<MAYBRIDGE\nmr>,<NMR_250MHZ>,
      <Start of raw data processing
       ef LB = 0.3 FT_mod = 6 PKNL = 1 SI = 32K 
       data hash MD5: 32K
       C3 58 59 68 FE E7 00 74 E6 31 91 5D CF 16 CA A1>)
(   3,<2006-02-02 15:34:30.55 +000>,<MAYBRIDGE\nmr>,<NMR_250MHZ>,
      <apk 
       data hash MD5: 32K
       FA 02 67 02 B4 19 AB 46 21 51 B8 59 27 26 C3 3D>)
(   4,<2006-02-02 15:34:31.36 +000>,<MAYBRIDGE\nmr>,<NMR_250MHZ>,
      <abs ABSG = 5 
       data hash MD5: 32K
       AA 87 F1 C7 31 24 71 E7 C0 72 55 95 91 94 BB A4>)
$$ ##END=
$$ 
$$ hash MD5
$$ 66 A4 CF 24 4C AB 90 5D 33 5E 7E 60 60 89 72 AB
##$RELAX= 
##$RELAX= 
##$RELAX= 
##$RELAX= 
##$RELAX= 
##$RELAX= 
##$RELAX= 
$$ Bruker specific parameters
$$ --------------------------
##$DU= <C:\u>
##$EXPNO= 15570
##$NAME= <ADRS>
##$PROCNO= 1
##$TYPE= <nmr>
##$USER= <dgb>
##$AMP= (0..31)
100 100 100 100 100 100 100 100 100 100 100 100 100 100 100 100 100 100 
100 100 100 100 100 100 100 100 100 100 100 100 100 100 
##$AQSEQ= 0
##$AQ_mod= 3
##$AUNM= <au_zg>
##$AUTOPOS= <34 >
##$BF1= 250.13
##$BF2= 250.13
##$BF3= 250.13
##$BF4= 250.13
##$BF5= 500.13
##$BF6= 500.13
##$BF7= 500.13
##$BF8= 500.13
##$BYTORDA= 1
##$CFDGTYP= 0
##$CFRGTYP= 5
##$CHEMSTR= <none>
##$CNST= (0..31)
1 1 145 1 1 1 1 1 1 1 1 1 1 1 1 1 1 1 1 1 1 1 1 1 1 1 1 1 1 1 1 1 
##$CPDPRG= <>
##$CPDPRG1= <>
##$CPDPRG2= <>
##$CPDPRG3= <>
##$CPDPRG4= <mlev>
##$CPDPRG5= <mlev>
##$CPDPRG6= <mlev>
##$CPDPRG7= <mlev>
##$CPDPRG8= <mlev>
##$CPDPRGB= <>
##$CPDPRGT= <>
##$D= (0..31)
0 1 0 0 0 0 0 0 0 0.06 0 0 0 0 0 0 0.0002 0 0 0 0 0 0 0 0 0 0 0 0 0 0 
0 
##$DATE= 1138894457
##$DBL= (0..7)
120 120 120 120 120 120 120 120 
##$DBP= (0..7)
150 150 150 150 150 150 150 150 
##$DBP07= 0
##$DBPNAM0= <>
##$DBPNAM1= <>
$$ [...]
##$SUBNAM7= <"">
##$SUBNAM8= <"">
##$SUBNAM9= <"">
##$SW= 20.6930455092707
##$SWIBOX= (0..15)
0 0 3 0 0 0 0 0 0 0 0 0 0 0 0 0 
##$SW_h= 5175.983436853
##$TD= 65536
##$TD0= 1
##$TE= 293.16
##$TE2= 300
##$TE3= 300
##$TEG= 300
##$TL= (0..7)
0 120 120 120 120 120 120 120 
##$TP= (0..7)
150 150 150 150 150 150 150 150 
##$TP07= 0
##$TPNAME0= <>
##$TPNAME1= <>
##$TPNAME2= <>
##$TPNAME3= <>
##$TPNAME4= <>
##$TPNAME5= <>
##$TPNAME6= <>
##$TPNAME7= <>
##$TPOAL= (0..7)
0.5 0.5 0.5 0.5 0.5 0.5 0.5 0.5 
##$TPOFFS= (0..7)
0 0 0 0 0 0 0 0 
##$TUNHIN= 0
##$TUNHOUT= 0
##$TUNXOUT= 0
##$USERA1= <user>
##$USERA2= <user>
##$USERA3= <user>
##$USERA4= <user>
##$USERA5= <user>
##$V9= 5
##$VALIST= <valist>
##$VCLIST= <CCCCCCCCCCCCCCC>
##$VD= 0
##$VDLIST= <DDDDDDDDDDDDDDD>
##$VPLIST= <PPPPPPPPPPPPPPP>
##$VTLIST= <TTTTTTTTTTTTTTT>
##$WBST= 1024
##$WBSW= 4
##$XGAIN= (0..3)
0 0 0 0 
##$XL= 0
##$YL= 0
##$YMAX_a= 396136
##$YMIN_a= -364078
##$ZGOPTNS= <>
##$ZL1= 120
##$ZL2= 120
##$ZL3= 120
##$ZL4= 120
##$ABSF1= 16.522
##$ABSF2= -4.171173
##$ABSG= 5
##$ABSL= 3
##$ALPHA= 0
##$AQORDER= 0
##$ASSFAC= 0
##$ASSFACI= 0
##$ASSFACX= 0
##$ASSWID= 0
##$AUNMP= <proc_1d>
##$AZFE= 0.1
##$AZFW= 0.1
##$BCFW= 0
##$BC_mod= 0
##$BYTORDP= 0
##$COROFFS= 0
##$CY= 12.5
##$DATMOD= 1
##$DC= 0
##$DFILT= <>
##$DTYPP= 0
##$F1P= 14.0000005364418
##$F2P= -0.99999901652339
##$FCOR= 0.5
##$FTSIZE= 32768
##$FT_mod= 6
##$GAMMA= 0
##$GB= 0
##$INTBC= 1
##$INTSCL= 1
##$ISEN= 128
##$LB= 0.3
##$LEV0= 0
##$LPBIN= 0
##$MAXI= 10000
##$MC2= 0
##$MEAN= 0
##$ME_mod= 0
##$MI= 0
##$NCOEF= 0
##$NC_proc= -3
##$NLEV= 6
##$NOISF1= 0
##$NOISF2= 0
##$NSP= 0
##$NTH_PI= 0
##$NZP= 0
##$OFFSET= 16.522
##$PC= 1
##$PHC0= -54.49703
##$PHC1= 5.784825
##$PH_mod= 1
##$PKNL= yes
##$PPARMOD= 0
##$PSCAL= 4
##$PSIGN= 0
##$REVERSE= no
##$SF= 250.13
##$SI= 32768
##$SIGF1= 0
##$SIGF2= 0
##$SINO= 400
##$SIOLD= 32768
##$SREGLST= <1H.CDCl3>
##$SSB= 0
##$STSI= 32768
##$STSR= 0
##$SW_p= 5175.98343685301
##$SYMM= 0
##$S_DEV= 0
##$TDeff= 65536
##$TDoff= 0
##$TI= <Analysis number 999999
Compound Code 99
Book Reference 9
Project Code 9>
##$TILT= no
##$TM1= 0
##$TM2= 0
##$TOPLEV= 0
##$USERP1= <user>
##$USERP2= <user>
##$USERP3= <user>
##$USERP4= <user>
##$USERP5= <user>
##$WDW= 1
##$XDIM= 32768
##$YMAX_p= 441572650
##$YMIN_p= -55274
$$ End of Bruker specific parameters
$$ ---------------------------------
##NTUPLES= NMR SPECTRUM
##VAR_NAME=  FREQUENCY,     SPECTRUM/REAL,   SPECTRUM/IMAG
##SYMBOL=    X,             R,               I
##VAR_TYPE=  INDEPENDENT,   DEPENDENT,       DEPENDENT
##VAR_FORM=  AFFN,          ASDF,            ASDF
##VAR_DIM=   32768,         32768,           32768
##UNITS=     HZ,            ARBITRARY UNITS, ARBITRARY UNITS
##FACTOR=    0.157963299565203, 1,           1
##FIRST=     4132.6476996994, 0,             0
##LAST=      -1043.33573715361, 0,           0
##MIN=       -1043.33573715361, -55274,      0
##MAX=       4132.6476996994, 441572650,     0
$$ Real data points
##PAGE= N=1
##DATA TABLE= (X++(R..R)), XYDATA
$$ [...]
21423 -3989 -1070 533 24 -493 -6222 -7151 -5915 -3115 -1488 1865 1409 -3287 -6476 -8924 -5638 -6027
21407 -6027 -2198 4524 9026 4998 2408 3102 -1086 -7366 -9831 -5550 -8349 -13166 -15679 -7522 -7108
21392 -7108 -9867 -3273 -469 -4287 -6017 -5459 154 1271 5115 8571 10286 3388 1338 -1060 -5846
21377 -5846 -7496 -3277 -272 -1734 -2295 -5806 -4614 -4771 -2341 754 4326 5322 5939 6219 6137 1649
21361 1649 -5538 -4003 1837 3652 1062 -743 467 -225 -5982 -7851 -5567 -3013 2464 5996 4583
21346 4583 188 1639 3171 5173 6042 8032 5236 2308 -1629 -4304 -3494 534 6863 6872 1849 -2206
21330 -2206 -748 2042 8959 7175 -955 -2693 -1764 -4304 -3228 1680 3855 1197 2131 1472 -4395
21315 -4395 -6475 -7224 -3778 -7443 -6571 -4137 -2887 -680 -1381 1228 3482 8446 7233 3759 4315 3386
21299 3386 2096 1198 -513 -3324 -4875 -743 6036 3979 1096 900 -4852 -10106 -11227 -9979 -6934
21284 -6934 -1564 1235 -870 2270 1200 2799 2910 2898 3105 2642 -3024 -3372 -5172 -1160 2205 -2614
21268 -2614 -4261 -4674 -4632 -2733 -4556 -5093 -7906 -8203 -10451 -12493 -9699 -7278 -6299 -5998 -5796 -6164 -4252
21251 -4252 -566 -1867 2380 2628 -1437 -5830 -7536 -3718 -1019 -2997 -4549 -6685 -9000 -8968 -7765
21236 -7765 -263 738 -5402 -2967 -235 -7387 -9489 -4766 -241 1782 1057 -2688 -4936 -4636 -2656
21221 -2656 -637 1947 2651 2025 2640 4136 4703 4258 4438 7134 2969 1640 301 -1986 -839 328
21205 328 -1884 -1138 1639 2525 4525 4475 4868 5270 1775 -1118 -365 -939 2858 1203 -141 -2053 -1171
21188 -1171 -1632 -2724 -4896 -5417 -2749 616 2003 2820 2369 4435 -1518 -3995 -2699 -2803 -3882 -3530
21172 -3530 -4272 -3243 2341 498 -2101 -2192 -3809 -1821 989 2052 -3134 -3628 870 4420 3786 -1053
21156 -1053 -3990 -1328 -1118 -4091 -920 853 1883 -1300 660 2628 1930 8107 5413 364 -10097
21141 -10097 -10017 -5793 1436 9451 4651 -1881 -1195 -6657 -1986 1319 6340 7169 7488 7555 1544 -3318
21125 -3318 -4657 -2861 2248 1773 2988 2926 3291 -988 -364 6449 9856 6546 49 -5986 -6031 -7024 -9980
21108 -9980 -6151 913 1176 6330 4541 1792 3631 1128 -4397 -7950 -6818 -7732 -7823 -10708 -12878 -10232
21092 -10232 -12572 -11929 -1787 -3910 -5589 -1382 1022 -984 -4569 -6885 -7200 -4647 -9069 -9224 -6405
21077 -6405 -6247 -2816 2367 4978 4219 3910 698 -1377 -2303 -2040 -1567 -4563 -7110 -4136 -980 -1632
21061 -1632 -1240 -2692 -3920 1186 5091 5671 3910 4272 3113 -1442 1465 3551 2294 1283 12
21046 12 -1604 -178 3244 4204 2868 6173 9918 7274 2468 -510 -5254 -5561 102 96 981 7035 4727
21029 4727 -2 -1907 3291 6084 8 -5118 -6471 -3860 -3953 -1487 -407 -1321 -4487 -9570 -9647 192
21013 192 5235 2826 498 -4259 -8534 -7305 -1258 600 4646 9633 6071 -1697 -9630 -12361 -11244
20998 -11244 -8232 -6132 -5514 -7870 -6274 -11959 -12310 -6849 -7787 -9478 -7706 -7925 -3837 -4418 -4745 -4966
20982 -4966 -3888 -1174 -847 4233 859 -3234 -4450 1369 6408 10012 7663 6233 6440 3317 1508
20967 1508 -2119 -2561 -4447 -8854 -11049 -7833 -4301 238 4337 -792 -2834 -41 4866 4192 -992
20952 -992 -6217 -1912 -826 3239 2465 -872 -3343 -1123 -1471 -5649 -9463 -9053 -8711 -2045 -5649 -1176
20936 -1176 2957 -401 -5768 -6018 -525 3431 1628 -501 -3333 -3966 5534 10801 8898 2814 -1186
20921 -1186 -2114 -2503 244 -1999 -4152 -8258 -10132 -10125 -4479 -4349 -8232 -6110 -5058 -6854 -5884 -4824
20905 -4824 -4590 -3826 -2390 -4360 -1552 -3323 -3830 -7800 -14493 -10972 -6643 -5453 -6370 -1471 -4742 -7705
20889 -7705 -9830 -10682 -7817 -4267 -3666 -6306 -3866 -1867 -186 -1039 246 -5870 -8123 -6849 -5039
20874 -5039 -2106 -1906 -6145 -9070 -9692 -3386 1554 2215 -917 -1634 -2768 -4101 -6591 -6833 -1707 -2303
20858 -2303 -5248 -4776 -4350 -6256 -2061 -885 -1586 -9315 -14037 -15453 -17323 -14968 -8965 -5267 -3428
20843 -3428 -1013 340 -1292 -3835 -3528 -3946 -1806 -452 -3291 -3424 -964 5121 3370 4789 8971
20828 8971 9498 6822 89 -3387 -3067 -1996 6712 9787 7853 5524 3986 6470 7477 6138 3288
20813 3288 2166 4262 6236 6952 5632 160 -3745 -615 1756 1641 -705 -1642 -2456 -573 3229 5766
20797 5766 10086 15275 11862 10105 11007 8789 9637 9901 5718 2411 5395 8291 7031 4191 5722
20782 5722 9103 7605 5994 5599 7558 11496 11300 6863 7241 9131 6065 585 442 2531 3866 131
20766 131 436 4812 2465 -5317 -1989 4828 6238 2248 -8397 -4065 -1386 722 606 706 -885
20751 -885 -1329 -4190 -2447 3742 6053 535 -5408 -8736 -7028 -5154 -351 3939 3736 3022 -99 -4008
20735 -4008 -5253 -898 -3735 -2665 -3046 1562 6498 8121 -1116 -8179 -10763 -7236 3281 6168 8196
20720 8196 6830 -1684 -1382 332 897 3377 5394 6733 -310 -1343 5335 10180 9457 4767 5420 4415
20704 4415 1041 -7630 -8439 -4168 3894 10674 14405 12244 4771 -928 -1434 1758 418 237 1690
20689 1690 2531 -3109 -9614 -12388 -12445 -7113 -807 4378 4953 7742 8437 7938 10988 10777 4670 4830 4050
20672 4050 180 -4601 -910 -1754 4390 8991 5024 792 -3357 -3084 -6305 -5044 -1832 848 -1472
20657 -1472 -1386 -3093 749 1601 983 -1135 -1073 -768 -314 -839 909 1254 3244 6770 11608 8859 2786
20640 2786 -1045 1271 -418 -4037 -5561 3374 9563 9796 10982 10976 8417 7990 5284 5168 4971 3379
20624 3379 4306 839 791 -1623 -7362 -6941 -4852 -2791 -215 3563 7887 7883 7037 2901 -3876 -8434 -4356
20607 -4356 -2045 -1816 -2955 -7813 -5098 -1297 -2005 -3711 -2463 2505 1674 966 87 5757 9603 9559
20591 9559 8678 8705 7547 5901 1426 3478 6108 3574 548 2584 1426 382 1871 -1865 591
20576 591 2099 -1141 -1117 1423 930 129 -299 -21 -2358 -5110 -7003 -3174 -2275 -4516 -4032 -4056 -6563
20559 -6563 -3967 1763 1347 -2423 -1979 -3165 -5917 -6701 -2381 2569 3705 -472 -2777 1358 5226
20544 5226 9061 7577 4797 2527 5916 3516 -2929 -3423 930 4183 6412 10922 7830 2287 -2328
20529 -2328 -2494 -2716 -2878 -1196 2091 3498 2280 2906 425 1396 2843 3379 -1043 2934 8156 12546
20513 12546 9771 9426 10667 14449 11320 4936 2620 -1128 65 4276 890 376 1571 2522 -1729
20498 -1729 -2953 -1211 -1027 1120 4361 7320 4620 162 -594 -2810 182 904 2504 2653 2304 300
20482 300 -5014 -4601 1265 -1351 -4844 -3430 -5922 -8325 -8734 -7764 -1521 -2575 1127 983 3919 7557
20466 7557 6741 4155 11 1886 8386 10681 8730 9398 5768 4528 4585 9632 8938 925 -1309 484
20450 484 3330 8359 10456 7523 1124 1389 5510 8116 9220 11287 10456 8162 3851 -126 -3848
20435 -3848 -1090 -604 -4238 -2388 -2879 -2262 -1043 -7396 -2976 7555 9814 10241 10783 4150 -1324 -4016
20419 -4016 -3666 -3586 -5568 -6561 -6361 -4837 2432 2927 -3530 -6528 -4104 1426 6049 3071 -3795 -4361
20403 -4361 -2890 -1055 -60 950 2489 -1757 -1240 1112 -1045 -1863 -2706 1950 2373 -5738 -3664 1068
20387 1068 -2086 -6526 -5493 -131 -1015 -1325 2441 5903 6148 10587 10003 5496 4148 2978 4297 3171
20371 3171 6235 4238 -1899 3869 12278 10125 5560 2666 -2677 266 5410 7928 10346 10977 6209
20356 6209 3565 4985 2040 -1895 -7322 -8015 -4604 -1992 2825 10025 9589 10103 9252 4091 -139 2881
20340 2881 3485 4970 -1155 -5038 -8081 -5005 -1693 -2208 -706 3875 1566 1203 1924 3258 4925 2477
20324 2477 6977 8353 1626 -2965 946 2842 3091 3214 2851 -1226 -4281 -4433 -6356 -7425 -8412 -5686
20308 -5686 -2116 -4751 -5197 -2204 1560 2865 9279 10020 4499 388 -3474 1236 4520 2890 -3741
20293 -3741 -2215 3302 7520 9454 9886 8902 6918 9510 5713 1873 -2753 -279 1553 3031 5354
20278 5354 5979 7027 6153 2969 -1419 177 4542 817 2441 3887 2267 5117 10683 12760 11055
20263 11055 12009 16844 13048 10435 13015 11809 7566 5094 5484 5078 -848 -1189 883 1432 4918 2689
20247 2689 2727 931 602 2202 6805 5768 6881 6945 7962 3494 1000 1507 561 465 1864 -1219 260
20230 260 3261 11994 7793 515 656 1787 4717 1367 1571 2773 3417 316 2009 974 1383 1716
20214 1716 669 2630 -429 -7960 -7088 -2012 -2456 -3560 -3682 -1295 6423 11057 7586 2024 -6083
20199 -6083 -1903 5862 10803 10060 3394 -1512 840 9995 15749 13580 8400 9414 11533 6972 5988
20184 5988 2145 -19 -5183 -8961 -5207 -1401 3553 2774 1401 852 1908 3503 1754 1261 -711
20169 -711 1868 667 -2535 -4405 -5181 -2764 -3527 -7255 -7030 -4513 -5766 -9917 -9380 -7958 -1486 3938
20153 3938 2672 -1991 -1921 4033 2221 4575 919 -923 3098 4182 1422 2005 69 987 679 5314
20137 5314 10324 8169 1608 -3991 -4481 -651 4762 3647 -3306 -3324 -273 1959 4699 6200 7490
20122 7490 8432 7035 4185 5334 5939 6527 14768 22955 16404 8755 1833 -1671 -3214 -2998 -3720 -2351
20106 -2351 2508 3914 1610 4504 1335 2486 5332 5873 9009 9826 8707 8284 7682 6566 5038 7603
20090 7603 5187 5834 3383 2128 1963 1388 1649 3985 5450 2955 -1234 -675 238 -1779 -3882 1626
20074 1626 8806 11123 5418 2655 4314 171 -8322 -7656 -7150 -5872 1156 6796 8824 11862 4237
20059 4237 1935 5154 8672 8361 8401 980 -2058 -2985 -47 1325 3278 2567 67 -1357 2925 2542
20043 2542 3227 7801 9786 2444 132 4308 4766 7120 3280 2728 632 6 1134 2501 8074 11665
20027 11665 8630 9685 9689 7843 6041 10729 11114 9497 8518 8731 2867 -1825 -1980 -711 1383 4363
20011 4363 3102 6420 6138 7443 5612 1028 2251 3025 878 3171 8448 9038 7946 9586 9957 7921
19995 7921 5453 5185 7075 5952 4845 1873 -238 -591 590 178 2493 6733 9063 8036 6641
19980 6641 6188 5447 5490 6786 4017 8005 12098 5362 5352 10365 11094 8479 5489 3768 2491 4534
19964 4534 3667 4148 1121 1378 5915 7689 7170 6912 8758 11743 11375 9233 6556 10724 12410 10700
19948 10700 12364 15864 14548 13176 11545 9586 8627 13512 15579 5942 3018 2439 463 2652 1879
19933 1879 -943 2125 4848 8000 4684 4285 2285 5231 6172 7008 7631 11000 9878 7027 5804 7431
19917 7431 5530 4519 5224 6646 9339 7791 4396 5175 3831 4040 6349 8404 18359 22242 15526
19902 15526 14178 16326 20460 24282 20431 17154 17303 18251 19394 17288 17526 18250 10978 6751 5816 7603
19886 7603 9923 7621 5439 2996 5955 12638 15698 18642 17881 13488 9896 11460 9274 6347 3235
19871 3235 2799 5891 3406 1031 -1036 -153 -701 -1392 1504 3252 7379 8948 9190 9652 7490 6061
19855 6061 8676 10486 8760 3533 -156 1311 6358 1353 -2044 -796 4560 5920 5102 6908 12084
19840 12084 13203 13708 16361 17331 14485 12111 12711 17498 15504 14482 14678 15060 12956 13159 10174 6773
19824 6773 4940 3461 6204 5804 -471 -1984 2299 10001 17353 15403 13146 9559 4662 -790 -803
19809 -803 2027 5939 10064 10963 6530 3261 2059 2938 2398 6150 10358 15356 12987 12942 15763 14944
19793 14944 13935 9685 89 261 3337 5107 7431 10025 3563 152 3825 5780 3241 3393 6602
19778 6602 9414 6129 4014 4948 5096 2910 3260 3940 5668 8953 8220 10138 9592 6618 9136 8639
19762 8639 1486 -6647 -4241 1833 1105 1803 6357 8475 9886 7386 10956 10441 9616 10654 9599 11346
19746 11346 13443 12715 12415 10273 7488 5803 5455 1744 5934 9119 13039 12904 12726 14688 15626 16628
19730 16628 12329 7988 7641 3723 1621 908 1796 2824 -1821 1060 7931 6971 7790 4616 4317 5170
19714 5170 3809 9858 15547 15209 11722 7881 11083 11349 9307 11119 14168 18891 19632 15050 12948
19699 12948 14757 13442 8582 6853 8028 8079 6746 5584 6023 4492 -1811 -273 3335 9087 9708
19684 9708 8794 7614 5769 3110 -4529 -2356 1989 4702 6283 10442 10059 6492 5520 2380 4361
19669 4361 5918 3537 2314 2722 -6 1180 4772 5228 7681 8996 11685 10296 9365 10191 11949 13862
19653 13862 4721 -4224 -4689 -2668 -4970 445 6201 3787 3747 1396 956 4475 6661 6360 3307 6618
19637 6618 10351 17123 19767 20123 18965 15747 11209 8765 12457 7889 7855 8686 7708 9275 10766 12807
19621 12807 9251 5482 6994 3943 3777 5442 5217 5036 2751 3764 8318 8774 5937 4332 8634
19606 8634 11006 7698 5475 6511 7723 6489 9360 13165 15219 8750 3713 9086 6810 5841 7627
19591 7627 9195 7164 7744 11473 9247 7266 6200 12955 19031 14052 6791 5688 11341 15017 16922
19576 16922 18038 16789 11482 9524 12554 12896 11818 12707 14244 16937 17388 16393 18349 20240 14285
19561 14285 8502 9843 8259 4839 6966 9273 11553 13987 14608 12558 13592 20781 19664 22302 23399
19546 23399 17462 11588 12928 14472 14343 15152 10558 11518 12856 11520 13736 12499 8300 9991 16470
19531 16470 20446 17315 16835 17211 10148 9132 9833 8951 5859 7158 13060 10077 11286 14017 16221
19516 16221 16733 17171 15999 20723 15108 11387 6104 2766 6697 10428 10264 13573 14821 18362 17123
19501 17123 20176 16972 14839 16819 14066 12393 10935 10239 7952 5827 8270 6272 8595 9119 5582
19486 5582 4931 5401 8744 10689 12573 9225 8691 11460 16358 17310 16731 11373 11248 10240 7348 10447
19470 10447 6694 6025 5389 7246 11266 14290 11475 11893 12225 16082 16793 19529 19790 17856 14557 15180
19454 15180 17886 14677 11285 9088 12393 15740 17902 17280 15371 14137 12291 13058 12883 12273 11529 12793
19438 12793 13831 16561 16254 13745 12793 18581 13855 5545 3603 10317 13747 13457 13793 14972 19140
19423 19140 18550 18677 12351 10216 11398 13260 16029 10301 6351 7799 8725 6254 6117 5941 3578 4977
19407 4977 6779 -64 1395 8968 8686 9657 8872 12636 15757 14918 13386 15204 20571 23662 24908 22466
19391 22466 17628 15357 17410 19335 17370 11294 6636 11984 13526 14761 17381 15655 17096 15363
19377 15363 17530 21334 24767 18570 12464 12571 12482 15649 11640 12416 10969 11800 15836 17258 6725
19362 6725 3889 6479 4130 5136 9152 8184 7644 10356 9133 11274 8935 7001 3805 8084 10295
19347 10295 14706 21133 21927 15814 15077 14580 17973 17388 12736 15558 14099 17690 23070 21385 25052
19332 25052 27390 21885 15524 13219 16385 22339 29995 26701 22600 18583 19290 21627 18544 17230 18837
19317 18837 21204 18845 21266 17710 16622 14529 12018 6877 10259 17866 20168 22851 26459 22787
19303 22787 22760 28724 24680 23794 28652 29561 28870 25764 18164 16481 17195 17242 13467 9834 9751 15508 20042
19286 20042 16038 18034 15843 10220 6448 10087 10413 13737 18261 23016 24331 24361 21259 17964 19500
19271 19500 16881 11847 9422 5586 7731 15409 11318 10293 11508 11918 12988 14464 14772 10511 11595
19256 11595 12890 11485 16493 18108 16426 13361 15194 17088 13905 14598 17833 21599 30895 27123 25926
19241 25926 24412 26740 31669 29239 24657 23352 20545 16777 13136 15256 21080 30211 28268 23920
19227 23920 22776 18404 20494 17481 15569 16267 14793 13550 13376 15624 20574 17471 14149 15423 13840
19212 13840 8388 6543 9344 12726 17046 19754 13598 9860 12503 19470 22984 17805 19171 18210 20237
19197 20237 18479 19874 23540 19556 16936 15886 16762 19278 16645 14378 17121 21113 20149 23521 27763
19182 27763 23754 17810 17119 13756 11163 10793 12177 16081 20153 23795 24444 22264 25616 24908 16635
19167 16635 13640 16863 17063 18730 18915 22012 24821 21766 20522 18640 21099 23353 21338 20623 24853
19152 24853 27577 21527 16965 18572 18973 22548 26058 27677 26536 26481 24344 17018 19400 30228 38562
19137 38562 38953 38830 38342 41205 46244 51838 58442 68029 66014 61825 68532 83959 103082 122748
19123 122748 140548 158539 182048 210884 238602 256386 262547 269882 286525 297349 297695 287144
19111 287144 287674 297280 305950 300700 284957 272449 267597 258484 228986 196268 171320 146907 127129
19098 127129 108376 86933 66990 58138 53788 51016 44911 40469 45660 48501 44488 40065 38521
19085 38521 38099 42648 40083 35647 36705 41536 38157 37302 41278 39696 39325 36348 38422 45723 43934
19070 43934 41391 38697 39656 37481 34353 32496 34901 35910 34468 37326 42874 44111 46581 46630 39417
19055 39417 30683 25986 28792 34867 33229 28965 33106 39505 39517 35093 27733 22364 22200 28513 28360
19040 28360 26877 24016 18759 19349 21518 29056 28033 24072 23541 27550 29898 35622 37769 29661 24529
19025 24529 22236 23715 24905 23343 23873 25286 21534 19431 23570 29692 30838 33415 36028 36699 37178
19010 37178 37297 40952 40205 36154 36661 42398 48234 47434 47863 47973 45223 38687 35813 34728 37907 37667
18994 37667 37564 33497 34929 37154 34767 28203 29945 35342 39189 38047 40027 40151 40234 35758 28825
18979 28825 28826 30811 34653 39001 38212 39848 43486 42650 42327 48625 51781 50095 48806 46057 47845 45092
18963 45092 43774 44203 43284 45042 45686 46792 51218 52123 52243 49488 52140 50139 47968 46886 46016 47314
18947 47314 52214 47786 44990 44914 46613 49879 50488 49303 49676 49037 46347 45090 44054 44630 45852 48729
18931 48729 50135 50003 48818 44763 40974 43423 43165 40970 41286 41747 44808 44800 41175 35079 36894 45112
18915 45112 48919 51906 46428 39975 38489 44527 53639 52388 48023 37028 32286 33072 32156 37272 39749
18900 39749 41219 38747 35755 38562 45306 51105 51504 50821 42726 43639 53291 62060 63916 60063 57811
18885 57811 56597 61212 68908 70825 74591 83434 95065 100562 103281 102971 103545 102870 101236 107217 110605
18870 110605 111015 107686 104711 100072 100963 101496 93864 86205 80480 77724 77412 72630 67385 65582 60028
18855 60028 60774 63452 63923 68143 67868 67564 68874 69670 73991 75427 71592 78494 78625 82462 90294 94180
18839 94180 95746 101831 111407 119360 132431 151453 176897 231185 319318 451900 589329 661518
18827 661518 686588 710906 701106 617521 503010 416010 365004 361936 408528 516873 640488
18816 640488 696884 704186 722669 707818 609793 474249 354067 270475 214504 170682 141962
18805 141962 122073 104923 99659 96508 92765 93711 88862 80269 76337 84839 92288 93489 90678 87759
18791 87759 89996 88384 83837 83683 83675 83942 82842 81876 79728 82014 85571 89609 94079 92031 92653 96546
18775 96546 97664 103939 112320 118069 125612 140869 158922 158505 139599 121408 113842 113700 116785 120236
18761 120236 119829 118045 118415 117368 123386 131837 129910 122824 115221 112323 108419 110673 109032 108748 117391
18746 117391 119555 119522 121664 122267 124505 121328 118338 114973 119904 119391 120995 121824 119538 121330 118267
18731 118267 118538 128051 129595 128408 126499 126341 132769 137861 141834 149680 160043 174085 194809 220852
18717 220852 245700 264567 281522 302231 328372 342758 337083 322904 315224 304496 294563 278163
18705 278163 259054 237929 219823 209399 203580 200984 201240 205735 207609 207379 206592 203642 200037 203050
18691 203050 199852 197082 201087 205045 208443 214280 221394 226154 229429 225380 225401 230288 238289 249559
18677 249559 267960 280343 292184 299477 302201 299300 307388 329582 360608 394600 431430 476295
18665 476295 522128 559433 595029 630645 680509 730105 768572 802263 831544 864531 916285
18654 916285 979310 1034192 1085196 1158864 1247725 1333753 1407800 1499247 1623896 1768997 1905757
18643 1905757 2051343 2246265 2489750 2773775 3091663 3467023 3974530 4656097 5583494
18634 5583494 6946746 9079583 12263322 16165013 19913630 23611668 28719640 35347178
18626 35347178 40570280 42344116 42945580 45667414 49765867 51426071 49624044 47528084
18618 47528084 48082193 50683256 52015324 49978523 46524464 44895234 44792947 42573174
18610 42573174 36850817 30393450 25575291 21705717 17575735 13510804 10317640 8155377
18602 8155377 6735851 5754895 5020918 4452220 4027715 3708909 3443942 3218217 3054643
18593 3054643 2955783 2869997 2756802 2630103 2524445 2439963 2337020 2176831 1999067 1863079
18583 1863079 1779478 1703873 1600944 1490969 1408229 1349192 1273948 1153000 1013508 891931
18573 891931 786391 689626 600895 532343 476885 430195 399511 383049 371891 357421 345571
18562 345571 332073 321829 318603 314928 306932 292315 283731 282316 275631 266593 261439 259351 250566
18549 250566 242270 236233 228193 224022 214911 203040 193415 188728 196975 212863 235298 258635 277277
18536 277277 291871 294526 287858 274479 252498 228774 219038 218206 226042 238245 251844 258353 255192
18523 255192 241936 216921 190641 169604 150851 135442 129049 119199 108638 102735 101024 98187
18511 98187 92574 87130 87474 88163 85224 83859 80192 81292 84770 83594 82383 84868 90121 89422 88374
18496 88374 82288 79801 80722 77243 68388 66564 68372 73019 76755 73910 75213 77824 73296 56357
18482 56357 45763 50805 54113 55891 55102 57226 60745 64392 63180 63896 66806 70348 72929 75723 78847
18467 78847 83106 82295 76420 72212 79128 80706 75599 78771 78059 77509 77988 79968 83290 89388 96909
18452 96909 101682 105750 104600 96162 90800 92083 93320 90503 89974 88289 86286 87632 92612 94593 95967
18437 95967 95739 100163 98122 93536 93816 94644 93233 95444 100093 98518 95572 100596 104472 106173 115763
18422 115763 122704 127874 134333 141443 143080 138941 137143 133743 133099 131156 122915 119293 111255 101861
18408 101861 93872 92727 93780 94102 95021 92447 88953 89838 85808 87934 91975 93569 98664 92910 86919
18393 86919 84083 86264 85861 87314 93951 94632 98259 103689 105775 106418 106518 107446 108497 105100 97682 92336
18377 92336 94883 95037 94860 100433 99885 104714 111797 112198 112618 118988 127211 137798 150794 172487 199277
18362 199277 232055 277153 333287 379236 405906 402350 372710 329176 275153 232439 199810 173775
18350 173775 158527 153073 156570 166999 177799 187658 210582 244078 294728 353484 408107 446156
18338 446156 461877 447537 403901 345613 295944 264868 242474 222559 207409 196520 188678 179210
18326 179210 165615 161468 151326 140001 141537 136882 133786 135356 135742 136807 139799 142131 142180 139314
18312 139314 137910 143826 149029 148401 147305 147730 150422 155669 154082 156228 165483 173168 175058 172208 167789
18297 167789 165668 165678 168845 170958 168899 169687 172296 170374 172615 178752 185482 186839 183216 181777 188776
18282 188776 191833 189281 184218 181707 179649 182247 181297 177849 178500 180286 179888 182319 184541 183396 178984
18267 178984 177897 186353 195114 200740 209938 220772 232731 240317 249216 258694 271822 283839 302326
18254 302326 314409 330090 346138 361950 382921 405623 429828 456317 489316 533821 573524
18243 573524 608867 659879 715791 785616 859788 909516 950874 1009588 1090673 1200699 1331014
18232 1331014 1477233 1651190 1887619 2231534 2752345 3558053 4844444 6868159 9689653
18223 9689653 12859411 15517238 17256539 18812608 21248447 24358602 26387582 25834741
18215 25834741 23275184 20622238 18960472 17679824 15643878 12697054 9630423 7162296
18207 7162296 5455740 4321670 3544125 3005438 2642731 2395686 2208178 2049809 1915155
18198 1915155 1817485 1759517 1725311 1703773 1693295 1707799 1754728 1835926 1938702 2021990 2051329
18187 2051329 2061824 2102962 2169901 2248204 2360997 2533483 2780303 3083166 3444830 3910301
18177 3910301 4509539 5272977 6365757 8094201 10890726 15274200 21454229 28597248
18169 28597248 34851211 39050600 42482165 47538835 54291752 59302501 58966483 53744614
18161 53744614 47562010 43308925 40234314 35850088 29372143 22305434 16397932 12214827
18153 12214827 9414414 7505637 6173302 5255665 4617528 4143686 3733359 3363784 3067817
18144 3067817 2854074 2693163 2526742 2335337 2156458 2019610 1946154 1903965 1887299 1917934
18134 1917934 1913060 1781898 1594418 1443572 1355243 1310764 1292237 1304798 1345414 1423700 1555415
18123 1555415 1729802 1861850 1863535 1809696 1810571 1869474 1961112 2077689 2246317 2551142 3110445
18112 3110445 4170706 6347135 10109462 12395669 10565098 7202600 5124904 4207916
18104 4207916 3864535 3773034 3806056 3918747 4085989 4331788 4725965 5372956 6421792 8131652
18094 8131652 10916154 15232122 21093147 28035172 35476169 41110491 43519199 42992279
18086 42992279 39305497 34077414 29736247 27594008 28223490 31310392 36097446 40429850
18078 40429850 42068080 41016804 36859237 30345969 23544071 17572974 12849080 9566313
18070 9566313 7429616 6028727 5092545 4425663 3924691 3538412 3226724 2962759 2746410
18061 2746410 2575698 2438621 2323546 2233696 2153494 2073410 2011807 1957979 1917841 1916284 1954512
18050 1954512 2008597 2065864 2128240 2195892 2278167 2412328 2650540 3046574 3689861 4761185
18040 4761185 6462956 8847977 11760355 15036078 17717329 19029692 19089601 17659464
18032 17659464 15357712 13323070 12187865 12278357 13540636 15696512 17848572 18842978
18024 18842978 18645883 16990267 14089655 10947703 8138215 5883773 4321478 3317533
18016 3317533 2667610 2233666 1921264 1687631 1502197 1348054 1224422 1121974 1041937 979756
18006 979756 924540 873054 820303 761748 702169 647187 599762 568095 552927 543368 533761 515975
17994 515975 493973 466446 442441 421138 401766 383274 372744 364749 368069 384031 423065 483304
17982 483304 546312 585864 618328 665956 711160 718388 679549 617705 568827 527310 460390 371679
17970 371679 292788 241174 207734 186343 181480 174785 161444 141710 125530 121309 110589 90135
17958 90135 79879 80448 80611 82882 91325 104057 109497 102264 93027 89775 86948 84503 83502 86350
17944 86350 88140 97723 105923 113656 123054 132056 143358 150806 153369 154284 153230 155567 155759 158602 179262
17929 179262 211807 257799 299699 323709 348382 381525 416564 428733 415279 389818 362077
17918 362077 333030 289658 229793 176577 137484 113832 108575 109358 117288 123147 122524 118957 114392
17905 114392 110687 106765 110416 115382 124557 137331 138613 130734 113144 90499 74131 64536 69673
17892 69673 79580 89476 98832 103695 106684 109237 108692 103795 105382 100693 90888 88293 90014 89361 86453
17877 86453 91039 91692 95445 98549 98986 108194 113339 110948 110250 112411 114399 118957 123523 123815 123320 118752
17861 118752 118807 119838 117827 121323 129239 134478 141679 154500 157383 154084 154345 157149 155631 160682 166114
17846 166114 175944 189364 193354 194581 192906 197621 206038 209249 209425 218222 226583 227500 236878 252826
17832 252826 261367 271796 290943 311320 323607 333338 352284 373127 402432 436229 470656 514347
17820 514347 554707 603167 667057 755294 867460 993494 1133278 1262950 1379045 1475854
17810 1475854 1547406 1593576 1623525 1641666 1661602 1711693 1818590 1984318 2216402 2516612
17800 2516612 2902746 3391113 4040195 4936319 6202361 8039286 10850404 15323883 22337049
17791 22337049 32243913 43787368 54142778 60216161 59892726 53473024 43286639 32524335
17783 32524335 23723398 17708233 13953065 11651210 10259431 9555279 9503979 10183071 11827884
17774 11827884 14932081 20299760 28695347 39847492 51542955 60552297 63855371 60292754
17766 60292754 51246640 39737865 28994130 20866162 15406038 11789289 9248717 7349740
17758 7349740 5919054 4862654 4103358 3563000 3173227 2877938 2653604 2480141 2340336
17749 2340336 2224283 2120867 2024018 1943752 1883016 1828847 1752221 1635601 1476064 1285885
17739 1285885 1105037 949593 819669 720477 648751 588229 533052 491190 459822 430320 399894
17728 399894 368579 344116 320652 301577 287740 272007 259608 248547 239114 224118 208722 199662
17716 199662 196081 194193 196308 211407 225958 248137 271388 288992 302053 314250 324274 342650
17704 342650 345341 327899 303952 278562 256389 242034 210776 176760 155978 132084 107260 96161
17692 96161 90520 83960 75402 68078 61472 56071 50389 50435 46810 44684 47847 50903 54862 59744 53939
17677 53939 50210 46909 40838 38210 37595 37044 36788 40421 34900 30833 33414 35422 43343 58980 71560
17662 71560 84523 90617 94784 97446 100159 107104 120680 135625 154029 173687 194299 201668 195098
17649 195098 178891 162148 152320 139877 125954 109679 94811 77875 55276 34060 13729 2474
17637 2474 -6492 -5066 6066 11670 10489 10452 14800 14519 14650 14884 9705 6896 5613 7459 918 -1354
17621 -1354 -1174 -1473 -6863 -9314 -12975 -12286 -5278 111 8071 16622 19425 19087 18401 17952 15776 12315
17605 12315 14721 18925 27514 37635 46227 56277 74921 97278 122921 151123 169012 176544 173788
17592 173788 160957 143873 124377 113237 114168 126215 143877 155994 167581 178363 167636 147006
17580 147006 126651 107339 85178 65800 44908 30483 24283 10076 -732 -6330 -7876 -6013
17568 -6013 -3767 -2630 -270 2670 7663 14869 19043 15095 8450 1106 827 -262 -425 -2502 -4702
17553 -4702 -2232 2441 11143 17689 17870 20943 32056 47779 64717 84420 106609 128061 141137
17540 141137 144801 135921 121506 103074 92409 94344 99238 114864 130125 137272 139178 131142 113592
17527 113592 89847 73631 58177 39180 24799 18341 16447 14895 15164 6760 6513 4890 1747
17514 1747 -311 -3915 -2966 -4437 -2720 -4113 -3291 -6196 -9643 -6685 -3897 -819 -4451 -3072 -2225
17499 -2225 -3654 -1056 -1092 -215 1885 -1986 -2026 -2509 -3600 -3390 -556 -1233 -3262 -7688 -11386 -10509 -10047
17482 -10047 -7408 -3106 -1677 -3833 -3764 186 -749 -8437 -12170 -11968 -7899 -5244 -981 -4504 -5662
17467 -5662 -6709 -6096 -3658 -3934 -6864 -8698 -12636 -11952 -5938 -9683 -12620 -8519 -5781 1448 2074 1990
17451 1990 -856 -4297 -4535 -2769 35 768 4098 19132 36222 57885 60001 43960 32789 30566
17437 30566 39363 57020 82564 119871 177467 233376 245681 232302 225589 242041 267996 266734
17425 266734 226336 171880 125046 97862 84850 80177 81497 93080 108742 131105 165775 206924
17413 206924 254330 286901 284664 268309 265859 277442 283508 251630 194602 142216 105253 79777
17401 79777 56275 41706 37008 32278 28387 24627 20513 16140 12309 7560 7310 5081 3468 5203
17387 5203 5079 2634 1556 -106 -2162 243 876 -4743 -6904 -2642 -251 3721 5568 5295 7342
17372 7342 6050 5520 7063 -1572 -7976 -9822 -6703 -12737 -15315 -14429 -9724 -11680 -12822 -13714 -12109
17357 -12109 -12342 -10902 -10825 -11802 -10076 -8734 -11528 -17062 -17942 -17397 -15415 -11795 -12109 -9584 -5830 -5466
17341 -5466 -10344 -4456 -3238 -4310 -5818 -7790 -9677 -12893 -15595 -12814 -12171 -13757 -17363 -15040 -12289
17326 -12289 -6628 127 1989 5465 11605 12732 8368 4965 3112 -347 -4051 -1870 -3953 -4063 3563
17311 3563 882 -3084 -3370 -2515 -6465 -6336 -8701 -7506 -4059 -6742 -4822 1429 5696 3973 -1078
17296 -1078 1132 1097 397 -4125 -9763 -15563 -21189 -20048 -15645 -12358 -12679 -9248 -8862 -8656 -5661 -8492
17280 -8492 -10584 -5637 -3413 -1662 2181 3296 848 -5207 -7198 -8573 -9098 -7669 -4425 340 2892
17265 2892 5969 7694 8930 6293 4799 4566 8497 8726 11960 10793 5631 9554 8258 10069 15633
17250 15633 18653 18786 11196 4239 9969 13307 5147 807 4128 6833 10180 14226 16955 19894 21820
17235 21820 21536 18612 16118 14984 16324 14319 10522 10898 11856 14651 20386 20435 20067 21877 23652 29906
17219 29906 41104 59446 79813 100017 127886 171298 223834 272346 301281 301326 277172 231064
17207 231064 180886 137300 105760 89127 76622 68755 70847 75545 78502 90236 109802 136237
17195 136237 175716 228717 278719 322411 347868 338467 300038 242128 182191 139928 104350 78675
17183 78675 66301 57584 49344 42178 32777 25603 18014 16832 20258 20134 18045 14349 10689 12374
17169 12374 17302 18892 20199 19803 16347 14572 8440 3827 2505 807 1108 5235 6965 8805 8920
17154 8920 11886 13055 13547 10680 10612 12916 18914 18146 17910 15327 15897 12402 14888 26056 26817 34265
17138 34265 42570 44041 44819 51695 50060 47432 41787 32905 29969 27899 26097 26436 25529 21450 19858
17123 19858 21257 28520 39004 44146 49701 52991 56817 61126 59669 49848 44132 43977 39906 34699
17109 34699 31371 24734 25044 23978 20907 18279 21483 23760 23863 20377 16787 17252 17333 17625 13817 15261
17093 15261 18976 16464 18609 26126 29399 27290 25286 26224 27833 29605 28216 32149 33867 27881 26014
17078 26014 23233 14364 8768 10952 14188 13165 12966 9847 14297 20944 26165 26450 24647 24298 26193
17063 26193 28716 24796 21047 17774 10425 11661 14626 17571 22394 27648 26723 20770 23677 27537 29451
17048 29451 30601 34043 36309 39673 38312 32105 25127 26349 31483 35037 41027 47339 50075 55315
17034 55315 56474 57692 58196 56431 54294 57589 56612 53036 52317 58185 59774 57814 60301 69698 74417
17019 74417 73693 76934 86781 98169 93041 81730 75849 83720 87028 84809 75004 68730 65101 64689
17005 64689 70698 77265 78781 78415 78761 84443 92027 95929 95973 91250 81580 72185 79054 89580 90013
16990 90013 79171 67254 69261 72829 73220 76031 80208 78093 74763 80531 81662 81288 78147 78348 74824
16975 74824 74254 78937 83924 92776 96172 94420 92509 98942 102773 110225 113538 109376 102760 106857 115964
16960 115964 120716 122464 121837 119391 111414 109780 114857 120515 122362 125320 126372 130764 138009 143405
16946 143405 145157 147378 149467 149615 151013 157173 165258 173675 179003 186182 193048 197876 207316 216217
16932 216217 224165 230466 242386 252997 260908 269467 279958 299707 316988 330600 356550 387498
16920 387498 408341 439188 470972 510551 560268 621286 692902 781767 872306 934984 978897
16909 978897 1043860 1163040 1318245 1439575 1494216 1552043 1668088 1873301 2113446 2313403
16899 2313403 2481188 2704225 3063702 3586677 4279311 5186788 6448558 8351370 11434251
16890 11434251 16758377 25834558 38302951 47769535 47714028 41995845 39385586 43484868
16882 43484868 49510808 48223397 38273762 26835020 18881705 14354769 11907642 10677998
16874 10677998 10330027 10872571 12502264 15765378 21868738 31937030 43330026 48297478
16866 48297478 44460899 39035194 39057232 44501390 47791970 42036388 30589393 20543826
16858 20543826 14184120 10402166 8003645 6406238 5369042 4684468 4147811 3660135
16850 3660135 3250935 2961203 2752925 2532381 2276060 2031682 1850369 1711615 1563240
16841 1563240 1408474 1286900 1206118 1132634 1058668 978379 912555 869891 830159 764572 679654
16830 679654 596244 522399 469194 428603 398686 371091 343889 319388 294146 272486 257262
16819 257262 240542 222960 214362 208074 198727 190276 180405 169408 161574 156656 149373 143626 140854
16806 140854 138598 135640 128067 118141 110440 100806 96709 90825 82669 67558 53455 47171 47829 48678
16792 48678 49772 51198 49872 51354 51397 49988 43694 34104 29694 29711 27069 26610 32379 35171 35044 31743
16776 31743 34132 39245 40674 40066 36171 34434 36461 38436 37107 32863 23702 17119 21858 34193
16762 34193 45116 42188 28883 18248 9424 7673 17130 28606 27856 12844 2748 -2880 -2276
16749 -2276 -3254 -5306 -8306 -4455 -95 5724 12500 17676 18837 10115 -3689 -16815 -17903 -10899
16735 -10899 -9471 -14825 -25960 -30219 -28599 -27242 -20001 -10612 -7971 -5536 -2838 944 -3727 -10772
16721 -10772 -13221 -18276 -14377 -13608 -15988 -18583 -19052 -21214 -18622 -14950 -14339 -8765 -4316 -199 4566
16706 4566 5683 6679 6836 4384 6824 6722 3419 1051 -1315 -822 1344 2228 2765 984 4989 9528
16690 9528 14599 2722 -7808 -12014 -14948 -17417 -14127 -6775 -4334 -1576 792 7086 12195 13770
16676 13770 13813 11125 11810 11063 4303 7585 8507 10383 9129 3157 4315 7453 19103 24438 31094
16661 31094 47033 71182 99338 142873 208635 280221 344146 418744 528110 651495 714141
16650 714141 693428 657743 671139 714679 713163 633280 518471 425657 357770 290020 216391
16639 216391 159619 117113 83281 66726 53734 44930 34848 30559 32681 31651 31332 38013 48932
16626 48932 56690 69846 79965 93346 105943 115638 119573 114542 109284 103810 93407 77201 64707
16613 64707 56677 45858 34774 22596 11631 3427 3023 3158 -1665 -4082 -1983 1158 1758 1125
16599 1125 2665 1253 246 5593 13336 11216 799 -3042 679 4523 2876 -2216 -9712 -7100
16585 -7100 -1844 -10652 -15966 -19909 -19913 -19426 -20168 -17450 -20950 -20484 -20190 -21724 -19897 -16690 -17640 -13320 -12968
16568 -12968 -15883 -19390 -22052 -18822 -16674 -22724 -25207 -26617 -22076 -15102 -16933 -16004 -16205 -20534 -26035
16553 -26035 -25542 -24277 -24827 -26291 -25613 -17892 -13069 -19078 -24349 -22494 -17992 -15965 -19710 -22548 -17897
16538 -17897 -18909 -21666 -22851 -18660 -13439 -12253 -20479 -24472 -29271 -31555 -31446 -30348 -26903 -25349 -20838
16523 -20838 -19950 -17504 -17656 -22023 -23615 -23918 -24557 -18505 -17574 -14278 -10157 -17253 -18551 -20303 -19722 -14899
16507 -14899 -13019 -9096 -9812 -14011 -17918 -23078 -21695 -17141 -16465 -12736 -12143 -18255 -19446 -16913 -17155
16492 -17155 -16404 -20233 -26913 -24435 -20784 -18575 -21985 -17516 -14201 -14189 -18060 -20180 -14557 -10749 -10556
16477 -10556 -8365 -2510 -281 -3454 -5799 -352 -282 -2066 -5154 -9769 -8693 -9448 -9735 -7409 -3729
16462 -3729 -6870 -8824 -11279 -13497 -15010 -18209 -22134 -21465 -17339 -14652 -18024 -21889 -18503 -14941 -16277
16447 -16277 -11828 -9864 -13543 -14747 -15663 -17489 -13844 -7937 -11002 -20328 -21219 -19096 -18672 -13690 -12717
16432 -12717 -17013 -22481 -25272 -24892 -21348 -17214 -18363 -24414 -20952 -18747 -18533 -18286 -16484 -11838 -12689
16417 -12689 -16832 -15379 -12439 -12821 -15905 -16855 -16944 -25069 -26772 -27787 -30614 -32051 -27899 -19935 -18488
16402 -18488 -13428 -7129 -3939 -4608 -7014 -5209 -4839 -4519 -5901 -6079 -10061 -10075 -6450 -11722 -18693 -15240
16386 -15240 -11222 -14137 -18697 -18418 -14447 -17895 -19339 -16048 -11844 -8587 -7183 -11951 -10754 -11056 -11322
16371 -11322 -7296 -10850 -16069 -19426 -21687 -16001 -10583 -6117 -3675 -3933 -3842 -5080 -3331 -4138 -9909
16356 -9909 -3270 -3980 -7474 -8876 -8644 -2859 3870 8493 12971 13931 11775 10451 11291 23170 32153
16341 32153 37391 51479 78521 124970 187534 230045 234642 214296 201081 219453 241740 230089
16329 230089 188521 142324 101248 76652 61504 48977 41367 43649 51209 72033 107677 157352
16317 157352 211422 232292 213144 194249 199557 220162 230545 201779 147769 100937 74674 55353
16305 55353 40121 23932 17760 16517 18005 19402 15440 8280 1095 -2363 -3234 -2624 -4952 -8057
16291 -8057 -8447 -8368 -9132 -12010 -13743 -12943 -7965 -3851 -6126 -7869 -8665 -6024 -8676 -9257 -7413 -8877
16275 -8877 -13041 -8416 -8280 -5226 -3447 -8511 -9470 -9480 -12323 -6498 -4706 -1968 -3158 -6161 -9140 -10364
16259 -10364 -7145 -8111 -11271 -18065 -18406 -14106 -13998 -14432 -17206 -16287 -13086 -12764 -13818 -14866 -13257 -16434
16243 -16434 -17714 -13570 -11727 -10743 -7656 -11228 -10808 -15215 -14132 -14760 -13213 -14712 -11671 -13020 -19108
16228 -19108 -22635 -22535 -19257 -18091 -16746 -9770 -4440 -2606 -9581 -11907 -7411 -6314 -10401 -15057 -6489
16213 -6489 -2768 -4155 -6481 -11644 -10788 -6695 -9553 -15554 -16180 -19277 -19271 -14972 -18708 -13851 -12138 -10809
16197 -10809 -10998 -14622 -19993 -20558 -12792 -8444 -3650 -1477 -4986 -6905 -12990 -18774 -17861 -16570 -13635
16182 -13635 -13069 -16857 -19262 -16550 -15125 -17217 -14074 -17091 -19396 -18239 -15783 -6019 -8183 -14615 -15096
16167 -15096 -14672 -17084 -17695 -20748 -23156 -18336 -21425 -24943 -20898 -21873 -23048 -25997 -20100 -15356 -14522
16152 -14522 -12952 -13084 -15283 -16858 -17031 -9199 -6584 -9954 -12420 -12356 -11870 -14748 -15715 -13117 -12336 -8874
16136 -8874 -5943 -15994 -22824 -21027 -19003 -15624 -13468 -16192 -16340 -21651 -20013 -17124 -17090 -14787 -13622
16121 -13622 -14816 -7954 -6585 -14045 -16498 -19055 -20772 -21226 -27673 -28421 -25313 -28132 -22470 -20381 -20024
16106 -20024 -17288 -13878 -11947 -11083 -11126 -12511 -14027 -12984 -12091 -13290 -6472 -3964 -7048 -9456 -8533 -10874
16090 -10874 -12207 -7212 -3287 -2977 -6385 -11052 -13324 -7197 -5288 -6921 -12676 -14648 -12373 -12739 -11907
16075 -11907 -12076 -11359 -10637 -7624 -7318 -8045 -7153 -11794 -12686 -12828 -7426 -2201 4484 1935 -2214 -3595
16059 -3595 -7087 -11618 -18500 -23912 -25038 -20418 -12259 -4704 540 1825 -627 -2782 -6731 -11072 -11991
16044 -11991 -17218 -18541 -17190 -18651 -15212 -14002 -19680 -18427 -14579 -19142 -19376 -17728 -14843 -12745 -10261
16029 -10261 -6648 -7961 -9828 -8382 -5650 -9044 -15853 -12452 -10422 -11349 -13870 -11591 -12809 -13226 -12507
16014 -12507 -14743 -13628 -11016 -9341 -5854 -7493 -6115 -6470 -6193 -7059 -14164 -17601 -10808 -5404 -8328
15999 -8328 -7598 -8471 -14599 -14733 -18874 -22548 -18114 -12512 -15692 -21714 -19537 -16129 -17242 -17832 -13441 -6894
15983 -6894 -9006 -8828 -11261 -14496 -8978 -9265 -12441 -12273 -13457 -11927 -8025 -5316 -4150 -1678 -985 -7080
15967 -7080 -10746 -11107 -11490 -9147 -6983 -3521 -7002 -12607 -15096 -16584 -16763 -16755 -12200 -12136 -16855 -19905 -19560
15950 -19560 -17483 -13320 -9859 -6580 -8939 -12222 -14674 -14918 -16601 -10918 -6977 -5126 -5036 -11525 -17023
15935 -17023 -18780 -17083 -15150 -15653 -14990 -12675 -14098 -15265 -17604 -16821 -15177 -12581 723 4068 3753
15920 3753 2501 -2948 -10337 -10872 -11037 -11106 -7071 -7806 -10584 -11034 -13649 -17286 -14746 -12942 -11714 -7935
15904 -7935 -11429 -11350 -12773 -16514 -17575 -21821 -18042 -9928 -8355 -7438 -10439 -10307 -13831 -17942 -18380 -17480
15888 -17480 -15388 -12836 -12830 -14174 -14950 -14784 -12433 -11927 -11098 -9146 -7956 -5936 -7753 -9656 -10587 -13240
15872 -13240 -11592 -6590 -11029 -12411 -9118 -4920 -4013 -8020 -10174 -13187 -17191 -16638 -17011 -15778 -13441
15857 -13441 -14124 -13489 -6599 -4144 -9460 -9453 -10642 -15407 -17307 -15569 -10283 -7933 -8632 -12039 -11336 -10941
15841 -10941 -6864 -8478 -9259 -11826 -10866 -8786 -13294 -13161 -16474 -15425 -12772 -13126 -13894 -13855 -6748 -4735
15825 -4735 -10216 -12229 -9711 -4964 -2473 -4301 -9703 -9604 -9342 -11218 -11996 -9563 -7943 -6482 -10359 -7469
15809 -7469 -4202 -5053 -6331 -8949 -9140 -10009 -5211 -8191 -12113 -13391 -14046 -13108 -14857 -14514 -9359 -4287
15793 -4287 -8837 -16047 -18800 -18611 -16160 -17015 -19509 -18247 -15803 -14974 -14098 -9297 -3538 -11220 -12969 -9081
15777 -9081 -2506 -651 1497 -3185 -3842 -7541 -9580 -11180 -15424 -20393 -19130 -16877 -12674 -8038 539
15762 539 5066 8888 5715 -7038 -17095 -15465 -12916 -11550 -9726 -7649 -8023 -6158 -6182 -5472 -4327
15747 -4327 -7220 -8899 -7150 -5824 -6367 513 3677 4407 -1361 -11857 -12399 -10562 -11019 -9420 -13196
15732 -13196 -15172 -14094 -15189 -17788 -20971 -20813 -18901 -15516 -12961 -15165 -18499 -19354 -18751 -14423 -9424
15717 -9424 -9235 -7260 -3256 -3532 -3796 -7029 -9505 -13531 -16698 -14444 -13038 -14802 -12615 -12120 -8308 -4457
15701 -4457 -1988 -3786 -9286 -10641 -15247 -15476 -18713 -19348 -14703 -9004 -4331 -4494 -7328 -5941 -6815 -10598
15685 -10598 -13855 -12063 -8111 -5726 -4198 -8026 -6078 -4557 -3725 -6191 -8265 -4603 -5653 -6333 -3742
15670 -3742 -3994 -6630 -4889 -3788 -3009 -2314 -3735 -7071 -5780 -1736 -3740 -8253 -10831 -7883 -3503
15655 -3503 1652 4895 -3446 -11028 -11415 -12195 -10515 -6133 -5259 -6739 -8837 -5201 266 30 -2062 -207
15639 -207 1995 1470 -885 -5220 -8235 -4725 -1218 -3621 -9876 -9070 -9733 -11397 -11661 -12025 -5114 -6426
15623 -6426 -12478 -10957 -12409 -15117 -11787 -4470 -5923 -6804 -8451 -7203 -9610 -10541 -14247 -11748 -6429
15608 -6429 -7449 -8418 -7832 -8534 -9499 -8914 -5664 -6113 -2972 -1388 -2902 -4863 -2852 -5401 -8867 -8677
15592 -8677 -6522 -11011 -9849 -8528 -11551 -10107 -3426 5251 3532 -5226 -8563 -6861 -5004 -5815 -8181
15577 -8181 -8772 -6136 -8320 -10621 -9235 -10435 -12370 -12459 -10211 -6396 -6272 -7778 -11889 -10922 -11812 -9951
15561 -9951 -10784 -14362 -16485 -12254 -10225 -9737 -10033 -8435 -5746 -7288 -7053 -5194 -7652 -6236 -5549 -5995
15545 -5995 -3312 -4670 -3299 1567 -2222 -5367 -6979 -7707 -6521 -2666 -6781 -10532 -11156 -7393 -669
15530 -669 1110 -990 -6244 -7170 -6898 -9633 -11370 -9935 -10675 -14139 -11122 -4243 -3839 -11756 -10744 -6105
15514 -6105 -3546 -7829 -7033 -2275 -3648 -3954 -6433 -5920 -5156 -2903 50 2973 3278 -1675 -6986 -9610
15498 -9610 -8887 -6598 -12100 -13169 -8526 -3924 -5684 -8043 -9930 -12314 -16576 -13499 -6234 -3651 -10336
15483 -10336 -12987 -10112 -11233 -15704 -14078 -5136 -4618 -5765 -3462 -7418 -13757 -11266 -11284 -12024 -8103
15468 -8103 -3979 -5929 -10798 -11489 -9447 -4729 -1871 -2618 -3507 -5229 -15302 -22037 -21071 -20899 -16824 -9748
15452 -9748 -10160 -11984 -3213 -1356 -174 199 -797 -2449 -7760 -10351 -9590 -9100 -5252 -6138 -11753 -13091
15436 -13091 -9095 -2831 -5130 -5688 -4226 -6375 -9915 -9916 -7664 -7950 -8838 -9079 -9659 -8858 -10584 -13936 -14762
15419 -14762 -14873 -14600 -17574 -18068 -23143 -21915 -18445 -16167 -13064 -10248 -6331 -9686 -12791 -11762 -8230
15404 -8230 -9831 -9070 -8282 -3247 335 -477 -1291 -2154 -4988 -8200 -11099 -5239 -8048 -8500 -11575 -12625
15388 -12625 -9937 -7457 -5749 -3161 -3448 -4736 -182 2103 1594 6347 7217 963 -13 861 4963 1271
15372 1271 -2856 -940 -903 -1943 -3152 -4957 -6801 -7160 -10067 -13789 -14482 -10554 -10399 -13842 -15477 -16673
15356 -16673 -12631 -10512 -13521 -17101 -14183 -8004 -2498 -3692 -7694 -10269 -9804 -9366 -5328 -5893 -10987
15341 -10987 -11251 -14137 -15837 -11244 -7682 -9032 -12947 -15702 -13614 -9174 -7239 -5148 -2117 -974 56
15326 56 -3474 -4718 -3518 -1361 -4194 -3579 -4248 -6349 -8153 -3493 -4572 -5915 -10677 -15978 -12876 -11944
15310 -11944 -9037 -5216 -1557 -2273 1631 -3189 -4869 -6518 -9845 -13561 -15135 -16445 -12287 -11067 -14375
15295 -14375 -15309 -17842 -15628 -16521 -16431 -13514 -7042 -7628 -5006 -3317 -2469 -122 -2030 -4019 -9282 -9972
15279 -9972 -9847 -9324 -6488 -1188 -992 -923 2811 -3186 -868 -3920 -8382 -4693 -776 -3480 -9326 -11316
15263 -11316 -9388 -5559 -1528 -120 1852 1065 -4162 -3101 2668 2099 1477 -5384 -5089 -2485 -4379
15248 -4379 -1105 4692 1063 -1624 -5071 -6354 -5041 -2596 -4937 -7256 -8393 -4218 -1129 146 1175
15233 1175 -1181 1777 5352 3529 2154 -1696 -3724 -4564 -4068 -4283 -6702 -7457 -8264 -4214 -3394 -7391
15217 -7391 -10209 -9733 -13034 -12351 -7947 -5342 -4598 -2174 -4018 -7139 -9882 -8285 -7189 -12494 -14491
15202 -14491 -15410 -11975 -8450 -9117 -7865 -5758 -2390 -3572 266 -1277 1429 -1339 1776 4636 6802
15187 6802 3498 -2424 1400 5909 7945 4562 -1465 -3144 -586 2181 1785 1720 -4011 -6513 -4932
15172 -4932 -1635 -4470 -2301 -2333 -8235 -12969 -14901 -16901 -18147 -17914 -17188 -13520 -16220 -15347 -10779 -7978
15156 -7978 -4866 -1569 -2125 -9585 -5546 -448 -4459 -10035 -12122 -14982 -14188 -10800 -7478 -10658 -8168
15141 -8168 -5378 -2001 -6490 -7874 -5836 -5298 -1177 -349 -9 3698 6184 3023 1542 -1203 -10028
15126 -10028 -11535 -7550 -7977 -8307 -9293 -8666 -8526 -8723 -66 1584 -518 -6610 -4127 -5771 -6921 -4587
15110 -4587 -2529 -720 -4205 -6185 -4857 -7097 -4354 -380 -3880 -7462 -6030 -6493 -10058 -11859 -10226
15095 -10226 -8258 -5612 -2553 -2879 -3940 -7395 -10336 -9817 -8337 331 6307 3236 -2523 -2767 -4242
15080 -4242 -9281 -9414 -6864 -9929 -11487 -10103 -8416 -4887 -2317 -978 -2610 -2436 -3793 -6105 -8084
15065 -8084 -7716 -5828 -4764 -5862 -4663 -4588 -4347 -811 -1728 -3487 -6814 -9988 -4541 -2552 -4521 -4834
15049 -4834 -1629 -2304 -4774 -4500 -4827 -5643 -2236 -4864 -10789 -13179 -10467 -9354 -8957 -10390 -3347 -6642
15033 -6642 -7418 -5640 -5508 -7638 -8934 -9046 -8614 -8175 -9045 -6889 -7657 -11266 -9971 -10269 -7158 -5479 -2426
15016 -2426 -2965 -7762 -7047 -10073 -12700 -6448 -1098 -40 -274 1126 -1382 -4099 -4312 -9055 -11107 -10252
15000 -10252 -9905 -5791 -1272 -1234 1914 2611 1994 -221 -7825 -9472 -5207 -5314 -4901 -6109 -7929 -11680
14984 -11680 -9296 -7182 -6153 -7361 -10183 -8867 -1918 2666 1421 2112 4177 8382 6697 6020 7522
14969 7522 7967 7082 583 -2330 -3177 -7751 -6148 -6382 -4327 1379 -1299 330 -456 -422 -1059 1812 -118
14952 -118 -2719 -1249 -720 -4467 -11290 -10391 -7021 -3472 -3444 -4308 -1376 -3977 -7591 -6210 -8265 -5795
14936 -5795 -4622 -4341 -4617 -1461 -314 -62 -2946 -1224 -2491 -1096 541 -1772 -2931 2990 6520
14921 6520 3974 3166 4708 893 -5059 -5446 -5637 -3327 467 4434 1903 -1210 -1969 -4392 -1942 -3101
14905 -3101 -11474 -7573 421 1785 4983 640 -4719 -5700 -3881 1729 -1240 -5981 -10562 -10223 -1006
14890 -1006 6577 17869 23027 18901 7548 1461 -623 -4503 -4084 -7162 -7194 -9746 -11134 -7256 -1262
14875 -1262 4427 3339 2642 4888 -422 245 1853 1435 4198 11555 14771 11047 11092 14309 24013 18722
14859 18722 8089 -538 -7925 1273 13683 12842 6998 1047 -10136 -10170 -7917 -7383 -6977 -8410 -11105
14844 -11105 -8324 -5255 3559 5835 3032 719 -1524 2884 8719 12455 6980 -367 -336 1575 1483
14829 1483 2795 1362 -3610 -3279 -1797 -3520 -1278 2797 4174 1123 2617 2206 -2024 -3355 -4155
14814 -4155 -1989 3464 1300 -1602 601 1809 3185 6661 1751 -2003 -2654 -5810 -2347 -6727 -7477
14799 -7477 -6470 -1898 4492 5650 1804 2921 2281 2013 1541 899 -2123 -2803 -1271 -2892 -87 -1993
14783 -1993 -9057 -6596 832 -2709 -8051 -9951 -5922 -9447 -10626 -5540 -1192 9570 20697 26918
14769 26918 25947 29594 32804 30878 27887 19837 10034 -2580 -10520 -8225 -436 -2347 -641 364
14755 364 -2408 -7483 -8604 -3931 -2032 -5547 -8853 -8929 -12893 -13763 -9509 -5120 -1466 -780 -520 955
14739 955 -1951 -2391 -1477 -3022 -3665 -3315 -3436 2946 1461 -1329 3445 5391 2678 -3248 -5119 -4134
14723 -4134 -6688 -6282 -8243 -7435 -2208 2679 2133 -602 -4932 -5223 -5812 -4966 -2755 -756 3923 6846
14707 6846 8353 10469 4419 929 -760 -4286 -7280 -5533 -661 2729 1801 -1606 -2165 1261 -2209
14692 -2209 -5671 -433 475 -4719 -3970 -1206 -3045 -3045 -4903 -4386 -4280 -6126 -3689 -2284 -1647 -4272 -6240
14675 -6240 -848 1160 242 -106 1560 -622 -4454 -3149 -4630 -1745 -1349 1778 5512 8754 10206
14660 10206 10802 4632 2878 1682 5832 3163 1304 -519 8349 10845 7378 6924 5989 2763 4387
14645 4387 6208 2913 -1260 -3249 -4457 37 1397 -7643 -8928 -8219 -11281 -7622 -7205 -6795 -10669
14630 -10669 -12142 -8477 -9377 -13534 -18111 -2711 38157 83643 102700 82021 37785 -1576 -14346
14617 -14346 -10061 -5106 -4436 -911 6063 6995 5303 7475 9409 6855 7135 7626 6562 2851 2053 -394
14601 -394 -232 2291 2356 2544 7554 6098 5949 2364 4062 4963 6408 6838 3820 3077 3070 2551 1943 3179
14583 3179 3686 -974 -4187 -3693 -2361 458 -1499 -1096 307 -352 -3472 -5633 -4866 -3332 -5450 -2796
14567 -2796 -795 -5011 -9167 -8860 -7868 -8830 -4387 135 -869 -147 -4423 -3927 663 6603 2886 -644
14551 -644 1763 3301 1436 109 -1613 811 -2289 -1391 1988 4719 4055 4954 6156 9084 11281 8489
14535 8489 3100 626 -2265 -358 1289 -1799 -2519 -1010 -1270 2340 7553 11348 12955 13214 15637
14520 15637 14939 9135 6980 8514 2762 2077 6310 9345 6811 3911 -2196 -1974 -899 1249 2629
14505 2629 5880 7183 9558 13517 15044 14339 5036 1409 -2390 2786 7384 11375 12311 8375 6729
14490 6729 6246 1564 -2339 -2024 -2804 -99 557 788 4018 2794 -4599 -9035 -8637 -8715 -9541 -6338 -4291
14473 -4291 -1615 565 2861 10196 12558 13972 8500 7503 6779 8968 10304 16027 16798 15417 15406 6310
14457 6310 117 1328 3811 3979 7928 3796 1941 -2015 531 999 -2227 -118 3415 5160 3911
14442 3911 2344 2170 4099 6833 8369 8857 5121 5821 4902 5623 10001 10431 8599 6828 9231 9856
14426 9856 10216 7938 10780 8858 8781 9076 7470 2176 2743 1766 -1060 270 9381 10156 6240 3889
14410 3889 -3189 -1625 460 1784 6181 3469 -75 -384 496 3874 3735 2416 620 4948 6151
14395 6151 14387 16008 4460 2132 3753 3461 7251 7235 11671 12173 12992 10402 6175 9489 13786 10345
14379 10345 5707 5420 9142 3595 178 -2254 -4073 -7206 -7723 -9661 -5879 -3135 -512 -3227 -4281
14364 -4281 -1751 -2552 1196 6112 8335 6740 10663 9423 7854 10229 12952 5108 -315 4070 6611
14349 6611 2757 3473 6803 7363 8532 12879 11415 12404 15471 21128 16558 8622 9074 8541 7978 9655
14333 9655 11721 12534 11273 11775 9821 6667 6743 7432 2952 2163 3855 414 -4892 -5813 -2302 -455
14317 -455 2311 5910 4903 7437 3583 2505 -1908 1114 3998 5000 2589 -248 -1388 216 -3907
14302 -3907 -9539 -7076 -4638 -389 2314 4146 3642 2222 5267 8931 9254 11518 10154 9213 12965
14287 12965 11263 5818 5367 1284 -616 194 6485 9970 10676 10814 6272 9982 9513 6614 9089 11853
14271 11853 13078 11112 9163 8954 8636 7439 9063 10828 13736 13626 13243 13669 13257 16492 17942 20250
14255 20250 22103 21519 19436 18362 18649 19015 17367 11987 11771 13423 9505 4621 6262 3638 3276 6695
14239 6695 8825 10124 7395 7639 8364 4216 1457 4696 6435 2999 69 -4655 -525 -572 227 305
14223 305 3356 2919 1668 512 -1368 -3880 604 2039 2594 5521 15255 11725 14199 12795 10785
14208 10785 7938 9166 8525 11513 10612 11718 13504 12016 12509 10694 12152 10190 10985 14191 13895 12766
14192 12766 10160 12088 11646 14659 13491 9163 9259 10395 16078 17240 13820 15741 19085 18724 21167
14177 21167 18116 19518 23335 25301 21361 18049 17314 25584 32321 42343 53275 63790 69296 65687
14163 65687 67130 65195 59329 54795 45210 32562 28212 23291 19710 20225 16860 18209 14880 10179
14149 10179 5438 3215 7911 14292 10788 8082 9583 11487 12302 11117 7375 8114 11351 17888 18868
14134 18868 8477 3839 6251 10763 15370 15435 14147 9010 8734 10162 8341 9395 10935 15195 9690
14119 9690 9142 11046 11014 8967 5453 3372 5620 7916 8972 4988 2661 3336 7479 7323 7736 7646 3638
14102 3638 9492 17054 21182 19269 13813 8420 6490 3223 3498 5077 5746 4786 2097 -617 -1666
14087 -1666 1702 8053 11631 17164 14384 15920 15614 9607 9487 10808 14880 18136 19137 20045 19580 21171
14071 21171 23582 26371 27376 26833 30242 29871 25026 22112 24615 27507 26223 26657 25174 20274 15396
14056 15396 15013 14340 9199 8564 10310 14302 18901 19929 22089 22080 18959 21204 22945 19650 19043 21324
14040 21324 17593 13482 13838 14509 9811 7476 9959 11760 12239 16206 25548 29909 24078 13435 6818
14025 6818 1686 1975 -1804 1314 3430 6234 7329 3986 7221 14271 17726 13601 12604 13880 11323
14010 11323 13791 16430 16579 16356 19650 20584 18791 22800 24247 23573 22132 13983 12032 11298 8185 12845
13994 12845 13753 16050 18037 20777 21235 25019 17719 9834 6249 8136 9644 12294 14837 11305 14783
13979 14783 16235 14639 20229 23105 21210 17926 14265 10866 12272 13159 15224 20677 23621 23281 22394
13964 22394 18975 12689 10965 12603 13608 17525 26130 33509 36942 36480 36083 33286 33631 37185 36724
13949 36724 25757 19525 17698 15449 16185 13183 12178 14456 16010 21183 16251 12052 15403 17121
13935 17121 17223 17470 17627 21973 27974 29291 25200 23486 23578 22137 17520 14471 19432 25306 28937 26658
13919 26658 22972 19403 18894 17238 13042 9760 14333 14352 16575 14787 15606 17343 16863 15035 15175 20218
13903 20218 20621 21046 20104 20470 21124 24099 24996 19390 20524 20714 19965 19860 16819 13505 14924 18224 17908
13886 17908 15417 14157 16125 20261 21856 23974 17778 19725 19202 18475 15027 13846 14841 15465 16387 13662
13870 13662 19241 13610 10648 8744 14737 15918 11433 10751 8852 9976 14271 14177 10723 13851 9827
13855 9827 6261 12994 17313 20831 16921 15465 14386 14362 17521 21738 13425 12300 10702 9487 6325
13840 6325 6822 10174 13648 15265 16686 19342 21161 22190 17593 20907 20248 19518 19197 13359 11005 12473
13824 12473 12339 15763 16661 16638 15302 17688 16299 17336 15765 20771 20082 15736 16460 18645 19465 14997
13808 14997 13417 14164 15346 13536 14834 17693 20073 16030 13915 15039 14097 16093 18697 20606 21211
13793 21211 20146 19986 20963 17144 14652 16206 15349 20925 26780 25829 23997 19690 14420 14696 16519 17200
13777 17200 20404 21507 18970 18171 17486 22455 22399 22936 26925 25462 18789 11757 12617 11949 9180 13136
13761 13136 14078 15659 15832 12691 16016 18814 24323 23385 22242 23856 18839 20448 21354 26008 24960
13746 24960 20677 22228 27907 27137 20804 18239 15836 16247 17114 13870 9350 10332 10283 17466 25515 28348
13730 28348 29037 30616 34523 31104 21889 18793 20933 18162 18500 19373 18520 24560 20747 11581 5041
13715 5041 5538 12337 14811 21716 30543 36780 38272 37137 35436 36291 36829 37192 29335 26589 21262 19813
13699 19813 15722 17402 17081 15419 15024 16102 17769 12619 11725 14509 20332 23087 23409 27386 28415
13684 28415 30376 34613 39639 49186 51219 52503 53920 52655 49653 47291 44293 32247 22904 21563
13670 21563 26079 30102 31094 35923 43972 50668 53028 45296 42095 38115 30186 22955 17675 12497 14434
13655 14434 21671 25628 29471 33514 30932 28878 29261 31566 32154 38881 38982 38040 33769 26495 24951
13640 24951 25376 30782 30962 25616 20503 18976 19758 21218 23801 23522 21852 21655 20312 25795 34207 35640
13624 35640 30318 29327 32832 34551 30413 30121 27852 23826 22168 24478 23767 25817 29188 26641 24985
13609 24985 27606 33471 32780 27863 28104 28672 28057 34776 40170 44924 41645 31413 29973 30394 28387
13594 28387 21775 24916 27803 27223 20102 22896 29136 30439 28729 25370 20418 22118 28115 31235 31820
13579 31820 27753 23787 24878 24421 24453 23887 26433 27602 27664 25416 22871 21386 26417 25337 27774 28216
13563 28216 30174 28902 26687 26096 25487 24908 30673 38935 42816 40805 31835 22326 20994 20595 14655
13548 14655 10489 15339 19819 22625 20570 21709 23306 26625 30309 36963 35496 31435 32576 35729
13534 35729 32047 32579 37233 36176 33319 30551 29619 29420 31910 31748 31055 30270 33086 29029 27293 31209
13518 31209 32150 33829 36316 33263 32900 33257 31722 32754 33554 34893 37557 34630 25383 22917 17815
13503 17815 17676 19761 23372 25013 25223 27353 28242 25179 20647 19571 26747 26506 26181 30913 27257 26353
13487 26353 27434 28176 28533 25715 25075 24279 25540 23986 25077 29433 34407 41178 38785 36617 35065
13472 35065 31867 31531 31853 36561 40648 37390 37816 33183 28996 28482 32112 27653 26542 28558 28854 30862
13456 30862 29563 26289 27661 32538 35047 34063 36742 38621 38012 34057 32109 36554 34723 34245 37958
13441 37958 36747 29881 29692 36547 40471 39474 40047 37083 38068 41683 44127 41274 43173 43917 39071 34452
13425 34452 30333 29570 30060 31991 34843 35590 36067 36604 36829 39162 40375 37157 40470 41463 37593 33070
13409 33070 38613 35449 35678 36912 34822 33868 34183 35489 35049 28849 27088 31411 37708 38241 39803 41995
13393 41995 42962 40550 38243 38961 39108 36758 31986 32153 34079 35808 33353 33441 36038 38005 39298 42665
13377 42665 43519 41920 35045 31320 33260 34677 35529 38917 42706 43447 44652 43360 41308 43230 39611
13362 39611 36260 37051 33479 30808 35413 40245 42249 47302 57096 69341 85309 106315 104227 86807
13348 86807 65427 55371 48884 45144 44037 39452 35699 32322 25149 25512 29604 35538 40129 42381
13334 42381 45327 42928 37307 41246 39596 35849 36995 33658 33823 34691 38824 44247 44529 40082 39230
13319 39230 40970 43085 41914 39555 39899 39940 36408 37168 41688 40389 37727 35129 32379 35824 43804
13304 43804 39945 40180 43533 46997 43617 35638 39049 40113 37883 41430 44206 41986 40740 44292 43518
13289 43518 33575 31146 38998 41595 39958 37117 38982 41391 42732 44478 47309 45339 44292 44284 42770
13274 42770 44881 52140 53811 56460 54547 52863 48411 42137 45546 47298 46950 44139 49603 55501 59898
13259 59898 56506 51362 49946 53424 59152 57261 57524 59564 57195 52533 51053 50173 51850 56776 59914
13244 59914 60705 59832 65284 64553 62159 58467 54986 48195 45000 46024 45514 44948 50317 51276 50968 51819
13228 51819 52688 55162 49459 44608 45024 49729 50210 52612 52776 50344 47163 43188 41339 43421 49169
13213 49169 55683 58740 66038 71423 64449 62906 62715 63740 66699 65544 64484 61916 63062 70498 73206
13198 73206 76282 77490 82407 85601 84081 82274 79302 76640 76282 77835 75028 71695 78241 84250 83879
13183 83879 88967 92148 88621 90532 97365 99923 103761 114189 126141 137071 154507 168810 173706
13170 173706 186448 208077 243695 296601 367377 471597 603092 744489 872681 968987 1028616
13159 1028616 1038952 1004958 923914 801528 661905 523310 405831 314919 250755 213709
13149 213709 187690 169739 154653 145532 140990 137830 130421 125520 119683 112774 111826 108272 106056 107385
13135 107385 106892 110769 115147 112242 108911 104435 102909 99124 89253 86845 85933 82279 88280 90935 92484
13120 92484 94618 94565 88403 80716 81099 87629 93862 92911 92642 93053 89188 84314 86386 94179 99868 96117
13104 96117 89270 87051 89789 92268 100331 100675 88173 84290 85476 90738 95755 96098 91423 90042 92205
13089 92205 91569 95228 98284 99739 102238 103398 103976 107974 107617 105901 110950 108572 104043 98351 96917
13074 96917 91223 89533 86034 86946 92017 96193 98983 105073 106864 98538 85629 79628 77401 84156
13060 84156 95230 105330 112073 122638 126585 127599 127164 126841 128570 134573 145823 151310 152525 155386
13046 155386 153661 158057 162595 171897 182879 194006 212141 230482 253081 284599 327035 395512
13034 395512 497811 672878 984756 1488519 2094914 2500572 2441884 1964469 1383324 941195
13024 941195 670683 509765 409417 346354 303595 269688 240813 219380 195541 175325 165192
13013 165192 161780 161605 159149 155740 149886 143013 139980 140073 147706 151523 156617 165367 172580 180155 191879
12998 191879 215576 238586 262959 284556 297996 298240 298014 293516 277585 256289 238448 214044
12986 214044 193681 184515 177048 168137 161351 156091 153873 154158 145909 146957 154244 158503 160586 162090
12972 162090 164238 165217 164564 168198 168830 167964 171435 179650 188821 198012 208001 206200 196478 191302 192890
12957 192890 197810 205070 203836 192118 184165 176488 177395 171314 169337 168447 174714 179504 182540 189031
12943 189031 198355 203931 207508 207851 207602 202738 195239 181437 172404 163030 151919 148616 145721 144095
12929 144095 144355 145384 151358 163200 173123 178625 173705 172422 174322 170373 163872 164155 170550 173899
12915 173899 174947 174121 180296 189803 197236 202529 206965 209670 210500 214883 220495 226398 230746 230449 230549
12900 230549 229772 232172 242187 250165 262415 284149 298569 317387 351431 377368 376878 356235 328555
12887 328555 310100 296879 286749 282667 280970 277545 276758 275973 276357 280791 291658 308763 328545
12874 328545 339689 340835 335503 317555 294231 277659 267199 263364 260175 262499 272144 288632 315760
12861 315760 337105 348249 355108 359248 364588 368565 376494 394423 426092 475223 529663 591856
12849 591856 641033 649806 622679 582316 548215 514330 486851 463554 445407 425246 409813 397112
12837 397112 386028 374287 371110 378741 386133 396282 403340 407203 406995 412677 434460 462632 488775
12824 488775 502787 514223 521990 528988 535729 539102 544337 548897 558980 570399 574778 578181 584172
12811 584172 582508 585748 587656 578096 574288 584423 597314 607436 616438 624185 632965 635379 641716
12798 641716 666254 715986 773348 825759 869543 897192 921827 938400 946555 958165 976762 1006624
12786 1006624 1046628 1086584 1127985 1179442 1243893 1319675 1405235 1499414 1601331 1716948 1842068
12775 1842068 1972076 2101448 2235322 2381033 2526363 2676657 2828155 2986953 3166921
12766 3166921 3376182 3633595 3959079 4374371 4908266 5615577 6525565 7629551 8846458
12757 8846458 10120788 11429729 12784575 14215721 15818496 17798176 20485451 24411633
12749 24411633 30449567 40003158 54995711 76878591 104187615 132072890 155746189
12742 155746189 173123096 183368849 184754829 176567805 160054640 137105450 110060823
12735 110060823 83241209 61251962 45686775 35309665 28390229 23731593 20560676
12728 20560676 18331572 16675240 15318767 14026016 12673614 11262819 9883148 8610047
12720 8610047 7503281 6590567 5865415 5274928 4770687 4330263 3952694 3635766 3363685
12711 3363685 3112766 2876817 2658026 2459784 2280133 2115799 1968716 1836106 1718944
12702 1718944 1613807 1527280 1450367 1377124 1306622 1240133 1175767 1122761 1081471 1057150 1027956
12691 1027956 998644 969928 948563 935494 920425 902494 882184 856990 852923 864390 890931
12680 890931 908987 909377 911620 914735 906105 883910 860335 843756 838202 826812 808296 789233 767737
12667 767737 742073 726914 723003 723086 722948 730128 732227 721007 708745 702942 708849 726597 752262
12654 752262 779030 807712 839452 869460 892659 925862 974834 1028578 1063243 1075198 1079181 1087835
12642 1087835 1118924 1178711 1266060 1367150 1456752 1524588 1563405 1598923 1650969 1734459 1844683
12631 1844683 1980544 2129282 2281516 2431908 2576373 2716206 2849141 2992734 3152799
12622 3152799 3339374 3572083 3858317 4185096 4525670 4878964 5256527 5698859 6257592
12613 6257592 6976415 7924464 9168974 10775973 12812033 15372361 18606250 22550417
12605 22550417 27093901 32253759 38602487 47624214 62014411 86236434 128308441 200314662
12597 200314662 303503562 400715788 441572650 404508958 312290824 213895418 142693930
12590 142693930 99305862 73013402 56469919 45727938 38335673 32605494 27644665
12583 27644665 23294098 19741662 17071747 15123224 13610430 12343515 11273458 10377613
12575 10377613 9556136 8658381 7722174 6910450 6276732 5759214 5289728 4861983 4474394
12566 4474394 4126811 3799913 3492977 3201529 2933081 2708775 2529298 2382445 2239082
12557 2239082 2091825 1936002 1776034 1622694 1494265 1401061 1343783 1314258 1285643 1236349
12547 1236349 1163178 1079423 1000781 942928 906785 889863 886826 887540 875677 859815 843482 834061
12535 834061 833361 835308 837877 838390 833351 836556 856301 897644 981396 1157506 1481679 2082146
12523 2082146 3144820 4536860 5318639 4780263 3474474 2316028 1602146 1188618 938928
12514 938928 778484 671851 588648 519053 475579 460003 460748 459549 452684 449026 457238 488367
12502 488367 564203 660086 735257 747400 683375 578630 475691 394953 322837 268154 228159
12491 228159 201996 188157 188998 193460 193951 188198 180517 167561 159610 157365 148678 135725 126264 123382
12477 123382 128720 125467 98873 74540 81835 142445 237307 337749 402150 376037 262388 117195
12465 117195 11377 -29473 -20981 2000 26935 46081 61086 72906 76839 72640 63639 53852
12453 53852 39999 28453 23151 16591 5535 2301 -10991 -31341 -37089 -36089 -26538 -4181 23363
12440 23363 51369 68089 63566 48972 39503 41906 45080 47922 43456 32268 20492 10113 4906
12427 4906 1420 6531 20396 33239 45020 53480 57377 69457 79340 91052 96798 96008 82955
12414 82955 68203 61999 63012 67743 80775 94167 108871 116152 109838 105369 108215 102926 83804
12401 83804 52507 20849 -6050 -29026 -44624 -51918 -40064 -17840 5533 18508 24977 22775
12389 22775 12904 5954 2520 4377 1629 3236 6270 6028 1411 -1823 -7185 -11466 -15063 -16288 -17143
12374 -17143 -17176 -18161 -15182 -19587 -19040 -19394 -28315 -26474 -20244 -11991 1073 12803 20274 23213 22981
12359 22981 21734 17111 21778 24739 30959 32041 27615 17186 2094 -15878 -26380 -27918 -20446
12346 -20446 -11224 -6375 -13489 -28604 -34082 -27454 -8558 17588 41587 58614 65760 66180 67696
12333 67696 73657 77456 78345 84513 94324 107020 124316 141772 161178 196957 248777 325305 438043
12320 438043 573659 707968 829591 922855 979777 987465 943688 857692 739919 602590 465808
12309 465808 350816 267531 207932 173135 149907 130582 116356 105268 92187 81036 69652
12298 69652 59004 45685 37599 28306 20198 16047 10153 2167 1751 4350 5671 -1345 -6177 -5057
12284 -5057 -2306 -7773 -12827 -5299 227 -115 -2616 -2851 5528 13043 17008 21603 29468 32794 35294
12269 35294 35985 30824 29568 28139 26570 30799 41034 47752 51977 52421 53603 63766 83536 97912
12255 97912 112541 137228 158332 175361 193458 211457 244171 290700 362475 479675 652312
12244 652312 895110 1222608 1607927 1988420 2314809 2551481 2668700 2654893 2503563 2235873
12234 2235873 1890933 1524587 1176635 886457 666481 505629 399032 331464 284023 254281
12224 254281 234615 218796 198648 181272 159533 141610 123107 105762 91912 78903 61281
12213 61281 50470 51075 51423 49454 49202 53682 54008 57127 63039 57497 53369 59507 71327 97641 139107
12198 139107 180674 221111 252453 269069 274417 271702 254964 222555 180360 142962 111510 88117
12186 88117 69480 62624 60018 59790 56655 49017 46680 44130 39433 34284 33797 38612 37472 37719 45138
12171 45138 50292 52373 50431 53742 67422 83171 101855 127875 158703 200780 261073 357180
12159 357180 535285 851913 1369121 1976820 2366475 2286826 1804706 1233426 799471 534448
12149 534448 379684 287338 224662 179224 145200 118355 95261 70684 51210 42435 34854 29989
12137 29989 25955 19059 12225 6529 6491 12296 15404 23679 32372 33006 29214 18646 12883 9618 12910
12122 12910 13129 9462 11718 21631 30723 34304 24021 7949 357 -5110 -13607 -17821 -18308 -17105
12108 -17105 -19624 -18460 -19957 -19808 -19266 -17423 -17511 -18254 -16645 -13401 -11783 -13714 -14776 -9335 -5779 -10346
12092 -10346 -11850 -15442 -18521 -15206 -18607 -19366 -15081 -10351 -9448 -2006 4629 6699 9743 9119 8453
12077 8453 10240 11713 9800 6122 1008 -713 -5785 -8236 -11078 -15151 -7758 -629 -3831 -6343 -9142
12062 -9142 -13305 -15061 -16251 -13410 -10796 -11566 -9599 -10271 -8714 -9119 -8247 -9814 -9884 -5226 -6542 -6989
12046 -6989 -7420 -8309 -14017 -13024 -6325 -5350 -8141 -13886 -13653 -9072 -10237 -12608 -11573 -9438 -4635 -6685
12030 -6685 -8675 -11078 -12384 -16820 -17481 -15989 -15988 -16147 -13416 -10260 -15586 -19224 -16699 -16324 -19955 -16706
12014 -16706 -17440 -13592 -10835 -12722 -9748 -13839 -18273 -24122 -21488 -23899 -23197 -14822 -10437 -10358 -7748
11999 -7748 -9292 -15266 -14816 -14197 -14847 -13068 -11907 -14315 -12457 -6904 -3407 -3236 -3340 -4326 -14768 -20837
11983 -20837 -15074 -13533 -13740 -16958 -22561 -21335 -16845 -12750 -10759 -11580 -13583 -10313 -11584 -12158 -10467
11968 -10467 -8631 -6859 -6561 -7185 -6987 -7690 -8804 -9172 -12633 -16642 -14539 -10336 -13624 -18266 -20808 -13822
11952 -13822 -8643 -14260 -17400 -18493 -16042 -18020 -19419 -15263 -8733 -10913 -17072 -21458 -19162 -15856
11938 -15856 -15509 -17385 -10070 -4424 -6094 -4083 -2632 -9193 -16435 -19992 -20565 -16659 -14319 -17893 -20858
11923 -20858 -23035 -18987 -16556 -11156 -12753 -10736 -8704 -14614 -12212 -10425 -13108 -8424 -3079 -9094
11909 -9094 -12028 -11181 -8246 -4777 -5560 -8265 -13478 -14134 -16915 -16931 -17040 -16800 -11718 -10346 -9103 -7896
11893 -7896 -12837 -15746 -16812 -16786 -16697 -14340 -15477 -14386 -9593 -6623 -10467 -11406 -13546 -12049 -12424 -16817
11877 -16817 -14167 -21058 -21912 -18366 -20509 -15022 -12822 -10654 -12820 -18242 -15724 -16429 -14370 -12394 -10830
11862 -10830 -9211 -2811 -920 -2003 -6114 -9356 -10362 -13189 -16504 -18415 -16811 -12726 -5840 -4958 -8867
11847 -8867 -7571 -2115 1507 -124 -4603 -3464 -720 -2116 -3750 -6962 -5985 -3277 -7215 -13542 -14034
11832 -14034 -8517 -8344 -10381 -11077 -13270 -14295 -12698 -9451 -5319 -5274 -6626 -4117 2017 2671 809 3470
11816 3470 1509 -1069 -560 -1280 -6426 -5505 1215 -181 -2612 -8672 -14444 -11781 -12241 -13436 -13560 -10242
11800 -10242 -11795 -13994 -15065 -11911 -10253 -3174 -455 1629 52 -2967 -2874 295 -1230 -4387 -4578
11785 -4578 -7119 -12080 -15136 -12153 -7302 -8488 -10233 -12593 -14186 -11186 -9510 -5349 103 3497 5199
11770 5199 -412 4 1729 509 -3520 -4162 -6624 -6580 -5300 -8959 -12179 -14875 -15607 -12327 -14508 -19840
11754 -19840 -21421 -21194 -19742 -15138 -9877 -5564 -6533 -7073 -7705 -10155 -10894 -12298 -12095 -9777 -12424 -18049
11738 -18049 -16061 -17013 -16543 -12425 -10778 -10070 -6664 -5001 -7092 -11772 -13977 -9521 -7686 -14742 -18854
11723 -18854 -21567 -15374 -15148 -21010 -21686 -18581 -13404 -6257 -5441 -14114 -13544 -11732 -12421 -12188 -5573 -2906
11707 -2906 -2592 -5742 -7737 -9766 -14940 -15822 -7356 928 -1203 -4406 -11580 -9332 -7730 -7583 -4815
11692 -4815 -7502 -9185 -8631 -9893 -5536 -3433 -2726 -7123 -8345 -10252 -9763 -5349 -6303 -13133 -10114 -3554
11676 -3554 -2763 -1893 -560 1963 -3913 -7602 -4950 -4120 -5029 -9739 -7666 -8203 -6575 -2200 -528 -3732
11660 -3732 -6444 -4988 -3833 -5255 -5102 -6856 -5640 -7601 -10933 -16524 -15826 -10930 -9943 -2285 4427
11645 4427 2427 -1266 305 -3656 -3907 -1177 -1579 805 3277 -1389 -2125 -3711 -5731 -6318 -6730 -5945
11629 -5945 -4449 -5282 587 588 628 -1824 -4896 -3203 -3420 -3084 -2049 -3281 -6275 -5724 -9340 -10189 -6939
11612 -6939 -4555 -2717 -211 3033 5037 3507 -951 -1036 -44 552 7245 10902 5352 891 -2000 -2437
11596 -2437 -10257 -14614 -12195 -6998 -2971 152 -530 -3976 -362 247 1053 1544 -2127 -3154 -1001 -3893
11580 -3893 -11213 -11010 -7846 -5184 -169 2141 480 2679 2995 1311 1092 -3293 -972 5228 5610 3526
11564 3526 2299 2577 -1011 -1925 -3764 -2037 5301 3981 -1227 -4912 -5145 -9185 -884 8316 5833
11549 5833 8372 13548 8249 10139 8913 12210 8772 5283 2595 4162 3520 -633 -2042 -4300 1728
11534 1728 6576 4834 1421 -2002 -4904 -2228 -660 5163 8389 -203 -7831 -16056 -17622 -10481 -4863
11519 -4863 -5362 -3727 -1152 487 3828 4278 8130 5793 1226 2683 2838 6563 7365 7192 5283 13217
11503 13217 16914 14102 13447 14271 13701 3937 -1848 -1848 -3 -5288 -3989 -2843 -5208 -5758 -3410 -6559
11487 -6559 -6905 -3372 106 2800 -870 -1631 -1624 1356 872 1780 6921 8770 5198 276 1018 1520 699
11470 699 -464 3665 6641 9225 5327 7222 10068 15110 12862 9217 7630 6313 6121 4482 3052
11455 3052 2486 2731 771 188 2469 -2987 -2786 1679 3511 354 481 1617 2963 3091 3255 3026 1236
11438 1236 6223 8412 5489 6106 7211 5747 3111 4323 10177 13062 14968 11743 7799 9534 12269
11423 12269 9672 4567 5203 6857 6776 7656 5107 2388 -405 -2242 -1192 4426 4953 2727 5290 4861
11407 4861 6167 4172 4090 5812 7414 6586 9550 12206 14586 18527 14189 12482 11869 9678 7363 6429
11391 6429 992 -1005 -884 209 -981 -3725 -3107 -860 3819 5897 9657 12582 15674 11134 12359
11376 12359 12267 10007 14262 14204 12156 6970 5209 9323 11680 8451 8995 8755 6930 8027 6640 7957
11360 7957 8371 8906 10797 14719 12972 10508 9238 9125 6934 7391 4455 9546 8669 8769 15977 10896
11344 10896 6056 2723 2925 5909 8448 9648 11158 10345 9710 9500 10327 12114 9313 8662 10502 15344
11328 15344 23374 28672 29625 28984 27342 23381 20692 10795 8500 10100 12894 15022 11161 10309 12447
11313 12447 14301 16462 13320 15884 17789 18686 20020 20054 21509 24983 19954 15114 15461 14135 13098
11298 13098 11827 10497 7186 12622 18430 15120 13579 15114 18674 20047 20470 16218 12368 9187 6586
11283 6586 11552 17809 17992 15558 8944 5899 5226 7425 9281 11828 16364 14478 12533 10206 16744
11268 16744 18009 14159 15109 15164 14366 16407 18912 17786 13137 12960 16844 18368 18968 22849 18801 16058
11252 16058 20364 22078 22024 23290 20926 17899 19173 21372 23921 26147 21339 18955 15340 15977 24768
11237 24768 25460 22660 21816 19637 19591 24901 28604 21939 17582 15795 11581 7895 6935 13998 19111 23882
11221 23882 24911 24962 31830 28630 23380 27504 26481 23174 21693 23872 28203 31765 30620 30208 29984
11206 29984 34105 40324 47807 48574 46145 41274 33594 28864 23427 21725 21297 22140 27188 29289 27316
11191 27316 26035 28734 34789 43688 48990 46515 42484 41626 42013 38510 35586 35590 31503 29121 29502 26505
11175 26505 24366 29439 28098 24077 24583 24029 20792 25898 27007 17867 20388 23351 21662 24967 27107
11160 27107 28075 31079 36996 39268 35379 30637 23641 21861 21469 25477 23491 19928 24830 27134 27895
11145 27895 31431 27909 26831 33649 38468 39229 31198 31429 33366 32156 37178 37580 30470 28113 30321
11130 30321 27703 27333 30892 28913 21824 16481 16715 17750 16011 15619 12979 13029 18173 24976 28612 31717
11114 31717 36172 33490 30662 29694 27332 26052 27116 25870 30678 34547 35366 34251 37661 32745 24685
11099 24685 25733 28872 33684 35583 33810 30293 28961 26084 31568 35312 33494 33517 38068 42200 41258
11084 41258 36757 39592 45823 48258 49423 49678 45346 42868 44336 43904 44360 43751 43774 37470 40885 42620
11068 42620 48823 54504 54208 55271 59847 60788 60166 57843 51846 47160 47394 45054 43663 45639 45966 50090
11052 50090 50617 43771 38092 25678 19358 16854 12974 15574 20703 25981 24020 28141 35320 43208
11038 43208 49749 47972 43377 46497 58502 69424 76125 79684 80471 78990 77751 71528 68607 68189
11024 68189 71250 82021 89063 87269 78507 76475 77876 74987 75532 70469 66255 71739 80303 83378
11010 83378 85060 88931 92557 100945 108213 116500 124115 131186 139002 145792 147596 161401 170204 184804
10996 184804 204203 229182 264852 315722 392540 522417 739461 1088202 1610682 2183873
10986 2183873 2418388 2109507 1542767 1063421 744384 540363 407674 320110 265567 225318
10976 225318 194295 170283 156962 140571 130785 126174 119733 119158 118549 115371 108921 104403 105128 107777
10962 107777 104026 97792 92006 85800 81426 72854 74948 77765 82893 85829 86979 78157 75700 75991
10948 75991 74316 72468 78186 78329 73086 66743 64184 65153 68888 67062 68626 69690 70212 71295 70376
10933 70376 64132 61192 60523 64289 66233 68651 69567 74757 76221 79378 79856 81710 81087 83158 83162 86934
10917 86934 96337 100113 97410 97801 101186 93813 90701 81283 78662 88785 86981 83251 82770 88591 93325
10902 93325 93308 92898 92742 95592 96038 95643 91687 85894 83400 86116 86777 85351 82164 77602 76718 73524
10886 73524 74916 76215 76618 77681 74222 76060 74155 68997 69481 69971 68572 68929 69841 74683 84665 84625
10870 84625 78983 76351 73244 66738 69483 71664 74022 69867 66758 63982 65864 71102 79971 78430
10856 78430 75419 75322 73325 75559 78556 83716 85227 81530 77601 80207 81003 73738 66167 65590 73172
10841 73172 72364 77346 83436 84153 87346 90632 91483 95682 104693 111362 114333 114890 124803 138096 155645
10826 155645 196971 251335 305587 367613 411902 405167 365796 326517 288090 255126 225559 203507
10814 203507 189076 170831 147148 127139 114209 107542 106317 106832 100429 103773 107750 106379 103902
10801 103902 106160 112877 116719 121184 131095 138409 149368 151746 142855 133786 127916 137180 144377 145963
10787 145963 144588 140118 138378 141972 139914 134884 129601 127950 126985 124972 123656 126955 123425 115822
10773 115822 113177 117228 130926 150675 177708 195214 205901 204743 204387 191262 158202 117810
10761 117810 92062 77397 65887 57124 51265 57243 75828 93782 100868 108737 113186 115543 105216
10748 105216 96901 92381 90795 96950 109163 123746 135979 143799 150579 164059 188214 202988 204237
10735 204237 199405 196210 196153 192190 193217 199069 204912 208368 211822 206562 190747 195395 225525 257661
10721 257661 281489 310414 327740 335229 348637 357319 348955 337941 330253 319212 303855 286126
10709 286126 263746 245287 239228 244005 260982 290693 332173 380835 438742 489369 521416 494981
10697 494981 369647 212677 135586 149537 198020 270921 341623 378303 372822 351435 344000
10686 344000 348493 353966 345157 330169 320663 317103 314272 306295 293168 296501 306458 317174 332790
10673 332790 352246 364529 367464 359589 348229 344521 358232 376443 387703 393403 401104 419367
10661 419367 435042 449983 458169 460195 459684 469488 494332 524824 545146 553893 549520 546037 548093
10648 548093 558490 568148 577399 595354 607677 609658 610268 610067 608888 604496 613204 632725 660148
10635 660148 680263 684878 677734 669346 671436 680599 696321 725142 751233 777450 802672 830260
10623 830260 870324 925351 996202 1065175 1114145 1143903 1168830 1202811 1254049 1337304 1448333
10612 1448333 1562153 1659369 1731459 1786058 1849293 1942940 2067793 2222154 2395021 2587049
10602 2587049 2801402 3044976 3320585 3626645 3896000 4054584 4161358 4313404 4566314
10593 4566314 4917795 5349500 5842249 6444032 7249879 8366630 9898188 11785969 13787441
10584 13787441 15812703 17524812 18575645 19436431 20937757 23556387 27484219 33012638
10576 33012638 40787074 51928323 68660058 95163197 138515920 209016171 310711546
10569 310711546 408853489 433878420 369920697 267845900 182658871 126901164 91798498
10562 91798498 68881288 53373471 42571372 34749140 28933289 24546513 21203798 18730427
10554 18730427 17016592 15884078 15115513 14367490 13247025 11744119 10222998 8940192
10546 8940192 7900422 7069999 6434654 5914552 5443465 5015139 4637993 4286778 3959840
10537 3959840 3643739 3337184 3058534 2825938 2636881 2467102 2307482 2155948 1997015
10528 1997015 1836635 1680933 1550490 1462211 1408605 1369548 1331515 1275084 1200940 1121598 1043871
10517 1043871 987302 959549 951748 946175 931472 905106 869445 832743 807353 783168 761907 729123
10505 729123 687299 644615 600511 564705 541330 523002 512294 502363 479233 449443 423108 394117
10493 394117 364754 342396 334222 324309 317155 313929 301262 282996 262967 245224 249780 265973
10481 265973 279534 277378 267053 249821 234641 226402 225587 225894 222024 217952 216616 217640 215440 203001
10467 203001 185828 174996 165594 163976 170620 177264 186118 195050 194978 191967 176942 163299 150693
10454 150693 139654 126931 113841 117786 119216 116199 89668 65987 77803 141651 242391 337253
10442 337253 385634 348412 207888 51889 -24600 -30649 -14480 6140 21932 38464 51079
10431 51079 52747 54531 59548 64672 61500 58129 57410 55396 48811 33689 11152 -8092 -27151 -46984
10417 -46984 -55274 -45853 -19464 11915 49533 67136 57888 40832 43160 55633 62411 56978 50225
10404 50225 41247 32824 22912 15078 15497 24071 39477 53936 61533 68898 80046 96318 106814
10391 106814 107957 107176 104377 94810 84071 77345 81046 89976 97535 108709 119248 127131 121060 108458
10377 108458 104177 99541 77558 47975 18743 -6399 -18322 -24711 -24235 -16000 -6004 15098 35542
10364 35542 43473 39637 34695 34166 31846 28361 28257 34635 29522 23700 18067 15015 15708 12078 11090
10349 11090 18992 35736 56354 78864 108438 152770 200215 235699 246104 219071 189292 190440
10337 190440 225421 273008 298146 275907 217931 157880 118636 95851 84235 82840 77950 64952
10325 64952 47578 24216 8874 -3152 -6510 -4875 -1492 -336 -5615 -22401 -31202 -31687 -21376
10312 -21376 -3113 15141 26605 24773 23197 23886 21975 22721 23266 24472 30530 36793 44249 48342
10298 48342 52752 59551 64077 65276 63477 61603 55037 48499 45717 46487 48422 55518 61521 58910 54843
10283 54843 53742 60368 64776 68371 72686 76001 85680 89003 86310 85073 91104 93803 96912 98170
10269 98170 102136 105449 111865 120711 135655 156926 176980 198776 221242 245977 284378 327211
10257 327211 376086 425047 467507 510803 563414 625260 697064 798833 939818 1142331 1436133
10246 1436133 1876069 2559857 3638337 5317045 7706410 10290729 11769843 11119506 8875431
10237 8875431 6393186 4478764 3199364 2365842 1809916 1430182 1153906 955140 810262
10228 810262 704479 625798 571172 531834 499437 463768 420905 375844 331773 293209 263472
10217 263472 242354 233824 230226 223534 211612 202434 195491 191441 184414 186573 191427 205687 239855
10204 239855 296809 383875 514683 712222 944247 1122108 1126766 961639 733576 534817
10194 534817 396105 293515 226862 182462 153164 128438 107776 96772 92551 85537 79568 80169
10182 80169 78580 74436 70795 63905 59600 53583 44300 34553 30882 30879 35513 41841 41228 42343 52648
10167 52648 61281 66487 72469 74684 76503 75420 80710 93666 108969 127301 147267 168801 192153
10154 192153 219859 251726 288956 343465 421003 540722 741235 1079790 1595479 2166910
10144 2166910 2403392 2093871 1519996 1030484 707135 504984 373568 287612 228289 183257
10134 183257 153545 134712 123953 110025 94485 86725 83594 80797 76536 70956 56616 39401
10122 39401 28302 28566 26455 18077 17184 13997 8620 3465 -3475 -8171 -7233 -6533 -8054 -10812 -15102
10107 -15102 -11982 -6893 -1740 7837 18423 33636 35403 28718 18782 12918 12696 15825 19738 23369
10093 23369 26506 27782 21171 14984 4452 -3416 -8333 -12401 -12871 -17592 -18649 -15408 -11690 -10102
10079 -10102 -8449 -10449 -8962 -4521 -1498 -5767 -9345 -8741 -6550 -4425 -2243 -2257 -4527 -5614 -7704
10064 -7704 -6312 -689 2244 1961 -5520 -10073 -10904 -6574 -708 3909 7410 13577 21844 22192 17545
10049 17545 11008 11293 12111 11586 11471 8233 7191 1572 -6386 -12400 -8423 -8409 -9403 -8445 -8498 -10426 -16402
10032 -16402 -22266 -23121 -18480 -15531 -12692 -16045 -14911 -14649 -15413 -9354 -8680 -11252 -11273 -10075 -4134 -2861
10016 -2861 -1064 2239 2646 1134 -3733 -6285 -7066 -11869 -17440 -15384 -16034 -16925 -16963 -21547 -14293 -13522
10000 -13522 -12230 -12392 -15896 -17264 -22631 -18906 -12398 -13867 -17057 -14241 -6516 -3114 -2728 -3279 -6163
9985 -6163 -10644 -12406 -9047 -7547 -10896 -12894 -13535 -10681 -11148 -15751 -15145 -16118 -22680 -24844 -21986 -20997
9969 -20997 -15287 -8083 -6934 -7163 -6677 -8035 -14702 -18410 -12851 -11425 -13929 -11588 -13564 -15876 -16281
9954 -16281 -14375 -14992 -16062 -17493 -19631 -15638 -15182 -17337 -18616 -16930 -16878 -17268 -18623 -14239 -12323 -8468
9938 -8468 -2385 -3390 -371 1051 -327 -367 -2423 -2113 -4549 -8448 -11459 -15411 -17410 -15492 -13452 -10236
9922 -10236 -5268 -9387 -13676 -13704 -11236 -15169 -18161 -18340 -17274 -15779 -16769 -9898 -1873 5238 11082 22088
9906 22088 37246 62207 79209 72785 50698 33966 19141 14287 22531 30855 42864 46194 28622
9893 28622 13863 3390 -4363 -5251 -4138 -8715 -11701 -6554 -4334 -7519 -6271 -5680 -6551 -9210 -2169
9878 -2169 57 -1791 -2629 -3323 -5062 -2979 -3560 -6408 -3375 -4664 -9249 -7463 -5385 -7169 -12627 -16522
9862 -16522 -4776 -1478 -6145 -8609 -10621 -9840 -10953 -8545 -7765 -7956 -6765 -7051 -3000 -4834 -8570
9847 -8570 -11141 -11311 -13800 -13534 -15336 -15810 -15002 -12630 -13263 -9890 -11137 -13649 -13007 -8225 -5535 -3121
9831 -3121 -2298 -5050 -3884 -2840 2079 4739 8319 11274 12973 16425 20961 21874 27449 26544 26925 29680
9815 29680 28587 24569 20482 15229 9707 8317 6558 6114 6134 3127 871 -1671 248 1792 2441 -1142
9799 -1142 -5676 -9229 -10301 -8016 -6249 720 5205 599 -3252 836 -1180 -6016 -13972 -16782 -13003
9784 -13003 -9323 -8766 -6518 -3191 -6761 -8089 -6517 -3309 2096 -2055 66 1061 -4445 -5163 -2404
9769 -2404 -2692 -1679 -4082 -4058 -2202 -3761 -10256 -7490 753 -436 -3672 -1998 1943 -1134 -2308 -4974
9753 -4974 -7267 -3108 -1356 3734 3781 -102 2473 4219 588 224 296 -1239 -436 -798 115 -524 -1733
9736 -1733 965 1428 3083 1989 489 -845 -3350 -4205 -8465 -9370 -6052 -6301 -1449 -1326 -5313 -9236
9720 -9236 -13694 -11322 -9973 -10743 -6865 -3115 -1498 -4043 -4963 -7646 -7019 -13055 -18660 -12797 -6673 -664
9704 -664 -6533 -8900 -10674 -6822 -8458 -9534 -11774 -6312 -5470 -5191 -1667 5312 7930 8209 7499 8678
9688 8678 2915 -1739 -5721 -6557 -4883 -4080 -743 -4282 -12274 -16851 -15742 -13738 -11429 -6346 -5502 -12193
9672 -12193 -14496 -14554 -15793 -16024 -11111 -11069 -12290 -11085 -12864 -13021 -11875 -10492 -5838 -2634 3183 1349
9656 1349 -1083 -2786 -5560 -5711 -9930 -11172 -14118 -14850 -13672 -9774 -4610 -4633 -5692 -9927 -11362 -11705
9640 -11705 -5368 -823 -925 -3217 -718 -7562 -14682 -13226 -16317 -12104 -9149 -10495 -6064 -7760 -10646
9625 -10646 -8983 -6819 -5638 3769 4886 8904 11280 9693 7631 3986 -882 237 2070 347 18
9610 18 -3302 -1724 776 -429 -3196 -1932 -243 -3026 -3998 -1944 -3 4424 1879 -1259 -5121 -9923
9594 -9923 -12394 -7816 -2307 3898 6805 2149 -3639 -4856 1853 2858 -5021 -10210 -8837 -12197 -13220
9579 -13220 -12961 -19999 -18547 -17617 -11935 -7382 -8751 -6329 -8272 -6545 -6384 -3377 473 1256 -766 -877
9563 -877 1735 579 367 2408 778 -34 5492 4684 -665 -7269 -6122 -1596 -4492 -7028 -7598 -4512
9547 -4512 -3264 -1558 467 758 -3780 -5105 -3321 -4759 -5023 -1662 1671 2450 5247 5344 2738 -2520
9531 -2520 -4376 209 4791 6724 4475 1896 1415 4529 7646 3397 -2272 -4865 -5443 -3243 -5751
9516 -5751 -9981 -9156 -7167 -2175 -952 -327 381 2673 3298 1093 -6022 -7422 -3991 4544 5837 4065
9500 4065 2720 315 1228 6614 5315 3271 5665 5794 7051 8051 2559 2674 5128 2415 -513 3174
9484 3174 5153 6418 5505 1234 -2223 -226 -3507 -2807 -2067 3960 5710 10949 10045 7704 5325 3883
9468 3883 5186 5229 1970 3834 4563 1835 -1404 1146 3153 -449 475 3579 4551 1813 246 4577
9452 4577 3770 164 -4744 -2170 3152 7843 11089 6636 -3127 -8825 -9217 -4851 -692 2771 1587
9437 1587 1256 -902 -4480 -8049 -5200 -3107 -5500 -1766 4149 9391 14387 15890 15826 10896 5551 6313
9421 6313 2178 1730 5877 3343 4479 2513 -31 696 4860 7276 7181 5577 1658 3326 4950 4255
9405 4255 756 2993 7668 10703 8883 8441 9815 8688 3029 6242 4985 3483 4005 4067 5663 5810
9389 5810 5167 3774 9252 8329 7309 6548 8016 3110 4734 11399 12441 7906 9295 15983 14892 13085
9373 13085 10933 13430 14330 13058 15196 17257 13153 14626 18070 22078 26356 28803 25608 27274 23787
9358 23787 23421 21413 18379 18795 22588 25560 25243 27599 29988 25313 20749 18690 14878 13466 19669
9343 19669 18574 19014 17329 17431 16768 16268 19156 15305 12010 17312 22117 19812 20906 21229 16451 16707
9327 16707 14976 10555 12516 14275 16100 19492 19883 14267 12171 14988 19056 19452 19804 15451 13222
9312 13222 13995 15060 13584 14423 14446 15764 21056 19105 19209 15691 13211 11923 16390 17934 19045 12647
9296 12647 13240 22682 25960 26715 27372 24616 18942 14561 18237 20759 17340 12977 10465 16175 20852
9281 20852 23196 25529 24500 25199 27406 25723 22493 24929 25048 23113 26364 31794 31122 23079 23105 27857
9265 27857 28886 29861 27619 27641 25449 23715 25562 25688 24574 24547 25119 24611 26722 27275 24617 19322 20221
9248 20221 27463 30502 31156 31194 26096 20708 18312 20897 22757 27974 26864 26432 29736 32061 29740 30242
9232 30242 32021 34377 38458 40127 40931 38067 41475 46180 45312 44473 40546 43503 44397 46692 46863 46662
9216 46662 43962 40915 35730 33778 34374 31155 26084 25829 30335 33686 31038 31611 32313 28057 25174 23563
9200 23563 22949 21054 24566 30371 29047 28895 32442 32245 26678 31107 30928 31393 33246 33110 38321 37251
9184 37251 31772 33900 33775 36144 34101 32071 37034 37865 37085 34726 36696 40952 39621 36080 41606
9169 41606 44240 39968 37412 35279 35910 35699 33006 32951 40075 43358 43267 40304 40031 41885 40582 33774
9153 33774 36051 37031 41158 43813 46039 43167 39122 42811 45527 46624 45054 41058 41720 41322 43603
9138 43603 47215 49256 46706 44227 40196 36523 41447 47142 48903 51031 53420 51800 43608 42772 40325
9123 40325 38786 44251 50471 56069 58105 57523 54459 48059 43952 40722 39481 42627 50668 50708 46231
9108 46231 39693 36419 39501 41702 46201 47973 51029 52445 51437 50783 50918 51861 50289 48729 46794
9093 46794 46483 45491 50358 52224 50252 51265 55470 51255 54786 55219 53440 52113 50890 50394 49175 50150
9077 50150 54463 54476 54076 52735 55797 57095 54500 55474 56324 55809 52786 55293 57688 58600 61484 60749 61801
9060 61801 58873 55589 52366 54142 53213 51578 53059 56208 56794 56553 56208 63145 63146 60795 62069 63003 68245
9043 68245 71070 67362 64266 65751 67854 71037 68274 66083 62602 65850 70842 69768 71329 73004 73417
9028 73417 66038 62183 63474 66138 66423 71254 73006 71052 69861 69688 67142 65207 65177 67371 73959 78061
9012 78061 72964 73775 71374 70471 71430 72235 70151 73690 72611 67416 70566 70773 63210 66946 66389 63267
8996 63267 62514 67691 72335 74277 73787 75298 79088 80328 79403 78494 83919 85580 87781 87855 86878 84153
8980 84153 85714 87826 90018 89392 96032 101473 100433 98162 93125 92721 98755 103484 106115 107105 107318 109394
8964 109394 111952 112673 113987 116924 123475 129062 136026 143925 146970 142154 136621 133634 133502 131257 126641
8949 126641 121585 122192 124809 131220 133750 130840 128950 123774 121835 122013 118384 118534 122885 125602 126835
8934 126835 126773 126755 129185 133774 137342 141107 141228 134688 131811 133568 135495 134973 131714 127618 128260 133674
8918 133674 133365 135061 141027 144421 152284 164722 176456 177074 169573 164996 160840 153011 147737 149855
8904 149855 148292 148544 149212 149295 151645 150117 144368 140670 146753 151634 151535 152798 155982 159392 163236 168733
8888 168733 170653 178877 191625 203589 206718 202529 198662 194274 197331 193784 192318 197641 202265 203796
8874 203796 205524 208472 215620 216341 216331 222848 226371 235222 246773 246909 235471 234637 236692 243229 248048
8859 248048 252473 256344 257684 262725 266375 270672 272012 272681 275172 280353 288724 297897 298173 296457 305614
8844 305614 309272 314531 323264 329919 336742 337285 340841 341544 347946 352829 354069 355705 355180 359420 365353
8829 365353 374322 384053 387322 388496 393970 399351 406702 410014 412530 420345 425025 429594 439636 441724
8815 441724 444852 454639 460706 465783 474097 483697 501332 517156 525887 531581 542097 551082 559139 570942
8801 570942 581455 593849 604536 613982 628247 640376 652719 669938 688121 707197 719623 729905
8789 729905 745458 764994 779446 792086 813924 830088 845867 867601 890914 912952 940356 963810
8777 963810 994099 1021460 1049266 1080077 1110139 1139950 1171315 1205056 1241743 1278927 1321856 1370438
8765 1370438 1414554 1463491 1511514 1564431 1623718 1684339 1745069 1806080 1874628 1947861 2028904
8754 2028904 2121626 2216506 2315930 2417375 2525081 2637797 2758637 2892828 3033408 3189053
8744 3189053 3353337 3527697 3725162 3935430 4159169 4390376 4648299 4929948 5228461 5549013
8734 5549013 5899224 6279782 6690615 7124614 7589261 8088313 8615680 9180852 9781132 10412770
8724 10412770 11078163 11774717 12497212 13244266 14022585 14828610 15660751 16533272 17441843
8715 17441843 18386583 19381601 20416478 21497788 22620940 23772559 24939910 26098461
8707 26098461 27202041 28191971 29017687 29627930 29962319 29976795 29648244 28989829 28035762
8698 28035762 26842330 25465347 23976195 22442273 20905677 19414287 17988874 16645578
8690 16645578 15393942 14236470 13171253 12204089 11326060 10527513 9807369 9151264 8548623
8681 8548623 8002253 7510676 7047146 6623034 6231824 5872169 5533070 5215979 4923054 4649918
8671 4649918 4393967 4156697 3946800 3746412 3555866 3380458 3214232 3052386 2899953 2760885
8661 2760885 2632943 2513983 2404017 2303645 2206801 2123698 2047624 1968767 1883578 1799911 1720592
8650 1720592 1655022 1599492 1540104 1482745 1432905 1383297 1343498 1298333 1253853 1208280 1167145
8639 1167145 1134090 1100456 1067150 1037436 1009870 983684 957854 925820 895695 869387 842982
8628 842982 816958 798086 781171 758025 739049 722086 708177 692155 676425 660898 640586 626785
8616 626785 614849 598605 586567 573099 562955 553023 545003 534158 521437 508317 494091 483117
8604 483117 470716 466957 455563 446313 439723 429951 421003 411994 405323 397137 384079 370851 362375
8591 362375 354369 351286 349750 343054 335681 333118 332294 329677 320729 315397 313498 304071 299052 297236 295291
8576 295291 292597 284808 279059 274274 267005 262220 254989 246307 240624 235872 234531 235309 229641 223281 218010
8561 218010 214815 214667 209396 206656 206166 204743 197340 192508 192522 194884 186272 174515 171296 176424 168528
8546 168528 147979 151474 188152 230412 250736 243774 213612 169604 139793 142059 157939 159733
8534 159733 154252 149410 146092 146267 145746 144087 143125 143447 141624 137292 139889 136260 132337 134619 139357
8519 139357 142317 138940 137282 137252 139381 139340 135528 134397 130848 128241 123948 119744 121447 120349 118125
8504 118125 117539 120718 117186 110227 105814 105970 108826 110048 107876 107290 101650 98386 98836 97693 99250
8489 99250 96028 96741 95943 97775 101805 103479 98055 92129 90085 91569 94611 94443 89390 85096 82603
8474 82603 84551 86856 81205 75511 76738 74171 74316 78060 72563 72070 74800 71038 64853 63419 64012
8459 64012 62803 62426 60598 58376 62519 65218 65394 64826 67787 65431 60058 55148 55255 54920 54235 57731
8443 57731 59090 60392 62909 63279 65919 62338 56913 53283 52542 54446 56625 59727 56330 48272 45939
8428 45939 46214 51824 57381 59580 54803 51657 50535 47149 49113 54896 54571 50592 50951 51632 52473 54778
8412 54778 51192 43411 40233 40151 42808 44018 46378 49287 47530 46428 47271 48889 51717 56728 54356
8397 54356 44203 41911 45380 41036 39621 42262 47043 43710 40736 42556 47076 48318 45698 45511 42991
8382 42991 41809 41026 42552 45668 46123 47673 47484 44594 43951 43424 42016 43782 43205 40697 36105 32841
8366 32841 36620 36829 33047 32008 33888 33957 35896 36439 35309 35385 37662 38573 36939 38423 39917 41128
8350 41128 40469 44460 44585 44183 41270 41076 41965 53300 59441 63595 65859 72290 76504 76445 78801 78252
8334 78252 75151 75025 69500 58872 51660 49307 48613 45253 41311 40581 45612 36117 32515 30686 31001
8319 31001 34508 37195 36443 33264 33170 37652 43096 44058 44241 40332 37679 40600 37857 39834 41618 41325
8303 41325 45489 48151 48896 52136 50404 46828 48411 58628 63067 69241 77204 78229 78990 74835 69728
8288 69728 67707 65361 68616 75479 81488 81029 82522 76989 69566 62012 56870 49152 42503 40756 38847
8273 38847 33280 26702 26484 22259 15672 19794 24991 22887 22474 25415 34064 35887 38431 36046 29481
8258 29481 28413 27662 28737 29187 31946 34834 33912 29169 29532 26687 26618 26714 25697 26122 32847 36176 31879
8241 31879 34145 34993 43073 56022 56928 59366 57988 52446 46786 48506 51075 45561 38113 30478 28399
8226 28399 25624 26728 27966 27248 27590 25379 27908 34419 36461 33597 24384 15944 17874 23116 21099
8211 21099 19928 22857 29670 28426 24909 24733 27139 27334 30743 35666 37944 36831 36827 38340 41445 39765
8195 39765 33918 31133 24836 19776 15364 15617 13989 13203 12380 15564 16833 17961 18604 22804 25448 24020
8179 24020 22029 21389 17750 15087 16109 18152 17998 14833 16068 15806 17320 18010 24705 32257 37472 34569
8163 34569 37047 39627 41127 39453 38664 37422 37562 42306 48941 58790 69643 70625 65787 55388 45871
8148 45871 41936 38204 39704 35275 28969 26230 25950 26445 24384 21535 19983 24936 35417 36308 35640
8133 35640 37975 39290 41485 49703 50826 49955 53232 53354 54692 56841 58949 62252 64087 66082 69225
8118 69225 69291 63375 53960 51030 54540 56290 55993 55082 57908 62102 57565 59778 64979 66378 64490 59380
8102 59380 56653 55591 50941 53064 59626 59552 57775 54114 50094 51418 57136 59140 59682 59297 62116 71909
8086 71909 81532 88391 90519 91037 95304 95879 95086 94327 93970 86911 78798 73660 70042 65694 64179 62931
8070 62931 65402 63362 58674 52283 52409 54196 54894 61144 63817 65509 64778 69440 79907 85485 88715
8055 88715 89159 92000 95032 101274 105366 107473 109385 108778 109354 105613 107905 115196 117110 122754 129334
8040 129334 131657 126955 117657 114099 107917 103844 105963 108227 107545 103776 104876 106470 104825 101023 96522
8025 96522 97180 95679 90517 96564 102090 104347 107673 112222 110131 108790 111763 116436 122422 129887 134450
8010 134450 133968 132368 139665 143343 142294 144602 146279 142165 138802 139583 139884 133593 130224 126794 121278
7995 121278 112247 108643 113281 112662 111393 115946 112295 113850 114085 115658 115708 113482 105133 96165 96379 96963
7979 96963 94171 89944 88430 90661 92953 101137 103986 101932 92931 89511 93594 93637 88803 79334 77308
7964 77308 76825 77861 72811 70224 67848 63472 59029 58865 56492 55178 51226 49672 46201 46566 46701 43091
7948 43091 40837 42860 49388 51388 50104 44357 40540 42762 43852 41221 37041 35698 31042 30740 29410
7933 29410 31438 34697 39257 39703 38768 35365 35898 35953 27432 17563 10267 11822 13559 13577 10798 14722
7917 14722 17253 13445 8665 5198 7644 8378 13384 13295 5373 2382 -1582 -4967 -3000 -1532 1251
7902 1251 5994 2645 3409 4170 2696 573 4078 5306 5042 5136 7551 8014 13438 14687 12588 5322
7886 5322 211 2815 5366 3823 1589 -175 -171 -999 -3439 -263 360 -3271 -2967 -5974 -8600 -8275 -7456
7869 -7456 -1395 3337 3626 2711 -16 -2393 406 1049 -1739 -4313 -4951 -6387 -9498 -9187 -5194 -6295
7853 -6295 -3491 -5926 -12576 -12450 -10319 -4272 -2246 -1839 -1980 -1568 131 3448 -1217 -3320 2383 4698
7837 4698 4218 -450 1692 5498 5458 8439 4272 387 -741 -1125 -164 -1496 -1918 -1850 979 5928 10589
7820 10589 12350 6007 -9439 -16510 -11428 -4278 56 -4763 -7259 -4144 -799 -1887 -4578 -143
7806 -143 854 -1292 -4320 -5719 -5513 -6345 -6662 -3942 1518 -1424 -2288 -2420 -322 -2397 -5930 -2180 -346
7789 -346 687 -1837 -5017 -8538 -12187 -12032 -9084 -6488 -9868 -10634 -11074 -12818 -10992 -7723 -4145 -1921
7773 -1921 -1608 -2790 -5239 -7797 -8292 -10102 -5630 -5505 595 3704 1292 -346 -2073 -1206 -237 -6533
7757 -6533 -3549 2793 2992 -1735 -2605 -3388 -4172 3312 1778 -3852 -7709 -4709 1613 1599 538 -2462
7741 -2462 -3038 -3812 -2388 -5842 -5553 -7004 -9312 -9091 -5505 1956 5507 6775 5361 2193 -1127 -6212
7725 -6212 -12637 -9920 -12319 -11204 -9504 -8394 -7596 -8268 -11292 -7681 -5208 745 7932 8690 188 -5655
7709 -5655 -7768 -7561 -5778 -6397 -6239 -10532 -9905 -5465 -7935 -8375 -3941 -2086 -6096 -8390 -4770 631
7693 631 60 23 8305 5989 3639 3218 993 -1418 -7733 -8261 -5314 -4656 -6402 -3536 -5745 -3712 -6079
7676 -6079 -6639 -3740 2019 1399 1856 -1054 -2055 4213 7092 5294 2801 -1011 -4278 -5478 -4270 64
7660 64 4342 6124 2642 -5204 -10462 -7350 -3030 -3591 -3701 -5213 -3496 4325 659 448 743 -1178
7644 -1178 -1341 2883 6346 6726 2582 2307 2351 -5969 -12905 -15087 -11032 -7219 -2309 2091 3756 -1922
7628 -1922 -5749 -9259 -7437 -11629 -11174 -11772 -13272 -7270 -3295 -1710 -4202 -5867 -2718 -2874 -7743 -6582
7612 -6582 -3747 -1803 -702 -372 -1888 -6827 -2101 1347 -1179 -978 1348 3651 456 1405 1488 -1086
7596 -1086 -2808 -3129 1075 -4715 -12158 -12000 -9467 -4953 -4998 -4433 -4480 -6323 -2600 497 3280 4914 5583
7579 5583 5302 1778 -458 2255 2202 -4078 -2969 -4124 -6658 -2864 -413 3545 5373 2655 -2429 -6361
7563 -6361 -12712 -12065 -4716 -2358 -5386 -11196 -12845 -6669 -5813 -5855 -8529 -9553 -9911 -5665 -4729 -2886
7547 -2886 -5188 -5927 -3219 -1044 4266 3642 2470 1136 1541 -1134 -2785 -103 -3431 -4297 -2457 -3159
7531 -3159 -2634 -3317 -2176 -1829 -5806 -8165 -7144 -11803 -10180 -3988 -1321 -6126 -9070 -8792 -8620 -6841
7515 -6841 -4331 -2410 2110 6646 4390 180 1782 1294 -2319 -3213 -5498 -5323 610 -759 -3691 -8241
7499 -8241 -11518 -12631 -10278 -3851 -7840 -6960 -4325 1063 5026 313 -1400 -125 -3623 -7553 -5120
7484 -5120 -4121 -8170 -10528 -8699 -9153 -5121 1548 -1275 1811 60 -4267 -404 1605 -944 -2323
7469 -2323 -1688 -601 68 2059 2308 -879 -3929 -1105 -1653 -825 -923 -1081 1471 2834 -1207 -4041 -6302
7452 -6302 -7715 -9935 -10957 -6838 -3597 -2690 -573 -2183 -1475 -1144 -1734 -4953 -6322 -8576 -11184 -15136
7436 -15136 -13309 -9400 -5159 -7144 -6756 -648 -1772 -9881 -11208 -8804 -4750 -518 -1106 -3006 -3652
7421 -3652 -6886 -4825 -4390 -1739 -2965 -3508 1350 -2868 -7905 -13785 -11572 -6309 -3806 -6292 -3652
7406 -3652 -4975 -4821 -4850 -3775 -6316 -6432 -4377 -6486 -6348 63 1348 -1294 -463 48 -1885 -7894 -10328
7389 -10328 -8142 -5770 -4154 -6051 -1821 -2417 -3151 -564 477 -339 219 -4675 -5269 -3758 -946 55
7373 55 619 -1234 -1458 -706 -3273 -7336 -6409 -2221 1020 -2903 -9198 -8832 -7645 -3884 -7469 -11104 -10507
7356 -10507 -7350 -8074 -7691 -7362 -6259 -2683 4472 5720 3755 2500 4895 -223 -8538 -9218 -9107 -6852
7340 -6852 -1676 -2066 -400 -1281 -3687 -6726 -8577 -5255 -5391 -5442 -6362 -8864 -10176 -12699 -18607 -15934
7324 -15934 -9576 -694 -3672 -7550 -9269 -6580 -2265 806 -2908 -2925 -6452 -7555 -7198 -8776 -9391 -10764
7308 -10764 -11222 -7975 -1892 -84 -1850 -4020 -2953 -3802 -2872 -1251 -4065 -5486 -5314 -6232 -1886 -2731
7292 -2731 -263 3128 -189 -904 -5705 -5905 -5462 -2107 -2182 -1844 -2804 -3304 -1760 -1387 -3808 -5202 1750
7275 1750 2482 3988 714 2502 4123 3814 4637 4910 -157 -2949 -6007 -8601 -7052 -5061 -2473 1141
7259 1141 -432 -2272 -538 2721 -644 -4887 -6578 -2570 -2494 -3953 -3188 -1725 -1728 -1596 -2159 -1387 338
7242 338 -1181 -1914 -5292 -8652 -7092 -3303 -2023 -1361 -504 -1491 -978 3691 6093 4940 6406 10366
7226 10366 7311 -1237 -3464 -5717 -1074 -64 -805 -4623 -1993 -2066 2672 609 -2732 -5185 -2142
7211 -2142 -2779 -4497 -4288 -2169 -3558 -4901 -7461 -2648 2917 -1095 -2130 -2495 -9677 -11750 -9025 -8673
7195 -8673 -5048 -7547 -8786 -12831 -11745 -13019 -13941 -8539 -3514 947 -3465 -5959 -6949 -7330 -8091 -799
7179 -799 -141 224 -1529 -5248 -6278 -6301 -3362 -4091 -6078 -7146 -5268 -4998 -10519 -12047 -9273 -8321 -6788
7162 -6788 -5344 -3732 -5970 -6543 -4608 -6390 -5876 -5670 -6406 -2581 -4881 -7952 -10446 -11691 -11784 -8635
7146 -8635 -2905 -1188 -6221 -10972 -11257 -13518 -12955 -10683 -9443 -11474 -14093 -13157 -9520 -10022 -8584 -4319
7130 -4319 -1668 -2267 -4512 -1755 1930 726 1555 1682 3558 4199 3315 -935 -4899 -4870 1979 3708 855
7113 855 -4274 -1067 5361 3881 -1175 1239 992 616 242 -2648 -1537 -237 -3590 -4245 -7277 -10332
7097 -10332 -6662 -8342 -10217 -7647 -7303 -12613 -9754 -5815 -5904 -6200 -7351 -6109 -2907 -1104 -791 -2533
7081 -2533 -2966 4052 4735 2099 -2656 -7182 -4693 -1744 1139 -1041 -1733 -1041 -5533 -4249 498 544
7065 544 -1989 -6354 -11302 -8678 -7412 -9092 -2868 -3740 -5835 -5807 598 244 -2530 -2701 2864 4732
7049 4732 868 -4054 -1842 -3419 -9041 -13846 -15275 -11994 -6302 -8654 -4841 -6546 -8661 -6315 -3862
7034 -3862 -1407 1759 -1369 -910 2314 2972 763 -741 -2694 -6887 -7193 -3992 -5063 -3023 2048 1505
7018 1505 -6654 -9443 -8343 -5289 -6864 -8097 -4129 -8347 -12576 -8981 -8028 -7481 -3888 1344 -2977
7003 -2977 -7295 -11204 -13691 -8549 -2016 -3530 -10210 -16714 -16322 -16030 -12588 -10887 -7951 -11213 -15404
6988 -15404 -8941 -4808 -9600 -9093 -2563 1776 337 -2379 -7089 -3046 -7405 -6208 -4499 1233 -1874
6973 -1874 -2701 1005 2215 281 4958 6593 440 -1681 -724 -7353 -10811 -9752 -3112 3096 1408
6958 1408 -3670 -5347 -5516 -1107 2654 1636 -2394 -7993 -7281 -9186 -6880 -5974 -768 721 3507 2095
6942 2095 183 4648 -540 -3268 -862 1569 2607 3550 3958 2229 2420 4059 616 -2374 -2533 -2832
6926 -2832 -6108 -5911 -6159 -8857 -10594 -8707 -3663 -2032 -2300 -4249 -7432 -4832 -1419 2567 -347 -2006
6910 -2006 -1524 7533 3184 -3803 -3986 -770 -3576 -5015 -8533 -10513 -9521 -11289 -8080 -3886 -8752 -8012
6894 -8012 -4600 -4131 -7713 -9221 -7735 -4718 -3039 -4749 -3133 1866 4439 -450 -2128 246 -3094
6879 -3094 -5702 -3030 129 -3301 633 -1538 -2491 1415 389 -2603 -284 1120 237 4410 3890 -3114
6863 -3114 -6172 2812 2774 3691 3872 4281 4575 5264 2931 62 659 2218 3113 3590 2243 4600 1596
6846 1596 2479 7211 10510 6136 978 969 4059 5227 6218 4361 -572 2929 4851 8554 14048 16665
6830 16665 16925 17256 14458 10296 9900 13014 14805 12581 10161 5616 4592 3137 1448 -1143 -2566
6815 -2566 -5156 -5884 -6330 -9100 -5099 -8554 -13310 -10969 -11786 -7092 -3778 -424 -5229 -6333 -2608 -1830
6799 -1830 1203 -2163 -1714 -665 2390 -523 -3582 -5121 -5554 -5722 -8452 -9268 -8983 -10756 -4271 -3044
6783 -3044 -6003 -6302 -2022 5009 2106 -360 -3805 -2419 -1081 -5295 -3544 -3689 -2681 -4134 -1489
6768 -1489 -2756 -5314 -6212 -1175 -1696 -2876 -3202 -1125 -971 -6301 -7057 -3558 -1712 800 -1753 -7037
6752 -7037 -9600 -7881 -2444 -1376 -2869 -1982 -1043 4800 3531 -3391 -8196 -7116 -11006 -7954 -5961
6737 -5961 -6742 -6767 -8656 -15239 -14286 -7300 2904 1915 1004 2058 -2861 -5226 -8255 -6372 -4429 -2827
6721 -2827 225 5659 1928 -3004 -3396 -3332 -7076 -4585 -1736 -3746 -2172 793 -3776 -10170 -6811 -212
6705 -212 2354 4236 4160 4428 1922 1931 940 -1744 -2947 -43 1245 -571 -6887 -6672 -1651 4707 4510
6688 4510 6003 8147 7445 5878 3982 3807 4986 6735 5962 30 -789 199 671 2338 540 -943
6672 -943 -1094 -3756 -2096 -4558 -6186 -1778 1019 3988 6470 3943 467 -54 5668 9933 6964 956
6656 956 -4629 -11703 -10745 -12369 -7455 -6450 -7735 -10179 -13966 -13693 -12352 -15564 -16884 -14973 -12794 -7861
6640 -7861 -7619 -8246 -9093 -7018 -595 91 753 555 -1221 -3347 307 321 -5578 -1617 -2217 -7321 -5288
6623 -5288 -8882 -6905 -2535 -3330 -3766 -5454 -8633 -8268 -5873 -3294 -598 2600 1639 1502 3050 2510
6607 2510 -547 -667 1301 -1230 -4189 -2891 2782 3712 3895 -4315 -8927 -8974 -13056 -16408 -15621 -15780 -16289
6590 -16289 -13054 -12944 -8993 -8568 -6822 -3824 -1373 -1514 -2538 -758 142 -630 -491 82 1177 5271
6574 5271 6468 3 -4229 -5933 -1911 -275 111 -3858 -8975 -7448 -1660 -1241 -3956 -5713 -1684
6559 -1684 -521 1014 5618 4037 1990 2979 2773 536 -3584 -4904 -1933 2083 4954 3605 6146
6544 6146 3718 -2608 -2894 424 79 -210 -627 -1408 -330 -830 -2626 -4312 -5005 -5558 -2994 2951 7023
6527 7023 5018 -5 -3983 -3973 -5933 -10348 -2627 3527 7954 -3115 -23951 -36402 -38916 -33223 -17480
6512 -17480 3146 12118 10226 2834 -4756 -2186 -3241 -4351 -5789 -2347 -1359 -5708 -7722 -2730 -520
6497 -520 2420 2269 476 2135 -107 1 -451 -94 1629 405 1661 -1487 -1147 -2136 -5083 -6850 -4626
6480 -4626 -7115 -11605 -11222 -8587 -11585 -9264 -6652 -4507 -4216 2106 5939 5316 3307 160 -3433 -3782
6464 -3782 -682 864 446 1043 2817 2279 6639 5172 4199 -3566 -6628 -11796 -10101 -6445 -5257 -4185
6448 -4185 -6057 -7616 -6318 -4124 -4390 -3207 -1770 1360 -405 -4596 -8568 -8022 -10980 -7358 -1167
6433 -1167 -1760 -1928 -5684 -1544 1953 2444 1834 747 -3516 -4440 3102 4523 7872 2475 365 1345
6417 1345 2579 -1220 -546 -909 -3224 -5073 -3511 -2358 -4470 -2974 -1355 -531 -1359 -2383 -5235 -6346
6401 -6346 -4014 -1664 1152 2011 584 3018 3875 973 2172 1565 4157 3994 -1336 -4431 -9040 -6795
6385 -6795 -1146 -405 1910 1126 2525 875 -1350 -3618 -1580 2336 524 -1299 -5400 -8365 -13887
6370 -13887 -11891 -9791 -13409 -11762 -9837 -13415 -11237 -10497 -7978 -5501 -5286 -8239 -8038 -6380 -5500 -791
6354 -791 733 1412 -1934 -5693 -9350 -12075 -9504 -4515 -4577 -1981 1045 1252 -956 -3462 -7949 -11826
6338 -11826 -5663 -3693 -4297 -3109 6666 11874 10012 9941 10043 5501 -4471 -7855 -4546 -6414 -6651 -4579
6322 -4579 -2345 2611 3049 3043 2350 -2228 -6049 -6779 -2049 1297 1778 3497 3855 -4028 -6354 -5066 -13020
6305 -13020 -16889 -10756 4714 9566 6223 3062 1301 2106 14179 20503 13334 3351 -5953 -5613 -490
6290 -490 -677 -3041 -5378 -8384 -7101 -3739 6543 11258 15452 11008 253 -1834 70 9987 11265
6275 11265 9175 4823 1299 -1304 -5681 -5106 -4659 -4246 736 923 862 1165 -5598 -529 2891 -1951
6259 -1951 -4120 -72 1213 -585 -727 -744 -128 2133 1740 -339 512 -1580 -638 1017 -781 -4689 -7486
6242 -7486 -6162 -7453 -9288 -9808 -10132 -7498 -6604 -5914 -4945 -3994 -1956 -6412 -8124 -3456 -2109 -1044
6226 -1044 -328 7820 13014 4621 -1615 1457 3562 -1535 -426 2121 -1522 -6739 -5581 -4804 -3646
6211 -3646 1863 6507 2113 -3562 -1877 -4997 -6845 -6829 -3025 2058 -3166 -5817 -632 2477 1582 -3682
6195 -3682 -10793 -11291 -5372 -6746 501 1021 -5115 -786 -508 -2933 -2979 -2966 -1204 152 3227 2567 -2376
6178 -2376 -4238 -8257 -6444 -2681 2520 -436 -2313 -406 2540 -1966 -6273 -2450 510 -643 -3608
6163 -3608 -5228 -2263 -271 -4496 -5345 -6287 -4178 -2636 -4623 -6679 -8151 -7546 -8232 -8768 -6009 -3048
6147 -3048 1426 1110 3538 3371 513 4242 3799 2341 276 830 -3102 -4793 -1186 -1379 -6747 -10387
6131 -10387 -11216 -10912 -5661 -7281 -5574 -1577 -493 -1464 -2971 1092 -17 -1618 -1947 -1288 -4135 -5012
6115 -5012 -3839 -6972 -5174 -510 59 -1173 -2860 2793 6264 7566 6779 6963 9180 5285 6640 3901
6099 3901 282 1270 -1477 -3751 -6000 -2028 -2042 -5310 -7720 -10932 -5809 -2303 4595 2263 912 3545
6083 3545 3972 1126 1581 6079 5907 5661 3673 762 -4857 -5149 -8720 -9546 -8711 -8728 -8257 -3776 -1097
6066 -1097 -3612 1459 5201 4579 1254 -3058 751 5499 2331 597 -6567 -6998 -4841 -2294 -171
6051 -171 1150 -1812 177 -281 801 -1482 -6216 -4312 -5791 -7143 -4033 -972 -1087 -5852 -4876 -3308
6035 -3308 -2980 -8205 -5189 -2786 -3321 -2105 2443 2172 -2559 730 -671 -3206 -4556 -10440 -9580 -7807
6019 -7807 -6643 -9335 -5660 -2692 -4057 -2953 -2593 -1392 -884 -4970 -4716 -4052 -2486 -607 1901 -169
6003 -169 4064 1537 -889 -3629 344 3458 806 317 -1325 -1527 226 3213 7755 8897 5861 -315
5987 -315 -2246 -1297 -1123 -8957 -12056 -7086 -4138 -5711 -7849 -4364 1438 2537 777 4145 3275 3558
5971 3558 2186 5433 1069 -137 -549 -3253 2469 10434 8823 3726 1321 3122 -1522 -5875 -1260
5956 -1260 439 1650 -1840 -5070 -2659 -5591 -2252 2311 2780 5384 6519 4503 4908 2532 -2429
5941 -2429 -6515 -3190 347 6122 9275 7643 5447 1366 -3795 -5799 -4461 -3113 -2368 -721 -305
5926 -305 677 3371 7958 7175 5253 654 -1503 -3944 -4208 -3636 2681 3693 -1619 914 6088 6998
5910 6998 4717 2682 -233 2310 3068 5860 6503 2271 -1961 -7981 -7654 -3435 -340 -2733 -8453 -8650
5894 -8650 -5055 -1421 -1349 -3869 -5921 812 7014 6804 -1357 -5067 -5502 -4408 -462 -1064 -1858 -4854
5878 -4854 -2123 -4317 -3951 570 3284 106 -1257 -4123 -2690 -3012 -2894 3949 5338 -572 -5545 -2150
5862 -2150 -3828 -891 1744 1922 -2712 -2869 429 3715 3634 -1453 -5250 -4064 -4524 -2410 -3563 -3771
5846 -3771 3153 5754 -1862 -4972 -4541 1347 -3288 -4707 -4741 -5693 -5658 -2321 -595 3172 2968 -460 -2290
5829 -2290 -8228 -14718 -9712 -5990 -4293 -6164 -4916 -3088 -460 137 1086 1755 3221 4223 3028 -3413
5813 -3413 -5773 -3888 1509 6023 6714 4157 -2182 -714 546 -2476 -2430 -2421 -1743 -708 -2739 -5895 -205
5796 -205 2216 3923 2881 -852 -2882 -1314 -1194 -1573 2916 3934 -769 -4112 -5115 -2684 -3926 -3849
5780 -3849 -3521 1172 -2317 -7139 -5336 -9916 -9357 -8246 -5575 -6215 -7658 -8153 -7451 -8288 -9456 -9826 -10604
5763 -10604 -9551 -9258 -10452 -10459 -6270 -2842 -2359 1689 2503 6645 7282 2614 776 2600 713 -370
5747 -370 6987 3481 -577 -2052 1390 4477 136 -4006 -3152 586 2400 3139 2362 1401 4645 1367
5731 1367 1493 443 -4127 -5494 -2092 -1094 1927 8687 12013 8270 6774 6723 6288 7598 5591 1095
5715 1095 -4797 -7609 -8647 -8809 -8415 -6099 -1705 2212 597 -2273 -4922 -8783 -9825 -4581 -3083
5700 -3083 -5991 -7781 -7538 -10064 -8235 -1707 1966 1067 -5762 -7908 -905 -4155 -7661 -8716 -6503
5685 -6503 -2022 1442 6798 2716 7026 3468 7176 7150 4092 3786 4795 6736 10661 6623 5736 8670
5669 8670 1813 -2766 -1590 273 -387 1148 2181 1501 6754 8199 10937 5084 1817 3024 4470
5654 4470 -36 -362 -626 1870 5383 4661 -989 -3778 -475 82 2115 3574 2545 1850 826 -1381
5638 -1381 -947 2439 3316 -2932 -2924 -699 -795 437 582 558 1282 1720 1182 4051 6763 8146 5155 -2854
5620 -2854 -5285 -9369 -8708 -3276 -98 -806 -5566 -4599 -3710 -162 -636 1268 3337 9550 12424 6806
5604 6806 4253 4607 404 -1594 -887 1864 307 59 7332 10112 1845 675 -2375 1237 8960 6451
5588 6451 -723 -3012 -213 1905 3366 146 -1092 253 -331 -3016 -2699 1338 642 -2600 2971 7376
5572 7376 2567 -464 -3162 -5411 586 1665 -890 -4484 -7783 -1662 -491 -2461 86 4560 6410
5557 6410 1519 -340 -683 -2309 -802 -2616 2134 2168 2291 1681 1132 2516 5772 4140 2347 2188 5467
5540 5467 9148 10061 4285 1348 1806 3532 1360 1818 4125 6755 7996 4158 4993 5886 6013 2908
5524 2908 -319 -1031 -1796 1748 5731 2456 443 -356 3654 2398 5599 3229 7939 14307 9571 7862
5508 7862 9391 5079 5949 8471 1635 -1425 -1509 1320 3241 5441 7075 10731 7963 4198 -4057 -2658
5492 -2658 2137 2710 4150 10104 7767 981 -5132 -7842 -5718 -1291 2936 7304 6428 3272 79
5477 79 -4689 236 4614 6349 2704 -1851 -6172 -4227 4867 8033 5379 4860 4990 1271 -101 208
5461 208 -670 -2758 -8497 -5742 -2333 -3389 -6731 -9739 -4691 -3347 -318 -2741 -6729 -7003 -5055 -3670
5445 -3670 -6768 -7257 -5825 -1279 1770 2679 2349 2040 3936 5200 2304 624 -18 -2985 -1078 -4097
5429 -4097 -10042 -15052 -10847 -10623 -10630 -6669 -1544 -2409 -4490 -7096 -6712 -9235 -5176 -4360 -5675 -1489 -4719
5412 -4719 -8646 -11213 -14253 -11365 -5446 -7746 -7156 -9385 -10125 -8163 -7112 -5403 -7217 -2504 6948
5397 6948 4877 6543 9059 9695 5619 881 -905 -2114 -2030 -2863 -4697 -3841 -4416 -5276 -3835 -3338 691
5380 691 7145 8479 9235 11351 16159 13159 7170 2339 333 2503 2211 -2377 -7118 -15733 -7594 800
5364 800 -302 -2935 -2764 2448 5776 8235 3610 10107 15238 12503 11956 11447 8067 68 -3243 -2723
5348 -2723 -2877 -4077 -8367 -7995 -3824 2959 6111 8879 8790 5261 701 -2238 -3777 -5932 -4512 -2946
5332 -2946 -729 -2579 -3959 -1923 5174 6581 11463 11946 10997 9564 9908 2707 3807 10716 10304 10734
5316 10734 1698 -7469 -10709 -8398 -6501 -8986 -3080 -1756 -6664 -3047 1180 3194 5304 2957 5937
5301 5937 7328 1531 -3034 -3124 -3287 1384 1295 -1512 -4929 -5327 -2940 -5662 -5581 -4684 -1301 2396 1328
5284 1328 -4561 -4599 -1478 -2970 -7586 -6655 -4752 -4829 2123 6188 7015 3848 -753 -6424 -4713 -5290 -1432
5267 -1432 6687 6961 302 2413 9281 6593 2322 2127 3582 4206 -255 -1610 -2509 -1325 -1830 -1044
5251 -1044 3278 4224 3761 -2653 -2391 1239 4363 8497 5056 5263 1934 -2338 -3494 171 3096 1607
5235 1607 544 473 1562 -342 -1195 -1027 2252 5574 6356 962 1207 5063 8532 8470 10412 4086 -4777
5218 -4777 -7751 -6924 -1371 1238 1263 -789 -4173 -5162 -4031 -910 -381 -3469 -7100 -9663 -9324 -7896
5202 -7896 -6059 -1959 1934 5302 5497 4359 2469 -1534 5554 2770 -1432 -106 -4429 -3657 -2582
5187 -2582 -3122 -2116 824 -89 1501 7747 8366 6201 3869 3972 3258 0 -536 1972 -990 -4628
5171 -4628 -1084 -2132 -2098 -1347 1006 4171 6562 13836 7466 -535 -4066 1883 4492 6146 7127 5409
5155 5409 1096 -1954 -2889 -2845 -1648 189 -282 -2916 57 6816 13492 14665 12827 15984 16314 11982
5139 11982 5641 3030 7416 11625 9109 5299 10728 10719 5269 4494 -1510 -2679 -5315 -6617 -891 4130
5123 4130 4729 2638 -920 808 2856 -86 1604 2469 1303 4506 3156 4458 1876 -2185 -4689
5108 -4689 187 4613 5013 2760 2508 363 5322 8294 3314 2325 2626 1714 -2009 -1115 249 -941
5092 -941 -257 2016 3923 6895 12209 23769 27778 23160 17931 11630 8916 2499 7224 9929 11428
5077 11428 15126 15652 15964 13060 7856 -1546 -8765 -10933 -5468 3674 4588 4687 8956 4567 4521 4042 5055
5060 5055 2949 -4966 -7186 -3908 -2342 1407 554 -2541 -3685 1012 3548 7946 8069 7418 7071 7353
5044 7353 1048 -1830 -2913 -4741 -5766 -7330 -7843 -4512 -1653 -1386 -582 -18 1653 5351 5016 -813
5028 -813 89 -2335 -2442 -1183 3944 3829 -319 -3764 -495 447 2016 1758 4243 7334 5706 1992
5012 1992 5000 8207 5774 2839 -1355 676 4546 5407 3801 731 -2218 1901 6483 7964 6999
4997 6999 1654 -3537 -5472 -3987 -5036 -4297 -1561 -1623 -1864 2420 7950 8576 4361 2587 8328 7025
4981 7025 6739 4862 3717 9873 11913 11840 11883 9400 8669 9096 11283 7426 4299 533 1280 -387 4030
4964 4030 8166 3649 104 -97 -4419 -6952 -1643 768 3274 3182 2654 3736 1301 -5294 -11218 -9785
4948 -9785 -9360 -8229 -9324 -8982 -2625 -2350 -2861 -4569 -7805 -14519 -10913 -6683 -5193 -5234 -6331 -6042 -4456
4931 -4456 -7673 -6966 -1763 -1618 -702 -3053 1421 4549 5789 4332 5787 7739 10877 13093 8177 6682
4915 6682 7388 4966 1714 -1064 -1608 2272 3105 2206 2522 6808 5470 1984 1094 80 -1331 -6071
4899 -6071 -3236 1706 2457 1360 -3530 -484 8286 10723 7410 7831 6105 705 -3861 -6216 -4159
4884 -4159 -1515 -4318 -2425 724 148 -1450 -3447 5886 8887 3105 -4572 -3532 2254 3200 -2912
4869 -2912 -862 -3207 -4030 -5791 -4773 -3974 -2870 -4353 -896 1787 -2049 -6903 -7244 -3850 -3878 -2058
4853 -2058 228 1348 3752 4030 5808 2396 15 -5205 -7869 -5376 -4687 -800 -2940 -1137 -1082 -1299
4837 -1299 -5125 -4664 -4450 -3371 -2418 -537 1068 -1629 3011 9109 6559 1052 -2005 -3582 -8999 -10339
4821 -10339 -4788 -2617 -3180 -2464 2805 9517 12359 11497 11013 9204 5248 1116 410 -1170 -57 3546
4805 3546 4418 4992 5882 2717 -304 375 -6383 -9855 -5829 -3141 -2267 3478 6531 3774 6105 3877
4789 3877 -1095 -1190 -1824 -3575 -705 -725 486 -84 889 5833 7229 6787 3264 -587 -3220 -917 2945
4772 2945 5404 1725 511 -2310 1395 1129 3338 7834 9367 10997 7042 3115 2338 4761 5778
4757 5778 3469 1955 -7117 -4635 1960 7295 6183 6841 4583 197 1520 -436 514 1381 3994 5677
4741 5677 2146 3002 3117 654 -1961 -1696 293 5849 6109 1317 -3765 -9183 -7475 -1801 3336 5927
4725 5927 12850 15254 11501 7878 8180 5893 1947 4237 4380 285 432 -2706 -4102 -4199 -539 1920
4709 1920 -1691 -2789 -1587 -2330 3289 5882 -166 915 1338 2077 4234 1045 -2166 3589 4101 -1454
4693 -1454 1704 4068 406 2852 6741 5274 1514 1964 3331 -159 -4920 -8122 -4780 -893 2093
4678 2093 4801 1976 -3952 -6631 -5453 -6477 -7172 -10085 -8379 -6558 -4412 -3523 -4062 -9588 -7805 -3578
4662 -3578 -7264 -10435 -717 5807 6522 6517 6321 2623 207 -1855 -1184 1166 2419 1130 -97 -3025
4646 -3025 -4024 -4481 -3357 -4810 -2175 2409 403 -939 276 -2403 -4225 -6585 -6814 -2226 2741 2592
4630 2592 4583 7018 6536 7593 7042 5185 1315 -380 -253 246 3499 5441 12816 13791 12002 7525
4614 7525 4909 3558 7166 10924 8548 5448 5067 250 -1874 -3188 30 2504 -1722 952 4064
4599 4064 6079 8735 8386 6373 6026 7508 4214 4281 552 -26 866 2211 1923 4690 7069 6086 3518
4582 3518 4837 8274 10300 5248 3994 -2685 -4257 -2262 3032 -335 -4717 2382 3644 562 -2860
4567 -2860 814 5044 5002 5004 7270 5958 1973 -333 1213 275 4037 2544 6036 8931 10787 12624
4551 12624 10094 5157 2000 7403 9371 5688 3827 6463 9805 8418 5539 3158 2347 1511 4534
4536 4534 1876 1217 -394 -3235 -539 776 2387 1056 -1966 -1681 1898 1418 4414 3306 4636 3791
4520 3791 -14 5356 5955 2735 -264 -2595 -1593 3437 5658 4862 4291 4573 1745 -1794 -6181 430
4504 430 2349 4567 7585 7371 776 -2987 -4172 -2380 2789 2341 -1973 -10512 -12020 -3179 6077 9337
4488 9337 7671 5694 -870 -5888 -9770 -2839 5479 10092 4767 4908 8288 438 -1034 256 2168
4473 2168 1790 -513 -8656 -7112 -4031 -2270 -3025 -586 4664 6746 5093 7822 9946 3516 -2134
4458 -2134 -3520 -2248 1228 6564 7198 4595 2244 -2395 -112 5053 6292 7135 10724 11892 5512
4443 5512 -39 548 2439 -2599 -3751 -4844 -5196 -2774 -1993 -3114 364 344 -5191 -7631 -2663 1655
4427 1655 8133 4556 -754 2492 4184 7618 9242 5833 3905 2 -4730 -6398 -3138 -4997 -6532
4412 -6532 -389 2338 5009 7179 9049 8860 7970 2200 372 4159 1493 3790 5232 4057 951
4397 951 921 1287 1459 -259 -584 417 1751 5060 670 -2116 -3158 -1694 2959 4034 -209 1094
4381 1094 3336 5635 5268 8566 11993 9335 6792 6593 12798 11962 8911 10536 11325 5093 790 -2380
4365 -2380 -903 -791 1056 -1229 -4092 -7612 -4968 3391 1401 2201 854 3244 2204 6503 2584
4350 2584 -3502 -4682 -2906 -892 2883 6308 6402 8219 6540 7147 5673 6357 7416 11465 11062 7175
4334 7175 10099 8547 2139 -306 4880 8157 5092 2489 -115 1959 4916 5859 3821 2218 3047
4319 3047 1122 3202 7090 7098 8494 9035 8106 5112 1876 1561 8882 6815 1292 1513 6024 3727 1041
4302 1041 1675 2236 4073 5693 8543 6388 6707 7852 5721 304 1096 1344 3563 7786 10942 8561
4286 8561 7073 380 2165 4040 1376 7266 8835 5447 6255 7238 6913 2612 3478 1386 1641 673
4270 673 651 2060 357 -2944 -560 1814 1809 2432 922 58 -4542 -3451 4271 10327 12968 9806 2945
4253 2945 200 2083 3351 3009 891 -6446 -9335 -399 4213 -2147 -3124 -2837 1953 3148 1383 291
4237 291 -8 -2229 -1709 -481 1930 1763 1508 -3109 -3766 -427 2111 -266 -1321 -942 2201 -120 -102
4220 -102 487 2262 4307 2297 1801 1184 1351 1553 344 -840 3703 5283 5675 7634 6082 7812 5511
4203 5511 2264 -1647 -1394 -5413 -2032 -507 -8613 -15046 -8404 -3523 -386 -925 3072 1241 -3778
4188 -3778 -390 208 -1043 -1845 -3922 -4407 -2671 1488 4655 4803 -1745 -3176 -1667 -1105 -2086 -1414 988
4171 988 -752 1127 -252 1765 6490 2839 -2708 -959 2496 23 952 2273 -151 3044 6510
4156 6510 971 -527 -151 -1522 1425 3233 2719 1231 -1996 -4952 4305 4130 2847 3753 2922 882
4140 882 763 -5724 -2008 -2170 1838 2863 6683 3448 -1115 -1356 105 -1765 -1690 -4426 -1081 3716
4124 3716 5323 6459 87 -1023 -835 1167 -3132 -2157 4494 3835 1205 1975 2618 -2153 -1061 1772
4108 1772 -51 1543 4472 2809 -1348 -5864 -5141 -1970 -1470 223 1957 3129 4940 6758 5259
4093 5259 2053 -2331 -922 6315 6814 6144 7838 3629 -296 6265 5468 -338 -2578 1567 194 1067
4077 1067 3835 -327 -1767 -1419 -2667 -3370 -4038 681 3517 2162 -1381 794 654 2666 -1028 -1112
4061 -1112 -1097 -2339 -2543 -506 1531 67 2234 5509 7607 6342 2309 2196 1243 -1358 -3296 -1396
4045 -1396 2139 7797 12286 10193 5916 7778 7043 7206 4887 2325 -3651 -4659 -1599 -3492 -506
4030 -506 -273 -1171 -1301 -2609 -6528 -5947 -1785 3421 9397 9611 8250 7647 5150 -1219 206 4642 2659
4013 2659 6199 9067 1673 1562 2988 2537 3861 1375 -263 1202 991 1137 2174 4707 4288 1386
3997 1386 -3716 -6962 -4884 -3306 -26 1282 2229 3269 5300 6349 4769 3755 1284 5789 10253
3982 10253 7261 7066 1335 -5707 -2604 -1674 1204 5984 5450 9575 11214 13838 10501 3500 1169
3967 1169 -1894 -473 6930 7833 4287 2198 6317 7919 9469 5856 1850 2394 -178 3216 1777
3952 1777 -763 465 -402 3656 1858 -1423 -4048 -1441 2976 8690 8592 5799 3309 1218 3734 5266
3936 5266 5546 1597 2688 1749 -1531 894 3316 3568 6186 7097 2029 -3624 -1432 1369 3860 4051
3920 4051 1863 1868 3832 8146 5852 5379 7934 2868 419 -1456 110 288 -1022 -7338 -3678 -2446
3904 -2446 3264 1015 485 3064 6456 1707 488 3525 1378 -1172 3311 6868 7685 8891 2287
3889 2287 -2810 -5399 -1011 -1462 -239 7191 12930 9588 4463 6262 8651 6897 5185 3716 2736
3874 2736 -780 903 3118 550 -1212 1687 3401 3276 766 5291 6357 1871 5308 11309 8322
3859 8322 8561 11590 13223 12047 8855 418 -2698 -2374 -1938 247 -939 2482 2844 2695 1375 1753
3843 1753 3087 8063 7789 4595 7644 5800 3375 1275 -1370 1604 3779 4485 7174 4556 2653
3828 2653 2818 3573 5 -1473 -685 3080 7102 8264 7184 8494 7508 4810 2792 2678 1734 639
3812 639 -1559 -1589 -4572 -3203 3484 3658 2146 4772 2094 3952 8691 7893 3070 6378 4304 4191
3796 4191 6272 5644 4763 2514 -68 -1344 -326 2101 -962 -864 1624 5038 3175 4621 8076 9066
3780 9066 8778 12543 15863 17405 11751 6628 2078 4849 6958 4133 -48 339 -839 -1066 1019 -220
3764 -220 -1579 -4316 -4103 -4166 -6236 -7204 -10038 -9892 -6759 1168 5962 3785 -5225 -3119 376 -1462
3748 -1462 -4428 -1984 -14 -1412 197 4024 4195 3507 3005 2217 5430 4930 1508 5063 5923 5111 7183
3731 7183 9654 8098 5835 -1934 -513 3423 3448 1681 -3314 -4642 -3426 -1576 483 5715 9839
3716 9839 8449 4706 752 -156 -2317 -2514 -2448 1661 7519 8315 7928 6024 6635 2554 1813 1510 -724
3699 -724 -3196 628 4644 5422 1024 -3009 -4161 -2925 -912 -199 -3865 1034 495 -2823 -3338 2201
3683 2201 6464 8964 5601 2467 2925 1144 -569 -1316 -4461 -3275 -1686 -872 -1941 -6297 -3610 443
3667 443 1151 -1540 359 2397 2893 4351 4167 4516 3628 1331 -296 1859 1512 2561 693 -3138 -639
3650 -639 2440 -1351 -3684 -4873 -5802 -3276 -1712 2588 2767 -3733 -2248 383 2762 6669 9645 4110
3634 4110 1655 -1448 -913 2716 3459 7553 9312 9403 3100 -1961 182 2756 1908 -2717 -436 4962
3618 4962 10288 14736 18387 21506 14432 13831 13039 3896 -3854 -3695 -957 1683 1484 1176 1854 918 1280
3601 1280 3905 2280 3818 3621 3564 4190 -1074 -2211 1424 1767 4085 127 -6120 -5167 -1940 -2545 -1829
3584 -1829 -4681 -2235 1257 1219 3817 3421 4043 1988 710 3685 7410 7267 6157 8247 9016 7181
3568 7181 4558 3863 4414 3453 3198 5436 8973 7699 4432 2354 1682 1222 -2077 -1428 375 -2481 -699
3551 -699 -1512 -2242 1287 -1939 -414 2146 41 -1822 -2962 -1579 1471 2203 -1106 -2675 -2087 -1338
3535 -1338 -4109 -3855 -4837 -6756 -7475 -4241 234 2182 4802 6140 3167 4551 6286 6244 1830 -2359
3519 -2359 -1762 -3994 -10556 -16834 -15976 -12333 -11243 -7713 -5242 -3422 -1731 -271 3061 1706 -2882
3504 -2882 -7222 -4184 -5443 -7390 -12765 -12417 -13535 -13531 -13519 -4664 1531 -2328 -5175 -205 -54 -941 1524
3487 1524 2660 -308 -5926 -4430 -3116 -5205 -4141 -1042 -2781 444 7181 9344 6165 2162 740
3472 740 2734 4619 472 319 768 274 -1304 -914 -1024 4597 6776 3522 -459 -5145 -3804 -3472 886
3455 886 6746 4331 1851 648 -653 -2950 910 5228 3516 2980 3118 5481 6792 7742 7144 7093 10008
3438 10008 7562 6780 3657 2111 -2235 -3469 -4828 -3583 -2969 -3916 -2988 1357 2799 -1156 -3358 -4729
3422 -4729 -2253 -1990 -871 -1741 -272 5926 6583 6255 680 -3431 -6686 -2576 -509 -1100 3978 2203
3406 2203 319 3209 5697 700 1687 5689 3800 -928 -612 -1319 -1636 1055 393 659 931 8084 14023
3389 14023 7823 503 -2282 -113 -1115 -1441 -130 2308 1667 -2415 -3182 -2752 4572 12381 14622 14448
3373 14448 9609 6398 6230 7797 186 -6203 -7660 -7063 -5859 -4872 -3690 -8829 -12851 -8645 -4327
3358 -4327 -6664 -4322 927 2074 8725 13628 9438 6710 6281 6139 4356 5301 10124 7574 5942 6336
3342 6336 11364 12490 9791 1738 572 5013 4171 6346 2547 4900 1569 580 -76 1117 1533 -2538
3326 -2538 -517 -852 -4039 -4215 483 940 2018 4301 4084 3079 7863 4813 5140 5924 6856 5965 5383
3309 5383 6441 11620 12829 8944 9023 6189 177 -3373 -3063 350 8161 13903 9625 2695 -2969 -1925
3293 -1925 774 2615 -66 -2303 2612 2611 -208 4086 8164 5761 515 -2083 -4828 239 3346 3890
3277 3890 4605 5739 5400 4893 4725 6991 6646 406 -2418 38 4264 3552 -996 582 -898 524
3261 524 3044 -2653 -3697 -975 -630 2392 2354 -172 996 2618 2122 6374 9407 7200 10655 6922
3245 6922 1613 877 4440 6123 6891 10351 11180 7579 5359 3297 -2094 -1320 -1336 43 3977 4371 530
3228 530 -5810 -5071 -1702 1829 797 1094 -1242 -3143 1152 1251 -733 1332 3658 3211 -1101 1060
3212 1060 5998 5940 5428 6777 2859 -3868 -6504 -10273 -10152 -7675 -3207 -1695 251 -1028 -2115 -1203
3196 -1203 -1625 -3393 -8758 -8917 -2944 1016 593 1145 -466 -5955 -7247 -1329 -513 1328 6072 7179
3180 7179 4688 4692 6033 7217 4148 4315 5480 6001 2932 -1494 -2543 -3900 -4293 -5728 -1489 2797
3164 2797 7122 7524 6375 4811 8210 12239 5504 4416 6403 4670 10812 10412 6842 6463 10789 10277
3148 10277 5579 6127 4007 9515 11264 9249 9802 4439 -1794 -3612 -8598 -5712 -5952 -3766 489
3133 489 -186 -4099 -4934 316 -1746 1578 5168 4494 1624 2318 -638 -5500 -9719 -8738 -8938 -7206 -9738
3116 -9738 -9154 -4322 -368 2699 5444 12805 16359 13439 10969 8384 3965 1569 2042 6032 8666
3101 8666 10625 8922 7935 3266 778 3493 5762 6813 7471 7680 1928 -2835 -1115 -133 -3822 -1958
3085 -1958 1541 5468 3955 1538 3741 8207 11847 9335 8997 13049 14017 8056 362 -3211 -4116 -5021
3069 -5021 -4457 -8489 -3751 -605 -356 3022 4442 5354 3924 2588 2030 976 2617 3093 1005 2415
3053 2415 8156 6913 4499 -768 1663 5093 7125 4013 4676 5060 4402 6003 4809 7978 6617 3813
3037 3813 4003 -1325 -2252 6646 11687 5632 4772 6941 10518 9057 8369 12641 11343 10114 6882 4771
3021 4771 5759 9005 12253 13030 10140 11039 14916 9004 4837 2212 1945 2930 -1227 -3006 1071 1462
3005 1462 3942 4963 2031 2978 4000 929 116 3971 1174 -1549 -4688 -1238 369 168 -7925 -9164
2989 -9164 -3422 961 -209 -2050 -4622 -5223 -1757 -3878 -4752 -1828 4092 3200 4189 1579 4727 7177
2973 7177 7382 7650 7395 5454 4499 -71 -3041 -2246 3390 -1059 -2417 1270 1584 319 -2009 -990
2957 -990 510 -3314 -6640 -4241 274 3529 5207 5564 1732 1228 4632 1299 604 -1509 -1725 527
2941 527 -508 296 1841 1954 -4779 -10543 -4284 3925 3406 2673 3686 4117 8643 10714 9440 5427
2925 5427 1498 1075 2616 2100 1713 -997 -806 -5009 -5577 -6009 -2171 -326 -2006 -5050 -6294 -8384
2909 -8384 -10280 -9313 -7217 -6431 -4234 -2284 -2593 -4196 497 -1431 -2158 -2809 -3191 -868 -639 -1917 -5122
2892 -5122 -8409 -3529 3183 1151 -372 1023 4889 7792 10992 14745 13196 9556 6400 4577 -497
2877 -497 -5831 2904 1077 -1666 1064 6720 5011 3570 3690 182 -3159 -1259 -3860 -3853 -1309 4008
2861 4008 7941 13615 9654 3300 2290 1983 5142 2892 -2024 2412 7612 7218 5771 2099 5543
2846 5543 5790 1446 1914 3934 6630 5450 5459 2451 3827 6122 5807 -263 4908 10903 7971 6857
2830 6857 6717 2123 -2424 -1147 -2625 -3981 936 2498 91 812 3816 5415 6517 8299 10090
2815 10090 5809 -475 3295 7621 9033 3413 80 228 9913 12398 8625 4333 -1445 3210 5148
2800 5148 3292 1257 -60 -3913 -5494 -2290 -5271 -4791 812 1891 1762 -2700 -5331 -6763 -7706 -2824
2784 -2824 -1277 -27 655 202 -2266 -301 2685 4073 4150 874 71 -73 6573 14698 11751 7244
2768 7244 10426 5747 3369 916 1518 -609 733 -177 -1053 -2607 -314 1508 -1228 -501 -1423 -8373
2752 -8373 -11861 -10257 -1416 5789 4549 3304 -175 -1069 1495 3647 1294 -3303 3440 4552 -963
2737 -963 -954 6209 11632 11305 3405 -2778 -2838 -1027 -1764 -7706 -12065 -14247 -7741 -1399 779 -1865 -1230
2720 -1230 -2581 -3231 1252 1871 7632 5851 1259 1361 825 -1266 -3734 -8472 -10949 -5200 -4085 -4992
2704 -4992 -2834 -1045 -3740 -3551 1972 1601 1630 689 -61 -2002 -1200 2228 4873 6284 7269 5595 5267
2687 5267 589 -6234 -4737 -334 62 5430 5007 279 1549 4958 6799 7121 3985 1997 1122 2896
2671 2896 3893 3788 2776 1787 2284 -2096 -4874 -3923 -2541 -3191 -406 5725 6120 9117 11148 2392 -5186
2654 -5186 -7012 -5367 -7119 -6126 -5840 -5565 -1611 -1353 1493 5746 11204 8742 6024 10084 11554 6220
2638 6220 3483 676 -1204 1066 3844 1424 1878 3189 3382 5872 8019 4851 7062 5070 787
2623 787 3632 7439 7212 9182 11406 9995 9070 7799 7237 6363 1467 -2644 -3869 -7424 -2219 5250
2607 5250 6118 1499 -3266 608 2967 -363 -2885 1395 -314 -1962 1949 1798 -1972 -3395 -7551
2592 -7551 -11022 -8908 -4017 -3034 -1721 1879 4378 -247 650 1347 -1144 120 -1546 -4577 -5299 -4773
2576 -4773 -4600 -1940 -2585 -5353 -2520 -2780 -3507 -3781 -2178 4155 4022 1953 1705 7394 5995 5805 4990
2559 4990 6141 -484 227 2687 1945 1653 1736 -65 1367 795 -2403 -5508 -6177 -1593 231 -4118 -6400
2542 -6400 -4890 -6318 -5025 -6418 -8383 -6535 -4971 -7328 -10774 -8840 -2819 4177 3180 5055 5204
2527 5204 3435 -2266 -5266 -5080 -4033 -5431 798 3778 -2362 -7598 -4489 682 -3331 -4874 -2498
2512 -2498 -4593 -5213 1412 4601 -1943 -2941 -767 29 -1477 -2092 121 -1182 -423 -1977 -1318 -53
2496 -53 3915 6640 5568 875 -1691 -3415 -4387 -2045 -2635 90 3612 1659 724 -205 -4711 -8082
2480 -8082 -5443 -564 -2479 -3824 -4255 -1515 857 2137 -218 -1176 -1645 3726 5816 11450 15277 13029
2464 13029 7517 2382 155 462 1409 4732 6211 10220 10447 4424 -734 -8673 -5546 4020 10426
2449 10426 10185 7061 -806 -5259 -2550 -793 -3567 -7815 -2617 1771 -728 -4120 -4582 -892 6259
2434 6259 2689 -1526 1104 -1027 -5059 -6847 -2247 467 -3828 -2675 -3083 -9332 -9374 -10027 -9004 -9511
2418 -9511 -9572 -7409 -5229 -917 418 -929 -2847 -6275 -4104 -2015 -3805 -7530 -4315 -1586 1039
2403 1039 2334 2114 6737 7832 1195 -1720 1609 3898 -2116 -5260 -3519 2123 67 -4676 -6351
2388 -6351 -6176 -3762 -4336 -6203 -3482 0 3032 2561 3213 261 255 4957 9892 9455 11013 8548 6196
2371 6196 7643 6019 3886 3713 4468 4452 1593 4684 4337 5502 4137 -1212 -2680 3596 6054 5803
2355 5803 4281 -791 -940 -18 1926 -3310 -3150 -28 -3193 -6611 -6714 -7258 2391 6683 6743 2778 4870
2338 4870 1573 -408 -1693 4811 11496 8408 6434 7028 6768 1314 -387 -4851 -3597 3008 10066
2323 10066 6798 4460 1936 -6069 -7763 -5461 -5386 -5684 -5388 1098 4182 1829 1773 7643 6901 7474 7575
2306 7575 6312 5996 4948 1302 -2383 -6672 -9909 -5540 -3109 -1735 2385 8580 8576 11262 10894 7287
2290 7287 5963 4806 1060 4445 3085 2062 3864 3174 7243 6899 7996 5017 1317 2476 -2008
2275 -2008 -3544 -3651 -6367 -3444 851 3669 2595 -1952 -381 -1827 -3171 -3429 -2339 -3697 -3328 3735
2259 3735 4798 791 2850 4606 2818 2428 4721 5667 6385 3926 1787 1189 2214 2554 4076 6328
2243 6328 1314 -2785 -1683 3304 785 494 -1273 -800 4031 5911 8287 12237 10852 6295 3317
2228 3317 2764 3789 5609 2910 4104 4336 -1609 -347 -531 2223 430 -1927 -5372 191 4210 2210
2212 2210 -4150 -4469 -782 3303 2961 1565 3655 3269 -1999 -1347 345 3921 6276 10170 9631 5077
2196 5077 1991 1573 5643 245 -2261 1243 3895 3598 -1673 -3379 -3909 1439 4370 1723 1952 3192
2180 3192 2365 -1264 -4036 -4121 -4904 -3134 -8049 -6547 -3317 50 2268 6980 8741 7193 2438 4033
2164 4033 5060 4909 4215 3253 -913 -7479 -4149 -2038 -778 1315 227 18 308 -717 279 1496
2148 1496 5396 6288 1397 -4917 -3998 -4892 -5839 -6290 -4580 -2489 1432 -311 -3634 -6043 -2153 1894
2132 1894 3295 4094 6230 4274 2272 -3128 -9767 -7424 2593 5264 4336 2358 -1328 -4757 -3811
2117 -3811 -3791 -8927 -5632 -7864 -5437 -5887 -1174 5207 -1593 -4968 -1446 5005 6094 8814 8385 3650
2101 3650 5886 4223 3533 684 943 279 1573 1508 217 934 1720 -6724 -4534 -2811 -1332 -540 2802
2084 2802 1716 1912 3778 4638 7565 9221 7292 7189 9015 2434 -4861 -3022 -1115 3116 3259 997
2068 997 -4265 -4109 -4971 -5243 -3634 -4794 -456 -1965 -1954 -3549 -2081 -78 1308 3083 -1490 -2512
2052 -2512 2400 798 2085 6345 847 -1115 1476 1292 -1239 -4416 -3066 -1178 -6860 -8580 -11007
2037 -11007 -8292 -2909 -1906 -1874 -2777 -143 -1014 727 416 1723 3681 824 751 977 3625 1642 -2900
2020 -2900 -2263 -1799 -1308 -8909 -7255 -1926 -400 -1690 -2406 -3888 -4784 1952 7736 5270 2697 5
2004 5 546 2845 5379 6425 8692 9006 5256 4636 6217 7234 2684 2476 2421 2974 -1126 -2851 4264
1987 4264 1263 2861 10353 11502 10807 5597 3570 6943 6233 3770 6748 4941 2064 -864 -3596
1972 -3596 -3468 -2672 -5640 -11897 -8831 -2321 4759 9168 10400 14540 14623 10460 5275 6046 6317 6567 9179
1955 9179 6520 1727 523 -777 350 4531 3393 2988 766 91 3082 1765 1300 3429 1691 -2324
1939 -2324 -753 -2741 -5534 -3237 334 2559 4327 2646 3483 4069 5264 6057 3144 4319 5670 3035
1923 3035 4512 477 -1661 3637 6270 5081 1051 -98 672 4584 2182 -1426 -458 765 -2216
1908 -2216 -96 -5074 -4760 -59 -235 -7076 -7223 1136 3509 72 -319 -176 -1522 631 2426 4908
1892 4908 2783 -121 791 1423 -2153 -2177 -5337 -8857 -7833 -1992 -5804 -7668 -7906 -6555 -6409 -6481 -6205
1875 -6205 -4897 116 876 -3217 -2617 -6123 -7382 -5956 -3741 814 -729 -8611 -7949 -188 4369 6951
1859 6951 6531 6804 5138 2812 -453 -4005 -4574 -2220 -644 -6761 -6021 -5989 -2062 3770 7710 6974 7375
1842 7375 1245 -3663 -3648 1087 4686 5579 5610 3475 -2364 -23 976 -1581 -3773 -2380 -1124 -3468
1826 -3468 -4545 -2710 3052 5022 4657 5598 6601 4068 4424 4605 1813 1070 1032 2201 3870 -1345 -2981
1809 -2981 -609 -4395 -3812 -6018 -5711 -805 663 458 5510 7376 6674 6696 4574 3839 -3106 -4538 -4625
1792 -4625 -6305 -5411 -1133 -939 3638 6966 4575 -452 -6047 -9295 -4666 1340 416 -45 -572 77
1776 77 3967 5223 5210 2093 -399 2126 3458 6300 7146 2900 2650 -971 -1873 -6650 -6360 -7586 -4994
1759 -4994 1438 1415 -3104 -4287 -1641 1265 3721 3155 -2120 -2739 -268 2684 1869 -3794 -7610 -3249
1743 -3249 -1492 1015 -1293 -678 1133 2474 -1908 -4365 -8408 -5920 -3119 -7193 -8405 -10657 -9885
1728 -9885 -6724 -5078 -2119 2748 3584 932 1120 -23 962 -2701 -7870 -4686 84 1025 2579 5072
1712 5072 1270 1122 3746 1007 -3735 -2243 -4534 -6626 -3983 3366 6207 6561 4405 54 -1975
1697 -1975 1351 1730 5731 8245 9419 7089 9421 10317 9035 10691 11437 4278 3442 4126 1912 -2623
1681 -2623 -2679 5203 5641 2378 3319 989 -1631 -960 2870 1914 -1383 -731 -159 -1568 -5263 -4421 -6124
1664 -6124 -1744 1151 940 1151 1415 4843 2979 -1368 -4293 -6757 -5045 -4280 -3641 -1294 -1729 2352
1648 2352 4800 3319 -414 -1658 -728 -3277 -3295 2247 1015 4488 3071 -2318 -6329 -1688 1377 -635
1632 -635 -3021 -5010 -6041 -7460 -5545 -9093 -6109 -8006 -6918 -5298 -973 841 231 584 1970 5233
1616 5233 428 -1207 -579 -4203 -4259 3526 3687 581 1369 5684 2651 -1515 746 3052 1230 -4502
1600 -4502 -7748 -4338 -1329 791 -2378 -3944 -2312 1029 2595 8586 3939 402 5941 10953 9140
1585 9140 3427 -1142 -1050 2936 2315 -437 -795 -538 -422 1342 3427 -1579 -3585 -5033 -225 998
1569 998 -84 2733 5641 4893 -496 578 -1318 -3840 -4758 -1049 -3214 -3632 -6742 -11832 -10989 -6749
1553 -6749 -4281 -6875 -6789 640 5477 -999 -2476 -1701 -764 2690 10005 9437 1475 -2916 -1902 -1813 10
1536 10 -171 -2017 -7947 -12141 -12970 -7488 -3788 589 1098 -1994 -5143 -9618 -3086 -1532 -4281 -4135
1520 -4135 -2206 -3711 -5225 -4098 -5514 -4096 -1135 -4547 -5993 -1694 1413 131 -5510 -5501 -3301 4376
1504 4376 11316 9964 5246 39 -402 5080 7377 5407 5216 -2012 -6829 -816 3741 8329 11486
1489 11486 10095 9304 10870 9494 7980 4841 5452 1868 1371 -169 -3550 -4506 -3136 -2246 -2724 -6536
1473 -6536 -5216 -4359 -3183 2996 7999 8611 12968 15344 7582 1817 -194 4440 5511 3482 1792
1458 1792 1276 2055 -35 612 953 -2896 -5461 -4706 -6263 -12488 -13476 -10177 -8143 -5377 -5177 -2982 -3089
1441 -3089 -1190 -1 -91 656 -307 6621 3935 1766 -31 3049 6451 4318 626 -5266 -7799 -4191
1425 -4191 -2290 -2212 104 -200 -2563 -4163 -3023 -323 -4493 -6406 -1826 2764 3126 -1610 -3060 -851
1409 -851 -4630 -6766 -7454 -4694 -3408 372 5665 830 -1016 -1277 -713 -2503 -1709 -2587 -1395 -1280 -3560
1392 -3560 -4012 -683 2276 899 300 -3292 -4806 -1614 -3051 -2989 2818 10727 12901 3050 -5441 -6587
1376 -6587 -1960 -2883 -2829 513 -573 -4435 -5663 -4143 -4974 -8030 -8716 -8419 -15344 -16693 -11987 -1203
1360 -1203 1818 255 -595 543 -2230 -6163 -6522 -8129 -9246 -10256 -12683 -13855 -17569 -16036 -13868
1345 -13868 -13534 -14809 -15175 -11458 -13224 -12643 -10193 -11903 -10262 -1638 1508 2646 1523 -2409 -3951
1330 -3951 613 1483 1788 -653 -4984 -5797 -7555 -9081 -986 2034 1396 620 -3564 438 612 -3316
1314 -3316 -5062 -2815 -2933 -2619 -4623 -6156 -9185 -7162 -1796 666 284 2857 5305 7848 7914 4424
1298 4424 1804 -2941 -4678 -2205 2855 441 -6655 -1654 1138 -2427 1849 -827 -3850 -5852 -7599
1283 -7599 -7274 -6832 -4628 -1899 206 -230 -3091 -4645 -2142 -5253 -5397 -3234 -4398 -5520 -4720 -5810
1267 -5810 -6241 -3982 -804 -3304 -6181 -4940 -3106 -4188 -5990 -4164 -6419 -15569 -15066 -11513 -13776
1252 -13776 -10287 -8341 -9450 -13323 -14502 -5396 856 2118 3232 5269 2710 1983 115 -3480 -4551
1237 -4551 -1560 875 -1211 943 1495 -524 -5482 -6798 -6418 -1299 -1212 -2299 5804 9023 8911 7486
1221 7486 5659 4739 5469 5966 6138 5546 2456 5801 3123 -2188 -1045 6335 11400 3178 -1341 -4471
1205 -4471 -6460 -6902 -8593 -8151 -216 355 -3851 -3083 2142 3287 3608 3099 3148 -4631 -6660 -3537 -8937
1188 -8937 -5778 1464 4860 4699 4947 11512 11213 5598 5241 9642 10382 13777 12385 12622 8947 4648
1172 4648 2958 3384 6143 6694 5631 2127 -5386 -10712 -10857 -9756 -8190 -6127 -672 -1242 -3424 -3701
1156 -3701 -3948 -3237 -4016 -9995 -9342 -7398 -7962 -7135 -10061 -8997 -6527 -1994 -3284 -4977 -7585 -2473
1140 -2473 -1903 -3547 -5350 -5239 -6434 -5020 -1727 -7182 -11711 -12125 -7023 -2861 -1696 -173 4015 7248
1124 7248 4943 5684 8031 3821 -1107 -3945 -8198 -9681 -10967 -10153 -7111 -4583 -3165 -3472 -3184 -5741
1108 -5741 -6905 -12706 -15121 -12917 -9113 -9288 -9310 -9210 -9930 -5864 -3914 -6763 -3314 -4329 -2204 424
1092 424 -329 254 -3263 -544 503 -5429 -11251 -16877 -14587 -9399 -9031 -11388 -12151 -14326 -10223 -7947
1076 -7947 -5034 -5956 -5660 -7179 -5682 3768 8442 11481 10768 2949 -2791 -2453 1746 -922 -3009 -1264
1060 -1264 -4303 -5707 -2655 1398 -430 336 -905 6786 8995 7019 32 -2723 -5024 -4882 -5659 -5364
1044 -5364 -4658 -2483 135 27 -2209 -1480 1747 3685 731 -4272 -4561 1383 2096 -1977 -5533 -6351
1028 -6351 -7566 -6426 -5385 -3701 1541 5860 9946 7822 2744 1816 1145 -2339 -12552 -11444 -7382
1013 -7382 -9372 -8115 -7544 -10230 -9327 -9612 -10993 -7902 -7405 -4470 -2588 -5227 -10546 -12570 -9624 -5795
997 -5795 -7064 -7495 -4209 -1154 5076 4843 1898 -5090 -5837 -3156 -6240 -9483 -10177 -7278 -6207 -6984
981 -6984 -7455 -4397 -1204 -104 -3180 -3486 225 -4488 -10332 -6804 -4003 -2993 -1307 -3041 -4151 -1261
965 -1261 -3586 -1765 -145 -2654 -2549 -1392 154 -850 -4721 -1575 -3883 -8831 -7756 -8080 -11515 -9955
949 -9955 -7202 -5150 1279 4643 3122 -1049 -5574 -2971 704 1356 -409 -4136 -9245 -7872 -3775
934 -3775 3044 5644 7603 6016 2119 -356 -3370 1294 1841 -4581 -5340 -1919 2958 579 -4001 -4804
918 -4804 -6221 -5318 -2941 -3961 -4768 -8261 -9953 -10511 -11113 -11523 -12210 -7813 -6446 62 1639 -1714 -1675
901 -1675 1524 3751 1151 1110 3112 -2320 -5887 -9897 -13897 -5680 -894 1238 2116 -1309 -3062 -3228
885 -3228 -3771 -1897 -1469 2727 3102 -807 -4702 -7443 -337 7094 5972 1176 -6235 -12639 -11084 -13308
869 -13308 -11902 -9960 -5936 -4902 466 3622 955 3177 3375 -1080 -200 -2183 -2433 334 4133 -674
853 -674 -3728 -1803 -1517 -4342 -4077 -1434 -5184 -10837 -13418 -10700 -8566 -6621 -6136 -3608 -1554 -2887
837 -2887 -6260 -4013 -2051 1485 5298 2693 -2013 -5000 -8950 -1100 -841 -5873 -7987 -10320 -10274 -4913
821 -4913 -1810 1166 6268 6652 1357 1510 2116 2204 4136 730 -5563 -4788 -2940 -2939 -3510 -8151 -3878 4754
803 4754 3786 1703 393 546 2255 5880 6506 3156 -112 -2527 -6478 -5575 -7046 -9142 -8512 -8420 -2310
786 -2310 430 -170 -3231 -1669 -3467 -5954 -4727 -5312 -9288 -6923 -2662 -3783 -8576 -11425 -9814 -3420
770 -3420 1928 4091 4147 2166 -1126 -1895 -1310 -737 -2536 -2296 193 4917 4194 1687 1158 5863 4765
753 4765 702 2486 -2004 -7042 -7686 -6237 -6135 -4661 -4986 -1695 -1755 2486 6154 7061 4666 2049 1832
736 1832 2831 2303 662 758 292 -299 2429 2920 352 1066 -887 1543 1745 -984 -5719 -7426 -8436
719 -8436 -2282 4229 1392 -1725 -399 -5284 -3694 -1322 -2251 -3989 -1405 -2006 59 2660 4410 6235
703 6235 8098 9266 6254 1570 1549 2459 691 3051 3230 -277 -4928 -5176 -5520 -1661 -1872 -2031 -5750
686 -5750 -8206 -3551 -1391 -3738 -8658 -6494 -1323 -1522 -2011 -2765 -197 565 1375 1468 -777 -3544 -172
669 -172 3219 20 -1833 171 2899 3422 5597 -711 -2027 2656 3059 919 284 -1466 -1854 -3204
653 -3204 -1514 -28 -3612 -7816 -10576 -6271 -1516 1863 1994 5051 5541 -175 -809 2576 6723 9260
637 9260 8542 11528 12562 8913 2112 -2007 1310 2512 -2263 -9662 -12424 -11193 -4219 -2193 -6047
622 -6047 -4110 -1957 -4540 -5004 -3063 530 1607 859 1302 1513 -251 -567 -3332 -5081 -4023 -1236
606 -1236 318 850 -2452 -4750 -4705 -7642 -12722 -10044 -7612 -5999 -2304 -1271 -797 -7044 -10879 -7810
590 -7810 -6555 -5962 -3953 -4920 -1845 -479 394 -3860 -6964 -11429 -13406 -11486 -5441 -6384 -7816 -3648
574 -3648 5134 5893 6523 6715 7414 4546 2411 216 147 2960 -1175 -2319 1942 4342 120 -392 -218
557 -218 -5897 -8085 -5109 -4786 -8293 -11721 -8878 -5759 -1190 -175 -219 384 -1844 -3506 -101 -844 518
540 518 1688 410 877 -3522 -2818 -2697 -3042 1271 7939 6254 -566 -8262 -7540 -3666 4860 8742 1865
523 1865 -420 -1105 1527 3510 1121 154 -3100 831 1793 -2287 -407 5714 5325 -2232 -10071 -6341
507 -6341 -1020 -2779 -3993 -2412 -2718 -5077 -9415 -8244 -3466 2576 6560 1563 -145 -1123 -4014 -1837
491 -1837 -1678 -1568 -3776 -7261 -7110 -237 3119 1009 -3034 -5304 -5403 -8332 -7354 -6016 -5852 -2090 315
474 315 -2281 -5275 -5250 -11255 -10442 -10124 -8489 -6268 -6584 -7384 -3910 3138 2038 1997 4532 3673 1163 2079
456 2079 3402 6194 8928 11204 6804 931 2435 -675 -1232 -3689 -3805 -925 -775 -3106 -2913 -7377
440 -7377 -9721 -9728 -9387 -10166 -3497 2619 4798 5180 -2041 -9611 -4419 -2172 684 491 -519 1313 745
423 745 914 3250 3999 -3296 -5596 -2396 -1898 -4769 -6940 -6278 -2927 -2512 -390 3545 4402 948 1744
406 1744 3264 3453 131 5430 4007 -1118 -1983 2104 5295 4205 3009 -2673 -3454 -1463 -3772 -5091
390 -5091 -4697 -1952 -4037 -3690 -7767 -9491 -9371 -8575 -7490 -6756 -3539 -4202 -2172 -2342 -693 -4510 -3266
373 -3266 -2811 -2000 -4036 -355 -1527 -3602 -6759 -6376 -10261 -12333 -10788 -4873 -946 -2558 -3972 -4711
357 -4711 -4226 -6358 -2692 3132 3325 -1352 -1432 235 -111 -3373 -307 6958 6899 2667 897 2694 -2332
340 -2332 -990 -6229 -8967 -8941 -8035 -6765 -2508 2123 1942 -4421 -3413 -758 -2754 -5546 -3612 519
324 519 3030 1805 -1691 -1676 -1933 -2590 -1823 -2351 -6230 -5736 -3874 -5507 -2823 -3909 -2814 -4577 -5473
307 -5473 -5354 526 942 -4532 -9890 -11519 -7219 -6116 -3652 -5232 -4918 -3743 -6004 -8783 -9644 -7100
291 -7100 -6129 -4792 -4552 -6692 -6233 -4521 747 2512 -3566 -6134 -8075 -11107 -5697 -2395 -2357 -6424
275 -6424 -9112 -7542 -5905 -2195 4561 3393 -585 -1114 -166 165 64 2613 3656 3057 1853 4043
259 4043 5843 6075 -1374 -4233 -4659 -3681 -5612 -5230 -5580 -1789 -2040 -3628 -1815 1688 -516 -480 -3439
242 -3439 -6116 -6363 -1339 745 1448 6112 6695 5610 5867 1015 416 327 -3573 -1752 1205 1796 4390
225 4390 3995 892 519 -691 -229 7247 12403 6592 -2080 -2868 3103 4491 855 157 -2789 1465
209 1465 2791 -168 -3881 -2395 1615 6276 5738 2829 2629 4690 5815 2468 -1969 -5210 -7076 -6263
193 -6263 -4409 -4492 -4447 -2393 -3896 -10110 -11373 -13898 -11204 -5800 -8776 -10333 -10074 -9653 -7609 -4127 -689
176 -689 -2394 -3199 -3723 -4797 -5473 -3369 -1240 -2089 -4795 -4457 -3439 -379 604 2293 96 -1211 -1378
159 -1378 1782 915 -1422 -5230 -6859 -4733 -6171 -9400 -7734 -3352 -103 2761 -2451 -9094 -11925
144 -11925 -12647 -11434 -9475 -10562 -9686 -8423 -7531 -6192 -4796 -6747 -5750 -7145 -8941 -6983 -3161 -783
128 -783 -1029 -3877 -4742 -4085 -4332 -6725 -5234 -4764 -1269 -634 -1611 -944 -1957 -2740 -3615 -3873 -1919 -42
110 -42 -1607 -5993 -7698 -3842 -4815 -5626 -682 819 305 -29 -1769 -2547 -4029 -5264 -6318 -7494 -7289
93 -7289 -6481 -5145 -5573 -5810 -7851 -7962 -6555 -4155 -2111 686 1099 -3256 -7313 -6860 -4456 -2731 -2396
76 -2396 -346 -1378 1180 2235 3524 1397 -1275 -3358 -3529 -7893 -9841 -8674 -3112 -789 -4402 -5919
60 -5919 -6675 -4028 -4534 -1842 -1406 -673 959 834 -1190 -2184 126 -552 -1830 -3010 -4882 -5852 -3146
43 -3146 -3486 -3125 -2817 -1834 1109 -209 -4894 -5818 -3871 -1897 -3297 -5352 -4543 -41 553 -3254 -5524
26 -5524 -5145 -4610 -7053 -6698 -4365 -4583 -5456 -4119 -2839 -1716 -1005 264 1079 3759 3195 2157 2062 -2286
8 -2286 -2630 -3392 -7088 -8810 -9153 -5683 -4654 -7315
0 -7315
$$ Imaginary data points
##PAGE= N=2
##DATA TABLE= (X++(I..I)), XYDATA
32767 87411 85514 86139 88016 85827 84472 84648 84128 84941 85987 89301 90016 90638 95315 96794 99078 97853
32751 97853 95803 95781 94168 92997 96392 100913 102677 105888 103448 105476 105990 107664 107342 107730 105444 107017
32735 107017 109981 112159 114978 113070 114867 114457 116404 121874 122521 118909 117582 116357 116770 118089 117539
32720 117539 120291 122707 122775 122212 122261 124452 125629 126274 126373 126219 126973 127918 129955 133006 133497 133747 134731 134647
32702 134647 133209 137660 138242 137105 139320 142162 141954 140928 141468 139336 140634 141292 140407 140432 142694 142303
32686 142303 138828 137372 140070 146369 147319 145902 143034 142629 145033 146076 146257 148504 153942 155419 158360
32671 158360 157410 157064 155565 154453 157999 162942 164960 163401 162883 161658 158946 157815 160522 162211 158092
32656 158092 162654 168994 170756 168114 167345 165647 166975 167743 168472 169998 173103 173337 173384 172165 170620 175258
32640 175258 176692 176584 178053 177896 174465 174223 176239 179157 184956 185897 180857 177307 181767 182129 184785
32625 184785 186284 189531 191476 187013 188660 190909 188884 189524 190718 189840 189347 191286 192298 192072 194317
32610 194317 193457 193743 194286 194447 194942 196384 201351 202796 199696 200481 201511 204321 202430 205113 204069 201569
32594 201569 203020 204839 207841 207221 206811 206793 206399 205825 208486 211435 209516 206386 206897 212393 213297 217353
32578 217353 218001 216177 219441 222541 224147 226037 221947 217652 222903 224814 224725 224166 225736 226521 224040
32563 224040 227271 233768 233467 231340 231302 235549 237239 234447 231672 231175 234149 238540 236458 233849 232439
32548 232439 235630 236357 235032 233516 231961 229797 230527 228572 227180 229494 230747 234326 238766 243521 240212
32533 240212 236404 234698 237890 239723 243628 242180 245996 253354 253515 251106 248762 246953 245987 249652 250217
32518 250217 250312 247588 246094 247826 249263 249392 254091 252729 248462 249634 251919 254540 256102 255382 253149
32503 253149 250327 251401 258787 261588 261750 259050 261754 261871 262111 258983 257257 255710 256285 257073 259256
32488 259256 262591 263462 262934 263732 264083 263912 264469 265019 263349 261408 261736 261032 262982 266563 269880 272889
32472 272889 270525 268323 267763 269306 271739 273575 275042 274711 272708 271063 269892 270503 276767 277695 278201
32457 278201 278644 280890 280591 276172 273235 272139 275315 278141 279121 281470 275445 272564 273001 278000 278201
32442 278201 279349 281711 280837 284928 287071 288544 289558 288180 284886 281082 277358 280807 283295 284389
32428 284389 282276 279249 278682 282078 290845 295713 294316 291161 289769 293735 294942 294821 294697 294897 292827
32413 292827 294348 293438 289479 294695 297926 298426 298116 303316 303237 301554 298638 290765 292264 294181 296261
32398 296261 295147 291831 292371 295281 297217 297369 296076 296200 295053 292694 293558 293383 291014 290848 289955 290190
32382 290190 294649 296709 295484 300422 304999 303341 302694 303060 303216 302107 302101 298307 301688 303154 302480 308947
32366 308947 307720 307001 304170 297806 295311 292690 297219 298715 302261 300030 300145 301771 298864 298222 304054
32351 304054 307298 308194 310681 316714 317077 314739 315119 313712 314025 314647 311970 312286 312816 312396 311956 310605
32335 310605 315357 316604 311349 312684 315694 318614 317060 311989 312291 312079 308931 310437 308264 307181 307810
32320 307810 308946 305531 307859 309332 307901 313820 311971 310089 310733 315090 319206 313510 311176 312332
32306 312332 314368 319183 315053 313881 312762 312564 318607 320118 319329 317967 319226 322745 324262 321424 320421
32291 320421 322915 322747 317715 316546 315926 315742 315354 317284 317533 317834 319006 317858 316312 316982 317850 317353
32275 317353 321881 318422 321541 322144 325056 326964 323834 321565 320430 315770 314721 317080 318934 316058
32261 316058 319208 322839 323836 320936 317809 323843 324744 320316 327321 330136 327254 323794 320992 318891 319712
32246 319712 323312 324370 325845 324627 321129 318930 314925 316371 324145 322854 323932 325517 328072 325684
32232 325684 326380 327833 330670 332342 330204 330125 332882 330290 329156 325731 320110 322584 324516 326553 329062
32217 329062 330040 331668 328547 328161 324261 323262 324021 329520 329736 326051 325352 324657 329809 330839 328594 327211
32201 327211 330216 334655 332240 331680 329859 327955 325110 325938 327055 328777 326087 327273 328098 328184 327169
32186 327169 329643 327583 328413 326984 325759 326442 328046 320944 318384 318449 325292 331144 326740 326524 329942
32171 329942 329628 332697 333659 332943 330633 329018 331138 329549 329101 335030 339461 337631 336884 336257 337710 339806
32155 339806 340571 337421 335547 334512 331792 328635 326488 327819 325998 326918 323216 324527 329818 330014 329909
32140 329909 332055 329239 323542 324944 329046 328249 329242 327130 323857 325325 333560 335301 331699 330712 335059
32125 335059 340098 339754 338729 335720 336068 334583 329485 327947 334417 337096 337550 334069 330662 332691 333426
32110 333426 337170 337589 333719 335017 333909 332032 331250 331791 332242 330767 331715 331595 332703 330221 330453 331252
32094 331252 327349 327699 332242 332381 330562 329215 329790 331416 328017 325987 325420 331115 336352 335881 331169
32079 331169 328338 331391 334773 334528 332295 333144 332314 335132 335945 332475 328160 328250 327983 327620 330831 332416
32063 332416 329885 332829 336910 339266 335928 331911 329923 329669 330019 327803 329838 329330 329393 335119 342146
32048 342146 340245 336251 329527 328260 331755 335029 339267 337244 333084 329351 323416 323028 324207 330407
32034 330407 339509 341102 346385 347427 343388 340171 337180 337162 334917 335188 335132 334566 331574 325186 322013 323694
32018 323694 325891 329634 332594 332951 333783 335997 341076 346115 342686 338829 333333 334315 337568 334028 335113
32003 335113 340082 343941 338115 336626 338425 335581 332943 329002 328259 327504 331023 334611 336607 338525 338079
31988 338079 334808 332513 334321 330466 339234 345277 342927 337082 336468 336552 333414 328243 329314 333966 334767
31973 334767 336296 337956 338659 337585 339187 343502 345003 343754 341169 335312 329848 331583 333213 334534
31959 334534 335228 337523 339663 343410 343352 339520 340256 338367 336300 334317 336312 334510 336472 340530 341092
31944 341092 342903 341151 342770 343332 339127 335737 338431 339930 342217 337926 339026 336766 334908 334435 338376
31929 338376 336905 335619 337424 341796 338962 336285 337042 336473 335884 331837 330306 331405 338300 337993 340848
31914 340848 343296 343218 343276 347113 350086 342862 340408 347718 345556 344306 338958 338677 338207 338606 335475 333113
31898 333113 332882 328940 326006 328389 335017 333851 330841 333512 337637 337647 335205 334882 343172 346800 347403
31883 347403 344308 342303 337689 337541 341030 340316 342631 342601 346772 345678 344134 342855 343293 339589 340660
31868 340660 343298 338967 334262 333529 331327 328754 324837 329080 329898 330864 335517 337939 340095 341602 337056
31853 337056 331322 330614 335330 335987 341141 348331 344801 346514 343860 341262 335612 337032 342567 341124 341530
31838 341530 337586 333684 335469 340045 338227 338367 340650 338939 339812 338158 340528 343494 342124 339128 338222
31823 338222 339784 337954 336771 331285 331612 337640 339572 338115 332340 331022 335948 335783 337881 340170 343630
31808 343630 347794 349514 347920 340268 336730 341100 342769 341384 339762 338318 337630 343024 349785 352227
31794 352227 350148 345426 338488 339049 342984 341013 337544 337423 336781 336805 334355 333513 332921 331951 336663 337548
31778 337548 340263 343252 341879 342544 341596 343909 345514 342973 340124 342983 341360 339721 341603 339429 340070
31763 340070 339653 336662 335727 341668 347711 345355 339735 333626 328552 324954 327301 336352 342032 342594 344153
31748 344153 341360 339674 336335 335150 333404 337952 342068 345211 349291 349787 349910 344678 337728 338053 339685
31733 339685 341542 344344 344549 338962 332932 329340 332540 337424 337813 341365 340822 336322 339903 342627 341264
31718 341264 341196 341508 343238 342234 340845 340041 338229 342098 343462 340974 338415 337111 336399 340240 345627
31703 345627 346728 341630 343130 346944 349362 346309 343804 340412 335053 333594 336395 332881 338066 338960
31689 338960 337097 339841 344272 347918 345723 341399 334612 331438 335157 339263 338983 340438 344483 341941
31675 341941 337010 336091 333889 333193 331147 335742 339438 341266 338938 337111 334061 332800 336856 343709 343745
31660 343745 341626 339459 339876 336431 335402 334964 331909 334023 339928 343498 338880 333525 330212 332548 337100
31645 337100 338012 338759 335307 333562 331706 332893 335158 334586 335202 337810 335879 334322 341404 346697 345347
31630 345347 339807 345082 348586 343441 343456 341677 338084 337815 333258 334328 338796 340368 338705 337980 339450
31615 339450 342509 340486 344559 345666 342607 342438 344079 347844 347642 345585 345985 344757 346746 350183 348302
31600 348302 348595 342600 340409 342268 340812 340991 346517 345713 346226 346885 344286 346665 352440 351899 351922 351504
31584 351504 350539 348560 343151 339146 337608 341639 345030 346076 344217 339846 343535 348038 346736 343525
31570 343525 344460 343554 345755 345980 346008 342665 338792 337608 335304 338493 342881 344441 341788 347548 350618
31555 350618 345554 343627 347122 344637 341300 340485 336541 336199 337902 336688 341390 343996 344905 349751 353754
31540 353754 349477 344687 343359 341822 342045 339463 340706 338234 336731 337157 342035 345494 346809 346894 342974
31525 342974 345811 343443 342258 343954 340538 344989 346801 343769 346797 345703 347119 348681 351254 353545
$$ [...]
##END NTUPLES=NMR SPECTRUM
##END=
