##TITLE=Analysis number 316179
Compound Code cc 46604
Book Reference 468/5
Project Code adrs
Chemist Name colinb
##JCAMPDX= 6.0         $$ Bruker NMR JCAMP-DX V2.0
##DATA TYPE= NMR SPECTRUM
##DATA CLASS= NTUPLES
##ORIGIN= Bruker BioSpin GmbH
##OWNER= nmr
$$ XWIN-NMR		Version 3.5
$$ Tue Jan  3 10:19:41 2006 GMT Standard Time (UT+0h)  MAYBRIDGE\nmr@NMR_250MHZ
##.OBSERVE FREQUENCY= 250.131544655141
##.OBSERVE NUCLEUS= ^1H
##.ACQUISITION MODE= SIMULTANEOUS (DQD)
##.ACQUISITION SCHEME= undefined
##.AVERAGES= 16
##.DIGITISER RES= 18
##SPECTROMETER/DATA SYSTEM= dpx250
##.PULSE SEQUENCE= zg30
##.SOLVENT NAME= CDCl3
##.SHIFT REFERENCE= (INTERNAL, CDCl3, 0, 16.4433)
##AUDIT TRAIL= $$ (NUMBER, WHEN, WHO, WHERE, WHAT)
$$ ##TITLE= Audit trail, XWIN-NMR		Version 3.5
$$ ##JCAMPDX= 5.01
$$ ##ORIGIN= Bruker BioSpin GmbH
$$ ##OWNER= nmr
$$ C:\u/data/dgb/nmr/ADRS/14080/pdata/1/auditp.txt
$$ ##AUDIT TRAIL=  $$ (NUMBER, WHEN, WHO, WHERE, WHAT)
(   1,<2006-01-03 10:18:42.75 +000>,<MAYBRIDGE\nmr>,<NMR_250MHZ>,
      <created by zg, POWCHK disabled, PULCHK disabled
       configuration hash MD5:
       62 19 C7 07 E1 42 D1 B7 37 6C 3D D0 77 39 F9 E6
       data hash MD5: 64K
       AB 8F 44 F5 86 DB F1 9A 89 4E 65 57 AA 7A C9 5D>)
(   2,<2006-01-03 10:19:07.86 +000>,<MAYBRIDGE\nmr>,<NMR_250MHZ>,
      <Start of raw data processing
       ef LB = 0.3 FT_mod = 6 PKNL = 1 SI = 32K 
       data hash MD5: 32K
       3C 11 97 38 89 43 36 67 4B 7D 4C 2B 5A 15 7C 16>)
(   3,<2006-01-03 10:19:12.13 +000>,<MAYBRIDGE\nmr>,<NMR_250MHZ>,
      <apk 
       data hash MD5: 32K
       62 96 A3 42 DC 69 95 E0 61 4D 9F 76 B0 00 B9 EF>)
(   4,<2006-01-03 10:19:14.08 +000>,<MAYBRIDGE\nmr>,<NMR_250MHZ>,
      <abs ABSG = 5 
       data hash MD5: 32K
       70 72 59 57 22 A2 1B 15 08 61 66 E1 29 F5 8B 2B>)
$$ ##END=
$$ 
$$ hash MD5
$$ CE 83 46 34 9B 00 4D 90 50 B2 20 DB AB CD DA AE
##$RELAX= 
##$RELAX= 
##$RELAX= 
##$RELAX= 
##$RELAX= 
##$RELAX= 
##$RELAX= 
$$ Bruker specific parameters
$$ --------------------------
##$DU= <C:\u>
##$EXPNO= 14080
##$NAME= <ADRS>
##$PROCNO= 1
##$TYPE= <nmr>
##$USER= <dgb>
##$AMP= (0..31)
100 100 100 100 100 100 100 100 100 100 100 100 100 100 100 100 100 100 
100 100 100 100 100 100 100 100 100 100 100 100 100 100 
##$AQSEQ= 0
##$AQ_mod= 3
##$AUNM= <au_zg>
##$AUTOPOS= <1 >
##$BF1= 250.13
##$BF2= 250.13
##$BF3= 250.13
##$BF4= 250.13
##$BF5= 500.13
##$BF6= 500.13
##$BF7= 500.13
##$BF8= 500.13
##$BYTORDA= 1
##$CFDGTYP= 0
##$CFRGTYP= 5
##$CHEMSTR= <none>
##$CNST= (0..31)
1 1 145 1 1 1 1 1 1 1 1 1 1 1 1 1 1 1 1 1 1 1 1 1 1 1 1 1 1 1 1 1 
##$CPDPRG= <>
##$CPDPRG1= <>
##$CPDPRG2= <>
##$CPDPRG3= <>
##$CPDPRG4= <mlev>
##$CPDPRG5= <mlev>
##$CPDPRG6= <mlev>
##$CPDPRG7= <mlev>
##$CPDPRG8= <mlev>
##$CPDPRGB= <>
##$CPDPRGT= <>
##$D= (0..31)
0 1 0 0 0 0 0 0 0 0.06 0 0 0 0 0 0 0.0002 0 0 0 0 0 0 0 0 0 0 0 0 0 0 
0 
##$DATE= 1136283520
##$DBL= (0..7)
120 120 120 120 120 120 120 120 
##$DBP= (0..7)
150 150 150 150 150 150 150 150 
##$DBP07= 0
##$DBPNAM0= <>
##$DBPNAM1= <>
$$ [...]
##$SUBNAM7= <"">
##$SUBNAM8= <"">
##$SUBNAM9= <"">
##$SW= 20.6930455092707
##$SWIBOX= (0..15)
0 0 3 0 0 0 0 0 0 0 0 0 0 0 0 0 
##$SW_h= 5175.983436853
##$TD= 65536
##$TD0= 1
##$TE= 294.16
##$TE2= 300
##$TE3= 300
##$TEG= 300
##$TL= (0..7)
0 120 120 120 120 120 120 120 
##$TP= (0..7)
150 150 150 150 150 150 150 150 
##$TP07= 0
##$TPNAME0= <>
##$TPNAME1= <>
##$TPNAME2= <>
##$TPNAME3= <>
##$TPNAME4= <>
##$TPNAME5= <>
##$TPNAME6= <>
##$TPNAME7= <>
##$TPOAL= (0..7)
0.5 0.5 0.5 0.5 0.5 0.5 0.5 0.5 
##$TPOFFS= (0..7)
0 0 0 0 0 0 0 0 
##$TUNHIN= 0
##$TUNHOUT= 0
##$TUNXOUT= 0
##$USERA1= <user>
##$USERA2= <user>
##$USERA3= <user>
##$USERA4= <user>
##$USERA5= <user>
##$V9= 5
##$VALIST= <valist>
##$VCLIST= <CCCCCCCCCCCCCCC>
##$VD= 0
##$VDLIST= <DDDDDDDDDDDDDDD>
##$VPLIST= <PPPPPPPPPPPPPPP>
##$VTLIST= <TTTTTTTTTTTTTTT>
##$WBST= 1024
##$WBSW= 4
##$XGAIN= (0..3)
0 0 0 0 
##$XL= 0
##$YL= 0
##$YMAX_a= 516766
##$YMIN_a= -507596
##$ZGOPTNS= <>
##$ZL1= 120
##$ZL2= 120
##$ZL3= 120
##$ZL4= 120
##$ABSF1= 16.4433
##$ABSF2= -4.249872
##$ABSG= 5
##$ABSL= 3
##$ALPHA= 0
##$AQORDER= 0
##$ASSFAC= 0
##$ASSFACI= 0
##$ASSFACX= 0
##$ASSWID= 0
##$AUNMP= <proc_1d>
##$AZFE= 0.1
##$AZFW= 0.1
##$BCFW= 0
##$BC_mod= 0
##$BYTORDP= 0
##$COROFFS= 0
##$CY= 12.5
##$DATMOD= 1
##$DC= 0
##$DFILT= <>
##$DTYPP= 0
##$F1P= 14.0000005364418
##$F2P= -0.99999901652339
##$FCOR= 0.5
##$FTSIZE= 32768
##$FT_mod= 6
##$GAMMA= 0
##$GB= 0
##$INTBC= 1
##$INTSCL= 1
##$ISEN= 128
##$LB= 0.3
##$LEV0= 0
##$LPBIN= 0
##$MAXI= 10000
##$MC2= 0
##$MEAN= 0
##$ME_mod= 0
##$MI= 0
##$NCOEF= 0
##$NC_proc= -2
##$NLEV= 6
##$NOISF1= 0
##$NOISF2= 0
##$NSP= 0
##$NTH_PI= 0
##$NZP= 0
##$OFFSET= 16.4433
##$PC= 1
##$PHC0= 82.42103
##$PHC1= 7.484168
##$PH_mod= 1
##$PKNL= yes
##$PPARMOD= 0
##$PSCAL= 4
##$PSIGN= 0
##$REVERSE= no
##$SF= 250.130019684382
##$SI= 32768
##$SIGF1= 0
##$SIGF2= 0
##$SINO= 400
##$SIOLD= 32768
##$SREGLST= <1H.CDCl3>
##$SSB= 0
##$STSI= 32768
##$STSR= 0
##$SW_p= 5175.98343685301
##$SYMM= 0
##$S_DEV= 0
##$TDeff= 65536
##$TDoff= 0
##$TI= <Analysis number 999999
Compound Code 99
Book Reference 9
Project Code 9>
##$TILT= no
##$TM1= 0
##$TM2= 0
##$TOPLEV= 0
##$USERP1= <user>
##$USERP2= <user>
##$USERP3= <user>
##$USERP4= <user>
##$USERP5= <user>
##$WDW= 1
##$XDIM= 32768
##$YMAX_p= 383008400
##$YMIN_p= -164009
$$ End of Bruker specific parameters
$$ ---------------------------------
##NTUPLES= NMR SPECTRUM
##VAR_NAME=  FREQUENCY,     SPECTRUM/REAL,   SPECTRUM/IMAG
##SYMBOL=    X,             R,               I
##VAR_TYPE=  INDEPENDENT,   DEPENDENT,       DEPENDENT
##VAR_FORM=  AFFN,          ASDF,            ASDF
##VAR_DIM=   32768,         32768,           32768
##UNITS=     HZ,            ARBITRARY UNITS, ARBITRARY UNITS
##FACTOR=    0.157963299565203, 1,           1
##FIRST=     4112.96301450643, 0,            0
##LAST=      -1063.02042234658, 0,           0
##MIN=       -1063.02042234658, -164009,     0
##MAX=       4112.96301450643, 383008400,    0
$$ Real data points
##PAGE= N=1
##DATA TABLE= (X++(R..R)), XYDATA
$$ [...]
19427E3816J4114P581m486j5763k0702n274p080j2912R531J7057m137R36O468
$$ 53816 67930 75511 71025 55262 34560 29286 22206 9294 18825 35882 31745 32681 39149
19414C9149n426l178k289J212J0407J0040j6742k4328j6573Q653J1498P23n731
$$ 39149 33723 30545 28256 29468 39875 49915 33173 8845 -7728 925 12423 13146 7415
19401G415q851R882O994k742J3081J529l1184P974K0590P260q443j461k291m558
$$ 7415 -1436 8446 15440 12698 25779 27308 -3876 4098 24688 31948 23505 22044 19753 15195
19387A5195L295Q834j00j5539O768O667j3468r611M134J5761J3064q63K043q84
$$ 15195 18490 27324 27224 11685 18453 25120 11652 2041 6175 21936 35000 34137 36180 35296
19373C5296p32o821k899n545P692O359j3184L835J2736l671J889r95N849O588
$$ 35296 34564 27743 24844 19299 26991 33350 20166 24001 36737 33066 34955 33960 39809 46397
19359D6397Q977l1j981P909k6925p751j2556n348O96J582o061J3796J9101L845
$$ 46397 55374 55343 53362 61271 34346 26595 14039 8691 9387 10969 4908 18704 37805 41650
19345D1650l489P610O730j0003k805K532Q58k0020J0657P6M134L042m229r221
$$ 41650 38161 45771 52501 42498 39693 42225 43083 23063 33720 33796 37930 40972 36743 27522
19331B7522Q629L88L462m745j5244R000J769q746j2306k582n48P70P476J6416
$$ 27522 36151 36539 40001 35256 20012 29012 30781 22035 9729 7147 6599 7369 14845 31261
19317C1261J708K98J9324m483j3884o269n09l897k836J612L948p581J1697r269
$$ 31261 32969 33267 52591 48108 34224 27955 27446 23549 20713 22325 26273 18692 30389 21120
19303B1120p772M702K0259N064m844o660J1001L643P901j061j1870q144j451J9373
$$ 21120 13348 18050 38309 43373 38529 31869 42870 46513 54414 53353 41483 33339 31888 51261
19289E1261J340j2421L855n707k161K428P512l296j717j1513O227Q628K055J1691
$$ 51261 52601 40180 44035 38328 36167 38595 46107 42811 41094 29581 35808 44436 46491 58182
19275E8182O500k7394m511K4535N355j2005n101P623p121j9284j8015k46K5954
$$ 58182 64682 37288 32777 57312 62667 50662 45561 53184 46063 26779 8764 8518 34472
19262C4472K6100J4861m976N417k042q552J690j0692Q83M008N051j2144N610Q289
$$ 34472 60572 75433 70457 75874 73832 65280 66970 56278 57161 61169 66220 54076 59686 67975
19248F7975R261R556L362N66j1156j2006l334q759j0780M459r041j233J2686J0097
$$ 67975 77236 86792 90154 90720 79564 67558 64224 55465 44685 49144 40103 38870 51556 61653
19234F1653J1723K0738q324K492L113j0336p741j5272o602J4717K239m069L051
$$ 61653 73376 94114 85790 88282 91395 81059 73318 58046 51444 66161 68400 64331 67382
19221F7382r012q743M826J0670K493R23k170O091P08p773j545L504K530J0679
$$ 67382 58370 49627 54453 65123 67616 68539 66369 72460 73168 65395 63850 67354 69884 80563
19207H0563M130q556N740p342o125J0296R00R71J8865k968K258p634j0685r930
$$ 80563 84693 76137 81877 74535 68410 78706 79606 80577 99442 96474 98732 91098 80413 70483
19193G0483j224o932Q784n663j1633j854L3L926j5058j5030n032J345J0008K752
$$ 70483 69259 62327 71111 65448 53815 51961 51994 55920 40862 25832 20800 22145 32153 34905
19179C4905o132J5611Q330L411J474J2412M001l610q791j2712J0729R691l480
$$ 34905 28773 44384 52714 56125 57599 70011 74012 70402 61611 48899 59628 69319 65839
19166F5839m853L896L162m366m486l181o123K1655J4182q93l542M559j46j0416
$$ 65839 60986 64882 68044 63678 59192 56011 49888 71543 85725 84832 81290 85849 85703 75287
19152G5287k2705m098J1802K484K1161J1783m40l517r898j9607m409J902K968
$$ 75287 52582 48484 60286 62770 83931 95714 95274 91757 81859 62252 57843 59745 62713
19139F2713K1823k927M744J1406J1734N573j2807p810K987M407P424M152K947
$$ 62713 84536 81609 86353 97759 109493 115066 102259 94449 97436 101843 109267 113419 116366
19126A16366l635n486Q113j2249k0579l484J3706L3721k7j179l550p185j2670
$$ 116366 112731 107245 115358 103109 82530 79046 92752 126473 126446 125267 121717 114532 101862
19113A01862n610M374K694j696p422J0326J3590K0443m646k484J1314J0923J2315
$$ 101862 96252 100626 103320 101624 94202 104528 118118 138561 133915 131431 142745 153668 165983
19100A65983J5559J4645O621k284m105j9254j9516o616r064M461n928j761R812
$$ 165983 181542 196187 202808 200524 196419 177165 157649 151033 141969 146430 140502 138741 148553
19087A48553J308J4249J2315J1520L843m038m31j9342k3899p788K4261P353J9140
$$ 148553 149861 164110 176425 187945 191788 187750 187319 167977 144078 136290 160551 167904 187044
19074A87044n60j1546m572k579Q077J5457K3575Q672j0520j502P489J2747K4408
$$ 187044 186484 174938 170366 167787 175864 191321 214896 223568 213048 211546 219035 231782 256190
19061B56190J5698J2226m851r302K797Q063J9903N863Q216K0413L1603J9502P721
$$ 256190 271888 284114 279263 269961 272758 280821 300724 306587 314803 335216 366819 386321 394042
19048C94042j212R318M566K5425K5137N999J9819N0892J5405L1403L2284J6849
$$ 394042 392830 402148 406714 432139 457276 463275 483094 533986 549391 580794 613078 629927
19036F29927L5064N1015N5493P3819Q1410Q2633R7089R9078R8120P7458P0325
$$ 629927 664991 716006 771499 845318 926728 1009361 1106450 1205528 1303648 1381106 1451431
19025A451431R5839J33847J79943K13607K56923K54606K68768K65727L44913M91312
$$ 1451431 1547270 1681117 1861060 2074667 2331590 2586196 2854964 3120691 3465604 3956916
19015C956916O30825Q73036J262242J902729K732329L582218M530490N046870
$$ 3956916 4587741 5460777 6723019 8625748 11358077 14940295 19470785 24517655
19007B4517655M885386N580478K925943k963997n656263n580211l226987j40429
$$ 24517655 29403041 34983519 37909462 34945465 29289202 23708991 20482004 20341575
18999B0341575K977080O245114Q865029R110846L819498l729654q195068q201655
$$ 20341575 23318655 29563769 38428798 47539644 51359142 47629488 39434420 31232765
18991C1232765n905550m569098m058234l329137k341923j124168L9637J097753
$$ 31232765 25327215 20758117 16699883 13370746 11028823 9904655 9944292 11042045
18983A1042045J801632J243238o28297j904063k277116j896087j235152p22115
$$ 11042045 12843677 14086915 13458618 11554555 9277439 7381352 6146200 5424085
18975E424085l99106j82468j8502J48506L01233M56973O52421R35357J274971
$$ 5424085 5024979 4842511 4824009 4972515 5273748 5730721 6383142 7318499 8593470
18966H593470J900883L110951M924974N515966K404200q86785j686178m62604
$$ 8593470 10494353 13605304 18530278 24046244 26450444 25563659 23877481 23414877
18958B3414877J259989J409426J307117L042806P261027J0950295N608638k251613
$$ 23414877 24674866 26084292 27391409 30434215 37695242 48645537 54254175 52002562
18950E2002562n050029n948844m551767k058645J347281M365349M466283k061140
$$ 52002562 46952533 41003689 36451922 34393277 35740558 40105907 44572190 42511050
18942D2511050p899030r414139p957564n179868l130927j939856j258754p91744
$$ 42511050 34612020 25197881 17240317 12060449 8929522 6989666 5730912 4939168
18934D939168m49606j35178J82727N74339P99185M06078m45406r45661j032987
$$ 4939168 4489562 4354384 4537111 5111450 5910635 6316713 5871307 4925646 3892659
18925C892659q08125n63329m17833l12050k22015j51749j03847q1591p8443p2683
$$ 3892659 3084534 2521205 2103372 1791322 1569307 1417558 1313711 1232120 1153677 1080994
18915A080994q3585j12010q8182m9558o7337n8716l6472j8946l4986l3311m8953
$$ 1080994 997409 885399 797217 747659 680322 621606 585134 566188 531202 497891 448938
18904D48938m8491l3806j9613n56r072o746J0327j5869k72K0372J5046p114j6250
$$ 448938 400447 366641 347028 346472 337400 330654 340981 325112 324840 345212 360258 353144 336894
18891C36894j1129J297R689J5911K6753K8377M0815K9140L3813L2715J2806r467
$$ 336894 325765 327062 336751 352662 379415 407792 448607 477747 511560 544275 557081 547614
18879E47614p968j9611j5169o939k4776j2551m88J1979O712k7192k4162m5418
$$ 547614 539646 520035 504866 497927 473151 460600 460112 472091 478803 451611 427449 382031
18867C82031k9967k1776r405J3655j4260l8125j8696j7903j3595k9596l4902k4126
$$ 382031 352064 330288 320883 334538 320278 282153 263457 245554 231959 202363 167461 143335
18855A43335j3301p949j302J415M977K7614J5194O52j4792k4940k2723k1775o310
$$ 143335 130034 122085 120783 122198 127175 154789 169983 170635 155843 130903 108180 86405 80095
18842H0095O512r865k851J1437m362R256J2148J6060M069j143J0386Q253K1690
$$ 80095 86607 76742 73891 85328 80966 90222 102370 118430 122499 121356 131742 139995 161685
18829A61685K3441J2778k556J1p287j2769k5394j7393n374k403J2314K2026M766
$$ 161685 185126 197904 195348 195359 188072 175303 149909 132516 127142 124739 137053 159079 163845
18816A63845n800M567M573l393j6987j2517q742j4076J0936k286q975p047q446
$$ 163845 158045 162612 167185 163792 146805 134288 125546 111470 122406 120120 111145 104098 95652
18803I5652o550o537J162j2656r967N136N115j511j666n678j4980m617O861o592
$$ 95652 89102 82565 83727 71071 61104 66240 71355 69844 68178 62500 47520 42903 49764 43172
18789D3172M364N693Q99M153K450l857k850R052N150R70K170J0370O658J799P915
$$ 43172 47536 53229 54128 58281 60731 56874 54024 63076 68226 69196 71366 81736 88394 90193 98108
18774I8108l746P539O424J7613J9118K2709M0332M7020l725j9137l4886l1239
$$ 98108 94362 101901 108325 125938 145056 167765 208097 255117 251392 232255 197369 166130
18762A66130k911m159J2861J9229Q357k0379l5900j5394j0395q797K521m959J533
$$ 166130 163219 159060 171921 191150 199507 179128 143228 127834 117439 108642 111163 106204 107737
18749A07737q329O986j6597j3480K147J2352j0084l1166j5714M287J7348J3198
$$ 107737 99408 106394 89797 76317 78464 90816 80732 49566 33852 38139 55487 68685
18737F8685j2675j7527r003N637N605J8043P611j3305j1310r404J5458J5110o234
$$ 68685 56010 38483 29480 35117 40722 58765 66376 53071 41761 32357 47815 62925 56691
18724E6691l333J1082Q916q24J6004Q217J5405n50j8185j7931K3074L3906N872
$$ 56691 53358 64440 73356 72532 88536 96753 112158 111608 93423 75492 98566 132472 138344
18711A38344o21k3502k0249k0158l712M102K4211N488J068l067L363j1211k9275
$$ 138344 137723 114221 93972 73814 70102 74204 98415 103903 104971 101904 105267 94056 64781
18698F4781M329R511P124j2781k3470K005n86j763k444L538R467k832M618P134
$$ 64781 69110 78621 85745 72964 49494 51499 50913 49150 46706 50244 59711 56879 61497 68631
18684F8631q020m237r919K751Q932J1186L142l92j6458J0206j295n121j1773j2027
$$ 68631 60611 56374 46455 49206 58138 69324 72466 72074 55616 65822 64527 59406 47633 35606
18670C5606J714J238j788p70M828J282j664Q559L350j967m379j3692p74J3694
$$ 35606 37320 38558 36770 36000 40828 42110 40446 49005 52355 50388 46009 32317 31543 45237
18656D5237N06p614n712R602K1190k5819j3660J3411J4704k330J0668l215j1065
$$ 45237 45743 38129 32417 42019 63209 37390 23730 37141 51845 49515 60183 56968 45903
18643D5903o548P508J2941O097j003j1296J2739J4399M605%p58r5l693Q430J0868
$$ 45903 39355 46863 59804 65901 64898 53602 66341 80740 85345 85345 84587 84492 80799 89229 100097
18628A00097J0176l202j0172j1768K129Q009j3613j8750j0386K009R740M733L931
$$ 100097 110273 107071 96899 85131 87260 95269 81656 62906 52520 54529 64269 69002 72933
18615G2933m819m040k059J108j32J866N178k2304j5727P755q67J2417J1351K275
$$ 72933 68114 64074 62015 63123 62991 64857 70035 47731 32004 39759 38892 51309 62660 64935
18601F4935K487j4727r072J2168J9670N717q471N861J9078j2351k0064O418O062
$$ 64935 67422 52695 43623 55791 75461 81178 72707 78568 97646 85295 65231 71649 77711
18588G7711m439J942J1130o394j315P762J7892J4726j5666n252K144q898l935
$$ 77711 73272 75214 86344 79950 78635 86397 104289 119015 103349 98097 100241 91343 87408
18575H7408J1046j872j6033l398M866k27j013J134O057m400j3076p177O304p540
$$ 87408 98454 96582 80549 77151 82017 81790 80777 81911 87968 83568 70492 63315 69619 62079
18561F2079j522N313J1256J547M778R904P274K355J574j0333j1546o1j0370k112
$$ 62079 60557 65870 77126 78673 83451 93355 100629 102984 104558 94225 82679 82618 72248 70136
18547G0136J2902J5651Q474n732J1394J9365p933q203J3332J5387k49J3569j3292
$$ 70136 83038 98689 107163 101431 112825 132190 124257 116054 129386 144773 144524 158093 144801
18534A44801k3072p424j162L64K303J3322O157M186j0609j2994j4054J3309J3753
$$ 144801 121729 114305 113143 113507 115810 129132 135289 139475 128866 115872 101818 115127 128880
18521A28880O321l864R35J2195K690Q826J5328L4236J6366R762O08k4755j9409
$$ 128880 135201 131337 132272 144467 147157 155983 171311 205547 221913 231675 232283 207528 188119
18508A88119R396K9498J9738M569O006L1985L5865L9173N3161P9640J23046J42113
$$ 188119 197515 227013 246751 251320 257326 289311 325176 364349 417510 497150 620196 762309
18496G62309J01256j294j00037j37408j24265o9871l1234k2207k1666j2528q626
$$ 762309 863565 862271 762234 624826 500561 430690 399456 377249 355583 343055 334429
18485C34429l688j7371k1443p905p86j421J828J0890K72j0826m843R853K0539
$$ 334429 330741 313370 291927 284022 283236 281815 283643 294533 294805 283979 279136 288989 309528
18472C09528K1476K0119K7728J3637P53l679K1989L8007K9996L9025L5681K5847
$$ 309528 331004 351123 378851 392488 393241 389562 411551 449558 479554 518579 554260 580107
18460E80107J9908N3779O9706O5547O3736M2378K9566K0015L8622Q8788J03842
$$ 580107 600015 653794 723500 789047 852783 895161 924727 944742 983364 1072152 1175994
18449A175994J08883J32640J05791M8821J3209K4451J01830K06002K96596M10897
$$ 1175994 1284877 1417517 1523308 1572129 1585338 1609789 1711619 1917621 2214217 2625114
18439B625114O14067R49325J461310K123544K422622K310370J940416p8410j809748
$$ 2625114 3239181 4188506 5649816 7773360 10195982 12506352 14446768 14368358 12558610
18430A2558610k220868j721886o64492M77167J792279L372972M282603L058741
$$ 12558610 10337742 8615856 7951364 8428531 10220810 13593782 17876385 20935126
18422B0935126J464669j445770l848600m143178l457367k205550j150899l96771
$$ 20935126 22399795 20954025 17105425 12962247 9504880 7299330 6148431 5751660
18414E751660K39435R37585J502490J071663m02691j355749j603775j272996q02645
$$ 5751660 5991095 6928680 8431170 9502833 9100142 7744393 6140618 4867622 4064977
18405D064977m37065j84060m6421L0080R9980J69253K56365L71381N78600R42871
$$ 4064977 3627912 3443852 3397431 3427511 3527491 3696744 3953109 4324490 4903090 5845961
18395E845961J446711J788781J354069P41286O17521M76718K76407N71509J400466
$$ 5845961 7292672 9081453 10435522 11176808 11794329 12271047 12547454 13118963 14519429
18386A4519429K992000N420320P855414P135707L225537J723677L963403P081506
$$ 14519429 17511429 22931749 30787163 37922870 41148407 42872084 46835487 53916993
18378E3916993M169561m769415j0308347j0932241q090982m368850j426173Q76050
$$ 53916993 58086554 53317139 43008792 32076551 23985569 19616719 18190546 19066596
18370A9066596K392192K012560P01613M17988j058153l634391m335738m022721
$$ 19066596 21458788 23471348 24172961 24590949 23532796 19898405 15562667 11539946
18362A1539946k904530j848289j191237p79489m72503k61229j45179j01732p6098
$$ 11539946 8635416 6787127 5595890 4816401 4343898 4082669 3937490 3835758 3759660
18353C759660o1227j0849N1730J24914K32036L72128N39952P55745J076846J620887
$$ 3759660 3698433 3687584 3739314 3864228 4096264 4468392 5008344 5764089 6840935 8461822
18343H461822K503921L598393L782015J646482p61193j627389j018479P64688
$$ 8461822 10965743 14564136 18346151 19992633 19231440 17604051 16585572 17350260
18335A7350260L338726O442279P814205N047014J157769k872174l406918j695632
$$ 17350260 20688986 27131265 34945470 39992484 41150253 38278079 34871161 33175529
18327C3175529j658481m412863n888537n723292m249080k602318j459810p51868
$$ 33175529 31517048 27104185 21215648 15492356 11243276 8640958 7181148 6429280
18319F429280k27972K59626N29127Q0341o63377r49010q81753n66011k47836p0250
$$ 6429280 6201308 6460934 6990061 7070402 6407025 5458015 4576262 4010251 3762415 3692165
18309C692165p5694o2139J133J15306K19211L44156N86037R84835J646036K650634
$$ 3692165 3616471 3554332 3555465 3670771 3889982 4234138 4820175 5805010 7451046 10101680
18299A0101680L554469K634527j56361j817644k157221j332038o361J416685L211070
$$ 10101680 13656149 16290676 16134315 14316671 12159450 10827412 10821051 12237736 15448806
18290A5448806N572800O810975K961834k895379n669477n787416l944109j902564
$$ 15448806 21021606 27832581 30794415 27899036 22229559 16442143 12498034 10595470
18282A0595470j84662J466492K811148K037452j038071k948716l396013k711820
$$ 10595470 10410808 11877300 14688448 16725900 15687829 12739113 9343100 6631280
18274F631280j736640j046065o12547l58694j84170p0292L6190J21240J69312
$$ 6631280 4894640 3848575 3236028 2877334 2693164 2622872 2659062 2780302 2949614
18265B949614K84018M55743P46986J252110J831790J580308K6223j154362j514810
$$ 2949614 3233632 3689375 4436361 5688471 7520261 9100569 9126792 7972430 6457620
18256F457620j230940o89972k28179R8600L89413O91426J096237J781184K802968
$$ 6457620 5226680 4536708 4308529 4407129 4796542 5487968 6584205 8365389 11168357
18247A1168357L698693L825602M194179L931929J152275k436204m550099m445833
$$ 11168357 14867050 18692652 22886831 26818760 27971035 25534831 20984732 16538899
18239A6538899l495661k847943k395192j941354j413869r21613n73756l57967
$$ 16538899 13043238 10195295 7800103 5858749 4444880 3523267 2949511 2591544
18231B591544k49562j23009k9836R2919K42960M84070Q25372R29672K42560n69254
$$ 2591544 2341982 2218973 2189137 2282056 2525016 3009086 3834458 4764130 5006690 4437436
18221D437436q84963q59785n99229l65594k36987j50313o6237K056N9180R8229
$$ 4437436 3552473 2692688 2093459 1727865 1490878 1340565 1274328 1276384 1335564 1433793
18211A433793J42415K25369L75077O71331J003367Q82779P8774m85375o26128
$$ 1433793 1576208 1801577 2176654 2847985 3851352 4734131 4812905 4327530 3701402
18202C701402m17594j8040M44727J067327J655923J147654l85877j234941j437461
$$ 3701402 3283808 3265768 3710495 4777822 6433745 7581399 7195522 5960581 4523120
18193D523120j073295n79323j41288K76604N12253J39514m76966p12166o95076
$$ 4523120 3449825 2870502 2729214 3005818 3518071 3657585 3180619 2468453 1773377
18184A773377n10538l40490k05684j30574q1690p0384l6170j8088Q247o085j6080
$$ 1773377 1262839 922349 716665 586091 504401 434017 397847 379759 388006 381921 365841
18173C65841j6585k5709j7593k0135k8765j0006j523J2582P51r758k2711m068
$$ 365841 349256 323547 305954 285819 257054 247048 245525 258107 258858 249100 226389 222321
18161B22321J4766J6422J8539J3401K6134j923j5753j1104k0389j3908j4765m413
$$ 222321 237087 253509 272048 285449 311583 309660 293907 282803 262414 248506 233741 229328
18149B29328m823j7668j0523J9484n216k1881l730j4873J6111K4731L0690J7976
$$ 229328 224505 206837 196314 215798 210582 188701 184971 170098 186209 210940 241630 259606
18137B59606J5896K3001K2968J5357K8380J8931Q815Q099J5762L0436N4055M9239
$$ 259606 275502 298503 321471 336828 365208 384139 392954 401053 416815 447251 501306 550545
18125E50545N8137Q0668Q6969R7549J15515J42759J94120K70629L35264M01323
$$ 550545 608682 689350 776319 873868 989383 1132142 1326262 1596891 1932155 2333478
18115B333478N53179Q31359J288108K123256L940514P437500R857542K090498
$$ 2333478 2886657 3718016 5006124 7129380 11069894 18507394 28364936 30455434
18107C0455434n525759p684158o877300m111577k223558j248026p44851m78091
$$ 30455434 24929675 17245517 10368217 6256640 4033082 2785056 2040205 1562114
18099A562114l08937j86503j52854j32599r4309r6767r7116n7809k9854l7448
$$ 1562114 1253177 1066674 913820 781221 686912 590145 493029 435220 405366 367918
18089C67918l0761j8463j5723k9956l8411j4593l499j1159q519j3983j2143k1752
$$ 367918 337157 318694 302971 273015 234604 220011 216512 205353 196834 182851 170708 148956
18077A48956o216j2138k134p859O828j3407j2308j4393j5468j316J3342J1808
$$ 148956 142740 130602 128468 120609 127437 114030 101722 87329 71861 70545 83887 95695
18065I5695K2465L424j7017j911O450J7801O867n809n832n993J0206r392j1750
$$ 95695 118160 121584 104567 102656 109106 126907 133774 127965 122133 116140 126346 116954 105204
18052A05204K213P754O022J6296J1395o406n096j2818p76P251j573j4855o393
$$ 105204 107417 115171 121193 137489 148884 142478 137382 124564 123788 131039 129466 114611 108218
18039A08218o788n915p910q922J5618J4312P259R727n500J486N740l812j2428
$$ 108218 101430 95515 87605 78683 94301 108613 115872 125599 120099 121585 127325 123513 111085
18026A11085N58J5535J5430K593p588m153p103j504k509m161N317K7260L331n034
$$ 111085 111643 127178 142608 145201 137613 133460 126357 124853 122344 118183 123500 150760 154091 149057
18012A49057L560R044n072K392K1249j765j4358l150P641J4552q329J3255L0219
$$ 149057 152617 161661 156589 158981 180230 178465 164107 160957 168598 183150 174821 188076 218295
17999B18295J5903J0537R959M912M739J6026K67J2936J8603R786J1902J0295K7323
$$ 218295 234198 244735 254694 259606 264345 280371 280638 293574 312177 321963 333865 344160 371483
17986C71483K9901K405L91J1922K1679K8393J1995K4220L7143L7815O9567O6557
$$ 371483 401384 403789 404180 416102 437781 466174 478169 502389 539532 577347 646914 713471
17974G13471P2540O9248O5680R0079J29947J65865K13427K73542J76847L7610
$$ 713471 786011 855259 920939 1011018 1140965 1306830 1520257 1793799 1970646 2008256
17964B008256n260J1679J05688J91502K92248L70559L46564L52837M37168O15763
$$ 2008256 2002996 2014675 2120363 2311865 2604113 2974672 3321236 3674073 4111241 4727004
17954D727004Q40961R96428J117423J392060J875292K590365L685565N494772
$$ 4727004 5567965 6564393 7681816 9073876 10949168 13539533 17225098 22719870
17946B2719870Q771744J5108798K5655130L3369721J8287017j0961621k6343114
$$ 22719870 31491614 46600412 72255542 105625263 123912280 112950659 86607545
17939H6607545k8533231k1202674j2823282p547679m608613k927615j913129j240980
$$ 86607545 58074314 36871640 24048358 16500679 11892066 8964451 7051322 5810342
17931E810342q08239n10280l60848m03212m32022m05437l96706l36600k87240
$$ 5810342 5002103 4491823 4130975 3727763 3295741 2890304 2493598 2156998 1869758
17922A869758k15824j33987q6737k5128J6615O0542N3775p3260j70537j88360
$$ 1869758 1653934 1519947 1433210 1408082 1424697 1485239 1539014 1465754 1295217 1106857
17912A106857j58482j11401p5615l9261m791l8654n1797p6968o1071m5495k4260
$$ 1106857 948375 836974 761359 722098 717307 678653 626856 549888 488817 443322 419062
17901D19062j9666m3159l9039j7678l2719l616J1264m843j6861m76o519j3480
$$ 419062 399396 356237 317198 299520 266801 263185 274449 269606 252745 252269 245750 232270
17889B32270j5424j0355O009K913j0609J477P71m718j6103m794L303j6889M684
$$ 232270 216846 206491 212500 215413 204804 206281 207052 202334 186231 181437 184740 167851 172535
17876A72535J8374K5527K1510J7726K5167J5094N127j4761j0527k439J1165J5856
$$ 172535 190909 216436 237946 255672 280839 295933 301060 286299 275772 273333 284498 300354
17864C00354j835j8462q606j9208l2569k2210k2694L19J6519J4578K4763j5846
$$ 300354 298519 280057 271451 252243 219674 197464 174770 175089 191608 206186 230949 215103
17852B15103l3408l9795l3124p119K798k497k1912n81J089k388j5315j3579L733
$$ 215103 181695 141900 108776 101657 104455 101958 80046 79465 80554 78166 62851 49272 53005
17839E3005j1202o038J0820K998l444R605J547j0284j2837K0088J8909J4740L846
$$ 53005 41803 35765 46585 49583 46139 55744 57291 47007 34170 54258 73167 87907 91753
17826I1753K242N980Q438R610J5879J2909o63k1916j0271M04J3970J9199p707
$$ 91753 93995 99975 108413 118023 133902 146811 146148 124232 113961 114365 128335 147534 139827
17813A39827j1856J6475J7209J2400R547j2457j9103l0200l9458k2214O527O017
$$ 139827 127971 144446 161655 174055 183602 171145 152042 121842 82384 60170 66697 72714
17801G2714k3560k6571J1858J7619Q947J0088J886j3252m6L506N370N12J0310
$$ 72714 49154 22583 34441 52060 61007 71095 72981 59729 59683 63189 68559 69071 79381
17788G9381J10K5179J38j8186j4290R61j0203m833l785k353j0327l450J0592L35
$$ 79381 79491 104670 104808 86622 72332 73293 63090 58257 54472 52119 41792 38342 48934 49269
17774D9269r850j1085o092j121L891l389j420J1699M502J8478j197j5763N448
$$ 49269 39419 28334 22242 21121 25012 21623 20203 31902 36404 54882 53685 37922 43370
17761D3370j707O39P124l124L331o687j3438O921M301Q547R04k519K410J0155
$$ 43370 41663 42302 49426 46302 49633 42946 29508 36429 40730 49277 50181 47662 50072 60227
17747F0227K2600n895l852K1330J4614K0986J9168J5383j2388l6904o070k134
$$ 60227 82827 76932 73080 94410 109024 130010 149178 164561 152173 115269 109199 107065
17735A07065j3049j4112k470j2313J345P368k1891q757L56J140O268q046N576
$$ 107065 94016 79904 77434 65121 66466 73834 51943 43186 43542 44682 50950 42904 48480
17722D8480m575k4833r058j3124o163J0298J4022m732J688R309j53K340m141k3588
$$ 48480 43905 19072 10014 -3110 -9273 1025 15047 10315 12003 21312 21159 23499 19358 -4230
17708d230O07J5787J1026n485J061J1990J0008Q15p436r334J2450J4512L461Q606
$$ -4230 -3623 12164 23190 17705 18766 30756 40764 41579 34143 24809 37259 51771 55232 63838
17694F3838K0472K3603j5344k3596j2813M812k992j7621j1042J3615P879Q513
$$ 63838 84310 107913 92569 68973 56160 60972 57980 40359 29317 42932 50811 59324
17682E9324j3624j8531q875j4787p901J3313R969m094O681J2863q077j5981k0935
$$ 59324 45700 27169 18294 3507 -4394 8919 18888 14794 21475 34338 26261 10280 -10655
17669a0655l064K148R103K338K68L990J529N84L97n303j930O658M719o61P156
$$ -10655 -13719 -11571 -2468 -130 138 4128 5657 6241 6638 1335 -595 6063 10782 10121 17277
17654A7277K969j5974l123j4164r870J2681J6593J0705L634j8319P570M104o294
$$ 17277 20246 4272 1149 -13015 -22885 -10204 6389 17094 20728 2409 9979 14083 7789
17641G789M114P13j9102r639O473r242j5519p595J3243J3879L607o238j0332l891
$$ 7789 11903 12616 -6486 -16125 -9652 -18894 -34413 -42008 -28765 -14886 -11279 -17517 -27849 -31740
17627c1740J919O914j0040o191N39J6705J7083O773l137J0487L217J2202r059
$$ -31740 -29821 -22907 -32947 -39138 -38599 -21894 -4811 1962 -1175 9312 12529 24731 15672
17614A5672j8988q590j0645m991j0266Q405Q898O316l831k773M679Q037J3317
$$ 15672 -3316 -11906 -22551 -27542 -37808 -29403 -20505 -14189 -18020 -20793 -16114 -8077 5240
17601E240j7149j3076K354n024j3933J621J718m278R802l942Q912R601n446M986
$$ 5240 -11909 -24985 -22631 -27655 -41588 -39967 -38249 -42527 -32725 -36667 -27755 -18154 -23600 -18614
17587a8614Q801P522K459l092l598M835o95O441r725L409J1009j0771j3090n204
$$ -18614 -9813 -2291 168 -2924 -6522 -1687 -2382 4059 -5666 -2257 8752 -2019 -15109 -20313
17573b0313P306J6957p984p910j1957J0969j71j282N685L448M032o722j3419l180
$$ -20313 -13007 3950 -4034 -11944 -23901 -12932 -13103 -14385 -8700 -5252 -1220 -7942 -21361 -24541
17559b4541l617M006J7133K0505k234M753j926j4748q981n817l145O420l669M990
$$ -24541 -28158 -24152 -7019 13486 11252 16005 14079 -669 -9650 -15467 -18612 -12192 -15861 -10871
17545a0871k307L903J3094J2319q024r925J0543P14p622N249k701k227q298j631
$$ -10871 -13178 -9275 3819 16138 8114 -1811 8732 9446 1824 7073 4372 2145 -6153 -7784
17531g784K1252N007j112n837o423m215L41P099Q186k2461K824M487N147J343
$$ -7784 13468 18475 17363 11526 5103 888 1229 8328 16514 -5947 -3123 1364 6511 7854
17517G854l904L475j6470p342r71j1020q276K964L828O053K4857Q351j4680j7334
$$ 7854 3950 7425 -9045 -16387 -17358 -28378 -36654 -33690 -29862 -23809 1048 9399 -5281 -22615
17503b2615l55J0875K090M594J2755J1359p037p959j5137l065M046N453r374l774
$$ -22615 -22970 -12095 -10005 -5411 7344 18703 11666 3707 -11430 -14495 -10449 -4996 -14370 -18144
17489a8144J4154M274K894J337l084q15O233o577j8139J5427J7301m822n414q316
$$ -18144 -3990 284 3178 4515 1431 616 6849 272 -17867 -2440 14861 10039 4625 -3691
17475c691K63P208l607K670K955l166j4890L889M763N448J1941J067k6137q277
$$ -3691 -3428 3780 173 2843 5798 2632 -12258 -8369 -3606 1842 13783 14850 -11287 -19564
17461a9564J643m657M696p158j84J485J478q760j0834J3337J5209m196J9992J8717
$$ -19564 -17921 -22578 -17882 -25040 -25224 -23739 -22261 -31021 -41855 -28518 -13309 -17505 2487 21204
17447B1204j0378j359K0098M5881P1355L9366j8361m7705m8561l5017k4767m221
$$ 21204 10826 9467 29565 75446 146801 186167 167806 120101 71540 36523 11756 7535
17435G535m225j993K18r110j0433j32J793l369J2054J2606J483j2116N871O652
$$ 7535 3310 1317 1535 -7575 -18008 -18140 -16347 -19716 -7662 4944 6427 -5689 182 6834
17421F834j609N57p821j0322K76Q205J7944J5940o84o688r859K417N612M395P54
$$ 6834 5225 5782 -2039 -12361 -12085 -3880 14064 30004 29320 22632 12773 15190 20802 25197 25951
17406B5951n4p483j5127R317O250J041j697n921k2323j1870J4514L9237Q925j6606
$$ 25951 25897 18414 3287 12604 18854 19895 18198 12277 -10046 -21916 -7402 31835 40760 24154
17392B4154k268r63J2666K9043J7138K2442M6954O5440Q6524J50919J48427J6128
$$ 24154 21886 20923 33589 62632 79770 102212 149166 214606 301130 452049 600476 616604
17380F16604j03571j37819j33236q7823n0170k4594j7517j2428q005n555r478
$$ 616604 513033 375214 241978 154155 103985 79391 61874 49446 41441 35886 26408
17369B6408p288O00J4027j1334r828m806r194j1348l067K724M753P854J653K78
$$ 26408 19120 19720 33747 22413 12585 7779 -1415 -12763 -15830 -13106 -8353 -499 1154 1432
17355A432p48j189P705j0965J081L25J0371R03O843O507j2966j6553J60j0472
$$ 1432 684 -505 7200 -3765 -2684 -2359 8012 8915 15758 22265 9299 -7254 -7094 -17566
17341a7566L324K498O413M73R755N194N243K823l103N790R432P306j4192j1643
$$ -17566 -14242 -11744 -5331 -4858 4897 10091 15334 18157 15054 20844 30276 37582 23390 11747
17327A1747p859N645L760j7285j2534R247J0552j261J997M174o872j0780K736
$$ 11747 3888 9533 13293 -3992 -16526 -7279 3273 2012 4009 8183 1311 -9469 -6733
17314f733J1300O485q658M038q21N817O909N718o596j625p908m685L94j1426K910
$$ -6733 4567 11052 2394 6432 5611 11428 18337 24055 17459 15834 7926 3241 3635 -7791 -4881
17299d881J625R56M62p540o811J682J6820R218j5622K151N192J576J294K616L658
$$ -4881 -3256 -2300 -1838 -9378 -16189 -14507 2313 11531 -4091 -1940 3252 4828 6122 8738 12396
17284A2396n688p651r904l864j3914q325O092j546o003J6797K2043N601q296j504
$$ 12396 6708 -943 -10847 -14711 -28625 -36950 -30858 -32404 -38407 -21610 433 6034 -2262 -3766
17270c766l074M576n874O788N806M984p393L893M24o609J424j9474q581n025J1647
$$ -3766 -6840 -2264 -8138 -1350 4456 9440 2047 5940 6364 -245 1179 -18295 -26876 -31901 -20254
17255b0254r32n61J2010P021O838m27O136l502j2141K587O499L516M078o082o745
$$ -20254 -21186 -21747 -9737 -2716 4122 3695 9831 6329 -5812 -3225 3274 6790 10868 4786 -1959
17240a959n601O808J112J537J2547J670r539j56o064o620m160J3721J0710r262
$$ -1959 -7560 -752 360 1897 14444 16114 6575 6419 355 -6265 -10425 3296 14006 4744
17226D744l224N266j925j7687p570j630J7143J0137L767k632q070R115J1523J448
$$ 4744 1520 6786 4861 -12826 -20396 -22026 -4883 5254 9021 6389 -1681 7434 18957 20405
17212B0405j7172o023N485J746K770O186k0796j4076o804R508R991j376q753J7
$$ 20405 3233 -2790 2695 4441 7211 13397 -7399 -21475 -28279 -18771 -8780 -10156 -18909 -18892
17198a8892j087Q170J3121l413k3012q377J2604J1868m710L14Q863L200o91N329
$$ -18892 -19979 -11809 1312 -2101 -25113 -33490 -20886 -9018 -13728 -13414 -4551 -1351 -2042 3287
17184C287J617M747L011J433j5728j7140m264J2760j238k5574R869R110l91q11
$$ 3287 4904 9651 12662 14095 -1633 -18773 -23037 -10277 -11515 -37089 -27220 -18110 -18501 -19312
17170a9312N182K833K313J3593K223j0403l49o192J517k7882P406J2016Q332r18
$$ -19312 -14130 -11297 -8984 4609 6832 -3571 -3920 -10112 -8595 -36477 -29071 -17055 -8723 -9641
17156i641j1743j0376K91J3378K699K310J8960q340j7763Q247R345J224K125j558
$$ -9641 -21384 -31760 -31469 -18091 -15392 -13082 5878 -2462 -20225 -11978 -2633 -1409 716 -842
17142h42J418M65J473n423r919o601q945L214n33j376K0816p374k1810M761J1884
$$ -842 576 1041 2514 -2909 -12828 -19429 -28374 -25160 -25693 -27069 -6253 -13627 -35437 -30676 -18792
17127a8792M055N604n869o705j0757M42J6540Q419k628N524J5431J4531J261m062
$$ -18792 -14737 -9133 -15002 -21707 -32464 -32022 -15482 -7063 -9691 -4167 11264 25795 27056 22994
17113B2994n037j0763l865l889o220J78p101l598k598j0554q803j402l213J2514
$$ 22994 17957 7194 3329 -560 -6780 -6602 -13703 -17301 -19899 -30453 -39256 -40658 -43871 -31357
17099c1357J0154J8348J0043Q3m961k0259l195M452J2165L4262q837j3851n18
$$ -31357 -21203 -2855 7188 7271 2310 -17949 -21144 -16692 -4527 29735 20898 7047 6529
17086F529R415l045n745L13j6558Q222N57j2046j870J4706J9872K0452J9111J0874
$$ 6529 15944 12899 7154 7467 -9091 -869 -312 -12358 -14228 478 20350 40802 59913 70787
17072G0787K4738N6689N2009M9804N7088L0091k209k5609n6479p7363m5899m4926
$$ 70787 95525 152214 204223 254027 311115 341206 338997 313388 256909 179546 133647 88721
17060H8721l2371m693o832j5723p130K16j5937q022O908L163P360j2236k8734
$$ 88721 56350 51657 44825 29102 21972 22188 6251 -1771 5137 8300 15660 3424 -25310
17047b5310P812J9943R081l47j593j7957q705P185J8570k778j399j9362O890l309
$$ -25310 -17498 2445 11526 11179 9586 -8371 -17076 -9891 8679 5901 4502 -14860 -7970 -11279
17033a1279m877J6144K763M009Q158O924j1276j8752p268J0541N897j0107k161
$$ -11279 -16156 -12 2751 6760 14918 21842 10566 -8186 -15454 -4913 984 -9123 -11284
17020a1284M389o642l368m043J3131K809o210Q446N52m646n674j3664N793J8695
$$ -11284 -6895 -13537 -16905 -20948 -7817 -5008 -11218 -2772 -2220 -6866 -12540 -26204 -20411 -1716
17006a716J2024q829k710O571j207l5J0152m63l7929k2618j176J0169L984J9834
$$ -1716 10308 1479 -1231 5340 4133 4098 14250 13787 -24142 -46760 -47936 -37767 -33783 -13949
16992a3949K1738j257J379o406l690m745L807m395o601m385M993P543j2187M791
$$ -13949 7789 6532 7911 1505 -2185 -6930 -3123 -7518 -14119 -18504 -13511 -5968 -18155 -13364
16978a3364J0467N65N706j7249j1349K7594J7891j662j1611p98j455o849p557
$$ -13364 -2897 -2332 3374 -13875 -25224 2370 20261 18599 6988 6190 4735 -2114 -9671
16965i671J54N641O771m089o23l055M361l63q33j2155L152r187j7967j703m333
$$ -9671 -9517 -3876 2895 -1194 -1817 -4872 -511 -874 -1707 -13862 -10710 -19897 -37864 -39567 -43900
16950d3900J6782N429m53Q350J6327R235j1699j8543j2305N325q0m947j0620P103
$$ -43900 -27118 -21689 -22142 -13792 2535 11770 71 -18472 -30777 -25452 -25532 -30479 -41099 -33996
16936c3996J392j0640Q615J3950J4559j328k394J2125J0226q691r085j1396j2031
$$ -33996 -32604 -43244 -34629 -20679 -6120 -7448 -9842 2283 12509 3818 -5267 -16663 -28694
16923b8694P761N548J6898l915j9581j0321L2023P592l844P091N634k0972k459
$$ -28694 -20933 -15385 1513 -2402 -21983 -32304 -281 7311 3467 10558 16192 -4780 -7239
16910g239k85K838k204j58N205J7882R207j7777p164R560m575p36N389J739K955
$$ -7239 -7524 -4686 -6890 -7048 -1843 16039 25246 7469 305 9865 5290 4554 9943 11682 14637
16895A4637O844L515j6872j72J0520j5513j3458k013K605q286j0592M411N279
$$ 14637 21481 24996 8124 7952 18472 2959 -10499 -12512 -9907 -18193 -28785 -24374 -19095
16882a9095N692N150n720r545k777J0125J0889l490n774N194J9149j2036j2624
$$ -19095 -13403 -8253 -13973 -23518 -26295 -16170 -5281 -8771 -14545 -9351 9798 -2238 -14862
16869a4862J2l245r167l283O788J9679J5675K565r187l496J2222J466j1698j7300
$$ -14862 -14850 -18095 -27262 -30545 -23757 -4078 11597 14162 4975 1479 13701 15167 3469 -13831
16855a3831n497J578j073Q942M406J7744K387o280l883l141r960K230J0053o162
$$ -13831 -19328 -17750 -18823 -9881 -5475 12269 14656 8376 4493 1352 -8608 -6378 3675 -2487
16841b487q800O188J6477k23M726p420j7240k977k18Q292L798j0905K061K10m15
$$ -2487 -11287 -5099 11378 11155 15881 8461 -8779 -11756 -11974 -3682 116 -10789 -8728 -8518 -8933
16826h933l449j432O40O806Q802O601N60J252J0696L315j1713r755J109J486P618
$$ -8933 -12382 -13814 -13174 -6368 2434 9035 9595 10847 21543 24858 13145 3390 4499 5985 13603
16811A3603Q268J357m267j2457J740j53p923r291J129k503L969p460l934L885
$$ 13603 21871 23228 18961 6504 8244 8091 168 -9123 -7994 -10497 -6528 -13988 -17922 -14037
16797a4037J95q658j2847m837P527J2641L1588J1301K633q585o966q825j0513
$$ -14037 -13842 -22500 -35347 -40184 -32657 -20016 11572 22873 25506 16921 9955 1130 -9383
16784i383j2861p812q093K0397J6602O806P757N314j8071n821J6364M46o277J3512
$$ -9383 -22244 -30056 -38149 -17752 -1150 5656 13413 18727 656 -5165 11199 11645 5368 18880
16770A8880J792j2725q962l694l883j638Q682J7661m393l614l782j2364J044M550
$$ 18880 20672 7947 -1015 -4709 -8592 -10230 -1548 16113 11720 8106 4324 -8040 -6996 -2446
16756b446J1950M901R941j979j4760r213q970j3441J0187L145m996l837N933J5069
$$ -2446 9504 14405 24346 22367 7607 -1606 -10576 -24017 -13830 -10685 -15681 -19518 -13585 1484
16742A484J0690P50q736r368q28k715M625q630l283O506j163R733k47N702m223
$$ 1484 12174 12924 4188 -5180 -6008 -8723 -4098 -12728 -16011 -9505 -10668 -935 -1182 4520 297
16727B97o586j6534J578O528J1602Q114J1678j5367N163O846K705j1762n88K74
$$ 297 -6289 -22823 -21245 -14717 -3115 4999 16677 1310 6473 13319 16024 4262 3674 3948
16713C948J4826k035j7982k9905l882R135J0460J7041L36j684O82j1892N338N786
$$ 3948 18774 16739 -1243 -31148 -35030 -25895 -15435 1606 1942 258 940 -10952 -5614 172
16699A72m711k637o266Q746j630q884J236m076J3257J0340j1021r470J4875K8668
$$ 172 -4539 -7176 -13442 -4696 -6326 -15210 -13974 -18050 -4793 5547 -5474 -14944 -69 28599
16685B8599j903J058j4084j1125o013j1950j218k432o306N447K5746K4574m340
$$ 28599 26696 27754 13670 2545 -3468 -15418 -16636 -19068 -25374 -19927 5819 30393 26053
16672B6053j6557k6091k875J3579m360O010L377m407J00J2903o987m943K362J3698
$$ 26053 9496 -16595 -19470 -5891 -10251 -4241 -864 -5271 -5171 7732 745 -4198 -1836 11862
16658A1862J0916k0762k4902j1281N93R248Q441l658o015M616O533N866k431N722
$$ 11862 22778 2016 -22886 -34167 -33574 -24326 -15885 -19543 -25558 -20942 -14409 -8543 -10974 -5252
16644e252j405p837J3645p575p822R34J4212m48n22Q066P565j0195n48l365q46
$$ -5252 -6657 -14494 -849 -8424 -16246 -15312 -1100 -1548 -2070 5996 13561 3366 2818 -547 -1393
16629a393p34J36j1903n336J9496L857j1261j6659L291K4212j838p248m128J2253
$$ -1393 -2127 -1991 -13894 -19230 266 4123 -7138 -23797 -20506 3706 1868 -5380 -9508 2745
16615B745N348J98R179k569j0219p02j4970r260K578J5216J0629O08q501j1901
$$ 2745 8093 8291 17470 14901 4682 3980 -10990 -20250 -17672 -2456 8173 8781 280 -11621
16601a1621n383j781N38N205O182P697k861r614L207M426K714Q269j4436l665
$$ -11621 -17004 -18785 -18247 -13042 -6860 837 -2024 -11638 -8431 -4005 -1291 6978 -7458 -11123
16587a1123J1453J0036L92n000k500N30q48j646j2383o878j73m712O501N994Q514
$$ -11123 330 10366 10758 5758 3258 3788 2940 1294 -11089 -17967 -18140 -22852 -16351 -10357 -1843
16572a843k235j5680P03j412K510k301R115P561l488M52O402o599j5919L154J3501
$$ -1843 -4078 -19758 -19055 -20467 -17957 -20258 -11143 -3582 -7070 -6618 -216 -6815 -22734 -19580 -6079
16557f079R459Q678Q08j3033m753Q805P393n654j0978J0204m387N680j1867k825
$$ -6079 3380 12058 12866 -167 -4920 3885 11278 5624 -5354 4850 463 6143 -5724 -8549
16543h549o71q056K305J094m554R165O67N768J2249o862o320l516j1534j8938
$$ -8549 -9220 -17276 -14971 -13877 -18431 -9266 -8599 -2831 9418 2556 -3764 -7280 -18814 -37752
16529c7752J066J2210M18q65N447P528n415K848l957n812J47J1859R557J1706
$$ -37752 -36686 -24476 -24058 -24923 -19476 -11948 -17363 -14515 -18472 -24284 -24137 -12278 -2721 8985
16515H985N256o661q319k192m208j930j172O49n68K831j5105K392K815J760J5191
$$ 8985 14241 7580 -739 -2931 -7139 -9069 -10241 -9592 -10160 -7329 -22434 -20042 -17227 -15467 -276
16500b76N89J0689J3205o140j4217n259L275j2215L467N233n441J4636R719k5697
$$ -276 313 11002 24207 18067 3850 -1409 1866 -10349 -6882 -1649 -7090 7546 17265 -8432
16486h432r773L074L111q383p058M558R25N210J4857J4756j4661k590J5930j735
$$ -8432 -18205 -15131 -12020 -20403 -27461 -22903 -21978 -16768 -1911 12845 -1816 -4406 11524 9789
16472I789O238J0917k445m030P60n460o212R9M360j3240k4828J1347R42j8879
$$ 9789 16027 26944 24499 20469 21229 15769 9557 9656 14016 776 -24052 -12705 -11763 -30642
16458c0642o328J6875Q843N476M610o254k48o114M960o678P653k394j8708m446
$$ -30642 -36970 -20095 -11252 -5776 -1166 -7420 -7668 -13782 -8822 -15500 -7847 -10241 -28949 -33395
16444c3395J7237L3o63K117l75o040Q239r45M6o293o688k938m200J1007O103o026
$$ -33395 -16158 -16125 -16788 -14671 -15046 -21086 -12847 -13792 -13746 -20039 -26727 -29665 -33865 -22858 -16755 -22781
16428b2781K1485Q807j4834j895p207k840J825r02J198O100J0591O851k116l94
$$ -22781 -1296 7511 -7323 -9218 -16425 -19265 -17440 -18342 -17144 -11044 -453 6398 4282 3888
16414C888J923r208m911k764M457K627J05O911p084j199J5816J448j3571J465
$$ 3888 5811 -3397 -8308 -11072 -6615 -3988 -3883 3028 -4056 -5255 10561 12009 -1562 -97
16400i7n719j829j4589j778L873j0225R348J7974K464m421o30J037j3686J4344
$$ -97 -5816 -7645 -22234 -24012 -20139 -30364 -21016 -3042 -578 -4999 -5629 -4592 -18278 -3934
16386c934P311j3751M247m121q887P781J4713R82k809r404o779O574J9620j035
$$ -3934 3377 -10374 -6127 -10248 -19135 -11354 3359 4341 1532 -7872 -14651 -8077 11543 10508
16372A0508K315N438j8140K603J7594O450l766j6881j9474q7J1170j037n015J2818
$$ 10508 12823 18261 121 2724 20318 26768 23002 6121 -13353 -13440 -2270 -3307 -8322 4496
16358D496r141j0735L863M638j3219p358l770K793J5174J5479n331l229q854m899
$$ 4496 -4645 -15380 -11517 -6879 -20098 -27456 -31226 -28433 -13259 2220 -3111 -6340 -15194 -20093
16344b0093K093J725P345Q536j966o94K788l750n051N911J3566o353j374j3824
$$ -20093 -18000 -16275 -8930 -394 -2360 -3054 -266 -4016 -9067 -3156 10410 4057 2683 -11141
16330a1141k464p572l081J3486J0069n42m84L568K565r886j0313Q74O467k546
$$ -11141 -13605 -21177 -24258 -10772 -703 -1245 -1729 1839 4404 -5482 -15795 -14921 -8454 -11000
16316a1000j8842k879N156J5733p048O209L022k755p387N280Q247o874N610O441
$$ -11000 -29842 -32721 -27565 -11832 -18880 -12671 -9649 -12404 -19791 -14511 -6264 -13138 -7528 -1087
16302a087j736k4157J4609K4221n065j7567j5808N612J4386K603O007J4770J3385
$$ -1087 -2823 -26980 -12371 11850 6785 -10782 -26590 -20978 -6592 -3989 2018 16788 30173
16289C0173l561o443o822P287j0283R3P936o255K342O83p025j4971m27j309K811
$$ 30173 26612 20169 13347 20634 10351 10444 18380 12125 14467 15150 8125 -6846 -7273 -8582 -5771
16274e771j990n336P502L766J913m995j2277L665j3849r122J195J1888P148j5578
$$ -5771 -7761 -13097 -5595 -1829 84 -4911 -17188 -13523 -27372 -36494 -35299 -23411 -16263 -31841
16260c1841L911J1223o665l7o531j647K8622Q932j3878n762r673j3282N014L3362
$$ -31841 -27930 -16707 -23372 -23409 -29940 -31587 -2965 5967 -7911 -13673 -23346 -36628 -31614 1748
16246A748Q921p131j0995O744j0164J2338J1996p412j7041j5073n834Q772R551
$$ 1748 10669 3538 -7457 -713 -10877 1461 13457 6045 -10996 -26069 -31903 -23131 -13580
16233a3580O143M805J3384j9745J5200J2563n101q085N08k2463k6019O177K5599
$$ -13580 -7437 -2632 10752 -8993 6207 18770 13669 5584 6092 -16371 -42390 -36213 -10614
16220a0614K855J711L055k455K498J0994l907m816L805j1640K793j0716k780q602
$$ -10614 -7759 -6048 -2993 -5448 -2950 8044 4137 -679 3126 -8514 -5721 -16437 -19217 -27819
16206b7819J6356J2905l85P467P501l760L561j4471j4219l816q073o600R493J2414
$$ -27819 -11463 1442 1057 8524 16025 12265 15826 1355 -12864 -16680 -24753 -31353 -21860 -9446
16192i446O043O111j0748j3118Q945J4168K588Q79N444j817q829M06p698m485
$$ -9446 -3403 2708 -8040 -21158 -12213 1955 4543 5422 10866 9049 220 626 -7072 -11557
16178a1557j875J1102J6000k574j867r620j7427l447L973q444J9384J4902K624
$$ -11557 -13432 -2330 13670 11096 9229 -391 -17818 -21265 -17292 -25736 -6352 8550 11174
16165A1174O998k492K787Q121J866r830N468k281m976p334o238j9008j6052N836
$$ 11174 18172 15680 18467 26588 28454 18624 24092 21811 16835 9501 3263 -15745 -31797 -25961
16151b5961K0483L980r398j1714J0295Q774Q909j6875j5489J2305J0425J3245
$$ -25961 -5478 -1498 -10896 -22610 -12315 -3541 5368 -11507 -26996 -14691 -4266 8979
16139H979M328q123j820Q051L008j3212Q99R588J1330k248j3782k1291j515O255
$$ 8979 13307 5184 3364 11415 14423 1211 2110 11698 23028 20780 6998 -14293 -15808 -9553
16125i553l313l475J3577L896J806j2692j6675R661R368L187N932j7092l723J5653
$$ -9553 -12866 -16341 -2764 1132 2938 -9754 -26429 -16768 -7400 -4213 1719 -15373 -19096 -3443
16111c443J2277M014k092j7423j6469j0523J8533M035p201m870j019J8917n529
$$ -3443 8834 12848 10756 -6667 -23136 -33659 -15126 -11091 -18292 -23162 -24181 -5264 -10793
16098a0793j1750l24R574P570Q44k57M237K073J500j4233k0629j9024K277K2354
$$ -10793 -22543 -22867 -13293 -5723 -4879 -5136 -899 1174 2674 -11559 -32188 -51212 -48935 -26581
16084b6581K0177J4K0453J371l15K828j0471p896J478K575r318L020Q006j5573
$$ -26581 -6404 -6390 14063 15434 15119 17947 7476 -420 1058 3633 -5685 -2665 5341 -10232
16070a0232k0726R997J001K117J2570l878j9746m572J7434M827M668m584m027
$$ -10232 -30958 -20961 -19960 -17843 -5273 -9151 -28897 -33469 -16035 -11208 -6540 -11124 -15151
16057a5151N657K879J57o961j2791o303J1240L856M547P559L490o553j041N941
$$ -15151 -9494 -6615 -6458 -13419 -26210 -32513 -21273 -17417 -12870 -5311 -1821 -8374 -9415 -3474
16043c474L959j1907q699J6834J5345j2220l031k607K368O289P887M384L937m875
$$ -3474 485 -11422 -20121 -3287 12058 -162 -3193 -5800 -3432 2857 10744 15128 19065 14190
16029A4190j0305q055p948l179L495O294J7605q35p686j3201R67J0506J0896K224
$$ 14190 3885 -4170 -12118 -15297 -11802 -5508 12097 11262 3576 -9625 -8658 1848 12744 14968
16015A4968q452J142j0221K384K072p069J104L294O012q654N001j657L227m632
$$ 14968 6516 7658 -2563 -179 1893 -5176 -4072 -778 5234 -3420 1581 -76 3151 -1481
16001a481l297N420K589L493O886N322l076j0671l159j2158m288J826J3839N981
$$ -1481 -4778 642 3231 6724 13610 18932 15856 5185 2026 -10132 -14420 -12594 1245 7226
15987G226J270j5820j040L381o687j8970M928K2427M516l392p501o294o226M650
$$ 7226 8496 -7324 -8364 -4983 -11670 -30640 -25712 -3285 1231 -2161 -9662 -15956 -22182 -17532
15973a7532J2503K369j2652J29L315m278m156j2005p16K7718J0723m962q411K167
$$ -17532 -5029 -2660 -15312 -15183 -11868 -16146 -20302 -32307 -33023 -5305 5418 456 -7955 -5788
15959e788J189L708L544L344m070j011J4871q728o842r65L602o694j768M557l96
$$ -5788 -4599 -891 2653 5997 1927 916 15787 7059 217 -748 2854 -3840 -5608 -1051 -1447
15944a447N965l899n431q703J9596J4408j2950j7816l751J1482Q952K821k262
$$ -1447 4518 619 -4812 -13515 6081 20489 7539 -10277 -14028 -2546 6406 9227 6965
15931F965K320Q983p829j1984J1982J7j0033m412o464J4119m116N440J0196j355
$$ 6965 9285 18268 10439 -1545 10437 10454 421 -3991 -10455 3664 -452 4988 15184 13829
15917A3829r844J428j242J014m62j321p198r91O249r554j0894o808K459J5334
$$ 13829 3985 5413 4171 5185 4723 3402 -3796 -4787 1462 -8092 -18986 -25794 -23335 -8001
15903h001L093O050p898R860n335q003N818l24L394Q873O217O768N691j2079R38
$$ -8001 -4908 1142 -6756 3104 -2231 -10234 -4416 -4740 -1346 7527 13744 20512 26203 14124 15062
15888A5062k5878M946O488J398o358j0329K373M224R987M230l354q156K870P886
$$ 15062 -10816 -5870 618 2016 -4342 -14671 -12298 -8074 1913 6143 2789 -5367 -2497 5389
15874E389q697O891K0934j9910j2346j745m678J3205Q48K289n38l956r238P100
$$ 5389 -3308 3583 24517 4607 -7739 -9484 -14162 -957 -109 2180 1642 -2314 -11552 -4452
15860d452p676j0988R024L3043J547r856J0233l49P7p818j822m325M883L222p573
$$ -4452 -12128 -23116 -14092 18951 20498 10642 20875 20526 20603 12785 10963 6638 11521 14743 7170
15845G170j6116j719L0J0017j4447j3127N116J9548K732n210M499P067o7N455
$$ 7170 -8946 -10665 -10635 -618 -15065 -28192 -23076 -3528 -796 -6006 -1507 5560 5493 10948
15831A0948m556r1O838J540M631J894J0976r270o127n747M422l09O130l236j490
$$ 10948 6392 6301 13139 14679 19310 21204 32180 22910 16783 11036 15458 15149 21279 18043 16553
15816A6553j4883j6798K971M462l608r85l546M125m943K857L625n691j3440N067
$$ 16553 1670 -15128 -12157 -7695 -11303 -12288 -15834 -11709 -16652 -13795 -10170 -15861 -29301 -24234
15802b4234J0101J8536M3m335O367n679P009R733p390K652n611J237p466q760
$$ -24234 -14133 4403 4446 111 6478 799 7808 17541 10151 12803 7192 8429 963 -7797
15788g797n847j4502J2194J1052J2991J1070n022m714j1581m083Q031j1206j3181
$$ -7797 -13644 -28146 -15952 -4900 8091 19161 14139 9425 -2156 -6239 1792 -9414 -22595
15775b2595o23M265k255P813N770o73k313j0514k40R371L215R731M630n868r810
$$ -22595 -23218 -18953 -21208 -13395 -7625 -8298 -10611 -21125 -21365 -11994 -8779 952 5582 -286 -10096
15760a0096L311J5076R558n051k1849M475n55j0507J092J8179l253n235N584J6226
$$ -10096 -6785 8291 17849 12798 -9051 -4576 -5131 -15638 -14546 3633 380 -4855 729 16955
15746A6955j979l823Q16j8944J576P023P501N23m74r28j2977j2530P260q96n938
$$ 16955 14976 11153 11969 -6975 -5399 1624 9125 9648 9174 8246 -4731 -17261 -10001 -10897 -16835
15731a6835K853P574k310j0408n37j6892j3611J5532K3512J5004l456Q30j923
$$ -16835 -13982 -6408 -8718 -19126 -19663 -36555 -50166 -34634 -11122 3882 426 1256 -667
15718f67k178j3242M59j127J5487k132L39N164J2443j537j6578J9045m633M456
$$ -667 -2845 -16087 -15628 -16755 -1268 -3400 -3061 2103 14546 13009 -3569 15476 10843 15299
15704A5299k841o694J342P07j2891R733l979r900k44q377o942n208P040k805J5370
$$ 15299 12458 5764 7106 7813 -5078 4655 676 -9224 -9468 -17845 -24787 -29995 -22955 -25760 -10390
15689a0390M574M100J1413j0561k657K728K604J3188Q04K286j1336j2197J0390
$$ -10390 -5816 -1716 9697 -864 -3521 -793 1811 14999 15803 18089 6753 -5444 4946
15676D946J775j3148k642M024k708k933p566N759N509J302q630n756K372J9582
$$ 4946 6721 -6427 -9069 -5045 -7753 -10686 -18252 -12493 -6984 -5682 -14312 -20068 -17696 1886
15662A886K7391m953j1749K633r293m93l324j7097N995oQ858P072j990m586l928
$$ 1886 29277 24324 12575 15208 5915 5422 2098 -14999 -9004 -9010 -152 6920 4930 344 -3584
15647c584r845Q814P030n290r355M42J690q456J8110J5754o146l951K877p365
$$ -3584 -13429 -4615 2415 -2875 -12230 -11788 -10098 -18554 -444 15310 9164 5213 8090 725
15633G25M905K20n977j4138J117J239K678M502M487j1106j3713M50J0932J7152
$$ 725 5630 5850 -127 -14265 -13148 -11909 -9231 -4729 -242 -11348 -25061 -24611 -13679 3473
15619C473Q192p534p750m53J6422j587k1284o322J0525L120P047J7495p156k6779
$$ 3473 11665 4131 -3619 -4072 12350 10763 -10521 -16843 -6318 -3198 3849 21344 14188 -12591
15605a2591J611m414k517r90L668R056K013p987L577R163m269K265J2501O325
$$ -12591 -10980 -15394 -17911 -18901 -15233 -6177 -4164 -12151 -8574 589 -3680 -1415 11086 17411
15591A7411k2454k041J049N949n148N10l916l920J858R872K1844L93q807j2034
$$ 17411 -5043 -7084 -6035 -86 -5234 -4724 -8640 -12560 -10702 -830 21014 21407 12600 566
15577E66j700m774j0156J813q415J518j203J0768J7664J776m878o477j4035j4262
$$ 566 -1134 -5908 -16064 -14251 -22666 -21148 -22351 -11583 6081 7857 2979 -3498 -17533 -31795
15563c1795l185L2161J7425N926j0900k520j0128j0863j2641J744m02Q081M395
$$ -31795 -34980 -2819 14606 20532 9632 7112 -3016 -13879 -26520 -24776 -25178 -17097 -12702
15550a2702M431l666P560J016J1511P53j0466k8K531M846j924n860l796o173Q308
$$ -12702 -8271 -11937 -4377 -3361 8150 8903 -1563 -1591 940 5786 3862 -1998 -5794 -11967 -3659
15535c659J3650n9k2329j0572K762K831O526N712J639Q100K560K749l131j1421
$$ -3659 9991 9932 -12397 -22969 -20207 -17376 -10850 -5138 -3499 4601 7161 9910 6779 -4642
15521d642N701J332q824N60M76j302j999m643j2817j34J1550M385N989r593N697
$$ -4642 1059 2391 -6433 -5873 -5397 -6699 -8698 -13341 -26158 -26292 -14742 -10357 -4368 -13961 -8264
15506h264J98L353J537q875R25l810j5163K256P403J3080K72R295m843j0265j1374
$$ -8264 -8066 -4713 -3176 -12051 -11126 -14936 -30099 -27843 -20440 -7360 -7088 2207 -2636 -12901 -24275
15491b4275R673L844m730J2408J4875K467k674j7383j3168L524m899l485O074
$$ -24275 -14602 -10758 -15488 -3080 11795 14262 11588 -5795 -18963 -15439 -20338 -23823 -17749
15478a7749j1424m405K0314J2310J3146M34j555j1280J408K433j0594k70M722
$$ -17749 -29173 -33578 -13264 -954 12192 12626 11071 -209 1199 3632 -6962 -7232 -2510
15465b510n365l130L19q214j121J4553N752P430J9855k657j9201K32k737j2990
$$ -2510 -7875 -11005 -10686 -18900 -20021 -5468 284 7714 27569 24912 5711 5943 3206 -9784
15451i784J1836J1470M514k179J0997j1356j9580r605k645R728J5911l058j3131
$$ -9784 2052 13522 18036 15857 26854 15498 -4082 -13687 -16332 -6604 9307 6249 -6882
15438f882L757J94r338N277N161J3501p068k304r744J438Q606m79o181m250J334
$$ -6882 -3125 -2931 -12269 -6992 -1831 11670 4602 2298 -7446 -6008 2598 2119 -4062 -8312 -6978
15423f978Q633J1784k1672p860N728M360R56J235j0339N424M49L402N596l592
$$ -6978 1655 13439 -8233 -16093 -10365 -6005 -5049 -3814 -14153 -8729 -8280 -4878 718 -2874
15409b874M056r465j4313J2703m07m112q675N279n472p3k8P965J9926P990n455
$$ -2874 1182 -8283 -22596 -9893 -10300 -14412 -23087 -17808 -23280 -23353 -23381 -15416 4510 12500 7045
15394G045K639r908n371r01n875q42q812O360l654o249M965L386O164P699J201
$$ 7045 9684 -224 -5595 -6496 -12371 -13213 -22025 -15665 -19319 -25568 -20603 -17217 -11053 -3354 -2153
15379b153j380j2387K095N957P107k082n120M524L642j0167m27k72J140j4558
$$ -2153 -3533 -15920 -13825 -7868 -761 -2843 -7963 -3439 203 -9964 -10391 -10663 -9523 -24081
15365b4081J1865J772N822J3564j0996m217j86K1414k074j241k661N385j6430
$$ -24081 -12216 -10444 -4622 8942 -2054 -6271 -6457 14957 12883 11642 8981 14366 -2064
15352b064k8061M824J1762J0201l120O993Q650q021j6076o502q46o27j1710J1619
$$ -2064 -30125 -25301 -13539 -3338 -6458 535 9185 1164 -14912 -21414 -22260 -22887 -34597 -22978
15338b2978J6534J77M525O978J9427k425k0606K90M106J894K343j0848q90n060
$$ -22978 -6444 -6267 -1742 5236 24663 22238 1632 1922 6028 7922 10265 -583 -1473 -6533
15324f533j2897O056K3267L803q406n279j1605N52O480K44l026p91K866N360K677
$$ -6533 -19430 -13374 9893 13696 5290 11 -11594 -11042 -4562 -4318 -7344 -8135 -5269 91 2768
15309B768n734j9263j0593J1946K6112P960k0122k2434J2624J5827m176R59N723
$$ 2768 -2966 -22229 -32822 -20876 5236 13196 -6926 -29360 -16736 -909 -5085 -4126 1597
15296A597q5J4365J4800k7345m984Q932J6696j5273j8652n682J6427J5536R84
$$ 1597 1512 15877 30677 3332 -1652 7280 23976 8703 -9949 -15631 796 16332 17316
15283A7316j9790j6957K0127P440n799l375q423j2309o831M702Q000P810J1875
$$ 17316 -2474 -19431 696 8136 2337 -1038 -9461 -21770 -28601 -23899 -15899 -8089 3786
15270C786M845j0257j221L163k949J2564P414o635l647K783M743j096j4727k891
$$ 3786 8631 -1626 -2847 316 -2633 9931 17345 10710 7063 9846 14589 13493 -1234 -4125
15256d125j5081J2746P813n615N384J718m645K0515Q415j1164q540j3515L84J3709
$$ -4125 -19206 -6460 1353 -4262 1122 2840 -1805 18710 27125 15961 7421 -6094 -5710 7999
15242G999r039j1427k231J0452n561K449J3843J1443n857k742j6320n511J7313
$$ 7999 -1040 -12467 -14698 -4246 -9807 -7358 6485 17928 12071 9329 -6991 -12502 4811
15229D811J2092j762r564n32Q891M239j3595P78n891k182J355k238P005n452j4109
$$ 4811 16903 15141 5577 5045 13936 18175 4580 5358 -533 -2715 -1360 -3598 3407 -2045 -16154
15214a6154R797J0000J3858j0987q022k2179p721J0822O726k996R40J5543p72
$$ -16154 -6357 3643 17501 6514 -1508 -23687 -31408 -20586 -13860 -16856 -15916 -373 -1145
15201a145j0941l916J0027K043j3088K055J0627M18l620j5493J1045L520j495
$$ -1145 -12086 -16002 -5975 -3932 -17020 -14965 -4338 -3920 -7540 -23033 -11988 -8468 -9963
15188i963L722J5708q150k5673j4691J074J0611J0938J2332j5739l070Q378K967
$$ -9963 -6241 9467 1317 -24356 -39047 -37973 -27362 -16424 -4092 -19831 -22901 -14523 -11556
15175a1556Q680P085r613n632j033p379r65J2962p459r977K840J1018N006J453
$$ -11556 -2876 4209 -5404 -11036 -12069 -19448 -20413 -7451 -14910 -24887 -22047 -11029 -6023 -4570
15161d570K080Q453r234m133M372R430j2259j5557o252K832M171Q345L371O549
$$ -4570 -2490 5963 -3271 -7404 -3032 6398 -5861 -21418 -27670 -24838 -20667 -12322 -8951 -2402
15147b402k627l542j775J5423R469J1942j5237r879j2648N772P297r50j2327q827
$$ -2402 -5029 -8571 -10346 5077 14546 26488 11251 1372 -11276 -5504 1793 843 -11484 -20311
15133b0311M922K1740L017j5744j902J4428J8155n340j2785p981k550j0398J030
$$ -20311 -15389 6351 9368 -6376 -8278 6150 24305 18965 6180 -1801 -4351 -14749 -13719
15120a3719P660j4633r598J4285J0408j7861J1726L265m242L746O700N735k495
$$ -13719 -6059 -20692 -30290 -16005 -5597 -23458 -11732 -8467 -12709 -8963 -2263 3472 977
15107I77o645L683J3025j286m558l504l214N147J4338l732q594j326N923J381
$$ 977 -5668 -1985 11040 9754 5196 1692 -1522 3625 17963 14231 5637 4311 10234 11615
15093A1615k637q127j1358J7333J1997o846p102M419j0926j2861N576J2683Q991
$$ 11615 8978 851 -10507 6826 18823 11977 4875 9294 -1632 -14493 -8917 3766 12757
15080A2757J69K436j4306J976N458k672P53M164m673m178L006J9888j4918p904
$$ 12757 12926 15362 1056 3032 8490 5818 6571 10735 6062 1884 4890 24778 9860 1956
15066A956k359Q158m877J3056o92j4166j994M131j361p133P462J4144p0R135j4902
$$ 1956 -403 7755 2878 15934 15242 1076 -918 3213 1852 -5281 2181 16325 16255 25390 10488
15051A0488j7854o798M310N301J7055J4282m773l290j0268k0494K637J156j6363
$$ 10488 -7366 -14164 -9854 -4553 12502 26784 22011 18721 8453 -12041 -9404 -8248 -24611
15038b4611m647J1512K417l863m84J2078R431r859l017P142k737N180R848j2047
$$ -24611 -29258 -17746 -15329 -19192 -19676 -7598 1833 -8026 -11043 -3901 -6638 -1458 8390 -3657
15024c657o250j8980M084J7721J4163m865j071K668P819o852k3136P41J1063J633
$$ -3657 -9907 -28887 -24803 -7082 7081 2216 1145 3813 11632 4780 -18356 -17615 -6552 -4919
15010d919n350J918m042K900j1809J762J6998l201o360J0061o35K0039l657n977
$$ -4919 -10269 -8351 -12393 -9493 -21302 -19540 -2542 -5743 -12103 -2042 -2677 17362 13705 7728
14996G728j7586m817P167J4720K097j3149J053O42n329j1773k043J7204o573J3962
$$ 7728 -9858 -14675 -7508 7212 9309 -3840 -2787 -2145 -7474 -19247 -21290 -4086 -10659 3303
14982C303p41j5546j282J3545Q827k357L484n722J3547O021r53o115j541O785
$$ 3303 2562 -12984 -14266 -721 8106 5749 9233 3511 17058 23079 22126 16011 14470 21255
14968B1255j1643j2367K820R540j5002N82J1185N424r990n186o286M114o286j11
$$ 21255 9612 -2755 65 9605 -5397 -4815 6370 11794 1804 -3382 -9668 -5554 -11840 -11951
14954a1951J4712R160j87j2994J01J1573p003j4921l674M263J7392J2942j0397
$$ -11951 2761 11921 11734 -1260 -1159 10414 3411 -11510 -15184 -10921 6471 19413 9016
14941I016m841k040p32J710j7184j3879R562J0710L675p393p346k10k870K217
$$ 9016 4175 2135 1403 3113 -14071 -27950 -18388 -7678 -4003 -11396 -18742 -18952 -21822 -19605
14927a9605J1523q124k68J0215j0499M488J0850J9727J0242m853j3472j727O769
$$ -19605 -8082 -16206 -16474 -6259 -16758 -12270 -1420 18307 28549 23696 10224 8497 15266
14914A5266J491m841q296j4978q18o251p765l955R957J2988J7448R753n966J738
$$ 15266 16757 11916 3620 -11358 -12176 -18427 -26192 -30147 -20190 -7202 10246 19999 14033 15771
14900A5771R275l515k1285k4000j4525J0155J0654J805J0124O155j9521p489R418
$$ 15771 25046 21531 246 -23754 -38279 -28124 -17470 -15665 -5541 614 -18907 -26396 -16978
14887a6978R884J0131o077j939j073J8228R951K723O039o60M629P865J297l708
$$ -16978 -7094 3037 -3040 -4979 -6052 12176 22127 24850 30889 30229 34858 42723 44020 40312
14873D0312j5518j5331l890J881M084j4846J239p556j125m74J1883M772o480j635
$$ 40312 24794 9463 5573 7454 11538 -3308 -2069 -9625 -10750 -11224 659 5431 -1049 -2684
14859b684M531K718j1983l609k118K787J4530m736M249k448j4547o835K2918j7846
$$ -2684 1847 4565 -7418 -11027 -13145 -10358 4172 -564 3685 1237 -13310 -20145 2773 -15073
14845a5073p447J3133j0234J4114J489J3493J0956k4513o795J4094m54J609r641
$$ -15073 -22520 -9387 -19621 -5507 -4018 9475 20431 -4082 -10877 3217 2763 4372 -5269
14832e269O589M421q817q815N037o7O304J235O714N032k628j1158Q984J4339j1953
$$ -5269 1320 5741 -3076 -11891 -6854 -6921 -617 618 7332 12364 9736 -1422 7562 21901 9948
14817I948P847J0013J5779K858l74m854j901m892q628o885j7902j1618o087J0784
$$ 9948 17795 27808 43587 46445 46071 41217 39316 34424 25796 18911 1009 -10609 -16696 -5912
14803e912O584M126M985k961n901P140n079j1680j2656P684n13k307j202J8679
$$ -5912 672 4798 9783 6822 921 8061 2982 -8698 -21354 -13670 -14183 -16490 -17692 987
14789I87J2720m640r680O340pJ1786o811M077L137N996n367j0120J3601L242l177
$$ 987 13707 9067 -613 5727 5720 17506 10695 14772 17909 23905 18538 8418 22019 25261 22084
14774B2084l157l43p088k426J6076J144K874J0659J4601P138M950n109O272J4211
$$ 22084 18927 18584 11496 9070 25146 26290 29164 39823 54424 61562 66512 61403 67675 81886
14760H1886K8861M9092N3888O8177J12523J40506J18100N7423M774n6386j07221
$$ 81886 110747 159839 213727 281904 394427 534933 653033 710456 715230 658844 551623
14749E51623j34922j23825q5200o5700l7924k4308j3303P497k0754q762q361N439
$$ 551623 416701 292876 207676 141976 104052 79744 66441 73938 53184 44422 36061 41500
14737D1500Q863j1774n465p946r666O433p209q202j1587N391j48Q171Q889M074
$$ 41500 50363 38589 33124 25178 15512 21945 14736 6534 -5053 338 190 8361 17250 21324
14723B1324n635m816o541O259m363j0128J1331m525j561O46l453J658J878n953
$$ 21324 15689 10873 4332 10591 6228 -3900 7431 2906 1345 1991 -1462 196 2074 -3879
14709c879l353j376J4265r258k308J083n80r972m552P14P65P766L784K74J328
$$ -3879 -7232 -8608 5657 -3601 -5909 -4826 -5406 -15378 -19930 -19216 -18451 -10685 -6901 -6627 -5299
14694e299r961m73J1358L189j8408j9580J6672Q521p328p467Q463K4294J7774
$$ -5299 -15260 -15733 -4375 -1186 -19594 -39174 -22502 -13981 -21309 -28776 -20313 3981 21755
14681B1755J1947k51j1189m313o600J366J1571O989j0925n477J1092n941q410
$$ 21755 33702 33451 22262 17949 11349 12715 24286 31275 20350 14873 25965 20024 11614
14668A1614j1454K9J976l85O475n008k223l559Q9J0595j3125k886O400J0157J4427
$$ 11614 160 189 2165 1780 8255 3247 1024 -2535 -2446 8149 -4976 -7862 -1462 8695 23122
14653B3122K067m240M747j0662j2782q571p07j070J705P287J1405R014k801j2462
$$ 23122 25189 20949 25696 15034 2252 -6319 -7026 -8096 -6391 896 12301 21315 18514 6052
14639F052m26k704r987j4268K744J0117K0617K256k2392p959N490J0839o274r012
$$ 6052 5626 2922 -7065 -21333 -18589 -8472 12145 14401 -7991 -15950 -10460 379 -5895 -14907
14625a4907Q587o450q546O517J4830R037R863j709n204k2488o888N745Q768J1615
$$ -14907 -6320 -12770 -21316 -14799 31 9068 18931 17222 12018 -10470 -17358 -11613 -2845 8770
14611H770K1882l886p484J6407L196L033j4105j3508j941J0899k409m709k269
$$ 8770 30652 26766 19282 35689 38885 41918 27813 14305 12364 23263 20854 16145 13876
14598A3876j1314O032J1436r583n63m753J288J7411L813l997j4404N659O45K060
$$ 13876 2562 8594 20030 10447 9884 5131 6419 23830 27643 23646 9242 14901 15546 17606
14584A7606k2973N214O118k855j068j122Q298O235l567P30j1698l943O462N677
$$ 17606 -5367 -153 5965 3110 2042 920 9218 15453 11886 12616 918 -3025 3437 9114
14570I114k098p779M222j0649M035J2933l197K247j4913Q256n797R958J861j6340
$$ 9114 7016 -763 3459 -7190 -3155 9778 6581 8828 -6085 2171 -3626 6332 8193 -8147
14556h147r224j1154l061N880O144j2092O035J6875J1721J893J3827J3463Q206
$$ -8147 -17371 -28525 -31586 -25706 -19562 -31654 -25619 -8744 2977 4870 18697 32160 40366
14543D0366j4797k8451j6151J3417l250J0031n12j5757o055R914L381R004O999
$$ 40366 25569 -2882 -19033 -5616 -8866 1165 653 -15104 -21159 -11245 -7864 1140 8139
14530H139M825o393o107q330k826L575j1048J491N892J2956j307j5204J6625R327
$$ 8139 12964 6571 464 -7866 -10692 -7117 -18165 -16674 -10782 2174 867 -14337 2288 11615
14516A1615Q177R928Q525L879p542r960l416l997K4667O147j0834j4847L042p675
$$ 11615 19792 29720 38245 42124 34582 24622 21206 17209 41876 48023 37189 22342 25384 17709
14502A7709p758o663O315O740j5689J1909Q612p018n001o959r503r393Q515K7044
$$ 17709 9951 3288 9603 16343 654 12563 21175 14157 9156 2197 -7306 -16699 -8184 18860
14488A8860J5655j2849j7475L379O825O784n662j7762j56J6364K718M807l980
$$ 18860 34515 21666 4191 7570 14395 21179 15517 -2245 -2401 13963 16681 21488 17508
14475A7508m889J147J678K134j056j6005K928J0590J704j062J2745j0596p638
$$ 17508 12619 13766 15444 17578 16522 517 3445 14035 15739 14677 27422 16826 9188
14462I188L94l958r493J0102Q734R456p408R81R811J3810j658j4629k88L278K471
$$ 9188 9582 5624 -3869 6233 14967 24423 17015 17996 27807 41617 39959 25330 25042 28320 30791
14447C0791L500p084j301R856k0150j3339K393Q762j4859n760r076P384j728P165
$$ 30791 34291 27207 25906 35762 15612 2273 4666 13428 -1431 -7191 -16267 -8883 -10611 -3446
14433c446M485l483P670O896R780m124k94K223k780k6481N463K355P169Q871J9366
$$ -3446 1039 -2444 5226 12122 21902 17778 17484 19707 16927 -9554 -4091 -1736 5433 14304 33670
14418C3670J2175p319p423L07n73j403o433k5243j5394l627K0171P783j1484L619
$$ 33670 45845 38526 31103 31410 30837 29434 23001 -2242 -17636 -21263 -1092 6691 -4793 -1174
14404a174R976J139O986J2883m469j9277o921l695J9858k004p570o740P121R335
$$ -1174 8802 9941 16927 29810 25341 6064 -857 -4552 15306 13302 5732 -1008 6113 15448
14390A5448j3827m355L672l796n582l838L988q9J2741N392j9992j1764P888p510
$$ 15448 1621 -2734 938 -2858 -8440 -12278 -8290 -8379 4362 9754 -10238 -22002 -14114 -21624
14376b1624J1886J1893J1384K77r998K178M547n790O61k622r28J05P903o922j903
$$ -21624 -9738 2155 13539 13816 3818 5996 10543 4753 5414 2792 1864 1969 9872 2950 1047
14361A047N765m523N02k348M6m584M703j8819l614J4270R756O921k448m75j763
$$ 1047 6812 2289 2791 443 489 -4095 608 -18211 -21825 -7555 2201 9122 6674 6199 4436
14346D436J0168N450j1696r779l118Q984J1027P243j715m567l770o342o242J705
$$ 4436 14604 20054 8358 -1421 -4539 4445 15472 22715 21000 16433 12663 6321 79 1784
14332A784N991n424j4525J15P087J1401q011q093L694J5742J2950Q132k254j1107
$$ 1784 7775 2351 -12174 -12059 -4972 6429 -1582 -9675 -5981 9761 22711 30843 28589 17482
14318A7482j3276J370M207r679j2734q410m994Q831O466J4506L573J692m35l717
$$ 17482 4206 5576 9783 104 -12630 -21040 -26034 -17203 -10737 3769 7342 9034 8599 4882
14304D882k375j663j886k953J4738l102j6040j6046N185j288L893J4375J3099
$$ 4882 2507 844 -1042 -3995 10743 7641 -8399 -24445 -19260 -20548 -16655 -2280 10819
14291A0819R215p115L011n643m543j3727L767N393K094n147j1857M367R55o769
$$ 10819 20034 12919 15930 10287 5744 -7983 -4216 1177 3271 -1876 -13733 -9366 -8411 -15180
14277a5180J3020J4813j1041j1546l08K0180O522j0723P285J952p422O571P734
$$ -15180 -2160 12653 1612 -9934 -10242 9938 16460 5737 13022 14974 7552 14123 21857
14264B1857Q443J187n033j5123l836J2063m788n539j4659j9832J10J7202m679
$$ 21857 30300 31487 26454 11331 7495 19558 14770 9231 -5428 -25260 -25150 -7948 -12627
14251a2627j1561n024J5429P923k082K450J0479j671j5495M514n164P175p701
$$ -12627 -24188 -29212 -13783 -5860 -7942 -5492 4987 3316 -12179 -7665 -12829 -5654 -13355
14238a3355k0545K170Q442O934J2472J594n027k589m351P984J0504J3662k312
$$ -13355 -33900 -31730 -23288 -16354 -3882 -2288 -7315 -9904 -14255 -6271 4233 17895 15583
14225A5583k086J661l352k165R954R944m291m419k5548j3469J8723J5684m064
$$ 15583 13497 15158 11806 9641 19595 29539 25248 20829 -4719 -18188 535 16219 12155
14212A2155r575p863o694m799N426O538J2706l88N501r742J2852J0839m123J359
$$ 12155 2580 -5283 -11977 -16776 -11350 -4812 7894 7506 13007 3265 16117 26956 22833 24192
14198B4192o561j0043J1012Q855p114p155K238r234n64J1476K648N862j5260j6606
$$ 24192 17631 7588 18600 27455 20341 13186 15424 6190 5626 17102 19750 25612 10352 -6254
14184f254k698p434l652Q123J4373J5413J6649L728j6037q629O91j374r90N742
$$ -6254 -8952 -16386 -20038 -11915 2458 17871 34520 38248 22211 13582 14273 12899 11909 17651
14170A7651k0802M604J0523J399O781o492n606O21R78r509r578O721L168K941
$$ 17651 -3151 1453 11976 13375 20156 13664 8058 8679 9657 148 -9430 -2709 459 3400
14156C400L94J217o894q605J1703J5606p537O724P582j1545n086N586k489J3023
$$ 3400 3794 5011 -1883 -10488 1215 16821 9284 16008 23590 12045 6959 12545 10056 23079
14142B3079K377k0225k899J2535Q023k708N90N32q273n031n604n805k201J898
$$ 23079 25456 5231 2332 14867 22890 20182 20772 21304 13031 8000 2396 -3409 -5610 -3712
14128c712j019Q123k360n664J4104R44L667O094r105j144P074m046j175R910J1012
$$ -3712 -4731 3392 1032 -4632 9472 10416 14083 20177 11072 9928 17002 12956 11781 21691 32703
14113C2703K042p227J0395R307k3058j8466J5444r23j0925r298O872L001p134
$$ 32703 34745 27518 37913 47220 24162 5696 21140 20217 9292 -6 6866 9867 2733
14100B733Q758p097j4310O595J9834L308m015k387k0589O438o535J878N099j0798
$$ 2733 11491 4394 -9916 -3321 16513 19821 15806 13419 -7170 -732 -7267 -5389 -290 -11088
14086a1088K6431R883j35j8369K017O472k045M644j567j2117m552j894J1527L103
$$ -11088 15343 25226 25091 6722 8739 15211 13166 17810 16243 4126 -426 -2320 9207 12310
14072A2310j5091j4564j55K244J6217J7587q081j1991L413l750j1834J1211o200
$$ 12310 -2781 -17345 -17500 -15256 961 18548 10467 -1524 1889 -1861 -13695 -2484 -8684
14059h684L59o896J1113K251J2775N50Q03j0947r142N137R077L58K615J2607J704
$$ -8684 -8325 -15221 -4108 -1857 10918 11468 12271 1324 -7818 -2681 6396 6754 9369 21976 23680
14044B3680j576o420j1984k13J2581L762N812o303n212k31j5707p497R439k095
$$ 23680 22104 15684 3700 3487 16068 19830 25642 19339 14127 13896 -1811 -9308 131 -1964
14030a964N587k825K616p966J2268J2513J709j2178M677N910r591N4L729K543
$$ -1964 3623 798 3414 -4552 7716 20229 21938 9760 14437 20347 10756 10810 14539 17082
14016A7082M507n077n333j5652P86O130O650m116r316L949l819J9484N330k543
$$ 17082 21589 16512 11179 -4473 -3687 2443 9093 4977 -4339 -390 -4209 15275 20605 18062
14002A8062K656j145j1813o775P526n729J3383R062Q113m472k6200l7K1653L040
$$ 18062 20718 19573 7760 985 8511 2782 16165 25227 33340 28868 2668 2631 24284 27324
13988B7324j6633p662K126J3476N714j43J847q781j2115j976J94m857Q414J3721
$$ 27324 10691 3029 5155 18631 24345 24202 26049 17268 5153 3177 3371 -1486 6928 20649
13974B0649Q306K795p632n2O892p642m923L45n606J218K559j3929k359j3986l008
$$ 20649 28955 31750 24118 24066 30958 23316 18393 18738 13132 14350 16909 2980 621 -13365 -16373
13959a6373P994J809J2246J0684m99J1123M330J467m965J8899Q370k1463j2483
$$ -16373 -8379 -6570 5676 16360 15861 26984 31314 32781 27816 46715 55085 33622 21139
13946B1139j6572o627j723J620L884K4381K5387j8328o615p457o048o337j2649
$$ 21139 4567 -2060 -3783 -2163 1721 26102 51489 33161 26546 19089 13041 6704 -5945
13933e945l159l4J375J4720m232O056J1271j0975K075p272K845J3986j372p549
$$ -5945 -9104 -9138 -7763 6957 2725 8781 20052 9077 11152 3880 6725 20711 19339 11790
13919A1790K0950N330k1794p485k414n628J099k745l402J2364Q128n64j256R100
$$ 11790 32740 38070 16276 8791 6377 749 1848 -897 -4299 8065 16193 15629 14373 23473
13905B3473o251m234J9589N103j1218j0974n191j0822j6275j0313n889K3519K0652
$$ 23473 17222 12988 32577 37680 26462 15488 10297 -525 -16800 -27113 -33002 -9483 11169
13892A1169o684j7642Q498J698L601M193J487L942r844l089N836Q399m702p253
$$ 11169 4485 -13157 -4659 -2961 640 4833 6320 10262 418 -2671 3165 11564 6862 -391
13878c91n81m639P293J302j771j3825n659K091J3981J802j809m117o995m892O626
$$ -391 -972 -5611 1682 2984 1213 -12612 -18271 -16180 -2199 -397 -2206 -6323 -13318 -18210 -11584
13863a1584K1319K1272L062k0314j3301j4671K273K0578Q126p074m734K468k464
$$ -11584 9735 31007 34069 13755 454 -14217 -11944 8634 16760 9686 4952 7420 4956
13850D956m371j127l721J015O441M903q99m636R267o483J998J4098n288j2726
$$ 4956 585 -542 -4263 -3248 3193 8096 7197 2561 11828 5345 7343 21441 16153 3427
13836C427m778o388J5870l833J1314J3650l157m70m515q882O878l325p30N764
$$ 3427 -1351 -7739 8131 4298 15612 29262 26105 25635 21120 12238 19116 15791 15061 20825
13822B0825Q587j682j1600j3899m674R166J5654j2950N44L208O348q881P54j4880
$$ 20825 29412 27730 16130 2231 -2443 6723 22377 9427 9971 13179 19527 10646 11400 -3480
13808c480K8M886p45p03Q580R015L568k100K3975J5153j3130j8760J415O116L555
$$ -3480 -3452 1434 689 -14 8566 17581 21149 19049 43024 58177 45047 26287 27702 33818 37373
13793C7373j0758J353k2116q9M398k75q761j1125J0322l77P282R154M089J1825
$$ 37373 26615 27968 5852 5763 10161 9886 1125 -10000 322 -55 7227 16381 20470 32295
13779C2295K573J576m952q456J7969q684p526r094j5971M534P845M241L607J6437
$$ 32295 34868 36444 31492 23036 41005 32321 24795 15701 -270 4264 12109 16350 19957 36394
13765C6394J4801M128J5163K6281K3211K9891K4556L8463N5158P3325J17257J90845
$$ 36394 51195 55323 70486 96767 119978 149869 174425 212888 268046 341371 458628 649473
13753F49473L12851M95986M41828k5434l67971m70524l77845k18416j41137r7515
$$ 649473 962324 1458310 1900138 1874704 1506733 1036209 658364 439948 298811 201296
13743B01296l9695k4796l0663j7458K496j799j5104j3750q914j820o78N824N889
$$ 201296 161601 136805 106142 88684 91180 89381 74277 60527 51613 49793 49115 54939 60828
13730F0828j0388L083R805n803j5123k2067o385O208L776q037L895J710k452k597
$$ 60828 50440 53523 63328 57525 42402 20335 13950 20158 23934 15897 19792 21502 19050 16453
13716A6453n961M348K742j5361R874J0812n633l448P564M316q908j8408P469J2023
$$ 16453 10492 14840 17582 2221 12095 22907 17274 13826 21390 25706 16798 -1610 5859 17882
13702A7882Q616J9183M539r415N527j389j1302k569n578k281J590O76o442q995
$$ 17882 26498 45681 50220 40805 46332 44943 33641 31072 25494 23213 24803 25479 19037 10042
13688A0042J7069P349k210O36J9318Q038l691j3566p064o275l550k425L353J582
$$ 10042 27111 34460 32250 32886 52204 60242 56551 42985 35921 29646 26096 23671 27024 28606
13674B8606O531l758m929l964K038K517N88q42K462l34J2113J3302j3929j6246
$$ 28606 35137 31379 26450 22486 24524 27041 27629 26787 29249 28915 41028 54330 40401 24155
13660B4155J0382P045j0206k1707o523R647R219J315l078r08K184p757R368l512
$$ 24155 34537 41582 31376 9669 3146 12793 22012 23327 20249 19341 21525 13768 23136 19624
13646A9624j6283J5757J7751J2527R166q178o991K351P990J0864p961o916r171
$$ 19624 3341 19098 36849 49376 58542 50364 43373 45724 53714 64578 56617 49701 40530
13633D0530j7049j826K1778J6673q358j4938m41n810M416J0831J2633l913L132
$$ 40530 23481 21655 43433 60106 51748 36810 36369 30559 34975 45806 58439 54526 57658
13620E7658J1410p9j7509l1190j8878l116J3208K0113J6324J0541m85j3746j2790
$$ 57658 69068 68989 51480 20290 1412 -1704 11504 31617 47941 58482 57997 44251 31461
13607C1461l244O139j0315r554k1166o877O541l893r091K3081L0872J7919k592
$$ 31461 28217 34356 24041 14487 -6679 -13556 -7015 -10908 -19999 3082 33954 51873 49281
13594D9281j6362r225L544R452K93j0408k900j63J4454N937j4359j1267J8528
$$ 49281 32919 23694 27238 36690 36983 26575 23675 23512 37966 43903 29544 18277 36805
13581C6805k988m847J016M995R723M108j389j936j2991r202m766K4294J8268P846
$$ 36805 33817 28970 29986 34981 44704 48812 47423 45487 32496 23294 18528 42822 61090 68936
13567F8936r31R677J8052j861K8948N0192M8216M397M0891K8450L89n8449p0478
$$ 68936 68005 77682 95734 93873 122821 173013 221229 225626 266517 294967 295356 236907 166429
13554A66429m5563l2255j4946m792L041o259j60L758o467l800Q490p718j1123
$$ 166429 120866 88611 73665 68873 71914 65655 65495 69253 62786 58986 67476 59758 48635
13541D8635K629j4024r939J0079m92n82P443J4945m666p556K2o433p43r58m02
$$ 48635 51264 37240 27301 37380 36888 36306 43749 58694 54028 46472 46494 40061 39318 38360 37958
13526C7958n955j2815j4381l95L546J2916K4089J7016o798r381j5116r130M717
$$ 37958 32003 19188 4807 4412 7958 20874 44963 61979 55181 45800 30684 21554 26271
13513B6271J1909j161j6020q622J7406J592j1897j1594M083J7893K4769J8674
$$ 26271 38180 37019 20999 12377 29783 31375 19478 7884 11967 29860 54629 73303
13501G3303L0528J9441J3337L193m98p553r929k6952k6138j8511m817k3994j6259
$$ 73303 103831 123272 136609 139802 139304 131751 121822 94870 68732 50221 45404 21410 5151
13488E151N94J7161O034N115J041J0508J1400J8859J3356K271j5663k382J740
$$ 5151 5745 22906 28940 34055 35096 45604 57004 75863 89219 91490 75827 73445 75185
13475G5185j1621j7835J895J6985Q120J6826Q284j6754j0650N11M426J1186L9509
$$ 75185 63564 45729 47624 64609 72729 89555 97839 81085 70435 70946 75372 86558 126067
13462A26067L1712j9663o071Q432j1443j5171j859k657K364l663q003j886k3538
$$ 126067 157779 138116 132045 140477 129034 113863 112004 109347 111711 108048 100045 98159 74621
13449G4621m35Q09O92R6N301M536K882J0100K520k2869j4981q192j9127K222p397
$$ 74621 74186 74995 75687 75783 81084 85620 88502 98602 101122 78253 63272 55080 35953 38175 30778
13434C0778n2652q6021n6114N0766J47813Q5819J3072K988O114J783n435k777
$$ 30778 -21874 -107895 -164009 -113243 34570 120389 133461 136449 142563 144346 138911 136134
13422A36134J3932K2437J7910K321J01j6390k0336k14P093M213K5955K9770j0208
$$ 136134 150066 172503 190413 192734 192835 176445 156109 155895 162988 167201 193156 222926 212718
13409B12718j9301j1608r75J2950J2279K5231K755J0336O421J592J0741N633o0
$$ 212718 193417 181809 180834 193784 206063 231294 234049 244385 250806 252398 263139 268772 268712
13396B68712J6976k902j5911M13q744N100K011R442J9975J8116P236m151k167
$$ 268712 285688 282786 266875 267288 258544 263644 265655 275097 295072 313188 320424 316273 314106
13383C14106N470p616J230P544O891J1925K2244K2774J6236N385J1313J5976L2086
$$ 314106 319576 311960 313190 320734 327625 339550 361794 384568 400804 406189 417502 433478 465564
13370D65564N804N599J8745N362J0718K2063M0575M1014J9004K7266L1371K0745
$$ 465564 471368 476967 495712 501074 511792 533855 574430 615444 634448 661714 693085 713830
13358G13830K5803K3155J9444N5027M9341K7537L1924N6766O7484M4007J2929
$$ 713830 739633 762788 782232 837259 886600 914137 946061 1002827 1070311 1114318 1127247
13347A127247J6788K9183L4576O7610P4797P1758R7333J28067J54924J89363J82093
$$ 1127247 1144035 1173218 1207794 1275404 1350201 1421959 1519292 1647359 1802283 1991646 2173739
13336B173739J42490J65954J89873J94204K28135K59120K80360L18150L74999
$$ 2173739 2316229 2482183 2672056 2866260 3094395 3353515 3633875 3952025 4327024
13327D327024M53215N19705O02882P64824R02687J029208J118190J264929J523238
$$ 4327024 4780239 5299944 5902826 6667650 7570337 8599545 9717735 10982664 12505902
13318A2505902J941297K613580L411373M463164N823388P623832J0356496J4773252
$$ 12505902 14447199 17060779 20472152 24935316 30758704 38382536 48739032 63512284
13310F3512284K2378454L7782347O7683178J05586618Q6065519j5948345p5226311
$$ 63512284 85890738 123673085 191356263 296942881 383008400 367060055 291833744
13303B91833744r2321236p3574251m4417139k5526703j5299998r903783o851944
$$ 291833744 199512508 125938257 81521118 55994415 40694417 30790634 23938690
13296B3938690m779799l349630k417644j934785j653679j384204j107565r09882
$$ 23938690 19158891 15809261 13391617 11456832 9803153 8418949 7311384 6401502
13288F401502p32213n74398m85657m34721l85965l41700k90586k57223k27512
$$ 6401502 5669289 5094891 4609234 4174513 3788548 3446848 3156262 2899039 2671527
13279B671527k12263j83064j54260j63230j34909j10145p1863o4839m8872o4671
$$ 2671527 2459264 2276200 2121940 1958710 1823801 1713656 1641793 1576954 1528082 1463411
13269A463411o2679m7635o2878n7383o4280q4552q2917o7864p1347n4935k8997
$$ 1463411 1400732 1353097 1290219 1232836 1168556 1084004 1001087 933223 861876 806941 777944
13258G77944k8170k0751k6476n054k6846m1953m2285j6429k1713k0082q301P642
$$ 777944 749774 729023 702547 697493 670647 628694 586409 569980 548267 528185 519884 527526
13246E27526O622j4016m2938l8453l2250M75P415j0889l6120j3119Q163R430j4399
$$ 527526 534148 520132 477194 438741 406491 406966 414381 403492 367372 354253 362416 371846 357447
13233C57447r441O609r626o315j4997k4295k0512j840n941l334r61l004j1812
$$ 357447 348006 354615 344989 338674 323677 299382 278870 277030 271089 267755 266794 263790 251978
13220B51978k3507m0294j5537J855j1885r30J6740R911r59L797j9718j8375J1931
$$ 251978 228471 188177 172640 174495 162610 161680 178420 188331 187372 191169 171451 153076 165007
13207A65007j006k5398j7476j949j890J833J6253M132K079J4241P694j7893k8003
$$ 165007 164001 138603 121127 119178 117288 119121 135374 139506 141585 155826 163520 145627 117624
13194A17624j3626J858J6904J3479j83j1926N870K7013P541j9813j7927q464Q95
$$ 117624 103998 105856 122760 136239 136056 124130 130000 157013 164554 144741 126814 118350 119245
13181A19245N1086P3720N8341O349l0944l6451o969q107k2002q571j7437j0017
$$ 119245 170331 244051 302392 308741 277797 241346 234377 226270 204268 195697 178260 168243
13169A68243o703j2212k4235j1240L3960J1596n520j0667k4430l5130j8923k5172
$$ 168243 161540 149328 125093 113853 147813 159409 153889 143222 118792 83662 64739 39567
13157C9567j4445J0516J2727K792j356j5440N06J2407j0334L230J8047P531R753
$$ 39567 25122 35638 48365 51157 49801 34361 34867 47274 36940 40170 58217 65748 75501
13144G5501P296n630p083p994k344J350J3333J7210j3660j4544M102n84O877k526
$$ 75501 82797 77167 70084 62090 59746 61096 74429 91639 77979 63435 67537 66953 73830 71304
13130G1304K789O535L923m200q515J3669J5690K013j0202j062o343r483j6574
$$ 71304 74093 80628 84551 80351 71836 85505 101195 103208 93006 91944 85601 76118 59544
13117E9544k4858k2090q707p328j0371l25J9272K1164J9148L6125L1774K0621
$$ 59544 34686 12596 3889 -3439 -13810 -14135 5137 26301 45449 81574 113348 133969
13105A33969q747l3100k8772M068K9085K3521K1506L940j4496j2379k8105k1166
$$ 133969 125222 92122 63350 67418 96503 120024 141530 145470 130974 118595 90490 69324
13093F9324j7466M484N360K340k131J7423K428k962k449k240p899o423j3601j9776
$$ 69324 51858 56342 61702 64042 61911 79334 81762 78800 76351 74111 66212 59789 46188 26412
13079B6412n951R313J5777n120r964J3763M060j3833k0793j8243p776L420N545
$$ 26412 20461 29774 45551 40431 30467 44230 48290 34457 13664 -4579 -12355 -8935 -3390
13066c390J8238J1599q514M764K308j1194O827J7426J1033m244j1106K657M228
$$ -3390 14848 26447 17933 22697 25005 13811 20638 38064 49097 44853 33747 36404 40632
13053D0632j5843j4015K1755K0825j4099r154q053j459k356J6947J6974J471p42
$$ 40632 24789 10774 32529 53354 39255 30101 22048 20589 18233 35180 52154 53625 52883
13040E2883j8835o807M392q229j3486K234P439P936J0156J9653R116q682N60j2019
$$ 52883 34048 27241 31633 23404 9918 12152 19591 27527 37683 57336 66452 57770 58330 46311
13026D6311l874J7775K355k0417j0137j0294j3201m47R412O373L56j5307q020
$$ 46311 42437 60212 62567 42150 32013 21719 8518 8071 17483 23856 24212 8905 885
13013H85J5358P551R893R260J9790J7432Q543o811j7672K802m595k6155k0512
$$ 885 16243 23794 33687 42947 62737 80169 88712 81901 64229 67031 62436 36281 15769
13000A5769k7841K134K3481L5235J2485l491l3165j0399N267o50J3792J2030l371
$$ 15769 -12072 -9938 13543 48778 61263 57772 24607 14208 19475 18825 32617 44647 41276
12987D1276n81j7909M618P758J1776j0500j4200k4247n853L775J5348K164j1980
$$ 41276 40695 22786 27404 35162 46938 36438 22238 -2009 -7862 -4087 11261 13425 1445
12974A445l2J1327J3438R711j3105j6450j9685m736O745M440J91M27j0986O385
$$ 1445 1413 12740 26178 35889 22784 6334 -13351 -18087 -11342 -6902 -6711 -6284 -17270 -10885
12960a0885O513j728J2688k399j3311M139Q87J3384N98J7337Q391j3133M947L533
$$ -10885 -4372 -6100 6588 4189 -9122 -4983 -4096 9288 9886 27223 35614 22481 27428 30961
12946C0961j2108n398p257p909O721L222j5206O402L0489K5221j5770j1475O279
$$ 30961 18853 13455 6198 -1711 5010 8232 -6974 -572 29917 55138 39368 27893 34172
12933C4172k5056j0366J3932L249o231R021m526p139j6792J2097J921P829M428
$$ 34172 9116 -1250 12682 15931 9700 18721 14195 7056 -9736 2361 4282 12111 16539
12920A6539j851m420J0523o306l876q483j516j229m930o119n466J3368N185p047
$$ 16539 14688 10268 20791 14485 10609 2126 610 -619 -5549 -11668 -17134 -3766 1419 -5628
12906e628O749L75Q065L17J741J778M907J241Q529J245j356l043n02o13j1335
$$ -5628 1121 1496 9561 9878 11619 13397 18304 19545 28074 29319 27963 24920 24418 23805 12470
12891A2470k1368L52J6808P488k46M378R579p612k242K868j31R648K1544j14Q155
$$ 12470 -8898 -8546 8262 15750 15504 19882 29461 21849 19607 22475 22344 31992 53536 53422 61577
12876F1577j408p508J4574J5133M477j022O591M850P11N501N120J2174J8904K0978
$$ 61577 60169 52661 67235 82368 86845 85823 92414 97264 97975 103476 108596 120770 139674 160652
12862A60652J9101L3710O2416Q4093J25728K16831L70985N38972L99513j12112
$$ 160652 179753 213463 275879 359972 485700 702531 1073516 1612488 2012001 1899889
12852A899889l88212m59369l59986k04918r5259m9934r141J9830N0446Q2119J27443
$$ 1899889 1511677 1052308 692322 487404 392145 342211 333070 352900 403346 485465 612908
12841F12908K40485M04582L21132m3596l03862l83284k93030j81151j18141o8083
$$ 612908 853393 1257975 1579107 1535511 1231649 848365 555335 374184 256043 187960
12831A87960n6324k6508k2409j5444j171P024q870k3741j8203K115R752K293J6895
$$ 187960 131636 105128 82719 67275 66104 73128 64258 40517 22314 24429 34181 36474 53369
12818E3369K59j7215L357m727o394j6308r681m18m469j1727K797l270K20J0754
$$ 53369 53628 36413 39770 35043 28649 12341 2660 2242 -2227 -13954 -11157 -14427 -14207 -3453
12804c453M591o683n441R000J6422J0665k2163n606m58j3400J1502L2402o853
$$ -3453 1138 -5545 -10986 -1986 14436 25101 2938 -2668 -3126 -16526 -5024 27378 20525
12791B0525O717O76m838M249l456p816o473J0194J0150j0682k457M96j0456k146
$$ 20525 27242 27918 23080 27329 23873 16057 9584 19778 29928 19246 16789 17285 6829 4683
12777D683r396n452l340J352J8699o457n329l570j500J4790Q068N745p19p083
$$ 4683 -4713 -10165 -13505 -12153 6546 89 -5240 -8810 -10310 4480 12548 18293 17574 10491
12763A0491J0963j004Q514l11L682L324j9301k3790j2810N517m585J2109j206
$$ 10491 21454 20450 28964 28653 32335 35659 16358 -7432 -20242 -14725 -19310 -7201 -8407
12750h407j305J4696M25M230o513Q757N802j3836j1194P130R098K0123r785j1532
$$ -8407 -9712 4984 5409 9639 3126 11883 17685 3849 -7345 -215 8883 29006 19221 7689
12736G689q21J850l549O739j643J2222j384r487r740N010J9138P783m831K847
$$ 7689 6868 8718 5169 11908 10265 22487 21103 11616 1876 6886 26024 33807 28976 31823
12722C1823j752o576j6490J234j3372n275J1475M610m84N755M991j650n159q796
$$ 31823 30071 23495 7005 8239 -5133 -10408 1067 5677 5193 10948 15939 14289 9130 334
12708C34L668P405M343j1458J062J0517k849N766n905j2797J2329K3830L547j4516
$$ 334 4002 11407 15750 4292 5354 15871 13022 18788 12883 86 12415 36245 39792 25276
12694B5276j7305N150j1209j892O440J51k367l555m960J8624J1798Q753j39k536
$$ 25276 7971 13121 1912 20 6460 6611 4244 689 -4271 14353 26151 34904 34765 32229
12680C2229j9238j2418J0040M434R19k86o085j0222L847n047n513O784K780N273
$$ 32229 12991 573 10613 15047 15966 15680 9595 -627 3220 -1827 -7340 -556 2224 7497
12666G497p08r251K1019M220j9514O924P090r994o510J0583K340K935q061j4739
$$ 7497 6789 -2462 18557 22777 3263 10187 17277 7283 773 11356 13696 16631 8570 -6169
12652f169K495J6205Q79M766j3447j3552Q076J7146j7328j139l665J0817L005
$$ -6169 -3674 12531 13410 18176 4729 -8823 -747 16399 -929 -2068 -5733 5084 8089
12639H089j1469J0719L330m800n324N498M177K513J967o112p061P445Q024L965
$$ 8089 -3380 7339 10669 5869 545 6043 10220 12733 14700 8588 1527 8972 16996 20961
12625B0961K82L581o507j2802q873q740n710J9707O891k484o947l147N98O625
$$ 20961 21243 24824 18317 5515 -3358 -12098 -17808 1899 8790 6306 -641 -3788 -3190 3435
12611C435l169q03j1720l15K672m303J205J5260M625J478j0241L069m215J0591
$$ 3435 266 -537 -12257 -12572 -9900 -14203 -12998 2262 6887 8365 -1876 1193 -3022 7569
12597G569L743q719P522O439j6912j2687l459k995N984k56K531Q625J4922K208
$$ 7569 11312 2593 10115 16554 -358 -13045 -16504 -19499 -13515 -13771 -11240 -2615 12307 14515
12583A4515p799j2678J2375R11m251J374P557L847q194m614Q334J2221m941j1256
$$ 14515 6716 -5962 6413 7324 3073 4447 12004 15851 7657 3043 11377 23598 18657 7401
12569G401j603O295r847j6020O638P461o992j5693n218P626J3251J865R448J2954
$$ 7401 5798 12093 2246 -13774 -7136 325 -6667 -22360 -27578 -19952 -6701 -4836 4612 17566
12555A7566N78j4383J438m599J1480O225O014n008j7645M934L605P620q618l0582
$$ 17566 18144 3761 5199 600 12080 18305 24319 19311 1666 6600 10205 17825 9207 -21375
12541b1375p963n36J4192O265j295p227K6320m075l529O543j527J2722m162m599
$$ -21375 -29338 -29874 -15682 -9417 -10712 -17939 8381 4306 777 7320 5793 18515 14353 9754
12527I754Q396l224p928j768l7j9806k2493J4677P339l724q35J0037K5062p586
$$ 9754 18150 14926 6998 5230 5193 -14613 -37106 -22429 -15090 -18814 -19649 -9612 15450 7864
12513G864j7759O970L015j0237L989R387n500O806O041R343k35L738k0302N192
$$ 7864 -9895 -2925 90 -10147 -6158 3229 -2271 4535 10576 19919 19684 23422 3120 8312
12499H312J6986j5936p773p885Q305R040p782j3204K082J0707M396j193M493j1781
$$ 8312 25298 9362 1589 -6296 2009 11049 3267 -9937 -7855 2852 7248 6055 10548 -1233
12485a233k0045l388J8265J5417J770J2124K068L335n82o553r738L11N37r589
$$ -1233 -21278 -24666 -6401 9016 10786 22910 24978 28313 27731 21178 11440 11751 12288 2699
12471B699q94N369j1135N273j634R823O403P253q235o213j4199m746j751j1382
$$ 2699 1805 7174 -3961 1312 -322 9501 15904 23157 14922 8709 -5490 -10236 -11987 -23369
12457b3369K1831J1263m78K177L650m844j4411P362m442Q32J038J4375l883k6195
$$ -23369 -1538 9725 9247 11424 15074 10230 -4181 3181 -1261 -429 609 14984 11101 -15094
12443a5094L296J3947Q958J538J81q064j8870o214k276J4290J8341o544k027q589
$$ -15094 -11798 2149 11107 12645 12826 4762 -14108 -20322 -22598 -8308 10033 3489 1462 -7127
12429g127l32J0288J0224l688l198L458j3866j896j2957p622P172R547N80K553
$$ -7127 -7459 2829 13053 9365 6167 9625 -4241 -6137 -19094 -26716 -19544 -9997 -9417 -6864
12415f864J8949p98J1892P704j1981j5747R373J0015q875j0178O534P865r845
$$ -6864 12085 11287 23179 30883 18902 3155 12528 22543 13668 3490 10024 17889 8044
12402H044l695j0653r834J1700J4471Q188J112m178j084o543N561N454k338p178
$$ 8044 4349 -6304 -16138 -4438 10033 18221 19333 15155 14071 7528 13089 18543 16205 9027
12388I027p355k029J0071j327k0937o970J0584k469r896N610L466R226Q063j008
$$ 9027 1672 -357 9714 8387 -12550 -19520 -8936 -11405 -21301 -15691 -12225 -2999 5064 4056
12374D056k2971q047Q142j205J1849J714J608O012j2340K59J0518o31j6654j2709
$$ 4056 -18915 -26962 -18820 -20025 -8176 -6462 -4854 1158 -11182 -10923 -405 -1036 -17690 -30399
12360c0399Q129K3212j866o653J0992n5n370l248j4234n600O50k17J6141J8115
$$ -30399 -22270 942 -924 -7577 3415 3360 -2010 -5258 -19492 -25092 -24442 -24659 -8518 9597
12346I597R777q007j0510r185l115P702L091Q056R469q129j247n417Q218j951
$$ 9597 19374 11367 857 -8328 -11443 -3741 -650 7406 16875 8746 7499 2082 10300 8349
12332H349j2229O679j550o173R726J0895r842M668j2548j622J5881K146n261m461
$$ 8349 -3880 2799 1249 -4924 4802 15697 5855 10523 -2025 -3647 12234 14380 9119 4658
12318D658o108j858n063n443L198J1762K742O618R538j549p425k369Q54q252j4536
$$ 4658 -1450 -3308 -8371 -13814 -10616 1146 3888 10506 20044 18495 11070 8701 9555 1303 -13233
12303a3233j1744J8714K2470N518N205m306k2394j5980o620n459m814k626K476
$$ -13233 -24977 -6263 16207 21725 26930 22624 230 -15750 -22370 -27829 -32643 -35269 -32793
12290c2793O970J9269J8939k780n255K165k914o068J3713n821j2050K25L538J3136
$$ -32793 -25823 -6554 12385 9605 4350 6515 3601 -2467 11246 5425 -6625 -6400 -2862 10274
12276A0274J2524j69p227N832n338l511j589j2535r830J366l124r000m060j051
$$ 10274 22798 22629 15402 21234 15896 12385 10796 -1739 -11569 -10203 -13327 -22327 -26387 -27438
12262b7438K2827J5483L474K708M597P943r332j4619j2249J9245l613o992K029
$$ -27438 -4611 10872 14346 17054 21651 29594 20262 5643 -6606 12639 9026 2034 4063
12249D063m988P629N808j136o804o584J1549P565j0262o447j4350l072m401L345
$$ 4063 -925 6704 12512 11376 4572 -2012 9537 17102 6840 393 -13957 -17029 -21430 -18085
12235a8085J8016K4435j5583j6070K088Q620m372k428J014j0525Q929J7078j0652
$$ -18085 -69 24366 8783 -7287 -5199 3421 -951 -3379 -2365 -12890 -3961 13117 2465
12222B465m650j316j5765j5059M52J1128n72M404J9252K377l260Q582P641o877
$$ 2465 -2185 -3501 -19266 -34325 -33873 -22745 -23317 -18913 339 2716 -544 8038 15679 8802
12208H802j0930o338p159K0471L082M431n90j2491J1499L549o711J1080o587j8970
$$ 8802 -2128 -8466 -15625 4846 7928 12359 11769 -722 10777 14326 7615 18695 12108 -6862
12194f862j4165J4067J4260M437J7144q498q279p143q753J855m557j3819r369
$$ -6862 -21027 -6960 7300 11737 28881 20383 12104 4961 -3792 -1937 -6494 -20313 -29682
12181b9682N64J3441J8897J1176j718J1588R271j5289l118q93n860l380j4337
$$ -29682 -29118 -15677 3220 14396 12678 24266 33537 18248 15130 14237 8377 4997 -9340
12168i340P649P382R237o842n938R399j8790q227j497m787N118L262q253k362
$$ -9340 -1691 5691 14928 8086 2148 11547 -7243 -15470 -16967 -21754 -16636 -13374 -21627 -23989
12154b3989M157m502j1527l548R158R451J5081P259K065k2132r943o914J2848
$$ -23989 -19832 -24334 -35861 -39409 -30251 -20800 -5719 1540 3605 -18527 -28470 -35384 -22536
12141b2536J7838R452J049K290j9835L203Q794K605M350J0499P459k707j2214
$$ -22536 -4698 4754 5803 8093 -11742 -8539 255 2860 7210 17709 25168 22461 10247
12128A0247k3562l270o773N707Q16Q665J0812P448N685L715j6786l477P04O349
$$ 10247 -13315 -16585 -23358 -17651 -16835 -8170 2642 10090 15775 19490 2704 -773 -69 6280
12114F280j0998l140k416j763n731J0056J4915L398m934m947K428L644l054j0046
$$ 6280 -4718 -7858 -10274 -12037 -17768 -7712 7203 10601 5667 720 3148 6792 3738 -6308
12100f308j0485J3707J4284O679J976o862o136o091j0710j844J5574R209m395
$$ -6308 -16793 -3086 11198 17877 19853 12991 6855 764 -9946 -11790 3784 12993 8598
12087H598j1188J3796O02N1J515j0778r724M703j3218p082K517J1280O470M769
$$ 8598 -2590 11206 11808 11859 13374 2596 -7128 -2425 -15643 -22725 -20208 -8928 -2458 2311
12073B311r004k878r634p60R843J008N30n580J567j0155n273L103J2853J5492
$$ 2311 -6693 -9571 -19205 -19965 -10122 -9114 -8584 -14164 -12597 -22752 -28025 -24922 -12069 3423
12059C423M351q153j915j3806k358J5681o085J326J1117J5192j0605M535k69p730
$$ 3423 7774 -379 -2294 -16100 -18458 -2777 -8862 -7536 3581 18773 8168 12703 12434 4704
12045D704M959O174K171L738j744n826m849n241N467J8451j0017k1544q312P72
$$ 4704 9663 15837 18008 21746 20002 14176 9327 4086 9553 28004 17987 -3557 -11869 -11097
12031a1097N495j1920k631J1147j362K289M258j8681n00Q050R80J8599m418j1730
$$ -11097 -5602 -17522 -20153 -9006 -10368 -8079 -3821 -22502 -23002 -14952 -13972 4627 209 -11521
12017a1521j9743J6729k27J1711K460M745j069R140M945N715j2737j2916K6j371
$$ -11521 -31264 -14535 -14762 -3051 -591 4154 3085 12225 17170 22885 10148 -2768 -2742 -4113
12003d113O678J0014K011l274P71n825k866M118K84K445L976J717J2441K650j4713
$$ -4113 2565 12579 14590 11316 12087 6262 3396 7514 7798 10243 14219 15936 28377 31027 16314
11988A6314k926m885j0156p497N920N944r10l224j3021J5031J8749L923k977j5594
$$ 16314 13388 8503 -1653 -9150 -3230 2714 1804 -1420 -14441 590 19339 23262 20285 4691
11974D691N502Q606K578J028q280k77J982L421o353M811m681n243k636j1882j0065
$$ 4691 10193 18799 21377 22405 14125 13848 15830 19251 12898 17709 13028 7785 5149 -6733 -16798
11959a6798k01q506r90J9550J6536P346r001l832j484J0049P867P759j4682j4550
$$ -16798 -16999 -25505 -26495 -6945 9591 16937 7936 4104 2620 12669 20536 28295 13613 -937
11945i37k4877J329j151o943J934J9313l939j0736o367Q453K3958J7796P889k4866
$$ -937 -25814 -24485 -25636 -32579 -30645 -11332 -15271 -26007 -32374 -23921 37 17833 25722 856
11931H56p612R494J576q343k8J6146N537m583R74K009j3200p215o054k700l950
$$ 856 -6756 2738 4314 -4029 -4057 12089 17626 13043 14017 16026 2826 -4389 -10443 -13143 -17093
11916a7093K708K3382J3963j5864p672K30m251j1713r63J8886P021o799k905Q298
$$ -17093 -14385 8997 22960 7096 -576 -346 -4597 -16310 -17273 1613 8634 1835 -1070 7228
11902G228J0730K369j930r750L126p96j0831j985P234L923j1105j1565r83J5488
$$ 7228 17958 20327 18397 8647 11773 10977 146 -1839 5395 9318 -1787 -13352 -14335 1153
11888A153J3990q836q021M262O235o891p166l322J5097r000j796K76r151q633
$$ 1153 15143 6307 -1714 2548 8783 1892 -5274 -8596 6501 -2499 -4295 -4019 -13170 -21803
11874b1803k257r591P11O712N156R037l21O684J0148K769O570P541L04p290q052
$$ -21803 -24060 -33651 -32940 -26228 -21072 -12035 -12356 -5672 4476 7245 13815 21356 21660 14370 6318
11859F318k017r751R418o26j4684J369O057n236J4117j28L604M90j6025j83M483
$$ 6318 4301 -5450 3968 3342 -11342 -9973 -3916 -9152 4965 4837 8441 8931 -7094 -7277 -2794
11844b794j6462o433R327N46L005J1772L596j71l503q069k4906m591J9612R014
$$ -2794 -19256 -25689 -16362 -15816 -12811 -1039 2557 2386 -1117 -9186 -34092 -38683 -19071 -10057
11830a0057p100k53J444O95P309J6687J4347p498J374r393j3931Q608Q793N807
$$ -10057 -17157 -17410 -15966 -15271 -7962 8725 23072 15574 16948 7555 -6376 2232 11025 16832
11816A6832q318R084k078j3890p022L322k849P67n99J70j640o44j776p461K768
$$ 16832 8514 17598 15520 1630 -5392 -2070 -4919 -4152 -4751 -4581 -6221 -6865 -8641 -16102 -13334
11801a3334L082J1663J9646j3752r635J121k478j298P759J7790k370j093p638
$$ -13334 -10252 1411 21057 7305 -2330 -1209 -3687 -4985 2774 20564 18194 17101 9463
11788I463n88o477j0883n953L943K479k541N296j3275m179J4603N637l470m811
$$ 9463 8875 2398 -8485 -14438 -10495 -8016 -10557 -5261 -18536 -22715 -8112 -2475 -5945 -10756
11774a0756j6827J6937R8n033Q049r50j2569R395K8780K2j7808j5586k762l571
$$ -10756 -27583 -10646 -10548 -15581 -7532 -8482 -21051 -11656 17124 17146 -662 -16248 -19010 -22581
11760b2581j803k247m06R160m224M605P504R637n50l626Q419l504l347l60N050
$$ -22581 -24384 -26631 -27037 -17877 -22101 -17496 -9992 -355 -905 -4531 3888 384 -2963 -3323 1727
11745A727k57M68M503K6725L643n756K39j6223k5799J4808m261j1588k130R613
$$ 1727 1470 1938 6441 33166 36809 31053 31292 15069 -10730 4078 -183 -11771 -13901 -4288
11731d288l34r869k144M836J1241J3086L573o256j0260l987Q741r280l770N533
$$ -4288 -4622 -14491 -16635 -11799 -558 12528 16101 9845 -415 -4402 4339 -4941 -8711 -3178
11717c178O002J930l814r560r95q260l761O169r28P716M821K539J0209o004J3122
$$ -3178 2824 4754 940 -8620 -9615 -17875 -21636 -15467 -16395 -8679 -3858 -1319 8890 2886 16008
11702A6008j590j4659p969k734K682M124O039K567L086J220K68j3830p801j1063
$$ 16008 14418 -241 -8210 -10944 -8262 -4138 1901 4468 7554 8774 9042 -4788 -12589 -23652
11688b3652L250L089K3253O250P884j040j0559j1714m894M925N303p363l915Q663
$$ -23652 -20402 -17313 5940 12190 20074 19034 8475 -3239 -8133 -3208 2095 -5268 -9183 -520
11674e20j381J31R608j1778N940P799o436M973L834o992j4103j1258J3794J0831
$$ -520 -1901 -1770 7838 -3940 2000 9799 3363 8336 12170 5178 -8925 -20183 -6389 4442
11660D442l160j7372oP15O437J933m138O7N671J4892r486j0976j009N518J5021
$$ 4442 1282 -16090 -16096 -15381 -8944 -7011 -11149 -11082 -5411 9481 -5 -10981 -11990 -6472 8549
11645H549N186k02J140r941L404m967j078R28N391j300K17m32j5363q653p397
$$ 8549 13735 13533 14673 4732 8136 3169 2091 3019 8410 7110 7327 6895 -8468 -17121 -24518
11630b4518M763N018O20M218Q473K530J5992J0991p58m295j7534m417J6139K569
$$ -24518 -19755 -14737 -14117 -9899 -1426 1104 17096 28087 27329 23034 5500 1083 17222 19791
11616A9791M596j7054k0370p951l414J5073J2854M261j0470j6227r562O842J1755
$$ 19791 24387 7333 -13037 -20988 -24402 -9329 3525 7786 -2684 -18911 -28473 -21631 -9876
11603i876J5098M074p527j874L292n346J2532n126M806J0056l782j6908R622N556
$$ -9876 5222 9296 1769 -105 3187 -2159 10373 5247 10053 20109 16327 -581 9041 14597
11589A4597k495j8063k471M77m737k289N98L137m229R866J4584J6350O17j7767
$$ 14597 12102 -5961 -8432 -7955 -12692 -14981 -14383 -11246 -15475 -5609 8975 25325 25942 8175
11575H175j6837M822J2818L734K308l159m816O207M60N206M2j1262j843n008M592
$$ 8175 -8662 -3840 8978 12712 15020 11861 7045 13252 13712 18918 18960 7698 5855 847 5439
11560E439k088M452Q395j0828j3481J7830J4869r062j7175j6238r065L135J6905
$$ 5439 3351 7803 16198 5370 -8111 9719 24588 15526 -1649 -17887 -26952 -23817 -6912
11547f912J9702j037L205P837m125j0093n551o210l503j2798k813P401n011j5637
$$ -6912 12790 11753 14958 22795 18670 8577 3026 -3184 -6687 -19485 -22298 -14897 -19908 -35545
11533c5545p462J1888J8616L824K741N166j5335j358J8672K796q683L916l900
$$ -35545 -43007 -31119 -12503 -8679 -5938 -772 -16107 -17465 1207 4003 -4680 -764 -4664
11520d664M737O315q51m290j143J9226p555k8783p089P028J3261m986J3542K821
$$ -4664 73 6388 5537 1247 104 19330 11775 -17008 -24097 -17069 -3808 -8794 4748 7569
11506G569q579l591p204j354J1024O894P082n186q408k806l572J2917L389k072
$$ 7569 -1010 -4601 -11805 -13159 -2135 4759 11841 6655 -1753 -4559 -8131 4786 8175 6103
11492F103j0019j871m983j5039j3698J133J7263L330J4728J5191p57O699m153
$$ 6103 -3916 -5787 -10770 -25809 -39507 -38374 -21111 -17781 -3053 12138 11381 18080 13927
11479A3927j6886l510O227n110k28L284O259r052j8464n247J2198J3694J6320
$$ 13927 -2959 -6469 -242 -5352 -5580 -2296 3963 -5089 -23553 -28800 -16602 -2908 13412
11466A3412L520j0844j8819k1456j5956j963J0090J9389J4906L086m508q328J4654
$$ 13412 16932 6088 -12731 -34187 -50143 -52106 -42016 -22627 -7721 -4635 -9143 -17471 -2817
11453b817Q324P093O456j0j0055n717K330J0328J173p055L726J090n046J1906
$$ -2817 5507 12600 19056 19046 8991 3274 5604 15932 17105 10050 13776 14866 9820 21726
11439B1726L491n766L712l551r211j5698j2560O329N708M066K018j1491K133r23
$$ 21726 25217 19451 23163 19612 10401 -5297 -17857 -11528 -5820 -1754 264 -11227 -9094 -10017
11425a0017O56m696j5695j1825K561J1380p44J4353K0207J0960q848j7617j246
$$ -10017 -9361 -14057 -29752 -41577 -39016 -27636 -28380 -14027 6180 17140 8292 -9325 -10571
11412a0571J2016p158Q547N763j189O899o022p549n924J797K2379O274j1496j1977
$$ -10571 1445 -5713 2834 8597 7408 14307 8285 736 -5188 -3391 18988 25262 13766 1789
11398A789j0170L72P726j5480j7230j1439J1035J6173M062j1107M787K2259J761
$$ 1789 -8381 -8009 -283 -15763 -32993 -44432 -33397 -17224 -13162 -24269 -19482 2777 4538
11385D538o384l772M413n29o239O364p444N930q339n082Q233O622Q23j1380j8909
$$ 4538 -1846 -5618 -1205 -1734 -7973 -1609 -9053 -3123 -11462 -16544 -8311 -1689 -866 -12246 -31155
11370c1155K174J2971J4519Q986k379R33M953n112L976J6457L472j0245k9300
$$ -31155 -28981 -16010 -1491 7495 5116 6049 11002 5890 9866 26323 29795 19550 -9750
11357i750Q53L86p313J805J2770N791J485l688j3613j2817J7373J095K148N901
$$ -9750 -8897 -8511 -15824 -14019 -1249 4542 6027 2339 -11274 -24091 -6718 -5623 -3475 2426
11343B426O383J903j5243j4559p850N973J0148J8264l389r028k275J8562K589
$$ 2426 8809 10712 -4531 -19090 -26940 -20967 -10819 7445 4056 -4972 -7247 11315 13904
11330A3904p80j1179o004J568J5524J0883p9O13r252k865r628j169o15j8844K730
$$ 13904 13124 1945 -4059 -2491 13033 23916 23837 24450 15198 12333 2705 1536 921 -17923 -15193
11315a5193M311K116n47l645n2j0030R52O320J2148o787n601L246J6563l493M732
$$ -15193 -10882 -8766 -9313 -12958 -13010 -23040 -22088 -15768 -3620 -10407 -16008 -12762 3801 308 5040
11300E040p597j2863j0725r659k36O749J3543J20l65K841R885L396j9322j4250
$$ 5040 -2557 -15420 -26145 -35804 -36040 -29291 -15748 -15628 -15993 -13152 -3267 129 -19193 -33443
11286c3443N567R866J1028J7358o426j2501R38P59m8j6951j151K646M0K951J2745
$$ -33443 -27876 -18010 -6982 10376 3950 -8551 -7613 -6854 -6902 -23853 -25004 -22358 -22318 -19367 -6622
11271f622J2847j4421r365l382j1305o373J3357J7629p597m512J5524O166j5197
$$ -6622 6225 -8196 -17561 -20943 -32248 -38621 -25264 -7635 -15232 -19744 -4220 1946 -13251
11258a3251r151N21R180j8360n860J1567L2044J4127K451r626j8037j1558o991
$$ -13251 -22402 -21881 -12701 -31061 -36921 -25354 6690 20817 23268 13642 -4395 -15953 -22944
11245b2944o799J0844j188R937P807l589j890m171j1466J0743J558m207j924N735
$$ -22944 -29743 -18899 -20087 -10150 -2343 -5932 -7822 -11993 -23459 -12716 -11158 -15365 -17289 -11554
11231a1554k643J1589L712l376l126n690n160j0839P272R720K831n677n867J0053
$$ -11554 -14197 -2608 1104 -2272 -5398 -11088 -16248 -27087 -19815 -10095 -7264 -12941 -18808 -8755
11217h755j904k045M256N496J825N738k113j5188q926J6852K224K966K046k993
$$ -8755 -10659 -12704 -8448 -2952 -1127 4611 2498 -12690 -21616 -4764 -2540 426 2472 -521
11203e21N773Q508j7456J5786M36J65l108j7540J1490R391o011j443M790J515
$$ -521 5252 13760 -3696 12090 12526 12691 9583 -7957 3533 12924 6913 5470 10260 11775
11189A1775L205k207L528j3760J120J681k0359J975P218K319J8836N040j0887
$$ 11775 14980 12773 16301 2541 3661 5342 -15017 -13042 -5824 -3505 15331 20371 9484
11176I484r739n048l744p343m743J743J7721R926j57k7415j4367Q06N729m535
$$ 9484 -255 -5303 -9047 -16390 -21133 -19390 -1669 8257 8100 -19315 -33682 -32876 -27147 -31682
11162c1682J0804K3684J6747L312j0213r80j7616l498O449M241l57r750r770K908
$$ -31682 -20878 2806 19553 22865 12652 11672 -5944 -9442 -2993 1248 891 -8859 -18629 -15721
11148a5721O872Q614J6063J7128M476j0124o042n609q082p64n903m636J4293N672
$$ -15721 -8849 -235 15828 32956 37432 27308 21266 15657 7575 6811 908 -3728 10565 16237
11134A6237j20o648J2760J716p916n123j1926n168Q767j928m188j6358N94J6683
$$ 16237 16117 9469 22229 23945 16029 10906 -1020 -6188 2579 651 -3537 -19895 -19301 -2618
11120b618N845l671m007j2752M679Q37N528J319K140k686j0730R404J6780J5789
$$ -2618 3227 -444 -4451 -17203 -12524 -11687 -6159 -4840 -2700 -5386 -16116 -6712 10068 25857
11106B5857O64r695n206q920j3813n850m94J1025Q44n631J5472P565K2R191J3053
$$ 25857 26521 16826 11620 2700 -11113 -16963 -17457 -6432 -5588 -11219 4253 11818 11840 21031 34084
11091C4084j0194j6703L445j167j7261q979N100N727J5624P815j0121p768J45
$$ 34084 23890 7187 10632 9465 -7796 -16775 -11675 -5948 9676 17491 7370 -398 -253
11078b53O359Q028J752N387o263j5787n649R082J1885n71o987j1573j5239R307
$$ -253 6106 14134 15886 21273 15010 -777 -6426 2656 14541 13970 6983 -4590 -19829 -10522
11064a0522K572k231P397n621j225J3056P631k3103m347M764R350J2018k270m761
$$ -10522 -7950 -10181 -2784 -8405 -9630 3426 11057 -12046 -16393 -11629 -2279 9739 7469 2708
11050B708J3075J3694l175n632N54j8297k1632M768J8325P128J870j1974l634
$$ 2708 15783 29477 26302 20670 21224 2927 -18705 -13937 4388 11516 13386 1412 -2222
11037b222j351N879k709q592Q966L325q35L665Q112r040q014l813j3721L648M120
$$ -2222 -3573 2306 -403 -8995 -29 3296 2461 6126 14238 5198 -2816 -6629 -20350 -16702 -12582
11022a2582q115j588K1210P899p137j6084J0735n792K655K648j3775r08J3602
$$ -12582 -20697 -22285 -1075 6824 -313 -16397 -5662 -11454 -8799 -6151 -19926 -20834 -7232
11009g232L092J9625O015K869o798p780r910j434n337N084J372k314o367o35J362
$$ -7232 -4140 15485 21500 24369 17571 9791 -119 -1553 -6890 -1806 -434 -2748 -9115 -9750 -8388
10994h388k47l796j2089P546J6252q431j039N311P708m432m095n924q871J0968
$$ -8388 -8635 -12431 -24520 -16974 -722 -9153 -10192 -4881 2827 -1605 -5700 -11624 -20495 -9527
10980i527J5334O846k50j6541j0789J2523J5172J1216k897O16J4973j6007k1951
$$ -9527 5807 12653 12403 -4138 -14927 -2404 12768 23984 21087 21703 36676 20669 -1282
10967a282j0149J269N423J173J4918K480j2522j1373J51J187J6123J575N270M601
$$ -1282 -11431 -10162 -4739 -3566 11352 13832 1310 -10063 -9912 -8725 7398 8973 14243 18844
10953A8844L51q49m293k3394k2192l808Q390Q324R788P611j530m672J5779o214
$$ 18844 19195 18346 14053 -9341 -31533 -35341 -26951 -18627 -8839 -1228 -2758 -7430 8349 2135
10939B135j0131j800n731j529k145R302J8376J838O049p044p288O049R929j2256
$$ 2135 -7996 -9796 -15527 -17056 -19201 -9899 8477 10315 16364 9320 2032 8081 18010 5754
10925E754j3797n362j1396j0248J149Q918K2061M654J4383n131J1357m606j1328
$$ 5754 -8043 -13405 -24801 -35049 -33900 -24982 -2921 1733 16116 10985 22342 17736 6408
10912F408M928R680o863r410N576N206p535m358J8461J1306m735o360N225o117
$$ 6408 11336 21016 14153 4743 10319 15525 7990 3632 22093 33399 28664 22304 27529 21412
10898B1412j7931q056K048Q525K074O92k93p900k907J575L800J950j6985n66J4994
$$ 21412 3481 -4575 -2527 5998 8072 8764 8471 571 -2336 -761 3039 4989 -11996 -12562 2432
10883B432k030m137J7000R022N751k88j0173q69j4978j030p972k862M4n73k338
$$ 2432 402 -3735 13265 22287 28038 27750 17577 16708 1730 700 -7272 -10134 -10090 -10663 -13001
10868a3001J402J2335R394M588n934J293l604l984j570R362o918j807k41r235
$$ -13001 -11599 736 10130 14718 8784 10077 6473 2489 919 10281 3363 1556 1315 -7920
10854g920L484J6005j239J6n072n652j7207k906L113q02o446J2944O354k18P078
$$ -7920 -4436 11569 10330 10346 5274 -378 -17585 -20491 -17378 -18180 -24626 -11682 -5328 -5546 1532
10839A532k800O286K530p018K499p964N044m630l467J0480j1267L351J6882n675
$$ 1532 -1268 5018 7548 530 3029 -4935 109 -4521 -7988 2492 -8775 -5424 11458 5783
10825E783p847L061J882o533j5766n663L080j36j0796k36M910J1217J1718q980
$$ 5783 -2064 997 2879 -3654 -19420 -25083 -22003 -22139 -32935 -33171 -28261 -17044 -5326 -14306
10811a4306j2590O148J3962J3255R917k929l811r108o871K202P590R896L729j968
$$ -14306 -26896 -20748 -6786 6469 16386 13457 9646 538 -6333 -4131 3459 13355 17084 15116
10797A5116l51N700N020m136J0036j5097r627q412l901k752J667n818j078J4187
$$ 15116 14765 20465 25485 21349 31385 16288 6661 -1751 -5652 -8404 -6737 -12555 -13633 554
10783E54J3568n134J148n596k969l587l806K4654r09k3290j172m481J6618J3352
$$ 554 14122 8988 10136 4540 1571 -2016 -5822 18832 17923 -5367 -6539 -11020 5598 18950
10769A8950l337j3603Q693p307m255J6361M961J792K715n135j3246j1632J2574
$$ 18950 15613 2010 10703 3396 -859 15502 20463 22255 24970 19835 6589 -5043 7531
10756G531J2149m568j6218P026K1272L8251K4003n259k0818k5499k5105j2817
$$ 7531 19680 15112 -1106 5920 27192 65443 89446 84187 63369 37870 12765 -52
10744e2r949K195O790l971J2149J4115j9325j4380j719l698N367K439J9761J1651
$$ -52 -10001 -7806 -1016 -4987 7162 21277 1952 -12428 -14147 -17845 -12478 -10039 9722 21373
10730B1373j676l970L311M439k156j2707m451K483n966M763m122K584J104K437
$$ 21373 19697 15727 19038 23477 21321 8614 4163 6646 680 5443 1321 3905 5009 7446
10716G446J1062K0043n886l0116l015l892n394Q907P251n943r83Q52Q044L498
$$ 7446 18508 38551 32665 2549 -466 -4358 -9752 -845 6406 463 -520 332 8376 11874
10702A1874J2683j7753j8519O675l687N6N824J4003j113j8794p80j788q433J3820
$$ 11874 24557 6804 -11715 -5040 -8727 -8671 -2847 11156 10043 -8751 -9531 -11319 -19752 -5932
10688e932J4289k037k616l583j3995o055J8937J9193m971j905L728m492K675M888
$$ -5932 8357 6320 3704 121 -13874 -19929 -992 18201 13230 11325 15053 10561 13236 18124
10674A8124J2372k69k2910j2246j3710r782O475O29J3874n199m543J4820J0044
$$ 18124 30496 30227 7317 -4929 -18639 -28421 -21946 -21317 -7443 -12642 -17185 -2365 7679
10661G679J5255j2732k1340n571J0223J1402P011n393j3721o117K109Q13J0532
$$ 7679 22934 10202 -11138 -16709 -6486 4916 11927 6534 -7187 -13304 -11195 -10382 150
10648A50J059q827R823q777o087J392o467j451R269M006J748N530J0391n658j189
$$ 150 1209 -7618 2205 -6572 -12659 -11267 -17734 -19185 -9916 -5910 -4162 1368 11759 6101 4912
10633D912m501m091n832m119O599O272J287L655M921j7193j4792J5689J488L392
$$ 4912 411 -3680 -9512 -13631 -7032 -760 527 4182 9103 -8090 -22882 -7193 -5705 -2313
10619b313k056M139m146L710J0447L912L768J328j1715m654L192O22j5237k272
$$ -2313 -4369 -230 -4376 -666 9781 13693 17461 18789 7074 2420 5612 6234 -9003 -11275
10605a1275J2574l009j2088r230J4831K4886m749k2893r968M874K127J1620O40
$$ -11275 1299 -1710 -13798 -23028 -8197 16689 11940 -10953 -20921 -16047 -13920 -2300 -1660
10592a660j0718J5628O745o601O98j6429J1346L473J3917q203m908n170j17J6063
$$ -1660 -12378 3250 9995 3394 4092 -12337 -991 2482 16399 8196 3288 -1882 -1999 14064
10578A4064n961K727m846Q479k1933k094R35K333R209k771N72k460P464L914R25
$$ 14064 8103 10830 5984 14463 -7470 -9564 -8629 -6296 2913 142 714 -1746 5718 9632 10557
10563A0557J402o102o735r846P033P595n032o85j3630m587P733R606j815j0091
$$ 10557 11959 5857 -878 -10724 -3691 3904 -1128 -1813 -15443 -20030 -12297 -2691 -4506 -14597
10549a4597m302N965J21q38O241M339r343j4051P738J842j4145k714j4411M559
$$ -14597 -18899 -12934 -12813 -13651 -7410 -3071 -12414 -26465 -18727 -16885 -31030 -33744 -48155 -43596
10535d3596J2460K4301J1047k302N687l125n852L853l546l008M90q587M043Q357
$$ -43596 -31136 -6835 4212 1910 7597 4472 -1380 2473 -1073 -4081 -3591 -12178 -8135 222
10521B22J120l505l382N768K0322k397k7329L068n537M851L007L0Q047P826j161
$$ 222 1342 -2163 -5545 223 20545 18148 -9181 -6113 -11650 -6799 -3792 -3762 4285 12111 10950
10506A0950n430k3793o557J2535M261K093P259M466M791N599j5063j2377j4647
$$ 10950 5520 -18273 -24830 -12295 -8034 -5941 1318 5784 10575 16174 1111 -11266 -25913
10493b5913J2718N591n619j0518J1748J3696j5169M758J5979l628k0735j644l868
$$ -25913 -13195 -7604 -13223 -23741 -11993 1703 -13466 -8708 7271 3643 -17092 -18736 -22604
10480b2604j0910m717m849J3268J5387J2495J3559o073L572m67q298j7866R336
$$ -22604 -33514 -38231 -43080 -29812 -14425 -1930 11629 5556 9128 8661 363 -17503 -8167
10467h167J9168J2540J445r842j2777j1469q289N617M446J1841k052k04m706o616
$$ -8167 11001 23541 24986 15144 2367 -9102 -17391 -11774 -7328 4513 2461 2257 -2449 -9065
10453i065J8568j921q659P419j975o16K067j44m111M21j7365m298K6388Q197q170
$$ -9065 9503 7582 -1077 6342 4367 3751 5818 5674 1563 1984 -15381 -19679 6709 14906 6736
10438F736P516M800k209Q526j0069j6660K1445P349j5703m084P816j3856j2521
$$ 6736 14252 19052 16843 25369 15300 -1360 20085 27434 11731 7647 15463 1607 -10914
10425a0914O967Q119J697n602j01j6118m195O90j805K0248J3839j9286j647N080
$$ -10914 -3947 4172 5869 267 166 -15952 -20147 -19457 -21262 -1014 12825 -6461 -8108 -3028
10411c028P416q663j0141P109K058j699L549J5412N565j732n098J817N463J1298
$$ -3028 4388 -4275 -14416 -7307 -5249 -6948 -3399 12013 17578 15846 10748 12565 18028 29326
10397B9326m758r994r539L614L305j807J3367J0252J267j5176r517o516p71J684
$$ 29326 24568 14574 5035 8649 11954 10147 23514 33766 35033 19857 10340 3824 3053 4737
10383D737L825R543j0357p692k2091M995J1137O655J4034O017p752n933L333n042
$$ 4737 8562 18105 7748 56 -22035 -17040 -5903 752 14786 20803 13051 7118 10451 5409
10369E409L124J2240k73m120O358M600M479L746q023r131j7223o216O157O596
$$ 5409 8533 20773 20500 16380 22738 27338 31817 35563 27540 18409 1186 -5030 1127 7723
10355G723J099o879k486N361q464j6164M87K4108Q460m233n474m736o364m438
$$ 7723 8822 1943 -543 4818 -3646 -19810 -19323 4785 13245 9012 3538 -1198 -7562 -12000
10341a2000r222J601M593M929J3430Q300j0880p280R815k555l089Q698N750j9341
$$ -12000 -21222 -19621 -15028 -10099 3331 11631 751 -6529 3286 731 -2358 6340 12090 -7251
10327g251k227j3775L051K6188j778L370M993j0715n822K115O6O773K505j2062
$$ -7251 -9478 -23253 -20202 5986 4208 7578 12571 1856 -3966 -1851 -1785 4988 7493 -4569
10313d569K270R584j4780q572j2105J7823J2083j029J0081Q484J704O72j2267
$$ -4569 -2299 7285 -7495 -16067 -28172 -10349 1734 705 10786 19270 20974 21646 9379
10300I379j1631R161N910k775M879K010r297l140j9447L042M674N808k979j31
$$ 9379 -2252 6909 12819 10044 14923 16933 7636 4496 -14951 -11909 -7235 -1427 -4406 -4537
10286d537L277J4738J143p4q842R62P593k147N170k169K031j1470O515j4515J68
$$ -4537 -1260 13478 14621 14547 5705 6667 14260 12113 17283 15114 17145 5675 12190 -2325 -2157
10271b157j6509o329Q407J0769J0771J4443rR4J1950j5690j4792p423J7011P600
$$ -2157 -18666 -24995 -16588 -5819 4952 19395 19386 19480 31430 15740 948 -6475 10536 18136
10257A8136j6916j0655j8991L604M287N123M146R43M727R135m640j9047q591P100
$$ 18136 1220 -9435 -28426 -24822 -20535 -15412 -11266 -10323 -5596 3539 -1101 -20148 -28739 -21639
10243b1639M655J0192k240R25O547J2599m27j1980N750K2082q227k2004k3828
$$ -21639 -16984 -6792 -9032 -8107 -1560 11039 10612 -1368 4382 26464 18237 -3767 -27595
10230b7595J4398J3279J0204J3025M627l300j7032J944J6478Q55r59j7494j3229
$$ -27595 -13197 82 10286 23311 27938 24638 7606 9550 26028 26883 25924 8430 -4799
10217d799J3298N904m315Q888J5864N766j1664K127k892j3003j129r942l583N627
$$ -4799 8499 14403 10088 18976 34840 40606 28942 31069 28177 15174 14045 4103 520 6147
10203F147K789k308J3160p454K179j6337j0343J110q2k578k19o916N676K698p844
$$ 6147 8936 6628 19788 12334 14513 -1824 -12167 -11057 -11139 -13717 -13936 -20852 -15176 -12478 -20322
10188b0322j3417N390J7324Q473q081l873J759J3356L164L265K217K860L259j7769
$$ -20322 -33739 -28349 -11025 -2552 -10633 -14506 -12747 609 3773 7038 9255 12115 15374 -2395
10174b395j1758J2317j123N475J838N475j474o528j1794J90K0573k644j7593J530
$$ -2395 -14153 -1836 -2959 2516 4354 9829 8355 1827 -9967 -9777 10796 8152 -9441 -7911
10160g911m526m059J295M334p393q666K816R823J5077L47o418n03Q724M578J2307
$$ -7911 -12437 -16496 -15201 -10867 -18260 -26926 -24110 -14287 790 1137 -5281 -5784 2940 7518 19825
10145A9825J0578o247j7038j1830M79N664o984j3694l839J2904K323M561p25J803
$$ 19825 30403 24156 7118 -4712 -4233 1431 -5553 -19247 -23086 -10182 -7859 -3298 -4023 -2220
10131b220J563q631l399J284K1480L202k645K242L036r765o610M888J352m314
$$ -2220 -657 -9288 -12687 -11403 10077 13279 10634 12876 15912 6147 -463 4425 5777 1463
10117A463p605j8858p957P791K779R01l926Q867K119K946J7072L6j7615j5695
$$ 1463 -6142 -25000 -32957 -25166 -22387 -21486 -25412 -16545 -14426 -11480 5592 5628 -11987 -27682
10103b7682J3083J0121j5988P920J008q539p31L985J3312q807j624O887m632P330
$$ -27682 -14599 -4478 -20466 -12546 -11538 -20077 -20808 -16823 -3511 -12318 -13942 -7055 -11687 -4357
10089d357P422o672j0105j5523L843J6246J6177J377j2830O65k502l838P75K934
$$ -4357 3065 -3607 -13712 -29235 -25392 -9146 7031 8408 -4422 -3757 -6259 -10097 -9322 -6388
10075f388q21P502M55j6414j0195k750M971m72M295J1437J3165R23n516o289M43
$$ -6388 -7209 293 748 -15666 -25861 -28611 -23640 -24112 -19817 -8380 4785 5708 192 -6097 -5654
10060e654M188l617l575M666k606J0364M013p523p270j694l403M000K2300r21
$$ -5654 -1466 -5083 -8658 -3992 -6598 3766 7779 256 -7014 -8708 -12111 -8111 14189 13268
10046A3268r314k846k597J556j06n441k974j3963M411R818k980J029J2409n637
$$ 13268 3954 1108 -1489 67 -39 -5480 -8454 -22417 -18006 -8188 -11168 -10139 2270 -3367
10032c367Q714J3319O865o912r524O09Mm47M99m205q704R079J5089j5606m278
$$ -3367 5347 18666 25531 18619 9095 9704 9708 9261 9760 5555 -3149 5930 21019 5413 1135
10017A135Q476j742n219K986n175o668Q154p43o181K510J367M971Q862P335j2301
$$ 1135 9611 7869 2650 5636 461 -6207 1947 1204 -4977 -2467 -1100 3871 12733 20068 7767
10002G767j818j535r04O039k089k228Q335k056m730j6650j0628N07m681J7987
$$ 7767 5949 4414 3510 9549 7460 5232 13567 11511 6781 -9869 -20497 -19990 -24671 -6684
9988f684J1063j297j116k633k423J277K0524P310r514p921n848J0878J327M894
$$ -6684 4379 3082 1966 -667 -3090 -1813 18711 26021 16507 8586 2738 13616 14943 19837
9974A9837N352J5646R808k835m815k483J2867Q920O654J6692J8275K2136L3116
$$ 19837 25189 40835 50643 47808 42993 40510 53377 62297 68951 85643 103918 126054 159170
9961A59170O6964Q1534J34533K17503L43680L74260J15036j95037l22181l33437
$$ 159170 226134 307668 442201 659704 1003384 1377644 1492680 1297643 975462 642025
9951F42025k43291j35148q8489o0001k6230j2746j0854n558K968l509j5806j4592
$$ 642025 398734 263586 175097 115096 88866 76120 65266 59708 62676 59167 43361 28769
9939B8769K1721J2344j1138k2006q079m641l755p834k564k464r438O662J0167
$$ 28769 50490 62834 51696 29690 21611 16970 13215 5381 2817 353 -9085 -2423 7744
9926G744o746O006P867L412j2338r82R004O071K166m334j4869M522P179j478j4317
$$ 7744 998 7004 14871 18283 5945 4963 13967 20038 22204 17870 3001 7523 14702 13224 -1093
9911a093l159R25J6691q158K29J265N441L150M89p78K119m705J697r659J902j411
$$ -1093 -4252 -3327 13364 5206 5435 6700 12141 15291 15780 15002 17121 12416 14113 4454 6356 4945
9895D945J1183Q806k0978j1722O870o84l839r192m455K541J2351P377R854J777
$$ 4945 16128 24934 3956 -7766 -896 -1580 -5419 -14611 -19066 -16525 -4174 3203 13057 14834
9881A4834r702q831o02M643Q780l994j4818P667l17j0490J0728N377Q092Q230
$$ 14834 5132 -3699 -4301 342 9122 5128 -9690 -2023 -2340 -12830 -2102 3275 11367 19597
9867A9597j6904m604N325M073k248p520j104P329K984j249r825N869M421K505
$$ 19597 2693 -1911 3414 7487 5239 -2281 -3385 3944 6928 5679 -4146 1723 6144 8649
9853H649p966n335r88R80M608O56J3597n934q654j3710K198L796K718j1103K8207
$$ 8649 683 -4652 -5640 -4660 -52 604 14201 8267 -387 -14097 -11899 -8103 -5385 -16488 11719
9838A1719Q603j189j3877j5335l885J421J7767m884o194M470n782n293K028r665
$$ 11719 20322 19133 5256 -10079 -13964 -12543 5224 340 -5854 -1384 -7166 -12459 -10431 -20096
9824b0096J1192J2272N960R141l453r861j2489Q303J9986P356m695j4040j2030
$$ -20096 -8904 3368 9328 18469 15016 5155 -7334 969 20955 28311 23616 9576 -2454
9811b454l791o378j849M87q516K4807K301j6514k426N101O490N553j404l843K471
$$ -2454 -6245 -12623 -14472 -13985 -22501 2306 4607 -11907 -14333 -9232 -2742 2811 1407 -2436 35
9796C5n840L217K846r403p213r945J1114J7010K0604j865K058n562l692R017J61
$$ 35 -5805 -2588 258 -9145 -16358 -26303 -15189 1821 22425 20560 22618 17056 13364 22381 22542
9781B2542j3168k0686l426J6035J4605L874j1764n526n429k136K0731J499j1901
$$ 22542 9374 -11312 -14738 1297 15902 19776 8012 2486 -2943 -5079 15652 17151 5250
9768E250p778J1076J0578j5548N94r19o037N051K249K485k257J8530k737k5362
$$ 5250 -2528 8548 19126 3578 4172 3253 -2784 2267 4516 7001 4744 23274 20537 -4825
9754d825l986J0572M669j3112k932R374J677j316p114n840J0726Q104R576j1288
$$ -4825 -8811 1761 6430 -6682 -9614 -240 1437 121 -6993 -12833 -2107 5997 15573 4285
9740D285j0737L238j675j138N569O453o429j4328R34R962K0214k218o320j1292
$$ 4285 -6452 -3214 -4889 -6027 -458 5995 -434 -14762 -13828 -3866 16348 14130 7810 -3482
9726c482j7600p526l713M046J2032l103o661J6209J8884K24j3958j1789L385p30
$$ -3482 -21082 -28608 -32321 -28275 -16243 -19346 -26007 -9798 9086 9310 -4648 -16437 -13052 -13782
9712a3782j3110m613J0997J2901J2314M350K260k524j4348o806K582o814R560
$$ -13782 -26892 -31505 -20508 -7607 4707 9057 11317 8793 -5555 -12361 -9779 -16593 -7033
9699g033N200k3075o105o282J8594R147J6681P87j5746R557J0349j8390o202J3330
$$ -7033 -1833 -24908 -31013 -37295 -18701 -9554 7127 7914 -7832 1725 12074 -6316 -12518 812
9685H12j0348q109O430R078L349M578J068j814j928O826q348j0986L621q77o740
$$ 812 -9536 -17645 -11215 -2137 1212 5790 6858 5044 3116 9942 1594 -9392 -5771 -6648 -13388
9670a3388O520K851n343R892j676L080Q717l916J815L239p924O27j5863k0875
$$ -13388 -6868 -4017 -9360 532 -1144 1936 10653 6737 8552 11791 3867 4494 -11369 -32244
9656c2244R127J0161J1766K011J055p491r795N567J4889O362n510q38K865n845
$$ -32244 -23117 -12956 -1190 821 1876 -5615 -15410 -9843 5046 11408 5898 5060 7925 2080
9642B080Q703k365n175O612O226p801j1342l010k050R094n114N933Q683N119M97
$$ 2080 10783 8418 3243 9855 16081 8280 -3062 -6072 -8122 972 -4142 1791 10474 15593 16090
9627A6090m621M077M237n802m117q572j1274m823J1709J0958L504O981l413n7
$$ 16090 11469 15546 19783 13981 9864 1292 -9982 -14805 -3096 7862 11366 18347 14934 14877
9613A4877r671k426l966l417k399k278Q41l824r931k493K252J0048N141l698K372
$$ 14877 5206 2780 -1186 -4603 -7002 -9280 -8439 -12263 -22194 -24687 -22435 -12387 -7246 -10944 -8572
9598h572o85l24k876p67O56K749m921j0416q424j312J9188O222L663J080q313
$$ -8572 -9257 -9581 -12457 -13224 -12568 -9819 -14740 -25156 -33580 -34892 -15704 -9482 -5819 -4739 -13052
9583a3052r198P243n786j3605R916J4013J9140m254k211K537o146j1315m466m34
$$ -13052 -22250 -15007 -20793 -34398 -24482 -10469 8671 4417 2206 4743 -1403 -12718 -17184 -17618
9569a7618R733m194k884J1044j24k034l109q397l040j1907O507J6036N879K689
$$ -17618 -7885 -12079 -14963 -3919 -4043 -6077 -9186 -17583 -20623 -32530 -26023 -9987 -4108 -1419
9555a419N171N94M050P459p497j513k1918k124J7830K1939k0548j4650K555Q458
$$ -1419 3752 4346 8396 15855 8358 6845 -15073 -17197 633 22572 2024 -12626 -10071 -1613
9541a613N944R767p947o625q627n10K6l786N973n472J2735P439l805O934R08n208
$$ -1613 4331 14098 6151 -474 -9101 -9611 -9585 -13371 -7398 -12870 -135 7304 3499 10433 11341 6133
9525F133k0480o751Q79P316J2459k668l934J2857J2273J2j0764J4376K697J0143
$$ 6133 -14347 -21098 -20219 -12903 -444 -3112 -7046 5811 18084 18096 7332 21708 24405 34548
9511C4548k0615j6184p027M37j4156J352L234J2888J104k625N922l398J2356J479
$$ 34548 13933 -2251 -9278 -8841 -22997 -21645 -18411 -5523 -4419 -7044 -1122 -4520 7836 9315
9497I315M020k421J5096j0212k5333j5217K02J5177P843P642j577j6576J52J0944
$$ 9315 13335 10914 26010 15798 -9535 -24752 -24550 -9373 -1530 6112 4535 -12041 -11889 -945
9483i45O912N362j2096j0333K069R614m78n604P6N342r319o160l684r63l994J3973
$$ -945 5967 11329 -767 -11100 -9031 583 105 -5499 -5423 -81 -9400 -15560 -19244 -20207 -24201 -10228
9467a0228J4424K4825R933k8979k2458r76K45N308k475j3090j971O383L303j915
$$ -10228 4196 29021 38954 9975 -12483 -13459 -13214 -7906 -10381 -23471 -25442 -19059 -15756 -17671
9453a7671m605r7Q893P768q935O263K1288Q550j9395j5479J968J296j226O256
$$ -17671 -22276 -22373 -13480 -5712 -14647 -8384 12904 21454 2059 -13420 -11452 -10156 -11382 -5126
9439e126J0586N225k361o207M128k2455o391J1840J0349m465o827j607J0827P079
$$ -5126 5460 10685 8324 2117 6245 -16210 -22601 -10761 -412 -4877 -11704 -13311 -2484 4595
9425D595M316N167l200p956p695J0825N975j4194j1602J3504m056N250j1076j890
$$ 4595 8911 14078 10878 2922 -4773 6052 12027 -2167 -13769 -265 -4321 929 -10147 -12037
9411a2037k250J935P535L648n537p621k90J5085M970k11P761O27n100P4l315m02
$$ -12037 -14287 -12352 -4817 -1169 -6706 -14327 -14617 468 5438 5227 12988 13615 8515 8589 5274 4872
9395D872Q251k1418r863L1084J7714o063j7412p322M921n610r004J4800L902n865
$$ 4872 13123 -8295 -18158 12926 30640 24577 7165 -157 4764 -846 -9850 4950 8852 2987
9381B987j8169r454j017K0908j287j0716K941J2068j5437k361R687j8873K212
$$ 2987 -15182 -24636 -25653 -4745 -6032 -16748 -13807 -1739 -17176 -19537 -9850 -28723 -26511
9368b6511J4697J3948Q187K935m564L478k6068N541j898j0709j563K1210P444
$$ -26511 -11814 2134 10321 13256 8692 12170 -13898 -8357 -10255 -20964 -22527 -1317 6127
9355F127J58O35O322R58q714m545N95j024l800r49J0352L127M318p349j3616q294
$$ 6127 6285 6920 13242 14200 5486 941 1536 512 -3288 -4237 6115 9242 13560 6211 -7405 -15699
9339a5699j1009J234J5528P886o02N979J2130L215j5452r631n178o296R131J0014
$$ -15699 -26708 -25474 -9946 -2060 -2662 3317 15447 18662 3210 -6421 -11599 -17895 -8764 1250
9325A250J852J3268k840n877r660J9352n397o841j0819J593k957l506O099K782
$$ 1250 3102 16370 13530 7653 -2007 17345 11948 5107 -5712 -4119 -7076 -10582 -4483 -1701
9311a701j1047l826J6474p050J3718J489l083P62L452L378J0639K87j2170j0732
$$ -1701 -12748 -16574 -100 -7150 6568 8057 4974 5736 9188 12566 23205 23492 11322 590
9297E90J5558J3919m175j4859j887Q334q42k2774j4904R382J1236k481Q448K573
$$ 590 16148 30067 25892 11033 9146 17480 16638 -6136 -21040 -11658 -422 -2903 5545 8118
9283H118J0635n812k3272J3605j1922N165P05K68R027L486j2539k936R512P08
$$ 8118 18753 12941 -10331 3274 -8648 -3483 -2778 -2510 6517 10003 -2536 -5472 4040 4748
9269D748R012Q597p838o955j7398K028J4134K597K068p227o678R153K975r042
$$ 4748 13760 22357 14519 7564 -9834 -7806 6328 8925 10993 3766 -2912 6241 9216 174
9255A74k800Q243J9034N708o684k1654k0238L716Q349R599L52J1819J2144O989
$$ 174 -2626 5617 24651 30359 23675 2021 -18217 -14501 -6152 3447 3799 15618 27762 34751
9241C4751M006j190o070j5854j1817n643P814j6232j806R436J7707J9406N304
$$ 34751 38757 37567 31497 15643 3826 -1817 5997 -10235 -12041 -2605 15102 34508 39812
9228C9812j837l4m417j1815p501j586J773J2717o967L762k315K149J3212J0284
$$ 39812 37975 37941 33524 21709 14208 12622 14395 27112 20145 23907 21592 23741 36953 47237
9214D7237J6583j010Q017K0889o640j3529k651K5852L4352J4611J3442J6283J5135
$$ 47237 63820 62810 70827 91716 85076 71547 68896 94748 129100 143711 157153 173436 188571
9201A88571J8613K7619M3937L9497L9805O2614R3715J20061J60094K32518L35189
$$ 188571 207184 234803 278740 318237 358042 420656 514371 634432 794526 1027044 1362233
9190A362233N61553J046699J997267K958190J162976j469751k258226k076889
$$ 1362233 1923786 2970485 4967752 7925942 9088918 7619167 5360941 3284052
9182C284052j288503p19322l91794k28295j48320j05335q0949m7253l7259k4616
$$ 3284052 1995549 1276227 884433 656138 507818 402483 321534 274281 237022 212406
9172B12406m0887j7374o021k9185j4175l443J1385l356k1341j8106k1125r150
$$ 212406 171519 154145 148124 118939 104764 101321 112706 109350 88009 69903 48778 39628
9160C9628p362K806l932n622K622Q965J7785k860m988p97o179p971r017M001J8177
$$ 39628 32266 35072 31140 25518 28140 37105 54890 52030 47042 46245 40066 32095 23078 27079 45256
9145D5256M346R312m189j6433M35R36j2392j603L008J057n552Q618j7697j8867
$$ 45256 49602 58914 54725 38292 38727 39663 27271 25668 28676 29733 24181 32799 15102 -3765
9131c765p907R077L20P559l652k31J3646J3891L637j4894l090J834q512k2423
$$ -3765 -11672 -2595 -2275 5284 1632 1401 15047 28938 32575 17681 14591 16425 7913 -14510
9117a4510K364O661L939J5399J112J210L451o200n837o779J91p40O548P942j39
$$ -14510 -12146 -5485 -1546 13853 14965 16175 19626 13426 7589 810 1001 261 6809 14751 14612
9102A4612k1536j3819L068R431r342k846o20M73l158O042k020M222K1564O024
$$ 14612 -6924 -20743 -17675 -8244 -17586 -20432 -21052 -20579 -23737 -17695 -19715 -15493 6071 12095
9088A2095j0005O732N730l090J0378R762j3517o407j2146j3594P567l619j5448
$$ 12095 2090 8822 14552 11462 21840 31602 18085 11678 -468 -14062 -6495 -10114 -25562
9075b5562j774M273K074R50K208n364m471m024J580K0150J2605o658j0716J1361
$$ -25562 -27336 -23063 -20989 -20039 -17831 -23195 -27666 -31690 -30110 -9960 2645 -4013 -14729 -3368
9061c368J5797J8614L209j691r41j4770j0457J0208J808q093q373J0351M389r870
$$ -3368 12429 31043 34252 32561 31620 16850 6393 16601 18409 10316 1943 12294 16683 6813
9047F813k709P968J1861m283l617j300K935j0662M242j4119j4078Q114Q771j0826
$$ 6813 4104 12072 23933 19650 16033 14733 17668 7006 11248 -2871 -16949 -8835 -64 -10890
9033a0890K373P308m884m808o274l262P687K0445j639k270J1010N275m87j0615
$$ -10890 -8517 -1209 -6093 -10901 -17175 -20437 -12750 7695 6056 3786 14796 20071 19584 8969
9019H969q640j1926j4768n827O876J0000J4573J698n234N424J528J798o57n745
$$ 8969 329 -11597 -26365 -32192 -25316 -15316 -743 955 -4279 1145 2673 4471 3814 -1931
9005a931M602N400O797L222k050k122J369M414j6870o899n796q712R863O324j608
$$ -1931 2671 8071 14868 18090 16040 13918 15287 19701 2831 -4068 -9864 -18576 -8713 -2389 -3997
8990c997R395L549q147j4263K327J5473p804O106M139j1105N00O036Q892J0205
$$ -3997 5398 8947 800 -13463 -11136 4337 -3467 2639 6778 -4327 -3827 2209 11101 21306
8976B1306k247J622m922r490p052m865Q432R203j9073q972K95o39J6820R432l97
$$ 21306 19059 20681 15759 6269 -783 -5648 2784 11987 -7086 -16058 -15763 -16402 418 9850 9453
8961I453k3563P785J3216j1434n138M08L24j0970J2176J5059L856j2450j0165
$$ 9453 -14110 -6325 6891 -4543 -9681 -9273 -8949 -19919 -7743 7316 11172 -1278 -11443
8948a1443J544n677M795J6226J72m218j0791j0409j665J2439K6034m100n596n634
$$ -11443 -9899 -15576 -10781 5445 5617 1399 -9392 -19801 -21466 -9027 17007 12907 7311 1677
8934A677N8n522j7884r094R975M834J1324J0423P803R419L289j5457o407J438
$$ 1677 1735 -3787 -21671 -30765 -20790 -15956 -4632 5791 13594 23013 26302 10845 4438 5876
8920E876r187k888O686n491o014Q480J5906m330J333Q221j875P694J49l87j3773
$$ 5876 -3311 -6199 487 -5004 -11018 -2538 13368 9038 10371 18592 16717 24411 24560 24173 10400
8905A0400o790P578J2446j260j3695j5503M742J2324r54j817L50j0422Q574J330
$$ 10400 3610 11188 23634 22374 8679 -6824 -2082 10242 9288 7471 7821 -2601 5973 7303
8891G303j949R951m598n265Q944j4480n580R381N137j6016J4651J3064r202R013
$$ 7303 5354 15305 10707 5442 14386 -94 -5674 3707 8844 -7172 7479 20543 11341 20354
8877B0354L019j2964N388l920q752N214n831Q631O147o387l406K694l586L300
$$ 20354 23373 10409 15797 11877 3125 8339 2508 11139 17286 10899 7493 10187 6601 9901
8863I901j5179j5047p121J0410N931n798m340R567K957J0428P199P510l299n675
$$ 9901 -5278 -20325 -27446 -17036 -11105 -16903 -21243 -11676 -8719 1709 8908 16418 13119 7444
8849G444L756J5454j1405j982n833l274J6926J7661m633m795j9097L391N18j2216
$$ 7444 11200 26654 15249 13267 7434 4160 21086 38747 34114 29319 10222 13613 14131 1915
8835A915l922m300J8590J2136n22j2043k2782k945J6179n14m369N890M107K458
$$ 1915 -2007 -6307 12283 24419 23897 11854 -10928 -13873 2306 1792 -2577 3313 7420 9878
8821I878o235m795J17j5709m474R580j307j1553R899J4378M153P667j729p236
$$ 9878 3643 -1152 -1035 -16744 -21218 -11638 -12945 -24498 -14599 -221 3932 11599 9870 2634
8807B634q373l577J2514J2006Q966k111J695j1605j313k561l468O8p983m286K972
$$ 2634 -5739 -9316 3198 15204 24170 22059 23754 12149 10836 8275 4807 4875 -3108 -7394 -4422
8792d422L999k335j1325m765L046J3037K039J708p108k773M767r971l5N82M900
$$ -4422 -423 -2758 -14083 -18848 -15802 -2765 -726 982 -6126 -8899 -4132 -14103 -14138 -13556 -8656
8777h656j216L518O255p371k000M874r952K455P433M432n183n002l000k42P938
$$ -8656 -9872 -6354 -99 -7470 -9470 -4596 -14548 -12093 -4660 -228 -5411 -10413 -13413 -13655 -5717
8762e717J3493O779J707l453p289L125o074o661l633m123J75O230r685l185J8325
$$ -5717 7776 14555 16262 12809 5520 8645 2571 -4090 -7723 -11846 -11671 -5441 -15126 -18311 14
8747A4J7863j7933k431k539K927p86J1658P446j873Q48O241j0536M078j3875K182
$$ 14 17877 -56 -2487 -5026 -2099 -2885 8773 16219 14346 15194 21435 10899 14977 1102 3284
8732C284j2132M604J332K645J5464n08l382k4056n334J3064J9200j2148j5134
$$ 3284 -8848 -4244 -2912 -267 15197 14689 11307 -12749 -18083 -5019 14181 2033 -13101
8719a3101J8835k108m507P872Q65K454n997J814j0798N868J2399n076o823m67
$$ -13101 5734 3626 -881 6991 7856 10310 4313 6127 -4671 1197 13596 8520 1697 1230
8705A230J330p03P919M00o587p243m82K6713J9342k4574j7374m140k0872Q876
$$ 1230 2560 1857 9776 10176 3589 -3654 -4136 22577 41919 17345 -29 -4169 -25041 -16165
8691a6165Q909L980j3507M498Q638P577J0341m887l917j2228j440J539P516Q849
$$ -16165 -7256 -3276 -16783 -12285 -3647 3930 14271 9384 5467 -6761 -8201 -6662 854 9703
8677I703J5107o757L894Q63k055p022m082R026N189j6984j5510N62N605R743k559
$$ 9703 24810 18053 21947 22810 20755 13733 9651 18677 23866 6882 -8628 -8066 -2461 7282 4723
8662D723j0655J2561Q617J1383k619n493j554j1025j4537n568J5414J4086o677
$$ 4723 -5932 6629 15246 26629 24010 18517 16963 5938 -8599 -14167 1247 15333 8656
8649H656K610J5605q884l760r573j7684N573J3626j935L814J4797K234j409N75
$$ 8656 11266 26871 17987 14227 4654 -13030 -7457 6169 4234 8048 22845 25079 23670 24245
8635B4245j0378j4521K2380J9627M648J0893k1438k6040j1388k395L497O534O919
$$ 24245 13867 -654 21726 41353 46001 56894 35456 9416 -1972 -4367 -870 5664 12583
8622A2583J1978k841k2316p770k173o255N523Q674J4688n249K4065n592n400K504
$$ 12583 24561 21720 -596 -8366 -10539 -16794 -11271 -2597 12091 6842 30907 25315 19915 22419
8608B2419j011L96p832m100l756J6526K5081k72p952J1933M460K716J1588q64
$$ 22419 21408 21804 13972 9872 6116 22642 47723 47451 39499 51432 55892 58608 70196 69332
8594F9332q866k01j4716j0274J930L132l424p071J0472K260r628K039q069r033
$$ 69332 60466 60265 45549 35275 37205 40337 36913 29842 40314 42574 32946 34985 26916 17883
8580A7883L905n550n807J309J929n500J4660J797p538o44M28o502p219N50k646
$$ 17883 21788 16238 10431 11740 13669 8169 22829 24626 17088 16444 16872 10370 3151 3701 1055
8565A055M6O307j3167L523J494O068r225J7095k529j4208j57L023r8N582n190
$$ 1055 1101 7408 -5759 -2236 -742 5326 -3899 13196 10667 -3541 -3698 -675 -773 4809 -381
8550c81p394p051N429K598m438J124J8574O076J443j2498o977j1502l991n403
$$ -381 -7775 -14826 -9397 -6799 -11237 -10113 8461 14537 15980 3482 -3495 -14997 -18988 -24391
8536b4391j104J1647J541o417Q894R110R871j0898o10N698O82l508j7576J849
$$ -24391 -25495 -13848 -12307 -18724 -9830 -720 9151 -1747 -2357 3341 4023 515 -17061 -15212
8522a5212J2647r702j2350J407o276P433o047M110M67j546Q339J0670j4551J4964
$$ -15212 -2565 -12267 -24617 -23210 -29486 -22053 -28100 -23990 -23523 -25069 -16730 -6060 -20611 -5647
8508e647J8769k437j2141K206J2877N702o80j9827j1467J3708N741Q292M019j0818
$$ -5647 13122 10685 -1456 750 13627 19329 18649 -1178 -12645 1063 6804 15096 19115 8297
8494H297j2162K589K2153L053o531r771L093L940p885m118M908Q224j3551j3323
$$ 8297 -3865 -1276 20877 23930 17399 7628 10721 14661 6776 2658 7566 15790 2239 -11084
8480a1084n84j458m143l85M703Q903k260J916J146j3381j99Q824J1666K871n66
$$ -11084 -11668 -13126 -17269 -17654 -12951 -4048 -6308 -4392 -3246 -16627 -16826 -8002 3664 6535 5969
8465E969p605J30N853J237L825P005k50p116n767p627q20p688M721O631j4117
$$ 5969 -1636 -1506 4347 5584 9409 16414 16164 9048 3281 -4346 -5166 -12854 -8133 -1502 -15619
8450a5619j2600J3072J8805k024p413L654O927J8067r036j8217m20j402J0214
$$ -15619 -28219 -15147 3658 1634 -5779 -2125 4802 22869 13833 -4384 -4804 -6206 4008
8437D008R338p793j2002p661J1289K70j3691k919Q669p200M293K6008J0157m744
$$ 4008 13346 5553 -6449 -14110 -2821 -2551 -16242 -19161 -10492 -17692 -13399 12609 22766 18022
8423A8022j5230o564Pm622L032J0863l450j3482n257j9007P052J659J0894Q561
$$ 18022 2792 -3772 -3765 -8387 -5355 5508 2058 -11424 -16681 -35688 -28636 -26977 -16083 -7522
8409g522p495J272R645n981q572J4154p727O206J1031k238q573l806l022l172
$$ -7522 -15017 -13745 -4100 -10081 -18653 -4499 -12226 -6020 5011 2773 -5800 -9606 -12628 -15800
8395a5800K0457Q906j2307P005R884p61L660K500o437o168j8647q877R48J0195
$$ -15800 4657 13563 1256 8261 18145 17384 21044 23544 17107 10939 -7708 -16585 -15637 -5442
8381e442j1316j280J5559J4156Q943r991k2780p332J594R991J0871J3563J551
$$ -5442 -16758 -18038 -2479 11677 20620 10629 -12151 -19483 -17889 -7898 2973 16536 18087
8368A8087p633J360j2450p201P245K691K840J2497J7774j3685j3063j1116R661
$$ 18087 10454 11814 -636 -7837 -592 2099 4939 17436 35210 21525 8462 -2654 7007
8355G007R984n879j000q173m893n324J3928j166K750j3339N816L2858Q109j0753
$$ 7007 16991 11112 10112 1939 -2954 -8278 5650 4484 7234 -6105 -289 32569 40678 29925
8341B9925k2151n302K027j5342j911R28M897J463K534k452K253k939o687Q289
$$ 29925 7774 2472 4499 -10843 -12754 -11826 -6929 -5466 -2932 -5384 -3131 -6070 -12757 -4468
8327d468p208m299K7566k939p343k718L199K069j6432l792J3462K0168r537j4046
$$ -4468 -11676 -15975 11591 8652 1309 -1409 1790 3859 -12573 -16365 -2903 17265 7728 -6318
8313f318J0056J5156M663n43j6304o621N377P566q144j5876J2456N042o469q826
$$ -6318 3738 18894 23557 23014 6710 89 5466 13032 4888 -10988 1468 6510 41 -8785
8299h785j342J463R026O144P305m439K312j2040m391L316R152O001N183r613k3774
$$ -8785 -10127 -8664 362 6506 13811 9372 11684 -356 -4747 -1431 7721 13722 18905 9292 -14482
8284a4482l629J1458P207l445J0463o345r555M668P369n020l629R901J6480r574
$$ -14482 -18111 -6653 554 -2891 7572 1227 -8328 -3660 3709 -1311 -4940 4961 21441 11867
8270A1867j5583p752N60M977n034k79j981M935J727M180P781P917K725r660m576
$$ 11867 -3716 -11468 -10908 -5931 -10965 -11244 -13225 -8290 -6563 -2383 5398 13315 16040 6380 1804
8255A804q383K522R34p055j855J3256Q818l165j064j6836q1J4149J5214p313j5527
$$ 1804 -6579 -4057 -3123 -10178 -12033 1223 10041 6876 5812 -11024 -11105 3044 18258 10945 -4582
8240d582p46j7581j36Q286O048N518o864k827m085l297J018K695N130Q707j3147
$$ -4582 -5328 -22909 -23045 -14759 -8711 -3193 -10057 -12884 -16969 -20266 -19248 -16553 -11423 -2716 -15863
8225a5863O25J3381J6647J3520p868N371K344n606j8975j2759N017J85j5498p536
$$ -15863 -15238 -1857 14790 28310 20442 25813 28157 22551 3576 -9183 -4166 -3981 -19479 -27015
8211b7015J1866J5070J2578j676P486P99o526j166L363M948j8494r429J847J2525
$$ -27015 -15149 -79 12499 10823 18309 19108 12582 11416 14779 19727 1233 -8196 -6349 6176
8197F176J4629j0347j6448p418j1933j336R85k54k375Q552R490J5867Q849j1965
$$ 6176 20805 10458 -5990 -13408 -25341 -26677 -25692 -25946 -28321 -19769 -10279 5588 14437 2472
8183B472L013N495j2248L84j1723P465J3886m826N82n624r033p965J0095m885
$$ 2472 5485 10980 -1268 -884 -12607 -5142 8744 3918 4500 -1124 -10157 -18122 -8027 -12912
8169a2912R353j92q1J1296P719j3932j5518M204P889K851M751O362J8368K740
$$ -12912 -3559 -3751 -3832 7464 15183 1251 -14267 -10063 -2174 677 5428 11790 30158 32898
8155C2898j4243m245N490o930j7681p880O412l417J747J5281l985q990J7835J2314
$$ 32898 18655 14410 19900 12970 -4711 -12591 -6179 -9596 -7849 7432 3447 -5543 12292 24606
8141B4606M62o011j2888P601K897n796k20J099n963K784k3723k795j349j2167
$$ 24606 25068 19057 6169 13770 16667 10871 10651 11750 5787 8571 -15152 -17947 -19296 -31463
8127c1463J3088J4083j604J9965j1112j2248m563p969K774N050m367J3597Q382
$$ -31463 -18375 -4292 -5896 14069 2957 -9291 -13854 -21823 -19049 -13999 -18366 -4769 3613
8114C613q69p988l594J1161L54r574J990k459J0280r30p975q13Q70J1418l204
$$ 3613 2744 -5244 -8838 2323 2677 -6897 -4907 -7366 2914 1984 -5991 -6804 -5934 5484 2280
8099B280j2630j3394Q591J84p966J3495J2713O13j9665l538O304J9303J5491o219
$$ 2280 -10350 -23744 -15153 -14969 -22935 -9440 3273 3886 -15779 -19317 -13013 6290 21781 15562
8085A5562j1567M20j4070J0687J0714q483k5776Q174J3541J2000R514r950k5747
$$ 15562 3995 4415 -9655 1032 11746 3263 -22513 -14339 -798 11202 20716 10766 -14981
8072a4981l229J1747N478J9738M244r011n809K910P578m146L800n575M420l759
$$ -14981 -18210 -6463 -985 18753 22997 13986 8177 11087 18665 14519 18319 12744 17164 13405
8058A3405m502j2113j2321o937N546q225L284J4059K656K55r489P833J3144M942
$$ 13405 8903 -3210 -15531 -22468 -16922 -25147 -21863 -7804 -5148 -4893 -14382 -6549 6595 11537
8044A1537j49M04M570O773m855r001O574k779p214k052o468K257Q407M315J1824
$$ 11537 11388 11792 16362 23135 18280 9279 15853 13074 5860 3808 -2660 -403 8004 12319 24143
8029B4143p304n940M216n366j7485j402J803O19l695l247N373P13k142R55M768
$$ 24143 16839 10899 15115 9749 -7736 -9138 -7335 -6716 -10411 -13658 -8285 -7572 -9714 -8759 -3991
8014c991J6471J3281m810r895m646J4540k512o055R725J1070M879j2677O909J716
$$ -3991 12480 25761 20951 11056 6410 20950 18438 12383 22108 33178 38057 25380 32289 34005
8000C4005j6819o546k076k072M236J3610Q166j8340j4471k364j276R276J5958
$$ 34005 17186 10640 8564 6492 10728 24338 32504 14164 -307 -2671 -3947 5329 21287
7987B1287J188n005j5696p234N566R776o69p376k715L089J425k941N538m735M465
$$ 21287 22475 17470 1774 -5460 106 9882 9213 1837 -878 2211 3636 695 6233 1498 5963
7972E963m111l210N050O93j2359Q460J197j116l888j0362l146j187k682R037J2150
$$ 5963 1852 -1358 3692 4385 -7974 486 1683 567 -3321 -13683 -16829 -18016 -20698 -11661 489
7957D89%Q385N694O755k771j293r687j7703K899o603R07J8703J0357o192j3838
$$ 489 489 8874 14568 21323 18552 17259 7572 -10131 -7232 -13835 -12928 5775 16132 9940 -3898
7942c898O745J6614P812j7872k442K597N0k5774j2797K79O262P612n130J3715
$$ -3898 2847 19461 27273 9401 6959 9556 9606 -16168 -28965 -28686 -22424 -14812 -19942 -6227
7928f227J1784J8832k129j5216O117r878q686J151K769L812m374J1160K563q259
$$ -6227 5557 24389 22260 7044 13161 3283 -5403 -4252 -1483 2329 -2045 9115 11678 3419
7914C419p36n985L749M119P158l061O812o307j0082k640l10m727q39P285j0018
$$ 3419 2683 -3302 447 4566 11724 8663 15475 9168 -914 -3554 -3864 -8591 -9430 -2145 -12163
7899a2163K438R244m641M261N217P149M291j9591j2771N678R339P507Q292j1387
$$ -12163 -9725 -481 -5122 -861 4356 11505 15796 -3795 -16566 -10888 -1549 5958 14250 2863
7885B863o642k160N023L304J5508j9916r251N212P832k298J2505OO54J3625L036
$$ 2863 -3779 -5939 -916 2388 17896 -2020 -11271 -6059 1773 -525 11980 11986 12640 26265 29301
7870B9301m924j1876k1780j3603J4786o375k554N338o193J4099K0133j043J760
$$ 29301 24377 12501 -9279 -22882 -8096 -14471 -17025 -11687 -17880 -3781 16352 15309 17069
7857A7069j6004o314n901J0643K922l35p758N498L467j3648k0124m732J6472R144
$$ 17069 1065 -5249 -11150 -507 2415 2080 -5678 -180 3287 -10361 -30485 -35217 -18745 -9601
7843i601P247J9415j5068j7030j841p173K244J0094N654N891N291m17r048q558
$$ -9601 -2354 17061 1993 -15037 -16878 -24051 -21807 -11713 -6059 -168 5123 4706 -4342 -12900
7829a2900j33M894J901r478J2165J0818M929p729j0362j1259j0935l563Q842P062
$$ -12900 -13033 -8139 -6238 -15716 -3551 7267 12196 4467 -5895 -17154 -28089 -31652 -22810 -15748
7815a5748L572P653o573m954Q443J0303m940n682p017O14K532L91M914J492K362
$$ -15748 -12176 -4523 -11096 -16050 -7607 2696 -2244 -7926 -14943 -14329 -11797 -11406 -6492 -5000 -2638
7800b638J3111q524p253p422J4728J120j2284o36O056k37K0754P438n864j3191
$$ -2638 10473 1949 -5304 -12726 2002 3122 -9162 -9798 -3742 -3979 16775 24213 18349 5158
7786E158J3009n397l450r380o994O340J0144l305L45K54J8931P871n269q753p512
$$ 5158 18167 12770 9320 -60 -7054 -714 9430 6125 6470 6724 25655 33526 28257 19504 11992
7771A1992r788o428Q685j7836L5M953K974l758J205j0597l721J5858l737R55J6620
$$ 11992 2204 -4224 4461 -13375 -13340 -8387 -5413 -9171 -7966 -18563 -22284 -6426 -10163 -9208 7412
7756G412j040j718j590j4398j779J072l922J2161J5190N391K593q135j5687R264
$$ 7412 6372 4654 3064 -11334 -13113 -12041 -15963 -3802 11388 16779 19372 11237 -4450 4814
7742D814J390j408O413K746q272p178O800j0367j1436J445M200m28r818K298P140
$$ 4814 6204 4796 11209 13955 5683 -1495 5305 -5062 -16498 -15053 -10853 -11281 -21099 -18801 -11661
7727a1661J1385P330m942j773l355N757j989N562m874j4915o913J8421Q007L82
$$ -11661 -276 7054 2112 339 -3016 2741 752 6314 1440 -13475 -20388 -1967 6040 6422
7713F422J1442n706k9376j3738J802k484r434J6552J7523J8414k154q611k0744
$$ 6422 17864 12158 -17218 -30956 -29154 -31638 -41072 -24520 -6997 11417 9263 652 -20092
7700b0092l96J6581K0891J1385j2436j1213J408K000J770n902P927q30j3115J529
$$ -20092 -20488 -3907 16984 28369 15933 4720 6128 8128 9898 3996 11923 11093 -2022 -493
7686d93j509k163k943k321Q295J4562J100R99j6432K076Q929L17p735N377j5657
$$ -493 -2002 -4165 -7108 -9429 -1134 13428 14528 15527 -905 1171 10100 10417 2682 8059 -7598
7671g598j2001n329J3838k49J605l087M78J1585J2623j4848j5635k681J0623J2919
$$ -7598 -19599 -24928 -11090 -11339 -9734 -12821 -12343 -758 11865 -2983 -18618 -21299 -10676 2243
7657B243J030k487N867J474j4676k3730n208N748Q442J1819J0684M728K267o056
$$ 2243 3273 786 6653 8127 -6549 -30279 -35487 -29739 -21297 -9478 1206 5934 8201 2145
7643B145q179k431j2681Q362N168R484J4947J3882o240j9374j0832m415l248j639
$$ 2145 -6034 -8465 -21146 -12784 -7616 1868 16815 30697 24457 5083 -5749 -10164 -13412 -15051
7629a5051j6802J1106J5165o193p083Q536K1512L238j1034M070O652J3641L40
$$ -15051 -31853 -20747 -5582 -11775 -18858 -10322 11190 14428 3394 7464 14116 27757 28097
7616B8097l322j6956p892j955o432n433M861K895m239j2085O803Q410J1780J699
$$ 28097 24775 7819 -73 -2028 -8460 -13893 -9032 -6137 -10376 -22461 -15658 -7248 4532 6231
7602F231q899R41O641j2983j0043n968Q978m57k869P442L433k667O180J979J1163
$$ 6231 -2668 -1727 4914 -8069 -18112 -24080 -15102 -15559 -18428 -10986 -7553 -10220 -4040 -2061 9102
7587I102r62o203k421l077J553J0580R313n108p989l163j410m285j7024P130K4549
$$ 9102 8140 1937 -484 -3561 -2008 8572 17885 12777 4788 1625 215 -4070 -21094 -13964 10585
7572A0585M419P771J2274j1339j7219J845k284P800J4375j0013j4934J637n94
$$ 10585 15004 22775 35049 23710 6491 8336 6052 13852 28227 18214 3280 4917 4323
7559D323J011Q746k494J425Q69Q970N97L44n829l572j9119k417J1634j3607k550
$$ 4323 5334 14080 11586 13011 13880 22850 23447 23791 17962 14390 -4729 -7146 4488 -9119 -11669
7544a1669N359q172N762K335n441R981M877J465k215k275m17K052J956m572R506
$$ -11669 -6310 -14482 -8720 -6385 -11826 -1845 3032 4497 2282 7 -410 1642 3598 -974 8532
7529H532J0981m02k2149j6474m217M990J7069J2217R473j2366j1529J5300l263
$$ 8532 19513 19111 -3038 -19512 -23729 -18739 -1670 10547 20020 7654 -3875 11425 8162
7516H162r738j0961p122J4595J5432m143j3432M16J0643J8058m190k1139j6079
$$ 8162 -1576 -12537 -19659 -5064 10368 6225 -7207 -6791 3852 21910 17720 -3419 -19498
7503a9498K164N177q478J1238J3148N845j108L235o90J483j0458o574K493J54
$$ -19498 -17334 -12157 -20635 -9397 3751 9596 8488 11723 11033 12516 2058 -4516 -2023 -1869
7489a869L406J0936P357j070n685o63J2389J0957k5074j8043j2201q105n728J2124
$$ -1869 1537 12473 19830 18760 13075 12412 24801 35758 10684 -7359 -19560 -27665 -33393 -21269
7475b1269J3067K580l076J0181j880J174J3417l624j7294o217m626R136J3358
$$ -21269 -8202 -5622 -8698 1483 -397 777 14194 10570 -6724 -12941 -17567 -8431 4927
7462D927k143j1057R448K1049L001j7117J583K548p828k90O63l667l712o132n849
$$ 4927 2784 -8273 1175 22224 25225 8108 9691 12239 4411 4121 4784 1117 -2595 -8727 -14576
7447a4576O530P297J2900m561j4098K318L2452j4782k5529L227R42K112K936K351
$$ -14576 -8046 -749 12151 7590 -6508 -4190 28262 13480 -12049 -8822 -7880 -5768 -2832 -481
7433d81Q756k696j390N342l118p734j4451R352j119R544J1589k195j4382j0720
$$ -481 8275 5579 4189 9531 6413 -1321 -15772 -6420 -7539 2005 13594 11399 -2983 -13703
7419a3703j3198Q967Q058q792q862K450N046L435R643j126L41j3884K503J3605
$$ -13703 -26901 -17934 -9876 -18668 -27530 -25080 -20034 -16599 -6956 -8082 -7741 -21625 -19122 -5517
7405e517J2502J0034r125j4062j1665R169P437q58R184M038k2603j4124O467P734
$$ -5517 6985 17019 7894 -6168 -17833 -8664 -1227 -2085 7099 11137 -11466 -25590 -19123 -11389
7391a1389K271K359J0685m66j5963K681O174P766J516J5692Q605p446o063J967
$$ -11389 -9118 -6759 3926 3460 -12503 -9822 -3648 4118 5634 21326 29931 22485 16422 18389
7377A8389R61j2772k551P174j1325j2127P410J5319l287l681J7611j2567j7579
$$ 18389 19350 6578 4027 11201 -124 -12251 -4841 10478 7191 3510 21121 8554 -9025
7364i025N944R284R324Q813n109j8546O336J2377K132R76j2276j0964M06M940
$$ -9025 -3081 6203 15527 24340 19231 685 7021 19398 21530 22506 10230 -734 -328 4612
7350D612R46K694N369K0398j9885k4928j829R743K567j1625l28p275J823J3263
$$ 4612 5558 8252 13621 34019 14134 -10794 -12623 -2880 -313 -11938 -12266 -19541 -17718 -4455
7336d455N052j780k047j0454L668J0486J1498k237j1819m04J0188L67p215L469
$$ -4455 597 -1183 -3230 -13684 -10016 470 11968 9731 -2088 -2492 7696 8063 848 4317
7322D317P56j8336K680P644L278J2594N092j1106p248R478N801j4288j2075L19
$$ 4317 5073 -13263 -10583 -2939 339 12933 18025 6919 -329 9149 14950 662 -11413 -11094
7308a1094J2275m100j562r013r66O665m350J3997j5144m284o504K83J228J2559
$$ -11094 1181 -2919 -4481 -13494 -14460 -7795 -12145 1852 -13292 -17576 -24080 -23797 -22569 -10010
7294a0010M711n520p877l43j031RJ5337J3530o388m899J5202N890j2717o274J1549
$$ -10010 -5299 -10819 -18696 -19039 -20070 -20061 -4724 8806 2418 -2481 12721 18611 5894 -380 11169
7279A1169J46j2531k325J641m760k553p715o375Q331R252r660N680Q851O91j4196
$$ 11169 11315 -1216 -3541 -1900 -6660 -9213 -16928 -23303 -14972 -5720 -15380 -9700 -849 -158 -14354
7264a4354Q462J7071J0041j358n081j2590L001K95K580l801Q134j24j1731j6189
$$ -14354 -5892 11179 21220 19862 14781 2191 5192 5487 8067 4266 12400 12276 545 -15644
7250a5644k919J5068J014k3237J3222J2978j034n065l47M162P970r768m98j0872
$$ -15644 -18563 -3495 -2481 -25718 -12496 482 -552 -5617 -5964 -1802 6168 -3600 -4098 -14970
7236a4970k59J2315J4970k151n270L198J0859O469M276j9510J024n654j8286j1486
$$ -14970 -15229 -2914 12056 9905 4635 7833 18692 25161 29437 9927 10951 5297 -12989 -24475
7222b4475K388J7135q95j2377J5662O531l578J2444k135K193k152j583l961K475
$$ -24475 -22087 -4952 -5847 -18224 -2562 3969 391 12835 10700 12893 10741 9158 5197 7672
7208G672L771N418j1215j3067l92q50j1589M374l6j4211q482J2491J2828J0743
$$ 7672 11443 16861 5646 -7421 -7813 -8663 -20252 -15878 -15914 -30125 -38607 -26116 -13288 -2545
7194b545Q580J775j0362l769K279J0821m099J2625M179k323n979k569m595N122
$$ -2545 6035 7810 -2552 -6321 -4042 6779 2680 15305 19484 17161 11182 8613 4018 9140
7180I140n450n964J291o674l939Q843J171P949J582l497J961N198k910o643j0892
$$ 9140 3690 -2274 -983 -7657 -11596 -2753 -1582 6367 7949 4452 6413 11611 8701 2058 -8834
7165h834j580L92L966K0578O096j5121o028J3638j225q99M961q687j3823L802
$$ -8834 -10414 -10022 -6056 14522 20618 5497 -531 13107 11882 10983 15944 7257 -6566 -2764
7151b764K4001l270M832r908j4180j3496k820M165R261N147m713J108K102J847
$$ -2764 21237 17967 22799 12891 -1289 -14785 -17605 -13440 -4179 968 -3745 -2637 -535 1312
7137A312L035k931j5304o41O448k575J374m563n178o057P073K3106k763j7032
$$ 1312 4347 1416 -13888 -14529 -8081 -10656 -9282 -13845 -19023 -25080 -18007 5099 2336 -14696
7123a4696m061k458N300L692k788n362K0262O341o989k065J5909k592p618o851
$$ -14696 -18757 -21215 -15915 -12223 -15011 -20373 -111 6230 -759 -2824 13085 10493 2875 -3976
7109c976k336l510L700J179K548Q410J7916L87q462k795n908o843L508P736o496
$$ -3976 -6312 -9822 -6122 -4943 -2395 6015 23931 24318 15856 13061 7153 310 3818 11554 5058
7094E058K859j1874Q159J0615k198q318j3296j9702J5137O907P964P908j7937
$$ 5058 7917 -3957 4202 14817 12619 4301 -8995 -28697 -13560 -6653 1311 9219 -8718
7081h718J744O310p122L840N602J574l39j7349N84K18J472N868r581O446K929
$$ -8718 -6974 -664 -7786 -3946 1656 3230 2891 -14458 -13874 -13656 -12184 -6316 -15897 -9451 -6522
7066f522L762l9j035J279O355J4127k383K671l026k351K996M1j8824o419K1299
$$ -6522 -2760 -2799 -3834 -2555 3800 17927 15544 18215 15189 12838 15834 15875 -2949 -9368 11931
7051A1931P020k901n094n182q598M254p267n639J0421o48q056M274n413P863j590
$$ 11931 18951 16050 10956 5774 -2824 1430 -5837 -11476 -1055 -1703 -9759 -5485 -10898 -3035 -4625
7036d625J073K104m246j1017k569j084K509J0408Q211P539J0257r551j1273m800
$$ -4625 -3552 -1448 -5694 -16711 -19280 -20364 -17855 -7447 764 8303 18560 9009 -2264 -7064
7022g064n440M804J247o290r09R569k10K708J140K869l246q392r387p615N116
$$ -7064 -12504 -7700 -6453 -12743 -13652 -4083 -4293 -1585 -445 2424 -822 -9214 -18601 -26216 -21100
7007b1100J613j34P134M834M470N245k366n037p593o221j285n94J4610r58J7638
$$ -21100 -19487 -19621 -12487 -7653 -3183 2062 -304 -5341 -12934 -19155 -20440 -21034 -6424 -7382 10256
6992A0256R173k466p298j900l137k402J0105l485j7086k621J930j0114j051J0946
$$ 10256 19429 16963 9665 7765 4628 2226 12331 8846 -8240 -10861 -8931 -19045 -20096 -9150
6978i150J2673p950k23j565Q773j1586K708K0235j619k0135m67J8301n103k1603
$$ -9150 3523 -4427 -4650 -6215 2558 -9028 -6320 13915 12296 -7839 -8306 9995 4892 -16711
6964a6711j2558O125J0958J8113K0106q178K785n414K756j953l512m913l274J3436
$$ -16711 -29269 -23144 -12186 5927 26033 17855 20640 15226 17982 16029 12517 7604 4330 17766
6950A7766K518k762q383j6804J185m887J4570l011m154P647N362p260N426q74
$$ 17766 20284 17522 9139 -7665 -6480 -11367 3203 192 -3962 3685 9047 1787 7213 6339
6936F339j443Q187J1999p683j3727L418O918j979J030O599Q942j9989j7241N565
$$ 6339 4896 13083 25082 17399 3672 7090 14008 12029 13059 19658 28600 8611 -8630 -3065
6922c065j652J1950J2094p527p559j2708j901m216o032J0399L414P751O896j4586
$$ -3065 -4717 7233 19327 11800 4241 -8467 -10368 -14584 -20616 -10217 -6803 948 7844 -6742
6908f742N623Q445N656J2066N357j6364J192m158r125q209o482m238P454N9j4017
$$ -6742 -1119 7326 12982 25048 30405 14041 15233 11075 1950 -6259 -12741 -16979 -9525 -9466 -23483
6893b3483K563K096p892J939N751n422k091M584R779O22l638R829P929P098L894
$$ -23483 -20920 -18824 -26716 -24777 -19026 -24448 -26539 -21955 -12176 -11554 -15192 -5363 2566 9664 13558
6878A3558J708o004k4963j2008J2344J5525M188j4790p041p367k011k471O317
$$ 13558 15266 9262 -15701 -27709 -15365 160 4348 -10442 -17483 -24850 -26861 -29332 -23015
6865b3015R037j2112l258J1850K279j6099R240J3458j0257J3401K1992q975m812
$$ -23015 -13978 -26090 -29348 -17498 -15219 -31318 -22078 -8620 -18877 -5476 16516 7541 2729
6852B729p487j3814M092k411R643J8609m229p595r041j130j766m214M406P988
$$ 2729 -4758 -18572 -14480 -16891 -7248 11361 7132 -463 -9504 -10634 -12400 -16614 -12208 -4220
6838d220m76j1014J096o807o465L085m35n838Q757J1594J654N481K403l757M675
$$ -4220 -4696 -15710 -14614 -21421 -27886 -24801 -25236 -31074 -22317 -10723 -9069 -3588 -1185 -4942 -267
6823b67L413L404K204R182k907n162L877n93j0469n127L197P16j71p046O852N73
$$ -267 3146 6550 8754 17936 15029 9867 13744 13151 2682 -2445 752 1468 1297 -5749 1103 1676
6807A676L688o56k354j5288j0244p61M72L757J2417J484q909q560k120J604O857
$$ 1676 5364 4708 2354 -12934 -23178 -23939 -23467 -19710 -7293 -5809 -14718 -23278 -25398 -23794 -16937
6792a6937m942j4226q299J3769K1557k984o839j2097J5430J2174L881K184o170
$$ -16937 -21879 -36105 -44404 -30635 -9078 -12062 -18901 -30998 -15568 -3394 487 2671 -3499
6779c499j1123J4729J5388M705j5485j527j2624j0520J2479P674N949m306j4999
$$ -3499 -14622 107 15495 20200 4715 3188 -9436 -19956 -7477 197 6146 1840 -13159
6766a3159q343J3443J6244O094p990k4785n769J1925J0295N308n430Q133N862
$$ -13159 -21502 -8059 8185 14279 6289 -18496 -24265 -12340 -2045 3263 -2167 5966 11828
6753A1828j4307Jj470Q172L44N171O947n673k50o753p129j2967K2156M732j9453
$$ 11828 -2479 -2478 -3948 4224 4568 9739 16686 11013 10763 4010 -3119 -16086 6070 10802 -8651
$$ [...]
##END NTUPLES=NMR SPECTRUM
##END=
