##TITLE=Analysis number 314902
Compound Code cc 46706
Book Reference 445/76/4
Project Code adrs
Chemist Name laurenf
##JCAMPDX= 6.0         $$ Bruker NMR JCAMP-DX V2.0
##DATA TYPE= NMR SPECTRUM
##DATA CLASS= NTUPLES
##ORIGIN= Bruker BioSpin GmbH
##OWNER= NMR
$$ XWIN-NMR		Version 3.5
$$ Mon Oct 31 11:27:15 2005 GMT Standard Time (UT+0h)  MAYBRIDGE\NMR@NMR_250MHZ
##.OBSERVE FREQUENCY= 250.131544655141
##.OBSERVE NUCLEUS= ^1H
##.ACQUISITION MODE= SIMULTANEOUS (DQD)
##.ACQUISITION SCHEME= undefined
##.AVERAGES= 16
##.DIGITISER RES= 18
##SPECTROMETER/DATA SYSTEM= dpx250
##.PULSE SEQUENCE= zg30
##.SOLVENT NAME= CDCl3
##.SHIFT REFERENCE= (INTERNAL, CDCl3, 0, 16.4452)
##AUDIT TRAIL= $$ (NUMBER, WHEN, WHO, WHERE, WHAT)
$$ ##TITLE= Audit trail, XWIN-NMR		Version 3.5
$$ ##JCAMPDX= 5.01
$$ ##ORIGIN= Bruker BioSpin GmbH
$$ ##OWNER= NMR
$$ C:\u/data/dgb/nmr/ADRS/11610/pdata/1/auditp.txt
$$ ##AUDIT TRAIL=  $$ (NUMBER, WHEN, WHO, WHERE, WHAT)
(   1,<2005-10-31 11:26:51.69 +000>,<MAYBRIDGE\NMR>,<NMR_250MHZ>,
      <created by zg, POWCHK disabled, PULCHK disabled
       configuration hash MD5:
       62 19 C7 07 E1 42 D1 B7 37 6C 3D D0 77 39 F9 E6
       data hash MD5: 64K
       DF 71 C7 C0 9D A3 20 65 A2 ED 26 DB 6A C8 B6 96>)
(   2,<2005-10-31 11:27:02.82 +000>,<MAYBRIDGE\NMR>,<NMR_250MHZ>,
      <Start of raw data processing
       ef LB = 0.3 FT_mod = 6 PKNL = 1 SI = 32K 
       data hash MD5: 32K
       31 96 4A 62 E5 4E F8 4D EA E4 25 F9 37 ED 07 9A>)
(   3,<2005-10-31 11:27:04.66 +000>,<MAYBRIDGE\NMR>,<NMR_250MHZ>,
      <apk 
       data hash MD5: 32K
       43 2F 3E A2 27 05 A4 7F 59 79 33 C8 EF 0A 74 72>)
(   4,<2005-10-31 11:27:05.39 +000>,<MAYBRIDGE\NMR>,<NMR_250MHZ>,
      <abs ABSG = 5 
       data hash MD5: 32K
       05 A7 78 3C FE 69 3D BC E4 1A CB 36 6C 18 83 1A>)
$$ ##END=
$$ 
$$ hash MD5
$$ 4A A5 BC 21 42 4D DD 2F 67 61 73 01 B0 F5 0B DF
##$RELAX= 
##$RELAX= 
##$RELAX= 
##$RELAX= 
##$RELAX= 
##$RELAX= 
##$RELAX= 
$$ Bruker specific parameters
$$ --------------------------
##$DU= <C:\u>
##$EXPNO= 11610
##$NAME= <ADRS>
##$PROCNO= 1
##$TYPE= <nmr>
##$USER= <dgb>
##$AMP= (0..31)
100 100 100 100 100 100 100 100 100 100 100 100 100 100 100 100 100 100 
100 100 100 100 100 100 100 100 100 100 100 100 100 100 
##$AQSEQ= 0
##$AQ_mod= 3
##$AUNM= <au_zg>
##$AUTOPOS= <19 >
##$BF1= 250.13
##$BF2= 250.13
##$BF3= 250.13
##$BF4= 250.13
##$BF5= 500.13
##$BF6= 500.13
##$BF7= 500.13
##$BF8= 500.13
##$BYTORDA= 1
##$CFDGTYP= 0
##$CFRGTYP= 5
##$CHEMSTR= <none>
##$CNST= (0..31)
1 1 145 1 1 1 1 1 1 1 1 1 1 1 1 1 1 1 1 1 1 1 1 1 1 1 1 1 1 1 1 1 
##$CPDPRG= <>
##$CPDPRG1= <>
##$CPDPRG2= <>
##$CPDPRG3= <>
##$CPDPRG4= <mlev>
##$CPDPRG5= <mlev>
##$CPDPRG6= <mlev>
##$CPDPRG7= <mlev>
##$CPDPRG8= <mlev>
##$CPDPRGB= <>
##$CPDPRGT= <>
##$D= (0..31)
0 1 0 0 0 0 0 0 0 0.06 0 0 0 0 0 0 0.0002 0 0 0 0 0 0 0 0 0 0 0 0 0 0 
0 
##$DATE= 1130758011
##$DBL= (0..7)
120 120 120 120 120 120 120 120 
##$DBP= (0..7)
150 150 150 150 150 150 150 150 
##$DBP07= 0
##$DBPNAM0= <>
##$DBPNAM1= <>
$$ [...]
##$SUBNAM7= <"">
##$SUBNAM8= <"">
##$SUBNAM9= <"">
##$SW= 20.6930455092707
##$SWIBOX= (0..15)
0 0 3 0 0 0 0 0 0 0 0 0 0 0 0 0 
##$SW_h= 5175.983436853
##$TD= 65536
##$TD0= 1
##$TE= 295.16
##$TE2= 300
##$TE3= 300
##$TEG= 300
##$TL= (0..7)
0 120 120 120 120 120 120 120 
##$TP= (0..7)
150 150 150 150 150 150 150 150 
##$TP07= 0
##$TPNAME0= <>
##$TPNAME1= <>
##$TPNAME2= <>
##$TPNAME3= <>
##$TPNAME4= <>
##$TPNAME5= <>
##$TPNAME6= <>
##$TPNAME7= <>
##$TPOAL= (0..7)
0.5 0.5 0.5 0.5 0.5 0.5 0.5 0.5 
##$TPOFFS= (0..7)
0 0 0 0 0 0 0 0 
##$TUNHIN= 0
##$TUNHOUT= 0
##$TUNXOUT= 0
##$USERA1= <user>
##$USERA2= <user>
##$USERA3= <user>
##$USERA4= <user>
##$USERA5= <user>
##$V9= 5
##$VALIST= <valist>
##$VCLIST= <CCCCCCCCCCCCCCC>
##$VD= 0
##$VDLIST= <DDDDDDDDDDDDDDD>
##$VPLIST= <PPPPPPPPPPPPPPP>
##$VTLIST= <TTTTTTTTTTTTTTT>
##$WBST= 1024
##$WBSW= 4
##$XGAIN= (0..3)
0 0 0 0 
##$XL= 0
##$YL= 0
##$YMAX_a= 421632
##$YMIN_a= -465401
##$ZGOPTNS= <>
##$ZL1= 120
##$ZL2= 120
##$ZL3= 120
##$ZL4= 120
##$ABSF1= 16.44519
##$ABSF2= -4.247982
##$ABSG= 5
##$ABSL= 3
##$ALPHA= 0
##$AQORDER= 0
##$ASSFAC= 0
##$ASSFACI= 0
##$ASSFACX= 0
##$ASSWID= 0
##$AUNMP= <proc_1d>
##$AZFE= 0.1
##$AZFW= 0.1
##$BCFW= 0
##$BC_mod= 0
##$BYTORDP= 0
##$COROFFS= 0
##$CY= 12.5
##$DATMOD= 1
##$DC= 0
##$DFILT= <>
##$DTYPP= 0
##$F1P= 14.0000005364418
##$F2P= -0.99999901652339
##$FCOR= 0.5
##$FTSIZE= 32768
##$FT_mod= 6
##$GAMMA= 0
##$GB= 0
##$INTBC= 1
##$INTSCL= 1
##$ISEN= 128
##$LB= 0.3
##$LEV0= 0
##$LPBIN= 0
##$MAXI= 10000
##$MC2= 0
##$MEAN= 0
##$ME_mod= 0
##$MI= 0
##$NCOEF= 0
##$NC_proc= -3
##$NLEV= 6
##$NOISF1= 0
##$NOISF2= 0
##$NSP= 0
##$NTH_PI= 0
##$NZP= 0
##$OFFSET= 16.44519
##$PC= 1
##$PHC0= 93.3153
##$PHC1= -22.13147
##$PH_mod= 1
##$PKNL= yes
##$PPARMOD= 0
##$PSCAL= 4
##$PSIGN= 0
##$REVERSE= no
##$SF= 250.130019212049
##$SI= 32768
##$SIGF1= 0
##$SIGF2= 0
##$SINO= 400
##$SIOLD= 32768
##$SREGLST= <1H.CDCl3>
##$SSB= 0
##$STSI= 32768
##$STSR= 0
##$SW_p= 5175.98343685301
##$SYMM= 0
##$S_DEV= 0
##$TDeff= 65536
##$TDoff= 0
##$TI= <Analysis number 999999
Compound Code 99
Book Reference 9
Project Code 9>
##$TILT= no
##$TM1= 0
##$TM2= 0
##$TOPLEV= 0
##$USERP1= <user>
##$USERP2= <user>
##$USERP3= <user>
##$USERP4= <user>
##$USERP5= <user>
##$WDW= 1
##$XDIM= 32768
##$YMAX_p= 366533341
##$YMIN_p= -178795
$$ End of Bruker specific parameters
$$ ---------------------------------
##NTUPLES= NMR SPECTRUM
##VAR_NAME=  FREQUENCY,     SPECTRUM/REAL,   SPECTRUM/IMAG
##SYMBOL=    X,             R,               I
##VAR_TYPE=  INDEPENDENT,   DEPENDENT,       DEPENDENT
##VAR_FORM=  AFFN,          ASDF,            ASDF
##VAR_DIM=   32768,         32768,           32768
##UNITS=     HZ,            ARBITRARY UNITS, ARBITRARY UNITS
##FACTOR=    0.157963299565203, 1,           1
##FIRST=     4113.43579812354, 0,            0
##LAST=      -1062.54763872947, 0,           0
##MIN=       -1062.54763872947, -178795,     0
##MAX=       4113.43579812354, 366533341,    0
$$ Real data points
##PAGE= N=1
##DATA TABLE= (X++(R..R)), XYDATA
$$ [...]
22941A5627k0329n991j6357l2875L987k4944L6549M4323K2069J5789m0396j9327
22929b1875J849K9388J536l3121j6635j903j1460J0562O883R047l8382J679K9726
22916c2706J8141j8j9560M779J0948l9360k0930L2068j1236k2586j2511K749L0682
22903e9540J6563q757J8515L2998j3701m3982j9309k8058L5916O1071L917J7384
22891A3017P027N766J0266k7055k0624l545K3366M042R942p300K090J1621J7159
22878D5772O308o59j4615k1591k3167K0397L5935l1902l0974l0689L8092M442
22866b651j2657L7403M4126j697l7480m6206j3544k9030m447J2597l4925n077
22854i3588O39J2821j1982R228K1379K4455J8696J9087m825l783M1689m0288n4128
$$ plain form
22941 15627 -4702 -10693 -27050 -59925 -55938 -80882 -44333 -10 22059 37848 -2548 -21875
22929 -21875 -20026 9362 10898 -22223 -38858 -40761 -52221 -41659 -34776 -25729 -64111 -62432 -32706
22916 -32706 -14565 -14583 -34143 -29364 -18416 -57776 -78706 -46638 -57874 -80460 -92971 -90222 -59540
22903 -59540 -42977 -51734 -33219 -221 -13922 -57904 -77213 -105271 -69355 -8284 -4367 13017
22891 13017 20044 25810 36076 9021 -11603 -15148 8218 12260 22202 14902 16992 28613 45772
22878 45772 52080 51421 36806 15215 -7952 12445 48380 16478 -14496 -45185 -7093 -2651
22866 -2651 -15308 22095 66221 64524 27044 -19162 -32706 -61736 -66183 -53586 -88511 -93588
22854 -93588 -92949 -80128 -92110 -82882 -61503 -37048 -18352 735 -4090 -7873 33816 -6472 -60600
22841f0600j7555N1317K8413K5298K3976q395J6308O471K305j3923M046L0996
22829H8657K467o0004m2710n6458N39M7851K403L1196J7961J610n538j8642o453
22816B879j0406j1061j0887L480K1184J3737K0263l8810j2037L4459q497r469
22804e165L815l5384M441L1996p177l0881j122K1136L8423l1115n8756j8914n62
22791h9265L1482N7564Q227k106Q029k3453m269k1784j0354k0029K8235M1936
22779D213l6033O381L1474J3720l2407L425j5039L740j7588k3549O530O008N052
22766d4073P1886K0457l2712k3469j4078r390M0196q572K1152J382J740Q87K4358
22753D9764k002m4634m1651l1230j8742q896J8767N4442M0787j6985k7591k9347
$$ plain form
22841 -60600 -78155 -26838 1575 26873 50849 42454 58762 65233 67538 53615 57661 88657
22829 88657 91124 31120 -11590 -68048 -67509 -19658 -17255 13941 31902 33512 27974 9332 2879
22816 2879 -7527 -18588 -29475 -25995 -4811 8926 29189 -9621 -21658 12801 4304 -5165
22804 -5165 -1350 -36734 -32293 -297 -7474 -38355 -39477 -18341 20082 -11033 -69789 -88703 -89265
22791 -89265 -57783 -219 8008 5902 13931 -9522 -13791 -35575 -45929 -65958 -37723 4213
22779 4213 -31820 -25439 6035 19755 -12652 -9227 -24266 -20526 -38114 -61663 -55133 -49125 -44073
22766 -44073 27813 48270 15558 -7911 -21989 -31379 8817 245 21397 22779 24519 25406 49764
22753 49764 47762 3128 -38523 -69753 -88495 -97391 -78624 -24182 16605 -380 -27971 -57318
22741e7318r604L3893J8047K7245M100j7510k5361m6596K591K8005L7878j1122
22729a5752Q23J4437L5339J4515J1989k8560k6485k1624k0478K0894J5659K4065
22717B4822J3131k0008m0399l3231J7892K3974K0580J5433j2034o353k2625L0926
22705A2108r12n185m599K2499j4924k2247k2932q505N9645M0804k4952J9709J4733
22692F5242J2744j6604n923l199l0518j2032J2352k0111k9009l281J4903J8969
22680C533m1345J0078N557k9738m7750K0307N9099m163j8778l0848L6785L3945
22668c318M810j7962J2185K8572o288R751L0915q639Q929k1407l0270k8856j1901
22655c3479J6701J749m832R434J5340O845n330J4599n972k4023j9757k5048j000
$$ plain form
22741 -57318 -66922 -33029 -14982 12263 16363 -1147 -26508 -73104 -70513 -42508 -4630 -15752
22729 -15752 -14929 -492 34847 49362 61351 32791 6306 -15318 -35796 -14902 757 24822
22717 24822 37953 17945 -22454 -55685 -37793 -13819 6761 22194 10160 3807 -18818 12108
22705 12108 11196 6011 1412 23911 8987 -13260 -36192 -44697 14948 55752 30800 50509 65242
22692 65242 77986 61382 55459 52260 21742 9710 22062 1951 -27058 -30339 -15436 3533
22680 3533 -37812 -27734 -22177 -51915 -99665 -79358 -20259 -24422 -43200 -74048 -37263 -3318
22668 -3318 1492 -16470 -4285 24287 17999 27750 58665 50026 58955 37548 7278 -21578 -33479
22655 -33479 -16778 -15029 -19861 -10427 4913 11758 6428 21027 15055 -8968 -28725 -53773 -54773
22642e4773O025q612k920Q814O390K1427M6171N725j5332R723m0994m5151j1052
22629g4559R001N23K5253J3640L1246N140k3390j714l1407J4060Q117k2066P89
22616d5367R791j5983J7825K4332J184P290q651r606o989J0378m5037J2269J5661
22603c2903N0189J5389k7085m4374j3039j9950P49K1160J2241k8785L6195J0214
22591a9999j26L173j320R703M6271N2939J8943m974k3226m2268l4346j9230Q784
22578e676K1418P944m8449j8315j7005M7714M1384l2691n785L3646j2289m2483
22566c0587J7247L7693R435K4077k0372M4316m2753m7377Q324j972l6146l8008
22554g6123P630L7158J8108J5558O7641L429r775l7918k8445r032J7701M751N621
$$ plain form
22642 -54773 -48748 -57360 -60280 -51466 -45076 -23649 22522 28247 12915 22638 -18356 -63507 -74559
22629 -74559 -65558 -65035 -39782 -26142 5104 10244 -13146 -14860 -46267 -32207 -24090 -46156 -45367
22616 -45367 -35576 -51559 -33734 -9402 -8218 -928 -9579 -19185 -26174 -15796 -60833 -48564 -32903
22603 -32903 17286 32675 5590 -38784 -51823 -71773 -71024 -49864 -37623 -66408 -30213 -19999
22591 -19999 -20125 -16952 -18272 -8569 37702 90641 109584 104610 81384 39116 4770 -14460 -5676
22578 -5676 15742 23686 -24763 -43078 -60083 -12369 29015 -3676 -9461 24185 11896 -30587
22566 -30587 -13340 24353 33788 57865 37493 81809 39056 -8321 3 -1969 -38115 -76123
22554 -76123 -68493 -31335 -13227 2331 69972 73401 63626 25708 -2737 -11769 5932 10683 16304
22541A6304l5462j367K1417j3156l1305k1065J0375q628Q443o959P104N2547L7814
22528C6062l6268k9084j0963p305l783M8632l3818k7919N822L2739M6810K9876
22516E0801l9506n9219J4546J5357J8444k2632j8336J4753J022J3765l456j1731
22504b6192M717J7979k5816r33J7101j1732R676K1543L4824j1075k4769l7373
22492c2050q895K4895K8455k1351l2427L0040K6773m71L1303j9391P679j740k2219
22479A0601l6080L7733K1958J010n879q210J690j6178J6396L4354K7764k0270
22467F4889p2724k5517K6405J8950j0495J2695K2027J2014j166l7998R08K7932
22455C7920j0770O278p349J3046j5586j4160m3710j4150j4761j896N0871N7485
$$ plain form
22541 16304 -19158 -20525 892 -12264 -43569 -64634 -54259 -62887 -54444 -61403 -54299 -1752 36062
22528 36062 -206 -29290 -40253 -47558 -51341 -2709 -36527 -64446 -58624 -25885 20925 50801
22516 50801 11295 -47924 -33378 -18021 423 -22209 -40545 -25792 -24770 -11005 -14461 -26192
22504 -26192 -21475 -3496 -29312 -30245 -13144 -24876 -15200 6343 41167 30092 5323 -32050
22492 -32050 -40945 -16050 12405 -8946 -41373 -11333 15440 14969 46272 26881 34560 32820 10601
22479 10601 -25479 12254 34212 35222 29343 21133 22823 6645 23041 57395 85159 64889
22467 64889 -7835 -33352 -6947 12003 1508 14203 36230 48244 47078 9080 9988 37920
22455 37920 27150 33428 26079 39125 23539 9379 -34331 -48481 -63242 -65138 -14267 43218
22443D3218o025K1041J6658k1168o1679m8892O932J2874L7665O987K2629J6850
22431D7090j1748k2552m0556k5968P302L7279J9084L523j4590j0737J5463p333
22419c743J9695j3142Q70m110J4020R651M152l6414J3655r037q652K1320j1252
22406b987m448J6907L8005j7113j8172L7345k460j9015j2263j5191J5173k4483
22394h702M437L0301m2729M084P764J2438j3129k0002K7746k4868J5078K5174
22382A7592Q778L9018j2729J845o014K0181J0100k748j1967N333m831o0787j6192
22369a2421J9833l7725j3311j855M636N764J3903K5853K200P596R566k0933k3344
22356b0238J0946j9347L226j2775L9110K3779k9519J1679J0977j6331N993M3592
$$ plain form
22443 43218 37193 58234 74892 53724 -7955 -56847 -49915 -37041 624 7611 30240 47090
22431 47090 35342 12790 -27766 -53734 -46432 -9153 9931 13454 -1136 -11873 3590 -3743
22419 -3743 15952 2810 3680 -430 13590 23241 27393 -9021 4634 -4403 -13055 8265 -2987
22406 -2987 -7435 9472 47477 30364 12192 49537 47077 28062 15799 608 15781 -8702
22394 -8702 -4265 26036 -16693 -12609 -4845 7593 -5536 -25538 2208 -22660 -7582 17592
22382 17592 26370 65388 52659 54504 48490 68671 78771 76023 64056 69389 64558 3771 -12421
22369 -12421 7412 -30313 -43624 -45479 -40843 -35079 -21176 4677 6877 14473 24039 3106 -20238
22356 -20238 -9292 -28639 -25413 -38188 922 24701 -4818 6861 17838 1507 7500 51092
22344E1092K0216l6215m5344j6140l612K2749K3365L3427M550n3090j3552L2237
22332A9683K1153Q203J0234j8597l8660r706J6953K488j687k8904j9446Q080J8909
22319a1297j7589l4252N156J2456j5784J4J7172J9976N39J7712k5620O782M0103
22306A5368n607P06J3846J170k5506k713R104Q550J534l3290j9939j9734L0735
22293b5776K8381Q574J697J012K6810k9756q538K9020K1827k3885k7827J6426
22281A7965k5370j4964l328Q782J0699j1328J1830K4557J2594N674l1262k6264
22269b0415N980q287L5312j7938k2560K6548K1305n6253j0300m479n428M9194
22257g321M2494n3164m2402J2950K2583J1933L410l949J3023K90l541l1794j5670
$$ plain form
22344 51092 71308 35093 -10251 -26391 -30003 -7254 16111 49538 54088 998 -12554 19683
22332 19683 40836 49039 59273 40676 2016 -7690 9263 11751 10064 -18840 -38286 -30206 -11297
22319 -11297 -28886 -63138 -57982 -45526 -61310 -61296 -44124 -24148 -23609 -5897 -31517 -24735 15368
22306 15368 9761 10467 24313 25483 -23 -2736 6368 14918 16452 -16838 -36777 -56511 -25776
22293 -25776 2605 11179 12876 13888 40698 10942 2404 31424 53251 29366 1539 17965
22281 17965 -7405 -22369 -25697 -16915 -6216 -17544 -5714 18843 31437 37111 5849 -20415
22269 -20415 -14435 -22722 12590 -5348 -27908 -1360 19945 -36308 -46608 -51087 -56515 -7321
22257 -7321 35173 -17991 -60393 -47443 -24860 -12927 -9517 -13466 -443 -153 -3694 -35488 -51158
22244e1158J2178K6337k2974K3439K4708N271l618L4817k1823k5203N0742K2263
22232G4979k0252M868n396l3628m3512M683K9054k041n582l4162o0529j0164N5773
22219d5909J4570k5772J9760k1882L4147J2425j0406M3700J1954k8420k3021K006
22207a6848K9399j3413N416J5499J1910M142l7855j2825J8841j0521k1525j1947
22195c9727J4029K2227L0955N264m500j2216M474l2861j4919j5166K6952K1782
22183F294n040n995L676j3633l5618J3619O7369O282m8684k1431n284l7622K4240
22170e1827J2091K0512J881j3881P497J6652O262l7739m9214L3677Q307K4241
22158b1541o744j5294l5165j3467J6333K9293K4026J315R330k5538k3031K0401
$$ plain form
22244 -51158 -38980 -12643 -35617 -12178 12530 17801 14183 49000 27177 1974 52716 74979
22232 74979 54727 59595 54199 20571 -22941 -18258 10796 8755 3173 -30989 -91518 -101682 -45909
22219 -45909 -31339 -57111 -37351 -59233 -25086 -12661 -23067 20633 32587 4167 -18854 -16848
22207 -16848 12551 -862 4554 20053 31963 36105 -1750 -14575 4266 -6255 -27780 -39727
22195 -39727 -25698 -3471 27484 32748 28248 16032 20506 -12355 -27274 -42440 -15488 6294
22183 6294 1254 -4741 -1065 -14698 -50316 -36697 30672 36954 -11730 -33161 -38445 -76067 -51827
22170 -51827 -39736 -19224 -17343 -31224 -23727 -7075 -813 -38552 -87766 -54089 -45782 -21541
22158 -21541 -28285 -43579 -78744 -92211 -75878 -46585 -22559 -21244 -11914 -37452 -60483 -40082
22146d0082M0690K5150j2391l8114P681r013K5005k589l6021K2720M1283J304
22134B5623R346P756M2870J6864k3218p4773j1607j4276M353J1429j6613L724
22122a8522Q81O364j592J8532Q050m9832m797M0355k5213r498J1800J5301j6501
22109b4672j2731J6132k6316K7726N0420m427Q701q146J1129L551P984L1066j7039
22096F3378m7009k7532k5626k1489J9638k3414k5122M6605L0163j0352n623J3386
22084a2997N186j6665J3873N3840k7025j9261j2771j1663J9115J4928j775j0505
22072e720L777Q123q270J1229n2547M855M1521J4048k421l9366k5942K3591J8876
22059h246l9008K0874r808l185J737l537K8218J0199p719l542l8159j1184J0851
$$ plain form
22146 -40082 608 25758 13367 -24747 -17066 -26079 -1074 -3663 -39684 -16964 24319 25623
22134 25623 34969 42725 85595 102459 79241 4468 -7139 -21415 -17062 -5633 -22246 -18522
22122 -18522 -17641 -11277 -12869 5663 13713 -36119 -40916 -561 -25774 -35272 -23472 -8171 -24672
22109 -24672 -37403 -21271 -47587 -19861 30559 26132 34833 26687 37816 41367 49351 80417 63378
22096 63378 16369 -11163 -36789 -58278 -38640 -62054 -87176 -40571 -10408 -20760 -26383 -12997
22084 -12997 -7811 -24476 -10603 43237 16212 -3049 -15820 -27483 -8368 6560 4785 -5720
22072 -5720 -1943 6180 -2090 9139 -43408 -38553 2968 17016 14595 -24771 -50713 -27122 -8246
22059 -8246 -47254 -26380 -36188 -39373 -37636 -41173 -12955 -2756 -10475 -14017 -52176 -63360 -52509
22046e2509N551K4729k1142k4011j7106L7182K0138k083J6578L8620L153J5724
22034D4824j1690l7257m4681j1746J4345j6644J6429M2162K0009k6338K5015Q753
22022B3181k6966q924m192n264q651J9564k95Q237k8570m0832m952K646O396M2709
22008b5913J304J086O859l7472m1753l5581L8154K5640M050K8809M6409j4939
21996c347j3528M7524l046k3460J5032O77J5422M078R442O47o1209l2780Q427
21983c6121K3355j9629p470p616J7857M248K2718l3847R214M6344N141o38k5327
21970a771K389k2399m1022M600R875J391J2353m8503j613K7374L5877j4469k7720
21957f3638j8017P354M6719j178L0008Q199k5453J021Q467L7685j5637j9003K3401
$$ plain form
22046 -52509 -46958 -22229 -43371 -67382 -84488 -47306 -27168 -29251 -12673 25947 29100 44824
22034 44824 33134 -4123 -48804 -60550 -46205 -62849 -46420 -4258 15751 -10587 14428 23181
22022 23181 -3785 -12709 -16901 -22165 -30816 -11252 -11547 -3310 -31880 -72712 -77664 -75018 -68622 -25913
22008 -25913 -24609 -23523 -16664 -54136 -95889 -131470 -93316 -67676 -63626 -34817 11592 -3347
21996 -3347 -16875 30649 27603 4143 19175 19852 35274 39352 48794 49441 -11768 -44548 -36121
21983 -36121 -12766 -32395 -39865 -47481 -29624 -25376 -2658 -36505 -27291 19053 24194 23556 -1771
21970 -1771 618 -21781 -62803 -58203 -48328 -46937 -34584 -83087 -84700 -57326 -21449 -35918 -63638
21957 -63638 -81655 -74301 -27582 -28760 1248 9447 -16006 -14985 -6518 31167 15530 -3473 19928
21944A9928l2242Q187N637l4691N1047K5829j6274j6833m6769k9268J5943J1728
21932c7778J696k2667k7316p278K1613N7656Q254q117M6089L6783j8066l4206
21920A6663j2903K1305P86Q736M5844k5848n0403j929n773j3480K924k539J2190
21907d427J4912J1811N0964k4036k3069m002j7393J5223K0076l2469J2263K1814
21895D1667l0719k3414J3409O519J0540j9435l0339k9793j1179K7577N0310n491
21883c48l5849j5271L4747K8169J1771J3309k1007R465L0715j2493l800k9823
21871I585j5153k283J4862L4526J956j8743l4017l5373j7893L5861J9469l5839
21859d3042r289K8279L2405Q982J9007J47J3189N433J9468K054l2676l2234j9161
$$ plain form
21944 19928 -12314 -4127 1510 -33181 17866 43695 27421 10588 -36181 -65449 -49506 -37778
21932 -37778 -36082 -58749 -86065 -93343 -71730 -14074 -5820 -13937 32152 68935 50869 16663
21920 16663 3760 25065 25851 34587 80431 54583 4180 2251 -3522 -17002 -14078 -16617 -4427
21907 -4427 10485 22296 73260 49224 26155 22153 4760 19983 40059 7590 19853 41667
21895 41667 10948 -12466 943 7462 18002 -1433 -31772 -61565 -72744 -45167 5143 -348
21883 -348 -36197 -51468 -16721 11448 23219 36528 15521 24986 55701 43208 39408 9585
21871 9585 -5568 -7851 7011 41537 43493 24750 -9267 -44640 -62533 -26672 -7203 -43042
21859 -43042 -52331 -24052 8353 17335 36342 36489 49678 55111 74579 76633 43957 11723 -7438
21846g438j1673l757R234M164K4994K0233M0485j2579o6628O478L0008J5357j4996
21833C3882j4346j0059p294j1603J0016K064k0946k9797J7694j4061M1371L3428
21821C0349p561J3631k3578o2499j6521M7133L5657l7643p116K3328K2942l461
21809A4661P720J2224k4796K289l464l2674j2882K8769j7103l524k8114J0122
21797d6772K0418J7502N0863M7319K898m420M288L149q417j7910N069n6486m8219
21784c0718J0262o355Q787J22p93K6030j2600j653l1721L0401J2505J3474j8477
21771g36m3260k7539j043q178M8462L6554j1814l6169j1019M0335N4109o817k3396
21758I489l1813j3107J3551l2220M3149K0456p313l2403j2908j903o61l9497M5459
$$ plain form
21846 -7438 -19111 -22868 -13634 -9470 15524 35757 76242 63663 -2965 3513 33521 48878 33882
21833 33882 19536 9477 2183 -9420 596 2660 -18286 -48083 -30389 -44450 -3079 30349
21821 30349 22788 36419 12841 -49658 -66179 -19046 16611 -21032 -28148 -4820 18122 14661
21809 14661 22381 34605 9809 12098 8634 -24040 -36922 -8153 -25256 -28780 -56894 -46772
21797 -46772 -26354 -8852 42011 89330 92228 87808 92096 95245 86828 68918 73987 17501 -30718
21784 -30718 -20456 -26811 -18024 -17902 -18695 7335 -5265 -6918 -38639 -8238 4267 17741 -736
21771 -736 -43996 -71535 -72578 -80756 -32294 4260 -7554 -43723 -54742 -14407 39702 32885 9489
21758 9489 -22324 -35431 -21880 -54100 -10951 9505 2192 -30211 -43119 -45022 -45683 -85180 -39721
21745c9721K9912o216K4880N545m9936k0009L731M790n962K3436N163J6162L686
21732d539M222J9693N5826Q172k6194k5706n8520P359K420j2546k2652J4983K8856
21719h626K8270m576k0991n679L3960L8276K107k6152n1021j8436n581K153K0416
21706a5880J3691j0841M6810k915l8757m0908k5719J6460N3444q870J3065R787
21694I367L3971J8287j9058n8796o3207k0913K3561L6105M8793J1287J1976j9805
21682A1568K4596n309l2214Q532k4022K8834J1477j397Q146p988j8890M4950k0271
21669B8012P019k8236o9501L3398N7032K445j2875J615l9135k1870K1302J592
21657a9202L3531o899k9246k4355J7668J7492L5732o395k6020k9683L632k4282
$$ plain form
21745 -39721 -9809 -16025 8855 14400 -35536 -55545 -51814 -47024 -52986 -29550 -24387 -8225 -4539
21732 -4539 -317 19376 75202 83374 57180 31474 -27046 -19687 -17267 -29813 -52465 -37482 -8626
21719 -8626 19644 15068 -5923 -11602 22358 60634 62741 36589 -14432 -32868 -38449 -36296 -15880
21706 -15880 -2189 -13030 33780 30865 -7892 -48800 -74519 -58059 -4615 -13485 -420 9367
21694 9367 43338 61625 42567 -16229 -79436 -100349 -76788 -40683 8110 19397 31373 11568
21682 11568 36164 30855 -1359 7173 -16849 11985 23462 22065 30211 22223 3333 48283 28012
21669 28012 35031 6795 -62706 -29308 27724 30169 17294 18909 -20226 -42096 -20794 -19202
21657 -19202 14329 7430 -21816 -46171 -28503 -11011 24721 18326 -7694 -37377 -33745 -58027
21645e8027L8040J4576J9682J0505K2622m0136m0860j8774K6109J4478K1284k029
21633G470n2724J0119j7904k0478M7219k1466K0265K9613J8240j981k2945K3540
21621A8968k3137j4373J1994M1481k6525l0172O814o145J4368k9450j0396K0233
21609b6340L8189Q0559J7421k5198k7518n3122k0225K268k4640k59R223K0289
21597i353k0975K1205K1885N1142J5860m7321o056j1528j8478J934J4587L0443
21585D3345J5150M8998Q126j9955k2501k5168O768K4488k6663o6225N477N7338
21573D9178J8427j9410k2154l53M3217j0013m7166J9110J2375k9945j4208L8305
21561C7363K8754j0325m3685m9691n413M9315M505l4632p7015m796N3087N3108
$$ plain form
21645 -58027 -19987 -5411 14271 24776 47398 7262 -33598 -52372 -26263 -11785 9499 7470
21633 7470 -45254 -35135 -53039 -73517 -26298 -47764 -27499 2114 20354 18373 -4572 18968
21621 18968 -4169 -18542 -6548 34933 8408 -21764 -14950 -21095 -6727 -36177 -46573 -26340
21609 -26340 11849 92408 109829 84631 57113 3991 -16234 -13966 -38606 -38865 -29642 -9353
21597 -9353 -30328 -9123 12762 63904 79764 32443 26387 14859 -3619 -1685 12902 43345
21585 43345 58495 107493 115619 95664 73163 47995 54763 79251 52588 -13637 -8160 49178
21573 49178 67605 48195 26041 25688 68905 58892 11726 30836 43211 13266 -942 37363
21561 37363 66117 55792 12107 -37584 -42997 6318 10823 -23809 -100824 -105620 -52533 575
21549E75M0206j2133l4006j1846k1409l1773J4352N051K3829K7404K8484m4298
21537a5564k4036L6380L3315m1686j3102j2602R750K274l1886m0583m5484J3223
21525a30001M4121K4707M8884j9885k5610J1198M8965L6478K4287j5692j9035
21514B8417j6840L4909j3643l4627L5931M4637j6112o7395j9808l8554j110N7123
21502g072J4033N347m8241q135K6078M5317J5562m1087k4890j2717K0080o935
21490b2660k4309l3043J8556j2493J4716R975M4219K2198K6895N5633k2922n0975
21478B5790l6784o016j5509k2814N3001M2374j6847m4424R699N742k0303j1373
21466c7464L7166J0221M077k5619l0951Q687M7294K2021k6466j0842k7124k3840
$$ plain form
21549 575 40781 28648 -5358 -17204 -38613 -70386 -56034 -50983 -27154 250 28734 -15564
21537 -15564 -39600 -3220 30095 -11591 -24693 -37295 -27545 -25271 -57157 -97740 -143224 -130001
21525 -130001 -85880 -61173 -12289 -32174 -57784 -46586 2379 38857 63144 47452 28417
21514 28417 11577 46486 32843 -1784 34147 78784 62672 -4723 -24531 -63085 -64195 -7072
21502 -7072 6961 12308 -35933 -44068 -17990 27327 42889 1802 -23088 -35805 -15725 -22660
21490 -22660 -46969 -80012 -61456 -73949 -59233 -49258 -5039 17159 44054 99687 76765 25790
21478 25790 -10994 -17010 -32519 -55333 -2332 40042 23195 -21229 -11530 -5788 -26091 -37464
21466 -37464 -298 9923 14000 -11619 -42570 -33883 13411 35432 8966 -1876 -29000 -52840
21454e2840L0013M4444R355K0094K5024k5560o883M5953Oo8374l7533J4307M0427
21441C8433k882l437Q676j4062N97K0520J1779q786l2514j478J0750k0880j2358
21428e642K534l5277k5259o832K8971L9632L0408J7713k1176q25k8071k1290J1981
21415a3133K3799L7140O017o537m4140l61M387q351J0327k7451m3837J2211K8306
21402b1623o846K6444J7911r340m8285K0506k3611M2584J313l1706M063J6154
21390a2436L6948O477l9810j5407l3J7165j3605m4032k9098P589K4440j2260M9576
21377b4486N8776L0342m3159k6573K3715Q243K9124j0163o5617l9104L1756J2620
21365a4526j6413k9043N400Q10J0441J2104j0146M732O1227P503l4758l7690J550
$$ plain form
21454 -52840 -22827 21617 30972 51066 76090 50530 43647 89600 89606 21232 -16301 -1994 38433
21441 38433 35551 32114 40790 26728 27325 47845 59624 50838 18324 16846 27596 6716 -5642
21428 -5642 -3108 -38385 -63644 -70476 -41505 -1873 28535 46248 25072 24247 -3824 -25114 -13133
21415 -13133 10666 47806 53823 47286 3146 2785 7172 -1179 9148 -18303 -62140 -49929 -21623
21402 -21623 -28469 -2025 15886 6546 -41739 -21233 -44844 -2260 -947 -32653 -28590 -12436
21390 -12436 24512 30989 -8821 -24228 -24261 -7096 -20701 -64733 -93831 -86242 -61802 -74062 -24486
21377 -24486 34290 64632 21473 -5100 18615 26858 55982 45819 -19798 -58902 -27146 -14526
21365 -14526 -30939 -59982 -54582 -53772 -43331 -31227 -41373 -36641 24586 32089 -2669 -40359 -38809
21352c8809L1218J9157L2378J3428L309J6090o639o008j2706K4425n560n690j6148
21339D8445j4619l5831j9821r668l5633n0775K2119J6218M6489k635k801K8812
21327i700j6879r473M6943J3500J3772j3597k8464l5644k0464K2186J7260L8219
21315A7659K7028m521k4566q885O1o557k4767L2998L8495k8067l7041k3114K9348
21302a1929k5033j0697P6K8092K2728k063j5096k4645n424L9103K4419l1365l7286
21289d9120k1946L9897k129k0708j411k3839P447J9642M0254L8225l0828j7632
21277b2148l5849K227J35K1721k565k312J1651q933K4382R017l7198L135K2002
21264a4735k5206K7991K0347j3719K60Q143J5757J625j7544l501L6635j5079l2031
$$ plain form
21352 -38809 -7591 11566 43944 57372 60681 76771 70132 64124 51418 75843 70283 64593 48445
21339 48445 33826 -2005 -21826 -31494 -67127 -117902 -95783 -79565 -33076 -35711 -38512 -9700
21327 -9700 -26579 -36052 10891 24391 38163 24566 -3898 -39542 -60006 -37820 -20560 17659
21315 17659 44687 40166 15600 6715 6776 219 -24548 8450 46945 18878 -18163 -41277 -11929
21302 -11929 -36962 -47659 -47583 -19491 3237 1174 -13922 -38567 -43991 -4888 19531 -11834 -49120
21289 -49120 -71066 -31169 -33298 -54006 -55417 -79256 -71809 -52167 -11913 26312 -4516 -22148
21277 -22148 -57997 -55770 -55635 -33914 -36479 -38791 -27140 -36073 -11691 -2674 -39872 -36737 -14735
21264 -14735 -39941 -11950 8397 -5322 -5062 3081 18838 20463 2919 -582 36053 20974 -11057
21251a1057K27k8908k739M2176j0816J3486J3806K5046K8644l2790o2114k9201
21239e4240j9515j7608O8683O2031p785k2925J4803m2745j151K8241j0381j5534
21227a8126j087J669J8446M2325J187j33m5640j4394J9970M0962p3170j5238M3650
21214D21K2423N873j7043K3588m76p144q350J8095J351J6039l7854n0262m45L1600
21200b184Q401L348p597j687j7180J3249J7964K5320j6206j3135j6497j5839j3401
21187c5444j0481K514L9996k4523j6403L5791K7381l565o032j3959j2571O0862
21175D3566K1855k1279l7087j6569Q756J650J3080K8566l2838M930r407J19j3377
21162h035k9506N1J3597K9664l768J4587L8027k4748l2341k1479j1376N3853j0396
$$ plain form
21251 -11057 -10830 -39738 -42477 -301 -11117 2369 16175 41221 69865 37075 -25039 -54240
21239 -54240 -73755 -91363 -22680 39351 31566 8641 23444 -19301 -20452 7789 -2592 -18126
21227 -18126 -19213 -17544 902 43227 44414 44281 -1359 -15753 4217 45179 -27991 -43229 421
21214 421 22844 28717 11674 35262 34786 27642 19292 37387 38738 54777 16923 -33339 -33784 -2184
21200 -2184 6217 9565 1968 281 -16899 -3650 14314 39634 23428 10293 -6204 -22043 -35444
21187 -35444 -45925 -43411 -3415 -27938 -44341 -8550 18831 15266 9234 -4725 -17296 43566
21175 43566 65421 44142 7055 -9514 -758 892 13972 42538 9700 14630 5223 5342 -8035
21162 -8035 -37541 -37490 -23893 5771 2003 16590 54617 29869 -2472 -23951 -35327 18526 8130
21149H130l2821J2939K4586j8283J2048p010L1131K3799j4718l9015j5701j2117
21137b7032j3978J2371P1464l9149k7998p003L598j860j3178O061L4738K9717
21125B7751j6440m6495J1379M2937n060j8189P651p387J5599N153l9342j1567
21113c4010L617K689N945L2488j5906j7587J2218j0796k2205J2233n70L0654j3049
21100a4279j0765k487J3538L855l8152J5984n5227l1437K7745N1424O0608j8615
21088B192j9843M328p717j7509o914J7357j3724J6034K5761J5949j7746l2625
21076c4457J8921j5475k2283L1865M4929n629L064M06K8834M2921o573j12k2861
21063F3550l8612j7032k447k3815q331J2636j3022j5390p334K3766k6533k8844
$$ plain form
21149 8130 -24691 -11752 12834 -5449 6599 -411 30720 54519 39801 786 -14915 -27032
21137 -27032 -41010 -28639 42825 3676 -24322 -31325 -27727 -29587 -42765 -36704 -1966 27751
21125 27751 11311 -35184 -23805 19132 14072 -4117 3534 -3853 11746 16899 -22443 -34010
21113 -34010 -30393 -27704 -21759 10729 -5177 -22764 -10546 -21342 -43547 -31314 -31884 -1230 -14279
21100 -14279 -25044 -27531 -13993 -10138 -48290 -32306 -87533 -118970 -91225 -39801 20807 2192
21088 2192 -17651 -13323 -21040 -38549 -45463 -28106 -41830 -25796 -35 15914 -1832 -34457
21076 -34457 -15536 -31011 -53294 -21429 23500 17871 20935 21341 50175 93096 86523 86411 63550
21063 63550 24938 7906 5459 -18356 -26687 -14051 -27073 -42463 -49797 -26031 -52564 -81408
21051h1408L9340L1042L3685J9760j0432k4285M247j1842j7630J8299J4360j7696
21039b560R273K1838q111k9409j9825L224J7998j9944R256l8290o244L5216L40
21026b7238j5694M772q122K8284J1430O730k7316J587Q171j6115l084j2150K7918
21013b0827J9111l2673l4093J5813R339K4463j7139j8696j6889J8784j4720j0876
21001g8403N9309M7612p362K9063O6227k9599M758q195k8552k5305k6321l885
20989f53K3322J8697P277n8610m8957K0538k2937j119K6120l2596R664J0155K9004
20976b0095K3786K3205l2760m8485m3782O725r829k2562M8425O5328K6149J6109
20964C2214R789j9879n0334o3748J6787J0906N1131K6338k484l2690k1577L229
$$ plain form
21051 -81408 -42068 -11026 22659 42419 31987 7702 11949 107 -17523 776 15136 -2560
21039 -2560 6713 28551 20440 -8969 -28794 -25570 -7572 -27516 -18260 -56550 -62794 -27578 -27238
21026 -27238 -42932 -38160 -46282 -17998 -6568 162 -27154 -25567 -17396 -33511 -36595 -48745 -20827
21013 -20827 -1716 -34389 -68482 -52669 -43330 -18867 -36006 -54702 -71591 -52807 -67527 -78403
21001 -78403 -19094 28518 21156 50219 116446 86847 91605 83410 54858 29553 3232 -653
20989 -653 22669 41366 48643 -9967 -58924 -38386 -61323 -62442 -36322 -68918 -59254 -49099 -20095
20976 -20095 3691 26896 -5864 -54349 -98131 -91406 -101235 -123797 -75372 -10044 16105 32214
20964 32214 42003 22124 -28210 -91958 -75171 -64265 -13134 13204 10720 -21970 -43547 -40318
20952d0318j857J5234N442l1282k0143Q721o32Q817L0463K535O124l5659l3398
20939h5953N1666L4512L2325j5302M611L5169M8228j1599m2533l1968O705o39
20927B5222N9228n2290k2321J4001l2614n104J1932J0988K304j8642k0544n115
20915c2955K7217J0604j8023J7604k227O407R701m298l2742l4810j9267L6842
20903c5947l3371Q508K9619M04j1102k7818k1061p952J5365K3106K476k1026o517
20890h5316J9051J5768j8970p116L1461K2841k8036k2896J4677J3902L2026J3793
20878A185k4325o426J1278q490k416m661J6464P479r045n512J5042L793k1319
20865b6953p453j0292J8978k0389J9960P186k3248l7908N2807N4948k4103m986
$$ plain form
20952 -40318 -42175 -26941 -21499 -52781 -72924 -64203 -64835 -56018 -25555 -23020 -16896 -52555 -85953
20939 -85953 -34287 225 32550 17248 21859 57028 105256 93657 51124 19156 25861 25222
20927 25222 84450 32160 9839 23840 -8774 -13878 -1946 9042 11346 -7296 -27840 -32955
20915 -32955 -5738 4866 -13157 4447 2220 8627 18328 14030 -18712 -53522 -72789 -35947
20903 -35947 -69318 -60810 -31191 -30787 -41889 -69707 -90768 -98720 -83355 -60249 -57773 -78799 -85316
20890 -85316 -66265 -50497 -69467 -76583 -45122 -22281 -50317 -73213 -58536 -44634 -12608 1185
20878 1185 -23140 -29566 -18288 -26778 -29194 -33855 -17391 -9912 -18957 -24469 -9427 -5634 -26953
20865 -26953 -34406 -44698 -25720 -46109 -26149 -18963 -42211 -80119 -27312 27636 3533 -1453
20853a453J4344L5424j1705n0630J1990j1454K0499J5999J2449j0492k7095k5346
20841b7470j567q114J6119m738k0066L4045K4443L984Q223r381j6922j8950r207
20828b9601n225n575J8748o844q982M487J0819J6826j2010j3020N0255L361J6012
20815C9251K8148m975L7988k7338l6621j2496M291j8366k0297l465O773j0441
20803a7548j3008K285J8357M3913O258k3898j9126k8969j6756j1467M2795L1254
20791A4090l4371j648p503J0058R169n9287p634L4439p386P764K9926r80p389
20778b0752K0459J9099O136j2699O007l527K3935O077o998l8802n1866L4067r98
20765a9862l0793L5854l235j1965M0295l1415L3060R982m4813L326p647O866k450
$$ plain form
20853 -1453 12891 48315 36610 -14020 -2030 -13484 7015 23014 35463 24971 -2124 -27470
20841 -27470 -29037 -37151 -21032 -25770 -45836 -11791 12652 16636 24859 15478 -1444 -20394 -29601
20828 -29601 -34826 -40401 -21653 -28497 -37479 -32992 -22173 -5347 -17357 -30377 19878 23239 39251
20815 39251 67399 62424 100412 73074 36453 23957 28248 9882 -10415 -13880 -7107 -17548
20803 -17548 -30556 -28271 -9914 33999 40257 16359 -2767 -31736 -48492 -59959 -17164 14090
20791 14090 -20281 -21929 -29432 -19374 -10205 -69492 -77126 -42687 -50073 -42309 -12383 -13363 -20752
20778 -20752 -293 18806 24942 12243 18250 14723 38658 44735 37737 -1065 -52931 -18864 -19862
20765 -19862 -50655 -14801 -18036 -30001 10294 -21121 11939 21921 -22892 -19566 -27213 -20347 -22797
20752b2797M1758k325p1930m6440J0835J1532J4854j1429J8611m3075K0064R526
20740g0816P352M9856J2773j0685j405J4445p6J1020K1613R101P980j3431n2047
20727a4320j6639j5386j11N2475O1846L5176J8937k9055m8939k3442r420N220
20715A6342j6551l4499J0439K4532J1072k9984J7253K3782p095l1502p955P928
20703a6238K0831l607J7598K579j6395J5736q387k1396j0285J2060k4438j3245
20691d5187k2512r571R339m3434m814L7600J0101L3905K0886k3836P814J3574
20679a6135K5709L1756O946q562O644o615j9144K1419J1754J3240j1153q085J4801
20666F2575k8155k619M962k8491j4833k4078j1517j0863M095L0870k1286J3365
$$ plain form
20752 -22797 18961 16636 -55294 -101734 -90899 -79367 -64513 -75942 -57331 -100406 -80342 -70816
20740 -70816 -63464 -13608 -835 -11520 -12925 1520 1444 12464 34077 43178 51158 37727 -14320
20727 -14320 -30959 -46345 -46456 6019 67865 103041 121978 92923 43984 20542 11122 16342
20715 16342 -209 -34708 -24269 263 11335 -18649 -1396 22386 15291 -16211 -24166 -16238
20703 -16238 4593 986 18584 21163 4768 20504 12117 -9279 -19564 -7504 -31942 -45187
20691 -45187 -67699 -77270 -67931 -111365 -116179 -78579 -68478 -34573 -13687 -37523 -29709 -16135
20679 -16135 9574 41330 48276 39714 46358 39743 20599 42018 53772 67012 55859 47774 62575
20666 62575 34420 31801 36763 8272 -6561 -30639 -42156 -53019 -48924 -18054 -39340 -25975
20654b5975j174l7514k5021L6916O8180L7043o066k4399p1255M350J8119M2938
20642A6142J5596l0627j7231O6557m752n4080m2144n906o085L5658L2877J2520
20630A8525M6690j0878m2247m9934k2063K6155L640l35k2100K6993m923m474J7483
20617a7468K6423K5629k0165m9479q083n357L8697J0693n95J0748k9181Q06L4278
20604A6946J3821N264M289k5746K050Q234l8219j0985p10p749J6518k3223j5676
20591e5186l252K5745M4460K2534P147j3472j7860Q422o056M604J5247L1532p156
20578E6709k1415j5494k389k2920l3315K669l1818J8170L4359J3202L8580R049
20566D5387l6928n082M0885R183J0487n761r481O533j412r241n134K874N5844
$$ plain form
20654 -25975 -27149 -64663 -89684 -52768 15412 52455 46389 21990 -49265 -44915 -26796 16142
20642 16142 31738 1111 -16120 50437 45685 -8395 -50539 -56445 -62530 -26872 6005 18525
20630 18525 65215 54337 12090 -37844 -59907 -33752 -30112 -30447 -52547 -25554 -30477 -34951 -17468
20617 -17468 8955 34584 14419 -35060 -43143 -48500 -9803 890 295 11043 -18138 -17332 16946
20604 16946 30767 36031 40320 14574 16624 24858 -13361 -24346 -25056 -32805 -16287 -39510 -55186
20591 -55186 -58438 -32693 11767 34301 41448 27976 10116 18538 12482 17086 32333 63865 56709
20578 56709 35294 19800 17411 -5509 -38824 -36155 -67973 -49803 -15444 -2242 36338 45387
20566 45387 8459 3377 44262 53445 63932 58171 48690 55223 53811 44570 39436 42310 98154
20553I8154j8069k7755l1357j3561O267K635q454K1716K1222M5228O240M4378
20541A46644L7700K784K1502L904K5109L4631K764M8993L4442k8285l732N7338
20529C83794N5037K8510j4450l5483j9565q681m047r331j167j061j123n3043n8934
20516B60456J7381j0506m3517K5404J950j8586l1559m3546n4935m621j1018k1244
20504F5659L876J0202K601j5420l2653r749J3279L64l8241p177M5481K0011l9771
20491A8462k1869L3347J2683O258l4588j5204j4910K7517J0603M811P37K6005
20479E3852l6575k7198M1314m701l7263m8943J1157M0569n013L1426k907O143
20467B1861m034m1255k1842l8224M4483K6075k4902p968l1467L7463J4103K9701
$$ plain form
20553 98154 80085 52330 20973 7412 13679 16314 7860 29576 50798 96026 102266 146644
20541 146644 184344 187128 208630 212534 237643 272274 275038 324031 358473 330188 326456 383794
20529 383794 438831 467341 452891 417408 397843 389162 385115 375784 374617 373556 372433 319390 260456
20516 260456 277837 267331 223814 249218 251168 232582 201023 157477 102542 97921 86903 65659
20504 65659 69535 79737 82338 66918 34265 24516 37795 38159 -82 -7259 38222 58233 18462
20491 18462 -3407 29940 42623 48881 14293 -911 -15821 11696 22299 27110 27847 53852
20479 53852 17277 -9921 31393 26692 -10571 -59514 -48357 -7788 -12801 18625 15718 21861
20467 21861 17827 -23428 -45270 -83494 -39011 -12936 -37838 -45806 -77273 -39810 -25707 3994
20455C994K783k4425k8843m166K6147N846J8077J6445l935M6143J8582j4909n070
20442E6669l735K4728l4372m1530k3339N791K4567j8314n1221P894J1471k2703
20430f4094m704M923O8895j606o4181k1020M036P4019Q417j7764Q711j9637K9790
20417E785m5078Q811K6861p839j5358k1209l2023Q398Q60N4626N2059j1909k8549
20404d565Q265J0323J4047m0288j6309J6101M1726L079l4510j9949k0043K747
20392c9376j5091J9201K7544J3448K5549K3799J6973N578n878k2285o279j2036
20380C1147K118J9498L8950j5848l8013j5318K9567l9797n550M3563Q753N383
20368F4453J172K3787P273k2853k9324l3372m2066p949M2910k2475j6163N256
$$ plain form
20455 3994 6777 -17648 -46491 -50657 -24510 -18664 -587 15858 11923 58066 76648 61739 56669
20442 56669 52934 77662 43290 1760 -21579 -15788 8779 -9535 -60756 -52862 -41391 -64094
20430 -64094 -68798 -63875 5020 3414 -60767 -81787 -77751 -3732 4685 -13079 -4368 -24005 5785
20417 5785 -39293 -30482 -3621 -11460 -26818 -48027 -80050 -71652 -70792 -16166 35893 23984 -4565
20404 -4565 3700 14023 28070 -12218 -28527 -12426 29300 32379 -2131 -22080 -42123 -39376
20392 -39376 -54467 -35266 -7722 5726 31275 55074 72047 77625 71747 49462 43183 31147
20380 31147 33265 52763 91713 75865 37852 22534 52101 12304 6754 50317 59070 64453
20368 64453 65625 89412 96685 73832 44508 11136 -30930 -38879 4031 -18444 -34607 -29351
20356b9351L5312J305J296J1353L82j2797K3068J0462j9823p936j4535j5746l7809
20343e4819K3791L2998j6443M3423Q090k5060j9994L0145k3889N540P864J519
20331A3165J3567K7743j51K5388K6241o3772k1089p032k4074l4010M3664L3658
20319C3298L1364O446j4128j1666l328j8094j6190j1475K1174J6047l4522j4382
20307a5456R384n94O878L739K7716n427o4539Q232L9768l2704m1874M532O296
20294e4049K0335L7867R024l595j8996J5698J0934k2771Q871n466j3540O150n865
20281a5403j6201k5656M939O5696K3826j9014m1044m71M2077o698k4333j8298
20269c0580J1448k3299N423L5199J0396o9917k3894L2548L9660J547m5039j15
$$ plain form
20356 -29351 5961 7266 8562 19915 20297 7500 30568 41030 21207 13271 -1264 -17010 -54819
20343 -54819 -31028 1970 -14473 28950 37040 11980 -8014 22131 -1758 3782 11646 13165
20331 13165 26732 54475 54324 79712 105953 42181 21092 14060 -10014 -44024 -360 33298
20319 33298 64662 71108 56980 45314 41986 23892 7702 -3773 17401 33448 -1074 -15456
20307 -15456 -6072 -6666 212 3951 31667 26240 -38299 -30067 9701 -23003 -64877 -60345 -54049
20294 -54049 -33714 4153 13177 9582 -9414 6284 17218 -5553 3318 -2148 -15688 -9538 -15403
20281 -15403 -31604 -57260 -52321 13375 37201 18187 -22857 -23328 18749 12051 -12282 -30580
20269 -30580 -19132 -42431 -37008 -1809 8587 -61330 -85224 -52676 -13016 -11469 -56508 -56623
20257e6623L9608O6128M9750j107m7432o2589j9498L674K7234j3197r860L3411
20245I499J3336l5895k1825r690q936K3544j1140m051L8188L340j3843j2916P647
20232b2742J8866l1645L8783M587j6561K4341J2831k865p3126l6235K2210J7450
20220d4106M744q756R984J8352n628J0948K3223O6255k00k9117Q872k7146n9013
20207c1588K8208M0421L0694m981l0939l6319J0857o0451r461J2662R297j6288
20195e7888j1705q97k9792k954L5352L5939K7465K2282M5400r126K6506j8928
20183F1654l6763j3021j3671l0701p44J5284L772K2985J0558l7888O058l603j1579
20170b7659k800L2591J3279j6653k4330L3565l4405j0307N2404k0919n21K867
$$ plain form
20257 -56623 -17015 49113 98863 97756 50324 -12265 -31763 -28089 -855 -14052 -23912 9499
20245 9499 22835 -13060 -34885 -44575 -53511 -29967 -41107 -45158 -6970 -3630 -17473 -30389 -22742
20232 -22742 -3876 -35521 3262 7849 -8712 15629 28460 25595 -47531 -83766 -61556 -44106
20220 -44106 -39362 -48118 -38134 -19782 -25410 -14462 8761 75016 74816 45699 54571 27425 -31588
20207 -31588 -3380 37041 67735 62754 31815 -4504 6353 -54098 -63559 -50897 -41600 -57888
20195 -57888 -69593 -70490 -100282 -103236 -67884 -31945 -4480 17802 63202 54076 80582 61654
20183 61654 24891 11870 -1801 -32502 -33246 -17962 -14190 8795 19353 -18535 -12477 -16080 -27659
20170 -27659 -30459 2132 15411 -1242 -25572 7993 -26412 -36719 15685 -5234 -5755 -2888
20158b888L6613k0087n217K391n98Q661o933k2093K9856j3915k1332l6386L211
20145d8717M2906J7452J8101J1868j6495l0325l845j5588P501K2324J4002J1284
20133C0468K2645j5256k8493j3859K773q745K0864J982J9504j4354L4474L3398
20121H5401k3909k1081l8734j1502K6094K7382K2483k415m3600j7006j8608m341
20109a9836O628l4956J4196L2463L8393n680l9352J4933k5870J4418L2651J1392
20097C9380J3990J0432o9376n0676M898j2062j8488M877K0041k2928L6059N1484
20085G631J6130J443k3308K373J0909j0954M46J5598k5562k4396L5075k597n6095
20072e3307K8274M0530L2328P156p494l3529j138J5592o270j168k4844k4936J8928
$$ plain form
20158 -2888 33725 13638 8421 10812 10214 18875 11942 -10151 19705 5790 -15542 -51928 -48717
20145 -48717 -5811 11641 29742 41610 25115 -5210 -9055 -24643 -17142 5182 19184 30468
20133 30468 53113 37857 9364 -4495 -1722 -10467 10397 12379 31883 17529 52003 85401
20121 85401 61492 40411 1677 -9825 16269 43651 66134 63719 20119 3113 -15495 -19836
20109 -19836 -13208 -48164 -33968 -1505 36888 31208 -8144 6789 -19081 -4663 27988 39380
20097 39380 53370 63802 -5574 -56250 -51352 -63414 -81902 -77025 -56984 -79912 -43853 7631
20085 7631 23761 25204 1896 4269 15178 4224 4670 20268 -5294 -29690 5385 2788 -53307
20072 -53307 -25033 15497 47825 54981 47487 13958 12820 28412 22142 20974 -3870 -28806 -9878
20059i878O494l43K9024j0115K871K8062j1764q586k2260M954L7n405j4399k3099
20045c4407j4286M447N2876N5200p364j8276l6276k9579l3440n761L274K4668
20033c8924K0638O448r328M200N0562R079o7814j9202j3900j65j0340L2186O932
20020b9628K3950k3297o1743J2897L8692M5838L7214P994K07n0013J6864J293
20008B0268M3497K6006j5211o243L5332J09811J52188J98499P3183j02538r8341
19997D36451p6828q4917p5015n2159R40n9010n3326K1948K6174j0650l5991j7727
19985A9890k8592l8569J713K8875j4695R774j2204J1905j766k8060Q096K9585
19973a4048J3089J8738K1085K441k6942K0703k0468P860j112j2700J599N165l0175
$$ plain form
20059 -9878 -3384 -3727 25297 15182 18053 46115 34351 25765 3505 8459 8496 3091 -11308 -34407
20045 -34407 -48693 -44246 8630 63830 56466 38190 1914 -27665 -61105 -66866 -63592 -38924
20033 -38924 -18286 -11838 -21166 -16966 33596 42675 -25139 -44341 -58241 -58406 -68746 -36560 -29628
20020 -29628 -5678 -28975 -90718 -77821 -39129 6709 43923 51917 52124 2111 18975 20268
20008 20268 63765 89771 74560 68317 103649 213460 365648 564147 637330 534792 436451
19997 436451 359623 274706 199691 147532 148472 89462 36136 58084 84258 73608 37617 19890
19985 19890 -8702 -47271 -45558 -16683 -31378 -21604 -33808 -21903 -23669 -51729 -43633 -14048
19973 -14048 -959 17779 38864 41305 14363 35066 14598 22458 21346 8646 10245 15410 -14765
19960a4765j3440p210j403k055k5827L061j0656j287P8546N5356j5020k0521M5475
19947G0254K6286J588k3347n5644n3439K7005K1528K698R703m3692l2996K7141
19935b2915P544P340o15n0260J3273K7659L421J6636N260j2402k1497q188J5926
19922a8818O2912K5252m5557n1281p882R733j756j0201K0085N486q337o98l3422
19909e4484m78L3775J6422n354Q706P353k6058J043j5612n2107M6151P2516J3421
19896D5294J3324j4387q49L051k4328j3604L8273J6782K521n2850M819K9899q83
19883D7062k1708n7r905k530N02k4074J4617K9894L0098j5641p854k8858l7896
19870b6350j1326k7295j1076K7856L4358L2374n863K2878r964l7469k8513K8369
$$ plain form
19960 -14765 -28205 -35415 -36818 -38873 -64700 -61639 -72295 -73582 4964 60320 45300 24779 70254
19947 70254 96540 98128 74781 19137 -34302 -7297 14231 16929 26632 -17060 -50056 -22915
19935 -22915 -15371 -8031 -8646 -58906 -45633 -17974 -14553 2083 7343 -5059 -26556 -34744 -18818
19922 -18818 44094 69346 23789 -27492 -35374 -25641 -27397 -37598 -17513 -12027 -20364 -21062 -54484
19909 -54484 -54962 -21187 -4765 -10119 -1413 5940 -20118 -19075 -34687 -86794 -40643 31873 45294
19896 45294 58618 44231 43382 46433 22105 8501 46774 63556 66077 13227 18046 47945 47062
19883 47062 25354 25297 15392 12862 13364 -10710 3907 33801 63899 48258 40404 11546 -26350
19870 -26350 -37676 -64971 -76047 -48191 -13833 18541 12678 35556 25592 -11877 -40390 -12021
19858a2021N0405L798j9692k9242k749m932K4048K2384K3086J01931J58457J07265
19846D22738k6022o3185l4849o7468o3308o3525m888j9715J514n9418m1666o175
19834b5967j928j9117k3412J5662O601M7261M1369k9896k2849Q828M747K7356
19822B8655J6408J705j1775k3255K7852L1033J4166k2758m5056n814k7840m0359
19810e7038L330O2037L6186r289K0557k6041r328l828n350R831O497p076l7323
19797a6835r306M2665O5966J1671L286j5245l7112o584l149K0451J7456R125j7394
19784F4995m1830K1873N4884L81M960j5558k5426L1471J991k2790j0503k1531
19772D2917k2062K2126Q079m36M426J0332k292j6310J6965J5587k7210N311j8647
$$ plain form
19858 -12021 38384 42182 22490 -6752 -9501 -14433 9615 31999 55085 157016 315473 422738
19846 422738 396716 333531 298682 231214 167906 104381 99493 79778 81292 21874 -19792 -25967
19834 -25967 -27895 -47012 -70424 -54762 -48161 -900 40469 10573 -12276 -3448 1299 28655
19822 28655 45063 46768 34993 11738 39590 70623 84789 62031 16975 11161 -16679 -57038
19810 -57038 -53708 8329 44515 35226 55783 29742 20414 16586 11236 21067 27564 20488 -16835
19797 -16835 -26141 16524 82490 94161 97447 82202 45090 38506 35357 55808 73264 82389 64995
19784 64995 23165 45038 99922 100303 105263 89705 64279 95750 97741 74951 64448 42917
19772 42917 20855 42981 51060 50624 55050 65382 63090 46780 63745 79332 52122 57433 38786
19759C8786k8542P242j4700j970L5005J955P242j9922L0775l815j4882j6012J5423
19746C6585K1718J1375P881j7923k9263m3109l4327k3134K624K593K5917L7231
19734a832j2133J9711N1253k2238J1582L1366k3543k6588K6021k5587k1785K359
19722H586l290l0327k5800R158J8772J8959K2077K614l8823L5039J0526l4888
19710g397l8711J7647l86J738M3868M5412K5667k4560l6151J4356j1630l9183
19698i330k904Q237L4537K5329J6252K9394K1675k2502j623L3032k1604j3353
19686I7140q746K6679L3212M8801R4715O1567K7153P668j2689l9026k2996J4375
19674C27853J8726N9752P8218J11255O4662J079L7470K5972m4887j06854r7993
$$ plain form
19759 38786 10244 17486 2786 816 35821 37776 45018 25096 55871 52056 37174 21162 36585
19746 36585 58303 69678 77559 59636 30373 -12736 -47063 -70197 -67573 -64980 -39063 -1832
19734 -1832 -13965 5746 56999 34761 46343 77709 54166 27578 53599 28012 6227 8586
19722 8586 5296 -25031 -50831 -41673 -22901 -3942 18135 20749 -18074 16965 27491 -7397
19710 -7397 -46108 -28461 -28847 -27109 16759 62171 87838 63278 27127 41483 29853 -9330
19698 -9330 -12234 -3997 30540 55869 72121 101515 123190 100688 99065 132097 110493 97140
19686 97140 88394 115073 148285 197086 291801 353368 380521 388189 375500 336474 313478 327853
19674 327853 346579 406331 484549 595804 660466 661545 699015 724987 680100 573246 475253
19663D75253r2173n2614l6721N317O4213L6268j2998L058q030l6062l3606m2280
19651B69625k8671L439j3415p8418m7954j2555l83l4433m854R511n3479m3683
19639c5270J9071l704J2897J88l0947J0099O1606m997l0994m033J5853P252J3208
19626C0229k0037j3631O89J7709n532r487O214r99O6437J5012j960o371j4789
19613F3484k106p126P548J2185N8575P9942J39348J36036J732q5439j21352j12752
19601A70075o2892l4821j6676N281M143J8495N747l0805P305j9246p807J4764
19589E3563N1639L82O715j1782m2554k0320k542m797l613M597l0418m3246j5064
19576e7440L7400K7660L8711j3636o994K5757j3931k4073J9446j9897L228m791
$$ plain form
19663 475253 383080 330466 293745 299062 363275 399543 386545 389603 381573 345511 311905 269625
19651 269625 240954 244393 230978 152560 104606 92051 91668 57235 52381 61892 8413 -35270
19639 -35270 -16199 -19903 -7006 -6818 -37765 -27666 33940 28943 -2051 -6084 9769 17021 30229
19626 30229 10192 -3439 -2750 14959 9427 -60 6154 5155 71592 86604 84644 78273 63484
19613 63484 61378 54252 61800 73985 132560 212502 351850 487886 489618 404179 282827 170075
19601 170075 107183 72362 55686 60967 65110 83605 89352 58547 65852 46606 38799 53563
19589 53563 105202 105584 112299 100517 57963 37643 35101 30304 26691 31288 870 -42376 -57440
19576 -57440 -20040 7620 46331 32695 25701 51458 37527 13454 32900 13003 16231 11440
19564A1440j4110J3415k8956O4523P2047M7360o2443m6721O482L6983j8319m0172
19552D1529j8254K3076k984j1618k7601r974L1517K9496L6716j7467k7138m740
19540D2558l6493l2917j8482J7027J2486L0826K8268J9916L410j5220n0088j6981
19528a5690q733M1688J2743j4151P2350l9371o2291n170n448r377Q7697j0086
19516D4161k2020p420k9099r92K5382Q685k3230p059N78M0722N015l9229k8329
19503c2835j3103K6539K4746K1727j8959k4885J2235M9267N0789o483l8123n0112
19491H03m5198J3235P384l2966K7034L1783k1828K4753O2899j388P908j0005j6832
19478D7582m3064n681L3076L9098M231n977J063J8965R576O0238K2591j1409j7949
$$ plain form
19564 11440 -2670 10745 -18211 46312 118359 165719 103276 56555 63037 100020 81701 41529
19552 41529 23275 46351 43367 31749 4148 -5826 25691 55187 91903 74436 47298 42558
19540 42558 6065 -26852 -45334 -28307 -15821 15005 43273 63189 66599 51379 1291 -15690
19528 -15690 -24423 17265 30008 15857 88207 48836 -13455 -18625 -24073 -33450 54247 44161
19516 44161 22141 14721 -14378 -15370 10012 18697 -4533 -11592 -11014 29708 34723 -4506 -32835
19503 -32835 -45938 -19399 5347 27074 8115 -16770 -4535 44732 95521 89038 50915 803
19491 803 -44395 -31160 -23776 -56742 -29708 2075 -19753 5000 67899 66511 74419 64414 47582
19478 47582 4518 -1163 31913 71011 75242 69265 70328 89293 98869 159107 181698 170289 152340
19465A52340Q411j1493L733M6358K5557k4694j6741J2520J8583K907l0070K3434
19453B10845M1021N7018L1794R996O255n7126o9871n0948K5147O6037O3058O1047
19441C94273O4466L2749o2619n8405n8737l5420k3556N9006O1829N4351O6464
19430D94401R1101Q575k1061J254K2465J9069j7284j0911j0901R0970J21464R4934
19418H84076R5014J25016J94146R6242l425l5555k3183m6719l2923m5507n9715
19407A147467M26N7262J943m8844k5910j1132o2669j08145n0237m9641o3168k0023
19395G67329j4819m4807o7138l8058n9711m9263p4561m5796k1158m4401k0727
19384B86890k621j9933l9090J334J2831K0315K4023p1677n0864l1311n6139p320
$$ plain form
19465 152340 160751 149258 152991 199349 224906 200212 183471 195991 214574 217481 187411 210845
19453 210845 251866 308884 340678 350674 356929 299803 229932 178984 204131 270168 333226 394273
19441 394273 458739 491488 428869 370464 311727 276307 252751 311757 373586 427937 494401
19430 494401 585502 594077 573016 574270 596735 615804 598520 587609 576708 667678 789142 884076
19418 884076 979090 1104106 1298252 1394494 1391069 1355514 1332331 1285612 1252689 1207182 1147467
19407 1147467 1147893 1205155 1207098 1158254 1132344 1121212 1058543 950398 900161 850520 787352 767329
19395 767329 752510 707703 640565 602507 542796 493533 418972 373176 352018 307617 286890
19384 286890 284269 264336 225246 226580 239411 259726 283749 212072 161208 129897 73758 66438
19372F6438n012n8039j7561N6964P48l2466j0064L1886M468n357l5603L283j1998
19359a2313L76J8193K8558J6965K722K393Q209K2849m142l4391j5498J6353K074
19346E2348k0132m9196J4703K5558N536j8809L8940K0116K6991J1316L9917Q0462
19334B27750J3889K2016P9371j2136k5845m5414p055N310k048m83J3582J5923
19322B84860M4999P9857k2107n0348m1031l19l896J4473j2834j1742j4932k3839
19310B43141j8376j8635l6018Q497K2030O4348L6620K8274l3935q6030L1113k0318
19298B20711m0596j225j6668J0922K8338N3124N3808M3016P2174P6165M3315R4973
19286F38057J16817K88702N48797J118366J928879J355092m48080j151920q17618
$$ plain form
19372 66438 61426 3387 -14174 42790 43538 11072 1008 32894 37362 32005 -3598 -315 -12313
19359 -12313 -11937 6256 34814 51779 54501 56894 65103 87952 83810 49419 33921 50274 52348
19346 52348 32216 -16980 -2277 23281 28817 10008 48948 69064 96055 107371 147288 227750
19334 227750 241639 263655 343026 330890 305045 259631 252576 257886 255838 255355 268937 284860
19322 284860 329859 409716 387609 337261 296230 295911 292015 306488 293654 281912 266980 243141
19310 243141 224765 206130 170112 178609 200639 264987 301607 329881 295946 209916 241029 220711
19298 220711 180115 178890 162222 173144 201482 254606 308414 351430 423604 499769 543084 638057
19286 638057 754874 1043576 1592373 2710739 4639618 5994710 5546630 4394710 3577092
19277C577092p08754p17466n56993l67845k30360j26588n4040m3530n6426j03407
19267F11683j06419k0659L564m5149l2899l2995m1579m2876n751N0479K3681n156
19255C55924j4104l7732l9640J1760q159l5206p922N3024R4636R4629J36902J61412
19243G65524K08278J25941N4579P9206J01735P608o6746k9305O1773J01411K40094
19232A650098M32922L67034J12994N9909P0146K3929j14092k09970k20444j99215
19222A973311j02764M7676J44881J41604n0144m6083L0515j24313j93211j07876
19212A713596l8326j00526o0151r6925j12709q6795p2006o0736q1372n0751m3323
19201I09976J1916J25418J69996J09578n439j9020j0303k0093r5097m8215n0601
$$ plain form
19277 3577092 2868338 2150872 1593879 1226034 995674 869086 815046 771516 715090 611683
19267 611683 505264 484605 488169 443020 410121 377126 335547 292671 286920 337399 361080 355924
19255 355924 341820 304088 264448 276208 268049 232843 224921 277945 372581 467210 604112 765524
19243 765524 973802 1099743 1154322 1233528 1335263 1342871 1276125 1246820 1308593 1410004 1650098
19232 1650098 2083020 2450054 2563048 2622957 2693103 2717032 2602940 2392970 2172526 1973311
19222 1973311 1870547 1918223 2063104 2204708 2154564 2108481 2138996 2014683 1821472 1713596
19212 1713596 1675270 1574744 1514593 1417668 1304959 1218164 1146158 1085422 1004050 953299 909976
19201 909976 921892 1047310 1217306 1326884 1321445 1302425 1292122 1272029 1176932 1128717 1078116
19190A078116o5012o1417L2642J39249R9787K8219N8559P7069j1367N5851Q9095
19179A520791J23002J31496J34515J71171K66521K83356K29421K03351L18428
19170C382052L25978L64068M88830O65516P82501J036824J530058K221638L341147
19161A4138612N667323J0000965J3437000Q238047K214l46880M604882P354994
19153F3097157K736496l162790j795933N117293J5832315K4359434J3467618k080054
19145A17571536M43441O033036k41896j1672304j8256896j6664241j2028443p494008
19137E7690225p37202Q303256Q721694J61011k93149M275020k430168j2704048
19129F2986639j3405462j0132071q840579p843221n750588l791145k572804j859827
$$ plain form
19190 1078116 1013104 951687 984329 1123578 1223365 1251584 1310143 1387212 1375845 1431696 1520791
19179 1520791 1643793 1775289 1909804 2080975 2347496 2630852 2860273 3063624 3382052
19170 3382052 3708030 4072098 4560928 5226444 6008945 7045769 8575827 10797465 14138612
19161 14138612 19805935 29806900 43243900 51481947 51484161 51137281 55742163 63097157
19153 63097157 65833653 62670863 60874930 65992223 81824538 106183972 119651590 117571536
19145 117571536 118014977 124048013 123806117 112133813 93876917 77212676 65184233 57690225
19137 57690225 56953023 65256279 73977973 74138984 73845835 78120855 75690687 62986639
19129 62986639 49581177 39449106 30608527 22765306 17014718 13223573 10650769 8790942
19121H790942j390828r28445o75099m97637l75688l28956l97572m10713l84284
19112C401720l13880k67588k63980k53623k09806j50941j38380j21700j03751
19103A578071l1532j3314q9275m8782m0439m3657j3267l2430l9833n078l5484
19092A184980j8380m5009J8183J26984J21758K2627m8356m3661o4875k7099l7312
19081A189840m1390l9966k0396K00L069j8084j4543n1632m7230J2813m2817o7915
19069H61949k7900K3109k1484m3746m9402k2888l8587R309J4495O2587P3635P7383
19057I18460k465p6237o1266k0572k550m0065k8908M4363J10156J63463J25250
19046A129629N4119K1515M944l6653j03041m7775Q700J1170M3060J57806J15266
$$ plain form
19121 8790942 7400114 6471669 5796570 5298933 4923245 4594289 4196717 3786004 3401720
19112 3401720 3087840 2820252 2556272 2302649 2092843 1941902 1803522 1681822 1578071
19103 1578071 1546539 1533225 1443950 1395168 1354729 1311072 1297805 1265375 1225542 1220464 1184980
19092 1184980 1166600 1121591 1139774 1266758 1388516 1411143 1362787 1319126 1254251 1227152 1189840
19081 1189840 1148450 1108484 1088088 1088288 1091357 1073273 1058730 1007098 959868 972681 929864 861949
19069 861949 834049 857158 835674 791928 742526 719638 681051 690360 704855 767442 841077 918460
19057 918460 915995 839758 778492 757920 755370 715305 686397 730760 840916 1004379 1129629
19046 1129629 1183748 1205263 1210207 1173554 1070513 1022738 1031438 1042608 1085668 1243474 1358740
19035A358740Q939q3670k7630Q6046J09123m69j3437J13718K08216J31752p07
19024A890621j67817j95208j48924j09588l8723k710K5111J10443K08098J61363
19014A732666m5954j42223j36018q3031m0466K1484P1715M8061J62631L08057
19004A896922L31849J12343j10025k10902k35279k62649k29132j61660r0372j0721
18994A030374J09975J60814K15215K74220L09758K17724J35582K44056L27060
18985C024778R2640j95065k10163q4838J15715K60321J19246o8898j08498r9699
18975B845539m4315p5783j21487r7483N2128K44385J78230k4529n9323M2970O6144
18964C006476O3929J28559K05157J99512J91038L17098M56255O12705R24392J447027
$$ plain form
19035 1358740 1367679 1284009 1256379 1342425 1451548 1451079 1437642 1551360 1759576 1891328 1890621
19024 1890621 1722804 1527596 1378672 1269084 1230361 1227651 1252762 1363205 1571303 1732666
19014 1732666 1686712 1544489 1408471 1325440 1284974 1306458 1378173 1426234 1588865 1896922
19004 1896922 2228771 2341114 2231089 2020187 1784908 1522259 1293127 1131467 1041095 1030374
18994 1030374 1140349 1301163 1516378 1790598 2100356 2318080 2453662 2697718 3024778
18985 3024778 3117418 2922353 2712190 2627352 2743067 3003388 3122634 3053736 2945238 2845539
18975 2845539 2801224 2725441 2603954 2506471 2558599 2802984 2981214 2956685 2897362 2940332 3006476
18964 3006476 3070405 3198964 3404121 3603633 3794671 4111769 4568024 5180729 6105121 7552148
18954G552148K235957L789330O980721J1857843J0997814P46493n977177n351334
18946C2831795m264670m029869k579813K36156M040118J0003966J8744062K1043639
18938G6025384O287886j0071577j2965707j0548390j0234939r347000o481551
18931B2664106l341131q64318J571033N252284J0042155Q370750j551438o966005
18923C5177436n881213m988608n108322m199172k664081j675109j171934o90367
18915H798630k91652K612K59804O91579J251045J991174L352947N937753J0402209
18906C2396101J3274957N900638m281785o403111m691241l891736k377713J232527
18898C1158637O883552J3749816J5683061J1346347N484478n257651j2955841
$$ plain form
18954 7552148 9788105 13577435 20558156 32415999 43413813 44160306 38183129 32831795
18946 32831795 28567125 24537256 21957443 22193599 26233717 36237683 54981745 76025384
18938 76025384 82313270 72241693 59275986 48727596 38492657 29145657 22664106
18931 22664106 19322975 18458657 20029690 25281974 35324129 43694879 42143441 35177436
18923 35177436 29296223 24307615 19199293 15000121 12336040 10660931 9488997 8798630
18915 8798630 8506978 8509590 8769394 9460973 10712018 12703192 16056139 21993892 32396101
18906 32396101 45671058 51571696 47289911 40886800 36195559 32303823 29926110 31158637
18898 31158637 38042189 51792005 67475066 78821413 84305891 79048240 66092399
18891F6092399j2628264j0310134q721657o315196l065492N09787N250972J0857210
18883D1669625R309386j844110q327667p259793o226457o373892n510094l796167
18875A1640831k428256j670032j283148r86854o44874m20020k92311j97797j17251
18866C600288j27468j30254j76023j69519k15707k09920j83233q2457l3096q0746
18856B191865r7201r9689k4585L9000P1659P698n4892k8285m3877r8383n3856
18845A809454P351L8609P3499K78790N25106O33015L69195K41102M37480M353
18835D417954o02917o96748n12276m65632m12435l33640j96137o1288n9325q3792
18825I93764n9856o1767m4998j3537l7239l4076n3625m4012k3280j4177m2368
$$ plain form
18891 66092399 53464135 43154001 34432344 28117148 25051656 25561443 30812415 41669625
18883 41669625 50979011 49134901 40807234 33547441 27320984 20947092 15436998 11640831
18875 11640831 9212575 7542543 6259395 5272541 4627667 4207647 3915336 3717539 3600288
18866 3600288 3472820 3342566 3166543 2997024 2781317 2571397 2388164 2305707 2272611 2191865
18856 2191865 2094664 1994975 1970390 2009390 2081049 2088747 2033855 2005570 1961693 1863310 1809454
18845 1809454 1816805 1855414 1928913 2207703 2732809 3365824 3735019 3976121 4413601 4417954
18835 4417954 3815037 3118289 2606013 2140381 1727946 1394306 1198169 1136881 1077556 993764
18825 993764 933908 872141 827143 813606 776367 742291 688666 644654 621374 607197 564829
18814E64829k1131r587J7628l843J8553L2454m776l0944K9974Q2294J07379J13989
18802H96819P0625O8611M5003o9469j17530j04302j03201j09134r7933m7875j7973
18791D13641m4482j694k7360l627K0614o887k646K3713l5590j0318K3281q657
18779C39988m9030Q88J4038J0664K1094J0764K241J5762j2594K920J8257M9533
18767D24525N7591O6991Q9963J57017K9083q7330q1219l5846r1652j12267J4046
18756D30902K8963O0126K4517L7305k2673r07Q055l6884j24202o9229l2583j8843
18744B84547j4469L4780K7845K4192j0463l8042j8295q596n528l3106j7183J0522
18732B36204Q140N5470N651J988J4515M1882N5899L568L516O4454k5446m4908
$$ plain form
18814 564829 543698 534111 551739 547896 566449 598903 594127 563183 593157 675451 782830 896819
18802 896819 967444 1036055 1081058 1011589 894059 789757 686556 577422 479489 431614 413641
18791 413641 369159 367465 340105 336478 357092 350205 347559 371272 335682 325364 348645 339988
18779 339988 290958 291846 305884 316548 337642 348406 350647 366409 353815 356735 374992 424525
18767 424525 482116 549107 639070 796087 825170 737840 656621 620775 529123 416856 430902
18756 430902 459865 519991 544508 581813 559140 558233 566288 529404 405202 335973 303390 284547
18744 284547 270078 304858 332703 356895 346432 308390 290095 281499 275971 242865 225682 236204
18732 236204 244344 299814 305465 307453 321968 363850 419749 423317 426833 491287 465841 420933
18720D20933M377J6369j5099O6075J997l6009j1777j6225j6721L5070J3312j285
18708D61017j8295k0710k6489L6152N8188L8872K6433k0451k3083k5091n0892
18697D35651n6874k4375K9703p647j8963J8588j0270k2754n163K5931k6007R422
18685C47242o864L937J1690k5403m0756O816J7961r06k0190K6673k5289k7107
18673B67804P51N459L8883O1711J3326P901O3430R0271J32893L69968O04540O92292
18661B349229K53904k77144m06849l37191l21991k87253k02907j69356r5210n6100
18651D49132n9934n1981J2032J9112j0689j5492k5332J4725K6587m0042p1043
18640B47075k3954M2195N3622Q2286J62519R4621q192o3237l3349r57j328j6076
$$ plain form
18720 420933 425310 441679 426580 492655 494652 458643 446866 430641 413920 448990 462302 461017
18708 461017 442722 422012 395523 431675 489863 528735 555168 534717 511634 486543 435651
18697 435651 378777 354402 384105 376458 357495 376083 365813 343059 337896 363827 337820 347242
18685 347242 340378 344315 356005 330602 289846 296662 314623 313717 293527 320200 294911 267804
18673 267804 268555 274014 312897 374608 387934 395835 459265 549536 682429 1052397 1656937 2349229
18661 2349229 2603133 2325989 1919140 1581949 1259958 972705 769798 600442 505232 449132
18651 449132 389198 337217 349249 368361 357672 342180 316848 331573 358160 318118 247075
18640 247075 223121 265316 318938 401224 563743 658364 650172 586935 553586 552629 551301 535225
18628E35225l5433l1031L6135N6367K2656N3336O7312J07276R8691N8420l5517
18617I33437o5667R817N3735J1124k5421j06596j38637k1991p844k9967J9405
18606F31395R040j8357j7735K5911k709p4928r8975n5210p2522o7528j1392K3636
18594B70626J8988J2448L6732o562l679j7401L217O1248N351O584M2571K5723
18582D55846l1516j0675q045K1561N967O750K1486J9527l8579l7781j0420o3457
18570C30664j1775P0515N8384K8656J4049l4558l6581j8158N3116M8866N5142
18559E58320J25606K63746N14460P54115M76922k40081m41271l24236l37106l05788
18549A044687k45192k10715o9412m2384o0716l5063R031K7585k9521p5013n4480
$$ plain form
18628 535225 499792 468761 504896 561263 583919 637255 704567 811843 910534 968954 933437
18617 933437 867770 877587 931322 942446 917025 810429 671792 649801 641957 611990 631395
18606 631395 640435 622078 604343 630254 627545 552617 453642 398432 325910 258382 246990 270626
18594 270626 289614 302062 338794 332232 328553 311152 314369 375617 380968 387552 430123 455846
18582 455846 424330 413655 405610 427171 433138 439888 461374 480901 442322 404541 394121 330664
18570 330664 318889 389404 447788 476444 490493 455935 419354 401196 454312 503178 558320
18559 558320 683926 947672 1462132 2216247 2693169 2453088 2011817 1687581 1350475 1044687
18549 1044687 799495 588780 519368 476984 416268 381205 390236 417821 388300 313287 258807
18538B58807j8773O0057J4716j3849k9782K1663K4578R539J0651j8864k2623K4155
18526C20275j5860m887l5987l0608K2071l4624r101R399j4006K0633O1809N9589
18514C48703l3419o3122q2698O81N7054L3976j9554n6457j6458N3660L9422P916
18502B69704J9915J4639j2993K8976M600N7061M106l0538M1041Q3343N7389J2619
18490E49862p094K3890L2808R27N8357J02968J49349J82343O1372p8373n3767
18479A022642q6271p2672p2268j15161p4210k8294J1174N5846J44019J67875P5006
18468A027686m3087n2663n7177o2952p8582l7235K7492J5540k9724M8087N0334
18457H07719J06230J65082J81699K21708K63870K27461Q6312n5999j46081j28224
$$ plain form
18538 258807 240034 300091 314807 300958 271176 292839 317417 326956 337607 318743 296120 320275
18526 320275 304415 299528 263541 232933 255004 220380 211279 220678 206672 227305 289114 348703
18514 348703 315284 252162 169464 170145 227199 261175 241621 185164 168706 222366 261788 269704
18502 269704 289619 304258 291265 320241 324841 381902 386008 355470 396511 479854 537243 549862
18490 549862 542768 566658 599466 600393 658750 761718 911067 1093410 1154782 1076409 1022642
18479 1022642 936371 863699 791431 676270 602060 573766 584940 640786 784805 952680 1027686
18468 1027686 984599 931936 874759 811807 733225 695990 723482 739022 709298 757385 807719
18457 807719 913949 1079031 1260730 1482438 1746308 1973769 2060081 2004082 1858001 1729777
18447A729777j27535j33246n9532O2078J49992K78792J94851k4020n1753n8952
18437A960452k0191j1104M5523J79590K77014L20552J03437L3020l1298j89537
18427B667458k83672k32889j70258j53265m3789M8126J07761J89601J25826r6749
18417B158150j56127r8340l0113j01002j07500L1318J34942K15550K78239L58238
18407B683355M42400J94969P5058K12334K51931P9304O6392K25886N15819J023057
18397E770505K018374L034799J555354r98574j546641j025023r17939o63803N5754
18388G282806R18314K108458M255032P637953P725744Q53903m290042m142937
18380B2349231l486719l630591k980930j741508n93879M22840J574160L569492
$$ plain form
18447 1729777 1602242 1468996 1409464 1471542 1621534 1900326 2095177 2071157 2019404 1960452
18437 1960452 1940261 1929157 1974680 2154270 2431284 2751836 2855273 2888293 2856995 2667458
18427 2667458 2383786 2150897 1980639 1827374 1783585 1831711 1939472 2129073 2254899 2158150
18417 2158150 2002023 1903683 1873570 1772568 1665068 1696386 1831328 2046878 2325117 2683355
18407 2683355 3125755 3320724 3395782 3608116 3860047 3939351 4005743 4231629 4747448 5770505
18397 5770505 7788879 10823678 12379032 11380458 9833817 8808794 7890855 7227052 7282806
18388 7282806 8201120 10309578 14564610 22202563 29928307 30782210 26492168 22349231
18380 22349231 18862512 15231921 12250991 10509483 9915604 10338444 11912604 15482096
18372A5482096N867309L771393j488674l318063k704362k515486k496974j919131
18364A0678108j136470m50874q3903J44795K56634L41268M98814N76930K17243
18355A1042545N5931K39503N61156J055430J829531K966872M275774O177281J0714250
18346C8918273J9401757K4835681J0092741q348991j1062554q371039q020681
18339E7445187o113735r02287N789401J4844915K9971784M5762290L3822983L405521
18331A84026059j682207N156562j1237050k4731218j5322243J793550Q718722
18324A46722175n952850j5966450o629654K851089o779365k0499799j9993744
18317G3751402j4428567j2308000j0977179q213049n488465l571214k289050j716281
$$ plain form
18372 15482096 21349405 25120798 23632124 20314061 17609699 15094213 12597239 10678108
18364 10678108 9541638 9090764 9006861 9151656 9408290 9749558 10248372 10825302 11042545
18355 11042545 11098476 11337979 11899135 12954565 14784096 17750968 22026742 28204023 38918273
18346 38918273 58320030 83155711 93248452 84899461 73836907 65465868 57445187
18339 57445187 51331452 50429165 56218566 71063481 101035265 146797555 180620538 184026059
18331 184026059 182343852 187500414 176263364 151532146 136209903 138003453 146722175
18324 146722175 140769325 124802875 118173221 121024310 114244945 93745146 73751402
18317 73751402 59322835 47014835 36037656 27824607 22336142 18764928 16475878 14759597
18309A4759597j520626j321379q59535o62441q35319q59264o00445l42669k65684
18300G492235j53571M5543J58709K85109M98987N72698O72306Q43187J257444
18291A1672647K023576L177919M906222Q107189J4671240K2603755J6431712L016886
18283H6611146N203422J0910566l067643j5701461j3729913j2198829j2894854
18276D5132434j0284071o050391l720337m216661m356140l168616k336719k040762
18268H958737j601080j115470p13928m76179l36713l05679k48451j83575r1837
18259C885825r8354r0066l2373J34653K15682J16131O3936N2911K5707j6781r2907
18248D164364j94903k28080j96788p4493Q3838Q5267K68714M45537O45716J078761
$$ plain form
18309 14759597 13238971 11917592 11058057 10395616 9560297 8701033 8100588 7757919 7492235
18300 7492235 7338664 7384207 7542916 7828025 8327012 8899710 9572016 10415203 11672647
18291 11672647 13696223 16874142 21780364 29887553 44558793 67162548 83594260 86611146
18283 86611146 91814568 102725134 99657491 83956030 70226117 58027288 45132434
18276 45132434 34848363 28797972 25077635 20860974 16504834 13336218 10999499 8958737
18268 8958737 7357657 6242187 5528259 5052080 4715367 4409688 4161237 3977662 3885825
18259 3885825 3787471 3697405 3665032 3799685 4015367 4131498 4195434 4248345 4274052 4257271 4164364
18248 4164364 3969461 3741381 3544593 3470100 3553938 3639205 3907919 4353456 4999172 6077933
18238F077933J601997K596073M857997P154463L924172j91603J285132K379588
18230B9685752k739072o060339m763807l572035l271057k633643j709631j024740
18222C911428p48167n41769l47389k80001k28581j75473j13508n3085M0107P2480
18212A536042Q7715m7097n9777N4092N3448j13026r9920k5808r7484r8799q0607
18201A108779r5122p9040m8794j3478m6945o1798k0871m9879r2269o1816M2720
18190E81487L3889L5401J8107J3830J2703m1383m6077l0016l4752l354q3900j2634
18178D43301M753n023l2733o1073L333K3612Q509l0740O6300L4312k7089K2208
18166D49670k2720m3666p773M8240J00075O9243p799l6951L6309r566k2064n469
$$ plain form
18238 6077933 7679930 10276003 15134000 22288463 26212635 26021032 27306164 29685752
18230 29685752 26946680 20886341 16122534 12550499 9279442 6645799 4936168 3911428
18222 3911428 3163261 2621492 2274103 1994102 1765521 1590048 1476540 1423455 1463562 1536042
18212 1536042 1623757 1576660 1516883 1570975 1624423 1511397 1411477 1385669 1288185 1189386 1108779
18201 1108779 1013657 934617 885823 872345 825400 763602 742731 692852 600583 538767 581487
18190 581487 615376 650777 668884 682714 695417 654034 607957 577941 543189 539835 455935 443301
18178 443301 448054 443031 410298 349225 352558 376170 384679 353939 420239 454551 427462 449670
18166 449670 426950 383284 375511 423751 523826 593069 585270 548319 584628 575062 552998 547529
18154E47529m1326m2741j3443k7960j128L3845l1690m6440J692P1797K6826J0502
18142D87463m6831M4451Q5629K8287K9982O396J0566O6418R779k6223J3948K0267
18130G30132k0561R688M1178M1897M1358N1142P0749R1829J16652J23290J84179
18119A481533J96295J96155K63570L56992M40287N91710P63398J096097J828068
18110G214105K961087M833514Q914715J8653800K9486064J1172567j4372835j5435867
18102E3427150j0052593j0803247j0859358p545492m471616k669973j732128j163402
18094D129341q37061n64624m31696l64029k40981k07175j77407j02015o0294j00498
18084A043561j03474o1764r7797j07096l8668o3122l2461n4519m0229j8134j9950
$$ plain form
18154 547529 506203 463462 450019 422059 420931 454776 423086 376646 378338 450135 476961 487463
18142 487463 440632 485083 570712 598999 628981 635377 645943 712361 722140 695917 709865 730132
18130 730132 709571 719259 760437 802334 843692 894834 965583 1057412 1174064 1297354 1481533
18119 1481533 1677828 1873983 2137553 2494545 2934832 3526542 4289940 5386037 7214105
18110 7214105 10175192 15008706 23923421 42577221 72063285 83235852 68863017 53427150
18102 53427150 43374557 32571310 21711952 14166460 9694844 7024871 5292743 4129341
18094 4129341 3292280 2727656 2295960 1931931 1690950 1483775 1306368 1204353 1144059 1043561
18084 1043561 940087 878323 780526 673430 634762 571640 539179 484660 444431 426297 406347
18073D06347k7159N838q305l9061k1764K978J7206k9200j7092J796j8766J2144
18061B84962r534L53K0894K4549j6977j787O050K8530p011m4407m2321K0568k067
18048B61802j4315J2072n742M4110R991k9167K2296j0610j645K7887L5885K0705
18036C73269j9551j1529j2634j7233j7204j8391J8840j2359n799o359N242j1803
18024B64489M240O2209J0314J6101m323j5823k6763j6898j6422L4072J2561J4534
18012C38291m9459k9839L7384K9636j3432p875J0136R152r570o7752n9254l7867
18000A49551L8206P8110M7755M2963m645m2655m6060j0699j2341j7535j9392L298
17988B06556M8621K3105J2315K6683P463m7482l5024r001k0642k108N565m7457
$$ plain form
18073 406347 379188 385026 376721 337660 315896 318874 336080 306880 289788 291584 272818 284962
18061 284962 275428 275781 296675 321224 304247 302460 308510 337040 330029 285622 243301 263869 261802
18048 261802 247487 259559 253817 297927 307918 278751 301047 290437 288792 316679 352564 373269
18036 373269 353718 342189 329555 312322 295118 276727 295567 283208 277409 271050 276292 264489
18024 264489 268729 330938 341252 357353 353030 337207 310444 293546 277124 311196 323757 338291
18012 338291 288832 258993 296377 326013 312581 304706 314842 323994 314424 246672 187418 149551
18000 149551 187757 265867 313622 356585 351940 309285 263225 252526 240185 222650 203258 206556
17988 206556 255177 278282 290597 317280 324743 277261 242237 233236 212594 210486 216051 168594
17976A68594l122l337k6513P819K1945O610l6818n3335J0763J9549J9355m752
17964A26758m3034o544R896N3090M4973j1165O338K239K6451j920l5339r428r987
17951A52328j5750R370L7212k1926L8343K9487O5577K7785L8110N9057Q1355J51823
17939F52771L13316M68861M92968R4747k29356l01731k86860k76186k09624j53369
17929E65537o6295k6085l7549J488l6278j1168J2749O0154J33961J67683K05632
17918I69829M16496M14480J72077j07929k41385k58623k78204k50188j67877j39192
17908E29484q4522q6641o6294k3615K122k1319m1565l1840j1879n699q103K5864
17896A75993N6533K4137m6033n5972K1326J2944R131k2565l7884J7226j0191K6822
$$ plain form
17976 168594 165472 162135 135622 143441 165386 171996 135178 81843 92606 112155 131510 126758
17964 126758 83724 77180 87076 140166 185139 173974 180312 182551 209002 207082 171743 162315 152328
17951 152328 136578 145948 183160 161234 199577 229064 294641 322426 360536 419593 500948 652771
17939 652771 966087 1434948 1927916 2022663 1793307 1491576 1204716 928530 718906 565537
17929 565537 499242 473157 435608 437096 400818 389650 402399 462553 596514 764197 969829
17918 969829 1386325 1800805 1972882 1864953 1623568 1364945 1086741 836553 668676 529484
17908 529484 444962 358321 292027 268412 270534 249215 207650 175810 163931 158232 150129 175993
17896 175993 232526 256663 210630 154658 175984 188928 198059 175494 137610 154836 144645 171467
17884A71467K2143J1263J6586k8554p58r903j030l985J3709J8877L5225M960K2329
17871B72329m4213p558j7538O471Q714L421j4311M825N2914j2878l9812j0654
17859B01710J1268j1508L1554J2283K1408O6O847M6580J16003Q0247K6J1804n7737
17846D70551o9833J4092M8899M643k4787j8100L9827M9030O2825J8559M591m1249
17834E59048m3202K8135K423K4915j8840m4416k1406m3108j6376n6890q38M3306
17822D12751N7890L8560n12N8241L5798q0214q1260n6778l9970k2587k2108q299
17810B91512n427m0914j6419k2794L3530L7126J3827L9516M2887N4250K5592K03
17798D52889M971J3216j9009k8665l4452j0161j6536j937J0454j2370M8019O0787
$$ plain form
17884 171467 193610 204873 221459 192905 192147 182244 181214 177229 190938 209815 245040 250000 272329
17871 272329 228116 220558 203020 209491 218205 221626 207315 212140 265054 252176 212364 201710
17859 201710 212978 201470 233024 245307 266715 266781 273628 320208 436211 516458 516484 528288 470551
17846 470551 400718 414810 463709 468352 443565 425465 465292 514322 577147 595706 600297 559048
17834 559048 515846 543981 546404 571319 552479 508063 486657 443549 427173 370283 369445 412751
17822 412751 470641 509201 508689 566930 602728 522514 441254 384476 344506 321919 299811 291512
17810 291512 286085 245171 228752 205958 239488 276614 290441 329957 372844 427094 452686 452889
17798 452889 457860 471076 452067 423402 388950 378789 362253 360316 370770 358400 406419 467206
17786D67206N8081m5560m4630K918n6011l3483L5489l034J3286k361k7754l725
17774C60422K4207P9104J89848J57479J10212K3981k7656n4826j48558j08587
17764F05626o1914m2411r5280r5041M928N8436J7281l4111n9501o0250R294J5978
17752B63035k346n2322J1856j67l3186k5959K1084J4978j8079J2099P981m5044
17740A53930J397k462M1441k351l2189J6930K7683Q589J1249J306l9475J807K5496
17727B13351L5729L7556N0888k5691M5895O8133l423K2495N8161j962n5711o3347
17715C82074p3318l6303l0342K294K6469q921m3350k8656j7487K8757K2001k232
17703B20986L7568L7080k2279m1784l4419l1996j8853L734L922M0659k7665J584
$$ plain form
17786 467206 525287 479727 435097 438015 382004 348521 384010 380976 394262 391901 364147 360422
17774 360422 384629 463733 653581 811060 921272 945253 917597 862771 714213 605626
17764 605626 543712 501301 406021 310980 315908 374344 391625 357514 298013 237763 247057 263035
17752 263035 260689 208367 220223 220056 186870 160911 181995 196973 178894 190993 198974 153930
17740 153930 155327 152865 194306 191955 159766 176696 204379 212968 224217 225523 186048 187855 213351
17727 213351 249080 286636 337524 311833 357728 425861 422438 444933 503094 501132 445421 382074
17715 382074 308756 272453 242111 244405 270874 261953 218603 189947 172460 201217 223218 220986
17703 220986 258554 295634 273355 231571 197152 165156 146303 150037 153959 194618 166953 168537
17691A68537K1310n25R093o066l6493M9269J9402o720k243n0885K0130M0064q605
17678B16268r190M9335L1149o1837n1369m3760l1292j1203M615L867K1314p07
17666A17190O951J2455J9671k6258L598K1364J5462K8342o483k9448k3760K6887
17654A65971K4889L930n164K7330J9014n905j0366N5505P778j8247l8110k0109
17642B06516j0210j0992l8451o5678r6322j1202J1903L710L4622M5003N0870j646
17630A18123K0325q297l9828J4029K5511K4116K3201J0148k6453m4828p98j0950
17618A04299K7166J5180J6717j091l4322k9338l6429P281j0395p049M7749j5849
17606H3919J201r047K0797K2530k8096j067J811K4176j0928j3367m877O159j1934
$$ plain form
17691 168537 189847 189322 198415 192349 155856 205125 224527 217807 215564 164679 184809 224873 216268
17678 216268 207078 256413 287562 225725 174356 130596 99304 88101 92716 96583 117897 117190
17666 117190 124141 136596 156267 130009 133607 154971 170433 198775 192292 162844 139084 165971
17654 165971 190860 194790 189626 216956 235970 230065 219699 275204 282982 264735 226625 206516
17642 206516 196306 185314 146863 81185 -15137 -26339 -14436 -10726 23896 68899 119769 118123
17630 118123 138448 130151 90323 104352 129863 153979 177180 187328 160875 116047 115249 104299
17618 104299 131465 146645 163362 162271 127949 98611 62182 69463 59068 52019 99768 83919
17606 83919 85120 76073 96870 119400 91304 90237 92048 116224 105296 91929 87052 93211 81277
17593H1277J307P1637M3329j7821j1927K2397k509M2062M1870l9569n6805J1896
17581A87144L1708R279m787k3402k8963r782J6918j7625j2548j8062n986j5970
17569A07924j731J0568k6899l2855Q913J805J7598J3629L9299K5082j365m0288
17557A21680j6223l6912j0618L8725q1j4060M2529P324k2667k0342k1139j1901
17545E6315n1350K1244K5046k3933M646N502K3136N2616M6533k2950J6918l111
17533A50612J141j9131M1749M197k2666k5245r9442q0571M566J119K5501O3125
17521D4955k1520m6463M3602J22360M3271J4949K1875Q237k8712n338J924l6169
17509A62971k9260m1237j8083K7565K1566k912l047l9075K4614N5250J8223k7520
$$ plain form
17593 81277 82584 154221 197550 179729 167802 190199 187690 229752 271622 232053 175248 187144
17581 187144 218852 228131 223344 199942 170979 161197 178115 160490 147942 129880 123894 107924
17569 107924 106193 116761 89862 57007 65920 67725 85323 98952 138251 163333 161968 121680
17557 121680 105457 68545 57927 96652 96571 82511 125040 132364 109697 89355 68216 56315
17545 56315 4965 26209 51255 27322 31968 37470 60606 113222 159755 136805 153723 150612
17533 150612 151753 132622 174371 178568 155902 130657 31215 -49356 -44790 -43671 -18170 44955
17521 44955 23435 -23028 20574 142934 186205 201154 223029 231266 202554 197216 199140 162971
17509 162971 133711 92474 74391 101956 123522 120610 117563 78488 103102 158352 176575 149055
17497A49055r898m671J902K2708q506k6412l7110k731Q081l0793N1357J6399L1126
17484A60507M2695j4237O755m998J6348O3553J516j2829L145m534m3698k2051
17472A92172R858K083Q240J2001J9670k7131J2989K537k0119r393k884J8318L3167
17459B51508L9887J6713N0951Q6214m8872j20974o8620J7178j3524q066J3983
17448B16378M9714K209L65k6674K0129P905N7716J00167J64312J35688q5596j10419
17436E31894m0111n8368p4655n5628l9150k8965l3718L344k1958L0779L3350J5499
17424B62313j1367M131L4813k0739j321K2222N4201m1047o0256K6678M1631N807
17412C17066J3026l2142O807K0537R007K5987M4839J6432n74j1692N50R832j1159
$$ plain form
17497 149055 139157 134486 136388 159096 150590 124178 87068 84337 92418 61625 112982 129381 160507
17484 160507 203202 188965 195720 190722 207070 270623 272139 259310 262455 257921 214223 192172
17472 192172 202030 204113 212353 224354 244024 216893 229882 232419 212300 202907 200023 218341 251508
17459 251508 291395 308108 359059 445273 396401 275427 206807 223985 210461 202395 216378
17448 216378 266092 268301 268666 241992 262121 270026 327742 427909 592221 727909 642313 531894
17436 531894 491783 433415 358760 303132 263982 235017 201299 204643 182685 213464 246814 262313
17424 262313 250946 255077 289890 269151 267830 290052 344253 303206 242950 269628 311259 317066
17412 317066 330092 297950 304757 325294 334301 360288 405127 421559 420985 409293 409843 419675 408516
17399D08516k4834k273J8939L8647L3091L4730J9195k4556m0459j7362K6541Q7936
17387E58111O5012L5621J09l3821P799O0569J3302o671J7682J09691P2088k070
17375H97422N3747P2740P0880K0395L6257N7406N8667M6556Q1026J07494J11742
17364A614332R9229J07168J82449K06898K52403L78374N92741P67386M64017n1025
17354D613972j65288q0650R452R9110K43539L14601N03251Q15470R87970J127456
17344H468883J432722J737888K182166K895229M142563O121832R215911J4286855
17336E0484049K3720765M3862073Q4703770J13064074N0698610m4128149o7298672
17329B55106520n2166217m9803197m8495504l6042222k2133292j3074409q200809
$$ plain form
17399 408516 383682 381409 400348 438995 472086 506816 526011 501455 460996 443634 470175 558111
17387 558111 623123 658744 658853 625032 632831 693400 706702 700031 717713 827404 899492 897422
17375 897422 951169 1023909 1094789 1115184 1151441 1208847 1267514 1314070 1395096 1502590 1614332
17364 1614332 1713561 1820729 2003178 2210076 2462479 2840853 3433594 4200980 4664997 4613972
17354 4613972 4448684 4368034 4377486 4476596 4720135 5034736 5537987 6353457 7341427 8468883
17344 8468883 9901605 11639493 13821659 16716888 20859451 26981283 36197194 50484049
17336 50484049 74204814 118066887 202770657 315834731 366533341 322405192 255106520
17329 255106520 202940303 153137106 104641602 68599380 46466088 33391679 25190870
17322B5190870n819767m350456l140486k268014j659379j238175r87127q25271
17314D902195n96506l90936l36164k62276j33201J49509L63770m7820m23462m72643
17304B752466l79786l79487l72698k95353j53221j04030j09439q7483n5507l5371
17294G80091l1579l3554l4563r3995n6586j499K8k0413k5853j5075J9503r799
17282D76706k3011m8471n8860q2770k4910J2627M163J4650L6636m888n1737m9508
17270B00627K1976N742K2434j9521n7165n5053n846K8386J8249J7046J8639o7621
17258A27893n0534L4959J1597j3248K3929j83l0628N815n728m882J425m5024k9984
17245B5407k1891O579K2947L5062J7684p986j7803n2519K5382L7213k0961m971
$$ plain form
17322 25190870 19371103 15020647 11880161 9612147 7952768 6714593 5727466 4902195
17314 4902195 4305689 3914753 3578589 3316313 3183112 3332621 3696391 3648571 3225109 2752466
17304 2752466 2372680 1993193 1620495 1325142 1171921 1067891 958452 870969 815462 780091
17294 780091 748512 714958 680395 586400 529814 528315 528343 507930 482077 467002 486505 476706
17282 476706 453695 405224 346364 263594 238684 251311 255474 270124 306760 301872 250135 200627
17270 200627 222603 228345 250779 231258 174093 119040 113194 141580 159829 176875 195514 127893
17258 127893 77359 112318 123915 110667 134596 134413 103785 109600 103872 98990 100415 55391 25407
17245 25407 3516 10095 33042 68104 85788 77802 59999 7480 32862 70075 49114 44143
17233D4143J7479K6622L5058k9401l7486J4075k8083j6601M031K4817j300R854
17221F3208k1751k3733l2538j0890j3098M8935l572m5174O736K9064J8584K5923
17209D1694m2314J1808j7313M1799K0840j6676J7162J1658j8275j3306l015k7492
17197F570n2153k9660L1014R926k4533K7631K6706j4240m549j042k1542k2177
17185f8049L4491k4174k1667L5750P197k8470M9592J0546J5366P510J5345k2599
17173A0838J9028L5238r106R522P383m7609j5310l7545n634Q151K2838K008K206
17160B008N760k9658n9750k098J581m533M2337k5435n3677n5330Q590L2620j1982
17147a49567L6367J9612O4758L2904q566j21L1820J9014o041m2178K9022j3681
$$ plain form
17233 44143 61622 88244 123302 93901 56415 70490 42407 25806 29837 54654 53354 63208
17221 63208 41457 17724 -14814 -25704 -38802 10133 6561 -38613 -31877 -2813 15771 41694
17209 41694 -620 11188 -6125 35674 56514 39838 57000 68658 50383 37077 34062 6570
17197 6570 -45583 -75243 -44229 -34303 -58836 -31205 -4499 -18739 -23288 -24330 -45872 -68049
17185 -68049 -33558 -57732 -79399 -43649 -36452 -64922 -15330 -4784 10582 18092 33437 10838
17173 10838 29866 65104 55998 65520 72903 25294 9984 -27561 -33195 -25044 -2206 -198 2008
17160 2008 7768 -21890 -81640 -83738 -82157 -86690 -44353 -69788 -123465 -178795 -170205 -137585 -149567
17147 -149567 -113200 -93588 -28830 4074 -4492 -4613 27207 46221 40180 -1998 27024 13343
17135A3343m1037K2043j1790j3958m3718N758L9686N6866N041q671k2007j8967
17123a7411j664K0516J7024K4839l0676k0463k1275l2641L8200k303l3008J1836
17111d7026m5509k3587L3930k8723j1474M8098K0257Q5182k7456j2878M4214j1771
17099B3257o994J7528J2141k8778J314K2698K504l0889Q533k3591m0068j1895
17087e4240j3095L1537N6815j1831k1799L4209J4573M2721j2876m7274l8268j0838
17075c0366k0078k4381N4265O0982J4050q691J9048k4841J1450L6401l6939m184
17063D6716J1762k80l1189p150L125M018m4944m0634p253k392K1920o663O564
17050d6400J76q842L1627L4561o451R954r713n785k045P811j1128P391K8459j499
$$ plain form
17135 13343 -27694 -5651 -17441 -31399 -75117 -69359 -29673 27193 32234 23563 1556 -17411
17123 -17411 -19075 1441 18465 43304 12628 -7835 -29110 -61751 -23551 -25854 -58862 -47026
17111 -47026 -92535 -116122 -82192 -110915 -122389 -74291 -54034 31148 3692 -9186 35028 23257
17099 23257 16263 33791 45932 17154 18468 41166 43670 12781 21314 -2277 -42345 -54240
17087 -54240 -67335 -35798 21017 9186 -12613 21596 36169 78890 66014 18740 -19528 -30366
17075 -30366 -50444 -74825 -20560 40422 54472 45781 64829 39988 51438 87839 50900 46716
17063 46716 58478 58198 27009 19859 22984 27002 -17942 -58576 -65829 -68221 -46301 -52964 -46400
17050 -46400 -46224 -55066 -23439 11122 4671 14625 4912 -873 -2918 4893 -6235 1156 29615 28116
17036B8116J0479O010K5264K138L7742J4950l1649o079K0281m0977r113J6952
17024G4114m9012l7353k8597J2651J1169m7782J4037p870l1105J9470L3705L3068
17012c505k117l7172l5116l512K9725n777n737K6919r055J3946R983q202j6785
16999d6405j5431J3449J6888P766m681m251J2714N590M5441j5849K4932l8954
16987A209l5123o770M3397K0099M4719L814n7190m4511R506J384j4481k0516j3066
16974f7529J0019p722J9028k2575J4255M1184q91k1238q416m343m0878n170L6254
16961e8022L9659J9302r423m5582K2543L7572l3098n5429k3746j4520J6116J5455
16949h9173j4628j2631L0731J2399L9129j5661l194N61p563N0084O441k614m2568
$$ plain form
17036 28116 38595 44605 69869 72007 109749 124699 93050 86971 107252 66275 57162 74114
17024 74114 25102 -12251 -40848 -28197 -17028 -64810 -50773 -58643 -89748 -70278 -36573 -3505
17012 -3505 -5622 -42794 -77910 -81422 -51697 -57474 -63211 -36292 -45347 -31401 -21418 -29620 -46405
16999 -46405 -61836 -48387 -31499 -23733 -28414 -32665 -19951 -14361 31080 15231 40163 1209
16987 1209 -33914 -40684 2713 22812 67531 71345 14155 -30356 -20850 -19466 -33947 -54463 -67529
16974 -67529 -57510 -65232 -46204 -68779 -54524 -13340 -14231 -35469 -43885 -48228 -89106 -94276 -58022
16961 -58022 -18363 939 -8484 -54066 -31523 6049 -27049 -82478 -106224 -120744 -104628 -89173
16949 -89173 -103801 -116432 -85701 -73302 -34173 -49834 -53028 -52467 -60030 -9946 -3505 -6119 -48687
16936d8687j3890L3388L7140J2894O253O703j2754l9075J761j0195j5467J2169
16924b9760L1330j3935j3904j2141L6897J4812j0350J301J994J4556j6495o5691
16912f1386j5413p096J3427M4193L0339J03k9558k5631J6586K5549j5077J2366
16900a1598r387j7403j1519K0236J0931J7189k8975m1563P95K40J0541M1340j2261
16887c1434R464J8447j997l3457j6479K931k5568L483L6988K4818J7891k912k5030
16874b2855j6766Q546K0021J1363m9841K2561J1903O918J8818j4199j9037k1146
16862d3714J1090L3364Q922R001m1578k2580K2616N3035j9418l9690M2480j0025
16850C503k8301k9750M655O1364q765o1974J1415l515O754O889M9548M7885r125
$$ plain form
16936 -48687 -62577 -29189 7951 20845 27098 33801 21047 -18028 -16267 -26462 -41929 -29760
16924 -29760 1570 -12365 -26269 -38410 -1513 13299 2949 4250 6244 20800 4305 -61386
16912 -61386 -76799 -83895 -70468 -26275 4064 4167 -25391 -51022 -34436 -8887 -23964 -11598
16900 -11598 -20985 -38388 -49907 -29671 -18740 -1551 -30526 -72089 -71294 -71054 -60513 -19173 -31434
16887 -31434 -21970 -3523 -5520 -38977 -55456 -52525 -78093 -74610 -37622 -12804 5087 2175 -22855
16874 -22855 -39621 -31075 -11054 309 -49532 -26971 -15068 -8150 10668 -3531 -22568 -43714
16862 -43714 -32624 740 9662 18663 -22915 -45495 -22879 30156 10738 -28952 13528 3503
16850 3503 -24798 -54548 -49893 11471 2706 -59268 -47853 -51368 -44614 -37725 11823 59708 50583
16837E0583p4357n2095J1673Q919n8461k8949O527r693j2331K6140M5655L5992
16825e0397J9844K2678l0569J5225l5850K1238J3449J1951l308j1460k0747J9240
16813b8706l3787L2760K1179J70K3293p534q205o1408J7426m819l3652L5143J0214
16800c7926L6289K1527m5180J1152O112p031l1283R08N1450O062l7225j3610J0166
16787b8589K6853p140J0154j8423l0079L0206N3068m0377j0079J0275j0746m853
16775a9730L1109M3028l7911j6856J3876p049J5231n0052k5982K6935K2815l2529
16763c7115o998n343N5086O6689L5637m6832m6079l3086j9697P196j4284K3582
16751b1244K80r267k9183J0267L0085K3602k2901k296l9608j6567J5964M7021
$$ plain form
16837 50583 -23774 -75869 -64196 -55277 -113738 -142687 -136160 -145853 -158184 -132044 -86389 -50397
16825 -50397 -30553 -7875 -38444 -23219 -59069 -37831 -24382 -12431 -15739 -27199 -47946 -28706
16813 -28706 -62493 -29733 -8554 -8384 14909 7375 -830 -62238 -44812 -49631 -83283 -48140 -37926
16800 -37926 -1637 19890 -25290 -14138 -8026 -15057 -46340 -45432 6018 12080 -25145 -38755 -28589
16787 -28589 -1736 -8876 1278 -17145 -47224 -17018 36050 -4327 -14406 -4131 -14877 -19730
16775 -19730 11379 54407 16496 -360 13516 6467 21698 -28354 -54336 -27401 -4586 -37115
16763 -37115 -44113 -49456 5630 72319 107956 61124 15045 -18041 -37738 -30542 -44826 -21244
16751 -21244 -20964 -30231 -59414 -49147 -19062 4540 -18361 -20657 -60265 -76832 -60868 -13847
16739a3847M491l0102J9370K3739O579J1916J5510K1820J6415K4643L3203K6217
16727A59954K4122O0845J06279J37334K20672L87467M84958K94645j11233l14571
16717A450472l10320l03596k84034k03611r7667o2927l8486n7114k1863K7547
16707I8401Q237J712o7012m8209J3638J3411K4016Q989j9093l4729o4594k3056
16695h8289M4485L3372L2810j478k3980n628k6992K5467L5860K8048r419j453
16683D2803j1361J6134J4567J8182J9274L922l2937k1520k4388l0967k7632J6455
16671a7468K2738O210q562k4905k3593K067q926J5395L4300J8636N235k2019P4152
16658G3260J4550l1671n044J40n750K8086P524j7980j7647m1365L770p540r609
$$ plain form
16739 -13847 -9356 -39458 -20088 3651 10230 22146 37656 59476 75891 100534 133737 159954
16727 159954 184076 244921 351200 488534 709206 1096673 1581631 1876276 1765043 1450472
16717 1450472 1140152 836556 552522 348911 251244 188317 149831 92717 70854 98401
16707 98401 106638 108350 41338 -6871 6767 20178 44194 53183 34090 -639 -65233 -88289
16695 -88289 -43804 -10432 22378 20900 -3080 -8708 -35700 -10233 25627 53675 44256 42803
16683 42803 31442 47576 62143 80325 99599 103521 70584 49064 24676 -6291 -33923 -17468
16671 -17468 5270 11480 2918 -21987 -45580 -43513 -52439 -37044 -2744 15892 21127 -892 73260
16658 73260 87810 56139 51095 51235 45485 73571 81095 63115 45468 4103 7873 333 -9276
16645i276J3959P46J6073K040k1725m9149j2746N675N820N173K717n7002l100
16632a00795O1209R795j6493L3321J7223l2564m569j3241L1390M2065J3181j6459
16620B4063j1030l7880K328q359m958Q171R493o090m8068k1215K1639R420j8108
16607h0594M5797K961k6891m561L8889L5290j6314o976K88J1455k94j1636k9041
16594d1627K023J3589Q919j7436P867k123J0507j6260M811K3145J2486J3208j6124
16581B985m2000J720N147K4246N5420M6372k7139l3018p9767o2101r08N2663J1669
16568d4711L11k3541J9963K7040j2904n0607K785L3007L0904K8930K8793n6083
16556a6113j7271j3402o320J230j8340J4609J1997r123J0419n300J108j7706M0601
$$ plain form
16645 -9276 4683 5429 21502 23542 1817 -47332 -60078 -54403 -48583 -43410 -40693 -97695 -100795
16632 -100795 -39586 -29791 -46284 -12963 4260 -28304 -32873 -46114 -14724 27341 40522 24063
16620 24063 13033 -24847 -22519 -30878 -35836 -27665 -18172 -24262 -72330 -93545 -71906 -62486 -80594
16607 -80594 -34797 -31836 -58727 -63288 -24399 10891 -5423 -12399 -12111 -656 -950 -12586 -41627
16594 -41627 -39604 -26015 -17096 -34532 -26665 -28788 -18281 -34541 -29730 -6585 5901 19109 2985
16581 2985 -39015 -37295 -32148 -7902 47518 93890 66751 33733 -46034 -108135 -109043 -56380 -44711
16568 -44711 -44400 -67941 -47978 -20938 -33842 -84449 -81664 -48657 -17753 11177 39970 -16113
16556 -16113 -33384 -46786 -53106 -51876 -70216 -55607 -43610 -52733 -42314 -47614 -46506 -64212 -23611
16543b3611J2623j8251k296k8625j5587K9065K0597j1003O0190M3291Q791l9248
16531C5936l1343k4551r666J1361M0182J8904n3339m6556O090M8053N4860L2605
16519H2536m2196l945J6332j5042p775j4796m878M232J0297K5661J874l3564j4229
16506D507k4564P139M7927l8211l1991j6064L332J9562J2106O767J6062l970R170
16493A1772j5093j0552m3934r810K7391L9980J3978O873J2128o995j7726O90k9794
16480b1092K0724J7851J420J5336k1166j5702J3125K8408P660k1663m5839O851
16468a4087m268j2137J5078J7587j7382M1611L1544k6647j0313N194J2019J1222
16456D9421k4792l2574N584L1008K2100l0364k8247k1940K8732q01l9845n5107
$$ plain form
16543 -23611 -10988 -29239 -31535 -60160 -75747 -46682 -26085 -37088 23102 66393 75184 35936
16531 35936 4593 -19958 -29624 -18263 21919 40823 -12516 -59072 -52982 -4929 49931 82536
16519 82536 40340 36395 52727 37685 29910 15114 10236 14468 24765 50426 52300 18736 4507
16506 4507 -20057 -12918 35009 -3202 -35193 -51257 -47925 -28363 -16257 -9490 6572 2602 11772
16493 11772 -3321 -13873 -57807 -67617 -40226 -246 13732 20605 32733 25738 8012 8702 -21092
16480 -21092 -368 17483 18903 34239 13073 -2629 10496 38904 46564 24901 -20938 -14087
16468 -14087 -18355 -30492 -15414 2173 -15209 26402 57946 31299 20986 26180 38199 49421
16456 49421 24629 -7945 -2361 28647 50747 20383 -7864 -29804 -1072 -1873 -41718 -96825
16444i6825Q668J3372J2069p634K3945j0381K6877N5186R599m6870j5117R947
16432a7164q108k2731L6918K1671J0805K0382L187j9526K1968m6372k2028K4801
16420C803o658j497j7677O025K2313k252k3373P81k0795J0816o261j8146l059
16407e5980j2961j305K8258j3259k2109L9068M3861K0053M577j7335k1396k83
16395h811N363J737M732k9879k3182N328K3112K2054R501K3605L553j5531k336
16382A9246Q544o086j2777K1236K3505J3540O413k1448P623k6514J8995l2422
16370A9855j3752P723K4247L3313k0763j9560L0616l9309m6416l300L268L8565
16358A4487L3653N750k198j8555k519k2374n494J6655o882m7669J0231N6802K4858
$$ plain form
16444 -96825 -88157 -74785 -62716 -70350 -46405 -56786 -29909 25277 34876 -11994 -27111 -17164
16432 -17164 -25272 -48003 -11085 10586 21391 41773 44960 25434 47402 1030 -20998 3803
16420 3803 -2855 -4352 -22029 -16004 6309 4057 -19316 -18535 -39330 -28514 -34775 -52921 -55980
16407 -55980 -68941 -70246 -41988 -55247 -77356 -38288 5573 25626 30203 12868 -8528 -8811
16395 -8811 -3448 -1711 3021 -26858 -50040 -44712 -21600 454 9955 33560 37113 21582 19246
16382 19246 27790 21704 8927 30163 53668 67208 73621 52173 59796 33282 52277 19855
16370 19855 6103 13826 38073 71386 50623 31063 61679 22370 -24046 -27346 -24078 14487
16358 14487 48140 53890 51692 33137 30618 8244 2750 19405 12523 -35146 -24915 31887 56745
16345E6745o948j9604J3119K8560l7466k4933n2405J0660L1459J217K9014J2779
16333D2197L5250Q244m7339o342q935m2572l6400k3544J5676K9138K8410N4267
16321D8050j4135m5139k1804Q706K4468M2486J0595n2744j6492j8579k718k3016
16309f0322k5922j1452K5409Q208N2758L5006j3074J99N246J523k3099L2126k886
16296B3720j2835J7729K5973L109n7439l6558J4929P029j9438l7786K677Q025
16284f0865L0261J9113m201J011K6885J7600k7370q792M3181k5002m2134O618
16272b3695L4970J3646m746j9029q050L946m998Q391K2048k5230j0522k4039k781
16259d0089P138l9174J0976L6332l432K0855m407P399j2808J1694K8875m484j5402
$$ plain form
16345 56745 49797 30193 43312 71872 34406 9473 -42932 -32272 -813 404 29418 42197
16333 42197 77447 85691 38352 32010 23075 -19497 -55897 -79441 -63765 -34627 -6217 48050
16321 48050 33915 -11224 -33028 -24322 146 42632 53227 483 -16009 -34588 -37306 -60322
16309 -60322 -86244 -97696 -72287 -64079 -11321 23685 10611 10810 16056 17579 -5520 26606 23720
16296 23720 10885 28614 54587 57696 257 -36301 -21372 -14343 -33781 -71567 -68890 -60865
16284 -60865 -30604 -11491 -15692 -14681 12204 29804 2434 -6358 36823 11821 -30313 -23695
16272 -23695 11275 24921 20175 1146 -6904 -2958 -7956 435 22483 -2747 -13269 -37308 -40089
16259 -40089 -32951 -72125 -61149 -24817 -28249 -7394 -11801 -4402 -17210 -5516 23359 18875 3473
16246C473n4613m6880q36L5438M608Q58K741K234j7926J0845M631k0196K2683
16233e2940M6265K4109l4469Q174n547R622K9607J8549k1734l4127M350N0965
16221D2824J4871m1778q960l6531K5754K1385J2366K1851l7720m3447K2556M1289
16209C4460m884N671L089m9992L097k6688n735K1364k7932o881m0274M5319P1709
16196B2323L2391k1962k9118j7759L390K7414J1203k996j5402K1763J9465k7057
16184B3655p3963j3695J5647K7121L3383J3918J6131K5807k6642j8894j0532J0538
16172B2474M2782q262o2412m7304J7173R347j670k455m3551J0277M1543M322K2940
16159E204k6776r499L1580N3054m0984l0576L3828L9648K3231m7043j8393M622
$$ plain form
16246 3473 -51140 -98020 -98856 -63418 -58810 -57952 -55211 -52977 -70903 -60058 -55427 -75623 -52940
16233 -52940 -6675 17434 -17035 -8861 -14408 -4786 24821 43370 21636 -12491 -8141 42824
16221 42824 57695 15917 6957 -29574 -3820 17565 29931 51782 14062 -29385 -6829 34460
16209 34460 29576 35247 38336 -11656 -8559 -35247 -40982 -19618 -47550 -54431 -94705 -49386 22323
16196 22323 54714 32752 3634 -14125 -10735 16679 27882 24886 9484 31247 50712 23655
16184 23655 -50308 -64003 -48356 -21235 12148 26066 42197 68004 41362 22468 11936 22474
16172 22474 65256 56994 -5418 -52722 -35549 -26202 -27872 -30327 -73878 -63601 -22058 -17736 5204
16159 5204 -21572 -31071 509 53563 12579 -17997 15831 55479 78710 31667 13274 17896
16147A7896J3068k9672j724p148K6572L9246l0237j5874L3331J1756m971l0182
16135B2061K566K317j6502L1488j0125J9m049j2564R025O791k8537J7772K9060
16122D9322j7661J5696K9491k813m1313k7910K0098O027k4644j0788N4079M8604
16110I8188J4165k1993N164k4924j7557n49M550m5875o1004j5789J8534L9413
16098g677L142n902J5898p940k7937K1371j4170P239J5149K0183o274J6473J7933
16085D7488L8490N801n6993k1169o323N620k8484O992j2579Q968K6072j9892l301
16072i310L786o890m3749L5728K6979J0145k1351q279k8316j7116R755J5471N0113
16059A6966j9002k6903K2329K9083K7712m7566n9247p153M1618L1657j9554j0456
$$ plain form
16147 17896 30964 1292 -432 -7580 18992 58238 28001 12127 45458 57214 52243 22061
16135 22061 24627 26944 10442 41930 31805 31824 27775 15211 24236 31027 2490 20262 49322
16122 49322 31661 47357 76848 74035 32722 4812 24910 30937 6293 -4495 49584 98188
16110 98188 112353 90360 95524 70600 53043 52494 57044 11169 -49835 -65624 -47090 -7677
16098 -7677 -4535 -10437 5461 -2479 -30416 -9045 -23215 -15976 -827 19356 13082 29555 47488
16085 47488 85978 91779 34786 13617 7294 12914 -15570 -8578 -21157 -12189 13883 -6009 -9310
16072 -9310 -5524 -12414 -56163 -20435 6544 16689 -4662 -12941 -41257 -58373 -48618 -33147 16966
16059 16966 -2036 -28939 -6610 22473 50185 2619 -56628 -63781 -22163 9494 -10060 -20516
16047b0516j0943J9447M1192J1470m7624K3142J5653M3431l1067l3000j8728K2581
16035A5038j0572J9179l6569l5385K6326J6008K0826L2761m4134k2139J4020l931
16023h572J0186j0266J1790M6914K6491l0255L689N256m8804k0558K9993O256
16011B2120k1401J4677j2469l014L596J3592K2191j9978p520J2001L1044k1837
15999C3002o2407N676J2723k2274K9304j0530m185L5045N0142J0353K327r944
15987F9232n3502m9897L0193M3874L980P54k0541J5431j579l2093K094k9555o464
15974b8073j6765j4007K7520K8785J7076J280J3081K3793L626l7784j4617N437
15962I352L2944P264l3329J3452j2036l3879p725K6657k2393k4619k3959J8447
$$ plain form
16047 -20516 -31459 -12012 29180 40650 -6974 16168 31821 75252 44185 11185 -7543 15038
16035 15038 4466 23645 -12924 -48309 -21983 -5975 14851 47612 3478 -18661 -4641 -8572
16023 -8572 1614 -8652 3138 50052 76543 46288 49977 55233 6429 -14129 15864 22120
16011 22120 719 15396 2927 -87 3509 17101 39292 19314 11794 23795 54839 33002
15999 33002 -29405 -23729 -11006 -33280 -3976 -14506 -18691 16354 66496 76849 79176 69232
15987 69232 15730 -34167 -3974 39900 43880 44634 24093 39524 37945 5852 7946 -21609 -28073
15974 -28073 -44838 -58845 -31325 -2540 14536 15816 28897 52690 56316 18532 3915 9352
15962 9352 42296 49560 16231 29683 17647 -16232 -23957 2700 -19693 -44312 -68271 -49824
15950d9824K6582J4846L189l2705K8948N0647L0128p85l2066l6148K499k2667
15938a7356j9833J7421K2298J5963j4138j7762J3588k9598j7967P331J9996O95
15926a9362L2505J2238K0886j1258R600r167J2972o0357L0045L6448m3999j9699
15914i148q316l315k0663l1823K2135m0666K4991J1841L2976J3388K5184L6031
15902E2615O602N079k5827j9653J7137L1130K6082k7141k7261n03J927l1671q396
15889A20j1597J745L1041J0669J6540p975p6942k2058L2121K4473N904P457n140
15876F358n6215k3776k518j4394m2464j4767L1489L3944J2040k1360O1710K7186
15864b767l4048p7141J727P4159R3259O260l049p403N501J3281q531k8272m2006
$$ plain form
15950 -49824 -23242 -8396 -5207 -37912 -8964 41683 71811 71026 38960 2812 5311 -17356
15938 -17356 -37189 -19768 2530 18493 4355 -13407 181 -29417 -47384 -40053 -20057 -19362
15926 -19362 13143 25381 46267 35009 44609 35442 48414 -11943 18102 54550 10551 -9148
15914 -9148 -17464 -20779 -41442 -73265 -51130 -91796 -66805 -54964 -21988 -8600 16584 52615
15902 52615 59217 64296 38469 18816 35953 67083 93165 66024 38763 38260 40187 8516 120
15889 120 -11477 -9732 21309 31978 48518 40543 -36399 -58457 -26336 -1863 4041 11498 6358
15876 6358 -49857 -73633 -76151 -90545 -133009 -147776 -116287 -82343 -70303 -91663 -29953 -2767
15864 -2767 -36815 -113956 -112229 -38070 55189 61449 58400 50997 56498 69779 61248 32976 -9030
15851i030J3283K9286K2033q386m0489n1981L7851L8538j4737m315k869l3724
15839b4540k6182j5332j880o084L0517J6541J9268K5568r307l3308k4774K3710
15827b5803J5910k2131m3170J3887K1572J3616L2261k5744j8736K5605K3621J418
15815A2306M765L399j5321m1462R08K3592L4604L2808k1006k1878L9156l1978
15803A9893o8365J2107J2613J3987L6584j3516K6810J5347j4135m2838K6120K6803
15791E1410m1992K3618O460m409L656J3849l8132j6324l1421L2819K1816l4472
15779a3122m5948j3284L2540p999m6421M1901K4323Q378L1241l643P314J936l219
15766A3997O567J3386k8617k7620k1639K7686L4485l123k7858J0714L1876j5995
$$ plain form
15851 -9030 4253 33539 55572 47186 6697 -45284 -7433 31105 16368 12053 9184 -24540
15839 -24540 -50722 -66054 -67934 -74018 -43501 -26960 -7692 17876 8569 -24739 -49513 -25803
15827 -25803 -9893 -32024 -75194 -61307 -39735 -26119 6142 -19602 -38338 -12733 10888 12306
15815 12306 17071 20470 5149 -36313 -35405 -11813 22791 55599 34593 12715 51871 19893
15803 19893 -48472 -36365 -23752 -9765 26819 13303 40113 55460 41325 -1513 24607 51410
15791 51410 9418 33036 39496 35087 38743 52592 14460 -1864 -33285 -466 21350 -13122
15779 -13122 -59070 -72354 -39814 -47813 -94234 -52333 -28010 -19632 11609 7966 15280 17216 13997
15766 13997 20564 33950 5333 -22287 -43926 -16240 18245 15122 -12736 -2022 29854 13859
15754A3859k2494j3638Q233K8226J88M381j1604l226j918o091M5103O0935n701
15741I6253k631j0962n7648l5627R055K3223l6010M033M3287J5920O415k4928
15729C0380l4148j546J694K3931J9831n7141q571J2954k5226P157P635M4713L4451
15716E6114l1518j0966l2098j7700l604M4256R442j2169m015l082Q916J2487J1170
15703B7233K3522o375r974J0721l5977k4979K2058K4372j6496J8822q827j9787
15691D313K7886L3166M973m9624o4784l4248p522J3616K4152O4937K6263j2399
15679C0729k6792Q183L9460k3494N160P672M609j9427p0827j0562J9594J2420
15667b3275K491M1969R841J0078m765J9166K0814K1386k6051k8558l751j0606
$$ plain form
15754 13859 -8635 -22273 -14040 14186 14374 18755 7151 3925 2007 -4084 41019 101954 96253
15741 96253 93622 82660 25012 -10615 -1560 21663 -14347 -10314 32973 48893 55308 30380
15729 30380 -3768 -5314 -3620 20311 40142 -16999 -25570 -12616 -37842 -30685 -23050 21663 56114
15716 56114 24596 13630 -18468 -36168 -39772 4484 13926 1757 -2258 -5340 3576 16063 27233
15703 27233 50755 44380 34406 45127 9150 -15829 6229 30601 14105 32927 24100 4313
15691 4313 32199 65365 70338 20714 -44070 -78318 -85840 -72224 -48072 16865 43128 30729
15679 30729 3937 12120 51580 28086 33246 40918 45527 26100 -44727 -55289 -35695 -23275
15667 -23275 -20784 21185 31026 41104 36339 55505 76319 97705 71654 43096 39345 28739
15655B8739o087K8675J344l0676p4262k3016j1015m3203K7740N2001L1K4214j64
15642b5679l3922j4272K9750M8380M1213k0233o204k5079l603J562P654M7245
15630D6812M0090k7608n520N214L3774k0835J7612j4923m2361N522M260l2224
15618I813M0558l592j6501J643R363k7217J2995K4022J9899n4628k1205j1394
15606a6244J0966J2192q582q339O611L6323R345l4359j4274k3268j4549L472K9419
15593a1287K105m9118P476L3588l8628N6148o469P360k7955j9128L6029O935R899
15580F955K5249N532l4971k384L3208L1630R101l2791j7692m0704j9317j0205
15568d6389l2851k6683L4469K5849J8090j7122J4892K6629l5931k3569J9269K7407
$$ plain form
15655 28739 22652 51327 52671 21995 -52267 -75283 -86298 -129501 -101761 -49760 -49729 -25515 -25679
15642 -25679 -59601 -73873 -44123 4257 45470 25237 19033 -6046 -9649 -8087 -433 46812
15630 46812 86902 59294 53774 58988 92762 71927 89539 74616 32255 37777 42037 9813
15618 9813 50371 46779 30278 31921 41284 14067 27062 51084 70983 16355 -4850 -16244
15606 -16244 -5278 6914 -1668 -10007 -3396 32927 42272 7913 -6361 -29629 -44178 -40706 -11287
15593 -11287 -9182 -58300 -50824 -17236 -55864 284 -6185 1175 -26780 -45908 -9879 -2944 6955
15580 6955 32204 37736 2765 381 33589 65219 74320 41529 23837 -16867 -36184 -46389
15568 -46389 -79240 -105923 -71454 -45605 -27515 -44637 -29745 -3116 -39047 -62616 -43347 -15940
15556a5940M5182j0514k0093r707j5918J5804k0709j3686L4753L9388r293j8854
15544D13K2140o024L966Q38O456k0074p1362M143L5818N0850l577m9105O672n599
15530b4445j5808L7672J0703K742r811j0854K4298L9258N300R687m5940j7890
15518D912J9315J6857J0668n9549k1790j2279K2411K1132m4464q21M747K7572
15506a1289P429l385J1712l2782M839J5354k7581J4450L3757j9465p587L9555
15494B5007K2057J7060j5979l1091k0189l7561l719K0416j1990J1510J2147J7466
15482E134K3732l7823n3316O5429N3193p7604n0390J0276N707M5735K4868k3830
15470h889l4141J864l4339l6049l5604K5937N9645m716j6259M8414J3260J9974
$$ plain form
15556 -15940 29242 18728 -1365 -11072 -26990 -11186 -31895 -45581 -10828 28560 19267 413
15544 413 22553 16529 20495 21333 27789 7715 -63647 -59504 -23686 27164 23587 -25518 -18846 -24445
15530 -24445 -40253 -2581 8122 10864 1053 -9801 14497 53755 59055 68742 22802 4912
15518 4912 24227 41084 51752 -7797 -29587 -41866 -19455 1677 -42787 -43608 -38861 -11289
15506 -11289 -3860 -7245 4467 -28315 -23476 -8122 -35703 -21253 12504 -6961 -14548 25007
15494 25007 47064 64124 48145 17054 -3135 -40696 -44415 -23999 -35989 -24479 -12332 5134
15482 5134 28866 -8957 -62273 3156 56349 -21255 -71645 -61369 -55662 -9927 14941 -8889
15470 -8889 -43030 -41166 -75505 -111554 -147158 -121221 -61576 -66292 -82551 -34137 -20877 -903
15458i03J892k3338K2353n670K1692J3178J6817k649l3323l2455p730k7567j0316
15445f8019N0601L3625L8343k1265p1608k7961J8959r627K7449L0600K388K862
15433F347j4799K9693k638m244Q339J0005l6440L3796M0385l9128n0088O554K0135
15420G917K7570J3493M791k6375j7163K9548J3918p3381K1694L5441j3509n2081
15408b8137q825j416j2340j2265j1552L1435K6045j6674j7058k6580L656O7414
15396f297L2300J2570L006k8524l162L3288k1650n2585l1398K9645O2534j0635
15384A9092L870J2610N828J2438J3801j2553k595j6274n099K3743K8459n788k1510
15371E6022m3195k412k8203j2014J8815K5109K5492j5452q719R11k0946p355K7821
$$ plain form
15458 -903 989 -22349 4 -5666 16026 29204 46021 43372 10049 -22406 -30136 -57703 -68019
15445 -68019 -17418 16207 54550 33285 -38323 -66284 -47325 -56952 -29503 1097 3485 6347
15433 6347 -8452 21241 18603 14359 22698 32703 -3737 30059 70444 31316 -18772 -12218 7917
15420 7917 35487 48980 53771 27396 10233 39781 53699 -19682 2012 37453 23944 -28137
15408 -28137 -36962 -38378 -50718 -62983 -74535 -43100 -17055 -33729 -50787 -77367 -73711 -6297
15396 -6297 26003 38573 41579 13055 9893 43181 21531 -31054 -62452 -32807 29727 19092
15384 19092 22962 35572 41400 53838 67639 55086 52491 36217 31118 54861 83320 77532 56022
15371 56022 12827 10415 -17788 -29802 -10987 14122 39614 24162 15443 16354 -4592 -11947 15874
15358A5874J6923j2748j0214L3345K29n1985j6604M0134J2023l5836j3966k1100
15346d3925j3585M5571M0674q877k4651J4271o051M6338k7159m1577o442K0833
15334d580j9362R820L563j4964M0605K0028J4375J0992J922L0282k1717r947n83
15321F0434k4714l327K9223J4498p896j6526l0488J4903J1777j1721k7705k6259
15309a7801j2480m0126J7405M4137R091L2891r570p037k1125k6264j1458j9197
15297f1534j3534N4626K7596J472J2884j1631j3313L3241j1555l1356l517o884
15285b3505J4363J1103j1579L0313J780q47j6368k6918M3971k640k8547K1242
15273A2368J2715K3216K247K7873j7355j0491N329m6629J3827L0720j9898l2541
$$ plain form
15358 15874 32797 20049 9835 43180 43409 -8576 -25180 14954 26977 -8859 -22825 -43925
15346 -43925 -57510 -11939 28735 19858 -4793 9478 3427 49765 22606 -18971 -25413 -4580
15334 -4580 -23942 -14122 -10559 -25523 15082 35110 49485 60477 62399 92681 70964 61017 60434
15321 60434 35720 32393 61616 76114 68218 51692 21204 36107 47884 36163 8458 -17801
15309 -17801 -30281 -70407 -53002 -8865 226 33117 23547 16510 -4615 -30879 -42337 -61534
15297 -61534 -75068 -20442 7154 8626 21510 9879 -3434 29807 18252 -13104 -16621 -23505
15285 -23505 -9142 1961 -9618 20695 22475 21628 5260 -21658 22313 19673 -8874 12368
15273 12368 25083 48299 50546 78419 61064 50573 55902 9273 23100 53820 33922 1381
15261A381j7234K3706k3872Q833K3325K9508K8333N357L4212J4598l0086p622
15249I0439j7980r933l9577m8333j4483R274j0562j6885K7554J9838j4750L4000
15237H602K6238j424O45n883J3549l623K1594K2524l2298j5790j1762Q086k6522
15224C936j5060j095m0118K8198N4026K3199n0067k9933j825N684J4719N4535
15212D6199o655k7108o483J999J247l95l4302k9682K2241L821J0948L3377Q543
15199B3750l2492j692l9711L138n053K8814J5381j2756J2845j3783j0388L1927
15187b0M0864j4495J8165K1217m6316k758j6562k4168k915j2944j8208r609o930
15174g4679K6890J9003K3554R722M721j9563n699R418m982J2007R375l4968m344
$$ plain form
15261 1381 -15853 7853 -16019 -7186 16139 45647 73980 79337 113549 128147 98061 90439
15249 90439 72459 62526 22949 -25384 -39867 -30593 -41155 -58040 -30486 -10648 -25398 8602
15237 8602 34840 33416 34061 28178 41727 38104 59698 82222 49924 34134 22372 30458 3936
15224 3936 -11124 -12219 -52337 -24139 29887 53086 3019 -26914 -28739 -23055 -8336 46199
15212 46199 39544 12436 5953 7952 9199 8804 -25498 -55180 -32939 -29118 -18170 15207 23750
15199 23750 -8742 -10434 -50145 -47007 -52060 -23246 -7865 -20621 -7776 -21559 -31947 -20
15187 -20 40844 26349 44514 65731 19415 16657 95 -24073 -26988 -39932 -58140 -67749 -74679
15174 -74679 -47789 -28786 -5232 4490 9211 -10352 -16051 -6633 -11615 392 9767 -25201 -29545
15161b9545P13M8256N963k5483o263n7450l92O3249K3099J5151m921k2541M948
15148A4784L2891j3291j1224Q350k4366o542J7352L2624N674r265J1598k5321
15136C3264k6455j5519J7907L6144k2803p6827k8546N1385N3486j4M1512L2667
15124I6201K2515l5237o766l9873K535R472n238k2425k4141L195k0371N5087L4800
15111F9754k1372l1859j1782J4919O341n067J2024j4780O382m1256K5148J7048
15099B5500J6192j0702K475J6535j3779l1518K0963L0013l8088l1479L375L414
15087g099L1295L4134m1843j7253J7535o304p025J5332j8849l8485L6697j0710
15075a2575k0381J5879J3488J2471L2005n129P154j4509K2016J709m3315J2899
$$ plain form
15161 -29545 -28832 19424 25387 -96 -6359 -63809 -64201 -952 22147 37298 32377 9836 14784
15148 14784 47675 34384 23160 31510 7144 602 17954 50578 56252 46987 58585 33264
15136 33264 6809 -8710 9197 45341 22538 -54289 -82835 -31450 22036 22022 63534 96201
15124 96201 118716 83479 76713 36840 39375 48847 43609 21184 -2957 238 -20133 34954 69754
15111 69754 48382 16523 4741 19660 26001 20934 32958 18178 24560 -16696 8452 25500
15099 25500 41692 30990 33465 50000 36221 4703 25666 55679 17591 -13888 -10513 -7099
15087 -7099 24196 58330 16487 -766 16769 10465 3440 18772 -77 -38562 -1865 -12575
15075 -12575 -32956 -17077 -3589 8882 40887 35758 42912 28403 50419 52128 8813 21712
15063B1712J909l5864J7116L376r549J5543O419k6733M3246J603k0174l2187J4584
15050A001L4691K0945j2347M906k0538j2817L8062k492n2133k4105n1945r90P983
15037f9779M8500K2347J089J1670P491L6890l4435J4117j6153k1926k9081J8927
15025a0343k8991k3942N4597J2447k6479k4016k0299k0405K8530N3019l258P52
15013h388P074N190J0126N152m3142r906K0526q45L1140r592o290K0855L1171
15000E3071k3557r580k1099l6293l5128j6988J3726K9858J7059Q9084K4631l2055
14988E2729q386l899K939j3863M3912l0700l2247j2324M949j334K3913l183p979
14975A4527k2540k34p742L0258O448n036m5975kM4519j1626l047p369j1253J271
$$ plain form
15063 21712 23621 -12243 4873 8249 -1300 14243 20662 -6071 37175 38778 18604 -13583 1001
15050 1001 35692 56637 44290 49196 28658 15841 53903 51411 -722 -24827 -76772 -77762 -69779
15037 -69779 -21279 1068 2157 13827 21318 58208 23773 37890 21737 -189 -29270 -10343
15025 -10343 -39334 -63276 -8679 3768 -22711 -46727 -67026 -87431 -58901 -5882 -9140 -8388
15013 -8388 -1314 3876 14002 19154 -23988 -33894 -13368 -14213 16927 7335 1045 21900 53071
15000 53071 29514 19934 -1165 -37458 -72586 -89574 -75848 -45990 -28931 60153 84784 52729
14988 52729 44343 40444 43383 29520 73432 42732 10485 -1839 3110 1776 25689 22506 14527
14975 14527 -8013 -8247 -15989 14269 20717 15681 -30294 -30296 14223 2597 -450 -7819 -19072 -17801
14961a7801k4267o214j3422k7401J0155M5352K9507l3952J344L3276J7309M7901
14949F1787o4103Q916n369j9830J3257m835Q266l3237j7812K5415J176j7135l673
14936d7177o061J5482r956K4039L7634J3110j0434k1009l8455k7155o402J562
14924g4822L1797L8246o077p5632m6713o27M1553K0957J5755K07J0302J1136J0614
14911b3304J5258q034L5813R291k5857j6353k5936L238J7940J7325l6613m6447
14899h3679J9787M1089n636K1816J2476j5264l0016j7414p034J9196M1785J4299
14887A1405m7034j6402m395J1871K6456L0005J435L5788k4808L551K7326k4960
14875C0238m7029j445j7443J6124L4159L3276n3058k0070j4543K4591J4202Q700
$$ plain form
14961 -17801 -42068 -48282 -61704 -89105 -78950 -33598 -4091 -38043 -36699 -3423 13886 61787
14949 61787 -2316 6600 1231 -18599 -5342 -10177 -1911 -35148 -52960 -27545 -26369 -43504 -47177
14936 -47177 -53238 -37756 -47712 -23673 13961 27071 16637 -4372 -42827 -69982 -76384 -74822
14924 -74822 -43025 -4779 -10856 -86488 -133201 -133828 -92275 -71318 -55563 -55356 -45054 -33918 -23304
14911 -23304 -8046 -16080 19733 29024 3167 -13186 -39122 -35884 -17944 -619 -37232 -83679
14899 -83679 -63892 -22803 -28439 -6623 5853 -9411 -39427 -56841 -63875 -44679 -2894 11405
14887 11405 -35629 -52031 -56426 -44555 -18099 11906 13341 49129 24321 27872 55198 30238
14875 30238 -16791 -18236 -35679 -19555 14604 47880 -5178 -25248 -39791 -15200 -998 7702
14863G702n0114J1210J8039n399M1668J3008k4212l9056j4533J9501J718m628
14851b5096o845j0218M900J2178j6839l4139L1301K8832M255J0217K4035j211
14839B1370l029J0201k1009P981p718j2184k2535N456j3035l0132L2811K9903
14827a920M346p2117k0136M03L7629L6066M6957Q72k106r118k6633L6760J4360
14814D5363j1622q851k8017m3249K7204K8280l3423m3378o13j2956l569L7808
14802d7023L2564L3754j4399j160K4505j0142j5439j1669J8248L7884j6083N627
14790C6667J7177k3956k5514R463J6010K6012J2770m6565o657K535k0544l0349
14778c2951J3499N319K0881K5599K4601l8163k4479J8878J9299K0045r698m3003
$$ plain form
14863 7702 -42412 -31202 -13163 -18562 23106 36114 11902 -27154 -41687 -22186 -20468 -25096
14851 -25096 -31941 -42159 -37259 -25081 -41920 -76059 -44758 -15926 -11671 -1454 22581 21370
14839 21370 18341 28542 7533 15514 7796 -4388 -26923 -21467 -34502 -64634 -31823 -1920
14827 -1920 2426 -69691 -89827 -89424 -51795 -15729 31228 32100 29994 20876 -5757 31003 45363
14814 45363 33741 24890 -3127 -46376 -19172 9108 -24315 -67693 -68306 -81262 -84831 -47023
14802 -47023 -14459 19295 4896 3736 28241 18099 2660 -9009 9239 47123 31040 36667
14790 36667 53844 29888 4374 13837 29847 55859 68629 22064 15407 17942 -2602 -32951
14778 -32951 -19452 -14133 6748 32347 56948 18785 -5694 13184 32483 52528 42830 -173
14766a73j502O1212l4986l2166p964m5343l5913M9426K5853o525r194q024M4001
14753a298M6871J6902k6722k9219k5569L6997M36o109j8008K1256P644p122m0569
14740b4510j5174k576p32M7996L1053J5542M7469p088m4797l6185j4168J3823
14728A0653M9888J7583m0244j5773j7497P594R584n9716j5585J7496m896k360
14716d3273P328k0046K5536P1893J2286o2146k8618R533L7356j773j1310j0886
14704a4120N9329L6139J0311k7077r92M836j7894l4965k1703n6953J9927J0978
14692c2184j6584L6563R764j3702L414m979L290L494J445l166k0029L7959J7309
14679B2594K180l4006l1467j1014o881J1675M3760K0208n0681m1649M250O438
$$ plain form
14766 -173 -1675 59537 24551 -7615 -15579 -60922 -96835 -47409 -21556 -28081 -37275 -45299 -1298
14753 -1298 45573 62475 35753 6534 -19035 17962 18398 12289 -5719 15537 23181 16059 -24510
14740 -24510 -39684 -42260 -42992 5004 36057 51599 99068 91980 47183 10998 -3170 10653
14728 10653 60541 78124 37880 22107 4610 12204 21788 -37928 -53513 -36017 -40913 -43273
14716 -43273 -35945 -55991 -30455 41438 53724 -8422 -37040 -27507 9849 8076 -3234 -14120
14704 -14120 45209 81348 91659 64582 63590 68426 50532 15567 -6136 -63089 -43162 -32184
14692 -32184 -48768 -12205 -2441 -16143 -12729 -17708 -14418 -10924 -9479 -12645 -32674 5285 22594
14679 22594 24774 -9232 -40699 -51713 -58594 -46919 -3159 17049 -33632 -75281 -71031 -64593
14667f4593J5055R957J4838L9690k2669m6541O391k1512M8028K028K4417M2637
14655D7726k677j6419Q900r470n634l0994j1857K1856l8094J907L2355J5283K9300
14642D2182Q097p826J8897Q76l0415j1886j1571o592K3430n404j5341j3028N662
14629b919M472O354J2248L1903L6645m8424l061k6736l0747n781n984M7363l019
14616A2314j8474o264K3277n83q802q82j1474l8409m2486p852M4242N7664j6721
14603a4450o43L55J9038K0302K3057q794l3137n13k16l591m0151j8825K1055K1758
14589a4755j4828k0921M526M514L3081J09j2026l606j12L612J9545J754p332j6991
14575b3430J8810N2291J2613k5551n0949J104l3827p4509O1174N2684k7619q186
$$ plain form
14667 -64593 -49538 -39581 -24743 14947 -7722 -54263 -47872 -69384 -21356 -19328 5089 47726
14655 47726 45049 28630 37530 28060 22426 -8568 -20425 1431 -36663 -34756 -2401 12882 42182
14642 42182 50279 42453 61350 62226 31811 19925 8354 1762 25192 19788 4447 -8581 -2919
14629 -2919 1553 7907 20155 52058 88703 40279 37218 10482 -20265 -26046 -32030 15333 12314
14616 12314 -6160 -12424 10853 10270 1468 586 -10888 -49297 -91783 -99635 -55393 2271 -14450
14603 -14450 -15093 -14738 4300 24602 47659 38865 5728 5215 4999 1408 -38743 -57568 -36513 -14755
14589 -14755 -29583 -50504 -45978 -41464 -8383 -8274 -20300 -23906 -24018 -20406 -861 893 -6439 -23430
14575 -23430 -4620 47671 60284 34733 -16216 -15112 -48939 -123448 -62274 -9590 -37209 -45395
14563d5395R155L1896J8703K0616J7894m4376j6175j7256o580k635N2096J73k4508
14550f392j913L914k3768K4667L9920J1640L4600M3147K081n3089r1649K1765
14538D923J9714M45Q052l915o6265j0810P872j2995M8391M3538j1853R372j5785
14525B0684k5345m98Q070M2121J5030k9310k7750L119l224K297L6200k3499k501
14512A5394J0324K7298K7573m528P079L5975k8419q1797k1795J2868K102K858
14500D932K9578k5247l4951q689R047r817j1807j5273J5123J9034Q363m887j8921
14487d3515R483O4173K4956l3672q803J2068j2877O538K7332j1691k1471J701
14475A4222O131N81J0966o975l7261j6006N241k1085R821M7381L5611n996k1355
$$ plain form
14563 -45395 -36240 -4344 14359 34975 52869 8493 -7682 -24938 -31518 -34153 17943 18116 -6392
14550 -6392 -8305 -4391 -28159 -3492 36428 48068 82668 125815 127896 74807 -16842 4923
14538 4923 24637 25082 33134 29219 -37046 -47856 -39984 -52979 -4588 38950 27097 36469 20684
14525 20684 -4661 -5159 2911 45032 60062 30752 3002 6121 2897 5194 41394 17895 15394
14512 15394 25718 53016 80589 76061 83140 119115 90696 8899 -12896 -28 2074 4932
14500 4932 34510 9263 -25688 -34377 -25330 -35147 -46954 -62227 -47104 -28070 -19707 -24594 -43515
14487 -43515 -34032 30141 55097 21425 12622 24690 11813 18351 45683 33992 12521 14222
14475 14222 20353 20934 31900 24925 -12336 -28342 -23101 -44186 -34365 13016 48627 42631 21276
14462B1276l0906n7147O783K1621M164L8084J5570L8897R106p8397o5232j3303
14450h9484j4389M1307O3299k0406j369M1609K836P460J1977r353j0298j6170
14438G019o073M4374L2645n7590J524M5402J6718k910k0868J0772l484m7032j4233
14425F264L5190O6301k3880l0004k8489l0258k724L3201J8418m717j4418k5215
14413c31J1596M4394K7374K4732J5783m1824k9985k6164j3738p913L7533K9774
14401G1231o6755n3878K8149M4848L4418k2535n469j2739j3743p597L0945M1523
14389F8398k0968j3653k3662j8476L4687m1841J850p385m6939K3694M7739J3544
14377A6988P733l4263k8465L007K0882L3520K3177l7493j4591J8839k8193N7O2843
$$ plain form
14462 21276 -9630 -66777 -59994 -38373 -34209 3875 19445 58342 67448 -10949 -76181 -89484
14450 -89484 -103873 -62566 733 -19673 -21042 20567 23403 30863 42840 33487 23189 7019
14438 7019 946 45320 77965 20375 21899 67301 84019 81109 60241 71013 67529 20497 6264
14425 6264 41454 107755 83875 53871 25382 -4876 -7600 25601 44019 39302 24884 -331
14413 -331 11265 55659 83033 107765 123548 81724 51739 25575 11837 3924 41457 71231
14401 71231 4476 -49402 -21253 23595 58013 35478 30009 17270 3527 -4070 26875 68398
14389 68398 47430 33777 10115 -8361 26326 -15515 -13665 -21050 -67989 -44295 3444 16988
14377 16988 24721 -9542 -38007 -35000 -14118 19402 42579 5086 -9505 9334 -18859 -18802 44041
14364D4041K6389j5863o9043K240L1392p299o63j0243j8850N136n42k787N8921
14351D2829L9932k8514o1724K9288j1715K30L2473l2117l2673j8208M6774q881
14339b306j6101R609j0202j2060l1148N774M6638j236J002M4830j0476m6203k8055
14326d9934J828j2832l5167J0657N5871j05k1389M1305K1836L3258q362l1386
14314E580J5202M9096j0964n5379Q110K6333l1462J9314P8800o204m0355l2270
14302B5801k7187J6569j1987l0123k7402J2654K2690l655M558j0755Q167P563
14290a3107k7652k589k8996k8407O5019M1024Q169K7672N515n5722J7950J5159
14278B4035M1460k6993j2703L547K4330k7708j8393k1852P303J679j702m067N755
$$ plain form
14364 44041 70430 54567 -14476 -12236 19156 11857 11194 951 -17899 -12763 -13305 -16092 42829
14351 42829 82761 54247 -7477 21811 10096 10326 42799 10682 -21991 -40199 6575 -2306
14339 -2306 -18407 -8798 -19000 -31060 -62208 -56434 -9796 -11032 -10030 34800 24324 -21879 -49934
14326 -49934 -48106 -60938 -96105 -85448 -29577 -29682 -51071 -9766 12070 45328 36966 5580
14314 5580 20782 69878 58914 3535 11645 37978 6516 25830 104630 98426 58071 25801
14302 25801 -1386 15183 3196 -26927 -54329 -41675 -18985 -22640 -18082 -28837 -20670 -13107
14290 -13107 -40759 -43348 -72344 -100751 -35732 5292 13461 41133 46648 -9074 8876 24035
14278 24035 65495 38502 25799 29346 53676 25968 7575 -14277 -6974 -5295 -6997 -11064 -5309
14265e309m807j6829L1705L70l8446J5742O6186K3102o9815p4115K169L6232O8421
14252C4606K2657M1450k5770l5077k8748j5450P662Q327P810j1002K953k8220
14240a8802O197l3851j6623L0321J4630M2787r529J9785K8943J4929j269j19m7202
14227C0197r293J018j524j7238L1764k2062k5205l3918L263K5822j6061J671L3964
14214B398K3851J2686l9627k1473j0194O758J9331M1878l5654m8257L9164P2109
14202F2970o469k7619j5037m9549K7960K4982J5202Q508j9446l709K6858l7033
14190G618l3489J1693L544K8132Q947K2041L9346k2368o5514j1399L9053J3954
14178D1558k0256n3097J2766M8023n172l8861j9869L3928K4706J5477M705r132
$$ plain form
14265 -5309 -10116 -26945 4760 5130 -33316 -17574 48612 71714 1899 -72216 -70047 -33815 34606
14252 34606 57263 98713 72943 37866 9118 -6332 1330 9657 17467 6465 9418 -18802
14240 -18802 -12605 -46456 -63079 -32758 -18128 24659 15130 34915 63858 78787 77518 77399 30197
14227 30197 20904 21922 20398 3160 34924 12862 -12343 -46261 -42998 -17176 -33237 -31566 2398
14214 2398 26249 38935 -692 -22165 -32359 -25601 -6270 35608 -46 -48303 -9139 62970
14202 62970 56501 28882 13845 -35704 -7744 17238 32440 40948 21502 17793 44651 7618
14190 7618 -25871 -14178 -10634 17498 26445 48486 87832 65464 -50 -11449 27604 41558
14178 41558 21302 -31795 -19029 28994 23822 -15039 -34908 -980 23726 39203 43908 34776
14166C4776j959R478k1940m7988J1654K0973N3024k6701l654K634j754k1535K0758
14153B7766k416o278p591j1027J582J8972k8294l8300R816j6128O454j2425J6458
14140d1411J4436q247L946P516L0798J093L874P828j0367J4079p2478l6611K5550
14127e9994L7742j071n441k5753j4445k3482N5630L105j3263J1831L3875J9059
14115A7793K859L110l629K5250j839o0719M681M0600L6648l549j5230l879K2968
14102F5064P856l7350j6943m210k5129l0542j9518J8237K3575J1445K0463k3660
14090a0712K0636O598J0788j430l2986j7293k1145j9654K8666K0143J103k3331
14078c8617n0483k5642j9775P741R0353L1261j8890k204r493j8473M4985J6373
$$ plain form
14166 34776 32817 42295 20355 -27633 -15979 4994 58018 31317 27663 30297 28543 7008 27766
14153 27766 25350 19072 11481 454 2036 21008 -7286 -45586 -35770 -51898 -45444 -57869 -41411
14140 -41411 -26975 -35222 -31276 -23760 7038 8131 12005 19833 9466 23545 -48933 -85544 -59994
14127 -59994 -22252 -23323 -28764 -54517 -68962 -92444 -36814 -33709 -46972 -35141 -1266 17793
14115 17793 20652 23762 20133 45383 43544 -17175 -12494 28106 64754 61205 45975 42096 65064
14102 65064 72920 35570 18627 14417 -10712 -41254 -60772 -42535 -18960 -7515 12948 -10712
14090 -10712 9924 16522 27310 25880 -7106 -24399 -45544 -65198 -36532 -16389 -15286 -38617
14078 -38617 -89100 -114742 -134517 -126776 -36423 -5162 -24052 -26256 -35749 -54222 -9237 7136
14066G136L4915q660p70j9944k2214N0797j8447k1719j0782j8905N162J5470k1505
14053b9466J1839L4006M2140j2614K0600l7966m861K2424J2916O063J0938m916
14041G1103m2382l3873J0836L7084k8922j7260K8447j6503K2836j8500K4180L4085
14029G1131Q466l9997J0282j0474q834J9181j0034l1485Q046J9031p046l9890
14017a1623L2901J1741k7557k1545k374J8199J6204K1398k5675k6575J8312M4501
14005D7907J3774l3848k0628j6822n830k187j2813P578L8175j4201l0178L016
13993b6057M2612m783K4594q988m508k9722J0258L5620K5414k2833l3237j5050
13981f680J4681m7177J4656O452J3511L394J8993N9447k1854j9072o53k753Q391
$$ plain form
14066 7136 42051 33391 32621 12677 -9537 41260 22813 1094 -9688 -28593 -23431 -7961 -29466
14053 -29466 -17627 16379 58519 45905 66505 28539 23678 46102 59018 65081 76019 71103
14041 71103 28721 -5152 5684 42768 13846 -3414 25033 8530 31366 12866 37046 71131
14029 71131 79597 39600 49882 39408 30574 49755 39721 8236 16282 35313 28267 -11623
14017 -11623 21278 33019 5462 -16083 -18457 -258 15946 37344 11669 -14906 3406 47907
14005 47907 61681 27833 7205 -9617 -15447 -17634 -30447 -22869 15306 1105 -29073 -26057
13993 -26057 16555 11772 36366 27378 22870 -6852 3406 39026 64440 41607 8370 -6680
13981 -6680 8001 -39176 -24520 -18068 -4557 -1163 17830 77277 55423 36351 35698 32945 41336
13968D1336J1069n0189o1596J0455N0154N774l8408R779J4257k2193q828o448
13956d4838l0406m263l3834L0192O4861O6603k3209k4775k325j6798k4789J599
13944d1982R230n648N046J7614J5555M549j2458j4808q677K7508K9815K8362n9081
13931d975M896J8028N4208K0880n7273n8853r228L0802J9175n0429m3478J7778
13919e8469P5647P506r479K3704j9770k2k978L719L090L6370L5897m1592l1446
13906B2177J8195J8090n1535j9254L5219J8410J9206j5805l1773N950J4025q143
13894B4762l7516m549j5481j4052M9408J329j4581O830O566J2560k3631j4353
13882b2708r7M1887L4647l9797N548M5482L8301K3615l5226J535K105k2771j7284
$$ plain form
13968 41336 52405 2216 -59380 -48925 1229 7003 -31405 -21626 -7369 -29562 -38390 -44838
13956 -44838 -75244 -79507 -113341 -83149 -18288 48315 25106 331 -1994 -18792 -43581 -41982
13944 -41982 -32752 -38400 -33354 -15740 -185 4364 -8094 -22902 -31579 -4071 25744 54106 -4975
13931 -4975 -79 17949 72157 93037 35764 -23089 -32317 -1515 17660 -32769 -76247 -58469
13919 -58469 17178 24684 15205 38909 19139 19117 16139 19858 22948 59318 95215 53623 22177
13906 22177 40372 58462 6927 -12327 22892 41302 60508 44703 12930 18880 32905 24762
13894 24762 -12754 -17303 -32784 -46836 2572 3901 -10680 -3850 2716 15276 -8355 -22708
13882 -22708 -22805 19082 53729 13932 19480 64962 103263 126878 91652 93187 95292 72521 55237
13869E5237m7272k7749j4644l4724K3681O1477L2136K2827j8959j9818K8058Q234
13857F8484m0534n0889j0808O772L6651K0707k9052j6790j2534k1042L4831K4485
13845A0281m0166j588l979m1031J3347j1981J6922L5470J108K0303j5239p556
13833b4109Q753j793N110j418M2601J9358k7323K772j772J7117j1537J3223j9251
13820B1731k4276N230l2651k367J2393J8041K6180K833k2840m4681K2732K4403
13808F728j6058m8581p76J0192k6563L7319M5089L8083R059n4108j2649r502j3920
13795c5687L6807J215J9637o4513j8287Q151L3980j1535k1278J6488r992K1117
13783b3897M1380Q22n626j9997j4864M617k4030L3760N8093J3368j0224r557j1228
$$ plain form
13869 55237 7965 -19784 -34428 -69152 -45471 16006 48142 70969 52010 32192 60250 68484
13857 68484 27950 -22939 -33747 -26975 9676 30383 1331 -15459 -27993 -49035 -14204 10281
13845 10281 -29885 -31473 -35452 -76483 -63136 -75117 -58195 -22725 -21617 -1314 -16553 -24109
13833 -24109 -15356 -17149 -12039 -13457 29144 48502 21179 23951 22179 39296 27759 40982 21731
13820 21731 -2545 2685 -29966 -32333 -19940 -1899 24281 27114 4274 -40407 -17675 6728
13808 6728 -9330 -57911 -58687 -48495 -75058 -37739 7350 45433 54492 384 -12265 -21767 -35687
13795 -35687 1120 2335 21972 -42541 -60828 -52677 -18697 -30232 -51510 -35022 -45014 -23897
13783 -23897 17483 18305 12679 -7318 -22182 -17565 -41595 -7835 50258 63626 53402 43845 32617
13770C2617L3683o4436J2326K050j7840o704k8168j558J5557j607j3781M852j3827
13757d6836r200r471j2609K0828J542J5636M0670L5421j2563j688M3017O093O886
13744G7726o019o3118J1537M6035m6028j8675j854l1388k828N3090R533l6468
13732h457O672N0241l2287l1803J5467L988L9105J1965j1721p7312n6132P343
13720h2931J7688L2913k2112N937J9150K3181K3064k2610j7600j4566r594O594
13708d0886k2974o148l297K0142k666j7043L7441K2482k8082j810L0012J6157
13696C328j2999K467o244p577L533k4794k1254M289m1341M5774L9585M1502j1671
13683A4598l6212l5860L3704O8788N7087k3950o6255k3696M6747J9910j45n0124
$$ plain form
13770 32617 66300 1864 14190 16240 -1600 -8304 -36472 -38030 -22473 -24080 -37861 -33009 -46836
13757 -46836 -56036 -65507 -78116 -57288 -55746 -40110 560 35981 23418 21730 64747 70840 77726
13744 77726 71707 8589 20126 66161 20133 1458 -396 -31784 -34612 18478 28011 -8457
13732 -8457 -1785 48456 16169 -15634 -167 3821 42926 54891 43170 -34142 -90274 -82931
13720 -82931 -65243 -32330 -54442 -48505 -29355 -6174 16890 -5720 -23320 -37886 -47480 -40886
13708 -40886 -63860 -70008 -73305 -53163 -55829 -72872 -35431 -12949 -41031 -42841 -12829 3328
13696 3328 -9671 -7204 -13448 -21025 -17492 -42286 -63540 -59251 -100592 -54818 -15233 26269 14598
13683 14598 -21614 -57474 -23770 45018 102105 78155 11900 -11796 34951 54861 54716 4592
13671D592k992L6597L4094q638q816l8661k9233L227J2468K1467N507l2454K9757
13658B6915K7251N846n738L926m3112n3021M2640K3944k9281j7580L0033L5197
13646D7020j3344j8973Q972j3628q59j402j8239k3911k306L6042L7448J6371j8240
13633C4951j283J3155l5054L0232K8179k1276L815l1175k2774K3540O00k1457
13621A453k3866K7076L7933l694l7349j2213J893J9192K3205L4537l6251m2800
13609a0884n6230l3813M6279N940J4139J5485L0595O263l8139p631J4972L487
13597i537J7224J2455j8390l2587l450j9465k642K689J5230J548K1708L319J931
13584i967K302j4877M924k1463J805K2599k6071P746K7917N04K4103K2078K8563
$$ plain form
13671 4592 1600 38197 72291 63653 54837 16176 -13057 -9830 2638 24105 29612 -2842 26915
13658 26915 54166 60012 54274 58200 15088 -37933 4707 28651 -630 -18210 11823 47020
13646 47020 33676 14703 23675 10047 9188 7786 -10453 -34364 -36670 -628 36820 53191 34951
13633 34951 33668 46823 11769 42001 70180 48904 52719 21544 -1230 22310 22910 1453
13621 1453 -22413 4663 42596 38902 1553 -10660 -8767 10425 33630 68167 31916 -10884
13609 -10884 -67114 -100927 -54648 -48708 -34569 -19084 11511 17774 -20365 -27996 -13024 -9537
13597 -9537 7687 20142 1752 -30835 -34285 -53750 -56392 -53703 -38473 -36925 -15217 -11898 -9967
13584 -9967 -7665 -22542 -17618 -39081 -37276 -14677 -40748 -33002 -5085 -4581 19522 41600 70163
13571G0163k5776L1250m99l7284k399K2281j9235J9806l055m9320k2990J6975
13559h3M8399k4816l9327j2909j937J6314M4351J4795J2490P38k7874l3026l2555
13546c5440K9271K3268M0599l340j9743M124n314k9000m7320n392N2589K5851
13534C0153j9713J2153J6324j2933k8371j8954k7646J9813M8923J3848O473j9022
13522B1048l070Q980J3634k2227J5667M6844m188j7991O395J2838k2031j3587
13510D2312L0749l2468j342j3808L2335J2326K0283o1648m4010Q430J849K4803
13498A9811P173P890j226k1650j6985N848j9909j717m576L1535K1590l6188l2247
13485d0651k7428k4442n407K7572K2628K8369J0501K464k2999J3101M0099K6930
$$ plain form
13571 70163 44387 75637 75138 37854 35455 57736 38501 58307 55252 5932 -17058 -83
13559 -83 48316 23500 -15827 -28736 -30673 -14359 29992 44787 57277 58015 30141 -2885 -35440
13546 -35440 -6169 17099 57698 54358 34615 38739 33425 4425 -42895 -48287 4302 30153
13534 30153 10440 22593 38917 25984 -2387 -21341 -48987 -29174 19749 33597 40070 21048
13522 21048 17978 26958 40592 18365 34032 80876 76688 58697 65092 77930 55899 42312
13510 42312 73061 40593 39251 25443 57778 70104 90387 28739 -15271 -6841 -4992 19811
13498 19811 26984 34874 33648 11998 -4987 861 -19048 -20765 -25341 6194 27784 -8404 -40651
13485 -40651 -68079 -92521 -97928 -70356 -47728 -19359 -8858 -6394 -29393 -16292 23807 50737
13473E0737k539m3034n9513o978K4077p004O5248J6086m6603N745J6137m577K153
13460I935o2469n637o262k9539k27L6625L7707j0458n212K6323J7507K40K1406
13447B9939l7002k4137K7961j0409R239n295k6889m1218P60N7310L1302O8432
13435G9993K3359k8261n911l460n9690k2046k895j5725j4966P429J9103j2406
13423c5476L3737R056m314j2196j0378n728K9201J395l1760l39k1590M285N4814
13410A0707r170j1522o955N1918l1070l2696l1483j8599L2216K9843K8478L2674
13398D4341j354l9181K9411K4327k3916j4813j2934r104n302L2392j3591M7757
13386E8033N6695j3987n7163q322j2721J3322j4256J7594j3310q743k7712K6597
$$ plain form
13473 50737 48198 5164 -54349 -61327 -37250 -44254 20994 37080 -9523 -3778 12359 7782 9935
13460 9935 -52534 -58171 -64433 -93972 -94199 -57574 -19867 -30325 -35537 -9214 8293 8533 29939
13447 29939 -7063 -31200 -3239 -13648 -4409 -9704 -36593 -77811 -77051 -19741 11561 79993
13435 79993 103352 75091 69180 65720 6030 -16016 -18911 -34636 -49602 -42173 -23070 -35476
13423 -35476 -1739 7317 3003 -9193 -19571 -25299 3902 5297 -26463 -26802 -48392 -44107 10707
13410 10707 1537 -9985 -16940 34978 3908 -28788 -60271 -78870 -46654 -16811 11667 44341
13398 44341 42987 3806 33217 57544 33628 18815 5881 -3223 -8525 23867 10276 58033
13386 58033 114728 100741 43578 35256 22535 35857 21601 39195 25885 17142 -10570 16027
13374A6027k726k4753Q529n579l880k5875k7183K8437n160k6177N7887J7694p4957
13361f7716N642L8787J8682O3112k399q959k5422k6947N20K2171M7839l6868q6628
13348e8186J0766j2101j7301k6478l958O9949P101l6975J7008M7151K5814j4503
13336H287r61j7552j4712J445K990K6943J4484j9700l6555j809K6483K3143J8955
13323C1441k6470l3145M2299M5023L2025l1765k9125l0204j8545J2147K4897N969
13311B4547k8575P212p755k1799l2898n079O5767O2679O093n3503j7974P133P661
13298A3509k718j9247k2198K0816K6889L443l03r737j7489K2321r85J6266J5502
13285D6069m8486N362K1036k4987j0233J1442r395L756M3966K6646k935o265j8630
$$ plain form
13374 16027 13301 -11452 -2923 -8502 -12382 -38257 -65440 -37003 -42163 -68340 -10453 7241 -67716
13361 -67716 -62074 -23287 -4605 58507 56108 47149 21727 -5220 -4700 17471 65310 28442 -58186
13348 -58186 -47420 -59521 -76822 -103300 -107258 -37309 -30208 -67183 -50175 -3024 22790 8287
13336 8287 7326 -10226 -24938 -23493 -20503 6440 20924 1224 -35331 -37140 -10657 12486 31441
13323 31441 4971 -28174 14125 59148 91173 59408 30283 79 -18466 -6319 18578 24547
13311 24547 -4028 3184 -4571 -26370 -59268 -64347 1420 64099 70192 16689 -1285 5848 13509
13298 13509 10791 -8456 -30654 -9838 17051 20494 20191 10454 -7035 15286 14301 30567 46069
13285 46069 -2417 2945 23981 -1006 -11239 203 -9192 -5436 38530 65176 62241 55976 37346
13272C7346o2164J7075m67m1930n101J0222L0449K2022N837j6380K0783K4386
13260D2078j1626j0436j5134r159j7289j6582L636K1199J5592L0172m449M8600
13248G6602r790J0009q548N053o286q3380n5359m163N3368L6770J967K8449m910
13235C9782k1304n623J222o428j7688K6397N156n4605J0692J3814l0234J3258
13223b5561m582K8925l63r782j584N180j6939j9553K3004J7981k5986j3371J4506
13210b8125J6405L2593j6874l3725K6389K2714j4192N10o225k9406N828J6055
13198h053j6435K9617L2998o62m1617l844J6953K8412L6161j7713j3989k7544
13186A4284m450J9801m2875l1496L2783j0411m1514k0684K8001M4780j245j8927
$$ plain form
13272 37346 -24818 -7743 -8210 -50140 -55241 -45019 -14570 7452 13289 -3091 17692 42078
13260 42078 30452 20016 4882 -4277 -21566 -38148 -34512 -13313 2279 32451 28002 76602
13248 76602 66812 76821 68273 73326 67040 -16340 -71699 -75862 -22494 14276 16243 44692 39782
13235 39782 18478 12855 14077 7649 -10039 16358 21514 -33091 -22399 -8585 -38819 -25561
13223 -25561 -30143 -1218 -1581 -11363 -12947 -7767 -24706 -44259 -21255 -3274 -29260 -42631 -28125
13210 -28125 -11720 20873 3999 -29726 -3337 19377 5185 5695 -530 -29936 -24108 -8053
13198 -8053 -24488 5129 38127 37465 -4152 -7996 8957 37369 73530 55817 41828 14284
13186 14284 9834 29635 -13240 -44736 -11953 -22364 -63878 -84562 -56561 -11781 -13026 -31953
13174c1953m2156R932J6751K2328K6936l1908j4705l040Q0214L0366l2983k2464
13162G318L9226L674O48j2920j6724k6792L515K216l3308j1540n034l2352L0805
13149e1268L7970L1085J2230k9111m5853j2391J2444M391K398r175j8541J8995
13137d6826M8423R809R013K4534p865J9491L4730m3725l5215n849j3733j9120
13125b6333k2446r438M2918J0569Q050J266m8803J6576L605Q2726P351o3832k4726
13112b2517j3243n2850J6611K8093N7014J7916k0428K4684N147r942J459k5134
13100F810l186N300r869J8j3970M437k1339M6235O8012q944m983j5675m2453o3901
13086e3508N105J4240Q123L3419L2688l9980J5911k4736k5260l2172l9108J5426
$$ plain form
13174 -31953 -74109 -64177 -47426 -25098 1838 -30070 -44775 -47815 32399 62765 29782 7318
13162 7318 46544 50218 50866 37946 21222 -5570 -2055 161 -33147 -44687 -49721 -82073 -51268
13149 -51268 -13298 17787 30017 906 -44947 -57338 -44894 -40503 -38105 -47280 -65821 -46826
13137 -46826 1597 11406 20419 44953 37088 56579 91309 47584 12369 6520 -7213 -26333
13125 -26333 -48779 -58217 -15299 -4730 3320 4586 -44217 -27641 -24036 58690 66041 2209 -22517
13112 -22517 -35760 -88610 -71999 -43906 13108 31024 10596 35280 40427 30485 31944 6810
13100 6810 3624 8924 -945 -927 -14897 -10460 -31799 14436 82448 73504 68521 52846 10393 -53508
13086 -53508 -48403 -34163 -26040 7379 40067 87 15998 -8738 -33998 -66170 -105278 -89852
13074h9852N2852L2504O934J9516k4290l6079J0002L3641P2404j4879p577M674
13062E9850q480k7696L693N501k8221j1799l64m6066l4768K7212K8059J7348l7163
13049e2894J8144J8246k9065O153k4385K5328J9458K5682L4590n8538j848j4269
13037c3398P492J3089k0123j2153K2700N1509j6220k4304K2113N129p502J0010
13025A8342L4239J8614l2400k5217l308k2395n1195l2377J5754M5207K3343j553
13013a2946k2921l2274N938R760J6414J5829K977K0441K3983q426j9426R461L9276
13000D8086L274J7106J9257k1209j9092j5322j4698O029J1768l3559m431M8463
12988D5672j4126m9414j0025N8888l6395m946J6475R434J3812Q145Q054q482l1079
$$ plain form
13074 -89852 -37000 -4496 2438 21954 -2336 -38415 -28413 5228 77632 62753 55176 59850
13062 59850 51370 23674 27367 32868 4647 -7152 -7516 -53582 -88350 -61138 -33079 -15731 -52894
13049 -52894 -34750 -16504 -45569 -39416 -63801 -38473 -19015 6667 41257 -17281 -19129 -33398
13037 -33398 -25906 -12817 -32940 -45093 -22393 29116 12896 -11408 10705 15834 8332 18342
13025 18342 52581 71195 38795 13578 10270 -12125 -63320 -95697 -79943 -34736 -11393 -12946
13013 -12946 -35867 -68141 -62203 -52443 -36029 -20200 -17223 3218 27201 18775 -651 8810 48086
13000 48086 51360 68466 87723 66514 47422 32100 17402 23431 35199 1640 -2791 45672
12988 45672 31546 -17868 -27893 30995 -5400 -10346 6129 15563 29375 37520 45574 37092 6013
12975F013n797J633N158k6903j2189j8141j2737m856J3101N3998L3755Q104m1093
12962D6k7978o560k7558O44L4123R285L4002l943k0073j2119J2837j2200k640
12949b2134J8170L039K327j7716J9753L4079K6526k6657k8241L2060K8076N8544
12937A27826N2036M368L5048N6819J13214J95122L62830L16675j8216k40113j96203
12926H09406j65669j78686j61258j17639p8755r81l3770j8764n1971l6692K9041
12915e738j4191j1378p242M524j9117j7492l0977o480N0040J6534j6445L46N2435
12902e181N0279M032m2697l6476J9701j8490K0283J3715M416j635j1959j6421
12890b0433M87n003l1554K0365J5918P767J2655k2256j6798M335L9749j9709j0723
$$ plain form
12975 6013 216 1849 7007 -19896 -32085 -50226 -62963 -67819 -54718 -720 33035 41139 46
12962 46 -27932 -34492 -62050 -61406 -27283 -17998 16004 12061 -8012 -20131 -7294 -19494 -22134
12949 -22134 -3964 -925 1402 -16314 3439 37518 64044 37387 9146 41206 69282 127826
12937 127826 179862 184230 219278 276097 389311 584433 947263 1263938 1245722 1005609 809406
12926 809406 643737 465051 303793 186154 107399 106418 72648 53884 1913 -34779 -5738
12915 -5738 -19929 -31307 -38549 -34025 -53142 -70634 -101611 -108091 -58051 -41517 -57962 -57616 -5181
12902 -5181 45098 49130 6433 -30043 -10342 -28832 -8549 5166 9582 7947 -4012 -20433
12890 -20433 -19946 -24949 -56503 -36138 -20220 -12453 202 -22054 -38852 -34517 5232 -14477 -25200
12877b5200J099q012N194N2132j7946l5090l3092L6072L5950l3021k9580L7665
12865a3829L5385K0514r728m3915k0271J4630q947J5636K9201L4871k573k1827
12853B9147n7127m9566j522K5907J4230Q063K5685J0115j0086K8648J6547K5310
12841F5351Q888p1832l0172O3660J21k1625Q078j7283m8865J0604N0555n750R685
12828B1415p703k0705j342L2919L6918K4657m5918o4007j1018J7872N465p775
12816a9222j3777k8621K4983O0670J5207R381o107l9474n73o784o098j0923J7455
12803c883M7198L436j0341q812k8575l6352m665m700J7063J7565k4792j3797J2457
12790c8198j3495M8321P4051l6609n2981J5751J0123K7559n854j4957m573M402
$$ plain form
12877 -25200 -24101 -32113 -26919 25213 7267 -27823 -60915 -24843 11107 -21914 -51494 -13829
12865 -13829 21556 42070 32342 -11573 -31844 -17214 -26161 -10525 18676 53547 50974 29147
12853 29147 -27980 -77546 -79068 -53161 -38931 -30868 -5183 4932 -5154 23494 40041 65351
12841 65351 74239 2407 -27765 35895 36016 14391 22469 5186 -43679 -33075 17480 11730 21415
12828 21415 13712 -6993 -8335 24584 61502 86159 40241 -23766 -34784 -16912 -11447 -19222
12816 -19222 -32999 -61620 -36637 24033 39240 48621 42514 3040 2467 -4317 -10415 -21338 -3883
12803 -3883 43315 46751 36410 27598 -977 -37329 -41994 -46694 -29631 -12066 -36858 -50655 -38198
12790 -38198 -51693 -3372 70679 34070 -18911 -3160 6963 34522 28668 13711 9138 13540
12778A3540j3227K4451k6917m3823l4455K4707Q358L859P401N5938J7471L7951
12766G5254K1781n2944n9998p12M5609o748K229L1761k1447m0054K6377k6947
12754e839K4126M4006j3287r346J6676l2804o8440o0938P7495M4817o2271l489
12742d9294M1913j0616r181j3337J1411l4686p448O0064K4760j1948l7111j5908
12730e1381p181K5671P2442P167K6354J9922J1436j9495j1284j117k900N543k5925
12717D9252n5812m3553j85K8772L2398L2414K3292k5196m2800j5805J8692K1155
12705B2624k872j1502k2365j8367r55J7867Q930k2759j2613k2481K4450K6337
12693a3706J8610m483j6739j4711j1871K161o884o832j4189K3623M0881J0037
$$ plain form
12778 13540 313 24764 -2153 -45976 -80431 -55724 -47366 -43507 -36106 19832 37303 75254
12766 75254 97035 44091 -15907 -16619 28990 22242 24471 56232 34785 -5269 21108 -5839
12754 -5839 18287 62293 49006 39660 56336 23532 -44908 -105846 -28351 16466 -45805 -49294
12742 -49294 -7381 -17997 -27178 -40515 -29104 -63790 -71238 -11174 13586 1638 -35473 -51381
12730 -51381 -58562 -32891 39551 46718 73072 92994 104430 84935 73651 72534 69634 75177 49252
12717 49252 -6560 -50113 -50298 -21526 10872 43286 66578 41382 -1418 -17223 1469 22624
12705 22624 19752 8250 -14115 -32482 -33437 -15570 -6640 -29399 -42012 -64493 -40043 -13706
12693 -13706 4904 421 -16318 -31029 -42900 -40739 -47623 -54455 -68644 -45021 -4140 5897
12681E897J2241k7454j3786L5941J5139j2145o928M8894L3270P396k8826o3974
12669E665l9002K744K8067L9072j2245l965J02q86k0334o8584L5137L9567m1697
12656c6359J398J323L3365n616J5971j6862L2904l629J1950N962k7357O227L2204
12643E1481L5256m7430O557M531j8067n9658q249Q225n124n5768j7025L0264J7994
12630e7013k6316K4884K1926K8925j5804k5125k6508M939K2282K3191J7966o637
12618a3290K8066l982n2905m4259K0124L566j6728n026Q085J8610M0620L0706
12606A3587k864J1063L7303r407k3141j1065j5018L7413j7158m6648j195r213
12594c6343j8879J1450N1186p106k1947j487l276k9361J7938O2653K1473k7189
$$ plain form
12681 5897 18138 -9316 -23102 12839 27978 15833 8905 57799 91069 98465 69639 5665
12669 5665 -33337 -30593 -2526 36546 24301 20336 20438 19552 -782 -69366 -34229 5338 -36359
12656 -36359 -34961 -33638 -273 -5889 10082 -6780 26124 22495 34445 40407 13050 19277 51481
12643 51481 86737 39307 45864 50395 32328 -27330 -35579 -27354 -32478 -88246 -105271 -75007 -57013
12630 -57013 -83329 -58445 -36519 -7594 -23398 -48523 -75031 -70092 -47810 -24619 -6653 -13290
12618 -13290 14776 10794 -42111 -86370 -66246 -62680 -79408 -84434 -76349 -57739 -17119 13587
12606 13587 10723 21786 59089 49682 26541 15476 458 37871 20713 -25935 -27130 -36343
12594 -36343 -55222 -43772 7414 308 -21639 -23126 -26402 -55763 -37825 24828 46301 19112
12582A9112L3568J2124k2477j7286p52l1961J2234q932j1315K8622o3492o620
12570e7175O1613J3818j5032o4343q987R535K8683J6415K5187J2303m6988o961
12558c1932P8979L6552k4934k2861k8867m7614K3902K0695L1578q944r68R837
12546C5423n286o642k9783N209J336l9919j7946K0390M7306o255k6989n451K1422
12533g185j5737K3936M4153R50m0590l4673n083L9026N731k4035J8711R50j4357
12520h203m483Q676J9919k3557m8878o708L3712J6107J8812k2324l3782Q843J1978
12507b9888K916M726N418J552P351L4330m8520L89n479j0996n265q233K10P528
12493d3961r526J9908J8447K3839j6185p314k189n490j5377n172K1910o030J9073
$$ plain form
12582 19112 52680 64804 42327 25041 24289 -7672 4562 -4370 -15685 12937 -50555 -57175
12570 -57175 4438 18256 3224 -61119 -70106 -60571 -31888 -15473 9714 22017 -24971 -31932
12558 -31932 47047 83599 58665 35804 6937 -40677 -16775 3920 35498 26554 25586 35423
12546 35423 30137 23495 -6288 -1079 257 -39662 -57608 -37218 10088 3833 -23156 -28607 -7185
12533 -7185 -22922 1014 45167 46117 5527 -29146 -34229 4797 10528 -13507 5204 6154 -8203
12520 -8203 -12686 -4010 15909 -7648 -56526 -63234 -29522 -13415 5397 -16927 -50709 -41866 -29888
12507 -29888 -26972 -22246 -16828 -15276 -7925 26405 -22115 -21726 -27205 -38201 -43466 -51699 -51489 -43961
12493 -43961 -53487 -33579 -15132 8707 -7478 -14792 -16981 -22471 -37848 -43020 -21110 -27140 -8067
12480h067p394p672j6929l6341M5769p810l9221o814j0560O718J7785N7414P3412
12467F0290J427l6145q292J5118M9231J4914m3207j473k4766k9522M0235J3304
12455E1114l1520k6795L229K1501q912r805K1607K6173L959j9228p549k3219o354
12442e799J7200o9612m4937N6404M2077l5252L6829K716k6012P409L8481j3954
12430E550j1263m2563n457K2230N88o840j5969j3272J9932k7728o5697o205P0708
12417g5986L2470l924j3298k9159J5795p914J9638K3019j2833O0212L0315L5934
12405G4269J83l997j4595l0500J0174k4930j1192J2400l7659j0042K3404o565
12393a9050l2471j6789J31L5969K6021q504K172K1436o916j0257J6709j1423L672
$$ plain form
12480 -8067 -15461 -23133 -40062 -76403 -30634 -38444 -77665 -84479 -95039 -88321 -70536 -13122 60290
12467 60290 61717 25572 17280 32398 81629 96543 53336 51863 27097 -2425 37810 51114
12455 51114 19594 -7201 -3972 17529 8617 -1188 20419 46592 50551 31323 23774 555 -5799
12442 -5799 11401 -58211 -103148 -46744 -4667 -39919 -3090 -374 -26386 -18977 19504 5550
12430 5550 -5713 -48276 -53733 -31503 -30915 -37755 -53724 -66996 -47064 -74792 -140489 -146694 -75986
12417 -75986 -43516 -47440 -60738 -89897 -74102 -82016 -62378 -39359 -52192 8020 38335 74269
12405 74269 74452 70455 55860 25360 35534 10604 -588 11812 -25847 -35889 -12485 -19050
12393 -19050 -51521 -68310 -68179 -32210 -6189 -14693 -12521 8915 1999 -8258 8451 -2972 700
12380G00J251R333J7669j4717J6278k5447k8240K229m850N646J2449k6909j9269
12367e3877n148M7068J0246j8388l2373K38Q0035K6836j3916j6629j2345J6936
12355B8683K9399j040q126o196l6728j6552o894J2093k966m711r057J3709k0259
12342b8645J2786J9830R073k4174j7251K6021J5982L3979k4251j4456p119j6853
12330a5078L3337j5203n0602k4341J6770K2033K9319l791J5594j1728l6383k7630
12318f7703M1082q297K4235K3555k930l3569j7483l700j9031K4429J6823n7993
12306h0582j2478L1387L6171N0182j701m9506K1726K2725Q422k7886m591q07K1826
12293A4888n669j6869o97j896K5548k5693l5992N811J4434K9399L9461l4768j9666
$$ plain form
12380 700 1951 11284 28953 14236 30514 5067 -23173 -20944 -25794 -20148 -7699 -34608 -53877
12367 -53877 -59025 -11957 -1711 -20099 -52472 -52234 27801 54637 40721 24092 11747 28683
12355 28683 58082 57042 48916 42720 5992 -10560 -17454 -5361 -8327 -13038 -22095 -8386 -28645
12342 -28645 -15859 3971 13044 -11130 -28381 -2360 13622 47601 23350 8894 1775 -15078
12330 -15078 18259 3056 -47546 -71887 -55117 -33084 -3765 -7556 8038 -3690 -40073 -67703
12318 -67703 -26621 -34918 -10683 12872 9942 -23627 -41110 -44810 -63841 -39412 -22589 -80582
12306 -80582 -93060 -61673 -25502 24680 22979 -26527 -4801 17924 26346 -1540 -6131 -6938 14888
12293 14888 9219 -7650 -8347 -10243 15305 -10388 -46380 -40569 -26135 3264 42725 7957 -11709
12280a1709O584q980L3897L6940N754O379k645j7096j1948K4535M056k2317R149
12267E2599j3767J511J78J1438j1990l0313K811j0298j1831n595K5703J6401K5301
12254E2148j2868j0252J4014j849J0007M1156n2245k4508K1480j0695L606j4807
12242A5187l1663p634K837k923j0923L0465P1725K7972l8524m2224k8116K951
12230a0870R004Q379J387P996l353R471k2669n4698K65N189q010N0069J4945l5420
12216b8315o408N124J1376K4010j1256k6082n9815r571O2600M5946N062J8243
12204C0914j2330m9598R959L5152Q83L000l6989m3428L0846J3144j5207J518l3013
12191f5149J3996M3159R100j33l3567m4704K7680m190j2540M2973K9356K8039
$$ plain form
12280 -11709 -5125 -14105 19792 56732 62486 68865 66220 49124 37176 61711 65767 43450 52599
12267 52599 38832 40343 40521 51959 39969 9656 12467 2169 -9662 -15257 10446 26847 52148
12254 52148 39280 29028 43042 41193 51200 92356 40111 15603 37083 26388 29994 15187
12242 15187 -16476 -24110 -21273 -24196 -35119 -4654 67071 95043 56519 14295 -13821 -10870
12230 -10870 -1866 6513 7900 15896 12543 22014 -655 -55353 -55088 -49899 -57909 -7840 7105 -28315
12216 -28315 -34723 -29599 -18223 5787 -5469 -31551 -91366 -100937 -38337 7609 12671 30914
12204 30914 18584 -31014 -21055 14097 14980 17980 -19009 -62437 -31591 -18447 -33654 -32136 -65149
12191 -65149 -51153 -7994 1106 973 -32594 -77298 -49618 -53808 -66348 -23375 5981 34020
12179C4020l7851j6979n3268o43N1178j3245k201m931J469J9474L7889K5071j6846
12166B3137j343n363l9160r192m210J3005r789k1976R623o405M2235M1106j8867
12153A2801K2697K2037j0006j800J670p430k9388J9935K8597m992k7077J385K0317
12140D8746j5352k8477l6446k504M0894J6558j7244J0832L6380l3541k4981l0110
12128c5245K6157K6508K2534j2669n96J1232n76L8002j1341m7581k9864k0474
12116c3913k3289j6453J1799K8583K0190Q390q055m0306J5702K7742l6016L3362
12104a2264M1501P768n1308l4857j7403O7461Q75n580N5989J4066j6113l9781
12092A0354M806j7926J6824L8728n2463j2822L8J1307m020l8704j2219Q114N5832
$$ plain form
12179 34020 -3831 -20810 -74078 -74721 -23543 -36788 -38989 -43920 -42451 -22977 14912 39983 23137
12166 23137 21794 16431 -22729 -31921 -36131 -23126 -32915 -54891 -45268 -51673 -9438 31668 12801
12153 12801 35498 57535 47529 45729 47399 39969 10581 30516 59113 54121 27044 28429 48746
12140 48746 33394 4917 -31529 -34033 6861 23419 6175 17007 53387 19846 -5135 -35245
12128 -35245 -9088 17420 39954 27285 26689 37921 37345 75347 64006 16425 -13439 -33913
12116 -33913 -57202 -73655 -61856 -33273 -13083 -4693 -12748 -53054 -37352 -9610 -45626 -12264
12104 -12264 29237 37005 -14303 -49160 -66563 898 1773 -3807 52182 66248 50135 10354
12092 10354 15160 -2766 14058 52786 323 -12499 -12461 -1154 -5174 -43878 -56097 -47983 7849
12079G849N111M2207k6900J0885J5112q136k2384J9606K6884k9893l2822k8665
12067b1146k802j6729p6792n615r383k367N3801N878J7140L9996K6873J2876j4355
12054G375j6569L0863K1978M3247k6256K5525q539m2447k5426Q338j3660l2920
12042b8491J2163R194O173J524L668j2291p058J3494j5828O629o0L2378L1441
12029E2936k8019j8352l5077j4924M9580L378L930L9373K2027j2832R595j3977
12017E7638l4422k3183J406N011n603j8849k0351k071J5665L432j1209j9371J2645
12004c9262K0602j3807R560K6752l8758m0399K3307R878l0478K0416L3945n4041
11992g2285J7035M1436r173N72J4641l319j1175k0173n241O91M970L2985K3675
$$ plain form
12079 7849 12960 55167 28267 39152 54264 46128 23744 43350 70234 40341 7519 -21146
12067 -21146 -23948 -40677 -117469 -123084 -132467 -134834 -81033 -75155 -58015 -18019 8854 21730 7375
12054 7375 -9194 21669 43647 86894 60638 86163 77624 35177 9751 18089 4429 -28491
12042 -28491 -16328 -7134 -961 563 4231 -8060 -15118 -1624 -17452 -10823 -10883 21495 52936
12029 52936 24917 6565 -28512 -43436 6144 9522 13452 52825 74852 62020 71615 57638
12017 57638 23216 33 1439 6450 847 -18002 -38353 -40424 -24759 -21327 -32536 -51907 -39262
12004 -39262 -18660 -32467 -22907 3845 -34913 -75312 -52005 -42127 -72605 -52189 -18244 -72285
11992 -72285 -55250 -13814 -22987 -22415 -7774 -11093 -22268 -42441 -47682 -46991 -42021 -9036 14639
11979A4639L5j5761m7041Q009p434k8822M489K211M5070M5195K129k154j2983
11966G582l6932J7207M3957k7121j688j4273P498J0558k1569J7834l4908L3439
11954A584L9991K7716j0865k2759n7881k9119J6552j717K3249J5309j8949k862
11942a9751l2176k6769K7018N8662L7228q025k2732l1374K6211J2067n730L3822
11930D8451k478j7292K467L977Q006N021k7189l5575J054L18K0275n5425K0861
11917b7529L6140o000J0236r257L9386J2525J1708R314K2142k7106m2337l3124
11905c902L828O0711l537m3988m673L2348m851l6867o883m131K5462K5196l0450
11892H263m2682J5969j3243J354L5075L6822j4839l5807K812O1591k0731k5137
$$ plain form
11979 14639 14674 -1087 -48128 -40119 -47553 -76375 -71886 -69675 -24605 20590 22719 20565 7582
11966 7582 -29350 -12143 31814 4693 3005 -11268 -3770 6788 -14781 3053 -31855 1584
11954 1584 41575 69291 58426 35667 -22214 -51333 -34781 -36498 -13249 2060 -16889 -19751
11942 -19751 -51927 -78696 -51678 6984 44212 36187 13455 -17919 8292 20359 14629 48451
11930 48451 45973 28681 31148 35125 43131 48152 20963 -14612 -13558 -13240 7035 -48390 -27529
11917 -27529 8611 2611 12847 3590 42976 55501 67209 76523 98665 71559 29222 -3902
11905 -3902 -74 60637 57100 13112 8439 40787 35936 -931 -7814 -11945 13517 38713 8263
11892 8263 -34419 -18450 -31693 -30339 4736 41558 26719 -9088 -6276 55315 34584 9447
11880I447k5603O958K0184l5109J8005N270j575J5626L0177R133N738n2409k1516
11867a5674k440L4854L056r22K3336O7976q212k3296l6660l0383l4453L163N4647
11854C4992J3728p0483k4899K6785j8520J0786J969j6471q228R689k0336j4116
11842g5104j2657J0156K3768K0857J4828o412K3258P1132k4433l5069p23p124
11830B477J8150r356O112k5814k5641L1373J4388L533M0680L344n1179k2703K7175
11817A2539L283l3291j0292j5718M9459L1181l6182j6793M4217N0094l6930k7652
11805A3915j3542K843q640J6833J932L0116J25l7590n550k0651m5718K1884J9025
11792b5018O316n1685R366K4753j992k1968M534k949K5358K2046J4486j6740m6962
$$ plain form
11880 9447 -16156 -9198 10986 -24123 -6118 -848 -2423 13203 43380 52513 58251 5842 -15674
11867 -15674 -18114 16740 19796 18874 42210 110186 101974 78678 42018 11635 -22818 -19655 34992
11854 34992 48720 -21763 -46662 -19877 -38397 -27611 -25642 -42113 -50341 -40652 -60988 -75104
11842 -75104 -87761 -77605 -53837 -32980 -18152 -24564 -1306 69826 45393 10324 9601 2477
11830 2477 20627 11271 17383 -8431 -34072 -2699 11689 15222 55902 59246 8067 -14636 12539
11817 12539 15822 -17469 -27761 -43479 5980 37161 979 -15814 28403 78497 41567 13915
11805 13915 373 3216 -5424 11409 13341 43457 43582 5992 442 -20209 -65927 -44043 -25018
11792 -25018 -18702 -70387 -61021 -36268 -38260 -60228 -55694 -58643 -33285 -11239 3247 -13493 -60455
11779f0455J3652N5759K2317Q224j7576n754j6416K4987J157l485J866j0395J764
11766A5645j6562j4475K6678k7308q225M055O1290P962r938j7232l6916k3494
11754c8520O109J1720P082q789M3033l752K3171r475o946K9108k5231k8208P680
11741F982J2790R899k1314j5696N843j5938j22M5086K7682j247k1470l6256q661
11728a2422r7N249K307j3361k0577J732J3387m53J0273j1170K128k8711r772j4754
11714g6241q875J0781K8472J2241j1191K400M0760J8682M211j5002j1959l3578
11702c9299k1471J8598M9481L3668m1784j7419j1813L5058L0780r334K0746k7036
11690B0175j9928K8103m5308q53J0565l3041k2653k4429K9783L6965Q320k7608
$$ plain form
11779 -60455 -46803 8956 31273 39497 21921 16167 -249 24738 25895 22410 24276 13881 15645
11766 15645 -917 -15392 11286 -16022 -24247 -20192 41098 49060 39122 21890 -15026 -38520
11754 -38520 -32411 -20691 -13609 -22398 20635 16883 40054 30579 23633 52741 27510 -698 6982
11741 6982 19772 29671 8357 -7339 -1496 -17434 -17556 27530 55212 53965 32495 -3761 -12422
11728 -12422 -12519 -7270 -4963 -18324 -38901 -37169 -23782 -24235 -13962 -25132 -23004 -51715 -61487 -76241
11714 -76241 -85116 -74335 -45863 -33622 -44813 -42413 -1653 17029 21240 6238 -5721 -39299
11702 -39299 -60770 -42172 7309 40977 -807 -18226 -30039 5019 35799 26465 47211 20175
11690 20175 247 28350 -16958 -17811 -7246 -40287 -62940 -87369 -57586 -20621 -12301 -39909
11678c9909J318J1620o724m5797k1649O643O4702O6423j5309m7958j8268L8628
11666f280J1447O321n380l437J52P467q887p532J1665l7632N164J4126k8827Q71
11652d0762K3378P516j7707J6952j9554r24j2031K2993J1045k0906L0346l581
11640c235O7104L3069K505k1645K2327N7j2628l700j193l2405k9928l0630K688
11627g614j6908O710N2700m2118k0351J5445J9404L756J383m3247q940m994k715
11614d7489M0600M6374q279m0525j9156L2079J3983J4379K3111l3022j6531j7595
11602a2071l5450k8767M8368N4003k7003l4793p05j889j268P025k7541k887J2794
11589e0184J2108N8329L500q3382L06M4440p12M4905O206k8894m2993J4418L4449
$$ plain form
11678 -39909 -38591 -26971 -33695 -79492 -101141 -94498 -29796 36627 21318 -26640 -44908 -6280
11666 -6280 5167 11488 6108 2671 2823 10290 1403 -6129 5536 -32096 -26932 -12806 -41633 -40762
11652 -40762 -17384 -9868 -27575 -10623 -30177 -31101 -43132 -20139 -9094 -30000 346 -3235
11640 -3235 63869 96938 99443 77798 100125 100182 87554 83854 82661 50256 20328 -10302 -7614
11627 -7614 -24522 -17812 34888 -7230 -27581 -12136 7268 11024 12407 -30840 -39780 -44774 -47489
11614 -47489 -6889 39485 31206 -9319 -28475 3604 17587 31966 55077 22055 5524 -12071
11602 -12071 -47521 -76288 -27920 26083 -920 -35713 -36418 -38307 -39575 -32550 -60091 -62978 -50184
11589 -50184 -38076 20253 23753 -59629 -59323 -14883 -15595 29310 35516 6622 -36371 -21953 12496
11576A2496j2422k5985k4114m3373j2130L0498M959l2533N2271L8703k5648O164
11564c1114K0922j3876j2346j8697P1716N6651q330j8024r164j5700k7959n7586
11552f3507k1532K5956J728O455L486k8924N9012M4217J0121m2225J8653J747
11540A5187l3816k8441l106O862R727M7623m1237k8674j2477K1159M8529L9057
11528D0393q266m8969l5129l741J4317n786O285M5839K695j6557q68K340J7473
11515A0026L899j8141j6294J4538J8550k0595l2564L9589J332k8678j5616R90
11503d2964l4096L1661L4734p440j5300k1571l7938j7608K6490Q886J3409L3040
11491b8697M408R225j7998K4896K7337j0743k0768q388K1240J090N712J7616k7081
$$ plain form
11576 12496 74 -25911 -50025 -93398 -105528 -75030 -70071 -102604 -50333 -11630 -37278 -31114
11564 -31114 -10192 -24068 -36414 -55111 16605 73256 64926 46902 37738 22038 -5921 -63507
11552 -63507 -85039 -59083 -57355 -50900 -47414 -76338 -17326 26891 37012 -5213 13440 15187
11540 15187 -18629 -47070 -50176 -43314 -33587 14036 -27201 -55875 -68352 -47193 1336 40393
11528 40393 32127 -16842 -51971 -55712 -41395 -47181 -40896 4943 7638 -8919 -9787 -7447 10026
11515 10026 13925 -4216 -20510 -5972 12578 -8017 -40581 -992 340 -28338 -43954 -42964
11503 -42964 -77060 -45399 -10665 -18105 -33405 -54976 -92914 -110522 -84032 -75146 -61737 -28697
11491 -28697 -24289 -15064 -33062 -8166 19171 8428 -12340 -20728 512 1602 7314 24930 -2151
11478b151k7367m450m8254o022p267L6783J0767q06N2420K780j3111k6028Q620
11465b4086J1940J1350k2637j6992k6974k955j535l8468K146L932P1118M7781
11453A4620n3712k8009j6506j2562L9239M6801j6477m9118L1527K2184k1536q207
11441e1756j5917J8430K2373K0217K2873j9377j8342j2073p061N8686N1135p778
11429F1410j5351k5792l7283j5384m237n919Q400R238N9605J9958J7245J9847
11417I1737J4429j7727m6571J702L065j1724l1208n8639k5317K4407L9622n479
11405b1703l9126J6015L1255o690j6580j5942j5180J2405N3938L9707l65J810
11393C9544j2120l2770k6739o0917N7P1654J2359J0703j4304k1754J2618L1807
$$ plain form
11478 -2151 -29518 -33968 -82222 -88244 -95511 -58728 -47961 -48767 3653 6433 -6678 -32706 -24086
11465 -24086 -12146 -796 -23433 -40425 -67399 -70354 -71889 -110357 -108211 -104279 -33161 14620
11453 14620 -39092 -67101 -83607 -96169 -56930 -10129 -26606 -75724 -44197 -22013 -43549 -51756
11441 -51756 -67673 -49243 -26870 -6653 16220 -3157 -21499 -33572 -40633 18053 69188 61410
11429 61410 46059 20267 -17016 -32400 -36637 -42556 -34156 -24918 34687 54645 71890 91737
11417 91737 106166 88439 41868 43570 46635 34911 3703 -54936 -80253 -55846 -16224 -21703
11405 -21703 -60829 -44814 -13559 -20249 -36829 -52771 -67951 -55546 -1608 38099 37734 39544
11393 39544 27424 -5346 -32085 -93002 -92945 -21291 -8932 1771 -12533 -34287 -21669 10138
$$ [...]
##END NTUPLES=NMR SPECTRUM
##END=
