##TITLE=Analysis number 319754
Compound Code cc 47704
Book Reference 451/151
Project Code adrs
Chemist Name evam
##JCAMPDX= 6.0         $$ Bruker NMR JCAMP-DX V2.0
##DATA TYPE= NMR SPECTRUM
##DATA CLASS= NTUPLES
##ORIGIN= Bruker BioSpin GmbH
##OWNER= nmr
$$ XWIN-NMR		Version 3.5
$$ Thu May 25 13:15:09 2006 GMT Daylight Time (UT+1h)  MAYBRIDGE\nmr@NMR_250MHZ
##.OBSERVE FREQUENCY= 250.131544655141
##.OBSERVE NUCLEUS= ^1H
##.ACQUISITION MODE= SIMULTANEOUS (DQD)
##.ACQUISITION SCHEME= undefined
##.AVERAGES= 16
##.DIGITISER RES= 18
##SPECTROMETER/DATA SYSTEM= dpx250
##.PULSE SEQUENCE= zg30
##.SOLVENT NAME= CDCl3
##.SHIFT REFERENCE= (INTERNAL, CDCl3, 0, 16.522)
##AUDIT TRAIL= $$ (NUMBER, WHEN, WHO, WHERE, WHAT)
$$ ##TITLE= Audit trail, XWIN-NMR		Version 3.5
$$ ##JCAMPDX= 5.01
$$ ##ORIGIN= Bruker BioSpin GmbH
$$ ##OWNER= nmr
$$ C:\u/data/dgb/nmr/ADRS/5170/pdata/1/auditp.txt
$$ ##AUDIT TRAIL=  $$ (NUMBER, WHEN, WHO, WHERE, WHAT)
(   1,<2006-05-25 13:14:41.54 +100>,<MAYBRIDGE\nmr>,<NMR_250MHZ>,
      <created by zg, POWCHK disabled, PULCHK disabled
       configuration hash MD5:
       84 BC 41 DB A1 6E 1D 46 DA 25 12 A5 C1 ED C5 3A
       data hash MD5: 64K
       C9 0C 98 01 12 A3 E4 97 62 8A 4F DE AD 89 B1 56>)
(   2,<2006-05-25 13:14:58.46 +100>,<MAYBRIDGE\nmr>,<NMR_250MHZ>,
      <Start of raw data processing
       ef LB = 0.3 FT_mod = 6 PKNL = 1 SI = 32K 
       data hash MD5: 32K
       84 B0 2E 38 FF 80 F0 C2 FB 43 D2 14 F1 9F 15 67>)
(   3,<2006-05-25 13:15:00.10 +100>,<MAYBRIDGE\nmr>,<NMR_250MHZ>,
      <apk 
       data hash MD5: 32K
       13 81 26 82 0C 44 A9 78 60 12 E9 00 9E 37 D3 B3>)
(   4,<2006-05-25 13:15:01.07 +100>,<MAYBRIDGE\nmr>,<NMR_250MHZ>,
      <abs ABSG = 5 
       data hash MD5: 32K
       A0 45 63 54 98 61 44 C1 EC 2A 9D 61 72 F4 E6 A2>)
$$ ##END=
$$ 
$$ hash MD5
$$ 4C 85 E8 D1 F3 8D F4 B8 5D 8B 13 A2 92 0E 0E E7
##$RELAX= 
##$RELAX= 
##$RELAX= 
##$RELAX= 
##$RELAX= 
##$RELAX= 
##$RELAX= 
$$ Bruker specific parameters
$$ --------------------------
##$DU= <C:\u>
##$EXPNO= 5170
##$NAME= <ADRS>
##$PROCNO= 1
##$TYPE= <nmr>
##$USER= <dgb>
##$AMP= (0..31)
100 100 100 100 100 100 100 100 100 100 100 100 100 100 100 100 100 100 
100 100 100 100 100 100 100 100 100 100 100 100 100 100 
##$AQSEQ= 0
##$AQ_mod= 3
##$AUNM= <au_zg>
##$AUTOPOS= <55 >
##$BF1= 250.13
##$BF2= 250.13
##$BF3= 250.13
##$BF4= 250.13
##$BF5= 500.13
##$BF6= 500.13
##$BF7= 500.13
##$BF8= 500.13
##$BYTORDA= 1
##$CFDGTYP= 0
##$CFRGTYP= 5
##$CHEMSTR= <none>
##$CNST= (0..31)
1 1 145 1 1 1 1 1 1 1 1 1 1 1 1 1 1 1 1 1 1 1 1 1 1 1 1 1 1 1 1 1 
##$CPDPRG= <>
##$CPDPRG1= <>
##$CPDPRG2= <>
##$CPDPRG3= <>
##$CPDPRG4= <mlev>
##$CPDPRG5= <mlev>
##$CPDPRG6= <mlev>
##$CPDPRG7= <mlev>
##$CPDPRG8= <mlev>
##$CPDPRGB= <>
##$CPDPRGT= <>
##$D= (0..31)
0 1 0 0 0 0 0 0 0 0.06 0 0 0 0 0 0 0.0002 0 0 0 0 0 0 0 0 0 0 0 0 0 0 
0 
##$DATE= 1148559280
##$DBL= (0..7)
120 120 120 120 120 120 120 120 
##$DBP= (0..7)
150 150 150 150 150 150 150 150 
##$DBP07= 0
##$DBPNAM0= <>
##$DBPNAM1= <>
$$ [...]
##$SUBNAM7= <"">
##$SUBNAM8= <"">
##$SUBNAM9= <"">
##$SW= 20.6930455092707
##$SWIBOX= (0..15)
0 0 3 0 0 0 0 0 0 0 0 0 0 0 0 0 
##$SW_h= 5175.983436853
##$TD= 65536
##$TD0= 1
##$TE= 295.16
##$TE2= 300
##$TE3= 300
##$TEG= 300
##$TL= (0..7)
0 120 120 120 120 120 120 120 
##$TP= (0..7)
150 150 150 150 150 150 150 150 
##$TP07= 0
##$TPNAME0= <>
##$TPNAME1= <>
##$TPNAME2= <>
##$TPNAME3= <>
##$TPNAME4= <>
##$TPNAME5= <>
##$TPNAME6= <>
##$TPNAME7= <>
##$TPOAL= (0..7)
0.5 0.5 0.5 0.5 0.5 0.5 0.5 0.5 
##$TPOFFS= (0..7)
0 0 0 0 0 0 0 0 
##$TUNHIN= 0
##$TUNHOUT= 0
##$TUNXOUT= 0
##$USERA1= <user>
##$USERA2= <user>
##$USERA3= <user>
##$USERA4= <user>
##$USERA5= <user>
##$V9= 5
##$VALIST= <valist>
##$VCLIST= <CCCCCCCCCCCCCCC>
##$VD= 0
##$VDLIST= <DDDDDDDDDDDDDDD>
##$VPLIST= <PPPPPPPPPPPPPPP>
##$VTLIST= <TTTTTTTTTTTTTTT>
##$WBST= 1024
##$WBSW= 4
##$XGAIN= (0..3)
0 0 0 0 
##$XL= 0
##$YL= 0
##$YMAX_a= 126202
##$YMIN_a= -189317
##$ZGOPTNS= <>
##$ZL1= 120
##$ZL2= 120
##$ZL3= 120
##$ZL4= 120
##$ABSF1= 16.522
##$ABSF2= -4.171173
##$ABSG= 5
##$ABSL= 3
##$ALPHA= 0
##$AQORDER= 0
##$ASSFAC= 0
##$ASSFACI= 0
##$ASSFACX= 0
##$ASSWID= 0
##$AUNMP= <proc_1d>
##$AZFE= 0.1
##$AZFW= 0.1
##$BCFW= 0
##$BC_mod= 0
##$BYTORDP= 0
##$COROFFS= 0
##$CY= 12.5
##$DATMOD= 1
##$DC= 0
##$DFILT= <>
##$DTYPP= 0
##$F1P= 14.0000005364418
##$F2P= -0.99999901652339
##$FCOR= 0.5
##$FTSIZE= 32768
##$FT_mod= 6
##$GAMMA= 0
##$GB= 0
##$INTBC= 1
##$INTSCL= 1
##$ISEN= 128
##$LB= 0.3
##$LEV0= 0
##$LPBIN= 0
##$MAXI= 10000
##$MC2= 0
##$MEAN= 0
##$ME_mod= 0
##$MI= 0
##$NCOEF= 0
##$NC_proc= -5
##$NLEV= 6
##$NOISF1= 0
##$NOISF2= 0
##$NSP= 0
##$NTH_PI= 0
##$NZP= 0
##$OFFSET= 16.522
##$PC= 1
##$PHC0= 179.7774
##$PHC1= -2.689422
##$PH_mod= 1
##$PKNL= yes
##$PPARMOD= 0
##$PSCAL= 4
##$PSIGN= 0
##$REVERSE= no
##$SF= 250.13
##$SI= 32768
##$SIGF1= 0
##$SIGF2= 0
##$SINO= 400
##$SIOLD= 32768
##$SREGLST= <1H.CDCl3>
##$SSB= 0
##$STSI= 32768
##$STSR= 0
##$SW_p= 5175.98343685301
##$SYMM= 0
##$S_DEV= 0
##$TDeff= 65536
##$TDoff= 0
##$TI= <Analysis number 999999
Compound Code 99
Book Reference 9
Project Code 9>
##$TILT= no
##$TM1= 0
##$TM2= 0
##$TOPLEV= 0
##$USERP1= <user>
##$USERP2= <user>
##$USERP3= <user>
##$USERP4= <user>
##$USERP5= <user>
##$WDW= 1
##$XDIM= 32768
##$YMAX_p= 346512425
##$YMIN_p= -1455350
$$ End of Bruker specific parameters
$$ ---------------------------------
##NTUPLES= NMR SPECTRUM
##VAR_NAME=  FREQUENCY,     SPECTRUM/REAL,   SPECTRUM/IMAG
##SYMBOL=    X,             R,               I
##VAR_TYPE=  INDEPENDENT,   DEPENDENT,       DEPENDENT
##VAR_FORM=  AFFN,          ASDF,            ASDF
##VAR_DIM=   32768,         32768,           32768
##UNITS=     HZ,            ARBITRARY UNITS, ARBITRARY UNITS
##FACTOR=    0.157963299565203, 1,           1
##FIRST=     4132.6476996994, 0,             0
##LAST=      -1043.33573715361, 0,           0
##MIN=       -1043.33573715361, -1455350,    0
##MAX=       4132.6476996994, 346512425,     0
$$ Real data points
##PAGE= N=1
##DATA TABLE= (X++(R..R)), XYDATA
$$ [...]
23047d00330K41897j02048l54648j27050j53773N17814J95596o6483j92820J18475
$$ -400330 -158433 -260481 -615129 -742179 -895952 -378138 -182542 -249025 -441845 -323370
23037c23370J52558n2313j23769k32294K827J03867k181K82182n2422r2438L90777
$$ -323370 -170812 -223125 -346894 -579188 -576361 -472494 -474675 -192493 -244915 -337353 53424
23026E3424J60698j35347j20554J23014L87815Q2237j57492n04699k7412K19092
$$ 53424 214122 78775 -41779 81235 469050 551287 393795 -110904 -138316 80776
23016H0776q9035j50400k99202k18590j29737L46570Q9648J06358k02934k50361
$$ 80776 -8259 -158659 -457861 -676451 -806188 -459618 -369970 -263612 -466546 -716907
23006g16907M44635O35087K18323k2767l87916k19892O9557J44976J52177r2176
$$ -716907 -272272 362815 581138 558371 170455 -49437 20120 165096 317273 225097
22996B25097L7067m59123l17524K38157q94q8768j29832L67010r467K37589j79390
$$ 225097 262164 -196959 -514483 -276326 -277220 -365988 -495820 -128810 -138277 99312 -80078
22985h0078o9300J32127J3675M5489m4611l63701R574l82011L71429P82284M3024
$$ -80078 -149378 -17251 -3576 41913 -2698 -366399 -356825 -738836 -367407 414877 457901
22974D57901r8232N5931k49780j03247K83886R3538q7158j81063n5936j9265L016
$$ 457901 359669 415600 165820 62573 346459 439997 352839 171776 115840 96575 99591
22963I9591K09513O2103j45072J7367m8661n7403j29303o27200O2424Q8799L20954
$$ 99591 309104 371207 226135 243502 194841 137438 8135 -619065 -556641 -467842 -146888
22952a46888J61032k7835K09357J19848k52134k07272J85973P13871L99333p31684
$$ -146888 14144 -13691 195666 315514 63380 -143892 42081 755952 1155285 423601
22942D23601r00011j75739j2849m8519N0326K99601M56817M3672k62732j2372
$$ 423601 -476410 -652149 -664998 -713517 -663191 -363590 93227 136899 -125833 -138205
22932a38205L53945k67891k47274K05396L09258L62403k23279m6883l1704p6631
$$ -138205 215740 -52151 -299425 -94029 215229 577632 354353 307470 275766 199135
22922A99135J16922N733l25341j24421K35212J98688K33397m08763k23369K39508
$$ 199135 316057 321790 -3551 -127972 107240 305928 539325 130562 -92807 146701
22912A46701L26538j86649k92243M8250j87505J29461N25809k7412n5626j82443
$$ 146701 473239 286590 -5653 42597 -144908 -15447 510362 482950 427324 244881
22902B44881m14774K59358K08938p3301m8076K17177N702j86849m38407l66052
$$ 244881 -169893 89465 298403 225102 177026 394203 399905 213056 -225351 -591403
22892e91403J09086K87454k12504j30054O34407J74376m2830J99015j9741k76487
$$ -591403 -482317 -194863 -407367 -537421 96986 271362 228532 427547 407806 131319
22882A31319n11351l33128K26861L31458K8544L77248j75135n2969K08538j22085
$$ 131319 -380032 -713160 -486299 -154841 -126297 250951 75816 22847 231385 109300
22872A09300K0688Q9835K62377K2649K33897k15273m45918j29019m0987j13522
$$ 109300 129988 219823 482200 504849 738746 523473 77555 -51464 -92451 -205973
22862b05973K70397K18245M399k32158m88324Q6703L72488k35844k28483J194
$$ -205973 64424 282669 287068 54910 -433414 -346711 25777 -210067 -438550 -437356
22852d37356k35868M39582j8611j27811p5329k39520L81838N99493j00896n09676
$$ -437356 -673224 -233642 -252253 -380064 -455393 -694913 -313075 286418 185522 -324154
22842c24154J34824N78303K97634j75892j84132j04108K37154K14934j51953n9036
$$ -324154 -189330 388973 686607 510715 326583 222475 459629 674563 522610 463574
22832D63574J50859j64357p283J88949O0780r3736l60962r5145J71478J39541
$$ 463574 614433 450076 442793 631742 692522 598786 237824 142679 314157 453698
22822D53698k2572m054k33381j6158o5730N33910J18383j681K32181J69596j26735
$$ 453698 431126 427072 193691 177533 111803 645713 764096 762415 994596 1164192 1037457
22811A037457l26106m08402p8286L37288K00599j30729k97964k60526j42422K03693
$$ 1037457 711351 302949 224663 561951 762550 631821 333857 73331 -69091 134602
22801A34602j58307n1138P9850j34110K60690q548k54007l27565j52364L1211
$$ 134602 -23705 -74843 5007 -129103 131587 123039 -130968 -458533 -610897 -579686
22791e79686L98631j02324k28201K46674K41867J09363k66082N6236k36510J30426
$$ -579686 -181055 -283379 -511580 -264906 -23039 86324 -179758 -123522 -360032 -229606
22781b29606K97759L67896l95225l59205m309J88477J39560j81529K24914L69175
$$ -229606 68153 436049 40824 -318381 -322690 -134213 5347 -176182 48732 417907
22771D17907j55697l88032l72584l45902l42118K90471K50329O9889q500K04300
$$ 417907 262210 -125822 -498406 -844308 -1186426 -895955 -645626 -575737 -584237 -379937
22761c79937K03232O2649J75543J22705L036J52110L56549k57435j58541m4288
$$ -379937 -176705 -114056 61487 184192 187228 339338 695887 438452 279911 235623
22751B35623j5415j26208j93317K03750L51264L46872j03271l26455j527l12546
$$ 235623 220208 94000 -99317 104433 455697 802569 699298 372843 371316 58770
22741E8770r5668j28459k05389m1572L21226K53256j17586l4359j68981k45476
$$ 58770 -36898 -165357 -370746 -412318 -91092 162164 44578 10219 -158762 -404238
22731d04238O1607J48318k51728j2146M09668K90618K20916m68241n60514J02549
$$ -404238 -342631 -194313 -446041 -458187 -48519 242099 463015 -5226 -565740 -463191
22721d63191K21426j8517K33735J88941l659M41822j2217n55695j95480J26104
$$ -463191 -241765 -260282 -26547 162394 158735 600557 588340 32645 -162835 -36731
22711c6731K38203k73659l42310K54250L32986m16K10415k8267k58819J36442
$$ -36731 201472 -72187 -414497 -160247 172739 172323 382738 354471 95652 232094
22701B32094K43445R5433l65059k5544J02639j3241m05363j37438J99163p7222
$$ 232094 475539 570972 205913 180369 283008 269767 -135596 -273034 -73871 -151093
22691a51093j73511N4293J08120J00225N9839k07294O7577M01281L20682J75542
$$ -151093 -324604 -270311 -162191 -61966 -2127 -209421 -141844 259437 580119 755661
22681G55661J89178p9608l22677j89979j45128K8791J85486J95176o0059N1993
$$ 755661 944839 865231 542554 352575 207447 236238 421724 616900 556841 608834
22671F08834L8799R2985j94456l45506j11950J12174j53974k81369k87439k75832
$$ 608834 647633 740618 546162 200656 88706 200880 46906 -234463 -521902 -797734
22661g97734J91456K88504j4226k59168J26656r112M9858p0433M18690K7374k90793
$$ -797734 -606278 -317774 -332000 -591168 -464512 -473624 -423766 -494199 -75509 -48135 -338928
22650c38928j32642L10292M07929j98028l4948J40323L03387l35361j89307O7604
$$ -338928 -471570 -161278 246651 48623 13675 153998 457385 122024 -67283 321
22640C21O8602l8311N7703l2108n4797N6815K59533J13215j92565k0994j45075
$$ 321 68923 30612 88315 56207 1410 58225 317758 430973 238408 217414 72339
22629G2339p9389N8492j0425j01644n4994j6765J0053r4338O4406j410J55834
$$ 72339 -7050 51442 41017 -60627 -115621 -132386 -122333 -216671 -152265 -153675 2159
22618B159K14151O9532k08049k36777q4527L3319p2145q4229p0649J72085J04634
$$ 2159 216310 285842 77793 -158984 -243511 -210192 -282337 -366566 -437215 -265130 -160496
22607a60496o7177R8202j56759J08853k7826K06161p5490o8102j04983K00321
$$ -160496 -227673 -129471 -286230 -177377 -205203 958 -74532 -142634 -247617 -47296
22597d7296m20483j5112L78962k54059l10249j40447K35038K8863J19901L13132
$$ -47296 -467779 -482891 -103929 -357988 -668237 -808684 -573646 -544783 -424882 -111750
22587a11750L78440K53914k4721r3752k32598j13729J99557n823k45919j45971
$$ -111750 266690 520604 495883 402131 169533 55804 255361 249538 3619 -142352
22577a42352j43783j07322n6009K92925j11361o7941K12767M55300L96068k1901
$$ -142352 -286135 -393457 -449466 -156541 -267902 -335843 -123076 332224 728292 706391
22567G06391k96236l37359m5276l66733K22907j5987N092K03622n863j39009L14439
$$ 706391 410155 72796 27520 -339213 -116306 -132293 -127201 76421 70558 -68451 245988
22556B45988J8719J08128K94928l42996k59714L4974q4540j36886l8122P6942
$$ 245988 264707 372835 667763 324767 65053 100027 15487 -121399 -159521 -82579
22546h2579m3362J06828j88165J7771j78693k34085L68112N70226J24397j53559
$$ -82579 -125941 -19113 -207278 -189507 -368200 -602285 -234173 336053 460450 306891
22536C06891J00534j23462k85111R5368N8571n5364j82772L461m1720l25624j29903
$$ 306891 407425 283963 -1148 94220 152791 97427 -85345 -81884 -123604 -449228 -579131
22525e79131L92311J67610N4616l43822j67552n7476k17626k5769M35849K04843
$$ -579131 -186820 -19210 35406 -308416 -475968 -533444 -751070 -776839 -340990 -136147
22515a36147J26253k36732j50594L60685K17586L66003J76595j8847j27884o10584
$$ -136147 -9894 -246626 -397220 -36535 181051 547054 723649 704802 576918 -33666
22505c3666j09423J72211J1241M3787O6574k09459k21578q8605K75372J65913
$$ -33666 -143089 29122 40363 84150 150724 -58735 -280313 -368918 -93546 72367
22495G2367j523P3773k93810j20301L25647M6296j21185O2696k21897P6703O7895
$$ 72367 70844 144617 -149193 -269494 56153 102449 -18736 43960 -177937 -101234 -33339
22484c3339P197J04875j77111J10345l34976j2766J60656L32365j83198k87076
$$ -33339 -26142 78733 -98378 11967 -323009 -335775 -175119 157246 -25952 -313028
22474c13028K87427J86183L7184r0907J10590j71922p2499J14369K65566j27262
$$ -313028 -25601 160582 197766 106859 217449 45527 -26972 87397 352963 225701
22464B25701k74202r300O5464j03855m27543j65329K14770L63946p6897k32014
$$ 225701 -48501 -57801 7663 -96192 -523735 -689064 -474294 -110348 -187245 -419259
22454d19259j32011m3858Q3635J10972j42361O2239j16216K75550N02781q792
$$ -419259 -551270 -595128 -511493 -400521 -542882 -480643 -596859 -321309 181472 172680
22444A72680l98618R0155j44k96916J30724O1027j14303l21333m12675J607M93712
$$ 172680 -225938 -135783 -135927 -432843 -302119 -241092 -355395 -676728 -1089403 -1087796 -594084
22433e94084L20838K45339K01178K35002j65960k72030k27962J09062P8883j75330
$$ -594084 -273246 -27907 173271 408273 242313 -29717 -257679 -148617 -69734 -245064
22423b45064j71731K26056L68680K12159o455J74486j5272j58109k16525o0808
$$ -245064 -416795 -190739 177941 390100 383645 558131 542859 384750 168225 107417
22413A07417l6441j38412K43993J0085q1971J36115M939j44427j69541L54198
$$ 107417 70976 -67436 176557 186642 104671 240786 245725 101298 -68243 285955
22403B85955K99943j8562n0624j98142l6245l32026J23274j41516m06554j7047
$$ 285955 585898 567336 516712 318570 282325 -49701 73573 -67943 -474497 -491544
22393d91544m00395K26301l051M84914L32077q3815K8204j49566k43646J00749
$$ -491544 -891939 -665638 -668689 -183775 148302 64487 92691 -56875 -300521 -199772
22383a99772M15879P399j40001R8553L87628J02627j88014j65672l69346k97491
$$ -199772 216107 223506 83505 182058 569686 672313 484299 318627 -50719 -348210
22373c48210j74200Q29224K55677l48667K22886K9789m1141k32067K3005M69060
$$ -348210 -522410 306814 562491 213824 436710 466499 425358 193291 216296 685356
22363F85356N65952J03276l55982P1222L45063o8601l61186j54597l09440J39800
$$ 685356 1251308 1354584 998602 1069824 1414887 1346286 985100 830503 521063 660863
22353F60863m7580k12817K40453L94195k0936k75363k42043J86514j36502Q2145
$$ 660863 613283 400466 640919 1035114 1014178 738815 496772 683286 546784 628929
22343F28929M440j55738n3537K3608O06899N9087o42034m79702j84745j46402
$$ 628929 633369 477631 424094 447702 1054601 1113688 471654 -8048 -192793 -339195
22333c39195N81012J98432J20641l00404m2237l595K5993m13159o17191J28324
$$ -339195 241817 440249 560890 260486 218249 214654 240647 -172512 -789703 -661379
22323f61379K03499P0945O9901K67985R7008k69004K13839K03066K14612K67091
$$ -661379 -457880 -386935 -317034 -49049 47959 -221045 -7206 195860 410472 677563
22313F77563J05304j09639n3484N0575k62878N3295K30550k34289P7966L07615
$$ 677563 782867 673228 619744 670319 407441 460736 691286 456997 534963 842578
22303H42578r1896j0222J8263R8871j13468m8293O3204j29264k22793l30206J38321
$$ 842578 750682 740460 758723 857594 744126 695833 759037 629773 406980 76774 215095
22292B15095J99041n7570j22713K44671Q9913K42451k05395k53966K40726K70393
$$ 215095 414136 356566 233853 478524 568437 810888 605493 351527 592253 862646
22282H62646J82912L86183K24341M5093J33511M14261K62565N11067P06015O83554
$$ 862646 1045558 1431741 1656082 1701175 1834686 2248947 2511512 3022579 3728594 4412148
22272D412148N56017Q15768Q78575Q73208J520936J677081K382478K881855M382482
$$ 4412148 4968165 5783933 6662508 7535716 9056652 10733733 13116211 15998066 20380548
22263B0380548O787689J1723419J9836802L4186761N0379568N3484668L3762143
$$ 20380548 27168237 38891656 58728458 92915219 143294787 196779455 230541598
22256B30541598J2183715N738663r247817m5836545o0111775m1414639k3296857
$$ 230541598 242725313 248463976 239216159 193379614 133267839 91853200 68556343
22249F8556343j4241094r291825o659929n127478l782866k785341j963411k053359
$$ 68556343 54315249 45023424 38363495 33236017 29453151 26667810 24704399 22651040
22241B2651040j739246j486532q09845q15038q05024r93138o18069n46308n89190
$$ 22651040 20911794 19425262 18615417 17800379 16995355 16002217 15384148 14837840 14248650
22232A4248650q22505o90798m50001n42133o22148m66368m22990o63480j60262
$$ 14248650 13426145 12735347 12285346 11743213 11121065 10654697 10231707 9568227 9407965
22223I407965m7172o6765k97924o25663m31794j43634k31400k92705j97037k21954
$$ 9407965 9360793 9294028 8996104 8370441 7938647 7795013 7563613 7270908 7073871 6851917
22213F851917J2922r3570j49605k50795n42414k93841j34720j83948j92993j15908
$$ 6851917 6864839 6771269 6621664 6370869 5828455 5534614 5399894 5215946 5022953 4907045
22203D907045k34598l39184j28371l59431r2685k41058l72458k71696j14155j21485
$$ 4907045 4672447 4333263 4204892 3845461 3752776 3511718 3139260 2867564 2753409 2631924
22193B631924J46437K22402L05321J73615k55006j29246K01558J48757O5091j96852
$$ 2631924 2778361 3000763 3306084 3479699 3224693 3095447 3297005 3445762 3510853 3314001
22183C314001k63994k50630N2785j92204j33394j71009q1114M2985j36546j72775
$$ 3314001 3050007 2799377 2852162 2659958 2526564 2355555 2274441 2317426 2180880 2008105
22173B008105l15259m9026j06219K75369K15257m40225R7851m5731l16578m31186
$$ 2008105 1692846 1643820 1537601 1812970 2028227 1588002 1685853 1640122 1323544 892358
22163H92358K36146M4838J9855M01546K78389j23002O5330Q6600l04672N9142
$$ 892358 1128504 1173342 1193197 1594743 1873132 1750130 1815460 1902060 1597388 1656530
22153A656530N6062K4263J53998K4370l9405J67062q5512n63247p12464k69609
$$ 1656530 1712592 1736855 1890853 1915223 1875818 2042880 1957368 1394121 681657 412048
22143D12048K09951j74865j37524l617L58113j6818l87111J66143L12934m9322
$$ 412048 621999 447134 309610 305993 664106 647288 260177 426320 739254 689932
22133F89932j52423k25830K02153n5305q7613j63566j025L14462O5481q624l49628
$$ 689932 537509 311679 513832 458527 370914 207348 206323 520785 586266 577642 228014
22122B28014j0727J87539J1003o9808j3421Q622L23608K69886K17225k73100k03932
$$ 228014 217287 404826 415829 346021 332600 341222 664830 934716 1151941 878841 674909
22111F74909N5077K5846L06894j53731n36425l28595J16489J44735P5372N14123
$$ 674909 729986 755832 1062726 908995 372570 43975 160464 305199 380571 894694
22101H94694Q429n04729M4635l9744l1031J02798j54520O8809R6211O872N9726
$$ 894694 903123 398394 443029 403285 372254 475052 320532 389341 485552 492424 552150
22090E52150k31111k44931M1713O423l0129J13518L97622J43464k69263j40407
$$ 552150 321039 76108 117821 124244 94115 207633 605255 748719 479456 339049
22080C39049k53506Q9325M1995P081l55803l52509P2686J77486l7702p9792J94958
$$ 339049 85543 174868 216863 223944 -131859 -484368 -411682 -234196 -271898 -351690 -156732
22069a56732L66837k13927k98409M57696K84158k37973r8907P5622K90680j82871
$$ -156732 210105 -3822 -302231 155465 439623 201650 102743 178365 469045 286174
22059B86174j05771k03240J47188J65056r7211k3055K35054q3941j26286J60507
$$ 286174 180403 -22837 124351 289407 192196 169141 404195 320254 193968 354475
22049C54475M1865J18790K02276k23100m61643N4842n3013j33558k80981L26501
$$ 354475 396340 515130 717406 494306 32663 87505 34492 -99066 -380047 -53546
22039e3546K14571n0075j37961J73853M27328k01180j02783n3177l93543k60580
$$ -53546 161025 110950 -27011 146842 574170 372990 270207 217030 -176513 -437093
22029d37093K99764L37358J94661n1895K49538N4969J5931k85276k543K12805
$$ -437093 -137329 200029 394690 342795 592333 647302 663233 377957 375414 588219
22019E88219J11119J77035l46430j15337j83972m06239O6287j38621j48800K36867
$$ 588219 699338 876373 529943 414606 230634 -175605 -109318 -247939 -396739 -159872
22009a59872j87291j60124J70220J53387k7081k40881k91381J38246L34074K80841
$$ -159872 -347163 -507287 -337067 -183680 -210761 -451642 -743023 -604777 -270703 10138
21999A0138k12237K06221j8187j44733J04324P5175Q135L4594k3498j62891Q18
$$ 10138 -202099 4122 -14065 -158798 -54474 20701 28836 63430 39932 -122959 -122141
21988a22141K60655M66484k8636k99429Q1259K8202j47429k34624P8829K25066
$$ -122141 138514 604998 576362 276933 358192 386394 238965 4341 83170 308236
21978C08236k25533l81093o2710K57644J05484K350j05774j36711K89677o4137
$$ 308236 82703 -298390 -361100 -103456 2028 4378 -101396 -238107 51570 -12567
21968a2567L1688Q6993J96593r9897Q9942M5821l75997q4852J77248k29607l618
$$ -12567 19121 106114 302707 202810 292752 338573 -37424 -122276 54972 -174635 -178253
21957a78253K45840j72934j75595M7687K70439M37824j5495j41352R8648j6073
$$ -178253 67587 -105347 -280942 -233255 37184 475008 459513 318161 416809 400736
21947D00736k04663J8369j66216Q3597l6564j58903l06910j55387R4358L7845
$$ 400736 196073 214442 48226 131823 95259 -63644 -370554 -525941 -431583 -393738
21937c93738J64843j07471J7791N3409J93843L15827P7191J00705j39444l66970
$$ -393738 -228895 -336366 -318575 -265166 -71323 244504 321695 422400 282956 -84014
21927h4014j10864K26200J24372n3288j70295o3327K01991R8945p538m96166q746
$$ -84014 -194878 31322 155694 102406 -67889 -131216 70775 169720 162182 -333984 -342730
21916c42730O5541M7983p507J86763K34782l8396k53955J89636J82616L33012
$$ -342730 -277189 -229206 -236713 -49950 184832 146436 -107519 82117 264733 597745
21906E97745J13602p3842j01819l24243k96252M8777M81794J94252n66292k50677
$$ 597745 711347 637505 535686 211443 -84809 -36032 445762 640014 73722 -176955
21896a76955o7707K6240j73996J66851o2738R6505P2609M8918M05235K7972J32425
$$ -176955 -244662 -218422 -392418 -225567 -288305 -191800 -119191 -70273 334962 362934 495359
21885D95359j26232l78102p8681J84901n04J05780m47081k01874O3387k7701J79233
$$ 495359 369127 -8975 -87656 97245 96741 202521 -244560 -446434 -383047 -410748 -231515
21874b31515J47897p9061j64345p9891P0952R8812j67672K87249L9067J5087L10741
$$ -231515 -83618 -162679 -327024 -406915 -335963 -237151 -404823 -117574 -78507 -63420 247321
21863B47321K59263m80362n34218K24556J80294P2576K80550k22834j03120K247
$$ 247321 506584 26222 -507996 -283440 -103146 -30570 249980 27146 -75974 -73727
21853g3727l911l20723J52939J64946l2234K3809n6121j72395o7868K00118O05006
$$ -73727 -77638 -398361 -245422 -80476 -112710 -88901 -145022 -317417 -385285 -185167 419839
21842D19839l28561k68994J06872j25149L2574K29649M77745n69192k55169k94962
$$ 419839 91278 -177716 -70844 -195993 -163419 66230 543975 -25217 -280386 -575348
21832e75348j28076K49470N260L63315K10674k25985k14389j79832j71359J01419
$$ -575348 -703424 -453954 -448694 -85379 125295 -100690 -315079 -494911 -666270 -564851
21822e64851K88361N2468k80679j83080J69929J95537L25657j54522k39600Q0791
$$ -564851 -276490 -224022 -504701 -687781 -517852 -322315 3342 -151180 -390780 -309989
21812c09989j4470J83931K93053k8907k03823J72353q2260L02208N4l0356J1056
$$ -309989 -324459 -140528 152525 123618 -80205 92148 9888 312096 312150 281794 292850
21801B92850r0215K26575M1007J67452k31184l1851j19100k79248j83649J82614
$$ 292850 202635 429210 470217 637669 406485 374634 255534 -23714 -207363 -24749
21791b4749K01718j75699m5968J0886K30983L391J52341j15252l82796j51066
$$ -24749 176969 1270 -44698 -33812 197171 200562 352903 237651 -145145 -296211
21781b96211n0409K10093l1545p9701J38062P9806K29476k49989m6369K8122Q5524
$$ -296211 -346620 -136527 -168072 -247773 -109711 -29905 199571 -50418 -96787 -68665 16859
21770A6859N6627m4417j21758k62305K54962P4340j19101n4627o2607k78829k28518
$$ 16859 73486 29069 -92689 -354994 -100032 -25692 -144793 -199420 -262027 -540856 -769374
21759g69374K69753M31885K22891q6655o04847O2202L78618L41818N669k59953
$$ -769374 -499621 -67736 155155 68500 -536347 -474145 -95527 246291 251960 -7993
21749g993l76830K61535P0096q5790k4408K9969Q3539N3787J47970j29509K2178
$$ -7993 -384823 -123288 -53192 -138982 -163390 -133421 -49882 3905 151875 22366 44544
21738D4544l79954l2862J46825n50232k40297M04161L63496r449N5251o2352k6087
$$ 44544 -335410 -368272 -221447 -771679 -1011976 -607815 -244319 -253768 -198517 -260869 -286956
21727b86956j18451J80197J70691n1378O6240j18752K74935j52454n8926K20909
$$ -286956 -405407 -225210 -54519 -105897 -39657 -158409 116526 -35928 -94854 126055
21717A26055j69023j90575j86796J09413J53278l14104J62989K25412K97961K21244
$$ 126055 -42968 -233543 -420339 -310926 -157648 -471752 -308763 -83351 214610 435854
21707D35854j4012n37687L9698K76199l57512q3340L45436L56902L56429L88526
$$ 435854 421842 -115845 -76147 200052 -157460 -240800 104636 461538 817967 1206493
21697A206493m81819n76776K1350P7050J76382K21914K51581K51576M670j26880
$$ 1206493 724674 147898 169248 246298 422680 644594 896175 1147751 1152421 1025541
21687A025541J8903L23640l38468k76833k23132K6351K8611j57131j65006K15334
$$ 1025541 1044444 1368084 1029616 752783 529651 556002 584613 427482 262476 477810
21677D77810k37326j69884j60704l5082K15169J07479l0129k71821j3144M50392
$$ 477810 240484 70600 -90104 -125186 89983 197462 167333 -104488 -117632 332760
21667C32760r2869N5708j86163j66844L03002J11607m14645k05095J3867N05848
$$ 332760 239891 295599 109436 -57408 245594 357201 -57444 -262539 -248672 257176
21657B57176J74235j69965l57004q6042L67770K54441l77860k97491J22109M25494
$$ 257176 431411 261446 -95558 -181600 186170 440611 62751 -234740 -112631 312863
21647C12863L98176p3615l29536k03137L37341k03077l74459k28304p1486J03080
$$ 312863 711039 637424 307888 104751 442092 239015 -135444 -363748 -435234 -332154
21637c32154L14483r0819j98361J12278K08799k1607k49406n9142K3074O845K6914
$$ -332154 -17671 -108490 -306851 -194573 14226 -7381 -256787 -315929 -292855 -286010 -259096
21626b59096j94617M67381k25071j13870K16315j33052K29863K08684k54452k54889
$$ -259096 -453713 13668 -211403 -325273 -108958 -242010 -12147 196537 -57915 -312804
21616c12804j6612K39259j7488n16278K6561q3032J21502N29705J20091J23765
$$ -312804 -329416 -90157 -107645 -623923 -597362 -680394 -558892 -29187 90904 214669
21606B14669P2160o9814K25256l08566k55364j1905l2650j04974J61568j97403
$$ 214669 286829 217015 442271 133705 -121659 -133564 -166214 -271188 -109620 -307023
21596c07023j87852L69569L86208O0750l56155k28990J54937J18771o8539J43076
$$ -307023 -494875 -125306 260902 321652 -34503 -263493 -108556 10215 -58324 84752
21586H4752J03431k84137p5846O9229j31909M8459J83224N4635J73408O4717K14307
$$ 84752 188183 -95954 -171800 -102571 -234480 -186021 -2797 51838 225246 289963 504270
21575E04270k38128k26887j59072J41230k77928l06457j5585J98064J6048L50090
$$ 504270 266142 39255 -119817 21413 -256515 -562972 -578557 -380493 -364445 -14355
21565a4355P2963k11639l7910P3749Q2893k87447j22104L8351K58013L12270J4478
$$ -14355 58608 -153031 -190941 -117192 -34299 -321746 -443850 -405499 -147486 164784 179262
21554A79262q3267l57174J73505J85673J60464l26852j25487q2075k59308K7427
$$ 179262 95995 -261179 -87674 97999 258463 -68389 -193876 -275951 -535259 -507832
21544e07832K14537k6198k16453r7875M18578J48020j75138l09354k28581K14625
$$ -507832 -293295 -319493 -535946 -633821 -215243 -67223 -242361 -551715 -780296 -565671
21534e65671M94522R2282J17265o9744l0787l3166r5883j41095j6881K37833M15906
$$ -565671 -71149 21133 138398 68654 37867 4701 -91182 -232277 -249158 -11325 404581
21523D04581j40581m53326k70944K70837J51978J07769K35044p5150j71001k63779
$$ 404581 264000 -189326 -460270 -189433 -37455 70314 305358 230208 59207 -204572
21513b04572l27121n9911K22381J24338N14294J09619l59067l02860j78956L6281
$$ -204572 -531693 -591604 -369223 -244885 269409 379028 19961 -282899 -461855 -425574
21503d25574K65339M0726p5810K3172j15226J75866K4334k19013K9544K13485
$$ -425574 -160235 -119509 -195319 -172147 -287373 -111507 -87173 -306186 -276642 -63157
21493f3157R2596J40831l01111j68809K23720K21008J09672Q3185j72446k36523
$$ -63157 29439 170270 -130841 -299650 -75930 145078 254750 337935 165489 -71034
21483g1034l332L25126K91719m23210m3029o999M7093l18663j36584L61291L21682
$$ -71034 -74366 250760 542479 119269 76240 69241 116334 -202329 -338913 22378 344060
21472C44060j35437j66025K61J8284j07635k16841J32413N5428r697n6367J48785
$$ 344060 208623 42598 42859 61143 -46492 -263333 -130920 -75492 -85189 -141556 7229
21461G229j62654k90882k6738J51627P6225j10060k17451m1801K9721J5257P9257
$$ 7229 -155425 -446307 -473045 -321418 -245193 -355253 -572704 -614505 -584784 -569527 -490270
21450d90270K53051M97180l1263K31972n7450l41889j04981K20058j64307r3118
$$ -490270 -237219 259961 228698 460670 403220 61331 -43650 176408 12101 -81017
21440h1017R6716m35466k32181K67436N40884q6369j36510k46550L9658k796M4416
$$ -81017 15699 -419767 -651948 -384512 156372 70003 -66507 -313057 -273399 -276195 -231779
21429b31779j34613J92386L82048m48287P6460J34217n9514r9858r630j73934
$$ -231779 -366392 -174006 208042 -240245 -163785 -29568 -89082 -188940 -198570 -372504
21419c72504K7352k8870J42984L1411J4304K82434p2327O9642K7239q8309j26895
$$ -372504 -345152 -374022 -231038 -199627 -185323 97111 24784 94426 121665 33356 -93539
21408i3539J20509K9390L30971K76709j21830Q8293m42755j21660l0162l14222
$$ -93539 26970 56360 387331 664040 542210 630503 187748 66088 35926 -278296
21398b78296K64340L43773m7327R3348j34582R6264J89109r2135k96922k81683
$$ -278296 -13956 329817 282490 375838 241256 337520 526629 434494 137572 -144111
21388a44111l79276K54741J29368j56248J84707p322n9368K26053J06014J97109
$$ -144111 -523387 -268646 -139278 -295526 -110819 -118141 -177509 48544 154558 351667
21378C51667l5238K32031k86493m07541J09734L846J89100P7255n4489l00199
$$ 351667 316429 548460 261967 -145574 -35840 -31994 157106 234361 179872 -120327
21368a20327R3185J6926K51139L3236m16958K38637L21674k47672n95153j87938
$$ -120327 -27142 -10216 240923 274159 -142799 95838 417512 169840 -425313 -613251
21358f13251K46963K1382K59420J67585P0835m32701J5062L53990j87486j10284
$$ -613251 -366288 -344906 -85486 82099 152934 -279767 -264705 89285 -98201 -208485
21348b08485L12618J60900k88659N1257j24215p1753J37454k05459J70625K11125
$$ -208485 104133 265033 -23626 27631 -96584 -168337 -30883 -236342 -65717 145408
21338A45408j54110k22698j18067n265J39273O6459J45053J23060k8663J01473
$$ 145408 -8702 -231400 -349467 -354732 -215459 -149000 -3947 119113 90450 191923
21328A91923J58632r7842j69431O1495N7920J86564J01010k98610l73611j99702
$$ 191923 350555 252713 83282 144777 202697 389261 490271 191661 -181950 -381652
21318c81652j17285L04198L69397R3059J75853L2320j10815k44860k7599k96990
$$ -381652 -498937 -194739 174658 267717 443570 475890 365075 120215 92616 -204374
21308b04374l50344l2736n6378R4748K71445p5060k18601K62952J77554k2634
$$ -204374 -554718 -587454 -643832 -549084 -277639 -352699 -571300 -308348 -130794 -153428
21298a53428k67087p8405M5115J85698K63666J74400L61174J07531kl72475r4313
$$ -153428 -420515 -498920 -453805 -268107 -4441 169959 531133 638664 638662 266187 171874
21287A71874j30196r4032M0874R8994R5988M4739J28978J14048J9460k06707j04712
$$ 171874 41678 -52354 -11480 87514 183502 228241 357219 471267 490727 284020 179308
21276A79308M71385L38577l24054p69039k0782M99077P5008l53801p7160K69380
$$ 179308 650693 989270 665216 -103823 -124605 374472 449480 95679 18519 287899
21266B87899j6317m28228n2092L0062J5985O5031J47094j17985K25866J16934
$$ 287899 271582 -156646 -208738 -178676 -162691 -97660 49434 -68551 157315 274249
21256B74249j48228N4733j364j56357J58573L12172K2896K55579l15391l68432
$$ 274249 126021 180754 179390 23033 181606 493778 516674 772253 456862 88430
21246H8430j581N7257r9846j68043M1380M35103J85245J12769o0993m74696k50612
$$ 88430 86849 144106 44260 -123783 -82403 352700 537945 650714 589721 115025 -135587
21235a35587P1108l9923K49394J98296J98468K6132l45084k99247R7852l02046
$$ -135587 -64479 -104402 144992 343288 541756 567888 222804 -76443 21409 -280637
21225b80637j0994K04421m4196l01683J27173J3590K2987L69121K19895j25612
$$ -280637 -291631 -87210 -131406 -433089 -305916 -292326 -269339 99782 319677 194065
21215A94065J0191j29893j00852j49378j14954M50451N2754p0524k41625j26198
$$ 194065 204256 74363 -26489 -175867 -290821 159630 212384 141860 -99765 -225963
21205b25963J9403J7407L76556N3277k90117M169J6108r778J43173j34641k2755
$$ -225963 -206560 -189153 187403 240680 -49437 -45268 -29160 -38938 104235 -30406 -53161
21194e3161M72409K2639o36441l7160k27590l38776Q2537M06095J24912j27352
$$ -53161 419248 441887 -194554 -231714 -459304 -798080 -715543 -309448 -184536 -311888
21184c11888r9861K32844q113m51787K9530K72470O15798J49512r9563j38097
$$ -311888 -411749 -178905 -187018 -638805 -609275 -336805 278993 428505 328942 190845
21174A90845j08837j39316N8974q592k87943l75714K30903J92564j07680J42165
$$ 190845 82008 -57308 1666 -6926 -294869 -670583 -439680 -247116 -354796 -212631
21164b12631J93778J49900l09729j57838K28141K93716L15041K56843k35722m06828
$$ -212631 -18853 131047 -178682 -336520 -108379 185337 500378 757221 521499 114671
21154A14671o1114M08268L82057j22142l67687l00173k91276J63311J76988m44782
$$ 114671 53557 461825 843882 721740 354053 53880 -237396 -74085 102903 -341879
21144c41879J11598k0278l13257o1326j98832J50787J78191q2528M23219K9017
$$ -341879 -230281 -250559 -563816 -625142 -823974 -673187 -494996 -577524 -154305 -125288
21134a25288r9954m0353l2606J0170P6765m9179K23907j47004K84200n7886k84505
$$ -125288 -225242 -265595 -298201 -288031 -211266 -260445 -36538 -183542 100658 42772 -241733
21123b41733j19770j09472K67745K54800n5000R2344k19325j35420K06263j8763
$$ -241733 -361503 -470975 -203230 51570 -3430 88914 -130411 -265831 -59568 -78331
21113g8331K74719j69894k51827j27831Q5326k3273M38059J78004R6515q9203
$$ -78331 196388 26494 -225333 -353164 -267838 -291111 146948 324952 421467 332264
21103C32264k95568l5899J93383K18943m30615m19089p9140l2464k84650M80813
$$ 332264 36696 797 194180 413123 -17492 -436581 -515721 -548185 -832835 -352022
21093c52022L86938M2303K86359n4794l50432k96571Q4682j48218K76986M69123
$$ -352022 34916 77219 363578 308784 -41648 -338219 -253537 -401755 -124769 344354
21083C44354n5253j29483j36997j72502k88785j04932J65198L22910K22912K39861
$$ 344354 289101 159618 22621 -149881 -438666 -543598 -378400 -55490 167422 407283
21073D07283Q2067K86639l85740j67825j9282J065j27664l118R146l5009j4896
$$ 407283 489350 775989 390249 222424 203142 204207 76543 73425 82571 47562 32666
21062C2666K39806k74465j82244R811J95199N3470j1432K02707l27570k48568
$$ 32666 272472 -1993 -184237 -174426 20773 74243 62811 265518 -62052 -310620
21052c10620j29K03042l8073l20480O6109l09007m9908L74173j30773o5124l72750
$$ -310620 -310749 -107707 -145780 -466260 -400151 -709158 -759066 -384893 -515666 -580790 -953540
21041i53540j46278K68676J51438J27225p495l8405K50225J33842m0132k03638
$$ -953540 -1099818 -831142 -679704 -552479 -559974 -598379 -348154 -214312 -254444 -458082
21031d58082J73690J4351k03313J93351J31693k79576l79643P0290J6917K16002
$$ -458082 -284392 -270041 -473354 -280003 -148310 -427886 -807529 -737239 -720322 -504320
21021e04320J38609K35856K25269p5116N8078k08051R0681j04978p7116m9537
$$ -504320 -365711 -129855 95414 20298 78376 -129675 -38994 -143972 -221088 -270625
21011b70625k87564J47988N48763L32469m63300k81407K4717L60888n4016l2713
$$ -270625 -558189 -410201 138562 471031 7731 -273676 -248959 111929 57913 25200
21001B5200o0231R4506j50683r389j46168p6677l5924J04785M49463m6502j90083
$$ 25200 -35031 59475 -91208 -100597 -246765 -323442 -359366 -254581 194882 148380 -41703
20990d1703l99530K54122L285O516J05416k42384k55186M69394j25233k95054
$$ -41703 -441233 -187111 -183826 -177310 -71894 -314278 -569464 -100070 -225303 -520357
20980e20357N0896K72630J77162k345n5680J39492J70321l51715j72287k6765
$$ -520357 -469461 -196831 -19669 -22014 -77694 61798 232119 -119596 -291883 -318648
20970c18648J8462m2570N5427J60119L5206l26118L04236j1487j48095K21087
$$ -318648 -300186 -342756 -287329 -127210 -92004 -418122 -113886 -125373 -273468 -52381
20960e2381j04258J98884j47576k6633n7194K79415R8766k9969j6344q6354M7441
$$ -52381 -156639 42245 -105331 -131964 -189158 90257 189023 159054 142710 56356 103797
20949A03797j91183j13622J77984J26449J2578j71260k48171j25556M52070J44793
$$ 103797 -87386 -201008 -23024 103425 116003 -55257 -303428 -428984 23086 167879
20939A67879Q863k33777l67960p313K32734M62390o7734J94182K69290k37515
$$ 167879 176742 -57035 -424995 -432308 -199574 262816 195082 389264 658554 421039
20929D21039r333M9241J39224j94826j6410j09522k10500k28204j71381K24487
$$ 421039 411706 460947 600171 405345 388935 279413 68913 -159291 -330672 -106185
20919a06185Q3185j14028n4184j64226k28328k28822k44312L94752M96294k06239
$$ -106185 -23000 -137028 -191212 -355438 -583766 -812588 -1056900 -662148 -165854 -372093
20909c72093k4333J17887k77225j04486J05670o1702J7240M90728M24922k8526
$$ -372093 -396426 -278539 -555764 -660250 -554580 -616282 -599042 -108314 316608 288082
20899B88082l5960j68657K5454J14851L1348j37946k64289L3543J47288J94857
$$ 288082 252122 83465 108919 223770 255118 117172 -147117 -113574 33714 228571
20889B28571N2933L59035N1195q099J3174j26652j99908j14945l03561k35308
$$ 228571 281504 640539 691734 683635 696809 570157 370249 255304 -48257 -283565
20879b83565J30272j13431J26193K45649k5337P4660l6323J87032L01007l09293
$$ -283565 -153293 -266724 -140531 105118 79781 154441 118118 305150 606157 296864
20869B96864J91082j2817l03131K0117k0587l54556Q1279j90524p4157M9363J96944
$$ 296864 487946 475129 171998 192115 171528 -183028 -101749 -292273 -366430 -317067 -120123
20858a20123M59255o2460j01668j66582K46667K19692k83369J6459M22505l9216
$$ -120123 339132 276672 175004 8422 255089 474781 191412 207871 630376 591160
20848E91160l2225l27102J84276j45646j28255j56382N9916J99759k26847m5160
$$ 591160 558935 231833 416109 270463 142208 -14174 45742 245501 18654 -26506
20838b6506K26121n3156m863k35584l29100j21815j64012K59155j19408j38181
$$ -26506 199615 146459 141596 -93988 -423088 -544903 -708915 -449760 -569168 -707349
20828g07349L95169L41398Q3209l71662L43118k3380l1645k22257J31160p1387
$$ -707349 -312180 29218 112427 -259235 83883 60503 28858 -193399 -62239 -133626
20818a33626l09756J78797K58635P2810K50406J91706k82464j9060q8602k82184
$$ -133626 -443382 -264585 -5950 66860 317266 508972 226508 207448 118846 -163338
20808a63338P8793j28269q4229K59587M28463q2035l3130P9701l94529k85901
$$ -163338 -84545 -212814 -297043 -37456 391007 308972 275842 355543 -38986 -324887
20798c24887K50732J338j19781j3155k39901p3755J49685j07263J45901K99865
$$ -324887 -74155 -72817 -192598 -205753 -445654 -519409 -369724 -476987 -331086 -31221
20788c1221K41486r5045j91406L3375M95836K38624Q9464k75469q6544k30254
$$ -31221 210265 115220 -76186 -42811 453025 691649 781113 505644 419100 188846
20778A88846k20799l03044k9471L46941O1512l11795N6580Q5232K7676K367O3849
$$ 188846 -31953 -334997 -364468 -17527 43985 -267810 -211230 -125998 -98322 -95955 -32106
20767c2106k58286j2669K32848M19198M1132R7405j9044K4553j61420k79102Q5769
$$ -32106 -290392 -303061 -70213 348985 390117 487522 468478 493031 331611 52509 138278
20756A38278P5473Q5140j44257n2364J68416n393j29381r7219k61457l46156P008
$$ 138278 213751 298891 154634 102270 270686 265293 135912 38693 -222764 -568920 -561912
20745e61912j77813R3977M89349L69155J4441r2163m87060o5570j76364J43476
$$ -561912 -739725 -645748 -156399 212756 227197 135034 -352026 -417596 -593960 -450484
20735d50484K88056L17949j24183L538N387k22530j58809j82915J06328K10960
$$ -450484 -162428 155521 31338 34876 40263 -182267 -341076 -523991 -417663 -206703
20725b06703K12920k11331L9078J45136k12323k37210l3219K93768K61908R2652
$$ -206703 6217 -205114 -166036 -20900 -233223 -470433 -503652 -209884 52024 144676
20715A44676J75326K96649k02112n7602o3737j9302j66844q678M7323k65465j30685
$$ 144676 320002 616651 414539 356937 293200 273898 107054 98376 145699 -119766 -250451
20704b50451M22250J44669k9761M2884m1729l93013j01240l27412o1605J62694
$$ -250451 171799 316468 286707 329591 287862 -105151 -206391 -533803 -595408 -432714
20694d32714M64474L02333J48559k55571J819l11093j48232J83L87788L52933
$$ -432714 31760 334093 482652 227081 228900 -82193 -230425 -230242 157546 510479
20684E10479J43000l75210m90688J9148o7649K00625L39840J10206J08403P8577
$$ 510479 653479 278269 -212419 -193271 -260920 -60295 279545 389751 498154 576731
20674E76731p6164O2662j07489p2111j84350j71202K4810K52366L04471j70381
$$ 576731 500567 563229 455740 383629 199279 28077 52887 305253 609724 439343
20664D39343q1703k32636J74970M9518p6391n5087j63795j02184L15946n1005
$$ 439343 357640 125004 299974 349492 273101 218014 54219 -47965 267981 216976
20654B16976l4350l15473q1092j76904M0658m11502k88734P291K95215K66816
$$ 216976 182626 -132847 -213939 -390843 -350185 -761687 -1050421 -1043130 -747915 -481099
20644d81099K1169o31850j28766K28101M11204K92851L54825J43179j55605l63402
$$ -481099 -459930 -1091780 -1220546 -992445 -581241 -288390 66435 209614 54009 -309393
20634c09393O0j00657j36070O41764J2721J25415L62764l61062k651l5450M2280
$$ -309393 -309333 -409990 -546060 95704 108425 233840 596604 235542 232891 197441 239721
20623B39721K63318j40842j669k07164k03710K94877K58747j59017k96719l3771
$$ 239721 503039 362197 360528 153364 -50346 244531 503278 344261 47542 13771
20613A3771J37287M22934m7624k43372j13612J9541l39392k18572O0345J77351
$$ 13771 151058 573992 526368 282996 169384 188925 -150467 -369039 -308694 -131343
20603a31343q6032J17381J62924k03377J7170k5888N2246j15801L31982j04171
$$ -131343 -217375 -99994 62930 -140447 -123277 -149165 -96919 -212720 119262 15091
20593A5091M9915O6956k13901k81743q9392j69696N8199K01843Q5020m1782j90247
$$ 15091 65006 131962 -81939 -363682 -453074 -622770 -564571 -362728 -277708 -319490 -509737
20582e09737r3139j773N14089K5627j13083J00327o7813J26453J04932k74424
$$ -509737 -602876 -604649 -90560 -64933 -178016 -77689 -145502 -19049 85883 -188541
20572a88541K74217K36216l52532J69075O3972k51594n57053M295O31508N14347
$$ -188541 85676 321892 -30640 138435 202407 -49187 -606240 -601945 29563 543910
20562E43910O8937j25904j78665m69914l697R1128k70567R3199Q5161j39634r2088
$$ 543910 612847 486943 308278 -161636 -165333 -74205 -344772 -251573 -166412 -306046 -398134
20551c98134p5137J97532N7066j31830M46262j23470L6386M6226J04834r3543
$$ -398134 -473271 -275739 -218673 -350503 95759 -27711 8675 54901 159735 66192
20541F6192M1501m6780j82375N7437n4246k3084j07169J7180J53482L65875r9350
$$ 66192 107693 60913 -121462 -64025 -118271 -141355 -248524 -231344 -77862 288013 188663
20530A88663j84566M1113k32615j52455K59577N9645k03528L5952N2488r7043
$$ 188663 4097 45210 -187405 -339860 -80283 -20638 -224166 -188214 -135726 -232769
20520b32769j78286J19627K15964o1255j67421M2318J3428n720J90611p8848j87277
$$ -232769 -411055 -291428 -75464 -136719 -304140 -261822 -248394 -254114 -63503 -142351 -329628
20509c29628K32490J21680l2010K22767m5277m91905L0066J00178Q4867k58582
$$ -329628 -97138 24542 -7468 215299 170022 -321883 -291817 -191639 -106772 -365354
20499c65354o3796J52832J01488M9662q6066l61456k52920N69372Q29635J16567
$$ -365354 -429150 -276318 -174830 -125168 -211234 -572690 -825610 -256238 573397 689964
20489F89964l6964n8974m0259k43083l47808j24769k718J79681J84580J97082
$$ 689964 653000 594026 553767 310684 -37124 -161893 -164611 15070 199650 396732
20479C96732J65705l62825n02340O2537L03060N3217j01246L64926j34363m78765
$$ 396732 562437 199612 -302728 -240191 62869 116086 14840 379766 245403 -233362
20469b33362j05465P1990L29152K7265j5360j36850o6358L0351J77241J96116
$$ -233362 -338827 -266837 62315 89580 74220 -62630 -128988 -98637 78604 274720
20459B74720m37418j12615k6937j01820R9883o8179k61474K39895M55643J10030
$$ 274720 -162698 -275313 -302250 -404070 -304187 -372366 -633840 -393945 61698 171728
20449A71728k20863l10346j97406L53810J95135j16208j85036J06922L08968N12940
$$ 171728 -49135 -359481 -556887 -203077 -7942 -124150 -309186 -202264 106704 619644
20439F19644j94538l26434j18993j13790o6105K64496j7504J61698k34810j20237
$$ 619644 425106 98672 -20321 -134111 -200216 64280 46776 208474 -26336 -146573
20429a46573J09808K71061K72826k85728j24169p9965m04370k81532R7207J35450
$$ -146573 -36765 234296 507122 221394 97225 17260 -387110 -668642 -571435 -435985
20419d35985K50234J88333j02390r8059j85426K46792O0410R4479J93761J07042
$$ -435985 -185751 2582 -99808 -197867 -383293 -136501 -76091 18388 212149 319191
20409C19191k47833l40386K13703q7339m36668r3883M43906J77970O0208J23078
$$ 319191 71358 -269028 -55325 -142664 -579332 -673215 -229309 -51339 8869 131947
20399A31947K28558k4243j05029N3495O6385k83721j3766n6900J51848p5213M2527
$$ 131947 360505 336262 231233 284728 351113 67392 53626 -3274 148574 73361 115888
20388A15888k7029L06978j5575l28898o0399j74055j78104J43548K30255J79359
$$ 115888 88859 395837 380262 51364 -9035 -183090 -361194 -217646 12609 191968
20378A91968J21527J64494m28985k63115K19563k2094r6102Q6440l0411K15245
$$ 191968 313495 477989 49004 -214111 5452 -16642 -112744 -26304 -56715 158530
20368A58530L8468m6472J78734J10585o6877J5273P339q3360j54809k16097J56603
$$ 158530 196998 150526 329260 439845 372968 388241 395580 312220 157411 -58686 97917
20357I7917q6759k7847q3472r1898J03344j18682J7461J00674j02090j28535J02153
$$ 97917 11158 -16689 -100161 -192059 -88715 -207397 -189936 -89262 -191352 -319887 -217734
20346b17734L75867J71965j6901k61695l14720O7237L2454K09332K23490N3590
$$ -217734 158133 330098 313197 51502 -263218 -195981 -163527 45805 269295 322885
20336C22885k30163n3042J36562l62825J2705k42609k61278K61072M17442j07321
$$ 322885 92722 39680 176242 -186583 -173878 -416487 -677765 -416693 749 -106572
20326a06572k28356j90187r459J01641O10061K4339M2199j66652m3202j20864
$$ -106572 -334928 -525115 -534574 -432933 177128 201467 243666 77014 33812 -87052
20316h7052K06994K2678J8386j15502m36348o2377K75562L46739k78840k53018
$$ -87052 119942 142620 161006 45504 -390844 -453221 -177659 169080 -109760 -362778
20306c62778O9772K06194K68066k35465j96474K15568k18999K7912L04720O4049
$$ -362778 -293006 -86812 181254 -54211 -250685 -35117 -254116 -226204 78516 142565
20296A42565P7030k62235j68967J02198J3313N9524J58139K27113O0588k5736
$$ 142565 219595 -42640 -211607 -109409 -96096 -36572 121567 348680 409268 383532
20286C83532P5550j14550k29035k62546k14428q2006L3279K19330J09527l01599
$$ 383532 459082 344532 115497 -147049 -361477 -443483 -410204 -190874 -81347 -382946
20276c82946k00647j37934O3077K29158K28413L03150j29472k37395m999J80644
$$ -382946 -583593 -721527 -658450 -429292 -200879 102271 -27201 -264596 -269595 -88951
20266h8951l42422k44624J39445O27063p6850k03833q668l95130k79763K21500
$$ -88951 -431373 -675997 -536552 90511 13661 -190172 -198840 -593970 -873733 -652233
20256f52233J84216L65511J19849k0991j45985o6619K6184j23934l41292k90209
$$ -652233 -468017 -102506 17343 -3648 -149633 -216252 -190068 -314002 -655294 -945503
20246i45503K61160J61699K28478K01893j15741j12783k43339J09780K43605n3115
$$ -945503 -684343 -522644 -294166 -92273 -208014 -320797 -564136 -454356 -210751 -263866
20236b63866k72213K06265J69426L16859m5036J10678p8946q5592M25315j40068
$$ -263866 -536079 -329814 -160388 156471 111435 222113 143167 57575 482890 342822
20226C42822m03459K28430J7554j53212N83712L47942j84625m04991k15447m21380
$$ 342822 -60637 167793 185347 32135 615847 963789 779164 374173 158726 -262654
20216b62654L23500K10841j35340k83042J6019L94984L55027n6637j04006m59502
$$ -262654 60846 271687 136347 -146695 -130676 264308 619335 562698 458692 -810
20206h10P0106J03777K31955J30466k61829l20480N4127K33268J56361L07125
$$ -810 69296 173073 405028 535494 273665 -46815 7312 240580 396941 704066
20196G04066M4987j2459j11846m24504l87531J80070K1956k94691k4290J96878
$$ 704066 749053 736594 624748 200244 -187287 -7217 14739 -279952 -304242 -107364
20186a07364k2801l36230l7699K03244J3291k581k83612L4769K27998M06938K34749
$$ -107364 -130165 -466395 -504094 -300850 -287559 -290140 -573752 -538983 -310985 95953 330702
20175C30702l55915j10242j35631J18972Q0541l9768K01382Q0773j14401J86430
$$ 330702 -25213 -135455 -271086 -152114 -71573 -111341 90041 170814 56413 242843
20165B42843m05196n4916N7672k87516k42865K53016O72133j94822j30134L03950
$$ 242843 -162353 -217269 -159597 -447113 -689978 -436962 235171 40349 -89785 214165
20155B14165j38591r832k09417k47018J48229P4320M19355K24532r4619r3980
$$ 214165 75574 65742 -143675 -390693 -242464 -168144 251211 475743 381124 287144
20145B87144J5724J80249j47989k37023j97837P4871k11359O5135J07253k74297
$$ 287144 302868 483117 335128 98105 -99732 -24861 -236220 -171085 -63832 -338129
20135c38129k03549j0313J5834J50629J83879M58117L5636j73120M8380l1883
$$ -338129 -541678 -551991 -536157 -385528 -201649 256468 292104 118984 167364 135481
20125A35481K27924j97998k63533M4165J20905J33984k78109L7571M3862p1964
$$ 135481 363405 165407 -98126 -53961 66944 200928 -77181 -39610 4252 -67712
20115f7712q8750k62930l23500j97237Q7848L46274P3984K30103L55627L5752
$$ -67712 -156462 -419392 -742892 -940129 -852281 -506007 -432023 -201920 153707 189459
20105A89459j30158J3239j05095j1614J77633K76680R7658m84158l02437o1726
$$ 189459 59301 72540 -32555 -44169 133464 410144 507802 23644 -278793 -340519
20095c40519L78038j5360j45066m3954K9352m9091l58090O1595M66742n7543K0761
$$ -340519 37519 22159 -122907 -166861 -137509 -186600 -544690 -483095 -16353 -73896 -53135
20084e3135L37340K2025m7544m41464j70033o5553L32205J64726R4412P2943l76159
$$ -53135 284205 306230 258686 -182778 -352811 -418364 -86159 78567 172979 245922 -130237
20073a30237k27085L68629J59908j87956L11120l48531l15892P4257K4209O4983
$$ -130237 -357322 11307 171215 -16741 294379 -54152 -370044 -295787 -271578 -206595
20063b06595J32064j25701j91511K13278J93106j63591O8183N8040K67471L90491
$$ -206595 -74531 -200232 -391743 -178465 14641 -148950 -80767 -22727 244744 635235
20053F35235j06972j04142j66371K793J1520J28895r7547k8295q1797j91173N8228
$$ 635235 528263 424121 257750 260543 272063 400958 303411 275116 193319 2146 60374
20042F0374j09932j77732l31595K7740L40289L47212M88508J47202l36061j92959
$$ 60374 -49558 -227290 -558885 -531145 -190856 156356 644864 792066 456005 263046
20032B63046j37541j2832j00469M02526M44741Q3600o4215m20588n50591j55173
$$ 263046 125505 112673 12204 414730 859471 943071 878856 458268 -92323 -247496
20022b47496L20702R1726q110k11361q0517J24989j11016J50376K24787K21106
$$ -247496 73206 164932 156822 -54539 -135056 -10067 -121083 29293 254080 475186
20012D75186k3492L7873j86416k50834l59720J45070J35967o7431q408L94778
$$ 475186 451694 489567 303151 52317 -307403 -162333 -26366 -93797 -102205 292573
20002B92573J98581k01355j10239j02895l61549J26206o4696m72352j70668L9230
$$ 292573 491154 289799 179560 76665 -284884 -158678 -223374 -695726 -866394 -827164
19992h27164K85728J677M1163M2643m4308L50264J73605j72610R742k0270k6512
$$ -827164 -541436 -539759 -498596 -455953 -500261 -149997 23608 -149002 -139260 -159530 -186042
19981a86042J33063R1051n963j62524l04343m62800O5598K12185K56232k12005
$$ -186042 -52979 38072 32109 -130415 -434758 -897558 -831960 -619775 -363543 -575548
19971e75548j57573L60376L0011l3596K71476J14561J26861J23894k34334O4132
$$ -575548 -733121 -372745 -342734 -376330 -104854 9707 136568 260462 26128 90260
19961I0260L7110M12992r9864k16895P0460J21597P1852k32878j04228Q6660k09965
$$ 90260 127370 540362 440498 223603 294063 415660 487512 254634 150406 237066 27101
19950B7101M949j50856j50535n18K9497Q5855n9587K23266K45461J57290J62204
$$ 27101 32050 -118806 -269341 -269859 -240362 -154507 -214094 9172 254633 411923 574127
19939E74127k90302j84344k40661P1734R8026J09400M786l67944j71668M08889
$$ 574127 283825 99481 -141180 -69446 28580 137980 142766 -225178 -396846 12043
19929A2043L5685l46981j28749K76527Q1529r7076j6254j51695o2418l0762P9837
$$ 12043 47728 -299253 -428002 -151475 -69946 -167022 -183276 -334971 -397389 -428151 -348314
19918c48314M80659K4864j35179p5201k30922M0342L20724J64520M6263o318k00567
$$ -348314 132345 157209 22030 -53171 -284093 -243751 76973 241493 287756 281438 80871
19907H0871m12086p3637M86792M93895J08505j42326O474J8461r0376j50219l14320
$$ 80871 -331215 -404852 81940 575835 684340 542014 548488 566949 476573 326354 12034
19896A2034o81083j35812m8223N65127r7154j22670q0717K47941j08169k24146
$$ 12034 -669049 -804861 -853084 -287957 -385111 -507781 -588498 -340557 -448726 -672872
19886f72872j10613J68743J81074K38099n4258j51064R9916M715L9870J89035
$$ -672872 -783485 -614742 -433668 -195569 -249827 -400891 -300975 -296260 -256390 -67355
19876f7355j16294O0592j37300L36204k6389l3454l37839J64320J52902m6755
$$ -67355 -183649 -123057 -260357 75847 49458 16004 -321835 -157515 -4613 -51368
19866e1368J67844j31643j13739K43294j859j50133P3326N586l50382j51546J97965
$$ -51368 116476 -15167 -128906 114388 112529 -37604 35722 41308 -309074 -460620 -262655
19855b62655L10404J46260J02288M0761k69511J03474J6470m42166q1848k4125
$$ -262655 47749 194009 296297 337058 67547 171021 187491 -254675 -336523 -360648
19845c60648K92238J26384l2883J14703J42760J2902k25689k65353J95616K79332
$$ -360648 -68410 57974 25091 139794 282554 295456 69767 -195586 30 279362
19835B79362O2958n32775k44936J26988J85025K6255j25523j18124n4565J43704
$$ 279362 342320 -190455 -435391 -308403 -123378 -97123 -222646 -340770 -395335 -251631
19825b51631K42541j77953J60300M8448k15608p4086j47738L93394K14084m20278
$$ -251631 -9090 -187043 -26743 21705 -193903 -267989 -415727 -22333 191751 -228527
19815b28527l95598O9962K52978J72153J96187j57593r997J49323K55999o9497
$$ -228527 -624125 -554163 -301185 -129032 67155 -90438 -100435 48888 304887 235390
19805B35390j04188L0461k4858k44626j71977J5998m7923K59768L5966J12295
$$ 235390 131202 161663 136805 -107821 -279798 -263800 -311723 -51955 -15989 96306
19795I6306M72165k2530m4609k55874m2282j2350k72969r8024L01159K39592m05072
$$ 96306 568471 545941 501332 245458 203176 190826 -82143 -180167 120992 360584 -44488
19784d4488j02072J26837N465K83534j62644R7295J95610J69621Q1729J65028
$$ -44488 -146560 -19723 -14258 269276 106632 203927 399537 569158 650887 815915
19774H15915l96233m85576L7606Q9834m28058j42515M03621J31272j55376J19146
$$ 815915 419682 -65894 -28288 61546 -366512 -509027 -105406 25866 -129510 -10364
19764a0364J58253q8899j28981m8223n6983K77535m5340M969m6425k94403p2393
$$ -10364 147889 58990 -69991 -118214 -175197 102338 56998 61967 15542 -278861 -351254
19753c51254K81919J79436L42382k08212r2641J72730m29369J07224k67342k58637
$$ -351254 -69335 110101 452483 244271 151630 324360 -105009 2215 -265127 -523764
19743e23764K37342J65172k83691m09716L720K32729K21199K56125J41047j33895
$$ -523764 -286422 -121250 -404941 -814657 -810937 -578208 -357009 -100884 40163 -93732
19733i3732J97844J69778j14903N3675j01842j95564j54742M9009J78745k06965
$$ -93732 104112 273890 158987 212662 110820 -84744 -239486 -190477 -11732 -218697
19723b18697L185J02658L74657j22010m08324J27380M26233k78203k08228J67010
$$ -218697 -215512 -112854 261803 139793 -268531 -141151 285082 6879 -201349 -34339
19713c4339j3223K58574K93810K12R0255K6817l92922J74327k22631j40777J7867
$$ -34339 -47562 211012 504822 505034 595289 622106 229184 403511 180880 40103 57970
19702E7970l44585j2621Q2276J28517q8582L85065K97179l89273l05912j32618
$$ 57970 -286615 -299236 -216960 -88443 -177025 208040 505219 115946 -189966 -322584
19692c22584J86209L98402k42728j66174l16517J40934K78912q6251K12640J71686
$$ -322584 -136375 262027 19299 -146875 -463392 -322458 -43546 -129797 82843 254529
19682B54529k95996r4801k65871K46722N68398J57898m46736j60298J6564o577
$$ 254529 -41467 -136268 -402139 -155417 412981 570879 124143 -36155 -19591 -26168
19672b6168J56731J26177L48675M9917P0884q7287l62286j77717l8105J62592
$$ -26168 130563 256740 605415 655332 726216 638929 276643 98926 60821 223413
19662B23413j45107p8318K86297R3772k92791O5835L2437L2869o3011l7174K09740
$$ 223413 78306 -12 286285 380057 87266 153101 185538 218407 155396 118222 327962
19651C27962k51461k678K28056L32797l23335j88421L7439K6773K6838j65084
$$ 327962 76501 73823 301879 634676 311341 122920 160359 187132 213970 48886
19641D8886j83379o1553J38592n1956J53077K29955K39598k6408k84309j54806
$$ 48886 -134493 -196046 -57454 -109410 43667 273622 513220 486812 202503 47697
19631D7697O6718K67371l19332m0181K04907l09144m26924k73832Q9022M46149
$$ 47697 114415 381786 62454 22273 227180 -81964 -508888 -782720 -693698 -247549
19621b47549K86210j8341L16283k48031r4269j67225j77021J06289J56545J23842
$$ -247549 38661 20320 336603 88572 -5697 -172922 -349943 -243654 -87109 36733
19611C6733o0028J94473K46440k63846m55512J39861j28859K1492L18669K51892
$$ 36733 -23295 171178 417618 153772 -301740 -161879 -290738 -269246 49423 301315
19601C01315j66887k30882o7354J9265j92085L07167J5416K0245m6125l60756
$$ 301315 134428 -96454 -163808 -144543 -336628 -29461 -14045 6200 -39925 -400681
19591d00681M82398L74778r9875k02474r8196L620R1132p4737k34069m2732q0231
$$ -400681 81717 456495 356620 154146 55950 59570 150702 75965 -158104 -200836 -281067
19580b81067j43123J50955L94878J43114o0176K79158k11543R2276N71394j08898
$$ -281067 -424190 -273235 121643 264757 204581 483739 272196 364472 935866 826968
19570H26968n79861l33102j4350J52164j38486J98732k89233l91485j81105K77327
$$ 826968 247107 -85995 -100345 51819 -86667 112065 -177168 -568653 -749758 -472431
19560d72431M33082j38585j20961o2232m23230m4270J52830J26984j17757L62498
$$ -472431 -39349 -177934 -298895 -361127 -784357 -828627 -675797 -548813 -666570 -304072
19550c04072O9035L40021P4035J19444o7228k27015N3162j29329M3852k68496
$$ -304072 -235037 104984 179019 298463 231235 4220 57382 -71947 -28095 -296591
19540b96591q3436O7288J80510j28063K72332N72419J45505l67237l88600j12956
$$ -296591 -380027 -312739 -132229 -260292 12040 584459 729964 362727 -25873 -138829
19530a38829L55978j34847J93778p8755j9877j33328J61533O6734J32285n1737
$$ -138829 217149 82302 276080 197325 177448 44120 205653 272387 404672 352935
19520C52935l58875l88906j77426J41610N43409J20722J7956r6713j72579J09150
$$ 352935 -5940 -394846 -572272 -430662 112747 233469 251425 154712 -17867 91283
19510I1283j32820l94402p4550k9745J23974L10942j60205n1506K4488K20590
$$ 91283 -41537 -435939 -510489 -540234 -416260 -105318 -265523 -317029 -292541 -71951
19500g1951L36626K02372k33697q1145j25092j26651J08329J65071o0059J9559
$$ -71951 264675 467047 233350 152205 27113 -99538 8791 173862 113803 133362
19490A33362n420J63777j82889l32366m2798k2542K21038J93494P8332k75625
$$ 133362 127942 291719 108830 -223536 -266334 -288876 -67838 125656 203988 -71637
19480g1637k86977k82006j51999J65087M25975K30151j87101l0997L74834J87894
$$ -71637 -358614 -640620 -792619 -627532 -201557 28594 -158507 -189504 185330 373224
19470C73224n4377n2961o441K98j48937m9545k74504m18563M4398K38575L20308
$$ 373224 318847 265886 259445 259743 110806 61261 -213243 -631806 -587408 -348833 -28525
19459b8525q9002j66216m2428J48298M37522K3652m1163J61274m7013n12676m91399
$$ -28525 -117527 -283743 -326171 -177873 259649 283301 242138 403412 356399 -156277 -647676
19448f47676L0169K38765K91817M5476r2728O5224k7659l99173j95114M9001P4340
$$ -647676 -617507 -378742 -86925 -41449 -134177 -68953 -96612 -495785 -690899 -641898 -567558
19437e67558M17152L76818o7553q4430L1530l19350Q3049L11966J5571m12651
$$ -567558 -150406 226412 158859 74429 105959 -213391 -130342 181624 197195 -215456
19427b15456M4037L7841l55510L80581K61906j10860m4508l5815j20533j20345
$$ -215456 -171419 -133578 -489088 -108507 153399 42539 -1969 -37784 -158317 -278662
19417b78662q6338K66560J45703O1239J55731O294j92152j81209r3966j38008
$$ -278662 -365000 -98440 47263 108502 264233 270527 78375 -102834 -196800 -334808
19407c34808J15355K12636j78464N6648J39558K43823l24795j16165K22771Q6048
$$ -334808 -219453 -6817 -185281 -128633 10925 254748 -70047 -186212 36559 122607
19397A22607m6930m6970j21504M80303L85281l22904l84871p0548j22622J48568
$$ 122607 75677 28707 -92797 387506 772787 449883 65012 -5536 -128158 20410
19387B0410j60102j70131K48941q0220j62113Q9004K50799J11103L4587j6869
$$ 20410 -139692 -309823 -60882 -141102 -303215 -214211 36588 147691 182278 165409
19377A65409J5574k87434k86022J05655K91769J6678k3295K39155j77089J81000
$$ 165409 180983 -106451 -392473 -286818 4951 21629 -1666 237489 60400 241400
19367B41400J07557k08163n50579j642L08988M19256j86652m11446J43190K47326
$$ 241400 348957 140794 -409785 -411427 -102439 316817 130165 -281281 -138091 109235
19357A09235J17499J39540r4783J77110K3595j46071n5799k21355j65248K04343
$$ 109235 226734 366274 271491 448601 472196 326125 270326 48971 -116277 88066
19347H8066N1641N907R1487P2675k90977L1271K70007M26511j28774n01995k36783
$$ 88066 139707 145614 237101 309776 18799 50070 320077 746588 617814 115819 -120964
19336a20964m4481K04425L14737j06371j76126K24957L57431n3565k7187r6369
$$ -120964 -165445 38980 353717 247346 71220 296177 653608 600043 572856 476487
19326D76487j21545j5156K337J57968m88028j33358k31017k83816J4424K30966
$$ 476487 354942 339786 342123 500091 12063 -121295 -352312 -636128 -621704 -390738
19316c90738J11136l4878K26360J65291j56234j92612K71192L03429k27152j75788
$$ -390738 -279602 -314480 -88120 77171 -79063 -271675 -483 302946 75794 -99994
19306i9994K79897L31652M58897j43045j87425j62684J916j76457m06018k4729
$$ -99994 179903 511555 970452 827407 639982 477298 479214 302757 -103261 -127990
19296a27990r0176Q825N34638K29063K07883k38870l05111N1361k47090J24105
$$ -127990 -218166 -209341 325297 554360 762243 523373 218262 269623 22533 146638
19286A46638J69131k61043q6132J23354J55985j35645k27173L88405P9625n63864
$$ 146638 315769 54726 -31406 91948 247933 112288 -114885 273520 353145 -210719
19276b10719j02796K57900q49M8657n7753n6859m10046m4278K41591L81991N3479
$$ -210719 -313515 -55615 -56464 -7807 -65560 -122419 -532465 -576743 -335152 46839 100318
19265A00318K0914m508o3829j76782k82916j8044J18898Q8867k65275k53106K82906
$$ 100318 121232 116724 52895 -123887 -406803 -424847 -305949 -217082 -482357 -735463 -452557
19254d52557O6727Q9089p3023J87315J86064K27689m7431j17544k05060J775J74615
$$ -452557 -385830 -296741 -369764 -182449 3615 231304 183873 66329 -138731 -136956 37659
19243C7659R4260n53862k21676P1883j12699k27111J85563N88325M43969P1190
$$ 37659 131919 -421943 -643619 -571736 -684435 -911546 -725983 -137658 306311 377501
19233C77501m7505J62047l22181k56938m0498Q6674K0924L74086k56371k34701
$$ 377501 329996 492043 169862 -87076 -127574 -40900 -19976 354110 97739 -136962
19223a36962k24058J90386J94294M18902K53016k91824l24595J67800M9236j56210
$$ -136962 -361020 -170634 23660 442562 695578 403754 79159 246959 296195 139985
19213A39985l27015K61722m435q7568l30760l7448N19769J19466j25810n74526
$$ 139985 -187030 74692 70257 -17311 -348071 -385519 134250 253716 127906 -446620
19203d46620k15496J94433M06540L46366l59848k20426m4270q678k29039J30095
$$ -446620 -662116 -467683 -61143 285223 -74625 -295051 -339321 -347999 -577038 -446943
19193d46943M42001N83923Q5324l70117q8956L960j07009p0068j52895k89675
$$ -446943 -4942 578981 664305 294188 205232 209192 102183 32115 -120780 -410455
19183d10455L31033O15717N4245j83115P934j0585k45281J15727k6063M44658
$$ -410455 -79422 536295 590540 407425 415359 404774 159493 275220 249157 693815
19173F93815J32086j17906l75092k23286Q3514O2092o2371k47595j28991J62122
$$ 693815 825901 707995 332903 109617 193131 255223 192852 -54743 -183734 -21612
19163b1612K56692N4536J5013l07403n5923J57752J13971J28132k64927j59280
$$ -21612 235080 289616 304629 -2774 -58697 99055 213026 341158 76231 -83049
19153h3049R0861R9745j85699k84210m4665J44896k09785L76651R922k85064k03673
$$ -83049 7812 107557 -78142 -362352 -407017 -262121 -471906 -95255 -85333 -370397 -574070
19142e74070K96254P48622Q8217k73586K3312K92165o5674r3792J70317N12316
$$ -574070 -277816 470806 559023 285437 308749 600914 535240 441448 611765 1124081
19132A124081J22586j90949k87125k95383m0117L0152l08315J80461q5895p6438
$$ 1124081 1246667 1055718 768593 473210 433093 463245 154930 335391 249496 173058
19122A73058j95550l34925p4630M34735N77446L12632K22390J4827l70743o91279
$$ 173058 -22492 -357417 -432047 2688 580134 892766 1115156 1129983 759240 67961
19112F7961m19378L2919l86J64800j38366J84009K44204K13075J9179K50051j49737
$$ 67961 -351417 -318498 -318884 -154084 -292450 -108441 135763 348838 368017 618068 468331
19101D68331k8271k30115P3862M6944p3014N6735K31641o9269k6213K23364j27175
$$ 468331 440060 209945 283807 330751 257737 314472 546113 476844 450631 673995 546820
19090E46820l36021j09365K58673j26847k79832j62537K00175k10568L21346M12730
$$ 546820 210799 101434 360107 233260 -46572 -209109 -8934 -219502 101844 514574
19080E14574m79016j33741m4561K25540m79640l451L83131l34508J89037J94356
$$ 514574 35558 -98183 -142744 82796 -396844 -400295 -17164 -351672 -162635 31721
19070C1721J71857O7711K75133L92538o5757m90951o6321J66098k0337N7907k38125
$$ 31721 203578 271289 546422 938960 873203 382252 315931 482029 461692 519599 281474
19059B81474q4785n8467j67086k89346j701K00278J79252j78845j17276K06459
$$ 281474 196689 138222 -28864 -318210 -319911 -119633 59619 -119226 -236502 -30043
19049c0043O21j43630K12465P5826r7767j76833j82541J05691Q6027J26523K63736
$$ -30043 -29422 -173052 39413 115239 17472 -159361 -341902 -236211 -150184 -23661 240075
19038B40075J76716k58072j58579Q896p2411j6333J61900J15572L85096L69921
$$ 240075 416791 158719 140 9036 -63375 -79708 82192 197764 582860 952781
19028I52781k64322k4516k08692q2605L9183q8378k98971p1982j31812q659K04471
$$ 952781 688459 663943 455251 372646 411829 323451 24480 -47502 -179314 -187973 16498
19017A6498n0244r2779K46375j537j6407R32R7577J40214j17756k05558l888k24613
$$ 16498 -33746 -126525 119850 118313 101906 102838 200415 340629 222873 17315 13427 -211186
19005b11186J79925K85732l2068K6873L09839k31860l39235j11095j2446J66498
$$ -211186 -31261 254471 222403 249276 559115 327255 -11980 -123075 -135521 30977
18995C0977N1746L03148N4444j8584j74973l30177L74421K81605J21444q3970
$$ 30977 82723 385871 440315 421731 246758 -83419 291002 572607 694051 610081
18985F10081j91394L6963k15063j12141r3871N3024j41354k62344J84443K52394
$$ 610081 418687 455650 240587 128446 34575 87599 -53755 -316099 -131656 120738
18975A20738P3153J36752L75613K53010k53377l61847K43645n1226k66004J49237
$$ 120738 193891 330643 706256 959266 705889 344042 587687 536461 270457 419694
18965D19694p6620R9105j8085j99601J83745j09264k95461J71271L0755j3151
$$ 419694 343074 442179 424094 224493 408238 298974 3513 174784 205539 192388
18955A92388l42877l57155l61579O35206O59932J02429r0994l9774k19642j31904
$$ 192388 -150489 -507644 -869223 -234017 425915 528344 437350 397576 177934 46030
18945D6030r6190K18740K96832k94078l70844j84195L76212M05061J71315K9808
$$ 46030 -50160 168580 465412 171334 -199510 -383705 -7493 397568 568883 598691
18935E98691k26189J8727j81672l65672M03187J63310m08016j5372J10692j04471
$$ 598691 372502 391229 209557 -156115 247072 410382 2366 -13006 97686 -6785
18925f785J63189q3229j15900k98749J96447J23897k72409k40263P3572L07801
$$ -6785 156404 73175 -42725 -341474 -145027 -21130 -293539 -533802 -460230 -152429
18915a52429L83524J9059k47368p184L6086k48399l1928r290j72641K56205K40250
$$ -152429 231095 250154 2786 -4398 31688 -216711 -248639 -257929 -430570 -174365 65885
18904F5885J88249K18770O1010l51679j23014J82611K46448P1518M42922j83617
$$ 65885 254134 472904 533914 182235 59221 241832 488280 559798 1002720 819103
18894H19103J31731k12812l34574l6696j38189n0876L52161l4554m9080k35984
$$ 819103 950834 738022 403448 366752 228563 177687 529848 495294 446214 210230
18884B10230M9871k74286n8337L43237K29212L7841m14927o2715J44948J21546
$$ 210230 260101 -14185 -72522 270715 499927 537768 122841 60126 205074 326620
18874C26620J65255J44286N3732k34183j7654K89880J38230j00819j51302j50252
$$ 326620 491875 636161 689893 455710 438056 727936 866166 765347 614045 463793
18864D63793n7814L48003J17496l24832k74298k94049J08374K57164J7104k58777
$$ 463793 405979 753982 871478 546646 272348 -21701 86673 343837 360941 102164
18854A02164J35328J66389O9683O9855j11082N4300L15174K8390N730L49929j01357
$$ 102164 237492 403881 473564 543419 432337 486637 801811 830201 835931 1185860 1084503
18843A084503j58849N7576N5011K80566j9377m8247o5221p2126k51105J44162
$$ 1084503 925654 983230 1038241 1318807 1299430 1251183 1185962 1113836 862731 1006893
18833A006893N12633L42297J17810q8002J3708j55620l83376j31294N0806L00565
$$ 1006893 1519526 1861823 1979633 1891631 1905339 1749719 1366343 1235049 1285855 1586420
18823A586420r0997o9208K40680L13357J75688L00484R2315M40544L31752M52796
$$ 1586420 1495423 1426215 1666895 1980252 2155940 2456424 2548739 2989283 3321035 3773831
18813C773831O76124J79749M63858P62822J062187J122552J249669J559867K161017
$$ 3773831 4449955 4629704 5093562 5856384 6918571 8041123 9290792 10850659 13011676
18804A3011676L486035N409429R707477J6697043K3813496K4258036J4191595
$$ 13011676 16497711 21907140 31614617 48311660 72125156 96383192 110574787
18797A10574787M775410K139050o148730k2661691k6626117j7314329r346032
$$ 110574787 115350197 117489247 111340517 88678826 62052709 44738380 35392348
18790C5392348n461674l674063k717817k016355j151509r00073m4786J63432M43994
$$ 35392348 29930674 26256611 23538794 21522439 20370930 19470857 19426071 19589503 20033497
18781B0033497R59647J615490K861986M948968Q883815J5859164K3809205K6391193
$$ 20033497 20993144 22608634 25470620 30419588 39303403 55162567 78971772 105362965
18773A05362965J7988829O215626J994682l534689k0869121l0457184k2189239
$$ 105362965 123351794 129567420 131562102 128027413 107158292 76701108 54511869
18766E4511869j2558739p068190m673321l463932k519204j487508j879295k123276
$$ 54511869 41953130 34884940 30211619 26747687 24228483 22740975 20861680 18738404
18758A8738404j288975j111546j005218p70176p59464p15210l20267K2049n46896
$$ 18738404 17449429 16337883 15332665 14562489 13803025 13087815 12767548 12789597 12242701
18749A2242701q99953o16654o46142o33388p88750n20224l72725j19986l30891
$$ 12242701 11342748 10726094 10079952 9446564 8657814 8137590 7764865 7644879 7313988
18740G313988j84267n83415J32930J68290k5543l9320n67650l30998q7904l8939
$$ 7313988 7129721 6546306 6679236 6847526 6821983 6782663 6215013 5884015 5796111 5757172
18730E757172o4798n83604j85671K66699k93034l37436l12364l137j49997j65151
$$ 5757172 5692374 5108770 4923099 5189798 4896764 4559328 4246964 4243827 4093830 3928679
18720C928679o80681N288K41901K21677m07696l98132k1343k9623J09395k44924
$$ 3928679 3247998 3253286 3495187 3716864 3309168 2911036 2889693 2860070 2969465 2724541
18710B724541O5985K08676o7576k98409l37624m23830L0839k31937J11710K68691
$$ 2724541 2790526 2999202 2931626 2633217 2295593 1871763 1902602 1670665 1782375 2051066
18700B051066l6858m8987n054Q0919J0565L5486l58815K9599L455j96465M52783
$$ 2051066 2014208 1965221 1960167 2041086 2051651 2087137 1728322 1757921 1761376 1564911 2017694
18689B017694j45030j70296j34855j56492J57966j75395j40530R3787J57082m51
$$ 2017694 1872664 1702368 1567513 1411021 1568987 1393592 1253062 1346849 1503931 1503480
18679A503480m48155J50902r4959j01659K02591R8282m7475k80986k10207R8316
$$ 1503480 1055325 1206227 1111268 1009609 1212200 1310482 1263007 982021 771814 870130
18669H70130j63125L15673L06908j7048l81697n07885P923j42893o8163K64968
$$ 870130 707005 1022678 1329586 1312538 930841 422956 430879 287986 219823 484791
18659D84791J98055J4226p5432K30927k24852l45766P3295K80218k4323K0759
$$ 484791 682846 697072 621640 852567 627715 281949 355244 635462 611139 631898
18649F31898o4260j55687j52435j69843J35558J15260l09731K18994J83040M0494
$$ 631898 567638 411951 259516 89673 225231 340491 30760 249754 432794 473288
18639D73288J5958o9271q8915k67776k92241R6578L25139J82163Q1499K43887
$$ 473288 489246 419975 331060 63284 -228957 -132379 192760 374923 456422 700309
18629G00309o2946k57074k59981j94790m2938K45230J98891J71154J38578j47102
$$ 700309 637363 380289 120308 -74482 -117420 127810 326701 497855 636433 489331
18619D89331k17177J99601k46k13786p3330J39734K60698K93853m00451k77264
$$ 489331 272154 471755 471509 257723 184393 324127 584825 878678 478227 200963
18609B00963q4760j17170J09990L33208K85718r8912j11010P6224o6599l44474
$$ 200963 116203 -967 109023 442231 727949 629037 518027 594251 527652 183178
18599A83178j69198K65702L46540O14381M03412k59213k73507k61682n3437Q8265
$$ 183178 13980 279682 626222 1240603 1644015 1384802 1111295 849613 796176 884441
18589H84441p8315m17237k02547K98661M31903K48956j0284l3840J87721K42939
$$ 884441 806126 388889 186342 485003 916906 1165862 1155578 1121738 1309459 1552398
18579A552398m11036l35553n0016m9997J31716k13927l9972K56915J18260p2429
$$ 1552398 1141362 805809 755793 705796 837512 623585 583613 840528 958788 886359
18569H86359N7890J15581r9699N2380K417J3521n1167K58167M1680K66209j22776
$$ 886359 944249 1059830 960131 1012511 1014928 1028449 977282 1235449 1277129 1543338 1420562
18558A420562Q822j70779j03614J67562K88852k13680l45104l14365j93557R2064
$$ 1420562 1429384 1258605 1154991 1322553 1611405 1397725 1052621 738256 544699 636763
18548F36763J89102J58572k98418l76945o3053M53723J27933l59554J22407J72795
$$ 636763 825865 984437 686019 309074 246021 699744 827677 468123 590530 763325
18538G63325K7667R6561L24773L44711N4291r1979j05115M0769l121J57001j22469
$$ 763325 790992 887553 1212326 1557037 1611328 1519349 1414234 1455003 1451882 1608883 1486414
18527A486414L5229L11825O11527J77489l4922m1887K1107J09575M01674J50460
$$ 1486414 1521643 1833468 2444995 2622484 2587562 2545675 2566782 2676357 3078031 3228491
18517C228491j65780j89481K81014M64707N5435L31062P2654L16339O73808R64678
$$ 3228491 3062711 2873230 3154244 3618951 3674386 4005448 4078102 4394441 5068249 6032927
18507F032927N58639P35230J174693J479096K149648L117649M657935Q372745
$$ 6032927 6591566 7326796 8501489 9980585 12130233 15247882 19905817 28278562
18499B8278562J2274671J4312625J2914185J0343276J1164770J1183023M438663
$$ 28278562 40553233 54865858 67780043 78123319 89288089 100471112 104909775
18492A04909775l520234n877685k766583j962470l551301j494254L101275N016906
$$ 104909775 101389541 95511856 92745273 90782803 87231502 85737248 88838523 93855429
18484I3855429N803456P822316N419425k225716r034242q535776p425580j1137674
$$ 93855429 99658885 107481201 112900626 110674910 101640668 93104892 85679312 74541638
18476G4541638j5468909j3985959q867961o136666l719319k258740k034655j856909
$$ 74541638 59072729 45086770 36218809 30082143 26362824 24104084 22069429 20212520
18468B0212520j782466j269991q58198j024949n80406o40906o51917n36518K0950
$$ 20212520 18430054 17160063 16301865 15276916 14696510 14055604 13403687 12867169 12888119
18459A2888119l70053m55819l58362l3511o98143q29815n09750l73259n73960
$$ 12888119 12518066 12062247 11703885 11670374 10972231 10142416 9632666 9259407 8685447
18450H685447o87027j55708J53397m56834l00992k10783p4989l0989k22817o8853
$$ 8685447 7998420 7842712 7996109 7539275 7238283 7027500 6952511 6921522 6698705 6629852
18440F629852J79331j66713n88590k91161j86926k30880k79828R570j88465k22585
$$ 6629852 6809183 6642470 6053880 5762719 5575793 5344913 5065085 5074655 4886190 4663605
18430D663605J02759n84837n29042k02721J56993m1904P2722j49499l33955j81701
$$ 4663605 4766364 4181527 3652485 3449764 3606757 3564853 3637575 3488076 3154121 2972420
18420B972420j1895L5958J18525j17930l1649p6763l25258J62760n6240k22717
$$ 2972420 2960525 2996483 3115008 2997078 2965429 2888666 2563408 2726168 2669928 2447211
18410B447211q3723m6960k93247j75643J07571O23303n5129n31233k65612j38240
$$ 2447211 2363488 2316528 2023281 1847638 1955209 2578512 2523383 1992150 1726538 1588298
18400A588298m74438l3052K20221m8435J62267J94527k33702m91853M5436K09490
$$ 1588298 1113860 1080808 1301029 1252594 1414861 1609388 1375686 883833 929269 1138759
18390A138759L61271J64443K02499p0147L0312j87868k13828j41793j11814j83518
$$ 1138759 1500030 1664473 1866972 1796825 1827137 1639269 1425441 1283648 1171834 988316
18380I88316N4256K8556K23916K57403M13289m50266m91478p9144m37742L0801
$$ 988316 1042572 1071128 1295044 1552447 1965736 1515470 1023992 944848 507106 537907
18370E37907l2709j29071j16791J21387L74940J20609k77249k44141K93378L16252
$$ 537907 505198 376127 259336 380723 755663 876272 599023 354882 648260 964512
18360I64512k63906n3238L45095J8456k43070l70843K58022K55092k022o7887
$$ 964512 700606 647368 992463 1010919 767849 397006 655028 910120 908098 840211
18350H40211j46823K80515k41705j88128j52555J16074L39014L3882j0810J02923
$$ 840211 693388 973903 732198 544070 391515 507589 846603 880485 869675 972598
18340I72598m2052O4006l43340K268j16533q7372j43859J46400J88502J48058
$$ 972598 930546 994552 651212 653480 536947 449575 305716 452116 640618 788676
18330G88676q7099k84029m24705J64602O01894M87804r5723l14711k48888j59348
$$ 788676 701577 417548 -7157 157445 759339 1247143 1151420 836709 587821 428473
18320D28473M31048M91649k7460m01517l63922q5790k82322L0718M7827j18995
$$ 428473 859521 1351170 1323710 922193 558271 472481 190159 220877 268704 149709
18310A49709j14806O0772p5191l2534J89556L36262M63204K10261q3285j56395
$$ 149709 34903 95675 20484 -12050 177506 513768 976972 1187233 1103948 947553
18300I47553l0814K0185J6141j48884k29725r0036K7282O9823M8177J35130j97782
$$ 947553 916739 936924 953065 804181 574456 484420 511702 581525 629702 764832 567050
18289E67050l71944o5037N5032K48464J44014L80887j55574j01205K8649j87158
$$ 567050 195106 130069 185101 433565 577579 958466 802892 701687 730336 543178
18279E43178K50545p9729o157o6703K05532K59232j70628l00231R5689j4305L1266
$$ 543178 793723 713994 707837 641134 846666 1105898 935270 635039 730728 716423 747689
18268G47689J73326J71391J35570K21591L6785O8171J37262k58518l37652n055
$$ 747689 921015 1092406 1227976 1449567 1486352 1554523 1691785 1433267 1095615 1090560
18258A090560k34013j50641J51224K60618J33871J22126L33142K5267j93354L35839
$$ 1090560 856547 705906 857130 1117748 1251619 1373745 1706887 1732154 1538800 1874639
18248A874639J48555l29899l2267q3740M54663R95569K16457j36230RJ03743J05721
$$ 1874639 2023194 1693295 1661028 1577288 2031951 3027520 3243977 3107747 3107756 3211499 3317220
18237C317220M11519Q31670K46714L2449M53242Q4579J72426O31396O92779O65541
$$ 3317220 3728739 4560409 4807123 4839572 5292814 5377393 5549819 6181215 6873994 7539535
18227G539535R37994J216460J331275K454167L728866N102832Q930413J4302610
$$ 7539535 8477529 9693989 11025264 13479431 17208297 22311129 31241542 45544152
18219D5544152J9634671K2224403J8838163J2286100M772153m252071j3544464
$$ 45544152 65178823 87403226 106241389 118527489 123299642 119047571 105503107
18212A05503107k0167338k1423768j6933771j0159688n961685m190662k631844
$$ 105503107 85335769 63912001 46978230 36818542 30856857 26666195 24034351
18205B4034351k212412j302772p5229j90215q3352O47153J653901K737039L691868
$$ 24034351 21821939 20519167 20443938 20253723 20170371 20817524 22471425 25208464 28900332
18196B8900332O613436J0882216J6508451J9611669J7944132J2371763N712832
$$ 28900332 35513768 46395984 62904435 82516104 100460236 112831999 118544831
18189A18544831j971516j0997673j8357287k0365796j6975604j1347122p441658
$$ 118544831 116573315 105575642 87218355 66852559 49876955 38529833 31088175
18182C1088175m397907l066114k460652k037392j341190j040956j045864r76053
$$ 31088175 26690268 23624154 21163502 19126110 17784920 16743964 15698100 14722047
18174A4722047o26394n20952o38664p14902n08709k98821m02145n36573n03944
$$ 14722047 14095653 13574701 12936037 12221135 11712426 11413605 11011460 10474887 9970943
18165I970943m23005k19906k20541j69645l57902k40739k15419J60448j24544
$$ 9970943 9547938 9328032 9107491 8937846 8579944 8339205 8123786 8284234 8159690
18156H159690o86615m86772k06934j73363l26603l36477J04922j82394k13552
$$ 8159690 7473075 6986303 6779369 6606006 6279403 5942926 6047848 5865454 5651902
18147E651902l59831k80884l1444J21686L65548J11291J38362J09731m12334l71184
$$ 5651902 5292071 5011187 4979743 5101429 5466977 5578268 5716630 5826361 5414027 5042843
18137E042843j98267p2830K87024R2270j14639l2043M49768K99415J94580K92732
$$ 5042843 4844576 4771746 5058770 5151040 5036401 5004358 5454126 5753541 5948121 6240853
18127F240853L73744N65009L61202L26841K74069R60689J004666J211508R80819
$$ 6240853 6614597 7179606 7540808 7867649 8141718 9102407 10107073 11318581 12299400
18118A2299400J624561J897909J596481K556306M029163N441582P827558J1990312
$$ 12299400 13923961 15821870 17418351 19974657 24003820 29445402 37272960 49263272
18110D9263272K0216372L5749089O0894326Q2001599O4392116K0174431N371045
$$ 49263272 69479644 105228733 166123059 248124658 312516774 332691205 338062250
18103C38062250Q450175m0125301r7836001p1862773l7917628k1391424j3893058
$$ 338062250 346512425 306387124 208551123 136688350 98770722 77379298 63486240
18096F3486240r558347p164767n132481l961991l285190k747673k311427j416833
$$ 63486240 53927893 46763126 41630645 37668654 34383464 31635791 29324364 27907531
18088B7907531j341675j367691j390648j150144r45521r93026j262570q79974
$$ 27907531 26565856 25198165 23807517 22657373 21711852 20718826 19456256 18576282
18080A8576282o88316r65739q14031r85630p86061m87052p16007k98940j96069
$$ 18576282 17887966 16922227 16108196 15122566 14336505 13849453 13133446 12834506 12638437
18071A2638437m57179l17802n42147l33722j00244R4549k43859o21394m89483
$$ 12638437 12181258 11863456 11321309 10987587 10887343 10981892 10738033 10116639 9627156
18062I627156n12094k74341k69006k45875j90428n19347o46573m17279K43062
$$ 9627156 9115062 8840721 8571715 8325840 8135412 7616065 6969492 6552213 6795275
18053F795275l15927k84092J06483k43398l90987K8335J3315l58126j35337j59203
$$ 6795275 6479348 6195256 6301739 6058341 5667354 5695689 5709004 5350878 5215541 5056338
18043E056338M5855j77843l25445K0877j21739k40284j59446L8552J05952k98335
$$ 5056338 5102193 4924350 4598905 4619782 4498043 4257759 4098313 4136865 4242817 3944482
18033C944482r6907k82997l39084q3207k74346p6636r0273r7069j26651l030K79811
$$ 3944482 3847575 3564578 3225494 3142287 2867941 2791305 2701032 2603963 2477312 2474282 2754093
18022B754093q9415j26784P2730m35786j75447j6081J39956K29216j24864L1224
$$ 2754093 2664678 2537894 2610624 2174838 1999391 1983310 2123266 2352482 2227618 2258842
18012B258842k52546K09107j55775q0726j29658k24160o0463K75130K59998k5192
$$ 2258842 2006296 2215403 2059628 1978902 1849244 1625084 1564621 1839751 2099749 2074557
18002B074557k06074m7082r5797m35721k46960k78397L9448Q2512J99461k88305
$$ 2074557 1868483 1821401 1725604 1289883 1042923 764526 803974 886486 1085947 797642
17992G97642j25453N3184J68655l07064j87044r9555J00114J5180P3662J22481
$$ 797642 672189 725373 894028 586964 399920 300365 400479 415659 489321 611802
17982F11802r0379m90022J58544L18891P3072j02061l95036M2266J48127L2424
$$ 611802 521423 31401 189945 508836 581908 479847 84811 127077 275204 307628
17972C07628J6706J13128J75059J74099j98576l56567J33402J41590k70745k93968
$$ 307628 324334 437462 612521 786620 588044 231477 364879 506469 235724 -58244
17962e8244J195l5682m2841j44223K0587l5477n6164J95253L11555N37328M8971
$$ -58244 -57049 -92731 -135572 -279795 -259208 -294685 -350849 -155596 155959 693287 742258
17951G42258n2478j56081k90307p5453j9498J61084k09522m3967K45067K79824
$$ 742258 689780 533699 243392 167939 148441 309525 100003 56036 301103 580927
17941E80927l00435k73247J29762L07510N0033o70717k05905N35023M54769J66379
$$ 580927 280492 7245 137007 444517 494550 -176167 -382072 152951 607720 774099
17931G74099P1531k74502m14237n2910k46022P6134L70126J71337j30619L52826
$$ 774099 845630 571128 156891 103981 -142041 -65907 304219 475556 344937 697763
17921F97763K17827N0616R1836j23667j50408J50617j57052k18384m8886J19732
$$ 697763 915590 966206 1058042 934375 783967 934584 777532 559148 510262 629994
17911F29994J9695r2430k14962K81327M79740P0852l17104k45262n7221j83081
$$ 629994 649689 557259 342297 623624 1103364 1174216 857112 611850 554629 371548
17901C71548j30814J03435P4322l55478j69266J65168J80553m3111L3456k55514
$$ 371548 240734 344169 418491 63013 -106253 58915 239468 196357 229813 -25701
17891b5701J05444J51391k77252N006n1279J47536j87623j43148K70989K62928
$$ -25701 79743 231134 -46118 -41112 -92391 55145 -132478 -275626 -4637 258291
17881B58291L13825j98189M7041J36148l61162k48046J79476J73640l91488L82102
$$ 258291 572116 373927 420968 557116 195954 -52092 127384 301024 -90464 291638
17871B91638J50463K38564K3998r1690m32259J42096K06082l5557P5118P295n58042
$$ 291638 442101 680665 704663 612973 180714 322810 528892 493335 568453 575748 17706
17860A7706k69148L40571M54999K86059P3537k15505m77531j86398J71995l0010
$$ 17706 -251442 89129 544128 830187 903724 688219 210688 24290 196285 166275
17850A66275j68768o4278L97021J81897M22558j88403k47437K26223M31163K99256
$$ 166275 -2493 -66771 330250 512147 934705 746302 498865 725088 1156251 1455507
17840A455507j34532O6736j36651J68424j2786l03377k52498j3334M24282n6018
$$ 1455507 1320975 1387711 1251060 1419484 1406698 1103321 850823 837489 1261771 1205753
17830A205753m08317N4664M72782m30169l31338n2985l08362M2002L16619J43337
$$ 1205753 797436 852100 1324882 894713 563375 510390 202028 244030 560649 703986
17820G03986k66097J19790N9138J48009J6650j26541k3918R8479l62179j15044
$$ 703986 437889 557679 616817 764826 781476 654935 631017 729496 367317 252273
17810B52273L10402J18084j12821m0264J06867l6086k45887k03692L89479J17456
$$ 252273 562675 680759 567938 527674 634541 598455 352568 148876 538355 655811
17800F55811p1363p4250k29628L17583L94369j41807l2433l25850m11061j96626
$$ 655811 584448 510198 280570 598153 992522 850715 818282 492432 81371 -115255
17790a15255j44211K6778Q6869K14451j53883k09451L70618j85919J09826p9461
$$ -115255 -259466 -232688 -145819 68632 -85251 -294702 75916 -110003 -177 -79638
17780g9638J189k04747P1278j20146j85021l59228K95271K64327N1149O411k84733
$$ -79638 -78449 -283196 -211918 -332064 -517085 -876313 -581042 -316715 -265566 -259155 -543888
17769e43888o2626J10268J08316O7210J59879P2895r7853J19623m7565j44343
$$ -543888 -606514 -496246 -387930 -320720 -160841 -87946 -185799 -66176 -113741 -258084
17759b58084J07122M20732J08971m4611m43530k23209J26697N88769R2073l05613
$$ -258084 -150962 269770 378741 334130 -109400 -332609 -205912 382857 474930 169317
17749A69317q4921k01862k05330K65921k36807l33813K53557M3801j02643K88893
$$ 169317 84396 -117466 -322796 -56875 -293682 -627495 -373938 -330137 -432780 -143887
17739a43887K14612M20700J20000P7456j81127j29023J14744L11777J81503k31717
$$ -143887 70725 491425 611425 688881 507754 378731 493475 805252 986755 755038
17729G55038n09376K5136L765N6054j4271q4587j13958l03768k82214k07971N8070
$$ 755038 245662 270798 274563 330617 316346 231759 117801 -185967 -468181 -676152 -618082
17718f18082K28009Q1774j2259m1658J61466K11882Q3800J82053K78782k52095
$$ -618082 -390073 -308299 -320558 -362216 -200750 11132 94932 276985 555767 303672
17708C03672l91244k74889L29749p564l6012j54621J47054K59374n3244j4480
$$ 303672 -87572 -362461 -32712 -40276 -76288 -230909 -83855 175519 122275 107795
17698A07795k54261j86215J19322k01784K0994J05178j53598o6471r6938L84478
$$ 107795 -146466 -332681 -213359 -415143 -394149 -288971 -442569 -509040 -605978 -221500
17688b21500M27402N2384L30987j51392n26901l31616R2191N4108j61019L18192
$$ -221500 205902 258286 589273 437881 -89020 -420636 -328445 -274337 -435356 -117164
17678a17164j48065J34718M89924J12360k07744l20489P3423O40238J33155m10482
$$ -117164 -265229 -130511 359413 471773 264029 -56460 16963 657201 790356 379874
17668C79874j83296l90964m2609N086M4569K1330L12782L75j0921l93837l17750
$$ 379874 196578 -194386 -236995 -231909 -187340 -166010 146772 147147 136226 -257611 -575361
17657e75361j6392m897J12777M59364N37202N4027k25916k81873j75450K73813
$$ -575361 -591753 -596650 -483873 -24509 512693 566720 340804 58931 -116519 157294
17647A57294J12893K26126O1361N2580q2832m19261o2066K40717J99461j20097
$$ 157294 270187 496313 557674 610254 527422 108161 46095 286812 486273 366176
17637C66176l56631q4153j65156L66565N3547l37785o0378J37016M76274O07556
$$ 366176 9545 -74608 -239764 126801 180348 -157437 -217815 -80799 395475 1003031
17627A003031j09104j13553k31094l87596k42045O1948o7094M46660L02329j19345
$$ 1003031 893927 780374 549280 161684 -80361 -18413 -85507 361153 663482 544137
17617E44137j67144M6673j33795j27912k1434J95629j64960J79918L7399k1874
$$ 544137 376993 423666 289871 161959 140525 336154 171194 351112 388511 366637
17607C66637J4539j11287l19292j75218l4229j18954K46417J69876l04245R3077
$$ 366637 381176 269889 -49403 -224621 -258850 -377804 -131387 38489 -265756 -172679
17597a72679K13278M83295R9637l76834l46243j91636N0746q3251L2949J49793
$$ -172679 40599 523894 623531 246697 -99546 -291182 -240436 -323687 -290738 -140945
17587a40945J7913K46293J54392J10754j8717Q4583l48216r9665J90731J37084
$$ -140945 -123032 123261 277653 388407 369690 454273 106057 6392 197123 334207
17577C34207J08897k41855j97506R6756k69167k10852J31337K72029j65742j44158
$$ 334207 443104 201249 3743 100499 -168668 -379520 -248183 23846 -141896 -286054
17567b86054K27417L27109L98411K47809m64450n45870j84664J73177N05258M47295
$$ -286054 -58637 268472 666883 914692 450242 -95628 -280292 -107115 398143 845438
17557H45438k70619n04597j596k70160J55509K11967p6692M6924l3806M9981Q8616
$$ 845438 574819 70222 68626 -201534 -46025 165942 89250 136174 102368 152349 240965
17546B40965l46882M3684j40681J10894R2813L14391K8899J52840p2149l34961
$$ 240965 -105917 -62233 -202914 -92020 793 315184 344083 496923 424774 89813
17536H9813Q2117l5577m48667k1691k3231j87273J74748J16479K30496J47926
$$ 89813 171930 136353 -312314 -334005 -357236 -544509 -369761 -253282 -22786 125140
17526A25140k71635j52628J15946p4792l0236M38630j32474p0786M0902j35047
$$ 125140 -146495 -299123 -183177 -257969 -288205 150425 17951 -52835 -11933 -146980
17516a46980k12341J07928K92358k60110l20817J08955L87112O3340P6935J00439
$$ -146980 -359321 -251393 40965 -219145 -539962 -431007 -43895 19445 96380 196819
17506A96819m91331m8587J8990K83392j88760P5651N64403j37384j39617L47367
$$ 196819 -294512 -343099 -324109 -40717 -229477 -153826 410577 273193 133576 480943
17496D80943m3588J21953J81140p4969J07799l72934k79713M8865j02556r1890
$$ 480943 437355 559308 740448 665479 773278 400344 120631 169496 66940 -24950
17486b4950L703L57082J57723j94441K78701K41361l1017k78445Q1690K27828
$$ -24950 -21247 335835 493558 299117 577818 819179 788162 509717 591407 819235
17476H19235k08143n72668J73756L15030j8486k54237j5104J56921Q5363n3837
$$ 819235 611092 38424 212180 527210 508724 254487 239383 396304 481667 427830
17466D27830j57915j5034j21896J35151K82850R6848j8967k79421P9473q9741
$$ 427830 269915 254881 132985 268136 550986 647834 628867 349446 428919 339178
17456C39178k75926j37500L0052J47807J39989J3696M13424J10972l64067j76143
$$ 339178 63252 -74248 -44196 103611 243600 257296 670720 781692 417625 241482
17446B41482k3305j98978J02993J01412J64944K91665O61122J5481k10916K40999
$$ 241482 218177 19199 122192 223604 388548 680213 1341335 1356816 1145900 1386899
17436A386899M20185k42388k99450o14366k98658r237j65272K20044O1521k31870
$$ 1386899 1807084 1564696 1265246 650880 352222 342985 177713 397757 459278 227408
17426B27408j37021M78433J51464j77370n1237j7251j79032m10383K8277J4249
$$ 227408 90387 568820 720284 542914 491677 474426 295394 -114989 -86712 -72463
17416g2463Q3581K6192J74790l8533r7131k5193K0099l565k7119k67585J80529
$$ -72463 11118 37310 212100 173567 76436 51243 71342 67777 40658 -226927 -46398
17405d6398K50962n3646j3018P6551J16105L89417K26822k69034k80644n11472
$$ -46398 204564 150918 137900 214451 330556 719973 946795 677761 397117 -114355
17395a14355O6580N49364M06148R2025j76085k15626o3292k11067o8116j32031
$$ -114355 -47775 501589 907737 999762 823677 608051 544759 333692 265576 133545
17385A33545j05066Q1154L7439M6729J37913N7760j92072p7074l8673P0785j56562
$$ 133545 28479 109633 147072 193801 331714 389474 197402 120328 81655 152440 -4122
17374d122j26376j8121K48018j30008j6141L25892J20384L47678J96518j03083
$$ -4122 -130498 -148619 99399 -30609 -46750 279142 399526 747204 943722 840639
17364H40639l19788L56203O23166k45204k48051j85517k28211j22162o057K1253
$$ 840639 520851 877054 1500220 1255016 1006965 821448 593237 471075 465018 486271
17354D86271o3541K0069j36159J66000Q5336r8692J17370J28227K31564j96862
$$ 486271 422730 442799 306640 472640 557976 459284 576654 704881 936445 739583
17344G39583l5558n178j23872M27389M27897K55782R9816L52829r7159l22148
$$ 739583 704025 698847 574975 1002364 1430261 1686043 1785859 2138688 2041529 1719381
17334A719381K05239j03619m05447K33988K47963M14329J84944O20046K75551
$$ 1719381 1924620 1821001 1415554 1649542 1897505 2311834 2496778 3116824 3392375
17325C392375l09180o9210M17387L38308L04426R94915J002167J452177J719923
$$ 3392375 3083195 3013985 3431372 3769680 4074106 5069021 6071188 7523365 9243288
17316I243288J588074K501177M493646P330767J0804937J2503045J1974071J0580469
$$ 9243288 10831362 13332539 17826185 25156952 35961889 48464934 60439005 71019474
17308G1019474J0094106Q534042L456650j617608o196659o863930q404430j0950718
$$ 71019474 81113580 89647622 93104272 91486664 85290005 78426075 70021645 59070927
17300E9070927j2448640j0500401o499861l415237j542664n84843N88263K256245
$$ 59070927 46622287 36121886 29622025 26206788 24664124 24079281 24667544 26923789
17292B6923789M180423O878878J1140690J3515845J2507273J0950416J0649098
$$ 26923789 31104212 37983090 49123780 62639625 75146898 86097314 96746412
17285I6746412R206663L054564l119945p930580q386093j0078534j2244902j4389130
$$ 96746412 105953075 109007639 105887694 97957114 89571021 79492487 67247585 52858455
17277E2858455j2588362q380602m991296l242194k450648j876711j634331j357014
$$ 52858455 40270093 31889491 26898195 23656001 21205353 19328642 17694311 16337297
17269A6337297j167522j002500n80186r20610o17873m73221n8612k15786j82163
$$ 16337297 15169775 14167275 13587089 12666479 12048606 11575385 11516773 11300987 11118824
17260A1118824l32961q59739q79657j21766j55725q58331k08020m43697j43379
$$ 11118824 10785863 9926124 9046467 8924701 8768976 7910645 7702625 7258928 7115549
17251G115549J4085n7387l4560j17596n05119j21370k20774j33314j15491k97828
$$ 7115549 7129634 7072247 7037687 6920091 6414972 6293602 6072828 5939514 5824023 5526195
17241E526195m61410l18231O2621K1771k38110n22319r7950J13837j10215k28721
$$ 5526195 5064785 4746554 4809175 4830946 4592836 4070517 3972567 4086404 3976189 3747468
17231C747468l08625m39794k12717p5647L90159J14138l14883k03124M7107k84352
$$ 3747468 3438843 2999049 2786332 2710685 3100844 3214982 2900099 2696975 2744082 2459730
17221B459730l8047l16716j22441J28384M08389k43122l51365q5728q7743l59011
$$ 2459730 2421683 2104967 1982526 2110910 2519299 2276177 1924812 1839084 1751341 1392330
17211A392330k33954K81064M97039k74109m19847K24828K86461j35372k18359
$$ 1392330 1158376 1439440 1936479 1662370 1242523 1467351 1753812 1618440 1400081
17202A400081J28696K39908N7340j13940k94664m93663k31600k25711j95407k18298
$$ 1400081 1528777 1768685 1826025 1712085 1417421 923758 692158 466447 271040 52742
17192E2742K29139L63349J84763L02907j04248k15493r1819J49116j86023J07898
$$ 52742 281881 645230 829993 1132900 1028652 813159 721340 870456 684433 792331
17182G92331J85932q1220K6406j60333n0991j8797o26488J5316J84305K02396
$$ 792331 978263 897043 923449 763116 712125 693328 66840 82156 266461 468857
17172D68857K10078J13628N3227K23962q3823n53457n29968K37386R9501O510
$$ 468857 678935 792563 845790 1069752 985929 432472 -97496 139890 239391 245901
17162B45901J51794J76104j18172j07853K32590J94201R799J89409l65110p0483
$$ 245901 397695 573799 455627 347774 580364 774565 784364 973773 608663 538180
17152E38180O4523J80675j70509k01344q6992J99830K71495Q8541n35514j86778
$$ 538180 602703 783378 612869 411525 324533 524363 795858 884399 348885 162107
17142A62107K11542K20738R9361l55287j92273l1465J632R4542j19609j31426
$$ 162107 373649 594387 693748 338461 146188 114723 116355 210897 91288 -40138
17132d0138J00041J77699K1985j68113N1767P3643j06190m3530J02810l5995j61789
$$ -40138 59903 237602 259587 91474 143241 216884 110694 67164 169974 133979 -27810
17121b7810Q5622M87992k70928K9448L5294k79962r0490J94207L9620k14984K526
$$ -27810 57812 545804 274876 304324 339618 59656 -30834 163373 202993 -11991 -9465
17110i465K54044O9348L52074L04444l86629k08848M318R3006m9727n17794q3090
$$ -9465 244579 313927 666001 970445 583816 374968 379286 472292 422565 -95229 -178319
17099a78319L54104k3203k22610l06177N00157J03477j34860M6212j14557J68504
$$ -178319 175785 152582 -70028 -376205 123952 227429 92569 138781 24224 192728
17089A92728r1122R4803k9497k03580o3039L13641J38104j55144j00947J06400
$$ 192728 101606 196409 166912 -36668 -99707 213934 352038 196894 95947 202347
17079B02347N15083P4639k68548N9316m198r6120m02003p954j25629K10081K75846
$$ 202347 717430 792069 523521 582837 578639 482519 80516 72562 -53067 157014 432860
17068D32860j92374k32558l20851k52835j23597J72163J74557K39902L99020K03505
$$ 432860 240486 7928 -312923 -565758 -689355 -517192 -342635 -102733 296287 499792
17058D99792J61110l21470j40337J28554J31735k71525p8219J48495K68237j72669
$$ 499792 660902 339432 199095 327649 459384 187859 109640 258135 526372 353703
17048C53703j63105k94217k45711J68354O9947P6410L5172K86698J75534n294
$$ 353703 190598 -103619 -349330 -180976 -111029 -34619 553 287251 462785 457491
17038D57491J82217J41375j63392n0741k1946k2054Q7539L24513j24680j44701
$$ 457491 639708 781083 617691 566950 545004 522950 610489 935002 810322 665621
17028F65621p5556k16379j24778n4167j39601j1290K03427Q5498M12443j05666
$$ 665621 590065 373686 248908 194741 55140 43850 247277 332775 745218 639552
17018F39552j98983M1636j15510K7898q1296L98778O443m63191l6842J89288j12280
$$ 639552 440569 482205 366695 394593 313297 712075 718518 255327 218485 407773 295493
17007B95493J14567L0495k12061j41118N0069j33572q023M25656J68101L23853
$$ 295493 410060 440555 228494 87376 137445 3873 -4150 421506 589607 913460
16997I13460l6245J27276Q6048J3362j95107k63199k79931l2121O9975P6902K27730
$$ 913460 877215 1004491 1090539 1103901 908794 645595 365664 333543 403518 480420 708150
16986G08150N7810J09563k64098j40099j57846q5385m2411N50587j29907l2730
$$ 708150 765960 875523 611425 471326 313480 228095 185684 736271 606364 573634
16976E73634J99768M691K14897O5369l43251L46571l5555M6548K57350J99562
$$ 573634 773402 778093 992990 1058359 715108 1061679 1026124 1072672 1330022 1529584
16966A529584k58821j29214R3840M50333N02882K44068L12400L27271l28477l06088
$$ 1529584 1270763 1141549 1235389 1685722 2188604 2432672 2745072 3072343 2743866 2437778
16956B437778j18932J60363O34598N39649J09559J93191M94307P47481P52543
$$ 2437778 2318846 2479209 3113807 3653456 3763015 3956206 4450513 5197994 5950537
16947E950537Q51853R91890J226235J906298L323100N373628R473212J3548969
$$ 5950537 6802390 7794280 9020515 10926813 14249913 19623541 29096753 42645722
16939D2645722J4463619Q144604K710835K214602j223543j3020748j4251166p245222
$$ 42645722 57109341 65253945 67964780 70179382 68955839 55935091 41683925 34438703
16931C4438703j042766L871844R038998J2989689J0708870L957372J240147J200935
$$ 34438703 33395937 37267781 46306779 59296468 70005338 73962710 75202857 76403792
16923G6403792o164659j4917793j0222069k765796L727469R434595J0311064M882935
$$ 76403792 70239133 55321340 45099271 42333475 46060944 55495539 65806603 70689538
16915G0689538P61719P75704k035949j2584304j3064356o960035j823908K982068
$$ 70689538 71451257 72226961 70191012 57606708 44542352 37582317 35758409 38740477
16907C8740477P878175J0755526Q589014K570138j98521l90674p341295j5221925
$$ 38740477 46618652 57374178 65963192 68533330 68334809 67944135 60602840 45380915
16899D5380915j1791125p466751m177137k519768k036758j439078j137620r20338
$$ 45380915 33589790 26123039 21945902 19426134 17389376 15950298 14812678 13892340
16891A3892340o73569p47052r43032n39789o09145n70905l66556k40097k97308
$$ 13892340 13218771 12471719 11528687 10988898 10379753 9808848 9442292 9202195 8904887
16882H904887j37242l4942Q9353o60306n36767m00662m45733M2786k78063l27499
$$ 8904887 8767645 8732703 8822056 8161750 7624983 7224321 6778588 6821374 6543311 6215812
16872F215812n33151l72640l59234M1249J39564j92868k60263k89118j02149j63931
$$ 6215812 5682661 5310021 4950787 4992036 5131600 4938732 4678469 4389351 4287202 4123271
16862D123271k34366j15268P6349k8275p6080L15509l03727k86452k44862j58731
$$ 4123271 3888905 3773637 3849986 3821711 3745631 4061140 3757413 3470961 3226099 3067368
16852C067368k44324l01314j29966j60886j76480k04039j72418P3504K71896J48576
$$ 3067368 2823044 2521730 2391764 2230878 2054398 1850359 1677941 1751445 2023341 2171917
16842B171917n2190j05892O4345J93478l57139j23278L0168n35810l09464J969
$$ 2171917 2119727 2013835 2078180 2271658 1914519 1791241 1821409 1285599 976135 978104
16832I78104K50637J38117j57419j16239o1222p9338j80480K95590p8997j88083
$$ 978104 1228741 1366858 1209439 1093200 1031978 952640 772160 1067750 988753 800670
16822H00670R9612j4738j94983j1653j5958l59631N1083K60246O0690J61436j56459
$$ 800670 900282 885544 690561 678908 662950 303319 354402 614648 675338 836774 680315
16811F80315o9315K59733R7359j99383r7985Q2176j0359J33268j60716k60934
$$ 680315 611000 870733 968092 768709 670724 752900 742541 875809 715093 454159
16801D54159l71244l09812m8599K63125L23498k1057J81320j3568k41737p5304
$$ 454159 82915 -226897 -275496 -12371 311127 290070 471390 457822 216085 140781
16791A40781j18419Q3501j17369L39782R4699M1925L2141j6685J31416l8254o63223
$$ 140781 22362 105863 -11506 328276 422975 464900 497041 480356 611772 573518 -89705
16780h9705k6305K91286M0150K0996j31542n51318n7383L8401J72567J95508j20488
$$ -89705 -116010 175276 215426 236422 104880 -446438 -503821 -465420 -292853 -97345 -217833
16769b17833k59191j51558L52062M67344N99266l70804J75962L69661k26875k55768
$$ -217833 -477024 -628582 -276520 190824 790090 419286 595248 964909 738034 482266
16759D82266j69584R5537Q4905q144n4816l12341k14010K02908L3766j68968K4700
$$ 482266 312682 408219 493124 484980 430164 117823 -96187 106721 140487 -28481 -3781
16748c781M94869P45963n4473j51117m85163J99824j44656k55072J01714j34842
$$ -3781 491088 1237051 1182578 1031461 546298 746122 601466 346394 448108 313266
16738C13266l8211k69396q4030K68899J38849j05533j39569K25332j55618Q3007
$$ 313266 275055 5659 -78371 190528 329377 223844 84275 309607 153989 236996
16728B36996K50986K40679J79872M2715J3216k68466l11994K9101K17134Q6194
$$ 236996 487982 728661 908533 951248 964464 695998 384004 413105 630239 716433
16718G16433J02861j37932k68515k3630p0298j75420l7765k29K62777R4750q3568
$$ 716433 819294 681362 412847 389217 318919 143499 105734 105505 368282 463032 379464
16707C79464r5820k2800N0831m97602j29835J09727J47629K6011O8738J8326j17058
$$ 379464 283644 260844 311675 -185927 -315762 -206035 -58406 -32395 36343 54669 -62389
16696f2389J11868j94731p7402j4964L3274K4700J66399l7090j83900m0157M03361
$$ -62389 49479 -145252 -222654 -237618 -204344 -179644 -13245 -50335 -234235 -274392 128969
16685A28969J29156J34708J28369r0899j81115l96020j44925j01250n0905K08747
$$ 128969 258125 392833 521202 430303 249188 -146832 -291757 -393007 -443912 -235165
16675b35165j52835K24547k77250j92382K76046L08110L78874M15988O1864m16179
$$ -235165 -388000 -163453 -440703 -633085 -357039 -48929 329945 745933 807797 391618
16665C91618m6358q8243k58521k3381q6376j21433J51434P8893L7131l21486M79603
$$ 391618 345260 257017 -1504 -24885 -111261 -232694 -81260 -2367 34764 -286722 192881
16654A92881M3778k90807k94014k07148J89692M2116L1600K39750L69596M9585
$$ 192881 236659 -54148 -348162 -555310 -365618 -323502 -291902 -52152 317444 367029
16644C67029k9441k62759k06120J31043O2800J73371K8237J29673r6822k81736
$$ 367029 337588 74829 -131291 -248 62552 235923 264160 393833 297011 15275
16634A5275r6625L3278J19684L12359j50739m81137J15289J87483K32785k22246
$$ 15275 -81350 -48072 71612 383971 233232 -247905 -132616 54867 287652 65406
16624F5406k72646j14986l9741L07475m5186k8278m0581K15879M29474K48808
$$ 65406 -207240 -322226 -361967 -54492 -99678 -127956 -168537 47342 476816 725624
16614G25624l50124l03354K98428O5840k49897l2626j32844o9740J43775j40066
$$ 725624 375500 72146 370574 436414 186517 153891 21047 -48693 95082 -44984
16604d4984L58531L12349r4964m51246l67976L4564p6582L30044j04465K67126
$$ -44984 313547 625896 530932 79686 -288290 -253726 -330308 -264 -104729 162397
16594A62397J69190K9672j68509j17509O5217m8784M4903l0761k73619j70453
$$ 162397 331587 361259 192750 75241 140458 91674 136577 105816 -167803 -338256
16584c38256m4836J44031L8459j66038k89616J50482N09520K66930K1843J54554
$$ -338256 -383092 -239061 -200602 -366640 -656256 -505774 3746 270676 292519 447073
16574D47073k80104j63337K0289J58313j90986J58154L5034j41578l31620j2203
$$ 447073 166969 3632 23921 182234 -8752 149402 184436 42858 -288762 -300965
16564c00965P2580O345o0056L87748N5141R9002l09687m22038Q0497n2416J42295
$$ -300965 -228385 -222040 -282096 105652 160793 259795 -49892 -471930 -391433 -443849 -301554
16553c01554J65115L58066J93599O522n2622q9992J20696M9130P8772O6301K04424
$$ -301554 -136439 221627 415226 421748 369126 279134 399830 448960 527732 594033 798457
16542G98457p53195o13435K62773J73704j16045M054k2022r5758j33354L3685
$$ 798457 45262 -568173 -305400 -131696 -247741 -243687 -265709 -361467 -494821 -461136
16532d61136R010L57684O6694k08738O1219K05193J84288m2744l73594m89387
$$ -461136 -452126 -94442 -27748 -236486 -175267 29926 214214 171470 -202124 -691511
16522f91511N958K6065L24641K91919l08991j03781J14034j69540L92008J44962
$$ -691511 -685553 -659488 -334847 -42928 -351919 -455700 -341666 -511206 -119198 25764
16512B5764K87329J41246m18176j49766L9575K78774L8614k296j73453l00945
$$ 25764 313093 454339 36163 -113603 -74028 204746 243360 241064 67611 -233334
16502b33334j58788j77851p2344J77776M88939J51028K32812k08322n27183j81342
$$ -233334 -392122 -569973 -642317 -464541 24398 175426 408238 199916 -327267 -508609
16492e08609K6844M31248K28718K38286j33462j51952o2445k26297Q3576J31956
$$ -508609 -481765 -50517 178201 416487 283025 131073 68628 -157669 -74093 57863
16482E7863r1735J70652j36095j57161m1152k46564R6890J27525j3692J7613K70975
$$ 57863 -33872 136780 685 -156476 -197628 -444192 -347302 -219777 -233469 -215856 55119
16471E5119R1788k0003K68844k34636N9741K14966j55013j86445j1006k22097
$$ 55119 146907 126904 395748 161112 220853 435819 280806 94361 83355 -138742
16461a38742j22323L77328k3773k9514r2332J05823M0945l61486o2190K66337
$$ -138742 -261065 116263 92490 62976 -29356 76467 117412 -244074 -306264 -39927
16451c9927K25604J20890k67431l05781o9934M7641J55727o3609j29338j06835
$$ -39927 185677 306567 39136 -266645 -336579 -288938 -133211 -196820 -326158 -432993
16441d32993K8829J87283J21195J69231L16132k95771j88921j58491M5443K01209
$$ -432993 -404164 -216881 -95686 73545 389677 93906 -95015 -253506 -208063 -6854
16431f854r7871l53170p0453K62454L81007j18322n1315j49319j82757K40933
$$ -6854 -104725 -457895 -528348 -265894 115113 -3209 -54524 -203843 -386600 -145667
16421a45667K97544k28986q0077M3084O6062J64839M1729r4711l45782j47034
$$ -145667 151877 -77109 -157186 -114102 -48040 116799 158528 63817 -281965 -428999
16411d28999m8046K33431K60085n841J96881K95883J00846k37025m6143J79323
$$ -428999 -477045 -243614 16471 10630 207511 503394 604240 367215 321072 500395
16401E00395J85361k28635k75956j58742k10129p899K34524J4048J10720j0450
$$ 500395 685756 457121 181165 22423 -187706 -195605 38919 52967 163687 153237
16391A53237r5653j15103L4688k546J9509j68085M78714L04859k75250j9506r3147
$$ 153237 57584 -57519 -22831 -25377 -5868 -173953 304761 609620 334370 314864 221717
16380B21717m38005q6864K07974J66403l07360j28615M12086O1013j30430K50841
$$ 221717 -216288 -303152 -95178 71225 -236135 -364750 47336 108349 -22081 228760
16370B28760p2746J65083J44733j05014J66168K44594k07702k32711o8440o1589
$$ 228760 156014 321097 465830 360816 526984 771578 563876 331165 262725 201136
16360B01136k55218l32658j65131K55484K51912N40029K83289Q0968k01939n7310
$$ 201136 -54082 -386740 -551871 -296387 -44475 495554 778843 859811 657872 600562
16350F00562K51087l3087P0420J07142J1357l05359j73333m5290j91543O1581
$$ 600562 851649 818562 888982 996124 1007481 702122 528789 483499 291956 353537
16340C53537J50694R1768n9635p7856Q3181k89148k23748J98901k12628k76802
$$ 353537 504231 595999 536364 458508 541689 252541 28793 227694 15066 -261736
16330b61736K39188j36355M1j24748J83556J75898K88931l35181l38687J42359
$$ -261736 -22548 -158903 -158862 -283610 -100054 75844 364775 29594 -309093 -166734
16320a66734L34674N3266j56199J90776o2960m59747j30713O7803n8647J61781
$$ -166734 167940 221206 65007 255783 192823 -266924 -397637 -329834 -388481 -226700
16310b26700J48178O7828o5070P7349k02476R9356K93635p648M2498j37336k78908
$$ -226700 -78522 -10694 -75764 1585 -200891 -101535 192100 184452 226950 89614 -189294
16299a89294m24241N7492P693J73800K01363L5516l05557m2987L05379M4071J52021
$$ -189294 -613535 -556043 -548350 -374550 -173187 -137671 -443228 -486215 -180836 -136765 15256
16288A5256J1535k01569o5496J157l05766q7209L93771K22567K65492J37255j93125
$$ 15256 26791 -174778 -240274 -239117 -544883 -632092 -238321 -15754 249738 386993 193868
16277A93868j58048L20589K85367P6374n0154k13277r7935Q7621l6631K418J86292
$$ 193868 35820 356409 641776 718150 667996 454719 356784 444405 407774 410192 596484
16266E96484n47501l25122k7496K00584j6084r4154M5346L31294J45881l09991
$$ 596484 48983 -276139 -303635 -103051 -119135 -213289 -167943 163351 309232 -759
16256g59q8344k6721J82085L41548p4526l30495l44591J6298L27007J97535k06568
$$ -759 -89103 -115824 66261 407809 333283 2788 -341803 -325505 1502 199037 -7531
16245g531r2407L5218J22005l76175j44330n518L89921K24677j83243n4740j66513
$$ -7531 -99938 -64720 57285 -318890 -463220 -468738 -78817 145860 -37383 -92123 -258636
16234b58636j77608K04965R7142r7040m19892j81023N8766N28512P4839k34254
$$ -258636 -436244 -231279 -134137 -231177 -651069 -832092 -773326 -244814 -169975 -404229
16224d04229J13273R9973j17629k61952O9257j6966K6132K49031L31038k76873
$$ -404229 -290956 -190983 -308612 -570564 -501307 -518273 -492141 -243110 87928 -188945
16214a88945J08074n2200J53351k52827O614J71938J6241k35872J35754K29936
$$ -188945 -80871 -133071 20280 -232547 -225933 -53995 -37754 -273626 -137872 92064
16204I2064l83786L00691L88286J10489o6330j72299k42278j66306j31068P8866
$$ 92064 -291722 8969 397255 507744 441414 269115 26837 -139469 -270537 -191671
16194a91671N9795k09239j30550K17714J93213j72890K1222k27519n2044K68111
$$ -191671 -131876 -341115 -471665 -253951 -60738 -233628 -212406 -439925 -491969 -223858
16184b23858m2870l65665J0086J88381j01995j13916l07195J48445L32735n0603
$$ -223858 -266728 -632393 -622307 -433926 -535921 -649837 -957032 -808587 -475852 -526455
16174e26455L63617K32124m3010L026m16318j21444K69241K5855P8546j82887
$$ -526455 -162838 69286 26276 29302 -387016 -508460 -239219 -213364 -134818 -317705
16164c17705Q5900K28058p6529k04307n2528J7734K46272L38697k69272j98017
$$ -317705 -231805 -3747 -80276 -284583 -337111 -319377 -73105 265592 -3680 -201697
16154b01697J96613J38528k51099m40508j39511J99319K76129J99792j8469Q4515
$$ -201697 -5084 133444 -117655 -558163 -697674 -498355 -222226 -22434 -40903 43612
16144D3612J23762n31652m73859L34798P04450J04260K654K69524p4361n8539
$$ 43612 167374 -364278 -838137 -503339 201111 305371 308025 577549 503188 444649
16134D44649l87852r6822j92465k7368M84202N3841m68810Q5282M97215j22653
$$ 444649 56797 -40025 -232490 -259858 224344 278185 -190625 -105343 391872 269219
16124B69219l23774n18121O4810M53477p5182j25341j41587j27959L30681M55060
$$ 269219 -54555 -572676 -507866 -54389 -129571 -254912 -396499 -524458 -193777 261283
16114B61283l9987l16062k0010k27363j14530p2128K18202P2494J40611l0896
$$ 261283 221296 -94766 -114776 -342139 -456669 -528797 -310595 -238101 -97490 -128386
16104a28386k75649m4793K75161J50743q5394L50819L8226L8767r458R0977k33653
$$ -128386 -404035 -448828 -173667 -22924 -108318 242501 280727 319494 310036 401013 167360
16093A67360m56182k55355o3940J01037R0522o8342J42764K94196K56695n3231
$$ 167360 -288822 -544177 -608117 -507080 -416558 -484900 -342136 -47940 208755 155524
16083A55524j09528K32168N68466J9760n54995k01262l78254j43821L60863J31628
$$ 155524 45996 278164 846630 866390 311395 110133 -268121 -411942 -51079 80549
16073H0549m9560K4760j15961J17882Q3426J2901r0014j78830n4286j88584L49173
$$ 80549 30989 55749 -60212 57670 141096 153997 63983 -114847 -169133 -357717 -8544
16062h544J48844R2403m03644m22826k80511J7863J8217l7714K25848K029r3532
$$ -8544 140300 232703 -170941 -593767 -874278 -856415 -838198 -875912 -650064 -648035 -741567
16051g41567j81041K82055k7747J12909K39946J48842M36217K06299o2174M0206
$$ -741567 -922608 -640553 -668300 -555391 -315445 -166603 269614 475913 413739 453945
16041D53945j72110K98229r2961k97852j85139j6541j01903m6784K23786J52222
$$ 453945 281835 580064 487103 189251 4112 -12429 -114332 -161116 62670 214892
16031B14892k26805O2880j85090J53341L06242j49093j58408r0187n6288J15050
$$ 214892 -11913 50967 -134123 19218 325460 176367 17959 -72228 -128516 -13466
16021a3466k15116l7714l51136K26537N04437J19281N57655J02363l88874o4302
$$ -13466 -228582 -266296 -617432 -390895 113542 232823 790478 892841 503967 439665
16011D39665L54816J42287l33668k09158J10973l34928k17816K56142J09418l18148
$$ 439665 794481 936768 603100 393942 504915 169987 -47829 208313 317731 -417
16001d17l23331j2078n6883l04653J04219p0260r7919Q22706L17070k50101n1338
$$ -417 -323748 -335826 -392709 -697362 -593143 -663403 -761322 61384 378454 128353 77015
15990G7015j930J70434j99277m82423j17791J46512M50743n7749l56341P5983
$$ 77015 75085 245519 46242 -436181 -553972 -407460 43283 -14466 -370807 -294824
15980b94824J31134j33466M7281o6164J82595M8749O6829m16815j42132K47488
$$ -294824 -163690 -297156 -249875 -316039 -133444 -84695 -17866 -434681 -576813 -329325
15970c29325J84788K00493K76722k08357m6754K95001P9626j61071k8799k40530
$$ -329325 -144537 55956 332678 124321 77567 372568 452194 291123 262324 21794
15960B1794l35106K12021n5397j45276K67261L2334k77804l08483K86361M65564
$$ 21794 -313312 -101291 -156688 -301964 -34703 -2369 -280173 -588656 -302295 163269
15950A63269l94788k96170N21441J80612n1695k02308l5760K36769q4674j96209
$$ 163269 -231519 -527689 -6248 174364 122669 -79639 -115399 121370 36696 -159513
15940a59513J00589n1438Q4164m7101j17416l68679N2104K87392K06812J56595
$$ -159513 -58924 -110362 -26198 -73299 -190715 -559394 -507290 -219898 -13086 143509
15930A43509L2894K18103K09207j12203J79965k67872j87611l82519J12584M23110
$$ 143509 176403 394506 603713 491510 671475 403603 215992 -166527 -53943 369167
15920C69167L07289k68593k60006K0734r9307k66974k23542J27460M76268o2405
$$ 369167 676456 407863 147857 168591 69284 -197690 -421232 -293772 182496 120091
15910A20091n5253p5035j38976j28795J18820O4400L4806J62965J35277q609J67993
$$ 120091 64838 -10197 -149173 -277968 -159148 -94748 -59942 103023 238300 229691 397684
15899C97684R5221j58206m16l04082n9698M56853L08181l63345l80497p4154j14670
$$ 397684 492905 334699 334283 30201 -29497 427356 735537 372192 -8305 -82459 -197129
15888a97129N27242m05026o26657l419J86090N85593L43083J62230p8081j80477
$$ -197129 330113 -74913 -701570 -704989 -518899 66694 409777 572007 493926 313449
15878C13449k59898k63773k59013J82331J29181J24328M63422r1758l76736k83769
$$ 313449 53551 -210222 -469235 -286904 -157723 -33395 430027 338269 -38467 -322236
15868c22236r2564K01180p2855k96328L76562l7225l77125j71411k2738J45763
$$ -322236 -414800 -213620 -286475 -582803 -206241 -243466 -620591 -792002 -814740 -668977
15858f68977J00764M53890j16421j07438m5466K85218L5211R3562P9320P9273
$$ -668977 -568213 -114323 -230744 -338182 -383648 -98430 -63219 30343 109663 188936
15848A88936J05350P1664k17868k98593o7464j7025K0490J787j45777K33847N1048
$$ 188936 294286 365950 148082 -150511 -217975 -235000 -214510 -212723 -358500 -124653 -73605
15837g3605j30734l8433J11168J56331k04692j70707J34205J77673R9943O28619
$$ -73605 -204339 -242772 -131604 24727 -179965 -350672 -216467 -38794 61149 689768
15827F89768j56190k42161k47683m07307n3919J77718L91178J02585j11089k28731
$$ 689768 533578 291417 43734 -363573 -417492 -239774 151404 253989 142900 -85831
15817h5831k77620j23025N8739L63709K14527j56603k43354l42493J91109L4681
$$ -85831 -363451 -486476 -427737 -64028 150499 -6104 -249458 -591951 -400842 -366161
15807c66161k46204l18643O8997L50582L77641M53688o0386k45439l69473p6975
$$ -366161 -612365 -931008 -862011 -511429 -133788 319900 259514 14075 -355398 -432373
15797d32373J78879l894K12211j30186M4178p3248L5282L71772p518k40319J89590
$$ -432373 -253494 -257388 -45177 -175363 -131185 -204433 -169151 202621 195103 -45216 144374
15786A44374J01558J2384p1494j31118j89555m6281L23188J24616l501n806l9480
$$ 144374 245932 258316 186822 55704 -133851 -180132 143056 267672 264171 258365 218885
15775B18885k98169J20349N628k84998J44708R9826j6951k28394K96753K9382
$$ 218885 -79284 41065 46693 -238305 -93597 6229 -10722 -239116 57637 87019
15765H7019j0331P3536J40046l26076j15330k12203o8198M04748M3481k17001
$$ 87019 76688 150224 290270 -35806 -151136 -363339 -431537 -26789 16692 -200309
15755b00309r4463K04457k31554k83528L02334L82183K6626j31710O0040j56332
$$ -200309 -294772 -90315 -321869 -605397 -303063 79120 105746 -25964 34076 -122256
15745a22256l41329o6351L61331K10121k79086J10458j22554l41421J33898K65555
$$ -122256 -463585 -529936 -168605 41516 -237570 -127112 -249666 -591087 -457189 -191634
15735a91634j44931K8554O8634M41503P4332n24785j81027J28237J17086L36313
$$ -191634 -336565 -308011 -239377 202126 276458 -248327 -429354 -301117 -184031 152282
15725A52282N0824m32162M8661k7667l08401j41904J9393J00784n0757j98326
$$ 152282 203106 -229056 -180395 -208062 -516463 -658367 -638974 -538190 -588947 -787273
15715g87273J84717L32133J73834L8434J3098O6138j90126k86388K98753O15752
$$ -787273 -602556 -270423 -96589 -58155 -45057 21081 -169045 -455433 -156680 459072
15705D59072k20693l39096k47068J58718M6135j52155K72966J49439l26462l38121
$$ 459072 238379 -100717 -347785 -189067 -142932 -295087 -22121 127318 -199144 -537265
15695e37265j99701j4969K38216J18736Q0047j1236J50837J71023K62829K0475
$$ -537265 -736966 -751935 -513719 -394983 -314936 -326172 -175335 -4312 258517 278992
15685B78992L9203k64235m9535K13261j45679j82068Q7197k50242M910N58075
$$ 278992 318195 53960 4425 217686 72007 -110061 -22864 -273106 -268196 289879
15675B89879m6031J6259k08172j5831L38168K36163Q3309m71685j32890k5659
$$ 289879 243848 260107 51935 36104 374272 610435 693744 222059 89169 63510
15665F3510j67755l78810P2969J01980j63009J84189J85374J60552J79843j74120
$$ 63510 -104245 -483055 -410086 -308106 -471115 -286926 -101552 59000 238843 64723
15655F4723M3551j68664L7605K29496j67058J50870O8988r2474p91510j90394
$$ 64723 108274 -60390 -22785 206711 39653 190523 259511 167037 -624473 -814867
15645h14867Q2863J26393j56652K25590J77855K81962J91771J14953m1995K8089
$$ -814867 -732004 -605611 -762263 -536673 -358818 -76856 114915 229868 187873 215962
15635B15962K1619k83656J77001r5167K91263j66247j14754J31557k67992k20509
$$ 215962 237581 -46075 130926 35759 327022 160775 46021 177578 -90414 -310923
15625c10923j99786Q3382K21256N8863j55475q0693J88330R8115M58122Q8547
$$ -310923 -510709 -427327 -206071 -147208 -302683 -383376 -195046 -96931 361191 449738
15615D49738m19690r7571j08261j00236m2489P3905k45439J22450j32712J09115
$$ 449738 30048 -67523 -175784 -276020 -318509 -244604 -490043 -367593 -500305 -391190
15605c91190K57413q9859k24130J11021J46494K33290M10573k34837o85615l0663
$$ -391190 -133777 -223636 -447766 -336745 -190251 43039 453612 218775 -466840 -497503
15595d97503q4764N7353K63427O08930J05877j57134j47522j08275l21188j96976
$$ -497503 -582267 -524914 -261487 347443 453320 296186 148664 40389 -280799 -477775
15585d77775M0505r5134N7315L38340N6925n1505K65188j67733k06674J72079
$$ -477775 -437270 -532404 -475089 -136749 -79824 -131329 133859 -33874 -240548 -68469
15575f8469N92471K39712k84543o86153k30624N1162P3688L91049P3232q3544
$$ -68469 524002 763714 479171 -206982 -437606 -386444 -312756 78293 151525 67981
15565F7981j74202J5152m0225M74193R673k2356O7612k40625o3518k20221j94402
$$ 67981 -106221 -91069 -131294 342899 352572 330216 397828 157203 93685 -126536 -320938
15554c20938q1052K35584m8383R2001K26733N874k66022J10984Q3767m33189q0839
$$ -320938 -401990 -166406 -214789 -122788 103945 109819 -156203 -45219 38548 -394641 -475480
15543d75480K79486L30306j39283o5565k6113j70865k03113q363J70812M7665
$$ -475480 -195994 134312 -4971 -70536 -96649 -267514 -470627 -478990 -308178 -260513
15533b60513R24j71292K12939l6649K2822J86577M62572P9218m86067j25629R5123
$$ -260513 -259589 -430881 -217942 -254591 -231769 -45192 417380 496598 10531 -115098 -19975
15522a9975L5895l9090j28645j38590K42343K26835k43435j70311K56905Q1020
$$ -19975 15920 -23170 -151815 -290405 -48062 178773 -64662 -234973 21932 102952
15512A02952J14414J41572k50196j88241j33877j67491k1369L95069J07668J81320
$$ 102952 217366 358938 108742 -79499 -213376 -380867 -402236 -7167 100501 281821
15502B81821j86356k32130l38124j9988L73351K91537J67934q7476J11318k21363
$$ 281821 95465 -136665 -474789 -494777 -121426 170111 338045 250569 361887 140524
15492A40524j26990o2140L30851J69987j83706l26121r538J57531q6158j59545
$$ 140524 13534 -48606 282245 452232 268526 -57595 -67133 90398 4240 -155305
15482a55305k17084j10729K54499L19053L77993k74188l14903j38181J35810L38862
$$ -155305 -372389 -483118 -228619 90434 468427 194239 -120664 -258845 -123035 215827
15472B15827k09967l83337k31700M88425K90739k36221k98876n42165k3097P7064
$$ 215827 5860 -377477 -609177 -120752 169987 -66234 -365110 -907275 -930372 -853308
15462h53308M16958k5972j795K97401K14069J98703J43489M869J33551N1778l79899
$$ -853308 -436350 -462322 -464117 -166716 47353 246056 389545 394414 527965 579743 199844
15451A99844m9376k76897K9099n7220r852k7889j50729J4899J66226M5504l24838
$$ 199844 150468 -126429 -97330 -154550 -164402 -192291 -343020 -328121 -161895 -116391 -441229
15440d41229L9353J40080K69028J46813P4030J9323l73645k12263j00508J77168
$$ -441229 -401876 -261796 7232 154045 228075 247398 -126247 -338510 -439018 -261850
15430b61850K50280L75958J5045k64015M23416Q3921k82442N5278N008j04866
$$ -261850 -11570 364388 379433 115418 538834 622755 340313 395591 400599 295733
15420B95733p6592p1860p0667R353L19680K87749L8813j68474j81404m55565k40698
$$ 295733 219141 147281 76614 85967 405647 693396 732209 563735 382331 -73234 -313932
15409c13932j49962M9694L40534J93356p1079j00360l82474R6828L75007K13926
$$ -313932 -463894 -414200 -73666 119690 48611 -51749 -434223 -337395 37612 251538
15399B51538j38251k27014p736J25467k51186M1576K07130J84588L15985P4241
$$ 251538 113287 -113727 -121463 4004 -247182 -205606 1524 186112 502097 576338
15389E76338k37768l79582j98811K44648P8982M58684j16210l08744j60538k81002
$$ 576338 338570 -41012 -239823 4825 83807 542491 426281 117537 -43001 -324003
15379c24003J15452J42012L16024l2835j02639Q4797k3401k83705O994K80925
$$ -324003 -208551 -66539 249485 216650 114011 198808 175407 -108298 -101304 179621
15369A79621N3633Q6354K5898r0577l45246j66680M4659j31277n1494k23957J01894
$$ 179621 233254 319608 345506 254929 -90317 -256997 -212338 -343615 -395109 -619066 -517172
15358e17172J94397L37754J56681r9795J22616P0646r8277P7553o27877N1913
$$ -517172 -322775 14979 171660 71865 194481 265127 166850 244403 -383474 -331561
15348c31561K03811L4853K81282j00820j30432m8090r1958r1350P2963J36539
$$ -331561 -127750 -92897 188385 87565 -42867 -90957 -182915 -274265 -201302 -64763
15338f4763L377j06018k50527O8881Q0473k44611K21979K95216K13256J95504
$$ -64763 -61386 -167404 -417931 -349050 -268577 -513188 -291209 4007 217263 412767
15328D12767l36339m12263j80720J39437N06102M81518j42927j18185N2899j55848
$$ 412767 76428 -335835 -516555 -377118 128984 610502 467575 349390 402289 246441
15318B46441j33295j26924n4934J23856J63861p0885k5459r5872J23649J2866
$$ 246441 113146 -13778 -68712 55144 219005 148120 122661 26789 150438 163304
15308A63304n7201j0128J17150R3277j80711N1414k53137q8713K72649n7434M08980
$$ 163304 106103 95975 213125 306402 125691 177105 -76032 -164745 107904 50470 459450
15297D59450M8953m83786o1697K18684o5139k5868r035q9475j35243J59558k11778
$$ 459450 508403 24617 -37080 181604 116465 90597 81562 -7913 -143156 16402 -195376
15286a95376m4759N8648K23626K36673K66642m29731m58534M4011J12148l55092
$$ -195376 -240135 -181487 42139 278812 545454 115723 -342811 -298800 -186652 -541744
15276e41744l33388K32079J57723J27535J72972j58213n0339J23427O6438J52714
$$ -541744 -875132 -643053 -485330 -357795 -184823 -343036 -393375 -269948 -203510 -50796
15266e0796K39895J19875l49814R9546O5706P4980o4651j11683K04303J72176
$$ -50796 189099 308974 -40840 58706 124412 199392 134741 23058 227361 399537
15256C99537j03247n34437j49224m0337K78468K82526P0844R3496j56120k18853
$$ 399537 296290 -238147 -387371 -427708 -149240 133286 204130 297626 141506 -77347
15246g7347K6914k32430j75775O2762M72115J08050k28541n2198J65492L68552
$$ -77347 -50433 -282863 -458638 -395876 76239 184289 -44252 -96450 69042 437594
15236D37594o15521l76723J84580K01357K61349R3931J48715M2879P1813k62429
$$ 437594 -177927 -554650 -370070 -168713 92636 186567 335282 378161 449974 187545
15226A87545l02292j89379J35382L45793j17047m5739R7858L9170n80508l73990
$$ 187545 -114747 -304126 -168744 177049 60002 14263 112121 151291 -429217 -803207
15216h03207L58622J31583J35284J12891L4103J03607O3829j92143J76912k57864
$$ -803207 -444585 -313002 -177718 -64827 -30724 72883 136712 -55431 121481 -136383
15206a36383o5818n2140k66530q9617J67978K97606r7933k18762K13584J45001
$$ -136383 -202201 -254341 -520871 -610488 -442510 -144904 -242837 -461599 -248015 -103014
15196a03014K59753j70p2848l22013l59222k35803L02584K46690R7889J40126
$$ -103014 156739 156569 83721 -238292 -597514 -833317 -530733 -284043 -186154 -46028
15186d6028J71635Q0259k01120J12103k3597l15578Q1931K87030j46367l92396
$$ -46028 125607 205866 4746 116849 93252 -222326 -140395 146635 268 -392128
15176c92128L4019p6999L64298J55219k78096M32545K90316k96743k43982j96825
$$ -392128 -358109 -435108 -70810 84409 -193687 238858 529174 232431 -11551 -208376
15166b08376K9821j5354k1998K1165J34831O3264K49735J03629r4332j60215j1200
$$ -208376 -178555 -193909 -215907 -194742 -59911 3353 253088 356717 262385 102170 90970
15155I0970K45593j41491o7851k0820j28152j68068N7292K17535J8230k45975
$$ 90970 336563 195072 127221 106401 -21751 -189819 -132527 85008 103238 -142737
15145a42737m16549l9211K01790K33351J19463N921P7193l9912J41187J27238
$$ -142737 -559286 -598497 -396707 -163356 -43893 -37972 39221 -691 140496 267734
15135B67734J12440j349j95100m24359j41898L3662j45436K43386L20541k40364
$$ 267734 380174 378825 183725 -240634 -382532 -348870 -494306 -250920 69621 -170743
15125a70743l74643J36208K83282j156J20142M44735j75149l28628K3995n5378
$$ -170743 -545386 -409178 -125896 -127052 -6910 437825 262676 -65952 -41957 -97335
15115i7335J60766k21787j76490k07173K68238N0048k19665Q987J22064j0570
$$ -97335 63431 -158356 -334846 -542019 -273781 -223733 -443398 -434411 -312347 -322917
15105c22917J29199J62617k32686k08595j55897n5019J94868J31305j69278Q897
$$ -322917 -193718 -31101 -263787 -472382 -628279 -683298 -488430 -357125 -526403 -517506
15095e17506K35211K30397K23464l5461j27488k52150o0719M16758J50058o735
$$ -517506 -282295 -51898 171566 136105 8617 -243533 -304252 112506 262564 255829
15085B55829j00665K3311o8613K0409l93663j29730J66803L18717K85496j06875
$$ 255829 155164 178475 109862 130271 -263392 -393122 -226319 92398 377894 271019
15075B71019L2187J31883K28473l04839j37409p481J28560K87329J37621Q5755
$$ 271019 303206 435089 663562 358723 221314 213833 342393 629722 767343 853098
15065H53098j79640k09268j35809k07523n1508J90899J57232j73778n9662k8638
$$ 853098 673458 464190 328381 120858 69350 260249 417481 243703 184041 155403
15055A55403r8027j32246l30606L50596J66806l5517j3995R1978K96428J37002
$$ 155403 57376 -74870 -405476 -54880 111926 76409 62414 154392 450820 587822
15045E87822n09270k12626k7404M5755j33851r7145J33891L45945Q9270O6274
$$ 587822 78552 -134074 -161478 -115723 -249574 -346719 -212828 133117 222387 288661
15035B88661L01605k6545L815m11594j73512o9881r4755p9526m67181k19245L14951
$$ 288661 590266 563721 567536 155942 -17570 -87451 -182206 -261732 -728913 -948158 -633207
15024f33207K07177J66997j23388j31027J56781k27321J5781K18439j08073J31264
$$ -633207 -426030 -259033 -382421 -513448 -356667 -583988 -568207 -349768 -457841 -326577
15014c26577J65291l0826J52689M11432n0469l36970k62220J30855J77412K88270
$$ -326577 -161286 -192112 -39423 372009 321540 -15430 -277650 -146795 30617 318887
15004C18887K62371j78764k90553M27919J11661q4779l94546m0475Q9406l81038
$$ 318887 581258 402494 111941 539860 651521 566742 172196 131721 221127 -159911
14994a59911j53120j26859j01463K704K83846O4328n3074j46874J3342R2067j71352
$$ -159911 -313031 -439890 -541353 -538649 -254803 -190475 -243549 -390423 -377081 -285014 -456366
14983d56366q8564J48679K61000Q9841R5592J97393M9314m266j48032J01777k027
$$ -456366 -544930 -396251 -135251 -45410 50182 247575 296889 292623 144591 246368 244341
14972B44341J1359K7709j005l8289K21083j82732J7750l5509l21284l92856j68955
$$ 244341 255700 283409 282404 244115 465198 282466 300216 264707 -56577 -449433 -618388
14961f18388K25193j01686J03124K90405J03366J85216N19070J84462p9000m95218
$$ -618388 -393195 -494881 -391757 -101352 2014 187230 706300 890762 811762 316544
14951C16544k55810J1800L58098L30135J20302p8302l51940k42089j85629o0093
$$ 316544 60734 72534 430632 760767 881069 802767 450827 208738 23109 -36984
14941c6984J6756k04546q7418K0365J05379q5481l2647L6546J50089N2310O0496
$$ -36984 -20228 -224774 -312192 -291827 -186448 -271929 -304576 -268030 -117941 -65631 -5135
14930e135J35922J04564k30896J5137L5090J03859k89204J85510J39001L1805
$$ -5135 130787 235351 4455 19592 54682 158541 -130663 54847 193848 225653
14920B25653k7580N9584k0633m10347K7935L43243O506r2998k4291q3829j42599
$$ 225653 198073 257657 237024 -173323 -145388 197855 204361 111363 87072 3243 -139356
14909a39356k02136j85436j07617J52345r2680Q4471M98698J77219j09365j86299
$$ -139356 -341492 -526928 -634545 -482200 -574880 -490409 8289 185508 76143 -110156
14899a10156P7731j97900O4189j57285J85196R2039K5265p5719l30833l6012q4079
$$ -110156 -32425 -230325 -166136 -323421 -138225 -46186 -20921 -96640 -427473 -463485 -547564
14888e47564j42605K57944Q992J21216j50869r5367m2887K53602K06556K49944
$$ -547564 -690169 -432225 -423233 -302017 -452886 -548253 -591140 -337538 -130982 118962
14878A18962K7467j82965m11836k32633k0188J82760M76121M04408J58363j63768
$$ 118962 146429 -36536 -448372 -681005 -701193 -518433 -42312 362096 520459 356691
14868C56691j94119j9716k52362j320J15941L1483J11400J97883k65933j76783
$$ 356691 162572 142856 -109506 -110826 5115 36598 147998 345881 79948 -96835
14858i6835P0012J14313k30056J11748Q0172n39l03088j90763j18347K57771M3642
$$ -96835 -26823 87490 -142566 -30818 49354 48815 -254273 -445036 -563383 -305612 -261970
14847b61970j37731L26393Q8628O0989N990J22844r3149r9508J07606J14976n18463
$$ -261970 -399701 -73308 15320 76309 82299 205143 111994 12486 120092 235068 -283395
14836b83395N3151J5528L3643M7126K85999k16343o71878n5979K37029P26319
$$ -283395 -230244 -214716 -181073 -133947 152052 -64291 -736169 -792148 -555119 171200
14826A71200L22811J6573J92615l81695j85002j7983R2820k36541k21690k39409
$$ 171200 494011 510584 703199 321504 136502 118519 211339 -25202 -246892 -486301
14816d86301K42187J52706J60086L89135L16217j55909j40689K83555N4328l26794
$$ -486301 -244114 -91408 68678 457813 774030 618121 477432 760987 815315 488521
14806D88521k1605j52574k28638K33954M66910j13684k15287j81803q9280J99794
$$ 488521 466916 314342 85704 319658 786568 672884 457597 275794 186514 386308
14796C86308n24204k65348J66646j08023P2230J33323j182J87942Q0497k21444
$$ 386308 -137896 -403244 -236598 -344621 -272391 -139068 -140250 47692 128189 -93255
14786i3255j31011L10037j12340J28865r5820O8240J53438p1048J92914K18846
$$ -93255 -224266 85771 -26569 102296 6476 74716 228154 157106 350020 568866
14776E68866O8291m3242J4268l14233j58909r8163J0287J31993L8900k09300P3118
$$ 568866 637157 593915 608183 293950 135041 36878 47165 179158 218058 8758 81876
14765H1876j06687p3303m9191R7495L42657j30412m18126l50539J43290N03337
$$ 81876 -24811 -98114 -147305 -49810 292847 162435 -255691 -606230 -462940 40397
14755D0397N1199j22951l57569q0446K10745N46080j5574n01946J28L11450R8907
$$ 40397 91596 -31355 -388924 -469370 -258625 287455 271881 -230065 -229937 81513 180420
14744A80420j58944q7028M91500J4515k41175j64539M23450j75802L55570k98907
$$ 180420 21476 -65552 425948 440463 199288 34749 458199 282397 637967 339060
14734C39060n86944p6725Q2593J47035P0170P4207J29233q0902j25143K10185
$$ 339060 -247884 -324609 -242016 -94981 -24811 49396 178629 97727 -27416 182769
14724A82769m5334J67720l55078J9206L0596j32798k26982J37669j18622J84202
$$ 182769 137435 305155 -49923 -30717 -121 -132919 -359901 -222232 -340854 -156652
14714a56652k27461j59527K44467L7045M3734K33163L6190j41873O8225K88287
$$ -156652 -384113 -543640 -299173 -262128 -218394 14769 50959 -90914 -22689 265598
14704B65598K16742K8133l79634m37929j86311J15227J63061J19806l8892m2674
$$ 265598 482340 510473 130839 -307090 -493401 -378174 -215113 -95307 -134199 -176873
14694a76873l33660l219q3895k49270L17627N95239L63061m868j59271Q3751j11811
$$ -176873 -510533 -513752 -597647 -846917 -529290 65949 429010 424142 264871 348622 236811
14683B36811O8670r7696l552q7403J9834J94487q8681M7606n1268k14603k47443
$$ 236811 305481 207785 204233 116830 136664 331151 242470 290076 238808 24205 -223238
14672b23238j22657L6302J89448k51953k503J55497J50547J14431J28576L28733
$$ -223238 -345895 -309593 -120145 -372098 -374601 -219104 -68557 45874 174450 503183
14662E03183l1926n88646j55736j71515r7955N8365O28882M9124m8349j62302
$$ 503183 471257 -117389 -273125 -444640 -542595 -484230 144652 193776 145427 -16875
14652a6875k8093K40037k5012J33130l6086j24045J84985J64894j89059j43320
$$ -16875 -44968 195069 170057 303187 267101 143056 328041 492935 303876 160556
14642A60556J2210K80157K06823p0466M5209j20441l44451j45550j14249j99230
$$ 160556 172766 452923 659746 589280 634489 514048 169597 24047 -90202 -289432
14632b89432J29784J6239J61045J25052j51067k21826J59359J66621L2269r060
$$ -289432 -159648 -143409 17636 142688 -8379 -230205 -70846 95775 128044 118984
14622A18984K89813m4582M9216j73000J52925K95172j93772l25174J4979M22472
$$ 118984 408797 364215 413431 240431 393356 688528 494756 169582 184561 607033
14612F07033J97466j70713n30837l02969l19272L8498M2259j44405j21998J26029
$$ 607033 804499 633786 102949 -200020 -519292 -480794 -438535 -582940 -704938 -578909
14602e78909J73945J73174L77486l6165K1988P1836J9672k23295O590j28477N2910
$$ -578909 -404964 -231790 145696 109531 131519 203355 223027 -268 6322 -122155 -69245
14591f9245l42613j54718K76569M82833K05796r3458L5615n5669j2818m22595
$$ -69245 -411858 -566576 -290007 192826 398622 305164 340779 285110 272292 -150303
14581a50303K18482o519k16478k47419j02728R9620L41463j02142k47330J49332
$$ -150303 68179 61660 -154818 -402237 -504965 -405345 -63882 -166024 -413354 -264022
14571b64022M3378K3313K03936J12604p2012p7758K3029L8761q5843k0990j80780
$$ -264022 -220644 -197331 6605 119209 47197 -30561 -7532 31229 -54614 -75604 -256384
14560b56384j76527o2280k87634L33253L04100J65260K12171k8714j01775J2396
$$ -256384 -432911 -495191 -782825 -449572 -145472 19788 231959 203245 101470 113866
14550A13866p0886o6466N4662J57965J18183j12401m1493q5397J12419P0775k23644
$$ 113866 42980 -23486 31176 189141 307324 194923 153430 68033 180452 251227 27583
14539B7583P4169J72458j99335l06998k71410R5312K41692o650J76701K95409
$$ 27583 101752 274210 74875 -232123 -503533 -408221 -166529 -173179 3522 298931
14529B98931L32997r8786l96191j4575K44288l09251k10972l5836L36416L18639
$$ 298931 631928 533142 136951 122376 366664 57413 -153559 -189395 147021 465660
14519D65660k26451l76623j20449J40403L15605j16487j81044P9573J05340l16473
$$ 465660 239209 -137414 -257863 -117460 198145 81658 -99386 -19813 85527 -230946
14509b30946j87698N33028R0740P0376j3899k71177j38905k15021k50199J89783
$$ -230946 -418644 114384 205124 275500 261601 -9576 -148481 -363502 -613701 -423918
14499d23918K02572J95333l9045K5631n0002j87052j77929j19929k19176k7288
$$ -423918 -221346 -26013 -65058 -39427 -89429 -276481 -454410 -574339 -793515 -820803
14489h20803J74919Q0519K65454n14M9284R1910O232L10217K95936M0621j69282
$$ -820803 -645884 -565365 -299911 -300425 -251141 -159231 -152999 157218 453154 493775 324493
14478C24493J49362m97463m54830J25226L09357k2J84940n8678n1278r8654K79841
$$ 324493 473855 -23608 -478438 -353212 -43855 -43877 141063 82385 31107 -67547 212294
14467B12294k2249m31167J42233r0949Q7215K31211n3792Q7336k835j64014j04047
$$ 212294 190045 -241122 -98889 -189838 -102623 128588 74796 162132 159297 -4717 -108764
14456a08764k43322j95334M73183K2511k87094l9842r3325K00279J97171M6552
$$ -108764 -352086 -547420 -74237 -51726 -338820 -378662 -471987 -271708 -74537 -27985
14446b7985L18465J83803R8682j53856k23445n11932o4111M55221M26414k97726
$$ -27985 290480 474283 572965 419109 195664 -316268 -380379 74842 501256 203530
14436B03530m42630J59507m1313j51945L97771L1550q6927j84476k1631K42889
$$ 203530 -239100 -79593 -120906 -272851 124920 156470 69543 -114933 -136564 106325
14426A06325o7199m09419K40844L37095j54599j51490K99380Q5845j32012j32101
$$ 106325 39126 -370293 -129449 207646 53047 -98443 200937 286782 154770 22669
14416B2669o5187J13195M0649p7768k10511k07506M913M42908m4316j58812L40670
$$ 22669 -42518 70677 111326 33558 -176953 -384459 -379546 63362 19046 -139766 200904
14405B00904j34706O12383J11727k09165r7807J09821k08624L0365L75155j71776
$$ 200904 66198 678581 790308 581143 483336 593157 384533 414898 790053 618277
14395F18277j83129N3554j50056N1286l61015k75546M1639K39876J8780J60466
$$ 618277 435148 488702 338646 389932 28917 -246629 -204990 34886 53666 214132
14385B14132k57748k11587k96588r8129L68346J90159K14325K80984K71995k33457
$$ 214132 -43616 -255203 -551791 -649920 -281574 -91415 122910 403894 675889 442432
14375D42432j44215k07247Q6427J37464L17718O7389j74125j21459l38450n19910
$$ 442432 298217 90970 177397 314861 632579 699968 525843 404384 65934 -453976
14365d53976q0927J69305K25912n0611j27780M9179K35374Q5861P4488J23673
$$ -453976 -534903 -365598 -139686 -190297 -318077 -268898 -33524 52337 126825 250498
14355B50498o9741j86014l4389J45920J3398J930K01481j2375m43895j22096k59832
$$ 250498 180757 -5257 -39646 106274 119672 121602 323083 310708 -133187 -255283 -515115
14344e15115J41950L32716K5477R8885k8161j18358K98150o93k18145k1645L65875
$$ -515115 -373165 -40449 -14972 83913 55752 -62606 235544 234851 16706 -4939 360936
14333C60936J04089l80754j29226J24641o9828J27989J43734m5762l79701m7923
$$ 360936 465025 84271 -44955 79686 9858 137847 281581 235819 -143882 -191805
14323a91805J09160M21108O9506j35863j44522j5237j46463k25617m21667p5950
$$ -191805 -82645 338463 407969 272106 127584 112347 -34116 -259733 -681400 -757350
14313g57350M48017j60646m4585J93506J75516J90176K58882J06921M6887n10262
$$ -757350 -309333 -469979 -514564 -321058 -145542 44634 303516 410437 457324 -52938
14303e2938m63798J97126J95973Q333J77242k85387o0675K40940N6902J57722
$$ -52938 -516736 -319610 -123637 -115304 61938 -223449 -284124 -43184 13718 171440
14293A71440J84840j23251j2167R8803k92109J0647k77101j81231J50086L47083
$$ 171440 356280 233029 220862 319665 27556 38203 -238898 -420129 -270043 77040
14283G7040k77105o4950j2275n6334J15342K23537J75726n15595j92232M30373
$$ 77040 -200065 -265015 -277290 -333624 -218282 5255 180981 -334614 -526846 -96473
14273i6473K98064r1284j18832K53451K1979L3470J63796j29253m08137n26969
$$ -96473 201591 110307 -8525 244926 266905 300375 464171 334918 -73219 -600188
14263f00188Q074L76886j63498j65486Q4741j52746K55235K87226J8828M53939
$$ -600188 -592114 -215228 -378726 -544212 -459471 -612217 -356982 -69756 -50928 403011
14253D03011K38195j96498n20202k4991j05597K36236J42772R3704L4531k55951
$$ 403011 641206 444708 -75494 -100485 -206082 30154 172926 266630 301161 45210
14243D5210k86700K79409p7943l7037K43272N46268R0013j19435k60662m06509
$$ 45210 -241490 37919 -40024 -77061 166211 712479 802492 683057 422395 15886
14233A5886k9805R5068N8602O9440l02322J21994k04321m7098J40081k4249j38578
$$ 15886 -13919 81149 139751 209191 -93131 28863 -175458 -222556 -82475 -106724 -245302
14222b45302n1519o5671K84234j72997k04490j6250P0121N3935l9635K07273J72318
$$ -245302 -296821 -362492 -78258 -251255 -455745 -471995 -401874 -347939 -387574 -180301 -7983
14211g983p8892K64687K73063m33750k45055J56154o6503l481K85986L903o7601
$$ -7983 -86875 177812 450875 17125 -227930 -71776 -138279 -141760 144226 148129 80528
14200H0528K2364K53944R4228Q1689j50220J32088k89491k76127j01922R3709
$$ 80528 102892 356836 451064 532753 382533 514621 225130 -50997 -152919 -59210
14190e9210K44169K9675j39338j38110q7182j00746L00741K09782q0676K224j20635
$$ -59210 184959 214634 75296 -62814 -149996 -250742 49999 259781 179105 181329 60694
14179F0694j77002j98548J3853l20198J2688O1607j78407o0894j510q7080K89608
$$ 60694 -116308 -314856 -301003 -621201 -608513 -546906 -725313 -786207 -787717 -874797 -585189
14168e85189L28425J684M2226K22047j39648l29791R8588O4097J88441K39860
$$ -585189 -256764 -255080 -212854 9193 -130455 -460246 -361658 -297561 -109120 130740
14158A30740o7853j19696O4144J3892n88890l9720N59837O08010m9768n4182n59747
$$ 130740 62887 -56809 7335 21227 -567663 -607383 -47546 560464 510696 456514 -103233
14147a03233l94420J94127M53375K30355j49912m61965l51317r8032O6201L05528
$$ -103233 -497653 -303526 149849 380204 230292 -231673 -582990 -681022 -614821 -309293
14137c09293L43254j31286l40838r8358J91761M61130k32889j00233j54797k57847
$$ -309293 33961 -97325 -438163 -536521 -344760 116370 -116519 -216752 -371549 -629396
14127f29396K91605J88660Q5659M9132q4657j65001M9154M06390j13078k08728
$$ -629396 -337791 -149131 -63472 -14340 -98997 -263998 -214844 191546 78468 -130260
14117a30260j33410J88346K32325m43550P2957K22497J84840q3238k12979k70085
$$ -130260 -263670 -75324 157001 -286549 -213592 8905 193745 110507 -102472 -372557
14107c72557k53421O8999L03397J07823M5941J45823K24736O3706J4179l64162
$$ -372557 -625978 -556979 -253582 -145759 -99818 46005 270741 334447 348626 -15536
14097a5536j24705J86498n4310k02723K37833J93083k43156j55023J40940j6036
$$ -15536 -140241 46257 -8053 -210776 27057 220140 -23016 -178039 -37099 -53135
14087e3135l9800L14268k51334j32069K05444L04124j20301n7538N4473j53640
$$ -53135 -92935 221333 -30001 -162070 43374 347498 227197 169659 224132 70492
14077G0492m8028N2503J95634J68232l8948m68k94209l80892K46481O8116k3560
$$ 70492 22464 74967 270601 438833 399885 399417 105208 -275684 -29203 38913 15353
14066A5353K05857L66208l01733k4663o2274k26876Q0541k67819k05451J54192
$$ 15353 221210 587418 285685 261022 198748 -28128 52413 -215406 -420857 -266665
14056b66665J58048j09402l0866k43807k1239M9035O6561J73447J01026j13107
$$ -266665 -108617 -218019 -248885 -492692 -513931 -464896 -398335 -224888 -123862 -236969
14046b36969J45922l31503J59115L20268L9528J72634l29560m66210J99455M82658
$$ -236969 -91047 -422550 -263435 56833 96361 268995 -60565 -526775 -327320 155338
14036A55338R5498m7227j34085J31888J66055Q452N6914n28622p12509K13194
$$ 155338 250836 203609 69524 201412 367467 375919 432833 -95789 -808298 -595104
14026e95104K2541J85553R3151K3640j26946L56136K84823K62320k80604n96237
$$ -595104 -572563 -387010 -293859 -270219 -397165 -41029 243794 506114 225510 -370727
14016c70727j46413K15976J46452l00328J46802M268R4944M98556p8414l50448
$$ -370727 -517140 -301164 -154712 -455040 -308238 -303970 -209026 289530 211116 -139332
14006a39332k49394Q7189K70302J61943J03897j99274p6572O1641P6039j35531
$$ -139332 -388726 -301537 -31235 130708 234605 35331 -41241 20400 96439 -39092
13996c9092m03110j07498K05151K28384O0204k39583L9723K31604K95835o7900
$$ -39092 -442202 -549700 -344549 -116165 -55961 -295544 -255821 -24217 271618 203718
13986B03718j85892j40508Q7594J20127l5695J76504L29527K12382j94179l66070
$$ 203718 17826 -122682 -35088 85039 49344 225848 555375 767757 573578 207508
13976B07508j46234N5469J90336K13866p7824l10098l57125q2730L25134L1453
$$ 207508 61274 116743 307079 520945 443121 133023 -224102 -306832 18302 49755
13966D9755j52510L00012o0815l65984k3840p6617M15527K10984j61238m8340
$$ 49755 -102755 197257 136442 -229542 -253382 -329999 85528 296512 135274 86934
13956H6934j33412j48400m05494J28783M62842K52376M7419L61930k29362j30128
$$ 86934 -46478 -194878 -600372 -471589 -8747 243629 291048 652978 423616 293488
13946B93488l88711l98739J34004K84645j6374J11639Q9670j05902J07651K13794
$$ 293488 -95223 -493962 -359958 -75313 -91687 19952 109622 3720 111371 325165
13936C25165k28265p8557K95928O9833J01399p4228k14210k98023J633k42981
$$ 325165 96900 18343 314271 384104 485503 411275 197065 -100958 -99325 -342306
13926c42306l39867K59094K07929j61670k0729K21536J73215K60637l22887O4985
$$ -342306 -682173 -423079 -215150 -376820 -397549 -176013 -2798 257839 -65048 -63
13916f3K27533N0570j15748m17280k6626J30522K65437M3116j09661j71356k70038
$$ -63 227470 278040 162292 -254988 -281614 -151092 114345 157461 47800 -123556 -393594
13905c93594j29296J01219o4321Q7414P8162K16731J09542j38262K96697L0585
$$ -393594 -522890 -421671 -485992 -398578 -320416 -103685 5857 -132405 164292 194877
13895A94877p9975J85992j00654J275k0381j6332J13440K534l07810k26256K62271
$$ 194877 114902 300894 200240 201515 181134 164802 278242 280776 -27034 -253290 8981
13884H981J88862p7357k28768j33383P6883K07540K78192n2472k53010J59775
$$ 8981 197843 120486 -108282 -241665 -164782 42758 320950 268478 15468 175243
13874A75243M41520n5413l07539j75205R6674Q0615P9872j07844m85983j98084
$$ 175243 616763 561350 253811 78606 175280 255895 335767 227923 -258060 -456144
13864d56144K11351L97020J22699L6303j34650J73090k78932j09343K18282P3965
$$ -456144 -244793 152227 274926 311229 176579 349669 70737 -38606 179676 253641
13854B53641J3104J20337k92920O1233q6384P6316j18094k7867J418J70975r9093
$$ 253641 266745 387082 94162 155395 69011 145327 27233 -634 784 171759 72666
13843G2666n4917J53416k58744k35886j7843J11504K9548J84845M39020K46706
$$ 72666 17749 171165 -87579 -323465 -341308 -229804 -200256 -15411 423609 670315
13833F70315J0330l18995J85854j31469P0655l8849K3642J73821j12607j24306
$$ 670315 680645 361650 547504 416035 486690 447841 471483 645304 532697 408391
13823D08391k64118j72539j37504j07163L83078p0032k31648J73539J06073k5640
$$ 408391 144273 -28266 -165770 -272933 110145 40113 -191535 -17996 88077 62437
13813F2437j93763j48510r6823j92510J55940k93618j91078L38942L01525K84792
$$ 62437 -131326 -279836 -376659 -569169 -413229 -706847 -897925 -558983 -257458 27334
13803B7334K48160l7788k8868j48165N852j16816p5300o3898K74999M76533J07697
$$ 27334 275494 237706 208838 60673 66525 -50291 -125591 -189489 85510 562043 669740
13792F69740k36348j47849k03590Q0313m39803O9675K30950J57255l35797l75554
$$ 669740 433392 285543 81953 162266 -277537 -207862 23088 180343 -155454 -531008
13782e31008R7897M53135L23987k71314J17258J26927p4814p5917m61158n3295
$$ -531008 -433111 20024 344011 72697 189955 316882 242068 166151 -295007 -348302
13772c48302o3196J47485Q0181k86217L4126J64866k11004j2010J33171n2543
$$ -348302 -411498 -264013 -183832 -470049 -435923 -271057 -482061 -494071 -360900 -413443
13762d13443J79039J63873J06257k25105K2144J53907J49160j55212p7353O6010
$$ -413443 -234404 -70531 35726 -189379 -167235 -13328 135832 -19380 -96733 -30723
13752c0723J28169K95763L07057j45892q9425J25731k03730j94654q4802Q2329
$$ -30723 97446 393209 700266 554374 464949 590680 386950 192296 107494 189823
13742A89823J89980j40062o6149j33920k66762r5463K08552M98129L53012k42403
$$ 189823 379803 239741 173592 39672 -227090 -322553 -114001 384128 737140 494737
13732D94737m34095q1589K982k13212r5038M1125j71230j78623n505K54850L58845
$$ 494737 60642 -20947 -17965 -231177 -326215 -285090 -456320 -634943 -640448 -385598 -26753
13721b6753M26955L9450j57191k09260m7482K62623j12055J02917K76762J2485
$$ -26753 400202 439652 282461 73201 25719 288342 176287 279204 555966 568451
13711E68451j89314j52532l16385j00801l5344J0464K21716k23321j22545J65981
$$ 568451 379137 226605 -89780 -190581 -225925 -215461 6255 -217066 -339611 -173630
13701a73630L03966J4042k92689p6243j66984k35278k4882K95604K17851j49033
$$ -173630 130336 144378 -148311 -224554 -391538 -626816 -651698 -356094 -138243 -287276
13691b87276k07152J15856N8897j29626P9140L35741k38523l46920J5638K90240
$$ -287276 -494428 -378572 -319675 -449301 -370161 -34420 -272943 -619863 -604225 -313985
13681c13985J20392K01077J04530j15229N8282K27545L17158J22763j03448j40848
$$ -313985 -193593 7484 112014 -3215 55067 282612 599770 722533 619085 478237
13671D78237l04049j49420N587o9213k14905R4610l07871j43587L58341K10360
$$ 478237 174188 24768 30355 -38858 -253763 -159153 -467024 -610611 -252270 -41910
13661d1910j22556p7404Q8809K61040L5033J57600r9532k59173O3786k0447l5271
$$ -41910 -164466 -241870 -153061 107979 143012 300612 201080 -58093 5693 -14754 -50025
13650e0025j70633j66458J11998L23584N8274p7169p1764L0660O8067K8519m2127
$$ -50025 -220658 -387116 -275118 48466 106740 29571 -42193 -11533 56534 85053 42926
13639D2926J44188j48742k54752l52437J5597J93336L52021q9004L4783K56549
$$ 42926 187114 38372 -216380 -568817 -553220 -359884 -7863 -96867 -62084 194465
13629A94465k00868J50581K43800K64299p2538n13464l30084k06026j14227P0940
$$ 194465 -6403 144178 387978 652277 579739 66275 -263809 -469835 -584062 -513122
13619e13122L97286N6564q274o5647j92659m0092K94167K58683M4055J4182o4085
$$ -513122 -115836 -59272 -67546 -133193 -325852 -365944 -71777 186906 230961 245143 181058
13608A81058K79100r1232j64563k25371p9737R0964J78497K43933j44186k00021
$$ 181058 460158 368926 204363 -21008 -100745 -9781 168716 412649 268463 68442
13598F8442j78383R6820j63577j80080J66565L0667L9749J00900K19214j9686
$$ 68442 -109941 -13121 -176698 -356778 -190213 -159546 -119797 -18897 200317 180631
13588A80631j39619j05385j47840J98566R2482m28907M9066M56471J03897M07039
$$ 180631 41012 -64373 -212213 -13647 78835 -350072 -301006 155465 259362 666401
13578F66401K56622k76603l58731P1201K2275K65612j03073l81746l09763O3624
$$ 666401 923023 646420 287689 358890 381165 646777 543704 161958 -147805 -84181
13568h4181k29134K98054j03975L27806O9469K95840k77203l26225j16386q8406
$$ -84181 -313315 -15261 -119236 208570 278039 573879 296676 -29549 -145935 -234341
13558b34341l18859q625Q9857K04394q30K03928K10439l25831k34017N3848M39474
$$ -234341 -553200 -561825 -471968 -267574 -268404 -64476 145963 -179868 -413885 -360037 79437
13547G9437r7643R2840l1110j63695J06774J82806n4848j25913R7520J46232j74159
$$ 79437 -18206 74634 43524 -120171 -13397 169409 114561 -11352 86168 232400 58241
13536E8241M950l68558l46322l3686J41526M29734P9935P3407n6070J03254K58129
$$ 58241 63191 -305367 -651689 -685375 -543849 -114115 -34180 39227 -16843 86411 344540
13525C44540Q5673k36907k83393P1154K92085j69955j42297K9767K91932j19423
$$ 344540 430213 193306 -90087 -18933 273152 103197 -39100 -9333 282599 163176
13515A63176k23739j78679J6842J12543L38046K00101j32407k01394R665L97255
$$ 163176 -60563 -239242 -222400 -109857 228189 428290 295883 94489 104154 501409
13505E01409M85381j5430n56122R1553K86666m39361n44518l27449l37509N6184
$$ 501409 986790 971360 415238 506791 793457 354096 -190422 -517871 -855380 -799196
13495g99196K53677j39994k39177K53784J89783J15641K8574l0482J29374L83400
$$ -799196 -545519 -685513 -924690 -670906 -481123 -365482 -336908 -367390 -238016 145384
13485A45384j14607j39294k3777J33692j06866j83375P6178K14358J92515J93474
$$ 145384 30777 -108517 -132294 1398 -105468 -288843 -212665 1693 194208 387682
13475C87682K8304j73743j93853q0295J87631k23339r4869K34751K38961q6760
$$ 387682 415986 242243 48390 -31905 155726 -67613 -162482 72269 311230 224470
13465B24470J06331J28736N6200k50571l34014P5072J76803P9835k35468p4284
$$ 224470 330801 459537 515737 265166 -68848 6224 183027 262862 27394 -46890
13455d6890P6838m6031l30085J78323J31566K05197j55322l86660j07763k59769
$$ -46890 29948 -16083 -346168 -167845 -36279 168918 13596 -373064 -480827 -740596
13445g40596J45889N39869J54373j82561O9339N2606J7764l5756L01502n0921
$$ -740596 -594707 -54838 99535 -83026 -13687 38919 56683 20927 322429 271508
13435B71508N9266j36823l22067l00338K2840M76931M6628j87179P950J7439L4048
$$ 271508 330774 193951 -128116 -428454 -405614 71317 117945 -69234 -61284 -43845 -9797
13424i797P7800k35282J50468K05660l10941j40457L7338N1688k72501k8530M04355
$$ -9797 68003 -167279 -16811 188849 -122092 -262549 -225211 -173523 -446024 -474554 -70199
13413g0199K32442j61317L03285N04283J0316k88014j27041k38714L0708n2338
$$ -70199 162243 926 304211 808494 818810 530796 403755 165041 195749 143411
13403A43411m65764K79137M5426K6444J7261k19724N4518J59121o6571j49830
$$ 143411 -322353 -43216 2210 28654 45915 -173809 -119291 39830 -26741 -176571
13393a76571k45799k52831J80533J07509K86836l1105o8376J11088P0993J97426
$$ -176571 -422370 -675201 -494668 -387159 -100323 -131428 -199804 -88716 -17723 179703
13383A79703L32854P4710j38063k19148l81220K0355K95482l26954k64957q3448
$$ 179703 512557 587267 449204 230056 -151164 -130809 164673 -162281 -427238 -510686
13373e10686J24946l8712J8040K43068r9756K40313J50691m13371k43822o0871
$$ -510686 -385740 -424452 -406412 -163344 -263100 -22787 127904 -285467 -529289 -590160
13363e90160J94886j18369Q0112k53J75375J70281L0585l63993l45168L0805L20090
$$ -590160 -395274 -513643 -433531 -433784 -258409 -88128 -57543 -421536 -766704 -735899 -415809
13352d15809L31463j40478l50727P9597K09805r0877p1673Q4192j23875P5118
$$ -415809 -84346 -224824 -575551 -495954 -286149 -377026 -448699 -364507 -488382 -413264
13342d13264J83182K9335q9007J04842q5793J23253K2913P6246j50367n14673
$$ -413264 -230082 -200747 -289754 -184912 -270705 -147452 -124539 -48293 -198660 -713333
13332g13333K6626N84657M3097n8288q3722k25987K55735L85580q4862j27363
$$ -713333 -686707 -102050 -58953 -117241 -200963 -426950 -171215 214365 129503 2140
13322B140k78366n2421k05063l06624K14721K91884R9042N4896j89592j34625
$$ 2140 -276226 -328647 -533710 -840334 -625613 -333729 -234687 -179791 -369383 -504008
13312e04008j27960j63252N72733L72818K58884J09795m68331l46396k85637Q4359
$$ -504008 -631968 -795220 -222487 150331 409215 519010 50679 -295717 -581354 -496995
13302d96995j41909K25701K34740K79549m0843l73338O8195j53112L44202M95851
$$ -496995 -638904 -413203 -178463 101086 60243 -313095 -244900 -398012 -53810 442041
13292D42041j82785k76159Q1304k09691j29815J8362J51437J13998j01261o243
$$ 442041 259256 -16903 64401 -145290 -275105 -256743 -105306 8692 -92569 -98812
13282i8812N5003n2357P1148j05896J67374J55116J47615k94398l55374j32910
$$ -98812 -43809 -96166 -25018 -130914 36460 191576 339191 44793 -310581 -443491
13272d43491J7557L54997n0967l19030J93923J94103J33672L8150J17460J88352
$$ -443491 -425934 -70937 -121904 -440934 -247011 -52908 80764 118914 236374 424726
13262D24726M5268m8786L7275k09367o9873j00143j99805L09343J72473l00011
$$ 424726 469994 421208 458483 249116 179243 79100 -120705 188638 361111 61100
13252F1100m41472j9968L54178L07473N2302j23243M02831O1893k02814J83635
$$ 61100 -380372 -400340 -46162 261311 313613 190370 593201 655094 452280 635915
13242F35915j25077m18407q9203l471K7744k9481k79898O2395J96530N5907j36028
$$ 635915 510838 92431 3228 -243 27501 -1980 -281878 -219483 -22953 32954 -103074
13231a03074j84334J19362N0983m1130K82299J48565j5552o6226k37097l37445
$$ -103074 -287408 -168046 -117063 -158193 124106 272671 257119 190893 -46204 -383649
13221c83649l57974q36J66071K82472J71471J27357J81710j41107k66444L7944
$$ -383649 -741623 -742459 -576388 -293916 -122445 4912 186622 45515 -220929 -182985
13211a82985L87388j23376l53163p2784K31358l32973P3306K88937j51209M12523
$$ -182985 204403 81027 -272136 -344920 -113562 -446535 -373229 -84292 -235501 177022
13201A77022K47891j46922j64122q5990j53863n2240j92497K6941k16910J75550
$$ 177022 424913 277991 113869 27879 -125984 -178224 -370721 -343780 -560690 -385140
13191c85140L6718n2350K50604K04061p156Q1474J12816j14871m2543m53544p8226
$$ -385140 -348422 -400772 -150168 53893 46737 128211 241027 126156 83613 -369931 -448157
13180d48157n3582M46875J68390k19103n6657J3722J21769J22048L16963J45052
$$ -448157 -501739 -54864 113526 -105577 -162234 -148512 -26743 95305 412268 557320
13170E57320k38714j87774J32749K67940K1384l3656l47143r1488K38324j35477
$$ 557320 318606 130832 263581 531521 552905 519249 172106 80618 318942 183465
13160A83465r2518o4272k55544K61590l6193L9857L52335j27747l04178k30422
$$ 183465 90947 26675 -228869 32721 -3472 36385 388720 260973 -43205 -273627
13150b73627K38368j407l19674k58587P760M28198L95697l4119j99175o1020j30923
$$ -273627 -35259 -36666 -356340 -614927 -607167 -178969 216728 182609 -16566 -77586 -208509
13139b08509K29316K27118j97786J46046j09785k22328j8476K98097J22447l51012
$$ -208509 20807 247925 50139 196185 86400 -135928 -154404 143693 266140 -84872
$$ [...]
##END NTUPLES=NMR SPECTRUM
##END=
