##TITLE=Analysis number 313872
Compound Code cc 47804
Book Reference 458/20
Project Code adrs
Chemist Name stevem
##JCAMPDX= 6.0         $$ Bruker NMR JCAMP-DX V2.0
##DATA TYPE= NMR SPECTRUM
##DATA CLASS= NTUPLES
##ORIGIN= Bruker BioSpin GmbH
##OWNER= NMR
$$ XWIN-NMR		Version 3.5
$$ Mon Sep 26 09:43:12 2005 GMT Daylight Time (UT+1h)  MAYBRIDGE\NMR@NMR_250MHZ
##.OBSERVE FREQUENCY= 250.131544655141
##.OBSERVE NUCLEUS= ^1H
##.ACQUISITION MODE= SIMULTANEOUS (DQD)
##.ACQUISITION SCHEME= undefined
##.AVERAGES= 16
##.DIGITISER RES= 18
##SPECTROMETER/DATA SYSTEM= dpx250
##.PULSE SEQUENCE= zg30
##.SOLVENT NAME= CDCl3
##.SHIFT REFERENCE= (INTERNAL, CDCl3, 0, 16.522)
##AUDIT TRAIL= $$ (NUMBER, WHEN, WHO, WHERE, WHAT)
$$ ##TITLE= Audit trail, XWIN-NMR		Version 3.5
$$ ##JCAMPDX= 5.01
$$ ##ORIGIN= Bruker BioSpin GmbH
$$ ##OWNER= NMR
$$ C:\u/data/dgb/nmr/ADRS/9930/pdata/1/auditp.txt
$$ ##AUDIT TRAIL=  $$ (NUMBER, WHEN, WHO, WHERE, WHAT)
(   1,<2005-09-26 09:42:30.92 +100>,<MAYBRIDGE\NMR>,<NMR_250MHZ>,
      <created by zg, POWCHK disabled, PULCHK disabled
       configuration hash MD5:
       62 19 C7 07 E1 42 D1 B7 37 6C 3D D0 77 39 F9 E6
       data hash MD5: 64K
       15 A7 D2 36 25 79 70 FC 9C EF CF 8E C1 44 64 59>)
(   2,<2005-09-26 09:42:50.17 +100>,<MAYBRIDGE\NMR>,<NMR_250MHZ>,
      <Start of raw data processing
       ef LB = 0.3 FT_mod = 6 PKNL = 1 SI = 32K 
       data hash MD5: 32K
       56 D0 90 7D 7F 2C E5 C1 EB 69 61 B6 BE 88 A4 5A>)
(   3,<2005-09-26 09:42:54.69 +100>,<MAYBRIDGE\NMR>,<NMR_250MHZ>,
      <apk 
       data hash MD5: 32K
       BE DC 96 68 DF EF 41 09 94 EE 81 30 D6 10 C0 D4>)
(   4,<2005-09-26 09:42:57.03 +100>,<MAYBRIDGE\NMR>,<NMR_250MHZ>,
      <abs ABSG = 5 
       data hash MD5: 32K
       47 95 34 80 06 23 7B FA 4F 77 84 4D 08 8A 1E AC>)
$$ ##END=
$$ 
$$ hash MD5
$$ 94 C9 14 53 86 5D 32 8D 60 8C 7C 8C 1C E1 2D E5
##$RELAX= 
##$RELAX= 
##$RELAX= 
##$RELAX= 
##$RELAX= 
##$RELAX= 
##$RELAX= 
$$ Bruker specific parameters
$$ --------------------------
##$DU= <C:\u>
##$EXPNO= 9930
##$NAME= <ADRS>
##$PROCNO= 1
##$TYPE= <nmr>
##$USER= <dgb>
##$AMP= (0..31)
100 100 100 100 100 100 100 100 100 100 100 100 100 100 100 100 100 100 
100 100 100 100 100 100 100 100 100 100 100 100 100 100 
##$AQSEQ= 0
##$AQ_mod= 3
##$AUNM= <au_zg>
##$AUTOPOS= <5 >
##$BF1= 250.13
##$BF2= 250.13
##$BF3= 250.13
##$BF4= 250.13
##$BF5= 500.13
##$BF6= 500.13
##$BF7= 500.13
##$BF8= 500.13
##$BYTORDA= 1
##$CFDGTYP= 0
##$CFRGTYP= 5
##$CHEMSTR= <none>
##$CNST= (0..31)
1 1 145 1 1 1 1 1 1 1 1 1 1 1 1 1 1 1 1 1 1 1 1 1 1 1 1 1 1 1 1 1 
##$CPDPRG= <>
##$CPDPRG1= <>
##$CPDPRG2= <>
##$CPDPRG3= <>
##$CPDPRG4= <mlev>
##$CPDPRG5= <mlev>
##$CPDPRG6= <mlev>
##$CPDPRG7= <mlev>
##$CPDPRG8= <mlev>
##$CPDPRGB= <>
##$CPDPRGT= <>
##$D= (0..31)
0 1 0 0 0 0 0 0 0 0.06 0 0 0 0 0 0 0.0002 0 0 0 0 0 0 0 0 0 0 0 0 0 0 
0 
##$DATE= 1127724148
##$DBL= (0..7)
120 120 120 120 120 120 120 120 
##$DBP= (0..7)
150 150 150 150 150 150 150 150 
##$DBP07= 0
##$DBPNAM0= <>
##$DBPNAM1= <>
$$ [...]
##$SUBNAM7= <"">
##$SUBNAM8= <"">
##$SUBNAM9= <"">
##$SW= 20.6930455092707
##$SWIBOX= (0..15)
0 0 3 0 0 0 0 0 0 0 0 0 0 0 0 0 
##$SW_h= 5175.983436853
##$TD= 65536
##$TD0= 1
##$TE= 294.16
##$TE2= 300
##$TE3= 300
##$TEG= 300
##$TL= (0..7)
0 120 120 120 120 120 120 120 
##$TP= (0..7)
150 150 150 150 150 150 150 150 
##$TP07= 0
##$TPNAME0= <>
##$TPNAME1= <>
##$TPNAME2= <>
##$TPNAME3= <>
##$TPNAME4= <>
##$TPNAME5= <>
##$TPNAME6= <>
##$TPNAME7= <>
##$TPOAL= (0..7)
0.5 0.5 0.5 0.5 0.5 0.5 0.5 0.5 
##$TPOFFS= (0..7)
0 0 0 0 0 0 0 0 
##$TUNHIN= 0
##$TUNHOUT= 0
##$TUNXOUT= 0
##$USERA1= <user>
##$USERA2= <user>
##$USERA3= <user>
##$USERA4= <user>
##$USERA5= <user>
##$V9= 5
##$VALIST= <valist>
##$VCLIST= <CCCCCCCCCCCCCCC>
##$VD= 0
##$VDLIST= <DDDDDDDDDDDDDDD>
##$VPLIST= <PPPPPPPPPPPPPPP>
##$VTLIST= <TTTTTTTTTTTTTTT>
##$WBST= 1024
##$WBSW= 4
##$XGAIN= (0..3)
0 0 0 0 
##$XL= 0
##$YL= 0
##$YMAX_a= 358468
##$YMIN_a= -333678
##$ZGOPTNS= <>
##$ZL1= 120
##$ZL2= 120
##$ZL3= 120
##$ZL4= 120
##$ABSF1= 16.522
##$ABSF2= -4.171173
##$ABSG= 5
##$ABSL= 3
##$ALPHA= 0
##$AQORDER= 0
##$ASSFAC= 0
##$ASSFACI= 0
##$ASSFACX= 0
##$ASSWID= 0
##$AUNMP= <proc_1d>
##$AZFE= 0.1
##$AZFW= 0.1
##$BCFW= 0
##$BC_mod= 0
##$BYTORDP= 0
##$COROFFS= 0
##$CY= 12.5
##$DATMOD= 1
##$DC= 0
##$DFILT= <>
##$DTYPP= 0
##$F1P= 14.0000005364418
##$F2P= -0.99999901652339
##$FCOR= 0.5
##$FTSIZE= 32768
##$FT_mod= 6
##$GAMMA= 0
##$GB= 0
##$INTBC= 1
##$INTSCL= 1
##$ISEN= 128
##$LB= 0.3
##$LEV0= 0
##$LPBIN= 0
##$MAXI= 10000
##$MC2= 0
##$MEAN= 0
##$ME_mod= 0
##$MI= 0
##$NCOEF= 0
##$NC_proc= -4
##$NLEV= 6
##$NOISF1= 0
##$NOISF2= 0
##$NSP= 0
##$NTH_PI= 0
##$NZP= 0
##$OFFSET= 16.522
##$PC= 1
##$PHC0= -74.49189
##$PHC1= 4.438636
##$PH_mod= 1
##$PKNL= yes
##$PPARMOD= 0
##$PSCAL= 4
##$PSIGN= 0
##$REVERSE= no
##$SF= 250.13
##$SI= 32768
##$SIGF1= 0
##$SIGF2= 0
##$SINO= 400
##$SIOLD= 32768
##$SREGLST= <1H.CDCl3>
##$SSB= 0
##$STSI= 32768
##$STSR= 0
##$SW_p= 5175.98343685301
##$SYMM= 0
##$S_DEV= 0
##$TDeff= 65536
##$TDoff= 0
##$TI= <Analysis number 999999
Compound Code 99
Book Reference 9
Project Code 9>
##$TILT= no
##$TM1= 0
##$TM2= 0
##$TOPLEV= 0
##$USERP1= <user>
##$USERP2= <user>
##$USERP3= <user>
##$USERP4= <user>
##$USERP5= <user>
##$WDW= 1
##$XDIM= 32768
##$YMAX_p= 267343706
##$YMIN_p= -315379
$$ End of Bruker specific parameters
$$ ---------------------------------
##NTUPLES= NMR SPECTRUM
##VAR_NAME=  FREQUENCY,     SPECTRUM/REAL,   SPECTRUM/IMAG
##SYMBOL=    X,             R,               I
##VAR_TYPE=  INDEPENDENT,   DEPENDENT,       DEPENDENT
##VAR_FORM=  AFFN,          ASDF,            ASDF
##VAR_DIM=   32768,         32768,           32768
##UNITS=     HZ,            ARBITRARY UNITS, ARBITRARY UNITS
##FACTOR=    0.157963299565203, 1,           1
##FIRST=     4132.6476996994, 0,             0
##LAST=      -1043.33573715361, 0,           0
##MIN=       -1043.33573715361, -315379,     0
##MAX=       4132.6476996994, 267343706,     0
$$ Real data points
##PAGE= N=1
##DATA TABLE= (X++(R..R)), XYDATA
$$ [...]
$$ plain form
28052 99685 114348 83170 78612 34682 12706 17689 69919 1683 -6134 -35950 -73130 22924
28040 22924 108133 59172 58590 23692 -9437 -30090 -78494 -54036 -24031 -4729 57873 62600
28028 62600 68029 29027 -23456 65831 52695 -21895 -64883 -56618 -26740 -32330 -63374 -69990
28016 -69990 -18779 30734 33601 11224 28219 38332 -45288 -40046 2875 -3513 53765 73509
28004 73509 75718 96533 85998 57691 -33575 -112450 -80737 14916 32855 61991 30489 -9162
27992 -9162 -18682 15679 28177 36046 50405 49435 77111 -6695 -32173 -3790 -49480 -61998 -26215
27979 -26215 36464 19705 85341 62772 47161 45165 -768 -79847 -101020 -47659 12769 44940
27967 44940 1963 -47412 -31221 -49265 -85102 -137466 -70886 -70810 -81642 -111948 -80329 -15625
$$ packed form
28052I9685J4663l1178m558m3930k1976M983N2230o8236p817k9816l7180R6054
28040B2924Q5209m8961n82l4898l3129k0653m8404K4458L0005J9302O2602M727
28028F2600N429l9002n2483Q9287j3136p4590m2988Q265K9878n590l1044o616
28016f9990N1211M9513K867k2377J6995J0113q3620N242M2921o388N7278J9744
28004G3509K209K0815j0535k8307r1266p8875L1713R5653J7939K9136l1502l9651
27992i162r520L4361J2498P869J4359r70K7676q3806k5478K8383m5690j2518L5783
27979b6215O2679j6759O5636k2569j5611j996m5933p9079k1173N3361O0428L2171
27967D4940m2977m9375J6191j8044l5837n2364O6580P6j0832l0306L1619O4704
$$ plain form
27955 -15625 27315 39034 36923 14516 -16506 -27304 3272 16858 8011 -2676 -28526 -21479
27943 -21479 -25227 -17503 -38524 -72966 -51333 -68661 -61503 -38866 10219 80596 119204 42047
27931 42047 13671 2872 -4402 94510 96268 31962 -44411 -31861 -16793 18226 23936 -47822
27919 -47822 -77409 -100492 -77643 -27571 -31110 -43595 -3357 -1384 86855 103045 107639 16515
27907 16515 -82600 -102735 -41682 -67665 -90580 -84727 -89210 -123486 -108395 -25456 51105 60155
27895 60155 21901 -9967 -55929 -119972 -168364 -118406 -149173 -115935 -112500 -82308 -35574 -59038
27883 -59038 -62015 -25919 46793 129451 178855 135103 71695 27078 29224 -7438 -13792 36386
27871 36386 45565 16308 56346 68945 24092 25698 2246 -36970 -38824 -7874 30620 54941
$$ packed form
27955a5625M2940J1719k111k2407l1022j0798L0576J3586q847j0687k5850P047
27943b1479l748P724k1021l4442K1633j7328P158K2637M9085P0377L8608p7157
27931D2047k8376j0799p274R8912J758o4306p6373J2550J5068L5019N710p1758
27919d7822k9587k3083K2849N0072l539j2485M0238J973Q8239J6190M594r1124
27907A6515r9115k0135O1053k5983k2915N853m483l4276J5091Q2939P6561R050
27895F0155l8254l1868m5962o4043m8392M9958l0767L3238L435L0192M6734k3464
27883e9038k977L6096P2712Q2658M9404m3752o3408m4617K146l6662o354N0178
27871C6386R179k9257M0038J2599m4853J606k3452l9216j854L0950L8494K4321
$$ plain form
27859 54941 29205 -47100 -127405 -100572 -95373 -101501 -67017 -22208 -86731 -94392 51905 89290
27847 89290 91131 76286 50767 85652 45024 10482 -4651 9721 -1202 -5941 29272 36516
27835 36516 24333 -32948 -54493 -60530 -39374 -49692 -73295 -102179 -126490 -117452 -108504 -85491
27823 -85491 -25816 83586 86334 71022 13581 -34358 -26714 14436 33786 -41329 -77199 -7574
27811 -7574 -8025 57048 77152 73608 -28799 -42004 56610 -19245 -14093 20925 -32044 43831
27799 43831 99994 48472 62739 42818 39065 32668 -9932 -55721 -62258 -65699 -75216 -134693 -94088
27786 -94088 10025 -25354 -58811 -6014 -52984 -55770 -89117 -126117 -38991 -41806 -51398 -14073
27774 -14073 -49033 -1143 4554 10289 -6322 -44148 -77571 -34921 -66990 -90804 -105767 -72603
$$ packed form
27859E4941k5736p6305q0305K6833N199o128L4484M4809o4523p661J46297L7385
27847H9290J841j4845k5519L4885m0628l4542j5133J4372j0923m739L5213P244
27835C6516j2183n7281k1545o037K1156j0318k3603k8884k4311R038Q948K3013
27823h5491N9675J09402K748j5312n7441m7939P644M1150J9350p5115l5870O9625
27811g574m51O5073K0104l544j02407j3205R8614p5855N152L5018n2969P5875
27799D3831N6163n1522J4267j9921l753o397m2600m5789o537l441r517n9477M0605
27786i4088J04113l5379l3457N2797m6970k786l3347l7000Q7126k815r592L7325
27774a4073l4960M7890N697N735j6611l7826l3423M2650l2069k3814j4963L3164
$$ plain form
27762 -72603 -43493 -29510 -9541 -4224 -20772 -51559 -56893 -25980 -12896 -37350 -18970 59298
27750 59298 77917 40093 5032 17868 16250 -1130 16531 -5088 15744 -13732 -9139 -15744
27738 -15744 -74546 -3661 -3894 -88293 -38832 60579 103985 126349 123695 160099 135306 53420
27726 53420 -1226 42162 122975 144404 127498 78036 62002 21936 -26843 -25562 -7493 -20434
27714 -20434 13156 -76147 -127364 -168850 -163634 -162676 -122459 -97522 -99141 -105247 -75843 -66521 -51073
27701 -51073 -37203 -33076 -35204 -79258 -45964 -21928 -21847 -3398 -8289 -21453 -22510 -36892 -94417
27688 -94417 -110832 -34530 -8674 -78562 -37550 23134 14026 5379 41666 44341 57078 12453
27676 12453 -7585 -57675 -51752 -61702 -78932 -70178 -150842 -134201 -102837 -32615 87210 124558
$$ packed form
27762g2603K9110J3983J9969N317j6548l0787n334L0913J3084k4454J8380P8268
27750E9298J8619l7824l5061J2836j618j7380J7661k1619K0832k9476M593o605
27738a5744n8802P0885k33q4399M9461R9411M3406K2364k654L6404k4793q1886
27726E3420n4646M3388Q0813K1429j6906m9462j6034m0066m8779J281J8069j2941
27714b0434L3590q9303n1217m1486N216R58M0217K4937j619o106K9404R322J5448
27701e1073J3870M127k128m4054L3294K4036Q1J8449m891j3164j057j4382n7525
27688i4417j6415P6302K5856o9888M1012O0684r108q647L6287K675J2737m4625
27676A2453k0038n0090N923r950j7230Q754q0664J6641L1364P0222J19825L7348
$$ plain form
27664 124558 16009 -17300 31526 117026 107033 123129 124854 82162 -1201 9293 -10825 -21182
27652 -21182 -71982 -47337 -32852 32038 82942 85054 39301 25815 -3401 21466 66786 50678
27640 50678 -14201 -38502 18184 23387 39750 16052 -66414 -117138 -5952 80586 14438 -54987
27628 -54987 -61958 90379 119000 128484 156784 114494 31899 -28403 -51319 -25125 13737 87667
27616 87667 111266 38031 44473 -4093 -73015 -63874 -20696 28062 -14700 -55015 -80240 -111819
27604 -111819 -155678 -158707 -105275 -60873 28810 41044 51115 -12002 743 59513 20581 32109
27592 32109 -3260 -36893 -53656 -34451 8354 83559 63153 78976 68451 43016 39917 -34155
27580 -34155 -95285 -72607 -55429 -39538 11075 15118 -4168 -38590 -78883 -18881 30490 16981
$$ packed form
27664A24558j08549l3309M8826Q5500r993J6096J725m2692q3363J0494k0118j0357
27652b1182n0800K4645J4485O4890N0904K112m5753j3486k9216K4867M5320j6108
27640E0678o4879k4301N6686N203J6363k3698q2466n0724J11186Q6538o6148o9425
27628e4987o971J52337K8621R484K8300m2290q2595o0302k2916K6194L8862P3930
27616H7667K3599p3235O442m8566o8922R141M3178M8758m2762m0315k5225l1579
27604a11819m3859l029N3432M4402Q9683J2234J0071o3117J2745N8770l8932J1528
27592C2109l5369l3633j6763J9205M2805P5205k0406J5823j0525k5435l099p4072
27580c4155o1130K2678J7178J5891N0613M043j9286l4422m0293O0002M9371j3509
$$ plain form
27568 16981 26385 15857 34550 12587 3696 -51002 -24234 18410 12952 31767 -30468 -80635
27556 -80635 -31849 -78102 -96450 -78137 -23424 -31658 -14898 53186 73485 133185 140164 162101
27544 162101 164047 141370 59211 -15773 -7489 13125 -6286 -13870 25753 -17227 -99176 -80578
27532 -80578 -80189 -71827 5262 28866 47803 112415 141500 122445 131156 128056 142428 88728 59379
27519 59379 61425 37613 17626 -26891 -28384 -39167 -185 90744 70478 46312 40974 20792
27507 20792 -43673 -64643 -126678 -93755 -94762 -31211 -18718 26806 88315 43032 80323 43684
27495 43684 21477 -10206 3174 59241 83548 79891 19306 -21528 -78067 -80324 -44614 -56113
27483 -56113 5715 98377 147913 97108 134982 127008 143988 168147 106922 71875 35061 38873
$$ packed form
27568A6981R404j0528J8693k1963q891n4698K6768M2644n458J8815o2235n0167
27556h0635M8786m6253j8348J8313N4713q234J6760O8084K0299N9700O979K1937
27544A62101J946k2677q2159p4984Q284K0614j9411p584L9623m2980q1949J8598
27532h0578L89Q362P7089K3604J8937O4612K9085j9055Q711l100J4372n3700k9349
27519E9379K046k3812j9987m4517j493j0783L8982R0929k0266k4166n338k0182
27507B0792o4465k0970o2035L2923j007O3551J2493M5524O1509m5283L7291l6639
27495D3684k2207l1683J3380N6067K4307l657o0585m0834n6539k257L5710j1499
27483e6113O1828R2662M9536n0805L7874p974J6980K4159o1225l5047l6814L812
$$ plain form
27471 38873 52447 68786 52219 21335 29552 46644 67761 105994 66582 63803 42974 52167
27459 52167 24477 -10489 -64495 -47464 44056 19001 -10363 -10348 48581 77711 48536 -30873
27447 -30873 -55054 -45687 -28258 -28486 18819 51733 -1373 -24716 11009 6950 17130 38496
27435 38496 75213 28983 79644 101507 -33544 -168921 -194274 -180167 -105699 34380 19468
27424 19468 -83916 -128911 -168944 -117419 -14286 -18157 -12994 -32730 -70427 -49728 -53578 -29826
27412 -29826 5972 10028 -30684 19359 45663 -7638 -102228 -59591 -52987 -47817 17811 94157
27400 94157 69980 24590 40962 42464 8063 12034 47217 -2288 -8636 30542 -40541 -60723
27388 -60723 -42812 -45541 -18225 66005 94325 45948 25976 -21100 -80555 -69657 -75474 -27091
$$ packed form
27471C8873J3574J6339j6567l0884Q217J7092K1117L8233l9412k779k0829R193
27459E2167k7690l4966n4006J7031R1520k5055k9364J5N8929K9130k9175p9409
27447c0873k4181R367J7429k28M7305L2914n3106k3343L5725m059J0180K1366
27435C8496L6717m6230N0661K1863j35051j35377k5353J4107P4468J40079j4912
27424A9468j03384m4995m0033N1525J03133l871N163j9736l7697K0699l850K3752
27412b9826L5798M056m0712N0043K6304n3301r4590M2637O604N170O5628P6346
27400I4157k4177m5390J6372J502l4401L971L5183m9505o348L9178p1083k0182
27388f0723J7911k729K7316Q4230K8320m8377j9972m7076n9455J0898n817M8383
$$ plain form
27376 -27091 6765 -943 17355 18760 43224 45911 9348 -12545 -11899 -108891 -88496 -103095 -126533
27363 -126533 -94689 -5854 -6067 49247 -3604 -1944 91821 89376 45090 20842 66277 115668
27351 115668 71374 2602 1487 -55759 -66618 -14007 8253 -3343 36756 74710 27229 75153
27339 75153 34126 24787 68885 95611 63965 41719 5529 20376 17895 49138 51709 17088
27327 17088 13367 11451 -15733 -23089 -11066 -50181 -88485 -116834 -97971 -9811 34127 92234
27315 92234 96407 -16813 -48107 -5558 15353 44741 53726 14458 3711 -397 20023 -14449
27303 -14449 -44984 -56288 -68270 -63198 17835 53394 82798 121344 147199 58421 44861 41888
27291 41888 79193 114604 64278 14336 49767 94957 73201 96885 89182 -23723 -66713 -133699
$$ packed form
27376b7091L3856p708J8298J405K4464K687l6563k1893O46r6992K0395j4599k3438
27363a26533L1844Q8835k13N5314n2851J660R3765k445m4286k4248M5435M9391
27351A15668m4294o8772j115n7246j0859N2611K2260j1596M0099L7954m7481M7924
27339G5153m1027r339M4098K6726l1646k2246l6190J4847k481L1243K571l4621
27327A7088l721j916k7184p356J2023l9115l8304k8349J8863Q8160M3938N8107
27315I2234M173j13220l1294M2549K0911K9388Q985l9268j0747m108K0420l4472
27303a4449l0535j1304j1982N072Q1033L5559K9404L8546K5855q8778j3560k973
27291D1888L7305L5411n0326m9942L5431M5190k1756K3684p703j12905m2990o6986
$$ plain form
27279 -133699 -100971 -6010 29065 75746 99790 106597 77729 52467 -25118 -81891 -23483 -23238
27267 -23238 -65035 -77324 -104757 -44725 -51276 -70574 -18942 38521 42881 55809 65589 -32775
27255 -32775 5373 25756 38030 22240 34814 72349 35058 26500 48260 69524 143091 119197
27243 119197 75649 72004 13855 -18303 71595 100250 120504 77535 25940 26781 47261 3455
27231 3455 -53483 -25151 -28461 -69551 -58622 -36572 -43901 12535 75410 59709 78892 130410
27219 130410 123401 56034 -761 -40354 -3248 82886 129098 116303 100512 74774 84755 40530
27207 40530 7807 26751 34402 14244 -31906 -70438 -54758 9493 28796 10932 37527 63725
27195 63725 -9895 -16248 -9606 -10892 7009 16454 -55465 -62428 33992 93597 145708 76124 43477
$$ packed form
27279a33699L2728R4961L5075M6681K4044O807k8868k5262p7585n6773N8408K45
27267b3238m1797j2289k7433O0032o551j9298N1632N7463M360J2928R780r8364
27255c2775L8148K0383J2274j5790J2574L7535l7291q558K1760K1264P3567k3894
27243A19197m3548l645n8149l2158Q9898K8655K0254m2969n1595Q41K0480m3806
27231C455n6938K8332l310m1090J0929K2050p329N6436O2875j5701J9183N1518
27219A30410p009o7367n6795l9593L7106Q6134M6212j2795j5791k5738R981m4225
27207D0530l2723J8944P651k0158m6150l8532J5680O4251J9303j7864K6595K6198
27195F3725p3620o353O642j286J7901R445p1919o963R6420N9605N2111o9584l2647
$$ plain form
27182 43477 53990 50688 92894 79243 65244 82491 107469 70219 87298 82526 -3694 -53081
27170 -53081 -42230 -26991 25103 101395 96747 29949 -37052 -73090 -163628 -161628 -154974 -112413
27158 -112413 -67881 -54975 -70409 3479 -35858 5774 20284 62411 14649 11352 35169 50769
27146 50769 50646 86946 -45794 -87058 -22890 -17982 8080 -11952 -40669 -25064 -3737 26607
27134 26607 9175 16683 39571 105947 124885 45215 9421 -9643 -25304 20763 48026 13984
27122 13984 -81159 -107818 -139765 -93024 -52770 -60593 -51157 -66671 -73068 -28738 15591 82991
27110 82991 92958 112789 146453 144836 121106 122182 104788 75882 112903 134313 101842 70467
27098 70467 51124 45033 4194 -6643 74394 107555 133177 177074 146053 70236 75554 45417
$$ packed form
27182D3477J0513l302M2206j3651j3999J7247K4978l7250J7079m772q6220m9387
27170e3081J0851J5239N2094P6292m648o6798o7001l6038r0538K000O654M2561
27158a12413M4532J2906j5434P3888l9337M1632J4510M2127m7762l297K3817J5600
27146E0769j23L6300j32740m1264O4168M908K6062k0032k8717J5605K1327L0344
27134B6607j7432P508K2888O6376J8938p9670l5794j9064j5661M6067K7263l4042
27122A3984r5143k6659l1947M6741M0254p823R436j5514o397M4330M4329O7400
27110H2991R967J9831L3664j617k3730J076j7394k8906L7021K1410l2471l1375
27098G0467j9343o091m0839j0837Q1037L3161K5622M3897l1021p5817N318l0137
$$ plain form
27086 45417 -3658 -54500 -31467 -48941 -63255 14514 42660 69962 72641 109650 52351 20711
27074 20711 19368 70114 34840 -39755 -58567 -57629 -55464 -15071 -18017 -56276 -80257 -49628 60305
27061 60305 103629 92837 81035 3183 -14389 50639 21697 -36272 -118810 -84471 -93847 -62943
27049 -62943 15051 26864 47293 23817 25176 72192 33836 10964 31912 62677 66303 102680
27037 102680 94947 94655 54388 -54323 -76076 -96683 -118998 -67842 -32469 8337 43704 5992
27025 5992 -4844 -11556 -6523 -31122 -12933 -23713 -25145 78312 73100 76429 89222 58433 81740
27012 81740 49957 -15670 -32681 6518 -4200 -27324 37134 18698 -23485 9889 57847 117947
27000 117947 80569 33013 96208 99894 128912 131187 118417 91840 71191 53414 38971 38249
$$ packed form
27086D5417m9075n0842K3033j7474j4314P7769K8146K7302K679L7009n7299l1640
27074B0711j343N0746l5274p4595j8812R38K165M0393k946l8259k3981L0629J09933
27061F0305M3324j0792j1802p7852j7572O5028k8942n7969q2538L4339r376L0904
27049f2943P7994J1813K0429k3476J359M7016l8356k2872K0948L0765L626L6377
27037A02680p733k92m0267j08711k1753k0607k2315N1156L5373M0806L5367l7712
27025E992j0836o712N033k4599J8189j0780j432J03457n212L329J2793l0789K3307
27012H1740l1783o5627j7011L9199j0718k3124O4458j8436m2183L3374M7958O0100
27000A17947l7378m7556O3195L686K9018K275j2770k6577k0649j7777j4443p22
$$ plain form
26988 38249 19616 25525 45294 385 -47478 -53986 -36803 -64973 -78011 -32506 13006 93806
26976 93806 143497 123395 73078 29572 96831 42810 -1824 2368 -36347 -82472 -19430 82056
26964 82056 66899 26294 14005 -2926 17572 4589 18760 48146 20333 -88868 -102679
26953 -102679 -61717 -612 99370 57636 -50431 -149612 -127114 -38800 17759 34338 3377
26942 3377 -50184 -39753 -58801 -18823 44658 81204 77483 70395 84280 138415 112973 81231
26930 81231 54957 -24731 -52836 -39776 -27428 -47421 -68626 -117718 -74993 -35163 -41413 -86034
26918 -86034 -147758 -220922 -210232 -115596 -96547 -39395 -36262 -30156 -33877 -18409 14025 -26398
26906 -26398 -67759 4997 -16294 23405 18354 -18580 -8490 58910 78189 3032 28841 62124
$$ packed form
26988C8249j8633N909J9769m4909m7863o508J7183k8170j3038M5505M5512Q0800
26976I3806M9691k0102n0317m3506O7259n4021m4634M192l8715m6125O3042J01486
26964H2056j5157m0605j2289j6931K0498j2983J4171K9386k7813j09201j3811
26953a02679M0962O1105R9982m1734j08067r9181K2498Q8314N6559J6579l0961
26942C377n3561J0431j9048L9978O3481L6546l721p088J3885N4135k5442l1742
26930H1231k6274p9688k8105J3060J2348j9993k1205m9092M2725L9830o250m4621
26918h6034o1724p3164J0690R4636J9049N7152L133O106l721J5468L2434m0423
26906b6398m1361P2756k1291L9699n051l6934J0090O7400J9279p5157K5809L3283
$$ plain form
26894 62124 114999 160164 80133 11252 -37804 -81734 -76504 -62474 -53420 -126 49485 38553
26882 38553 -15589 -91330 -114478 -129216 -140161 -118721 -84531 -107512 -84946 -51831 -97105 -80254
26870 -80254 -111765 -48247 -77021 -118719 -134441 -161371 -130053 -79193 -43613 -39878 10395 -21237
26858 -21237 -33003 20141 -29963 -15180 56761 36293 -3015 -72222 -2355 18240 -24217 -32788
26846 -32788 -57179 -41627 29063 38486 50005 39726 77332 121780 118765 14718 -41785 -62904
26834 -62904 -62569 -59694 -9623 56968 107789 81383 88139 97955 91650 81392 95095 84335 3156
26821 3156 -142664 -97306 -95052 -124441 -155297 -136503 -84875 -130174 -110904 -68545 -39840 -34573
26809 -34573 -24499 32319 52165 99790 93810 96587 86450 87798 52525 59997 56497 -38401 -25506
$$ packed form
26894F2124N2875M5165q0031o8881m9056m3930N230J4030R054N3294M9611j0932
26882C8553n4142p5741k3148j4738j0945K1440L4190k2981K2566L3115m5274J6851
26870h0254l1511O3518k8774m1698j5722k6930L1318N0860L5580L735N0273l1632
26858b1237j1766N3144n0104J4783P1941k0468l9308o9207O9867K0595m2457q571
26846c2788k4391J5552P0690R423J1519j0279L7606M4448l015j04047n6503k1119
26834f2904L35K875N0071O6591N0821k6406O756R816o305j0258J3703j0760q1179
26821C156j45820M5358K254k9389l0856J8794N1628m5299J9270M2359K8705N267
26809c4573J0074N6818J9846M7625n980K777j0137J348l5273P472l500r4898J2895
$$ plain form
26796 -25506 24298 35906 28683 -40510 -20175 45559 35725 -62259 -53492 -86296 -137240 -128243
26784 -128243 -29652 18174 34084 112927 55726 6730 28234 30859 13514 102915 147662 127061
26772 127061 140161 131045 99678 48369 758 -50939 -46195 33942 67578 84019 25262 9970
26760 9970 -65247 -70732 59364 54188 3471 -32030 -40669 -113663 -130348 -65800 -82812 -48951
26748 -48951 70886 138392 193595 87643 -61168 -112505 -103248 -36321 -34577 -58256 -10577
26737 -10577 4191 33672 54833 63876 50200 18604 9165 -3665 -7419 -4404 -12050 -50548 -36267
26724 -36267 58649 98898 21247 9387 9199 12722 62647 73691 38614 51936 66593 50786
26712 50786 64865 70424 40452 63711 49635 -354 1501 52083 28771 9574 -26408 -36437
$$ packed form
26796b5506M9804J1608p223o9193K0335O5734r834r7984Q767l2804n0944Q997
26784a28243R8591M7826J5910P8843n7201m8996K1504K625j7345Q9401M4747k0601
26772A27061J3100r116l1367n1309m7611n1697M744Q0137L3636J6441n8757j5292
26760I970p5217n485J30096n176n0717l5501q639p2994j6685O4548j7012L3861
26748d8951J19837O7506N5203j05952j48811n1337R257O6927J744k3679M7679
26737a0577J4768K9481K1161R043j3676l1596r439j2830l754L015p646l8498J4281
26724c6267R4916M0249p7651j1860j88L523M9925J1044l5077J3322J4657j5807
26712E0786J4079N559k9972K3259j4076m9989J855N0582k3312j9197l5982j0029
$$ plain form
26700 -36437 -10123 -15520 -37882 -6310 -1905 45342 133191 148808 69714 30822 -33107 -111505
26688 -111505 -121064 -116822 -32956 -15031 -70589 -128540 -84909 -59448 -117739 -31174 -348 -14185
26676 -14185 18199 76715 72260 80584 55166 -58853 -54477 87630 170095 163818 135170 71663
26664 71663 42928 42002 20847 29228 38812 -40904 -60008 -47926 -41794 -73029 -98094 -86195 -81709
26651 -81709 -6769 18492 -13431 -50202 -27546 -277 1232 -8895 -16224 -12199 88547 117984
26639 117984 122181 71672 55964 19985 -69395 -6464 65361 97138 58268 -13090 -33457 34012
26627 34012 54289 28724 5902 5678 6590 21868 38948 33770 -2062 -31993 -41942 -33752 44131
26614 44131 -18249 32728 102645 145983 173503 153859 105961 81477 10118 38953 55212 21637
$$ packed form
26700c6437K6314n397k2362L1572M405M7247Q7849J5617p9094l8892o3929p8398
26688a11505r559M242Q3866J7925n5558n7951M3631K5461n8291Q6565L0826j3837
26676a4185L2384N8516m455Q324k5418j14019M376J42107Q2465o277k8648o3507
26664G1663k8735r26k1155Q381R584p9716j9104J2082O132l1235k5065J1899M486
26651h1709P4940K5261l1923l6771K2656K7269J509j0127p329M025J00746K9437
26639A17984M197n0509j5708l5979q9380O2931P1825L1777l8870p1358k0367O7469
26627C4012K0277k5565k2822k24R12J5278J7080n178l5832k9931r949Q190P7883
26614D4131o2380N0977O9917M3338K7520j9644m7898k4484p1359K8835J6259l3575
$$ plain form
26602 21637 84501 100587 60138 64094 352 -58884 10876 2344 -77579 -112048 -82160 -84856
26590 -84856 -145784 -188355 -158439 -87289 -15395 2808 20083 62917 96197 81393 62109 476
26578 476 29004 42391 75320 67853 63025 25142 7701 -54222 -94696 -40046 -69325 -34261
26566 -34261 13100 36371 10594 -37124 -13201 -45621 -92242 -87048 -68194 -79335 -19154 -17657
26554 -17657 -31194 -80470 -98095 -6262 76622 130514 145951 110718 -11761 -53099 -41815
26543 -41815 36189 80723 80719 38878 17648 11026 50218 104551 50005 1917 -17853 37763 73737
26530 73737 25017 25292 17719 296 -48272 -72388 -81629 -37672 34887 -4858 -20829 -11681 -38948
26517 -38948 -2592 80652 71167 75346 107318 73045 2128 28905 31659 -44356 -120419 -128496
$$ packed form
26602B1637O2864J6086m0449L956o3742n9236O9760q532p9923l4469K9888k696
26590h4856o0928m2571K9916P1150P1894J8203J7275M2834L3280j4804j9284o1633
26578D76K8528J3387L2929p467m828l7883j7441o1923m0474N4650k9279L5064
26566c4261M7361K3271k5777m7718K3923l2420m6621N194J8854j1141O0181J497
26554a7657j3537m9276j7625R1833Q2884N3892J5437l5233j22479m1338J1284
26543d1815P8004M4534mm1841k1230o622L9192N4333n4546m8088j9770N5616L5974
26530G3737m8720K75p573j7423m8568k4116r241M3957P2559l9745j5971R148k7267
26517c8948L6356Q3244r485M179L1972l4273p0917K6777K754p6015p6063q077
$$ plain form
26505 -128496 -91731 -74569 -67588 -23383 -35378 -39975 -62546 -39667 -20644 -15823 -42374 21758
26493 21758 73352 92753 64897 32673 12695 73305 97413 20373 -12463 -11140 -37514 -65771
26481 -65771 -51886 -60133 -43888 -23985 10690 38630 82414 60426 -34339 -95608 -115409 -132587
26469 -132587 -114127 -47379 -23398 4455 51204 117998 59078 -29383 -54193 -82201 -120536
26458 -120536 -8366 74488 127383 102156 52685 31728 18959 12554 -44325 -38970 -36794 -31657
26446 -31657 6699 14274 8300 -7286 -50664 -60971 -35007 -33969 -8347 -19242 3287 44539
26434 44539 95877 15486 -41674 -37659 65000 1360 -59211 -98872 -80328 -44610 -45468 4327
26422 4327 28448 13820 -1556 61168 64982 25499 -1334 -30194 -55714 -21732 1391 -14645
$$ packed form
26505a28496L6765J7162O981M4205j1995m597k2571K2879J9023M821k6551O4132
26493B1758N1594J9401k7856l2224j9978O0610K4108p7040l2836J323k6374k8257
26481f5771J3885q247J6245J9903L4675K7940M3784k1988r4765o1269j9801j7178
26469a32587J8460O6748K3981K7853M6749O6794n8920q8461k4810k8008l8335
26458a20536J12170Q2854N2895k5227m9471k0957j2769o405n6879N355K176N137
26446c1657L8356P575n974j5586m3378j0307K5964J038K5622j0895K2529M1252
26434D4539N1338q0391n7160M015J02659o3640o0571l9661J8544L5718q58M9795
26422D327K4121j4628j5376O2724L814l9483k6833k8860k5520L3982K3123j6036
$$ plain form
26410 -14645 -59423 -78003 -120543 -78396 -43037 39015 108565 117508 59135 5557 -38424 -34185
26398 -34185 46179 111470 111516 70790 70952 63748 -9344 23633 26730 -28010 -45041 -22152 4242
26385 4242 -23485 -36169 -76803 -101554 -42584 -2294 13921 77230 126937 50483 -30937 -43017
26373 -43017 -57243 -49742 -35171 -31828 -3327 33139 1884 3657 9874 43671 54274 80539
26361 80539 90111 94092 8296 -110549 -94754 -116260 -135958 -137243 -132802 -108845 -66069 15832
26349 15832 107937 121129 15041 -28292 27150 71311 71639 71309 12038 -12282 56 50390
26337 50390 -3158 -142595 -121071 -42565 56962 59978 -66571 -56294 -39707 -53646 -32405
26326 -32405 -23253 -34006 45863 56215 11730 13488 40994 22443 -11226 20455 49359 92532
$$ packed form
26410a4645m4778j8580m2540M2147L5359Q2052O9550Q943n8373n3578m3981M239
26398c4185Q0364O5291M6m0726J62p204p3092L2977L097n4740j7031K2889K6394
26385D242k7727j2684m0634k4751N8970M0290J6215O3309M9707p6454q1420j2080
26373d3017j4226P501J4571L343K8501L6466l1255J773O217L3797J0603K6265
26361H0539R572L981q5796j18845J5795k1506j9698j285M441K3957M2776Q1901
26349A5832R2105J3192j06088m3333N5442M4161L28l30n9271k4320J2338N0334
26337E0390n3548j39437K1524P8506R9527L016j26549J0277J6587j3939K1241
26326c2405R152j0753P9869J0352m4485J758K7506j8551l3669L1681K8904M3173
$$ plain form
26314 92532 105610 113302 132728 74941 55518 68182 117096 127157 137982 68079 -13907 -82598
26302 -82598 -122192 -114674 -75093 40386 93727 33564 28230 49410 9340 -53629 -100455 -111511
26290 -111511 -74039 -58068 -31796 5384 56259 34739 -7767 -35698 -84035 -113924 -113677 -65521
26278 -65521 -91676 -143981 -104710 -61297 -6939 9445 -15327 23538 48547 1614 10028 53539
26266 53539 86785 43661 106213 123127 12811 -39427 20606 101097 114578 50672 32667
26255 32667 45879 31421 24997 14080 -2254 5925 -53595 -45397 -21551 -30115 -38784 -3387 -38665
26242 -38665 -50002 -68701 -132500 -45222 -17894 71229 77771 102018 56350 43682 19969 52155
26230 52155 41382 45590 77110 77628 56863 5090 -14806 49211 18026 222 -23588 16142
$$ packed form
26314I2532J3078P692J9426n7787j9423J2664M8914J0061J0825o9903q1986o8691
26302h2598l9594P518L9581J15479N3341o0163n334K1180m0070o2969m6826j1056
26290a11511L7472J5971K6272L7180N0875k1520m2506k7931m8337k9889K47M8156
26278f5521k6155n2305L9271M3413N4358J6384k4772L8865K5009m6933Q414M3511
26266E3539L3246m3124O2552J6914j10316n2238O0033Q0491J3481o3906j8005
26255C2667J3212j4458o424j0917j6334Q179n9520Q198K3846q564q669L5397l5278
26242c8665j1337j8699o3799Q7278K7328Q9123O542K4247m5668j2668k3713L2186
26230E2155j0773M208L1520N18k0765n1773j9896O4017l1185j7804k3810L9730
$$ plain form
26218 16142 55773 27485 -14797 -111022 -68482 67396 107933 65177 95394 36438 -12290
26207 -12290 28730 49767 50715 2776 -64890 -74169 -42886 -61378 -26072 45423 120995 149621
26195 149621 107644 137716 77930 67375 91649 72279 58491 43569 24145 61562 38133
26184 38133 22702 53778 40691 -1232 -22510 -36427 3264 1145 -9258 -34126 -55957 -58025
26172 -58025 -20405 73824 70437 94966 105079 43465 6487 34075 58480 35889 61335 31773
26160 31773 71420 140463 116359 39612 -23795 -52826 -68826 1966 95294 95971 62564 2946
26148 2946 -19216 22570 25616 -44025 -44017 -18740 8006 4912 -54406 -55090 -28736 19888 -15108
26135 -15108 -70354 -66032 -8648 -10749 -41983 -64356 -50089 -1566 -5634 -41797 -16614 -63196
$$ packed form
26218A6142L9631k8288m2282r6225M2540J35878M0537m2756L0217n8956m8728
26207a2290M1020K1037R48m7939o7666r279L1283j8492L5306P1495P5572K8626
26195A49621m1977L0072n9786j0555K4274j9370j3788j4922j9424L7417k3429
26184C8133j5431L1076j3087m1923k1278j3917L9691k119j0403k4868k1831k068
26172e8025L7620R4229l387K4529J0113o1614l6978K7588K4405k2591K5446k9562
26160C1773L9647O9043k4104p6747o3407k9031j6000P0792R3328O77l3407n9618
26148B946k2162M1786L046o9641QK5277K6746l094n9318o84K6354M8624l4996
26135a5108n5246M322N7384k101l1234k2373J4267M8523m068l6163K5183m6582
$$ plain form
26123 -63196 -82792 -49345 31084 -17026 -143604 -66380 -618 -39860 -101458 -51059 -7858
26112 -7858 20647 -32706 -84575 -48606 50181 40754 2989 15951 -4166 -8203 6049 -37469
26100 -37469 -101857 -101100 -26794 19670 43055 51500 24877 9775 32946 77965 95880 79533
26088 79533 4299 -2997 35010 -13311 -39247 -63222 7193 86598 39270 -14234 7188 -8685
26076 -8685 -71602 -86728 -93357 -63921 -12083 -1873 22815 12094 -21664 -40556 -74803 -115545
26064 -115545 -124928 -68555 -12588 -17569 49720 27502 47624 75626 44648 -17041 -23088 -69254
26052 -69254 -50145 -46970 16335 64879 122924 86808 -6557 45917 66018 21219 21233 16296 -28845
26039 -28845 -36889 -45185 -64200 -69202 -11055 65112 110697 87116 118801 102906 49378 40314
$$ packed form
26123f3196j9596L3447Q0429m8110j26578P7224O5762l9242o1598N0399M3201
26112g858K8505n3353n1869L5969R8787r427l7765J2962k0117m037J4252m3518
26100c7469o4388P57P4306M6464K3385Q445k6623j5102K3171M5019J7915j6347
26088G9533p5234p296L8007m8321k5936k3975P0415P9405m7328n3504K1422j5873
26076h685o2917j5126o629K9436N1838J0210K4688j0721l3758j8892l4247m0742
26064a15545r383N6373N5967m981O7289k2218K0122K8002l0978o1689o047m6166
26052f9254J9109L175O3305M8544N8045l6116r3365N2474K0101m4799J4m937m5141
26039b8845q044q296j9015n002N8147P6167M5585k3581L1685j5895n3528r064
$$ plain form
26027 40314 62609 36918 -3319 15636 39343 43548 -47059 -10084 -4633 -118022 -100621 -22405
26015 -22405 -22747 -68260 -36374 -49753 -10924 13493 22441 1970 22431 25453 4468 44057
26003 44057 2592 -40477 37815 93513 86454 97997 45406 -11741 -4254 9622 36421 58377
25991 58377 163068 123303 110580 83461 63308 12486 53706 53026 87917 30447 -4086 -72035
25979 -72035 -10579 69979 66869 36212 26473 31405 39809 -12313 -32186 -20639 26239 58306
25967 58306 59511 75782 71277 112054 84671 -21710 1067 35108 78818 97667 67594 102157
25955 102157 155838 183133 153789 118664 67642 -22242 -439 1913 10247 23535 19473 30901
25943 30901 -32209 -30979 59475 40241 20210 16375 89685 127689 126093 106506 75682 65080
$$ packed form
26027D0314K2295k5691m0237J8955K3707M205r0607L6975N451j13389J7401P8216
26015b2405l42m5513L1886j3379L8829K4417Q948k0471K0461L022k0985L9589
26003D4057m1465m3069P8292N5698p059J1543n2591n7147P487J3876K6799K1956
25991E8377J04691l9765j2723k7119k0153n0822M1220o80L4891n7470l4533o7949
25979g2035O1456Q0558l110l0657r739M932Q404n2122j9873J1547M6878L2067
25967E8306J205J6271m505M0777k7383j06381K2777L4041M3710J8849l0073L4563
25955A02157N3681K7295k9344l5125n1022q9884K1803K352Q334J3288m062J1428
25943C0901o3110J230R0454j9234k0031l835P3310L8004j596j9587l0824j0602
$$ plain form
25931 65080 46600 23702 -12176 -63426 -108119 -71707 -38334 33606 45989 -53921 -110307 -40509
25919 -40509 -6974 9626 -38914 -36409 -26253 -55645 15074 92734 127966 72530 48383 -20426
25907 -20426 -52541 -69610 -63253 -29272 -3876 -13566 -25686 -2812 -11733 -58646 -112236 10860
25895 10860 59315 53095 137740 151982 3927 -47416 -36645 -23189 1844 4784 -26812 -87334
25883 -87334 -59601 -56813 -100460 -59741 14512 25123 -25493 -18898 -33947 18254 55321 83526
25871 83526 85882 117515 132730 106256 82425 73002 72235 61963 78331 70882 35365 -14500 9012
25858 9012 17580 -45803 22073 40043 74933 83750 31062 -64939 -120555 -108763 -59549 -42942
25846 -42942 -75184 -131672 -75749 -40016 -35302 3155 40305 -9698 -38184 -82819 -56046 -29102
$$ packed form
25931F5080j8480k2898l5878n1250m4693L6412L3373P1940J2383r9910n6386O9798
25919d0509L3535J6600m8540K505J0156k9392P0719P7660L5232n5436k4147o8809
25907b0426l2115j7069O357L3981K5396r690j2120K2874q921m6913n3590J23096
25895A0860M8455o220Q4645J4242j48055n1343J0771J3456K5033K940l1596o0522
25883h7334K7733K788m3647M0719P4253J0611n0616O595j5049N2201L7067K8205
25871H3526K356L1633J5215k6474k3831r423p67j0272J6368p449l5517m9865K3512
25858I012Q568o3383O7876J7970L4890Q817n2688r6001n5616J1792M9214J6607
25846d2942l2242n6488N5923L5733M714L8457L7150n0003k8486m4635K6773K6944
$$ plain form
25834 -29102 -10258 -45960 -43621 -66691 -85321 -66680 -49424 -35474 -232 -41478 -63107 -41380
25822 -41380 -25421 -2022 -16761 -3191 -13891 22436 9296 2666 23131 -2439 -24805 -18357
25810 -18357 -31647 6791 16729 36843 33268 54227 42898 -20072 -1511 59853 24673 -19102
25798 -19102 46914 71457 63110 122773 89373 88265 66399 29952 -159 -22519 -38662 -27679
25786 -27679 -50615 -29416 868 -110683 -83381 -67659 -49257 -29393 -50539 -91876 -143175
25775 -143175 -163241 -151957 -98639 -49798 -32206 -23983 35887 59693 14606 -14916 -12273 66007
25763 66007 85851 57870 40475 -9416 52340 83305 -15244 -51275 3592 10416 11736 -39252
25751 -39252 -72759 -29410 9910 -39995 -40047 -2413 -43509 -56503 4213 41002 10840 -6706
$$ packed form
25834b9102J8844l5702K339k3070j8630J8641J7256J3950L5242m1246k1629K1727
25822d1380J5959K3399j4739J3570j0700L6327j3140o630K0465k5570k2366O448
25810a8357j3290L8438R938K0114l575K0959j1329o2970J8561O1364l5180m3775
25798a9102O6016K4543q347N9663l3400j108k1866l6447l0111k2360j6143J0983
25786b7679k2936K1199L0284j11551K7302J5722J8402J9864k1146m1337n1299
25775a43175k0066J1284N3318M8841J7592Q223N9870K3806m5087k9522K643P8280
25763F6007J9844k7981j7395m9891O1756L0965r8549l6031N4867O824J320n0988
25751c9252l3507M3349L9320m9905n2L7634m1096j2994O0716L6789l0162j7546
$$ plain form
25739 -6706 16123 23261 31085 3374 -64514 -58249 -59732 -60378 -3054 -3299 -32234 -104275 -158022
25726 -158022 -149694 -89675 -100027 -104092 -79867 -31825 -8777 -65939 -121487 -137426 -66956 75382
25714 75382 122655 64161 74027 78139 123875 95988 95235 31854 9981 47487 107907 111564 129217
25701 129217 116222 162703 120825 6137 -80821 -109831 -50765 -75214 -79766 -59730 -114392
25690 -114392 -88931 -62719 -14359 -2129 -70071 -80564 -106640 -105020 -62322 -17186 -10919 -116217
25678 -116217 -184557 -97152 -21311 -263 -820 89726 132699 101902 44800 -28570 -83813 -5094
25666 -5094 -13031 -14898 -91887 -160338 -136534 -129891 -145361 -93911 -59749 -98461 -135022 -87956
25654 -87956 -18362 -59803 -52305 -5366 191 -19211 -13415 -3342 -96208 -61285 42398 77535
$$ packed form
25739f706K2829P138P824k7711o7888O265j483o46N7324k45k8935p2041n3747
25726a58022Q328O0019j0352m065K4225M8042K3048n7162n5548j5939P0470J42338
25714G5382M7273n8494R866M112M5736k7887p53o3381k1873L7506O0420L657J7653
25701A29217j2995M6481m1878j14688q6958k9010N9066k4449m552K0036n4662
25690a14392K5461K6212M8360J2230o7942j0493k6076J620M2698M5136O267j05298
25678a16217o8340Q7405P5841K1048n57R0546M2973l0797n7102p3370n5243P8719
25666e094p937j867p6989o8451K3804O643j5470N1450L4162l8712l6561M7066
25654h7956O9594m1441P498M6939N557j9402N796J0073r2866L4923J03683L5137
$$ plain form
25642 77535 47887 29795 49942 74533 71540 7505 25584 28911 -2083 936 -9565 43506
25630 43506 68896 121896 87706 75351 32595 16777 28375 -10107 -38107 -18707 -59404 32673
25618 32673 48191 -10778 15187 33730 95640 115705 95208 4225 -32414 -97686 -36255 5364
25606 5364 12995 -11302 15637 -5470 5185 -8379 -52542 -101067 -58662 14016 93276 87429
25594 87429 -1399 8003 50693 45808 -19234 -70327 -75269 -49494 -11952 -8970 -40289 17170
25582 17170 -34169 -79515 -56725 -26252 30400 62552 52219 -24832 -18775 111533 117199 101644
25570 101644 65873 17277 49422 63012 17991 -2604 37236 115680 77507 14871 -18823
25559 -18823 -25944 -7054 7555 46008 35088 -517 -31627 -30466 -93863 -105250 -45403 -17577
$$ packed form
25642G7535k9648j8092K0147K4591k993o4035J8079L327l0994L019j0501N3071
25630D3506K5390N3000l4190j2355m2756j5818J1598l8482k8000J9400m0697R2077
25618C2673J5518n8969K5965J8543O1910K0065k0497r0983l6639o5272O1431M1619
25606E364P631k4297K6939k1107J0655j3564m4163m8525M2405P2678P9260n847
25594H7429q8828R402M2690m885o5042n1093m942K5775L7542K982l1319N7459
25582A7170n1339m5346K2790L0473N6652L2152j0333p7051O057J30308N666j5555
25570A01644l5771m8596L2145J3590m5021k0595L9840P8444l8173o2636l3694
25559a8823p121J8890J4609L8453j0920l5605l1110J161o3397j1387N9847K7826
$$ plain form
25547 -17577 14884 15714 -58070 -66941 -50448 -37281 -38122 -42855 -47544 694 55907 54948 109486
25534 109486 137413 138040 76843 47693 8021 73453 96198 64763 754 -28561 -6519 17827
25522 17827 -27088 -57406 -34199 -56767 -117402 -115620 -52112 2960 2105 -44856 -44288 -24863 457
25509 457 31331 27563 10226 36491 41511 10822 -60512 -67840 -74900 -48823 -23015 -64321 -83270
25496 -83270 -69344 -73933 -39444 -48187 4229 93907 85162 67765 32870 30124 -40149 -97484
25484 -97484 -77677 -106190 -45932 19285 14841 -2796 -24876 -78802 -97307 -84000 -19393 -507
25472 -507 -70452 -49612 14767 28871 -3412 -43486 -22021 7116 29295 46587 57986 6695
25460 6695 2043 -69082 -132257 -127438 -116095 -150222 -134725 -71891 -4405 63152 83968 118954
$$ packed form
25547a7577L2461Q30p3784q871J6493J3167q41m733m689M8238N5213r59N4538
25534A09486K7927O27o1197k9150l9672O5432K2745l1435o4009k9315K2042K4346
25522A7827m4915l0318K3207k2568o0635J782O3508N5072q55m6961N68J9425K5320
25509D57L0874l768j7337K6265N020l0689p1334p328p060K6077K5808m1306j8949
25496h3270J3926m589L4489q743N2416Q9678q745j7397l4895k746p0273n7335
25484i7484J9807k8513O0258O5217m444j7637k2080n3926j8505J3307O4607J8886
25472e07o9945K0840O4379J4104l2283m0074K1465K9137K2179J7292J1399n1291
25460F695m652p1125o3175M819J1343l4127J5497O2834O7486O7557K0816L4986
$$ plain form
25448 118954 56142 63669 58456 10749 -19360 -20392 -32057 -46695 -21218 63273 91188 63334
25436 63334 33586 30558 46868 23890 1881 2177 -206 -54358 -84657 -60226 -14137 -29048
25424 -29048 -45249 -93016 -63191 -31021 -47675 -96272 -81455 -26701 9868 96161 112539 91898
25412 91898 40170 72692 9018 -57010 -64382 -106492 -78503 18757 20987 -32821 -91746 -59100
25400 -59100 -20411 -7148 -15896 -20628 -947 42652 -25386 -55288 -96033 -112312 -66390 -36915
25388 -36915 -23150 15615 20062 24874 11465 2319 25831 2558 -59056 -75984 -8415 37610
25376 37610 38248 -10950 4722 -2425 -3147 -22437 -8954 7719 8396 -52575 -66404 -1257 -8083
25363 -8083 -8316 10748 8521 40696 77544 35891 5155 39652 45612 21605 44505 40288 57728
$$ packed form
25448A18954o2812P527n213m7707l0109j032j1665j4638K5477Q4491K7915k7854
25436F3334k9748l028J6310k2978k2009K96k383n4152l0299K4431M6089j4911
25424b9048j6201m7767K9825L2170j6654m8597J4817N4754L6569Q6293J6378k0641
25412I1898n1728L2522o3674o6028p372m2110K7989R7260K230n3808n8925L2646
25400e9100L8689J3263q748m732J9681M3599o8038k9902m0745j6279M5922K9475
25388c6915J3765L8765M447M812j3409r146K3512k3273o1614j6928O7569M6025
25376C7610O38m9198J5672p147p22j9290J3483J6673O77o0971j3829O5147o826
25363h083k33J9064k227L2175L6848m1653l0736L4497N960k4007K2900m217J7440
$$ plain form
25350 57728 45507 18713 -20139 -27794 13703 31593 38523 5723 -43714 -25216 -19848 -60509
25338 -60509 -40564 -7047 -58454 -30403 -50399 -18779 10192 -38767 -51277 -19883 3277 107097
25326 107097 90016 50728 38680 75037 64463 26105 -48083 -25475 -25841 -71714 -59568 -39703
25314 -39703 -51884 36157 73073 60662 151339 159072 103853 28450 -50961 12150 3440 42616
25302 42616 10326 20712 88744 68067 68320 107187 66940 25623 24474 19495 24416 18613 23700
25289 23700 21600 -33532 -66005 -105113 -110182 -157558 -42998 12210 33301 -42007 -70052 -83782
25277 -83782 -4996 1907 1283 22881 111095 109142 96027 110189 90503 92103 13462 9038 6174
25264 6174 -35481 -64296 -56439 -62725 -9348 51418 69180 47615 32735 -24000 8025 -8657
$$ packed form
25350E7728j2221k6794l8852p655M1497J7890O930l2800m9437J8498N368m0661
25338f0509J9945L3517n1407K8051j9996L1620K8971m8959j2510L1394K3160J03820
25326A07097j7081l9288j2048L6357j0574l8358p4188K2608l66m5873J2146J9865
25314c9703j2181Q8041L6916j2411R0677P733n5219p5403p9411O3111q710L9176
25302D2616l2290J0386O8032k0677K53L8867m0247m1317j149m979M921n803N087
25289B3700k100n5132l2473l9108n069m7376J14560N5208K1091p5308k8045j3730
25277h3782P8786O903o24K1598Q8214j953j3115J4162j9686J600p8641m424k864
25264F174m1655k8815P857o286N3377O0766J7762k1565j4880n6735L2025j6682
$$ plain form
25252 -8657 15960 -11777 -86047 -48327 -34565 -36520 -25544 -37029 -7485 32358 44773 8312
25240 8312 4229 -2694 17423 28016 48826 8356 -58850 -30802 -19219 11595 65578 111165
25228 111165 41756 44052 91828 100222 135804 128825 110704 38066 -62998 -114564 -89616 -77785
25216 -77785 -49834 -6924 -19333 -71743 -77796 -43482 -67653 -73091 -151774 -277693 -250550 -101786
25204 -101786 11380 78936 74738 30940 6759 -15995 -26175 1696 -20757 13056 76273
25193 76273 114015 78186 45164 9794 -8895 -5379 4593 1361 -55563 -87186 -93381 -80864
25181 -80864 -75096 -57583 -59309 -87002 -40714 -7622 -4313 -44199 -44315 11171 44803 831 -10903
25168 -10903 57877 43834 44061 30536 2066 18499 1210 26305 13140 5328 1884 6884 -61876
$$ packed form
25252h657K4617k7737p4270L7720J3762j955J0976j1485K9544L9843J2415l6461
25240H312m083o923K0117J0593K0810m0470o7206K8048J1583L0814N3983M5587
25228A11165o9409K296M7776Q394L5582o979j8121p2638j01064n1566K4948J1831
25216g7785K7951M2910j2409n2410o053L4314k4171n438p8683j25919K7143J48764
25204a01786J13166O7556m198m3798k4181k2754j0180K7871k2453L3813O3217
25193G6273L7742l5829l3022l5370j8689L516R972l232n6924l1623o195J2517
25181h0864N768J7513j726k7693M6288L3092L309l9886j16N5486L3632m3972j1734
25168a0903O8780j4043K27j3525k8470J6433j7289K5095j3165p812l444N000o8760
$$ plain form
25155 -61876 -88222 -100926 -52760 -55557 -40099 21095 82988 125624 104966 112758 103602 86674
25143 86674 36843 4511 -4998 -66787 -81892 -56049 -74243 -24310 -38327 -26486 -1738 -10922
25131 -10922 -16902 -13480 -16226 39896 -15053 44508 115915 108525 114570 118923 119675 52824 -18764
25118 -18764 27523 22354 -6071 280 37943 37371 -1897 64291 98291 171180 200188 194652 155532
25105 155532 174120 119210 92132 42724 -2619 -36254 13594 63136 103195 66696 -12894
25094 -12894 -29152 -21000 -44206 -34335 -23799 -66555 -25567 -12704 -52620 -74423 -43485 -49834
25082 -49834 -66734 -94389 -13555 19235 -42227 -17344 18078 -22821 -72990 -48584 -28422 -58197
25070 -58197 -29269 -23988 22333 30651 11064 -1516 29691 71656 75363 66792 5140 -5735
$$ packed form
25155f1876k6346j2704M8166k797J5458O1194O1893M2636k0658P792r156j6928
25143H6674m9831l2332r509o1789j5105K5843j8194M9933j4017J1841K4748r184
25131a0922n980L422k746N6122n4949N9561P1407p390O045M353P52o6851p1588
25118a8764M6287n169k8425O351L7663n72l9268O6188L4000P2889K9008n536l9120
25105A55532J8588n4910k7078m9408m5343l3635M9848M9542M0059l6499p9590
25094a2894j6258Q152k3206R871J0536m2756M0988J2863l9916k1803L0938o349
25082d9834j6900k7655Q0834L2790o1462K4883L5422m0899n0169K4406K0162k9775
25070e8197K8928N281M6321Q318j9587j2580L1207M1965L707q571o1652j0875
$$ plain form
25058 -5735 -51024 -87335 -57315 -60312 -32925 -49307 -94813 -103697 -121824 -103678 6281 73270
25046 73270 89403 112444 85066 31543 -11976 -29779 32818 78870 31730 -56513 -69576 23272
25034 23272 32795 28646 57029 39405 14564 -31500 -51177 -26714 20940 -14952 -41054 -19340
25022 -19340 -65752 -87728 -91928 -23107 -24188 -29054 -25682 -28031 -47431 -69883 -25354 34790 104385
25009 104385 137626 80637 91443 117023 72037 3263 493 33986 78373 34409 33076 21723
24997 21723 -20467 -63048 -71135 -43048 -71542 -76668 -138326 -139741 -85473 -70360 -118183 -116505
24985 -116505 -33513 40974 3779 8191 50949 57172 73470 152845 149060 109313 26465 35924
24973 35924 87799 59895 -37221 -68639 -40360 -13662 -36099 -30657 -51336 2947 29920 53561
$$ packed form
25058e735m5289l6311L0020k997K7387j6382m5506q884j8127J8146J09959O6989
25046G3270J6133K3041k7378n3523m3519j7803O2597M6052m7140q8243j3063R2848
25034B3272R523m149K8383j7624k4841m6064j9677K4463M7654l5892k6102K1714
25022a9340m6412k1976m200O8821j081m866L372k349j9400k2452M4529O0144O9595
25009A04385L3241n6989J0806K5580m4986o8774k770L3493M4387m3964j333j1353
24997B1723m2190m2581q087K8087k8494n126o1658j415N4268J5113m7823J678
24985a16505Q2992P4487l7195M412M2758O223J6298P9375l785l9747q2848R459
24973C5924N1875k7904r7116l1418K8279K6698k2437N442k0679N4283K6973K3641
$$ plain form
24961 53561 -22428 -33416 13478 57305 84645 132594 116719 62968 -52675 -65147 -39425
24950 -39425 -36790 -19588 -16241 20457 25245 45912 1567 -23256 50216 71938 124034 111632
24938 111632 92019 142101 156407 153119 83934 41952 23343 706 -59354 -107049 -64183 11863
24926 11863 -28925 -48207 -56987 -906 55391 -4058 -87550 -105723 -92525 -20865 10471 61278
24914 61278 33405 67231 61662 48442 25290 23565 22256 -1736 13801 -4882 -10135 -13542 -14348
24901 -14348 12901 18599 35200 46233 47891 98161 112021 127096 83173 93450 70787 38082
24889 38082 8605 -4292 -43122 -66832 -114267 -49563 57488 111121 28022 -75629 -129879
24878 -129879 -165798 -102474 -49597 -6950 -5886 4860 29288 53139 100640 120886 97104 52178
$$ packed form
24961E3561p5989j0988M6894M3827K7340M7949j5875n3751j15643j2472K5722
24950c9425K635J7202L347L6698M788K0667m4345k4823P3472K1722N2096j2402
24938A11632j9613N0082J4306l288o9185m1982j8609k2637o0060m7695M2866P6046
24926A1863m0788j9282q780N6081N6297n9449q3492j8173J3198P1660L1336N0807
24914F1278k7873L3826n569j3220k3152j725j309k3992J5537j8683n253l407q06
24901a4348K7249N698J6601J1033J658N0270J3860J5075m3923J0277k2663l2705
24889C8082k9477j2897l8830k3710m7435O4704J07051N3633q3099j03651n4250
24878a29879l5919O3324N2877M2647J064J0746K4428K3851M7501K0246k3782m4926
$$ plain form
24866 52178 13366 -11256 -30272 -48353 -55511 -21677 -32750 -70827 -14363 7886 6542 -36359
24854 -36359 -52713 -43366 -70804 -32607 -57713 -85354 -86860 -86717 -76921 -68905 -100147 -94217 -106231
24841 -106231 -91834 18890 36596 64131 26899 -45574 -53272 10021 -17603 -38755 -10842
24830 -10842 2486 29805 64994 50490 5148 -34942 -105462 -73632 38715 62302 89304
24819 89304 69720 29577 -10388 -47956 -46375 -21787 24631 68750 126050 113944 42021 -25183
24807 -25183 -46436 -32129 -8976 -3134 18783 -80416 -148321 -165479 -176268 -134911 -105060 -20707
24795 -20707 -4934 -53789 -48008 -6670 -535 -9163 -35938 -29195 -50368 -88385 -119507 -168062
24783 -168062 -172202 -58738 12566 45785 53788 68366 59432 51683 46536 -5341 -10383 39718
$$ packed form
24866E2178l8812k4622j9016j8081p158L3834j1073l8077N6464K2249j344m2901
24854c6359j6354R347k7438L8197k5106k7641j506J43R796Q016l1242N930j2014
24841a06231J4397J10724J7706K7535l7232p2473p698O3293k7624k1152K7913
24830a0842J3328K7319L5189j4504m5342m0090p0520L1830J12347K3587K7002
24819H9304j9584m0143l9965l7568J581K4588M6418M4119N7300j2106p1923o7204
24807b5183k1253J4307K3153N842K1917r9199o7905j7158j0789M1357K9851Q4353
24795b0707J5773m8855N781M1338O135q628k6775O743k1173l8017l1122m8555
24783a68062m140J13464P1304L3219Q003J4578q934p749n147n1877n042N0101
$$ plain form
24771 39718 41115 32893 -1767 -17310 39527 -11113 -74376 -108365 -64257 -20424 -30235 -7958
24759 -7958 -1458 -43053 -66580 19282 30230 20701 23250 -35472 -35242 -13122 -30120 -5258 84825
24746 84825 76225 45158 -7083 -17196 -295 70893 17116 17451 64216 55893 43520 53091 24728
24733 24728 12861 37127 56702 -44869 -121288 -102127 -46967 -27365 -19638 -13918 -12768 -8613
24721 -8613 -4447 -5523 19921 20303 -55513 -133646 -105333 -48681 5457 60083 76210 13322 -5430
24708 -5430 -57114 -67045 -58421 -59209 -64549 -33979 -44882 -77071 -77472 -50669 -76890 -58457 85158
24695 85158 130131 105706 36279 43791 61887 51901 27626 -15516 3297 -3119 -15082 46338
24683 46338 -7572 -32718 10785 65426 54600 -13013 -19854 -4336 -41217 -21508 4692 1451
$$ packed form
24771C9718J397q222l4660j5543N6837n0640o3263l3989M4108M3833r811K2277
24759g958O500m1595k3527Q5862J0948r529K549n8722K30K2120j6998K4862R0083
24746H4825q600l1067n2241j0113J6901P1188n3777L35M6765q323j2373R571k8363
24733B4728j1867K4266J9575j01571p6419J9161N5160J9602P727N720J150M155
24721h613M166j076K5444L82p5816p8133K8313N6652N4138N4626J6127o2888j8752
24708e430n1684r931Q624p88n340L0570j0903l2189m01K6803k6221J8433J43615
24695H5158M4973k4425o9427P512J8096r986k4275m3142J8813o416j1963O1420
24683D6338n3910k5146M3503N4641j0826o7613o841J5518l6881J9709K6200l241
$$ plain form
24671 1451 54423 111691 161022 77351 14727 -51597 -44892 15142 -1957 24902 22692 65595
24659 65595 119540 123142 67412 11247 -42689 -106924 -137884 -133025 -88361 -14719 6619 -30706
24647 -30706 -101933 -92895 -122926 -146702 -153295 -112001 -77112 -97463 -82508 -37245 -13598 -30182
24635 -30182 -24496 -2323 -30521 -15492 -1171 50388 25789 47417 75739 -1882 -39786 -8674
24623 -8674 -2281 -18744 -55240 -108014 -65537 -26937 -35680 -88239 -68507 -33446 -13789 75639
24611 75639 103902 124485 133042 117374 40350 2487 41016 56972 27954 7718 -40455 -77002
24599 -77002 -66335 -29303 -51596 -86182 -77754 -31374 21869 60057 81097 15341 -12321 -44054
24587 -44054 -15984 -65374 -78417 -45440 -43317 -64638 -19727 27351 -10730 -74066 -21583 73204
$$ packed form
24671A451N2972N7268M9331q3671o2624o6324O705O0034j7099K6859k210M2903
24659F5595N3945L602n5730n6165n3936o4235l0960M859M4664P3642K1338l7325
24647c0706p1227R038l0031k3776o593M1294L4889k0351J4955M5263K3647j6584
24635c0182N686K2173k8198J5029J4321N1559k4599K1628K8322p7621l7904L1112
24623h674O393j6463l6496n2774M2477L8600q743n2559J9732L5061J9657Q9428
24611G5639K8263K0583Q557j5668p7024l7863L8529J5956k9018k0236m8173l6547
24599g7002J0667L7032k2293l4586Q428M6380N3243L8188K1040o5756k7662l1733
24587d4054K8070m9390j3043L2977K123k1321M4911M7078l8081o3336N2483R4787
$$ plain form
24575 73204 115582 77411 1086 22514 10629 -43036 -34143 -59912 -65217 -60209 -81264 -48143
24563 -48143 -4920 -38149 -34945 -32464 -33976 13554 47892 39721 8403 10548 -39487 -25348 -20973
24550 -20973 -33655 -32975 -67874 -43376 -13543 -32069 -32730 -16441 20069 15390 -62029 -49794 -2372
24537 -2372 20306 102847 157833 63295 -13398 -67981 -46106 -30407 -75665 -67357 -42952 16518
24525 16518 9683 -5678 39746 42288 53619 43274 -18940 12871 -8554 -63010 -65806 -114863
24513 -114863 -89440 -110139 -44784 13099 -62276 -150530 -157668 -42516 -29915 -85001 -102055
24502 -102055 -116825 -98841 -60152 -6738 63964 65798 27303 4528 13001 56349 65490 -15225
24490 -15225 34556 33470 33430 95304 109322 40818 36865 14209 27621 37892 50477 82022 116166
$$ packed form
24575G3204M2378l8171p6325K1428j1885n3665Q893k5769n305N008k1055L3121
24563d8143M3223l3229L204K481j512M7530L4338q171l1318K145n0035J4139M375
24550b0973j2682O80l4899K4498K9833j8526o61J6289L6510m679p7419J2235M7422
24537b372K2678Q2541N4986r4538p6693n4583K1875J5699m5258Q308K4405N9470
24525A6518o835j5361M5424K542J1331j0345o2214L1811k1425n4456k796m9057
24513a14863K5423k0699O5355N7883p5375q8254p138J15152J2601n5086j7054
24502a02055j4770J7984L8689N3414P0702J834l8495k2775Q473M3348R141q0715
24490a5225M9781j086m0O1874J4018o8504l953k2656J3412J0271J2585L1545L4144
$$ plain form
24477 116166 78641 -2759 -55585 -81751 -21876 21863 42663 52534 16395 -22395 -46382 13155
24465 13155 89454 160261 146794 153232 157223 81549 7434 -23147 14292 90209 110655 109285
24453 109285 116768 94261 50984 93662 6280 -45071 6247 65321 38486 11824 -56384 -42046
24441 -42046 57920 60099 -8649 -12918 3001 51104 -13788 -60952 -85732 -69726 -36886 -53095
24429 -53095 -55998 -79771 -3477 51567 8501 1629 -5198 -20259 -30202 -33702 66521 16776
24417 16776 32073 127927 84461 36953 76064 90365 90119 126422 49122 27052 5195 22717
24405 22717 99107 56268 24347 -6751 -27747 -111178 -105857 -8865 13737 -38515 -24309 21431
24393 21431 36604 18286 124247 80763 35347 77122 80646 71345 37333 44006 11623 33759
$$ packed form
24477A16166l7525q1400n2826k6166N9875M3739K0800R871l6139l8790k3987N9537
24465A3155P6299P0807j3467O438L991p5674p4115l0581L7439P5917K0446j370
24453A09285P483k2507m3277M2678q7382n1351N1318N9074k6835k6662o8208J4338
24441d2046R9966K179o8748m269J5919M8103o4892m7164k4780J6006L2840j6209
24429e3095k903k3773P6294N5044m3066o872o827j5061r943l500J00223m9745
24417A6776J5297R5854m3466m7508L9111J4301k46L6303p7300k2070k1857J7522
24405B2717P6390m2839l1921l1098k0996q3431N321R6992K2602n2252J4206M5740
24393B1431J5173j8318J05961m3484m5416M1775L524r301l4012O673l2383K2136
$$ plain form
24381 33759 27014 24256 -17044 -32762 -27501 -17755 63021 112822 57971 -2815 -57847 -54331 -36998
24368 -36998 -10684 1705 73114 59776 5557 -18362 869 92869 61384 16104 -46856 -119834
24356 -119834 -134679 -149922 -106246 -9745 -3789 2392 20485 72401 48643 63766 104925 71501
24344 71501 56773 59093 58592 55773 72765 112976 126280 96218 64383 93592 92797 962 -76786
24331 -76786 -89841 -84591 -52411 -8068 -10862 -36974 -65617 -28348 26427 18252 8761 5539 -16735
24318 -16735 33844 129369 134083 128553 128250 94473 56753 87273 140282 105125 60670 51346 23528
24305 23528 72613 93053 99330 25210 -129 -21120 -32516 -26728 -57701 -58130 -63063 -46570 -6085
24292 -6085 9738 -8697 21259 -24350 -69287 -53585 -74391 -54028 -15543 34370 31425 33146
$$ packed form
24381C3759o745k758m1300j5718N261R746Q0776M9801n4851o0786n5032L516J7333
24368c6998K6314J2389P1409j3338n4219k3919J9231R2000l1485m5280o2960p2978
24356a19834j4845j5243M3676R6501N956O181J8093N1916k3758J5123M1159l3424
24344G1501j4728K320n01k819J6992M0211J3304l0062l1835K9209p95r1835p7748
24331g6786j3055N250L2180M4343k794k6112k8643L7269N4775q175r491l222k2274
24318a6735N0579R5525M714n530l03l3777l7720L0520N3009l5157m4455r324k7818
24305B3528M9085K0440O277p4120k5339k0991j1396N788l0973m29m933J6493M0485
24292f085J5823j8435K9956m5609m4937J5702k0806K0363L8485M9913k945J721
$$ plain form
24280 33146 17503 -73262 -82888 -74501 -126281 -83401 -25978 -24040 -32771 -37928 -2756 46427 27246
24267 27246 47094 33732 2560 14043 49897 77005 82869 16744 -44509 -44699 -34356 53573
24255 53573 -21537 -19632 19304 37838 -9897 -43976 2832 305 38160 60542 33698 30102
24243 30102 41404 -24501 -54247 -15490 -51641 -38372 25699 80828 62486 104251 78378 16698
24231 16698 -27359 -8324 65078 73708 52862 20333 -60186 -62719 13442 91154 96063 65201
24219 65201 26755 33709 -8343 -48694 -15935 -31018 -7521 -36907 -64160 -37285 -56027 -102565
24207 -102565 -92361 -93695 -77253 -60101 -65673 -14586 -31934 6615 26091 64435 32102 7681
24195 7681 51597 21769 27987 10683 -18577 -81576 -78888 -34515 -6970 -10318 3566 -14725
$$ packed form
24280C3146j5643r0765r626Q387n1780M2880N7423J938q731n157L5172M9183j9181
24267B7246J9848j3362l1172J1483L5854K7108N864o6125o1253j90J0343Q7929
24255E3573p5110J905L8936J8534m7735l4079M6808k527L7855K2382k6844l596
24243C0102J1302o5905k9746L8757l6151J3269O4071N5129j8342M1765k5873o1680
24231A6698m4057J9035P3402Q630k0846l2529q0519k533P6161P7712M909l0862
24219F5201l8446O954m2052m0351L2759j5083K3497k9386k7253K6875j8742m6538
24207a02565J0204j334J6442J7152n572N1087j7348L8549J9476L8344l2333k4421
24195G681M3916k9828O218j7304k9260o2999K688M4373K7545l348J3884j8291
$$ plain form
24183 -14725 25418 72749 16749 44727 69340 106956 68312 39623 -23285 -53139 -113098 -108142
24171 -108142 -39090 -65257 -99018 -67726 23622 -785 -33242 -37353 55827 32371 -54087 -149354
24159 -149354 -167062 -150246 -113328 -102272 -24727 -2610 614 7519 3242 -38638 -9717 -49723
24147 -49723 -33502 39873 43343 43378 93980 57070 42678 48423 53125 108668 119961 110664 158535
24134 158535 103480 39562 19521 43060 70077 21607 -34336 -23518 7263 5601 -4770 -3015
24122 -3015 -21552 -42713 -77324 -34951 22185 50653 13389 -32144 14780 47772 -20604 -63790
24110 -63790 -89185 -22400 -8803 -14113 -1466 -86377 -86772 -76456 -99144 -93562 -50367 8914
24098 8914 -38051 -81769 -72320 -49724 -97129 -116651 -126470 -40970 19396 31145 -15014 -66613
$$ packed form
24183a4725M0143M7331n6000K7978K4613L7616l8644k8689o2908k9854n9959M956
24171a08142O9052k6167l3761L1292R1348k4407l2457m111R3180k3456q6458r5267
24159a49354j7708J6816L6918J1056P7545K2117L224O905m277m1880K8921m0006
24147d9723J6221P3375L470L5N0602l6910j4392N745M702N5543J1293r297M7871
24134A58535n5055o3918k0041K3539K7017m8470n5943J0818L0781j662j0371J755
24122c015j8537k1161l4611M2373N7136K8468l7264m5533M6924L2992o8376m3186
24110f3790k5395O6785J3597n310J2647q4911l95J0316k2688N582M3195N9281
24098H914m6965m3718R449K2596m7405j9522r819Q5500O0366J1749m6159n1599
$$ plain form
24086 -66613 -94927 -107092 -83635 -63597 -5894 55631 -16970 -47649 -40274 -28859 -10625 36060
24074 36060 -19949 -48300 -82455 -21386 -36257 -38937 -70908 -115620 -133848 -108068 -79929 -86376
24062 -86376 -56181 -27289 4933 14797 9645 -11582 -47944 -28290 -48483 -61926 -81573 -80250
24050 -80250 14569 -3574 -74014 -99306 -93867 -76808 -67031 -51634 4001 -35429 -11022 20726
24038 20726 51881 113039 120587 104006 58048 65822 29513 78811 138996 115838 106709 68901
24026 68901 107262 164766 175504 48567 18501 25116 -27705 -101378 -69632 5625 70037 135533
24014 135533 161923 95519 17712 -34258 -69527 -44233 6814 38175 100290 86890 16587
24003 16587 -18941 -1547 28131 23363 -36056 -10446 -31370 -85513 -127184 -97622 76150 120122
$$ packed form
24086f6613k8314j2165K3457K0038N7703O1525p2601l0679P375J1415J8234M6685
24074C6060n6009k8351l4155O1069j4871k680l1971m4712j8228K5780K8139o447
24062h6376L0195K8892L2222R864n152k1227l6362J9654k0193j3443j9647J323
24050h0250R4819j8143p0440k5292N439J7059R777J5397N5635l9430K4407L1748
24038B0726L1155O1158P548j6581m5958P774l6309M9298O0185k3158r129l7808
24026F8901L8361N7504J0738j26937l0066O615n2821p3673L1746P5257O4412O5496
24014A35533K6390o6404p7807n1970l5269K5294N1047L1361O2115j3400p0303
24003A6587l5528J7394K9678m768n9419K5610k0924n4143m1671K9562J73772M3972
$$ plain form
23991 120122 118566 72498 26655 61252 5456 -12464 24106 14886 -30957 8757 52128 9471
23979 9471 -53340 -53529 -69703 6226 -37400 -26480 -7987 15595 69356 51692 11503 -4550
23967 -4550 -18921 -38867 -36863 -26819 33135 60094 40840 50433 -17077 -9371 15926 -21496
23955 -21496 15211 43181 -4976 5633 -19199 -1525 96606 54122 29993 23176 58946 37244
23943 37244 9172 24916 43429 653 -13115 -37803 -56370 -37831 -28328 18089 -33703 -14422
23931 -14422 29356 42101 22626 33968 19368 2800 17111 54782 24564 -15274 -23895 30252
23919 30252 93093 34529 -40904 -72342 -97953 -90528 -76342 -92929 -55209 -12330 16910 30458
23907 30458 -5289 -12042 596 5191 48510 484 -20110 -10211 20021 23411 56018 19338
$$ packed form
23991A20122j556m6068m5843L4597n5796j7920L6570r220m5843L9714M3371m2657
23979I471o2811j89j6174P5929m3626J0920J8493K3582N3761j7664m0189j6053
23967d550j4371j9946K004J0044N9954K6959j9254R593o7510P706K5297l7422
23955b1496L6707K7970m8157J0609k4832J7674R8131m2484k4129o817L5770k1702
23943C7244k8072J5744J8513m2776j3768k4688j8567J8539R503M6417n1792J9281
23931a4422M3778J2745j9475J1342j4600j6568J4311L7671l0218l9838q621N4147
23919C0252O2841n8564p5433l1438k5611P425J4186j6587L7720M2879K9240J3548
23907C0458l5747o753J2638M595M3319m8026k0594R899L0232L390L2607l6680
$$ plain form
23895 19338 9541 12844 -44697 -33758 -25533 -52258 -43139 -11385 -27661 -24964 50447 61941 73216
23882 73216 115382 78479 -25105 -74927 -43612 5905 -33581 -67674 -81533 -103332 -96957 -92331
23870 -92331 -35942 -78109 -134299 -133151 -111568 -47906 29751 133927 97717 -23138 -88290
23859 -88290 -74340 -29879 -14398 -2440 30465 45369 -1881 -46487 -50794 -81487 -109774 -143179
23847 -143179 -155366 -53214 -30271 -26956 31299 19582 7749 -7503 -11279 19451 79961 83387
23835 83387 27742 -16793 2857 -5250 -31416 -96676 -108290 -95430 -86881 -115435 -65998 -39624
23823 -39624 -27100 -12244 10629 47627 50923 -5117 -11085 26222 6324 12357 42858 37526
23811 37526 25182 43090 80273 144358 120504 61546 47414 46417 -4740 31187 80551 78470
$$ packed form
23895A9338r797L303n7541J0939Q225k6725R119L1754j6276K697P5411J1494J1275
23882G3216M2166l6903j03584m9822L1315M9517l9486l4093j3859k1799O375M626
23870i2331N6389m2167n6190J148K1583O3662P7657J04176l6210j20855o5152
23859h8290J3950M4461J5481J1958L2905J4904m7250m4606m307l0693k8287l3405
23847a43179j2187J02152K2943L315N8255j1717j1833j5252l776L0730O0510L426
23835H3387n5645m4535J9650q107k6166o5260j1614J2860Q549k8554M9437K6374
23823c9624J2524J4856K2873L6998L296n6040n968L7307j9898O033L0501n332
23811C7526j2344J7908L7183O4085k3854n8958j4132r97n1157L5927M9364k081
$$ plain form
23799 78470 29761 -10194 38434 42033 2132 -19251 -57508 -53153 -80755 -76273 -15504 12565
23787 12565 29446 -46234 -51316 10946 -44201 1895 9164 1582 -7416 16951 1171 7476 -13040
23774 -13040 -24978 -16372 17737 40289 53563 38835 108396 71752 6341 -60292 -84141 -53291
23762 -53291 -17197 -23466 -40129 25042 81072 98383 60163 34083 -51318 -38747 -21152 43535
23750 43535 37974 23435 1266 -7956 -21045 -60724 -109801 -83179 -89315 -79614 -78549 -175764 -205944
23737 -205944 -159774 -78688 -83864 -67014 3288 60476 124949 156880 69705 80395 110083 73880
23725 73880 70107 26534 -25303 -2445 70283 17318 -19741 3903 44855 28398 48981 48114
23713 48114 74219 39240 1082 19112 5882 28165 -16657 -34751 6617 70459 12409 -31691
$$ packed form
23799G8470m8709l9955M8628L599l9901k1383l8257M355k7602M482O0769K8069
23787A2565J6881p5680n082O2262n5147M6096P269p582q998K4367j5780O305k0516
23774a3040j1938Q606L4109K2552J3274j4728O9561l6644o5411o6633k3849L0850
23762e3291L6094o269j6663O5171N6030J7311l8220k6080q5401J2571J7595O4687
23750D3535n561j4539k2169r222j3089l9679m9077K6622o136R701J065r7215l0180
23737b05944M6170Q1086n176J6850P0302N7188O4473L1931q7175J0690K9688l6203
23725G3880l773m3573n1837K2858P2728n2965l7059K3644M0952j6457K0583q67
23713D8114K6105l4979l8158J8030j3230K2283m4822j8094M1368O3842n8050m4100
$$ plain form
23701 -31691 26327 7632 -44928 -50421 -51943 -34909 -49131 -53320 -82881 -67229 -19862 -22564
23689 -22564 -2585 59168 51303 -14721 1176 75116 -740 -90660 -56316 -44557 -64236 -35809
23677 -35809 -20661 -43764 -57961 3084 -1796 -17547 -8957 19102 -13017 -18946 -21612 -33549
23665 -33549 -102017 -124515 -127387 -111882 -81705 -22433 2119 -3895 -31975 -5853 11480 20914
23653 20914 -12416 12415 -2749 21054 7803 -9210 16354 50808 25906 -49449 -56583 11313
23641 11313 17888 -21197 43275 109330 159367 46832 -55755 -52984 -96024 -73996 -63809 -69139
23629 -69139 -35224 -11867 53831 39041 56516 63509 34704 -5597 -64793 -106966 -3196 95597
23617 95597 62433 34237 54136 12868 9843 30187 38885 60348 25580 22739 -4555 -46436
$$ packed form
23701c1691N8018j8695n2560n493j522J7034j4222m189k9561J5652M7367k702
23689b2564J9979O1753p865o6024J5897P3940p5856q9920L4344J1759j9679K8427
23677c5809J5148k3103j4197O1045m880j5751Q590K8059l2119n929k666j1937
23665c3549o8468k2498k872J5505L0177N9272K4552o014k8080K6122J7333R434
23653B0914l3330K4831j5164K3803j3251j7013K5564L4454k4902p5355p134O7896
23641A1313O575l9085O4472O6055N0037j12535j02587K771m3040K2028J0187n330
23629f9139L3915K3357O5698j4790J7475O993k8805m0301n9196m2173J03770R8793
23617I5597l3164k8196J9899m1268l025K0344Q698K1463l4768k841k7294m1881
$$ plain form
23605 -46436 -112091 -100344 -91772 -42172 -2978 -46458 -92599 -99279 -69681 -37814 -40826 -7168
23593 -7168 19617 92235 49332 43327 64846 72110 107495 55059 -13284 1252 41809 103426
23581 103426 88953 2940 -33689 -25844 7169 32815 -5521 -41986 -45399 -128411 -162074 -112120
23569 -112120 -80490 -87161 -122583 -110759 -118673 -97551 -93876 -144477 -155907 -98973 6602 69384
23557 69384 66607 44835 56494 63607 34353 -65467 -65764 -25631 -21642 -47071 -65142 -21953 125247
23544 125247 130171 96369 -22029 -100161 -91971 -19391 -6122 5685 14310 46587 47933 40776
23532 40776 48053 57596 6608 40755 5673 -9479 -17807 -16217 -15735 49621 64736 127181 81172
23519 81172 72449 83769 60895 -76130 -141313 -107878 -50117 -33904 -72516 -86930 -70554 -71598
$$ packed form
23605d6436o5655J1747Q572M9600L9194m3480m6141o680K9598L1867l012L3658
23593g168K6785P2618m2903o005K1519P264L5385n2436o8343J4536M0557O1617
23581A03426j4473q6013l6629P845L3013K5646l8336l6465l413q3012l3663M9954
23569a12120L1630o671l5422J1824p914K1122L675n0601j1430N6934J05575O2782
23557F9384k777k1772J1659P113k9254r9820k97M0133L989k5429j8071M3189J47200
23544A25247M924l3802j18398p8132Q190P2580J3269J1807Q625L2277J346p157
23532D0776P277R543n0988L4147l5082j5152q328J590M82O5356J5115O2445m6009
23519H1172q723J1320k2874j37025o5183L3435N7761J6213l8612j4414J6376j044
$$ plain form
23507 -71598 -42856 65057 152009 157281 104448 123129 65051 55282 67809 10051 -31094 -65544
23495 -65544 -95004 -129147 -40686 24534 -1091 35691 31924 128056 100593 96880 92938 82301
23483 82301 36136 18247 -4653 -4057 -64374 -96650 -106261 -112068 -98368 -82237 -106893 -95096
23471 -95096 -83848 -57811 -52513 -70167 -68619 -38415 -23469 -44688 -30099 7003 -52217 -83483
23459 -83483 -38910 50604 23528 58340 63401 -41574 -60199 -70474 -86451 -58318 -22974 -51403
23447 -51403 -76319 -14503 -22245 -12830 8537 -52839 -59764 -30084 29538 106004 74002 68147
23435 68147 32277 40132 -12138 2520 45740 -9418 -30525 -74294 -49181 -43050 -67082 -37630
23423 -37630 1234 578 -58697 -90637 -87617 -90482 -114405 -102154 -46124 -12092 8696 -91221
$$ packed form
23507g1598K8742J07913Q6952N272n2833J8681n8078r769J2527n7758m1145l4450
23495f5544k9460l4143Q8461O5220k5625L6782l767R6132k7463l713l942j0637
23483H2301m6165j7889k2900N96o0317l2276r611n807J3700J6131k4656J1797
23471i5096J1248K6037N298j7654J548L0204J4946k1219J4589L7102n9220l1266
23459h3483M4573Q9514k7076L4812N061j04975j8625j0275j5977K8133L5344k8429
23447e1403k4916O1816p742R415K1367o1376o925K9680N9622P6466l2002n855
23435F8147l5870P855n2270J4658M3220n5158k1107m3769K5113O131k4032K9452
23423c7630L8864o56n9275l1940L020k865k3923J2251N6030L4032K0788r9917
$$ plain form
23411 -91221 -121512 -96681 -24092 6374 40186 52991 22250 -58656 -77502 -70038 -82235 -66198
23399 -66198 -44976 -57322 -97279 -93191 -56341 -63918 -42645 -29674 -34459 -1682 -26283 -67969
23387 -67969 -37977 -22013 -67935 -76701 -84242 -80111 -25053 2330 12634 17815 9159 -71600 -62179
23374 -62179 -28389 -3485 17836 -60196 -64597 -24627 -73665 -87940 -96023 -66608 44958 137806
23362 137806 200465 138593 81217 37093 -14141 -24774 -38416 -21039 -23918 -9767 40910 14937
23350 14937 20894 -4161 24066 20455 -51998 -67799 -99663 -117617 -40464 -90031 -112711 -152366
23338 -152366 -141105 -105925 -129621 -116309 -117470 -113733 -132917 -102005 -61226 -86131 -135982 -95522
23326 -95522 -60247 -34117 69165 107958 -14744 -80152 -165836 -200845 -135126 1533 47217
$$ packed form
23411i1221l0291K4831P2589L0466L3812J2805l0741q0906j8846P464j2197J6037
23399f6198K1222j2346l9957M088L6850p577K1273J2971m785L2777k4601m1686
23387f7969K9992J5964m5922q766p541M131N5058K7383J0304N181q656q0759R421
23374f2179L3790K4904K1321p8032m401L9970m9038j4275q083K9415J11566R2848
23362A37806O2659o1872n7376m4124n1234j0633j3642J7377k879J4151N0677k5973
23350A4937N957k5055K8227l611p2453j5801l1864j7954P7153m9567k2680l9655
23338a52366J1261L5180k3696J3312j161L737j9184L0912M0779k4905m9851M0460
23326i5522L5275K6130J03282L8793j22702o5408q5684l5009O5719J36659M5684
$$ plain form
23315 47217 26899 -18376 30221 11473 21387 25446 29540 41310 1771 14907 -63981 -75635
23303 -75635 14935 53267 -51947 -100399 -182492 -178557 -133120 -67667 -90899 -112280 -83951 -50399
23291 -50399 -55371 -97982 -77212 -32862 -8972 2626 -22619 -7983 -32740 -107310 -103998 -143548
23279 -143548 -115219 -59888 -20438 14523 -41812 -31056 -40990 -12879 4410 -43096 -28966 28356
23267 28356 4141 -2402 70251 25058 11190 -37090 -123288 -123530 -91351 -78583 -72252 -45281
23255 -45281 -25042 11521 10843 -8719 -54956 -122796 -159812 -110646 -76392 -19305 -14067 -36809
23243 -36809 -98964 -120069 -129212 -114046 -83143 -43482 34096 42303 -4788 -34493 -62318 -49752
23231 -49752 -56031 -49937 -106297 -108476 -113690 -56549 1060 -67264 -122842 -182928 -149548 -85854
$$ packed form
23315D7217k0318m5275M8597j8748R914M059M094J1770l9539J3136p8888j1654
23303g5635R0570L8332j05214m8452q2093L935M5437O5453k3232k1381K8329L3552
23291e0399m972m2611K0770M4350K3890J1598k5245J4636k4757p4570L312l9550
23279a43548K8329N5331L9450L4961n6335J0756r934K8111J7289m7506J4130N7322
23267B8356k4215o543P2653m5193j3868m8280q6198k42L2179J2768O331K6971
23255d5281K0239L6563o78j9562m6237o7840l7016M9166L4254N7087N238k2742
23243c6809o2155k1105r143J5166L0903L9661P7578Q207m7091k9705k7825J2566
23231d9752o279O094n6360k179n214N7141N7609o8324n5578o0086L3380O3694
$$ plain form
23219 -85854 -87038 -61834 -25309 -42696 -63880 -67439 -35068 -23623 -20387 -22925 -47547 -20371
23207 -20371 -20708 -52771 -56449 -68958 -73055 -13430 -2363 13704 23720 34213 48349 28728
23195 28728 -68215 -102522 -91157 -38403 -28346 -37969 -65129 -36165 -33840 -89771 -72729 -68422
23183 -68422 -41658 -5827 -1897 -45986 -103535 -81331 -63093 28083 42664 -536 -24783 -53567
23171 -53567 -98989 -103283 -60929 -37994 -26675 -61683 -8696 -18425 -5458 47794 1499 -55300
23159 -55300 -33632 15567 30465 5513 -9644 -3500 -41615 -75798 -31314 -35873 -33803 -42560
23147 -42560 -46904 -27403 20002 11691 11289 -35373 -100897 -82306 -65119 -137852 -205550 -188174
23135 -188174 -179081 -99464 -40084 -57264 -30827 24029 65429 49934 18916 -38126 -20930 3015
$$ packed form
23219h5854j184K5204L6525j7387k1184l559L2371J1445L236k538k4622K7176
23207b0371l37l2063l678j2509m097N9625J1067J6067J0016J0493J4136j9621
23195B8728r6943l4307J1365N2754J0057r623k7160K8964K325n5931J7042M307
23183f8422K6764L5831L930m4089n7549K2204J8238R1176J4581m3200k4247k8784
23171e3567m5422m294M2354K2935J1319l5008N2987r729J2967N3252m6295n6799
23159e5300K1668M9199J4898k4952j5157O144l8115l4183M4484m559K070q757
23147d2560m344J9501M7405q311m02m6662o5524J8591J7187p2733o7698J7376
23135a88174R093P9617N9380j7180K6437N4856M1400j5495l1018n7042J7196K3945
$$ plain form
23123 3015 -10057 5111 28244 -1271 -52655 -54825 -52375 -94565 -142899 -163809 -75834 -55269
23111 -55269 -52550 -66453 -79688 -62592 -104391 -132483 -50352 -20572 14479 108949 158568 163481
23099 163481 153455 116184 129585 134337 71979 46276 3140 30715 66808 53271 11480 -45490
23087 -45490 -64042 -41703 -9738 -25192 -21680 47111 57785 31492 25646 -40946 -33996 4727
23075 4727 -46900 -78757 -59452 -28237 -8215 -9698 -20580 -45308 -88979 -133987 -142330 -160482
23063 -160482 -60244 -70843 -102528 -68395 -30159 -61225 25805 82660 -25021 -14449 -52855
23052 -52855 -31820 -47245 -57938 -99057 -79030 -22001 17080 -14766 -43795 -59397 -32082 -41849
23040 -41849 -42642 -30484 -3242 -56531 -57504 -3444 104705 103174 74659 58725 32914 5579
$$ packed form
23123C015j3072J5168K3133k9515n1384k170K450m2190m8334k0910Q7975K0565
23111e5269K719j3903j3235J7096m1799k8092Q2131K9780L5051R4470M9619M913
23099A63481j0026l7271J3401M752o2358k5703m3136K7575L6093j3537m1791n6970
23087d5490j8552K2339L1965j5454L512O8791J0674k6293n846o6592O950L8723
23075D727n1627l1857J9305L1215K0022j483j0882k4728m3671m5008q343j8152
23063a60482J00238j0599l1685L4133L8236l1066Q7030N6855j07681J0572l8406
23052e2855K1035j5425j0693m1119K0027N7029L9081l1846k9029j5602K7315r767
23040d1849p93J2158K7242n3289r73N4060J08149j531k8515j5934k5811k7335
$$ plain form
23028 5579 34452 10084 -33286 6905 35445 -3476 16340 -46908 -50321 -62881 -33154 -13445
23016 -13445 -33505 -18545 -14684 4369 -80292 -50331 -66464 -89502 -62559 -99258 -61298 -53255
23004 -53255 -68390 -43184 -31404 -7306 -3625 40283 -12258 -60929 -81750 -48778 -24555 1048
22992 1048 60790 14196 -52577 -25160 1596 -8022 -14488 -13798 -356 79679 54372 60776 3391
22979 3391 -88883 -82617 -66139 -83584 -56669 -710 -639 38285 3220 6910 48778 5449 -63606
22966 -63606 -13249 -42026 -28704 -15764 -4204 34177 -49643 -80903 -72611 -84334 -8937 65483
22954 65483 35986 -25718 -8881 -23200 -42399 -67246 -30808 19147 82632 26842 -15574 -36360
22942 -36360 -89967 -164638 -144837 -165799 -132739 -79745 -58352 -48017 -26277 -1705 -28960 -123469
$$ packed form
23028E579K8873k4368m3370M0191K8540l8921J9816o3248l413j2560K9727J9709
23016a3445k0060J4960L861J9053q4661K9961j6133k3038K6943l6699L7960Q043
23004e3255j5135K5206J1780K4098L681M3908n2541m8671k0821L2972K4223K5603
22992A048N9742m6594o6773K7417K6756r618o466O90J3442Q0035k5307O404n7385
22979C391r2274O266J6478j7445K6915N5959P1L8924l5065L690M1868m3329o9055
22966f3606N0357k8777J3322J2940J1560L8381q3820l1260Q292j1723P5397P4420
22954F5483k9497o1704J6837j4319j9199k4847L6438M9955O3485n5790m2416k0786
22942c6360n3607p4671J9801k0962L3060N2994K1393J0335K1740K4572k7255r4509
$$ plain form
22930 -123469 -123757 -1053 -24029 -75603 -61680 -2607 -42522 -60547 2329 -9695 -34518 -31230
22918 -31230 -34337 -69987 -102249 -64635 -17894 -20945 1481 21170 40967 28578 5928 18037
22906 18037 26241 67140 49174 -17109 -8821 -63415 -119615 -20108 25011 18376 14451 14979 -15493
22893 -15493 9233 84359 95483 28873 -48407 -55522 -47883 23356 25783 -1478 19288 2880
22881 2880 25852 30144 57359 59226 64974 85205 104465 127807 98392 72775 31232 -14116
22869 -14116 -90351 20829 123108 165624 200823 286577 296549 426508 803696 1176350 1331927
22858 1331927 1340595 1285351 1116479 1079825 1028890 1083821 1300113 1422368 1320486 1073226
22848 1073226 773427 516893 352953 247083 126212 57496 21599 23431 41527 10515
$$ packed form
22930a23469k88J22704k2976n1574J3923N9073l9915j8025O2876j2024k4823L288
22918c1230l107l5650l2262L7614M6741l051K2426J9689J9797j2389k2650J2109
22906A8037Q204M0899j7966o6283Q288n4594n6200R9507M5119o635l925N28l0472
22893a5493K4726P5126J1124o6610p7280p115P639P1239K427k7261K0766j6408
22881B880K2972M292K7215J867N748K0231J9260K3342k9415k5617m1543m5348
22869a4116p6235J11180J02279M2516L5199Q5754R972J29959L77188L72654J55577
22858A331927Q668n5244j68872l6654n0935N4931K16292J22255j01882k47260
22848A073226k99799k56534j63940j05870j20871o8716l5897J832J8096l1012
$$ plain form
22838 10515 -29475 -90565 -141042 -106799 -71930 -36250 -96051 -73681 -59275 -15014 58126 108426
22826 108426 82602 -60891 -148115 -126013 -74442 -112945 -82063 -46439 -36393 -6955 10353
22815 10353 44041 43036 23594 58800 -9253 -12750 -16308 -104585 -151875 -70875 -41429 23738
22803 23738 62614 127366 128785 74986 -6582 -15983 -42630 -21632 -50068 -70006 -18755 -6704
22791 -6704 27365 813 -23796 -32394 -40213 -6663 95194 80346 56707 68778 53498 57697
22779 57697 112572 178707 77719 66767 27667 -60615 -55806 -22229 18359 50161 51117 50547
22767 50547 72765 57076 4688 3286 65133 116696 123925 115469 171014 107009 109985 133691
22755 133691 171477 90285 97314 128640 56053 51488 70804 12806 17480 15504 38872 97462
$$ packed form
22838A0515l9990o1090n0477L4243L4869L5680n9801K2370J4406M4261P3140N0300
22826A08426k5824j43493q7224K2102N1571l8503L0882L5624J0046K9438J7308
22815A0353L3688j005j9442L5206o8053l497l558q8277m7290Q1000K9446O5167
22803B3738L8876O4752J419n3799q1568r401k6647K0998k8436j9938N1251J2051
22791f704L4069k6552k4609q598p819L3550J01857j4848k3639J2071j5280M199
22779E7697N4875O6135j00988j0952l9100q8282M809L3577M0588L1802R56n70
22767E0547K2218j5689n2388j402O1847N1563P229q456N5545o4005K976K3706
22755A33691L7786q1192P029L1326p2587m565J9316n7998M674j976K3368N8590
$$ plain form
22743 97462 122874 154976 208217 156927 55441 -37921 -36574 11985 -44869 -13559 51911 52307
22731 52307 15699 1038 -58859 -45060 -25482 -91290 -54564 -20121 48226 46493 45604 72926
22719 72926 106490 138568 150302 214874 215878 125812 53498 -20834 -25017 -9916 1038 36864
22707 36864 112906 122124 55818 7901 -2391 31172 76491 63031 17470 38159 -11071 -27779
22695 -27779 -31791 -39931 -5315 25544 -14459 -31276 -113133 -145899 -137289 -96765 -91865 -62538
22683 -62538 -16997 9140 89676 39422 14740 22297 17963 -3980 -22790 25421 40018 101282
22671 101282 170688 109624 118035 107298 99328 50127 7992 66093 127201 164635 150664 67240
22659 67240 -17558 -45708 -40252 -58710 -44254 3651 58541 30797 34791 75179 45122 46721
$$ packed form
22743I7462K5412L2102N3241n1290j01486r3362J347M8559n6854L1310O5470L96
22731E2307l6608j4661n9897J3799J9578o5808L6726L4443O8347j733q89K7322
22719G2926L3564L2078J1734O4572J004r0066p2314p4332m183J5101J0954L5826
22707C6864P6042R218o6306m7917j0292L3563M5319j3460m5561K0689m9230j6708
22695b7779m012q140L4616L0859m0003j6817q1857l2766Q610M0524M900K9327
22683f2538M5541K6137Q0536n0254k4682P557m334k1943j8810M8211J4597O1264
22671A01282O9406o1064Q411j0737p970m9201m2135N8101O1108L7434j3971q3424
22659F7240q4798k8150N456j8458J4456M7905N4890k7744L994M0388l0057J599
$$ plain form
22647 46721 38632 43828 7784 -11278 28092 56620 22618 21249 19754 28421 -16587 -10712 -8437
22634 -8437 29644 46410 41320 5187 -11553 7621 25902 43945 4227 -74282 -57732 -12313
22622 -12313 15073 -17601 -28411 -38428 -40315 30516 57953 22027 58600 80758 58947 434
22610 434 -21152 -3443 2100 -10192 -17568 17363 19547 5695 -5505 35253 37513 13876 55935
22597 55935 22061 -23617 -79341 -89152 -55718 -15455 9585 16000 18611 41804 9556 -21123
22585 -21123 -47516 -11111 77223 54542 17078 19444 -19709 -68883 -63331 -5536 -61020 -138540
22573 -138540 -144291 -100724 -74481 14074 89866 126148 71179 91757 60500 48834 43847 29841
22561 29841 52521 28907 -50825 -56656 -6837 38346 79004 91142 115649 102876 139135 189086
$$ packed form
22647D6721q089N196l6044j9062L9370K8528l4002j369j495Q667m5008N875K275
22634h437L8081J6766n090l6133j6740J9174J8281J8043l9718p8509J6550M5419
22622a2313K7386l2674j0810j0017j887P0831K7437l5926L6573K2158k1811n8513
22610D34k1586J7709N543j2292p376L4931K184j3852j1200M0758K260k3637M2059
22597E5935l3874m5678n5724r811L3434M0263K5040O415K611K3193l2248l0679
22585b1123k6393L6405Q8334k2681l7464K366l9153m9174N552N7795n5484p7520
22573a38540n751M3567K6243Q8555P5792L6282n4969K0578l1257j1666m987j4006
22561B9841K2680k3614p9732n831M9819M5183M0658J2138K4507j2773L6259M9951
$$ plain form
22549 189086 188946 163451 94484 44838 9339 -3022 111853 139804 92608 171116 180037 209360
22537 209360 185657 101033 85915 70320 36908 26159 -24318 -743 -27180 -9498 7714
22526 7714 -13369 -62653 -44956 12774 25071 21090 23625 94312 151696 183360 156086 158256
22514 158256 148552 147555 187288 140095 121704 95196 106840 182947 184602 164525 126055 98226
22502 98226 46351 34265 49547 72367 -30798 -33916 95894 133110 103548 18310 -26804
22491 -26804 -37426 -34426 -16146 55890 125105 123293 134782 143398 126952 138702 195190 208788
22479 208788 123118 88433 91785 123744 109493 -13621 -78202 -130424 -100066 -71001 -48905
22468 -48905 -38338 -177 14232 13318 93611 105035 68691 72777 49735 56453 22640 -335
$$ packed form
22549A89086j40k5495o8967m9646l5499j2361J14875K7951m7196P8508Q921K9323
22537B09360k3703q4624j5118j5595l3412j0749n0477K3575k6437J7682J7212
22526G714k1083m9284J7697N7730J2297l981K535P0687N7384L1664k7274K170
22514A58256r704r97L9733m7193j8391k6508J1644P6107J655k0077l8470k7829
22502I8226n1875j2086J5282K2820j03165l118J29810L7216k9562q5238m5114
22491b6804j0622L000J8280P2036O9215j812J1489Q616j6446J1750N6488J3598
22479B08788q5670l4685L352L1959j4251j23114o4581n2222L0358K9065K2096
22468d8905J0567L8161J4409r14Q0293J1424l6344M086k3042O718l3813k2975
$$ plain form
22456 -335 11663 104605 130435 51754 54152 85653 116575 51184 -8592 -2507 17379 -31335
22444 -31335 -54925 33108 7848 33638 70397 125570 107881 82861 91328 57184 23808 34693
22432 34693 -1271 72739 138913 139482 197767 258292 314221 322179 378888 452928 492572 499360
22420 499360 498821 479149 451573 412297 380588 385994 378230 348100 341751 278243 246841 129153
22408 129153 77041 99147 139902 195585 263482 271997 334018 472760 637884 827877 1122249
22397 1122249 1385491 1413159 1384826 1312161 1208235 1166199 1261048 1423311 1534710 1545369
22387 1545369 1309494 950849 662985 533747 472053 337966 266240 204331 179966 162048
22377 162048 186686 244344 250425 240230 314455 314560 308346 224690 215432 237073 258456 288697
$$ packed form
22456c35J1998R2942K5830p8681K398L1501L0922o5391n9776O085J9886m8714
22444c1335k3590Q8033k5260K5790L6759N5173j7689k5020Q467l4144l3376J0885
22432C4693l5964P4010O6174N69N8285O0525N5929P958N6709P4040L9644O788
22420D99360n39j9672k7576l9276l1709N406p764l0130o349o3508l1402j17688
22408A29153n2112K2106M0755N5683O7897Q515O2021J38742J65124J89993K94372
22397A122249K63242K7668k8333p2665j03926m2036R4849J62263J11399J0659
22387A545369k35875l58645k87864j29238o1694j34087p1726o1909k4365j7918
22377A62048K4638N7658O081j0195P4225J05o214q3656r258K1641K1383L0241
$$ plain form
22365 288697 308684 303508 367075 409643 430606 401931 451709 444606 462643 505067 446231 402163
22353 402163 417866 493637 530654 513502 545026 601845 542951 496608 525175 563369 593686
22342 593686 630891 678102 728030 748406 790696 929003 1016508 1043882 1045811 1049495 1084904 1195274
22330 1195274 1349188 1470224 1553948 1587516 1677498 1842726 2084435 2292891 2449528 2595943
22320 2595943 2745767 2992902 3381718 3862106 4312516 4846501 5354217 5978677 6576417
22311 6576417 7372070 8503066 9941930 11732385 13968727 16506364 19640446 23542633
22303 23542633 28478971 35390334 45808818 62778156 91630893 138953455 201474265
22296 201474265 250028379 260745576 245021360 208987106 177403399 175029190 205080408
$$ packed form
22365B88697J9987n176O3567M2568K0963k8675M9778p103J8037M2424n8836m4068
22353D02163J5703P5771L7017j7152L1524N6819n8894m6343K8567L8194L0317
22342E93686L7205M7211M9928K0376M2290J38307Q7505K7374J929L684L5409J10370
22330A195274J53914J21036Q3724L3568Q9982J65228K41709K08456J56637J46415
22320B595943J49824K47135L88816M80388M50410N33985N07716O24460N97740
22311F576417P95653J130996J438864J790455K236342K537637L134082L902187
22303B3542633M936338O911363J0418484J6969338K8852737M7322562O2520810
22296B01474265M8554114J0717197j5724216l6034254l1583707k374209L0051218
$$ plain form
22289 205080408 246726474 262277294 244299981 202556554 144739277 96419502 64798397
22282 64798397 45271455 33100619 25152383 19734519 15900294 13017725 10871158 9253678
22274 9253678 8042288 7092909 6148650 5320656 4718109 4186094 3800302 3513731 3362080
22265 3362080 3146839 2912142 2770086 2620473 2463992 2305997 2155302 2074169 2066514 2006412
22255 2006412 1882220 1720062 1577409 1532850 1441640 1335475 1312664 1339264 1318402 1282534
22245 1282534 1185391 1087749 1045232 1004429 972081 1016158 1006847 916544 857894 853887 844652 850134
22233 850134 826389 766232 749685 715241 701269 726140 706117 656809 636504 636025 577319 598209
22221 598209 588290 575505 585450 506106 385588 360502 415609 480516 460391 451037 466248 450480
$$ packed form
22289B05080408M1646066J5550820j7977313m1743427n7817277m8319775l1621105
22282F4798397j9526942j2170836p948236n417864l834225k882569k146567j617480
22274I253678j211390r49379r44259q27994o02547n32015l85792k86571j51651
22265C362080k15241k34697j42056j49613j56481j57995j50695q1133p655o0102
22255B006412j24192j62158j42653m4559r1210j06165k2811K6600k0862l5868
22245A282534r7143r7642m2517m0803l2348M4077r311r0303n8650m007r235N482
22233H50134k3745o0157j6547l4444j3972K4871k0023m9308k0305m79n8706K0890
22221E98209r919j2785R945p9344j20518k5086N5107O4907k0125r354J5211j5768
$$ plain form
22209 450480 434110 441986 489924 532841 501602 474026 441742 437929 482306 500093 573286 695152
22197 695152 930148 1184757 1475644 1714645 1799704 1707640 1513427 1351950 1353612 1552513
22187 1552513 1732436 1730620 1554055 1269046 1051113 859771 670206 489449 414787 295084
22177 295084 235598 276165 266561 196416 118492 10781 39828 106379 132185 163418 195805
22166 195805 228875 210444 157943 119631 66758 69109 79580 109652 154129 220320 204617 225041
22154 225041 218584 170336 166423 242047 275281 275033 220974 138392 137982 143516 112556 71267 110337
22141 110337 175551 205448 200247 216380 168949 121041 170498 189306 169455 188261 250333 232578
22129 232578 195870 126693 98055 80427 82283 119365 150229 91409 33472 56673 89409 97703
$$ packed form
22209D50480j6370P876M7938M2917l1239k7576l2284l813M4377J7787P3193J21866
22197F95152K34996K54609K90887K39001Q5059r2064j94213j61477J662J98901
22187A552513J79923j816j76565k85009k17933j91342j89565j80757p4662j19703
22177B95084n9486M0567r604p0145p7924j07711K9047O6551K5806L1233L2387
22166A95805L3070j8431n2501l8312n2873K351J0471L0072M4477O6191j5703K0424
22154B25041o457m8248l913P5624L3234k48n4059q2582m10N534l0960m1289L9070
22141A10337O5214K9897n201J6133m7431m7908M9457J8808j9851J8806O2072j7755
22129B32578l6708o9177k8638j7628J856L7082L0864n8820n7937K3201L2736Q294
$$ plain form
22117 97703 128683 150665 148240 219024 232707 268873 236117 158639 86540 100987 111074 95051
22105 95051 28487 -60824 -76690 5607 16395 -49237 -39790 -24334 58339 -3733 -87083 -39294
22093 -39294 37594 139438 161182 86549 41997 28846 39872 62241 76626 48487 -35317
22082 -35317 -35324 -60736 -36135 -39320 -79545 -106531 -83869 -71317 -55137 -19609 7345 17841 33578
22069 33578 -20312 -45792 25055 108553 135298 62728 82760 81466 178447 237334 206549 150225
22057 150225 75401 52685 -55495 -31452 17851 5023 24149 48964 97724 44849 66884
22046 66884 122147 106746 105102 88057 37550 63356 58646 137721 210549 187467 116692 78851
22034 78851 76790 50268 -399 1483 72817 55418 67872 54751 71640 24432 -48865 -34917
$$ packed form
22117I7703L0980K1982k425P0784J3683L6166l2756p7478p2099J4447J0087j6023
22105I5051o6564q9311j5866Q2297J0788o5632R447J5456Q2673o2072q3350M7789
22093c9294P6888J01844K1744p4633m4552j3151J1026K2369J4385k8139q3804
22082c5317pk5412K4601l185m0225k6986K2662J2552J6180L5528K6954J0496J5737
22069C3578n3890k5480P0847Q3498K6745p2570K0032j294R6981N8887l0785n6324
22057A50225p4824k2716j08180K4043M9303j2828J9126K4815M8760n2875K2035
22046F6884N5263j5401j644j7045n0507K5806m710P9075P2828k3082p0775l7841
22034G8851k061k6522n0667J882P1334j7399J2454j3121J6889m7208p3297J3948
$$ plain form
22022 -34917 -18803 117 -27182 -41170 -18047 -47930 -65762 20220 44002 26270 34623 99272
22010 99272 103571 86568 40210 82414 121309 59373 64742 73474 39798 -21904 20990 1010
21998 1010 -15226 25468 41558 68257 30856 -6033 7183 -23829 -57212 -40084 -32639 -7041
21986 -7041 -22081 -68730 -50681 -103649 -89083 -60809 -92562 -34732 -21582 -71985 -22566 9984
21974 9984 30168 131357 161339 60087 39287 71437 51760 -11562 -56506 -38915 -48730 -38532
21962 -38532 -12552 -13495 -25680 68783 157700 117043 9755 -47483 22802 36046 49787 39250
21950 39250 73034 25699 -19003 -35987 -71314 -57520 -55826 -29038 -22634 -51581 -62011 -122635
21938 -122635 -134248 -77160 -49426 -4362 12145 27853 15270 -4732 -37949 -19513 38590
$$ packed form
22022c4917J6114J8920k7299j3988K3123k9883j7832Q5982K3782j7732Q353O4649
22010I9272M299j7003m6358M2204L8895o1936N369Q732l3676o1702M2894j9980
21998A010j6236M0694J6090K6699l7401l6889J3216l1012l3383J7128P445K5598
21986g041j5040m6649J8049n2968J4566K8274l1753N7830J3150n0403M9419L2550
21974I984K0184J01189K9982j01252k0800L2150j9677o3322m4944J7591r815J0198
21962c8532K5980r43j2185R4463Q8917m0657j07288n7238P0285J3244J3741j0537
21950C9250L3784m7335m4702j6984l5327J3794J694K6788O404k8947j0430o0624
21938a22635j1613N7088K7734M5064J6507J5708j2583k0002l3217J8436N8103
$$ plain form
21927 38590 35395 -14125 -72355 -93251 -97275 -83733 -25617 -15943 -12874 51122 27441 37582
21915 37582 41534 61985 -5086 -43785 -49643 -96743 -94448 -43256 3013 117 -19514 -65447
21903 -65447 -78091 55539 149432 150171 105494 11651 -16627 7314 4776 10383 60926 106070
21891 106070 109913 -4457 2914 -6460 -1864 28516 63950 67728 27219 45314 24923 24523 30221
21878 30221 7177 -17120 -23827 -49271 -45402 -7202 37958 -6877 -58938 -81742 -117875 -84082
21866 -84082 -89642 -80615 -1847 -5975 -61002 -71140 -89141 -68729 -21831 8405 -32065 -22138
21854 -22138 39454 27016 -9798 -23472 -21893 -21396 -68100 -43309 -54024 -62782 -88577 -90144 -77530
21841 -77530 -70864 -44430 -59976 1925 -2188 -13031 -52460 -41691 -16956 51338 104801 112802
$$ packed form
21927C8590l195m9520n8230k0896m024J3542N8116R674L069O3996k3681J0141
21915C7582L952K0451o7071l8699n858m7100K295N1192M6269k896j9631m5933
21903f5447j2644J33630R3893P39m4677r3843k8278K3941k538N607N0543M5144
21891A06070L843j14370P371r374M596L0380L5434L778m0509J8095k0391m00N698
21878C0221k3044k4297o707k5444L869L8200M5160m4835n2061k2804l6133L3793
21866h4082n560R027P8768m128n5027j0138j8001K0412M6898L0236m0470R927
21854b2138O1592j2438l6814j3674J579M97m6704K4791j0715q758k5795j567J2614
21841g7530O666K6434j5546O1901m113j0843l9429J0769K4735O8294N3463Q001
$$ plain form
21829 112802 96092 64652 22951 -59505 -44934 19235 30062 -34368 -138571 -110986 -6115
21818 -6115 -102868 -94181 -36804 -8308 -23621 -52046 -51695 -7833 2755 8136 63529 99402 11216
21805 11216 -95314 -39464 -100427 -174950 -168539 -120831 -94569 -51833 -12623 39481 108042 113960
21793 113960 89609 45493 58027 23166 -698 22305 27670 14351 -10808 -20762 -68712 -96340
21781 -96340 -135588 -121896 -98440 -75582 -69163 -57694 -70764 -80446 -55037 -20400 -31595 12784
21769 12784 -1061 448 51158 104188 131914 144297 124902 80963 80292 74058 38782 12537
21757 12537 30219 32255 1346 39922 93657 88762 52856 8795 13862 44590 55334 60416
21745 60416 47527 -3014 -49216 -49845 -44996 -36929 -34623 -49759 3331 42666 55117 35016 12269
$$ packed form
21829A12802j6710l1440m1701q2456J4571O4169J0827o4430j04203K7585J04871
21818f115r6753Q687N7377K8496j5313k8425L51M3862J0588N381N5393L5873q8186
21805A1216j06530N5850o0963p4523O411M7708K6262M2736L9210N2104O8561N918
21793A13960k4351m4116J2534l4861k3864K3003N365j3319k5159r954m7950k7628
21781i6340l9248J3692K3456K2858O419J1469j3070r682K5409L4637j1195M4379
21769A2784j3845J509N0710N3030K7726J2383j9395m3939o71o234l5276k6245
21757A2537J7682K036l0909L8576N3735m895l5906m4061N067L0728J0744N082
21745F0416j2889n0541m6202o29M849Q067K306j5136N3090L9335J2451k0101k2747
$$ plain form
21732 12269 39130 128423 169070 180476 251153 448948 682276 978384 1354121 1483474 1390772
21721 1390772 1237174 1048579 996002 1063114 1241666 1410791 1371953 1161152 876813 637395
21711 637395 482978 358739 236510 124263 43862 88233 123658 128964 75369 64781 134807
21700 134807 172240 128051 83639 75650 30391 1847 13255 59498 48905 86672 72043 85098
21688 85098 132278 83890 67152 33166 31683 63688 -12723 -72729 11734 55460 38655 45282
21676 45282 -13516 -18753 13136 7990 33002 70079 57053 51940 107385 83112 63932 80598
21664 80598 52390 -10790 40152 136312 101651 44590 58575 29151 15543 -26651 6907 -13730
21652 -13730 -58312 -63282 -37700 5049 -56840 -42225 -40869 -50918 -70053 -91348 -39344 10769
$$ packed form
21732A2269K6861Q9293M0647J1406P0677J97795K33328K96108L75737J29353r2702
21721A390772j53598j88595n2577O7112J78552J69125l8838k10801k84339k39418
21711F37395j54417j24239j22229j12247q0401M4371L5425N306n3595j0588P0026
21700A34807L7433m4189m4412p989m5259k8544J1408M6243j0593L7767j4629J3055
21688H5098M7180m8388j6738l3986j483L2005p6411o0006Q4463M3726j6805O627
21676D5282n8798n237L1889n146K5012L7077j3026n113N5445k4273j9180J6666
21664H0598k8208o3180N0942R6160l4661n7061J3985k9424j3608m2194L3558k0637
21652a3730m4582m970K5582M2749o1889J4615J356j0049j9135k1295N2004N0113
$$ plain form
21640 10769 -3305 -75264 7365 29062 -7091 -76543 -72690 -52879 -34949 -48195 -94762 -155637
21628 -155637 -156545 -107822 -81312 -57924 -55177 -114748 -63657 -6470 249 39755 22210 -15354
21616 -15354 -12347 -11433 6617 25689 13790 -29384 -86250 -42525 15394 2340 70496 38216
21604 38216 -36751 -57005 -21491 -53232 -86034 -29897 -19253 25729 67178 61970 -3323 -24407
21592 -24407 -24072 -2695 -28838 -57888 -60073 -54888 10194 -2545 62282 136570 86570 79631 22777
21579 22777 15837 -11472 -110923 -165190 -100946 -48493 35128 41423 -10416 -2141 -23901 -3752
21567 -3752 100878 186522 152986 82642 75417 27168 44144 10788 17816 -41438 -74765 -83868
21555 -83868 -81061 -38884 -79479 -25248 59013 35190 60071 84818 92930 44208 23660 20340
$$ packed form
21640A0769j4074p1959Q2629K1697l6153o9452L853J9811J7930j3246m6567o0875
21628a55637r08M8723K6510K3388K747n9571N1091N7187O719L9506j7545l7564
21616a5354L007R14J8050J9072j1899m3174n6866M3725N7919j3054O8156l2280
21604C8216p4967k0254L5514l1741l2802N6137J0644M4982M1449n208o5293k1084
21592b4407L35K1377k6143k9050k185N185O5082j2739O4827P4288n0000o939n6854
21579B2777o940k7309r9451n4267O4244N2453Q3621O295n1839Q275k1760K0149
21567c752J04630Q5644l3536p0344p225m8249J6976l3356P028n9254l3327r103
21555h3868K807M2177m0595N4231Q4261k3823K4881K4747Q112m8722k0548l320
$$ plain form
21543 20340 35912 38268 57574 52147 -8073 -28504 -1565 26060 1720 -68694 -67912 -112375
21531 -112375 -147066 -98811 -25350 29791 57651 -387 -13209 -20585 -19345 -44757 -63263 -60198
21519 -60198 -59084 18891 25656 15527 34829 25802 -17145 -18368 9479 68334 58114 17033
21507 17033 6708 30828 29734 39168 52401 42341 36144 -373 -7563 -5444 6040 28005 63341
21494 63341 47590 10974 -12134 -36682 -4713 6958 82652 139275 147407 150711 74275 12084
21482 12084 -15272 -23552 58925 70402 6800 -7415 69533 121333 45438 31699 73951 34288
21470 34288 31617 61991 -2139 -70584 -59943 -79142 -58944 -75438 -30105 43399 59403 -21615
21458 -21615 -37934 -8091 26362 24882 -21510 -56424 -81425 -60205 -71129 -67760 -56107 -48661
$$ packed form
21543B0340J5572K356J9306n427o0220k0431K6939K7625k4340p0414P82m4463
21531a12375l4691M8255P3461N5141K7860n8038j2822p376J240k5412j8506L065
21519f0198J114P7975O765j0129J9302r027m2947j223K7847N8855j0220m1081
21507A7033j0325K4120j094R434J3233j0060o197l6517p190K119J1484K1965L5336
21494F3341j5751l6616k3108k4548L1969J1671P5694N6623Q132L304p6436o2191
21482A2084k7356q280Q2477J1477o3602j4215P6948N1800p5895j3739M2252l9663
21470C4288k671L0374o4130o8445J0641j9199K0198j6494M5333P3504J6004q1018
21458b1615j6319K9843L4453j480m6392l4914k5001K1220j0924L369J1653P446
$$ plain form
21446 -48661 -43125 72542 163981 139390 101408 46339 48078 -4799 -90598 -78013 -79199 -68244
21434 -68244 -7329 -5358 4990 49251 84601 85342 89526 58148 10637 -7764 -86361 -30413
21422 -30413 -23397 11128 3597 -52231 -66540 -16619 23691 20987 18981 45062 40809 -9 19076
21409 19076 -23982 -64161 -17896 49208 84904 71392 27631 3996 -3590 -437 44103 -42071
21397 -42071 -109265 -132365 -111092 -76162 -21470 -37483 -80742 -101163 -48337 35044 40472 32133
21385 32133 86126 68460 20467 3584 17464 -7301 -38105 -32512 36211 19693 25007 13705
21373 13705 -17423 -13867 -3731 39701 68717 60495 16784 21043 49062 56827 40705 73408
21361 73408 96641 106357 74780 101512 78316 104250 122889 83957 93595 76352 93559 79171
$$ packed form
21446d8661N536J15667R1439k4591l7982n5069J739n2877q5799J2585j186J0955
21434f8244O0915J971J0348M4261L5350P41M184l1378m7511j8401p8597N5948
21422c0413P016L4525p531n5828j4309M9921M0310k704k006K6081m253m0818J9085
21409A9076m3058m0179M6265O7104L5696j3512m3761k3635p586L153M4540q6174
21397d2071o7194k3100K1273L4930N4692j6013m3259k0421N2826Q3381N428q339
21385C2133N3993j7666m7993j6883J3880k4765l0804N593O8723j6518N314j1302
21373A3705l1128L556J0136M3432K9016q222m3711M259K8019P765j6122L2703
21361G3408K3233R716l1577K6732k3196K5934J8639l8932R638j7243J7207j4388
$$ plain form
21349 79171 57206 86618 71749 40268 14851 41220 60688 74378 17955 47003 67308 7273
21337 7273 -91835 -44065 26038 273 -68993 -75048 -36222 18780 66637 131362 66545 86025
21325 86025 150026 145419 33851 -25248 30318 80571 29869 21770 -12432 -66762 -33831 15549
21313 15549 91365 85739 64733 9041 -51652 -44099 -59770 -102561 -120705 -50766 -83011 -137059
21301 -137059 -100520 -12468 29669 50676 29250 -16456 -116627 -45025 -5350 -18227 22664
21290 22664 49427 24348 54971 35648 -13646 -25808 15938 -14752 -37013 -34555 -14266 14375
21278 14375 65196 91121 56115 27814 997 -56737 -118858 -90724 -6981 9562 -16354 -59999
21266 -59999 -53417 -16091 13940 52408 20853 22663 39011 44331 56453 118414 76888 71441
$$ packed form
21349G9171k1965K9412j4869l1481k5417K6369J9468J3690n6423K9048K0305o0035
21337G273r9108M7770P0103k5765o9266o055L8826N5002M7857O4725o4817J9480
21325H6025O4001m607j11568n9099N5566N0253n0702q099l4202n4330L2931M9380
21313A5549P5816n626k1006n5692o0693P553j5671m2791j8144O9939l2245n4048
21301a37059L6539Q8052M2137K1007k1426m5706j00171P1602L9675j2877M0891
21290B2664K6763k5079L0623j9323m9294j2162M1746l0690k2261K458K0289K8641
21278A4375N0821K5925l5006k8301k6817n7734o2121K8134Q3743J6543k5916m3645
21266e9999O582L7326L0031L8468l1555J810J6348N320J2122O1961m1526n447
$$ plain form
21254 71441 82671 2188 -33460 -57158 -28809 -19909 451 -77479 -112015 -67630 -26510 -38467
21242 -38467 -81398 -87261 -45154 -71371 -11457 -19980 5836 88609 56602 3097 3646 18147
21230 18147 29380 35809 15623 55782 -32012 -118912 -128001 -131567 -125613 -139390 -128992 -86256
21218 -86256 -14252 -12955 -59192 -44469 -12543 -6476 -32985 -58669 -84095 -124280 -58881 -17881
21206 -17881 26816 56944 31892 60181 55053 11033 992 -9728 -11754 6940 51988 31770
21194 31770 20920 -12626 -27038 -47452 -54001 -66144 -26611 -10911 2584 -155 -30159 -60381
21182 -60381 -131181 -211275 -180255 -152685 -144725 -103881 -117092 -62592 2270 67243 72349 60621
21170 60621 80926 37515 31767 -674 -12895 26021 51443 39869 37785 129480 159157 153220
$$ packed form
21254G1441J1230q0483l5648k3698K8349Q900K0360p7930l4536M4385M1120j1957
21242c8467m2931n863M2107k6217N9914q523K5816Q2773l2007n3505N49J4501
21230A8147J1233O429k0186M0159q7794q6900r089l566N954j3777J0398M2736
21218h6256P2004J297m6237J4723L1926O067k6509k5684k5426m0185O5399M1000
21206a7881M4697L0128k5052K8289n128m4020j0041j0720k026J8694M5048k0218
21194C1770j0850l3546j4412k0414o549j2143L9533J5700J3495k739l0004l0222
21182f0381p0800q0094L1020K7570P960M0844j3211N4500O4862O4973N106j1728
21170F0621K0305m3411n748l2441j2221L8916K5422j1574k084R1695K9677n937
$$ plain form
21158 153220 95794 43404 66940 52413 39612 -4339 -67346 -99667 -28959 -58914 -77658
21147 -77658 -66145 -111927 -151102 -64649 -20649 16777 1617 -42131 -45100 -5042 33338 7274
21135 7274 -1845 -23649 -10365 -2107 -40033 11820 -5582 -1771 5755 44287 40747 13010 -10329
21122 -10329 33813 81441 23642 -34914 -6414 -6232 24137 -2570 26245 53682 57415 88623
21110 88623 66714 50879 62072 93722 86927 27475 9938 -7997 14015 -20767 -54188 -1092
21098 -1092 -43038 -67999 -84974 -50112 -21139 1275 -46379 -83857 -63135 -50194 -31580 17826
21086 17826 35850 -33596 -86285 -133021 -67120 -14295 -60084 -98884 -123168 -98260 -57696 1547
21074 1547 -56955 -127370 -114911 -66285 29196 64208 18692 55952 135189 98276 6218 -62794
$$ packed form
21158A53220n7426n2390K3536j4527j2801m3951o3007l2321P0708k9955j8744
21147g7658J1513m5782l9175Q6453M4000L7426j5160m3748k969M0058L8380k6064
21135G274r119k1804J3284Q258l7926N1853j7402L811P526L8532l540k7737k3339
21122a0329M4142M7628n7799n8556K8500J82L0369k6707K8815K7437L733L1208
21110H8623k1909j5835J1193L1650o795n9452j7537j7935K2012l4782l3421N3096
21098a092m1946k4961j6975L4862K8973K2414m7654l7478K0722J2941J8614M9406
21086A7826J8024o9446n2689m6736O5901N2825m5789l8800k4284K4908M0564N9243
21074A547n8502p0415J2459M8626R5481L5012m5516L7260P9237l6913r2058o9012
$$ plain form
21062 -62794 -98745 -79080 -22944 -24479 -54744 -71365 -41581 -28638 -46976 -63652 -31608 -29535
21050 -29535 -16086 27761 85772 -49155 -97713 -16868 32784 -10140 -22579 -20894 -51400 -10149
21038 -10149 32481 51680 -13630 -79458 -110563 -160578 -155230 -124847 -52512 2972 6771 11357
21026 11357 31614 67320 90878 69552 65541 36741 7953 10406 21175 34974 43367 40499
21014 40499 56481 45990 -22372 -71982 -56416 -2585 60430 45869 2708 9820 44346 53366
21002 53366 65875 11285 -42904 -42666 -17254 -18193 -62275 -21664 36523 27332 -1212 19356 79361
20989 79361 103716 103203 135692 97135 -10626 -87103 -95315 -10694 78861 42276 75328 88611
20977 88611 49949 8829 -35270 -76160 -104647 -128929 -135350 -51220 37497 28429 -67067 -93413
$$ packed form
21062f2794l5951J9665N6136j535l0265j6621K9784J2943j8338j6676L2044K073
21050b9535J3449M3847N8011j34927m8558Q0845M9652m2924j2439J685l0506M1251
21038a0149M2630J9199o5310o5828l1105n0015N348L0383P2335N5484L799M586
21026A1357K0257L5706K3558k1326m011k8800k8788K453J0769J3799Q393k868
21014D0499J5982j0491o8362m9610J5566N3831O3015j4561m3161P112L4526R020
21002E3366J2509n4590n4189K38K5412r39m4082M0611N8187r191k8544K0568O0005
20989G9361K4355n13L2489l8557j07761p6477q212Q4621Q9555l6585L3052J3283
20977H8611l8662m1120m4099m0890k8487k4282o421Q4130Q8717r068r5496k6346
$$ plain form
20965 -93413 -81191 -19232 -14792 9649 6052 -14816 -53142 -18217 74327 119882 25396 40657
20953 40657 43843 69530 62528 -9466 13479 11734 -44326 25129 38800 48992 98557 139676
20941 139676 168377 125063 25268 -15497 74151 63556 -36813 -79541 -61142 -19250 -3923
20930 -3923 22691 31529 -26167 -48434 -48380 -48144 -83655 -104833 -102361 -99909 -102034 -113518 -110169 -90272
20916 -90272 -67763 -65742 -28749 15856 62571 25812 -5222 -8123 23830 26116 45457 10907
20904 10907 -25297 -25271 51599 121329 132394 12303 785 6056 -5966 -29896 -21993 10816
20892 10816 14246 -59282 -42325 -12130 -33049 -68239 -21723 -27005 -54075 -59378 -33840 -34877
20880 -34877 -62428 -72812 -18494 -24342 -74258 -59473 20905 15352 -5445 -17559 -46666 3968
$$ packed form
20965i3413J2222O1959M440K4441l597k0868l8326L4925R2544M5555r4486J5261
20953D0657L186K5687p002p1994K2945j745n6060O9455J3671J0192M9565M1119
20941A39676K8701m3314r9795m0765Q9648j0595j00369m2728J8399M1892J5327
20930c923K6614Q838n7696k2267N4K36l5511k1178K472K452k125j1484L349J9897
20916i0272K2509K021L6993M4605M6715l6759l1034k901L1953K286J9341l4550
20904A0907l6204K6P6870O9730J1065j20091j1518N271j2022k3930P903L2809
20892A0816L430p3528J6957L0195k0919l5190M6516n282k7070n303K5538j037
20880c4877k7551j0384N4318n848m9916J4785Q0378n553k0797j2114k9107N0634
$$ plain form
20868 3968 57100 52900 42833 29067 -15100 -161073 -191393 -154118 -41813 -59631 -99898 -66806
20856 -66806 12791 23225 -42322 -25523 2570 43 -9028 -7935 -5841 -25595 38957 143685
20844 143685 179284 123055 60351 33018 -72411 -162119 -153498 -145353 -81270 -24151 -23077 24337
20832 24337 -2083 -8664 -28137 -17751 -11721 55028 83093 7989 32766 28083 -28198 -1711
20820 -1711 22436 64661 20335 -21216 2909 22999 7754 -62099 -49700 -65360 -65832 -78952
20808 -78952 -41361 6754 -30054 -76575 -124142 -160964 -144418 -55996 -6994 54714 98993 34299
20796 34299 -31011 -319 32319 22436 53804 82378 56826 1091 165 -29008 -76423 -70507
20784 -70507 -65123 12969 39857 5496 -23415 -13952 -10918 30811 34490 14196 37618 -15357
$$ packed form
20868C968N3132m200j0067j3766m4167j45973l0320L7275J12305j7818m0267L3092
20856f6806P9597J0434o5547J6799K8093k527r071J093K094j9754O4552J04728
20844A43685L5599n6229o2704k7333j05429q9708Q621Q145O4083N7119J074M7414
20832B4337k6420o581j9473J0386O030O6749K8065p5104K4777m683n6281K6487
20820a711K4147M2225m4326m1551K4125K0090j5245o9853J2399j5660m72j3120
20808g8952L7591M8115l6808m6521m7567l6822J6546Q8422M9002O1708M4279o4694
20796C4299o5310L0692L2638r883L1368K8574k5552n5735r26k9173m7415N916
20784g0507N384P8092K6888l4361k8911R463L034M1729L679k0294K3422n2975
$$ plain form
20772 -15357 -58047 -29814 -12723 48109 88077 86339 28048 2071 -56250 -109278 -110175 -62730
20760 -62730 -15161 -45427 -119204 -141306 -111216 -66212 -21047 -11604 -15651 -36100 -100818 -148150
20748 -148150 -121772 -96546 -115562 -141255 -108992 -81771 -91025 -63033 -26171 19201 -10612 9792
20736 9792 -37678 -141471 -175724 -186616 -153082 -121984 -150241 -189042 -162577 -113634 -76825 -89072
20724 -89072 -118075 -48509 -80058 -43565 -11399 2285 -56527 -57400 -96501 -152720 -105172 -31481
20712 -31481 -2090 -6215 -33642 -22509 -8996 73146 76812 13331 18546 63761 21954 30231
20700 30231 93042 16286 -42898 -63960 -82263 -53493 19139 50608 43835 48673 47730 46394 -57249
20687 -57249 -32777 -9783 -49155 -26844 -21092 -106373 -86987 -15578 81585 25741 -40729 -56280
$$ packed form
20772a5357m2690K8233J7091O0832L9968j738n8291k5977n8321n3028q97M7445
20760f2730M7569l0266p3777k2102L0090M5004M5165R443m047k0449o4718m7332
20748a48150K6378K5226j9016k5693L2263K7221r254K7992L6862M5372k9813K0404
20736I792m7470j03793l4253j0892L3534L1098k8257l8801K6465M8943L6809j2247
20724h9072k9003O9566l1549L6493L2166J3684n8812q73l9101n6219M7548P3691
20712c1481K9391m125k7427J1133J3513Q2142L666o3481N215M5215m1807Q277
20700C0231O2811p6756n9184k1062j8303K8770P2632L1469o773M838r43j336j03643
20687e7249K4472K2994l9372K2311N752q5281J9386P1409R7163n5844o6470j5551
$$ plain form
20675 -56280 -52955 -66585 -38758 -65574 -15045 23750 30064 -16256 487 -12046 -4967 16373
20663 16373 34142 11719 -46797 -29463 68922 -1633 -39885 -24351 -779 -52168 -28401 14083
20651 14083 21047 41945 50335 16564 15292 -37873 -76543 -88583 -43386 -49260 -15394 -31417
20639 -31417 -27711 52065 125787 88459 53941 30312 6438 -2060 13670 -6672 -51084 -77359
20627 -77359 -43555 -60048 -78846 -65647 -72503 -124516 -122211 -90202 -21296 -19049 -107979 -120153
20615 -120153 -85594 -98096 -76781 -35303 42237 72151 66291 48720 -74550 -114476 -10785
20604 -10785 36915 -37700 -42443 -84840 -92936 -26674 35545 73251 -5445 -36953 -36181 46986
20592 46986 119182 87400 60727 39274 -695 15772 20769 45657 42827 -43329 -134652 -101399
$$ packed form
20675e6280L325j3630K7827k6816N0529L8795O314m6320J6743j2533P079K1340
20663A6373J7769k2423n8516J7334R8385p0555l8252J5534K3572n1389K3767M2484
20651A4083O964K0898Q390l3771j272n3165l8670j2040M5197n874L3866j6023
20639c1417L706P9776P3722l7328l4518k3629k3874q498J5730k0342m4412k6275
20627g7359L3804j6493j8798J3199o856n2013K305L2009O8906K247q8930j2174
20615a20153L4559j2502K1315M1478P7540K9914n860j7571j23270l9926J03691
20604a0785M7700p4615m743m2397q096O6262O2219L7706p8696l1508P72Q3167
20592D6986P2196l1782k6673k1453l9969J6467M997K4888k830q6156r1323L3253
$$ plain form
20580 -101399 -27775 34181 70243 88328 76174 38849 70755 141177 145672 109948 8512
20569 8512 -34916 931 -8353 -126514 -132822 -141460 -50135 -44501 -14081 11624 -2848 -69587
20557 -69587 -106604 -114158 -45732 -27359 27201 44251 534 -51488 -69925 -111054 -129200 -51464
20545 -51464 -50610 -49772 -105299 -77430 -76254 -79623 -83456 -124616 -93274 -45698 -21029 -5030 14787
20532 14787 68508 57742 -9626 -18368 -26327 -73191 -118737 -139083 -82609 -88906 -36975 -7430
20520 -7430 -31302 -74682 -138212 -79273 -47876 35893 8477 15552 -34250 -94592 -8113 -836
20508 -836 -56925 -164989 -180622 -188879 -193740 -153941 -70876 -9148 19310 38392 -43124 -64239
20496 -64239 28686 29648 9980 10968 -11405 -41319 -21349 -19669 -71331 -75847 -100723 -102243 -62307
$$ packed form
20580a01399P3624O1956L6062J8085j2154l7325L1906P0422M495l5724j01436
20569H512m3428L5847r284j18161o308q638R1325N634L0420K5705j4472o6739
20557f9587l7017p554O8426J8373N4560J7050m3717n2022j8437m1129j8146P7736
20545e1464Q54Q38n5527K7869J176l369l833m1160L1342M7576K4669J5999J9817
20532A4787N3721j0766o7368q742p959m6864m5546k0346N6474o297N1931K9545
20520g430k3872m3380o3530N8939L1397Q3769k7416P075m9802o0342Q6479P277
20508h36n6089j08064j5633q257m861L9799Q3065O1728K8458J9082q1516k1115
20496f4239R2925R62j9668R88k2373k9914J9970J680n1662m516k4876j520L9936
$$ plain form
20483 -62307 -38576 -32761 1358 32011 95775 37705 15904 -8306 -26519 6931 -19254 -34053
20471 -34053 -31674 -42401 -94111 -89329 -24294 9867 -50404 -82645 -23418 -13948 -31983 -14169
20459 -14169 -65908 -86413 -14687 39138 31445 28732 -6489 -26805 -7788 -13325 -36227 -48468
20447 -48468 48289 85103 -13303 -81996 -11738 43658 51546 44989 30788 16114 34519 -14819
20435 -14819 -20978 9855 60376 -2168 -17417 9913 -36956 -60187 -75772 -109012 -135297 -135226
20423 -135226 -100313 22204 63560 33621 37435 -9141 -47496 -54890 -98819 -164830 -201710 -155972
20411 -155972 -193582 -239267 -180333 -64879 -63216 -96933 -131190 -86065 -71330 -43398 18192
20400 18192 49606 7747 -25452 -20306 -52882 -58358 -33888 -30386 -65289 -76686 -42360 49066
$$ packed form
20483f2307K3731N815L4119L0653O3764n8070k1801k4210j8213L3450k6185j4799
20471c4053K379j0727n1710M782O5035L4161o0271l2241N9227R470j8035J7814
20459a4169n1739k0505P1726N3825p693k713l5221k0316J9017n537k2902j2241
20447d8468R6757L6814r8406o8693P0258N5396P888o557j4201j4674J8405m9338
20435a4819o159L0833N0521o2544j5249K7330m6869k3231j5585l3240k6285P1
20423a35226L4913J22517M1356k9939L814m6576l8355p394m3929o6011l6880M5738
20411a55972l7610m5685N8934J15454J663l3717l4257M5125J4735K7932O1590
20400A8192L1414m1859l3199N146l2576n476K4470L502l4903j1397L4326R1426
$$ plain form
20388 49066 9495 12302 -11355 -59181 -99771 -131320 -89728 -33831 -56819 -59266 -67650 -13435
20376 -13435 13933 -58234 -69426 -6103 -14688 -38386 -21278 20663 27799 -1967 -81860 -98446
20364 -98446 -52259 -87631 -38922 -12477 32610 51920 67846 90965 71235 16306 32573 58179
20352 58179 11147 -29072 -35113 23621 70519 26416 -145 9785 102515 119845 17531 -67169
20340 -67169 -52203 27600 74503 78303 19494 -32172 -83229 -73112 -13884 4797 -73330 -85588
20328 -85588 -59364 -54771 -7561 39887 -9870 -39651 -42589 -48844 41736 79209 74282 -55809
20316 -55809 -85961 -25963 -18774 -66773 -78017 -76159 -63322 -97457 -15074 60011 107350 80709
20304 80709 26813 8202 18509 28647 -164 -48407 -72339 -25929 -13673 9780 29063 62030
$$ packed form
20388D9066l9571K807k3657m7826m0590l1549M1592N5897k2988k447q384N4215
20376a3435K7368p2167j1192O3323q585k3698J7108M1941P136k9766p9893j6586
20364i8446M6187l5372M8709K6445M5087J9310J5926K3119j9730n4929J6267K5606
20352E8179m7032m0219o041N8734M6898m4103k6561R930R2730J7330j02314q4700
20340f7169J4966P9803M6903L800n8809n1666n1057J0117N9228J8681p8127j2258
20328h5588K6224M593M7210M7448m9757k9781k938o255R0580L7473m927j30091
20316e5809l0152N9998P189m7999j1244J858J2837l4135Q2383P5085M7339k6641
20304H0709n3896j8611J0307J0138k8811m8243k3932M6410J2256K3453J9283L2967
$$ plain form
20292 62030 -19702 -51186 -47784 -20178 -5794 -27317 544 64449 45165 -47439 -14249 -18951
20280 -18951 -34947 32725 69273 56083 4773 -38018 14332 52609 24274 -54699 -133596 -116994
20268 -116994 -103534 -89807 -87699 -79758 -23293 66090 75678 36644 22218 -3632 -69321 -102454
20256 -102454 -85713 -48989 -30218 -6634 29786 13954 -25775 4837 92475 36800 50369
20245 50369 68471 20909 -10366 39253 57868 44462 17804 -49907 -34274 -10864 -75707 -75896
20233 -75896 -8544 48578 -10217 -28060 9097 34735 40960 36188 -3754 -14169 -71378 -89974
20221 -89974 -90203 -80970 -2680 58212 107040 29079 -10573 6996 6159 -49196 -49884 -101414 -91558
20208 -91558 -89748 -63537 26572 -19129 -18950 -43851 -47052 -64330 -110472 -151893 -155688 -150304 -117514
$$ packed form
20292F2030q1732l1484L402K7606J4384k1523K7861O3905j9284r2604L3190m702
20280a8951j5996O7672L6548j3190n1310m2791N2350L8277k8335p8973p8897J6602
20268a16994J3460J3727K108P941N6465Q9383R588l9034j4426k5850o5689l3133
20256a02454J6741L6724J8771K3584L6420j5832l9729L0612Q7638n5675J3569
20245E0369J8102m7562l1275M9619J8615j3406k6658o7711J5633K3410o4843j89
20233g5896O7352N7122n8795j7843L7157K5638O225m772l9942j0415n7209j8596
20221h9974k29R233P8290O0892M8828p7961l9652J7569q37n5355o88n1530R856
20208i1558J810K6211R0109m5701J79k4901l201j7278m6142m1421l795N384L2790
$$ plain form
20195 -117514 -94490 -50268 -12268 -50148 -93030 -34127 -25497 -31954 -918 -11217 2076 -5701
20183 -5701 1712 4079 28994 -29088 8634 19207 28914 -241 -50144 -77947 -33124 -18844
20171 -18844 -15411 -50019 -81593 -56051 -74168 -57681 23589 -7375 -92996 -102159 -65449 -71030
20159 -71030 -87851 -93257 -84292 -42273 -22630 22243 -60559 -34928 49223 138785 148312 128239
20147 128239 1422 -71085 -44813 2788 63179 114263 85500 12323 -2980 -10551 -42824
20136 -42824 -119737 -122175 -83029 -39402 -11663 -7802 -32677 -19514 11044 -25937 -9750 -9506
20124 -9506 -43924 -64008 -89586 -94580 -83958 -53702 22222 54040 75116 100524 65268 41327
20112 41327 21648 -20157 -18035 23238 21001 -98717 -139319 -141149 -54432 10874 -59808 -116496
$$ packed form
20195a17514K3024M4222L8000l7880m2882N8903Q630o457L1036j0299J3293p777
20183e701P413K367K4915n8082L7722J0573R707k9155m9903k7803M4823J4280
20171a8844L433l4608l1574K5542j8117J6487Q1270l0964q5621r163L6710n581
20159g1030j6821n406Q965M2019J9643M4873q2802K5631Q4151Q9562R527k0073
20147A28239j26817p2507K6272M7601O0391N1084k8763p3177j5303p571l2273
20136d2824p6913k438L9146M3627K7739L861k4875J3163L0558l6981J6187K44
20124i506l4418k0084k5578m994J0622L0256P5924L1818K1076K5408l5256k3941
20112D1327j9679m1805K122M1273k237j19718m0602j830Q6717O5306p0682n6688
$$ plain form
20100 -116496 -119271 -87763 -62846 -79078 -97249 -87766 -51424 -84790 -48198 -7048 15861 21079
20088 21079 -45322 -86429 -6046 8997 -24228 -54406 -116226 19448 117649 130076 26266
20077 26266 -68051 -135050 -119977 -124194 -99778 -122067 -116550 -181674 -169142 -122824 -113266 -128428
20065 -128428 -97659 -88412 -36857 -25529 -46439 -12864 -9640 -84876 -98439 -75078 -58458 -25445
20053 -25445 24937 48717 -7825 -28606 -33309 -72339 -57132 -66384 -44804 -42401 -42754 -36520 -92364
20040 -92364 -127972 -66400 4565 -36794 12863 108754 109990 51847 45470 48944 5104 -49470
20028 -49470 -43117 -27602 17394 69707 28940 -19704 -110502 -51452 29249 49116 93266 143541
20016 143541 152676 100745 108195 85370 -15379 -52278 -61369 -57191 -122279 -136763 -106329 -71355
$$ packed form
20100a16496k775L1508K4917j6232j8171R483L6342l3366L6592M1150K2909N218
20088B1079o6401m1107Q0383J5043l3225l0178o1820J35674R8201J2427j03810
20077B6266r4317o6999J5073m217K4416k2289N517o5124J2532M6318R558j5162
20065a28428L0769R247N1555J1328k0910L3575L224p5236j3563K3361J6620L3013
20053b5445N0382K3780n6542k0781m703l9030J5207r252K1580K403l53O234n5844
20040i2364l5608O1572P0965m1359M9657R5891J236n8143o377L474m3840n4574
20028d9470O353J5515M4996N2313m0767m8644r0798N9050Q0701J9867M4150N0275
20016A43541R135n1931P450k2825j00749l6899r091M178o5088j4484L0434L4974
$$ plain form
20004 -71355 -58971 -41993 -86411 -96489 -105463 -20894 43566 59846 13566 -29745 -35678 -41098
19992 -41098 -52394 -58301 -63159 -133378 -163101 -140711 -121744 -82029 -53694 -40809 -39567 -71063
19980 -71063 -50062 -52413 -69321 -125824 -153945 -151442 -78860 -90914 -94634 -25261 -36190 -49298
19968 -49298 12760 36162 -16954 -74574 -3187 -56981 -76258 -26054 -38954 21403 13177 -28129
19956 -28129 -86022 -91097 -60562 -41596 -78351 -78938 -68755 -96736 -99126 -109325 -110181 -106432 -30480
19943 -30480 -50571 -103159 -143121 -98472 -67973 -18559 22208 -21699 -24793 -53790 -110405 -41474
19931 -41474 -7813 -36421 -14691 -8268 -29941 -34984 38719 71011 53670 42687 42919 -22569
19919 -22569 -12608 24537 -37779 -105823 -31051 -57817 -47865 -28765 -26680 -48278 -61610 16011
$$ packed form
20004g1355J2384J6978m4418j0078q974Q4569O4460J6280m6280m3311n933n420
19992d1098j1296n907m858p0219k9723K2390J8967L9715K8335J2885J242l1496
19980g1063K1001k351j6908n6503k8121K503P2582j2054l720O9373j0929j3108
19968d9298O2058K3402n3116n7620P1387n3794j9277N0204j2900O0357q226m1306
19956b8129n7893n075L0535J8966l6755n87J0183k7981k390j0199q56L749P5952
19943c0480k0091n2588l9962M4649L0499M9414M0767m3907l094k8997n6615O8931
19931d1474L3661k8608K1730O423k1673n043P3703L2292j7341j0983K32o5488
19919b2569R961L7145o2316o8044P4772k6766R952J9100K085k1598j3332P7621
$$ plain form
19907 16011 66971 52985 -9033 -554 -35264 -41071 -44421 -49170 10771 102510 52210 -8987
19895 -8987 -15187 -9202 -22112 -95942 -123458 -100886 -113281 -128774 -83738 -52049 -3472 67665
19883 67665 151518 158148 108731 -19652 -65653 -36286 63168 94027 48904 -295 -44916 -71478
19871 -71478 -44417 -18186 -37326 -48356 -11519 -9597 -91246 -79398 -41998 19900 66251 101965
19859 101965 125901 129541 101158 64659 22957 -129 102168 63900 14525 15932 8506 8134
19847 8134 -5663 -24771 -2203 102196 57415 -33368 -40773 -74940 -124790 -71380 38695 59621
19835 59621 16194 13044 20125 50283 108544 124509 90248 95935 37682 41293 97207 57651
19823 57651 -26464 -62444 -2248 -50412 -59063 -10959 15088 74324 80557 33033 -18387 -87361
$$ packed form
19907A6011N0960j3986o2018Q479l4710n807l350m749N9941R1739n0300o1197
19895h987o200N985j2910p3830k7516K2572j2395j5493M5036L1689M8577P1137
19883F7665Q3853O630m9417j28383m6001K9367R9454L0859m5123m9199m4621k6562
19871g1478K7061K6231j9140j1030L6837J922q1649J1848L7400O1898M6351L5714
19859A01965K3936L640k8383l6499m1702k3086J02297l8268m9375J407p426l72
19847H134j3797j9108K2568J04399m4781r0783p405l4167m9850N3410J10075K0926
19835E9621m3427l150P081L0158N8261J5965l4261N687n8253L611N5914l9556
19823E7651q4115l5980O0196m8164q651M8104K6047N9236O233m7524n1420o8974
$$ plain form
19811 -87361 -123994 -139971 -149579 -91999 -4398 -4435 -37728 -62189 -115178 -104272 -96667 -64979 -41546
19798 -41546 5115 -6555 -67685 -74667 -1856 -12737 -33388 2959 1775 -17845 -48064 -16830
19786 -16830 24108 13942 22124 85890 98389 72206 93590 142305 148000 94206 78260 8172
19774 8172 16138 -7901 -52711 -73436 -113240 -51479 -31600 -60056 -89960 -104127 -85289 -60918
19762 -60918 -15165 37259 19624 -13725 40598 69095 57442 94207 110077 64398 -12440 -36635
19750 -36635 -28176 -71022 -78863 -67507 -51460 -12770 8950 -51054 -62930 -62704 -43456 -28511
19738 -28511 -62393 -39442 35545 -532 -23421 -28086 -78600 -77647 -53352 -31948 -16496 -18215
19726 -18215 -49442 -103629 -69437 -70505 -89199 -39693 -53856 -88866 -100611 -61778 4290 9189
$$ packed form
19811h7361l6633j5977r608N7580Q7601l7l3293k4461n2989J0906P605L1688K3433
19798d1546M6661j1670o1130o982P2811j0881k0651L6347j184j9620l0219L1234
19786a6830M0938j0166Q182O3766J2499k6183K1384M8715N695n3794j5946p0088
19774H172P966k4039m4810k0725l9804O1761J9879k8456k9904j4167J8838K4371
19762f0918M5753N2424j7635l3349N4323K8497j1653L6765J5870m5679p6838k4195
19750c6635Q459m2846p841J1356J6047L8690K1720o0004j1876K26J9248J4945
19738b8511l3882K2951P4987l6077k2889m665n0514R53K4295K1404J5452j719
19726a8215l1227n4187L4192j068j8694M9506j4163l5010j1745L8833O6068M899
$$ plain form
19714 9189 -81921 -128680 -86174 -34555 -80802 -111174 -112573 -66181 -57189 -23968 -32253 15908
19702 15908 79175 49092 1830 -31556 -52977 -34429 16303 -38373 -10367 4495 -18894 16769
19690 16769 43636 -2658 -19604 -72125 -74476 -86147 -76290 -97156 -84596 -110072 -89371 -69623
19678 -69623 -95101 -143919 -183619 -128920 -71701 -48593 -33113 -39088 -105431 -96168 -65024 -39785
19666 -39785 -116254 -135738 -53269 1595 -6941 -32416 613 47314 -6302 17564 72870 40619
19654 40619 5863 -6791 -37325 -94797 -87183 -3638 12729 38098 15630 -10216 31179 22147
19642 22147 90897 95786 91414 41351 3841 -13281 35887 35068 37552 18021 -21126 -24289 -90478
19629 -90478 -92953 -61280 -26410 48641 23612 -52751 -123021 -71794 -46321 -60438 -156815 -169889
$$ packed form
19714I189r1110m6759M2506N1619m6247l0372j399M6392Q992L3221q285M8161
19702A5908O3267l0083m7262l3386k1421J8548N0732n4676K8006J4862k3389L5663
19690A6769K6867m6294j6946n2521k351j1671R857k0866J2560k5476K0701J9748
19678f9623k5478m8818l9700N4699N7219K3108J5480n975o6343R263L1144K5239
19666c9785p6469j9484Q2469N4864q536k5475L3029M6701n3616K3866N5306l2251
19654D0619l4756j2654l0534n7472P614Q3545J6367K5369k2468k5846M1395r032
19642B2147O8750M889m372n0063l7510j7122M9168q19K484j9531l9147l163o6189
19629i0478k475L1673L4870P5051k5029p6363p0270N1227K5473j4117r6377j3074
$$ plain form
19617 -169889 -166661 -150182 -143875 -124031 -46632 7181 54187 41073 7265 22716 20118 27511
19605 27511 47210 -5811 -29851 2518 27480 57071 62701 13630 40327 91809 135248 142911
19593 142911 30918 -10514 -43579 -50163 -72990 -123455 -160878 -117225 -35159 -54088 -34360
19582 -34360 -29166 34524 69618 10877 -13542 3287 32356 21605 -1131 -49928 -84432 -65948
19570 -65948 -62857 -34584 14831 91880 107432 29977 -50621 -39906 -15526 -15005 24037 42317
19558 42317 -21496 -49507 -51129 -115049 -115372 -85009 -46434 -14140 -41997 -83862 -43244 -191
19546 -191 -5565 -66597 -62543 -13927 36986 10628 -45995 -33728 -81692 -122768 -111662 -116490 -95424
19533 -95424 14797 -8550 -84212 -168471 -135103 -36782 -46453 -27180 29151 99359 48721 -51457
$$ packed form
19617a69889L228J6479O307J9844P7399N3813M7006j3114l3808J5451k598P393
19605B7511J9699n3021k4040L2369K4962K9591N630m9071K6697N1482M3439P663
19593A42911j11993m1432l3065o584k2827n0465l7423M3653Q2066j8929J9728
19582c4360N194O3690L5094n8741k4419J6829K9069j0751k2736m8797l4504J8484
19570f5948L091K8273M9415P7049J5552p7455q0598J0715K4380N21L9042J8280
19558D2317o3813k8011j622o3920l23L0363L8575L2294k7857m1865M0618M3053
19546a91n374o1032M054M8616N0913k6358n6623J2267m7964m1076J1106m828K1066
19533i5424J10221k3347p5662q4259L3368R8321r671J9273N6331P0208n0638j00178
$$ plain form
19521 -51457 -53056 -69872 -47175 -35410 31834 -23464 24989 4824 -75646 -70969 -50583 -23855
19509 -23855 -102941 -104669 -58863 -84673 -109594 -136545 -58424 -84095 -112974 -105695 -87221 -81546
19497 -81546 -94103 -58351 -40428 -49607 658 -36388 -24640 -14289 23723 459 26633 45043
19485 45043 78606 4901 -82951 -65721 -65768 -62520 25577 75120 33001 -9166 17035 30870
19473 30870 51680 -13442 -52714 -60389 -27121 -12758 71192 41285 29788 -11459 21266 -69407
19461 -69407 -53218 -10646 22523 9048 -43167 -8123 -4805 -15933 -51683 -60989 -62657 -11251
19449 -11251 -9974 -16873 6144 -41071 -110699 -128983 -86514 -25474 21469 35049 -8479 -51002
19437 -51002 -78023 -93795 -106967 -162533 -116252 -27312 -4229 -38482 -8369 -23307 -59813 -66646
$$ packed form
19521e1457j599j6816K2697J1765O7244n5298M8453k0165q0470M677K0386K6728
19509b3855p9086j728M5806k5810k4921k6951P8121k5671k8879P279J8474N675
19497h1546j2557L5752J7923r179N0265l7046J1748J0351L8012k3264K6174J8410
19485D5043L3563p3705q7852J7230m7L248Q8097M9543m2119m2167K6201J3835
19473C0870K0810o5122l9272p675L3268J4363Q3950k9907j1497m1247L2725r0673
19461f9407J6189M2572L3169j3475n2215L5044L318j1128l5750r306j668N1406
19449a1251J277o899K3017m7215o9628j8284M2469O1040M6943J3580m3528m2523
19437e1002k7021j5772j3172n5566M6281Q8940K3083l4253L0113j4938l6506o833
$$ plain form
19425 -66646 -61045 -30333 -18452 -63755 -102138 -124922 -73728 -63137 -74411 -32091 -13398 -44152
19413 -44152 -35991 -78979 -85874 -86446 -78240 -54507 -59544 -8932 18232 13739 16943 -1635 -42607
19400 -42607 -28394 -2164 6268 -9746 8381 33884 73833 93313 97448 -2514 -32300 -65061
19388 -65061 -25861 -51304 -67113 -12633 11922 42823 -22738 13049 47730 -16059 -35869 -27342
19376 -27342 -81814 -90631 -64577 16765 59498 43220 18138 -73531 -72182 -50834 -84795 -58891
19364 -58891 -42456 -65374 -1583 41416 73867 9579 -30266 18236 24123 26456 18182 58096
19352 58096 139292 120682 87051 76509 29819 -13022 27194 48143 -1194 10823 36490 28518
19340 28518 10192 70555 82964 84700 53158 4787 -50178 -73645 -79701 -58094 -55135 -13868
$$ packed form
19425f6646N601L0712J1881m5303l8383k2784N1194J0591j1274M2320J8693l0754
19413d4152Q161m2988o895n72Q206K3733n037N0612K7164m493L204j8578m0972
19400d2607J4213K6230Q432j6014J8127K5503L9949J9480M135r9962k9786l2761
19388f5061L9200k5443j5809N4480K4555L0901o5561L5787L4681o3789j9810Q527
19376b7342n4472q817K6054Q1342M2733j6278k5082r1669J349K1348l3961K5904
19364e8891J6435k2918O3791M2999L2451o4288l9845M8502N887K333q274L9914
19352E8096Q1196j8610l3631j0542m6690m2841M0216K0949m9337J2017K5667p972
19340B8518j8326O0363J2409J736l1542m8371n4965k3467o056K1607K959M1267
$$ plain form
19328 -13868 -57232 -67404 -35356 3019 -7435 -34756 17286 25141 -27650 -64607 -130254 -101775
19316 -101775 -127259 -97851 -71120 -65064 -39660 -1272 10940 -13369 32572 13615 -44490 -51041
19304 -51041 -46524 -98919 -73099 -32198 -11877 6045 3954 2948 17977 52900 47152 88945
19292 88945 108518 92077 -9719 -46384 -48131 -9030 -21756 -35884 -21146 -64099 -111337 -117354
19280 -117354 -60256 -10083 -37843 -15817 -60781 -77058 -100594 -154063 -237799 -179838 -69197
19269 -69197 13770 -4475 18809 66943 45764 -15469 -70484 -57489 -56049 -61663 -39999 27385
19257 27385 21693 -4254 -31135 17440 139004 140594 91024 24038 -36027 -30634 -21436 -16404
19245 -16404 -44676 -73833 -72450 -6173 43549 29660 4197 14137 70790 103734 71948 9082
$$ packed form
19328a3868m3364j0172L2048L8375j0454k7321N2042P855n2791l6957o5647K8479
19316a01775k5484K9408K6731O056K5404L8388J2212k4309M5941j8957n8105o551
19304e1041M517n2395K5820M0901K0321J7922k091j006J5029L4923n748M1793
19292H8945J9573j6441j01796l6665j747L9101j2726j4128J4738m2953m7238o017
19280a17354N7098N0173k7760K2026m4964j6277k3536n3469q3736N7961J10641
19269f9197Q2967j8245K3284M8134k1179o1233n5015J2995J440n614K1664O7384
19257B7385n692k5947k6881M8575J21564J590m9570o6986o0065N393R198N032
19245a6404k8272k9157J383O6277M9722j3889k5463R940N6653L2944l1786o2866
$$ plain form
19233 9082 23369 49921 75405 91471 104984 42241 -493 -43868 -37169 -16923 -39538 -152735
19221 -152735 -168858 -158392 -108358 -10093 4976 13396 -19865 -49482 -40937 -82540 -32410 -37538
19209 -37538 7322 43158 46908 11592 -3768 -603 16926 -31390 -86137 -72796 -45133 -36544
19197 -36544 -78826 -27631 5375 61121 10666 -50825 -49015 -51026 -113218 -76269 -16754 91351
19185 91351 123443 40877 -9354 99054 100146 14822 -22647 -54430 -26662 -57609 -71681 -22907
19173 -22907 68927 20153 -95346 -97378 -70946 -16999 39921 86108 50312 38710 23353 5550
19161 5550 47967 105540 103808 125010 94284 74296 -4434 -80324 -87298 -64233 -111611 -65213
19149 -65213 -43815 33219 53713 17475 -26619 -43809 -12258 24131 12559 43316 -9170 -136047
$$ packed form
19233I082J4287K6552K5484J6066J3513o2743m2734m3375O699K0246k2615j13197
19221a52735j6123J0466N0034R8265J5069Q420l3261k9617Q545m1603N0130n128
19209c7538M4860L5836L750l5316j5360L165J7529m8316n4747J3341K7663Q589
19197c6544m2282N1195L3006N5746n0455o1491J810k011o2192L6949N9515J08105
19185I1351L2092q2566n0231J08408J092q5324l7469l1783K7768l0947j4072M8774
19173b2907R1834m8774j15499k032K6432N3947N6920M6187l5796j1602j5357j7803
19161E550M2417N7573j732K1202l0726j9988p8730p5890o974K3065m7378M6398
19149f5213K1398P7034K0494l6238m4094j7190L1551L6389j1572L0757n2486j26877
$$ plain form
19137 -136047 -114488 -85146 -37326 47207 121128 130966 84204 45519 30429 74475 28843 -16776
19125 -16776 -67165 -20915 -26178 -40545 -25211 17935 -10662 -37883 -76069 -50071 -8287 30215
19113 30215 30401 -15268 -24669 -48096 -135476 -196208 -147946 -49182 -17006 -11654 32454 17912
19101 17912 19086 27206 9266 42951 68529 61898 67615 52762 38651 -23829 -57985 -47131
19089 -47131 -49332 -36121 -18960 -28220 -58056 -104581 -127982 -157826 -157312 -69545 -37847 -48916
19077 -48916 -19352 -31273 -8440 64756 44041 964 -41422 -27926 -21066 -56719 -60889 -524
19065 -524 45792 109311 63207 6376 -19221 -91033 -135767 -169566 -138743 -48415 -38879 -69921
19053 -69921 -89155 -80893 -40744 35610 101702 25210 -15432 7440 46937 82124 29417 -13717
$$ packed form
19137a36047K1559K9342M7820Q4533P3921R838m6762l8685j5090M4046m5632m5619
19125a6776n0389M6250n263j4367J5334M3146k8597k7221l8186K5998M1784L8502
19113C0215J86m5669r401k3427q7380o0732M8262R8764L2176N352M4108j4542
19101A7912J174Q120j7940L3685K5578o631N717j4853j4111o2480l4156J0854
19089d7131k201J3211J7161r260k9836m6525k3401k9844N14Q7767L1698j1069
19077d8916K9564j1921K2833P3196k0715m3077m2386J3496O860l5653m170O0365
19065e24M6316O3519m6104n6831k5597p1812m4734l3799L0823R0328R536l1042
19053f9921j9234Q262M0149P6354O6092p6492m0642K2872L9497L5187n2707m3134
$$ plain form
19041 -13717 -23323 -55366 -57486 -42152 -29913 -12906 -88901 -196466 -214391 -115537 -118234 -151182
19029 -151182 -89789 -7005 -16556 -10406 -38164 -27774 -23787 -18751 -15919 -85330 -136816 -177398
19017 -177398 -139619 -50857 -44339 109 -21665 -49870 -74396 -75304 -88239 -41399 -22932 -26300
19005 -26300 13501 61275 16827 16101 -40182 -63903 -73657 -12075 77931 130965 90099 76050
18993 76050 45044 77815 82898 42525 31952 21711 -13758 -11803 -8476 -3279 39233 68091
18981 68091 27747 4238 -44203 -47425 -33089 -14097 -8728 -42540 -47368 9935 37379 -34009
18969 -34009 -54626 -32828 -26094 -30067 -34547 -29063 -39380 -18775 6344 5474 77579 76337 46527
18956 46527 3443 4898 29309 99022 79344 97853 31718 -7439 45097 30136 -12852 -11643
$$ packed form
19041a3717r606l2043k120J5334J2239J7007p5995j07565j7925R8854k697l2948
19029a51182O1393Q2784r551O150k7758J0390L987N036K832o9411n1486m0582
19017a77398L7779Q8762O518M4448k1774k8205k4526r08j2935M6840J8467l368
19005b6300L9801M7774m4448p26n6283k3721r754O1582R0006N3034m0866j4049
18993G6050l1006L2771N083m0373j0573j0241l5469J955L327N197M2512K8858
18981F8091m0344k3509m8441l222J4336J8992N369l3812m828N7303K7444p1388
18969c4009k0617K1798O734l973m480N484j0317K0605K5119q70P2105j242k9810
18956D6527m3084J455K4411O9713j9678J8509o6135l9157N2536j4961m2988J209
$$ plain form
18944 -11643 3389 529 -35597 11866 -4266 3071 12655 46619 55756 61746 91347 125358 93957
18931 93957 15272 18291 30565 9063 -4630 41172 59717 -22477 -105034 -99511 -38038 70598
18919 70598 88025 50577 -18035 -42402 -5489 -38256 -33246 -47637 -25541 -35258 -55070 -90316
18907 -90316 -108492 -61106 -30037 -11923 -37328 -77516 -81313 -112734 -84716 -23101 12516 -60660
18895 -60660 -32558 -7518 42392 44114 8087 34756 27130 -23159 -77774 -48101 20943 -1756
18883 -1756 -25714 -8690 -71690 -90437 -58647 -54079 -99086 -35022 68216 54058 45599 -20132
18871 -20132 -91727 -47878 -22006 3814 112670 125777 126772 88775 68723 20325 -6948 -15962
18859 -15962 -28361 -56777 -162738 -204652 -109208 -45087 -16284 -61163 -11732 29611 61004
$$ packed form
18944a1643J5032k860l6126M7463j6132P337R584L3964R137N990K9601L4011l1401
18931I3957p8685L019J2274k1502j3693M5802J8545q2194q2557N523O1473J08636
18919G0598J7427l7448o8612k4367L6913l2767N010j4391K2096r717j9812l5246
18907i0316j8176M7386L1069J8114k5405m0188l797l1421K8018O1615L5617p3176
18895f0660K8102K5040M9910J722l6027K6669p626n0289n4615K9673O9044k2699
18883a756k3958J7024o3000j8747L1790M568m5007O4064J03238j4158q459o5731
18871b0132p1595M3849K5872K5820J08856J3107R95l7997k0052m8398k7273r014
18859a5962j2399k8416j05961m1914R5444O4121K8803m4879M9431M1343L1393
$$ plain form
18848 61004 77480 27879 -39632 -70875 -136221 -147080 -53753 -19726 -12493 -2087 -7303 18297
18836 18297 -52553 -99589 -66520 -46009 -72316 -54809 -7310 -43415 -119702 -92606 -124138 -81765
18824 -81765 -43861 21708 823 -56050 -62733 -43467 -16533 15878 5444 -30003 -17538 -32329
18812 -32329 -120590 -111413 -49839 20970 42228 81153 36178 -19329 20683 1162 -65982 -99902
18800 -99902 -64332 -4974 43 2764 470 25151 68857 70721 8755 -58126 -90036 -83729 -86438
18787 -86438 -81439 -74401 2187 40711 42886 51346 47709 84018 84536 70499 69947 31525 -41957
18774 -41957 -32013 2173 715 17512 79795 174559 231594 389010 556147 604484 521659 430010
18762 430010 281561 139876 61777 71571 67962 107945 45531 10408 15895 5284 -17968 25986
$$ packed form
18848F1004J6476m9601o7511l1243o5346j0859R3327L4027P233J0406n216K5600
18836A8297p0850m7036L3069K0511k6307J7507M7499l6105p6287K7096l1532M2373
18824h1765L7904O5569k0885n6873o683J9266K6934L2411j0434l5447J2465j4791
18812c2329q8261R177O1574P0809K1258L8925m4975n5507M0012j9521o7144l3920
18800i9902L5570N9358N017K721k294K4681M3706J864o1966o6881l1910O307k709
18787h6438M999P038P6588L8524K175Q460l637L6309N18j4037n52l8422p3482
18774d1957R944L4186j458J6797O2283R4764N7035J57416J67137M8337q2825r1649
18762D30010j48449j41685p8099R794l609L9983o2414l5123N487j0611k3252M3954
$$ plain form
18750 25986 16311 -16832 -20340 6990 -16088 -67896 -57239 52608 107099 83400 50409 -109161
18738 -109161 -214178 -157570 -121364 -77240 -15601 -56846 -24908 33013 60035 68287 30400
18727 30400 22771 8330 35017 45646 54676 57584 28942 61282 85043 60500 23626 -15872
18715 -15872 47216 130597 144588 119303 94281 34260 75925 87619 41043 46091 73355 82164
18703 82164 46307 -37613 -45169 -55043 -50172 -41751 23347 46609 107058 107097 52565 6185 62791
18690 62791 25744 48608 41941 72522 113289 47018 -19999 -54665 45481 88094 32362 21652
18678 21652 54120 50117 64459 83898 40588 25140 -9587 -31268 -53545 15652 61974 47032
18666 47032 61835 117829 112032 16113 -56171 -64680 33176 136747 156993 123443 66135 -18280
$$ packed form
18750B5986r675l3143l508K7330k3078n1808J0657J09847N4491k3699l2991j59570
18738a09161j05017N6608L6206M4124O1639m1245L1938N7921K7022Q252l7887
18727C0400p629j4441K6687J0629R030K908k8642L2340K3761k4543l6874l9498
18715a5872O3088Q3381J3991k5285k5022o0021M1665J1694m6576N048K7264Q809
18703H2164l5857q3920p556r874M871Q421O5098K3262O0449L9n4532m6380N6606
18690F2791l7047K2864o667L0581M0767o6271o7017l4666J00146M2613n5732j0710
18678B1652L2468m003J4342J9439m3310j5448l4727k1681k2277O9197M6322j4942
18666D7032J4803N5994n797r5919p2284q509R7856J03571K0246l3550n7308q4415
$$ plain form
18654 -18280 -46834 9574 84176 106213 70329 39989 43997 -57870 -57928 -70431 -61554 -12539
18642 -12539 -6910 -10927 -59632 -81849 -39521 -51446 -65443 -109967 3003 42774 -15862 11218
18630 11218 20133 -25093 -5026 2002 33176 11966 -38582 -7123 35400 71467 137597 112201
18618 112201 36862 -52040 -60820 -18098 31115 16914 41648 63753 78049 41658 78103 82550
18606 82550 6623 -9197 -4112 -19569 10976 -28849 -34468 18814 87212 91885 16469 18283
18594 18283 51401 -17730 -55796 -66946 -60784 -59371 -83111 -92428 -69242 -68729 -62439 4291 68918
18581 68918 14846 -64468 -84021 -52498 -48244 11368 92478 143936 120837 46504 -29737 -25915
18569 -25915 -58941 -73102 -48713 -15515 -16003 15113 59040 119585 159219 125450 66704 53463
$$ packed form
18654a8280k8554N6408P4602K2037l5884l0340M008j01867n8j2503Q877M9015
18642a2539N629m017m8705k2217M2328j1925j3997m4524J12970L9771n8636K7080
18630A1218Q915m5226K0067P028L1174k1210n0548L1459M2523L6067O6130k5396
18618A12201p5339q8902q780M2722M9213j4201K4734K2105J4296l6391L6445M447
18606H2550p5927j5820N085j5457L0545l9825n619N3282O8398M673p5416J814
18594A8283L3118o9131l8066j1150O162J413k3740r317K3186N13O290O6730O4627
18581F8918n4072p9314j9553L1523M254N9612Q1110N1458k3099p4333p6241L822
18569b5915l3026j4161K4389L3198m88L1116M3927O0545L9634l3769n8746j3241
$$ plain form
18557 53463 52164 72064 -27799 -64135 -56792 -35855 -57612 -79601 -50119 -64394 -27308 36232
18545 36232 56132 24011 9786 6670 -16526 -34023 -53434 -17968 3338 -19282 -32754 -43310
18533 -43310 -32174 -84433 -81553 -21515 41367 12362 -17997 -21563 -49968 -69595 -55781 -57949
18521 -57949 -39956 -7864 6108 -6369 -57051 -75280 -49085 5324 83693 124195 105471 86000
18509 86000 -3458 8160 23499 31447 26564 37470 6946 -59581 -49237 -40004 -29660 -40940
18497 -40940 -44727 -52963 -60453 -380 -46019 -141939 -136713 -148571 -93130 -45545 -23567 -39662
18485 -39662 -90562 -175929 -177133 -130702 -55832 -57354 -86294 -145702 -183730 -86005 -24586 -30770
18473 -30770 9105 18949 -66519 -94777 -12195 48679 -19983 -71536 -120035 -117799 -46479 46789
$$ packed form
18557E3463j299J9900r9863l6336P343K0937k1757k1989K9482j4275L7086O3540
18545C6232J9900l2121j4225l116k3196j7497j9411L5466K1306k2620j3472j0556
18533d3310J1136n2259K880O0038O2882k9005l0359l566k8405j9627J3814k168
18521e7949J7993L2092J3972j2477n0682j8229K6195N4409P8369M0502j8724j9471
18509H6000q9458J1618J5339P948m883J0906l0524o6527J0344R233J0344j1280
18497d0940l787q236p490O0073m5639r5920N226j1858N5441M7585K1978j6095
18485c9662n0900q5367j204M6431P4870j522k8940n9408l8028R7725O1419o184
18473c0770L9875R844q5468k8258Q2582O0874o8662n1553m8499K236P1320R3268
$$ plain form
18461 46789 65651 44786 67084 69514 -18383 -145638 -100609 -8745 -73624 -89790 -59755 11289
18449 11289 1002 -56810 -76674 -28546 -43059 -119671 -155589 -146884 -59008 -20901 -55588 -92032
18437 -92032 -100310 -15925 79775 93325 276 -40927 -41748 14290 -19479 -21614 -4372 33161
18425 33161 28777 24389 -2632 27051 97848 124633 89056 3219 -63780 -49528 10099 -1574
18413 -1574 -15208 -14699 -21915 -42554 -73069 -83317 -105380 -79295 -39891 -970 -20105 14725
18401 14725 20896 38369 47388 5977 -32909 -72002 -14461 -16871 -927 -11746 19088 44774
18389 44774 15609 5476 57535 114621 162007 159834 140206 113284 114291 51855 21414 31947
18377 31947 41185 75892 72517 58115 35287 31081 24348 -17374 10031 10474 -11166 34818 32862
$$ packed form
18461D6789J8862k0865K2298K430q7897j27255M5029R1864o4879j6166L0035P1044
18449A1289j0287n7812j9864M8128j4513p6612l5918Q705Q7876L8107l4687l6444
18437i2032q278Q4385R5700J3550r3049m1203q21N6038l3769k135J7242L7533
18425C3161m384m388k7021K9683P0797K6785l5577q5837o6999J4252N9627j1673
18413a574j3634N09p216k0639l0515j0248k2063K6085L9404L8921j9135L4830
18401A4725O171J7473R019m1411l8886l9093N7541k410J5944j0819L0834K5686
18389D4774k9165j0133N2059N7086M7386k173j9628k6922J007o2436l0441J0533
18377C1947R238L4707l375j4402k2828m206o733m1722K7405M43k1640M5984j956
$$ plain form
18364 32862 15943 -7985 -10790 734 30066 84851 70663 28063 8283 -15659 9042 56380
18352 56380 23517 -39702 -103381 -130530 -144449 -167044 -109453 -19744 12125 -17722 -80066 -101990
18340 -101990 -67701 -47343 -9789 -6563 -41407 4368 70998 67342 41470 38293 19445 24469
18328 24469 24559 34104 56771 31888 -28924 -32237 23587 23991 -16516 7579 53890 78697 76979
18315 76979 47141 21188 22661 37749 65804 87215 145152 114930 62119 -2300 12570 -47991
18303 -47991 -76195 -81380 -52170 -44529 4728 -30675 -62769 -58403 -28241 44413 -13947 -29652
18291 -29652 -21884 -54095 -82942 -65065 -24989 -2896 56426 141453 103951 40475 -10763 25449
18279 25449 -66825 -86716 -106862 -79440 -12255 -25699 -19322 -21459 -18037 34659 45738 -42209
$$ packed form
18364C2862j6919k3928k805J1524K9332N4785j4188m2600j9780k3942K4701M7338
18352E6380l2863o3219o3679k7149j3919k2595N7591Q9709L1869k9847o2344k1924
18340a01990L4289K0358L7554L226l4844M5775O6630l656k5872l177j8848N024
18328B4469R0R545K2667k4883o0812l313N5824M04m0507K4095M6311K4807j718
18315G6979k9838k5953J473J5088K8055K1411N7937l0222n2811o4419J4870o0561
18303d7991k8204n185K9210P641M9257l5403l2094M366L0162P2654n8360j5705
18291b9652P768l2211k8847J7877M0076K2093N9322Q5027l7502o3476n1238L6212
18279B5449r2274j9891k0146K7422O7185j3444O377k137L422N2696J1079q7947
$$ plain form
18267 -42209 -61190 -20396 -45475 -59900 -55851 -20976 26285 64925 13272 -13896 -24896 -8915
18255 -8915 -11379 -11349 7115 3133 -9199 -59150 -107287 -109506 -89366 -22128 41426 107884 99507
18242 99507 83290 186723 168999 103168 87723 192306 215548 177854 136774 141964 210368
18231 210368 204489 220974 255308 224355 175416 106328 100629 59670 35674 40272 65555 134525
18219 134525 138064 93565 81887 -9226 -63801 -94981 -82415 -63862 -111514 -88893 -63064 47666
18207 47666 105786 3028 -52668 56711 140159 143999 148055 80786 25659 -10380 -67536 -44880
18195 -44880 -41927 -59991 -37888 -7667 22613 18646 -21098 24274 54693 53110 75122 109765
18183 109765 78963 -23211 -64929 -57594 -8827 31662 40357 -4745 -9438 10036 39280 109782
$$ packed form
18267d2209j8981M0794k5079j4425M049L4875M7261L8640n1653k7168j1000J5981
18255h915k464L0J8464l982j2332m9951m8137k219K0140O7238O3554O6458q377
18242I9507j6217J03433j7724o5831j5445J04583K3242l7694m1080N190O8404
18231B10368n879J6485L4334l0953m8939o9088n699m0959k3996M598K5283O8970
18219A34525L539m4499j1678r1113n4575l1180J2566J8553m7652K2621K5829J10730
18207D7666N8120j02758n5696J09379Q3448L840M056o7269n5127l6039n7156K2656
18195d4880K953j8064K2103L0221L0280l967l9744M5372L0419j583K2012L4643
18183A09765l0802j02174m1718P335M8767M0489Q695m5102m693J9474K9244P0502
$$ plain form
18171 109782 205025 192053 170965 156739 169353 196574 172017 160278 158730 135217 152308 189344
18159 189344 130809 100475 101350 161899 218125 219132 255135 309575 312906 310818 314562 322761 342381
18146 342381 417629 440435 450070 385535 387458 420415 485686 515309 469673 507711 600274 656710
18134 656710 743700 784006 828333 934512 1058289 1166273 1311737 1509642 1783522 1948582
18124 1948582 2123693 2385220 2711459 3211797 3886502 4703764 5712270 6885651 8303470
18115 8303470 10106616 12519278 16172519 22328285 33170415 52551973 82764824 112311861
18107 112311861 121845515 113116975 90779368 61249034 38787218 25073798 17004114
18100 17004114 12083296 8943996 6890193 5442064 4321878 3521746 2953409 2612330
$$ packed form
18171A09782R5243j2972k1088j4226J2614K7221k4557j1739j548k3513J7091L7036
18159A89344n8535l0334Q75O0549N6226J007L6003N4440L331k088L744Q199J9620
18146C42381P5248K2806R635o4535J923L2957O5271K9623m5636L8038R2563N6436
18134F56710Q6990M0306M4327J06179J23777J07984J45464J97905K73880J65060
18124A948582J75111K61527L26239N00338O74705Q17262J008506J173381J417819
18115H303470J803146K412662L653241O155766J0842130J9381558L0212851K9547037
18107A12311861R533654q728540k2337607k9530334k2461816j3713420q069684
18100A7004114m920818l139300k053803j448129j120186q00132n68337l41079
$$ plain form
18092 2612330 2258254 1958402 1623843 1371459 1224835 1140539 1001217 933942 850226 802933
18082 802933 728666 630569 605959 623944 574879 478772 454075 472719 469834 458671 479123 462616
18070 462616 442741 355763 274386 300203 335553 324371 267615 267905 284346 315497 386551 405246
18058 405246 366832 282928 182725 155436 129985 138046 192988 213003 152242 114560 60164
18047 60164 69295 33755 12693 98285 132836 60912 46382 42918 32957 84635 133967 90506
18035 90506 22558 11900 94134 108678 147192 152296 133590 63806 -6905 -24261 25345 54847
18023 54847 25502 8673 13855 32317 65876 145098 124782 130303 150241 123098 127896 98562
18011 98562 126509 130942 106898 23914 -11491 -12846 39895 44189 67999 116818 53124 17690
$$ packed form
18092B612330l54076k99852l34559k52384j46624q4296j39322o7275q3716m7293
18082H02933p4267r8097k4610J7985m9065r6107k4697J8644k885j1163K0452j6507
18070D62616j9875q6978q1377K5817L5350j1182n6756K90J6441L1151P1054J8695
18058D05246l8414q3904j00203k7289k5451Q061N4942K0015o0761l7682n4396
18047F0164R131l5540k1062Q5592L4551p1924j4530l464r961N1678M9332m3461
18035I0506o7948j0658Q2234J4544L8514N104j8706o9784p0711j7356M9606K9502
18023E4847k9345j6829N182J8462L3559P9222k0316N521J9938k7143M798k9334
18011I8562K7947M433k4044q2984l5405j355N2741M294K3810M8819o3694l5434
$$ plain form
17999 17690 129730 195632 211957 187887 142267 104368 48671 35510 6914 -10654 -2592 55650
17987 55650 77318 129240 163008 83298 125 -7053 86435 172286 125596 110985 103937 115189
17975 115189 174482 222268 196860 149712 137558 108750 93043 117818 129632 194917 236446
17964 236446 281191 323213 431807 580300 843286 1209781 1401145 1390750 1204304 942649
17954 942649 835855 950838 1160520 1356309 1415637 1306756 1044354 777085 582224 399097
17944 399097 257887 112322 66496 127691 110938 9774 -57146 -60576 -6728 58022 32244
17933 32244 10048 -15927 67388 143140 126748 64342 37253 18506 15993 50741 60799 29841
17921 29841 8144 16425 38242 68208 58769 -41766 -29254 -1923 -5214 7666 31733 12620
$$ packed form
17999A7690J12040O5902J6325k4070m5620l7899n5697j3161k8596j7568Q062N8242
17987E5650K1668N1922L3768p9710q3173p178R3488Q5851m6690j4611p048J1252
17975A15189N9293M7786k5408m7148j2154k8808j5707K4775J1814O5285M1529
17964B36446M4745M2022J08594J48493K62986L66495J91364j0395j86446k61655
17954I42649j06794J14983K09682J95789N9328j08881k62402k67269j94861j83127
17944C99097j41210j45565m5826O1195j6753j01164o6920l430N3848O4750k5778
17933C2244k2196k5975Q3315P5752j6392o2406k7089j8747k513L4748J0058l0958
17921B9841k1697Q281K1817K9966r439j00535J2512K7331l291J2880K4067j9113
$$ plain form
17909 12620 63394 116708 97891 46991 9366 -10835 -11572 11230 16167 -14984 -65342 -41884
17897 -41884 -6091 -1471 38004 -24814 -30914 8254 -45101 -95761 -153548 -137106 -146201 -78506
17885 -78506 65069 71988 20726 -32913 -103561 -139362 -79378 -80103 -66368 -43693 -75393 -74954
17873 -74954 -1750 21586 13206 9036 -1544 -30106 -9415 11864 12487 22077 -11326 -86770 -116039
17860 -116039 -79182 -51625 17506 70502 12857 -50835 -25193 8304 -32648 -101743 -88190
17849 -88190 1661 46351 73555 39000 61918 69713 33172 35239 29273 -27081 -61770 -21193
17837 -21193 -3556 11656 35836 54689 44018 55946 47883 24326 40580 30380 105661 59237
17825 59237 -57511 -43774 16617 -21673 22563 66658 63653 47221 70793 79344 131824 255332
$$ packed form
17909A2620N0774N3314j8817n0900l7625k0201p37K2802M937l1151n0358K3458
17897d1884L5793M620L9475o2818o100L9168n3355n0660n7787J6442r095O7695
17885g8506J43575O919n1262n3639p0648l5801N9984p25J3735K2675l1700M39
17873g4954P3204K3336q380m170j0580k8562K0691K1279O23R590l3403p5444k9269
17860a16039L6857K7557O9131N2996n7645o3692K5642L3497m0952o9095J3553
17849h8190Q9851M4690K7204l4555K2918P795l6541K067n966n6354l4689M0577
17837b1193J7637J5212K4180J8853j0671J1928q063k3557J6254j0200P5281m6424
17825E9237j16748J3737O0391l8290M4236M4095l005j6432K3572Q551N2480J23508
$$ plain form
17813 255332 222569 101419 55633 -1887 -18708 1624 70224 94309 62277 63914 37990
17802 37990 -36473 -89746 -62112 -59142 -11290 3633 -30910 -14454 -107966 -62978 19824 64085
17790 64085 90259 80141 72504 74258 41910 3451 -67091 -49673 10235 31310 29099 -8314
17778 -8314 7553 32670 58277 61942 17452 -36576 -88944 -9299 79407 63589 13469 -23789
17766 -23789 -51316 4671 1091 1934 14486 45915 37747 17499 3520 -19002 26139 -5254
17754 -5254 -3035 15526 -41596 -55117 6822 33042 55202 62651 55465 83533 114276 103656
17742 103656 95916 20894 -22249 -5235 93948 130786 137538 127923 70986 12268 -44802 -31818
17730 -31818 -13148 -28218 33037 51892 53215 61973 60268 -12563 -48628 -48010 -3877 -9719 43232
$$ packed form
17813B55332l2763j21150m5786n7520j6821K0332O8600K4085l2032J637k5924
17802C7990p4463n3273K7634K970M7852J4923l4543J6456r3512M4988Q2802M4261
17790F4085K6174j0118p637J754l2348l8459p0542J7418N9908K1075k211l7413
17778h314J5867K5117K5607L665m4490n4028n2368P9645Q8706j5818n0120l7258
17766b3789k7527N5987l580Q43J2552L1429q168k0248j3979k2522M5141l1393
17754e254K219J8561n7122j3521O1939K6220K2160P449p186K8068L0743j0620
17742A03656p740p5022m3143J7014R9183L6838O752r615n6937n8718n7070J2984
17730c1818J8670j5070O1255J8855J323Q758j705p2831l6065O18M4133n842N2951
$$ plain form
17717 43232 70008 136510 234797 152850 179 -49446 18736 25507 19681 -37510 -73135 -72562
17705 -72562 -63720 -52633 -56067 -97092 -43227 53475 50585 14087 -41091 -49021 -42268 5675 -36496
17692 -36496 -121198 -107693 -54523 -26584 -26350 21880 49795 8065 8245 14651 67668 66920 64100
17679 64100 67817 44936 -13745 -16442 -605 65150 69302 165761 173391 75198 5713 -4339
17667 -4339 23310 66791 92513 80726 121507 73598 62032 67531 77870 55799 35566 47981
17655 47981 54941 37234 44766 49290 45176 58539 53610 91104 91610 107169 123545 73944 48066
17642 48066 99629 84884 116418 146981 148763 103364 77677 87406 84668 90203 89568 114203 141824
17629 141824 156966 123970 99329 145100 150472 183076 227970 294686 265655 207084 38770
$$ packed form
17717D3232K6776O6502R8287q1947j52671m9625O8182O771n826n7191l5625N73
17705g2562Q842J1087l434m1025N3865R6702k890l6498n5178p930O753M7943m2171
17692c6496q4702J3505N3170K7939K34M8230K7915m1730J80O406N3017p48k820
17679F4100L717k2881n8681k697J5837O5755M152R6459P630r8193o9485j0052
17667d339K7649M3481K5722j1787M0781m7909j1566N499J0339k2071k0233J2415
17655D7981O960j7707P532M524m114J3363m929L7494N06J5559J6376m9601k5878
17642D8066N1563j4745L1534L0563J782m5399k5687R729k738N535o35K4635K7621
17629A41824J5142l2996k4641M5771N372L2604M4894O6716k9031n8571j68314
$$ plain form
17618 38770 -23253 85867 178060 207574 196010 189639 146415 116907 174893 175551 173627 188602
17606 188602 119754 89131 73142 26516 27244 68608 54848 72502 105750 150461 136601 82930
17594 82930 62992 84854 125785 182429 185245 170731 57232 13795 50528 9904 -1350 40616
17582 40616 34029 -24988 -37134 17401 4625 4848 55936 83462 86052 52518 4669 -7498
17570 -7498 59741 85929 57402 84027 105205 60612 87261 42652 59186 153687 230897 208201
17558 208201 171144 98252 166022 207486 204467 202831 164565 103590 105469 103970 124902 150001
17546 150001 97511 34691 -4953 -23909 21999 103318 73364 96759 153606 145660 142982 172084
17534 172084 149126 156428 117654 43481 52265 126983 193144 164440 110396 72824 96925 150582
$$ packed form
17618C8770o2023J09120R2193K9514j1564o371m3224k9508N7986O58j924J4975
17606A88602o8848l0623j5989m6626P28M1364j3760J7654L3248M4711j3860n3671
17594H2930j9938K1862M0931N6644K816j4514j13499m3437L6733m0624j1254M1966
17582D0616o587n9017j2146N4535j2776K23N1088K7526K590l3534m7849j2167
17570g498O7239K6188k8527K6625K1178m4593K6649m4609J6534R4501P7210k2696
17558B08201l7057p2892O7770M1464l019j636l8266o0975J879j499K0932K5099
17546A50001n2490o2820l9644j8956M5908Q1319k9954K3395N6847p946k678K9102
17534A72084k2958P302l8774p4173Q784P4718O6161k8704n4044l7572K4101N3657
$$ plain form
17522 150582 118812 6553 -26501 1811 20460 55501 81889 141656 160788 60645 61010
17511 61010 51744 21510 114147 169687 151780 179205 240271 200206 169189 193100 215027 206210
17499 206210 216313 291366 313064 292299 304895 314893 363366 387057 329141 241672 263799 358464
17487 358464 411929 417794 382830 326474 265807 218494 181596 274966 227231 201742 222293 282883
17475 282883 214901 96366 96693 168399 245841 227414 182794 112463 108005 138675 119358 93817
17463 93817 132970 132927 85475 72981 25749 45519 118591 136091 165652 155963 141939 112257
17451 112257 181233 191749 215511 317958 349595 391510 406605 464212 662595 845956 911834
17440 911834 916830 828132 651642 515210 434435 400894 374269 388779 362401 325925 313577
$$ packed form
17522A50582l1770j12259l3054K8312J8649L5041K6388N9767J9132j00143L65
17511F1010r266l0234R2637N5540j7907K7425O1066m0065l1017K3911K1927q817
17499B06210J0103P5053K1698k0765J2596R998M8473K3691n7916q7469K2127R4665
17487C58464N3465N865l4964n6356o0667m7313l6898R3370m7735k5489K0551O0590
17475B82883o7982j18535L27P1706P7442j8427m4620p0331m458L0670j9317k5541
17463I3817L9153m3m7452j2494m7232J9770P3072J7500K9561r689j4024k9682
17451A12257O8976J0516K3762J02447L1637M1915J5095N7607J98383J83361O5878
17440I11834M996q8698j76490j36432q0775l3541k6625J4510k6378l6476j2348
$$ plain form
17429 313577 333952 398239 469342 489977 529487 514732 477344 523165 566463 614369 622518 628403
17417 628403 637410 645583 722360 749836 817290 874152 954527 1016069 1020129 1088256 1225027 1374762
17405 1374762 1512819 1606572 1772781 1940620 2094087 2451367 2970710 3469406 3707153 3826259
17395 3826259 3773619 3728002 3926089 4406540 5137038 5808876 6339224 6790409 7133073 7769204
17385 7769204 8661765 9750066 11058164 12652623 14560830 16912741 19839196 23756000
17377 23756000 28694422 35176753 44613599 59768016 86174552 132104256 197917916
17370 197917916 253485604 267343706 252017185 213153883 175792920 169046547 198657143
17363 198657143 245718018 267066424 250661924 209514727 148799439 97578503 64956352
$$ packed form
17429C13577K0375O4287P1103K0635L9510j4755l7388M5821M3298M7906Q149N885
17417F28403R007Q173P6777K7476O7454N6862Q0375O1542M060O8127J36771J49735
17405A374762J38057R3753J66209J67839J53467L57280N19343M98696K37747J19106
17395C826259n2640m5617J98087M80451P30498O71838N30348M51185L42664O36131
17385G769204Q92561J088301J308098J594459J908207K351911K926455L916804
17377B3756000M938422O482331R436846J5154417K6406536M5929704O5813660
17370A97917916N5567688J3858102j5326521l8863302l7360963o746373K9610596
17363A98657143M7060875K1348406j6404500m1147197o0715288n1220936l2622151
$$ plain form
17356 64956352 45350610 33433111 25741989 20273724 16255537 13306555 11126171 9613327
17348 9613327 8719891 8089421 7388733 6660663 6005741 5558374 5234980 4838588 4457300
17339 4457300 3998893 3674180 3439004 3460715 3466928 3377134 3110294 2760648 2368179 2065211
17329 2065211 1856030 1718525 1552606 1428882 1366268 1367126 1261457 1117436 965277 929265
17319 929265 995885 1081392 1077158 1059998 1002981 949254 937676 947747 893570 785700 761989
17308 761989 745231 653653 569348 500020 494529 513787 546452 545420 562662 523934 472009 414060
17296 414060 410383 496685 532100 545832 538667 543539 440669 484633 536514 521845 432512 370985
17284 370985 369651 349082 353144 386707 426586 489405 457552 419833 458577 469555 491132 455696
$$ packed form
17356F4956352j9605742j1917499p691122n468265m018187k948982k180384j512844
17348I613327q93436o30470p00688p28070o54922m47367l23394l96392l81288
17339D457300m58407l24713k35176K1711O213q9794k66840l49646l92469l02968
17329B065211k09181j37505j65919j23724o2614Q58j05669j44021j52159l6012
17319I29265O6620Q5507m234j7160n7017n3727j1578J0071n4177j07870k3711
17308G61989j6758r1578q4305o9328n491J9258L2665j032J7242l8728n1925n7949
17296D14060l677Q6302L5415J3732p165M872j02870M3964N1881j4669q9333o1527
17284C70985j334k0569M062L3563L9879O2819l1853l7719L8744J0978K1577l5436
$$ plain form
17272 455696 391994 354551 326780 288081 223676 157344 160145 250586 287124 273022 212255 149065
17260 149065 148138 188585 219807 209427 238919 184858 153347 147767 176624 160234 193867 316443
17248 316443 297839 260890 262751 206318 223696 266821 208057 144707 120947 87843 26348 43619
17236 43619 115811 190159 179858 100534 33210 9924 -33035 7266 145891 219271 212289 268441
17224 268441 307154 317711 275763 191300 169456 195505 162718 163602 189085 169224 220756 272549
17212 272549 272357 173023 55082 55781 95343 175429 182214 147786 132752 89926 67604 62637
17200 62637 136692 204210 159381 85930 62127 24071 -26112 -59418 -39704 9053 56167 101735
17188 101735 137965 205872 157175 82922 58634 118142 123768 76128 -24940 -16167 17369 28732
$$ packed form
17272D55696o3702l7443k7771l8699o4405o6332K801R0441L6538j4102o0767o3190
17260A49065r27M0447L1222j0380K9492n4061l1511n580K8857j6390L3633J22576
17248C16443j8604l6949J861n6433J7378M3125n8764o3350k3760l3104o1495J7271
17236D3619P2192P4348j0301p9324o7324k3286m2959M0301J38625P3380o982N6152
17224B68441L8713J0557m1948q4463k1844K6049l2787Q84K5483j9861N1532N1793
17212B72549j92r9334j17941O99L9562Q0086O785l4428j5034m2826k2322m967
17200F2637P4055O7518m4829p3451k3803l8056n0183l3306J9714M8757M7114M5568
17188A01735L6230O7907m8697p4253k4288N9508N626m7640j01068Q773L3536J1363
$$ plain form
17176 28732 -28865 -127963 -144085 -76125 -9526 16562 22767 28639 39907 -2534 16984 7526
17164 7526 -24131 -9587 -1283 26566 21381 67316 83421 89924 105581 63897 28271 50686
17152 50686 -33310 -84056 -49042 43799 103681 106541 82095 42504 -2465 -13181 -31350 -25182
17140 -25182 29402 45784 -6646 -21760 5735 16714 27174 56906 63248 136488 108091 49438
17128 49438 -3833 -70347 -65980 10096 79481 70767 42611 25016 10000 -4075 -2091 -3868
17116 -3868 -47132 -77989 -74950 -91454 -61884 -8029 -8114 -5088 46637 61318 37782 44470 25221
17103 25221 6543 -98341 -145097 -99138 -80127 -104818 -107530 -68041 -80175 -128002 -125841 -108046
17091 -108046 -62286 -52925 -99014 -137330 -129533 -140560 -111566 -84301 -48345 17891 45481 75707
$$ packed form
17176B8732n7597r9098j6122O7960O6599K6088O205N872J1268m2441J9518r458
17164G526l1657J4544Q304K7849n185M5935J6105O503J5657m1684l5626K2415
17152E0686q3996n0746L5014R2841N9882K860k4446l9591m4969j0716j8169O168
17140b5182N4584J6382n2430j5114K7495J0979J0460K9732O342P3240k8397n8653
17128D9438n3271o6514M367P6076O9385q714k8156j7595j5016j4075J984j777
17116c868m3264l0857L039j6504K9570N3855q5L026N1725J4681k3536O688j9249
17103B5221j8678j04884m6756M5959J9011k4691k712L9489j2134m7827K161J7795
17091a08046M5760R361m6089l8316P797j1027K8994K7265L5956O6236K7590L0226
$$ plain form
17079 75707 -14799 -45435 -37493 -51996 -77530 -47969 -61014 -82316 -122663 -83340 -34463 17587
17067 17587 1732 55790 -21645 12574 11941 -33784 -87227 -58594 26231 -21129 -25544 9820
17055 9820 96193 127895 64218 73705 114035 19305 -74638 -81819 4267 39808 82409 123665
17043 123665 100359 92915 35142 -22112 -13534 -11934 -22615 -41885 -64200 -53909 -132698 -208832
17031 -208832 -159972 -71116 -1438 36649 14933 -32602 -27792 -2025 34254 -1156 -26281 -100646
17019 -100646 -121864 -89835 -54258 -3612 62306 52003 6493 14940 29147 42420 62465 39087
17007 39087 28232 77759 115444 87952 68995 39933 9589 28098 47263 19391 -9557 -91302
16995 -91302 -126766 -46537 -30582 -37691 -40097 -35295 -156406 -133726 -114348 -99322 -25539 23830
$$ packed form
17079G5707r0506l0636P942j4503k5534K9561j3045k1302m0347L9323M8877N2050
17067A7587j5855N4058p7435L4219o33m5725n3443K8633Q4825m7360m415L5364
17055I820Q6373L1702o3677R487M0330r4730r3943p181Q6086L5541M2601M1256
17043A23665k3306p444n7773n7254Q578J600j0681j9270k2315J0291p8789p6134
17031b08832M8860Q8856O9678L8087k1716m7535M810K5767L6279l5410k5125p4365
17019a00646k1218L2029L5577N0646O5918j0303m5510Q447J4207J3273K0045k3378
17007C9087j0855M9527L7685k7492j8957k9062l0344J8509J9165k7872k8948q1745
16995i1302l5464Q0229J5955p109k406M802j21111K2680J9378J5026P3783M9369
$$ plain form
16983 23830 10127 18862 43533 9202 -5129 -17596 62641 118445 44286 -40548 -46692 -52698
16971 -52698 -11701 76556 50062 29579 13662 29155 17267 2347 24806 45740 41405 3865
16959 3865 -2374 25306 29493 60215 -21571 -54060 -53704 -46646 -57524 -76675 -31854 -4607 -30884
16946 -30884 -8061 -42692 32104 47293 46412 4799 5637 2370 23385 32628 82456 132897 126462
16933 126462 110392 112027 59203 21152 8388 4649 17025 32758 25942 -15595 -28431 -62281
16921 -62281 -67369 -84526 -56627 -32231 6739 80444 64479 60259 78973 69715 49287 11115
16909 11115 15659 37865 -76158 -135205 -124372 -110436 -138825 -122961 -84869 -55135 -33711 -99155
16897 -99155 -123696 -65920 8893 60329 107509 101270 126702 69810 54080 31795 8659 -23557
$$ packed form
16983B3830j3703Q735K4671l4331j4331j2467Q0237N5804p4159q4834o144o006
16971e2698M0997Q8257k6494k0483j5917J5493j1888j4920K2459K0934m335l7540
16959C865o239K7680M187L0722q1786l2489L56P058j0878j9151M4821K7247k6277
16946c0884K2823l4631P4796J5189q81m1613Q38l267K1015R243M9828N0441o435
16933A26462j6070J635n2824l8051j2764l739J2376J5733o816m1537j2836l3850
16921f2281n088j7157K7899K4396L8970P3705j5965m220J8714r258k0428l8172
16909A1115M544K2206j14023n9047J0833J3936k8389J5864L8092K9734K1424o5444
16897i9155k4541N7776P4813N1436M7180o239K5432n6892j5730k2285k3136l2216
$$ plain form
16885 -23557 -28324 -30329 12135 47267 1111 -74753 -41648 -58746 1041 61581 94529 80154
16873 80154 88131 76837 4439 -78713 -96739 -2945 53455 53602 33012 49730 6466 23708
16861 23708 40401 53544 100271 131158 15193 -13412 14805 3625 -65464 -41399 498
16850 498 -7743 -17398 -69247 -57906 -55850 -13612 -4154 -12908 -11635 20483 -41511 -51233 1608
16837 1608 -42163 -54624 -99493 -74947 -39693 -102751 -56786 9798 46179 9132 -50032 -123362
16825 -123362 -112263 -144490 -141254 -116763 -42331 35309 29013 -30222 -28092 2172 45257 106517
16813 106517 124420 144626 157907 157021 85066 16654 38886 -5048 -90556 -77064 -89224 -65585
16801 -65585 -28956 -50690 -40618 -3076 43463 28121 54132 77996 70627 24212 23134 77265
$$ packed form
16885b3557m767k005M2464L5132m6156p5864L3105j7098N9787O0540L2948j4375
16873H0154P977j1294p2398q3152j8026R3794N6400J47k0590J6718m3264J7242
16861B3708J6693J3143M6727L0887j15965k8605K8217j1180o9089K4065M1897
16850D98q241r655n1849J1341K056M2238R458q754J273L2118o1994r722N2841
16837A608m3771j2461m4869K4546L5254o3058M5965O6584L6381l7047n9164p3330
16825a23362J1099l2227L236K4491P4432P7640o296n9235K130L0264M3085O1260
16813A06517J7903K0206J3281q86p1955o8412K2232m3934q5508J3492j2160K3639
16801f5585L6629k1734J0072L7542M6539j5342K6011K3864p369m6415j078N4131
$$ plain form
16789 77265 90448 80986 67195 15766 56221 134457 190957 139840 173026 202577 286053 388258
16777 388258 528499 747465 1131893 1437465 1612512 1471228 1221281 1048427 952707 1064565
16767 1064565 1280489 1399510 1358982 1196366 882573 612914 423421 317627 256686 233392
16757 233392 207797 170706 124912 20882 44112 151322 128533 86997 72443 76379 49300
16746 49300 17233 1284 -25390 -76819 -50650 18873 8408 -76403 -61320 -75019 -93962 -97798
16734 -97798 -70626 -14433 33588 31638 30945 21305 -18504 -3613 15406 23394 22667 -18152 -11832
16721 -11832 30202 22645 -49111 -8000 2179 -20191 8270 35252 19204 9230 -61130 -50228
16709 -50228 14098 91415 13435 -60322 13985 41538 24747 4332 -14840 -1067 -639 11625
$$ packed form
16789G7265J3183r462j3791n1429M0455P8236N6500n1117L3186K9551Q3476J02205
16777C88258J40241K18966L84428L05572J75047j41284k49947j72854r5720J11858
16767A064565K15924J19021m0528j62616l13793k69659j89493j05794o0941k3294
16757B33392k5595l7091m5794j04030K3230J07210k2789m1536j4554L936k7079
16746D9300l2067j5949k6674n1429K6169O9523j0465q4811J5083j3699j8943l836
16734i7798K7172N6193M8021j950o93r640l9809J4891J9019P988p27m0819O320
16721a1832M2034p557p1756M1111J0179k2370K8461K6982j6048r974p0360J0902
16709e0228O4326P7317p7980p3757P4307K7553j6791k0415j9172J3773M28J2264
$$ plain form
16697 11625 21876 7613 1034 44180 120726 206402 103721 37536 -8478 -26766 -2487 -12585
16685 -12585 -18546 -7880 4574 -3690 -23664 -66116 -63124 6324 58113 24845 57866 113126
16673 113126 48881 29003 60497 72098 66403 -16442 -66394 -41722 -12141 51681 77984 75099
16661 75099 80311 72437 23992 -26990 32291 55371 78386 141083 179775 75497 -9421 -28459
16649 -28459 12755 11235 44190 42097 23702 -352 38009 73800 78887 103947 99451 122475
16637 122475 153839 179683 226209 238310 254552 216923 230442 275933 247754 255286 342986 418678
16625 418678 526625 617606 754690 801619 847988 1000694 1255678 1717857 2462584 3676457
16615 3676457 5890322 9131610 11929767 12441763 11273419 8580892 5571497 3503787
$$ packed form
16697A1625J0251j4263o579M3146P6546Q5676j02681o6185m6014j8288K4279j0098
16685a2585n961J0666J2454q264j9974m2452K992O9448N1789l3268L3021N5260
16673A13126o4245j9878L1494J1601n695q2845m9952K4672K9581O3822K6303k885
16661G5099N212p874m8445n0982N9281K3080K3015O2697L8692j04278q4918j9038
16649b8459M1214j520L2955k093j8395k4054L8361L5791N087K5060m496K3024
16637A22475L1364K5844M6526J2101J6242l7629J3519M5491k8179P532Q7700P5692
16625D18678J07947R0981J37084M6929M6369J52706K54984M62179P44727J213873
16615C676457K213865L241288K798157N11996j168344k692527l009395k067710
$$ plain form
16607 3503787 2280618 1433323 1001674 807581 712944 609208 500248 397149 344105 336915
$$ packed form
16607C503787j223169q47295m31649j94093r4637j03736j08960j03099n3044p190
$$ [...]
##END NTUPLES=NMR SPECTRUM
##END=
