##TITLE=Analysis number 314366
Compound Code cc 47816
Book Reference 458/60
Project Code adrs
Chemist Name stevem
##JCAMPDX= 6.0         $$ Bruker NMR JCAMP-DX V2.0
##DATA TYPE= NMR SPECTRUM
##DATA CLASS= NTUPLES
##ORIGIN= Bruker BioSpin GmbH
##OWNER= NMR
$$ XWIN-NMR		Version 3.5
$$ Mon Oct 17 11:27:44 2005 GMT Daylight Time (UT+1h)  MAYBRIDGE\NMR@NMR_250MHZ
##.OBSERVE FREQUENCY= 250.131544655141
##.OBSERVE NUCLEUS= ^1H
##.ACQUISITION MODE= SIMULTANEOUS (DQD)
##.ACQUISITION SCHEME= undefined
##.AVERAGES= 16
##.DIGITISER RES= 18
##SPECTROMETER/DATA SYSTEM= dpx250
##.PULSE SEQUENCE= zg30
##.SOLVENT NAME= CDCl3
##.SHIFT REFERENCE= (INTERNAL, CDCl3, 0, 16.4586)
##AUDIT TRAIL= $$ (NUMBER, WHEN, WHO, WHERE, WHAT)
$$ ##TITLE= Audit trail, XWIN-NMR		Version 3.5
$$ ##JCAMPDX= 5.01
$$ ##ORIGIN= Bruker BioSpin GmbH
$$ ##OWNER= NMR
$$ C:\u/data/dgb/nmr/ADRS/10860/pdata/1/auditp.txt
$$ ##AUDIT TRAIL=  $$ (NUMBER, WHEN, WHO, WHERE, WHAT)
(   1,<2005-10-17 11:27:24.02 +100>,<MAYBRIDGE\NMR>,<NMR_250MHZ>,
      <created by zg, POWCHK disabled, PULCHK disabled
       configuration hash MD5:
       62 19 C7 07 E1 42 D1 B7 37 6C 3D D0 77 39 F9 E6
       data hash MD5: 64K
       B5 6D 78 BF FD E5 96 0A AC 2A 41 E0 9D 4F 90 33>)
(   2,<2005-10-17 11:27:36.41 +100>,<MAYBRIDGE\NMR>,<NMR_250MHZ>,
      <Start of raw data processing
       ef LB = 0.3 FT_mod = 6 PKNL = 1 SI = 32K 
       data hash MD5: 32K
       F6 2C 31 D7 CF 1E 42 C5 30 37 A6 10 22 7B 99 74>)
(   3,<2005-10-17 11:27:38.02 +100>,<MAYBRIDGE\NMR>,<NMR_250MHZ>,
      <apk 
       data hash MD5: 32K
       1D 47 97 59 C1 8A B9 EA 84 F2 27 B7 F8 81 13 9A>)
(   4,<2005-10-17 11:27:38.69 +100>,<MAYBRIDGE\NMR>,<NMR_250MHZ>,
      <abs ABSG = 5 
       data hash MD5: 32K
       E7 EB AE F3 B1 ED 0F 84 EA A8 3F 73 46 10 94 95>)
$$ ##END=
$$ 
$$ hash MD5
$$ 1B 1D 4E 59 40 D7 AF F3 29 53 22 A9 F1 23 F9 30
##$RELAX= 
##$RELAX= 
##$RELAX= 
##$RELAX= 
##$RELAX= 
##$RELAX= 
##$RELAX= 
$$ Bruker specific parameters
$$ --------------------------
##$DU= <C:\u>
##$EXPNO= 10860
##$NAME= <ADRS>
##$PROCNO= 1
##$TYPE= <nmr>
##$USER= <dgb>
##$AMP= (0..31)
100 100 100 100 100 100 100 100 100 100 100 100 100 100 100 100 100 100 
100 100 100 100 100 100 100 100 100 100 100 100 100 100 
##$AQSEQ= 0
##$AQ_mod= 3
##$AUNM= <au_zg>
##$AUTOPOS= <10 >
##$BF1= 250.13
##$BF2= 250.13
##$BF3= 250.13
##$BF4= 250.13
##$BF5= 500.13
##$BF6= 500.13
##$BF7= 500.13
##$BF8= 500.13
##$BYTORDA= 1
##$CFDGTYP= 0
##$CFRGTYP= 5
##$CHEMSTR= <none>
##$CNST= (0..31)
1 1 145 1 1 1 1 1 1 1 1 1 1 1 1 1 1 1 1 1 1 1 1 1 1 1 1 1 1 1 1 1 
##$CPDPRG= <>
##$CPDPRG1= <>
##$CPDPRG2= <>
##$CPDPRG3= <>
##$CPDPRG4= <mlev>
##$CPDPRG5= <mlev>
##$CPDPRG6= <mlev>
##$CPDPRG7= <mlev>
##$CPDPRG8= <mlev>
##$CPDPRGB= <>
##$CPDPRGT= <>
##$D= (0..31)
0 1 0 0 0 0 0 0 0 0.06 0 0 0 0 0 0 0.0002 0 0 0 0 0 0 0 0 0 0 0 0 0 0 
0 
##$DATE= 1129544842
##$DBL= (0..7)
120 120 120 120 120 120 120 120 
##$DBP= (0..7)
150 150 150 150 150 150 150 150 
##$DBP07= 0
##$DBPNAM0= <>
##$DBPNAM1= <>
$$ [...]
##$SUBNAM7= <"">
##$SUBNAM8= <"">
##$SUBNAM9= <"">
##$SW= 20.6930455092707
##$SWIBOX= (0..15)
0 0 3 0 0 0 0 0 0 0 0 0 0 0 0 0 
##$SW_h= 5175.983436853
##$TD= 65536
##$TD0= 1
##$TE= 294.16
##$TE2= 300
##$TE3= 300
##$TEG= 300
##$TL= (0..7)
0 120 120 120 120 120 120 120 
##$TP= (0..7)
150 150 150 150 150 150 150 150 
##$TP07= 0
##$TPNAME0= <>
##$TPNAME1= <>
##$TPNAME2= <>
##$TPNAME3= <>
##$TPNAME4= <>
##$TPNAME5= <>
##$TPNAME6= <>
##$TPNAME7= <>
##$TPOAL= (0..7)
0.5 0.5 0.5 0.5 0.5 0.5 0.5 0.5 
##$TPOFFS= (0..7)
0 0 0 0 0 0 0 0 
##$TUNHIN= 0
##$TUNHOUT= 0
##$TUNXOUT= 0
##$USERA1= <user>
##$USERA2= <user>
##$USERA3= <user>
##$USERA4= <user>
##$USERA5= <user>
##$V9= 5
##$VALIST= <valist>
##$VCLIST= <CCCCCCCCCCCCCCC>
##$VD= 0
##$VDLIST= <DDDDDDDDDDDDDDD>
##$VPLIST= <PPPPPPPPPPPPPPP>
##$VTLIST= <TTTTTTTTTTTTTTT>
##$WBST= 1024
##$WBSW= 4
##$XGAIN= (0..3)
0 0 0 0 
##$XL= 0
##$YL= 0
##$YMAX_a= 460379
##$YMIN_a= -472682
##$ZGOPTNS= <>
##$ZL1= 120
##$ZL2= 120
##$ZL3= 120
##$ZL4= 120
##$ABSF1= 16.45862
##$ABSF2= -4.234552
##$ABSG= 5
##$ABSL= 3
##$ALPHA= 0
##$AQORDER= 0
##$ASSFAC= 0
##$ASSFACI= 0
##$ASSFACX= 0
##$ASSWID= 0
##$AUNMP= <proc_1d>
##$AZFE= 0.1
##$AZFW= 0.1
##$BCFW= 0
##$BC_mod= 0
##$BYTORDP= 0
##$COROFFS= 0
##$CY= 12.5
##$DATMOD= 1
##$DC= 0
##$DFILT= <>
##$DTYPP= 0
##$F1P= 14.0000005364418
##$F2P= -0.99999901652339
##$FCOR= 0.5
##$FTSIZE= 32768
##$FT_mod= 6
##$GAMMA= 0
##$GB= 0
##$INTBC= 1
##$INTSCL= 1
##$ISEN= 128
##$LB= 0.3
##$LEV0= 0
##$LPBIN= 0
##$MAXI= 10000
##$MC2= 0
##$MEAN= 0
##$ME_mod= 0
##$MI= 0
##$NCOEF= 0
##$NC_proc= -3
##$NLEV= 6
##$NOISF1= 0
##$NOISF2= 0
##$NSP= 0
##$NTH_PI= 0
##$NZP= 0
##$OFFSET= 16.45862
##$PC= 1
##$PHC0= -68.49605
##$PHC1= 6.380963
##$PH_mod= 1
##$PKNL= yes
##$PPARMOD= 0
##$PSCAL= 4
##$PSIGN= 0
##$REVERSE= no
##$SF= 250.130015851729
##$SI= 32768
##$SIGF1= 0
##$SIGF2= 0
##$SINO= 400
##$SIOLD= 32768
##$SREGLST= <1H.CDCl3>
##$SSB= 0
##$STSI= 32768
##$STSR= 0
##$SW_p= 5175.98343685301
##$SYMM= 0
##$S_DEV= 0
##$TDeff= 65536
##$TDoff= 0
##$TI= <Analysis number 999999
Compound Code 99
Book Reference 9
Project Code 9>
##$TILT= no
##$TM1= 0
##$TM2= 0
##$TOPLEV= 0
##$USERP1= <user>
##$USERP2= <user>
##$USERP3= <user>
##$USERP4= <user>
##$USERP5= <user>
##$WDW= 1
##$XDIM= 32768
##$YMAX_p= 389246376
##$YMIN_p= -396583
$$ End of Bruker specific parameters
$$ ---------------------------------
##NTUPLES= NMR SPECTRUM
##VAR_NAME=  FREQUENCY,     SPECTRUM/REAL,   SPECTRUM/IMAG
##SYMBOL=    X,             R,               I
##VAR_TYPE=  INDEPENDENT,   DEPENDENT,       DEPENDENT
##VAR_FORM=  AFFN,          ASDF,            ASDF
##VAR_DIM=   32768,         32768,           32768
##UNITS=     HZ,            ARBITRARY UNITS, ARBITRARY UNITS
##FACTOR=    0.157963299565203, 1,           1
##FIRST=     4116.79489935965, 0,            0
##LAST=      -1059.18853749336, 0,           0
##MIN=       -1059.18853749336, -396583,     0
##MAX=       4116.79489935965, 389246376,    0
$$ Real data points
##PAGE= N=1
##DATA TABLE= (X++(R..R)), XYDATA
$$ [...]
##PAGE= N=2
##DATA TABLE= (X++(I..I)), XYDATA
22273G38954K580L520j9059K1779J2305K5223L760k597K5662J0529l9318j4694
22261G68644n201r269J740M145j705k4627j9142N991q836J9255J8094k0951J8170
22248G46308K6977R032R177j2607J7982K6144k8733j5298J6795j011l7622l8935
22236G18209r498J7905J9354m269k0094R209M0804K8075J0853j1633j9752j6464
22224G62699J970R015K1289j3424O016J0308k9486j5674K2117n640k4518k031
22212G42641L1334K416l6571K0330q355q80j5366R956L257n152J5062j823k4030
22199G32819J1456N4268R54k090M729j4530k5903k0487O911n58k303j119j2737
22186G31410r315J8693o056Q505j4810k5966l026P17J1828K7625K4745J8773J4682
$$ y = [738954, 741534, 745054, 725995, 747774, 760079, 785302, 789062, 786465, 812127, 822656, 783338, 768644, 763443, 754174, 755914, 760059, 758354, 733727, 714585, 720576, 711740, 730995, 749089, 728138, 746308, 773285, 782317, 791494, 778887, 796869, 823013, 794280, 778982, 795777, 794766, 757144, 718209, 708711, 726616, 745970, 741701, 721607, 730816, 771620, 799695, 810548, 798915, 779163, 762699, 764669, 773684, 794973, 781549, 787565, 797873, 768387, 752713, 774830, 769190, 744672, 742641, 773975, 776391, 739820, 760150, 751795, 750915, 735549, 745505, 748762, 743610, 758672, 756849, 732819, 744275, 798543, 799497, 797407, 802136, 787606, 761703, 741216, 748127, 747569, 745266, 744147, 731410, 722095, 740788, 734732, 743237, 728427, 702461, 699435, 700152, 711980, 739605, 764350, 783123, 797805]
22173G97805j6094k880O6qJ3717J8074K665k0734k1571j3353j6709l717j4901
22160G22360J999L6518K7035k15k0170P096J2462M476J5430j6294k3107J6586
22148G84176j7207L396r471j4537J3804M0463M423l3457J4134j799P662J2398
22136H03985m383K7471K8477j692l0998r610P993J1954k5088k2863N313J3114
22124H03673J229p535k0195j0955n3344P145M6573R060L79J9761J7048r707j2132
22111G91000l993j4118N240n330J258k1546o559J3104o293M171O422J9938m543
22098G78751l33O017J9499K705R182j7589p270l5570r091J4207n032o027K9644
22085G79093K5546p462p707K0378o607j7172m707N841k6475J9897J1082k958K6069
$$ y = [797805, 781711, 778831, 778897, 778889, 792606, 810680, 813345, 792611, 771040, 757687, 740978, 737261, 722360, 724359, 760877, 787912, 787697, 767527, 774623, 787085, 791561, 806991, 790697, 767590, 784176, 766969, 770365, 760894, 746357, 760161, 800624, 805047, 771590, 785724, 783925, 791587, 803985, 799602, 827073, 855550, 853858, 822860, 813250, 821243, 833197, 808109, 785246, 790559, 803673, 804902, 797367, 777172, 766217, 712873, 720018, 766591, 775651, 776030, 795791, 812839, 803132, 791000, 787007, 772889, 778129, 772799, 774057, 752511, 745952, 759056, 752763, 756934, 763356, 783294, 778751, 778418, 784435, 803934, 806639, 815821, 798232, 790962, 755392, 746301, 760508, 755476, 749449, 779093, 804639, 797177, 789470, 809848, 803241, 786069, 781362, 787203, 760728, 780625, 791707, 788749, 814818]
22072H14818J0490J8928J8174k9199l3973j9375n451K559K0545M702J1581J6802
22060H30601j505l2071L137R813N895k657l7451r525M3679K8126j3972l3216K2312
22047H13166L0575j0607k0132q255l685j7714O74j4592J3210K1701j3089M918
22035G96170p912k4325K3884J8354m992j0965l6485j6282P341J4868j4297J686
22023G47045J7732N088N472Q472L5971J6845J4216m1108j9260j8407M150K3681
22011G99897J8088J34N264n273k6519l021J6167m996K0841J7861j8103l4269K1166
21998H07237K731l263J55N764k1919k1349q540m0807K685K6869J1031J7383j3143
21985G64834J8837J2702n547L212K1295o296p773K38o684R157K225K315j994O181
$$ y = [814818, 825308, 844236, 862410, 833211, 799238, 779863, 774412, 776971, 797516, 802218, 813799, 830601, 829096, 797025, 800162, 809975, 815870, 813213, 775762, 766237, 809916, 838042, 824070, 790854, 813166, 843741, 833134, 813002, 804747, 801062, 783348, 784022, 769430, 782640, 804341, 791252, 796170, 788258, 763933, 787817, 806171, 801179, 790214, 753729, 737447, 744788, 759656, 745359, 747045, 764777, 769865, 775337, 783809, 819780, 836625, 850841, 809733, 790473, 772066, 776216, 799897, 817985, 818119, 823383, 818110, 791591, 788570, 804737, 799741, 820582, 838443, 820340, 786071, 807237, 809968, 806705, 806860, 812624, 790705, 769356, 760816, 720009, 722694, 749563, 760594, 777977, 764834, 783671, 796373, 790826, 794038, 815333, 809037, 801264, 801502, 794818, 803975, 806200, 808515, 806521, 812702]
21971H12702L749N99k0722k5015l534L922O376K1085J9625N903J6982K0089j6704
21958H45057m636J3667j0502n244J1075r542P315J736J191j9030J6153J1494l346
21945H55388m123l3362j8494o952p111K9889K7594L2923j1859j1866j9488j6228
21933H16311O131j5016J419l897J9842J5183J2880l5478k5837K008M1761q401
21921H26906k8454O274K1177j6034n837J3946J3199q21L352J7094J331m266q770
21908H39097J4781j6968l7453J3452j585j5119J4678J6005o381O860K373l5455
21896G94285j8096K7325K6909J6012r676l2539j3468K3021K3325l3415k4889J2801
21884G91595L7354R385J1094K2077j520p067k3084j3138k0109M44m306J132K323
$$ y = [812702, 816451, 817050, 796328, 771313, 767779, 771701, 778077, 799162, 818787, 824690, 841672, 861761, 845057, 840421, 854088, 843586, 838342, 849417, 839875, 847190, 848926, 850117, 831087, 847240, 858734, 855388, 851265, 817903, 799409, 792457, 785346, 815235, 842829, 875752, 863893, 852027, 832539, 816311, 822442, 807426, 808845, 804948, 824790, 839973, 852853, 817375, 791538, 793546, 835307, 826906, 798452, 804726, 825903, 809869, 804032, 817978, 831177, 830356, 833708, 850802, 852133, 847867, 839097, 853878, 836910, 799457, 812909, 811324, 796205, 810883, 826888, 820507, 827367, 829740, 794285, 776189, 803514, 830423, 846435, 836759, 804220, 790752, 813773, 837098, 803683, 778794, 791595, 828949, 838334, 849428, 871505, 869985, 862918, 839834, 826696, 806587, 807031, 802725, 803857, 806180]
21871H06180J8437M442j725m662m501L76q269j518J1674o04n61j674J4186q526
21857H23255j6560J5040K2964J6975K480J440J4302j969l6740p400j4553m5k711
21844H16478K3846Q320k2645L544k8788q481q340M681K3127K8346j2532j332j3880
21831H12344j1847K20J7705n400J5787Q440o125J2722r80O649j5521q537L0355
21818H55812p926j5849P759J1167J7094p938k2789j7084k384K4441K992l471n019
21805H36805l1010j2133L6139K5528p32j904k4450J1876K6613J82j8126n990k2004
21792H20794j7148j7100j8192J9330K6959K662J412O356J2835J3235j3271J001
21780H38873J024o89m047R827J095k2136J6176K697J411j5969q937p381J563K7500
$$ y = [806180, 824617, 829059, 827334, 822672, 818171, 818547, 810278, 808760, 820434, 819830, 819269, 817595, 831781, 823255, 806695, 821735, 844699, 861674, 864154, 865594, 879896, 877927, 841187, 833787, 819234, 819189, 816478, 840324, 848644, 825999, 829543, 800755, 792274, 783934, 788615, 811742, 840088, 827556, 826224, 812344, 800497, 800717, 818422, 813022, 828809, 837249, 831124, 843846, 842866, 849515, 833994, 825457, 855812, 847886, 832037, 839796, 850963, 868057, 860119, 837330, 820246, 817862, 842303, 845295, 841824, 836805, 805795, 793662, 829801, 855329, 854597, 852693, 828243, 840119, 866732, 866914, 848788, 842798, 820794, 803646, 786546, 768354, 787684, 814643, 817305, 818717, 825073, 837908, 851143, 837872, 838873, 839897, 839208, 835161, 844988, 846083, 823947, 840123, 842820, 844231, 828262, 819325, 811944, 813507, 841007]
21766H41007K1907k6026J300J2165M977p123l7697j8409K0988m562j1115j7788
21754G79624k477j7046N441J6729J6579J3758M971r587P278l606J5440J9919L4721
21741H81744o425r267j7578j2940l766j834k2808J5554M1015j3871n6757n907
21729G87160J0986j499N674K6153Q610J2912k4738p305K1572k8389j6624J7214
21717H11726J1088R034L605N261J6946N851m15l8859l2947l383M4822L0712N849
21704H69290k362R515r607j1908n482Q8j314P580K795j1409j201J7374J6447K2187
21690I01993J595o098m7315m6193K1750J2126l086k4386k5375m631J3160L051
21678G96591j7731L0473K2189k907k0147J1257K7131j4727j0948n746J783P431
$$ y = [841007, 862914, 836888, 838188, 850353, 855330, 848207, 810510, 792101, 813089, 808527, 797412, 779624, 777147, 760101, 765542, 782271, 798850, 812608, 817579, 807992, 815270, 811664, 827104, 847023, 881744, 875319, 866052, 848474, 835534, 831768, 829934, 807126, 822680, 863695, 849824, 793067, 787160, 798146, 796647, 802321, 828474, 837084, 849996, 825258, 817953, 839525, 811136, 794512, 811726, 822814, 831848, 835453, 840714, 857660, 863511, 863096, 824237, 791290, 787907, 832729, 863441, 869290, 866928, 876443, 866836, 854928, 849446, 849534, 848220, 855800, 858595, 847186, 845985, 863359, 879806, 901993, 903588, 897490, 850175, 803982, 825732, 837858, 834772, 810386, 785011, 780380, 793540, 796591, 778860, 809333, 831522, 828615, 808468, 819725, 846856, 832129, 821181, 815435, 817218, 824649]
21666H24649R820J3942j0399N953O464j977J6774L1483j4043j4992l405j4878
21654H49391j2882k5206l3468K7700L9520R427k432k7013P462L0128O092o807
21642H61912l0159J675L2417j9189j6467J3597K5245n994R231k3780j8702J0892
21630H40678k787j4107l184k232M437j3681J1829K4693Q238L5325J7678j7034
21618H89853k3190j0878N055n703k0802j1068l3322Q327N2265K956j8421Q902
21606H43974k026R865p693j663J9855J2697l1740k7715J0791K2758Q520l7443
21594H20180j1543j0659O219K8682J7487o517J716O694J1842m191J0119L065N120
21581H78214k618j3701L218j8897k7549P260K9954K2531p147K415q804J3796K2011
$$ y = [824649, 834469, 848411, 838012, 843965, 850429, 848452, 865226, 896709, 882666, 867674, 864269, 849391, 836509, 811303, 777835, 805535, 845055, 854482, 852050, 825037, 832499, 862627, 868719, 861912, 831753, 833428, 865845, 846656, 830189, 843786, 869031, 863037, 872268, 848488, 829786, 840678, 837891, 823784, 820600, 818368, 822805, 809124, 820953, 845646, 853884, 889209, 906887, 889853, 866663, 855785, 860840, 855137, 834335, 823267, 789945, 798272, 850537, 853493, 835072, 843974, 841948, 851813, 844120, 842457, 862312, 875009, 843269, 815554, 826345, 849103, 857623, 820180, 808637, 797978, 804197, 832879, 850366, 843849, 845565, 852259, 864101, 859910, 870029, 873094, 878214, 875596, 861895, 865113, 846216, 818667, 825927, 855881, 878412, 871265, 873680, 864876, 878672, 900683]
21568I00683k001O452k6609M452p552l0537J3509K7582j0549J12J2516l2157j5475
21555H40426k363P898m547J6311m740j158L583M0739O408l8319O709J1215K1116
21542I03278k5562l6822K7650N52j2954J8675Q588j4728Q203k0868l6826J043
21530H20229J2166J6455O446j7142j5957K2943J1896K0413M881P096K336j9619
21518H72143j1738J4912Q910j6812p851K077K4201p048j2601l5508j8915L9271
21506H51041M2465K1917p93K486j6397j4512k7545k369J9470K679m33j8013L518
21493H63514k7974k0069J9850j581P648K769l103J7010J616j3801P611K1126L1549
21480I06165L063r045R693l9069j7345J8789J1615P590k1780k870J627J4055J0281
$$ y = [900683, 898682, 905134, 878525, 882977, 875425, 844888, 858397, 885979, 875430, 875542, 888058, 855901, 840426, 838063, 845961, 841414, 857725, 852985, 851827, 855410, 896149, 902557, 864238, 870947, 882162, 903278, 877716, 840894, 868544, 869096, 856142, 874817, 883405, 868677, 876880, 856012, 819186, 820229, 832395, 848850, 855296, 838154, 822197, 845140, 857036, 877449, 882330, 889426, 891762, 872143, 860405, 875317, 884227, 867415, 859564, 861641, 885842, 878794, 866193, 830685, 811770, 851041, 893506, 915423, 914630, 917116, 900719, 886207, 858662, 856293, 875763, 878442, 878009, 859996, 863514, 835540, 815471, 835321, 833740, 841388, 844157, 841054, 858064, 859680, 845879, 853490, 874616, 906165, 909228, 900183, 909876, 870807, 853462, 872251, 883866, 891456, 869676, 866806, 868433, 882488, 892769]
21467H92769r99j2571k830j0225J8799J5938O405m355j3943L733J546O03j5414
21454H79456O190Q892k6430k5326R971j895j0515N681J8686L1663P116r199K301
21441H96591k1448m0947m757L396p960r833J1956M2543L248j4795P264k2645r845
21428H32768k1964J5695K1118m892j1130L04K3017M890j7671j7661j1719K4311
21416H37066K0415P232R620m578K5314P197k5960k513J7464K41r801k5866k0214
21403H35617J035M9038J7913l8814k4186k3785J719L0141J3270J0927k8696j504
21391H42675j952J94m83J1717Q847M075R623j7683j2382J5174K6729N238j9686
21378H72086M99O044P863N941L1289k8665L16J6915J0655L606j3791j3158k8902
$$ y = [892769, 891770, 879199, 876369, 866144, 884943, 900881, 907286, 902931, 888988, 892721, 894267, 894870, 879456, 885646, 894538, 868108, 842782, 852753, 850858, 840343, 846024, 864710, 896373, 903489, 894290, 896591, 875143, 834196, 829439, 832835, 824875, 815042, 826998, 869541, 872789, 857994, 865258, 842613, 832768, 810804, 826499, 847617, 842725, 831595, 831899, 854916, 859806, 842135, 824474, 812755, 837066, 857481, 864713, 874333, 869755, 895069, 902266, 876306, 873793, 891257, 891498, 881697, 855831, 835617, 836652, 885690, 903603, 864789, 840603, 816818, 818537, 848678, 861948, 872875, 844179, 842675, 840723, 840917, 840434, 852151, 860998, 865073, 874696, 857013, 844631, 859805, 886534, 891772, 872086, 872585, 878629, 886492, 892433, 923722, 895057, 895373, 912288, 922943, 926549, 912758, 899600, 870698]
21365H70698R494O561J672j24J8275J0181J6991P78q467P39m550O195J6714l9500
21351I05657l5283K3053P376k8691l2008L657N4723L0061j1145n091K5573k2146
21339I15736n011O152J2742j022k4078l4799p246J08N672K5664L1531K5649j2521
21326I38577m352j1935l5699j2481J5073P789p845n522O083m839J4020R917K0388
21313I29174J0914l8294n4161J1620P466K204K0528M0752K6148l014l3397l2124
21301H87816J2189N324P260j2227j7154j0191K0334K2549n984l5108J0851N2298
21289I37957k5124K0469J3304J096m219j9111n2985j6633k0957Q169K2440J0291
21277H74697j2257o566R439k128r576j2552K0158K8955j977K1084N984m7406p718
$$ y = [870698, 880192, 886753, 888425, 888301, 906576, 916757, 933748, 934526, 926059, 926798, 922248, 928443, 945157, 905657, 870374, 893427, 900803, 872112, 840104, 843761, 898484, 928545, 917400, 912309, 937882, 915736, 910725, 916877, 929619, 928597, 904519, 869720, 862474, 862582, 868254, 893918, 925449, 951098, 938577, 934225, 922290, 886591, 874110, 889183, 896972, 889127, 883605, 889688, 884849, 898869, 908786, 929174, 940088, 901794, 847633, 859253, 866719, 868923, 889451, 930203, 956351, 953337, 919940, 887816, 900005, 905329, 912589, 900362, 883208, 873017, 893351, 915900, 909916, 874808, 885659, 937957, 912833, 933302, 946606, 947702, 943483, 924372, 871387, 854754, 833797, 841966, 864406, 874697, 862440, 855874, 865313, 863185, 853609, 841057, 861215, 890170, 888193, 909277, 915261, 867855, 860137]
21264H60137J4552J7754J8174l770l6314J4104j7720J4147L297Q136o990k4001
21252H61506N823n547o257J1984K4195J8474l3192m75J7126R856j7528k0029M7112
21239I13048P999l0167j6040p572R869K3420j722j1870m245m504J9494M601J3072
21226I15383J7633l2216j9544J7546M405r775O099m68j7974j3592J0823R963p130
21213H81153j0978M3391J865j6676p6r70J7275o028k5268Q721j1398k2457j5370
21200H43184J8136K4727k54J4146L575j1902J563j5904R370K328p91j6687J3354
21187H84845J1568l310k0928j1920L1497m521p020J2552J3513K74J2873O029l42
21174I25110n211o3630l488M0445Q198J6528j4606R851J5590o400j8671k1523
$$ y = [860137, 874689, 892443, 910617, 906847, 870533, 884637, 866917, 881064, 884361, 892497, 885507, 861506, 867329, 861782, 855525, 867509, 891704, 910178, 876986, 876511, 893637, 903493, 885965, 865936, 913048, 921047, 890880, 874840, 867268, 877137, 900557, 898835, 886965, 882720, 878216, 897710, 902311, 915383, 933016, 900800, 881256, 898802, 903207, 893432, 899531, 899063, 881089, 867497, 878320, 888283, 881153, 870175, 913566, 915431, 898755, 898679, 897709, 914984, 908956, 883688, 892409, 881011, 858554, 843184, 861320, 886047, 885793, 899939, 903514, 891612, 893175, 877271, 886641, 888969, 888178, 871491, 884845, 896413, 893103, 872175, 860255, 891752, 887231, 880211, 892763, 906276, 906550, 919423, 925452, 925110, 919899, 856269, 852781, 893226, 901424, 917952, 903346, 913197, 928787, 922387, 903716, 882193]
21162H82193J94P847k537J5472K0837q550J440k078K861N290J5323k557k3340
21149I12395k691K5989J2318J4953J0076J4376l3357J907j0510j2502j8935J8010
21137I32029K01Q99J8651r257l137p474m692r598J0682K2471o272K2824J9568
21124I86895j0128k2543k1797j1261q093m673l857J7254J1447J0953k4829j4259
21112I05109J9286K2394j206k4121J738k658o086r505j9320n331j56K7980K2991
21099I31115k5980K3199J0142m1689J2743K3724j7664j7203j4358j7608j3917
21088H52504J8603M5918j4844m189R545M016J8110J8806j9818j7191O088K8656
21076I46204k517r167l122J3239J488J3737K6313j5416j7422o35j3098l1749Q395
$$ y = [882193, 882387, 890234, 887697, 903169, 924006, 915456, 916896, 914818, 917679, 922969, 938292, 935735, 912395, 909704, 935693, 948011, 962964, 973040, 987416, 954059, 955966, 945456, 932954, 914019, 932029, 932230, 933129, 951780, 942523, 939386, 931912, 927220, 917622, 928304, 950775, 944503, 967327, 986895, 976767, 954224, 932427, 921166, 913073, 908400, 904543, 921797, 933244, 944197, 919368, 905109, 924395, 946789, 945583, 921462, 923200, 920542, 914456, 904951, 885631, 880300, 880144, 908124, 931115, 905135, 928334, 938476, 896787, 909530, 933254, 915590, 898387, 884029, 866421, 852504, 871107, 917025, 902181, 897992, 907537, 911553, 929663, 948469, 928651, 911460, 917548, 946204, 943687, 934520, 931398, 944637, 946125, 959862, 986175, 970759, 953337, 952702, 939604, 907855, 916250]
21063I16250K0845P943j8123j6112k1701J3665M67m302j114o723M921k936l488
21050H89592L783m874J2261L0962K0087J9033l71j8554J2567p585k0197L911o011
21037I34604M747M312l0601j95M11k0597j9893J0212J1282n425K2822J2142q837
21024I14984r667J1294P086r324K7679K2195R099k1760j5129k867r75R302j6381
21011I25536K0967J3850o025m3083m1035J6531L4753K1766k0984l8367K557L7455
20999I23921J1075j4044j6099L1506J3051p272j5919Q98J1659r475j4818P000
20987I21483K2757O754l1117n831K7888K7134l05J6684j6112q438J6756m449N643
20974I78847p359l4534k6378l1945k0154J1555K3859J6086J570J3661J9906K17
$$ y = [916250, 937095, 945038, 926915, 910803, 889102, 902767, 903234, 898932, 897818, 891095, 896016, 893080, 889592, 893375, 888501, 900762, 931724, 951811, 970844, 970473, 951919, 964486, 956901, 936704, 940615, 934604, 939351, 943663, 913062, 912867, 913278, 892681, 872788, 883000, 894282, 888857, 911679, 923821, 914984, 905317, 916611, 923697, 914373, 942052, 964247, 973346, 951586, 936457, 933590, 932615, 941917, 925536, 946503, 960353, 954328, 911245, 870210, 886741, 921494, 943260, 922276, 883909, 886466, 923921, 934996, 920952, 904853, 936359, 949410, 942138, 926219, 927117, 938776, 929301, 914483, 921483, 944240, 950994, 919877, 914046, 941934, 969068, 968763, 985447, 969335, 960897, 977653, 973204, 978847, 971488, 936954, 910576, 878631, 858477, 870032, 893891, 909977, 911547, 925208, 945114, 945331]
20962I45331P619j9895J0331l203J0062L0035l419j4592q581k9269j4884L1702
20950I41237l461O282N615K4704j1875o172R429k7709l9591Q492J8776O566l984
20937I28309J8872j3689o305r149K6262K4776j9491m3379j7989Q636J6567J4335
20925I27755J4992J7809q584J1487K198J211J849J2476k0114k6978j4773j3769
20913I05559J0054m20k3748Q397J2286K3982m162O2L850K0345N598j70Q009l2813
20899I36829m698k1216J5207K6306K5424m6513n175K0262K9693R626o284j4830
20887I64631q073j3496K708J4656l20R759l2436l3988L0213L2559k5291l6244
20875I04678j1278J7326L6291k5985J3005Q922J6238k6193J9694K2811Q017J1607
$$ y = [945331, 952950, 933055, 943386, 940183, 950245, 980280, 976861, 962269, 953688, 924419, 909535, 941237, 937776, 944058, 949673, 974377, 962502, 956330, 965759, 938050, 898459, 906951, 925727, 932293, 928309, 947181, 933492, 927187, 918038, 944300, 969076, 949585, 906206, 888217, 896853, 913420, 927755, 942747, 960556, 951972, 963459, 965657, 966868, 968717, 981193, 961079, 934101, 919328, 905559, 915613, 915193, 891445, 899842, 912128, 936110, 931948, 932010, 935860, 956205, 961803, 961633, 969642, 936829, 932131, 910915, 926122, 952428, 977852, 931339, 926164, 946426, 976119, 985745, 979461, 964631, 956558, 943062, 945770, 960426, 960106, 969865, 937429, 903441, 933654, 966213, 940922, 904678, 893400, 910726, 947017, 921032, 934037, 942959, 959197, 933004, 952698, 975509, 983526, 995133]
20863I95133q148p42K827l8123j222J7506k006O091J302j820J2770k5096j4837
20850I43635J969j5906m4695K3282J5703q553K0962J1510j6341K263K9117K4859
20838I87805j1842k164j4075L4432O8023o334k9122k4940P634k4084l8960j0226
20826I36147K709J1470J9468k5326j462j0215r771j094J141R033K9236n666k3182
20813I32488j513m182K8661K5556K335j9432J9472j2891n230j4784j6875n43o717
20800I26345j1733j3212L511L2330k1991K0334K9000J7597j7782p98J0098J1267
20788I84966L0069L619k7393l4088j6119j4343J6387M876J3900o918J2229j1839
20776I55346K2441k2115j5438r534n796k1157J0123M9915J40m0279j3331L2870
$$ y = [995133, 986985, 986243, 989070, 950947, 949725, 967231, 965225, 971316, 972618, 970798, 983568, 958472, 943635, 945604, 929698, 885003, 908285, 923988, 915435, 936397, 947907, 931566, 933829, 962946, 987805, 975963, 973799, 959724, 994156, 1062179, 1055845, 1026723, 1001783, 1009417, 985333, 946373, 936147, 938856, 950326, 969794, 944468, 943006, 932791, 923020, 921926, 923067, 932100, 961336, 955670, 932488, 930975, 926793, 955454, 981010, 983345, 963913, 983385, 970494, 965264, 950480, 933605, 933062, 926345, 914612, 901400, 904911, 937241, 915250, 935584, 964584, 982181, 964399, 963601, 973699, 984966, 1015035, 1018654, 991261, 957173, 941054, 926711, 943098, 947974, 961874, 954956, 967185, 955346, 977787, 955672, 940234, 930700, 924904, 903747, 913870, 963785, 963925, 923646, 910315, 943185]
20764I43185L9905m645l8151j9193K2857j8633j7873k298p546J0359R922J0581
20752I28470J0723J0574K0301J2430r927M160J8073J2638j3483P965j4734k7751
20740I59439k9789Q609J2523K1216K9956J53j4300j9965N277m0664M731N6262
20728I93448K983l9294J611j197L3711J269l9320P620j229k51j7651p17J9755
20715I60738o757N542K3639j1769k2778K0442M5515J5451p728M342k5941K8309
20703A029005J7144k875k8048k0670j687J1948J6116j516Q384K1118m2736j7870
20691I88313o001l285M011K4278n986m2629j8062m3245J1945J6363K3852K9784
20679I79338J0525j6498K145K4153j6527k838j8039m422J2701K8315Q152k434
$$ y = [943185, 983090, 978445, 940294, 921101, 943958, 925325, 907452, 905154, 897608, 907967, 917889, 928470, 939193, 949767, 970068, 982498, 972571, 976731, 994804, 1007442, 993959, 1001924, 987190, 959439, 929650, 938259, 950782, 971998, 1001954, 1002107, 987807, 967842, 973119, 932455, 937186, 993448, 996431, 957137, 958748, 957551, 991262, 992531, 953211, 960831, 959602, 959351, 941700, 940983, 960738, 953981, 959523, 983162, 971393, 948615, 969057, 1014572, 1030023, 1022295, 1026637, 1000696, 1029005, 1046149, 1043274, 1015226, 994556, 992869, 1004817, 1020933, 1019417, 1027801, 1048919, 1006183, 988313, 982312, 979027, 983038, 1007316, 1001330, 958701, 940639, 897394, 909339, 925702, 949554, 979338, 989863, 973365, 975510, 999663, 983136, 980298, 962259, 957837, 970538, 998853, 1007005, 1004571]
20667A004571K230j3434M249l6721l4290R528J5281K2013O231K1865o826l9396
20655I55301j9005j410K2224J1363k665k237J8980k437K4041J8679N110l123j3214
20642A011607Q816K968j0553j0707k5585k0931L030J7105Q262L427J5921J7863
20630A021223j8091n947N3j715p926j1752j4714K2096L8845M73J638L2190q453
20617A047920l1677l608j7446P302L2369k68m2415j3815k4747o354L2388P983
20605I87632q634K7443j054j1424K9829M042j0386l6414n1482K0903K0640J5086
20593I86181J7314J82J2085K2994k660l1645J4019J5161o48j4404J7028r616k1409
20580A004582m6044O35J5831j1586n763p926R242K9700m83p812L572L968j4685
$$ y = [1004571, 1006801, 993367, 997616, 960895, 926605, 936133, 951414, 973427, 979658, 1001523, 994697, 955301, 936296, 934886, 957110, 968473, 965808, 963571, 982551, 980114, 1004155, 1022834, 1027944, 1024821, 1011607, 1020423, 1023391, 1012838, 1002131, 976546, 955615, 958645, 975750, 984012, 987439, 1003360, 1021223, 1003132, 997185, 997238, 995523, 987597, 975845, 961131, 983227, 1022072, 1022545, 1024183, 1056373, 1047920, 1016243, 1012635, 995189, 1002491, 1034860, 1034592, 992177, 978362, 953615, 947261, 979649, 987632, 978998, 1006441, 1005387, 993963, 1023792, 1027834, 1017448, 981034, 929552, 950455, 971095, 986181, 1003495, 1003677, 1015762, 1038756, 1036096, 1004451, 1018470, 1033631, 1032983, 1018579, 1035607, 1025991, 1004582, 958538, 959173, 975004, 963418, 957655, 949729, 958971, 988671, 988188, 980376, 983948, 987916, 973231]
20567I73231O019K4383M772j3759N487m679K4331J996m0961l430J2371r298K3618
20554A004081j7386q011J289p888K5551K4983m924N372l077O835Q167j0222j7262
20541A007508j9242K5737K7828j7879l2994k7332j5527K2239M285L4397M2631
20530A051651J4343k1808k0966n227j1069k991J4923J2887j7602k9285j9822k269
20518I62765R23r259J2776J3349L3921o83J5714j7089j4607K4671K0210k3195
20506A019496j4791K4932L041n858j3901K127K0576n2024l9064o553J548P656
20494I47185M1560L4675l910m9616q944M603j556K4147J6166k9416J1181M8518
20482A034593O133l1399j4248Q421L2936j045J7778j7506k3369n968K5899L5719
$$ y = [973231, 979250, 1003633, 1008405, 994646, 1000133, 995454, 1019785, 1021781, 980820, 977390, 989761, 980463, 1004081, 986695, 978684, 979973, 972085, 997636, 1022619, 1017695, 1023067, 1019990, 1026825, 1034992, 1024770, 1007508, 988266, 1014003, 1041831, 1023952, 990958, 963626, 948099, 970338, 974623, 1009020, 1051651, 1065994, 1044186, 1023220, 1017993, 1006924, 1003933, 1018856, 1031743, 1014141, 984856, 965034, 962765, 963688, 954429, 967205, 980554, 1014475, 1013792, 1029506, 1012417, 997810, 1022481, 1042691, 1019496, 1004705, 1029637, 1032678, 1026820, 1012919, 1015046, 1035622, 983598, 944534, 937981, 939529, 947185, 988745, 1023420, 1019510, 969894, 960950, 965553, 963997, 988144, 1004310, 974894, 986075, 1034593, 1040726, 1009327, 995079, 1003500, 1036436, 1035391, 1053169, 1035663, 1012294, 1006326, 1032225, 1067944]
20470A067944q24j8299j8873j9864L0389J5228l9413m5026J7272P62J4051K2235
20458A025582p796K859l4300k3421N531J4033J4064n588m010j0258J4487L4123
20446A025306K0510J7933K1172q861j8646k6579k4125Q382J9329K5367J0741k8654
20434A041875j5029p795O040j4025J0884M683J8204Q047j1231R406j5105k6367
20422A009587J2107K4840k617j0836K024J1414M93k2186j7287o775j443K089J1993
20409A013403L1499r221j0891j223l917J6729R056o371j3009k648j2292r522M147
20396A005740J4451J1118J5382L394J9329K3651j8157m3509p458K8190L82l2058
20384A020455m0810J6081M9252M3583j0623m88O325j1792k3685K764R071P290
$$ y = [1067944, 1067120, 1048821, 1029948, 1010084, 1040473, 1055701, 1016288, 971262, 988534, 989296, 1003347, 1025582, 1017786, 1020645, 986345, 962924, 968455, 982488, 996552, 990964, 986954, 976696, 991183, 1025306, 1045816, 1063749, 1084921, 1076060, 1057414, 1030835, 1006710, 1015092, 1034421, 1059788, 1070529, 1041875, 1026846, 1019051, 1025091, 1011066, 1021950, 1026633, 1044837, 1052884, 1041653, 1051059, 1035954, 1009587, 1021694, 1046534, 1043917, 1033081, 1035105, 1046519, 1047012, 1024826, 1007539, 1000764, 999321, 1001410, 1013403, 1044902, 1035681, 1024790, 1023567, 1019650, 1036379, 1045435, 1039064, 1026055, 1023407, 1011115, 1001593, 1005740, 1020191, 1031309, 1046691, 1050085, 1069414, 1093065, 1074908, 1031399, 1023941, 1052131, 1052513, 1020455, 979645, 995726, 1044978, 1088561, 1077938, 1077450, 1083775, 1071983, 1048298, 1051062, 1060133, 1067423]
20372A067423P942q163k9544j0677K013N087p81j8599K0683M0284j356j9603l2339
20359A022370j0998K2733n532m890K0000K7541K1017O61k3927k2756n518o330
20347A034371k419m730J481J0601J3522r124j8770P272j3326K6607K5829j6066
20335A055248j3437J7835m887j7967m11K1820j427m11K9023m319k0525K0080j70
20322A080452k6623k3698R553L350L8721R72j8720k9576n125J9542M550P768K4925
20309A086091q770k101N63j3519j2050O697R136j2123N286o031k4450o007K951
20296A025673K9154k4107j4647j0380J0082j0482j1416J2437J3003K91n468k266
20284A011874K4060K8530K127Q440J6701j5330k4082n45J1026K76j8814k149J2854
$$ y = [1067423, 1075365, 1067202, 1037658, 1026981, 1028994, 1034081, 1033300, 1014701, 1035384, 1075668, 1074312, 1054709, 1022370, 1011372, 1034105, 1028573, 1023683, 1043683, 1071224, 1092241, 1092902, 1068975, 1046219, 1040701, 1034371, 1031952, 1027222, 1028703, 1039304, 1052826, 1043702, 1024932, 1032204, 1018878, 1045485, 1071314, 1055248, 1041811, 1059646, 1054759, 1036792, 1036381, 1058201, 1056774, 1056363, 1085386, 1081067, 1060542, 1080622, 1080452, 1053829, 1030131, 1039684, 1043034, 1081755, 1082727, 1064007, 1034431, 1029306, 1048848, 1053398, 1061166, 1086091, 1077321, 1075220, 1075783, 1062264, 1050214, 1056911, 1066047, 1053924, 1059210, 1053179, 1028729, 1022722, 1025673, 1054827, 1030720, 1016073, 1005693, 1015775, 1005293, 993877, 1006314, 1019317, 1019608, 1014140, 1011874, 1035934, 1064464, 1066591, 1075031, 1091732, 1076402, 1052320, 1051775, 1062801, 1063077, 1044263, 1042114, 1054968]
20271A054968R11j7587K7640J83K6735N285j0832J8454j8120l1914J729J222j9044
20258A039630J2613N764j5069J182l821K4521J1847K5861J722k3558j9069K2080
20246A083703P304k285n840O567Q859j1571J4768j2805j1081j6986K2174K4887
20234A107694P211j6794O028J3846r981k1956L785J0874J7123k4527n140K366
20222A090529r933K3723J8661K15m446k0638n134r01K9099k573j5038K3811Q980
20209A136355j6141k0172j6014q874j7542J7083L5211k2099k2143j5283K3428
20198A073809K5158J2520k705m486L679Q774K5136J357k8753j7558l0438K579
20186A069072M2251K4221J726K470k1355l702R881P558l1606l139q217J883k1564
$$ y = [1054968, 1055879, 1038292, 1065932, 1066115, 1092850, 1098135, 1087303, 1105757, 1087637, 1055723, 1057452, 1058674, 1039630, 1052243, 1058007, 1042938, 1044120, 1040299, 1064820, 1076667, 1102528, 1104250, 1080692, 1061623, 1083703, 1091007, 1088722, 1082882, 1089449, 1098308, 1086737, 1101505, 1088700, 1077619, 1060633, 1082807, 1107694, 1114905, 1098111, 1104139, 1117985, 1108004, 1086048, 1089833, 1100707, 1117830, 1093303, 1088163, 1090529, 1080596, 1104319, 1122980, 1123195, 1118749, 1098111, 1092977, 1092076, 1121175, 1118602, 1103564, 1127375, 1136355, 1120214, 1100042, 1084028, 1075154, 1057612, 1074695, 1109906, 1087807, 1065664, 1050381, 1073809, 1098967, 1111487, 1108782, 1104296, 1107975, 1116749, 1141885, 1143242, 1114489, 1096931, 1066493, 1069072, 1111323, 1135544, 1137270, 1139740, 1118385, 1114683, 1124564, 1132122, 1100516, 1097377, 1089160, 1091043, 1069479]
20173A069479J4303j3443n127o263K2655L8782J2851j0715j2841j9613j6157R99
20161A074910p367K5277J9860J3992K0320o683k8048j8167q741J8217M765l18
20149A108017l4985k126J6904o865K9062J95k5223N558J2131l667j4119L883L1117
20136A119882J0918m6423k4252K091L2496N2914N629k7171j4455M298L3031k2000
20124A126958j5582j2468K3747r141J4125j5352j262k2371J2740j6546J0638O279
20112A101765K1619J4602q205j8588l760j2995k3340K194O323j9317j1482r712
20100A039104L3660J9261O965L666J4670l588k9791n064K2428P563j6074J314
20088A094114J1638J107o678J1298J060j8917J38k4628k348M066K0455q074J1579
$$ y = [1069479, 1083782, 1070339, 1065212, 1058949, 1081604, 1120386, 1133237, 1122522, 1109681, 1090068, 1073911, 1074910, 1067543, 1092820, 1112680, 1126672, 1146992, 1140309, 1112261, 1094094, 1085353, 1103570, 1108335, 1108017, 1073032, 1070906, 1087810, 1080945, 1110007, 1110202, 1084979, 1090537, 1102668, 1099001, 1084882, 1088765, 1119882, 1130800, 1084377, 1060125, 1062216, 1094712, 1147626, 1153255, 1126084, 1111629, 1115927, 1148958, 1126958, 1111376, 1098908, 1122655, 1113514, 1127639, 1112287, 1111025, 1088654, 1101394, 1084848, 1095486, 1101765, 1123384, 1137986, 1129781, 1111193, 1107433, 1094438, 1071098, 1073292, 1079615, 1060298, 1048816, 1039104, 1072764, 1092025, 1098990, 1102656, 1117326, 1113738, 1083947, 1078883, 1101311, 1108874, 1092800, 1094114, 1105752, 1106859, 1100181, 1111479, 1112539, 1093622, 1093760, 1069132, 1066784, 1070850, 1091305, 1083231, 1094810]
20075A094810L1786K4177l8378m4736p956J4384K7420J4871j4285k7409L9126
20064A113810M4288N937k6451o384K297k1553j1027N427j2352K4368J9761j2366
20052A125755k1465N243R294p540r36J7680J4583O943m9944j3075J9873K9793
20040A136204J7161j8940R647o151j0435K2128M981j8155L416K5517k873j802
20028A160698j0728J1838k4990L389j4893k0500l630q337N115J836j4884k6135
20016A058779j2628J4167N709L2354J6879K866O722j2836l1406n538O21P983J4292
20003A097964k2800K7775P124L2817O188l1413J8146L317k5374j3236L3876M2318
19991A176702j9690k2786Q7r437j7836l1027J6628M4688K4162o953k1387n698
$$ y = [1094810, 1126596, 1150773, 1112395, 1067659, 1059703, 1074087, 1101507, 1116378, 1102093, 1074684, 1113810, 1158098, 1164035, 1137584, 1131200, 1133497, 1111944, 1100917, 1106344, 1093992, 1118360, 1138121, 1125755, 1104290, 1109533, 1118827, 1111287, 1110351, 1128031, 1142614, 1149557, 1099613, 1086538, 1106411, 1136204, 1153365, 1134425, 1144072, 1137921, 1127486, 1149614, 1154595, 1136440, 1139856, 1165373, 1162500, 1160698, 1149970, 1161808, 1136818, 1140207, 1125314, 1104814, 1101184, 1092847, 1097962, 1099798, 1084914, 1058779, 1046151, 1060318, 1066027, 1098381, 1115260, 1118126, 1124848, 1112012, 1080606, 1075068, 1075689, 1083672, 1097964, 1075164, 1102939, 1110063, 1142880, 1149068, 1117655, 1135801, 1139118, 1113744, 1100508, 1134384, 1176702, 1157012, 1134226, 1134313, 1124876, 1107040, 1076013, 1092641, 1137329, 1161491, 1154538, 1133151, 1127453]
19979A127453j1742M1893M529j5043k806m9P503n513k6936q354k1044K1353J0652
19966A121896J7549K9184K3931K55m423j3221r658k9515J8101J3355r099l0770
19954A127585l8793j4995K7910n687l9504K9136N1880J5513R91r234K1070P215
19942A173087j6385j7156j3286J094k3362q607K3161K6460K4566L2001j1936k5978
19930A163659J5098J3298l0375k0431J4429J0925q805O831K7244P885k529j9011
19918A178218j1431j4849k9440j9798J1008M2229K5334J4691J8057j6166m3509
19907A154344l1055k2120n924K7824R040K4003J8757J1107O687j9232j3825l0769
19895A128837K6662J8150j4032k5795L3097k817k0177j9209o164J0927K8400L061
$$ y = [1127453, 1115711, 1157604, 1162133, 1147090, 1144284, 1144235, 1151738, 1146225, 1119289, 1110935, 1089891, 1111244, 1121896, 1139445, 1168629, 1192560, 1192815, 1188392, 1175171, 1165513, 1135998, 1154099, 1167454, 1158355, 1127585, 1088792, 1073797, 1101707, 1096020, 1056516, 1085652, 1137532, 1153045, 1154036, 1144802, 1165872, 1173087, 1156702, 1139546, 1126260, 1127354, 1103992, 1095385, 1118546, 1145006, 1169572, 1201573, 1189637, 1163659, 1178757, 1192055, 1161680, 1141249, 1155678, 1166603, 1157798, 1164629, 1191873, 1199758, 1197229, 1178218, 1166787, 1151938, 1122498, 1102700, 1113708, 1155937, 1181271, 1195962, 1214019, 1197853, 1154344, 1123289, 1101169, 1095245, 1123069, 1132109, 1156112, 1174869, 1185976, 1192663, 1173431, 1159606, 1128837, 1155499, 1173649, 1159617, 1133822, 1166919, 1164102, 1143925, 1124716, 1118552, 1129479, 1157879, 1160940]
19883A160940m702J8133M302j831p790K616p886k7836J9092K0158K9515O875j6347
19870A195239l3946k5411J8205K0500J6426j3630j9761q766M0890J929k2418k9200
19858A140057K3012J5172p8K5399N398J0770r649j0874J2866J512k9272J322K5222
19845A210857q150k524J1918r039J6533q325n894L077l354l4564L710N975J712
19832A181932J3436l166m355M705M324k7105l4000j29K9036P411L2890M340k1651
19819A187668j9500k6467J61J4072J6734r884n23K2687k763M624J7727J2208k9217
19806A187527K7621J8754r227J233M362q749p674J5157k1550k3510n8l618q538
19793A171730J4541K1214K4678j5150j4752p517j422J9795j1285P195J3015K5138
$$ y = [1160940, 1156238, 1174371, 1178673, 1176842, 1169052, 1171668, 1163782, 1135946, 1155038, 1175196, 1204711, 1211586, 1195239, 1161293, 1135882, 1154087, 1174587, 1191013, 1177383, 1157622, 1148856, 1189746, 1191675, 1169257, 1140057, 1163069, 1178241, 1178163, 1203562, 1208960, 1219730, 1210081, 1199207, 1212073, 1213585, 1184313, 1185635, 1210857, 1202707, 1200183, 1212101, 1203062, 1219595, 1211270, 1205376, 1208453, 1205099, 1170535, 1174245, 1180220, 1181932, 1195368, 1192202, 1187847, 1192552, 1196876, 1169771, 1135771, 1135642, 1164678, 1172089, 1204979, 1209319, 1187668, 1168168, 1141701, 1141862, 1155934, 1172668, 1162784, 1162261, 1184948, 1182185, 1186809, 1204536, 1216744, 1187527, 1215148, 1233902, 1224675, 1225908, 1230270, 1221521, 1213847, 1229004, 1207454, 1183944, 1183886, 1180268, 1171730, 1186271, 1207485, 1232163, 1217013, 1202261, 1194744, 1193322, 1213117, 1201832, 1209027, 1222042, 1247180]
19781A247180r505l912J1941m7709k6823q820J2015J8401K4735o13k4387P579
19769A200082K0627n253r933r768J9190j4551j5480m313j0073K8109K2216r52
19757A219901M532J9069o263j0882l0069j234Q823p710j2012q41j56J3045J5824
19744A212027J322N442j752j0877j9111K7790O538j5905K6251O538L80O480m227
19731A240896J7184l784j5387j1191J442K6514j5995J7972j825l3043j7192O997
19719A212588k178j3186J3074K4131K2382R505k9503j9240k4183r661L2613M8224
19707A264566j2636l9797J1071K6213J2424k4730l5152k2336k5446K1682J9857
19696A195716j4748J9313Q007J1995q380J3421J0875m79p277m384j4777M0318
$$ y = [1247180, 1237675, 1233763, 1245704, 1197995, 1171172, 1162352, 1174367, 1192768, 1217503, 1216890, 1192503, 1200082, 1220709, 1215456, 1205523, 1195755, 1214945, 1200394, 1184914, 1180601, 1170528, 1198637, 1220853, 1219901, 1224433, 1243502, 1237239, 1226357, 1196288, 1195054, 1203877, 1196167, 1184155, 1183314, 1183158, 1196203, 1212027, 1213349, 1218791, 1217039, 1206162, 1187051, 1214841, 1221379, 1205474, 1231725, 1238263, 1238643, 1245123, 1240896, 1258080, 1254296, 1238909, 1227718, 1229160, 1255674, 1239679, 1257651, 1255826, 1222783, 1205591, 1212588, 1210410, 1197224, 1210298, 1234429, 1256811, 1266316, 1236813, 1217573, 1193390, 1183729, 1216342, 1264566, 1251930, 1212133, 1223204, 1249417, 1261841, 1237111, 1201959, 1179623, 1154177, 1175859, 1195716, 1180968, 1200281, 1208288, 1220283, 1211903, 1225324, 1236199, 1235720, 1228443, 1224059, 1209282, 1249600]
19684A249600M689k6363j2860O09J6850k2900q389n767K3246L7661m826k5754
19672A225796P926r996j7788L0755K3223k9472k7116j1928L5307K4938M349J0571
19660A266565p888k9401k5655M154K0888j949j2835l0695j5525R867N4265J4044
19648A245835J083l230J5843K2052r143j030j7557p849M445r093j4047K5959K4797
19635A278065k4530k4460J9693J6077K5425j0449j3479k5691j8999J2683K3880
19624A258215P121j4453j5255j4897J7651J0245o936q194o238R90j6010O221P605
19611A226065R103P30M0849K5974k0277l2616o647l2827k764J5678K7231K5730
19599A276229J4564K022j0178l2482j2233J6934r454n229l2132p5J2685K4399
$$ y = [1249600, 1254289, 1227926, 1215066, 1215675, 1232525, 1209625, 1201236, 1195469, 1218715, 1256376, 1251550, 1225796, 1233722, 1223726, 1205938, 1236693, 1259916, 1230444, 1203328, 1191400, 1226707, 1251645, 1255994, 1266565, 1258677, 1229276, 1203621, 1207775, 1228663, 1226714, 1213879, 1183184, 1167659, 1177526, 1231791, 1245835, 1246918, 1243688, 1259531, 1281583, 1272440, 1271410, 1253853, 1246004, 1250449, 1241356, 1227309, 1253268, 1278065, 1253535, 1229075, 1248768, 1264845, 1290270, 1279821, 1266342, 1240651, 1221652, 1234335, 1258215, 1265336, 1250883, 1235628, 1220731, 1238382, 1248627, 1241691, 1233497, 1227259, 1228249, 1212239, 1218460, 1226065, 1235168, 1235898, 1276747, 1302721, 1282444, 1249828, 1243181, 1210354, 1207590, 1223268, 1250499, 1276229, 1290793, 1292815, 1282637, 1250155, 1237922, 1254856, 1245402, 1240173, 1208041, 1207966, 1220651, 1245050]
19587A245050K2686n275j714J3197Q597P698l871l2168j0806p24J2641k3272L9856
19574A271895M4256Q421m4052k4297K311L7243J8752l0660j4339j7188j38J4750
19562A266954j4958j9503J4450L3219K1833m4040l6276j3058J732P636K7084L1778
19550A276851n421l8224k2718J0869O735L5730R602j1891k5613J6610j5178N201
19538A242553K1789m705P5k446J1348k042J0868j909j0625R268j795j8265J9583
19525A273697L1477J5701j6544L429P202k9575j9257m7408K103K8352J9878J3695
19513A282750K5021P166o709K5905j7493J2j0044K3813Q435l9394j1207J3260
19501A301515K6398K8182q797l5589k3733j8097J1203p923j4968J777J1954J222
$$ y = [1245050, 1267736, 1262461, 1260747, 1273944, 1282541, 1290239, 1286368, 1254200, 1243394, 1242670, 1255311, 1232039, 1271895, 1316151, 1324572, 1280520, 1256223, 1258534, 1295777, 1314529, 1283869, 1269530, 1252342, 1252204, 1266954, 1251996, 1232493, 1246943, 1280162, 1301995, 1257955, 1221679, 1208621, 1210353, 1217989, 1245073, 1276851, 1271430, 1233206, 1210488, 1221357, 1228092, 1263822, 1273424, 1261533, 1235920, 1252530, 1237352, 1242553, 1264342, 1259637, 1259712, 1257266, 1268614, 1266572, 1277440, 1275531, 1264906, 1274174, 1272379, 1254114, 1273697, 1305174, 1320875, 1304331, 1307760, 1314962, 1285387, 1266130, 1218722, 1220825, 1249177, 1269055, 1282750, 1307771, 1314937, 1308228, 1334133, 1316640, 1316652, 1306608, 1330421, 1338856, 1299462, 1288255, 1301515, 1327913, 1356095, 1347298, 1311709, 1287976, 1269879, 1281082, 1273159, 1258191, 1259968, 1271922, 1273144]
19489A273144j1914J5611J0066k5070J6889P030N340j048o558K5634k4131j5304
19477A269689m761J0667K3660L496K4801j7790r810J1637K6686J9604k2196l0561
19465A305122J1182J7206j7340k4603K7040J7935p472K7k5967j0421k0047J9494
19453A292156L4254k3256l0771p029K3522J7522L706j9151m639Q535K6556q258
19441A313147m238n383J7404J0475j0415j1914j603j9237J7824Q226j756j8033
19429A294497P058N9117Q093n948k7451l4278M267O010j3132j8965Q269L5473
19417A323010k340k6352o403N743k188L0063K0812j5404j2060j2353R787K9107
19405A341422m635j6624k1006P241J5067k011l1332k2640N3639K5909j3503n520
$$ y = [1273144, 1261230, 1276841, 1286907, 1261837, 1278726, 1285756, 1291096, 1290048, 1283490, 1309124, 1284993, 1269689, 1264928, 1275595, 1299255, 1302751, 1327552, 1309762, 1299952, 1311589, 1338275, 1357879, 1335683, 1305122, 1316304, 1333510, 1316170, 1291567, 1318607, 1336542, 1329070, 1329097, 1303130, 1292709, 1272662, 1292156, 1326410, 1303154, 1272383, 1265354, 1288876, 1306398, 1310104, 1290953, 1286314, 1294849, 1321405, 1313147, 1308909, 1303526, 1320930, 1331405, 1320990, 1309076, 1307473, 1288236, 1306060, 1314286, 1312530, 1294497, 1301555, 1360672, 1368765, 1362817, 1335366, 1301088, 1305355, 1311365, 1298233, 1279268, 1287537, 1323010, 1320670, 1294318, 1287915, 1293658, 1291470, 1321533, 1342345, 1326941, 1314881, 1302528, 1312315, 1341422, 1336787, 1320163, 1299157, 1306398, 1321465, 1319454, 1288122, 1265482, 1319121, 1345030, 1331527, 1326007]
19393A326007J8200o291o872j1270r878l212K826M2543L4480k9919m5836k2375
19381A288403J5474R226k4473P186J1058J2031N394K2929k764p760l599O662O842
19368A346609O505q054J9031L1137J7560k0689j4303J7197k3114l957j3046l9822
19356A315054Q899p870r115l803k790l840J8456K9631K2427j5460N37L6512L0471
19343A419109l0024l7805M357J6254k088j5846j9408O156K1990J3016j7360J042
19331A359393O109K5535k396J2724K288j7933l585K6366J3034p229K3155Q818
19319A446279L116j1511j5846N14j7016j7517M107R623J8905J585K4054k6866
19307A419427k3921j6955K8125n584l3266J7356n621j6017j4677k3442K239q083
$$ y = [1326007, 1344207, 1337916, 1331044, 1319774, 1309896, 1306684, 1309510, 1352053, 1386533, 1356614, 1310778, 1288403, 1303877, 1313103, 1288630, 1295816, 1306874, 1318905, 1324299, 1347228, 1344464, 1336704, 1333105, 1339767, 1346609, 1353114, 1345060, 1364091, 1395228, 1412788, 1392099, 1377796, 1394993, 1371879, 1367922, 1354876, 1315054, 1323953, 1316083, 1306968, 1303165, 1300375, 1296535, 1314991, 1344622, 1367049, 1351589, 1352126, 1388638, 1419109, 1389085, 1351280, 1355637, 1371891, 1369803, 1353957, 1334549, 1340705, 1362695, 1375711, 1358351, 1359393, 1365502, 1391037, 1388641, 1401365, 1403653, 1385720, 1382135, 1408501, 1421535, 1414306, 1437461, 1446279, 1449395, 1437884, 1422038, 1422552, 1405536, 1388019, 1392126, 1401749, 1420654, 1422239, 1446293, 1419427, 1395506, 1378551, 1406676, 1401092, 1367826, 1385182, 1379561, 1363544, 1348867, 1325425, 1327664, 1319581]
19295A319581j7181k054o132J0248M92O192K0414K7280j0282l3693k2496J3479
19283A305848J8490O317J1304K647J3147R53j2625q495L140m114K2895J8202R91
19270A378700k0640j057K9692k7595P383k649l2909j6070L1147J7786j7182J1878
19258A358484L2423k4108k4669j6448L901J4783K8432J4375l413J0533m775j5537
19246A373981r327o58J4706J3776j7187Q735K1905K073p990m162j2319l1109P301
19233A359725M7654K9190n431r088n922k3627J193q203r937j551j5049j2224O48
19220A347378K0519P94o665J2478J0523K228P129p087r104J2598j694m890K5345
19207A409552J4963q645N150m75M17P464n496j6191q335N747P115j5083J1933
$$ y = [1319581, 1302400, 1300346, 1294214, 1304462, 1304954, 1311146, 1331560, 1358840, 1348558, 1314865, 1292369, 1305848, 1324338, 1330655, 1341959, 1344606, 1357753, 1358706, 1346081, 1337586, 1340726, 1336612, 1359507, 1377709, 1378700, 1358060, 1357003, 1386695, 1359100, 1366483, 1363834, 1330925, 1314855, 1346002, 1363788, 1346606, 1358484, 1390907, 1366799, 1342130, 1325682, 1329583, 1344366, 1372798, 1387173, 1383760, 1394293, 1389518, 1373981, 1364654, 1363996, 1378702, 1392478, 1375291, 1384026, 1405931, 1408004, 1400014, 1395852, 1383533, 1352424, 1359725, 1407379, 1436569, 1431138, 1422050, 1416128, 1392501, 1393694, 1385491, 1375554, 1374003, 1358954, 1346730, 1347378, 1367897, 1368691, 1362026, 1374504, 1385027, 1387255, 1394384, 1387297, 1378193, 1390791, 1389097, 1384207, 1409552, 1424515, 1415870, 1421020, 1420545, 1420962, 1428426, 1422930, 1406739, 1398404, 1404151, 1411266, 1396183, 1408116]
19194A408116J3992K8642N622k5618n658m6669J5646K0719j8495j8139j4381P348
19182A371125P898K8246J8001j0115O771L2596Q882r076l8129P881Q879j4155
19170A418804n947J4148J3702k2871k6393J7470L530j3467k1867J9813J4621N6
19158A411599j7286Q393L127j6690j1900L0568L4651j6703k37j5493m243O802
19146A412588J9979k3887m3J603L3907M3675J0214j0269l4948j4158L957l6119
19134A406499j3214J0517L1161j9565l4019K5534L4480j5856L169L5829k7816
19123A436719j6667N136l108j3048M095k0605L16O009l818j8741R186M7447L472
19110A436393n149L1306J900k140J4796J4748O687k5749k8140J9563p46Q86j8746
$$ y = [1408116, 1422108, 1450750, 1456372, 1430754, 1425096, 1378427, 1394073, 1414792, 1396297, 1378158, 1363777, 1371125, 1379023, 1407269, 1425270, 1415155, 1421926, 1454522, 1463404, 1454328, 1416199, 1424080, 1432959, 1418804, 1412857, 1427005, 1440707, 1417836, 1391443, 1408913, 1412443, 1398976, 1377109, 1396922, 1411543, 1411599, 1394313, 1402706, 1405833, 1389143, 1377243, 1407811, 1442462, 1425759, 1425522, 1410029, 1405786, 1412588, 1432567, 1408680, 1408637, 1410240, 1444147, 1487822, 1498036, 1487767, 1452819, 1438661, 1442618, 1406499, 1393285, 1403802, 1434963, 1415398, 1381379, 1406913, 1441393, 1425537, 1428706, 1464535, 1436719, 1420052, 1425188, 1422080, 1409032, 1413127, 1392522, 1392838, 1398847, 1395029, 1376288, 1385474, 1432921, 1436393, 1431244, 1462550, 1464450, 1462310, 1477106, 1491854, 1498541, 1472792, 1444652, 1464215, 1463469, 1464355, 1445609]
19097A445609o59N875J6543K2585k4736j9028L1278Q512k7525j6522K4060K1511
19085A487503J002m516M247k0092P244K7372J9751k1657r383J0866p378j5607
19073A479352J7331J5292j0941k9914M85m547K2471K4619j2789q762J0789K0142
19061A523528J1843k3689j7012l6578P920q818j8381K6465K3147k9558o69J2338
19049A470536K1257K6478J6339j2359k4423n727l3843j7275K1014K6541J933N351
19037A495822R000L7668k1200l5644J4492k4601l476J6221k7862k5104J4117J3107
19025A462540j5500L384K4041K1082J0901j2878j8366j4232K1269L4439n0841
19014A465839k9548K3607Q019j2101k1462M959J5005K3993J1670p413J9405L3251
$$ y = [1445609, 1444950, 1450825, 1467368, 1489953, 1465217, 1446189, 1477467, 1485979, 1458454, 1441932, 1465992, 1487503, 1488505, 1483989, 1488236, 1468144, 1475388, 1502760, 1522511, 1500854, 1491471, 1502337, 1494959, 1479352, 1496683, 1511975, 1501034, 1471120, 1471605, 1467058, 1489529, 1514148, 1501359, 1492597, 1503386, 1523528, 1535371, 1511682, 1494670, 1458092, 1466012, 1457194, 1438813, 1465278, 1488425, 1458867, 1458198, 1470536, 1491793, 1518271, 1534610, 1522251, 1497828, 1492101, 1458258, 1440983, 1461997, 1488538, 1490471, 1495822, 1504822, 1542490, 1521290, 1485646, 1500138, 1475537, 1472061, 1488282, 1460420, 1435316, 1449433, 1462540, 1447040, 1450424, 1474465, 1495547, 1506448, 1493570, 1475204, 1460972, 1482241, 1516680, 1465839, 1436291, 1459898, 1467917, 1455816, 1434354, 1439313, 1454318, 1478311, 1489981, 1482568, 1501973, 1535224]
19002A535224j2917j3337q194k8418j6664M327n500K6357L3338j8673K1630J9592
18990A536765p409k4569j143K03j500M150N276j400j8687m1083j6381K8784K1385
18977A484391M565J7468J1971P402o956P543N473o00n751k2405j6369L2941K8824
18964A548497l960q330K88k3398P531J9338K1349l717L522r915J1560K1917K381
18951A587063n3192l2858J4097J5028r962k2695j549K5138j7089M93K9615P560
18939A541649J3885M467J8106l8807o038K2708K0963j4434j6879K2811L6149l0000
18927A574580k2071K4725J0976P069K402m3485j6391k374P279J3075k5492k670
18915A527623K2725L8033Q508r330J100k2001l612Q496M52M3236m817J0196J892
$$ y = [1535224, 1522307, 1508970, 1500776, 1472358, 1455694, 1460021, 1454521, 1480878, 1514216, 1495543, 1517173, 1536765, 1529356, 1504787, 1503644, 1503847, 1502347, 1506497, 1511773, 1510373, 1491686, 1450603, 1434222, 1463006, 1484391, 1488956, 1506424, 1518395, 1525797, 1518841, 1526384, 1531857, 1531257, 1525506, 1503101, 1486732, 1519673, 1548497, 1544537, 1536207, 1536495, 1513097, 1520628, 1539966, 1561315, 1557598, 1561120, 1551205, 1562765, 1584682, 1587063, 1533871, 1501013, 1515110, 1530138, 1520176, 1497481, 1495932, 1521070, 1503981, 1504474, 1534089, 1541649, 1555534, 1560001, 1578107, 1539300, 1533262, 1555970, 1576933, 1562499, 1545620, 1568431, 1604580, 1574580, 1552509, 1577234, 1588210, 1595279, 1597681, 1554196, 1537805, 1535431, 1542710, 1555785, 1530293, 1527623, 1550348, 1588381, 1596889, 1587559, 1588659, 1566658, 1563046, 1571542, 1571994, 1615230, 1610413, 1620609, 1622501]
18902A622501j4581j3138J3403L154J7763j284J2859L445j3793j4243j4850r815
18890A591421K8007J7517O502R522r253N915k5337l1604j0550q822l853L1191
18878A600656q853l1244j6130n854m956N0023K582j1347J6913p5n792n729p574
18865A572620N490L5606M879J1180j4890k5386L3318Q771J5284K8357K084j6523
18853A660790Q461L387N302j8351j5865m531o286p641j7057j9844p755L2483J8219
18840A631312j0773K0630L1923J518l0405M713k22k8454j7424O037J0749O1j0982
18827A608683K0166n032j6889R185J6545k5022j1653J1525k0313J78J1599J8839
18815A617811R840L1749J9892j5043k1267K1087K9700k8145k6243P408J3472k3222
$$ y = [1622501, 1607920, 1594782, 1608185, 1611339, 1629102, 1627818, 1640677, 1644122, 1630329, 1616086, 1601236, 1591421, 1619428, 1636945, 1643447, 1652969, 1643716, 1649631, 1624294, 1592690, 1582140, 1573318, 1569465, 1600656, 1591803, 1560559, 1544429, 1538575, 1533619, 1583642, 1586224, 1574877, 1591790, 1591715, 1585923, 1580194, 1572620, 1578110, 1613716, 1618595, 1629775, 1614885, 1589499, 1622817, 1631588, 1646872, 1675229, 1677313, 1660790, 1669251, 1672638, 1677940, 1659589, 1643724, 1639193, 1632907, 1625266, 1608209, 1588365, 1580610, 1613093, 1631312, 1620539, 1641169, 1673092, 1674610, 1644205, 1648918, 1648696, 1620242, 1602818, 1608855, 1619604, 1619665, 1608683, 1628849, 1623817, 1606928, 1616113, 1632658, 1607636, 1595983, 1607508, 1587195, 1587373, 1598972, 1617811, 1627651, 1659400, 1679292, 1664249, 1642982, 1664069, 1693769, 1665624, 1639381, 1646789, 1660261, 1637039]
18803A637039m435l382k5364N970L4462J1718j82J0789j016j3553R079r24J2710
18790A672911R083k3031P530J4136O058J8604Q028J9926M5197J985O693j4341
18778A772779k7044J5630J7125J4171j1966l6385j0344j1207M1530J4979J535
18767A780803J9130K2623o579q4110j38073o9309J6501P728K0699J1659K1257
18756A602329J845R972N336O304k7779m700n562J3782L4048J8065J8117J5665
18744A687422k7054k844m0k663N126M1o873R960l886L515K3838K1596j0216l1840
18730A666082n770M345N343P285O919k0000k050k0753L0291K1662o793J074L7767
18717A725402K6122n572l3054j8646R145Q89J593J8361O908p291L5698J4028k8107
$$ y = [1637039, 1632604, 1629222, 1603858, 1609828, 1644290, 1656008, 1655826, 1666615, 1665599, 1652046, 1661125, 1660201, 1672911, 1681994, 1658963, 1666493, 1680629, 1686687, 1705291, 1713319, 1733245, 1778442, 1780427, 1787120, 1772779, 1745735, 1761365, 1778490, 1792661, 1780695, 1744310, 1733966, 1722759, 1764289, 1779268, 1780803, 1799933, 1822556, 1815977, 1731867, 1593794, 1524485, 1540986, 1548714, 1569413, 1581072, 1602329, 1604174, 1614146, 1619482, 1625786, 1598007, 1593307, 1587745, 1601527, 1635575, 1653640, 1671757, 1687422, 1660368, 1657524, 1657484, 1654821, 1659947, 1659988, 1653115, 1663075, 1659189, 1662704, 1686542, 1708138, 1697922, 1666082, 1660312, 1664657, 1670000, 1677285, 1684204, 1664204, 1662154, 1641401, 1671692, 1693354, 1686561, 1687635, 1725402, 1751524, 1745952, 1712898, 1694252, 1703397, 1704286, 1705879, 1724240, 1731148, 1723857, 1759555, 1773583, 1745476]
18704A745476m4367j1245N564K43J3387j197j5516Q393J8878P193K0643K4319
18692A771771l492J999j7523k6669r555J9257R205L079m350J3384k0851J109M6610
18679A783974L732j8911k6685r03l830k347N158Q293M862p9j6001j2416J2016
18666A736863L3073R156j4150L685J0568p919m306j9417n321j2779j8122R506
18654A720837M6655L2487Q497n523J7145K0776k1155k4990j4529Q063J1401L3588
18642A833252q281l1043l0507J237K6156r178k6810J6221P644l0691l386K3419
18630A768033L1585N527j2425j0252K269K925L3155L614q595l113P977J3893M336
18617A838929j1375k3349j0746k688K9319J3559j3653Q355q018R750J5288p136
$$ y = [1745476, 1701109, 1689864, 1695428, 1695671, 1709058, 1707861, 1692345, 1700738, 1719616, 1726809, 1747452, 1771771, 1768279, 1770278, 1752755, 1726086, 1716531, 1735788, 1744993, 1748072, 1743722, 1757106, 1736255, 1737364, 1783974, 1787706, 1768795, 1742110, 1741207, 1737377, 1735030, 1740188, 1748481, 1753343, 1753264, 1737263, 1724847, 1736863, 1769936, 1779092, 1764942, 1768627, 1779195, 1771276, 1766970, 1747553, 1742232, 1729453, 1711331, 1720837, 1767492, 1799979, 1808476, 1802953, 1820098, 1840874, 1819719, 1794729, 1780200, 1788263, 1799664, 1833252, 1824971, 1793928, 1763421, 1764658, 1790814, 1781636, 1754826, 1771047, 1778691, 1748000, 1744614, 1768033, 1799618, 1805145, 1792720, 1782468, 1784737, 1787662, 1820817, 1824431, 1815836, 1812723, 1820700, 1834593, 1838929, 1827554, 1804205, 1793459, 1790771, 1820090, 1833649, 1819996, 1828351, 1820333, 1830083, 1845371, 1838235]
18605A838235J9818k615J0849K9442K814J8848j9967m4723k0328j5135K9528N135
18593A851901o258P867r495k4427j7773J1325L460j1376k5821J3136l418n397
18581A783724P454J9011K5647j62K1040k631j160J2127l261L966J7547l488K9472
18568A909286J0002L853l7483n005j4124k6243j2321M88M050K0471p636K8718
18556A874056j1327k3301m517M670J6494J7106J1059m846N334j1541J0582L626
18544A887395K5018O76p775Q225j3878R510K3917k8439l3156L030L0057M0989
18532A945569R741k6262J0502O305J8163j1322M043N91l2305L246J9557M737M087
18519A956652j0416R60m4117k8811J4985J6165M4782l34P309o910k5548r036L0110
$$ y = [1838235, 1858053, 1855438, 1866287, 1895729, 1898543, 1917391, 1897424, 1852701, 1832373, 1817238, 1846766, 1851901, 1845643, 1853510, 1844015, 1819588, 1801815, 1813140, 1816600, 1805224, 1779403, 1792539, 1789121, 1783724, 1791178, 1810189, 1835836, 1835674, 1856714, 1854083, 1852923, 1865050, 1861789, 1865755, 1883302, 1879814, 1909286, 1919288, 1923141, 1885658, 1880653, 1866529, 1840286, 1827965, 1828453, 1832503, 1852974, 1845338, 1874056, 1862729, 1839428, 1834911, 1839581, 1856075, 1873181, 1884240, 1879394, 1884728, 1873187, 1883769, 1887395, 1912413, 1913089, 1905314, 1913539, 1899661, 1909171, 1933088, 1904649, 1871493, 1874523, 1904580, 1945569, 1955310, 1929048, 1939550, 1945855, 1964018, 1952696, 1956739, 1957330, 1925025, 1928271, 1947828, 1952565, 1956652, 1946236, 1947196, 1903079, 1874268, 1889253, 1905418, 1950200, 1949866, 1957175, 1950265, 1924717, 1915681, 1945791]
18506A945791J7514m815K0815J0625j3888Q531m555K4933L2673k101k0384k8941
18494A986198j4415k0065J9342N513j6520j571j5542J689J2229P344K2868O210
18482A993280l1270Q319J3808J8909L107r325K0228J4075q800j8012j887n055
18470A997377q837j4224J0458j6661k8613J9376M6648J8382J7254m204j6234j5109
18458B005613l870J2803j3500r854J2733J7123J2420j1061j4585p837j5802J1417
18446A995600K1414K3935L3646k8384j2410k6156N174L9102J1114J007K2008Q55
18434B086905j6486o873k690J2147J7671j7236k285j1808K15j3237k366Q252R089
18421B061298J9499M10O243Q689k3697j3607J5386O342K3740N3064k425k0594
$$ y = [1945791, 1963305, 1958490, 1979305, 1989930, 1976042, 1984573, 1980018, 2004951, 2037624, 2035523, 2015139, 1986198, 1971783, 1951718, 1971060, 1976573, 1960053, 1958482, 1942940, 1944629, 1956858, 1964202, 1987070, 1993280, 1962010, 1970329, 1984137, 2003046, 2006153, 1996828, 2017056, 2031131, 2022331, 2004319, 2002432, 1997377, 1988540, 1974316, 1984774, 1968113, 1939500, 1958876, 2005524, 2023906, 2041160, 2036956, 2020722, 2005613, 2001743, 2014546, 2001046, 1991192, 2003925, 2021048, 2033468, 2022407, 2007822, 1999985, 1984183, 1995600, 2017014, 2040949, 2074595, 2046211, 2033801, 2007645, 2012819, 2051921, 2063035, 2064042, 2086050, 2086905, 2070419, 2063546, 2060856, 2073003, 2090674, 2073438, 2071153, 2059345, 2059560, 2046323, 2043957, 2052209, 2061298, 2080797, 2081207, 2087450, 2096139, 2072442, 2058835, 2074221, 2080563, 2104303, 2157367, 2154942, 2134348]
18409B134348j4260L7j0128J0746K9236l360O011k441k4044p986O494J4774j1557
18396B127870L4014m659k7784n839K870J8851j0415o164J8184j133K3039J9306
18384B188140N598Q532J3243J0903k5917Q714K3071j1777K087j2812l63M685m13
18371B213691J062p208J9816K0977l4569p850j1260K8483M62J4791Q592p63J8041
18358B264265l284K2730J7605j7751j6118j5026P968J084K727O646q202L726n265
18345B261105J2726K1595R113K5461j5909m002j1965k7186l5002Q11J3003J4245
18333B263995J1260Q198L0818L1047K2833p897o708M0391K6104j2964n888k709
18321B398480O706k5974m7726N287K6345J4374L3063J9310n944k5847M084K4344
$$ y = [2134348, 2120088, 2120125, 2109997, 2120743, 2149979, 2146619, 2152630, 2150189, 2126145, 2118159, 2124653, 2139427, 2127870, 2161884, 2157225, 2129441, 2123602, 2126472, 2145323, 2134908, 2128744, 2146928, 2145795, 2168834, 2188140, 2193738, 2202270, 2215513, 2226416, 2200499, 2209213, 2232284, 2220507, 2222594, 2209782, 2209419, 2214104, 2213691, 2214753, 2207545, 2227361, 2248338, 2213769, 2205919, 2194659, 2223142, 2223604, 2238395, 2246987, 2246224, 2264265, 2260981, 2283711, 2301316, 2283565, 2267447, 2252421, 2260389, 2261473, 2264200, 2270846, 2262644, 2266370, 2261105, 2273831, 2295426, 2304539, 2330000, 2314091, 2310089, 2298124, 2270938, 2235936, 2236747, 2249750, 2263995, 2275255, 2283453, 2314271, 2345318, 2368151, 2360254, 2353546, 2393937, 2420041, 2407077, 2401189, 2398480, 2405186, 2379212, 2331486, 2336773, 2363118, 2377492, 2410555, 2429865, 2423921, 2398074, 2402158, 2426502]
18309B426502O700J22l5323j0486l861K9326K9708n570j3436J806k524K3268K7028
18296B473260m6486q527j1488k5248L8351L7103R912K3989N296R419r950K1637
18284B517268R648m7227O953J1543Q558J6956J8736J7810k0609j7100J9423L8740
18272B580699M3529P645J6563N181m7818j412J8254K2365k7215m3529M2184O7570
18260B684016K5110P920o630o992J2991J0788j0561K0596N846k881m4839k1221
18248B674143J5221K7080j5170j526L2571L3548K5274Q521o929q764J8731J6805
18236B819505o30J4683J2785r069J0247J5093L4420j4066J8360K6744o334J8257
18224B939995L731j0882N8258L7857o680l4268j6888M2136J6658K0786K5385M1288
$$ y = [2426502, 2433202, 2433324, 2398001, 2387515, 2383654, 2412980, 2442688, 2437118, 2423682, 2425488, 2422964, 2446232, 2473260, 2426774, 2418247, 2406759, 2381511, 2419862, 2456965, 2466877, 2490866, 2496162, 2505581, 2495631, 2517268, 2526916, 2479689, 2486642, 2498185, 2506743, 2523699, 2542435, 2560245, 2539636, 2522536, 2541959, 2580699, 2624228, 2631873, 2648436, 2653617, 2605799, 2604387, 2622641, 2645006, 2617791, 2574262, 2616446, 2684016, 2709126, 2717046, 2710416, 2703424, 2716415, 2727203, 2716642, 2737238, 2743084, 2740203, 2695364, 2674143, 2689364, 2716444, 2701274, 2699748, 2732319, 2765867, 2791141, 2799662, 2792733, 2783969, 2802700, 2819505, 2818875, 2833558, 2846343, 2837274, 2847521, 2862614, 2897034, 2882968, 2901328, 2928072, 2921738, 2939995, 2943726, 2932844, 2991102, 3028959, 3022279, 2988011, 2971123, 3013259, 3029917, 3050703, 3076088, 3117376]
18212C117376K1084j1058n794Q798J4432J2810L881L3911J7182m97j6557L9221
18200C234789K0083K510J5071L3503N4736K5372k0573l678k423J87L2112L7790
18188C429479K3861K0246L3776k107Q34J359L1738L9120J6564L6089K4765K1649
18176C677373L4402N564N17M1685N1861K8799Q707M1238P7970O3415J4728j180
18164D045079K1050N3042M4229N9809K5192M5110O8843R1722O9723P1646K4919
18153D620364Q085M0126M1038N6922Q4803P3293P9945O7207Q4867J09954R6694
18142E363298Q6393J07898R4488P2714Q7258J14936J58105J40761J72752J69398
18132F568001J45090J62144K00727K18408K01986K38060K53860K90315K99919
$$ y = [3117376, 3138460, 3127402, 3121608, 3130406, 3144838, 3157648, 3161529, 3195440, 3212622, 3212125, 3195568, 3234789, 3254872, 3257382, 3272453, 3305956, 3360692, 3386064, 3365491, 3361813, 3359390, 3359577, 3391689, 3429479, 3453340, 3473586, 3507362, 3505255, 3506089, 3507448, 3539186, 3578306, 3594870, 3630959, 3655724, 3677373, 3711775, 3717339, 3717856, 3759541, 3811402, 3840201, 3848908, 3890146, 3968116, 4031531, 4046259, 4045079, 4066129, 4119171, 4163400, 4223209, 4248401, 4293511, 4362354, 4454076, 4523799, 4595445, 4620364, 4628449, 4668575, 4709613, 4766535, 4851338, 4924631, 5004576, 5071783, 5156650, 5266604, 5363298, 5449691, 5557589, 5652077, 5724791, 5812049, 5926985, 6085090, 6225851, 6398603, 6568001, 6713091, 6875235, 7075962, 7294370, 7496356, 7734416, 7988276, 8278591, 8578510]
18123H578510L49939M03507M94578N27249N89971P33405Q17307Q92886J028586
18114A4415938J284796J562451K032831K657318L458244M194443L876814m56359
18106C3026476j0261642k1778196j8603772m287766J251823K242005K123605J897196
18098a4390271J645804J402198J218079R91039P83640N96287L52564J26873J15264
18089g158523K00944K50688K71940L13819L45374L40012L43225L16298K75023
18080d501200K47988K31070K45228K20905J95276J69738J52280J39396J46933
18071b752386J60090J38942J50544J12115J15780J22819J24477J04230P3210N9334
18061a590845M0783O7617J03212R1590R2767J05324J07896P8972P5665O8988O4405
$$ y = [8578510, 8928449, 9331956, 9826534, 10353783, 10943754, 11677159, 12494466, 13387352, 14415938, 15700734, 17263185, 19296016, 21953334, 25411578, 29606021, 33482835, 33026476, 22764834, 986638, -17617134, -21904900, -20653077, -18411072, -16287467, -14390271, -12744467, -11342269, -10124190, -9133151, -8349511, -7753224, -7400660, -7273787, -7158523, -6957579, -6706891, -6434951, -6121132, -5775758, -5435746, -5092521, -4776223, -4501200, -4253212, -4022142, -3776914, -3556009, -3360733, -3190995, -3038715, -2899319, -2752386, -2592296, -2453354, -2302810, -2190695, -2074915, -1952096, -1827619, -1723389, -1650179, -1590845, -1550062, -1482445, -1379233, -1287643, -1194876, -1089552, -981656, -902684, -827019, -758031, -693626]
18050f93626M5740p506J2790P6015N2835O8936N7570N7294N0127P2115K9386O1700
18038a16624L4409q572j1033L4318L1240K2584L1792M7292K2602j7725N056L5964
18026A11303L2331M7980L9123M2393L037M7890N3278J9190K1935L2645K4228Q814
18014D84147j0120j7446L6898L5480L1468J4690K9030j0246K0842K4803J5151
18003F54697R839K9248P1787K9745j4481j2704j0314J9669O818J9875Q506j6660
17991G96025n764K2696K1834L0201K9069R291K8503M013j6683k6308R106P454
17979I09437L6069Q763J5390J9798P846K008j6154m314J9418K8868J8150K9735
17967A075014K5743K0387k1747j7624j09J1032J8759J9244K2679J019L1943j8340
$$ y = [-693626, -647886, -655392, -642602, -566587, -513752, -444816, -387246, -329952, -279825, -207710, -178324, -116624, -82215, -90787, -101820, -67502, -36262, -13678, 18114, 65406, 88008, 70283, 75339, 111303, 143634, 191614, 230737, 273130, 276167, 324057, 377335, 396525, 418460, 451105, 475333, 484147, 474027, 456581, 493479, 528959, 560427, 575117, 604147, 593901, 614743, 639546, 654697, 664536, 693784, 765571, 795316, 780835, 768131, 757817, 777486, 784304, 804179, 812685, 796025, 790261, 812957, 834791, 864992, 894061, 903352, 931855, 935868, 919185, 892877, 901983, 909437, 945506, 954269, 969659, 989457, 997303, 999311, 983157, 978843, 998261, 1027129, 1045279, 1075014, 1100757, 1121144, 1099397, 1081773, 1081664, 1092696, 1111455, 1130699, 1153378, 1154397, 1186340, 1168000]
17955A168000L496R151J0471R336P242J1079J5691P323J6448J5926J1044K430
17943A287637m239n890m396P67m689K4846J1868L6588N7580N24k7055k257K5460
17930A396744O989k2770j3788J2552j7531o575O107J7750J1193K4442k9255j5205
17918A370653L6317J6008J1897N854J7139N602j7245o605N5595J4561q93K8595
17906A537478j0092k0246l8983j9569M8655J0287j2921J7061J5891L9845n297
17895A562109J2990L0123j0579j6947J6861K3810J293j7632M05M513o24L1867
17883A638189O843j5177K5769R796k4726n665K8431J5758o749j0468m123N580
17871A663458J9380L420l6217m1921L1902M3514r73P725M7574M0705M841j5912
$$ y = [1168000, 1171496, 1180647, 1191118, 1200454, 1207696, 1218775, 1234466, 1241789, 1258237, 1274163, 1285207, 1287637, 1283398, 1277508, 1273112, 1273879, 1269190, 1294036, 1305904, 1342492, 1400072, 1400596, 1373541, 1371284, 1396744, 1403733, 1380963, 1367175, 1379727, 1362196, 1355621, 1361728, 1379478, 1390671, 1415113, 1385858, 1370653, 1406970, 1422978, 1434875, 1440729, 1457868, 1463470, 1446225, 1439620, 1495215, 1509776, 1508883, 1537478, 1527386, 1507140, 1468157, 1448588, 1497243, 1507530, 1494609, 1511670, 1527561, 1567406, 1562109, 1575099, 1605222, 1594643, 1577696, 1594557, 1618367, 1619660, 1602028, 1602433, 1606946, 1606322, 1638189, 1645032, 1629855, 1655624, 1665420, 1640694, 1635029, 1663460, 1679218, 1672469, 1662001, 1657878, 1663458, 1682838, 1686258, 1650041, 1608120, 1640022, 1683536, 1682563, 1690288, 1737862, 1778567, 1783408, 1767496]
17859A767496k8840k562L005J7466O237k1669k5347j6338M751K358k786K6506
17847A730277L2262q182j2916K0772O010p70J1977K3258L946m6847j4002J4782
17835A760567L3187M1344K049J4785Q076J9451K371l046q707q855J0183m407k3850
17822A843148N25K4135l883K8627K0530r857J1236p878J9618j6776j5921k3956
17810A869548Q408L2900K8077r904k0667K0094L5957N577J4568J7499J6019k1136
17798A996940L454q081n5833k745N532R275m358L4113J8667K6871k2212M74K3720
17785B025817P206m255N642k0079j1357M411L057L1905J5017J10j252k4575j1948
17772B019699L102P866J2841r473j4810P769P946K7379Q908k2171j276j0616p230
$$ y = [1767496, 1738656, 1736094, 1739099, 1756565, 1762802, 1741133, 1715786, 1699448, 1704199, 1706557, 1703771, 1730277, 1762539, 1754357, 1741441, 1762213, 1768223, 1767453, 1779430, 1802688, 1806634, 1759787, 1745785, 1760567, 1793754, 1835098, 1837147, 1851932, 1860008, 1879459, 1881830, 1878784, 1870077, 1861222, 1871405, 1866998, 1843148, 1843673, 1867808, 1863925, 1892552, 1913082, 1903225, 1914461, 1906583, 1926201, 1909425, 1893504, 1869548, 1877956, 1910856, 1938933, 1929029, 1908362, 1928456, 1964413, 1969990, 1984558, 2002057, 2018076, 1996940, 2000394, 1992313, 1936480, 1933735, 1939267, 1948542, 1944184, 1978297, 1996964, 2023835, 2001623, 2002097, 2025817, 2033023, 2028768, 2034410, 2014331, 2002974, 2007385, 2010442, 2042347, 2057364, 2057474, 2056222, 2031647, 2019699, 2022801, 2030667, 2043508, 2034035, 2019225, 2026994, 2034940, 2062319, 2071227, 2049056, 2047780, 2037164, 2029934]
17759B029934M6128m524k407K1082r14o295L6164K8583R052J476J4051J2532O129
17746B190991k8731k4406r170L7251M7651j8500N49k6234l6171o251K296K9587
17734B158862K4554J4851l2871k7191J0347J3686L4124Q583P180J6434Q328K1013
17722B257900K930J3382K2943K1483j2180O699l1942J743J5155N945n420p367
17710B291271K5797K4437J2093k3591R569q407j2671m3500N463J2960K0691K8210
17698B342322j461p867k4147K477K6420J9920N742j1781j1900L00J0750J459J5086
17685B367320M2909N920j0712J6886J2333j4953O256L5770L5034R011l0745m895
17673B470134K4687M8167J3110j9547j3344o954N283j1203J868R111p93m220j5201
$$ y = [2029934, 2076062, 2071538, 2069131, 2090213, 2089299, 2083004, 2119168, 2147751, 2156803, 2158279, 2172330, 2184862, 2190991, 2162260, 2137854, 2128684, 2165935, 2213586, 2195086, 2195635, 2169401, 2133230, 2126979, 2129275, 2158862, 2183416, 2198267, 2165396, 2138205, 2148552, 2162238, 2196362, 2204945, 2212125, 2228559, 2236887, 2257900, 2260830, 2274212, 2297155, 2318638, 2306458, 2313157, 2281215, 2282958, 2298113, 2304058, 2298638, 2291271, 2317068, 2341505, 2353598, 2330007, 2339576, 2331169, 2318498, 2274998, 2280461, 2293421, 2314112, 2342322, 2340861, 2332994, 2308847, 2311324, 2337744, 2357664, 2363406, 2351625, 2339725, 2340025, 2350775, 2352234, 2367320, 2410229, 2416149, 2405437, 2422323, 2434656, 2419703, 2425959, 2461729, 2496763, 2505774, 2475029, 2470134, 2494821, 2542988, 2556098, 2536551, 2523207, 2516253, 2521536, 2510333, 2512201, 2521312, 2520519, 2516299, 2501098]
17660B501098m409L7281L4017N0971L6973k2180J3368J3857j3228l482O378K7280
17648B677924K065P171M4030O2414J3100L7337R4550N7743M5541N8260R1228J39324
17636C330687J28346J43100j3981l25582p11924o87214k31691N0411O9699O5069
17626A816920K9370Q1700P5987K9956K6085M2651N5507K4540J595R813k8852J1732
17614B177004M1144L7012J6904L871j0089K4810K8753K1060J1157r941m905N315
17602B342095M145M5804K0428J0399N500K5862K6875J1556q404K1304O304J069
17590B512937K6009J6588P861j0511j4413J652K161J8924K0554R966J9315K2943
17578B633986J996J1956j0324J1631j3374j9055j8560r757K1686K1775K2246k25
$$ y = [2501098, 2496689, 2533970, 2567987, 2618958, 2655931, 2633751, 2647119, 2660976, 2647748, 2644266, 2650644, 2677924, 2679989, 2687160, 2731190, 2793604, 2806704, 2844041, 2938591, 2996334, 3041875, 3100135, 3191363, 3330687, 3459033, 3602133, 3588152, 3262570, 2550646, 1863432, 1631741, 1682152, 1751851, 1816920, 1846290, 1927990, 2003977, 2033933, 2060018, 2102669, 2158176, 2182716, 2184311, 2194124, 2165272, 2177004, 2218148, 2255160, 2272064, 2275935, 2265846, 2290656, 2319409, 2340469, 2351626, 2341685, 2336780, 2342095, 2346240, 2392044, 2412472, 2422871, 2428371, 2454233, 2481108, 2492664, 2484260, 2505564, 2511868, 2512937, 2538946, 2555534, 2563395, 2552884, 2538471, 2540123, 2542284, 2561208, 2581762, 2591728, 2611043, 2633986, 2635982, 2647938, 2637614, 2649245, 2635871, 2616816, 2598256, 2588499, 2610185, 2631960, 2654206, 2653981]
17566B653981K8912K0213o561j4242J045M6182K2620k5010K127j7899l8424J170
17554B674114L8345O245K4137L5177M666M9502L2254k6688j3927j0174j6172l5829
17542B761650P239M5532k427j5347Q727J3490K0770J0197K1583k5227m092J6434
17530B858529J2977L076n346K2446o852l722K936p919j7480J3788j4l337M1973
17517B911055J2119Q062N861j7987L0008J4216o502N987L5740L351j4304J9799
17505C007405J3716K8147L0086j1007J4332p363J5466Q006Q416l29K3460j112
17493C129223k3864n009L1937M8377K7138Q299j6674j9102k5289J9962P682P582
17481C190262k6032N706M654N553J1025m963J2135M1552r736j2968K0373P888
$$ y = [2653981, 2682893, 2703106, 2696545, 2682303, 2683348, 2729530, 2752150, 2727140, 2729267, 2711368, 2672944, 2674114, 2712459, 2718704, 2742841, 2778018, 2782684, 2832186, 2864440, 2837752, 2823825, 2813651, 2797479, 2761650, 2768889, 2814421, 2811994, 2796647, 2805374, 2818864, 2839634, 2849831, 2871414, 2846187, 2842095, 2858529, 2871506, 2874582, 2869236, 2891682, 2884830, 2881108, 2884044, 2876125, 2858645, 2872433, 2872419, 2869082, 2911055, 2923174, 2931236, 2937097, 2919110, 2949118, 2963334, 2956832, 2962819, 2998559, 3001910, 2987606, 3007405, 3021121, 3049268, 3079354, 3068347, 3082679, 3075316, 3090782, 3098788, 3107204, 3106875, 3130335, 3129223, 3105359, 3100350, 3132287, 3180664, 3207802, 3216101, 3199427, 3180325, 3155036, 3174998, 3182680, 3190262, 3164230, 3169936, 3174590, 3180143, 3191168, 3186205, 3198340, 3239892, 3230156, 3217188, 3237561, 3245449]
17469C245449K7893J0750o792k8498j7903j497J5994K9265K9090M3936J6316p854
17457C356149o194K6810K2705J7083L4204J0763R396m6173m5909k1031K5123M3647
17445C426573K9074M4846K528J9234R656k1341q2156j05121l9719n81R109P82
17433C292884O0113M8764L80K050J3783o483J340J6781r310J6084J5621k7125
17421C424882K9377L2371P01l761J0354K8737O486J9133J6355J1399J0407L3125
17409C619566J5986l9787J8991L1922J7768L4974K5211J1060j973k4188k638K5770
17397C732662j5427J45M0557n817J5554j5074r29K8263O934q073K4095q641l175
17384C791074J1704J2534J2038K5630J2140O067M876m063J4970J133K369j3184
$$ y = [3245449, 3273342, 3284092, 3277300, 3248802, 3230899, 3229402, 3245396, 3274661, 3303751, 3347687, 3364003, 3356149, 3349955, 3376765, 3399470, 3416553, 3450757, 3461520, 3470916, 3424743, 3378834, 3357803, 3382926, 3426573, 3455647, 3500493, 3503021, 3522255, 3531911, 3510570, 3428414, 3323293, 3283574, 3282993, 3292102, 3292884, 3352997, 3401761, 3402141, 3404191, 3417974, 3411491, 3412831, 3429612, 3420302, 3436386, 3452007, 3424882, 3454259, 3486630, 3487331, 3483570, 3493924, 3522661, 3529147, 3548280, 3564635, 3576034, 3586441, 3619566, 3635552, 3595765, 3614756, 3646678, 3664446, 3699420, 3724631, 3735691, 3733718, 3709530, 3706892, 3732662, 3717235, 3717380, 3757937, 3752120, 3767674, 3752600, 3751671, 3779934, 3786868, 3778795, 3802890, 3794249, 3791074, 3802778, 3815312, 3827350, 3852980, 3865120, 3871187, 3876063, 3872000, 3886970, 3888103, 3890472, 3877288]
17372C877288J8595J1753K3562j01Q214L6853L1438K356M542K4825K5065j6291
17360D048099j8859m826J1037J3674K8027J5597K3356L564K2866J3346k4811k7064
17348D104006l3404m218M1973M3019P9631J11096L9839j8051l102p427J7942j6165
17336D355139O259K0307K3322M961r059M1394J8677L923K6038K2641J6615J6976
17324D547193K2368P70j3080J2834P536Q688J477J5941L0468K2396K6325L726
17312D686642o149J5062j1556l170J7143J7538K7264K3K2184M9774n00Q130L3686
17299D856071K3460j2121k0560K7755J2658L6626L2235k2070j1941M308M9384
17288D975805N901L2479J4842k4670o515M5980M1513p42J479K458J2042p708O486
$$ y = [3877288, 3895883, 3907636, 3931198, 3931097, 3939311, 3976164, 4007602, 4009958, 4014500, 4039325, 4064390, 4048099, 4029240, 4024414, 4035451, 4049125, 4077152, 4092749, 4116105, 4119669, 4142535, 4155881, 4131070, 4104006, 4070602, 4066384, 4108357, 4151376, 4231007, 4342103, 4381942, 4363891, 4360789, 4353362, 4371304, 4355139, 4361398, 4381705, 4405027, 4409988, 4400929, 4442323, 4461000, 4464923, 4490961, 4513602, 4530217, 4547193, 4569561, 4570331, 4557251, 4570085, 4577621, 4586309, 4587786, 4603727, 4634195, 4656591, 4682916, 4686642, 4680493, 4695555, 4683999, 4680829, 4697972, 4715510, 4742774, 4742797, 4764981, 4814755, 4814255, 4822385, 4856071, 4879531, 4867410, 4846850, 4874605, 4887263, 4923889, 4956124, 4934054, 4922113, 4926421, 4975805, 4981706, 5014185, 5029027, 5004357, 4997842, 5043822, 5085335, 5084593, 5086072, 5088530, 5100572, 5092864, 5099350]
17275E099350M5936M4965j0615J6120L9733L7670J4972K4335M0633K4303l0397
17264E347005r292M8175N3459n277J8708N0958o48L07K7050M7821O3126N4588
17252E695980P8053O9493J2783k9470m5282m7348j5568K8515P792L2137N514L2026
17240E824625N3353N4452N5218M4065K1592K8767K8636L4018N4679L9552j4210
17229F224747m5310j11541j57030n9882P0551O0804L9744N4437P3891P8144N3336
17218F281891O2779L7653N5744L9492L5185N6600N1068M7742l41N507J7879K4666
17206F715865N8039P7067O5386L6283L7755O1625M4855M5420K2248L7435P6425
17195G278403O8810K3125L1130O5339Q5481M8775K7061M9456Q0674N0461L1843
$$ y = [5099350, 5145286, 5190251, 5179636, 5195756, 5235489, 5273159, 5288131, 5312466, 5353099, 5377402, 5347005, 5337713, 5385888, 5439347, 5434070, 5452778, 5503736, 5503088, 5503395, 5530445, 5578266, 5641392, 5695980, 5774033, 5843526, 5856309, 5826839, 5781557, 5734209, 5718641, 5747156, 5754948, 5787085, 5792599, 5824625, 5877978, 5932430, 5987648, 6031713, 6053305, 6082072, 6110708, 6144726, 6199405, 6238957, 6224747, 6179437, 6067896, 5910866, 5850984, 5921535, 5982339, 6022083, 6076520, 6150411, 6228555, 6281891, 6344670, 6382323, 6438067, 6477559, 6512744, 6569344, 6620412, 6668154, 6667813, 6673320, 6691199, 6715865, 6773904, 6850971, 6916357, 6952640, 6990395, 7052020, 7096875, 7142295, 7164543, 7201978, 7278403, 7347213, 7370338, 7401468, 7466807, 7552288, 7601063, 7628124, 7677580, 7758254, 7808715, 7840558]
17184G840558O9543M2485O6231Q9361R0611J18037R4690O4819J13799J18777P5466
17173H784377J08814J22810J55628K38498L44024L43667J39709k93700r05362
17164I038465j182586m39989M681J40845J66035J56626J44768J55370J46929J49108
17154H480252J43225J30999J07733J03832N9343L3903Q8567J48036J16113J23295
17144I535298J30920J05741O2343O0655Q8254J32057J29234Q9660O6981P7527
17134A0478670J27463J14087J07359J08577R7045Q9007J22618J40531R7440P5863
17124A1558660J29049J43407J52875J62147J23893J25760J21235J63853J29840
17115A2810719J47303J89008J60676J43181J48643J88229J73140J68991J88206
$$ y = [7840558, 7910101, 7952586, 8018817, 8108178, 8198789, 8316826, 8411516, 8476335, 8590134, 8708911, 8784377, 8893191, 9016001, 9171629, 9410127, 9754151, 10097818, 10237527, 9943827, 9038465, 7855879, 7415890, 7420571, 7561416, 7727451, 7884077, 8028845, 8184215, 8331144, 8480252, 8623477, 8754476, 8862209, 8966041, 9025384, 9059287, 9147854, 9295890, 9412003, 9535298, 9666218, 9771959, 9834302, 9894957, 9983211, 10115268, 10244502, 10334162, 10401143, 10478670, 10606133, 10720220, 10827579, 10936156, 11033201, 11122208, 11244826, 11385357, 11482797, 11558660, 11687709, 11831116, 11983991, 12146138, 12270031, 12395791, 12517026, 12680879, 12810719, 12958022, 13147030, 13307706, 13450887, 13599530, 13787759, 13960899, 14129890, 14318096]
17106A4318096K12456K19965K62160K27745K36820K28509K56268K60784L09625
17097A6532428L22483L00206K66367K45831L47676L49706L82575M04420M34746
17088A9586438M08643M15106M42571M79222N19440N59336O02282O35298O29802
17079B4278138L37081k22507m95511r0101M52011O93490P61059Q35704R13271
17070B7462635R77052J083186J123196Q30673L74492J97788Q15220J322012J621182
17061C5807436J833328J844310J765662J473762J194713J364855K332679K934275
17053E0551020L278290L662145M090341M836148N779066O425574P041483P980096
17045I3644163R505339J2848543J7648903K3240586K8906427K9001709M309763
$$ y = [14318096, 14530552, 14750517, 15012677, 15240422, 15477242, 15705751, 15962019, 16222803, 16532428, 16854911, 17155117, 17421484, 17667315, 18014991, 18364697, 18747272, 19151692, 19586438, 19995081, 20410187, 20852758, 21331980, 21851420, 22410756, 23013038, 23648336, 24278138, 24615219, 24392712, 23897201, 23807100, 24259111, 24952601, 25713660, 26549364, 27462635, 28439687, 29522873, 30646069, 31476742, 31851234, 32049022, 32864242, 34186254, 35807436, 37640764, 39485074, 41250736, 42724498, 43919211, 45284066, 47616745, 50551020, 53829310, 57491455, 61581796, 66417944, 72197010, 78622584, 85664067, 93644163, 103149502, 115998045, 133646948, 156887534, 185793961, 214795670, 219105433]
17038B19105433o0623565j43079772j41395981l6876565P223390J5706745J5272188
17031a24668127J3640411J1420274R198390P398785O658215N651503M434588K801205
17023f3464756J067126Q36731J510206K056877K324266K242837J957345J557428
17015d9911940J679213J944415J963725J862343J845863J658977J158657N50775
17007c7247972P35462J091139J189001J194892J179664J109446J006429R23489
16999b8818450Q38023Q16430P02339O67382O52928O08643O19313O40648O30816
16990b2641928N96568N49996N66010N44633M81782M43086M25332M10096M12483
16981a8211942M06029L97142L94932M04481L57403K78115K98603K91949K78637
$$ y = [219105433, 158481868, 15402096, -125993885, -162870450, -155647060, -139940315, -124668127, -111027716, -99607442, -90409052, -83010267, -76352052, -70700549, -66265961, -63464756, -62397630, -61560899, -60050693, -57993816, -55669550, -53426713, -51469368, -49911940, -48232727, -46288312, -44324587, -42462244, -40616381, -38957404, -37798747, -37247972, -36512510, -35421371, -34232370, -33037478, -31857814, -30748368, -29741939, -28818450, -27980427, -27163997, -26461658, -25794276, -25141348, -24532705, -23913392, -23272744, -22641928, -22045360, -21495364, -20929354, -20384721, -19902939, -19459853, -19034521, -18624425, -18211942, -17805913, -17408771, -17013839, -16609358, -16251955, -15973840, -15675237, -15383288, -15104651]
16972a5104651K51989K17215K19634K19336K25444K55660K41809K19101K15618
16963a3038845K05811K05089J74643J80683J75331J75432J92169K09486J82944
16954a1337257J76157J75079J51280J35685J19302J66371J38667J48092R9329
16945a0027295J24177J36805J26030J17132P5056J01036J36734J58954J39143
16936h912228J15271J05302J02327R8191J27752J15719Q9489L8241R0562J03223
16926g926151P4786P4164Q3910J08279M8259O1375N2498N7236O0141Q5791R8647
16915g121065K9755J3481P5648J00515R7197O6633Q7124Q3096K0458J2134L5863
16904f499161M4505P0073M9124L8586P1584P7007R0961R5362M0153O7700M4184
$$ y = [-15104651, -14852662, -14635447, -14415813, -14196477, -13971033, -13715373, -13473564, -13254463, -13038845, -12833034, -12627945, -12453302, -12272619, -12097288, -11921856, -11729687, -11520201, -11337257, -11161100, -10986021, -10834741, -10699056, -10579754, -10413383, -10274716, -10126624, -10027295, -9903118, -9766313, -9640283, -9523151, -9448095, -9347059, -9210325, -9051371, -8912228, -8796957, -8691655, -8589328, -8491137, -8363385, -8247666, -8158177, -8119936, -8029374, -7926151, -7851365, -7777201, -7693291, -7585012, -7536753, -7475378, -7422880, -7365644, -7305503, -7219712, -7121065, -7091310, -7077829, -7002181, -6901666, -6804469, -6737836, -6650712, -6567616, -6547158, -6535024, -6499161, -6454656, -6384583, -6335459, -6296873, -6225289, -6148282, -6057321, -5961959, -5921806, -5854106, -5809922]
16893e809922Q132L5019M9824K8209L1553O8184O7342Q5631L9077L0660M3754
16882e322537L6114O7377N0636j6519J3441L5491N9138O5708N0584N5685p661
16871d912543J0167K9649K1222L9495J5507K3057N0383M4773L4561K4693K5853
16860d593183L4688M8519M6148L1069L6238K3186Q314J0160l3430k3341m1051
16849d452683o3602L1194R6940K16255J49143L2286K7833N1373M4546P1055P8441
16838c717219Q508J0997J3433K6957J8153K2718J2958N8947M3741q861J6038N0818
16826c442812l479K5776N9251L6009m679K214P299L0103J1684K8866K5247J2865
16814c211656L4609J4450J0135j211J1595K9192K5270K6012K8398K0489J2317
$$ y = [-5809922, -5801790, -5766771, -5716947, -5688738, -5657185, -5589001, -5521659, -5436028, -5396951, -5366291, -5322537, -5286423, -5219046, -5168410, -5184929, -5171488, -5135997, -5076859, -5011151, -4960567, -4904882, -4912543, -4902376, -4872727, -4851505, -4812010, -4796503, -4773446, -4723063, -4678290, -4643729, -4619036, -4593183, -4558495, -4509976, -4463828, -4432759, -4396521, -4373335, -4365021, -4354861, -4388291, -4411632, -4452683, -4516285, -4485091, -4388151, -4171896, -4022753, -3990467, -3962634, -3911261, -3866715, -3795660, -3717219, -3708711, -3697714, -3684281, -3657324, -3639171, -3616453, -3603495, -3544548, -3500807, -3509668, -3493630, -3442812, -3446291, -3420515, -3361264, -3325255, -3329934, -3327720, -3320421, -3290318, -3278634, -3249768, -3224521, -3211656, -3177047, -3162597, -3152462, -3153673, -3142078, -3112886, -3087616, -3061604, -3033206, -3012717, -3000400]
16803c000400J1652K8954L4994R061J1020J398J7323L4748O1952N2031L333l934
16791b737868j1438q581O5824N1743L8083K9903J0093j9605J8214K8159K5172
16780b510301n780M5604M9870O321N46J2434K573J4406L4737J2073K1994L8837
16768b276686K5826O2910M3255J1441M3146L1514k568J7478L2073L6902O0289
16757a914420R0193J08822Q3066N9129j5443j83594l52409l83087k00987l4212
16747b742942P1473N5266P1655P3757P1570N5306K5321m56O647O2476J4982j5027
16735b249972M7713M1013O0053M0242k3602q8650j7337j0293l053K8747M9887
16724b125252J5708N757J6318J874R21L9123K9374j1128J6692K604M753J7098
$$ y = [-3000400, -2988748, -2959794, -2924800, -2915739, -2904719, -2903321, -2885998, -2851250, -2789298, -2737267, -2733934, -2737868, -2749306, -2757887, -2692063, -2640320, -2602237, -2572334, -2562241, -2581846, -2563632, -2535473, -2510301, -2516081, -2470477, -2420607, -2414286, -2413740, -2401306, -2398733, -2384327, -2349590, -2337517, -2315523, -2276686, -2250860, -2187950, -2144695, -2133254, -2090108, -2058594, -2061162, -2043684, -2011611, -1974709, -1914420, -1824227, -1715405, -1632339, -1573210, -1588653, -1772247, -2124656, -2507743, -2708730, -2742942, -2671469, -2616203, -2544548, -2470791, -2399221, -2343915, -2318594, -2319050, -2312403, -2249927, -2234945, -2249972, -2202259, -2161246, -2101193, -2060951, -2084553, -2173203, -2190540, -2200833, -2203886, -2175139, -2125252, -2109544, -2103787, -2087469, -2085595, -2084674, -2045551, -2016177, -2027305, -2010613, -2008009, -2003256, -1986158]
16712a986158M1100L9818L9293K0825j5515L551l367M3308K4565L3727K8279k740
16700a733314j9380J9445L1993J097L85L853K3962J5319J0404J0832L9399L6328
16688a559677P928J7j1850k007J4991L0588M806j7993K4414J5357J8910k41k2458
16675a497215K1111M2069J7083K144p323K1893M139j7193l6662k156J5459L3891
16663a402760K4466J1875N685K689k3412K5859L6733Q938J4250K3381K4204K5939
16651a222153J9032k7251J1646j576j802K2407p191J5758J6168J5585R835M8608
16639a100934K8055l7453j9261j9340o492K2231L4474j89k0326L5318J3604j2433
16627a082746j274J3907K7324k5057k057J4147K8972L3422j1287M49J636L2433
$$ y = [-1986158, -1945058, -1905240, -1865947, -1845122, -1860637, -1857086, -1860453, -1817145, -1792580, -1758853, -1730574, -1733314, -1752694, -1733249, -1701256, -1700159, -1699774, -1695921, -1671959, -1656640, -1646236, -1635404, -1596005, -1559677, -1551749, -1551732, -1563582, -1565589, -1550598, -1520010, -1515204, -1533197, -1508783, -1493426, -1474516, -1474757, -1497215, -1476104, -1434035, -1416952, -1414808, -1422131, -1400238, -1396099, -1413292, -1449954, -1452110, -1436651, -1402760, -1378294, -1366419, -1360734, -1358045, -1381457, -1355598, -1318865, -1309927, -1295677, -1272296, -1248092, -1222153, -1203121, -1230372, -1218726, -1220302, -1222104, -1199697, -1206888, -1191130, -1174962, -1159377, -1149542, -1100934, -1072879, -1110332, -1129593, -1148933, -1155425, -1133194, -1098720, -1098909, -1119235, -1083917, -1070313, -1082746, -1084020, -1070113, -1042789, -1067846, -1069903, -1055756, -1026784, -993362, -1004649, -1004200, -1002564, -970131]
16615i70131L2609L9780J5944J6573M3184M4148J0770L5789K7934O814j06014
16604h02600j99652j35794l2751K9105K4151Q004N177J7901L7522K1257J0974
16593a016706K4295k316l1393J8306K1225J0928K4707L500J9771K2015K3374J7330
16581h64964L2611K9112L0336K5771J2246p898j9134j0433q810K0161k4709k3084
16569h08795k3742l8472K2109K8614M272L1473j2972l839K1816M1251L3229J1473
16557f93583K8835K4160n03m4013j2318J2349L3069J0582k8210k6783J3856R304
16545f73255j5436K54J7141O220R185K9209J6942K746o209Q497j2189L13M6802
16532e69780J6292J7902J7900j5477j4540j5145k9171O193M8401J7164r921J7371
$$ y = [-970131, -937522, -897742, -881798, -865225, -822041, -777893, -767123, -731334, -703400, -696586, -802600, -1002252, -1138046, -1170797, -1141692, -1117541, -1109537, -1104360, -1086459, -1048937, -1027680, -1016706, -992411, -994727, -1026120, -1007814, -986589, -975661, -950954, -947454, -927683, -905668, -882294, -864964, -832353, -803241, -772905, -747134, -734888, -742786, -761920, -772353, -781163, -761002, -785711, -808795, -832537, -871009, -848900, -820286, -816014, -784541, -797513, -801352, -779536, -738285, -705056, -693583, -664748, -640588, -641091, -685104, -697422, -685073, -652004, -641422, -669632, -696415, -682559, -673255, -688691, -688437, -671296, -665076, -655891, -626682, -609740, -606994, -613203, -604706, -616895, -616582, -569780, -553488, -535586, -517686, -533163, -547703, -562848, -592019, -585826, -537425, -520261, -530182, -512811]
16520e12811K2326J1282k4826j2514o938O307L6152q551J7810J1267k300M0379
16508d22417j0794l3796L428M964l1180r085J9937J2880L610L1092J1099J0811
16496d09451p345Q784M27J5238K950L4266j981m3508k0156K0466L8402K4349j1411
16483c48970k681p950k317M3858N4624p803R693j956k6869J1094K9129P331K1529
16470b21288K3729J727j1298l929k634K3047M584L904L4038K3765J3074k9777
16458a41058l1806k78J0299J7714J6112J4592M4174K8042N5453N2162J4066J6210
16446I5682N3170n682Q948O6950Q5254O3765R3512J52761J63559J07460j63115
16435G22264n59915q09359m20390n701O7928O6621O8973N3170L2454L0043J9040
$$ y = [-512811, -490485, -479203, -504029, -516543, -523481, -517174, -481022, -489573, -471763, -460496, -462796, -422417, -433211, -467007, -463579, -458615, -489795, -498880, -478943, -466063, -462453, -431361, -420262, -409451, -416796, -408012, -407585, -392347, -389397, -355131, -357112, -400620, -420776, -400310, -361908, -337559, -348970, -351651, -359601, -361918, -318060, -263436, -271239, -261546, -263502, -290371, -279277, -250148, -242817, -221288, -197559, -195832, -207130, -211059, -213693, -190646, -186062, -182158, -148120, -124355, -111281, -141058, -172864, -173142, -162843, -145129, -129017, -114425, -70251, -42209, 13244, 65406, 79472, 95682, 148852, 143170, 152118, 219068, 304322, 368087, 461599, 614360, 777919, 885379, 722264, 162349, -647010, -1067400, -1073101, -1005173, -938552, -869579, -816409, -783955, -753912, -734872]
16424g34872M9389L8864J3119M3815L8117j6165j5065K0781O0811L4081p837q
16412d74970J9380K009j4430M545L9362J5928O748J9903L2330L324j4088o85J3290
16399c47354l43K0532o18J653Q039M675K4421J7559J6657K1060K0202j5650m3799
16386b72966k5070L9778J5074M975J0002l919L016J9934K6769K926p958M7K2021
16373a65371l872k887j2716j9521j4716o875K3429M8989J7841m804J2636L7910
16361h9957K5207J83Q977k5365k4720Q756K1372R791j4491M109j2641j9653p800
16348a16232J4759L3100M3256k338j7558m6337j800k756K7929J0625j5237J1117
16336f1472J7820n090K6019L357N985j6594J0451j6846n534J1605K6866K3759
$$ y = [-734872, -685483, -646619, -633500, -589685, -551568, -567733, -582798, -562017, -501206, -467125, -474962, -474970, -455590, -453581, -468011, -463466, -424104, -408176, -401428, -381525, -349195, -345871, -359959, -360644, -347354, -347697, -327165, -327783, -326130, -318091, -313416, -288995, -271436, -254779, -233719, -213517, -229167, -272966, -298036, -258258, -243184, -238209, -228207, -232126, -229110, -209176, -182407, -179481, -187439, -187392, -165371, -169243, -172130, -184846, -204367, -219083, -225958, -202529, -153540, -135699, -140503, -127867, -89957, -64750, -64567, -55590, -80955, -105675, -96919, -75547, -65756, -80247, -76138, -88779, -108432, -116232, -101473, -68373, -25117, -27455, -45013, -91350, -93150, -95906, -67977, -57352, -72589, -61472, -43652, -48742, -22723, -19366, -13381, -29975, -19524, -36370, -41904, -30299, -3433, 20326]
16324B0326j519l3792o447J8747J7325m372K705L8154q145j8888o98M747J2537
16311D0680J2779L87r09K0550L856j7516K2795K7330r076Q973q011m1736j8177
16298D1925m964R126K3631K6068J185L5580K6627m4351k6938M901M3750R675j0684
16285A35531j666k5407j5558l530N1666K5544l5608Q358p41q47K6890L8661j4122
16272A89171j5167L0639o682j5422L974n205L238L4981k1043l9365l8188M396
16260A25327L0797L7890K0629L7243P451k0410k3692l775R969J4461l544J8099
16248B50445m510j8207r324J084L494j3605r84Q789N443J3475N815Q471r226K777
16234B43937K6357J0757j6916j5900Q923K5162J7569k3670m210o587J1575R953
$$ y = [20326, 18807, -14985, -21432, -2685, 14640, 10268, 12973, 51127, 42982, 24094, 23396, 28143, 40680, 53459, 53846, 52937, 73487, 77343, 59827, 82622, 109952, 100876, 109849, 101838, 60102, 41925, 36961, 46087, 69718, 95786, 96971, 132551, 159178, 114827, 87889, 92790, 136540, 146215, 135531, 133865, 108458, 92900, 89370, 141036, 166580, 130972, 139330, 138589, 137742, 164632, 203293, 189171, 174004, 204643, 197961, 182539, 186513, 181308, 184546, 219527, 198484, 159119, 120931, 125327, 156124, 194014, 214643, 251886, 259337, 238927, 215235, 211460, 221429, 235890, 232346, 250445, 245935, 227728, 218404, 219488, 222982, 209377, 208393, 217182, 222625, 236100, 241915, 250386, 241160, 243937, 270294, 281051, 264135, 248235, 257158, 282320, 299889, 276219, 272009, 265422, 276997, 286950]
16222B86950J0036l470j9720o967p42Q473J9402r829J8330R269J5894J2430J6598
16209C56654J1475l8625j6942k680k0173J5655K9279P423J5487q024L348l6658
16197C16219k8100j642J5889Q697L3643J6099J2176L186n510K4025K0604P555
16185D22841k7041j5060J1297L7495j6311J0132K1825j6124j1240j6270p284p128
16173C87132o869l807J9730O400J0650l7535j7632K0494L2676r802l047K8513
16161D26903j0687K8786J3191N533k171j1130o159k6135m67j2008J8661N8073
16149D82390K3782l990l9627q652j5435q724J3307p12J7760J2082O151J7346j6918
16136D78760Q485J1236j1736j2970n203q003k355J7489j629j9049k2160J9319
$$ y = [286950, 296986, 293516, 273796, 266829, 266087, 274560, 293962, 284133, 302463, 311732, 327626, 340056, 356654, 368129, 329504, 312562, 309882, 289709, 305364, 334643, 342066, 357553, 349529, 352877, 316219, 288119, 286477, 302366, 311063, 344706, 360805, 372981, 376167, 370657, 394682, 415286, 422841, 395800, 380740, 392037, 429532, 413221, 423353, 445178, 429054, 417814, 401544, 394260, 387132, 380263, 376456, 396186, 402586, 413236, 375701, 358069, 378563, 411239, 401437, 398390, 426903, 416216, 445002, 458193, 463726, 461555, 450425, 444266, 418131, 417664, 405656, 424317, 482390, 506172, 502182, 462555, 453903, 438468, 429744, 443051, 442339, 460099, 472181, 478332, 495678, 478760, 487245, 498481, 486745, 473775, 468572, 460569, 458214, 475703, 474074, 455025, 432865, 452184]
16124D52184m41J0110L0367j319k3077q04J2312L5388k5763p9K5403p397J9127
16111E26011J6827m1757Q712K4661K985q335j8061J1257j243J2725J8251J3671
16099E65704J2363j5212P585L928m550k3412l1891J0820J1018K0330j1129p114
16087E38440j3413R291J5162Q118m817k5194j1024m498P722L2761J6414j7157
16075E51805J7333J9994J4626j718j4767m851j4687l195K0835J8454J6043j7302
16063F02570j8729q453J1320J2122J3530j5382L2981J8227l8175k4996J1794K5829
16051F22638j8869K7R257j1604J8967L6881K942m0238J511j7084K2928J9463k8069
16038F18750j1823J6084J1644K3544J5139k1704K0489j2201M02k2013lN0728m186
$$ y = [452184, 451743, 461853, 492220, 490901, 467824, 467020, 479332, 514720, 488957, 488878, 514281, 506884, 526011, 542838, 501081, 509793, 534454, 537439, 529104, 511043, 522300, 521057, 533782, 552033, 565704, 578067, 562855, 570440, 574368, 569818, 546406, 514515, 525335, 536353, 556683, 545554, 538440, 525027, 534318, 549480, 557598, 552781, 527587, 516563, 512065, 519787, 552548, 568962, 551805, 569138, 589132, 603758, 602040, 587273, 582422, 567735, 564540, 585375, 603829, 619872, 602570, 583841, 575388, 586708, 598830, 612360, 596978, 629959, 648186, 610011, 585015, 596809, 622638, 603769, 603796, 613053, 601449, 620416, 657297, 660239, 620001, 621512, 604428, 627356, 646819, 618750, 606927, 623011, 634655, 658199, 673338, 651634, 672123, 659922, 660324, 638311, 638308, 689036, 684850]
16025F84850k8515j0571j2511K5144J7140j1192J2820P44j0525P518R335N224
16013F89461j3561j9470R162J997L8987K8514p915r841K489J2864j1659j4851
16001G06177L091n241n283L887N552J2595j4013j0263r167R148k1935j1749j6711
15988F46088p540L1164N3208K6933n061m0599l4859K1181J5620k2551R984M5798
15976G39366K7867n170J1433L096J7772j5263o5225j4660o086j6865L7423K4939
15964G38627J3715J5370J1176J2547k7965n2980Q230K3230J3020j647j8263K0135
15952G55195K6993k963k599j3252k3964j7038q562n02J6690J8426k4785k146j3314
15939G08179k115L563o528O282O470o961J069j6135N810J6282K2214Q995o171
$$ y = [684850, 656335, 645764, 633253, 658397, 675537, 664345, 677165, 677909, 667384, 674902, 684237, 689461, 675900, 656430, 665592, 667589, 706576, 735090, 727175, 717334, 719823, 732687, 721028, 706177, 709268, 704027, 698744, 702631, 708183, 720778, 706765, 696502, 687335, 696483, 674548, 662799, 646088, 638548, 669712, 722920, 749853, 744792, 704193, 669334, 690515, 706135, 683584, 693568, 739366, 767233, 762063, 773496, 776592, 794364, 779101, 713876, 699216, 693130, 676265, 713688, 738627, 752342, 767712, 778888, 791435, 763470, 710490, 718720, 741950, 754970, 753323, 735060, 755195, 782188, 779225, 776626, 763374, 739410, 722372, 713810, 713308, 729998, 748424, 723639, 721493, 708179, 706064, 709627, 703099, 709381, 715851, 708890, 709959, 693824, 699634, 715916, 738130, 747125, 740954]
15926G40954r445M4393J3072k5852k4729j5037R366q050k0119L0302K4171J974
15914G61000J053K0805N316r865J0730J0580J8961P61l3272j2128l0390K6152
15902G69703J061R302M290M204j6041r627j2387J8035J4901j1673k6788J5042
15890G60022M5854r846J3811k631j6529l0602j298J6260J5186J349l5673o944
15878G48959K240J4732N994l939p352J3302J6853j1886M084N913J5043J2500M0383
15865H56826K7133o436j9808m749J6642p393l412O451k4529J4404J5337j2750
15853H57716k5802j9430k6406j5402J3667J3040J9287R787O908j6960q337J11
15841H08179N707J4799K0232Q130J6633j1360j2309p876J0967m696j3370k3856
$$ y = [740954, 731509, 775902, 788974, 763122, 738393, 723356, 732722, 724672, 704553, 734855, 759026, 761000, 762053, 782858, 788174, 778309, 789039, 799619, 818580, 819341, 786069, 773941, 743551, 769703, 770764, 780066, 784356, 788560, 772519, 762892, 750505, 768540, 783441, 771768, 744980, 760022, 805876, 796030, 809841, 807210, 790681, 760079, 758781, 775041, 790227, 791576, 755903, 748959, 751199, 765931, 771925, 767986, 760634, 773936, 790789, 778903, 782987, 788900, 803943, 816443, 856826, 883959, 877523, 857715, 852966, 869608, 862215, 858803, 865254, 840725, 855129, 870466, 857716, 831914, 812484, 786078, 770676, 784343, 797383, 816670, 826457, 833365, 816405, 808068, 808179, 813886, 828685, 848917, 857047, 873680, 862320, 850011, 842135, 853102, 848406, 835036, 811180]
15829H11180Q386K3865J3720k391K1400J2216J6033M0979n401J108j0794P808
15817I38109K001r533j0657r875J3879J0502L297R589L1208j7914n995j4463k4982
15804I15166N083j5532r758K8130j4883M089j6923K6897K8177o746q191J1533
15792I47042j0462l019m0246J4567R178L5989L9789J3762L838j4712k9361p096
15780I59269J2507l4j7188K8484o031m0333L5082L1263P94j3556L984L109l4661
15767I62689j6442M80M855k1000p290K3214L6098L6533k3141m5934l2679J634
15755I19017K2669K3295M744k1386j6359K66P810j3378K1344M1215j804p349J9597
15742I99681K1892M570P97j536L636K0598O263P822P871p379L564n853j8502L30
$$ y = [811180, 819566, 843431, 857151, 854760, 876160, 888376, 904409, 945388, 939987, 941095, 930301, 938109, 940110, 930577, 919920, 910045, 923924, 934426, 937723, 947312, 978520, 960606, 954611, 940148, 915166, 920249, 904717, 894959, 923089, 908206, 912295, 895372, 922269, 950446, 943700, 935509, 947042, 936580, 933561, 893315, 907882, 917060, 953049, 992838, 1006600, 1010438, 995726, 966365, 959269, 971776, 971742, 954554, 983038, 977007, 936674, 971756, 1003019, 1003813, 990257, 994241, 997350, 962689, 946247, 946727, 951582, 930582, 923292, 946506, 982604, 1019137, 995996, 950062, 917383, 919017, 941686, 964981, 969725, 948339, 931980, 932246, 940056, 926678, 948022, 989237, 987433, 980084, 999681, 1021573, 1026143, 1026940, 1025404, 1029040, 1049638, 1055901, 1063723, 1071594, 1064215, 1067779, 1061926, 1043424, 1043754]
15728A043754l1697j4317J0752L6361o874M81J9274L867n767J9508p197J6260
15716A084405O403k2792L225l059k0449K4581j7060j1651j0157O167J8701K3920
15704A082234K3828o080J3061L8169J0195l3955l8246K8909Q482j5301k8920J3792
15692A096168K6866Q643k4388p989K27J8366M243r393R522O519N837l191M864
15679A136294Q355O774l700j0777K450j112q816n824q340k3568J7935J1712M2745
15666A164128n45j7362o798J6822K3663l6066m581L1287J6323j9583O474J3682
15654A187444q145k8895k5888q732K2647m722q564J3792R370L374q848M381J9825
15641A167039M551J7743K2088K2693l737j9662k7013k4863j8285J2861J7250p464
$$ y = [1043754, 1012057, 997740, 1008492, 1044853, 1037979, 1038460, 1057734, 1061601, 1055834, 1075342, 1068145, 1084405, 1090808, 1068016, 1071241, 1068182, 1047733, 1072314, 1055254, 1043603, 1033446, 1039613, 1058314, 1082234, 1106062, 1099982, 1113043, 1151212, 1161407, 1127452, 1089206, 1118115, 1126597, 1111296, 1082376, 1096168, 1123034, 1131677, 1107289, 1099300, 1099527, 1117893, 1122136, 1112743, 1122265, 1128784, 1134621, 1131430, 1136294, 1144649, 1151423, 1147723, 1136946, 1139396, 1138284, 1129468, 1123644, 1115304, 1091736, 1109671, 1121383, 1164128, 1163583, 1146221, 1139423, 1156245, 1179908, 1143842, 1139261, 1170548, 1186871, 1167288, 1173762, 1187444, 1179299, 1150404, 1124516, 1115784, 1138431, 1133709, 1125145, 1138937, 1148307, 1151681, 1142833, 1147214, 1167039, 1171590, 1189333, 1211421, 1234114, 1230377, 1210715, 1183702, 1158839, 1140554, 1153415, 1170665, 1163201]
15629A163201j7540K0880M0987K7583j8417k1479R836K3651j3039l0467l1836
15618A153360k1890J36M0883J5021j9258J6329k303j4290K0381J4896R427j5657
15606A197035L834O749K0012K7086K0828j0025j0596l0459m611j778k56L5187
15594A253006o558p174k4244k2262L235m843L3633K7359K3479j3466n940J3658
15582A269883J0053L0313J3766j6889L509P254J6216L276j6504l5796j1388K5655
15570A299348j482k5397l132M8225J4435l8289k0811j328j6601j0934J2463J1957
15558A268454L4130J929P813j202j5290K672K3265p823j3308p617R326J2424k3778
15545A290995N08N430L773o355K771j0620j4726j217J1546P786J5581m041q260
$$ y = [1163201, 1145661, 1166541, 1207528, 1235111, 1216694, 1195215, 1205051, 1228702, 1215663, 1185196, 1153360, 1131470, 1131606, 1172489, 1187510, 1168252, 1184581, 1182278, 1167988, 1188369, 1203265, 1212692, 1197035, 1200869, 1207618, 1227630, 1254716, 1275544, 1265519, 1254923, 1224464, 1219853, 1218075, 1217819, 1253006, 1246448, 1239274, 1215030, 1192768, 1196003, 1191160, 1224793, 1252152, 1275631, 1262165, 1256225, 1269883, 1279936, 1310249, 1324015, 1307126, 1310635, 1317889, 1334105, 1337381, 1320877, 1285081, 1273693, 1299348, 1297866, 1272469, 1269337, 1317562, 1331997, 1293708, 1272897, 1271569, 1254968, 1244034, 1256497, 1268454, 1302584, 1304513, 1312326, 1311124, 1295834, 1298506, 1321771, 1313948, 1300640, 1293023, 1302349, 1314773, 1290995, 1291503, 1296933, 1300706, 1294351, 1297122, 1286502, 1271776, 1270559, 1282105, 1289891, 1305472, 1301431, 1293171]
15532A293171L354p863P102K3976J5364j0863M71j1678k245K338K8517N132J0639
15519A357415J566j0476R224K2588k3521J6788P822q698p177J6876o207N883q21
15506A381262j6892N679j1040k184J014K2856M739Q483Q505k6962k0807O352L4845
15493A395850L4255J2619l6669n350J4496j1374p082k4933l293K1145K3102J0396
15481A423162K1731k9574P388K2415j601k4832j4061J8830R783R47l464o730N357
15468A429351K8016J8206l5405l3362j4798J2303j0232J3469J229L384K1607j2274
15456A421494m588k1167P267M5355n656J2403P935q27j2016J8669J4172n230N773
15443A483584j0290J933l298R306J2994k9100n304Q066O869P573k432j108J3416
$$ y = [1293171, 1296525, 1288662, 1295764, 1319740, 1335104, 1324241, 1324712, 1313034, 1310789, 1313127, 1341644, 1346776, 1357415, 1358981, 1348505, 1357729, 1380317, 1356796, 1373584, 1381406, 1372708, 1365531, 1382407, 1376200, 1382083, 1381262, 1364370, 1370049, 1359009, 1356825, 1357839, 1380695, 1385434, 1393917, 1402422, 1375460, 1354653, 1361005, 1395850, 1430105, 1442724, 1406055, 1400705, 1415201, 1403827, 1396745, 1371812, 1368519, 1389664, 1412766, 1423162, 1444893, 1415319, 1422707, 1445122, 1443521, 1418689, 1404628, 1423458, 1433241, 1434188, 1430724, 1423994, 1429351, 1457367, 1475573, 1440168, 1406806, 1392008, 1404311, 1394079, 1407548, 1408777, 1412161, 1433768, 1421494, 1416906, 1395739, 1403006, 1448361, 1442705, 1455108, 1463043, 1462216, 1450200, 1468869, 1483041, 1477811, 1483584, 1473294, 1475227, 1471929, 1481235, 1494229, 1465129, 1459825, 1467891, 1474760, 1482333, 1479901, 1478793, 1492209]
15430A492209J8513j9230p3p818R696k181r369K8585j3555K0954j3873l2704Q37
15417A471991K5724K4225J2619m391L3297J6604j2561J3490m748k9235l3423j5436
15405A498156J392j0692l5907L451R375K0444Q845K2235J1345l9241K3932L0517
15393A543852j4399j5632j7161J3592L966l3765J9620M9229J3898j9632j7567
15382A526001j2005K5472J4673l264l031Q334j2469o978R586J2331R74k3575j3062
15369A522987m037J7830M6397N7450q691k4818j0897k1261j1114j2649k0371j216
15357A529610L1816L9692K6195m911j8671p58J968J6109k078M364J8953j6066
15345A626223j8912k6678j4214L0540K5134l2153k218J2827n88J2362l59J4905
$$ y = [1492209, 1510722, 1491492, 1491419, 1483601, 1493297, 1491116, 1481747, 1510332, 1496777, 1517731, 1503858, 1471154, 1471991, 1497715, 1521940, 1534559, 1530168, 1563465, 1580069, 1567508, 1580998, 1576250, 1547015, 1513592, 1498156, 1499548, 1488856, 1452949, 1456400, 1465775, 1486219, 1495064, 1517299, 1528644, 1489403, 1513335, 1543852, 1529453, 1513821, 1496660, 1510252, 1514218, 1480453, 1500073, 1549302, 1563200, 1543568, 1526001, 1513996, 1539468, 1554141, 1550877, 1547846, 1556180, 1543711, 1536733, 1546319, 1558650, 1559624, 1536049, 1522987, 1518950, 1536780, 1583177, 1640627, 1631936, 1607118, 1596221, 1574960, 1563846, 1551197, 1530826, 1529610, 1561426, 1601118, 1627313, 1622402, 1603731, 1602973, 1604941, 1621050, 1618972, 1623336, 1642289, 1626223, 1607311, 1580633, 1566419, 1596959, 1622093, 1589940, 1587722, 1600549, 1599961, 1612323, 1611964, 1626869]
15333A626869j6440M323L7148R753k3029k3387J4209k3690J254J4694P253j189
15321A627768j1312j7112K024j2195o526K8810K4977K4691K7943O152L7753j1145
15309A721828q653n452j7379l145j9328K4736K1715m576j8371N439R392J3339
15297A719545p127j9224l621j7193o002L2992K6177J1576Q70j7353j727L1414
15285A750327k033o2480O612L0642L5458j3607k765m890k6150j734J3814j4197
15273A708997J4203K3092n586k7450J169J4875L5273j9163j9693J9249J6509O019
15261A767494j8340l707J9835R643k2759R108M5121J1908r848o324j6437l9658
15249A746036j6025K1571J4425P045J0524N4919K6161j95k9704J3422k1424o4762
$$ y = [1626869, 1610429, 1614752, 1651900, 1661653, 1638624, 1615237, 1629446, 1605756, 1607010, 1621704, 1628957, 1627768, 1616456, 1599344, 1601368, 1589173, 1582647, 1611457, 1636434, 1661125, 1689068, 1695220, 1732973, 1721828, 1713175, 1707723, 1690344, 1687199, 1667871, 1692607, 1714322, 1709746, 1691375, 1696814, 1706206, 1719545, 1712418, 1693194, 1689573, 1672380, 1666378, 1699370, 1725547, 1737123, 1737993, 1720640, 1718913, 1750327, 1748294, 1685814, 1692426, 1723068, 1758526, 1744919, 1742154, 1737264, 1711114, 1709380, 1723194, 1708997, 1723200, 1746292, 1740706, 1713256, 1714425, 1729300, 1764573, 1745410, 1725717, 1744966, 1761475, 1767494, 1749154, 1745447, 1765282, 1774925, 1752166, 1761274, 1806395, 1818303, 1808455, 1802131, 1785694, 1746036, 1730011, 1751582, 1766007, 1773052, 1783576, 1838495, 1864656, 1864461, 1834757, 1848179, 1826755, 1761993]
15237A761993K045L53j3032J2153L1467M663k1559j4034J0388K1062J1502Q650
15225A815651q600N412j0471l2905J6737r218k4332L3457J5181j6137j207M2302
15213A825870J8184k1513m0014N757M8237k0807J3466K0543j376Q154k7690j5557
15201A813254R90j007J6085M588N274K1782L502p708n296J7878K5591o664l3799
15188A854470l930O630k0426K0386J8383k62K2325q686l846r66L1157O407j4813
15175A906829j6441k5658j1516N403J8790J8922L0098n783j9691k5168L6079K6434
15163A938298j5662m772k1304J745Q199L785Q81K8436j9450J515J7473K4009M686
15150A967839K774j3422k2800k95J8627J9112j2818k053L065j4459m861p615J1450
$$ y = [1761993, 1764038, 1764391, 1751359, 1763512, 1794979, 1799642, 1778083, 1764049, 1774437, 1795499, 1807001, 1815651, 1807051, 1812463, 1801992, 1769087, 1785824, 1776606, 1752274, 1785731, 1800912, 1784775, 1783568, 1825870, 1844054, 1822541, 1782527, 1788284, 1836521, 1815714, 1829180, 1849723, 1848347, 1856501, 1828811, 1813254, 1814244, 1813237, 1829322, 1833910, 1839184, 1860966, 1864468, 1856760, 1851464, 1869342, 1894933, 1888269, 1854470, 1850540, 1857170, 1836744, 1857130, 1875513, 1875251, 1897576, 1888890, 1885044, 1884078, 1915235, 1921642, 1906829, 1890388, 1864730, 1853214, 1858617, 1877407, 1896329, 1926427, 1920644, 1900953, 1875785, 1911864, 1938298, 1922636, 1917864, 1896560, 1898305, 1906504, 1910289, 1911170, 1939606, 1920156, 1921671, 1939144, 1963153, 1967839, 1970613, 1957191, 1934391, 1934096, 1952723, 1971835, 1959017, 1956964, 1960029, 1945570, 1940709, 1933094, 1944544]
15137A944544O125n613O656j0241O937K3251J7398K3391j7039N569m0306j3722
15125A946950L6087K1282J1017R287q55j6367J6865p014J3420J5575k0648j1526
15113B014073k1722j2519J3975J0219o021j3068m937o322M615J9547k0010j3851
15101A963979L4038M1071K1256j1786j7089M661l2857q708L0659j6817j9964j781
15089A986662q149o284n994j2769K9901R843K6476L6289p313l191L2578l0308
15077B047741j7110J524J7931m634K95j0493j97Q962O442J7080p243k037o579
15064B051682K4679K6450k4156q072J7001K9852j5066J098K0666j2901o086J3618
15052B118765l092j1950J0826J536K73j5031J9101R570k3387r599O574K5757L7132
$$ y = [1944544, 1950669, 1945056, 1951712, 1941471, 1948408, 1971659, 1989057, 2012448, 1995409, 2000978, 1960672, 1946950, 1983037, 2004319, 2015336, 2024623, 2023768, 2007401, 2024266, 2017252, 2030672, 2046247, 2025599, 2014073, 1992351, 1979832, 1993807, 2004026, 1998005, 1984937, 1980000, 1973678, 1978293, 1997840, 1977830, 1963979, 1998017, 2039088, 2060344, 2048558, 2031469, 2036130, 2003273, 1994565, 2025224, 2008407, 1988443, 1986662, 1978513, 1972229, 1966235, 1953466, 1983367, 1993210, 2019686, 2055975, 2048662, 2045471, 2078049, 2047741, 2030631, 2032155, 2050086, 2045452, 2045747, 2035254, 2035057, 2044019, 2050461, 2067541, 2060298, 2058261, 2051682, 2076361, 2102811, 2078655, 2070583, 2087584, 2117436, 2102370, 2103468, 2124134, 2111233, 2105147, 2118765, 2115673, 2103723, 2114549, 2116085, 2116358, 2101327, 2120428, 2129998, 2106611, 2097012, 2103586, 2129343, 2166475]
15039B166475R423L3289j640o82m6708m3047j4056k0766j0966J8318L0407J9337
15027B139384K1339Q315j6825l674k8092L6420J8985j2054K730k4793j1124K3655
15015B154266K5285o446l0726M1949K9590q673j7953J4572Q127j9152j020K1521
15003B211340L09L41l112J7103j9300J87o001k4622K8358K6725j2224j7782J1122
14990B212444K1609q539K5947N586j0985K4615J3499m8299n6453J6926J1000k1501
14978B185849K075M079R898K9359J5748J5777j3403j5859O955L3194K2292M101
14966B300065K2837J673J4890j0825r008j4338q790l1365Q699L3316k1359k7487
14954B258308N077L972m284K3542N264J5831k3543N013K6613M4691k5644k1114
$$ y = [2166475, 2175898, 2209187, 2207547, 2206865, 2160157, 2117110, 2103054, 2082288, 2071322, 2089640, 2120047, 2139384, 2160723, 2169038, 2152213, 2148539, 2120447, 2156867, 2175852, 2163798, 2166528, 2141735, 2130611, 2154266, 2179551, 2173105, 2142379, 2184328, 2213918, 2205245, 2187292, 2201864, 2209991, 2190839, 2189819, 2211340, 2211649, 2211990, 2208878, 2225981, 2206681, 2206868, 2200867, 2176245, 2204603, 2231328, 2219104, 2201322, 2212444, 2234053, 2225514, 2251461, 2257047, 2246062, 2270677, 2284176, 2235877, 2179424, 2196350, 2207350, 2185849, 2187924, 2192003, 2201901, 2231260, 2247008, 2262785, 2249382, 2233523, 2240478, 2273672, 2295964, 2300065, 2322902, 2324575, 2339465, 2328640, 2319632, 2305294, 2296504, 2265139, 2273838, 2307154, 2285795, 2258308, 2263385, 2267357, 2263073, 2286615, 2291879, 2307710, 2284167, 2289180, 2315793, 2360484, 2334840, 2313726]
14942B313726j765J5288L0845K8100k128j9186m918j371J0526J6971m5106q866
14930B332116K6283N786j9286o096j323n7888k8169M0279L5039L5205J3436O184
14918B381566K2081K1340o358k7455n818J7383J3151K99L09p452k1506j0892J7968
14905B394616K1173l057r825J5820q234n1866Q17K1502L2857J1336p686m485l5098
14892B377870k2864K463K9136J3021L2447J4358j5102J274O566j5315J8164p073
14880B434945k1721J3026r462O527K3089o40J1496J2718j21l589j4585Q784M32
14867B460899k0035J3318j78r352K7442O302q720L2597j3436P915J5610p205L5083
14854B540240K816j7371J5839j2945j107j7174j1713J3852M544J7702j0304o433
$$ y = [2313726, 2311961, 2327249, 2358094, 2386194, 2384066, 2364880, 2359962, 2358591, 2369117, 2386088, 2340982, 2332116, 2358399, 2364185, 2344899, 2338803, 2337480, 2279592, 2251423, 2291702, 2326741, 2361946, 2375382, 2381566, 2403647, 2424987, 2418629, 2391174, 2385356, 2402739, 2415890, 2416189, 2416498, 2409046, 2387540, 2376648, 2394616, 2415789, 2412732, 2402907, 2418727, 2410493, 2358627, 2359444, 2380946, 2413803, 2425139, 2417453, 2412968, 2377870, 2355006, 2357469, 2386605, 2399626, 2432073, 2446431, 2431329, 2432603, 2439169, 2423854, 2442018, 2434945, 2413224, 2426250, 2416788, 2423315, 2446404, 2445764, 2457260, 2469978, 2469857, 2466268, 2451683, 2460467, 2460899, 2440864, 2454182, 2454004, 2444652, 2472094, 2478396, 2469676, 2502273, 2488837, 2496752, 2512362, 2505157, 2540240, 2543056, 2525685, 2541524, 2528579, 2527472, 2510298, 2498585, 2512437, 2516981, 2534683, 2524379, 2517946]
14842B517946L634R756j907P347K0347j0866j7992K1709J7521q721J6338K581
14830B577693o007J0237O485q511k4462k2787K7663L1640L6369K903p690l6379
14818B587154l0540K2384L3734J2632J0457K3531J8418l4665k8189k4766j1989
14807B578161K7887Q501j6579J3891J9249o051n285m6404k152M0892J6285L516
14795B631911o300Q930J2875K1883K740N455j9258J3825R328n922j8768R459q306
14782B657852l842M3054l645j9617k1066j6704J0441L2345M3620J6926L296j8735
14770B723925j5676J6213J2743j4530L5199J3539j6106k4969j1197j6299J517
14759B704359p252P078J6024L0363l419l6676J4328J8865J8916k2340l2832J5226
$$ y = [2517946, 2521580, 2531336, 2529429, 2536776, 2557123, 2546257, 2528265, 2549974, 2567495, 2558774, 2575112, 2577693, 2571686, 2581923, 2588408, 2579897, 2555435, 2532648, 2560311, 2591951, 2628320, 2631223, 2623533, 2587154, 2556614, 2578998, 2612732, 2625364, 2635821, 2659352, 2677770, 2643105, 2614916, 2590150, 2578161, 2606048, 2614549, 2597970, 2611861, 2631110, 2625059, 2619774, 2573370, 2571218, 2612110, 2628395, 2631911, 2625611, 2634541, 2647416, 2669299, 2672039, 2677494, 2658236, 2672061, 2681389, 2675467, 2656699, 2666158, 2657852, 2654010, 2697064, 2693419, 2673802, 2652736, 2636032, 2646473, 2678818, 2722438, 2739364, 2742660, 2723925, 2708249, 2724462, 2737205, 2722675, 2757874, 2771413, 2755307, 2730338, 2719141, 2702842, 2704359, 2697107, 2704185, 2720209, 2750572, 2747153, 2710477, 2724805, 2743670, 2762586, 2740246, 2707414, 2722640]
14747B722640J4579J3988K319l498j552r344j2474O115M7875N2529j7686l4772
14735B780719R007N317p465N217J46J9019o705j5564K1554K2358j8172O927P667
14722B830025Q696j04j1531r60K1794K0096l091L012j1201l248K598N318j2996
14709B848408L3753L298j3101j6464J0727K5045K5722M760k4565j8358R029o489
14697B881765N523J8262k5070J2645J3360K7681R142j0620j8274n706K3670J0339
14685B942717Q267l0200k1250J3963J3188k743r201j2057J6949J310j1136K6231
14673B936038L8219P673Q01P012j0899o059K1490l052O873p222o022n017O695
14660B986530L5613L7521J0159k2428j1308j9234K119K0769j3977j0620J868L8605
$$ y = [2722640, 2737219, 2751207, 2753526, 2750028, 2748476, 2739132, 2726658, 2732773, 2780648, 2833177, 2815491, 2780719, 2789726, 2795043, 2787578, 2792795, 2792941, 2811960, 2805255, 2789691, 2811245, 2833603, 2815431, 2822358, 2830025, 2838721, 2838617, 2827086, 2826126, 2847920, 2868016, 2864925, 2867937, 2856736, 2853488, 2856086, 2861404, 2848408, 2882161, 2885459, 2872358, 2855894, 2866621, 2891666, 2917388, 2922148, 2897583, 2879225, 2888254, 2881765, 2887288, 2905550, 2880480, 2893125, 2906485, 2934166, 2943308, 2932688, 2914414, 2908708, 2932378, 2942717, 2950984, 2920784, 2899534, 2913497, 2926685, 2923942, 2914741, 2902684, 2919633, 2920943, 2909807, 2936038, 2974257, 2981930, 2982731, 2989743, 2978844, 2972785, 2994275, 2991223, 2998096, 2990874, 2984852, 2979835, 2986530, 3022143, 3059664, 3069823, 3047395, 3036087, 3016853, 3018972, 3039741, 3025764, 3015144, 3017012, 3055617]
14648C055617R755k3555l507j7208J4898J7417o474m871m455r575L3941L2636
14636C094619Q388J5416j8409J933j2599K9368Q206M01J4428q773k0910R78J3111
14623C126157K5613L230P682K0797k932K055N961j4707m9817j5469k3675L0128
14611C115023L0409J810p665J751M8599l112j9863n421L614L895q69p351M82K74
14597C161576J8831L4899K9381K6983K0392j3299m1383l2583n950R234Q798K2656
14585C239535o306j6771k0767j3339l89L8354L1396K0859Q973N197r026M577J5592
14572C297885k7222j3184l718K9625J3819j9272J7375J9553J0872M1813j3342
14561C354204j0168K8493K52k3468k0356Q971k3242j0310J4438J596N9045J1854
$$ y = [3055617, 3065372, 3041817, 3038310, 3021102, 3036000, 3053417, 3046943, 3042072, 3037617, 3028042, 3061983, 3094619, 3103007, 3118423, 3100014, 3101947, 3089348, 3118716, 3126922, 3127323, 3141751, 3132978, 3112068, 3113046, 3126157, 3151770, 3155000, 3162682, 3183479, 3180547, 3182602, 3188563, 3173856, 3124039, 3108570, 3084895, 3115023, 3145432, 3147242, 3139577, 3141328, 3189927, 3186815, 3166952, 3161531, 3165145, 3169040, 3168171, 3160820, 3161302, 3161576, 3180407, 3215306, 3244687, 3271670, 3292062, 3278763, 3237380, 3204797, 3198847, 3208081, 3216879, 3239535, 3233229, 3216458, 3195691, 3182352, 3181963, 3220317, 3251713, 3272572, 3281545, 3286742, 3277716, 3282293, 3297885, 3270663, 3257479, 3253761, 3283386, 3297205, 3277933, 3295308, 3314861, 3325733, 3367546, 3354204, 3344036, 3372529, 3372781, 3349313, 3328957, 3337928, 3314686, 3304376, 3318814, 3320410, 3379455, 3391309]
14549C391309K051p865J1200m705l2778j9565O036L0063K8195j45o714k2107M9234
14536C424209L2370j3658k0493j5960j4112n927J3218K26P522J5125n285K1056
14524C438291K1589J0817k785j4554o32K3544P609j6624q75N164J8529j2303j7180
14511C460590J0645K4657L025K3912j4001k8027K0660K7930J3577r189j0198K3068
14499C546649J6716J3043K1571J9245q103k16k4561k5981K1859k4959R057n295
14487C559025q712J7433K7140L4430L2735K9635N08l1916n0252K350L0714J224
14475C644314M736p253K3316n314q743K0726J6108k271l240m506Q711J0528k2345
14462C674767j0817P236K4337j963J0503m749j019j2981N105K7930L3739J2404
$$ y = [3391309, 3393360, 3385495, 3396695, 3391990, 3359212, 3339647, 3345683, 3375746, 3403941, 3403796, 3397082, 3374975, 3424209, 3456579, 3442921, 3422428, 3406468, 3392356, 3386429, 3399647, 3399873, 3407395, 3422520, 3417235, 3438291, 3459880, 3470697, 3467912, 3453358, 3452726, 3476270, 3483879, 3467255, 3466380, 3471544, 3490073, 3477770, 3460590, 3471235, 3495892, 3498917, 3522829, 3508828, 3480801, 3501461, 3529391, 3542968, 3533779, 3523581, 3546649, 3563365, 3576408, 3597979, 3617224, 3609121, 3608905, 3584344, 3558363, 3580222, 3555263, 3564320, 3559025, 3550313, 3567746, 3594886, 3629316, 3662051, 3691686, 3692194, 3660278, 3610026, 3612376, 3643090, 3644314, 3649050, 3641797, 3665113, 3659799, 3651056, 3671782, 3687890, 3685619, 3682379, 3677873, 3686584, 3697112, 3674767, 3663950, 3671186, 3695523, 3693560, 3704063, 3699314, 3698295, 3685314, 3690419, 3718349, 3752088, 3764492]
14450C764492l9867J9424j1805M1616L6664j626K746K0521k4065j1173l0360o197
14438C760370k41J4104L9073n663m432k4549j0731J3694J9243L0425L607r289
14426C825611j7110L657J9617J3929j8727j1567K927N058J6389K3216l564M635
14414C864071n664J4586J6672k6321M896N697J1558K0493K5609M4564J3894j4567
14402C975488k6517n131K7401J5423J595L069J5314M171j1373M549K044K0142
14390D026175N0654q913l4419k0499q36M1497p078Q65K0550n656j3450O714m946
14377D050658k053J623m218L2371P273j8034J625l888K6089K6829R112M0521P931
14364D175839j1627L96j5300p612N991l350K149O529q112m842J969K08j50K8569
$$ y = [3764492, 3724625, 3744049, 3732244, 3773860, 3810524, 3808898, 3811644, 3832165, 3808100, 3796927, 3766567, 3760370, 3760129, 3774233, 3813306, 3807643, 3803211, 3778662, 3767931, 3781625, 3800868, 3831293, 3834900, 3825611, 3808501, 3812158, 3831775, 3845704, 3826977, 3815410, 3818337, 3823395, 3839784, 3863000, 3859436, 3864071, 3858407, 3872993, 3889665, 3863344, 3868240, 3873937, 3885495, 3905988, 3931597, 3976161, 3990055, 3975488, 3948971, 3943840, 3971241, 3986664, 3988259, 3991328, 4006642, 4010813, 3999440, 4003989, 4006033, 4026175, 4076829, 4067916, 4033497, 4012998, 4012162, 4053659, 4046581, 4047446, 4067996, 4062340, 4048890, 4055604, 4050658, 4048605, 4050228, 4046010, 4078381, 4085654, 4067620, 4069245, 4065357, 4091446, 4118275, 4127387, 4167908, 4175839, 4164212, 4164608, 4149308, 4141696, 4147687, 4144337, 4146486, 4153015, 4144903, 4140061, 4142030, 4142238, 4142088, 4170657]
14350D170657K8155j962J103l696k2034k4981J3020k287O571K5024K5535J2850
14338D227955L0179J4756p420Q46J6840j7899o345J8254k4856J8005J6924J6330
14326D303569J7692k5253J1085M3327J9835L987m424J3492N374j3576q336Q618
14314D375390J3772j3204O666N483J5859J4701l044J9494J2394r953m633L7356
14302D470281L5779n877m3034l3121r99R342J5508M678q761p87K5777P745K5529
14289D502060J6978j2962K3292R34l057j311J3884N6374J8738l6564N397q487
14277D575276j0598J9921K9935J4271M767M674K1050R239l973j000N397m342k1016
14264D643601K1000J5446J634k3725l7513J2388K1533J7870Q315N733k285j7305
$$ y = [4170657, 4198812, 4196850, 4197953, 4194257, 4172223, 4147242, 4160262, 4157975, 4164546, 4189570, 4215105, 4227955, 4258134, 4272890, 4265470, 4266316, 4283156, 4265257, 4258912, 4277166, 4252310, 4270315, 4287239, 4303569, 4321261, 4296008, 4307093, 4350420, 4370255, 4374242, 4369818, 4383310, 4388684, 4375108, 4366772, 4375390, 4389162, 4375958, 4382624, 4388107, 4403966, 4418667, 4415623, 4435117, 4447511, 4437558, 4432925, 4470281, 4506060, 4500183, 4457149, 4424028, 4423029, 4432371, 4447879, 4452557, 4443796, 4443009, 4468786, 4476531, 4502060, 4519038, 4506076, 4529368, 4530302, 4527245, 4525934, 4539818, 4596192, 4614930, 4578366, 4583763, 4575276, 4564678, 4584599, 4614534, 4628805, 4633572, 4638246, 4659296, 4668535, 4664562, 4663562, 4668959, 4664617, 4643601, 4664601, 4680047, 4681681, 4657956, 4620443, 4632831, 4654364, 4672234, 4680549, 4686282, 4683997, 4666692]
14252D666692p247M2034K3220J6859K6702L0774R492j4209j0921j2893j781J0264
14240D778986L7727L9553L0590k906l7489k1887m762K0399K9206L6673J9622j1617
14228D914095k2196M052J2185J1138J4913j8170J3741N9508J9914J276K2347k2062
14216E010741k4722M047J4632K6160K0339J1579j661J0109l3901o11L7037L4415
14204E108164n076j6437O253L151K7406J5260K2355n431n433j0254Q541L0r258
14191E139271q713K377N388J7285M2426J3535Q164J4832r048P455K7284K5712
14179E285968M698k2130L1586J9315j6236o197l525K9333M2711k2883n5223J1254
14167E298671L8872Q681R734J8263j7775J2951R656R594K2078O0587J5196j8003
$$ y = [4666692, 4659445, 4701479, 4724699, 4741558, 4768260, 4799034, 4808526, 4794317, 4783396, 4770503, 4768722, 4778986, 4816713, 4856266, 4886856, 4883950, 4846461, 4824574, 4819812, 4840211, 4869417, 4906090, 4925712, 4914095, 4891899, 4895951, 4908136, 4919274, 4934187, 4916017, 4929758, 4989266, 5009180, 5010456, 5032803, 5010741, 4986019, 4990066, 5004698, 5030858, 5051197, 5062776, 5061115, 5071224, 5037323, 5036712, 5073749, 5108164, 5103088, 5086651, 5092904, 5096055, 5123461, 5138721, 5161076, 5155645, 5150212, 5139958, 5148499, 5148529, 5139271, 5130558, 5132935, 5138323, 5155608, 5198034, 5211569, 5219733, 5234565, 5225517, 5232972, 5260256, 5285968, 5290666, 5268536, 5300122, 5319437, 5303201, 5297004, 5293479, 5322812, 5365523, 5342640, 5287417, 5298671, 5337543, 5346224, 5355958, 5374221, 5356446, 5369397, 5379053, 5388647, 5410725, 5471312, 5486508, 5468505]
14155E468505j995j5246j543L242L3628J7687J1395j0325J8073J4312J5538J9893
14143E573164j798K584P898J3307O893P800J1668J5194k568p652O105k6522m616
14130E601457N6972N1054n150n239J2267j8783K905j0740J1628L0487N5619j1839
14118E770638j2559K9929J2183K478k3129l0082K0380L3301J5869j859k796L8046
14106E852399k5738K6751L7897L1117J0881P529n632q169R798J5334P295K2904
14094E982366J496K2300L2294J082J1620J2808j3208J4084J0895J6718r968K997
14082F085484J0659N1598K0039j4393J0362K8196M512j5849P332r306O459M7114
14070F232207M4776N766j6744K0160K9750j0097K565M0569P954J0700j4797p9
$$ y = [5468505, 5466510, 5451264, 5449721, 5452963, 5486591, 5504278, 5515673, 5505348, 5523421, 5537733, 5553271, 5573164, 5571366, 5573950, 5581848, 5595155, 5602048, 5609848, 5621516, 5636710, 5634142, 5626490, 5632595, 5606073, 5601457, 5658429, 5709483, 5704333, 5699094, 5711361, 5692578, 5695483, 5684743, 5696371, 5726858, 5782477, 5770638, 5758079, 5788008, 5800191, 5802669, 5779540, 5749458, 5769838, 5803139, 5819008, 5817149, 5814353, 5852399, 5826661, 5853412, 5891309, 5922426, 5933307, 5940836, 5935204, 5927035, 5936833, 5952167, 5959462, 5982366, 5983862, 6006162, 6038456, 6039538, 6051158, 6063966, 6050758, 6064842, 6075737, 6092455, 6082487, 6085484, 6096143, 6147741, 6167780, 6153387, 6163749, 6191945, 6196457, 6180608, 6187940, 6178634, 6185093, 6232207, 6276983, 6282749, 6266005, 6286165, 6315915, 6305818, 6308383, 6348952, 6356906, 6367606, 6352809, 6352730]
14058F352730L1331L422K5336L1191J4924o746q962R334N5554M0691J7202j3455
14046F552552j4176p367m64O828K0140K8774l356K9569J0494M32o334L3720K5802
14033F676614Q106K1326P32Q107l2657j4830N3005Q2523M3250Q057J5310P158
14021F876701K2938J0686R156j5732M3881M6591J0712J628J7921K4558J1313J0338
14009G070691J0720k620K2158K8458J5362j8269J8892P264J1029M5194N7933O0069
13997G326881K4227k8644J7198P9483O4442Q1598O5947N4339K1856p4297j45121
13986G487909k00404j23104l5498L0282M2714N4772N1985O9709N5901O7122M4916
13975G546304M4557N2726j2810q8290p7394o2391K5016Q1118M4579M1744N6093
$$ y = [6352730, 6384061, 6387483, 6412819, 6444010, 6458934, 6452188, 6443226, 6452560, 6508114, 6548805, 6566007, 6552552, 6538376, 6531009, 6530545, 6537373, 6557513, 6586287, 6582931, 6612500, 6622994, 6623426, 6617092, 6650812, 6676614, 6684720, 6706046, 6706778, 6714885, 6682228, 6667398, 6720403, 6802926, 6846176, 6854233, 6869543, 6876701, 6899639, 6910325, 6919481, 6903749, 6947630, 6994221, 7004933, 7006561, 7024482, 7049040, 7060353, 7070691, 7081411, 7078791, 7100949, 7129407, 7144769, 7126500, 7145392, 7152656, 7163685, 7208879, 7266812, 7326881, 7351108, 7322464, 7339662, 7419145, 7483587, 7565185, 7631132, 7685471, 7707327, 7633030, 7487909, 7287505, 7164401, 7128903, 7159185, 7201899, 7256671, 7308656, 7378365, 7434266, 7501388, 7546304, 7590861, 7643587, 7630777, 7542487, 7465093, 7402702, 7427718, 7508836, 7553415, 7595159, 7651252]
13964G651252N0665M5375j0023r0604j51990j20480n6433l9018K9792O1519O7941
13953G437996R2508O5702O1460O0658J3220q2281j18270n2174K3919M1701M5963
13942G590402O5270P9889P0258P2068Q2959P0291K3208k8223j81230k75163j88227
13931G381502l0653J6287L1954L9422P5843L8087M7763K4664J2276N3990M0610
13920G731745M1180K9970M8640L9986K0144L3786O9312M2069K3363j2523k4803
13909H042869r1K3713N0114M9859N676K381J5408M8020M253K7722M5526M0214
13897H355664K0016K4461P288L9115M5698J5299K1421R084L1814L5659L1071L3192
13885H669782P012J2148Q268K4307L0260M5971M9878Q153j2486N4047K1503J3197
$$ y = [7651252, 7701917, 7747292, 7737269, 7646665, 7494675, 7374195, 7317762, 7278744, 7308536, 7370055, 7437996, 7530504, 7596206, 7657666, 7718324, 7731544, 7649263, 7530993, 7478819, 7502738, 7544439, 7590402, 7655672, 7735561, 7805819, 7877887, 7960846, 8031137, 8054345, 8026122, 7844892, 7569729, 7381502, 7350849, 7367136, 7399090, 7438512, 7514355, 7552442, 7600205, 7624869, 7637145, 7691135, 7731745, 7772925, 7802895, 7851535, 7891521, 7911665, 7945451, 8014763, 8056832, 8080195, 8067672, 8042869, 8042778, 8066491, 8116605, 8166464, 8172140, 8174521, 8189929, 8237949, 8242202, 8269924, 8315450, 8355664, 8375680, 8400141, 8407429, 8446544, 8492242, 8507541, 8528962, 8538046, 8569860, 8605519, 8636590, 8669782, 8676794, 8688942, 8697210, 8721517, 8751777, 8797748, 8847626, 8855779, 8843293, 8897340, 8918843, 8932040]
13873H932040M089O336J8143J6808M2324L6655m020K6309P1199M2115K1457K9323
13861I242778K5677K3643P620J2678L4374L6149K0486K3510L3929L5603J0334
13850I506781L832K2470L8756M0008M3244L4112L0956L096J7598n829K3638P2521
13838I831183M4019O7958N7534L4616L318K0442K5087M1148L1438L9640J9934
13827A0216317L3268O5470M9460L7441R1012Q8418P2708N5776K555l3955o8686
13816A0609784j19182r2689m3287N5K8957P1177O8427M2133Q9611Q1918J03503
13805A0840407Q9843O2994J6278m1375p5370o4939J0845P4196Q0300J10359J27250
13794A1230788Q0357L174p9138r3094j08286j23539m5061K7971M5751Q3990J34796
$$ y = [8932040, 8936129, 8942465, 8960608, 8977416, 9019740, 9056395, 9052375, 9078684, 9149883, 9191998, 9213455, 9242778, 9268455, 9292098, 9299718, 9312396, 9346770, 9382919, 9403405, 9426915, 9460844, 9496447, 9506781, 9510613, 9533083, 9571839, 9611847, 9655091, 9689203, 9720159, 9723255, 9740853, 9735024, 9758662, 9831183, 9875202, 9943160, 10000694, 10035310, 10038628, 10059070, 10084157, 10125305, 10156743, 10196383, 10216317, 10249585, 10315055, 10364515, 10401956, 10492968, 10581386, 10654094, 10709870, 10712425, 10678470, 10609784, 10490602, 10397913, 10354626, 10354681, 10383638, 10454815, 10523242, 10565375, 10654986, 10736904, 10840407, 10930250, 10993244, 11009522, 10968147, 10892777, 10827838, 10838683, 10912879, 10993179, 11103538, 11230788, 11311145, 11314319, 11235181, 11142087, 11033801, 10910262, 10865201, 10893172, 10938923, 11022913, 11157709]
13783A1157709J22212J15030P6401O3172L3518o5210q9935o7447J3231M8838O6498
13772A1474017J11403J30649J39761J03253O8083P7243K0579r2293j62005j65217
13762A1705473j32018j3153K3050N0041Q5987J03418O2171K3861O5427Q0340O7896
13751A2122493N6153N6826K4686M8204M6700P9762N6083M1621M5669M6268O8217
13740A2692682M9283M0569O0197L4283K4616P3908P5677N0930M7373L3794M1721
13729A3225033O1182P3457P7069O1920J9327O9037M9577N4025Q3933N7367M1259
13718A3873186O4763O1834Q3713O8441O3538N2186j0506N3087K4687M5804N3191
13707A4433924M7800M1769L7599N0960P4731O2959P6907N4948O3451R6927R0982
$$ y = [11157709, 11279921, 11394951, 11471352, 11534524, 11568042, 11502832, 11412897, 11345450, 11358681, 11407519, 11474017, 11585420, 11716069, 11855830, 11959083, 12027166, 12104409, 12124988, 12032695, 11870690, 11705473, 11573455, 11560302, 11583352, 11633393, 11719380, 11822798, 11884969, 11908830, 11974257, 12054597, 12122493, 12178646, 12235472, 12260158, 12308362, 12355062, 12434824, 12490907, 12532528, 12578197, 12624465, 12692682, 12741965, 12782534, 12842731, 12877014, 12901630, 12975538, 13051215, 13102145, 13149518, 13183312, 13225033, 13286215, 13359672, 13436741, 13498661, 13517988, 13587025, 13636602, 13690627, 13774560, 13831927, 13873186, 13937949, 13999783, 14083496, 14151937, 14215475, 14267661, 14257155, 14310242, 14334929, 14380733, 14433924, 14481724, 14523493, 14561092, 14612052, 14686783, 14749742, 14826649, 14881597, 14945048, 15041975, 15132957]
13696A5132957L2629P6206J01272Q0711M0799L2600O1950L5961M5740P3203N1845
13685A5765873N2577L8818O5590R5298J12717P7170O2992P7691J05205O7073P4231
13674A6595235J13772Q9765P3083Q8767Q9409J16831Q0489K2997P176O7662Q9486
13663A7434672J09793J04341J55552J35544J24804J11227Q9892R2325O8292M0463
13653A8466905N1143R7377J24623J52396J52775Q9622R0852J04288R9239R4204
13643A9523424R7548J15194J27203J39348J90767K19236J54770J54378J77336
13634B0899204J68555J62180J62195J05842Q2012O2550k6722L99O336qP7045J76283
13622B1875871K08715J70669J65219K30526K68595K37077K20777J97025J83024
$$ y = [15132957, 15165586, 15241792, 15343064, 15423775, 15464574, 15497174, 15559124, 15595085, 15640825, 15714028, 15765873, 15818450, 15857268, 15922858, 16018156, 16130873, 16208043, 16271035, 16348726, 16453931, 16521004, 16595235, 16709007, 16798772, 16871855, 16960622, 17050031, 17166862, 17247351, 17270348, 17277524, 17345186, 17434672, 17544465, 17648806, 17804358, 17939902, 18064706, 18175933, 18265825, 18358150, 18426442, 18466905, 18518048, 18615425, 18740048, 18892444, 19045219, 19134841, 19225693, 19329981, 19429220, 19523424, 19620972, 19736166, 19863369, 20002717, 20193484, 20412720, 20567490, 20721868, 20899204, 21067759, 21229939, 21392134, 21497976, 21579988, 21642538, 21615816, 21616215, 21622551, 21622543, 21699588, 21875871, 22084586, 22255255, 22420474, 22651000, 22919595, 23156672, 23377449, 23574474, 23757498]
13613B3757498J39634P0963N4455J10364J75328K36258K99237K65343K48096J39760
13603B5496936N5551j5867o0113k5517P5074J90424K82779L67330L04734K43924
13593B6915255J78428J19600J09402J04145Q5059O8514Q4444J47123K79657L53210
13583B8444837M03322M09439M08824M14639M03780L47897K16658P3535p5751j19024
13573C0928156O8526K54436L43583M19027L82999L16205L10523L19560L07437
13564C3650452K96312L61914M30381N01361N31249N49574N69061O19276O62096
13555C8171676O44182O16968N81738M62448N03505N68148O09144P15243P85162
13546D3658214Q79007R31345J002482J005417J002917R09208P46212P01696Q51189
$$ y = [23757498, 23897132, 23968095, 24022550, 24132914, 24308242, 24544500, 24843737, 25109080, 25357176, 25496936, 25552487, 25536620, 25476507, 25450990, 25526064, 25716488, 25999267, 26366597, 26671331, 26915255, 27093683, 27213283, 27322685, 27426830, 27511889, 27580403, 27664847, 27811970, 28091627, 28444837, 28848159, 29257598, 29666422, 30081061, 30484841, 30832738, 31049396, 31122931, 31047180, 30928156, 30996682, 31251118, 31594701, 32013728, 32396727, 32712932, 33023455, 33343015, 33650452, 33946764, 34308678, 34739059, 35240420, 35771669, 36321243, 36890304, 37509580, 38171676, 38815858, 39432826, 40014564, 40477012, 40980517, 41548665, 42157809, 42873052, 43658214, 44537221, 45468566, 46471048, 47476465, 48479382, 49388590, 50134802, 50836498, 51687687]
13537E1687687J157211J368849J506087J625038J773272J974687K166756K356102
13529F5615689K586105K794678L196715L709995M326620N121712O008583O666933
13521A00027030O184303K732538m354228j2162172j3113445q169432r063009j4474759
13513D7606826j4426399n472080K025678N359105O611368P180134P638876Q160598
13505F4684106Q756439R056502P723887K326436p842960j7075257j5221170l352441
13497D9055542O017854O904784J006034p939296j2815359q268685m792557r467282
13489A9701035j6695819j5413593m672915L738918P570737R283458J0371360J1332791
13481B5215972J2274871J2526357R763480m22378j8749714l6263650l3007568
$$ y = [51687687, 52844898, 54213747, 55719834, 57344872, 59118144, 61092831, 63259587, 65615689, 68201794, 70996472, 74193187, 77903182, 82229802, 87351514, 93360097, 100027030, 106211333, 108943871, 104589643, 92427471, 79314026, 71144594, 62081585, 47606826, 33180427, 27708347, 29734025, 35093130, 41704498, 48884632, 56523508, 64684106, 73440545, 82497047, 90220934, 92547370, 84704410, 67629153, 52407983, 49055542, 55073396, 61978180, 62984214, 55044918, 42229559, 33960874, 29168317, 19701035, 3005216, -12408377, -17081292, -13342374, -5771637, 3511821, 13883181, 25215972, 37490843, 50017200, 59780680, 59358302, 40608588, 4344938, -28662630]
13474b8662630j3894453K168125Q938306J1250397J2124694J2382775J1300358
13467A5607572O296669n321930k0761042k8839465j8071099l052108N042540Q418701
13459d0680162R470448Q033217K253324q835303k0772913k2537742j0926133j070224
13451h5065488K941683M060356M318199M262167M006047L626238L310571L060514
13443e5479713K824278K456444K047264J811819J840905J867613J865242J832012
13435c8934136J792759J695074J654828J641647J557641J448507J425495J397172
13427b6321013J330528J264045J246221J200631J140046J075336J058716J050074
13419a6955416J056192J039695J032768R48170Q75395Q50736Q77381Q69376Q35974
$$ y = [-28662630, -42557083, -40388958, -31450652, -20200255, -8075561, 4307214, 15607572, 21904241, 16582311, -4178731, -33018196, -51089295, -54141403, -49098863, -40680162, -31209714, -23176497, -20923173, -29758476, -50531389, -73069131, -83995264, -85065488, -82123805, -78063449, -73745250, -69483083, -65477036, -61850798, -58540227, -55479713, -52655435, -50198991, -48151727, -46339908, -44499003, -42631390, -40766148, -38934136, -37141377, -35446303, -33791475, -32149828, -30592187, -29143680, -27718185, -26321013, -24990485, -23726440, -22480219, -21279588, -20139542, -19064206, -18005490, -16955416, -15899224, -14859529, -13826761, -12878591, -12003196, -11152460, -10275079, -9405703, -8569729]
13410h569729Q49321Q70648Q70615Q42943Q26154Q55520Q08495P90690P76951
13401a078392P80725Q00608Q09056P73053P61149P98154Q37540Q36573Q25884
13392F144350Q38286Q58985Q72115Q59005Q34930Q64903R15924R55539R93904
13383A4137941J070930J103143J125881J112347J141814J207811J275115J369570
13375B3544552J423195J523711J604070J624243J539456J490782J420426J423586
13367C5594021J592294J924363K371296K760684L128509L434711L840511M398597
13359E9044986N142339N909746O704698P292082O647989K386012p319868j8949948
13351F6858036k2363685j1175970M36324O104292Q330735R506920Q082929L62498
$$ y = [-8569729, -7720408, -6849760, -5979145, -5136202, -4310048, -3454528, -2646033, -1855343, -1078392, -297667, 502941, 1311997, 2085050, 2846199, 3644353, 4481893, 5318466, 6144350, 6982636, 7841621, 8713736, 9572741, 10407671, 11272574, 12188498, 13144037, 14137941, 15208871, 16312014, 17437895, 18550242, 19692056, 20899867, 22174982, 23544552, 24967747, 26491458, 28095528, 29719771, 31259227, 32750009, 34170435, 35594021, 37186315, 39110678, 41481974, 44242658, 47371167, 50805878, 54646389, 59044986, 64187325, 70097071, 76801769, 84093851, 90741840, 93127852, 85807984, 66858036, 44494351, 33318381, 33754705, 39858997, 48189732, 57696652, 65779581, 66142079]
13343F6142079j3798170k7190724k5221948r252734K405721P621429J0209152
13336A0914805J1994717J3190754J2434759O048063r191064k9264189l7386192
13329b1258347k3837625m385873N300369Q552015R743915J0472659J1184914J1659185
13321G431212J0998807P388276p85645j1399773j6649458j0678045n471217q264180
13313b7430023j3430103j0990337o87277O344056O029740j642972j3401314j8728410
13305g3936640j1605232l91111N291727O920078P154420P192061P374720P783624
13297d4216353Q197433P676892M596124k337953j0925640j4373459r639015q230094
13289f9252065j2884778j5328022q138283J0600L650269M603251M598163M216728
$$ y = [66142079, 52343909, 25153185, -68763, -9321497, -6915776, 705653, 10914805, 22909522, 36100276, 48535035, 54583098, 45392034, 16127845, -21258347, -45095972, -49481845, -44181476, -35629461, -25885546, -15412887, -4227973, 7431212, 18430019, 25818295, 25032650, 13632877, -3016581, -13694626, -19165843, -27430023, -40860126, -51850463, -52537740, -46193684, -40163944, -41806916, -55208230, -73936640, -85541872, -85932983, -80641256, -73721178, -66566758, -59374697, -51999977, -44216353, -36018920, -28342028, -23745904, -26083857, -37009497, -51382956, -61021971, -69252065, -82136843, -97464865, -105603148, -105592548, -101942279, -97339028, -92740865, -88524137]
13281h8524137L727220L163958K645565K281384K024951J770147J570078J474994
13273f9865840J572068J665327J613604J572058J532187J487542J429883J374400
13265e7618771J323085J231725J157956J133106J089235J042521R72247R51568
13257d8717328R03735Q95289Q54368Q50092Q20362P90919P64660O88298N24873
13248d1624732L05650K23573M06961N16051O09528N79117N33382N13887N03100
13239c7433483M64136M48788M65989M62990M38479L98900M02752M01861L61285
13230c3588303L32312L45053L85885L75373L38897L17901L14201K86897K53656
13221c0638128K60706K93979K63797L00202L26051K85493K43088K59748K32900
$$ y = [-88524137, -84796917, -81632959, -78987394, -76706010, -74681059, -72910912, -71340834, -69865840, -68293772, -66628445, -65014841, -63442783, -61910596, -60423054, -58993171, -57618771, -56295686, -55063961, -53906005, -52772899, -51683664, -50641143, -49668896, -48717328, -47813593, -46918304, -46063936, -45213844, -44393482, -43602563, -42837903, -42149605, -41624732, -41319082, -41095509, -40688548, -40172497, -39562969, -38983852, -38450470, -37936583, -37433483, -36969347, -36520559, -36054570, -35591580, -35153101, -34754201, -34351449, -33949588, -33588303, -33255991, -32910938, -32525053, -32149680, -31810783, -31492882, -31178681, -30891784, -30638128, -30377422, -30083443, -29819646, -29519444, -29193393, -28907900, -28664812, -28405064, -28172164]
13212b8172164K42116K33234K16840K12913K19980K18260J90974J95113K33575
13203b6209159K30451K00610J87036J86096J83158J93681J89030J85585J35444
13194b4518068J14091J11202J66371J89249J59839J58842J74491J65937J39384
13185b3138662J75388J49706J01223R4308O7609J14691J34552J16721J39258J31933
13175b1913273J34406J28769J21250R9201P5843R4345R3806Q6429P4220Q2118
13165b0922886J35537J39797J22971J12262J54483J25648R0879Q3010J07509R7329
13155a9753461O9455O8159Q2066J05702J58070J26745J03775R7578P3282O6671
13145a8801958N1901P8482J05998J36405J30487R8711J13814P7203R5884Q5527
$$ y = [-28172164, -27930048, -27696814, -27479974, -27267061, -27047081, -26828821, -26637847, -26442734, -26209159, -25978708, -25778098, -25591062, -25404966, -25221808, -25028127, -24839097, -24653512, -24518068, -24403977, -24292775, -24126404, -23937155, -23777316, -23618474, -23443983, -23278046, -23138662, -22963274, -22813568, -22712345, -22618037, -22550428, -22435737, -22301185, -22184464, -22045206, -21913273, -21778867, -21650098, -21528848, -21429647, -21353804, -21259459, -21165653, -21079224, -21005004, -20922886, -20787349, -20647552, -20524581, -20412319, -20257836, -20132188, -20041309, -19958299, -19850790, -19753461, -19684006, -19615847, -19533781, -19428079, -19270009, -19143264, -19039489, -18941911, -18868629, -18801958, -18750057, -18671575, -18565577, -18429172, -18298685, -18199974, -18086160, -18008957, -17913073, -17827546]
13135a7827546P2150P9184J16434N6579N3211O1409N0333J00070J26319R7714
13125a7014143L9684O8213Q3373Q7220R0359O4866P3036Q1978J10440R4759Q7750
13114a6132465O9533O9862Q4071P9027Q7297Q0578P5995L8312M3753M2470L2292
13103a5429275Q0644P2973R1354O2422O8853O2971R2243Q9252O5744K2529O7839
13092a4652451O7323N1214M7292N1560L3865N5991O0749M6494O8719N6745O6783
13081a4045716P4776P1008P9213M7284K1957N8364P2068L3301L0251L0643L3456
13070a3493395O1845R5266N3843N5815J4935O5942O8770K3120N1847N3294L7916
13059a2910802K3644L4038O5530O6846O4331O5864N4539M4106Q3118N3235L6169
$$ y = [-17827546, -17755396, -17676212, -17559778, -17503199, -17449988, -17388579, -17338246, -17238176, -17111857, -17014143, -16974459, -16906246, -16822873, -16735653, -16645294, -16580428, -16507392, -16425414, -16314974, -16220215, -16132465, -16062932, -15993070, -15908999, -15829972, -15742675, -15662097, -15586102, -15547790, -15504037, -15461567, -15429275, -15348631, -15275658, -15184304, -15121882, -15053029, -14990058, -14897815, -14808563, -14742819, -14720290, -14652451, -14585128, -14533914, -14486622, -14435062, -14401197, -14345206, -14284457, -14237963, -14169244, -14112499, -14045716, -13970940, -13899932, -13820719, -13773435, -13751478, -13693114, -13621046, -13587745, -13557494, -13526851, -13493395, -13431550, -13336284, -13282441, -13226626, -13211691, -13145749, -13076979, -13053859, -13002012, -12948718, -12910802, -12887158, -12853120, -12787590, -12720744, -12656413, -12590549, -12536010, -12491904, -12408786, -12355551, -12319382]
13048a2319382N3037N6848L5107J4047M2340O0582P0471J02201Q6194R9815Q4796
13037a1613944Q4742Q9579P755p7162j88903k46159j47842m1911N0024R5321J18266
13026a1870234J22651J18066N0920K3551L0655k4621l9205m6628m6223M1012P6070
13015a1563986O1680P9998N8507P4695Q4367R2274P1267O766m3773r1032j03051
13004a1272288n7996k2786q49M7889Q7059O8879N9574M2512k4818r5829m0384
12993a1209037J075P9182O9811M8901J06359N4056M4843P2914J03467O1930J7297
12982a0549202j0609n3115r9509j09786p5172k3288L500K7819N7808P0439P4028
12971a0687087K7970L4998O8074O7410J1040L5786L8894K8457L8527L9079N3004
$$ y = [-12319382, -12266345, -12209497, -12174390, -12160343, -12118003, -12057421, -11986950, -11884749, -11798555, -11698740, -11613944, -11529202, -11439623, -11431868, -11509030, -11697933, -11944092, -12091934, -12133845, -12083821, -11988500, -11870234, -11747583, -11629517, -11578597, -11555046, -11524391, -11549012, -11588217, -11634845, -11681068, -11640056, -11563986, -11502306, -11422308, -11363801, -11289106, -11204739, -11112465, -11041198, -11034432, -11078205, -11169237, -11272288, -11330284, -11353070, -11353919, -11306030, -11218971, -11150092, -11090518, -11048006, -11072824, -11168653, -11209037, -11207962, -11128780, -11058969, -11010068, -10903709, -10849653, -10804810, -10731896, -10628429, -10566499, -10549202, -10559811, -10612926, -10712435, -10822221, -10897393, -10920681, -10917181, -10889362, -10831554, -10761115, -10687087, -10659117, -10624119, -10556045, -10488635, -10477595, -10441809, -10402915, -10374458, -10335931, -10296852, -10243848]
12960a0243848N5441J4232L0934K1910K9244N5357M0792N1637M3351K2819n507
12949i883638q715M2692K0597M5356L1554O705N5035K2896K2487L6884K9148K8243
12937i550756n050K1077N4189K4850K1526M9775M2868K9007L3533M6923M2683
12926i189375Q81J4310K4867M2185O348K9146k1282n082M6462K1177J2499M2725
12914h975139L5212J3699J5155M0031J4143K1185L2560M6364J3899J5051R176
12903h718664K3538R734K382L7670M9179M6527L9326J9671L6594m077O641L3361
12891h418118L1881L2070J5237M9265M804K5792K5293K6626O0202N8280L9785
12880h048883L0777K5865J0859L9468M5161P4929Q3404Q0106L9179N049j26369
$$ y = [-10243848, -10188407, -10174175, -10143241, -10121331, -10092087, -10036730, -9995938, -9944301, -9900950, -9878131, -9883638, -9892353, -9849661, -9829064, -9783708, -9752154, -9745449, -9690414, -9667518, -9645031, -9608147, -9578999, -9550756, -9555806, -9534729, -9480540, -9455690, -9434164, -9384389, -9341521, -9312514, -9278981, -9232058, -9189375, -9188494, -9174184, -9149317, -9107132, -9100784, -9071638, -9092920, -9098002, -9051540, -9030363, -9017864, -8975139, -8939927, -8926228, -8911073, -8871042, -8856899, -8835714, -8803154, -8756790, -8742891, -8727840, -8718664, -8695126, -8685392, -8683010, -8645340, -8596161, -8549634, -8510308, -8490637, -8454043, -8458120, -8451479, -8418118, -8386237, -8354167, -8338930, -8289665, -8284861, -8259069, -8233776, -8207150, -8146948, -8088668, -8048883, -8018106, -7992241, -7981382, -7941914, -7896753, -7821824, -7738420, -7658314, -7619135, -7614086, -7740455]
12869g740455k30909k11669q0475J3811J659K6853M9341Q9980P2496P4141Q8009
12858g847218N3325L0687R1r9631r0756m5232J1719M5277O2295O5732P3898R6904
12846g642909Q9026L7434k2138j10557j53569j68726o0021J5628J5315O0814M7651
12835g892052O0114O0558K7130j5602n7723p5990l8567N325K4702N5966O6040
12824g780099N7406M0098N2933Q9383N2904M7695J7483n9951j93334j79362q9465
12813g944309k8910N0041O6222K523J7036L7688L7008N5889J8453M8625J2102
12802g627632J7680J4706Q756N4379M7064K5820L0539J8701j5759l269K5081K5045
12790g378889J7885M0990M2565M2416J8817J7324N107Q73K4027L2535l204J9090
$$ y = [-7740455, -7971364, -8183033, -8263508, -8249697, -8248038, -8221185, -8171844, -8081864, -8009368, -7935227, -7847218, -7793893, -7763206, -7763115, -7862746, -7953502, -7998734, -7987015, -7941738, -7879443, -7813711, -7739813, -7642909, -7553883, -7516449, -7538587, -7649144, -7802713, -7971439, -8031460, -8015832, -8000517, -7939703, -7892052, -7831938, -7771380, -7744250, -7759852, -7817575, -7893565, -7932132, -7926807, -7902105, -7846139, -7780099, -7722693, -7682595, -7629662, -7540279, -7487375, -7439680, -7422197, -7482148, -7675482, -7854844, -7944309, -7973219, -7923178, -7856956, -7854433, -7837397, -7799709, -7762701, -7706812, -7688359, -7639734, -7627632, -7609952, -7595246, -7586490, -7532111, -7485047, -7459227, -7428688, -7409987, -7425746, -7429015, -7403934, -7378889, -7361004, -7320014, -7277449, -7235033, -7216216, -7198892, -7193785, -7192912, -7168885, -7136350, -7139554, -7120464]
12778g120464N1601J2453K2340K6800k651J9296N067Q956J3350N932L8957K6987
12766f891376K3858L0414j3341J3219L8714M5553L996J6313L1377J6246L0341
12755f654686J8692K9250L9745J6786L2760K0703K5153M2524J7824Q210K2589
12744f380450M7214O3580J7002P411M4492Q790J7123r34K8415M4673M5670O0432
12732e996582O4111N6940J01442J16900J27948J37568J83295K47264K40522J41654
12722d578938j80888p29536j163846r71153l32383Q355R8783J35272J44461J09510
12712g460363J10605Q5833R7169L7000L5358L1845K821K3085K2335K0339L4797
12701f959176K0663K0192L5353J3132N825K2564K6257M5145M1141M1897O503K9281
$$ y = [-7120464, -7068863, -7056410, -7034070, -7007270, -7009921, -6990625, -6985558, -6976602, -6963252, -6957320, -6918363, -6891376, -6867518, -6837104, -6850445, -6837226, -6798512, -6752959, -6748963, -6732650, -6701273, -6685027, -6654686, -6635994, -6606744, -6566999, -6550213, -6517453, -6496750, -6471597, -6429073, -6411249, -6403039, -6380450, -6333236, -6269656, -6252654, -6245243, -6200751, -6191961, -6174838, -6175772, -6147357, -6102684, -6057014, -5996582, -5932471, -5875531, -5774089, -5657189, -5529241, -5391673, -5208378, -4961114, -4720592, -4578938, -4759826, -5489362, -6653208, -7624361, -7956744, -7948389, -7849606, -7714334, -7569873, -7460363, -7349758, -7263925, -7166756, -7129756, -7094398, -7062553, -7059732, -7036647, -7014312, -6993973, -6959176, -6938513, -6918321, -6882968, -6869836, -6864011, -6841447, -6815190, -6770045, -6728904, -6687007, -6680504, -6651223]
12689f651223Q224K0905L9266J9598J2685K2143K6515L3066j805j1269j7086L7797
12677f461184O1991N1555K2970J4486O030j185j200K4707L7307K9499L2503J240
12665f181281P300m983K0693K9022J3394M037k7634j7308O971L4457K6216k0702
12653f109818Q16Q938J4411J1680p280k5022J6778K4737K0103L4514P2230L8522
12641e899391q659j8981J6698L361q941l2957j0121M2215L2390K4237J6051K6286
12629e817812q87p393M7648J819k4853L071L4109j0355l3809J0837j070L626k165
12616e797234J6603L7611J7181K2719O996j1789K0297N7527J2510q75L969q920
12604e623405k6725m398J8984J5335K1825j0907M031O154O657K7589L8149q052
$$ y = [-6651223, -6642999, -6622094, -6582828, -6563230, -6550545, -6528402, -6501887, -6468821, -6470626, -6481895, -6498981, -6461184, -6399193, -6347638, -6324668, -6310182, -6304152, -6305337, -6306537, -6281830, -6244523, -6215024, -6182521, -6181281, -6173981, -6178964, -6158271, -6129249, -6115855, -6111818, -6139452, -6156760, -6149789, -6115332, -6089116, -6109818, -6109002, -6100064, -6085653, -6073973, -6081253, -6106275, -6089497, -6064760, -6044657, -6010143, -5937913, -5899391, -5908050, -5927031, -5910333, -5906972, -5915913, -5948870, -5958991, -5916776, -5884386, -5860149, -5844098, -5817812, -5818699, -5826092, -5778444, -5776625, -5801478, -5798407, -5764298, -5774653, -5808462, -5797625, -5798695, -5795069, -5797234, -5780631, -5743020, -5725839, -5703120, -5696124, -5707913, -5687616, -5630089, -5617579, -5618454, -5614485, -5623405, -5650130, -5654528, -5635544, -5620209, -5598384, -5609291, -5605260, -5599106, -5592449, -5564860, -5526711, -5534763]
12592e534763J6311q350K456N186K4842J0460m169J4947J7214M0522j7859k6933
12580e460136j3117K9722L0645L0681J4687j1286J8327Q573M891J5765N958p627
12568e332917J82J8783r53Q746k2900k6129M2631N640N759M7403J8498J0196K3571
12555e201490N703k9715p179r12r354J2596L0088L465o622J9511L268k3694O589
12542e197746L4L7255N143q277o870N504J0316m681L4337N85j5712Q734K9739
12529e101639K0468L3426j159l4821J3057J3862l4417k8039J9211K0251N839J8823
12517e055138j0922L102q251L6244L4435K6359J7432n589m0208j6986J280o481
12505e024723L2501K4277J0906k9603Q629L1544J7232k0478K4938M3750J258J465
$$ y = [-5534763, -5518452, -5526802, -5524346, -5519160, -5494318, -5483858, -5488027, -5473080, -5455866, -5415344, -5433203, -5460136, -5473253, -5443531, -5412886, -5382205, -5367518, -5378804, -5360477, -5351904, -5347013, -5331248, -5325290, -5332917, -5332735, -5313952, -5314905, -5306159, -5329059, -5355188, -5312557, -5306917, -5301158, -5253755, -5235257, -5225061, -5201490, -5195787, -5225502, -5232681, -5233593, -5242947, -5230351, -5200263, -5196798, -5203420, -5183909, -5180641, -5204335, -5197746, -5197712, -5160457, -5155314, -5163591, -5170461, -5164957, -5154641, -5159322, -5124985, -5124400, -5140112, -5131378, -5101639, -5081171, -5047745, -5048904, -5083725, -5070668, -5056806, -5091223, -5119262, -5100051, -5079800, -5073961, -5055138, -5066060, -5062958, -5071209, -5034965, -5000530, -4974171, -4956739, -4962328, -5002536, -5019522, -5018242, -5024723, -4992222, -4967945, -4957039, -4986642, -4978013, -4946469, -4929237, -4949715, -4924777, -4881027, -4879769, -4878304]
12493d878304k6952j0586R165K6384L0358P110P345m4492j1283K4527J4897Q281
12481d843550L63k0033k3390n197L4971M5225O983J1918j558J8428J6382J0530
12469d748928j5527j706M804J3728k392K864k4760K081J0645j2959k2404J7819
12457d776735K3913K6920J038L0449M482o76K6087K2663k3588j4490j5853k276
12445d698066L0073L1723M4005K348k0339r812p461P665J0757k2104N806J5050
12433d610355j4526m529K1491K0728L0176P75l73j2855N467J5813K7502j1768
12421d532454k8201J6297j6447n683M8092J9278J3371L432K0038k0773k6453J3512
12409d495991L2855k0544j8983q623K9625M2529J4274R174R829K6354l3002m4647
$$ y = [-4878304, -4905256, -4915842, -4906677, -4880293, -4849935, -4842825, -4835480, -4879972, -4891255, -4866728, -4851831, -4843550, -4843187, -4863220, -4886610, -4891807, -4856836, -4811611, -4804628, -4792710, -4794268, -4775840, -4759458, -4748928, -4764455, -4766161, -4761357, -4747629, -4750021, -4747157, -4771917, -4769836, -4759191, -4772150, -4794554, -4776735, -4752822, -4725902, -4724864, -4694415, -4689933, -4690609, -4664522, -4641859, -4665447, -4679937, -4695790, -4698066, -4667993, -4636270, -4592265, -4589917, -4610256, -4620068, -4627529, -4619864, -4609107, -4631211, -4625405, -4610355, -4624881, -4629410, -4607919, -4587191, -4557015, -4556240, -4556613, -4569468, -4564001, -4548188, -4520686, -4532454, -4560655, -4544358, -4560805, -4566488, -4518396, -4499118, -4485747, -4482315, -4462277, -4483050, -4509503, -4495991, -4463136, -4483680, -4502663, -4511286, -4481661, -4439132, -4424858, -4415684, -4405855, -4379501, -4412503, -4457150]
12397d457150J452K3849K6213n982J7063L3595L2312k2574k3857K2700J2953J0637
12385d328789L494o661j1435K3231q05K729j4630K173j4414n867K7544k738J2711
12372d313457Q348R224K382L449J660O584P441k455M326q616K9684R479K2972
12359d218979j1254j9576J4272k1581j7639Q773K2328O798J6306L4956k141O353
12347d181384J3940p943n443K2445o532p118n8692j5933L5751N4956K092k1834
12335d175695K4208K0379m396J520N2937K122m1706K357J8164n578L2465J5803
12323d057420l899k3032K086M115K2881k0667j6913n28k6507m402L2737M5986
12311d045563J2313m819q242J0596J432k3531j5399J0522n323j4683L7319L7010
$$ y = [-4457150, -4455698, -4431849, -4405636, -4411618, -4394555, -4360960, -4328648, -4351222, -4375079, -4352379, -4339426, -4328789, -4325295, -4331956, -4343391, -4320160, -4320965, -4318236, -4332866, -4330693, -4345107, -4350974, -4323430, -4326168, -4313457, -4305109, -4295885, -4293503, -4290054, -4288394, -4281810, -4274369, -4276824, -4272498, -4281114, -4251430, -4241951, -4218979, -4230233, -4249809, -4235537, -4257118, -4274757, -4265984, -4243656, -4236858, -4220552, -4185596, -4187737, -4181384, -4167444, -4175387, -4180830, -4158385, -4164917, -4172035, -4230727, -4246660, -4210909, -4155953, -4153861, -4175695, -4151487, -4131108, -4135504, -4133984, -4081047, -4078925, -4120631, -4118274, -4100110, -4105688, -4073223, -4057420, -4061319, -4084351, -4082265, -4078150, -4055269, -4075936, -4092849, -4093377, -4119884, -4124286, -4091549, -4045563, -4033250, -4038069, -4046311, -4035715, -4034283, -4057814, -4073213, -4062691, -4068014, -4082697, -4045378, -4008368]
12299d008368K6090j5682o954O662k350j8373N4771O412R64p589n154J2157k0674
12286c978088j7048J6634K268j1155J1951J3249J5052L2095j8225k2302K0012
12275c935557L1858K4396j7508n582m996N612O157r886j3265O283J9816K6721
12263c865951J2071K073k6194Q614K7885j1720M248J4324n273J9073K8410M529
12251c787911m7472k0355K2230K2196k3655l0657K6670L783M203N676M470j3264
12239c834086J3471J2591K9673J0003j1999j543K3021k220j950N163k6012L1533
12227c752355L2281j2003j8586j9867k118P283R813J421k663n099O74N842R90
12214c754387p488K4770K081J4538Q859O467K5495J5877L7033k285j5938J2314
$$ y = [-4008368, -3982278, -3997960, -4004914, -3998252, -4000602, -4018975, -3964204, -3957792, -3956828, -3964417, -3969571, -3957414, -3978088, -3995136, -3978502, -3976234, -3987389, -3975438, -3962189, -3947137, -3915042, -3933267, -3955569, -3935557, -3903699, -3879303, -3896811, -3902393, -3907389, -3901777, -3895620, -3905506, -3918771, -3912488, -3892672, -3865951, -3853880, -3851807, -3878001, -3869387, -3841502, -3853222, -3848974, -3834650, -3839923, -3820850, -3792440, -3787911, -3835383, -3855738, -3833508, -3811312, -3834967, -3865624, -3838954, -3835171, -3830968, -3825292, -3820822, -3834086, -3820615, -3808024, -3778351, -3768348, -3780347, -3781890, -3758869, -3761089, -3763039, -3757876, -3783888, -3752355, -3720074, -3732077, -3750663, -3770530, -3772648, -3765365, -3755552, -3754131, -3756794, -3761893, -3761219, -3755377, -3754387, -3761875, -3737105, -3735024, -3720486, -3711627, -3705160, -3679665, -3663788, -3626755, -3629040, -3644978, -3632664]
12202c632664R917k6991l6679J2777J0801N442J1093j4567r887J3831Q888R697
12190c638342o485o772j5635M0186P792k0296L7621K1015l0658q197K35M903K8587
12177c586046m291k0210j4672M958K661P014N4322m0125j8410K9098K1523k7652
12165c591830J3480N045L315K0784K0254k108K2894L2274J811k6047j5675p668
12153c523471N286j2085n136J1267j3828J5729J6631j4900j577M1924p934k2959
12141c511053l514P278R339j8596l3L3149L1856o220m076l637r637J79j900L4106
12127c442759J2238j9011Q958k9444k0796K8082K6944N941L619J0035K8347j8714
12115c406560j0295j5997J6144K8153L134M373l392J2792j0636o774j1731j6789
$$ y = [-3632664, -3622747, -3649738, -3686417, -3673640, -3662839, -3657397, -3646304, -3660871, -3670758, -3656927, -3648039, -3638342, -3644827, -3651599, -3667234, -3627048, -3619256, -3639552, -3601931, -3580916, -3611574, -3619771, -3619536, -3614633, -3586046, -3590337, -3610547, -3625219, -3620261, -3617600, -3610586, -3556264, -3596389, -3614799, -3585701, -3564178, -3591830, -3578350, -3573305, -3569990, -3549206, -3528952, -3531060, -3508166, -3475892, -3474081, -3500128, -3515803, -3523471, -3518185, -3530270, -3535406, -3524139, -3537967, -3522238, -3505607, -3520507, -3522084, -3480160, -3488094, -3511053, -3514567, -3507289, -3497950, -3516546, -3516579, -3483430, -3451574, -3457794, -3461870, -3465507, -3475144, -3474965, -3476865, -3442759, -3430521, -3449532, -3440574, -3470018, -3490814, -3462732, -3435788, -3429847, -3426228, -3416193, -3387846, -3406560, -3416855, -3432852, -3416708, -3388555, -3385421, -3381048, -3384440, -3371648, -3382284, -3389058, -3400789, -3417578]
12103c417578k5857n482o516J8586L8099J9304J7118L3467j8496k4677j5906M4001
12091c343937K1589j0720k596j0243l627L4615m62l7557M109M237j3418r885M946
$$ y = [-3417578, -3443435, -3448917, -3455433, -3436847, -3398748, -3379444, -3362326, -3328859, -3347355, -3372032, -3387938, -3343937, -3322348, -3333068, -3335664, -3345907, -3349534, -3314919, -3315381, -3352938, -3348829, -3344592, -3358010, -3367895, -3362949]
$$ [...]
##END NTUPLES=NMR SPECTRUM
##END=
