##TITLE=Analysis number 313852
Compound Code cc 48010
Book Reference 458/18
Project Code adrs
Chemist Name stevem
##JCAMPDX= 6.0         $$ Bruker NMR JCAMP-DX V2.0
##DATA TYPE= NMR SPECTRUM
##DATA CLASS= NTUPLES
##ORIGIN= Bruker BioSpin GmbH
##OWNER= NMR
$$ XWIN-NMR		Version 3.5
$$ Fri Sep 23 12:56:32 2005 GMT Daylight Time (UT+1h)  MAYBRIDGE\NMR@NMR_250MHZ
##.OBSERVE FREQUENCY= 250.131544655141
##.OBSERVE NUCLEUS= ^1H
##.ACQUISITION MODE= SIMULTANEOUS (DQD)
##.ACQUISITION SCHEME= undefined
##.AVERAGES= 16
##.DIGITISER RES= 18
##SPECTROMETER/DATA SYSTEM= dpx250
##.PULSE SEQUENCE= zg30
##.SOLVENT NAME= CDCl3
##.SHIFT REFERENCE= (INTERNAL, CDCl3, 0, 16.4345)
##AUDIT TRAIL= $$ (NUMBER, WHEN, WHO, WHERE, WHAT)
$$ ##TITLE= Audit trail, XWIN-NMR		Version 3.5
$$ ##JCAMPDX= 5.01
$$ ##ORIGIN= Bruker BioSpin GmbH
$$ ##OWNER= NMR
$$ C:\u/data/dgb/nmr/ADRS/9920/pdata/1/auditp.txt
$$ ##AUDIT TRAIL=  $$ (NUMBER, WHEN, WHO, WHERE, WHAT)
(   1,<2005-09-23 12:56:11.61 +100>,<MAYBRIDGE\NMR>,<NMR_250MHZ>,
      <created by zg, POWCHK disabled, PULCHK disabled
       configuration hash MD5:
       62 19 C7 07 E1 42 D1 B7 37 6C 3D D0 77 39 F9 E6
       data hash MD5: 64K
       95 26 E0 F4 DB 51 95 C0 5C 86 85 C4 71 B9 11 F9>)
(   2,<2005-09-23 12:56:24.25 +100>,<MAYBRIDGE\NMR>,<NMR_250MHZ>,
      <Start of raw data processing
       ef LB = 0.3 FT_mod = 6 PKNL = 1 SI = 32K 
       data hash MD5: 32K
       0B C6 5A 1B AF 68 B8 A3 75 8D 80 EC 1E C5 C4 E9>)
(   3,<2005-09-23 12:56:25.94 +100>,<MAYBRIDGE\NMR>,<NMR_250MHZ>,
      <apk 
       data hash MD5: 32K
       85 08 41 7D 86 D8 77 E6 A6 76 EC 5B 90 5B C4 8F>)
(   4,<2005-09-23 12:56:26.66 +100>,<MAYBRIDGE\NMR>,<NMR_250MHZ>,
      <abs ABSG = 5 
       data hash MD5: 32K
       C3 2A E3 D2 E8 E7 75 09 91 77 EA 0C 26 8B B2 0D>)
$$ ##END=
$$ 
$$ hash MD5
$$ CF A4 47 1D C5 26 E1 AD 47 66 8C 2D 31 C6 33 E6
##$RELAX= 
##$RELAX= 
##$RELAX= 
##$RELAX= 
##$RELAX= 
##$RELAX= 
##$RELAX= 
$$ Bruker specific parameters
$$ --------------------------
##$DU= <C:\u>
##$EXPNO= 9920
##$NAME= <ADRS>
##$PROCNO= 1
##$TYPE= <nmr>
##$USER= <dgb>
##$AMP= (0..31)
100 100 100 100 100 100 100 100 100 100 100 100 100 100 100 100 100 100 
100 100 100 100 100 100 100 100 100 100 100 100 100 100 
##$AQSEQ= 0
##$AQ_mod= 3
##$AUNM= <au_zg>
##$AUTOPOS= <28 >
##$BF1= 250.13
##$BF2= 250.13
##$BF3= 250.13
##$BF4= 250.13
##$BF5= 500.13
##$BF6= 500.13
##$BF7= 500.13
##$BF8= 500.13
##$BYTORDA= 1
##$CFDGTYP= 0
##$CFRGTYP= 5
##$CHEMSTR= <none>
##$CNST= (0..31)
1 1 145 1 1 1 1 1 1 1 1 1 1 1 1 1 1 1 1 1 1 1 1 1 1 1 1 1 1 1 1 1 
##$CPDPRG= <>
##$CPDPRG1= <>
##$CPDPRG2= <>
##$CPDPRG3= <>
##$CPDPRG4= <mlev>
##$CPDPRG5= <mlev>
##$CPDPRG6= <mlev>
##$CPDPRG7= <mlev>
##$CPDPRG8= <mlev>
##$CPDPRGB= <>
##$CPDPRGT= <>
##$D= (0..31)
0 1 0 0 0 0 0 0 0 0.06 0 0 0 0 0 0 0.0002 0 0 0 0 0 0 0 0 0 0 0 0 0 0 
0 
##$DATE= 1127476570
##$DBL= (0..7)
120 120 120 120 120 120 120 120 
##$DBP= (0..7)
150 150 150 150 150 150 150 150 
##$DBP07= 0
##$DBPNAM0= <>
##$DBPNAM1= <>
$$ [...]
##$SUBNAM7= <"">
##$SUBNAM8= <"">
##$SUBNAM9= <"">
##$SW= 20.6930455092707
##$SWIBOX= (0..15)
0 0 3 0 0 0 0 0 0 0 0 0 0 0 0 0 
##$SW_h= 5175.983436853
##$TD= 65536
##$TD0= 1
##$TE= 295.16
##$TE2= 300
##$TE3= 300
##$TEG= 300
##$TL= (0..7)
0 120 120 120 120 120 120 120 
##$TP= (0..7)
150 150 150 150 150 150 150 150 
##$TP07= 0
##$TPNAME0= <>
##$TPNAME1= <>
##$TPNAME2= <>
##$TPNAME3= <>
##$TPNAME4= <>
##$TPNAME5= <>
##$TPNAME6= <>
##$TPNAME7= <>
##$TPOAL= (0..7)
0.5 0.5 0.5 0.5 0.5 0.5 0.5 0.5 
##$TPOFFS= (0..7)
0 0 0 0 0 0 0 0 
##$TUNHIN= 0
##$TUNHOUT= 0
##$TUNXOUT= 0
##$USERA1= <user>
##$USERA2= <user>
##$USERA3= <user>
##$USERA4= <user>
##$USERA5= <user>
##$V9= 5
##$VALIST= <valist>
##$VCLIST= <CCCCCCCCCCCCCCC>
##$VD= 0
##$VDLIST= <DDDDDDDDDDDDDDD>
##$VPLIST= <PPPPPPPPPPPPPPP>
##$VTLIST= <TTTTTTTTTTTTTTT>
##$WBST= 1024
##$WBSW= 4
##$XGAIN= (0..3)
0 0 0 0 
##$XL= 0
##$YL= 0
##$YMAX_a= 613986
##$YMIN_a= -624238
##$ZGOPTNS= <>
##$ZL1= 120
##$ZL2= 120
##$ZL3= 120
##$ZL4= 120
##$ABSF1= 16.43447
##$ABSF2= -4.258701
##$ABSG= 5
##$ABSL= 3
##$ALPHA= 0
##$AQORDER= 0
##$ASSFAC= 0
##$ASSFACI= 0
##$ASSFACX= 0
##$ASSWID= 0
##$AUNMP= <proc_1d>
##$AZFE= 0.1
##$AZFW= 0.1
##$BCFW= 0
##$BC_mod= 0
##$BYTORDP= 0
##$COROFFS= 0
##$CY= 12.5
##$DATMOD= 1
##$DC= 0
##$DFILT= <>
##$DTYPP= 0
##$F1P= 14.0000005364418
##$F2P= -0.99999901652339
##$FCOR= 0.5
##$FTSIZE= 32768
##$FT_mod= 6
##$GAMMA= 0
##$GB= 0
##$INTBC= 1
##$INTSCL= 1
##$ISEN= 128
##$LB= 0.3
##$LEV0= 0
##$LPBIN= 0
##$MAXI= 10000
##$MC2= 0
##$MEAN= 0
##$ME_mod= 0
##$MI= 0
##$NCOEF= 0
##$NC_proc= -2
##$NLEV= 6
##$NOISF1= 0
##$NOISF2= 0
##$NSP= 0
##$NTH_PI= 0
##$NZP= 0
##$OFFSET= 16.43447
##$PC= 1
##$PHC0= 131.0806
##$PHC1= 4.843729
##$PH_mod= 1
##$PKNL= yes
##$PPARMOD= 0
##$PSCAL= 4
##$PSIGN= 0
##$REVERSE= no
##$SF= 250.130021893024
##$SI= 32768
##$SIGF1= 0
##$SIGF2= 0
##$SINO= 400
##$SIOLD= 32768
##$SREGLST= <1H.CDCl3>
##$SSB= 0
##$STSI= 32768
##$STSR= 0
##$SW_p= 5175.98343685301
##$SYMM= 0
##$S_DEV= 0
##$TDeff= 65536
##$TDoff= 0
##$TI= <Analysis number 999999
Compound Code 99
Book Reference 9
Project Code 9>
##$TILT= no
##$TM1= 0
##$TM2= 0
##$TOPLEV= 0
##$USERP1= <user>
##$USERP2= <user>
##$USERP3= <user>
##$USERP4= <user>
##$USERP5= <user>
##$WDW= 1
##$XDIM= 32768
##$YMAX_p= 398007659
##$YMIN_p= -12832
$$ End of Bruker specific parameters
$$ ---------------------------------
##NTUPLES= NMR SPECTRUM
##VAR_NAME=  FREQUENCY,     SPECTRUM/REAL,   SPECTRUM/IMAG
##SYMBOL=    X,             R,               I
##VAR_TYPE=  INDEPENDENT,   DEPENDENT,       DEPENDENT
##VAR_FORM=  AFFN,          ASDF,            ASDF
##VAR_DIM=   32768,         32768,           32768
##UNITS=     HZ,            ARBITRARY UNITS, ARBITRARY UNITS
##FACTOR=    0.157963299565203, 1,           1
##FIRST=     4110.75414655484, 0,            0
##LAST=      -1065.22929029817, 0,           0
##MIN=       -1065.22929029817, -12832,      0
##MAX=       4110.75414655484, 398007659,    0
$$ Real data points
##PAGE= N=1
##DATA TABLE= (X++(R..R)), XYDATA
$$ [...]
17579A0415J386k047L372K385p99m315l818J393N104J539k297j331N3j1j839l40
17563H850k22K776J401M996M235l095l625O00J33l245q01K194Q56o81j967k733
17547I672j379M140M603j472k489o87j960j26K555J181K082L345M63m601o25j969
17531A2733K367J339K7j970j209k436j161p80K703j316k414j475M016K592p07
17516A2309J794L203n14k130j020o64j091m589R79K644j635M504L121k27k813
17501A3871K08K932j79j130k158j542m26m561M14N608K151m165j575L246L199
17486A5893o11K53j821k472m757R54K511j240L812j336k308l44N05k992J936L748
17470A1731k507k200J035J943K910K54j796k333nK616j060j525q14J318J693N179
$$ y = [10415, 11801, 9754, 13126, 15511, 14712, 10397, 6579, 7972, 13076, 14615, 12318, 10987, 11040, 11029, 9190, 8850, 8628, 11404, 12805, 17801, 22036, 18941, 15316, 15916, 16049, 12804, 12003, 14197, 15053, 14372, 12405, 9672, 8293, 12433, 17036, 15564, 13075, 12388, 10428, 10302, 12857, 14038, 16120, 19465, 19928, 15327, 14702, 12733, 15100, 16439, 16466, 14496, 13287, 10851, 9690, 8910, 11613, 10297, 7883, 6408, 10424, 13016, 12309, 14103, 17306, 16792, 14662, 13642, 12978, 11887, 7298, 8277, 10921, 9286, 13790, 16911, 16684, 13871, 14079, 17011, 16832, 15702, 13544, 12002, 11576, 7015, 7429, 13037, 15188, 11023, 9448, 12694, 15893, 15282, 15535, 13714, 11242, 6485, 7439, 9950, 8710, 12522, 11186, 8878, 8534, 9039, 6047, 7983, 11731, 9224, 7024, 8059, 10002, 12912, 13166, 11370, 9037, 9032, 11648, 10588, 9063, 8249, 9567, 11260, 16439]
17454A6439J854J447r35l294n08J118j312k552n75M514L033K392O426J0571O177
17439D4795m562l858o362o672k777n602p38J427N24k165l835J125K548K733l37
17424A6244l039K503P47K935K158K430P477J4831K2488J7528n35p560j7968j9211
17410D1028j3802n470L106P10l627o654k945O48l88P10l267m68J394j640j688
17395G647J575J401q36j368P49O60k85j956J43k1O06r33l68k865j283k34l47L182
17377E467M639R19l300j233J940l38k023p16J359J571j026j644j68o53k818k000
17361b4K730L300P38R60J480Q61k588k977m1J183L689M559O18k224j301k746j478
17344F739J468L832p11k366K121Q4j92k424j355k195O74m01k268J316L503j758
$$ y = [16439, 18293, 19740, 18805, 15511, 15003, 16121, 14809, 12257, 11682, 16196, 19229, 21621, 28047, 38618, 44795, 40233, 36375, 30013, 23341, 20564, 14962, 14224, 15651, 16175, 14010, 10175, 11300, 13848, 16581, 16244, 13205, 15708, 16455, 19390, 21548, 23978, 31455, 46286, 68774, 86302, 85767, 78207, 60239, 41028, 27226, 21756, 24862, 25572, 21945, 15291, 12346, 12994, 12606, 13316, 10049, 9581, 10975, 9335, 7647, 9222, 10623, 9787, 8419, 9168, 9828, 9543, 7587, 7730, 7709, 8315, 7382, 7014, 4149, 2866, 2632, 2285, 5467, 10106, 11025, 7725, 6492, 8432, 8094, 6071, 5355, 6714, 8285, 7259, 5615, 5447, 4794, 1976, -24, 2706, 6006, 6744, 7704, 9184, 10045, 7457, 4480, 4439, 5622, 9311, 13870, 14488, 12264, 10963, 8217, 6739, 8207, 12039, 11328, 8962, 11083, 11167, 10975, 8551, 7196, 5001, 5675, 5274, 3006, 4322, 7825, 6067]
17328F067q02n09R62n72j114M180K88l4P32l124k165J502K168j25J393K991j808
17311A0030m448J73O2o87K296L007J635J843j763l501Q29J210k205k053j080m26
17295D922L06j766k341K830J979l804K158k9j573K740L379Q07j1K230K928o38
17279A4117j687k376l574O26j10J170r30N54P54R21k527J447r14L64m640k941
17263B54M257J191k438P7j047J788K54L811O48K9k680M22k34k807k674K104R34
17246C889O15m87j650J239J420L78J793k106j157K3P85J119L327L907k78p55k891
17229I171k144k281J888j39k571M53L227L63j981L82m47N66l150j15K52l40J549
17212D683J527j752j756k533r49J47L64K518M847Q93J279N25j630m183j232K803
$$ y = [6067, 5265, 4756, 5718, 5146, 4032, 8212, 8500, 8466, 9198, 6074, 3909, 5411, 7579, 7454, 8847, 11838, 10030, 5582, 5755, 5817, 5130, 7426, 10433, 12068, 13911, 12148, 8647, 9476, 10686, 8481, 6428, 5348, 4922, 5228, 3462, 1121, 3951, 5930, 2126, 4284, 4255, 2682, 5422, 8801, 9608, 9597, 11827, 14755, 14117, 12430, 10054, 6480, 7106, 6996, 8166, 7236, 7790, 8544, 9465, 6938, 8385, 7471, 7835, 3195, 254, 4511, 5702, 3264, 3341, 2294, 4082, 4336, 8147, 8795, 8824, 6144, 6566, 6332, 3525, 851, 2955, 3889, 4504, 4017, 2367, 3606, 5026, 5404, 7197, 5091, 3934, 3957, 4742, 5861, 9188, 13095, 12817, 12062, 9171, 7027, 4746, 6634, 6495, 3924, 4377, 7604, 7967, 5986, 6368, 5921, 6487, 3337, 3222, 3474, 3134, 4683, 6210, 4458, 2702, 169, -780, -633, -269, 2249, 7096, 7989, 9268, 9793, 8163, 3980, 2748, 5551]
17196E551J103K623q54K444K141k428k389j44k710O4K496r07K492M375j817N68
17180A2608l35M26j676m099l110M1n99J496J835K989J261j446L8L2m313k630L44
17163B862J589J040Q81K641M66k336k306K450L733j274L27j399j949j514j92j848
17147C171k490K981J217k755L359J784J52L170R59Q55k282l236J212J989J585
17132A1671L754n49k854k266k377j787J981K685K93l273J729K725J679m549p06
17117H156J492j027k649j77R33J34j710k362j79J950O38P58j039j5k403j676j465
17100f41M60N068K157k41j485r87m86K583L282p91j035r13J935L8o18n675j140
17083A511J168j89j709R29L27J444k11j981j039K19R84K965J924j012l281J388
$$ y = [5551, 6654, 9277, 8423, 10867, 13008, 10580, 8191, 8047, 5337, 5401, 7897, 6990, 9482, 13857, 12040, 12608, 12273, 12699, 11023, 6924, 3814, 3855, 3256, 4752, 6587, 9576, 10837, 9391, 9429, 9461, 5148, 2518, 2862, 4451, 5491, 6372, 9013, 9479, 7143, 4837, 7287, 11020, 9746, 10073, 8674, 6725, 5211, 5019, 3171, 681, 3662, 4879, 2124, 5483, 7267, 7419, 10589, 11548, 12403, 10121, 6885, 8097, 10086, 11671, 15425, 14876, 12022, 9756, 7379, 5592, 7573, 10258, 10551, 7278, 9007, 11732, 13411, 8862, 8156, 9648, 8621, 5972, 5795, 6728, 6862, 5152, 2790, 2611, 4561, 5199, 5957, 4918, 4903, 2500, 824, -641, -181, 4887, 7044, 6803, 5318, 4331, 3845, 6428, 9710, 8919, 7884, 6971, 8906, 8944, 8326, 2651, 1511, 2679, 2490, 781, 1710, 2037, 3481, 3270, 1289, 250, 469, 1453, 4418, 6342, 5330, 2049, 3437]
17067C437P00L50K675j787m89q59L243L01%k363j610L60L259l74k1N03o38L531
17049A0218Q84j995j534l635M03K776q69p62l95m889k706j065K238L497k35k007
17033g6j405p77J433N346J698o02j64L020m84k032n53M14L83K372N94n619r20
17016B628j7L22m8k576q70K05M17j922k99L936M74L61L266l65j682L024l85l243
16998C226l33O37K323n01j991k554R20J760J410K183o06k031p6n37K059L009j995
16981F903j012R12j934K183L931L944l733o97K000l891l423l8P9J318q58m89k141
16964C054n01Q91k655j847J499K493l7k604P2N078M204K339j800J811J222r41
16948A2278m420L85J538l061j959j13J035j411j593L624J999k190j649K420J523
$$ y = [3437, 4137, 4487, 7162, 5375, 4886, 4027, 7270, 7571, 7571, 5208, 3598, 3958, 7217, 6843, 6822, 7325, 6687, 10218, 11102, 9107, 7573, 3938, 4341, 7117, 6248, 5486, 5091, 202, -2504, -3569, -1331, 2166, 1931, -76, -1481, -2258, -825, 4521, 6219, 5617, 5453, 8473, 7989, 5957, 5404, 5818, 6201, 8573, 9167, 3548, 2628, 2611, 2933, 2885, 309, -561, -356, 61, -1861, -2160, 1776, 2250, 2611, 5877, 5512, 3830, 6854, 6469, 3226, 2893, 3530, 5853, 5352, 3361, 807, 1727, 3487, 4897, 7080, 6474, 4443, 4367, 3830, 5889, 8898, 6903, 5891, 6803, 4869, 7052, 10983, 14927, 11194, 10497, 12497, 8606, 5183, 5145, 5224, 6542, 5684, 5195, 3054, 2553, 3444, 789, -1058, 441, 2934, 2897, 293, 365, 5443, 9647, 11986, 10186, 11997, 13219, 12278, 7858, 8243, 9781, 6720, 4761, 4648, 5683, 4272, 2679, 6303, 8302, 6112, 4463, 6883, 8406]
16933H406J37l58j123k424n554p92N42O9Q82N390M154q60j769k087j424O89N15
16916D393K49K18K962k451m82k608q38K464K742N14j846j350P70J800J336n77
16900G296K948M66j987Q44J399k61m725k051q75l256J729J046j576k135j193J983
16884c48K628J179J021J044m060P12K857j128J070R65J560K366K153l184j326
16869G509k824k884Q97P11j498j555L11K081Q23m12K80j203j649J45L495J276
16853E503k111j264K997K044k210k499j630K555l68L96j0J625n92K126K592o011
16837C143n166K898J318J433k042K175M34k450j094O2O40J225J36k155O46K673
16821C876j002l148j373j560p07K92K166j20k811J37M929J747J25Q57o52R2K954
$$ y = [8406, 8543, 8185, 7062, 4638, -916, -1708, -1166, -1097, -215, 5175, 9329, 8469, 6700, 4613, 3189, 3878, 4393, 4642, 4860, 7822, 5371, 4889, 2281, 1443, 3907, 6649, 7163, 5317, 3967, 4737, 6537, 7873, 7296, 10244, 10710, 8723, 9567, 10966, 10705, 5980, 3929, 3054, -202, 1527, 2573, 997, -1138, -2331, -348, 2280, 3459, 4480, 5524, 1464, 2176, 5033, 3905, 4975, 5940, 7500, 9866, 12019, 8835, 7509, 4685, 1801, 2698, 3409, 1911, 356, 667, 2748, 3571, 3159, 3439, 2236, 587, 732, 4227, 5503, 3392, 2128, 5125, 7169, 4959, 2460, 830, 3385, 3017, 3413, 3403, 5028, 4436, 6562, 9154, 3143, -2023, 875, 2193, 3626, 1584, 3759, 4193, 1743, 649, 711, 1351, 2576, 2712, 557, 1203, 3876, 2874, -274, -1647, -3207, -3914, -3622, -1456, -1576, -4387, -4250, 679, 2426, 2551, 3408, 2756, 2848, 5802]
16804E802J485j268p95l152l029r56o20J966N26M436K966j08J456n898l252J229
16788G88L100J755k762j31Q07n27r11K153K387k875j870j440k563J305j285r25
16772b994L037K156k929k70J91l071m01N336L290n82j822q28P77j152J088O30
16756B456J857J617m564j598L351J489J338l524k591J123N9q60J853J574K440
16741F020k434j845L664P04j186j156j218j672K018J65l789j205M86j251N85L568
16725A454K034K14J269K324j309j032j511n80J804k36J809K348j712k983K82m14
16709C761j104L1L124n16j343k405n06j206K330K061K523j184j787K52k656l187
16693a812J586K235P02j569L724J665l820k352K367r45n19K72l701K207J056R96
$$ y = [5802, 7287, 6019, 5224, 2072, -957, -1913, -2533, -567, -41, 4395, 7361, 7253, 8709, 2811, -441, 788, 3888, 5643, 2881, 2750, 3557, 3030, 2119, 4272, 6659, 3784, 1914, 474, -2089, -784, -2069, -2994, 43, 2199, -730, -1000, -809, -3880, -4281, 1055, 4345, 3763, 1941, 1113, 1890, 738, 1826, 2456, 4313, 5930, 1366, -232, 3119, 4608, 5946, 2422, -169, 954, 1013, 153, 2006, 3580, 6020, 3586, 1741, 5405, 6109, 4923, 3767, 2549, 877, 2895, 3060, -729, -1934, -1448, -2699, -2114, 1454, 3488, 3702, 4971, 7295, 5986, 4954, 3443, 2863, 4667, 4431, 6240, 8588, 6876, 3893, 4175, 3761, 2657, 2688, 5812, 5296, 3953, 1548, 1042, -164, 2166, 4227, 6750, 5566, 3779, 4031, 1375, -1812, -226, 2009, 2711, 1142, 4866, 6531, 2711, 359, 2726, 1781, 1262, 1534, -2167, 40, 1096, 2092]
16677B092M640J712j146l376j876j196P56l640k097L948L910L384P08J829l893
16662E755n58K690k856j582l841k534j968M404K710j075j059J940l456J380K654
16647B604K439R93R29l802J055M553P46j324j223j262l102j250m97k717L12L294
16631A748J153L214l851l051L378R53r92m172l152n42K844J896j645O48K780R62
16615B171P68q82J12M214j383l877j053j40Q26r62j102j115j584M30L816l637
16599c398o14j252M36m65M638J234o14k236l884p38j640L161J967n37K511K234
16583H03k379R62k0J346Q11m64J968K380J977k150q33J176K635l905k508k39J410
16566B970l932K667J262j8j148o94j353j335K159J609O96l54K16J530J584M18
$$ y = [2092, 6732, 8444, 7298, 3922, 2046, 850, 1606, -2034, -4131, -183, 3727, 7111, 7819, 9648, 5755, 5197, 7887, 5031, 3449, -392, -2926, -4894, -490, 2220, 1145, 86, 2026, -1430, -50, 2604, 5043, 6036, 6965, 3163, 4218, 8771, 9517, 8193, 6970, 5708, 2606, 1356, 859, -1858, -1546, 1748, 2901, 6115, 2264, -787, 2591, 3544, 2552, -1620, -4772, -5314, -2470, -574, -2219, -1571, 1209, 2171, 2939, 2057, 2169, 6383, 5000, 1123, 70, -70, 756, -206, -1308, -2423, -4007, -3577, 239, -3398, -4012, -5264, -4828, -5293, -655, 579, -35, -2271, -6155, -6893, -8533, -5372, -3405, -3942, -1431, 803, -1576, -614, -634, 712, 1523, 1059, 3027, 5407, 7384, 5234, 4401, 5577, 8212, 4307, 1799, 1560, 2970, -962, 1705, 2967, 2949, 1801, 1107, -246, -1581, 578, 2187, 2883, 2529, 2745, 4275, 5859, 6277]
16550F277n208k111j87j125O17R22J10K204N16N07j58J163L454M081r26j759j081
16533G296J35j719l334l260k833K724K073M75P71M88k969o25j38K602J021M81
16517C188J057j59K78P20k602m417m094J144J839J591K943K128J240j886k009
16502I61l14L395J840M88k865k023j309q02k94J893J565l032K348N298m795l000
16486f46L63J262k55j796o39J666R02l01M08k95L495K28m709p5Q24M261p74J710
16468E629j531L66J415j291q49j273l182j705J743L678j092j913l6K270N87j804
16452A012L47K374j024m870p14K250M473K981q65n116j671L167J401L92j897k841
16436f01j368K359M104k690n430o08q9K882N144J560M77J130n16k023n01K300
$$ y = [6277, 1069, -1042, -1229, -2354, -1737, -815, -705, 1499, 2015, 2522, 2364, 3527, 6981, 11062, 10136, 8377, 7296, 7431, 5712, 2378, -882, -3715, -991, 1082, 1557, 2328, 2816, -153, -778, -916, 1686, 2707, 3188, 4245, 4086, 4364, 5084, 2482, -1935, -6029, -4885, -3046, -1455, 1488, 3616, 4856, 2970, 961, 647, 4042, 5882, 6370, 3505, 1482, 173, -629, -923, 970, 2535, -497, 1851, 7149, 2354, -646, -283, 979, 724, -1072, -1711, -45, 857, 556, 964, 669, 4164, 4392, -317, -392, 432, 4693, 3919, 5629, 4098, 4464, 5879, 4588, 3739, 2466, -716, -2421, -678, 3000, 1908, -5, -41, 2229, 2816, 1012, 1359, 3733, 2709, -2161, -2875, -625, 3848, 6829, 5964, 848, -823, 2344, 3745, 4137, 2240, -601, -1969, 390, 4494, 1804, -3626, -4234, -4323, -1441, 3703, 5263, 5740, 6870, 6354, 4331, 3830, 6130]
16420F130k722k333k322K494O55j678p15L357J059P54M87q88l651k214L97M114
16404B924k26l607j55k11j399k084O53n2J940J173L960R55n68j488j898q92K095
16387A120K006l267j559k906j67P86J526L41r54j68j223l63J379j770J05K394
16371b720L22R68J693j725L099K209j83j213J666L260j03L84j221j088k644m06
16355B298k941k243o31j86K940J111K840k73q08K083n15l889k636J815L377j695
16339F47J933K431k025l545q93l60N801J76j396Q54Q91M74j257k29k686p48K506
16322B574L913J613j376n64J017k593k127l788k447j077J647K161J594K344J616
16307D507N91J96K55m258k142j79Q79l358r20M540J810J226o07N1m39n47n71l248
$$ y = [6130, 3408, 1075, -1247, 1247, 1902, 224, -491, 2866, 3925, 4679, 5166, 4278, 627, -1587, -1190, 2924, 2698, -909, -1064, -1275, -2674, -4758, -4105, -4157, -2217, -1044, 2916, 3871, 3303, 1815, -83, -975, 1120, 3126, -141, -1700, -4606, -4773, -3987, -2461, -2120, -3074, -3242, -4465, -4828, -3449, -5219, -5114, -2720, -2398, -1430, 263, -1462, 1637, 3846, 3663, 2450, 4116, 7376, 7273, 7657, 6436, 5348, 2704, 2298, -643, -2886, -3517, -3703, -763, 348, 3188, 2915, 2107, 4190, 3675, -214, -2850, -1035, 2342, 647, 2580, 5011, 2986, -559, -1452, -1812, 3989, 4165, 2769, 3623, 4514, 4988, 3731, 3502, 816, 68, 2574, 6487, 8100, 6724, 6160, 7177, 4584, 2457, -1331, -3778, -4855, -3208, -1047, 547, 2891, 4507, 5098, 5294, 5549, 1291, -851, -1030, -151, -3509, -4429, 111, 1921, 3147, 2540, 2591, 2152, 1605, 1034, -2214]
16289b214L910J708K326L076J871l181o613k130l022j437J081Q36J573N16L45
16274a355J711P98P22L366k587m634k462L85J426j683K748J246j026Q22J896m79
16258H94q02j689Q96K241Q38q51R02N36r64q72M25o96j607l190J041N408K833
16241E343k573j546k115J608J156J635K283j748l474q48K476o22q41J12Q26J538
16225C210j14k055k926j194L216J105J034J759l93N52q03L2J010J380J156l76
16209F593j418k02j127k366J408j223K486j555q93p33k748O77L64J11K1R92J887
16192B274j57r38Q31j183j830L82j00L018O59k237m537j391l10Q7L237K587j620
16175a228j494j197k774Q51L478K043l432k142j429o6Q76j020O8M212K436M679
$$ y = [-2214, 1696, 3404, 5730, 8806, 10677, 7496, 883, -1247, -4269, -5706, -4625, -3789, -2216, -1700, -1355, 356, 1154, 1876, 5242, 2655, -1979, -4441, -4056, -2630, -4313, -1565, -319, -1345, -523, 1373, 894, 92, -1597, -701, 1540, 2378, 1527, 2429, 2965, 2001, 1129, 1554, 858, -749, -3939, -2898, 2510, 5343, 2770, 1224, -891, 717, 1873, 3508, 5791, 4043, 569, -279, 2197, 1575, 734, 846, 1672, 3210, 3096, 1041, -1885, -3079, 137, 1242, 2276, 4035, 3642, 4194, 3391, 3423, 4433, 5813, 6969, 6593, 5175, 4973, 3846, 1480, 2888, 1665, 4151, 2596, 1703, 970, -1778, -1101, -737, -626, -605, 387, 2274, 2117, 1179, 2010, 827, -1003, -621, -721, 2297, 2956, 719, -3818, -5209, -5519, -5432, -2195, 392, -1228, -2722, -3919, -6693, -5842, -2364, -321, -3753, -5895, -7324, -7390, -6514, -7534, -7466, -3254, -818, 3861]
16159C861j050j337m47M08l280j341J206j229j923l06L26K740M686k119P07j8
16143H84m70M27K17K957Q94j461j047j800l113L107R44q74k149m122L098m24k973
16126e905J621O254j667l68K167L17j6j98m361k849j286L666K509m80l161j64
16110c921L84R24Q00k306Q67J322j070J652R50K046M23j480n62q51J80l060q61
16093d563J793M702L713P43J154k455j250j93J429m18O53j538k418k39j184K05
16077A34q04K127K841P12m346k381K559o91j316J455R63M55N44k029j09q66j544
16060b296k65K1N13J47J717J15n81j934J458N37J765Lk046n90j997K296L374J565
16042C802r62m129K482k8k373o1J432L68k011Q15J260j812k536l21j737P74K694
$$ y = [3861, 2811, 1474, 1027, 1435, -1845, -3186, -1980, -3209, -5132, -5438, -5112, -2372, 2314, 195, 902, 884, 414, 841, 1058, 4015, 4909, 3448, 2401, 601, -2512, 595, 1539, 665, -1484, -5606, -2508, -2932, -5905, -4284, 1970, 303, -65, 2102, 2419, 2403, 2205, -2156, -5005, -6291, -2625, -116, -596, -3757, -3921, -3537, -2613, -1813, -4119, -3252, -1930, -3000, -1348, -398, 1648, 2071, 591, 29, -822, -642, -3702, -4563, -2770, 1932, 5645, 6388, 7542, 5087, 3837, 3644, 5073, 4655, 5308, 3770, 1352, 1113, -71, 134, -670, 1457, 4298, 5010, 664, -1717, 842, 151, -1165, 290, 1253, 1708, 2252, 223, 114, -752, -2296, -2561, -2540, -2027, -1880, -163, -48, -629, -2563, -1105, -568, 1197, 1200, -846, -1436, -3433, -1137, 2237, 3802, 2840, -1289, 1193, 1165, -1208, -1269, 163, 531, -1480, -665, 595, -1217, -3753, -4074, -5811, -5037, -2343]
16025b343p73K679l373K12M220m485j726j17j795l61N643K693r90k94R38L205
16009C333p37J377k872k741J00J324M39J209j858J057K889j66l925R78N08Q23
15993A738k787m081k963k498J698L24J781L027L662J755q67j267l588n64m50n69
15977e649M53q80N47K981J768J935O343J238j571j587l727k263J273J533j35L466
15961E725k79k977k429l200k310K196N49P66L799j692J356J255j975j723K787
15946A848M5j523j612r50L974J218O25j511j618n83K276O46J61k403j884j033
15930b324K06o91j060j07J075Q67J594r47P19J522M04J713J315j73j335k755n22
15913d99J313K771J004J48Q80j102l431J090j410R7P8l202J684K680m16m647j976
$$ y = [-2343, -3116, -437, -3810, -3598, 622, -3863, -5589, -5706, -7501, -7862, -2219, 474, -516, -810, 128, 3333, 2596, 3973, 1101, -1640, -1540, -216, 223, 1432, -426, 631, 3520, 3354, -571, 407, 915, 1738, -1049, -5130, -8093, -10591, -8893, -8569, -6788, -3761, -99, 1656, 789, -478, -4066, -4630, -5080, -5649, -5196, -6076, -5529, -2548, -780, 1155, 7498, 8736, 7165, 5578, 1851, -412, 861, 2394, 2259, 5725, 5446, 2469, 40, -3160, -5470, -3274, -2725, -1959, 1840, 148, 1504, 2759, 784, -939, 1848, 1893, 370, -1242, -2192, 1782, 3000, 3625, 2114, 496, -87, 2189, 2835, 2996, 593, -1291, -2324, -2118, -2809, -3869, -3976, -2901, -2034, -440, -1387, -668, 854, 1258, 2971, 4286, 4113, 2778, 23, -499, 814, 3585, 4589, 4737, 5617, 4515, 1084, 2174, 764, 861, 939, -2263, -579, 2101, 1685, -2962, -4938]
15896d938L82J586P72K599j207Jm94P31Q71J043J398L61k922j488K516J774K360
15879E345l009j159R13M45N16m58j554L62K215k951m128J837M306k320p11K441
15863B090L514O30m947k569L95J749k700O61K130k221p76k410j601J643K017J035
15847a360J172n95j675K90J930m62j046k023R14k648k172R5j528Q83J607l295
15831i913M364L063j319L768L558l52k556m662l11J242J173n70j666j198K968
15816b411L508l84j890N84p20J447J292o63K071J64j308L53j971r94J790o95K024
15799B197K501k097l845J643R49m64K491k568n154R59M892J129Q95l169n995K657
15783b979K15L241J420J076J060J520j520k105k82o78k016L18J2J637J478k06
$$ y = [-4938, -4556, -2970, -2198, 401, -806, -805, -1299, -568, 303, 1346, 2744, 3105, 183, -1305, 1211, 2985, 5345, 2336, 1177, 2090, 2535, 3051, 2593, 1039, 1401, 3616, 665, -3463, -1626, 2680, 360, -351, 2090, 5604, 6234, 1287, -1282, -887, 862, -1838, -1177, 953, -1268, -2044, -4454, -6055, -4412, -2395, -1360, -188, -783, -2458, -2168, -238, -700, -1746, -3769, -2855, -5503, -7675, -7580, -9108, -8225, -6618, -9913, -5549, -2486, -3805, -37, 3521, 3169, 613, -4049, -4360, -3118, -1945, -2515, -4181, -5379, -2411, 1097, 713, -1177, -593, -1313, 134, 1426, 763, 2834, 2998, 1690, 2043, 72, -922, 868, 173, 2197, 4698, 2601, -1244, 399, 1348, 884, 3375, 807, -4347, -3388, 1504, 2633, 3528, 359, -5636, -2979, -2764, 477, 1897, 2973, 4033, 5553, 4033, 1928, 1646, 968, -1048, -730, -718, 919, 2397, 2191]
15767B191k151j217K911j539k108j554K354J027l588k589j64J168O92J315n09
15752c761P43q04j447k885K619K820l89o35K650P55K606K622N51m11j497l207
15736C30r55J592j327j364L918L876l897l850K004K411M294q75L12M87j412k808
15720B736K437R89J79k052j626l023p62L276J435K77k469l633j042r66k28j418
15704e890l241l04K301M14M190N1p22j500m84K002K663N97K138K579M51r51j844
15687B450p14Q53J001j881O89m23J145L21j738j159ln048l9J891K345P59j55J458
15669A752N28m91l690l039n002j748K262L261L141q36J048l242J141J448j178
15654d645j359J947O470j208j121l347m798k24L911K032j093L28j718O67K141
$$ y = [2191, 40, -1177, 1734, 195, -1913, -3467, -1113, -86, -3674, -6263, -6427, -5259, -4567, -3252, -3761, -3018, -3822, -5269, -8154, -5535, -2715, -3104, -3739, -1089, -334, 2272, 4894, 5445, 5034, 3537, 330, -625, 967, -360, -1724, 2194, 6070, 2173, -1677, 327, 2738, 7032, 6157, 6469, 6956, 5544, 2736, 5173, 6162, 6341, 4289, 2663, -360, -1122, 2154, 3589, 3866, 1397, -2236, -3278, -4244, -4472, -5890, -9131, -9435, -7134, -6720, -2530, -2479, -3201, -4701, -5185, -3183, -520, 77, 2215, 4794, 5245, 4294, 2450, 1736, 2589, 3590, 1709, 2398, 1975, 3120, 3441, 1703, 544, 541, -4507, -4546, -2655, -310, 449, 294, 1752, 2280, 1789, -1901, -4940, -9942, -11690, -9428, -6167, -3026, -3862, -2814, -6056, -4915, -3467, -4645, -6004, -4057, 2413, 1205, 84, -3263, -8061, -8285, -4374, -2342, -3435, -3107, -4825, -4158, -2017]
15639b017M56p06L988p56m062J488P50q66j249j260j239k03N553N125l553k270
15623h21Q31l211k13J113P62o39J41K074k121m082N70M881J657k047k861J541
15607b425L02j605L64k283J587L241r04K59Q66J612n89K69j63k859l771K5L75
15590e699Q35J447o93j960N76r16L558L624L69J143L894N42k49n375o471O07K839
15573a929L261O99p72j775j337L240K860k344o64L15j302l631k060j373K373M93
15557c946J998Q67K013r35l928R65M362J14J12k30j94k229L40N53M550m265o900
15540f753j545M079K034r47J287j017o37J371J123J362k10k513j600K356L652
15525B042j152J861q14P60o69n52O78J310L28k300m310o66M881J969l85k027N38
$$ y = [-2017, -1561, -2267, 1721, 965, -3097, -1609, -859, -1725, -2974, -4234, -5473, -5676, -123, 5002, 1449, -821, 10, -3201, -3414, -2301, -1539, -2178, -2037, 37, -2084, -6166, -5596, -715, 942, -1105, -3966, -2425, -2123, -3728, -3364, -5647, -4060, -819, -1723, -1464, -598, 1014, 425, 694, 531, -2328, -6099, -6074, -5699, -4864, -3417, -4110, -6070, -5494, -6410, -2852, 772, 1141, 2284, 6178, 6720, 6471, 1096, -5375, -4768, -1929, 1332, 2031, 1259, -516, -1853, 1387, 4247, 1903, 1239, 1554, 252, -3379, -5439, -6812, -4439, -3946, -1948, -1081, 932, -3, -3931, -2966, 1396, 1510, 1622, 1392, 1198, -1031, -691, -138, 4412, 147, -6753, -8298, -4219, -2185, -3132, -1845, -2862, -3499, -2128, -1005, 357, 147, -2366, -3966, -1610, 2042, 890, 2751, 1937, 2697, 2028, 1476, 2154, 3464, 3792, 1492, -2818, -3484, 1397, 3366, 2981, 954, 1492]
15508A492J30K644j933N34j521l410J411L123l325P06o41m68j283J21M71l58j346
15491c653n98J111L373Q11p27J09J061l941J477Q0N09J316L170K598m419l217
15475i40j847j188L336K246N7J631j234J13j429j44j405k553l91n69K233L091
15459A007L65j562j461J242l91J295l60r32j677k682N13J645M20K950j865n461
15443f954j488L349L635k139j078M554K723o219k993p9J671M94K4L28K777n3N71
15426h77k6P00Q98o88K73K168J586l619j028L374M185J75j038l425l070l73O6
15409g19j770r95N90K745j042J056K372l523j738j78j284K203J952J247J11n59
15393D68r03p61j278M3k811l637J214M589L173l73n38m51P4M98l59l14K729j679
$$ y = [1492, 1622, 4266, 2333, 2867, 1346, -2064, -653, 2470, -855, -149, -790, -1258, -2541, -2420, -1949, -2307, -3653, -4251, -3140, 233, 1044, 317, 426, 1487, -2454, -977, -897, -388, 928, 4098, 6696, 2277, -940, -2787, -3975, -639, 1607, 1664, 3295, 2061, 2174, 745, 601, -804, -3357, -3748, -4317, -2084, 1007, 1372, -190, -1651, -409, -800, 495, 135, -797, -2474, -5156, -4643, -2998, -2578, 372, -1493, -6954, -8442, -5093, -1458, -3597, -4675, -121, 2602, -3617, -6610, -6689, -5018, -4524, -4500, -4172, -1395, -1448, -877, -903, -203, 695, 7, 280, 2448, 4034, 415, -613, 2761, 6946, 7121, 6083, 2658, -412, -785, -719, -2489, -3484, -2894, -149, -1191, -135, 2237, -1286, -3024, -3202, -4486, -2283, -331, 916, 1027, 468, -435, -1196, -2474, -2431, -5242, -8879, -7665, -3076, 97, -276, -814, -1265, -1191, -693, -1052, -1366, 1363, -316]
15375c16n30K239k08j301p0k128k088Q71j179o88K363p71K887K478o34j060k991
15358c126n85K91m364j267K548K87J763J906J674j199K8J713O32l10Q29L054r55
15341B919l807k025k27L174k65j15O33p15m58M032P50k713J957r57m684J305r25
15324b121l21N276R1m996k501M581L106J845k348k766K288L112q68j940K258k887
15308A809k85l73j456R99j781O89K523M211L509l181l894N25M61j689K087J659
15292E813m165m52K95k76k246K415Q68j458k088k302l080j245K402L004j816j853
15276f184J857J787j25j427p6n68K117J356j416j159K08j695K291M427j965j763
15260b335p3o11j450J888N96m67J166K066J043l105p03k569K168M952l22n031
$$ y = [-316, -846, 1393, 1185, -116, -186, -2314, -4402, -3531, -4710, -5398, -3035, -3806, -919, 1559, 925, -135, -3126, -3711, -3420, -7784, -9051, -6503, -6216, -4453, -2547, -873, -2072, -2044, -331, 301, -9, 820, 3874, 2919, -888, -2913, -3140, 34, -231, -346, 287, -428, -886, 3146, 3896, 1183, 3140, 2183, -2501, -1196, -2121, -2442, 2834, 2925, -2071, -4572, 9, 3115, 4960, 2612, -154, 2134, 5246, 4378, 2438, 4696, 1809, 1524, 1151, -305, 694, -1087, -398, 2125, 6336, 9845, 6664, 2770, 3295, 3756, 2067, 4154, 5813, 1648, 1196, 1491, 1215, -1031, 1384, 2252, 794, -1294, -3596, -6676, -7921, -5519, -2515, -4331, -6184, -4327, -2540, -2665, -4092, -4168, -4736, -2619, -1263, -2679, -3838, -3630, -5325, -3034, 1393, -572, -2335, -2408, -3019, -4469, -2581, -1985, -2452, -1286, 780, 1823, -1282, -1985, -4554, -2386, 2566, 2244, -2787]
15244b787j79K524j691m38q5J792j363k024l156q31J754J332L91R3L10J873L66
15227b119Q1J566K231J095k694r95j054J312L199K79r84m54l201j879l66M620
15211F37L777k348n849l027J240L497Q06k441p43o09L056J398K80j714J916m32
15195e56O1J466l602j167j664K438J443l13j450O68m05j200k66K177N84l606K572
15178b820L795p16k594J619l274j584J131j177K950j659m618L540N011P60N62
15163I26k606j209m65J354P53N65J750K13k523J194l04L03j559K42J574N06l59
15146C55l39j396l217k639J149M887J522Q70k154M72L997J467r95J052m162j772
15130i03j209L03J406j64k167j855l92q49M422K689J350L73p62j61j283j896l001
$$ y = [-2787, -2966, -442, -2133, -2571, -2656, -864, -2227, -4251, -7407, -8238, -6484, -5152, -4761, -4668, -4358, -2485, -2119, -2038, -472, 1759, 2854, 160, -835, -1889, -577, 2622, 2901, 1917, 1463, -1738, -3617, -3983, 637, 4414, 2066, -3783, -6810, -5570, -2073, -1267, -3708, -4451, -5060, -2004, -606, -326, -2040, -124, -556, -495, 971, -2631, -3798, -5462, -3024, -1581, -1894, -3344, -2676, -3081, -4281, -4547, -2370, -1786, -5392, -2820, 975, 259, -2335, -716, -3990, -5574, -4443, -5620, -2670, -4329, -8947, -5407, -396, 364, 926, -1680, -2889, -3354, -2000, -1247, -682, 1068, 1281, -1242, -48, -352, -49, -1608, -1366, 208, 714, 355, 16, -1380, -4597, -7236, -6087, -1200, 322, 1192, -962, -490, 3507, 4974, 3979, 5031, 869, -903, -2112, -1809, -403, -567, -2734, -4589, -4981, -5830, -1408, 1281, 2631, 3004, 2242, 2081, 798, -1098, -4099]
15113d099k495M644M771j195n316k152L370K488K128J621M670k86o178m521J442
15098a108O65k076O66j585J781j682p28j896K56M85q03K620K091j522j261k630
15082f727Q06L31J579j172L729L066k26p77k184M2J737J213l286j249J901O1J418
15065B62K731N41O97q48n251K07K030m90Q35J58p84j701J04K745r62k335p40O92
15047b109J181k47l108O0J529p3k49l316Q3K091J679K82L253M471J270j400m086
15030A311j283j937K616o01k333J152J931n261Q45L849N372j201l512j26O08k704
15014a274M66l09Q35M131l779l309K516N05K57J801J51k686j725l013L230M160
14998A957J44K360K156m750j692O4O78j36J51M37j898L95J95p92j665L79O2J054
$$ y = [-4099, -6594, -1950, 2821, 1626, -3690, -5842, -2472, 16, 2144, 3765, 8435, 8149, 1971, -2550, -1108, -443, -2519, -1853, -3438, -1657, -3339, -4067, -5963, -5707, -5222, -6025, -3405, -1314, -2836, -4097, -6727, -5921, -5590, -4011, -5183, -1454, 1612, 1386, 609, -1575, -1533, 204, 1417, -1869, -3118, -1217, -1156, 262, 2993, 3534, 4231, 3383, -1868, -1661, 369, -121, 714, 872, 88, -1613, -1509, 1236, 274, -2061, -2801, -2109, -928, -1175, -4283, -4223, -2694, -2767, -3016, -6332, -6249, -4158, -2479, -2197, 1056, 5527, 6797, 5397, 1311, 28, -1909, 707, 106, -2227, -1075, 856, -4405, -3560, 289, 5661, 4460, 948, 822, 1430, -1274, -808, -1117, -282, 3849, 70, -3239, -723, -218, 39, 1840, 1991, -695, -2420, -5433, -2203, 1957, 2101, 4461, 6617, 1867, 175, 239, 917, 781, 932, 1369, -529, -134, 61, -731, -2396, -2017, -1955, -901]
14980i01j708M61K887J348J488l88n92p67j977j773n02K628K233m293q1M751N743
14963H557n03l490q77j747L449O505P555O792k932o725n530q878o620J482L997
14948A035J736k009K06k721m13K839j218j065L16J42N08r05K739K62o52J195K37
14931B232m87j154n06m98k446K738J047p06j535J722L343K333k255k809j966j679
14915b626P67K779J025k161j709J927M77o45k877o50M574j22k098R33J093l255
14899b568Q3r23l122J391L830m86K0J00J276j589j474l228J708L720J399k12j872
14882a947K83J126K09J443p4l188k416R29j422J792R92n88K227J776p55k05j881
14865a699j317P72q84k73K887K067J639J191j968q20q95m55l303k221J424J806
$$ y = [-901, -2609, -2148, 739, 2087, 3575, 3187, 2595, 1828, -149, -1922, -2424, 204, 2437, -1856, -1937, 2814, 8557, 8054, 4564, 3687, 1940, 5389, 11894, 19449, 26241, 23309, 16584, 11054, 2176, -4444, -2962, 1035, 2771, 762, 968, -1753, -2166, 673, -545, -1610, -1294, -1152, -644, -1549, 1190, 1452, 800, 1995, 2232, 1745, 591, 85, -413, -2859, -121, 926, 220, -1315, 407, 3750, 6083, 3828, 1019, -947, -2626, -1859, 920, 1945, -216, -1925, 2, 479, -166, -3043, -3693, 881, 759, -1339, -406, 687, -2568, -2485, -3408, -6530, -5139, -1309, -1795, -1775, -1675, -399, -1988, -3462, -6690, -4982, -1262, 137, -75, -1947, -1664, -538, -329, 1114, 1040, -2148, -4564, -3635, -5057, -3265, -2273, -2861, -634, 1142, 387, 182, -1699, -3016, -2244, -3128, -3401, -514, 1553, 3192, 4383, 2415, 1595, 700, 245, -3058, -5279, -3855, -2049]
14849b049J039L602n3l490O34o43j371J623L74Q64J384L566j513n474m906j705
14833h118L789L317N39R75j71k350O53q12j469M69m48j990K557L1j457P93J826
14816a866n35P28Q90j36K765j721l466m07J160l07P01L275J539k568J378K519
14800C949o16k631o59P42j42k135j572k71L54k6L049L580m14l690l246L025K300
14783A597j130j198K171j634k800M81j484j643K914j174P14R3k172J060J467J009
14767a729J486J361n17k908M39j188q08j34N94P73k4l219k91k34L427Q35NK510
14749C78R06l394j664L987K979M00q02j828l333M3J044J510l189j985K883K671
14733F06q56M2p40O7j253Q01l140k953j498O14J342K737j099J253J408J686J010
$$ y = [-2049, -1010, 2592, 2539, -951, -317, -960, -2331, -708, -334, 530, 1914, 5480, 3967, -1507, -6413, -8118, -4329, -1012, -473, 502, 331, -2019, -1366, -2178, -3647, -3178, -3626, -5616, -3059, -3028, -4485, -3692, -1866, -2401, -1673, -783, -919, 1846, 125, -3341, -3748, -2588, -2895, -2194, 1081, 2620, 52, 1430, 3949, 3333, 702, 43, 785, 643, -1492, -3064, -3335, -2981, -3007, 42, 3622, 3208, -482, -3728, -703, 1597, 467, -731, 1440, -194, -2994, -2513, -3997, -5640, -2726, -3900, -3186, -3093, -5265, -4205, -2738, -1729, -243, 1118, 601, -2307, -1868, -3056, -3864, -3998, -3404, -2631, -2655, -5874, -6165, -6399, -2972, -2137, -2132, 378, 1284, -2110, -3774, 213, 3192, 3592, 2790, 962, -2371, -2328, -1284, 226, -2963, -4948, -2065, 606, -250, -208, -948, -881, -2134, -1333, -4473, -7426, -8924, -8310, -6968, -4231, -5330, -4077, -2669, -983, 27]
14716B7j905k723j556K857M191J267j875p67N55J95j34j522J926j576k526L720
14700A54L441p56j938j324J617N98R96J634o74q70P78k61l970j472K501R59k071
14683f58q98P62J58J461m54j371j554K580o46Q13J015l8l048M00r3J054M952l506
14665I29o30m44j522o28j039k566K409K848j899j50q50J335K750q56k549R88k46
14648b120j710J336q09j838L281K405K770J247k956n124l14K43o65p7R99J610
14632a722R47r04k268O10K851l37p43k37j245J351p42J490L18J788J038j196n55
14615D44j826q18J911J425j043k211L443L793k528k3m60l679l03j562q08m926
14599i171j80Q3Q9Q51L629M787n4k504j169k222l143L086O031L514j066j661k307
$$ y = [27, -1878, -4601, -6157, -3300, 891, 2158, 283, -484, 71, 266, 132, -1390, 536, -1040, -3566, 154, 3595, 2839, 901, -423, 1194, 1792, 2788, 4422, 3748, 2878, 3656, 3395, -575, -2047, 454, 1413, -658, -1556, -794, -636, 825, 371, -1000, -2554, 26, -620, 193, 1208, 1170, -1878, -1478, -1571, -517, 4435, 929, 299, -145, -1667, -2295, -3334, -5900, -3491, -643, -2542, -2692, -3542, -2207, 543, -313, -2862, -1874, -2120, -3830, -2494, -3303, -5141, -1860, 545, 3315, 4562, 1606, -3518, -3832, -3589, -4254, -4331, -3332, -1722, -775, -1679, -3947, -3337, -486, -823, -1566, -1803, -3048, -1697, -2439, -949, -631, 1157, 2195, 999, 444, -1382, -2200, -289, 1136, 93, -2118, 1325, 5118, 2590, 2567, 2107, -1572, -1875, -3437, -4245, -9171, -9351, -9268, -9179, -8328, -4699, 88, 34, -2470, -3639, -5861, -9004, -5918, 113, 3627, 2561, 900, -1407]
14582a407N476k31k258j677j131K089K345k658K098P07m926Q64J334P73m191q74
14566c667Q51J202m72j418M54J514q45J425K58J002J764J671j399k934M36K088
14550A930k217j585j018j518k215J16K485K501j737O09j068l288j753K726K347
14535c685L16K598k006k703L172L047n74J8l433j275J31M088j640r1R53m234N67
14518d751K441K491K070j364k476k279k948l214J751L022K964q7q73j798m44p05
14502f200Q38L762N036j500k963k358j559j78J716J018K043k064m07M608l84n15
14486H93M27j299N99K245k023l356J804L630J261j286l028l439p23k266N72N11
14470e478k016k972K01L648K649q65J57L22k239J03J215M529k447j437J01p36
$$ y = [-1407, 4069, 3838, 1580, -97, -1228, 861, 3206, 548, 2646, 3353, -1573, -709, 625, 1398, -2793, -3667, -2816, -1614, -2086, -3504, -3050, -1536, -2381, -956, -698, 304, 2068, 3739, 2340, -594, -158, 1930, -287, -1872, -2890, -4408, -6623, -6507, -4022, -1521, -3258, -2649, -3717, -7005, -8758, -6032, -3685, -3369, -771, -2777, -5480, -2308, 739, 165, 183, -3250, -4525, -4394, -306, -1946, -2037, -1084, -5318, -4751, -2310, 181, 2251, 887, -1589, -3868, -6816, -10030, -8279, -5257, -2293, -2380, -3253, -5051, -5495, -6200, -5362, -1600, 3436, 1936, -1027, -3385, -4944, -5122, -3406, -2388, -345, -2409, -2816, 1792, 1408, 893, 1320, 21, 620, 2865, 842, -2514, -710, 2920, 4181, 2895, -133, -3572, -4295, -6561, -5989, -5478, -7494, -10466, -10265, -6617, -3968, -4833, -4676, -4354, -6593, -6490, -5275, -746, -3193, -4630, -4529, -5265]
14454e265j636J680L097p94q15M46j45Q97J890L201J71Q72j947k894j321l451
14438f014K86O12K55k419J216Q08O58R9K8n27Q28M15m14K907R71j36j680l162
14420e269J921K76q82j339N12J682N80J496K309j28k441Q42K907k214j534j462
14404b744k767L23J202j277m54N092j002Q6j055K210K657q06l160l65J025m66
14388a501K157p75n09J225N39J168l67N65k515m327J131J836O64j473K213l67
14372c36qj361j38k115k61O34J564J915J438Q42p29j49J976k695o98j713j779
14355c613N34J468j042J572K18k167j54j491m17J63j945J239N05O61J20j003m510
14338i862L134K581O24J580k974K96J750P12l58k000j977k592J39O828J450k988
$$ y = [-5265, -6901, -5221, -2124, -2918, -3733, -3287, -3432, -2535, -645, 2556, 2727, 3599, 1652, -1242, -2563, -6014, -5728, -5116, -4861, -7280, -6064, -5256, -4598, -4499, -4471, -4998, -4170, -3755, -4169, -1262, -291, -427, -2107, -5269, -3348, -3072, -3954, -5293, -4781, -3099, -2519, -1023, 1286, 1158, -1283, -441, 2466, 252, -1282, -2744, -5511, -5188, -3986, -5263, -5717, -625, -1627, -1541, -2596, -386, 2271, 1465, -1695, -2060, -1035, -1501, 656, -119, -628, 597, 1136, 2304, 1937, 2502, -13, -4340, -3209, -1373, -709, -2182, 31, -336, -344, -1705, -1843, -3958, -4219, -3585, -2021, -106, 1332, 2174, 1445, 1296, 3272, 577, -121, -1834, -3613, -3079, -1611, -2653, -1081, -863, -3030, -3184, -4675, -5092, -4929, -6874, -5635, -5130, -4469, -4349, -5352, -9862, -6728, -4147, -3523, -1943, -4917, -4621, -2871, -2159, -2517, -4517, -6494, -9086, -8947, -2119, -669, -3657]
14322c657O96K403J088j738j457p5k758j997R61K063R58J588K303N25J486l262
14306h73j393J673M427Q71j134p07J297j355j545j799j536l19k057Q22J806M42
14290a380j309j118L685O25k389j646k27p1N07q60N62J07k085P41m08J721K495
14273a050P96k860k934O32K177j556%K667M902O38J26L642m270m545J016J45l303
14256c777k395K135m6n32R2j625k414M343K309k275O90L929j789k735K542L415
14240A867J643m864R97N22n387L99j100N23J175j841j765j776j29l03J494J327
14224g218L639L696j509J95P24J963J243j298k168l465k480K114M076K503n53
14209A462r69j236K01J750r61k08L73k654K107n59l78k443J790L091O82j074j741
$$ y = [-3657, -2961, -558, 530, -1208, -2665, -2740, -5498, -7495, -6534, -4471, -3513, -1925, 378, 903, 2389, -873, -2266, -593, 3834, 4705, 3571, 2864, 4161, 2806, 1261, -538, -2074, -2393, -4450, -3628, -1822, -1380, -2689, -3807, -122, 503, -1886, -3532, -3759, -3830, -3323, -4183, -3621, -3514, -5599, -4858, -5266, -3545, -1050, -254, -3114, -6048, -5416, -3239, -4795, -4795, -2128, 2774, 3412, 3538, 7180, 2910, -1635, -619, -474, -3777, -6172, -4037, -4083, -4615, -4523, -6148, -8562, -4219, -1910, -4185, -3495, 434, -1355, -4090, -1548, 1867, 3510, -1354, -357, 165, -5222, -4823, -5923, -5400, -4225, -6066, -7831, -9607, -9736, -10039, -8545, -7218, -3579, 117, -1392, -1197, -473, 1490, 2733, 1435, -733, -4198, -6678, -4564, -488, 2015, 1462, 493, -743, -542, 1208, 247, 39, 412, -2242, -135, -694, -1072, -3515, -1725, 1366, 2048, 974, -767]
14192g67k244NJ100k69j266J390K006j228k631J37j205j172j812J580K267M842
14176G33K453j817J46q73P69K196Q12j531k795J370j087K386P64k100l715j92
14160b481k14j058k099J8N579m57P03L67J189q46k360J33j981J407r73j441k84
14143d798J451K602R59N78J192K594O23o460j036k49j818j299j322k58N51k13
14127f903J89K301L754N83j236R53J416q17J945l70p68j257L068j219N73l096
14111h84m719q34K165R44O0p94k02R55K202K421k3q73k460J679j162j005J091
14094a439R04O63K528J613K85m58j148N22m328j898J897L942l56l053l577J185
14078b718K00J358N19Q03R30P40j783q77K874J377K898K118j571n040j805J006
$$ y = [-767, -3011, -3006, -1906, -2175, -3441, -2051, -45, -1273, -3904, -3767, -4972, -6144, -7956, -6376, -4109, 733, 3186, 1369, 1515, 642, 1411, 3607, 4419, 2888, 93, 1463, 376, 2762, 3526, 1426, -2289, -2481, -2695, -3753, -5852, -5834, -255, -712, -9, 358, 1547, 701, -1659, -1526, -3507, -2100, -3073, -4514, -4798, -3347, -745, 214, 792, 1984, 4578, 5201, -1259, -2295, -2544, -4362, -5661, -6983, -7241, -6690, -6903, -6714, -4413, -659, -76, -1312, -359, 1057, 240, 2185, 1815, 1047, -210, 2858, 1639, 2212, -884, -5603, -6437, -4272, -3328, -3268, -4062, -4264, -3309, -1107, 1314, 1291, 418, -2042, -363, -1525, -2530, -1439, -535, 128, 2656, 4269, 4554, 4096, 2948, 3470, -858, -2756, -859, 3083, 2727, -326, -3903, -2718, -2518, -1160, -641, 162, 1092, 1832, 49, -828, 2046, 3423, 6321, 8439, 6868, 1828, 23, 1029]
14062A029J934J908j828Q50j775N3L70j773J260k002k067J183J892j534k262k784
14046e546K136L374K47O42J830k605j603J703J518n17k779r16j997J98L066N74
14030f75R35L93M12q77J263j473r61J398Q37p72m51L319k651k002L932l210l591
14013d174j106j830M163Q022K59l927k536P02J135K971R71l490l200j004k211
13998e255n21R53k635L06M533j639l096J970K606j159P90J225j769K05J166J491
13982h29k426K112K75o38Q44m1j817l091O19K030K263k83k414J925J014J56j01
13965d02M93r31k647R77K043M61k216j753j628o86l6J455N7m99K427J448k177
13948c614R32M314J447j477j059J301J377n459j800K253K841q99r66R95j018l60
$$ y = [1029, 2963, 4871, 3043, 3893, 2118, 2171, 2541, 768, 2028, 26, -2041, -858, 1034, -500, -2762, -5546, -3410, -36, 211, 853, 2683, 78, -1525, 178, 1696, 1179, -1600, -2516, -4513, -4315, -1249, -675, 260, 653, 1065, 188, 1451, -22, -983, 415, 1252, 480, 29, 3348, 697, -1305, 2627, -583, -4174, -5280, -7110, -2947, 5075, 5334, 1407, -1129, -427, 708, 3679, 4650, 1160, -2040, -3044, -5255, -5776, -4823, -7458, -7152, -2619, -4258, -7354, -5384, -2778, -3937, -3147, -1922, -3691, -3486, -2320, -829, -3255, -1143, -868, -1506, -662, -703, -2520, -5611, -4992, -2962, -699, -982, -3396, -1471, -457, -301, -402, 91, -840, -3487, -2510, -467, -6, -2222, -3975, -5603, -6289, -6325, -4870, -4813, -5312, -2885, -1437, -3614, -2682, 1632, 3079, 1602, 543, 1844, 3221, -2238, -4038, -1785, 1056, 157, -809, 186, -832, -1192]
13932a192N387J995n152l822k090J479K322J344k362j267k91l701L75N2j27j968
13916i018K997L852N98j691j618M86L152R06j766j474J266J181L822J142n620
13901a785O44o54o22j877k26J663J773K123j960K129k115j644L12j15J936J208
13885G90J358J426j724L060J923l96r47l335j278p06P45J934J325P37j472j294
13869B146J259l67l17J387O27j095q3n85r89K161o5P18l657m89N91k191L86J658
13851A095R00P59j309K5J59L653J660k352p0O74O0n05k117j536m93J131M09J145
13833C288m609j626R14o91m025m48Q91M313N320K11r21K298Q98l994m645n84J383
13816b027M234J995k749o64J436M94j08l159L592P46j910j995J816J613K7J533
$$ y = [-1192, 4195, 6190, 1038, -2784, -4874, -3395, -1073, 271, -2091, -3358, -3649, -7350, -6975, -6923, -7050, -9018, -6021, -2169, -1571, -3262, -4880, -4394, -1242, -336, -2102, -3576, -2310, -1129, 2693, 3835, -1785, -1141, -1795, -2417, -4294, -4520, -2857, -1084, 1039, -921, 1208, -907, -2551, -2239, -2354, -418, 790, 2148, 3574, 1850, 4910, 6833, 6437, 5490, 2155, 877, 171, 916, 2850, 4175, 4912, 3440, 2146, 3405, 3038, 2721, 4108, 4735, 3640, 3557, 2972, 1983, 4144, 4079, 4797, 1140, 651, 1242, -949, -563, 1095, 1995, 2754, 1445, 1470, 1629, 5282, 6942, 4590, 4520, 5194, 5254, 4749, 2632, 1096, 603, 1734, 2143, 3288, -1321, -2947, -2033, -2724, -6749, -7197, -6306, -1993, 3327, 3538, 2617, 4915, 5813, 1819, -2826, -3410, -2027, 2207, 4202, 1453, 789, 2225, 2719, 2611, -548, 3044, 3790, 1880, -115, 1701, 3314, 3341, 4874]
13800D874n4k696j641j775j806K383j275P1Q80k720j235j52J158K162j822K495
13784a153Q97J396j186M85n76K95J194k056K910J971k969l378K189j126j127p36
13768b970J28J614M616K501j522j050L454l920l580q25K629L057j555R62K248
13753E787M28k438l595j820k36J128J150o19L27L417L772k552n397k240l61K09
13737c040O12K946K762J89k525k380l987k153P39K878Q75j119l573k06Q29q01
13721g954K766K406k15n98k852O41K035k796k455o29K478K389K453j31m165o47
13705g274L51M027L420L035K04m750r37J59q50K545o77j177l463Q13K272p38j334
13688d374j288j53K418J127r56j601j948J474J841M36J62J342k421k287K285L269
$$ y = [4874, 4820, 2124, 483, -1292, -3098, -715, -1990, -1919, -1039, -3759, -4994, -5146, -3988, -1826, -3648, -1153, -256, 1140, -46, 439, -137, 158, 1352, -704, 2206, 4177, 1208, -2170, 19, -1107, -2234, -2970, -2842, -1228, 3388, 5889, 4367, 3317, 6771, 2851, -729, -1554, 1075, 4132, 2577, 3539, 5787, 6215, 3777, 182, -1638, -1874, -746, 404, -215, 112, 3529, 7301, 4749, -648, -2888, -3249, -3040, -2428, 518, 3280, 3469, 944, -1436, -5423, -7576, -6837, -3959, -3084, -4203, -7776, -7982, -7153, -7954, -5188, -2782, -2997, -3595, -6447, -5806, -3771, -6567, -9022, -9651, -7173, -4784, -2331, -2462, -6627, -7274, -6923, -2896, 524, 3559, 3763, -987, -1924, -1765, -2615, -70, -747, -1924, -5387, -4574, -2302, -3040, -4374, -5662, -5815, -3397, -2270, -3226, -4827, -6775, -5301, -3460, -3024, -2862, -1520, -3941, -6228, -3943, -674]
13672f74l29k844j616J98J267J312k1J042j597j567l22k370j325J434j7J319J452
13655d658J753J868O86k887l109J860K595n7M0J124J21p59j81k929j820l52O48
13638f057j96L262M17l40n83k427J967J740j851k981O56J648m42L835K053l040
13622b339j130L956J583k74J345m75J593Q25n167J527J421Q87M51j677M72M02
13606C400Q70J171L995O687P075Q800R029K199l736q671n742l527m627n853l542
13591G528J541Q77k221k001L123k628j588l998R03M45l650k303P6K197k015O26
13575c088n6j571q35J202Q45Q32L63o54J468L272J406K4p73j553L71j165j863
13558a775O38L659j958j978J857J825O50j783r81j666j733j6j771K63p21Q2J396
$$ y = [-674, -1003, -3847, -5463, -5265, -3998, -2686, -2707, -1665, -3262, -4829, -5151, -7521, -8846, -7412, -7429, -6110, -4658, -2905, -1037, -351, -3238, -6347, -4487, -1892, -1949, -1909, -785, -664, -1423, -1604, -4533, -6353, -6705, -6057, -6253, -2991, -2574, -2914, -3497, -5924, -3957, -2217, -4068, -7049, -6393, -4745, -5187, -1352, 701, -2339, -3469, 487, 2070, 1796, 3141, 2666, 4259, 5084, -83, 1444, 2865, 3752, 4203, 2526, 2998, 3400, 4270, 5441, 9436, 16123, 23198, 31998, 41027, 43226, 39490, 30819, 25077, 21550, 16923, 11070, 7528, 9069, 9946, 7725, 5724, 8847, 6219, 4631, 633, 1536, 1981, -1669, -3972, -3896, -1699, -3714, -3088, -3144, -4715, -5550, -4348, -3503, -2671, -2308, -2962, -1494, 1778, 3184, 3208, 2435, 882, 1253, 88, -1775, -1137, 2522, 564, -1414, 443, 2268, 2918, 1135, 154, -1512, -3245, -3261, -5032, -4769, -5490, -5408, -4012]
13541d012J882J457Q38j812L19j531n297l739K953K986J918M20m76J742N21j202
13525c033oM37k468N10j068J066q41Q46K127k71j977K074J896J269j26j148r30
13508a643k346J060M218R5k450p36j853q67j27j733R90M117K7l386j720k9J095
13491e288L769N663P8k866j036j094K783K348K76l74k050k89l368m229k267R78
13475f966K431L472J403j920j957J734l196r44M034R23j473j373J27K439n3n61
13459a880l20K1O80l310j661j313oJ464K958J750K795J746Q39j645j463q71j944
13442b160j16K734J356m66k582m827p10J717k393J247M212L60j08j441j195k47
13426d619k810m587M955N434k491J032K579k418M59k68k205j274l161j10J454
$$ y = [-4012, -2130, -673, 165, -1647, -1328, -2859, -8156, -11895, -8942, -5956, -4038, -3618, -4094, -2352, -1831, -3033, -3039, -2602, -5070, -4560, -5628, -4562, -5403, -4557, -2430, -2701, -4678, -2604, -708, 561, 435, -713, -1643, -3989, -2929, 1289, 1384, -1066, -1802, -3655, -4522, -4649, -6382, -5392, -1275, -1248, -4634, -6354, -6383, -5288, -1519, 4144, 4222, 1356, 320, -774, 2009, 4357, 4633, 4259, 2209, 1920, -1448, -5677, -7944, -6966, -4535, -1063, 340, -1580, -3537, -1803, -4999, -5943, -1909, -986, -2459, -3832, -3705, -1266, -1319, -1880, -2200, -2179, -1499, -4809, -6470, -7783, -7789, -6325, -3367, -1617, 1178, 2924, 3763, 2118, 655, -216, -2160, -2276, 458, 1814, 1348, -1234, -6061, -6771, -5054, -7447, -6200, -1988, -1628, -1736, -3177, -4372, -4619, -7429, -12016, -7061, -1627, -4118, -3086, -507, -2925, -2466, -2734, -4939, -6213, -9374, -9484, -8030]
13411h030K390L292J653J118l254j264l48L8K531L073P55k632O59J801p78k730
13395a726k301N77K390K011K550J4j943l731M34K750L13j719k993k89J421q17
13379c059l229J452L978J525J782P69k707k708k375K059M106J493j690k849p48
13364b201K422J02J234L711K927k327l788j624j628j323J515P24p47N6j094J561
13348d80M4l60M13L042j804m605k848j211L671j404k12p4m37L614K327J024j340
13331f40J435K423J361K787J961m924l150l281Q93M00o15j131l387Q40K156K312
13315e60L372l41Q0j323j890lj789j636J381J881l38K815L256j909n48j813m128
13298c493L490j251r55N1O74K222o39l031J793J976j527n151J62M220k307K674
$$ y = [-8030, -5640, -2348, -695, 423, -2831, -4095, -4443, -4405, -1874, 1199, 1954, -678, -19, 1782, 1004, -1726, -4027, -3450, -1060, 951, 3501, 3515, 1572, -2159, -1725, 1025, 1338, -381, -3374, -3663, -2242, -3059, -6288, -4836, -858, 667, 2449, 3218, 511, -2197, -4572, -2513, 1593, 3086, 1396, -1453, -2201, 221, 323, 1557, 5268, 8195, 5868, 2080, 456, -1172, -2495, -980, -256, -1003, -947, -2041, -480, -436, -796, -383, 2659, 855, -3750, -6598, -7809, -4138, -5542, -5754, -5828, -6265, -2651, -324, 700, -640, 795, 3218, 4579, 7366, 9327, 4403, 1253, -2028, -1135, -735, -1350, -2481, -5868, -5028, -2872, -560, 2812, 2471, 2551, 1228, -662, -665, -2454, -4090, -2709, -828, -1166, 1649, 4905, 2996, 2448, 635, -3493, -3, -1254, -2209, -2158, -1484, 738, 99, -2932, -1139, 837, -690, -5841, -5679, -1459, -3766, -1092]
13282a092L136j523j588KL074j635l449K036K533M200J070j519j617j31k617r87
13266a07K133J182l283J714M80K400k302o69m103j117N94k874K430L599J92j77
13250I2l995l672L195L084M477r02k667J079j106k392J574j498K144j110j276
13235b973R03J061k980R34o37J657J846K086M02k178k939J347k52l389j40R54
13219d298Q11J963J655k422m240L124N67m56N027K539l38l349n690q32L213K307
13203d19K372J164j938k11Q92j125q6R49r77l118J169J41o93J806J920J607J49
13186C602J38j264k335J266n85K27j328p65j479j197J494K916k062k369K018L035
13170A312l17J916J620k46j088k668K363m61k099J013m574l807p87N416j47K708
$$ y = [-1092, 2044, 521, -1067, -1065, 2009, 374, -3075, -1039, 1494, 5694, 6764, 5245, 3628, 3497, 880, -107, 2026, 3208, -75, 1639, 2119, 4519, 2217, 1548, -2555, -3672, -3078, -5952, -3522, 77, 269, 92, -3903, -7575, -4380, -1296, 3181, 2279, -388, 691, -415, -2807, -1233, -2731, -587, -1697, -2973, -2070, -1009, -3989, -3055, -3692, -2035, -189, 1897, 2299, 121, -2818, -1471, -1723, -5112, -5252, -4298, -3487, -1524, 131, -2291, -6531, -3407, -2840, -3296, 1731, 4270, 3932, 583, -5107, -5939, -2726, -419, 1953, 3117, 1179, 968, 1860, 735, 649, 1598, 621, -2497, -1328, -1187, -1880, -74, 1846, 3453, 3602, 3740, 2476, 141, 1407, 822, 1049, -279, -1044, -2523, -3720, -2226, 690, -1372, -3741, -1723, 1312, 995, 2911, 4531, 4285, 3197, 529, 2892, 2431, 332, 1345, -3229, -7036, -7823, -2407, -2554, 154]
13154A54p85M25j283p98k49J968j950N02K652j592n68n56N7K022L86J550K298
13137D233M04p13o79j611J697J592o45l375q33J882k438Oj384r53L54K5M55J996
13119A3q63L1j535j292l23M90J600J77j234J554L392q51K922L16k44L99k585n941
13101c974N35J157q10k210J770R10j596K802j597l343m19K342j554k46K925J871
13085a437L072r20Q49K452Q77RJ619k236l778k183J55j65j089K449J046k136M86
13068i30k567n48R04K175l159j9j024N18L978Q89k436J195q4P15L916J760j694
13051C589l343k226K92p40M95J468J739r70k594j131k3j785n95L242l381n409
13035a1372K952L840K295r56k542M90q59j168j838L79J449j542M29P48K340L772
$$ y = [154, -631, -206, -1489, -2287, -2536, -568, -2518, -2016, 636, -956, -1524, -2080, -2023, -1, 385, 1935, 4233, 4637, 3924, 3245, 1634, 3331, 4923, 4278, 903, 70, 1952, -486, -480, -1864, -2817, -2463, -2438, -1983, 13, -850, -819, -2354, -3646, -3969, -3479, -1879, -1702, -2936, -1382, 2010, 1159, 4081, 4397, 4153, 4552, 1967, -3974, -3439, -2282, -3092, -5302, -3532, -2622, -4218, -1416, -3013, -6356, -6775, -4433, -5987, -6233, -3308, -1437, 1635, 715, 1564, 4016, 4893, 4902, 6521, 4285, 507, -1676, -1521, -1686, -2775, -326, 720, -1416, -930, -3497, -4045, -3141, -966, -4125, -4144, -5168, -4650, -672, 217, -2219, -1024, -1108, -393, 3523, 5283, 3589, 246, -1980, -1688, -2428, -1933, -465, 1274, 304, -2290, -3421, -3444, -5229, -5824, -2582, -5963, -11372, -8420, -4580, -2285, -3241, -5783, -5293, -6152, -7320, -9158, -8779, -7330, -8872, -8443, -7695, -5355, -1583]
13019a583j411j310p70L42J518o6r64J567N60O04K529Q69q74j507k146%J868Q3
13001f91K206K20n487m688J485K913J701k43k414L493K672j094j399j505K204
12986f27n26k826J520M221m26l416m121K914K818M52j709j774k907K720J45O50
12970b892J587J330J497J599N63k905j17J142n206l225j75K809R74K120K619J750
12954C470p97j926k108p10J126N309J67k644j150k900l52J120r75K719Q46k567
12938a372o0j778L43K782J146p64L9P03j401l249j502J210P37O89J923p0m554
12921e178l206J306L362L951Q34j802k39q11k310J886l76k079K770J501k384m404
12905g179J352K538L59K826K40l932R59j410o96Q70J361O23J810J319p47o91l634
$$ y = [-1583, -2994, -4304, -5074, -4732, -3214, -3280, -4244, -2677, -2117, -1513, 1016, 1885, 1011, -496, -2642, -2642, -774, -691, 1515, 1735, -3752, -8440, -6955, -4042, -2341, -2584, -4998, -1505, 1167, 73, -1326, -2831, -627, -1153, -3979, -2459, 1762, 1336, -2080, -6201, -3287, -469, -17, -1726, -3500, -6407, -3687, -3542, -2892, -1305, 25, 1522, 3121, 3684, 779, 662, 1804, -3402, -6627, -6802, -3993, -3019, -899, 1720, 3470, 2673, 747, -1361, -2071, -945, 4364, 4531, 1887, 737, -2163, -2515, -1395, -2370, 349, 1195, -1372, -1432, -3210, -2867, -85, 1061, 297, 336, 1039, -362, -3611, -5113, -3903, -3166, -2477, -554, -624, -5178, -8384, -7078, -3716, 235, 1069, -733, -972, -1783, -4093, -2207, -2583, -4662, -1892, -391, -2775, -7179, -5827, -3289, -2930, -104, 136, -3796, -2837, -4247, -4943, -4073, -2712, -2089, -279, 1040, 293, -398, -4032]
12888d032j855o86K146J665n12P53j901j84j247q17K146J012J87M07r23k041j285
12871g167J778p85O77j544j097K725K891M05P18j234k418j923P76j50k81J643
12855d986j158K781M376j214k328L322O21k552o95j224r97O14M274L17o09m44
12839I8N60l003j012Q07J059j442N31r80N82j856l453R40L668j795J340J975j20
12822b101r56J223P68J814O87K473J024j868j949l749J535L7O37R59K285J965
12806D784k610K59Q82l79j315l310R65O91j601j737J816o15J881m70k010J155
12790a614M113N165n138m807l20k89n13j018L111K756p11k201n053j489O076L25
12774a607K73R33K451J119k225k998J049j998N74J573j407q31K291J029M41m104
$$ y = [-4032, -5887, -6573, -4427, -2762, -3274, -2521, -4422, -4606, -5853, -6670, -4524, -3512, -3325, -2918, -3841, -5882, -7167, -5389, -6174, -5497, -7041, -8138, -5413, -2522, -2117, -1399, -2633, -5051, -6974, -6198, -6348, -6629, -4986, -6144, -3363, 1013, -201, -2529, 793, 1414, -1138, -1833, -3057, -4054, -3440, 834, 1151, 542, 98, 658, -2345, -3357, -2550, -1491, -2933, -2402, -3382, -2800, -4656, -8109, -7169, -3501, -5296, -3956, -1981, -2101, -3057, -1834, -1066, 748, 1435, 3908, 4932, 3064, 1115, -2634, -1099, -1062, -425, 534, 2819, 4784, 2174, 2433, 3315, 2936, 1621, -1689, -724, -33, -1634, -3371, -1555, -2170, -289, -759, -2769, -1614, 2499, 7664, 2526, -2281, -2601, -2890, -3403, -4421, -1310, 1446, 735, -1466, -6519, -8008, -1932, -1607, -1334, -401, 2050, 3169, 944, -2054, -1005, -3003, -2429, -856, -2263, -3094, -803, 226, 667, -3437]
12758c437k165N93L570r9q39K52L114Q23n139l748N09o54p93N764Q06r6L755K020
12740D236r13j864k702j692l466J752L382P52p04n88J893k419J940J148M380r21
12724D214n607m946L828m63l072j050J001J994Q81j235M794O46l98k215J375K29
12708b4l651j981L090J356j26Q8J689L444K2j523l11J457N48j706O82q92l551
12691a389k930r28k400K545K901P53M163K509J162k961j002m653l81J396j148
12676b363l115Q26P67R87k003r96M707m200Q8K107n04J694O78L45j579j914L710
12659g65M551Q24l090k208k259J188J691j214k281j324J774J68L41k377k154M02
12643f733k291j744L148K393l02N05L65J998L886j738r27l259j333K858N57k123
$$ y = [-3437, -5602, -5009, -1439, -1538, -2377, -2125, 989, 1812, -3327, -7075, -6566, -7220, -8013, -2249, -1443, -1539, 2216, 4236, 3323, 1459, -1243, -2935, -6401, -4649, -1267, -515, -1219, -1807, 86, -2333, -393, 755, 5135, 4214, -1393, -6339, -2511, -2974, -6046, -7096, -6095, -4101, -3220, -4455, 339, 985, 587, -1628, -253, -24, -3675, -5656, -2566, -1210, -1336, -1248, 441, 3885, 3907, 2384, 2073, 3530, 4078, 2372, 3054, 2162, -1389, -4319, -5247, -7647, -5102, -2201, -1448, 2715, 5224, 6386, 3425, 2423, -2230, -2611, -1215, -2363, -5478, -4652, -3885, -2898, -4901, -5897, -1190, -5390, -5302, -3195, -3699, -2005, -1327, -982, -2561, -4475, -765, 3786, 4610, 1520, -688, -2947, -1759, -68, -1282, -3563, -4887, -3113, -2945, -2604, -4981, -7135, -6733, -9024, -10768, -7620, -5227, -5529, -5024, -4659, -2661, 1225, -513, -1440, -4699, -6032, -3174, -2617, -4740]
12627d740k936k389J43K016M974J900j14K22Q23l126p51L02k902j80N75k350j137
12610i670K347M008j354J382J7k647j163j375J176L689M495J269k180q0R04K570
12594C388n64l279j86j461l497m811j126J401R65J592M091R90p13M856m38k825
12578a617j356j620j587K299L949j089J098n16J763P08j832m649l226O95J639
12563e341O39q77M006K330k605J441l800l435J557N946J638l257l750n82K498
12548c592K853J333n6J209M2J095o22Q98l747j549M84K317L788j476j726J604
12532B855Q52l756m760m57J092J931Q34Lm673K347J267K012l35k657J467j662
12516c640N38j31L443N700l73k937j263r27m11k025k405L25J426J063n86p72K456
$$ y = [-4740, -7676, -10065, -9922, -7906, -2932, -1032, -1146, -924, -101, -3227, -3978, -3676, -6578, -6758, -6183, -8533, -9670, -7323, -3315, -4669, -3287, -3270, -5917, -7080, -8455, -7279, -3590, 905, 2174, -6, -86, 818, 3388, 2824, -455, -641, -2102, -5599, -10410, -11536, -10135, -9170, -7578, -3487, -2497, -3210, 1646, 1208, -1617, -2973, -4593, -6180, -3881, 68, -1021, 77, -439, 1324, 2032, 200, -4449, -7675, -6980, -5341, -4702, -5579, -1573, 757, -1848, -407, -4207, -7642, -6085, -139, 1499, -1758, -5508, -6090, -3592, -739, 594, 538, 1747, 1789, 2884, 2262, 3160, -587, -2136, -1652, 665, 4453, 2977, 1251, 2855, 3707, -49, -4809, -5266, -4174, -2243, -1409, -1406, -6079, -3732, -2465, -453, -788, -3445, -1978, -3640, -3102, -3233, 210, 5910, 5537, 2600, 1337, 410, -1, -2026, -4431, -4106, -2680, -1617, -2203, -2975, -519]
12499e19J482J394J31l803J412J310J380j299p80L582%k744l52K741m012k27P196
12482F892R43m264o11J194l229q44K032R10j811n932J1J841M256N29l636p01N74
12465a846j064J776M29n8P36Q14L153K337j220n99l592J229K730j215j587k663
12449f40j269R43n8q61K781o41K753J472k060k553L65m73n63m71o01R17l84K148
12431H05M803k366m331l299Q06L707L103l020j281j48K286J676J916J247m362
12416A542n143j308k073L5J079K933J670k954j792K628L559k112k40N59L044L955
12400E382K183l57n18k888r71N63m43j287O39j047l540J704M96k122j130j659
12384d995j167K906J672J494L27q07j641J129k364o26L067J775K069k80j046k582
$$ y = [-519, 963, 2357, 2488, -1315, 97, 1407, 2787, 1488, 708, 4290, 4290, 1546, 1194, 3935, -77, -304, 6892, 7835, 3571, 2960, 4154, 925, 81, 2113, 3023, 1212, -4720, -4709, -2868, 1388, 1917, -1719, -2420, -1846, -2910, -1134, -705, -763, -27, 787, 3940, 6277, 5057, 4458, 866, 2095, 4825, 3610, 2023, -640, -1909, -966, -1024, -1885, 896, 255, 3008, 4480, 2420, -133, 232, -241, -804, -1275, -1876, -959, -1343, 805, 5608, 3242, -1089, -4388, -3582, 125, 3228, 208, -1073, -1221, 1065, 2741, 4657, 5904, 1542, -3601, -4909, -6982, -6947, -5868, -2935, -1265, -4219, -6011, -3383, 176, -1936, -2176, -1617, 1427, 5382, 7565, 7208, 6690, 3802, 2831, 3394, 2951, 1664, 2303, 1256, -2284, -580, -84, -2206, -3336, -4995, -6162, -3256, -1584, -90, 237, -570, -2211, -1082, -3446, -4072, -1005, 770, 2839, 2559, 1513, -1069]
12368a069j877L53L607J673N80k286r38J52k216m42J156k078j093J57Q13M33Q25
12351b250J847J697J921P76J675q83j943l272J68K733K247k751m435O5J333Q23
12335b49l15o91j310K32J178J310k479l443J619J474L565K991j104k728n68J310
12319G92j946P41O87J198o52k821k136j538K097O2j347j17P57K70O43M53M26m38
12301b869j09J542K505j04j307k325N18O15k627k023P17j004J087J456J383q99
12285c444j255J622K181n22J291J432K21o12L592j957k116o78J826J874K12j205
12269B462q5K76l950k838R02J543J608J858n56k969l095k206j034K456N97J605
12253c426k19k569K534M764n14q65j887O11n89K531q96q32J701m93J580K725J61
$$ y = [-1069, -2946, -2593, 1014, 2687, 3267, 981, 43, 195, -2021, -2463, -1307, -3385, -4478, -4321, -3508, -3075, -2250, -403, 1294, 3215, 3991, 5666, 4783, 2840, -432, -264, 2469, 4716, 1965, -2470, -2405, -1072, -249, -564, -1255, -2565, -2333, -1155, 155, -2324, -5767, -4148, -2674, 891, 3882, 2778, 50, -518, 792, -1154, -413, 274, 1472, 820, -2001, -4137, -5675, -3578, -3516, -4863, -4980, -4223, -3953, -3310, -2857, -2431, -2869, -2978, -1436, 1069, 965, -342, -2667, -2149, -1534, -4161, -6184, -5467, -6471, -5384, -3928, -2545, -3444, -4699, -3077, -896, -1418, -127, 1305, 1526, 914, 4506, 2549, 433, -245, 1581, 3455, 3667, 2462, 2377, 2653, -1297, -4135, -3233, -1690, -82, 1776, 1220, -1749, -4844, -7050, -8084, -5628, -5031, -3426, -3645, -6214, -3680, 1084, 570, -295, -2182, -1571, -2160, 371, -525, -1357, 344, -149, 1431, 4156, 4317]
12236D317q66O88L097l274l108j80J276K38P61p13Q1K323J529J41l428k275K60
12219H67K251J483J34q32k133j175m7J023K46j730J705q50k298K541j183k125
12203b123j252N216M959j518k492k737j532j188j961k81K572J251J273K531J350
12188D068o35n159m900J560o78J94J205J630q47q19N73j427J22L789K293L36p56
12171E49j144Q76q65K558Q28p111J525M909o59l452k975K805J36q90P89K471Q9
12154D39J187l813l087P05N80L288q7k250l5j998R85L312O15j523K041J677j046
12137I90j248l874P25N13O16q86j734K849J338k780j591L443K190J713K725M45
12121E434l037n30l830l268K10M157o7m43q16j712J49J350K241J292k196k973
$$ y = [4317, 3451, 4139, 7236, 3962, 854, 674, 1950, 2188, 2949, 2236, 2317, 4640, 6169, 6310, 2882, 607, 867, 3118, 4601, 4735, 3903, 1770, 595, 548, 1571, 1817, 87, 1792, 942, -1356, 1185, 2, -2123, -3375, 1841, 6800, 5282, 2790, 53, -1479, -2667, -4628, -4909, -2337, -1086, 187, 2718, 4068, 3433, -1726, -6626, -5066, -5744, -5550, -4345, -2715, -3562, -4381, -3808, -5235, -5113, -1324, 969, 1305, 549, -595, 281, -584, 1974, 2802, -4309, -2784, 2125, 1466, -1986, -4961, -2156, -2020, -2910, -2121, 350, 439, 1626, -2187, -5274, -4569, -3989, -701, -788, -3038, -3073, -5071, -4086, -774, -159, -1682, 359, 2036, 990, -258, -4132, -3407, -2894, -2278, -3164, -4898, -2049, -711, -3491, -5082, -1639, 551, 2264, 4989, 5434, 2397, 1867, -1963, -5231, -5021, -864, -931, -1374, -2190, -3902, -3753, -2403, -162, 1130, -1066, -4039]
12105d039l15K033N488j278j619j922k099O21P9k82J956j442j494K370J607j122
12089a458R3j423j265O07P98N58k670l78J551N33l037K463J900L069L70k937K276
12072A050L917k884n57j235q58m215k866k45J158J055J598P33K668N370q62j273
12056B554j802l794J862k00J078J21m441k261k81L623J6K303Q69j961J220K900
12040A806j024l357J438K755k233Q59N77N049P51m952l672R00QQ91L59k990j019
12023c854J216K530J323L507l39j549k361k108n671j286J313N120K794J091Q93
12008B619Q4j314P35O4J348j34l115Q64k59q42j180k226K15j32K224k649k638
11991f336j380K146J969L198k757k082L73M954K717j952j082q26K590j718l281
$$ y = [-4039, -4354, -2321, 3167, 1889, 270, -1652, -3751, -3130, -3051, -3333, -1377, -2819, -4313, -1943, -336, -1458, -1365, -2788, -4053, -3446, -2648, -2090, -4760, -5138, -3587, -3054, -6091, -3628, -1728, 1341, 1711, -1226, 1050, 4967, 2083, 1526, 291, -567, -4782, -7648, -7893, -6735, -5680, -4082, -3349, -681, 4689, 3827, 2554, 752, -3042, -1180, -1380, -302, -181, -4622, -6883, -7164, -3541, -3525, -1222, -353, -2314, -1094, 1806, 782, -2575, -1137, 1618, -615, 244, 821, 5870, 6621, 1669, -2003, -1103, -1095, -204, 155, -2835, -3854, -2638, -108, 1215, 4722, 4383, 2834, 473, -1635, -7306, -8592, -7279, -2159, 635, 1726, 2619, 2703, 1389, 2124, 2188, 3536, 3402, 287, 1151, 892, 50, -1130, -3356, -3141, -3273, -1049, -3698, -6336, -7716, -5570, -3601, -403, -3160, -5242, -4869, 85, 2802, 850, -232, -1058, 1532, -186, -3467]
11976c467K422L129O32j258k660k444R58n87Q1J28O55J944K495k441m55P04Q38
11959F74j127j998j809L77J535K080L095L82K96R43J460m95j648m734p58n79Q17
11942a489O41N5q89O28J829K168o20j323L219K26l570q75J574p97m30j265k715
11925c633K433M27l427J54L175J529l41L915J82J121J71k504l697j773O758L104
11909G594j096k510Q43q26p45L91l556Q60P1J03N88K31j461j329j067J000M009
11892C100k78p60r45m483r91J656J715J423m59O6k262l075O11L721k13p16J667
11875b23j614M61K589j333k208q81J043J438k169N99J929n14L250k043k104K891
11859A111K253R84j53j083j178o96J063Q74o88k240m27L187j85p12L415L031k235
$$ y = [-3467, -1045, 2084, 2716, 1458, -1202, -3646, -2688, -3275, -3194, -3066, -2411, -467, 2028, -413, -868, -164, 674, -453, -2451, -4260, -3883, -2348, -268, 2827, 3209, 3505, 4448, 5908, 5413, 3765, -969, -1727, -2306, -1489, -848, -793, -1682, -1054, 775, 2943, 2323, 1000, 4219, 4445, 875, 0, 1574, 777, 347, -918, -3633, -1200, -773, -4200, -4046, -871, 658, 317, 4232, 4414, 5535, 5706, 3202, -495, -2268, 4490, 7594, 6498, 3988, 4831, 4005, 3260, 3651, 95, 955, 1026, 1129, 1717, 1948, 487, -842, -1909, -909, 3100, 2822, 2062, 1117, -3366, -4357, -2701, -986, 437, -22, 44, -2218, -5293, -4682, -961, -1174, -1890, -223, -1837, -1376, 1213, -120, -2328, -3209, -2166, -728, -2897, -2298, -369, -883, 2367, 324, -1780, 1111, 3364, 4348, 4195, 3112, 1934, 1238, 2301, 3175, 2487, 247, -180, 3007, 2822, 2110, 5525, 8556, 6321]
11842F321j795k12R52l53J61J034O9l273J043J5L7k186K343O78k001l123l64l309
11824c963J081p2J652o3N60l91j910l337m36j068K246K898J945L38m50m42j798
11807c210k08K218j343K623K359p36J187J252n12k027m48p80J566l99J859J713
11791E114k59j453q42J617M37k74n80K867M074K045q75l756L8K859k437l988r45
11774C642J106K674j788J001r06k335k92J160o19l67q17J747k022l315k47K58
11758a120J749p63O63M034K80k885p62j023R19Q84k402r91K751J830j223O49O03
11741C193J32m79l233n820K796L841L195J339Q61j959k296p3J534M54j896j722
11725a33j278M46p25j493O53K608K166k746l7L000q7l348o12J652j062n57J394
$$ y = [6321, 4526, 4314, 5266, 4913, 5074, 6108, 6177, 2904, 3947, 3962, 3999, 1813, 4156, 4834, 2833, -290, -654, -3963, -2882, -2954, -1302, -1365, -805, -1196, -3106, -6443, -6879, -7947, -5701, -2803, -858, -520, -970, -1412, -3210, -3418, -1200, -2543, 80, 2439, 1703, 2890, 4142, 3630, 1603, 1155, 375, 1941, 1542, 3401, 5114, 4855, 3402, 2560, 4177, 4614, 4340, 3760, 6627, 10701, 12746, 11871, 8115, 8153, 11012, 8575, 4587, 3642, 4748, 7422, 5634, 6635, 5729, 3394, 3102, 4262, 3643, 3276, 2459, 4206, 2184, -1131, -1378, -1120, 629, -134, 529, 4563, 4843, 1958, 1196, 173, 1092, 1976, -426, -1417, 1334, 3164, 1941, 2590, 3193, 3325, 2846, -387, -6207, -3411, 430, 3625, 4964, 5825, 3866, 1570, 1497, 3031, 3485, 1589, -133, -1411, -965, -1690, -3183, -2530, 78, 2244, -502, -539, 2461, 2374, -974, -1586, 66, -996, -1553, -159]
11708a59m17j714K56K016m93k80J201J40j008M57M059J973o85m942m688L69M318
11691D03J240l071L231M279j61J740j435k044j471R51k990k385J829Q65q95L025
11675C111n35L12P09J840n46k222l480J394K348J709N14k169o73J516M013r89
11659F852k027j620l238N36k167l67L514j463R51Q68l04l07J616M476K399q85
11643H834k349l369j472K97k143j312J073k2L96J189k007qM01J378J373J229m04
11626C084k020o15q29k583J787K055p19l52L986K192R49k97j513k65k867k497
11610e04J283J872Q13J121K514J34N03k138q08M215mj02l44m72J975R90l504l254
11592D290r56L568K97k749J129q05j343l135l795o93N446J264J079r77k309L263
$$ y = [-159, -576, -2290, -2034, -18, -511, -791, 410, 550, -458, -1, 4058, 6031, 5346, 404, -4284, -3915, 403, 1643, -1428, 1803, 6082, 5921, 7661, 6226, 4182, 2711, 3662, 672, -1713, 116, 981, 86, 3111, 2576, 2888, 3597, 5437, 4891, 2669, -811, 583, 2931, 4640, 5154, 2985, 2312, 3828, 7841, 6852, 4825, 3205, -33, 503, -1664, -2031, 1483, 20, 971, 1839, 1535, 1228, 2844, 7320, 9719, 8834, 6485, 3116, 1644, 1941, -202, -1514, -441, -463, -67, 1122, -885, -893, -492, 886, 2259, 3488, 3084, 1064, 449, -380, -2963, -1176, 879, 160, -192, 3794, 5986, 6935, 6638, 5125, 4860, 1993, -504, 779, 2651, 3464, 4585, 7099, 7233, 7736, 5598, 4790, 9005, 9001, 8899, 8555, 8083, 10058, 11048, 7544, 4290, 3334, 6902, 7199, 4450, 5579, 4774, 3431, 296, -3499, -4192, 1254, 2518, 3597, 2620, 311, 3574]
11576C574K60o69k1j280p15k433N39O29P7j338j642K975K248M439K997l015k017
11559D608k959M17J432m11l264K57O54O69O99P26j146j453p20M4k237O23L063
11542A002L918n54l017j280L849O73J663R8j567j19j151k45J765N5l331k338P87
11525B08K827L87l823k294L645N17K597J427L361k24n306k251N84j265R11K568
11509C869N00k5J73N52J105K027l019j142L940L522k379k696k509o67J373l428
11493A196j559M541K133P4j317k509J214K654K341m834k033J930J378M89n06k416
11477B776j984P34N4R46J107J22K29K298K420J521o47m37q48L77j26j164p28j912
11459D738q69k383l290j054K386L292K256K133L54J108j103n87K218p41k343R74
$$ y = [3574, 3834, 3165, 3144, 1864, 1149, -1284, -745, -116, -39, -1377, -3019, -44, 2204, 6643, 9640, 6625, 4608, 1649, 2066, 3498, 3087, -177, 80, 734, 1403, 2102, 2828, 1682, 229, -491, -447, -2684, -2061, 1002, 4920, 4366, 1349, 69, 3918, 4591, 6254, 6352, 4785, 4666, 3515, 3270, 5035, 5090, 1759, -579, 208, 3035, 3422, -401, -2695, 950, 1467, 4064, 5491, 8852, 8628, 3322, 1071, 1655, 390, 1301, 3869, 4369, 4344, 4517, 5069, 6174, 8201, 5182, 4040, 7980, 11502, 9123, 6427, 3918, 3251, 4624, 1196, -363, 4178, 6311, 6385, 5068, 2559, 3773, 6427, 8768, 3934, 1901, 3831, 5209, 5698, 5192, 2776, 792, 1526, 1580, 2526, 3633, 3755, 3984, 6282, 8702, 10223, 9576, 9139, 8291, 8668, 8542, 7378, 6650, 4738, 3869, 1486, -1804, -2858, -472, 2820, 5076, 7209, 7563, 8671, 7568, 6981, 9199, 8458, 6115, 7089]
11443G089l388m37K709k52P75l21k079J224k499l052J911J418L847L109j276o72
11427H106p38n5j150j576j954J989J678K109L23j17j840j422k079o4K335N521
11411A1066m69m440j038o83m850j992M19K595J830J52l110j224J41N629L048K600
11395I674p13k101l216q87O21N45P12J867O30J492j960m240k59R75J089J541K44
11378F014J851k637K098J795k044k644K70j50q27J532L597J134o06m759m072K971
11362C523N00K063k97l4l623J99M348J909N23j922k629k585j233J645m39r61J758
11345B745P10J051j150k131r60k052K803J550j374J183L159L625p3k630M8J993
11329H497K314j066j854m37j26k071k09p63J76J6R36J818J675O9j553r86j158
$$ y = [7089, 3701, 3264, 5973, 5721, 6496, 6175, 4096, 5320, 2821, -231, 1680, 3098, 6945, 10054, 8778, 8106, 7368, 7313, 6163, 4587, 2633, 4622, 6300, 8409, 8732, 8615, 6775, 5353, 3274, 3210, 5545, 11066, 10597, 6157, 5119, 4436, -414, -2406, -1987, 608, 2438, 2590, -520, -1744, -1603, 4026, 7074, 9674, 8961, 6860, 3644, 2757, 3378, 3923, 4635, 6502, 7132, 8624, 6664, 2424, 2165, 3140, 4229, 5770, 6014, 7865, 5228, 7326, 9121, 7077, 4433, 4703, 4553, 3726, 5258, 8855, 9989, 9383, 4624, 552, 3523, 4023, 6086, 5789, 5755, 2132, 2331, 6679, 8588, 9111, 7189, 4560, 1975, 742, 2387, 1948, 987, 2745, 3455, 4506, 3356, 1225, 265, -1787, 1016, 2566, 1192, 2375, 5534, 9159, 9086, 6456, 6504, 8497, 10811, 9745, 7891, 7454, 7328, 5257, 5048, 4285, 4461, 4477, 5413, 7231, 8906, 8975, 7422, 6436, 5278]
11312E278l14k55p7J109r94k580K167q94j306J334K3K094j74p43k441k06k381
11295c60J89J779K491K157K518J384l737l80J100L13j823J039R53j404k931J777
11279E065J221l433L39L33K021l95m43J250j423k351Q87j503J142K787l91K519
11263G625k053q94n8J279j958k623K334R37k277K492M371P79o25J037L83j450
11247I299J199J912o84j663j795J012J707j297k512k664Q97k110J717K133j685
11232E466q15K256M041O84k709k605l862K374L890K153j042k009J933l16r35K774
11216A1278J061k235m949k128L303L366p71j761J716J422q59j715m672m119M102
11201C039N521m82J409L13j310J348O89K645J696k346l489J041J945K999l9k22
$$ y = [5278, 4964, 4709, 4632, 5741, 4747, 2167, 4334, 3440, 2134, 3468, 3491, 5585, 5411, 4668, 2227, 2021, -360, -171, 1608, 4099, 6256, 8774, 10158, 6421, 6041, 7141, 7454, 5631, 6670, 7623, 6219, 3288, 5065, 6286, 2853, 3192, 3525, 5546, 5151, 4708, 5958, 4535, 2184, 3071, 1568, 2710, 5497, 5106, 7625, 5572, 4678, 4620, 5899, 3941, 1318, 3652, 4589, 2312, 4804, 9175, 9954, 9329, 10366, 10749, 9299, 10498, 12410, 11726, 10063, 8268, 9280, 10987, 9690, 7178, 4514, 5411, 3301, 5018, 7151, 5466, 4651, 6907, 10948, 11632, 8923, 6318, 2456, 4830, 8720, 10873, 9831, 7822, 9755, 9439, 8504, 11278, 12339, 10104, 5155, 3027, 6330, 9696, 8925, 7164, 8880, 10302, 9443, 7728, 3056, -1063, 3039, 8560, 8078, 9487, 9800, 8490, 9838, 10527, 13172, 14868, 12522, 9033, 10074, 12019, 15018, 14979, 14757]
11185A4757j369n519l478j522j681j636K609J34J36m01N0M067L868J748l225j300
11169G238m0P47r88J82l87J053K57l28o22M14k72r8N90R88J580j101m174k371
11151B668L831M255L12k759r34k78J684O20J441J538K466j003k935R89J653j612
11135A1936N0o25M134K82l317n685K273N621j355j320j944j369k657Q29K315K899
11119A2067r63J028P83j956K645M69j296n326k152J713k59o92K738k242J66p09
11103F014m30K369Q63k48k374k734J586k623m082k023L85K923N047L09p1M439
11087I350K493J212J734k485j400j507k837Q70j703j391J47n081P74L997O037
11072A0210N06m59K296M92r5O25N9l160l070J252K176m071n318R04L950J891k431
$$ y = [14757, 13388, 7869, 4391, 2869, 1188, -448, 2161, 2295, 2431, 2030, 2080, 6147, 10015, 11763, 8538, 7238, 7198, 7945, 6957, 7139, 6752, 7805, 8062, 7734, 7112, 7526, 7254, 7156, 7746, 8734, 10314, 9213, 5039, 2668, 6499, 10754, 11066, 8307, 7373, 7095, 8779, 9399, 10840, 12378, 14844, 13841, 10906, 11895, 13548, 11936, 11986, 11361, 15495, 15777, 12460, 6775, 9048, 14669, 13314, 11994, 10050, 8681, 6024, 6853, 9168, 12067, 11104, 12132, 12915, 10959, 13604, 14073, 12777, 7451, 5299, 7012, 6753, 6061, 8799, 6557, 6723, 6014, 5584, 7953, 8816, 8568, 6194, 3460, 5046, 2423, -1659, -3682, -3297, -374, 4673, 4982, 4911, 9350, 11843, 13055, 14789, 12304, 10904, 9397, 6560, 7430, 5727, 4336, 4483, -598, 176, 4173, 10210, 10716, 10257, 12553, 13045, 12950, 13575, 13634, 10474, 7404, 8656, 10832, 6761, 1443, 2347, 6297, 8188, 5757]
11055E757j347L400K20J722j18r3j458N51J245p49j89J809J196n36j022J665J320
11038A3373N22j156j664k957r19N07L762Q99K280K462m50k283k359j219j491k206
11022G101k770J190L10Q92K607K419L93k357l608J49L421K560J946n28J743J806
11006A7274L388K67j378J183J304K123M011J769K122N349J165k974n019o952l371
10991B0261m37j578k815k505l11j734J669j792J765J934R89j37k33n22K463J333
10975A8350j076j42l326m359J44L532K842l588k076K440L288K110l917l263q76
10960A0083J387j152j100K051j025K61n034k346K362M849M480J787K839l856j375
10945A4211L493L411k9J05K017l02N103L36k950r29l94k165m563l20j613J339
$$ y = [5757, 4410, 7810, 8030, 9752, 9634, 9541, 8083, 8634, 9879, 9130, 8941, 10750, 11946, 11410, 10388, 12053, 13373, 13895, 12739, 11075, 8118, 7199, 7706, 11468, 12367, 14647, 17109, 16659, 14376, 12017, 10798, 9307, 7101, 4331, 5521, 5831, 6723, 9330, 11749, 12142, 9785, 6177, 6326, 9747, 12307, 14253, 13725, 15468, 17274, 20662, 20929, 19551, 20734, 22038, 24161, 28172, 29941, 32063, 37412, 38577, 35603, 30584, 23632, 20261, 19824, 18246, 15431, 12926, 12615, 10881, 12550, 10758, 12523, 14457, 15446, 15309, 15076, 14554, 17017, 18350, 17274, 17132, 13806, 9447, 9591, 13123, 15965, 12377, 10301, 12741, 16029, 18139, 14222, 10959, 10083, 11470, 10318, 9218, 11269, 10244, 10505, 5471, 3125, 5487, 10336, 14816, 16603, 19442, 15586, 14211, 17704, 21115, 21086, 21191, 23208, 22906, 28009, 28345, 25395, 24466, 24072, 21907, 17344, 17024, 15411, 16750]
10929A6750J031o97k044K56K699k927J173K284m64J420J396J85p43m729q96o95
10913A3999m79L561L133M24m319q8j9m935k755M74L802O73j554L075q13J165l19
10896A5025l876j934J617n8k133j937J455J718j094m013K778J954L269l75p02
10881A1694J478k716L518K473M129N420N679L803K168J049p95O5n01j62J017O20
10865C8939k97j85P67o49L83N54l706n630k567J330L436k2k686k668L313L875
10849C4187K79J116K758P39J067j495j629k335K26M74L161K242P75m97L195O789
10833E1052M187l083n447l044j853n418p211l999K1R41K327L855K804J77N80k00
10817C5689m207m148K307K438k551j525L93K359L996J051J212L186j280n949p95
$$ y = [16750, 17781, 17084, 15040, 15296, 17995, 15068, 16241, 18525, 18061, 19481, 20877, 21062, 20319, 15590, 14694, 13999, 13520, 17081, 20214, 20638, 16319, 16231, 16212, 11277, 8522, 8996, 12798, 13471, 11917, 14992, 14179, 15344, 15025, 11149, 9215, 10832, 10774, 8641, 6704, 8159, 9877, 8783, 4770, 7548, 9502, 12771, 12396, 11694, 13172, 10456, 13974, 16447, 20576, 25996, 31675, 35478, 37646, 38695, 37900, 37965, 37464, 37302, 38319, 38939, 38642, 38457, 39224, 38575, 38958, 39512, 35806, 30176, 27609, 28939, 32375, 32353, 29667, 26999, 30312, 34187, 34466, 35582, 38340, 39079, 40146, 38651, 37022, 34687, 34913, 35387, 38548, 40790, 41565, 41068, 44263, 51052, 55239, 52156, 46709, 43665, 41812, 36394, 29183, 25184, 25205, 26146, 28473, 32328, 35132, 35309, 35889, 35689, 31482, 27334, 29641, 32079, 29528, 28003, 28396, 30755, 34751, 35802, 37014, 40200, 38920, 32971, 32176]
10802C2176O38m714j310K329L848J861R77j634O28J162K615j042j131k463j58
10787C3782O31L134J502O26m98j901j001L600l77j519P09J442J921l587n137m417
10771B8910Q41j281n5L633l27P25l113j901m01L529J846N704L643L491J826N43
10755D7613J552L508J470Q46l395J818q15Q60N365L196o98l572n829n120J098
10740D7897M737K483n8k679N88l421k069J266j486k193l824l742r82M030K354
10725D2901N36j780K887O561J793k18M649K366j429k626l341n146l724j51L748
10710D7026J58r4J081k662K540P020Q61K007R43l075k004K699J362l10j815l328
10694E2409m272k634J208k690J621N895Q692Q985L658j453l800k784M275K457
$$ y = [32176, 32814, 28100, 26790, 29119, 32967, 34828, 35805, 34171, 34799, 35961, 38576, 37534, 36403, 33940, 33782, 34413, 37547, 39049, 39675, 39177, 37276, 36275, 39875, 39498, 37979, 38688, 40130, 42051, 38464, 33327, 28910, 29751, 28470, 28415, 32048, 31721, 32446, 29333, 27432, 27031, 30560, 32406, 38110, 41753, 45244, 47070, 47613, 49165, 52673, 54143, 54989, 51594, 53412, 52597, 53457, 58822, 62018, 61320, 57748, 51919, 46799, 47897, 52634, 55117, 55059, 52380, 52968, 49547, 47478, 48744, 47258, 45065, 41241, 37499, 36517, 40547, 42901, 43437, 41657, 44544, 51105, 52898, 52680, 57329, 59695, 58266, 55640, 52299, 47153, 43429, 43278, 47026, 47184, 47090, 48171, 45509, 48049, 55069, 55930, 57937, 58880, 55805, 53801, 56500, 57862, 57552, 55737, 52409, 48137, 45503, 46711, 44021, 45642, 51537, 60229, 69214, 72872, 71419, 67619, 64835, 69110, 71567]
10680G1567l701l941O1P319O06R18O535N696R075J1194J1478Q496K284L363O710
10665A37660P689J4093J4814J9453K6044L0649L4966L9594N1627P7095J19306
10654E72990J89637L17903N17693P00552O76984L66934p9223m58046o52037o34385
10644A519002m76923l11827j96183j25982q4859n3402l3929k5160j5146m703K042
10633A92930P564M387o425j3061j8481k1953j2538r543p504q370q483p549n683
10620H5291o512l084l015m411k267m01k616m181qO8K160k366l183j277k639j844
10604D9715K658J440M4m58L35M310N410K025P55J370L102L537J820J478N528M230
10588H7299N790J6322K4131K1452J0667k663j4837k1161j8762j1210m106j004
$$ y = [71567, 67866, 63925, 63986, 71305, 71911, 72829, 79364, 85060, 94135, 105329, 116807, 125303, 127587, 130950, 137660, 145349, 159442, 174256, 193709, 219753, 250402, 285368, 324962, 376589, 453684, 572990, 762627, 1080530, 1598223, 2298775, 2975759, 3342693, 3263470, 2805424, 2153387, 1519002, 1042079, 730252, 534069, 408087, 323228, 269826, 235897, 210737, 195591, 190888, 192930, 200494, 204881, 198456, 185395, 166914, 144961, 132423, 122880, 115376, 107006, 98523, 90974, 85291, 78779, 75695, 72680, 68269, 66002, 65601, 62985, 58804, 58796, 58864, 61024, 58658, 55475, 54198, 51559, 49715, 52373, 53813, 53857, 53399, 53734, 58044, 63454, 65479, 66234, 67604, 70706, 74243, 76063, 77541, 83069, 87299, 93089, 109411, 133542, 154994, 165661, 162998, 148161, 127000, 108238, 97028, 92922, 91918]
10576I1918n167k675l655n971k377m499m419l30l227oJ664N452K848J92L514K917
10560G6179n1J961J3036K3331K5264J2723m729j6697k3076j7273j2118o666n016
10547F6868l618l652J155K706P69N952M505L408M744L660N960N314O554n58Q84
10532A04651k16J129J589j362R12J952L351j722j691J988m08Q45J341J910L470
10517A17739N019O069K776M946N892L197O618K089L124M664O818J0742J4156J6471
10503B10320K2314L1565L8342L6121K0861K588p63o288k0424l4464l9432l4833
10491B25907l2706k7607k0667j4950j0524p197m913L996O586m21k411P25K402
10478A18220l58l736l430m856n384q454q488l992n321j742L087L169M452N328
$$ y = [91918, 86751, 84076, 80421, 74450, 72073, 67574, 63155, 62825, 59598, 59592, 61256, 66708, 69556, 69748, 73262, 76179, 76128, 78089, 91125, 114456, 139720, 152443, 147714, 131017, 107941, 90668, 78550, 71884, 66868, 63250, 59598, 60753, 63459, 64228, 70180, 74685, 78093, 82837, 86497, 92457, 97771, 104325, 103767, 104651, 104435, 105564, 107153, 105791, 106703, 108655, 112006, 110284, 108593, 110581, 110173, 111018, 112359, 114269, 117739, 122758, 128827, 131603, 136549, 142441, 145638, 152256, 154345, 157469, 162133, 168951, 179693, 193849, 210320, 232634, 264199, 302541, 338662, 359523, 362111, 361348, 355060, 334636, 300172, 260740, 225907, 193201, 165594, 144927, 129977, 119453, 112256, 107343, 111339, 117925, 117504, 115093, 115818, 118220, 117862, 114126, 110696, 105840, 100456, 92002, 83514, 79522, 74201, 72459, 75546, 78715, 83167, 88495]
10464H8495J330P56Q819J0714J385O607O780K414L824J853l856n522k825k096
10450A18678L539L262L596L349J762J875M835P461R774J1950J0376R971J3042
10437B03470J3219J3174Q858N125N337L494n251j0921j454J435j024n292o604
10424B23566j3121q568p76K583j4n740k805j690l549m958L560J913N13j901L787
10409A92800M474M934P935J5605K0277K982j7529l0718l1519k5458k0992k0491
10397A02300k0138j1863J658J5904L1065L3076L3725K8277K1747J7696J1801R270
10385B74518J2485N425K892J1536J3586J4106R189N611L841k944o665j720P012
10372C48872R187O851l985j7467j6058n854k377j4913k1340r775o361j597N15
$$ y = [88495, 89825, 90581, 99400, 110114, 111499, 118106, 124886, 127300, 131124, 132977, 129121, 123599, 120774, 118678, 122217, 125479, 129075, 132424, 134186, 136061, 140896, 148357, 158131, 170081, 180457, 190428, 203470, 216689, 229863, 238721, 243846, 249183, 252677, 247426, 236505, 235051, 236486, 235462, 230170, 223566, 210445, 201877, 201101, 203684, 203670, 197930, 195125, 193435, 189886, 184928, 188488, 190401, 190914, 189013, 192800, 197274, 202208, 210143, 225748, 246025, 249007, 231478, 200760, 169241, 143783, 122791, 102300, 82162, 70299, 71957, 87861, 118926, 152002, 185727, 214004, 235751, 253447, 265248, 274518, 287003, 292428, 295320, 306856, 320442, 334548, 343737, 349348, 353189, 350245, 343580, 341860, 348872, 358059, 364910, 360925, 343458, 327400, 321546, 319169, 304256, 282916, 273141, 266780, 265183, 265698]
10359B65698O855R264J0172J9518J6777J4881N575K244M074O603O578K406n390
10346C65255j271L760N418Q734J3613K0618J9576K4486K0635J3341J3358J6771
10334E24294R650M003N164J1728J8341J8918J5380J4569K6087L1037K8557K0852
10322G28580J9550K1297K1686J9626K0708K6835K5764K6742L0631K8302K8881
10311I98602K5383K7557K4236J9960K5679K3128K3172K2995K7415K9750L1000
10300A278877L7351M3928M8523O2999P4108Q1403P6266P5005R0013J08970J15950
10289B093393J10420J00357R8520J10314J22852J30930J45742J65379J97317K38202
10279C513426K75421L00896L23922L67928M16121M69563N30676O03683P14174
$$ y = [265698, 272553, 281817, 291989, 311507, 328284, 343165, 348740, 350984, 355058, 361661, 368239, 370645, 365255, 363984, 367744, 373162, 381896, 395509, 416127, 435703, 460189, 480824, 494165, 507523, 524294, 533944, 537947, 543111, 554839, 573180, 592098, 607478, 622047, 648134, 679171, 707728, 728580, 748130, 769427, 791113, 810739, 831447, 858282, 884046, 910788, 941419, 969721, 998602, 1023985, 1051542, 1075778, 1095738, 1121417, 1144545, 1167717, 1190712, 1218127, 1247877, 1278877, 1316228, 1360156, 1408679, 1471678, 1545786, 1627189, 1703455, 1778460, 1868473, 1977443, 2093393, 2203813, 2304170, 2402690, 2513004, 2635856, 2766786, 2912528, 3077907, 3275224, 3513426, 3788847, 4089743, 4413665, 4781593, 5197714, 5667277, 6197953, 6801636, 7515810]
10270G515810Q83405J067154J146388J095952J045424J128903J379187J693054
10262A6955277J949923K193724K542023L024336L614378M319868N156532O196947
10254D5953008P804449J0468292J4967273K2873515L6302719N4782040O9023663
10247B62174959O4669757M1532986J8609654Q379024K641279q827882k5367479
10240C63812298m3328125n8604144o2910391n4288091l9682098k6793997j8058176
10233F0147276j2598314r090594o661483m879757l624967k820930k259132j806498
10225A6405601j466649j256234j131258j011483q59959p30888p00153p63497q40300
10216G645180q52778p62686o08253m61444l51922k87549k40242k05489j78859
$$ y = [7515810, 8399215, 9466369, 10612757, 11708709, 12754133, 13883036, 15262223, 16955277, 18905200, 21098924, 23640947, 26665283, 30279661, 34599529, 39756061, 45953008, 53757457, 64225749, 79193022, 102066537, 138369256, 193151296, 262174959, 326844716, 368377702, 386987356, 395366380, 398007659, 389179777, 363812298, 320484173, 261880029, 198969638, 144681547, 104999449, 78205452, 60147276, 47548962, 38458368, 31796885, 26917128, 23292161, 20471231, 18212099, 16405601, 14938952, 13682718, 12551460, 11539977, 10680018, 9949130, 9248977, 8485480, 7645180, 6792402, 6029716, 5421463, 4960019, 4608097, 4320548, 4080306, 3874817, 3695958]
10207C695958j63765j57994j59938j54795j48604j46164j43098j39762j30703
10198B351135j10537q2441p3448o8009o2836o1084o0552n6473m8573m9152n3642
10187A624388o2837o0796o0186o2305n9558n2870n1552n2204m6837l9798l2271
10176A043174k6596k4059k3381k6999k4986k3470j9726k0403j8362k1464k0630
10165G93098j6880j8672r321o256j1153j4159j9117j8719j5841j2880j3164j4133
10153F22803j5028j3263j0612q041q171o187m795K296L403j491o277j3496j0993
10140E30148j2203j1253j4658j2640p682m903O08L048L792K307N064R278Q485
10127D99391M049K011J554O016N533J4640K3971L0596K0909j669k4038k9951j3814
$$ y = [3695958, 3532193, 3374199, 3214261, 3059466, 2910862, 2764698, 2621600, 2481838, 2351135, 2240598, 2158157, 2084709, 2016700, 1953864, 1892780, 1832228, 1775755, 1727182, 1678030, 1624388, 1561551, 1500755, 1440569, 1378264, 1318706, 1265836, 1214284, 1162080, 1115243, 1075445, 1043174, 1016578, 992519, 969138, 942139, 917153, 893683, 873957, 853554, 835192, 813728, 793098, 776218, 757546, 748225, 741969, 730816, 716657, 697540, 678821, 662980, 650100, 636936, 622803, 607775, 594512, 583900, 575859, 567688, 561501, 556706, 559002, 562405, 560914, 554637, 541141, 530148, 517945, 506692, 492034, 479394, 471712, 466809, 467417, 470465, 474257, 476564, 481628, 490906, 499391, 503440, 505451, 507005, 513021, 518554, 533194, 557165, 587761, 608670, 607001, 582963, 553012, 539198]
10114E39198j3553k9385l7810m0004l3020k0819j8138j4373j2137r505l998M8
10102C06504O69L56r22m948n716O611J4310J9768J7709J4399O311r349k1340k8910
10088C15452k8504k9095l4857l5246l0823k1937n513K804O785R678O067J922K942
10075A59675J066k022j193m162p238o712n981q571m466j859k623o733j0053j0807
10061H8321j4248j0798n566l233j253m665q846n840N598J7975J1087M994N890
10048G9416J0084J2042Q016O471L082k940j640n426j771j537j236j60M1M13k416
10033A02439l316j612j82N032M746N03Q40J602N954M490M352L984K443K743J646
10018A35664k59n221l599m533n291m184m710n159m518K471P394J3946R812J204
$$ y = [539198, 525645, 496260, 458450, 418446, 385426, 364607, 346469, 332096, 319959, 310454, 306456, 306504, 307173, 307529, 306607, 301659, 295943, 302554, 316864, 336632, 354341, 368740, 375051, 365702, 344362, 315452, 286948, 257853, 222996, 187750, 156927, 134990, 129477, 132281, 139066, 148744, 154811, 156733, 159675, 160741, 158719, 157526, 153364, 146126, 139414, 133433, 124862, 120396, 118537, 115914, 109181, 99128, 88321, 74073, 63275, 57709, 54476, 53223, 48558, 39712, 33872, 39470, 57445, 68532, 73526, 79416, 89500, 101542, 109558, 116029, 119111, 116171, 114531, 109105, 107334, 105797, 104561, 104401, 104442, 104855, 102439, 99123, 97511, 97329, 102361, 107107, 107610, 108450, 110052, 116006, 120496, 124848, 128832, 131275, 134018, 135664, 135405, 130184, 126585, 122052, 116761, 112577, 107867, 102708, 98190, 100661, 108055, 122001, 131813, 133017]
10004A33017p73k532j828k195P66M107Q16K1K090k024p562n677r900o958n260
9989I6108k678n683o111l262n932n702n354m747m482o375l181k499o738m893j171
9974B7300K935J508J236L078L844M00K462K240j261k972N51K104m16l178j214
9959C8617p17r45k112J94P15j737J476N373K620L455J597K997M116M685L67L65
9943F1066P40j5K379L184N047K418R19K682k748n150n272m935l65K774j280j437
9927F0007n846o211k652n0K80L030M742N048j666l768l394m847k159o93j008l535
9911C7278k417l928m398K063K911j288M265L317K202K263j774j492K90j88L768
9896D2872L45m167l787L296M021L122N688R95j666M288J288k285J378J081N03
$$ y = [133017, 132244, 129712, 127884, 125689, 126455, 130562, 131378, 131399, 133489, 131465, 123903, 118226, 108326, 101368, 96108, 93430, 87747, 81636, 78374, 72442, 66740, 61386, 56639, 52157, 45782, 42601, 40102, 33364, 28471, 27300, 30235, 31743, 32979, 36057, 39901, 40301, 42763, 45003, 43742, 40770, 41321, 43425, 43009, 39831, 38617, 37900, 36955, 34843, 35037, 35752, 34015, 35491, 40864, 43484, 46939, 48536, 51533, 55649, 60334, 60701, 61066, 61806, 61791, 64170, 67354, 72401, 74819, 75738, 78420, 75672, 70522, 65250, 60315, 59950, 62724, 61444, 60007, 54161, 47950, 45298, 45248, 45528, 48558, 53300, 58348, 56682, 52914, 49520, 44673, 42514, 41821, 40813, 37278, 34861, 30933, 26535, 28598, 31509, 30221, 34486, 37803, 40005, 42268, 40494, 39002, 39292, 39104, 42872, 43217, 39050, 35263, 38559, 42580, 45702, 51390, 52385, 50719, 55007, 56295, 54010, 55388, 56469, 56972]
9881E6972j118k271l135K794P5k55k340j007O052K691l401j800q0J754Q23J649
9865E7403L112L476P531O186Q197P607R896O569L353K5K83L236Q477J1909J3468
9850A50728J1934J3692J8478K2924K9719L5685N3823Q7024J41063K30668L33855
9839A129593L73127K68735O4203j35093k62254k74652j75200k1624J44284K78403
9829A389522K88216J39859p3156k52093l43426l27811k40648j58627j03754o6173
9819B51909m4990k9016j9039j3734p876p169q477j0169q916r876q523j1638q187
9806F4299k347j196l114n231o537k578O76J432M805K704j896l96j202j587k538
9791D5294o83j253r62l596l417j366k768r99K295J657j764j046J326M576J794
$$ y = [56972, 55854, 53583, 50448, 53242, 53317, 53062, 50722, 49715, 55767, 58458, 55057, 53257, 53177, 54931, 55754, 57403, 60515, 63991, 71522, 77708, 85905, 93512, 103408, 109977, 113330, 113355, 113638, 116874, 125351, 137260, 150728, 162662, 176354, 194832, 217756, 247475, 283160, 336983, 424007, 565070, 795738, 1129593, 1502720, 1771455, 1835658, 1700565, 1438311, 1163659, 988459, 966835, 1111119, 1389522, 1677738, 1817597, 1744441, 1492348, 1148922, 821111, 580463, 421836, 318082, 251909, 206919, 177903, 158864, 145130, 137254, 130085, 121608, 111439, 102523, 92647, 84124, 72486, 64299, 61952, 60756, 57642, 52411, 45874, 43296, 43972, 45404, 50209, 52913, 51017, 50621, 49419, 47832, 45294, 44611, 43358, 42396, 38800, 35383, 34017, 31249, 30250, 32545, 34202, 32438, 31392, 32718, 37294, 39088]
9776C9088j671l739k145O19k091N03l267K93L088N579K767o07K378M300j765O08
9760D3938j46k681J797K691L22k001J182N39k423K69L836K039K487L524o08J216
9744E5981M246M323O836M442L787J931M169Q672Q561O524J3051J6139K0035M5500
9730B04197Q2218P2521J5712k0372n2138n6675l5320j5493n117j073J315O529
9718A96304J1989J3257J2417J7796K1404J9875K3075K8114L1931L5731M1084M9231
9706E02208N9653O7357P3259Q6242R9045J07793J19806J32889J42543J43154J30927
9695A664876J08474P0255K5481j9718o0875r8859j25961j39844j40914j36205
9685A146710j28901j16606j03131q8068p9738o6831n5939m7794m5378l9357l5679
$$ y = [39088, 37417, 33678, 31533, 32152, 30061, 30564, 27297, 27590, 30678, 36257, 39024, 38417, 40795, 45095, 43330, 43938, 43792, 41111, 42908, 45599, 45921, 43920, 45102, 45641, 43218, 43487, 47323, 49362, 51849, 55373, 54765, 55981, 60227, 64550, 71386, 75828, 79615, 81546, 85715, 94387, 102948, 109472, 122523, 138662, 158697, 204197, 286415, 358936, 374648, 354276, 302138, 245463, 210143, 194650, 189533, 188460, 189775, 196304, 208293, 221550, 233967, 251763, 273167, 293042, 316117, 344231, 376162, 411893, 452977, 502208, 561861, 629218, 702477, 788719, 887764, 995557, 1115363, 1248252, 1390795, 1533949, 1664876, 1773350, 1843605, 1869086, 1849368, 1788493, 1689634, 1563673, 1423829, 1282915, 1146710, 1017809, 901203, 798072, 710004, 630266, 563435, 507496, 459702, 414324, 374967, 339288]
9674C39288k9750k8251k2454j8705j9078j3149j2499j4079j1953j1195r780q770
9662A39625n937n385q880r435r789p963l000l316o047m845k752j323n94k64k298
9647F7797m261k534n439j087j431j730k931j173j614k251j431l40J393j112l29
9632D1527O30p25l042l265N88n780q364k339k460k501j35j5P77k020l792j699
9616G385q32K878M096M843O054N158K025L180L609M005K838m722l137k296N94
9601C5678K597j291l600l881l546L63j556L939K959l39j687k987p417l864L414
9586A8782L210K094l011l28L732n447M51Q68n79J685J06n86k435j933J70N32l574
9569A3737J26M648J997r26k232n362K247L903p95k874k70k21O37P34K7l57k67
$$ y = [339288, 309538, 281287, 258833, 240128, 221050, 207901, 195402, 181323, 169370, 158175, 148395, 139625, 133688, 128303, 119423, 109988, 100199, 92236, 89236, 85920, 79873, 75028, 72276, 70953, 70359, 70095, 67797, 63536, 61002, 55563, 54476, 53045, 51315, 48384, 47211, 45597, 43346, 41915, 41575, 42968, 41856, 41527, 42157, 41432, 38390, 35125, 35713, 29933, 21569, 19230, 16770, 14269, 14134, 14119, 14896, 12876, 9084, 7385, 6553, 9431, 13527, 18370, 24424, 29582, 31607, 34787, 38396, 42401, 45239, 40517, 37380, 35084, 35678, 38275, 36984, 33384, 29503, 25957, 26320, 24764, 28703, 31662, 31323, 29636, 26649, 19232, 15368, 18782, 21992, 24086, 21075, 20747, 24479, 19032, 19483, 20351, 19772, 21457, 21563, 20977, 18542, 16609, 16779, 17311, 13737, 13863, 18511, 20508, 19582, 17350, 11988, 14235, 18138, 17343, 14469, 14199, 13978, 14615, 15349, 15376, 15019, 14752]
9552A4752r68j825Q70Q84o80l76k177k36K057K961M200p76j406j43J202K02p57
9535A7784o98k656l32l051M05J92J372J062n595l5k070M25J970K961K293j220
9519A2807k454M27O12l59k790j489L552J782q67K358Q82J342j069j783j256j967
9503I728j994N4K196L151M332k26Q65M679J377n806k755k596k293j869l260r85
9487D598q52o1K880k238L65k649q07M468L144L953j00l915j699J108k031L025
9471I189N2j932L308N42m503N90O29M34L783P02j299k831k217J41j122K57j23
9454E600n12n10k693k950K412K013K256L315R94j299k699p57J166L76P0N94k507
9437D869k195J970L952N31k452K185J005l585J985L066J362L3j240J9J355K42
$$ y = [14752, 13784, 11959, 12829, 13713, 13033, 12657, 10480, 10244, 12301, 15262, 19462, 18686, 17280, 17137, 18339, 18541, 17784, 17086, 14430, 14098, 11047, 11452, 11644, 13016, 14078, 8483, 8448, 6378, 6803, 8773, 11734, 14027, 12807, 10353, 10780, 11392, 11033, 8243, 6754, 10306, 12088, 11221, 13579, 14461, 15803, 14734, 12951, 11695, 9728, 7734, 7788, 9984, 13135, 17467, 17241, 18106, 22785, 24162, 18356, 15601, 13005, 10712, 8843, 5583, 4598, 3746, 3685, 6565, 4327, 4692, 2043, 1236, 5704, 8848, 12801, 12701, 8786, 7087, 8195, 6164, 9189, 9241, 7309, 10617, 11159, 6656, 7246, 7875, 8309, 12092, 12794, 11495, 8664, 6447, 6588, 5466, 5723, 5600, 5088, 4578, 1885, -1065, 1347, 3360, 5616, 8931, 9925, 8626, 5927, 5170, 6336, 6712, 6782, 7376, 4869, 2674, 4644, 8596, 9127, 6675, 8860, 9865, 6280, 8265, 11331, 12693, 12726, 11486, 11505, 12860, 13102]
9421A3102K75j794R95J86j517Q69j686l429O81J458n44l90M35k250j338K018k462
9404D609j476j123M51K666J663k971k741q44O43l27J232L895J414L280J813j297
9388A0887k294j437Q98j934O40p51j786j457J084r90J853J459j050j380j147Q05
9372C400K853j87l565K519L152j299j392J611M71l016l551j399K370M81r04L136
9356D680Q57J60J10l531l370K837K737L522j39m499k49M076R29j436J513K692
9340A0889j910l668m940j164N551K933j126j350L121L389J99r8j175J349J312
9325A3312m468k020M374J18o56j136N65J461n0k465J349M468k58n644J073N17
9309A0540K04p44n50J327K354j127o104j297m98j032k181o40R26L575k270k342
$$ y = [13102, 13377, 11583, 12578, 12764, 11247, 12116, 10430, 7001, 7682, 9140, 8596, 8206, 8641, 6391, 5053, 7071, 4609, 3133, 2010, 2461, 5127, 6790, 3819, 1078, 234, 877, 550, 1782, 5677, 7091, 10371, 12184, 10887, 8593, 7156, 8054, 6120, 6760, 6009, 4223, 2766, 3850, 2860, 4713, 6172, 5122, 3742, 2595, 3400, 6253, 6066, 2501, 5020, 8172, 6873, 5481, 7092, 7563, 4547, 996, -403, 1967, 2448, 1544, 4680, 5537, 5697, 5807, 2276, -1094, 1743, 4480, 8002, 7863, 3364, 3115, 7191, 8120, 6684, 8197, 10889, 8979, 5311, 371, -793, 4758, 7691, 6565, 5215, 8336, 11725, 11924, 11826, 10651, 12000, 13312, 8844, 6824, 11198, 11316, 10660, 9524, 10089, 11550, 11500, 9035, 10384, 14852, 14594, 8950, 10023, 10540, 10744, 10000, 9450, 10777, 13131, 12004, 5900, 4603, 4105, 3073, 892, 252, 1178, 4753, 2483, 141]
9293A41l679K031N024J673j157k723m55M02K494K58n42M04j700j267L48K851K647
9276F750k214n90L933J743j681l97m82L48j506J737J409K885r60k653J879J387
9260A1588j276n24M01k158J392j43j771j610K700k62K184P16j015l183K261J128
9244A0428k397j987j735j617P30K217N94n52k134j924j331J906L205n85J903J001
9228G722L13j57n28n4k479K01J681o59K246K507l93q06L878m11Lp14N69j631j832
9209I456j297O46P90K692L153j48J350n61M47k293m85l381k910K70j443J504j61
9192G629K48l545l897K312J218M75P99J055k51Oj059K78j616J10j381k710k44
9175e73J438L363K066L88j809J657M145K266l282m268o30J2L084n38k741O93M78
$$ y = [141, -3538, -1507, 3517, 5190, 4033, 1310, 855, 1257, 3751, 4009, 3467, 3871, 2171, 904, 1252, 4103, 6750, 4536, 3946, 7879, 9622, 7941, 7544, 7062, 7410, 5904, 7641, 9050, 11935, 10975, 8322, 10201, 11588, 10312, 9788, 10189, 8031, 9423, 9280, 7509, 5899, 8599, 8337, 10521, 11237, 10222, 7039, 9300, 10428, 8031, 6044, 4309, 2692, 3422, 5639, 6233, 5681, 3547, 1623, 292, 2198, 5403, 4818, 6721, 7722, 8035, 7878, 7350, 7296, 4817, 5018, 6699, 6040, 8286, 10793, 10400, 9594, 13472, 13061, 13064, 12350, 12919, 11288, 9456, 8159, 8805, 9595, 12287, 15440, 15292, 16642, 16081, 16528, 14235, 13750, 10369, 7459, 7729, 6286, 7790, 7629, 7877, 4332, 435, 2747, 3965, 4440, 5239, 6294, 6043, 6049, 4990, 5268, 3652, 3762, 2381, -329, -573, 865, 4228, 6294, 6682, 4873, 6530, 10675, 12941, 9659, 5391, 4761, 4773, 7857, 7319, 4578, 5271, 5749]
9158E749M2J211O53N64P38L64k95J25n13j493K961K574J621M442N398N902J0485
9141D0528J7763J3042N937k17r648j6734j6478j0770p506p44k785k842O27L157
9127A3330q83k815k282P26r44p03R19L83J579J46q34p69p68o88k771J293n139
9110b20j450K642J894J600j463L21J764n82P90j963K042M510N42k989k207j594
9094C637R14P96J132j458k249j098k161P41L596J928j928m32N74l367J089J782
9078C496J35j892j354k023K193K899L51k364p91J759J852O48J431j451n83n46
9062C760n81j117O64L222k076j091J357j636k776m8L01n6J292q53j324K68J680
9045I86j154J641L083q46l803M867Q09n01j193k065l214k725L927K774k120l255
$$ y = [5749, 5791, 7002, 7655, 8219, 8957, 9321, 9026, 9151, 8638, 7145, 10106, 12680, 14301, 18743, 24141, 30043, 40528, 58291, 71333, 77270, 77053, 67405, 50671, 34193, 23423, 15917, 15173, 12388, 9546, 10173, 13330, 12447, 9632, 7350, 8076, 7132, 6429, 7348, 7731, 9310, 9456, 8622, 7853, 7085, 6397, 3626, 4919, -220, -1670, 972, 2866, 4466, 3003, 3324, 5088, 4506, 5296, 3333, 5375, 9885, 10427, 7438, 5231, 3637, 4551, 5347, 6479, 5021, 2772, 1674, -487, 254, 3850, 5778, 3850, 3418, 3992, 625, 1714, 3496, 3631, 1739, 385, -1638, 555, 3454, 3805, 1441, 650, 2409, 4261, 4909, 6340, 4889, 4306, 3760, 3179, 2062, 2726, 5948, 3872, 2781, 4138, 2502, -274, -322, -21, -77, 1215, 362, -962, -694, 986, -168, 1473, 4556, 3710, -93, 4774, 5583, 5082, 3889, 1824, -1390, -4115, -188, 2586, 466, -2789]
9029b789M055K213J150O25r82j473j85R86N62j509Q04P44m701n433K695L210M87
9012D59Q36M278j860j365q28j494j568n86K205J770L905R76j795l974J451J167
8996C577Q95j317R83j281N18K119J489k269k480j075k137M14J495K5J85K092j563
8979A670Q3J488J369m86p81k212J44K177K300l489q99J597Q09m647o08J880J147
8962A542M151k211k308L63M31p36j283J024k297K093M536l065p29J538j756j532
8946b39q91N160L879p47O87j217m47J768J379o4m7j743L886n14j143J40K047L71
8928A2265l395L50j62j172M6j817J313J094k750o33j263J009J368j890j818K700
8912E245K962l769n73K032o31k091K248R54p14j624m47R53J204L723J163l887
$$ y = [-2789, 1266, 3479, 4629, 5254, 4272, 2799, 2614, 3600, 4162, 2653, 3457, 4201, -500, -5933, -3238, -28, 459, 1295, 5573, 3713, 2348, 1520, 26, -1542, -2128, 77, 1847, 5752, 6728, 4933, 959, 2410, 3577, 4472, 3155, 4138, 2857, 3375, 5494, 6983, 4714, 2234, 1159, -978, -564, 931, 956, 1141, 3233, 1670, 1753, 3241, 4610, 4124, 3343, 1131, 1275, 3452, 5752, 2263, 1364, 2961, 3770, -877, -1485, 395, 1542, 5693, 3482, 1174, 1537, 1968, 1232, -51, 973, -1324, 769, 5305, 2240, 1511, 3049, 1293, -239, -1130, 4030, 7909, 7162, 7849, 6632, 6185, 7953, 9332, 9268, 9221, 7478, 11364, 10850, 9707, 9847, 11894, 12265, 8870, 9220, 9058, 7886, 7932, 6115, 7428, 8522, 5772, 5139, 3876, 4885, 6253, 4363, 2545, 5245, 8207, 4438, 3865, 5897, 5266, 3175, 5423, 6377, 5663, 4039, 3592, 4545, 5749, 9472, 10635, 6748]
8896F748l43L76L742q6l543P60J591k96k874J315J638j567l352j938O76M251K145
8879I243r53j239j272K508p86j384j115L3J890M130q61o934l468M063K103p95
8863E163M08J396Q63j541j673k513J874P84J139N15J877J367l017j157K344j428
8847F401N35K273J503l213k763N94M409j87l525k622o62L732L120L168J659O02
8831A5024j283k705J055N221K436K444M668N133J1100J0566m05q296q176n151
8817C1631n651l265n098m913k124J7M08M13j860m313j589j115K01J380L923Q78
8801H923j707o68O85K915r9p2O85j730j918J992L09K026J210j365r49J14K803
8784A3154J272L289J751K04k013k281J532j45o36L93k446m300j311J804J387j639
$$ y = [6748, 6405, 6781, 10523, 10437, 6894, 7654, 9245, 8949, 6075, 7390, 9028, 7461, 4109, 2171, 2847, 7098, 9243, 8290, 7051, 5779, 8287, 7501, 6117, 5002, 5035, 6925, 11055, 10194, 3260, -208, 3855, 5958, 5163, 5571, 6967, 7830, 6289, 4616, 2103, 3977, 4761, 5900, 6415, 8292, 9659, 6642, 5485, 7829, 6401, 6936, 9209, 10712, 7499, 4736, 5330, 9739, 9552, 6027, 3405, 2743, 6475, 9595, 12763, 14422, 15024, 13741, 11036, 12091, 17312, 19748, 22192, 26860, 31993, 43093, 53659, 53254, 44958, 36782, 31631, 25980, 22715, 17617, 12704, 10580, 10597, 11005, 11418, 9558, 5245, 3656, 2541, 2742, 4122, 8045, 8923, 7216, 6548, 7233, 10148, 10049, 9977, 10662, 8932, 7014, 9006, 9315, 11341, 12551, 11186, 10237, 10351, 13154, 14426, 17715, 19466, 19670, 17657, 15376, 16908, 16763, 16127, 16520, 14074, 9774, 8463, 10267, 11654, 10015]
8768A0015k873R56j15J421J953M0k846M25j513k120K226J131J080J138J565k435
8752A0048r66q32j022n10r46j874J092J406R45N10N407L169k187L590J916j81
8736A9565J11K286k8O08k22L80j050l40R49j580J049j971j333L59K641l19M191
8719B5296K946L162J691n59J124k653r91Q7j217J684o58l937l92k289k264m16
8703B0614J125J262r45l132j959j527k466k327J746J432L25N675k064J305p61
8688A8303K295l167k010M609M03n84k86K148K14K33L73n41k928l910K90K094n493
8671A2043j521K031K500N957M633m87O77k129m169l473P10M99J61P55k384k30
8655A5573r18K120J93L60M86k823J648k372R5J514L292L876M407j917k692k402
$$ y = [10015, 7142, 8098, 7983, 9404, 11357, 11397, 8551, 8976, 7463, 5343, 7569, 8700, 9780, 10918, 12483, 10048, 9082, 8250, 7228, 6718, 5772, 3898, 4990, 6396, 7341, 7851, 13258, 16427, 14240, 17830, 19746, 19565, 19676, 21962, 21934, 22542, 22320, 22700, 21650, 21310, 22259, 20679, 21728, 19757, 18424, 18783, 21424, 21105, 25296, 28242, 31404, 33095, 32536, 33660, 31007, 30016, 30103, 28886, 30570, 29912, 25975, 25583, 23294, 21030, 20614, 21739, 23001, 22056, 18924, 16965, 15438, 12972, 10645, 12391, 13823, 14148, 19823, 17759, 19064, 18303, 20598, 17431, 15421, 20030, 20433, 19849, 19563, 21711, 21925, 22158, 22531, 21990, 19062, 15152, 15442, 17536, 12043, 10522, 12553, 15053, 21010, 25643, 25156, 25833, 23704, 19535, 16062, 16772, 17271, 17432, 18187, 15803, 15573, 14655, 16775, 16968, 17328, 17814, 14991, 16639, 14267, 14362, 15876, 19168, 23044, 27451, 25534, 22842, 20440]
8639B0440J980rm109j467J79L32P69K987p81J115K561l60l854l984K787L268K799
8622B4653R59j241q13R39J453N19Q31k61P52K135N51K087L4j967M199Q206M677
8605D7713M156K343J958J383M262M491J29J227j007k213n69j512m963n438l929
8590D8031n140m017m392J010L493j476q262q813j092J220M915k237k811L24j660
8575A9093j971l149r28K041M61n46J337m62M5r1r5j897j999k044K21k38R28J594
8557A2300J34j77k769k175J492K496O60J12P14j035Q31l218j165l640l78P93Q87
8540E862J854k52j991m89K34J158M373K826m016k672j318J106J353N7M067M662
8524A6814K863N47k819l055R73o263k498r50K850L576m991j865j657R97K470J037
$$ y = [20440, 22420, 22411, 18302, 16835, 17014, 17346, 18115, 21102, 20321, 21436, 23997, 23637, 19783, 15799, 18586, 21854, 24653, 25612, 24371, 23558, 24497, 25950, 26469, 27300, 27039, 27791, 29926, 30477, 32564, 32598, 30631, 34830, 43036, 47713, 51869, 54212, 56170, 57553, 61815, 66306, 66435, 67662, 66655, 64442, 63873, 62361, 57398, 51960, 48031, 42891, 38874, 34482, 35492, 38985, 37509, 29247, 20434, 19342, 20562, 25477, 23240, 20429, 20753, 19093, 17122, 13973, 13045, 15086, 15547, 15001, 16338, 15876, 15921, 15830, 15735, 13838, 11839, 9795, 10016, 9778, 10706, 12300, 12434, 12257, 9488, 7313, 8805, 11301, 11961, 12073, 12787, 11752, 12583, 9365, 8200, 4560, 4182, 4975, 5862, 7716, 7464, 5473, 4984, 5218, 6376, 10749, 13575, 9559, 6887, 5569, 6675, 8028, 8085, 12152, 16814, 19677, 20224, 17405, 14350, 15323, 9060, 6562, 5612, 8462, 12038, 7047, 5182, 3525, 4522, 6992, 8029]
8508H029n166j844K720j726k768K742k256k444O184O177K727m93k813o0j426M24
8492H007m40l971K766k12N58k906j340L377p7K962K019J548Q517M761j253j342
8476B2974k790l366m160n697k900J073K866l00k61j274n8k929j954K529K354l464
8460B643k069M96L39P5j270L05R38L166J863L03j197j02p71j760L056l5Q50q15
8442F015m205m452L974L209L055j683l46M691O677j078n492k899j810l144j645
8427H67n46o92M287K345k572r52M99K42j561l627R7K663M834M482p81R00N44j954
8409I075K050N31j036k448M2l004j096r72n49J933L3m78p28L161J091p19l38j040
8391E508N15o10K642j779q11l94P57j167p65J240j26l386k5K879r7j964M128J515
$$ y = [8029, 2863, 1019, 3739, 2013, -755, 1987, -269, -2713, 3471, 9648, 12375, 11882, 9069, 9009, 7583, 8007, 7567, 3596, 6362, 6150, 6708, 3802, 2462, 5839, 5762, 8724, 10743, 12291, 20808, 25569, 24316, 22974, 20184, 16818, 12658, 6961, 4061, 5134, 8000, 7700, 7439, 6165, 6107, 3178, 1224, 3753, 6107, 2643, 574, 1070, 1409, 1484, 214, 519, 1457, 4623, 6486, 6789, 5592, 5490, 4719, 2959, 6015, 5980, 6830, 6015, 1810, -2642, 1332, 4541, 7596, 5913, 5567, 10258, 16935, 15857, 10365, 7466, 5656, 2512, 867, 321, -371, 3916, 6261, 3689, 2737, 3236, 3478, 1917, -1710, -1613, 1050, 5884, 10366, 9585, 10485, 11029, 9075, 11125, 11656, 10620, 8172, 8214, 5210, 4114, 3142, 2593, 4526, 4559, 4081, 3353, 6514, 7605, 6886, 6548, 5508, 6023, 5413, 8055, 6276, 5465, 5071, 5828, 4661, 3896, 5136, 5010, 1624, 1599, 4478, 4381, 2417, 6545, 8060]
8373H060j446K06k941J229L868J614j06J866M247L870K367j042m132k771k709
8358A2180k012k321k108N04j269K603J35J774J314j823j272R15J932q94p327l993
8342a662J069J674J810l83k465l015J640N041J919r95k227Q87L150j180k869j599
8326G95K56k292j834J233K158L619J888J576k481k242K016O05L89j880j88J260
8310D878R65j047k486k127J137J549K744j311q05n70j501J505K5p47k195l54L409
8293C069K16l54N84p29l032J47K070K305J977j818k341p74k051r01J244Q70J578
8276B060J285R34l24k266l67k501J101K295K335l229n300r5k748q91k98N174L103
8259B68m08K694K900R98j363o57N04l72j391J587P14k836l443k05j661J15J130
$$ y = [8060, 6614, 6820, 3879, 5108, 8976, 10590, 10484, 12350, 16597, 20467, 22834, 21792, 17660, 14889, 12180, 10168, 7847, 5739, 6243, 4974, 7577, 7712, 9486, 10800, 8977, 7705, 8620, 10552, 9658, 2331, -1662, -593, 1081, 2891, 2508, 43, -2972, -1332, 3709, 5628, 4633, 2406, 3293, 6443, 5263, 2394, 795, 1051, -1241, -3075, -1842, 316, 3935, 5823, 7399, 4918, 2676, 4692, 5297, 5686, 3806, 3618, 4878, 5843, 4796, 2310, 183, 1320, 2869, 5613, 4302, 3497, 2927, 1426, 2931, 2956, 2209, 14, -340, 3069, 3285, 2931, 3515, 2786, -246, -99, 1971, 4276, 6253, 4435, 2094, 1320, -731, -1632, -388, 482, 2060, 3345, 4279, 3955, 1689, 1322, -1179, -78, 2217, 4552, 1323, -3977, -4072, -6820, -7711, -8009, -2835, 268, -140, 2554, 5454, 6452, 5089, 4432, 4936, 4564, 3173, 4760, 5474, 2638, -805, -1010, -2671, -2556, -1426]
8242a426K075L753j042m118l144M946m454k423J858J859q57J155M66j151J136
8227a367K298k34N03L935m095J403L610P03n95k464q40k449m7O186K43j701o80
8210D409q39j558l665k574J047J577K965K410q01R07j043j94J356J215N148l05
8194A0055o312j691R44r32k68O22l055j948R19J954p6J587Q98j71m68J306o94
8177B670j732J713M89r36p16j053R77J424K073O12k335l53m242k417L859N40K65
8160H38j839p76K413r8n84K064J423J455j609j098r94L41l52l514j103K892L780
8143C239p79j673k416o32R6o99K627K636N50J24Q24J960k93k806j195J266L2L955
8125F816N16N39J275N94j069K965j103k437l06L899M828K384J93Q80n60O23k40
$$ y = [-1426, 649, 4402, 3360, -758, -3902, 1044, -3410, -5833, -3975, -2116, -2973, -1818, -1352, -2503, -1367, 931, 697, 1200, 5135, 1040, 2443, 6053, 6756, 6161, 3697, 2857, 408, 361, 6547, 6790, 5089, 4409, 3570, 2012, -1653, -4227, -3180, -1603, 1362, 3772, 2971, 3878, 2835, 2641, 3997, 5212, 10360, 10055, 3743, 2052, 2996, 2064, 1796, 2418, -637, -2585, -1666, 288, 212, 1799, 2697, 2526, 2058, 3364, 2670, 938, 2651, 3140, 2204, 1488, 435, 1412, 2836, 4909, 5521, 3186, 2833, -1409, -3826, 33, 573, 838, -1001, -1777, 636, 538, -46, 2018, 3441, 4896, 3287, 2189, 1195, 1536, 1184, -2330, -3433, -541, 3239, 2460, 787, -1629, -2261, -2165, -2864, -237, 2399, 2949, 3073, 3897, 5857, 5564, 2758, 1563, 2829, 2861, 6816, 7332, 7871, 9146, 9740, 8671, 11636, 10533, 8096, 7790, 11689, 16517, 18901, 19094, 19974, 19414, 20037, 19797]
8108A9797k556k481j602k349k622k84j135k291K9l040q42K303J418K71Q18Q6N40
8091F060k007r06k55L26J03j043o77J121J917J623J772K390k242K81p59J176K403
8074A1283k590Q20J171J226K469Q408Q491Q875L130k686Q63j245m763p315l375
8059B4762l835k739j573j484r50j990J410M51o08j125K33K317J579j801n547j106
8043G994J402N42O74K080k04p24j700k21K926P47K85j830J633K671K049L461M030
8026B5815k225p14K48J802n82L038L298K409O11j748m198j613l195j6J546K44
8010B4720Ql897k339J499l03j7J756R08l710l517K210L277r0k597n30l86K877
7993A9869J575j218J932m35O19k075m136k487j831K216j518j489j68K716J006
$$ y = [19797, 17241, 14760, 13158, 10809, 8187, 7903, 6768, 4477, 4506, 1466, 624, 2927, 4345, 4616, 5434, 5520, 6060, 4053, 3147, 2892, 3218, 3321, 2278, 1601, 2722, 4639, 6262, 8034, 10424, 8182, 8463, 7704, 8880, 11283, 8693, 9513, 10684, 11910, 14379, 22787, 31278, 40153, 43283, 40597, 41460, 40215, 35452, 28137, 24762, 20927, 18188, 16615, 15131, 14181, 12191, 13601, 14052, 13444, 12319, 12552, 14869, 16448, 14647, 9100, 7994, 9396, 9938, 10612, 12692, 12488, 11764, 10064, 9843, 12769, 13516, 13801, 11971, 13604, 16275, 18324, 21785, 25815, 23590, 22876, 23124, 24926, 24344, 27382, 30680, 33089, 33700, 31952, 27754, 26141, 22946, 22930, 24476, 24720, 24728, 20831, 18492, 19991, 19688, 19671, 21427, 22335, 18625, 15108, 17318, 20595, 20505, 17908, 17378, 16992, 19869, 21444, 20226, 22158, 21723, 22342, 20267, 16131, 13644, 11813, 14029, 12511, 11022, 10854, 13570, 14576]
7978A4576l512P04N603L73m525k18K158K38J758K762J245j570k554J662j141k06
7962A7353M581O70K135J629j510L68M0m178l64K057K42n464j171J001L239K716
7946B3344j796k200m757k00j139J885l484o6k05M58O78l834j179j190J357K257
7930I929m30j057L88j725M87K548N78R22J742l219k076J821j917k541J573L447
7914A0470n70j347j405M678j441l120M636K975j323n805N43j704J387N92k84k629
7898E653k132K539N17q40j345j602k04j261k611M262M364N6j508j496p39N48J335
7881E536q93K018m345k921m64L57N238M909j284P79l114k553K412K043M5o170
7865A593m570j164k40L067L511m26k63K969k335O59Q54l195j950L667J60r26j245
$$ y = [14576, 11064, 11768, 17371, 17744, 13219, 13001, 15159, 15397, 17155, 19917, 21162, 19592, 17038, 18700, 17559, 17353, 21934, 22604, 24739, 26368, 24858, 25226, 25266, 21088, 20724, 22781, 23023, 17559, 16388, 17389, 20628, 23344, 21548, 19348, 14591, 14391, 13252, 15137, 11653, 11587, 11382, 11840, 12518, 8684, 7505, 6315, 7672, 9929, 9499, 8442, 8830, 7105, 7592, 10140, 10718, 11640, 13382, 10163, 8087, 9908, 7991, 5450, 7023, 10470, 9900, 8553, 7148, 11826, 10385, 7265, 11901, 14876, 13553, 7748, 8291, 6587, 7974, 8566, 8282, 5653, 3521, 6060, 6577, 5737, 4392, 2790, 2586, 1325, -1286, 2976, 7340, 7396, 5888, 4392, 3653, 4201, 5536, 4643, 6661, 2316, -605, -1069, -712, 4526, 9435, 8151, 8930, 5816, 3263, 5675, 7718, 7763, 1593, -2977, -4141, -4381, -1314, 2197, 1771, 1508, 4477, 2142, 2801, 3655, 460, -1490, 2177, 2337, 1411, 166]
7848A66k774J362J04J180r63J551j95J735M549J213k456J689L288l751L66N16
7832G580K98k149k934l233j977j66P74P24l61M21K52k481L770J323n449n121N31
7815h198L276J803J726L661o1J010m67l688k389j622j56J624o48n41p11J437K105
7798a839J997k032K079N66n82L009J387K100j98k662m034p59K067J860P63l115
7782F07k956J053r96L35N39J623J182j828m650L470J383j091j817J609K790M041
7766E294j37k771k992k805K085K612k913m310L17l29K948l92j635M274J181J553
7750A980K89j703M41J679j81n067l771P41On28J850l22K254J38P97o21J413o71
7732a276O82P97J661J983j06o183J22K427J39m393L507L458R5J307j476j341m033
$$ y = [166, -2608, -1246, -1142, 38, -925, 626, 431, 2166, 6715, 7928, 5472, 7161, 10449, 6698, 7064, 7580, 7878, 5729, 2795, -438, -2415, -2581, -1807, -1083, -1444, -1023, -771, -3252, 518, 1841, -3608, -8729, -8198, -4922, -3119, -1393, 2268, 2207, 3217, 2750, -938, -3327, -4949, -5105, -3481, -4129, -4670, -5381, -3944, -1839, 158, -1874, 205, 771, 189, 3198, 4585, 6685, 6487, 3825, -209, -968, 1099, 2959, 3722, 607, -2349, -1296, -2292, -1957, -1418, 205, 1387, -441, -5091, -1621, -238, -1329, -3146, -1537, 1253, 5294, 5157, 2386, -606, -3411, -1326, 1286, -1627, -5937, -5620, -5949, -3001, -3393, -5028, -754, 427, 1980, 2269, 566, 1007, 2686, 2505, -2562, -6333, -5592, -5586, -6114, -4264, -4586, -2332, -2194, -1397, -2018, -605, -1276, -594, 203, 1864, 3847, 3741, -2442, -2320, 107, 246, -4147, -640, 2818, 2913, 4220, 2744, 1403, -2630]
7715b630j350R81M96L26K70p28J085J109j444k323K548K177P83k319M35p95K067
7698F88j453k738r63K299M410j3m765M37j011J066m68k906j767j604L060J760
7682c968M110l98j377k731K414J583m14J65J76J631n34K58k32K525K509j896m249
7665d28l182n92k538r11J548j938N16M329q16J174j225J282j815m03p21J65p38
7648f293j724R93L008K411k026J526J002O96o68J059J828L496J266k809j857m64
7632A444m259j346m41l65J187o85j334l912l86L019O030K242K322n77k976N34
7616D97p69J699J943l935l406o64K167J146M896J199j495m23K37j840k270j127
7600b145J653k689j556o52J608J801j333L076k624n169K571M425j333J540j66
$$ y = [-2630, -3980, -2999, -2503, -2177, -1907, -2635, -1550, -441, -1885, -4208, -1660, 517, 1300, -1019, -584, -1379, 688, -765, -3503, -4466, -2167, 2243, 2230, -2535, -2098, -3109, -2043, -2511, -5417, -7184, -8788, -5728, -3968, 142, -256, -1633, -4364, -1950, -367, -781, -616, -440, 1191, 657, 915, 683, 3208, 5717, 3821, -428, -3610, -4202, -6740, -7651, -6103, -8041, -7525, -3196, -4012, -2838, -4063, -2781, -4596, -4999, -5720, -5555, -6293, -8017, -7024, -4016, -1605, -3631, -2105, -1103, -407, -1075, -16, 1812, 5308, 6574, 3765, 1908, 1444, -2815, -4161, -4602, -4967, -3780, -4465, -5799, -9711, -10097, -7078, -1048, 1194, 3516, 2939, -37, 497, -272, 1427, 3370, -565, -3971, -4635, -2468, -1322, 3574, 4773, 3278, 2855, 3092, 1252, -1018, -2145, -492, -3181, -4737, -5389, -3781, -1980, -3313, -237, -2861, -8030, -5459, -1034, -2367, -827, -993]
7585i93k592k5J236N435j014l639r56r81j258K235J980j472k584n68J834J00L7
7568c225m49J764J238J816J122q71j162r45L74k307N94K657m11k245J022K062
7552A034Q37J67M85j779l362j005K070M17j438k12L366J2l485q84R51m48k137
7535e411J354J909J206J0K717K127k598l549J712J654j299l032k272n44L314L931
7519A229K072j811j722j409N183n20J460o95j707n28k180k40k370k959J753J084
7503c360J292j911M319J574K91p57p24p72j620M57j960j233o69r06J082J597N98
7486b702j814K453K099j670n3k28j000J784K72l885K657Q85j265K421K192k500
7470c54j320j309k111J791L028K079k346q45j944j673J531N28k8M470M87K160
$$ y = [-993, -3585, -3610, -2374, 3061, 2047, -1592, -2548, -3529, -4787, -2552, -572, -2044, -4628, -5196, -3362, -3262, -3225, -3674, -1910, -672, 1144, 2266, 1395, 233, -712, -338, -2645, -2051, 606, 195, -2050, -1028, 1034, 1871, 2038, 2523, 744, -2618, -3623, -1553, -1136, -2574, -2786, 580, 592, -2893, -3777, -2826, -3274, -5411, -4057, -2148, -942, -932, 1785, 3912, 1314, -2235, -523, 1131, -168, -3200, -5472, -6016, -2702, 1229, 3301, 1490, -232, -1641, 3542, 3022, 4482, 3787, 2080, 1552, -628, -868, -3238, -6197, -4444, -3360, -2068, -3979, 340, 1914, 2205, 1448, 724, -48, -1668, -1211, -3171, -4404, -5073, -5979, -4897, -3300, -2702, -4516, -2063, 36, -1634, -1687, -1915, -2915, -1131, -859, -4744, -2087, -1202, -2467, -46, 2146, -354, -1674, -2983, -5094, -3303, -275, 1804, -542, -1387, -3331, -5004, -3473, -2945, -2973, 1497, 1984, 4144]
7454D144J703j843k688k388m00J02J877L108r38k460L81P49j946J217k907o57
7438b946Q07O86q03P75L244j757j477J760j321j863k284n46P52N45K656L483k962
7421a251j216K25L97l494r51l82j993K402P08K747K85m22J170L463j5j028j519
7404h74k413j443R28J078n64k710j40M515L98n400l424K435J739l87J904J934
7388b424J035J445j226l290k639J625K664J582J690L10j627j496r57m533K929
7373d912L727J517l57k474j714J63m37m49M37m66L90K703qK7l568j280K200j920
7355f421j970N546O359L28N28k350m620k883M85L521k258J790K723P48p5J060
7339B511n22j013k07Q10j701j399l036j640P73r47L70K129L994j20j696j500j658
$$ y = [4144, 5847, 4004, 1316, -1072, -1472, -1370, 507, 3615, 2677, 217, 598, 1347, -599, 618, -2289, -2946, -2139, -1453, -2256, -1481, 1763, 6, -1471, 289, -1032, -2895, -5179, -5725, -4973, -4428, -1772, 1711, -1251, -2467, -2242, -1845, -5339, -6290, -6672, -8665, -6263, -5555, -2808, -2523, -2945, -1775, 1688, 1673, 645, -874, -3287, -4730, -3802, -2724, -3288, -5998, -6138, -1623, -1225, -6625, -10049, -7614, -5875, -6262, -4358, -2424, -1389, 56, -1170, -4460, -7099, -5474, -2810, -1228, 462, 772, -855, -2351, -3308, -7841, -4912, -1185, 332, -25, -2499, -4213, -4050, -4487, -4936, -4499, -4965, -4575, -1872, -1880, -1853, -5421, -6701, -4501, -6421, -8391, -2845, 3514, 3842, 4370, 2020, -2600, -5483, -4998, -1477, -3735, -1945, 778, 1526, 1451, 2511, 1989, 976, 769, 1579, -122, -1521, -4557, -6197, -5424, -6371, -6001, -3872, 122, 2, -1694, -3194, -4852]
7322d852Q31J501l132K32K441J597k24R76k021k638O53J724L94m03J765m56j354
7305b966l789m55J143k18K258R46K472L442q37q73P94m39l958R30N364K63k536
7288A541j195J584O4m505J909K693M77l018m566l19J205K824L074j308j87k125
7272a852l996k370j35K02K649L253k20r57K03j184L341j605k263L91L582L42l179
7255c798k044K068K959j825J214K866m160P6j055p03M46M60J074J380j373r05
7239c320M79m6j725J090p45r7j381J52J965L216K280j909j032k661j873Q15k16
7222e008O01j9L098Q32o09m98J939j814k905o53j419m76j553k981K428K027J849
7205e161K780K58J434m0L89j866l42L98L96J114J972m28k783j844L481K088o97
$$ y = [-4852, -4021, -2520, -5652, -5420, -2979, -1382, -1606, -630, -2651, -5289, -4636, -2912, -2518, -2921, -1156, -1612, -2966, -6755, -7210, -6067, -6285, -4027, -3081, -609, 2833, 1996, 1123, 1917, 1478, -2480, -1550, 3814, 4077, 1541, 346, 1930, 1994, -2511, -602, 2091, 2568, -450, -5016, -5335, -4130, -1306, 1768, 460, 273, -1852, -5848, -8218, -8353, -8151, -5502, -2249, -2469, -3426, -3223, -4407, -1066, -2671, -4934, -4543, -961, -619, -3798, -5842, -3774, -815, -2640, -1426, 1440, -2720, -2644, -3699, -4402, -3956, -3496, -2422, -1042, -2415, -3320, -2841, -2887, -4612, -3522, -4267, -4364, -5745, -5593, -3628, -412, 1868, -41, -1073, -3734, -5607, -4792, -5008, -4407, -4426, -1328, -496, -1105, -1603, 336, -1478, -4383, -5036, -6455, -6931, -8484, -11465, -9037, -7010, -5161, -2381, -2123, -689, -729, -340, -2206, -2548, -2150, -1754, -640, 1332, 904, -1879, -3723, -242, 1846, 1149]
7188A149l177l489K94L422J198K803k574l077j548R0k203j48K68n00k39L852J403
7171b476J346q0P96r70j991j938l346K337L484J296J457N29o45j114k701P52q91
7154d155o93L641J929k321k491J557Q66J775N54j580R50l665j529K273N560n427
7138b756k291j806K377J367K082K294K89m191j698L13K364R12l92j542J007J434
7122b37k4k529l526N38K805J828m91Q92L66m74k204J398M595R17m35m076l928
7105d585J392J315r60J452K5P5J073j564j045K729J464O16l839L26K382j958l806
7088d908l378K417p07j232K983P08o99J868j389m055K143J066K188J771q68j270
7072c362J086N15O45R25l043l52K110J689p78o8j113k958k094p75J840J754N29
$$ y = [1149, -2028, -5517, -5223, -1801, -603, 2200, -374, -3451, -4999, -4909, -7112, -7260, -6992, -7492, -7731, -3879, -2476, -1130, -1210, -414, -1384, -3375, -5313, -8659, -6322, -2838, -1542, -85, 444, -201, -1315, -4016, -3264, -4155, -4848, -1207, 722, -1599, -4090, -2533, -1667, 108, 662, -918, 32, -3633, -5162, -2889, 2671, -2756, -5047, -6853, -4476, -3109, -1027, 1267, 1556, -2635, -4333, -4020, -1656, -744, -1136, -2678, -1671, -237, -261, -2790, -6316, -5778, -2973, -1145, -1636, -744, -378, -852, -3056, -1658, 2937, 3854, 3419, -657, -4585, -3193, -1878, -2838, -1386, -1361, -1286, -213, -1777, -2822, -93, 1371, 1987, -1852, -1526, 856, -1102, -4908, -8286, -5869, -6576, -7808, -4825, -4117, -4816, -2948, -4337, -8392, -6249, -5183, -2995, -1224, -2092, -3362, -2276, -1761, -1116, -191, -3234, -3586, -1476, 213, -565, -633, -1746, -4704, -6798, -7573, -5733, -3979, -3450]
7055c450m581q22J176K271J347M14K909J610N04j669k081m36J26m381l67J275
7039f155j83J275L105k494R80k330O78J041K738N38j716J843J916Q7j755J702
7023A270K07K912q55l19l875K80m88J00K29k686j137O327K694j655N29J088n004
7006c83l340j778Q88J677r0K100j828k727l58N736J425k936k84q71o55M1M151
6989G68K989k457J530m49J153j870k165M76K17J02j1k788j739j721j51k52K029
6972d339M33o43N23K56J328J435P50j645l53k873M42K426K011k452N94J20j482
6955c469p8J590M05j771O16Q7K215q8r63p02R38j028R49J97p66K70J27j949K805
6936f15r68j25m05O5j561l744J94K02J539k38j384J792J914k196m89M130k85k11
$$ y = [-3450, -8031, -8853, -7677, -5406, -4059, -3645, -736, 874, 1378, -291, -2372, -2808, -2682, -7063, -7430, -6155, -6338, -5063, -1958, -4452, -3472, -5802, -5124, -4083, -1345, -807, -2523, -680, 1236, 1323, -432, 1270, 1477, 4389, 3534, 3215, -660, -380, -868, -768, -539, -3225, -4362, 1965, 4659, 3004, 3533, 4621, -383, -3723, -5501, -4613, -2936, -3026, -926, -2754, -5481, -5839, -103, 1322, -1614, -1898, -2769, -3424, -3383, 768, 3757, 1300, 2830, 2381, 3534, 1664, -501, -25, 192, 294, 283, -2505, -4244, -5965, -6116, -6368, -4339, -3906, -4549, -4026, -3770, -2442, -1007, -257, -1902, -2255, -5128, -4686, -2260, -249, -2701, -2107, -1987, -3469, -3547, -1957, -1552, -3323, -2707, -2620, -405, -493, -1456, -2158, -1220, -2248, -1299, -1102, -1868, -1598, -1471, -3420, -615, -1583, -1708, -2113, -2048, -3609, -7353, -7159, -6957, -5418, -5656, -7040, -5248, -3334, -5530, -6019, -1889, -2174, -2385]
6918b385J530l004l893O00J908N761l398m102j812J939J421j718k455K850J851
6903d907J200k959N73L57j99m38J894m26k412j204M144L345K531j711k490k264
6887d966J592J865M63k408q64L412K639J62O58l267j839M77J743K006L166k216
6871B623r59J9j382J910K061J97j789j25l84K664k06k219k887m46P39K605R90
6854C411q68k017K344J148l031R3k461k95P66j652J770J476l136j014J062J009
6838a395J967k002j067J45j434J322j04J45J635j126r18L90j944n98m63M248K507
6821A308k044o26p72J418J379k496k797L455j37q68M27k481o29M507N7j016K76
6804a039L54R97k88m67k518N42k56J345J835K026J14o47l63P79L156k041l253
$$ y = [-2385, -855, -3859, -7752, -7152, -5244, 517, -2881, -6983, -8795, -6856, -5435, -7153, -9608, -6758, -4907, -3707, -6666, -6093, -5736, -5935, -6373, -4479, -4905, -7317, -8521, -4377, -1032, 1499, -212, -2702, -4966, -3374, -1509, -1046, -3454, -4318, -906, 1733, 1895, 2553, -714, -2553, -2076, -333, 1673, 4839, 2623, 1664, 1683, 301, 2211, 4272, 4469, 2680, 2555, 2171, 4835, 4629, 2410, -477, -923, -184, 2421, 3411, 2543, 526, 2870, 4018, 987, 1080, -1381, -1676, -910, -2562, -792, 684, -2452, -3466, -2404, -1395, 572, -1430, -2497, -2352, -3786, -2464, -2568, -2423, -788, -1914, -2832, -2442, -4386, -4984, -5447, -1199, 1308, -736, -1362, -2134, -716, 663, -1833, -4630, -1175, -1312, -2180, -1753, -4234, -4863, -356, -299, -1315, -1039, -685, 312, 24, -443, -2961, -2419, -2675, -1330, 505, 2531, 2645, 1998, 1635, 2414, 5570, 3529, 276]
6787B76k605O35K643L393nj186n48J585j946R84L450L020M900p10n255q04M845
6770A2672J116L731Q58K699P361L501k413J593N087R259O938N253N356L252k55
6755F6008L580K235P97N54Q706R159P482J2383K9713M4226L6044J8187n485l3196
6741B00393m3293l8003l0296k0387j3212j4942j1578p611o145m554P82Q51j209
6728A0796l85k529k455k795L76M632J538k147m031k228l83m18R04J048l31J066
6712B658N08l242N1M464M30M75j393l446j918J249R27J60k745M826J39l250M61
6695C54J328q28P83n44R38l441J691N456K96j832l283M74J905Q65j500J541j132
6678C071k274k812k820K529O66J089J069l271k74L181M1k529O76L464j189j96
$$ y = [276, -2329, -1694, 949, 4342, 4337, 3151, 2603, 4188, 2242, 3226, 6676, 9696, 14596, 13886, 8631, 7827, 12672, 13788, 17519, 18377, 21076, 28437, 31938, 29525, 31118, 36205, 45464, 52402, 57655, 63011, 66263, 66008, 69588, 71823, 72620, 73174, 81880, 91039, 98521, 110904, 140617, 184843, 220887, 239074, 233589, 200393, 157100, 119097, 88801, 68414, 55202, 40260, 28682, 21071, 14926, 10372, 11154, 12005, 10796, 10411, 7882, 5427, 2632, 3008, 7640, 9178, 7031, 3000, 772, 389, -29, 875, 1923, 1592, 2658, 3166, -76, -25, 4439, 4869, 5344, 3951, 505, -1413, -164, 763, 923, -1822, 3004, 3143, -107, 354, 1682, 854, 1637, 1093, 2031, -1410, 281, 5737, 6033, 4201, 918, 1392, 3297, 4162, 2662, 4203, 3071, 797, -2015, -4835, -2306, -1640, -551, 518, -2753, -3027, 154, 195, -2334, -1658, 1806, 617, 421]
6662D21M75J258m9k309q16p01P36J087j662J320O68j865j489j829L99J291L82
6645b683K932j127k644K44k446k363j7K756M274J639K57k423j088p41j942k812
6629h184L771K791j094k568J765L14J613Q22r11k099j199M574J140o90J688j21
6613A612k221r84r68q96M715K825k077n26j923j328j144J009L024K146j352N39
6597B451K80l545j882K758L389q65k643K63J780M225j453n563l92m274M311L94
6581g66j416o99r41J92j772L026l4j68K837j715j205K987o32j633j379J97j150
6564d271r31J386M93J840m5P19m557j845J091J596j947R07m51j726K112K610o47
6547c666q25m68r04j148j244q0N10p46j071R1N298P61l52L127J866K569l32l423
$$ y = [421, 896, 2154, 2105, -204, -1020, -1721, -985, 102, -1560, -240, 428, -1437, -2926, -4755, -4356, -3065, -2683, 249, -878, -3522, -3278, -5724, -8087, -8104, -5348, -1074, 565, 822, -1601, -2689, -3430, -5372, -8184, -4413, -1622, -2716, -5284, -3519, -3205, -1592, -770, -1681, -3780, -4979, -405, 735, 45, 1733, 1612, -609, -1593, -2561, -3457, 1258, 4083, 2006, 1480, -443, -1771, -2915, -1906, 1118, 3264, 1912, 2451, 2731, -814, -2696, 62, 3451, 2586, -57, 206, 1986, 6211, 4758, -805, -1197, -5471, -1160, -766, -2182, -2881, -3822, -3630, -5402, -2376, -2410, -2578, 259, -1456, -2661, 326, -306, -1939, -3318, -3121, -4271, -5202, -3816, -3323, -1483, -1528, -809, -5366, -7211, -6120, -4524, -6471, -5564, -6015, -7741, -5629, -3019, -3666, -4491, -4959, -5863, -7011, -8255, -8335, -7825, -8571, -9642, -9551, -4253, -3492, -3844, -717, 1149, 3718, 3386, -37]
6529c7n463k568O7J558R24L848j438j564j101K750K184P80J444l351o34K573j984
6512b012m093K487j407O56j880J44J508J184R65j448l657K7J182p53Q69K017Q86
6495c325J650j223j256J621M4j41j537N3M974j05l524M70J034J194n3m431J109
6478c446K200K407L936J104m225j960o44J835p26J044n032l343J707n05m01J796
6462d253K792J118j969k612J692K258K705J613J280j086l526m002K73K464j71
6447a424J69J120K614N87K27l618j990R92J829j213n58L237j930M87K044p69n
6430A799j177j473q00k179Q0K301L814p55j231j215n78Q81L50j584k173n74M442
6413g2M380K441j960j440n93l268l827R99l69L53K337j921k170j845L042K162
$$ y = [-37, -5500, -8068, -8001, -6443, -5519, -1671, -3109, -4673, -5774, -3024, -840, -60, 1384, -1967, -2601, -28, -2012, -6105, -3618, -5025, -4369, -6249, -6105, -4597, -3413, -2448, -3896, -7553, -7526, -6344, -7097, -6228, -4211, -3325, -1675, -2898, -4154, -2533, -2489, -2630, -4167, -4114, 860, 755, -2769, -2299, -1265, -71, -124, -4555, -3446, -1246, 1161, 5097, 6201, 1976, 16, -628, 1207, 481, 1525, -3507, -6850, -5143, -5648, -6049, -4253, -1461, -343, -2312, -4924, -3232, -974, 1731, 3344, 4624, 3538, 12, -3990, -3717, -1253, -1424, -1255, -135, 2479, 3066, 3293, -325, -2315, -1323, 506, -707, -1265, 1972, 42, 529, 2573, 1804, 1799, 622, -851, -1651, -3830, -3750, -1449, 2365, 1610, 379, -836, -1414, -533, -183, -1767, -3940, -4514, -72, 4308, 6749, 4789, 3349, 2756, -512, -4339, -3340, -3709, -3356, -1019, -2940, -5110, -6955, -3913, -1751]
6397a751j124J91j33J67J262l03j665m77K407L416j503p23j574j591L80k25j695
6380d941K269K645r0j429J881K577J165m751k884m10j404P03j398N450K120r13
6364E90J354k581r09j573N18M29Q4k196j07J845l416j195P40M198j605K065J393
6347c66j939j002J825M57L10l737k398J403p6K86O39K710K194k120K177O96k094
6330a035k063j022N92O47K72N02l84J915J992n181j873L360J092m88L02j473K266
6313e79j70j689L390J218J571j826p50N89J223J393m569k162J159k231J236q21
6297c018r89j614r11k2k697L789J151J070j207J807k727q62K066K206J953r83
6281i88m19n09J082J811r90l790k801q14L131L030M78j21J254j945k623J506J839
$$ y = [-1751, -2875, -2684, -2817, -2650, -1388, -1691, -3356, -3833, -1426, 1990, 487, -236, -1810, -3401, -3021, -3246, -4941, -2672, -27, -117, -1546, 335, 2912, 4077, -674, -3558, -3968, -5372, -4669, -6067, -617, 1503, 590, 1944, -637, -1546, -3119, -2601, -2172, -2088, -4284, -4391, -2546, -5962, -7157, -6417, -2219, -3824, -1759, -366, -2305, -3307, -1482, -1025, -715, -4452, -6850, -5447, -5523, -5237, -4598, -1888, 306, -1814, 363, 1059, -1035, -3098, -4120, -3528, -2881, -2609, -2107, -2491, -576, 1416, -3765, -5638, -2278, -1186, -1674, -1372, -2845, -579, -749, -2438, 952, 2170, 3741, 1915, 1165, 1754, 2977, 4370, -199, -2361, -1202, -3433, -2197, -3018, -4007, -5621, -6532, -6554, -9251, -5462, -4311, -3241, -4448, -2641, -5368, -6230, -4164, -1958, -5, -988, -1407, -1916, -834, 977, -13, -3803, -6604, -7418, -4287, -1257, -779, -900, 354, -1591, -4214, -2708, -869]
6264h69m02J268J844j337j400p2L23l319j156J673j43k56K124J438j925n15K519
6247b05R16R19l494l02M01K24j441o31l45p43Q1J85P03n34m31R04n62K226J814
6228c15m670o56K308m94J368j066K149L205k96q68j552l500k26J122o74K610M190
6211B635O62k766J743r81m9j185j143m812j716J643J305K762P35P44l01q37O67
6194h94j48p05K45j038Q47K535K971k490k408k23J916q13k709M29J276L381K047
6177D219m556j950J6j770K463j210j832j562j6j16K224j97K080k23k632K134K071
6160h57M83J814J716m385m909L38K700N41j751M91J40K591j221k187l129j3K125
6143e513k18J522M204m36P7j49j437k949J480p7M155k065l803K290L213n81j386
$$ y = [-869, -1271, -3, 1841, 504, -896, -968, -645, -3964, -5120, -3447, -3590, -3846, -1722, -284, -2209, -2724, -205, 711, 1630, -1864, -2166, -1765, -1541, -2982, -3613, -3958, -4701, -4620, -4435, -3732, -4266, -4697, -3793, -4355, -2129, -315, -4985, -5641, -3333, -3827, -2459, -3525, -1376, 1829, 1533, 665, -887, -4387, -4613, -3491, -4165, -1555, 2635, 3297, 531, 2274, 1293, 1244, 59, -1084, -5896, -7612, -5969, -4664, -1902, -1167, -423, -724, -1561, -894, -1042, -1747, -1502, -2540, -1693, 842, 3813, 1323, -1085, -1308, 608, -205, -2914, -2485, -1209, 2172, 4219, -337, -2287, -2271, -4041, -1578, -2788, -4620, -6182, -6198, -6314, -4090, -4287, -2207, -2430, -5062, -2928, -857, -374, 1440, 3156, -1229, -6138, -5800, -3100, -2559, -4310, -3819, -3679, -1088, -2309, -4496, -7625, -7638, -5513, -5731, -4209, -5, -441, -364, -513, -1950, -4899, -3419, -3496, 659, -1406, -5209, -2919, 294, -287, -1673]
6126a673J33L88J512J69j078j605J090J17K62m2n96J768L91q74m95j480j353P13
6108b653L265L05k066o13m49L420p50k014P81J087p02j564n48M29L72J738O72
6091G10j156k127K70j004J041O58j787J902N289q52j379O85J658l55k943K8J160
6074A798J007K042p26k921r76r32m04k08r79L389K596o79j261n298q6J420l270
6057e488J186J958J938M69K81j158n73O72j313k181M02O90j248M82J73m329k18
6040h257K262J718J868N18m16L537L432K06L37K543j185j030k317k046j989mj574
6023b397J917L501j31k262l543k44r6j910K432L062L137p45j079l381j635m99
6007c873p4L666l08R27Q2j777L26j949N48K044k868j436L072J696l38j993m220
$$ y = [-1673, -1540, -1152, 360, 529, -549, -2154, -1064, -947, -685, -727, -1323, 445, 836, -38, -533, -2013, -3366, -2653, 612, 917, -1149, -1762, -2211, 1209, 459, -1555, -774, 313, -389, -1953, -2501, -2072, -1700, 38, 710, -446, -2573, -2303, -3307, -2266, -1608, -3395, -1493, 3796, 2944, 1565, 2250, 3908, 3553, 610, 638, 1798, 2805, 4847, 4121, 1200, 224, -708, -1112, -1320, -2299, 1090, 3686, 3007, 1746, -3552, -3638, -2218, -5488, -4302, -2344, -406, 63, 344, -814, -1387, -715, -2028, -4209, -3807, -3117, -4365, -3883, -3710, -8039, -8257, -5995, -4277, -2409, -1891, -2307, 1230, 4662, 4868, 5205, 7748, 6563, 5533, 3216, 1170, -819, -823, -2397, -480, 3021, 2890, 628, -2915, -3159, -3255, -5165, -2733, 329, 3466, 2721, 1642, -1739, -3374, -3873, -3947, -281, -589, 338, 420, -1357, -1031, -2980, -2432, -388, -3256, -4692, -1620, 76, -262, -2255, -6475]
5990f475K04J327J928K504K430j376l546M24K233L801K395J251k950l220N15j376
5974F9j705L132j353L61q6N63k570m073M070K349l924k971J2R76k402L046M461
5957d5J803P29j392n327j761M686J339k568J750M32n18N3j005J511M26j167j843
5940b897N63K521L498J120j540m535j371j047j982R69J193J499l411k844K828
5925e436L719p08j865J092l5K165P56j514o72M01J944j74K413j503l902L080n97
5908h36j580k065k15L534j28n27J163K39P09j932K209j51r80j348J917j140j478
5891b609j377n12J726J842m14j649j954J942l13j250J164K109J78k433M129l67
5875B12K429j53j460k336l370k209l71m19K114K126L741J947j583q34j42j403
$$ y = [-6475, -6271, -4944, -3016, -512, 1918, 542, -3004, -2580, -347, 3454, 5849, 7100, 4150, 930, 1445, 69, -1636, 1496, 143, 504, 418, 981, -1589, -5662, -1592, 757, -3167, -6138, -6126, -5150, -7552, -4506, -45, 1758, 2487, 1095, -4232, -5993, -1307, 32, -2536, -786, -354, -872, -819, -1824, -313, 113, -1054, -2897, -2334, 187, 3685, 4805, 3265, -1270, -2641, -3688, -5670, -4701, -3508, -2009, -5420, -8264, -5436, -1717, -2425, -4290, -3198, -3233, -1068, -312, -1826, -2498, -2097, -153, -327, 2086, 583, -3319, -239, -836, -2416, -4481, -4696, -1162, -1290, -1817, -654, -415, 294, -1638, 571, 420, -560, -1908, 9, -1131, -2609, -3986, -4498, -2772, -930, -1344, -2993, -4947, -3005, -3318, -4568, -3404, -1295, -1117, -3550, 579, 212, 2641, 2488, 1028, -1308, -4678, -6887, -7258, -7677, -5563, -3437, 304, 2251, 668, -166, -308, -1711]
5859a711l100o28K210K391j739j895M344K183k504j6O64j231P36J738J059L92
5843B893k377k509R0p51j015L620n86l51j126j532P44k44L255O05j699j502l97
5826b882m439j518j852j480J532J864K309J294k213O92L389K096j96J200J704
5811A500l011k551K449J722k694l853J946p20J354J757M30j81l274o243M399M835
5795b135J597l73l687j497O007Q73Q80J095J812O47k255J547M69n044l371K733
5779g02R68r38J386J053Kn42R03k30l65M76j582j958j799J245M26j683J866R20
5761e54k881M95J54k00K196n65l11k07J326k752p39K29k10N52j817J765J494L051
5743A026k848k810N60n15K414J72j435k979o20N446K356R15j144k364J164k148
$$ y = [-1711, -4811, -5439, -3229, -838, -2577, -4472, -128, 2055, -449, -465, 199, -1032, -296, 1442, 2501, 2893, 516, -1993, -1903, -2654, -3669, -49, -635, -986, -2112, -3644, -2900, -3144, 111, 716, -983, -2485, -2882, -7321, -8839, -10691, -12171, -10639, -8775, -6466, -5172, -7385, -6693, -3304, -1208, -1404, -204, 1500, -1511, -4062, -1613, 109, -2585, -6438, -4492, -5212, -3858, -2101, -1671, -1852, -5126, -11369, -6970, -2135, -538, -911, -4598, -6095, -88, 785, 1665, 2760, 4572, 5219, 2964, 4511, 4980, -64, -3435, -702, 266, -672, 714, 1767, 1769, 1227, 2130, 1900, 1535, 2011, 429, -1529, -3328, -2083, -1657, -3340, -1474, -554, -3435, -2940, -2786, -2986, -790, -1355, -1666, -1873, -547, -3299, -4038, -3809, -4019, -3467, -5284, -3519, -2025, 1026, -1822, -4632, -4072, -4587, -2173, -2001, -3436, -6415, -7035, -1589, 767, 1682, 538, -1826, -662, -2810]
5727b810n04K31K127Q56k123j866m29Q54K960Q05J243l122j669J14J089K989k248
5710a503l10l31k765l58o87j26N97L702L80K545J945j263o35j287n191r91j277
5693g555K54K058L194m58J756J791j531l11j310P08J97j922J385O74Q9J094j871
5676a758j135K889k590K092O81J959k372j008J446J623o25k733r45J836K33Q51
5660D44N58l173k113L134O21j823j166K682K880O38j533p00m43l76M36P07j222
5643d49L703k83o286j327K694o60L399J958r34k4j258o58O69j6l178J839l487
5626d298J115K995R71j03n60P19j203J57J9j016k743K190M534k864k419l976L16
5609f166J418R33k54J762Q39J089n54n25N119K772k301l924p25j121L494J754
$$ y = [-2810, -3314, -3083, -956, -100, -2223, -4089, -4518, -3664, -704, 101, 1344, -1778, -3447, -3333, -2244, 745, -1503, -1813, -2144, -4909, -5267, -5954, -6080, -5483, -1781, -1401, 1144, 3089, 1826, 1191, -96, -5287, -6278, -7555, -7301, -5243, -2049, -2507, -751, 1040, -491, -802, -2112, -1404, -1207, -3129, -1744, -1070, -981, 113, -1758, -2893, -4, -2594, -502, 179, 2138, -234, -1242, 204, 1827, 1202, -1531, -2476, -640, -407, 444, 1002, -2171, -4284, -1150, -529, -2352, -3518, -836, 2044, 2682, 1149, 449, 6, -370, 66, 773, -449, 3254, 2971, -3315, -4642, -1948, -2608, 791, 2749, 1815, 1791, 533, -125, 544, 528, -2650, -811, -4298, -3183, -188, 783, 680, 120, 839, -364, -207, -188, -1204, -3947, -1757, 2777, -87, -2506, -6482, -6166, -4748, -3815, -4069, -2307, -1468, -379, -933, -1458, 3661, 6433, 4132, 208, -517, -1638, 1856, 3610]
5593C610K675R73j623m328q16M33J874k318Q77L215j679n629j210K141R86r61
5577a780J198n29J697l535l491k303k00M166J078j664l55L038J556J058K377J206
5561C517P4J617j218j27k931j507j957k75J113k280j514J09o38J286Q29K718j563
5544b747K747J217k542k985k75K525j566j563j22K926J795j027Qk085Q42p32j097
5527d681J310Rj172l545P80n24L732J136J76Q96m426k214L549M204M003j359M96
5510B370k090p74L143L46k652j590k162k577K409N80k037k56K298N381M989j324
5494F054k55o92l569q26Q29K637J612q75k040j217n27J358k846l072M75n50L041
5477d63L840j682l139J677J851l608o37J919k95k882n33J842k168K899J959j974
$$ y = [3610, 6285, 7258, 5635, 1307, 491, 924, 2798, 480, 1357, 4572, 2893, -2736, -3946, -1805, -819, -1780, -582, -1111, 586, -2949, -6440, -8743, -8943, -4777, -3699, -5363, -5718, -2680, -1124, -66, 2311, 3517, 3591, 5208, 3990, 3863, 932, -575, -2532, -2807, -1694, -3974, -5488, -5379, -6017, -4731, -3902, -1184, -2747, 0, 1217, -1325, -4310, -4585, -2060, -3626, -5189, -5311, -2385, -590, -1617, -1609, -3694, -2852, -3584, -4681, -3371, -3362, -4534, -8079, -7299, -7823, -4091, -2955, -2779, -1883, -6309, -8523, -4974, -770, 3233, 1874, 2370, 280, -494, 2649, 2995, 343, -1247, -3409, -5986, -3577, -2997, -5034, -5290, -2992, 2389, 7378, 6054, 5799, 5107, 1538, 712, 1541, 4178, 5790, 4915, 2875, 1658, 1131, 2489, -357, -3429, -2954, -3504, -463, 3377, 1695, -1444, 233, 2084, -1524, -2161, -242, -537, -3419, -3952, -2110, -4278, -1379, 580, -1394]
5461a394K30O2k102K219J369j171j413J549k78M7o44l17J131q38j463M22j269
5444c860J646M59m80j675J248J636R61L594J431j481j779k347N54K55J719M39
5428B320L85p13j677p46k70l164j697j066l655J159K926J237L351l5k246K478
5412a413K917n47l667j850k945J594J071k086l97j176p95L87L405J908j452j153
5396f199j221J193K617L674K494M78k12j28J200J296N85O52o35l545m818K754
5380A85P87j421J40N2Q0j493J786k13k045K90J663Q68j38m42k308P30o75K076
5362g8K250L269o96k591K710k094j999J726R22n06m077l012J91K191R12J070o58
5345d70L84k03o62m19l84J410K705J090m77J644P1J77o92j340j884J414k65r72
$$ y = [-1394, -1164, -1102, -3204, -985, 384, -787, -2200, -651, -929, -882, -1526, -1843, -712, -1550, -3013, -2591, -3860, -2214, -1755, -2235, -3910, -2662, -1026, -65, 3529, 4960, 3479, 1700, -647, -93, 162, 1881, 2320, 2705, 1992, 315, -431, -701, -3865, -5562, -6628, -10283, -9124, -6198, -4961, -1610, -1645, -3891, -1413, 1504, 957, -2710, -4560, -7505, -5911, -4840, -6926, -7323, -8499, -9294, -8907, -5502, -3594, -5046, -6199, -7420, -6227, -3610, 64, 2558, 3036, 2824, 2696, 3896, 5192, 5777, 6429, 5794, 2249, -2569, 185, 972, -449, -309, -257, -177, -1670, 116, -97, -2142, -1852, -189, 679, 541, 99, -2209, -1479, -2154, -78, 2172, 5441, 4745, 2154, 4864, 2770, 771, 2497, 3419, 2913, -1164, -4176, -3985, -1794, -882, 188, -470, -86, -289, -951, -1370, -1754, -344, 2361, 3451, 2974, 4618, 4689, 4866, 4174, 2834, 950, 2364, 2099, 1127]
5327A127M37o44N80Q91j811Jk217l759l166L984L199j779k523J008M650M47j623
5310a198l961j490O77L169J291m38J143J168P45J96j463j019J806n75k51Oj311
5293a505n08j902k2j118P36K525J159P61N46k797M81K535l951k058o02O73K557
5276b490N11j353J414J459r23l812N62R0j888K453R48j793m825m3K582Q42J170
5259e096l081K219Q162K302n331m251M29K190K874j861j060r22J285M083l582
5244a640L14J542r79j590l9M31j660j378N69J929M783r14l18j454k912j14K970
5227d60P90L369j478o13j002J813k657k207M74O95k063K674r07k363J801P01j559
5210b992K3J285k95K62P89L95J815r46n24l369m30j579k190j004N39M690M132
$$ y = [1127, 1564, 920, 1500, 2391, 580, 581, -1636, -5395, -8561, -4577, -1378, -3157, -5680, -4672, -22, 425, -1198, -5159, -6649, -5972, -2803, -1512, -1950, -807, 361, 1106, 1302, -161, -1180, 626, 51, -200, -194, -1505, -2013, -3915, -3937, -5055, -4319, -1794, -635, 126, 672, -2125, -1644, 891, -3060, -5118, -5720, -5047, -2490, -1979, -3332, -1918, -459, -1382, -5194, -4632, -4542, -6430, -3977, -3029, -4822, -9647, -9690, -7108, -6266, -5096, -8177, -5958, 2204, 4506, -825, -5076, -4647, -2457, 417, -1444, -2504, -3426, -2141, 1942, -1640, -1326, 216, -763, -2353, -2392, -1961, -3621, -4999, -4430, -2501, 2282, 1368, 1050, -404, -3316, -3430, -460, 330, 3699, 2221, 1608, 606, 2419, -238, -2445, -1971, -1276, -3339, -665, -1572, -3935, -2134, -1433, -2992, -2969, -1684, -1979, -1717, -928, -533, 1282, 336, -188, -3557, -3987, -5566, -7756, -8760, -8221, -3531, 601]
5193F01J001J052l78l114j989L580M11k282k45j948j506K051J45j424K07J967
5177a871j12l946K181K596J621J270j900k279l602k003M656j512k296K124O32
5162d441j086j050l83k056K342K586r82R67M53J159M455k306j909l280p82r6o5
5145f474J444P14M167o43j114K890p4K18J464k339k409j761J583J250J674l70
5129B20m849k124n49K264J173Q67Q57L175o20j873p67r09J755O62Q73p1k283Q34
5111a365j177l286Q12q42j56J34L97K861J091k012j811K297L550J973k775r16
5095a225O2p79n87R85M953J448L88l648l152r75k610q90J274K478J466K272l55
5078A105l06R29k23o30J037k462j997j758n60O61M353M83k551k255J168J007k49
$$ y = [601, 1602, 2654, 2276, -838, -2827, 753, 1164, -1118, -1363, -3311, -4817, -2766, -2621, -4045, -3838, -1871, -1983, -5929, -3748, -1152, 469, 1739, -161, -2440, -6042, -8045, -3389, -4901, -7197, -5073, -4441, -5527, -6577, -6960, -9016, -6674, -4088, -5070, -4103, -3650, -2491, 1964, -342, -2251, -5531, -6313, -6409, -6474, -5030, -4316, -149, -792, -1906, 984, 910, 1128, 2592, 253, -2156, -3917, -2334, -1084, 590, 220, -4629, -6753, -7302, -5038, -3865, -2998, -2141, 1034, 414, -1459, -2226, -3135, -1380, -718, 155, 84, -2199, -1365, -2542, -5828, -5016, -5858, -6014, -5880, -5483, -2622, -1531, -3543, -5354, -3057, 493, 2466, -309, -1225, -1163, -1942, -2529, -1544, 3409, 4857, 5245, 1597, -1555, -2530, -5140, -6030, -4756, -2278, -812, 1460, 1105, 799, 1728, 1505, 875, 1912, -550, -2547, -4305, -4865, -4204, 149, 632, -1919, -4174, -3006, -1999, -2248]
5061b248j023K12j398J311J484j07Q80j54m173n31J369K659j064J397L310r90
5045I34j840l080j080K399J234j683j265J618J888J275j64k143J264J809j600
5030d34J478l38J874l46m606l436L999R44J769l85k64o88O8J991N54m401J258
5013i63J265M471J397p62j536m126Q62J880k750j817j012l495J825K424J92k35
4997b380K208r07J537K358m489j552K124j326m69J653J824o99j901k526j416j860
4981g821M131L550j574j135K49L3r78O61J222l85K590K44L96L04o04j122N32L328
4963C621r1m234q14K617k001l117K799L633l274k991o16Q40K117n16o0M68K731
4946A112k00l207K12K680L688J422m486l49n11J334M46k947k606R62j204n70J749
$$ y = [-2248, -3271, -3059, -4457, -3146, -1662, -1769, -889, -1043, -5216, -5747, -4378, -1719, -2783, -1386, 1924, 934, -906, -3986, -5066, -2667, -1433, -3116, -4381, -2763, -875, 400, 236, -1907, -643, 1166, -434, 1044, 706, 2580, 2234, -2372, -5808, -1809, -865, 904, 519, 255, -433, -365, 1626, 2180, -2221, -963, 302, 4773, 6170, 5408, 3872, -254, 608, 2488, -262, -2079, -3091, -6586, -4761, -2337, -2145, -2380, -172, -1079, 458, 2816, -1673, -3225, -1101, -2427, -2896, -1243, 581, -118, -2019, -4545, -5961, -7821, -3690, -140, -1714, -2849, -2600, -2567, -3545, -2884, -1662, -2047, 543, 787, 1183, 1487, 883, -239, 293, 3621, 3530, -704, -1518, 1099, -902, -4019, -1220, 2413, -861, -3852, -4468, -3628, -1511, -2027, -2087, -1619, 1112, 912, -2295, -2083, 597, 4285, 5707, 1221, 872, 361, 1695, 2141, -806, -3412, -2450, -3654, -4224, -2475]
4929b475L866j008J261N50r15l348J144M11O49j416J651k4J344K778O01k977j244
4912H48o45j406l78K155R67J074o66j022p26J194j135K435j64J291k039k950J09
4895a058R7k694j81J580J957M57K419O91l371p52M149r02k74J517q18P64k427
4878A154M19R89J906q83j679J751K67k408N12n620j762N80J193q31k530m78K783
4861d637J638O124n50j390o06J53j694l99p52j128q16j045K484J624m3l138m38
4844d613J548j428o82R87J855K741J902k123k629R80J439J164Q99j574m80m06
4828d20K56J247R70j258l054l962K14J697L683O31J431N80j167j987r1K90J877
4811I37N90l760k776j550J61J177K970J50j379J780R11O63j367K342R53j039m529
$$ y = [-2475, 1391, 383, 1644, 2194, 1279, -2069, -925, -514, 135, -1281, 370, 346, 1690, 4468, 5069, 2092, 848, 203, -1203, -1581, 574, 1541, 2615, 1949, 927, 201, 1395, 260, 2695, 2531, 3822, 1783, -1167, -1058, -961, -3655, -3836, -2256, -299, 158, 2577, 3268, -103, -855, 3294, 2392, 2118, 3635, 2817, 3581, 1154, 1573, 2562, 4468, 3585, 1906, 3657, 3924, 1516, 2028, -3592, -5354, -4774, -3581, -4412, -6942, -7420, -4637, -2999, 3125, 2575, 1185, 579, 732, -962, -1361, -2113, -3241, -4057, -5102, -2618, -994, -1037, -4175, -4613, -3065, -4493, -5175, -4188, -2333, 408, 2310, 187, -2442, -1462, -23, 1141, 2040, 466, -14, -420, -164, 1083, 2053, 795, -2259, -6221, -6007, -4310, -627, 4, 1435, 2015, 848, -1139, -1230, -940, 937, 1527, -2233, -5009, -6559, -6398, -5221, -2251, -2101, -3480, -1700, -789, -126, -1493, 849, 1802, 763, -3766]
4794c766k412L464l02p80K616J076M78k21k29J216r95J20k247k621K697L258N40
4777A892j690j248k349k53n44M360J556r16j734L40L290J312k02J748k055K77
4761C784R70m079j550K458J48R30j603j527L874L290k321L94j43j887l776P35
4745c03N60K627j244j996K964q12j348j940k797l468r82j122P27M371k746j8l4
4728g561L340M150R1k237J769J708K90j770o65J610o01o39q7k09k208R59L206
4711A146j306l386J522L354j265N19J146j161j940P09L703K847o15l628R62L549
4695F156m55k624l861j230J438R51n59j693M90J528N76j955o31K71M552J167k781
4678A340j282k491Q98Q59n48k502p09K675l1o25k03J873J99K186k15k102k119
$$ y = [-3766, -6178, -2714, -3016, -3796, -1180, -104, 374, 153, -76, 1140, 145, 265, -1982, -4603, -1906, 1352, 1892, 202, -1046, -3395, -3648, -4192, 168, 1724, 808, -926, -586, 2704, 4016, 3814, 5562, 3507, 3784, 4754, 675, -875, 1583, 1731, 2661, 1058, -469, 3405, 6695, 4374, 4768, 4625, 2738, -1038, -303, 257, 2884, 1640, -356, 2608, 1796, 448, -1492, -4289, -7757, -8739, -9861, -9134, -4763, -7509, -7527, -7561, -4221, -71, 20, -2217, -448, 1260, 1550, -220, -885, 725, 124, -515, -602, -811, -3019, -2060, 1146, -160, -3546, -2024, 1330, 65, 584, 1730, 569, -1371, -662, 3041, 5888, 5273, 1645, 2607, 6156, 5701, 3077, -784, -2014, -576, 375, -184, -1877, -1387, 141, 717, -1238, -1869, -1598, 2954, 4121, 1340, 58, -2433, -1535, -676, -1224, -3726, -4435, -1760, -1791, -2416, -2619, -746, -547, 1639, 1424, -678, -2797]
4661b797l753k451J115M119k62J847p85K76L182k598N99J888j08J4K16l638j362
4644d498J472J122J923n86m991r57M80L364L33L403R35J761m79m39N22j919K97
4627A743m47K01R18j788L66m121N66J654M51j74p10K232K515P75l37n63O13k709
4609A185J396Q99l769k258r43j247K598L931J169J91k829j755K763o10k879p57
4593b915k45J49N93o81J4J62j902l41J452K645l14O44Q02L502k756k024L305j033
4575A057n807j733J735j602j138J649k93j40j448J660J634J542L41J431J957J597
4559B442l555l348p7O02Q14j83J070P73j413r6o59n10J414n68K941L569Ql742
4541e18l19J04q37j206O85N05j799m60P3j800K786J104M65m162N8J120P04M38
$$ y = [-2797, -6550, -9001, -7886, -3767, -4029, -2182, -2967, -2691, 491, -2107, -1508, 380, 272, 286, 502, -3136, -4498, -3026, -1904, 19, -567, -5558, -6515, -6035, -2671, -2338, 1065, 2000, 3761, 3282, 2843, 3365, 1446, 1743, 1296, 1497, 2415, 627, 993, -3128, -2562, -908, -457, -631, -1341, 891, 3406, 4181, 3844, 3281, 3894, 1185, 2581, 3480, -289, -2547, -3490, -4737, -2139, 1792, 2961, 3152, 323, -1432, 1331, 721, -2158, -2915, -3160, -3011, -2418, -3099, -3085, -2923, -4825, -5166, -3714, -1069, -1383, -739, 63, 3565, 809, -1215, 2090, 1057, -4750, -6483, -4748, -6350, -7488, -5839, -6132, -6272, -7720, -6060, -4426, -2884, -2543, -1112, 845, 2442, -1113, -4461, -4538, -3936, -3122, -3305, -2235, -1462, -2875, -2971, -3630, -4140, -2726, -3294, -353, 3216, 3224, -518, -837, -733, -1570, -2776, -2091, -1586, -3385, -3845, -3772, -5572, -2786, -1682, -1217, -5379, -5321, -4201, -3497, -3059]
4523c059j048K516m0J339N62p8j946j653j082J27O7O66L022K468p19P74j367l704
4505c155j867K12J74J148l07R89J330n85R55m38j981k806K894J387P04O7M252
4488B973K441m949m714J367N798L215K111j264m854k85P95M53k571j402O80J258
4472A052K761j244l235j692L138R25O20j634l158j54l013J565L699J754O42O11
4456B637j339P27j249j758j916l977J134L173L141K177j528R75m24r52j838r7
4440a114n93K401m18N37m28k528O57O6K447p52l778l813P48J237L234L579j345
4423A37j036J737j084n075j232L468L247L75K153q24J84K312k718j801J596K27
4407A666k670j001j649P76M479M17l135k69K75k353m8J283J277L215j762k120
$$ y = [-3059, -4107, -1591, -1631, -292, 270, 192, -1754, -3407, -4489, -4362, -4295, -3629, -607, 1861, 1142, 1916, 549, -3155, -5022, -4810, -4636, -3488, -3795, -2806, -1476, -2061, -1106, -1544, -3525, -6331, -3437, -2050, -1346, -1279, 2973, 5414, 465, -4249, -2882, 2916, 6131, 8242, 6978, 2124, 1839, 2634, 3087, 516, -886, -206, 1052, 3813, 2569, -666, -2358, 780, 1705, 2325, 691, -2467, -2621, -5634, -4069, -370, 1384, 2026, 2637, 1298, 2025, 776, -982, -2898, -6875, -5741, -2568, 573, 2750, 1222, 2197, 1773, 821, -1017, -1114, -1707, 694, 276, 813, 385, -2143, -1486, -1420, 1027, 275, -3503, -7316, -6568, -5331, -2097, 1482, 137, -899, 838, -246, -5321, -6553, -3085, 162, 537, 2690, 1866, 2050, 4362, 1644, -157, 1439, 1666, -1004, -2005, -3654, -2878, 1601, 2018, -1117, -1386, -1111, -3464, -3512, -2229, -952, 2263, 501, -1619]
4391a619L06L55K882q41j634O27O0l666k690M1J651K216J497K449O9l725k563
4374d585R77j724j339J269J372J469J437K587K051m256q58J649j867m16k303o99
4358e236o66J468J25l105J846L841L391K380k934k023m99l128J893R32m685k415
4342h815L837K709J154J667p76O16L207o13k569j467J00K701J304K41k206q37
4326B53k735M5M8j655j093M345q67l402J00N33K0P98k112J094L171k004j738q28
4308f027K823J834j052n74j361R77k08q37J281J276j235j455L21P62K472K001
4292I98O0l380j161J14J074K867J027O07m46j307j62K718j33j991j821K929l70
4275A623K14O50m70k11l874l319L424N368J679M24o29m480r81K892J52l384m157
$$ y = [-1619, -1313, -958, 1924, 1083, -551, 76, 136, -3530, -6220, -6179, -4528, -2312, -815, 1634, 1703, -2022, -4585, -3608, -5332, -6671, -5402, -4030, -2561, -1124, 1463, 3514, -742, -1600, 49, -1818, -2234, -4537, -5236, -5902, -4434, -4309, -7414, -5568, -1727, 1664, 4044, 1110, -913, -1412, -4540, -2647, -1715, -6400, -8815, -4978, -2269, -1115, 552, -224, 392, 3599, 2986, 417, -1050, -950, 1751, 3055, 3296, 1090, 253, -2482, -2437, -2389, -4044, -5137, -792, -1659, -5061, -4961, -4428, -4408, -3610, -5722, -4628, -1457, -3461, -5199, -6027, -3204, -1370, -2422, -2996, -4357, -3380, -3588, -4425, -3144, -1868, -3103, -4558, -4237, -3475, -1003, 998, 1058, -2322, -3483, -3369, -2295, 572, 1599, 2206, 1760, 453, 291, 3009, 2876, 885, -936, 1993, 1623, 1837, 2487, 2017, 1806, -2068, -5387, -1963, 3405, 5084, 5508, 4879, 399, -582, 2310, 2462, -922, -5079]
4258e079j380K171K0N56J681l27J359K983k514j026o98m129L145K089j522K497
4242a74P29l935p27J669J717L787j351k521P81K127k533r77K195k598j591K046
4226a356j98k947J269K020L93j362K54P99j804J965K180N74j522J176k179j710
4210b448K887R18j96j781J502l912L07j837N69M220M525Q05k225k065J56L55J152
4193B932j47j112p23R15j494j704q90o27j55j695J469k93k123j457K352P62K251
4176a739M098L492l664k335n86K410K047k328l429N59r70O24J407j214K34K100
4160G06j766k901J740L815p67p48j249k199J190K794K011K323l02k61J300j403
4144D283j167q00k384j669Q62K74k851l33J766l23q22K213J346Q84m97m10J373
$$ y = [-5079, -6459, -4288, -4268, -3712, -2031, -2358, -999, 1984, -530, -1556, -2254, -6383, -3238, -1149, -2671, -174, 555, -3380, -4107, -2438, -721, 3066, 1715, -806, -25, 2102, -431, -1408, 787, -1811, -3402, -1356, -1554, -4501, -3232, -1212, -819, -2181, -1927, -1128, -2932, -967, 1213, 1787, 265, 1441, -738, -2448, 439, 1357, 1161, -620, 882, -3030, -2723, -4560, -3991, 229, 4754, 5559, 3334, 1269, 1425, 1780, 2932, 2785, 1673, 950, 1865, 371, -1333, -2223, -2850, -3005, -4700, -3231, -3524, -5647, -7104, -4752, -3990, -1739, 2359, 5851, 2187, -148, -734, 1676, 3723, 1395, -2034, -1475, -2445, -1821, -414, -1628, -1394, 706, -1060, -3961, -2221, 1594, 827, 79, -1170, -3369, -2179, 615, 2626, 4949, 4647, 4386, 5686, 4283, 3116, 2316, -68, -1737, -875, -601, -3452, -3785, -2019, -2342, -3164, -951, 395, 1279, 782, 372, 1745]
4127A745R53m0m78o40Q4M23j128q99J701j768j081j02K482J348N85l01m100J361
4109A45L3l372j232j215j106K503J679K528J045k938q46J612k095j785j307J467
4093d884K560M27K694q69J733L551L44l403k435j938K83j666j365j282K44K141
4077c865K4Q5J148L373J920k934o48L414n84j901l566L51J345K906J411J776j101
4060C154j376J304L40K121L2j679k932j941k10K640j03J8Q9N33j479K942Q51q11
4042C493l404O02K00j305j435k436m70K776L175l30J087k192k245r5Q16J831j935
4025a867j439J836p74k8J155J822k37k967J684m99M90Q49k258K53j45ok554M505
4007a80K866j228m60Q18l431k929m11K47l89L813M129J563k264j533L320j67R18
$$ y = [1745, 2698, 2658, 2180, 1540, 1624, 2047, 919, 20, 1721, -47, -1128, -1230, 1252, 2600, 3185, 2884, -1216, 145, 178, -3194, -4426, -5641, -6747, -4244, -2565, -37, 1008, -1930, -2776, -1164, -3259, -5044, -6351, -4884, -2324, -1897, 797, -72, 1661, 5212, 5556, 2153, -282, -2220, -1937, -3603, -4968, -6250, -6006, -3865, -3841, -3756, -2608, 765, 2685, -249, -897, 2517, 1933, 32, -3534, -3183, -1838, 1068, 2479, 4255, 3154, 1778, 3082, 3422, 5543, 5575, 3896, 964, -977, -1187, 1453, 1350, 1368, 1457, 1990, 511, 3453, 4304, 3493, 89, 691, 891, -414, -1849, -4285, -4755, -1979, 1196, 866, 1953, -239, -2484, -2579, -1763, 68, -1867, -3306, -1470, -2244, -2272, -1117, 705, 468, -2499, -815, -1314, -824, 25, -2233, -1980, -2125, -2131, -4685, -180, 2686, 1458, 998, 1816, -1615, -4544, -4955, -4708, -5097, -1284, 2845, 4408, 2144, 611, 3931, 3764, 4682]
3990D682O61k792j435l10k237j3j573l045n13J292P86L563J974N70m158J375K322
3973A149o93J037j376l002j314oK502J106o19N37J386J818k1J409K86k036J667
3956C830m169N84l760j208P59K136M597M380j319l463J750J306J078j975l306
3941A220J464L7q92J668K545J399O94k083k737L13j169j123k289k003OL295N314
3924E659K024J54m53l334n507l165N24K150N86L055kK65j956k180j503K805L357
3907B479j059l490k301K921J23r08p7o63R63K458m64J258K201K379j128k188j260
3890A244j357J24Q33r10K459q55j451j728l031J046m78M75K95P22K940M13r57
3873b16k285j70j373K190j065J529K741K1m89j376j761M84j168j283n94M097L569
$$ y = [4682, 5343, 2551, 1116, 806, -1431, -1444, -3017, -6062, -6575, -5283, -4497, -934, 1040, 1610, -2548, -1173, 1149, 456, 1493, 117, -2885, -4199, -4205, -1703, -597, -1216, -679, 707, 2525, 2504, 3913, 4199, 2163, 3830, -339, 245, -3515, -4723, -3964, -1828, 2769, 7149, 5830, 2367, 4117, 5423, 6501, 4526, 1220, 2684, 2721, 1829, 3497, 6042, 7441, 8135, 6052, 3315, 3628, 2459, 1336, -953, -2956, -2950, 345, 5659, 7683, 7837, 7384, 4050, -1457, -4622, -4098, -1948, -1362, 1693, 1691, 1956, 0, -2180, -3683, -878, 2479, 1420, -2070, -4371, -1450, -1327, -2235, -2312, -2975, -2012, 446, -18, 1240, 3441, 5820, 4692, 2504, 1244, -113, 11, 844, -66, 2393, 1538, 87, -1641, -4672, -3626, -4104, -3629, -3334, -2612, 328, 741, -216, -2501, -2671, -4044, -1854, -2919, -1390, 1351, 1372, 883, -493, -2254, -1770, -2938, -4221, -4815, -718, 2851]
3856B851j837n000J461J835j090k48J499J095J594o42P1j03j187N65k122n62K733
3839I13N080j138k863l191k055j747K37J481L412L142J56l176j001j128j362j944
3823e184L581M70J604j565r30L927j057p24J689J23K730j016j41M66q06N05r20
3806B752J336O04j078K183k572k757k196j53j350k447J798M71J154k143K167K242
3790A1j130K357K595k235j816k195K32j000L103q83K564j932m963K60J474l640
3774g198K451j76k399K209n45R54p8J69R52K823J284k112K30J077k98j865j237
3757c759l08M770K823j29l797J431K232l829j422N79K156j722j539j500J061L265
3741C12J390k422O50k267J760J589k753J807p54O2L55R56k648L089K516k173J235
$$ y = [2851, 1014, -3986, -2525, -690, -1780, -2028, -529, 566, 2160, 1518, 1589, 1486, 299, 864, -1258, -1820, 913, 5993, 4855, 1992, -1199, -3254, -5001, -4764, -3283, 129, 3271, 3427, 251, -750, -1878, -3240, -5184, -1603, -1133, 471, -1094, -2024, 1903, 846, 122, 1811, 1934, 4664, 3648, 3507, 3973, 3167, 3672, 2752, 4088, 4692, 3614, 5797, 3225, 468, -1728, -1881, -3231, -5678, -3880, -3409, -2255, -4398, -2231, 11, -1119, 1238, 3833, 1598, -218, -2413, -2181, -3181, -78, -961, 1603, -329, -5292, -5032, -3558, -7198, -4747, -4923, -7322, -5113, -5658, -4704, -4782, -4613, -3661, -838, 446, -1666, -1436, -359, -657, -2522, -3759, -4067, 703, 3526, 3397, -400, 1031, 3263, -566, -1988, -1409, 747, -975, -2514, -4014, -2953, 312, 1702, -720, -70, -2337, -577, 1012, -1741, 66, -688, -626, -271, 685, -1963, 1126, 3642, 1469, 2704]
3724B704j745j646n80j920k191L777J18k305J216K026K821J891p08r08n214J93
3708b471k222J219K611K314M1k129j522K322j67j496K062J128j406j386J353J71
3692D22j373l55J474J334j630k198P27L694m02q75K624N58J047l892l281K784
3676F58K800K217k512J630j087k292l673j409K177J314l32j016K712Q02K0M44
3660B453O38P80l341o17J829l115j531P95L94r32O33K950M263r39k587k153j268
3643a748K299J804o10J391K090q14o31k280P80K00k02k318k025K278L550J304
3627E068k398j543Q96k385k64K228K070k838l502n40J946K55O43n57N0L195K390
3610D714n88k245k101j653m66j77j110j185J775K49N69L071j303j829M80J097
$$ y = [2704, 959, -687, -1267, -3187, -5378, -1601, -1483, -3788, -2572, -546, 2275, 4166, 3458, 2550, -2664, -2471, -4693, -3474, -863, 1451, 1492, -637, -2159, 163, -4, -1500, 562, 1690, 284, -1102, 251, 422, -951, -1306, 168, 1502, -128, -2326, -1599, 2095, 1693, 818, 3442, 4000, 5047, 1155, -2126, 658, 3458, 5675, 3163, 4793, 3706, 1414, -2259, -3668, -1491, -177, -509, -1525, 1187, 1989, 2009, 2453, 3091, 3871, 530, -87, 1742, -1373, -2904, -2109, -1715, -2647, -2014, 936, 5199, 4260, 1673, -480, -1748, 551, 2355, 1745, 3136, 5226, 4412, 3781, 1501, 2281, 2481, 2279, -39, -2064, 214, 3764, 5068, 2670, 1127, 2023, -362, -626, 1602, 3672, 834, -2668, -3208, -1262, -1007, -364, -921, -871, 2324, 4714, 4126, 1881, -220, -1873, -2339, -2516, -3626, -4811, -3036, -2787, -2218, 853, -450, -2279, -1799, -702]
3594g02N92L384N43Q61p38p20j848p62J208j026j802q89J836R69l684n39L850
3577E33K24j029k9K394j209j821m173j71J871O27k013J137L278M143n09k840m88
3560g5o87k934K040M651P39J24k847j79J488k609j979J26j780j91o64M921K685
3543B829J306R57J917l35k627O50k724L60R46J78q81k130q55J172k15N69j399
3526b82J622M101R56j259k040j511Q28k951l272K084K664K474J50J490m11j457
3510C186m944j069k74J380K230q49j799M49m264K391L513j763J17j074k545l776
3494i091L552K002k398K793J694k258J400J079J472J350m23J276J046m76K674
3479E692R99m055j55K222k325j508n58L774K238k715k863K415J406J96j764q72
$$ y = [-702, -110, 3274, 3817, 4678, 3940, 3220, 1372, 610, 1818, 792, -1010, -1899, -63, 906, -2778, -3317, 533, 757, -272, -301, 2093, 884, -937, -5110, -5281, -3410, -2783, -4796, -3659, -381, 3762, 3253, 413, -75, -762, -3696, -1656, 2995, 3734, 3858, 1011, 832, 2320, -289, -2268, -2142, -3922, -4113, -4777, 144, 2829, 4135, 5092, 7009, 6674, 4047, 4697, 1973, 2333, 3279, 3457, 2576, 446, -409, 763, 548, 1117, -282, 1340, 5441, 6397, 5138, 3098, 1587, 2415, -536, -3808, -1724, 940, 3414, 3564, 5054, 4643, 3186, -1758, -2827, -3101, -1721, 509, -340, -2139, -1690, -5954, -3563, -50, -1813, -1696, -2770, -5315, -9091, -5539, -3537, -5935, -3142, -1448, -3706, -2306, -1227, 245, 1595, 1172, 2448, 3494, 3018, 5692, 6691, 2636, 2481, 4703, 2378, 870, 312, 4086, 6324, 3609, 746, 3161, 4567, 4763, 2999, 2127]
3463B127l877k309J734J585P44j843q17k42K868M42j45R54k833Q78J028j594J772
3446D72j561J169k64l96r1J037K173m61n30J882k29M192J757j302n504m970q29
3429c455J469j167K126R18Q66J519q31j061j07q95R45J194J081p24r69k36j638
3412i65P99l60o049L07M172N255J562P35m352l093j464K826O69M2J167K586Q99
3395D736j614l51n36o02k340j393k69J743L137J079p25j319J546l260M36L058
3379C326r62o55k621o64J88O76P53M566j779m040K459O568K574l839j368j245
3363C937J867k845m107l986j88K393M64J503L943P17k426K96o17j204M939K957
3347G643l679j276q95j389k745r87J560J265R80R70p05J051k762l848j350L297
$$ y = [2127, -1750, -4059, -2325, -740, 4, -1839, -2656, -2898, -30, 412, 267, 1221, -1612, -734, 294, -1300, 472, -1089, 80, -184, -580, -671, 366, 2539, 2078, 1548, 3430, 3201, 7393, 9150, 7848, 2344, -2626, -3455, -1986, -3153, -1027, -109, 757, 2276, 1445, 384, 277, -618, 327, 1521, 2602, 1878, 909, 673, -965, -166, -526, -6575, -6268, -2096, 3159, 4721, 5456, 1104, -1989, -3453, -627, 42, 84, 1251, 3837, 4736, 3122, 2771, 2235, 1633, -707, -2100, -2369, -626, 2511, 3590, 2865, 1546, 3092, -168, 268, 3326, 2364, 1709, -912, -1576, -1388, -712, 41, 4607, 2828, -1212, 1247, 7815, 10389, 6550, 5182, 3937, 5804, 2959, -1148, -5134, -5322, -2929, -2465, -962, 2981, 3698, 1272, 1568, 951, -253, 4686, 7643, 3964, 2688, 1793, 404, -2341, -3328, -1768, -503, 477, 1447, 742, 1793, -969, -4817, -6167, -2870]
3331b870K314J220p87K697P12K25J544k240k309J241N47l352Q05K92l709K989
3315f81k36j651j569J628j65J084P53J737j583k455L618L78j570k50K019K647
3299C704K082r6k423l145o91M08k3M409j053j724r11j369j541k169J177J839l41
3282a867J424N491K594n61j284J185J440j863J677k457j625l458j556j317P80
3267a397P59k531j961j828J115K476q86K10n69j027J861K839J469j919j751k037
3251e177J042K626P07k899m90N474K165j166n38m145l473j886k008J161K502N784
3235c21j616l121J319M470L688j131J220j661j872n32J208j072k411j74K743L274
3219D011j463k207j928M68J032l464K16L722l96l29l441k11L478L415Q53k684
$$ y = [-2870, -556, 664, -123, 2574, 3286, 3511, 5055, 2815, 506, 1747, 2294, -1058, -253, 39, -3670, -681, -917, -2568, -4137, -2509, -2674, -1590, -837, 900, -683, -3138, 480, 858, -712, -962, 1057, 3704, 5786, 5690, 3267, 122, -569, -161, -184, 4225, 3172, 1448, 537, -832, -2373, -4542, -3365, -1526, -1867, -443, 5048, 7642, 7081, 5797, 6982, 8422, 6559, 8236, 5779, 4154, 696, -860, -2177, -1397, -638, -3169, -5130, -6958, -5843, -3367, -4253, -4043, -4612, -5639, -3778, -939, 530, -1389, -3140, -5177, -4135, -1509, -802, -3701, -4191, 1283, 3448, 2282, 1744, -2401, -5874, -7760, -9768, -8607, -6105, -321, -1937, -5058, -3739, 731, 4419, 3288, 4508, 2847, 975, 443, 1651, 579, -1832, -2006, 737, 4011, 2548, 341, -1587, -1119, -87, -3551, -3335, 387, -9, -338, -3779, -3990, -512, 2903, 3756, 1072]
3203A072l457P87j833M20q46J790J42L138j328o09L514jl45l620M16l46j890K348
3185f48K82J598J531q72J56L349j701k171p35L5o09j40k143M44K83j758k354J462
3167c991N054o98k217n27K093o23M205r58k360q08k911K780J940j317K35J348
3151A245k94M99K250k060L6K664J102j418k82o77j613j080K810l07k723k621Q3
3134b386K208Q24l0k094k128L23K240K752K674K24L93k571q30q25K66j100J516
3117A456N145M14k250k682K150P57j193L115k750l091j966j813K086R69J656J750
3101C753N85j775P75J09m230m200J504J215N49P81N284J128J22q76l284O79M445
3084F564M25J690n51j139m182o32j292k42J804K571k015k479k824L940J208k746
$$ y = [1072, -2385, -1598, -3431, -3011, -3857, -2067, -1925, 1213, -115, -724, 2790, 2789, 2444, -1176, -760, -1106, -2996, -648, -366, 1232, 2763, 1891, 2047, 5396, 3695, 1524, 789, 824, 215, 75, -2068, -1624, -1341, -3099, -5453, -3991, 1063, 365, -1852, -2379, -286, -909, 3296, 2338, -22, -830, -3741, -961, 979, -338, -103, 1245, 951, 1450, 3700, 1640, 1676, 4340, 5442, 4024, 3742, 3065, 1452, 372, 3182, 2875, 152, -2469, -2386, -178, 646, 616, -1478, -3606, -3283, -1043, 1709, 4383, 4607, 5000, 2429, 1599, 774, 1040, -60, 1456, 6601, 7015, 4765, 2083, 4233, 4990, 3797, 6912, 4162, 1071, -895, -2708, -622, 347, 2003, 3753, 4338, 2563, 3338, 3447, -783, -4983, -3479, -2264, -1715, -934, 4350, 5478, 5600, 4724, 1440, 2119, 6564, 6989, 8679, 8128, 6989, 2807, 2175, 883, 641, 2445, 5016, 3001, 522, -2302, 1638, 2846, 100]
3068A00k618O87N80N15k75J316k46p8k676k57K339j407Q96K773j433l062P72K159
3050H5Q68j397j877J227J418k547j997J845L321J196J772J78m439j741K703J223
3034A838j100l18J41j822j149j229P14K913j84k599k28Q79j506K030J711J1N34
3017F36J481j756m687N025L109k028j835J525L859K891k132m267L57l423q11M22
3001a634RL00K055J037J649k97P2k49l184M1q45K616J181k424r40Q3r39J63L152
2982A846R11l377j055p60M42L440K888L17k418k740k675K370J512l516m18K930
2966c03J348l399m70K818O10m35Q92K343J071l198l206Q06J144M59j624N14k522
2949c152j282L772R10k9O27l734j298K674N41L005M528j860q01q91J712k10k249
$$ y = [100, -2518, -1831, -1251, -736, -1011, 305, 59, -19, -2695, -2952, -613, -2020, -1124, 1649, 216, -2846, -2074, 85, 953, -444, -2321, -1094, 324, -2223, -4220, -2375, 946, 2142, 3914, 4092, -347, -2088, 615, 1838, 738, 420, 561, -1261, -2410, -3639, -2925, -12, -196, -2795, -3023, -2144, -3650, -1620, 91, 102, 636, 2117, 361, -4326, 699, 3808, 1780, -55, 1470, 5329, 8220, 6088, 1821, 2178, -1245, -2056, -1634, -1625, -1325, 730, 1767, 3416, 3119, 3191, 2942, -242, -201, -1046, 1570, 2751, 327, -613, -530, -1469, -1306, 1846, 2757, -620, -1675, -2435, -1993, 1447, 4335, 4652, 2234, -506, -3181, -811, 701, -2815, -3233, -303, 1045, -2354, -2824, -6, 604, 169, 1061, 3404, 4475, 1277, -1929, -1123, 21, 480, -1144, -630, -3152, -4434, -662, 248, 219, 846, -2888, -4186, -1512, -971, 2034, 6562, 4702, 3901, 3010, 4722, 4512, 2263]
2932B263k424k064n44r18Q46K627L330j314p04k78M68m207j021L637J243J620
2916B560J761J627k727l354j451K642M28j667M71o4q78K876j166P43k927r73L146
2899A047j496o02l93l007J53L801j125l829Q84K015m77R69o65K051K927k6k818
2882e91k542J885j110J556P80K294j327m82K135k962m541j901M74o37M649M857
2866B537j357m158M86Q69q87J511J808M24J208L506L08l468m15L59J67J049Q00
2849D747l068j522j08k162l224m7L624O33K82N84r42q47J438L636r81m363n59
2832b879O7J663O27k195q82L447O88J434n77n44M42K216l820j410O25K381k144
2815h61K02L93J803O54j368k517j698L9L507k012j160k039k075M128K444O47l28
$$ y = [2263, -161, -2225, -2769, -3687, -2841, -214, 3116, 1802, 1098, 820, 1288, -2919, -3940, -303, 940, 2560, 4321, 5948, 3221, -133, -1584, 1058, 1486, -181, 290, 226, -652, 2224, 1058, 1801, -1126, -2099, 1047, -449, -1051, -1444, -4451, -4298, -497, -1622, -5451, -4567, -2552, -3029, -2060, -2725, -674, 2253, 2227, -591, -3133, -1248, -2358, -802, -22, 2272, 945, 463, 2598, -364, -4905, -6806, -6332, -6969, -2320, 2537, 1180, -2978, -2492, -1623, -2510, -999, 809, 1233, 2441, 5947, 6255, 2787, 2372, 2731, 2898, 3947, 4747, 1679, 157, 49, -2113, -5337, -5384, -1760, -1127, -845, -261, -1203, -2050, -612, 3024, 2043, -2320, -2879, -2812, -1149, -522, -2717, -3599, -152, 536, 1970, 1393, 849, 1291, 3507, -313, -1723, -1098, 1283, -861, -659, -266, 1537, 2191, 823, -1694, -3392, -3353, 154, -1858, -3018, -5057, -7132, -3004, -560, 87, -241]
2798b41j961j196l02M98P52P6K107R27K396K032r87l123J532L02o718o81K233
$$ y = [-241, -2202, -3398, -3700, -3202, -2450, -2374, -267, 660, 3056, 5088, 4101, 978, 2510, 2812, -3906, -4587, -2354]
$$ [...]
##END NTUPLES=NMR SPECTRUM
##END=
