##TITLE=Analysis number 318350
Compound Code cc 48016
Book Reference 458/106
Project Code adrs
Chemist Name stevem
##JCAMPDX= 6.0         $$ Bruker NMR JCAMP-DX V2.0
##DATA TYPE= NMR SPECTRUM
##DATA CLASS= NTUPLES
##ORIGIN= Bruker BioSpin GmbH
##OWNER= nmr
$$ XWIN-NMR		Version 3.5
$$ Fri Mar 24 10:01:09 2006 GMT Standard Time (UT+0h)  MAYBRIDGE\nmr@NMR_250MHZ
##.OBSERVE FREQUENCY= 250.131544655141
##.OBSERVE NUCLEUS= ^1H
##.ACQUISITION MODE= SIMULTANEOUS (DQD)
##.ACQUISITION SCHEME= undefined
##.AVERAGES= 16
##.DIGITISER RES= 18
##SPECTROMETER/DATA SYSTEM= dpx250
##.PULSE SEQUENCE= zg30
##.SOLVENT NAME= CDCl3
##.SHIFT REFERENCE= (INTERNAL, CDCl3, 0, 16.522)
##AUDIT TRAIL= $$ (NUMBER, WHEN, WHO, WHERE, WHAT)
$$ ##TITLE= Audit trail, XWIN-NMR		Version 3.5
$$ ##JCAMPDX= 5.01
$$ ##ORIGIN= Bruker BioSpin GmbH
$$ ##OWNER= nmr
$$ C:\u/data/dgb/nmr/ADRS/1420/pdata/1/auditp.txt
$$ ##AUDIT TRAIL=  $$ (NUMBER, WHEN, WHO, WHERE, WHAT)
(   1,<2006-03-24 10:00:11.94 +000>,<MAYBRIDGE\nmr>,<NMR_250MHZ>,
      <created by zg, POWCHK disabled, PULCHK disabled
       configuration hash MD5:
       84 BC 41 DB A1 6E 1D 46 DA 25 12 A5 C1 ED C5 3A
       data hash MD5: 64K
       FC F4 7A BF 6F 5A 90 DF E1 93 C1 DD 85 2A D1 DA>)
(   2,<2006-03-24 10:00:35.35 +000>,<MAYBRIDGE\nmr>,<NMR_250MHZ>,
      <Start of raw data processing
       ef LB = 0.3 FT_mod = 6 PKNL = 1 SI = 32K 
       data hash MD5: 32K
       46 45 DB B6 63 B5 A7 E8 74 1A 1C 32 E1 67 79 7A>)
(   3,<2006-03-24 10:00:44.95 +000>,<MAYBRIDGE\nmr>,<NMR_250MHZ>,
      <apk 
       data hash MD5: 32K
       54 97 B1 B2 56 A9 B2 90 8B AB 21 59 15 EA BC 81>)
(   4,<2006-03-24 10:00:48.00 +000>,<MAYBRIDGE\nmr>,<NMR_250MHZ>,
      <abs ABSG = 5 
       data hash MD5: 32K
       DC 5B 83 AE 88 C7 66 BB 19 A0 93 70 8A C9 1D 3F>)
$$ ##END=
$$ 
$$ hash MD5
$$ 41 E2 38 01 C3 0D 30 87 74 D1 31 9B BD D0 5F F0
##$RELAX= 
##$RELAX= 
##$RELAX= 
##$RELAX= 
##$RELAX= 
##$RELAX= 
##$RELAX= 
$$ Bruker specific parameters
$$ --------------------------
##$DU= <C:\u>
##$EXPNO= 1420
##$NAME= <ADRS>
##$PROCNO= 1
##$TYPE= <nmr>
##$USER= <dgb>
##$AMP= (0..31)
100 100 100 100 100 100 100 100 100 100 100 100 100 100 100 100 100 100 
100 100 100 100 100 100 100 100 100 100 100 100 100 100 
##$AQSEQ= 0
##$AQ_mod= 3
##$AUNM= <au_zg>
##$AUTOPOS= <6 >
##$BF1= 250.13
##$BF2= 250.13
##$BF3= 250.13
##$BF4= 250.13
##$BF5= 500.13
##$BF6= 500.13
##$BF7= 500.13
##$BF8= 500.13
##$BYTORDA= 1
##$CFDGTYP= 0
##$CFRGTYP= 5
##$CHEMSTR= <none>
##$CNST= (0..31)
1 1 145 1 1 1 1 1 1 1 1 1 1 1 1 1 1 1 1 1 1 1 1 1 1 1 1 1 1 1 1 1 
##$CPDPRG= <>
##$CPDPRG1= <>
##$CPDPRG2= <>
##$CPDPRG3= <>
##$CPDPRG4= <mlev>
##$CPDPRG5= <mlev>
##$CPDPRG6= <mlev>
##$CPDPRG7= <mlev>
##$CPDPRG8= <mlev>
##$CPDPRGB= <>
##$CPDPRGT= <>
##$D= (0..31)
0 1 0 0 0 0 0 0 0 0.06 0 0 0 0 0 0 0.0002 0 0 0 0 0 0 0 0 0 0 0 0 0 0 
0 
##$DATE= 1143194407
##$DBL= (0..7)
120 120 120 120 120 120 120 120 
##$DBP= (0..7)
150 150 150 150 150 150 150 150 
##$DBP07= 0
##$DBPNAM0= <>
##$DBPNAM1= <>
$$ [...]
##$SUBNAM7= <"">
##$SUBNAM8= <"">
##$SUBNAM9= <"">
##$SW= 20.6930455092707
##$SWIBOX= (0..15)
0 0 3 0 0 0 0 0 0 0 0 0 0 0 0 0 
##$SW_h= 5175.983436853
##$TD= 65536
##$TD0= 1
##$TE= 294.16
##$TE2= 300
##$TE3= 300
##$TEG= 300
##$TL= (0..7)
0 120 120 120 120 120 120 120 
##$TP= (0..7)
150 150 150 150 150 150 150 150 
##$TP07= 0
##$TPNAME0= <>
##$TPNAME1= <>
##$TPNAME2= <>
##$TPNAME3= <>
##$TPNAME4= <>
##$TPNAME5= <>
##$TPNAME6= <>
##$TPNAME7= <>
##$TPOAL= (0..7)
0.5 0.5 0.5 0.5 0.5 0.5 0.5 0.5 
##$TPOFFS= (0..7)
0 0 0 0 0 0 0 0 
##$TUNHIN= 0
##$TUNHOUT= 0
##$TUNXOUT= 0
##$USERA1= <user>
##$USERA2= <user>
##$USERA3= <user>
##$USERA4= <user>
##$USERA5= <user>
##$V9= 5
##$VALIST= <valist>
##$VCLIST= <CCCCCCCCCCCCCCC>
##$VD= 0
##$VDLIST= <DDDDDDDDDDDDDDD>
##$VPLIST= <PPPPPPPPPPPPPPP>
##$VTLIST= <TTTTTTTTTTTTTTT>
##$WBST= 1024
##$WBSW= 4
##$XGAIN= (0..3)
0 0 0 0 
##$XL= 0
##$YL= 0
##$YMAX_a= 351780
##$YMIN_a= -394150
##$ZGOPTNS= <>
##$ZL1= 120
##$ZL2= 120
##$ZL3= 120
##$ZL4= 120
##$ABSF1= 16.522
##$ABSF2= -4.171173
##$ABSG= 5
##$ABSL= 3
##$ALPHA= 0
##$AQORDER= 0
##$ASSFAC= 0
##$ASSFACI= 0
##$ASSFACX= 0
##$ASSWID= 0
##$AUNMP= <proc_1d>
##$AZFE= 0.1
##$AZFW= 0.1
##$BCFW= 0
##$BC_mod= 0
##$BYTORDP= 0
##$COROFFS= 0
##$CY= 12.5
##$DATMOD= 1
##$DC= 0
##$DFILT= <>
##$DTYPP= 0
##$F1P= 14.0000005364418
##$F2P= -0.99999901652339
##$FCOR= 0.5
##$FTSIZE= 32768
##$FT_mod= 6
##$GAMMA= 0
##$GB= 0
##$INTBC= 1
##$INTSCL= 1
##$ISEN= 128
##$LB= 0.3
##$LEV0= 0
##$LPBIN= 0
##$MAXI= 10000
##$MC2= 0
##$MEAN= 0
##$ME_mod= 0
##$MI= 0
##$NCOEF= 0
##$NC_proc= -3
##$NLEV= 6
##$NOISF1= 0
##$NOISF2= 0
##$NSP= 0
##$NTH_PI= 0
##$NZP= 0
##$OFFSET= 16.522
##$PC= 1
##$PHC0= 176.7145
##$PHC1= 5.295641
##$PH_mod= 1
##$PKNL= yes
##$PPARMOD= 0
##$PSCAL= 4
##$PSIGN= 0
##$REVERSE= no
##$SF= 250.13
##$SI= 32768
##$SIGF1= 0
##$SIGF2= 0
##$SINO= 400
##$SIOLD= 32768
##$SREGLST= <1H.CDCl3>
##$SSB= 0
##$STSI= 32768
##$STSR= 0
##$SW_p= 5175.98343685301
##$SYMM= 0
##$S_DEV= 0
##$TDeff= 65536
##$TDoff= 0
##$TI= <Analysis number 999999
Compound Code 99
Book Reference 9
Project Code 9>
##$TILT= no
##$TM1= 0
##$TM2= 0
##$TOPLEV= 0
##$USERP1= <user>
##$USERP2= <user>
##$USERP3= <user>
##$USERP4= <user>
##$USERP5= <user>
##$WDW= 1
##$XDIM= 32768
##$YMAX_p= 413418213
##$YMIN_p= -210156
$$ End of Bruker specific parameters
$$ ---------------------------------
##NTUPLES= NMR SPECTRUM
##VAR_NAME=  FREQUENCY,     SPECTRUM/REAL,   SPECTRUM/IMAG
##SYMBOL=    X,             R,               I
##VAR_TYPE=  INDEPENDENT,   DEPENDENT,       DEPENDENT
##VAR_FORM=  AFFN,          ASDF,            ASDF
##VAR_DIM=   32768,         32768,           32768
##UNITS=     HZ,            ARBITRARY UNITS, ARBITRARY UNITS
##FACTOR=    0.157963299565203, 1,           1
##FIRST=     4132.6476996994, 0,             0
##LAST=      -1043.33573715361, 0,           0
##MIN=       -1043.33573715361, -210156,     0
##MAX=       4132.6476996994, 413418213,     0
$$ Real data points
##PAGE= N=1
##DATA TABLE= (X++(R..R)), XYDATA
$$ [...]
20683 -40047 -66150 -54949 -27636 -47906 -47705 -78217 -86139 -89871 -56211 -25826 -78402 -73982 -29861
20670 -29861 -58334 -104950 -89557 -73443 -25995 8935 44887 30958 40635 18525 16154 44783
20658 44783 57310 -1684 -18659 -21040 -14467 -28642 -13368 -10473 -8613 -4299 -24425 -31097 -44576
20645 -44576 -96664 -102361 -87599 -49770 -67714 -47964 -17164 -32437 -56742 -43168 -46778 -37476
20633 -37476 -16414 -27030 2572 9950 31872 58033 15838 -33034 -41686 -45003 -51461 -20662
20621 -20662 -4090 46674 61452 35217 57750 96293 29638 -22793 12253 -7743 14784 55848
20609 55848 87268 74036 35427 -35067 -67715 -27714 40874 67067 79244 49671 41666 16721
20597 16721 880 7273 -8567 20795 49704 65111 43313 29312 28894 50601 57558 24973
20585 24973 22918 35623 29774 -10270 -11929 -15970 -4773 6438 -11254 -53643 -33529 -36848 -35559
20572 -35559 -13634 -19455 -41093 -57453 -39760 -9589 -48254 -51384 -17104 -15011 -6051 -53701
20560 -53701 -107081 -36321 6720 -32368 -15857 -4786 -26632 -24186 -30778 -42007 -13858 -16415
20548 -16415 -21317 -30772 -23069 -56530 -97972 -71777 -47729 -54059 -62621 -80304 -25054 -27486 -29924
20535 -29924 34494 61061 7185 -86838 -71187 -5423 2795 12090 -10412 -65242 -36073 -3873
20523 -3873 -17881 -18074 46289 18537 2843 -4929 8955 -3775 -19101 8445 -9845 -39033
20511 -39033 25096 17285 -4128 -3311 -24660 20511 26067 -29961 -38373 -36694 -27692 -45839 -92373
20498 -92373 -105688 -93768 -90328 -16030 51829 81377 43396 39256 63437 8090 -55894 -52668
20486 -52668 -79914 -61047 -45722 -37497 -72165 -75307 -82517 -74834 -81983 -98983 -63733 -12 -10195
20473 -10195 -40375 -16225 -33316 -59496 -57230 -82837 -30675 -23721 -5122 -3560 -23211 -53318
20461 -53318 -77575 -66483 -49783 -50876 10226 43667 17768 -30486 -48862 -70862 -81907 -100314
20449 -100314 -104219 -37268 -10764 26887 23564 6609 -382 -49249 -51519 -19233 17756 927
20437 927 701 -804 -34578 -24282 -24532 -5046 44898 45738 51696 51589 23879 47921 77303 91239
20423 91239 51364 38686 6528 -27554 -20966 3130 45520 39785 1661 -32098 -80927 -74106
20411 -74106 -36115 -4526 8707 -979 -52961 -80863 -88762 -67175 2859 45980 18073 -19115
20399 -19115 -10807 -9331 -14116 13940 -23070 -55271 -69758 -13011 -1165 -7205 -33160 -60383
20387 -60383 -72669 -33370 39042 108875 112621 24305 -67013 -38938 -96930 -135021 -94658 -36084
20375 -36084 1680 15891 3682 -33129 -35777 -28301 1287 -58185 -60674 -39296 -17924 20565
20363 20565 -1715 -52893 -63740 -63021 -66591 -60637 -41239 -81478 -46238 -31184 -73243 -41155
20351 -41155 24944 93504 96101 58785 -13210 -54500 -1253 27980 6928 -26120 -34034 7290
20339 7290 15389 4363 -44474 -4020 515 -34358 -53533 -61420 -46502 -88505 -95250 -22280 -28329
20326 -28329 -71495 -68808 -25800 -8195 -35299 -34857 24725 61574 65906 60672 -13210 -42182 6094
20313 6094 25733 -4465 -44543 -84554 -83124 -94343 -117564 -82287 -23014 -3937 -337 11855
20301 11855 33749 24758 -43060 -64489 -34807 9196 -13422 -15061 17113 64924 62236 8336
20289 8336 -21076 -20449 -22465 -28953 -15879 -3626 -18089 -28930 -19103 -33632 -45819 -73476 -101292
20276 -101292 -104704 -24380 27260 -15681 -45366 -52091 -34206 -42103 -37649 -40047 -43274 -43930 -47019
20263 -47019 -75732 -35217 11627 32444 57894 57685 34548 992 -14344 -7980 -14088 -32397
20251 -32397 -67093 -26312 -45607 -62086 -54797 -22464 -58707 -54188 -53792 -27275 -28636 -471 34912
20238 34912 885 -4883 -54232 -68257 -64440 -90672 -77935 -47378 -42336 -61279 -82824 -95506
20226 -95506 -28147 -16747 -18076 -37218 -36828 -36269 -33653 25531 56080 67673 2593 -51246 -55466
20213 -55466 -32173 -29203 -52417 -48010 6131 -28931 -62974 -88183 -72051 -32937 -4459 -7811
20201 -7811 -26093 -63001 -27180 -19653 10336 11827 -9890 3731 -2751 -16202 15226 17733 -6905
20188 -6905 -2633 -59708 -64439 -62956 -85687 -57017 -15567 -35253 -22987 8478 35428 9072
20176 9072 -22112 -17102 -11395 -18009 -18795 11123 67422 65784 49067 5740 -37531 -28966 173
20163 173 4060 -8118 -48753 -87780 -66608 -34527 9564 5458 -60348 -94127 -82731 -26706
20151 -26706 -22595 -5798 27075 42759 -6073 -29967 -86021 -79935 -26886 -17609 -41064 -40503 -68535
20138 -68535 -34712 -75247 -82338 -49557 -53247 -62542 -63717 -42852 -55409 -27539 38981 34615 -5858
20125 -5858 28724 11689 -32320 6749 74378 95713 73992 36 -29920 -41011 -30385 -5993
20113 -5993 -30362 -80658 -77192 -45959 -40268 -47650 -64947 -78242 -80078 -47181 -28609 32897 38173
20100 38173 -25049 -44968 -85195 -97176 -69067 -17900 -14828 -45619 -31866 -41589 -65091 -83109
20088 -83109 -16438 15531 29025 36708 51734 22013 9241 25862 79880 47802 35975 504
20076 504 -3657 -43611 -56967 -28629 -27332 -33403 17414 57022 31956 48474 37286 43136 28334
20063 28334 -32257 -75861 -30796 42835 46202 15184 1828 45636 60116 45841 29701 16546
20051 16546 -49267 -86153 -29100 10417 60635 59341 -11972 -16712 -9389 32031 108556 78119
20039 78119 -42317 -40256 -9824 -47519 -41301 -38489 -59134 -96518 -126150 -126056 -89991 -58346 -53584
20026 -53584 23786 100042 31873 -52538 -75233 -93175 -26138 32658 34056 2510 -23835 -21282
20014 -21282 -40777 -40416 37068 25746 -6232 -9607 12982 61767 39723 18627 20594 23264 20994
20001 20994 98652 131317 78150 25530 -2296 -43249 -41490 -33389 42708 29518 -21523 -25798
19989 -25798 -15194 -4127 -21884 -16213 -13118 -14840 -54267 -89853 -15899 41220 66046 57776
19977 57776 48165 21676 -12056 -35029 -83274 -29728 -27162 -13041 -11158 6929 10730 -21680
19965 -21680 5167 31712 -17900 -54079 -102610 -74784 -87505 -54814 -42292 -22749 -26254 -30342
19953 -30342 -26387 -13623 4432 11301 17215 -18306 -41385 -29640 7571 -13985 -59186 -18516
19941 -18516 31687 43220 -15439 -11815 -12899 -20244 -19945 -25320 36854 45301 855 -35015 -2138
19928 -2138 -2708 -34046 21634 13560 13145 -33388 -99376 -71621 -94026 -83450 -85709 -127702 -116053
19915 -116053 -52192 -14945 -64782 -66554 -37306 -70393 -55854 9887 22849 12252 -2287 -15199
19903 -15199 -79651 -92688 -67481 -69145 -44997 -61712 -69009 -16538 9446 12861 -6634 -22422
19891 -22422 -44581 -36917 2084 -18371 -56836 -51892 -43931 10363 56068 38728 35221 21788
19879 21788 23587 64649 12456 -37648 -70345 -61426 -27100 -5266 -31801 -30846 -64151 -59862 -27408
19866 -27408 -29134 -41833 -16895 -8387 2326 6034 -9086 -15635 9408 28397 41268 19275
19854 19275 -43818 -101070 -115756 -139083 -140927 -90928 -81338 -119649 -64227 -9519 -45197 -82829
19842 -82829 -55806 -51470 -98896 -106302 -88064 -86367 -95951 -91373 -34513 -16287 -2149 -17677 -38782
19829 -38782 -47630 -18645 -15347 -23189 -29209 -60608 -49890 -27374 -16679 -22032 -73676 -90662 -99825
19816 -99825 -99063 -67109 -4613 20020 -22397 -38898 -76243 -29972 -6734 -15412 -59420 -159343
19804 -159343 -160363 -50171 -13423 -41564 -139814 -210156 -162199 -115138 -84241 -83248 -81947 -50306
19792 -50306 -25314 23500 20629 -13661 -5265 -22736 -21163 6330 2764 -13509 -10666 -10271 19393
19779 19393 27555 -28380 5112 53785 56951 55357 50543 -5155 -75560 -63328 5790 25796
19767 25796 -6017 -24872 -65740 -63266 -25427 -31093 -42336 -32058 -43228 -68723 -54190 -3349
19755 -3349 25973 1514 16995 29843 28304 38389 -7363 -88085 -31051 29837 40717 43233
19743 43233 5851 -37355 2405 13256 -18350 -62714 -48374 -17988 11593 33243 36265 77405
19731 77405 39801 6759 -28115 -67767 -64024 -51569 -69065 -73601 -109544 -102889 -92756 -97271
19719 -97271 -70275 -17597 8084 -17799 -30527 -31574 -17421 -14633 -50010 -15899 2392 -3356
19707 -3356 -18654 12325 3936 9547 35687 47678 -7092 -23853 -27924 -75910 -109879 -108098 -82874
19694 -82874 -108233 -119922 -110310 -13009 64796 39364 -20830 3483 12615 1553 37727 39236
19682 39236 40018 4824 -40055 -51963 -20684 -1892 -36177 -27419 25638 -7956 -63163 -19887
19670 -19887 -6556 49268 69515 27176 18600 74139 119595 103219 53619 -8312 -20590 -45664
19658 -45664 -9876 7257 24375 3583 -68314 -14792 22941 55195 43005 21010 21520 -32765
19646 -32765 -52265 -45481 -40620 -16654 -31360 -30858 -56849 -128265 -116444 -88906 -26016 -61146
19634 -61146 -112335 -98346 -56392 -17885 -11349 21442 -4233 -21774 14520 16670 -15236 -66423
19622 -66423 -74747 -59795 -70945 -93129 -133601 -136974 -39010 -2065 -28763 -6587 -1191 -35670
19610 -35670 -53884 -82392 -25358 -6455 -67162 -100817 -127668 -124310 -81640 5209 22066 -22157
19598 -22157 -99280 -50954 6895 38232 2462 -16266 -42571 11937 37627 -14335 -34373 -25823
19586 -25823 -53360 -11696 2452 -2097 -13892 10756 -23525 -78660 -57150 -4277 42431 62264
19574 62264 17155 -11959 -2209 -10750 8699 14075 17664 39044 42478 1137 -17771 -33135 -41404
19561 -41404 -45870 -63331 -103126 -96150 -87453 -40657 3129 -6470 -2429 14829 -48999 -69763 -100798
19548 -100798 -95865 -71921 -123876 -152588 -98744 -64592 -46220 -83137 -30015 18958 80492 111158
19536 111158 102804 97070 39018 19766 -24997 -40870 -22459 27831 66051 54409 19747 30452
19524 30452 27723 13592 8706 -25547 -2218 15599 38576 69009 58951 52751 34806 24790
19512 24790 71000 85308 22144 22105 -10162 -57969 -60511 -45960 -30715 -68779 -71953 -18129 -12093
19499 -12093 27977 74651 24082 -32138 -55835 -48272 -26913 -26707 -45639 42222 65347 44546
19487 44546 36194 15400 30273 -12005 -6410 9966 24336 -234 -15101 -29012 -12227 35463
19475 35463 -9490 -69960 -118436 -94213 -34964 -38881 1552 37255 30838 19695 -8915 15920
19463 15920 -4732 -26242 -61204 -77009 -90902 -44623 -781 -5978 117 882 13497 10394 139
19450 139 -29986 -76294 -47275 -7491 -35867 -35277 -27093 -4244 25530 71057 75615 40405 43299
19437 43299 16677 17230 -6715 -21756 27921 27289 43401 72883 65302 63242 8870 -21933 -9275
19424 -9275 -13033 -1033 -5282 -76305 -84966 -40949 -22798 -11440 16556 -223 35764 135150
19412 135150 117994 40582 1570 -8872 -45180 -79870 -75160 -34658 13351 54565 22498 10308
19400 10308 22614 62511 33629 -42373 -21666 475 -23865 -94762 -115109 -72154 -42624 -44060
19388 -44060 -38185 -30040 -6852 27496 71037 102470 41694 -20482 -39122 -5146 -30976 -58401
19376 -58401 -19543 -17013 32382 56586 -4449 -52858 -19508 20266 23054 15891 -88686 -36580
19364 -36580 35754 76434 61230 74346 68802 14018 -73536 -87400 -20172 34629 77863 82785
19352 82785 54509 314 18404 39622 76199 70968 40606 10773 -19720 -21445 -27325 -35091
19340 -35091 -45935 -51121 -35766 -37747 -41007 -37269 -87314 -59500 -20694 36282 4970 30372
19328 30372 76885 93725 71509 112425 98822 78941 46992 47788 77994 48313 27738 -51267
19316 -51267 -113357 -122842 -79745 -35825 -37447 4734 22511 4016 -10693 203 -48362 -77578
19304 -77578 -89217 -44964 14152 12610 -44682 -54749 -45051 -28162 -34683 3973 -2146 -43096
19292 -43096 -44908 -50961 -50083 -62188 -91656 -58746 -19153 26232 4657 -57466 -76606 -42479
19280 -42479 12134 -1440 -15306 -43411 -42629 -14681 -45664 -91910 -131055 -155906 -116539 -116029
19268 -116029 -121805 -40012 5878 27595 22563 10648 1285 -24891 -29335 -65184 -81376 -66674
19256 -66674 -12407 -13950 -19221 6886 -27191 -46632 -62948 -18412 -29623 -38110 -67039 -75771
19244 -75771 -70020 -81087 -41945 6775 50137 37301 729 -9830 -559 19737 10437 -15136
19232 -15136 -28978 -20610 11924 -38 3754 19491 -5773 -68417 -138945 -121901 -78630 -60117
19220 -60117 -71842 -71796 -111397 -107747 -70651 -28864 11412 15431 -42983 -14785 -3661 -12643 19966
19207 19966 22382 -45432 -53219 -38149 -17821 -47339 -46700 -31014 -40320 -71120 -43005 -23908 -9417
19194 -9417 -8656 -20293 -16742 14565 34071 64949 71246 109207 96205 60095 47369 49174 24401
19181 24401 -2730 -31665 -37873 -51674 -37846 -45329 -67767 -74467 -93767 -113382 -91211 -84542
19169 -84542 -53907 -3804 -45969 -75018 -96523 -123500 -180623 -177408 -123673 8261 29176 -32843
19157 -32843 -48178 15350 -21007 -27509 -11074 -57177 -96441 -124212 -113934 -100565 -68768 -60747
19145 -60747 -32481 -86143 -114165 -145686 -158018 -123605 -102178 -111269 -107202 -120154 -115454 -68445
19133 -68445 -26873 -15859 -65380 -69704 -16507 7260 10886 8836 -7018 -70690 -61910 -8063
19121 -8063 37821 16388 29920 20127 9376 24401 25125 65712 78446 36707 -31475 -31321 -43484
19108 -43484 -41518 36460 13689 2804 7338 11561 32673 42053 25370 430 26536 4200
19096 4200 -16337 -32801 -40338 -52207 -19887 29188 6558 -55368 -41298 -14089 28474 6453
19084 6453 -10052 14455 41008 42906 24842 53502 34686 -9682 -48390 -49474 -2463 27230
19072 27230 48382 59802 78077 51335 65491 70428 67246 23622 15452 11656 23345 43243
19060 43243 6015 10891 24673 51968 71403 36803 20420 11594 32867 51734 79431 91298
19048 91298 126675 129003 79913 77478 148179 125908 65928 9005 -23207 -31964 -17896 -7703
19036 -7703 25474 48844 114607 118183 122220 138443 124537 108634 56143 10383 9776 52152 52668
19023 52668 132529 51990 -25100 -37517 3877 25717 90595 100935 130745 101232 99802 115165
19011 115165 116014 89963 66304 82575 68365 24823 38538 113468 199055 247133 249170 228925
18999 228925 250149 267353 178671 110847 106532 86220 138992 178418 193081 187365 124669 99179
18987 99179 62561 -10283 -8269 604 5249 -6631 -5534 -12992 6795 43330 72506 85353 47994
18974 47994 68344 97782 88939 110337 99008 39587 -25481 -64965 -17419 8566 42480 87143
18962 87143 109390 123420 128023 126417 131476 191366 249009 225004 168472 153086 136229 102391
18950 102391 58351 5892 7462 66554 124740 126687 106737 102381 47868 61030 99132 44550
18938 44550 -17060 -10758 -29459 -31416 -28691 -80033 -48394 28422 33772 18867 110610 138089
18926 138089 111311 42195 38506 36088 9114 -25720 47077 139442 133499 107738 51433 45716
18914 45716 76433 78356 92602 140895 92434 44559 48071 68946 2799 -9748 -31983 -93142
18902 -93142 -97946 -92495 -83453 -39175 -20481 -5607 -19210 13693 53367 33047 19193 22998
18890 22998 41724 59146 70132 38578 65902 29483 -8512 7429 25128 81787 175445 176813
18878 176813 135876 119366 165907 124593 76140 110145 139862 238724 291457 275425 263554
18867 263554 207062 172625 190090 179942 176358 116779 41926 80233 95412 159503 218542 227705
18855 227705 233415 163590 122404 132715 114101 153971 160748 122130 111590 134769 162841 169131
18843 169131 160202 141572 184066 189209 136914 110758 84716 98360 132744 127396 148948 173400
18831 173400 182983 218479 272817 266082 266495 236842 215124 153631 167180 180723 145308 138992
18819 138992 207643 249622 211181 184047 146053 157255 226127 246405 171819 122367 110662
18808 110662 116270 64733 39854 109998 121751 147083 148491 100430 15714 -18951 -7239 -8195
18796 -8195 26933 49293 77742 119174 90711 88233 84319 59644 71500 98680 66471 66805 59055
18783 59055 43536 64846 81075 62043 36033 -31726 -22015 12375 62966 73798 64619 50325
18771 50325 6642 -2833 -2707 36446 43357 70855 150104 255242 407092 459556 390412 312985
18759 312985 248411 206743 153587 96911 32214 8136 40164 70725 91900 78958 27921
18748 27921 -15836 -32774 -27000 -14641 12215 10918 -3031 49831 39109 26810 44995 37968
18736 37968 22357 44594 10329 -3758 4895 -16380 -46848 -55050 -9011 -10635 12720 -8872
18724 -8872 4527 38019 75775 78798 66413 57176 29237 -20620 10309 43491 35376 80263
18712 80263 151692 174744 118306 56047 84040 132341 83596 119846 118442 29192 21871 44327
18700 44327 52398 49862 60071 24731 757 43156 70459 44458 44466 57179 71949 52295 41328
18687 41328 2677 40977 25125 42716 58863 45325 16014 50642 69389 81096 29436 18087
18675 18087 -10917 -47106 31106 63825 94243 85343 60224 54491 44441 63639 47975 -10407
18663 -10407 -53658 -53288 -50355 -13420 -2290 -30673 2101 68991 50895 -20153 -20014 36641 97355
18650 97355 97734 97041 118933 45826 74027 104323 119141 133111 109062 68696 39594 52111
18638 52111 58622 70410 73377 72202 56745 78063 88833 76845 36986 46238 80406 78429 56555
18625 56555 36728 -41122 -2793 58383 133742 115982 100502 92616 109386 114757 76953 15556
18613 15556 -11496 9246 14293 42178 77066 60487 86342 137591 180570 188176 198608 246091
18601 246091 222501 175281 118930 102778 88082 97863 139409 148684 176189 169718 180203 193344
18589 193344 222902 232950 208374 166142 146546 171422 224943 274043 301229 314036 291504
18578 291504 289369 376788 421905 373150 398981 445847 521072 553266 583408 655047 674875 698605
18566 698605 833211 1041422 1275061 1555860 2064180 2971755 4059745 5316535 6708214
18557 6708214 7834350 8010767 7244533 5907187 4463083 3460438 2977010 2873783 3074498
18548 3074498 3699882 4928064 6867656 8949804 10379550 11285265 12108312 12495606 11904035
18539 11904035 10420732 8324618 6208067 4863979 4246760 4144042 4465186 5199958 6372461
18530 6372461 7377114 7539643 6928389 5842274 4718462 3947413 3597881 3662974 4063904
18521 4063904 4812980 5746521 6592467 7315150 7782643 7746766 7486715 7159708 7113498 7802204
18511 7802204 9408539 11498067 13338922 14980138 17367977 21512902 27306270 33440866
18503 33440866 39552467 44243517 46224439 46071437 42662442 36280360 29334931 22875748
18495 22875748 18481162 16813929 17433483 19478090 21248583 21474412 20527894 19187424
18487 19187424 18240485 18204125 19385029 21061877 21455145 19830128 16749847 13006086 9993880
18478 9993880 8170714 7227912 6691470 6441763 6432585 6562139 6892749 7598049 8910785
18469 8910785 11135917 14750175 19925593 25122624 28018185 27876484 25650231 23034988
18461 23034988 22060741 23952323 29366301 39059200 52409653 66564385 77038337 80797486
18453 80797486 79222974 75276980 71028541 65095661 56518567 46515871 36960506 30631042
18445 30631042 28134815 29013485 32768199 38042967 42974072 46445749 46946006 44089162
18437 44089162 39150608 32767083 26744470 22247802 19795109 19975859 22919431 28132962
18429 28132962 32781371 33544186 30175423 24160399 17927340 13589372 11101481 9809759
18421 9809759 9326365 9677145 10840820 12100391 12335558 11283445 9512845 7664875 6268376
18412 6268376 5491203 5185151 5104176 5290323 5690559 6438669 7577008 9569913 13018657
18403 13018657 18445097 24681529 28941960 30015416 28540600 26143166 24503743 23079856
18395 23079856 20458166 16920111 13125013 10103037 8244610 7069551 6145761 5393647
18387 5393647 4722576 4213017 3819347 3480497 3259663 3122634 3010099 2993610 3133307 3312295
18377 3312295 3473773 3627721 3785100 4056684 4474302 5097022 6035506 7054646 7724723
18368 7724723 8031794 8207806 8611899 9895339 12521031 16732610 22001831 26905436 30487105
18359 30487105 33620290 38378931 46303359 55965408 63858848 66701353 63210444 55768633
18351 55768633 47692283 41973043 39568422 38830589 38959640 40465752 44003300 50388582
18343 50388582 58086805 62974780 63314893 58781745 49909129 39774074 30406319 22859486
18335 22859486 17752272 14633688 12721498 11783579 11707254 12428962 14026337 15808016 16457179
18326 16457179 15629259 13735586 11438434 9653651 8573513 8110482 8168787 8876402 10617786
18317 10617786 13634379 17352281 20293410 21415068 20244234 17708035 15230753 13799371
18309 13799371 14035079 16219260 20092789 24616725 28978567 33496480 37426860 38964414
18301 38964414 37646736 33636604 28089858 23576332 21363401 21575915 24005385 27794930
18293 27794930 31596434 32697317 29883297 24463463 17970658 12569578 9131263 7087840
18285 7087840 5821178 5008920 4423245 3926667 3541884 3258927 3021341 2880914 2909604
18276 2909604 3016151 3265057 3510780 3609967 3440410 3055530 2578820 2204836 1903273 1664166
18266 1664166 1469857 1287993 1140462 1044769 958283 884047 841456 771827 815324 844365 804302
18255 804302 821523 855660 779969 744742 678263 605216 536581 554255 539118 533771 551784 558446
18243 558446 557994 564661 529291 504293 507134 518077 481168 445420 386403 376509 381830 391577 429013
18230 429013 445351 384926 421588 456523 497744 537262 519085 484671 472088 472181 483909 462553
18218 462553 435660 414436 405526 406356 382107 388415 398203 403365 387705 339364 286507 264699 251700
18205 251700 278857 291251 280078 281897 255846 274957 241730 252807 308105 296400 247026 235873
18193 235873 218678 250719 238343 266103 264755 203028 212172 236257 265558 242221 188769 137949
18181 137949 147714 142429 137181 149468 165007 233027 259628 248686 245389 241069 249981 220571 200188
18168 200188 189370 124370 126754 164221 179295 178129 204376 234538 191825 167519 190987 241249
18156 241249 267859 276519 305056 304427 290171 242279 281566 306367 310508 287871 263407 307094
18144 307094 327853 323838 315069 322461 344436 362605 394946 448006 442730 479435 549727 608551
18132 608551 630864 552749 569575 601663 666385 715926 758130 829396 962786 1065926 1101985
18121 1101985 1192368 1388367 1610103 1855564 2111774 2410536 2797036 3383442 4253485 5495695
18111 5495695 7340418 10236900 15228929 24661031 42874308 70216365 90395415 90504159
18103 90504159 76443093 52238710 31348771 19537873 13312035 9805675 7672966
18096 7672966 6208943 5063695 4245248 3576595 3055520 2674757 2368876 2115729 1928472
18087 1928472 1768881 1596406 1423422 1269675 1153818 1037607 1013130 992378 937782 842077
18077 842077 751025 773969 769432 694205 614029 537419 509797 468771 480458 461612 391639 370268
18065 370268 346046 323654 318119 303409 281164 352820 329003 319659 276404 232123 185419 232670
18053 232670 221069 167331 133127 126026 91764 132480 191602 262542 230792 202383 192254 197310
18041 197310 210152 230967 229998 258332 253525 230562 234275 232215 260108 268157 242481 224348 214991
18028 214991 243777 301230 289104 278620 235270 177952 182901 233365 246217 264949 286163 340533
18016 340533 398676 411410 414813 406014 347636 271513 234087 247240 214346 126571 130303 104877
18004 104877 100864 121767 111301 80211 150496 151149 136222 150274 194155 235792 208657 142807
17992 142807 96341 94353 127148 141814 174252 233178 258224 255742 201280 158994 182473 205518
17980 205518 179313 116580 144303 229889 231666 256854 282658 308058 373657 400029 426990 445555
17968 445555 395117 321055 248318 241927 292646 266888 247552 227114 235425 220701 233160 238133
17956 238133 235397 255143 280141 281469 242380 259599 272339 287896 297448 228010 195440 193923
17944 193923 211490 236174 284352 270000 224145 187749 209014 204006 185719 204086 254912 185250
17932 185250 166076 199936 237952 239509 272229 278915 205027 186196 196828 217097 227716 200524
17920 200524 164816 168977 150182 100362 101246 140404 163971 174163 166120 175628 151665 130657
17908 130657 126522 88410 28090 -5142 23813 82632 102633 89137 75949 127262 148550 151843
17896 151843 202569 212445 183336 223168 288936 266275 249496 240715 228293 223849 182499 169040
17884 169040 206335 232108 196166 160753 143858 121217 123364 105594 86739 69543 53794 64754
17872 64754 43243 46164 84145 72755 94066 131369 119800 129974 169371 138206 98180 145121
17860 145121 208813 268690 246265 199761 170285 132434 126231 176117 230912 201697 224454 270685
17848 270685 311404 359392 367692 337315 293070 276730 259221 249191 169552 181163 202687 188721
17836 188721 211137 266098 277279 254335 285029 286909 276066 257427 271234 228799 184997 144343
17824 144343 110908 141874 151290 82914 81323 38189 22963 47364 61677 94186 159470 215544
17812 215544 221434 166126 94284 82586 91104 125064 144817 191824 194036 156230 129599 103469
17800 103469 107950 160274 193405 227913 253273 238495 266932 282180 271077 275394 242475 212088
17788 212088 216944 249103 285150 232621 157369 150837 164351 128952 126032 135935 131563 131882 173814
17775 173814 229016 227007 168033 184717 203638 185496 179325 233940 256996 235662 198183 207245
17763 207245 213670 110934 64658 59587 29451 42295 46952 32581 16729 -8256 7586 9566
17751 9566 -18299 28007 69503 73052 19882 -13315 61387 57692 33756 58755 71619 71373 79239
17738 79239 108610 129517 113624 50957 -15876 -7407 23467 34394 60166 63106 37008 8977
17726 8977 25781 43610 80984 132410 121375 59626 27512 3912 32541 39481 -7309 -53711
17714 -53711 -15256 29787 41553 38140 25432 9453 -4200 -22672 -51205 -31982 12804 75
17702 75 50389 90111 99364 91505 47930 57750 2721 -48605 -18555 48146 42510 -1469 18171
17689 18171 28267 2897 39201 92022 78998 59446 65990 57763 -3977 -22455 -40892 -40478
17677 -40478 -56534 -81576 -46462 -7336 32693 80443 68509 79907 27536 5112 30661 51714
17665 51714 -15511 1983 28794 31661 17747 5898 56751 40154 13330 19346 -3719 -38304
17653 -38304 -13732 42617 80836 25166 -17926 -17191 37324 31107 15241 41625 95357 53070
17641 53070 59002 54170 52115 47560 87569 105389 98165 33075 -24195 17082 17921 10440 3026
17628 3026 47332 84083 113111 155923 139416 101013 56985 64656 52581 38210 24528 45949
17616 45949 32904 1055 9319 19468 4826 -37754 21437 30340 40449 26328 60238 -5750
17604 -5750 8680 28034 6568 -20692 -50225 -62975 -38581 -33758 -49175 -47868 5561 -2187
17592 -2187 -58441 -25655 44327 78528 49463 25082 -35757 -8679 72805 76390 59680 21789
17580 21789 7735 -20010 -30188 -76815 -68024 -39898 -28670 -30937 -34046 -18961 4829 18997
17568 18997 43719 -2096 -27492 -49337 -43513 -51280 -17232 43215 78128 97174 53707 47984
17556 47984 30408 10806 27392 22584 36710 32115 5993 30677 63666 130089 126669 121607
17544 121607 137016 136802 132214 109517 96542 88870 40017 93190 118350 146896 156622 99501
17532 99501 71788 134299 113348 46757 34811 19848 6500 41341 72721 69512 89673 111000
17520 111000 65813 23297 44091 45979 -1095 12439 23927 -1863 -28792 -7957 -1808 886
17508 886 7462 -7614 -31278 -9026 22963 11910 -7118 18888 14424 63538 56982 51016 52360
17495 52360 41254 48354 29160 48438 91612 79179 54249 84273 134432 76627 41807 13479
17483 13479 -15753 -15900 -50676 -50437 -31197 20632 59302 84873 90157 22135 74772 65852 18961
17470 18961 13607 73187 118653 119794 93547 48279 -21231 20860 65530 74093 22884 -9171
17458 -9171 25109 59318 42383 35434 31594 14684 27055 45935 77467 139644 154764 73851
17446 73851 28673 93356 174088 176656 209728 278529 406815 555110 583692 538480 427920
17435 427920 246281 147770 109244 118605 193965 207537 145135 59927 52011 67029 103991 73744
17423 73744 60109 55224 27057 169 -9273 4743 -15867 -6539 -56126 -46042 -18547 -15578
17411 -15578 -25498 -51328 -41393 -12066 42698 40129 62556 46210 69275 81021 22423 -1153
17399 -1153 11847 67359 14171 1172 -17508 -64493 -60648 -69694 -25897 -23633 2356 36377
17387 36377 76040 51627 52788 67401 89536 31767 -22256 -38897 4948 76759 135779 148645
17375 148645 102557 83645 47767 -10732 -18052 39332 60607 59776 61017 67316 36251 -3945
17363 -3945 -50226 -33478 -2480 -4661 -10902 -11116 -75575 -85295 -22723 11599 -17297 -63226 -82357
17350 -82357 -96050 -42239 10912 51014 53257 6379 19455 47147 94952 147663 145955 112652
17338 112652 84965 70715 55739 42208 -999 15603 49122 68723 62856 65525 67395 73431
17326 73431 96778 95497 47494 -17919 21343 7784 5893 6439 26733 94571 102102 59852 11516
17313 11516 -101906 -120708 -88674 -55275 -7311 -26926 -58614 -29020 44743 103850 52046
17302 52046 6401 -43190 -56583 -80593 -116834 -38738 56875 101048 38382 27959 40270 26155
17290 26155 -5559 10665 -2580 -24421 -19264 -47200 -52983 -52510 -69063 -75398 -31932 40288 34628
17277 34628 3384 58626 107060 100922 77673 46342 9140 -20414 -37611 -14761 54342 85493
17265 85493 63861 40760 49498 85147 119511 67939 50581 92452 88443 80948 77245 50094
17253 50094 75112 68310 83185 86274 60493 60939 95962 94848 67356 -43333 -77132 -103729
17241 -103729 -96452 -118575 -143077 -108278 -46760 -9813 -27761 -87173 -127868 -88690 -30110 -11956
17229 -11956 -17149 -7232 -39137 -31168 -41132 -42769 -22751 -4316 9650 21313 21282 19186 -33
17216 -33 -3682 -2536 18854 -1233 -10282 -12655 29464 64373 52144 80043 117471 121815 85072
17203 85072 60764 12576 23284 57635 76870 63190 12327 -11929 -6770 18908 39233 36065
17191 36065 -10896 26023 47370 -31619 -111012 -67784 2077 -11347 -52495 -51714 -62134 -44784
17179 -44784 43520 53774 43236 27908 74157 38890 -8791 -30654 -6763 3733 -23849 -21445
17167 -21445 -36070 -32955 -37860 -37841 21005 32982 -19190 -20757 13379 48945 -286 -4286 -3077
17154 -3077 19203 53964 57596 71398 72595 116590 138466 124199 44213 6470 -46639 -42720
17142 -42720 -12643 -10430 -20821 50343 82029 49773 48849 64704 49516 3384 36114 57119
17130 57119 28143 20059 38184 59419 82656 73824 64064 62312 41864 66046 34434 36887 17681
17117 17681 -8895 -37250 -45734 12708 79666 51744 37008 74963 39873 -22064 -53445 -8724
17105 -8724 38212 27075 6787 -32362 -25478 25627 76581 73289 85174 84389 -7235 -74725 -36677
17092 -36677 34913 56551 48472 30893 18889 -28444 -44074 431 50774 90385 60862 28178
17080 28178 40884 77957 109340 98795 76930 64324 99082 140653 148979 124281 68755 70719
17068 70719 37989 -10571 4188 37074 54580 31482 -10989 -5383 18110 -13051 -58439 -38606
17056 -38606 21562 75758 58442 29240 24089 9227 21168 8960 48633 107904 130763 104598
17044 104598 64144 38487 63787 43540 16727 -29960 -56139 -28070 -58603 -26480 15067
17033 15067 12745 -74442 -53670 37831 48416 37867 80297 89510 42401 64442 82711 61199
17021 61199 29055 -25284 -70573 -60767 -30264 7116 -21817 -51919 -39385 -23070 -6013 -68435
17009 -68435 -88072 -34828 9076 33947 2254 -29109 -23618 25561 47993 -10895 25882 43384
16997 43384 36833 28728 7123 39621 -11583 -31553 -20539 -76718 -84135 -66219 -28951 -26381
16985 -26381 3179 34312 39802 53467 66925 49437 45826 70836 46764 4204 -26534 -45903
16973 -45903 18311 28425 36653 54030 76832 57611 12506 -11800 -32876 -13356 -486 -17354
16961 -17354 55553 138408 101699 40233 50371 60978 55171 -18399 -17719 14082 -2009 -36368
16949 -36368 -74965 -72911 -48084 2208 -7697 -2565 -31872 19511 9236 -8137 -6632 -33553
16937 -33553 -20690 -18234 9253 32408 17702 8026 -43566 -72867 -16766 -2184 -66979 -50241
16925 -50241 -42701 -12636 23073 -13030 -981 6881 32439 22334 -13780 -5826 448 13107
16913 13107 4103 27494 38207 -1330 -10828 -60043 -62823 1405 5622 20007 -12671 -17341 55809
16900 55809 45320 15168 7707 -7912 -8500 915 10866 78369 51490 -27342 -33052 3906 -7210
16887 -7210 -26675 -10220 26080 15292 17512 66857 37030 47874 78986 72372 -8222 2849
16875 2849 -17897 -65980 -28817 -19867 -23213 -25212 -32578 -22298 -43886 -45796 -47845 -50582 -31986
16862 -31986 -35752 -9215 -727 102 -32897 -38723 -59923 -49949 -41010 -38731 -56398 -80037 -45292
16849 -45292 -7817 1053 -27867 -49915 -33643 -26721 -48763 -59411 -26124 -13076 -8093 -17723
16837 -17723 42911 72094 77467 115644 105392 59646 -24831 -15800 2327 -44422 -85935 -101490
16825 -101490 -75107 30076 83880 66416 86151 100708 81969 70470 10416 -49578 -20960
16814 -20960 16032 -16391 -38460 -68807 -74198 -55596 -30630 -8713 11073 -2058 -14004 -25976
16802 -25976 -64670 -97672 -24450 849 -29436 -8661 -926 -23274 -55500 3972 42642 21745
16790 21745 24479 10608 -13685 -18654 -61129 -50949 -73409 -90062 -96384 -26062 42462 24192
16778 24192 40113 7837 -74211 -71397 -45119 -6426 30118 41580 58166 39899 7769 -17308
16766 -17308 -9893 -14432 14937 32016 25425 12101 -9027 1510 30862 31492 -10309 -42368 -94789
16753 -94789 -110035 -54067 -21738 -21153 -17323 5404 15938 15328 5024 12602 39116 42507 14896
16740 14896 2426 -12763 17434 37381 75752 81147 72032 63933 25275 24586 30049 2814 28268
16727 28268 29223 -33941 -17032 82490 96300 39832 53897 61526 6440 18998 63855 26143
16715 26143 -14436 -53899 -68293 -50612 7987 30944 22969 23523 9557 -38065 -75987 -70057
16703 -70057 -50735 -47689 -51168 -44408 -31735 -27781 -24607 -15261 -36183 -53977 -52836 -40742 -34036
16690 -34036 -11291 -45988 -70715 -34753 -17975 6886 52470 59383 23618 20027 16712 6002
16678 6002 13465 46100 46209 35161 24386 34103 2058 2159 -29659 -6713 29198 22230 41061
16665 41061 24551 303 18680 -31218 -65094 -94011 -67103 -40444 -37491 -62148 -78511 -25527
16653 -25527 -3102 -7320 3343 -28098 17486 73019 88453 38331 -8508 -25689 18347 42161
16641 42161 40412 73262 61838 54737 58504 4927 -50922 -52469 -50466 -23498 -48331 -88014 -68936
16628 -68936 -50029 -15776 -49372 -54027 -48629 -11618 10970 12507 -17077 -68741 -78975 -75120
16616 -75120 -102768 -96407 -52097 -26712 -26888 -17163 10779 8774 -3923 -28548 -35652 -21480 -72951
16603 -72951 -61066 -81727 -17915 56916 62161 66248 33877 27112 -6466 -52814 -60504 -50562 -9752
16590 -9752 -22907 -5425 -26479 -55577 -51715 -39322 -24316 -5252 6116 -18616 -65808 -80730
16578 -80730 -34734 -4540 4251 -30336 -19404 3288 -6410 -39258 -30967 9286 37808 -10616
16566 -10616 -30498 -28825 -13597 5670 7686 12876 60636 56997 47248 75813 29122 -8349 13712
16553 13712 47926 63719 60615 24559 61082 84566 54021 51198 46529 45855 24966 199 -18742
16540 -18742 -5755 -11174 11677 -1369 -22121 2776 -11157 -7059 -29727 -52823 -81588 -91534
16528 -91534 -104626 -92082 -54002 -28090 -23881 -81671 -72142 -51190 -30811 22476 46311 35420
16516 35420 -7433 -26239 -4465 5938 -41287 -9555 -10805 -33853 -31064 -17275 -20730 -40252
16504 -40252 -62669 -12531 8676 -21535 24561 -8023 -2322 2896 33943 56914 41990 14804
16492 14804 1425 -41706 -89171 -60975 -28823 -45337 -29267 -31464 -51981 -93365 -86463 -32742
16480 -32742 8163 -13518 -14231 24943 54628 16738 -51795 -32927 12116 40428 47442 36622
16468 36622 -1972 -14967 -8146 -33384 -52374 -17697 80812 57348 17507 9781 -23588 -67927
16456 -67927 -76851 -107692 -100101 -112178 -112848 -137560 -106900 -60627 162 21981 24948 -3330 -31387
16443 -31387 -32672 -83266 -53452 -8170 16522 4789 -30823 -9956 -11015 -23987 -19020 27445
16431 27445 37135 34346 -26898 -34102 -28194 -54877 -46486 41624 83434 52872 -33344 -39901 3919
16418 3919 -52925 -87421 -16225 44936 58060 37495 10081 -8886 -8474 13608 34549 47673
16406 47673 42252 17894 -9338 -61296 -12533 3547 -9568 -87359 -73408 35405 55434 41705
16394 41705 67492 99675 53554 -3477 -26438 -17487 7271 17399 -49015 -95423 -22924 3451
16382 3451 -49427 -70558 -39962 -5424 9589 3835 5189 5988 -1595 -33220 -23055 34279 25368
16369 25368 69424 103430 89977 42063 20325 -39681 -68051 -35919 1461 30584 39147 47875
16357 47875 25213 -963 10618 17729 -11002 -51254 -29770 9982 44668 68069 59195 27208
16345 27208 37234 28882 23162 -3172 1847 -33675 -32347 -15075 1635 26777 32614 32285 -383
16332 -383 9856 35885 2457 -13773 7883 -1066 -10027 -5975 24651 22560 -21161 4251 25683
16319 25683 -6656 -51884 -15403 -1325 11814 13118 35488 52858 10192 47668 73562 43736
16307 43736 28790 23641 -44629 -53308 -62107 -72372 -4012 -4596 -50959 -38939 -36813 -19161 -46425
16294 -46425 -10544 33179 41482 50646 76866 126827 74164 21911 60241 129370 126976 104311
16282 104311 83479 45746 17691 30003 59186 62214 82246 73468 54091 33686 -9433 -56700
16270 -56700 -48238 -24340 25140 36535 -19974 -71897 -91068 -63517 -69964 -71592 45717 76264
16258 76264 61377 -28527 -26427 -29362 -47823 -55914 -78460 -63096 -19056 12779 -24671 -39733
16246 -39733 -41666 -52691 -32798 -40273 -80053 -79475 -28626 -84126 -90465 -71307 -75521 -47171 -82014
16233 -82014 -122102 -65461 -12450 36707 69542 48432 18698 -10867 1784 29535 45456 -30947
16221 -30947 -52181 -24880 -44659 -32948 -24406 -33354 -74315 -51427 -53030 -8665 50774 31412
16209 31412 -26170 -29322 -10955 24087 -14956 -52542 -92200 -59361 -55960 -35089 36111 39201
16197 39201 55470 56369 50905 41875 51675 92648 76859 -16773 -14234 13141 38673 2567 -27424
16184 -27424 -29508 -27406 -38265 -6795 33206 99352 100881 21783 11373 -35139 11 16809
16172 16809 42672 64339 4642 -52609 -65009 -64586 -68432 -44392 -33096 5225 40553 49104
16160 49104 35682 27225 10990 -4749 -48149 -29334 35481 47417 16630 -11162 -2264 -6163
16148 -6163 -15155 8479 6466 -25666 7581 -4312 -16464 -38126 -57561 -3454 31373 60576
16136 60576 57775 33829 46401 67045 79019 78245 53211 33139 58668 58501 63436 79439 96545
16123 96545 20418 -36517 -67190 -27546 -24444 -30999 -12682 36699 47914 42532 50614 31016
16111 31016 6048 -7279 22155 39967 38972 9836 -16311 12490 20155 35641 65354 81065
16099 81065 100423 49828 11748 30297 14135 -28106 -4961 75119 116059 67937 74105 88846
16087 88846 92389 48335 43417 64773 29856 -14738 -62322 -54480 25483 76432 63380 27150
16075 27150 -37817 -17865 11386 43267 46441 71322 42000 22391 5506 42790 58496 -15595
16063 -15595 -64995 -27603 -62298 -12908 26152 -17983 -20552 -63299 -51987 5344 -29838 -53272
16051 -53272 24634 15439 4566 59796 58314 56488 26539 32042 68028 95586 123104 94477
16039 94477 79500 87632 25660 -15649 29438 33299 -9657 -24931 -13786 20821 39619 55308
16027 55308 66652 50157 60290 14984 6175 72160 62326 30100 23303 48580 86923 71368
16015 71368 10634 -28003 -54475 -87955 -106258 -26155 -9138 -27670 -42759 -18994 -49785 -62476
16003 -62476 -9736 -50996 -41249 -10177 -11173 -18094 6861 3466 26785 30916 63253 64016 14060
15990 14060 -6664 -4342 -9598 -2547 2707 38551 42498 57071 20758 -58661 -52981 -103419 -136176
15977 -136176 -96098 -11057 36533 25160 -1488 12800 32204 59942 101587 84294 72950
15966 72950 56024 2320 20539 40923 52731 43644 5570 -77976 -25147 15125 46929 48526
15954 48526 14854 21470 731 18506 -5634 -3177 10237 -31323 -46485 -36478 -42628 -76078
15942 -76078 -59685 -32628 -2907 8824 -33284 -26049 -14934 17547 -4388 -27591 -20874 -68315
15930 -68315 -78468 -26934 50105 40390 7176 -37534 -61578 -49128 -36494 35129 89764 89074
15918 89074 72132 64104 71431 35620 35347 50063 39356 8574 18113 50967 75345 108988 83720
15905 83720 48158 54208 65087 75004 116141 112627 65998 29725 -10391 -44019 -25451 -29255
15893 -29255 -61449 -76118 -47856 -37764 -46415 -28525 -66266 -89296 -96403 -103951 -48147 -9264
15881 -9264 -9662 21838 47932 9557 -14013 7261 33288 25798 8727 -18813 18458 7130
15869 7130 3841 9531 73688 91696 78095 32744 31886 55464 51141 37850 37478 16493 40200
15856 40200 107166 75829 46187 38244 14749 53083 69890 49053 26751 7848 -60975 -71527
15844 -71527 -38636 -35830 -17834 -25027 -66690 -14336 7617 -1851 -25720 -6234 -25228 -4248
15832 -4248 -2954 -36903 -39196 -3193 40273 -4948 -28615 7716 68401 75851 -11172 -68291
15820 -68291 -34988 -28403 -52106 -343 66468 39022 -32425 -3588 26548 23072 40524 -19334
15808 -19334 -34592 -6981 -20572 -46554 -16820 34931 15984 21730 9979 -493 14453 21258
15796 21258 40140 69622 57915 67920 51856 32851 33962 33240 -249 -20370 -53344 -79049
15784 -79049 -29304 -27676 9767 54598 84629 52712 -532 -23173 -29822 32680 85558 43913
15772 43913 35334 14542 -43105 -54840 -69980 -32250 8803 2202 -36930 -20790 15084 6770
15760 6770 -37723 -40072 -64352 -68184 -30008 -17012 -14515 -17459 -60094 -82676 -35103 -35529 22686
15747 22686 34682 -9415 21308 54795 63234 39149 1795 14781 48640 78611 75407 27809
15735 27809 14855 45547 9654 -25177 9762 3320 5639 33079 63178 21406 46646 85663
15723 85663 52973 6944 3046 23800 22466 3014 -5610 5295 -25400 -40059 -5044 49318
15711 49318 13085 4100 33779 70036 76925 50000 42884 52882 6519 9165 784 -7160 -83933
15698 -83933 -115954 -11018 1283 -13164 1455 -32395 -40702 -9932 -29833 -20659 -10514 30753
15686 30753 30127 42302 74840 56384 -3665 -28279 20526 68186 60416 52422 31256 24253 -38937
15673 -38937 -70612 -20976 14485 5805 25446 49528 76458 55986 57308 41709 -5389 -71270
15661 -71270 -105663 -121415 -78226 -66734 -62485 -21387 15 48015 92250 76897 54547 63725
15649 63725 79177 54608 82693 73616 66915 33795 8353 23403 84919 73226 23645 -51995
15637 -51995 -47893 -29449 -44084 -32841 -45625 -40634 4032 66152 123816 80048 30878 -2036
15625 -2036 31744 33229 -7686 -19185 -12831 34890 33287 12253 -40219 -23536 27334 39629
15613 39629 53006 11768 -27123 -54215 -64028 -73051 -96166 -73686 -1712 28534 37158 39827
15601 39827 46449 21674 11777 -6590 19238 75010 85285 62873 37233 -20807 -2496 18171
15589 18171 -46260 -36536 -38237 -47713 -21124 -40369 -15918 18492 49116 12954 -10343 24453
15577 24453 13126 3188 -24252 -51356 -49050 -40122 -71198 -71990 -44750 -13899 33352 45801 56340
15564 56340 45348 23540 36256 47742 69653 57262 32458 37828 53633 16470 -12615 -7504
15552 -7504 -9839 -16282 9034 23750 63070 62810 72682 76214 56314 65439 43141 86747 96052
15539 96052 77273 74967 30967 19640 62323 135315 156945 114167 118717 96016 33913 -17245
15527 -17245 -6624 13467 23722 25793 -27864 -20384 38466 53880 61343 32123 22665 25744 6670
15514 6670 21098 -21574 -32789 -38963 -32702 -18805 -8626 -17448 -4073 8144 21800 16323 54601
15501 54601 42712 39884 49265 19871 29985 27043 -51 32544 77012 25215 3466 8888
15489 8888 -4511 13605 38334 67160 26066 -52738 -69537 -27272 26038 73533 68068 68801
15477 68801 67925 28898 36209 -6574 8962 65560 69657 22903 10476 29310 -2846 5558 11438
15464 11438 19219 1010 31181 33113 25810 52955 58557 57450 36194 -2525 -8055 6305 41345
15451 41345 44200 42910 74925 60829 68664 60695 50781 53134 28355 -9318 -86313 -96488 -124316
15438 -124316 -111964 -55135 -34991 -73483 -24019 34588 65890 85914 86766 51581 40278 66345
15426 66345 92555 28491 1277 -17192 -8106 -6984 -55965 -66630 -26098 25561 22802 67765
15414 67765 64057 57746 24267 -24914 -25578 25685 72275 51876 9687 29225 42132 75262
15402 75262 74541 84290 126043 136545 183221 168426 109363 49106 -7378 -49480 -22976 -15348
15390 -15348 -49075 -48235 -2682 22652 -12253 -53723 -86854 -97776 -56742 -3417 18579 43332
15378 43332 74287 77520 53208 -13496 -31828 -22166 -19327 10077 4746 -6863 50030 23653
15366 23653 -7108 4749 12972 2014 -12568 9038 -30552 -38851 32256 84025 85740 48852
15354 48852 10711 16910 67783 61907 57437 40700 29964 37824 7010 2432 27188 31354 22992
15341 22992 12599 -2753 -52318 -59257 -24150 5598 21291 4005 -978 27084 -7124 -4845
15329 -4845 3781 59891 80806 37677 -298 -16803 -13081 8672 -2591 -3318 -213 8541 7595
15316 7595 -9213 14633 -2009 -37248 -78419 -88143 -63521 -24419 7086 -7989 6957 35918
15304 35918 69062 73686 43112 38078 16424 10937 27204 61025 10346 -33753 28094 83016
15292 83016 110260 166430 168370 104575 60775 52109 53376 79840 78809 55164 38031 52547
15280 52547 72096 89966 75039 65655 80370 75788 51461 58081 95077 104432 40294 -15696
15268 -15696 26021 71615 75198 71212 66459 88420 90137 124946 126658 115284 70712 18677 8241
15255 8241 6339 7388 -10541 -13524 -7064 16043 13419 12747 -35402 -93735 -55980 -42219 18299
15242 18299 9534 -65669 -63312 -7283 -2541 6659 22190 49073 41445 58464 96892 80193 19557
15229 19557 -18196 -30941 23712 28389 73685 53510 51668 30705 12110 -8402 27380 72121
15217 72121 82159 32219 -13482 -4412 21289 84425 107498 25191 11340 11739 25269 15525
15205 15525 -4487 -33110 -70169 -116547 -90933 -17245 -1195 -1277 16026 -5441 14280 41627
15193 41627 58023 16792 -6586 -19739 -57192 -46891 19540 88621 71055 62970 82820 97326
15181 97326 122964 66521 -5863 65240 148108 131418 72319 36670 58992 52559 37359 7719
15169 7719 -4898 19772 52278 125173 78832 11737 -13792 -31263 -2853 -18877 -47455 -51756
15157 -51756 -7417 -9923 -75350 -89167 -93343 -32238 -19071 -48935 -47327 -10789 30333 38644
15145 38644 73951 92157 51797 57504 49918 64285 82876 99489 21511 -24414 -11453 -14565
15133 -14565 -8694 26397 -23602 -29255 22600 48287 50914 9538 25436 54589 32616 -59825
15121 -59825 -27625 57421 29806 -16154 27339 56175 23038 -15792 -14925 342 -9918 -493
15109 -493 9219 21466 37715 37866 34640 21850 1124 -3765 -51308 -3437 -791 28800 18721
15096 18721 9686 18836 39311 66981 41270 29083 -42404 -60652 -59801 -67129 -3575 322 -17780
15083 -17780 4459 8178 23318 4213 -33298 -15555 -29607 -29837 -74453 -54597 -27863 -7699
15071 -7699 11663 12416 -1999 23956 10579 31395 34986 37718 24085 17573 -19884 -16036 -17361
15058 -17361 -22686 -21520 -32485 3592 -21062 11708 8392 11243 51109 48618 53983 81207 56950
15045 56950 58181 54748 63805 49495 37561 23260 15626 8714 72081 85441 38400 -13881 -33140
15032 -33140 -41251 22644 24093 39715 52552 12643 15739 21094 39395 11436 28863 32087 34953
15019 34953 98700 98398 59704 11391 -50868 2956 14177 -19010 -49032 -38580 -62173 -30452
15007 -30452 27114 100044 153453 141176 65788 70821 163353 212918 224669 202009 116311 86534
14995 86534 74395 73226 42072 -24496 -48718 -48387 -86566 -86713 -40813 -8475 -6817 25615 28745
14982 28745 -39531 -58625 -44806 12697 25913 14610 -9106 -3578 -24938 17605 34652 50379
14970 50379 93582 94697 65759 25795 6492 -41335 -66700 -30084 -15536 33293 45837 49817
14958 49817 17583 -33678 -53296 -56548 -57999 -69255 -53827 -10277 15309 46342 51576 57448
14946 57448 67058 82805 63953 41669 -11840 -57830 -50631 -34078 -27656 -44915 -46900 -9702
14934 -9702 5177 -9474 7317 2243 -43537 -23090 25117 89355 106938 128653 102082 40913
14922 40913 31724 11870 1203 -17473 -21466 4920 -9160 -15810 -4974 -5171 -40666 4776 54443
14909 54443 60184 65416 60026 52152 20547 43549 53172 42077 61341 85711 54005 14506 -39208
14896 -39208 -31195 -790 27751 27308 16966 -23577 16352 46555 71016 89313 82696 45097
14884 45097 53095 85578 103017 144185 126638 41972 -4218 -48729 -46114 13518 68694 -2075
14872 -2075 -69984 -84797 -111609 -60246 -22853 35080 34908 21983 30032 41355 54811 14193
14860 14193 -27423 -63025 -79522 -44523 -32597 25974 53467 55258 49823 7499 -428 -6997
14848 -6997 3783 61548 47549 -13133 -38630 -41945 31933 58598 41326 -46810 -54022 -55195
14836 -55195 -23556 -26098 -7140 75276 86045 79938 74623 71581 21031 22530 52960 22738 51799
14823 51799 80422 14491 2171 24489 -39738 -72513 -40923 -19543 -51110 -37674 7075 5684
14811 5684 15934 39592 -8851 -50752 -48967 -23722 -44003 -75449 -56730 -40510 20445 123277
14799 123277 110337 79683 68375 89155 56813 102134 130534 87054 74929 53444 36324
14788 36324 29619 37166 8783 -224 -37270 -78937 -41982 -24444 -25316 39832 65157 52206 66869
14775 66869 67611 90103 79300 30061 -21604 -25818 -50058 -49805 -31219 -28689 -10132 -49797 -35762
14762 -35762 -8403 -21627 496 28079 -9064 -28220 -73596 -47294 9756 34308 44613 14557
14750 14557 -16246 -33393 -74174 -66138 -38835 -48337 -95281 -122601 -122168 -122276 -67874 -38100 64713
14737 64713 76006 49313 39785 15178 439 72784 73894 49359 20867 -23579 -40210 -53460
14725 -53460 8322 65492 105074 96887 16941 -45362 -41134 -35042 -59074 -40523 -4347 -15224
14713 -15224 -14550 -12823 5136 3462 -8672 -11243 -2947 -19136 -28114 -31761 -63678 -27544 8767
14700 8767 23848 52177 59032 113870 109750 75643 75400 101346 102347 31742 17883 63836 65682
14687 65682 48906 6011 27463 67111 51260 36073 37592 8684 -51512 -64058 -46861 -65439
14675 -65439 -26310 2751 21083 40525 16480 -9307 -5717 103 16161 42564 70715 133296
14663 133296 130686 63128 33014 3277 15336 27940 59317 97755 75756 55772 55309 78101
14651 78101 44612 13840 -20682 -36254 27590 60196 86159 56529 36337 30385 32537 32317
14639 32317 65679 66847 65431 63162 68131 23491 -32353 -50826 -51353 -68342 -43507 34423 39855
14626 39855 28714 22081 -4062 -19482 -54826 -41077 -7396 -11140 -623 64150 44344 32509
14614 32509 41386 48568 45628 44965 21289 10717 40630 56982 36237 -7523 -73762 -111099 -82772
14601 -82772 -35211 -14584 -20354 5235 92004 87332 72301 90604 31478 -29216 -76603 -101529
14589 -101529 -77899 -25093 28101 44601 42237 15246 -23530 -9751 -984 -5131 -22496 -31874
14577 -31874 31736 48687 108842 100271 29716 14461 9261 -6935 -41499 -63279 -75678 -8871
14565 -8871 61564 27270 -28668 -56668 -45523 -24114 -35841 -78330 -106523 -72726 -26601 19006
14553 19006 15464 -13654 -5249 71481 98225 56330 59047 9274 -10712 -22742 -33076 -82742
14541 -82742 -75988 -54931 -31953 -6009 36534 12389 -4842 15723 41891 17034 3576 -8648
14529 -8648 1308 -50357 -116864 -88555 -39818 -4901 -4636 -5268 29438 76274 32673 -10440 -97184
14516 -97184 -157911 -107757 -103053 -95261 -77222 -66880 -6603 -37344 -35646 -2778 -71925 -118677
14504 -118677 -79391 -38128 -32471 -74410 -58157 28470 55734 53489 112980 97895 85033 30704
14492 30704 31953 63306 93345 77829 103450 106111 23221 -15671 29172 34485 -26914 -15892
14480 -15892 -22033 -56329 -98919 -118345 -93921 -80459 -61813 -22235 30438 43363 33185 38094
14468 38094 5436 -12443 -32168 -42141 -66351 -42111 -13059 -46143 -29925 33639 36554 23490
14456 23490 20967 37392 32825 -25679 -31300 -41252 -51515 -79924 -75800 -73448 -74989 -73612 -3532
14443 -3532 80071 114397 85511 49332 26899 27629 81689 79904 83612 20366 -51460 -85265 -58941
14430 -58941 -64968 -24515 -2587 -2466 -21022 -23343 -32032 -1158 26122 77155 44127 20871 53947
14417 53947 44646 60703 29626 5260 29405 7036 25676 59077 52295 12529 -6935 -4398
14405 -4398 39068 42647 -1303 5492 9712 -34571 -39776 524 -2929 -7979 12907 25638 95614
14392 95614 97950 59607 4387 -20127 16607 34986 32236 15020 20005 67315 81625 22002
14380 22002 -13817 -29284 -29832 -73345 -47817 1765 10813 -38755 -39833 -9213 16283 21161 -18779
14367 -18779 43004 118972 90446 48798 28987 -942 5325 60766 79156 52117 -15159 10160
14355 10160 60704 53095 66363 74534 88305 59859 64261 40798 41825 43840 53826 37996 71506
14342 71506 84994 87714 82277 111433 103615 67606 60002 54538 58265 4102 -46966 -49633 -100579
14329 -100579 -104171 -31397 9689 9487 17044 12514 3322 20917 8986 -33740 12978 26293 23243
14316 23243 -14343 -14420 9091 2638 30493 65664 102028 86760 55523 44241 60554 10387
14304 10387 -58077 -24313 -9556 -11809 -17250 -3427 24859 18825 -4287 -21676 -46553 -52534
14292 -52534 -21571 7604 -9150 -54169 -56306 -14743 34572 66037 68522 91030 45350 -12000
14280 -12000 -16158 -29463 -47119 -47304 26843 72912 76534 11646 -18388 -42912 -48516 -41124 -31136
14267 -31136 -25631 36531 51677 37134 -3693 -12642 59158 114348 110919 91412 101074 141436
14255 141436 107327 28831 28091 47329 66288 46056 17723 -1630 10024 -5088 -89775 -70998
14243 -70998 -65731 -16626 -1961 -9139 4835 -22583 -28238 -15591 7899 29499 59964 22969
14231 22969 -6754 -26960 38768 116551 112711 70681 -9256 -89652 -100976 -99348 -66020 -32990
14219 -32990 -43476 -16322 3852 -34297 -24743 29989 84486 46013 -8996 -41582 -28513 -23531
14207 -23531 -10134 -42676 -64690 -26974 14483 24027 30930 24935 -43558 -10564 64809 112215
14195 112215 141989 128489 93775 79821 57109 22771 -23572 -10997 -54373 -75217 29199
14184 29199 63611 -8140 -60171 -56681 -19810 14657 2488 12630 24769 2009 -330 -32624
14172 -32624 3858 18099 9144 -10078 11107 42494 49642 20902 14309 -2027 -26943 -7938
14160 -7938 10927 -36587 -50369 -53324 -34683 4361 -52061 -46391 873 -32004 -29470 24917
14148 24917 81188 -11946 -102551 -94599 -58590 -70974 -4696 15324 56384 71654 71662 47333 42184
14135 42184 2648 -32618 -3708 -17586 -45041 -83816 -14238 30928 53466 31976 7872 -25572
14123 -25572 -12245 7340 11684 7561 -17527 11083 53609 27325 -16773 -37421 -35205 -55951
14111 -55951 -32851 15936 2127 4262 -22493 5971 20415 -24470 13448 10888 41418 122778
14099 122778 120428 34725 -506 -8339 7172 34165 102169 57617 10662 88757 103887 28911
14087 28911 11004 30101 41233 17086 34280 29811 24066 69532 99490 74996 30960 344
14075 344 -2877 54205 70486 60166 12004 -12040 -32508 -1205 11851 -43617 -83676 -121035
14063 -121035 -130881 -61109 2422 36891 -1557 -34559 -20649 -31629 -45435 -8148 -27756 -6188
14051 -6188 -4126 9345 -12261 -27014 21943 52276 26443 26599 -29634 -32783 -35204 -8854 -23925
14038 -23925 -27125 -48604 -11030 24811 29046 -6279 -18659 -896 6615 -12381 -59190 -73189
14026 -73189 -22183 10833 41005 47517 48825 83603 77907 76533 53099 21630 -19840 -5910
14014 -5910 -9029 -42619 -29569 -8318 15166 49367 44836 -9390 -8288 33179 23488 -11008 -21451
14001 -21451 -44751 -39266 -35498 -36947 -99307 -90062 -93349 -118793 -74247 -14320 58734 109389 63253
13988 63253 49889 53851 35452 8676 -4179 -2811 -28539 -40660 -18724 2330 20919 45713
13976 45713 73824 21809 535 40599 53274 35353 -4538 -23193 12741 30824 48302 75929
13964 75929 44518 20531 59468 90905 99752 77335 46669 85214 72020 34789 35797 47087
13952 47087 38737 8660 1462 24032 6190 29198 35865 -6036 -11625 2256 20080 53171
13940 53171 35191 28433 63497 44757 35352 21587 27375 64471 117995 92056 8050 14424
13928 14424 -7498 -44789 -71679 -71231 4915 59980 65385 55791 15922 -13832 55008 134097
13916 134097 142734 59224 -10418 3715 -22712 -49580 -72215 -21167 -27412 26034 75305 75512
13904 75512 59648 61259 29431 -5424 -5769 12326 -27709 -3250 -12530 -25999 -10409 37458
13892 37458 28493 30540 23980 67187 58089 41518 15059 19074 15611 10915 44035 40448 36461
13879 36461 26321 5680 2986 -7089 -13428 -12205 6975 56951 45905 17826 -42332 -27561
13867 -27561 7871 -1962 -23107 -42889 -46426 -61424 -10748 56650 92182 61282 81764 82933
13855 82933 47521 36499 51827 27224 -13247 -48260 -45240 -15295 2337 -9436 -9335 -15612
13843 -15612 -41321 -37179 -8762 -8101 -10270 -11136 17998 37582 32214 14681 -13142 -53557 -63377
13830 -63377 -62089 -37151 -25895 -20174 4238 52221 53414 34989 12131 28598 17541 15235
13818 15235 16679 -800 -588 25454 46582 41300 17116 11425 9045 6866 -582 -12731 54872
13805 54872 45706 16480 -54493 -75150 -1506 33494 52209 71858 4247 -78024 -79105 -68724
13793 -68724 -22560 -16453 -2129 65878 65351 -6617 -71157 -98933 -97912 -84083 -49437 -23285
13781 -23285 13832 28769 40925 45271 21856 2014 29813 57721 64288 61551 10918 -84104
13769 -84104 -97538 -39225 -11063 39935 44539 3292 3807 280 1983 4395 14567 -20820 -56215
13756 -56215 -60635 -63514 10340 13797 54741 106661 97356 19202 -7130 29693 55465 59614 -6950
13743 -6950 -18918 5344 12065 35127 12967 -33534 -20269 -32421 -56370 -76681 -40249 -10876
13731 -10876 16182 34798 46801 7186 -5420 19095 25185 33440 24544 1610 -19362 -40251
13719 -40251 -5036 3043 -1542 -904 34426 24192 -6966 -4517 5325 13538 45511 55627 66152
13706 66152 80833 50701 8245 -54 -26315 -83225 -82530 -75282 -93247 -62871 -46332 -44196 -70451
13693 -70451 -85041 -76290 -73284 -78415 -104230 -105287 -103252 -14639 12239 60180 40048 775 -29551
13680 -29551 -1250 23578 5377 -7165 -7069 3347 -36634 -17069 58624 52718 -6636 -2545 5542
13667 5542 -25271 -81231 -51647 -4351 59907 37352 3921 -13865 -53176 -76134 -75591 -81138
13655 -81138 -39597 10057 30435 20197 22818 -15051 -7682 34493 -8940 -7184 19133 35991
13643 35991 18927 13124 29307 18819 4269 -40305 -14951 2492 -20920 -3903 -8601 -9392
13631 -9392 47860 53781 36982 41096 62212 62327 79817 65777 61741 69414 56958 48944 26541
13618 26541 22891 8233 23277 80442 74475 49675 -1510 -41944 2335 -22775 -73319 -106755
13606 -106755 -97502 -67692 3879 -21187 -63227 -87261 -37235 -34434 -28219 33046 26109 -68891
13594 -68891 -87424 -44856 -53433 -42239 -20817 -36216 -66099 -27188 10288 36571 25305 44394
13582 44394 12904 -16639 19636 68032 77864 30042 19810 -16614 1641 -27642 -9633 15790
13570 15790 23744 11678 46761 60417 27019 21030 46045 14371 -15892 -20792 -24773 -62165
13558 -62165 -38097 -24224 -43370 -72019 -58525 -26634 3280 46136 50370 108649 94230 70076
13546 70076 45831 25506 8905 74077 111410 83723 88139 65080 46638 9499 -36574 -6778
13534 -6778 20311 -33524 -63723 -42950 -1268 18495 21964 -35123 -14425 12087 -30276 -40324
13522 -40324 -27862 -1523 16855 8053 58096 58990 -10194 -13695 -17058 -20821 -14735 -9507 -51945
13509 -51945 -32345 -54848 -39418 -28414 -42725 -26543 2956 -6181 -29434 -8696 37638 35970
13497 35970 1 1429 -35599 -63360 -117944 -90399 -28208 -5436 -47100 -56980 -55455 -12693
13485 -12693 35126 20408 -12654 -60218 -21607 82 15912 48271 16127 -36015 -77614 -121444
13473 -121444 -155530 -75184 -46420 -47901 -14999 48619 65149 28900 50313 80359 3946 -25136
13461 -25136 51690 83323 23771 22326 98260 116962 77351 49008 -46387 -68674 -26371 -6057
13449 -6057 41352 46683 65815 40547 53849 54879 38107 22493 19269 31864 15900 -33117
13437 -33117 -23104 7513 -21255 -45169 -60336 -29359 -62081 -117757 -100950 -22934 18318 -12182
13425 -12182 -40813 -841 42054 16308 10144 24480 50722 86586 51051 50521 76710 79678
13413 79678 45663 54335 14558 15315 20057 57805 67079 54808 22920 1338 -24626 -32915 -35688
13400 -35688 -50987 -3619 17015 21090 -13994 -16742 19180 29403 21841 7372 23075 57324
13388 57324 -8458 -62612 -69112 -47356 21557 -277 -30406 -53410 -72752 -62321 -76873 -68690
13376 -68690 -48374 -13393 -16331 -20310 -80404 -21880 20529 -758 -22432 -3639 40679 -9029
13364 -9029 -4482 10132 -2445 8102 48982 59751 76818 105079 93220 43645 58785 78114
13352 78114 79913 71983 74985 47851 22976 1156 -26452 -44589 14932 35821 34361 3683
13340 3683 18339 33245 46347 32885 149 -19250 -20233 -16438 2943 -7906 7576 27039
13328 27039 63732 52649 27137 31414 12986 -11262 -32209 -13555 -28193 11109 28605 -51158
13316 -51158 -72856 -58361 -31071 -30713 -106871 -86588 -15730 32507 73583 24292 -5915 -31291
13304 -31291 -35485 30337 16611 16006 -10201 6511 9634 -6667 4517 100785 45431 -33545
13292 -33545 -46127 -14197 -15504 -1600 3325 -10171 62082 66290 59067 29158 30096 28667 3554
13279 3554 -6144 -28298 -45157 -65925 -56518 -72290 -76966 -86876 -35416 -8347 -26780 -34565 -20211
13266 -20211 -33291 -19855 -5554 -38381 -13782 4261 4799 14623 -5185 -4848 15090 24460 39541
13253 39541 25246 -42311 -11030 -10053 -75924 -61180 -38698 -26890 9085 52070 115551 78901
13241 78901 -13744 -75295 -94636 -105422 -66453 -12080 32955 -1157 -32722 -13842 -3413 25742
13229 25742 12180 -54960 -132421 -131431 -67609 -41601 -30705 -54738 -97314 -113328 -98272 -92441
13217 -92441 -140926 -142704 -128215 -118296 -110179 -91825 -49563 -58388 -82588 -33538 370 58399
13205 58399 75955 10315 11504 2912 9773 -11866 -69589 -47290 -30999 -59684 -47586 -44623
13193 -44623 -39292 -36414 -21452 -1832 -23224 -603 -16023 -53455 -34608 -12710 -5413 53017
13181 53017 4341 -35217 -51318 -63424 -55145 -41145 9306 33474 37621 60271 34984 29549
13169 29549 26273 34194 -4730 -4307 5609 13472 7717 -85233 -84275 -21733 -7313 -16243 -1344 10146
13155 10146 39714 40488 16898 -11088 -53415 -61253 -44756 -20325 5013 12898 8019 -9990 -25193
13142 -25193 -14214 -32514 -38904 -31058 -22859 -25610 48813 33749 5240 12504 29440 11016 -23648
13129 -23648 -8427 2804 15231 12540 56427 66164 52635 702 -10207 22108 37323 81622
13117 81622 75061 -338 -36828 -80411 -7616 33342 22976 31551 81309 132118 131032 91500
13105 91500 62669 111875 118629 6366 11688 58768 61461 80899 55670 -4906 -42800 -20079
13093 -20079 -20575 2260 61424 99918 76157 42954 81893 23455 -8832 -1740 -29784 -31621
13081 -31621 -26839 50887 64782 40918 -21297 -4661 -45534 -54030 -61168 -3103 23314 5539
13069 5539 9024 13459 -18074 -42041 -34137 -45632 -25122 7691 13985 -28864 -65969 -25774 -10451
13056 -10451 20934 26612 27530 12775 23328 28871 13000 22478 47452 59224 43072 34123 7369
13043 7369 -18862 -39544 -34171 -50188 -43633 -33081 -16800 14181 -6991 -39427 9817 90970
13031 90970 53452 -10803 -15098 9991 -9980 -25891 -21444 -40084 -41706 -62903 -50891 -6696
13019 -6696 36603 15325 305 -8810 -3847 -11708 -66206 -94500 -62388 -63237 -64543 -47665 -66642
13006 -66642 -53823 -41093 -38080 -52110 -34882 -53216 -40360 -63992 -81673 -56838 -17488 -5063
12994 -5063 -16836 -74069 -78078 -47109 -27160 -62463 -69764 -40913 -9428 -45370 -79639 -57872
12982 -57872 -37299 -77306 -80257 -44470 -1339 25567 -15869 -31016 -4699 23248 12483 27909
12970 27909 18579 -24151 -72616 -39278 -14074 -38520 -63092 -18226 -17175 -46814 -16211 21090
12958 21090 9011 -14848 -29042 -8538 3116 -29319 -14663 15808 -2832 9721 21105 11324
12946 11324 2713 38935 87140 65747 38762 28382 43171 80199 72632 34831 -51043 -97993
12934 -97993 -63565 -51258 -84954 -82242 -71777 -82307 -48271 9668 2703 -67512 -90945 -81318
12922 -81318 -43240 -32265 -25661 -11832 9082 21763 -36448 -78527 -63385 -22180 -8241 -40858
12910 -40858 -90267 -71297 -47335 -17886 5862 13206 -5382 -48954 -46200 7084 70270 8849
12898 8849 -72233 -106179 -108084 -38753 39994 43248 4000 -24193 27461 60858 -9230 -52353
12886 -52353 -16486 -9151 40148 88639 50333 6104 -37363 -57657 5727 28773 -18420 -60988
12874 -60988 -18535 -31595 -41199 -50273 -27684 -76590 -76272 -42657 -10897 -8613 -19287 -71514 -87517
12861 -87517 -49774 -58876 -50521 -31629 -3804 -36286 19078 27527 2517 -18138 15029 58821
12849 58821 2151 -66475 -77484 -75617 -58736 -48924 -28175 -26583 -101519 -123743 -95986 -38159
12837 -38159 -13293 -6223 -9653 -32622 -49793 -1564 11374 -20813 20635 1890 75226 79508
12825 79508 7647 -56567 -39826 -78550 -73071 -34829 -51244 -28682 5537 8204 -17651 -53780
12813 -53780 -28966 -2946 -37065 -31375 14589 57908 22322 -101411 -134002 -129370 -122235 -98010
12801 -98010 -121342 -101862 -45362 -65616 -54338 -43053 -58146 -60630 -95923 -20454 -14114 -14790
12789 -14790 -25410 -33266 -35554 -58164 1416 -10213 -22514 -29129 -23606 -43827 -9376 -38707
12777 -38707 -56894 -30834 -37426 -16248 -52141 -74220 -82853 -70022 -55876 -55968 -100962 -71563 3447
12764 3447 25746 -7499 -15553 -37659 -29554 -26421 14913 -23019 6492 39014 32017 -15998 -31045
12751 -31045 -59986 -60308 -7453 -4831 6936 22897 48712 26913 1262 21004 30072 -27233
12739 -27233 27362 103610 91062 76785 14186 -51516 -28921 -33459 -26702 54283 60375 18674
12727 18674 34595 16241 -41977 -28447 -16782 -17572 -10154 23909 43520 -15812 -20957 17727
12715 17727 -49281 -115392 -74224 1998 19472 33413 39319 15446 560 -33588 -43112 -38368
12703 -38368 21306 29182 42905 36505 13852 9201 -35731 25683 47173 -3844 -29278 -32512
12691 -32512 -54219 -40116 14371 85011 92826 27481 12176 29324 -20183 -28813 -38154 -91635
12679 -91635 -99391 -90958 -68872 -23378 -11326 -8979 61343 51415 22504 -34674 -26139 -25732 -16649
12666 -16649 30468 35632 54637 20595 -14743 -52527 -56534 -21961 -53392 -104690 -112016 -89088
12654 -89088 -65821 -20738 -11505 -44917 14 1876 -69738 -75231 -37486 -69375 -132449 -101208
12642 -101208 -93549 -64331 -18470 34823 65693 81619 45441 28463 -74572 -64680 -89976 -87866
12630 -87866 -49969 -9043 17990 42907 44927 31563 21142 12834 10525 -29597 -68840 -7639
12618 -7639 25964 -3597 -58918 -36669 23857 59151 41736 -75970 -135164 -106660 -8528 50277
12606 50277 70969 72814 82806 41240 -48008 -64140 -20499 9795 39537 59855 6091 -46484
12594 -46484 -28705 -32835 3687 52054 93717 101561 79184 85840 101429 150366 147679 114901
12582 114901 49300 7351 -33501 -45 50284 14988 24554 40094 -11146 -30865 -5338 -12424
12570 -12424 -714 -74704 -95227 -51624 -2877 2525 -15957 -24501 -35556 -42922 -81355 -155366
12558 -155366 -151319 -122280 -66984 -22035 5359 -6477 -34504 -62907 -63361 -60100 -46002 -25179
12546 -25179 -7027 -5683 26729 28198 9430 3589 17600 33982 21499 51979 5560 -47908
12534 -47908 3003 -16373 -49712 -6946 21079 28552 22352 18707 52403 70737 88456 85815
12522 85815 32188 14177 20745 41458 43419 32706 3245 -2820 -6506 32710 51202 52
12510 52 -12257 -17884 -891 41097 90335 77479 38753 -14995 -49445 -79818 -64216 -81984
12498 -81984 -95189 -99206 -106048 -57869 -57131 -34133 -68528 -66672 5072 20692 2675 -27665 -56625
12485 -56625 -55896 -37820 2710 27075 -38293 -112510 -81438 -79917 -68509 -31965 -47577 -75797
12473 -75797 -134142 -127648 -105489 -27586 53231 69317 50060 14028 60942 46164 16930 13505
12461 13505 49817 53766 41565 15910 9950 32538 42796 21795 15815 93798 69909 34907
12449 34907 10352 -18944 -5970 -21026 -29676 -15430 -4557 -20179 -44020 -52622 -16888 20460
12437 20460 -3546 -19282 9989 71201 2815 -47478 -80741 -97913 -29087 12817 -7064 -88912
12425 -88912 -33556 -21397 -9243 -27836 -21833 -54240 -34654 -15165 15280 58831 43777 83293
12413 83293 64153 74879 -36547 -101719 -104071 -33150 -5545 -219 -35173 -62030 -67655 -38610
12401 -38610 -4708 -31018 -67876 -73978 -78943 -77176 -104734 26882 51402 9810 25642 36623
12389 36623 -26274 -28895 -6345 36734 44802 -6025 1359 24006 9556 19583 9021 46
12377 46 -8720 -13431 17982 28345 41011 20696 -8014 79757 74164 33408 4362 14577 36930
12364 36930 67103 34100 11005 -18232 -53935 -61592 -60129 -41404 -61017 -95077 -66545 -54501
12352 -54501 -34956 -9885 -8762 -22717 -27959 2667 -2593 -27748 -1679 60961 35734 26424
12340 26424 -14907 14518 -22765 -14896 -21112 -41075 -23647 -32477 -44140 -83826 -117006 -95538
12328 -95538 -17021 19124 50512 62255 30871 49605 56819 36864 -39742 -90950 -59778 -36601
12316 -36601 -102 -33269 -37104 2288 -14311 -19334 -29957 -78745 -59055 -85102 -79665 75
12304 75 40130 35530 40408 38473 -9582 -52238 -86072 -94170 -14952 -27872 -48462 -123414 -145076
12291 -145076 -135259 -109967 -65871 -8576 2996 28039 41410 12607 51704 46635 32379 -11815
12279 -11815 -7210 55294 66232 15027 -17382 -31491 -33863 -94800 -128540 -106451 -57624 -21388
12267 -21388 -32447 -50472 -106886 -81063 -72483 -50387 -11711 -6365 16372 9499 42547 82263
12255 82263 54174 -15763 -53005 -8303 -24975 -3201 -10596 -9684 40680 7852 -27777 21585
12243 21585 66311 76221 27459 2574 5044 31601 20947 -27876 -52054 11543 6885 -35545
12231 -35545 -30039 -45195 -71043 8934 27910 70916 56854 83694 104894 20365 -32730 -19680
12219 -19680 -68580 -60359 -51337 -65028 -74126 -37257 -55631 -110438 -71579 -2236 20637 -4484
12207 -4484 -9999 22983 34043 48128 40760 35758 23830 22795 -52899 -100341 -114027 -93525 -10688
12194 -10688 -4632 4551 110 3853 -23122 -75971 -89571 -79464 -55336 -41183 -45918 -32797 -42434
12181 -42434 -14359 17103 16035 -3114 1501 13335 52425 14569 -10564 29783 70099 56856
12169 56856 -35470 -74744 -55382 -47696 -48682 -51105 -43736 -45707 -32368 -50872 -65032 -52358 -20341
12156 -20341 -39301 -102569 -98472 3915 11398 -34441 -21542 8977 3165 -13895 27772 48086
12144 48086 31312 -22099 -51089 -1356 66090 65378 61497 75864 41357 29770 -4019 15060
12132 15060 12496 -59958 -85448 -69873 -7013 44069 515 -15442 -5646 -17143 -20927 -23140
12120 -23140 -64704 -50773 -4565 -31660 -134069 -120766 -39460 -39888 -89322 -92179 26262 64888
12108 64888 75605 129370 51265 -60527 -60829 -31821 -39498 10243 29757 -22255 -34630 -23571
12096 -23571 -70810 -75124 -12204 -72599 -86673 -85283 -66167 -28373 37646 -7190 -10285 -10214 26252
12083 26252 63003 30578 6729 -1737 -38746 -31958 -7524 -21279 -7072 21361 28344 -1963
12071 -1963 16988 -51779 -153322 -178123 -122442 -50382 -15962 24168 27275 41836 -13270 -49041
12059 -49041 -37710 -97161 -105263 -75348 -82564 -105131 -55687 -35062 -91978 -76857 -62631 -50319
12047 -50319 -33140 15552 52241 76752 40930 20198 -14168 -41970 -44704 -31289 -47139 -32093
12035 -32093 -4095 -32758 -9800 29622 30430 74190 31573 22784 36281 2494 -27589 -72197
12023 -72197 -38829 -41717 -42898 36381 41301 35819 44123 69451 83247 39151 23515 40235 69002
12010 69002 73913 114427 229876 390568 455563 426261 398425 406714 401481 393859 285829 133359
11998 133359 109640 96550 84296 127990 109378 81456 53961 -4537 -5112 -2939 38609 105435
11986 105435 147498 157490 166110 182297 90789 32305 61359 47381 48394 1754 -49046 -76712
11974 -76712 -47011 7045 40760 79612 88153 134913 157617 194903 202366 265614 370330 446892
11962 446892 526320 538076 515375 541415 544850 487289 483164 486485 339649 261535 219089 170317
11950 170317 181573 153323 101005 18028 -23778 -91079 -104257 -75423 30615 83698 107722
11939 107722 108866 34675 -5305 1022 54939 67764 50681 -38755 -111728 -148226 -96152 -45647
11927 -45647 -23068 -3935 -16191 -23466 -18150 -9994 18737 138101 199872 224516 287669 354942
11915 354942 397250 445684 408364 309646 230797 127690 61857 205 26704 98892 133928
11904 133928 82169 74356 39428 37128 13374 11513 -29329 -24453 -11233 -16295 6589 3186 18000
11891 18000 54326 22404 5687 -10485 5718 10980 7454 10010 29946 57799 25616 23545
11879 23545 7663 20606 56083 29901 12720 25274 39020 11712 -2447 -40802 -41008 -3710
11867 -3710 -17113 -27878 -47838 -37206 -2065 5638 -19161 -12644 14550 -60603 -61633 -31428
11855 -31428 -19948 -4162 -18374 -9671 7445 39002 30299 -1795 -2087 7133 -12665 16918 -763
11842 -763 22660 9824 19768 -29061 -68020 -496 12297 7694 7167 36409 47171 26589 24580
11829 24580 -7018 21551 38531 58552 55408 50893 58480 88506 94125 71759 25983 3212
11817 3212 38056 72560 43569 19736 5004 -37664 -41055 18809 37444 -32584 -41056 -62146
11805 -62146 -86367 -32403 1468 -24300 -13586 12280 -9053 -19197 -1181 -48097 -39324 4182
11793 4182 14130 28970 53788 40188 27079 38620 34348 23060 -14236 -31717 -27304 -21780 -44098
11780 -44098 4852 16080 -25324 -59214 -96581 -51475 -48593 -91628 -83280 -55426 438 -7340
11768 -7340 -23781 -22203 9532 29718 11271 7719 37775 46670 68072 80171 52256 -10816
11756 -10816 36486 50345 23159 10215 -4423 -12067 -47331 -68663 -32442 -45852 -54410 -57944
11744 -57944 -95030 -54313 -21106 -39976 -57584 -103455 -92196 -36212 -37362 -42732 -76869 -91429
11732 -91429 -47930 -41293 -64447 -57407 -77383 -69863 -67274 -17001 37896 41853 48047 33314 -2362
11719 -2362 -14203 -15178 -15578 15187 48825 23775 477 31279 84229 86027 90262 87815 94776
11706 94776 109925 75820 45848 63524 47956 24169 -2442 11468 -18035 44930 96162 75088
11694 75088 -7124 -35157 -56599 -57963 -15536 -5832 -4443 4967 11599 21167 34098 16050 26409
11681 26409 40470 34683 24639 -49610 -52584 -89742 -81750 -37171 -6564 -1684 27422 -13897
11669 -13897 -65894 -76832 -60157 -36900 -23681 -35535 -45935 -1061 14956 -12492 -37277 -18054
11657 -18054 25604 56946 -8513 -24738 -47816 -50874 -19508 27931 -25988 -26589 7424 24513
11645 24513 -31113 -83972 -78230 -10119 -17640 -59613 -94426 -104863 -97224 -96438 -40558 -6039 -36846
11632 -36846 -41504 -69367 -49671 -54030 -58695 -43842 -36564 15521 4071 6330 24665 12674 -11208
11619 -11208 -7174 -13262 -45726 -42299 -18558 -1291 34727 -2696 -17648 17653 70161 71525
11607 71525 92854 71310 -3533 -46193 -79319 -87215 -16000 42501 50746 36317 9817 -1752
11595 -1752 -35575 -97526 -122990 -80642 -39599 -54352 -81632 -54062 -70745 -39151 -57247 -89262
11583 -89262 -64584 -24623 -7158 -12354 -83378 -107110 -147217 -168564 -131160 -79620 -83218 -149523
11571 -149523 -131873 -71613 -52912 -20093 21869 65953 -9143 -72936 -96842 -65961 -91350
11560 -91350 -78369 -46723 -1539 -26328 -27778 -36877 -46824 -23303 33201 -32356 -55573 -39739
11548 -39739 -66136 -40851 -11210 -15935 -23255 -30727 -16557 25607 8652 -41145 -18342 10288
11536 10288 -10467 -2086 67920 59648 59645 51203 17942 13530 -18417 -1851 37136 22398 24278
11523 24278 19960 -20331 -15362 -7207 -10598 9949 11934 -704 -15751 -24532 -35241 -30911 12694
11510 12694 72661 37773 -1884 -22821 -46438 -13280 150 -63501 -78077 -31827 -5694 -14858
11498 -14858 -69914 -68882 -58196 -32764 -12379 -36083 -60022 -30951 -51501 -42208 -20966 -50808
11486 -50808 -90566 -66349 -75600 -22964 7273 -12164 -24428 -15428 -12392 -7486 -13161 25024 62479
11473 62479 -22788 -45846 -8794 -17791 -81914 -68049 -70767 -78421 -68296 -72740 -87325 -118457
11461 -118457 -66499 -8286 -1984 -16528 -8355 39252 64526 24209 -9136 -11004 -27583 -64588
11449 -64588 -97305 -143156 -104235 -80943 -64155 -53219 -46626 -28087 -50400 -89414 -38210 17847
11437 17847 33800 30107 -1018 -11637 -9171 -7325 713 7909 -2946 -10086 -21888 -14849 -12908
11424 -12908 -10364 -6043 25146 36966 8245 -19203 17171 18189 3141 -25366 -19637 -31355
11412 -31355 -20408 -21936 11818 68554 107778 121371 114967 66297 34971 -12143 -29083 -1212
11400 -1212 22434 22662 12489 -31293 -62106 -167141 -182247 -150667 -125902 -93221 -73669 -24072
11388 -24072 47156 75858 71861 29618 -33374 -85267 -70160 -53175 -63444 -28258 97065 80124
11376 80124 30139 82203 107877 98818 98895 109093 33204 -46066 -114708 -77221 -48215 -85725
11364 -85725 -101774 -92943 -93647 -52634 -40529 -34001 37783 -201 -5184 -19460 -11492 5148 -1397
11351 -1397 -44371 -9121 13058 -1449 8251 28713 22615 16321 -8574 -47223 -66428 -73472 -75901
11338 -75901 -99738 -93857 -25596 -25639 5237 47883 40825 32387 -21044 -44051 -75824 -80578 -55570
11325 -55570 -76135 -48206 -3724 16806 22857 19524 50515 34730 10906 -7241 17896 59156
11313 59156 94597 30630 -38736 -43581 -38631 -24310 -33766 -77703 -72745 -46500 -94755 -120539
11301 -120539 -108236 -61851 -41743 21984 46176 18136 9092 20717 -774 -747 12663 20581
11289 20581 -19590 -16938 -39827 -100758 -74216 -61058 -32532 -78368 -69319 -81718 -79432 -70184
11277 -70184 -71628 -11436 42878 24789 -15308 -44163 -20231 25912 15102 32368 2011 -6673
11265 -6673 -17069 -10208 32603 20660 30809 -23902 -63468 -34061 -51434 -42233 -54488 -110787
11253 -110787 -107413 -79999 -94968 -116646 -150299 -138073 -122246 -83104 -46551 -25958 -31406 -32232
11241 -32232 -10929 -11362 -8248 -5853 2439 23900 46889 83069 88649 -4565 -51475 -31525 17681
11228 17681 -13785 -39432 -9274 -37305 -50772 -39402 -34493 -19096 -21536 -63737 -53966 -32849
11216 -32849 -11268 65663 38490 193 -8170 -26815 -19130 18138 9095 -19134 -24042 -7473
11204 -7473 -21628 -32048 -19815 -43004 -143509 -186529 -148910 -83473 -19267 52418 44810 22068
11192 22068 11655 -22733 -41715 -42811 -46112 -73809 -60459 -52242 -34187 -4401 -34333 -39609
11180 -39609 -71523 -88628 -74755 248 33377 64429 55366 47651 34691 1699 -52493 -96418
11168 -96418 -90067 -81925 -1957 -7453 -114992 -138073 -139017 -59771 -33642 -35013 -51529 -85814 -78594
11155 -78594 -30310 -44057 -58483 -73571 -73841 -124760 -137508 -84492 -73825 -100299 -134755 -115942
11143 -115942 -78873 -45162 -28343 4800 5487 53114 1524 -57507 -59795 -48864 -31901 -38747
11131 -38747 -25187 -34573 -10283 24070 49222 97460 92747 68394 45317 60377 98236 158883
11119 158883 258578 451011 712069 982352 1162809 1274910 1408331 1645469 1897188 2027313
11109 2027313 1908548 1706051 1474605 1319284 1228646 1062155 799218 559749 411527 279963
11099 279963 181684 110944 90185 68420 18772 -4698 4516 16789 24962 11651 -4083 -4327
11087 -4327 -3862 -43283 -22629 5675 29018 28795 37416 47507 19747 56421 72684 100049 127296
11074 127296 63748 27710 -15492 -30192 -10820 24685 18135 27747 48385 27797 -7851 -24967
11062 -24967 -21853 -52791 -60120 -64792 -70408 -78549 -111743 -102370 -42703 3569 3662 4815 -5936 7728
11048 7728 47920 55644 30881 -21653 -67936 -34760 -61847 -78161 -13920 -18398 -12447 -40314
11036 -40314 -16154 14920 51582 17914 -14725 -54793 -33872 -9039 -43614 -71866 -84448 -93025
11024 -93025 -73208 -39688 25953 4769 -24591 -17278 -7490 -5012 12891 56126 -13729 -49788
11012 -49788 -48514 -8908 63098 93327 98467 55357 3529 -1806 -20182 -99676 -121432 -58170
11000 -58170 -61997 -40672 2894 -19187 -25254 -80912 -117886 -114010 -69401 -32959 1203 49653
10988 49653 52885 -9122 -15570 -6159 10010 39856 -2222 -25686 8328 44638 5946 -26390
10976 -26390 -33125 -59812 -52652 -80076 -118304 -76689 14297 36819 22787 364 -10126 2036
10964 2036 28846 35268 7222 -28541 -58859 -48604 -20795 21619 -30709 -37659 11267 92471
10952 92471 83329 -27854 -26718 -3527 57311 39113 56554 5974 2097 47302 50437 28185
10940 28185 15119 -56211 -61355 -56933 -8738 42289 49136 47943 57952 70802 23091 -30509
10928 -30509 -27191 -12478 13699 35542 6753 -28979 -32143 26459 52519 94859 127263 81295
10916 81295 33811 9729 11807 32618 31320 38004 56903 39178 34354 15144 21872 52574 61559
10903 61559 11306 -21068 -4655 51823 57264 88336 136512 182822 248328 264776 335654 412663
10891 412663 546568 787286 1195776 1641759 2031789 2150102 1904782 1454114 988749 652432
10881 652432 434220 296222 233415 209337 195520 158739 121356 74151 105694 141011 130363
10870 130363 137737 98409 109169 120712 73946 58022 85321 32782 8587 27965 102425 74726
10858 74726 48745 82173 108339 139652 151958 171246 134037 101658 80046 64150 44544 46949
10846 46949 140243 187891 200343 256472 396722 537846 785042 1195946 1766014 2162568
10836 2162568 2191574 1874191 1403865 981936 674223 488176 379168 272336 206496 164609
10826 164609 174127 212432 165362 111024 71831 100509 90499 50702 -27266 -25040 3825 -11568
10814 -11568 12346 39979 91304 112060 68957 18142 4082 7277 -3309 -8428 -45926 10029
10802 10029 9490 17339 75039 79304 65050 119840 134829 136869 122888 105957 67334 36119 -13973
10789 -13973 -16801 20017 3942 -9471 10578 65802 64630 51680 36958 36284 18165 9731 19646
10776 19646 37652 2193 -27635 -72273 -91844 -83872 -37155 -11270 42430 83318 67359 5546
10764 5546 -75747 -53550 -6607 -47082 -94005 -64497 -33881 -20084 -47643 -35002 -43655 -12204
10752 -12204 48344 38071 57274 74163 13254 3295 -14626 -14830 30964 52372 24577 60085
10740 60085 93493 68493 28392 84166 103860 111749 104572 78479 123930 211434 246135 254467
10728 254467 198472 193862 211943 212308 219671 225361 199928 213588 209323 152985 125311 119738 86969
10715 86969 62109 4258 -5203 4670 540 36932 102073 104425 111863 115065 89379 75419 41634
10702 41634 31979 110831 108154 57431 1495 -72847 -13359 49470 24494 -25959 -2328 33862
10690 33862 95237 185042 222183 182562 214273 215241 209868 199464 151543 109622 127097 124829
10678 124829 104202 110027 96941 96700 58421 54121 10613 15053 88415 121792 153939 163880 116386
10665 116386 51864 36433 92090 113249 27924 15453 -14185 -21095 -29612 -57715 -28963 12998
10653 12998 29225 6688 26337 58113 18584 23853 20858 31401 75903 117753 121893 95105
10641 95105 69753 131967 90074 116980 238929 273666 239758 184810 143414 67280 11491
10630 11491 41090 48910 97209 82430 74612 89549 135413 185728 173891 138714 82902 86430
10618 86430 88161 112903 128336 62569 43334 128033 161599 241247 393243 601871 865384
10607 865384 956860 868200 776566 658875 672778 762099 804149 779690 740357 790179 817376
10596 817376 885191 1112214 1350696 1468028 1450603 1271901 938012 657555 496611 383449
10586 383449 302622 213459 205634 209213 237544 248518 250236 290577 293498 274762 249178 308774
10574 308774 427625 445585 417319 378902 306599 292082 238434 215676 163211 109628 72892
10563 72892 55514 28531 25186 91524 254221 418426 581012 640932 626097 616826 557103
10552 557103 504084 486481 478666 461041 430576 445342 437788 382122 402310 398200 401805 413691
10540 413691 455351 507932 551529 601055 649461 664116 637653 661466 665789 668338 667954 634120
10528 634120 552340 576283 595904 620455 725316 835428 913213 1052562 1118080 1113105 1189532
10517 1189532 1269353 1314762 1383489 1392261 1436352 1507606 1605967 1698174 1789984 1906687 2202435
10506 2202435 2534802 2753931 2911580 3111612 3427904 3843423 4395950 5130728 6016376
10497 6016376 6861563 7463139 7736058 7904315 8233455 8961683 10231425 11957463 13996847
10488 13996847 16235951 18681022 21689430 25851349 32099250 41558624 56559243 81492417
10480 81492417 124117052 194140638 289118001 376077852 411335419 381917602 305182555
10473 305182555 214566360 142082945 95919404 68654789 52116725 41509265 34364426
10466 34364426 29295724 25379381 22245237 19620918 17379825 15575115 14245853 13251894
10458 13251894 12646220 12430464 12655885 13212107 13747259 13987394 13712140 13022395 12302965
10449 12302965 11766678 11652650 12038673 13018423 14472260 16444812 18796939 21501078 24661238
10440 24661238 28810352 35069573 44951912 61148167 88629910 136313346 213567223
10433 213567223 312297263 392460931 413418213 370364912 285625021 195641486 128748371
10426 128748371 87694846 63640459 49063717 39746884 33347268 28563069 24563690
10419 24563690 21055935 17999831 15564780 13777768 12397723 11250144 10300923 9771881
10411 9771881 9523557 9359714 9001637 8427599 7631160 6741372 5871941 5137431 4589127
10402 4589127 4208998 3950239 3749843 3528623 3292235 3105116 2919449 2721317 2562488
10393 2562488 2390188 2174174 2014343 1874521 1809945 1797857 1791235 1775079 1725610 1664518 1665021
10382 1665021 1633843 1577476 1531376 1458467 1430130 1362287 1316524 1368597 1392536 1400375 1403994 1406298
10370 1406298 1377364 1354939 1318579 1265824 1224920 1234519 1230982 1137678 1013926 1008834 959646 920847
10358 920847 902491 824651 759945 689190 632618 592290 564804 569177 614428 651334 753806
10347 753806 835837 856399 860361 789797 738335 692335 646697 639861 639264 594681 598963 574558
10335 574558 517095 484760 442408 452986 495291 567705 641057 661360 625928 600327 601798 672107
10323 672107 749327 831559 836920 833418 848725 843181 814190 737495 650399 626369 588218 530241
10311 530241 483097 416081 363274 279395 217227 231462 308800 404062 520940 538452 525075
10300 525075 536957 551759 519286 507799 480939 458828 396699 382404 390645 371023 386571 366413
10288 366413 291719 270901 271765 259645 248037 276457 319969 325773 335794 423676 467605 434890
10276 434890 425493 385855 378655 366280 356746 373112 356618 322653 348724 326202 292517 347253
10264 347253 291719 250047 267609 318622 380582 489659 554804 568793 565109 584692 565933
10253 565933 559808 576007 562262 579118 607992 694707 767959 803383 758706 692196 654809 526612
10241 526612 475109 442033 328464 276734 280625 256716 198703 145316 65958 22331 110085
10230 110085 178856 189916 222949 181013 159601 146434 149551 114336 59898 81018 177220 248929
10218 248929 296448 292473 236015 129589 74770 165639 191047 172709 143379 167026 206361
10207 206361 246714 296459 236363 213687 218143 221010 214433 199777 152540 187346 170749 188546
10195 188546 245411 260103 245344 230886 125962 52660 52934 70562 90297 96016 111592 136540
10183 136540 175817 135983 161594 210461 191863 144580 177555 127888 103901 186557 197355
10172 197355 201647 218088 216038 219651 189209 211322 207968 160194 110174 68941 38339 96011
10160 96011 103319 82336 74142 84175 60702 79056 105906 144931 161736 142156 120621 126042
10148 126042 95919 141032 171529 174247 154213 162393 165910 190984 124077 96364 64530 101928
10136 101928 133182 138963 93024 110678 115875 92865 110303 151859 260442 249942 220626 184038
10124 184038 138471 60345 68337 86187 70871 74697 73902 62300 114369 171120 128982 93721
10112 93721 73299 117899 161846 181899 175347 170982 170608 166822 166040 147674 171620 171622 166578 184357
10098 184357 203487 193380 121366 126035 174826 224285 245420 229031 142583 54042 69066 86223
10086 86223 74896 143840 202487 167753 131306 149037 163853 119997 133630 177070 196198 168087
10074 168087 176926 157632 162759 164298 168611 204111 280030 358259 457555 631264 839524 1157685
10062 1157685 1641535 2088725 2234598 2084787 1676229 1187454 853440 652194 504054
10053 504054 429642 394589 321546 300653 278339 255961 250005 204259 185641 211487 203113 193428
10041 193428 227596 304203 304584 273744 217178 231576 199568 170567 154142 192424 207423 203142
10029 203142 223422 272156 364030 491739 687111 954267 1406912 1927399 2251210 2266063
10019 2266063 1951070 1504916 1056037 718412 499238 433538 398591 333686 324773 295106
10009 295106 199957 138535 121118 157519 149392 136066 98317 128594 204264 176280 163906 159025
9997 159025 120332 81864 89508 90079 83257 55303 21616 30698 20404 15169 11902 50867 81945
9984 81945 100696 58182 13776 2992 61461 94423 76396 78753 89694 107305 101920 30967
9972 30967 23480 60531 131411 89227 17870 45097 64253 6105 3912 -15526 20469 62888
9960 62888 47591 48246 94939 123594 129369 138991 146972 193726 203805 197585 180201 136119 85140
9947 85140 73392 99075 135555 175122 153385 133855 76344 -37065 -77414 -67405 -25013 26965
9935 26965 85409 59954 23560 13288 5227 11451 58519 -5236 33368 113708 123554 125252 187235
9922 187235 214665 145151 76510 42881 46362 49247 46598 20038 28191 15976 -14406 -13951 50535
9909 50535 95518 97494 56675 63624 126695 164888 106428 107473 186367 223000 191096 223138
9897 223138 228510 189577 155190 161210 122646 62735 82917 95830 111863 91379 76898 85060
9885 85060 28448 -27948 -17163 12743 15085 40530 34459 34718 22108 10355 1415 -52659 -33024
9872 -33024 32248 70152 138832 181946 132158 54199 50680 90222 111383 81926 62052 74975
9860 74975 122539 162164 185103 222577 307125 369547 426281 418415 356184 330816 302149 228232
9848 228232 233123 210423 172837 207017 183124 149535 125137 97559 134843 117971 76194 37832
9836 37832 52468 64217 62171 69627 63510 70513 24149 31244 101765 111854 48342 -2716 48550
9823 48550 106544 109214 126651 196977 203915 169023 109845 83827 105513 113330 153704 192827
9811 192827 228369 283438 321029 373027 422052 427774 393870 376717 369822 307814 284121 324487
9799 324487 334323 299407 203827 175452 164186 130618 87630 67634 69632 59366 72011 57704
9787 57704 18675 6702 -3160 12533 87395 127083 135266 144608 135588 145353 120849 71810 33906
9774 33906 2709 30956 32778 19937 57401 31267 43068 37768 33282 38441 41563 87623 80163
9761 80163 41528 73641 108742 186045 211468 205084 216164 243142 216593 180640 151726 150352
9749 150352 124044 98184 89044 79926 67998 47091 36825 75994 98277 120905 190469 141137
9737 141137 56471 -24414 -54221 -50437 -47470 -33477 42041 33698 31248 38586 -272 -43618 -35496
9724 -35496 -18604 -24074 2673 69847 117704 66330 54314 53306 48837 17965 58827 149419
9712 149419 178548 145759 144264 165903 167353 131642 75959 17084 2205 35009 8884 -28112
9700 -28112 -43110 -44489 -13680 -41238 -88735 -97789 -53671 -39406 -41497 9712 51329 73654
9688 73654 46451 -7594 -87251 -76329 -38694 -47918 -46919 -65714 -52875 4886 22176 -5185
9676 -5185 -36206 33999 95499 43868 11475 -25522 -52858 -42648 -24010 -43022 -26708 25840
9664 25840 45663 34405 21029 -66621 -72251 -76524 -48073 -20777 -43463 -53992 -30143 -45049
9652 -45049 -8262 4349 23403 44343 55841 17076 5593 -5773 -50475 -42038 -31131 -34379
9640 -34379 -29343 892 45331 19682 -19025 -13260 -9239 26924 36670 28833 1715 13175 -3594
9627 -3594 -8944 11078 35650 48238 53499 69477 57195 33798 39029 68604 75614 77318 46856
9614 46856 44050 19003 -7683 -7656 -7101 8549 -5935 -14491 -22077 22334 52681 269 -36382
9601 -36382 -20961 38777 5093 -7445 23095 37505 69961 66142 17930 -13277 19800 -2067
9589 -2067 -22728 -66134 -62762 -68138 -33806 28559 42398 17372 40400 59501 27848 -17016
9577 -17016 -31213 32924 82772 72715 28460 -4039 28135 15018 14009 60509 82513 84469
9565 84469 110714 127935 96712 49394 26117 -13226 -17641 -32510 -64284 -48207 -9906 16514
9553 16514 10681 15895 20798 7768 -2554 5987 35401 14696 -9460 -25663 -25602 -21817 -4263
9540 -4263 -5939 -3664 31813 72332 104863 87757 62669 16355 37798 32234 28925 -3317 -43925
9527 -43925 -52207 -13722 71628 62769 68987 91811 146755 195963 149881 94831 75863 26081
9515 26081 10651 -53797 -51016 4746 -8571 -35281 -23832 -26033 22126 45693 65972 51164
9503 51164 69014 26598 -28171 -22229 45595 83734 96298 68997 -14885 -11857 41660 85458
9491 85458 36520 -11652 14078 -23793 -34442 -38101 -44824 -30124 -34026 -6141 37542 22828
9479 22828 -8131 18703 3982 19624 57859 39401 28315 7812 11931 4925 11301 -15304
9467 -15304 -40041 -61449 -77530 -32368 -1417 -47294 -111793 -116908 -62216 30517 -17616 -39405
9455 -39405 31434 46620 7431 15621 21497 30528 23723 51389 52903 29787 47675 28998 33358
9442 33358 -3166 -12005 18346 -44085 -26796 16893 -22063 -65280 -60987 -2 45930 -21583
9430 -21583 -55081 26574 54806 49559 3810 14404 38001 5904 -46677 -20861 87338 106637
9418 106637 72380 37364 49657 36254 23746 29042 6933 -33180 2632 36423 55025 52214
9406 52214 13567 19297 -3376 -8200 -1213 49572 69823 61734 39586 -4060 2100 28493 40716
9393 40716 62130 95331 132527 64205 32048 20441 -38903 -47665 -42628 -49087 -38361 22916
9381 22916 34330 63969 94189 71453 53095 67564 52642 44522 17584 26146 23558 -34
9369 -34 13144 39776 40263 5981 -5214 40624 101229 90805 106514 119855 127219 92259 52868
9356 52868 70401 62915 58188 -22082 -26691 25905 35597 62532 43362 14037 35185 22511 510
9343 510 -18647 47262 123619 128316 87116 65199 77098 32428 9758 24671 34212 21906 17296
9330 17296 -527 4042 -15270 -20953 4311 33016 70694 109195 89655 86624 27483 -9618
9318 -9618 16093 79300 53209 38467 38615 7082 29624 76820 63484 17582 38128 100091
9306 100091 70323 24575 20320 -2788 -8304 12220 34663 42946 15595 -6674 -26242 -67683
9294 -67683 -60371 -13182 -1715 19769 -774 8848 8717 -32652 -25247 -7418 -14047 -54503 -61836
9281 -61836 -64200 70 64818 31975 -3943 9551 29674 42219 65902 45807 5466 22657
9269 22657 21920 8578 -6123 -32143 -46353 -32608 7674 64956 97934 39986 28794 34734
9257 34734 35920 -5083 -52403 -17795 -7110 1154 4571 -3581 22775 6523 27122 59937 48546
9244 48546 64942 36286 19409 47529 92852 97553 80918 23913 33741 27874 21108 -7180 36253
9231 36253 31715 46612 80299 74743 72306 33439 71401 92276 99049 102488 89159 26123 17797
9218 17797 25527 -5047 -18467 -45678 -60262 -4686 17170 3501 -34133 -80578 -102553 -79157
9206 -79157 -72100 -57972 -94343 -111692 -60425 -44647 -2539 10678 33813 83837 99947 51365
9194 51365 -15001 6260 44563 67502 121365 121374 64410 78962 82802 104023 67111 54244 49129
9181 49129 54033 57159 25653 51051 66995 152619 153032 119166 148623 145956 102218 96069 135247
9168 135247 113952 61609 47820 10876 15989 25838 112216 67304 49316 60092 76895 80652
9156 80652 100241 78275 111395 134178 175005 200067 177456 117064 85726 151859 151478 164344
9144 164344 130024 88002 87225 56843 76422 146627 214193 258646 231082 263381 300624 313001
9132 313001 280479 268765 283583 275238 266615 293131 415192 473588 545520 580259 646575 730715
9120 730715 822636 966150 1161439 1343505 1660215 2092305 2716060 3786468 5457346 8368212
9110 8368212 13570821 21697586 29505509 31927095 28908425 22144125 14584773 9361468
9102 9361468 6341886 4589375 3533966 2836666 2278987 1865868 1538889 1310958 1158657
9093 1158657 1005158 926015 894551 776362 751655 737659 659825 605399 525514 461001 442075
9082 442075 448854 392616 285501 264103 203674 183911 168393 154870 142684 193326 256849 283878
9070 283878 237069 149721 72987 58497 72603 73236 105628 138234 179683 120603 125140 64308
9058 64308 48154 57377 45691 2979 24090 60917 46217 38239 -9662 -58088 -26153 18642
9046 18642 21204 77512 80488 45152 68506 99848 85094 125190 136627 138672 108106 43079
9034 43079 28575 54266 128489 59140 -34373 -13050 31716 14397 -14495 34815 55151 70526
9022 70526 57520 55950 45970 69746 59205 34579 -30765 -38409 15490 11486 -2597 -12280 7170
9009 7170 9035 41905 83366 111085 86349 93269 75837 43796 8512 54337 86574 47342
8997 47342 42034 34827 33097 -1747 -35404 15850 20935 51307 57775 84344 75066 30261 16697
8984 16697 56056 45983 12383 50689 86994 101090 99006 76107 43678 38772 91067 105683
8972 105683 70376 2218 -63931 -69467 -36144 4007 56009 33364 15236 4310 -19787 -12642
8960 -12642 -37427 -10901 -6911 53028 69362 98456 114204 96811 64693 51939 23866 4097
8948 4097 27632 38872 32649 -21171 -24080 16572 45084 16127 9315 7552 -10082 53922 68601
8935 68601 46652 12352 48981 22725 -8746 -17453 12276 28431 11586 27408 34911 44776
8923 44776 -10611 -40452 -62448 -76342 -54877 -71752 -41081 40663 92562 24635 -26245 38495
8911 38495 52243 -16968 -17835 9962 41506 77804 113376 121616 98073 57690 -16188 -58521
8899 -58521 -33752 -25593 -22875 360 14094 17561 40417 66325 59223 19453 -30612 -15861 -4332
8886 -4332 2507 -20017 -13992 205 -13080 -48334 -55997 -64135 -53773 -15183 -26275 -12447 4196
8873 4196 37721 36175 9533 -1343 15083 58786 41325 21209 -60969 -49202 -22179 -45777
8861 -45777 -77442 -38130 -46258 -32152 -5879 -9913 10936 18324 -47618 -73938 -61602 -75125
8849 -75125 -71808 -54663 -56680 -70167 -24151 -16287 8632 -4441 798 4772 11744 7888 605
8836 605 2220 60491 41105 45822 14599 5328 1746 8457 -3503 18923 57816 85313 63223
8823 63223 51845 29149 47770 37901 20957 59909 55396 45968 19772 43249 15393 -37305
8811 -37305 -71764 -65101 43819 79675 27222 -10536 -8316 -14723 17201 88268 70472 38543
8799 38543 12805 30186 13381 27935 42724 -2226 -24506 -12065 -7754 68031 38048 -10868
8787 -10868 20442 74980 99486 124039 88908 42958 29590 58299 105136 87472 40547 15319
8775 15319 1692 -31740 -22684 -8376 -31028 24791 34180 4461 -27513 -49332 -57755 -22336
8763 -22336 -14263 -6352 35527 36875 50335 -20508 -50424 13764 11332 35487 30876 15537 17909
8750 17909 6967 16513 44298 65891 83254 78138 99554 126887 151986 118088 81181 56357
8738 56357 350 -67804 -68359 -31086 -16211 -70875 -57985 -10964 54007 32574 -35043 -74673
8726 -74673 -74116 -15274 17648 -28681 -57367 -60666 -10660 51035 27867 39471 36955 73201 140630
8713 140630 146121 103301 28044 -7035 -18122 4964 -1199 -808 28221 22961 53505 82206 87089
8700 87089 101350 114349 127865 153362 115096 90140 72135 57329 3357 29673 32280 -17581
8688 -17581 -114716 -156449 -97988 -51560 -60817 -88908 -68679 -75192 -63266 -60599 -1371 59363
8676 59363 81196 54949 55432 27283 22494 62075 36834 41287 22695 2237 6019 24833 23108
8663 23108 -4470 -36502 -6299 14833 9895 -4993 -26127 -5982 43720 66638 84916 30631
8651 30631 -32425 -30685 11779 61907 11492 7316 65276 95144 81888 103382 120861 57403
8639 57403 30195 -34231 -74795 -39984 40867 57930 -9906 28159 8196 23526 71183 58615
8627 58615 63466 57056 22365 1084 -32880 10766 27182 10898 12546 65016 78976 49870
8615 49870 41541 28209 1013 39771 60025 49219 98617 59603 15116 15843 89345 64168
8603 64168 66734 114189 167951 144927 92863 15846 -24632 -3874 35528 22409 72222 126040
8591 126040 90210 77394 49299 115917 160435 166588 190574 209629 183057 137114 115594 127771
8579 127771 124478 116024 121647 116348 104167 116868 142497 110987 88586 63518 18976 -18484
8567 -18484 -5011 27629 57021 102736 138569 124295 113419 85501 31865 24756 26319 15667
8555 15667 14804 -6295 -12206 -2558 -31149 -3111 -860 16876 51541 43105 40833 27290 14920
8542 14920 -701 -4143 -37875 -79244 -55006 536 -2501 -1765 -13748 -39705 -53791 -71367 -39939
8529 -39939 -78242 -101362 -66545 -17105 40497 59189 69972 51270 6031 -27276 -59378 -21743
8517 -21743 26987 1775 -19519 -16344 3231 -6565 -3798 13112 15837 46038 45766 6940 34172
8504 34172 38066 2904 16076 58843 83449 74927 11811 17320 34601 71581 51987 9418
8492 9418 41678 67982 66127 37715 6710 -38121 -15224 10698 28115 39551 37218 50315
8480 50315 38747 40497 26917 -3614 -27542 -73941 -74876 -86583 -74456 -108889 -109119 -67072 -32583
8467 -32583 16743 2670 -31926 -79162 -89800 -79866 -41364 -17452 23471 -17465 5628 9902
8455 9902 31669 41634 49286 34777 -12199 -35138 -28293 4464 28724 63503 91353 95388 74426
8442 74426 78883 71678 111652 102926 56440 7753 45096 33774 -12061 -10752 3811 -6483 33191
8429 33191 64963 84808 100806 36361 -2235 37736 59599 51752 41176 -9866 4966 33222
8417 33222 14600 -12780 58053 26610 30374 17522 -4024 28701 68653 50378 78303 83011
8405 83011 24124 -18146 -30860 8879 26004 11288 21846 -25082 36844 113540 118310 104757
8393 104757 128720 88796 -15092 -3124 -5263 -30102 -46336 -45029 -58904 -14180 -69501 -67412
8381 -67412 13047 65055 33040 5997 -12530 -50054 -32193 35613 37632 34083 32024 20510
8369 20510 69617 85942 95734 79209 3442 20764 17424 35511 27319 -33429 -54863 -27407
8357 -27407 -43312 -17056 16545 38794 39546 82915 77869 38008 -20654 -3715 27913 36675 36010
8344 36010 1772 -12823 5923 4771 27017 -15952 -30678 -38645 -42548 -47481 -1801 46984 2459
8331 2459 -72825 -53616 15119 22389 1066 23382 46028 52741 57739 771 -25392 -27157 -16728
8318 -16728 35862 17862 3077 16682 -4652 -36669 -43700 -29497 -71342 -77511 -36821 -40170
8306 -40170 -70297 -44578 -929 -4256 -42329 -28956 -21996 1251 20819 8856 49959 91607
8294 91607 75596 64490 39350 2327 18180 26679 3819 -24205 50557 87016 42446 64191
8282 64191 66836 73791 58501 27241 -14718 -2173 22591 11847 5230 -62301 -110049 -119840 -108997
8269 -108997 -56360 -7358 44451 65251 66922 43988 -8894 -8696 17707 12035 -24939 -15996 16450
8256 16450 54787 37155 13587 53172 46658 21997 53886 87882 95577 80606 80186 51867 33508
8243 33508 6129 -35595 -56830 -11202 46215 63346 29354 20183 55884 45430 12004 37270
8231 37270 51858 35422 29989 18382 -16167 -25363 36704 64271 85365 95327 41374 19848
8219 19848 -24991 -6870 -15529 -74310 -32206 -32372 -48989 -58272 -81628 -61320 -34616 -13248 19758
8206 19758 -5480 10396 14479 24541 10505 -9992 5012 5888 20811 30891 21829 43494 19852
8193 19852 3508 18218 16039 34029 39969 44312 51652 68842 55827 37542 74338 99362 99846
8180 99846 68297 35286 37477 9115 -80917 -33073 25304 27275 12219 40473 27806 13050
8168 13050 -1172 9796 -1101 19785 31984 27570 25437 11675 -61432 -60196 15984 40080
8156 40080 -3687 -49605 -19004 13758 18861 24281 21225 2323 20474 22401 1099 -8311 6104
8143 6104 14294 20280 35326 36320 19613 -17631 -15557 6425 33900 27789 -19309 -5738 13646
8130 13646 -14738 -24181 -22947 -13143 6117 33663 -17346 -33575 61220 52250 -26129 -43277 -56040
8117 -56040 -87868 -78117 13641 108540 126288 62987 41819 55098 72321 64108 13420 -14217
8105 -14217 -20137 -442 -51081 -54861 -27775 -5536 24168 45847 58632 62051 67273 24983 -43458
8092 -43458 -75553 -91962 -15439 18249 55619 73230 76212 63039 45430 49891 12089 -22549
8080 -22549 -13765 -44648 -61509 -46357 -20035 31858 19888 50960 38789 66801 77788 106154
8068 106154 105426 69395 55123 58238 35889 62636 69165 114582 85082 44082 35355 37181 3024
8055 3024 -31669 -43092 -29212 -3604 -22728 -74342 -92294 -88604 -79542 -71625 -33901 1318 1021
8042 1021 -80 -4794 18684 23848 5096 4647 17824 30099 6846 -23482 -40403 -36757 -64204
8029 -64204 -79644 -13720 52089 38695 34387 26218 -6487 -48665 -29504 2396 -15898 -1440
8017 -1440 11425 31369 21571 -3348 16170 45936 2945 14581 -1549 -48917 -38804 808
8005 808 53929 79686 62258 55078 55193 29418 39787 63579 108911 83951 60749 127723 126090
7992 126090 71630 59827 57934 57874 38978 62191 69680 57732 78025 64799 30050 -16915 -54700
7979 -54700 -28902 -27028 -30910 16275 24690 18460 -36134 -89442 -107681 -111390 -96547 -66727 -66660
7966 -66660 -33499 -41801 12614 38795 25467 23936 8311 -7608 -15390 -18864 -19976 -20685 47501
7953 47501 132399 199243 197715 179081 143303 122343 123186 76113 79381 52178 98882 76394 1170
7940 1170 -45236 -62701 -62039 -60872 -58524 -8208 22713 -3422 -47899 -59995 -53598 -24604 -2997
7927 -2997 28263 28959 12470 4294 -20877 -36350 -41870 -16431 37818 311 -44866 15855 34823
7914 34823 51307 54640 59578 59928 55427 56645 52924 110240 149985 116177 64600 62291 115136
7901 115136 141919 154046 117144 110641 103877 51325 5000 -11746 -5790 -18759 -30171 -31563
7889 -31563 -69464 -75954 -79770 -23794 -1958 -67545 -54155 -6357 59946 42275 3899 -43697
7877 -43697 -83961 -82993 -67636 -17696 -22826 -19921 2696 10434 15732 -1261 -31167 -33721 -17912
7864 -17912 -44726 -34304 -5618 -1107 7173 42175 75387 72832 55644 49596 79809 34445 -1869
7851 -1869 -16056 21105 52804 77917 59956 77968 66208 -2094 35216 62333 20352 9435
7839 9435 -18391 -19819 -9427 -26136 -4835 13999 27453 64013 38537 -37912 12712 56591
7827 56591 -5777 -17288 -2911 9756 4381 -40340 -10298 -12943 20453 30609 63179 60155
7815 60155 48144 58957 34407 18475 -20881 14278 -7790 -56907 -84671 -52276 -30068 14457
7803 14457 -11349 -56567 -33294 -42763 -37636 17099 27593 13316 25525 26012 18599 -9629 1987
7790 1987 16875 45819 41986 15317 50357 50687 33040 41844 52297 -3206 -13140 -8070 -21614
7777 -21614 -50835 -63430 -78300 -61686 -56938 -71193 -83020 -31522 4838 17841 -9175 1556
7765 1556 -5551 882 2377 -40328 -59260 -47887 7880 26727 32636 61353 99798 80064 72534
7752 72534 64463 64341 58685 71679 67968 60913 17218 9805 33062 32865 53384 27743 34638 47896
7738 47896 46255 56998 38834 4961 -15629 -1101 -30348 -69803 -71081 -45573 -62850 -58076
7726 -58076 -83611 -80192 -38524 -38838 -6070 16582 2134 -15366 -17549 11531 8333 -6505 -44524
7713 -44524 -24819 -23663 -43977 -35819 -52148 -59078 -46196 -27313 -41105 -25611 -1287 -16162
7701 -16162 -48769 -69721 9494 12330 -32578 -17623 -13425 38675 -3996 -29478 -49486 -51142
7689 -51142 -52487 -62559 -48059 -12278 12834 -7797 33077 18720 -1548 17426 27419 29308
7677 29308 20928 -25254 -75194 -21574 6102 8263 -12507 -19523 -10183 25462 50123 62679 63165
7664 63165 -3931 -21483 -12248 9022 31663 23954 45816 71175 63695 49399 28932 80705
7652 80705 86006 38419 21525 24876 13909 8193 65 18491 -13881 -22259 -52903 -87999 -70899
7639 -70899 -62056 -29608 16352 12039 -66501 -79896 5781 30998 45139 72937 22695 -39509
7627 -39509 -37058 -16822 -20676 15884 -34729 -54323 -15693 27879 11776 3942 101 47274 46783
7614 46783 55676 6522 -40256 -82546 -65514 6605 23166 -56931 -70137 -105306 -78659 -36128
7602 -36128 53402 31134 -12536 -24535 -51446 -100489 -94899 -88071 -34326 34159 40056 -420
7590 -420 -34668 -55250 -32807 -9692 15381 19163 -38041 -46816 -27644 -13268 -30688 -58321 -78434
7577 -78434 -66032 -66355 -19466 28698 27609 13437 -32780 -19352 31533 55770 32830 45368
7565 45368 22815 -34654 1917 17563 25409 30885 -6387 -44638 -78154 -95720 -65805 -51080
7553 -51080 -32416 3443 -708 -5172 -6586 -16226 -5380 -37200 -41809 -9080 14068 12233 3918
7540 3918 -3665 34180 4278 -39663 -60927 -46195 -29727 -37412 -26448 -30865 -73183 -63511 4340
7527 4340 21495 -9506 -51469 -81899 -39958 964 -13320 -65144 -100706 -125489 -87898 -95155
7515 -95155 -114985 -132392 -124918 -117105 -90532 -47868 -71607 -110334 -92031 -122439 -100348 -52291
7503 -52291 7174 40801 28385 -8451 -11009 -37254 -37240 -57105 -72320 -100609 -93345 -64239 -42813
7490 -42813 -23113 28622 27609 -40349 -58255 -1779 34617 14320 -22881 -10631 -33962 -38495
7478 -38495 -64203 -42864 29414 17768 -30512 6695 -18061 -94828 -53450 -36134 -40010 -49853
7466 -49853 -10787 12390 -15405 -36263 -208 -15324 6411 29376 26014 -19052 -59095 -70191
7454 -70191 -25355 2713 13831 -39184 -10501 3910 31712 32939 -12700 -37312 -35362 -36610
7442 -36610 -28776 -40996 -103056 -126269 -148650 -125979 -68738 -40887 -21270 -14529 -22889 -88892
7430 -88892 -76039 -42578 -16589 -38468 -77940 -137716 -93378 -11800 43617 105375 108740 44016
7418 44016 7860 39170 32205 8460 12810 22009 36143 50228 25675 17120 -33607 -18704 30157
7405 30157 24210 37656 54225 35086 -9982 8763 -10668 -44602 -64404 -93071 -98490 -77133
7393 -77133 -31558 -40113 -87342 -83514 -59650 -46419 -37057 -17560 -7203 -9406 -8624 -40243 -19387
7380 -19387 -39665 -94258 -114946 -79004 20873 67179 67327 98336 57596 -17134 -35127 -12270
7368 -12270 27981 -6765 -44938 -53401 -10862 -24077 -35476 -77379 -98526 -75794 -48532 -4908
7356 -4908 11298 3004 -12993 -4658 -6130 35066 64622 76397 29423 30748 51390 45570 -25627
7343 -25627 -82431 -97915 -41351 -47391 -27666 -18610 -15977 -36081 -19333 -5856 -39050 -79704
7331 -79704 -81778 -128762 -126043 -93397 -105145 -61065 -23021 -14485 -53157 -65696 -37170 -37725 -3745
7318 -3745 19723 18875 -8205 -1049 -11933 -34551 -32562 23039 21783 42689 69192 18184 -4235
7305 -4235 -40403 -57677 -62674 -31170 -72739 -64101 -23976 -7326 -35002 -65298 -69229 -94818 -47512
7292 -47512 11314 -3751 31344 65599 77492 39786 -38290 -45482 -40389 -56093 -11725 58209
7280 58209 78344 76764 25768 -16808 -17912 -18918 6370 3433 -5409 -35821 -51400 -9374 13086
7267 13086 10528 -2169 -36611 -59944 -61603 -61687 -107149 -120597 -92934 -65542 -44958 -2892 3705
7254 3705 30967 -8802 2634 12320 43270 101244 126704 71010 21516 13186 40377 -3513
7242 -3513 -61847 -63479 -13729 -51377 -42699 -42113 -106566 -80172 2910 78506 107348 61935 36969
7229 36969 -11551 -19284 -25923 -25417 -27623 -30814 -38907 -24661 -32977 -48863 -37712 -30644 -44177 14442
7215 14442 61073 61775 77820 88963 68411 61583 56798 49417 38621 65465 93549 62879 32064
7202 32064 15537 39216 74513 71839 22923 14673 47474 44232 10822 16094 27723 -27384 205
7189 205 64247 45545 36966 14744 1868 34179 27204 60358 68363 65553 22402 13876 25609
7176 25609 -2729 -8538 24613 24852 9554 635 -16366 631 -16906 -26529 -973 34935 22425
7163 22425 -39337 -72930 -50797 -5049 34366 -10163 -30652 -31797 -26195 -7569 -11240 34592
7151 34592 49414 -2340 -13795 -78095 -90787 -67135 -71259 -49073 -41623 -17742 3580 9542
7139 9542 -37915 -89167 -64666 -8191 -53 42153 88014 106887 80216 72999 82810 96425 27919
7126 27919 26083 43553 64798 35231 14999 27101 24873 14328 -16259 24606 38773 -13473
7114 -13473 -53659 -74634 -643 24191 -5848 -45852 -72750 -20836 -1628 37867 20345 -24287
7102 -24287 -31802 -13291 18873 6078 -10855 -10009 -47079 -53583 -10877 12920 4582 1121 -16309
7089 -16309 -6691 16084 28670 15940 8727 16921 38064 45740 44833 53479 83202 97881 62829
7076 62829 29495 1122 -6179 -10829 6833 46329 38009 -39733 -63908 -31953 4146 37343
7064 37343 72583 53452 13112 -32357 -59410 -45386 -44291 13228 74871 37003 -23204 7060
7052 7060 15736 -15466 -32538 -12362 581 32471 18174 -35356 -6818 21577 2385 22642
7040 22642 1386 -3636 14319 19764 5010 20569 9852 14730 -53069 -119249 -100357 -94074 -118658
7027 -118658 -91241 -38757 -18287 -32282 -25271 -21199 -10068 -62754 -98228 -71132 -68715 -56275
7015 -56275 -41768 -71393 -70919 -63705 -15236 -1602 5750 63558 91170 82535 61723 59432 95703
7002 95703 71039 52713 -44806 -103231 -58499 3511 23119 30559 39690 28600 29719 30151 14244
6989 14244 -39500 -88347 -68045 -40701 -22796 9038 -14214 -26151 1474 1472 -1233 22125 20128
6976 20128 -24182 -60246 -22925 7177 7663 -34735 -64010 -98314 -79524 -54849 -66393 -36291
6964 -36291 -22520 21761 80829 98659 53659 15400 15109 -20796 1571 43543 33786 -30895
6952 -30895 -84391 -48261 -26092 -11478 19579 13393 -12595 -7106 40802 91208 80798 10664
6940 10664 -5461 14818 60361 16555 -29251 3654 -17394 -19624 -29134 -69181 -61081 -84375
6928 -84375 -68725 5313 20444 43290 44889 46878 23627 31495 16597 43917 46522 35354 30227
6915 30227 -10507 -7562 17880 76932 33056 -12056 -39556 -86045 -93498 -62407 -17571 27785
6903 27785 14679 -44695 -64060 -48038 -50231 -1637 2898 -27370 -41826 -49024 -25125 21570
6891 21570 62649 54941 8331 -30789 -48830 -72018 -73906 -82715 -42592 -71491 -66202 -66824 -26430
6878 -26430 -58769 -74963 -21946 -1176 -18851 -17073 -19851 -16276 -28044 -35773 -54947 -73089 -45091
6865 -45091 -73050 -68533 -56890 -115573 -135798 -85619 -63123 -19255 32751 50588 58612 45307
6853 45307 17338 -29170 2667 -20518 -10932 19202 40481 30782 -10290 -43311 -104957 -123703
6841 -123703 -102616 -30136 -46274 -47503 3975 20628 39346 39213 462 6614 -9961 -35440
6829 -35440 -55330 -66104 -31179 -47919 6849 -19039 -94933 -90833 -81539 -91946 -106952 -49395
6817 -49395 -45242 -36172 -17937 -43732 -53390 -28492 11838 48236 90846 73707 31798 -14270
6805 -14270 -24905 7193 78545 56480 61769 81171 64706 15263 40983 24103 -32247 -30692
6793 -30692 -31491 -7655 18366 -3179 -70248 -81565 -66220 -64373 -42019 -41318 -28725 -67 75
6780 75 -27556 -74690 -61580 -47055 30565 -31066 -60005 -29742 53341 51689 43955 8074 796
6767 796 -1582 -55391 -19677 9209 20355 -27322 -1623 14399 5380 49094 30717 13958 23217
6754 23217 69938 37526 33885 32163 -28627 -23096 19676 55160 69690 39662 7743 -12245
6742 -12245 -2396 -33379 -63336 -33215 19726 23363 -11686 -60762 -82367 -96938 -109582 -110442 -102733
6729 -102733 -86592 -62499 -54190 -43528 -15973 -6954 -2038 4576 7754 -40695 -93927 -85187 -12580
6716 -12580 25642 57948 112786 143945 177273 161820 101096 69971 49542 43195 30644 39998
6704 39998 -957 8554 46879 52374 38626 25167 40503 -11216 -19445 3169 20115 36914
6692 36914 38500 -15928 -46237 -53702 -35098 20932 54040 40038 11468 -6673 38648 35402
6680 35402 862 23192 106981 43483 -42770 -21989 -16218 -3412 -15968 -34654 -23721 -42645
6668 -42645 -34000 -20692 18275 9615 -30940 -36227 1834 5326 -16361 8472 19494 17474 16832
6655 16832 12531 40790 48382 52339 38639 6613 -32992 -4945 32863 55102 72674 29615
6643 29615 -50142 -49453 -12522 38730 16595 -26040 -5420 54110 92752 76152 100820 75481
6631 75481 29086 -10492 -38053 19124 -30036 -34705 -30633 -37486 -25585 -20851 -39732 -32308 -15045
6618 -15045 -15001 -16080 63471 111779 90326 21692 -38982 -64720 -117541 -98723 -55298 -76132 -59104
6605 -59104 12342 34926 13694 -4597 -1954 -26001 -30664 -23583 -44379 -39605 -62656 -92658 -49113
6592 -49113 -11733 14608 21130 4101 -928 -7793 -37525 -34665 -63347 -55732 -46762 -33147 7263
6579 7263 25269 -4373 -32010 -17550 25458 49632 29825 29825 -1147 17924 37329 22329 43046
6566 43046 12755 16910 39558 83302 121225 115558 129466 88839 65045 54460 81660 66815
6554 66815 12275 -22770 -22211 -36590 2695 41045 24546 14196 -30500 -21459 -16806 7035 -57923
6541 -57923 -87395 -95006 -129951 -123391 -113796 -67838 -31263 -3109 4363 5656 42164 24481 -15287
6528 -15287 -64649 -29506 -3479 74 9972 5462 36242 -26416 -25996 -16037 -41783 -26324 -67303
6515 -67303 -56878 -33490 -67299 -42848 -12101 -12095 -1441 31516 20457 -17658 14339 64907 8787
6502 8787 -32005 -32385 -27877 6226 -21334 -26216 28748 78141 37281 -11670 -34373 -20425 4107
6489 4107 31124 29950 31492 -9056 -13717 -13241 -1687 -17520 7453 25337 13281 6383 5711 347
6475 347 12221 6295 18196 44194 37452 18515 29534 32335 13533 -17054 -4905 29394 45021
6462 45021 16810 39749 -5130 -25841 -31779 -33575 -52030 -52879 -17806 700 39856 76649 70804
6449 70804 55349 -17248 -50618 -90076 -147634 -104412 -34569 12113 29670 17836 19664 8363
6437 8363 718 9009 23463 -15846 -19669 -26461 -80720 -134237 -108836 -30734 23106 13421 -21761
6424 -21761 -64922 -140040 -101485 -54161 -64476 -20515 26602 33154 27962 -19426 -24869 -26002 3954
6411 3954 -4806 -17243 -32875 -65390 -22633 -19463 -45437 -43647 8002 39603 63823 27695 29288
6398 29288 21380 -28913 -14529 -14716 8652 50795 32164 40953 27735 -20635 -7404 -10204 -35637
6385 -35637 -49399 -20955 2865 -16075 -40577 -68355 -71628 -53683 2337 -7014 26226 39644
6373 39644 21077 -20757 -29164 -49174 -33851 -5844 39011 41948 47848 3320 -47723 -18100
6361 -18100 15822 21018 -10102 -67691 -75904 -60951 -37321 9636 11230 -4112 -23201 -51166
6349 -51166 -56823 -86588 -99213 -44045 -16727 -17574 1749 17148 -1568 -35660 -25697 38669 58058
6336 58058 25175 41846 59753 41168 30817 -21173 -46973 -46648 -36167 -59098 -63681 -60970 -87122
6323 -87122 -120054 -75917 -25640 -13721 -46955 -66428 -73129 -34423 -11263 -18729 -57266 -77395
6311 -77395 -21414 45297 64519 29060 77866 49127 55135 68691 59192 34575 34447 33228 37260
6298 37260 -22380 -19383 -12149 -20106 -9148 -35892 -45586 -17764 19798 19267 -4938 8004 15928
6285 15928 40092 14774 7692 -36010 -45865 -34831 -48446 -34604 -66503 -85645 3280 22748
6273 22748 -6669 -53625 -67350 -85570 -55240 -12269 -1199 -10879 -58292 -71090 -45129 -61149
6261 -61149 -47928 28438 20884 13367 -6273 -33505 -30044 -26937 -40226 -83257 -89733 -52791 -795
6248 -795 53177 16406 -28347 -41573 -60500 -45105 27301 30801 -17843 -58781 -15986 -31335
6236 -31335 -40996 -53198 -142041 -170275 -100986 -109617 -111110 -68295 -44268 -75548 -53035 -36662
6224 -36662 -19228 11501 63431 33505 8768 -19211 -56180 -74181 -39176 -25957 -56850 -18733
6212 -18733 8253 -26869 -83525 -94548 -83882 -60531 9258 34196 48515 44533 8891 -43007
6200 -43007 -63999 -18705 -16555 -24642 -35747 -17662 24652 59208 63905 63599 38184 2294 -4564
6187 -4564 -8470 -6650 -34624 -67863 -21739 -20506 -35192 -26206 -40682 -26231 3516 -8801 22985
6174 22985 26068 -5555 -29645 -16487 -5781 -7382 -69306 -58182 -53691 -73696 -50818 2242
6162 2242 -6248 -85276 -116023 -104856 -50845 -47692 -63676 -81056 -79766 -69107 -37133 -31203 -41742
6149 -41742 -24161 28372 49283 34540 -11904 17452 21341 9662 39841 -11043 -59689 -14892
6137 -14892 4001 -14940 -35075 -27352 9778 15774 15547 -30330 15080 36640 5989 -37318 -55076
6124 -55076 -7516 -4624 1387 71673 124478 58305 25704 61269 27258 -3306 -3882 -28403 -16851
6111 -16851 12964 16921 28850 14141 -10093 12966 28631 -4635 -12361 -26203 -1745 18765
6099 18765 30469 9941 45218 46004 19009 2656 -24136 -36452 16091 26958 16094 -13915
6087 -13915 -45155 -12629 17485 19006 -5494 -36966 -46619 -12288 3950 37178 37458 -39117 -79291
6074 -79291 -53482 -20895 -30236 -11401 -19991 -40167 -4327 20025 -57700 -115860 -96011 -73250
6062 -73250 -39368 -31645 49282 95085 68702 30248 13141 5228 27369 54623 50313 63366
6050 63366 20997 -37413 -55751 -19631 6323 16151 -24301 -46889 -28345 -32884 -46485 -45386
6038 -45386 -27897 -7453 -8081 -33817 -27387 16765 5453 -5765 661 -27535 -15917 30152 59761
6025 59761 66589 18846 -16510 -44358 -93778 -63534 -36309 9042 37787 57825 73169 67209
6013 67209 62774 47856 54481 55542 23060 1086 21132 26120 24967 41645 47801 -18823 -64234
6000 -64234 -37225 -17883 -12526 -20173 -18557 -31026 -25602 -6449 -27636 -30667 -16209 -1546 -45781
5987 -45781 -34897 -38892 -20156 -9911 24927 7945 11641 7922 -47549 -87951 -64378 -67772 -45376
5974 -45376 -41683 -17053 -17053 -57891 -31698 18604 24616 -12897 -12810 -23036 -21939 -68395 -104646 -99470
5960 -99470 -104001 -32165 16707 -38742 -90104 -66951 -29212 8835 18605 6378 5988 -18369 -1514
5947 -1514 5564 -18010 -5947 21193 37453 14145 -7407 -30207 -60812 -58690 -33134 -71961
5935 -71961 -67204 -45151 -58225 -14867 -23672 -86303 -45300 -19661 -5201 20902 42548 59980
5923 59980 40155 -30562 4531 -9164 -73118 -94611 -57807 -78336 -104914 -124978 -102259 -71877
5911 -71877 -31578 1924 -9487 27782 14648 -21941 -35785 -32578 -50365 -70952 -54998 -41753
5899 -41753 -11644 -59922 -34744 6990 15892 -8082 7694 35250 26663 -22045 -27019 -7268
5887 -7268 52351 78616 31630 -6956 -21513 -24913 -43943 -105212 -71190 -23646 -15910 -61821
5875 -61821 -134967 -100783 -73329 -18306 17662 55955 50454 71486 24326 45373 6351 -11852
5863 -11852 -577 46243 31874 -5477 -14125 -21455 -27734 -33892 -56703 -92873 -127777 -98792 -74549
5850 -74549 -58547 -93081 -105675 -126038 -82751 -34421 42411 63440 13590 10962 6017 -2694
5838 -2694 -43665 -25703 -21888 -13943 -16200 -57128 -61683 -53141 -42892 -2587 29725 37002 920
5825 920 -45916 -46595 -66427 -110845 -122011 -75718 -20545 11910 52443 84827 55911 -32108 -83939
5812 -83939 10897 29016 79599 116904 46939 -29939 -24861 -38972 -40191 -25490 -27729 -32232 -55169
5799 -55169 -59173 -47442 -12438 -47433 -52984 -31001 2264 41815 67867 34633 31039 -3614
5787 -3614 -36764 -42317 24480 73624 63669 82154 51634 10476 -17626 -25126 -15595 28463 55602
5774 55602 52731 -33744 -86512 -43652 -20780 27579 -42990 -94333 -82269 -122678 -78662 -48352
5762 -48352 -35166 -1245 7465 18020 35410 -21790 -82177 -69886 -61331 -82259 -87387 -97091 -81718
5749 -81718 -70841 -24415 -22219 17705 46315 40591 51377 90891 105675 78547 34975 43611
5737 43611 37934 33152 40432 -45891 -97995 -83579 -47854 -47858 -61449 -22504 -15685 1311 -13944
5724 -13944 -89409 -46296 14798 6826 10127 9465 -49327 -53420 -44661 -2764 3660 10752 -20468
5711 -20468 -30794 -15711 21662 7709 14688 35170 50809 43449 49321 63813 43696 -17125
5699 -17125 -48562 -56556 -24786 -6188 -27613 49217 60372 -18067 -38756 -13863 6374 44151
5687 44151 55217 -7 -32519 -32924 -53375 -32716 -39158 -61092 -78801 -67037 -8080 -20433
5675 -20433 -19354 38717 85086 -46549 -138366 -117615 -71873 -107037 -85602 -299 5367 -8665
5663 -8665 -2534 -15089 -2752 2429 -30679 -56802 -36827 -42692 -98119 -70650 147 52656 37346
5650 37346 -16113 -47088 -31014 -11566 -18590 -18872 -22143 -3085 23679 29536 50690 38930 14375
5637 14375 14367 39012 -4606 -37203 -39378 -30947 -74465 -35711 -36557 -25755 -7818 30869 6994
5624 6994 -53166 -36989 17788 33754 31823 -3299 -38469 -68447 -108748 -137294 -95294 -28324
5612 -28324 -12372 -41434 -51671 -27980 -36084 8529 35095 23794 -14759 15576 17911 22290
5600 22290 24020 9093 9137 61245 39694 4269 14397 40102 37987 58906 54265 75878 58041
5587 58041 17110 38823 3023 -4820 35249 52113 74054 56088 79053 122206 108710 79539
5575 79539 71039 55945 51765 49183 101203 129124 85761 42382 30440 41645 39351 45231 41735
5562 41735 -2470 -32236 -40281 -21063 -5495 13345 17141 29542 66333 50933 43684 21194
5550 21194 -19277 -4934 -4883 12428 4030 9701 29646 5176 5295 27833 73258 86522 39689
5537 39689 23841 25270 28196 46303 58910 -18614 -20638 21533 51489 -25121 -55919 -34302
5525 -34302 -20975 -874 -14733 -52548 -10542 29673 36259 65009 66530 49723 36288 -15561
5513 -15561 -5293 -1532 -1586 -56677 -76624 -51967 -63398 -117979 -104299 -75137 -54559 -27243 -39978
5500 -39978 -33274 -598 -21632 -73308 10707 15838 -23248 -16076 18920 43064 33912 9594 34621
5487 34621 56335 97546 97663 21617 26617 95410 132420 96984 39343 41678 26877 3647 18412
5474 18412 40494 20867 28690 23691 -2773 -29445 -6170 -2929 -31097 -27442 -1893 33023 31900
5461 31900 4242 31411 49616 62398 67834 21526 50093 30335 54614 51713 18367 24152
5449 24152 20430 -754 -36034 -35079 31190 5284 -16812 34702 32051 27250 68231 78364 95608
5436 95608 41499 -20955 2583 37768 69049 68629 50903 24990 23248 57127 44333 25221
5424 25221 -1222 12021 18537 82361 94836 75905 2893 -11451 9797 19132 47450 18260
5412 18260 -45034 -54323 -54266 -34843 -55299 -47899 -87140 -108237 -80772 -6536 14120 -2956 -1117
5399 -1117 -8241 -23244 -38241 -90761 -101382 -76148 -46833 -30166 -18074 -56860 -15545 33908
5387 33908 -30903 -45102 17937 16275 14697 -2926 -41535 -8287 -18391 -77463 -77948 -32624 13190
5374 13190 14547 2618 -22334 -7089 -32764 -75023 -38687 1950 24294 16716 26228 59653
5362 59653 61581 34649 12235 5188 -24985 -44199 -34302 -14643 31134 -14968 -10983 2620 34767
5349 34767 24424 6951 26640 27027 516 10976 65332 56868 32479 50597 57466 15827 -12926
5336 -12926 26994 15947 -30883 -6148 -23381 6542 38730 48292 59107 67369 18495 -26041
5324 -26041 -16718 -175 25379 -34372 -39801 3643 63706 94116 72920 32836 22770 -36307
5312 -36307 -52537 -31301 -7739 18832 28125 11772 42111 37019 55146 36556 70830 109602
5300 109602 -4542 -29799 -18600 -4813 -29756 -17377 72253 54530 14728 -3546 -5431 -16553
5288 -16553 -70728 -16372 30930 10415 41586 -6303 -14692 26694 28456 3410 -8430 -27305
5276 -27305 -6873 -51350 -40693 -49771 -4519 -35537 -41022 -51879 -29247 9049 -27576 -60426
5264 -60426 -65324 -61006 -45113 -53721 -59243 -69357 -34999 -57599 -88559 -94414 -47655 -41572 -12936
5251 -12936 34211 78189 18262 9873 -40587 -62027 -45865 -74588 -37640 31757 51663 34524
5239 34524 36187 24971 44559 -18253 -64560 -26320 18224 79184 90122 53595 40700 38082
5227 38082 31088 9867 -24369 4291 57584 87889 65490 53750 55937 51359 18456 19724 -39395
5214 -39395 -13309 16139 5060 10301 7905 -33165 -67609 -76086 -96696 -62080 -15043 9029
5202 9029 13211 3096 -53215 -23977 -1915 -55139 -35499 60328 91019 26753 41256 50403
5190 50403 23722 20802 18013 9817 24540 19205 -1440 -12882 -58660 -26739 7270 -1330 -52933
5177 -52933 -66161 -32979 -37893 -24025 34814 36942 -620 10005 7115 50276 51340 -7088 4767
5164 4767 25386 63320 57056 5394 -47502 -34527 -40675 -50040 3340 31324 7516 -32475 -10825
5151 -10825 26116 42600 24776 -2708 17423 -727 17137 38768 27601 51220 -369 -455
5139 -455 8383 -52883 -53035 -25075 -30180 -58890 -54261 -47329 -47901 13057 29096 38408 92897 140470
5125 140470 75561 942 -34373 -49558 -91599 -68709 -87372 -126076 -98699 -45548 -22057 -25960
5113 -25960 11695 46794 4702 16799 21623 -15113 -8242 27474 -24601 -64343 -44909 4105
5101 4105 38492 61705 70208 58980 42130 15537 9194 -7287 15657 53111 17293 469
5089 469 22996 -18608 -14544 87352 126342 89215 69308 77841 116244 118779 53569 10507 -12658
5076 -12658 -23236 -20339 -64282 -66727 -31010 3756 -3411 -46999 -23530 -23742 -45163 -19778 -243
5063 -243 -7793 -16362 17718 49112 108237 132908 45797 2818 4369 28701 57729 87231 55644
5050 55644 42248 -8059 -42146 -5327 -21596 -45303 -44832 -26480 10587 1145 -22708 -7044
5038 -7044 48376 61951 49683 55399 31368 -26562 -47429 -81438 -45349 -12305 9298 19425
5026 19425 27289 -238 -9007 -14854 -40778 -54107 -60329 -59688 -22801 22628 15578 29246 61128
5013 61128 11352 -25443 -42555 -21664 37502 99556 114739 60264 21398 29967 30105 15852
5001 15852 -15368 -5908 5618 71621 13683 -18248 -8243 -63170 -72717 -48119 -46519 -81571
4989 -81571 -21957 -1367 -49842 -83606 -52485 -2366 -13418 -19194 15008 2218 -5061 -6237
4977 -6237 -25711 -19524 37667 16280 9280 20670 16269 35272 16780 -27153 -39379 -353 -5997
4964 -5997 -30157 -50887 2345 11583 4775 8499 -23875 -19554 -25226 -60384 -46704 -26879 -11741
4951 -11741 8260 5751 -19459 -45128 -7928 29416 5763 -4561 -25525 -62582 -58787 -21343
4939 -21343 24662 -5224 -41223 -47849 -30071 7769 968 -2871 -16899 -45254 -19520 5090
4927 5090 37417 51270 6350 5403 -18533 -16370 -29435 -45663 -75865 -89968 -69692 -42570 -13538
4914 -13538 39050 42300 15528 -4883 -69387 -61377 -72 -2444 -5095 -87811 -80446 -7205 21024
4901 21024 24741 52641 52363 -5859 -47728 -42302 -45528 -152 -5799 -28425 -82615 -64525 -14536
4888 -14536 -9559 -9006 -40959 -51578 -52293 -46843 -54248 -92700 -67189 -48130 2887 55449 49408
4875 49408 16225 -2153 26184 7430 1752 -1104 -16024 25732 44725 73949 63137 -8978
4863 -8978 -49643 -37581 -37062 -40945 -15127 -17403 8704 -27335 -73121 -93678 -64152 -44739 -55092
4850 -55092 -72642 -51877 -2472 -21927 18750 -14896 -18848 -5056 -14736 -12930 4584 -13473
4838 -13473 -7974 1147 -24751 -40737 -46591 -48251 -44317 10426 17062 -20247 -44926 -13013 11806
4825 11806 546 -59980 -46965 -50983 -39784 14851 -12027 -28071 8065 142 -4749 12340
4813 12340 53462 29160 2442 -2791 17307 46396 52725 19117 -26555 11909 49339 35617
4801 35617 38231 58716 90970 37253 -10920 1261 11316 10314 34730 67059 24188 -11526
4789 -11526 59182 109638 83149 36563 27967 7709 -5220 11025 -1903 -17856 -4644 19460
4777 19460 21650 24761 63965 106909 97517 70077 42305 53794 64732 57667 16357 20482 44445
4764 44445 -20581 -40500 6934 9227 -33950 -43448 -31399 -23658 5052 33055 56027 64457 35000
4751 35000 -3774 -55666 -72948 -98562 -69682 -56786 -74054 -64082 -6111 -3091 -7295 2027 -10665
4738 -10665 -15099 -89666 -69992 -10606 6322 -22533 19798 12544 832 2104 -50179 -77395
4726 -77395 -71656 -64194 -41092 -12041 9408 2664 15487 -37531 -92918 -79669 -22687 -16222 -71903
4713 -71903 -121717 -91724 -10041 10761 -27825 -9385 -20378 -55928 -62082 -25723 38487 48299
4701 48299 34619 21859 -7373 -55552 -63804 -45516 -27770 -49148 -19706 12250 -25353 14902
4689 14902 70707 108199 85070 66045 27917 32354 36756 -14390 -69741 -84293 -38526 -52519
4677 -52519 -73507 -45304 -37109 -47776 -48845 -14501 29931 49586 6729 -16231 25110 -2147
4665 -2147 -92695 -133957 -36211 -12873 -19577 -21135 -46381 -49574 4820 10328 32392 -11267 8169
4652 8169 -36133 -83487 -87794 -59137 -62776 -115698 -113441 -4373 26561 19266 -388 29043 16931
4639 16931 -49906 -56789 8860 28738 709 -39825 -20793 -27628 -38639 -50075 -36739 -49753
4627 -49753 -44473 -29821 -36206 12179 25276 -42646 -52960 -52374 -87480 -45945 -40471 -71993 -115409
4614 -115409 -112844 -98626 -45728 -35344 -39686 -13558 -9311 -8872 -18868 -48597 -35301 25605 26324
4601 26324 10983 -18715 13495 28115 -22924 -80383 -75367 -102637 -127208 -120175 -103312 -81866
4589 -81866 -65483 -62654 2150 56978 40610 -5697 -8712 36033 50669 1605 -40307 -33906
4577 -33906 -24880 819 16304 33523 54389 34696 34635 -12575 26759 61550 56835 77423 50466
4564 50466 8205 41664 53842 14174 23811 -18227 -67331 -73487 -78860 -60477 9484 22760
4552 22760 51857 37974 80888 97797 75108 51932 49265 48118 50483 67709 50799 75594
4540 75594 91251 110027 58529 -5264 -65862 -93614 -41502 -16114 -11155 19524 77347 47078
4528 47078 15885 11257 29384 23921 17884 3945 -11398 -36239 -66151 -84695 -45186 -10781
4516 -10781 -42547 -86079 -44355 15114 23649 61007 38692 -33047 -17073 17033 -31087 -73978
4504 -73978 -88905 -14947 18912 4248 1717 -4173 -63242 -76129 -42256 -27378 -80373 -57663
4492 -57663 -32750 -28762 -22387 -24971 3238 4531 -14769 -17806 9924 5916 9957 -7765 -38798
4479 -38798 -51150 -98799 -113298 -117185 -76049 -51252 -21772 40531 59858 50209 23470 -8590
4467 -8590 -24864 -57010 -91497 -94561 -46453 8240 -11801 -19698 -7649 -21682 -35159 -16943
4455 -16943 -12883 -51406 -53553 -69576 -66301 -23103 -41764 -31984 -37691 -85751 -82238 -83382 -63293
4442 -63293 -27560 -31346 -4446 -4111 38613 7464 -20993 -2761 -16209 -44894 -38859 -7931 15097
4429 15097 47189 18507 38665 63004 15897 12087 2538 -9537 -10746 -33361 -36423 -34951 -38420
4416 -38420 -23006 -28928 -27252 -53036 -66692 -88434 -35300 -4444 -89643 -40812 -31635 -50425
4404 -50425 -31510 35066 49219 30452 13134 -21838 -32573 -51745 -45361 -24803 28956 75597
4392 75597 84472 56839 -499 23898 92335 61586 11376 -12809 -7795 10379 42007 62955
4380 62955 57776 22442 31528 10720 -18612 -48787 -17350 9054 29863 12035 -22170 -16941
4368 -16941 -15192 -15693 -45788 -35546 -57143 -101395 -122255 -109981 -32700 -9632 -28417 -34350 -2083
4355 -2083 -20886 13117 59012 91281 78290 64056 16624 -6710 18408 32121 34377 52711
4343 52711 -9068 -59427 -76992 -67743 -22756 -32071 -32149 -7411 25838 19486 -13865 -1854 345
4330 345 -15972 -40862 -61026 -61173 -47042 -67093 -84724 -80438 -89870 -55014 -2874 -35861 -91405
4317 -91405 -55832 -9915 -39014 -39959 -16504 -947 21819 -17623 -11191 -16130 27428 79938 74993
4304 74993 69631 28373 -40159 -106096 -95117 -1495 52764 6779 -49263 3993 32547 28261
4292 28261 53106 27917 54799 94368 87088 99583 93526 40296 -465 -55873 -45912 -23114
4280 -23114 -15753 -27855 -952 33230 73567 90058 100592 127071 80083 65457 66163 44633
4268 44633 -31084 -35989 -17676 -24327 -62304 -81583 -72685 -22910 30263 48587 48183 36056 9495
4255 9495 -20550 -46459 -13600 -7949 26310 17171 -16218 -15551 -31075 -29338 -15645 -37696 -11109
4242 -11109 -903 -53030 -81205 -84474 -51593 12543 65366 71251 -9497 -49945 -16122 -19651
4230 -19651 -27469 -2092 6401 -7552 16940 -9541 -15671 24787 47766 -1632 -24365 -21289 -24632
4217 -24632 38975 26981 -35342 -42686 -32222 -15652 -16146 -2416 -13494 45794 64217 42857
4205 42857 62716 109485 86345 62652 46687 13475 30422 13492 -47090 -37122 1048 -5040
4193 -5040 -22716 63059 84193 -7584 -11837 34774 25230 -24318 30006 56335 11717 1618
4181 1618 33449 44853 25931 4018 15203 33267 38414 39298 -6326 -5324 35278 23792 18549
4168 18549 48124 71309 102965 55239 38102 59840 64935 35082 -5863 -8325 -17584 -34250
4156 -34250 -97248 -85540 -68610 -57572 -68938 1236 75724 19309 -53054 -234 1617 -53957
4144 -53957 -39484 -27692 349 54742 51299 6018 29550 -32395 -37623 -4458 -41470 -76289
4132 -76289 -48823 -22425 -12739 6361 19219 -31214 -10684 47924 71748 51920 22045 12727
4120 12727 49777 8757 -35848 -4897 3567 49067 41620 14992 -7179 -24223 -43844 -14863
4108 -14863 32687 3870 32003 1573 -13599 1718 -9527 2787 -4268 -66060 -68200 -45394
4096 -45394 -26312 2742 10001 18333 56314 85616 25807 29147 27994 24744 28707 36808 45148
4083 45148 22967 18715 31818 60300 39696 -8453 42037 50583 3596 -12849 -5402 10641
4071 10641 50881 17990 -18863 17407 37000 29792 49432 511 8063 25229 45613 -5146
4059 -5146 -14185 19515 -3263 -36301 -7199 -85592 -91258 -62269 -49584 -63225 -81734 -95593
4047 -95593 -100708 -73526 -33972 36213 61742 46105 5113 -97878 -140900 -61983 5378 -15110
4035 -15110 -22195 -41295 5497 29202 -39814 -18527 13821 21979 -14491 -46252 -70103 -81439
4023 -81439 -45611 -66225 -49099 -47391 -89340 -78848 -49859 -19397 -11315 -20372 -40429 -15553
4011 -15553 3750 -28049 -740 93829 91184 60136 6376 -27934 -21376 -19387 -18847 29946 52038
3998 52038 9964 19642 58445 36674 3848 14346 -15591 -33792 -26214 -18236 -23545 -8484 15983
3985 15983 29658 69577 71565 -5630 -22498 -765 -19277 -40647 -55275 -50820 -30820 -31699 -29072
3972 -29072 -8823 -63369 -66642 -71434 -48264 8239 26845 47036 23811 -6015 8978 50248
3960 50248 88589 71247 34644 31330 24463 -736 41578 40568 -22866 -9450 8972 51774
3948 51774 49340 44269 36537 42608 64621 22450 20377 31732 21835 29025 7442 46772 47546 -15111
3934 -15111 -62235 -113473 -106545 -80343 -55478 -34025 40143 41989 -4902 -60450 -55046 -6535
3922 -6535 19666 -12904 -52897 -92441 -72236 -15755 13889 10263 -16451 -25967 -20796 -43699 -44597
3909 -44597 -30479 -31260 17154 43749 44268 42809 17341 -13038 -92732 -101622 -36189 -67444 -93587
3896 -93587 -51158 -36071 -24962 -17313 -39083 6752 26361 12925 4372 -31696 2194 44450
3884 44450 54001 35907 64648 78153 34887 -8898 34345 72450 27165 -33594 -58497 -44212
3872 -44212 -51798 9629 46541 55115 19045 -26301 -23867 -31613 -36711 -102129 -67356 -15938 -361
3859 -361 55862 70213 -2114 -21740 1740 5362 -14158 -58844 -82688 32187 58631 10725
3847 10725 1770 8677 2916 15048 22180 1560 5996 -512 1908 34141 15639 7439 10007 -16366
3833 -16366 -9239 -27861 1274 9636 -11872 6335 -18937 3554 5056 13821 31021 13413 10829
3820 10829 -8914 -24448 -17997 -41138 -44736 -25835 -30405 -39400 -27499 22674 73599 70600 51604
3807 51604 26501 27523 15692 50994 63550 24446 27220 22094 23640 28378 -7812 -17027 -33367
3794 -33367 8114 -15421 -60534 -76493 -50198 -30458 14256 70731 47553 31058 -5231 -18760
3782 -18760 -25596 -46579 -38647 -37702 -38667 -33477 -42075 -2522 11136 1657 -34012 -38050 -35250 -74158
3768 -74158 -41627 -7274 30642 7606 -67960 -86253 -35251 -7269 -42970 -30467 -28329 -14284
3756 -14284 -13444 -15713 -10374 -24847 -14774 -11428 -13573 -7672 -17427 -10686 41219 33164 25647 -670
3742 -670 -54182 -131096 -110147 -113926 -86684 -94323 -84275 -23515 2409 -24500 -23796 -13245 30568
3729 30568 39001 10855 -22036 -25975 -14564 -1792 -31405 -35530 -66487 -65750 -44170 -25436 -30114
3716 -30114 38253 73458 24409 -27316 -30557 -929 16969 -6249 7284 -18784 -12665 -30845
3704 -30845 -22259 10361 40789 57239 14916 -7563 4199 5271 -17205 -56688 -61292 -51319 -19577
3691 -19577 18403 44502 -11499 -31459 -29869 -101123 -102257 -89161 -17922 36276 32481 30011 51832
3678 51832 36015 19980 -51670 -110020 -39125 31041 1343 -38440 -43224 -52465 26114 62953
3666 62953 22848 14354 3804 -80505 -105983 -50096 -33786 -55547 -33261 18166 39128 47091
3654 47091 39152 67597 28668 18867 -665 -44854 -39584 -65477 -62950 -23682 -8645 -16370 -36160
3641 -36160 -50312 -78188 -30264 18942 13626 47969 71198 75178 77835 91448 74828 18432
3629 18432 14460 6959 56612 62724 67006 77903 120284 142047 112129 -5136 -32574 -10580
3617 -10580 55320 12532 33821 61823 80327 70582 45600 20574 -10860 -27249 -8813 -7104
3605 -7104 -6565 18646 34169 6986 -49942 -17884 -31625 -6951 15911 20724 23000 -2073 -11737
3592 -11737 -4782 -63370 -89512 -39837 -33321 -36460 -28163 -15173 -19687 13450 65679 59378 14420
3579 14420 -15788 -24646 -30644 14157 46943 22807 7631 6518 11551 3827 37141 11124 1041
3566 1041 7288 10150 -4622 -3985 4362 29004 43099 74333 78163 41690 66635 69221 -15685
3553 -15685 -31542 -53815 -25447 21689 -33677 -28482 31569 1216 17114 24618 -35943 -75816
3541 -75816 15678 60058 66696 37059 27534 10602 31448 53090 -15065 -26133 -67962 -41782
3529 -41782 -38906 -34456 -33323 -15885 32965 73900 44811 20232 4829 3505 57298 53228 12869
3516 12869 -9490 -24076 -70953 -95306 -74396 -41879 -17485 -7144 -6694 -24033 -29596 -12765
3504 -12765 -33244 -32083 25205 -2040 11976 36446 -41000 -90553 -74037 -24686 -5214 37033
3492 37033 75720 85263 102024 76210 61040 41785 40377 64205 47213 -11556 -94425 -99409
3480 -99409 15723 85074 48628 580 2210 2107 4407 24892 -2594 16217 1181 -30783
3468 -30783 17846 9909 62350 81048 21017 48744 69503 40078 -13221 -12110 -52508 -59263
3456 -59263 -56654 11498 -227 -19186 12914 61489 65178 86870 99010 57849 48369 35131
3444 35131 -16882 -23208 -8900 43495 43090 26760 25321 30737 61259 61233 19696 -3725 2737 45439
3430 45439 61892 84319 18993 19419 52597 105595 146932 145943 112049 88578 48533 53127 9457
3417 9457 -49529 -71509 -76547 -52815 2626 -6260 17441 462 19948 44201 10887 13315 -1933
3404 -1933 -17017 -49666 -7833 -25963 1769 77702 71670 40444 -25092 -40537 4414 16445
3392 16445 10820 -15130 -81742 -61565 -7895 34500 67989 35831 12801 45010 84702 8746
3380 8746 -32872 -67976 -88944 -38515 22317 7460 42050 40936 16384 6029 31856 10479
3368 10479 -34758 -9513 16522 7542 2155 -20328 -24481 -14821 31953 18083 -47292 -45706 2883
3355 2883 3149 12813 48529 66986 63936 19808 -11657 43114 62164 58556 82874 56570 22860
3342 22860 57863 124859 125782 60816 23808 38067 14588 8405 -10173 -44738 -41261 -19218 8160
3329 8160 63550 90030 35777 34150 49930 11555 -47076 -57680 -89360 -59939 -41362 -32011
3317 -32011 -19067 7544 40853 52198 25157 -13079 -35229 -24971 -1072 -64589 -77102 -11331
3305 -11331 -16517 -28833 -47698 -36672 13897 5001 4999 9538 54747 57121 59352 15233 -20481 -9569
3291 -9569 -27233 -42043 -44898 -68271 -87433 -99309 -88220 -112358 -98420 -87552 -51858 -65500
3279 -65500 -60627 -60517 -95459 -132335 -108788 -94622 -94304 -60993 -54064 -62263 -26071 14645 -714
3266 -714 -25829 -43757 3853 49790 28699 25087 40455 -6636 -31918 66896 90525 51485
3254 51485 69227 89026 80887 64957 -2838 -25300 16138 60654 55752 34152 8288 1627
3242 1627 13050 60642 95413 90343 85705 83089 60981 35368 110540 173820 163216 110230 70549
3229 70549 71553 67148 103999 99404 17316 -37503 19790 17495 27135 4549 2947 48772 58768
3216 58768 72587 50618 21674 -24118 17234 17651 11446 13557 7329 45578 97030 108747 52338
3203 52338 60123 54388 16769 -18056 19854 66835 58148 73453 135546 127075 75102 68984 26078
3190 26078 -27826 -65088 -17682 -8992 -22579 -38877 6285 23157 16581 -9769 -11788 -23898
3178 -23898 -55729 -61813 -82005 -95381 -109458 -55698 -23155 -32585 -37436 -23061 -5409 -6917 -42084
3165 -42084 -72383 -77876 -106229 -123865 -50780 25447 67072 68837 26395 11025 13907 -41337
3153 -41337 -58935 -34551 3100 16030 37665 -6433 14626 15430 52833 99120 73309 66392
3141 66392 66153 16610 -36558 -2218 36808 32823 -8989 -54571 -33574 50763 117607 75016
3129 75016 46110 47375 13654 6508 59213 130508 79266 51210 11854 -18463 16222 21257
3117 21257 816 -67060 -38636 -29440 -8334 15819 -17436 -43004 -58685 -44583 -22540 -38768
3105 -38768 -53307 15417 45866 23694 -48032 -35542 22912 48186 87511 83282 57864 -590
3093 -590 -49689 -7216 71415 74898 30019 -19014 6590 58198 53730 12277 -33434 -48892 -16128
3080 -16128 22960 -891 -6988 12015 43905 42637 19502 37478 93923 56497 -12963 9111
3068 9111 97528 98900 60640 5478 -105535 -137782 -76065 -42025 11529 66491 127565 110700
3056 110700 81089 14501 -19425 -22587 9956 53080 57991 -522 -27533 6476 30210 24965
3044 24965 -9837 -42809 -35027 21636 16434 -1765 2903 34112 32890 61997 41136 25901 17983
3031 17983 -490 66 27749 11288 12688 41025 94109 55877 18619 -46279 -53975 -44371 4416
3018 4416 47452 68211 71043 47213 -4936 -33538 -46251 -55023 -39161 -35129 -27871 -16512 7136
3005 7136 14004 -9112 -12926 27777 34381 2248 -40062 -59516 -91560 -92864 -119426 -82830 -38306
2992 -38306 -31118 1324 9836 -19905 -20446 -9967 7272 -21400 -11172 23730 32056 -1277 -23247
2979 -23247 -7477 -5473 -2242 2507 -20616 -35570 -36575 23249 997 20446 49200 69047 31832
2966 31832 -49060 -38987 -44257 -29541 12009 46943 40564 22611 -4913 -40288 -52041 -38861
2954 -38861 16891 40929 11431 -18813 -26052 3706 44031 40593 -1620 -17054 6535 -1885
2942 -1885 27093 37463 44998 55245 89306 81263 93605 81064 70807 52141 75349 98744
2930 98744 88008 83702 61404 43760 53822 41739 30114 55399 52338 65612 87258 88341
2918 88341 43842 -5953 2189 6962 25184 57163 68277 -18497 -53569 -21655 20640 7887
2906 7887 25311 37250 37797 -18917 -38627 -11520 30222 55580 55367 6063 -38431 -10314 -48458
2893 -48458 -99488 -102925 -68038 -52099 7866 -18247 -4825 3579 -53253 -36173 15201 67147
2881 67147 46021 56796 53937 -6550 11588 32407 -47344 -58620 -66848 -49702 26894 31318
2869 31318 36301 114723 103990 46058 37957 57708 31122 37575 5782 -62096 -2664 4943 34109
2856 34109 69419 125553 134726 95401 61811 12552 -17795 -34304 -10971 -8383 37049 20747
2844 20747 1638 -14389 -72054 -78050 -62814 -48595 -76619 -67486 -21651 6864 7955 -4392
2832 -4392 -23102 -27874 -48682 -54757 1711 12062 -42989 -66644 -50839 -6011 27382 21819 -36112
2819 -36112 -69518 -21464 -26005 -1828 -1904 -12890 41010 76286 49395 30288 15639 3764 32474
2806 32474 40654 -6781 -23234 37816 84548 99492 95812 42363 18801 72483 56313 43
2794 43 -24220 -34366 -72453 -76960 -64215 -19880 -25457 -39548 -18344 -21245 -24802 -21038 -508
2781 -508 36071 45512 -3320 -75013 -28565 11921 -26633 -21781 45246 80143 40337 -9229 -3398
2768 -3398 8948 -5931 -9929 -79333 -83781 -15780 -56563 -81577 -31862 3808 11281 -24907 -19000
2755 -19000 12430 -9515 -60635 6502 23101 7172 -14145 -41535 -43554 -30839 -6461 -47269
2743 -47269 -64230 -27038 -29632 -9681 -1166 -16076 -53489 -34442 -26264 -34299 11009 20275 -5283
2730 -5283 -24131 -2480 22937 88567 49361 54317 12958 -56849 -91945 -94775 -74695 -21699
2718 -21699 -22317 9081 -47312 -59765 -26979 -8595 22793 25892 -52896 -54522 -37909 -75108 -69861
2705 -69861 -89563 -105880 -76117 -40656 -27206 28145 -2166 -95316 -68314 -27408 -3080 37720
2693 37720 25843 59490 73602 71123 3416 -61116 -72919 -24080 9140 12884 38048 71850
2681 71850 67367 65915 71276 40400 21093 16168 15470 33385 4270 20320 57118 88490 66953
2668 66953 62376 63944 64751 78803 42069 -13812 -73071 -81596 -3574 -533 -31596 -24616 -43904
2655 -43904 -37579 -105892 -98092 -103434 -64265 -45008 -12441 7220 -32349 -28538 -48291 -69085 -72569
2642 -72569 -48238 -31246 -1458 42471 7591 7391 6509 4298 9441 12368 -31773 -20034 -33716
2629 -33716 -25075 -21725 12012 19587 22940 -13887 17786 22352 37395 31058 40011 41005 -10356 -52664
2615 -52664 -34278 -22216 -66685 -111471 -79908 -47937 -40467 -18279 -14227 -6181 -32348 -69297
2603 -69297 -52491 -60686 -55543 -92285 -133679 -137149 -81943 -58160 -2766 -13245 -38855 5167
2591 5167 2136 29287 21279 47386 33332 21141 35113 17937 6521 -18976 25816 -1176
2579 -1176 -39738 -14555 -40818 12700 30035 12733 -11127 -3876 -4778 -25949 -8704 -7475 -4894
2566 -4894 33164 32791 1447 4569 -12536 -64871 -40810 5757 14781 -43055 -52400 7551 35358
2553 35358 -12392 -1096 -2474 -31063 -40472 79494 96673 69719 11408 16604 4094 -48889
2541 -48889 -20062 29705 28754 -5799 -41612 -41458 -22281 -32445 -44875 -8369 2312 -44790 -48966
2528 -48966 -20062 -1471 37061 24396 6174 1708 -21983 -4696 12792 10747 12819 7748 -29004
2515 -29004 -12793 -11537 -9392 17660 8747 55725 100887 120806 112140 91692 78217 98055 82450
2502 82450 17645 1250 26395 12424 -16002 -17830 10611 5887 20789 72450 12897 -98907
2490 -98907 -94303 -106413 -83139 -32631 13302 29228 -27595 -58097 -36429 -54035 -42677 -11992
2478 -11992 -1802 -66223 -40701 -6674 19670 30666 -5490 -1749 4521 -1444 40938 -8654
2466 -8654 -40078 998 -11334 -26797 36729 64722 73885 96824 95703 92853 47238 84089 101455
2453 101455 105714 92229 34324 48274 41883 52303 71177 90039 31806 -13772 -62854 -85464
2441 -85464 -23108 -19375 -8538 -287 4342 -7186 -60933 -86500 -42150 -40928 -102084 -118401 -66664
2428 -66664 -49938 -56811 -12878 46351 26848 -5974 8001 -9841 4605 29847 68470 27886
2416 27886 2136 11638 18297 -6943 -14358 16499 76982 36215 848 -7863 -23503 -5048 -27480
2403 -27480 -19578 55692 87788 32497 5977 27270 -3939 -778 48923 66327 40981 -16776
2391 -16776 -39700 -22530 -71955 -63442 -55829 -30568 -42442 -3541 35988 49602 -27739 -77162
2379 -77162 -73705 -56195 -31278 -9423 -20935 8233 23235 32376 69960 54226 4518 34184
2367 34184 52833 25711 -7732 681 -8011 10592 59379 64229 79141 87485 35422 -15699 -22012
2354 -22012 -3588 48974 13106 29241 54110 8842 -26272 36404 39310 41224 42269 53861
2342 53861 22657 -16656 14437 2645 -13359 -20586 -7167 4692 -9730 16646 -23485 -43416
2330 -43416 -55716 -35002 -10486 30152 40645 63440 66456 44964 51458 24461 15481 -3190
2318 -3190 54985 55582 21448 18666 12419 -513 48515 44905 28818 28508 59174 54945 29876 -28622
2304 -28622 -87191 -67484 7807 39083 31865 80839 78918 42292 27943 9743 52448 46819
2292 46819 19479 18074 1118 -93984 -145491 -58730 -7037 -44769 -78576 -114520 -63917 -8164
2280 -8164 16624 -26893 -100685 -137536 -35348 -4969 -20991 -66128 -78356 -49349 -23772 -33925
2268 -33925 -48650 -129585 -171287 -128358 -101178 -93274 -9325 35132 80655 94316 84346 43727
2256 43727 16405 4320 1453 12219 17078 43072 26889 7332 -15704 13233 36614 17848
2244 17848 -19277 -52632 -3060 12969 -32303 -41867 -31200 -14701 77615 89959 56387 22852
2232 22852 11299 41037 44555 83622 123525 41680 -47913 -71111 -39902 19208 41181 87361
2220 87361 99665 -7127 -76845 -37948 17487 41771 -18595 -77253 -45854 -17166 5748 12834
2208 12834 28187 3597 -8209 -40602 -6371 11584 -5682 -25717 -69586 -69887 -90788 -45744
2196 -45744 -50297 -26640 -19681 -24044 -385 25220 13745 -49531 -54423 -62080 -97875 -100318 -42417
2183 -42417 -57130 -33923 -25848 -3567 4929 6890 -5386 1005 11187 -19934 -35748 -77936 -105334
2170 -105334 -30939 42450 23101 -43580 7028 53088 17230 -29302 -8702 -41306 -32519 34539
2158 34539 59979 77203 52567 6442 1178 -40497 -93294 -119652 -146027 -120376 -129334 -101848
2146 -101848 -20435 -15467 15528 -1871 -17582 29825 69970 68988 30752 -58703 -53228 14686
2134 14686 14073 -14615 -27417 -48014 -27980 20246 34493 15497 28381 39001 10149 -43246
2122 -43246 -59263 -43772 -56220 -53876 -49867 765 42620 67688 34356 -10967 -45639 -36078
2110 -36078 -41682 -46428 -31774 -9311 26193 70604 29021 11950 61996 40754 59473 105500
2098 105500 69076 21867 20007 15957 4503 -16221 20222 -10652 -80229 -96201 -42918 -14718
2086 -14718 -32238 -21455 -18187 11884 11406 22252 58228 15852 -34792 -10695 42738 40558 68235
2073 68235 77517 86407 65185 53645 49157 24323 36213 62986 92932 22303 -13902 -9645 22132
2060 22132 27535 36543 40585 18892 52568 3052 6527 17131 -21913 -6459 10446 40858 110168
2047 110168 154508 153442 115459 79055 80092 92416 52739 48095 41146 5942 20237 36447
2035 36447 29364 -11125 -6453 49745 73839 47627 2421 -6268 -29139 -15436 -27439 -105
2023 -105 -4526 -12496 -10338 10465 2519 -13897 3011 49666 57670 8009 -27017 -51154 -88993
2010 -88993 -66362 17273 60345 58691 42714 7816 -13305 -21316 6131 22381 38509 54301
1998 54301 44723 -21777 -50725 -70246 -79289 -88036 -112951 -65441 -37633 -39029 -9293 -3855 -24301
1985 -24301 -24622 2545 35529 44354 66653 91961 32970 -1629 -14883 25124 56646 15122
1973 15122 30343 7295 14123 26501 -11640 -18774 -29913 -4625 30070 73781 28691 25715
1961 25715 14875 -13709 -14926 39649 6809 21180 1352 -54335 -90078 -65783 -63820 -33761
1949 -33761 7152 50135 78389 41843 5339 -16383 -12093 -2345 -57436 -45340 -19223 -8844
1937 -8844 -46715 -71520 -48320 1105 3926 11040 50211 18911 2909 -20243 -29660 -26993 -22047
1924 -22047 -36094 -18529 33842 107585 97475 52924 7772 34760 23786 -17540 -27675 -52550
1912 -52550 -69536 -41970 -35545 -69006 -51429 -19187 -42895 -34128 -8523 -15294 -50011 -56328 -36133
1899 -36133 -24192 -4818 1783 -11061 22022 2289 16603 5238 -32608 -73936 -42794 -16449
1887 -16449 -29608 -9367 -41927 -30116 29102 6734 -41741 -35096 -44114 -82793 -117182 -99683
1875 -99683 -60960 -17756 920 13564 21523 21816 -14973 -3966 24436 -11742 -52853 -33228
1863 -33228 22940 18509 43286 74356 11209 -40654 -57431 -44324 -60897 -44838 -46169 27307
1851 27307 50959 60155 59546 19080 -21361 19594 52639 73463 59708 -52839 -104919 -93959
1839 -93959 -90308 -45182 -11008 -19406 -56564 -54290 -70428 -76717 -55872 -31369 11806 23636 2101
1826 2101 -28664 -10141 -13292 -40249 -48916 53870 83451 44888 53441 -31094 -91844 -115648
1814 -115648 -68032 -11126 41051 35907 76642 82226 65839 54918 63331 76837 63798 58215
1802 58215 4201 -15526 24546 60523 84023 92824 95160 71686 29019 874 10627 8974 -18402
1789 -18402 -60256 -52215 1620 -27980 -10129 -15659 4827 19931 -36787 -59564 -53136 -60607 -26381
1776 -26381 -9408 -5545 -15132 -18055 62399 78081 61896 66495 27954 -6897 13131 44451 92921
1763 92921 66570 39708 -6268 19002 36898 55078 73287 80772 49532 29855 39437 -4760
1751 -4760 19457 37640 71576 76243 84108 93966 65129 39629 59148 55218 52440 52313 -10981
1738 -10981 -44108 -10958 -31433 -40231 -45839 -42573 -35890 -22604 -8417 -24609 11307 22713 20520
1725 20520 -26028 -75795 -78226 -77104 -38170 -49746 -9516 75187 48976 17576 -5128 4800
1713 4800 -29935 -23422 33367 46286 10972 -18662 7685 9316 -14164 -19722 -18466 42776 97776
1700 97776 24607 -40945 -91951 -111730 -82055 -53381 -44644 -7594 19955 -4067 -54262 -33117
1688 -33117 3787 17899 41171 3206 -25163 21336 47729 4573 -20744 -13893 -15899 -11818
1676 -11818 -77499 -98986 -29224 -4232 -43206 -8299 31824 -6611 -14818 -18362 -3870 -16178
1664 -16178 -24862 -44893 5407 25453 26087 512 -9136 -26214 -69314 -25656 -6807 -23790 -36306
1651 -36306 16581 14334 -36907 -110768 -108235 -48752 -840 -32912 -62224 -30696 -28796 -32505 -5361
1638 -5361 32756 34560 31948 28480 24285 14868 48427 44771 45197 70724 58405 52668 111977 111490
1624 111490 90129 59489 38318 8086 -41804 -29137 23269 77125 93825 74373 49610 67088
1612 67088 71566 36667 44691 63300 34932 -8726 -20608 -28867 -37906 -29435 20317 101836 69730
1599 69730 22937 5427 25253 35949 48438 106777 59440 34011 55604 71813 29428 -4594
1587 -4594 -15208 23237 17341 -41301 -63102 -32434 41825 -13473 -60465 -51739 -48844 -15986 -46189
1574 -46189 -79074 -72462 -97180 -74697 -47564 6327 72691 125604 128565 111293 77361 82257
1562 82257 55702 60843 75809 27608 -12610 -22435 -96158 -122495 -66033 -51 -27760 -96482
1550 -96482 -75847 -49444 -14346 -23909 -43804 -78259 -100819 -120213 -115605 -100649 -55497 -64044
1538 -64044 -71025 -105049 -113370 -43319 -37449 -1920 57281 43801 13060 2492 4220 44690 78176
1525 78176 81089 86790 92620 124277 80021 2575 -26054 25918 -12420 10730 14720 -21086 -51693
1512 -51693 -48888 -56696 -35336 -898 -16853 -61443 -92008 -67200 -18043 5160 -12279 -35302
1500 -35302 -17255 -37066 -69054 -53169 -36421 -37712 -56621 -89500 -77847 -73223 -114404 -100006
1488 -100006 -72602 -13851 50885 34073 27282 21586 20718 55035 48003 -15773 -13478 2023 -26559
1475 -26559 -38773 -16296 15719 -12418 -38176 -15937 -6757 -55643 -79932 -12051 10669 -10298
1463 -10298 -29543 18039 38474 -10874 -28500 -20059 -30299 -26183 16014 -1307 -2372 20085
1451 20085 80313 119129 91636 80017 64672 61031 64252 45142 -27163 -35400 -39477 -37638 -9033
1438 -9033 35042 58476 58507 13721 20612 -2108 18679 74491 79444 44064 -27637 -46358 -13796
1425 -13796 16199 -15457 -37684 9657 64970 61897 84713 104229 84811 17203 8511 23817
1413 23817 18141 25056 17165 -26709 -9497 -2725 16137 27003 32081 17136 8614 -43455 -83665
1400 -83665 -80242 -97589 -97412 -14240 35029 43341 -14455 -35432 33136 41341 30665 14674 -26818
1387 -26818 23285 39690 34899 27778 69232 65022 8276 -32417 -36505 12546 39529 56599 46073
1374 46073 28852 7771 -43836 -55599 11931 42906 31751 21564 -22913 -98413 -67623 -29402
1362 -29402 -19886 -24437 -21171 26742 42531 29355 43183 74019 73971 -2988 -50859 -48366 -58221
1349 -58221 -74630 -51795 -23396 -10823 -45658 -83370 -100058 -112160 -75796 -11450 41193 29267
1337 29267 22275 24 -36560 -19289 -31372 -51531 -22375 -1524 23426 44446 17511 -2671
1325 -2671 -41180 -45219 7127 28288 -16560 -58219 -26236 13362 18860 25127 29228 22086 12933
1312 12933 -25739 -99694 -117014 -81729 7638 76053 71207 27663 -6771 -33560 -6887 26382
1300 26382 3597 5889 -27077 -55754 -15185 10209 25311 28739 23979 -6819 -15766 -9935 -22903
1287 -22903 -9240 -12902 37548 24156 -11492 -27646 -9570 263 -21748 6446 1835 26879
1275 26879 98074 92214 27289 -68183 -31012 -12924 4410 14094 1114 -40909 15322 77677
1263 77677 99327 30110 23441 18853 34725 15083 -3941 -13439 33441 91603 79291 36897
1251 36897 45831 67030 80974 31394 -10120 -7708 41087 85018 103300 91139 55853 -7632
1239 -7632 -60274 3773 66947 47342 37417 18870 -22331 -24719 -24884 -6736 -27327 -53461 -16682
1226 -16682 42642 83532 21658 -21102 -22149 -17009 -2850 -35072 -44049 -43385 -31253 -3340 41712
1213 41712 55417 13809 32853 64223 112369 116001 82159 56516 50750 27434 15993 39342
1201 39342 86613 96992 63588 60712 48196 23087 -26712 -69261 -59146 -66781 -61057 -31665
1189 -31665 -13305 -932 3354 8830 13250 31379 -30479 -71322 -71913 -73524 -47501 -7530 28302
1176 28302 19409 -16995 -26480 -13858 5785 44013 31206 -8051 -41162 -82823 -89427 -86325 -4277
1163 -4277 20201 -9811 -6770 20546 24385 -11391 -66977 -103885 -93172 9384 57189 27135
1151 27135 -951 -20439 -25501 -3324 -1612 16101 49287 11534 -17367 -7278 -11143 -19024 2155
1138 2155 13433 43743 23642 -28615 -34818 -24080 2694 37944 86747 51001 43189 71576
1126 71576 57830 85369 113203 46694 -25908 -26611 9649 -29566 -16701 -55639 -94680 -60428
1114 -60428 -29636 19354 -24729 30947 67908 36098 -23204 18833 20202 70705 66354 19656
1102 19656 24030 20306 9278 10798 -13120 -46468 -53497 -84989 -82439 -45827 4530 16966 80377
1089 80377 107888 -10915 -80084 -78590 -72189 -66510 -82256 -113037 -64581 -29034 -3067 32959
1077 32959 77311 39382 12931 3999 39737 86768 81663 86756 126982 82768 17118 4447
1065 4447 -22307 2797 27331 33236 21353 -43393 -43733 -69977 -102039 -101881 -45666 -758 20538
1052 20538 29964 94438 98104 85336 98110 100949 79516 50905 25788 -15366 -12917 22821 -4746
1039 -4746 14673 15228 88568 146863 128206 110230 63473 43790 30720 27681 38241 62008 53944
1026 53944 30567 9677 17483 -3650 -91941 -95592 -83677 -20146 25142 172 -359 -23894 -54987
1013 -54987 -6703 65643 90486 73112 75662 81381 43263 8655 53832 100629 110972 88177
1001 88177 21641 -36815 11798 72022 91505 94881 115198 57939 -3540 -68430 -77117 -29012
989 -29012 -5816 9938 11370 22897 95830 102107 30944 -7146 19128 22550 32116 47391 55475
976 55475 71987 61785 40397 28101 -22772 35016 38123 18165 -15692 -35818 -33138 -47961
964 -47961 -16344 16680 1263 -31924 -26759 -34738 -67690 -67731 -54359 -5610 58582 4531 -88399
951 -88399 -130638 -119804 -75933 -35420 -33151 -45651 2525 -20694 -26567 -47640 -40361 -13748 -22889
938 -22889 -1079 -4729 8533 -6779 14055 20977 5681 -2863 -48700 -87667 -43627 -6611 -24980
925 -24980 -63950 -74291 -83374 -43842 46658 40719 -11036 -32722 -51703 -24344 31042 30467 4498
912 4498 14378 2527 -10876 6103 30449 24960 15230 -1547 82320 149638 182813 117144 54119
899 54119 33190 -7883 14277 39751 49584 62426 12470 -1947 1746 -22554 8142 68937
887 68937 83459 5585 -35746 -1818 4694 7411 6719 -13486 17148 -14866 -35000 -744 5976
874 5976 -18083 -7821 3219 -30464 -47501 -55932 -41157 -19013 -12095 -30187 -20721 9837 35226
861 35226 53521 34915 -13638 -13686 68151 74040 34813 -1871 22644 38203 2832 -41515 5959
848 5959 37799 13864 -15057 -58895 -60554 -49147 -3485 -12425 -30569 -40851 -19666 -7192 9214
835 9214 50940 92534 50189 30737 -12596 -65631 -27109 -24305 -21434 18168 36260 7786 15598
822 15598 -7676 -5681 -1790 10476 -19898 6505 42692 70810 105916 47603 18098 6348
810 6348 -4511 -2155 20249 28015 14608 32463 56043 72511 59903 86874 103632 81646 61216
797 61216 85004 35436 -1983 -44896 -12489 35089 28189 11096 25877 20532 -14683 16516
785 16516 32474 26357 35761 58358 60650 91456 112455 108698 85138 44499 50095 77808 109129
772 109129 133001 92841 98417 113183 68100 7819 5540 74623 85691 59944 22724 -1564
760 -1564 -23785 2928 5757 -6547 -27575 -86398 -54063 19011 31659 -26609 -117202 -133249
748 -133249 -74291 -17989 13984 15314 22516 37752 5136 -9977 10557 57830 92654 86213
736 86213 67229 52715 39662 19364 59168 104354 80944 81061 52663 29279 28734 40123 51259
723 51259 78675 68842 101668 73543 67849 7616 -28656 -95781 -126529 -108794 -103477 -93355 -35024
710 -35024 55239 78453 70468 61990 -3209 11504 9481 12395 37888 60437 78318 65191 32343
697 32343 -20819 -16066 -36619 -16200 28775 70051 53743 -9399 -3494 27795 77913 51724
685 51724 22928 29327 12552 20845 10398 -13421 18131 53742 54310 38397 36482 8366 -8599
672 -8599 3032 -51229 -108403 -64890 -27153 3648 -11554 -12651 15410 39153 55150 -6303
660 -6303 2024 -16916 42916 103133 123535 83892 124044 115184 87147 37150 81118 107462 93190
647 93190 41765 -17453 -45449 -78257 -24091 35430 71491 37581 -17543 9333 52940 21597
635 21597 16427 32472 -7788 6395 8475 6542 33965 49540 104022 121696 61108 73548 39307
622 39307 30183 66945 73472 72446 122072 149666 167256 141258 101478 67876 8304 3104 45028
609 45028 75340 81417 45159 32776 32091 31831 58947 66645 96038 84042 80613 66522 62385 50953
595 50953 97829 160130 176113 166744 120471 123102 150824 112483 49448 10319 56644 95560
583 95560 86676 70926 61791 37682 -8383 -13546 -2514 -7936 -5803 -8130 19813 -36767 -19556
570 -19556 3016 -17208 317 15194 72819 65196 97109 71701 46293 49330 32544 37057 13184
557 13184 -39241 -46349 -38348 -78402 -51337 -31296 22567 105209 96097 -6201 -9267 -24623 -8068
544 -8068 18974 39644 -9426 -38190 -30430 -15140 18453 48051 85180 104354 80998 37525
532 37525 26900 -1565 15729 49520 63213 48585 55289 75816 95094 90473 101317 66507
520 66507 36346 -2464 6524 32042 14007 24362 8742 -23636 -11574 2344 38882 8205
508 8205 -6802 10577 17264 -29799 -38902 -12343 -19864 -20828 -33721 -25961 7513 17041 3289 -16901
494 -16901 -1469 25135 37662 11571 3588 -18612 -19745 7953 36690 67109 43201 4562
482 4562 33522 59879 55744 101747 103212 81151 53017 159 -5228 -3779 -28229 -6709 55045
469 55045 133024 105827 63789 83697 89249 81301 70117 51177 58331 68740 68086 93419 125343
456 125343 112438 57362 13064 -7243 -3700 31315 23487 40455 55252 51231 50807 48101 40640
443 40640 91232 115523 134094 102696 62153 89389 100910 116460 145155 131789 56415 12838
431 12838 21105 -2959 -7797 6381 5731 -2070 645 13765 -20854 -75459 -62472 -22355 18494
418 18494 56405 22093 10480 33583 49820 20295 -24815 -8932 7190 10428 52609 74596
406 74596 49556 -4718 -28752 -29966 -40327 -3169 10974 5007 -41039 -16651 14412 62829
394 62829 56829 26940 47327 131158 121666 104266 113075 94750 35990 -4037 -22099 13987 59488
381 59488 87400 81360 85768 65692 45449 52717 52657 104521 118016 137331 109006 35447 -8902
368 -8902 -37360 -16124 -10898 -24632 11517 10600 52272 14834 -73919 -82825 -34344 -3801 -38273
355 -38273 -13841 -10252 -19295 21396 16793 47510 54557 20354 42454 52054 19822 4168 -13598
342 -13598 -30967 -52368 -34050 -27640 -22741 -600 9578 15200 -13255 -12178 41270 91271 64633
329 64633 35811 41792 53448 77008 84575 89479 95764 69747 31054 35061 50161 84024 87193
316 87193 101153 108866 74561 79177 68095 74078 52440 38393 29389 1104 37032 115705 135468
303 135468 45787 -2686 22345 48757 42868 6212 -19031 -12176 14411 -5462 -38857 -17297
291 -17297 1675 43634 53496 91938 86198 70109 91746 87493 84959 64956 68388 44191 38037
278 38037 42460 92713 113991 64345 25395 6209 -12254 -26388 -25962 6251 30748 43476 28174
265 28174 22969 -3048 8475 -6073 -10639 8277 21952 2500 -11339 14472 28250 17917
253 17917 -20609 -34423 17582 33580 71579 84007 84311 77732 33951 26591 34685 34101 1264
240 1264 19721 51961 69104 50976 29870 43488 71773 114501 74411 16147 32854 54092
228 54092 88977 115358 135672 120346 79926 17439 3250 -12504 7299 6650 25941 46511
216 46511 24389 -14583 -54048 -65419 -40489 -38059 -10593 30483 44438 59947 21540 -3745
204 -3745 21760 11403 -26538 -29430 -13081 27735 47888 46968 31888 20371 42688 18445 13046
191 13046 19247 40893 83487 98145 63521 69655 56750 62348 76293 80475 62992 51848 34822
178 34822 38444 42083 22835 36301 30025 23017 27864 22797 26846 36319 23880 26565 55665 49742
164 49742 37200 29748 34954 13388 13908 18622 -14939 7664 34712 49472 39604 80895 126832
151 126832 141544 115718 84371 83306 81184 50119 7733 -2638 33262 71761 75535 91251
139 91251 85878 61664 77209 86918 62487 35629 18365 2263 -18141 -12371 3697 -305 9214
126 9214 49643 75784 50965 45868 69239 47278 42622 26802 41219 51268 35744 20008 26900
113 26900 27675 -29125 -13531 18308 13563 -3765 -17165 4133 49231 1634 -11375 32441 33506
100 33506 24510 32711 33952 13381 17666 67942 82894 61296 33025 17139 13830 41419 43281
87 43281 27068 16073 7314 -29350 -25538 11981 8935 -33231 -10791 26396 50056 57148 57041
74 57041 66605 50527 72304 85673 92574 82862 62915 17531 -44748 -29709 45707 24384 -32302
61 -32302 1127 32161 34784 37513 -1934 -4862 5734 3286 39812 63296 41520 39199 62799
48 62799 52797 58145 95475 125198 117224 84140 93431 112985 116833 103401 58921 16439 19767
35 19767 -4308 4581 40473 34573 -12625 -18863 6119 3337 706 25884 24332 26595 48135 57319
21 57319 30081 42986 14533 21829 19853 58053 27580 -12863 -19823 15345 57288 85919 99213
8 99213 54023 -2133 -35657 3617 52493 53400 58554 40313
0 40313
$$ Imaginary data points
##PAGE= N=2
##DATA TABLE= (X++(I..I)), XYDATA
32767 23967 -1627 -4017 3306 37011 44936 45271 23407 -22861 -31335 -449 -4104 -2850 33386
$$ [...]
##END NTUPLES=NMR SPECTRUM
##END=
