##TITLE=Analysis number 317953
Compound Code cc 14547
Book Reference 471/26
Project Code adrs
Chemist Name carlr
##JCAMPDX= 6.0         $$ Bruker NMR JCAMP-DX V2.0
##DATA TYPE= NMR SPECTRUM
##DATA CLASS= NTUPLES
##ORIGIN= Bruker BioSpin GmbH
##OWNER= nmr
$$ XWIN-NMR		Version 3.5
$$ Thu Mar  9 08:23:13 2006 GMT Standard Time (UT+0h)  MAYBRIDGE\nmr@NMR_250MHZ
##.OBSERVE FREQUENCY= 250.131544655141
##.OBSERVE NUCLEUS= ^1H
##.ACQUISITION MODE= SIMULTANEOUS (DQD)
##.ACQUISITION SCHEME= undefined
##.AVERAGES= 16
##.DIGITISER RES= 18
##SPECTROMETER/DATA SYSTEM= dpx250
##.PULSE SEQUENCE= zg30
##.SOLVENT NAME= CDCl3
##.SHIFT REFERENCE= (INTERNAL, CDCl3, 0, 16.522)
##AUDIT TRAIL= $$ (NUMBER, WHEN, WHO, WHERE, WHAT)
$$ ##TITLE= Audit trail, XWIN-NMR		Version 3.5
$$ ##JCAMPDX= 5.01
$$ ##ORIGIN= Bruker BioSpin GmbH
$$ ##OWNER= nmr
$$ C:\u/data/dgb/nmr/ADRS/360/pdata/1/auditp.txt
$$ ##AUDIT TRAIL=  $$ (NUMBER, WHEN, WHO, WHERE, WHAT)
(   1,<2006-03-09 08:22:51.32 +000>,<MAYBRIDGE\nmr>,<NMR_250MHZ>,
      <created by zg, POWCHK disabled, PULCHK disabled
       configuration hash MD5:
       84 BC 41 DB A1 6E 1D 46 DA 25 12 A5 C1 ED C5 3A
       data hash MD5: 64K
       A0 91 1B F4 43 3B 97 4E 9B 66 D2 57 55 7D C3 B3>)
(   2,<2006-03-09 08:23:04.27 +000>,<MAYBRIDGE\nmr>,<NMR_250MHZ>,
      <Start of raw data processing
       ef LB = 0.3 FT_mod = 6 PKNL = 1 SI = 32K 
       data hash MD5: 32K
       97 7E 93 3B E4 7A BF BE 46 61 0B F7 3B C7 C7 F9>)
(   3,<2006-03-09 08:23:05.80 +000>,<MAYBRIDGE\nmr>,<NMR_250MHZ>,
      <apk 
       data hash MD5: 32K
       C2 4B F0 FE 6E B5 4B C4 E2 DE C9 3C 42 65 E9 F2>)
(   4,<2006-03-09 08:23:06.54 +000>,<MAYBRIDGE\nmr>,<NMR_250MHZ>,
      <abs ABSG = 5 
       data hash MD5: 32K
       FC AC 2A FA AF 68 F1 35 80 72 F7 C6 0F 53 1F B5>)
$$ ##END=
$$ 
$$ hash MD5
$$ 74 5C 7B D5 94 CD 7A 09 89 5F E8 8D 76 06 CD 92
##$RELAX= 
##$RELAX= 
##$RELAX= 
##$RELAX= 
##$RELAX= 
##$RELAX= 
##$RELAX= 
$$ Bruker specific parameters
$$ --------------------------
##$DU= <C:\u>
##$EXPNO= 360
##$NAME= <ADRS>
##$PROCNO= 1
##$TYPE= <nmr>
##$USER= <dgb>
##$AMP= (0..31)
100 100 100 100 100 100 100 100 100 100 100 100 100 100 100 100 100 100 
100 100 100 100 100 100 100 100 100 100 100 100 100 100 
##$AQSEQ= 0
##$AQ_mod= 3
##$AUNM= <au_zg>
##$AUTOPOS= <4 >
##$BF1= 250.13
##$BF2= 250.13
##$BF3= 250.13
##$BF4= 250.13
##$BF5= 500.13
##$BF6= 500.13
##$BF7= 500.13
##$BF8= 500.13
##$BYTORDA= 1
##$CFDGTYP= 0
##$CFRGTYP= 5
##$CHEMSTR= <none>
##$CNST= (0..31)
1 1 145 1 1 1 1 1 1 1 1 1 1 1 1 1 1 1 1 1 1 1 1 1 1 1 1 1 1 1 1 1 
##$CPDPRG= <>
##$CPDPRG1= <>
##$CPDPRG2= <>
##$CPDPRG3= <>
##$CPDPRG4= <mlev>
##$CPDPRG5= <mlev>
##$CPDPRG6= <mlev>
##$CPDPRG7= <mlev>
##$CPDPRG8= <mlev>
##$CPDPRGB= <>
##$CPDPRGT= <>
##$D= (0..31)
0 1 0 0 0 0 0 0 0 0.06 0 0 0 0 0 0 0.0002 0 0 0 0 0 0 0 0 0 0 0 0 0 0 
0 
##$DATE= 1141892570
##$DBL= (0..7)
120 120 120 120 120 120 120 120 
##$DBP= (0..7)
150 150 150 150 150 150 150 150 
##$DBP07= 0
##$DBPNAM0= <>
##$DBPNAM1= <>
$$ [...]
##$SUBNAM7= <"">
##$SUBNAM8= <"">
##$SUBNAM9= <"">
##$SW= 20.6930455092707
##$SWIBOX= (0..15)
0 0 3 0 0 0 0 0 0 0 0 0 0 0 0 0 
##$SW_h= 5175.983436853
##$TD= 65536
##$TD0= 1
##$TE= 294.16
##$TE2= 300
##$TE3= 300
##$TEG= 300
##$TL= (0..7)
0 120 120 120 120 120 120 120 
##$TP= (0..7)
150 150 150 150 150 150 150 150 
##$TP07= 0
##$TPNAME0= <>
##$TPNAME1= <>
##$TPNAME2= <>
##$TPNAME3= <>
##$TPNAME4= <>
##$TPNAME5= <>
##$TPNAME6= <>
##$TPNAME7= <>
##$TPOAL= (0..7)
0.5 0.5 0.5 0.5 0.5 0.5 0.5 0.5 
##$TPOFFS= (0..7)
0 0 0 0 0 0 0 0 
##$TUNHIN= 0
##$TUNHOUT= 0
##$TUNXOUT= 0
##$USERA1= <user>
##$USERA2= <user>
##$USERA3= <user>
##$USERA4= <user>
##$USERA5= <user>
##$V9= 5
##$VALIST= <valist>
##$VCLIST= <CCCCCCCCCCCCCCC>
##$VD= 0
##$VDLIST= <DDDDDDDDDDDDDDD>
##$VPLIST= <PPPPPPPPPPPPPPP>
##$VTLIST= <TTTTTTTTTTTTTTT>
##$WBST= 1024
##$WBSW= 4
##$XGAIN= (0..3)
0 0 0 0 
##$XL= 0
##$YL= 0
##$YMAX_a= 340237
##$YMIN_a= -334202
##$ZGOPTNS= <>
##$ZL1= 120
##$ZL2= 120
##$ZL3= 120
##$ZL4= 120
##$ABSF1= 16.522
##$ABSF2= -4.171173
##$ABSG= 5
##$ABSL= 3
##$ALPHA= 0
##$AQORDER= 0
##$ASSFAC= 0
##$ASSFACI= 0
##$ASSFACX= 0
##$ASSWID= 0
##$AUNMP= <proc_1d>
##$AZFE= 0.1
##$AZFW= 0.1
##$BCFW= 0
##$BC_mod= 0
##$BYTORDP= 0
##$COROFFS= 0
##$CY= 12.5
##$DATMOD= 1
##$DC= 0
##$DFILT= <>
##$DTYPP= 0
##$F1P= 14.0000005364418
##$F2P= -0.99999901652339
##$FCOR= 0.5
##$FTSIZE= 32768
##$FT_mod= 6
##$GAMMA= 0
##$GB= 0
##$INTBC= 1
##$INTSCL= 1
##$ISEN= 128
##$LB= 0.3
##$LEV0= 0
##$LPBIN= 0
##$MAXI= 10000
##$MC2= 0
##$MEAN= 0
##$ME_mod= 0
##$MI= 0
##$NCOEF= 0
##$NC_proc= -4
##$NLEV= 6
##$NOISF1= 0
##$NOISF2= 0
##$NSP= 0
##$NTH_PI= 0
##$NZP= 0
##$OFFSET= 16.522
##$PC= 1
##$PHC0= 174.1262
##$PHC1= 8.24752
##$PH_mod= 1
##$PKNL= yes
##$PPARMOD= 0
##$PSCAL= 4
##$PSIGN= 0
##$REVERSE= no
##$SF= 250.13
##$SI= 32768
##$SIGF1= 0
##$SIGF2= 0
##$SINO= 400
##$SIOLD= 32768
##$SREGLST= <1H.CDCl3>
##$SSB= 0
##$STSI= 32768
##$STSR= 0
##$SW_p= 5175.98343685301
##$SYMM= 0
##$S_DEV= 0
##$TDeff= 65536
##$TDoff= 0
##$TI= <Analysis number 999999
Compound Code 99
Book Reference 9
Project Code 9>
##$TILT= no
##$TM1= 0
##$TM2= 0
##$TOPLEV= 0
##$USERP1= <user>
##$USERP2= <user>
##$USERP3= <user>
##$USERP4= <user>
##$USERP5= <user>
##$WDW= 1
##$XDIM= 32768
##$YMAX_p= 363758958
##$YMIN_p= -339998
$$ End of Bruker specific parameters
$$ ---------------------------------
##NTUPLES= NMR SPECTRUM
##VAR_NAME=  FREQUENCY,     SPECTRUM/REAL,   SPECTRUM/IMAG
##SYMBOL=    X,             R,               I
##VAR_TYPE=  INDEPENDENT,   DEPENDENT,       DEPENDENT
##VAR_FORM=  AFFN,          ASDF,            ASDF
##VAR_DIM=   32768,         32768,           32768
##UNITS=     HZ,            ARBITRARY UNITS, ARBITRARY UNITS
##FACTOR=    0.157963299565203, 1,           1
##FIRST=     4132.6476996994, 0,             0
##LAST=      -1043.33573715361, 0,           0
##MIN=       -1043.33573715361, -339998,     0
##MAX=       4132.6476996994, 363758958,     0
$$ Real data points
##PAGE= N=1
##DATA TABLE= (X++(R..R)), XYDATA
$$ [...]
24241c3916l952k7583M1764K4838k3195j34838K7234N2874K9068M1661M0461R78
24229C5394J3871O2162l6069L6740O418r1160j9096J4216k8329J6616n5220n6663
24217a01120l2378N1077M0123O4400J728j9001p2883k4637N6270N1001J2199m575
24205B2204L1120m3919j9152k2762Q404j7469n8189m8234m4078N2035R1456O6721
24193A8137o280l1670o5136m1546O6827K5053O4028m79o0522p970j1263k4593
24181g5414q3398K9133M1307J08423O1984n0104r7288K7002p228J9248j4682M4631
24169C614j710l7653m6182l7048j0277J56032N0367n7215l6093n4852q9452K7031
24157a33438l6557M0416O8260K663M6873n4806j4748J05002o4222n9932O9104
$$ plain form
24241 -33916 -37868 -65451 -23687 1151 -22044 -156882 -129648 -76774 -47706 -6045 34416 35394
24229 35394 49265 111427 75358 112098 118516 27356 8260 22476 -5853 10763 -44457 -101120
24217 -101120 -133498 -82421 -42298 22102 23830 4829 -68054 -92691 -36421 14580 26779 22204
24205 22204 53324 9405 -9747 -32509 -24105 -41574 -99763 -147997 -192075 -140040 -48584 18137
24193 18137 11857 -19813 -84949 -126495 -59668 -34615 29413 28934 -31588 -39558 -50821 -75414
24181 -75414 -158812 -129679 -88372 20051 82035 31931 -65357 -38355 -45583 -26335 -41017 3614
24169 3614 1904 -35749 -81931 -118979 -129256 26776 77143 19928 -16165 -71017 -160469 -133438
24157 -133438 -169995 -129579 -61319 -58656 -11783 -66589 -81337 23665 -40557 -100489 -31385
24146c1385M0101p6938J0903J5149k6410O8272J08060k9690k9196J0535j7243
24135D2158L2148K0683k968K6304q0690l705K4007O3854l4133r1887L5158K3674
24123E4603j2237l5945r0846Q9012J13669m3100j5850L2398J0021n7814j8896
24112B5015k9622J9963k3244l7307M7414L5114l4903L1472P8869N4453j1683l6151
24100A19390p2815l5171j3726J3598k7847L8928k4691P408R342o6528k6925J1389
24088f7648O0340j2217l3506q0018J14346P3643Q03j1300k4797k6371Q9805P5323
24076A58403l3778j17277r634P1943j962K8165J0734n5142n1450n1007R5310Q8738
24064A33043k8853l2501L6339P411n6462r5861o9198J8657K2408j8576K4860N0956
$$ plain form
24146 -31385 8716 -68222 -57319 -42170 -68580 -308 107752 78062 48866 59401 42158
24135 42158 74306 94989 92021 118325 37635 33930 57937 121791 87658 -4229 30929 54603
24123 54603 42366 6421 -84425 4587 118256 75156 59306 91704 101725 43911 25015
24112 25015 -4607 15356 -7888 -45195 2219 37333 2430 33902 112771 167224 155541 119390
24100 119390 46575 11404 -2322 11276 -16571 22357 -2334 5074 14416 -52112 -79037 -67648
24088 -67648 -7308 -19525 -53031 -133049 -18703 54940 55743 44443 19646 -6725 83080 158403
24076 158403 124625 7348 -2286 69657 67695 95860 106594 51452 2 -51005 44305 133043
24064 133043 104190 71689 108028 115439 58977 -36884 -106082 -87425 -65017 -83593 -58733 -7777
24052g777N4807N80j03943l1006L7349Q7857J13195n7865l4519n5138Q2768O063
24040I2371J2509M2828M8160J2144q3071n7492Q348l6287o2611Q0847P8392o0895
24028G5243p2792j5183O9504o759n652J5936M2722K7993j3616O0182r656n4169
24016A13753m2080q7980L9973N692q2929N3286O4676j8412m7671j9278L159N406
24004a2405k4756M8541K3875n0724k5359k6907L803Q3139k8586q27J3302k7941
23992b4845M6614K4770k177m5555m6992L740k8412m7142Q6823J29829j2425j2090
23980G2138l0742j1905J11731r39o8723k5080N312N3462k4444n0695m2800m09
23968a3094M0273l7121n9706K0167J6460m6132k6292j0776L3331j5487N0226m95
$$ plain form
24052 -7777 47030 47610 -56333 -87339 -49990 37867 151062 93197 58678 3540 86308 92371
24040 92371 104880 147708 195868 208012 124941 67449 75797 39510 -23101 57746 136138 75243
24028 75243 2451 -12732 56772 50013 44361 60297 103019 131012 117396 177578 167922 113753
24016 113753 71673 -16307 23666 29358 -53571 -285 64391 45979 -1692 -20970 -17811 -12405
24004 -12405 -37161 11380 35255 -15469 -40828 -67735 -63932 19207 -9379 -10206 3096 -24845
23992 -24845 21769 46539 44362 -1193 -48185 -44445 -72857 -119999 -33176 96653 84228 72138
23980 72138 41396 29491 141222 140283 71560 46480 51792 105254 80810 30115 -12685 -13094
23968 -13094 27179 -9942 -69648 -49481 -33021 -79153 -105445 -116221 -82890 -98377 -48151 -48646
23956d8646Q0248Q0107k2047r7664k228k6713j8619m874k332K3222N7084P3270
23944I0808j05613o3773O5438J064j03017J1576L4916j4345k8742P931Q0770Q2675
23932E9688N5646k838j02041m6532N420j5845L9980N610K7598L8209L9444q2393
23920B1946k2979L4144K9151K878k3122p6267L0372k1505n9703J1094M0494M5852
23908A2355J0342O348N331l9750P249N8004K0009q7320k465Q5496k2878q8570
23896c5849L310L134l2568O6284O98J8286j6314j31417N207J6877M5088k8289
23884h5553k1073M1410K1333J9514k1682M35Q4249N3431n0062n7852j20Q6809
23872G0839l0612r1781o3779l1915O968L9760O106J6413N4420N9216k262Q6637
$$ plain form
23956 -48646 31602 111709 89662 -8002 -10230 -36943 -55562 -60436 -62768 -39546 17538 90808
23944 90808 -14805 -78578 -13140 -12076 -115093 -103517 -68601 -82946 -111688 -103757 -22987 59688
23932 59688 115334 112496 10455 -36077 -30657 -46502 -6522 -912 26686 64895 104339 21946
23920 21946 -1033 33111 62262 65140 42018 -34249 -3877 -25382 -85085 -73991 -33497 12355
23908 12355 22697 29045 34376 -5374 1875 59879 79888 -7432 -9897 75599 52721 -35849
23896 -35849 -32539 -29405 -61973 4311 5009 23295 6981 -124436 -119229 -102352 -57264 -85553
23884 -85553 -106626 -65216 -43883 -24369 -46051 -45616 38633 92064 42002 -15850 -15970 70839
23872 70839 40227 -51554 -115333 -147248 -140280 -100520 -94414 -78001 -23581 35635 33373 120010
23860A20010R5454o1765q7632j70458j4093l525O8298N9184J6462N5467j06547
23849b9145j2710N9134J0925j4993P373n22L0394K1891L1496L8540n9027q8566
23837e210l3642R700J1352j1434K1348l2592k4804O458j6065k9204O3789L2267
23825h037p4752n6262Q4080J12639k5455l5089O9192r8964o5551O4849K2227m8221
23813e9344O2370j8380l3579n2281r304J4760j9238p251J0732j808K4209P9305
23801i809L1734q9197o98l0411M418N2062P9670L9883l7364n3536j7404L27P7098
23788D6773o255j32230j07710Q0315Q5667n9829q95O7791j1679J7734N3807k0683
23776A2806j36300p8054L3121J05467Q2567N6360m5790j285M7628Q3l8692r702
$$ plain form
23860 120010 215464 153699 66067 -104391 -118484 -122009 -53711 5473 21935 77402 -29145
23849 -29145 -41855 17279 28204 13211 20584 20062 50456 72347 103843 142383 83356 -5210
23837 -5210 -38852 -29152 -17800 -29234 -7886 -40478 -65282 -58824 -74889 -104093 -40304 -8037
23825 -8037 -82789 -139051 -54971 57668 32213 -2876 66316 -32648 -98199 -33350 -11123 -59344
23813 -59344 3026 -15354 -48933 -101214 -110518 -95758 -114996 -122247 -111515 -113323 -89114 -9809
23801 -9809 21925 -67272 -67970 -98381 -93963 -41901 37769 77652 40288 -13248 -30652 -30325 46773
23788 46773 40518 -91712 -199422 -119107 -33440 -93269 -94164 -26373 -38052 -20318 33489 12806
23776 12806 -123494 -201548 -168427 -62960 19607 75967 30177 28892 76520 76603 37911 28209
23764B8209r5244K0523k5153K8259L6385k7584M6589K4004M7704r7309k9849L0394
23752a3072j2032K4338L3008j0867O6961O2656J8911o1522l2172o647K9124j6134
23740H2552j6063j8484l0637l261k652M8345P9650q963J0954k484O9595j31195
23728G7357n0122m427J9831p0273l8086L9117L777M9370l1599J1888Q035n4368
23716c9500p5989K0086J7209M454l5739m703J7872j7734J1448Q4887O6083K3691
23704G2065k8123j3503M5860l181o4996J2753n8829k8845J2891J2833M7248R9423
23692A05596K1578j2021M0840M2677l3222n5252j07953m1318R7499l8386p1815
23681e1777j1045P3957o7785L2598O7474L8586j8401M2252k2625l6639j4765n0304
$$ plain form
23764 28209 -67035 -46512 -71665 -43406 -7021 -34605 11984 35988 83692 -13617 -43466 -13072
23752 -13072 -25104 -766 32242 21375 88336 150992 169903 108381 76209 69562 98686 82552
23740 82552 66489 48005 17368 14107 11455 59800 139450 130487 141441 138957 208552 77357
23728 77357 27235 22808 42639 -27634 -65720 -26603 -22826 26544 -5055 6833 14868 -39500
23716 -39500 -115489 -95403 -78194 -73740 -109479 -114182 -96310 -114044 -102596 -17709 48374 72065
23704 72065 43942 30439 76299 73118 8122 20875 -37954 -66799 -53908 -41075 6173 105596
23692 105596 127174 115153 155993 198670 165448 110196 2243 -39075 58424 20038 -51777
23681 -51777 -62822 11135 -56650 -24052 43422 82008 63607 105859 83234 46595 31830 -18474
23669a8474k825O3886m577m1291K0918M393o3711q0086P8353R3045m8991k4625
23657b3985L1224M0171l3575j16535l7706J11392K3101K7733l3574K3389K7406
23646C9041j08672j0100l7629k5037R0246N4917p67j9392k6732k8671L1111r725
23634e1410N9056Q6079K3967n9518j3639l6398o5560l2385J0142R0367L3839j00122
23622e5582j02128p8081M1525J49729P7160l6652o9181L1280P709k0414K3238
23611c1397M580N5065k8853j19017R6485k775j4141k5237l6397q629L0468L6905
23599d2943L4726m0443k9994R5841P716j0066k7299L0884J00214k0559r1488K4822
23587C1411K7120m7920n2431m004r089K54r2859k3838O2042L8746J5559k8535
$$ plain form
23669 -18474 -21299 42587 38010 -3281 17637 22030 -41681 -121767 -43414 49631 640 -23985
23657 -23985 7239 47410 13835 -102700 -140406 -29014 -5913 21820 -11754 11635 39041
23646 39041 -69631 -79731 -117360 -142397 -52151 2766 1999 -17393 -44125 -72796 -41685 -51410
23634 -51410 7646 93725 117692 58174 44535 8137 -57423 -89808 -79666 10701 44540 -55582
23622 -55582 -157710 -235791 -194266 -44537 32623 -4029 -73210 -41930 -34221 -54635 -31397
23611 -31397 -26817 28248 -605 -119622 -23137 -25912 -40053 -65290 -101687 -110316 -79848 -42943
23599 -42943 -8217 -48660 -78654 17187 24903 14837 -12462 18422 118636 98077 6589 31411
23587 31411 58531 10611 -41820 -45824 -54913 -54659 -147518 -171356 -109314 -70568 -55009 -83544
23575h3544k6360Q2190J16724j8780k4579l8829j6845k8592L9410k7786M4051
23564A7060M2918M0950J5664M3700j5092J3032k2223J6611K7214L0409r8709n9468
23552E2066k2799J001j9535q9142K4107j6099L6902M1376Q599J2738k155K2416
23540D9475P1519Q679o3176L0287q2869l4031r581m865K5310p44o2468J3979J22004
23527F3519O0827q8280k94j0133O8220M116j08244k2107J17033m4159o2811k9524
23515e1837k2194L9358O0219j6302j11405k0406N3736M4525J2592o301p1610J0690
23503g8935J898J1739l320J5187Q6484o288Q4933L4146l5234r0561k2745N1593
23491D8897k0835n9920o7497q210k0502n5271l4968L3828L4736J34427L2780k3234
$$ plain form
23575 -83544 -109904 -27714 89010 70230 45651 6822 -10023 -38615 795 -26991 17060
23564 17060 59978 100928 116592 160292 145200 158232 136009 152620 179834 210243 111534 52066
23552 52066 29267 30268 10733 -78409 -54302 -70401 -33499 7877 16476 29214 27059 49475
23540 49475 120994 129673 66497 96784 13915 -20116 -29697 -34562 -9252 -9996 -72464 -58485 63519
23527 63519 124346 36066 35772 25639 93859 97975 -10269 -32376 84657 40498 -22313 -51837
23515 -51837 -74031 -34673 25546 9244 -102161 -122567 -68831 -24306 -11714 -18015 -89625 -78935
23503 -78935 -77037 -65298 -68618 -53431 33053 26765 111698 145844 110610 20049 -2696 48897
23491 48897 28062 -31858 -99355 -107565 -128067 -183338 -218306 -184478 -149742 -15315 17465 -5769
23479e769Q9292P3348j34784K3354k2004l1772O228q7364m5220J3925O2099k7523
23467h6190J2430N8377n644j8350j5892n4616P6742k2300l7478K4786L985J5912
23455d8238J5896P1692O3499J1287j8914l0855L2387K0703l5758k5383m9647o3224
23443e6555J9309R949m6782O3836M4877r2792m738M2726M4403Q968n8755j07942
23431a33496o0229Q1536J30612Q0366P009j1290q2741o4506J0933M232K1498J4121
23419a955l3941J0812J6526K8169L2390l1997q560j0279P7567K2610N8351m8757
23407A10936j02140l9825J8136J7053j4729M872K6879J7603k6808q0284m9961
23396a18268o0664m0704P8894N0283J03968o919o4432L732L6044M9453M2198m4176
$$ plain form
23479 -5769 83523 156871 22087 45441 23437 -8335 -2107 -89471 -134691 -120766 -58667 -86190
23467 -86190 -73760 -15383 -21027 -39377 -55269 -109885 -33143 -55443 -92921 -68135 -64150 -48238
23455 -48238 -32342 39350 102849 114136 95222 64367 96754 117457 81699 56316 6669 -56555
23443 -56555 -37246 -27297 -74079 -10243 34634 -58158 -62896 -20170 24233 33201 -25554 -133496
23431 -133496 -193725 -112189 18423 98789 105798 94508 11767 -52739 -41806 -37574 -16076 -1955
23419 -1955 -35896 -25084 -8558 19611 52001 20004 11444 1165 78732 101342 159693 110936
23407 110936 8796 -31029 -12893 4160 -10569 -5697 21182 38785 11977 -68307 -118268
23396 -118268 -178932 -219636 -140742 -90459 13509 6590 -57842 -54110 -18066 31387 73585 29409
23384B9409l9430k6153O1985K9690k0080L9263J4743l7913p0007P9428J5029j05205
23372b9241j8819l2757j8578K4117M7509L0365p547j4414m2727j1685R8572q3474
23360e8679l100j8501M005R6185O3268L6199r8330l2979l3016K8463K176k3777
23348c8086n7923J4926K7433l2716m949K1048j03080q1779N5349N6045N5367M1597
23336d6768j8581n343M9631J05894o441m0660j6315O3507p5357k4577J9109O6113
23324G0212K5764j25500p8709J33493j4277l8656j2615K4214n5881m7161m7607
23313a66723J6907J00481Q4006o0715p536k4877M5198P1649k132p8122j8601Q2861
23301D2396n8451l9875o309l3097k6724K6443P6562Q1310R1076o7295n2427l9442
$$ plain form
23384 29409 -10021 -36174 25811 55501 35421 74684 89427 51514 -18493 60935 75964 -29241
23372 -29241 -48060 -80817 -99395 -75278 -27769 2596 -4951 -19365 -62092 -73777 24795 -58679
23360 -58679 -61779 -80280 -76275 19910 83178 119377 21047 -11932 -44948 -16485 -14309 -38086
23348 -38086 -96009 -81083 -53650 -86366 -91315 -70267 -173347 -255126 -199777 -143732 -88365 -46768
23336 -46768 -65349 -70692 -21061 84833 78392 37732 21417 84924 9567 -15010 4099 70212
23324 70212 95976 -29524 -108233 25260 10983 -27673 -40288 -16074 -71955 -119116 -166723
23313 -166723 -149816 -49335 34671 -26044 -33580 -58457 -13259 58390 56258 -21864 -40465 42396
23301 42396 -16055 -55930 -62239 -95336 -122060 -95617 -19055 62255 153331 86036 33609 -5833
23289e833m532l843K5421m9180l4133L2866j4808M665N8461k7182p3349P7102
23277a4345L4627j0801o9237M2960O9908n1656m1176n9410j0503J6825j1234M6632
23265e7410Q2963o2305J8856P0951n4083q7737O099J2050J7619L4972p6216n581
23253i9822K1516M3553m2716K9290L0099o472j3906L5928j0844k0483Q076M0361
23241A4580L3303r9693o2422N8814K4173K3538K6753k5533N4883L1769k9003l1305
23229A9857k8810m1747k9344M8629M8011M5157k7585K477K3647O0719J0538j947
23217A29602O924n443q20j0135j3498p6625m5489m1160K2122l244m1174O964j7564
23204h9540K3635M0632R45K952M8723o8708m6262L5606j0593J5111O2357j9322
$$ plain form
23289 -5833 -10365 -14208 11213 -37967 -72100 -39234 -54042 -49377 9084 -18098 -91447 -14345
23277 -14345 20282 9481 -59756 -16796 53112 1456 -39720 -99130 -109633 -92808 -104042 -57410
23265 -57410 25553 -36752 -17896 53055 -1028 -88765 -82666 -70616 -52997 -18025 -94241 -99822
23253 -99822 -78306 -34753 -77469 -48179 -18080 -24552 -38458 -2530 -13374 -33857 -25781 14580
23241 14580 47883 -51810 -114232 -55418 -31245 -7707 19046 -6487 48396 80165 51162 19857
23229 19857 -8953 -50700 -80044 -31415 16596 61753 34168 36645 60292 121011 131549 129602
23217 129602 136526 131083 130263 120128 106630 30005 -15484 -56644 -34522 -37766 -78940 -71976 -89540
23204 -89540 -65905 -25273 -24328 -21376 27347 -41361 -87623 -52017 -62610 -47499 14858 -4464
23192d464n2521K7584j7529p1563p0032l29K8015K5639O0120j6945K4351M0495
23180b7179o3309M4519N8338m4382q4710N611J4078L8353m4887n502L7401Q0190
23168H521k3656J1068l8241j7053K9439l8989l317p3028J5145k940K5618L9075
23156f8358k756M5264M8435K9238K8749j6459L5531L9626J8739L5399J8509K2323
23144B34240p7399j70974m1085N6602Q3283J0693J0350j7488p5760k5869J7452
23133D045k5387j4119K4603l8026K9331P3496M1850q8196r957k0768j47441J8654
23121a51915M4028J4486N8060k6791l5505l5160K8001J3027k1811k8210R1604
23110e0186j5604J2195N7619J12941O010j02824k5300M8469R0656l0484n3624
$$ plain form
23192 -4464 -56985 -29401 -46930 -118493 -188525 -188854 -160839 -135200 -75080 -92025 -67674 -27179
23180 -27179 -90488 -45969 12369 -32013 -116723 -111112 -97034 -58681 -103568 -109070 -71669 8521
23168 8521 -15135 -4067 -42308 -59361 -29922 -68911 -72228 -145256 -130111 -133051 -107433 -68358
23156 -68358 -71114 -25850 22585 51823 80572 64113 99644 139270 158009 193408 211917 234240
23144 234240 156841 -14133 -55218 1384 84667 95360 105710 88222 12462 -13407 4045
23133 4045 -21342 -35461 -10858 -48884 -19553 53943 95793 7597 -2360 -23128 -170569 -151915
23121 -151915 -107887 -93401 -35341 -62132 -97637 -132797 -104796 -91769 -113580 -141790 -50186
23110 -50186 -65790 -53595 4024 116965 122975 20151 -5149 43320 133976 103492 49868
23099D9868n6832n5231j329K4748k5169J2120j6264l341J02508O0120L2333q9387
23087C4144q5415L6628L8239n0561m7608k179N1833O6812r5492N5887J09070j1523
23075I9835M642K043o348m9553k4324M006m7613o930M5077O3334j9960K2567O2183
23062A48959P913k9432l1712j12121j2687K5269l599N9321O4547K441l9533o0811
23050A8555j1454O5805J4346j19536j11950N1371R2488j9679k3683N9214Q8602
23039A04079l9023o124k6664l3406N9297K303n696K7863j18959n0633R5489L5802
23027D4328k8047J6904L4273k9579L5531K2235p6272J5462L5121q162j815j8421
23015D1558n6834o8944j2234L5036Q8110O7538m2261J1233J2131K3687k8742k2735
$$ plain form
23099 49868 -6964 -62195 -63524 -38776 -63945 -51825 -68089 -71430 31078 91198 123531 34144
23087 34144 -51271 -14643 23596 -26965 -74573 -76752 -24919 41893 -53599 2288 111358 99835
23075 99835 104477 106520 100172 50619 26295 30301 -17312 -24242 20835 84169 64209 86776 148959
23062 148959 156872 127440 95728 -16393 -29080 -3811 -7410 51911 116458 118899 79366 18555
23050 18555 7101 72906 87252 -32284 -144234 -92863 -375 -20054 -43737 15477 104079
23039 104079 65056 58932 32268 -1138 58159 60462 54766 82629 -36330 -86963 8526 44328
23027 44328 16281 33185 67458 37879 73410 95645 19373 34835 69956 61794 59979 41558
23015 41558 -15276 -84220 -96454 -61418 26692 94230 51969 63202 75333 99020 70278 47543
23003D7543J6688p9849o9998j4691J0331K1002P905l3507m4552J03188J90645
22992A54705o3659j7072K2227O2045p6673J6894N833l135l16K0008m432j2197
22980A04228j20671p2438L4453j55K0419K7956O2474L2624n8864K3601p8826o7723
22968i2922K9253J6761M4210l1458k8983R511P0633O9328J1080m3925o7977j37702
22956a52191J13977P0246P0706R7422q2422q0132r0016M9028O4044k0196j6878
22945B3588l0429P2396O8596n0019n4798L4132l7520o3318N3694O1675j0019o6488
22933A490q9800N9381M7005j2092l3073P0096m3682k5774k5043n153N3649o0915
22921f3911o8321O8909M9233N7091L979O7948k3338n4603n5086p0807O2231J0244
$$ plain form
23003 47543 64231 -15618 -85616 -100307 -89976 -68974 -61069 -94576 -139128 -35940 154705
22992 154705 91046 73974 96201 158246 81573 98467 104300 101165 100849 120857 116425 104228
22980 104228 -16443 -88881 -54428 -54583 -34164 -6208 56266 88890 30026 53627 -25199 -92922
22968 -92922 -63669 -46908 -2698 -34156 -63139 -53628 17005 86333 97413 53488 -14489 -152191
22956 -152191 -38214 32032 102738 200160 117738 37606 -52410 -3382 60662 40466 23588
22945 23588 -6841 65555 134151 84132 29334 63466 25946 -37372 16322 77997 67978 1490
22933 1490 -88310 -28929 18076 5984 -27089 43007 -675 -26449 -51492 -56645 -2996 -63911
22921 -63911 -132232 -63323 -14090 43001 46980 114928 91590 36987 -18099 -88906 -26675 -16431
22909a6431j11633n6808P5881L8262m8192K1765Q8261O628J9250P1193Q0513p7082
22897I1607q9375M6962l4756O9511N5051n5009N9188n97j06305O401m3184o617
22885g123m7739k4306J27270k529n2700j27951m3642M2171R6501R1439L2493K6251
22873A10135r8063q5671k9195P0789J1477J3643q3243q180J24300N7213m4342
22862C8863k8715j09939r4308N4335J33858L7832m4924N3729M1902o8204r3389
22851g8960J4330J22878M400o9883k0230j6492j3203M263O4001K6907l4686n6391
22839e3066N6373K0576J0616K7681j1364n6704n3600m0488K8418J4135J08864
22828E1441L559j08805l0470R9267J27153K397K694k6710P1103j3772Q364o0379
$$ plain form
22909 -16431 -128064 -184872 -108991 -70729 -118921 -97156 -8895 -2267 16983 88176 168689 91607
22897 91607 2232 49194 14438 83949 139000 83991 143179 142582 36277 42678 -506 -7123
22885 -7123 -54862 -79168 48102 45573 -7127 -135078 -178720 -136549 -40048 51391 83884 110135
22873 110135 12072 -73599 -102794 -32005 -20528 -6885 -90128 -98308 25992 83205 38863
22862 38863 10148 -99791 -194099 -139764 -5906 31926 -12998 40731 82633 14429 -78960
22851 -78960 -64630 58248 62648 -7235 -27465 -43957 -57160 -52897 11104 38011 3325 -53066
22839 -53066 3307 23883 34499 62180 50816 -5888 -59488 -99976 -71558 -57423 51441
22828 51441 55000 -53805 -84275 14992 142145 144542 147236 120526 191629 177857 186221 125842
22816A25842k7257J9981J9112l2706K5921o5149r1859k1838L6494J37457J3747
22805A39745q0664q5277l2885k5208L5977J64001J07274m4465j64356l5886R0858
22794F9114N7258O4266l2602l8564J7559m3549p8544R861J337K764j8270L8994
22782D9624J2826m551o6108o2440K375K3971R1550L701q4610m7211J2147M4321
22770b4405J4871O3849Q94r5865Q3941J6306j6022M7518K6778O7979j10311q7681
22758a2148n1915K5780m2055j06961P260J55787l03k8358n2991r5061Q0672L2906
22746h7387N294l8401o5020O9189J30843j0159q089K1831q1719k0344O9266L81
22734a4315k4520K2426L2186r766K4599l9408N3608J09142j7140k0497o5857M2731
$$ plain form
22816 125842 98585 118566 137678 104972 130893 65744 -26115 -47953 -11459 125998 139745
22805 139745 59081 -26196 -59081 -84289 -48312 115689 222963 178498 14142 -21744 69114
22794 69114 126372 190638 158036 119472 137031 93482 14938 24799 26136 28900 10630 49624
22782 49624 62450 57899 -8209 -70649 -68274 -44303 47247 50948 -33662 -80873 -68726 -24405
22770 -24405 -9534 54315 55209 -40656 43285 59591 43569 91087 117865 185844 75533 -12148
22758 -12148 -64063 -38283 -80338 -187299 -180039 -24252 -24555 -52913 -105904 -200965 -120293 -87387
22746 -87387 -82093 -120494 -185514 -116325 14518 4359 -3730 18101 -63618 -83962 -14696 -14315
22734 -14315 -38835 -16409 15777 6011 30610 -8798 44810 153952 136812 116315 50458 93189
22722I3189l488l5271K6075p0387k0971k590j03305j4368M6724O2546M627R532
22710g687k0089N7486N6688j2898k7374j0Q7846o0982j07347l5514J9244n4622
22698a05259L7863L8279k6035l4398j6284l9845Q4105k7222K8267o371K0602J833
22686d4465K7342N8657J21825m6634q5744q3327k779O143M5717J5151L1482o756
22674C6612n5268k2717K059L5905P6258j4370k2289j7284n3045k8254L2986P6567
22662D7160l2833k8413K5651Q7911L5128k7756J94n5663k529J9537j5226o9719
22650a6558K7841J6600J1026K9129j9457m2319Q093J8612l04l31M7766J3934o3486
22637C0546j1830n6985k9245q792L5942R1078j9159o4171j1290P7404j6784P167
$$ plain form
22722 93189 89701 54430 80505 10118 -10853 -13443 -116748 -131116 -84392 -21846 -17219 -7687
22710 -7687 -27776 29710 86398 73500 46126 46116 133962 72980 -34367 -69881 -50637 -105259
22698 -105259 -67396 -29117 -55152 -89550 -105834 -145679 -61574 -88796 -60529 -66900 -46298 -44465
22686 -44465 -17123 41534 163359 116725 30981 -52346 -55125 -48982 -3265 11886 43368 36612
22674 36612 -18656 -41373 -39314 -3409 72849 58479 36190 18906 -34139 -62393 -29407 47160
22662 47160 14327 -14086 11565 99476 134604 106848 107042 51379 48850 68387 53161 -16558
22650 -16558 11283 27883 38909 68038 48581 6262 14355 32967 32663 32332 80098 94032 30546
22637 30546 18716 -38269 -67514 -76306 -40364 50714 31555 -32616 -43906 33498 16714 23881
22625B3881k9107m9484j9281k3973P5161O8332J1194R238m4459K4965l6425K0024
22613C0066K7433j539k71l9786l1059K572J3073J6080k0944q343k1539K3783R486
22600i88K2728J1488k0310m8115J00546N5595k3926j6714n6027M1627n6094j29782
22588a19972m5913N5329n6125l0039O4023J11303K4222k5540L7356q4889m9875
22577a20120N9309P9945l6264n8279L1075J9369o1596K5740J6073j4107M1665
22566a7190o9637k208O2376L139Q2933Q1430K4883m0546j7368m7179n1480P682
22554A6835p829j02770n3471M2380n2525J1749J15173J20768K7868l8384n2536
22543B7258M1762k6185p3697j6386K0162M6539l2485j16525P304N8863O3756O7545
$$ plain form
22625 23881 -5226 -54710 -73991 -97964 -22803 45529 56723 65961 21502 46467 10042 30066
22613 30066 57499 55960 55689 15903 -15156 -12584 489 16569 -4375 -12718 -34257 -10474 -988
22600 -988 21740 33228 12918 -35197 65349 120944 97018 80304 24277 65904 9810 -119972
22588 -119972 -165885 -110556 -166681 -196720 -132697 -21394 2828 -22712 14644 -70245 -120120
22577 -120120 -60811 19134 -17130 -75409 -44334 -24965 -86561 -60821 -44748 -58855 -17190
22566 -17190 -86827 -89035 -26659 -23520 59413 140843 165726 125180 107812 60633 9153 16835
22554 16835 9006 -93764 -147235 -104855 -157380 -145631 -30458 90310 118178 79794 27258
22543 27258 69020 42835 -30862 -47248 -27086 19453 -13032 -129557 -122253 -63390 366 67911
22531F7911K5803k5226K7616M5186m295J530m8R624l1204M122q2627j1042l4018
22518f668J28670P1632k5990j2318K1462j0387q9585k9545Q5363K4161p3855q6774
22506c834r2023j234Q3932J5542M9396O1492O0112K8462k4836R556r2398q5995
22494H172K846M0121L6712m6098j3137Q41R2570J21070k4723o0511j14033K25
22482D4055p665M5670K181o6678L995k8052j18506m9358L7228K3333r057q2527
22470b05381q842Q4527J27768N7930J12110J7724r0883o3737o6727k1474R774
22459d7211J23148Q2054O5364m6121q7911m2329r3874l3777M8159P9497M1337
22448H8336j9585J0280Q1419M666j76510q0297l4180M5741P4662m9389m0939l1675
$$ plain form
22531 67911 93714 68488 96104 141290 136995 138525 138477 148101 116897 121019 38392 27350 -6668
22518 -6668 122002 193634 167644 155326 176788 166401 76816 47271 132634 156795 82940 -3834
22506 -3834 -95857 -97091 -13159 2383 51779 113271 173383 201845 177009 186565 94167 8172
22494 8172 11018 51139 87851 41753 28616 29457 122027 243097 218374 157863 43830 44055
22482 44055 36390 82060 84241 17563 21558 -6494 -125000 -174358 -137130 -113797 -122854 -205381
22470 -205381 -214223 -129696 -1928 56002 168112 185836 94953 31216 -35511 -56985 -47211
22459 -47211 75937 157991 223355 177234 89323 46994 -46880 -80657 -32498 46999 88336
22448 88336 68751 79031 160450 165116 -11394 -91691 -125871 -80130 -5468 -54857 -95796 -127471
22436a27471P4734Q3281j3318o802K2566O710K1011j3534L4376M5865p1558j9349
22424C6511M983o2281K2114m4350l0430L7701k0811n3018P8087M4819P005l2504
22412a2174J5069j22448l4678P5018R8663N2870j2735n6003m2693p545L3532k682
22400a5806o1738N4014O1139J2806o5282L0242L8816m5346J3203l1972J6426Q5655
22388I2157n9437l3172K16Q0458p957q5201j2894j1007R5538j8675j1176o7323
22376c8473k3382P402J5425M6253n5189R1M970K7693J385N2134j0795J6256o6232
22363b2462L5538K904l1210M9679j6304P794N381R5027M1919o4094q0446o2939
22351c9213L5745n80l3886M7096K6858k7463n8833j5783l461M8944N7632o4709
$$ plain form
22436 -127471 -52737 30544 17226 10424 32990 39700 60711 47177 81553 127418 55860 36511
22424 36511 41494 -20787 1327 -43023 -73453 -35752 -56563 -109581 -31494 13325 20330 -12174
22412 -12174 2895 -119553 -154231 -79213 19450 72320 59585 3582 -39111 -46656 -13124 -15806
22400 -15806 -77544 -23530 37609 50415 -14867 15375 54191 8845 22048 -9924 6502 92157
22388 92157 32720 -452 -236 80222 72265 -12936 -25830 -36837 58701 40026 28850 -38473
22376 -38473 -61855 -54453 -39028 7225 -47964 -47873 -42903 -15210 -13825 38309 27514 43770 -22462
22363 -22462 13076 15980 -15230 34449 18145 25939 31320 126347 168266 104172 23726 -39213
22351 -39213 -3468 -4048 -37934 9162 36020 8557 -50276 -66059 -69520 -20576 37056 -27653
22339b7653p200J2653q288j1934J9370l9639L3793P919J3990Q0756O0332q4765
22327D9334j12275L1695O0137j40784j18231P6257K4022J3605J0985R0852l8284
22316e2687m4159o50j1704j5787m780K3183L6830K5185Q6625k8306k6765K1138
22304H123n5608P6553J5938j03512J1006J32187o7243j01880l0525Q4115J4717
22293a6129L3952j1419J1740l7087p2938M6721Q3898J3690j0230L7680k9828K433
22281E2483M3932o7053n8157n6074m787N0481k9249K7708n737J2060M8928l619
22269A0916l0364m8964n1776J884j9284Q6741M7252K5841j53972K9828J33320
22258C1422P4810j1295j18850J7761o1929p357j6856J2782O9364p9480r9180n0902
$$ plain form
22339 -27653 -34853 -22200 -30488 -42422 -23052 -62691 -28898 -20979 -6989 73767 134099 49334
22327 49334 -62941 -31246 28891 -111893 -230124 -153867 -129845 -116240 -105255 -14403 -52687
22316 -52687 -96846 -97496 -109200 -124987 -129767 -106584 -69754 -44569 42056 13750 -13015 8123
22304 8123 -47485 29068 45006 -58506 -47500 84687 17444 -84436 -114961 -30846 -16129
22293 -16129 17823 6404 18144 -18943 -91881 -45160 38738 52428 42198 79878 50050 52483
22281 52483 96415 29362 -28795 -84869 -89656 -39175 -68424 -40716 -46453 -34393 14535 10916
22269 10916 -19448 -68412 -120188 -118304 -137588 -50847 -3595 22246 -131726 -101898 31422
22258 31422 106232 94937 -23913 -6152 -68081 -75438 -92294 -79512 -10148 -89628 -188808 -239710
22246b39710N3776J55580j1397N0031M8837m1364j7785p9282q2185N3725Q3478
22235b6296M8251j5487m3609P747K417K2789J6490j10929o0471J12864K6686j3159
22223c2707k2021L3890L1018r743o6278l9931N061K1801M6307P275l6957K0806
22211d1479p6585m1496O5527K2281K0347J36010P1746m7882P6915L494j1452r822
22199A67604j4403j6602O4700P584q6695L2967j403p5914l5390j3750K0395j20087
22187g0994J2040P9222O1811m8642o9623J5243K7083J28810K8554o8312J5801
22176A10993l3853K5208J007J4761j9826r3822p3835N3211j7849q8360J1478J5913
22164i4974P3344K6579K2439j475l8745j9176K8416k3288j64246M5247L9009L1788
$$ plain form
22246 -239710 -185934 -30354 -41751 8280 57117 15753 -2032 -81314 -163499 -109774 -26296
22235 -26296 21955 6468 -37141 -29394 -26977 -4188 12302 -98627 -159098 -46234 -19548 -32707
22223 -32707 -54728 -20838 10180 437 -65841 -105772 -100711 -78910 -32603 -25328 -62285 -41479
22211 -41479 -118064 -159560 -94033 -71752 -51405 84605 156351 108469 185384 188878 177426 167604
22199 167604 153201 136599 201299 208883 122188 155155 153752 77838 42448 28698 49093 -70994
22187 -70994 -58954 20268 82079 33437 -36186 -20943 6140 134950 163504 95192 110993
22176 110993 77140 102348 103355 118116 98290 4468 -69367 -16156 -34005 -122365 -110887 -94974
22164 -94974 -21630 4949 27388 25913 -12832 -32008 -3592 -26880 -191126 -145879 -106870 -75082
22152g5082Q5061J05803n1478m3588O208K4542l1864k3943j6112R798k2432Q9031
22140E5944N7623n2551n9315n1259l3626M3440j2707q2846m5105M5402P5524o0680
22128a20156j3373J8349p545m729k3278l7495k0619K0228N323L2315M9368J7436
22116h4176L4668j2086l3111j8445q487n9692K602M4982N442j628K6081P3530
22104c0320M2402p4826m2306P2904O6689j2565j4483K7910J6373j05773j09790
22093a63785J22022Q2723l990J9879q5802k0098O2068M2975k683L02m1145K1392
22081C3858j5519n4467L3088K7757L228j0365l1292j3529K0320k4881j5839O2146
22069A4505m105K1457n744m4555l0728l579j2505J6835L554m1386L0714K4591
$$ plain form
22152 -75082 9979 115782 64304 20716 26924 51466 19602 -4341 -20453 -10655 -33087 55944
22140 55944 113567 61016 1701 -49558 -83184 -39744 -52451 -135297 -180402 -135000 -59476 -120156
22128 -120156 -133529 -115180 -122725 -127454 -150732 -188227 -208846 -188618 -183295 -150980 -101612 -84176
22116 -84176 -49508 -61594 -94705 -113150 -121637 -181329 -178727 -133745 -128303 -129931 -103850 -30320
22104 -30320 12082 -62744 -105050 -32146 34543 21978 7495 35405 51778 -53995 -163785
22093 -163785 -41763 40960 36970 56849 -28953 -49051 13017 55992 53309 53611 12466 33858
22081 33858 18339 -36128 -3040 24717 27945 17580 -13712 -27241 -6921 -31802 -47641 14505
22069 14505 10400 31857 26113 -18442 -49170 -52749 -65254 -48419 -44865 -86251 -55537 -30946
22057c0946L3620N4310k4714K0733J5200j11884o096p908Q5325J26746P152p1332
22045I0206l7612l3857l3899Q6066P8673L041n7222k9176J7739J7870j6226k0323
22033F5280o7869M2218J047j00889q2827Q5723L6368q1444k617R6693n0964l5807
22021i5088J8819K9845m4839M4958M9291r3821m4278m0050O37o223K8704n619
22009a57664J3749m7252p817M5815J24071J5763M2047Q9641m66l2300M1728q1597
21997D5718j00778m4359Q3878K8370n8523O273j5006n640N4131L7869k9526J9116
21985B1523j739o1747K960J6773M2635m8587K7901L76o4304k847J5487L8350m3007
21972e6226q2982j2270O9633O9356L3174n4278Q329N9149q352m9262O5858M0636
$$ plain form
22057 -30946 2674 56984 32270 53003 68203 -43681 -49777 -57685 27640 154386 161538 90206
22045 90206 52594 18737 -15162 70904 149577 152618 95396 66220 83959 101829 85603 65280
22033 65280 -2589 39629 40676 -60213 -143040 -57317 -20949 -102393 -105010 -8317 -59281 -95088
22021 -95088 -76269 -46424 -91263 -46305 2986 -90835 -135113 -175163 -174526 -180749 -152045 -157664
22009 -157664 -143915 -191167 -198984 -153169 -29098 -13335 28712 118353 117887 85587 127315 45718
21997 45718 -55060 -99419 -15541 12829 -45694 -39421 -54427 -60067 -5936 31933 2407 21523
21985 21523 19784 -41963 -39003 -22230 20405 -28182 -281 95 -64209 -67056 -51569 -13219 -56226
21972 -56226 -139208 -151478 -81845 -12489 20685 -33593 -25264 33885 25533 -23729 42129 82765
21960H2765o2401K2948l7823q4231m098M0114K8246m1454r0422K4195L4741J46703
21948E9283k6756r3860n8999L4081P9560J0827m5108k9764R618Q1239m3810O475
21936a7214J9614k9126J8833m8390n6749j8606j0176M5042Q0924L2781k5157n6608
21924f4832R885J73034O4958o3709k6666r134m5300q453l0457J22M877L6124O0673
21911A01122j5989j22168j17727K2797L5346m1683j12306Q9296P3711P6020J0415
21900a166M2935p4973l2252K2898n3320j6170m0238O2552R8363m5477k1660J192
21888e7316O272k6578l0902Q4998P8288m1900q4586J732M1000K7502L0330O2508
21876I1348O4254n6510m4486m8781J1782O9678R6826l1050q6258o4991j17458
$$ plain form
21960 82765 20364 43312 5489 -78742 -82840 -42726 -14480 -55934 -146356 -122161 -87420 59283
21948 59283 32527 -61333 -120332 -86251 -6691 4136 -40972 -70736 -61118 20121 -23689 -17214
21936 -17214 2400 -26726 -7893 -56283 -113032 -131638 -141814 -96772 -15848 16933 -8224 -64832
21924 -64832 -54947 118087 183045 119336 92670 83536 38236 29783 -674 -552 4325 40449 101122
21911 101122 85133 -37035 -154762 -131965 -96619 -138302 -250608 -161312 -87601 -11581 -1166
21900 -1166 41769 -33204 -65456 -42558 -95878 -112048 -152286 -89734 8629 -36848 -58508 -57316
21888 -57316 -51044 -77622 -108524 -23526 54762 12862 -71724 -69992 -28992 -1490 28840 91348
21876 91348 155602 99092 54606 5825 17607 87285 184111 153061 66803 1812 -115646
21865a15646O3590J42817O2107p0497p8292l6818K8768k1221j7095L9877k2542
21854b4952n47p3480l016j2590k2824l0145O2239L4062j7380L5505J5767Q1688
21842D4327l3304j3158k853q295n9910r7257M308J23224K8510l7096n2451L6436
21830f7519K3165j8847M0248K4452q7086j8031p933M9816K5239N6830M1383p860
21818E3857p3667j22198N3127M0739J5386R1451r753l933L70M1617p5823j20757
21806a09584n3235Q9178M4118Q3003l8371M8288M1085l6681j9786j2679l4886
21795D50o4983J2864K6334l6524M5227O6983P6875m5759j636J1519p9779k7752
21783a6181j5410l3417p4148M3485M6494k0208j7013J06757R9054N1521k3449
$$ plain form
21865 -115646 -52056 90761 152868 82371 4079 -32739 -3971 -25192 -42287 -2410 -24952
21854 -24952 -25499 -98979 -101995 -114585 -137409 -167554 -105315 -71253 -88633 -53128 -37361 44327
21842 44327 11023 -2135 -4988 -13283 -73193 -170450 -166142 -42918 -14408 -51504 -103955 -67519
21830 -67519 -44354 -63201 -22953 1499 -85587 -103618 -111551 -61735 -36496 20334 61717 53857
21818 53857 -19810 -142008 -88881 -48142 -32756 58695 48942 45009 45379 86996 11173 -109584
21806 -109584 -162819 -73641 -29523 53480 15109 63397 104482 67801 48015 35336 450
21795 450 -64533 -51669 -25335 -61859 -16632 50351 127226 81467 79831 91350 11571 -16181
21783 -16181 -31591 -65008 -139156 -95671 -49177 -69385 -86398 20359 119413 170934 147485
21772A47485m8241q7758j13145m0699M7783m1888o4515L0003N2654J10007K5221
21761A6907m7704N4755J35539o9508q2480q8300J097J9899N4614j6485r1081L677
21749a09070K7706M2094L8762L6515k7829j42036l6038J32888J3056J3495O0419
21738D9962n9989j5602O4133M6689k6608o2376r7979j0077Q4846L5541J01821
21727A10361k4650r2463L8353p865L1231m8363o0469L8013j7811L6059j1952j6137
21715b5693m1577O2062m8824K9291m0246Q7835J55504l6104p9074n672J9383n7594
21703A9291M676L4655n976q2234n7744l3568P8844K6978M290M4199M307m0550
21691b832l6521j3980N0989M7674k9335k2392L0244P719M5529p0998p3860r5915
$$ plain form
21772 147485 99244 11486 -101659 -142358 -94575 -136463 -200978 -170975 -118321 -8314 16907
21761 16907 -30797 23958 159497 89989 7509 -80791 -79694 -59795 -5181 -21666 -112747 -109070
21749 -109070 -81364 -39270 -508 36007 8178 -133858 -169896 -37008 -23952 -10457 49962
21738 49962 -10027 -25629 38504 85193 58585 -3791 -101770 -111847 -27001 8540 110361
21727 110361 85711 -6752 31601 23736 54967 6604 -53865 -15852 -33663 2396 -9556 -25693
21715 -25693 -67270 -5208 -54032 -24741 -64987 22848 178352 142248 63174 57502 76885 19291
21703 19291 23967 58622 52646 -29588 -87332 -120900 -42056 -15078 -10788 33411 37718 -2832
21691 -2832 -39353 -53333 -2344 45330 15995 -6397 23847 31566 77095 6097 -67763 -163678
21679a63678K4581M4158L1871N8572J0690n7653M518K1928J7093Q0353k488m130
21667F5815l4993o3174L3133P8588j4382m146l5354M4085l0574n2529j7551L1781
21655F99l9406m4521p143l3605l7650O6857J27177K163m3610l0165q4571j01175
21643b24950K9087P8927M7021J2268k0248j03780o0233N9776R0651o247o9768
21632a67496M5059J62006k378j32139Q542O2722p1406o8038J2555K0143J1677
21621a18753Q374K5579N0529K1900k0623j7800k3344M0416N8203j6261j680M050
21609A0590o6641M874K3329N4320l5547O6583N1252j33944j24098l268Q9103N5842
21597g605j1861J8449J0817n0327k761J9061q7206k8940J01873N6367J2113O1289
$$ plain form
21679 -163678 -139097 -94939 -63068 -4496 6194 -51459 -46941 -25013 -7920 72433 69945 65815
21667 65815 30822 -32352 781 79369 64987 60841 25487 69572 38998 -13531 -31082 699
21655 699 -38707 -83228 -90371 -123976 -161626 -94769 32408 34571 -9039 -39204 -123775 -224950
21643 -224950 -195863 -116936 -69915 -57647 -77895 -181675 -241908 -182132 -91481 -97728 -167496
21632 -167496 -122437 39569 37191 -94948 -86406 -23684 -95090 -163128 -150573 -130430 -118753
21621 -118753 -110379 -84800 -34271 -12371 -32994 -50794 -74138 -33722 24481 8220 6540 10590
21609 10590 -56051 -51177 -27848 26472 -9075 57508 108760 -25184 -149282 -152550 -63447 -7605
21597 -7605 -19466 -1017 9800 -40527 -43288 -24227 -111433 -140373 -38500 17867 29980 91269
21585I1269N2205o0165J4516p7193l496M7401L5065M2954l711j01662o3495p9154
21573a05466P6318K5225M3516R377l0240J0188m9473k8867l4434o195M6087K1260
21561b2704q84K1463K8411L8729m988k5522n1116n4121j2289L3305N9104n5803
21549d6415J2065m0343L6661l9235q616M1462Q4255K4572o5254O1855K6602j2711
21537G4898r621n0747M84m554J9801N8123o9767r6039J0271M0829L9239q621O1517
21524F5813p816m8743j8505l2962k0410J35050J12355o6047l6250n4381j3640
21513A4464r9680o1412O8639J1569m0944N9501K4913k931n799k2081J19921O3196
21501A29356l5113m7073r9l5017j1701K4682M840L119n1364j4182n7021L586m4136
$$ plain form
21585 91269 143474 83309 97825 20632 17136 64537 99602 142556 138845 37183 -26312 -105466
21573 -105466 -29148 -3923 39593 48970 18730 28918 -20555 -49422 -83856 -90051 -43964 -22704
21561 -22704 -23588 -2125 26286 65015 60027 34505 -16611 -70732 -83021 -49716 9388 -46415
21549 -46415 -34350 -74693 -38032 -77267 -85883 -44421 39834 64406 -848 61007 87609 74898
21537 74898 65277 14530 15014 10460 30261 88384 18617 -77422 -67151 -26322 12917 4296 65813
21524 65813 57997 9254 -9251 -42213 -62623 72427 184782 118735 82485 28104 14464
21513 14464 -85216 -146628 -77989 -66420 -107364 -47863 -22950 -25881 -31680 -53761 66160 129356
21501 129356 94243 47170 47071 12054 353 25035 29875 32994 -18370 -32552 -89573 -85987 -130123
21488a30123N5756R8700l0507q5732l341J1514m296J5307K1154N9853k418o2776
21476e6909k7404n6475j0621P4195L6787L1191q116L9056K6923j5799P7396j8445
21464I1779j27517r1970l2068q097Q4316Q8125O742n1499M5249P0571O3675o4188
21452G5118o6064J2404j4108R879O2003l2360M0065m1585j21747N52q418M676
21440g9585r526M0926j6272R0998K5240m9674j0153L396k1175l6426m6209k4088
21428a32548L4259J9551j7215Q862m8964J5124P0219k3317k2260j9001M8390O6109
21416g91N2737k1566N8336J7485k2642l6883k4151j07928n4646N3525O5879O6221
21404D5576j6569l2955r6J5240l1958j1313M9214N2672M2575M1333p0582m5321
$$ plain form
21488 -130123 -74367 24333 -6174 -91906 -95247 -83733 -88029 -72722 -51568 8285 5867 -56909
21476 -56909 -84313 -140788 -151409 -77214 -40427 -9236 -17352 21704 48627 32828 110224 91779
21464 91779 -35738 -127708 -159776 -167873 -83557 4568 11310 -40189 5060 75631 139306 75118
21452 75118 9054 21458 7350 17229 79232 46872 86937 45352 -76395 -75843 -84261 -79585
21440 -79585 -89111 -48185 -64457 26541 51781 2107 -8046 -4650 -25825 -62251 -108460 -132548
21428 -132548 -98289 -78738 -95953 -87091 -136055 -120931 -50712 -74029 -96289 -115290 -66900 -791
21416 -791 51946 30380 88716 106201 83559 46676 22525 -85403 -140049 -86524 -20645 45576
21404 45576 29007 -3948 -4044 11196 -20762 -32075 17139 69811 112386 153719 83137 37816
21392C7816k1442r3439r2538K8139M0800K8274L5242q639M1221Q962Q4493l3236
21380E5653p5898L3630m9298N42M6442j6622k0469L7686M175j3221o6078J7675
21368d5783n4808r7517O5876m289J7818K1738o1419j0148p229L6116J10766K5293
21356c586j32661l1702N1304M0325N9548J10363K0727l9711j1866m0326j09345
21345h6930m0294j5809M3238N4244M9830n2212n4288M4738R683L1290J02018j07389
21333b1881p7587K6711M2960O567O8296L5100m310M6488k1110n0241J9883J40
21321G1016J1831n274M140j12539n2040p471n9774p6101O6712N0583J175j6349
21309a24091N266Q8434N5853o1985j1117o2281R680m7776M9442K39M6175N4614
$$ plain form
21392 37816 16374 -77065 -169603 -141464 -100664 -72390 -37148 -45787 -4566 4396 88889 55653
21380 55653 -20245 13385 -35913 -35371 11071 -5551 -26020 11666 15841 2620 -63458 -45783
21368 -45783 -100591 -198108 -132232 -136521 -118703 -96965 -158384 -168532 -175761 -139645 -28879 -3586
21356 -3586 -136247 -167949 -116645 -76320 -16772 93591 114318 74607 62741 22415 -86930
21345 -86930 -127224 -143033 -99795 -45551 4279 -47933 -102221 -57483 -47800 -16510 85508 -21881
21333 -21881 -99468 -72757 -29797 -23230 45066 80166 75856 122344 101234 50993 70876 71016
21321 71016 82847 77573 81713 -30826 -82866 -90337 -150111 -226212 -159500 -108917 -107742 -124091
21309 -124091 -118825 -30391 25462 -36523 -47640 -109921 -100241 -148017 -98575 -98336 -52161 2453
21297B453o236m5141n2196k8895j8533L2134Q4615O6112l3106R597J58530Mj80392
21284a1054L7001N3177J5693n566l339l790M681q8593K6267q6768j39602m2805
21272b44698J21793J17758L2218M505j9155L7316K7995L2583j5977k6544j2752
21261E5042k1167K8840k6459P7672m4837r3752M5707K8819o9874m4000J9525l3905
21249g8389O30N7239N225q621N3713N3187q6756j16348L2643Q4727K8678q8385
21237f2457o2547O2775O7548l0648R576j2067Q75K2493J3583l0877j2529o2068
21225i6343m651O2628P9887o0451j34185O276R0068J17644M0588j02027o1226
21214f1792n4750K9506J216P5164j7304l7375K4857o8034o1119j3319O740J15564
$$ plain form
21297 2453 -3783 -48924 -101120 -130015 -148548 -116414 -31799 34313 1207 10804 169334 169338 -11054
21284 -11054 25947 79124 94817 89251 85912 82122 86803 -1790 24477 -62291 -201893 -244698
21272 -244698 -122905 -5147 27071 31576 12421 49737 77732 110315 94338 67794 55042
21261 55042 33875 62715 36256 113928 69091 -24661 21046 49865 -20009 -64009 -44484 -78389
21249 -78389 -77759 -20520 -15295 -23916 29797 82984 -3772 -120120 -87477 -2750 25928 -62457
21237 -62457 -125004 -62229 5319 -25329 -15753 -27820 -26945 -4452 9131 -21746 -34275 -96343
21225 -96343 -100994 -38366 41521 -18930 -153115 -146839 -56771 60873 101461 -566 -61792
21214 -61792 -116542 -87036 -85820 -10656 -27960 -65335 -40478 -108512 -169631 -182950 -176210 -60646
21202f0646Q6689R2628K472l8197j4042j22773k5918J3564K2814O1159J5972q3612
21190d9890l5038M0037J1707j6981L0935O3310k4160l2299O6737L7430p181r4980
21178a0373j01359P489M7532o6719n1235O9410J52734K7747j10420o4374K0753
21167g8815P170m663q958M5816R2046K7290O88K6532r990r0772k1286Q203p9316
21154h6055M9552R3794Q1554j772l1192j670L681l8956j0190j01100p5848m3339
21142a61541J54770O1022o467J9836O5439m262o3882J0619n0528n0030q1078j13354
21130b19456J9778O3509M2124J2523K6096j3054O5882M8440k1800M3008J274n6879
21118A1445n1884j9564L1517K5616K1287K5672K7971m1309l3365j3522O0188Q0780
$$ plain form
21202 -60646 26043 118671 121143 82946 68904 -53869 -79787 -66223 -43409 17750 33722 -49890
21190 -49890 -84928 -44891 -33184 -50165 -19230 44080 19920 -12379 54358 91788 84607 -10373
21178 -10373 -111732 -104243 -56711 -123430 -174665 -105255 47479 75226 -35194 -99568 -78815
21167 -78815 -71645 -76308 -85266 -39450 52596 79886 80574 107106 97116 6344 -14942 -6739 -86055
21154 -86055 -36503 57291 138845 137073 105881 104211 107892 68936 58746 -42354 -118202 -161541
21142 -161541 -6771 54251 47784 67620 133059 128797 64915 75534 25006 -25024 -106102 -219456
21130 -219456 -199678 -136169 -94045 -81522 -55426 -68480 -2598 45842 24042 67050 68324 11445
21118 11445 -40439 -60003 -28486 -2870 18417 44089 72060 30751 -2614 -16136 44052 124832
21106A24832p240l920r4743q4573o3244K5235Q5553j9372j2393M7874L6706J1186
21094D5901M4566N889m0648Q790l8929N4390K8681o5584p0270J7970m6413M0780
21082a4877L8651n0967L1655Q4190l6653p1196P971j4808K2031m731q3388M4368
21070d7754R6212m7208n0955J6569l4348K4080Q0594k7767l6661K0249L4326j7818
21058I519r1979L9811j3781n4820L450j235L7434P8601N915k4353K1845K1596
21046C2003M58l0250r2704o5538N1115L8951J1661Q9843O8051o6090o3116n4480
21034h0096m68j4117Q5834K3656k9219L0876O7395J9985o9844J8925O741p5374
21022a5706k6677Q3379l187j00460l8277N3871O8180M6294P6181q706m1982L1107
$$ plain form
21106 124832 117592 113672 18929 -65644 -128888 -103653 -18100 -37472 -49865 -1991 34715 45901
21094 45901 90467 96356 55708 64498 25569 79959 108640 43056 -27214 -9244 -55657 -14877
21082 -14877 23774 -27193 4462 88652 51999 -19197 -11226 -26034 -4003 -8734 -92122 -47754
21070 -47754 48458 1250 -49705 -33136 -67484 -43404 37190 9423 -27238 -6989 27337 9519
21058 9519 -82460 -42649 -56430 -111250 -107800 -109035 -71601 7000 12915 -11438 10407 32003
21046 32003 32461 2211 -90493 -156031 -104916 -65965 -54304 35539 103590 37500 -25616 -80096
21034 -80096 -80564 -94681 -8847 14809 -14410 16466 83861 103846 34002 52927 59668 -15706
21022 -15706 -42383 40996 37809 -62651 -100928 -47057 21123 67417 143598 134892 92910 124017
21010A24017J8875k7764p9064o7177Q6860L5959j7101l3668L408o5179o094P1456
20998D4528n9857l0664N5784M9203m4493J5270Q799N082N6288j07501m9950L1529
20986b5982K0595M1054N5118m0517k5441P2728o0588j8817k4725k2071J499J0291
20974a6856O7161N0925j0080o1835O082K8117p416O6612m7649j02063K7221k8152
20962b7933N0598J3560P2144J229l4976m7798p2687Q2044N4712k7280j5896J4349
20950F2066k406L3194M2052N7728K2517r0549m567O5035k3047j66519l1252M303
20938c1445k761J7295p5867L6693K8753J0401q848p7002n1913O1970j1107J2539
20926i1292k9839j088N9048Q4121J3514L8115K5960n6830K4661q7274N983L6460
$$ plain form
21010 124017 142892 115128 36064 -31113 55747 91706 74605 40937 44345 -20834 -26928 44528
20998 44528 -15329 -45993 9791 58994 14501 29771 38570 43652 99940 -7561 -57511 -25982
20986 -25982 -5387 35667 90785 50268 24827 97555 36967 18150 -6575 -28646 -27147 -16856
20974 -16856 50305 101230 91150 29315 35397 63514 56098 122710 75061 -27002 219 -27933
20962 -27933 22665 36225 108369 109598 74622 26824 -45863 36181 90893 63613 47717 62066
20950 62066 59660 92854 134906 192634 215151 124602 120035 185070 162023 -4496 -35748 -31445
20938 -31445 -34206 -16911 -92778 -56085 -27332 -16931 -25779 -102781 -154694 -92724 -103831 -91292
20926 -91292 -121131 -122219 -63171 20950 34464 72579 98539 41709 66370 -20904 -14921 21539
20914B1539l2923O071K1277M7982M6785j2601l7317j3038K9831K3263n492l9126
20902E6251m0994p6401M6784M1175k7222J3624o691K09L1590O2664j19L3345j4743
20889A19472l2865j22568M019o6007K5751R9522J7982l7675j23485o0591O3711
20878a12734P0K0374k5600L1952L0988K8494L054O0266n1948l1911K4345L1038
20866H388J6353q8369m0125K6553J1769J4169Q734r12q0439J3705R6195L9406
20854B5427l854K595J1692m0590N309N1865Q4729n0217o5369j0486l6688j6703
20842d2290L5132q3833n8354K9622M6031J701J4742J1243O3659k6044r2579m1839
20830a42809J3337Q4475N6077l4317L7634r0908n1815J3177J1854o8555m3563
$$ plain form
20914 21539 -11384 -5313 15964 63946 110731 98130 60813 47775 77606 100869 95377 56251
20902 56251 15257 -61144 -14360 26815 -407 13217 6526 6735 38325 100989 100870 134215 119472
20889 119472 86607 -35961 -31942 -97949 -72198 27324 45306 7631 -115854 -176445 -112734
20878 -112734 -112664 -92290 -117890 -85938 -54950 -26456 -23402 36864 -15084 -46995 -22650 8388
20866 8388 24741 -63628 -103753 -77200 -65431 -51262 -42528 -43440 -123879 -110174 -13979 25427
20854 25427 21573 24168 35860 -4730 579 52444 137173 86956 21587 11101 -25587 -42290
20842 -42290 -7158 -90991 -149345 -119723 -73692 -71991 -57249 -46006 17653 -8391 -100970 -142809
20830 -142809 -129472 -44997 11080 -23237 14397 -76511 -128326 -115149 -103295 -171850 -215413
20819b15413N1101M4808K0621N9388M7375M8912K6304q0517j00579J9564J03221
20808B4785j2754n4024K6822j3211l27O7113J02692K8471r7867j09033K0343J0205
20796f785N0321P0916l9360N528j2050m8882o5112l4412J2697K3433l3651k1942
20784i9299n7534L95P3714Q9637k4172r9943k9320N5383O6993n5686J8449Q2557
20772B1174J02399m4713j37920L1700j2899m3348Q9420Q9264O782o9637k6781
20761E441k244N9670P6077O822n3617p3313J5626Q2446J9664r1568m5205K9668
20749B9467k0839j21938n459M7913K236j2229J19191O52J8782R007M7716m6714
20737F7785m8491j7046N548j4230K4951N8496L501M11o8555l7532O9519l1728
$$ plain form
20819 -215413 -164312 -119504 -98883 -39495 7880 56792 83096 2579 -98000 -78436 24785
20808 24785 12031 -41993 -15171 -28382 -28709 38404 141096 169567 71700 -37333 -16990 -6785
20796 -6785 43536 114452 75092 80620 68570 19688 -45424 -79836 -67139 -43706 -77357 -99299
20784 -99299 -156833 -156438 -82724 6913 -17259 -117202 -146522 -91139 -24146 -79832 -61383 21174
20772 21174 123573 78860 -59060 -27360 -40259 -83607 5813 95077 101859 32222 5441
20761 5441 3197 62867 138944 145766 92149 18836 34462 116908 136572 45004 -201 29467
20749 29467 8628 -113310 -118769 -70856 -68620 -80849 38342 38994 57776 66783 114499 67785
20737 67785 19294 2248 7796 -6434 18517 77013 80514 80925 12370 -25162 44357 12629
20725A2629r1449M9851q613j7417l256L5827n849m3780L8034p7466j3680O0074
20713f5095L1417m9904k527m1290j7539j9606N470J16102N0390N6657O1063l823
20701A21315l9084l2578j08039p3614j0041j020J5448L67l1418L9165K2628J1713
20689h5158L4187L101k7106M3158O7332N2047l0046o218K2499K196o6055p473
20677B464L2102L8425J5143r7692j03988J08303K4989j55144o4969N9029R7121
20666d4217q2398l7998L7183O8856O3938q6508P021M9880P3593Q0147P068n6774
20654G9791p7270m641k8311l4101j737M5998N5814q757M791l1042k8845j6972
20642d5282j3133M0985K8968j4314P6302K7492l8971J3259L8445O6251j24300
$$ plain form
20725 12629 -78820 -28969 -37582 -54999 -58255 -22428 -28277 -72057 -34023 -111489 -125169 -65095
20713 -65095 -33678 -83582 -86109 -127399 -144938 -164544 -159074 -42972 7418 64075 125138 121315
20701 121315 82231 49653 -58386 -132000 -142041 -143061 -127613 -127246 -158664 -119499 -96871 -85158
20689 -85158 -50971 -47870 -74976 -31818 35514 87561 57515 51297 73796 75992 9937 2464
20677 2464 34566 72991 88134 -9558 -113546 -5243 19746 -135398 -200367 -141338 -44217
20666 -44217 -126615 -164613 -127430 -58574 5364 -81144 -74123 -24243 49350 129497 136565 79791
20654 79791 2521 -2120 -30431 -64532 -66269 -20271 35543 26786 31577 535 -28310 -45282
20642 -45282 -58415 -17430 11538 -2776 73526 101018 62047 75306 113751 180002 55702
20631E5702j07562L6476L7354l669m0453J599J097N4392R9526J9990N211o4211
20619I5452K9624n952k2410o1489L9974j1478p3533o7941p52J5676J8273P5770
20607C1214j6721j04298o004J7597J18136j2834l2464l331n729J0475l7706M8849
20595G184N4193j6743k4309j800K8605P85p2869o9491j6053q254O9745O0223K4569
20582C5785m6259N0977r1050n4123m2420N0672M5346P0508p1554j10613J0209
20571a52522J7222N8219M9205k6845J774n0730m1971J00121Q543J2835O0823M2530
20559G9204o8922l5947M7314l87l4208k747o9646M0627L4655o3338k9042k1368
20547a23805j8818q696K2633P0020M6387K9955Q1199O984p1282K1827N7765k0901
$$ plain form
20631 55702 -51860 -15384 21970 18301 -22152 -20553 -19456 34936 134462 154452 159663 95452
20619 95452 125076 119124 96714 35225 75199 63721 -9812 -77753 -78505 -62829 -44556 31214
20607 31214 14493 -89805 -95809 -78212 39924 27090 -5374 -8705 -14434 -3959 -41665 7184
20595 7184 61377 44634 20325 18525 47130 47915 -24954 -94445 -110498 -118752 -49007 11216 35785
20582 35785 -10474 40503 -50547 -104670 -147090 -96418 -51072 19436 -52118 -162731 -152522
20571 -152522 -135300 -77081 -27876 -54721 -52947 -103677 -145648 -45527 -36984 -24149 36674 79204
20559 79204 10282 -25665 21649 21262 -12946 -15693 -85339 -44712 -10057 -73395 -102437 -123805
20547 -123805 -142623 -151319 -128686 -58666 -12279 17676 98875 105859 34577 56404 114169 93268
20535I3268m3696j16296Q9430J50490m935j33090m3831J9537M8844p2608k4255
20524c7142M7194M4267M7936j16470l9036K3908P2514M4704k9070j22175j9014
20513h2384K6260m6198l5885J5138J08815R0400o7906k5516R8894J2474m5098
20502D8994m772m3706o8398j1676K9998k6420M5799J6585N1040J9131J6465L401
20490G6441j16259K3833K2927k5896k5460l3374N1498K907P792n9304l4887l3223
20478a43005N3303j7934m1897R9984R6573K4979m1413J0208M3781k1363l1200
20467C2016k2928n9705p2077K7071J25993J8498j1744Q637Q2492J7331q4901M718
20455F5401M6145M5638r780j2213o5101n0074n9541o4690O0555O1127K362r980
$$ plain form
20535 93268 49572 -66724 22706 173196 168261 35171 -8660 10877 59721 -12887 -37142
20524 -37142 10052 54319 102255 -14215 -53251 -29343 43171 87875 58805 -63370 -82384
20513 -82384 -56124 -102322 -138207 -123069 -14254 76146 8240 -17276 81618 94092 48994
20502 48994 44222 516 -67882 -79558 -49560 -75980 -30181 -13596 37444 56575 73040 76441
20490 76441 -39818 -15985 6942 -18954 -44414 -77788 -26290 -23383 -15591 -74895 -109782 -143005
20478 -143005 -89702 -107636 -149533 -49549 47024 72003 30590 40798 84579 63216 32016
20467 32016 9088 -50617 -122694 -95623 30370 48868 37124 45761 128253 145584 60683 65401
20455 65401 111546 157184 147404 135191 70090 20016 -39525 -104215 -43660 17467 19829 9849
20443I849q5476k3635o6564J5674M780K2346M3629M4033m328N5466Q1651l0535
20431F6890L1943n9848m6044n0383m8146J05453J0681n5120o9373N2843M442M6922
20419i740L6309o8744K6862j2472K931M6680N0409L4114K4600m5159r2525p9476
20407h6211N442N3486j7150J0648R5346n0095k7726M891r860Q6103N0228K7718
20395A42820n6260l9053M1887L7112J007j1181J3637j21565j22005o9414K3119
20384a59896J44748K4151l3567M243M6687N2392J4494M893l2458j6434p684M3983
20372H5552o325P5855J5453M8154K7705n2014n289N162p9530p2437l1771l7435
20360b6920M931R6513r0670k9049m7781L7465M1417M1904l2173l5299P194l4928
$$ plain form
20443 9849 -75627 -99262 -165826 -150152 -145372 -123026 -79397 -35364 -39692 15774 97425 66890
20431 66890 98833 38985 -7059 -57442 -105588 -135 10546 -44574 -113947 -61104 -56662 -9740
20419 -9740 26569 -42175 -15313 -27785 -24854 21826 72235 106349 130949 85790 -6735 -86211
20407 -86211 -80769 -27283 -44433 -33785 61561 11466 -16260 -11369 -21229 64874 115102 142820
20395 142820 86560 47507 89394 126506 127513 116332 129969 8404 -113601 -183015 -159896
20384 -159896 -15148 9003 -24564 -20321 26366 78758 93252 98145 65687 49253 41569 85552
20372 85552 79227 155082 170535 218689 246394 194380 189091 194253 114723 42286 10515 -26920
20360 -26920 -21989 74524 -16146 -45195 -92976 -55511 -14094 27810 -4363 -39662 -32468 -67396
20348f7396K4770M0919m3322L7022L8806j32429k2850P7935K5138n532k7456j3792
20336f8187K1724K9726P0875J18937k3035j19643l0015j3177O2395m167M0577
20325H6010j2674p7232r9825j0179K9611N82L719K6210j7703Q844N5327L354j8862
20312b2818R915K2957k2727k404p4799p7716j7188J26021J10269L475p4776L3961
20300A4170N4745L66l7406N5212k9497j475k8643q0690l307L852j977p5985L4640
20287i5995R75M5899M1627L5543j9985m8065k6972m842L7223J9557M277J1451
20275F93k3138N916J4771k8603j38713L0500N0980K7774j0419m0173O909R1363
20263a2140O2204J0584p7511m5777J0170O2726O3093k3585L4630q6002n1844O1892
$$ plain form
20348 -67396 -42626 -1707 -45029 -8007 30799 -101630 -124480 -46545 -21407 -26939 -54395 -68187
20336 -68187 -46463 -16737 54138 173075 150040 30397 382 -12795 49600 45433 86010
20325 86010 73336 -3896 -103721 -113900 -84289 -83707 -79988 -53778 -71481 -62637 -7310 -3956 -22818
20312 -22818 -12903 10054 -12673 -15077 -89876 -167592 -184780 -58759 51510 54985 -19791 14170
20300 14170 68915 69281 31875 87087 57590 56115 27472 -53218 -56525 -52673 -54650 -130635 -95995
20287 -95995 -95020 -49121 -7494 28049 8064 -40001 -66973 -71815 -34592 -15035 -10758 693
20275 693 -22445 -16529 -1758 -30361 -169074 -138574 -87594 -59820 -70239 -110412 -103503 -12140
20263 -12140 50064 60648 -16863 -62640 -52470 10256 73349 49764 84394 -1608 -53452 8440
20251H440l2409J2108O2508J7547P248j08414l8446L8442p1734J8216J01184J1123
20239B5813o0943O6041K7284p1775q7547o090M9067L8096L3614N2910K832j9109
20227E0193l8846K0130M2093p1986n2383K7646M2563N6355L8709q2741j7838M8158
20215F2053O0978k5027p0041q1440P3350M5723p5421o7644L752L6558J29463P0923
20203A63227p1164k9876m02k7379l820l3269k8025q506K256M3449l0642o980j6582
20190d7713O1600Q756k1566j5576N1839J0349O0679K0839r1883p2610m5195N1867
20178b8614M9432N236O3L2396R74K2075J2754l4120K811l3995L0190N8113o503
20165A10812r3840p6141k9650M0734L7465K1340K9786j9047l6782J3123K5388
$$ plain form
20251 8440 -23969 -11861 50647 68194 75442 -32972 -71418 -32976 -104710 -86494 14690 25813
20239 25813 -35130 30911 58195 -13580 -101127 -107217 -58150 -20054 13560 66470 69302 50193
20227 50193 11347 31477 73570 1584 -50799 -23153 19410 75765 114474 31733 13895 62053
20215 62053 123031 98004 27963 -53477 19873 65596 -9825 -77469 -73717 -37159 92304 163227
20203 163227 92063 62187 61785 34406 30586 -2683 -30708 -39214 -36958 6491 -24151 -31131 -47713
20190 -47713 13887 22643 1077 -14499 37340 47689 108368 129207 37324 -35286 -80481 -28614
20178 -28614 20818 26054 26117 58513 59487 81562 94316 60196 63007 29012 59202 117315 110812
20165 110812 16972 -59169 -88819 -48085 -10620 10720 40506 21459 -15323 -2200 23188
20154B3188K7574N0524m2076k4921J999n4674O8041Q4557k8276l5826o5848n9010
20142e4748j9948L8478J06205l3332O4856P0157n0291k1174p509j40565N240L2691
20130i940j0042J6461L0718N268l9013N5668l0616l1494l3050j1624O2015K7626
20118C1977n9602O2331Q3760p3784p8205m33k8411n9410o2632J4331R2153Q685
20106f9240k8160M9061P1292J7724r9606k9617l2660R7788N5957l2580k349K6612
20094B4222k9091m6998k8766q5457l5617J07170J33245j1933m1066p2849j2883
20083a00023K6164K2464R318j5099j2454K2001k9547k2430O5074J7089j0325L3004
20071E236J160K8185J6215o2838j02967p0219N4246J22505p9652J0369Q6642R688
$$ plain form
20154 23188 50762 101286 59210 34289 36288 -18386 49655 134212 105936 70110 4262 -54748
20142 -54748 -74696 -36218 69987 36655 101511 171668 121377 100203 92694 -47871 -42631 -9940
20130 -9940 -19982 -3521 27197 32465 -6548 49120 18504 -12990 -46040 -57664 4351 31977
20118 31977 -27625 34706 118466 44682 -33523 -33956 -62367 -121777 -184409 -170078 -77925 -69240
20106 -69240 -97400 -48339 22953 40677 -58929 -88546 -121206 -23418 32539 -41 -2390 24222
20094 24222 -4869 -51867 -80633 -166090 -201707 -94537 38708 26775 -14291 -87140 -100023
20083 -100023 -73859 -51395 -42077 -57176 -69630 -47629 -77176 -99606 -34532 -17443 -27768 5236
20071 5236 6396 34581 50796 -12042 -115009 -185228 -130982 -8477 -88129 -77760 8882 18570
20059A8570l5972l5493j0787k8007N1641M1849j4007P6877L820K0659p8047k7554
20047a6451L751J8288n3998j8695K6837p425N387M5146j9616J0312j6826q3743
20035a07033N5931O7472l995j5747L5174K1423k6480P68M1270j0360N5853O8051
20023A82327Q6971o28r7536m3076M2592q195l1267r8177Q8544J00465p506r6695
20011A17819o5694n4721N255J00826l7201j05881l424n2653k8635O7408L6266
20000b0635l3499l8550P6748K7587O4262K6341N3377m1412j04690K8425J6007
19989E3961M4445J07817n5256l4297j11905o2907n721R2488J7898r2003o808r673
19977f1961l0528M5094k1826L2918o700j2850m3267q018O916m8792l6623J15465
$$ plain form
20059 18570 -17402 -52895 -63682 -91689 -40048 1801 -12206 64671 68491 89150 11103 -16451
20047 -16451 -12700 5588 -48410 -67105 -40268 -47693 -42306 2840 -16776 -6464 -23290 -107033
20035 -107033 -51102 16370 12375 -3372 31802 53225 26745 27513 68783 58423 114276 182327
20023 182327 269298 268670 171134 128058 170650 162455 131188 33011 121555 222020 214514 117819
20011 117819 52125 -2596 2659 103485 66284 -39597 -43021 -95674 -124309 -56901 -20635
20000 -20635 -54134 -92684 -15936 11651 75913 102254 155631 114219 9529 37954 53961
19989 53961 98406 206223 150967 116670 4765 -58142 -63863 28625 46523 -45480 -52288 -61961
19977 -61961 -92489 -47395 -69221 -36303 -43003 -55853 -99120 -107138 -100222 -149014 -185637 -70172
19965g0172O7547O416K2613N5443k8082k7376M4097K4288J0163O7568l2458m9670
19953I0377o0119p1564n1932N4592k8520N9278p2491l4644P1894P6179J28446
19942A61496l175j8167j27845n5468J19251L35n6516l3500K9420n38O3166L1145
19930A09604p6757o686K3364K1521K0828k9941J1331L5160J8380j08905K2622
19919D0521L8200L6054m0529L1266N1892K0369n158l5478j6086J2403l4271O3464
19907A62647M5006K3306p8590J5305R0843J48143J45740J62798M61065K58260
19897A434523J44793J02387M5058k61290l85909k50553j36934j58359j85235k4152
19887C24329K326j6907k271j07354p2391n931N0139j1672n9656q5780m0201n1167
$$ plain form
19965 -70172 -2625 3791 26404 81847 53765 26389 70486 94774 104937 172505 140047 90377
19953 90377 30258 -41306 -93238 -38646 -67166 -7888 -80379 -115023 -43129 33050 161496
19942 161496 158321 140154 12309 -43159 76092 76427 19911 -13589 15831 15293 78459 109604
19930 109604 32847 26161 49525 71046 91874 61933 73264 108424 126804 17899 40521
19919 40521 78721 114775 74246 105512 157404 177773 172615 137137 121051 133454 99183 162647
19907 162647 207653 230959 152369 167674 258517 406660 552400 715198 1176263 1434523
19897 1434523 1579316 1681703 1726761 1465471 1079562 829009 692075 533716 348481 324329
19887 324329 326655 309748 307477 200123 127732 121801 171940 160268 100612 14832 -25369 -76536
19875g6536M103L921P6569K9169m6166N209n6382L042M2856K7078p296j5906J26673
19862A16334J8376k2835n6578J2341M3958l1569n4581k5041Q576q509l2367N7190
19850B5295n78n814o9210P7423M6501M4846M6493q9463j12736m5675Q5535J4786
19838A7403L5597l4826o6202J3221j6744q6647N0340J42454R8470K0350p8539
19827I4877p8798n9443o6332N4789L8202O0596j11567N33J4938m783J8431L9005
19815D48l2031M1118J51371N950O1347K4180o2170m8890J7239O6271l7482n1637
19803A35714J1991j3543J269n3859k8416r4207M922J1344j689J0346O8278N3811
19791A05961J61N1240m9793q0966Q2395l5418J8751M5041o2714m2847j4921L2996
$$ plain form
19875 -76536 -72433 -68512 8057 37226 -8940 -3731 -60113 -57071 -14215 12863 5567 -10339 116334
19862 116334 134710 111875 55297 67638 111596 80027 25446 405 8981 472 -31895 25295
19850 25295 24717 18903 -50307 27116 73617 118463 164956 75493 -37243 -82918 2617 17403
19838 17403 53000 18174 -48028 -34807 -51551 -138198 -87858 54596 153066 173416 94877
19827 94877 16079 -43364 -109696 -54907 -16705 43891 -67676 -67143 -52205 -56988 -38557 448
19815 448 -31583 9535 160906 166856 228203 252383 190213 141323 158562 224833 187351 135714
19803 135714 147705 134162 135431 81572 53156 -41051 -36129 -24785 -26474 -16128 52150 105961
19791 105961 106122 157362 107569 26603 108998 73580 92331 137372 74658 31811 16890 49886
19779D9886k1916m9334P0458j3433M4550M3415j52223m5314J26525O7685j32666
19768a2367j55531P3625M9929R7589K6741K3191k0776K5686K9224k4610M0242
19757A52943l0184o7203o5603q9519O407Q3040j844k028Q811L2709j783o6767
19745d1021l2168k3461M9434M3066l9206M9796J709N396N8189R015J1482k8300
19733F3931M9923K0620o8109j0795O6915n6521p4369k7660r399l0819J1963R4102
19721B9782J9313J5426L9641L4222l3254j15081j6143J04219M267j16561l8937
19710g3106K6110L2109J08762Q5480l7968j7022m41m3888k4506q7945m3545J4925
19698f1035N2175N5955p6652J1403j08747N0293J31794r752k6941K538J2516K3710
$$ plain form
19779 49886 27970 -21364 49094 35661 80211 123626 -28597 -73911 52614 120299 -12367
19768 -12367 -167898 -94273 -44344 53245 79986 103177 82401 108087 137311 112701 152943
19757 152943 122759 55556 -10047 -99566 -93159 -10119 -11963 -13991 -5180 27529 25746 -41021
19745 -41021 -73189 -96650 -47216 -4150 -43356 6440 8149 13545 71734 80749 92231 63931
19733 63931 113854 134474 66365 55570 122485 65964 -8405 -36065 -45464 -76283 -64320 29782
19721 29782 49095 64521 104162 138384 105130 -9951 -26094 78125 82392 -34169 -73106
19710 -73106 -46996 -14887 93875 179355 141387 124365 123924 80036 55530 -32415 -75960 -61035
19698 -61035 -8860 47095 -29557 -18154 -126901 -76608 55186 45434 18493 21031 33547 57257
19686E7257L1618k1617j9264P87k6639J3094Q9300K8775J7009o1704l7414K0054
19674I1256l143p1426J2498R078M4543k8850L1399M925N59j31433o6756O0060
19662d7290m1850m9013J41009O4487j6597M7591k9463l0189m1308J928l585R91
19650c289l4515R1137L473j0426M5285q403N4758q5060j21986q832J42899P3333
19638A38374M1667k9621p15r8489m0853P1396k4961l0682k5594P521O6504O503
19626H1050l4975K254n5554p1056Q9777M7191m1278l2944J8847N4274j9292L7099
19614G5393Q2332n8221q6182j5150M023N8391K8463r955N2214J13297j9377k9048
19602A96180j3938o9074O3098k5321q5906m326K6331K6007l0037l616K210M8111
$$ plain form
19686 57257 88875 67258 47994 48781 22142 35236 124536 153311 170320 108616 71202 91256
19674 91256 88113 16687 29185 38263 82806 53956 85355 90280 90839 -40594 -107350 -47290
19662 -47290 -89140 -138153 2856 67343 50746 98337 68874 38685 -2623 -695 -4280 -3289
19650 -3289 -37804 53333 56806 46380 91665 83262 138020 52960 -69026 -77858 65041 138374
19638 138374 180041 150420 149705 51216 10363 81759 56798 26116 522 8043 74547 81050
19626 81050 46075 48329 -7225 -78281 11496 58687 17409 -15535 3312 57586 38294 75393
19614 75393 157725 99504 13322 -1828 2195 60586 89049 79094 131308 244605 225228 196180
19602 196180 182242 113168 176266 150945 65039 60713 87044 113051 83014 79398 81608 129719
19590A29719p6341q2677M8253J9912n7078n2010L1341j8472J4079l332L8323Q941
19578F58l4583M9821Q852m1114n6435k1887P2860l0981l0989L85L7250M9379Q9247
19565I2463J8914m305K1330L5075o2252n0100k686j4135J19965L3557j18078o5324
19553D424N7456j1706K3682O995j2567n7750O3126j0636K2744j8534m595P3861
19541A36500L5698j37779j00872N4836k5282K6001Q6549M8098L7911m0466N3771
19530A74965j3793n8733K5963j7946k773n1239n6825J1414O3288N7090p380K8415
19518A52446M3433M2389k6335q1179n1552O7122K8197q2829l639M5789K8537l2665
19506A29714K528k9874k2306L5775K2756k0961j06280j1245K5501K1196m960J3444
$$ plain form
19590 129719 53378 -29299 18954 38866 -18212 -70222 -38881 -57353 -43274 -46606 -8283 658
19578 658 -33925 15896 24748 -16366 -72801 -94688 -21828 -52809 -83798 -83413 -46163 3216 92463
19565 92463 111377 107072 128402 163477 101225 51125 48439 34304 154269 187826 69748 4424
19553 4424 61880 50174 73856 80851 68284 10534 73660 63024 85768 67234 62639 136500
19541 136500 172198 34419 -66453 -11617 -36899 -10898 75651 123749 161660 121194 174965
19530 174965 161172 102439 128402 110456 107683 56444 -381 11033 74321 131411 124031 152446
19518 152446 195879 238268 211933 130754 79202 146324 174521 91692 88053 133842 162379 129714
19506 129714 132242 102368 80062 115837 138593 117632 11352 107 25608 46804 41844 55288
19494E5288O3103J6517l6684o1617k676N079j12770R14L7848Q3048P736J2444
19482F8230m6315O776K431J0851P4261m0038J2672L3634o7898p1196K9778L4350
19470D7536N1003P2249N1875J4347j05008P3504j2907k2479j04168m111O7533
19459A29374q4297n5094k7047M0818J27684M6694m5008P12M1351j2297N0116m3394
19447A69612m4939m6531l368L0074o407k5406m6311J12877L5183k3531k3920p1076
19435E6257M20J1573l6442K1775l2134l6864P7721K5338O689l4356J2473R2809
19423A65259L0477Q062r4697Q600l1018m89K9257L6991K9443K2627J0542K2760
19411B37814q5651J4995p388l8691M7488L2709l6822L0809K7432l6318k2717m228
$$ plain form
19494 55288 118391 134908 98224 36607 33931 39010 -73760 -72846 -34998 48050 55786 68230
19482 68230 21915 28691 31122 41973 116234 76196 88868 122502 54604 -16592 13186 47536
19470 47536 98539 170788 222663 237010 132002 205506 192599 170120 65952 61841 129374
19459 129374 45077 -10017 -37064 3754 131438 178132 133124 133836 175187 162890 213006 169612
19447 169612 124673 78142 74774 104848 98441 73035 26724 139601 174784 151253 127333 56257
19435 56257 56677 68250 31808 53583 21449 -15415 62306 87644 94333 59977 72450 165259
19423 165259 195736 203798 109101 117701 86683 86194 115451 152442 181885 204512 215054 237814
19411 237814 152163 167158 159770 121079 168567 201276 164454 195263 222695 186377 163660 159432
19399A59432m1574L9185P6849J36814k7639j29740N5419k0472J8399m1308l6895
19388A88470J61797Q0113P1335J51557K09395J54019K0728q5075l7837l1884j11046
19377G71572k07310k00584n7967J9867o004Q8088R6558K6469q5096l4627n495
19366D05471p3551l0215j2411n7907k6146J1502n900J9742j14227J8802m4354
19355I0806q5772j7177R6059J3917O2481L9254m7370j36941l573O9768J00255
19344A81707R9165Q7142P3399K6463P4748K7541k9752m5656o7211O3866J31985
19333F23397J49043N3430J32446K41184K03960J21198M7589k8251j51276j76665
19323A216055k03388k15565q0257l5735o4354l4787k7603j3350r1756p1017k8430
$$ plain form
19399 159432 117858 157043 233892 370706 343067 213327 268746 248274 266673 225365 188470
19388 188470 350267 430380 501715 653272 862667 1016686 1037414 952339 914502 882618 771572
19377 771572 564262 363678 305711 325578 319574 407662 504220 530689 445593 410966 405471
19366 405471 331920 301705 289294 231387 205241 216743 210843 230585 116358 135160 90806
19355 90806 5034 -12143 83916 97833 160314 199568 152198 15257 11684 81452 181707
19344 181707 280872 368014 441413 467876 542624 570165 540413 494757 427546 491412 623397
19333 623397 772440 825870 958316 1199500 1403460 1524658 1572247 1543996 1392720 1216055
19323 1216055 1012667 797102 716845 681110 616756 581969 554366 541016 449260 378243 349813
19312C49813p5341Q2383J26851l8343m7320K0512J3237q2777l6358p883J45300
19301D50074L7190l2317l3717j9809k2445m0572o3285K6679j6051J1319l5819
19290B61247k2590j0412k8298O5453Q2835Q1985K5612J7045k6090q0377J3639
19279C80049O2008l5341k4669n7830m4830j2639J07374O4640m41R920n8564n2819
19267C36858k8084Q419O8314O7252K4673q684o5889q6431Q691P4588k7810n4608
19255C17289N3171P2079N1909K0424j8605k8655j3500Q9450j973j3318j6091k6307
19243D85873l3394J10945P3842K1019O7472K0805J2413L5467P8391K0569K06l5838
19231H57770J1918p5173r586j1289J07192J17243M078p8926j06507j4854P4218
$$ plain form
19312 349813 274472 356855 483706 445363 398043 418555 431792 349015 312657 304774 450074
19301 450074 487264 454947 421230 401421 378976 338404 275119 301798 285747 297066 261247
19290 261247 238657 228245 199947 265400 348235 430220 455832 472877 446787 366410 380049
19279 380049 442057 406716 382047 324217 279387 266748 374122 438762 438321 448241 389677 336858
19267 336858 308774 317193 385507 452759 477432 468748 402859 316428 325119 399707 371897 317289
19255 317289 370460 442539 494448 514872 496267 467612 454112 543562 541589 528271 512180 485873
19243 485873 452479 563424 637266 658285 725757 746562 758975 794442 872833 893402 893608 857770
19231 857770 869688 794515 784929 773640 880832 998075 1002153 923227 816720 801866 876084
19220H76084L2411P4347N6970J99237K40181K73298K04867K96016L29696K92601
19210B875708J08593r7389k17409k01899j73217K8187J51704L18692L17002L76066
19200C486038O23618N79284O20869M76564L96803K93283J52134P4255J61970K63321
19190G128139K87085M58431N69489Q17596J044516J277618J509006J677216J891480
19181A6660576K226962K896185M090723O115890R240701J4271022K2691801L6611378
19173A14805238N3969616O3090586N5525168L1025732p882401m0435693n6776487
19166B13321759n6134382m3007370k8825535j8701060j2160834p930710n504542
19159D1057326l965719l164277k882087k884193k991460k913054k700634k420020
$$ plain form
19220 876084 908495 982842 1039812 1239049 1479230 1752528 1957395 2253411 2583107 2875708
19210 2875708 2984301 2886912 2669503 2467604 2294387 2322574 2474278 2792970 3109972 3486038
19200 3486038 4109656 4688940 5309809 5786373 6183176 6476459 6628593 6702848 6864818 7128139
19190 7128139 7415224 7873655 8443144 9260740 10305256 11582874 13091880 14769096 16660576
19181 16660576 18887538 21783723 25874446 31990336 41231037 55502059 78193860 114805238
19173 114805238 168774854 231865440 287390608 318416340 310533939 270098246 213321759
19166 213321759 157187377 114180007 85354472 66653412 54492578 46561868 41057326
19159 41057326 37091607 33927330 31045243 28161050 25169590 22256536 19555902 17135882
19151A7135882k007553j723197j402487j130453q42946n08942l03852l03535m27473
19142H485444o20372p87238p02383o66430m96927m12762k17759l30883j80924
19133D069766p1027q8488j50733o0191o1337k40077j25172k10890l11749k21459
19123B528643j71573j42267j44659j23150q7231j20094j15585j06845k8532q4922
19113A403785j21089K1090R7915L2294M5192k290p9985j15312j34724J3020J54167
19102A314063Q5691M1445J22566J04904j9777q1075k73721j77942j41383l7536
19092I37235k5973J1654r4804L992N5284K1788k0392m0374L138r1964p5824j4360
19080F69400o2045j5395K2488k1462n5864M3528n570J9194J7583J0853K687k2325
$$ plain form
19151 17135882 15128329 13405132 12002645 10872192 10029246 9520304 9216452 8912917 8485444
19142 8485444 7865072 7077834 6375451 5709021 5212094 4799332 4581573 4250690 4069766
19133 4069766 3998739 3910251 3759518 3699327 3637990 3397913 3272741 3061851 2750102 2528643
19123 2528643 2357070 2214803 2070144 1946994 1859763 1739669 1624084 1517239 1488707 1403785
19113 1403785 1282696 1303786 1401701 1433995 1479187 1476897 1396912 1281600 1146876 1159896 1314063
19102 1314063 1399754 1441199 1563765 1668669 1648892 1567817 1294096 1116154 974771 937235
19092 937235 911262 922916 828112 832104 887388 909176 888784 848410 851548 759584 683760 669400
19080 669400 607355 591960 614448 592986 537122 580650 575080 594274 611857 622710 625397 603072
19068F03072K8919l530N5256L2139r709J00743J51174N4097N3192k7861r8233
19057I39259N5242R4895J61896J18312O2767j5056n3977j67696j02874q0334o3571
19046I48863k7906N7160N4297L3098N2095p5142j57613j67654r8248j26897k6589
19035D65464K9565m0465j12998J0426n8017r8861k9357N3848K8370M7791L376
19024B99142j27394J9051K0102j8035q155j43255j28766j05073p5803n3321k207
19013c23714N9285J28433K46894J39820K4163L9636o823p733J3424J1842L4323
19002C59550J02437L0093l2208p0000n1930k2082Q0092j9158k4106M0059j196
18991C91551q6432o0587N2236J9735p2836m6210j0422o9047L0870L3263m595J1594
$$ plain form
19068 603072 631991 628461 683717 715856 706147 806890 958064 1012161 1065353 1037492 939259
19057 939259 994501 1089396 1251292 1369604 1432371 1417315 1363338 1195642 1092768 1012434 948863
19046 948863 920957 978117 1032414 1065512 1117607 1042465 884852 717198 618950 492053 465464
19035 465464 495029 454564 341566 351992 293975 195114 165757 219605 247975 295766 299142
19024 299142 171748 190799 210901 192866 184711 41456 -87310 -192383 -268186 -321507 -323714
19013 -323714 -264429 -135996 110898 250718 274881 314517 307694 299961 313385 325227 359550
19002 359550 461987 492080 459872 389872 337942 315860 395952 376794 352688 392747 391551
18991 391551 305119 244532 296768 316503 243667 197457 187035 117988 148858 182121 177526 189120
18979A89120J00115l5794n4601j6554O5809Q3342P4934l456P4814j350j6842J8484
18967D78021L5904q9550J2789K9781K2074p7242j03130L4543N2319L0465o8166
18956C57808L2356J6421j004L8448q959l7735J6700O8756m7484o1875L9617n5384
18944C57665Q759L9853M7202l0247o753M1779k2106j06739l2312R0918N9652j8086
18932D29585L0592L855N5093Q3139P4813M4370J91858K75869L47017K91255J94807
18921B022253N7221o7675j55616j44777q9973j69222j84220j27542j52290j11279
18911H76880j34946j68491q0784j01601M6583Q8576M9088J4031m72N0323q2345
18900E56842j3232P731j4099k5975m9866N3k4578n0276j4144Q682m9048l8289
$$ plain form
18979 189120 289235 253441 198840 182286 248095 331437 406371 402915 477729 476379 459537 478021
18967 478021 513925 424375 437164 466945 489019 411777 308647 343190 395509 425974 357808
18956 357808 390164 406585 405581 444029 435070 397335 414035 482791 435307 373432 413049 357665
18944 357665 366424 406277 453479 423232 416479 458258 436152 329413 297101 388019 447671 429585
18932 429585 460177 464032 519125 602264 677077 721447 913305 1189174 1536191 1827446 2022253
18921 2022253 2079474 2011799 1856183 1711406 1621433 1452211 1267991 1140449 988159 876880
18911 876880 741934 573443 492659 391058 437641 526217 575305 589336 588864 639187 556842
18900 556842 543610 551341 537242 511267 461401 461454 436876 386600 372456 381138 332090 293801
18888B93801k9743M457J30890J244q2007J1634O3053Q116n9476j05300l0096j4663
18876A91910K7260K5925J1948M9857m8523L5049P2880L4181k7659O4930o783k8075
18864D02900j2367P886m6584n3022N4426k0582R4272O6434k2056k3228J2467O9708
18852E30254J19051L8376K9110o2254q1128O7036O5908j980l2040n1887m4997
18841E75449j9743k2713k4989K6693m2256M8219p845J2390Q4958N2747q6246j05170
18829D91494J0374L9410j4079M1883K7236m7544l8774n034K5424J6549L2687O5357
18817F44983M6348Q4853q312k4648k1050j224O368o4674M6456k3337K2259N0653
18805G58675J78584K67824J98579J67758J4508J24870k6749j67697j51083q6138
$$ plain form
18888 293801 264058 268515 399405 400649 318642 330276 393329 401445 341969 236669 206573 191910
18876 191910 219170 245095 257043 306900 258377 293426 366306 400487 372828 437758 430975 402900
18864 402900 390533 398419 351835 298813 353239 332657 426929 493363 471307 448079 460546 530254
18852 530254 649305 687681 716791 654537 573409 640445 706353 704373 672333 620446 575449
18841 575449 555706 532993 508004 534697 492441 540660 532815 545205 630163 682910 596664 491494
18829 491494 501868 541278 527199 569082 596318 548774 510000 504966 530390 546939 579626 644983
18817 644983 691331 776184 767872 743224 722174 720950 727318 662644 709100 685763 708022 758675
18805 758675 937259 1205083 1403662 1571420 1585928 1710798 1684049 1516352 1365269 1279131
18795A279131j07459j28613k4081k5935k1292r4764q0840N6711M677n5762O622
18784H08395l7041J9224P2805M777L7344L6897M6539p2821p9398J6138N1684N1169
18772I55712J8959L6823R8436M1835j04453m4551N0468K65942L18778J24565q1799
18761A680715j13689j22036j43886o6126O2230L2423j48608j17089p9535j1514
18751I72885N0525J33286J38038O4065Q469q0551P5223J99200J20193N8316l69
18740A739280Q7687J01501P7093J48790J79979J07862J9329N2947K08910K16364
18730B939742J61568L01397L90723J65614N560p1366J2296J36447L18248K41876
18720D602105K91003M11652P58285J005460J259942J673887K185632L128338L749918
$$ plain form
18795 1279131 1171672 1043059 1018978 993043 971751 876987 796147 852858 857535 801773 808395
18784 808395 771354 790578 863383 868160 905504 942401 988940 916119 836721 852859 904543 955712
18772 955712 974671 1011494 1109930 1151765 1047312 1002761 1053229 1319171 1637949 1762514 1680715
18761 1680715 1567026 1444990 1301104 1234978 1297208 1329631 1181023 1063934 984399 972885
18751 972885 1023410 1156696 1294734 1358799 1367268 1286717 1361940 1561140 1681333 1739649 1739280
18740 1739280 1826967 1928468 2005561 2154351 2334330 2442192 2461521 2514468 2723378 2939742
18730 2939742 3101310 3402707 3793430 3959044 3964604 3893238 3905534 4041981 4360229 4602105
18720 4602105 4893108 5304760 6063045 7068505 8328447 10002334 12187966 15316304 19066222
18711A9066222L087667J577467L95487N44746K481068O356268J2721627K1359332
18703F7589884K6764429K1854644Q096037n226678j0161262p028160m319917p244899
18695I0324078j2086727j3900540j0592777m225777K101732N867444M503376p70865
18687F1219944o617185r819675r466310p087224n030133l537336k240046j355380
18679A6066655o99079k00212j34379j20752o7482j29654r0805P424K6409O3348
18669A4721473L24642R98153J885836L138011N007328Q093449J2531724J5955481
18661F2656097J4060061O441775k943817r134829r403933n270897M08184O815469
18653F3628110J5384573K7898292M3322543N4836023N7743034N0658296L2611383
$$ plain form
18711 19066222 22153889 23731356 24126843 24671589 27152657 33508925 46230552 67589884
18703 67589884 94354313 116208957 124304994 119078316 108917054 101888894 97568977 90324078
18695 90324078 78237351 64336811 53744034 49518257 51619989 57487433 61990809 61219944
18687 61219944 54602759 44783084 35316774 28229550 23199417 19662081 17422035 16066655
18679 16066655 15367576 15167364 15032985 14912233 14844751 14715097 14624292 14631716 14658125 14721473
18669 14721473 15046115 16044268 17930104 21068115 26075443 34168892 46700616 62656097
18661 62656097 76716158 83157933 80214116 71079287 61675354 56404457 56812641 63628110
18653 63628110 79012683 106910975 150233518 205069541 262812575 313470871 346082254
18646C46082254M817671k6582835n0756874n8642471m9893736l2073877j5335910
18639A17614222o649197o637862j0775388j4449973j4345753j1310736q425681
18632D5019632o487266n163869m099638l299159k573092k150416j783918j410104
18624A8052170j095743q98164p60035p38018q26950q85432j096711r57953o38457
18615A0154707m61891l73076k46958j96963j91622j12840J16870K59819M17422
18606I365468O25951P65258N57986K67924J45171k5201P7851L80557Q91972J273216
18596A4326153J500457J815482K302601L030329M422164P407471J1637313J4071885
18588F0513855J3226987Q956397O073273R287411K1221268M0095112N5790908
$$ plain form
18646 346082254 350899925 324317090 273560216 214917745 165024009 132950132 117614222
18639 117614222 110965025 104327163 93551775 79101802 64756049 53445313 45019632
18632 45019632 38532366 33368497 29268859 25969700 23396608 21246192 19462274 18052170
18624 18052170 16956427 16058263 15298228 14560210 13733260 12847828 11751117 10793164 10154707
18615 10154707 9692816 9319740 9072782 8875819 8684197 8571357 8688227 8948046 9365468
18606 9365468 9991419 10756677 11314663 11582587 11727758 11702557 11780408 12160965 13052937 14326153
18596 14326153 15826610 17642092 19944693 22975022 27397186 34804657 46441970 60513855
18588 60513855 73740842 82697239 88770512 98057923 119279191 159374303 215165211
18581B15165211O0700967M6764769K2824175p234893l1064017m7155428n3128036
18574B06872748m8498250l8098704k4887714j4272300o494553Q7973O013079R035467
18566H9757746O804808l65430r047083j4294428j4884211j1854185q578488o036985
18558C1501744m176720k786325j879138j359735j279388j218515j181107j107822
18550A6512994q17658m65774l42839k00668k8716L13538R02796J885543L261600
18541B1020816M993296P527532R248269Q399272M529459j187661m450305m405649
18533D5675029k87116O408524J2005082J3476412J0661186O665228P874481J1392349
18525A13871175J0910985K557095j1726626k1591672k3616114j8341345j1172719
$$ plain form
18581 215165211 275866178 322630947 345455122 338220229 307156212 260000784 206872748
18574 206872748 158374498 120275794 95388080 81115780 74621227 74709200 80722279 89757746
18566 89757746 96562554 96197124 87150041 72855613 57971402 46117217 37538729 31501744
18558 31501744 27325024 24538699 22659561 21299826 20020438 18801923 17620816 16512994
18550 16512994 15695336 15229562 14886723 14686055 14657339 14970877 15873673 17759216 21020816
18541 21020816 26014112 33541644 42789913 51189185 55718644 54530983 50080678 45675029
18533 45675029 45387913 51796437 63801519 77277931 87939117 94604345 102478826 113871175
18525 113871175 124782160 127339255 115612629 94020957 70404843 52063498 40890779
18518D0890779n752321k421710q58675j074067k363265l529072l975455l572593
18510A7343621k662196k177188j603335j232236r98675q68388o12617m83602m26708
18501F278676m03550l41623m34710n44686n92687m67404l96249k62699j90290
18492B644778j52437p6782o1209m92P8463M592j30621j06828l121q850r5937m7532
18480B044024q5303r4297j02112N7885K9824j3597m7917j41420j11843j03433
18470A431811J31312L8490O704M5649N6533l0137j43354j59946L151M2185P9860
18459A502258O0678j21427j23232m9116K2761j8719j91573j64983q179k2655o4917
18448H20896l7369Q10K1208L3933J1396K9271J16324O2972P3114J22796K26392
$$ plain form
18518 40890779 35138458 32716748 31858073 30784006 28420741 24891669 20916214 17343621
18510 17343621 14681425 12504237 10900902 9668666 8669991 7801603 7188986 6705384 6278676
18501 6278676 5875126 5533503 5098793 4554107 3961420 3494016 3097767 2835068 2644778
18492 2644778 2492341 2415559 2354350 2353858 2432321 2436913 2306292 2199464 2196343 2187493 2091556 2044024
18480 2044024 1958721 1864424 1762312 1820197 1850021 1836424 1788507 1647087 1535244 1431811
18470 1431811 1563123 1601613 1608317 1653966 1710499 1680362 1537008 1377062 1380213 1422398 1502258
18459 1502258 1562936 1441509 1318277 1269161 1291922 1273203 1081630 916647 908468 885813 820896
18448 820896 783527 784337 805545 839478 850874 880145 996469 1059441 1132555 1255351 1481743
18437A481743L38422L67775J34898J2083k40034l00846k44899k73368k14828j48584
18427I12362j86449k71244k46436l1659L7840J23440j0289J5706J98961J30372
18417F72604n9874j0189M2630K3365K570K3961j0118k3406J5851r34Q3886k00
18405G60146j4530K4953O8447J4239L6250o6014j8252K4682n2495m1546L9946
18394G75826K7074n8531N9746j8219n0739j422l3578n1185K0741J5678k7190o189
18382F52012k3441q648j1185M4546J32713P6178L5689n8833k1118L0806K1470
18371H70189R929Q6021J14042J84529L01272L66745L77430K76604K9026j64988
18361B450799k77693k48815j67145r4920J77822J76869J19742J34264K0679J37001
$$ plain form
18437 1481743 1820165 2187940 2322838 2334921 2094887 1794041 1549142 1275774 1060946 912362
18427 912362 725913 454669 208233 176574 214414 337854 327565 343271 542232 672604
18417 672604 612730 602541 645171 668536 671106 695067 684949 661543 677394 676460 760346 760146
18405 760146 745616 770569 839016 853255 889505 823491 805239 829921 777426 735880 775826
18394 775826 802900 744369 804115 785896 735157 733735 700157 648972 669713 685391 658201 652012
18382 652012 628571 619923 608738 653284 785997 862175 897864 839031 817913 848719 870189
18371 870189 880118 966139 1080181 1264710 1565982 1932727 2310157 2586761 2615787 2450799
18361 2450799 2173106 1924291 1757146 1662226 1840048 2016917 2136659 2270923 2291602 2428603
18351B428603K25685J76945K03398K75938K54875L70877L07569J05845M3776m4975
18341D348536j7209K9726p9326j89910j12854j5547J05180K44862K47585L00152
18331D861195M17997N46170N97795O58508O57023P97997J016728J259012J455476
18322A2267901J993407K734038L610231N028817P415380J1281689J7989770K9184954
18314I1506187M5137265N9546897O2781835M8490903J7839844j8939847m7140309
18307B59222775n8516748n4034437m0702055k7029695j7297628j1093504p412357
18300D3136351n288987m127218l776289l487179l296711l047683k677302k301568
18292A5133414j830618j528816j215386j033143q31877o83478p02465o26323l56602
$$ plain form
18351 2428603 2654288 2831233 3034631 3310569 3565444 3936321 4243890 4349735 4393511 4348536
18341 4348536 4331327 4361053 4281727 4091817 3978963 3963416 4068596 4313458 4561043 4861195
18331 4861195 5279192 5825362 6423157 7081665 7738688 8536685 9553413 10812425 12267901
18322 12267901 14261308 16995346 20605577 25634394 33049774 44331463 62321233 91506187
18314 91506187 136643452 196190349 258972184 307463087 325302931 306363084 259222775
18307 259222775 200706027 146671590 105969535 78939840 61642212 50548708 43136351
18300 43136351 37847364 33720146 29943857 26456678 23159967 20112284 17434982 15133414
18292 15133414 13302796 11773980 10558594 9525451 8693574 8010096 7307631 6681308 6324706
18283F324706k62019k61507j54339k5420K7846K6659N6925J91607J08400N5648
18273F088506j5929j71870j07115k09374m18808n64617m80516m32619l97538m31050
18263B859070k50372K5975l7243n8448J51203J20267J38781J65481K01110J8448
18253C334272k08647k30229k78714l90531l09428k64818j38027k10656p0663M8877
18243A281436r2744j02979n5747r2263M9226J6653n261K867M9649Q4048k5012
18232A109873M932r8242p9475j40225p0033Q0516M0097P664R641k1566n5933j7790
18220G69459p8251p7531k842m1306O6730K9523J4352K2587o0693j10080l5278
18209D96670j3357J10892M9294m174p6727K3845p802O72l6946j5330k3289m9699
$$ plain form
18283 6324706 6062687 5801180 5646841 5621421 5649267 5675926 5732851 5924458 6032858 6088506
18273 6088506 6072577 5900707 5793592 5584218 5165410 4600793 4120277 3687658 3290120 2859070
18263 2859070 2608698 2634673 2597430 2538982 2690185 2810452 2949233 3114714 3315824 3334272
18253 3334272 3125625 2895396 2616682 2226151 1916723 1651905 1513878 1303222 1232559 1281436
18243 1281436 1188692 1085713 1029966 937703 986929 1003582 998321 1001188 1050837 1134885 1109873
18232 1109873 1114805 1016563 937088 796863 726830 807346 847443 855107 864748 843182 787249 769459
18220 769459 691208 613677 610835 569529 636259 665782 680134 702721 642028 531948 496670
18209 496670 483313 594205 643499 639325 562598 586443 578641 579313 542367 527037 503748 454049
18197D54049P5671L4577L467K5607M3222k0071J2052o985O2671J89711K03583
18186A077554J55240L8829r6064k02864j27366k7624j1833M1325R0123J18968
18176A056288J96439J39528M9033m9167j85285k29106j38113j18990j15155o1637
18166E43835o3430L0953M7972L391m7883j34906j32896q7638p8311j43231j19876
18155a82020l4344L0504Q2292J73361K44480J56839L9921k371N3081N2007P18
18144F14468K3319n5607J0387L7283N7145P5739K1439L89O7814J03517J41865
18133A097758j1317m489J2185P4707L13294K12744J34825J41808O1375M9494R9257
18122B181641J3557J17296K95793L11355L79074M26096M04036M91418P51764J166527
$$ plain form
18197 454049 529720 564297 567764 593371 636593 616522 628574 621589 684260 873971 1077554
18186 1077554 1232794 1271623 1175559 972695 845329 817705 805872 847197 937320 1056288
18176 1056288 1252727 1392255 1441288 1392121 1206836 977730 839617 720627 605472 543835
18166 543835 480405 511358 559330 562721 514838 379932 247036 159398 81087 -62144 -182020
18155 -182020 -216364 -185860 -103568 69793 314273 471112 511033 508662 561743 613750 614468
18144 614468 637787 582180 592567 629850 686995 762734 784173 784562 852376 955893 1097758
18133 1097758 1086441 1081952 1094137 1168844 1482138 1694882 1829707 1971515 2032890 2082384 2181641
18122 2181641 2195198 2312494 2608287 2919642 3298716 3724812 4128848 4620266 5372030 6538557
18112F538557J886495K872393M469130P666293J4639007K9947346M4352349K2127982
18104A34499552j274109k8960391l7436883k4023915j3513889p838507m613258
18097A6838600k895132j829926j184415p84513p89214j091739j133408q94418
18089F235835r17263q39965n84927l70277m23110k80644j33749k18787k72487
18080B194626k11602j24550p1967j71415j14276p1610K973j2583j6224M3029N7505
18069A503906O9228N6566m0067q6653k8959r299J5781K8386q3482M8133J09662
18058A583202P0132N2070j32973k13465k40984k18847j08993p1669j0274n9697
18048F48502p6316n6860p0165j18165n2262L1198J16750R1230k8520j04842n3718
$$ plain form
18112 6538557 8425052 11297445 15766575 23432868 38071875 68019221 112371570 134499552
18104 134499552 133225443 104265052 66828169 42804254 29290365 21451858 16838600
18097 16838600 13943468 12113542 10929127 10144614 9355400 8263661 7130253 6235835
18089 6235835 5318572 4478607 3893680 3523403 3100293 2819649 2685900 2467113 2194626
18080 2194626 1983024 1858474 1786507 1615092 1500816 1429206 1432179 1419596 1403372 1446401 1503906
18069 1503906 1573134 1629700 1589633 1502980 1474021 1464722 1480503 1508889 1425407 1473540 1583202
18058 1583202 1653334 1705404 1572431 1358966 1117982 899135 790142 718473 708199 648502
18048 648502 572186 515326 445161 326996 274734 305932 422682 513912 485392 380550 326832
18037C26832m2913l579m5018O1257Q0276L0008p7862l2399k2263j7690r194j5624
18025B31831m2996J4955J05867R0828Q5199R1308J13870J70220L4224o9730m9768
18014G75808l6329k0775p3734L869N5693p6587j03076q1578n165J16734K08491
18003G63351J78346M0338K4903o7407k35693j91688j29156o6897L155k9417l2261
17992B57574N4491l6159j07469J5424P1809j2306l0856q0152q4714n2765o4683
17981f9806N2913K0337J9981P247M0525Q4777l6539M4691N5191o9670l0035j9872
17969I9740o8220j39873q69n570K4242Q486P5662L8175l169J5084O8092J3108
17957A24888j2934n1789r025J9677m5758n4889j50366j08311O1881J23900Q0638
$$ plain form
18037 326832 283919 280340 235322 296579 376855 406863 329001 296602 274339 256649 247455 231831
18025 231831 188835 203790 309657 400485 485684 576992 690862 861082 895306 825576 775808
18014 775808 739479 718704 644970 648839 704532 627945 524869 443291 438126 554860 763351
18003 763351 941697 982035 1006938 939531 703838 512150 382994 316097 319252 289835 257574
17992 257574 312065 275906 168437 183861 255670 243364 212508 132356 47642 -5123 -69806
17981 -69806 -16893 3444 23425 30672 71197 155974 119435 164126 219317 149647 119612 99740
17969 99740 31520 -108353 -109222 -114792 -90550 -82064 -6402 31773 28604 43688 111780 124888
17957 124888 111954 60165 51140 70817 25059 -29830 -180196 -288507 -226626 -102726 -22088
17946b2088N0730J50764L479q0887L1221j8719j24568j7158M4484N5280Q3163
17935A55701J2871q168l547j9580M8363q7373n1134L5916M7658m6819j32076J697
17923d6491J0705O3848l4576R789Q3582R0281l6643k4793k4713l940J5310K1970
17911A24329j2585j5382o0609m2787J9287Q367q8228J1332L8246L8777P2276N167
17899I8190Q119q1988n1997Q6775j8079l2661l013M4856O189n4705L3284P6572
17887A11542J6987l6316j19269k4826L7272J13520R4629q9466j04334j2659o472
17876a9392m9448K7142K1599L2645m8845L5178L7948j6065m5440R906N2775j853
17864C6150L4372k6403j28974o9077K3704J29135Q2254L5052l1752L5918N7340
$$ plain form
17946 -22088 28642 179406 182885 101998 133219 114500 -10068 -27226 17258 72538 155701
17935 155701 168572 160404 156857 137277 185640 98267 47133 83049 130707 83888 -48188 -46491
17923 -46491 -35786 28062 -6514 3275 86857 177138 140495 115702 90989 87049 102359 124329
17911 124329 111744 96362 35753 -7034 12253 20620 -67608 -56276 -18030 20747 93023 98190
17899 98190 106309 24321 -27676 59099 41020 8359 5346 50202 56391 1686 34970 111542
17887 111542 128529 92213 -27056 -51882 -14610 98910 193539 104073 -261 -12920 -19392
17876 -19392 -68840 -41698 -20099 12546 -36299 -1121 36827 20762 -24678 -14772 38003 36150
17864 36150 70522 44119 -84855 -153932 -130228 -1093 81161 116213 84461 120379 177719
17853A77719J0040j5143q5704n3803Q30O5030N9321K5165R26l5497q8114m7455
17841A3315j4008L187J6334Q5314m9604o8652l6367o4443l4535J2035M2149K125
17829i3150K9855L2570L1487N0876J1867j0911O169r6132r0900L7746P1099M0186
17817B0762l1864Q0087M3149k8605l4381n4842j9139N6942K4315N6152M764j9098
17805I8242k5324L4O1980j9143j01401j5458J963m9617m2567o9360N0422J09322
17793i07l4775o7173M2854O8242K4868j9024N1210N8255J4073n9438k6823J5822
17781F7184n4560q9589J8008K2223j5094l098N9623j598R033k2054O9859k426
17769E7511j14556n7266K5035N5522J8490p078P9829o5837o2454M0418m8160K2466
$$ plain form
17853 177719 187759 172616 86912 33109 33939 98969 158290 183455 184381 148884 60770 13315
17841 13315 -693 2494 18828 104142 54538 -14114 -50481 -114924 -149459 -137424 -95275 -93150
17829 -93150 -63295 -30725 762 51638 63505 52594 58763 -37369 -128269 -90523 -19424 20762
17817 20762 -11102 68985 112134 83529 49148 -5694 -24833 32109 56424 112576 117340 98242
17805 98242 72918 72952 134932 115789 14388 -1070 893 -48724 -91291 -160651 -110229 -907
17793 -907 -35682 -102855 -60001 8241 33109 14085 65295 123550 137623 78185 51362 67184
17781 67184 12624 -76965 -58957 -36734 -51828 -54926 4697 3099 12132 -9922 59937 57511
17769 57511 -57045 -114311 -89276 -33754 -15264 -22342 57487 -8350 -70804 -30386 -78546 -56080
17757e6080N7581j2653O0773J9454m8932j1410R329m8853L8221j7424o5278P9976
17745D704J11267j7058l0059K135M9458Q2892m3575j46238J0593N0951j8218K6995
17733H3847j8378n8287j1859l7999j3634L4742L7326Q6529P1612o8312q8287J8587
17721C5887P3800J5767l5408n5461k3984r3545K0244m287n8045M6196R0026O1473
17709G2663j4573k3911L4957j01646l6292r79L3254j8249N3793P6181K9605P5073
17697A79876J72417J80726K93164L15512K69311L18240P0603k10583k96883k78105
17687A014278j87694j83438k44341j11087J001n1277P743L1321K1755l2849L3176
17676B98588L1791m2920j14717j13841l8771N5439q565m8849m4901R2246N6359
$$ plain form
17757 -56080 1501 -11152 49621 69075 20143 8733 18062 -30791 7430 -9994 -75272 4704
17745 4704 115971 98913 68854 70989 120447 203339 159764 13526 24119 75070 56852 83847
17733 83847 65469 7182 -4677 -42676 -56310 -21568 15758 102287 173899 105587 17300 35887
17721 35887 109687 125454 90046 34585 10601 -82944 -62700 -66987 -125032 -78836 11190 72663
17709 72663 58090 34179 69136 -32510 -68802 -69781 -36527 -54776 -983 75198 104803 179876
17697 179876 352293 533019 826183 1141695 1411006 1729246 1799849 1589266 1292383 1014278
17687 1014278 826584 643146 398805 287718 288719 237442 245185 276506 298261 265412 298588
17676 298588 330379 287459 172742 58901 20130 75569 67004 18155 -26746 65500 121859
17665A21859j36851k3972J5672P3829L4764J0765K2055n6207p5864M265J9282
17654I597q5172l3868N3087J0799L2907L625O30k9104M8629q4657j7089P7382
17642a3234P1971L446q4644o030N5494j5575m376q3164K8297j4184l5557O5666
17630c1890L5235j7464n6417n0368K3488J3205R759N9779l068r468P290N70K6389
17617G040P2226k2667j7276l9237J0485N5109p2196j5014K7578m3082o4296q3590
17605a84920M2154O1124L0095L2349K2233J155k7876R7484R4011o8977o0777j4962
17593B3093r0804l9772K8576J1333n467j659N2124O1943l436n1733m2640O5063
17581F621N8858L9707j1644o7227m6726n8452k0674M2422P4062N966m1844p7002
$$ plain form
17665 121859 -14992 -38964 -23292 50537 85301 96066 118121 61914 -13950 -9685 9597
17654 9597 -75575 -109443 -56356 -45557 -12650 -9025 -8395 -37499 11130 -73527 -90616 -13234
17642 -13234 58737 62183 -22461 -28491 27003 11428 7052 -76112 -47815 -61999 -97556 -31890
17630 -31890 3345 -14119 -70536 -120904 -97416 -84211 -74452 -14673 -17741 -27209 -19919 -19349 7040
17617 7040 79266 56599 39323 86 10571 65680 -6516 -21530 6048 -37034 -101330 -184920
17605 -184920 -142766 -81642 -51547 -19198 3035 4190 -23686 73798 167809 98832 38055 23093
17593 23093 -67711 -107483 -78907 -67574 -73041 -74700 -22576 39367 35931 -15802 -58442 6621
17581 6621 65479 105186 93542 26315 -20411 -78863 -99537 -57115 16947 22913 -18931 -95933
17569i5933l7487K6259p884r652M632r34M0165k1142K1144L8638m5166J4169R6812
17556B3621O0714L7468j0443n3893j40508j2272L2005R5859l5944l2090m658J0372
17544b9769L516M7593K6558m3587l1279m4565n5500N2615l4731L3529J34977M7197
17532A06554m8392p7222J0934K6814Q1297p566j16996l0804J4794N1488O026J6743
17520C3670K4076Q07r4292l342M0215p686l4438N5885K1459L689Q5178k3463p0937
17507C0821n1281K9846p946m3605l297n4976j9867N0605J9605Q2564k5365n1979
17495d4875O1371k7792l1550Q733Q5894K0668j3946l9366m4852R762K0016K9580
17483C3643Q960p8897k0640p2014M5043Q9049j5848P2327L5250m8589p6566J1198
$$ plain form
17569 -95933 -133420 -107161 -115045 -124697 -120065 -120999 -80834 -101976 -80832 -42194 -87360 -73191 23621
17556 23621 84335 121803 111360 57467 -83041 -95313 -63308 32551 -3393 -35483 -40141 -29769
17544 -29769 -26253 21340 47898 4311 -26968 -71533 -127033 -74418 -109149 -75620 59357 106554
17532 106554 58162 -19060 -8126 18688 99985 92419 -24577 -55381 -40587 10901 16927 33670
17520 33670 57746 58553 -35739 -39081 1134 -6552 -40990 14895 36354 40043 125221 101758 30821
17507 30821 -20460 9386 1440 -42165 -45462 -100438 -120305 -69700 -50095 32469 7104 -44875
17495 -44875 16496 -11296 -42846 -34113 51781 72449 58503 19137 -25715 -15953 4063 33643
17483 33643 42603 -36294 -56934 -128948 -83905 5144 -10704 61623 96873 48284 -28282 -17084
17471a7084R7441J4309J0213o7517p3943K0570J6253R5117p3146j12772k6780
17460a17339J32267J02015L2993p0711j8484n9148j762j2009M8743O9829L5501
17449A41895q0674K675p7928k1033j4811k6113K9694K7163J59882L40155K02002
17438F82907n0438j75448j80408j00320k7058j49284j5484J19732j00641M2232
17428D5790O0889n655j13638k0140P3596m1451M073L1377J0863j12307l2843N9744
17416c9702P0398P7481O8515k8615l6143n7719K348O2415l709p0965j8670r7851
17404g2217m5625J16763R5651k6160n6001l349j5843J3563N8301O8352k9373r2957
17392A1105o5238j8934k7103J9678K6479J0561r46P1595K984m1135K5735l8450
$$ plain form
17471 -17084 80357 94666 104879 37362 -36581 -16011 242 95359 22213 -90559 -117339
17460 -117339 14928 116943 149936 79225 60741 1593 -169 -12178 36565 106394 141895
17449 141895 61221 63896 -14032 -35065 -49876 -75989 -46295 -19132 140750 480905 682907
17438 682907 632469 457021 276613 176293 149235 -49 -15533 104199 3558 45790
17428 45790 106679 101024 -12614 -32754 40842 -609 3464 34841 45704 -66603 -99446 -39702
17416 -39702 30696 108177 176692 148077 111934 54215 56563 118978 115269 44304 25634 -72217
17404 -72217 -117842 -1079 94572 68412 12411 9062 -6781 6782 65083 133435 104062 11105
17392 11105 -54133 -73067 -100170 -80492 -54013 -43452 -44398 27197 30181 -10954 14781 -23669
17380b3669J2662J4918k0341M039J6539n9514N5534m5582m0549j7021o6875L3571
17368a36288L6733l6127M1971K5066j8138j0022N9631K2937J12954j0666o0531
17357B7520L0617m9788j220P9720P0865P7980j3663j13527o7273J5726R64L3916
17345I1837n0568q5410J2496N0922K6885J2025m6790l4587j7736n5832j335Q2639
17333a5454P3710l6117o2097k5011J8879Q4425n8774K3738M0607K3942k8069J773
17321D1552J972n2515Q240K2852m4898j07288M7371J6713J1648Q2909M9338Q3803
17309A61697o9329j60501m0296N466J28396O7563n9353j18383K7545L4501n2401
17298g5095o6822j3157j8066j2239j0299K4457K9775O8207P4362j0769O929K299
$$ plain form
17380 -23669 -11007 3911 -16430 -12391 4148 -55366 168 -45414 -85963 -102984 -169859 -136288
17368 -136288 -99555 -135682 -93711 -68645 -86783 -96805 -37174 -14237 98717 88051 27520
17357 27520 58137 8349 7129 86849 157714 235694 222031 108504 41231 56957 57921 91837
17345 91837 41269 -44141 -31645 19277 46162 58187 11397 -23190 -40926 -96758 -98093 -15454
17333 -15454 58256 22139 -39958 -64969 -46090 38335 -20439 3299 43906 67848 39779 41552
17321 41552 43524 -8991 -751 22101 -22797 -130085 -82714 -66001 -54353 28556 77894 161697
17309 161697 92368 -68133 -108429 -102963 25433 92996 33643 -84740 -57195 -22694 -75095
17298 -75095 -141917 -155074 -173140 -185379 -195678 -171221 -141446 -73239 1123 -9646 -2717 -418
17286d18m124q2072n6062J8276k9367j0729N1363k095q4053Q5802M7698M9300
17274a6481J05752k186M9876L253k5760p3059o1185M3395j8123m9953k7267n244
17262g6982L3320n7112j2676o3024O5191N7481l0644J9165M6173K1258J0911l2860
17250a9799n7946J1248M9555O2341L9696j01700l5763J11174O2128k8004k3182
17239F9748o3920J11952O976j1437j550l4235L0189j6334m8457N403P3292K2248
17227A43875r7906l2639K3596J2851p8210M7041Q0353r1217P633M8443O639k4067
17215D6392k5315o282J9360k2359j3431J8234L021K2404P8933j5792p0991j3977
17203B0197m1038M581j7029j0332n5956o1910M2030Q4277P7605O4903Q6111r400
$$ plain form
17286 -418 -4542 -86614 -142676 -124400 -153767 -164496 -113133 -115228 -199281 -113479 -65781 -16481
17274 -16481 89271 87085 136961 140214 114454 41395 -19790 23605 5482 -44471 -71738 -76982
17262 -76982 -43662 -100774 -113450 -176474 -111283 -53802 -84446 -65281 -19108 2150 13061 -19799
17250 -19799 -77745 -66497 -16942 45399 85095 -16605 -52368 58806 120934 92930 69748
17239 69748 5828 117780 124756 113319 111769 77534 107723 91389 42932 48335 121627 143875
17227 143875 45969 13330 36926 49777 -28433 18608 98961 7744 15377 63820 70459 46392
17215 46392 21077 14795 34155 11796 -1635 16599 19620 42024 120957 105165 34174 20197
17203 20197 -20841 -16260 -33289 -43621 -99577 -161487 -119457 -35180 42425 107328 193439 184039
17191A84039o4570j5727P605l9413p6975k0046P0361k4726p4745l6028n2350n878
17179a48453O5910M9433p3909j2158L5214Q175L0888N2946N0273j4391l2032l5820
17167b3924j522m4698L8661K4814J456m2949M0413k1088n525L6060P1383j3060
17155F0021m9003O981k8718P1994L0519M1987M1272K3896j2778j26597L6287l3166
17143F2695o1527k9148K514m725K1291p5415j6618k3827l1905O151L1636j1730
17131a30608j3021q5431k080O4255O4762J41660P2078n3108p2106j4940o072K4811
17119i800m6N3874K8844j14695l0843Q969N0794n8650j3648p1083L2949k4492
17107a47827N5659N16j0747q492N8968O9875J8747M1675Q414O11n0742l9559n221
$$ plain form
17191 184039 119469 103742 111347 71934 -5041 -25087 45274 20548 -54197 -90225 -142575 -148453
17179 -148453 -82543 -33110 -107019 -119177 -83963 -75788 -44900 8046 58319 43928 11896 -23924
17167 -23924 -25446 -70144 -31483 -6669 -5213 -48162 -7749 -28837 -34362 1698 73081 60021
17155 60021 11018 17999 -10719 61275 91794 133781 175053 198949 186171 59574 95861 62695
17143 62695 1168 -27980 -25466 -30191 -8900 -84315 -100933 -124760 -156665 -150514 -118878 -130608
17131 -130608 -143629 -229060 -231140 -166885 -102123 39537 111615 58507 -13599 -28539 -34611 -9800
17119 -9800 -9846 44028 72872 -41823 -72666 -63697 -12903 -71553 -85201 -156284 -123335 -147827
17107 -147827 -92168 -91652 -102399 -110891 -51923 17952 36699 78374 86788 87399 36657 -2902 -8123
17094h123j6694K2870J5372k6814j3132j17840q970J35842n425j11591j6243j962
17082a52710P9632R1617l1433m7331m0054L9570J0256J2893n674k2468M4593L5110
17070A4001K5001K4008j8602j9429L3517m0854M8606L2334q9432k8905J3068n4449
17058f1136K117m5129N6651L463k4511k4416j7980Q9233N1641l6421M4336M2154
17046H0002p2045m7058M9585R7078L3501q0680L5353M3777r3679j20413j8130
17035i2709L0473K6816j8357q4116J4283R4436R268p923L5231q6061k9266j255
17023a09180K6608N311N4277J5538j2457L6954L1236R566p6517K2399R9426N5536
17011A58697o0729l7182j2493J6124m0778n6078j864o1266k3347O9450L1877n6746
$$ plain form
17094 -8123 -24817 -1947 13425 -13389 -26521 -144361 -153331 -17489 -22914 -134505 -150748 -152710
17082 -152710 -73078 18539 -12894 -60225 -100279 -60709 -50453 -37560 -43234 -65702 -21109 14001
17070 14001 39002 63010 44408 24979 58496 17642 66248 98582 9150 -19755 -6687 -61136
17058 -61136 -59019 -104148 -47497 -44034 -68545 -92961 -110941 -21708 29933 -6488 37848 80002
17046 80002 7957 -39101 10484 107562 141063 60383 95736 139513 45834 -74579 -92709
17035 -92709 -62236 -35420 -53777 -137893 -123610 -29174 -19906 -27829 7402 -78659 -107925 -109180
17023 -109180 -82572 -77261 -22984 -7446 -19903 17051 48287 57853 -18664 3735 103161 158697
17011 158697 97968 60786 48293 64417 23639 -32439 -34303 -95569 -118916 -49466 -17589 -74335
16999g4335O9899N0215o3865m4524K1425p699l4408O4945N2268o9458n1960K1121
16987f6376M1234J022q521P9512k3688o7391o5165O3203O2970m3367k5304J8600
16975c3271L0356Q8725n7665j9631K3607k7863o6509K5067o382q9996k4778K744
16963a55596O6882K2406M3712L2985K6728j6266J3102l2144O7365K6859n3848
16952D2185j24800j10403O6927O9603j4592O7370L3010q0214j5949R0478N5880
16941G9495o1916j02983J1266R6302Q8879L4949P120j2669J472q2356q7615l0754
16929e8810j9593L460r27M2559l3020k7039L005o017R9778M6728o0171q2797J3188
16916g9656Q6248K3974J8585N1479n118p9451o719n900n4029r5520K2589N1264
$$ plain form
16999 -74335 -4436 45779 -18086 -62610 -41185 -48884 -83292 -18347 33921 -35537 -87497 -66376
16987 -66376 -25142 -24120 -32641 46871 23183 -44208 -109373 -46170 16800 -26567 -51871 -33271
16975 -33271 -2915 85810 28145 8514 32121 4258 -62251 -37184 -43566 -133562 -158340 -155596
16963 -155596 -88714 -66308 -22596 10389 37117 20851 33953 1809 69174 96033 42185
16952 42185 -82615 -193018 -126091 -56488 -71080 -3710 29300 -50914 -66863 23615 79495
16941 79495 17579 -85404 -74138 22164 111043 145992 153112 140443 141915 59559 -28056 -58810
16929 -58810 -78403 -74943 -75870 -33311 -66331 -93370 -90365 -96382 3396 50124 -10047 -92844 -79656
16916 -79656 6592 30566 49151 100630 95512 16061 9342 3442 -50587 -146107 -123518 -72254
16904g2254m1817R7488J7612j2498K812m1539o878O6328n37n0018K5048L4823
16892A8570n5237Q629M807l4288n6249J3511k3772j402J02995M1293o1598J4684
16880b8057R489l6016n3216n1425M9926R7926k518m4838j191M5595j199K6580
16868A1056O150p1243k8070O485N4313N3606l3126k8944K0579P2706j7969k4001
16856B1542L3716K1673L3323O637L9394J04173J1265j10470m0596L201m2308j6979
16844F4571l7565L9235j3356n4080N6936o991j23453M0251M2532k7584J9974L6415
16832C6885N502m4160K858j9888j4682j7729m1753k3768k1309R4516O1096l941
16820A3627n9859M6396J482j7311k5499K378m4954K9470L0132L097l9502j6118
$$ plain form
16904 -72254 -114071 -16583 1029 -11469 -8657 -50196 -57074 9254 8717 -41301 -16253 18570
16892 18570 -36667 -28038 -23231 -57519 -113768 -100257 -124029 -125431 -22436 18857 -42741 -28057
16880 -28057 -18568 -54584 -107800 -159225 -109299 -11373 -13891 -58729 -59920 -14325 -15524 11056
16868 11056 17206 -54037 -82107 -75622 -21309 32297 -829 -29773 -9194 63512 45543 21542
16856 21542 55258 76931 110254 116891 156285 260458 271723 161253 120657 123858 81550 64571
16844 64571 27006 66241 52885 -1195 55741 48750 -74703 -34452 8080 -19504 470 36885
16832 36885 42387 -1773 1085 -18803 -33485 -51214 -92967 -116735 -138044 -43528 17568 13627
16820 13627 -46232 164 1646 -15665 -41164 -38786 -83740 -54270 -24138 -21041 -60543 -76661
16808g6661M3500p742j5289K4299J5615J27035j5718n4615M570l6322o6568m5637
16796a03533o3003M1256R2330J08884l8387o9209L5420j7775L515N405j3345N4613
16784C6171m8004K2432j3154K0987l1350j9813N8216o920r868k0516j7930L8514
16772H765m8115l5867J08732L7861l8628p799k3294n3653L6059k895n6064p5245
16760a50143j8155M9136Q1750J07949Q6504m0501L4708L6660j3377j20652n8031
16749d152m9601K0063P9738Q0624k0747o5575n675N1515M5500p7181p7345n633
16737b8469K9584k1159L4445K9731L3430m9850l2324j0120k7914L4892m7458o2415
16725a17627k5494j2699o725p345K6354R7266R5902J8602j05533o3038M7173p4904
$$ plain form
16808 -76661 -33161 -40903 -56192 -31893 -16278 110757 95039 40424 44994 8672 -57896 -103533
16796 -103533 -166536 -125280 -32950 75934 37547 -31662 3758 -14017 -10502 -5097 -18442 36171
16784 36171 -11833 10599 -2555 18432 -12918 -32731 25485 18565 8697 -11819 -29749 8765
16772 8765 -39350 -75217 33515 71376 32748 24949 1655 -51998 -15939 -18834 -74898 -150143
16760 -150143 -168298 -119162 -37412 70537 157041 116540 151248 187908 174531 53879 -4152
16749 -4152 -53753 -33690 46048 126672 105925 40350 34675 86190 131690 54509 -22836 -28469
16737 -28469 1115 -20044 14401 44132 77562 27712 -4612 -14732 -42646 -7754 -55212 -117627
16725 -117627 -143121 -155820 -162545 -169890 -143536 -46270 49632 68234 -37299 -100337 -53164 -128068
16713a28068j6077L8696P1834M6615j9241L983J4286N4457j06083l2325J9243
16702e2680j9585R634Q5185M2268p9999k3330M8765M7495n8793n7204Q1799K6201
16690D9756j21178j16094N6847J37603L6797o1551j6508L3915J267M564J6620
16679B2038k7183l3230l3175k8461K4460R3550j9071R149o060l955L4473j497
16667C1038O3678l5879p0304K0048j8056m1620L5469K598j7304M6187p851P488
16655A5492K6483o897M5876L1713m0251m9155r9406L2054M7717k6549j529L3843
16643I391k9758q256Q634J3236J6505O8917m7714M6971O4948p8461m288J8536
16631G8661N991m0966L8420m8402r2495J9146R0677O9511k3588k4813R9398k7809
$$ plain form
16713 -128068 -144145 -105449 -33615 13000 -6241 -2258 12028 66485 -39598 -71923 -52680
16702 -52680 -72265 -62631 22554 64822 -15177 -38507 10258 57753 -1040 -58244 23555 49756
16690 49756 -71422 -187516 -130669 6934 43731 -17820 -34328 -413 854 5418 22038
16679 22038 -5145 -38375 -71550 -100011 -75551 17999 -1072 8077 2017 -1938 32535 31038
16667 31038 94716 58837 -11467 8581 -9475 -51095 -15626 -13028 -30332 15855 8004 15492
16655 15492 41975 35078 80954 112667 72416 23261 -76145 -44091 3626 -22923 -24452 9391
16643 9391 -20367 -28623 -19989 -6753 9752 78669 30955 77926 142874 64413 60125 78661
16631 78661 84652 43686 82106 33704 -58791 -39645 51032 120543 96955 72142 171540 143731
16619A43731m8704n5728K6742j23271j1026L1742N2538j0766o0369L1572k83K4303
16607D81O7911o4586j0455P1785L9589j092l0874l5292j2711L9543k572R7476
16595A59203N4634k9900j18008k6537Q0706k9146o8892p3379R2362L1592J1108
16584H3743q0937m7904L2091L2435K589l342R3049n7239p9376n695m6184N2445
16572b4325J17M071N215q909k7022n8854R3653M6874k1718N8281j8243q8592p4160
16559a13612O0243K6791p625L6355l8720r5750J8146M2005J1083K7049L8339N353
16547I657o3865L2200J3599N9725n876j1303k3756k3892K5149n2626j6223J38968
16535H1757K3422j6131j495m9285M5478L4812l1966l6758J7160L8751K2952r9940
$$ plain form
16619 143731 95027 39299 66041 -57230 -68256 -36514 16024 5258 -55111 -23539 -23822 481
16607 481 68392 3806 -6649 65136 104725 103633 72759 37467 24756 64299 61727 159203
16595 159203 213837 183937 65929 39392 120098 90952 22060 -51319 41043 72635 83743
16584 83743 2806 -45098 -13007 19428 22017 18675 111724 54485 -24891 -30586 -76770 -24325
16572 -24325 -24208 -20137 -14922 -23831 -50853 -109707 -16054 30820 9102 67383 49140 -39452 -113612
16559 -113612 -53369 -26578 -34203 2152 -36568 -132318 -114172 -72167 -61084 -34035 4304 9657
16547 9657 -54208 -22008 -8409 51316 45440 34137 10381 -13511 11638 -40988 -57211 81757
16535 81757 105179 89048 87553 38268 83746 118558 86592 49834 66994 105745 128697 28757
16523B8757o0116J9873L7785J2315n3478o0536k862j734R612K3875J1886K1041
16511a3582K9430j6325N2097o4195l1793O7853j3595n1457j3534r6955k2235R463
16499a64828L2875N7663j7913K6269L3019q5734k6486N1161l6479j660K6156P8532
16487b7425P4542j00458m9770K7293N804j0323r195o8529r041J23826L0027N52
16475a2697j7204p2617K4124J07304O2717j0821l6810k5128J3731l5213j12578
16464a15192r028R7986R4556Q1608L2382q792j29660O707j533l8272l7400l070
16452b9708M4408J04933l9775k901k7996l3777q3499M1287O2006j8960J2302J17143
16440A45463l9176p8473j2367o938K4264o6794M8487m7990m2373K5657m8682O7321
$$ plain form
16523 28757 -31359 -11486 26299 38614 -14864 -75400 -78262 -79996 -70384 -46509 -34623 -13582
16511 -13582 15848 -477 51620 -12575 -44368 23485 9890 -41567 -55101 -152056 -174291 -164828
16499 -164828 -131953 -74290 -92203 -65934 -32915 -118649 -145135 -93974 -130453 -132113 -105957 -27425
16487 -27425 47117 -53341 -103111 -75818 -70014 -80337 -89532 -158061 -167102 -43276 -13249 -12697
16475 -12697 -29901 -102518 -78394 28910 91627 80806 43996 18868 32599 -2614 -115192
16464 -115192 -124220 -26234 68322 149930 182312 173520 43860 50567 49034 10762 -26638 -29708
16452 -29708 14700 119633 79858 76957 48961 15184 -68315 -27028 34978 16018 28320 145463
16440 145463 106287 27814 15447 8509 32773 -34021 14466 -33524 -75897 -50240 -98922 -31601
16428c1601L158J01570m5342l3749q0525j23135j6991J2697Q9294P0607m9193
16417a03210k8478O4154J45937N5147m2401m0894J7248r6558k9900J9512K3732
16406a5711L093r59L4400m1904l3123L6547p21j6807l4945j4109L6826N5929K1311
16393B9827Q116k9802m9346N8757J6880j8889N3594n049k7131m4969J2223m506
16381b95j2926J700p0571L3791K4757M7049K3030p2515j16J446L1198K8866O2598
16368I8012n1451L1910k7576k6067l6701k7113J1751o6907j2829P4392k6026j466
16356f0071M283O2440k0757L740J2626n7743m4185K5571K053M6419O2558J12775
16344A49709Q371L9095N554p6716N700P0584k428j14973p5543j5164J8696J311
$$ plain form
16428 -31601 -28443 73127 27785 -5964 -86489 -209624 -226615 -213918 -124624 -54017 -103210
16417 -103210 -131688 -67534 78403 133550 91149 50255 67503 -29055 -58955 -39443 -15711
16406 -15711 -12618 -13577 20823 -21081 -54204 -17657 -18378 -35185 -70130 -84239 -47413 8516 29827
16393 29827 37943 8141 -41205 17552 34432 15543 69137 64088 36957 -8012 4211 -295
16381 -295 -13221 -11521 -82092 -48301 -23544 23505 46535 -25980 -26096 -24650 6548 35414 98012
16368 98012 46561 78471 50895 24828 -11873 -38986 -27235 -94142 -106971 -32579 -58605 -60071
16356 -60071 -55788 6652 -14105 -10365 2261 -55482 -99667 -74096 -72043 -25624 36934 149709
16344 149709 158080 197175 202729 126013 131713 202297 199869 84896 9353 -5811 12885 14196
16332A4196m7228N4273O3785k1594l7243l6500l2756j12786j3868Q8900K8296
16321e2525R1774j6594P636N1412j8411K5302k5819o6166J0142l0579K4674M9768
16309E0614L6401O0032K2724j33394j14330M1320M847k5290n5021o1288j6670
16298a90055N5672P5506K4369n7920q844L8080k8848k5844O5078k086p568N7028
16286e432J5759k3322O6434k9264n9746q771J4258J8784R263K3494k2141P1123
16274G0439Q8153K1862o4119q4621J3617L7732l2517m6575l242J5689K0977k7404
16262I991R522m5034k1802L1178J0004K9492M9230O7912j7535q9724p9821m8458
16250i5045M0485O1793M5544q8771o3911l8122J9084p2626L4070N4633J5361J7207
$$ plain form
16332 14196 -33032 21241 85026 63432 26189 -10311 -43067 -155853 -169721 -80821 -52525
16321 -52525 39249 22655 30291 81703 63292 88594 62775 -3391 6751 -23828 846 50614
16309 50614 87015 147047 169771 36377 -77953 -36633 -31786 -57076 -112097 -173385 -190055
16298 -190055 -134383 -58877 -34508 -92428 -101272 -63192 -92040 -117884 -52806 -54892 -62460 -5432
16286 -5432 10327 -12995 53439 24175 -35571 -44342 -30084 -11300 -2037 21457 -684 70439
16274 70439 158592 180454 116335 31714 45331 83063 50546 3971 729 16418 37395 9991
16262 9991 19513 -25521 -47323 -16145 -6141 23351 72581 140493 122958 33234 -46587 -95045
16250 -95045 -54560 7233 52777 -35994 -99905 -138027 -118943 -191569 -157499 -102866 -87505 -70298
16238g0298m0110N4041Q320L2391M5772p401k3595L0101K4471k0779J798r5448
16226f0737o3763n7351l911R1870Q5529p911o9481M6988j8731p2174J1729Q1301
16214c6642P0511k9839r419N5814P8566J16740K486p1344J2820N3990p596L560
16202B39647K8226P813j15852m3292J7344N784o6677k6612K2601j3053q7883r4570
16190a26524J9623J02463p078L5147K8937J0986M7807N632K7878l6123n0283m0553
16178A7912N5585l0815r939k5272R356K1734k0804O501N0795k9297j8869M341
16166C1228n1444p0540N231k5192J8990P2957K3933L2142j9945K0237K0098M7282
16154A04977n1342o7829k1528K8851K1261r6661O2084L1239J6291L0612L9005
$$ plain form
16238 -70298 -110408 -56367 -48047 -15656 30116 22715 -880 29221 53692 32913 34711 -60737
16226 -60737 -124500 -181851 -185762 -93892 -8363 -16274 -85755 -38767 -57498 -129672 -117943 -36642
16214 -36642 33869 4030 -5389 50425 128991 245731 248217 176873 189693 243683 236087 239647
16202 239647 267873 275686 159834 116542 133886 139670 72993 46381 68982 55929 -31954 -126524
16190 -126524 -106901 -4438 -11516 23631 52568 63554 111361 116993 144871 108748 58465 17912
16178 17912 73497 42682 32743 7471 16827 38561 17757 24258 75053 45756 26887 31228
16166 31228 -20216 -90756 -85525 -110717 -91727 -18770 5163 37305 17360 37597 57695 104977
16154 104977 53635 -14194 -35722 -6871 14390 -82271 -20187 11052 27343 57955 96960
16143I6960N1789p8442l4214m7773r3104L8955N3648L36j3990N1841P3180k9625
16131F9561j1147L2301j3864k5932l3691J7751K1888J6482L2866m9883o5961j7207
16119b6836K4305L2731q286k3088N1743j1346j38428J2343N6536K5924j5301l4415
16107e4118J01481l5677M2297N8955M0967l7846o4697M3064m565r7199L3269O1511
16095H7442J9941o3083n4459N4202J3756l0376j0133j5636K2137m6574l9905P5905
16083A3217N9571o0041o8610k7518L0982L3772L1780K3151K287q7262l7158M339
16071h1490k3891O9962L4407N9160N3081m9342n8144k8377j040l7433M9584M4892
16059C1369L6684p2705j19944n5219Q4335J16836O6562j8277m5541q286k7764
$$ plain form
16143 96960 148749 70307 36093 -11680 -104784 -65829 -12181 -11845 -25835 26006 99186 69561
16131 69561 58414 90715 76851 50919 17228 34979 56867 73349 106215 56332 -9629 -26836
16119 -26836 -2531 30200 21914 -1174 50569 39223 -99205 -86862 -30326 -4402 -19703 -54118
16107 -54118 47363 11686 53983 112938 153905 116059 51362 94426 89861 -7338 25931 87442
16095 87442 107383 44300 -10159 44043 57799 27423 17290 1654 23791 -22783 -62688 13217
16083 13217 72788 12747 -55863 -83381 -52399 -18627 13153 36304 38591 -48671 -85829 -81490
16071 -81490 -105381 -35419 -1012 58148 111229 61887 3743 -24634 -25674 -63107 -13523 31369
16059 31369 68053 -4652 -124596 -179815 -95480 21356 87918 69641 24100 15814 -11950
16048a1950j3824O090J8886K7019Q0343J121q2238j13270L5569L1449R4850k8167
16036D5878j24249l4328J7008J6667Q0999l92o2087M1837m8000o5295J7608R0009
16024b4345L9977n4914M7314L4238J16153k1388r8637m785k2281n0564R3210K1180
16012G5158j2345J5946k1599P605j2717n1487r1071M6967o5352n0263L5469n1087
16000a74776N5649J16587J9726O064J0260p9787q057R65Q092P8473K6080j8891
15988D0385K1374j7958p776N2897k7772m1120j4631q410k3771L596l878m6218
15976g3282m4930O6227P2405L8050k9906q951P2344n8575J2630K4733O844K972
15964H0561k6985o4171J7822N6657P5939q787o3050L5164L6131J9836M3628k5868
$$ plain form
16048 -11950 -25774 -19684 -798 26221 106564 107685 25447 -87823 -52254 -20805 74045 45878
16036 45878 -78371 -112699 -95691 -79024 1975 1583 -60504 -18667 -66667 -131962 -114354 -24345
16024 -24345 15632 -39282 8032 42270 158423 137035 38398 33613 11332 -39232 53978 75158
16012 75158 62813 78759 57160 64765 52048 561 -90510 -43543 -108895 -159158 -123689 -174776
16000 -174776 -119127 -2540 17186 23250 33510 -46277 -54334 -53369 -45277 33196 59276 40385
15988 40385 61759 43801 36025 88922 61150 20030 5399 -3011 -26782 -23186 -27064 -73282
15976 -73282 -118212 -51985 20420 58470 28564 19613 91957 33382 46012 70745 77589 80561
15964 80561 53576 -10595 7227 63884 139823 131036 67986 103150 139281 159117 202745 176877
15952A76877j15668O660P370q5151l4370L5810O4724l5198q7603k3221o899j6130
15940a12799m786J22438M6791j51279m070N4453J5029O0468N1681K8683M5187
15929A51796L2171k5936p0610p7013p8667m4805L7620J9418O2151J02099M3584
15918A51808o3545j3453P4815k7090j7704l6972R2611j2188p0864p3184J4324
15907A8558K4175k4416j2282j2941K3705K6343l0779J9260k63m0893J0274L8472
15895C9213j3963J8481K9067L983J6628l6599k1912K6475J0015K747o2566k390
15883I179J3210P6012O06p6416J2874j1015M3768q1412m2427R7336L1409m4657
15871B8467n0377l5319J9168J1146L0389J05512J1391q6767o1270k6313n7656
$$ plain form
15952 176877 61209 67869 75239 -9912 -44282 -8472 56252 21054 -66549 -89770 -96669 -112799
15940 -112799 -117585 4853 51644 -99635 -103705 -49252 -34223 26245 77926 106609 151796
15929 151796 183967 158031 87421 10408 -68259 -113064 -75444 -56026 6125 108224 151808
15918 151808 88263 74810 149625 122535 104831 67859 160470 148282 77418 4234 18558
15907 18558 42733 18317 6035 -6906 16799 43142 12363 31623 31360 -9533 741 39213
15895 39213 25250 43731 72798 76781 93409 56810 34898 61373 71388 74135 11569 9179
15883 9179 22389 98401 99007 22591 35465 24450 68218 -13194 -55621 41715 73124 28467
15871 28467 -21910 -57229 -38061 -26915 3474 108986 120377 33610 -27660 -53973 -111629
15860a11629J28106j7162m6154n1571j2030K1907Q6565q5151l8105J12194O2024
15849D8994o0770m2952L6711R6301k6342N6637P7713R308N1141o1223J9689N3567
15837B58774o9280j0001l4593L3885K000k9974j04899K358J5864j25403j08884
15826a70153M1548J0073N1674o533P4193O0708L6513J237j3835R587M160Q345
15814A07517J2128j967q0870m730q465o1311J1279L7943K7952m6170M878M5486
15802D3670M1286j2670p7897n8891R007J4883j8682O3989L8600o104m1327n128
15790i264k0952P6948J9002N0434n5714q815K6706L8271j3774j01481m9366K1680
15778b6325l66j2588N6843J7287r1754l1982O4415r016M4441n8087L440m5035
$$ plain form
15860 -111629 16477 -685 -46839 -98410 -110440 -88533 -1968 -87119 -125224 -13030 48994
15849 48994 -11776 -54728 -18017 78284 51942 108579 186292 195600 246741 185518 205207 258774
15837 258774 189494 179493 144900 178785 180785 150811 45912 48270 64134 -61269 -170153
15826 -170153 -128605 -118532 -66858 -73391 802 61510 98023 99260 85425 95012 99172 107517
15814 107517 119645 117678 36808 32078 23613 -37698 -26419 11524 39476 -6694 -1816 43670
15802 43670 84956 72286 -5611 -64502 -55495 -40612 -59294 4695 43295 37191 -4136 -9264
15790 -9264 -30216 46732 65734 116168 60454 51639 78345 116616 102842 1361 -48005 -26325
15778 -26325 -26691 -39279 17564 34851 -56903 -88885 -24470 -33486 10955 -47132 -43692 -88727
15766h8727J9235O4123L3939o900n5021m9060Q0336Q5813N1315L931o0788q333
15754F9863j10039o1629r0421K7362M5616K4557N1834M763n331N3576o6384J9915
15742c6318L5706J812q4143L992k4302O5470R2703R5996j0310p270K5476j8337
15730A40475n4469P6573m3920k9611O1918L2665q2824j9246j6642j14844O5696
15719A5771J28383O717L3031n653l7777r711k4622n6824q7814k1087K5984L2618
15707i84j2181q17n7545p5214P611M7233l1884N8507m464O8368J9150m2489j1865
15694c6574L8585K0855m567j6678M0602P8704J13749j06168o6672l0916m1515
15683a0595N650m8205o960O8172m911m2848o01P2006M6500j4408r2345j00179
$$ plain form
15766 -88727 -69492 -5369 28570 21670 -33351 -82411 -2075 83738 135053 138984 78196 69863
15754 69863 -40176 -101805 -192226 -164864 -119248 -94691 -42857 -38094 -43425 10151 -56233 -36318
15742 -36318 -612 1200 -82943 -78951 -103253 -37783 54920 150916 140606 133336 158812 140475
15730 140475 86006 162579 118659 89048 150966 183631 100807 81561 64919 -49925 15771
15719 15771 144154 150871 183902 178249 140472 130761 106139 49315 -38499 -59586 -33602 -984
15707 -984 -13165 -13982 -71527 -146741 -139130 -91897 -123781 -65274 -69738 -1370 17780 -24709 -36574
15694 -36574 2011 22866 18299 1621 42223 120927 234676 128508 61836 30920 -10595
15683 -10595 -4945 -53150 -60110 8062 3151 -39697 -40298 31708 78208 63800 -28545 -128724
15671a28724K5805K9203l4100m1521J02010J05983j3518P3814M6269o7463L4492
15660A32250n1933r4468l8238M2541J5961N2244q6236l1364J3723Q464p30O5892
15648B8106M3566o7381q5971P9931J2513j7709l1914M915L5778M1225k0971K2722
15636D4810J5232r084n5784M1912j6415o5495M3134M3060L4952M438j7862k5893
15624C7005M6304N4224r9840l4786M8668P333j08725l7003J64606O4368J0455
15613A52609o7914k2242m8045J0740l9995k0105o9847m1755J03871K3091n7646
15602g7238j8291j5405N3418Q5958k4072L3865K534q5447p5027K1365N8448n3691
15590i3583J464L2118q5889O5951J636k7008R0265M8953l5346J2720L484q9122
$$ plain form
15671 -128724 -102919 -73716 -107816 -149337 -47327 58656 45138 118952 165221 97758 132250
15660 132250 80317 -14151 -52389 -9848 6113 58357 -27879 -59243 -45520 -37056 -37786 28106
15648 28106 71672 4291 -81680 -1749 10764 -6945 -38859 -33944 1834 43059 22088 44810
15636 44810 60042 50958 -4826 37086 20671 -44824 -1690 41370 76322 80760 62898 37005
15624 37005 83309 137533 37693 2907 51575 58908 -49817 -86820 77786 142154 152609
15613 152609 84695 62453 14408 25148 -14847 -34952 -104799 -146554 -42683 -19592 -77238
15602 -77238 -95529 -110934 -57516 28442 4370 38235 40769 -44678 -119705 -98340 -39892 -93583
15590 -93583 -92119 -60001 -145890 -79939 -78303 -105311 -15046 33907 -1439 11281 14765 -74357
15578g4357m8043j1624J34478o688j22696L4621Q4962m2311k5781n2125p7294
15567b06858L7197O1973J8387n3031L5823O9628J02063j0655j36851J4358O7921
15556d5j7760n7261l258N5348j1095K6650P7333L9996m0846p9154q5786N8327
15544c7551J8156j6892J5955J04604K6678o7956r8725m8211k6606Q2529J31927
15533H3908m4121k8064p9032q2875q3773M0404Q8788M8010K68p571P5925P3222
15521H5089j7709m3473o9915J0604p8667P5202P4538n1546m5481J25434O1095
15510A25171j46593M0459J291Q0495j8117r2863k8923K432O5692L9483p4097q105
15498a3675m99L4906N9243p0541m2510R3935J2570l7685m2152m6637k6977L9370
$$ plain form
15578 -74357 -122400 -134024 454 -6234 -128930 -94309 -9347 -51658 -77439 -129564 -206858
15567 -206858 -169661 -107688 -89301 -142332 -106509 -36881 65182 54527 -82324 -67966 -45
15556 -45 -17805 -75066 -78324 -22976 -34071 -7421 69912 109908 69062 -10092 -95878 -37551
15544 -37551 -19395 -36287 -20332 84272 110950 42994 -55731 -103942 -130548 -48019 83908
15533 83908 39787 11723 -67309 -150184 -233957 -193553 -104765 -56755 -56487 -64058 11867 85089
15521 85089 67380 23907 -46008 -35404 -114071 -38869 35669 -15877 -61358 64076 125171
15510 125171 -21422 19037 20328 100823 82706 -10157 -39080 -36648 29044 68527 -5570 -13675
15498 -13675 -14174 20732 79975 9434 -33076 60859 73429 35744 -6408 -53045 -80022 -40652
15486d0652M3361O6274J0510J8900m9883r4769J5211M5323q0605K8027N3877l2441
15474a6867k3542K4901j5937l2260Q0998J8181P7991l3809q6560l7910K7840J658
15462a5316N8497Q3216n6046k6966K4465M0478m6554j8254p9865l3197N7938L4979
15450B3375j611m5870O7888M4670n6182k0473p5265j3096M1047K9752l6225m4053
15438h6043M4310K9050K5933n5677n1055L1484J0280R3556L6518J0157J0778l6025
15426F3266p5735o8599l563k518p644Q0934m342L7694N9072k2966K5105l1324
15414D9380r717Q8804q856p4155J1936P249n3936j16266l7289k3573K0224J56607
15402A0408J12753k2826P0044L346j03010r6998m0969L0843O1310j0714K8898
$$ plain form
15486 -40652 2709 68983 79493 98393 48510 -46259 -31048 14275 -66330 -38303 15574 -16867
15474 -16867 -40409 -15508 -31445 -63705 17293 35474 113465 79656 -6904 -44814 -16974 -15316
15462 -15316 43181 126397 70351 43385 67850 108328 61774 43520 -36345 -69542 -11604 23375
15450 23375 21764 -24106 43782 88452 32270 11797 -63468 -76564 -35517 -5765 -41990 -86043
15438 -86043 -41733 -12683 13250 -42427 -93482 -61998 -51718 41838 78356 88513 99291 63266
15426 63266 -12469 -81068 -84631 -87149 -94793 -13859 -18201 19493 78565 55599 80704 49380
15414 49380 39663 128467 119611 45456 57392 64641 10705 -105561 -142850 -166423 -146199 10408
15402 10408 123161 100335 170379 173725 70715 -26283 -67252 -36409 24901 14187 43085
15391D3085l2325k8561j5011j0329k946l762N058R60J15895J28401K6961j22114
15379A05312o1382n2717L8459L0708M2361O0244j02529p5136k1314K1578l129
15368a7545K7132k2687k1001K5303l1805O645M965L533P627m4827m3640J4285
15356i2015k8721J7818L0933j6884N3439L7041M6630l0792K6550o7853r6745r206
15344a29805M5261L2365M2057N2948N6939l8072n8082k2139P1366j0954l0629
15333A1255j7179k4724n4654J3824K9864L5216q2079N5481j6236j37848j4248
15322b01328M7903l3809J32535O9173N678k0554q4403o2537m6643P8306M8913
15311f6766M3039k9832q6294l2091L8868O1489N1645N8617J11626N0466k348q8303
$$ plain form
15391 43085 10760 -17801 -32812 -43141 -46087 -49849 -44791 -43831 72064 200465 227426 105312
15379 105312 43930 -8787 29672 60380 102741 162985 60456 -14680 -35994 -14416 -17545
15368 -17545 9587 -13100 -34101 -8798 -40603 -33958 -28993 -25460 -17833 -62660 -106300 -92015
15356 -92015 -120736 -102918 -71985 -88869 -35430 1611 48241 17449 43999 -23854 -120599 -129805
15344 -129805 -84544 -52179 -10122 42826 99765 61693 3611 -18528 52838 41884 11255
15333 11255 -5924 -30648 -85302 -71478 -41614 -6398 -88477 -32996 -49232 -187080 -201328
15322 -201328 -153425 -187234 -54699 14474 20152 -402 -84805 -147342 -193985 -115679 -66766
15311 -66766 -23727 -53559 -139853 -171944 -133076 -71587 -19942 38675 150301 200767 198419 110116
15299A10116m502k1673n0961J8246O4246k6061l6860K7102O7599n6142n804k7615
15287E7691j6446L0535m7439J5894o4847J0507K3098J5428n6264O232j3411O9920
15275C0898Q8950K5453o4322q2362R819n9949m4348K4138J06143J41075Q042p2839
15263A10698j2567k4267o1997m9841Q7866p2273N1896N7276j0650J0199j4588
15252G1752J0102q1253J7486m1331M1171R4237M1422o6901j11446j9017N6669
15241A2891k7572l5476m107K7706N6989L2138m1165r4345N273L0702k7989k0135
15229h5090J3221Q8451Q6192j1071m2860l8904L2395l2506J06499M9812J0869
15218A77008K1284q8766o9485m739k0880n4777j4530O0965r567l7545J9750J3388
$$ plain form
15299 110116 105614 83941 32980 51226 115472 89411 52551 79653 147252 91110 85306 57691
15287 57691 41245 71780 24341 40235 -24612 -14105 8993 24421 -31843 -25611 -39022 30898
15275 30898 119848 145301 80979 -1383 8436 -51513 -95861 -71723 34420 175495 183537 110698
15263 110698 98131 73864 11867 -37974 49892 -22381 29515 86791 76141 86340 71752
15252 71752 81854 601 18087 -23244 17927 112164 153586 86685 -24761 -43778 12891
15241 12891 -14681 -50157 -54264 -26558 30431 62569 21404 -72941 -67668 -36966 -64955 -85090
15229 -85090 -71869 16582 102774 91703 48843 9939 42334 9828 116327 166139 177008
15218 177008 198292 109526 40041 35302 14422 -40355 -54885 6080 -3487 -41032 -21282 -7894
15206g894J0453j1013p7400J7518K9500j8457K9686M2312l0427p2074p635m7414
15194a42845L9864P0202J0010K8993P5293L5210r7759j50697M3142L6929J9454
15183c2204J7492o849l8728k0816o9586o1881j4976N5534M3882J0321O057K3173
15171h8581l6952L8003L3966M2982N1825J8059n4735L7837L8886p3424j8773M0249
15159B9342J6857m1998K9419Q189j30685Q1839J2469J950j5578K0319m0591K4088
15147d380L5658j7880n856j3921M9834O715r1557n0851Q9412M5200N1391k6958
15135F6807J1983n4805n9385k8151n2075k2530l2949N2252L7487j5239J0443K6266
15123e9896k5455r41P9357M6856O423j10128m2456N2156M1534J9589M1118P8209
$$ plain form
15206 -7894 2559 -8454 -85854 -68336 -38836 -57293 -27607 14705 -15722 -87796 -95431 -142845
15194 -142845 -102981 -32779 -22769 6224 81517 116727 18968 -131729 -88587 -51658 -32204
15183 -32204 -14712 -21561 -60289 -81105 -150691 -212572 -227548 -172014 -128132 -117811 -111754 -88581
15171 -88581 -125533 -87530 -53564 -10582 41243 59302 4567 42404 81290 7866 -10907 29342
15159 29342 46199 4201 33620 41809 -88876 -7037 5432 7382 -8196 12123 -28468 -4380
15147 -4380 31278 13398 7542 -6379 43455 50170 -41387 -92238 -2826 42374 93765 66807
15135 66807 78790 23985 -35400 -63551 -115626 -138156 -171105 -118853 -81366 -96605 -86162 -59896
15123 -59896 -85351 -86292 -6935 39921 46344 -63784 -106240 -54084 -12550 7039 48157 126366
15111A26366k1660k3909m1506j20774o0457K9690N7052J9603M3287J0001l3326
15100a5633p9298k7408N3662J3026M7284m8547O0244J36915j01302n7032o3114
15089h1203o2202q698j8784l4452O1562q137P1620J56233J5712l7607r0639o9321
15077a05916J31584L1814k3741o6466l1240P4955N5099j1391k6973M417k6066
15066F076N876o0528k2187M1962R936M1931K1327N6309m3210k3916l3940r288
15054i652r338o4619j8422K4402L3023M2055l9092l4804L4121R2049k9994K8940
15042D8669P6149P6215l3880P2253M9085q0542m6286k2344K0914k8047R845O7915
15030B09946N2408m9582n1492q9239p1839J569n7313J8258N0641J7837q590K1451
$$ plain form
15111 126366 104706 80797 39291 -81483 -141940 -112250 -55198 -35595 7692 17693 -15633
15100 -15633 -94931 -122339 -68677 -55651 -8367 -56914 3330 140245 38943 -18089 -81203
15089 -81203 -143405 -152103 -170887 -205339 -143777 -151914 -80294 75939 91651 54044 -36595 -105916
15077 -105916 25668 57482 33741 -32725 -63965 10990 66089 54698 27725 32142 6076
15066 6076 11952 -48576 -70763 -28801 -18865 23066 44393 100702 57492 33576 -364 -9652
15054 -9652 -18990 -83609 -102031 -77629 -44606 -2551 -41643 -76447 -42326 49723 19729 48669
15042 48669 124818 201033 167153 239406 288491 207949 161663 139319 160233 132186 142031 209946
15030 209946 262354 212772 161280 72041 202 1771 -55542 -37284 13357 31194 22604 44055
15018D4055L4205J44040o8389j12699q4574J02673N0537L0831j5150J2748K5489
15007A63766l6462r8900m5764o5114j14520K7301J50197P0912K6950L0343n5302
14996E3407j15454N0222J34606j685j60972k9256N7499R9403J0349p0869K7771
14985E5021J55872J6630r3156j29788n5782k7156J3891j2517n8714L7179k7663
14974a26183L8847L1062L2260r460n3131j4193N5388K2858r188O5716j3353k1826
14962a203N3956J37998L8712j7245n0433r7209r8804J15978j8601p936K462O1979
14950A19654k6915l5260n1527o1398l4052j5244N1145l343o7181M2084P8989J3082
14938A0034l7999P7690j3756m9828N9468P0614L119j1521o2737J1472l5705m5227
$$ plain form
15018 44055 78260 222300 153911 41212 -43362 59311 109848 140679 125529 138277 163766
15007 163766 127304 28404 -17360 -82474 -196994 -169693 -19496 51416 78366 108709 53407
14996 53407 -62047 -11825 122781 121096 -39876 -69132 -11633 87770 98119 27250 55021
14985 55021 210893 227523 134367 4579 -51203 -78359 -64468 -76985 -135699 -98520 -126183
14974 -126183 -87336 -56274 -24014 -33474 -86605 -100798 -45410 -22552 -31740 33976 20623 -1203
14962 -1203 52753 190751 229463 212218 161785 64576 -34228 81750 63149 55213 57675 119654
14950 119654 92739 57479 5952 -55446 -89498 -104742 -53597 -56940 -124121 -82037 -3048 10034
14938 10034 -27965 49725 35969 -13859 45609 116223 119342 107821 45084 56556 20851 -24376
14926b4376j0236J6857m7566m7133J404P9299Q5677P1475l3222o037N6879O1245
14914B04266M0271j8583j37741o0433k5813q0755o3532P4581J12980L8774m4476
14903C9539l9299j4549k9543l482k7230j12687r404M815j3683J6870M5545j9079
14891a62187P1716n2473K422q879N4524N3458j5587L86J2489M1412J3731O4129
14879G5141L4163q7881p3539L388l8711L0093Q8263R8852K76l9659j2899l0187
14867D7300l583j0407m234P3843k8555k0497j3711l3102m9369n1178J4212N4406
14855b4875O8143N2072n298N2642k8343p0795n9257K9118o4108l5988L7787m3140
14843i2042j4143p693j5037M3399K1017j2396M3842k1760j4203L9717o0156j8655
$$ plain form
14926 -24376 -34612 -17755 -65321 -112454 -111050 -31751 53926 125401 92179 86142 143021 204266
14914 204266 244537 225954 88213 27780 1967 -78788 -142320 -67739 45241 84015 39539
14903 39539 240 -14309 -43852 -47334 -74564 -187251 -196655 -191840 -205523 -188653 -143108 -162187
14891 -162187 -90471 -142944 -140522 -149401 -94877 -41419 -57006 -56620 -44131 -2719 11012 75141
14879 75141 109304 21423 -52116 -48728 -87439 -57346 30917 129769 130045 90386 77487 47300
14867 47300 43717 33310 29076 102919 74364 53867 40156 7054 -42315 -93493 -79281 -24875
14855 -24875 43268 95340 90042 142684 114341 43546 -15711 13407 -50701 -86689 -48902 -92042
14843 -92042 -106185 -113878 -128915 -85516 -64499 -76895 -33053 -54813 -69016 -29299 -89455 -108110
14831a08110k2058N6934N889j6761l5051N0330P0113j3328M3315o971k0137L4136
14819C8301J7670p8709N0251P7797O100q552p0958L350n0448k7133K1841O4756
14807D4266R1294o9116q1692j4070m8186o884P6797L4054Ro281o5756j1452K9225
14794b7792R9566o4951l9323Q1911O8725j5219j1084j4514N3390n3292l0913j770
14782D4734o0198l2291J8266j4615l1132N3895J21170Q5570L4262k5791p4910
14771A18960k9816p621j5548l9973n2338O3444k9858k9267p653L3627k6870j17730
14759a40643l8199M9695J14178O4171j3928P240n6541j2922j7021o1900l7391
14748a43261o948J6278N2747Q6493K9887j07227K0554O7854m621p5162l4519P4411
$$ plain form
14831 -108110 -130168 -73234 -67345 -84106 -119157 -68827 1286 -12042 31273 24302 4165 38301
14819 38301 55971 -22738 27513 105310 111410 102858 31900 35250 -15198 -42331 -20490 44266
14807 44266 135560 66444 -15248 -29318 -77504 -84388 -7591 26463 26472 20191 -45565 -57017 -27792
14794 -27792 71774 6823 -32500 49411 118136 102917 91833 77319 130709 77417 46504 44734
14782 44734 -15464 -47755 -29489 -44104 -75236 -21341 99829 185399 219661 193870 118960
14771 118960 89144 81523 65975 26002 -26336 37108 7250 -22017 -29670 3957 -22913 -140643
14759 -140643 -178842 -129147 -14969 49202 35274 42514 -14027 -26949 -43970 -105870 -143261
14748 -143261 -150209 -133931 -81184 5309 35196 -72031 -51477 16377 11756 -63406 -97925 -23514
14736b3514l6081n5558l7923L2602Q7018M6618j4788j13270L0675L1862j9536
14725g1895K5846O695O192K9672K1970j056M8444j9803k7544Q0569j6860q3312
14713a082M7717k0514n1722J7473R7582J1162o5482o1807l7825N6973O8435N6208
14701A17118q5715j01225l7512J9208L6189o7762L3817P7868M0653j7999n1014
14690c6374k6025n8688O898K2449j6091O1426R6821m3896J4892R1871R02j0049
14678A04136o6024p6185k2419j05120J328L0541k8739M6334l530L4875L5317m2680
14666i2166R6367j3540K854N4563O8729O132m823j7910j13200n4628L1706M7225
14654A1309p1121L943J48420k4188J8379K3628p2951m6046m113j3411k5137Q4448
$$ plain form
14736 -23514 -59595 -115153 -153076 -120474 -33456 13162 -1626 -114896 -84221 -52359 -71895
14725 -71895 -46049 -39354 -33162 -3490 18480 17424 65868 46065 18521 99090 82230 -1082
14713 -1082 46635 26121 -25601 -8128 89454 100616 35134 -26673 -64498 -7525 60910 117118
14701 117118 31403 -69822 -107334 -88126 -51937 -119699 -85882 -8014 32639 14640 -36374
14690 -36374 -62399 -121087 -114189 -91740 -107831 -46405 50416 6520 21412 113283 114185 104136
14678 104136 38112 -38073 -60492 -165612 -164284 -133743 -162482 -116148 -119678 -84803 -49486 -92166
14666 -92166 4201 -9339 -6485 48078 116807 122939 118116 100206 -12994 -67622 -35916 11309
14654 11309 -59812 -55869 92551 68363 86742 110370 37419 -8627 -12740 -26151 -51288 33160
14642C3160P2320O510q7670k354P3336L0744j27357j50024l1486R289J38832L983
14630c0717n7475o6230j1164N1688K2613j0193K5264K3929L497O6725J4087m3506
14618a1482p187P1466M1486j9410N265l8463p8465p8132K8166M0195K2842J990
14606b1729N4930j5281m9693N6482n5225L0758O1425p7565k444N9323J5058L4451
14594I0490o9434J6208Q86p4875m5777q761j2400J23210k0844r4115J14501N4089
14582G3178k3268k6854R409Q491m1262k5977P566K7909O1317k1993q8519j7768
14570e7771o14o549Q9312k8930p176M8743N959m2803m5137J2649R7990R5806L3125
14557A94604m8126m1846n522J2035p0203p4365n6145p3431P9445R7557p9225q4221
$$ plain form
14642 33160 105480 111990 24320 21966 95302 126046 -1311 -151335 -182821 -173532 -34700 -30717
14630 -30717 -88192 -154422 -165586 -113898 -91285 -101478 -76214 -52285 -48788 17937 32024 -11482
14618 -11482 -18669 52797 94283 74873 80138 41675 -36790 -114922 -86756 -46561 -23719 -21729
14606 -21729 33201 17920 -31773 24709 -30516 242 61667 -15898 -18342 40981 56039 90490
14594 90490 21056 37264 38150 -36725 -82502 -91263 -103663 19547 -1297 -95412 19089 73178
14582 73178 49910 23056 32465 40956 -306 -26283 -18717 9192 70509 48516 -40003 -57771
14570 -57771 -58385 -64934 24378 -4552 -11728 37015 42974 171 -44966 -32317 65673 161479 194604
14557 194604 146478 104632 99110 111145 40942 -33423 -89568 -162999 -83554 14003 -65222 -149443
14545a49443P6258J9699N124m845j01434l9038n0682J3220M5439L704N2559N9180
14533g0259m4017J844l5703P647P7800L3045r108K4811k8785Q5567J01587J3686
14521A58115o1778j7635O2843m0768o5579l8778j6451Q0213M1224o8844l5890
14510c328P6943O6289J1252L604k5595o9997n1951l3051K9061K2998K8872Q9503
14498A44600M8499r9937o8665l373p0003M0024N0756N45N069M5346Q1175m5286
14486A28750m4346o5388k7652J9893M6077L3407r1923j08095n072J15207L3532
14475C4390j04933l0827K6648N7611o907J1746J9581j7731L9857k7291r0850K8826
14463e9880M0628N094o4068K0881Q9830m6933o1857P6515P0997n5801l1540j19990
$$ plain form
14545 -149443 -73185 -53486 -48362 -53207 -154641 -193679 -244361 -231141 -185702 -181998 -129439 -70259
14533 -70259 -114276 -112432 -148135 -140488 -62688 -29643 -38751 -13940 -42725 42842 144429 158115
14521 158115 96337 78702 141545 100777 35198 -3580 -20031 60182 101406 32562 -3328
14510 -3328 73615 139904 151156 154760 129165 59168 7217 -25834 3227 26225 55097 144600
14498 144600 193099 93162 24497 21124 -48879 -8855 41901 42446 47515 92861 174036 128750
14486 128750 84404 19016 -8636 11257 57334 90741 -1182 -109277 -114349 858 34390
14475 34390 -70543 -101370 -74722 -17111 -24018 -12272 7309 -10422 29435 2144 -88706 -59880
14463 -59880 -19252 -14158 -78226 -57345 32485 -14448 -76305 210 71207 15406 -16134 -136124
14451a36124p8385j9662P2499M6149M0865k1097L9785Q9136L4188o3729j2520
14440h895M1675L8639n9817p453P76k9555J3763l710m691o6807n226Q352O9328
14427a3621n3675o1973r289Q041J03388O3142q22M3979k2129N4982j70J494q9604
14414B3743n4828M0030j0295J13697O853p1285j07905q4137Q520L288O2223K4019
14402d6077L834k1790m8732k8679K4029J591J0282J9819J570J2253K1070K0888
14390b9942k7217K3133L0288N114O8079J7427k6205R9591L9828m5355j1744j04732
14378C8265n0046O3846L0639j4672j14306p9356P744M7231O2833j0208p9921l4756
14366a32707P6271M3035J6431J20248k212n4233j05730l7181P9731J275o02K7976
$$ plain form
14451 -136124 -214509 -234171 -161672 -115523 -74658 -95755 -55970 33166 67354 3625 -8895
14440 -8895 32780 71419 11602 4149 4925 -24630 -10867 -14577 -19268 -86075 -91301 -82949 -13621
14427 -13621 -67296 -129269 -138558 -130517 -27129 36013 35191 79170 57041 112023 111853 113347 23743
14414 23743 -31085 8945 -1350 112347 119200 47915 -59990 -144127 -135607 -132319 -70096 -46077
14402 -46077 -42243 -64033 -112765 -141444 -117415 -115824 -105542 -85723 -84153 -71900 -50830 -29942
14390 -29942 -57159 -34026 -3738 1376 69455 86882 60677 160268 200096 154741 142997 38265
14378 38265 -11781 52065 82704 68032 -46274 -125630 -117886 -70655 -7822 -18030 -97951 -132707
14366 -132707 -56436 -13401 3030 123278 121066 66833 -38897 -76078 3653 4928 4326 32302
14354C2302n0443M8594o612o0164N8491M1318q3987k9605J1324N533k6511l7109
14342i6869N7372O5752m5427j1419N2930R4968l6070q4013J5692Q0517J3299p9475
14330B7257m134m826N7246l695p1532m0153K5883j01013q1207K3347P0555J28006
14318B5734L5608l1132j1166q324m9116N614N5062K6382M3635o6298l315K3355
14306D6039n5516l1306o117J0786J09301l5088l9696M270j5496k1400L9562J58274
14294A63613M9522j08938j19739p5699j9962J8397M5310m4422N8107m2687m0444
14283a16942R6818M8858q550J2213Q448J3392L0060N6401K3054r21j4085j49725
14271i79q9665p0331q8487J4448J04621J15724Q051p1413j312l8358L0846J05105
$$ plain form
14354 32302 -18141 30453 23841 -36323 22168 63486 -20501 -50106 -38782 -33249 -59760 -96869
14342 -96869 -39497 26255 -19172 -30591 22339 117307 81237 -2776 12916 93433 106732 27257
14330 27257 23123 18297 75543 71848 316 -39837 -13954 -114967 -196174 -172827 -102272 25734
14318 25734 61342 30210 19044 10720 -38396 -32782 22280 48662 92297 25999 22684 46039
14306 46039 -9477 -40783 -46900 -36114 73187 38099 -1597 2673 -12823 -34223 5339 163613
14294 163613 213135 104197 -15542 -91241 -111203 -92806 -47496 -91918 -33811 -76498 -116942
14283 -116942 -20124 28734 20184 32397 40845 54237 84297 140698 163752 162831 148746 -979
14271 -979 -90644 -160975 -249462 -235014 -130393 -14669 -6618 -78031 -79343 -117701 -86855 18250
14259A8250J45113M1134k265l7750o7254l8860J3699k1794N1631k8108j153k7468
14247D5175q4661P8917k6551l3547K2037N3097m1544Q069j080K0566K0174j8051
14235D2601l2267r537l1848m2243M5998L006m3190n5217M0945N9338R684J01896
14223H9166L757K2487K6918j02274j6103o734j12130o51J12619M3663L4760n7355
14211C8123l4621m3543K7174q522J0767O5699j2509j4641q6204n117J2920j3321
14199f3795K2765j8391o9015j3684R1859N0347J249P163J9190j5630O8149m797
14187G5410k7126n1802M1934q4835m1609m6261M6218R367l0722N7643K8990M8011
14175B5218L6661n8535j56660m6817K6972j1321N5929J4683K640k0660k2160P0536
$$ plain form
14259 18250 163363 204497 202232 164482 97228 58368 72067 50273 101904 73796 72643 45175
14247 45175 -39486 39431 12880 -20667 1370 54467 12923 20992 19912 40478 60652 42601
14235 42601 10334 797 -31051 -73294 -27296 -24290 -67480 -122697 -81752 -22414 -12730 89166
14223 89166 92923 115410 142328 40054 23951 17217 -94913 -95564 17055 60718 95478 38123
14211 38123 3502 -40041 -12867 -21389 -10622 55077 42568 27927 -58277 -63394 -50474 -63795
14199 -63795 -41030 -59421 -128436 -142120 -50261 86 1335 8498 27688 12058 80207 75410
14187 75410 48284 -3518 38416 -46419 -88028 -134289 -88071 -78704 -109426 -51783 -22793 25218
14175 25218 61879 3344 -153316 -200133 -173161 -184482 -128553 -113870 -111230 -131890 -154050 -83514
14163h3514K390m6815L7392J01417j8636L4106N9569n7201o6796N2733N9133M1993
14151A15771K430M991p1852j30819K9503P6875K9925m5399j6666l3583p821J4509
14139c2136N108r811o3757k1762M1133N5j9298J4561m4222k6372M55N8406J36294
14126C8654k1775Q148n825K3001O2193O7681K5010q3728P9523J0843p130j51689
14114D4906q0583l9146p6521K5187M401J5319p625m8234L242O49L2956N7344L3664
14101c4441j3213r7295l8174l3923m4974O0954L8994L8303O5907P8957j09380
14090h8285J8632Q112J0200k9020P719j7924O1596P5409K0812K1739r431J6648
14078I6207J3785r6398K7504K1584p2586o6814P759k1624L3111L9740L4864J5109
$$ plain form
14163 -83514 -81124 -127939 -90547 10870 -7766 26340 85909 28708 -38088 14645 73778 115771
14151 115771 118201 123192 51340 -79479 -49976 26899 56824 11425 -5241 -38824 -46645 -32136
14139 -32136 -27028 -36839 -100596 -122358 -81225 -81170 -100468 -85907 -130129 -156501 -156046 -97640 38654
14126 38654 16879 25027 19202 42203 104396 172077 197087 113359 192882 203725 196595 44906
14114 44906 -35677 -74823 -151344 -126157 -121756 -106437 -114062 -162296 -159054 -158405 -125449 -68105 -34441
14101 -34441 -47654 -144949 -183123 -217046 -262020 -201066 -162072 -123769 -57862 21095 -88285
14090 -88285 -69653 -61541 -51341 -80361 -72642 -90566 -28970 46439 67251 88990 79559 96207
14078 96207 109992 13594 41098 62682 -9904 -76718 -68959 -90583 -57472 -17732 17132 32241
14066C2241l9780L2213r1529m442L9121K0039P423q308K0202K4663m9707j23697
14054a41561j0036Q1124N1426k0299Q051M0748K5305K3969j9241j06799l4467
14043a01780j2474R6098J2903n5103K071K8121N2449O755j2840j6412k1517J1564
14031a0165m763R6246l6437p62n6635r7797L3692Q0865m7342m3417O5638J224
14019a9653L4609K5196N3481r1859l1029L747O4600M5928K6506O0524j497m3422
14007A27131q9348o6689p1961O8260Q3409m4788m5849m8651n0439J9273R2870
13996b6782O1707M8789L9960m6992m0536J0433P7405m2991j2103p9178m3109N6132
13984B735l77m3434P6804l4452l1456o10k0994o8967K3150P1597l3122l7607R995
$$ plain form
14066 32241 -7539 24674 -66855 -71297 -32176 -12137 -4714 -13022 7180 31843 -17864 -141561
14054 -141561 -151597 -70473 -19047 -39346 -31295 9453 34758 58727 39486 -67313 -101780
14043 -101780 -114254 -18156 -5253 -60356 -58285 -30164 22285 29040 16200 -212 -21729 -10165
14031 -10165 -14928 81318 44881 44119 -12516 -110313 -76621 4244 -43098 -86515 -20877 -19653
14019 -19653 14956 40152 93633 1774 -29255 -25508 39092 85020 111526 172050 170553 127131
14007 127131 37783 -28906 -100867 -32607 50802 6014 -39835 -88486 -138925 -119652 -26782
13996 -26782 34925 83714 123674 76682 36146 46579 123984 80993 68890 -10288 -53397 2735
13984 2735 2358 -41076 35728 1276 -30180 -30790 -51784 -120751 -97601 -26004 -59126 -96733 -86738
13971h6738O8668j9450o804q5159M8157N2386P4800K9398l2652K5646l4062l3337
13959H53p787M5106m8894O397l4342L9515M7260J5816k8199r4782P313N5402P8257
13946H1915l4725K5320l6929o0449J2762N9372M942n3276n5950p882k1582j5503
13934a01985m296m2315k4652P3044J2427M8288J9615O2412n8603K6585r9901m0744
13922a30125R984r7380O8586J23166N2247P8735N6452l4865q3668j9197J7992
13911D1927k2309K0840k5771j3947R4421M5474k9351q5807N4924l0995j6071k7039
13899F296L9973j5398m68p9968o048o4528q6728J0718Q779l5938P0580M3060K1948
13886h7722L5399k1306P0352Q0597P5067k0563j6055l9249o468o6119k8667N5768
$$ plain form
13971 -86738 -18070 -37520 -44324 -129483 -81326 -28940 45860 75258 42606 68252 34190 853
13959 853 -6934 38172 -10722 -4325 -38667 848 48108 63924 35725 -59057 -51744 3658 81915
13946 81915 47190 72510 35581 -24868 -12106 47266 52208 -1068 -57018 -64900 -86482 -101985
13934 -101985 -106281 -148596 -173248 -100204 -87777 -39489 -19874 42538 -16065 10520 -89381 -130125
13922 -130125 -120141 -217521 -148935 -25769 26478 105213 161665 126800 43132 23935 41927
13911 41927 19618 40458 14687 740 95161 140635 111284 25477 80401 49406 33335 6296
13899 6296 46269 30871 30403 -49565 -55613 -120141 -206869 -196151 -187372 -223310 -152730 -109670 -87722
13886 -87722 -52323 -73629 -3277 77320 152387 131824 115769 76520 70052 3933 -24734 31034
13874C1034N4747L7569j3667j167k4751L4093j5757j09943l1767M5554N1970k0328
13862C7587j04973k9030J00092M8459L8031Q215m5349o2495k2805k8864k7959
13851h9091N1838O4175Q726j5908K6632J3018l5386j9988k5698J7717m1014l9477
13839h4456M3380R578k6628N998K7656L6723J3063l9848O4391Q421J623p8434
13827a8533o2238L2969K8920R188p361n241j5853n2550r6010J07775M5925J2620
13815b0389j1375M8615J9084k198o2336O893K8146l0947j9552J2468k8021K9643
13803b9969M1591J7631N3436M2082n8811k6932N7145k6694j0261L8047J9227l3299
13791H3193J1790m8445Q81J5404l1170M9818k4027n9734n3943N6676Q7085r1334
$$ plain form
13874 31034 85781 123350 109683 108516 83765 117858 102101 -7842 -39609 5945 57915 37587
13862 37587 -67386 -96416 3676 52135 90166 98381 53032 -9463 -32268 -61132 -89091
13851 -89091 -37253 26922 35648 19740 46372 59390 24004 4016 -21682 -3965 -44979 -84456
13839 -84456 -41076 -31498 -58126 -52128 -24472 12251 25314 -14534 49857 58278 59901 -18533
13827 -18533 -80771 -47802 -18882 -9694 -17055 -22296 -38149 -90699 -186709 -78934 -33009 -20389
13815 -20389 -31764 16851 35935 33737 -28599 -21706 6440 -24507 -44059 -31591 -59612 -29969
13803 -29969 11622 29253 82689 124771 65960 39028 96173 69479 59218 97265 116492 83193
13791 83193 94983 46538 47419 62823 31653 81471 57444 -2290 -56233 443 87528 -3806
13779c806k5757L2722l98n6979m1685J0249J8555J7169J18870P4804o2221j00885
13767a9362k9123Q3186p417N9335j4761l3776K3494P478l6252k7050j4889l7575
13755d6712Q3497O5835q626p8403l6508Q299K8803k832L919L8851o5310q398O5787
13742D8202j0728p2261L0206J1618m8289j9610o618o2307O4930K5227K363k328
13730c9595R277N3288L7064l945J3567n9166j4307J2679J03470m4685M6808L195
13718A17650M033L6194l0210J8977l2048k3343k0889p0575n3483n3945L3806J33351
13706E9518o4308r3485N4637K4544O4145l5934O7434M7983N40r148k0507k7593
13694F7826l727q2218k6955M7166j3239m5403l7282P3682J6941m2735K734P6068
$$ plain form
13779 -3806 -29563 3159 2761 -54218 -95903 -85654 -67099 -49930 68940 143744 81523 -19362
13767 -19362 -48485 34701 27284 86619 71858 38082 61576 69054 32802 5752 -9137 -46712
13755 -46712 36785 102620 93994 15591 -20917 -12618 16185 13353 17272 56123 -9187 -17585 48202
13742 48202 37474 -34787 -4581 7037 -41252 -60862 -67480 -129787 -64857 -39630 -37267 -39595
13730 -39595 -30318 22970 60034 56089 69656 10490 -3817 8862 112332 67647 114455 117650
13718 117650 121683 157877 127667 146644 114596 91253 70364 -211 -53694 -107639 -73833 59518
13706 59518 -4790 -98275 -43638 -19094 45051 9117 76551 124534 125074 115926 95419 67826
13694 67826 64099 -18119 -45074 2092 -11147 -56550 -93832 -20150 -3209 -45944 -43210 32858
13682C2858N675j3490o4756J3840K5357M0287Q225K646l1854j0944k9360J5544
13670e972r3038M1705J20926M6292L7007J7512q5616p6461M94m4104k4713O5259
13658g09n617L6359N5193n370m6499k4409L6310P9669p1538k7443K5776Q5281
13646A37003M9431j4243j17983r0777o2744O4121M0312K2166m7294l6360O625
13635d9743Q7591j8111J378m1729q6617P41K6196k1637o3623Q0916O6791L2644
13623A4797l5998L964L4511m2671j27749l4745J53369M3050O9141N6012j00074
13612C3607q0173k8340L8766N8667q4526k9229P3571J43882J0827m0584r836p6269
13600A0363p7938j732L8393r3383K1688q8292M5128J07629Q4542j02248n5568
$$ plain form
13682 32858 38533 25043 -39713 -25873 -516 39771 47996 50642 18788 7844 -21516 -5972
13670 -5972 -99010 -57305 63621 109913 146920 164432 78816 2355 2849 -41255 -65968 -709
13658 -709 -6326 30033 85226 79856 33357 8948 45258 124927 53389 25946 51722 137003
13646 137003 186434 172191 54208 -36569 -99313 -35192 5120 27286 -20008 -56368 -49743
13635 -49743 37848 19737 21115 -20614 -107231 -106490 -80294 -101931 -165554 -84638 -17847 14797
13623 14797 -21201 -17237 17274 -25397 -153146 -187891 -34522 8528 77669 133681 33607
13612 33607 -46566 -74906 -36140 22527 -61999 -91228 -17657 126225 137052 96468 86632 10363
13600 10363 -67575 -69307 -30914 -124297 -102609 -190901 -145773 -38144 46398 -55850 -111418
13589a11418Q1223l5106k2990N6431L9645k0302n9542R2788J8602K5118J5242
13578G9691N0586M6666j13817j18339J9954P5008J8311o3975N3845o217k1662
13567B0051J8143j6111m9705n7707k4750K7854L2753j420k3076M8473K0589k2
13555d928m749l0149J20073J50608o1511k4160m358n341q5923r4665m1329L7894
13543d8538j0240K3016L2558k5117n9065j3706K3464M8803K7082J9959J2962j0695
13531B0483K4503J17493L2044o6286j56533k5866n6651O7411j6264j7298J2975
13520f3989L7922J1918Q5387M9739l4538o6226l6174j9399k3871l700N8491L3477
13508B9037j017l489j08584L3206O0105J0454n337L6226r7855k8144j9655J7983
$$ plain form
13589 -111418 -30195 -65301 -88291 -31860 7785 -12517 -72059 20729 39331 64449 79691
13578 79691 130277 176943 63126 -55213 -35259 39749 58060 -5915 47930 41713 20051
13567 20051 38194 22083 -27622 -85329 -110079 -82225 -49472 -50892 -73968 -25495 -4906 -4928
13555 -4928 -9677 -39826 80247 230855 169344 145184 140826 135485 49562 -45103 -86432 -48538
13543 -48538 -58778 -35762 -3204 -28321 -87386 -101092 -77628 -28825 -1743 18216 31178 20483
13531 20483 44986 162479 194523 128237 -28296 -54162 -110813 -43402 -59666 -76964 -63989
13520 -63989 -26067 -14149 71238 120977 86439 20213 -15961 -35360 -59231 -62931 -4440 29037
13508 29037 28020 24531 -84053 -50847 9258 19712 14375 50601 -47254 -75398 -95053 -77070
13496g7070l4768q852l4718P7549Q7065R9369k3656l9344N9002j12159o6737M3511
13484c0808J2865k2535q638o3280J7165j0517p2782N7479J65616K6652n2766m522
13472A3929K0614N8132k4999p3505Q5373n570p0627n3185L9370O4164Q388l8730
13460B3354K4711N760J3931j20655N9096K5296l3238k4358q827l769m2315L4148
13448d6866N8353m0217q9480J1799r935k7062Q9783j1028K8107L2896n3824p0812
13436a28286L6461o533J3976O8791O2217j2055p842J4232l9598K8918J25429k1188
13424A34522n3443k6731L725n0875q2354o1481l397n2650L6265P5973J3411O8288
13412A253K4990j1795P124J8310L9817K3790n0001O1837J0737m9912k6557o9547
$$ plain form
13496 -77070 -111838 -120690 -155408 -77859 9206 108575 84919 45575 104577 -7582 -74319 -30808
13484 -30808 -17943 -40478 -49116 -112396 -95231 -105748 -178530 -121051 44565 71217 18451 13929
13472 13929 34543 92675 67676 -5829 79544 73974 3347 -49838 -10468 53696 62084 23354
13460 23354 48065 53825 67756 -52899 6197 31493 -1745 -26103 -34930 -38699 -81014 -46866
13448 -46866 11487 -28730 -118210 -106411 -116346 -143408 -53625 -64653 -36546 -3650 -57474 -128286
13436 -128286 -91825 -98358 -84382 -15591 46626 34571 26729 40961 1363 30281 155710 134522
13424 134522 81079 54348 58073 7198 -75156 -136637 -140034 -192684 -156419 -80446 -67035 1253
13412 1253 26243 14448 21572 39882 79699 103489 53488 115325 126062 76150 49593 -19954
13400a9954k1569O5258M6374J7129k8571j40409j28217K5433J40580M0225M9017
13389D5296K3617r9803n9315M7334J9480J4387Q1517j1504l322N6671K8436j22181
13377B0613k8494J5460j4704p3203j3200N5735Q339P5536r649q697J348J9499
13365D8583p1598J4256n6236q120P4140N0746m0898J3170N3784m5392p4554J7460
13353b4659K3980l8045p1788o1759J6252j7076L4795J3193N7987m0094J9164K4386
13341f3664O7753Q1907J147j5415L4453r077l4617n1201p102j844Q482L7568L3589
13328H1979J4646J4023k6252m0190o342M6460L941j49499q497Q2427j6523P4173
13316G0346L5089j32110m4920l1252k4030K094P2641L7226Q3167J4879M0806m4613
$$ plain form
13400 -19954 -41523 23735 70109 87238 58667 -81742 -209959 -184526 -43946 -3721 45296
13389 45296 68913 -30890 -90205 -42871 -23391 -9004 72513 61009 57687 114358 142794 20613
13377 20613 -7881 7579 -7125 -80328 -93528 -37793 -29454 46082 36433 27736 29084 48583
13365 48583 -23015 -8759 -64995 -73115 1025 51771 10873 24043 77827 32435 -42119 -24659
13353 -24659 -679 -38724 -110512 -172271 -156019 -173095 -138300 -125107 -67120 -107214 -88050 -63664
13341 -63664 4089 85996 87143 71728 106181 97104 62487 11286 4184 2340 10822 48390 81979
13328 81979 96625 110648 84396 44206 37864 84324 88265 -61234 -69731 12696 -3827 70346
13316 70346 105435 -26675 -71595 -102847 -126877 -124783 -52142 -14916 68251 83130 123936 79323
13304G9323N189j9873r1221m5739j2919Q0925K0061J6997M2508k0932k068L0824
13292H3075n786j32734j48880R5100J30907R3539N4375j14164j58066n3899N4555
13281a01978J14264J8583j1430p4690l8773P9195O0737n9727m954l4777l7982
13270i1532l7518J7967K2798Q4179K778j07973K3076N7839L1536m9786J785O0686
13258A5835J09282m5925j6419m40n2668m2044j4566m1345k7173O7016J03743N6537
13246A11833N838l323n2834n8673L171j5257J35859M2242p509k0010k8964n899
13234A06474r0180m9308K9264M9069l9045m5180l0699o573K9220N1654K455J3056
13222B0207J9128N1017l7085k0726K4709J21895k3860l2306K7488p1227j11198
$$ plain form
13304 79323 84512 64639 -26582 -72321 -85240 -4315 15746 32743 75251 54319 52251 83075
13292 83075 77289 -55445 -204325 -109225 21682 115221 169596 55432 -102634 -156533 -101978
13281 -101978 12286 30869 19439 -55251 -94024 -14829 45908 -13819 -18773 -53550 -91532
13270 -91532 -129050 -111083 -88285 -4106 -1328 -109301 -86225 -28386 3150 -46636 -44851 15835
13258 15835 125117 79192 62773 62333 9665 -32379 -46945 -88290 -115463 -48447 55296 111833
13246 111833 117671 114348 61514 2841 6012 -9245 126614 168856 161347 141337 112373 106474
13234 106474 16294 -33014 -3750 45319 6274 -38906 -69605 -76178 -46958 4696 7151 20207
13222 20207 39335 90352 53267 32541 57250 179145 155285 122979 150467 79240 -31958
13211c1958l2621r5793N3684N4723l3509K0299O8352l3394K3727J09989O2187
13200A65686j21843O1586Q8223J2072l9692J726O2800l3805r3515J4099J595q8761
13188C0171m5349J7270j3727k8336P6058N0984r4278k6898P8038J0968K0772M9142
13176A24815j5405q6443k0650N8595N0224M1380j3894l874j9776o5861m22o0702
13164a2013J1700M2340m7181J0726L9756J2168J1739O9458R5722J92294J51721
13153E78430J70223N1322L0888p0104j70456j68703j79210j89252m7901J1793
13143A7030l0362L1634J37276L7456J9956n0711J4173p8207j080J9246j5887n5609
13131D4915o4777M3004J4047L5006l7151o4518k159K1168l43o5917m9814N7216
$$ plain form
13211 -31958 -64579 -160372 -106688 -51965 -85474 -65175 3177 -30217 -6490 103499 165686
13200 165686 43843 105429 193652 205724 166032 167758 230558 196753 103238 117337 118932 30171
13188 30171 -15178 2092 -11635 -39971 36087 87071 -7207 -34105 43933 54901 75673 124815
13176 124815 109410 22967 2317 60912 111136 152516 138622 134748 114972 49111 48689 -12013
13164 -12013 -313 42027 -5154 5572 45328 57496 69235 138693 234415 426709 578430
13153 578430 748653 799975 830863 760759 590303 421600 242390 53138 5237 17030
13143 17030 -13332 18302 155578 193034 212990 162279 176452 98245 97165 116411 100524 44915
13131 44915 -19862 23142 37189 72195 35044 -29474 -31633 -10465 -10808 -76725 -126539 -69323
13119f9323K3724J29405J21347M7031q5759k6943M1179R5439J11673J65190J29351
$$ plain form
13119 -69323 -45599 83806 205153 252184 166425 139482 180661 276100 387773 552963 682314
$$ [...]
##END NTUPLES=NMR SPECTRUM
##END=
