##TITLE=Analysis number 318650
Compound Code cc 15504
Project Code adrs
Chemist Name scafell
##JCAMPDX= 6.0         $$ Bruker NMR JCAMP-DX V2.0
##DATA TYPE= NMR SPECTRUM
##DATA CLASS= NTUPLES
##ORIGIN= Bruker BioSpin GmbH
##OWNER= nmr
$$ XWIN-NMR		Version 3.5
$$ Fri Apr  7 08:42:34 2006 GMT Daylight Time (UT+1h)  MAYBRIDGE\nmr@NMR_250MHZ
##.OBSERVE FREQUENCY= 250.131544655141
##.OBSERVE NUCLEUS= ^1H
##.ACQUISITION MODE= SIMULTANEOUS (DQD)
##.ACQUISITION SCHEME= undefined
##.AVERAGES= 16
##.DIGITISER RES= 18
##SPECTROMETER/DATA SYSTEM= dpx250
##.PULSE SEQUENCE= zg30
##.SOLVENT NAME= CDCl3
##.SHIFT REFERENCE= (INTERNAL, CDCl3, 0, 16.4531)
##AUDIT TRAIL= $$ (NUMBER, WHEN, WHO, WHERE, WHAT)
$$ ##TITLE= Audit trail, XWIN-NMR		Version 3.5
$$ ##JCAMPDX= 5.01
$$ ##ORIGIN= Bruker BioSpin GmbH
$$ ##OWNER= nmr
$$ C:\u/data/dgb/nmr/ADRS/2340/pdata/1/auditp.txt
$$ ##AUDIT TRAIL=  $$ (NUMBER, WHEN, WHO, WHERE, WHAT)
(   1,<2006-04-07 08:41:56.87 +100>,<MAYBRIDGE\nmr>,<NMR_250MHZ>,
      <created by zg, POWCHK disabled, PULCHK disabled
       configuration hash MD5:
       84 BC 41 DB A1 6E 1D 46 DA 25 12 A5 C1 ED C5 3A
       data hash MD5: 64K
       0D B5 19 D3 FD 04 71 3F B3 D9 4F 56 6C 99 96 5C>)
(   2,<2006-04-07 08:42:14.84 +100>,<MAYBRIDGE\nmr>,<NMR_250MHZ>,
      <Start of raw data processing
       ef LB = 0.3 FT_mod = 6 PKNL = 1 SI = 32K 
       data hash MD5: 32K
       52 0A 41 86 A0 8A 77 38 10 7D CB A2 B3 A8 9B 63>)
(   3,<2006-04-07 08:42:18.48 +100>,<MAYBRIDGE\nmr>,<NMR_250MHZ>,
      <apk 
       data hash MD5: 32K
       7F CA 10 7F 21 55 C4 E6 61 6D F5 76 52 BE 8D 93>)
(   4,<2006-04-07 08:42:19.75 +100>,<MAYBRIDGE\nmr>,<NMR_250MHZ>,
      <abs ABSG = 5 
       data hash MD5: 32K
       F4 19 5D 0D F0 B1 14 76 9C 4B F1 5B B0 F0 E9 DE>)
$$ ##END=
$$ 
$$ hash MD5
$$ 8B 12 63 30 97 1D 8D 34 E5 83 12 92 29 E4 4B 8B
##$RELAX= 
##$RELAX= 
##$RELAX= 
##$RELAX= 
##$RELAX= 
##$RELAX= 
##$RELAX= 
$$ Bruker specific parameters
$$ --------------------------
##$DU= <C:\u>
##$EXPNO= 2340
##$NAME= <ADRS>
##$PROCNO= 1
##$TYPE= <nmr>
##$USER= <dgb>
##$AMP= (0..31)
100 100 100 100 100 100 100 100 100 100 100 100 100 100 100 100 100 100 
100 100 100 100 100 100 100 100 100 100 100 100 100 100 
##$AQSEQ= 0
##$AQ_mod= 3
##$AUNM= <au_zg>
##$AUTOPOS= <47 >
##$BF1= 250.13
##$BF2= 250.13
##$BF3= 250.13
##$BF4= 250.13
##$BF5= 500.13
##$BF6= 500.13
##$BF7= 500.13
##$BF8= 500.13
##$BYTORDA= 1
##$CFDGTYP= 0
##$CFRGTYP= 5
##$CHEMSTR= <none>
##$CNST= (0..31)
1 1 145 1 1 1 1 1 1 1 1 1 1 1 1 1 1 1 1 1 1 1 1 1 1 1 1 1 1 1 1 1 
##$CPDPRG= <>
##$CPDPRG1= <>
##$CPDPRG2= <>
##$CPDPRG3= <>
##$CPDPRG4= <mlev>
##$CPDPRG5= <mlev>
##$CPDPRG6= <mlev>
##$CPDPRG7= <mlev>
##$CPDPRG8= <mlev>
##$CPDPRGB= <>
##$CPDPRGT= <>
##$D= (0..31)
0 1 0 0 0 0 0 0 0 0.06 0 0 0 0 0 0 0.0002 0 0 0 0 0 0 0 0 0 0 0 0 0 0 
0 
##$DATE= 1144395714
##$DBL= (0..7)
120 120 120 120 120 120 120 120 
##$DBP= (0..7)
150 150 150 150 150 150 150 150 
##$DBP07= 0
##$DBPNAM0= <>
##$DBPNAM1= <>
##$DBPNAM2= <>
$$ [...]
##$SUBNAM7= <"">
##$SUBNAM8= <"">
##$SUBNAM9= <"">
##$SW= 20.6930455092707
##$SWIBOX= (0..15)
0 0 3 0 0 0 0 0 0 0 0 0 0 0 0 0 
##$SW_h= 5175.983436853
##$TD= 65536
##$TD0= 1
##$TE= 294.16
##$TE2= 300
##$TE3= 300
##$TEG= 300
##$TL= (0..7)
0 120 120 120 120 120 120 120 
##$TP= (0..7)
150 150 150 150 150 150 150 150 
##$TP07= 0
##$TPNAME0= <>
##$TPNAME1= <>
##$TPNAME2= <>
##$TPNAME3= <>
##$TPNAME4= <>
##$TPNAME5= <>
##$TPNAME6= <>
##$TPNAME7= <>
##$TPOAL= (0..7)
0.5 0.5 0.5 0.5 0.5 0.5 0.5 0.5 
##$TPOFFS= (0..7)
0 0 0 0 0 0 0 0 
##$TUNHIN= 0
##$TUNHOUT= 0
##$TUNXOUT= 0
##$USERA1= <user>
##$USERA2= <user>
##$USERA3= <user>
##$USERA4= <user>
##$USERA5= <user>
##$V9= 5
##$VALIST= <valist>
##$VCLIST= <CCCCCCCCCCCCCCC>
##$VD= 0
##$VDLIST= <DDDDDDDDDDDDDDD>
##$VPLIST= <PPPPPPPPPPPPPPP>
##$VTLIST= <TTTTTTTTTTTTTTT>
##$WBST= 1024
##$WBSW= 4
##$XGAIN= (0..3)
0 0 0 0 
##$XL= 0
##$YL= 0
##$YMAX_a= 378738
##$YMIN_a= -426023
##$ZGOPTNS= <>
##$ZL1= 120
##$ZL2= 120
##$ZL3= 120
##$ZL4= 120
##$ABSF1= 16.45308
##$ABSF2= -4.240093
##$ABSG= 5
##$ABSL= 3
##$ALPHA= 0
##$AQORDER= 0
##$ASSFAC= 0
##$ASSFACI= 0
##$ASSFACX= 0
##$ASSWID= 0
##$AUNMP= <proc_1d>
##$AZFE= 0.1
##$AZFW= 0.1
##$BCFW= 0
##$BC_mod= 0
##$BYTORDP= 0
##$COROFFS= 0
##$CY= 12.5
##$DATMOD= 1
##$DC= 0
##$DFILT= <>
##$DTYPP= 0
##$F1P= 14.0000005364418
##$F2P= -0.99999901652339
##$FCOR= 0.5
##$FTSIZE= 32768
##$FT_mod= 6
##$GAMMA= 0
##$GB= 0
##$INTBC= 1
##$INTSCL= 1
##$ISEN= 128
##$LB= 0.3
##$LEV0= 0
##$LPBIN= 0
##$MAXI= 10000
##$MC2= 0
##$MEAN= 0
##$ME_mod= 0
##$MI= 0
##$NCOEF= 0
##$NC_proc= -3
##$NLEV= 6
##$NOISF1= 0
##$NOISF2= 0
##$NSP= 0
##$NTH_PI= 0
##$NZP= 0
##$OFFSET= 16.45308
##$PC= 1
##$PHC0= 170.7012
##$PHC1= 6.179946
##$PH_mod= 1
##$PKNL= yes
##$PPARMOD= 0
##$PSCAL= 4
##$PSIGN= 0
##$REVERSE= no
##$SF= 250.130017238185
##$SI= 32768
##$SIGF1= 0
##$SIGF2= 0
##$SINO= 400
##$SIOLD= 32768
##$SREGLST= <1H.CDCl3>
##$SSB= 0
##$STSI= 32768
##$STSR= 0
##$SW_p= 5175.98343685301
##$SYMM= 0
##$S_DEV= 0
##$TDeff= 65536
##$TDoff= 0
##$TI= <Analysis number 999999
Compound Code 99
Book Reference 9
Project Code 9>
##$TILT= no
##$TM1= 0
##$TM2= 0
##$TOPLEV= 0
##$USERP1= <user>
##$USERP2= <user>
##$USERP3= <user>
##$USERP4= <user>
##$USERP5= <user>
##$WDW= 1
##$XDIM= 32768
##$YMAX_p= 366099944
##$YMIN_p= -120868
$$ End of Bruker specific parameters
$$ ---------------------------------
##NTUPLES= NMR SPECTRUM
##VAR_NAME=  FREQUENCY,     SPECTRUM/REAL,   SPECTRUM/IMAG
##SYMBOL=    X,             R,               I
##VAR_TYPE=  INDEPENDENT,   DEPENDENT,       DEPENDENT
##VAR_FORM=  AFFN,          ASDF,            ASDF
##VAR_DIM=   32768,         32768,           32768
##UNITS=     HZ,            ARBITRARY UNITS, ARBITRARY UNITS
##FACTOR=    0.157963299565203, 1,           1
##FIRST=     4115.4089898285, 0,             0
##LAST=      -1060.57444702451, 0,           0
##MIN=       -1060.57444702451, -120868,     0
##MAX=       4115.4089898285, 366099944,     0
$$ Real data points
##PAGE= N=1
##DATA TABLE= (X++(R..R)), XYDATA
$$ [...]
16746C3163p044q541l3175m070L0045L0369K9416N260j1513k7025k1942j7175
16734b232j1623j0498L0480L821j1661k8012q259J2210J1574J575P210j1553O343
16721a0625q382J8540m175J9927R32m973K810l1653J8012M3216k0623k078J264
16708B2192l9085j4275j0832P766L344j3122j9600K7312L3997L5993N527j8424
16696B0793j0334J8219L595L652L373j1004L86J5633j2775k6567j7026K553K3381
16683A3879n007k9227J939K378J470K0280K5362j2399l3289n347R669J0602m062
16670c752l137N208L0835J0523K1412l6299k5776Q814O625j4806M936p307k1542
16657b4266J1273R290j879J0438K4309R137j8693j2895j8344J0339K564O439J8316
$$ plain form
16746 33163 26119 17578 -15597 -19667 10378 40747 70163 75423 63910 36885 14943 -2232
16734 -2232 -13855 -24353 6127 9948 -1713 -29725 -37984 -25774 -14200 -12625 -5415 -16968 -10625
16721 -10625 -19007 -467 -4642 15285 16217 11244 14054 -17599 413 43629 23006 20928 22192
16708 22192 -16893 -31168 -42000 -34234 -30890 -44012 -63612 -36300 -2303 33690 39217 20793
16696 20793 10459 28678 32273 35925 39298 28294 28680 44313 31538 4971 -12055 -9502 13879
16683 13879 8872 -20355 -18416 -16038 -14568 5712 31074 18675 -14614 -19961 -10292 310 -3752
16670 -3752 -6889 -1681 29154 39677 61089 24790 -986 7828 14453 -353 4583 -2724 -24266
16657 -24266 -12993 -3703 -5582 4856 29165 38302 19609 6714 -11630 -1291 1273 7712 26028
16644B6028n872k4608k8009k5730K8551K1600M609l4815k9248M9210J6976j8988
16632b0296l9169j6779K9391L6065J8816j500J6237N599J05o133J5764J019p966
16619C1153k435k6021j1651J9459J7122M856k528j4161l7378O282K2888l1257
16607b3671j758O469n469K3998J1247P496j1241l1185k2284j068O719J0760o58
16594c0645k9497K9915K6752J1028J1548K5724N741l8290q173k1491J4522L9226
16582C6360Q801j9572J7339q659l0790k1985m983J0395l1416O28J6443J8711J1024
16569B296M081O416j6822j8475J2137J6168r742o601P190n850n623J4251j1287
16556a1861p162M697j0195r825k0691J7934J4146k7377r673L8659J7938k0464
$$ plain form
16644 26028 20156 -4452 -32461 -58191 -29640 -8040 -3431 -38246 -67494 -18284 -1308 -20296
16632 -20296 -59465 -76244 -46853 -10788 8028 6528 22765 28364 28469 22336 38100 39119 31153
16619 31153 28718 2697 -8954 10505 27627 32483 29955 15794 -21584 -15302 7586 -23671
16607 -23671 -25429 -18960 -24429 -431 10816 18312 7071 -24114 -46398 -47466 -40747 -29987 -30645
16594 -30645 -60142 -30227 -3475 7553 19101 44825 50566 12276 4103 -17388 -2866 36360
16582 36360 45161 25589 42928 34269 3479 -18506 -23489 -13094 -44510 -43882 -27439 -8728 2296
16569 2296 6377 12793 -4029 -22504 -10367 5801 -3941 -10542 -3352 -9202 -14825 -574 -11861
16556 -11861 -19023 -14326 -24521 -34346 -55037 -37103 -22957 -50334 -60007 -21348 -3410 -23874
16544b3874n495K9045K5450J920P75L807k8045k4764k634L025k7714Q82J07K6291
16530b1224J260p689J3774j6779p732K0955P118k3126J9106L1753j0387l0034
16518b3005p401L4631J6874J9661K8115l8356j7010l0100j6550j1118q506J2855
16506c9910P746Q29K8270R855k8538j9811j8848j585K3550P123K6361K5961J3770
16493C4773q608j8430k2893k7039J1980J2351P411J2827k2541K7711L7917J7506
16481F2965j2081J665l5662l5230K5618R41o897J7960J1898m4818o0320P604O1213
16468e144J9168j4181j8185K5352L69k2644L814p402k7689J014J5128J8334K2566
16455A0500r551n02J8149j0053j8779K728l560j7055J7063J9100l5761j2300K6234
$$ plain form
16544 -23874 -29369 -324 25126 27046 27821 31628 3583 -21181 -23815 -20790 -48504 -47622 -47515 -21224
16530 -21224 -19964 -27653 -13879 -30658 -38390 -17435 -10317 -33443 -14337 17416 7029 -23005
16518 -23005 -30406 4225 21099 40760 68875 30519 13509 -16591 -33141 -44259 -52765 -39910
16506 -39910 -32164 -31335 -3065 6790 -21748 -41559 -60407 -61992 -38442 -31319 -4958 21003 34773
16493 34773 26165 7735 -15158 -42197 -30217 -17866 -10455 2372 -20169 7542 45459 62965
16481 62965 50884 52549 16887 -18343 7275 8216 1319 19279 31177 -13641 -73961 -66357 -5144
16468 -5144 14024 -157 -18342 7010 7379 -15265 -11451 -18853 -46542 -45528 -30400 -12066 10500
16455 10500 949 447 18596 8543 -10236 -7508 -11068 -28123 -11060 8040 -27721 -40021 -13787
16442a3787P46j2552K3863O839K5586r26m909j4121J5572K1536n372J1999J0856
16429F5330J1399J9343L2197J4387k1454l86r563o376j8152k2648m831K2689R809
16416I1744l9961r040N235N399k0589k0000k7106N127J2767R91q543J3624p516
16403B132n3J5740j4844l1408j896L8631K6051k8040Q422N936m3790J1776J0097
16390a246j3129N8364J0021l3905o707r183j1034p082j3179J4386J1421J1411
16378A0138l270k72j6332j1400l265L5532R965k6855q770k5938j6424K3321j0161
16365d3731J3196J9363l2212k680L5546R16R349j704k3056K1276l254n691j0012
16352b2694k984J7196K0865j3931l0941K796M5424L9309n836l176l4894r652R185
$$ plain form
16442 -13787 -13041 -25593 -1730 5109 30695 29769 24860 10739 26311 47847 42475 54474 65330
16429 65330 76729 96072 128269 142656 121202 120816 111253 104877 86725 64077 59246 81935 91744
16416 91744 51783 42743 47978 53377 32788 12788 -14318 -9191 3576 4567 -3976 9648 2132
16403 2132 2079 17819 2975 -28433 -30329 8302 34353 6313 14735 20671 -23119 -11343 -1246
16390 -1246 -14375 43989 54010 20105 13398 4215 -6819 -13901 -27080 -12694 -1273 10138
16378 10138 6868 6596 -9736 -21136 -24401 11131 21096 -5759 -14529 -40467 -56891 -33570 -43731
16365 -43731 -30535 -11172 -43384 -46064 -10518 -9602 -253 -1957 -25013 -3737 -6991 -12682 -22694
16352 -22694 -25678 -8482 12383 -1548 -32489 -29693 15731 55040 49204 46028 11134 1482 10667
16339A0667K1873M098J2174k9843m0758J19o231R541K0314r181k777j158K3638
16326A2476J4832j7223j4334L117l0127j9011J4196j381O519J2742l001n352m6324
16313g2871J4046Q020k1772J1515k0126j3981J1838L63L3202K9296Q540j8638
16301c0568J6340L9320K2683k303k3327r713k4311J8829j6037n797P064K2946
16289A5126K486J4153L0458K2891o8909l4264k52O452L2126K6749k2544j8520
16277E952k5264o089J2649K7921K1604k6380k2155l110J2326K0259N492n818L7854
16264E5241l033m8117j0937J2127n35n144L5356l7630p879j7253J1270O642j0786
16251b0678l1406o502L3125L1710J6373J0034K282l3928L0715P297k0681k8005
$$ plain form
16339 10667 32540 36638 48812 18969 -21789 -21670 -27901 -18360 1954 -7227 -10004 -11162 12476
16326 12476 27308 10085 -4249 -1132 -31259 -50270 -36074 -37455 -30936 -18194 -21195 -26547 -72871
16313 -72871 -58825 -50805 -72577 -61062 -81188 -95169 -83331 -82968 -49766 -20470 -11930 -30568
16301 -30568 -14228 25092 47775 45472 22145 12432 -11879 6950 -9087 -14884 -7820 15126
16289 15126 17612 31765 62223 85114 16205 -18059 -18311 -11859 20267 47016 24472 5952
16277 5952 -19312 -25401 -12752 15169 36773 10393 -11762 -14872 -2546 17713 23205 17387 55241
16264 55241 52208 4091 -6846 5281 4746 -398 34958 -2672 -10551 -27804 -16534 -9892 -20678
16251 -20678 -52084 -58586 -25461 6249 22622 32656 34938 1010 31725 39022 18341 -9664
16239i664M076L2165K6225O704K230j6297k1415j2981q874J1217K2738o734l727
16226B5663m0797q068k3526R628j1941j023J2729O507k0330k159J9791J6064l805
16213b1267O639M5084k696k4975j9855l588K6547Q725L437K238o371P760k9706
16200h028J3080K3191q065J1909j9797K468j555j6122l638Q836j0855j4159O232
16187a6503N472r711L066l7212K6451K2838N992j2917m8569j1304N3016M0750
16175B1369Q375j3727l6507j1598K2086J507k3480r49m5875k5323N7908O0007
16163A3793k0760n870L0852K5755n292l1046J9059L747r203k3218k6844m3357
16151g2384K683J6016K9298J9956J2777n307L642R343n605l000K5085K483N80
$$ plain form
16239 -9664 -5588 26577 52802 59506 61736 45439 24024 11043 2169 13386 36124 29390 25663
16226 25663 -15134 -23202 -46728 -37100 -49041 -50064 -37335 -30828 -51158 -53317 -33526 -17462 -21267
16213 -21267 -14628 30456 27760 2785 -17070 -20658 5889 14614 18051 20289 13918 21678 -8028
16200 -8028 5052 28243 20178 32087 12290 14758 13203 -2919 -6557 2279 -8576 -22735 -16503
16187 -16503 -11031 -20742 -17676 -54888 -28437 -5599 393 -12524 -61093 -72397 -19381 21369
16175 21369 29744 16017 -20490 -32088 -10002 -8495 -31975 -32924 -78799 -104122 -46214 13793
16163 13793 -6967 -12837 18015 43770 38478 7432 26491 30238 21035 -2183 -29027 -72384
16151 -72384 -69701 -53685 -24387 -4431 8346 3039 6681 16024 10419 7419 32504 34987 35567
16138C5567j2651k428K4748K8076l5730k5000j6551j0121J4830J3373N715j0297
16126I531P368m5958l7532M002O181j0745L9558M6926J7715r048n034L5783J2583
16113G1330l6014k4993M055K3213j0336Q802K1810k8593k0962K278J7250l859
16101B3981k2739O487J4003J8795p644n1340j4899L4429K7574j0864j356k2332
16089e905J4795L1437k9134j9109J2002J0832L5494p562j4332k910l0104k122
16077f618J6435q258j1250J5275J5141q749J6747k0900n7487l0963L6013L4535
16065a0079j5115J234J5615J0720o783k908J0999J0510J8993J1547l5753j5848
16053f868L5145K7543k6088k1099k5378J7268L3632p438J2555j0083L3118J7266
$$ plain form
16138 35567 22916 20488 45236 73312 37582 12582 -3969 -14090 740 14113 19828 9531
16126 9531 16899 -29059 -66591 -62589 -56408 -67153 -27595 19331 37046 27998 22964 58747 71330
16113 71330 35316 10323 14378 37591 27255 36057 57867 29274 8312 10590 27840 23981
16101 23981 1242 7729 21732 40527 32883 -18457 -33356 1073 28647 17783 16427 -5905
16089 -5905 8890 40327 11193 -7916 4086 14918 50412 42850 28518 25608 -4496 -6618
16077 -6618 9817 1559 -9691 5584 20725 11976 28723 7823 -49664 -80627 -44614 -10079
16065 -10079 -25194 -23960 -8345 2375 -4408 -7316 3683 14193 33186 44733 8980 -6868
16053 -6868 28277 55820 29732 8633 -16745 523 34155 26717 39272 29189 62307 79573
16041G9573k8285o0456J1048m909k3892m2961L438L9837L1903k9134l8829j4380
16029g7047J5406L6143P661J3530J2923k0339k3474K084J0270j5634J2783l0699
16017e6393L125J0757J0481K6790K6618k7262k5831K235K8167j2462J2251K9316
16005B7792P467l1974j6096L2640J3271k6401m7709J1206J6943K3555k6778l0090
15993d6174L6869j4800q640L4592L237J9317j885m6226K1423j1193L847P836j879
15980c676K2099M91k4232k3058p379j3889k3069M1395j0805p433k8425K4003J993
15967e1985m536M384k5016K1240K1733K9040k149k4327j9591O636j5114j349R264
15954e1770P007J7010N2852L296l7522k3645n762N234n756j6697J2395L2909J8875
$$ plain form
16041 79573 51288 -9168 1880 -3029 -26921 -69882 -66444 -26607 5296 -23838 -62667 -77047
16029 -77047 -61641 -25498 -17837 -4307 8616 -11723 -35197 -33113 -22843 -38477 -25694 -56393
16017 -56393 -53268 -42511 -32030 -5240 21378 -5884 -31715 -29480 -1313 -13775 -1524 27792
16005 27792 35259 3285 -12811 19829 33100 6699 -41010 -29804 -12861 10694 -16084 -46174
15993 -46174 -9305 -24105 -32745 1847 5084 24401 22516 -23710 -2287 -13480 -9633 -1797 -3676
15980 -3676 18423 18914 -5318 -28376 -35755 -49644 -72713 -31318 -42123 -49556 -77981 -53978 -51985
15967 -51985 -56521 -52137 -77153 -55913 -34180 -5140 -7289 -31616 -51207 -44571 -59685 -61034 -51770
15954 -51770 -44763 -27753 25099 28395 -9127 -32772 -38534 -33300 -39056 -55753 -43358 -10449 8426
15941H426j7044N888j6024q338J2564L0825n647J8554l416j9323R10j8674k0522
15928c1821K0507J9007k2901k0912J0486J0603J1256j1944K312J1590J219L073
15916B475j4726q473q798M0078P806O449Q344J1883k0070k0426l0358j0196O001
15903c0011J1329K7277M53K7438J7127L26j8365K0091K2458J3215j5449k6540
15891D9349J6901k9057k6208j9813j5062K3774N506K6890l171n4819j5574O234
15879c5050J6172L2131K1049n629k0010l0458p383K6834j6883r151Q83K0395M508
15866b592l930P404l8871j8838K9929L5679L5834k2249l7573j8981J7008K7207
15854A0027J6465l0626j3266J7842L0281J506K6897j6849j7431N751j8255n1331
$$ plain form
15941 8426 -8618 -2730 -18754 -27092 -14528 16297 10650 29204 25788 6465 7375 -11299 -31821
15928 -31821 -11314 7693 -15208 -36120 -25634 -15031 -3775 -15719 -13407 -1817 -598 2475
15916 2475 -12251 -20724 -29522 10556 18362 24811 33155 45038 24968 4542 -25816 -36012 -30011
15903 -30011 -18682 8595 9048 36486 53613 53939 35574 55665 78123 91338 75889 49349
15891 49349 66250 37193 10985 -8828 -23890 -116 5390 32280 29109 -25710 -41284 -35050
15879 -35050 -18878 13253 34302 28673 8663 -21795 -29178 -2344 -19227 -28378 -27495 -7100 -2592
15866 -2592 -6522 882 -37989 -56827 -26898 8781 44615 22366 -15207 -34188 -17180 10027
15854 10027 26492 -4134 -17400 442 30723 32229 59126 42277 24846 30597 12342 -38989
15842c8989j877J7842r677K2438K0626K3016L148n0269K1725J2396N689p336j8420
15829C12j7453Q907K3842O646N026l6566j8247l878l971L5296K1656O664j3172
15816A5062k6232j3158j5339r220o18k044N779L0289K2089j9510l9500j031M6846
15803f587J6013N300j2249j3364K9436p096k4018r40n792k797J4508J4612r126
15790b100j8803r61k773j9049J8400K358l4093M7494M9967r893k0850j4789l6083
15777d1175O323J5592Q249M5382J6270j1597J5483Q635j9355j6070K0981j3308
15765C5410m0161R633K5492K9237l359m240q959N313l947k1232J560R482K190
15752C6419l2108k1702P942l67J1252R647k439q06L554L682j465j1306q20p224
$$ plain form
15842 -38989 -40866 -23024 -32701 -10263 10363 33379 36527 -13742 7983 20379 26068 18732 312
15829 312 -17141 -8234 15608 22254 27280 -9286 -27533 -31411 -35382 -86 21570 28234 15062
15816 15062 -11170 -24328 -39667 -48887 -49505 -51549 -45770 -15481 6608 -12902 -52402 -53433 -6587
15803 -6587 9426 14726 2477 -10887 18549 11453 -12565 -13505 -19297 -22094 -7586 7026 -2100
15790 -2100 -20903 -21864 -24637 -43686 -25286 -22928 -57021 -9527 40440 30547 9697 -5092 -41175
15777 -41175 -34852 -19260 -11011 34371 50641 39044 54527 63162 43807 27737 48718 35410
15765 35410 -4751 4882 30374 59611 56252 52012 43053 48366 44419 23187 24747 34229 36419
15752 36419 4311 -17391 -9449 -9816 1436 11083 8644 7838 11392 15074 13609 2303 1483 -5741
15738e741K2795J9321j9122K5249j4774J117o816p667k4387j0210M9051J6116
15726D4932q7o4142m3344k2400L8415K9082j9674l4969Q017R123K0071M234N081
15713b5661O7J879J3761J1025J9192q517l1300k1733O074J1825j1613P526M771
15700b2704J1913J2663K7434o872n955j6317p451J511j2835k0713K936o248R825
15687c2813L5019l772k9713K8106L6596Q764k637R133p568k0272n293O228k017
15674A9761M483j2436Q055L2658K0201l2381l2489O417M212L088Q722j1068j9996
15661g73L7826K8640n261j1034k6844k0263k0765J6609J9840j8967P914l197L8064
15648D1789K0834l3640j4859J887J2191k3974j9548K2321K3572k6753k2480K2855
$$ plain form
15738 -5741 17054 36375 17253 42502 27728 28845 22029 14362 -10025 -20235 28816 44932
15726 44932 44845 -19297 -62641 -85041 -46626 -17544 -37218 -72187 -64170 -55047 -34976 -30742 -25661
15713 -25661 -25594 -23715 -9954 1071 20263 11746 -19554 -41287 -35213 -23388 -35001 -27475 -22704
15700 -22704 -10791 1872 29306 22434 16479 162 -7289 -5778 -18613 -39326 -36390 -42638 -32813
15687 -32813 2206 -1566 -31279 -3173 33423 42187 39550 48683 41115 20843 15550 21778 19761
15674 19761 24244 11808 19863 52521 72722 40341 7852 14269 18481 21569 30291 19223 -773
15661 -773 37053 65693 60432 49398 22554 2291 -18474 -1865 17975 -992 6922 3725 41789
15648 41789 62623 28983 14124 16011 28202 4228 -15320 7001 30573 3820 -18660 4195
15636D195L9470l6739k82O447J3636N655K7006Q077m2417j9371M085k1831j2085
15623b4154P592R519k981Q518K183j6580M005J1277J4566j2140o724J906K0087
15610A7074r887j1238K5335J2157k8665m0838P516J0871k1293l871m010j861o004
15597e4714k658M0731N2667j990j5117k962J3248K894j7777n9630j0388l3066
15585h8762R912J8525k8437j3637l14J1362K6673M7852J0281k0193k54P942k8223
15572d7273L501L9150j6680j4205k4034m22P694M6312O634j6250l491K5590K603
15559I129K3912L3800k9934l5758k0865K9877J3993k0985K0253L600m2516Q048
15547g446j8470n448K6780M490J222K0540k522J7782n055k6349j2469n243K6242
$$ plain form
15636 4195 43665 6926 6644 13091 26727 32382 59388 67465 25048 5677 9762 -12069 -24154
15623 -24154 -16562 -7043 -10024 -1506 677 -15903 -11898 -621 13945 1805 -4919 -3013 17074
15610 17074 7187 -4051 21284 33441 4776 -36062 -28546 -17675 -38968 -42839 -46849 -48710 -54714
15597 -54714 -57372 -16641 36026 34036 18919 15957 29205 32099 14322 -45308 -55696 -88762
15585 -88762 -78850 -60325 -88762 -102399 -102713 -91351 -64678 -16826 -6545 -26738 -26992 -19050 -47273
15572 -47273 -43772 -4622 -21302 -35507 -59541 -59963 -52269 -5957 677 -15573 -19064 6526 9129
15559 9129 33041 66841 36907 1149 -19716 10161 24154 3169 23422 27022 -15494 -7446
15547 -7446 -25916 -31364 -4584 -94 1128 21668 19146 36928 31873 5524 -6945 -12188 14054
15534A4054K5597k7388k6471M3367k6106l9422J1687L3787l760m900K4247k145
15522B2547m0556l8828K6366L635r570K2746k033k8162j1123R393J688j9162L95
15509f2664Q3773N286k8266k4685R63J9936o38P543J1526L140j9498j2975RM3751
15495B7201N288j9500p40k2265j0322O383K0093r652K1722K3740k2510J1544J7683
15482D8665J0702j6594n405n619q400N019J258k9075N052Q924j0670j1056m856
15469a2055J2058J3604k1061J523L865J4528j3596k5601K438M706J4159p021l400
15456a5853L2895o079j9599j636J7493J8888m0442k2457m738K325L7513K295N75
15443A180M7458J232l1271p335k8410l0468L2993m885O472J4115n948P678l082
$$ plain form
15534 14054 39651 12263 -14208 29159 3053 -36369 -24682 9105 5345 445 24692 22547
15522 22547 -18009 -56837 -30471 -26836 -36406 -13660 -15693 -43855 -54978 -45585 -43897 -63059 -62664
15509 -62664 21109 26395 -1871 -26556 -25593 -5657 -6295 1248 12774 15914 -3584 -16559 -16550 27201
15495 27201 32489 12989 12249 -10016 -20338 -13955 6138 -3514 18208 41948 19438 30982 48665
15482 48665 59367 42773 37368 31749 23349 28368 29626 551 5603 14527 3857 -7199 -12055
15469 -12055 3 13607 -7454 -5931 -2066 12462 -1134 -26735 -24297 -19591 -5432 -12453 -15853
15456 -15853 17042 10963 -8636 -10272 7221 26109 -14333 -36790 -41528 -39203 -1690 605 1180
15443 1180 48638 49870 18599 11264 -17146 -47614 -14621 -19506 -13034 1081 -4867 2811 -271
15430b71Q962j4068j5986n0417j4248J9573K1344K2203J0205j6781Q509J236J0193
15417i546N1472L3850o620l6548n7026k4507J4349M8963J6423P015k2270K67M9551
15404F5373m401m9611k035l631j2304k6919m250K9832k624J7661p971o284k972
15391a0136J3520p354J3387J274N118k786k2743J4002k2511J5353P238m7083k5686
15378f8407L2048K0317k823L1650J8882K5808q536m8166l3424m955j267J916J2588
15365b4369J1833j0355R197j1265J0298L0301J2460j955O199J4281j6764j6727
15353A3134k8862J1876J4123N605K48j8579j8062j1921N984Q448M486J22n601
15340a8999R386K4196Q330L62J1617k7904k9308j044p35k343j4074j8975J6728
$$ plain form
15430 -271 8691 -5377 -21363 -71780 -86028 -66455 -45111 -22908 -12703 -29484 -20975 -19739 -9546
15417 -9546 41926 75776 69156 32608 -24418 -48925 -34576 14387 30810 37825 15555 15822 65373
15404 65373 60972 11361 9326 5695 -6609 -33528 -37778 -7946 -10570 7091 -880 -7164 -10136
15391 -10136 3384 -3970 9417 10691 15809 13023 -9720 4282 -18229 -2876 4362 -42721 -68407
15378 -68407 -36359 -16042 -18865 12785 31667 57475 48939 773 -32651 -37606 -38873 -36957 -24369
15365 -24369 -12536 -22891 -13694 -24959 -14661 15640 28100 26145 32344 46625 29861 13134
15353 13134 -15728 -3852 10271 15876 16124 -2455 -20517 -32438 -26454 -18006 -13520 -13398 -18999
15340 -18999 -9613 14583 22913 23275 34892 6988 -22320 -23364 -24099 -26442 -40516 -59491 -42763
15327d2763M5340J5338r227k866j407k3117l5111L978j395M4655L7069k440J0119
15314C8173j4331j1790q250j0719l263q177O021l482j6410n867K1056J9098N9831
15301F1890L0381j9400N098k0169n8617l3269o650J8995J8176m1839q767L617
15289e0554Q090M365j6980k5050M7187K3622j3419K8126k1713l5024j9772L2580
15277c8542J7720J2567k4823j784K8950P653K5276J9716j7922k3933R214l984
15265A0108j9468O162K4211L8358k2809j7277m0708Q707M4597R336m0230R532
15253A0519K0608r735n790j9680j5474M579J4292j5981j0530J6229J878k8553
15241c7638J5299L3453L0881j8895j4741j1291j5948J6840M430j0779J5795P60
$$ plain form
15327 -42763 2577 17915 8688 5822 4415 -18702 -53813 -49835 -51230 -6575 30494 28054 38173
15314 38173 23842 12052 3802 -6917 -10180 -18357 -12336 -15818 -32228 -38095 -17039 2059 61890
15301 61890 92271 72871 77969 57800 -817 -34086 -40736 -21741 -3565 -45404 -54171 -50554
15289 -50554 -42464 -38099 -55079 -80129 -32942 -9320 -22739 5387 -16326 -51350 -71122 -38542
15277 -38542 -20822 -8255 -33078 -34862 -5912 1741 27017 46733 28811 4878 14092 10108
15265 10108 -9360 -3198 21013 59371 36562 19285 -21423 -12716 31881 41217 987 10519
15253 10519 31127 21392 15602 -4078 -19552 -14973 -681 -16662 -27192 -10963 -9085 -37638
15241 -37638 -22339 11114 41995 23100 8359 -2932 -18880 -2040 2390 -8389 7406 8166
15229H166k2253l39K5105K4750j6183j0996J9673O81r387J5078m4443K1365N1441
15216F2658N443j8563j2346k2381j6512L5188L4423J5933J5958J2815j5426n6192
15204D0998l7176l0161j11J3896L8363l156k9654J1495J0891j0417k2136l4493
15192e1661J3092L0200R735K976q810k4720N494K0995K4456K4246P540L700k3106
15179C4137k9366j6013J1034m018J8174l977k5092K0314J7886j8779m1094M010
15167c2784R60J7746r57j1237J2901Q601K2623L118r879k0628N580P443j7402
15154a3915m073J6401Q173l8982n5143O729O4668L7783l007n5197j7497J0042
15142d4018L5988K632p268K2176j0136L2589K8847k5931P255l2075j2273K3277
$$ plain form
15229 8166 -14087 -14426 10679 35429 19246 8250 27923 28604 19217 34295 -10148 11217 62658
15216 62658 68101 49538 37192 14811 -1701 33487 67910 83843 99801 112616 97190 40998
15204 40998 3822 -26339 -26450 -12554 25809 22653 -7001 4494 15385 4968 -17168 -51661
15192 -51661 -38569 -8369 1366 4342 -4468 -29188 -23694 -2699 21757 46003 53543 57243 34137
15179 34137 4771 -11242 -208 -4226 13948 9971 -15121 5193 23079 4300 -36794 -32784
15167 -32784 -31824 -14078 -15035 -26272 -13371 -4770 17853 20971 11092 -9536 -3956 3487 -13915
15154 -13915 -17988 -1587 6586 -32396 -87539 -80810 -16142 21641 18634 -36563 -54060 -44018
15142 -44018 -8030 -5398 -12666 9510 -626 31963 60810 34879 42134 10059 -2214 21063
15130B1063o664n346k479M685j6782j623j1697k1533P029L5242K4200p006q266
15117A0823J3895j8090j7631M9410p6M408j7500j5627j023P859p045k3431j7037
15104c1065m718K1303K2657l6471L205K9218K7528j9428P273j112j4753M536j1243
15091c070L3856j2835j6991j4030L476L2364j313l0563Q978l122j9365p784J3516
15078a6883Q643L897J6648J1095P60k4494k7152K0517n578p156J780J5888n259
15065g294l0545K7647K4696j3354l2774j7327j1668j127j1347J8497M5787J4995
15053F186K7338j2089l5553j1647K3792K7113P142q524j4497N009N824O040P265
15040C3399K9958K0102k8523J1870k8104m390r533l347j6250q619j3448r556J0980
$$ plain form
15130 21063 14399 9053 6574 11259 -5523 -7146 -18843 -40376 -33347 1895 26095 19089 10823
15117 10823 24718 6628 -11003 38407 38331 42739 25239 9612 8589 16448 9403 -14028 -31065
15104 -31065 -35783 -14480 8177 -28294 -25089 4129 31657 12229 19502 18390 3637 8173 -3070
15091 -3070 30786 17951 960 -13070 -9594 22770 21457 -9106 -128 -3250 -22615 -30399 -16883
15078 -16883 -8240 -4343 12305 23400 24160 -334 -27486 -6969 -12547 -19703 -17923 -2035 -7294
15065 -7294 -37839 -10192 14504 1150 -31624 -48951 -60619 -61746 -73093 -54596 -8809 6186
15053 6186 33524 21435 -14118 -25765 -1973 25140 32282 23758 9261 14270 20094 26134 33399
15040 33399 63357 83459 54936 66806 38702 34312 24779 21432 5182 -3437 -16885 -26441 -15461
15027a5461K348l4398L1263L0638m840K8820l2154o498j9764m7332j0759K6103
15015e2034L6604N8096K8285j7138l3982j3325j1876l1573l214L5119K3530j2673
15003E819O163K2937j2984j9265k3392j3565P077L054q162j4254L3802J9973P586
14990A4789j0411O686j9750J1721O758j4231r469o857p235m3649M586M1465J4931
14977a0666J8209j9658m4258k960R672j666m2008j7952O0371O3562J7474L5320
14965F5440l1929j9679o578p05K7783J3291M360j8655l5006k3390k674J8315J3331
14952C904q883j6015K229R668J9891N526K865O971j4220R72k9695m16q039J0753
14938a4489P134P367k447l407K4609p462J2383k6082l4263Q622M473j5443p017
$$ plain form
15027 -15461 -13113 -47511 -16248 14390 9550 38370 6216 -282 -20046 -67378 -78137 -52034
15015 -52034 -15430 42666 70951 53813 19831 6506 -5370 -36943 -40157 -5038 18492 5819
15003 5819 11982 34919 21935 2670 -20722 -34287 -27210 -24156 -32318 -46572 -12770 7203 14789
14990 14789 4378 11064 -8686 3035 9793 -4438 -13907 -20764 -27999 -71648 -67062 -25597 -10666
14977 -10666 7543 -12115 -56373 -59333 -49661 -51327 -93335 -111287 -50916 12646 30120 65440
14965 65440 33511 13832 7254 6549 34332 47623 51983 33328 -1678 -25068 -27742 -9427 3904
14952 3904 -4979 -20994 -18765 -9097 10794 16320 19185 26156 11936 12908 -16787 -17203 -25242 -14489
14938 -14489 -7355 12 -2435 -5842 18767 11305 23688 -2394 -36657 -28035 -23562 -39005 -46022
14925d6022N7740L2872q627R84K4625M930k3962j7430k4861N562k4470L1743K1448
14912C4532m464l941k5717o237K2646o397l7608k505J7268P11J367N755l319l2787
14898d0696J5659L0867L1201k294N441p550r976l382k726j1816J3233K07l0143
14885a1975o724P318r355l6870j7089N9971m650p924J5993j8669r810M6527M64
14872G207J4055j6354j6010J225L437j372P985j30J39j0439J8425K2038o804K702
14858B6104M1916K4062k355J049o5878j4057r818j4825l1645J570M3326K5852
14846B5301k1387P804q264J7498K1776j8687k3608J160r742J0140K776N93m08
14833D952j9248m1J5282r519k3832L2639M9731m80j5400l7829k6013K0448n062
$$ plain form
14925 -46022 11718 44590 35963 36947 61572 66502 42540 25110 249 5811 -18659 13084 34532
14912 34532 30068 26127 410 -5827 16819 10422 -27186 -29691 -12423 -11712 -10345 -4590 -7909 -40696
14898 -40696 -25037 5830 37031 34737 40178 32628 22652 19270 16544 4728 17961 18168 -11975
14885 -11975 -18699 -11381 -20736 -57606 -74695 -14724 -19374 -27298 -11305 -29974 -39784 6743 7207
14872 7207 21262 4908 -11102 -9877 -6440 -7812 173 43 182 -10257 8168 30206 23402 26104
14858 26104 68020 92082 89727 90776 24898 10841 1023 -13802 -45447 -43877 -551 25301
14846 25301 3914 11718 3454 20952 42728 24041 433 1593 -8149 1991 4767 5360 4952
14833 4952 -14296 -14337 945 -8574 -32406 233 49964 49484 34084 -3745 -29758 -9310 -14372
14820a4372j6977j5964J5396M6055L1265l0774l1245Q728J1701K2122l7765l606
14808a5436K0560J2160J7478n696J9428m005k9301J2240j1849Q130Q489l0161
14796B037j2564j3212L1741O059l3500J6147J4255J0306n107j8088P254j8758
14784a3430P057N30k8066K100R873n361J6969j3918j2070O239J5333J592m9085
14771f2237Q582K861j3239K1203K9608J7092k7862J7518L7666J1016J848l388
14759D0668j7974l6992J476J9749j5170k1055J8698N773j8358J8516J7062q234
14747D159k2314l1224J997K9736L8790K8499k8060l3495j8619j9879K4408J5132
14735a0870n105O938J6613J0110J558L4760N4436o697n6368n3101j8993L2733
$$ plain form
14820 -14372 -31349 -47313 -31917 14138 45403 14629 -16616 -7888 3813 25935 -11830 -15436
14808 -15436 5124 17284 34762 29066 48494 44489 15188 27428 15579 23709 32198 2037
14796 2037 -10527 -23739 8002 14061 -19439 -3292 10963 21269 16162 -1926 5328 -13430
14784 -13430 -6373 -5843 -33909 -31809 -21936 -27297 -10328 -24246 -36316 -30077 -14744 -13152 -62237
14771 -62237 -53655 -50794 -64033 -42830 -13222 3870 -23992 -6474 31192 42208 44056 40668
14759 40668 22694 -14298 -12822 6927 -8243 -29298 -10600 -4827 -23185 -4669 12393 4159
14747 4159 -18155 -49379 -47382 -17646 21144 49643 21583 -11912 -30531 -50410 -26002 -10870
14735 -10870 -15975 -9037 7576 17686 19244 54004 108440 101743 45375 -7726 -26719 6014
14723F014j3585k7735L539j424l0846j8396L6014J8191P138k8390j6568J6113
14711d9935O960M015P559K6899L2182m997j4381j9288R459K9860L1980k1907k3183
14698A5223K3055p543k4895k493l8211J1057L1158J3184K6544k8358J8351j9379
14686A7693j9613j3655o453L4669J8066j3388q282k4544l1332o278J0096L1791
14674a1230N780O861o29L3200K5259J0429k0992m8738l1356M3796K0945k6066
14662G259L4721J659J1772j9245q09l873Q96j4912L835J577J546o101o111L6441
14648D8655Q873l7798l8801k4487R32M3416O133k74N06N79Q465Q956j8305j3368
14634f518L624J2239m0051q310Q260K056Q471k455P818n975P996l743Q655k938
$$ plain form
14723 6014 -7571 -35306 -31767 -33191 -64037 -82433 -46419 -28228 -21090 -49480 -66048 -49935
14711 -49935 -42975 -38960 -31401 -4502 27680 22683 8302 -10986 -1527 28333 60313 38406 15223
14698 15223 38278 30735 5840 3347 -34864 -23807 7351 20535 47079 18721 37072 17693
14686 17693 -1920 -15575 -22028 12641 30707 17319 9037 -15507 -46839 -53117 -43021 -11230
14674 -11230 -5450 1411 782 33982 59241 69670 48678 -60 -31416 12380 33325 7259
14662 7259 41980 43639 55411 36166 35357 31484 32380 17468 21303 22880 24426 18325 12214 48655
14648 48655 57528 19730 -19071 -43558 -42626 790 6923 6649 7155 7734 16199 25155 6850 -6518
14634 -6518 -2894 9345 -30706 -39016 -30756 -28700 -20229 -22684 -14866 -20841 -12845 -16588 -7933 -10871
14620a0871k5841j3379M1949N6209J2677k2645k0089J2355k8275l1277k3183k041
14608e4411P304J6617K2946L7094L2590R504O01k5577j0756L907n154o591n531
14595B2543J00r111q536K9607j1232l2106j8484J6112k227K2893J1090j4776n4088
14582d8215j4116M4336K8795J8500j4153k5568P368M8116m466j9230p581K4519
14570C8305K7690j9289l1442m3127k5461j1233M6141n040K1671J5490n639J7179
14558B5245J1719M3240K3852j6374j6502j2548l4588L804J0893r913j4273j9935
14546e380O305k5858k9870J8405L1694K5757K1847K9023J5710M914l0381l8599
14534B3567l229j2719l0312k1293J0158J5799L6802J4583J4750K2653o317k3435
$$ plain form
14620 -10871 -36712 -50091 -8142 48067 60744 38099 18010 30365 2090 -29187 -52370 -54411
14608 -54411 -47107 -30490 -7544 29550 62140 71644 72245 46668 35912 39819 34665 28074 22543
14595 22543 22643 13532 4996 34603 23371 -8735 -27219 -11107 -13334 9559 20649 5873 -48215
14582 -48215 -62331 -17995 10800 29300 15147 -10421 -3053 45063 40597 21367 13786 38305
14570 38305 65995 46706 15264 -27863 -53324 -64557 -18416 -23456 -1785 13705 8066 25245
14558 25245 36964 80204 104056 87682 71180 58632 24044 27848 38741 28828 14555 -5380
14546 -5380 925 -24933 -54803 -36398 -4704 21053 42900 71923 87633 92547 62166 23567
14534 23567 20338 7619 -22693 -43986 -33828 -18029 18773 33356 48106 70759 64442 41007
14522D1007J1928k524j4865O512j7340k6622m3823j6761K3965J3608M752N696
14510a4467J588l7221J9142K5454K5324J7911J3090R07j5420K2921j0274k5236
14498B3719m0806J5040L5967l2753l5811k2715L3971O5016J1867J2639p900k2646
14486C5588P87k1407k0539k9535L232P14m13K2279p447k3078k085k784R052J3225
14472b2411M1441Q251J0265K8274j2678o0579j4586K9041k959j1588K0224j4378
14460a683o715J1632K2644J6696R257m0191l1217J5735J479N436K8664K633L6219
14447G0589k0724m6959J6892k8976j3831l687l95L9432M73k922Q222k266J6938
14434C2786P074j1397J8411K501m7405m3935j153M2626L5704j4196j9119p166
$$ plain form
14522 41007 52935 50411 35546 42058 24718 -1904 -45727 -62488 -38523 -24915 -20163 -14467
14510 -14467 -12879 -50100 -30958 -5504 19820 37731 50821 51728 36308 59229 48955 23719
14498 23719 -17087 -2047 33920 1167 -34644 -57359 -23388 41628 53495 66134 58234 35588
14486 35588 36375 14968 -5571 -35106 -31874 -31160 -31573 -9294 -16741 -39819 -41904 -44688 -35636 -22411
14472 -22411 19030 27281 37546 65820 53142 -7437 -22023 7018 4059 -7529 12695 -1683
14460 -1683 -8398 3234 25878 42574 51831 11640 -19577 -3842 -2363 3073 31737 34370 70589
14447 70589 49865 2906 19798 -9178 -23009 -26696 -27091 12341 12814 9892 18114 15848 32786
14434 32786 39860 28463 46874 49375 1970 -41965 -43118 -492 35212 21016 1897 -5269
14422e269J9501J7198j4403l2858l521J5397M24j3022n009K4749J8956L1682o00
14409E3225l764l0220L17K6093N3869k9340l3017k758p500m2113J263L5113P042
14396B8210J7736L885m5023j4369L1052O976J6601l978P418J398j5007J3056l6416
14383A1539k0057J0619Q881j2471J8704M8792k623k3114k7207k6219J4431L272
14371D547O731j119l2167k1437L790L1392N949m3151m4129N6496N2752N719j0400
14358A4973m127o996L490J1821j0213k4872l8281j2864J7081M6274R573m2848
14346c6989l9683L724K6072L125K7296J7590j5166k7734P575k1057j3442K2358
14334d6331R674j8270K2213J9823l8612L862L6460k171r169r895p474K9971K0081
$$ plain form
14422 -5269 14232 31430 17027 -15831 -19352 -3955 -3531 -16553 -21562 3187 22143 53825 53225
14409 53225 49461 19241 19558 45651 99520 70180 37163 34405 26905 -15208 -13945 21168 28210
14396 28210 45946 49831 4808 -9561 21491 28467 45068 41090 48508 49906 34899 47955 11539
14383 11539 -8518 2101 10982 -1489 17215 66007 63384 40270 13063 -13156 1275 4547
14371 4547 11278 10159 -22008 -43445 -39655 -8263 -2314 -45465 -89594 -33098 19654 25373 14973
14358 14973 10846 3850 7340 19161 8948 -15924 -54205 -67069 -49988 -3714 5859 -36989
14346 -36989 -76672 -72948 -46876 -43751 -16455 1135 -14031 -41765 -34190 -55247 -68689 -46331
14334 -46331 -36657 -54927 -32714 -12891 -51503 -47641 -11181 -13352 -22521 -32416 -39890 -9919 10162
14321A0162k7107j0502J1911J0132L1192K173m5563m100O8408O687l0439O3Q701
14308C1718L0786j6605k3718n671M5660j415k2900N840j09M114j6086l6250j6376
14295b1012j441K9420M0749J4657Q69m7445j0300K8025j8809L868K4954o623j1293
14282B5619k7010l405J57J8651Q669k7986K6663r644k4791k4730k3433L3072M6706
14269A8538J6983j4211k3073k7354k2448J7815k012N76J3561M4185r3k8753j3925
14256b0211L1152j3906j7382l774k1042L5549J8361K0900k2140j5795J5855O882
14244A4449k0498r187J4745j9803K072j5388j7264J4264o28N500p665L571j9j6332
14230e2183J6473M5694L5575K8726k3673l0829l0551L5210K6763k963l8181J1503
$$ plain form
14321 10162 -16945 -27447 -15536 -5404 25788 27961 -17602 -21702 46706 53393 22954 23017 31718
14308 31718 62504 45899 22181 16510 62170 60755 37855 43695 43586 47700 31614 -4636 -21012
14295 -21012 -22453 6967 47716 62373 63242 15797 5497 33522 14713 18581 43535 36912 25619
14282 25619 -1391 -4796 -4639 14012 22681 -5305 21358 11714 -13077 -37807 -61240 -28168 18538
14269 18538 35521 21310 -1763 -29117 -51565 -33750 -35762 -35186 -21625 22560 22467 -6286 -20211
14256 -20211 10941 -2965 -20347 -24121 -45163 -9614 8747 29647 7507 -8288 7567 14449
14244 14449 -6049 -15236 -491 -20294 -18222 -33610 -50874 -36610 -37238 -31738 -39403 -35832 -35851 -52183
14230 -52183 -35710 9984 45559 74285 50612 19783 -10768 24442 51205 48242 10061 21564
14218B1564j4064M856J4517k8421N646m66L6491p668j3438J925j1519j1325m84
14205b386n371r052J5817M0813M1862o615l4017k8397j2427n339P613p49k1327
14192a9575k5618j8957J4546L209J6101P750r083P322p641k357L5975L1604K8860
14179F2136m8805j1693M2226K8525l370j8356k3672r218J1411K312N63j601l4107
14166c649k2777J0965p091J8229L2235J808r789l3891K8212J35J3871n028j9891
14153C339o182j3892j016k2132j6419L0763L4141r846P725j37j6770k8979k4965
14140f4370J6628m469K87L8947J5202j6056N472M30j0447J0125J0420k4659K4148
14127A658K9079k6724j4056l681k7676K5654M3859J108m0600j1015k214j4286
$$ plain form
14218 21564 7500 12356 26873 -1548 4098 3632 40123 32455 19017 20942 9423 -1902 -2386
14205 -2386 -7757 -16809 -992 39821 81683 75068 41051 12654 227 -5112 2501 1752 -19575
14192 -19575 -45193 -64150 -49604 -46395 -30294 -22544 -31627 -24305 -31946 -34303 1672 33276 62136
14179 62136 13331 1638 43864 72389 69019 50663 26991 17773 29184 31496 32059 30458 -3649
14166 -3649 -26426 -15461 -22552 -4323 27912 29720 19931 -13960 14252 14387 28258 23230 3339
14153 3339 -2843 -16735 -17751 -39883 -56302 -25539 8602 -1244 6481 6344 -10426 -39405 -64370
14140 -64370 -47742 -52211 -51924 -12977 2225 -13831 -8359 -7929 -18376 -8251 2169 -22490 1658
14127 1658 30737 4013 -10043 -13724 -41400 -15746 28113 29221 -11379 -22394 -24608 -38894
14115c8894J2063l306p031K1800j2173l322M786n94l1789k1248K9287J129J5766
14102c3526J0605J8478L7965Q627l415j6658k8103J6911m386M139M4671k0567
14090C4741m0714o533K2705j4494j1351q02k1705M262J1000J5255K3291q031j5851
14077h227L7306j1495m4038l5765K0262J3498j2009j7617L2623L282K6437L194
14065G451j3834m2043k5793j1028K5427K1510J1198L5317K2593j0171M98P574
14053B8699k2626k2281n757J8806p748k0488J420p116Q950O452j2634K1382K6
14040a2915l618R666m502K0319K7172L618k6471m493r858j146L803L9251J4671
14027E5497r17m6525j2751L2847L2111k753j9081m1707k3495J1698o275L4333
$$ plain form
14115 -38894 -26831 -30137 -37168 -15368 -27541 -30863 -26077 -26671 -58460 -79708 -50421 -49292 -33526
14102 -33526 -22921 -4443 33522 42149 38734 22076 -6027 10884 6498 10637 55308 34741
14090 34741 -5973 -12506 10199 -4295 -15646 -16448 -38153 -33891 -22891 -7636 15655 7624 -8227
14077 -8227 29079 17584 -26454 -62219 -41957 -28459 -40468 -58085 -25462 -22180 4257 7451
14065 7451 -6383 -48426 -74219 -85247 -59820 -38310 -27112 8205 30798 20627 21125 28699
14053 28699 6073 -16208 -21965 -3159 -10907 -31395 -29975 -37091 -28141 -21689 -34323 -12941 -12915
14040 -12915 -16533 -6867 -11369 8950 36122 39740 13269 8776 -1082 -2228 1575 40826 55497
14027 55497 54580 8055 -4696 28151 60262 57509 38428 -3279 -26774 -15076 -21351 12982
14015A2982K3750k2704J8425J6684l1593l2757Q591j953p067k4950J7268qK0231
14002c101K1957k1697Q533K9581k255m0941k0794k958O48K7659K4117j7757O800
13989I792m5153l3163N4374M4360J156k7312Q81p478k861J1925K747j6042J600
13976e174j835j7673R580J9022K4866n041j8443j0106O768j2301J1930j0330K4046
13963A5309r434l0761j4956k5946p347K536L0417M6295p797j5942j7412n32J3818
13950b1752O775k4601R854k825j178M3898o591l3267n87K2802M857P911m074J297
13936B519K0536j1672L7029M846m0638n022j1339k6061m949J0934J6305K2555
13924A5043l013q442K8518J7759m2192J7763j0787q519J1938l1020m2127j0499
$$ plain form
14015 12982 36732 14028 32453 49137 17544 -15213 -6622 -8575 -15642 -40592 -23324 -23332 -3101
14002 -3101 18856 -2841 5692 35273 33018 -7923 -28717 -31675 -31027 -3368 20749 2992 9792
13989 9792 -35361 -68524 -14150 30210 31366 4054 4935 -2543 -5404 6521 9268 -6774 -5174
13976 -5174 -7009 -24682 -15102 3920 28786 23745 5302 -4804 1964 -10337 1593 -8737 15309
13963 15309 5875 -24886 -39842 -65788 -73135 -70599 -40182 6113 -1684 -17626 -35038 -35570 -21752
13950 -21752 -14977 -39578 -29724 -32549 -33727 10171 3580 -29687 -30274 -7472 -2615 5296 1222 2519
13936 2519 23055 11383 48412 53258 12620 7598 -3741 -29802 -34751 -23817 -7512 15043
13924 15043 12030 3588 32106 49865 7673 25436 14649 6130 18068 -12952 -55079 -65578
13912f5578K1471K8304n400j4019K0213K7737j615m393K1232K0913J1379j7318
13900D2926r145k3093k3727j8931L120J5309J9789j429k7065j2534L0086j294
13888e988k8683O401K5399K168J720J326m021Q432j1227K7892J0738j8243j0535
13875E379k3774J681J6097J3870o148k3736M066L9001K4621m5322j1803K2942
13863A6874M019J4119j6001l6948k395j5852K1407K2236J8448j3500K8824M4431
13851H5662m4028l9240J0197j8570J6540K7044l2754Q468j1703m748K2497K953
13839B2318j6987j0703Q008J9499n26J1770J8041j0825J2882P441l5125j6057
13827I736K6817r720j3202N317R768j1193n723L2376o418o184o72k3444l875l41
$$ plain form
13912 -65578 -44107 -15803 -21203 -35222 -15009 12728 11113 6720 27952 48865 60244 42926
13900 42926 33781 10688 -13039 -31970 -28850 -13541 6248 4819 -22246 -34780 -4694 -5988
13888 -5988 -34671 -28270 -2871 -703 1017 2343 -1678 6754 -4473 23419 34157 15914 5379
13875 5379 -18395 -16714 -617 13253 7105 -16631 -12565 26436 51057 5735 -6068 16874
13863 16874 20893 35012 19011 -17937 -20332 -36184 -14777 7459 25907 12407 41231 85662
13851 85662 41634 2394 12591 -5979 10561 37605 4851 13319 1616 -3132 19365 22318
13839 22318 5331 -5372 2636 22135 21609 33379 51420 40595 53477 60918 25793 9736
13827 9736 36553 26833 13631 18948 28716 17523 11800 44176 37758 31574 30902 7458 3583 3242
13813C242k2222j6015j5974j6670m13K9773L551K7757K2944K9735K1826P192j4860
13800E9866r10j5582k1874j6565P038k9281n387L2643J6020j0507j4837k7370
13788b6746k1351N2109K7004Q671k8473k1298j952J1322J2621m3724m0350q855
13776h1022L1612K8451l0296j6677M703l786r95L6222L1528J7488j1062j8325
13764a2159k0263l189K151K1389O778K308K3484J5985N004j3823j0973o316j4410
13751d034j8163J0567j9524k5280K0732L8425J3156J0664M501J3504j4387k0314
13739I847q029j002J4168o706l300j0405N224k4461l3107j9750l305J6478o167
13726g0515k1163P169M4131K7820J5531l359k8714J498L0068L3145j5958j3311
$$ plain form
13813 3242 -18980 -34995 -50969 -67639 -68052 -38279 -34728 -6971 15973 45708 67534 74726 59866
13800 59866 58956 43374 21500 4935 11973 -17308 -22695 9948 25968 15461 624 -26746
13788 -26746 -48097 4012 31016 39687 11214 -10084 -12036 -714 11907 -31817 -72167 -81022
13776 -81022 -49410 -20959 -51255 -67932 -63229 -67015 -68010 -31788 -260 17228 6166 -12159
13764 -12159 -32422 -35611 -33460 -12071 -5293 -2985 20499 36484 41488 27665 16692 10376 -4034
13751 -4034 -22197 -11630 -31154 -56434 -35702 2723 15879 26543 31044 44548 30161 9847
13739 9847 1818 816 14984 8278 4978 -5427 -203 -24664 -57771 -77521 -80826 -64348 -70515
13726 -70515 -91678 -84509 -40378 -12558 2973 -386 -29100 -27602 2466 35611 19653 6342
13714F342K683j1231K2225l3837p181j6965r297p215J9930K2461J928L845j2165
13701a8477j8471K893k121N200K1082J2723j7799j6608l455K438J6105K8619J5935
13688B8064L6374k4385l4259J9721N856k2966m1172M73K153M729J402M460K8433
13675H883K2238K264N50n382n4164o058M7391J7290n688k0451K2743j2164l685
13662A3767m394O138l4924j6380L1239K6278J2863l394m2268K3313o476j8550
13650a2788l877k2189j5442J3501K4284J7360m3460m1090J7083N1714J8065j1571
13638h410j0082L5086K4262L0531m0124l8208q056K1948o530l698K4637L7272
13626E8628K7155k0786m7952m717o207j3635K2830j6385K069J4589J159j9738
$$ plain form
13714 6342 9025 -2206 20019 -13818 -20999 -37964 -47261 -54476 -34546 -12085 -10157 -6312 -18477
13701 -18477 -36948 -34055 -36176 -30976 -9894 2829 -14970 -31578 -35033 -32595 -16490 12129 28064
13688 28064 64438 40053 5794 25515 31371 8405 -32767 -32294 -30141 -25412 -24010 -19550 8883
13675 8883 31121 33385 33935 28553 -25611 -31669 15722 33012 27324 6873 29616 17452 13767
13662 13767 9373 15511 -19413 -35793 -4554 21724 34587 31193 -11075 12238 5762 -12788
13650 -12788 -16665 -38854 -54296 -40795 -16511 849 -42611 -83701 -66618 -14904 3161 -8410
13638 -8410 -18492 16594 40856 71387 31263 -6945 -15001 6947 417 -3281 21356 58628
13626 58628 85783 64997 17045 12328 6121 -7514 15316 -1069 1000 15589 16748 -2990
13614b990q844J5876P570j4771m316K64J7347O444J7765L34l117q109N394l862
13600B4985j8421K540K0743K1992L3920j8772m7302k3987k3989J9169M0819n25
13588C1172n941J6587J227p911l2550j9496o083O976P669M448o919L335N565j4741
13574a6662m009M31M850k9496k421J7013l4659k519J2194L1640M3327L8231l2744
13561B5176M456O560R846n121p668l2909J3184K794j4937K3441M2169O485O616
13548H0092j2374k5680O834j5761J7969J3367j1949k6158J1001J7914j4970j324
13536C8961r175j2421k8754L458J0447M0565l890J4686m475m7641l0346K5517
13524c068J86k1121J6785J5254P656L009k9251N588j7498j4666q357j1148N679
$$ plain form
13614 -2990 -11834 4042 11612 -3159 -7475 -7211 10136 16580 34345 34679 31562 23453 28847 24985
13600 24985 6564 9104 29847 51839 85759 66987 19685 -4302 -28291 -9122 31697 31172
13588 31172 25231 41818 43045 35134 2584 -16912 -22995 -16019 -8350 -3902 -10821 -7486 -1921 -16662
13574 -16662 -20671 -20240 -15390 -44886 -47307 -30294 -64953 -67472 -55278 -23638 19689 57920 25176
13561 25176 29632 36192 46038 40917 33249 340 13524 16318 1381 24822 66991 73476 80092
13548 80092 67718 42038 48872 33111 51080 64447 52498 26340 37341 55255 40285 38961
13536 38961 29786 17365 -11389 -7931 2516 43081 39191 53877 49402 1761 -28585 -3068
13524 -3068 -2882 -24003 -7218 8036 15692 18701 -10550 -4962 -22460 -37126 -45483 -56631 -50952
13511e0952L8514M8112o620K956Q263l4843Q617K5286j0133k1601R555J5596j3962
13498A8788q18O346k4522L595P731m973K2100K2909j9467k7513M4670K0142l0744
13485C8244l2518P030K6620n474j966j5272k7412j9436J0203j2406K0302j82k0761
13472c3028J4172j1171K4834J4793O103J2584k3901K4985J7307K714R753l3050
13460B6095m2142q047M5017k1251j7858J2114j3206J2526O594Q805R716p386m3120
13447c2143N537N8294q49j8817l4097N336L4407K9072J7329q255r817k5225n6099
13434c5327j27K4789k4557P419p520k466J3843L2860L832K2238P232p370Q114
13421D2960k8773l3976j5266J9930M2572J8361J4228j5565l2973n0739j8344M1217
$$ plain form
13511 -50952 -12438 35674 29054 32010 40273 5430 14047 39333 29200 7599 17154 32750 18788
13498 18788 17970 24316 -206 3389 11120 6147 28247 51156 31689 4176 48846 68988 38244
13485 38244 5726 12756 39376 33902 31936 16664 -10748 -30184 -19981 -32387 -12085 -12267 -33028
13472 -33028 -18856 -30027 -5193 9600 15703 28287 4386 29371 46678 49392 59145 26095
13460 26095 -16047 -24094 20923 -328 -18186 -6072 -19278 -6752 -158 8647 18363 10977 -32143
13447 -32143 -26606 31688 30839 12022 -22075 -16739 17668 46740 64069 55814 45997 20772 -35327
13434 -35327 -35454 -10665 -35222 -27803 -35323 -37789 -23946 8914 12746 34984 42216 34846 42960
13421 42960 14187 -19789 -35055 -15125 27447 45808 60036 44471 11498 -39241 -57585 -16368
13409a6368N4872K2130j4768j104l295j5033j8700q326j2574q238j2731M7396
13397A3261K3301k0019J7506m0454m3645o065N7766K8005j7930j7324l9538k3441
13385f8577L5004L9802k3395r889J131M703J2477J1680r744k2958L8937N2808
13373F1979K732k1124k3369K1062M922j8627j0707l739q179K799J4013k0641k7172
13360b6051k707r766k4431k0193N1617J2611J0275j5383J5127L5682L906k2666
13348H021m4251k8120L2362N0533J3479j7467k785J9942K9728k6684j4697l5965
13336a5904l9847R215k564O362L0414M8602M5821j2301l3031k3964m550j9855
13324a1602l3518K5819K4878k7294l290O302l0938k8196K2801L3305J6161K3794
$$ plain form
13409 -16368 38504 60634 45866 44762 41467 26434 7734 -592 -13166 -21404 -34135 13261
13397 13261 36562 16543 34049 -6405 -50050 -56115 1651 29656 11726 -5598 -45136 -68577
13385 -68577 -33573 6229 -17166 -27055 -25924 -21221 -8744 2936 -6808 -29766 9171 61979
13373 61979 64711 43587 20218 41280 46202 27575 16868 13129 4950 7749 21762 1121 -26051
13360 -26051 -28758 -38524 -62955 -83148 -31531 -18920 -8645 -24028 -8901 26781 30687 8021
13348 8021 -36230 -64350 -31988 18545 32024 14557 11772 31714 61442 34758 20061 -15904
13336 -15904 -55751 -46536 -49100 -42738 -12324 36278 82099 69798 36767 12803 8253 -11602
13324 -11602 -45120 -19301 5577 -21717 -25007 -18705 -49643 -77839 -55038 -21733 -5572 18222
13312A8222L5488j7870J6240k1775m8098P218K1640l744k7465j7423L6066j851
13300c352r069j0369j8461K282J9130K0996m0024l3869O047O4739J2988k238M1728
13287E0528M313m0382p017j7210J3191q008j9726j0136j542o491J9441R797J1553
13274a689L401L5785n678l2181j7976R22K8014P953J1346j1849l5101n633j148
13261b3834j2493L8324J3974l140L0803j8316m2813j4124P576L3779M0008m0361
13249I383k3559p31Q29n386J7398j7524o565j9752M038J167m0034Q322M3579J5559
13235a3276P6j2209P771J3024j632J3091j915k79n0719J529L147J6785k9051j7126
13221g0784J4333K9587L5198K3141K4833K2669J6558o3186j5214L394j6111j3048
$$ plain form
13312 18222 53710 35840 52080 30305 -17793 -10575 11065 7321 -20144 -37567 -1501 -3352
13300 -3352 -12421 -22790 -41251 -38969 -19839 1157 -38867 -72736 -66689 -1950 11038 8800 50528
13287 50528 54841 14459 7442 -9768 3423 -4585 -24311 -34447 -35989 -42480 -23039 -13242 -1689
13274 -1689 1712 37497 31819 -362 -18338 -17416 10598 18551 29897 18048 -17053 -22686 -23834
13261 -23834 -36327 1997 15971 12831 43634 25318 -17495 -31619 -24043 9736 49744 9383
13249 9383 -14176 -14907 -14078 -19464 -2066 -19590 -26155 -45907 -41869 -40702 -80736 -72414 -28835 -13276
13235 -13276 -13200 -25409 -17638 -4614 -6246 6845 4930 4651 -46068 -44539 -41392 -24607 -53658 -70784
13221 -70784 -56451 -26864 8334 31475 56308 78977 95535 32349 17135 20529 4418 -8630
13209h630l1204K2927O2263J7099l9517k5898J6533J9418j9744j4919j7147j0124
13197b8943Q584J6812n755L2485J5823m1912k035J9134j3320N191J0830k320o169
13184H405j3338O115L221P25L560K467J8156l3926k305L409K619j1509l2250k1418
13170f6069J9479k8375K2530j5295k51K0088Q02P667k323K834J2835K4144Q156
13157F222j2893j5774k6971M7729K4186l6920j8002l7463J8806M7576J4891Q210
13145A9597K7052m1300m4531k0565J7321L3083M2455K8932j5017k848k2539j0012
13133A1628q420q104J2691k856P95k8230l114J766R170N102j3242K1233K7392
13120B5811k3952k5620l74J8190n77P48O972l4911j9162k4393J5325O0051K053
$$ plain form
13209 -8630 -39834 -16907 45356 62455 22938 -2960 13573 32991 13247 -1672 -18819 -28943
13197 -28943 -20359 -3547 -9302 23183 39006 -2906 -4941 14193 873 6064 16894 14574 8405
13184 8405 -4933 1182 4403 5128 8688 11155 29311 -4615 -6920 -3511 -892 -12401 -44651 -66069
13170 -66069 -46590 -74965 -52435 -67730 -67981 -47893 -47091 -39424 -41747 -38913 -26078 -1934 6222
13157 6222 -6671 -22445 -49416 -1687 22499 -14421 -32423 -69886 -51080 -3504 11387 19597
13145 19597 46649 5349 -39182 -59747 -42426 -9343 33112 62044 47027 44179 21640 11628
13133 11628 3208 -4896 7795 4939 5734 -22496 -25610 -23844 -14674 -9572 -22814 -1581 25811
13120 25811 1859 -23761 -24135 -5945 -6522 -5774 1198 -33713 -52875 -77268 -61943 -1892 161
13107A61j797j728q37K3598J4230P3J843l2267j8140k3466j5804K4320J040l8905
13093f7679k3335K9794M5707r586Q754K6216K3203j2354l779j1270o16j339N376
13080I092K2539j2923k4377j4267J0332J1217k0698m066J7137J4961M0897l6964
13068A2880m4818L362r809j6071J0441l38o728q425J5779M2722o388m398l053
13055a4844j6145K1744L4224J06r56j8689j1033J6780l1802k2062j1437J0528
13043d3586J3903j6871M217M6007J4711J0525N770k5553p747l7806l4142L3131
13031c7441q339J4514J0549k644j0651j3682L1581l3485j2708K4702O1217K2757
13019D6370j5942K940j0349j3243l59k6071Q642J7576M7242M975l0385l0336P988
$$ plain form
13107 161 -1636 -3364 -4201 19397 33627 33700 35543 3276 -14864 -38330 -54134 -29814 -28774 -67679
13093 -67679 -91014 -61220 -15513 -25099 -16345 9871 33074 20720 16941 5671 5055 3716 9092
13080 9092 31631 18708 -5669 -19936 -9604 1613 -19085 -23151 -6014 8947 49844 12880
13068 12880 -31938 -28576 -38385 -54456 -44015 -44353 -51081 -59506 -43727 -1005 -7393 -11791 -14844
13055 -14844 -30989 -9245 24979 25085 24129 5440 -5593 11187 -20615 -42677 -54114 -43586
13043 -43586 -29683 -46554 -42337 3670 18381 28906 34676 9123 1376 -36430 -70572 -37441
13031 -37441 -45780 -31266 -20717 -23361 -34012 -47694 -16113 -49598 -62306 -37604 23613 46370
13019 46370 30428 33368 23019 9776 9417 -16654 -8012 9564 56806 61781 31396 1060 9048
13006I048k4004l0725J6204L423k776l329q74J5275M383j5219j8439j0178k2101
12993g9312M0556L4760J8030J8024O499k056j8556J9702K6064j7287o187k0973
12981A9264O405O196l1245p602o220m160k33J4362K6825j3028k1234N38N2527
12968D2395k4757j2110K0464r134k1426K771j101l1956k313K9665J8265K6163
12956C6926k1829l1280K580J6244O356J2252j7543m5178j18K7317r220j7631J7892
12943b3232L8241N750m1879p602N024L2725J7507o155K4829m080k8940k5432m434
12930a7678J3990O993K7477J6485k3814l1200l3937k4097K5731K7174O432n050
12918a1494J1680L6403O157m7103k0047O687J6607J6404L6266J2884k9057k9381
$$ plain form
13006 9048 -14956 -45681 -29477 -26054 -28830 -32159 -33033 -17758 -13375 -28594 -47033 -57211 -79312
12993 -79312 -38756 -3996 14034 32058 38557 36501 17945 37647 63711 46424 40237 19264
12981 19264 25669 31865 620 -6982 -13202 -17362 -17595 -3233 23592 10564 -10670 -10132 42395
12968 42395 17638 5528 25992 16858 -4568 -1797 -2898 -34854 -37167 -7502 10763 36926
12956 36926 15097 -16183 -13603 2641 8997 21249 3706 -41472 -41590 -14273 -23493 -41124 -23232
12943 -23232 15009 20759 -21120 -28722 -23698 9027 26534 20379 45208 41128 12188 -13244 -17678
12930 -17678 -3688 3305 30782 47267 23453 -7747 -41684 -65781 -40050 -12876 -6444 -11494
12918 -11494 186 36589 42746 -4357 -24404 -17717 -1110 15294 51560 64444 35387 6006
12906F006l2073k0474N309M1837K3172P990q33J8016k5182k3403k7581O963N953
12893a4300j0062l246j0776M03J3811k2630M4343K4575j0073J9028j4702k2011
12881e640N657R251j6619k9202K7502J3321l0374k5835J4817K1383R059p367P133
12868f914J2081l0090j5093J1715J8955K5334Q02k1253l5166J7995J3684K3628
12856A5678j2393L640J4126J2852j1302k8187j7128J157l1821j0999r76K3684
12844d1669N178o431P942K1467k0289j868n127L5986L1158p823L0325j4296j6900
12831A7653J2301l095k6082j6537J197j1161o566J0993j7790K835j5670J001n643
12818e6564q179K1460N821j1133o91k530j2806Q237J3268k10n472J0972J2821
$$ plain form
12906 6006 -26067 -46541 -41232 605 23777 31767 30934 48950 23768 365 -27216 -20253 -14300
12893 -14300 -24362 -27608 -38384 -37981 -24170 -46800 -2457 22118 12045 31073 16371 -5640
12881 -5640 17 9268 -7351 -36553 -9051 4270 -26104 -51939 -37122 -15739 -6680 -14047 -6914
12868 -6914 5167 -24923 -40016 -28301 -9346 15988 16790 -4463 -39629 -21634 -7950 15678
12856 15678 3285 6925 21051 33903 22601 -5586 -22714 -21557 -53378 -64377 -65353 -41669
12844 -41669 -36491 -42922 -34980 -13513 -33802 -35670 -40797 -4811 26347 18524 48849 34553 17653
12831 17653 29954 26859 777 -15760 -14563 -25724 -32290 -21297 -39087 -36252 -51922 -50921 -56564
12818 -56564 -64743 -43283 -37462 -48595 -49286 -51816 -64622 -56385 -43117 -43327 -48799 -37827 -25006
12805b5006N249k776Q600O450R629J5869k1829K26J2365l774L2896Q294j9245
12792B6948j7138l9007L240N4053Q78l5410j9636n874O176K5494J2857l613j9837
12779a0869j246L197j3827J8014Q641j6324N479J6961m4114J5202J8828K6993
12767B6935J3350l2479k6958j6682M925l4692J7678K9785j1060j3689J6317J2549
12755a4021J0874N8235J0587n2551j7752K2396j9676j3682K7843j9773j7367M0111
12743A5224L564j0629K1524Q640k1279l1112m154L0969L5922l0151k1377N191
12731B332o670k7237L08J2645L687J485Q83J70l1672j9147J2776K6073j2242j5666
12717e2275J9539M4400k109k2797j8542M521j9362q639l0670N159L9793M3922
$$ plain form
12805 -25006 -19757 -22533 -13933 -7483 2146 18015 -3814 -3588 8777 5003 37899 46193 26948
12792 26948 9810 -29197 -25957 28096 28974 -6436 -26072 -31946 -25770 -276 12581 8968 -10869
12779 -10869 -12115 -8918 -22745 -4731 3910 -12414 -6935 10026 -34088 -18886 -58 26935
12767 26935 40285 7806 -19152 -35834 -30909 -65601 -47923 -18138 -29198 -42887 -26570 -14021
12755 -14021 -3147 55088 65675 13124 -4628 17768 -1908 -15590 12253 -7520 -24887 15224
12743 15224 18788 8159 29683 38323 17044 -14068 -18222 12747 48669 18518 -2859 2332
12731 2332 -4338 -31575 -31267 -18622 -14935 -13450 -12567 -12397 -44069 -63216 -50440 -24367 -36609 -52275
12717 -52275 -32736 11664 9555 -13242 -31784 -27263 -46625 -55264 -85934 -80775 -40982 2940
12705B940k0814j1370K5978l176J1819j8595j7778j6066J4307L7823L3379j8099
12693B0348k0369j8774J747j6343n3194M6952O0282M781k126j8959j2409j259
12681i323k6117n011M0246R403k5242l1744M4042p345m2156j2088L283K4932M6816
12668I696L5223L764k0422q283k202k933j6127k6048J1070J8169k0649R794j1778
12655b0726j2161J3854J2821p190m6395k114J1944j0214K7669K2171K1951k3200
12643a1590J8465M276m4676j0874K6712N3697l370J2631k3003p904R228j4074
12631I518j6826J3549R392k0888O366L954n670K9573J7848l3987k211j7939P004
12618c17J4048r819O616N21j3797j5854J0591k9401k0321M3886M7723J913N483
$$ plain form
12705 2940 -17874 -29244 -3266 -6442 5377 -13218 -30996 -47062 -32755 5068 38447 20348
12693 20348 -21 -18795 -17048 -33391 -86585 -39633 20649 25430 23304 4345 -8064 -9323
12681 -9323 -35440 -40451 -205 9198 -16044 -47788 -3746 -11091 -53247 -65335 -62052 -37120 9696
12668 9696 44919 48683 28261 19978 17776 14843 -1284 -27332 -16262 1907 -18742 -8948 -20726
12655 -20726 -32887 -19033 -6212 -13402 -59797 -61911 -49967 -60181 -32512 -10341 11610 -11590
12643 -11590 6875 11151 -33525 -44399 -17687 36010 32640 45271 22268 14364 23592 9518
12631 9518 -7308 6241 15633 -5255 1111 5065 -605 28968 46816 12829 10618 -7321 -317
12618 -317 13731 3912 10528 11049 -2748 -18602 -8011 -37412 -57733 -13847 33876 35789 41272
12605D1272k305o105l0017L512O713o627J4186q544j3217k0947M66J5649M234
12592a730l731k5833k409M8796J4599k2189L2882r314J4067k4253j4375L659k0105
12579i936J3356M1817l6093q657K9136j0924j7195l1451l3289P265K0007L3583
12567b381r762j0964L7378L9799j3164k7410m100n2147j1463J9795J3989K1002
12555E72M4080J2630l8835n0755p076J2961L3148k1940k1795J1740K4745m60j3403
12542a4388j6976K4964K5595j0701M218K7047j9876k1367K4420j0793L080J4205
12530B9428M92N765r512N278J8639N936K0849K3024j3670k7871j8477r526L004
12517C3359J6325K1273P0861J22448R3904j743r6649n5821p5153n3014Q371k372
$$ plain form
12605 41272 38967 32862 2845 6357 13070 6443 20629 12085 -1132 -22079 -21613 -5964 -1730
12592 -1730 -5461 -31294 -33703 15093 29692 7503 40385 31071 45138 20885 6510 10169 -9936
12579 -9936 3420 45237 9144 487 29623 18699 1504 -29947 -63236 -55971 -35964 -2381
12567 -2381 -12143 -23107 14271 54070 40906 13496 9396 -42751 -54214 -34419 -20430 572
12555 572 44652 57282 18447 -32308 -39384 -26423 6725 -15215 -37010 -25270 -525 -985 -14388
12542 -14388 -31364 -6400 19195 8494 12712 39759 19883 -1484 22936 12143 15223 29428
12530 29428 29920 35685 26173 31451 50090 56026 76875 99899 86229 58358 39881 30355 33359
12517 33359 49684 70957 141818 264266 358170 356427 259778 203957 128804 75790 84161 81789
12505H1789n5796l7102K4964j6331K8303j048p569J2358m0782j5911K5532q43
12493b436j1865O930K6331j4625k9571k1209j5518l55j070J6056m079M1954M5398
12480C5941L0354m348l398j5684k500J3586O365j5595l3568l0298N541k1035l5374
12467g0013j7093J5280K4818M1320L2503K0887j984j0760J637k6007k6202p625
12455b3239J3651L5926l0876l4735j2876J9879M2262R306m795k7684J023K2168
12443A0010O987J9773l5223j564M678o37k6830j0043q825O026K2197K9571L6938
12430E3058n514k4736K028j578K6713L5119M9975J5605q8813l7557J1039l6445
12418a106K1094J4932K9356k1303k3747m2993K6516R108J1628J8721R212j4633
$$ plain form
12505 81789 25993 -11109 13855 -2476 25827 24779 17210 29568 -11214 -27125 -1593 -2436
12493 -2436 -14301 -7371 18960 4335 -25236 -46445 -61963 -62318 -63388 -47332 -51411 -9457 35941
12480 35941 66295 61947 58549 42865 40365 53951 60316 44721 11153 -19145 -13604 -34639 -70013
12467 -70013 -87106 -71826 -47008 -5688 26815 47702 45718 34958 36595 10588 -15614 -23239
12455 -23239 -9588 26338 -4538 -39273 -52149 -32270 9992 19298 14503 -13181 -12158 10010
12443 10010 16997 36770 1547 -17 4661 4024 -22806 -32849 -41674 -35648 -13451 16120 53058
12430 53058 47544 22808 24836 23258 49971 85090 135065 150670 61857 24300 35339 -1106
12418 -1106 19988 34920 64276 42973 19226 -23767 2749 11857 23485 42206 51418 36785
12406C6785O646k3438M903K3677r031j34M072k7263k5641J9925J7737k6942j8687
12393a7391L4615P395m028K2381J5666k9797k5740J3224P668j2813m4019k4959
12381e7798m857J5406L7134J2210k164k113p286K6176J8724J0791k3476J8071
12369D0818R110k5491l1024j4658p48R15N7551P852K377m84l4060j5006L0101
12356B7253K790P635j9604j6732Q548J0172J2502L418J4840k854m9645l0483J1390
12343b0770N349j5339O140k57j4367J5963M20j2539K1339J1860k2662j2965K4522
12330a3306K9136M047l7034j4960J4911L56J7649Q527l412J9921J6391j5993l2597
12317f364J0821k6582O272n688q908k4531L9941N0435j0707k4134j464N252N561
$$ plain form
12406 36785 43431 19993 24896 48573 39542 39408 43480 16217 -9424 10501 28238 1296 -17391
12393 -17391 17224 24619 20591 42972 58638 28841 3101 16325 23993 11180 -32839 -57798
12381 -57798 -62655 -47249 -10115 2095 -69 -2182 -9468 16708 35432 46223 22747 40818
12369 40818 49928 24437 -6587 -21245 -21993 -21078 36473 44325 46702 46218 12158 -2848 27253
12356 27253 30043 37678 18074 1342 9890 20062 32564 35982 50822 47968 -1677 -32160 -20770
12343 -20770 -15421 -30760 -24620 -24877 -39244 -23281 -22861 -35400 -14061 -2201 -24863 -37828 -13306
12330 -13306 15830 19877 -17157 -32117 -17206 -16850 799 9326 5914 25835 42226 26233 -6364
12317 -6364 4457 -22125 -15853 -21541 -30449 -54980 -15039 35396 24689 555 -909 4343 9904
12304I904K4491J4832l8069l0546j7820l1234k2007M0794K5005k018J7971q352
12292a7049j4933K5906J3894q51r136j5270k451O834r824Q086K0970J4637k206
12279A8607l2632q058P576O152M7142l5403m3985j27J7008J0159R253j7415k1994
12266d3717J0820K7838k9507K1727J7643p136l99k2261j1962k0627k331K0681
12254c9231R0M7085J8216k398l3165k0432p112M1409J4503O783J2793J2375j3419
12241C7497K342r416l8083j9168n785j9925j434J1464J7131M840l4499J3901J2439
12228b8696j0493k2034m062M2324Q087K952J9628N4367L654j2208k9373l5898
12216a1752O889M915r229n360K3910J2448k2344j5144j960j974J74M531n898j6645
$$ plain form
12304 9904 34395 49227 11158 -19388 -37208 -68442 -90449 -49655 -24650 -26668 -8697 -17049
12292 -17049 -31982 -6076 7818 6967 -2169 -17439 -19890 -13056 -22880 -14794 6176 20813 18607
12279 18607 -14025 -22083 -14507 -8355 38787 3384 -40601 -40728 -23720 -13561 -4308 -21723 -43717
12266 -43717 -32897 -5059 -34566 -12839 4804 -2332 -2731 -24992 -36954 -57581 -59912 -39231
12254 -39231 -39141 7944 26160 23762 -9403 -29835 -36947 4462 18965 25748 38541 50916 37497
12241 37497 39839 30423 -7660 -26828 -32613 -52538 -53972 -42508 -25377 -20537 -55036 -41135 -28696
12228 -28696 -39189 -61223 -65285 -22961 -14874 -11922 7706 62073 65727 53519 24146 -11752
12216 -11752 -4863 52 -9177 -14537 9373 21821 -523 -15667 -17627 -19601 -19427 -14896 -20794 -37439
12202c7439J0030J6000k6n486M439J1682K932K1896P974L521j6776K8447K9258
12189G6452k2299l0980j6198K3K1325n2455j8207R219k2840k1914K6606J9403
12177c1865J1121k497j5756j7565L1848L5132K0113J4388j1476j6505l901k9153
12165a6116L4411K1704r605L967J187j8595q10j9356L003j0690k4846j6001L1637
12152b0110J2441j2363J1714N276K580P22k1386k7642m82k202K4342J3338J7230
12139C458L4332K3367j954j3836J1974q204o344j3916J7000J9579J6608j9743
12127F2321n1641l0237J9732j3785l2857P76L0266k880J4859k735J6967p11k5526
12114a5451O999J5957J9164M915J1523m960k0705m1437J9800j6003K59J842k1003
$$ plain form
12202 -37439 -27409 -11409 -11435 -16921 -12482 -800 2132 24028 32002 35523 18747 47194 76452
12189 76452 54153 23173 6975 6998 28323 -24132 -42339 -33120 -55960 -77874 -51268 -31865
12177 -31865 -20744 -23241 -38997 -56562 -24714 10418 30531 44919 33443 16938 13037 -16116
12165 -16116 18295 39999 30394 34361 35548 16953 16143 -3213 -210 -10900 -35746 -51747 -20110
12152 -20110 -7669 -20032 -8318 -3042 -462 260 -21126 -48768 -49250 -51452 -27110 -13772 3458
12139 3458 37790 61157 59203 45367 57341 49137 42793 28877 45877 65456 82064 62321
12127 62321 10680 -19557 175 -13610 -46467 -45691 -15425 -18305 -3446 -6181 10786 10075 -15451
12114 -15451 -8452 7505 26669 31584 43107 38147 17442 -23995 -4195 -20198 -19939 -18097 -39100
12101c9100J1497K7632j651l6902j481K2376k0565k7244J8381J5136j1383P402
12089c5902k5656J092M277Q244K6700K1522P766K7832k4750m3119j0545r032J2661
12076c8910l240j3949j830k9142q380N1230K4318l455K470k7446k7047o112j8561
12063a00054j365K7998L3993K7739j566n06N973k5487j4693N9953L0090j5793
12051B6282j2392j7237j3584k422j4560L840o888J0492N986K406O073L6126k704
12038B1418n7123j583L3929K9880M261k0029m9625k7752K0020M3207K9017J5112
12026D0732n129k5889J1499j6253k7707n194K0046J3649j9953k7255L146L63r818
12013d7763n866J1304L1091j2117J2390Q472J7079p853j0458l981M551M6317N524
$$ plain form
12101 -39100 -27603 29 -1622 -38524 -40005 -17629 -38194 -65438 -47057 -31921 -43304 -35902
12089 -35902 -61558 -60466 -56189 -47945 -21245 277 8043 35875 11125 -31994 -42539 -51571 -38910
12076 -38910 -42150 -56099 -57929 -87071 -95451 -44221 -19903 -23358 -20888 -48334 -75381 -81493 -100054
12063 -100054 -101419 -73421 -39428 -11689 -13255 -13761 -7788 -33275 -47968 11985 42075 26282
12051 26282 13890 -3347 -16931 -19353 -33913 -30073 -36961 -26469 -20483 -18077 -12004 24122 21418
12038 21418 -35705 -37288 -3359 26521 30782 10753 -38872 -66624 -46604 -3397 25620 40732
12026 40732 35603 9714 21213 4960 -22747 -27941 -7895 5754 -14199 -41454 -38308 -37945 -47763
12013 -47763 -53629 -42325 -11234 -23351 -10961 -2489 14590 6737 -3721 -7702 -3151 43166 48690
12000D8690n057k8340Q696p82j1868M7577K6010m3252m3237j4862o738O349M039
11987a2775K2971J3346r535j93J3392J7437q597k2038k0714l93K2164Q290N435
11974B8790j03j2065j1212K8594j1025m063J2643P128k9555j4649j8320k5754
11962d9591K3620k5536j9313K1230M3702q941n7444j9174J3033K6868j5053j439
11950f8038K5054J9450L3735P945J3825k4610k1882p376J3480k6526l977j1128
11938e0048j3067j5956L9279L3311K2966l4333l9711M333K1718O404j5607P808
11926c2903k670j6662J0927J3799K7411j9103K3767K2847m736O486j4914k205
11914A2044j2644L217j4897M526K8506K5191j7590j792j4699n42k230k7609p167
$$ plain form
12000 48690 43633 15293 23989 23207 11339 58916 84926 41674 -1563 -16425 -23163 -16814 -12775
11987 -12775 10196 23542 14007 13814 27206 44643 36046 14008 -6706 -7099 15065 23355 28790
11974 28790 28687 16622 5410 34004 22979 18916 31559 38687 9132 -5517 -23837 -49591
11962 -49591 -25971 -51507 -70820 -49590 -5888 -14829 -72273 -91447 -78414 -51546 -66599 -68038
11950 -68038 -42984 -23534 10201 18146 31971 7361 -14521 -21897 -8417 -34943 -38920 -50048
11938 -50048 -63115 -79071 -39792 -6481 16485 -17848 -57559 -53226 -31508 -25104 -40711 -32903
11926 -32903 -35573 -52235 -41308 -27509 -98 -19201 4566 27413 22677 29163 14249 12044
11914 12044 -600 2617 -12280 -7754 20752 45943 28353 26561 11862 11320 9090 -18519 -25686
11901b5686l526J8008O455j4319R498J7403q141j0286O372P627Q25J9638j1122
11888A2746j5938j0437q463p218K3293P9215O719l1430k8592k4428N03m989k7442
11875c6461j0078L2436K9853k9032R517K1457j7876k8610n029j6875o293L2167
11863b4824L6030M6798K172l9220Q549J2794k4609M621j7202n687J6548J1477
11851B7447j2400m1560l1971K2311L9356L2513o417k1933l573k2283Q138N830
11839d542k5022p183N263N5139J5660k6243k7808L8270o502K2598J0366M14j8008
11826C2402k0588K6621L1154j9481J5244N103l612q808k9871j6343j0188j613
11814B0k5806k712q280J7064J466r390J6458K1116J4276j6363K39P335R354j008
$$ plain form
11901 -25686 -29212 -11204 -4749 -19068 -9570 7833 -308 -10594 -4222 3405 4230 23868 12746
11888 12746 -3192 -13629 -22092 -29310 -6017 73198 79917 48487 19895 -4533 -4030 -9019 -36461
11875 -36461 -46539 -14103 15750 -13282 -3765 17692 -184 -28794 -33823 -50698 -56991 -24824
11863 -24824 11206 58004 60176 20956 29505 42299 17690 22311 5109 -578 15970 27447
11851 27447 15047 -26513 -58484 -36173 3183 35696 29279 7346 3773 -18510 -10372 -4542
11839 -4542 -29564 -36747 -31484 23655 39315 13072 -14736 23534 17032 39630 49996 50410 32402
11826 32402 11814 38435 69589 50108 65352 70455 66843 58035 28164 11821 1633 20
11814 20 -25786 -28498 -36778 -19714 -18248 -27638 -11180 9936 24212 7849 8088 15423 24777 23769
11800B3769l64m058j1445n8246k7661K5359K3437L7329K0472J9931J124j7951
11788C1696l0900J9071J6739k9469K082j4252k2337J9370k8761m289M9210j15
11776H045k3989k1057J1710J1082k6958r059J8551K7015M7353j6504k0499k3802
11764a8112p607J6225J6244Q449k1321L55N2975m0377n5858n795q60K7866J6780
11751a1036K0683L954P262K152k2590j5508j6730j0127o436p720p661j0452J122
11738g3087O563L1336L773j5188K4393j435l0413r065J7446M6L835J4049L8749
11725A1002J241j2886N717J5071Q95J5874M465M040j207O412r748n6805j2100
11712b8029J4784k4712m70j860M660J2216k3665l1066K649J6414L358J1159k834
$$ plain form
11800 23769 23405 19347 7902 -50344 -78005 -52646 -29209 8120 28592 48523 49647 31696
11788 31696 796 19867 36606 7137 9219 -5033 -27370 -8000 -36761 -41050 8160 8045
11776 8045 -15944 -37001 -25291 -14209 -41167 -50226 -31675 -4660 42693 26189 5690 -18112
11764 -18112 -25719 -9494 6750 15199 -6122 -5767 47208 6831 -49027 -54822 -55682 -27816 -11036
11751 -11036 9647 13601 20863 23015 425 -15083 -31813 -41940 -48376 -56096 -63757 -74209 -73087
11738 -73087 -66524 -35188 -31415 -46603 -22210 -23645 -54058 -63123 -45677 -45631 -41796 -27747 11002
11725 11002 12243 -643 5074 20145 21040 36914 41379 45419 44212 50624 40876 -15929 -28029
11712 -28029 -13245 -37957 -38427 -40287 -35627 -23411 -47076 -78142 -75493 -59079 -55721 -44562 -47396
11699d7396l0485N311J9124K3666Q40n210J693J3787J2382l1917j3340P581n044
11686d9008l063K7169p570m7407J700K2322M2588N8560o347m7342k0119m492L1012
11673a997K4157j6710l8261K7136m994K0880l4287J605K4125p930l6099J3564
11661b8811K4850M7844N883l9631N0K0208K3391j9002m0030k2794p98j3061J14
11648d1787K6496J9225n623K2117j020P760r898l7731n946M995n1564j756J2586
11635f2146L5566K1063J3512J7584p518j5745M8592P549k2223k0051O06j1160
11623E629J49k0031j3646L2308K0571j5878l0595O802p66m865J5312J2210o847
11610C53m2416r985L7036N7305J5544m3862j8595n031L3248m241J571K3883Q50
$$ plain form
11699 -47396 -77881 -72570 -53446 -29780 -28940 -34150 -32457 -18670 -6288 -38205 -51545 -43964 -49008
11686 -49008 -52071 -24902 -32472 -79879 -78179 -55857 -13269 45291 38944 -8398 -28517 -33009 -1997
11673 -1997 22160 5450 -32811 -5675 -10669 10211 -24076 -22471 1654 -6276 -42375 -28811
11661 -28811 -3961 43883 49766 10135 10185 30393 53784 34782 -5248 -28042 -28840 -41901 -41787
11648 -41787 -15291 3934 -1689 20428 19408 27168 17270 -20461 -26407 -21412 -72976 -74732 -62146
11635 -62146 -26580 -5517 7995 25579 18061 2316 50908 58457 36234 16183 16789 5629
11623 5629 5778 -14253 -27899 4409 24980 9102 -21493 -14691 -15457 -20322 -5010 7200 353
11610 353 -42063 -52048 -15012 42293 57837 13975 -4620 -9651 23597 19356 20927 44810 45660
11597D5660j5768j3227O619k6475j3003j807l228M528k5250j7313L9285L9893
11585A9914k4688l1339O461Q295M6221R421m1683j8610J4079J4731p090q197j7909
11572c0394m5656J4453K5861j9937j0315m964o109J5926Q818N857J8936J6934
11560a0590L2425L6375K874m7650j4035K6628j0455l0330M389j840o002J0469
11548g742J3701K746J0019r645O135J367j3719k2201k3425K4904K4267K9604l381
11535C2630l8975q048J180j1146k2743J4248J5517M1509k829j8261M352J3873
11523B1307j1584K9834N907l3361j4746j003l084K3045K5950q335J3514L1082
11511G8526l0053R615j1569j2255j3770J4814J6218m563k3616P738O19P105O023
$$ plain form
11597 45660 29892 16665 23284 -3191 -16194 -18001 -21229 -16701 -41951 -59264 -19979 19914
11585 19914 -4774 -36113 -29652 -21357 24864 34285 -7398 -26008 -11929 2802 -4288 -12485 -30394
11572 -30394 -76050 -61597 -35736 -55673 -65988 -70952 -77061 -61135 -52317 -46460 -27524 -10590
11560 -10590 21835 58210 61084 13434 -601 26027 15572 -14758 -10369 -12209 -18211 -7742
11548 -7742 5959 8705 18724 9079 15214 16581 2862 -19339 -42764 -17860 6407 36011 32630
11535 32630 -6345 -14393 -13213 -24359 -47102 -32854 -17337 24172 21343 3082 7434 21307
11523 21307 9723 39557 45464 12103 -2643 -3646 -6730 16315 42265 33930 47444 78526
11511 78526 48473 58088 46519 34264 20494 35308 51526 46963 23347 31085 31704 38809 44832
11498D4832M687l70j9304p86J6630J1086j4789j4686J3404j3589o4034j3794L9529
11485a1184K3860M386j4140k1212N058J2358o470l017k5465j1317K4702j9699
11473d2140j6762L7259K861j9514L916J8356J9833O962n439o267p475j179j5948
11460b5537j5075J3382m342l2293k4068L3888K8421L6590P619k7033k1599N77
11448b9470J8774K8146k2613p549K3813O135j7445j6970J450l652L8675j26p400
11435A1768j5922j2491j6560K9876J8637l220J3144k125k6755j835k7169j8032
11423e0684J4452j1790K2878M404J3943J7398j3914j2526j481J2131l910o048
11411a5147q197k5168o675N590L6523K2274l1727O733O6902K8556j4174m2561
$$ plain form
11498 44832 49519 49149 29845 29059 45689 56775 41986 27300 40704 27115 -36919 -50713 -11184
11485 -11184 12676 17062 2922 -18290 -13232 -874 -7344 -10361 -35826 -47143 -22441 -42140
11473 -42140 -58902 -21643 -18782 -38296 -34380 -16024 3809 10771 5332 -935 -8410 -9589 -25537
11460 -25537 -40612 -27230 -31572 -63865 -87933 -54045 -25624 10966 18585 -8448 -30047 -29470
11448 -29470 -10696 17450 -5163 -12712 11101 17236 -209 -17179 -15729 -19381 19294 19168 11768
11435 11768 -4154 -16645 -33205 -3329 15308 12088 25232 23107 -3648 -5483 -32652 -50684
11423 -50684 -36232 -48022 -25144 -20740 -6797 10601 -3313 -15839 -17320 -5189 -9099 -15147
11411 -15147 -23344 -48512 -55187 -49597 -13074 9200 -22527 -15794 51108 79664 65490 22929
11399B2929q635K8613k3456o229j0123n084k314L530k4436l4090L474M2605L622
11386i594r462j2631P508M6346N932n2460l813K84K4024r311L653j7437l8011
11373f4972Q922O1843K8416k5110j2608K004j4463k485k513M9274M4464j8183
11361E4589L439k262m191M269q553k4629k4733j1736L5013L0234j1369R805J4425
11348F4301J1699k7565q787j9876J0763j6373l783k9008j5362r701j8398M4305
11336a7785M9619J1133k3090m937R762j9444R012M8066j4512r544k0143j4575
11324C562j4395p717K0222Q28J7251Q013L8472J9453k8539J956o3000m0908O16
11311d4186K9781J6371j2043j1054j180L3325K3001j5650j469K8461r69O488P58
$$ plain form
11399 22929 14294 42907 19451 13222 3099 -1985 -4299 -769 -25205 -59295 -55821 -13216 -9594
11386 -9594 -19056 -31687 -24179 22167 28099 -24361 -28174 -27890 -3866 -13177 -9524 -26961 -64972
11373 -64972 -56050 5793 34209 9099 -3509 -1505 -15968 -18453 -20966 28308 72772 54589
11361 54589 58028 55766 51575 55844 47291 22662 -2071 -13807 21206 51440 40071 49876 64301
11348 64301 76000 48435 39648 19772 30535 14162 10379 -18629 -33991 -43692 -62090 -17785
11336 -17785 31834 42967 19877 14940 24702 5258 14270 62336 47824 38280 18137 3562
11324 3562 -10833 -18550 1672 2500 19751 27764 66236 85689 57150 59106 -3894 -44802 -44186
11311 -44186 -14405 1966 -10077 -21131 -22311 11014 34015 18365 16896 45357 44388 50876 51634
11298E1634r006p481k5178J7303K4905K5230j5111k3387K352M987J6571N487r740
11285E8566n996q979O086j5915p51J7904r543j3419K1458j6196o0394n1764k5251
11272a04194K2828K6243M5289K6702k0417k4245j275M9628j9838L4949Q049O550
11260E0269j2227m3703j3413J4282O583k4523m121K8019J5582J8809M6288k06
11248H1639J837q596K430m7840k0560K6728L6360o233m1666j3184J5139O914K6286
11235E9254R842j0050m9441m1601J2736K5901J5185N97k1587j0998J7334P324
11223A4496o569k3510l106K6394j2728J6696J3384L1568p842J0546n802k0481
11211C3046j701J2987l3102n5064j0184K7730N0806M263J3489J2873q394j887
$$ plain form
11298 51634 42628 35147 9969 27272 52177 77407 62296 38909 41261 46248 62819 68306 58566
11285 58566 52570 43591 49677 33762 33011 50915 41372 27953 49411 33215 -27179 -78943 -104194
11272 -104194 -81366 -55123 -9834 16868 -3549 -27794 -29069 20559 721 35670 43719 50269
11260 50269 38042 -5661 -19074 -4792 1791 -22732 -26853 1166 16748 35557 81845 81639
11248 81639 83476 74880 77310 29470 8910 35638 71998 65765 24099 10915 26054 32968 59254
11235 59254 69096 59046 9605 -31996 -19260 6641 21826 22423 836 -10162 7172 14496
11223 14496 7927 -15583 -18689 7705 -5023 11673 25057 56625 48783 59329 53527 33046
11211 33046 31345 44332 11230 -43834 -54018 -26288 24518 28781 42270 55143 46749 44862
11199D4862k244J9821l4124m5143j0856L0728r29j5864J4101k421Q463m791m3183
11186d1580J3041L7103J1968j3133j4364l0904Q886J1725J7279K678J35k4738
11174b1904J6701J9962R035J8060m021j149j5485L5162K4690l5902m320J2823
11162E3652J8880l5049l7705J1435L8798P631j6704o241k6091K1112N584J7260
11150E2562K035o685J9564M6077L6297N582K5478M8902R5791J37347K10844L49364
11138A023158M18260M24953J79433q4314k45544l91818l66032k45866j68383j25488
11128D18359q8032k9464j5300k5512n9542l8670K4725M2712J453n777l2909m7968
11116A44075l5570O6156K2603j0760j4842P168J0141k2223l7246m0394p581J5353
$$ plain form
11199 44862 42618 62439 28315 -16828 -27684 3044 2115 -13749 352 -2069 6394 1603 -41580
11186 -41580 -28539 8564 20532 7399 -6965 -37869 -28983 -17258 21 2699 2834 -21904
11174 -21904 -5203 14759 23794 41854 37833 36684 21199 56361 81051 45149 40829 53652
11162 53652 72532 37483 -222 11213 50011 57642 40938 34697 8606 29718 35302 52562
11150 52562 54597 47912 67476 113553 149850 155432 180910 229812 325603 462950 673794 1023158
11138 1023158 1441418 1866371 2045804 1961490 1715946 1324128 958096 712230 543847 418359
11128 418359 330327 300863 285563 260051 200509 161839 186564 229276 230729 224952 192043 144075
11116 144075 108505 174661 197264 186504 171662 178830 188971 166748 129502 89108 81527 96880
11104I6880j351K9941K5112j3359k5175j7402J938k18K0670l0587m7272K0710
11092E9887K3854l050k4220P619l351J6117J719j1705J1559j7772j0609K7252
11080G7300J7129k1824k0266l3090k0465P097J2504j0060j1095n773N202j4973
11068a8314L0497M7281K0074k1626j9522j1611l2345J8240j4000k5486K6142j553
11056b223J3313j9003k088J9787K2357N882k3505K1239O624j0544J2769j1525
11044C3083J4798R821j6469K1704K2376K3561j9751l1855j7320j0168r935J6933
11032C6778O368K9082l189l4189j7070K3712L217n6359O7r031o872M1332r64o94
11018A2188K5574J1029j6087M227J3215k4622j88R354J3783l847k023j1323n22
$$ plain form
11104 96880 95529 125470 150582 137223 112048 94646 96584 96366 117036 86449 39177 59887
11092 59887 83741 80691 56471 64090 60739 76856 78575 66870 78429 60657 50048 77300
11080 77300 94429 72605 52339 19249 -1216 5881 18385 8325 -2770 -8543 -3341 -18314
11068 -18314 12183 59464 79538 57912 38390 26779 -5566 12674 -1326 -26812 -670 -2223
11056 -2223 11090 -7913 -10001 9786 32143 38025 14520 35759 42383 31839 44608 33083
11044 33083 47881 57702 41233 62937 85313 108874 89123 57268 39948 29780 19845 36778
11032 36778 43146 72228 69039 34850 17780 41492 44709 -11650 -11583 -20614 -27486 13846 12882 12188
11018 12188 37762 48791 32704 36931 50146 25524 25336 34690 48473 44626 42603 31280 30758
11005C0758j8904j2640j5353j5488L6897L0318j1738j4441J8104l167k1163J8805
10993B1988p842J8324p069J0723J8337J5028N6099j9333L7234N1335J9858L5729
10981B50411K784k3696P119P31k8057k7219j3504q346k1890m52l4679j8343l707
10968H1152M0028l4790r020k5109N60R150j3408M0150P3684o1178m6298j2386
10956D2535k716k2322j5901M0727L3245J347K4475K1613J3110j83o426j7601j9066
10943I2837J1517k2020O905j139K4459L56Q265o775R93m909l4892n9429m2511
10930b6343J4254J6482K7487L2743Q429j8121j1577L0198J6027Q21r681l3116
10918D7603k445L7460j1478j7162m484M0350R485n527k5255k388p240j571r879
$$ plain form
11005 30758 11854 -786 -16139 -31627 5270 35588 23850 9409 27513 24346 3183 21988
10993 21988 14146 32470 25401 36124 54461 69489 125588 106255 143489 194824 214682 250411
10981 250411 253195 229499 236618 237349 209292 182073 168569 160223 138333 137881 103202 84859 81152
10968 81152 121180 86390 77370 52261 52821 61971 48563 88713 162397 101219 54921 42535
10956 42535 39819 17497 1596 42323 75568 76915 101390 123003 136113 135930 129504 111903 92837
10943 92837 104354 82334 89239 88100 112559 112915 121180 114405 115398 110489 75597 16168 -26343
10930 -26343 -12089 4393 31880 64623 73052 54931 43354 73552 89579 90400 80719 47603
10918 47603 45158 82618 71140 53978 49494 89844 99329 93802 68547 66159 58919 57348 47469
10905D7469o517j4568j9411L6693O7819N307l0226j2253p599J4108n708K2075
10893I7189J8997j3614k6693j120J5300n290J5407R436J1664M898M002k1780k6376
10880H2020n691j1084j2554L0943J8708K2693j243L0858N6063l0702j0252j5304
10868A54455q618L4456J7389K411p360N1224P826N287M6517R7821J12379K41986
10856G55773K89998L28423K67729K07444Q0369m7773j73655k46070k48625j36015
10846A077598r1978o8885m1534J5670K675l0486o5202r0300o1963k385N588k6819
10834F21979o721L2559J8025k0043m0040N7r341K7542k382m790j0890O091K9301
10821F41347l2811r268k3207N904O609R984K8868j041N470j612j5230r154r703
$$ plain form
10905 47469 40952 26384 6973 43666 111485 116792 86566 74313 66714 80822 75114 97189
10893 97189 116186 102572 75879 74759 90059 84769 100176 109612 121276 126174 130176 108396 82020
10880 82020 76329 65245 52691 83634 102342 125035 123792 154650 210713 180011 169759 154455
10868 154455 145837 180293 197682 200093 192733 243957 251783 257070 303587 401408 513787 755773
10856 755773 1045771 1374194 1641923 1849367 1929736 1881963 1708308 1462238 1213613 1077598
10846 1077598 985620 916735 875201 890871 893546 863060 797858 707558 645595 643210 648798 621979
10834 621979 615258 647817 665842 645799 605759 605816 596475 624017 621635 616845 605955 612046 641347
10821 641347 608536 599268 576061 581965 588574 598558 627426 626385 631855 630243 615013 605859 596156
10808E96156J7617o128n934k0057K0463J4798K3985K6226L279j2267k8892j7120
10796F12126J9442J8243k4427j3552J1972N361j1184L2775M8153J2489J2443M8930
10784G72771K9821M7032M0915Q098m662M8089M4317K3462k3235J4767J5995K9015
10772A046385J458J3458k965J9316M6911L6608N1263N7154J17743Q7699O3611
10761A538641M9355P2370R7347J35749J51408J31254J42751J71299K23041K34655
10751B947870L45101M51582N71316O52376O03956M48587L70218K74474K82802
10742F948282M76056P68725J077288J444713J971481K605772L397253M341557
10734B3031127N736718Q249833J2925835K1701592L7699542O0645257P9045497
$$ plain form
10808 596156 613773 607645 601711 581654 602117 616915 640900 667126 670405 658138 629246 612126
10796 612126 631568 649811 625384 611832 623804 629165 617981 650756 698909 711398 723841 772771
10784 772771 802592 849624 890539 898637 893975 942064 986381 1009843 986608 1001375 1017370 1046385
10772 1046385 1047843 1061301 1058336 1077652 1124563 1161171 1212434 1269588 1387331 1475030 1538641
10761 1538641 1587996 1660366 1757713 1893462 2044870 2176124 2318875 2490174 2713215 2947870
10751 2947870 3292971 3744553 4315869 4968245 5572201 6020788 6391006 6665480 6948282
10742 6948282 7424338 8193063 9270351 10715064 12686545 15292317 18689570 23031127
10734 23031127 28767845 37017678 49943513 71645105 109344647 169989904 249035401
10727B49035401P7395368L9669175m704317l7381668p3556246p1623663m8201213
10720A30632837k8991699j7780380j1765181q578499o623889n562150m741638
10713D6589401l901417l245229k775961k297490j845762j425384j064229q03598
10705B9230331p12049q01671j028072j109322j212896j115576r16874p76774p44490
10696B0812607p14135p09639p10033o11281n48681n19931l98099l47902k52774
10687A6000132k05522k68241l43900m44010m47694n03567n54655m87197m25752
10678A2319594l32742k90242l48255k69602k74723k60118k52938k59375k69245
10669I762354k53568j93790k17148k07026j61412j90047j70285j97301j70627
$$ plain form
10727 249035401 326430769 366099944 361395627 324013959 250457713 178834050 130632837
10720 130632837 101641138 83860758 72095577 63517078 56893189 51331039 46589401
10713 46589401 42687984 39442755 36666794 34369304 32523542 31098158 30033929 29230331
10705 29230331 28518282 27716611 26688539 25579217 24366321 23250745 22333871 21557097 20812607
10696 20812607 20098472 19388833 18678800 18067519 17518838 16998907 16600808 16252906 16000132
10687 16000132 15794610 15526369 15182469 14738459 14290765 13787198 13232543 12745346 12319594
10678 12319594 11986852 11696610 11348355 11078753 10804030 10543912 10290974 10031599 9762354
10669 9762354 9508786 9314996 9097848 8890822 8729410 8539363 8369078 8171777 8001150
10660H001150k07912k00534j61662j85040j57984j50018j79081j22503q8879j37205
10650F410332j04954j13962j18378q1992j02847r2927n3490p4844j26032j21818
10640E419088p9045p7300q0990n7483q9233q3614r8701r9929p8213j05611j11723
10629D457246j31975j32571l2698n9089p2643q9600o2870l8140o6274o2658p7287
10618C631441j15991j08127m7093k3578n4113p8298n9003k0072o0276n7215k5548
10607B982127K628L0257N3161J08760K44301K68669J74076M9679q7373q4544j75823
10596C565918j92854n1018j10521j27228o6140p5105q0552p5829q1156j12711
10586B592804q3001n9317l6811n8349j02845o1775j5457J1746j9020l6220j5775
$$ plain form
10660 8001150 7793238 7592704 7431042 7246002 7088018 6938000 6758919 6636416 6547537 6410332
10650 6410332 6305378 6191416 6073038 5991046 5888199 5795272 5741782 5666938 5540906 5419088
10640 5419088 5340043 5262743 5181753 5124270 5035037 4951423 4852722 4752793 4674580 4568969 4457246
10629 4457246 4325271 4192700 4160002 4100913 4028270 3938670 3875800 3837660 3771386 3708728 3631441
10618 3631441 3515450 3407323 3360230 3336652 3282539 3204241 3145238 3125166 3064890 3007675 2982127
10607 2982127 2984755 3015012 3068173 3176933 3421234 3689903 3863979 3913658 3826285 3741741 3565918
10596 3565918 3373064 3322046 3211525 3084297 3018157 2943052 2862500 2786671 2705515 2592804
10586 2592804 2509803 2450486 2413675 2355326 2252481 2190706 2175249 2186995 2167975 2131755 2115980
10575B115980l0116k7908m4342m9078l6351n9511k0231l1421q2324o0270l1232
10564A643196k8636l8079l5697K9214K7617J5607j9011j6640j1336l1248j5709
10553A519278l8145k5573n5179k0458r730j6769k3786j9540m3147l7809j2232
10542A216910l4528m8293n1545l3046m7601j7725J1987j5409p895p232j643o902
10530I57078k0614k4528k6592J8072K9043l9164m2528j5879J9921N678l0870Q016
10518H37633j4253m3650l0501J9953k1822k0837p882j0148n130L851n691n125
10506F96398r289k3248J5031k0667k9972j386J7197l1060k0939J9670L4975n1421
10494E95289p7865k9749p827M231j555M3717m57m6282L1450M0434l78m5820p948
$$ plain form
10575 2115980 2085864 2057956 2013614 1964536 1928185 1868674 1848443 1817022 1734698 1674428 1643196
10564 1643196 1614560 1576481 1540784 1569998 1597615 1613222 1594211 1577571 1566235 1534987 1519278
10553 1519278 1481133 1455560 1400381 1379923 1370193 1353424 1329638 1310098 1266951 1229142 1216910
10542 1216910 1182382 1134089 1082544 1049498 1001897 984172 996159 980750 972855 965623 963980 957078
10530 957078 936464 911936 885344 903416 932459 893295 850767 834888 854809 860487 829617 837633
10518 837633 823380 779730 749229 769182 747360 726523 718641 708493 703363 707214 701523 696398
10506 696398 687109 663861 678892 658225 628253 626867 644064 613004 592065 611735 646710 595289
10494 595289 517424 487675 479848 484079 482524 526241 525784 479502 510952 551386 551008 505188 497240
10481D97240K799j0559R725K0594l4833l1573N425m310k3286j4410r92R025j4082
10468D10763r808j2029k0911l5305q035j2713L1773J4343m620L2567j1506l0621
10456C43898j6701n220k8962j072l072M346K72J4689O43J8899J7000j3961j9381
10443C11378j6785j1390J2848j9959Q52m143l7403j4475K6913J4757j9285J0681
10431B53989M0095j4304n0046j7143J1516k5460J5669K0318O086j5254N24L5531
10419B61521j2750J859l5215j8493O097L2082r463j9020l643p323J2073l828l1121
10406A72776n663j1013K2402P210k1290r999k0637J6600k241N34L9791r388k0582
10393A58500j2659n156K0217l2487l3404J9579K2321Q577k4253K7525J7698n73
$$ plain form
10481 497240 500039 489480 499205 519799 484966 453393 458818 454508 431222 416812 415820 424845 410763
10468 410763 400955 388926 368015 332710 324675 311962 343735 358078 353458 386025 374519 343898
10456 343898 327197 321977 293015 291943 288871 293217 293489 308178 308821 327720 344720 330759 311378
10443 311378 294593 283203 296051 276092 276944 272801 235398 220923 247836 262593 243308 253989
10431 253989 294084 279780 229734 212591 224107 198647 214316 234634 240720 225466 225990 261521
10419 261521 248771 250630 215415 196922 203019 235101 225638 206618 202975 195652 207725 203897 172776
10406 172776 167113 156100 178502 185712 164422 154423 133786 150386 148145 148679 188470 179082 158500
10393 158500 145841 140685 160902 128415 95011 114590 136911 145488 121235 148760 166458 165885
10381A65885m211Q183O63j8286l0296J409J8852o049k1148J3050J8871J3966j4209
10368A46680N916L3326j291k803k7385l6641j3769M571K492o362k492K1924l3464
10355I0702j8489K642p85L378N957K1838K4863K3349p396n807J2781M146l452
10342A53727K4707O2617P0457N7797M625k4036J7182j3818L8609K9983J2999Q293
10330D43142j2404o9720k9195l4719l7508o977r701m8996j6319K9664P1828L2745
10318C11840K1701L8882R0162J07012K48614L89032M39113L68113J24650r5683
10308B043436k78724l99211l57238k57028j26340p8921q4914p5457j7489n0393
10298C17721l036J1946K1670n768l3366m872o0070m4639o700R033R302j5118l8627
$$ plain form
10381 165885 161674 169857 170520 152234 121938 123347 142199 136150 115002 128052 146923 160889 146680
10368 146680 152596 185922 184631 181828 154443 117802 104033 108604 111096 104734 102242 124166 90702
10355 90702 72213 74855 74070 77448 83405 105243 130106 153455 146059 140252 153033 157179 153727
10342 153727 178434 241051 311508 369305 373930 349894 367076 353258 391867 421850 434849 443142
10330 443142 430738 361018 331823 297104 259596 252619 242918 193922 177603 207267 279095 311840
10318 311840 333541 372423 462585 569597 818211 1207243 1646356 2014469 2139119 2043436
10308 2043436 1764712 1365501 1008263 751235 624895 545974 461060 385603 368114 317721
10298 317721 314685 326631 348301 342533 309167 304295 244225 199586 192886 201919 211221 196103 157476
10285A57476K501M827K0994J5135J1417P685k5332k1809r653M3951K8386j7226
10273B18352j9977M303J6134j1417J4069N691j3218O289k4749k8328J1515k5042
10261A53622l675j1344k6166J0718R185j1454l2843j377J1462M02P324j3894K8595
10248A20555K0977l4590M679j0991j7772J519r994j549O303J937k125k6489j3315
10235C9145j6260m381J74M3491J5063p9j9340O02q868j5345p483N5622J4276o630
10221H9987J6720p841j9928J1171j4077k2570k547m382p410L2366K0568k259J6905
10208A06703k2129k3314J4199J4790L3630J0339k6790n5602n278L2159l0756j8504
10196B9447K8614L2000k6805l4296J9399J3495j0336j614L2912J541J3992P947
$$ plain form
10285 157476 159977 164804 185798 200933 212350 220035 194703 172894 163241 207192 235578 218352
10273 218352 198375 202678 218812 207395 221464 227155 213937 220226 195477 167149 178664 153622
10261 153622 149947 138603 112437 123155 132340 120886 88043 86666 98128 98530 105854 91960 120555
10248 120555 141532 106942 111621 100630 82858 84377 74383 72834 79137 81074 78949 52460 39145
10235 39145 22885 18504 18678 62169 77232 77153 57813 58415 49547 34202 26719 82341 96617 89987
10221 89987 106707 98866 78938 90109 76032 53462 50915 46533 39123 71489 92057 89798 106703
10208 106703 84574 61260 75459 90249 123879 134218 107428 51826 46548 78707 47951 29447
10196 29447 58061 90061 63256 28960 48359 61854 51518 49904 82816 84357 98349 106296
10184A06296j927Q0186O4793L4585j9708k5826n7819n9501j2690q862K1727k4507
10172I6747m8226l6229l2069O360J6881J926k8544K0857K4317K5885J2845k6710
10160C4040j0640k454J5259J7260j007K7104P769j066n929p255o02N289l3032
10147D4736j0779O842j8746j7121j0550J3843k324J3708J2722J3101R323q587
10135D6168k0403k383J8523p891j2009j3977M786q039K1530k5290q442n63r196
10122a7186L9782K8014q624J0573l6874l8484l344j9355J1255J1950P722o278
10110b0849r681N642N9913l100k9670J685j805o623k1371J2963K3578j487k4583
10097a5388M6569L7355l5129l6386K4115K8377J17q170k3986R115L6017J9061
$$ plain form
10184 106296 104369 184555 249348 283933 264225 238399 180580 121079 108389 99527 121254 96747
10172 96747 48521 12292 -19777 -13417 3464 5390 -23154 -2297 22020 47905 60750 34040
10160 34040 23400 20946 36205 53465 52458 79562 87331 86265 80336 73081 72479 77768 44736
10147 44736 33957 40799 22053 4932 -5618 8225 5901 19609 32331 45432 54755 46168
10135 46168 25765 23382 41905 34014 22005 8028 12814 4775 26305 1015 -7427 -7990 -17186
10122 -17186 22596 50610 41986 52559 15685 -22799 -26143 -45498 -34243 -22293 -14571 -20849
10110 -20849 -30530 -24888 35025 31925 2255 3940 2135 -4488 -25859 -12896 10682 9195 -15388
10097 -15388 31181 68536 33407 -2979 21136 49513 49630 41460 17474 26589 62606 81667
10085H1667n2571j7318P612J9388o610l1404k7840J498R160J3770J6031m613k0946
10072a2176N2882j0815j8540k0957j0194k2877J7137K3809K181N959j1113k7400
10060c2104P501K9829k2916q921K1298p55l204M0411j463m0701k7206L16j0986
10047d8901K6896J8336N7448j630k7691N75M0083k6706l7914J534J7678J0866
10035C0574l4125M007L0475o66k0767j3889n092k2036j100k4379K8044J5966K7158
10022A4170Q71k2578j8528n331k1502J6171n188k7122j5905M6129K4691J1792
10010b330J7851k8612K1246k17K576N264Q165L1013P728j0893j434l7641J1041
9997B3757J7186K3133j3883m1851L1320R737j3058P115L1027J4370j3444l8580
$$ plain form
10085 81667 29096 11778 19390 38778 32168 764 -27076 -25578 -16418 -2648 13383 8770 -12176
10072 -12176 40706 29891 11351 -9606 -19800 -42677 -25540 -1731 450 6409 -4704 -32104
10060 -32104 -24603 5226 -17690 -26611 -5313 -6068 -9272 31139 29676 -11025 -38231 -37915 -48901
10047 -48901 -22005 -3669 53779 52149 24458 25033 65116 38410 496 2030 19708 30574
10035 30574 -3551 456 30931 30265 9498 -4391 -9483 -31519 -32619 -56998 -28954 -12988 14170
10022 14170 15041 -7537 -26065 -31396 -52898 -36727 -41915 -69037 -84942 -38813 -14122 -2330
10010 -2330 15521 -13091 8155 7938 10514 15778 23943 54956 62684 51791 50357 12716 23757
9997 23757 40943 64076 50193 8342 39662 49399 36341 43456 74483 88853 75409 36829
9985C6829k0287n388j0592Q091J8508M56O665j8207l0205k1554J0955M9463J1416
9972C6150K7918j7875j6569p634R202j9523j4984j3659k1271l192L3891N1501
9960D3955M5374k7869m0470j0686k3588j3220K2638l1760k091K2742K2618K3124
9948C0767J3580K702J6570k3201R518J6979k6388l2427l3472K9927M0918j3370
9936C2103l2961M546L616J4908L9731K646k6339k796q540k8173j8422O016j974
9923a5639k0841P850J2144l3624N401k445R007L1641N1273kj9056K3801P586p801
9909D9295M416J3774k6479q467J9189o741o1609N858N1197K5050o175l8676q151
9896A2481j469j5754K2782M667J4039j29n934N403J2344J1861L548l0189l0329
$$ plain form
9985 36829 16542 11154 562 8653 27161 27617 34282 16075 -14130 -35684 -24729 24734 36150
9972 36150 64068 46193 29624 21990 31192 11669 -3315 -16974 -38245 -41437 -7546 43955
9960 43955 89329 61460 20990 10304 -13284 -26504 -3866 -35626 -37717 -14975 7643 30767
9948 30767 44347 47049 63619 40418 49936 66915 40527 8100 -25372 4555 45473 32103
9936 32103 -858 3688 7304 22212 61943 64589 38250 35454 26914 -1259 -19681 -13665 -15639
9923 -15639 -36480 -28630 -16486 -50110 -44709 -47154 -38147 -6506 44767 44765 25709 49510 57096 49295
9909 49295 53711 67485 41006 32539 51728 44987 -16622 -10764 40433 65483 59308 20632 12481
9896 12481 11012 -4742 18040 22707 36746 36617 30683 36086 48430 60291 63839 33650 3321
9883C321j1616K9809r140K2552J5278J5896J6697J9289n3161j7629N642j5150
9871B1788J2362K4432r436m81pJ0652r600k6076j9584J3854M7503K1523P020j4959
9857G8991k9566l4742j1413L3199J5286o1077k5898L5908J9233r060J0545J0164
9845C1570l2362j2426K6780J517m496k0565j5608q016J2943L0802J8554K3601
9833E2294j1509K1738n429j8003L9922P584l2551o446r304k1435J8502q208k3928
9820C227J7678l8873l3228J1445J3154K3572n615j469N0046J3543j1841j6764
9808B4875k4568j9600M9419P770p579Q321L9409j101o029j9311J083r583j6360
9795B6746K9287j5700k0402q487k2906p129l812N662q631n370P776L2336L0677
$$ plain form
9883 3321 -8295 21514 12374 34926 50204 66100 82797 102086 48925 31296 36938 21788
9871 21788 34150 58582 49146 48665 48658 59310 49710 23634 4050 17904 65407 86930 93950 78991
9857 78991 49425 14683 3270 36469 51755 -9322 -35220 688 19921 10861 21406 31570
9845 31570 -792 -13218 13562 15079 10583 -9982 -25590 -33606 -20663 10139 28693 52294
9833 52294 40785 62523 57094 39091 79013 86597 54046 47600 38296 16861 35363 27155 3227
9820 3227 20905 -17968 -51196 -39751 -26597 -3025 -8640 -10109 39937 53480 41639 24875
9808 24875 307 -19293 30126 37896 30317 38638 78047 76946 70917 51606 52689 43106 26746
9795 26746 56033 40333 19931 11444 -11462 -18591 -22403 -16741 -25372 -30742 -22966 9370 40047
9782D0047j6692j0835R178M8020L859M614j4431j0056k1069j0565k3740o004P416
9769b58J1827J3844J6858J2442J4345j7851j6445j6495r351Q331K4045J622l8783
9756D131j1185j2921j3961K8819r440m660L2974l341q942j1557P458J4718J5225
9743B7318J0799m8411R00L2898j800j0501j9013l446L6316j5427k1295J2490K2920
9730B3748Q493J1377K3951O562j122j2615j5921k18J2854M187j2747J3782J1244
9717G3575l5674m2685j8362j237K6192J9650j2350j0493r828P799k546r335M4004
9704B8710L909k3914k3625K6215R223j8059L562j2172J2532J7466j0412L819J7224
9691C4478L164p873k8635j8433N526j4602Q962K245K5063J0255k1634j3467M7746
$$ plain form
9782 40047 23355 12520 21698 69718 73577 78191 63760 53704 32635 22070 -1670 -7674 -258
9769 -258 11569 25413 42271 54713 69058 51207 34762 18267 8916 17247 41292 42914 4131
9756 4131 -7054 -19975 -33936 -5117 -14557 -19217 13757 10416 1474 -10083 -2625 12093 27318
9743 27318 38117 -10294 -9394 23504 21704 11203 -7810 -11256 25060 9633 -11662 828 23748
9730 23748 32241 43618 67569 74131 73009 60394 44473 44255 57109 61296 48549 62331 73575
9717 73575 37901 -4784 -23146 -24383 1809 21459 9109 -1384 -11212 -3413 -5959 -15294 28710
9704 28710 32619 8705 -14920 11295 20518 2459 6021 -6151 6381 23847 13435 17254 34478
9691 34478 37642 29769 1134 -17299 -11773 -26375 -17413 -15168 9895 20150 -1484 -14951 32795
9678C2795m033l5999j2732m5266J5148K3400K401k680M5406K1972r235j0j6183
9665A4984j639L1527k2011q416l0711k71j8353k3234M3730K8364L5863N642l0224
9652B5251l3457l024J2262q883J9392K0288J5374P558j6117k3729k9148J724N252
9639g257j4417L4381O0293L3168m0215k3783k2360l2840j3162J9337j8903n226
9627c0984N230J9948r50O690K9441m6409l6880L12M3557J4276k5719J5271K5292
9614A9075J7889Q116j7308j6443P662P41N8143P171j6432k0498n420k2473j1544
9601H679q728J4339q644P328J7967r548J3378P493P060J3947l411k2610j6283
9588B0967K2825M6206k505m2068J4656K4424k8480l1242j069R856J4488j174j862
$$ plain form
9678 32795 28762 -7237 -19969 -65235 -50087 -26687 -24286 -26966 18440 40412 31177 31167 14984
9665 14984 13345 44872 22861 14445 -16266 -16537 -34890 -58124 -14394 13970 49833 55475 25251
9652 25251 -8206 -11230 1032 -7851 11541 31829 47203 54761 38644 14915 -14233 -12509 -7257
9639 -7257 -21674 12707 73000 106168 65953 42170 19810 -13030 -26192 -6855 -25758 -30984
9627 -30984 -25754 -5806 -6756 -66 29375 -17034 -53914 -53602 -10045 4231 -21488 -6217 19075
9614 19075 36964 45080 27772 11329 18991 19732 77875 85046 68614 48116 42696 20223 8679
9601 8679 -49 14290 5646 12974 30941 21393 34771 42264 49324 63271 59860 37250 20967
9588 20967 43792 89998 87493 45425 60081 84505 56025 24783 23714 33570 48058 46884 45022
9575D5022M5195J3315n5474l3247Q322K8598K4441l7232j7844O566p691L282R
9562B3262k6115j099K927L4551k8275n0757r552K6061l3048k1673L7280L2472
9550a3966k2530M6687O2031k1360l9780J782N631j650n2288j4486K1736L638j1251
9537c5806N891K1125J9513K03m918L7465K577k339k2421l4017j057R100J1830
9524G146m8350k846J7773L4445J2945r481o196j2387Q519j2428j0782P085k6194
9511d0751j1901K5213J8162K2891l1649l020J1032P972l220k5046K9236L2236
9499C1155m961r829K8455k7799l2338J0022P95j1709j4262J5147k492l2239O166
9486d3889N1973k4100l7176m932Q375M8245L8241M125L859j2680k6748J5171K5599
$$ plain form
9575 45022 90217 103532 48058 14811 23133 51731 76172 38940 21096 27662 19971 23253 23262
9562 23262 -2853 -3952 -1025 33526 5251 -45506 -55058 -28997 -62045 -83718 -46438 -13966
9550 -13966 -36496 10191 72222 50862 11082 12864 18495 16845 -35443 -49929 -28193 -24555 -35806
9537 -35806 -29915 -8790 10723 10926 6008 43473 46050 43711 21290 -12727 -13784 -4684 7146
9524 7146 -41204 -44050 -26277 8168 21113 11632 5436 -6951 1568 -10860 -21642 -14557 -40751
9511 -40751 -52652 -27439 -9277 13614 -18035 -21055 -10023 -2051 -5271 -30317 -1081 31155
9499 31155 26194 16365 44820 17021 -15317 -5295 -4500 -16209 -30471 -15324 -17816 -50055 -43889
9486 -43889 8084 -16016 -53192 -58124 -49749 -1504 36737 40862 44721 32041 5293 20464 46063
9473D6063O831l1056m5734P979K9185j593p883o431L885r47m8112J7880O156j8424
9459d2201J3069M9045K0767J6259J5417J1452k4511l7897l1574P419J3522K3098
9447C3865L0672k6343l9646k1236L3545k5957P13K186j5523j1647m266O700K3183
9434a3754J9305K0483p866q795j5644N083N1191j0811k1197J084O317m898P773
9421B8271k0983j9964q486K3825J7902R559O360k5218k1648j766L5946J8678r465
9408C3011n9182K348M6301J9654j9572k1177p188k0593J033J7662L4197k7996
9396a502n2002J5976L615j9768M279L4035K4959m753j1765N711J4680j6797j3243
9383a6575J4909j0677P780L7909L4323l1881k3338k676P76q50k3596N383L3460
$$ plain form
9473 46063 52894 21838 -23896 -15917 13268 11675 3792 -2639 1246 299 -47813 -29933 -23777 -42201
9459 -42201 -29132 19913 40680 56939 72356 83808 59297 21400 -10174 -2755 10767 33865
9447 33865 64537 38194 -1452 -22688 10857 -15100 -14387 -12201 -27724 -39371 -43637 -36937 -13754
9434 -13754 5551 26034 18168 9373 -6271 -1188 50003 39192 17995 19079 25396 20498 28271
9421 28271 7288 -12676 -21162 2663 20565 30124 36484 11266 -10382 -12148 23798 42476 33011
9408 33011 -26171 -23823 22478 42132 22560 1383 -5805 -26398 -25365 -7703 26494 -1502
9396 -1502 -53504 -37528 -33913 -53681 -49402 -15367 9592 4839 -6926 -1215 13465 -3332 -16575
9383 -16575 -1666 -12343 -4563 33346 67669 35788 12450 9774 10550 9700 -13896 -8513 24947
9370B4947O098j6413J546p060J4704J1762k5976j2849M3022L0544k7099k3361
9358A9865j4511M898N719j1431J9072O050J2505L407R827o430O358o513j3051
9345C5765r414L3453K6603P070J7242J8413l8375J2222q370o682O336P42q129
9332H6876L2291j2342n4149k5086K3107K0194L167l5010m53P731l2044k7186L3970
9319B1066K8333K1318k7833l1831P482J5063L9029K5362l0077j9482m338P844
9307E1936j4344J9439l654J7369L5053p537k7183j5923p574q4J0178o1378M692
9294I90J7795p265K8066K6611r396R204P608L5706q295k6383p020l4225j4636
9281A8760M0817M922j2224l4225j0388O345J9900M753k1886K1301K7229K1066
$$ plain form
9370 24947 31045 14632 16178 9118 23822 35584 9608 -3241 39781 70325 43226 19865
9358 19865 5354 10252 15971 4540 23612 29662 42167 45574 55401 48971 55329 48816 35765
9345 35765 26351 59804 86407 93477 110719 129132 90757 102979 94609 87927 94263 95005 86876
9332 86876 119167 106825 52676 27590 50697 70891 74058 39048 38595 46326 14282 -12904 21066
9319 21066 49399 70717 42884 11053 18535 33598 72627 97989 67912 48430 44092 51936
9307 51936 37592 57031 53377 70746 105799 98262 71079 55156 47582 47498 57676 -3702 990
9294 990 18785 11520 39586 66197 56801 66005 73613 109319 101024 74641 67621 33396 18760
9281 18760 59577 64499 52275 18050 7662 14007 33907 38660 16774 38075 65304 86370
9269H6370j671J2014J8964P265j5196K4464l577k0842k6085P916N313K3530N798
9256A24263M108j4843j3115J3442L2789p231J0901r647L4350K8366k9280O157
9244A80260L0070l03K4766K6920R794n746L200M165O337R984Q599J1880P2509
9231C82435N2106L5728L4703L2961M1614M9523P3839P9764O9771J04697R7114
9220A054255Q6893J47726J56445J72855K38800K58700K43635K29358K90863K92213
9210C171743J97721J46520L5806m1478j40973j90352k10175k26783k38854j93308
9200B309867j72712j70656j84133j28504r9265q1509q5117j06047q7125p9191
9190A115608n0449m8428l7541p2873l9725m7957k2844n8927m4335k5924j4403
$$ plain form
9269 86370 84699 96713 115677 122942 107746 132210 128633 107791 81706 89622 94935 118465 124263
9256 124263 128371 113528 100413 113855 146644 139413 150314 140667 175017 203383 174103 180260
9244 180260 210330 210027 234793 261713 271507 265761 268961 273126 279463 289447 298046 309926 382435
9231 382435 434541 470269 504972 537933 579547 629070 702909 782673 852444 957141 1054255
9220 1054255 1141148 1288874 1445319 1618174 1856974 2115674 2359309 2588667 2879530 3171743
9210 3171743 3369464 3515984 3551790 3510312 3369339 3178987 2968812 2742029 2503175 2309867
9200 2309867 2137155 1966499 1782366 1653862 1554597 1473088 1387971 1281924 1194799 1115608
9190 1115608 1065159 1016731 979190 906317 866592 818635 795791 736864 692529 666605 652202
9179F52202j9155k5299J5958N663m079k2807o8307m3267m3163M0351J4670j9869
9167D82898j7909j1076p815M810j4696R459k3279q020j0243k9749l9844k0644
9155C13892L178j3473k8247m2265K3443J1826P1o456L4149L2298j5145o212j7669
9142B89390j7545j1522n0491J4804j7979l3752M659K3164L3151J878k655j0168
9130B22934k9884J225M271l352j0991l4408j0568q047j8496j1066j5219l714N4771
9117A37456P810Q551j6008j0540n1062J1656J2968p144n333M6073n385j5849j5658
9104I7535P52J5721j7049j9555k5424J1010M1097K7313j425k8973k8784k1145
9092E1073J3334M222R137O557L1058l975q291k4970l6638J6640L0912L9516N332
$$ plain form
9179 652202 633047 607748 623706 629369 625290 602483 534176 490909 447746 488097 502767 482898
9167 482898 464989 453913 446098 450908 436212 445671 422392 414372 404129 374380 334536 313892
9155 313892 317070 303597 275350 233085 256528 268354 268425 261969 296118 328416 313271 307059 289390
9142 289390 271845 260323 209832 224636 206657 172905 177564 200728 233879 235757 233102 222934
9130 222934 193050 194275 198546 195194 184203 149795 139227 131180 112684 101618 86399 82685 137456
9117 137456 145266 153817 137809 127269 76207 87863 100831 93687 88354 134427 129042 113193 97535
9104 97535 98287 114008 96959 77404 51980 62990 104087 131400 129975 101002 72218 51073
9092 51073 64407 68629 77766 84323 115381 111406 103115 78145 41507 58147 89059 128575 133907
9079A33907k4849J8070l338k3778J7062Q522j716L705m310l2061k9410L4192j3181
9066H2815m305j405k2416J3876l140j8191N697J1665j4988J8843K7301j980j6123
9053G7649k7814K2166m098m239L545l32o537k5644j587K3468p356j4777r548J4027
9039C8923j3431M328Q610r888j8145J8551j3659R010m367J6488J8300m213k8909
9026B1598j0274J1575R748k7340M1562L6246j9533k2380j4561R052j2254p907
9014A5532K2794J953j4836j318K4263K7876J0284R788m36j922N450M177k5809
9001G7796k023K4824j1789k9164k7231J557L0378N845k846K0156l4524l4658l018
8988A5303j6582L3041M495l0007k9624k0917M0986M0998J0750o407j0444J5589
$$ plain form
9079 133907 109058 127128 123790 100012 117074 125596 123880 127585 123275 91214 61804 95996 82815
9066 82815 78510 77105 54689 68565 65425 47234 52931 64596 49608 68451 95752 93772 77649
9053 77649 49835 72001 67903 63664 67209 66877 60340 34696 33109 56577 49221 34444 24896 38923
9039 38923 25492 29820 38430 28542 10397 28948 15289 24299 19932 36420 54720 50507 21598
9026 21598 11324 22899 32647 5307 46869 83115 63582 41202 26641 35693 23439 15532
9014 15532 38326 40279 25443 24125 48388 76264 86548 96336 95900 93978 99428 103605 77796
9001 77796 75773 100597 88808 59644 32413 33970 64348 70193 67347 87503 52979 18321 15303
8988 15303 -1279 31762 36257 6250 -23374 -44291 -3305 37693 48443 42036 31592 47181
8976D7181Q260k258J2582k865m1158l8436m764K7732k7974j1536K7408J7225J3798
8963B5195K5880k7514o3159l9512K6683O0284L8947n952q900j1164J2212k3686
8951I314j9081j0897J0035M6527M2829k2960k0355r064m625n279k1995J541N3328
8938D9318r939k3201k002k4551J4584l691J0355J1778N734j3428l1124n278K0853
8925e92K3523k056k4697k8270k883J4217k0800Q870K4677K1445K8506L2104j1004
8912F3040j8595N795n366j7065k5447r063K2738K0263R412j2953j8338n632M598
8899A3387n4949k4324N84k676M0346K315j8868J9456M9742M3829J2528j5507l0061
8886C5802k0963j788P267q473l7180J4430n738j0583r232J4776K1552J090m046
$$ plain form
8976 47181 55441 53183 65765 62900 21742 -16694 -21458 6274 -21700 -33236 -5828 11397 25195
8963 25195 51075 23561 -39598 -79110 -52427 7857 46804 40852 31952 20788 33000 9314
8951 9314 -9767 -20664 -10629 35898 78727 55767 35412 26348 21723 16444 -5551 -4010 49318
8938 49318 39379 16178 14176 -10375 4209 518 10873 22651 28385 14957 -16167 -21445 -592
8925 -592 22931 20875 -3822 -32092 -34975 -20758 -41558 -32688 -8011 13434 41940 74044 63040
8912 63040 44445 50240 44874 27809 2362 -6701 16037 36300 45712 32759 14421 8789 13387
8899 13387 -41562 -65886 -65302 -67978 -27632 -25317 -44185 -24729 25013 68842 81370 65863 35802
8886 35802 14839 13051 20318 11845 -25335 -10905 -16643 -27226 -36458 -21682 -130 960 -3086
8873c086J954j328J9124j4264m535K5408L5758J1341j5235k8250j1648J8558j1721
8860B2076j9255l5682j9487N160K940j469L8290K3837l0294k8566k211J1244l4255
8847f7672j051K2977J2847L2125J0388K1788o412k9347q029j2763j6362N130J8788
8834a7593j9907K8210L6349Q261L915j6580k3660J4303k2190J4029J8945j6977
8822G105k4349l7166j24l3652j5860K1869L023n704L2950L2276J5648R264j5774
8809a0494l737j0221j7645K3871J8810k5909K4137J9613q530j5956j3546J852
8797a7755j8746M250L6568N2832J0159l2825K13j0398m9438l257J5179Q641l869
8784h446J2873P565r107n185j6804o814K3857J1290j577j7191l2395o51J0562
$$ plain form
8873 -3086 -1132 -2460 16664 2400 -2135 23273 59031 70372 55137 26887 15239 33797 22076
8860 22076 2821 -32861 -52348 -47188 -44248 -45717 -7427 16410 -13884 -42450 -44661 -33417 -67672
8847 -67672 -68723 -45746 -32899 -774 9614 31402 24990 -4357 -12386 -25149 -41511 -36381 -17593
8834 -17593 -37500 -9290 27059 35320 39235 22655 -1005 13298 -8892 5137 24082 7105
8822 7105 -17244 -54410 -54534 -88186 -104046 -82177 -79154 -84858 -51908 -19632 -3984 5280 -10494
8809 -10494 -14231 -24452 -42097 -18226 584 -25325 -1188 18425 9895 -6061 -19607 -17755
8797 -17755 -36501 -32251 4317 57149 67308 34483 34696 24298 -25140 -28397 -13218 -4577 -8446
8784 -8446 4427 11992 2885 -2300 -19104 -25918 -2061 9229 7652 -9539 -41934 -42585 -32023
8771c2023K3893N0840k4412l6542l978J5066p637l6060P125K3049Q17j6623m461
8758d0946K0934K5609J5116K4142j3563l8824o269K3703Q720k2915J7831O831
8746B0369q095J5903o96l972j2284j493m0028K4030L2878q347k5220M918J234
8733h03J5581M619R945j3749L0917j9779n918k0541j3067N862L1795O077L124
8720C4063Q88J6041r089M235k2235k4682N688R335j396j9991N4O294J7062J7465
8706C3732n566O675n159j5542k1541k0416J8921K622R901M509q276K3413M0412
8693F3685k2145k2272j1627Q079p574k2288p1719j1274L7258N7768K6498k9713
8681e324j7261P583K8960j5950m6849K6482K3095k28k245K4076J5566l4540P556
$$ plain form
8771 -32023 -8130 42710 18298 -18244 -22222 -7156 -14793 -50853 -43728 -20679 -19862 -36485 -40946
8758 -40946 -20012 5597 20713 44855 31292 -7532 -13801 9902 18622 -4293 13538 20369
8746 20369 12274 28177 27481 23509 11225 9732 -30296 -6266 26612 18265 -6955 -2037 -803
8733 -803 14778 19397 29342 15593 46510 26731 20813 272 -12795 -6933 24862 30939 34063
8720 34063 34951 50992 41903 46138 23903 -779 4909 14244 12848 -7143 -7089 -795 16267 33732
8706 33732 28166 34841 29682 14140 -7401 -27817 -8896 -6274 3627 8136 -140 23273 63685
8693 63685 41540 19268 7641 15720 8146 -14142 -85861 -97135 -59877 -2109 24389 -5324
8681 -5324 -22585 -15002 13958 -1992 -48841 -22359 736 508 -1737 22339 37905 3365 10921
8668A0921m388j4420K0525j7808q58J7623M0695p870L051j0144R081m612q007
8655C3789l0915j8909J738K3754J1519J0517J0161k7630k1230j143J9438J71J3626
8642B4886J5245j7675l6870J7878L029J121M693j1616P352K4412P59m867L8462
8629F6809Q063j8776l6149j0048r036J862o581k7877k4125K5039L5546j0314j5225
8616b0812L694o308Q934K2609j016J228k136j0617Q233R429L6067j5848L6491
8603F9948K3933q226j6592l5148l9606L3053O9005J2624j8922l5076k7401n073
8591B2519L962J5714J8482n297P167l8784k9055J5452j5735L5552L4183k6873
8579C7287m256j4116q95M184j1101r877k2742J8938K4625L478j8944k0702K786
$$ plain form
8668 10921 6533 -7887 12638 -5170 -6028 11595 52290 44420 47471 37327 46408 41796 33789
8655 33789 2874 -16035 -14297 9457 20976 31493 41654 14024 -7206 -8349 11089 11260 24886
8642 24886 40131 22456 -14414 3464 6493 7614 12307 691 8043 32455 33214 28347 66809
8629 66809 74872 56096 19947 9899 863 2725 -3856 -31733 -55858 -30819 4727 -5587 -20812
8616 -20812 -17118 -23426 -14492 8117 7101 8329 6193 -4424 3809 13238 49305 33457 69948
8603 69948 93881 85655 69063 33915 -5691 27362 96367 108991 90069 54993 27592 22519
8591 22519 26481 42195 60677 55380 62547 23763 -5292 10160 -5575 29977 64160 37287
8579 37287 33031 18915 18020 22204 11103 1226 -21516 -2578 22047 25525 6581 -14121 -11335
8566a1335O236J4529k3978L170J7491K0218K1117k944p972k1538K4816J4957J3839
8553F8606J3655l825l4277n5124j1127L561j3842l0127j2099K3504J4517J9073
8541a7505l31k4403o572K1155M794K8587K4701j8447O802n209J5426J7967K1738
8528F8703q378O54k3829k4099M832J3975P804l1161l6152r453n001J5702J1413
8515a4990j0386P956J533J7464J434j3733P899J4253J5088j991j0869J4038R936
8502C7632k497R849J724Q155j9453Q315K2247j0827l1691l237K3394N861j990
8489D7482j6688n0402r372K3863K6979L5641J3828l7455j6321k1507J7868M2421
8477E6337J1686l4804l3659o479q851j4241J3047j4809L4649J8670q140O742j9862
$$ plain form
8566 -11335 -5099 9430 -14548 -11378 6113 26331 47448 44504 36532 14994 39810 54767 68606
8553 68606 82261 78436 44159 -10965 -22092 -18531 -32373 -62500 -74599 -51095 -36578 -17505
8541 -17505 -17836 -42239 -48811 -27656 -22862 5725 30426 11979 18781 13572 28998 46965 68703
8528 68703 60325 60979 37150 13051 17883 31858 39662 8501 -27651 -37104 -42105 -26403 -14990
8515 -14990 -25376 -17420 -15887 1577 3011 -10722 -2823 11430 26518 24527 13658 27696 37632
8502 37632 35135 44984 46708 54863 35410 43725 65972 55145 23454 20217 43611 49472 47482
8489 47482 30794 -19608 -28980 -5117 21862 57503 71331 33876 17555 -3952 13916 56337
8477 56337 68023 33219 -440 -6919 -15770 -30011 -16964 -31773 2876 21546 13406 20148 286
8464B86m9459k3486J439k7619K3017N7360O0637N275l0876q599O1845J3202m6719
8451C6303j6848k740j923j0342j252p55J7458J4564j4786l1152j6398L248k7204
8438e1827p353O749L1308J4919j2084J902k8182L1703J7273j1766J4240L6616
8426D3498k0397j3393j467L4144k6164m3868O0M3o10J7549j0006J0515Q034J2256
8412A0194J7549J1977j3765j772r39l0968j9465j4428J2036J4246L3362k2861
8400d834k8908P529o65j1293j3854Q658J0034J4432J9539K698j463J7498J487
8387B0858J0049K4609O494l406l2435m3942j1398N0575l5432L963M4266J05J8211
8374E2517k6601j8643l790j8373j9411K3149j2969k6503J2628L1179K5042j3183
$$ plain form
8464 286 -49173 -72659 -71220 -98839 -75822 -18462 42175 47450 16574 7975 69820 83022 36303
8451 36303 19455 16715 14792 4450 3198 2443 19901 34465 19679 -11473 -27871 -24623 -51827
8438 -51827 -59180 -52431 -21123 -6204 -18288 -16386 -44568 -12865 4408 -7358 6882 43498
8426 43498 23101 9708 8241 42385 16221 -27647 -27587 -27544 -28154 -10605 -20611 -10096 -2062 10194
8412 10194 27743 39720 25955 24183 23244 -7724 -27189 -41617 -29581 -15335 18027 -4834
8400 -4834 -33742 -26213 -26878 -38171 -52025 -43367 -33333 -18901 638 3336 1873 19371 20858
8387 20858 30907 55516 62010 58604 26169 -17773 -29171 21404 -14028 -10065 34201 34306 52517
8374 52517 25916 7273 3483 -14890 -34301 -11152 -24121 -50624 -37996 -6817 18225 5042
8362E042k7297r262J1996J6848J1106j9000j6459k5336J7710J1684k874k9054
8350e4896P303L8433L6667j326O014J151O680m747k7931N137j7647k0247j0564
8337c5973l549M782J6401K539P33Q271L763j2187J674J9223k4049r236K1532O000
8323g6J1629K2275m6371m50J5202J9688n197k7253j6871L3731K9990J9664R812
8310F5773j7722n902k0650r951j7019k2867n706M4218p872k0923j6664K5755J2688
8297C158j1036k7307L0489J4849m5994k9555K6094L1464J0347J7138l535K3595
8285C9707J838J5487k6055k4490j1411m235l4849j3218K3878N6443j2964n9839
8273d9708k4337M2258L7457o014j6550J1996K3099L5862l2926k6384j2314k8260
$$ plain form
8362 5042 -22255 -31517 -19521 -2673 8433 -10567 -27026 -52362 -34652 -22968 -25842 -54896
8350 -54896 -47593 -9160 27507 26181 32195 33346 40026 35279 7348 12485 -5162 -25409 -35973
8337 -35973 -39522 -34740 -18339 -15800 -15067 -6796 -3033 -15220 -13546 5677 -18372 -27608 -6076 -76
8323 -76 11553 33828 -12543 -12993 2209 21897 16700 -10553 -27424 6307 36297 55961 65773
8310 65773 48051 42149 21499 11548 -5471 -28338 -34044 10174 2302 -18621 -35285 -9530 3158
8297 3158 -7878 -35185 -4696 10153 -35841 -65396 -39302 -7838 2509 19647 16112 39707
8285 39707 41545 57032 30977 6487 -4924 -9159 -44008 -57226 -33348 23095 10131 -49708
8273 -49708 -74045 -31787 5670 -344 -16894 -4898 18201 54063 21137 -5247 -17561 -45821
8261d5821j0088K3704L8237M76k0120O603n371R056j78j2355K784K697J3513M758
8247G895M14l2428J3696K9740J5580K967o726l2576m4643j887J0135K4996K4049
8234A1212m800o188J2659j8332k416m1508M377L1632l626k0678J3936n841L9000
8221I427O518m291k8978J1587K3387Q579P900j2497j3721K707j2551q751m868
8208a5552J650L373M787Q914J0401n484l6447j8685N186N6415k0100l6982P759
8195c4765K7903L603j5989j2199L42J1629M8462P955j8558l3020N006R606p082
8182g107j8069p105j1790j8071K5870K5410R552L7053J1557Q22Q755p3900k2610
8169c9633L6894K7746j82n374l30k817o10k681k5300l4255K2095J9517j7187M721
$$ plain form
8261 -45821 -55909 -32205 6032 6508 -13612 -7009 -12380 -3324 -3502 -15857 -13073 -10376 3137 7895
8247 7895 8309 -24119 -10423 19317 34897 37864 31138 -1438 -46081 -47968 -37833 -12837 11212
8234 11212 6412 224 12883 -5449 -7865 -49373 -44996 -13364 -16990 -37668 -23732 -29573 9427
8221 9427 15945 11654 -17324 -5737 17650 26229 34129 21632 7911 10618 -1933 -10684 -15552
8208 -15552 -13902 -10529 -5742 3172 13573 8089 -28358 -47043 -41857 14558 -5542 -42524 -34765
8195 -34765 -6862 -3259 -19248 -31447 -31105 -19476 28986 36941 18383 -14637 -9631 -25 -7107
8182 -7107 -25176 -32281 -44071 -62142 -36272 -10862 -1310 35743 47300 48122 56877 -17023 -39633
8169 -39633 -2739 25007 24825 19451 19121 16304 15694 13013 -12287 -46542 -24447 -4930 -22117 -17396
8155a7396K4820K001p851n693j9809k6924q592L484J1279N737O786J6874r469
8142b4753Q905M2107L0812k1042j5739J6988k9169q247R995l863n943K2247l648
8129A8650r11j316k0250p129o856O661j5081M427J0044n946J2562N802n960l5224
8115d0527O561J8972n051K127o979K1656J0679j9129l568N902j8645J1789j2415
8102b8628k839p364O039J3584L6856o075j2769j7949k453J6263J7344k9633J7930
8089C06R920j8508m4922L3821L9471J3815j0365m3148M1573J883l200k594j2187
8076E865p765j2533K3982p947k9374k7548k460K2673O133m408k723K0458R826
8063e821j0206K0964j126l8158l427J726J3113j4800K3438M2853R159p383j0031
$$ plain form
8155 -17396 7424 9425 1574 -4119 -23928 -50852 -59444 -55960 -44681 -38944 -32158 -15284 -24753
8142 -24753 -15848 26259 57071 36029 20290 37278 8109 -138 9857 5994 51 22298 18650
8129 18650 17739 16423 -3827 -10956 -17812 -11151 -26232 -21805 -11761 -17707 -5145 657 -5303 -40527
8115 -40527 -33966 -14994 -20045 -17918 -24897 -3241 7438 -11691 -15259 -9357 -28002 -16213 -28628
8102 -28628 -31467 -38831 -32792 -19208 17648 11573 -1196 -19145 -21598 -5335 12009 -17624 306
8089 306 10226 -8282 -53204 -19383 20088 33903 23538 -19610 21963 23846 20646 18052 5865
8076 5865 -1900 -14433 9549 1602 -27772 -55320 -57780 -35107 -28974 -33382 -36105 -15647 -5821
8063 -5821 -16027 4937 3811 -34347 -37774 -36048 -22935 -37735 -14297 28556 37715 30332 20301
8050B0301j9143j1369j0171j913J1001K5903L1093k6446k9441K1307j3515j6485
8038a8878J3634p16J2409l728M7972J4000k0909J3158o837l6985j4271j6611j9562
8025c7324K2145M4466J500o82k450j4821k6675o460k0963K3750K3868m1968j8358
8012e3972K4269J2570L445r114j1980J2018L8570M9010J541j9587j4889J1692
8000D3573k2284n4070k383J3886M373K538L7729j4703k501M164PQ914o021J5666
7986B8888K7239m414j6151J1470n876l727k4503M918j6378m3102l0244K3885J4492
7973c3503J0811K7722k227k9376K0272L914O637k212m569j4183J4237J1297j7052
7960h232Q418J8176o019k0713L1924J3492r421r158j9208M9049M5479q188l6510
$$ plain form
8050 20301 1158 -10211 -20382 -22295 -11294 14609 45702 19256 -10185 11122 -2393 -18878
8038 -18878 -5244 -5960 6449 2721 50693 64693 43784 56942 50105 13120 -1151 -17762 -37324
8025 -37324 -15179 29287 30787 30105 27655 12834 -13841 -20301 -41264 -17514 6354 -35614 -53972
8012 -53972 -29703 -17133 -13688 -22802 -34782 -22764 15806 64816 66357 46770 31881 43573
8000 43573 21289 -32781 -35164 -21278 -16905 -14367 23362 8659 6158 10322 10329 19243 13222 28888
7986 28888 56127 51713 35562 47032 41156 37429 12926 17844 1466 -41636 -71880 -47995 -33503
7973 -33503 -22692 5030 2803 -26573 -6301 -2387 4250 2038 -2531 -16714 -2477 8820 -8232
7960 -8232 186 18362 12343 -8370 23554 37046 27625 18467 -741 48308 93787 85599 49089
7947D9089l5473o553j4496R496J4933L355M953L0435M751r589l4897J2232N448
7934C3684N654k3941l5718j7542M850N0273J0463j4072l4784J3438P04J138q929
7921a4782L058Q528K62J4934j0399k8018j980j8343j2742L377l040O035K5712
7908b7398K0829L1346j9893m925M551j9951K2976L7007j9122k6979k6472J4724
7896a3307J133J4046J9979j6223o306o649k551j0497J4359l519M271j1255K19
7883a6300L662k981k3149R615J4838L4249n914l5180j2882M3669p928k1304K2108
7870B503k8215l1409L3276K1915K6378R246M377n368N668j9404l0023j4577M0555
7857A4922p126K7006J760k2479K1556K3533j6340j6581r842k523N024P510k0738
$$ plain form
7947 49089 13616 7063 -7433 2063 16996 20351 25304 55739 60490 50901 16004 28236 33684
7934 33684 39338 15397 -20321 -37863 -33013 17260 27723 13651 -21133 -7695 -6991 -5853 -14782
7921 -14782 -11724 -3196 -2934 12000 1601 -26417 -28397 -46740 -59482 -56105 -59145 -53110 -27398
7908 -27398 -6569 24777 4884 -41 4510 -15441 7535 44542 25420 -1559 -28031 -13307
7896 -13307 -12174 1872 21851 5628 -678 -7327 -9878 -20375 -6016 -9535 -5264 -16519 -16300
7883 -16300 -12638 -15619 -38768 -29153 -14315 19934 14020 -21160 -34042 9627 1699 -19605 2503
7870 2503 -25712 -57121 -23845 -1930 24448 33694 38071 32703 38371 18967 -11056 -25633 14922
7857 14922 7796 34802 36562 14083 35639 59172 42832 26251 16409 13886 18910 26420 5682
7844E682r681K1532J4665k2103l8858K2265L0062j8240K96o303p125j5763M386
7831a9185L1333m481l42j157L9695l2147o6114L0980K5960j1006k6358K9669M4138
7818D0985q132k4787k0209L8774M0958m917j0476j9673k8941J9959K2849k7769
7806A8621k9384R937p917N385k525O0r130J2127J4120K1961l726n679p316l898
7792A2636L743M751M942R698l4057j6218J9483j6120P467M1605J5234l5063l7959
7779a9858k8645j0356M2581K8194J5951M739p383J5066M3780m4369k0082k001
7767A7617o573j5484J9451J1432j0050J2025L8957l5477j4240m0114K6959J9192
7755B3695j7291j4256J1466R717Q295J7074j2948k0559k4909J2400M914j2013
$$ plain form
7844 5682 -3999 17533 32198 10095 -28763 -6498 23564 5324 5620 -683 -7808 -23571 -19185
7831 -19185 12148 7667 7325 6168 45863 13716 -52398 -21418 4542 -6464 -32822 -3153 40985
7818 40985 32853 8066 -12143 26631 67589 62672 52196 32523 3582 23541 46390 18621
7806 18621 -10763 -826 -8743 -3358 -5883 -5823 -14953 -2826 11294 33255 29529 23850 16534 12636
7792 12636 16379 21130 26072 35770 1713 -14505 4978 -11142 -3675 37930 53164 18101 -19858
7779 -19858 -48503 -58859 -16278 11916 27867 32606 25223 40289 84069 39700 19618 17617
7767 17617 11044 -4440 15011 26443 16393 28418 67375 31898 17658 -22456 4503 23695
7755 23695 6404 -7852 3614 13331 21626 38700 25752 5193 -19716 -7316 -2402 -14415
7743a4415L2193j2615J1074J9144J9952k0562k2771k795j235j0593j8144j723
7731b2490m243k534O403J1980k000j553k151J1083N9754p752l2151k5128k3320
7718c4102j9102r507K3467M098k3302J051L1628J6062j7039o52K6628J3452k673
7705A0009k1175l2036J603J9204O930k066j1071K4402m93J0418J5200j0217J175
7692A1883k0297J307r876K1857Q442J1011K624j0201o203N110j0798J470p300
7679i71n790O295K902k0930O786J7862J3729j91j4601J426o91k112k3578M438
7665a5426J8350J7122k0938l8452K9935K5717p385j9845k102j850J0430J2541
7653H097j294J549O823J6399J551k4990p26J7988j2537l9692P51M009M197l419
$$ plain form
7743 -14415 17778 5163 16237 35381 55333 34771 12000 9205 7970 -2623 -20767 -22490
7731 -22490 -26733 -29267 -22864 -10884 -12884 -14437 -16588 -5505 54249 46497 14346 -10782 -34102
7718 -34102 -53204 -62711 -39244 -35146 -58448 -57397 -25769 -9707 -26746 -27398 -770 12682 10009
7705 10009 -11166 -43202 -41599 -22395 -15465 -17531 -28602 -4200 -4693 5725 20925 10708 11883
7692 11883 -8414 -7107 -16983 4874 13316 24327 26951 16750 10547 15657 4859 6329 -971
7679 -971 -6761 -466 2436 -18494 -11708 6154 19883 19692 5091 6517 5826 3714 -19864 -15426
7665 -15426 2924 20046 -892 -39344 -9409 16308 8923 -10922 -13024 -14874 -4444 8097
7653 8097 6803 8352 15175 31574 33125 8135 7409 25397 12860 -26832 -26081 -22072 -17875 -21294
7639b1294q709l4076j7843m718J8900K1742p647M064L1326K5531P144o357N273
7626A3336j6021k8274J3487j2752j479M681K5634J5100r638j0078Q033j0593k6743
7613c5307j8620p978p524q028o416j3636J0320K3105K5986M4892j6975k9344Q446
7600c1079J6136k6434m848M0365K9845L8963j5962m5322o967L6356J737o120l3551
7587f881K854o030k0499j5453J7682M068O1793N6540k2644k5944k7210k5685k9168
7574c6577j7574R760N552P651L0220r791J2546J9819J1976l6877j5087O348l4731
7561d6765k755l6157k6549M3438L4746M4208J0201o365k0658M821J7815p714q229
7548C7K9121j5938k5850p603j353K3042M557O058J9657M3285K5877L950p1081
$$ plain form
7639 -21294 -30003 -64079 -81922 -86640 -67740 -45998 -53645 -49581 -18255 7276 14420 8063 13336
7626 13336 -2685 -30959 -17472 -30224 -31703 -27022 -1388 13712 4074 -6004 2029 -8564 -35307
7613 -35307 -53927 -61905 -69429 -77457 -83873 -97509 -87189 -64084 -38098 6794 -10181 -39525 -31079
7600 -31079 -14943 -41377 -46225 -5860 23985 62948 46986 1664 -5303 31053 32790 26670 -6881
7587 -6881 -4027 -10057 -30556 -46009 -28327 -24259 37534 94074 71430 45486 18276 -7409 -36577
7574 -36577 -54151 -44391 -38839 -31188 -968 -10759 1787 21606 33582 -3295 -18382 -12034 -46765
7561 -46765 -49520 -85677 -112226 -68788 -34042 10166 20367 14002 -6656 -1835 15980 8266 37
7548 37 29158 13220 -12630 -20233 -21586 1456 6013 12071 31728 75013 100890 104840 33759
7535C3759m1671k7236q693J5452K0282K165l1330J7642N036j069J2237l1822J707
7522c3541L0619N7886l010j8286k0328j7074r669K0311Q184j0462j6601k5293
7510c7264J8297K3578l1098k2998K9974R030M994m8062j7896L2612J1750K4068
7498c015J976m73k214n429k6012j7569L5514j4760N174k2305J8689L8962n3273
7485d4735j5502J374Q680J1315k847J9156J9785M496m4036k48j566j1944N994
7472e0078J6139P571J492J2256J4334l679R328R163r39k3842J6687K0251j4943
7459A3740Q204L5296j6300p5019k5062j2122K9284J8124j1063K0868K743p681
7447a8988N6621K3726k9342M359J2439p973l0076k4954j6664L3327J2859N031
$$ plain form
7535 33759 -7912 -35148 -43841 -28389 -8107 -5942 -37272 -19630 -14594 -15663 -3426 -35248 -33541
7522 -33541 -2922 54964 51954 33668 13340 -3734 -13403 6908 15092 4630 -11971 -37264
7510 -37264 -18967 4611 -26487 -49485 -19511 -10481 -5487 -53549 -71445 -38833 -27083 -3015
7498 -3015 -1039 -1512 -3726 -9155 -35167 -52736 -17222 -31982 -26808 -49113 -30424 8538 -44735
7485 -44735 -60237 -58863 -50183 -38868 -41715 -22559 -2774 1722 -42314 -42562 -44128 -56072 -50078
7472 -50078 -33939 -26368 -24876 -12620 1714 -1965 7363 16526 15587 -8255 8432 28683 13740
7459 13740 21944 57240 40940 -34079 -59141 -71263 -41979 -23855 -34918 -14050 -11307 -18988
7447 -18988 37633 61359 32017 36376 48815 40842 10766 -14188 -30852 2475 15334 20365
7435B0365j3248L279L28j2131L910P269O148J8828J4857J9723J691k3952n9440
7422a2373r224K0612k0585K6394N601Q76j9062j26K8882m3791l0479K234M8204
7409b837J1985R073O829j2529n432K2955J7193p784M715k0867k3881M7786r731
7396C7475p934J6023J1206N805j6327l6575j2533J8699J0187k7341n6403Q515
7384d9203O044M2070j6099j1608J4192J5566J1385J6304j7472j5925n409N628
7372d527j5089J806p627N160l523J7415K2866m6145r210J4280R447K468j3368
7359b6047k2222m22L9629l976M314l8287K4468K8111k1865j5354J94o145J269
7346c6333J9774J6955j6629j9753k7806K2220O451k8637P087K4165O140L8383
$$ plain form
7435 20365 7117 10396 10724 -1407 2503 9772 15920 34748 49605 69328 71019 47067 -12373
7422 -12373 -21597 -985 -21570 4824 10425 11301 -7761 -7887 20995 -22796 -53275 -51041 -2837
7409 -2837 9148 18221 25050 12521 7089 30044 47237 39453 44168 23301 -580 47206 37475
7396 37475 29541 45564 56770 62575 46248 9673 -2860 15839 26026 -1315 -57718 -49203
7384 -49203 -43159 -1089 -17188 -28796 -14604 962 12347 28651 11179 -4746 -10155 -4527
7372 -4527 -19616 -17810 -25437 -20277 -23800 -6385 16481 -29664 -38874 -24594 -15147 -12679 -26047
7359 -26047 -48269 -48691 -9062 -13038 -8724 -47011 -22543 5568 -16297 -31651 -31457 -37602 -36333
7346 -36333 -16559 396 -16233 -35986 -63792 -41572 -35121 -63758 -56671 -32506 -26366 12017
7334A2017L1372J0391J1373q395n0211k1475N370j5578N372j264R620J8472J026
7321H090Q527j0859j7167p430J9936J6297L2684L5983o412j8138m494m68j4712
7308D1837n8020m5773j271m750N804L5294R205M034k1283J3594J2690r150J968
7295a5821J6511l3197j0668n400N982M3699j607K0082j343J5861j527k1123j2447
7282i98P485N645J715j5503k8660m5847J7033L4472K4686k7445k058j975N6416
7269B4966K4670j1960m3666k8025n096l7925l762J4727M7838K6488J924j3225
7257c046P555j2476J9076p183q69Q170q788k9553k2576R269L1434o933j2677m296
7243c2893p795r75J5097J5645m127p783j642M4j7394R573K2878j0075l9823l9215
$$ plain form
7334 12017 43389 53780 65153 56758 6547 -14928 -9558 -25136 -19764 -21028 -11408 7064 8090
7321 8090 16617 5758 -11409 -18839 1097 17394 50078 86061 79649 61511 57017 56549 41837
7308 41837 -16183 -61956 -63227 -67977 -62173 -26879 -17674 -13640 -34923 -21329 -8639 -17789 -15821
7295 -15821 690 -32507 -43175 -48575 -42593 1106 -501 19581 18238 34099 32572 11449 -998
7282 -998 6487 12132 13847 -1656 -30316 -76163 -59130 -24658 28 -27417 -29475 -31450 24966
7269 24966 49636 37676 -5990 -34015 -39111 -77036 -80798 -66071 -18233 8255 10179 -3046
7257 -3046 4509 -7967 11109 3926 3057 11227 2439 -27114 -49690 -40421 -8987 -15920 -28597 -32893
7243 -32893 -40688 -41663 -26566 -10921 -15048 -22831 -24473 -24429 -41823 -32250 -9372 -19447 -59270 -98485
7229i8485K2037K1447M923N629J7572L4875J7501J8988K3108m410j7054j1604
7217C4527J962J5491r768j7150P106O900k0361k1303j6708K172J8440K6823J1175
7204C9306J0916m2034j6113m94K4405K5237k0234k1101O541k8115J2142L3254
7192B3710L1920j185k0281p586l0855j5762k5214K216R021O104L7814P090O926
7179B3918M851J43J5739o301k3404j8814j3216p646J5254J4255Q820j6100l0740
7166c3241J5085j36n5455p777J9160K6381J5988K4649J2876l096k8037l315k615
7153a9533K0866J0496P383K5507k5310n406J9515j6237q064J2153N687K0006L1696
7140G8759l1001j5779k2049j1206o20O092k5650P260J5449L1755n013J578l6609
$$ plain form
7229 -98485 -76448 -55001 -50078 -44449 -26877 7998 25499 44487 67595 63185 46131 34527
7217 34527 36489 51980 42212 25062 32168 39068 18707 -2596 -19304 -17132 1308 28131 39306
7204 39306 50222 8188 -7925 -8419 15986 41223 20989 -112 6429 -21686 -9544 23710
7192 23710 55630 54445 34164 26578 -4277 -20039 -45253 -43037 -34016 -27912 9902 16992 23918
7179 23918 28769 28912 44651 38350 14946 -3868 -17084 -24730 -9476 4779 13599 -2501 -33241
7166 -33241 -18156 -18292 -73747 -81524 -62364 -35983 -19995 4654 17530 14434 -13603 -16918 -19533
7153 -19533 1333 11829 19212 44719 19409 14003 33518 17281 9217 21370 27057 47063 78759
7140 78759 47758 31979 9930 -1276 -1896 4196 -21454 -14194 1255 33010 27997 29575 -7034
7127g034j0355J7609J1269l6525J5093J1223M532O206n949J2710R836j705j1611
7114A5299m2779l423K1545K3437R141k8637l8446M4236M1536j7036k7868M406
7102A411P475k303k5802N191K8467j3464L980r858j2733n405j2205j4127K7150
7089b2223K0494M183P685M869K4246J1547Q183j9472m1372j7449r917n645K5794
7076i077K281j0498P917J7327Q805K5089J5801j2037k7825j7744K0522q807m437
7063G317J0965M320j1042L827m3647k963N0124l407j2017j2025N021K6198J3655
7050C6326m0987J0543p406j48k0724Q764K1003j0674n3082j2288N1930K4026j1432
7037d149K7053J6923J5241J5262j4476m0572n2099j0065l9958J5514L6865L6K4733
$$ plain form
7127 -7034 -17389 220 11489 -25036 -9943 1280 5812 12018 6069 18779 28615 26910 15299
7114 15299 -27480 -30903 -9358 14079 23220 -5417 -43863 373 41909 24873 -2995 1411
7102 1411 8886 6583 -19219 -14028 14439 975 4955 -4903 -17636 -23041 -35246 -49373 -22223
7089 -22223 -1729 2454 10139 15008 39254 50801 58984 39512 -1860 -19309 -29226 -34871 -9077
7076 -9077 -6796 -17294 -9377 7950 16755 41844 57645 45608 17783 39 20561 11754 7317
7063 7317 18282 22602 11560 15387 -28260 -31223 18901 15494 3477 -8548 -3527 22671 36326
7050 36326 -4661 5882 -1524 -1672 -22396 -13632 7371 -3303 -56385 -68673 -16743 7283 -4149
7037 -4149 22904 39827 55068 70330 55854 15282 -36817 -46882 -86840 -71326 -34461 -34425 -9692
7024i692k201r76K3819J4237n184j9497l6292j2980L7721n889J4513J0287j3050
7011e184M156L905l467m3905l1629M800J6844Q146J4958J9353K3466r63k2241
6998a1761k2082J81K7615j5663j1474j0078k760L1012n537K7033n18r76R376j5070
6984g02j7258J0172M7118j7703l7145k661K1950K4928l1143n690k4545M4547J5349
6971B7217K0738l208L850N818l267j0234q960m4269k3400K696K1653l232L0572
6958A5974J5710J5364q20K4704J3770l445j8606n232l6425j7083j3976k1587j6621
6945d8273J4258J6492N626R649J2916J1311r046k2808p121k4060n747N755J6168
6932b4880K5426N904M091j4859Q944M7497K536l8223j1515Q955J7973m622M83
$$ plain form
7024 -9692 -11893 -12869 10950 25187 20003 506 -35786 -48766 -11045 -16934 -2421 7866 -5184
7011 -5184 -1028 2877 -590 -44495 -76124 -71324 -54480 -46334 -31376 -12023 11443 10480 -11761
6998 -11761 -33843 -33662 -6047 -21710 -33184 -43262 -46022 -15010 -20547 6486 5968 4992 14368 -702
6984 -702 -17960 -7788 39330 21627 -15518 -18179 3771 28699 -2444 -8134 -32679 11868 27217
6971 27217 47955 44747 48597 54415 51148 40914 31954 -12315 -35715 -33019 -11366 -14598 15974
6958 15974 31684 47048 46228 70932 84702 81257 62651 57419 20994 3911 -10065 -31652 -48273
6945 -48273 -34015 -17523 -11897 -2248 10668 21979 12933 -9875 -16996 -41056 -46803 -41048 -24880
6932 -24880 546 6450 10541 -4318 4626 52123 54659 16436 4921 13876 31849 27227 27710
6919B7710J1149m681P77j6379j8350j4598Q259K6940k1294j3123J5559L2343l2210
6906B102k9190r131k6403L1600M0595Q573l5140L1936L0394j2713k3373l1245
6894b1995L160r616N583L2518M3755J5585l7434j477K909n1042n6477k1103M7903
6881d7731J4202K7987J2897P426j4619k8101m7055J4980K5560r835J4375K4493
6869e421J2183M7797J4265l8154n0128q968L1784J4383n116p375K8452K4545k4586
6856C3661k7909k5798Q128j269K5416J2995l8294j7928q380J6530L5460j1307
6844A305k0044k2515r83L0671K9183j4158J4055J7778j0788j0346k1527j9724
6832b7093n759K6516J188L549P120L467J8451j1330m9784J4385J6187M0451q611
$$ plain form
6919 27710 38859 34178 34955 18576 226 -14372 -6113 20827 -467 -13590 1969 34312 2102
6906 2102 -27088 -36219 -62622 -31022 9573 18146 -16994 14942 45336 32623 9250 -21995
6894 -21995 -18835 -28451 -22868 9650 53405 68990 31556 30079 32988 -18054 -74531 -95634 -47731
6881 -47731 -33529 -5542 7355 14781 162 -27939 -74994 -60014 -34454 -44289 -29914 -5421
6869 -5421 6762 54559 68824 30670 -19458 -28426 3358 17741 12625 5250 33702 58247 33661
6856 33661 5752 -20046 -11918 -13187 12229 25224 -13070 -30998 -39378 -22848 12612 1305
6844 1305 -18739 -41254 -42237 -11566 17617 3459 17514 35292 24504 14158 -7369 -27093
6832 -27093 -32852 -6336 -5148 -1599 5521 8988 27439 16109 -33675 -19290 -3103 37348 28737
6819B8737j2167J1397k9154m5279P080J4133k0765M316P741J5086P899j7477P846
6806b0607j4195j8462n759j922L8061j6549k7407j9141L4089J1949J5149j013
6794b5807j0470j5539L929n876j3733J8927L0614m99J8053k5422r993n890O193
6781c5513m13m925M352L500N9801K3927j7356l2455k5435r293m865K002J7604
6768a9069O849j5679j9504j6384K2512J4107j3224J4482J4556J5274o177q299
6756a0556j7171j0261J162K2606mJ0681J4933M357m5871O203K8934L6492J8012
6743E9517k055m6357l4271Q3k9j3762j7728L5935N3642P67l2028j4613J7390k2781
6729a6290l1297J4388K7196r508J3055j1971L0811K2696L3332K238K7142K4965
$$ plain form
6819 28737 16570 27967 -1187 -46466 -39386 -25253 -46018 -41702 -33961 -18875 -10976 -28453 -20607
6806 -20607 -34802 -53264 -59023 -60945 -22884 -39433 -66840 -85981 -51892 -39943 -24794 -25807
6794 -25807 -36277 -51816 -47887 -53763 -67496 -48569 -17955 -18454 -401 -25823 -35816 -41706 -35513
6781 -35513 -35926 -40851 -36499 -32999 26802 50729 33373 918 -24517 -33810 -38675 -36673 -19069
6768 -19069 -12220 -27899 -47403 -63787 -41275 -27168 -40392 -25910 -11354 3920 -2257 -10556
6756 -10556 -27727 -37988 -36826 -14220 -14224 -3543 11390 15747 -30124 -23921 5013 41505 59517
6743 59517 57462 11105 -23166 -23083 -23112 -36874 -54602 -18667 34975 35742 3714 -10899 6491 -16290
6729 -16290 -47587 -33199 -6003 -15511 -2456 -14427 16384 39080 72412 74650 101792 126757
6717A26757O1887P4522J5239J5253m9335p7206m1631j4314o902J3026j8188l5096
6705F4012q759M607k4416R488J1719K0187j4647q728k4815j488J6859Q306l4859
6692A7466J0145M447k0240j7910k2271k6204N2654L6952l2492L0173N980N066
6680D3766k0190Q506L3681L0964k4090j0724J2863j0849O717n147J3003N365j0641
6667G3224k7160j8635q457k4061j2937J3006J6314J9548R008M407j8337k9557
6655c637Q811L2440P871l0289M401o826p896J4674K5352k4325j2721J380J02K787
6641A2124j8205j394l2009k5490J8113J4160R859O463r416K5636j0175J311Q034
6628i89J9851P906M145n6862J112K2438n540J4748r91p489k6805n506J8567K522
$$ plain form
6717 126757 188644 263166 278405 293658 244323 167117 125486 111172 104270 117296 99108 64012
6705 64012 55253 59860 35444 44932 56651 76838 62191 53463 28648 27160 44019 52325 17466
6692 17466 27611 32058 11818 -6092 -28363 -54567 -1913 35039 2547 32720 38700 43766
6680 43766 23576 32082 65763 96727 72637 61913 74776 63927 70644 65497 78500 83865 73224
6667 73224 46064 27429 18972 -5089 -18026 -5020 11294 30842 39850 44257 25920 -3637
6655 -3637 5174 37614 45485 15196 19597 12771 4875 19549 44901 20576 7855 9235 9337 12124
6641 12124 -6081 -7475 -39484 -64974 -46861 -32701 -22842 -16379 -25795 -159 -10334 -9023 -989
6628 -989 18862 26768 30913 -25949 -24837 -2399 -7939 6809 5818 -1671 -28476 -33982 -15415 -12893
6614a2893J1973N70r245m99l371R145M728k133k4087l1250N543L78L770K286k7362
6599g2447Q247Q506L100k7668J6231L3527K9126R623q790r597J1513J1686j0873
6586B184k2111k9226R96K2596M650J9713J4686R077J2059k5051n758J3382L0155
6573D7352j0577K7385J434m2807l0196J343p497l430J5606M687j0814L0601l354
6560A9733k5511M472J4047J5082j9129K053j5360j2706k8941l6973N577N771M8987
6547b2898l587K8359K3910J5516N138K361n64n565m5478l7694M500k738K1098
6534a7642J6333j6736n842r368J9265L3914J8668n081l0595o191K0378P862m5431
6521b0466n6918M5050N9376o182m4104J3113j6311l7M2098R581j0521K3577j37
$$ plain form
6614 -12893 -920 -350 -9595 -10094 -13465 -4320 408 -1725 -25812 -57062 -51519 -51141 -47371 -45085 -72447
6599 -72447 -64200 -55694 -52594 -80262 -64031 -30504 -1378 8245 -545 -10142 1371 13057 2184
6586 2184 -19927 -49153 -48157 -25561 -20911 -1198 13488 22565 34624 9573 3815 17197 47352
6573 47352 36775 64160 65594 22787 -7409 -6066 -13563 -16993 -1387 3300 -7514 23087 19733
6560 19733 -5778 -1306 12741 27823 8694 10747 -4613 -17319 -46260 -83233 -77656 -71885 -22898
6547 -22898 -26485 1874 25784 41300 46438 48799 48235 42670 -2808 -40502 -36002 -38740 -17642
6534 -17642 -1309 -18045 -23887 -33255 -13990 19924 38592 33511 2916 -3275 17103 24965 -20466
6521 -20466 -77384 -32334 27042 20860 -23244 -10131 -26442 -26479 15619 25200 14679 38256 38119
6508C8119J0521L998k5092k1337m3931J409N142M3635O689J690l7920j2339M016
6495b5400j3471K674J1681L587J4226P257l4241k3086K4830n664k8144L9983j4578
6482d0346k2171J0871Q267J7269L0404K1953j1388o267k501j9753L416J0157o627
6469f716l281J6414J4728l3228l1161P032Q682l773j7445J0087K1142J1990n660
6456a1189k1868K087O266Q190O158l857r615j1821J7530j8483l335K5402j3820
6443b8355p774L459q168J8340N8017O435l989j6928k3163M6847k4035L93j2293
6430H786k6163r875j1068n842K3966L9379L1128K152m0007j0795N613k9239K7139
6417E174K7499p980l1920o71l52j7709J3228K8918J1590O227j8715k8793Q630
$$ plain form
6508 38119 48640 52638 27546 6209 -37722 -36313 -31171 12464 19153 20843 -17077 -29416 -25400
6495 -25400 -38871 -36197 -24516 -20929 -6703 554 -33687 -56773 -31943 -37607 -65751 -25768 -40346
6482 -40346 -62517 -51646 -43379 -26110 4294 26247 14859 8592 6091 -13662 -10246 -89 -6716
6469 -6716 -9997 6417 21145 -12083 -43244 -36212 -27530 -31303 -48748 -38661 -17519 -5529 -11189
6456 -11189 -33057 -30970 -24704 -16514 -10356 -14213 -23828 -35649 -18119 -36602 -39937 -14535 -28355
6443 -28355 -36129 -32670 -40838 -22498 35519 41954 37965 21037 -2126 44721 20686 21079 8786
6430 8786 -17377 -27252 -38320 -44162 -20196 19183 50311 52463 12456 1661 7274 -21965 5174
6417 5174 32673 24693 -7227 -7898 -8250 -25959 -12731 16187 27777 34004 15289 -13504 -4874
6404d874N045j2224M470K6138M4013K1571r827k800q823J6052j5136j8511p439
6391C7655l3891k2768P991K1871j9080j881j510j6310K7236K9417J2780p833j9884
6378A3793m5879j6734K0479L3214p078K2937k8655j3972k679j7770L1421K9636
6366A8713q930m7224o139J3799O382J8540L663M473L827k4473K2462J70p299k7450
6352b9486j7868L6095N1754j0667l6563j6256M0575P379l4363j5927K8461K879
6340F013k1015J1957L5773m687k292n747k7095q765M6558L6853m0328k3174J362
6327E413j6539Q282j947N195J2104Q751l0134j2061l2556K609l87Q174L5154J050
6313f892n025k0095J4573J8587K3976l698l5877o722K4904l463l3831k0835J8477
$$ plain form
6404 -4874 171 -12053 -7583 18555 62568 84139 74312 71512 62689 78741 63605 45094 37655
6391 37655 3764 -19004 -11013 10858 -8222 -10103 -11613 -27923 -687 28730 41510 33677 13793
6378 13793 -32086 -48820 -28341 4873 -2205 20732 -7923 -21895 -24574 -42344 -10923 18713
6366 18713 9783 -37441 -43580 -29781 -23399 -4859 -1196 3277 7104 -17369 5093 5263 -2036 -29486
6352 -29486 -47354 -11259 40495 29828 -6735 -22991 17584 24963 -9400 -25327 3134 6013
6340 6013 -15002 -3045 32728 28041 25749 20002 -7093 -15858 30700 67553 27225 4051 5413
6327 5413 -11126 -2844 -4791 404 12508 21259 -8875 -20936 -53492 -50883 -51270 -43096 -7942 -6892
6313 -6892 -11917 -32012 -17439 1148 25124 21426 -14451 -21173 3731 268 -33563 -54398 -35921
6300c5921M4413L0953j8321j1288K8657J2396k9010m8466O967L4718j5922j3588
6288a4412n640j0003Q047K7067J094o890n98k5290p390K1461k7681J3128J8333
6275h774m0429m906L9057L6866R180P995N928p129j1674K4746P045n638m2613
6262I654l3626K5019J6427K0196l0674j2947m432J0690M076L450l8427J458K9917
6249G81L9089K8623l5127k8053p755p651k114K922J5669l2960L2387J1662j6488
6236I85J2745j1996m6992K410j7021L413K5166M8505j663l4849p176L096l0377
6223e3754j2728L3336L7611L1107k2411k1120k3439j7134J4315M2172j7681j5703
6211b5429Q431r122J9135K4049k3195j8025M632J2539K2316J5367J1263j7968
$$ plain form
6300 -35921 8492 39445 21124 9836 38493 50889 21879 -26587 -19620 15098 -824 -14412
6288 -14412 -20052 -30055 -22008 5059 6153 -737 -1335 -26625 -34015 -12554 -40235 -27107 -8774
6275 -8774 -49203 -54109 -15052 21814 30994 38989 44917 37788 26114 50860 57905 52267 9654
6262 9654 -23972 1047 17474 37670 6996 -5951 -10383 307 4383 7833 -30594 -29136 781
6249 781 39870 68493 33366 5313 -2442 -10093 -12207 -9285 6384 -26576 5811 17473 985
6236 985 13730 1734 -45258 -42848 -59869 -56456 -31290 17215 15552 -19297 -26473 -23377 -53754
6223 -53754 -66482 -33146 4465 35572 13161 -7959 -31398 -48532 -34217 7955 -9726 -25429
6211 -25429 -16998 -26120 -6985 17064 -6131 -24156 -19524 -6985 15331 30698 41961 23993
6199B3993J7648j2088j3074k535J739K1034j2897K663j8750k2199q613K6731j7553
6186a3901K4679o755K1028j4999J38J5804l069l9843o635M0523p206j5260K3177
6173A7681n035k5991j7359j0529K5819L1271j1298r060l3832J7065K2525J6093
6161A7350J6817P091k4598k0430J7601j6J4279m0288j8113L9640O245O62o535
6148I705p240p02J6939L3031J2162n4615l3616P797K7902l573m018O144K3656
6135C3572k2269j8043j2525L192K3135j3581l1861r033q496O014n642k0270K5424
6122e0383K1498J0870M212k2919m2256J4660Q456K3570J0350M9120J2144j7126
6110B2196J2740j0722j7532O202j4325l707k926j1408K0427l4255k1617M9250
$$ plain form
6199 23993 41641 29553 16479 13944 15683 36717 23820 26483 7733 -14466 -23079 3652 -13901
6186 -13901 10778 4023 25051 10052 10190 25994 22925 -16918 -23553 16970 9764 -5496 17681
6173 17681 12646 -13345 -30704 -41233 -15414 15857 4559 -4501 -38333 -21268 1257 17350
6161 17350 34167 41258 16660 -3770 13831 13815 28094 -12194 -30307 9333 15578 16240 9705
6148 9705 2465 1763 18702 51733 63895 9280 -24336 -16539 11363 7790 3772 9916 33572
6135 33572 11303 -6740 -19265 -16073 7062 -6519 -38380 -47413 -55909 -49895 -55537 -75807 -50383
6122 -50383 -28885 -18015 -13803 -36722 -78978 -64318 -55862 -32292 -21942 27178 39322 22196
6110 22196 34936 24214 6682 12884 -1441 -5148 -8074 -19482 945 -33310 -54927 -5677
6098e677K5006M576J0894L12m047J440j6802k3291R793k878J7959P436l677l9682
6084a8638q271k7223M537J3881J2389k1900J5986m8866m196M0999Q489L5979K2957
6071B6123j686K6213r649l7477J6758r586o086o39O35J1303j1013j8295n826O7264
6057D8039J4240P546k0094l1076r038k1476j3926K5532k832j2267J1385k371j0808
6044a7146j9692L1627M1046l5336k0564K4768J3373k3117m1564k6458J4624k1602
6032h0041K125O2408L1204r387J0732M2631O808k9139L632m2370k0834O646R132
6019f453k536q498J9801j4899j2683k6968p93K1783L6791K731j4227j7152l5134
6006e8237r055L6751P936k7100l614L0803K4965m938l4963K3543M2757j3820p807
$$ plain form
6098 -5677 19329 23905 34799 35111 31064 32504 15702 -7589 2204 -674 17285 24721 21044 -18638
6084 -18638 -26909 -54132 -49595 -35714 -23325 -45225 -29239 -78105 -82301 -41302 -32813 3166 26123
6071 26123 24437 50650 41001 3524 20282 10696 4610 3971 4606 15909 4896 -13399 -19225 48039
6057 48039 62279 69825 49731 18655 9617 -11859 -25785 -253 -3085 -15352 -3967 -6338 -17146
6044 -17146 -36838 -5211 35835 499 -20065 4703 18076 -5041 -46605 -73063 -58439 -80041
6032 -80041 -77916 -15508 15696 6309 17041 59672 66480 37341 40973 -1397 -22231 -15585 -6453
6019 -6453 -8989 -17487 2314 -12585 -25268 -52236 -53029 -31246 5545 8276 -5951 -23103 -58237
6006 -58237 -67292 -30541 -22605 -49705 -53319 -22516 2449 -2489 -37452 -13909 28848 15028 7221
5993G221p202R374k2231J2032J5497k561k5889j414K5704L1259K327k3916l1035
5980a0834L222k3238J2383J2595j7028M334J7625L739K7975j8858m6157j5941
5968e0183K9833J3347j696O232K9376r899j0473K4741K411K58J1679j9887Q950
5955C4689k9568L694M1237p465l7024j3991K0623l3172k5149J1746R168o254J6760
5942a4706m285N645j9942K3998j7698O056L1135K298J5693K0664l0781k0016R
5929a930q790p771J3963K4697n605j3617J2160M0523M684k8117k3094j8657J3851
5916B297j6454j3991L0995j0422k3981l6318J5726J9076R403n333M088P268O309
5903a1337Q791m0960j3395M2005J4916l8230k782K2177K8270K2910J2313m810
$$ plain form
5993 7221 19 9393 -12838 -806 14691 12130 -13759 -15173 10531 41790 44117 20201 -10834
5980 -10834 -7612 -30850 -18467 -5872 -22900 -18566 -941 2798 30773 11915 -34242 -50183
5968 -50183 -20350 -7003 -8699 -2467 26909 17010 6537 31278 33689 33947 45626 25739 34689
5955 34689 5121 8815 50052 42587 5563 -8428 12195 -20977 -46126 -34380 -25212 -31466 -14706
5942 -14706 -18991 -13346 -33288 -9290 -26988 -20932 10203 12501 28194 48858 18077 -1939 -1930
5929 -1930 -10720 -18491 -4528 20169 14564 947 13107 53630 58314 30197 7103 -11554 2297
5916 2297 -14157 -28148 2847 -7575 -31556 -67874 -52148 -33072 -23669 -29002 -24914 -17646 -11337
5903 -11337 -2546 -43506 -56901 -14896 20 -38210 -40992 -18815 9455 32365 44678 39868
5891C9868k9558l5606L0225j0127m8101N003K51K1733R669k0802J5099Q644k3316
5878c7018L922L0700L3120K6731Q015L3153j8841o0547l9268K3573K1233n835
5866A8938J3494q138k4701p103o782K2997N160j3935k0237l1421j106M545O001
5853d2288J1356k97M624j8885P571m019J2872P874j0331r862K3421j1248l2111
5840f1323J6318n139M4360K0361j9377r340r743K5189L2217J6914j5703k5623
5828I111k5496j3553J071J7817L5205J0693J490J7943j0270m7895k9090K0825
5816a2149k1987K4757j3468n0953K9177N6884M6112L836l8789l172j3669q144
5804a565p127j3806K5449J4149j7580J5934m0831K8493L0907k791k2230O879k8643
$$ plain form
5891 39868 10310 -25296 4929 -5198 -53299 -48296 -48045 -26312 -16643 -37445 -22346 -13702 -37018
5878 -37018 -33096 -2396 30724 57455 65470 98623 79782 19235 -20033 3540 24773 18938
5866 18938 32432 24294 -407 -7510 -14292 8705 13865 -70 -20307 -51728 -52834 -48289 -42288
5853 -42288 -30932 -31229 -26605 -45490 -37919 -41938 -29066 -21192 -31523 -41385 -17964 -29212 -61323
5840 -61323 -45005 -50144 -5784 14577 -4800 -14140 -23883 1306 33523 50437 34734 9111
5828 9111 -16385 -29938 -28867 -11050 24155 34848 36338 54281 44011 -3884 -32974 -12149
5816 -12149 -34136 -9379 -22847 -73800 -44623 12261 58373 62209 23420 20248 6579 -1565
5804 -1565 -8692 -22498 2951 17100 -480 15454 -25377 3116 34023 31232 9002 15881 -12762
5791a2762M453J7896k6954k6003K4392J5921j1161k0549P278J2033Q145J4670
5779G359K132m728j0922n532L2806L369j3399k2467l5188Q369J3831o091R436
5766b1025M9666K7316k8218n361Q891k1549n3571q914K4398K4301J3331q028R752
5753A0989K1165l492k7067j9521L01O759j4170j8783M0748q730M654k2473K5797
5740c823J4509p820M76J4766k6804j7322k4457O870n4J5042K1498J9725m338k7888
5726a9620k0508k1446l6792L2831K4585p265K9830J3903l3492K1671j0356Q007
5714a8652M2787L6501j7834l4633n921n739r444j2759l524l0003J5883L0611k001
5701a4728j4427l7418J2827M9661k7538l1240J4456L2907j3557J9074J1852P294
$$ plain form
5791 -12762 -8309 9587 -17367 -43370 -18978 -3057 -14218 -34767 -27489 -15456 -7311 7359
5779 7359 9491 4763 -6159 -11691 21115 24484 11085 -11382 -46570 -38201 -24370 -30461 -21025
5766 -21025 28641 55957 27739 22378 31269 9720 -43851 -52765 -28367 -4066 9265 1237 10989
5753 10989 32154 28662 1595 -17926 -17625 -10866 -25036 -43819 -3071 -11801 -7147 -29620 -3823
5740 -3823 10686 2866 3342 18108 -8696 -26018 -50475 -43605 -43659 -28617 -7119 12606 8268 -19620
5726 -19620 -40128 -61574 -98366 -65535 -40950 -48215 -18385 -4482 -37974 -16303 -26659 -18652
5714 -18652 24135 60636 42802 8169 2248 -3491 -12935 -25694 -29218 -59221 -43338 -12727 -14728
5701 -14728 -29155 -66573 -53746 -4085 -31623 -62863 -48407 -15500 -29057 -9983 1869 9163
5689I163k3599j6504j570m863n465k1516M531L2551R977j6907J0691m821j5674
5676d4006L3732K6547j2523p930J0615l2903P051J9119q238j4769l4696n964O345
5663e7620j6093m64L7535L4588O738L1257r891m4461l4720n870p157n392J6996
5650e4554N903j6471J1690K9572Q068K6064J674R185k4369L0111J0707m7741m1470
5637e1631L9082L0369R48k6311k0242l0310K6618K4235k179K5678m877n477L626
5624I529k652J1578k1261l4128j3384O282R557o807k2565l502J2055J4762M9391
5611H855r984n610K1128n386J283k749J5232k9445L50L8089m2507m3354k7667
5598h1765N0746J7671j0808K5428N037K4330K3155p57n0489n1609J9535K3179
$$ plain form
5689 9163 -14436 -30940 -32510 -37373 -42838 -64354 -59823 -27272 -17295 -34202 -23511 -28332 -44006
5676 -44006 -10274 16273 3750 -4180 6435 -26468 -19417 -298 -8536 -23305 -58001 -63965 -57620
5663 -57620 -73713 -74177 -36642 -2054 4684 35941 26050 -18411 -53131 -59001 -66158 -71550 -54554
5650 -54554 -48651 -65122 -53432 -23860 -15792 10272 11946 21131 -3238 26873 37580 -10161 -51631
5637 -51631 -12549 17820 18768 -7543 -27785 -58095 -31477 -7242 -9421 16257 11380 5903 9529
5624 9529 6877 18455 -2806 -36934 -50318 -44036 -34479 -41286 -63851 -67353 -55298 -40536 8855
5611 8855 -1129 -6739 14389 9003 10286 7537 22769 -6676 -6326 31763 -10744 -54098 -81765
5598 -81765 -31019 -13348 -24156 1272 6309 30639 53794 53037 2548 -49061 -29526 -6347
5586f347M7091q766m978j3899j7119o864P981m5720j6022L0882K2221M818J9107
5573A2385p990l487R138N945n44J4870j3196n743J1141k0816m8245L163K6268
5560a7111q47J3389o699l018K443K5569N880k2997j931O516J9969j1369j1665
5547a871l4207k1403M767j64J5099J8864o664j1217K0656J8004j9048m1395n139
5534f3718O5988J5424O233M682l2457n737M3591J8321l0145j1056j6344j5332
5522b0550Q751j6411R711K970j3007l3393J8619L6261J8770q178j3167q800m171
5509b2595K8618N478m6917j4876k578K494J0895J4035L2185J9538K1105k9337
5497A8045J7577L393k2926j2618j2344J6044M187K3708M9806l275m7203k9680
$$ plain form
5586 -6347 40744 31978 27000 13101 -4018 -10882 -2901 -48621 -64643 -33761 -11540 -6722 12385
5573 12385 4395 908 10046 15991 15447 30317 17121 11378 22519 1703 -46542 -43379 -17111
5560 -17111 -17958 -4569 -11268 -14286 -11843 13726 19606 -3391 -5322 1194 21163 9794 -1871
5547 -1871 -36078 -57481 -52714 -52878 -37779 -18915 -25579 -36796 -16140 1864 -17184 -58579 -63718
5534 -63718 2270 17694 23927 28609 -3848 -9585 34006 52327 22182 11126 -5218 -20550
5522 -20550 -11799 -28210 -18499 -15529 -28536 -61929 -43310 -7049 11721 3543 -9624 -18424 -22595
5509 -22595 6023 11501 -35416 -50292 -52870 -50376 -39481 -25446 6739 26277 47382 18045
5497 18045 35622 39015 16089 3471 -8873 7171 11358 35066 84872 81597 34394 4714
5485D714j9278K6855M61j2617q470K6075K1534l735n089l674K2315K5832j15j3012
5471F1796l8830k0531j1978j2424j6772k1717l264K7305K7022K8802k2363K8635
5459B5681j598j9948j7522k2965j6944K1671J8836M537M298J5975j139K6568K3636
5446F1086k4214j8775N306l54j0019k0248Q120j742O420q479o761r924P941Q35
5432a0808j4277n310M441J0918r987J8011L2080j208k047M334j9427l0595k7875
5419e1750n276K2966J6998Q336l943J6087K2556N559l1244j7123R257J4833k1978
5406a4722o544l030J1172k2861M279R703J8355J0747j6056l599r780M0437M1604
5393E9705j2851q972K3639k9587m3019Q510p466o9191o235K9963L6703L8607M803
$$ plain form
5485 4714 -14564 12291 12752 135 -8335 17740 39274 35539 30450 26776 49091 74923 74808 61796
5471 61796 22966 2435 -9543 -21967 -38739 -60456 -63720 -36415 -9393 19409 -2954 25681
5459 25681 24083 4135 -13387 -36352 -53296 -31625 -12789 -8252 -3954 12021 10882 37450 61086
5446 61086 36872 18097 23403 23049 13030 -7218 902 -840 5580 -2899 -9660 -19584 -11643 -10808
5432 -10808 -25085 -30395 -25954 -15036 -25023 -7012 25068 23860 21813 26147 6720 -23875 -51750
5419 -51750 -57026 -34060 -17062 -8726 -12669 3418 25974 31533 289 -16834 -7577 7256 -14722
5406 -14722 -21266 -24296 -13124 -35985 -31706 -22003 -3648 7099 -8957 -12556 -22336 18101 59705
5393 59705 46854 37882 61521 31934 -11085 -2575 -10041 -79232 -85467 -55504 -18801 19806 24609
5380B4609m3039m432O816O139J9611j9190k5538L2071K2881l2198l4047N748K7730
5367a2839L0788K9786j1302k0989n425j9394R03O16k1964m06j4719k1954L2451
5354c4448K9301l0242l3329j906L2913K2462L441M163K7075o507l492k2853q115
5341b1537j5317Q634J2939J2486J7555J5853P351n646J5849O071j997J292M493
5328E8026l258k4787m1754k0139J1436r918m211K2108K6995k375M400o007q323
5315B193K1367k1512k2788J3212K7210J9099j3613J0456K8046n0036n5893K2635
5303a9624L095J4836j3400P620R807j5676Q320M34J4972N05L322J0710k460j942
5289B0519o9153j9814P784P3799P6350J4397l3641l4405j0411j2320K2643M076
$$ plain form
5380 24609 -18430 -22862 -16046 -9907 9704 -9486 -35024 -2953 19928 -12270 -46317 -40569 -12839
5367 -12839 17949 47735 36433 15444 10019 -9375 -8472 -7856 -29820 -30226 -44945 -66899 -34448
5354 -34448 -5147 -35389 -68718 -70624 -37711 -15249 -11808 -7645 19430 12923 9431 -13422 -21537
5341 -21537 -36854 -28220 -15281 -2795 14760 30613 37964 32318 48167 54238 52241 53533 58026
5328 58026 54768 29981 -11773 -31912 -20476 -30394 -34605 -12497 14498 12123 16523 10516 2193
5315 2193 23560 2048 -20740 -7528 19682 38781 25168 35624 63670 13634 -42259 -19624
5303 -19624 -16529 -1693 -15093 -7473 2334 -13342 -5022 -4588 10384 10889 14211 24921 22461 20519
5289 20519 -48634 -68448 -60664 13135 89485 103882 70241 35836 25425 13105 35748 39824
5277C9824k7753M184k6830m5575K0992j0463j079J8169K3628q746M756J2159K7786
5264C1052j5323l1112J391L197M263j4255k3308K5627N2290n93J807J2072k2622
5251B4486k9076J1238J5197k244J110M061O268l4744k0670k5979o240K3712Q408
5238b4473j5312J1022L4183J9306J5285k6978j5769q269m4491M407J7452j1545
5226d5182J6741N3384K3893m2827l3676j4170k140j7012K178N637K9699K7307
5214C832K6354J2816l8182m401Q136L49K2860R829l542k1817p252j3734j116k4267
5200c0135p487l41K8235L1299p216L2672M5086N104j1659o7572j0750k6765r877
5187b9406N803J1139K0614J4224M420q075J7876k032J4805j635j2859m4135l2029
$$ plain form
5277 39824 12071 16255 -10575 -56150 -35158 -45621 -46700 -28531 -4903 -13649 -8893 3266 31052
5264 31052 15729 -15383 -13992 -10795 -6532 -20787 -44095 -18468 33822 33229 35036 47108 24486
5251 24486 -4590 6648 21845 19601 20711 24772 31040 -3704 -24374 -50353 -56593 -32881 -24473
5238 -24473 -39785 -28763 5420 24726 40011 13033 -2736 -11005 -55496 -51089 -33637 -45182
5226 -45182 -28441 24943 48836 6009 -27667 -41837 -43977 -60989 -58811 -53174 -23475 3832
5214 3832 30186 43002 4820 419 8555 8904 31764 41593 38051 16234 8982 -4752 -5868 -30135
5200 -30135 -37622 -37963 -9728 21571 14355 47027 92113 97217 85558 17986 7236 -19529 -29406
5187 -29406 -23603 -12464 8150 22374 26794 18719 36595 34563 49368 47733 34874 -9261 -41290
5174d1290O581m062L3818o261m125J3638N635R772O3737J1104J4255R508n3022
5161E9288j1670j6379j8569k3083r497n607J1497j877l2661j5815K1396o484K3036
5148b6425K628r342L1099R188Q982J5520l5173l2206q158j4364j0024L6937K1886
5135i452M182j8223m7655J5601K9359J9679J6849K678k1328l896L6563r654K008
5122A6711j645j1741o455N39l728o037j4809J8939k772l5146k0799K3693L8993
5109d257J281m43M288j2681L1348O628l1889J578J7618J2317p442Q416j8543L9751
5095D7970M607l144J2505O989L681l969j4650m3099j8715J7944J8383M0056k6971
5082D1587n0585k5531M1434J2828m46K327j2686n1494k5702K9782M5766J2596
$$ plain form
5174 -41290 -34709 -38771 -4953 -11214 -15339 -1701 3934 13706 77443 88547 102802 112310 59288
5161 59288 47618 31239 12670 -10413 -19910 -25517 -14020 -15897 -48558 -64373 -42977 -49461 -26425
5148 -26425 -23797 -33139 -2040 7148 16130 31650 -3523 -35729 -43887 -58251 -68275 -31338 -9452
5135 -9452 -5270 -23493 -71148 -55547 -26188 -6509 10340 13018 -8310 -12206 24357 14703 16711
5122 16711 15066 3325 -3130 -2591 -6319 -12356 -27165 -8226 -10998 -46144 -66943 -43250 -4257
5109 -4257 -2976 -3419 869 -11812 19536 26164 -5725 -4147 13471 25788 18346 26762 8219 47970
5095 47970 52577 49433 61938 68927 72608 68639 53989 10890 -7825 10119 28502 68558 41587
5082 41587 -8998 -34529 6905 19733 19287 21614 8928 -42566 -68268 -38486 7280 19876
5070A9876P234l4125J8888K5239L072j400j2459k3480j7676j8355k4331J2007
5058d5510J2858L017J3318M661O4990Q846N087l7351k1239k8639J126L0542k4785
5045a3079o4519q241L5100K0621J7121J1003p064k213k2417K5697k3134l5338
5033f6463J5076L3686K0635Q231L6665n238l8668j3219j8275j4560j365j6640
5021f0135K2979k0129j0686K6319K7605L6355J8720N790L255r36l408m2783j2252
5008i306J2986L0595L1410Q128k6221k5942j615j3019M4218K2181m6567m5536
4996a8688J6831J0737O212l8033j3834J7495l498k6795q984K1287N789O115k6251
4983e1617j6726j368M5755K3012R150R507j4030q472K3844O398k907j7150l1414
$$ plain form
5070 19876 27110 -7015 11873 37112 40184 38784 26325 2845 -14831 -33186 -57517 -45510
5058 -45510 -32652 -29635 -16317 -11656 53334 62180 67267 29916 8677 -19962 -18836 11706 -13079
5045 -13079 -77598 -85839 -50739 -30118 -12997 -1994 -9058 -11271 -33688 -7991 -31125 -66463
5033 -66463 -51387 -17701 2934 11165 47830 42592 3924 -9295 -27570 -42130 -43495 -60135
5021 -60135 -37156 -57285 -67971 -41652 -14047 22308 41028 46818 50073 49137 45729 2946 -9306
5008 -9306 3680 34275 65685 73813 47592 21650 20035 7016 51234 73415 26848 -18688
4996 -18688 -1857 8880 15092 -22941 -36775 -19280 -22778 -49573 -58557 -37270 -31481 -25366 -51617
4983 -51617 -68343 -69711 -23956 -944 8206 17713 3683 -4789 19055 25453 22546 5396 -26018
4970b6018k249O75j7701K8203J7795P600L694M03N357L895n065J2489j6074j8158
4956e154J6632L2116n3401J582O266J977M989j552l0026j344M0600J9886J570
4943C4141l8674j7005K1225K8903J1184m1066m8898J1383J825j3389J5763L3222
4931a386J4232l5368R959K2411l832j0860M750k6019m404R996P629M79J0755r103
4917a0761Q49K2925L003o7J240j0446k7177o370J0455N492k3634K3873K94J2510
4903B186J2675k62k1094Q528J9057l9812j2753K5211L7910l636j6239r154j1429
4890h812j0503J7126L9148j1525m259j3975j771K3365J9096R615l4455j7553r089
4877c592k803N109k498j9798j4599j6937j0568L6346N9756K0012o080k5180l6245
$$ plain form
4970 -26018 -28267 -27592 -45293 -17090 705 8305 11999 12402 17759 21654 16589 29078 13004 -5154
4956 -5154 11478 43594 -9807 -8225 -1959 18 5007 3455 -26571 -27915 12685 32571 34141
4943 34141 -4533 -21538 -313 28590 39774 -1292 -50190 -38807 -36982 -50371 -34608 -1386
4931 -1386 12846 -22522 -12563 9848 6016 -4844 -94 -26113 -30517 -20521 -12892 -12413 -1658 -10761
4917 -10761 -9912 13013 16016 15949 17189 6743 -20434 -26804 -16349 -10857 -34491 -10618 -10324 2186
4903 2186 14861 14599 -6495 2033 21090 -18722 -31475 -6264 31646 28010 11771 2617 -8812
4890 -8812 -19315 -2189 36959 25434 21175 7200 5429 28794 47890 57505 23050 5497 -3592
4877 -3592 -6395 -1286 -3784 -23582 -38181 -55118 -65686 -29340 30416 50428 44348 19168 -17077
4864a7077j5398L431L2557r003K350K6051j3715l123k3848l822O182J8695N336
4851H616k4371J9763J3412l2352J8235k9277k4084J4996L786J9152J2315J123
4839A314r953j2015o889J5354k218O770j336K7667J5825j2242n247K150q460k3709
4825a2989L096L5801k685k6260J88J3586l287l0872O329j3214j4524K1488L4205
4812A0862k6849q55K1474O931Q664r236o360j6159k2447J8546o956K3151M8214
4799D8980K374l7200m4507J2880M1571j2457j0049p630j9769M718j6883j6075
4787e4047J8193N2152r039m608k6233K7570J265l4589k6837j3896Q888K8709L2060
4774d12Q251Q477O978m3819k4952J2198J6020J1290n30k1646k3641P453j1562
$$ plain form
4864 -17077 -32475 -29044 3513 -5490 -3140 22911 9196 6073 -17775 -21597 -15415 3280 8616
4851 8616 -15755 4008 17420 -14932 3303 -25974 -50058 -35062 -31276 -12124 191 1314
4839 1314 -8639 -20654 -27543 -12189 -14407 -7637 -8973 18694 34519 22277 17030 19180 10720 -12989
4825 -12989 -9893 25908 23223 -3037 -2849 10737 7450 -23422 -17093 -30307 -44831 -23343 10862
4812 10862 -15987 -16842 4632 11563 20227 10991 4631 -11528 -33975 -15429 -22385 766 48980
4799 48980 51354 14154 -30353 -17473 24098 11641 1592 -6038 -25807 -21089 -37972 -54047
4787 -54047 -35854 16298 7259 2651 -23582 3988 5253 -29336 -56173 -70069 -61181 -32472 -412
4774 -412 7839 16316 23294 -20525 -45477 -33279 -17259 -5969 -6499 -28145 -51786 -44333 -55895
4761e5895l963K7864L3197K0021k3070l682J4567M462Q507p230J800o109J3195
4748B3664L9436j9330o7038j3301M9609j4725n821K4920K5867N050R868L891k6262
4735C5828o199Q215J1982L838j5401k2874k0704J0171k783J8887P973l0484l3097
4722c4648Q311L3411J8234K8056m457l528j4287k5599j2695N698L1679M038Q877
4709D3090K200m4175j1622L617L3672R040K058j2489k8773K1462K8118j9990k3324
4696B884o0601J538J809J5292P278K2837J1833l7906J7891J8315j5564o3850L0902
4683d7342L9657n66Q896J5203K2485j2834j8249j5325O650K9952n72r120j8665
4670A70k2359n5341J3444K1222P544N718M3538l002j5737J6906K0555j0467j2559
$$ plain form
4761 -55895 -59858 -31994 1203 21224 -1846 -5528 9039 13501 22008 14778 16578 10469 23664
4748 23664 63100 43770 -23268 -36569 13040 -1685 -7506 17414 43281 48331 58199 62090 35828
4735 35828 29629 37844 49826 53664 38263 15389 -5315 4856 2073 20960 28933 -1551 -34648
4722 -34648 -26337 7074 25308 53364 48907 45379 31092 5493 -7202 -1504 30175 34213 43090
4709 43090 45290 1115 -10507 -6890 26782 35822 37880 25391 -3382 18080 46198 26208 2884
4696 2884 -57717 -56179 -54370 -39078 -31800 -8963 2870 -35036 -17145 1170 -14394 -78244 -47342
4683 -47342 -7685 -8251 645 15848 38333 25499 7250 -8075 -1425 28527 27955 18835 170
4670 170 -22189 -77530 -64086 -42864 -35320 -29602 13936 10934 -4803 12103 32658 22191 9632
4657I632k4559K2623K3141j360j046P856l4739o056M5223J4690K930l5594o5461
$$ plain form
4657 9632 -14927 7696 30837 29477 28431 36287 1548 -4508 40715 55405 58335 22741 -42720
$$ [...]
##END NTUPLES=NMR SPECTRUM
##END=
