##TITLE=Analysis number 320090
Compound Code mo 07000
Project Code adrs
Chemist Name spectrum
##JCAMPDX= 6.0         $$ Bruker NMR JCAMP-DX V2.0
##DATA TYPE= NMR SPECTRUM
##DATA CLASS= NTUPLES
##ORIGIN= Bruker BioSpin GmbH
##OWNER= nmr
$$ XWIN-NMR		Version 3.5
$$ Tue Jun 13 09:53:42 2006 GMT Daylight Time (UT+1h)  MAYBRIDGE\nmr@NMR_250MHZ
##.OBSERVE FREQUENCY= 250.131544655141
##.OBSERVE NUCLEUS= ^1H
##.ACQUISITION MODE= SIMULTANEOUS (DQD)
##.ACQUISITION SCHEME= undefined
##.AVERAGES= 16
##.DIGITISER RES= 18
##SPECTROMETER/DATA SYSTEM= dpx250
##.PULSE SEQUENCE= zg30
##.SOLVENT NAME= DMSO
##.SHIFT REFERENCE= (INTERNAL, DMSO, 0, 16.522)
##AUDIT TRAIL= $$ (NUMBER, WHEN, WHO, WHERE, WHAT)
$$ ##TITLE= Audit trail, XWIN-NMR		Version 3.5
$$ ##JCAMPDX= 5.01
$$ ##ORIGIN= Bruker BioSpin GmbH
$$ ##OWNER= nmr
$$ C:\u/data/dgb/nmr/ADRS/620/pdata/1/auditp.txt
$$ ##AUDIT TRAIL=  $$ (NUMBER, WHEN, WHO, WHERE, WHAT)
(   1,<2006-06-13 09:52:46.22 +100>,<MAYBRIDGE\nmr>,<NMR_250MHZ>,
      <created by zg, POWCHK disabled, PULCHK disabled
       configuration hash MD5:
       E2 DF 36 D8 04 B2 41 60 5A D7 A3 38 5A 4B D0 FE
       data hash MD5: 64K
       9B DD 26 F7 9B D7 57 0F 6F 24 8C BC BB 44 52 56>)
(   2,<2006-06-13 09:53:10.36 +100>,<MAYBRIDGE\nmr>,<NMR_250MHZ>,
      <Start of raw data processing
       ef LB = 0.3 FT_mod = 6 PKNL = 1 SI = 32K 
       data hash MD5: 32K
       7D 58 FC B5 79 10 10 4C 22 CD F0 8C 56 F8 25 BB>)
(   3,<2006-06-13 09:53:14.09 +100>,<MAYBRIDGE\nmr>,<NMR_250MHZ>,
      <apk 
       data hash MD5: 32K
       D1 93 A6 A5 21 8D E1 EF 45 5D E0 9E 2E 92 4B 98>)
(   4,<2006-06-13 09:53:15.72 +100>,<MAYBRIDGE\nmr>,<NMR_250MHZ>,
      <abs ABSG = 5 
       data hash MD5: 32K
       66 17 51 F2 B0 11 FE 9D 9B 05 86 87 21 8F E7 37>)
$$ ##END=
$$ 
$$ hash MD5
$$ 1C 6C 89 5B 92 D1 CB 62 14 1F 4B 4C 3F 59 07 45
##$RELAX= 
##$RELAX= 
##$RELAX= 
##$RELAX= 
##$RELAX= 
##$RELAX= 
##$RELAX= 
$$ Bruker specific parameters
$$ --------------------------
##$DU= <C:\u>
##$EXPNO= 620
##$NAME= <ADRS>
##$PROCNO= 1
##$TYPE= <nmr>
##$USER= <dgb>
##$AMP= (0..31)
100 100 100 100 100 100 100 100 100 100 100 100 100 100 100 100 100 100 
100 100 100 100 100 100 100 100 100 100 100 100 100 100 
##$AQSEQ= 0
##$AQ_mod= 3
##$AUNM= <au_zg>
##$AUTOPOS= <8 >
##$BF1= 250.13
##$BF2= 250.13
##$BF3= 250.13
##$BF4= 250.13
##$BF5= 500.13
##$BF6= 500.13
##$BF7= 500.13
##$BF8= 500.13
##$BYTORDA= 1
##$CFDGTYP= 0
##$CFRGTYP= 5
##$CHEMSTR= <none>
##$CNST= (0..31)
1 1 145 1 1 1 1 1 1 1 1 1 1 1 1 1 1 1 1 1 1 1 1 1 1 1 1 1 1 1 1 1 
##$CPDPRG= <>
##$CPDPRG1= <>
##$CPDPRG2= <>
##$CPDPRG3= <>
##$CPDPRG4= <mlev>
##$CPDPRG5= <mlev>
##$CPDPRG6= <mlev>
##$CPDPRG7= <mlev>
##$CPDPRG8= <mlev>
##$CPDPRGB= <>
##$CPDPRGT= <>
##$D= (0..31)
0 1 0 0 0 0 0 0 0 0.06 0 0 0 0 0 0 0.0002 0 0 0 0 0 0 0 0 0 0 0 0 0 0 
0 
##$DATE= 1150188763
##$DBL= (0..7)
120 120 120 120 120 120 120 120 
##$DBP= (0..7)
150 150 150 150 150 150 150 150 
##$DBP07= 0
##$DBPNAM0= <>
##$DBPNAM1= <>
##$DBPNAM2= <>
##$DBPNAM3= <>
$$ [...]
##$SUBNAM7= <"">
##$SUBNAM8= <"">
##$SUBNAM9= <"">
##$SW= 20.6930455092707
##$SWIBOX= (0..15)
0 0 3 0 0 0 0 0 0 0 0 0 0 0 0 0 
##$SW_h= 5175.983436853
##$TD= 65536
##$TD0= 1
##$TE= 295.16
##$TE2= 300
##$TE3= 300
##$TEG= 300
##$TL= (0..7)
0 120 120 120 120 120 120 120 
##$TP= (0..7)
150 150 150 150 150 150 150 150 
##$TP07= 0
##$TPNAME0= <>
##$TPNAME1= <>
##$TPNAME2= <>
##$TPNAME3= <>
##$TPNAME4= <>
##$TPNAME5= <>
##$TPNAME6= <>
##$TPNAME7= <>
##$TPOAL= (0..7)
0.5 0.5 0.5 0.5 0.5 0.5 0.5 0.5 
##$TPOFFS= (0..7)
0 0 0 0 0 0 0 0 
##$TUNHIN= 0
##$TUNHOUT= 0
##$TUNXOUT= 0
##$USERA1= <user>
##$USERA2= <user>
##$USERA3= <user>
##$USERA4= <user>
##$USERA5= <user>
##$V9= 5
##$VALIST= <valist>
##$VCLIST= <CCCCCCCCCCCCCCC>
##$VD= 0
##$VDLIST= <DDDDDDDDDDDDDDD>
##$VPLIST= <PPPPPPPPPPPPPPP>
##$VTLIST= <TTTTTTTTTTTTTTT>
##$WBST= 1024
##$WBSW= 4
##$XGAIN= (0..3)
0 0 0 0 
##$XL= 0
##$YL= 0
##$YMAX_a= 298603
##$YMIN_a= -360638
##$ZGOPTNS= <>
##$ZL1= 120
##$ZL2= 120
##$ZL3= 120
##$ZL4= 120
##$ABSF1= 16.522
##$ABSF2= -4.171173
##$ABSG= 5
##$ABSL= 3
##$ALPHA= 0
##$AQORDER= 0
##$ASSFAC= 0
##$ASSFACI= 0
##$ASSFACX= 0
##$ASSWID= 0
##$AUNMP= <proc_1d>
##$AZFE= 0.1
##$AZFW= 0.1
##$BCFW= 0
##$BC_mod= 0
##$BYTORDP= 0
##$COROFFS= 0
##$CY= 12.5
##$DATMOD= 1
##$DC= 0
##$DFILT= <>
##$DTYPP= 0
##$F1P= 14.0000005364418
##$F2P= -0.99999901652339
##$FCOR= 0.5
##$FTSIZE= 32768
##$FT_mod= 6
##$GAMMA= 0
##$GB= 0
##$INTBC= 1
##$INTSCL= 1
##$ISEN= 128
##$LB= 0.3
##$LEV0= 0
##$LPBIN= 0
##$MAXI= 10000
##$MC2= 0
##$MEAN= 0
##$ME_mod= 0
##$MI= 0
##$NCOEF= 0
##$NC_proc= -6
##$NLEV= 6
##$NOISF1= 0
##$NOISF2= 0
##$NSP= 0
##$NTH_PI= 0
##$NZP= 0
##$OFFSET= 16.522
##$PC= 1
##$PHC0= 167.5234
##$PHC1= 8.115432
##$PH_mod= 1
##$PKNL= yes
##$PPARMOD= 0
##$PSCAL= 4
##$PSIGN= 0
##$REVERSE= no
##$SF= 250.13
##$SI= 32768
##$SIGF1= 0
##$SIGF2= 0
##$SINO= 400
##$SIOLD= 32768
##$SREGLST= <1H.DMSO>
##$SSB= 0
##$STSI= 32768
##$STSR= 0
##$SW_p= 5175.98343685301
##$SYMM= 0
##$S_DEV= 0
##$TDeff= 65536
##$TDoff= 0
##$TI= <Analysis number 999999
Compound Code 99
Book Reference 9
Project Code 9>
##$TILT= no
##$TM1= 0
##$TM2= 0
##$TOPLEV= 0
##$USERP1= <user>
##$USERP2= <user>
##$USERP3= <user>
##$USERP4= <user>
##$USERP5= <user>
##$WDW= 1
##$XDIM= 32768
##$YMAX_p= 466637459
##$YMIN_p= -1643889
$$ End of Bruker specific parameters
$$ ---------------------------------
##NTUPLES= NMR SPECTRUM
##VAR_NAME=  FREQUENCY,     SPECTRUM/REAL,   SPECTRUM/IMAG
##SYMBOL=    X,             R,               I
##VAR_TYPE=  INDEPENDENT,   DEPENDENT,       DEPENDENT
##VAR_FORM=  AFFN,          ASDF,            ASDF
##VAR_DIM=   32768,         32768,           32768
##UNITS=     HZ,            ARBITRARY UNITS, ARBITRARY UNITS
##FACTOR=    0.157963299565203, 1,           1
##FIRST=     4132.6476996994, 0,             0
##LAST=      -1043.33573715361, 0,           0
##MIN=       -1043.33573715361, -1643889,    0
##MAX=       4132.6476996994, 466637459,     0
$$ Real data points
##PAGE= N=1
##DATA TABLE= (X++(R..R)), XYDATA
$$ [...]
23515c18343k10500J33298L54112M3532j00585K46860j74183M53447m3453k94362
23505H9823k67036R6063J8595o2501n6446j9537J02059k06795N3115L03789j34372
23494h3243j94911l18775J42859K08605J06812K42453k56554k04661r443J44689
23484b22169K17873o1949O42882n0595o63687J33711N3369N4484m1758l61869
23474b99708N64013J93323n08152k15175j57982J43253J84300j20214j20572K83252
23464e3662M23691k86728J48748k5548j63344n6602P3423j03259j97627K09590
23454c1318k58971P917J46408k37106K13332O55920L9486m58997l69857L8141
23444b55045j18940o0939L60440m4834J34897J13299j93982q421K5729n0113k10494
$$ y = [-318343, -528843, -395545, -41433, 2099, -98486, 148374, -25809, 427638, 384185, 89823, -177213, -81150, -62555, -125056, -181502, -201039, -98980, -305775, -252660, 51129, -83243, -278154, -596929, -454070, -245465, -138653, 103800, -152754, -357415, -366858, -222169, -4296, -66245, 576637, 526042, -137645, -3934, 49435, 103919, 62161, -299708, 264305, 457628, -50524, -265699, -423681, -280428, -96128, -216342, -336914, -53662, 370029, 83301, 232049, 206501, 43157, -13445, 59978, -43281, -240908, -31318, -290289, -282372, -135964, -373070, -159738, 496182, 535668, 76671, -293186, -255045, -373985, -434924, -74484, -119318, 15579, 128878, -65104, -73525, -47796, -97909, -308403]
23433c08403k83733l52754J28747K43912k9185J59478N05540Q1717J8577k61275
23423i7379m47318l14619O00237R09826j828p42292j47795J58483r0325K1056
23413a51954L28222J10063l2247j87167j22338k36217J69164j07226O1275J56521
23403a1904k59711K33542J6593m2868q2442k92118J8780L13266Q770J33338j87762
23392a52516J08742N54527L1600l70289j07386K1272P277K0699j84024j87750
23382b57848J42567R06136K11107l38437p28357n01667r4175K83752M08057L60211
23372C91346J39514l73808O942M05776j83054k61299O5180L7844o2611j3103J49730
23361C02457o6019R4432k04516j81021K08754M41121L78690o08139q05631m47227
$$ y = [-308403, -592136, -944890, -816143, -572231, -601416, -441938, 63602, 145319, 163896, -97379, -544697, -859316, -259079, 650747, 648919, -93373, -241168, -82685, -173010, -151954, 176268, 286331, 254084, 66917, -55421, -291638, -122474, -229700, -168425, -11904, -271615, -38073, -21480, -64348, -146790, -438908, -420128, -106862, -98092, 35246, -152516, -43774, 510753, 542353, 172064, 64678, 85950, 93227, 113926, -70098, -257848, -115281, 790855, 1001962, 663525, -64832, -566499, -660674, -376922, 31135, 391346, 530860, 157052, 163994, 569770, 386716, 125417, 190597, 228441, 165830, 152727, 302457, 236438, 330870, 126354, -54667, 154087, 595208, 973898, 365759, -439872, -887099]
23351h87099j95033J05964M71760L78607J56609K16914k70274j84764k31509o4551
23341e03376J82063n4722k40905R1964J84215K43433k96443M4580M0785j85902
23331d94308j3177j56737J06638N58251L64199j99748O9868L14913j21734j12102
23321C16063K50095m7397o6202J41686m9191L3402q90822k18940L58829L3351
23311a39126j23022j05927J1917N97423o9881M68437L97504l44400j49562j97305
23301C46058m0928J6152j6546r8168M9815Q7565k44423j88349K27283K333j88689
23290d7897P5981k33795k4439J31118K45586j69622k29230L18085O324n34886
23280d62775J29018j70217J41229J39521J7355M83846J07939j70827l07412n53395
$$ y = [-887099, -1082132, -976168, -504408, -125801, 30808, 247722, -22552, -207316, -438825, -503376, -321313, -376035, -616940, -524976, -340761, -97328, -393771, -349191, -308406, -494308, -507485, -664222, -557584, 667, 364866, 165118, 234986, 549899, 428165, 316063, 566158, 518761, 452559, 594245, 545054, 578456, -312366, -531306, -172477, -139126, -262148, -368075, -356158, 241265, 171384, 639821, 1037325, 692925, 543363, 346058, 305130, 321282, 304736, 206568, 256383, 343948, 99525, -88824, 138459, 140792, -47897, 28084, -205711, -230150, -99032, 146554, -23068, -252298, 65787, 72111, -462775, -333757, -503974, -362745, -223224, -205869, 277977, 385916, 215089, -92323, -645718]
23270f45718q4947L04046J72616L19366J14896P6009k50524k53106k18332l47627
23260h13321K3436K03740j0070m8173M60271M958l78952r8928L05718Q4391j41583
23249d08513L15297O4670J14061J98441N6572r6210o32071m04951L26801J97591
23239b68312K89244J84923k01510j51320J93672j678l59701Q814K3870O22413
23229C40415L49941k81984m69556p3433o60284j54182K53458K42272M5268K45360
23219a62725J83705R0188p1250m0530j58563K11367j3630k64532j23989K42924
23209a07035Q6068j20982L08558J85396l59163k72942l76667k05767L2893K29218
23199f00423J77213J43051k20083k71905K73688o4368m9074O30997P1856k43651
$$ y = [-645718, -730665, -426619, -254003, 65363, 180259, 256268, 5744, -247362, -465694, -813321, -789885, -586145, -596215, -644388, -184117, -179159, -558111, -657039, -351321, -266930, -408513, -93216, -28546, 85515, 283956, 340528, 244318, -387753, -792704, -465903, -268312, 20932, 205855, 4345, -146975, 46697, 45019, -314682, -305868, -281998, 340415, 690356, 408372, -61184, -134617, -794901, -949083, -695625, -453353, -408085, -162725, 20980, 111168, 39918, -612, -159175, 52192, 38562, -225970, -349959, -107035, -20967, -141949, 166609, 352005, -7158, -280100, -656767, -862534, -829641, -600423, -423210, -280159, -500242, -772147, -498459, -562827, -611901, 19096, 90952, -152699]
23189a52699K02547K72625J54429L35000J46482m20957K90885k26439m95956J76516
23179B82433J82814k45663m16118o0096M80581o530k06107J05534K7629j11690
23169C2787J38696l74248J37752K97983q1081j20336O8681J95323P9098j16528
23159B58127j1125k35128l68443J53210o464j38863j6564J25756J08744J69320
23149C8570M6523O462K95226m68011k35076K7572M82573j84468j87574l31761
23139e09964k47601k07600J64291M78293l8761j64112p7793L16576K55264L75592
23129C44185j26823j25088K05292q72l00692k24950k277R8183J67905N73629K54810
23118H63302N4339n8726k72182J61982L33566K316j10814J0155l63902m53075
$$ y = [-152699, 49848, 322473, 476902, 811902, 958384, 537427, 828312, 601873, 105917, 282433, 465247, 219584, -196534, -256630, 223951, 217421, 11314, 116848, 144477, 32787, 171483, -202765, -65013, 232970, 151889, 31553, 100234, 295557, 374655, 258127, 247002, 11874, -356569, -203359, -209823, -348686, -365250, -239494, -130750, 38570, 85093, 91555, 386781, -81230, -316306, -288734, 193839, 9371, -178203, -509964, -757565, -965165, -800874, -322581, -361342, -525454, -603247, -286671, -31407, 344185, 217362, 92274, 297566, 296694, -3998, -228948, -231225, -133042, 34863, 608492, 863302, 917641, 858915, 586733, 748715, 1082281, 1084597, 973783, 983938, 620036, 166961]
23108A66961l14008K60329j84654j03986p49627p18904K53596L51622l21867K09485
23098a151053L57205L61653K57545k71340L5898L98192m2932j18658q989p8168
23088b60647j29730L76882K79668j79042l2421j65346m40292m55569M0341K73848
23078f92308O2263l418K04054L69629J48989J5200Q4472j06745J28996L49818
23068E60950j71343m51675j94556K47275M31622N3819j30236Q3000o3245l26066
23058C9545l59315K88305N14561k81976m27924K03222M23389k82294n06350j88576
23048e77413J38867J02823m1523K79170k0129j08663L74214L36951k6973l45713
23038A11611J0216M3055K05843K36831l14026M3563O2588J62642P1927K8776k31634
$$ y = [166961, -147047, 113282, -71372, -175358, -924985, -1643889, -1390293, -1038671, -1360538, -1151053, -793848, -432195, -174650, -445990, -410092, -11900, -54832, -173490, -182479, -260647, -390377, -13495, 266173, 87131, 54710, -110636, -550928, -1006497, -966156, -692308, -630045, -633463, -429409, -59780, 89209, 104409, 188881, 82136, 211132, 560950, 389607, -62068, -256624, -9349, 422273, 476092, 345856, 428856, 365611, 39545, -319770, -31465, 483096, 201120, -226804, -23582, 399807, 117513, -388837, -577413, -438546, -335723, -377246, -98076, -118205, -226868, 147346, 484297, 457324, 111611, 121827, 164882, 370725, 607556, 293530, 337093, 399681, 562323, 634250, 663026, 431392]
23027D31392j72224q0095j68510m6906l35889j99001J05577J80924Q4115k44197
23017d44814n52664M8908J75719N49403J45613k28299M7389J20523k1462j18972
23007b78656Q620l84492l24519M4379M74254k99935l3437K92593N1131l16616
22997g66678K4471K15103J36879K10782j28493K07006K46654L0891m28629j17874
22987c69888K66080M37981K50326k6789j56444j97076L40617K67119o0200l79340
22977C72386k17417o0315M10854L18071m5568l75817m14462J34085N4338N5909
22967B32064L67501k32064k47597o4253o7775n1926k09699M53328J49300J83951
22957E12830k31534P767J10659J22546k68508M4407K06939n33479q8973K18572
$$ y = [431392, 259168, 179073, 10563, -36343, -372232, -571233, -465656, -284732, -200617, -444814, -997478, -948570, -772851, -223448, -77835, -306134, -258745, -138222, -159684, -278656, -270036, -654528, -979047, -934668, -460414, -760349, -793786, -501193, -450062, -766678, -742207, -527104, -390225, -179443, -307936, -100930, 145724, 176615, -252014, -369888, -103808, 334173, 584499, 557710, 401266, 204190, 544807, 811926, 751726, 372386, 154969, 94654, 505508, 823579, 778011, 402194, -12268, 121817, 176155, 232064, 599565, 367501, 119904, 55651, -12124, -64050, -273749, 179579, 328879, 512830, 281296, 289063, 399722, 522268, 253760, 298167, 505106, -28373, -117346, 101226]
22947A01226L02824l4608j50696j17803l94171j97776k36895K7836J08099P5574
22937e16390j3086M86511K60630o7088l27769j35660K17532L24714J76448l57945
22927D7897O8507Q03941P0692j82140j8122j4185k30568k49627k40019o3024K02641
22916A95993l9577k8979m18380L33772L30755J29714k17152m58092L440j37418
22906c05924O3586J17593N4360l31302k62206j70910j54010M22152L85612j55140
22896c36189k5235J82337K25675l12302r5558J34829q0458K58669K78857k8716
22886B01909k43071k82194m11512Q6523M3536k47508J64100K55845m1593j27029
22876f00994m913M54653l8300l6510K37123J73917m8869j89719K28048l98965
$$ y = [101226, 404050, 369442, 218746, 100943, -293228, -491004, -727899, -700063, -591964, -516390, -529476, -42965, 217665, 150577, -177192, -312852, -95320, 229394, 405842, 47897, 116404, 920345, 991037, 808897, 790775, 776590, 546022, 296395, 56376, -6648, 195993, 156416, 127437, -290943, 42829, 373584, 503298, 286146, -171946, -168506, -305924, -242338, -124745, -70385, -401687, -663893, -834803, -988813, -566661, -181049, -336189, -361424, -179087, 46588, -265714, -361272, -226443, -306901, -48232, 230625, 201909, -41162, -323356, -734868, -648345, -604809, -852317, -688217, -432372, -473965, -600994, -605907, -151254, -189554, -226064, 11059, 184976, 136107, -53612, 174436, -224529]
22866b24529m61380J44259J84813J90420J83468J57980K23431K42504j89237l38858
22856A12871j4030j8555L99954J87307l44113j29580O7683l31615n7905n30552
22846f58535J94860L76790j45961J3082J78529l3202P6617K7744j39985J21573
22836A1512j10185P9227l5101l66003q8401J85799n656J18128K27944J82994k35661
22825c5403k75344j18712K02038l42871m75188J44715K40111m7379J05694N41584
22815f0755j31761p41464J43519L78938M7030J28068M1163M5116J02941k9267
22805g6472j19108L21957K6575J5641j31622l06604M4497k0572J79694p6152j79814
22794c21980O4012J95398K13091p9217M02543q1318n09615J41776r0699p1852
$$ y = [-224529, -685909, -541650, -356837, -166417, 17051, 175031, 398462, 640966, 451729, 112871, 98841, 80286, 480240, 667547, 323434, 193854, 261537, -70078, -127983, -658535, -463675, -86885, -232846, -219764, -41235, -74437, 2180, 29924, -110061, 11512, -98673, -19446, -54547, -420550, -508951, -323152, -328808, -210680, 17264, 200258, -35403, -310747, -429459, -227421, -570292, -1045480, -900765, -660654, -708033, -602339, -60755, -192516, -933980, -790461, -411523, -364493, -236425, -195262, -150146, -47205, -76472, -195580, 126377, 152952, 168593, 36971, -269633, -225136, -245708, -66014, -142166, -321980, -257968, -62570, 150521, 71304, 473847, 392529, -117086, 24690, -66009, -137861]
22784a37861l2734R9699J68448K86403J39330m93723J52337O7220j94802l2062
22774B2255k79418M2479J69185k25846l83065J31016K39312K88752N21096l10894
22764B14872k22753K10664L0744n33904k76587M28906N42053j79606k00097l13072
22754b98780O2676O3159n2362K81527p5797m69548M56992M30286k19559l61276
22744a82682K79401j43076K05689J20608n49066j6386O62665p5168j37941K53651
22734D17695m17600m38482P4871K12030M45379k75830j14377K05915J17022m22398
22724a95775K89578Q5330l08355K97242l29915N45M88648R1763o2020K11467m17105
22713A51403j62497L5188j19359J46509L3935k00162n86197J23119K50196Q5582
$$ y = [-137861, -170595, -70896, 97552, 383955, 523285, 29562, 181899, 249119, 54317, 22255, -257163, -214684, -45499, -271345, -654410, -523394, -284082, 4670, 525766, 214872, -7881, 202783, 233527, -300377, -576964, -148058, 393995, 214389, 14292, -298780, -236104, -172945, -225307, 56220, -19577, -489125, -32133, 398153, 178594, -182682, 96719, -46357, 159332, 279940, -269126, -285512, 377153, 301985, 164044, 417695, 95, -438387, -363516, -151486, 293893, 18063, -96314, 109601, 226623, -195775, 93803, 179133, -129222, 168020, -161895, -161350, 327298, 419061, 357041, 568508, 151403, -11094, 24094, -95265, 51244, 85179, -114983, -701180, -578061, -327865, -242283]
22703b42283j21820J60958J09877k75621L51439J27304J78078m8247n07799k14652
22693d82766k01381k24677J74248K40561M91457M41734j13754j44031R2593m1191
22683B32793l2028J47126m14405m49413o1388K06021M43618l5718J61927n1346
22673A47187o89814j10923K67209J71636K86566J31696q6075K0892q4396o3212
22663i234j31443O0503J53490k2615J67534K71404j94776k24984l580j00176K99913
22652B66036l4671M57028j42148k84844n23053l51700K83820M21504P2039m8170
22642A15841L14559L28861l27033J94892k01746P0974M41085Q7953p9231l28516
22632F17639j56406o192J59873j26056m56443k28442J35087j94930k65368N70464
$$ y = [-242283, -364103, -203145, -93268, -368889, -17450, 109854, 287932, 239685, -268114, -482766, -684147, -908824, -734576, -494015, -2558, 439176, 325422, 181391, 273984, 232793, 200765, 347891, -66514, -515927, -577315, -371294, 72324, 36606, 198533, 147187, -542627, -653550, -386341, -214705, 71861, 203557, 117482, 138374, 53978, -9234, -140677, -80174, 73316, 50701, 218235, 489639, 294863, 69879, 66299, -33877, 266036, 231365, 688393, 546245, 261401, -261652, -613352, -329532, 91972, 164011, 115841, 430400, 759261, 432228, 627120, 425374, 496348, 937433, 1025386, 946155, 617639, 461233, 455041, 614914, 488858, 32415, -196027, -60940, -255870, -521238, 49226]
22622D9226j2525J3717K92639L71768o927k2168l85034k22211L571j87909L3262
22611g2591q5207j89139J59417O67462j48449l43593L78724K48020m35928m32368
22601b53652j48578n61812o6966L60235L78596N1236K45786K72722Q9562l73517
22591f388m21063k67854M47857J51903K8421J361J36001L25243O18000l36823
22581F76658q42403J96134m90852j22323M72121J62869J2340J05363N3567k23838
22571c64p8897l34657J20927N25655N5946k19002p6460O7116l29114J20868J20368
22560b7614n22214o48619m05820N85371L12533j50467L16720N1868j2680J22869
22550c78053J50805L04818K78471K37205k30659j04190M16623l28193k1284Q5274
$$ y = [49226, 36701, 50418, 343057, 714825, 707898, 685730, 300696, 78485, 82056, -105853, -72591, -157798, -346937, -187520, 479942, 331493, -12100, 366624, 614644, 178716, -253652, -402230, -964042, -1031008, -670773, -292177, -240941, 4845, 277567, 367129, -6388, -427451, -695305, -247448, -95545, -67124, -65763, 70238, 395481, 1013481, 676658, -165745, 30389, -460463, -582786, -110665, 52204, 64544, 169907, 223474, -364, -79261, -413918, -292991, 232664, 288610, 69608, -6852, 60264, -268850, -147982, -27614, -549828, -1198447, -1604267, -1018896, -706363, -856830, -540110, -488242, -500922, -378053, -227248, 77570, 356041, 593246, 362587, 258397, 675020, 346827, 325543, 410817]
22540D10817q9146j54730o305m24989J27607L83849K27946r6344q177k00773j26883
22529D2872R2442j21500l06803J96148J21141k3236J01756j05173k06978m46418
22519f55749N7941L87132L75719j03276L25655K54715J55664J10855p3068k25589
22509F09999o43739k5974P8868l86583K72961K0759O7149k16738J31240k9972
22499a22030r4910J20696K25276J30715j41116k43233p1189M0171K08718o7625
22489a4527p0934q0655L12837K02871n2351J08588P7305k79505k50526j83243
22479b30140O2667L23778n57l52432L4686j3194K6608j85857P5061K53528j87730
22468a93582J06984J21490o0091l47942l2008J92767r7416Q5600M199j50431j22367
$$ y = [410817, 321671, 166941, 160636, -264353, -136746, 247103, 475049, 378705, 370528, 169755, 42872, 135314, 13814, -292989, -96841, 24300, 1064, 102820, -2353, -209331, -655749, -597808, -210676, 165043, 61767, 387422, 642137, 797801, 908656, 835588, 609999, -33740, -59714, 19154, -367429, -94468, -73709, -6560, -223298, -92058, -122030, -216940, -96244, 129032, 259747, 118631, -124602, -195791, -155620, 53098, -14527, -85461, -166116, 146721, 349592, 297241, 405829, 483134, 203629, -46897, -230140, -167473, 156305, 155748, -196684, -161998, -175192, -148584, -334441, -259380, -5852, -193582, -86598, 34892, -25199, -373141, -405149, -212382, -309798, -224198, -219999, -370430, -492797]
22457d92797J0621K26630K66308j45763k77198j68259L19382M33580j52529p2599
22447e2624o8293j41338J9800j54231N87284l9118l2933J6679n05030k6801N02258
22436A05653M72251l08426j07369N8709j80278l64202j49138r4787J03041k17966
22426f82512J43110Q235j30992M05108L35206N19512l35836o89793l90391J99743
22416f18610J89203o9641o8838K43647Q2074r2539J86932k73040R0540j97337
22406e27609r2806P454J00193K56736P3689k1570j13706j97311L51581K8279J75580
22395D0510J40065j53768l1241j50905J4494L03365J15674j36430j52473L11234
22385C00525K10368Q6219N2948j66486L4549l49061k0929K13052J0531j52666
$$ y = [-492797, -482176, -255546, 10762, -135001, -412199, -580458, -261076, 172504, 19975, -52624, -120917, -262255, -242455, -396686, 190598, 151480, 118547, 135226, -369804, -396605, 105653, 577904, 269478, 162109, 220818, 40540, -323662, -472800, -567587, -464546, -682512, -539402, -531167, -662159, -257051, 78155, 597667, 261831, -427962, -818353, -618610, -429407, -499048, -567886, -324239, -242165, -334704, -147772, -420812, -330272, -527609, -620415, -612961, -512768, -256032, -182343, -203913, -317619, -514930, -163349, -135070, 40510, 180575, 26807, -4434, -155339, -140845, 162520, 278194, 141764, -10709, 300525, 510893, 597112, 650060, 483574, 518123, 169062, 148133, 361185, 371716, 219050]
22375B19050M22080k0339k7763l0476K50782K55771r288k87547q4351m55256o54672
22364d22009K23715L75434j3036N8978J0123l06553r9162K29425o5500n55265
22354e63850j45292q1318K33598L32554M00445k4372L07237J4590l99946J99164
22344B72810l4799J34952J10767k64479k46387p2027K32410K66981L35577j12112
22334F23693m62042j73617j98630k65967L2598M31436K63593l45062n8507j20410
22324b72915r9151P132n46735j37664K52754L32843K16260M05550j17321k00349
22314a59596L14909J98497j92913j4978k6262J09932r6792o4627j81194l82449
22304d95473p3817L57692J84968k16716j38136j85438J55218N31845J54763k7178
$$ y = [219050, 641130, 620791, 593028, 562552, 813334, 1069105, 1059817, 772270, 687919, 232663, -422009, -198294, 177140, 164104, 223082, 233205, -73348, -172510, 56915, -8585, -563850, -709142, -790460, -556862, -224308, 176137, 151765, 459002, 473592, 73646, 272810, 238011, 372963, 483730, 219251, -27136, -99163, 133247, 400228, 735805, 623693, 161651, -11966, -210596, -476563, -443965, -12529, 251064, -93998, -152505, -272915, -372066, -364934, -911669, -1049333, -796579, -463736, -247476, 158074, 40753, -159596, 155313, 353810, 160897, 145919, 119657, 229589, 132797, 68170, -113024, -495473, -569290, -211598, -26630, -243346, -381482, -566920, -411702, 120143, 274906, 247728]
22294B47728l04252l20288l11386K527J88832L05962L88310M03673j00537K22162
22284G22731k52054k76201J20558p1134m45659J25305j1394M0207j95923r3376
22274c36940m9113N98O003j45375j21061J58672M12874K04195n1681j69597J15938
22263B4513n5742j21109N04445m387K07530j17606N5718j83170p8713l48911o826
22252a24258L18573J885k81774j83868Q4062m3007p9523k9484J2023J31174r8747
22241b92944J91056k2495J48047K04516L01048j5267l70820n15964J70724Q0069
22231a22030J51920K15780O3274k53847p0870j2669k29237l03474j47942k82283
22221i91378O1401M30513L55091L97300N6726k4084k16804N754K2800j64789l69959
$$ y = [247728, -56524, -376812, -688198, -685671, -496839, -190877, 197433, 601106, 500569, 722731, 470677, 194476, 315034, 243900, -201759, -76454, -87848, -47641, -243564, -336940, -386053, -385455, -379452, -524827, -645888, -487216, -74342, 129853, 78172, -91425, 24513, -31229, -152338, 352107, 347720, 555250, 437644, 493362, 310192, 231479, -117432, -124258, 194315, 196200, -85574, -269442, -185380, -228387, -307910, -337394, -325371, -194197, -292944, -101888, -124383, 23664, 228180, 529228, 513961, 143141, -372823, -202099, -122030, 29890, 245670, 308944, 55097, -15773, -28442, -257679, -561153, -709095, -991378, -929977, -499464, -144373, 252927, 309653, 285569, 68765, 74519, 97319, -67470, -437429]
22210d37429J8526o0933J33867K96966j90111L07919l01386o02229J62751J51183
22200e20876j40175L70681O5218p9906q8882n12020K37321O04665L22853r341
22190B49538j24263k37990K13451N545M28540K97989k56917m38738m03653J03553
22180a62945J11432j6123L90312m98220j09778l19820o1481J34897K85117L71878
22170A25269k01844m37867j31580J35998L00508P26661j3015k60794j13078K08925
22160C39183K53765m99550m00142J23351K78063Q5516J34048K74713J42517o8676
22150F62788j58248k0240J05923J39431m92432l8375k64001j27686K84409L03953
22140C95522j35547q1757j14790J1950j20222N7162j21519m0243K051M12212R418
$$ y = [-437429, -418903, -479836, -345969, -49003, -239114, 68805, -232581, -834810, -672059, -520876, -661051, -290370, -225152, -305058, -393940, -905960, -668639, -63974, 258879, 249538, 125275, -112715, 100736, 106281, 534821, 832810, 575893, 137155, -266498, -162945, -51513, -67636, 322676, -175544, -285322, -605142, -666623, -531726, -246609, 125269, -76575, -514442, -646022, -510024, -209516, 517145, 504130, 243336, 130258, 339183, 592948, 93398, -306744, -183393, 94670, 180186, 314234, 588947, 731464, 662788, 504540, 484300, 590223, 729654, 237222, 198847, -65154, -192840, 91569, 395522, 259975, 178218, 63428, 75378, -44844, 12318, -109201, -149444, -147393, 264819, 274237]
22129B74237o9016K28854k08168m2274m7011j54597l64229l33932j54444N00777
22119c69803n2371P049N0207k9318P1967p8441J94633j70818O2756j74343K04563
22108b83919j06894k75323Q9517n2543J18089K39978M89360M5993j77665j88873
22098a02280r2751n41069m34425J24940K68917J58535L25831M41902j15160k1285
22088A3155l1827L39802j01127L97220l1018j88625k47371j01876k31794k80533
22078d63994k46260J45043N7200Q2282k66023k40117J00977j9309K74979P0194
22068e05028k19453K1612p416l46058j84067K45263L22387M76502j73404j51406
22058e21068J30227j13795K12304j94141j91854N1539k39444r8474M45619J34104
$$ y = [274237, 205221, 434075, 225907, 183633, 136622, -17975, -382204, -716136, -870580, -369803, -422174, -415125, -364918, -394236, -322269, -400710, -206077, -376895, -314139, -488482, -283919, -390813, -666136, -576619, -629162, -511073, -271095, 218265, 264258, 86593, -102280, -195031, -736100, -1170525, -1045585, -776668, -618133, -292302, 149600, 34440, 13155, -18672, 321130, 220003, 617223, 586205, 397580, 150209, 48333, -183461, -463994, -710254, -565211, -508011, -425729, -691752, -931869, -830892, -850201, -575222, -505028, -724481, -702869, -710285, -1056343, -1240410, -995147, -672760, -196258, -369662, -521068, -390841, -504636, -292332, -486473, -678327, -626788, -866232, -964706, -519087, -384983]
22048c84983K24718R0996N4894q7139J97150j2012l55968l06870k8366R560M26569
22037a71451J10480J36156L436m53228k69323j40718R5398K37581J81598J6932
22027b53139L44517M70295J96004j64740l59621j54237j62655Q9227L69913m2282
22017C33282L05653L76832n56914o96790o5377J71691j47667k64612M09558M57963
22007C23619k94163j4477k67985K50195K08366J14033l06149k8646p7380k05468
21997b98055Q7616P3522P8979p1041j12563P3825J70082J20000J30190k49693
21987B862O1498L56870R7550K70824k76536J38815J16147l71533n15210l3375
21977a52088M68010J84325j19525p4774M4907J3270j36121j60404q4960m42626
$$ y = [-384983, -160265, -69269, -14375, -101514, 95636, 83624, -272344, -579214, -607580, -598020, -171451, -60971, 75185, 78621, -374607, -643930, -784648, -689250, -451669, -270071, -253139, 91378, 561673, 757677, 592937, 233316, 79079, -83576, 5651, 375564, 333282, 638935, 1015767, 458853, -237937, -303314, -131623, -279290, -543902, -134344, 323619, 29456, 14979, -253006, -2811, 205555, 319588, 13439, -15207, -92587, -298055, -210439, -136917, -57938, -128979, -241542, -167717, 2365, 122365, 252555, 2862, 64360, 421230, 518780, 789604, 513068, 651883, 768030, 396497, -118713, -152088, 315922, 500247, 380722, 305948, 350855, 364125, 228004, 67600, -17360, -459986]
21967d59986P7695k9274L24294j72302k04147p4199O87513J71514o69254k84150
21957f32296J04189m9242Q8721L54979L17768m2983j7560m965k68650j65309L3211
21946b82137k7329L86254l3871m55887N1862k6665K7114N7343q9983Q5288L76820
21935F8809P2164n37459k37933K56991M05115L09566m34764j18008M09875K34207
21925D28563j95562k80465K38641l32127m8930p5619j66159J29134K83149M44050
21915D24675k71567m52342O7152L31192p0252l47749J10397R2450j22459M72811
21905B34308k43134k28900J3479j37354J68511M08979L75896l0342k99002j52777
21895A09664l29949R3396K91807N2686k97196k12702L37459L69605k17346L40576
$$ y = [-459986, -382291, -411565, -87271, -259573, -463720, -537919, 149594, 321108, -348146, -632296, -528107, -577349, -488628, -133649, 184119, 141136, 123576, 118611, -150039, -315348, -282137, -309466, 76788, 42917, -412970, -361108, -387773, -360659, -303316, -393299, -308011, 68809, 140973, -396486, -634419, -377428, 27687, 337253, -97511, -215519, 194356, 428563, 233001, -47464, 191177, -140950, -189880, -265499, -431658, -302524, -19375, 424675, 153108, -299234, -232082, 99110, 28858, -318891, -208494, -116044, -238503, 234308, -8826, -237726, -224247, -361601, -193090, 215889, 591785, 561443, 262441, 109664, -220285, -126889, 164918, 217604, -79592, -292294, 45165, 414770, 197424, 538000]
21885E38000L32316l60763l34160j61727L8649j64939J66854j5701k55640K20921
21875C810J38341J11877J26496K83227l64666n60348n7200J07812r3889k12195
21865e16735J38484m72299q078M43805M85410L84159l1642o7549n560k19305n7549
21854G3141J14478k14325j39888N5075l3294k02643n3664j03150J8869J25964
21844c59437K3228l07822r4138O22905M80568J61718k74464k73637m78585k89897
21834g89561N386L70650r4027K5708o0155j72050p1845J6388J50095M90908L69427
21823B40924n0086j54323M7775M41928j09566j73910k76676j39359j94909m1088
21813d09290Q6539L44613J58010k93701J4534k31937l17008j79767n0506n9866
$$ y = [538000, 870316, 509553, 175393, 13666, 52315, -112624, 54230, 38529, -217111, 3810, 142151, 254028, 380524, 663751, 299085, -261263, -318463, -210651, -304540, -516735, -378251, -850550, -858628, -414823, 70587, 454746, 423104, 355555, 349995, 130690, 73141, 187619, -26706, -166594, -111519, -144813, -347456, -401120, -504270, -485401, -359437, -336209, -644031, -738169, -115264, 365304, 527022, 252558, -21079, -499664, -789561, -784175, -413525, -507552, -481844, -541999, -714049, -785894, -769506, -619411, -128503, 240924, 190838, 36515, 84290, 526218, 416652, 242742, -33934, -173293, -368202, -409290, -322751, 21862, 179872, -113829, -99295, -331232, -648240, -828007, -878513, -938379]
21803i38379M2526K01505J58936K76103K61648J86870l1539R5368J97857j43378
21793C07517j40056l19692j57806k9248J5774p1505J2646k41533K62565J80060
21783a81278k2380m9059k09262J80411M5749J37274N93907j01170k57257j6334
21773A20601K10251q7836K7765l23809k71528J29091l48009q7858r5844N7331
21763f69845K14965k92819r8052K47862M94205L33368N127j13487l78124L00205
21753D3405r9178J54561o5444m33827K3638k23421K41099N33433j00667o48113
21743e74514o2502Q2653L00739q3247j44442j14996j36919J63703J22699M5258
21733d01568R280K35504m3208l87380j35272J58749j6116j9995k1414k5291j42543
$$ y = [-938379, -895853, -694348, -535412, -259309, 2339, 189209, 157670, 253038, 450895, 307517, 167461, -152231, -310037, -339285, -323511, -395016, -382370, -623903, -361338, -181278, -203658, -252717, -461979, -281568, -235819, -98545, 495362, 394192, 136935, 120601, 330852, 243016, 270781, -53028, -324556, -195465, -543474, -631332, -727176, -669845, -454880, -747699, -845751, -597889, -103684, 229684, 234811, 121324, -256800, 43405, -55773, 98788, 33344, -400483, -376845, -600266, -359167, 174266, 73599, -574514, -637016, -554363, -253624, -336871, -481313, -596309, -733228, -569525, -446826, -401568, -392288, -156784, -199992, -587372, -722644, -563895, -580011, -600006, -621420, -646711, -789254]
21722g89254J53685L68899J71413k97871K44076P1792k40763J87454j44133J98715
21712g5987J49616R3592j23556k87183j20236P4959R1640l9657k15484l4064k51044
21701g37404N7385J19980K33013L21660M0241L70459M1533n1039l48834j81816
21691a34822L89352K7157L1196m79445l1026Q7533P8495L27464j05617j98461
21681h174n4814J05626J57457k17279k15629J59470J15861J31032m5448J60904
21671B89006m18545R9255j17923k37315m18918q0501K13391k01234J71357J10816
21661e90611M11256J26816L4659J76387k09463l18044p149l2172L57836K26613
21651A76128j45997k79053K15125k55439J70365k12689j02515k7031N56494P4495
$$ y = [-789254, -635569, -266670, -95257, -393128, -149052, -77260, -318023, -130569, -274702, -75987, 73629, 167221, 43665, -243518, -363754, -288795, -197155, -236812, -452296, -486360, -737404, -680019, -560039, -327026, -5366, 34875, 405334, 446867, 395828, 46994, -134822, 254530, 281687, 312883, -166562, -197588, -110055, -31560, 295904, 190287, -8174, -62988, 42638, 200095, -17184, -232813, -73343, 42518, 173550, 128102, 289006, -129539, -30284, -148207, -385522, -804440, -884941, -671550, -872784, -701427, -590611, -179355, -52539, -17880, 158507, -50956, -369000, -376149, -408321, -50485, 176128, 30131, -248922, -33797, -289236, -118871, -331560, -434075, -461106, 95388, 169883]
21641A69883k94208k52670K66739J15155J25806J09504j95503j47247N754j37594
21631b34381j74271k5441J49219L57244K03140O6819k64594k87691P242J85507
21621a7207J68794l50090k15141j42892j20213J37112J6818N8677J93921k88069
21611e58290n5237J44m6721P43376j50422k06768Q593O0972M6727n23231l20972
21600a001829k8114j82594M887J7591K83377L80035M7068K14695O31289K8875
21590C95280k07178n28613j39010K6949M2507K5344K55689j46412K18802L3518
21580b3124j32845l49663L43381N96414j28783j59335j13945J72897M3370m58680
21570b10313r3110k3402L95883j6017J16032L1474o1045J47442r7228m25946j6370
$$ y = [169883, -124325, -376995, -110256, 4899, 130705, 240209, 44706, -102541, -96787, -234381, -408652, -434093, -284874, 72370, 275510, 342329, 77735, -209956, -202714, -17207, 151587, -198503, -413644, -556536, -676749, -539637, -522819, -464142, -270221, -558290, -613527, -613383, -660104, 83272, -67150, -273918, -265325, -204353, -157626, -680857, -1001829, -1029943, -1212537, -1207650, -1190059, -906682, -526647, -479579, -264884, 366405, 395280, 188102, -340511, -479521, -452572, -410065, -384721, -129032, -275444, -56642, -23124, -155969, -505632, -162251, 434163, 305380, 146045, 32100, 204997, 248367, -210313, -303423, -326825, 69058, 53041, 169073, 200547, 139502, 286944, 189716, -236230, -252600]
21559b52600M48330L11515k86076n20457j15350J39053j55851K5683J58125L30539
21549H2911k89171R266K9892K27864j73212L16579J77804k37082j43419j72536
21539a71104M7276j84736k99124p4614j2423J78630M7622M72817L6116j09816
21529f9356K9073K32540j17556K33581k08220L08442k349p35695m98279q7211
21519i15030M77710j46005l98804L65019N07933J44843m7507M5425j70127m24189
21509e60732N8767K95502L03642K46788J1645l07179j93193L2451P4462Q9525
21499E1678n6254N8948m8646J32608K29498J65003R9055n3716k29203l80910l4888
21488f6827j69139K71522M17572j19441j88894J03829l13037O5865m2876J70065
$$ y = [-252600, 195730, 507245, 221169, -299288, -414638, -275585, -431436, -405753, -247628, 82911, -206260, -196994, -167102, 60762, -112450, 204129, 381933, 144851, 1432, -171104, -123828, -308564, -607688, -682302, -694725, -516095, -468473, 4344, 40460, -69356, -40283, 192257, 74701, 308282, 100062, 408504, 406155, -329540, -827819, -915030, -437320, -583325, -982129, -617110, -109177, 35666, -11841, 33584, -136543, -560732, -501965, -206463, 97179, 343967, 355612, 48433, -144760, -112309, -37847, 51678, -4576, 54372, 5726, 138334, 367832, 532835, 631890, 578174, 348971, -31939, -66827, -235966, 35556, 453128, 333687, 144793, 248622, -64415, 1450, -41426, 128639]
21478A28639P5898J54143K4317j50685j74940p77196P3486L41811j52005l7570
21468d94102j60388p6250J99517L89937J00063l31270j66515j24878l7168J39788
21458e61266l504K36926n3662k11659J41666P57438M3724m14154j36068L50591
21448A50032Q1094J32209l96890L74128j38851l17878q2060l53117K27269J98157
21438a25907m12685j30145k7217M89149Q8633p0226J53261K35896j40789j61777
21428a01807J28871j9007k23401K49495M4497l0048j45624l82548M129K12986
21418b62457K79854j70114j15716K86027N4421j62907L7851j26778j86348N91172
21408B25005r4260o20227k47393J58638K58728L23964M21216l6369l9715O1667
$$ y = [128639, 204537, 358680, 382997, 232312, 57372, -719824, -646338, -304527, -456532, -494102, -654490, -730740, -531223, -141286, -41223, -372493, -539008, -663886, -701054, -561266, -564770, -327844, -381506, -593165, -451499, 305939, 349663, -64491, -200559, 150032, 231126, 363335, -33555, 340573, 201722, -116156, -198216, -551333, -324064, -125907, -538592, -668737, -695954, -206805, -118172, -188398, -35137, 200759, 59970, -101807, 27064, 8057, -215344, 34151, 78648, 48600, -97024, -479572, -475443, -262457, 17397, -152717, -268433, 17594, 72015, -90892, -53041, -179819, -366167, 225005, 130745, -489482, -736875, -578237, -319509, 4455, 425671, 389302, 349587, 411254]
21398D11254q4459j20228m08214N86818L56374l2621m46938j20459j97185k27144
21388b82802n4669L5975j60698k97286Q1176M54729J37683R0618r1645L5409L29666
21377B78156p7139l16264J14619J15035N71121R4671o073m70663j95200j02307
21367E956L1582L39622j33421j24880k63851j28195K72150l7114k13338j17984
21357c69473k50654O6154L55093J12526j12867R040K10638L5741m2822m0020L50356
21346C23712k57383k61642j80330M0106L4974K23599J75880M7952j7911j85844
21336e6887k27434j70349K42845M85689K24353m2687j44077J07424j3220K29509
21326F35166n3629j57520n0268m74351m85647K39677L8654k2686J04443J67459
$$ y = [411254, 326795, 206567, -201647, 385171, 741545, 708924, 261986, 141527, -55658, -282802, -337471, -301496, -462194, -759480, -678304, -223575, -85892, 4726, -86919, -51510, 278156, 201017, -115247, -628, 114407, 685528, 780199, 774126, 303463, 108263, 5956, 37538, 377160, 243739, 118859, -144992, -273187, -1037, -38151, -251489, -369473, -620127, -553973, -198880, -86354, -199221, -190181, 20457, 56198, 13376, -26644, 323712, 66329, -195313, -375643, -335537, -300563, -76964, 98916, 146868, 128957, -56887, -284321, -454670, -211825, 273864, 498217, 455530, 311453, 418877, 405657, 635166, 581537, 424017, 373749, -100602, -586249, -346572, -307918, -330604, -226161, -58702]
21316e8702l86924m88495J53701P55665J33890k12734J5506l47623j69217K42577
21306c62356M66691K79473J10752k05691m26115p8558j18383O10862L47710M185
21296F28570L50947j83715m30601r5552R0758L04278P3584L8221j78945j69460
21286D28085k76279J61483j01428N4053J67046M7091k35075l86396k10821m0491
21276c92732K27117O307J73880K22171n96826J00370K92700k21817K40386K68426
21266C19982m30243m6762K35888O05007J94791k49623q3816m52063R8362R1913
21256B83436n54048k03692J0902L7031K60413q3027k41997P8744J3012J84328
21246b14898M8630k83015J48308J88111l47795o2001N52709n2036j15354L5802
$$ y = [-58702, -445626, -934121, -780420, -24755, 109135, -103599, -88093, -435716, -604933, -362356, 104335, 383808, 494560, 288869, -137246, -215804, -334187, 276675, 624385, 628570, 979517, 795802, 365201, 269649, 360407, 664685, 738269, 776490, 597545, 428085, 151806, 313289, 211861, 265914, 432960, 480051, 244976, -141420, -352241, -392732, -165615, -159308, 14572, 236743, -360083, -259713, 32987, -188830, 51556, 319982, -110261, -157023, 78865, 683872, 878663, 629040, 545224, 93161, 191523, 283436, -270612, -474304, -463402, -426371, -165958, -248985, -490982, -412238, -399226, -214898, -166268, -449283, -300975, -112864, -460659, -522660, 30049, -21987, -137341, -101539]
21236a01539K21708K3881j16092l61549l33048J05275K86914j13312j93680L96764
21226a84678Q8469j96076l05054J70915K95649J66483j19304Q409J52618K14712
21216B92143l17088j05630j33770N52586M6897j49457L45174j98196m78224k16580
21206c62145k55280Q5285N67411N6073j65794p5877K8463J62345K11519k33571
21196A8429k63371j80648J50435J50197j44486j11408j03582Q4940L08249Q3146
21186h099P1432M1791m4645l31242j40393j23456L22966M20020j7540L62148n1572
21175E01410K8989K98334J76842M2871j25773j73623k91787p62743j94044L72613
21165a26911K98533k22976K27096k54843o863L17856Q7540P1719J95990o337J98638
$$ y = [-101539, 120169, 144050, 27958, -333591, -666639, -561364, -274450, -387762, -581442, -184678, -96209, -292285, -597339, -426424, -130775, 35708, -83596, -75187, 77431, 292143, -24945, -130575, -264345, 288241, 335138, 185681, 530855, 332659, -145565, -362145, -617425, -532140, 35271, 91344, -74450, -150327, -121864, 40481, 252000, 18429, -244942, -425590, -275155, -124958, -269444, -380852, -484434, -399494, -91245, -8099, 63333, 105124, 60479, -270763, -411156, -534612, -211646, 208374, 190834, 552982, 501410, 530399, 828733, 1005575, 1048446, 922673, 749050, 457263, -305480, -499524, -126911, 171622, -51354, 175742, -79101, -85964, 231892, 319432, 391151, 587141, 580804, 779442]
21154G79442k40078l90787K11894j7753J32975j80653j43946l12740M2491j39767
21144b58922J44484k19553l94407K62947k98249q0279l0039j00695l29634J13221
21134a191126N05531O60423L64942l11177O2682j93597j6193M2413k41637k0805
21124c38544j73494j88710N66633k61972l40905N3791J15475j9670P81600O7071
21114B61275J36289Q9704j32314n0849j20988k21653k53238k04776m9378L04971
21104b40957r7651J1407j25872J04912J55483j20370J18532J26969k27370l14630
21094f09547R4579K21338J71364j64717l68161O7608M76897K28237k6802K60607
21084C51403P6681l6984n91668k01266J33709J03333J15068L7983N9854l39835
$$ y = [779442, 539364, 148577, 360471, 342718, 475693, 295040, 151094, -161646, -119155, -258922, -114438, -333991, -728398, -465451, -763700, -843979, -874018, -974713, -1304347, -1191126, -685595, -25172, 339770, 28593, 91275, -102322, -118515, -76102, -317739, -338544, -512038, -700748, -134115, -396087, -736992, -683201, -567726, -587396, 194204, 261275, 397564, 487268, 354954, 304105, 183117, -38536, -291774, -496550, -545928, -240957, -338608, -327201, -453073, -348161, -192678, -313048, -194516, -67547, -294917, -609547, -514968, -293630, -122266, -286983, -655144, -587536, -110639, 117598, 90796, 351403, 428084, 391100, -200568, -401834, -268125, -164792, -49724, -11741, 48113, -291722]
21074b91722j29130N01163L35375J11355J82768o8219q3407q635k48285l69245
21064f7982N5090j82813n1117J35013K48366K24235k97011p64278Q0753K41467
21054c78277j45172o9873M57887O20283n2711m64788j87204N124l65521r9154
21044f79406K04274Q9482N22795n21287j79688k0047K60395L77314j5726m9846
21034a1740k60003j41725p1385J54828n3502K19109l604l50496j00809L15197
21024c04130R1843k94925j44339R4784j33982k35275K26144R5130j08268L34887
21014c78131M68638J75563j97562m22131N0299K81081K44192k21229n61167k4698
21004e85145L20311K73151L22142L0436k51010l336M47764L753k83087k74097
$$ y = [-291722, -420852, 80311, 415686, 527041, 709809, 641590, 558183, 549548, 301263, -67982, -12892, -195705, -246822, -111809, 136557, 360792, 63781, -700497, -619744, -378277, -523449, -593322, -135435, 484848, 432137, -32651, -219855, -214731, -580252, -679406, -475132, -385650, 137145, -384142, -563830, -583877, -323482, 53832, 38106, -11740, -271743, -413468, -484853, -330025, -383527, -164418, -168022, -518518, -619327, -304130, -212287, -507212, -651551, -556767, -690749, -926024, -699880, -604750, -713018, -378131, 90507, 266070, 68508, -353623, -303324, -22243, 221949, 720, -560447, -585145, -264834, 8317, 330459, 360895, 109885, 106549, 554313, 558066, 274979, 882]
20994H82k67766l40939J36926K1875J81039j25625J40692J53308k1722j74254
20984b95584P4900k01393k26044j49078K81683J81881L35870O00135j36979l41528
20974A23863o11919r2940J53450J20965L05241l23876m4024J0926j93472m79204
20964a030990k01427L84425R4219k58853j94360J61617J20341J59685L5456M9509
20954f80378o982O8878K5759N6297M0650J26580K16472L051q6071k90548J80181
20943c46111K53807o3575K3163M5618J35207r6850o12890J07411J23910J36189
20933b94121J04163R9403j28740j31975k8295K65764J11178j55674m93643N9490
20923e92450j23264q2530J65137J38371J76054L16952O5445K15904k06498m13559
$$ y = [882, -266884, -607823, -470897, -449022, -267983, -393608, -252916, -99608, -121330, -295584, -220684, -422077, -648121, -797199, -515516, -333635, 2235, 602370, 465391, 123863, -488056, -580996, -427546, -306581, -1340, -325216, -369240, -358314, -551786, -1030990, -1232417, -847992, -753773, -1012626, -1206986, -1045369, -925028, -765343, -729887, -680378, -687360, -618482, -592723, -536426, -495776, -369196, -152724, -149673, -235744, -526292, -346111, -92304, -155879, -132716, -87098, 48109, -48741, -661631, -554220, -430310, -294121, -189958, -90555, -219295, -351270, -379565, -113801, -2623, -158297, -651940, -592450, -715714, -798244, -633107, -494736, -318682, -1730, 63715, 279619, 73121, -340438]
20913c40438k41628J02982M88129m45837l54152K54290J87454O07474N4650r6278
20903B16646K12126m7477k3390N6639j03007n33394l1441l17025j10374P22317
20893D1620J23115o01402l18902J44664R6508J12601l1837K68190K4364j44273
20883b85352n5887j45302M79894O04817J17916P6868j91952l08422k72000k74662
20873b54082j27917J86314r9096M64934L04043l13458l42968j95446J27289L44014
20863I3627K01946m74743K15372L87443m44575j70659M5744Q0227K52209k9798
20853A56793l7632J25945J39633k7577p9541k60101k58359k55646j62801Q7972
20843e71314Q3680O0558j51465K33886J10824j83615j30701j15359L09390R9429
$$ y = [-340438, -582066, -479084, 9045, -436792, -790944, -536654, -349200, 258274, 312924, 216646, 428772, 381295, 357905, 414544, 311537, -221857, -253298, -570323, -680697, 41620, 164735, -436667, -755569, -610905, -514397, -401796, -433633, -165443, -141079, -285352, -341239, -486541, -6647, 598170, 716086, 792954, 601002, 292580, 20580, -254082, -381999, -195685, -294781, 170153, 474196, 160738, -182230, -377676, -250387, 93627, 295573, -179170, 36202, 423645, -20930, -191589, -145845, -65618, 186591, 156793, 119161, 245106, 384739, 357162, 277621, 17520, -240839, -496485, -659286, -571314, -487634, -427076, -578541, -344655, -233831, -417446, -548147, -663506, -354116, -254687]
20833b54687K27907K76318j39348j57472o4887j10797Q0547K52474N1291J07746
20823B69092j15095J76819j9430M3353j21746Q8304K61467l11409l85857K46909
20813A32407Q1736j36808m18164O1304k2538K65088N38307r0857j60413K10233
20803D60295k73169k95170p8179k02382l2654K97553N34222m4987l38999l54217
20793c27687j30672L17652K24380J82398l32498L35228L6827l79026k07644m72232
20783g53274K43983q1509K04774L71660m9828l02936K37232J3814l58122m2630
20773e16836L08496J61875k90949P5296K4179n0872K28795j49247J8339j12732
20763c03656o4812R6755J99923L53887N2522q8232k73923Q946M12001l4474j60780
$$ y = [-254687, -26780, 249538, 110190, -47282, -112169, -222966, -142419, 110055, 161346, 269092, 153997, 330816, 311386, 354739, 232993, 321297, 582764, 271355, -114502, 132407, 214143, 77335, -340829, -279525, -302063, -36975, 501332, 410475, 250062, 460295, 187126, -108044, -186223, -388605, -421259, -123706, 410516, 365529, 26530, -327687, -458359, -140707, 83673, 266071, -66427, 268801, 305628, -73398, -281042, -753274, -509291, -590800, -386026, -14366, -64194, -367130, -129898, -116084, -474206, -516836, -208340, -46465, -337414, -262118, -237939, -288811, -60016, -209263, -190924, -303656, -368468, -271713, -71790, 282097, 334619, 246387, -27536, -18590, 393411, 358937, 198157]
20752A98157L14419k34389P1265P5564n3760o11991j37194K28238o9569k53215
20742d72475l38319J2213J10175K38533J53627Q3791j26210m31055J69720N07583
20732i2417L71710J5787k91122j97575K77512L5555k31749l82837J34754L86182
20722B5800j27392K02971M775m86715n81455l0385O45829J08030l69504K92625
20712c15421M13482k95696J529P01103K45507k4078j8245r0784P6069k21756k61263
20701B10447K18898J802m67596m87644j4779R4315J67842K32135J18582j84980
20691a10978m41425l75263J52488M63261J4631k59590m82636J6406K69385L96333
20681c57388K36736l64985m08102J49883J30435M766m5858L84523M02561M23570
$$ y = [198157, 512576, 278187, 349452, 425016, 371256, -240735, -377929, -149691, -219260, -472475, -810794, -798581, -688406, -449873, -296246, -212455, -338665, -769720, -600000, -92417, 279293, 295080, 3958, -193617, 83895, 119450, -112299, -495136, -360382, 25800, -101592, 101379, 106154, -380561, -962016, -992401, -346572, -238542, -608046, -315421, 98061, -197635, -196106, 504997, 750504, 726426, 708181, 617397, 693466, 471710, 210447, 429345, 431147, -36449, -524093, -538872, -444557, -276715, -44580, 74002, -110978, -552403, -927666, -775178, -311917, -297286, -556876, -1039512, -1023106, -753721, -357388, -120652, -485637, -893739, -743856, -613421, -608655, -654513, -269990, 132571, 556141]
20671E56141K13809j87177o56158n32937q4666L68678L86278J84424k77500k13609
20661b42717M3247k99495K07847J55014M23513L44816J95771k85998m73088j71578
20651a02668K07346O52652j66208k59818j62075n056l78572p7522M41539J92597
20641C42215k92310K00659J17733K2848m78090m14823K58850L29466K68230j71799
20631A82979l71072K1000Q0974j9633m20383j7575J86554Q7307l05245p3783j60969
20620h09846P0080J62290r7622o1929J53752R8301J59436M72268m6259l08677
20610b08206K6815J99777n6756M79750j61390j41032K17936k63250k21151q8169
20600b15676M31069K2240n39520N7466K65468k18767m04932K10556M62119M77620
$$ y = [556141, 769950, 582773, -73385, -606322, -690988, -322310, 63968, 248392, -29108, -242717, -199470, -498965, -291118, -136104, 287409, 632225, 827996, 541998, 68910, -102668, 104678, 757330, 591122, 331304, 169229, 164173, -214399, -291921, 149618, 342215, 49905, 250564, 368297, 391145, -86945, -501768, -242918, 86548, 354778, 182979, -188093, -167093, -86119, -105752, -526135, -543710, -357156, -269849, -575094, -648877, -809846, -739766, -577476, -675098, -737027, -583275, -484974, -325538, 146730, 100471, -208206, -181391, 18386, -38370, 441380, 279990, 138958, 356894, 93644, -127507, -215676, 215393, 237633, -301887, -244421, 21047, -197720, -602652, -392096, 70023, 547643]
20590E47643j57497k32637l73035k39923L29298O4135j39007O525j35147k03476
20580e33121J36320K45883k73953j48679K62243K88078k32028n60254J84097P6064
20570e55350L92691K16645M9495j64613Q6736m58966K59785L88313m27125k65179
20560d77568J45912J60452L93041m7548M7386J60595j57784M9296N03300K52180
20550A029262j00604m57122m45052n37980q414K69477k03776Q1180K47390O481
20540a19158J02807k7387J97938J49868L98545j21777l06424n90028p4585L72927
20530a7274J17946n32308L9876k37297K49735L14493K54984M38110r5613r04770
20520c72118J33069M90775J99791j93886j20711J52406n3844J745K22553p9123
$$ y = [547643, 390146, 157509, -215526, -455449, -126151, -62016, -201023, -194498, -329645, -533121, -396801, -150918, -424871, -573550, -311307, -23229, -255257, -815511, -631414, -555350, -162659, 53986, 103481, -61132, 25604, -433362, -173577, 214736, -212389, -477568, -331656, -171204, 221837, 174289, 221675, 382270, 224486, 273782, 777082, 1029262, 928658, 471536, 26484, -511496, -519910, -250433, -454209, -373029, -125639, -119158, -16351, -43738, 154200, 304068, 702613, 580836, 274412, -315616, -390201, -17274, 100672, -431636, -391760, -629057, -379322, -64829, 190155, 628265, 532652, -372118, -239049, 251726, 451517, 257631, 136920, 289326, 235482, 237227, 459780, 380657]
20510C80657M7033j25712j98594R8241l50866N3449J98868m93968k50303L5700
20500f05495M1191K83869N96168O9096K0038k52795k53169O1283k71370j96488
20490e07672K62148j48075J69616K592j32894L29903K30111n8878K44363K29415
20480F20629L8379k16612j1369j51619l69786K38222M76802j32770n08328J65664
20470A49212j3801M0960j36009J045K46112j30271k26222O0920r4240J52922M0579
20459I1207l09164K6501M37936k3266J29219k09447j63366k50746j70070L07491
20449a33705k0623J57712j56375k98635j755K08953p3427p6725j15515K8812L27950
20438a53333N4756M5100N0295p33L27024o0555o75880k13113J75019L74192M26211
$$ y = [380657, 427690, 301978, 103384, 201625, -149241, -95792, 103076, -390892, -641195, -605495, -564304, -280435, 315733, 384829, 404867, 152072, -101097, -39814, -311184, -507672, -245524, -393599, -223983, -221391, -354285, -24382, 205729, 146851, 391214, 620629, 659008, 442396, 431027, 279408, -90378, 147844, 624646, 491876, -16452, 149212, 135411, 176371, 40362, 41407, 287519, 157248, -68974, -8054, -102294, 50628, 91207, -217957, -191456, 246480, 223214, 352433, 142986, -20380, -271126, -441196, -133705, -154328, 3384, -152991, -451626, -453381, -244428, -317855, -394580, -510095, -481283, -153333, -98577, -53477, -3182, -3915, 323109, 262554, -413326, -626439, -451420, -77228, 348983]
20427C48983j65271O6354l14212j83265M85692M10262m61990q781M7940j83719
20417D1993k3220j28466L05127m1067k27886J22440r8848K6748K1764k86343k20730
20406e08488K34258J9247N29127L85001J75540l42578l80502l7097J11832j46065
20396D0275M2746R8541q861J79140k1713j23284J72854O5420K318k5455l67979
20385E4002l25933K7780j48463l7226N34149J9246J25217k3237j81103J0774j32379
20374g7173n03781l41579O56212K91888N9066K52540J45312R5425N0123O9379
20364F97412n0465j95921N6158N01991J28173j9422j32656K23835J54979k05692
20354A158392R209j89862k75554j84430K28015K50255L60219L79624j22221K2351
$$ y = [348983, 183712, 250066, -64146, -247411, 238281, 648543, 186553, 177772, 225712, 41993, 18773, -109693, 195434, 154367, -73519, 48921, -49927, -23179, -1415, -287758, -508488, -274230, -254983, 274144, 659145, 834685, 492107, 111605, 74508, 186340, 40275, 83021, 181562, 172701, 351841, 330128, 206844, 379698, 445118, 447436, 421981, 54002, -271931, -244151, -392614, -429840, 104309, 123555, 248772, 225535, 44432, 55206, -77173, -580954, -922533, -266321, 25567, 84633, 337173, 482485, 577910, 628033, 697412, 646947, 451026, 507184, 1009175, 1137348, 1117926, 985270, 1209105, 1364084, 1158392, 1167601, 977739, 702185, 517755, 745770, 996025, 1356244, 1735868, 1613647, 1635998]
20344A635998j71611M2290l80760p17784j43915j27442j54948k00276J72041L29800
20334B83393K05905L90153m87403r3763O7613K28157J32013r9433j48505o7390
20324D10740j10742j19139q6950J88222L02626L21617J66208k85630n28515k33045
20314B5392J24730O28700M12627J18250J15695j74723L09927J01536J37728m81378
20304A318484K37900j8068r6233J64138k36206l13071K10305k66525J0127j32738
20294H78113q3771l04551q6389k39202j88342L84608O0382O0429P617L37477m12315
20283D14056k73377L21535Q49l70387K18281L22863m47272m65829l2660J84053
20273a27888k8306K11834J2717j38051j77037P6940L42856M29669K21054J75035
$$ y = [1635998, 1464387, 1506677, 1125917, 408133, 264218, 136776, -18172, -218448, -46407, 283393, 489298, 879451, 392048, 298285, 365898, 594055, 726068, 626635, 478130, 410740, 299998, 180859, 93909, 282131, 584757, 906374, 1072582, 786952, 258437, 25392, 150122, 778822, 1191449, 1309699, 1425394, 1250671, 1560598, 1662134, 1799862, 1318484, 1556384, 1538316, 1442083, 1606221, 1370015, 1056944, 1267249, 1000724, 1010851, 878113, 794342, 489791, 403402, 164200, -24142, 360466, 420848, 481277, 488894, 826371, 414056, 140679, 462214, 463063, 92676, 310957, 633820, 186548, -279281, -311941, -127888, -156194, 55640, 68357, -69694, -246731, -169791, 173065, 602734, 823788, 998823]
20263I98823m58147j85404l82734k84017K46582K26272J15487j01645k91626k9984
20253a46393o8278j5501r3227L2614J58319J99494K96237P1020k49781k23611
20243c9107K01532J29471k73455j64673J5260j83207L29689J59575k4461K8756
20233A79380j32381l57635L62595N28186k1316r1323l02266n90258m43564J72701
20223f95881N35335j86941j35345l6628k00465N07202O20068l90925j07661J73501
20213H2260k1890K18592L73328n99109l5702K76458L0941K59158M5719J19028
20203G48783l5874l44945r5388m66352Q971j90852L4625K30558J16478P9342Q5942
20192A71288K4680j72091K35242K24123l09149k08778j61765K74839K63933K33961
$$ y = [998823, 540676, 355272, -27462, -311479, -64897, 161375, 276862, 175217, -116409, -146393, -214671, -230172, -323399, -290785, -132466, 67028, 363265, 434285, 184504, -39107, 162425, 291896, 18441, -146232, -130972, -314179, 15510, 175085, 150624, 179380, 46999, -310636, 51959, 580145, 558829, 467506, 165240, -425018, -868582, -695881, -160546, -347487, -482832, -519460, -719925, -212723, 407345, 16420, -91241, 82260, 60370, 278962, 652290, 53181, 17479, 293937, 324878, 584036, 629755, 748783, 712909, 367964, 272576, -193776, -184805, -375657, -341032, -110474, 6004, 85346, 171288, 195968, 23877, 259119, 483242, 174093, -34685, -196450, 78389, 342322, 576283]
20182E76283m72415k36174k50072J96855O2018l4473j83921J68113j48051J9633
20172c02204J70765l83963J80846J84126L83620j80233m15924N2215K56224m3927
20162i8455k51585o6041K29837K82126l18264J71228j46533k41634J39334N0109
20152b49878J39119J64740J91016j26207j75676p5746K29371K89516Q1141m26433
20142D0963l9883n1868k71472J74339K3938o258k746P4225p2119p8449j82738
20131c92068K56611n0075J7796K25094P6106k75754m6539K27838j39936k57892
20121c58819M4109l48464K5684K70132M64343k22627j38415k93263j9339N6390
20111e20269J62379k5597j80020K95548M24956J20896P7756p3153j78802L69493
$$ y = [576283, 103868, -132306, -382378, -185523, -123505, -157978, -341899, -173786, -321837, -302204, -131439, -515402, -334556, -150430, 233190, 52957, -362967, -310752, -54528, -98455, -350040, -416081, -186244, 95882, -222382, -51154, -197687, -439321, -299987, -249878, -110759, 53981, 244997, 118790, -56886, -132632, 96739, 386255, 467396, 40963, 1080, -50788, -322260, -147921, -123983, -130241, -132987, -58762, -130881, -209330, -392068, -135457, -185532, -167736, 57358, 133464, -142290, -188829, 39009, -100927, -358819, -314710, -663174, -637490, -367358, 96985, -125642, -264057, -557320, -576659, -520269, -357890, -383487, -563507, -267959, 156997, 277893, 355649, 282496, 103694, 473187]
20101D73187k1170l26454L18315J09258J60079j37315n19832j01423J20436K06619
20091B81700k80593K8727K04133L4959j32787j84882J46905j35861r6163R070
20081a24792R6909M56160N20494J4122m28810l03105l37984o4442j48450K71036
20071d8862k15604k22122q2432p9317l3907K75875j1318J32806J97164K01257
20061A13540j38037o1357j48534J2960K05878M84310k89378n87210k46835J03134
20051e51529K11421M36250M2259j02232J13943j17924J65945J09089j13918r9407
20041I3897l24960q0174K00439k42154l65483K30672K6232M4928j53431J77636
20031c92398Q5505j35483Q3933N86348K41850K9789P501l88655k49922P5329K16457
$$ y = [473187, 452017, 125563, 443878, 553136, 713215, 575900, 56068, -45355, 75081, 281700, 1107, 29834, 233967, 268926, 136139, -48743, 98162, -37699, -133862, -124792, -27883, 428277, 948771, 962893, 534083, 230978, -107006, -171448, -319898, -48862, -264466, -486588, -569020, -648337, -682244, -406369, -417687, -284881, -87717, 113540, -24497, -85854, -234388, -221428, -15550, 468760, 179382, -407828, -654663, -551529, -340108, 96142, 138401, 36169, 150112, 32188, 198133, 307222, 193304, 93897, -231063, -311237, -110798, -352952, -718435, -487763, -461531, -416603, -570034, -392398, -306893, -442376, -358443, 227905, 469755, 499544, 507045, 118390, -131532, -56203, 160254]
20020A60254j77939L629o4250L13451R5397m20122j82197M5116O3208K23714M9457
20009A09718l78148M20383K91892J46023j19683k78196o0345p46K36304m9971
19999C17231J59148J22819j25443n53019k70837o612K32915K29420L74636j9197
19989D61061k2798j58312j74880m17304J80473K5766q3359J89226K60710M06340
19979F66923K70490p5261L1799q0582J53970n63227l55212n4571L31544J43303
19969D69176q0812j09224N69476K75933K5661Q9942Q6516m02124j54650O2238
19959H32132J35395O2779K58584m83934n62745m3646M09146p0895l54189n1921
19949A30706L39351M47762L85039R3004k05268m77437k55070J56984k22222k1053
$$ y = [160254, -17685, -14056, -78306, 235145, 330542, -89580, -271777, -226661, -163453, 60261, 109718, -268430, 151953, 443845, 589868, 470185, 191989, 131644, 130898, 367202, 317231, 476379, 599198, 473755, -79264, -350101, -356713, -123798, 105622, 480258, 461061, 438263, 279951, 105071, -312233, -131760, -105994, -189353, -127, 260583, 666923, 937413, 862152, 893951, 813369, 967339, 404112, 48900, -5671, 325873, 469176, 388364, 279140, 848616, 1124549, 1150210, 1240152, 1326668, 924544, 769894, 832132, 967527, 1030306, 1288890, 804956, 242211, 198565, 607711, 536816, 182627, 130706, 470057, 917819, 1302858, 1395862, 1190594, 713157, 458087, 615071, 392849, 371796]
19939C71796J75328k89205K571j99931n0388N41378K64314j67095m20039l61034
19929a32305J35185O8905P7449l48460j38243M83102O4690p5362R869n44125J57745
19918b41550M39363j14607J6386K17241j08528l2950O1471K13357K72827j0875
19908G12135j36835J06676J54600k4737O8085J75460l00833q46117K72600N09321
19898F90355J94657j5561L125m731m2275k22406k91284L3337M15448J00501n1970
19887H09196J02174l07802j72419L01147L2042l83466P5923K95806j66583k54681
19877C31337L03053j61833J08088j21127J55949J24098m8142N0274j08780J06241
19867G39158J55751K51294M38339k87679L7854m71368m07552j25368L7786M32558
$$ y = [371796, 547124, 257919, 260490, 60559, 10171, 551549, 815863, 648768, 228729, -132305, 2880, 71785, 149234, -199226, -337469, 145633, 210323, 134961, 144830, -399295, -241550, 197813, 83206, 99592, 316833, 208305, 175355, 236826, 450183, 723010, 712135, 575300, 681976, 836576, 811839, 879924, 1055384, 754551, -91566, 181034, 690355, 885012, 869451, 872576, 867845, 825570, 603164, 311880, 345217, 760665, 861166, 809196, 911370, 603568, 431149, 732296, 764338, 380872, 456795, 752601, 586018, 331337, 634390, 472557, 580645, 459518, 615467, 739565, 691423, 741697, 632917, 739158, 894909, 1146203, 1584542, 1296863, 1334717, 863349, 455797, 330429, 368215, 800773]
19857H00773J74852O943k79738k47983L53730R1666l30729k27174K5024l13268
19847E4096k5222O29965N38899l70172l22714j22284L71296O7720K64963p8911
19837A007636O680J60038R9515L08795k68994l12679K95497k60490K18119J93693
19827A447810J85137M4781j95989l91778K911k2594k62599o9292L01792K23559
19817A263738L9996J44295k10289n82973r7511K4030l1522L16239J05882M53882
19807A425767L51523P5113k17958l23548k17432J86069N72541L96412m23357k33039
19797A592091K74876L46522J92783k41882j46350j56334O9964K77233O30079N44286
19787C383268K45266K92193R9143K03853k20097J94252P19765J008109Q89709
$$ y = [800773, 975625, 982568, 702830, 454847, 808577, 900243, 569514, 342340, 367364, 54096, 28874, 658839, 1197738, 827566, 504852, 382568, 753864, 821584, 1086547, 1007636, 1014316, 1174354, 1273869, 1582664, 1313670, 1000991, 1296488, 1035998, 1254117, 1447810, 1632947, 1677728, 1481739, 1089961, 1092872, 1070278, 807679, 738387, 1040179, 1263738, 1303734, 1448029, 1237740, 654767, 557256, 581286, 549764, 866003, 971885, 1425767, 1777290, 1852403, 1634445, 1310897, 1093465, 1279534, 1852075, 2248487, 1825130, 1592091, 1866967, 2213489, 2406272, 2164390, 2018040, 1861706, 1931670, 2208903, 2838982, 3383268, 3628534, 3920727, 4019870, 4223723, 4003626, 4197878, 4917643, 5925752, 6815461]
19778F815461J122087R69677P72619N55787O86854J031128J531557J764543K402980
19769A7652693K693185L044026M099759O484962Q864643J3757925J9484699K3072475
19761I9154367J9762720J1599755Q739837J3060744K2793980L4471573M5164410
19754B54747386M6657805K6271640j1067766k4819180r717954Q740368J8568242
19747C09380541K4180205K3921048n510439n7594128n7895312l0852908j3929260
19740A91699747p763239l978352l797398j9050022l3953048k5441062j4531302
19733H3185324q412435n340490l657662k917204k246807k291292j590780n97353
19725E6131301O36399J472347J955885K653463L759590O757745J2390797J9416073
$$ y = [6815461, 7937548, 8907225, 9679844, 10235631, 10922485, 11953613, 13485170, 15249713, 17652693, 20345878, 23389904, 27489663, 33974625, 42839268, 56597193, 76081892, 99154367, 118917087, 130516842, 139256679, 152317423, 175111403, 209582976, 254747386, 301405191, 327676831, 316609065, 291789885, 282071931, 290812299, 309380541, 333560746, 357481794, 351971355, 294377227, 236481915, 205629007, 191699747, 183936508, 179958156, 176160758, 157110736, 123157688, 97716626, 83185324, 74772889, 69432399, 65774737, 62857533, 60610726, 58319434, 56728654, 56131301, 56767700, 58240047, 60195932, 62849395, 66608985, 73366730, 85757527, 105173600]
19717A05173600K3953564K0419057J1173101P149315J1802052K2792695L5575278
19710B38038662M6912421M9243822K8271891j2850444k8648683j1194427Q269313
19703C18042555J8229766K3749254K4611421m885091o0761270o2388668l3928269
19696B22669698j5958032q622841m522651m216021j9347584l5657564k7797055
19689A06547950j6519686r927380o667972n136165m687935m254848l443064k827399
19681E3083501k212737k199837k287925k089975k152344k238868k079409k174109
19673C5648297j446175j337942j084794r03152q82028j111792j063694q20439
19665B6998281n91947j054631m49081k4493p60976r84132q33067n97811o20358
$$ y = [105173600, 129127164, 149546221, 160719322, 167868637, 179670689, 202463384, 238038662, 284951083, 334194905, 362466796, 349616352, 320967669, 309773242, 318042555, 336272321, 360021575, 384632996, 379747905, 318986635, 256597967, 222669698, 206711666, 198088825, 193566174, 189350153, 170002569, 134345005, 106547950, 90028264, 80100884, 73432912, 68296747, 63608812, 59353964, 55910900, 53083501, 50870764, 48670927, 46383002, 44293027, 42140683, 39901815, 37822406, 35648297, 34202122, 32864180, 31779386, 30876234, 29994206, 28882414, 27818720, 26998281, 26406334, 25351703, 24902622, 24878129, 24117153, 23133021, 22299954, 21702143, 21081785]
19656B1081785r4813L5434n40874l11170q29983q39559o03502k81725k54103m32611
19646A6928879o77302o23452l86230k11127l95507j66070k24052k95783l20401
19637A3628955k4423L06772o34823l56873n72923o61750o67593l22989O39577
19628A1333930K15507k95518j56657k95413m78388k91184m4948j63140J04097
19619I928286M9155k42504j75573K21239l21678o06495R8001l16826n01881k87360
19609G844364J91675L27923M01722n51661o17608j49682j24361j2471O9210j26117
19599G252994j0292o8309m98074o39243j35303N6926j2433n20621j57869N82922
19589E850698M49377k07012M4254m39648o1798L33958m11255n00700K27306K11792
$$ y = [21081785, 20986972, 21022406, 20481532, 20170362, 19340379, 18500820, 17897318, 17615593, 17361490, 16928879, 16251577, 15628125, 15241895, 15030768, 14635261, 14469191, 14245139, 13949356, 13628955, 13604532, 13911304, 13276481, 12919608, 12346685, 11684935, 11017342, 10694353, 11333930, 11549437, 11253919, 11097262, 10801849, 10323461, 10032277, 9987329, 9824189, 9928286, 9977441, 9734937, 9559364, 9780603, 9458925, 8852430, 8950431, 8633605, 8131724, 7844364, 8036039, 8363962, 8765684, 8214023, 7596415, 7446733, 7322372, 7309901, 7379111, 7252994, 7242702, 7174393, 6676319, 6037076, 5901773, 5958699, 5946266, 5425645, 5267776, 5850698, 6300075, 6093063, 6137317, 5697669, 5635871, 5969829, 5558574, 5057874, 5285180, 5496972]
19579E496972J08802m6794l53976L5573J12654m30650m65410n0853j15296K64340
19569D555362k44150j88662J02128J44750k91715l32055m07170J1490L20587N7678
19559C728243m51974o34784J97878L3088k84744R1232L94205K29040m68913m40134
19549B393137n2598L11785o1468N88326m01952k20844M8283j68199j49119j2555
19539B274796K1077K2019l0448N23092k5418j01091j23861k22844L56732J12877
19529B806931k20507J43068J68934p8941l97356o50378l27650j31215L05074L95004
19519B012964j00792k00933l16736j40429k93205j2610L00197j02546l09336k60107
19509E76467P0306N10060L54645o8320l48746k90124n0249O4114J9217M70323
$$ y = [5496972, 5605774, 5558980, 5205004, 5240577, 5353231, 4922581, 4457171, 4406318, 4291022, 4555362, 4311212, 4122550, 4224678, 4369428, 4077713, 3745658, 3338488, 3349978, 3670565, 3728243, 3276269, 2641485, 2839363, 2872451, 2587707, 2678939, 3073144, 3302184, 2833271, 2393137, 2340539, 2652324, 2590856, 3179182, 2777230, 2556386, 2604669, 2436470, 2287351, 2274796, 2295873, 2317892, 2287444, 2810536, 2785118, 2684027, 2560166, 2337322, 2694054, 2806931, 2586424, 2729492, 2898426, 2819485, 2422129, 1771751, 1444101, 1312886, 1617960, 2012964, 1912172, 1711239, 1394503, 1254074, 960869, 948259, 1248456, 1145910, 836574, 576467, 646773, 1156833, 1511478, 1443158, 1094412, 804288, 754039, 818153, 837370, 1307693]
19499A307693L48519k23430k21564l3168m1054K92199R9693p4098k22535l93182
19489H39073m24325R0496j04782K22807p1219k08414N98934M72251Q1816M511
19479A501148j34808M7786K99459q434j84932m17953o43448k25870N57856L23275
19469A114079J54188n2623m15774m26264K63560M13618R3883j775l6248k42873
19459H63771l05680k46592P2100M84437K83277L9263j1481n7781l05743l47915
19449D67656M440M06211L24361o72217j43433K78572o5870o2006K95753K25178
19439A058645L5306J9054J00231k03732M259K69640k8263m15340l03074k56037
19429B80689O5985L06634M43298j62927j26846J41263L06057k52833p9279r5639
$$ y = [1307693, 1656212, 1432782, 1211218, 1178050, 1136996, 1429195, 1528888, 1454790, 1232255, 839073, 414748, 505244, 400462, 623269, 552050, 343636, 942570, 1414821, 1496637, 1501148, 1366340, 1414126, 1713585, 1705151, 1520219, 1102266, 458818, 232948, 790804, 1114079, 1268267, 1215644, 799870, 373606, 637166, 1050784, 1144667, 1142892, 1106644, 863771, 558091, 311499, 383599, 868036, 1151313, 1190576, 1179095, 1121314, 815571, 467656, 472096, 878307, 1202668, 530451, 387018, 665590, 599720, 537714, 833467, 1058645, 1093951, 1113005, 1213236, 1009504, 1013763, 1283403, 1255140, 839800, 536726, 280689, 346674, 653308, 1096606, 933679, 806833, 948096, 1254153, 1001320, 922041, 826402]
19419H26402J35526j94723L04545J39549r1649n16958J80887K21546m1315j99354
19409G64456n13774k73668L21103M29570n31089j31515M71965M3977k63671l95151
19399g7797K42509K96808L0671j17888j17599P0984L5276L90537J46152k84592
19389F15061k36854J02219l35451n7146J22958J47560J07775J5325M12216o6578
19379H27085p4046J359k63929k92967k16271j77381L13322L52911p3215j55545
19369B41323k46358K00951m5162L7509K91997J03511J79380r0119n3029l4058
19359E85945l08975M0839Q3639L55511j28265k67442J84531K35097j35022J54324
19349H00182n9197j84457L1419j18394J08777J03136n30168l38805J070K8972
$$ y = [826402, 961928, 767205, 1071750, 1211299, 1119650, 602692, 783579, 1005125, 963810, 764456, 250682, -22986, 298117, 727687, 196598, 65083, 537048, 581025, 317354, -77797, 164712, 461520, 492191, 374303, 256704, 327688, 362964, 753501, 899653, 615061, 378207, 480426, 144975, 87829, 210787, 358347, 466122, 481447, 893663, 827085, 753039, 754398, 490469, 197502, -18769, -196150, 117172, 470083, 396868, 241323, -5035, 195916, 150754, 188263, 480260, 583771, 763151, 673032, 620003, 585945, 276970, 317809, 401448, 756959, 628694, 361252, 545783, 780880, 645858, 800182, 740985, 556528, 587947, 469553, 578330, 681466, 151298, -187507, -186437, -157465]
19339a57465j39634j10990J77433L57027j39327Q1845J58133J18062m6146k95346
19329C592J45681N3908K5529k02094n92850L40718M56225L22914l2155l00231
19319B21237J1807j27671J50388j62313K24772K30496j5134J48948j2152K04421
19309H74799L45851q9795l73981j14117q4441m1793o3798k25484k2187M24956
19299F30010J20811k87075j15340j9485J6558j27980K51365N01908J6958r2074
19289H95656L7249L14018k13732j90217M98815J22901k49499J00879P9646K34665
19279A630381j960j48084K11489L23140j37659o7779j36403p92728p56964J95617
19269C19050Q71892M03058J2343k18091J13960m8253m79064q8389o4067M9539
$$ y = [-157465, -297099, -408089, -230656, 126371, -12956, 68889, 227022, 345084, 298938, 3592, 149273, 203181, 228710, 26616, -566234, -225516, 230709, 553623, 521468, 221237, 233044, 105373, 255761, 93448, 318220, 548716, 533582, 682530, 670378, 874799, 1220650, 1130855, 756874, 642757, 558316, 516523, 452725, 227241, 205054, 630010, 750821, 463746, 348406, 328921, 345479, 217499, 468864, 970772, 987730, 895656, 932905, 1246923, 1033191, 842974, 1341789, 1464690, 1215191, 1316070, 1395716, 1630381, 1628421, 1480337, 1691826, 2014966, 1877307, 1809528, 1673125, 880397, 123433, 319050, 1190942, 1594000, 1606343, 1388252, 1502212, 1453959, 974895, 886506, 822439, 871978]
19259H71978M34266Q4660j08966m63806n82397k59662J07618l08982m5390k68774
19249e39455L80319N13413p8204l53904L70865M24301j94841K64373o174l94282
19239C86411m10680J25829L63134O12425J53152n50928j05504N58518O8840j01171
19229A100026k63554J41830Q56582L67392m13259m2290J21559K00076K87680M47896
19219B803938r7085n3117j21303m7944j73415k70687j15736k9331j17642k07256
19209A570422k88500J0995n79115M8824J32529r4210J72028k73891K5921l01432
19199D23571j00221P2959k35664j73849L72367K89303l65016J3830m7681j01918
19189A47681J24697m5011k49798R7400j3565L50687J85355L41056J67798j72367
$$ y = [871978, 1306244, 1390904, 1281938, 818132, 235735, -23927, 83691, -225291, -270681, -539455, -159136, 354277, 276073, -77831, 293034, 717335, 522494, 786867, 780693, 386411, -24269, 101560, 464694, 1077119, 1230271, 679343, 573839, 1132357, 1201197, 1100026, 836472, 978302, 1834884, 2202276, 1789017, 1746727, 1868286, 2068362, 2356042, 2803938, 2706853, 2653736, 2532433, 2484489, 2311074, 2040387, 1924651, 1895320, 1777678, 1570422, 1281922, 1292917, 713802, 762626, 895155, 800945, 972973, 699082, 725003, 423571, 323350, 396309, 160645, -13204, 359163, 648466, 283450, 297280, 249599, 147681, 272378, 227367, -22431, 74969, 61404, 412091, 597446, 938502, 1106300, 933933]
19179I33933k6709O7730L45568R9239l19901l62887p23911q349R9466k83879r8614
19168b78314L67427P6891l89866N9974L17977J23036l17948P3814K99882L33301
19158F66174J12206o2988j71992j38881K998L07394N5276J35579J00967Q3085
19148A089818k06875J98109O91866K63368J55327o7826k53354R886l13l31530
19138A548476j82408j27983k54320k8988k32480k8975K36674o8281J61395J8793
19128A041903o7211r2823o7182q9341J08380J8346m25733k09088k38459m20540
19118d41748k77317K50324O55717K78291j59400k34773l2107N9473J061985L30847
19108A491292m10008J13276N48246j12094Q6864K85644K9695n1403j54316L8612
$$ y = [933933, 907224, 974954, 1320522, 1419761, 1099860, 736973, 13062, 4713, 104179, -179700, -278314, 89113, 166004, -223862, -163888, 154089, 277125, -40823, 32991, 332873, 666174, 778380, 715392, 543400, 404519, 407517, 714911, 770187, 905766, 1006733, 1089818, 882943, 1081052, 1772918, 2036286, 2191613, 2123787, 1870433, 1880319, 1880006, 1548476, 1366068, 1238085, 983765, 954777, 722297, 693322, 929996, 861715, 1023110, 1041903, 974692, 881869, 814687, 725346, 833726, 852072, 426339, 217251, -21208, -441748, -719065, -468741, 186976, 465267, 305867, 71094, 38987, 98460, 1160445, 1491292, 1081284, 1194560, 1742806, 1630712, 1717576, 2003220, 2032915, 1981512, 1827196, 1865808]
19098A865808L61980J65286L85859L33612m12628l61692k79357o06897k86325
19089A165646K45290k08203j03190L8961j58675M6256j26526k1826l1084j5424
19079H31225l36569k61791j39777L86739J89526j97839M1417k39215l60244j71638
19069b58166L65625J65415j83032K18759q0730j39926K82619L38611k3554l02693
19059C82928J21851L47818K48859J79123m0650j55084k81313J16412K33330J79612
19049A332886J64345K0110l12025l69281K01407K22598K8928N2645p6305k21951
19039A043357k3181k30316j08443k514k23207k49552Q3557l88844j37496J75595
19029f1044O3133k11149P2086N65282L43231k61777j28362K18946K16724M78831
$$ y = [1865808, 2227788, 2393074, 2778933, 3112545, 2699917, 2338225, 2058868, 1451971, 1165646, 1410936, 1202733, 1099543, 1138504, 979829, 1026085, 899559, 877733, 846649, 831225, 494656, 232865, 93088, 479827, 669353, 471514, 512931, 273716, -86528, -258166, 107459, 272874, 89842, 308601, 227871, 87945, 370564, 709175, 685621, 382928, 504779, 852597, 1101456, 1280579, 1239929, 1084845, 803532, 919944, 1153274, 1332886, 1497231, 1517341, 1205316, 836035, 1037442, 1260040, 1288968, 1341613, 1265308, 1043357, 1020176, 789860, 681417, 678903, 455696, 206144, 289701, -99143, -236639, -61044, 2089, -209060, -136974, 428308, 771539, 509762, 381400, 600346, 817070, 1295901]
19019A295901j65836k58559j13372K5528j2998K58712P8627j7665L43461m07867
19009A025932j13571M24662Q8049n06079J74045Q31425j04892p1216J32332k86797
18999A593890J09222j84682l45265J44752J05614l62622r3937K89358K1318r8272
18989A179376J87909K76459m24286j82270k49933N6158J13357k39493q0869K8460
18979F64868k2601l32393o0363J89335n6940J09726L20723n70131N1510J2222
18969C05956J018j90040L77735J39291k96185j15591l53169n5038L77961J61699
18959C53637N0324j01197k09104L53785L23073o0585r4593K19414L15341j371
18949A148724J35611m2707J01826k71585L6866L8357R4266l7515j145J22635K30650
$$ y = [1295901, 1130065, 871506, 758134, 783662, 770664, 1029376, 1108003, 1090338, 1433799, 1025932, 912361, 1337023, 1425072, 918993, 1093038, 1924463, 1819571, 1748355, 1880687, 1593890, 1703112, 1518430, 1173165, 1317917, 1423531, 1060909, 966972, 1256330, 1277648, 1179376, 1367285, 1643744, 1219458, 1037188, 787255, 843413, 956770, 717277, 636408, 664868, 642267, 309874, 249511, 438846, 381906, 491632, 812355, 242224, 293734, 305956, 306974, 116934, 494669, 633960, 337775, 222184, -130985, -186023, 191938, 353637, 403961, 302764, 93660, 447445, 770518, 709933, 615340, 834754, 1150095, 1148724, 1284335, 1241628, 1343454, 1071869, 1108735, 1147092, 1241358, 1203843, 1202698, 1325333, 1555983]
18938A555983l98363k25078k11241l22174J8245J97046L92374J85746j75608o8224
18928I48706K81096K30404m41199l60118p8739P4522J32104o5391l87207J75831
18918E10009j13518k36087k65312j81091M81308L86545O7727l26404l33984P5840
18908F5033K79301L18871j97648m35023n24795L3201J63042L82594p7337Q331
18898A5570o2680J71033N52897K95962n28635j52934N35297M43399Q4791M5595
18888A400295K54556k07897m60174n99564n831N79399L72084k53791m1377j18211
18878I19489n1179J49005M2921j11776m30157R0611r6262M26952K30159p1503
18868A098260Q7213L12871M19533J09726j60076J34359q1172j80746O8871m14832
$$ y = [1555983, 1157620, 932542, 721301, 399127, 417372, 614418, 1006792, 1192538, 1016930, 948706, 1229802, 1460206, 1019007, 658889, 580150, 654672, 786776, 721385, 334178, 510009, 396491, 160404, -104908, -285999, 195309, 581854, 649581, 323177, -10807, 65033, 344334, 663205, 465557, 30534, -494261, -461060, -298018, 84576, 7239, 15570, -47110, 123923, 676820, 972782, 444147, 291213, 826510, 1269909, 1354700, 1400295, 1654851, 1446954, 986780, 387216, 381385, 960784, 1332868, 1079077, 1037700, 919489, 868310, 1017315, 1060236, 948460, 518303, 608914, 512652, 939604, 1169763, 1098260, 1185473, 1498344, 1917877, 2027603, 1867527, 2001886, 1920714, 1739968, 1808839, 1394007]
18858A394007q11221k20988O5810j95102K79684K78750o0825l795q4446q1903
18848E59971j83974N31731Q7352m38802K004J67917o4906j63128q0795j55977
18838B61393J95289m0683j99547M15028K27986K29960p6346k96081k91913O6500
18828D91586O2955J47166M2495L4202j36384j17155j05362j25019J14865K70268
18818F79617M32075J28868m91603l50198r0027J5984J99625K85068m05530N2678
18808D56557K69044N48591k04865j38196J05447k8211j66095L92031M78841p7387
18798A635757k77154K8335K26043l87955k65044J25458j15417k73593K84067O74415
18788A654912K58122k6199j96319j55292j40134k88483q7044M38613J21058q3677
$$ y = [1394007, 582786, 361798, 427608, 232506, 512190, 790940, 730115, 726320, 641874, 559971, 375997, 907728, 995080, 556278, 558282, 726199, 661293, 498165, 417370, 261393, 456682, 415999, 216452, 631480, 859466, 1089426, 1013080, 716999, 425086, 491586, 554541, 701707, 744202, 778404, 642020, 524865, 419503, 294484, 409349, 679617, 1111692, 1240560, 748957, 398759, 308732, 324716, 524341, 809409, 403879, 456557, 725601, 1274192, 1069327, 931131, 1036578, 1008367, 842272, 1234303, 1713144, 1635757, 1358603, 1386938, 1612981, 1225026, 959982, 1085440, 970023, 696430, 980497, 1654912, 1913034, 1886835, 1690516, 1535224, 1395090, 1106607, 1019563, 1458176, 1579234, 1495557]
18778A495557L31026L82154K64156K59140O7215K80386K09286L89938j03028k19226
18768C356604K60470M56912L44458N36898O98631N25038k8956P61246O63611Q22026
18758H396938J222059J050780N67000Q99851J209354K224496K827576L956257
18750B2354311O030274R285863J3328073J7411206J7251645J1760776P534447
18743A04956595R741707J6618330K6577159L5700917L6600761K3270780j478976
18736B51987273j7787494r248600N850541J4762936J8612882J5749008p547074
18729B72379472m3253571m4114425k4814659j1972711o297275l364122n563405
18722A32999304k0533775k5737443j7311173r987667o590857m547043l144882
$$ y = [1495557, 1826583, 2208737, 2472893, 2732033, 2799248, 3079634, 3288920, 3678858, 3575830, 3356604, 3617074, 4073986, 4418444, 4955342, 5653973, 6179011, 6150055, 6911301, 7574912, 8396938, 9618997, 10669777, 11236777, 12136628, 13345982, 15570478, 18398054, 22354311, 28384585, 37670448, 50998521, 68409727, 85661372, 97422148, 104956595, 114698302, 131316632, 157893791, 193594708, 230195469, 253466249, 251987273, 234199779, 224951179, 230801720, 245564656, 264177538, 279926546, 272379472, 229125901, 185011476, 160196817, 148224106, 141926831, 138562709, 132999304, 112465529, 86728086, 69416913, 59429246, 52838389, 48291346, 45146464]
18715D5146464k439339j883536j337964j177014j115527j320329j096935j028395
18707C3747425j026488p47883n27138n76610R8730q5041j66901k33171M27802
18698C0910725J267015J132904J437156J711450K596314L741999N104508P120677
18690E5022748J0304260J6446705K5230893L1023635K7307032J6473297J1747187
18683A93555757J8102609L2606223M8878506O0178997N6552120K9142517j5048756
18676D23967973l1877275j0081530J3378100K5022198K8325047J7902946k9701220
18669D36936239p9037812o5265653l4507169j8228516r722266m947095j4856932
18662B10370796l8720626l8318637k4211318j4340943r215356p277229n720306
$$ y = [45146464, 42707125, 40823589, 39485625, 38308611, 37193084, 35872755, 34775820, 33747425, 32720937, 31973054, 31445916, 30869306, 30968036, 30882995, 30716094, 30482923, 30910725, 32177740, 33310644, 34747800, 36459250, 39055564, 42797563, 47902071, 55022748, 65327008, 81773713, 107004606, 138028241, 165335273, 181808570, 193555757, 211658366, 244264589, 293143095, 353322092, 409874212, 439016729, 423967973, 392090698, 382009168, 395387268, 420409466, 448734513, 466637459, 436936239, 357898427, 292632774, 258125605, 239897089, 230174823, 225227728, 210370796, 171650170, 133331533, 109120215, 94779272, 85563916, 78286687, 72566381]
18655G2566381l921501l669307l259728k996446k998716k826952k330665j871600
18647D8691466k130027j883405j894810k513637k563469j365623j179633o84357
18639C4476505p93813j387426j255113j271617r33440j212008p58003r27165p99055
18630B5138865p38332l23732o47264j153547o58360j32748Q03k73812l47067k96905
18620B0567901l06459k61875m10376o40865p92657p19470n76736l62824j32437
18611A6364202k2460j74811k15361m22861m83891o77472n68800m26049k95545
18602A3076952k72132p9732n32204p00932o49987K74979L48786k19071j43633
18593A1103026p1149l48037j42641l9617J36447K22959l51235k28204o4136k39622
$$ y = [72566381, 68644880, 64975573, 61715845, 58719399, 55720683, 52893731, 50563066, 48691466, 46561439, 44678034, 42783224, 40269587, 37706118, 36340495, 35160862, 34476505, 33682692, 32295266, 31040153, 29768536, 28835096, 27623088, 26865085, 25937920, 25138865, 24400533, 24076801, 23429537, 22275990, 21617630, 21484882, 21485685, 21211873, 20864806, 20567901, 20261442, 19999567, 19589191, 18948326, 18155669, 17436199, 16859463, 16496639, 16364202, 16341742, 16166931, 15951570, 15528709, 15044818, 14367346, 13798546, 13372497, 13076952, 12804820, 12725088, 12192884, 11491952, 10841965, 11116944, 11465730, 11246659, 11103026, 11031877, 10683840, 10541199, 10501582, 10638029, 10860988, 10509753, 10281549, 10217413, 9977791]
18583I977791K08955k0738N6874l68803k74492J33406j41231m24755m81868J35249
18573H800388k78903J30956j53833o65297J44795k00774j14862R7371j2935L59444
18563H106350K10110L15256l9100o02907j49959L06248j01380K89617L14541R2378
18553H741154L13169L49376M76448J80192j73255K48605j20628K77787K37565
18544A0530413L55428Q05911M32492Q7792k66068N2951L61987M17727J126679
18535A3905312J341293J264508J485581J943342K298294L525477M903246P606089
18527C8273142J2031471J8535367K6176643K7964173J7937006O718523N246992
18520A52883317J0491336J8442163K5986233L1802811K9348265M399744l2458186
$$ y = [9977791, 10186746, 10166008, 10222882, 9854079, 9579587, 9712993, 9571762, 9147007, 8665139, 8800388, 8521485, 8652441, 8498608, 7833311, 7978106, 7777332, 7662470, 7759841, 7746906, 8106350, 8316460, 8631716, 8592616, 7989709, 7839750, 8145998, 8044618, 8334235, 8648776, 8741154, 9054323, 9403699, 9880147, 10060339, 9887084, 10135689, 10015061, 10292848, 10530413, 10885841, 11691752, 12124244, 12212036, 11945968, 11998919, 12360906, 12778633, 13905312, 15246605, 16511113, 17996694, 19940036, 22238330, 25763807, 30667053, 38273142, 50304613, 68839980, 95016623, 122980796, 140917802, 147636325, 152883317, 163374653, 181816816, 207803049, 239605860, 268954125, 273353869, 240895683]
18513B40895683l4807139j8440793o510871j978346P53079J530393j6526779m0372940
18505A24542287l3010247j8825416j0394690o458687l973467k855355j715777
18498D7308648j563332j267838j395917k05753M89069n0185M80490R25267K192703
18489D6913152L279685M404050P621889J3637959K1307982K8804703K8668611
18482A54638031J7180252N758573M692500J2261375K0702336K7586886L1871699
18475B74691652K8285280J33184l7026213l5945976j7120299n018569M96979M377974
18467B12874012N894647r492852k4623130j7271236j0691917q192739l716101
18460A44780684K408063P934192J2668054J6025311J2298212n815459k3264374
$$ y = [240895683, 206088544, 187647751, 181136880, 179158534, 179911613, 181442006, 164915227, 124542287, 91532040, 72706624, 62311934, 55853247, 51879780, 49024425, 47308648, 45745316, 44477478, 43081561, 42875808, 43364877, 43314692, 43795182, 44720449, 46913152, 50192837, 54596887, 62218776, 75856735, 97164717, 125969420, 154638031, 171818283, 177576856, 182269356, 194530731, 215233067, 242819953, 274691652, 302976932, 303110116, 266083903, 230137927, 213017628, 207999059, 208496038, 212874012, 218768659, 209275807, 184652677, 167381441, 156689524, 148496785, 144780684, 147188747, 155122939, 167790993, 183816304, 196114516, 190299057, 167034683]
18453A67034683j8905228r239250l791674j791516r82072k033455j5766634k4869199
18445H9655655j7350117r983947n732841l835681k755831k278361j968080j366400
18437D4384397j467776o28695n16518n57584l29922L71391L19274N86433J727917
18428D3888917L121991N448665R764286J5079367J8923199J6528370P821230J875941
18420A22451966L427523Q588517J4111514J8839466K1428993J5547662r346547
18413A95049094k9319906k1374715r205696l049464j167354Q16355j894882j9941175
18405A09912257k8180296j8688417j0462374o071008m407602l147842k124596
18398C6830122k046756j738091j413168j014005n64023o55908j058456j020646
$$ y = [167034683, 148129455, 138890205, 135098531, 133307015, 132324943, 130291488, 114524854, 89655655, 72305538, 62321591, 56588750, 52753069, 49997238, 47718877, 45750797, 44384397, 42916621, 42287926, 41771408, 41213824, 40883902, 41255293, 41574567, 42161000, 43888917, 47010908, 52459573, 62223859, 77303226, 96226425, 112754795, 120576025, 122451966, 125879489, 134468006, 148579520, 167418986, 188847979, 204395641, 195049094, 165729188, 144354473, 135148777, 132099313, 130931959, 131748314, 129853432, 109912257, 81731961, 63043544, 52581170, 46510162, 42102560, 38954718, 36830122, 34783366, 33045275, 31632107, 30618102, 30054079, 29398171, 28339715, 27319069]
18390B7319069j010618j042909q45815p38722n44046q33112p04733o30236o58042
18381B0310836q01991q30630p90266l99458n47462n91386l44702k1485l25349
18372A5658107n38846o89085m0943l20010l32428l33796m70480l55540m07552
18363A2169427K38779l61620k62124k394j42636l90458k62460r9336l56175n63319
18353I967684j94006Q150l45631L34347K70200k23759j009339m56001J59093J76965
18343H687703l03162k73801k35352l33763l4547l01900Q0646p4357J68595p0810
18333G309252P3804k09442n49427m96491q9955k902o088j24342K15065l2282l07458
18322E779734l2761q3273J14881k35790k65707l80490K56449J78994j01893k18406
$$ y = [27319069, 26308451, 25265542, 24419727, 23681005, 23136959, 22303847, 21599114, 20968878, 20310836, 19508845, 18678215, 17887949, 17488491, 16941029, 16349643, 16004941, 15983456, 15658107, 15119261, 14430176, 14389233, 14069223, 13736795, 13402999, 12932519, 12576979, 12169427, 12408206, 12046586, 11784462, 11782068, 11639432, 11248974, 10986514, 10887178, 10531003, 9967684, 9773678, 9781828, 9436197, 9770544, 10040744, 9816985, 8807646, 8351645, 8510738, 8687703, 8384541, 8110740, 7875388, 7541625, 7507078, 7205178, 7285824, 7211467, 7380062, 7309252, 7383056, 7173614, 6624187, 6127696, 6037741, 6034839, 6028751, 5904409, 6119474, 6087192, 5779734, 5746973, 5663700, 5778581, 5542791, 5277084, 4896594, 5153043, 5332037, 5230144, 5011738]
18312E011738k72087M6247J25204K86854K01060m25771o32891n57677K43549N12707
18302D538933L3005P6017M52278L1797J50124L62902l63443m94279j3469j9107
18292D754758q426m6101l06654n80697L4872K3911p1872l7958k07093J05508m15872
18281C244376j62153M5997j39172l23133k6203m8706K80927M74069r416q4816
18271C251770L7429K63495L03283p5351p7960K5617M1788j53912j25921K15688
18261C705926P5355J0254j02368l41162J64176L03361M29003L1587k84813j99777
18251C791542o80319j89657M52326N04966l23370n75645k98538j77269Q954k81283
18241B231707n17105q2006K54955j09607N38711M86876J4987l36229n87042q4953
$$ y = [5011738, 4739651, 4785898, 4911102, 5197956, 5399016, 4973245, 4340354, 3782677, 4026226, 4538933, 4571938, 4647955, 5100233, 5132030, 5282154, 5645056, 5281613, 4787334, 4773865, 4754758, 4746332, 4700231, 4393577, 3812880, 3847752, 3871663, 3799791, 3761833, 3554740, 3660248, 3244376, 3082223, 3128220, 2989048, 2665915, 2639712, 2591006, 2871933, 3346002, 3336586, 3251770, 3289199, 3552694, 3855977, 3780626, 3702666, 3728283, 3770071, 3616159, 3490238, 3705926, 3781281, 3791535, 3689167, 3348005, 3512181, 3815542, 4244545, 4276132, 3991319, 3791542, 3111223, 2921566, 3373892, 3878858, 3555488, 2979843, 2681305, 2504036, 2512990, 2231707, 1714602, 1632596, 1887551, 1777944, 2316655, 2803531, 2818518, 2482289, 1895247, 1810294]
18231A810294p1110M85068K86008K66420n18658j53467l38817j19533K27522L9521
18221A913248J94691l6680k35535N0584P6202j1824j09081N3012M3576J27245
18211B065438M75625L01372j56026K910k4595p2468m65302l39797l74439l91346
18201A021372j10868J91527Q1000K09947J58402k59488k80311K84411J84493j59406
18191A321079M64433m1808j00551K5047K19393K9109m9180j03834O04939O14818
18181B983445K23788k07456j3732l6518J88596P9181J63442K7169J33994m75101
18171C066808k24446K7476j12572Q0925J56536J16939m28197m80272o13724j76880
18161A412593J68199M9203q58801m68524J96846J25541R6732m3902k05202j43093
$$ y = [1810294, 1739184, 2224252, 2510260, 2776680, 2258022, 2104555, 1765738, 1646205, 1873727, 1913248, 2107939, 2071259, 1835724, 1886308, 1962510, 1950686, 1841605, 1894617, 1938193, 2065438, 2541063, 2842435, 2686409, 2689319, 2664724, 2592256, 2126954, 1787157, 1412718, 1021372, 910504, 1102031, 1183031, 1392978, 1551380, 1291892, 1011581, 1295992, 1480485, 1321079, 1785512, 1743704, 1643153, 1668200, 1887593, 1916702, 1867522, 1763688, 2368627, 2983445, 3207233, 2999777, 2986045, 2949527, 3138123, 3217304, 3380746, 3407915, 3541909, 3066808, 2842362, 2869838, 2757266, 2838191, 2994727, 3111666, 2683469, 2203197, 1589473, 1412593, 1580792, 1629995, 771194, 302670, 499516, 625057, 721789, 677887, 472685, 329592]
18151C29592o3297K34827L16428J51683N20250o2120k56080p7286q9029j13004
18141H91964k9167l33162J86319M31084N6348R4834k33880j62246l32739O6671
18131F36026M35858r3898k91256m12577N21040J10907l47233N1601K69805k5047
18121H55226M53495O26914L19138j81794l01355l7231L46757j61770j11114K99230
18111B107496K02297l38039o44678o61895J97313R2147j33637k778K06703Q9203
18101A114132n8356J52751j70376j26877n15469j5922Q7670J8394J16867n0100
18091E52714l21833j02822K57323K45401j8371K25699j62185j21251p6790k623
18081D75262r953Q8252j93164J02153o0051M8040K4351j28751k01695p02115J9731
$$ y = [329592, 266295, 501122, 817550, 969233, 1489483, 1427363, 1171283, 1093997, 1004968, 891964, 862797, 529635, 715954, 1147038, 1203386, 1298220, 1064340, 902094, 569355, 636026, 1071884, 977986, 686730, 274153, 795193, 906100, 558867, 610468, 880273, 855226, 1308721, 1935635, 2254773, 2072979, 1771624, 1734393, 2081150, 1919380, 1808266, 2107496, 2309793, 1971754, 1327076, 665181, 862494, 954641, 821004, 818226, 1024929, 1114132, 1055776, 1208527, 1038151, 911274, 395805, 379883, 467553, 485947, 602814, 552714, 230881, 128059, 385382, 630783, 612412, 838111, 675926, 554675, 477885, 475262, 465309, 553561, 360397, 462550, 402499, 450539, 474890, 346139, 144444, -557671, -537940]
18070e37940K81572K49771L6382Q04571J60363J4915m90196l22248J20050k25107
18060I2133J28135K87211J98062L69836l57629m15280J0975J31040K59168L57389
18050A061040J1084j68111J636o1233J82585P1228k54699k51955p0697J22113
18040F42991R0483J87376j55409j000983j43911J5016K7333K8052J74061M27034
18030B92043J39146j52923Q2755j69762M5876M17189M04892m3474r8295k96981
18020F20466l31287l1857n2261J42663K48072l604M6221m2612M6682k5085O8956
18009F86354M9839k7840q9340l70167J0524N31367k6469j92126L4207l48950J88321
17998D45720K94275l72081k92622M05840M20647m2030n3473M2139p178K31569
$$ y = [-537940, -256368, -6597, 29785, 834356, 994719, 1009634, 519438, 197190, 317240, 92133, 220268, 507479, 705541, 1075377, 717748, 302468, 313443, 444483, 703651, 1061040, 1072124, 904013, 905649, 844416, 1027001, 1098229, 843530, 591575, 520878, 642991, 733474, 920850, 765441, -235542, -379453, -364437, -337104, -309052, -134991, 292043, 431189, 278266, 361021, 191259, 237135, 654324, 1059216, 1015742, 917447, 620466, 289179, 257322, 205061, 347724, 595796, 592192, 638413, 595801, 642483, 617398, 686354, 736193, 708353, 619013, 248846, 259370, 790737, 764268, 572142, 606349, 257399, 445720, 739995, 367914, 75292, 481132, 901779, 859749, 806276, 848415, 841237, 1072806]
17988A072806O96940Q0481j46675l88743K2535j04309k56093j50334J46562m22796
17978E50374N4114M9152K25026o9009k38426J57666L92203K48352m31402l2802
17968I05248K05183q8912J06632K9838M78284K1724k0265m31471q1666o2110k46938
17957H15547q119M15526L05309M11373K69113j85452K9237J81766J23641j16724
17947B241217j79146j37355K91148K76375j72151m17160L4832L64861J5351n93908
17937A724064k85475M5083m6382k99572p2612P4230L89283J08733m09374O6849
17927A294827P23218P0241l40731j30569l3878O3640M65n1775k90588l39693m16009
17916E49148R2185j60865k18029J14087N98427Q9518j24095o0372J59459p9664
$$ y = [1072806, 1769746, 1850227, 1703552, 1314809, 1337344, 1233035, 976942, 826608, 973170, 550374, 604488, 653640, 878666, 809657, 571231, 728897, 1121100, 1369452, 938050, 905248, 1110431, 1021519, 1128151, 1157989, 1636273, 1657997, 1637732, 1206261, 1124595, 1062485, 815547, 807428, 1222954, 1528263, 1939636, 2208749, 2023297, 2052534, 2234300, 2357941, 2241217, 2062071, 1924716, 2215864, 2492239, 2320088, 1902928, 1937760, 2302621, 2317972, 1724064, 1438589, 1483672, 1437290, 1137718, 1065106, 1139336, 1528619, 1637352, 1227978, 1294827, 2018045, 2088286, 1747555, 1616986, 1583108, 1646748, 1647213, 1595438, 1304850, 965157, 549148, 641333, 480468, 262439, 376526, 974953, 1064471, 940376, 880004, 1039463, 959799]
17906I59799K59688K1301p7192J5066j25295j73804j89137J47910J07099l84468
17896E60967k79159J03219N40798M01538l9862M09602N9287K1616J44199n9237
17886A862968L23574K46200m35902m90924J59983J9965l44742k30484n3203l20494
17876G36941N179O2901L98266L21217J83621m07028l56367Q5979j8528r8987j13014
17865H00180J00972k83369n69619j87448L95340M52462L83193p3618m14277L41102
17855I44918K96726J36273p6814m9529q2027l512q6853O09801O2097k07257j21775
17844A422048l13536o7277M49074L03498k08880j41454K07410J64758j67315n02341
17834A145985m18399m0455J61859L87021q0921n25794J82288J53380O6129K37331
$$ y = [959799, 1219487, 1240788, 1163596, 1178662, 1053367, 879563, 690426, 838336, 945435, 560967, 281808, 385027, 925825, 1327363, 1287501, 1697103, 1756390, 1778006, 1922205, 1862968, 2186542, 2432742, 1996840, 1505916, 1665899, 1685864, 1341122, 1110638, 1057435, 736941, 742120, 805021, 1203287, 1524504, 1708125, 1301097, 944730, 1030709, 1012181, 913194, 800180, 901152, 617783, 48164, -139284, 256056, 708518, 1091711, 1018093, 603816, 944918, 1241644, 1377917, 1301103, 1251574, 1169547, 1166035, 1079182, 1688983, 1751080, 1543823, 1422048, 1108512, 1041235, 1490309, 1793807, 1584927, 1443473, 1650883, 1815641, 1648326, 1145985, 727586, 687131, 848990, 1236011, 1155090, 629296, 811584, 964964, 1031093, 1268424]
17824A268424K14169j46708J7184j29171L0476L70591o1247k26423o9747k67796
17814I99752p6559K04675L87896K45782l17020M1638M7083L0399j83069J95793
17804A576370M72049L01260M6496J79415L03904j53721J79800M42073J83498L2335
17794C563479J36346K58542J27752M29751M39119M21603M03766O91308N13610
17785F985276K70903M61420P14601R07750J015073P08488J175570J187366J991589
17776A5418036K775379L078272M379418N953847R541744J4657786K0774621K4539758
17768A01118861J9460999R956568O141378J0198562J8338931K5005549K6731345
17761B16952193K0743059M285811k1082324k9693983j7633563p843608l828049
$$ y = [1268424, 1482593, 1335885, 1353069, 1223898, 1254374, 1624965, 1563718, 1337295, 1267548, 999752, 923193, 1127868, 1515764, 1761546, 1444526, 1486164, 1533247, 1563646, 1380577, 1576370, 2048419, 2349679, 2396175, 2575590, 2879494, 2725773, 2905573, 3347646, 3531144, 3563479, 3699825, 3958367, 4086119, 4515870, 4954989, 5376592, 5780358, 6471666, 6985276, 7256179, 7717599, 8432200, 9339950, 10355023, 11063511, 12239081, 13426447, 15418036, 18193415, 21271687, 25651105, 31604952, 41146696, 55804482, 76579103, 101118861, 120579860, 130536428, 136677806, 146876368, 165215299, 190220848, 216952193, 237695252, 241981063, 220898739, 191204756, 173571193, 165727585, 161899536]
17754A61899536m28394m487425k5307623l3353061k2710811j2983218p947312
17747E4681692m956219l242923j924060r21096n61867k44299l72704q7755N97889
17738D2968658K76027N46708J227896K406699K802826M057196O642061J0058921
17730G0986992J6086014K2743340K6611460K4719767K1597094K4764304L1804433
17723B39313404L4330120L1824240K8271851K5562018J7795743J830292r10456
17716C78017212L697468l673047k2511526k8690730k4615307l1568143l1503478
17709B39152449j9991998j6254539l0586081l6604259k5378161j5246861r671955
17702H5418595o658329m860352l487070k865915k434620k087852k585176j723369
$$ y = [161899536, 161471142, 156983717, 131676094, 98323033, 75612222, 62629004, 54681692, 49725473, 46482550, 44558490, 43637394, 43075527, 42831228, 42458524, 42370769, 42968658, 43244685, 43791393, 45019289, 47425988, 50228814, 54286010, 60928071, 70986992, 87073006, 109816346, 136427806, 161147573, 182744667, 207508971, 239313404, 273643524, 305467764, 333739615, 359301633, 377097376, 378927668, 378017212, 381714680, 378041633, 355530107, 326839377, 302224070, 270655927, 239152449, 219160451, 202905912, 172319831, 135715572, 110337411, 95090550, 85418595, 78760266, 73899914, 70412844, 67546929, 65112309, 63024457, 60439281, 58715912]
17694E8715912j855860j535153j236085m95554J59531R45210J990868L611153
17686F0300022P131224J1976471J7505924K0302832J5084039O841938M919766
17679A44062216Q956207J5084983K0194277K1108304J5777530J349207k1043330
17672B05489394k5896414j5367754p815395m559492k037715o128126k3136424
17665A20548074k7550221j8982915j1601247o922548m960460l582055k841799
17658D4106829k262619j866603j571243j729663j843957j501490j796518j047284
17650C0487452p14099j041759r50719j211869j488105j123717m91951p70580j029240
17641B1665413r22521k17502m50132l42815l95158m05031n72059j051015j72897
$$ y = [58715912, 56860052, 55324899, 54088814, 53593260, 53752791, 54698001, 56688869, 60300022, 67431246, 79407717, 96913641, 117216473, 132300512, 139142450, 144062216, 153018423, 168103406, 188297683, 209405987, 225183517, 226532724, 205489394, 179592980, 164225226, 156409831, 151850339, 149812624, 143684498, 120548074, 92997853, 74014938, 62413691, 55491143, 50530683, 46948628, 44106829, 41844210, 39977607, 38406364, 36676701, 34832744, 33331254, 31534736, 30487452, 29773353, 28731594, 27780875, 26569006, 25080901, 23957184, 23465233, 22694653, 21665413, 20742892, 20525390, 20075258, 19732443, 19337285, 18932254, 18360195, 17309180, 17136283]
17632A7136283l8923k3796l35403n56709l40369n11810r64392m35285L84016k45739
17622A4067873n80195k80453p07569l36281n27930k85531J1764p5377J37852k87606
17612A1136547L2136L10653k44222j80701l87394p82609j99149L11904j0675j29411
17602I857079k15120o15782q6949k27594r1135L18586k84974l54948m50640n9237
17592G789286k47734m21918l83116k13559n26119m9617k7348l01901j15297K36821
17582E739498J93419R3184J82688n87844P6593K98170k64013l13642k30705M2739
17572E230087n1000l83831R527l3064N8876J68094l52063P0049n6191j99944m31992
17561D028548M60945K46243m14120k80803K78045l7118J07713M06076J56948l22407
$$ y = [17136283, 17097360, 17073564, 16738161, 16181452, 15841083, 15329273, 14364881, 13929596, 14313612, 14067873, 13487678, 13207225, 12499656, 12163375, 11635445, 11349914, 11361678, 11286301, 11424153, 11136547, 11168683, 11479336, 11235114, 11054413, 10667019, 9884410, 9685261, 9997165, 9986490, 9857079, 9641959, 9026177, 8939228, 8711634, 8620499, 8939085, 8654111, 8299163, 7848523, 7789286, 7541552, 7119634, 6736518, 6522959, 5996840, 5947223, 5919875, 5617974, 5502677, 5739498, 5932917, 6026101, 6208789, 5620945, 5697538, 5995708, 5731695, 5418053, 5187348, 5230087, 5179087, 4795256, 4804783, 4771719, 4830595, 4998689, 4646626, 4716675, 4660484, 4460540, 4028548, 4489493, 4735736, 4321616, 4040813, 4318858, 4281740, 4389453, 4795529, 4952477, 4630070]
17551D630070l62122L3173k74747o5998J52506n40795j40389J03028J14846K94615
17541C944187M6476k37888r1496J2473k66917o77932O5059J82811J62519J94846
17531C334138L68439l53952o05173k71018k27057r0416O9614n7543n0129k9716
17521B087187N2557l31132m38130K35366J51721J27969O5030J35691k11276L9353
17511A914336j30843K4008K91336q6218k68065M87423k57512m2767M11472L03198
17501B646368j63636Q6997k26869k45758J19666M2899k08833P5039k01373j02906
17491A821594L35569k05066M49927K83231j14588p25051n23184J25712j10496
17482A337648R8062j65525j23118L23187l2802m64915j49218Q5219j72888J42385
$$ y = [4630070, 4267948, 4301121, 4026374, 3960376, 4112882, 3572087, 3431698, 3534726, 3649572, 3944187, 3990663, 3752775, 3661279, 3673752, 3406835, 2728903, 2793962, 2976773, 3139292, 3334138, 3702577, 3348625, 2743452, 2472434, 2245377, 2154961, 2224575, 2167032, 2116903, 2087187, 2139744, 1808612, 1370482, 1605848, 1757569, 1885538, 1950568, 2086259, 1874983, 1914336, 1783493, 1807501, 2098837, 2012619, 1744554, 2231977, 1974465, 1931698, 2343170, 2646368, 2482732, 2569729, 2342860, 2097102, 2216768, 2259667, 2050834, 2125873, 1924500, 1821594, 2157163, 1952097, 2402024, 2685255, 2570667, 1845616, 1322432, 1448144, 1337648, 1435710, 1270185, 1147067, 1470254, 1437452, 972537, 823319, 908538, 735650, 878035]
17472H78035n076L71P5858k6248M22338J98886k25555K62848k71766m56931k89850
17461E62910K76182J94725j113M9875L42382L60909j68132p74657l1660K72276
17451A083697J95959J13312k8162k48461o01698J0964Q4334N00424M69819R5392
17441A675580J90701p0493J1008l4708l61201l32983j75935Q7023l5112k45266
17431G08614m26609j97645K54233J57750k3594N33662J43460o11019r7473m7331
17421C94048l60997L15125L15456Q2627J5493m47534k25211N74632r9668l67286
17411A96685j03262M70496M57052k99756k27453J25261n7222r8408J96469L39222
17401I99084P6396p86988j10219J22346k6461M86457j33790l1983L08904K37748
$$ y = [878035, 872959, 873330, 949188, 922940, 1345278, 1544164, 1318609, 1581457, 1309691, 852760, 562910, 839092, 1033817, 1032704, 1082579, 1424961, 1785870, 1617738, 843081, 811421, 1083697, 1279656, 1392968, 1364806, 1116345, 514647, 525611, 609945, 1110369, 1580188, 1675580, 1866281, 1795788, 1806796, 1772088, 1410887, 1077904, 901969, 988992, 953880, 708614, 282005, 84360, 338593, 496343, 472749, 1006411, 1149871, 538852, 441379, 394048, 33051, 348176, 663632, 746259, 761752, 314218, 89007, 663639, 563971, 196685, 93423, 563919, 1020971, 721215, 493762, 619023, 561801, 463393, 659862, 999084, 1075480, 288492, 178273, 300619, 274158, 760615, 626825, 594842, 903746, 1141494]
17391A141494j41395o77758l64275L42919J67074M6361N4849Q1690Q1218j71718
17381E60459j09692k60388r1023J05508K56597L34015r7476q1571j10067M6480
17371E52842j85493k03580K02L59722J30381l88081J05815M12987K12769k2215
17361I75349p2787m35737j38812M56777M61650k52378m28005m15367j13676J55959
17351A92973j05947J14008J93729O03072m5354r8464K3424n1127p4021r3883j64353
17340D94057q7034L32803r6991k58971O1143n0737n512j81844n3219J91802L92195
17329G37692m0751p4431K00505j12643m9068J04242j96896K21289K05646k93465
17319G02120j39885N04925M4556n2731q5189k32367l26054p1300j25688L64143
$$ y = [1141494, 1000099, 322341, -41934, 300985, 468059, 514420, 569269, 650959, 732177, 560459, 450767, 190379, 99356, 204864, 461461, 795476, 698000, 616429, 506362, 552842, 367349, 163769, 163971, 523693, 654074, 265993, 371808, 784795, 997564, 975349, 902562, 466825, 328013, 784790, 1246440, 994062, 566057, 150690, 37014, 192973, 87026, 201034, 394763, 997835, 952481, 854017, 877441, 826314, 752293, 658410, 494057, 407023, 739826, 642835, 383864, 445007, 394270, 388758, 206914, 153695, 345497, 737692, 696941, 622510, 823015, 710372, 661304, 765546, 568650, 789939, 995585, 702120, 562235, 1067160, 1111716, 1058985, 973796, 741429, 415375, 344075, 218387, 582530]
17309E82530J75552j97031J07605K54212O2136o30742l90186O4404q761L93091
17299D12810q0310M60337L08353L2921k64955j5668L13k76912m03099j58851K97147
17288C12086N27265J14055j23463l35581O604j34262J52320O18419J23899m59320
17278H02022r7115j85284Q2801Q9219K89923k89423l11980l30766J26687l10079
17268a33995m84593K69552O13378J7923k89999L75993K66811j69999l795K98952
17258G60228m56652k82327K84682J94221k93434n27878Q911J93170J96291j78279
17248a01067Q9125L34759j5434j55302K04498l78611J8619N7460J69635o9745
17238A53937N7475J51717l75924m68011K15335M14843L45474l42187j00864J06480
$$ y = [582530, 758082, 561051, 668656, 922868, 985004, 354262, -35924, 28480, 19719, 412810, 332500, 792837, 1101190, 1134111, 869156, 853488, 853801, 576889, 173790, 14939, 312086, 839351, 953406, 829943, 494362, 500966, 366704, 519024, 1137443, 1261342, 802022, 704907, 519623, 602424, 691643, 981566, 692143, 380163, 49397, 176084, -133995, -618588, -349036, 264342, 282265, -7734, 368259, 635070, 465071, 461276, 760228, 303576, 21249, 305931, 500152, 206718, -321160, -312249, -119079, 77212, -101067, -11942, 322817, 307383, 152081, 356579, -22032, -3413, 54047, 223682, 153937, 211412, 363129, -12795, -480806, -265471, 149372, 494846, 152659, 51795, 158275]
17228A58275P3406O32360k03064j95118K94436J79127K31317K17275K14837N4849
17218A657700j18965k86169Q758q5470J44068J91831M8909k10551j44693j67065
17208A038353J18993J3341m9372l11265j52043K28623J45498l91194q739K00456
17198H32651j7264j54136l16530p0540L5782k48777m09651L81783R19155N37695
17188A490168k8563m65787J81325Q6256j88559J71733M81170M34469O292K0535
17178B189039m45680Q9140J75584K97870L04476k7878n7385j85119n81844k16549
17168A541654Q8582R4822k7390l07774k40806K28331M437K26551j62507m36078
17158A009822j54167L1263j67016L1825L94744j28833l2432L9199m59075l79192
$$ y = [158275, 231681, 864041, 660977, 465859, 760295, 939422, 1170739, 1388014, 1602851, 1657700, 1538735, 1252566, 1261324, 1175854, 1319922, 1511753, 1560662, 1350111, 1205418, 1038353, 1157346, 1170687, 1121315, 810050, 658007, 886630, 1032128, 640934, 632195, 832651, 815387, 661251, 344721, 274181, 309963, 61186, -348465, 33318, 952473, 1490168, 1461605, 995818, 1177143, 1263399, 1074840, 1246573, 1727743, 2162212, 2168504, 2189039, 1743359, 1832499, 2008083, 2305953, 2610429, 2582551, 2525166, 2340047, 1758203, 1541654, 1630236, 1725058, 1697668, 1389894, 1149088, 1377419, 1381856, 1608407, 1445900, 1009822, 855655, 886918, 719902, 751727, 1146471, 1017638, 985206, 1024405, 565330, 186138]
17148A86138K61218q9157l32217m86209O5846L78982L10796J68453Q8836K44946
17138G97632J74417k08772j45701M05726L75971p7659L14590m07173k76001K03551
17128A156581j27378j33510J07785J04779M4387k97691m32870k41591N0885j23833
17118A07544K32505N5741J36755j9885k47403o9287l4419k32725m2951l84282
17108d98407K02750L15702p9338q5928L91313j55975j25411j34853K33644K4138
17098H7635j10020J29278m5198k90936k70425o8643J29642k84698j0372L44574
17088c89163J04121j11930l02873k2109k6437j86046J78680N99297L44918p5461
17078A12997L11171K45010J06679o7625p9268L05k14959m64489K64993L07021
$$ y = [186138, 447356, 358199, 25982, -460227, -394381, -15399, 295397, 463850, 552686, 797632, 972049, 763277, 617576, 1023302, 1399273, 1321614, 1636204, 1229031, 953030, 1156581, 1029203, 895693, 1003478, 1108257, 1152644, 854953, 422083, 180492, 231377, 107544, 340049, 395790, 532545, 512660, 265257, 195970, 161551, -71174, -114125, -498407, -295657, 20045, -59293, -145221, 246092, 90117, -35294, -170147, 63497, 87635, -22385, 106893, 61695, -229241, -499666, -568309, -438667, -723365, -733737, -389163, -285042, -396972, -699845, -721954, -748391, -934437, -755757, -156460, 188458, 112997, 424168, 669178, 775857, 708232, 628964, 629269, 414310, -50179, 214814, 521835]
17068E21835k3553n16655j3059j75477l09025K82897L81003J98265j278k42235
17058A02718M16693j08888n08563J75215K98069k47021j82772K60110J35827p3751
17048B67637J81467k36538m68557K27568k05711m3082j22619M7361L12442q4246
17038a24278k94323j95260j1175L56653J41055q6873L09674j63809K18820R2684
17028B43168l15999k36604J63974J72459J26470k22831L3821L44935P6034J34345
17018E19772P0202p158r7200R5328J2095m26213K4769K35384N3892N79642K23448
17007A283961j29519q39109n20056K95543M16883J28203K56536Q9171j52511l18245
16997E10857m88229l27569j81484L65953M145l77128Q9618M70428j18798j19317
$$ y = [521835, 498282, -18373, -31432, -206909, -515934, -233037, 147966, 346231, 344953, 102718, 519411, 410523, -98040, 77175, 375244, 128223, -54549, 205561, 341388, 267637, 449104, 212566, -255991, -28423, -234134, -277216, -399835, -352474, -40032, -124278, -418601, -613861, -625036, -268383, -127328, -214201, 95473, -68336, 150484, 243168, -72831, -309435, -145461, 26998, 153468, -69363, -35542, 309393, 385427, 519772, 589974, 582816, 485616, 580944, 593039, 166826, 191595, 426979, 480871, 1060513, 1283961, 1154442, 315333, -204723, 90820, 507703, 635906, 892442, 981613, 829102, 510857, 22628, -304941, -486425, -120472, -116327, -493455, -403837, 66591, -52207, -171524]
16987a71524K50959P0075Q2651l07270j15981J93192P9178L00362K0475l8141
16977C63976q9834J13775K9861j27541j16631l41067j94878p1452M46980L20424
16967C33613M47572J38357m54899j23847j56655n78551n5667p1672N3548K34550
16957b33651J28733K12702J97228K62298j65435m27589p3825K07994K58869M28918
16947G96242l71755k23123k77141r8702L63793J52043L09652J01050Q8938K04558
16937A045555j39976m20153k83419K1425l9453K18744K51631J6469j36666m0223
16927D93934l6737Q8849k14841K41815m3307m25683j96448J9118O54592J10072
16917F91364o9330m41870m49026j74289j1169n0738K61966J54782l56558l72397
$$ y = [-171524, 79435, 149510, 232161, -75109, -191090, 2102, 81280, 381642, 402117, 363976, 274142, 387917, 417778, 290237, 173606, -167461, -362339, -433791, 13189, 333613, 781185, 919542, 464643, 340796, 184141, -394410, -450077, -521749, -468201, -233651, -104918, 107784, 305012, 567310, 401875, -25714, -99539, 108455, 367324, 796242, 424487, 201364, -75777, -174479, 189314, 341357, 651009, 752059, 840997, 1045555, 905579, 485426, 202007, 223432, 183979, 402723, 654354, 670823, 534157, 493934, 457197, 546046, 331205, 573020, 529713, 104030, -92418, -73300, 581292, 691364, 622034, 180164, -268862, -443151, -454320, -505058, -243092, -88310, -444868, -817265]
16907h17265M6071Q30928L81044L3503o6717l50084J99624j77884j41550K29805
16897A67475J17772l24423O7308J34587k4134K8814k15142N1458J40619O2077
16887B06411k05292L45133J7892J4057J19547O7914k04514k96889k88133l23393
16877e47267j7585K87252J59154J64930m83631R4808O40078K18637j98777n86258
16867b68659J2111K69726O653j55313j2341o940m6803J91025K97779K34149K76290
16856G97677j76847l18910Q5706j76934n67680l6223m5269L35179j71432k81958
16846e56691K42297J25485O9308J94921o2359N0444q1426K06172l80219K90196
16836I8128M48962j42244m17451l7146R425P4696j26727k4007J16473n5075L28642
$$ y = [-817265, -771194, 59734, 440778, 474281, 407564, 57480, 257104, 79220, -62330, 167475, 285247, -39176, 28132, 162719, 138585, 167399, -47743, 3715, 144334, 206411, 1119, 346252, 364144, 378201, 497748, 565662, 361148, 64259, -223874, -547267, -564852, -277600, -118446, 46484, -437147, -342339, 297739, 516376, 317599, -268659, -256548, 13178, 19831, -135482, -147823, -154763, -201566, -10541, 287238, 521387, 797677, 620830, 301920, 387626, 210692, -356988, -393211, -438480, -103301, -274733, -556691, -314394, -188909, -119601, 75320, 12961, 63405, -18021, 188151, -192068, 98128, 547090, 404846, -12605, -49751, -40326, 34370, -92357, -116364, 109, -54966, 273676]
16825B73676K90693o2865j02046j59749j85777L50957K79624r4073k6715m88906
16815G4819j20889J7688L8128p7833J50933L37808n6813j63502m62504k10616
16805d72781O2943J23139q4748K25664Q8274l27349k50393N34458k1456K70006
16795A47757L18025j74783m96769J34683M70636M7261j30050p8982K42214Q2266
16785E62258n3334p622L42643k75493n12924J748k18849K42372L71850m09872
16775D2777M402j91353L8798K6816L34235O48524m4416k24359R0458m5104o44379
16764C6399R6485M4881L018K09857J57072l16967l95033l15309o3835L007m18575
16753i59000j25573L46750L49114K30789K83603K855k52862j49573L05456Q4925
$$ y = [273676, 564369, 501504, 399458, 239709, 53932, 404889, 684513, 590440, 563725, 74819, -46070, -28382, 9746, -68087, 82846, 420654, 363841, 200339, -262165, -472781, -409838, -286699, -371447, -145783, -57509, -384858, -635251, -100793, -122249, 147757, 465782, 290999, -205770, -71087, 399549, 446810, 316760, 237778, 479992, 562258, 508924, 501302, 843945, 568452, 55528, 57276, -161573, 80799, 452649, 42777, 47179, -144174, -105376, -78560, 255675, 904199, 859783, 635424, 725882, 680778, 36399, 132884, 177765, 180783, 390640, 547712, 230745, -164288, -479597, -543432, -540425, -959000, -1084573, -737823, -388709, -157920, 125683, 128538, -124324, -273897, 31559, 116484]
16743A16484P5070Q4452j66370j81650j10016K14669J80965k94767m77037j17363
16733f75563J01061M16358O6886j35058j72361J18491k72337j16091M88695L79644
16723A99725J9918l74750k77386j08614K46135J47297j08187J37562O6262k79412
16713c31450j39229p0146j26282J1656k5635K25681L16627L68399J64327j45188
16703B48760k53519p767J19106j20246j52792l5867R6376l69188k31475L52221
16693c54391M80997r7630n60936N91379L19072l6356m92582k36594Q08018L09134
16683G30111l50260m86454P3786q0487j32385K68315N2875j63386l46734j83908
16673f18527n8196N42192Q5890m11805J47270N90229O9515j20568k76417k76497
$$ y = [116484, 191554, 276006, 109636, -72014, -182030, 32639, 213604, -81163, -558200, -675563, -574502, -158144, -91258, -226316, -398677, -280186, -552523, -668614, -179919, 199725, 219643, -155107, -432493, -541107, -294972, -147675, -255862, -118300, -52038, -331450, -470679, -540825, -667107, -655451, -681086, -455405, -138778, 229621, 393948, 248760, -4759, -12526, 106580, -13666, -166458, -202325, -105949, -475137, -706612, -354391, 126606, 28976, -531960, 59419, 378491, 342135, -150447, -387041, 420977, 730111, 379851, -106603, -32817, -113304, -245689, 22626, 75501, -87885, -434619, -618527, -676723, -134531, -48641, -460446, -313176, 277053, 346568, 226000, -50417, -326914]
16663c26914j22733k08090j1508J49172j71188m647J15633M4773j4222J41280
16653d08444K44456l25823k21189L78555O50547J08921l57767m4089k908j26145
16643a03886J48025J6770l76676L9311Q5768j75887j91325K20775k9097k26272
16633e92494k0167K06487M44974K48274j55556k81648J25196J17832l26787K26453
16623g436M6546j13568K9321Q7239K46872j53911r1224j47084K72241J6016l0101
16612A54911l68128o7821k2471j34890O63469K85246l20155K7057o8993j30216
16602A8009j07169n0822J43115J94779l34424o43816l17301k00754J48443L34518
16592h15422O10468M78151P9289j74475r9303R4437O9613p689k07597j58760R1798
$$ y = [-326914, -449647, -657737, -669245, -520073, -691261, -695908, -580275, -535502, -549724, -408444, -163988, -489811, -711000, -332445, 318102, 427023, 69256, 25167, 22259, -103886, 44139, 60909, -315767, -276456, -190688, -366575, -557900, -337125, -366222, -592494, -612661, -406174, 38800, 287074, 131518, -150130, -24934, 92898, -233889, -7436, 39110, -74458, -45137, 42102, 288974, 135063, 43839, -103245, 168996, 185012, 154911, -213217, -281038, -303509, -438399, 225070, 510316, 190161, 217218, 148225, 18009, -89160, -139982, 3133, 197912, -136512, -780328, -1097629, -1298383, -1149940, -815422, -204954, 273197, 352486, 178011, 78708, 173145, 242758, 235069, 27472, -131288, -39490]
16581c9490k33142j30390M01095J53135j31319l45408o8242P76574J10991j76545
16571C17259l8547k17934l60444Q1111J14291J09398J29931l2862L1287K06078
16561C39568J89863k27338k65220j21868j94780m23901J38319J37612k74513P0612
16551f31646j1784N43850m7171j60421j8850J85895J44652j25324j71335k7656
16541c19790n3484j21150M7457J77858j4176l07960J3642L21957J9725N5657J50964
16530b9300K07175J50182j52154l6422l6660k28380K143o47494n92857J02700
16520a261067O91345n253l1597J14984R088k744K8133k44660j44969n5564L91660
16509e10644R13400R7106l79822N34213L40952n36479k50550j50169j92623L29798
$$ y = [-39490, -272632, -403022, -1927, 151208, 19889, -325519, -393761, 382813, 493804, 317259, 278712, 60778, -299666, -218555, -104264, 5134, 135065, 102203, 133490, 339568, 529431, 302093, 36873, -84995, -279775, -703676, -565357, -427745, -702258, -631646, -643430, -99580, -146751, -307172, -326022, -140127, 4525, -120799, -292134, -319790, -373274, -494424, -446967, -269109, -283285, -591245, -577603, -255646, -235921, -180264, -29300, 177875, 328057, 175903, 139481, 102821, -125559, -123416, -770910, -1363767, -1261067, -569722, -574975, -606572, -491588, -482500, -485244, -457111, -701771, -846740, -902304, -510644, 402756, 499862, 120040, 654253, 995205, 458726, 208176, 58007, -134616, 195182]
16499A95182J68610j8808m15079l85914k03123o9522j56788J12683N2692J72245
16489e47822J87556p1367j48136J88824P58873k41333n3513J7822k90339m66277
16479f65712l5251N54358O820J52724k0696o4993P1065l5985k1193q6977o2617
16468b08457J1722L3642J3003k30081Q8775k2295K09299j78721J07725J38138
16458c7250o509j12242J3934L4822J92324m9535M0993k07680j59713O1858O2922
16447a66076j25027K71400M8082p5939P6518k971J38694m86595n45588k54739
16437a122241K91112M55028K82803J41077M2480l41439J3797N54032j45193l51350
16427a79894J76920J2417n31774l00546J77108M12842N75328k35310l50450J46830
$$ y = [195182, 363792, 344984, -70095, -456009, -659132, -728654, -885442, -772759, -720067, -547822, -360266, -431633, -579769, -390945, 367928, 126595, 73082, 90904, -199435, -665712, -700963, -146605, -139785, 12939, -7757, -72750, -1685, -37670, -58863, -145840, -208457, -196735, -163093, -150090, -380171, -291396, -313691, -104392, -283113, -175388, -37250, -43759, -156001, -142067, -107245, 85079, 35544, 76537, -131143, -290856, -228998, -166076, -291103, -19703, 28379, -47560, 28958, 25987, 164681, -321914, -867502, -1122241, -831129, -376101, -93298, 47779, 90259, -251180, -237383, 316649, 171456, -179894, -2974, 9443, -522331, -822877, -645769, -232927, 342401, 107091, -243359, -96529]
16417i6529J8976o9736K07710K18578K00441j31456K0509k41094k50055k33031
16407c55687M66869K92677L23645k61146n23345k56028J31309j93510l3919K28282
16397a80853j38844k2995Q6516K10655p7956r730j33597j06851K74785m7612q6768
16386b33250n3914K56303K35767J22883l03018n08400R4509J63089L13456k63988
16376a76563j98841k1104l56065J05221m68754L65039K97409l61852p1171N36853
16366c49828J90200J14674k08337k82651N04305J67652K89662m99060j82571k36678
16356d92632K68938M5711k12405N7574K25046p843m708k20812K07609j10437j05057
16345c49016j40348j73575j30164p1435j61459N12300P4721k9860k35374o2435
$$ y = [-96529, -77553, -147289, 60421, 278999, 479440, 347984, 368493, 127399, -122656, -355687, 111182, 403859, 727504, 466358, -56987, -313015, -181706, -375216, -409135, -180853, -319697, -342692, -256176, -45521, -123477, -133207, -266804, -373655, -98870, -146482, -233250, -287164, -30861, 204906, 327789, 24771, -483629, -389120, -226031, 87425, -176563, -375404, -396508, -752573, -647352, -1116106, -751067, -453658, -815510, -886681, -349828, -159628, -44954, -253291, -535942, -31637, 136015, 425677, -73383, -255954, -492632, -223694, -177983, -390388, -332814, -107768, -115611, -120319, -341131, -133522, -243959, -349016, -489364, -662939, -793103, -864538, -1025997, -513697, -438976, -468836, -704210, -766645]
16335g66645M34844j17170l57513j64763J83706N49590j98577O8389Q7269K93808
16325A2938j05729l02346J3460J58225O2232k3756L11883J74224L6551J99030
16315E36712J46975N2173q7151k217L1419l01579l39738j05960k56143j58490
16305d83999R223n9686J00499J13038l14910J7234M0215M3720K66176O1123n6810
16294b64177J13550J70303N24349L36478l96917n30594n19789l48345o0080K13389
16284g61833k99324K03835P16545P6008J70190j34346k35078J7465K09011j29381
16274a66908K16169p4725m56505K35092j31687K5034l83067j87037K1802J57859
16264g43973R3403K63620j24355k53103J56888M46237P0639n15456m59652J28043
$$ y = [-766645, -331801, -448971, -806484, -971247, -787541, -237951, -436528, -368139, -280870, 12938, -92791, -395137, -381677, -223452, -161220, -184976, 126907, 301131, 337682, 536712, 683687, 735860, 648709, 646492, 677911, 376332, 36594, -69366, -325509, -483999, -474776, -534462, -433963, -320925, -635835, -618601, -578386, -534666, -268490, -207367, -264177, -150627, 19676, 544025, 880503, 483586, -47008, -566797, -915142, -975222, -761833, -1061157, -857322, -140777, -64769, 105421, -28925, -264003, -246538, -37527, -166908, 49261, -25464, -481969, -246877, -378564, -353530, -736597, -923634, -901832, -743973, -650570, -386950, -511305, -764408, -607520, -161283, -90644, -606100, -1065752, -937709]
16254i37709L50536q5699L06575P46027m20775j12908K00086M12232J81068j28334
16244E11099n26074l97046M8007K99286L23431K94313l51617j63886K82533n8673
16234B61373k10951J61606L70985o2697j67640l66703m68103j44143M31496J87675
16224g102k60811K43253K16408k48660j35631k59883j2557K59783K61714l4579
16214B1935k78516M7636l585L09431L83512P1571n33932r5935r8059K29486L40716
16203C94260J45450j28255k7910J82150j4662n73088L25239N03949j89235m37681
16193A80217J98214J26130p7230j17863j08236j46253K53796K08677J16598K44032
16183H78082k33345q131j2430l3038k13712l01060k40112J17574Rj56698K47949
$$ y = [-937709, -587173, -672872, -366297, 379730, -41045, -153953, 46133, 458365, 639433, 511099, -14975, -412021, -364014, -64728, 258703, 553016, 201399, 37513, 320046, 261373, 50422, 212028, 583013, 520316, 352676, -14027, -482130, -626273, -194777, -7102, -267913, -24660, 191748, -56912, -192543, -452426, -464983, -205200, 56514, 21935, -256581, -208945, -212530, 96901, 480413, 551984, 18052, -77883, -175942, 53544, 394260, 539710, 411455, 383545, 565695, 551033, -22055, 303184, 807133, 617898, 180217, 378431, 504561, 427331, 309468, 201232, 54979, 308775, 517452, 634050, 878082, 644737, 636606, 624176, 591138, 377426, 76366, -163746, -46172, -46163, -202861, 45088]
16172D5088O3289m2823j55061Q144O0215J16508k69042m48879O8552L54225K20127
16161B0343J63354o6992k49145J82910R0100o3935O368k77099r5664M54087k94921
16150a30594J27545M15153k8889R8307N7803m45306k99526j46709j67599j36997
16140f56812j23879M4960J25731K70357J11304N66084K54383l39577j66935M8006
16130A33622n53625o0124L05618l24296k44660K77638N12740j09298l25531Q3095
16120c04821L51319o35118K83263O25619l93187l44868m23399j27694K38352J43768
16110e86766K19050n6162j33309n3584r6555M09483M11705n00498l12979Q2635
16100f16980j51436K61734K30530K46729l86869k10763j88329J80362J84187J63671
$$ y = [45088, 108377, 65554, -89507, -81363, -21148, 95360, -173682, -622561, -554009, -199784, 20343, 183697, 116705, -132440, 50470, 140570, 76635, 83003, -194096, -289760, 164327, -130594, -3049, 412104, 383215, 481522, 539325, 94019, -205507, -352216, -519815, -656812, -780691, -735731, -610000, -339643, -228339, 337745, 592128, 252551, 85616, 133622, -420003, -480127, -174509, -498805, -743465, -465827, 46913, -62385, -387916, -304821, 46498, -588620, -305357, 320262, -72925, -417793, -841192, -968886, -730534, -586766, -367716, -423878, -557187, -610771, -707326, -297843, 113862, -386636, -699615, -616980, -768416, -506682, -276152, -29423, -416292, -627055, -815384, -635022, -450835, -287164]
16090b87164N09101P7902j70908l07678k80201p8215j93550K98589L08964K44086
16080A20926J3571j98400L02953O08408Q0529p58632j05573m1265m68721m15555
16070h61759L66633K47395j76308r0378L85223K12527m3792p5326l40393j52450
16060e28628M13267J65861k07892n63995P2918m9706M19222O5824j83254r3647
16050d90030K07511L3782K98270O96880k05774j28425q4751k49512j12493m921
16040c9463k934J99929j67715j18151L5224r6197J82529m3816J77979L13786k86923
16029A54248k25133L87830O7537J44132j64988J05360l65562j20741R5391r3691
16019a5617l27813l6653N9375j25220K22925L42707m3886n15787l21243L11846
$$ y = [-287164, 221937, 299839, 128931, -178747, -458948, -537163, -730713, -432124, -123160, 120926, 134497, -63903, 239050, 847458, 927987, 169355, 63782, 22517, -446204, -861759, -495126, -247731, -424039, -514417, -129194, 83333, 39541, -35785, -376178, -528628, -115361, 50500, -157392, -721387, -648469, -698175, -278953, -213129, -396383, -490030, -282519, -248737, 49533, 746413, 540639, 412214, 327463, 77951, -34542, -39463, -42397, 157532, -10183, -128334, -93110, -189307, -6778, -50594, 127385, 441171, 154248, -70885, 316945, 384482, 528614, 363626, 468986, 103424, -17317, 78074, -15617, -343430, -380083, -320708, -445928, -223003, 119704, 75818, -439969, -761212, -449366]
16009d49366N25469J53482k1208R0277O0891m78204o09831K61028L42955o9280
15999a93787J46192p9926j96258j74590K0358J93327J16684K46903O15136K95534
15989I89573k64433k14300k12545J68892K40121n09523k76473k3087j29560K97742
15979F6407Q8708K06049J43817l41951k23950p0147j40637J404J10451L37006
15969A77157r3182j63821J35475m5535j9921R22J00621j34589l33964N1469k75847
15958f01215k06432K86742K77184K96052K59219K71457l02618m64507l76891k46662
15948h07671j6720M16912j37746j73651J18373N7722K07909M35567M3889m90973
15938c46389J84160j41271o7374l23972M9154j00972j822K28724K41912L28215
$$ y = [-449366, 76103, 229585, 208377, 298654, 359545, -118659, -728490, -467462, -124507, -193787, -47595, -127521, -323779, -498369, -478011, -284684, -168000, 78903, 694039, 989573, 725140, 510840, 298295, 467187, 707308, 197785, -78688, -101775, -231335, 66407, 155115, 361164, 504981, 163030, -60920, -131067, -271704, -270300, -159849, 177157, 83975, -79846, 55629, 10094, -9827, -8905, 91716, -42873, -376837, -325368, -601215, -807647, -520905, -243721, 52331, 311550, 583007, 280389, -184118, -561009, -807671, -824391, -407479, -545225, -718876, -600503, -542781, -334872, 100695, 144584, -346389, -162229, -303500, -370874, -694846, -645692, -746664, -748486, -519762, -277850, 50365]
15928E0365l01456j36154L57985M91025M7430k93333m18227j3155J04377M02075
15918B90932J82581j07413O904j43202j69712J65450J92015n07842o3055M45001
15908B91659J60526K7451O7876k75782j0939J20244n8459l20038k5876q9626L4138
15897g8826K4858M06395l179j85104l24179L58038L13991m50358j99668j0276
15887a48308L9543m1700Q7310l9682o9099J903j25657L17815N88251l80953j11300
15876A18123k31691p2072r6632j15834J58483k74447r6226J1298j49268P6980
15866f71286J37812N9704P056K34291L50776K34618k36195l2597K0022l39454
15856b35253n1992r544K92580Q6506K18543l02605O2553k96534J38730J7092k51538
$$ y = [50365, -251091, -387245, -29260, 461765, 509195, 215862, -202365, -215520, -111143, 290932, 473513, 366100, 373004, 229802, 60090, 225540, 417555, -90287, -153342, 291659, 452185, 479636, 547512, 271730, 260791, 381035, 322576, 2538, -23338, -112964, -78826, -53968, 352427, 349248, 164144, -160035, 198003, 511994, 61636, -138032, -148308, -108765, -150465, -63155, -102837, -171936, -170033, -295690, 22125, 610376, 229423, 118123, -113568, -185640, -282272, -398106, -239623, -514070, -610296, -598998, -748266, -671286, -533474, -473770, -466714, -232423, 118353, 352971, 116776, 84179, 104201, -235253, -287245, -296789, -4209, 82297, 300840, -1765, 60788, -235746, -97016, -79924, -331462]
15845c31462n1271K81342j57591J69566m35557k17230J76347L52919O4311J0151
15835a38475k5906p7596Q7562o1364q9464k93751M11581J65955j16552r1717K12742
15824a6985K90132K90366L08530L7691k48765l65536J79398j433j04615j3677
15814C55106l46422l04205L39575O91854j44697k43880r2591J42412Q3139j30014
15804C50277n6786K5171J90527o8586N0936k3991k37263m05973k78271J84509
15794b69450N1015j54288O7845M31558J0968j48723M919J15012N483Q9406J92614
15783C96359k69262l83263j08847p0256n81700j37813K90401Q0800J5847J4364
15773g53370J40407o8993K6394R8661j07590N2722J15596J96762K62409O8445
$$ y = [-331462, -382733, -101391, -258982, -89416, -524973, -742203, -565856, -212937, -148626, -138475, -164381, -241977, -154415, -215779, -305243, -598994, -187413, -21458, -138010, -229727, -16985, 273147, 563513, 872043, 909734, 660969, 295433, 474831, 473398, 368783, 355106, 8684, -295521, 44054, 735908, 591211, 347331, 254740, 397152, 480291, 350277, 293491, 318662, 509189, 440603, 491539, 467548, 230285, -175688, -453959, -269450, -218435, -372723, -304878, 126680, 137648, -11075, -6156, 108856, 114339, 203745, 396359, 127097, -256166, -365013, -435269, -1016969, -1154782, -864381, -783581, -767734, -753370, -612963, -681956, -655562, -556901, -664491, -611769, -496173, -299411, -37002, 31443]
15763C1443j86822r9802P3476M64876j94516n9889j69581l01260J65725N21585
15753B45235j12660p9830p6704p0400k98287K01240k07085K8069K60445R3469
15743a6508j23852R0092k8103K03688l47541k50643M25863K00827M800M45999
15733F04622j54091L05564L27289j98410l06710M10532l46384m71951L38088k65526
15723B43023k81791P4244j24170k64335R6242R9219k02934M9942j54861K31093
15713b34328o3670J77722K82210k59664l44594k58885J24954K32813K56872M48072
15703C61502k34547R6537O9546o07347j94984K63636J28273k90183L5933R5043
15693b76591M09658K72672k29498l61892J59653q799m77714p0734j19078J38688
$$ y = [31443, -155379, -255181, -181705, 283171, 88655, 28766, -140815, -442075, -276350, 245235, 132575, 52745, -23959, -94359, -392646, -191406, -398491, -370422, -109977, -16508, -140360, -50268, -78371, 125317, -222224, -472867, -47004, 153823, 158623, 604622, 450531, 756095, 1083384, 884974, 578264, 988796, 642412, 170461, 508549, 243023, -38768, 35476, -88694, -353029, -256787, -157568, -360502, -310560, -465421, -234328, -297998, -120276, 161934, -97730, -442324, -701209, -576255, -343442, -86570, 361502, 126955, 223492, 293038, -314309, -509293, -245657, -117384, -407567, -371634, -276591, 133067, 405739, 176241, -185651, -25998, -34797, -512511, -583245, -702323, -563635]
15683e63635L9461j29606M20904L29955l17757l21519K8506K7821j50717N9848
15673e76739K25061K77055K02112Q8016j08615L84892Q1061j95678q6842k63570
15663B6753M0756j20906Q4862L60978Q2449m9018m3602J37898k77686m06787k22303
15652c86606K22437N61837J10206l2311l6112k42997l85808k21619j11452N8756
15642d63669p8284Q6364K52369K0088k0868p1020j08249R3313K58158q7448K16189
15631I6943M3707k41597k5747K00273k54390m29200K18906k4048j45408O0413
15621e00148M92437J92872J87077q2417k31015J10154Q1650j31838l96753j4716
15611b92697K92807J96432l098m40133M0752L0056m9020K01753L40870P3671l20353
$$ y = [-563635, -524174, -653780, -232876, 97079, -220678, -542197, -513691, -485870, -636587, -576739, -351678, -74623, 127489, 215505, 106890, 491782, 572843, 377165, 290323, 26753, 67509, -53397, 31465, 392443, 474892, 425874, 382272, 520170, 242484, -164303, -386606, -164169, 397668, 507874, 475563, 439451, 196454, -189354, -410973, -522425, -463669, -541953, -455589, -203220, -183132, -204000, -275020, -383269, -289956, -31798, -119246, 96943, 140650, -100947, -126694, 73579, -180811, -610011, -391105, -415153, -560561, -500148, -7711, 185161, 372238, 289821, 58806, 168960, 250610, 118772, -277981, -292697, 110, 196542, 193444, -246689, -205937, -175881, -224901, -23148, 317722, 391393, 71040]
15600G1040j97309j0148K63360M58275k97390n17805n7447j7557P8629L81556
15590A55204j17319k02516Q8945k7632J18690L08021J82559k81569j00273K3235
15580A47345k02364J53959L68944j1112J41451o7237J28411n045j7349n03270
15570A33733R2480J38076m11291l72080j2522l3218J62902N47930j83192j54111
15560i1293L9124K36011l4883k49403K86809l4709O7119j55335J8988k43830k19042
15549c80444O62891N39519M3877L327Q4186m20209o09928l3146J96751o9732k46026
15538b28934l31775K43048M1954k8716j6342o1167k23766K19443r9806R5948j40909
15527e31022K08938L6370L89357r3408k32433K10956J6950O5428L72612N4925
$$ y = [71040, -126269, -136417, 126943, 585218, 287828, -229977, -287424, -304981, -226352, 155204, 37885, -164631, -75686, -103318, 15372, 323393, 505952, 224383, 124110, 147345, -55019, 98940, 467884, 456772, 598223, 530986, 659397, 654352, 637003, 133733, 226213, 364289, -47002, -419082, -431604, -464822, -301920, 246010, 62818, -91293, -52169, 183842, 148959, -100444, 186365, 151656, 218775, 63440, 82428, -161402, -380444, 282447, 821966, 865843, 869170, 953356, 533147, -76781, -109927, 86824, 17092, -228934, -560709, -317661, -275707, -304423, -320765, -381932, -605698, -386255, -486061, -390113, -531022, -322084, -285714, 103643, 10235, -222198, -11242, 5708, 71136, 443748, 498673]
15517D98673K247J61313m75135l02654k34896M25808O22214J58920Q90j77282
15507F80098J5488k31065l65724L52822k94169k06450K43671K16641j58428k99411
15497d6527l99023k21448J62835l2720J36624J84319j7470J18939J07081l60826
15487c68216j380J93285k14204J30588L48756R5207l0399j08822O1287R7493q5787
15476A17808q0394k63035l51474O3923N86986L174K73411L56617Q0968l91639
15466C96345l01929j90780J13038K64516L23852j1261m44201m67820l4302l4069
15456c86611N46673J53970q5526j08596n1661j44369L37782L01484m76994k7552
15446E8600J32589m26724k91066J36811J34908P4867J99785N1240l04983k14449
$$ y = [498673, 500920, 662233, 187098, -115556, -350452, 75356, 697570, 856490, 857380, 680098, 695586, 464521, 98797, 451619, 157450, -49000, 194671, 411312, 252884, -46527, -445550, -666998, -504163, -536883, -400259, -215940, -233410, -114471, -7390, -368216, -369596, -176311, -390515, -259927, 88829, 184036, 153637, 44815, 106102, 203595, 117808, 37414, -225621, -577095, -513172, 73814, 76988, 350399, 707016, 787984, 396345, 94416, -96364, 16674, 281190, 605042, 593781, 149580, -318240, -352542, -386611, 160062, 314032, 228506, 119910, 68249, -76120, 261662, 563146, 86152, 58600, 191189, -235535, -526601, -389790, -254882, -180015, 19770, 71010, -233973, -448422]
15436d48422k2662L31j58212P5532K5113j75865l8472l00151O9168K13656J68014
15425e91970K21924K77299j75510J77437L38062J60055j86223j00747J6479l52790
15415b15984O7803K84871k48628M5193j30735l05278K05647J59308j80304J18254
15405a99853N76197K10351j54389j95829k24055j18137K50844n3087j48854J21904
15395F5092j34256P4760j70822k75323M4187J25229N1712L80643N8045M7885k70334
15384c182m70535k62015J21564P02760K59029k30488j85012R2836J40263J63534
15374C28754m2082j06325m14282N838J44816n0374j33694O7487K58107M20657
15364D78902O1516l36367j01657j72263l09830J30293O58082N03830J10347o59986
$$ y = [-448422, -471084, -470753, -628965, -553433, -528320, -704185, -742657, -1042808, -973640, -759984, -591970, -370046, -92747, -268257, -90820, 247242, 407297, 221074, 120327, 136806, -215984, -148181, 136690, -111938, -66745, -197480, -502758, -297111, -137803, -318107, -199853, 376344, 586695, 432306, 236477, 12422, -105715, 145129, 92042, -56812, 65092, -69164, 5596, -165226, -440549, -396362, -271133, -219421, 161222, 219267, 267152, -3182, -473717, -735732, -614168, 88592, 347621, 117133, -67879, 24957, 165220, 328754, 286672, 180347, -233935, -228097, -83281, -133655, -267349, -199862, 58245, 478902, 540418, 204051, 102394, -69869, -379699, -249406, 408676, 912506, 1022853, 362867]
15354C62867l86761K0611J80456q1220j1907K737m37496j62176M19909J30899
15344C7919k12677k23404L6936k72482K21612P1864j797R3025l97444P5164N9317
15333e11967n8234M9037l8312k26008j31708K56939J04103J78730J92241k2219
15323b07398J58549N15003k75803k98210k60447J31645N25915J28105k82916j88508
15313e4065k33522r7687J41396j16886k9687p9756j57593K72093N49725K12497
15303D06515n0976j23311k72476k48304j24840j67017K46465M36077N44639l638
15293F43134k89094j75818l08021J13492n11238k84026N95859M43512j70802K25288
15283B82286L3879l05469j4998j87520l72053L26203J97178p0182J91340j88356
$$ y = [362867, -23894, -3283, 177173, 95953, 84046, 86783, -350713, -512889, -92980, 37919, -174758, -398162, -361226, -633708, -412096, -340232, -342029, -249004, -646448, -571284, -511967, -570201, -521164, -559476, -785484, -917192, -660253, -556150, -377420, -185179, -207398, -48849, 466154, 190351, -107859, -368306, -236661, 289254, 417359, 134443, -54065, -287587, -385274, -243878, -360764, -390451, -470207, -627800, -355707, 194018, 406515, 355539, 232228, -40248, -288552, -413392, -580409, -333944, 102133, 646772, 643134, 354040, 178222, -129799, -16307, -527545, -811571, -215712, 227800, 56998, 282286, 316165, 10696, -4302, -191822, -563875, -237672, -40494, -110676, 80664, -107692]
15273a07692n8066R2093P6064M14629L20516j32681o55701j27248l827Q3424J86728
15262H8239L05076j1928O3914l25394l70110p2891l85273K72843K60820K79533
15252A04829J42457m8942j62444J85658M7192l48024r9321M34085o3788n5062
15242A36640j7730Q0841J88383k11820n11762L10172j32049J94286K20610P6116
15232C33687k3346j83996o40775k49405M38177j54452N0233M13041j24556k21080
15222c62472m9908M06830J64889J23148J51139r5307j85966j12835p7820K62935
15212B24633j57285p5070o9604j08427o6416j84405k40212L39579K04162K23423
15202I0378L9824k61616l18141j73733K96118o2111K29545M09703p7054o1875
$$ y = [-107692, -165758, -73665, 2399, 417028, 737544, 604863, -50838, -178086, -181913, -98489, 88239, 393315, 381387, 445301, 119907, -250203, -323094, -708367, -435524, -174704, 104829, 247286, 198344, 35900, 221558, 268750, -79274, -178595, 255490, 191702, 136640, 118910, 199751, 388134, 176314, -335448, -25276, -157325, 36961, 257571, 333687, 310341, 126345, -514430, -763835, -325658, -480110, -429877, -16836, -141392, -362472, -412380, -5550, 159339, 282487, 433626, 338319, 152353, 39518, -38302, 224633, 67348, -7722, -77326, -185753, -252169, -436574, -676786, -337207, -133045, 90378, 130202, -131414, -449555, -623288, -327170, -389281, -159736, 249967, 172913, 111038]
15192A11038k15763k39575K25323l59001l49205P4420P1292j44098M12431m6649
15182d59787j3114L4907k25221k73475L87647O54110n7706m17927m4064n7449
15172d72079m908J46591p9718l17913k02822L58351m2203Q2923J12177L07235
15162a12366j54353J4776m34670J19659p1511Q2484j1601k77687K0129M13928
15152d11212L41559J86907K59034m5797j50164K41380Q2843m90435R4543L10236
15142D18894p4580j43960j36247l30083L00334o8918n27283k56371J81434Q0168
15132e56612L2808m4179J27593j12747m99131j83082J69506J79638K62573N3768
15122e69865J65862K24063l75243J79893K21635o408J40918p0948l57518r0641
$$ y = [111038, -104725, -344300, -118977, -477978, -827183, -752763, -681471, -825569, -413138, -459787, -472901, -437994, -663215, -936690, -549043, 105067, 47361, -370566, -414630, -472079, -476987, -330396, -410114, -728027, -930849, -572498, -614701, -531778, -419601, -112366, -266719, -251943, -686613, -566954, -638465, -555981, -567582, -845269, -825140, -411212, -69653, 117254, 376288, 330491, 180327, 421707, 504550, 14115, 108658, 418894, 344314, 200354, 64107, -265976, 34358, -34560, -561843, -818214, -636780, -556612, -523804, -567983, -440390, -553137, -1052268, -1235350, -1065844, -886206, -623633, -569865, -404003, -179940, -555183, -375290, -153655, -160063, -19145, -90093, -447611, -538252]
15112e38252L84810Q3924l4986L39131K29662k84532j65497o3931R656K80844
15102B40829J40620M630J05859n615k40577l63768p9008J49242O7763k66861j17415
15091c64301Q1725r7493o7919N01891M15332l44184j66400J05960k13989j01750
15081b51128K33467j81559k43048L85589J39407J4707m41333p2457J55810K11033
15071d9512L90907J79554k13035k0636k66312J09402M32777J99595k67926j20209
15061C74605j04625k7126k30828m84982l07868J72682J17144L55402j08578L13123
15051F8949l98081k35581j88287j74438J85669J11274K71368j24817M65045Q0423
15041F1524l13294m73711q3092r0229M38977K77754N3126j04736j94040n30460
$$ y = [-538252, -153442, -69518, -104504, 234627, 464289, 179757, 14260, -49671, -40015, 240829, 381449, 386079, 491938, 486323, 245746, -118022, -197030, -47788, 19975, -246886, -364301, -282576, -380069, -447988, 53903, 469235, 125051, -41349, 64611, -149378, -251128, -17661, -199220, -442268, -56679, 82728, 97435, -343898, -416355, -260545, -49512, 341395, 520949, 307914, 287278, 20966, 130368, 563145, 762740, 494814, 374605, 269980, 242854, 12026, -472956, -780824, -608142, -490998, -135596, -244174, 68949, -329132, -564713, -753000, -927438, -741769, -630495, -359127, -483944, -18899, 61524, -251770, -725481, -808573, -898802, -459825, -182071, -128945, -233681, -427721, -958181]
15031i58181l8687M37721M21978r0081K41721p0818J02382k27007m31371L07458
15021c04885L188m14424k26274N1199M92128L72012J94801k8840j095k40804k244
15010a05238J59142k81508l97290J43818l82750k58843L86456L78207M07949M37239
15000D87182J50144k64967o33396k89074L31128Q1974k2173J15714L30307K7538
14990C14377k60297k51143J2612J55876K03137k21606n81407k93395K73980L18746
14980c29120L6522M36666Q457m17617l22982L16660L57301n4892l49785m9831
14970c68621n2491N136n4046K65637L74381j89790l02533J77174k30967j36395
14960e12515J88053R7084k6297K2641L03127l76984l80619J87159K27119K41481
$$ y = [-958181, -996868, -559147, -137169, -227250, 14471, -56347, 46035, -180972, -612343, -304885, -301697, -716121, -942395, -891196, -399068, -27056, 167745, 138905, 137810, -102994, -105238, 53904, -227604, -624894, -481076, -863826, -1122669, -736213, -358006, 49943, 487182, 637326, 372359, -261037, -550111, -218983, -137009, -159182, -43468, 286839, 314377, 54080, -197063, -184451, -28575, 174562, -47044, -628451, -921846, -647866, -329120, -292598, 144068, 152525, -265092, -588074, -271414, 85887, 30995, -318790, -368621, -421112, -415976, -470022, -204385, 169996, -19794, -322327, -145153, -376120, -512515, -324462, -227378, -253675, -231034, 72093, -304891, -685510, -498351, -271232, -29751]
14950b9751J72940J5050m65615l50323k0984j31033k13202Q2210M47520M10431
14940h2757j44709K03365J77447r5568J92213j84009k81633R9308l42116l0540
14930d88999J98969K49588J93507J07878k99759l13033l26648N63623L87601K66144
14920E38871K02520J25630m75420o05253o04484r2776L45388M62466M17960R2936
14910D07838L79298J12756j83091o30556n09347M35288j15046o4778O3789j33643
14900b37492j15400O99551K14226l48329R1746j04492j84864k78402P9451N70266
14890C86261o81414o84688K3811M70733M21375O50359k59336p80006j95963K09420
14880d39448k6831J4681N25k61704m34154j6256K84905P6115K19408o939L33916
$$ y = [-29751, 143189, 158239, -307376, -657699, -678683, -809716, -1022918, -940708, -493188, -82757, -227466, -24101, 153346, 57778, 249991, 65982, -215651, -116343, -458459, -488999, -290030, -40442, 153065, 260943, -38816, -351849, -678497, -114874, 272727, 538871, 741391, 867021, 391601, -213652, -818136, -910912, -565524, -103058, 314902, 407838, 787136, 899892, 716801, 86245, -423102, 12186, -102860, -167638, -103849, -237492, -352892, 346659, 560885, 212556, 304302, 199810, 14946, -263456, -184005, 386261, -295153, -979841, -956030, -485297, -63922, 586437, 327101, -452905, -648868, -439448, -466279, -451598, -451073, -712777, -1146931, -1163187, -878282, -802167, -582759, -589698, -255782]
14869b55782P929K36813J46084l27260K8697K7983J98600R4713j44355q1880r8094
14858a66552m2555Q4173n7329O9096k46101P1055K12634k773l7712k93839j46758
14847e56661k3961M505K02585l855J97222M32203m21195j96244m3654p8617N2735
14836d34937K06036L86783K23525J02517j40179K01612j67877j51798P5415k67897
14826C3200p4564J27313N1631m9807K00006L5447J010k05438j45749K47190k67787
14815d7548j33711R1112q3581k22397O8808L16309j36354J52549M33845J12318
14805E51350K1882j64153j6379l3876k39127k14802J27528L5299O498k04530j29048
14794b59358J03964O18890P7873J53834K73580P6632K222m74842l31037q4504
$$ y = [-255782, -247853, -11040, 135044, -192216, -163519, -135536, 63064, 157777, 13422, -68458, -166552, -209107, -124934, -182263, -113167, -359268, -288213, -75579, -78352, -116064, -409903, -556661, -580622, -576117, -373532, -377387, -180165, 252038, -169157, -365401, -409055, -487672, -434937, -228901, 157882, 381407, 483924, 343745, 545357, 377480, 225682, 301097, 33200, -41364, 85949, 137580, 87773, 287779, 323226, 324236, 118798, -26951, 220239, -47548, -181259, -90147, -173728, -396125, -327317, -11008, -147362, 5187, 439032, 551350, 573232, 409079, 392700, 358824, 119697, -95105, 32423, 67722, 74220, -130310, -259358, -155394, 463496, 541369, 695203, 968783, 1045415, 1047637, 572795, 241758, 157254]
14784A57254o438l31743k33341j11253J88750R9566n96K04354l96958k69194j69212
14773h68811j63796K76744M78380J79872K44835N98007o6596l69721n31236n24641
14763g46963j30867k35236M67797O94898K16618O1043r4845j93729m06308n591
14753c73183j47951l2475k69826j09229O60416J43367j91387K15982N21113J17551
14743E34378k2713j61486o8725r1609m75332P1573r0233L13330k58052m2365r5632
14732c86866K96095K52546o303j38928m01204l23388O5392j46956L68294J07362
14722c13956n15880k18317K74982L65358K15477J47451J71865K3986m79212q6665
14712d14911J06554j97462j40851n6227K70644j3489q9208m1006J40771K44308
$$ y = [157254, 150816, -180927, -414268, -525521, -336771, -237205, -237801, -33447, -430405, -699599, -868811, -1032607, -755863, -277483, -97611, 147224, 745231, 678635, 308914, -222322, -746963, -877830, -1113066, -645269, 49629, 266247, 327290, 232445, 38716, -367592, -373183, -521134, -553609, -823435, -932664, -272248, -128881, -320268, -104286, 416827, 534378, 511665, 350179, 281454, 189845, -285487, -213914, -304147, 9183, -248869, -291234, -386866, -90771, 161775, 155472, 16544, -384660, -708048, -642656, -789612, -421318, -313956, -829836, -1048153, -773171, -407813, -192336, -44885, 126980, 150966, -328246, -414911, -308357, -505819, -646670, -702897, -432253, -445742, -534950, -575956, -435185, -190877]
14702a90877j89025j11975K21554J75199k97704k59337J48493J34763K10690J73086
14692A4867j62910L366j21690J59149q2272R4506L44634J56689m74343k04234
14682b72238J99926j52377J37631L78971l39529l77282k12594L02718J64705J10987
14672e9082O2902j90477q9319L2377r4861L02347M15203O6110l70945k69486o14474
14661h09705j12188O52120Q21254M0442n62999r4222o7655o4016j64705J02079
14651b59595L26893j60190j27079j5764M17228r4729l78269j69403M53097j1494
14641a9305k23638l55658j54418K99694q3905M9517J63113l13998K26708J1716
14631d00174L25542K57267n10542o12333N93500J78172J15708K53896J99289K4234
$$ y = [-190877, -379902, -491877, -270323, -95124, -392828, -652165, -503672, -368909, -158219, 14867, -148043, -144677, -266367, -107218, -189490, -94984, 249650, 406339, -68004, -272238, -72312, -224689, -87058, 291913, -47616, -424898, -637492, -334774, -170069, -59082, 3820, -186657, -275976, -243599, -338460, -36113, 379090, 445200, 74255, -195231, -809705, -921893, -269773, 551481, 591923, 28924, -65298, -132953, -196969, -361674, -259595, 67298, -92892, -219971, -235735, 181493, 86764, -291505, -460908, -7811, -19305, -242943, -598601, -753019, -453325, -537230, -487713, -324600, -638598, -411890, -400174, -74632, 182635, -327907, -940240, -346740, -168568, -52860, 201036, 400325, 424559]
14621D24559k94938l62426L0650J07245K01243n8823P8742k44311k71104J62473
14611b26690L80114N2307j98605K52438o3028l1992l4527k18513K6709k7776M8506
14600d1057j94604K23402O39607J57495K7326k93576l29937R668J57187N79289
14590I34800j95500j37761l32482l12095K2969L98267l1423l12256k66500j74398
14580d06379q2573j33544J53030L91536J73908P4877R789J47859K1823j1721j05587
14569B33018q0844K6930M5329j26240J82634j03830M13419k38561n66906l44769
14559e59820L9446M92188J96798N08180L38660k27513j19225l85613m19591L7907
14549i8583J62238m33602k8891L63184K46521l88121m87790Q7966M01609J72480
$$ y = [424559, 129621, -232805, -202155, -94910, 106333, 47510, 126252, -118059, -389163, -226690, 153424, 205731, 7126, 259564, 196536, 164544, 130017, -88496, -61787, -89563, -41057, -235661, -12259, 627348, 784843, 812169, 518593, 188656, 198324, 355511, 934800, 739300, 601539, 269057, -43038, -20069, 378198, 346775, 34519, -231981, -406379, -488952, -622496, -469466, -77930, 95978, 170855, 180644, 328503, 350326, 338605, 233018, 152174, 179104, 224433, 98193, 280827, 176997, 590416, 351855, -215051, -559820, -520374, -28186, 168612, 676792, 1015452, 787939, 668714, 283101, -136490, -98583, 63655, -369947, -398838, -35654, 210867, -177254, -665044, -577078, -175469, -2989]
14539b989J1904n43988p9234O7511M13641M06111J26474J61687n9235k56431k60319
14528a4868k27528j57022L45560J33863J57043m8772J17410J85359O7280m8471
14518E09854o20690P1117o695o2184J53275J5663m82808M03275L87722J48653
14508E17182L7442l73607k74497J97260J25586q7574l7601K75291R6980L34937
14498H11399l38381l33863J8024J78862J21935k64460n16337j45378m39857o702
14488i14758K58111N05138N7383P2196m5045l39189l76964k79578L55856O24622
14478h2228j68235j98481K76212k4372L08793k05988k76490j02630K36932P7008
14468a59479k74039l3549O3800J2970j26716P8675j28096K95061L04145K15523
$$ y = [-2989, 8915, -535073, -614307, -546796, -133155, 272956, 399430, 561117, 501882, 245451, -14868, -242396, -399418, -53858, 80005, 237048, 188276, 305686, 491045, 558325, 509854, -110836, -39719, -46414, -108598, 44677, 60340, -422468, -19193, 368529, 517182, 554624, 181017, -93480, 103780, 229366, 141792, 104191, 379482, 476462, 811399, 473018, 139155, 157179, 336041, 457976, 193516, -322821, -468199, -908056, -914758, -656647, -151509, -94126, -21930, -66975, -406164, -783128, -1062706, -706850, -82228, -250463, -448944, -172732, -197104, 111689, -94299, -370789, -473419, -236487, -159479, -433518, -467067, -403267, -390297, -517013, -438338, -566434, -271373, 32772, 248295]
14458B48295L32625n32609L1998Q0946O5285M4521o78489O0137k54968P3027K07801
14447c21431n2664q9375K50928Q9035M9217M1390o2225K87560K14589j03844r6956
14436B06224J87617M2565J87644N6932k50299n35208m69053l70031J93761J40165
14426f09683J05887M90214L42182P266J28021k40427n6525K28391k14417j28923
14416E1986J54587L36922K38878k5207j11009p6099n04785k93420M65749r451
14406B28151k83211J15976K70108j81157J07611N9613k7559J63172J01170k97666
14396B56208l92671M09419j31247j23234K84855J57162Q4315M8592o5017k57589
14386B70793j39351j11585K18569P5765k40493l1580j13071m53836j26444K20351
$$ y = [248295, 580920, 48311, 80309, 161255, 226540, 271061, -407428, -347291, -602259, -529232, -321431, -374095, -463470, -212542, -123507, -74290, -32900, -95125, 192435, 407024, 303180, 206224, 393841, 436406, 624050, 680982, 430683, -104525, -573578, -943609, -749848, -609683, -503796, -13582, 328600, 335866, 463887, 223460, 166935, 395326, 180909, 51986, 206573, 543495, 782373, 757166, 646157, 570058, 65273, -228147, 237602, 228151, -55060, 60916, 331024, 149867, 257478, 317091, 289532, 452704, 553874, 256208, -136463, 272956, 141709, 18475, 303330, 460492, 544807, 593399, 528382, 270793, 131442, 19857, 238426, 314191, 73698, 42118, -70953, -524789, -651233, -430882]
14376d30882N15119L59617j89946K45399j77939m17048M899k64504m1897J1746
14366c85436J56162q9114k72919L64427J51079k91762l3154k27372k69815L2615
14356h65289J03362j27M54442J83471P9791m18086j66095K47203J55099M9197
14346a77032J77034k94324J78682l1129M41357O1008j7439m57760j20198L25444
14336H5643J27727o1562k03975p1916M75471J48038l66205O3508K39538L4831
14326D71098l01484l85596j76469J52920j76617k5550J07839n26774J86286o2753
14316g37100J80788j20997J58177M04679L96154j96946Q334J3534r5812j16372
14306a05561l07522N82424L53738K2069J84244r0790j15731m9116P6761j01043
$$ y = [-430882, 84237, 443854, 253908, 499307, 321368, -95680, -90781, -355285, -397182, -385436, -229274, -318388, -591307, -226880, -75801, -367563, -400717, -628089, -897904, -865289, -761927, -762054, -307612, -124141, -44350, -462436, -628531, -381328, -226229, -177032, 2, -294322, -115640, -146769, 294588, 355596, 338157, -119603, -239801, 85643, 213370, 151808, -52167, -124083, 351388, 499426, 133221, 196729, 436267, 471098, 169614, -215982, -392451, -239531, -416148, -441698, -333859, -860633, -674347, -737100, -556312, -677309, -519132, -114453, 281701, 84755, 93089, 106623, 10811, -105561, -413083, 169341, 523079, 545148, 729392, 638602, 522871, 473755, 550516, 449473]
14296D49473j74040j12351j87629l62873j87103m04819L77172K65654R851K94348
14286c2317J10258K40369J13878k96622k21737J32736q4289k58421j78910J21179
14276c53876K62565l49929k14718j50722J64687K46006q5985k62713j06094n0026
14266i00805L03137L43816Q0409p000j60577r2601l5463J24733J42714K33724
14256C2087L09165l75463j48523N54232j93994l8690J78869j95887m26686L08995
14246D105J29004k17046j266k23303J11231O6988k63041l39074o0901J74853N3499
14235e64951P3702J01184l3933q0995J24447K15850R0801o9395k81806R3958M83253
14224A52115P2343j57586j94748l75967j68302J69951K23709K14659M52023j29930
$$ y = [449473, 275433, 163082, -24547, -387420, -574523, -979342, -602170, -336516, -326665, -32317, 77941, 318310, 432188, 135566, -86171, 46565, -37724, -296145, -475055, -353876, -91311, -441240, -655958, -806680, -641993, -395987, -481972, -744685, -850779, -900805, -597668, -253852, -173443, -180443, -341020, -433621, -469084, -344351, -201637, 32087, 341252, -34211, -182734, 371498, 177504, 138814, 317683, 121796, -304890, 4105, 133109, -83937, -85203, -308506, -197275, -130287, -393328, -732402, -793303, -618450, -564951, -491249, -390065, -423998, -504993, -380546, -164696, -73895, -143290, -425096, -331138, 152115, 224458, 66872, -127876, -503843, -672145, -502194, -278485, -63826, 388197, 258267]
14214B58267o01800k86804N0608k10013R8841M74806M78828M0232m02294j95729
14204b95058O4780j21855j15003j0030O2560J29318k95210N0267N97234J98307
14194B65310j70730J47871k68817l18274k08457k04280O0368O61820K00592k23850
14184e8447l34524K96865M90059k76937l01246q4769K524k61278K27933J73909
14174a25911n6429o43326O91185J82113j81014p8233m9994q0327Q9301l916j68927
14163d25478J79489J03909K32643L95243J61893p4326r2603J72426j93971P1998
14153E31223l6566k06539K52023j66519k13261J33287R5193r0634K95962j21501
14143D72668j85128m2320m40660j93466N4224M53708L37475K95184l66067O0810
$$ y = [258267, -343533, -630337, -579729, -789742, -690901, -216095, 262733, 302965, -99329, -295058, -230278, -352133, -467136, -477166, -414606, -285288, -580498, -530231, 67003, 265310, 94580, 242451, -26366, -344640, -553097, -757377, -697009, -35189, 165403, -58447, -392971, -96106, 393953, 117016, -184230, -268999, -266475, -527753, -299820, -125911, -182340, -825666, -134481, 47632, -133382, -211615, -261609, -341936, -252635, -256551, -425478, -245989, -142080, 90563, 485806, 647699, 573373, 480770, 653196, 459225, 531223, 494657, 288118, 540141, 373622, 160361, 293648, 388841, 298207, 594169, 472668, 287540, 245220, -195440, -388906, -334682, 119026, 456501, 751685, 385618, 446428]
14133D46428j20508j88932K16150J82621n8074k98018J01931L77614m37679n26081
14123c04548r981J32342O19272L188n5915k99796L33818j11781k11143r624j56552
14112g0720M455j19884q2934l3535j30054j90913K49004l8992k89525O43563o6302
14101a25837Q9730M16439K18520q8730l26765j66611J99186K03299J48303L2861
14091F00395r1974m16282l47813Q0892M00463R6869l58646k49576M572r8541R3012
14080b86629p4932J01153k51060j33456M55307Q7920l48010J27901r9212J75975
14070b45043q8475j57435o8304M85000j89914o49539K16437K45809j83309L33952
14060c00821L39591j3039j36420j22236j32678N2881k61264N14800R9680r789
$$ y = [446428, 325920, 136988, 353138, 535759, 477685, 179667, 281598, 659212, 221533, -304548, -314529, -182187, 437085, 440273, 384358, 84562, 418380, 306599, 95456, 85832, -70720, -66265, -186149, -269083, -302618, -432672, -623585, -374581, -413573, -703098, -59535, -125837, -36107, 380332, 598852, 510122, 183357, 16746, 215932, 419231, 567534, 600395, 508421, 92139, -255674, -174782, 225681, 322550, -36096, -285672, -281100, -379641, -286629, -361561, -260408, -511468, -644924, -189617, -101697, -449707, -321806, -421018, -245043, -333518, -490953, -559257, -74257, -264171, -913710, -697273, -451464, -634773, -300821, 38770, 25731, -110689, -232925, -365603, -312722, -573986, -59186, 40494, 30705]
14050C0705r6884o3682q4435m8698L11488L47568j19206k38744k37005M75086
14040B76193L40107r7045m96456l31176M3578L10262m37876j33672M60264L03837
14030B38016P1000k42440K219K93841j15007k76325J66297j99106M1415K03595
14020A83505j03167r9836k56155J44496J12956o2394N36854j28503j50318j52014
14010B5424k56788L43686o4q2124l39659K55075J85059k14892j29813k35557j10429
13999e60082J72865J23032j45606L33251J16929K12199j58913j21126m6401o12854
13989f86706m66810k86376K10003M85471J19065O1059P7718J93300j58402J35185
13979c16493L98894O95850M99175l08248l63935l19452l62828j73168m9833m03806
$$ y = [30705, -66179, -129861, -214296, -262994, 48494, 396062, 276856, 38112, -198893, 276193, 616300, 519255, 22799, -308377, -264799, 45463, -392413, -526085, -65821, 238016, 309016, 66576, 68795, 362636, 247629, -28696, 137601, -61505, -20090, 183505, 80338, -19498, -275653, -131157, -18201, -80595, 456259, 327756, 177438, 25424, -231364, 112322, 112258, 30134, -309525, -54450, 130609, -84283, -214096, -449653, -560082, -387217, -264185, -409791, -76540, 40389, 252588, 93675, -27451, -73852, -686706, -1153516, -1439892, -1229889, -744418, -625353, -564294, -486576, -293276, -451678, -316493, 82401, 778251, 1277426, 969178, 605243, 285791, -77037, -250205, -300038, -703844]
13969g03844m56138n1619N12888J85050q0012L27950N77921J17307l9979j31983
13959B57541j58409L2299j83131o4891k18470l6574k05197J83060P5472l28947
13949f47247L92293k5998O3993K32136r2992m08256Q4235L91467L32122J7062
13939C38815k05913k04436K53341J17074j38896J01211q8120J02503o0160k26833
13929a1414n0241N336M1634j63588j35730m74003m4136K00681M7426L14228k28031
13918d97838J69199K5094k90377j7988J36566J621j39481K3605N2124K47733j81461
13907d71203k81093k09256J27476P04930L45267r7042r2801n58310k33184k14965
13897i80181m35568M93024O20843L54641R4815Q474l7365J31029k31120N397j80592
$$ y = [-703844, -1159982, -1211601, -698713, -513663, -593675, -265725, 312196, 429503, 389524, 257541, 99132, 131431, -51700, -116591, -335061, -371635, -576832, -393772, -318300, -647247, -254954, -280952, -216959, 15177, -77815, -486071, -401836, -10369, 321753, 338815, 132902, -71534, 181807, 298881, 159985, 261196, 173076, 275579, 215419, -11414, -61655, -56319, -14685, -178273, -314003, -788006, -832142, -631461, -584035, -269807, -497838, -328639, -303545, -593922, -611910, -475344, -473723, -613204, -589599, -537475, -289742, -471203, -752296, -961552, -834076, -129146, 216121, 119079, 26278, -532032, -765216, -980181, -1415749, -922725, -301882, 52759, 147574, 156048, 118683, 249712, 18592, 23989, -156603]
13886a56603j03400j26522K55399L0777K89210j44618k51668j26091j05921O4821
13876c74616Q4933j51120P1061K36014l23670J34069L70107j34447l64160j67843
13866f19672l05531K0596L30685L67976P0599O6391p3783R849k32231j01064m2976
13855e09161O6824L77148k52158p93l20377k04595J18437O15849o7572n81954
13845g58352L09204J62280J62171k2514m25919j98045j15692L00166M41987L21678
13835A76964J36940j74774j43373j36981j17625J01936K55766K59496l52299j40216
$$ y = [-156603, -260003, -386525, -131126, -100349, 188861, 44243, -207425, -333516, -439437, -374616, -289683, -440803, -369742, -133728, -457398, -323329, 46778, -87669, -451829, -619672, -925203, -904607, -573922, -205946, -135347, -68956, -142739, -132890, -365121, -466185, -509161, -442337, -65189, -317347, -318140, -638517, -843112, -724675, -108826, -176398, -758352, -449148, -286868, -124697, -147211, -573130, -771175, -886867, -586701, -144714, 176964, 313904, 139130, -4243, -141224, -258849, -156913, 98853, 358349, 6050, -134166]
$$ [...]
##END NTUPLES=NMR SPECTRUM
##END=
