##TITLE=Analysis number 320089
Compound Code mo 07029
Project Code adrs
Chemist Name spectrum
##JCAMPDX= 6.0         $$ Bruker NMR JCAMP-DX V2.0
##DATA TYPE= NMR SPECTRUM
##DATA CLASS= NTUPLES
##ORIGIN= Bruker BioSpin GmbH
##OWNER= nmr
$$ XWIN-NMR		Version 3.5
$$ Tue Jun 13 09:41:58 2006 GMT Daylight Time (UT+1h)  MAYBRIDGE\nmr@NMR_250MHZ
##.OBSERVE FREQUENCY= 250.131544655141
##.OBSERVE NUCLEUS= ^1H
##.ACQUISITION MODE= SIMULTANEOUS (DQD)
##.ACQUISITION SCHEME= undefined
##.AVERAGES= 16
##.DIGITISER RES= 18
##SPECTROMETER/DATA SYSTEM= dpx250
##.PULSE SEQUENCE= zg30
##.SOLVENT NAME= DMSO
##.SHIFT REFERENCE= (INTERNAL, DMSO, 0, 16.522)
##AUDIT TRAIL= $$ (NUMBER, WHEN, WHO, WHERE, WHAT)
$$ ##TITLE= Audit trail, XWIN-NMR		Version 3.5
$$ ##JCAMPDX= 5.01
$$ ##ORIGIN= Bruker BioSpin GmbH
$$ ##OWNER= nmr
$$ C:\u/data/dgb/nmr/ADRS/610/pdata/1/auditp.txt
$$ ##AUDIT TRAIL=  $$ (NUMBER, WHEN, WHO, WHERE, WHAT)
(   1,<2006-06-13 09:40:58.90 +100>,<MAYBRIDGE\nmr>,<NMR_250MHZ>,
      <created by zg, POWCHK disabled, PULCHK disabled
       configuration hash MD5:
       E2 DF 36 D8 04 B2 41 60 5A D7 A3 38 5A 4B D0 FE
       data hash MD5: 64K
       FB 77 EC 32 20 EC 31 8D D4 A6 6F 27 0B 02 AE 5B>)
(   2,<2006-06-13 09:41:21.93 +100>,<MAYBRIDGE\nmr>,<NMR_250MHZ>,
      <Start of raw data processing
       ef LB = 0.3 FT_mod = 6 PKNL = 1 SI = 32K 
       data hash MD5: 32K
       5A 67 AA C9 F3 95 89 25 D7 E0 D9 64 A1 1A A7 56>)
(   3,<2006-06-13 09:41:26.33 +100>,<MAYBRIDGE\nmr>,<NMR_250MHZ>,
      <apk 
       data hash MD5: 32K
       FA 2B 40 73 59 A4 6A B0 21 61 43 24 07 38 1B 8F>)
(   4,<2006-06-13 09:41:28.08 +100>,<MAYBRIDGE\nmr>,<NMR_250MHZ>,
      <abs ABSG = 5 
       data hash MD5: 32K
       4C 09 F1 AE A2 72 12 D1 52 4F 0B 56 38 03 2E 30>)
$$ ##END=
$$ 
$$ hash MD5
$$ FA 80 80 18 CE F7 BF C7 16 D9 AC 03 2F 7A CA 2E
##$RELAX= 
##$RELAX= 
##$RELAX= 
##$RELAX= 
##$RELAX= 
##$RELAX= 
##$RELAX= 
$$ Bruker specific parameters
$$ --------------------------
##$DU= <C:\u>
##$EXPNO= 610
##$NAME= <ADRS>
##$PROCNO= 1
##$TYPE= <nmr>
##$USER= <dgb>
##$AMP= (0..31)
100 100 100 100 100 100 100 100 100 100 100 100 100 100 100 100 100 100 
100 100 100 100 100 100 100 100 100 100 100 100 100 100 
##$AQSEQ= 0
##$AQ_mod= 3
##$AUNM= <au_zg>
##$AUTOPOS= <7 >
##$BF1= 250.13
##$BF2= 250.13
##$BF3= 250.13
##$BF4= 250.13
##$BF5= 500.13
##$BF6= 500.13
##$BF7= 500.13
##$BF8= 500.13
##$BYTORDA= 1
##$CFDGTYP= 0
##$CFRGTYP= 5
##$CHEMSTR= <none>
##$CNST= (0..31)
1 1 145 1 1 1 1 1 1 1 1 1 1 1 1 1 1 1 1 1 1 1 1 1 1 1 1 1 1 1 1 1 
##$CPDPRG= <>
##$CPDPRG1= <>
##$CPDPRG2= <>
##$CPDPRG3= <>
##$CPDPRG4= <mlev>
##$CPDPRG5= <mlev>
##$CPDPRG6= <mlev>
##$CPDPRG7= <mlev>
##$CPDPRG8= <mlev>
##$CPDPRGB= <>
##$CPDPRGT= <>
##$D= (0..31)
0 1 0 0 0 0 0 0 0 0.06 0 0 0 0 0 0 0.0002 0 0 0 0 0 0 0 0 0 0 0 0 0 0 
0 
##$DATE= 1150188056
##$DBL= (0..7)
120 120 120 120 120 120 120 120 
##$DBP= (0..7)
150 150 150 150 150 150 150 150 
##$DBP07= 0
##$DBPNAM0= <>
##$DBPNAM1= <>
##$DBPNAM2= <>
##$DBPNAM3= <>
$$ [...]
##$SUBNAM7= <"">
##$SUBNAM8= <"">
##$SUBNAM9= <"">
##$SW= 20.6930455092707
##$SWIBOX= (0..15)
0 0 3 0 0 0 0 0 0 0 0 0 0 0 0 0 
##$SW_h= 5175.983436853
##$TD= 65536
##$TD0= 1
##$TE= 295.16
##$TE2= 300
##$TE3= 300
##$TEG= 300
##$TL= (0..7)
0 120 120 120 120 120 120 120 
##$TP= (0..7)
150 150 150 150 150 150 150 150 
##$TP07= 0
##$TPNAME0= <>
##$TPNAME1= <>
##$TPNAME2= <>
##$TPNAME3= <>
##$TPNAME4= <>
##$TPNAME5= <>
##$TPNAME6= <>
##$TPNAME7= <>
##$TPOAL= (0..7)
0.5 0.5 0.5 0.5 0.5 0.5 0.5 0.5 
##$TPOFFS= (0..7)
0 0 0 0 0 0 0 0 
##$TUNHIN= 0
##$TUNHOUT= 0
##$TUNXOUT= 0
##$USERA1= <user>
##$USERA2= <user>
##$USERA3= <user>
##$USERA4= <user>
##$USERA5= <user>
##$V9= 5
##$VALIST= <valist>
##$VCLIST= <CCCCCCCCCCCCCCC>
##$VD= 0
##$VDLIST= <DDDDDDDDDDDDDDD>
##$VPLIST= <PPPPPPPPPPPPPPP>
##$VTLIST= <TTTTTTTTTTTTTTT>
##$WBST= 1024
##$WBSW= 4
##$XGAIN= (0..3)
0 0 0 0 
##$XL= 0
##$YL= 0
##$YMAX_a= 376161
##$YMIN_a= -461427
##$ZGOPTNS= <>
##$ZL1= 120
##$ZL2= 120
##$ZL3= 120
##$ZL4= 120
##$ABSF1= 16.522
##$ABSF2= -4.171173
##$ABSG= 5
##$ABSL= 3
##$ALPHA= 0
##$AQORDER= 0
##$ASSFAC= 0
##$ASSFACI= 0
##$ASSFACX= 0
##$ASSWID= 0
##$AUNMP= <proc_1d>
##$AZFE= 0.1
##$AZFW= 0.1
##$BCFW= 0
##$BC_mod= 0
##$BYTORDP= 0
##$COROFFS= 0
##$CY= 12.5
##$DATMOD= 1
##$DC= 0
##$DFILT= <>
##$DTYPP= 0
##$F1P= 14.0000005364418
##$F2P= -0.99999901652339
##$FCOR= 0.5
##$FTSIZE= 32768
##$FT_mod= 6
##$GAMMA= 0
##$GB= 0
##$INTBC= 1
##$INTSCL= 1
##$ISEN= 128
##$LB= 0.3
##$LEV0= 0
##$LPBIN= 0
##$MAXI= 10000
##$MC2= 0
##$MEAN= 0
##$ME_mod= 0
##$MI= 0
##$NCOEF= 0
##$NC_proc= -6
##$NLEV= 6
##$NOISF1= 0
##$NOISF2= 0
##$NSP= 0
##$NTH_PI= 0
##$NZP= 0
##$OFFSET= 16.522
##$PC= 1
##$PHC0= 164.5843
##$PHC1= 1.526938
##$PH_mod= 1
##$PKNL= yes
##$PPARMOD= 0
##$PSCAL= 4
##$PSIGN= 0
##$REVERSE= no
##$SF= 250.13
##$SI= 32768
##$SIGF1= 0
##$SIGF2= 0
##$SINO= 400
##$SIOLD= 32768
##$SREGLST= <1H.DMSO>
##$SSB= 0
##$STSI= 32768
##$STSR= 0
##$SW_p= 5175.98343685301
##$SYMM= 0
##$S_DEV= 0
##$TDeff= 65536
##$TDoff= 0
##$TI= <Analysis number 999999
Compound Code 99
Book Reference 9
Project Code 9>
##$TILT= no
##$TM1= 0
##$TM2= 0
##$TOPLEV= 0
##$USERP1= <user>
##$USERP2= <user>
##$USERP3= <user>
##$USERP4= <user>
##$USERP5= <user>
##$WDW= 1
##$XDIM= 32768
##$YMAX_p= 517063169
##$YMIN_p= -1419427
$$ End of Bruker specific parameters
$$ ---------------------------------
##NTUPLES= NMR SPECTRUM
##VAR_NAME=  FREQUENCY,     SPECTRUM/REAL,   SPECTRUM/IMAG
##SYMBOL=    X,             R,               I
##VAR_TYPE=  INDEPENDENT,   DEPENDENT,       DEPENDENT
##VAR_FORM=  AFFN,          ASDF,            ASDF
##VAR_DIM=   32768,         32768,           32768
##UNITS=     HZ,            ARBITRARY UNITS, ARBITRARY UNITS
##FACTOR=    0.157963299565203, 1,           1
##FIRST=     4132.6476996994, 0,             0
##LAST=      -1043.33573715361, 0,           0
##MIN=       -1043.33573715361, -1419427,    0
##MAX=       4132.6476996994, 517063169,     0
$$ Real data points
##PAGE= N=1
##DATA TABLE= (X++(R..R)), XYDATA
$$ [...]
16877A34032J63423K47658j96104l15433j48623n0376J19036q3154q1191K63162
16867E2430n8112J27882l7514j81577J692J8083k29523J11466J44232J69793n6778
16856F2074J07416m5558l9449P9296l0343n2916j79826j40584P6239J24418Q6393
16845D7160r4348K2974L93811k39087k44965j72718j13349K88391L75140J49383
16835D12392Q0078l72149k12198J37287N2622j55684l06385J64629j14778K4311
16825b89875K69191Q6982k0776M7040j99210j5794R8214J27832Q4712o1211j22548
16814D557l2078m1499K772l17801j58660K5115L54431M51321l3573j08324m95057
16803c48796l27927J188L22873L03618K53974p2872r4324k31070J20630O5487
$$ plain form
16877 134032 297455 545113 349009 33576 -115047 -165423 -46387 -129541 -210732 52430
16867 52430 -5682 122200 84686 -96891 -95199 -77116 -306639 -195173 -50941 118852 62074
16856 62074 169490 123932 84483 163779 133436 80520 -99306 -239890 -163651 -39233 47160
16845 47160 -47188 -24214 369597 130510 -114455 -287173 -400522 -112131 263009 412392
16835 412392 492470 120321 -91877 45410 98032 -57652 -364037 -199408 -314186 -289875
16825 -289875 -20684 66298 45522 92562 -106648 -122442 -24228 103604 188316 127105 4557
16814 4557 -27521 -69020 -66248 -384049 -542709 -517594 -163163 288158 254585 146261 -348796
16803 -348796 -676723 -675535 -352662 -49044 204930 132058 37734 -193336 -72706 -7219
16793g219l2063R3918R1803R9084k48321L1574n2904R3939O4333l8980j388J93540
16781B87316j69254m5486M35565J61746k01273j08900m45977J28243R1892K10065
16771C43937L03190o3229j74367R1073l7243o8879J20868l32484k46966j4851
16761g8951l6326j186k32195J33949K6180O7274J30699K8519l27336k39141P3797
16750d54717j7860K21031J8056J23136M5635N6635p8049R847j00262p1814k17131
16739d65493J39224K2307J62403j01208p6506K79575k17847L2336p6464N3629
16729b48044j88454R0486n2219K11756K14741L4240m6885l32200M6569K39560
16719c0450R7846p1588j97261J9377J61931o3118j51528J56986J9407n2731j67771
$$ plain form
16793 -7219 -39282 54636 146439 245523 -2798 28776 -24128 69811 134144 95164 93776 287316
16781 287316 118062 72576 508141 669887 468614 359714 -86263 41980 133872 343937
16771 343937 647127 583898 409531 500604 463361 394482 515350 182866 -64100 -78951
16761 -78951 -115277 -116463 -348658 -214709 -188529 -121255 9444 37963 -289373 -528514 -454717
16750 -454717 -472577 -251546 -233490 -110354 -64719 -8084 -86133 -76286 -176548 -248362 -465493
16739 -465493 -326269 -303962 -141559 -242767 -319273 -39698 -257545 -225209 -301673 -248044
16729 -248044 -436498 -346012 -398231 -186475 28266 62506 15621 -316579 -270010 -30450
16719 -30450 67396 -4192 -201453 -182076 -20145 -83263 -234791 -77805 -58398 -111129 -278900
16708b78900n6713o7587l823J99343R8322j03358J39048R7878N7591j08520q9103
16697a15822n1352k4443l1571J68967J29571K4676R0082M7442L5991k41292k00804
16686a68555J29619K54410j51681L0006M8918o0278N7748m76828K3967K05813
16676a06861M5267O8411P347j75218k97665m09371Q1435L03981K12020J75378
16666i5276j29985l4079K86190K22779J2882j51844Q2250J90869k07198l42846
16656a66258K8186K92267j34512l89218J6617L8194j21508J76645k7490J83603
16646a03474R384k23116J09829p8253j02178J47959J41816R9001J02830J53711
16636B57509k4930j0546M1768K00921J56960J21325k87400l27875j47752l7863
$$ plain form
16708 -278900 -335613 -403200 -407023 -207680 -109358 -212716 -73668 24210 81801 -26719 -115822
16697 -115822 -167174 -191617 -223188 -54221 75350 100026 190108 237550 273541 32249 -168555
16686 -168555 -38936 215474 63793 93799 142717 82439 140187 -336641 -312674 -106861
16676 -106861 -61594 6817 14164 -161054 -458719 -868090 -786655 -482674 -270654 -95276
16666 -95276 -225261 -259340 26850 249629 262511 110667 192917 383786 176588 -166258
16656 -166258 -138072 154195 19683 -369535 -352918 -314724 -436232 -259587 -287077 -103474
16646 -103474 -94090 -317206 -207377 -285630 -387808 -239849 -98033 968 103798 257509
16636 257509 232579 222033 263801 464722 621682 743007 455607 127732 -20020 -57883
16626e7883k9622k98674J18950n5548k72839J60362J3068O5643L28186J26439
16616I8082j38502j07964J7168K14662k09444L5392j20497q8530q7872J52929
16606b34576J85941P0100J23319r2126j18738P2465j20029J6793L5439L9923M1891
16595B0402k15368j93814O5963L6110q716J4020K34287K43974O1804M44559k43
16584G02978k87035k27144P5381r5054m5044l19116k43559j24870J20399Q518
16574d34546J06829J39621N8395O0102N5577J56496J65316q6917j3121k08018
16564b66j11306O284j74872L3745J19010N3122j28383j64125j708K00703K35621
16553F7825q5871j30631K13141l01226k39149J79462K77101J60973Q747J66042
$$ plain form
16626 -57883 -87505 -386179 -267229 -322777 -595616 -435254 -422186 -356543 -28357 98082
16616 98082 -40420 -148384 -131216 83446 -125998 -90606 -211103 -299633 -387505 -234576
16606 -234576 -48635 21465 144784 52658 -66080 6385 -113644 -96851 -61412 -21489 20402
16595 20402 -194966 -388780 -322817 -286707 -295423 -281403 -47116 196858 258662 703221 702978
16584 702978 415943 188799 264180 169126 124082 -195034 -438593 -563463 -443064 -434546
16574 -434546 -327717 -188096 -129701 -69599 -14022 142474 307790 220873 207752 -266
16564 -266 -111572 -105288 -280160 -246415 -127405 -74283 -202666 -366791 -368499 -167796 67825
16553 67825 -18046 -148677 64464 -236762 -475911 -296449 -19348 141625 150372 316414
16543C16414J84548k48110k54788O1071J03798m7003J3851J16549q9568q2526
16533G4236r5867N8959o3115j41184r6309n6417P6848J5109m7413N3250K03575
16522a8328J50311j92524j96519r2828J91224N6943J95570K26029l94450k08774
16512b83346M79175K26546l36456j93467j68013N92972J27149J41895k24538j98435
16502A63482R1191j60328j617q300j00238k40819J4642j44754j19021k4422q0507
16491f10691N6597K46991L46975Q2335k69391j84140j24159N9662L30139M1828
16481b3854J23478j9162k46674j18417P8001j27336J27507L31417M34705l420
16471E56245k70368l55693l33497j07995K18428K39971J4670J18525J42250r6000
$$ plain form
16543 316414 500962 252852 -1936 59135 162933 115930 129781 246330 156762 74236
16533 74236 -21631 37328 -25787 -166971 -263280 -319697 -242849 -227740 -275153 -221903 -18328
16522 -18328 131983 -60541 -257060 -349888 -158664 -101721 93849 319878 -74572 -283346
16512 -283346 195829 422375 85919 -107548 -275561 317411 444560 586455 361917 163482
16502 163482 254673 94345 92728 84428 -15810 -256629 -241987 -386741 -505762 -530184 -610691
16491 -610691 -554094 -307103 39872 122207 -147184 -331324 -455483 -395821 -65682 -23854
16481 -23854 99624 80462 -166212 -284629 -206628 -333964 -206457 124960 559665 556245
16471 556245 285877 -69816 -403313 -511308 -292880 -52909 -38239 80286 222536 126536
16461A26536K20513r111k16405n6825o2776k03236M114J74509l8742J64610O7466
16450A70653j75164J45733K49249J25156k57531r095p0674K01323l51617m96099
16440d68066J6527J00276m7477J15818K33551M38965J10755j71989k30367L2550
16430A30543j38516N5573M9486k56696n0706J77152J71209J19212j53141o7433
16420C6683j36206J52126o6908k47124k40997j43256J87566K88188K16995p046
16410D0021j25108K43564R9279n7342K29373l9378j05396O9440k49222k93901
16400a88670J85968L09892J34637k33644j78352l46036R7678K87487L22152j85357
16390B05755j47462p8061m4012J50289J34714o731q4520J9088j3517j9143K7157
$$ plain form
16461 126536 347049 337938 121533 64708 1932 -201304 -197190 -22681 -61423 103187 170653
16450 170653 -4511 141222 390471 515627 258096 249001 178327 379650 28033 -468066
16440 -468066 -451539 -351263 -398740 -282922 -49371 389594 500349 328360 97993 130543
16430 130543 -7973 47600 97086 -159610 -210316 -33164 138045 257257 104116 36683
16420 36683 -99523 52603 -14305 -261429 -502426 -645682 -458116 -169928 47067 40021
16410 40021 -85087 158477 257756 200414 429787 390409 285013 354453 105231 -188670
16400 -188670 -2702 307190 441827 208183 29831 -316205 -218527 68960 391112 205755
16390 205755 58293 -19768 -63780 86509 221223 214492 129972 149060 135543 116400 143557
16379A43557M4312Q3547M7440l10782l46033J57057L08349l51053k44610J34071
16369c34145K48179P6151K5123J60734r0597J20314j06742m28886k03249J89221
16359c43897q3051j54294j8636P920K13850j75350O7300J05598O2120j86502j06213
16348f11155r8190K37262K17181J46652o008l4644j30905j14481n6798M0184J8487
16337c92415L0801K70571K64796R2536k2413m95939k32271K45994K98346j1887
16327D8119Q6123p13l2648j82218K36015n0049j98474J12191K72939p3247k80651
16316f2613j47472J27067Q1855O1892j73450p2140K31050o05j49285j53270k55064
16305e12035K72601J46999j62377J10610J32362J65272J06766j19403j3683n2868
$$ plain form
16379 143557 187869 271416 318856 8074 -337959 -180902 127447 -223606 -468216 -334145
16369 -334145 -85966 -9815 15308 176042 85445 205759 99017 -329869 -533118 -343897
16359 -343897 -426948 -581242 -599878 -591958 -378108 -553458 -486158 -380560 -318440 -504942 -611155
16348 -611155 -709345 -472083 -254902 -108250 -114258 -148902 -279807 -394288 -451086 -410902 -392415
16337 -392415 -361614 -91043 173753 266289 243876 -252063 -484334 -238340 60006 48119
16327 48119 134242 133529 100881 -81337 154678 104629 -93845 18346 291285 218038 -62613
16316 -62613 -210085 -83018 -1163 60729 -112721 -184861 46189 45584 -103701 -256971 -512035
16305 -512035 -239434 -92435 -254812 -144202 -11840 153432 260198 140795 127112 74244
16295G4244k99957m5253n9934j64640k22552J13834L00151J84781K821J95724
16285G9219P3801q7771n8759m19557j92467o7529N7449J14452J23767K99279J46217
16274F8101L9621p4194k50343M2653k45056K1370M7254J24809J22517j12401K75676
16263F0007j8747l420J2774J37098J6150k1180j49258k11224N4096M6644M0226
16252c6834k1398j47218k92347j52718k90624L10830K79521J82503o7344O4075
16242a71554L69869J06213k42959k26063L7716k27746K9925K90439J40966m4265
16232F2541O4658l2660j27975J4586R2182j89931l00666o7540k7153L22982L71264
16221A82288j01967k03647k05238o8779R8493J54627K66159Q3446j89028o5037
$$ plain form
16295 74244 -225713 -270966 -330900 -495540 -718092 -604258 -304107 -119326 -116505 79219
16285 79219 153020 65249 6490 -413067 -605534 -673063 -615614 -501162 -377395 -78116 68101
16274 68101 107722 33528 -216815 -174162 -419218 -397848 -350594 -225785 -103268 -215669 60007
16263 60007 41260 37840 50614 187712 203862 182682 33424 -177800 -123704 -77060 -36834
16252 -36834 -58232 -205450 -497797 -650515 -941139 -630309 -350788 -168285 -235629 -171554
16242 -171554 198315 304528 61569 -164494 -126778 -354524 -324599 -34160 106806 62541
16232 62541 127199 94539 -33436 -18850 73332 -116599 -417265 -484805 -511958 -188976 182288
16221 182288 80321 -123326 -328564 -397343 -298850 -144223 121936 205382 16354 -48683
16211d8683K43716J629k88547j81247m7015L85151J7173k57251p5654R8130J22152
16200c0446Q2955k26510n5902k43368r6228J62069N50742K14959J41497o8043
16190D31725k74598j82301k0765j60944o9464K82951L23532j5385q207L7865j17375
16179B27034j23330j18639j22636L5548j76940j24592p1819K9834J96608R7700
16169a51232k23573j1613J67633J4284J8036J77608R0139j01750j6273l83984
16159d20725j03378O024K85829j44656k44384k0681O9053K33240L9282j69235
16149d69631R938j33754n0883L47658K17344J05865l5289J3856J86055J10429
16139C01588J60637k31359l02720j26002j6067J7134J6392o1754k45989J06846
$$ plain form
16211 -48683 195033 196662 -91885 -273132 -320147 65004 82177 -175074 -250728 -152598 -30446
16200 -30446 52509 -174001 -229903 -473271 -569499 -407430 143312 358271 499768 431725
16190 431725 157127 -25174 -45939 -206883 -276347 6604 330136 314751 306544 344409 227034
16179 227034 103704 -14935 -137571 -102023 -278963 -403555 -475374 -445540 -248932 -151232
16169 -151232 -374805 -386418 -218785 -204501 -186465 -8857 81282 -20468 -36741 -420725
16159 -420725 -524103 -518079 -232250 -376906 -621290 -641971 -572918 -339678 -300396 -469631
16149 -469631 -459693 -593447 -644330 -296672 -79328 26537 -8752 5104 191159 301588
16139 301588 462225 230866 -71854 -197856 -213923 -196789 -180397 -242151 -488140 -381294
16129c81294K71580r0366k00317L4970j11815O9881K29666K27701N3506o4021
16119C9491j27084k38263o7614l7151K54132k08484p5899L54094L14944J04704
16109C12870j69967Q1660J20784k26257m23701N7897J56405j78893K31781K49429
16099B12008J7516n3480O4903k85532j81475L32654J47100K28230m06851l11655
16089b36582J34851J28223m6378m1381K1801J27010M802j52892j9386P0644J11124
16078A01836J10664K3985j13831J52454j09290q6667k36688O4094K94114k58798
16068e8127l09260o8726j1152R4028M2125m5758j13924J65975J41423p6533L6737
16057b03192R4935J73360J24925O9659k68309k51054Q2562J29841J32453Q2247
$$ plain form
16129 -381294 -109714 -200080 -400397 -365427 -477242 -407361 -177695 50006 103512 39491
16119 39491 -87593 -325856 -393470 -430621 -176489 -384973 -460872 -106778 208166 312870
16109 312870 142903 224563 345347 119090 -304611 -246714 -90309 -269202 -37421 212008
16099 212008 229524 176044 240947 -44585 -226060 106594 253694 481924 75073 -236582
16089 -236582 -101731 26492 -19886 -61267 -39466 87544 92346 -60546 -79932 -9288 101836
16078 101836 212500 236485 122654 275108 165818 79151 -157537 -93443 200671 -58127
16068 -58127 -367387 -436113 -447265 -353237 -311112 -356870 -470794 -304819 -163396 -239929 -203192
16057 -203192 -108257 65103 190028 259687 -8622 -259676 -177114 -47273 85180 167427
16047A67427k2247j10713k81101n163L34030M31511j18074j66116r3231p1473
16037F4850k57388l2363J01595N2339j42182M7548J29524j03054J59788p0445
16027d9788k58041j99174j59068k17187K12555K76277K18192K89014r4388j87926
16017a69534m1006M02803K08306k13993l78941k12383K3083K16400n1337j13704
16007c30306j53871K33345K67251J79175J83648K1822k89305j60558J80276L20350
15997D51827M5174J8695l51598j76415j63123k10972m8759K94782J56826k05645
15987a89208j27528N9709J83595l3877o76j59474R7506j17447K72498L15304j5586
15976B84816k29793K7658K78979J50195j8945j94312l4727k40026M879K0810j18137
$$ plain form
16047 167427 145180 34467 -246634 -251797 82233 513744 395670 229554 136323 64850
16037 64850 -192538 -224901 -123306 -70967 -213149 -165601 -36077 -139131 20657 -49788
16027 -49788 -307829 -507003 -666071 -883258 -670703 -394426 -176234 112780 18392 -169534
16017 -169534 -210540 192263 400569 186576 -192365 -404748 -381665 -165265 -216602 -330306
16007 -330306 -484177 -250832 16419 195594 379242 401064 111759 -48799 131477 451827
15997 451827 497001 515696 164098 -12317 -175440 -386412 -435171 -140389 16437 -189208
15987 -189208 -316736 -257027 -73432 -107309 -107985 -267459 -169953 -287400 -14902 300402 284816
15976 284816 55023 82681 361660 511855 492910 298598 263871 23845 28724 49534 -68603
15965f8603J83835r7037j26543l10979L7288K39468j97479j2408J99650p2280
15955b25088m15578N0242K89284j20878k9362O6404K79942P4227l43459n2172
15945d26438K43291q5908J05061o6333J020l1230j40367J19571l18915O7331K97706
15934b35211K41155m9010k52290k01883p5868K22878r8071j32339L9789K67894
15924b72956M36680J96124K5722Q9198j98820l6552K31107j75719l51690k80637
15914c37543N3852j83688K24266M28929l2975j83605p8516J314q5173l2093K31787
15903F555r6145l77129k9540J25680k24697O1612J47251L8300m3827P5683q5060
15892d01317J43574k18866m0270j39072K70825K34932J64627J21349p566k93802
$$ plain form
15965 -68603 115232 18195 -108348 -419327 -382039 -142571 -340050 -352458 -152808 -225088
15955 -225088 -640666 -590424 -301140 -422018 -451380 -384976 -105034 -30807 -374266 -426438
15945 -426438 -183147 -269055 -163994 -230327 -229307 -260537 -400904 -281333 -600248 -532917 -235211
15934 -235211 5944 -43066 -295356 -497239 -573107 -350229 -448300 -580639 -540850 -272956
15924 -272956 163724 359848 385570 474768 275948 239396 470503 294784 -56906 -337543
15914 -337543 -283691 -467379 -243113 185816 152841 -30764 -109280 -107966 -193139 -225232 6555
15903 6555 -89590 -466719 -496259 -370579 -595276 -533664 -386413 -348113 -391940 -316257 -401317
15892 -401317 -257743 -476609 -516879 -655951 -385126 -150194 14433 135782 128216 -165586
15882a65586k81365M8793J46443J53199L7597p2399l97456n7205M24894J03496
15872e9589M4675q3057j28130J27813L60772M45845p781n28963k60077J68659
15862H0167j63662J82653K71609J6423k29048L8181L43074j20454k29859j41238
15852D7846n4033l42381j88961K12464P8419l9107j53103O6375j48225K8294K76212
15841b16200q1157P407J18481J21787J92844k08728m70420q4237M2108J87282
15831c90833K91075J13750J41228O7353k10143l59970Q2929L9407R9063P2671
15821e3470j5374o370j85121k82005k99757P3753M6904K10008J39581K10020l6522
15810a98353j02059j49971J64458J19795J13171r3638j22481P2809J01826k43941
$$ plain form
15882 -165586 -446951 -398158 -251715 -98516 -60919 -133318 -530774 -587979 -163085 -59589
15872 -59589 -14914 -97971 -226101 -98288 262484 708329 700548 171585 -88492 80167
15862 80167 -83495 99158 370767 387190 158142 196323 539397 418943 189084 47846
15852 47846 -6187 -348568 -537529 -325065 -246646 -285753 -438856 -372481 -520706 -492412 -216200
15841 -216200 -297357 -289950 -171469 -49682 143162 -65566 -535986 -620223 -578115 -390833
15831 -390833 -99758 13992 155220 222573 12430 -347540 -264611 -225204 -126141 -53470
15821 -53470 -68844 -75214 -260335 -542340 -842097 -768344 -721440 -511432 -371851 -161831 -198353
15810 -198353 -300412 -450383 -285925 -166130 -52959 -146597 -269078 -196269 -94443 -338384
15800c38384j90993J8674r1142N3517N0430J07103N0008k5007Q2234j56799J95888
15789b44471k8965n1975k02332J70248N7588K15572L0845P4629J6693J801j74857
15778a35224J88775J44668j50508K26307J8476J46304j25495k28040m78347l3878
15768d26962P6656j6048K01383J07470N007o2022n5468N5567j15478j89474j6544
15757d35913N2258L41759L7573p2141p2106R0249K41114O7896k25440j55476j86289
15746c16516L62905K26812K64225o3149N4903p6218l12156j11616J78195o9877
15736A37508n8757m19007j68127K38257J65892j19339R3018k4988p4526j37864
15726c67933j20591O4577L43240O4859l53030m6911q668K06937R3183p9482m9754
$$ plain form
15800 -338384 -529377 -510703 -601845 -548328 -497898 -390795 -340787 -365794 -283560 -440359 -244471
15789 -244471 -273436 -325411 -527743 -357495 -299907 -84335 -53490 21139 37832 39633 -135224
15778 -135224 53551 198219 47711 274018 292494 438798 313303 85263 -393084 -426962
15768 -426962 -350306 -366354 -164971 -57501 -52494 -114516 -169984 -114417 -229895 -419369 -435913
15757 -435913 -383655 -41896 -4323 -76464 -148570 -58321 182793 250689 25249 -130227 -316516
15746 -316516 46389 273201 537426 474277 529180 452962 140806 29190 207385 137508
15736 137508 78751 -340256 -508383 -270126 -104234 -223573 -130555 -155543 -230069 -367933
15726 -367933 -488524 -423947 -80707 -15848 -368878 -415789 -424457 -217520 -124337 -203819 -253573
15715b53573p9770o9876K41701M5366j3318J56638o2132j90419j64260O104O20674
15704B37135j69106j22300J08251J48330l7531k14231k94564K69759L07360K00518
15694D33621j82281m68982n5337l7796K14969J04936j50010q2865j9162k7657
15684b70564M7119j71275j76708J64619K11026J21990J83348L1666k2438j51154
15674c2371j75095L8794l4392Q413j10443P2447P6606P2411j26077j41007M636
15663c46078N4532K946L1054j46488J3024J66235K42159M1445n6988q8045k4802
15652a11006j1480p3326L48402J36499k18101j34372O3778J22517L5381o8893
15642H9399p1463k19910j02295k9427Q1392n8577l06273J93471J14838J16934
$$ plain form
15715 -253573 -333343 -403219 -161518 -116152 -129470 27168 -34964 -225383 -389643 -383539 237135
15704 237135 68029 -54271 53980 202310 164779 -49452 -344016 -74257 233103 433621
15694 433621 251340 -217642 -272979 -310775 -95806 9130 -140880 -223745 -242907 -270564
15684 -270564 -223445 -394720 -571428 -406809 -195783 -73793 109555 141221 118783 -32371
15674 -32371 -207466 -168672 -203064 -194651 -305094 -232647 -156041 -83630 -209707 -350714 -346078
15663 -346078 -291546 -288600 -257546 -404034 -391010 -224775 17384 58829 1841 -86204 -111006
15652 -111006 -122486 -195812 152590 289089 70988 -63384 394 122911 158292 89399
15642 89399 17936 -201974 -304269 -333696 -252304 -310881 -617154 -423683 -308845 -191911
15632a91911J51939L57767J95619k13300n2305j29510j42751l475J68942J1574
15622A52589L8894n7731j67740L6607J5299J18191j82353q8747L08838j92833
15612a8986j66413J66760L8745p1027l8716k31003r2900j22895J02847L28639
15602a04949N2934O8087j5102l4859Q1371P4287J26605m3551p363m9920m3345
15591A04195O0825k11705j40255k42336J15369M93971k2719j71601r3999j05842
15581b14097j05121j09448r0335j46016R0702J07429K99006J39021k3512j21834
15571a74205k77671k62639K25485K58079J29657J15467j45499M098p5726J63317
15561c9637j51945m6701J36065K17950J33993j04519j90880q0583Q3702j15491
$$ plain form
15632 -191911 -39972 317795 513414 300114 247809 118299 -24452 -27927 141015 152589
15622 152589 191483 133752 -33988 2619 17918 136109 -46244 -134991 173847 -18986
15612 -18986 -185399 -18639 20106 -50921 -89637 -320640 -413540 -536435 -433588 -104949
15602 -104949 -52015 16072 970 -33889 47482 121769 248374 204823 197460 147540 104195
15591 104195 165020 -46685 -186940 -429276 -313907 180064 157345 -14256 -108255 -214097
15581 -214097 -319218 -428666 -519001 -665017 -574315 -466886 -167880 -28859 -52371 -174205
15571 -174205 -451876 -714515 -489030 -230951 -101294 14173 -131326 -127228 -202954 -39637
15561 -39637 -191582 -238283 -102218 115732 249725 145206 -45674 -126257 -42555 -158046
15551a58046k71731O6662L13569K35206N7484N7591L71813k57177l33795m1236
15541D0340K59567M244J68224j10856l88736J08507K89269k5325k88543p7293
15531b0602J49889r5047J10401j3556J4740j84701K59620j30857j64639J64788
15521I0036N910p7504q5302j46178J15861J66335l8768j0015L4375j09344P4164
15510A9570L3680J66694J72011r0745j69825M8294k7546K5477J54260M0228j76050
15499A96048k51321j11548l5996R0772K6014j61727M14667L3636j17955k35245
15489a52655k93390K7975J68937K79712K9828j25238j25394q7958J35445K52686
15479A09948J9383J9593N534j19700J18313K6799q8353j41879J12974K7831K20814
$$ plain form
15551 -158046 -429777 -363115 -49546 185660 243144 300735 672548 415371 81576 40340
15541 40340 299907 304151 472375 361519 -27217 81290 370559 345234 56691 -20602
15531 -20602 129287 34240 144641 131085 145825 -38876 220744 89887 -74752 90036
15521 90036 95946 18442 -66860 -213038 -97177 69158 30390 20375 54750 -54594 19570
15510 19570 53250 219944 391955 301210 131385 179679 152133 177610 331870 372098 196048
15499 196048 -55273 -166821 -202817 -112045 -86031 -247758 166909 200545 82590 -152655
15489 -152655 -446045 -418070 -249133 30579 60407 -64831 -190225 -278183 -142738 109948
15479 109948 129331 148924 154458 34758 153071 179870 91517 -50362 62612 90443 311257
15468C11257r6042l07515k72339j7391J54929K00685o9994J808L9080J82651j52433
15457b5304j48896Q9934L46462Q7994K11243j7889j82581p6555m8617j05057j90106
15446e9372L4632j2157J11361j45445j54590J08636R724j95036j82168J2410K79535
15435a92470K29376R6721j73059J6825j09810j79057o693J14189J6688N3098J91807
15424E7615K50357p1195p9575J74253j71573m9230R7817J01210o2167l48153k58750
15413c59391N599M4270M4175m0349o2860r3043Q1249j51201j52251J25540L29387
15402b28875J94219J7508q0723J10022N3631J58983M09937p4061o14297l19690
15392c73346J77041J44575J16117J3761k23620m6543O0851j52555L74797K11796
$$ plain form
15468 311257 215215 -92300 -364639 -382030 -227101 -26416 -96410 -94602 -55522 127129 -25304
15457 -25304 -174200 -84266 262196 350190 561433 543544 360963 284408 235791 130734 -59372
15446 -59372 -24740 -36897 74464 -70981 -225571 -116935 -107211 -302247 -484415 -472005 -192470
15435 -192470 36906 133627 -39432 -22607 -132417 -311474 -318167 -203978 -187290 -134192 57615
15424 57615 307972 236777 157202 331455 159882 110652 208469 309679 247512 -100641 -359391
15413 -359391 -353792 -309522 -265347 -305696 -368556 -461599 -380350 -531551 -683802 -558262 -228875
15402 -228875 -34656 -17148 -97871 12151 65782 224765 634702 560641 -53656 -373346
15392 -373346 -196305 -51730 64387 78148 -145472 -192015 -131164 -283719 91078 302874
15382C02874p0757J37964k0981o447k16207l23568J4446J16353K96677M5560j62711
15371A13203K07653O4699l05559k62075J74948o5751o7631J58160j49933j11678
15361b43964K18880J557j41645j04052n784J47838K5840r4105j29436k3477j87308
15350e35656K12831j0591j40326K09906K13372n1652K30376J90147j65407k02980
15340d9980l66015q8855K25321J50217J67024j14277p7786m2097j57289l26490
15330f80227k6562K92106L23547R5763k01534j36261L8931K86585k1847n0103
15320g9602n1651O138L62505j19605k01774k50559p8837J80791J40750j16693
15310b08537j11029j27590P0025K7609L4754J878J7345Q9529o9243J55761r2679
$$ plain form
15382 302874 232117 370081 349100 342653 126446 -197122 -182676 -66323 230354 275914 113203
15371 113203 320856 385555 79996 -182079 -7131 -72882 -140513 17647 -132286 -243964
15361 -243964 -25084 -23527 -165172 -269224 -275008 -127170 -101330 -195435 -324871 -348348 -535656
15350 -535656 -322825 -333416 -473742 -263836 -50464 -102116 128260 318407 153000 -49980
15340 -49980 -415995 -504850 -279529 -129312 37712 -76565 -154351 -196448 -353737 -680227
15330 -680227 -706789 -414683 -91136 4627 -196907 -333168 -294237 -7652 -29499 -79602
15320 -79602 -131253 -125115 237390 117785 -83989 -334548 -413385 -232594 -91844 -208537
15310 -208537 -319566 -447156 -377131 -349522 -314768 -312890 -295545 -206016 -275259 -119498 -212177
15299b12177j0381j42323J33166J56618L6810n2057L5766P3250j53461p4868p080
15288b16737L6544j10504L7401j51650J31407L55760L39156J31878j49972j80687
15278B22596p1155r3985m4080P1356J02883P6971J4m1462J40935j92234l11032
15267a39193j06556q8328L06827k000j28108n1878L6642n2959J19284O1486m6218
15256i1001J69216k4557J29039J6550Q2233j14541M2997j97735J12508J3180j81119
15245d3230l3384k62921k38051l621J70090J79530j45991k11092P8044J44931
15235c65695K86878K41996K98932j05212k71695q6573J32190l56403m0462M47267
15225A81223K72585K2764j93642k98579J23173K88100r0089k05087j13508O0180
$$ plain form
15299 -212177 -222558 -364881 -231715 -75097 -38287 -90344 -54578 18672 -134789 -209657 -216737
15288 -216737 -180193 -290697 -253296 -404946 -273539 82221 421377 553255 403283 222596
15278 222596 151441 57456 13376 84732 187615 264586 264600 223138 364073 171839 -139193
15267 -139193 -245749 -334077 -27250 -29250 -157358 -209236 -172594 -225553 -106269 -44783 -91001
15256 -91001 78215 53658 182697 199247 281480 166939 209936 12201 124709 137889 -43230
15245 -43230 -76614 -339535 -577586 -581207 -411117 -231587 -377578 -588670 -510626 -365695
15235 -365695 -78817 163179 462111 356899 85204 -1369 130821 -225582 -266044 181223
15225 181223 453808 476572 282930 -15649 107524 395624 305535 100448 -13060 47120
15215D7120p3171o7863k77722j57300K32158O9598K00523J21852m1326p6243N1720
15204B9346J2496k11304q9279K49264O166o1143K9298k50372J05513J25559j48584
15193b03040K32323J40323k07440k28875o4688K28699O7712O6134J36934K9742
15183A97824k20231j97523o9027q2928J78867J07504r785Q1591J94470O6529k07469
15172C9822m2247m2755l40009l28693R0190N4808p0382k72930P1913K24862K01257
15161d14164J64722M8653j39859J39950P9615k85768j47157K60862K95115N326
15151G295p4008P1025J34347K4990k61152j3219r08K68715K19881k59711J5311
15140A32566O9120K00588j23744R387L6253k62983J7395K02697r6723k65699k7729
$$ plain form
15215 47120 -26051 -93914 -371636 -528936 -296778 -227180 -26657 95195 53869 -22374 29346
15204 29346 41842 -169462 -258741 -9477 -3311 -64454 -35156 -285528 -180015 -54456 -203040
15193 -203040 29283 169606 -37834 -266709 -331397 -102698 -34986 31148 168082 197824
15183 197824 -22407 -219930 -288957 -371885 -193018 -85514 -95299 -13708 180762 247291 39822
15172 39822 -2425 -45180 -385189 -713882 -623692 -568884 -639266 -912196 -840283 -615421 -414164
15161 -414164 -249442 -200789 -340648 -200698 -121083 -406851 -554008 -293146 1969 7295
15151 7295 -66713 4312 138659 163649 -97503 -110722 -111630 157085 376966 117255 132566
15140 132566 201686 402274 278530 287917 324170 61187 78582 281279 184556 -81143 -108872
15129a08872K83893k8616j76276K45625P2465j0871j43541q6477j1617K35972
15119B71685K24855l10688j56567m93387p4056R1011K61260J99291J0794Q1081
15109A05279l7584j11125j31818q9631j55275J2240Q044l8752J11778J58526J39187
15098b9131P8980j4452J60413j21291K40886k06764j37155k21703L7359q2660
15088b95518l15567R343j4118L72327M61458J7274k54315l79047J64646j44059
15078c77576r4059L20874J57983K63127J8801j48938j50027k00493J21758J02578
15068A4028k02215q8477j13982j48435J60920K08819n4091l7174m5899K21723
15058h4783K65493n4003k98446n277M3818j50666J72282j33967J36062j1288P6159
$$ plain form
15129 -108872 175021 146405 -29871 215754 288219 277348 133807 47330 35713 271685
15119 271685 496540 185852 29285 -464102 -538158 -447147 -185887 13404 24198 105279
15109 105279 67695 -43430 -175248 -264879 -420154 -407914 -399870 -438622 -326844 -168318 -29131
15098 -29131 49849 35397 195810 74519 315405 108641 -28514 -250217 -212858 -295518
15088 -295518 -611085 -601742 -615860 -243533 217925 235199 -19116 -398163 -233517 -377576
15078 -377576 -471635 -150761 7222 270349 289150 140212 -9815 -210308 -88550 14028
15068 14028 -188187 -276664 -390646 -539081 -378161 -169342 -223433 -260607 -306506 -84783
15058 -84783 180710 126707 -171739 -177016 -133198 -283864 -111582 -245549 -109487 -120775 -44616
15047d4616K68331p4095k9364J52981n9012l35228j44817o9391N8028M0217q1191
15036c18157K47316J34608j80837p6263j74234l03718O8682J85825K39065J5464
15026a62249L2709J25629J57532K04841J66517M060j43331j24862r6939L816j25263
15015D2460q6915j03433J55466J85284J47403o3647j08618r3035M4897k26781
15005a06919l45596M2130o8008L08528P8429J6268L5644l7425J77089J18600j3514
14994B05226j15799J08775L7464k7292r3411L0032j50925j14991m9379J00094
14984g0206N7621q5874j48748P7723K33853p1960j63794j59132o9770M47253J55794
14973B02760J58173j37817k32077k71682L989J84662K58709k1364j81376J4225
$$ plain form
15047 -44616 223715 149620 120256 273237 214225 -121003 -265820 -335211 -277183 -236966 -318157
15036 -318157 -70841 63767 -117070 -193333 -367567 -671285 -602603 -416778 -177713 -162249
15026 -162249 -129540 -3911 153621 358462 524979 529039 385708 260846 163907 167723 42460
15015 42460 -44455 -147888 7578 192862 340265 276618 168000 74965 119862 -106919
15005 -106919 -452515 -410385 -478393 -169865 -91436 -75168 -39524 -76949 100140 218740 205226
14994 205226 89427 198202 235666 208374 114963 144995 -5930 -120921 -170300 -70206
14984 -70206 -12585 -98459 -247207 -169484 64369 -7591 -171385 -330517 -400287 46966 202760
14973 202760 360933 223116 -8961 -280643 -276654 -91992 166717 145353 -36023 -21798
14963b1798j24205r9135P6346K41003J47470J0777J05436j5865k68257J97191
14953B48963L9365j91884N4923j63622j50095j95607L6965M8512K03811J24382
14943E5713r6037J33256J82247K3555j00768k51370j63893J82230R81k72147r2136
14932c98369J36205n7448J60948L9590j47051J19296j21927j36075N6531K0173
14922c28127j51956M5517q2398N6640p0661L64770J66749l00302R4427J52026
14912e3315r2716K37533L25738L38637j51118n04874l98491K16137k1478j87484
14902b91431J3550J05397J35512m8880r6293L6033J59996J00466J16573j10179
14892A20744K7168N0440J05424j60284j29442N8191P1112k84180j43597l7059
$$ plain form
14963 -21798 -146003 -245138 -168792 72211 219681 230458 335894 320029 51772 248963
14953 248963 288328 96444 151367 -12255 -162350 -357957 -320992 -272480 -68669 55713
14943 55713 -40324 92932 275179 298734 197966 -53404 -217297 -35067 -34086 -306233 -398369
14932 -398369 -262164 -319612 -158664 -119074 -266125 -146829 -268756 -404831 -348300 -328127
14922 -328127 -480083 -434566 -516964 -460324 -530985 -166215 534 -299768 -205341 -53315
14912 -53315 -146031 91502 417240 755877 604759 99885 -298606 -82469 -103947 -291431
14902 -291431 -277881 -172484 -36972 -85852 -182145 -146112 13884 114350 230923 120744
14892 120744 147912 198352 303776 143492 14050 72241 143353 -140827 -284424 -321483
14882c21483j79667M7366N5655J58855J06598K6451R6374K9621K15202J8623n97457
14871c43862l42535L0839K50914N8909J97219K13136R5326O4093J38785J06180
14861D69004J25993l93549l50707M4394O3233j03344J24441m7330J08692L03552
14851C44379l4199k32008o4943j13431R8533J75454J59764q6056j13047k31656
14841i7210J083K54563j13868k7920J50196N9159o3589k42342p4697R5070k48712
14830c08267M543K42456J41095j0790p2067k14683j84575J81295Q6103l2078J02947
14819f4021J69806J06579K6086k24066j96545K1816K2623K37393l5253J01849
14809A66267J87811j36012L85390K22478j11919l69084k23093m7731j73419J44121
$$ plain form
14882 -321483 -501150 -453784 -398129 -239274 -132676 -106225 -9851 19770 234972 253595 -343862
14871 -343862 -686397 -655558 -404644 -345735 -148516 64620 159946 224039 362824 469004
14861 469004 594997 201448 -149259 -104865 -41632 -144976 -20535 -67865 40827 344379
14851 344379 310180 78172 13229 -100202 -1669 173785 333549 247493 134446 -97210
14841 -97210 -96127 158436 44568 16648 166844 226003 162414 -79928 -154625 -59555 -308267
14830 -308267 -303724 -61268 79827 69037 -3030 -217713 -402288 -220993 -134890 -166968 -64021
14819 -64021 105785 212364 238450 14384 -182161 -160345 -137722 99671 64418 166267
14809 166267 354078 218066 603456 825934 714015 344931 121838 74107 -99312 44809
14799D4809J93126j79983m30725j59050J30558J6523L90477L5252P7731p2462
14789D6256k13066O9192J53605j00177J28743M9462j93954k03122j84760Q6728
14779c61093q1261m1830J48853J99311K31156K36310N6055o8744j9564k86991
14769A2202j00214r0725L6078j40205k54165K36569j4659J44283K8909J05699
14759c6228J15608O3995M09Q7607J75744k88820l8830K28139J16067j17550m54101
14748a47960j60611Q4051J189j88787J04382M33810j39656N316l7272K7377J2097
14737f064J06583N1421l7054j75220j10397l7005L28377K47444j87152m7282j00579
14726C3072m6532k62248j12316P9601K33951p7966q3405l18996k10298j7322J21651
$$ plain form
14799 44809 237935 57952 -372773 -531823 -401265 -384742 5735 40987 118718 46256
14789 46256 -166810 -97618 55987 -44190 84553 134015 -59939 -263061 -447821 -361093
14779 -361093 -442354 -484184 -335331 -136020 95136 331446 387501 318757 299193 12202
14769 12202 -88012 -178737 -142659 -282864 -537029 -300460 -315119 -170836 -141927 -36228
14759 -36228 79380 143375 143784 231391 407135 118315 79485 307624 423691 306141 -147960
14748 -147960 -308571 -224520 -223331 -412118 -307736 126074 -13582 -8266 -45538 -18161 -6064
14737 -6064 100519 151940 114886 -60334 -170731 -207736 120641 368085 180933 133651 33072
14726 33072 -13460 -275708 -388024 -308423 -74472 -152438 -235843 -554839 -765137 -782459 -660808
14715f60808J01516J65130J56970q0014J6586K55038L19383J94390j33034j51387
14705A83770k39249j28424m7457L805N3395J2241j58114l4385K03396j13651j57114
14694d21787p875K93423J45886m8671L10545L5831j86366j13963n5068o2620m3858
14683a54523J78959K08378q515j3306k9805q3986l7836K392J69991r0680l0515
14672A10554m4989k51862l007J96008J36024k24448l01735L13686J50787J1338
14662I2356J79123j35419k0061K62520J85711l46426k25286j10511j17699J8009
14652b17683N6800j03217K2819J80627J58008q591k38507l20482k01606N8380
14642f13452J08748R6492L68852O26757J07941j01181j85171l12332n8300J18511
$$ plain form
14715 -660808 -559292 -394162 -237192 -317206 -300620 -45582 273801 468191 335157 183770
14705 183770 -55479 -183903 -231360 -227555 -174160 -161919 -320033 -354418 -151022 -264673 -421787
14694 -421787 -429662 -136239 9647 -39024 271521 307352 120986 7023 -48045 -110665 -154523
14683 -154523 24436 232814 224299 210993 181188 97202 59366 61758 231749 141069 110554
14672 110554 65565 -186297 -189304 6704 142728 -81720 -383455 -69769 81018 92356
14662 92356 271479 136060 115999 378519 564230 217804 -7482 -117993 -235692 -217683
14652 -217683 -160883 -264100 -241281 -60654 97354 88763 -149744 -470226 -671832 -613452
14642 -613452 -504704 -408212 -39360 587397 695338 594157 408986 96654 38354 156865
14632A56865J08056P8617K8470k98288J31403K22571j49228j39658n8432m8752
14622C1624K11649J62606k86762k47139j3822J13824N3198K32Q694k41235J90232
14611a6899L88879k13500l07656j37320J30777J91955k53463L10759N8251m05857
14601b54074j72253q737j28912o795K36148K82039K26413Q2945n6575k57544j56154
14590b13499p7915k42479l19952n5677K18838K20532K61621p6016M0966K3828
14580b19753n9562K66794J76474j94462K6890J73841R3272j03770k36759J74213
14570I7178K94656k0865l28193n8652m702J03051j76547N7800Q6136J80122K73235
14559E03219j5475l48408P139j29725j43872j57959L5304o5113J33439J96182
$$ plain form
14632 156865 264921 343538 372008 73720 205123 427694 278466 138808 80376 31624
14622 31624 243273 405879 119117 -128022 -141844 -28020 25178 25410 34104 -207131 -16899
14611 -16899 371980 158480 -149176 -286496 -155719 36236 -217227 93532 151783 -254074
14601 -254074 -426327 -435064 -563976 -570771 -334623 -52584 173829 256774 200199 -57345 -213499
14590 -213499 -291414 -533893 -853845 -909522 -690684 -470152 -208531 -284547 -243581 -219753
14580 -219753 -279315 -12521 163953 -30509 -3619 170222 263494 159724 -77035 97178
14570 97178 391834 370969 42776 -15876 -20578 82473 -94074 -36274 49862 229984 503219
14559 503219 487744 139336 146475 16750 -127122 -285081 -249777 -314890 -181451 14731
14549A4731J32192M2369J70045Q178k12380j31871L943o9365j21976K26775P853
14538G0494n13539P2675J59137j07204J72337m8129o1489j14164R3323K60477
14528a6082K28405R384k88020m5589J93928j1551J13376K19541k41785q2351J46149
14517B25405O8302k54186k30534Q7240o6094q0769M0792q3736P7569L02529Q6152
14506A72670j80690j1212l500o8394m3104j03862J63193R5011j27585k41273J08416
14495b40330K99399J39582L7311n9368o1564j96107k18345m425P4668M5662j57581
14484c41098j3058J40097J31214r9789l320P6792J36726K22652P561N1629Q5265
14473C94671r2917l02840j90031L4873l2443J39498K62584q0840k96327j39876
$$ plain form
14549 14731 146923 189292 359337 367515 155135 23264 27207 -42158 -164134 62641 70494
14538 70494 -443045 -370370 -211233 -318437 -146100 -194229 -255718 -369882 -276559 -16082
14528 -16082 212323 221707 -66313 -111902 82026 70475 183851 403392 161607 79256 225405
14517 225405 293707 39521 -191013 -103773 -169867 -250636 -209844 -293580 -216011 86518 172670
14506 172670 -8020 -19232 -22732 -91126 -134230 -238092 -74899 20112 -107473 -348746 -240330
14495 -240330 59069 198651 235962 176594 115030 -81077 -299422 -303847 -229179 -183517 -341098
14484 -341098 -354156 -214059 -82845 -182634 -185954 -109162 27564 250216 257777 309406 394671
14473 394671 301754 -1086 -191117 -156244 -188687 -49189 213395 132555 -163772 -303648
14463c03648l05480J43285J93993J87996k0257J25118J04615N5879P9457k88738
14453b7780P8088J13951k0487m22170j45555J73899J52841o6573n9437L3670K98348
14442A08795J18767L0313J9684r6161N9000j63500o2753J57230j8283j98886j61215
14431b07009j26732M6141j52806J46657J87207J20301K82849k59565K84846K84585
14421F06474p4055j42693J8154j07933o5691q415n8254l5297P776l6983J61599
14410B64682j99181m55263J53086N2511K51479J5416k1142K60511L29073j41200
14400E09972m72775J37182K93907j29055p1601j13467M7890L61812J83290l29861
14390D17294l24384r2588j4941m1901j79750j17299q1132J24313K79658J71905
$$ plain form
14463 -303648 -609128 -465843 -271850 -83854 -104111 21007 125622 181501 260958 -27780
14453 -27780 50308 164259 143772 -278398 -423953 -250054 -97213 -163786 -223223 -189553 108795
14442 108795 227562 257875 277559 181398 240398 76898 14145 171375 153092 -45794 -207009
14431 -207009 -333741 -287600 -440406 -293749 -106542 13759 296608 37043 321889 606474
14421 606474 532419 389726 407880 299947 234256 225841 167587 132290 140066 103083 264682
14410 264682 65501 -389762 -236676 -184165 67314 82730 61588 322099 651172 509972
14400 509972 37197 174379 468286 339231 267630 154163 202053 563865 747155 417294
14390 417294 92910 322 -14619 -56520 -236270 -353569 -434701 -310388 -30730 141175
14380A41175K06794q5340O0242j37654r0036L05240J05987k93903l50482N1764
14370h6213l7956K39576K00044K1095j90658M4879o4632j47932q501K00263j25550
14359D4415l35125j17620K17897j21365L7874K82391l1497l00780j38824Q530
14349d54104K60645L10110n6234l36016k50934J3134J04323k9673J18254l5391
14339c55886J47087L58673n6807j56936J15956k3800J63235N28450r0229k20302
14329D09441k01251j43737o1874j00048j65610R7700J68649J21153m0623o6638
14319A7162K9442j42908k22936J28291m5334K01230J54846O5516Q6646k93805
14309b1850o6591m6642P0684J06840j1936J52022J45896J83351O7341l82072j75866
$$ plain form
14380 141175 347969 262629 322871 185217 95181 400421 506408 212505 -137977 -86213
14370 -86213 -124169 115407 315451 336546 145888 190767 126135 -21797 -30298 169965 44415
14359 44415 -290710 -408330 -190433 -311798 -273924 8467 -23030 -323810 -462634 -454104
14349 -454104 -193459 116651 60417 -275599 -526533 -513399 -409076 -438749 -320495 -355886
14339 -355886 -208799 149874 93067 -63869 52087 28287 191522 719972 629743 409441
14329 409441 208190 64453 2579 -97469 -263079 -165379 3270 124423 83800 17162
14319 17162 46604 -96304 -319240 -190949 -236283 -35053 119793 185309 271955 -21850
14309 -21850 -88441 -135083 -64399 42441 30505 182527 328423 511774 579115 197043 21177
14298B1177O40k02142n8866K18726K26499J28495j4360J64183j13475j02650j75696
14287I2531L7937K4213r1271L6299l21353k57365J56749M10064J58422m0273m3479
14276A62474k81284j66481J18676R1851o2290l019j58M5019l374R9223p1193l3500
14264a04056R1996r9630p0332M1946l7473J26520K46179L44850k38356n5070k31610
14253A4964o5247M1800K21461K77614R3191j30989J47769j46491l60881k29439
14243a36248P7647M8297j35931p8508J15615j59927L3524j47557L30570J7967
14233c4551N4215k574j86645j04923J13157J29348j80994j16126Q4179J86762
14223e8152J80780l56898k04354P9210J84691J72985R0932k509J8156K11377K76756
$$ plain form
14298 21177 21817 -180325 -239191 -20465 206034 334529 320169 484352 370877 268227 92531
14287 92531 130468 154681 63410 99709 -221644 -479009 -322260 87804 246226 205953 162474
14276 162474 -118810 -285291 -166615 -74764 -137054 -140073 -140231 -95212 -98586 637 -70556 -104056
14264 -104056 -12060 -111690 -182022 -140076 -177549 -51029 195150 540000 301644 246574 14964
14253 14964 -50283 -8483 212978 490592 583783 452794 600563 454072 93191 -136248
14243 -136248 -58601 -10304 -146235 -224743 -109128 -269055 -235531 -383088 -52518 -34551
14233 -34551 19664 17090 -169555 -274478 -161321 -31973 -212967 -329093 -244914 -58152
14223 -58152 122628 -234270 -438624 -359414 -174723 -1738 89194 86685 104841 316218 592974
14212E92974J6293m10337k37882N9553j81481q1481P3901K62452J29286L45652
14202E68930j31014m48887J71470J13020J11230o7052m13849j4423M9535n3398
14192a14438L1498J97449k13320k07597J10001L07573K04920j96311k96590q561
14182a85376L0345k2446K07315J58473J91931j77399j10194N9035p0897j05382
14172b4595n002L88411J00905r2739p0329l4139j23912k33652k67919R9882J99124
14161f3965K05368q6754j01984j3418O8316R447L9537J85996L8454R0607q1477
14150B90127N3111L932q2359p6626k18911K5204l7617j55544J22224J54605J66539
14139B44685m12069m6015j48571K5528J29151J10316L00833N38427Q3560k41476
$$ plain form
14212 592974 609267 198930 -38952 20601 -160880 -242361 -168460 93992 223278 568930
14202 568930 437916 -10971 160499 273519 384749 317697 -96152 -110575 -61040 -114438
14192 -114438 -82940 114509 -98811 -306408 -196407 111166 316086 119775 -176815 -185376
14182 -185376 -155031 -177477 29838 188311 380242 202843 92649 151684 80787 -24595
14172 -24595 -29597 358814 459719 366980 296651 262512 138600 -95052 -362971 -263089 -63965
14161 -63965 141403 54649 -47335 -60753 7563 17010 56547 242543 280997 371604 290127
14150 290127 343238 347170 264811 188185 -30726 -5522 -43139 -198683 -76459 78146 244685
14139 244685 -167384 -213399 -361970 -336442 -207291 -96975 203858 742285 825845 584369
14129E84369k96041j18009J38718p7021K34885l4277k76343j92673j3199j60783
14119b10374J74137P1839J19986p3746J25095K31095j42920k40592k73934k2186
14109b41600L5860p4482p0735J53599J22875L41681J06175k53865k8120J36442
14099B27830J66152M4660j42201k26939p6329r9928K6292K54452n6433j16876
14089F80K1787K2149r9777M6471Q8802l4476Q2681m249L9910J789k05812j35974
14077a76019J74715K23760J24269K4851j08777k51381k20392J00289K98538J30314
14067C20167m4043j75889j83190n7402J48747P0606l1630J58438K76443m45348
14057C6899j68511J40543J36565J54617J12289J39091k68885l43892j77314L57853
$$ plain form
14129 584369 288328 170319 309037 232016 466901 432624 156281 -36392 -49591 -210374
14119 -210374 -36237 35602 155588 81842 206937 438032 295112 54520 -219414 -241600
14109 -241600 -205740 -280222 -350957 -197358 -74483 267198 373373 119508 91388 227830
14099 227830 393982 438642 296441 69502 -6827 -106755 -80463 173989 117556 680
14089 680 22467 44616 -55161 -8690 80112 45636 128317 124068 163978 165767 -40045 -176019
14077 -176019 -1304 222456 346725 371576 262799 11418 -208974 -108685 189853 320167
14067 320167 276124 100235 -82955 -140357 8390 78996 47366 205804 482247 36899
14057 36899 -131612 8931 145496 300113 412402 551493 282608 -61284 -238598 119255
14047A19255K14690l63498p1949P7861n3425j5878K1249j74745L32387J61594
14037B47541j55210J10368q4870m7742o7558J24001K08857J62275j06287j42313
14027B49062j43140R4126J51945M0912N0224k32321p6532m8020J4569j47721k53142
14016c00038J53809M31233L9707k31981r34k02386j66828J9972N1830J28130J60468
14005H2982L6674J42056o4805j63995Q8819j06018o7227j69327K96483K6695J10221
13994B12558J91690J10955j33612j23772j5673k3952j15260J2487K03861M2700
13984C61982l05383K24703l0883j87326L48153R3723k35854k49218P1434M4060
13974A35391j44536l3578j21803O7705J28304j46261l22045K31574R5146k42711
$$ plain form
14047 119255 333945 -29553 -101502 -23641 -77066 -92944 -71695 -246440 85947 247541
14037 247541 92331 202699 117829 70087 2529 126530 335387 497662 391375 249062
14027 249062 105922 200048 351993 392905 443129 210808 134276 86256 100825 -46896 -300038
14016 -300038 -146229 285004 324711 92730 91796 -110590 -277418 -257446 -205616 -77486 82982
14005 82982 119656 261712 196907 32912 121731 15713 -51514 -220841 75642 102337 212558
13994 212558 404248 515203 381591 257819 242146 218194 102934 115421 319282 361982
13984 361982 56599 281302 250419 63093 411246 504969 269115 19897 91331 135391
13974 135391 -9145 -42723 -164526 -96821 31483 -114778 -436823 -205249 -110103 -352814
13964c52814Q7018j5517J22401k41772k19538P2920L84445O1512Q9422M6370q0155
13953d5708R3209j52055o4950p2215K67738K08275M8924k99966k05452P1706K27144
13942G6650k11629N2119R7880L4951J09276j98368j1528J00804J9096j35991k06527
13931b73267j61552L9088R816J97122K78651N5546j27391l72920J16945L62051
13921A24089M9073J0303j12087j60716L4279J45876M08101L72234r153m25422
13911D36577l11908k16671J52410M26634j88749l10571l38302N7181J11867J9844
13901a61688K63111L0253O2951J61119r2541m23354m11195j83057K75571J53966
13891c24864o2629j41314L49153M83145o9178j05026n4141j15832o1008M4634
$$ plain form
13964 -352814 -265796 -281313 -158912 -400684 -620222 -547302 -162857 -101345 -11923 34447 -45708
13953 -45708 47501 -104554 -169504 -241719 26019 234294 283218 -16748 -222200 -150494 76650
13942 76650 -134979 -82860 15020 49971 159247 -39121 -50649 50155 69251 -66740 -273267
13931 -273267 -434819 -395731 -385915 -188793 89858 145404 18013 -354907 -237962 124089
13921 124089 173162 183465 71378 -89338 -55059 90817 498918 871152 861999 436577
13911 436577 124669 -92002 60408 487042 298293 -12278 -350580 -293399 -181532 -161688
13901 -161688 101423 131676 194627 355746 263205 -160149 -571344 -754401 -478830 -324864
13891 -324864 -387493 -528807 -179654 303491 234313 129287 75146 -40686 -101694 -57060
13881e7060J05159o8018k84354k71443J42293J35136J51797m1772M1092J28409
13871a8761r381J75958l1226J058J72276Q5576j84857o4600k7619J84544J5180
13860B98148r9209j42123j10091L15233J81330l44600j0451J27569K12262j2848
13850D15220j44582r6620l65001J67526O8478l98L04167J98237K4747k47997j08631
13839B15146j28522r4012j3252k12006k6823Q4375q8734L2136k00492n0249M30987
13828e1446J93377k5644l8076P6478P1670L0186k24588j67426l1542j40340q4768
13817c92119p7306j3065n0741J107O1945M15783Q6834j16481J19377L50440L45450
13806G31224k91778l38972j00572j58294J8402J80230L0702j88286J96006N6895
$$ plain form
13881 -57060 48099 -19919 -304273 -575716 -433423 -298287 -146490 -188262 -147170 -18761
13871 -18761 -28142 147816 116590 117648 289924 375500 190643 126043 98424 282968 298148
13860 298148 198939 56816 -53275 261958 443288 98688 88237 215806 428068 415220
13850 415220 270638 174018 -190983 -23457 45021 44623 348790 547027 571774 323777 215146
13839 215146 86624 -7388 -20640 -232646 -259469 -175094 -263828 -231692 -432184 -482433 -51446
13828 -51446 141931 116287 78211 154689 226359 256545 31957 -135469 -167011 -307351 -392119
13817 -392119 -469425 -482490 -533231 -532124 -470179 -54396 32438 -84043 35334 385774 731224
13806 731224 439446 100474 -98 -158392 -139990 40240 70942 -117344 78662 135557
13796A35557K2651r7705j23723M7254k6274j0008J72309J35479j66745Q9882k4170
13785A54507J79309N9397j2000j05424m26069l32324l185K80871L62956J51769
13775C09807o5781r8388j68402r3818m4208j51477J6757l3411J85421M2687J24798
13764B3985J10009q1580m04462j42533L61592K97902k41520K3988m4763j77457
13754b74839j11773J35012P3085Q5637j06170K371J8727l17343j35288O0988K29437
13743c40156l9084Q8826Q4186n4657J03765P1315O0757o1288j40735q275k72421
13732e07767R2800L38595K47508L4007k799Q8963K368P6176j00474m4970l60050
13721a35643j87714J00261J75829K15445j02180J32624r5099j01721q6540J58922
$$ plain form
13796 135557 158208 60503 -63220 -15966 -42240 -52248 120061 255540 88795 178677 154507
13785 154507 333816 393213 381213 275789 -150280 -482604 -485789 -204918 158038 309807
13775 309807 244026 145638 -22764 -116582 -160790 -312267 -295510 -328921 -143500 -100813 23985
13764 23985 133994 52414 -352048 -494581 -132989 164913 -76607 -52619 -97382 -274839
13754 -274839 -386612 -251600 -178515 -92878 -199048 -196677 -177950 -495293 -630581 -569593 -340156
13743 -340156 -379240 -290414 -206228 -260885 -157120 -85805 -25048 -86336 -227071 -235346 -507767
13732 -507767 -414967 -76372 171136 205143 202344 291307 293675 369851 269377 224407 -135643
13721 -135643 -323357 -223096 -47267 168178 65998 198622 103523 1802 -84738 74184
13711G4184r5718j72258K33849R8469k18180J36191N3739K1158j59756J33103
13701A04781K71859k260P651L9092j52772j9671k3731l060k65493k71546N4085
13690b61065O9069k3696L35504J95448l11055l2205N1020J25761J90204p762j61849
13679A69374j96266O1094P3395N1627J75665n7323k70487k39632P3513K18232
13669E9192K23574q2493l89130J77809J52334p9456j4478n5746j64260J64496
13659h158Q7169J88592q6315m4716R2099K53309j32882l22953k67819O8158J76952
13648C436J44695j44783O4326j5565q9957Q822K86192p2028P0102m33583m33143
13637f11486K58269K42390P8886R0906m8141N3787L40616j16709k82756Q4214
$$ plain form
13711 74184 -21534 -193792 40057 138526 -79654 56537 110276 131434 -28322 104781
13701 104781 376640 374380 382031 421123 268351 248680 224949 221889 -43604 -315150 -261065
13690 -261065 -191996 -215692 119812 315260 4205 -28000 23020 148781 338985 331223 169374
13679 169374 -26892 34202 107597 159224 334889 277566 7079 -232553 -159040 59192
13669 59192 282766 200273 -188857 -11048 141286 61830 47352 -8394 -172654 -8158
13659 -8158 79011 267603 181288 136572 228671 481980 349098 26145 -241674 -173516 3436
13648 3436 148131 3348 67674 52109 -37848 -29026 257166 185138 255240 -178343 -611486
13637 -611486 -353217 -110827 -31941 58965 10824 64611 405227 288518 5762 89976
13627H9976J4763m622J83936j55017o1748K47075N2937p8219j85430p2829N1957
13616H2779j33018k4418n2856j88095M7781K14050J33209l4687K3133J21512j4226
13605A75164o4126j42817k00469K5744J24623J53238K72406J39937K52436j21297
13595F14839r2399l6793j39427P8368l0225M0390N7038j56928j82574k10857k3522
13584h2090j93679m4617M28294J28495j4581L2488k58209p8492K62171j51254
13574B8526N4757L78874n4111k00995j50230q2759J19424o6328l62568J00329
13564b35081J01078j61905L74796M3053L7975r9015o5231j41124l06631M06725
13554d5360P5422j70288j05108K359J19812k23766J76545O6155O1172k53593J15633
$$ plain form
13627 89976 104739 100117 284053 129036 67288 314363 367300 289081 103651 30822 82779
13616 82779 -50239 -74657 -127513 -315608 -267827 -53777 79432 44745 67878 189390 175164
13605 175164 111038 -31779 -232248 -206504 -81881 71357 343763 483700 736136 614839
13595 614839 522440 485647 346220 424588 394363 434753 491791 334863 152289 -58568 -82090
13584 -82090 -275769 -320386 107908 236403 221822 254310 -3899 -82391 179780 28526
13574 28526 83283 462157 408046 207051 56821 -25938 93486 27158 -335410 -235081
13564 -235081 -134003 -295908 78888 121941 159916 60901 -4330 -145454 -452085 -45360
13554 -45360 30062 -140226 -245334 -242975 -123163 -346929 -170384 -104229 -43057 -296650 -181017
13543a81017L01193j00781l39950K90596L18036m9206p0121K45828j37086j34301
13533A43191j99607J11283K2467k0061J29534k10406M6946l1793j21550l4549
13523a64545J56503J905j3849j29327R331J28547R0489M5089J44449L0807m9167
13512B50232n53194j60870P4094K46583J34083J66272M9463j68589K40989J00227
13502C79290l2219j06390J3035J81084k22033j17525r1590J80043J00520J09196
13492C93411k56437j31239M07799K6947j03414j8110j80985k09371J61420p5718
13482A4303m4919L24485j65871Q8436O7688m4563j06119j63195m55532J19375
13472c65912L28863k4787q4066K820L2143k2850J81846J29215j50941j67616k66256
$$ plain form
13543 -181017 120176 19395 -320555 -29959 288077 238871 168750 414578 277492 143191
13533 143191 -56416 54867 77334 57273 186807 -23599 23347 -8446 -129996 -164545
13523 -164545 -8042 -6137 -19986 -149313 -139982 -11435 79054 124143 268592 299399 250232
13512 250232 -302962 -463832 -389738 -143155 -9072 157200 206663 38074 279063 379290
13502 379290 347071 240681 253716 434800 212767 95242 3652 183695 284215 393411
13492 393411 136974 5735 413534 440481 337067 318957 137972 -71399 90021 14303
13482 14303 -30616 293869 127998 216434 284122 239559 133440 -29755 -485287 -365912
13472 -365912 -37049 -61836 -145902 -143082 -110939 -133789 48057 177272 26331 -141285 -407541
13461d07541j7326J60624L78019j04955Q3483J36953j75879n9928k10282N9048
13451a57784k14706k40121J53481L27473j99972o4327J37050k6760O897P3094
13441b05675k29413K45443J25623n6379M01034J12987k8503k19112R4895J27488
13431C68388j87m5132j96803j86198J43052J49383K8242L9938J64123O4814q2974
13420D46646k83669n4834k2155k77389j32773R750l154m4147J12484K25287K6806
13409B852K5444J7347k28286M4106Q9096L5267q4627r5214K7999J48742O3786
13398D6512l54188K6578J6903J0626m2074p9173P1057J48706J10660K76853J88201
13387D20661J35978r5369j81368k42387j64875l15910N2854M4879J10676N3046
$$ plain form
13461 -407541 -424867 -264243 113776 8821 92304 229257 53378 -6550 -216832 -157784
13451 -157784 -372490 -612611 -459130 -131657 -331629 -395956 -258906 -285666 -278769 -205675
13441 -205675 -435088 -189645 -64022 -120401 280633 393620 365117 146005 240900 368388
13431 368388 368201 323069 126266 -59932 83120 232503 260745 300683 464806 529620 446646
13420 446646 162977 108143 85988 -191401 -324174 -314424 -317578 -361725 -249241 -23954 2852
13409 2852 28296 45643 -182643 -138537 -49441 -14174 -98801 -194015 -166016 -17274 46512
13398 46512 -307676 -281098 -264195 -253569 -295643 -374816 -303759 -155053 -44393 232460 420661
13387 420661 556639 461270 279902 37515 -127360 -443270 -390416 -345537 -234861 -181815
13377a81815m8617O8997K0402n604j7559Q9145N2420L503J56766n9824j46423
13366f8609J99566Q805p6718J71623l7522k72454j40076J92652L30379J11220
13356D18866j27882j50448j40454k1019j29013R1152K25188P2787r9738l3346
13346A06093J81019j09157j04120J73944j0665p991n2586j13839l78116O6708
13336b48710J73560O6526k6310m566j45304K08902L65994k1355p3503m3519j09533
13325A42182j3470K67081M80711J1343k72807k97894J71921P7255j31099j47619
13315B87604k6236Q4511j51327j89220l34247J03784r696K72911J76938j01852
13305A13170j61627Q7175P6071N2869J3308K3690j10003j66717k58009J10352
$$ plain form
13377 -181815 -230432 -161435 -141033 -146637 -164196 -75051 -22631 -19128 137638 77814 -68609
13366 -68609 130957 139762 63044 234667 197145 -75309 -215385 -22733 307646 418866
13356 418866 290984 140536 82 -20937 -149950 -58798 166390 239177 139439 106093
13346 106093 287112 177955 73835 247779 237114 229123 176537 62698 -315418 -248710
13336 -248710 -75150 -8624 -34934 -39500 -184804 24098 390092 368737 295234 251715 142182
13325 142182 128712 395793 876504 887847 615040 317146 489067 566322 435223 287604
13315 287604 261368 345879 194552 5332 -328915 -225131 -234827 38084 215022 113170
13305 113170 -48457 38718 114789 167658 180966 204656 94653 -72064 -330073 -219721
13295b19721Q4629j99941q3072K83863L99037Q9285k6728M8814j57984j85559
13285C2623j61277q9423K01928K94275J19774R7767k57403k07321K07275J54266
13275C92484L8775j17084K17088p6507L0647l5600j19146l12380l8270r0988J68485
13264E7504J356L3032J81179J45162q1591J26349j55754k27595N4743j14496k48920
13253b29031J03302j25035J58482K88599n5042j57384k95685l1786K08380J23461
13243a1739J91025j64666j29576P131K73599L45651q397l4685M6170k14622l50211
13232e0320j09048L33498J54502R5947m26084O1355K68216n6852l31463j05947
13222a66196J92518J38200K60933n21J7379M6167j36828o37m7874k43257Q0241
$$ plain form
13295 -219721 -135092 -335033 -418105 -134242 264795 354080 327352 376166 218182 32623
13285 32623 -128654 -218077 -16149 278126 397900 495667 238264 30943 238218 392484
13275 392484 431259 314175 531263 454756 485403 449803 330657 18277 -19993 -110981 57504
13264 57504 58860 91892 273071 418233 336642 462991 307237 79642 134385 19889 -229031
13253 -229031 -125729 -250764 -92282 196317 141275 -16109 -311794 -343580 -135200 -11739
13243 -11739 179286 14620 -114956 -107825 165774 511425 503028 468343 514513 299891 -50320
13232 -50320 -159368 174130 328632 424579 -1505 59850 328066 271214 -60249 -166196
13222 -166196 26322 164522 425455 424934 442313 488480 351652 351015 303141 59884 140125
13211A40125J16633j59123R4455K35732k3748L18467K43268j30571l42886j7836
13201D74516K77180N6792p0209J9086k89443j98771K40052J57232j1056l97159
13191B58220p391k5203j65837J80364J4683N082k40434L88253L19351j92529j80097
13180C54462j40690O2500k15121J84488J17456m8836j1773k53172j02102K60405
13170B07617J43964R0956J18446J61268r284j65688J88993m0785k71743L1302
13160D55046K55747l8623j57378q3512J67957j19633j57926r8368N6064J05389
13150C84763J07654K248n3786Q3379P3855o9827J18293n2928k28796k69996J58743
13139B53602K32065j40600k54324J79450J68772o2254N2147N4962R4161k57888
$$ plain form
13211 140125 256758 97635 192090 427822 404074 722541 965809 835238 492352 474516
13201 474516 751696 808488 738279 757365 467922 269151 509203 666435 655379 258220
13191 258220 250829 225626 59789 240153 254836 259918 19484 407737 727088 534559 354462
13180 354462 213772 276272 61151 245639 363095 314259 302486 49314 -52788 207617
13170 207617 351581 442537 560983 722251 712967 547279 736272 695487 423744 455046
13160 455046 710793 672170 514792 431280 599237 479604 321678 223310 279374 384763
13150 384763 492417 494665 440879 524258 598113 528286 646579 593651 364855 94859 253602
13139 253602 485667 345067 90743 270193 438965 376711 428858 483820 577981 320093
13129C20093j03382p8715J83524J3858J44987J24966k67439q9039r5590q2992
13119G0271k07252l7767N8890L86764J96175j94183k70523q6615p9267J31053
13109c2454M17949J20952o0174q3701m8202j86952j43424J31651K80375N7419
13099D53439k53814j77131J48750J19308r0254p800K784k06784l83023l8537Q2923
13088c50139K96102L05866J54766P7959k68446j27284k49386K48627K4232M5912
13078A58209O6052M1458j1274k45687j43057L3046Q9129N8650K42293J36076j83125
13067B41770j95461k9007J00874J27044j68798q0676m1387J8540J29981K9687
13057A32567k53984k22073N9799R2718j00865L33921O1819m5767j735j04986R163
$$ plain form
13129 320093 216711 137996 321520 335378 480365 605331 337892 248853 153263 70271
13119 70271 -136981 -174748 -115858 270906 467081 272898 2375 -84240 -163507 -32454
13109 -32454 385495 506447 446273 362572 314370 127418 -16006 115645 396020 453439
13099 453439 199625 22494 171244 290552 200298 192498 195282 -11502 -394525 -433062 -350139
13088 -350139 -54037 251829 406595 484554 216108 88824 -160562 88065 112297 158209
13078 158209 224261 265719 254445 8758 -134299 -101253 -12124 46526 288819 424895 241770
13067 241770 46309 17302 118176 245220 76422 -4254 -45641 -27101 102880 132567
13057 132567 -121417 -343490 -283691 -190973 -291838 42083 103902 58135 56400 -48586 -39423
13046c9423M359l270J8184J94587m7775n0269r1963J52657j38658j59359J52818
13035h112J07487j15457J36446L29373L0295r3783k11270N6619O9332j72006q6373
13024D2551k04262r6808Q9628n9214J50342K86921j51204p5581Q160J69356P6772
13013B36661j23885J15223J18628P0280l75210k50764J72448K55914K4383j80703
13003F2975m3738J69698J89557j57665k01762J43697K3291j86466J19793m5565
12993G3815j88812p8118O7038M14705j47056j87315J67103J65235P938J12817
12983D07350n7187j02674M7097M910k7080m5193k863J85020j86056k5379J15519
12972C13464J11981j93695r8049k07262J9348K06623j26518Q9315K50082k9728
$$ plain form
13046 -39423 -35064 -38334 -20150 174437 126662 76393 -15570 137087 -1571 -160930 -8112
13035 -8112 99375 -16082 120364 449737 480032 386249 174979 231598 300930 128924 42551
13024 42551 -161711 -258519 -168891 -228105 -77763 209158 57954 -17627 -9467 159889 236661
13013 236661 112776 227999 346627 416907 41697 -209067 -36619 219295 243678 62975
13003 62975 19237 188935 378492 220827 19065 162762 186053 -413 119380 73815
12993 73815 -114997 -193115 -126077 288628 141572 -45743 121360 286595 294533 407350
12983 407350 350163 247489 294586 299496 272416 227223 224360 409380 223324 197945 313464
12972 313464 425445 231750 133701 -73561 -54213 152410 25892 115207 365289 335561
12962C35561l82815m8158J5784J10315J74954q0349j0704j46847k48562R4536
12952a86285K54785K64932k6668r0891j01695J28676p6122q5390M0639K50933
12942C72914K01889j60510k16689l49709N6723K06731j43073K1462j1055j28976
12932a50293n0131j90211r2501J78869M35867L90719l4953j49003J53220j99561
12922B92022q3675k28458j766k0496K71135P7748j26096m7535n4407j99936J06659
12911a4805J81483n480K19314R5669j92385l46883J02711L5263l45018j08792
12901c78923K06792K35054p4397j19485J64778J86417j13390P9554l8849r9990
12891D7561r7510n9098J8635K0977L1257K32578J3489j01413L8753J00234O9179
$$ plain form
12962 335561 -47254 -95412 -79628 30687 205641 125292 114588 -32259 -280821 -186285
12952 -186285 68500 333432 306764 215873 114178 242854 166732 81342 121981 372914
12942 372914 574803 414293 197604 -152105 -95382 111349 -31724 -10262 -21317 -150293
12932 -150293 -200424 -390635 -483136 -304267 131600 522319 487366 338363 491583 292022
12922 292022 208347 -20111 -21877 -42373 228762 306510 180414 132879 78472 -121464 -14805
12911 -14805 166678 161198 380512 476181 283796 -63087 39624 74887 -270131 -378923
12901 -378923 -172131 62923 -11474 -130959 33819 220236 106846 186400 147551 47561
12891 47561 -49949 -109047 -90412 -69435 -38178 194400 207889 106476 145229 245463 314642
12880C14642J65252r7137k26436L4457J47888K68872J75173n1874O4626l93773
12870D01690l28084j98416J6989J54526J50792L01356k81995k77496p3343J21661
12860a2320O2586K28566J74510l73966k03828k46398j12690K67933J69039J04949
12850E8381J08760M1380j14308J42023L31120q4551r8764m1605N0809k12908j27593
12839E2744j281J10177K3870J69161J22550j30781k45834n0883L44076N2344k30829
12828B15314N8577Q7806M7880j54211j89098j29839L92002K53231o4740j38884
12818C78038l1418k6510p6347p0931j0786L78630j13755j19742k55K05996k9676
12807D83244k63138M8647K40716N8330p8971k90046r9310j41723J41273J31007
$$ plain form
12880 314642 479894 382757 156321 190778 338666 607538 782711 730837 795463 401690
12870 401690 73606 -124810 -107821 46705 197497 498853 216858 -60638 -133981 -12320
12860 -12320 50266 278832 453342 79376 -124452 -370850 -483540 -215607 -46568 58381
12850 58381 167141 208521 94213 236236 567356 482805 384041 342436 393245 180337 52744
12839 52744 51463 161640 185510 354671 477221 346440 100606 49723 393799 446143 215314
12828 215314 273891 361697 409577 255366 66268 -63571 328431 581662 516922 378038
12818 378038 346620 320110 243763 172832 162046 540676 426921 307179 306924 512920 483244
12807 483244 220106 268753 509469 567799 488828 198782 99472 -42251 99022 230029
12797B30029J38247j24399l61875Q5932Q0086L4418l19529p9931K85905L95226
12787C64109J29323j6468k65139J25900J08375q8344K1622O1389J80860l852j56091
12776D61684j55050k41986K46292k8347j49794o889J60376L2515J10845J94913
12766F24559j31007k59024R4527k09136l07411J99823J69800M7876k6244J72878
12756C76641j54634N924N3520l4844j24956j37554n7037N908J60232J09039K96987
12745D99226j40398p9082k5678L9851r7759j46116K0928j91598k14803J05201
12735b30228O8338M5491J85513J92159o135o8958K58873n6988J84595R7257j45434
12724E24483j33948K7390N737K5303K36238q5513J97456J89732l37201m67512
$$ plain form
12797 230029 368276 243877 -117998 -32066 48020 82438 -237091 -317022 -31117 364109
12787 364109 493432 476964 211825 337725 446100 357756 379378 440767 621627 617775 461684
12776 461684 306634 64648 310940 282593 132799 125910 286286 318801 429646 624559
12766 624559 493552 234528 329055 119919 -187492 12331 182131 230007 203763 376641
12756 376641 222007 227931 281451 246607 121651 -15903 -72940 -67032 93200 202239 499226
12745 499226 358828 279746 254068 293919 196160 50044 70972 -120626 -335429 -230228
12735 -230228 -161890 -116399 69114 261273 255138 186180 445053 388065 572660 669917 524483
12724 524483 390535 417925 423662 448965 685203 599690 797146 986878 649677 182165
12714A82165L6475j78766N3227K23685j24717k57645L03025K12822Q8337k8562
12704E10046k06651R4876q2977P2321j37734J06164q4973q888J44353L5503J08835
12693E50875j79789j54594L0154Q1612k3541K40640J2374m0210k71424L5441J52839
12682D34377N4696k13649r0130N5560J55418n7023N7300J66004J80330k38163
12672E04720P3665O9117J73360j72406k39732j03467K08031J34554J08309J03699
12662H59850j42009m6294J28724j82200j40280Q4078K0574n686K11907J22932
12652I11596j76743j24563J22026J3667j12704J09385j30598M1178J8132K6981
12642F98357m94l2218J48169J78865m6958k43323j23568l55464j92865J25112
$$ plain form
12714 182165 218640 39874 93101 316786 192069 -65576 237449 450271 538608 510046
12704 510046 303395 398271 315294 387615 249881 356045 271072 262184 406537 442040 550875
12693 550875 371086 216492 246646 328258 304717 545357 557731 517521 246097 281538 434377
12682 434377 489073 275424 185294 240854 396272 339249 396549 562553 742883 504720
12672 504720 578385 647502 820862 648456 408724 305257 513288 647842 756151 859850
12662 859850 717841 671547 800271 618071 477791 561869 582443 576757 788664 911596
12652 911596 734853 610290 732316 745983 633279 742664 612066 653244 671376 698357
12642 698357 697863 665645 813814 992679 945721 702398 578830 223366 30501 155613
12632A55613m5748J32932Q0489q8981Q8225M4879O4627J9428K85597K54522j04004
12621H87579k14499j31225N823l7123j74269Q4411J31530j13149k5596p6367J27700
12610D64815L27058K18585J16364k01316p6691J515K4005k52241j38496n407P6181
12599E54372J20561J74556M9534Q1837o6679K310k00754J09505k116O1736k1163
12588H63699P3189K0077J94190N3409P2107j57521J17852J31431k40911l69026
12578G58496k50560j85842j67824m1955K18057J67199K50399j05057L3468J3827
12568F90208L648K56103J18126r4098k95996p9227M6900j43963K41008J85587
12558I28296q2013K68783M9520j56265N0707O9281O2229r1070N4918p7351k00416
$$ plain form
12632 155613 109865 242797 323286 234305 322530 367409 432036 451464 737061 991583 887579
12621 887579 673080 541855 547678 510555 336286 420697 552227 439078 413482 337115 464815
12610 464815 791873 1010458 1126822 925506 848815 850330 874335 622094 483598 478191 554372
12599 554372 674933 849489 899023 980860 914181 916491 715737 825242 823126 884862 863699
12588 863699 936888 956965 1151155 1204564 1276671 1119150 1237002 1368433 1127522 758496
12578 758496 507936 322094 154270 112315 330372 497571 747970 642913 676381 690208
12568 690208 693856 949959 1068085 973987 677991 598764 645664 501701 742709 928296
12558 928296 846283 1115066 1164586 1008321 1059028 1128309 1190538 1099468 1154386 1077035 876619
12547H76619Q5095L17j84906j10400q3768L73678O3235K0589k17451m5307m1522
12536G36179J20324K18660J76635r093q4155m39646j92835J73417m9725j00108
12526E49653Q7901L4508q8142k11136J29942J23983K22666n9614l9094M8819k28515
12515E70971P0028L15606J0220k19764j58347k64539Q0587L24218L9489k178o5035
12504G01256M04703J53144N714p3055j16479j7918r1923m2895P9629K58281J59147
12493A419604o865j02287Q4988l7412r8199J32873K11208j32234k68122R3040
12483A296594K92671N6481J6764K09631m5818j85435j49824j01615P7780j89776
12473A277453J73252K73470j56654l18875j4054R6474j30070N2269o1602L9785
$$ plain form
12547 876619 961714 962031 777125 666725 582957 956635 1019870 1040459 823008 777701 736179
12536 736179 856503 1075163 1251798 1242705 1158550 718904 526069 699486 649761 549653
12526 549653 637554 672062 583920 372784 502726 626709 849375 789761 750667 799486 570971
12515 570971 640999 956605 966825 747061 588714 324175 404762 728980 768469 766291 701256
12504 701256 1105959 1259103 1264817 1191762 1075283 1057365 965442 922547 1002176 1260457 1419604
12493 1419604 1412739 1310452 1395440 1358028 1259829 1392702 1603910 1471676 1203554 1296594
12483 1296594 1589265 1645746 1662510 1872141 1826323 1640888 1491064 1389449 1467229 1277453
12473 1277453 1450705 1724175 1567521 1248646 1234592 1331066 1200996 1253265 1191663 1231448
12463A231448l86879o0243K07807Q4387J28924K9989j7048j65982k07443p8401
12453G66559J94536P9323J61450m7026j54399R5459J44553Q1637j19503k6938
12443A175651k75699k44139K38638K41719j13916O1678J94436k47997r0879J20441
12433A059933P7067K08769k13986r8752J75068J5808O130j58838j06138K04731
12423A169792R6375n9964R4423j59835o5522m2281K58975M2528k3396K85635J17860
12412A714590k68423n57075R8917J96242j29741j83626J30611K29583K32580m5185
12402A418473j80720j02487K26159L99530J22764j01793j39510o7024j43228J17486
12392A549650L2579O5136J49577O3680K86774k16022k64749k18160N85K47084
$$ plain form
12463 1231448 844569 784326 992133 1076520 1205444 1235433 1218385 1052403 844960 766559
12453 766559 961095 1040418 1201868 1154842 1000443 1095902 1240455 1322092 1202589 1175651
12443 1175651 899952 655813 894451 1136170 1022254 1083932 1278368 1030371 939492 1059933
12433 1059933 1137000 1345769 1131783 1033031 1208099 1223907 1230037 1071199 965061 1169792
12423 1169792 1266167 1206203 1300626 1140791 1075269 1032988 1291963 1334491 1311095 1596730 1714590
12412 1714590 1446167 889092 988009 1184251 1054510 870884 1001495 1231078 1463658 1418473
12402 1418473 1237753 1135266 1361425 1760955 1883719 1781926 1642416 1575392 1432164 1549650
12392 1549650 1582229 1647365 1796942 1860622 2147396 1931374 1666625 1448465 1449050 1696134
12382A696134N0134N1882Q9686k41594j73084m3331L0410P1555L5895J63592J15722
12371A847001J03118K901j78936R1116j47647J32856j47457j3357j28911P2933
12361A633617K74885k34681o6073L60167M40950K3103k67832j93203N0956m2119
12351A979770k44592O9315K82201J11165J32839j7060q1667n0291L39804k0850
12341B500634p1032N2371J83805K61634J78482j45783k52437l5185J30409K37416
12331C040314J80027K87179K78138J07543k18033n6751R8025J1841l29911l06019
12321C092353K07988J69437j01686J25210K97303j8986q1187k88821J05274L6731
12311C543616R1974j12927m8979L56477J16964M26194K72334Q0845j30083k6339
$$ plain form
12382 1696134 1746268 1798150 1887836 1646242 1473158 1429827 1460237 1531792 1567687 1731279 1847001
12371 1847001 1950119 1953020 1774084 1865200 1717553 1850409 1702952 1689595 1560684 1633617
12361 1633617 1908502 1673821 1607748 1967915 2408865 2431968 2164136 1970933 2021889 1979770
12351 1979770 1735178 1804493 2086694 2197859 2330698 2313638 2231971 2181680 2521484 2500634
12341 2500634 2429602 2481973 2665778 2927412 3105894 2960111 2707674 2672489 2802898 3040314
12331 3040314 3220341 3507520 3785658 3893201 3675168 3618417 3716442 3728283 3398372 3092353
12321 3092353 3300341 3469778 3368092 3493302 3790605 3771619 3690432 3401611 3506885 3543616
12311 3543616 3635590 3522663 3473684 3830161 3947125 4373319 4645653 4726498 4596415 4570076
12301D570076O23634M95618K95956N41205O01733N25443P71768N58726N22801
12292I506960Q14048J129531J023068J130313J022950J206822Q78172O66879M03029
12283A7781772N01411L33872J38576J30334m3596k12809m14706l30284p85577
12274A7098993p33576n76243p67069k41912j75138o91664l37507m85361l60468
12265A2730055k44723l15600N6117M30005M04888M49627L35085N05215L37847
12256A4688516P40549R67609P54285R64617J350805R97033J227035J617740J714956
12247B5023145J744119K042582K161956J937549J740349J960728J876468J551436
12239D0038332J331250J296784J111019R77891Q17109O17135M42279M04398K37513
$$ plain form
12301 4570076 5193710 5689328 5985284 6526489 7128222 7653665 8425433 8984159 9506960
12292 9506960 10321008 11450539 12473607 13603920 14626870 15833692 16711864 17378743 17781772
12283 17781772 18283183 18617055 18755631 18885965 18842369 18629560 18214854 17884570 17098993
12274 17098993 16365417 15789174 15022105 14780193 14605055 13913391 13575884 13090523 12730055
12265 12730055 12485332 12169732 12225849 12655854 13060742 13510369 13845454 14350669 14688516
12256 14688516 15429065 16396674 17150959 18115576 19466381 20463414 21690449 23308189 25023145
12247 25023145 26767264 28809846 30971802 32909351 34649700 36610428 38486896 40038332
12239 40038332 41369582 42666366 43777385 44755276 45572385 46189520 46631799 47036197 47273710
12230D7273710L60341j19558m52101o16281r09304j328800j016571r61900j317162
12221D0912374j272531j788872k089476j458885j280914j379930j038665o64603
12213B9938498n66281m45242J76948L82396M42830Q2597O30786Q53408J070543
12204C2566483J275659J430867J382320J257956J427153J725682J880557J974891
12196D4921568K394140K547522K318410K858139L076129K825381L010840L022538
12188F6974667K622631J987218J165471Q93553M98429n95301q81154j158211j879737
12179F9627566k650720k889448k745857k746359k805537k725543k485064k083163
12171D8495875j908758j578369j454755j752736j684130j423176r50321j066440
$$ plain form
12230 47273710 47634051 47514493 47062392 46446111 45536807 44208007 43191436 42229536 40912374
12221 40912374 39639843 37850971 35761495 34302610 33021696 31641766 30603101 29938498
12213 29938498 29372217 28926975 29103923 29486319 29929149 30011746 30642532 31495940 32566483
12204 32566483 33842142 35273009 36655329 37913285 39340438 41066120 42946677 44921568
12196 44921568 47315708 49863230 52181640 55039779 58115908 60941289 63952129 66974667
12188 66974667 69597298 71584516 72749987 73643540 74141969 73546668 72665514 71507303 69627566
12179 69627566 66976846 64087398 61341541 58595182 55789645 53064102 50579038 48495875
12171 48495875 46587117 45008748 43553993 41801257 40117127 38693951 37743630 36677190
12163C6677190j400898j358001q19804o59613n81526k37276K62134N15742N82312
12154C2980260R24432R53329J066881J447680K042558K133310J878489J753820
12146D5180759J853873J607991J475303J510487J282559Q12103J079143M35788
12138E5238006K91183K84847k1636l04534k57931o73293j011719j108343j190151
12129E1246429j242637j489502j723272j800337k101918k288100k104270j899701
12121C6596692k222941k091494j833110j750166j298990j400534j025988p91397
12113B4182072q87939p57456r47425m86200n6617k40853o5433M1710k85207k12536
12103B0284116L20015J32755J05186O53531Q13044P75714P98329O29303R71905
$$ plain form
12163 36677190 35276292 33918291 33098487 32438874 31857348 31620072 31882206 32397948 32980260
12154 32980260 33904692 34858021 35924902 37372582 39415140 41548450 43426939 45180759
12146 45180759 47034632 48642623 50117926 51628413 52910972 53723075 54802218 55238006
12138 55238006 55529189 55814036 55792400 55487866 55229935 54556642 53544923 52436580 51246429
12129 51246429 50003792 48514290 46791018 44990681 42888763 40600663 38496393 36596692
12121 36596692 34373751 32282257 30449147 28698981 27399991 25999457 24973469 24182072
12113 24182072 23294133 22536677 21589252 21103052 21046435 20805582 20740149 20781859 20496652 20284116
12103 20284116 20604131 20736886 20842072 21495603 22308647 23084361 23882690 24511993 25483898
12094B5483898J179625J159210R12721Q35097O29085N28163L61871M7962J60972
12085C1298604k61066o64838m60229p30949r23327p57197m28141m29555n44265
12076B6099037k79217o06099l42983j26654R9032L05787N31577P48316R49046
12067B7377842J305368J052752J252534J932147J793394J968818K282262K575967
12059D1541084K597489L005813L201149L167425K961318K529350K256019K434953
12051F3694600K583854J886395J766480J512450J359864J384673J163428J118415
12043G6470159J159945J637687J840854K188787L048042L510341L586351M319510
12035I7761676M541342M512981M837378M767997M054852L500945K482682J649503
$$ plain form
12094 25483898 26663523 27822733 28735454 29570551 30199636 30727799 31089670 31137632 31298604
12085 31298604 31037538 30372700 29912471 29181522 28258195 27500998 27072857 26643302 26099037
12076 26099037 25819820 25213721 24870738 24744084 24843116 25148903 25680480 26428796 27377842
12067 27377842 28683210 29735962 30988496 32920643 34714037 36682855 38965117 41541084
12059 41541084 44138573 47144386 50345535 53512960 56474278 59003628 61259647 63694600
12051 63694600 66278454 68164849 69931329 71443779 72803643 74188316 75351744 76470159
12043 76470159 77630104 79267791 81108645 83297432 86345474 89855815 93442166 97761676
12035 97761676 102303018 106815999 111653377 116421374 120476226 123977171 126459853 128109356
12027A28109356J030747R2057j216526j972876k592243l666900m270185m039749
12019A11473681m159707l682164l476144l307331k688404k120594j644262r16614
12011H9478461n31611j79368L89143L63950l69790j18545l03552n40762j142950
12002H7044976j618139j838234k031255k204572k380076k131818k404073k219417
11994G0217392k078714k040940j587359j108110p47052m7920O9238P94618J090526
11985F4561679J647908K434279K970376L214312L576703L882075M513164M969736
11977I1770232N258624N239594N232156N207817N259149N389434N053846M584038
11969A32994890M691632M399557M176980M332890M848115M915437N503106O497851
$$ plain form
12027 128109356 129140103 129232160 128015634 126042758 123450515 119783615 115513430 111473681
12019 111473681 107313974 103631810 100155666 96848335 94159931 92039337 90395075 89478461
12011 89478461 88946850 88767482 89156625 89520575 89150785 89032240 88728688 88187926 87044976
12002 87044976 85426837 83588603 81557348 79352776 76972700 74840882 72436809 70217392
11994 70217392 68138678 66097738 64510379 63402269 62655217 62607297 62676535 63471153 64561679
11985 64561679 66209587 68643866 71614242 74828554 78405257 82287332 86800496 91770232
11977 91770232 97028856 102268450 107500606 112708423 117967572 123357006 128410852 132994890
11969 132994890 137686522 142086079 146263059 150595949 155444064 160359501 165862607 172360458
11961A72360458P575707Q579359R876847J1667981J3308051J5071124J6555494
11954B54995021J8416220K0174072K1529348K2855172K4230024K5070578K4722041
11947D11992476K4113908K2249664J9979682J6301197J2266105P647823K512314
11940E17063169k559200p111358j1269897j5434165j9023178k1422742k3604926
11933D16637703k4680852k4808570k4042279k2513133k0361012j8812926j6768078
11926B64650853j5311693j4160999j3106051j2242493j1211737j0892959j0588640
11919A77136281j0137394r347300q967068q725887q179675p935515p344297p030924
11911A09468221o696731n906588n175337m774101m581932m193323l538126l454509
$$ plain form
11961 172360458 179936165 188515524 198392371 210060352 223368403 238439527 254995021
11954 254995021 273411241 293585313 315114661 337969833 362199857 387270435 411992476
11947 411992476 436106384 458356048 478335730 494636927 506903032 514550855 517063169
11940 517063169 514503969 507392611 496122714 480688549 461665371 440242629 416637703
11933 416637703 391956851 367148281 343106002 320592869 300231857 281418931 264650853
11926 264650853 249339160 235178161 222072110 209829617 198617880 187724921 177136281
11919 177136281 166998887 157651587 148684519 139958632 131778957 123843442 116499145 109468221
11911 109468221 102771490 96864902 91689565 86915464 82333532 78140209 74602083 71147574
11903G1147574l401944k929572k559057k568448k401112k232496k158260k201932
11895E0694753j950848j975873j842074j449918j619564j806221j121023j074937
11887C7854295j426436j229981j331334j177674j372688j254378j057548r75052
11879B8029204r65245p79591o88230o64558n92299o32180o53879o09940o81989
11870B1761293m25501m96934o74534r2781m15832n56608n83131l73445l27147
11861A7815380n33027p31011l74817o42605k52394j90361k32784k53976n46396
11852A4058009l80709m76569j39826m02287n28017k65396M9490k10840m83163
11843A1220692l56733n02645k28652l85620l24109j4525j1586j28694l52874n19000
$$ plain form
11903 71147574 67745630 64816058 62257001 59688553 57287441 55054945 52896685 50694753
11895 50694753 48743905 46768032 44925958 43476040 41856476 40050255 38929232 37854295
11887 37854295 36427859 35197878 33866544 32688870 31316182 30061804 29004256 28029204
11879 28029204 27063959 26284368 25596138 24931580 24339281 23707101 23053222 22443282 21761293
11870 21761293 21335792 20838858 20164324 20071543 19655711 19099103 18515972 18142527 17815380
11861 17815380 17282353 16551342 16176525 15533920 15281526 15091165 14858381 14604405 14058009
11852 14058009 13677300 13200731 13060905 12658618 12130601 11865205 11914695 11703855 11220692
11843 11220692 10863959 10361314 10132662 9747042 9422933 9408408 9396822 9268128 8915254 8396254
11833H396254l41395k18167j88233l6444j23155o9288P3848l12408r4533J90541
11823G277020l60806k66110j96232k48292J49929K07799m7545l6753m1242j14922
11813F322846k54978o2025K9514o7210l1720r7298l26068l6679L04643j58482
11803E622543k37243j10845j83077r5561J77008k05892L3738r570J11108J95704
11793E297913k57206k29480Q1361K19133j38860j19509j05853j00744j19486N4835
11783D582104j35862N9738R1605q5105l4472j4870j58848j90053k049O0679M9203
11772D222070Q5562J3838j8988n3546M8995l27988j09365Q7382p651l1527J02225
11761D011007q4406R1511r5864l29480k21916K87863J26511Q2679J0918l52587
$$ plain form
11833 8396254 8054859 7836692 7648459 7612015 7488860 7419572 7493420 7181012 7086479 7277020
11823 7277020 6916214 6650104 6453872 6205580 6355509 6563308 6515763 6479010 6437768 6322846
11813 6322846 6067868 6005843 6035357 5968147 5936427 5839129 5513061 5476382 5781025 5622543
11803 5622543 5385300 5274455 5091378 4995817 5172825 4966933 5000671 4991101 5102209 5297913
11793 5297913 5040707 4811227 4892588 5111721 4972861 4853352 4747499 4646755 4527269 4582104
11783 4582104 4446242 4505980 4597585 4512480 4478008 4463138 4304290 4114237 4112188 4172867 4222070
11772 4222070 4307632 4321470 4302482 4248936 4297931 3969943 3860578 3947960 3940309 3908782 4011007
11761 4011007 3926601 4018112 3922248 3592768 3370852 3658715 3785226 3867905 3878823 3526236
11751C526236j58491l18425M6168j08223K54133K45615k54094j3380p3843K1659
11741C167355j10l51039j84104o9262O798K69932K17358L37169M9291j56084L3471
11730C320775n190q7669O1594p8508J92152j17132j34914j2661k55874O0082K22708
11719C165363J50770m8122k36295J84809L15587J54391l38963l46992j12466K21993
11709C110075K16995n2577N7655n7060K9357J84351l71019l814q5264R7691M3826
11698C170216k36640p7391m7782J88670K23185P402l33411k43486J70083K86338
11688C107184J2717o9424M5100j59887J93489L26147j33236m46104q993K70056
11678C137049K87162q4265l32888p8339k14853j6477J87847J29597J65893L04630
$$ plain form
11751 3526236 3367745 3049320 3095488 2987265 3241398 3487013 3232919 3219539 3145696 3167355
11741 3167355 3167245 2816206 2632102 2562840 2569638 2839570 3056928 3394097 3443388 3287304 3320775
11730 3320775 3315585 3227916 3289510 3211002 3403154 3286022 3151108 3138447 2882573 2942655 3165363
11719 3165363 3316133 3268011 3031716 3216525 3532112 3686503 3347540 3000548 2888082 3110075
11709 3110075 3327070 3274493 3332148 3275088 3304445 3488796 3117777 3113963 3028699 3126390 3170216
11698 3170216 2933576 2856185 2808403 2997073 3220258 3227660 2894249 2650763 2820846 3107184
11688 3107184 3119901 3050477 3095577 2935690 3129179 3455326 3322090 2875986 2866993 3137049
11678 3137049 3424211 3339946 3007058 2928719 2713866 2697389 2885236 3014833 3180726 3485356
11668C485356J33577m3377P0527M99215K74053R1335J08624K99279K42271L59671
11658E520531K85165q5087j61192k54881p8176j5332Q6687j65272k72319L3177
11648D893301p3720J65089K583K08222N88041Q7689l7257k04621J80580J95129
11638F005036J75902K79432N08387N19142J99966K98606L27469O32201O24957
11629I571098N55636M08290K36511L21496Q1237p3052K32481N50345M0009n73070
11619A1350981n28284k52797m3496p4546o5606j44425j51753J58144L2892n8275
11609A0222835K00003L95075n1682L28828L46599J98332J46676M41296J41157
11600A2369119L20380P37586P26200P09794Q44365J067212J181477J331219J367056
$$ plain form
11668 3485356 3618933 3575556 3646083 4145298 4419351 4510686 4619310 4918589 5160860 5520531
11658 5520531 5805696 5720609 5559417 5304536 5226360 5211028 5297715 5132443 4860124 4893301
11648 4893301 4819581 4984670 4987253 5195475 5783516 5871205 5833948 5629327 5809907 6005036
11638 6005036 6180938 6460370 6968757 7487899 7687865 7986471 8313940 8946141 9571098
11629 9571098 10126734 10535024 10771535 11093031 11174268 11101216 11333697 11884042 11924051 11350981
11619 11350981 10822697 10569900 10526404 10451858 10386252 10241827 10090074 10248218 10281110 10222835
11609 10222835 10422838 10817913 10766231 11095059 11441658 11639990 11786666 12227962 12369119
11600 12369119 12689499 13427085 14153285 14863079 15707444 16774656 17956133 19287352 20654408
11591B0654408J494703K002609K121690K186172K543237K685989L170534L392857
11583D0252199L429436L490753L664036L407883L000660K556096J800289J062007
11575F2663359Q09760M82851k14173r68913j501818k028569k063060k620326k418925
11566E2140186k388361k396761k589357k234255j646802j643763j278514r79197
11558C6983176m41683k98070j60056r794R2801M82271Q05424J066343J212950
11549C9733362J576227J657749K191395K435979K759293L130819L153206L371994
11541F0010024L710840L809999L980955L838445L570290L354815L350302K824410
11533H8450080K350131K134298J901788J325903J015146J036581R04361M92209
$$ plain form
11591 20654408 22149111 24151720 26273410 28459582 31002819 33688808 36859342 40252199
11583 40252199 43681635 47172388 50836424 54244307 57244967 59801063 61601352 62663359
11575 62663359 63473119 63955970 63741797 62772884 61271066 59242497 57179437 54559111 52140186
11566 52140186 49751825 47355064 44765707 42531452 40884650 39240887 37962373 36983176
11558 36983176 36541493 36243423 36083367 36073573 36166374 36648645 37454069 38520412 39733362
11549 39733362 41309589 42967338 45158733 47594712 50354005 53484824 56638030 60010024
11541 60010024 63720864 67530863 71511818 75350263 78920553 82275368 85625670 88450080
11533 88450080 90800211 92934509 94836297 96162200 97177346 98213927 99118288 99610497
11525I9610497L98547L76495J19894k56643l37231o64994r08808j479654j777565
11516I5080538k219329k342048k777408k987577k971391k660194k571863k419651
11508G4131077j986614j545495q14254m78188l72883L71152J225209J511038J717574
11499G3758616J695299J932707K000581J296453J371772J289701O03304M37431
11491H4385864N29617K38621j70442J5509O34633P94064J239902J075386J903778
11482I0646932K179735K114614J442905J239979J028813L93496j96369r06205
11474I7943900j647523k087537k351593k918020l151601l606570l183892k869940
11466G6127224k461113k041572j598357j087478j54203L44771P71727R50431J278008
$$ plain form
11525 99610497 100009044 100385539 100505433 100248790 99911559 99246565 98337757 96858103 95080538
11516 95080538 92861209 90519161 87741753 84754176 81782785 79122591 76550728 74131077
11508 74131077 72144463 70598968 69784714 69306526 68933643 69304795 70530004 72041042 73758616
11499 73758616 75453915 77386622 79387203 80683656 82055428 83345129 83948433 84385864
11491 84385864 84915481 85154102 84983660 84999169 85633802 86427866 87667768 88743154 90646932
11482 90646932 92826667 94941281 96384186 97624165 98652978 99046474 98850105 97943900
11474 97943900 96296377 94208840 91857247 88939227 85787626 82181056 78997164 76127224
11466 76127224 73666111 71624539 70026182 68938704 68784501 69129272 69900999 70851430 72129438
11457G2129438J544888J640258J285761J030078J247885J096915R72143N95932
11449H1543298M12911M46849K05418N8442j51548m79234l96316q4591k62407p19865
11439H0572957j100854j166795j730855j839391j769766k230676l036931k714971
11431F4982718k831297k613136k379358k884268l037927l048387k636724k280622
11423D3270999j807171j946673j512151j121032j014447r48438q06103p65337
11415C3349647k35690J8311R2985K72097M32924J199045J308813R49839J485049
11406C8873020J507353J880172K323921K337307K281452K272760K289503J527132
11398E5292620J679464R19858M7397m11382p31811j306354j903482k257958k403351
$$ plain form
11457 72129438 73674326 75314584 76600345 77630423 78878308 79975223 80947366 81543298
11449 81543298 81956209 82403058 82608476 82666918 82515370 82036136 81639820 81555229 81292822 80572957
11439 80572957 79472103 78305308 76574453 74735062 72965296 70734620 67697689 64982718
11431 64982718 62151421 59538285 57158927 54274659 51236732 48188345 45551621 43270999
11423 43270999 41463828 39517155 38005004 36883972 35869525 34921087 34114984 33349647
11415 33349647 33113957 33132268 33225253 33497350 33930274 35129319 36438132 37387971 38873020
11406 38873020 40380373 42260545 44584466 46921773 49203225 51475985 53765488 55292620
11398 55292620 56972084 57891942 57939339 57527957 56796146 55489792 53586310 51328352 48925001
11389D8925001k652834k911651l180024l102366k742171k544275k454605k254869
11381B7082206k061557j608491j540415r77613j008587j332369r08903j225939
11373A6418332r21540q34185n22750n90153m74534l03583n06350m49347m17713
11364A1398177m2020M2732j22243j59557K13911Q3293l12277M7481M0775m7561
11354A1142711J64636O2474k25764j10861k03264j72516j87875j99816l48028
11345I921697R5321l11963n12975m48088n47697n54128m33066k82557l70094m92803
11335F063647l05324j4312p2222m58504j61018k95776k46618m90367j4821J46149
11325D150834j55470o8578k06375r8477K3678j26952j89506P0925k1830N7552
$$ plain form
11389 48925001 46272167 43360516 40180492 37078126 34335955 31791680 29337075 27082206
11381 27082206 25020649 23412158 21871743 20894130 19885543 18553174 17644271 16418332
11373 16418332 15496792 14662607 14139857 13549704 13075170 12771587 12265237 11815890 11398177
11364 11398177 11356157 11398889 11276646 11117089 11331000 11414293 11102016 11149497 11190272 11142711
11354 11142711 11307347 11369821 11144057 11033196 10829932 10657416 10469541 10269725 9921697
11345 9921697 10017018 9705055 9192080 8743992 8196295 7642167 7209101 6926544 6556450 6063647
11335 6063647 5758323 5744011 5671789 5213285 5052267 4756491 4509873 4019506 4004685 4150834
11325 4150834 3995364 3926786 3720411 3621934 3645612 3518660 3329154 3400079 3378249 3435801
11315C435801O114J03931J86859k91629m18811m5605k01277r1302k6408K2829
11305B680502J07964p8049n3553p930p8182J06008K05028J12804j24096l36322
11295B534174l4J5258O0474q321k96472l02145q4759j96061m9225J2478j02073
11284A583294j30171K08255K14806J77860j19018o5580o7402j65026J35315L28149
11274B100482k02529j82940k30685l5798K60263j30063m71118j56584m9455R6673
11264I98246k1695K20453K26225J68275L4551L605j57603M8212j87776k27076
11254A105417J92843K45581k00385P2372K44846q1368l01749k54907K16721j5148
11244A224223l23273J72909K03204L20196N1695K6114l78590l14625R4083R5462
$$ plain form
11315 3435801 3441915 3545846 3732705 3441076 3022265 2976660 2775383 2684081 2657673 2680502
11305 2680502 2788466 2710417 2656864 2648934 2570752 2676760 2881788 2994592 2870496 2534174
11295 2534174 2534140 2549398 2609872 2601551 2305079 2002934 1918175 1722114 1672889 1685367 1583294
11284 1583294 1453123 1661378 1876184 2054044 1935026 1869446 1802044 1637018 1772333 2100482
11274 2100482 1897953 1715013 1484328 1448530 1708793 1578730 1107612 951028 901573 998246
11264 998246 976551 1197004 1423229 1591504 1626055 1629660 1472057 1520269 1332493 1105417
11254 1105417 1298260 1543841 1343456 1415828 1660674 1579306 1277557 1022650 1239371 1224223
11244 1224223 900950 1073859 1277063 1597259 1648954 1675068 1296478 981853 1075936 1171398
11234A171398J43102j30365n4249k35725J13796K86011O3362j32728R7705K3376
11224A345683r1876K7195j74155k0788k81595j57249K33257j09688L9700K52107
11214A062591K01889Q5866Q5090J63381m01399j97966j41741J18701K02967M41219
11204A620598o0085j75819j63814p6008j31668p5482J3919L36477k7329j44346
11194A116443j15523j39626p9589m1421L04281K83856j29632l08136j76J95685
11184A086162J21072j77556l04252j05910j34430J22658M44455L3340j22530M3194
11174A006203J35398K06478m5534k74405K63856P1466j05975K07197J28657k19423
11164A373918m4966k66362k51130j11839m44589n975K82567J655O0837J20847
$$ plain form
11234 1171398 1314500 1184135 1129886 894161 1007957 1293968 1357330 1224602 1322307 1345683
11224 1345683 1253807 1281002 1106847 1086059 804464 647215 880472 770784 810484 1062591
11214 1062591 1264480 1350346 1435436 1598817 1197418 999452 857711 976412 1179379 1620598
11204 1620598 1560513 1384694 1220880 1144872 1013204 937722 951641 1288118 1260789 1116443
11194 1116443 1000920 861294 781705 740284 1044565 1328421 1198789 890653 890477 1086162
11184 1086162 1207234 1029678 725426 619516 485086 607744 1052199 1085539 963009 1006203
11174 1006203 1141601 1348079 1302545 1028140 1291996 1363462 1257487 1464684 1593341 1373918
11164 1373918 1328952 1062590 811460 699621 255032 249057 531624 533279 594116 714963
11154G14963j05952K7924J61606P7060J1318J96861k20819m37364k29750J83245
11144C79092J41378J67288j30112m75618n9666M4666L08140j6827o745L52442
11134G04038J13212Q6667M36809P359n6071L294o055j61552J46038m14774l09032
11123E49933K37254J53915k64480k6937K09261R3865J01368j81666k03963L5058
11113G03608J61499J58219j71245l1653K5853l54323r3718J41139l3250p5859
11103D30270J9997K50035o0795o7486j78165Q2236K81543J58626N0787p979n7811
11092I01258J8263j76446o3459j21591J23134p0298M630k80169j47531J82829
11082C70620K91216O3923J0311J5004J31022J94710J72246K56711K4030r1635
$$ plain form
11154 714963 609011 636935 798541 875601 886919 1083780 862961 425597 195847 379092
11144 379092 520470 687758 557646 82028 22362 67028 375168 358341 351596 704038
11134 704038 817250 903917 1340726 1348085 1292014 1295308 1289253 1127701 1273739 858965 549933
11123 549933 787187 941102 676622 649685 858946 952811 1054179 872513 668550 703608
11113 703608 865107 1023326 852081 820428 846281 491958 398240 539379 506129 430270
11103 430270 450267 700302 639507 572021 393856 476092 757635 916261 967048 959069 901258
11092 901258 919521 743075 679616 558025 681159 610861 615491 335322 187791 370620
11082 370620 661836 725759 736070 751074 882096 1076806 1249052 1505763 1529793 1438158
11072A438158l17163m43381k32798j35721J98753J49845l1703J45138K82911J94924
11062A248963j20280M1393p666q2876P874J61005L05182L2492J0847K2543P8563
11051A698040l1490J20168K17902j19098p4683K53006L57331J49362J23812k14359
11041B479991j18139P6434o5725K4500j27266j00487J25148K84964K91970p0525
11031B800865j48377K33913N7704K8806k75990l39022J8973Q3966j48762K92060
11021B604136K91882j88136k31116M5555j33536k0836q0216r3820J5129L1724
11011B240766J03418k7660N5031j10016k73549k44980L3148k45906k09458J53766
11001A474560j79260K29284K32916n2082q6773j27975p3432J67530k27251j83652
$$ plain form
11072 1438158 1120995 677614 444816 309095 507848 657693 625990 771128 1054039 1248963
11062 1248963 1128683 1170076 1162410 1079534 1087408 1248413 1553595 1586087 1596934 1619477 1698040
11051 1698040 1666550 1786718 2004620 1885522 1810839 2063845 2421176 2570538 2694350 2479991
11041 2479991 2361852 2438286 2372561 2397061 2269795 2169308 2294456 2579420 2871390 2800865
11031 2800865 2652488 2886401 2944105 2972911 2696921 2357899 2376872 2460838 2312076 2604136
11021 2604136 2896018 2707882 2476766 2522321 2388785 2367949 2287733 2193913 2209042 2240766
11011 2240766 2344184 2316524 2371555 2261539 1987990 1743010 1776158 1530252 1320794 1474560
11001 1474560 1295300 1524584 1757500 1705418 1618645 1490670 1417238 1584768 1357517 1173865
10991A173865L3184R5537J67136o1224q8539J53533j65212j18716m6662j90662
10981I52240r2522K74727R9646j07810k97225R8231J62396j01967k43120q0951
10971F63645P3131K90415j0020r6751j28679M0450K90999l8957j46087r3535n8852
10960G85759k00228j96236K6547K69437M217n6744J16460L22977R4132q1965J31423
10949A215779R9522O6061j70577j26604K96867j16424l77040l65171o5336L10671
10939G67748Q3466K5212K9222j41786K16975J17114o9721M9972p3398Q7801j18234
10928I74371k66527j95813j84101J50355L19005J49708j79704m001l6395k16917
10918E09981J84879J57822j81144r6549K19233j12521j45198K38016O5389p4071
$$ plain form
10991 1173865 1207049 1302586 1469722 1408498 1319959 1473492 1308280 1189564 1142902 952240
10981 952240 859718 1134445 1234091 1126281 829056 927287 1089683 987716 744596 663645
10971 663645 736776 1027191 1017171 920420 791741 832191 1123190 1084233 938146 844611 785759
10960 785759 585531 389295 415842 685279 689496 632752 749212 1072189 1166321 1084356 1215779
10949 1215779 1315301 1381362 1210785 1084181 1381048 1264624 887584 522413 457077 767748
10939 767748 851214 876426 905648 763862 980837 1097951 1028230 1078202 1004804 1092605 974371
10928 974371 707844 512031 327930 478285 797290 946998 767294 763293 726898 509981
10918 509981 694860 852682 671538 574989 794222 681701 536503 774519 839908 765837
10908G65837j48715j01530k11469Q3419p7899m8151K49544J20132k33977j525
10898C95666M47265K32840j7119k17516j59704k27393k37807J37706J09K90584
10888F44631r3733K2920j86174l34612K63816K23179j19277N27R5014J23561J18593
10877G58445K3820J64304K96240k80029k1769n2940o4059p9692k37332j31929
10867C75059K62835q2382j30111j78538k7104Q2357J20184O8208O7738K71075
10857H29321K14346J33438k87997k07902J45700J8149k65307K84242M13080R0326
10847A367396J66473J33262l36440l53427j99464j16381L01990K53462j03676
10838A113195k38115J09973L3026r2151j77316j48871K15852L03984L43772j60227
$$ plain form
10908 765837 617122 515592 304123 387542 309643 261492 511036 631168 397191 395666
10898 395666 842931 1075771 1058652 841136 681432 454039 216232 353938 354047 644631
10888 644631 550898 573818 387644 53032 316848 540027 420750 421277 516291 639852 758445
10877 758445 782265 946569 1242809 962780 941011 888071 824012 744320 506988 375059
10867 375059 637894 555512 425401 246863 219759 302116 422300 490508 558246 829321
10857 829321 1043667 1177105 889108 681206 826906 845055 579748 863990 1277070 1367396
10847 1367396 1533869 1667131 1330691 977264 777800 661419 963409 1216871 1113195
10838 1113195 875080 985053 1018079 925928 748612 599741 815593 1119577 1463349 1303122
10828A303122l16754k85129K56101J95488j1730L0338j11481j90803j3200k05527
10818F50425k7087R0587m9456j92806N4231J56368J00165J34440P8489R703r8823
10807I06236K348Q5093J13560K15115l8345j03688j90089R6233j55008k73344
10797F58111K04805L30643J46389k44896k70886k28739P215L61490M4988j88948
10787H20172q1362k9380J05738j19328Q7956J76778K14074j91588K0361J17701
10777A121122J00113O2557l9803J29905k97003k93448K9101N09441k07933m02374
10767G11678J9370L09320K01110K602q6377R8725M9853O6888j64791J61742J75944
10756A546064j46400J4197J97420l8782k8669k601M7414m800M6960R3859k13932
$$ plain form
10828 1303122 986368 701239 957340 1152828 1141098 1171436 1059955 869152 855952 650425
10818 650425 623338 713925 664469 471663 525894 682262 782427 916867 995356 1005059 906236
10807 906236 908584 993677 1107237 1322352 1284007 1180319 990230 1086463 931455 658111
10797 658111 862916 1193559 1339948 1095052 824166 595427 602642 964132 1009120 820172
10787 820172 738810 709430 815168 695840 783796 960574 1174648 983060 1003421 1121122
10777 1121122 1221235 1283792 1243989 1373894 1076891 783443 812544 1321985 1114052 711678
10767 711678 731048 1040368 1241478 1244080 1157703 1256428 1306281 1373169 1208378 1370120 1546064
10756 1546064 1399664 1413861 1611281 1572499 1543830 1541229 1588643 1583843 1630803 1724662 1510730
10745A510730n8550o6411m1435L34242J80996P2005J03368r7119k06233J16620
10735A848213J62930j5452l3088L02157J55154q9430n0815q5145K45500K0045
10725B460069J97073P8618j30926l18261j76966J40276J52380J29136r9796J60807
10715B592410K8400J01536K36494L59454p5071l50146l76979r538L03061p206
10705B802415R5778J40421K15801k24846j97490K7801J52775K6044k14143m6243
10695B778313J69109L41574L6453j40614k21160j0379Q4959r5486K10523O08280
10685C761572K20022j86945j82598k36598K1953M2249J34917K44708R1838j86732
10675C724386k66027n7532K47189L32659M4759L99338K76644J42186K46514K20289
$$ plain form
10745 1510730 1452180 1385769 1344334 1678576 1859572 1931577 2034945 1937826 1731593 1848213
10735 1848213 2011143 1995691 1962603 2264760 2419914 2330484 2279669 2194524 2440024 2460069
10725 2460069 2657142 2735760 2604834 2286573 2109607 2249883 2402263 2531399 2431603 2592410
10715 2592410 2620810 2722346 2958840 3318294 3243223 2893077 2516098 2506560 2809621 2802415
10705 2802415 2898193 3038614 3254415 3029569 2832079 2859880 3012655 3038699 2824556 2778313
10695 2778313 2947422 3288996 3325449 3184835 2963675 2953296 3038255 2942769 3153292 3761572
10685 3761572 3981594 3794649 3612051 3375453 3397406 3439655 3574572 3819280 3911118 3724386
10675 3724386 3458359 3400827 3648016 3980675 4025434 4424772 4701416 4843602 5090116 5310405
10665E310405K34462K79775J04589L56175M69724L20159k349J4911K11199L18334
10655G617384j1622m4833J21693L03715M18281K02882J17651L99422P82105P58961
10645A0665639O09481O19169J012850J099116R20708J143487J328936J338033
10637A8737419J642555J856989K086706K460611K834881L833162M641296N822254
10629D3915873P110232Q518297R932472J0522437J0298347R501393Q453564P601454
10621A15854069P139189P769559R372744J1433361J2472832J2777473J3636554
10614A90455781J3935014J2527237R884281P276560N668640O233297Q411082J1071091
10606B65462983J2724290J1174538Q821803Q850811R478547P207717L041758j66253
$$ plain form
10665 5310405 5544867 5824642 5929231 6285406 6755130 7075289 7072940 7087851 7299050 7617384
10655 7617384 7605762 7560929 7682622 7986337 8404618 8607500 8725151 9124573 9906678 10665639
10645 10665639 11275120 11894289 12907139 14006255 14926963 16070450 17399386 18737419
10637 18737419 20379974 22236963 24323669 26784280 29619161 33452323 38093619 43915873
10629 43915873 51026105 59544402 69476874 79999311 90297658 99799051 108252615 115854069
10621 115854069 122993258 130762817 140135561 151568922 164041754 176819227 190455781
10614 190455781 204390795 216918032 226802313 234078873 239747513 245980810 254391892 265462983
10606 265462983 278187273 289361811 298183614 307034425 316512972 323720689 326762447 326596194
10598C26596194j529124j294369N51304K604718J669327l931153j0170588j1866270
10590C02630039j0306428r043101r092840r671405r291773q292043o346294n001550
10582B35584605n930481j0370213j5013181j6093906j3582194j1171312j0194784
10575A53228534r367189q804438p665630o931297p011688p442083r315956j1061017
10567H5629236j0929555r326498p644034o289483m847399l497739l013162k571259
10559C7510107k054045k173439j681663j414585j541319j475986j170488j087296
10551B4911286j157658j081644q53780q46942n61986n22067p87036m95024k95251
10542A8309898q05547p64315m96435k29261n83392o03807m23440l17703n55636
$$ plain form
10598 326596194 325067070 323772701 324324005 326928723 328598050 324666897 314496309 302630039
10590 302630039 292323611 283280510 274187670 264516265 255224492 246932449 240586155 235584605
10582 235584605 229654124 219283911 204270730 188176824 174594630 163423318 153228534
10575 153228534 143861345 135056907 127391277 120459980 113448292 106006209 96690253 85629236
10567 85629236 74699681 65373183 57729149 51439666 46592267 43094528 40081366 37510107
10559 37510107 35456062 33282623 31600960 30186375 28645056 27169070 25998582 24911286
10551 24911286 23753628 22671984 21818204 20971262 20409276 19887209 19100173 18605149 18309898
10542 18309898 17504351 16740036 16243601 16014340 15430948 14827141 14403701 14085998 13530362
10533A3530362n56208l74621k83307j31036l42820n68158j58485k72808m80847
10524A0362072m4877j18653k93451j69157k31881j96460k91840k16077l50395
10515H449281j00623j55049l01085l30241l3451m1674n1883m32245m81092j16750
10505F405188J60321N1304L7882l2135m14084l26251l01329K0294J5805j84636
10495E432359l65485k60437k34815O929N898P9592l69024p9707J13362L17922
10485D646594j0612o6157L0880k42712l30423o0412o7612k73188J10484R7655
10475C834497j33628j09649q3406J0291K4266j53466k0367J45580j73962p7365
10465C262791k4074K93808Q2241J01286o161j36483k08359k47784O5430K01633
$$ plain form
10533 13530362 12974154 12599533 12316226 12185190 11842370 11274212 11115727 10842919 10362072
10524 10362072 10317195 10198542 9905091 9735934 9504053 9307593 9015753 8799676 8449281
10515 8449281 8348658 8193609 7892524 7562283 7528832 7487158 7435275 7003030 6521938 6405188
10505 6405188 6565509 6616813 6654695 6622560 6208476 5882225 5580896 5601190 5616995 5432359
10495 5432359 5066874 4806437 4571622 4578551 4584449 4664041 4295017 4215310 4328672 4646594
10485 4646594 4635982 4569825 4600705 4357993 4027570 3967158 3899546 3626358 3736842 3834497
10475 3834497 3700869 3591220 3507814 3518105 3542371 3388905 3368538 3514118 3340156 3262791
10465 3262791 3238717 3532525 3614766 3716052 3709891 3573408 3365049 3117265 3182695 3384328
10455C384328J23898P2600k34534j56440o5217j00885j08992K4175M5790L07423
10445C292146j49402j47302J39386j57956r7457l00786J04202P9631m1031n5457
10435B665974k12953p6933r2821R3365J9798j64740J40574k27428J66848l4546
10425B277138l29070j03388R6173J92427k39986p3332L33574l9134j82561O0764
10415A992605J25271r4797j33160L35769J3909r9290J56768l13270j91249K19293
10405B011849N4889k9482J96214k50408k42418j46027J48348P7293n8506J1797
10395A773549q5357L72207J25517o0099n8422q1882j35939j55733L47663R3008
10385B134512k78789l06219p6383r514q2382K57576K37822J18350n2938j0129
$$ plain form
10455 3384328 3508226 3580826 3346292 3189852 3124635 3023750 2914758 2938933 2984723 3292146
10445 3292146 3142744 2995442 3134828 2976872 2879415 2578629 2682831 2762462 2721431 2665974
10435 2665974 2453021 2376088 2283267 2376632 2396430 2231690 2372264 2144836 2311684 2277138
10425 2277138 1948068 1844680 1940853 2133280 1893294 1819962 2153536 2114402 1931841 1992605
10415 1992605 2117876 2023079 1889919 2225688 2239597 2140307 2297075 1983805 1792556 2011849
10405 2011849 2066738 2037256 2233470 1983062 1740644 1594617 1742965 1820258 1761752 1773549
10395 1773549 1688192 2060399 2185916 2125817 2067395 1985513 1849574 1693841 2041504 2134512
10385 2134512 1855723 1549504 1473121 1463607 1381225 1638801 1876623 1994973 1942035 1931906
10375A931906q2343l81124l9014J86774L6602l14857j55856J75896J59184J941
10365A519109K08636K26219j46857l7314j09028j6185k87584N6705J67674k8962
10355A552413j78208l6072L31357J5196M1174k96249r5929K38071K10264O0131
10345A842148m221j93793j81836j82067J73266R3157O3796q9532L56633L21242
10335B198793K4092R8307j06831l68391l81796j65740N5297J32139K40799K20872
10325A947541J26959k33115k98569l36722L29390J80967q3573q5427J13369k4816
10315A636004k54230q3920j04509K99187k3515l3826M5039M40183J07724j815
10305B026322M5651j59717j82922m8749k84525p8232K89084N9611n5325K27811
$$ plain form
10375 1931906 1849563 1468439 1429425 1616199 1652801 1337944 1182088 1357984 1517168 1519109
10365 1519109 1727745 1953964 1807107 1769793 1660765 1644580 1356996 1413701 1581375 1552413
10355 1552413 1374205 1338133 1669490 1684686 1725860 1429611 1333682 1571753 1782017 1842148
10345 1842148 1837927 1644134 1462298 1280231 1453497 1546654 1610450 1520918 1877551 2198793
10335 2198793 2222885 2321192 2214361 1845970 1464174 1298434 1353731 1485870 1726669 1947541
10325 1947541 2074500 1841385 1542816 1206094 1535484 1716451 1632878 1547451 1660820 1636004
10315 1636004 1381774 1297854 1193345 1492532 1469017 1435191 1480230 1920413 2028137 2026322
10305 2026322 2071973 1912256 1729334 1680585 1396060 1317828 1606912 1666523 1611198 1839009
10295A839009J88717m8510n5677o9555l25943k14908M22529J36192r2701j73820
10285A605333k07069J69490M8921L250j48443K5498l1619R7296r8995N4499K02450
10274A720611K6196J06140K50431R5780J56622J43404o9900Q4726R8763j40156
10264B472617r4187m6729M6564n8949J96997K54779L66596j23064n0682q8012
10254B875930j23850m6615J97838K01364K87021J55138l9624k41078J3472j67264
10244C112332K40600M33695Q3414j27418j6514L5782K54404P9516N3659K13321
10234D362791J54646M028j26302j34667K94398L35803J51281R2817M05882M96264
10224F036941M35283L15575N61570L80484K51844M87287O22013P33205M21695
$$ plain form
10295 1839009 2027726 1979216 1923539 1853984 1528041 1313133 1735662 1871854 1779153 1605333
10285 1605333 1398264 1567754 1616675 1619925 1471482 1496980 1465361 1562657 1463662 1518161 1720611
10274 1720611 1746807 1852947 2103378 2199158 2355780 2499184 2429284 2514010 2612773 2472617
10264 2472617 2378430 2331701 2378265 2319316 2516313 2771092 3137688 3014624 2963942 2875930
10254 2875930 2752080 2705465 2903303 3104667 3391688 3546826 3507202 3266124 3279596 3112332
10244 3112332 3352932 3786627 3870041 3742623 3726109 3761891 4016295 4095811 4149470 4362791
10234 4362791 4517437 4521465 4395163 4260496 4554894 4890697 5041978 5134795 5540677 6036941
10224 6036941 6472224 6787799 7349369 7729853 7981697 8468984 9090997 9824202 10245897
10215A0245897J79836J42771J39818J10325J24004o1014j98007k14949l22046
10206A0146635k65253j05628J02179Q7426n3040k08964L94228J03680O8239P3145
10196A0342647K09359L76840N66483M15947M44557K61658J79813J39510L62429
10187A3299243k4769n02430k59171j79456k12126k63744k82392j21992l4015k00729
10177A1218419K11816K51019L5142r3909q7893J48332P7847J75751K12583K19257
10167A2368364o964J12088L70255K60090K58707L45721K52451L73532L60389M35815
10157A5130448L40552J61140K83460L85842R02329O46652M91872M95787P87847
10148A9625929Q06646J003577R52322Q85042J077437J157816J364524J982594
$$ plain form
10215 10245897 10425733 10568504 10708322 10818647 10942651 10881637 10683630 10468681 10146635
10206 10146635 9881382 9775754 9877933 9965359 9912319 9703355 10097583 10201263 10269502 10342647
10196 10342647 10552006 10928846 11495329 11911276 12355833 12617491 12797304 12936814 13299243
10187 13299243 13274474 12772044 12512873 12333417 12121291 11857547 11575155 11453163 11419148 11218419
10177 11218419 11430235 11681254 11716396 11622487 11534594 11682926 11760773 11936524 12149107 12368364
10167 12368364 12361400 12473488 12843743 13103833 13362540 13708261 13960712 14334244 14694633 15130448
10157 15130448 15471000 15632140 15915600 16301442 17203771 17850423 18342295 18838082 19625929
10148 19625929 20432575 21436152 22388474 23273516 24350953 25508769 26873293 28855887
10140B8855887K205380K419595K664743K785632L193413L501218M098488M442303
10132E4166659M691726N295913N046456M666829M529862M354006M218056L587481
10124I0556988L191655L103644K600058J962400J804401J791604K042059J949943
10116A09002752J924874K270817K600466L043521L569622L721193M141122L835230
10108A34109597L910758L903425L234977K659060K719501K044392J591865J306341
10100A55479916N95095N96781J03046J75701O9035j92510J42053L58880K29956
10091A57557953L94830N95650P78815P85346J274082J339829J418315J561276
10083A65706096K209875K982033L736172M718349N658551P188867Q755163J0377004
$$ plain form
10140 28855887 31061267 33480862 36145605 38931237 42124650 45625868 49724356 54166659
10132 54166659 58858385 64154298 69200754 73867583 78397445 82751451 86969507 90556988
10124 90556988 93748643 96852287 99452345 101414745 103219146 105010750 107052809 109002752
10116 109002752 110927626 113198443 115798909 118842430 122412052 126133245 130274367 134109597
10108 134109597 138020355 141923780 145158757 147817817 150537318 152581710 154173575 155479916
10100 155479916 156075011 156671792 156774838 156950539 157019574 156827064 156969117 157327997 157557953
10091 157557953 157952783 158548433 159327248 160112594 161386676 162726505 164144820 165706096
10083 165706096 167915971 170898004 174634176 179352525 185011076 192199943 200955106 211332110
10075B11332110J1789316J2484964J3062088J2794595J1769927J0138081P996947
10068B91368028O375547L868374J327188p05558k744175m642931o247431p169851
10060B81429191p628914o974501m893759l473136j796589j55526J958881L686155
10052B62151802N428739O480065O813969O510212N518271L918681K086543K71147
10044B99179429j680471l930512o435162q386961r845180j0873017j1730139j1882045
10036B34415942j1576190j0798688r552005q007466o567295n495326m352091l357708
10028A74709173k746794k200624k134602j989015j616942j662452j285187j085460
10020A59988097j304435q34574n03206p2434n3698j36798k03989j03090k53049
$$ plain form
10075 211332110 223121426 235606390 248668478 261463073 273233000 283371081 291368028
10068 291368028 297743575 301611949 302939137 302233579 299489404 294846473 288599042 281429191
10060 281429191 273800277 266825776 261932017 258458881 256662292 256506766 258465647 262151802
10052 262151802 267580541 274060606 280874575 287384787 292903058 296821739 298908282 299179429
10044 299179429 297498958 293568446 287133284 278746323 268901143 258028126 246297987 234415942
10036 234415942 222839752 212041064 202489059 194481593 187914298 182418972 178066881 174709173
10028 174709173 171962379 169761755 167627153 165638138 164021196 162358744 161073557 159988097
10020 159988097 158683662 157849088 157345882 157273448 157219750 157082952 156878963 156775873 156522824
10011A56522824o51682j090566j419258k021953k133238k831812l605864l954719
10003A38813732m039723m304255m386261m375182m158488l930344l547895k715699
9995A07355885k316209j852791j503134j272696j094242j623217j653529k053063
9987I3987004k178320k477186k776568l135126l674403l634673l991524m563615
9979F7555589m975238m202054l804668l701346l552306l016237l006716k483064
9971C8813960k365308k067101j717494j622189j493880j423015j316318j216453
9963B5592202j210520o30287p67879j005962q96805r88650q71260o80691q88066
9954A7652082n05905n74616p17934l51967j6809J3579o13882q01697o71065k32116
$$ plain form
10011 156522824 155871142 154780576 153361318 151339365 149206127 146374315 142768451 138813732
10003 138813732 134774009 130469754 126083493 121708311 117549823 113619479 110071584 107355885
9995 107355885 105039676 103186885 101683751 100411055 99316813 97693596 96040067 93987004
9987 93987004 91808684 89331498 86554930 83419804 79745401 76110728 72119204 67555589
9979 67555589 62580351 58378297 54573629 50872283 47319977 44303740 41297024 38813960
9971 38813960 36448652 34381551 32664057 31041868 29547988 28124973 26808655 25592202
9963 25592202 24381682 23751395 22983516 21977554 21080749 20092099 19220839 18540148 17652082
9954 17652082 17146177 16571561 15853627 15501660 15484851 15498430 14884548 14082851 13411786 13179670
9944A3179670n68365r3234j55348r8112k77295n85860j97909r6128r3937J24907
9934A1138389j53198m5547j20314r0310j10626J61523K24086k6224r7502J40222
9924A1020499J02108M4675m755j309O4219k07058k98894n64817l63056o4838k30843
9913I495931o97111l94592j04947q5142p0343l67621q4906J57135N3366J39436
9903H041206K86547J79887O0484L9334k22972k93471j45719j1498j37718k24995
9893G571085k65951l52480k43355j03328j51149l49193m43239l58721k44540j33619
9883D925510k7909k4264j43294r1991j11767k4966k10828j53182J11360O0716
9873D309385m98246l27954j49246j02041k15003l6819l9418L3740j46947j94460
$$ plain form
9944 13179670 12611305 12518071 12362723 12264611 11987316 11401456 11203547 11107419 11013482 11138389
9934 11138389 10985191 10939644 10819330 10729020 10618394 10779917 11004003 10977779 10880277 11020499
9924 11020499 11122607 11167282 11162527 11161218 11225437 11018379 10719485 10154668 9791612 9726774 9495931
9913 9495931 8798820 8404228 8299281 8214139 8143796 7776175 7691269 7848404 7901770 8041206
9903 8041206 8327753 8507640 8568124 8607458 8384486 8091015 7945296 7933798 7796080 7571085
9893 7571085 7305134 6952654 6709299 6605971 6454822 6105629 5662390 5303669 5059129 4925510
9883 4925510 4897601 4873337 4730043 4638052 4526285 4501319 4290491 4137309 4248669 4309385
9873 4309385 3811139 3483185 3333939 3231898 3016895 2980076 2940658 2974398 2827451 2632991
9863B632991k9207K70133L1208k76412j13453K7466M7017L5245j26179m9762j05136
9852B343911K7292j74663p6288M08238R3482j85278P9160K43759j16404j04044
9842B539165J9648l91720l00427k51645M3023J10060j00885K4516R8418K01419
9832A991572L617O4575k57656j08114m8408J82328r990p2376K3597j79779n24
9821A588842n0330m4806k31178j01166L21172K36856m4386j6318O4723k4347p9685
9810A619377O6407K3565l6182r14J42045j98101k5715l75246K4544J05624j91081
9799A154323o4116N6135L10393L36424J41049j39747j90714k63065l91130L5937
9789I85489K30955O3994J85739k39430j75204K71342M0806l49872L0184N725k445
$$ plain form
9863 2632991 2603784 2873917 2905125 2628713 2515260 2542726 2589743 2624988 2498809 2449047 2343911
9852 2343911 2371203 2196540 2120252 2528490 2621972 2436694 2515854 2759613 2643209 2539165
9842 2539165 2558813 2167093 1866666 1615021 1658044 1768104 1667219 1691735 1790153 1991572
9832 1991572 1995189 2059764 1802108 1693994 1645586 1827914 1817924 1745548 1769145 1589366 1588842
9821 1588842 1538512 1493706 1262528 1161362 1482534 1719390 1675004 1658686 1723409 1699062 1619377
9810 1619377 1685784 1709349 1673167 1672253 1814298 1616197 1590482 1215236 1239780 1345404 1154323
9799 1154323 1090207 1146342 1456735 1793159 1934208 1794461 1603747 1340682 949552 985489
9789 985489 1216444 1280438 1466177 1226747 1051543 1322885 1363691 1013819 1044003 1049728 1047283
9778A047283K6695J9531j53634J70126k6477K28130K38066q1634k71550j63165
9768A033371P8158M3398L4422k3144r6814J74310p5313k84768K06425O8431J02562
9757A261038O9883k55650k87635r3353J36253K44445j54470j82987j81105j60423
9747C95996L58689J67938j50305N2106R2231N9702r5913k03693p3183J15606N4486
9736G73660q3717j48275m5410J49499K97062J81596j56837j68021l73436J83372
9726F09493J60584k4771J85835K13285m6211l53019P3041J15513K40735m4263
9716A130222j73031J95073j18753k7958J0189J02114j68931Q9143k17429J61460
9706I82099K34902j29097q9886n2319o8553J23344K64892L45422n9225l84368
$$ plain form
9778 1047283 1073978 1093509 939875 1110001 1083524 1311654 1549720 1468086 1196536 1033371
9768 1033371 1111529 1154927 1189349 1166205 1069391 1243701 1168388 883620 1090045 1158476 1261038
9757 1261038 1330921 1075271 787636 694283 830536 1074981 920511 737524 556419 395996
9747 395996 754685 922623 772318 824424 916655 976357 880444 676751 603568 719174 773660
9736 773660 689943 541668 496258 645757 942819 1124415 967578 799557 426121 609493
9726 609493 770077 745306 931141 1144426 1098215 745196 818237 933750 1174485 1130222
9716 1130222 957191 1152264 1033511 1005553 1015742 1117856 948925 1038068 820639 982099
9706 982099 1217001 1087904 998018 945699 877146 1000490 1265382 1610804 1551579 1167211
9696A167211k88726j10004K35669m5694j35091J44895J29000L15616r4611J47301
9686A465566J1544m9117J29011k41882j38120J150K69264J70060k1544k88968
9676A306964n3942p8896j34187n8334j49975k3323J59856K6634J42214Q3915j5653
9665A205273J0931K55091j8398J08559L44187L91351r9171l5111L37402K77969
9655B778083j41026k63967k2461M3146J73954k03999j47765j14504k13879q4409
9645A803173M7804l8282j73602K37579K6521j71009l43417j05039N2954q7854
9635A248828J11742l4293j25270J57934K5194q6901O1515k196K17412J88758J51307
9624A914030k27993j5729p6119k0428j76392k02046J45365J73760j90922j29622
$$ plain form
9696 1167211 878485 768481 1004150 958456 823365 968260 1097260 1412876 1318265 1465566
9686 1465566 1477110 1427993 1557004 1315122 1177002 1178152 1447416 1617476 1595932 1306964
9676 1306964 1253022 1174126 1039939 981605 831630 808307 968163 994797 1137011 1220926 1205273
9665 1205273 1216204 1471295 1452897 1561456 1905643 2296994 2197823 2162712 2500114 2778083
9655 2778083 2637057 2373090 2350629 2393775 2567729 2363730 2215965 2101461 1887582 1803173
9645 1803173 1850977 1812695 1639093 1876672 1903193 1732184 1388767 1283728 1336682 1248828
9635 1248828 1360570 1326277 1201007 1358941 1384135 1297234 1358749 1356553 1573965 1762723 1914030
9624 1914030 1686037 1670308 1594189 1573761 1397369 1195323 1340688 1514448 1323526 1193904
9614A193904j36270r5671O3753J22562Q4080l2310j82928m952N1218L02703O7743
9603A433832j57437k77131p8773o6299l8834K49120L5032J9224j04193k26882
9593G87659l05629J43522K94386P8596J92357l5631J39467L6748j46837k24926
9583I59712m6050Q2188j85267J12927L12641K6265l73046l73211j33513L20959
9573G03605K69594k1253k07866r6125k08702j13081L18714L83131n72n1402j10128
9562H65915j99322m80018k73537K9029J26828J47605Q0573M1678M871k56971k46871
9551a60220K12542K92838j4006m0160J58760P793j34940j23194J26581k1237M5939
9540C50696K41052K57816q4327l66565j5917l0557J13735J0446K20109K2198k47467
$$ plain form
9614 1193904 1057634 961963 1025716 1148278 1232358 1200048 1017120 1012168 1063386 1366089 1433832
9603 1433832 1276395 999264 920491 854192 815358 1064478 1099510 1118734 1014541 787659
9593 787659 482030 625552 919938 998534 1190891 1155260 1294727 1331475 1184638 959712
9583 959712 913662 995850 810583 923510 1236151 1262416 889370 516159 382646 703605
9573 703605 973199 951946 744080 647955 439253 326172 644886 1028017 1027445 976043 865915
9562 865915 666593 186575 -86962 -57933 68895 216500 297073 338751 343622 86651 -160220
9551 -160220 52322 345160 331154 290994 449754 457547 322607 199413 325994 304757 350696
9540 350696 591748 849564 765237 398672 382755 352198 465933 476379 696488 718686 471219
9529D71219j79998o2088j35547j99254l1159K15969P5179J15468k2926J25793
9519C72656L8430j83400j36936m2922L14541l4935k47484M1109O8364O1403J56582
9508D07408n4728j19822m4782j9399J63472j38421K2948J66621J24246k5160k19482
9497B62901q2903J25101n3643j33841j44883J49676L0896K05459J25587p5752
9487D08598j08899L42160K14378j77831l00819l8120j47415j13039O7580L97740
9477E44333k5627K3405m1158P4075M2457Q9004J43817j06606p0422k81424J63400
9466E55254J61887M9280l12969j98347J90367J24832j71443l32190o161K29144
9456B89654J72502J78707j30390k12122j27995L9374N6320l79567j40520Q8803
$$ plain form
9529 471219 291221 229133 93586 -105668 -136827 79142 154321 269789 246863 372656
9519 372656 411086 227686 90750 47828 362369 327434 79950 121059 189423 250826 407408
9508 407408 352680 232858 188076 168677 332149 193728 216676 383297 507543 482383 262901
9497 262901 179998 305099 251456 117615 -27268 122408 153304 358763 484350 408598
9487 408598 299699 641859 856237 678406 377587 339467 192052 79013 146593 544333
9477 544333 518706 542111 500953 575028 617485 706489 850306 743700 673278 391854 555254
9466 555254 717141 766421 453452 255105 445472 570304 398861 66671 60510 289654
9456 289654 462156 640863 510473 298351 170356 209730 266050 -113517 -254037 -165234
9446a65234J26019N3947O5075r8741P0876j37381j08022L61489L76652j11000
9436D33680M8110J0328j67683j10331J99644n3049m03123n3300K75588j13243
9426F6621J02488N4197J41658K03108j18927j94869J23807k12445k50850l2604
9416a17816J96643K41115L43783r1381J0073o2912q9505K1561K1341k05689j65344
9405A01869K78902j17897k3517k00897M2731n6517j21513j48287j11104J77486
9395a78744K1761J73629K28439L0762n7458j89881J03861J42158p6887j30173
9385F7467M6081j55696R9676j56062k34063j73960J83543J32217Q4025K95710
9375A88938j54655k665K09177J95723j68990p0187j91519j52346O1286J57212
$$ plain form
9446 -165234 -39215 14732 79807 -18934 51942 -85439 -193461 168028 544680 433680
9436 433680 481790 492118 324435 214104 413748 360699 -42424 -95724 179864 66621
9426 66621 169109 223306 364964 568072 449145 254276 378083 165638 -85212 -117816
9416 -117816 78827 319942 663725 572344 582417 519505 430000 451561 472902 267213 101869
9405 101869 380771 262874 239357 38460 81191 24674 -96839 -245126 -356230 -178744
9395 -178744 -156983 16646 245085 275847 218389 28508 132369 274527 197640 67467
9385 67467 113548 -42148 57528 -98534 -332597 -506557 -323014 -190797 -106772 188938
9375 188938 34283 31618 240795 436518 267528 197341 5822 -146524 -85238 71974
9365G1974J41579J3256J01425j53829n1719j18096n1407k0043j08677j76033J11493
9354b40077J78921k55779m5005J00076J2859L8496J60492K34387m3215R675J76706
9343C27536j05729j70335O5128L0409j22391K4720J58665J14325r7995k55045
9333c0712o3227q0303K1746J64914K1701j2125J47624J37826P3701J0808p2848
9322C19105j43085K15647J09714j70383p6140q9906j86247j28500j91047l34063
9312f74905J04207M59394J88496q3542o1789J02317L6749L0697J69895k05639
9302F5880o2262M0527k59544P4949Q6846r0283j43091L01022P9368k08622J28477
9291A3267j93124j42437o8968O1687P3090R8701J33806l91244J0213L23792L14098
$$ plain form
9365 71974 213553 226809 328234 174405 122686 4590 -46817 -66860 -175537 -351570 -240077
9354 -240077 -61156 -316935 -361940 -261864 -249005 -210509 -50017 184370 141155 150830 327536
9343 327536 221807 51472 116600 147009 24618 49338 208003 322328 224333 -30712
9333 -30712 -93939 -174242 -152496 12418 34119 21994 169618 307444 381145 391953 319105
9322 319105 176020 391667 501381 330998 254858 164952 -21295 -149795 -340842 -674905
9312 -674905 -570698 -111304 77192 -6350 -68139 34178 70927 101624 271519 65880
9302 65880 3618 44145 -215399 -140450 -53604 -143887 -286978 14044 93412 -115210 13267
9291 13267 -179857 -322294 -391262 -329575 -256485 -157784 -23978 -415222 -405009 -81217 232881
9280B32881J67570o8624p8625o3037j24778J84837L9410l2834J10777q3392o7394
9269B16791O4712m56224l33404J62574R5986J20681J97703J99586j31408k44242
9259a07245Q6301K8841R0245r6050l46640J2210k9087r7496M00150M73698k27641
9248A87286k3146J04667j98881m838j99769k58062Q0136J1920K33995J99304l22162
9237a89550L0495J95174P708o0970O7787q5376l1203l20843k0693j31742q8107
9226f27320J25072L69221L76357o1955N8944R4161p8258K7519O3031j55582k71056
9215g9866J945J83965j73145K5430K9796o1193k88462j6273K69086J77487O3362
9204A32132j65463p9766K59000l3464k40695J67500o2260j91212J05907j127J30138
$$ plain form
9280 232881 400451 331827 253202 190165 65387 250224 289634 256800 367577 284185 216791
9269 216791 281503 -174721 -508125 -345551 -249565 -128884 68819 268405 136997 -107245
9259 -107245 -20944 7897 98142 2092 -344548 -332338 -361425 -458921 -58771 414927 187286
9248 187286 164140 268807 69926 65088 -134681 -392743 -312607 -300687 -66692 132612 -189550
9237 -189550 -159055 36119 43827 -17143 50644 -34732 -65935 -386778 -407471 -539213 -627320
9226 -627320 -502248 -133027 243330 181375 240319 334480 256222 283741 346772 191190 -79866
9215 -79866 -77921 106044 -67101 -41671 -11875 -73068 -361530 -377803 -108717 68770 132132
9204 132132 -33331 -113097 145903 112439 -128256 39244 -23016 -214228 -108321 -109448 20690
9193B0690J13035R4057p1298j13820J84007Q0461L3467l43742p9740J37555j14853
9182f0181j02406k0940J67535K35022P2938j93283j1574o335j61354L3463K19657
9171A72542J27185O9817j84039j23593J16832r5520Q4218K20995o4581k55007
9161F8849j43717j48229Q3420J74188K70746J1818J6810j97676k26948j52679
9151b43418o2589J36156K06518L9480j23768n4011K10535K23605J15903l94820
9141E3591j34841l5512O8860J93563j65267l22966n5835L44300n2494o6398J57156
9130a5843j24733l18256m6532L82698J30220j28746k42818j9115R0713J37127
9120a55285j0979R6573P8413j11001P8665r3587k7638k8494j80670J51782L20191
$$ plain form
9193 20690 133725 227782 156484 42664 226671 307132 340599 -3143 -82883 54672 -60181
9182 -60181 -162587 -183527 -15992 219030 291968 98685 87111 80776 -80578 -47115 172542
9171 172542 299727 369544 185505 61912 178744 83224 167442 388437 323856 68849
9161 68849 -74868 -223097 -139677 34511 305257 317075 333885 136209 -90739 -243418
9151 -243418 -306007 -169851 36667 76147 -47621 -101632 108903 332508 448411 53591
9141 53591 -81250 -116762 -47902 145661 -19606 -342572 -398407 -54107 -106601 -172999 -15843
9130 -15843 -140576 -458832 -505364 -122666 7554 -121192 -364010 -383125 -292412 -155285
9120 -155285 -166264 -69691 8722 -102279 -23614 -117201 -144839 -173333 -354003 -202221 117970
9109A17970N9075J11579K37560l1421j38288j70401k92758j75351K44024J56905
9099A18894m8288J88569K75700k07860k35136j67863k6901j72450J0356J84177
9089h0802J55857J28679l996J67718k39527k29219K7488Q7390J32570k13869j32147
9078a99858p8840J48142O6773O0127K18994k2079k20929k25639J68760J39731
9068E5182j79272j33702j46020o5554J24414L5650j45123J04132J99420J8229
9058a32644o6569K49557J91630O7865k18380m81338j850L30151m0764L43464K53399
9047D94521j54080j85222j98120o1881J8609J96535L6820M1988j02727k06265
9037a19822Q1321m2372j34660K53684q92n7819k9380J85387k5646j9694K369O3616
$$ plain form
9109 117970 177045 288624 526184 494763 356475 186074 -106684 -282035 -38011 118894
9099 118894 70606 259175 534875 327015 91879 -75984 -102885 -275335 -264979 -80802
9089 -80802 75055 203734 199738 367456 127929 -101290 -73802 13588 146158 -67711 -199858
9078 -199858 -278698 -130556 -63783 -3656 215338 193259 -27670 -253309 -84549 55182
9068 55182 -124090 -257792 -403812 -469366 -344952 -309302 -454425 -350293 -150873 -132644
9058 -132644 -199213 50344 241974 309839 91459 -389879 -391729 -61578 -102342 241122 494521
9047 494521 340441 155219 -42901 -104782 -86173 110362 147182 189170 86443 -119822
9037 -119822 -38501 -80873 -215533 38151 37259 -20560 -49940 135447 109801 90107 92476 156092
9025A56092P8914R7879J35652k8598k23978l9783k96719o8835o5122p147J55949
9014a05696P7480K45937J18763O772M1785j52189r4839K0627j3711r1996J68833
9003B21766J09280l55010k43245R9872n4360J39326j23367q1745k43046M9768
8993d80761p8626J17733K84754J908M2301J49665O3680k10475Q507M4332j48458
8982b05440J3184L0268R7566O8642J42213k50998q6767K16770j82539k31711j49533
8971e38345J04678m9489q0206K57168M9266K3319L207p2157j49639R4470M141
8960c53587n0750K35976J11419K9816n4114K1349j79450l2061K16339J26439j68245
8949i6869l8209K95496q3140q044j57445j84919j96003l559q0862L39907L29453
$$ plain form
9025 156092 235006 332885 468537 439939 215961 176178 -120541 -189376 -254498 -261645 -105696
9014 -105696 -28216 217721 336484 343256 385041 232852 138013 158640 144929 52933 221766
9003 221766 331046 -23964 -267209 -167337 -221697 -82371 -205738 -287483 -530529 -480761
8993 -480761 -559387 -441654 -156900 -154992 -112691 36974 100654 -109821 -101314 -56982 -205440
8982 -205440 -192256 -161988 -64422 4220 146433 -104565 -191332 25438 -157101 -388812 -538345
8971 -538345 -433667 -483156 -563362 -306194 -256928 -233609 -230402 -302559 -452198 -357728 -353587
8960 -353587 -404337 -168361 -56942 -27126 -81240 -59891 -239341 -271402 -55063 71376 -96869
8949 -96869 -135078 160418 77278 69234 -88211 -273130 -469133 -472692 -553554 -213647 115806
8938A15806m0184j17108o0253j51367j97591J93665J95201n6228k11404P1277
8928b58186O8357j15041N1110N47734j14686m32839L5455J094l1812K5871J640
8917b21303K22131Q7329k28524l9570N371J07797R4376K8779O7989J42932K33708
8906E01015j9466k64380l41424j45095j82544Q281K36265k20689K2183J28919
8896b76935J57413O5817J66899l7297j0934k66019o497k5626j82913l31426R5434
8885f52084M87693L04069q6163n0493J73359J58095k7346j41402j31991q1908
8875d8171J73597k39659J03424k1991L4681L62005k61630l37313k5384J08705
8865a51736j84098k53421K23188J43913L2716J38222j1753L40331J35033r6455
$$ plain form
8938 115806 75622 -41486 -101739 -253106 -450697 -257032 -61831 -118059 -329463 -258186
8928 -258186 -189829 -304870 -253760 293974 179288 -253551 -218096 -217002 -248814 -222943 -221303
8917 -221303 828 88157 -140367 -179937 -174566 -66769 27607 56386 124375 267307 501015
8906 501015 481549 217169 -124255 -269350 -451894 -443613 -207348 -428037 -405854 -276935
8896 -276935 -119522 -53705 113194 75897 64963 -201056 -207553 -233179 -416092 -747518 -652084
8885 -652084 -164391 139678 53515 3022 176381 334476 307130 165728 33737 -48171
8875 -48171 125426 -114233 -10809 -32800 1881 363886 102256 -235057 -260441 -151736
8865 -151736 -335834 -589255 -366067 -222154 -189438 -51216 -62969 277362 412395 315940
8855C15940l14196k32397j28221J07105m594R8309k3288K48370J09918J229P7295
8844B55470k2464j28907L333L0205m3650M0184o137j48231K35501q9477q2693
8833D3134r6101J44614R9318j15631j50322J7031l1302j52556n4794j875K19568
8822g8916J1247l74936k42947Q5214p8230k36475J09978L06966O243K09947J115
8811b80794n3088j06163o2918n5827K72513j28522M054J06222j15916l3975L15453
8800a38961J67506K96464m6466j92413j78277r9200L2491m0403k51574N9733J28194
8789b62906L00183K5695o1290J02929K43808K094k72753k01723m41449o4727K56320
8778c73819J13644J73309N6158n9167L6855Q9706l79138o6317J44564r796R3977
$$ plain form
8855 315940 1744 -230653 -358874 -251769 -256363 -158054 -181342 67028 176946 178175 255470
8844 255470 233006 104099 107432 137637 93987 134171 128034 -20197 215304 125827 43134
8833 43134 -52967 91647 190965 75334 -74988 -57957 -89259 -241815 -296609 -298484 -78916
8822 -78916 -67669 -442605 -685552 -600338 -678568 -915043 -805065 -498099 -491856 -281909 -280794
8811 -280794 -333882 -440045 -502963 -558790 -286277 -414799 -410745 -304523 -420439 -454414 -138961
8800 -138961 28545 325009 278543 86130 -92147 -191347 -158856 -199259 -450833 -391100 -262906
8789 -262906 37277 62972 1682 104611 348419 350513 77760 -123963 -565412 -630139 -373819
8778 -373819 -260175 -86866 -30708 -89875 -53020 36686 -342452 -408769 -264205 -274001 -180024
8767a80024j04100k60331m0247J78452J68241Q7626Q1027j5448N741k51580k6029
8756c56672J4362K05372L58700j49078j60043j3906j0504p8687k80452M1774q488
8745d37622n5819J96173K83584n8264k4147J45206l488K24743P9333j17486j58950
8734G3263J78001n9923j85004L5992m4286J3912K56065l9069j99510j54492j57834
8723b82885K44643L19851j34397l24728j33668J43423k68099J53966J03654j16469
8713b94709J40033p8050K74699n8587J17586p9444l9581P5352j88382J999J55372
8702B6288k9313k85742k40933j26616n0635L07412L07324J30206j18344J62812
8692H2459N1324Q868K90525j30565k31680j00337j96256j25828j52940L14139
$$ plain form
8767 -180024 -284124 -544455 -584702 -406250 -238009 -150383 -69356 -84804 -79063 -330643 -356672
8756 -356672 -342310 -136938 221762 72684 -87359 -101265 -111769 -190456 -470908 -429134 -437622
8745 -437622 -493441 -297268 -13684 -71948 -96095 49111 45623 270366 349699 232213 73263
8734 73263 251264 191341 6337 42329 -1957 11955 268020 228951 29441 -125051 -282885
8723 -282885 -38242 281609 147212 -177516 -311184 -167761 -435860 -281894 -178240 -294709
8713 -294709 -154676 -232726 41973 -16614 100972 21528 -18053 57299 -131083 -129084 26288
8702 26288 -3025 -288767 -529700 -656316 -706951 -399539 -92215 37991 -80353 82459
8692 82459 133783 142651 433176 302611 70931 -29406 -225662 -351490 -504430 -190291
8682a90291O1550q2109J16071K92497j69995k18063n4176n0889j75936J43441
8672c27900J78542j88527J53920K87053j91115N0955K07246Q6993r761k02168
8662D5238o114O1960j33480j42463j62549O7998j38579K21425K87574j17074j52813
8651a68877P4861l6811P2260K4655j180r2728K2943O768k1307N4399k70057j01067
8639d36141L6221K29689L7807J34030J81464q1911k6966J68945M102j08168o2477
8628G6595N0595Q3486k18488j38955k93126p8633L39012J33789j3283l22436l661
8617c85105J7099m5604L5454N0117M359J77532K20130k3508o2198o8883k93574
8606c74181o7997J58061M00077Q0443j28138l03346j09024l67N7198J63082L9415
$$ plain form
8682 -190291 -128741 -210850 -94779 197718 27723 -190340 -244516 -295405 -471341 -327900
8672 -327900 -149358 -337885 -183965 103088 -88027 -37072 170174 257167 247406 45238
8662 45238 39124 101084 -32396 -174859 -337408 -269410 -407989 -186564 101010 -16064 -168877
8651 -168877 -94016 -130827 -58567 -33912 -35092 -127820 -104877 -98109 -119416 -65017 -335074 -436141
8639 -436141 -399920 -170231 -132424 1606 183070 101159 74193 243138 247240 139072 76595
8628 76595 127190 210676 -7812 -146767 -439893 -518526 -179514 -45725 -59008 -381444 -385105
8617 -385105 -368006 -413610 -378156 -328039 -323680 -146148 73982 50474 -11724 -80607 -374181
8606 -374181 -442178 -284117 115960 196403 68265 -235081 -344105 -344472 -287274 -124192 -84777
8595h4777K10903r5033n2747M3048j73927j6491j427K8515K2690j23429J65593
8584g7082J48269J3345R5088L1040J42970m2607k6232r4216J00578q7339j62293
8573D1521K40699K02240j28067j98830n1257J25779j14263m09741k61906m8576
8563f02401K26122K79950J94525L1909M0387m1235L1354m2468k7619j35813k45295
8552b90584l0040j5529M7175O7466Q2962l5351k596j86669j50846q2253K54634
8541c41631J86867Q1422K90212P0717o2375n7814R6790M9108J32918l93402k00875
8530a48063m4831j06497J28152J43351L8604Q6374K0685n1056k36597j21265K64041
8519b7102K04891k37329q5600J76752K27593K02339j68837k27642o7808k16156
$$ plain form
8595 -84777 126126 31093 -21654 21394 -152533 -169024 -170451 -141936 -119246 -242675 -77082
8584 -77082 71187 84532 179620 210660 353630 311023 284791 190575 291153 203814 41521
8573 41521 282220 484460 356393 157563 106306 232085 117822 -291919 -553825 -602401
8563 -602401 -376279 -96329 98196 130105 170492 129257 160611 118143 90524 -45289 -290584
8552 -290584 -320624 -336153 -288978 -221512 -138550 -173901 -176497 -363166 -514012 -596265 -341631
8541 -341631 -154764 -73342 216870 287587 225212 167398 264188 313296 446214 52812 -148063
8530 -148063 -192894 -299391 -171239 -27888 10716 97090 117775 66719 -169878 -291143 -27102
8519 -27102 177789 -59540 -145140 31612 259205 461544 292707 65065 -2743 -218899
8509b18899k74796J41761K07489p2445K85904O2159j66573p5819N242j7547k40322
8498c63846J64426M62610K67410l350k12487k59809j52960m7007J92655j61438
8488a13796j42182Q0663K35441K61645j62428j18310J6084J71628O9135j23438
8478A74442M5581Q7517L7308k025Q0142j23947J19601j51535m32505j06549L24715
8467E2745J17474M1036P3351m6567j72403j07102J74977O4245j57637L5937P9566
8456A55622l4249J30906k3293o8651Q3084n2959M5467k6459K2051J06537J14017
8445D52073j46886M0076o2261p5036j77556J22526N6477M6163k2336L4228j30363
8434A37105l10666J83298K02185Q4420p3844j45489j72183K00115J47858k7191
$$ plain form
8509 -218899 -493695 -351934 -144445 -216890 69014 131173 -35400 -111219 -105977 -123524 -363846
8498 -363846 -199420 263190 530600 527250 314763 54954 -98006 -145013 47642 -113796
8488 -113796 -255978 -175315 60126 321771 159343 41033 57117 228745 297880 174442
8478 174442 220023 307540 344848 342823 422965 299018 418619 267084 -165421 -271970 52745
8467 52745 170219 211255 284606 238039 65636 -41466 133511 197756 40119 76056 155622
8456 155622 121373 252279 228986 160335 243419 190460 235927 209468 231519 338056 452073
8445 452073 305187 345263 283002 207966 30410 152936 209413 255576 233240 267468 137105
8434 137105 -173561 9737 211922 296342 222498 77009 -95174 104941 252799 225608
8424B25608p5616r3885J02092j27650N6342L62627j8019K5841J11969k86965r4887
8413A87457J10677j04634q1710N5856N8138J14491j10108l87153l70029J69989
8403c57026L21836J98255J95566M1260O0773j02580k95480q89L70244K9571r960
8392D51570k00785j49474J22899J86727K89479r0552k54242l26828l6689n7418
8382f5313K793K20141J22466j23815m00533q1086L10730J6724k7016l4818n0038
8371a09765k07491p4090j20604J03942J92844k6519k51092J03286Q9507k82486
8361e82468n7655L35114N63730K10487J75113J40339O5178J01258k69131j54208
8351E27757M1578j13851k32398J2446O0323N4038J86720j28866j0533P8072J8034
$$ plain form
8424 225608 149992 56107 158199 30549 86891 449518 431499 457340 569309 282344 187457
8413 187457 298134 193500 111790 167646 225784 340275 230167 -156986 -527015 -357026
8403 -357026 -35190 163065 358631 399891 460664 358084 62604 61715 431959 461530 451570
8392 451570 250785 101311 224210 410937 700416 609864 355622 28794 -7895 -65313
8382 -65313 -62520 157621 280087 156272 -244261 -325347 -14617 2107 -24909 -59727 -109765
8371 -109765 -317256 -391346 -511950 -408008 -215164 -241683 -492775 -389489 -299982 -582468
8361 -582468 -640123 -305009 258721 469208 644321 784660 849838 951096 681965 527757
8351 527757 569335 455484 223086 235532 295855 349893 536613 407747 397214 475286 493320
8340D93320j11930L7271L2779n9188k82983k95237j77614L0956L39637J24896
8330A31907K87063r2874N2289r8491j60284j05800K792J41483N8163N279j81428
8319D0099k47944k5051K00535K8129k02745J84653L97931o9511q7844k92947l9896
8308a14591J20504K37891q5400J84964J57390j05652k02057o9334q1307L1359
8298G3767N4163K9235k71973L0501j4486J9851M2016J18928K79811j14688l13975
8287f6850J53807J56977j48276j29365l4356k15464j6611J31522j9038k9932K21043
8276C457q1518k7275P180q7195j02172j06972K71268K35344j21142j17262Q0936
8265d5351J87148m1091j9740N950j22124p618j60141Q5690j27764M6403j9880
$$ plain form
8340 493320 381390 418661 451440 392252 109269 -185968 -363582 -332626 7011 131907
8330 131907 418970 326096 378385 279894 119610 13810 16602 158085 216248 221527 40099
8319 40099 -207845 -232896 -32361 -4232 -206977 -22324 375607 306096 218252 -74695 -114591
8308 -114591 5913 243804 158404 343368 500758 395106 193049 123715 42408 73767
8298 73767 127930 157165 -114808 -84307 -98793 -78942 -36926 82002 361813 247125 -66850
8287 -66850 86957 243934 95658 -33707 -68063 -283527 -300138 -168616 -187654 -217586 3457
8276 3457 -78061 -105336 -98156 -185351 -287523 -394495 -123227 112117 -9025 -126287 -45351
8265 -45351 141797 100706 80966 86916 -35208 -42826 -202967 -117277 -245041 -198638 -218518
8254b18518m345J57851K95891M2064j59393K3025j0046k60875J27249j0958j1786
8243b9841j34839r8187J43565L71169K8711j81468j95527J19910K23181j18039
8233A28635o742M7537j31890l76035j60967L20k2600J2898J9957j8502O2811K21156
8221b23422L13343k0108J42329k78808k20632j27036K22955R9893j4150o6442
8211a72078l0295J09585p8232J43530p8409k49153N5611K95009o2888k89959K24172
8200a33107J44559Q3096j71726j69834k73235j98968K47146L35817M6925J89573
8190A00246J40540k61704j0494L0654J50520J25790Q1950k67939j40065K4262
8180b6240K3940K15967J56062j04017j15490k47103j43523J55777J71694L29795
$$ plain form
8254 -218518 -222863 -65012 230879 272943 113550 136575 126529 -134346 -7097 -18055 -29841
8243 -29841 -164680 -262867 -119302 251867 280578 99110 -96417 23493 246674 128635
8233 128635 121893 169430 37540 -338495 -499462 -499142 -521742 -508844 -488887 -507389 -444578 -223422
8221 -223422 89921 69813 212142 -66666 -287298 -414334 -191379 -91486 -105636 -172078
8211 -172078 -202373 -92788 -171020 -27490 -105899 -355052 -299441 -4432 -67320 -357279 -133107
8200 -133107 11452 94548 -77178 -247012 -520247 -719215 -472069 -136252 -89327 100246
8190 100246 240786 -20918 -31412 -758 149762 275552 357502 89563 -50502 -26240
8180 -26240 -2300 213667 369729 265712 150222 -96881 -240404 -84627 87067 416862
8170D16862k21397k11492J8854K5953Q5326p506J72973m063n5770q0411l21373
8159a82044r1350J45174L2793J7674J19039J85384k79455l0755J97865L6026P8057
8148B28408m955k61796k76712q4615k234K17536K46327j22479j20781J82402k9639
8137b8538Q5863K08124N2585j78911k45670J33041N3216K7570p4605m4785j98138
8126b10248K6864L79628n7137j3552N7402j7173l02391q0307J93109M8100o0986
8115c6691J50277n811m4489J3469R6249k66316q8777J50418Q3171j99256K90770
8104A43014J09031j31024j45433p9095K9867K51590K02023j0591l36450j74501
8094a41569j24468J90628Q7559K0962k6057P4985J33707j56883l80529q1448m265
$$ plain form
8170 416862 195465 -16027 2827 28780 114106 106600 279573 275510 219740 139329 -182044
8159 -182044 -273394 -128220 -95427 -77753 41286 226670 -52785 -83540 114325 150351 228408
8148 228408 223453 -38343 -315055 -399670 -401904 -184368 61959 -60520 -181301 1101 -28538
8137 -28538 57325 265449 318034 139123 -106547 26494 79710 107280 32675 -12110 -210248
8126 -210248 -183384 196244 139107 125555 182957 165784 -136607 -216914 -23805 24295 -36691
8115 -36691 113586 107775 63286 76755 173004 -93312 -182089 -31671 51500 -147756 143014
8104 143014 252045 121021 -24412 -103507 -73640 177950 379973 369382 32932 -141569
8094 -141569 -266037 -75409 12150 33112 7055 82040 215747 58864 -321665 -403113 -407378
8083d07378O7894J86136L1909K05465K4412n8718p6600J8904j62979m08418J57359
8072d22014P1199J09973j10930j92536L871n474J92225J99631k9664n8841J17509
8061a25051O4068K60148p5389k75459j75269K16712m0407J9962q6668Q6885J61438
8050C0970Q2468q1569L48587J61170k75859q9810n0930j87863j22775k7870R7333
8039a16148K10686N7040j35479J95286o8101o5762j1796j78712J2238l0832l8393
8028a69973r1522k6235L13821J77887P5747p4568k50738R8139J22596Q5593l7877
8017B22870j77170j87989l68802K53260J30251P9048J45933l77749J02510O968
8007a70870j34858q031j73801n2584O7153l5054k9140m7025K03106M45421r5999
$$ plain form
8083 -407378 -339484 -153348 -121439 84026 108438 49720 -26880 -7976 -170955 -579373 -422014
8072 -422014 -350815 -240842 -351772 -544308 -540437 -545911 -353686 -154055 -183719 -242560 -125051
8061 -125051 -60983 199165 123776 -151683 -326952 -110240 -150647 -130685 -217353 -130468 30970
8050 30970 113438 31869 380456 541626 265767 175957 125027 -62836 -185611 -213481 -116148
8039 -116148 94538 151578 16099 211385 143284 77522 65726 -112986 -100748 -131580 -169973
8028 -169973 -261495 -287730 26091 203978 279725 205157 -45581 52558 175154 260747 222870
8017 222870 45700 -142289 -511091 -257831 -127580 -48532 97401 -280348 -177838 -170870
8007 -170870 -305728 -313759 -487560 -540144 -472991 -508045 -537185 -584210 -381104 64317 -31682
7996c1682j43740j64353k46677Q6350M87725M7806k71585j74131m1504m7591j80463
7985f79845J43715K24319K1915R9873L63694K95880J09503R6758L9571j96842
7975E18541j84180j58068j10369J40333k72827q2001j069J05553J22349K46224
7965C24486K6304l8210l7974j18692j11283o8913k67491k71219j13334J31426
7955e44900L69611J34836J99248j66985k36986O1283L1020r5829J946Q218o8027
7944c06565j5195K16909k16306R3196L43554j24787k20679j23750j13298J13482
7934c53439N291L1654K44834L3433K37754M4889M6939K24138j02150l03557j24113
7923a4327l670J51797J50545j0148j5861l5034p4630J9245P3824J9478k43461
$$ plain form
7996 -31682 -175422 -339775 -586452 -500102 -12377 35429 -236156 -410287 -451791 -499382 -679845
7985 -679845 -536130 -311811 -289896 -190023 173671 469551 579054 675812 715383 518541
7975 518541 334361 176293 65924 206257 -66570 -148571 -149640 -44087 78262 324486
7965 324486 350790 312580 274606 155914 44631 -24282 -291773 -562992 -676326 -544900
7955 -544900 -175289 -40453 158795 -8190 -245176 -183893 -152873 -248702 -246756 -238538 -306565
7944 -306565 -321760 -104851 -321157 -227961 115593 -9194 -229873 -353623 -466921 -353439
7934 -353439 -348148 -316494 -71660 -38227 199527 244416 291355 515493 413343 109786 -14327
7923 -14327 -17997 133800 284345 274197 258336 223302 148672 167917 241741 261219 17758
7912A7758K2581K405k54996L1042j1268L45972n4381l57015J76354m1403j49163
7901b72114J04403J29142l391J42167o7141J0510O6778O5807J10555J3708k27008
7890G3416j48418L24726J21961j74647k16577k29777j80558J29263K99206k2836
7880b4241k18761J53837j71331l22196J7177J33554J63049J59002N6903L48260
7870B95253L9157Q7017l48828k10569Q4531K29992J87175L53703l09033k17871
7860A90527j95335j39427J82768n9617M0201K06816P9421N4866k27410k1004p6910
7849C4896j2496P5173R5524P0166N1815k44228k74745j5638M368p1166J19111
7838a67220M0515K30088J94478k4835K77372l4260k36778j63745j86473k66538
$$ plain form
7912 17758 40339 42744 -212252 -181210 -192478 153494 99113 -257902 -81548 -122951 -272114
7901 -272114 -167711 -38569 -41960 100207 33066 43576 110354 176161 286716 300424 73416
7890 73416 -75002 249724 371685 197038 -19539 -249316 -429874 -300611 -1405 -24241
7880 -24241 -243002 -89165 -260496 -582692 -565515 -431961 -268912 -109910 -53007 295253
7870 295253 334410 421427 72599 -137970 -53439 176553 363728 717431 408398 190527
7860 190527 -4808 -144235 38533 -21084 19117 225933 305354 360220 132810 111806 34896
7849 34896 22400 97573 193097 263263 315078 70850 -203895 -219533 -215165 -286331 -167220
7838 -167220 -126705 103383 297861 273026 550398 516138 279360 115615 -70858 -337396
7828c37396p4524K71563J00891q7578J024p0363K98452J04994k54806O6642R6592
7817A15491k11973q3857O7787k12266r1926J28086R7541k2087q0108p0302J36809
7806b26805J73149r1348K09347j34008k1779K61354l3893n4525O6066j72722o9882
7795i5046q8473J57320J76465k08641k43863j08547j6426j34996J52059M75168
7785F5020K24602J29049j5764k91752k11767j3856J53169j91024j49983J57214
7775a45092j94362J72660O0534L8728r83r7037l52598R5452K19925L84638K01405
7764C83270o1131J96011o5627q6963K31772l81543n66964K2968Q5592l0709Q9831
7753a83493J88322o1553M7801j49504N1716k0572j40628j29823R7059K78665J74817
$$ plain form
7828 -337396 -411920 -140357 -39466 -127044 -126020 -196383 102069 207063 -47743 18899 115491
7817 115491 -96482 -180339 -112552 -324818 -416744 -288658 -191117 -213204 -293312 -363614 -226805
7806 -226805 -53656 -145004 64343 -69665 -91444 169910 136017 81492 147558 -25164 -95046
7795 -95046 -183519 -26199 150266 -58375 -302238 -410785 -427211 -562207 -410148 65020
7785 65020 289622 418671 402907 111155 -100612 -114468 38701 -152323 -302306 -145092
7775 -145092 -339454 -166794 -106260 -67532 -68515 -165552 -518150 -422698 -202773 181865 383270
7764 383270 322139 518150 452523 365560 597332 215789 -351175 -328207 -242615 -273324 -183493
7753 -183493 4829 -56724 -8923 -158427 -106711 -127283 -267911 -397734 -300675 -22010 152807
7742A52807M7579j97602j31548J33222Q6074J12771K78113L17568k34905l73074
7732A91005Q636K10201j18919n47199J04020n763j19365M8998P0318r7879J59424
7721i6523K24405k23604j38411Q2321j52786j1184k0919Q5766K41742K61216j58875
7710I3148j79961K0178j9392l0438K23705J76756M0307k07846j44809J16752K36711
7699C25111J9599K7564k94516k4659l8770j25445M18441k01653r5300Q7124K3545
7688A21041o8407j59709J05511M2777K6371l1878q4761n5312j70866o5142O7777
7677b72598P3455Q0537J85801r6570J52094j44890m873j16173k63282j8695L9284
7666c85910K80932L52392j57996k84028j95944j88077J55839O32541L65587k78560
$$ plain form
7742 152807 200386 2784 -128764 4458 90532 203303 481416 798984 564079 191005
7732 191005 199641 409842 290923 -256276 -152256 -158019 -277384 -228386 -158068 -255947 -96523
7721 -96523 127882 -95722 -234133 -151812 -304598 -315782 -336701 -250935 -9193 252023 93148
7710 93148 -86813 -66635 -86027 -116465 107240 283996 324303 116457 -28352 88400 325111
7699 325111 344710 372274 77758 53099 14329 -111116 307325 105672 10372 97496 121041
7688 121041 52634 -107075 -1564 41213 67584 35706 -49055 -104367 -275233 -340375 -272598
7677 -272598 -199143 -118606 67195 -29375 122719 -22171 -27044 -143217 -406499 -425194 -385910
7666 -385910 -104978 247414 89418 -194610 -390554 -578631 -422792 209749 575336 296776
7656B96776r2022j41589k1351N0971j04728k04076k22942K5893K84981J05158
7646b2929O2027o0269J8203J0272k3329p5906j32834k6849L1473L10623J56010
7635B46492j93189o8268k54970J27894O8434R1811j63189P2751L65861J8969j62778
7624A49818Q708J69450L1582j82397o0603J0334j91993k35042j08126n9539J96165
7613b71643M3527R722N4040K26488n5229j16607m7139J98455j83813J6063J83279
7602E7143m0679r0819K08463J23371K86273N5459k08246k64991j87696L45612
7592B83890J57441l19712j97221K4221J86483K531j56812o9898j81402J33238
7582a37241O6335j24420Q6657J76550m4365J3689j3448R0434M03700J74970k84622
$$ plain form
7656 296776 204754 63165 41814 92785 -11943 -216019 -438961 -413068 -128087 -22929
7646 -22929 39098 -21171 -2968 7304 -16025 -91931 -224765 -251614 -220141 90482 246492
7635 246492 53303 -14965 -269935 -142041 -73607 18204 -144985 -72234 293627 312596 149818
7624 149818 158526 327976 359558 177161 116558 126892 -65101 -300143 -408269 -467808 -271643
7613 -271643 -228116 -218394 -164354 62134 6905 -109702 -156841 41614 -142199 -126136 57143
7602 57143 16464 -74355 134108 257479 543752 599211 390965 125974 -61722 283890
7592 283890 441331 121619 -75602 -51381 135102 137633 -19179 -89077 -270479 -137241
7582 -137241 -70906 -195326 -108669 67881 23516 37205 23757 114191 517891 692861 408239
7571D08239k13605L1153O2508r2155k01726k11206k9753P4140q4930J064L2323
7560b23948L39697K48492j82087J7392k71772J15911j70555q5520K4455J85972
7550a963Q6125m6437j47624r1966l4220K3675k56888L21214N5304j06443J35650
7539f3573L01939j25614j87454k62942Q1383K17981j932N3651K08380P99M6451
7528B69069R5590R5992J74563k68682j09182L0098O0717n6481o7339k3072K02528
7517D03801r6722m27202l92488K70814j7219L9187j91522j90005L32949K65895
7507b512q181M5905p3448k71546J84288P9090p0881N6972j6577J72444j62508
7496f6954j87619j1689J22839j7688N1336K16957n9861j9422J12257r6526j13642
$$ plain form
7571 408239 194634 225787 288295 196140 -5586 -216792 -246545 -172405 -257335 -256271 -223948
7560 -223948 115749 364241 182154 199546 -72226 43685 -126870 -212390 -187935 -1963
7550 -1963 84162 37725 -109899 -201865 -236085 -212410 -469298 -148084 -92780 -199223 -63573
7539 -63573 238366 112752 -74702 -337644 -256261 -38280 -40212 13439 221819 222618 269069
7528 269069 364659 460651 635214 366532 257350 287448 348165 291684 224345 201273 403801
7517 403801 307079 -120123 -512611 -241797 -259016 -219829 -411351 -601356 -268407 -2512
7507 -2512 -10693 35212 -38236 -309782 -125494 -46404 -117285 -60313 -76890 95554 -66954
7496 -66954 -254573 -266262 -143423 -161111 -109775 107182 47321 27899 140156 43630 -70012
7485g0012p9684J44660k06778k97761J24788L67484L00950j34026j50482j27835
7475a28696o3017Q0171j2896k24252n30L9918j204J99900p8206k04962J43680
7464b50094P5018J80434K02281K49168k28398j40572m3118j09005o4401p4157
7454b02844J9547K21649N007j06424j4273j564l5071L0151j72765j49388j73623
7443e79598k5350L78821K01574J98664K12567j87080l01177m3105j6038J69654
7433H932J48255k38585m952j7247k5383K7787p4883j5333j24198J95113J24310
7422C816K43994n2853k98336k94144J25386j12681p5430l4603L46950j72912J4968
7411c05845r8124K43668j70692J08624J71924j64831j53347j15726k82120K6277
$$ plain form
7485 -70012 -149696 -5036 -211814 -509575 -384787 -17303 283647 149621 -861 -128696
7475 -128696 -191713 -111542 -124438 -348690 -349220 -309302 -310506 -110606 -188812 -393774 -250094
7464 -250094 -175076 5358 207639 456807 228409 87837 44719 -64286 -128687 -202844
7454 -202844 -183297 38352 43359 -63065 -77338 -78902 -113973 -83822 -256587 -405975 -579598
7443 -579598 -604948 -226127 -24553 174111 386678 199598 -101579 -144684 -160722 8932
7433 8932 157187 -81398 -86350 -103597 -128980 -101193 -176076 -191409 -315607 -120494 3816
7422 3816 247810 194957 -103379 -397523 -272137 -384818 -460248 -494851 -147901 -320813 -305845
7411 -305845 -403969 -160301 -330993 -222369 -50445 -215276 -368623 -484349 -766469 -740192
7401g40192J90694k26560M19566K67818j01984l6623N9458o6269K1329J19634
7391i3129k9141K73204m2951O711q7311k26988j7588k04524j64431K3706J68785
7380c93657L99831Q3710k86131p0791R5598L6751k5967O9242J12300k44188o4381
7369b87683J327K9443O4696L05721K7730l65506k1560P0490m7873J71755L09777
7358B58317N9872j81621j78119K10033J18924j78458l89290J17883J74381p7442
7348f5520O3056J43904J10888m8190j35201K32233j81897k39256Q3438K71115
7338B34570j06514j9647k73958J35618K51488p670O5249K7277k1946l62226k24290
7327c02049n0687J12312J82242j03936J43071j27827Q6327n0420n8879L88776
$$ plain form
7401 -740192 -549498 -776058 -356492 -88674 -190658 -227281 -167823 -234092 -212763 -93129
7391 -93129 -122270 150934 107983 114694 27383 -199605 -217193 -421717 -586148 -562442 -393657
7380 -393657 6174 89884 -196247 -267038 -171440 -134689 -160656 -91414 20886 -223302 -287683
7369 -287683 -286356 -256913 -192217 113504 141234 -224272 -245832 -175342 -223215 -51460 258317
7358 258317 318189 136568 -41551 168482 287406 108948 -280342 -162459 11922 -65520
7348 -65520 -2464 141440 252328 204138 68937 301170 119273 -119983 -36545 234570
7338 234570 128056 108409 -165549 -29931 221557 213887 279136 306413 284467 -77759 -302049
7327 -302049 -352736 -240424 -58182 -162118 -19047 -146874 -60547 -110967 -169846 218930
7317B18930P8253j07619q5965k4339L25400K67349l23374m13387k66681J61519
7307a69914L22059j10812l16267j08179l6443j64634l8536K35026L58868K58979
7297B30147O3220k0303k7065l26019j6815p4130k7633M01282L66081j70195k49870
7286A48700o5104J41364P887q7226l1212l9878j6602m6011m4684J8264J70164
7275A55662j26110K8757J30808o3924m2062j9602k0197J9680O6625j93728k26917
7264b91008o6701J74776M9971o7121j04584J02540p1432j72638O5531J30395N3444
7253a96827j27254K13750L50399k3453K6542m6977K07549n1103M0681n234o3917
7242C24156r6640k60521J19888j24512j59838M3147L0663P5951N9381j285j94234
$$ plain form
7317 218930 297183 189564 103599 79260 404660 672009 348635 -64752 -331433 -169914
7307 -169914 152145 41333 -274934 -383113 -419556 -584190 -622726 -387700 -28832 230147
7297 230147 293367 273064 245999 -80020 -96835 -170965 -198598 202684 568765 398570 148700
7286 148700 83596 224960 232847 145621 114409 74531 57929 11918 -32766 -14502 155662
7275 155662 29552 58309 189117 125193 83131 63529 43332 63012 129637 -64091 -291008
7264 -291008 -357709 -182933 -132962 -200083 -304667 -202127 -273559 -446197 -380666 -250271 -196827
7253 -196827 -324081 -110331 240068 216615 243157 196180 403729 352626 393307 388073 324156
7242 324156 227516 -33005 86883 -37629 -197467 -154320 -123657 -47706 11675 10390 -183844
7231a83844j78376P1315L14467l17939j11958M9654P6860J35263M09j24312L9814
7220b28647O3482J91717O6951k72021n0617n0405o1236m0108J35120m376l4529
7209b84669n9787P58J40075L0146j03639k04573J00749P9676J09918J55350j17845
7198a53841R208m8804K36057j61987j26415K03240J59126J22108l3648j84991
7188B0053q5832k50562j70967J96815K14806L2422j20822M2364K42496n479j68546
7177e3252N8374M8016K77634j2164m181L801j64353p2603o0742p6799j12576L38106
7165A69261J0262r9150k56276J94375J04137l22695j93630J02708R7287O7666
7155a26055K9605l2625k2029J90782q1179o0851K95438L14473J76452k13834j62605
$$ plain form
7231 -183844 -362220 -290905 23562 -294377 -406335 -356681 -279821 -144558 -144149 -268461 -228647
7220 -228647 -165165 26552 93503 -178518 -229135 -279540 -340776 -380884 -245764 -250140 -284669
7209 -284669 -344456 -343698 -203623 -173477 -277116 -481689 -380940 -301264 -191346 -35996 -153841
7198 -153841 -144633 -193437 42620 -119367 -245782 -42542 116584 238692 205044 20053
7188 20053 -65779 -316341 -487308 -290493 -75687 -43265 -164087 -121723 120773 115294 -53252
7177 -53252 5122 53138 330772 318608 314427 318228 153875 81272 20530 -56269 -168845 169261
7165 169261 179523 80373 -175903 18472 122609 -200086 -393716 -291008 -193721 -126055
7155 -126055 -96450 -129075 -151104 39678 -41501 -102352 193086 507559 684011 470177 307572
7144C07572k96174k6472j5237R5608J18509J43662J92037k11732k44681j74080
7134a10988q2936O5797k6493O8563J55375J62429j74194k2238Q6405j05227k7671
7123a1178K41390J25784k82338l9926Q9018K7173K4867j48521j13849p6001J61929
7112a652J69593j74247k22601j80023r9936J29729K30026J56992O8597N2995J79180
7101C08653j1340j98270O4217j67290J64016L6299k31495n8833j94193k19313
7091e07549j45352L80848M6892L9295n9631r1957r1489q4029K03907K72396k986
7080c9655L5163J93047m7216k33800l57498J53615K77803j74433J9239R1391j6734
7069i9078j28399N9268K91324j69032M7810k7925R7857P2293k75936j43900n564
$$ plain form
7144 307572 11398 -15074 -30311 65297 183806 327468 519505 307773 63092 -110988
7134 -110988 -193924 -128127 -154620 -86057 69318 231747 57553 35315 121720 16493 -11178
7123 -11178 230212 355996 73658 33732 122750 149923 174790 26269 -87580 -163581 -1652
7112 -1652 167941 -6306 -228907 -408930 -508866 -379137 -149111 7881 76478 129473 308653
7101 308653 297313 99043 163260 -4030 159986 196285 -35210 -94043 -288236 -507549
7091 -507549 -652901 -272053 -225161 -185866 -245497 -337454 -428943 -512972 -309065 -36669 -39655
7080 -39655 -4492 188555 141339 -92461 -449959 -296344 -18541 -192974 -173735 -82344 -99078
7069 -99078 -227477 -168209 123115 -45917 1893 -26032 71825 144118 -131818 -275718 -281282
$$ [...]
##END NTUPLES=NMR SPECTRUM
##END=
