##TITLE=Analysis number 320237
Compound Code rdp 00158
Project Code adrs
Chemist Name fudan
##JCAMPDX= 6.0         $$ Bruker NMR JCAMP-DX V2.0
##DATA TYPE= NMR SPECTRUM
##DATA CLASS= NTUPLES
##ORIGIN= Bruker BioSpin GmbH
##OWNER= nmr
$$ XWIN-NMR		Version 3.5
$$ Mon Jun 19 13:28:51 2006 GMT Daylight Time (UT+1h)  MAYBRIDGE\nmr@NMR_250MHZ
##.OBSERVE FREQUENCY= 250.131544655141
##.OBSERVE NUCLEUS= ^1H
##.ACQUISITION MODE= SIMULTANEOUS (DQD)
##.ACQUISITION SCHEME= undefined
##.AVERAGES= 16
##.DIGITISER RES= 18
##SPECTROMETER/DATA SYSTEM= dpx250
##.PULSE SEQUENCE= zg30
##.SOLVENT NAME= CDCl3
##.SHIFT REFERENCE= (INTERNAL, CDCl3, 0, 16.522)
##AUDIT TRAIL= $$ (NUMBER, WHEN, WHO, WHERE, WHAT)
$$ ##TITLE= Audit trail, XWIN-NMR		Version 3.5
$$ ##JCAMPDX= 5.01
$$ ##ORIGIN= Bruker BioSpin GmbH
$$ ##OWNER= nmr
$$ C:\u/data/dgb/nmr/ADRS/1020/pdata/1/auditp.txt
$$ ##AUDIT TRAIL=  $$ (NUMBER, WHEN, WHO, WHERE, WHAT)
(   1,<2006-06-19 13:28:30.70 +100>,<MAYBRIDGE\nmr>,<NMR_250MHZ>,
      <created by zg, POWCHK disabled, PULCHK disabled
       configuration hash MD5:
       E2 DF 36 D8 04 B2 41 60 5A D7 A3 38 5A 4B D0 FE
       data hash MD5: 64K
       68 38 14 36 07 9B E2 A6 E5 A0 4E F7 9B 46 31 3A>)
(   2,<2006-06-19 13:28:42.45 +100>,<MAYBRIDGE\nmr>,<NMR_250MHZ>,
      <Start of raw data processing
       ef LB = 0.3 FT_mod = 6 PKNL = 1 SI = 32K 
       data hash MD5: 32K
       02 71 F4 65 16 D9 8A 27 B0 A2 B2 B0 8D 9A 72 FA>)
(   3,<2006-06-19 13:28:44.29 +100>,<MAYBRIDGE\nmr>,<NMR_250MHZ>,
      <apk 
       data hash MD5: 32K
       91 DE E4 A3 9C 03 B5 D0 58 6B 62 E3 C1 18 9B C0>)
(   4,<2006-06-19 13:28:45.14 +100>,<MAYBRIDGE\nmr>,<NMR_250MHZ>,
      <abs ABSG = 5 
       data hash MD5: 32K
       97 38 5A EA 6B CA 8E 8E 21 6F 0C 3E B9 D0 EC 14>)
$$ ##END=
$$ 
$$ hash MD5
$$ 08 45 FB A7 45 7E 5D C3 05 09 3B 08 A7 DB 3D 57
##$RELAX= 
##$RELAX= 
##$RELAX= 
##$RELAX= 
##$RELAX= 
##$RELAX= 
##$RELAX= 
$$ Bruker specific parameters
$$ --------------------------
##$DU= <C:\u>
##$EXPNO= 1020
##$NAME= <ADRS>
##$PROCNO= 1
##$TYPE= <nmr>
##$USER= <dgb>
##$AMP= (0..31)
100 100 100 100 100 100 100 100 100 100 100 100 100 100 100 100 100 100 
100 100 100 100 100 100 100 100 100 100 100 100 100 100 
##$AQSEQ= 0
##$AQ_mod= 3
##$AUNM= <au_zg>
##$AUTOPOS= <31 >
##$BF1= 250.13
##$BF2= 250.13
##$BF3= 250.13
##$BF4= 250.13
##$BF5= 500.13
##$BF6= 500.13
##$BF7= 500.13
##$BF8= 500.13
##$BYTORDA= 1
##$CFDGTYP= 0
##$CFRGTYP= 5
##$CHEMSTR= <none>
##$CNST= (0..31)
1 1 145 1 1 1 1 1 1 1 1 1 1 1 1 1 1 1 1 1 1 1 1 1 1 1 1 1 1 1 1 1 
##$CPDPRG= <>
##$CPDPRG1= <>
##$CPDPRG2= <>
##$CPDPRG3= <>
##$CPDPRG4= <mlev>
##$CPDPRG5= <mlev>
##$CPDPRG6= <mlev>
##$CPDPRG7= <mlev>
##$CPDPRG8= <mlev>
##$CPDPRGB= <>
##$CPDPRGT= <>
##$D= (0..31)
0 1 0 0 0 0 0 0 0 0.06 0 0 0 0 0 0 0.0002 0 0 0 0 0 0 0 0 0 0 0 0 0 0 
0 
##$DATE= 1150720109
##$DBL= (0..7)
120 120 120 120 120 120 120 120 
##$DBP= (0..7)
150 150 150 150 150 150 150 150 
##$DBP07= 0
##$DBPNAM0= <>
##$DBPNAM1= <>
##$DBPNAM2= <>
$$ [...]
##$SUBNAM7= <"">
##$SUBNAM8= <"">
##$SUBNAM9= <"">
##$SW= 20.6930455092707
##$SWIBOX= (0..15)
0 0 3 0 0 0 0 0 0 0 0 0 0 0 0 0 
##$SW_h= 5175.983436853
##$TD= 65536
##$TD0= 1
##$TE= 294.16
##$TE2= 300
##$TE3= 300
##$TEG= 300
##$TL= (0..7)
0 120 120 120 120 120 120 120 
##$TP= (0..7)
150 150 150 150 150 150 150 150 
##$TP07= 0
##$TPNAME0= <>
##$TPNAME1= <>
##$TPNAME2= <>
##$TPNAME3= <>
##$TPNAME4= <>
##$TPNAME5= <>
##$TPNAME6= <>
##$TPNAME7= <>
##$TPOAL= (0..7)
0.5 0.5 0.5 0.5 0.5 0.5 0.5 0.5 
##$TPOFFS= (0..7)
0 0 0 0 0 0 0 0 
##$TUNHIN= 0
##$TUNHOUT= 0
##$TUNXOUT= 0
##$USERA1= <user>
##$USERA2= <user>
##$USERA3= <user>
##$USERA4= <user>
##$USERA5= <user>
##$V9= 5
##$VALIST= <valist>
##$VCLIST= <CCCCCCCCCCCCCCC>
##$VD= 0
##$VDLIST= <DDDDDDDDDDDDDDD>
##$VPLIST= <PPPPPPPPPPPPPPP>
##$VTLIST= <TTTTTTTTTTTTTTT>
##$WBST= 1024
##$WBSW= 4
##$XGAIN= (0..3)
0 0 0 0 
##$XL= 0
##$YL= 0
##$YMAX_a= 840812
##$YMIN_a= -891456
##$ZGOPTNS= <>
##$ZL1= 120
##$ZL2= 120
##$ZL3= 120
##$ZL4= 120
##$ABSF1= 16.522
##$ABSF2= -4.171173
##$ABSG= 5
##$ABSL= 3
##$ALPHA= 0
##$AQORDER= 0
##$ASSFAC= 0
##$ASSFACI= 0
##$ASSFACX= 0
##$ASSWID= 0
##$AUNMP= <proc_1d>
##$AZFE= 0.1
##$AZFW= 0.1
##$BCFW= 0
##$BC_mod= 0
##$BYTORDP= 0
##$COROFFS= 0
##$CY= 12.5
##$DATMOD= 1
##$DC= 0
##$DFILT= <>
##$DTYPP= 0
##$F1P= 14.0000005364418
##$F2P= -0.99999901652339
##$FCOR= 0.5
##$FTSIZE= 32768
##$FT_mod= 6
##$GAMMA= 0
##$GB= 0
##$INTBC= 1
##$INTSCL= 1
##$ISEN= 128
##$LB= 0.3
##$LEV0= 0
##$LPBIN= 0
##$MAXI= 10000
##$MC2= 0
##$MEAN= 0
##$ME_mod= 0
##$MI= 0
##$NCOEF= 0
##$NC_proc= -1
##$NLEV= 6
##$NOISF1= 0
##$NOISF2= 0
##$NSP= 0
##$NTH_PI= 0
##$NZP= 0
##$OFFSET= 16.522
##$PC= 1
##$PHC0= 170.7679
##$PHC1= 6.230362
##$PH_mod= 1
##$PKNL= yes
##$PPARMOD= 0
##$PSCAL= 4
##$PSIGN= 0
##$REVERSE= no
##$SF= 250.13
##$SI= 32768
##$SIGF1= 0
##$SIGF2= 0
##$SINO= 400
##$SIOLD= 32768
##$SREGLST= <1H.CDCl3>
##$SSB= 0
##$STSI= 32768
##$STSR= 0
##$SW_p= 5175.98343685301
##$SYMM= 0
##$S_DEV= 0
##$TDeff= 65536
##$TDoff= 0
##$TI= <Analysis number 999999
Compound Code 99
Book Reference 9
Project Code 9>
##$TILT= no
##$TM1= 0
##$TM2= 0
##$TOPLEV= 0
##$USERP1= <user>
##$USERP2= <user>
##$USERP3= <user>
##$USERP4= <user>
##$USERP5= <user>
##$WDW= 1
##$XDIM= 32768
##$YMAX_p= 286468588
##$YMIN_p= -14939
$$ End of Bruker specific parameters
$$ ---------------------------------
##NTUPLES= NMR SPECTRUM
##VAR_NAME=  FREQUENCY,     SPECTRUM/REAL,   SPECTRUM/IMAG
##SYMBOL=    X,             R,               I
##VAR_TYPE=  INDEPENDENT,   DEPENDENT,       DEPENDENT
##VAR_FORM=  AFFN,          ASDF,            ASDF
##VAR_DIM=   32768,         32768,           32768
##UNITS=     HZ,            ARBITRARY UNITS, ARBITRARY UNITS
##FACTOR=    0.157963299565203, 1,           1
##FIRST=     4132.6476996994, 0,             0
##LAST=      -1043.33573715361, 0,           0
##MIN=       -1043.33573715361, -14939,      0
##MAX=       4132.6476996994, 286468588,     0
$$ Real data points
##PAGE= N=1
##DATA TABLE= (X++(R..R)), XYDATA
$$ [...]
16448D402L929p07j372J014J443j714m197m380R74J074j731K998J125j353j020
$$ 4402 8331 7624 6252 7266 8709 6995 2798 -1582 -608 466 -1265 1733 2858 1505 485
16433D85k453R37r15K731J177J548L7r96l61j26M0k039K055L92j56JL19k241m772
$$ 485 -1968 -1031 -1946 785 1962 3510 3547 2551 2190 2064 2104 65 2120 2512 2356 2357 2676 435 -4337
16414d337m7M217J468p05j505J276K488p37M09J965K130k562n343K32L704K164
$$ -4337 -4384 -167 1301 596 -909 367 2855 2118 2527 4492 6622 4060 -1283 -1051 2653 4817
16398D817k674l856k588K075N08J622k904q78K86m12L86J292q49k782j914N900
$$ 4817 2143 -1713 -4301 -2226 -1718 -96 -3000 -3878 -3592 -4004 -3618 -2326 -3175 -5957 -7871 -1971
16382a971L636k108k595M87j912j561l96L613j181K406J253r90m31j56J904j221
$$ -1971 1665 -443 -3038 -2551 -4463 -6024 -6420 -2807 -3988 -1582 -329 -1319 -1750 -1906 -2 -1223
16366a223l140K216J282k828k182J840R74q57K634l83l32j35M82m403q98P270
$$ -1223 -4363 -2147 -865 -3693 -5875 -4035 -3061 -3918 -1284 -1667 -1999 -2134 -1652 -6055 -6953 317
16350C17M914J436m323m119P82J96q04K475N248Q88j574j027M4k839p13K324R71
$$ 317 5231 6667 2344 -1775 -993 -797 -1601 874 6122 7010 5436 4409 4453 1614 901 3225 4196
16333D196l250q17o86N82J810L343n02o306l692m00J071Q16J801J734K13K045
$$ 4196 946 129 -557 25 1835 5178 4676 -1630 -5322 -5722 -4651 -3835 -2034 -300 -87 1958
16317A958k640l520J548M69M456K535l932l058K599M740L24m014L96p07j410J151
$$ 1958 -682 -4202 -2654 -2185 2271 4806 874 -2184 415 5155 5479 1465 1861 1154 -256 895
16301H95N02J730n74j780K71k084m86J819r38Q01j980J044K138K476M033o37l361
$$ 895 1397 3127 2553 773 1044 -1040 -1526 293 -645 156 -1824 -780 1358 3834 7867 7230 3869
16284C869J796j154l30j416R38N1k019J001p50k210p58O9n35N034L299q59m261
$$ 3869 5665 4511 4181 2765 3703 3754 1735 2736 1986 -224 -982 -913 -1448 3586 6885 6026 1765
16267A765m031k47J15j912O59L110N518J967j865m338j452J233j28R10J7j499
$$ 1765 -2266 -2513 -2398 -4310 -3651 -541 4977 6944 5079 741 -711 522 394 1304 1321 -178
16251a78J529J678j286J237j464J145Q91N47Rk107K87j426p87J901j216j025P26
$$ -178 1351 3029 1743 2980 1516 2661 3552 4099 4108 2001 2288 862 75 1976 760 -265 461
16234D61k287J9M83J735O34j82j093K32J709M78o32L657K048m208l665r4M803
$$ 461 -1826 -1807 -1324 411 1045 863 -230 2 1711 2189 1557 5214 7262 3054 -611 -705 4098
16217D098p24J425o86K18J352k655j499l29M55Q36k496j574j288R70j141K485
$$ 4098 3374 4799 4113 4331 5683 3028 1529 1200 1655 2491 -5 -1579 -2867 -1897 -3038 -553
16201e53K614J784k616l260l459J862J126L686J24k220j004l560l094Q7K506J078
$$ -553 2061 3845 1229 -2031 -5490 -3628 -2502 1184 1308 -912 -1916 -5476 -8570 -8483 -5977 -4899
16185d899M512K722m727l069L157O00p45R30l53K83J807j15M45l52J522K835L807
$$ -4899 -387 2335 -2392 -5461 -2304 -1704 -2449 -1519 -1872 -1589 218 103 548 196 1718 4553 8360
16168H360l354m351m3j373p97K36O65q49P33q29J683P83J70K510j77J630k70m922
$$ 8360 5006 655 612 -761 -1558 -1322 -657 -1506 -773 -1602 81 864 1034 3544 3367 4997 4727 -195
16150a95m323k284J148O49M809N575j22j108k270l076K817J757k054L47J204j40
$$ -195 -4518 -6802 -5654 -5005 -196 5379 5257 4149 1879 -1197 1620 3377 1323 1670 2874 2734
16134B734k231k997L05J634J860j262l07j14j9j094k529k155P85J992n35k23K832
$$ 2734 503 -2494 -2189 -555 1305 43 -264 -378 -397 -1491 -4020 -6175 -5390 -3398 -3933 -4156 -1324
16117a324j488J508K19K118K13l040l02K31m9R94Q78J979l48l38P06j338l030
$$ -1324 -2812 -1304 -1085 1033 1246 -1794 -2096 -1865 -1914 -920 -42 1937 1589 1251 1957 619 -2411
16100b411l78k289K846M818k278k142K948j807k182M17L43M517J112j808n000
$$ -2411 -2789 -5078 -2232 2586 308 -1834 1114 -693 -2875 -2458 -2115 2402 3514 1706 -3294
16085c294j045L184q03q43J231n09j470O07J120J010O33k1l5K212O89J077j075
$$ -3294 -4339 -1155 -1958 -2801 -1570 -2079 -3549 -2942 -1822 -812 -179 -200 -235 1977 2666 3743 2668
16068B668J144j594j207L009j85n38J465K701m40m90J28K130q52o45m365k218
$$ 2668 3812 2218 1011 4020 3835 3297 4762 7463 7023 6533 6661 8791 7939 7294 2929 711
16052G11l64R87k4j548J79n72J805Q7l8K242K105n17k272j868j766N49K194j821
$$ 711 347 1334 1310 -238 -59 -631 1174 1261 1223 3465 5570 5053 2781 913 -853 -304 1890 69
16034F9j281J94J018M56m987p18L159k24M72J665j498J433K262L246K079k598
$$ 69 -1212 -1018 0 456 -4531 -5249 -2090 -2314 -1842 -177 -1675 -242 2020 5266 7345 4747
16018D747l416k728j853K755L244k842l95k712n381OO03J845K823j043k28L382
$$ 4747 1331 -1397 -3250 -495 2749 -93 -488 -3200 -8581 -8575 -7972 -6127 -3304 -4347 -4575 -1193
16002a193J281j96k83l222l34L534J196k598k814J221R38j515k61L150N11j441
$$ -1193 88 -108 -391 -3613 -3947 -413 783 -1815 -4629 -3408 -2470 -3985 -4246 -1096 -585 -2026
15986b026J462p20l016j660M507K876k94k263J552k90k417j273J28K91J817Q36
$$ -2026 -564 -1284 -4300 -5960 -1453 1423 1129 -1134 418 128 -2289 -3562 -3434 -3143 -1326 -490
15970d90j992j88J502k010j119K904K501J311O44q27n05K861J008j262k250Q63
$$ -490 -2482 -2670 -1168 -3178 -4297 -1393 1108 2419 3063 2236 1731 4592 5600 4338 2088 2951
15954B951j091m390N20L257j089J419k372k062L583M878l364p036R38M81M68L631
$$ 2951 1860 -2530 -2010 1247 158 1577 -795 -2857 726 5604 2240 -4796 -3858 -3377 -2909 722
15938G22O14j724m212l829P86N054k15j617p13k372L480L221j374J886K888p34
$$ 722 1336 -388 -4600 -8429 -7643 -2589 -2804 -4421 -5134 -7506 -4026 -805 -2179 -293 2595 1861
15922A861n95o30J302L685j258o39k233k794l122J440M916j448l496k395k090
$$ 1861 1266 636 1938 5623 4365 3726 1493 -1301 -4423 -2983 1933 485 -3011 -5406 -7496
15907g496L360J931j747K692J336J108q37k85k173k619R8P74J209n3N93q30j709
$$ -7496 -4136 -2205 -3952 -1260 76 1184 347 62 -2111 -4730 -4632 -3858 -2649 -2702 -2109 -2939 -4648
15890d648R12k837k410M568K172k922j947L470K395J262R8k652Q16R25N80m33
$$ -4648 -3736 -6573 -8983 -4415 -2243 -5165 -7112 -3642 -1247 15 113 -2539 -1723 -798 -218 -651
15874f51l916N37J600J616m73J388Q23j112j993j30p19J791M028J147P0j132l354
$$ -651 -4567 -4030 -2430 -814 -1287 101 924 -188 -2181 -2311 -3030 -1239 2789 3936 4006 2874 -480
15857d80k468j42J028L804K759o04m812k534k225k932L575K364n16J472o28n12
$$ -480 -2948 -3090 -2062 1742 4501 3897 -915 -3449 -5674 -8606 -5031 -2667 -3183 -1711 -2339 -2851
15841b851j235j985k192N116P668K547j419j491k319k9J332K5j865j090M25q43
$$ -2851 -4086 -6071 -8263 -3147 4521 7068 5649 4158 1839 1810 3142 3167 1302 212 637 -206
15825b06k19j703J103p83j936J07k236J070o82N5OJ773L495k894j619N94n8M08
$$ -206 -425 -2128 -1025 -1808 -3744 -3637 -5873 -4803 -5485 -5430 -5424 -3651 -156 -3050 -4669 -4075 -4133 -3725
15807c725L35nO34J526K223K578nk648j581P0L789J106j281l699l206J131J288
$$ -3725 -3390 -3395 -2761 -1235 988 3566 3561 913 -668 -598 3191 4297 3016 -683 -3889 -2758 -1470
15790a470L031L745J488l383k563J085L29m137k437K319q75o76J975j34j987L066
$$ -1470 1561 5306 6794 3411 848 1933 2262 -1875 -4312 -1993 -2868 -3544 -1569 -1703 -3690 -624
15774f24l24k085P54Q39K314o70k0j12k782q4j710R97P54K61j491j654l63L823
$$ -624 -948 -3033 -2279 -1440 874 204 184 72 -2710 -2794 -4504 -3507 -2753 -2492 -3983 -5637 -6000 -2177
15756b177L956j183n364n88M751K177J819l261j694j145l97j495o455J788M465
$$ -2177 1779 596 -4768 -5356 -605 1572 3391 130 -1564 -2709 -3106 -4601 -11056 -9268 -4803
15741d803J765m15J016R42J292m16R93J468p44j58j311l118j002J993M101j830
$$ -4803 -3038 -3453 -2437 -1495 -203 -619 374 1842 1098 940 -371 -3489 -4491 -2498 1603 -227
15725b27j456L635P157j715l079L75j532m035j664J319J430J28J015J132j846
$$ -227 -1683 1952 9109 7394 4315 4690 3158 -877 -2541 -1222 208 336 1351 2483 637
15710F37n19j802O30j076K130k590k747L532R32k22l82q08k315k020J228L525
$$ 637 118 -1684 -1054 -2130 0 -2590 -5337 -1805 -873 -1095 -1477 -2285 -4600 -6620 -5392 -1867
15694a867K04J892M80O35J097N6n75M326q78k443M30k080l646L659Q15k820N64
$$ -1867 -1663 229 709 1344 2441 2497 1922 6248 5370 2927 3357 1277 -2369 1290 2105 -715 -151
15677a51j081L063J56l638J531O51O28N474m93k679O94k295j01J382n97J037L160
$$ -151 -1232 1831 1987 -1651 -120 531 1159 6633 6140 3461 4155 1860 1759 3141 2544 3581 6741
15660F741K478j293k837L916K028J385j955n514p44k984j09K932l178m047j966
$$ 6741 9219 7926 5089 9005 11033 12418 10463 4949 4205 1221 1112 4044 866 -3181 -5147
15645e147J896L319K051o31J062j741p29r37M436K311o250k233R05J831Q10J657
$$ -5147 -3251 68 2119 1488 2550 809 80 -857 3579 5890 -360 -2593 -1688 143 953 2610
15629B610j22k527k114m3j795J14L19M27J712k993m944J224K971L402J342J684
$$ 2610 2488 -39 -2153 -2196 -3991 -3877 -3558 -3131 -1419 -4412 -9356 -8132 -5161 -1759 -417 1267
15613A267K941M774K050j827k419k874K067K168j63k878k600M661L704j873l306
$$ 1267 4208 8982 11032 9205 6786 3912 5979 8147 7984 5106 2506 7167 10871 8998 5692
15598E692J667K317m1P03j949j296j013r05l332k660j222L68N47k825R29M046
$$ 5692 7359 9676 9635 10338 8389 7093 6080 5175 1843 -817 -2039 -1671 -1124 -3949 -3020 1026
15582A026J070p37k669j794m35J209R00k7n11O25K374j335m23r42p54j521P01
$$ 1026 2096 1359 -1310 -3104 -3539 -2330 -1430 -1457 -1968 -1343 1031 -304 -727 -1669 -2423 -3944 -3243
15565c243N95Q98p11J70j408L498J202l269j225j013k599L430q67q1q74M938N275
$$ -3243 -2648 -1750 -2461 -2291 -3699 -201 1001 -2268 -3493 -4506 -7105 -3675 -4542 -4623 -5497 -559 4716
15548D716J612p46r31j379J015k90J500j457j862k204K25k71r44QL737q70k281
$$ 4716 6328 5582 4651 3272 4287 3997 5497 4040 2178 -26 199 -72 -1016 -1008 2729 1859 -422
15531d22L34q08k841k85O89J268L439j004j723J796L047J727K008j113k278Q12
$$ -422 -88 -896 -3737 -4022 -3333 -2065 1374 370 -1353 443 3490 5217 7225 6112 3834 4646
15515D646N114L964j895m238k820K659N85j394K777O2j146P43M8l822l883J181
$$ 4646 9760 13724 11829 7591 4771 7430 8015 6621 9398 9460 8314 9057 9105 5283 1400 2581
15499B581K296j809j305k462j445m71J041J363j508K362J481o85m44q50k860M73
$$ 2581 4877 3068 1763 -699 -2144 -2615 -1574 -211 -1719 643 2124 1439 995 145 -2715 -2242
15483b242P74l03J114K169M94k00k050p98M091J554j638l063j917j397O36K063
$$ -2242 -1468 -1771 -657 1512 2006 1806 -244 -1042 3049 4603 2965 -98 -2015 -3412 -2776 -713
15467g13j214N062o58n498l46J898k402m32K850K400J419j394k412J558J174K58
$$ -713 -1927 3135 2477 -3021 -3367 -1469 -3871 -4303 -1453 947 2366 972 -1440 118 1292 1550
15451A550l857k895R29P231J504k361K352J845Q11j693r05m536m918k107K594
$$ 1550 -2307 -5202 -4273 2958 4462 2101 4453 6298 7109 5416 4511 -25 -4943 -7050 -4456
15436d456J991M97N75j169k376j911j03K716M13J706k071o80L362J597J110J120
$$ -4456 -2465 -1968 -1393 -2562 -4938 -6849 -6952 -4236 -3823 -2117 -4188 -4868 -1506 91 1201 2321
15420B321j526o13j110p32J761r86N21l059k91K640K898j906J0j793J117M036
$$ 2321 795 182 -928 -1660 101 -885 -364 -3423 -3714 -1074 1824 -82 -72 -1865 -748 3288
15404C288q71k376j245j802K282R68k781l373J766J293J011k570k786M119J530
$$ 3288 2417 41 -1204 -3006 -724 244 -2537 -5910 -4144 -2851 -1840 -4410 -7196 -3077 -1547
15389a547P67J476k003j349J689j588j110J357L588K430j19m627J888J021j86
$$ -1547 -780 696 -1307 -2656 -967 -2555 -3665 -2308 1280 3710 3591 -1036 852 1873 1687
15374A687j181k71j997N42N644N005L71n166l619k530j907M90q76J593K892n246
$$ 1687 506 235 -1762 -1220 4424 9429 9800 4634 1015 -1515 -3422 -2932 -3808 -2215 677 -4569
15358d569k71M473J804l523K63J461Q02k587Q26n65m34J813R62k13j857r77L360
$$ -4569 -4840 -367 1437 -2086 -1823 -362 440 -2147 -1321 -1886 -2320 -507 455 242 -1615 -2592 768
15341G68J828k695n98j656N511K147k511k161k748k497L434J262r97k080N827
$$ 768 2596 -99 -697 -2353 3158 5305 2794 633 -2115 -4612 -1178 84 -913 -2993 2834
15326B834K392l120j671j648K455J142k299K588J6L13m10k080l96j496k690J04
$$ 2834 5226 2106 435 -1213 1242 2384 85 2673 2689 3002 2592 512 116 -1380 -4070 -3966
15310c966M956L011L26m682j127k086j40k935l803J604J552K79N707K058k343
$$ -3966 990 4001 4327 -355 -1482 -3568 -3708 -6643 -10446 -8842 -7290 -7011 -1304 754 -1589
15295a589Q96j954l106k208k167K457L087j407m72K06K103K155J086m131o699
$$ -1589 -693 -2647 -5753 -7961 -10128 -7671 -4584 -5991 -6463 -6257 -4154 -1999 -913 -5044 -11743
15280a1743M45M734Q64J141J70m56k036j7m85J941M079L756j461o55j638l33J244
$$ -11743 -11298 -6564 -5700 -4559 -4389 -4845 -6881 -6898 -7383 -5442 -1363 2393 932 277 -1361 -1694 -450
15263d50J183K066j149m11J329n30j938Q36k490J424j13j53K667K94o40J187L97
$$ -450 733 2799 1650 1239 2568 2038 100 936 -1554 -130 -243 -396 2271 2565 1925 3112 3509
15246C509r7m295j912J743j938l125J246J424J467j63K410K470j192l229j058
$$ 3509 3412 -883 -2795 -1052 -2990 -6115 -4869 -3445 -1978 -2141 269 2739 1547 -1682 -2740
15231b740J653Q16p60M64K891j120j612k109r52J763K025K436N50j815k203J248
$$ -2740 -1087 -271 -1031 -567 2324 1204 -408 -2517 -3469 -1706 319 2755 3305 1490 -713 535
15215E35J216n93L21N78R98J120q65k583n231J237q1O95j193L734K643l514l226
$$ 535 1751 1158 1479 2057 3055 4175 3310 727 -4504 -3267 -3348 -2653 -3846 -112 2531 -983 -4209
15198d209j092J858K271R75J666k243p24L589q6l815k044k45K452K380r29o90
$$ -4209 -5301 -3443 -1172 -197 1469 -774 -1498 2091 2005 -1810 -3854 -4099 -1647 733 -196 -886
15182h86j460K748J544K359K479l047k357L395J874l237M40l072k967L72J477
$$ -886 -2346 402 1946 4305 6784 3737 1380 4775 6649 3412 3852 780 -2187 -1815 -338
15167c38J578J884N21j581j400K00j6n767n44k06M395K005k523N93r53Q85J772
$$ -338 1240 3124 3645 2064 664 864 848 -4919 -5463 -5669 -1274 731 -1792 -1199 -2152 -1267 505
15150E05O56K2J856j598k90j162l162j61N10J167l21K302Q6M24l972j411J705
$$ 505 1161 1183 3039 1441 1151 -11 -3173 -3334 -2824 -1657 -1978 324 410 834 -3138 -4549 -2844
15133b844m59o08m01K040J711K388k464q73L698J376j038k653p32P36J935R37
$$ -2844 -3303 -3911 -4312 -2272 -561 1827 -637 -1510 2188 3564 2526 -127 -859 -123 1812 2749
15117B749L66n0K93j424j801j45J504J629O04J082nn905j627l00J887k601j219
$$ 2749 3115 3065 3358 1934 133 -12 1492 3121 3725 4807 4802 -1103 -2730 -3030 -1143 -3744 -4963
15100d963K735K823J241N47j75K121N019j024l786K600J452J232j420p108p9L89
$$ -4963 -2228 595 1836 2383 2208 4329 9348 8324 4538 7138 8590 9822 8402 1294 1215 1604
15084A604m60K667j535K266L704q31r61k739L96J306j312m16K346p94k949N64
$$ 1604 1144 3811 2276 4542 8246 7415 6454 3715 4111 5417 4105 3689 6035 5241 2292 2856
15068B856q43l235j643r39J942J355o25L125K243l240k336J472L219n0j340K97
$$ 2856 2013 -1222 -2865 -3804 -1862 -507 -1132 1993 4236 996 -1340 132 3351 3301 1961 2258
15052B258J180j601j590k169J49K543j374K289k51n61n06L407J013j509k317l443
$$ 2258 3438 1837 247 -1922 -1773 770 -604 1685 1434 873 367 3774 4787 3278 961 -2482
15036b482j734m53k632n19M647M384m649j433J922K784L80k890J378J453k139
$$ -2482 -4216 -4669 -7301 -7820 -3173 1211 -3438 -4871 -2949 -165 215 -2675 -1297 156 -1983
15021a983K721l33m319L953P46j75n53k202O22J295L882m63q88q33j920O67l16
$$ -1983 738 405 -3914 39 785 610 57 -2145 -1523 -228 3654 3191 2303 1470 -450 217 -99
15004i9J679L537K794j217j313K047o03k658j077m902k68M349M647J121O76l464
$$ -99 1580 5117 7911 6694 5381 7428 6825 4167 3090 -1812 -2080 2269 6916 8037 8713 5249
14988E249n466J427O99n15j252j633r43l710K294M349K779Q7j726m133J519J028
$$ 5249 -217 1210 1909 1394 142 -1491 -2434 -6144 -3850 499 3278 3365 1639 -2494 -975 53
14972E3j06N21K528K14m381J013N04j043J345J069R21P21j330l006j738R04J884
$$ 53 -53 468 2996 3210 -1171 -158 346 -697 648 1717 2638 3359 2029 -977 -2715 -1811 73
14955G3K200l674j033K148J293j524k128L724j366l999k130m15M290M68q4J009
$$ 73 2273 -1401 -2434 -286 1007 -517 -2645 1079 -287 -4286 -6416 -6831 -2541 -2073 -2157 -1148
14939a148l710k152M766M965l16L074j463j128K348j10k01l76l310j624j105j232
$$ -1148 -4858 -7010 -2244 2721 2405 5479 4016 2888 5236 5126 4925 4549 1239 -385 -1490 -2722
14923b722O99R57K967R28m9q02j031L030K17k119L743l177k683j767m023k605
$$ -2722 -2023 -1066 1901 2829 2780 1978 947 3977 4194 2075 5818 2641 -42 -1809 -5832 -8437
14907h437M213Q16j624R86k844j682J390M424Q10J680o74j894k476n70k627L050
$$ -8437 -4224 -3408 -5032 -4046 -6890 -8572 -7182 -2758 -1948 -268 -942 -2836 -5312 -5882 -8509 -5459
14891e459k183j184K708J082M75J764L905M619L231l244l422r16j032P93n06K42
$$ -5459 -7642 -8826 -6118 -5036 -4561 -2797 1108 5727 8958 5714 2292 1376 344 1137 631 873
14875H73n51j44K729k43j870j9M44J623m86l230J414L03o402q03N433L997M25
$$ 873 322 178 2907 2664 794 775 1219 2842 2356 -874 540 843 -5559 -6362 -929 3068 3493
14858C493k312j905m80L35j85K548P33J039j571J33j88j168N15k012k859J976
$$ 3493 1181 -724 -1204 -869 -1054 1494 2227 3266 1695 1828 1640 472 987 -1025 -3884 -1908
14842a908J121k338J39k44K318j563l188o2J866K050J251K109l37j697p38K776
$$ -1908 -787 -3125 -2986 -3230 -912 -2475 -5663 -5725 -3859 -1809 -558 1551 1214 -483 -1221 1555
14826A555K802J291j472k191P3L74p06o20J888K600J827J508l610m050l324J255
$$ 1555 4357 5648 4176 1985 2058 2432 1726 1106 2994 5594 7421 8929 5319 1269 -2055 -800
14810h00O53L89J395K983R64k795k647j485k090K640n08j052j11N58J177n80r53
$$ -800 -147 242 1637 4620 5584 2789 142 -1343 -3433 -793 -1301 -2353 -2464 -1906 -729 -1309 -2262
14793b262m067J121J500q47J408j174N40J896J899M264o80j891j327l144j885
$$ -2262 -6329 -5208 -3708 -4555 -3147 -4321 -3781 -1885 14 4278 3598 1707 380 -2764 -4649
14778d649J327L868j248m67K237J609l450O39K437p07k610L12p58m87K07J914
$$ -4649 -3322 546 -702 -1169 1068 2677 -773 -134 2303 1596 -1014 -702 -1460 -1947 -1740 174
14762A74N47J786k392j712J627J41k670l43J714J482j298m011P03L977K142J58
$$ 174 721 2507 115 -1597 30 171 -2499 -2842 -1128 354 -944 -4955 -4252 -275 1867 2025
14746B025O42K204N99nJ026R30l255O29O86p13q59k354J745K951j797l631N65
$$ 2025 2667 4871 5470 5465 6491 7421 4166 4795 5481 4768 3909 1555 3300 6251 4454 823 1388
14729A388p78j976K935m38J937j821l474k399K411L136J65o81j0K68K783J594
$$ 1388 610 -1366 1569 1131 3068 1247 -2227 -4626 -2215 921 1086 405 395 663 3446 5040
14713E040k72J615P33j702j528k822q0L929L240J847k309n101j887K918j432K097
$$ 5040 4768 6383 7116 5414 3886 1064 984 4913 8153 10000 7691 2590 703 3621 2189 4286
14697D286K211j788k116j610j341P22M180J434k845J64k234P12K59l495r52J277
$$ 4286 6497 4709 2593 983 -358 364 4544 5978 3133 3297 1063 1775 2034 -1461 -2413 -1136
14681a136j172J241l77o37r67L203r38n341l170J624J518L728L841L941n36j918
$$ -1136 -2308 -1067 -1444 -2081 -3048 155 -783 -6124 -9294 -7670 -6152 -2424 1417 5358 4822 2904
14665B904l121L279k268k137k158J381j320J525N585K11R32l59j930j4J367M33
$$ 2904 -217 3062 794 -1343 -3501 -2120 -3440 -1915 3670 3881 4813 4454 2524 2510 3877 4310
14649D310J592K744Q2k490m670j032q86j462j313K745K127J216l323P40N24K541
$$ 4310 5902 8646 8728 6238 1568 536 -350 -1812 -3125 -380 1747 2963 -360 380 904 3445
14633C445q4k487N17J831n06M37k331L869L538J386J067n55m85o17j421l83r17
$$ 3445 3361 874 1391 3222 2716 3153 822 4691 8229 9615 10682 10127 9642 9025 7604 7221 6304
14616F304m557n23J182N93p95k154q8M488j737K98N19K29Q5J89K832J387j013
$$ 6304 1747 1224 2406 2999 2204 50 -38 4450 2713 3011 3530 3759 3844 4033 6865 8252 7239
14599G239j373L125n09k092q20p77k012K30L102K536k56K302M12K42O22J143k333
$$ 7239 5866 8991 8482 6390 5570 4793 2781 3011 6113 8649 8393 10695 11107 11349 11971 13114 10781
14582A0781j675k505l190m48J957K338K589J278l462j188j310j46J044j221j059
$$ 10781 9106 6601 3411 2963 4920 7258 9847 11125 7663 6475 5165 5019 6063 4842 3783
14567C783M8J0J004N54j230J50K624j321J09p80J020L873J55l964m33K267K99
$$ 3783 3831 3841 4845 5399 4169 4319 6943 5622 5731 4951 5971 9844 9999 6035 5602 7869 8168
14550H168q98j871J814p60j355k524J782L510N214L74j255l682j557M857N352
$$ 8168 7270 5399 7213 6453 5098 2574 4356 7866 13080 13454 12199 8517 6960 11817 17169
14535A7169m60k234l614Q91j015N92J086k96l038l589k647p03L144K439K095J820
$$ 17169 16709 14475 10861 11752 10737 11329 12415 12119 9081 5492 2845 2142 5286 7725 9820 11640
14519A1640J943J374l468l261K169O89J91k404l03J265j259K410j90j984K977
$$ 11640 13583 14957 11489 8228 10397 11086 11277 8873 8570 9835 8576 10986 10796 8812 11789
14504A1789r64k062j211j796J917rK946O023Q86J689m127n927K367K393n31j164
$$ 11789 10825 8763 7552 5756 7673 7664 10610 16633 17519 19208 15081 9154 11521 13914 13383 12219
14488A2219l075J60K429L290M4L02j55l045J509J391N26n36r85J375j644L205
$$ 12219 9144 9304 11733 15023 15067 15369 15214 12169 13678 15069 15595 15059 14074 15449 13805 17010
14472A7010K335R93j241k417p28j552L42q22K99R00k128J315J999O99m62J692
$$ 17010 19345 20338 19097 16680 15952 14400 14742 13920 14219 15119 12991 14306 16305 17004 16542 18234
14456A8234m129k302P3L029K542K891k091J172N35K087j788j329j910J029L718
$$ 18234 14105 11803 11876 14905 17447 20338 18247 19419 19954 22041 20253 18924 17014 18043 21761
14441B1761M03k855r75N30R3m06r36R59M683m22l323j731K076j199Q35J348j909
$$ 21761 22164 19309 18334 18864 18957 18551 17615 18574 23257 22835 19512 17781 19857 18658 19493 20841 18932
14424A8932m860J504K065K05O29o62K949j5m044j001J455j547L07K504M719p4
$$ 18932 14072 15576 17641 17846 18475 17813 20762 20747 16703 15702 17157 15610 15917 18421 23140 23066
14408B3066l136j939j813q56K884J587r70j687k222m25J006j001M10K479J201
$$ 23066 19930 17991 16178 15322 18206 19793 18823 17136 14914 14489 15495 14494 14904 17383 18584
14393A8584J515j221l498j68K188K085M066j883l84M82k666k99n60j616q41q68
$$ 18584 20099 18878 15380 15212 17400 19485 23551 21668 21284 21766 19100 18801 18241 16625 15784 14916
14377A4916K915L298J024l352j512j027n527q92j852j047J037L419j73R42J991
$$ 14916 17831 21129 22153 18801 17289 16262 10735 9843 7991 6944 7981 11400 11227 12169 14160
14362A4160J74N34J323J102l28j543r76p00o55J118j615l540K08M031m21k429
$$ 14160 14334 14868 16191 17293 16965 15422 14446 13746 13091 14209 12594 9054 9262 13293 12872 10443
14346A0443J539K137k687m632o93l259L493N245j124O92J192p99J209J593R54
$$ 10443 11982 14119 11432 6800 6107 2848 6341 11586 10462 11154 12346 11547 12756 14349 15303
14331A5303k770m211l388K368N308P071K192n126m343k038K26J959J910k190j298
$$ 15303 12533 8322 4934 7302 12610 19681 21873 16747 12404 10366 10592 12551 14461 12271 10973
14316A0973k782n78J645j207j432l42J875P09L07m76m389J77K748l93m04K090
$$ 10973 8191 7613 9258 8051 6619 6277 8152 8861 9168 8692 4303 4480 7228 6835 6431 8521
14300H521n04k136j962m17j362l091j13J67K05K734J47J878K213N63p40k819N68
$$ 8521 8017 5881 3919 3502 2140 -951 -1064 -897 -692 2042 2189 4067 6280 6843 6103 3284 3852
14283C852K381K405m83J783q04O75j125k173N83j025J262m55p95J930L46N39J290
$$ 3852 6233 8638 8155 9938 9134 9809 8684 6511 7094 6069 7331 6876 6081 8011 8357 8896 10186
14266A0186l094k463J437m316J045J987K238L324j980l577l41K846J62j58k262
$$ 10186 7092 4629 6066 1750 2795 4782 7020 10344 8364 4787 4446 7292 7454 7296 5034
14251E034N06J237j729k83l50J482N6k296J556N17J348j208p68K135L703l01k097
$$ 5034 5540 6777 5048 4765 4415 5897 5953 3657 5213 5730 7078 5870 5102 7237 10940 10639 8542
14234H542j090k057m44j474j272K831k837o44n07K54K305L430K56j819l357k610
$$ 8542 7452 5395 4951 3477 2205 5036 2199 1555 1048 1302 3607 7037 7293 5474 2117 -493
14218d93K179M414j290k020L294L516m96K31k634k410j387K575J00l446j695o56
$$ -493 1686 6100 4810 2790 6084 9600 9104 9335 6701 4291 2904 5479 5579 2133 438 -218
14202b18J657J690J396J852J14j056k773j34P84L625o90l684j533K753L253k436
$$ -218 1439 3129 4525 6377 6491 5435 2662 2528 3312 6937 6247 2563 1030 3783 7036 4600
14186D600l500J411p42k29j79R11P30k500j770J703J640Q76L270n63k947j586
$$ 4600 1100 2511 1769 1540 1361 2272 3002 502 -1268 435 2075 2951 6221 5658 2711 1125
14170A125p89k616k703k299j06L035K150M507J917o25n60j718m074j285J304j126
$$ 1125 336 -2280 -4983 -7282 -7388 -4353 -2203 2304 4221 3596 3036 1318 -2756 -4041 -2737 -3863
14154c863M1J896k127j583n55J899O502k57l648k557J042Q57k086J651R00K107
$$ -3863 -3822 -1926 -4053 -5636 -6191 -4292 2210 1953 -1695 -4252 -3210 -2353 -4439 -2788 -1888 219
14138B19R43l550j375K619K274R33r0L49J135K115j254n687j150j631Q6J354J322
$$ 219 1162 -2388 -3763 -1144 1130 2063 1973 2322 3457 5572 4318 -1369 -2519 -4150 -4064 -2710 -1388
14121a388m36j711K831M36J641J770j143n09p2m855k9m15J337R71M59k655l954
$$ -1388 -1824 -3535 -704 -268 1373 3143 2000 1491 1419 -3436 -3465 -3880 -2543 -1572 -1113 -3768 -7722
14104g722K147M284R55k309N36L491K050k673k203m18k71K405J130J032l634m200
$$ -7722 -5575 -1291 -336 -2645 -2109 1382 3432 759 -1444 -1862 -2133 272 1402 2434 -1200 -5400
14088e400N25K348J688O25m392j843p41J636K369m77o22j10R49l852k875M722
$$ -5400 -4875 -2527 -839 -214 -4606 -6449 -7190 -5554 -3185 -3662 -4284 -4394 -3445 -7297 -10172 -5450
14072e450L879k140K727K990k501N16j770j537n2m81M91j398K361N350J170j102
$$ -5450 -1571 -3711 -984 2006 -495 21 -1749 -3286 -3338 -3819 -3328 -4726 -2365 2985 4155 3053
14056C053k717n96J928Q17k12k481o96Q26J122n62P16N430K375k997r92l982m669
$$ 3053 336 -260 1668 2485 2273 -208 -904 -78 1044 482 1198 6628 9003 6006 5014 1032 -3637
14039c637O98K770J164N13j61J958R26j614j237p75m308k405M567L002R82k09
$$ -3637 -2939 -169 995 1508 1347 3305 4231 2617 1380 605 -3703 -6108 -1541 1461 2443 2234
14023B234j335P23J008K242j558k436j845J701n3j008k468J20j895j765L68J180
$$ 2234 899 1622 2630 4872 3314 878 -967 734 681 -327 -2795 -2675 -4570 -6335 -5967 -4787
14007d787k326J854L719L08Q9K242k045l185j75J77j88J669K291k369l419K044
$$ -4787 -7113 -5259 -1540 -1232 -1143 1099 -946 -4131 -4306 -4129 -4317 -2648 -357 -2726 -6145 -4101
13991d101K744K915j623l773K2J429Q76J78N35O61j730J012J163J77p79l89j246
$$ -4101 -1357 1558 -65 -3838 -3816 -2387 -1511 -1333 -798 -137 -1867 -855 308 485 -294 -683 -1929
13974a929K006K323M66o8k033m708Q61N01k559p34j678r1J986j400L501K352P62
$$ -1929 77 2400 2866 2798 765 -3943 -3082 -2581 -5140 -5874 -7552 -7643 -5657 -7057 -3556 -1204 -442
13957d42p72k397p13n24n56J810J678K689K005L958J738l628l914m791O2j922
$$ -442 -1214 -3611 -4324 -4848 -5404 -3594 -1916 773 2778 6736 8474 4846 932 -3859 -3797 -5719
13941e719l562j208l147J970K568J442Q59J441J520L345L080k42j589k481M76
$$ -5719 -9281 -10489 -13636 -11666 -9098 -7656 -6797 -5356 -3836 -491 2589 2347 758 -1723 -1247
13926a247L362l231o9K083m09R5R17j406k502j768J421J007l490K676J250j560
$$ -1247 2115 -1116 -1185 898 489 584 1501 95 -2407 -4175 -2754 -1747 -5237 -2561 -1311 -2871
13910b871o1J406Q04k039P47j441l55J114M179j9j890k15j296l712j190q61J220
$$ -2871 -2932 -1526 -722 -2761 -2014 -3455 -3810 -2696 1483 1464 -426 -641 -1937 -5649 -6839 -7700 -6480
13893f480J319M72j126L703K051J693K846R8M84M793L064n581m741k139O76j542
$$ -6480 -5161 -4689 -5815 -2112 -61 1632 4478 4576 5060 9853 12917 7336 2595 456 1132 -410
13877d10r36J45M106K478k55j45J835J39L425J955o14N58J697l270m017k739k070
$$ -410 -1346 -1201 2905 5383 5128 4983 6818 6957 10382 12337 11723 12281 13978 10708 6691 3952 1882
13860A882J23l587j351M993N830k260j726R69M191K48l692l477L79J462o44k160
$$ 1882 2005 -1582 -2933 2060 7890 5630 3904 4873 9064 9312 5620 2143 2522 3984 3340 1180
13844A180p66K481O98j084j734j887j77N55L085k816m39j120J271J02O80k008
$$ 1180 414 2895 3593 2509 775 -1112 -1289 -734 2351 -465 -904 -2024 -753 -651 29 -1979
13828a979j766m00M453K00j235N12J072K768k070J299J312l105j165O71r37l499
$$ -1979 -3745 -4145 308 508 -727 -215 857 3625 1555 2854 4166 1061 -104 567 -370 -3869
13812c869J716J162O29j237K32K137J392o15k714q70J874K192J702l739n720L128
$$ -3869 -2153 -991 -362 -1599 -1367 770 2162 1547 -1167 -2037 -163 2029 3731 -8 -5728 -2600
13796b600L683M83j828k356K8N31k759m470j99N223J633j477R66K035k559k684
$$ -2600 1083 1566 -262 -2618 -2590 -2059 -4818 -9288 -9487 -4264 -2631 -4108 -3142 -1107 -3666 -6350
13780f350L098K214K031K53p52k419j695k94M20P99k011o16K251R04j107O84J607
$$ -6350 -3252 -1038 993 1246 494 -1925 -3620 -3914 -3494 -2695 -4706 -5322 -3071 -2167 -3274 -2590 -983
13763i83r66K093L20k179j62Q61l26j077j357J343M91J348j981k41k767K80L197
$$ -983 -1949 144 464 -1715 -1877 -1016 -1342 -2419 -3776 -2433 -1942 -594 -2575 -2816 -5583 -5303 -2106
13746b106p23J37L603q43l988q33K452K051N97J68j84j877J421j245k933P13J607
$$ -2106 -2829 -2692 911 68 -3920 -4753 -2301 -250 347 515 331 -1546 -125 -1370 -4303 -3590 -1983
13729a983K038L83j419j260o62m394m99L197J976l54J663J462m4k301k883M285
$$ -1983 55 438 -981 -2241 -2903 -7297 -7796 -4599 -2623 -2977 -1314 148 104 -2197 -5080 -795
13713g95K83j257M60J783O84p46n172p79J532K297m459J290K212O98m013N79M71
$$ -795 -512 -1769 -1309 474 1158 412 -4760 -5539 -4007 -1710 -6169 -4879 -2667 -1969 -5982 -5403 -4932
13696d932j81j079j493O6K059J8N50J746j65l385L584J962p46j182n93k512J023
$$ -4932 -5113 -6192 -7685 -7619 -5560 -5542 -4992 -3246 -3411 -6796 -3212 -1250 -1996 -3178 -3771 -6283 -5260
13679e260J11j749J547J421O41j618l132J97J154K402k052o39J016M56l422P45
$$ -5260 -5149 -6898 -5351 -3930 -3289 -4907 -8039 -7842 -6688 -4286 -6338 -6977 -5961 -5505 -8927 -8182
13663h182L500j154k88r99K211J247J081L942j442k83k242J013j514l39q70K74
$$ -8182 -4682 -5836 -6124 -7123 -4912 -3665 -2584 1358 -84 -367 -2609 -1596 -3110 -3449 -4319 -4045
13647d045N66j576k139O92L54M340j108k357j126K220k761p63K171L058l588j124
$$ -4045 -3479 -5055 -7194 -6502 -6148 -1808 -2916 -5273 -6399 -4179 -6940 -7703 -5532 -2474 -6062 -7186
13631g186O77k45j696p73J873N072M0q01m24R99J898P93R55j480r90K79j733j006
$$ -7186 -6509 -6754 -8450 -9223 -7350 -2278 -2238 -3039 -3463 -2464 -566 227 1182 -298 -1288 -1009 -2742 -3748
13613c748J850M215R05J625k03l588j137j61N71J563p98J973j753k444j422K035
$$ -3748 -1898 2317 3222 4847 4644 1056 -81 -242 329 1892 1094 3067 1314 -1130 -2552 -517
13597e17j169l405k819K232L122r99j870L541L600L95k040M52k067k183q8m47
$$ -517 -1686 -5091 -7910 -5678 -2556 -3555 -5425 -1884 1716 2111 71 523 -1544 -3727 -3815 -4262
13581d262L37j930J026L149k442j08m33J78j118N02M212O65j354k521r08N66L12
$$ -4262 -3925 -5855 -4829 -1680 -4122 -4230 -4663 -4485 -5603 -5101 -889 -224 -1578 -4099 -5007 -4441 -4129
13564d129l995L182K958j910j515J804o38p77O10l39K458L368r71O97Q14j701
$$ -4129 -8124 -4942 -1984 -3894 -5409 -3605 -4243 -5020 -4410 -4749 -2291 1077 106 803 1617 -84
13548h4j310L1Q6j349j001K485J574m158O56L048J970j276M91L55k319j366k190
$$ -84 -1394 -1363 -1277 -2626 -3627 -1142 432 -3726 -3070 -22 1948 672 1163 1518 -801 -2167 -4357
13531d357j188j298L578M470K211J323j77o917n007k20L633j865o61K899J880
$$ -4357 -5545 -6843 -3265 1205 3416 4739 4562 -2355 -7362 -7582 -3949 -5814 -6475 -3576 -1696
13516a696m26N15m82k047J086J062K664j09m308J341J923L0R79m8j726j890j312
$$ -1696 -2122 -1607 -2089 -4136 -3050 -1988 676 567 -3741 -2400 -477 -447 532 484 -1242 -3132 -4444
13499d444n98L70j924r35j276N23L680N677J744O80l092m14M367P19j40n017l331
$$ -4444 -5042 -4672 -6596 -7531 -8807 -8284 -4604 1073 2817 3497 405 -9 4358 5077 4937 -80 -3411
13482c411j244L35n5K259J142k854J229K636o69J280N65k672n26K780P90j285
$$ -3411 -4655 -4320 -4375 -2116 -974 -3828 -2599 37 -632 648 1213 -1459 -1985 795 1585 300
13466C00j15j485J827L286j46j452k243l414q06J406M022J757m149k389O11q21
$$ 300 185 -1300 527 3813 3667 2215 -28 -3442 -4248 -2842 1180 2937 -1212 -3601 -2990 -3811
13450c811L033J037j036k396J89K821k742k799l11K296J564R83P34l799m907j158
$$ -3811 -778 259 -777 -3173 -2984 -163 -2905 -5704 -6015 -3719 -2155 -1172 -438 -4237 -9144 -10302
13434a0302o76L522L801j963p35K991k046Q88j491j07J611L267j148o18K739M254
$$ -10302 -10978 -7456 -3655 -5618 -6353 -3362 -5408 -4520 -6011 -6118 -4507 -1240 -2388 -3006 -267 3987
13418C987l782l014n926P8L890J800R93o76m441M67K873k519m20Q22M09L428J907
$$ 3987 205 -2809 -8735 -8657 -4767 -2967 -1974 -2650 -7091 -6624 -3751 -6270 -6690 -5868 -5459 -2031 -124
13401a24k283J192O54K657J173k111l08q12j370k621p87J081K692Q00j779k891
$$ -124 -2407 -1215 -561 2096 3269 1158 850 38 -1332 -3953 -4740 -3659 -967 -167 -1946 -4837
13385d837j500K48k693M014J623K389J265j295r63j062M50n35J348l298K969K740
$$ -4837 -6337 -6089 -8782 -4768 -3145 -756 509 -786 -1749 -2811 -2361 -2896 -1548 -4846 -1877 863
13369H63o31m439l207K74J364K254j965j249J070M536L58k992J50J193p08K167
$$ 863 232 -4207 -7414 -7140 -5776 -3522 -5487 -6736 -5666 -1130 -772 -3764 -3614 -2421 -3129 -962
13353i62q04k678K032kP26q48J786L984j646l703J241J232k449K653J739l47j247
$$ -962 -1766 -4444 -2412 -2414 -1688 -2536 -750 3234 1588 -2115 -874 358 -2091 562 2301 1954 707
13336G07l40L074k400l018J839j662j785j101J651o5K578K138K84K915K411j909
$$ 707 367 3441 1041 -1977 -138 -1800 -3585 -4686 -3035 -3100 -522 1616 1900 4815 7226 5317
13320E317K934j802l46j043k988J72R16p34k598M10K324j374k069m08k086p41
$$ 5317 8251 6449 6103 5060 2072 2244 3160 2426 -172 238 2562 1188 -881 -1289 -3375 -4116
13304d116J632j172j604O5K142K538J954K965j749Kn99j004r41M60l073k154k199
$$ -4116 -2484 -3656 -5260 -5195 -3053 -515 1439 4404 2655 2657 2058 1054 113 573 -2500 -4654 -6853
13287f853j384J787K805L688j452m08j14k031L01K185J043N77k962L32K747j608
$$ -6853 -8237 -6450 -3645 43 -1409 -1817 -1931 -3962 -3661 -1476 -433 144 -2818 -2486 261 -1347
13271a347j91N25k386L908J863k59j746O56L672j218k95J469j989L060P43j326
$$ -1347 -1538 -1013 -3399 509 2372 2113 367 1023 4695 3477 3182 4651 2662 5722 6465 5139
13255E139J355J514K473K019K590j25k347J489m066l345K51J014j679j819J780
$$ 5139 6494 8008 10481 12500 15090 14965 12618 14107 10041 6696 6947 7961 6282 4463 6243
13240F243r32k523n61M206j24q15k796j465q15K458K74r90L75n25j469P1J075
$$ 6243 5311 2788 2227 6433 6309 5494 2698 1233 418 2876 3150 2160 2535 2010 541 612 1687
13223A687j967m013K252J666j342r23N228R30K989m66P21n938q23Q0k30j09J36
$$ 1687 -280 -4293 -2041 -375 -1717 -2640 2588 3518 6507 6041 6762 824 1 81 -149 -258 -122
13206a22l635L991K194j480j648k453k029J84O070M062j11K41k634n88j714k35
$$ -122 -3757 234 2428 948 -700 -3153 -5182 -4998 1072 5134 5023 5264 2630 2042 328 93
13190I3J083j018J542o88n230j537N05R63l66J413k193L792J301l415r75N224
$$ 93 1176 158 1700 1012 -4218 -5755 -5250 -4287 -4653 -3240 -5433 -1641 -340 -3755 -4730 494
13174D94M188N32m088j882M081N067j899K564K101N28N411O102Lp874j734j340
$$ 494 4682 5214 1126 -756 3325 8392 6493 9057 11158 11686 17097 23199 23202 15328 13594 12254
13158A2254k678l409m861j395l2j712k31K345L621K107n179l158J061J661J038
$$ 12254 9576 6167 1306 -89 -121 -1833 -2064 281 3902 6009 830 -2328 -1267 394 1432
13143A432n56l208K820J252j795j299L927l26n962k138M508J581l311N22O38N36
$$ 1432 876 -2332 488 1740 -55 -1354 2573 2247 -3715 -5853 -1345 236 -3075 -2553 -1915 -1379
13127a379O63r33K246p43k012l033J799n45O90R02j844j211J017l038k8J697K133
$$ -1379 -716 -1649 597 -146 -2158 -5191 -3392 -3937 -3247 -2345 -4189 -5400 -4383 -7421 -7449 -5752 -3619
13110c619K873J512l052J517k53k993K637r81j066K446L97J288M060j417k468
$$ -3619 -746 766 -2286 -769 -1022 -4015 -1378 -2359 -3425 -979 -582 706 4766 3349 881
13095H81l467j108n88R13J409K20J566j314o58M02j420j627j27j644J121J342
$$ 881 -2586 -3694 -4282 -3369 -1960 -1740 -174 -1488 -2146 -1744 -3164 -4791 -4918 -6562 -5441 -4099
13079d099K477k897m125J878J445K2k82K535L866K252J188m361o152K997L605
$$ -4099 -1622 -4519 -8644 -6766 -5321 -5299 -5581 -3046 820 3072 4260 -101 -6253 -3256 349
13064C49m179j892k451j181K577K280j045q24K92K049o40m71J298R72m662j448
$$ 349 -3830 -5722 -8173 -9354 -6777 -4497 -5542 -6366 -6074 -4025 -4665 -5136 -3838 -2866 -7528 -8976
13048h976L103J504k186k531J096r62J854K546M782p57n91m57l84L54n49j557
$$ -8976 -5873 -4369 -6555 -9086 -7990 -8952 -7098 -4552 230 -527 -1118 -1575 -1959 -1605 -2154 -3711
13032c711q93k637r69J377R58o96J252K323J362j110j96p98j869q92j130N585
$$ -3711 -4604 -7241 -8210 -6833 -5875 -6571 -5319 -2996 -1634 -2744 -2940 -3738 -5607 -6499 -7629 -2044
13016b044J524l65K709O8K24J817k569K15j249k164j359K832J769L167j920n806
$$ -2044 -520 -885 1824 1892 2116 3933 1364 1579 330 -1834 -3193 -361 1408 4575 2655 -3151
13000c151O10L931P33k130j885k515r79O71M99K547J703j273j191j246j409J216
$$ -3151 -2541 1390 2123 -7 -1892 -4407 -5386 -4715 -4216 -1669 34 -1239 -2430 -3676 -5085 -3869
12984c869R59j42r00l619J015O99J927K278k875k927J720R82O0k867l44J274K574
$$ -3869 -2910 -3052 -3952 -7571 -6556 -5857 -3930 -1652 -4527 -7454 -5734 -4752 -4692 -7559 -7903 -6629 -4055
12967d055O81J052o36q63K193j72j508j786J538k68K469n21K968p3l461l96K927
$$ -4055 -3374 -2322 -2958 -3821 -1628 -1800 -3308 -5094 -3556 -3824 -1355 -1876 1092 1019 -2442 -2838 89
12950H9K187M16N31j805l819m37q20K277k151K04P15J303K463Q97j047l895j63
$$ 89 2276 2692 3223 1418 -2401 -2838 -3658 -1381 -3532 -3328 -2613 -1310 1153 2050 1003 -2892 -3055
12933c055k003l269j515J421M33J801l03L031Q66J198K516J028o24j765l35j045
$$ -3055 -5058 -8327 -9842 -8421 -7988 -6187 -6490 -3459 -2593 -1395 1121 2149 1525 -240 -575 -1620
12917a620j656L734R9j938p62k55K383r40m515l554J566L128L242N586L625K600
$$ -1620 -3276 458 557 -1381 -2143 -2398 -15 -955 -5470 -9024 -7458 -4330 -1088 4498 8123 10723
12901A0723l4K841L174n978k940O77m43l283k158r27n43K697N967J137j736l99
$$ 10723 10689 13530 16704 10726 7786 8463 8020 4737 2579 1652 1109 3806 9773 10910 9174 8775
12885H775J348q63k888n623m1MK1J062K727j652l657P29l017j323L76N381k303
$$ 8775 10123 9260 6372 749 708 712 733 1795 4522 2870 -787 -58 -3075 -4398 -4022 1359 -944
12868i44o172m09L080L526J213o158k580L542L535p86k082j204J955L47J072J734
$$ -944 -7116 -7525 -4445 -919 294 -5864 -8444 -4902 -1367 -2153 -4235 -5439 -3484 -3137 -2065 -331
12852c31P17n79n950k256K389nL24k207k847K509J134R77O00J307J733R4l9q29
$$ -331 386 -193 -6143 -8399 -6010 -6015 -5691 -7898 -10745 -8236 -7102 -6125 -5525 -4218 -2485 -2391 -2430 -3259
12834c259o5O15J770j339r5K683l81J605K861q16l698j000k352R88R17p32J145
$$ -3259 -3324 -2709 -939 -2278 -2373 310 -71 1534 4395 3579 -119 -1119 -3471 -2483 -1566 -2298 -1153
12817a153J353j338J002j744O83O37j229J738o66m237K089O41L61q47j043J422
$$ -1153 200 -1138 -136 -1880 -1197 -560 -1789 -51 -717 -4954 -2865 -2224 -1863 -2710 -3753 -2331
12801b331j335M63L198j786k137J021j533M78L232J009O88j479J565K15j087j668
$$ -2331 -3666 -3203 -5 -1791 -3928 -2907 -4440 -3962 -730 279 967 -512 1053 1268 181 -1487
12785a487j960n27M199J166k99l40j203K40M94k03Q33j280O75k662k785j98M908
$$ -1487 -3447 -3974 225 1391 1092 752 -451 -211 283 80 913 -367 308 -2354 -5139 -5337 -429
12768d29L70j547l613l402Q19L447P58J215J835l69j315K573k144o9q20j065P3
$$ -429 -59 -1606 -5219 -8621 -7802 -4355 -3597 -2382 -547 -916 -2231 342 -1802 -1871 -2691 -3756 -3683
12751c683L592K385L7k535j52Q8J65J941j010j717k260j741J329J128q39M62k836
$$ -3683 -91 2294 2331 -204 -356 -268 -103 1838 828 -889 -3149 -4890 -3561 -2433 -3272 -2810 -5646
12734e646M62M046J049l28k694j115J889j666r55k101o94L626L09k64J069k484
$$ -5646 -5184 -1138 -89 -417 -3111 -4226 -2337 -4003 -4958 -7059 -7753 -4127 -3818 -4082 -3013 -5497
12718e497k47J251J50k425J721L492P89q36k058j419O90M065K536K155l244m986
$$ -5497 -5744 -4493 -4343 -6768 -5047 -1555 -766 -1602 -3660 -5079 -4389 -324 2212 4367 1123 -3863
12702c863q00J238L646J942k358j000O46K099J965k389o57k059k686m05Q52P4
$$ -3863 -4663 -3425 221 2163 -195 -1195 -549 1550 3515 1126 469 -1590 -4276 -4681 -3829 -3755
12686c755P47N61L62j743m89L922K195j191j849n58l398j022K088J710K559O12
$$ -3755 -3008 -2447 -2085 -3828 -4317 -395 1800 609 -1240 -1798 -5196 -6218 -4130 -2420 139 751
12670G51j739k31k98j275j670L51L720n72l612J184L1k440M42j048k288J906K052
$$ 751 -988 -1219 -1517 -2792 -4462 -4111 -391 -963 -4575 -3391 -3360 -5800 -5358 -6406 -8694 -6788 -4736
12653d736l106K08J128K578M04j132P23L111L035j699l611k004j633m82J382j202
$$ -4736 -7842 -7634 -6506 -3928 -3524 -4656 -3933 -822 2213 514 -3097 -5101 -6734 -7216 -5834 -7036
12637g036K090L82J035j017m496J475L135Q93j201K42Q60k330k383J06j52J357
$$ -7036 -4946 -4564 -3529 -4546 -9042 -7567 -4432 -3539 -4740 -4498 -3638 -5968 -8351 -8245 -8397 -7040
12621g040j013J743j324l715k924L257K324J50j75q33j697L960L137J538J178
$$ -7040 -8053 -6310 -7634 -11349 -14273 -11016 -8692 -8542 -8717 -9550 -11247 -7287 -4150 -2612 -1434
12606a434j868r50M308m84m907k602L568K105o01k58K156k064N30k8K123k667
$$ -1434 -3302 -4252 56 -428 -5335 -7937 -4369 -2264 -2865 -3123 -967 -3031 -2501 -2529 -406 -3073
12590c073l440k411K540J334k324k699N508J454J596J0m543L081M020l287j687
$$ -3073 -6513 -8924 -6384 -5050 -7374 -10073 -4565 -3111 -1515 -1505 -6048 -2967 1053 -2234 -3921
12575c921j819j526p91k67k03k47j165M97q7m33L730K213K826J956k338l855p64
$$ -3921 -5740 -7266 -8057 -8324 -8527 -8774 -9939 -9442 -9529 -9962 -6232 -4019 -1193 763 -1575 -5430 -6194
12558f194J098k046O708K695n913j161j030o00J393J425l726k995K187K942J248
$$ -6194 -5096 -7142 -434 2261 -3652 -4813 -5843 -6443 -5050 -3625 -7351 -10346 -8159 -5217 -3969
12543c969o33m27j433K110j372k684K80R13J289o52J435j952j156L110J078k639
$$ -3969 -4602 -5029 -6462 -4352 -5724 -8408 -8128 -7215 -5926 -6578 -5143 -7095 -8251 -5141 -4063 -6702
12527f702n25J836R11k172l397L725K164K300l85J939J100J698j992l414N44n69
$$ -6702 -7227 -5391 -4480 -6652 -10049 -6324 -4160 -1860 -2245 -306 794 2492 500 -2914 -2370 -2939
12511b939J566J627j681J764m71l099j428k6J126J959J490r21j397J528K118m09
$$ -2939 -1373 254 -1427 337 -134 -3233 -4661 -4687 -3561 -1602 -112 -1033 -2430 -902 1216 807
12495H07m467k974p0l550Q60L421j547J291J219Q93J148M68J513j953J537K90
$$ 807 -3660 -6634 -6704 -10254 -9394 -5973 -7520 -6229 -5010 -4117 -2969 -2501 -988 -2941 -1404 -1114
12479a114j062j83j485K313L469m78k83l73n823k904j98J942K832j113k425j374
$$ -1114 -2176 -2359 -3844 -1531 1938 1460 1177 804 -5019 -7923 -8121 -6179 -3347 -4460 -6885 -8259
12463h259l388L958N902K898k332k948Q37K918j063K651P03l812j156r38K257
$$ -8259 -11647 -7689 -1787 1111 -1221 -4169 -3332 -414 -1477 1174 1877 -1935 -3091 -4029 -1772
12448a772R20l416j527L811r88j575K644L218O18L47k288j686K29o81J665p68
$$ -1772 -852 -4268 -5795 -1984 -2972 -4547 -1903 1315 1933 2280 -8 -1694 -1465 -2146 -481 -1249
12432a249j404l341K912K417q60j992J119M6J842k02l070J237o0k573m33J228
$$ -1249 -2653 -5994 -3082 -665 -1525 -3517 -2398 -2352 -510 -712 -3782 -2545 -2605 -5178 -5611 -4383
12416d383L230j425m63O78n340j628K116L431J4k467j336k113k017K714J551L386
$$ -4383 -1153 -2578 -3041 -2363 -7703 -9331 -7215 -3784 -3770 -6237 -7573 -9686 -11703 -8989 -7438 -4052
12400d052K50p07J016J436k382l535j443J444K007L526L75k66l423k791n97L69
$$ -4052 -3802 -4509 -3493 -2057 -4439 -7974 -9417 -7973 -5966 -2440 -2065 -2331 -5754 -8545 -9142 -8773
12384h773J982k54J566l65l476l304M376L364k139k373j720P0K904K016L889j02
$$ -8773 -6791 -7045 -5479 -5844 -9320 -12624 -8248 -4884 -7023 -9396 -11116 -11046 -8142 -6126 -2237 -2339
12368b339m029P70L076m60J137q12J824k78l099l282J168J011r83J656J587m739
$$ -2339 -6368 -5598 -2522 -2982 -1845 -2657 -833 -1111 -4210 -7492 -6324 -5313 -6296 -4640 -3053 -7792
12352g792r23N345L848J179M19l72j172l713p72Q45L521j931k622j330Q30p87
$$ -7792 -8715 -3370 478 1657 2076 1704 532 -3181 -3953 -3108 413 -1518 -4140 -5470 -4640 -5427
12336e427J833o48l83P41J603l054j975Q76P46K549J231l219Q51M01K8K2J58K51
$$ -5427 -3594 -4242 -4625 -3884 -2281 -5335 -7310 -6434 -5688 -3139 -1908 -5127 -4276 -3875 -3847 -3825 -3667 -3416
12318c416j642q3L196P48K46j086Q65N38j141k386J527M115K478p6j772j633M08
$$ -3416 -5058 -5141 -1945 -1197 -951 -2037 -1172 -634 -1775 -4161 -2634 1481 3959 3883 2111 478 886
12301H86k914P92j157J283j463k384l427k286J624L058J12O80J931r69l146l532
$$ 886 -2028 -1236 -2393 -1110 -2573 -4957 -8384 -10670 -9046 -5988 -5876 -5196 -3265 -4234 -7380 -10912
12285a0912o7J917J316k245k936N83k595L654N110L559K87R12j456l077K87J539
$$ -10912 -10979 -9062 -7746 -9991 -12927 -12344 -14939 -11285 -6175 -2616 -2329 -1417 -2873 -5950 -5663 -4124
12269d124J532Q31J583J66p21J912Q28j083m406p79q51L807K396r46l004o55k897
$$ -4124 -2592 -1761 -178 -12 -733 1179 2007 924 -3482 -4261 -5112 -1305 1091 145 -2859 -3514 -6411
12252f411l63K322j665j117J406L098J512O04n26R54j226J37j011k628j440q75
$$ -6411 -6774 -4452 -6117 -7234 -5828 -2730 -1218 -614 -1140 -186 -1412 -1275 -2286 -4914 -6354 -7229
12236g229r14k545l280J312J898J367J950R13j7J65J096q0k412n33J112m37K943
$$ -7229 -8143 -10688 -13968 -12656 -10758 -9391 -7441 -6528 -6545 -6380 -5284 -5364 -7776 -8309 -7197 -7634 -4691
12219d691K730M48K812J065O2j583l047k946j377K266M052j590Q27K975k633K109
$$ -4691 -1961 -1513 1299 2364 2426 843 -2204 -5150 -6527 -4261 -209 -1799 -972 2003 -630 1479
12203A479l218l631l679L862O413L690j868m062o26k12l60j220j857J547O80J415
$$ 1479 -1739 -5370 -9049 -5187 1226 4916 3048 -1014 -1640 -1852 -2212 -3432 -5289 -3742 -3062 -1647
12187a647K630L0k410m633j403J800M853L556K608J345j56k042O28O18p21o14
$$ -1647 983 1013 -1397 -6030 -7433 -5633 -780 2776 5384 6729 6573 4531 5159 5777 5056 4442
12171D442m329N95M344M218J815K011J274k1M52Nk201m058n467n545k954J033
$$ 4442 113 708 5052 9270 11085 13096 14370 14349 14801 14806 12605 8547 3080 -2465 -5419 -4386
12155d386J675K448M885k445k238j841k755m694K416J198j200L251j006QL977
$$ -4386 -2711 -263 4622 2177 -61 -1902 -4657 -9351 -6935 -5737 -6937 -3686 -4692 -4684 -707
12140g07l29K399m47k495l888j446N74M52j660L459K330j26l219j654J5j988o54
$$ -707 -1036 1363 916 -1579 -5467 -6913 -6339 -5887 -7547 -4088 -1758 -1884 -5103 -6757 -6742 -8730 -9384
12123i384J92J245L12K71N159K995K68J8j764m47J745J356j243r76L049O798J791
$$ -9384 -9192 -7947 -7635 -7364 -2205 790 1058 1076 -688 -1135 610 1966 723 -253 2796 9594 11385
12106A1385j500k407K031j1l824J2l797l888Qj512J017l306j493K48j947N7N993
$$ 11385 9885 7478 9509 9498 5674 5686 1889 -1999 -1991 -3503 -2486 -5792 -7285 -7037 -8984 -8927 -2934
12089b934M870J034J293k569n173l332M21p20n16M102J615K881r01j565K293J260
$$ -2934 1936 2970 4263 1694 -3479 -6811 -6390 -7110 -7626 -3524 -1909 972 71 -1494 799 2059
12073B059K280L612j145l049m121k289j334l377J551K760J714M09l459l868j412
$$ 2059 4339 7951 6806 3757 -364 -2653 -3987 -7364 -5813 -3053 -1339 -930 -4389 -8257 -9669
12058i669J218M554L312q61l11j267k185j714j006p96Q89K156j188Q40L530L790
$$ -9669 -8451 -3897 -585 -1446 -1757 -3024 -5209 -6923 -7929 -8725 -7836 -5680 -6868 -6028 -2498 1292
12042A292L177j377j572J448J137m63k379j006K811k680k987o82J812J948J260
$$ 1292 4469 3092 1520 2968 4105 3642 1263 257 3068 388 -2599 -3281 -1469 479 1739
12027A739N60P3l665j364k11L961k419j660J685L308l336l263J893J14K002K299
$$ 1739 2299 2372 -1293 -2657 -2868 1093 -1326 -2986 -1301 2007 -1329 -4592 -2699 -2585 -583 1716
12011A716J494l927n516J594M430J170m710n196q21J215M340P50K275J038r28
$$ 1716 3210 -717 -6233 -4639 -209 961 -3749 -8945 -9766 -8551 -4211 -3461 -1186 -148 -1076
11996a076l43j364r74o0J540k05M22J33j991j680j55K15j144m11j787J515K222
$$ -1076 -1419 -2783 -3757 -3817 -2277 -2482 -2060 -1927 -3918 -5598 -5753 -5538 -6682 -7093 -8880 -7365 -5143
11979e143j401k959j855L713K450K148l14L72j860J411J189J356J543n53J002
$$ -5143 -6544 -9503 -11358 -7645 -5195 -3047 -3361 -2989 -4849 -3438 -2249 -893 650 97 1099
11964A099l951k389j734j216J205L301J92j830L450l174l382j927P28K920L152
$$ 1099 -2852 -5241 -6975 -8191 -6986 -3685 -3493 -5323 -1873 -5047 -8429 -10356 -9628 -6708 -3556
11949c556l42P20J076j83j176K939m76l237O88K470R79k776k566o20k66N78L146
$$ -3556 -3898 -3178 -2102 -2285 -3461 -522 -998 -4235 -3547 -1077 -98 -2874 -5440 -6060 -6326 -5748 -2602
11932b602J549j949m94L019j061l576j738j047J095J713J18k94M12n4j940J357
$$ -2602 -1053 -3002 -3496 -477 -1538 -5114 -6852 -7899 -6804 -5091 -4973 -5267 -4855 -4909 -6849 -5492
11916e492P57M74J53K637m66J219J164q39k29m417N75L289M402K397m34J40J052
$$ -5492 -4735 -4261 -4108 -1471 -1937 -718 446 -393 -622 -5039 -4464 -1175 3227 5624 5190 5330 6382
11899F382J748K794n232k706j275k58J630O07l69j906k740j672J916j824j38J071
$$ 6382 8130 10924 5692 2986 1711 1453 3083 3690 3321 1415 -1325 -2997 -1081 -2905 -3043 -1972
11883a972k032k36J01M8j593k494O06J041L051J382J928L227K19l434K192L2J254
$$ -1972 -4004 -4240 -4139 -4091 -5684 -8178 -7572 -6531 -3480 -2098 -170 3057 3276 -158 2034 2066 3320
11866C320K525K44k25j518l181n759L17j5J64j444J915J248K454r83j285K078
$$ 3320 5845 6089 5864 4346 1165 -4594 -4277 -4292 -4128 -5572 -3657 -2409 45 -938 -2223 -145
11850a45J336K406J84j312j475Q21l26J020K409n90J228j563j568k036K27j166
$$ -145 1191 3597 3781 2469 994 1815 1489 2509 4918 4328 5556 3993 2425 389 616 -550
11834e50k61K779J913J53r7p46q163j033k542J34L932J236L120K558k669m8K424
$$ -550 -811 1968 3881 4034 3937 3191 -4972 -6005 -8547 -8413 -4481 -3245 -125 2433 -236 -284 2140
11817B140p03o44J748j409k888K775o30K597K29p50K205k278k271N58M64R69J744
$$ 2140 1437 793 2541 1132 -1756 1019 389 2986 3215 2465 4670 2392 121 679 1143 2112 3856
11800C856j372m162q95N62k631k222R85J104K469J179j854k122J154K367k59Q2
$$ 3856 2484 -1678 -2573 -2011 -4642 -6864 -5879 -4775 -2306 -1127 -2981 -5103 -3949 -1582 -1841 -1759
11784a759k047L2J841k58N42L474J794R74j71l619j504r39M3j013O20J942K343
$$ -1759 -3806 -3774 -1933 -2191 -1649 1825 3619 4593 4422 803 -701 -1640 -1597 -2610 -1990 -48 2295
11767B295J908j363k662k82j342K324k19R49p99j85m16j953j009J743j95L025
$$ 2295 4203 2840 178 -104 -1446 878 659 1608 809 624 208 -1745 -2754 -1011 -1206 1819
11751A819K728q79k125j155k717q29j257J316R64j896j105j636j553K136M402
$$ 1819 4547 3668 1543 388 -2329 -3158 -4415 -3099 -2135 -4031 -5136 -6772 -8325 -6189 -1787
11736a787K112J820k774m369O5J400K820L18k338j681p84K26j76N58L547J875
$$ -1787 325 2145 -629 -4998 -4933 -3533 -713 -395 -2733 -4414 -5198 -4972 -5148 -4590 -1043 832
11720H32m98q62J774Q23J072k42l080J174M74r74N13j106j649j473K66J124O88
$$ 832 334 -528 1246 2069 3141 2899 -181 993 1467 493 1006 -100 -1749 -3222 -2956 -1832 -1144
11703a144j502j133J402j997q14J344j238k074j796J802K839J210J504j864k950
$$ -1144 -2646 -3779 -2377 -4374 -5188 -3844 -5082 -7156 -8952 -7150 -4311 -3101 -1597 -3461 -6411
11688f411m46J164k3k36L472J396j090K81L051J997l19k041n064J281O86J056
$$ -6411 -6857 -5693 -5716 -5952 -2480 -1084 -2174 -1893 1158 3155 2836 795 -4269 -2988 -2302 -1246
11672a246j425p79M95J358k98P71k908j357r6j795P400L274k679k416j237K64
$$ -1246 -2671 -3450 -2955 -1597 -1895 -1124 -4032 -5389 -5485 -7280 120 3394 715 -1701 -2938 -2674
11656b674J266j016P3K070K559k212j207J201N81M82j203M801K846m628j440J74
$$ -2674 -1408 -2424 -2351 -281 2278 66 -1141 60 641 1123 -80 4721 7567 2939 1499 1673
11640A673K422K199Q41N38N76j373J413K350K150k246m282l60O37N861K021J26
$$ 1673 4095 6294 7135 7673 8249 6876 8289 10639 12789 10543 6261 5901 6538 12399 14420 14546
11624A4546m336J28K325M93N173M515M378O673O584L437O391O863N964J0822J2540
$$ 14546 10210 10338 12663 13156 18329 22844 27222 33895 40479 43916 50307 57170 63134 73956 86496
11609H6496J7327K3303K9141M0662N7420P7516R1150Q8275O1154L7351J5118k697
$$ 86496 103823 127126 156267 196929 254349 331865 423015 511290 572444 609795 624913 622216
11597F22216k9960n6244o3351n2768l4633j1637n75k770j347r08M31n961j0139
$$ 622216 592256 536012 472661 419893 385260 373623 373048 370278 368931 368023 368454 362493 352354
11584C52354j6516j9794k5881j9454j9113k0037k2176k0378j9363j4106j2089
$$ 352354 335838 316044 290163 270709 251596 231559 209383 189005 169642 155536 143447
11573A43447p182p577n905o177n780q907p714j763n991o353k020k756m208n507
$$ 143447 136265 128688 122783 116606 110826 101919 94205 92442 86451 80098 78078 75322 71114 65607
11559F5607k514n399l442O52l180m184l934l946k579L98J301L550j283j202j401
$$ 65607 63093 57694 54252 54904 51724 47540 43606 39660 37081 37479 38780 42330 41047 39845 38444
11544C8444K814k065m448k35k51r10j570p02R30r97l902J369o73m516j377K853
$$ 38444 41258 39193 34745 34510 34259 33349 31779 31077 32007 31010 27108 28477 27804 23288 21911 24764
11528B4764N80j636R2J977R00k298l360N27K411K224N30J595K49n75M60K418K552
$$ 24764 25344 23708 23800 25777 26677 24379 21019 21546 23957 26181 26711 28306 28555 27980 28440 30858 33410
11511C3410n31K665K447K140M313J762l00N16j270l632j828j964o76o97L73l781
$$ 33410 32879 35544 37991 40131 44444 46206 45906 46422 45152 41520 39692 37728 37052 36355 36728 32947
11495C2947j565m347j068L851k96k656j794M02k412j037K801j095j960k861l58
$$ 32947 31382 27035 25967 29818 29522 26866 25072 25474 23062 22025 24826 23731 21771 18910 18552
11480A8552K468L570L097K242l43m912k74M697K121M433Q741O650Q855P484J3135
$$ 18552 21020 24590 27687 29929 29586 24674 24400 29097 31218 35651 44392 51042 59897 67381 80516
11465H0516J5891J6392K2832L5312N2156O6981P7994Q0059O5532L7723O758j3049
$$ 80516 96407 112799 135631 170943 223099 290080 368074 448133 513665 551388 558146 545097
11453E45097l4301o1240p7787p3681o3156m8111l1894j9059j5474r729r229j0816
$$ 545097 510796 449556 371769 298088 234932 186821 154927 135868 120394 110665 101436 90620
11441I0620o085o000m778m036l853l096J85k455o858l513l725k135k161m416L38
$$ 90620 84535 78535 73757 69721 65868 62772 62957 60502 53644 50131 46406 44271 42110 37694 38032
11426C8032J154l083l436k325P68l107k538k09L8n90j485m68j69K495j391j896
$$ 38032 39186 36103 32667 30342 31110 28003 25465 25256 25294 24704 23219 22751 22582 25077 23686 21790
11410B1790N8L09N75k523l59o368j906J806J183j062L380K205m753m162J085P6
$$ 21790 21848 22157 22732 20209 19850 13482 11576 13382 14565 13503 16883 19088 14335 10173 11258 11334
11394A1334k44J828N439J850L86m24O22M612J640j896l138K74J972J692K031J603
$$ 11334 11090 12918 18357 20207 20593 20169 20791 25403 27043 25147 22009 22283 24255 25947 27978 29581
11378B9581k19R20L16k050K666K809m27Pk977N1M787k23n212k935R8j330k887
$$ 29581 29362 30282 30598 28548 31214 34023 33596 33603 30626 30677 35464 35241 30029 27094 27192 25862 22975
11361B2975j684l939m08m495o73M186J06J433j335o02j725j880J228M974k885
$$ 22975 21291 17352 16944 12449 11776 15962 16068 17501 16166 15564 13839 11959 13187 18161 15276
11346A5276j162j310k251K366j702l376K728K252q80j48j460l75Q39N02J419J131
$$ 15276 14114 12804 10553 12919 11217 7841 10569 12821 11941 11793 10333 9958 10797 11299 12718 13849
11330A3849M7k489j857N59j335j486k413L208K801L266J780l12j650K879N355
$$ 13849 13896 11407 9550 10109 8774 7288 4875 8083 10884 14150 15930 15618 13968 16847 22202
11315B2202N506K242j6o47J044p69k836k127K924P815P409K379K898M221O662
$$ 22202 27708 29950 29934 29287 30331 29562 26726 24599 27523 35338 42747 45126 48024 52245 58907
11300E8907Q346J2326J1416O395J1755J5730J4534K0321K1189K4101K3075K0380
$$ 58907 67253 79579 90995 97390 109145 124875 139409 159730 180919 205020 228095 248475
11288B48475J4479J0362P629p67m223r538k0137j5851j8409k3348j7565j5795
$$ 248475 262954 273316 280945 280178 275955 266417 246280 230429 212020 188672 171107 155312
11276A55312j2728j1415j0446j1548j1065r780n456n240o760n351o753q216m775
$$ 155312 142584 131169 120723 109175 98110 88330 82874 77634 70874 65523 58770 50554 45779
11263D5779J765l688j103k474m951p87J12l917q93J783j468n738k461p88J268
$$ 45779 47544 43856 42753 40279 35328 34541 34653 30736 29843 31626 30158 24420 21959 21171 22439
11248B2439L201j630l824o252j524k603k559K993L048K220l138k118n41J114J013
$$ 22439 25640 24010 20186 13934 12410 9807 7248 10241 13289 15509 12371 10253 9712 10826 11839
11233A1839q51J432R56n690n031p39M543K881k547j635K864m12n85K757K027j431
$$ 11839 10988 12420 13376 7686 2655 1916 6459 9340 6793 5158 8022 7610 7025 9782 11809 10378
11217A0378l357k039o876o32j084K011J705K904k304j418N51j117j118L214M602
$$ 10378 7021 4982 -1894 -2526 -3610 -1599 106 3010 706 -712 -161 -1278 -2396 818 5420
11202E420p86k320L852l216j413K467L227M3k823k971N85j283j138Q96j200J55
$$ 5420 4634 2314 6166 2950 1537 4004 7231 7274 4451 1480 2065 782 -356 540 -660 -505
11186e05N369P583k335o99O15k4k455J405N39j527l709k924J156J9Q26j351o51
$$ -505 4864 12447 10112 9413 10028 10004 7549 8954 9493 7966 4257 1333 2489 2508 3334 1983 1332
11169A332k323j429R93J502J299J436j587P59j754k518n28L176J950j904K057
$$ 1332 -991 -2420 -1427 75 1374 2810 1223 1982 228 -2290 -2818 358 2308 404 2461
11154B461P03j369j503k079m14P11L545L18l988j828o79J172j10L918P96K95R12
$$ 2461 3164 1795 292 -1787 -2201 -1490 2055 2373 -1615 -3443 -4122 -2950 -3060 858 1654 1949 2861
11137B861Q11j127j772j364K381K91k668k384L95J374O43J249M41k122o96R82
$$ 2861 3672 2545 773 -591 1790 2081 -587 -2971 -2576 -1202 -559 690 1131 -991 -1687 -705
11121g05K99Jo11j01L844k045K11J746j457n40j025L503q15l007k400J265L101
$$ -705 -406 -405 -1016 -1117 2727 682 893 2639 1182 642 -383 3120 2305 -702 -3102 -1837 1264
11104A264Q02m0J451j043j920k092q34k528P09L959J012m09K702J18j363j308
$$ 1264 2066 2026 3477 2434 514 -1578 -2412 -4940 -4231 -272 740 331 3033 3151 1788 480
11088D80k085p47k166o80Q78K090N32j023J14q7k781j398j100N90J995M33L024
$$ 480 -1605 -2352 -4518 -5198 -4320 -2230 -1698 -2721 -2607 -2694 -5475 -6873 -7973 -7383 -5388 -4955 -1931
11071a931K573k586J25J307k84J891k035J271K807r06j626l47j544K781k498n448
$$ -1931 642 -1944 -1819 -512 -796 1095 -940 331 3138 2232 606 259 -1285 1496 -1002 -6450
11055f450k692L673O39j198j09q57l376K014J299O82J442j914J44K291j354J106
$$ -6450 -9142 -5469 -4830 -6028 -6137 -6994 -10370 -8356 -7057 -6375 -4933 -6847 -6703 -4412 -5766 -4660
11039d660L708L386p78k8L17j036J501j542j294j963k28L134M54j713K175k356
$$ -4660 -952 2434 1656 1628 1945 909 2410 868 -426 -2389 -2617 517 971 -742 1433 -923
11023i23o94K789j447l417j529N673k43O08j146l379M26J711L210K365p71k044
$$ -923 -1617 1172 -275 -3692 -5221 452 209 817 -329 -3708 -3282 -1571 1639 4004 3233 1189
11007A189k643j235m00j200q37N03j129O18J384o60j247L003K158k344k696K187
$$ 1189 -1454 -2689 -3089 -4289 -5126 -4623 -5752 -5134 -3750 -4410 -5657 -2654 -496 -2840 -5536 -3349
10991c349K48K021M005k66m219l257p21K327K90O2k631j164K618O94k711k476
$$ -3349 -3101 -1080 2925 2659 -1560 -4817 -5538 -3211 -2921 -2859 -5490 -6654 -4036 -3342 -6053 -8529
10975h529j717L225R79J151m72K337J559m62l072q85J258J317J747l97k229l721
$$ -8529 -10246 -7021 -6042 -4891 -5363 -3026 -1467 -1929 -5001 -5886 -4628 -3311 -1564 -1961 -4190 -7911
10959g911k63j608K392M186J931L169K379l251k77k61L17j188k871P42q64K289
$$ -7911 -8174 -9782 -7390 -3204 -1273 1896 4275 1024 747 486 803 -385 -3256 -2514 -3378 -1089
10943a089J488j1j362l763k491j65K312n23j369L794M778K135J89j292j538J978
$$ -1089 399 388 -974 -4737 -7228 -7393 -5081 -5604 -6973 -3179 1599 3734 3923 2631 1093 3071
10927C071J044q95l634k881k016m34j739J084K330l4K157L38n857k985M094Q46
$$ 3071 4115 3220 -414 -3295 -5311 -5745 -7484 -6400 -4070 -4104 -1947 -1609 -7466 -10451 -6357 -5511
10911e511Q25J908R14J71J592k114m713j892L255r49N50O1J775K604J218j802
$$ -5511 -4686 -2778 -1864 -1693 -101 -2215 -6928 -8820 -5565 -6514 -5964 -5903 -4128 -1524 -306 -2108
10895b108j692Q67q13R14N41K517l88p15k754r25K13k483J031L476N610q06J256
$$ -2108 -3800 -2933 -3746 -2832 -2291 226 -162 -877 -3631 -4556 -4343 -6826 -5795 -2319 3291 2485 3741
10878C741R80k445k30q73k881j94k245j858n97k444N49r66l89j751R46M947N219
$$ 3741 4721 2276 2046 1173 -1708 -1902 -4147 -6005 -6602 -9046 -8497 -9463 -9852 -11603 -10657 -5710 -491
10861d91q77k462l420L012l59m10L134L514R74j074J771J088j684o524j6L316
$$ -491 -1368 -3830 -7250 -4238 -4597 -5007 -1873 1641 2615 1541 3312 4400 2716 -3808 -3824 -508
10845e08K024k034l830k367r93J418R10K135j033J266J269r20J462O55l807l185
$$ -508 1516 -518 -4348 -6715 -7708 -6290 -5380 -3245 -4278 -3012 -1743 -2663 -1201 -546 -4353 -7538
10829g538k072P44P83J315N126J133j080k323J11J971j570j544J688K374L015
$$ -7538 -9610 -8866 -8083 -6768 -1642 -509 -1589 -3912 -3801 -1830 -3400 -4944 -3256 -882 2133
10814B133k466l721j966J764N67k259m01Q85L308J9r21q77k583l024j685j027
$$ 2133 -333 -4054 -6020 -4256 -3689 -5948 -6349 -5464 -2156 -2137 -3058 -3935 -6518 -9542 -11227 -12254
10798a2254L474K544R43J26L49O65P58m12J712J082n06K101k078j203J59K57K104
$$ -12254 -8780 -6236 -5293 -5167 -4818 -4153 -3395 -3807 -2095 -1013 -1519 582 -1496 -2699 -2540 -2283 -179
10781a79M61j539j958k611k463J844k542j023Q83L623R03K209j289r91K201J988
$$ -179 282 -1257 -3215 -5826 -8289 -6445 -8987 -10010 -9127 -5504 -4601 -2392 -3681 -4672 -2471 -483
10765d83l322j154O013j652k901m820K465K959J204R60m82m56O30P4r33K031K726
$$ -483 -3805 -4959 1054 -598 -3499 -8319 -5854 -2895 -1691 -731 -1213 -1669 -1039 -965 -1898 133 2859
10748B859o17j527J644J681k656n52K694M193M447L801O19k880n213o67p4L42
$$ 2859 2242 715 2359 4040 1384 832 3526 7719 12166 15967 16586 13706 8493 7826 7752 8094
10732H094j746j514M15p36k274L306m298k815J078m122J994N596P4J527K959o32
$$ 8094 6348 4834 5249 4513 2239 5545 1247 -1568 -490 -4612 -2618 2978 3052 4579 7538 6906
10716F906R19j092m134j256P42l42O60J190j219k430j301J327L63j720m226J980
$$ 6906 7825 6733 2599 1343 2085 1743 2403 3593 2374 -56 -1357 -30 333 -1387 -5613 -3633
10700c633M497q20k981k023L611K299l141k676K839M964K296k172k383l458k924
$$ -3633 864 44 -2937 -4960 -1349 950 -2191 -4867 -2028 2936 5232 3060 677 -2781 -5705
10685e705o81J824L440K3K464R36J242r21l495k684K156j788Q0l67K429k095r27
$$ -5705 -6386 -4562 -1122 -1099 1365 2301 3543 2622 -873 -3557 -1401 -3189 -3109 -3476 -1047 -3142 -4069
10668d069j348n9J976K888k013j060k539j34M012j01j766p6L539K792O94k987
$$ -4069 -5417 -5476 -3500 -612 -2625 -3685 -6224 -6358 -2346 -2447 -4213 -4289 -750 2042 2736 -251
10652b51j402j2J505J861j260j034p84j335k744j576j25p82K255L034K188J233
$$ -251 -1653 -1665 -160 1701 441 -593 -1377 -2712 -5456 -7032 -7157 -7939 -5684 -2650 -462 771
10636G71l798R06M71j013j125j222N86M32j49p48K768M084k779k01L54P82O73
$$ 771 -3027 -2121 -1650 -2663 -3788 -5010 -4424 -3992 -4141 -4889 -2121 1963 -816 -1017 -663 119 792
10619G92j050K8J111k676l13k193o35j843K403J378k420P90p3j685k639J368O042
$$ 792 -258 -230 881 -1795 -2108 -4301 -4936 -6779 -4376 -2998 -5418 -4628 -4701 -6386 -9025 -7657 -1615
10602a615n52q19l025j688J333M256J438q46N15R3J881R12k271o70K750M59j029
$$ -1615 -2167 -2986 -6011 -7699 -6366 -2110 -672 -1518 -1003 -910 971 1883 -388 -1058 1692 2151 1122
10585A122m884L56L961L51k01l37M61J148R20j548k929J048j691M74L54K000R10
$$ 1122 -3762 -3406 555 906 705 368 829 1977 2897 1349 -1580 -532 -2223 -1749 -1395 605 1515
10568A515k551L263O762L206R79N227M057O795N306K10M94m377l611q18l722l188
$$ 1515 -1036 2227 8989 12195 13174 18401 22458 29253 34559 34769 35263 30886 27275 26457 22735 19547
10552A9547J123M219M84J928K329M088J060q91K24k319l494l957k252n894l843
$$ 19547 20670 24889 25373 27301 29630 33718 34778 33887 34111 31792 28298 24341 22089 16195 12352
10537A2352j497k214l632k772L811K083k567k647j327j258M054L025Ok584l689
$$ 12352 10855 8641 5009 2237 6048 8131 5564 2917 1590 332 4386 7411 7417 4833 1144
10522A144j407j820l420L455L372Q0j73M26N53k11k21p13q1k050k598k426L79
$$ 1144 -263 -2083 -5503 -2048 1324 1404 1231 1657 2210 1999 1778 1065 984 -1066 -3664 -6090 -5711
10505e711r40k0R85P86l221J830J493K946K959r54J375m69k996m995L11q97K64
$$ -5711 -6651 -6671 -5686 -4900 -8121 -6291 -4798 -1852 1107 153 1528 1059 -1937 -6932 -6621 -7518 -7254
10488g254j035j175J482K378J65j627J674K563L6J750L01j82J881Q68l794j494
$$ -7254 -8289 -9464 -7982 -5604 -5439 -7066 -5392 -2829 -2793 -1043 -742 -924 957 1825 -1969 -3463
10472c463p68J343J241J754J345j862k099R47l128P09L84J485j618R90P62J2L528
$$ -3463 -4231 -2888 -1647 107 1452 -410 -2509 -1562 -4690 -3981 -3597 -2112 -3730 -2740 -1978 -1966 1562
10455A562J301M0J714k21L638J964N250k19m921J005K65k240l457J07j241o37
$$ 1562 2863 2903 4617 4396 8034 9998 15248 15029 10108 11113 11378 9138 5681 5788 4547 3910
10439C910k70J760m45K665k413k501k795R16J437l607o66M75J004K0o36l004j640
$$ 3910 3640 5400 4955 7620 5207 2706 -89 827 2264 -1343 -2009 -1534 -530 -510 -1146 -4150 -5790
10422e790O91K615M811q36J157q44J200R73l280j59o67j288k288J892j882k725
$$ -5790 -5099 -2484 2327 1491 2648 1804 3004 3977 697 538 -129 -1417 -3705 -1813 -3695 -6420
10406f420K430M458j10o79p64k42l109K14Q74M843j57j40k158k361J095L360R29
$$ -6420 -3990 468 358 -321 -1085 -1327 -4436 -4222 -3348 1495 1338 1198 -960 -3321 -2226 1134 2063
10389B063p40o49j877n52k072m240J271L413J602O71k209o22o77k485J982J576
$$ 2063 1323 674 -1203 -1755 -3827 -8067 -6796 -3383 -1781 -1110 -3319 -3941 -4618 -7103 -5121 -3545
10373c545j532M103q07J203J514q09M55J89j464k96J025k938k846R48J655r91
$$ -3545 -5077 -974 -1781 -578 936 127 582 771 -693 -989 36 -2902 -5748 -4800 -3145 -4136
10357d136L312M489J662l591k796J118J866N31O55J884O174J102m707k912j323
$$ -4136 -824 3665 5327 1736 -1060 58 1924 2455 3110 4994 11168 12270 7563 4651 3328
10342C328K210L150M494K036j244P86j896m674j936l258l132J320K36j572K50
$$ 3328 5538 8688 13182 15218 13974 14760 12864 8190 6254 2996 -136 1184 1420 -152 98
10327I8L312K019k813O65N15l135J508M251M55k106j481j701q63l586j491R2K431
$$ 98 3410 5429 2616 3281 3796 661 2169 6420 6875 4769 3288 1587 724 -2862 -4353 -4261 -1830
10310a830P85M94L006M598M794j743k329k042k602m51M681J850O65N19N694j527
$$ -1830 -1045 -551 2455 7053 11847 10104 7775 5733 3131 2680 7361 9211 9876 10395 16089 14562
10294A4562k451j258L086K176j618O18j20k823k330k903k54P2N7M12j736l672
$$ 14562 12111 10853 13939 16115 14497 15115 14995 12172 9842 6939 6685 6757 6814 7226 5490 1818
10278A818J50J918j319J737N62o31j410l32J987J393L57k833j160N503p94J36
$$ 1818 1968 3886 2567 4304 4866 4235 2825 2493 4480 5873 6230 3397 2237 7740 6946 7082
10262G082k065j663r65r62J185J19J39l61j137N143M293k834k48l19L013L159
$$ 7082 5017 3354 2389 1427 2612 2731 2870 2509 1372 6515 10808 7974 7726 7407 10420 13579
10246A3579J490k662o377l156J133K373M192J721l02j155k16R15O300q99k548
$$ 13579 15069 12407 6030 2874 4007 6380 10572 12293 11991 10836 10620 11535 17835 16936 14388
10231A4388J289J226p82k102p89k063j929j352J126J136l83k635j161j796n45
$$ 14388 15677 16903 16121 14019 13230 11167 9238 7886 9012 10148 9765 7130 5969 4173 3628
10216C628j306J375K564L72r93n45K504K998k26N02k247K306q55K145J526l208
$$ 3628 2322 3697 6261 6633 5640 5095 7599 10597 10371 10873 8626 10932 10077 12222 13748 10540
10200A0540r92R25M240O42K036M851L262J469J512p89j178n119p008l127J876
$$ 10540 9548 10473 14713 15355 17391 22242 25504 26973 28485 27696 26518 21399 14391 11264 13140
10185A3140J089R57K844L317K936N79N064K286J041K597K144K400J911K626J462
$$ 13140 14229 15186 18030 21347 24283 24862 29926 32212 33253 35850 37994 40394 42305 44931 46393
10170D6393j914k529l65k156J152j220j275l796m150m435l132l162n11K648K887
$$ 46393 44479 41950 41585 39429 40581 39361 38086 34290 30140 25705 22573 19411 18900 21548 24435
10155B4435j651l941k03K331j637k379n173O01K235N16L898J274k749Q48j74j921
$$ 24435 22784 18843 18640 20971 19334 16955 11782 12383 14618 15134 19032 20306 17557 18405 18231 16310
10139A6310k094p34J079L03J549L0J402P04k123m332m311N454J111k406J995J304
$$ 16310 14216 13482 14561 14864 16413 16443 17845 18549 16426 12094 7783 13237 14348 11942 13937 15241
10123A5241l496l956J193k423J912N01k28j613J13k87k136p02L996J148J401j727
$$ 15241 11745 7789 8982 6559 8471 8972 8744 7131 7244 6957 4821 4119 8115 9263 10664 8937
10107H937J192K696J112k715j130R73L098k85m47K15O473J203j92M084N664R505
$$ 8937 10129 12825 13937 11222 10092 11065 14163 13878 13431 13646 20119 21322 21130 25214 30878 40383
10091D0383J0336Q411Q007N984N02l267n582q964l031l353j0404n295j563n057
$$ 40383 50719 59130 67137 73121 73623 70356 64774 55810 52779 49426 39022 33727 32164 27107
10077B7107k311N044K290K446L233K034Q271O546P028Q009R235R535O525J0661
$$ 27107 24796 29840 32130 34576 37809 39843 48114 54660 61688 69697 78932 88467 94992 105653
10063A05653J0906P234J1994J7992L7981N3676O9345J06401J70582K93210N22428
$$ 105653 116559 123793 135787 153779 191760 245436 314781 421182 591764 884974 1407402
10052A407402Q11182R57906N41436j4761n2065J41106j67159q45139r13787o24331
$$ 1407402 2218584 3176490 3717926 3703165 3651100 3792206 3625047 2779908 1866121 1241790
10042A241790l34903j83203j07686p5631n4989l9208l1214k3362j8932j9718j7165
$$ 1241790 906887 723684 615998 540367 485378 446170 414956 391594 372662 352944 335779
10031C35779j6846j2913j3321j4357j5345k1874k0029j4187j0580j0798j0209
$$ 335779 318933 306020 292699 278342 262997 241123 221094 206907 196327 185529 175320
10020A75320j0993j0410r925l953m564q694n029k982n684n395m346n613j838n178
$$ 175320 164327 153917 143992 140039 135475 126781 121752 118770 113086 107691 103345 97732 95894 90716
10006I0716q010k152q43J083q47p156j932j127m106k651j849k399l516l1r12N7
$$ 90716 82706 80554 79711 80794 79947 72791 70859 69732 65626 62975 61126 58727 55211 55180 54268 54325
9990E4325L098Q98l77K227p32l453j779J494J492r76k530l35m341n764l528j22
$$ 54325 57423 58321 57944 60171 59439 55986 54207 55701 57193 56217 53687 53352 49011 43247 39719 39597
9974C9597J094k706l012j781q29m570j450K758O167m415n706P59J528J436m61
$$ 39597 40691 37985 34973 33192 32363 27793 26343 29101 35268 30853 25147 25906 27434 28870 28409
9959B8409k205l506M36K093n22k20j729k283n77k35k228M308L848k133j008L42
$$ 28409 26204 22698 23134 25227 24705 24485 22756 20473 19896 19661 17433 21741 25589 23456 22448 22790
9943B2790J184k210k469j802M889N811L882J808j09J135k50k268m230n176k786
$$ 22790 23974 21764 19295 17493 22382 28193 32075 33883 33774 34909 34659 32391 28161 22985 20199
9928B0199n77O20J727j003o91j292j563K004M53j542l455J048k209l768o56j5
$$ 20199 19622 20242 21969 20966 20275 18983 17420 19424 19877 18335 14880 15928 13719 9951 9295 9280
9912I280L731J081K698K633j745J001K625r2J420K473j89K45l664j091j211O83
$$ 9280 13011 14092 16790 19423 17678 18679 21304 21212 22632 25105 24916 25161 21497 20406 19195 19878
9896A9878L857K765k407k957j353j213M87K281N681K906J2l933P52j750l236k251
$$ 19878 23735 26500 24093 21136 19783 18570 19057 21338 27019 29925 29937 26004 26756 25006 21770 19519
9880A9519M7j548J957M087k51Q16k511l844n6J139K389j285j711j624L799J075
$$ 19519 19566 18018 19975 24062 23811 24627 22116 18272 18216 19355 21744 20459 18748 17124 20923 21998
9864B1998N771O066l239R29l445l791M810M599j131k067p5n91o50r85N40k404
$$ 21998 27769 33835 30596 31525 28080 24289 29099 33698 32567 30500 30425 29834 29184 28199 28739 26335
9848B6335J366l368n308m558m070K617L169J365J168O89r18j785Q04J420k221
$$ 26335 27701 24333 19025 14467 10397 13014 16183 17548 18716 19405 18487 16702 17506 18926 16705
9833A6705p96K705K833K774J181K471m89j51J106r5l599N146N577R323P131N725
$$ 16705 15909 18614 21447 24221 25402 27873 27384 27233 28339 28244 24645 29791 35368 44691 51822 57547
9817E7547K326k245j516l47j225N016Q26q18k960j519j556n989j0498l049K69
$$ 57547 59873 57628 56112 55765 54540 59556 60382 59564 56604 55085 53529 47540 37042 33993 34262
9802C4262n123j03k221j397K166n37j118l133J539Q64p33j091k62J932M25J635
$$ 34262 29139 29036 26815 25418 27584 27047 25929 22796 24335 25199 24466 23375 23113 25045 25470 27105
9786B7105l610k369J010K206K196l85k613m149J377M193M39k377j280N4K442J063
$$ 27105 23495 21126 22136 24342 26538 26153 23540 19391 20768 24961 25400 23023 21743 21797 24239 25302
9770B5302j878n15j455K604Q85n22m695J771N66M52N184J974J556O79k267K20
$$ 25302 23424 22909 21454 24058 24943 24421 19726 21497 22063 22515 27699 29673 31229 31908 29641 29861
9754B9861L469o05l506k80L78N93K798J444l93M820M216j721j749L200M836M943
$$ 29861 33330 32725 29219 28939 29317 29910 32708 34152 33759 38579 42795 41074 39325 42525 47361 52304
9738E2304L775P715M805M527m67J763J390n273k679k04J370l290n104o796j551
$$ 52304 56079 63794 68599 73126 72659 74422 75812 70539 67860 67656 69026 65736 60632 53836 52285
9723E2285L26k445l578k841q03k518J41j417q31p325n036j427L030k050k805m233
$$ 52285 52611 50166 46588 43747 42944 40426 40567 39150 38319 30994 25958 24531 27561 25511 22706 18473
9707A8473J209M257J511Q69J609J179J84n7j518m82K099L114M819K904j1N119
$$ 18473 19682 23939 25450 26319 27928 29107 29291 29234 27716 27234 29333 32447 37266 40170 40159 45278
9691D5278J770J026K246J550l679j957o37J11l661m688Q46m24J809N641M054L992
$$ 45278 47048 48074 50320 51870 48191 46234 45597 45708 42047 37359 38205 37781 39590 45231 49285 53277
9675E3277J2068J6394J6940J1190J4384J3374J6754J6936K4475L3998N2531Q5217
$$ 53277 65345 81739 98679 109869 124253 137627 154381 171317 195792 229790 282321 367538
9663C67538J39484K24981L19602L58597K54917P9544J452N205q7277k85410l50143
$$ 367538 507022 732003 1051605 1410202 1665119 1744663 1746115 1751320 1664043 1378633 1028490
9652A028490k80578j77098j05991n9820l6020k4826j4892o818o582p329l528L80
$$ 1028490 747912 570814 464823 405003 368983 344157 329265 322447 315865 308536 305008 305388
9640C05388N195J1163J9699L3546N4276P8270J06486J32851J53843J64991J44824
$$ 305388 310583 321746 341445 374991 429267 507537 614023 746874 900717 1065708 1210532
9629A210532J12559Q5529M1449l4304q7612j14046j41222j56330j47187j25956
$$ 1210532 1323091 1408620 1450069 1415765 1328153 1214107 1072885 916555 769368 643412
9619F43412j03801q3178o3903m5880k7815j7041j5561j8641j5979j0840j1667
$$ 643412 539611 456433 392530 346650 318835 301794 286233 267592 251613 240773 229106
9608B29106j1868j4867j4144j2635j0355n754o368q366n750k200j512p64J080
$$ 229106 217238 202371 188227 175592 165237 159483 153115 144749 138999 136799 135287 134523 135603
9595A35603q415o894p992o671n270n267k011l496l121R8j575r47L065j561j39
$$ 135603 127188 120294 112302 105631 100361 95094 93083 89587 86466 86564 84989 84042 87107 85546 85407
9580H5407k101q03l339j01J372n75n09j69k02l165k541n776j795O88O94M53K216
$$ 85407 83306 82503 79164 79063 80435 79860 79351 79182 78980 75815 73274 67498 65703 66391 67085 67538 69754
9563F9754O908r81J048j395o35J05k786l247j429Q22J587L43M248O453j41o518
$$ 69754 76662 75681 76729 75334 74699 74804 72018 68771 67342 68164 69751 70094 74342 80795 80654 74136
9547G4136o230n13j483j013p321l860m399m354j432l082j325K612P792L844N09
$$ 74136 67906 67393 65910 64897 57576 53716 49317 44963 43531 40449 39124 41736 49528 53372 53881
9532E3881K857P851J943k540n122q072k529k206o954j1793j0168p641l684J73
$$ 53881 56738 64589 66532 63992 58870 50798 48269 46063 39109 27316 17148 9507 5823 5996
9518E996n68r22K15L688L007j59k049j165J059M234K208j20P053L435n33K278
$$ 5996 5428 4506 4721 8409 11416 11257 9208 8043 9102 13336 15544 15424 22477 25912 25379 27657
9502B7657L177J635O318J699L195P271R259N849L140L459L581p3n253l576m122
$$ 27657 30834 32469 38787 40486 43681 50952 60211 66060 69200 72659 76240 76167 70914 67338 63216
9487F3216k182K263O064N002L907R194J0290J1742J7220K0569J9499J2130P855
$$ 63216 61034 63297 69361 74363 78270 87464 97754 109496 126716 147285 166784 178914 186769
9474A86769J9555M6845L2248J69l615k4169m185P211l3550k3016j0479j7738k4756
$$ 186769 206324 253169 285417 285586 281971 257802 253617 260828 227278 204262 193783 176045 151289
9461A51289j5741o432m957O13L375K488N916K208J187J253N610K35l319n799n75
$$ 151289 135548 129116 124159 124772 128147 130635 136551 138759 139946 141199 146809 147044 143725 137926 137351
9446A37351j115m439l495o227m041k480k427l686m915k796k633J362L273L625
$$ 137351 136236 131797 128302 122075 118034 115554 113127 109441 104526 101730 99097 100459 103732 107357
9432A07357M654l1j319P546N124K52L997L941R023M120L653J1010P301J144j272
$$ 107357 112011 111980 110661 118207 123331 123583 127580 131521 140544 144664 148317 159327 166628 167772 166500
9417A66500Q060K031p404p229q066q530m285o065j2648j6002j2934J511l266j1410
$$ 166500 174560 176591 169187 161958 153892 145362 141077 135012 122364 106362 93428 94939 91673 80263
9403H0263j4325o888l203m222l01P542J1993J0945J2995J3976P410P932J2804
$$ 80263 65938 59050 55847 51625 51324 58866 70859 81804 94799 108775 116185 124117 136921
9390A36921P684l502j1467p111j310k896j093L829O598P444Q879J2831J4438Q144
$$ 136921 144605 141103 129636 122525 121215 118319 117226 121055 127653 135097 143976 156807 171245 179389
9376A79389L064m462j2217p488r86l231n491n12O122O914R525J1259J0911J1471
$$ 179389 182453 177991 165774 158286 157300 154069 148578 148066 154188 161102 170627 181886 192797 204268
9362B04268R387J1386Q144J5563J2453J3674J6046L0087M3694N5321P3160Q8526
$$ 204268 213655 225041 233185 248748 261201 274875 290921 321008 364702 420023 493183 581709
9350E81709J05144J16866R2593j4693q8737r2809n7926r6735j30765r2619m7771
$$ 581709 686853 803719 896312 881619 792882 700073 642147 545412 414647 322028 274257
9339B74257m1997k5375Q569K0170K2091K8894L6361L4267K4896J7098o36j2609
$$ 274257 232260 206885 215454 235624 257715 286609 322970 357237 382133 399231 398595 385986
9327C85986j6532j8046j5915j2753j6670j2505j2293m587M288J4970J4745J4589
$$ 385986 369454 351408 335493 322740 306070 293565 281272 276685 280973 295943 310688 325277
9315C25277J1122L107M29j274l318o448l391O665J4348Q328J0763J7199K2416
$$ 325277 336399 339506 339935 338661 335343 328895 325504 332169 346517 354845 365608 382807 405223
9302D05223K0131J4697l334J25J718j02q2R93N542R425J6672J5002J5681J3323
$$ 405223 425354 440051 436717 436842 438560 438458 438376 439369 444911 454336 471008 486010 501691 515014
9288E15014J0847J7262J9602K4696J3319J4021K7666L8668L5309K7804K0492J5700
$$ 515014 525861 543123 562725 587421 600740 614761 642427 681095 716404 744208 764700 780400
9276G80400J6309J4489J3921J8998K7963K9061K6133K5039L7917N9165P3590P6070
$$ 780400 796709 811198 825119 844117 872080 901141 927274 952313 990230 1049395 1122985 1199055
9264A199055Q0945R5275J02549J02085R4037P5825N2674L9022L1113K8956L1391
$$ 1199055 1280000 1375275 1477824 1579909 1673946 1749771 1802445 1841467 1872580 1901536 1932927
9253A932927M4249N3788O6844J04345J37027J53965J63396K01581K61161L12573
$$ 1932927 1977176 2030964 2097808 2202153 2339180 2493145 2656541 2858122 3119283 3431856
9243C431856L60783M25214N15020O47159Q34276J076261J328044J466060J507681
$$ 3431856 3792639 4217853 4732873 5380032 6214308 7290569 8618613 10084673 11592354
9234A1592354J695709K011227K145628K153633K614796L678838N163572P277476
$$ 11592354 13288063 15299290 17444918 19598551 22213347 25892185 31055757 38333233
9226C8333233J0827291J6758306K6573894M0773876N4673119N6119633L3861684
$$ 38333233 49160524 65918830 92492724 133266600 187939719 244059352 277921036
9219B77921036O497882r38679K988349j0855265m3183105n6938622m8168326l1661912
$$ 277921036 284418918 283480239 286468588 275613323 232430218 175491596 127323270 95661358
9211I5661358j9393557j2198705q009077n423229l798855k833978k361405k161207
$$ 95661358 76267801 64069096 56060019 50636790 46837935 44003957 41642552 39481345
9203C9481345k097285k122890k226553k267246k294720k221959j987873j692363
$$ 39481345 37384060 35261170 33034617 30767371 28472651 26250692 24262819 22570456
9195B2570456j404761j164073r64826p90191o54132o16578o82636p24671o79919
$$ 22570456 21165695 20001622 19036796 18246605 17592473 16975895 16293259 15568588 14888669
9186A4888669o59773p56879q39192q00569p06862o06607n37578m88547m37267
$$ 14888669 14228896 13472017 12632825 11832256 11125394 10518787 9981209 9492662 9055395
9177I055395l88955l43204l04375k81089k71126k63279k42592k27372k24719k29833
$$ 9055395 8666440 8323236 8018861 7737772 7466646 7203367 6960775 6733403 6508684 6278851
9167F278851k33747k19739j94166j77919j77172j72411j60700j46739j41335j40614
$$ 6278851 6045104 5825365 5631199 5453280 5276108 5103697 4942997 4796258 4654923 4514309
9157D514309j27216j05491q8852q5832r2618r7286r3029q9353r0800j01282r9862
$$ 4514309 4387093 4281602 4192750 4106918 4014300 3917014 3823985 3734632 3643832 3542550 3442688
9146C442688r8854r3927q9548p9899p2833q2311p7242n9658n0428n1496n6087
$$ 3442688 3343834 3249907 3160359 3080460 3007627 2925316 2848074 2788416 2737988 2686492 2630405
9135B630405o3067n8370n7423o9366q4087j00966r5085r4519j00834j03567r9022
$$ 2630405 2567338 2508968 2451545 2382179 2298092 2197126 2102041 2007522 1906688 1803121 1704099
9124A704099q9849q6291p5473o1904m8430m3838m4319m6821m7314m6280n1170
$$ 1704099 1614250 1527959 1452486 1390582 1342152 1298314 1253995 1207174 1159860 1113580 1062410
9113A062410n5002o1461o0127m7233l9996k9660k3815k6192j7699j3451j0498
$$ 1062410 1007408 945947 885820 838587 798591 768931 745116 718924 701225 687774 677276
9102F77276l919p037r555q325J666q56j3801j2565K0569L2343J1892K9031L9479
$$ 677276 673357 666320 656765 648440 650106 649250 635449 622884 643453 675796 687688 716719 756198
9089G56198L8907O5355P2374K9279R932J1757j1225n8876q7466q0139n3225l5097
$$ 756198 795105 860460 932834 962113 972045 983802 972577 913701 826235 746096 692871 657774
9077F57774k4660j7068j0324j4809k3173k4345j9972j4595j3607j1357p936j0868
$$ 657774 633114 616046 605722 590913 567740 543395 523423 508828 495221 483864 475928 465060
9065D65060j3618j6124j5699j6947j2099j0764o520K555N784P8j916K144K595
$$ 465060 451442 435318 419619 402672 390573 379809 373289 375844 381628 381706 379790 381934 384529
9052C84529o47n995j2750j4941j1129q847l977k715J017R642J0015O085J0761
$$ 384529 383882 377887 365137 350196 339067 330220 326243 323528 324545 334187 344202 350287 361048
9039C61048J0861M977K77m451o331m384o690p109j3078j1073j2177j5083j3996
$$ 361048 371909 376886 377163 372712 366381 361997 355307 348198 335120 324047 311870 296787 282791
9026B82791j0959n797p644j2271k2429k2236q157J242J668n467r74Q636J3529
$$ 282791 271832 266035 258391 246120 223691 201455 193298 194540 196208 190741 189767 198403 211932
9013B11932P000L030N148P801J935L368J365J155L246k190j231q47j078j458j597
$$ 211932 218932 221962 227110 234911 236846 240214 241579 242734 245980 243790 242559 241712 240634 239176 237579
8998B37579n023n723j0724r900p021p425r561r771q280p906l569q301l169J635
$$ 237579 232556 226833 216109 206209 199188 191763 182202 172431 164151 156245 152676 144375 141206 142841
8984A42841l172m534J082J904J783N23q52j278p891j0235o423n058p336p254K322
$$ 142841 139669 135135 136217 138121 139904 140427 139575 138297 130406 120171 113748 108690 101354 94100 96422
8969I6422n24p981m283M362M938r854q948M18M62J862K724n884m051K179K345
$$ 96422 95898 87917 83634 87996 92934 83080 74132 74550 75012 76874 79598 73714 69663 71842 74187
8954G4187J558L504J015P28K771L41n628p468m814j154k674L25J651J150M082
$$ 74187 75745 79249 80264 80992 83763 84104 78476 71008 66194 65040 62366 62691 64342 65492 69574
8939F9574P832M341Q819J4171J4470R951O063Q812K375j847o955j0356p467o753
$$ 69574 77406 81747 90566 104737 119207 129158 135221 144033 146408 144561 137606 127250 119783 113030
8925A13030j628l175L154L789R69q8l721n337k528o92j302r282j4514o841o621
$$ 113030 111402 108227 111381 115170 116139 116051 112330 106993 104465 103773 102471 93189 78675 71834 65213
8910F5213l919l442n838n964j482M082O958K649M902M267Q33k347m86O9m499l670
$$ 65213 61294 57852 52014 46050 44568 48650 55608 58257 63159 67426 68259 65912 65426 65495 60996 57326
8894E7326j650o10k164k321K990L75N18j988r56M643O478M26K848N11p86l420
$$ 57326 55676 55066 52902 50581 53571 53946 54464 52476 51520 56163 62641 63067 65915 66426 65640 62220
8878F2220k592n818j687M129J838N12l13j133j46K924k85n258k883k303j488L293
$$ 62220 59628 53810 52123 56252 58090 58602 58289 57156 57010 59934 59649 54391 51508 49205 47717 51010
8862E1010R35K661m024l42R37R90K744r86J170M647P83L110O389N162J1678R423
$$ 51010 51945 54606 50582 50240 51177 52167 54911 53925 55095 59742 60525 63635 70024 75186 86864 96287
8846I6287Q980M557K337j006n210n828r570j0983q773l101K69k571K142K376k701
$$ 96287 105267 109824 112161 111155 105945 100117 90547 79564 70791 67690 67959 65388 67530 69906 67205
8831F7205m585k290K564P48J048J049L753L185N410P148P723J1508R930R637J4887
$$ 67205 62620 60330 62894 63642 64690 65739 69492 72677 78087 85235 92958 104466 114396 124033 138920
8816A38920J7825K9030L9391M8506P2017R6184J21710J43214J62128J66882J42644
$$ 138920 156745 185775 225166 273672 345689 441873 563583 706797 868925 1035807 1178451
8805A178451J15895Q8961K9932m6149r4245j16818j41721j58370j45639j18878
$$ 1178451 1294346 1383307 1413239 1367090 1272845 1156027 1014306 855936 710297 591419
8795E91419r9870p8375n7928l5642k8375k1606j7400j5756r609r686q259j3366
$$ 591419 491549 413174 355246 319604 291229 269623 252223 236467 226858 217172 208913 195547
8783A95547j2459r568j0971r315r865m650n457p133o787o260k653q260p625o385
$$ 195547 183088 173520 162549 153234 143369 138719 133262 126129 119342 113082 110429 102169 94544 88159
8769H8159n566o284n028l212n37k249L141N402M517L557M097P57m213l918n766
$$ 88159 82593 76309 71281 68069 67532 65283 68424 73826 78343 81900 85997 86754 82541 78623 72857
8754G2857q143k385n414k900j869n046k654o81J22j306J9R6K223k62J004L245
$$ 72857 64714 62329 56915 54015 52146 47100 44446 43765 43887 42581 42600 42696 44919 44657 45661 48906
8738D8906J653r93j513J660O19J927k55o85L943K799N80n682m019l661m567k248
$$ 48906 50559 49566 48053 49713 50332 52259 52004 51319 55262 58061 58641 52959 48940 45279 40712 38464
8722C8464M17l545j823l798j233J656J805J376J036m906l180j778K587M07k006
$$ 38464 38881 35336 33513 29715 28482 30138 31943 33319 34355 29449 26269 24491 27078 27485 25479
8707B5479m992n106l331j630j507J472M7J752K970J891M774J605K661l37k554
$$ 25479 20487 15381 12050 10420 8913 10385 10432 12184 15154 17045 21819 23424 26085 25748 23194
8692B3194q36m40j70J718j811R79J090L989j811k834J925j307k437j326j398j108
$$ 23194 22358 21918 21748 23466 21655 22634 23724 27713 25902 23068 24993 23686 21249 19923 18525 17417
8676A7417l158j510P11O152k24K601J187M84q86k624k065K281L576N2j794J072
$$ 17417 14259 12749 13460 19612 19388 21989 23176 23660 22774 20150 18085 20366 23942 23994 22200 23272
8660B3272N84J443j160l87L80R16J756K544J566l063k326k440k910L286j00k671
$$ 23272 23856 25299 24139 23752 24132 25048 26804 29348 30914 27851 25525 23085 20175 23461 23361 20690
8644B0690O2L651O69j046k892o71K137K970k440k395m972n482l61J968K305K28
$$ 20690 20752 24403 25072 24026 21134 20463 22600 25570 23130 20735 15763 10281 9920 11888 14193 14421
8628A4421L077K86o52k972L38K443K307O763M033K61m07j533Q53J90k387K39K402
$$ 14421 17498 17784 17132 14160 14498 16941 19248 26011 30044 30305 29898 28365 29218 29408 27021 27260 29662
8611B9662N72l055l219K545R00R6K042q73p39M21K344J477n678j432J808M64j101
$$ 29662 30234 27179 23960 26505 27405 27501 29543 28670 27931 28352 30696 32173 26495 25063 26871 27335 26234
8594B6234L205o7M82l63J59o35j126k559k123k884p71J121l499n56m96P59K001
$$ 26234 29439 29372 29854 29491 29650 29015 27889 25330 23207 20323 19552 20673 17174 16618 16122 16881 18882
8577A8882L31j489r33N038L471m13K426J486k076k325j810M33L723K277r12j522
$$ 18882 19213 17724 16791 21829 25300 24887 27313 28799 26723 24398 22588 23021 26744 29021 28109 26587
8561B6587J390k634j940k082M9k433P49J050l91J166L21r52J830p2P29L378J343
$$ 26587 27977 25343 23403 21321 21370 18937 19686 20736 20345 21511 21832 20880 22710 22638 23367 26745 28088
8544B8088j626l596j708j309l790r68K832N24m78j149j710J856m63J14M0J103
$$ 28088 26462 22866 21158 19849 16059 15091 17923 18447 17969 16820 15110 16966 16503 16617 16657 17760
8528A7760k19o41o0M072L180P88k86M327n37n223l121j314P43k640M70J519j848
$$ 17760 17541 16900 16840 20912 24092 24880 24594 28921 28384 23161 20040 18726 19469 16829 17299 18818 16970
8511A6970j387m390J955K901J381K492K363j616j072K596K137j588j491n168k085
$$ 16970 15583 11193 13148 16049 17430 19922 22285 20669 19597 22193 24330 22742 21251 16083 13998
8496A3998Q15M045P23k574j599K231K510l07n80k380P15r08M46J149p39R65M52
$$ 13998 14813 18858 19581 17007 15408 17639 20149 19842 19262 16882 17597 16689 17135 18284 17545 18510 18962
8479A8962j105J606j72J016k209l000n45K364K116J909o57l593L10j391k885J224
$$ 18962 17857 19463 19291 20307 18098 15098 14553 16917 19033 20942 20285 16692 17002 15611 12726 13950
8463A3950k94J775K510O686K594j004M19l059N27J639l709l038l414P26J740J653
$$ 13950 13656 15431 17941 24627 27221 26217 26636 23577 24104 25743 22034 18996 15582 16308 18048 19701
8447A9701K271N65O11k427j955N13J496j224m937j628J000j305L63Q02K989J448
$$ 19701 21972 22537 23148 20721 18766 19279 20775 19551 14614 12986 13986 12681 13044 13846 16835 18283
8431A8283q00p13r88j511j752l221K742l724k771L258K433L519j920m53j642l143
$$ 18283 17483 16770 15782 14271 12519 9298 12040 8316 5545 8803 11236 14755 12835 12382 10740 7597
8415G597J029n26l579k87J309L385p40m14J109K722L98j230K101j909j02L663
$$ 7597 8626 8100 4521 4234 5543 8928 8188 7774 8883 11605 12003 10773 12874 10965 10863 14526
8399A4526k211j384M257K187j661j268m006m349MR44K078r62K825J320k636m27
$$ 14526 12315 10931 15188 17375 15714 14446 10440 6091 6095 7039 9117 8155 10980 12300 9664 9237
8383I237M755N935j176p12j228m214o59R19K955K17k833m10K783k579j868j58
$$ 9237 13992 19927 18751 18039 16811 12597 11938 12857 15812 16029 13196 12786 15569 12990 11122 10964
8367A0964J695j284k544J893k19q13K958l89p20n92j893O81Q75k215J505K201
$$ 10964 12659 11375 8831 10724 10505 9692 12650 12261 11541 10949 9056 9737 10612 8397 9902 12103
8351A2103L267j967j785K773j950J865K717N16p09q81j085k913l863k798j715
$$ 12103 15370 13403 11618 14391 12441 14306 17023 17539 16830 15949 14864 11951 8088 5290 3575
8336C575K393j427P95M088L753P65k51n017j604r22P78k94K32p57K082K959J544
$$ 3575 5968 4541 5336 9424 13177 13942 13691 8674 7070 6148 6926 6632 6864 6107 8189 11148 12692
8319A2692j337n36k972j707K54K042L63j584J197k720R2J1k221Q20K636j221j5
$$ 12692 11355 10819 7847 6140 6394 8436 8799 7215 8412 5692 5784 5795 3574 4394 7030 5809 5794
8302E794j290J839M666L0j388q83j471M09K12J222Q24m170j006K04J928l728l040
$$ 5794 4504 6343 11009 11039 9651 8768 7297 7706 7918 9140 9964 5794 4788 4992 6920 3192 152
8285A52Q0J125P67j745R49k658p38K034J500P90k422k65M086K04M97N24K014J289
$$ 152 232 1357 2124 379 1328 -1330 -2068 -34 1466 2256 -166 -431 3655 3859 4356 4880 6894 8183
8267H183L49k540k199N33J252q01k04M850L240K014j725j415J548j520J894K31
$$ 8183 8532 5992 3793 4326 5578 4777 4573 9423 12663 14677 12952 11537 13085 11565 13459 13690
8251A3690j039N48P0k775j308j463P80k68k26m688p18k098L131M052L38r80r21
$$ 13690 12651 13199 13269 10494 9186 7723 8503 8235 8009 3321 2603 505 3636 7688 8026 7046 6125
8234F125k409L861n70R1K247K584N99K389k821p0l05j01J00M62J24m725p66K072
$$ 6125 3716 7577 7007 7098 9345 11929 12528 14917 12096 12026 11721 11620 11720 12182 12306 7581 6815 8887
8216H887O081P58k777J954l877k067M931l75N92j159m897l093J266O1q32j50N76
$$ 8887 14968 15726 12949 14903 11026 8959 13890 13515 14107 12948 8051 4958 6224 6285 5453 5303 5879
8199E879k179J81j921l0M403P869K775l365l116M81O72l45j332j028J390o03j467
$$ 5879 3700 3881 1960 1930 6333 14202 16977 13612 10496 10977 11649 11304 9972 8944 10334 9731 8264
8182H264j02j174k232k667O30K225j106n49r46K242M65J23P82m73m374K250J860
$$ 8264 8162 6988 4756 2089 2719 4944 3838 3289 2343 4585 5050 5173 5955 5482 1108 3358 5218
8165E218k467k950N75L57J910J475K092k73m1L001L059j66j177k232j888q14k518
$$ 5218 2751 -199 376 733 2643 4118 6210 5937 5896 8897 11956 11790 10613 8381 6493 5679 3161
8148C161K153L513J903n703n765K177K051L984R44J558J38l277j712l077P98N180
$$ 3161 5314 8827 10730 5027 -738 1439 3490 7474 8418 9976 10114 6837 5125 2048 2846 8026
8132H026K284L346k025p61K473K254j308j991j016K032k30j787L514j870l324
$$ 8026 10310 13656 11631 10870 13343 15597 14289 12298 11282 13314 13084 11297 14811 12941 9617
8117I617n042j751J915j748J067L453J135k267k34P66j098J424K69n668J998L368
$$ 9617 4575 2824 4739 2991 4058 7511 8646 6379 6145 6911 5813 7237 7506 1838 3836 7204
8101G204k514o57P68j500J315L253J230j206k943j5K679j886L035K440j266l061
$$ 7204 4690 4033 4801 3301 4616 7869 9099 7893 4950 4935 7614 5728 8763 11203 9937 6876
8085F876l7K698N23j210l152o34k1J01k451k210K643J259J798k673l05o49n94
$$ 6876 6839 9537 10060 8850 5698 5064 5043 5144 2693 483 3126 4385 6183 3510 3205 2556 1962
8068A962j430j964L5K057R69j280J563M62q36O315J109j093J409L72K97J9j355
$$ 1962 532 -1432 -1397 660 1629 349 1912 2374 1538 7853 8962 7869 9278 9650 9947 9966 8611
8051H611l730r72l85k054L564K535k028M60L39j832m655K785L547P67p32l686
$$ 8611 4881 3909 3524 1470 5034 7569 5541 6001 6340 4508 -147 2638 6185 6952 6220 2534
8035B534M228M634j002k274L98L007j802k852j037M426O95l764P70M177j201k920
$$ 2534 6762 11396 10394 8120 8518 11525 9723 6871 5834 10260 10955 7191 7961 12138 10937 8017
8019H017n356m60O09j550L56R30L379K010N05Q94J818Q88l85k075j698k358l392
$$ 8017 2661 2201 2810 1260 1616 2546 5925 7935 8440 9334 11152 12040 11655 9580 7882 5524 2132
8002B132j239l97R26J963K095j129J308j601J022O60j454j620j52K437K904L136
$$ 2132 893 496 1422 3385 5480 4351 5659 4058 5080 5740 4286 2666 2514 4951 7855 10991
7986A0991O16o768l168L123P924K247m261k741j079k76j292L0L818J793l561K919
$$ 10991 11607 4839 1671 4794 12718 14965 10704 7963 6884 6608 5316 5346 9164 10957 7396 10315
7970A0315n06m704o51M46K13J512Q09O01K974j602j683K943j508L28n72J82J806
$$ 10315 9809 5105 4454 4900 5113 6625 7434 8035 11009 9407 7724 10667 9159 9487 8915 9097 10903
7953A0903K192o65m57n45J458k036j834M82Kn55k337l38J200j919J491L02O939
$$ 10903 13095 12430 11973 11428 12886 10850 9016 9498 9500 8945 6608 6270 7470 5551 7042 7344 14283
7936A4283L08k61j992l042j438k80K180j210k410k748K745K099J453J282Q35l936
$$ 14283 14591 14330 12338 9296 7858 7578 9758 8548 6138 3390 6135 8234 9687 10969 11804 7868
7920G868l171j601o1J378K91k17J89L850k730l910m569N54J796M850M58q82J541
$$ 7868 4697 3096 3035 4413 4704 4487 4676 8526 5796 1886 -2683 -2129 -333 4517 4975 4093 5634
7903E634j423K134K907k017n580l503J859J332K333K454k287k457L14K848J376
$$ 5634 4211 6345 9252 7235 1655 -1848 11 1343 3676 6130 3843 1386 1700 4548 5924
7888E924l202j663J694j185o44L913O29m25j081k136K281J104m388k017K145L02
$$ 5924 2722 1059 2753 1568 924 4837 5466 5041 3960 1824 4105 5209 821 -1196 949 1251
7872A251r37k847L590L78J414J471k652k681l873p74K780k45k09K055K171J456
$$ 1251 314 -2533 1057 1435 2849 4320 1668 -1013 -4886 -5660 -2880 -3125 -3334 -1279 892 2348
7856B348K25k406j487J534j340j30J272O27q20r26j352J796L455R89l50J216O69
$$ 2348 2573 167 -1320 214 -1126 -1256 16 643 -177 -1103 -2455 -659 2796 3785 3435 4651 5320
7839E320O40k520l539J095m5J824n05j596J076K667K449j316j046k76o27L476
$$ 5320 5960 3440 -99 996 951 2775 2270 674 1750 4417 6866 5550 4504 4228 3601 7077
7823G077P93j405K33K776P38j158n288l303k41M238P01m61l98o62J762j010p96
$$ 7077 7870 6465 6698 9474 10212 9054 3766 463 222 4460 5161 4700 4302 3640 5402 4392 3596
7806C596M091k882l930K960o81k894N45O92k668k299N25k58N32j9J710M08L025
$$ 3596 7687 4805 875 3835 3154 260 805 1497 -1171 -3470 -2945 -3203 -2671 -2690 -980 -572 2453
7789B453J401j896rk230k58j571J640K59j559M59K671L001J015q50J326r53m462
$$ 2453 3854 1958 1949 -281 -539 -2110 -470 -211 -1770 -1311 1360 4361 5376 4526 5852 4899 437
7772D37k48n27M140K842j364J078p20m0k576m098j568J533N97L653L35j566j877
$$ 437 189 -338 3802 6644 5280 6358 5638 5598 3022 -1076 -2644 -1111 -514 3139 3474 1908 31
7755C1o52M137L749j178K35O29m414j209M25J219n79j101l363J936K798n46m69
$$ 31 -621 3516 7265 6087 6322 6951 2537 1328 1753 2972 2393 1292 -2071 -135 2663 2117 1648
7738A648j401m021o69L388K013J337j726M867L433k335j597q12j1j065l243j635
$$ 1648 247 -3774 -4443 -1055 958 2295 569 5436 8869 6534 4937 4125 4114 3049 -194 -1829
7722a829J665j51p42J59K963M751N55Kn64k912j239J462o55J592L189k869m257
$$ -1829 -164 -315 -1057 -898 2065 6816 7371 7373 6809 3897 2658 4120 3465 5057 8246 5377 1120
7705A120J683J365l924p63K479p70O36k603J70L046J129m866j476L74L592J035
$$ 1120 2803 4168 244 -519 1960 1190 1826 -777 -607 2439 3568 -1298 -2774 -2400 1192 2227
7689B227o5k370j081N91j04L073k366l407K19j234K773M306O4K378O12j969J574
$$ 2227 2162 -208 -1289 -698 -802 2271 -95 -3502 -3283 -4517 -1744 2562 2626 5004 5616 3647 5221
7672E221J513m647j842j463l953k6j254J251M578O77O84m31o9J655k2n94j580
$$ 5221 6734 2087 245 -1218 -5171 -5197 -6451 -5200 -622 55 739 308 239 1894 1872 1278 -302
7655c02p87K40J716K927j024k368k672j071L16K624K222l65j416J775K878q14
$$ -302 -1089 -849 867 3794 2770 402 -2270 -3341 -3025 -401 1821 1456 40 1815 4693 3879
7639C879k880M92J964K148k993j096K359j28p27L314j539l007m451P4J045K153
$$ 3879 999 1491 3455 5603 2610 1514 3873 3745 3018 6332 4793 1786 -2665 -2591 -1546 607
7623F07j037K279m88k304k385j369K267J014J547r65J909L132J015j236j192J580
$$ 607 -430 1849 1361 -943 -3328 -4697 -2430 -1416 131 -834 1075 4207 5222 3986 2794 4374
7607D374l479j661k081m50K558k66p73k60j67J968J200j586j067J887k493P19
$$ 4374 895 -766 -2847 -3297 -739 -1005 -1778 -2038 -2205 -237 963 -623 -1690 197 -2296 -1577
7591a577j433N31K415J85q71L886L262j122j764M07O02L01l059K156R44kN58r98
$$ -1577 -3010 -2479 -64 121 -750 3136 6398 5276 3512 3919 4521 4822 1763 3919 4863 4861 5419 4421
7573D421j493j324r85J21l42pJ108k097j886J011N091l65k698L016j945m382m536
$$ 4421 2928 1604 619 740 398 391 1499 -598 -2484 -1473 3618 3253 555 3571 1626 -2756 -7292
7556g292J595M600J72K776p4k940k217K135J420j061J956L076JK76j514J251J351
$$ -7292 -5697 -1097 -925 1851 1777 -1163 -3380 -1245 175 -886 1070 4146 4147 4423 2909 4160 5511
7539E511J455j251j841k904k562j587J284L846j270q25j316M70Q19L768L424j432
$$ 5511 6966 5715 3874 970 -1592 -3179 -1895 1951 681 -144 -1460 -990 -171 3597 7021 5589
7523E589l659k30l54K615N40l142o26k759j786P94J696J539Ol027J801P23P39
$$ 5589 1930 1700 1346 3961 4501 1359 733 -2026 -3812 -3018 -1322 217 223 -2804 -1003 -280 459
7506D59k772r23K60J575J689K253K106m273L86K417N22m741k028k404n72K955
$$ 459 -2313 -3236 -2976 -1401 288 2541 4647 374 760 3177 3699 -1042 -3070 -5474 -6046 -3091
7490c091K561J746K274j877j393j336r9Q70q59M43k471L47O32K8J528rj023P21
$$ -3091 -530 1216 3490 1613 220 -1116 -1215 -345 -1204 -761 -3232 -2885 -2253 -2225 -697 -706 -1729 -1008
7472a008r61K224L682K01j028Q72K70L022J176l414l773j020K040M023K947l316
$$ -1008 -1969 255 3937 4138 3110 3982 4252 7274 8450 5036 1263 243 2283 6306 9253 5937
7456E937m178k843K626k816p52L708P12n57M51j354j467l861K134K601J067l385
$$ 5937 1759 -1084 1542 -1274 -2026 1682 2394 1837 2288 934 -533 -4394 -2260 341 1408 -1977
7440a977m694J529M950K186P16k008R70L220j33K113n38j293m223n313J934K859
$$ -1977 -6671 -5142 -192 1994 2710 702 1672 4892 4759 6872 6334 5041 818 -4495 -2561 298
7424B98J226L718Q45J966j226j683k469K276j643j117k551l715J658J889k384
$$ 298 1524 5242 6087 8053 6827 5144 2675 4951 3308 2191 -360 -4075 -2417 -528 -2912
7409b912k370M47J945j766j478K528K600L026R09j602O29j298O77j371m44k830
$$ -2912 -5282 -4835 -2890 -4656 -6134 -3606 -1006 2020 2929 1327 1956 658 1335 -36 -480 -3310
7393c310j565J311L548P80M83K168L594K251k601l611l366m29k206J092N00o23
$$ -3310 -4875 -3564 -16 764 1247 3415 7009 9260 6659 3048 -318 -747 -2953 -1861 -1361 -1984
7377a984j642N27O52j9L46j595J444P52K973J429l058l465N0K684L529J051j486
$$ -1984 -3626 -3099 -2447 -2466 -2120 -3715 -2271 -1519 1454 2883 -175 -3640 -3590 -906 2623 3674 2188
7360B188P11J392j204N26J86r53j937J413K523J06n00J925J931j654n050l424
$$ 2188 2899 4291 3087 3613 3799 2846 909 2322 4845 4951 4451 6376 8307 6653 1603 -1821
7344a821o59q7j808J603K265j20o88J486K071j479N32k1N65l302l11L457K612
$$ -1821 -2480 -2567 -4375 -2772 -507 -627 -1315 171 2242 763 1295 1274 1839 -1463 -1774 1683 4295
7327D295j368r1k15q52Q62K652M90j699j208k33j958J649K768j330M96j836J73
$$ 4295 2927 2836 2621 1769 2631 5283 5773 4074 2866 2633 675 2324 5092 3762 4258 2422 2595
7310B595k90N86J556j594j545L79m70k583K982P47k451l808j523L151k20l55j302
$$ 2595 2305 2891 4447 2853 1308 1687 1217 -1366 1616 2363 -88 -3896 -5419 -2268 -2488 -2843 -4145
7293d145L817L003k776n140j183N125P46q90J400j699k633L007J028j87n07M5
$$ -4145 -328 2675 -101 -5241 -6424 -1299 -553 -1443 -43 -1742 -4375 -1368 -340 -527 -1034 -989
7277i89J64l672K444Q32J662j797K034K514k978J899J630j492j958p88j102J676
$$ -989 -825 -4497 -2053 -1221 441 -1356 678 3192 214 2113 3743 2251 293 -495 -1597 79
7261G9R42j64j405p51L669J148l561k478j083p2j144P85K113R88r61j081K234
$$ 79 1021 857 -548 -1299 2370 3518 -43 -2521 -3604 -3676 -4820 -4035 -1922 -934 -1895 -2976 -742
7244g42J147K341o18K89J848r91j180k437L077k45M97l510k504J737L2j488L853
$$ -742 405 2746 2128 2417 4265 3274 2094 -343 2734 2489 2986 -524 -3028 -1291 -1259 -2747 1106
7227A106L983r18j227J414j620l03k088j8j081j433J210J109O54j354k649O44
$$ 1106 5089 4171 2944 4358 2738 2435 347 329 -752 -2185 -975 134 788 -566 -3215 -2571
7211b571K738N476M156j10k814J641l110n385l493P41K830K029o42j349r46j498
$$ -2571 167 5643 9799 9689 6875 8516 5406 21 -3472 -2731 99 2128 1486 137 -809 -2307
7195b307M251K671j276j641j936J19k72M68k80J289J991J754j885m376j622n83
$$ -2307 1944 4615 3339 1698 -238 -119 -391 77 -203 1086 3077 4831 2946 -1430 -3052 -3635
7179c635J708M91j031l246K761M571K468j732J188O47J943L252n247j367p43j31
$$ -3635 -1927 -1436 -2467 -5713 -2952 1619 4087 2355 3543 4190 6133 9385 4138 2771 2028 1897
7163A897k742j037L039k36j211M92K127J418k20K49o06l120k344J158K784J949
$$ 1897 -845 -1882 1157 921 -290 202 2329 3747 3527 3776 3170 50 -2294 -1136 1648 3597
7147C597P41O57m40k936o21J108K950k893O50Q99q28k862L795j411J30K521j392
$$ 3597 4338 4995 4555 1619 998 2106 5056 2163 2813 3712 2884 22 3817 2406 2536 5057 3665
7130C665j51k764m855q02K233j964j478J476k169n53M015L501k089j357l18J761
$$ 3665 3514 750 -4105 -4907 -2674 -4638 -6116 -4640 -6809 -7362 -3347 154 -1935 -3292 -3610 -1849
7114a849n13k51M75J70p47O7N61M08o48k691n12J002m3K831J166n136K0K440K09
$$ -1849 -2362 -2613 -2138 -1968 -2715 -2648 -2087 -1679 -2327 -5018 -5530 -4528 -4571 -1740 -574 -5710 -5690 -3250 -3041
7095c041L18L814J058j241k479O07K022L863j848j874k535k794j77M486O774P5
$$ -3041 -2723 1091 2149 908 -1571 -964 1058 4921 3073 1199 -1336 -4130 -4307 179 6953 7028
7079G028m525j910j84l20K44j197O74j340J601J748j416o20l944K960L077R54
$$ 7028 2503 593 409 89 333 -864 -190 -1530 71 1819 403 -217 -4161 -1201 1876 2830
7063B830k491l715N05K870q96K59J175k469p12J393J901r17L177J048J706l426
$$ 2830 339 -3376 -2871 -1 -897 -638 537 -1932 -2644 -1251 650 -267 2910 3958 5664 2238
7047B238k365P34m049L96J76j67J578J822p83J720M241K12j873l811OJ014k209
$$ 2238 -127 607 -3442 -3046 -2870 -3037 -1459 363 -420 1300 5541 5753 3880 69 75 1089 -1120
7030a120j970J805M017m252l865n81L793L994j441k174j833m26J976k71j007o94
$$ -1120 -3090 -1285 2732 -1520 -5385 -5966 -2173 1821 380 -1794 -3627 -4053 -2077 -2348 -3355 -4049
7014d049K155L9j755J724n61k932j952J456k469j362L256J588j073L13L929J197
$$ -4049 -1894 -1855 -3610 -1886 -2447 -5379 -7331 -5875 -8344 -9706 -6450 -4862 -5935 -5622 -1693 -496
6998d96L999J317j524k418O56j858N3K001J010k024k35J600o55l089k562J639
$$ -496 3503 4820 3296 878 1534 -324 -271 1730 2740 716 481 2081 1426 -1663 -4225 -2586
6982b586M374K9r32J464p9N73k96j335j51l48k374k07R13J733o7m300j182L553
$$ -2586 1788 1817 885 2349 2270 2843 2547 1212 1061 713 -1661 -1868 -955 778 711 -3589 -4771 -1218
6964a218r89J017K800K474l380j354j423p36k765J348Q76L134R95J557l862l236
$$ -1218 -2207 -1190 1610 4084 704 -650 -2073 -2809 -5574 -4226 -3350 -216 779 2336 -1526 -4762
6948d762J590R48K919M04n18j767J20K048L47j591q23o35K352L217l54o0k386
$$ -4762 -3172 -2224 695 1099 581 -1186 -1066 982 1329 -262 -1085 -1720 632 3849 3495 3435 1049
6931A049n0j484J175K23K530J746P84r04m383N70J455m35k220j429k326j774K923
$$ 1049 999 -485 690 913 3443 5189 5973 5069 686 1256 2711 2276 56 -1373 -3699 -5473 -2550
6914b550j562l43m74k87J023K428R53J301J269k531o42K192K323L866K081n80
$$ -2550 -4112 -4455 -4929 -5216 -4193 -1765 -812 489 1758 -773 -1415 777 3100 6966 9047 8467
6898H467l965L73n23Q41k822n150J948J615l114o97l58L172m23n134K371J394
$$ 8467 4502 4875 4352 5193 2371 -2779 -831 784 -2330 -3027 -3385 -213 -636 -5770 -3399 -2005
6882b005J456j204P29J248j23M50p19j516j645l031j025M875M70j943K07J695
$$ -2005 -549 -1753 -1024 224 101 551 -168 -1684 -3329 -6360 -7385 -2510 -2040 -3983 -3776 -2081
6866b081K446J208j103l923j10J10r80L124n30k264j695RJ785L073o59K627K632
$$ -2081 365 1573 470 -3453 -3563 -3453 -4433 -1309 -1839 -4103 -5798 -5789 -4004 -931 -1590 1037 3669
6849C669m117k051J931K93K397k25J289l132k870M988q11K60J832O99k416j595
$$ 3669 -448 -2499 -568 -275 2122 1897 3186 54 -2816 2172 1361 1621 3453 4152 1736 141
6833A41M934O22r13l835j377M866k132j402j38K143K610j167r21J329k825M1j486
$$ 141 5075 5697 4784 949 -428 4438 2306 904 766 2909 5519 4352 3431 4760 1935 1976 490
6816D90l82P3J600j715j019k096N45L640J713k454j941k016Q30K582K407j186
$$ 490 108 181 1781 66 -953 -3049 -2504 1136 2849 395 -1546 -3562 -2732 -150 2257 1071
6800A071n438l154J768L641L696J207M49m168m819J856K110J364r00k104k750
$$ 1071 -4367 -7521 -5753 -2112 1584 2791 3240 -928 -5747 -3891 -1781 -417 -1317 -3421 -6171
6785f171K276L155M139o11l58J474q29r94M68j915k496J196R31J166j340O16K493
$$ -6171 -3895 -740 3399 2788 2430 3904 3075 2081 2549 634 -1862 -666 265 1431 91 707 3200
6768C200J746K498K359J618k215o47k735j915J016j234J858q76l785j548L524
$$ 3200 4946 7444 9803 11421 9206 8559 5824 3909 4925 3691 5549 4673 888 -660 2864
6753B864K455j708L72J944r50j049l230NJ185k738J726Q85k729r10J140J329o19
$$ 2864 5319 3611 3983 5927 4977 3928 698 703 1888 -850 876 1761 -968 -1878 -738 591 -28
6736b8K275L782J200j146k696k974k517j455K264o51p39j96J146L264n47L41L78
$$ -28 2247 6029 7229 6083 3387 413 -2104 -3559 -1295 -1946 -2685 -2881 -1735 1529 982 1323 1701
6719A701K382n94l773j644k229K06M272L233J027o79j616j269K885J556o08O07
$$ 1701 4083 3489 -284 -1928 -4157 -3951 321 3554 4581 3902 2286 1017 3902 5458 4850 5457
6703E457l307l657O22P46Rr23L282K912j921j665P8k429r88K030K327J869r98
$$ 5457 2150 -1507 -885 -139 -130 -1053 2229 5141 3220 1555 1633 -796 -1784 246 2573 4442 3444
6686C444K41k727j134N13p15j118j279J580J454L28j52k28J360k275J113l99k152
$$ 3444 3685 958 -176 337 -378 -1496 -2775 -1195 259 587 435 207 1567 -708 405 6 -2146
6669b146L13O24J605L48k13j506m568K771L260j042j605K674L619n11l815O57
$$ -2146 -1833 -1209 396 744 531 -975 -5543 -2772 488 -554 -2159 515 4134 3623 -192 465
6653D65k39k640j526J574M079O81j2j804j053O4j271j060J176R15n15O82j145
$$ 465 226 -2414 -3940 -2366 1713 2394 2382 578 -475 -411 -1682 -2742 -1566 -651 -1166 -484 -1629
6636a629k235K175k78Q99L638J668j759P1j264k533j77N34Q4N58K467N591n34
$$ -1629 -3864 -1689 -1967 -1068 2570 4238 2479 2550 1286 -1247 -1424 -890 -806 -248 2219 7810 7276
6619G276l865m253j935J162K188J533P6P02R80K283M46n319k129L044n41j91j812
$$ 7276 3411 -842 -2777 -1615 573 2106 2182 2884 3864 6147 6593 1274 -855 2189 1648 1457 -355
6602c55J456k203j878L1k177l195K392K017L83K092N41M36j995k108J299L064
$$ -355 1101 -1102 -2980 -2949 -5126 -8321 -5929 -3912 -3529 -1437 -896 -460 -2455 -4563 -3264 -200
6586b00J595J131j379l734m170j567R10J036L322K621p65K858J21o21p82k570
$$ -200 1395 2526 1147 -2587 -6757 -8324 -7414 -6378 -3056 -435 -1200 1658 1779 1158 376 -2194
6570b194k180L38O92r96q81J060q22L88O58J28mJ295j134L949K15J174K052k901
$$ -2194 -4374 -4036 -3344 -4340 -5221 -4161 -4983 -4595 -3937 -3809 -3813 -2518 -3652 297 512 1686 3738 837
6552H37R26J456J305P47k362k071K437L907j457K11k816l854j364K42R28r38J36
$$ 837 1763 3219 4524 5271 2909 838 3275 7182 5725 5936 3120 -734 -2098 -1856 -928 -1866 -1730
6535a730J410N58j143Q49J751l0R49K827l246n00K502P4J238J447o40k127k143
$$ -1730 -320 238 -905 -56 1695 1665 2614 5441 2195 1695 4197 4271 5509 6956 6316 4189 2046
6518B046l383l04P69j465j273o84j615K885K021Q62l679k93p28L155q1q19J707
$$ 2046 -1337 -1641 -872 -2337 -3610 -4294 -5909 -3024 -1003 -141 -3820 -4113 -4841 -1686 -1767 -2586 -879
6501h79l273k548J941L500L6k185k4L120K584Q52j827l820j359j194n86J984p6
$$ -879 -4152 -6700 -4759 -1259 -1223 -3408 -3432 -312 2272 3124 1297 -2523 -3882 -5076 -5662 -3678 -3754
6484c754J759M70K376p9M27Q08j028k857k342M54j06r61M936L291j188q33K271
$$ -3754 -1995 -1525 851 772 1199 2007 979 -1878 -4220 -3766 -3872 -4833 103 3394 2206 1373 3644
6467C644k385j503Q35L921N91Q45J031j090p60l324p18J307M35r35R1j446J845
$$ 3644 1259 -244 591 4512 5103 5948 6979 5889 5129 1805 1087 2394 2829 1894 1985 539 2384
6450B384M70J706K414L229k143n766p128K377R14J093j247K226J925P31l047L50
$$ 2384 2854 4560 6974 10203 8060 2294 -4834 -2457 -1543 -450 -1697 529 2454 3185 138 488
6434D88l769k601M864J888n230j370P70J080K705m31j95L037J582M213j366k888
$$ 488 -3281 -5882 -1018 870 -4360 -5730 -4960 -3880 -1175 -1606 -1801 1236 2818 7031 5665 2777
6418B777R39J741J452k001l792k40N34J052j918j602J468J229J129R00J579J759
$$ 2777 3716 5457 6909 4908 1116 876 1410 2462 544 -1058 410 1639 2768 3668 5247 7006
6402G006l75k987q60j404K029k107k61q08j173j104j665j334J29L223L652K77
$$ 7006 6631 3644 2784 1380 3409 1302 1041 233 -940 -2044 -3709 -5043 -4914 -1691 1961 2238
6386B238j195j081J593j250j257j206j75l854R48l103k94N013J100k396l327J808
$$ 2238 1043 -38 1555 305 -952 -2158 -2333 -6187 -5239 -8342 -8636 -3623 -2523 -4919 -8246 -6438
6370f438Q77P55L685J927r84j357M12q07R36J898J013p63j495nr05J708P71k839
$$ -6438 -5561 -4806 -1121 806 -178 -1535 -1123 -1930 -994 904 1917 1154 -341 -346 -1251 457 1228 -1611
6352a611J305J979p06o82r98r03j44m7j077J630J251K426r64J461R72R2l950r75
$$ -1611 -306 1673 967 285 -713 -1616 -1760 -1807 -2884 -1254 -3 2423 1459 2920 3892 3984 34 -941
6334i41P04L258J857k162l705K29o21k347j53O34K341J316q74j796L52kJ295M200
$$ -941 -237 3021 4878 2716 -989 -760 -1381 -3728 -3881 -3247 -906 410 -464 -2260 -1908 -1910 -615 3585
6316C585J191n47p548k829M695J037O56J011J567J10j396J64Q36j309j254k165
$$ 3585 4776 4229 -3319 -6148 -1453 -416 240 1251 2818 2928 1532 1696 2532 1223 -31 -2196
6300b196j35j303K823J96j326P6J810L907K472r73j393j514k705O34R51Q74k275
$$ -2196 -2331 -3634 -811 -615 -1941 -1865 -55 3852 6324 5351 3958 2444 -261 373 1324 2198 -77
6283g7m653p72L163R36J361k32M74n64P62J627j446l833k975J795L340j812O15
$$ -77 -4730 -5502 -2339 -1403 -42 -274 200 -364 398 2025 579 -3254 -6229 -4434 -1094 -2906 -2291
6266b291J191q36j647M095L254L53l865m503j913J074M877K992l60k95k222j632
$$ -2291 -1100 -1936 -3583 512 3766 4119 254 -4249 -6162 -5088 -211 2781 2421 2126 -96 -1728
6250a728P88j307K493J6j841p3j423K62n04J40K403M929j086q02q64J611k968
$$ -1728 -940 -2247 246 262 -1579 -1652 -3075 -2813 -3317 -3177 -774 4155 3069 2267 1403 3014 46
6233D6j876R32j929l05j512J885O08J369m19L472K694k371j287K98J201k81L157
$$ 46 -1830 -898 -2827 -3132 -4644 -2759 -2151 -782 -1201 2271 4965 2594 1307 1605 2806 2525 5682
6216E682k198m250J147J326K333j331R76J216l540k871j722K222k74L165J003
$$ 5682 3484 -766 381 1707 4040 2709 3685 4901 1361 -1510 -3232 -1010 -1284 1881 2884
6201B884K478K080l057n726l650j20p33j466J399J183P51K890p60m300Q8K869
$$ 2884 5362 7442 4385 -1341 -4991 -5111 -5844 -7310 -5911 -4728 -3977 -1087 -1847 -6147 -6059 -3190
6185c190L696K968n2j664l054j837m456N986L842K973M230k414m803r42O76k268
$$ -3190 506 3474 3422 1758 -1296 -3133 -7589 -1603 2239 5212 9442 7028 2225 1283 1959 -309
6169c09O58j789K888O589R26k593m814k000P61j558m55L025n88m22J28j118J226
$$ -309 349 -1440 1448 8037 8963 6370 1556 -444 317 -1241 -1696 1329 741 319 447 -671 555
6152E55k484l168j826L065K618K193j553q72Q72j745j109M036J097L60K587r75
$$ 555 -1929 -5097 -6923 -3858 -1240 953 -600 -1472 -600 -2345 -3454 582 1679 2039 4626 3651
6136C651k119K660M910j449m809m789o53K234K834k959o52j025j633L459p6L786
$$ 3651 1532 4192 9102 7653 2844 -1945 -2598 -364 2470 -489 -1141 -2166 -3799 -340 -416 3370
6120C370L347j637j20j778l808j079P57L4O38j504j514lQ06R51j922k998J333
$$ 3370 6717 5080 4960 3182 -626 -1705 -948 -914 -276 -1780 -3294 -3297 -2491 -1540 -3462 -6460 -5127
6103e127L660J996J063k444Q70K774M98J323K062n08j139j869k667Q18k057k309
$$ -5127 -1467 529 1592 -852 18 2792 3290 4613 6675 6167 5028 3159 492 1310 -747 -3056
6087c056j709K870L309J24J952k12j309q32l913Q11K910K129J235j546J350j612
$$ -3056 -4765 -1895 1414 1538 3490 3278 1969 1137 -2776 -1965 945 3074 4309 2763 4113 2501
6071B501p80L531q63r25n25l339o208L399O311J802m970k574j580j632r7j353
$$ 2501 1721 5252 4389 3464 2939 -400 -6608 -3209 3102 4904 -66 -2640 -4220 -5852 -5949 -7302
6055g302N217Q14J63J954K446j754j74j35k373n19J624j183k450J188P51K951
$$ -7302 -2085 -1271 -1108 846 3292 1538 1364 1229 -1144 -1663 -39 -1222 -3672 -2484 -1733 1218
6039A218M66n49K583k007k552l238J9J697k082m299j75M760M119m99j103k044
$$ 1218 1684 1135 3718 1711 -841 -4079 -4060 -2363 -4445 -8744 -8919 -4159 -40 -539 -1642 -3686
6023c686l80N06j810J735L554J63m84q86O75j49L754M39L597r56m255l175P02
$$ -3686 -4066 -3560 -5370 -3635 -81 82 -402 -1288 -613 -762 2992 3431 7028 6072 1817 -1358 -656
6006f56J204q55j326m05j755J791j99k073K932K298k272o69j406j311J59J994
$$ -656 548 -307 -1633 -2038 -3793 -2002 -2201 -4274 -1342 956 -1316 -1985 -3391 -4702 -4543 -2549
5990b549K129J032k600J342k154m42K816K570J975k797k590j484M21M99P77j769
$$ -2549 -420 612 -1988 -646 -2800 -3242 -426 2144 4119 1322 -1268 -2752 -2331 -1832 -1055 -2824
5974b824o62j37L09J183M70j110J349K365k606p28J386P78o97o39J699q26k959
$$ -2824 -3486 -3623 -3314 -2131 -1661 -2771 -1422 943 -1663 -2391 -1005 -227 -924 -1563 136 -690 -3649
5957c649n08l247p66J095N130J836j399J724O00J751j580p7J115j208O31j016
$$ -3649 -4157 -7404 -8170 -7075 -1945 -109 -1508 216 816 2567 987 910 2025 817 1448 432
5941D32q10Q19j431m093m95K197J547j53J143K776j184j770l98P94j499q09J385
$$ 432 -378 441 -990 -5083 -5578 -3381 -1834 -1987 -844 1932 748 -1022 -1420 -626 -2125 -2934 -1549
5924a549N63J068M79J834Q80l122j482L052J791k583j760K737K948K387m081m163
$$ -1549 -986 82 561 2395 3275 153 -1329 1723 3514 931 -829 1908 4856 7243 3162 -1001
5908a001l281P29J669o24K085j325j336O003L084j555n023m443l534K290L775
$$ -1001 -4282 -3553 -1884 -2508 -423 -1748 -3084 2919 6003 4448 -575 -5018 -8552 -6262 -2487
5893b487M115N30k823k898l78k033j168k29N022N678K810r43l337j160L314j613
$$ -2487 1628 2158 -665 -3563 -3941 -5974 -7142 -7371 -2349 3329 6139 5196 1859 699 4013 2400
5877B400k471K957K507j945j339k42k949k209q79j32k31j701J944J141J510M232
$$ 2400 -71 2886 5393 3448 2109 1867 -1082 -3291 -4170 -4302 -4533 -6234 -4290 -3149 -1639 2593
5861B593J79J693j214j426j601p62p0n828k455M996L255m42j208k303j942K71
$$ 2593 2772 4465 3251 1825 224 -538 -608 -6436 -8891 -3895 -640 -1082 -2290 -4593 -6535 -6264
5845f264K986j661M21L996J275n10j038Q31M896m56k691m24k039K011Q84k245
$$ -6264 -3278 -4939 -4518 -522 753 243 -795 36 4932 4476 1785 1361 -678 1333 2217 -28
5829b8L140j254m196o99J744M800J176r85j502k549J173M33K038p00o0k448N53
$$ -28 3112 1858 -2338 -3037 -1293 3507 4683 3698 2196 -353 820 1253 3291 2591 2531 83 636
5812F36L164l129l960n98l76J845L619rj815Q66J550L375L569j870n248j050K533
$$ 636 3800 671 -3289 -3887 -4263 -2418 1201 1192 -623 243 1793 5168 8737 6867 1619 569 3102
5795C102N263M57j218k241l041J048J715j665p01J282l623r85N20k95j471n81
$$ 3102 8365 8822 7604 5363 2322 3370 5085 3420 2719 4001 378 -607 -87 -382 -1853 -2434
5779b434K213j95j262L598K015j824n38K075Q14k912m601l451J883M481L338k928
$$ -2434 -221 -416 -1678 1920 3935 2111 1573 3648 4462 1550 -3051 -6502 -4619 -138 3200 272
5763B72m033J246O837J658l805p949r48J472J004K595L196j118k125K414J469
$$ 272 -3761 -2515 4322 5980 2175 -5774 -6722 -5250 -4246 -1651 1545 427 -1698 716 2185
5748B185k50K258l99j31k971j361k706m14J29K56j190M12pK022M34n02K900J50
$$ 2185 1935 4193 3794 3663 692 -669 -3375 -3789 -3660 -3404 -4594 -4182 -4189 -2167 -1733 -2235 665 815
5730H15k552k986K824M154N193j067q08J644j139j697P56j216o54J550k815k177
$$ 815 -1737 -4723 -1899 2255 7448 6381 5573 7217 6078 4381 5137 3921 3267 4817 2002 -175
5714a75J481j096j692J806n19j940L6K43O84l07n902j935P85L648M157K301K823
$$ -175 1306 210 -1482 324 -195 -2135 -2099 -1856 -1172 -1479 -7381 -9316 -8531 -4883 -726 1575 4398
5697D398J020l601k108n92J274M55k574j854L48j662p93J675O27N595j318k202
$$ 4398 5418 1817 -291 -883 391 846 -1728 -3582 -3234 -4896 -5689 -4014 -3387 2208 890 -1312
5681a312l23J42j373N52K44j522J459K662m03q24K004L830j238p59J550k713J683
$$ -1312 -1635 -1493 -2866 -2314 -2070 -3592 -2133 529 126 -698 1306 5136 3898 3139 4689 1976 3659
5664C659k510k797N19L700k109k837L107M20J41O31n323n091l619L061o33K156
$$ 3659 1149 -1648 -1129 2571 462 -2375 732 1152 1293 1924 -3399 -8490 -12109 -9048 -9681 -7525
5648g525j187L058K954J553J46j582J218L843l276K74L314J351K81m626j629R51
$$ -7525 -8712 -5654 -2700 -1147 -1001 -2583 -1365 2478 -798 -524 2790 4141 4422 -204 -1833 -882
5632h82J460R80k701k606j122j249m42l95K204J819J510L48K184K237p45l422
$$ -882 578 1558 -1143 -3749 -4871 -6120 -6562 -6957 -4753 -2934 -1424 -1076 1108 3345 2600 -822
5616h22q92k170l542K353M036J615L834J31l615n045k05J099N28M635L591q59
$$ -822 -1714 -3884 -7426 -5073 -1037 578 4412 4543 928 -4117 -4322 -3223 -2695 1940 5531 4672
5600D672j374O03k653m092m35l76L704J726l022j107J940J587L61k582Q11K443
$$ 4672 3298 3901 1248 -2844 -3279 -3655 49 1775 -1247 -2354 -414 1173 1534 -1048 -237 2206
5584B206K41k695J808L84K003p82j263l64j394m54j098j567N74O03M026J929l528
$$ 2206 2447 -248 1560 1944 3947 3165 1902 1538 144 -310 -1408 -2975 -2401 -1798 2228 4157 629
5567F29j138l94L772K54q89k890k36L104K661j58r44q24k439j181k131q55n77
$$ 629 -509 -903 2869 3123 2234 -656 -892 2212 4873 4715 3771 2947 508 -673 -2804 -3659 -4236
5550d236L770o56K613L422j955l260J696O10j171j695k502K49K768r76%k259L532
$$ -4236 -466 -1122 1491 4913 2958 -302 1394 2004 833 -862 -3364 -3115 -347 -1323 -1323 -3582 -50
5533e0L499J556l762m799K697L244J4k851k34K146n76q19J783O39l933j497K076
$$ -50 3449 5005 1243 -3556 -859 2385 2399 -452 -686 1460 884 65 1848 2487 -1446 -2943 -867
5516h67m86k602J017L418q94m5J486M732j84p884k453LL28L342K864k0r47o298
$$ -867 -1353 -3955 -2938 480 -414 -459 1027 5759 5575 -2309 -4762 -4759 -4431 -1089 1775 1755 808 -5490
5498e490j754J095K97J062K728k58l590j369K879K896N43k50J831j363k463k732
$$ -5490 -7244 -6149 -5852 -4790 -2062 -2320 -5910 -7279 -4400 -1504 -961 -1211 620 -743 -3206 -5938
5482e938q0L324J991l88j282L445K402l06M56p26p21r96j084M578j740n698J161
$$ -5938 -6018 -2694 -703 -1091 -2373 1072 3474 3168 3624 2898 2177 1181 97 4675 2935 -2763 -1602
5465a602M566K382k911P51k223j419M580l89k914L46j215p47j104q88q06K565
$$ -1602 2964 5346 2435 3186 963 -456 4124 3735 821 1167 -48 -795 -1899 -2787 -3593 -1028
5449a028q0o73P85k083N78K011K210J382K3j876l84n30L11J88l88n97j860j07
$$ -1028 -1108 -1781 -996 -3079 -2501 -490 1720 3102 3125 1249 865 335 646 834 446 -151 -2011 -2118
5431b118R8K504J00n345K889q56k900r34J088L944j379K097K151j767O91j186
$$ -2118 -2020 484 584 -4761 -1872 -2728 -5628 -6562 -5474 -1530 -2909 -812 1339 -428 263 -923
5415i23P16N777K33n510P44K246m037p4Q93r94P04K506J195j370k423k029j481
$$ -923 -207 5570 5803 293 1037 3283 -754 -828 65 -929 -225 2281 3476 2106 -317 -2346 -3827
5398c827j67J785l925m056J801M996O063L269j574l363R06j648p83k24L915o22
$$ -3827 -3994 -2209 -6134 -10190 -8389 -3393 2670 5939 4365 1002 1908 260 -523 -747 3168 2546
5382B546k580k396J935K54m622r69Q83N233M435j258l697j010j617n94k217J794
$$ 2546 -34 -2430 -495 -241 -4863 -5832 -4949 284 4719 3461 -236 -1246 -2863 -3457 -5674 -3880
5366c880K730j362K549L973j596l606J316K856r1j205j670o72K232L18o07j487
$$ -3880 -1150 -2512 37 4010 2414 -1192 124 2980 2889 1684 14 -658 1574 1892 1285 -202
5350b02K025J604o389p07j211l536L266M764K594j95J097l3j078q6j543Q49J910
$$ -202 1823 3427 -2962 -3669 -4880 -8416 -5150 -386 2208 2013 3110 3077 1999 1913 370 1219 3129
5333C129K193J076k655k181q51l792J4L605K449l915m787J887k725K128J399M64
$$ 3129 5322 6398 3743 1562 711 -3081 -3067 538 2987 -928 -5715 -3828 -6553 -4425 -3026 -2562
5317b562M82J736J729j810k696N32j194n54k66P35M156p33l287r07J969j226p85
$$ -2562 -2080 -344 1385 -425 -3121 -2589 -3783 -4337 -4603 -3868 288 -445 -3732 -4639 -2670 -3896 -4681
5300d681R62m1K414J673j465j061L573j402j143K078J895l512k287k42j26m9J503
$$ -4681 -3719 -3760 -1346 327 -1138 -2199 1374 -28 -1171 907 2802 -710 -2997 -3239 -3365 -3414 -1911
5283a911r23k83L143Q85m023j34K078r3J807n90j405k417J02J581K869J36J21
$$ -1911 -2834 -3117 26 911 -3112 -3246 -1168 -1261 546 -44 -1449 -3866 -3764 -2183 686 822 943
5266I43j911k815j110K949M062J096r37m595k08M442j817j919M04r27q46O36Q8
$$ 943 -968 -3783 -4893 -1944 2118 3214 2277 -2318 -2526 1916 99 -1820 -1416 -2343 -3189 -2553 -2465
5249b465M081K336k132k456J732K893K63L1j480k337j820K321O29m02J071p99
$$ -2465 1616 3952 1820 -636 1096 3989 4252 4283 2803 466 -1354 967 1596 1194 2265 1466
5233A466j603k113R17n21j608j530k474O66J699QJ338m422L96R38l047O81K993
$$ 1466 -137 -2250 -1333 -1854 -3462 -4992 -7466 -6800 -5101 -5093 -3755 -8177 -7781 -6843 -9890 -9209 -6216
5216f216j144N021M117j131l62p39L24l658n31K629j058K838J573m290J890K182
$$ -6216 -7360 -2339 1778 647 285 -454 -130 -3788 -4319 -1690 -2748 90 1663 -2627 -737 1445
5200A445n23o02r34J993O88m33o54l25j598n978M289N13o90K984L013N41J250
$$ 1445 922 320 -614 1379 2067 1634 980 655 -943 -6921 -2632 -2119 -2809 175 3188 3729 4979
5183D979j757j970j502j124K640j017k960k28J096L687o1K098l144m014P01L904
$$ 4979 3222 1252 -250 -1374 1266 249 -2711 -2939 -1843 1844 1783 3881 737 -3277 -2576 1328
5167A328N57p21K04o15Q83j668l429n277J778O149k44m83M22j094Q87j729J261
$$ 1328 1885 1164 1368 753 1636 -32 -3461 -8738 -6960 -811 -1055 -1538 -1116 -2210 -1323 -3052 -1791
5150a791L071J316l991j481P79K481l623L46k718j428k58K527o1Q65j333P92O0
$$ -1791 1280 2596 -1395 -2876 -2097 384 -3239 -2893 -5611 -7039 -7297 -4770 -4831 -3966 -5299 -4507 -4447
5133d447k891R81L184L210p00l218NK793n1L70m65m72l483l102M965N148J24m218
$$ -4447 -7338 -6357 -3173 37 -663 -3881 -3876 -1083 -1134 -764 -1229 -1701 -5184 -8286 -3321 1827 1951 -2267
5115b267Q4j40Q33J608R79L53L06j552l905L97N037J347j299m507j88j404j503
$$ -2267 -2183 -2323 -1490 118 1097 1450 1756 204 -3701 -3304 1733 3080 1781 -2726 -2914 -4318 -5821
5098e821j89K611M078J745j136q92K351l3l153J753K887j309m645l097J87K052
$$ -5821 -6010 -3399 679 2424 1288 396 2747 2714 -439 1314 4201 2892 -1753 -4850 -4663 -2611
5082b611k27L212K233j666L659L138l482m211J00K256r47k485N28L71L10j065
$$ -2611 -2838 374 2607 941 4600 7738 4256 45 145 2401 1454 -1031 -503 -132 178 -887
5066h87k037l77j29k409j591K618N021K717P44k777j469j33J262N65M2k690j888
$$ -887 -2924 -3301 -3430 -5839 -7430 -4812 209 2926 3670 893 -576 -709 553 1118 1160 -1530 -3418
5049c418J046K577M42K5p14q99N42j120M74l590k364k429k6O7L021K532K460L656
$$ -3418 -2372 205 647 672 -42 -941 -399 -1519 -1045 -4635 -6999 -9428 -9454 -9387 -6366 -3834 -1374 2282
5031B282q35l16L203O2j426l243l430J319j232J480J076P83p83L00j877K871M871
$$ 2282 1447 1131 4334 4396 2970 -273 -3703 -2384 -3616 -2136 -1060 -277 -1060 -760 -2637 234 5105
5014E105Q75r80Q12l257J346N81m594l761J982K917J013J398m76J146J306Q73
$$ 5105 5980 5000 5812 2555 3901 4482 -112 -3873 -1891 1026 2039 3437 2961 4107 5413 6286
4998F286m74K339l034k482j103k515o01j843K621q0R03j527m05O93Q17O05R51
$$ 6286 5812 8151 5117 2635 1532 -983 -1584 -3427 -806 -886 17 -1510 -1915 -1222 -405 200 1151
4981A151p09O92R94l01n158k764J236K836L306R66O29J322o5j570R91q11k778
$$ 1151 442 1134 2128 1827 -3331 -6095 -4859 -2023 1283 2249 2878 4200 4135 2565 3556 2745 -33
4964c3k564K132L67K62j967n60k585k522K638K567r35P59J856J250k259k123j04
$$ -33 -2597 -465 -98 164 -1803 -2363 -4948 -7470 -4832 -2265 -3200 -2441 -585 665 -1594 -3717 -3821
4947c821K341K874L2m06m225j290M482L517Q76k762n640m65K565L167k35Q33M56
$$ -3821 -1480 1394 1426 1020 -3205 -4495 -13 3504 4380 1618 -4022 -4487 -1922 1245 1010 1843 2299
4930B299k526r62j009K047J658q02j286L062o84p54l580n108m02L809L503L092
$$ 2299 -227 -1189 -2198 -151 1507 705 -581 2481 1797 1043 -2537 -7645 -8047 -4238 -735 2357
4914B357J920p54l655r49N77M5l068L29L067J315k061j20k781q56M042J929P54
$$ 2357 4277 3523 -132 -1081 -504 -459 -3527 -3198 -131 1184 -877 -997 -3778 -4634 -592 1337 2091
4897B091Q30j465M34k812l41j98R19J119k310J275L413j255o48j761l491r04J857
$$ 2091 2921 1456 1890 -922 -1263 -1461 -542 577 -1733 -458 2955 1700 1052 -709 -4200 -5104 -3247
4880c247L822L562J09k267l913Q98K020J588k984J06P08j56n179K352K440J358
$$ -3247 575 4137 4246 1979 -1934 -1036 984 2572 -412 -306 402 246 -4933 -2581 -141 1217
4864A217K564p17m047k605j634R59p13K512K876k294j353K047R87L80m94j978
$$ 1217 3781 3064 -983 -3588 -5222 -4263 -4976 -2464 412 -1882 -3235 -1188 -201 179 -315 -2293
4848b293j17K181m61k091j015K185P51k788K347J293k07m1O17j036J455J952j512
$$ -2293 -2410 -229 -690 -2781 -3796 -1611 -860 -3648 -1301 -8 -215 -256 361 -675 780 2732 1220
4831A220r97l31j337J958l50L6J19p07J833K917O73j745J653N05j442P23k499
$$ 1220 223 -108 -1445 513 163 199 318 -389 1444 4361 5034 3289 4942 5447 4005 4728 2229
4814B229j391l739L37P91J18Q36Q56k655L07K721J409Q31Q21k756o02J956k537
$$ 2229 838 -2901 -2564 -1773 -1655 -819 37 -2618 -2311 410 1819 2650 3471 715 113 2069 -468
4797d68k047L80L307J2P24J719m79j666j225j481O12J884P43r75K00J286J633
$$ -468 -2515 -2135 1172 1184 1908 3627 3148 1482 257 -1224 -612 1272 2015 1040 1240 2526 4159
4780D159R57n590j765L92o85J216j99Q40j459J320J219P37m225j039R31M13J186
$$ 4159 5116 -474 -2239 -1847 -2532 -1316 -1515 -675 -2134 -814 405 1142 -3083 -4122 -3191 -2778 -1592
4763a592j591j513J653M90l401k164L822J329j41L250L444l418o48J36p81J799
$$ -1592 -3183 -4696 -3043 -2553 -5954 -8118 -4296 -2967 -3108 142 3586 168 -480 -344 -1125 674
4747F74o78m45J315K664j433J143l220k786N005L238J853l244j48j720j529q13
$$ 674 -4 -449 866 3530 2097 3240 20 -2766 2239 5477 7330 4086 3938 2218 689 -124
4731a24m60M22N13m49K739J84k166j188j44Q76K869n15k887L65o99m168j949r00
$$ -124 -584 -162 351 -98 2641 2825 659 -529 -673 203 3072 2557 -330 35 -664 -4832 -6781 -7681
4713g681J270K96P4K065q92P18J291R35l3K33J149j158j264J825K203j710j176
$$ -7681 -6411 -6115 -6041 -3976 -4868 -4150 -2859 -1924 -1957 -1724 -575 -1733 -2997 -1172 1031 -679 -1855
4696a855q6K219K436k217k026m643q42K505K382J388o20o71L476O75j376j35K821
$$ -1855 -1941 278 2714 497 -1529 -6172 -7014 -4509 -2127 -739 -1359 -2030 1446 2121 745 610 3431
4679C431K237m878l080J338n93J654k065P18j916J632K380l918R29J547J906n71
$$ 3431 5668 790 -2290 -952 -1545 109 -1956 -1238 -3154 -1522 858 -3060 -2131 -584 1322 751
4663G51k139j6m421m710J653J525M339J117r13j369j347J901L806J210L688j030
$$ 751 -1388 -1404 -5825 -10535 -8882 -7357 -3018 -1901 -2814 -4183 -5530 -3629 177 1387 5075 4045
4647D045O72k414j927j270m516j715K96j047P17k07N834K984p49Q58k019Q41k192
$$ 4045 4717 2303 376 -894 -5410 -7125 -6829 -7876 -7159 -7366 -1532 1452 703 1561 -458 383 -1809
4630a809k140P73m41K693O39j492M49K610q38p1L973J152k869K90j971o36P9n41
$$ -1809 -3949 -3176 -3617 -924 -285 -1777 -1328 1282 444 373 4346 5498 2629 2919 948 312 391 -150
4612a50j093k782j090J535J176R01j734M91J511L512K370l697p972j183J015P90
$$ -150 -1243 -4025 -5115 -3580 -2404 -1503 -3237 -2746 -1235 2277 4647 950 -7022 -8205 -7190 -6400
4596f400J205K222L991J299j37k834j591K27j04k999J608M383J531J742J24j381
$$ -6400 -5195 -2973 1018 2317 2180 -654 -2245 -2018 -2122 -5121 -3513 870 2401 4143 4267 2886
4580B886q05J50k352k515m84j701J143N15K55j683J74N661J617m460L890j007
$$ 2886 2081 2231 -121 -2636 -3120 -4821 -3678 -3163 -2908 -4591 -4417 1244 2861 -1599 2291 1284
4564A284k673k750k40J600O55p22j37J510O34J413j401N31M43k160j741j539j425
$$ 1284 -1389 -4139 -4379 -2779 -2124 -2846 -2983 -1473 -839 574 -827 -296 147 -2013 -3754 -5293 -6718
4547f718L57K797L259Q05K155j737J491J735o70l326k704K092J357l070K041K767
$$ -6718 -6361 -3564 -305 500 2655 918 2409 4144 3474 148 -2556 -464 893 -2177 -136 2631
4531B631j000j670l249j924K071M40j426R59O981l40j195j367K60K129k524j123
$$ 2631 1631 -39 -3288 -5212 -3141 -2701 -4127 -3168 3813 3473 2278 911 1171 3300 776 -347
4515c47K825n21J308n07k655K893q23j52L09k872J344J569n675l23L979L454l678
$$ -347 2478 1957 3265 2758 103 2996 2173 2021 2330 -542 802 2371 -3304 -3627 352 3806 128
4498A28l979K140k228m058L41K076M309n07m09M118l120K311J327j59k201p45
$$ 128 -3851 -1711 -3939 -7997 -7656 -5580 -1271 -1778 -2187 1931 -1189 1122 2449 2290 89 -656
4482f56K436M377k098m344j19R3j916o60J338L132Q26N85j470j249j77l49n03
$$ -656 1780 6157 4059 -285 -404 -311 -2227 -2887 -1549 1583 2409 2994 1524 275 98 -251 -754
4465g54K2r68q7K294k361j217J499L061r97K863L463m450m287k639k585j990L44
$$ -754 -732 -1700 -1787 507 -1854 -3071 -1572 1489 492 3355 6818 2368 -1919 -4558 -7143 -9133 -8789
4448h789N596M734j100m7O43k219j646j148N110K358P55K87O96k018L59J527k83
$$ -8789 -3193 1541 441 394 1037 -1182 -2828 -3976 1134 3492 4247 4534 5230 3212 3571 5098 4815
4431D815j833m653k16J032J485J918k52n335K132J858n18R50k465k952M84J407
$$ 4815 2982 -1671 -1887 -855 630 2548 2296 -3039 -907 951 433 1383 -1082 -4034 -3550 -2143
4415b143K114q46K058k501J051N53j765p65k639j084k67J863K929J31J062k651
$$ -2143 -29 -875 1183 -1318 -267 286 -1479 -2244 -4883 -5967 -6234 -4371 -1442 -1311 -249 -2900
4399b900k447N01J270J292j768j588O8Q15J223J410j338l7j017K931J196j625
$$ -2900 -5347 -4846 -3576 -2284 -4052 -5640 -5572 -4757 -3534 -2124 -3462 -3499 -4516 -1585 -389 -2014
4383b014j958L21J584J639l090J835K191l07J248j859j229P11p26l27K901K397
$$ -2014 -3972 -3651 -2067 -428 -3518 -1683 508 201 1449 -410 -1639 -928 -1654 -1981 920 3317
4367C317N02m588n019M593L619m28j393N32m349l009P095K684l762k274P86j022
$$ 3317 3819 -769 -5788 -1195 2424 1996 603 1135 -3214 -6223 872 3556 -206 -2480 -1694 -2716
4351b716k026k284K209K905J978K071K11m01j963n14j55lk956J000l623j292M32
$$ -2716 -4742 -7026 -4817 -1912 66 2137 2348 1947 -16 -530 -685 -688 -3644 -2644 -6267 -7559 -7127
4334g127j2M373M772L278j425j483J299L30k193j917p15K33M35K246R00P23m98
$$ -7127 -7139 -2766 2006 5284 3859 2376 3675 4005 1812 -105 -820 -587 -152 2094 2994 3717 3219
4317C219p123j659J370J902J453J528n28j789K378j5n232K581M863n83k287j378
$$ 3219 -3904 -5563 -4193 -2291 -838 690 162 -1627 751 736 -4496 -1915 2948 2365 78 -1300
4301a300l499l17M589J057M38J383K738M29k283n62k010p78r4J796j349j015J51
$$ -1300 -4799 -5116 -527 530 968 2351 5089 5518 3235 2673 663 -115 -209 1587 238 -777 -626
4284f26J383J548j527lJ81k978j999R32J494M187J280j611k820l806k862k63k036
$$ -626 757 2305 778 775 956 -2022 -4021 -3089 -1595 2592 3872 2261 -559 -4365 -7227 -7490 -9526
4267i526l169L997M080k44K313K514o43k654k731j443q58l935M11L643M370J143
$$ -9526 -12695 -8698 -4618 -4862 -2549 -35 -678 -3332 -6063 -7506 -8364 -12299 -11888 -8245 -3875 -2732
4251b732O97m655j514l49K901M405N4n3q29j098j017l769j991K180NK344M043
$$ -2732 -2035 -6690 -8204 -8553 -5652 -1247 -1193 -1246 -2075 -3173 -4190 -7959 -9950 -7770 -7765 -5421 -1378
4234a378J632L064J312p19j112k749k684L239q66o65J680p59J679O38M40N33P04
$$ -1378 254 3318 4630 3911 2799 50 -2634 605 -261 -926 754 -5 1674 2312 2752 3285 3989
4217C989j648N33P7l827J327j983j899j246k665j45M29K07P69M893j414k652M031
$$ 3989 2341 2874 2951 -876 451 -1532 -3431 -4677 -7342 -7487 -7058 -6851 -6082 -1189 -2603 -5255 -1224
4200a224R22l841K249N571j906j920J804Q26k202k063k390O014J040j464k109
$$ -1224 -302 -4143 -1894 3677 1771 -149 1655 2481 279 -1784 -4174 1840 2880 1416 -693
4185f93l161k49P10j179N70nLj340L841Q60o69k87L039K970Q03j902j804j260
$$ -693 -3854 -4103 -3393 -4572 -4002 -4007 -4004 -5344 -1503 -643 -1312 -1599 1440 4410 5213 3311 1507 247
4167B47m02J845l10k5k217k072J74J165J211K32J642O97r33o40j722j469j184
$$ 247 -155 1690 1380 1355 -862 -2934 -2760 -1595 -384 -152 1490 2187 1254 614 -1108 -2577 -3761
4150c761K571J150J325Q14n16L73K610J385j367J236j039n207o70l50k111o1j357
$$ -3761 -1190 -40 1285 2099 1583 1956 4566 5951 4584 5820 4781 -426 -1096 -1446 -3557 -3618 -4975
4133d975J065K951K293j003o912m405L278L422K627J068N217J512k939j812J466
$$ -4975 -3910 -959 1334 331 -6581 -10986 -7708 -4286 -1659 -591 4626 6138 3199 1387 2853
4118B853j892m288rM64K372J820Lk138J130K201j494j723Q1O82L401m48m295p
$$ 2853 961 -3327 -3336 -2872 -500 1320 1323 -815 315 2516 1022 -701 -620 62 3463 3015 -1280 -1287
4100a287N447j956k571Q37L124k535l430K382L453K360n167m510M672K938k270
$$ -1287 4160 2204 -367 470 3594 1059 -2371 11 3464 5824 657 -3853 819 3757 1487
4085A487j588p82n38r1L573M826k067j18R63m851n894o49J091L06j039o88N935
$$ 1487 -101 -883 -1421 -1512 2061 6887 4820 4702 5665 814 -5080 -5729 -4638 -4332 -5371 -6059 -124
4068a24K250p70j044j689J206M51m345N28N37K630j542O92L213J32P20k31J401
$$ -124 2126 1356 312 -1377 -171 280 -4065 -3537 -3000 -370 -1912 -1220 1993 2125 2845 2614 4015
4051D015l872P6L056j329l853j635K460k179L24R82l386J754K716k246K273R24
$$ 4015 143 219 3275 1946 -1907 -3542 -1082 -3261 -2937 -1955 -5341 -3587 -871 -3117 -844 80
4035H0m955K489Q82L95l558j31K472J864J318m675n8K242K020o79r44o23K334
$$ 80 -4875 -2386 -1504 -1109 -4667 -4798 -2326 -462 856 -3819 -3877 -1635 385 -294 -1238 -1861 473
4018D73K058P30Q4j889k601l197l38L962L702K144J00P82m975l120m7K060K137
$$ 473 2531 3261 3345 1456 -1145 -4342 -4680 -718 2984 5128 5228 6010 1035 -2085 -2132 -72 2065
4001B065p30K134K205K13n95p94j2o95l570O17J24M00r88j737J422O28N00J868
$$ 2065 1335 3469 5674 5887 5292 4498 4486 3791 221 838 962 1362 374 -1363 59 687 1187 3055
3983C055o07k25k154n96k526j02R31r32N19M470r21k33p65Q10j960l629K54j66
$$ 3055 2448 2223 69 -527 -3053 -3155 -2224 -3156 -2637 1833 912 679 -86 724 -1236 -4865 -4611 -4777
3965d777k556l122L727K939j879L036P65J261N81J775J318P41J570k696l839j692
$$ -4777 -7333 -10455 -6728 -3789 -5668 -2632 -1867 -606 -25 1750 3068 3809 5379 2683 -1156 -2848
3949b848j667L91K991K015l282k9J776K208J040j013j108r30l31L254k483m805
$$ -2848 -4515 -4124 -1133 882 -2400 -2429 -653 1555 2595 1582 474 -456 -787 2467 -16 -4821
3933d821J859R6j455q57K069L975K820p99p31k327n7l155o31r99J826L71o97l44
$$ -4821 -2962 -2866 -4321 -5178 -3109 866 3686 2887 2156 -171 -228 -3383 -4014 -5013 -3187 -2816 -3513 -3857
3915c857K99J340l12j11r33Q64N09L040m35k530J322J392j958j965r59J734K8
$$ -3857 -3558 -2218 -2530 -2641 -3574 -2710 -2201 839 404 -2126 -804 588 -1370 -3335 -4294 -2560 -2532
3898b532J028M56J352j810k086J690J151R42j33l405j085n53K894k49J010R27
$$ -2532 -1504 -1048 304 -1506 -3592 -1902 -751 191 58 -3347 -4432 -4985 -2091 -2340 -1330 -403
3882d03K456o87r46k682O59M16o00j272p52J243J845l47J033j830m14J70Q3j434
$$ -403 2053 1366 420 -2262 -1603 -1187 -1787 -3059 -3811 -2568 -723 -1070 -37 -1867 -2281 -2111 -2028 -3462
3864c462l165K497L940L039K539N18j415l42j138j214O43n04l314k239J259j618
$$ -3462 -6627 -4130 -190 2849 5388 5906 4491 4149 3011 1797 2440 1936 -1378 -3617 -2358 -3976
3848c976o05J29r94j580L85J614M932L159j261n59M74m07J368Q63K83j290Q91
$$ -3976 -4581 -4452 -5446 -7026 -6641 -5027 -95 3064 1803 1244 1718 1311 2679 3542 3825 2535 3426
3831C426m03J095k077p83j548j96N30m25L625J488K191p44P04j136l324k252O125
$$ 3426 3023 4118 2041 1258 -290 -486 44 -381 3244 4732 6923 6179 6883 5747 2423 171 6296
3814F296P52k462p84K423p73j089j475k27k497j451k314K770N129K333k039k492
$$ 6296 7048 4586 3802 6225 5452 4363 2888 2661 164 -1287 -3601 -831 4298 6631 4592 2100
3798B100l53k088m17j853j509J435j184k262k825q14L749M992k51MJ364n02J378
$$ 2100 1747 -341 -758 -2611 -4120 -2685 -3869 -6131 -8956 -9770 -6021 -1029 -1280 -1276 88 -414 964
3781I64j138k909j139j93Q97j256L981J817m18j283k643K198J458J968L247R86
$$ 964 -174 -3083 -4222 -4415 -3518 -4774 -793 1024 606 -677 -3320 -1122 336 2304 5551 6537
3765F537l087j175j340J03L954J236l788l343N34j131n477L449M291J585l075
$$ 6537 3450 2275 935 1038 4992 6228 2440 -903 -369 -1500 -6977 -3528 763 2348 -727
3750g27j43j29j476j670J715J820N10J41j608L92m108j589J421L56R74K229P55
$$ -727 -870 -999 -2475 -4145 -2430 -610 -100 41 -1567 -1175 -5283 -6872 -5451 -5095 -4121 -1892 -1137
3733a137k105N88K417J56K67J821m156K76J661J441J765j464p10K555J372O43
$$ -1137 -3242 -2654 -237 -81 186 2007 -2149 -1873 -212 1229 2994 1530 820 3375 4747 5390
3717E390k337l603k026Q01N16k027n44J632K332J994j33j88l35N84J574Q46l462
$$ 5390 3053 -550 -2576 -1775 -1259 -3286 -3830 -2198 134 2128 1995 1807 1472 2056 3630 4476 1014
3700A014m206Q48J450l023j635J411J725L862J2l115k744J450p63J805P23m84
$$ 1014 -3192 -2344 -894 -3917 -5552 -4141 -2416 1446 1458 -1657 -4401 -2951 -3714 -1909 -1186 -1670
3684a670r59j470r34J344L072K650j848J830j002l765M073K725j37J358m7j819
$$ -1670 -2629 -4099 -5033 -3689 -617 2033 185 2015 1013 -2752 1321 4046 3909 5267 5220 3401
3668C401J489k134k028J554j07J453m580m972N91K417K150m71J144K164J727j423
$$ 3401 4890 2756 728 2282 2175 3628 -952 -5924 -5333 -2916 -766 -1237 -93 2071 3798 2375
3652B375j316k050k119J258J182K46J125o97r43J000l004q34J457j460j60L952
$$ 2375 1059 -991 -3110 -1852 -670 -424 701 4 -939 61 -2943 -3777 -2320 -3780 -3940 12
3636A2O514r78o235n572l22J628r08j3J678L898l86N35p81l161J874L233J706
$$ 12 6526 5548 -687 -6259 -6581 -4953 -5861 -5874 -4196 -298 -684 -149 -930 -4091 -2217 1016 2722
3619B722l31l234k580L038N13j668j00K530J922j443m437K384M743j710m818j273
$$ 2722 2391 -843 -3423 -385 128 -1540 -1640 890 2812 1369 -3068 -684 4059 2349 -2469 -3742
3603c742K068m93j457k005L0J886O16j169j227K377L523L491p55k196k549J463
$$ -3742 -1674 -2167 -3624 -5629 -5599 -3713 -3097 -4266 -5493 -3116 407 3898 3143 947 -1602 -139
3587a39Q80K186M23K405J270l323l967j188M61l03l847l408O76Q80J191R52O09
$$ -139 741 2927 3350 5755 7025 3702 -265 -1453 -992 -1295 -5142 -8550 -7874 -6994 -5803 -4851 -4242
3570d242P90K156k742J239N418J178l228j364J93j804k272K312M20K43j687k2
$$ -4242 -3452 -1296 -4038 -2799 2619 3797 569 -795 -602 -2406 -4678 -2366 -1946 -1703 -3390 -3412
3554c412K502j023K962K218K722R28L076k340j506o159k797M37n11o41L59J093
$$ -3412 -910 -1933 1029 3247 5969 6897 9973 7633 6127 -32 -2829 -2392 -2903 -3544 -3185 -2092
3538b092K25J765J513Q61o12k770J501r41l379L59J806o76N72L877K96n008l85
$$ -2092 -1867 -102 1411 2272 1660 -1110 391 -550 -3929 -3570 -1764 -2440 -1868 2009 2305 -2703 -3088
3521c088k067k560l719k322M194K154M91M069O54j014J016N54j847o13n25K511
$$ -3088 -5155 -7715 -11434 -13756 -9562 -7408 -6917 -2848 -2194 -3208 -2192 -1638 -3485 -4098 -4623 -2112
3505b112L26N08k102l699m57j6r1J945M979Q82j225n3J81Q82J395R78k014k794
$$ -2112 -1786 -1278 -3380 -7079 -7536 -7552 -7643 -5698 -719 163 -1062 -1115 -934 -52 1343 2321 307 -2487
3487b487k457J903K051J593L041P57n694m102J264j794%J879K630K198m71K94
$$ -2487 -4944 -3041 -990 603 3644 4401 -1293 -5395 -4131 -5925 -5925 -4046 -1416 782 311 605
3471F05J375n45j228k877R09Q95L362J386m774N00M246J405n481m868J345J279
$$ 605 1980 1435 207 -2670 -1761 -866 2496 3882 -892 -392 3854 5259 -222 -5090 -3745 -2466
3455b466p85j98r58O13J813K928J52j013K485j670K78J9j113q95j080N76K441
$$ -2466 -3251 -3449 -4407 -3794 -1981 947 1099 86 2571 901 1179 1198 85 -810 -1890 -1314 1127
3438A127j999j166P62K448n38p64L518K615p18j108k54k802m622n04J29J372L132
$$ 1127 -872 -2038 -1276 1172 634 -130 3388 6003 5285 4177 3923 1121 -3501 -4005 -3876 -2504 628
3421F28K645o86n08k113k866m29R21M611J698j262J617j87m37j593k567j168k616
$$ 628 3273 2587 2079 -34 -2900 -3329 -2408 2203 3901 2639 4256 4069 3632 2039 -528 -1696 -4312
3404d312R17L8J657K323J395k441J145j514M37J521J862J095L36o41j079m205
$$ -4312 -3395 -3357 -1700 623 2018 -423 722 -792 -355 1166 3028 4123 4459 3818 2739 -1466
3388a466k571K25o1l40j605N67J964J320K606l125Q38K726K75l045l042R22M33
$$ -1466 -4037 -3812 -3873 -4213 -5818 -5251 -3287 -1967 639 -2486 -1648 1078 1353 -1692 -4734 -3812 -3379
3371c379k004l72K796L187J054l079N83K355J694k112k953R14K175m154r94J032
$$ -3379 -5383 -5755 -2959 228 1282 -1797 -1214 1141 2835 723 -2230 -1316 859 -3295 -4289 -3257
3355c257N955K136n239l184l522Q86O58j177J529J317K293K591j036j476J906
$$ -3257 2698 4834 -405 -3589 -7111 -6225 -5567 -6744 -5215 -3898 -1605 986 -50 -1526 380
3340C80J575Q81j867j816R85l98m537l6K56j126O17K533J848J628K247K427J135
$$ 380 1955 2836 969 -847 138 -260 -4797 -4833 -4577 -5703 -5086 -2553 -705 923 3170 5597 6732
3323F732R90j844l578o50L770K044K82m366l109j161Q82K396k409m985Q89J333
$$ 6732 7722 5878 2300 1650 5420 7464 7746 3380 271 -890 -8 2388 -21 -5006 -4117 -2784
3307b784J41L078K48K538j702j747k695j312r76m79J702n47K055K597N50o45k216
$$ -2784 -2643 435 683 3221 1519 -228 -2923 -4235 -5211 -5690 -3988 -4535 -2480 117 667 22 -2194
3290b194l541K27J644o4k766R19M55P83J13M052K285m541O90L171r20m918l656
$$ -2194 -5735 -5508 -3864 -3928 -6694 -5775 -5320 -4537 -4424 -372 1913 -2628 -1938 1233 313 -4605 -8261
3273h261M550M140q50J793M18N00R98L41k022k697M32J003J509K212o32l261j896
$$ -8261 -3711 429 -421 1372 1790 2290 3288 3629 1607 -1090 -658 345 1854 4066 3434 173 -1723
3256a723Q99k988J861K610J067k458j671j239r58K793J260N13N33o66j794k204
$$ -1723 -824 -3812 -1951 659 1726 -732 -2403 -3642 -4600 -1807 -547 -34 499 -167 -1961 -4165
3240d165J036L518Q94j83j97P34L664j531j121J717j956k018k503M11M028L484
$$ -4165 -3129 389 1283 1100 903 1637 5301 3770 2649 4366 2410 392 -2111 -1700 2328 5812
3224E812P58n069k464K364J722J443l171p76L69J332J336j447k611K943M36K010
$$ 5812 6570 1501 -963 1401 3123 4566 1395 619 988 2320 3656 2209 -402 2541 2977 4987
3208D987o41l628J84j522Q03K01k335K622j418k366K989J138l76J385k543m467
$$ 4987 4346 718 902 -620 183 384 -1951 671 -747 -3113 -124 1014 638 2023 -520 -4987
3192d987j497L722M307J342j243n296j202K847K295m477j422J370L784J085j125
$$ -4987 -6484 -2762 1545 2887 1644 -3652 -4854 -2007 288 -4189 -5611 -4241 -457 628 -497
3177d97M55K612J30J284j46l02k110n445L69J659K217O08q2j169j006J029R54
$$ -497 -42 2570 2700 3984 3838 3536 1426 -4019 -3650 -1991 226 834 752 -417 -1423 -394 560
3160E60j49P55j629O60K623j547J248k373j060j595k949r77J890L594J158J592
$$ 560 411 1166 -463 197 2820 1273 2521 148 -912 -2507 -5456 -6433 -4543 -949 209 1801
3144A801L170P60K73j42n048p04l173j17M524k073m842P32M030Q21J676M23k54
$$ 1801 4971 5731 6004 5862 814 110 -3063 -3180 1344 -729 -5571 -4839 -809 12 1688 2111 1857
3127A857j58O71P03K095k140l228j494N0J468j185l704J041Q05j027q15n73K716
$$ 1857 1699 2370 3073 5168 3028 -200 -1694 -1644 -176 -1361 -5065 -4024 -3219 -4246 -5061 -5634 -2918
3110b918M79K79K496J319o40k431k686J286K508N313j707J353k342k411L334J304
$$ -2918 -2439 -2160 336 1655 1015 -1416 -4102 -2816 -308 5005 3298 4651 2309 -102 3232 4536
3094D536k451k871J287J718k988j193L152O12k340k975j335p1K071K582m26k085
$$ 4536 2085 -786 501 2219 -769 -1962 1190 1802 -538 -3513 -4848 -4919 -2848 -266 -692 -2777
3078b777k63k987j440J764K283j961J429K898J542j493l4O16L232m15j388l673
$$ -2777 -3040 -6027 -7467 -5703 -3420 -5381 -3952 -1054 488 -1005 -1039 -423 2809 2394 1006 -2667
3062b667j580K008M12k598J063q93q43J588j62K910L164r35k220j302k49l621
$$ -2667 -4247 -2239 -1827 -4425 -3362 -4255 -5098 -3510 -3672 -762 2402 1467 -753 -2055 -2304 -5925
3046e925K304L035k380O4J00J35K106j455k618J372J150l801J909K314j820J894
$$ -5925 -3621 -586 -2966 -2902 -2802 -2667 -561 -2016 -4634 -3262 -2112 -5913 -4004 -1690 -3510 -1616
3030a616o72K093J597k578q31j60N66M059N223l605r222m639L631L698K763L970
$$ -1616 -2288 -195 1402 -1176 -2007 -2167 -1601 2458 7681 4076 -5146 -9785 -6154 -2456 307 4277
3014D277Ml531k571l872k463L85N204K156Q28k084o4j014K63O84J708J668j708
$$ 4277 4281 750 -1821 -5693 -8156 -7771 -2567 -411 417 -1667 -1731 -2745 -2482 -1798 -90 1578 -130
2997a30n38l839j761J364K207n51R8N70J087j13J071k404l918J019N82Q01N438
$$ -130 -668 -4507 -6268 -4904 -2697 -3248 -3150 -2580 -1493 -1606 -535 -2939 -6857 -5838 -5256 -4455 983
2980I83K485q53J097N97J367L93k852j306j659j68L26k961M19M418J026j587L86
$$ 983 3468 2615 3712 4309 5676 6069 3217 1911 252 84 410 -2551 -2132 2286 3312 1725 2111
2963B111l701n916j65M722K435K216P58k409l253J25J628J204N39j379k733k484
$$ 2111 -1590 -7506 -7671 -2949 -514 1702 2460 51 -3202 -3077 -1449 -245 294 -1085 -3818 -6302
2947f302J104K419J045k19j248J075J908K538j644n70j823l319l42K637J829r98
$$ -6302 -5198 -2779 -1734 -1953 -3201 -2126 -218 2320 676 106 -1717 -5036 -5378 -2741 -912 -1910
2931a910j099K382K578J508P33k710J908Q8j698O00J836j351k85l025l227PN039
$$ -1910 -3009 -627 1951 3459 4192 1482 3390 3478 1780 2380 4216 2865 2580 -445 -3672 -3665 1374
2914A374J074P63j432j319k786m350K009J002q88R33P50L546r99l512J5k438k99
$$ 1374 2448 3211 1779 460 -2326 -6676 -4667 -3665 -4553 -3620 -2870 676 -323 -3835 -3820 -6258 -6557
2897f557P699J454p484m410J078K316O27L83j036m86M149L648k349L59p85l342
$$ -6557 1142 2596 -4888 -9298 -8220 -5904 -5277 -4894 -5930 -6416 -2267 1381 -968 -609 -1394 -4736
2881d736n34p77M19L384M016O80k253k654l311L087N430J275n277j195k206n36
$$ -4736 -5270 -6047 -5628 -2244 1772 2452 199 -2455 -5766 -2679 2751 4026 -1251 -2446 -4652 -5188
2865e188J759k52K10L721k043j619R34L012j282j00m77L94J076L857K057k352
$$ -5188 -3429 -3681 -3471 250 -1793 -3412 -2478 534 -748 -848 -1325 -931 145 4002 6059 3707
2849C707l847l91K852K024n47l146N38J862l36L38l87l235j483K838j761j39J16
$$ 3707 -140 -531 2321 4345 3798 652 1190 3052 2716 3054 2667 -568 -2051 787 -974 -1113 -997
2832i97J465O9l046j057J91K040M75J798m11l296k7l46K78J32J875Q54J081q40
$$ -997 468 537 -2509 -3566 -3375 -1335 -860 938 527 -2769 -2796 -3142 -2864 -2732 -857 -3 1078 238
2814B38n09k00p17J09M63J101J984l699N62L830J284m826o89o1J851J89j22k040
$$ 238 -271 -471 -1188 -1079 -616 485 2469 -1230 -668 3162 4446 -380 -1069 -1130 721 910 788 -1252
2796a252k513J310Q22J59j785o41N29J77K588K522K673n38j357o27K035J375m317
$$ -1252 -3765 -2455 -1633 -1474 -3259 -3900 -3371 -3194 -606 1916 4589 4051 2694 2067 4102 5477 1160
2779A160k434K107K31j935l47L355K50l600l959k416k188O72K705L208K141O44
$$ 1160 -1274 833 1064 -871 -1218 2137 2387 -1213 -5172 -7588 -9776 -9104 -6399 -3191 -1050 -406
2763d06P95j393k524K341j31N9J059j54o97K665L324m594r74m39k419j069J292
$$ -406 389 -1004 -3528 -1187 -1318 -1259 -200 -354 -1051 1614 4938 344 -630 -1069 -3488 -4557 -3265
2746c265M642K516o347J414K299k196p00l15K975K651k463n150p93l32k418l36
$$ -3265 1377 3893 -2454 -1040 1259 -937 -1637 -1952 1023 3674 1211 -3939 -4732 -5064 -7482 -7818
2730g818J635J304J248J20j013k337Q92P71j841K614N99j153l584R98j906j76
$$ -7818 -6183 -4879 -3631 -3511 -4524 -6861 -5969 -5198 -7039 -4425 -3826 -4979 -8563 -7565 -9471 -9647
2714i647K088J200j305K600O681K240k892j853K17J120j701l832L67Q82J868M132
$$ -9647 -7559 -6359 -7664 -5064 1617 3857 965 -888 -671 449 -1252 -5084 -4717 -3835 -1967 2165
2698B165L331j872k371k899l574J772L136Q75K22o39j69L59R64k58Q14k355L2
$$ 2165 5496 3624 1253 -1646 -5220 -3448 -312 563 785 146 -23 336 1300 1042 1856 -499 -467
2681d67L527m154j145l53k199O31O0K139N724L511j642l789l106j73O89l49O71
$$ -467 3060 -1094 -2239 -2592 -4791 -4160 -4100 -1961 3763 7274 5632 1843 -1263 -1436 -747 -1096 -425
2664d25J844J556j634k249l290j184M202N489J951l28j649L06m36k299j414J864
$$ -425 1419 2975 1341 -908 -4198 -5382 -1180 4309 6260 5932 4283 4589 4153 1854 440 2304
2648B304q83q7j408K366k266j588K382K315n6j649L11J505J920j121J260N8j462
$$ 2304 1421 1334 -74 2292 26 -1562 820 3135 3079 1430 1741 3246 5166 4045 5305 5363 3901
2631C901l831k299M403N65Q71L752k668m389l216k303K594J997j29Q31l145o01
$$ 3901 70 -2229 2174 2739 3610 7362 4694 305 -2911 -5214 -2620 -623 -752 79 -3066 -3667
2615c667j183J072N479K855J769J121j412k386k213j318r77k429L07J528J911
$$ -3667 -4850 -3778 1701 4556 6325 7446 6034 3648 1435 117 -860 -3289 -2982 -1454 457
2600D57k099j648l72M61J72L987J408m80q24l83K016J612j37m13j47j111m59j709
$$ 457 -1642 -3290 -3662 -3201 -3029 958 2366 1886 1062 679 2695 4307 4170 3757 3610 2499 2040 331
2582C31l995k729N429O178l176p88j643j954L84P93m75k638k334j045J554J956
$$ 331 -3664 -6393 -964 5214 2038 1250 -393 -2347 -1963 -1170 -1645 -4283 -6617 -7662 -6108 -4152
2566d152K47M72J595J424J365J052o78R51j757N03o44q8j833l881j958J015L379
$$ -4152 -3905 -3433 -1838 -414 951 2003 1325 2276 519 1022 378 290 -1543 -5424 -7382 -6367 -2988
2549b988N457K872O8k667j904l949P81l2P96R9l477J243K679j951j791Q35L15
$$ -2988 2469 5341 5409 2742 838 -3111 -2330 -2362 -1566 -1467 -4944 -3701 -1022 -2973 -4764 -3929 -3614
2532c614p51l130J647L650l78j492K172p79l51R54J964j539j686o00M079J066
$$ -3614 -4365 -7495 -5848 -2198 -2576 -4068 -1896 -2675 -3026 -2072 -108 -1647 -3333 -3933 146 1212
2516A212j354j65J329M372k034j017j096J044j587L016j230j135J724J364M4J762
$$ 1212 -142 -307 1022 5394 3360 2343 1247 2291 704 3720 2490 1355 3079 4443 4487 6249
2500F249J374k933l085k358J258M337P76k684R73J238k64k285k113J750r2P85
$$ 6249 7623 4690 1605 -753 505 4842 5618 2934 3907 5145 4881 2596 483 2233 2141 2926
2484B926N33jj72j562k225n22K265K08j372j029k150k030L602K187j360j472J997
$$ 2926 3459 3458 3286 1724 -501 -1023 1242 1450 78 -951 -3101 -5131 -1529 658 -702 -2174 -177
2467a77J408J25k466n159n50J297L282Q54L2j79l485J873L611J621J855j857O01
$$ -177 1231 1356 -1110 -6269 -6819 -5522 -2240 -1386 -1354 -1533 -5018 -3145 466 2087 3942 2085 2686
2450B686j160k285J408K47m30J531M38q09k279J205P29k878j456J678K955M712
$$ 2686 1526 -759 649 896 466 1997 2435 1626 -653 552 1281 -1597 -3053 -1375 1580 6292
2434F292j049o453r60m74J227j743J76L600M37P94m69j042j334k7m12r01J758
$$ 6292 5243 -1210 -2170 -2644 -1417 -3160 -2984 616 1053 1847 1378 336 -998 -1025 -1437 -2338 -580
2417e80J845j054K939j341l467k808l66J045j06K510k741m39K548K063R38j487
$$ -580 1265 211 3150 1809 -1658 -4466 -4832 -3787 -3893 -1383 -4124 -4563 -2015 48 986 -501
2401e01kL636m81l751R59K862j014j033j181m87K82Q19K425Q44K651k87k516j787
$$ -501 -503 3133 2652 -1099 -140 2722 1708 675 -506 -993 -711 108 2533 3377 6028 5741 3225 1438
2383A438n19m1N82j749J605K070j491k290o6n77J30N76K84J497m020l29l30J304
$$ 1438 919 878 1460 -289 1316 3386 1895 -395 -461 -1038 -908 -332 -48 1449 -2571 -2900 -3230 -1926
2365a926L55Q94p6o95N171L179k377l457L01K868m117j617L966O56l750J319J110
$$ -1926 -1571 -677 -753 -1448 3723 6902 4525 1068 1369 4237 120 -1497 2469 3125 -625 694 1804
2348A804q5J143l40j844Q84P01J056j718l758O07j02j263L388J609L56p70J588
$$ 1804 1719 2862 2522 678 1562 2263 3319 1601 -2157 -1550 -1652 -2915 473 2082 2438 1668 3256
2331C256j275J674r94r66k333J40K026j97l225Q33j059K440L11r67j170l944Q45
$$ 3256 1981 3655 2661 1695 -638 -498 1528 1331 -1894 -1061 -2120 320 631 -336 -1506 -5450 -4605
2314d605L227K058L68P09L818L44J712l348o87r44l606k852J212K747Q18Q85K157
$$ -4605 -1378 680 1048 1757 5575 5919 7631 4283 3596 2652 -954 -3806 -2594 153 971 1856 4013
2297D013R20q56l948k16j932J320K868k212k772L613k406j246p08k259l81K257
$$ 4013 4933 4077 129 -87 -2019 -699 2169 -43 -2815 798 -1608 -2854 -3562 -5821 -6202 -3945
2281c945l970q85J641L780J30P25J203L73r87K797k489q76L410K810j778K48J733
$$ -3945 -7915 -8800 -7159 -3379 -3249 -2524 -1321 -948 -1935 862 -1627 -2503 907 3717 1939 2187 3920
2264C920k449J576J979n2k914l9L641L790j016o768j940J087j177m05K629j64
$$ 3920 1471 3047 5026 4974 2060 2021 5662 9452 8436 1668 -272 815 -362 -767 1862 1698
2248A698L61K361P54j999l266j791o6P52L281L233M10k492k840n48l972r79J067
$$ 1698 2059 4420 5174 3175 -91 -1882 -1948 -1196 2085 5318 5728 3236 396 -152 -4124 -5103 -4036
2231d036L190L920j167k855L29j162K118k867M60K207J493o50j627q49K018r6
$$ -4036 -846 3074 1907 -948 -619 -1781 337 -2530 -2070 137 1630 980 -647 -1496 522 426
2215D26L423K586j06j041l020Q4m639j294J578J643J659J078P93k556k382K669
$$ 426 3849 6435 6329 5288 2268 2352 -2287 -3581 -2003 -360 1299 2377 3170 614 -1768 901
2199I01k152j449R23M736L55l133j293J016p47k159j36j215N51J068L092J265
$$ 901 -1251 -2700 -1777 2959 3314 181 -1112 -96 -843 -3002 -3138 -4353 -3802 -2734 358 1623
2183A623k172j913J836j152Q94k524k320j219M410K357j973n78k332r2K767K321
$$ 1623 -549 -2462 -626 -1778 -884 -3408 -5728 -6947 -2537 -180 -2153 -2731 -5063 -5155 -2388 -67
2167f7m05q93o29K483j615k976K80K028N90K331M190J040l240K122L108j479l315
$$ -67 -472 -1365 -1994 489 -1126 -4102 -3822 -1794 -1204 1127 5317 6357 3117 5239 8347 6868 3553
2150C553m576K314K012K08J116j033l353k709L05j245K8L124L390j757L423k014
$$ 3553 -1023 1291 3303 3511 4627 3594 241 -2468 -2163 -3408 -3380 -256 3134 1377 4800 2786
2134B786l988j469O1L186k74l916K93K791r25j897K999K322O95q03k522j976L79
$$ 2786 -1202 -2671 -2610 576 302 -3614 -3321 -530 -1455 -3352 -353 1969 2664 1861 -661 -2637 -2258
2117b258M008J966k032m142l514k12J098K165K63K364K648J023J183k44J103K844
$$ -2258 1750 3716 1684 -2458 -5972 -6184 -5086 -2921 -2658 -294 2354 3377 4560 4316 5419 8263
2101H263k079n109k583K63K194J385N60j396k965l699m306K297O112K307l788
$$ 8263 6184 1075 -1508 -1245 949 2334 2894 1498 -1467 -5166 -9472 -7175 -1063 1244 -2544
2086b544p3%L411L174M7N37P70j470m513j013M723J842j51K94Q24n460o56k437
$$ -2544 -2617 -2617 794 3968 4015 4552 5322 3852 -661 -1674 3049 4891 4740 5034 5858 398 -258 -2695
2068b695q64K872r1N43K551J3k792L72L895J67j781l384J499K440O42o95k774
$$ -2695 -3559 -687 -778 -235 2316 2329 -463 -91 3804 3971 2190 -1194 305 2745 3387 2692 -82
2051h2j42r69j377P70M828N86o10k73O35L655L126R35P38j686k003P51j425m133
$$ -82 -224 -1193 -2570 -1800 3028 3614 3004 2731 3366 7021 10147 11082 11820 10134 8131 8882 7457 3324
2033C324o43M72l882j655K939K564J490j118j393m93Q99Q41K136k521m408j409
$$ 3324 2681 3153 -729 -2384 555 3119 4609 3491 2098 1605 2504 3345 5481 2960 -1448 -2857
2017b857J59J269j60j475j886L065K944K653J596m472m596J03k01M34M20J517
$$ -2857 -2698 -1429 -1589 -3064 -4950 -1885 1059 3712 5308 836 -3760 -3657 -3858 -3424 -3004 -1487
2001a487L9K632J517n10l434j771k699j96K302K941J450p28j478J697J88R97L43
$$ -1487 -1448 1184 2701 2191 -1243 -3014 -5713 -5909 -3607 -666 784 56 -1422 275 463 1460 1803
1984A803M78J442m767j280K378J50j120r40n06r72J078J077J64M02o88k082J090
$$ 1803 2281 3723 -1044 -2324 54 204 -916 -1856 -2362 -3334 -2256 -1179 -1015 -613 -1301 -3383 -2293
1967b293M471j930j133K67l460k442J056L56o68M81M476K511M01J676k441k453
$$ -2293 2178 248 -885 -618 -4078 -6520 -5464 -5108 -5776 -5295 -819 1692 2093 3769 1328 -1125
1951a125OL04J80k312j479J770K947J880l38j139J530k749j694L139J542R84j917
$$ -1125 -1119 -815 -635 -2947 -4426 -2656 291 2171 1833 694 2224 -525 -2219 920 2462 3446 1529
1934A529l702J634J757r57j114o63K489q48k861j738j328K983J039J231j94o78
$$ 1529 -2173 -539 1218 261 -853 -1516 973 125 -2736 -4474 -5802 -2819 -1780 -549 -743 -1421
1918a421K702k233l473K0K598M13j350M848O477l003l866l88o1m14n0M461J444
$$ -1421 1281 -952 -4425 -4405 -1807 -1394 -2744 2104 8581 5578 1712 1324 1263 849 799 5260 6704
1901F704j449l0q8j071j520j80k227j647l96J289L335j032P5K802j305l033o73
$$ 6704 5255 5225 5137 4066 2546 2366 139 -1508 -1904 -615 2720 1688 1763 4565 3260 227 -446
1884d46k264o3K510N47N21p25M237K011j655r46k064k894K626L099o93k002k515
$$ -446 -2710 -2773 -263 284 805 80 4317 6328 4673 3727 1663 -1231 1395 4494 3801 1799 -716
1867g16M6L245K237k643k205L049K508j018l866k380O79J808Q44j438j009K722
$$ -716 -670 2575 4812 2169 -36 3013 5521 4503 637 -1743 -1064 744 1588 150 -859 1863
1851A863J248L677q29n026Q37J170j091q83n74K099m68L57m79k881J029M27o4
$$ 1863 3111 6788 5959 933 1770 2940 1849 966 392 2491 2023 2380 1901 -980 49 476 412
1834D12j456o91J661J345K46r6l581j581r46n80O34R33J298j094N21M324p57l470
$$ 412 -1044 -1735 -74 1271 1517 1421 -2160 -3741 -4687 -5267 -4633 -3700 -2402 -3496 -2975 1349 592 -2878
1816b878K351k008J977j004k866o66L251J353p94J26q60L421J721k95J785j31
$$ -2878 -527 -2535 -558 -1562 -4428 -5094 -1843 -490 -1284 -1158 -2018 1403 3124 2829 4614 4483
1800D483K5J222k270q10J926j364k414J618J040J523J563K479m70l536l247j403
$$ 4483 4508 5730 3460 2650 4576 3212 798 2416 3456 4979 6542 9021 8551 5015 1768 365
1784C65L371N735n559n420L374P71m73k024L145J427n812m193K657J381p48m01
$$ 365 3736 9471 3912 -1508 1866 2637 2164 140 3285 4712 -1100 -5293 -2636 -1255 -2003 -2404
1768b404J97O43J416Kl85j90k36K031K147j156J451K196j19j859k044K39J322
$$ -2404 -2207 -1564 -148 -146 -531 -721 -957 1074 3221 2065 3516 5712 5593 3734 1690 1929 3251
$$ [...]
##END NTUPLES=NMR SPECTRUM
##END=
