##TITLE=Analysis number 319878
Compound Code sew 05383
Project Code adrs
Chemist Name af chempharm
##JCAMPDX= 6.0         $$ Bruker NMR JCAMP-DX V2.0
##DATA TYPE= NMR SPECTRUM
##DATA CLASS= NTUPLES
##ORIGIN= Bruker BioSpin GmbH
##OWNER= nmr
$$ XWIN-NMR		Version 3.5
$$ Thu Jun  1 12:42:42 2006 GMT Daylight Time (UT+1h)  MAYBRIDGE\nmr@NMR_250MHZ
##.OBSERVE FREQUENCY= 250.131544655141
##.OBSERVE NUCLEUS= ^1H
##.ACQUISITION MODE= SIMULTANEOUS (DQD)
##.ACQUISITION SCHEME= undefined
##.AVERAGES= 16
##.DIGITISER RES= 18
##SPECTROMETER/DATA SYSTEM= dpx250
##.PULSE SEQUENCE= zg30
##.SOLVENT NAME= CDCl3
##.SHIFT REFERENCE= (INTERNAL, CDCl3, 0, 16.522)
##AUDIT TRAIL= $$ (NUMBER, WHEN, WHO, WHERE, WHAT)
$$ ##TITLE= Audit trail, XWIN-NMR		Version 3.5
$$ ##JCAMPDX= 5.01
$$ ##ORIGIN= Bruker BioSpin GmbH
$$ ##OWNER= nmr
$$ C:\u/data/dgb/nmr/ADRS/110/pdata/1/auditp.txt
$$ ##AUDIT TRAIL=  $$ (NUMBER, WHEN, WHO, WHERE, WHAT)
(   1,<2006-06-01 12:42:04.69 +100>,<MAYBRIDGE\nmr>,<NMR_250MHZ>,
      <created by zg, POWCHK disabled, PULCHK disabled
       configuration hash MD5:
       E2 DF 36 D8 04 B2 41 60 5A D7 A3 38 5A 4B D0 FE
       data hash MD5: 64K
       EC 0D EB B4 72 5F C5 48 25 21 CD 10 A4 5C 61 ED>)
(   2,<2006-06-01 12:42:23.21 +100>,<MAYBRIDGE\nmr>,<NMR_250MHZ>,
      <Start of raw data processing
       ef LB = 0.3 FT_mod = 6 PKNL = 1 SI = 32K 
       data hash MD5: 32K
       59 0B F6 EF 1B 20 43 67 F7 71 96 11 CC 8A 8A 6A>)
(   3,<2006-06-01 12:42:27.46 +100>,<MAYBRIDGE\nmr>,<NMR_250MHZ>,
      <apk 
       data hash MD5: 32K
       FE 22 F5 0B 3C 5C AF DC 1C 21 D7 62 4D 56 E6 6F>)
(   4,<2006-06-01 12:42:29.18 +100>,<MAYBRIDGE\nmr>,<NMR_250MHZ>,
      <abs ABSG = 5 
       data hash MD5: 32K
       70 8C F0 91 2D 38 4C 07 B8 FA 6C A7 93 B1 08 4B>)
$$ ##END=
$$ 
$$ hash MD5
$$ 22 22 CF 8B 0C 96 F9 D2 77 F9 9D BF F0 81 E7 53
##$RELAX= 
##$RELAX= 
##$RELAX= 
##$RELAX= 
##$RELAX= 
##$RELAX= 
##$RELAX= 
$$ Bruker specific parameters
$$ --------------------------
##$DU= <C:\u>
##$EXPNO= 110
##$NAME= <ADRS>
##$PROCNO= 1
##$TYPE= <nmr>
##$USER= <dgb>
##$AMP= (0..31)
100 100 100 100 100 100 100 100 100 100 100 100 100 100 100 100 100 100 
100 100 100 100 100 100 100 100 100 100 100 100 100 100 
##$AQSEQ= 0
##$AQ_mod= 3
##$AUNM= <au_zg>
##$AUTOPOS= <25 >
##$BF1= 250.13
##$BF2= 250.13
##$BF3= 250.13
##$BF4= 250.13
##$BF5= 500.13
##$BF6= 500.13
##$BF7= 500.13
##$BF8= 500.13
##$BYTORDA= 1
##$CFDGTYP= 0
##$CFRGTYP= 5
##$CHEMSTR= <none>
##$CNST= (0..31)
1 1 145 1 1 1 1 1 1 1 1 1 1 1 1 1 1 1 1 1 1 1 1 1 1 1 1 1 1 1 1 1 
##$CPDPRG= <>
##$CPDPRG1= <>
##$CPDPRG2= <>
##$CPDPRG3= <>
##$CPDPRG4= <mlev>
##$CPDPRG5= <mlev>
##$CPDPRG6= <mlev>
##$CPDPRG7= <mlev>
##$CPDPRG8= <mlev>
##$CPDPRGB= <>
##$CPDPRGT= <>
##$D= (0..31)
0 1 0 0 0 0 0 0 0 0.06 0 0 0 0 0 0 0.0002 0 0 0 0 0 0 0 0 0 0 0 0 0 0 
0 
##$DATE= 1149162122
##$DBL= (0..7)
120 120 120 120 120 120 120 120 
##$DBP= (0..7)
150 150 150 150 150 150 150 150 
##$DBP07= 0
##$DBPNAM0= <>
##$DBPNAM1= <>
##$DBPNAM2= <>
$$ [...]
##$SUBNAM7= <"">
##$SUBNAM8= <"">
##$SUBNAM9= <"">
##$SW= 20.6930455092707
##$SWIBOX= (0..15)
0 0 3 0 0 0 0 0 0 0 0 0 0 0 0 0 
##$SW_h= 5175.983436853
##$TD= 65536
##$TD0= 1
##$TE= 295.16
##$TE2= 300
##$TE3= 300
##$TEG= 300
##$TL= (0..7)
0 120 120 120 120 120 120 120 
##$TP= (0..7)
150 150 150 150 150 150 150 150 
##$TP07= 0
##$TPNAME0= <>
##$TPNAME1= <>
##$TPNAME2= <>
##$TPNAME3= <>
##$TPNAME4= <>
##$TPNAME5= <>
##$TPNAME6= <>
##$TPNAME7= <>
##$TPOAL= (0..7)
0.5 0.5 0.5 0.5 0.5 0.5 0.5 0.5 
##$TPOFFS= (0..7)
0 0 0 0 0 0 0 0 
##$TUNHIN= 0
##$TUNHOUT= 0
##$TUNXOUT= 0
##$USERA1= <user>
##$USERA2= <user>
##$USERA3= <user>
##$USERA4= <user>
##$USERA5= <user>
##$V9= 5
##$VALIST= <valist>
##$VCLIST= <CCCCCCCCCCCCCCC>
##$VD= 0
##$VDLIST= <DDDDDDDDDDDDDDD>
##$VPLIST= <PPPPPPPPPPPPPPP>
##$VTLIST= <TTTTTTTTTTTTTTT>
##$WBST= 1024
##$WBSW= 4
##$XGAIN= (0..3)
0 0 0 0 
##$XL= 0
##$YL= 0
##$YMAX_a= 318560
##$YMIN_a= -423292
##$ZGOPTNS= <>
##$ZL1= 120
##$ZL2= 120
##$ZL3= 120
##$ZL4= 120
##$ABSF1= 16.522
##$ABSF2= -4.171173
##$ABSG= 5
##$ABSL= 3
##$ALPHA= 0
##$AQORDER= 0
##$ASSFAC= 0
##$ASSFACI= 0
##$ASSFACX= 0
##$ASSWID= 0
##$AUNMP= <proc_1d>
##$AZFE= 0.1
##$AZFW= 0.1
##$BCFW= 0
##$BC_mod= 0
##$BYTORDP= 0
##$COROFFS= 0
##$CY= 12.5
##$DATMOD= 1
##$DC= 0
##$DFILT= <>
##$DTYPP= 0
##$F1P= 14.0000005364418
##$F2P= -0.99999901652339
##$FCOR= 0.5
##$FTSIZE= 32768
##$FT_mod= 6
##$GAMMA= 0
##$GB= 0
##$INTBC= 1
##$INTSCL= 1
##$ISEN= 128
##$LB= 0.3
##$LEV0= 0
##$LPBIN= 0
##$MAXI= 10000
##$MC2= 0
##$MEAN= 0
##$ME_mod= 0
##$MI= 0
##$NCOEF= 0
##$NC_proc= -5
##$NLEV= 6
##$NOISF1= 0
##$NOISF2= 0
##$NSP= 0
##$NTH_PI= 0
##$NZP= 0
##$OFFSET= 16.522
##$PC= 1
##$PHC0= 176.3557
##$PHC1= 4.423288
##$PH_mod= 1
##$PKNL= yes
##$PPARMOD= 0
##$PSCAL= 4
##$PSIGN= 0
##$REVERSE= no
##$SF= 250.13
##$SI= 32768
##$SIGF1= 0
##$SIGF2= 0
##$SINO= 400
##$SIOLD= 32768
##$SREGLST= <1H.CDCl3>
##$SSB= 0
##$STSI= 32768
##$STSR= 0
##$SW_p= 5175.98343685301
##$SYMM= 0
##$S_DEV= 0
##$TDeff= 65536
##$TDoff= 0
##$TI= <Analysis number 999999
Compound Code 99
Book Reference 9
Project Code 9>
##$TILT= no
##$TM1= 0
##$TM2= 0
##$TOPLEV= 0
##$USERP1= <user>
##$USERP2= <user>
##$USERP3= <user>
##$USERP4= <user>
##$USERP5= <user>
##$WDW= 1
##$XDIM= 32768
##$YMAX_p= 322901103
##$YMIN_p= -961647
$$ End of Bruker specific parameters
$$ ---------------------------------
##NTUPLES= NMR SPECTRUM
##VAR_NAME=  FREQUENCY,     SPECTRUM/REAL,   SPECTRUM/IMAG
##SYMBOL=    X,             R,               I
##VAR_TYPE=  INDEPENDENT,   DEPENDENT,       DEPENDENT
##VAR_FORM=  AFFN,          ASDF,            ASDF
##VAR_DIM=   32768,         32768,           32768
##UNITS=     HZ,            ARBITRARY UNITS, ARBITRARY UNITS
##FACTOR=    0.157963299565203, 1,           1
##FIRST=     4132.6476996994, 0,             0
##LAST=      -1043.33573715361, 0,           0
##MIN=       -1043.33573715361, -961647,     0
##MAX=       4132.6476996994, 322901103,     0
$$ Real data points
##PAGE= N=1
##DATA TABLE= (X++(R..R)), XYDATA
$$ [...]
16657a04856N1869K40316R3374k38488j39885j34163p4260k5041K8784L8315J25575
$$ -104856 -52987 187329 280703 42215 -97670 -231833 -306093 -331134 -302350 -264035 -138460
16646a38460J57860R4329m2192k25546J00722J35079n4783j41836R1967J02173
$$ -138460 19400 113729 71537 -154009 -53287 81792 27009 -114827 -22860 79313
16636G9313m9167J06598J08537J42582J5331n4666k9748K2550j50105r8032m3946
$$ 79313 30146 136744 245281 387863 403194 348528 318780 341330 191225 93193 49247
16625D9247L1011q5733j9333Q5081J6895j69332j4684k483j26535J35670R9303
$$ 49247 80258 -5475 -24808 60273 77168 -92164 -106848 -109331 -235866 -100196 -893
16614h93K7630m3498o3328q6229j08691J48394P3851Q4529R5974M6139k00381
$$ -893 26737 -16761 -80089 -166318 -275009 -126615 -52764 31765 127739 173878 -26503
16603b6503k52250o3828L5163J73429L15553P188p2236R244L8471P5344o7934
$$ -26503 -278753 -342581 -307418 -133989 181564 188752 116516 125760 164231 239575 171641
16592A71641j07461M5939L1864J34247P6760j28773j52766l1104O0771J23609
$$ 171641 64180 110119 141983 276230 352990 224217 71451 40347 101118 224727
16582B24727j21832m0554J5612j78664j00113N0606j9204k6660r2631J06051J38509
$$ 224727 102895 62341 77953 -100711 -200824 -150218 -169422 -196082 -288713 -182662 -44153
16571d4153K0875l9527o4131N0291j1985J6533r7146n2494P3640O2529k38208
$$ -44153 -23278 -62805 -126936 -76645 -88630 -72097 -169243 -221737 -148097 -85568 -323776
16560c23776m9237N0236J27304k6572n5251J03595K25631N3735K0939j40260j15352
$$ -323776 -373013 -322777 -195473 -222045 -277296 -173701 51930 105665 126604 -13656 -129008
16549a29008R6847N7373j1603l8342J4801O8891m3834O2033n5368k8561r4168
$$ -129008 -32161 25212 13609 -24733 -9932 58959 15125 77158 21790 -6771 -100939
16538a00939J94812P0984j5514j02626q5771l3857J53730J13223n7757j24889
$$ -100939 93873 164857 149343 46717 -39054 -72911 80819 194042 136285 11396
16528A1396Q0200O6639q3832l5601o0377Q6596n3664o8052r9118o3923J52957
$$ 11396 91596 158235 74403 38802 -21575 65021 11357 -56695 -155813 -219736 -66779
16517f6779j5086J3136n0946J05043J69488J4459j53884J802j5064j53120J427
$$ -66779 -81865 -68729 -119675 -14632 154856 169315 15431 17233 2169 -150951 -149524
16506a49524K60680P3627k19436p3995k2873n2238N0524J26828O3180k1789p1334
$$ -149524 111156 184783 -34653 -108648 -131521 -183759 -133235 -6407 56773 34984 -36350
16495c6350j06840J1582J1991M2322J07056j03155K2674L6794J0110m0969q9142
$$ -36350 -143190 -131608 -119617 -77295 29761 -73394 -50720 -13926 -3816 -44785 -133927
16484a33927M3949Q6704L2543o9596j7346r6035o3534q3341l5106J63381J7629
$$ -133927 -89978 -3274 29269 -40327 -57673 -153708 -217242 -300583 -335689 -172308 -154679
16473a54679L1852O750n952L9806M4228O3116K66191p3198L0533r5542J2474o4774
$$ -154679 -122827 -116077 -122029 -82223 -37995 25121 291312 218114 248647 153105 165579 100805
16461A00805r5070m009J07420n5328L6773J25432P3207j29233m5688k654m4152
$$ 100805 5735 1726 109146 53818 90591 216023 289230 159997 114309 111655 67503
16450F7503j5882M8207j37280K5513J74724j4768L6246m6988o6326M4765K4355
$$ 67503 51621 99828 -37452 -11939 162785 148017 184263 137275 70949 115714 140069
16439A40069r3649j31420o8116J8464j07686J40604J10769j07195r9007k37220
$$ 140069 46420 -85000 -153116 -134652 -242338 -101734 9035 -98160 -197167 -434387
16429d34387M1425J33783J51167o5177K4106m5397M7340k25773j72683K01617
$$ -434387 -392962 -259179 -108012 -173189 -149083 -194480 -147140 -372913 -545596 -343979
16419c43979J32538J96278J57729J227j05152k03734j93017j3937J12399J20926
$$ -343979 -211441 -15163 142566 143793 38641 -165093 -358110 -372047 -259648 -138722
16409a38722J22618m4139j50624n6554K44024J4396J10060j51534j14886j35946
$$ -138722 -16104 -60243 -210867 -267421 -23397 -9001 101059 -50475 -165361 -301307
16399c01307K5500J02094J06860J66339k995j30826J53670m999k22500m8916J4681
$$ -301307 -275807 -173713 -66853 99486 96491 -34335 119335 114336 -108164 -157080 -142399
16388a42399J53044M7494l943j76057j68005o1338N4172J30720J14527R335J03418
$$ -142399 10645 58139 54196 -121861 -289866 -351204 -297032 -166312 -51785 -42450 60968
16377F0968L9621k3389m3152P8221J32733M0887j10856j25106k5587n4701j80728
$$ 60968 100589 77200 34048 112269 245002 285889 175033 49927 24340 -30361 -211089
16366b11089j91410Q475L3215L9044j0306P5906J65971k993J8961K2018m930j39187
$$ -211089 -402499 -394024 -360809 -321765 -332071 -256165 -90194 -93187 -74226 -52208 -57138 -196325
16354a96325j39566k8068p7161J13690J60684O954l2800J13010L7070J25576L6425
$$ -196325 -335891 -363959 -441120 -327430 -166746 -159792 -192592 -79582 -42512 83064 119489
16343A19489j2361J6983j50116j999J1861j31118K27088R833p7871j29099M4408
$$ 119489 107128 124111 -26005 -28004 -16143 -147261 79827 89660 11789 -117310 -72902
16332g2902N8709O5492K8894p8784n7257J26140N6727p7292O5778P0661j82997
$$ -72902 -14193 51299 80193 1409 -55848 70292 127019 49727 115505 186166 3169
16321C169k06127R6682j5517o0367P7551L6718Q4753J16132K1805m9917q8308
$$ 3169 -202958 -106276 -121793 -182160 -104609 -67891 16862 132994 154799 104882 16574
16310A6574K1121q2010k64268J87135J52615m9701O0858n3582j38800k6400M9137
$$ 16574 37695 -44315 -308583 -121448 31167 -18534 42324 -11258 -150058 -176458 -127321
16299a27321P4032K2380P4935J00642l4508l5088J4348o8148k7546J50868j17984
$$ -127321 -53289 -30909 44026 144668 110160 75072 89420 21272 -6274 144594 26610
16288B6610k18534j2446P5087l1549N1788m160J9372O0181J61936J17861j30614
$$ 26610 -191924 -204370 -129283 -160832 -109044 -113204 -93832 -33651 128285 246146 115532
16277A15532j31244K7187J00493O2825m848J50974j44089j85751n8527N537L7020
$$ 115532 -15712 11475 111968 174793 169945 320919 176830 -8921 -67448 -61911 -24891
16266b4891P0555O9492p7944j98067n6680k9221l6907J41062Q580J5351J87302
$$ -24891 45664 115156 37212 -160855 -217535 -246756 -283663 -142601 -134021 -118670 68632
16255F8632K37681j08494p4680r4293j58217m9657K370J65384L973m1404l9896
$$ 68632 306313 197819 123139 28846 -129371 -179028 -176658 -11274 -7301 -48705 -88601
16244h8601m5978j714l2610L9954L4491r721J03029J26537M0070N418q0815L5448
$$ -88601 -134579 -136293 -168903 -128949 -94458 -104179 -1150 125387 165457 170875 90060 125508
16232A25508K05249l6560j69135k8564J17299j7378k99350m7376m0821J67197
$$ 125508 330757 294197 125062 96498 213797 196419 -102931 -150307 -191128 -23931
16222b3931j3717k33304j54992k9373P9185M0885O5681Q1670J72982L6064m5217
$$ -23931 -37648 -270952 -425944 -455317 -376132 -335247 -269566 -187896 -14914 21150 -24067
16211b4067k60114j08825K11115J06918P7440J37857J67322p9820n4448k02793
$$ -24067 -284181 -393006 -181891 -74973 2467 140324 307646 227826 173378 -29415
16201b9415m1869L2323L3344j94264Q3189k0177P2882J0936j23905Q331R7578
$$ -29415 -71284 -38961 -5617 -199881 -116692 -136869 -63987 -53051 -176956 -168625 -71047
16190g1047Q8499k2136j79126r3508N2238L1740l052R4010N5185J4826m2405O0912
$$ -71047 17452 -4684 -183810 -277318 -225080 -193340 -196392 -102382 -47197 -32371 -74776 -13864
16178a3864p259N3910J8569Q0517m7524o6014j89739m6840p0753n4317J20931
$$ -13864 -21123 32787 51356 131873 84349 18335 -171404 -218244 -288997 -343314 -222383
16167b22383J3934q5906M7870m4197K9825J64659K7859l3265q6095j6087J82496
$$ -222383 -208449 -294355 -246485 -290682 -260857 -96198 -68339 -101604 -187699 -203786 -21290
16156b1290J09323Q61j81111L6523m9509J09252L8932R1j7787j1173L9630k115
$$ -21290 88033 88894 -92217 -55694 -105203 4049 42981 43072 25285 14112 53742 51627
16144E1627p4918p2405J7151J9649P4056p5686j6985l495p5986l5968K36595J49645
$$ 51627 -23291 -95696 -78545 -58896 15160 -60526 -77511 -81006 -156992 -192960 43635 193280
16132A93280R8104j19194k04946l2787K16313k1760k1525o1555Q045o9862j71543
$$ 193280 291384 172190 -32756 -65543 150770 129010 107485 45930 53975 -15887 -187430
16121a87430j6442Q5239O8885m478o3066M149J51426K25860P8239L392k30325
$$ -187430 -203872 -118633 -49748 -54226 -117292 -113143 38283 264143 342382 345774 115449
16110A15449j12529L7561m7997r4715l4264M0869J7503r041K0644N8616Q8625
$$ 115449 2920 40481 -7516 -102231 -136495 -95626 -78123 -87164 -66520 -7904 80721
16099H0721J31929j9644j24738l2993l954r2062p7808Q6250J45300K96739p8304
$$ 80721 212650 193006 68268 35275 31321 -60741 -138549 -52299 93001 389740 311436
16088C11436k26960r5674l3570N2678O3233L160o7620n5209J9719J79677j91854
$$ 311436 84476 -11198 -44768 7910 71143 74303 6683 -48526 -28807 150870 -40984
16077d0984o4158l128J24237j49277P9458R1346o7890N1490m212M7566j22424
$$ -40984 -105142 -108270 15967 -133310 -53852 37494 -30396 21094 16882 64448 -57976
16066e7976r6155j03770j36409M0972N6143O2704J48414J87808Q8163j43506m7814
$$ -57976 -154131 -257901 -394310 -353338 -297195 -234491 -86077 101731 189894 46388 -1426
16055a426J7055M1028J28238J8735j23596L5208J89119K6335q1569J73371r0647
$$ -1426 15629 56657 184895 203630 80034 115242 304361 330696 249127 422498 331851
16044C31851j30203n2788j42088N9042r853r7465k0810O4477P3713n2451P281
$$ 331851 201648 148860 6772 65814 55961 -41504 -62314 2163 75876 23425 30706
16033C0706N2919j15659N6298k982O7175N7994J5651j2591K0848R0646j45814
$$ 30706 83625 -32034 24264 21282 88457 146451 162102 149511 170359 261005 115191
16022A15191p010J0397p6021o3771p852O9134j74775j6865l3740j126K6079K51000
$$ 115191 108181 118578 42557 -21214 -29066 40068 -134707 -151572 -185312 -186438 -160359 90641
16010I0641K8223j56529k55950j45020R7185O5413R2220P7621J30497n3547l2226
$$ 90641 118864 -37665 -293615 -438635 -341450 -276037 -183817 -106196 24301 -29246 -61472
15999f1472O9605n6737j30128r3044k9670P1791R4957O8509l2088n9947L1439
$$ -61472 8133 -48604 -178732 -271776 -301446 -229655 -134698 -66189 -98277 -158224 -126785
15988a26785P3885P3151o3995Q3466K1857o1813K44707o4207m8562k01450k71717
$$ -126785 -52900 20251 -43744 39722 61579 -234 244473 180266 131704 -69746 -341463
15977c41463M177M257J57689J38489j26682o1651J00214J8429J5341O8465q4514
$$ -341463 -337286 -333029 -175340 -36851 -163533 -225184 -124970 -106541 -91200 -22735 -107249
15966a07249k242j1023J42525l9886K6037m1102M5434J06150J08201k0373q9101
$$ -107249 -109491 -120514 22011 -17875 8162 -32940 12494 118644 226845 206472 117371
15955A17371j41566j30534k8744m2747O0281j8699N6156L1537j12339Q8277m1008
$$ 117371 -24195 -154729 -183473 -226220 -165939 -184638 -128482 -96945 -209284 -121007 -162015
15944a62015O4455Q4969J30433j50040j77719l0267M4488M9592L2227l565j4287
$$ -162015 -97560 -12591 117842 -32198 -209917 -240184 -195696 -146104 -113877 -117442 -131729
15933a31729m2166j19890J11128K26488L2879q4498j52929l8340J21459J06989
$$ -131729 -173895 -293785 -182657 43831 76710 -7788 -160717 -199057 -77598 29391
15923B9391R6486J1331l6570O4679q3647j41133j21348j8863Q0936r2803P8771
$$ 29391 125877 137208 100638 165317 81670 -59463 -180811 -199674 -118738 -211541 -132770
15912a32770L0894k5493q6405J113N0126J32301l2373o8094m367O6934J19875
$$ -132770 -101876 -127369 -213774 -212661 -162535 -30234 -62607 -130701 -135068 -68134 51741
15901E1741l7730K7242R1667j0711j5050O486O9696Q7378k3463p9304j20697j77375
$$ 51741 14011 41253 132920 122209 107159 113645 183341 270719 247256 167952 47255 -130120
15889a30120J3923J20259J59884R0258q2849j90244R2659J10680J07699r5485
$$ -130120 -116197 4062 163946 254204 171355 -18889 73770 184450 292149 196664
15879A96664k29512k9139k9274j46603j20824K2183P7939J63977M3202O2452n8714
$$ 196664 -32848 -61987 -91261 -237864 -358688 -336505 -258566 -94589 -51387 11065 -47649
15868d7649P8556j2456k2786n6418p1450K65248L0007j2446p4516O1846J26177
$$ -47649 30907 18451 -4335 -60753 -132203 133045 163052 150606 76090 137936 264113
15857B64113j27109n1288j7758m1266K641M5474J88476J00337J5870j08922j98005
$$ 264113 137004 85716 67958 26692 29333 74807 263283 363620 379490 270568 72563
15846G2563j84884O01Q9036P3192L2194M8403j67924P9989j00529o206m3366j51319
$$ 72563 -112321 -111720 -22684 50508 82702 131105 -36819 43170 -57359 -63565 -106931 -258250
15834b58250J76142Q2698n4134k0672K9935r4029j2116P5555P4395J66233L8516
$$ -258250 -82108 590 -53544 -74216 -44281 -138310 -150426 -74871 -476 165757 204273
15823B04273l8983j50951j53874j18698Q6247M1154K7886J71621J5813o6035j23016
$$ 204273 165290 14339 -139535 -258233 -171986 -130832 -102946 68675 84488 18453 -104563
15812a04563j8014J31464M7563m9955J13q4939j44178Q6124j10919j06164K20747
$$ -104563 -122577 8887 56450 6495 6608 -78331 -222509 -136385 -247304 -353468 -132721
15801a32721O5736o1108m9377J68180J5851j4549L2413k2909n3294o2078O6723
$$ -132721 -66985 -128093 -177470 -9290 6561 -7988 24425 1516 -51778 -113856 -47133
15790d7133K19106j38242k9606q3290o8674p841j0666O4411L4953r7366K048J6012
$$ -47133 171973 33731 4125 -79165 -147839 -155680 -166346 -101935 -66982 -164348 -162300 -146288
15778a46288Q7466p4689M453j0362o6317n7986N4497O772J0434l7443l1933r4567
$$ -146288 -58822 -133511 -129058 -139420 -205737 -263723 -209226 -202454 -192020 -229463 -261396 -355963
15766c55963J29653J08279j17228L0158r712Q3072J13748Q3309o8349j25048J51787
$$ -355963 -226310 -118031 -235259 -205101 -214813 -131741 -17993 65316 -3033 -128081 23706
15755B3706k2304m8753L3821j33895j38284j37945J62559J44927q0558J41506
$$ 23706 1402 -47351 -13530 -147425 -285709 -423654 -261095 -116168 -196726 -55220
15745e5220J15098m7104Q837J06011j52670j87196p1242j82661Q5692j30576J05811
$$ -55220 59878 12774 21611 127622 -25048 -212244 -283486 -466147 -380455 -511031 -405220
15734d05220J52856R1929J44972R5086m3506q510p3539j65746J44132K9629j9671
$$ -405220 -252364 -160435 -15463 79623 36117 27607 -45932 -211678 -67546 -37917 -57588
15723e7588Q3892J09689q9777n5280J54402R7661o4674k24260M6225K28127L5038
$$ -57588 26304 135993 46216 -9064 145338 242999 178325 -45935 290 228417 263455
15712B63455j13211k6244M9562k2573j83914n6159j3775k9073j01633M8292J43525
$$ 263455 150244 124000 173562 150989 -32925 -89084 -102859 -131932 -233565 -185273 -41748
15701d1748k7555L6609n132J06298J08711q0330l8233r3121m7661L229n6571r6538
$$ -41748 -69303 -32694 -37826 68472 177183 96853 58620 -34501 -82162 -78933 -135504 -232042
15689b32042n5091P9735L6760j49449N7857n5249M5670r9227k0980K2077J28509
$$ -232042 -287133 -207398 -170638 -320087 -262230 -317479 -271809 -371036 -392016 -369939 -241430
15678b41430n9338K1046K3989L1725K71824L4967j63740j54545N0821K9369Q4304
$$ -241430 -300768 -279722 -255733 -224008 47816 82783 -80957 -235502 -184681 -155312 -71008
15667g1008N226L8796J3082J06449O0001m1261j36309r8372J00723R15j3580P5982
$$ -71008 -65782 -26986 -13904 92545 152546 111285 -25024 -123396 -22673 -21758 -35338 40644
15655D0644m9565n7438N5223J42423o631j78192J6320O8194J20659j08987k3063
$$ 40644 -8921 -66359 -11136 131287 124656 -53536 -37216 30978 151637 42650 19587
15644A9587m6866K0460J0242R3064m1359O8705j773n045k5211n0026J42222m7298
$$ 19587 -27279 -6819 3423 96487 55128 123833 122060 117015 91804 41778 184000 136702
15632A36702j29053j29115R1098K10921Q668O6614j07951o4561r2995k45888Q7894
$$ 136702 7649 -121466 -30368 180553 189221 255835 147884 83323 -9672 -255560 -167666
15621a67666K43969L5016J7137n699J3582j47093k49110Q3384N3713L2931M7198
$$ -167666 76303 111319 128456 122757 136339 -10754 -259864 -176480 -122767 -89836 -42638
15610d2638k623K2059j1172K3573k50005p4392J41159p7879j48759J52107m1374
$$ -42638 -45261 -23202 -34374 -10801 -260806 -335198 -194039 -271918 -420677 -268570 -309944
15599c09944l6831P2667q790K29920J30680L4228m0707j51113j68646l9303m7797
$$ -309944 -346775 -274108 -282898 -52978 77702 111930 71223 -79890 -248536 -287839 -335636
15588c35636k6450J34389K63805K2077o4832j29548j726m0535P6659n4459k4990
$$ -335636 -362086 -227697 36108 58185 -6647 -136195 -137921 -178456 -101797 -156256 -181246
15577a81246P4969J04214L533r3320P0390j00676O682P681R6980K05579j78066
$$ -181246 -106277 -2063 1470 -91850 -21460 -122136 -115454 -107773 -10793 194786 16720
15566A6720j27549o4110j8579q3054n427j69522O5542J28187r7452k5799J36598
$$ 16720 -110829 -174939 -193518 -276572 -281999 -451521 -385979 -257792 -355244 -381043 -244445
15555b44445K49467j2211k8449M7911K6899j12778J846K8144L0592n760j50602
$$ -244445 5022 -7189 -35638 12273 39172 -73606 -71760 -43616 -13024 -18784 -169386
15544a69386k29897J8740J55983J92685l3O3027N3595j40022k69430j8548Q4630
$$ -169386 -399283 -380543 -224560 -31875 -31908 31119 84714 -55308 -324738 -343286 -258656
15533b58656j59190l048J59960j1542J31792L8630Q5697J7683n5199m3529j4891
$$ -258656 -417846 -420894 -260934 -272476 -140684 -102054 -16357 1326 -53873 -97402 -112293
15522a12293j07055L5266J12146O542p099l2259j49319J04633m1879o2277l7958
$$ -112293 -219348 -184082 -71936 -65394 -72493 -104752 -254071 -149438 -191317 -253594 -291552
15511b91552O9900J40853O8226R8126K06844L8664r9674j11131j26395j0614p0768
$$ -291552 -221652 -80799 -12573 85553 292397 331061 231387 120256 -6139 -16753 -87521
15500h7521L1619k7578p7401m6503j64899J73942J36993J69121l1201k25836l9094
$$ -87521 -55902 -83480 -160881 -207384 -372283 -198341 -61348 107773 76572 -149264 -188358
15489a88358P6136k2345j88464M70K8437O4324K3759J92155J35018R469L2386
$$ -188358 -112222 -134567 -323031 -322561 -294124 -229800 -206041 -13886 121132 130601 162987
15478A62987K8129j09836j06876J790M9186k6345l5532k455n1823L0377o5688
$$ 162987 191116 81280 -25596 -23806 25380 -965 -36497 -38952 -90775 -60398 -126086
15467a26086j99879K4357M4373K31268J92898J40713J29771J0238k40795j52024
$$ -126086 -325965 -301608 -257235 -25967 166931 307644 437415 447653 206858 54834
15457E4834m0965j9073J5762k3604J32601J3362P1776J85132n9967j59060l2330
$$ 54834 13869 -5204 10558 -13046 119555 132917 204693 389825 329858 170798 138468
15446A38468M9130j69645r4467q0385O8595r3821r4687J66212J17752q9173r1854
$$ 138468 187598 17953 -76514 -156899 -88304 -182125 -276812 -110600 7152 -82021 -173875
15435a73875p2850m7091L0938q5048M9086J74421J27679O7454k06379j59861m2879
$$ -173875 -246725 -293816 -262878 -347926 -298840 -124419 3260 70714 -135665 -295526 -338405
15424c38405j60327R8140J93669Q6500j05886j15452n7081N4734J20033k6389
$$ -338405 -498732 -400592 -206923 -120423 -226309 -341761 -398842 -344108 -224075 -250464
15414b50464K7514P2425J81417K2646J65654j35657k63471q33k8298M7705R2260
$$ -250464 -222950 -150525 30892 53538 219192 83535 -179936 -180769 -209067 -161362 -69102
15403f9102l5540p1126O3846K7488j29914N8396M1479Q4694k3962O5212q2912
$$ -69102 -104642 -175768 -111922 -84434 -214348 -155952 -114473 -29779 -53741 11471 -71441
15392g1441m6171J2456J845P7198L7166p941P5889P6392j9948J41r5669j11101
$$ -71441 -117612 -105156 -103311 -26113 11053 3112 79001 155393 135445 135586 39917 -71184
15380g1184J83920j8558r2465j9223P720J40586R8933l0193j05713j84651L4382
$$ -71184 112736 94178 1713 -17510 -9790 130796 229729 199536 93823 -90828 -56446
15369e6446L4802l2207j0775K7195N0518J3902J07353k9296j8512j34716q1074
$$ -56446 -21644 -53851 -64626 -37431 13087 26989 134342 105046 86534 -48182 -129256
15358a29256r954Q705m5337P8777j54883M2642K27389n5137m8875r9112R584k83686
$$ -129256 -139210 -130505 -175842 -97065 -251948 -209306 18083 -37054 -85929 -185041 -175457 -459143
15346d59143N1304L15617J4493n89J47380j83163j79503R3236k0583n1262j53691
$$ -459143 -407839 -92222 -77729 -78318 69062 -114101 -293604 -200368 -220951 -272213 -425904
15335d25904J45093J58037R8204J10720L5466j78043n8145j7937K08452K9736
$$ -425904 -280811 -122774 -24570 86150 121616 -56427 -114572 -132509 75943 105679
15325A05679j27355n2597p9231J8814k5073l4256l0270M9891J67559J74053J1582
$$ 105679 -21676 -74273 -153504 -134690 -159763 -194019 -224289 -174398 -6839 167214 178796
15314A78796j31112m3621j05289M8931k1517M990n7910J28175R2178n3183o4773
$$ 178796 47684 4063 -101226 -52295 -73812 -68822 -126732 1443 93621 40438 -24335
15303b4335J55939L8989k0654N4554q110k1280k9856j47146O0410k591k04108
$$ -24335 131604 170593 149939 204493 196383 175103 145247 -1899 58511 55920 -148188
15292a48188k58829J15021K41108J06974m2130j65523J6858j8230j3483k9113
$$ -148188 -407017 -291996 -50888 56086 13956 -151567 -134709 -152939 -166422 -195535
15282a95535p8580Q4674J02044J6541J190m0829j5407r139j40619J41979L6921
$$ -195535 -274115 -189441 -87397 -70856 -69666 -110495 -125902 -135041 -275660 -133681 -96760
15271i6760J16223l5191r3153Q7905J69297J5646m5543j02100K1467P5955O6261
$$ -96760 19463 -15728 -108881 -20976 148321 163967 118424 16324 37791 113746 180007
15260A80007j12810K7035O9118k36023j38178m1718j36392J17780Q6803K8713
$$ 180007 67197 94232 163350 -72673 -210851 -252569 -388961 -271181 -184378 -155665
15250a55665m5684Q2137R782r2264K3433O2444j999o7174N0760j08126J0648M4367
$$ -155665 -201349 -119212 -109430 -201694 -178261 -115817 -117816 -184990 -134230 -242356 -231708 -187341
15238a87341q7818k0643J6394J75953N9075j56736q0148n4039K00799K45289J070
$$ -187341 -275159 -295802 -279408 -103455 -44380 -201116 -281264 -335303 -134504 110785 111855
15227A11855k16793K8492o8920N9339p0498p2694J38240P6139R053r9182r9798
$$ 111855 -104938 -76446 -145366 -86027 -156525 -229219 -90979 -14840 -5787 -104969 -204767
15216b04767K0171O7110P9849J52247o0028j87634p8945J71991P8273J23241K06225
$$ -204767 -184596 -117486 -37637 114610 54582 -133052 -211997 -40006 38267 161508 367733
15205C67733r4745j73291j75371R9884M7717j7247j65461j7262p9416j83240l037
$$ 367733 272988 99697 -75674 24210 71927 54680 -110781 -128043 -207459 -390699 -393736
15194c93736J58920N8339M8196r96k1065J34102O7635j53691k68385R712J77050
$$ -393736 -234816 -176477 -128281 -129277 -150342 -16240 51395 -102296 -370681 -360969 -183919
15183a83919K01575k1198l6471O9305R081q7962j28869j13757L4756J82755J10340
$$ -183919 17656 -3542 -40013 29292 38373 -49589 -178458 -292215 -257459 -74704 35636
15172C5636P5904p5163j82904k8406O7927O7392J90490j37655j41555m8246M0611
$$ 35636 111540 36377 -146527 -174933 -107006 -39614 150876 13221 -128334 -176580 -135969
15161a35969J34229j59754j01425J28985J89884r6905r4387P9233K5704j43257
$$ -135969 -1740 -161494 -262919 -133934 55950 -40955 -135342 -56109 -30405 -173662
15151a73662J60283L01626j14845l15099k5287J48099R1440k5397n9364j36697
$$ -173662 -13379 288247 173402 -141697 -166984 -18885 72555 47158 -12206 -148903
15141a48903m1333m5770J5557J51487J6515L2713O8077p1142N6773j9320q9261
$$ -148903 -190236 -236006 -220449 -68962 -52447 -19734 48343 -22799 33974 14654 -74607
15130g4607q9913J28573Q9869j06064o7018j71190N3962J69151N6389p2381M4607
$$ -74607 -164520 -35947 53922 -52142 -119160 -290350 -236388 -67237 -10848 -83229 -38622
15119c8622J09868J10707m0945j68995m1949K47096L9288o9933j87302M7833R9721
$$ -38622 71246 181953 141008 -27987 -69936 177160 216448 146515 -40787 7046 106767
15108A06767J32459q8670k28399j37502j58791P7759R4568N8947R1313N1658n0707
$$ 106767 239226 150556 -77843 -215345 -374136 -296377 -201809 -142862 -51549 109 -50598
15097e0598R5418o43K2079N0865p1133J38814m5671j6675p3504N4014k7584l50
$$ -50598 44820 44177 66256 117121 45988 184802 139131 122456 48952 102966 75382 75032
15085G5032j88611j14735J00648j12051J74380K00553j3918L2052m3807J6999
$$ 75032 -113579 -228314 -127666 -239717 -65337 135216 121298 153350 109543 126542
15075A26542J5976p3207o767Q8545l8985J22952l9583p746J6612j26800j12900
$$ 126542 142518 69311 62544 151089 112104 235056 195473 187727 204339 77539 -35361
15064c5361k5471J09429K6706R9924O5711p5140J19900r2513j26792j80324k9883
$$ -35361 -60832 48597 75303 175227 240938 165798 285698 193185 66393 -113931 -143814
15053a43814J07662n8896l0101J76502J10573j56133O6282J5018J09772o9675
$$ -143814 -36152 -95048 -125149 51353 161926 5793 72075 87093 196865 127190
15043A27190O5667K5717j70519k20890L2132K44123M7564p7785j11627o1851L2849
$$ 127190 192857 218574 48055 -172835 -140703 103420 150984 73199 -38428 -100279 -67430
15032f7430j78794N1430J70587O431m6780j2268M3038p4219j61242P9367K79287
$$ -67430 -246224 -194794 -24207 -17776 -64556 -76824 -33786 -108005 -269247 -189880 89407
15021H9407J94641J60605j14137k71877j78064j80837K12805O1145k10304l4945
$$ 89407 284048 444653 330516 58639 -119425 -300262 -87457 -26312 -236616 -271561
15011b71561L058M2480J7908P0476j24925o4626R5486K61862K27949P2756J4121
$$ -271561 -268503 -226023 -208115 -137639 -262564 -327190 -231704 30158 258107 330863 344984
15000C44984n9909o6956m7672k02250k53609J79833Q7643q760n9830j41382j19578
$$ 344984 285075 218119 170447 -31803 -285412 -105579 -17936 -26696 -86526 -227908 -347486
14989c47486P3734J12003K60097J3572J4282K8634P5695o8042j41255j1532l0787
$$ -347486 -273752 -161749 98348 111920 126202 154836 230531 162489 21234 9702 -21085
14978b1085N3589R6614K2546j25578j9379L6926o8540K0167K3950j45334r0697
$$ -21085 32504 129118 151664 26086 6707 43633 -24907 -4740 19210 -126124 -216821
14967b16821J14723j01144m4016Q0661J0363J75167K90428J37967k80j67628k07059
$$ -216821 -102098 -203242 -247258 -166597 -156234 18933 309361 447328 447048 279420 72361
14956G2361q1433O4547j88073j49067K94066K67470j76515l37090K06449M8868
$$ 72361 -9072 55475 -132598 -281665 12401 279871 103356 -233734 -27285 21583
14946B1583J8271k3243k69537n6062N8265K7447L6771K0225J26690J9877q7790
$$ 21583 39854 16611 -252926 -308988 -250723 -223276 -186505 -166280 -39590 -19713 -107503
14935a07503p0695n7342o0201q992J21218r4397j07023Q428O6679K19773R4065
$$ -107503 -178198 -235540 -295741 -304733 -183515 -277912 -384935 -376507 -309828 -90055 4010
14924D010q8459k0992N1916J3274L3322J24397J16543n1247n4594M1663K3888
$$ 4010 -84449 -105441 -53525 -40251 -6929 117468 234011 182764 128170 169833 193721
14913A93721n6783l5572j5912K7255J71417k1130p0448k12975j30533k7683J04964
$$ 193721 136938 101366 85454 112709 284126 262996 192548 -20427 -150960 -178643 -73679
14902g3679K3168R6770j61266j83699J06045K74209L0412K08912K48388k81220
$$ -73679 -50511 46259 -115007 -298706 -192661 81548 111960 320872 569260 288040
14892B88040k77415m5273j52994m0906O8640n6628N8695N9817O5225j15975m3749
$$ 288040 10625 -34648 -187642 -228548 -159908 -216536 -157841 -98024 -32799 -148774 -192523
14881a92523o8063q5197L5537L17881J04271k0325P6887m6352j35687R721p4915
$$ -192523 -260586 -345783 -310246 7635 111906 91581 168468 122116 -13571 -3850 -78765
14870g8765n6017N2338o343K403J31926p3904k36893J07549K44608k21948j91674
$$ -78765 -134782 -82444 -88787 -86384 45542 -28362 -265255 -157706 86902 -135046 -326720
14859c26720O7766K21092R88L7161M3592p8438m076J78056N9057m2510M4558J2856
$$ -326720 -258954 -37862 -36874 287 43879 -34559 -38635 139421 198478 155968 200526 213382
14847B13382k18816J6975l9772j17189j45320L65J18545K7570K7972n4713J17942
$$ 213382 -5434 11541 -28231 -145420 -290740 -290375 -171830 -144260 -116288 -171001 -53059
14836e3059m7266n6897P0080n2899j31422j78182J07338J02178J05626R8536N4214
$$ -53059 -100325 -157222 -87142 -140041 -271463 -449645 -342307 -240129 -134503 -35967 18247
14825A8247Q9059l6182k9085k18010k4630R9991K52298J65381L1944j3742p4550
$$ 18247 107306 71124 42039 -175971 -200601 -100610 151688 317069 349013 335271 260721
14814B60721m358P658k11903Q9621L0414j16141k95824O135J00051J28591O1735
$$ 260721 256363 264021 52118 141739 172153 56012 -239812 -233677 -133626 -5035 56700
14803E6700k0531p788m7354Q9636J5946j26613K1169R5298l9181J16802j12012
$$ 56700 36169 28381 -18973 70663 86609 -40004 -18835 76463 37282 154084 42072
14792D2072k34334j7372J45170K0239M7851P4546J14373M8684J01004m7962j37580
$$ 42072 -192262 -209634 -64464 -44225 3626 78172 192545 241229 342233 294271 156691
14781A56691K672j80052q5090J32960N2393k7605P2734m9389J16029P1536j26492
$$ 156691 159363 -20689 -105779 27181 79574 51969 124703 75314 191343 262879 136387
14770A36387q6832l2263K40236K2953j79573r7757q837N2258O5317k05381j54910
$$ 136387 49555 17292 257528 280481 100908 3151 -5686 46572 111889 -93492 -248402
14759b48402n6545M115Q3577J63642l4110n3000M0634n004l6271M115m446o8628
$$ -248402 -304947 -300832 -217255 -53613 -87723 -140723 -100089 -105093 -141364 -137249 -141695 -210323
14747b10323J73705J15593o4455j18320R588J13397Q8820R8252l7572q5073n4804
$$ -210323 -36618 78975 14520 -103800 -94212 19185 108005 206257 168685 83612 28808
14736B8808O6155p1031L5143N8152j33862j40185l5441J52228R2000J64253O7344
$$ 28808 94963 23932 59075 117227 -16635 -156820 -192261 -40033 51967 216220 283564
14725B83564j40019q2042O2885j35981j3670n6544J73627J55482q8668k6560r6725
$$ 283564 143545 61503 124388 -11593 -25263 -81807 91820 247302 158634 132074 35349
14714C5349k0240p239M7535J01618K6870j72550K1901m5703K5868l9860j04303
$$ 35349 15109 7870 55405 157023 183893 11343 33244 -12459 13409 -26451 -130754
14703a30754r3609J3835L1893J40667l9541k566J98088r8474m8811J45568N0592
$$ -130754 -224363 -210528 -178635 -37968 -77509 -80075 118013 19539 -29272 116296 166888
14692A66888J18330j41742j41857m0946J38281k2909j78644p0655J75681J94822
$$ 166888 285218 143476 1619 -39327 98954 76045 -102599 -173254 2427 197249
14682A97249J59736k34565j87414J86530J6340J33039N5303l8528o8511P7982
$$ 197249 356985 122420 -64994 121536 137876 270915 326218 287690 219179 297161
14672B97161j13407k12178o1609L169O1936j03930n4309P5243r5853q9175K27560
$$ 297161 183754 -28424 -90033 -86864 -24928 -128858 -183167 -107924 -203777 -292952 -65392
14661f5392j5282M7621J13517K200Q0594m2685k08013l1801O3409Q2953o6726
$$ -65392 -80674 -33053 80464 82664 163258 120573 -87440 -119241 -55832 27121 -39605
14650c9605P5563m5218j05304J679Q1933l0336r0504k31630p5954K12901K34062
$$ -39605 35958 -9260 -114564 -112885 -30952 -61288 -151792 -383422 -459376 -246475 -12413
14639a2413k4819R1811P2553M6011M1350j17506r5013o77J11030n723q4761j83206
$$ -12413 -37232 54579 127132 173143 214493 96987 1974 1297 112327 106604 21843 -161363
14627a61363J5777J11685J64699n2301p3150R4688N4028O5517K6975o5944q3353
$$ -161363 -145586 -33901 130798 78497 5347 100035 154063 219580 246555 180611 97258
14616I7258P6869o0031J51996n7873j60275n6934j4435j42441J23006K55909j72424
$$ 97258 174127 114096 266092 208219 47944 -8990 -23425 -165866 -42860 213049 40625
14605D0625l1201J21064R9907k47639j11864R7180j0085n6190J4504L5060k4307
$$ 40625 9424 130488 230395 -17244 -129108 -31928 -42013 -98203 -83699 -48639 -72946
14594g2946J47213J73774j7712j3780J816k03678o9013O5751j07898k5616O4425
$$ -72946 74267 248041 230329 216549 218365 14687 -54326 11425 -96473 -122089 -57664
14583e7664j29860q2885J50744L5565K14565P646k19343q9360M7697N9526R5628
$$ -57664 -187524 -270409 -119665 -84100 130465 138111 -81232 -170592 -122895 -63369 32259
14572C2259J46741k5873j08294n759Q5373r3975r1347o4444P6368J81296R5883
$$ 32259 179000 153127 44833 39074 124447 30472 -60875 -125319 -48951 132345 228228
14561B28228q40j06467l9595P9137P9926l9268L587j56813K528M6937O9222N1600
$$ 228228 227388 120921 81326 160463 240389 201121 204708 47895 50423 97360 166582 218182
14549B18182k03551m4732K9230k3018j1059k5741J25138k6629L7404L6514j3659
$$ 218182 14631 -30101 -871 -23889 -34948 -60689 64449 37820 75224 111738 98079
14538I8079p2688n8053j42904o6258P1662L8493r306R1964r9119J859J20610R6213
$$ 98079 25391 -32662 -175566 -241824 -170162 -131669 -140975 -49011 -148130 -146271 -25661 70552
14526G0552J90542l9012l0336o3630r5709P5296j0120l9130O4232p6593m5359
$$ 70552 261094 222082 191746 128116 32407 107703 97583 58453 122685 46092 733
14515G33J9209k3250J50782j8647j57863L4371J25940o7785k1656l932m3422N2892
$$ 733 19942 -3308 147474 128827 -29036 5335 131275 63490 41834 37902 -5520 47372
14503D7372M756p1779O9247J3243l1354M7374q3779j19340K3512O6012j39165
$$ 47372 52128 -19651 49596 62839 31485 78859 -4920 -124260 -100748 -34736 -173901
14492a73901p4835J25953k6940N1562Q0478K0174J368j43059j40737m9515K18593
$$ -173901 -248736 -122783 -149723 -98161 -17683 2491 3859 -139200 -279937 -329452 -110859
14481a10859J39712m2133k9192Q459N4902j17787j82490J38944J04347J14649
$$ -110859 28853 -13280 -42472 -34013 20889 -96898 -279388 -140444 -36097 78552
14471G8552p7993l823J82872N0301j45096j46461p7572j57087l8303j0098j01804
$$ 78552 559 -3264 179608 229909 84813 -61648 -139220 -296307 -334610 -344708 -446512
14460d46512r7554P2512J17401J17110L7400J03807K13278R9945m9186r1297m1571
$$ -446512 -544066 -471554 -354153 -237043 -199643 -95836 117442 217387 168201 76904 35333
14449C5333J5793q7523J26522J40796p9417j02610j3090L677j2144k7082k93494
$$ 35333 51126 -36397 90125 230921 151504 48894 35804 39481 27337 255 -293239
14438b93239n8420J32878K19515j1335m5685J14313J24148q755n0968N5855L0772
$$ -293239 -351659 -218781 734 -10601 -56286 58027 182175 173420 122452 178307 209079
14427B09079M3753j75305o0801R157O9765O3220M0572j58858j16576j03573j07830
$$ 209079 252832 77527 16726 25883 95648 158868 199440 40582 -75994 -179567 -287397
14416b87397o913J20150J17937R4254J01558M8793J9515p6933j39937k10620q6305
$$ -287397 -294310 -174160 -56223 38031 139589 188382 207897 130964 -8973 -219593 -305898
14405c05898N6814L5215J05200P8821N0014k0958J6038M1902K89475J18465r3076
$$ -305898 -249084 -213869 -108669 -29848 20166 -792 15246 57148 346623 465088 372012
14394C72012o0334k60136m763q909M8980Q925j04973j02212O1841N4685K662P2701
$$ 372012 311678 51542 46779 37870 86850 95775 -9198 -111410 -49569 5116 7778 80479
14382H0479q7991q0113R0005J6246q2694J9725M3481j2452j30205l9593J11786
$$ 80479 -7512 -87625 2380 18626 -64068 -44343 -862 -13314 -143519 -183112 -71326
14371g1326l6463j14604J98098J12947j32038J2439M062O9481j01396k03313O1268
$$ -71326 -107789 -222393 -24295 88652 -43386 -30947 -26885 42596 -58800 -262113 -200845
14360b00845K02209l1134n9317p3418P5475l8248K5110P4309K88491M4561j81955
$$ -200845 1364 -29770 -89087 -162505 -87030 -125278 -100168 -25859 262632 307193 125238
14349A25238j46113r6427m0853J09481J64340P9773M9635j70451p3080j6373j22627
$$ 125238 -20875 -117302 -158155 -48674 115666 195439 245074 74623 1543 -14830 -137457
14338a37457j64390J09909J56672l7411k1887J32355P6232m6459J6321m0158L2944
$$ -137457 -301847 -191938 -35266 -72677 -94564 37791 114023 67564 83885 43727 76671
14327G6671K5308J38707j2171j36244j50769J26419O1345Q3646j16777r6494N4586
$$ 76671 101979 240686 228515 92271 -58498 67921 129266 212912 96135 -359 54227
14316E4227N382o4301O4214N3349K7660k1518j90194k49493r2992j95786L9579
$$ 54227 59609 -4692 59522 112871 140531 119013 -71181 -320674 -413666 -609452 -569873
14305e69873K21542L8963J70598K3503j33470J4538Q7096M9809Q1683R4754n5479
$$ -569873 -348331 -309368 -138770 -115267 -248737 -234199 -147103 -97294 -15611 79143 23664
14294B3664K24916Q1031j00804j14677j21051L4466L7583l5557o9545M3993j07898
$$ 23664 248580 329611 228807 114130 -6921 27545 65128 29571 -39974 4019 -103879
14283a03879k8300K15392J32660o2278j19210n9689k19282J12044K87858M9519
$$ -103879 -132179 83213 215873 153595 34385 -25304 -244586 -132542 155316 204835
14273B04835j61425j14298J3483M8270l654j38921p1065K328J2625L670l0319
$$ 204835 43410 -70888 -57405 -9135 -12789 -151710 -222775 -220447 -207822 -204152 -234471
14262b34471n348k4219L2094k0521P8089P5343Q2273j09412j19228P7293J16671
$$ -234471 -239819 -264038 -231944 -252465 -174376 -99033 -16760 -126172 -245400 -168107 -51436
14251e1436j5997K7630K37665N7861o7814j02444j9313p8860j02865n773K41043
$$ -51436 -67433 -39803 197862 255723 187909 85465 66152 -12708 -115573 -121346 119697
14240A19697P5724L1603r4535q1113J25836O1471M013J1991l5111r9393m5784
$$ 119697 195421 227024 132489 51376 177212 238683 242696 254687 219576 120183 74399
14229G4399j91974M3620J13714N3881J58840N7096j268j77309r5547K6206n9604
$$ 74399 -117575 -73955 39759 93640 252480 309576 308308 130999 35452 61658 2054
14218B054r6127Q4676J3366l5309L3498J11032J51441o8701k20850o8118R3061
$$ 2054 -94073 -9397 3969 -31340 2158 113190 264631 195930 -24920 -93038 23
14207B3K2779o9641J73905q3405N0914Q7625o7701Q7526J31717j30160j59175
$$ 23 22802 -46839 127066 43661 94575 182200 114499 202025 333742 203582 44407
14196D4407o0160p1234R2644L4887o8122j23894M5134k7907j11156j2270p2060
$$ 44407 -15753 -86987 5657 40544 -27578 -151472 -106338 -134245 -245401 -257671 -329731
14185c29731o5960O9961J76945k2934N5848O1479M4791n4374R7389l6821M2251
$$ -329731 -395691 -325730 -148785 -171719 -115871 -54392 -9601 -63975 33414 -3407 38844
14174C8844l5683p0594P8131o8235R6915N9622n5963N681l3567M6220m9148j63430
$$ 38844 3161 -67433 10698 -57537 39378 99000 43037 48718 15151 61371 12223 -151207
14162a51207j04270J26699J5524k1802J35733M6292k05994q6511n6753O9525P0440
$$ -151207 -255477 -128778 -113254 -135056 677 46969 -159025 -245536 -302289 -232764 -162324
14151a62324N2125J26451M8369J5031r2733j0274l3772o7287l7640j2091m8748
$$ -162324 -110199 16252 64621 79652 -13081 -23355 -57127 -124414 -162054 -174145 -222893
14140b22893p1488N9739K9817j5958l6273Q4701J66696k4913K5468Q9124j47742
$$ -222893 -294381 -234642 -204825 -220783 -257056 -172355 -5659 -30572 -5104 84020 -63722
14129f3722n9058L8209n7175J46791K5870O4015O4413r7745j2710O5123L8341
$$ -63722 -122780 -84571 -141746 5045 30915 94930 159343 61598 48888 114011 152352
14118A52352o252j67999j77395Q3532J0457m8882P0648M1174j33459j68119k1956
$$ 152352 146100 -21899 -199294 -115762 -105305 -154187 -83539 -42365 -175824 -343943 -365899
14107c65899n0945J88922K45508J74021k5965j8425r3632L9767J24976n9618o1915
$$ -365899 -416844 -227922 17586 191607 165642 147217 53585 93352 218328 158710 96795
14096I6795M7024J20462l6945j28083M1279J05323M802j13583l694J12270Q071
$$ 96795 143819 264281 227336 99253 140532 245855 250657 137074 133380 245650 253721
14085B53721j54132j62444K570L6266N2915m7705l1789m9168J11214Q0042N4969
$$ 253721 99589 -62855 -60285 -24019 28896 -18809 -50598 -99766 11448 91490 146459
14074A46459j39949N6629r917j33820l474K96994J57737j20155m2036j21802k252
$$ 146459 6510 63139 53222 -80598 -84072 212922 370659 250504 208468 86666 84414
14063H4414n6926j35698j62730m6060j14383Q9889P1807J23874q500j11207n3480
$$ 84414 27488 -108210 -270940 -317000 -431383 -341494 -269687 -145813 -154313 -265520 -319000
14052c19000k6885m2084M1936j6685R1921J49709r5272j03865P3178n0285l7118
$$ -319000 -345885 -387969 -346033 -362718 -270797 -121088 -216360 -320225 -247047 -297332 -334450
14041c34450J27807O232j0763J21375J00095p9131j43632J5082R3282M4249o4577
$$ -334450 -206643 -200411 -211174 -89799 10296 -68835 -212467 -197385 -104103 -59854 -124431
14030a24431j1280J25539J40000P9045n7967j41457j04720N756o7925Q2572J11624
$$ -124431 -135711 -10172 129828 208873 150906 9449 -95271 -89515 -157440 -74868 36756
14019C6756r1921n1554J16903J77954k18605N724k1055q2393m4545O3674j12812
$$ 36756 -55165 -106719 10184 188138 -30467 -24743 -45798 -128191 -172736 -109062 -221874
14008b21874L830J79361j30852R8043n919M0977J28923K00588J50431R8907j58953
$$ -221874 -218044 -38683 -169535 -71492 -77411 -36434 92489 293077 443508 542415 383462
13997C83462k59847l00591k33883J37897J35523j54687J71910J77222K9131j2905
$$ 383462 123615 -176976 -410859 -272962 -137439 -292126 -120216 57006 86137 73232
13987G3232j64877n3055J71524J2839R1270O6456L3927m0130j01736J07788p7794
$$ 73232 -91645 -144700 26824 39663 130933 197389 231316 191186 89450 197238 119444
13976A19444n1787P1950n372k7341r70l895q1347j7407l2014N9767N0307n8918
$$ 119444 67657 139607 134235 106894 105924 102029 20682 3275 -28739 31028 81335 22417
13964B2417P1357k043j00284k9355m6998J3863l6269N2880P9775N2911M0668J53280
$$ 22417 93774 91731 -8553 -37908 -84906 -71043 -107312 -54432 25343 78254 118922 272202
13952B72202K0283N7906k23557k90704k1913J11995o45j04604j11551P0750Q3656
$$ 272202 292485 350391 126834 -163870 -185783 -73788 -74433 -179037 -290588 -219838 -136182
13941a36182Q3548M1884L7968N3898j45882q7410M1336L6194J2317M5185P6182
$$ -136182 -52634 -10750 27218 81116 -64766 -152176 -110840 -74646 -62329 -17144 59038
13930E9038q9377j03801K9138N3525j59281Q1106K53285m4287o3183j00087P6219
$$ 59038 -30339 -134140 -105002 -51477 -210758 -129652 123633 79346 16163 -83924 -7705
13919g705q375p3462j00736l4948Q3573J9357K3335K00696k3827m6495k507o1456
$$ -7705 -16080 -89542 -190278 -225226 -141653 -122296 -98961 101735 77908 31413 28906 -32550
13907c2550j3581p4170R3725o2280r1641O1318k5371m5544j70305O4482R5336
$$ -32550 -46131 -120301 -26576 -88856 -180497 -119179 -144550 -190094 -360399 -295917 -200581
13896b00581L557j0307J95634J66938o4776j88733P155P6030J27755J15987o5378
$$ -200581 -197024 -207331 -11697 155241 90465 -98268 -91113 -15083 112672 228659 163281
13885A63281j66174j52464O3490N544n5732p760O2929p8509l5779J03198K3052
$$ 163281 -2893 -155357 -91867 -86323 -142055 -149815 -86886 -165395 -201174 -97976 -74924
13874g4924j75733Q352K2331K01140J50528M4281j6806j76151r8564j75166J39128
$$ -74924 -250657 -242305 -219974 -18834 131694 175975 159169 -16982 -115546 -290712 -151584
13863a51584R2954j21604K07413j3384q4616j2104j6576P3866Q5629M1321O3815
$$ -151584 -58630 -180234 27179 13795 -70821 -82925 -99501 -25635 59994 101315 165130
13852A65130N847l611M4653n3701O2276P3360N7841j06828j4513j11417j9036
$$ 165130 170977 167366 212019 158318 220594 293954 351795 244967 230454 119037 100001
13841A00001Q5882j37036K6058n9156o3429J6901j56238l3607O3989J12464M9747
$$ 100001 185883 48847 74905 15749 -47680 -30779 -187017 -220624 -156635 -44171 5576
13830E576k1772j52731L044J84404K68196J9292j61848j56120R9466R2822K5025
$$ 5576 -16196 -168927 -165883 18521 286717 306009 144161 -11959 87507 180329 205354
13819B05354m1230k47459j58104J1870j0182m1336N9552O3905r3653J12347O4074
$$ 205354 164124 -83335 -241439 -229569 -239751 -281087 -221535 -157630 -251283 -138936 -74862
13808g4862J1552p2551o2018q0515J68144J49363j34448n581l9573P0309l9186
$$ -74862 -63310 -135861 -197879 -278394 -110250 39113 -95335 -100916 -140489 -70180 -109366
13797a09366P644J07003K1714K7022j37310j05670N9509K2482K0867j07519p4293
$$ -109366 -101722 5281 26995 54017 -83293 -188963 -129454 -106972 -86105 -193624 -267917
13786b67917J31683J23391j49186o7752J93274Q3726m0461p3748l6830j11211
$$ -267917 -136234 -12843 -162029 -229781 -36507 47219 6758 -66990 -103820 -215031
13776b15031l0147n7156O2876J67707r4985M2095j1701j28942Q4765J87173k9657
$$ -215031 -245178 -302334 -239458 -71751 -166736 -124641 -136342 -265284 -180519 6654 -23003
13765b3003n4547L2517j2528l2386L688l699K2041K0420K9633r6198M0422n664
$$ -23003 -77550 -45033 -57561 -89947 -86259 -89958 -67917 -47497 -17864 -114062 -73640 -79304
13753g9304P2722k07398j27012n9147J99599K3567N0171J27640k5051j86593p3039
$$ -79304 -6582 -213980 -340992 -400139 -200540 -176973 -126802 838 -24213 -210806 -283845
13742b83845J55517J48732J50837l7016m9102q6965q9055j59014m7241J44399
$$ -283845 -128328 20404 171241 134225 85123 -1842 -90897 -249911 -297152 -152753
13732a52753J68842Q2894J0625j93397o7344M2971L2890K1249P4894m3683l960
$$ -152753 16089 98983 109608 -83789 -151133 -108162 -75272 -54023 20871 -22812 -26772
13721b6772k2717l7314Q1810j2641L8722p3479J69082J73201l0157j45464k49139
$$ -26772 -49489 -86803 -4993 -17634 21088 -52391 116691 289892 259735 114271 -134868
13710a34868j60938O4712j0314K3893j02325K6895P2048Q8831J72791r117j11305
$$ -134868 -295806 -231094 -241408 -217515 -319840 -292945 -220897 -132066 40725 31608 -79697
13699g9697J39972Q3658m0302n2542j94928j02181L9564M4141J14808q5711o1998
$$ -79697 60275 143933 103631 51089 -143839 -246020 -206456 -162315 -47507 -133218 -195216
13688a95216K61150P2822k35170k9081P4187j84792j7275J89116K11719M3462
$$ -195216 65934 138756 -96414 -125495 -51308 -236100 -253375 -64259 147460 190922
13678A90922j42379N8655O9242M7374o5970M2828M0137R2644j06756k97078J8739
$$ 190922 48543 107198 176440 223814 157844 200672 240809 333453 226697 -70381 -51642
13667e1642L4118j9618J87273J04464K7108k43001j43296N7459J78763J22709
$$ -51642 -17524 -37142 150131 254595 281703 38702 -104594 -47135 131628 254337
13657B54337r98j84326j17971P8654O0602p7418J16778J88236j5484j1066m5594
$$ 254337 253339 69013 -48958 29696 90298 12880 129658 317894 302410 291344 245750
13646B45750p0095j10367j21237m0799L6079L6019R0008r3721k9422K24485r4037
$$ 245750 175655 65288 -55949 -96748 -60669 -24650 65358 -28363 -57785 166700 72663
13635G2663l9632Q9569n8244P6947J68714j51524n6797K5567L1141l2088O0294
$$ 72663 33031 122600 64356 141303 310017 158493 101696 127263 158404 126316 186610
13624A86610p8144j3436J1301J77825k1333o318J28072j082j32281j30948j20555
$$ 186610 108466 95030 106331 284156 262823 256505 384577 383495 251214 120266 -289
13613b89j340K0552l9410l7045J4106J43618J58995k3313n9566j15565P8854J17420
$$ -289 -1629 18923 -20487 -57532 -43426 100192 259187 235874 176308 60743 139597 257017
13601B57017K1208j29094k13935O117J3896r5308j34828J08186l0279k01325P2793
$$ 257017 278225 149131 -64804 -58687 -44791 -140099 -274927 -166741 -197020 -398345 -325552
13590c25552J95253J57723k4582j52868j15331J30717J84046m97k25665n8726
$$ -325552 -130299 27424 2842 -150026 -265357 -134640 49406 48909 -176756 -235482
13580b35482K1232J70938r7251J16048J74098J64506o7265j40727M268k7743j6448
$$ -235482 -214250 -43312 -140563 -24515 149583 314089 246824 106097 110365 82622 66174
13569F6174q0134j71052N8370R2650M3459P2697J36160k45312o0583K0403r4962
$$ 66174 -13960 -185012 -126642 -33992 9467 82164 218324 -26988 -87571 -67168 -162130
13558a62130J0547J82429K51735L6778k601j78063k7966j43069j36165K05509
$$ -162130 -151583 30846 282581 319359 316758 138695 110729 -32340 -168505 37004
13548C7004O6623J28470J58620R1234L9165j92225j43957j57529k07358k9340
$$ 37004 103627 232097 390717 481951 521116 328891 184934 27405 -179953 -209293
13538b09293J04509p3279j7800p8838K5072R9306J56201p3301l8164N6926l4256
$$ -209293 -104784 -178063 -195863 -274701 -249629 -150323 5878 -67423 -105587 -48661 -82917
13527h2917o9313R8153N98M4974l1501Q2336Q9773Q0058J03859R5261m6793j63550
$$ -82917 -152230 -54077 -53479 -8505 -40006 42330 132103 212161 316020 411281 364488 200938
13515B00938k2199O9316K4153j0558R051l1600o7398j27553j09149q1802R0831
$$ 200938 178739 248055 272208 261650 270701 239101 171703 44150 -64999 -146801 -55970
13504e5970J87023O4287P8290L1016l1647k60768j39222J9896j1268j88295J98589
$$ -55970 131053 195340 273630 304646 272999 12231 -126991 -107095 -118363 -306658 -108069
13493a08069J46019K6505L9848P637O5683J1697k3633p0734k7608j09584k0302
$$ -108069 37950 64455 104303 111940 177623 189320 165687 94953 67345 -42239 -62541
13482f2541o5293Q3946j387O5282J8471j4666J35470M005R1427r2293l1435j7824
$$ -62541 -127834 -43888 -45275 20007 38478 23812 159282 163287 254714 162421 130986 113162
13470A13162N7370p2121p9240m61J60910j238m8418p2921l663J57221Q2052o0458
$$ 113162 170532 98411 19171 18710 179620 178382 129964 57043 53380 210601 292653 232195
13458B32195Q2584j9435P2632j8247j3871j01885j02724l1029o7048n1880m6995
$$ 232195 314779 295344 367976 349729 335858 233973 131249 100220 33172 -18708 -65703
13447f5703l4213J1982M312K5699J2542r8826q4934J73920N3359N050N6514p6216
$$ -65703 -99916 -87934 -83622 -57923 -45381 -144207 -229141 -55221 -1862 3188 59702 -16514
13435a6514n1785L4902K0383N0819O3241j8523l0551J64770R6009j06188L9693
$$ -16514 -68299 -33397 -13014 37805 101046 82523 51972 216742 312751 206563 246256
13424B46256K4952J43727j90768k30868m2736L990p3729r6923O7836J49980o1549
$$ 246256 271208 414935 224167 -6701 -49437 -45447 -119176 -216099 -148263 1717 -59832
13413e9832o6719J50390K61939Q8445Q6102j97420l36495N4038L8803l7480k8
$$ -59832 -126551 23839 285778 374223 460325 262905 -73590 -19552 19251 -18229 -18257
13402a8257J43623J84048j66815L3272J38136J56121m6418j31284m3236m5386
$$ -18257 125366 309414 142599 175871 314007 470128 423710 292426 249190 203804
13392B03804q9645J85175J6551q9018J12177q1285n6085P9927K23956p6136j5123
$$ 203804 114159 299334 315885 226867 339044 257759 201674 281601 505557 429421 414298
13381D14298j20015j30850j56447j8702O6846J50698j14518j27382J59273J84609
$$ 414298 294283 163433 6986 -11716 55130 205828 91310 -36072 123201 307810
13371C07810j44980k8222P9975N092r2146j8448p8117j60316j18284K06110k6041
$$ 307810 162830 134608 214583 219675 127529 109081 30964 -129352 -247636 -41526 -67567
13360f7567p3291J31443J18489j7848R1024n6433J9956j49836o1682k4572J57857
$$ -67567 -140858 -9415 109074 91226 182250 125817 145773 -4063 -65745 -90317 67540
13349F7540J77557K3528N1078q1788k6042j2867n8745o1942k5425R0384K4766
$$ 67540 245097 268625 319703 237915 211873 199006 140261 78319 52894 143278 168044
13338A68044l5406q6400K6532m0566j6300p2519l0568J22342Q276m8436j3128
$$ 168044 132638 46238 72770 32204 15904 -56615 -87183 35159 43435 -5001 -18129
13327a8129Q7291o2256Q825q6923r4179J64795J28328J33777o9455j47060j12492
$$ -18129 69162 6906 15731 -71192 -165371 -576 127752 261529 192074 45014 -67478
13316f7478K81042Q5353j40441q1668q059j31927n0990J41559N4555J50010O6584
$$ -67478 213564 298917 158476 76808 68749 -63178 -114168 27391 81946 231956 298540
13305B98540m8907j00459r0140n6629M0062m258j5284J46643l1778j86702J04558
$$ 298540 249633 149174 59034 2405 42467 38209 22925 169568 137790 -48912 55646
13294E5646J50580l3858m031Q4533M4167q281j21168K1235R8352k5038J4269M7736
$$ 55646 206226 172368 168337 252870 297037 288756 167588 188823 287175 262137 276406 324142
13282C24142l5446j10631j48076n0899p643J43911K02158J08810M8817J66365
$$ 324142 288696 178065 29989 -20910 -28553 115358 317516 426326 475143 641508
13272F41508P7990Q9255J30564M7107m598J44675J01920J03553n4393O285k25972
$$ 641508 719498 808753 939317 986424 981826 1126501 1228421 1331974 1277581 1283866 1057894
13261A057894k08879l1581M7105M4537q3670J4339o0377N6547K4404K9307L1102
$$ 1057894 849015 817434 864539 909076 825406 839745 779368 835915 860319 889626 920728
13250I20728M9991O2019N1796N0118P9320M4570J04207J5319j14583q7516O6428
$$ 920728 970719 1032738 1084534 1134652 1213972 1258542 1362749 1378068 1263485 1175969 1242397
13239A242397J69582O9794J55975J18647j40254l6782M1318j35646k98560k48526
$$ 1242397 1411979 1481773 1637748 1756395 1616141 1579359 1620677 1485031 1186471 937945
13229I37945K124J5285J12205J57570j05568j49806J25836J1332j06592M3590
$$ 937945 940069 955354 1067559 1225129 1119561 969755 1095591 1106923 1000331 1043921
13219A043921M7732r4912j73100L2720Q5021N8597J68681K02388K09238J60167
$$ 1043921 1091653 996741 823641 856361 941382 999979 1168660 1371048 1580286 1740453
13209A740453K17827r1604k09989j22729k07002j26484j12227j82433j95172m4879
$$ 1740453 1958280 1866676 1656687 1533958 1326956 1200472 1088245 905812 710640 665761
13199F65761j23780O508k0492J07344K0156k04972k08821j55771m3229J02519
$$ 665761 541981 548489 527997 635341 655497 450525 241704 85933 42704 145223
13189A45223o7740m7385N7211P4994J305P7802M0310L4023k6036j63656m0839
$$ 145223 77483 30098 87309 162303 163608 241410 281720 315743 289707 126051 85212
13178H5212K2540Q4495J32939L0798k01066K2022J44891K6942k59433J3973N2746
$$ 85212 107752 192247 325186 355984 154918 176940 321831 348773 89340 103313 156059
13167A56059j49232k9113J73998J18652Q3687q6697m1849k948J37882R2763P7822
$$ 156059 6827 -22286 151712 270364 354051 267354 225505 222557 360439 453202 531024
13156E31024k3779R8826J12797j20202j79075K4726k1294O469j90902j27074K8784
$$ 531024 507245 606071 718868 598666 419591 444317 423023 429492 238590 111516 140300
13145A40300n3002Q401K21399J38516m0359J39915L6870q5779k05964j78360j94369
$$ 140300 87298 95699 317098 455614 415255 555170 592040 506261 300297 121937 -72432
13134g2432p5220J21022O404P0601K643J6411k5900R380J72432j94889q3006l5933
$$ -72432 -147652 -26630 -20226 50375 53018 69429 43529 52909 225341 30452 -52554 -88487
13122h8487J69476O3820K6301J01075n9244n3517j5154j04416J00033l3505j22084
$$ -88487 80989 144809 171110 272185 212941 159424 144270 39854 139887 106382 -15702
13111a5702q9710J51699K4257Q9550M8236o8789N2534Q2712R5020J59060L4599
$$ -15702 -105412 46287 70544 160094 208330 139541 192075 274787 369807 528867 563466
13100E63466r9922j08089N6083R3002k42165j41042p1084J22751N8014J94099
$$ 563466 463544 355455 411538 504540 262375 121333 50249 173000 231014 425113
13090D25113j58246k925P0645k14536J3726J11253J53242j44443j5115P1552J44989
$$ 425113 266867 263942 334587 120051 133777 245030 398272 253829 238714 310266 455255
13079D55255j35706j17234j0411O4818M4050q1445J7428j1325j26887R1516o8483
$$ 455255 319549 202315 191904 256722 300772 219327 236755 225430 98543 190059 121576
13068A21576j02652K3585J81288j04186r1116M2678j26931M1147N6553J90960
$$ 121576 18924 42509 223797 119611 28495 71173 -55758 -14611 41942 232902
13058B32902j7796j54876r0789J6092J29501J518j6168J01077n18o1878J54874
$$ 232902 215106 60230 -30559 -14467 115034 116552 100384 201461 200943 139065 293939
13047B93939M9095J48348J1452j20544o1083m4749l3636l9897J71663J56701j1945
$$ 293939 343034 491382 502834 382290 321207 276458 242822 202925 374588 531289 519344
13036E19344j62925j80630k25480R2925L0901j21240K1621q7563J19098K11246
$$ 519344 356419 175789 -49691 43234 74135 -47105 -25484 -113047 6051 217297
13026B17297l0432r4161j7216k41850R2060L4282j91951j15051n5609l6524Q70
$$ 217297 186865 92704 75488 -166362 -74302 -40020 -231971 -347022 -402631 -439155 -438285
13015d38285j93174l2565n1261K9546K37325J15565J53763J64091m379j06911
$$ -438285 -631459 -664024 -715285 -685739 -448414 -332849 -179086 -14995 -19374 -126285
13005a26285k053J90566J87733Q6685J4848Q9937j74690j70335P2087J6802q9425
$$ -126285 -128338 62228 249961 336646 351494 441431 266741 96406 168493 185295 95870
12994I5870j00085j65324j88810J11287J46460J69986J74616J03964r3508n23
$$ 95870 -4215 -169539 -358349 -247062 -100602 69384 244000 347964 254456 253933
12984B53933r3269k8535M5776o8179J1264M8728L35138K41609Q1935l9167O81
$$ 253933 160664 132129 177905 109726 120990 169718 504856 746465 828400 789233 789914
12973G89914K33612K50849J42870o7188j61116k19506J27097Q9057n5525M5629
$$ 789914 1023526 1274375 1417245 1350057 1188941 969435 1096532 1185589 1130064 1175693
12963A175693K8431J15298M5735j99519l51142K1537L68655k22438k15015N7341
$$ 1175693 1204124 1319422 1365157 1165638 814496 836033 1204688 982250 767235 824576
12953H24576n1452N073Q042j22888J27195K96191K33460Q3635K01051L01178K11069
$$ 824576 773124 778197 786239 663351 790546 1086737 1320197 1403832 1604883 1906061 2117130
12942B117130J61135K2707Q135J50802O4812N5759Q4152j7242q6774p8271j83033
$$ 2117130 2278265 2300972 2309107 2459909 2524721 2580480 2664632 2647390 2560616 2482345 2299312
12931B299312j90447k1752j53173o9641P8011Q452p2772j75651K8095K2175N1680
$$ 2299312 2108865 2087113 1933940 1864299 1942310 1950762 1877990 1702339 1730434 1752609 1804289
12920A804289K26786J23007p0778j66254q6928N3853M6734J72074m9662P5800
$$ 1804289 2031075 2154082 2083304 1917050 1830122 1883975 1930709 2102783 2053121 2128921
12910B128921K1227n3534J7234j00694O1668n4161p0441Q4351O9021q0941o8717
$$ 2128921 2150148 2096614 2113848 2013154 2074822 2020661 1950220 2034571 2103592 2022651 1953934
12899A953934q2701J68913J95250J47524J09141j59966k75206R7781Q3807J62686
$$ 1953934 1871233 2040146 2235396 2382920 2492061 2332095 2056889 2154670 2238477 2401163
12889B401163k9077l18393j8432R6940r8013l5850N6543J83673K37361Q4328L4558
$$ 2401163 2372086 2053693 2035261 2132201 2034188 1998338 2054881 2238554 2475915 2560243 2594801
12878B594801l7227n3765L6775J39935n6308o528J27145j391n9539o2404J14241
$$ 2594801 2557574 2503809 2540584 2680519 2624211 2617683 2744828 2743437 2683898 2621494 2735735
12867B735735J54306O162J1632K9396O7090j10725M2218J74069J86154Q8381J15743
$$ 2735735 2890041 2896203 2907835 2937231 3004321 2893596 2935814 3109883 3296037 3384418 3500161
12856C500161L02934O2138j69494K23532L66572L918L114K83157J63483J56991
$$ 3500161 3803095 3865233 3695739 3919271 4285843 4289761 4292875 4576032 4739515 4896506
12846D896506K62120K58513J90351K46612L26783N48159N04302M70913O08604
$$ 4896506 5158626 5417139 5607490 5854102 6180885 6729044 7233346 7704259 8312863
12837H312863O86032Q56667J095450J356224J438576J525960J847051K444492
$$ 8312863 8998895 9855562 10951012 12307236 13745812 15271772 17118823 19563315
12829A9563315K791317L229346M542307N844721Q226323J1388434J5486138K0685334
$$ 19563315 22354632 25583978 30126285 35971006 44197329 55585763 71071901 91757235
12821I1757235K6776953L2336929L4548267L1648425K5746484J8614927Q073929
$$ 91757235 118534188 150871117 185419384 217067809 242814293 261429220 269503149
12814B69503149p972153k5099828l4247189l2789935k6060182j8709012j1499644
$$ 269503149 261530996 236431168 202183979 169394044 143333862 124624850 113125206
12807A13125206n016458J72332M665802P889829J0097621J1170165J1232918J0635991
$$ 113125206 108108748 108281080 112946882 120836711 130934332 142104497 153337415 163973406
12799A63973406R446546P594971N679653M732930N469656P903450J1181373J4231791
$$ 163973406 173419952 181014923 186694576 191427506 196897162 204800612 215981985 230213776
12791B30213776J6717703J7929588J6569802J2750047P078576J54362q096417
$$ 230213776 246931479 264861067 281430869 294180916 301259492 301413854 293317437
12784B93317437j6031710j9969714j9254567j5601688j1503669p589203m105198
$$ 293317437 277285727 257316013 238061446 222459758 210956089 203366886 199261688
12777A99261688j810067j027192j549012k603422m475946o736297r125893j0499883
$$ 199261688 197451621 196424429 194875417 192271995 187796049 181059752 171933859 161433976
12769A61433976j0219593q635121n315897l97354N631433J2835721K0353901K7151084
$$ 161433976 151214383 142579262 137263365 136866011 142497444 155333165 175687066 202838150
12761B02838150L1639842L1661529K6239166J7537315O718361p684451k4838591
$$ 202838150 234477992 266139521 292378687 309916002 316634363 308949912 284111321
12754B84111321l8926161m3003075l7493541k9289141k1969445j6428694j2235241
$$ 284111321 245185160 202182085 164688544 135399403 113429958 97001264 84766023
12747H4766023r339432p034164n354119m345399l817059l297398k847447k670997
$$ 84766023 75426591 68392427 63038308 58692909 54875850 51578452 48731005 46060008
12739D6060008k507927k383135k160649k000263j766779j735604j295650j150164
$$ 46060008 43552081 41168946 39008297 37008034 35241255 33505651 32210001 31059837
12731C1059837j463685j377789j209246j105896j092180r09882p79137q27846
$$ 31059837 29596152 28218363 27009117 25903221 24811041 23901159 23122022 22294176
12723B2294176q86398p66782o96133p31258o96710o44536o84773o35732n15904
$$ 22294176 21407778 20640996 19944863 19213605 18516895 17872359 17187586 16551854 16035950
12714A6035950m31139m53342o42958n55458k86809m04621m16448o07955k93606
$$ 16035950 15604811 15151469 14508511 13953053 13666244 13261623 12845175 12237220 11943614
12705A1943614k01266l92406m68095l81409j01645l38494l14850j58086l68305
$$ 11943614 11742348 11349942 10881847 10500438 10398793 10060299 9745449 9587363 9219058
12696I219058l88610m37127l01607r4920j22444j58095j89324j28424k47419k83507
$$ 9219058 8830448 8393321 8091714 7996794 7874350 7716255 7526931 7398507 7151088 6867581
12686F867581k73652j99237j11344k14967j85110j61644k09803n14809j56242
$$ 6867581 6593929 6394692 6283348 6068381 5883271 5721627 5511824 4997015 4840773
12677D840773K5774j39705k10636j86253l3562j05888j37596k80590k58196n9037
$$ 4840773 4866547 4726842 4516206 4329953 4296391 4190503 4052907 3772317 3514121 3455084
12667C455084j13385k21478k63568l2943Q52L2404m7888n7607J6831k25108o8219
$$ 3455084 3341699 3120221 2856653 2823710 2824562 2856966 2809078 2751471 2768302 2543194 2474975
12656B474975J26381q7859k80464l0968J69164k6144J00952j26055k09667j93267
$$ 2474975 2601356 2513497 2233033 2202065 2371229 2345085 2446037 2319982 2110315 1917048
12646A917048j6758J84764R0670P2047J38523k66614j69768j54810J5806k43949
$$ 1917048 1900290 2085054 2175724 2247771 2386294 2119680 1949912 1795102 1810908 1566959
12636A566959l25505k55860l88896j70272J12537N5008n8908o4564j4686q1544
$$ 1566959 1241454 985594 596698 426426 538963 593971 535063 470499 455813 374269
12626C74269J21774K36223J56431N6190j08496p3417j07311J8333j00841j15193
$$ 374269 496043 732266 888697 944887 836391 762974 655663 673996 573155 457962
12616D57962l4817m2374k03066m6383p4720R9884j06139M0816M9318k43986m6942
$$ 457962 423145 380771 177705 131322 56602 156486 50347 91163 140481 -103505 -150447
12605a50447m6882n0421K2169J97659K16925J31846J13270K27313J11798j9530
$$ -150447 -197329 -247750 -225581 -27922 189003 320849 434119 661432 773230 753700
12595G53700J7973k3339J25964P0420k0147P6264p5126j61882m3011J13841O2840
$$ 753700 771673 748334 874298 944718 924571 1000835 925709 763827 720816 834657 897497
12584H97497K538o1286J7667K42097M6378r5042j50933J5240j84261K5326j05362
$$ 897497 900035 838749 856416 1098513 1144891 1049849 898916 914156 729895 755221 649859
12573F49859j85145k2680K28075n3835p6587J45099K40845L68394K45606R1151
$$ 649859 464714 442034 670109 616274 539687 684786 925631 1294025 1539631 1630782
12563A630782N5224K7935j17843q6638O9652p0537k78426j08434M3042J45861
$$ 1630782 1686006 1713941 1596098 1509460 1579112 1508575 1230149 1121715 1164757 1310618
12553A310618n6753J0198k5341K9910M9482m9379j1319k77292k26329J05013J16323
$$ 1310618 1253865 1264063 1238722 1268632 1318114 1268735 1257416 980124 753795 858808 975131
12542I75131j4391L186J00943r2399r4397R0132o5889j39329j06984R2954L332
$$ 975131 960740 963926 1064869 972470 878073 968205 902316 762987 656003 748957 752289
12531G52289K9473k0563p4949p1166N6732O4714k8576l0437K0229M0650O0695
$$ 752289 781762 761199 686250 615084 671816 736530 707954 677517 697746 738396 799091
12520G99091j00026j48955R6935N878j00945j74599K3691j1438K47903N3523j43719
$$ 799091 699065 550110 647045 652923 551978 377379 401070 389632 637535 691058 547339
12509E47339l5061J42148j00024r2545O2224Q0524M5142M6172J5201j42139q6561
$$ 547339 512278 654426 554402 461857 524081 604605 649747 695919 711120 568981 482420
12498D82420p7050j17028r5379R0501l953N4221l1171p9697L5359J39382J10162
$$ 482420 405370 288342 192963 283464 279511 333732 302561 222864 258223 397605 507767
12487E07767k8358q1266o691M5446n7668N405j05734j03946K17221J33868j22186
$$ 507767 479409 398143 391452 436898 379230 384635 278901 174955 392176 526044 403858
12476D03858o7638K08412j10839r6295m6175J26166M8279j23765p7670M1399J00090
$$ 403858 336220 544632 433793 337498 291323 417489 465768 342003 264333 305732 405822
12465D05822k26557j17747J3927j11978m7956K82310J77516K4831J45646J978
$$ 405822 179265 61518 75445 -36533 -84489 197821 375337 400168 545814 547792
12455E47792l4769L166p4837o1909l3397j25481o8885J02368j450J3407r3982
$$ 547792 513023 516189 441352 379443 346046 220565 151680 254048 252598 266005 172023
12444A72023J09176J10338L1184k5278o6017L1169q3000J00407M3457N1487j3917
$$ 172023 281199 391537 422721 397443 331426 362595 279595 380002 423459 474946 461029
12433D61029k16105j49835J45828N4322r7456L2532J30451m4226o0185l5108o6129
$$ 461029 244924 95089 240917 295239 197783 230315 360766 316540 256355 221247 155118
12422A55118l8899j01882l4447J32787P4384L090R775L9512R5306J45770j21474
$$ 155118 116219 14337 -20110 112677 187061 190151 199926 239438 334744 480514 359040
12411C59040m3423o4302k05853j75284M260O2455L9343J59340O838O8817K0721
$$ 359040 315617 251315 45462 -129822 -125562 -63107 -23764 135576 142414 211231 231952
12400B31952l1750l3181J31040L6538M5787q0460J2049j21012p632M2662j6921
$$ 231952 200202 167021 298061 334599 380386 299926 311975 190963 183331 225993 209072
12389B09072l1949K9061L4828j0450o219M7712K5005J02810J36781k1028j62544
$$ 209072 177123 206184 241012 230562 224343 272055 297060 399870 536651 515623 353079
12378C53079j05168j53452K2463J271N2211J36870J92474j79178l7631Q1629J36704
$$ 353079 247911 94459 116922 118193 170404 307274 499748 320570 282939 364568 501272
12367E01272N3996p0243l3338J81055Q1936J76874J45324J45596J32172P9412
$$ 501272 555268 485025 451687 632742 714678 891552 1036876 1182472 1314644 1394056
12357A394056R7546J64051J49243j85425l79205j76105o161r7692j75730j71062
$$ 1394056 1491602 1655653 1804896 1619471 1240266 1064161 1058000 960308 784578 613516
12347F13516j29946J39033K6465K1088M078P773K77638K81668P0777K0437J62039
$$ 613516 483570 622603 649068 670156 674234 682007 959645 1241313 1312090 1332527 1494566
12336A494566j11095J680R7362K07861J97843Q2000j1477r5146p5277o8148j13100
$$ 1494566 1383471 1385151 1482513 1690374 1888217 1970217 1958740 1863594 1788317 1720169 1607069
12325A607069l5306J06526j84655k41338m3298J39217o3095k05641m9560n227
$$ 1607069 1571763 1678289 1493634 1252296 1208998 1348215 1285120 1079479 1029919 1024692
12315A024692k48063p2419Q7170Q1030J91015k0822q5733J2298p2196J4300J53297
$$ 1024692 776629 704210 791380 872410 1063425 1042603 956870 969168 896972 911272 1064569
12304A064569N1365K01500K71873J35928P5693R3611j33771k57580k48076l17500
$$ 1064569 1115934 1317434 1589307 1725235 1800928 1894539 1760768 1503188 1255112 937612
12294I37612k36170n2192q9001k3348K4018q3202P0766J69357j15317m2881J6307
$$ 937612 701442 649250 560249 536901 560919 477717 548483 717840 602523 559642 575949
12283E75949j85578J53024j31463k48152j7720N5896J28448j38438n2914j32948
$$ 575949 390371 543395 411932 163780 146060 201956 330404 191966 139052 6104
12273F104J4090n0367L3100J40102J38992p2350J25885n6258L3024J35551p877
$$ 6104 20194 -30173 2927 143029 282021 209671 335556 279298 312322 447873 439996
12262D39996j71242m0196k03943Q044J19313J00440j74138o6674n386J42619J16925
$$ 439996 268754 228558 24615 32659 151972 252412 78274 11600 6214 148833 265758
12251B65758N7016r7884q7307J9352M84k2166p0590n7467p8545J8152P9382o761
$$ 265758 322774 224890 137583 156935 157419 135253 64663 7196 -71349 -53197 26185 19424
12239A9424k3026P7254O5448k38982L5955J22669P5679j38038M4088J3613O2983
$$ 19424 -3602 73652 139100 -99882 -63927 58742 134421 -3617 40471 54084 117067
12228A17067K7002j13597j1684R6945m7425j31191j25528J3996J03174O9965J52087
$$ 117067 144069 30472 18788 115733 68308 -62883 -188411 -174415 -71241 -1276 150811
12217A50811K26490n2915j64867q6316J08595J44206P3651J6025r1535m1943r7879
$$ 150811 377301 324386 159519 73203 181798 326004 399655 415680 324145 282202 184323
12206A84323p5579N4726Q0497j8537K7550K5854j19410j39221j44678j444J18624
$$ 184323 108744 163470 243967 225430 252980 278834 159424 20203 -124475 -125919 -7295
12195g295r5671N6918P6848M7032O2898M5985N4878J25735Q583L5165j7662j22158
$$ -7295 -102966 -46048 30800 77832 140730 186715 241593 367328 375911 411076 393414 271256
12183B71256J747O1470O8258L4736k326m7300k1259o8100p4234r5825r7385j12651
$$ 271256 273003 334473 402731 437467 435141 387841 366582 298482 224248 128423 31038 -81613
12171h1613k8863M5050K53354M9691O4494j9885R419j14653j10359k1132J06372
$$ -81613 -110476 -65426 187928 237619 302113 282228 291647 176994 66635 45503 151875
12160A51875J2730j39898N9448j2754J32057M3828j7344j03454k31003p369J05165
$$ 151875 164605 24707 84155 71401 203458 247286 229942 126488 -104515 -111884 -6719
12149f719N2647P7367k0933K8648Q2463P8483J58571o5529k5907M9513R7500K04307
$$ -6719 45928 123295 102362 131010 213473 291956 450527 384998 359091 408604 506104 710411
12137G10411P9693k7426K44977p7776k05653j46960j38671q536M2976j53120k11351
$$ 710411 790104 762678 1007655 929879 724226 577266 438595 430059 473035 319915 108564
12126A08564J5791R0663L6667N293r8015M2547J41231j33361j27119j41044l6550
$$ 108564 124355 215018 251685 256978 158963 201510 342741 209380 82261 -58783 -95333
12115i5333J07461J38978K43597P9r7838q1792j32435j44785J37164l0683j1094
$$ -95333 12128 151106 394703 394782 296944 215152 82717 -62068 75096 44413 33319
12104C3319k3749L8080J85610J26539k6633o3370q2373J97610J25455O1735K57484
$$ 33319 9570 47650 233260 359799 333166 269796 187423 385033 510488 572223 829707
12093H29707Q0208r7691m3038J07192j8665o1022j21860n2729j40295O7776k3193
$$ 829707 909915 812224 769186 876378 857713 796691 674831 622102 481807 549583 526390
12082E26390j34113k20448o9273P5807j1614k17617m9158l8688J14166n0629j11829
$$ 526390 392277 171829 102556 178363 166749 -50868 -100026 -138714 -24548 -75177 -187006
12071a87006L5905O1736J23926L24904J14032q6627m5143J18345j00462p8505
$$ -187006 -151101 -89365 34561 359465 473497 386870 341727 460072 359610 281105
12061B81105j89184o8318r6440R4789O6016j664j22907J1160J35190N6772m5596
$$ 281105 91921 23603 -72837 21952 87968 86304 -36603 -25443 109747 166519 120923
12050A20923R8317M6550n0355O8331j7854P0092M4878p5065j7833q9421l0168
$$ 120923 219240 265790 215435 283766 265912 336004 380882 305817 287984 198563 168395
12039A68395p830j29976L7613J36791M6615l3124R3332r9546j26653K96348p584
$$ 168395 160565 30589 68202 204993 251608 218484 311816 212270 85617 381965 374381
12028C74381k20735n4174p1408j34119J04972J04740n6192r1062j57541m7101
$$ 374381 153646 99472 28064 -106055 -1083 103657 47465 -43597 -201138 -248239
12018b48239K02041J22599J29337K9472j01493r6451J607K4586o5874k6646J23893
$$ -248239 -46198 76401 205738 235210 133717 37266 38873 63459 -2415 -29061 94832
12007I4832l2017k4282R0620j63291j9063J44439J01156j64315R8546P2011r8816
$$ 94832 62815 38533 129153 -34138 -53201 91238 192394 28079 126625 198636 99820
11996I9820n9025K5890J15516m2720j23988J2498L8199q3747l496J17874o9773
$$ 99820 40795 66685 182201 139481 15493 27991 66190 -17557 -21053 96821 27048
11985B7048J77093J0073N597k5335k0752R4476N7208n4877q9472m3638M0530j01249
$$ 27048 204141 214214 219811 194476 173724 268200 325408 270531 181059 137421 177951 76702
11973G6702L5952j24597r345Q0239k0382J71819J02444N5941o3022q341Q762K11142
$$ 76702 112654 -11943 -21288 58951 38569 210388 312832 368773 305751 297410 306172 517314
11961E17314J93912J65958J69325J52138J96992J58733j0936O620J32545j09214
$$ 517314 711226 877184 1046509 1198647 1395639 1554372 1543436 1550056 1682601 1573387
11951A573387k17094k02980n4484j9840p1404Q9333j03775q2772J6285J03361
$$ 1573387 1356293 1153313 1098829 1078989 1007585 1096918 993143 910371 926656 1030017
11941A030017M9509K0428L994K09762M9636m1190j9104k0766R7931m0886L1807
$$ 1030017 1079526 1099954 1103948 1313710 1363346 1322156 1303052 1282286 1380217 1339331 1371138
11930A371138J64838N3700N1253J20766O0983J78205J1810r6589m8483m8481j87587
$$ 1371138 1535976 1589676 1640929 1761695 1822678 2000883 2012693 1916104 1867621 1819140 1631553
11919A631553j38398M5295j80184j16733k25853o1438k4763P2309J72488k7212
$$ 1631553 1493155 1538450 1358266 1241533 1015680 954242 929479 1001788 1174276 1147064
11909A147064j52726k71612j24744J64234R3780j01439p29J60946J21528R2001
$$ 1147064 994338 722726 597982 762216 855996 754557 753828 914774 1036302 1128303
11899A128303J94012L53070R8986l9686j10551j42995k15154k37778n1670P7591
$$ 1128303 1322315 1675385 1774371 1734685 1624134 1481139 1265985 1028207 976537 1054128
11889A054128l7872k86011k42831o728J11879L4099j5723l5363J63887J4302J6619
$$ 1054128 1016256 730245 487414 480686 592565 626664 610941 575578 739465 753767 770386
11878G70386j65188j80058j15044R827P060Q5666k2591n1448r4491l2844j24729
$$ 770386 605198 425140 310096 319923 326983 412649 390058 338610 244119 211275 86546
11867H6546Q5142N9861K42m3980j6380J3389k5998L2277l4023N518k7722L6775
$$ 86546 171688 231549 231791 187811 171431 184820 158822 191099 157076 162594 134872 171647
11855A71647R2836O0160L579r7633j41948K2789L00993O2214j19286j53499j22727
$$ 171647 264483 324643 328222 230589 88641 111430 412423 474637 355351 201852 79125
11844G9125R7896q8261j27229N2838L75111J18891N2857l7865j10023M7731R1651
$$ 79125 177021 88760 -38469 14369 389480 508371 561228 523363 413340 461071 552722
11833E52722n32M912j96609k29348N7903p5671k79974k45394J94425K85946J03284
$$ 552722 552190 557102 360493 131145 189048 113377 -166597 -411991 -217566 68380 171664
11822A71664j77648k820K28813J37624j03898j19229L4173J24954j29407j25041
$$ 171664 -5984 -8804 220009 357633 253735 134506 168679 293633 164226 39185
11812C9185j17381K00024K28059k2763o5912P4616m6141j09995P5688k4948j60676
$$ 39185 -78196 121828 349887 327124 261212 335828 289687 179692 255380 230432 69756
11801F9756j18821O1203J91979J53720Q0638p1008k00475m1390Q1306p8179p9592
$$ 69756 -49065 12138 204117 357837 438475 367467 166992 125602 206908 128729 49137
11790D9137J3345K9874M8825O5208n6595n0882K51854J72095o0390J0928q8544
$$ 49137 62482 92356 141181 206389 149794 98912 350766 522861 462471 473399 384855
11779C84855k20760p8301j7963K9639N0543k0278l0212K7482J32361M4176J14943
$$ 384855 164095 85794 67831 97470 148013 127735 97523 125005 257366 301542 416485
11768D16485O5627j82046j07313O8551j7825N4633N296j44310j6829O9190R8448
$$ 416485 482112 300066 192753 261304 243479 298112 303408 159098 142269 211459 309907
11757C09907J29158l0621P6124j9213q0843j61210n6022n3472p8323J07503K2459
$$ 309907 439065 408444 484568 465355 384512 223302 167280 113808 35485 142988 165447
11746A65447j78915p6099M3471j23437j46063J47732J52570j2885j36017j57920
$$ 165447 -13468 -89567 -46096 -169533 -315596 -167864 -15294 -28179 -164196 -322116
11736c22116R9628J81450Q8386k9849J47062j95485m4979j83605k43634J27788
$$ -322116 -222488 -41038 47348 17499 164561 -30924 -75903 -259508 -503142 -375354
11726c75354j15886j82919j51059m2430r3999J68587L96816L14476R6164J11328
$$ -375354 -491240 -674159 -825218 -867648 -961647 -793060 -396244 -81768 14396 125724
11716A25724J97753J28229O2069k6630p2522j16888j4182K8524j73821r302j84588
$$ 125724 323477 451706 513775 487145 414623 297735 283553 312077 138256 128954 -55634
11705e5634P1349J12313J81424J52796R1431j47646L5686j23482j5716Q444j64098
$$ -55634 15715 128028 309452 462248 553679 406033 441719 318237 302521 310965 146867
11694A46867L2869m195J70260K18324J64505r1923K3658J81700L51590K66990
$$ 146867 179736 175541 345801 564125 728630 636707 660365 842065 1193655 1460645
11684A460645N1548k8361j67125K8440J89432R7509j26447j66654r1777q8097
$$ 1460645 1512193 1483832 1316707 1345147 1534579 1632088 1505641 1338987 1247210 1159113
11674A159113K2095k00394j07373J10663k681l2490j4279o9653Q3559J89586N7438
$$ 1159113 1181208 980814 873441 984104 981423 948933 934654 865001 948560 1138146 1195584
11663A195584Q784J33723K71178J01252K2135K25693L69993K3842r862K25453
$$ 1195584 1204368 1338091 1609269 1710521 1732656 1958349 2328342 2352184 2342322 2567775
11653B567775K03582j06265R410J68262O3401P6263J70389n0572k48727j18091
$$ 2567775 2771357 2665092 2674502 2842764 2906165 2982428 3152817 3102245 2853518 2735427
11643B735427q201j96640p1190j92932j29171k6681J6805j42355j79481j13517
$$ 2735427 2727226 2530586 2459396 2266464 2137293 2110612 2127417 1985062 1805581 1692064
11633A692064l1519O9826p1299j12521P9266j151m0154J10064K24707J12123J33681
$$ 1692064 1660545 1730371 1659072 1546551 1625817 1624666 1584512 1694576 1919283 2031406 2165087
11622B165087m6841q3546M6885N3507Q6111m4902n7635J62842K0828P847j49054
$$ 2165087 2118246 2034700 2081585 2135092 2221203 2176301 2118666 2281508 2302336 2310183 2161129
11611B161129j28381N0250J66080M9312L6153k5429L7060k16145q3218M0895Q970
$$ 2161129 2032748 2082998 2249078 2298390 2334543 2309114 2346174 2130029 2046811 2087706 2096676
11600B096676l1023j19643J45568R3560O7007m1301J60581J08429m4536j02097
$$ 2096676 2065653 1946010 2091578 2185138 2252145 2210844 2371425 2479854 2435318 2333221
11590B333221Q9157N2960J04614J22407O216J78938J13452p4006p3785k2603R1149
$$ 2333221 2422378 2475338 2579952 2702359 2708575 2887513 3000965 2926959 2853174 2830571 2921720
11579B921720J09383o6377n4022J78925N7861l5909J88994M7852O9174o772k7803
$$ 2921720 3031103 2964726 2910704 3089629 3147490 3111581 3300575 3348427 3417601 3410829 3383026
11568C383026K26460K00473K86674J75373N9223O9182K72887L25990K51395J04892
$$ 3383026 3609486 3809959 4096633 4272006 4331229 4400411 4673298 4999288 5250683 5355575
11558E355575K52659L10119K08168K49896M05856O92367O19138M56872N81150
$$ 5355575 5608234 5918353 6126521 6376417 6782273 7474640 8093778 8550650 9131800
11549I131800Q40318J128578J492464J689203J770899K143272K585093L269464
$$ 9131800 9972118 11100696 12593160 14282363 16053262 18196534 20781627 24051091
11541B4051091L965243N303441P125430R435463J2897341J7586284K3622900K9833183
$$ 24051091 28016334 33319775 40445205 49880668 62778009 80364293 103987193 133820376
11533A33820376L4669435L5723638L2649161K7012461J8791098N595870j1194303
$$ 133820376 168489811 204213449 236862610 263875071 282666169 288262039 277067736
11526B77067736k6387931l3410913l1949787k6415432j9860451j2884404n958984
$$ 277067736 250679805 217268892 185319105 158903673 139043222 126158818 120199834
11519A20199834M64369N096581Q470937J0679316J1475452J0300797P756493M629412
$$ 120199834 120664203 125760784 134231721 144911037 156386489 166687286 174443779 179073191
11511A79073191K155186O27733R857O50050L016891P323586J3190921J9119826
$$ 179073191 181228377 181856110 181865967 182516017 185532908 192856494 206047415 225167241
11503B25167241K3563750K4948651K3051644J7502239Q667578k650603j4084145
$$ 225167241 248730991 273679642 296731286 314233525 322901103 320250500 306166355
11496C06166355k2339979k5174848k2997990j7327185j0896625n749435k816203
$$ 306166355 283826376 258651528 235653538 218326353 207429728 201680293 198864090
11489A98864090j534269k500728m594678o966299r128322j0233944j1032095j0674104
$$ 198864090 197329821 194829093 190234415 183268116 174139794 163905850 152873755 142199651
11481A42199651q652981n194070m02762N294480J1557505J8050630K3536418K7417127
$$ 142199651 133546670 128352600 127949838 133244318 144801823 162852453 186388871 213805998
11473B13805998K7686568K3389062J5827469O198184n270871j8982913l1394322
$$ 213805998 241492566 264881628 280709097 286907281 281636410 262653497 231259175
11466B31259175l7722608l5466410k8511352k1448988j5790977j1738894q744092
$$ 231259175 193536567 158070157 129558805 108109817 92318840 80579946 71835854
11459G1835854o638665n205282m253072l729993l315197k958677k614937k369771
$$ 71835854 65197189 59991907 55738835 52008842 48693645 45734968 43120031 40750260
11451D0750260k319695j922888j746991j756567j488318j356343j202643j218476
$$ 40750260 38430565 36507677 34760686 33004119 31515801 30159458 28956815 27738339
11443B7738339j268520j025709j168751j033489r51065o85125p76465q63194p12933
$$ 27738339 26469819 25444110 24275359 23241870 22290805 21605680 20829215 19966021 19253088
11434A9253088m21072o28288o47925o24516n25389n33568n26025n22789m50210
$$ 19253088 18832016 18203728 17555803 16931287 16405898 15872330 15346305 14823516 14373306
11425A4373306m71878l72618m90243n10755n85596n73717l25876k21069l33404
$$ 14373306 13901428 13528810 13038567 12527812 11942216 11368499 11042623 10821554 10488150
11416A0488150l41998k30078k18564p6563l32114k79064j77147k97852l30884
$$ 10488150 10146152 9916074 9697510 9620947 9288833 9009769 8832622 8534770 8203886
11407H203886l76704l40164L198j33150j79979j44272l13627n39367l61697j97069
$$ 8203886 7827182 7487018 7490216 7357066 7177087 7032815 6719188 6179821 5818124 5621055
11397E621055q5213j27857J34301j26932l75819k76065j98863j68537l9899j13339
$$ 5621055 5535842 5407985 5542286 5415354 5039535 4763470 4564607 4396070 4356171 4242832
11387D242832j47132k21229j06500j93266r8881K8768k50934l07442j40842j59268
$$ 4242832 4095700 3874471 3767971 3574705 3475824 3504592 3253658 2946216 2805374 2646106
11377B646106j53763M2373O4932N191L8115j32968j8280R8444l9529k17358q5901
$$ 2646106 2492343 2534716 2599648 2604839 2642954 2509986 2491706 2590150 2550621 2333263 2247362
11366B247362k11728r1387k00962j75187j54409j45259M0530J38925q9782L3198
$$ 2247362 2035634 1944247 1743285 1568098 1413689 1268430 1308960 1447885 1358103 1391301
11356A391301M0982J7803j20472n554j15421j79319j2184j96006k73859o9998
$$ 1391301 1432283 1450086 1329614 1324060 1208639 1029320 1017136 821130 547271 477273
11346D77273j18147j15216k6520K0486R2194P8753J00048j7257q2726J59653K04406
$$ 477273 359126 243910 217390 237876 330070 408823 508871 491614 408888 568541 772947
11335G72947O6660j70654q6168n3913K2077o5440r107j33836r7156M5617q3077
$$ 772947 839607 668953 582785 528872 550949 485509 476402 342566 245410 291027 207950
11324B07950j48450R307J71920K0805j03736J00754j43555J1300m4218k53406
$$ 207950 59500 68807 240727 261532 157796 258550 114995 126295 82077 -171329
11314a71329J9323J22178O7655J24729K03773K47725P1648o9072J29352K02468
$$ -171329 -152006 -29828 37827 162556 366329 614054 685702 616630 745982 948450
11304I48450L8989o3144N7045J26054M5186q523j35008j74839R2921L04507J45743
$$ 948450 987439 924295 981340 1107394 1152580 1144057 1009049 834210 927131 1231638 1377381
11293A377381j3576o6836l01858k82298m939L0616j19881r0664j17067J26310
$$ 1377381 1363805 1296969 995111 712813 707874 738490 618609 527945 410878 537188
11283E37188J91066J15834J77691L59859J18168J05912J59420P6525k24361q8054
$$ 537188 728254 844088 1021779 1381638 1499806 1605718 1765138 1841663 1617302 1529248
11273A529248p7983K0344K5088r4818r2466n357L7297J7548K2852n8755r0708
$$ 1529248 1451265 1471609 1496697 1401879 1309413 1304056 1341353 1358901 1381753 1322998 1232290
11262A232290n1783J1385p3120j33000L3983N7523J12547J33936j16637l0795
$$ 1232290 1180507 1191892 1118772 985772 1019755 1077278 1189825 1323761 1207124 1176329
11252A176329N6993q009j97018P480L17455L59483L85224O77704Q28868Q03051
$$ 1176329 1233322 1225313 1028295 1035775 1353230 1712713 2097937 2775641 3604509 4407560
11242D407560K91755L26597L76854J31275m76869j084763j224133q10692m12074
$$ 4407560 4699315 5025912 5402766 5534041 5057172 3972409 2748276 1937584 1525510
11233A525510j0945j05439k03145k1166m6778j39676k2602k9132M9192p1708o5098
$$ 1525510 1514565 1409126 1205981 1184815 1138037 998361 975759 946627 995819 924111 859013
11222H59013j15674r4781K1363Q1401J30760L8818o6341k07163M8536k5476o2046
$$ 859013 743339 648558 669921 751322 882082 920900 854559 647396 695932 670456 608410
11211F08410k3337k308R48Q3866J8257j17633j41724q408J42377j33576M9824
$$ 608410 585073 582765 583713 667579 685836 568203 426479 418071 560448 426872 476696
11200D76696N2008k2117j12826j74376J47419J07178J57230q7346j21704M341
$$ 476696 528704 506587 393761 219385 366804 473982 631212 543866 422162 426503
11190D26503j6473k15058j23020P2035J48666N1180k8543j51298j10247K47140
$$ 426503 410030 194972 71952 143987 292653 343833 315290 163992 53745 300885
11180C00885O4980O3609j40438j76947J45863K37442L8016l5239j13052m9498
$$ 300885 365865 429474 289036 112089 257952 495394 533410 498171 385119 335621
11170C35621m1172q9822N3302Q316K38731k9591j70880p0200q493J7604j64333
$$ 335621 294449 204627 257929 266245 504976 475385 304505 234305 225812 243416 79083
11159G9083m5160N4606l1443j44773l1082J16690O7637j7501J34051K9161o1295
$$ 79083 33923 88529 57086 -87687 -118769 -2079 65558 48057 182108 211269 149974
11148A49974k2393j04291m151J06899J75969J70461j61053n6637J00008q9387
$$ 149974 127581 23290 19139 126038 302007 472468 311415 254778 354786 265399
11138B65399N9106Q8807N0978Q0936j43006J13189O1819j49998j98481n7581J00486
$$ 265399 324505 413312 464290 545226 402220 515409 577228 427230 228749 171168 271654
11127B71654p4823m6108Q6924J994Q0722N4447J62040n4563j66117n0088K8656
$$ 271654 196831 150723 237647 239641 320363 374810 536850 482287 316170 266082 294738
11116B94738N360n884n1627j33742m0754M9960J30982J59232O5753M6095J5223
$$ 294738 300098 294214 242587 108845 68091 118051 249033 408265 474018 520113 535336
11105E35336Q5482k08108q2307L46343L85135L23822K16767l9904q3829M6216
$$ 535336 620818 412710 330403 676746 1061881 1385703 1602470 1562566 1478737 1524953
11095A524953M5344j30959J74587J96114j84385k23396k59373p8445j8968q9104
$$ 1524953 1570297 1439338 1613925 1810039 1625654 1402258 1142885 1064440 1045472 956368
11085I56368q7265l006r0725k4849J8030K21522Q2201M105P408k560J75448J42420
$$ 956368 869103 866097 775372 750523 768553 990075 1072276 1076381 1083789 1081229 1256677 1399097
11073A399097o4438N4972J37267J14535J01977O4719N2888j45331m422J14359
$$ 1399097 1334659 1389631 1526898 1641433 1743410 1808129 1861017 1715686 1711264 1825623
11063A825623Q7180l03897k26555j1683n8453N9871L4391m1959l857m5884j31296
$$ 1825623 1912803 1608906 1382351 1370668 1312215 1372086 1406477 1364518 1360661 1314777 1183481
11052A183481j71802n5274J10712o508n4346J18443m421j6391N7943K7697K6514
$$ 1183481 1011679 956405 1067117 1060609 1006263 1124706 1120285 1103894 1161837 1189534 1216048
11041A216048J86276l6955K4576J31360Q3698q4569j47019j40094l49802n4883
$$ 1216048 1402324 1365369 1389945 1521305 1605003 1520434 1373415 1233321 883519 828636
11031H28636J2836J500m2750j01569j26248j22329k00607o8193K0351J59384J44767
$$ 828636 841472 842972 800222 698653 572405 450076 249469 181276 201627 361011 505778
11020E05778M26j60020J0034J29194L5156J07190r1976k03576j10253j01767k5148
$$ 505778 506204 346184 356218 485412 520568 627758 535782 332206 221953 120186 95038
11009I5038M0839j7562n2017J58756o9485o9640J0022L7001Q4156j9407j2091
$$ 95038 135877 118315 66298 225054 155569 85929 95951 132952 217108 197701 185610
10998A85610p0145n9781o8054N8203L59039J15488l23546k31514J6903O2243J8057
$$ 185610 115465 55684 -12370 45833 404872 520360 196814 -34700 -17797 44446 62503
10987F2503P6932O2520J3942Q299q7618J75224J27144o1342Q8349k904R6630j29401
$$ 62503 139435 201955 215897 224196 136578 311802 438946 377604 465953 463049 559679 430278
10975D30278j25262J6654k653R1053j15065j66278J32495N7403q4510k36587o1377
$$ 430278 305016 321670 319017 410070 295005 128727 261222 318625 234115 -2472 -63849
10964f3849J69090O0210p6357q2238k6685M3424J56689Q9037k11745k33937q048
$$ -63849 105241 165451 89094 6856 -19829 23595 180284 269321 57576 -176361 -184409
10953a84409P5978J01273P9221M4118l0292m1236O5524j459J40546J29875J21476
$$ -184409 -108431 -7158 72063 116181 85889 44653 110177 108718 249264 379139 500615
10942E00615O257m8713k7171r6007k12691j28126p750j93466q795J55816K8156
$$ 500615 506872 458159 430988 334981 122290 -5836 -13586 -207052 -215847 -60031 -31875
10931c1875j32308J85804J20991k21049J15664M3223l5280m9783R1250o0296j19380
$$ -31875 -164183 21621 142612 -78437 37227 80450 45170 -4613 86637 26341 -93039
10920i3039R4478J83698m8381j04637l081K55667J84305q1613k49804j8131k4994
$$ -93039 1439 185137 136756 32119 29038 284705 469010 387397 137593 119462 94468
10909I4468P4009q9521K0704J18452q8119J23406k53896p8035N5057m5830k05098
$$ 94468 168477 78956 99660 218112 129993 253399 -497 -78532 -23475 -69305 -274403
10898b74403n4119R1715J08229Q6105J60788P6396k77937l1832J9336J03569K1136
$$ -274403 -328522 -236807 -128578 -42473 118315 194711 -83226 -115058 -95722 7847 28983
10887B8983j49214N890J05309N5691N0166N5685p8001k1405J51155J9253l3556
$$ 28983 -120231 -114341 -9032 46659 96825 152510 74509 53104 204259 223512 189956
10876A89956q6801k08895k6623K37190J56408p6717j09677o7216o0919k937N172
$$ 189956 103155 -105740 -132363 104827 261235 184518 74841 7625 -53294 -56231 -51059
10865e1059J03912p5082m4684n2740j18132r3123J3689J21301p4674m9806j61098
$$ -51059 52853 -22229 -66913 -119653 -237785 -330908 -317219 -195918 -270592 -320398 -481496
10854d81496R7807K43783J96079r56p7476j33389k16928J10630K92929J73668
$$ -481496 -383689 -139906 56173 55217 -22259 -155648 -372576 -261946 30983 204651
10844B04651n0546O4522o1357q5224m4066j30420j92779K02388K0386j1257j21947
$$ 204651 154105 218627 157270 72046 27980 -102440 -295219 -92831 -72445 -83702 -205649
10833b05649J62557J21637r6099J44108J5651r6347q0029J29969J83155m5670
$$ -205649 -43092 78545 -17554 126554 142205 45858 -34171 95798 278953 233283
10823B33283q9479l8032J39653j3766j97694j21039k90820K2291K72553J11531
$$ 233283 143804 105772 245425 231659 33965 -87074 -377894 -355603 -83050 28481
10813B8481j24992n3551j05747P8143J05857R2954o3296j49311J08460N4305j09444
$$ 28481 -96511 -150062 -255809 -177666 -71809 21145 -42151 -191462 -83002 -28697 -138141
10802a38141J882m6649P6038q4165K044N2617J24704k0558O433J53752R6129q5617
$$ -138141 -136259 -182908 -106870 -191035 -188991 -136374 -11670 -32228 -25795 127957 224086 138469
10790A38469j26817k69620r1024J08112M3131L9311N3328j17684j8024J81769
$$ 138469 11652 -257968 -348992 -240880 -197749 -158438 -105110 -222794 -240818 -59049
10780e9049j3449J23092K11845j40445j95890J12007j216j28554R6353J05046
$$ -59049 -72498 50594 262439 121994 -73896 38111 36895 -91659 4694 109740
10770A09740Q9946O8126j44914n9460m5983J24589O1753j75568l8006n3140k7259
$$ 109740 199686 267812 122898 63438 17455 142044 203797 28229 -9777 -62917 -90176
10759i0176J25707K00660j2374k36712j27055j9545L1407O2939J79685q7282p4739
$$ -90176 35531 236191 223817 -12895 -139950 -159495 -128088 -65149 114536 27254 -47485
10748d7485j4168L956j6208L243L8991K15526R8718j84335m9914j24330p0465
$$ -47485 -61653 -57697 -73905 -70662 -31671 183855 282573 98238 48324 -76006 -146471
10737a46471P201J94858K29669J80715k2975j64273j37416j39445l8268j76113
$$ -146471 -139270 55588 285257 465972 442997 278724 141308 1863 -36405 -212518
10727b12518q7431J9203J41046j09294j1792p9016o049J18188K7124j50008n651
$$ -212518 -299949 -280746 -139700 -248994 -260786 -339802 -345851 -227663 -200539 -350547 -356198
10716c56198J55014J08021L9594J29479L1926N2790n6609q1838R563r1287J40
$$ -356198 -201184 -93163 -53569 75910 107836 160626 104017 22179 31742 -59545 -59405
10705e9405j9001J02410P0498N8048J9168r7400k23010R6106J05009n4193l340
$$ -59405 -78406 24004 94502 152550 171718 74318 -148692 -52586 52423 -1770 -5110
10694e110J5753M9695o0816J91223K7124j60933j13878J14479n395k9588O0527
$$ -5110 10643 60338 -478 190745 217869 56936 -56942 57537 52142 22554 83081
10683H3081K104n7380n5164j20528O1438J20988O9788P3769P15J70962O2707P2397
$$ 83081 85185 27805 -27359 -147887 -86449 34539 104327 178096 178811 349773 412480 484877
10671D84877j70482q8264m5721r2248K9038p3087l7899N4705j21766p2242N0914
$$ 484877 314395 226131 180410 88162 117200 44113 6214 60919 -60847 -133089 -82175
10660h2175r215J5364p0966J39898J22044q8402m2267Q5940J23353R947j43001
$$ -82175 -91390 -76026 -146992 -7094 114950 26548 -15719 70221 193574 203521 60520
10649F0520L6541R5466o882k4645j00398r4191P5300J37226o1886j08505q9479
$$ 60520 97061 192527 185645 161000 60602 -33589 41711 178937 117051 8546 -80933
10638h0933K3622n3907K6505k3297J4644P6580j5783k2939J21009P0174j33303
$$ -80933 -57311 -111218 -84713 -108010 -93366 -16786 -32569 -55508 65501 135675 2372
10627B372j83818J23553J30505R28j43814J6721R9811j53018j67582J47291J01775
$$ 2372 -181446 -57893 72612 73540 -70274 -53553 46258 -106760 -274342 -127051 -25276
10616b5276o5337m3196J5219Q4226p652Q1380L0714p1659k0073Q0719j10704j97171
$$ -25276 -90613 -133809 -118590 -34364 -42016 39364 70078 -1581 -21654 59065 -51639 -248810
10604b48810q9436O8620K44966R4847m2549M8037p253L4529L5677k24422J735
$$ -248810 -338246 -269626 -24660 70187 27638 75675 68422 102951 138628 -85794 -84059
10593h4059J33081j10679K385J21405k6539K7073j47726j31560J48125J24970
$$ -84059 49022 -61657 -59272 62133 35594 62667 -85059 -216619 -68494 56476
10583E6476K01052o3185j91490M2660J43392m7771q4274o8525q8411J61162Q132
$$ 56476 257528 194343 2853 45513 188905 141134 56860 -11665 -100076 61086 69218
10572F9218p1321q123o0192K8529J07598N1563o1879R1700m7433k77240l0007
$$ 69218 -2103 -10226 -70418 -41889 65709 117272 55393 147093 99660 -177580 -207587
10561b07587j64208Q2932J49664M7612l5557J04662K16582Q8612j52711n7324
$$ -207587 -371795 -288863 -139199 -91587 -127144 -22482 194100 282712 130001 72677
10551G2677l9151J3321o965l4924J6649R8829j48290J9890J61490o6422j9050
$$ 72677 33526 46847 39882 4958 21607 120436 -27854 -7964 153526 87104 68054
10540F8054R1850p4085o2830j47229Q8825L43212N6379j32064j25069j43313l8609
$$ 68054 159904 85819 22989 -124240 -35415 307797 364176 232112 107043 -36270 -74879
10529g4879j52092J1244P3704Q0636n0427K5754L9801J0169N4576J20062N2368
$$ -74879 -226971 -215727 -142023 -61387 -111814 -86060 -46259 -36090 18486 138548 190916
10518A90916k38202M8442M4767j08396j5722j47874K8450K15003J40660R405n4792
$$ 190916 -47286 1156 45923 -62473 -78195 -226069 -197619 17384 158044 167449 112657
10507A12657Q1384K3110q1302q1798L2374L0837m7920n3552N8538M1490r6115
$$ 112657 194041 217151 135849 54051 86425 117262 69342 15790 74328 115818 19703
10496A9703J19123M4409J90380J3310k11606j8376j63238j65057M0443k00906
$$ 19703 138826 183235 373615 386925 175319 156943 -6295 -171352 -130909 -331815
10486c31815J8761O569k1403J74219K55312J61778r1125q3008p3431j97607L0421
$$ -331815 -313054 -306485 -327888 -153669 101643 263421 172296 89288 15857 -181750 -151329
10475a51329J67145K9937j26297J30040N4800m8171r9292K0384M0518j096M1012
$$ -151329 15816 45753 -80544 49496 104296 56125 -43167 -22783 17735 16639 57651
10464E7651J23387p8549j43546k9267K57793N328n7364p0988j8052M6896q8423
$$ 57651 181038 102489 -41057 -70324 187469 192797 135433 64445 46393 93289 4866
10453D866J25839p4861j72512J25107J21880k1226p0381o1433P3037K3151o0395
$$ 4866 130705 55844 -116668 8439 130319 109093 38712 -22721 50316 73467 13072
10442A3072q014K0312R3746L5669N7823k3267o0007j99964N071J26703M9692R5395
$$ 13072 5058 25370 119116 154785 212608 189341 129334 -70630 -65559 61144 110836 206231
10430B06231j48472L0786J98280J39448k8709n9010j7689j04821m216M7129o1626
$$ 206231 57759 88545 286825 426273 397564 338554 320865 216044 211828 258957 197331
10419A97331p2058l3633o3545j50953p2766M9725j55717j52962K07721J84442
$$ 197331 125273 91640 28095 -122858 -195624 -145899 -301616 -454578 -246857 -62415
10409f2415K2655j1810q1010k1605Q7691P5843R914R4096R0940n9367J40004m3229
$$ -62415 -39760 -51570 -132580 -154185 -66494 9349 19263 113359 204299 144932 284936 241707
10397B41707k7777k4650Q778j6129o0078m0498O7042o0870k16549p4961J75267
$$ 241707 213930 189280 198058 181929 121851 81353 148395 87525 -129024 -203985 -28718
10386b8718L4873R4435J10989K52j15538O860Q0200M8596j2612j76181j01217
$$ -28718 6155 100590 211579 211831 96293 103153 183353 231949 219337 43156 -58061
10375e8061Q7980m2539o8269k1987m1081J94532p464j61717j2378L2261P9029
$$ -58061 29919 -12620 -80889 -102876 -143957 50575 43111 -118606 -130984 -98723 -19694
10364a9694J3807m6247L8984N2003k04757P4793M5678j62597O1796j0189j08845
$$ -19694 -5887 -52134 -13150 38853 -165904 -91111 -45433 -208030 -146234 -156423 -265268
10353b65268J25023m2162k6703J19457P0104j9172J11851O8534J37473j9046Q845
$$ -265268 -140245 -182407 -209110 -89653 -19549 -38721 73130 141664 279137 260091 268936
10342B68936j61857l5336R8950O9101J2217k7853o610k2184k147q0626k2128P6630
$$ 268936 107079 71743 170693 239794 252011 224158 217548 195364 193217 112591 90463 167093
10330A67093J16585L675M9208K9105n5203l7564j54986m9182n5111k3296O9661
$$ 167093 283678 287353 336561 365666 310463 272899 117913 68731 13620 -9676 59985
10319E9985J09631k636j09624j52929j4597M1044J05381r1682l5050l8766r8854
$$ 59985 169616 166980 57356 -95573 -110170 -69126 36255 -55427 -90477 -129243 -228097
10308b28097R2858N4385N8812r1072j85541J20739K649j28185j92280J37563J83726
$$ -228097 -135239 -80854 -22042 -113114 -298655 -177916 -175267 -303452 -495732 -358169 -174443
10297a74443J0163n4777k8191j4717j8373q6603p0352l192K13261J30206n3053
$$ -174443 -164280 -219057 -247248 -261965 -280338 -366941 -437293 -440485 -227224 -97018 -150071
10286a50071J73806J61037l5368N6375N565o4876Q764r6207J8074J85383n5055
$$ -150071 23735 184772 149404 205779 211344 146468 155232 59025 77099 262482 207427
10275B07427j38705J00208O6082j2939o9496k2074n2475J39305o3411L7650N4822
$$ 207427 68722 168930 235012 222073 152577 130503 78028 217333 153922 191572 246394
10264B46394j3365o8933j11116q024O3994j9574L6285P3399m0528j19437J1122
$$ 246394 233029 164096 52980 44956 108950 89376 125661 199060 158532 39095 50217
10253E0217j57522m4907k7267K0257o9540o0007R1698J33280q0056J44451n1070
$$ 50217 -107305 -152212 -179479 -159222 -228762 -288769 -197071 -63791 -143847 604 -50466
10242e0466k20804l1996P9154J66281J86874q758J20850L4660J33559j45572j84667
$$ -50466 -271270 -303266 -224112 -57831 129043 120285 241135 275795 409354 263782 79115
10231G9115p7511R413R5165L5062j41623M4498p2928o5521k0104r4328l1032L2204
$$ 79115 1604 11017 106182 141244 -379 44119 -28809 -94330 -114434 -208762 -239794 -207590
10219b07590k7460N5635M494O2482j12013k74076J07639K47633O9635N5803o7007
$$ -207590 -235050 -179415 -174921 -112439 -224452 -498528 -390889 -143256 -73621 -17818 -84825
10208h4825l1708r4149l6480l3552J52082J68758k713J51403J05113p7038j95869
$$ -84825 -116533 -210682 -247162 -280714 -128632 40126 37413 188816 293929 216891 21022
10197B1022m6494l1292J708o7174n7134k4015L7258O1638j97198l7247J30376
$$ 21022 -25472 -56764 -55056 -122230 -179364 -203379 -166121 -104483 -301681 -338928 -208552
10186b08552K35215p9229m1034R3966J39885m4699j08511Q3344j2423q9326p7469
$$ -208552 26663 -52566 -93600 366 140251 95552 -12959 70385 57962 -31364 -108833
10175a08833J3798J4721N938Q0026J26328L8219o7562k97430j09722l3419J36842
$$ -108833 -95035 -80314 -74376 5650 131978 170197 102635 -194795 -304517 -337936 -201094
10164b01094L4555r6640k0954j29172J02124K99665Q812J2340o0912o0762q1915
$$ -201094 -166539 -263179 -284133 -413305 -311181 -11516 -2704 9636 -51276 -112038 -193953
10153a93953P080R7853L2605j27424N6513L4536J88539Q3157j13674j08108l0955
$$ -193953 -186873 -89020 -56415 -183839 -127326 -92790 95749 178906 65232 -42876 -73831
10142g3831P6515J05818j25231P6731Q1735K8814l8223p653j39222K4963P9968
$$ -73831 2684 108502 -16729 60002 141737 170551 132328 124675 -14547 10416 90384
10131I0384j9593J4966J12761j92342r7402J9352p6972R5676J20979O4853L7506
$$ 90384 70791 85757 198518 6176 -91226 -71874 -148846 -53170 67809 132662 170168
10120A70168j24335r3053J21520o2208j24318R3235J08368J64827k9723m6450
$$ 170168 45833 -47220 74300 12092 -112226 -18991 89377 254204 224481 178031
10110A78031j04305j58372m5854n3511J14919R4521J35005j0452k02631m7957
$$ 178031 73726 -84646 -130500 -184011 -69092 25429 160434 149982 -52649 -100606
10100a00606J24619R8900j0079q096J28096K3256k87449o7340j24245j42412R872
$$ -100606 24013 122913 112834 104738 232834 256090 -31359 -98699 -222944 -365356 -355484
10089c55484J58657O3155M7802j03001K2536J4387K6614P9690j12589p7593k0842
$$ -355484 -196827 -133672 -85870 -188871 -166335 -151948 -125334 -45644 -158233 -235826 -256668
10078b56668J2712K2326O7998P7627O4594J22359r774J57886L0408j1033j3247
$$ -256668 -243956 -221630 -153632 -76005 -11411 110948 101174 259060 289468 278435 265188
10067B65188k8901J32104q1006j52180k23749k32397j68074N3978J78047L86593
$$ 265188 236287 368391 287385 135205 -88544 -320941 -489015 -435037 -256990 129603
10057A29603Q1956j51732R4453p0468K4542R817R5004J17719q3384j57113q3276
$$ 129603 211559 59827 154280 83812 108354 118171 213175 330894 247510 90397 7121
10046G121L5772m742K6096r0754m7882j28837L5382J42206P7488j8192j41975
$$ 7121 42893 38151 64247 -26507 -74389 -203226 -167844 -25638 51850 33658 -108317
10035a08317k3149J8783J59375N6672n7105j7319j7845j74866K3645M2431m4302
$$ -108317 -131466 -112683 46692 103364 46259 28940 11095 -163771 -140126 -97695 -141997
10024a41997O4434K4044k28573k2896R3531P2723O5488P4887J14011Q2485j50842
$$ -141997 -77563 -53519 -282092 -304988 -211457 -138734 -73246 1641 115652 198137 47295
10013D7295j02587j52097j54242R6k5148k1570J78426R8213k46503j1863J84275
$$ 47295 -55292 -207389 -361631 -361535 -386683 -408253 -229827 -131614 -378117 -389980 -205705
10002b05705O6665O722l5661O738n9479J96395J95418K4670j50468k14205k5909
$$ -205705 -139040 -132318 -167979 -161241 -220720 -24325 171093 195763 45295 -168910 -194819
9991a94819p8942M175J45645J04665j902p3885j84416M1078K36930N5436j67072
$$ -194819 -273761 -269586 -123941 -19276 -21178 -95063 -279479 -238401 -1471 53965 -113107
9980a13107l6997J4442J13047K2142K8833J51431m637q2266j47732P8709J9680
$$ -113107 -150104 -135662 -22615 -473 28360 179791 175154 92888 -54844 23865 43545
9969D3545n6303l8765j21886j10056Q9025J28925Q2226M7633J09519J02592p1254
$$ 43545 -12758 -51523 -173409 -283465 -194440 -65515 16711 64344 173863 276455 205201
9958B05201j3888P7671M7500k50770j42061J7061J44600j1997N3907j65863j58726
$$ 205201 191313 268984 316484 65714 -76347 -59286 85314 73317 127224 -38639 -197365
9947a97365K8644R2649O7110m0202j83004P6367J29262j56635N8239r0451j14478
$$ -197365 -168721 -76072 -8962 -49164 -232168 -155801 -26539 -183174 -124935 -215386 -329864
9936c29864j05855J81030J56371J22990p3414r5370K7299J98917J64560k9001
$$ -329864 -435719 -254689 -98318 24672 -48742 -144112 -116813 82104 246664 217663
9926B17663r4940l3623J11479O4810j50728m4972N6381k2415P6027Q5665q8867
$$ 217663 122723 89100 200579 265389 114661 69689 126070 103655 179682 265347 176480
9915A76480j06665p9110k4409M8505j02880j58556o7542K54985P6568N2359N1872
$$ 176480 69815 -9295 -33704 14801 -88079 -246635 -314177 -59192 17376 69735 121607
9904A21607p9824J6182n542K01209J6061j84602M372q8787m8185l0780j10518
$$ 121607 41783 57965 52423 253632 269693 85091 89463 676 -47509 -78289 -188807
9893a88807p67P494m8002p7100n760O9903K80537J52484L8698o6049l0561P074
$$ -188807 -189574 -182080 -230082 -307182 -312942 -243039 37498 189982 228680 162631 132070 139144
9881A39144J9644j30524l34737l6807K49779L9612o6964j31394K8318L054L5555
$$ 139144 158788 28264 -306473 -343280 -93501 -53889 -120853 -252247 -223929 -220875 -185320
9870a85320R1837j11449j03267O5986M5325J75908K25885j5995o5699n9872R4311
$$ -185320 -93483 -204932 -308199 -242213 -196888 -20980 204905 188910 123211 63339 157650
9859A57650R8193j56811L8674J03099P3157l3027j18338n2355J01226J6267j10701
$$ 157650 255843 99032 137706 240805 313962 280935 162597 110242 211468 227735 117034
9848A17034J25915k1167J7377N0197K23225J85806O9572l61237k43194M514O0549
$$ 117034 242949 221782 239159 289356 512581 698387 767959 406722 163528 168042 228591
9837B28591P5437q512j66960j64710J12962N2836l8978J26837O9031o4204P0604
$$ 228591 304028 295516 128556 -36154 76808 129644 90666 217503 286534 222330 292934
9826B92934J9819r0633P579o4630j67468m8691j5592o7280J9894J00732Q8074
$$ 292934 312753 222120 229699 165069 -2399 -51090 -66682 -133962 -114068 -13336 74738
9815G4738m018N1217k4321k43359k07593J93840K14525J46051r8645m7795J77493
$$ 74738 70720 121937 97616 -145743 -353336 -159496 55029 201080 102435 54640 232133
9804B32133l4783N5861n807n9535j29476m5416l1138q0676r8601J36665J79398
$$ 232133 197350 253211 247404 187869 58393 12977 -18161 -98837 -197438 -60773 118625
9793A18625Q5393j6714j30248n8168M2358m7136j73205J55037L40537J27856j76846
$$ 118625 204018 187304 57056 -1112 41246 -5890 -179095 -24058 316479 444335 267489
9782B67489j48628n5281r9301k299l7281p805q7196n488m7064J4851J40881J40721
$$ 267489 118861 63580 -35721 -38020 -75301 -83106 -170302 -175790 -222854 -208003 -67122 73599
9770G3599Q0320j9663j58161R4651J79797R6628j61897j19508q9463J00290O4490
$$ 73599 153919 134256 -23905 70746 250543 347171 185274 65766 -23697 76593 141083
9759A41083n4867j04616p6895J03811M0026J27189l6040j57962j46228L9547O6773
$$ 141083 86216 -18400 -95295 8516 48542 175731 139691 -18271 -164499 -124952 -58179
9748e8179j09901o1959j3317J77972n8697J68187J50789N6986l6464l2680l2984
$$ -58179 -168080 -230039 -243356 -65384 -124081 44106 194895 251881 215417 182737 149753
9737A49753j51568r9609j06683J37335J67516q185k37986j51110M891O4384P3237
$$ 149753 -1815 -101424 -208107 -70772 96744 88559 -149427 -300537 -295646 -231262 -158025
9726a58025K09894j97261q3916L6819j1755K7454L279J53978J80896j22503M9013
$$ -158025 51869 -145392 -229308 -192489 -204244 -176790 -173511 -19533 161363 38860 87873
9715H7873j45185j15407J35993J08080Q995L9041r3644o7030j58225N4710J58770
$$ 87873 -57312 -172719 -36726 71354 80349 119390 25746 -41284 -199509 -144799 13971
9704A3971P3030j08237q5154n1848J10344J19643j0509r672J26989m123k15328
$$ 13971 87001 -21236 -106390 -158238 -47894 71749 61240 51568 178557 174434 -40894
9693d0894j56440K1235J17654m5827m4286j048J9493M1849J27062n2084j30871
$$ -40894 -197334 -176099 -58445 -104272 -148558 -149606 -130113 -88264 38798 -13286 -144157
9682a44157j57184J47965N3575J02061J88751j7169l2074J41015j19614J13942
$$ -144157 -301341 -153376 -99801 2260 191011 173842 141768 282783 163169 277111
9672B77111L8209r5125j64584j04490J12080J3677p6697k0530Q5389N7523j68061
$$ 277111 315320 220195 55611 -48879 63201 76878 181 -20349 65040 122563 -45498
9661d5498j37702R6342P9545Q3666j09076j18038R744j26506J41997J00575N8220
$$ -45498 -183200 -86858 -7313 76353 -32723 -150761 -141017 -267523 -125526 -24951 33269
9650C3269j69606J19790J64108Q8694n5456j0113n0963k03622n2205J19227J98570
$$ 33269 -136337 -16547 147561 236255 180799 170686 119723 -83899 -136104 -16877 181693
9639A81693O7216n748j56745j02320P1539k4886j2127K4265m0493j14830J9553
$$ 181693 248909 243161 86416 -15904 55635 30749 18622 42887 2394 -112436 -92883
9628i2883k970j03479j51658K2448P7471r443m5893J25286J45766k05407j21913
$$ -92883 -95853 -199332 -350990 -328542 -251071 -260514 -306407 -181121 -35355 -240762 -362675
9617c62675K9862n7013J12255M9595P7149N8200q2449k1526P085R0679R2171J23964
$$ -362675 -332813 -389826 -277571 -227976 -150827 -92627 -175076 -196602 -189517 -98838 -6667 117297
9605A17297M3845k03851o2915J45930P2554j3076N1401m6495K6443j06645q1319
$$ 117297 161142 -42709 -105624 40306 112860 99784 151185 104690 131133 24488 -56831
9594e6831N612K746O9374m2782k15755j36219N4059R1198m7959m4463l9550q457
$$ -56831 -51219 -48473 20901 -21881 -237636 -373855 -319796 -228598 -276557 -321020 -360570 -369027
9582c69027R0654K00011o7935k5086M1420M1606K5640j5404N0501L8503P7880
$$ -369027 -278373 -78362 -146297 -171383 -129963 -88357 -62717 -78121 -27620 10883 88763
9571H8763J7891J4847j59255j06736Q6702J5850J5720Q7451J5923J14788R0789
$$ 88763 106654 121501 -37754 -144490 -57788 -41938 -26218 61233 77156 191944 282733
9560B82733j44150j18324o4823r7609q0567J01722N1474l0596L6559j9992O7489
$$ 282733 138583 20259 -44564 -142173 -222740 -121018 -69544 -100140 -63581 -83573 -16084
9549a6084K04508p7955k42866k0646J9499m1897j35109k8506Q1715L7725R377
$$ -16084 188424 110469 -132397 -153043 -133544 -175441 -310550 -339056 -257341 -219616 -210239
9538b10239k7762J99340L5088J40190q4424m8189O6498l6732k9758p2673m6611
$$ -210239 -238001 -38661 -3573 136617 52193 4004 70502 33770 4012 -68661 -115272
9527a15272k0317J34882P1775M1951K0843n31k0094l7860K7177o435j20066m8844
$$ -115272 -135589 -707 71068 113019 133862 133331 113237 75377 102554 96119 -23947 -72791
9515g2791j14293m3573J01517J16836R1655N7446j55768p9806N2406Q198k11443
$$ -72791 -187084 -230657 -129140 -12304 79351 136797 -18971 -98777 -46371 -38173 -249616
9504b49616l6543J66869J20925J4431l8907j00578k885L7598l3019N7452P056
$$ -249616 -286159 -119290 1635 16066 -22841 -123419 -126304 -88706 -121725 -64273 -57217
9493e7217m2566M7250J62784j84949j43459K8810k2387K66614k1861l27242l035
$$ -57217 -99783 -52533 110251 -74698 -218157 -189347 -211734 54880 33019 -294223 -297258
9482b97258J32502J53070J45607k13909j89863L5449J20729M5475j10284q4848
$$ -297258 -164756 -11686 133921 -79988 -269851 -234402 -113673 -68198 -178482 -263330
9472b63330Q316N6238J38854J79776P4853K1375p8277n5590J53644k4502j68804
$$ -263330 -255014 -198776 -59922 119854 194707 216082 137805 82215 235859 211357 42553
9461D2553p8211r2843p328R482l9743O8469K60631O5254J6584n8328q4313N8395
$$ 42553 -35658 -128501 -135829 -126347 -166090 -97621 163010 228264 244848 186520 102207 160602
9449A60602J79498j41243j99996n2994j5542J69238M912N0619r3913Q069J18628
$$ 160602 340100 198857 -1139 -54133 -69675 99563 104475 155094 61181 69250 187878
9438A87878q6230M2829r5768j60216J90766R3120j59922q0991m5601j5194n544
$$ 187878 101648 144477 48709 -111507 79259 172379 12457 -68534 -114135 -129329 -134873
9427a34873J36097R9175J38958P7664o5786j04436J52943J874j94983J02837k4674
$$ -134873 1224 100399 239357 317021 251235 146799 299742 301616 106633 209470 184796
9416A84796k20411j34835J66556M3278q8218l8448P2765m7014l7497k9364j42830
$$ 184796 -35615 -170450 -3894 39384 -48834 -87282 -14517 -61531 -99028 -128392 -271222
9405b71222R6157R5343j8707J04026P2054J7494l0722r441J2188k29497K24213
$$ -271222 -175065 -79722 -98429 5597 77651 95145 64423 54982 67170 -162327 61886
9394F1886m6544J4327J52365M5020L0584j51836R557j36054P4566o210m7181j54552
$$ 61886 15342 29669 182034 227054 257638 105802 115359 -20695 53871 47661 480 -154072
9382a54072o5875R6024J45273P8615O5208N7582m1707j23003p435K3072M2709
$$ -154072 -219947 -123923 21350 99965 165173 222755 181048 58045 50610 73682 116391
9371A16391p16J7176r1695m4615k3749r9454J5076r1591J42067J76106P6815J16954
$$ 116391 115675 132851 41156 -3459 -27208 -126662 -111586 -203177 -61110 114996 191811 308765
9359C08765j92426j88227J0729p6710J41898K2987r3371J37333J02781k1702J7516
$$ 308765 116339 -71888 -61159 -137869 4029 27016 -66355 70978 173759 152057 169573
9348A69573j97769j2669M0159J73776j53578n7767J61075O3390j14854k19589
$$ 169573 -28196 -40865 -706 173070 19492 -38275 122800 186190 71336 -148253
9338a48253j49989N5669J2313K0962J63263M9983j20587o0590M1822K96823K5211
$$ -148253 -298242 -242573 -230260 -209298 -46035 3948 -116639 -177229 -135407 161416 186627
9327A86627j72340m4503r9438l6116K19106l2205J2451J5079j18092j05867j73334
$$ 186627 14287 -30216 -129654 -165770 53336 21131 33582 48661 -69431 -175298 -348632
9316c48632q161P4617J04381J02892P2921j48529k7031J22603J93838R5905l5432
$$ -348632 -356793 -282176 -177795 -74903 -1982 -150511 -177542 -54939 138899 234804 199372
9305A99372j61931N7445o2750r0901J20197J62650R5436l53004j36525J72294
$$ 199372 37441 94886 32136 -58765 61432 224082 319518 -33486 -170011 2283
9295B283O4940m5578j25600p8379J12281K70305J28313j16064j75026j1546J12864
$$ 2283 67223 21645 -103955 -182334 -70053 200252 328565 212501 37475 25929 138793
9284A38793J10389p3485p8076q0128n741R728J1926l8402p4815j31837n2330k1613
$$ 138793 249182 175697 97621 17493 11752 21480 33406 -4996 -79811 -211648 -263978 -285591
9272b85591L6897K01575J24758l103l3629N695J22469m8275j71506k015J6309
$$ -285591 -248694 -47119 77639 74536 40907 46602 169071 120796 -50710 -52725 -36416
9261c6416M6058P645l3968k9403J39246J20188j39675q8198q781L3325m5738p0365
$$ -36416 9642 17287 -16681 -46084 93162 213350 73675 -14523 -23304 10021 -35717 -106082
9249a06082J00356J36823p8335q2269J61309L1202L7804j15553j04570n4437L6435
$$ -106082 -5726 131097 52762 -29507 131802 163004 200808 85255 -19315 -73752 -37317
9238c7317l969O9077j53119n6540K74668J40243O8484n4743j19183l2409j22210
$$ -37317 -41286 27791 -125328 -181868 92800 233043 301527 246784 127601 95192 -27018
9227b7018j94326k5058J9794j36255j45627K35793Q3048K49339J32538n7524O5082
$$ -27018 -221344 -246402 -226608 -362863 -508490 -272697 -189649 59690 192228 134704 199786
9216A99786K7510J8780k8755l5796j01764K4988J19760m4620k69640j23529K00497
$$ 199786 227296 246076 217321 181525 79761 104749 224509 179889 -89751 -213280 -12783
9205a2783k4198l3565O7537Q9559k24043O6869j3488p495Q4103N5927J39868M2410
$$ -12783 -36981 -70546 -3009 86550 -137493 -70624 -84112 -91607 -7504 48423 188291 230701
9193B30701o6387r9149O390K06964O191J8778L0091l703l4480k13220j9349R2443
$$ 230701 164314 65165 71555 278519 284710 303488 333579 329876 295396 82176 62827 155270
9181A55270Q519Q8799m26m7996L6162j6816L2929j25211j85082q5381K14050J88202
$$ 155270 163789 252588 252162 204166 240328 223512 256441 131230 -53852 -139233 74817 263019
9169B63019J73000R4746j03612q1125m5919l2475m3689r8218j6157k5396P3714
$$ 263019 436019 530765 427153 346028 300109 267634 223945 125727 109570 84174 157888
9158A57888J36386r2271j1526J49189J1575q8263J10640J62109N0686L6108K14231
$$ 157888 294274 202003 190477 339666 351241 262978 373618 535727 586413 622521 836752
9147H36752o238j2594J09356J778Q6186j9308J40715Q5145K12829K74721J46819
$$ 836752 830514 817920 927276 929054 1015240 995932 1136647 1221792 1434621 1709342 1856161
9136A856161K1322O8059K64074N69530O75061O39302R85289J221442J763970K715847
$$ 1856161 1877483 1945542 2209616 2779146 3454207 4093509 5078798 6300240 8064210 10780057
9126A0780057M038093N927209P574380P967541O111287M771191M235439J092457
$$ 10780057 14818150 20745359 28319739 36287280 42398567 47169758 51405197 52497654
9118E2497654m683319j0160747j0536566p347475m689704l156055k094896j228018
$$ 52497654 47814335 37653588 27117022 19769547 15079843 11923788 9828892 8600874
9110H600874r12830o60624n02623n64164n19206n51256l94572l55900k96809k46787
$$ 8600874 7688044 7027420 6524797 5960633 5441427 4890171 4495599 4139699 3842890 3596103
9100C596103k08931j30974j16811j11664p2882l1674k18819k65374j47646k94008
$$ 3596103 3387172 3256198 3139387 3027723 2954841 2923167 2704348 2438974 2291328 1997320
9090A997320l6924K5900j7103k30674k8679M6836j89225q0621K5967L9928p025
$$ 1997320 1960396 1986296 1969193 1738519 1709840 1756676 1567451 1486830 1512797 1552725 1545700
9079A545700j0482m4833j90640j3741K2056l15621p7277L504J53033k462o8459
$$ 1545700 1535218 1490385 1299745 1286004 1308060 992439 915162 918666 1071699 1069237 1000778
9068A000778j00972p6627r0402N3055n4076j02072N3096R0628r9937j72892q7021
$$ 1000778 899806 823179 732777 785832 731756 629684 682780 773408 673471 500579 413558
9057D13558o0607N5355J81809K6082j77908j92422M0179J51614P6383l798J84991
$$ 413558 352951 408306 590115 616197 438289 245867 286046 437660 514043 510245 695236
9046F95236l9541j52806r6689N6445j40822N9920M116j60567M9540O9569N1824
$$ 695236 655695 502889 406200 462645 321823 381743 385859 225292 274832 344401 396225
9035C96225m1441j12794N7387J49462j6494N9278P8270j42324j07053o2270r9304
$$ 396225 354784 241990 299377 448839 432345 491623 569893 427569 320516 258246 158942
9024A58942l3624J58633K03110r3812o9137Q0118j95982o6674p786j22247j97759
$$ 158942 125318 283951 487061 393249 324112 404230 208248 141574 133788 11541 -186218
9013a86218Q968K27952J01079P4930L3086j3343p0408n8859l2459o1165j16462
$$ -186218 -177250 50702 151781 226711 259797 246454 176046 117187 84728 23563 -92899
9002i2899K15030K28362n6891j37209K4928J70541J10483k16960p8449Q0379L5016
$$ -92899 122131 350493 293602 156393 181321 351862 462345 245385 166936 247315 282331
8991B82331q8443r8080J3341k26689k13078J54395J61912O5454J38485n7525M2258
$$ 282331 193888 95808 109149 -117540 -330618 -176223 -14311 51143 189628 132103 174361
8980A74361j0082q1134Q7598q121M7197j89905j94999L2099J47767k63299r4336
$$ 174361 164279 83145 170743 162622 209819 19914 -175085 -142986 4781 -258518 -352854
8969c52854K24683J60824J49025L7675j66880j79419o1431p7030J06005L6748
$$ -352854 -128171 32653 181678 219353 52473 -126946 -188377 -265407 -159402 -122654
8959a22654O4080j10866O513J39745K2937Q6273k6867N694J04410n7284j91437
$$ -122654 -58574 -169440 -162927 -23182 -245 86028 59161 64855 169265 111981 -79456
8948g9456r284J4519q3523R9883Q3355L3524n6789j34764l2541l170p675j16420
$$ -79456 -88740 -74221 -157744 -57861 25494 59018 2229 -132535 -165076 -168246 -175921 -292341
8936b92341o8269j64652J67134R2725j6642J86713K939R9570J02128L4605j9116
$$ -292341 -360610 -525262 -358128 -265403 -282045 -95332 -92393 7177 109305 143910 124794
8925A24794j44663k43264j17506M098J29221q5621J8821K6667P3990M6408l133
$$ 124794 -19869 -263133 -380639 -376541 -247320 -332941 -314120 -287453 -213463 -167055 -170188
8914a70188q5719J99100J59057k5351l7985L3050j9457m5220n9531J77983M3885
$$ -170188 -255907 -56807 102250 76899 38914 71964 52507 7287 -52244 125739 169624
8903A69624o4998j08999N4794M2933q2949p0004o207N1085k0810R6966P3273j09867
$$ 169624 104626 -4373 50421 93354 10405 -59599 -65806 -14721 -35531 61435 134708 24841
8891B4841Q3333N8354l1141k47342j17359r6389l2579K13418J27191m6485J50541
$$ 24841 108174 166528 135387 -111955 -229314 -325703 -358282 -144864 -17673 -64158 86383
8880H6383L7139m9614j96919j6579N9027n5201l6390P10N1613P3709o9831J2592
$$ 86383 123522 73908 -123011 -139590 -80563 -135764 -172154 -171444 -119831 -46122 -115953 -103361
8868a03361N564J32754M2145j77870j3586K08495J24906r4161N00j58455K7730
$$ -103361 -97797 34957 77102 -100768 -114354 94141 219047 124886 125386 -33069 -5339
8857e339J28917q595m6252k69534K7023J5786K8124J33988m2079Q8262J09094
$$ -5339 123578 114983 68731 -200803 -173780 -157994 -129870 4118 -37961 50301 159395
8846A59395j5438j53662r5833K20577K2851k37846M5897L4998j838O1166J78497
$$ 159395 143957 -9705 -105538 115039 137890 -99956 -54059 -19061 -20899 40267 218764
8835B18764j3660j50663k58768j85097l9913P1765N3584M1984l0331K4611J43504
$$ 218764 205104 54441 -204327 -389424 -429337 -357572 -303988 -262004 -292335 -267724 -124220
8824a24220o5572q2549J37263Q321j79124J14464J18989K9244J73323L3237n5576
$$ -124220 -189792 -272341 -135078 -126757 -305881 -191417 -72428 -43184 130139 163376 107800
8813A07800l5925J45677r4570j22198L746r1644q6954Q3298J18788l7913p2828
$$ 107800 71875 217552 122982 784 4530 -87114 -174068 -90770 28018 -9895 -82723
8802h2723q3365N169N5272M8798R2358r151k47067p9303L6269m1086J21110R7598
$$ -82723 -166088 -160919 -105647 -56849 35509 26358 -220709 -300012 -263743 -304829 -183719 -86121
8790h6121P0555p909N5885j4720k10158j58404j068J26382R7157P4690L1103n3451
$$ -86121 -15566 -23475 32410 17690 -192468 -350872 -351940 -225558 -128401 -53711 -22608 -76059
8778g6059K17680J37333l8876j95624k6611J03859J0120j68399j61594j695m423
$$ -76059 141621 278954 240078 44454 17843 121702 131822 -36577 -198171 -199866 -204289
8767b04289K1052k7301K05554J07571L9522J30013j16686k16127m8173J05076
$$ -204289 -183237 -210538 -4984 102587 142109 272122 155436 -60691 -108864 -3788
8757c788r7759N9658m1190r2526J39777J63549O2375R2427k8066m2341J2244j4510
$$ -3788 -101547 -41889 -83079 -175605 -35828 127721 190096 282523 254457 212116 224360 209850
8745B09850p5921M8626J64656Q0312j05595q0638p2487m2194j0934j73681j09627
$$ 209850 133929 182555 347211 427523 321928 241290 168803 126609 115675 -58006 -167633
8734a67633o6676J51114J31026N7049j29347j39526J02393J39205m8464K5754
$$ -167633 -234309 -83195 47831 104880 -24467 -163993 -61600 77605 29141 54895
8724E4895J16637m2281M4255J74994L2720k56643k48N7730m372J18442K82012
$$ 54895 171532 129251 173506 348500 381220 124577 124329 182059 177687 296129 578141
8713E78141p2355k89685l9445J1430k61392N4838L2616j13937o6789K9425J03568
$$ 578141 505786 216101 176656 188086 -73306 -18468 14148 -99789 -166578 -137153 -33585
8702c3585J83525M5532o0981j0428O5895L1835q4803k1942M9059m86j16378p5589
$$ -33585 149940 195472 134491 124063 189958 221793 136990 115048 164107 163621 47243 -28346
8690b8346m8457J16695L9298k20394k0893j7428r524K86688J64964R3217j00883
$$ -28346 -76803 39892 79190 -141204 -162097 -179525 -189049 97639 262603 355820 254937
8679B54937j57606j83465j63503l6574K51949J90671J07584p8273K7093L8708
$$ 254937 97331 -86134 -249637 -286211 -34262 156409 263993 185720 212813 251521
8669B51521N8353j774j35227K532m855r0937k5929l5838J9343O1673K9281J85380
$$ 251521 309874 308100 172873 175405 170550 79613 53684 17846 37189 98862 128143 313523
8657C13523K3738R509J37954j0102k55047l866k5122r6938M1829N7973J20058
$$ 313523 337261 346770 484724 474622 219575 215709 190587 93649 135478 193451 313509
8646C13509N5374J29626P1776m235L6113k10049k01682n1523l1549q3787P0354
$$ 313509 368883 498509 570285 566050 602163 392114 190432 138909 107360 23573 93927
8635I3927J81726q8445r0245j35658j47050j15654q3500o2212q5916K9864l8773
$$ 93927 275653 187208 96963 -38695 -185745 -301399 -384899 -447111 -533027 -503163 -541936
8624e41936K68097J80757R1107R0395N0408j65814j61040M3712J87764J58220
$$ -541936 -273839 -93082 -1975 88420 138828 -26986 -188026 -144314 43450 201670
8614B01670m396l3399p6596q593j08184o835P7936R2282k7359l5779q2661M6656
$$ 201670 197274 163875 87279 78686 -29498 -36333 41603 133885 106526 70747 -11914 34742
8602C4742q8395J67528K09857J90407M701p6871j079K4455P3583l7064j19722
$$ 34742 -53653 113875 323732 514139 518840 441969 440890 465345 538928 501864 382142
8591C82142j21198l8135j72882k7928J16534M8602L667o3335K8522k17533m813
$$ 382142 260944 222809 49927 21999 138533 187135 190802 127467 155989 -61544 -66357
8580f6357K22263J67375n3629l8995J7991P0587N4517N026q595j14214r4413l7090
$$ -66357 155906 323281 269652 230657 248648 319235 373752 378778 370183 255969 161556 124466
8568A24466m0587K16824O3267J45187K52393J31794K6282q9768j30731q8114k23148
$$ 124466 83879 300703 363970 509157 761550 893344 919626 829858 699127 611013 387865
8557C87865K64j07396k46451J868K96857J438O6050J02982l5551j38201k5978
$$ 387865 388129 280733 34282 36150 333007 334445 400495 503477 467926 329725 303747
8546C03747j8138l949j48345m0809J09973p8070J31028J05663p154r9042J01801
$$ 303747 285609 281660 133315 92506 202479 124409 255437 361100 353946 254904 356705
8535C56705J35347P9694j01068J7444j78646o8143r3739J21715J91031k28536
$$ 356705 492052 571746 470678 488122 309476 241333 147594 269309 460340 231804
8525B31804q371M8566K90449L27239K27544K55401J68555M0260M1694l8405l54553
$$ 231804 223433 271999 562448 889687 1117231 1372632 1541187 1581447 1623141 1584736 1230183
8514A230183k82259k24683j71969K0067p2750o1419J18303j81048k45431j93611
$$ 1230183 947924 723241 551272 571339 498589 437170 555473 374425 128994 -64617
8504f4617N7831J16987M1272M3541J13433J32573J2382j84418r9506R037l5139
$$ -64617 -6786 110201 151473 195014 308447 441020 453402 268984 169478 178515 143376
8493A43376l9348j01979k1483J09697k1491m5989J25094J11771j2982k34324j4281
$$ 143376 104028 2049 -19434 90263 68772 22783 147877 259648 246666 12342 -1939
8482a939J32558P896J41379J55058J7968r8906J77501J99300J53898p5660k437
$$ -1939 130619 138515 279894 434952 452920 354014 531515 730815 884713 809053 806616
8471H06616j0866k35571k11571r1154o7637j61653j11909Q276p310J0827R8908
$$ 806616 795750 560179 348608 257454 189817 28164 -83745 -75469 -82779 -71952 26956
8460B6956M5416J38779O1287l6264M366k0446k09033n4137k1053j19462k6591
$$ 26956 72372 211151 272438 236174 240540 220094 11061 -43076 -64129 -183591 -210182
8449b10182j5815j8229m6468K3176K50771O4962L1232J46505q25j09155k6876
$$ -210182 -225997 -244226 -290694 -267518 -16747 48215 79447 225952 225127 115972 89096
8438H9096J36552m087J2795k35497k1150Q8199p3303j09674k3493K05783J61559
$$ 89096 225648 221561 234356 -1141 -22291 65908 -7395 -117069 -140562 65221 226780
8427B26780k35021M5840j120J0105R7539M9192j96584k13344R8351K23471j09734
$$ 226780 -8241 37599 36479 46584 144123 193315 -3269 -216613 -118262 105209 -4525
8416d525m3157P1624L2562R2284L7638m7722j11433p1925j06615o8737J31368
$$ -4525 -47682 23942 56504 148788 186426 138704 27271 -44654 -151269 -220006 -88638
8405h8638K21623j47786j85201K6006R5065J03251J9954R258o4675Q756L3875
$$ -88638 132985 -14801 -200002 -173996 -78931 24320 44274 53532 -11143 -2387 31488
8394C1488r648j7252k09842j69626N5403P8122Q5148L5656N1512O791r342n5718
$$ 31488 21840 4588 -205254 -374880 -319477 -241355 -156207 -120551 -69039 -62248 -71590 -127308
8382a27308J23577q1510k95079m6619o07K1550J01204Q0751J69721j34084n9866
$$ -127308 -3731 -85241 -380320 -426939 -427546 -405996 -304792 -224041 -54320 -188404 -248270
8371b48270j01086J0585K06259P3990K3993R6091N3226j20513m9762o4027j11064
$$ -248270 -349356 -338771 -132512 -58522 -34529 61562 114788 -5725 -55487 -119514 -230578
8360b30578K08628N4757q5937P9237l6807n0627M0621L0856o317r0400p1538j83707
$$ -230578 -21950 32807 -53130 26107 -10700 -61327 -20706 10150 3833 -86567 -158105 -341812
8348c41812j35569M2065L36548J35391N7296k16722j06098J65508J94963j00119
$$ -341812 -477381 -435316 -98768 36623 93919 -122803 -228901 -63393 131570 31451
8338C1451j41938J00505N8602k9312l8320K1263Q9733J90578O1696n3455p5280
$$ 31451 -110487 -9982 48620 19308 -19012 2251 91984 282562 344258 290803 215523
8327B15523J2241N5305j13709p9919j31999L5254Q6321m24J19363j74803k0788
$$ 215523 227764 283069 169360 89441 -42558 -7304 79017 78593 197956 23153 2365
8316B365j1499Q7334J30940l9345j9198J55939N9666j5904q0500k03814j01919
$$ 2365 -9134 78200 209140 169795 150597 306536 366202 350298 269798 65984 -35935
8305c5935J59787R7995r5433j65173j16396l6685k7186J33450l165P4927J23534
$$ -35935 123852 221847 126414 -38759 -155155 -191840 -219026 -85576 -88741 -13814 109720
8294A09720J21904J4353k18082r549J38347N4270r6329J26960q9717j22245q2849
$$ 109720 231624 245977 27895 18346 156693 210963 114634 241594 151877 29632 -53217
8283e3217R0913Q4225j03570k26273j36482J11674M3644J78560q796j96445N0417
$$ -53217 37696 121921 18351 -207922 -344404 -232730 -189086 -10526 -19322 -215767 -165350
8272a65350J86371J59574J13588j47294n3041O0527J9145J8632r2400O0139j6512
$$ -165350 21021 180595 294183 146889 93848 154375 173520 192152 99752 159891 143379
8261A43379j84639j38330N5183L3561m753N2048L8709P3527j9576j59541j47757
$$ 143379 -41260 -179590 -124407 -90846 -95599 -43551 -4842 68685 49109 -110432 -258189
8250b58189P631N4076O5568R1786J29873J35129R4345j58359k21712K1304P0552
$$ -258189 -250558 -196482 -130914 -39128 90745 225874 320219 161860 -59852 -38548 32004
8239C2004j88953j01951P0491k497j39869q3879k2909R8436M2448K10492j5894
$$ 32004 -156949 -258900 -188409 -190906 -330775 -414654 -437563 -339127 -296679 -86187 -102081
8228a02081L2631K8031o0603N3761l0415J39659l7970J11434q2678j12927K06593
$$ -102081 -69450 -41419 -102022 -48261 -78676 60983 23013 134447 51769 -61158 145435
8217A45435L0373j01329n0907j16970l3932K67180J35670j94312n4136k1993M1463
$$ 145435 175808 74479 23572 -93398 -127330 139850 275520 81208 27072 5079 46542
8206D6542J57729J911o2274n4507O3479P2528j11059k880j67189j57871N7462
$$ 46542 204271 206182 143908 89401 152880 225408 114349 111469 -55720 -213591 -156129
8195a56129m5538J5996P0024R2144j9993O9068J67725L8081n0231O356k8158j13344
$$ -156129 -201667 -185671 -115647 -23503 -43496 25572 193297 231378 181147 187503 159345 46001
8183D6001j18083J0432Q3755j02050j7452j7973p4574j9285p7116O2593J42236
$$ 46001 -72082 -61650 22105 -79945 -97397 -115370 -189944 -209229 -286345 -223752 -81516
8172h1516p802J1040P381o2229j7470r5385J4691k361R3669M0579O9492M3951
$$ -81516 -89318 -78278 -70897 -133126 -150596 -245981 -231290 -233651 -139982 -99403 -29911 14040
8160A4040j73208m939J31592L5309r5721p4391j4901K31068N3296j36108j93818
$$ 14040 -159168 -164107 -32515 2794 -92927 -167318 -182219 48849 102145 -33963 -227781
8149b27781N0375J02077n2911j95365n2668K20339Q0524k2207j9934n986q1383
$$ -227781 -177406 -75329 -128240 -323605 -376273 -155934 -75410 -97617 -117551 -123537 -204920
8138b04920j6583J68924j16547k4640J88808p5280m5508J2826P1851q2740m5556
$$ -204920 -221503 -52579 -169126 -193766 -4958 -80238 -125746 -112920 -41069 -123809 -169365
8127a69365o8696O8663J12825n3875j1571m9422J93992K58179n0978k57554j1516
$$ -169365 -238061 -169398 -56573 -110448 -122019 -171441 22551 280730 229752 -27802 -39318
8116c9318k4413M0717N023J689J4660L5307K6057o5118j61783J07367Q1458j47505
$$ -39318 -63731 -23014 -17991 -16302 -1642 33665 59722 -5396 -167179 -59812 21646 -125859
8104a25859k1896O4649M4349K4510M9505o5714j50782J15547K15077j53594n5093
$$ -125859 -147755 -83106 -38757 -14247 35258 -30456 -181238 -65691 149386 -4208 -59301
8093e9301J8539K0356K1851k2747p4238m2239J488J65098L5512L5243j00474l1930
$$ -59301 -40762 -20406 1445 -21302 -95540 -137779 -136291 28807 64319 99562 -912 -32842
8081c2842p5128Q4023J20895m6156m4292J65369K25716j40105r0087k02085J26309
$$ -32842 -107970 -23947 96948 50792 6500 171869 397585 257480 167393 -34692 91617
8070I1617O1163r1406L6613O3755r8270N3336O8158M1239j27135p1320J34147
$$ 91617 152780 61374 97987 161742 63472 116808 184966 226205 99070 27750 161897
8059A61897k2861k08138M5583J78369J615n0380L543m9339k32415K256j04457
$$ 161897 139036 -69102 -23519 154850 156465 106085 109628 60289 -172126 -169870 -274327
8048b74327o1426J45411K04979R6939M2333J03169L6878j17437j45219R1139M3719
$$ -274327 -335753 -190342 14637 111576 153909 257078 293956 176519 31300 122439 166158
8037A66158J6579k3488j28016o0127J79652J73752r6474j67575j08836j06958
$$ 166158 182737 159249 31233 -28894 150758 324510 228036 60461 -48375 -155333
8027a55333Q5253R3632Q4144l8199r5579K2354r0731J0834J29551J84218o9717
$$ -155333 -70080 23552 107696 69497 -26082 -3728 -94459 -83625 45926 230144 160427
8016A60427r9727k1196P2198j17416p3087j20768k8612P1160R5404L8992M8944
$$ 160427 60700 39504 111702 -5714 -78801 -199569 -228181 -157021 -61617 -22625 26319
8005B6319J42801J66484Q4165J24451M9711J25521O5920k11452j31220o3849j7778
$$ 26319 169120 335604 419769 544220 593931 719452 785372 573920 442700 378851 361073
7994C61073o6796l0544L4960l1522J66698J20825l2496j10834j33620j49120M5922
$$ 361073 294277 263733 298693 267171 433869 554694 522198 411364 277744 128624 174546
7983A74546r9694r5727k08775k978j63715M3273L23731K48702M0916L4098o1521
$$ 174546 74852 -20875 -229650 -232628 -396343 -353070 -29339 219363 260279 294377 232856
7972B32856J7527J30514j89005k1663l7074J8620J6117k1821N6376Q520J22606
$$ 232856 250383 380897 191892 170229 133155 151775 167892 146071 202447 210967 333573
7961C33573P3876k9241j11529j7931M537J57691N2134K7492o1501J06005n9049
$$ 333573 407449 378208 266679 248748 253285 410976 463110 490602 429101 535106 476057
7950D76057j29565j7622J37721m0154p7519N3426J29076j68969l5422L205J28921
$$ 476057 346492 328870 466591 426437 348918 402344 531420 362451 327029 330234 459155
7939D59155J7790r4480m4550j01792p2375Q8702j24426l8669R7450k7710j48253
$$ 459155 476945 382465 337915 236123 163748 252450 128024 89355 186805 159095 10842
7928A0842J05698K52778j38113j98282j40982l4458j11294r9355K0510P777L44036
$$ 10842 116540 369318 231205 32923 -108059 -142517 -253811 -353166 -332656 -324879 19157
7917A9157K70282N108N0365j381k49745L9148L21155j34119K4102J55154J12140
$$ 19157 289439 294547 344912 343531 93786 132934 454089 319970 344072 499226 611366
7906F11366l8296l21k76847k75967J01612K7486J0831j47629j474M6220Q1722
$$ 611366 573070 572749 295902 19935 121547 149033 159864 12235 10761 56981 138703
7895A38703K0651k81348j41614L2856L7484O2R8877R5188J50056Q6738j59872
$$ 138703 159354 -121994 -263608 -230752 -193268 -193206 -94329 859 150915 237653 77781
7884G7781k4444O9836J23122j00341k25001o2998J2899J12279n4621N4582O664
$$ 77781 53337 123173 246295 145954 -79047 -142045 -129146 -16867 -71488 -16906 -10242
7873a0242m5473Q6474J45291K32m2804j02777o0322o3980L057J1699q5285K6299
$$ -10242 -55715 30759 176050 176282 133478 30701 -29621 -93601 -90544 -78845 -164130 -137831
7861a37831J04916J1936k93640J3389J21344j16323p2037R1179J17040p6197m5620
$$ -137831 -32915 -20979 -314619 -301230 -179886 -296209 -368246 -277067 -160027 -236224 -281844
7850b81844J09824L0959Q9833Q9818N4641J49011L5672k37712p6427j98659m2897
$$ -281844 -172020 -141061 -51228 38590 93231 242242 277914 40202 -36225 -234884 -277781
7839b77781J07423J05978q3685K46463K3657O2698r4125o3878K7627J57131j07750
$$ -277781 -170358 -64380 -148065 98398 122055 184753 90628 26750 54377 211508 103758
7828A03758j06751j04601k9663P9461R6334j74633r4230J10800N6357j36035p5161
$$ 103758 -2993 -107594 -137257 -57796 38538 -136095 -230325 -119525 -63168 -199203 -274364
7817b74364K21193n6183M2133N0725j07027p9925j6193N6564P2238n4097o968
$$ -274364 -53171 -109354 -67221 -16496 -123523 -203448 -219641 -163077 -90839 -144936 -151904
7806a51904k6324o8265J37790J10417J935O9991K3592M9561l3582k5712j5293
$$ -151904 -178228 -246493 -108703 1714 3649 73640 97232 146793 113211 87499 72206
7795G2206Q6126N8128P9357n7287j53701j28131l0464J5973l166J03109p4531
$$ 72206 158332 216460 295817 238530 84829 -43302 -73766 -57793 -60959 42150 -32381
7784c2381j198J24849K2243j6828l8573O4659j69675o6507J95987K761N7785k7601
$$ -32381 -33579 91270 113513 96685 58112 122771 -46904 -113411 82576 85337 143122 115521
7772A15521o6971K578j3310J8869K499q0508k9416J94887K0923j14398K6208N5068
$$ 115521 48550 51128 37818 56687 59186 -21322 -50738 144149 165072 50674 76882 131950
7760A31950j47968j19579P625N7865O1290k9035k06597M31J41090J9854K3161
$$ 131950 -16018 -135597 -127972 -70107 -8817 -37852 -244449 -244018 -102928 -83074 -59913
7749e9913P2104P6837n9052j19329j85479j5112P9748J24888l8218j2677o8122
$$ -59913 12191 89028 29976 -89353 -274832 -289944 -210196 -85308 -123526 -136203 -204325
7738b04325l9825P5079J26560m0801q814q0214N1694j73595P1005Q3132j51006
$$ -204325 -244150 -169071 -42511 -83312 -92126 -172340 -120646 -294241 -223236 -140104 -291110
7727b91110j07433m2068J72405K8019j21493m7911J52980J63938k4816k80677
$$ -291110 -398543 -440611 -268206 -240187 -361680 -409591 -256611 -92673 -117489 -398166
7717c98166o8569K92468J38068K38226J3998r0033k7781M973L4854j5869r8033
$$ -398166 -466735 -174267 -36199 202027 216025 125992 98211 103184 138038 122169 24136
7706B4136j51914p0275J15122R4776j60154k62126M1687Q2198o5266P4854k3118
$$ 24136 -127778 -198053 -82931 11845 -148309 -410435 -368748 -286550 -351816 -276962 -300080
7695c00080L0035Q4733r3725Q478J87036J5453j18646j42584n1740R2666Q8381
$$ -300080 -270045 -185312 -279037 -270559 -83523 -68070 -186716 -329300 -381040 -288374 -199993
7684a99993o8804j7155J78079R4708q6903M403J00951L8092l2808r481o8795j28293
$$ -199993 -268797 -285952 -107873 -13165 -100068 -95665 5286 43378 10570 1089 -67706 -195999
7672a95999l0119J25984q7783J62165J2418K8487N0149O0745P1321M0583p3107
$$ -195999 -226118 -100134 -187917 -25752 -13334 15153 65302 126047 197368 237951 164844
7661A64844j01630j31600j4427m0470l4706m4574r9997P881Q7202M7405j21358
$$ 164844 63214 -68386 -82813 -123283 -157989 -202563 -302560 -294679 -207477 -160072 -281430
7650b81430O3842J87462J07594O8954o0533n3449j2882O1688Q9623l4160j01819
$$ -281430 -217588 -30126 77468 146422 85889 32440 19558 81246 170869 136709 34890
7639C4890p6637j44873p3646J70796O1377j436j01760o7418n7465M1506k5967
$$ 34890 -41747 -186620 -260266 -89470 -28093 -29529 -131289 -198707 -256172 -214666 -240633
7628b40633j3561K9247Q6934J64249Q0859j17414r7135K0549o2343K22910J61055
$$ -240633 -254194 -224947 -138013 26236 107095 -10319 -107454 -86905 -149248 73662 234717
7617B34717j38538j42832j14708m5632J0382L3488j8294p9330o1048J01333k4557
$$ 234717 96179 -46653 -161361 -206993 -196611 -163123 -181417 -260747 -321795 -220462 -245019
7606b45019L2196J10519J42096r0345r84P7358O966r3791n00L2563K613j61712
$$ -245019 -212823 -102304 39792 -50553 -51537 25821 32787 -61004 -61504 -28941 -26328 -188040
7594a88040N6307q8928j43515k4142J16510Q5342M9264P792J67866j00153Q441
$$ -188040 -131733 -220661 -364176 -388318 -271808 -186466 -137202 -129410 38456 -61697 -53256
7583e3256J23558K12409m8093J6746r4723k36662j19752q463O8832j48369j15733
$$ -53256 70302 282711 234618 251364 156641 -80021 -199773 -208236 -139404 -287773 -403506
7572d03506J86763Q6614K21798l74k27829o5496K30889j6545j96956L7123O6630
$$ -403506 -216743 -130129 91669 91295 -136534 -202030 28859 12314 -184642 -147519 -80889
7561h0889j0332M2095J5887l0487M0055l287L8429J11542j33354m5029J87645
$$ -80889 -91221 -49126 -33239 -63726 -23671 -26958 11471 123013 -10341 -55370 132275
7550A32275M6026q4200j84943j16769Q1133J56544j16564l8961J01086J4345N0788
$$ 132275 178301 94101 -90842 -207611 -126478 30066 -86498 -125459 -24373 -10028 40760
7539D0760N2177j23807j72109p8297J6206L6000J62443r2281K2330p1421K00072
$$ 40760 92937 -30870 -202979 -281276 -265070 -229070 -66627 -158908 -136578 -207999 -7927
7528g927l8990k03380L2815J06575o3516m7758J25069N1618j08379M5203j41560
$$ -7927 -46917 -250297 -217482 -110907 -174423 -222181 -97112 -45494 -153873 -108670 -250230
7517b50230j1061M5370k19048J49424m3736L0987P9445O9031m0329q7578N1705
$$ -250230 -261291 -215921 -434969 -285545 -329281 -298294 -218849 -149818 -190147 -277725 -226020
7506b26020Q1514J48702r3778m7015R7768O9830o2436L0115j50971Q1126q4718
$$ -226020 -144506 4196 -89582 -136597 -38829 31001 -31435 -1320 -152291 -71165 -155883
7495a55883m5492j47698k2555J53797P1863n8391k00296K42772P1006j63813J029
$$ -155883 -201375 -349073 -371628 -217831 -145968 -204359 -404655 -161883 -90877 -254690 -253661
7484b53661J20280M7594M4790R9856R2059O0743N5632N0615j42524n3999k2276
$$ -253661 -133381 -85787 -40997 58859 150918 211661 267293 317908 175384 121385 99109
7473I9109K952K2288j01043L7334l4215j12862j5433J885m9746J3978l5001k573
$$ 99109 102061 124349 23306 60640 26425 -86437 -101870 -99985 -149731 -135753 -170754 -173327
7461a73327K4850L0656J45554J11179j25769m5905J45343J3949K365k56882j33617
$$ -173327 -148477 -117821 27733 138912 13143 -32762 112581 126530 128895 -127987 -261604
7450b61604J77027J4316j042R4512J01816k6411n7689j68453l0929J41733J86976
$$ -261604 -84577 -70261 -71303 23209 125025 98614 40925 -127528 -158457 -16724 170252
7439A70252k9922j10721q0688M0117L1500o056r6774n2332j0867R442K16079K852
$$ 170252 140330 29609 -51079 -10962 20538 14482 -82292 -134624 -145491 -136049 80030 82882
7427H2882l0326J27736Q247k8551K1524M642Q5433k7654k03030k30388R3880J53926
$$ 82882 52556 180292 188539 159988 181512 186154 271587 243933 40903 -189485 -95605 58321
7415E8321J57634q8442j00684J95574L6769q0259j13740p6953l7199K7646o313
$$ 58321 215955 127513 26829 222403 259172 178913 65173 -11780 -48979 -21333 -27646
7404b7646K2343J37027j10983j32220j16648O8367J2886n5589J13531Q0781M428
$$ -27646 -5303 131724 20741 -111479 -228127 -159760 -146874 -202463 -88932 -8151 -3723
7393c723j07730Q5606o4159N8604L5871J9613p625k00262n6911J88247P4593q8367
$$ -3723 -111453 -25847 -90006 -31402 4469 24082 16457 -183805 -240716 -52469 22124 -66243
7381f6243J34159o6794j44535o7329P6543O5322J0386l06427j44320j09325R3609
$$ -66243 67916 1122 -143413 -210742 -134199 -68877 -58491 -364918 -509238 -618563 -524954
7370e24954J62531J40213K5332j16296K1720N3865j3167j51508Q8146J0553K0083
$$ -524954 -362423 -222210 -196878 -313174 -291454 -237589 -250756 -402264 -314118 -303565 -283482
7359b83482Q3652K25431O4226q1071j35880R9641J62265o5014N6584q370j44558
$$ -283482 -199830 25601 89827 8756 -127124 -27483 134782 69768 126352 117982 -26576
7348b6576k7909m3814o0086J13070Q316J5322K36825L4854j08735j76822M7295
$$ -26576 -54485 -98299 -158385 -45315 -36999 -21677 215148 250002 141267 -35555 11740
7337A1740r4001o8243P9441l3325j25245J09708J46451q6023j09831j42294J05621
$$ 11740 -82261 -150504 -71063 -104388 -229633 -119925 26526 -59497 -169328 -311622 -206001
7326b06001J73382P8817r056J0695N5605q919r8916N126N6910j5966j68516k29997
$$ -206001 -32619 46198 37142 47837 103442 94523 -4393 733 57643 41677 -126839 -356836
7314c56836J6611J32376m7126M4300p8115r2197j67354r534K96828J16429M9842
$$ -356836 -340225 -207849 -254975 -210675 -288790 -380987 -548341 -557875 -261047 -144618 -94776
7303i4776K54037J3092l4386J0019l4177R888n1478Q3888J05245m5696k05526
$$ -94776 159261 172353 137967 147986 113809 123697 72219 156107 261352 215656 10130
7292A0130j33378K38464J95597k74865j05732J22859M5434o5055k29349n7180
$$ 10130 -123248 115216 310813 35948 -69784 53075 98509 33454 -195895 -253075
7282b53075r3996Q7654K1131o962j0617Q9631N7158K6851O3992L3416R4597P1176
$$ -253075 -347071 -259417 -238286 -245248 -255865 -166234 -109076 -82225 -18233 15183 109780 180956
7270A80956m6362N094K1967j15863p4421J05919O8627R6217j7973j07999l504
$$ 180956 134594 139688 161655 45792 -28629 77290 145917 242134 224161 116162 112658
7259A12658o6227O4505J37308N0810J2270k2687o9856K8958R2690j88422j15065
$$ 112658 46431 110936 248244 299054 311324 288637 218781 247739 340429 152007 36942
7248C6942n9979J78771J1512k67876o8798k1143j8459N8388O8591L7174K0860
$$ 36942 -23037 155734 167246 -100630 -169428 -190571 -209030 -150642 -82051 -44877 -24017
7237b4017m292n1631j34500J16870l2724P1344J66148K7922o6941k9020P1039
$$ -24017 -28309 -79940 -214440 -97570 -130294 -58950 107198 135120 68179 39159 110198
7226A10198k8248m0327l2291j09613R8354J14168J0581K7783k5100N841j31444
$$ 110198 81950 41623 9332 -100281 -1927 112241 122822 150605 125505 131346 -98
7215i8r2731k7398n1106Q5766J26668K5012r9716O0634R2062o7319j64695j13623
$$ -98 -92829 -120227 -171333 -85567 41101 66113 -33603 27031 119093 51774 -112921 -226544
7203b26544q0879J67874r136O2030o1144N593K7217J96282K56226N5747k48894
$$ -226544 -307423 -139549 -148685 -86655 -147799 -142206 -114989 81293 337519 393266 144372
7192A44372r7455j03655k4305J06840N1590n6049n6267J12431q669j88249n3457
$$ 144372 46917 -56738 -81043 25797 77387 21338 -34929 77502 68833 -119416 -172873
7181a72873k437K3684K3715K4950P5787M1283J10640R5964O4332j18431k02669
$$ -172873 -175310 -151626 -127911 -102961 -27174 14109 124749 220713 285045 166614 -36055
7170c6055j15005j9383J02668j9202p5989p075o4037K05366N5983J8345J959j38657
$$ -36055 -151060 -170443 -67775 -86977 -162966 -170041 -234078 -28712 27271 45616 47575 -91082
7158i1082m7827j57728J5313J69038Q6313j3637J8675q8459J76267J32504n3708
$$ -91082 -138909 -296637 -281324 -112286 -25973 -39610 -20935 -109394 66873 199377 145669
7147A45669j32546o9966r6255J71245r5012Q7034L9004Q5245J00606l2685k02505
$$ 145669 13123 -56843 -153098 18147 -76865 10169 49173 134418 235024 202339 -166
7136a66n4498m5629J36361K5422j72950l1761j55749j13410p272Q4839K68996
$$ -166 -54664 -100293 36068 61490 -111460 -143221 -298970 -412380 -419652 -334813 -65817
7125f5817J22337p1316j91896n6215J49828J49124k931R816O3267m3034l9891
$$ -65817 56520 -14796 -206692 -262907 -113079 36045 33114 42930 106197 63163 23272
7114B3272J20673L7553j2633M7506p473L8885p6111r6678m5185K13290J0630K3449
$$ 23272 143945 181498 168865 216371 208898 247783 171672 74994 29809 243099 253729 277178
7102B77178o1808j38608J08515m903k8583j21362Q3099P2716n9575P7947O3135
$$ 277178 215370 76762 185277 180374 151791 30429 113528 186244 126669 204616 267751
7091B67751k6371l7047l35180K2097J60833J50641o3908j50708J5345m1553k7983
$$ 267751 241380 204333 -130847 -108750 52083 202724 138816 -11892 3453 -38100 -66083
7080f6083j1640q2169o4857J95399K51455r7293r3886J20496j46958j28842J07896
$$ -66083 -77723 -159892 -224749 -29350 222105 124812 30926 151422 4464 -124378 -16482
7069a6482o16r4736r8263Q5313O3654R6383Q3244o1365j3165P1241J04627k58266
$$ -16482 -17098 -111834 -210097 -124784 -61130 35253 118497 57132 43967 115208 219835 -38431
7057c8431j90808K11418n0574k24468l0349K36443M5953J07199M8212Q667q3977
$$ -38431 -229239 -17821 -68395 -292863 -323212 -86769 -40816 66383 114595 123262 39285
7046C9285l8501J25893r5545k66210j55624J33223N4754J707o2038K06870J38893
$$ 39285 784 126677 31132 -235078 -390702 -257479 -202725 -201018 -263056 -56186 82707
7035H2707n0297j36526J4666o233L5748M6816r6287j50328n7949P4739N5270N2146
$$ 82707 32410 -104116 -89450 -95683 -59935 -13119 -109406 -259734 -317683 -242944 -187674 -135528
7023a35528N3970M3611o532l8138J9790O4824O4897J52639n2094p8805q1722m645
$$ -135528 -81558 -37947 -44479 -82617 -62827 1997 66894 219533 167439 88634 6912 2267
7011B267M4086L9957p73O494k17652p4971J33085N4775O5721r5470j05075K45941
$$ 2267 46353 86310 85537 92031 -125621 -200592 -67507 -12732 52989 -42481 -147556 98385
6999I8385J56661j84571j64775o4638p371P2810O5131N7626K32350K8408k08559
$$ 98385 255046 70475 -94300 -158938 -166309 -93499 -28368 29258 261608 290016 81457
6988H1457j86174j40152L1376Q1233K13567j20246J8152l9490j5638m5259O5558
$$ 81457 -104717 -244869 -213493 -132260 81307 -38939 -20787 -60277 -75915 -121174 -55616
6977e5616l01O6936o6882n7657j29937j43616O1065K65743n5840o2825m7757J00417
$$ -55616 -55917 11019 -55863 -113520 -243457 -387073 -326008 -60265 -116105 -178930 -226687 -126270
6965a26270J1815p8881J11382M0263j18741j9649J26767K5488n2253l4228M7908
$$ -126270 -114455 -193336 -81954 -41691 -160432 -180081 -53314 -27826 -80079 -114307 -66399
6954f6399j46263k1820J04022J0015J35364K8231N5309Q240n1859o9519P2354
$$ -66399 -212662 -234482 -130460 -120445 14919 43150 98459 106699 54840 -14679 57675
6943E7675J57185k8130j77690p7765l6660O768j2206N38l4262p4565n7788K76651
$$ 57675 214860 186730 9040 -68725 -105385 -98617 -110823 -110285 -144547 -219112 -276900 -249
6931b49O5429J10318j43759q6264K5662J11267K70021K0263q2467M8463n3652
$$ -249 65180 175498 31739 -54525 -28863 82404 352425 372688 290221 338684 285032
6920B85032q6572r1609L4399j0810j1880j54783r5314O6850o6297J42749N3896
$$ 285032 198460 106851 141250 130440 118560 -36223 -131537 -64687 -130984 11765 65661
6909F5661j82131j70883K6798J31639m499O2189Q7548J5419j57491l1243J19945
$$ 65661 -116470 -287353 -260555 -128916 -133415 -71226 16322 31741 -125750 -156993 -37048
6898c7048K4095Q4981o3646l3563J1992k9359R2898N1524M9554l859o2784k5692
$$ -37048 -12953 72028 8382 -25181 -13189 -42548 50350 101874 151428 147569 84785 59093
6886E9093q7652q8846j5276M2956k3579k8367p5512J36805L3755J2880R0598n3931
$$ 59093 -28559 -117405 -132681 -89725 -113304 -141671 -217183 -80378 -46623 -33743 56855 2924
6874B924k13966o9778K43169L00903n729o8563M2501r345k31105j50258m048L240
$$ 2924 -211042 -280820 -37651 263252 257523 188960 231461 222116 -8989 -159247 -163295 -160055
6862a60055Q8330m3151j3837M9730j23485j53878K4011M5963M9390J13892n1741
$$ -160055 -71725 -114876 -128713 -78983 -202468 -356346 -332335 -286372 -236982 -123090 -174831
6851a74831k6244M291J4094R2782Q2800j305j39192j43672J15354J6989p5921
$$ -174831 -201075 -196784 -182690 -89908 -7108 -8413 -147605 -291277 -175923 -158934 -234855
6840b34855L3238J68134O0769j54401P289p2603J32611l7197n6539J27876l5397
$$ -234855 -201617 -33483 27286 -127115 -119826 -192429 -59818 -97015 -153554 -25678 -61075
6829f1075k47291m1538J4782j1748J60621J78109o5543o7211k0858o9957Q8365
$$ -61075 -308366 -349904 -335122 -346870 -186249 -8140 -73683 -140894 -161752 -231709 -143344
6818a43344r4515k44255J18063K75263j1938L1942k3630o6548J38362l7277J1236
$$ -143344 -237859 -482114 -364051 -88788 -100726 -68784 -92414 -158962 -20600 -57877 -46641
6807d6641j04719j32644p6806J12354K02076m2744k0158N4311K4158O7890l1980
$$ -46641 -151360 -284004 -360810 -248456 -46380 -89124 -109282 -54971 -30813 37077 5097
6796E097j81937p6928K2260n8147j11407K05445K29802K13909k1650r1463j11506
$$ 5097 -176840 -253768 -231508 -289655 -401062 -195617 34185 248094 226444 134981 23475
6785B3475n121L8006j17716j23467N0265N7853n712j07647p0385M415J74864J5257
$$ 23475 18354 56360 -61356 -184823 -134558 -76705 -82417 -190064 -260449 -256034 -81170 -65913
6773f5913M711M5232J24830L2103k7766Q9813j21646j54499j52545n1097J62987
$$ -65913 -61202 -15970 108860 140963 113197 203010 81364 -73135 -225680 -276777 -113790
6762a13790L30412J9637m5360j59332j63054l9938j01680q2646O1732J68756M1148
$$ -113790 216622 236259 190899 31567 -131487 -171425 -273105 -355751 -294019 -125263 -84115
6751h4115k5853J01745N3876L0515n0359j2326n1781N7480J08014j90788N830
$$ -84115 -109968 -8223 45653 76168 25809 13483 -38298 19182 127196 -63592 -57762
6740e7762K3761q2027N4651M3455q2580k16709K0674j5341l8126k2824J35777
$$ -57762 -34001 -116028 -61377 -17922 -100502 -317211 -296537 -311878 -350004 -372828 -237051
6729b37051J35824q1191n9129Q8903k4424L2290O2868k4995K1159r830k51579
$$ -237051 -101227 -182418 -241547 -152644 -177068 -144778 -81910 -106905 -85746 -95576 -347155
6718c47155m7029J04367L7950Q9631o3579j18060j30877O1651J50691Q7585J5363
$$ -347155 -394184 -289817 -251867 -162236 -225815 -343875 -474752 -413101 -262410 -174825 -159462
6707a59462J13063j15517m0716J63432L0547n9830k2181l1256j10873J54162J30492
$$ -159462 -46399 -161916 -202632 -39200 -8653 -68483 -90664 -121920 -232793 -78631 51861
6696E1861l9282J5733J67181N5962l3001r8222L751l1901p4860L7626K33939Q0179
$$ 51861 12579 28312 195493 251455 218454 120232 123983 92082 17222 54848 288787 368966
6684C68966j06402j22351j20180M6849j9813k43808l0445P570j75244L5271J39354
$$ 368966 262564 140213 20033 66882 47069 -196739 -227184 -219614 -394858 -359587 -220233
6673b20233j18041L47O3246R1760K6422o8246J17402j5218r8939L3804O1728j68659
$$ -220233 -338274 -337927 -274681 -182921 -156499 -224745 -107343 -122561 -221500 -187696 -125968 -294627
6661b94627O6269Q5898M7607J18229J01217q9205O685j44590j33209Q0034J35080
$$ -294627 -228358 -142460 -94853 23376 124593 35388 42073 -102517 -235726 -155692 -20612
6650b0612M3968q082j70894K5395J63435l9044m495j43847k47298j15382J10171
$$ -20612 23356 15274 -155620 -130225 33210 -5834 -10329 -154176 -401474 -516856 -406685
6639d06685l9617J57R8913N9579P4088l0883J19638N3813J38174j01654p4949
$$ -406685 -446302 -446145 -347232 -287653 -213565 -244448 -124810 -70997 67177 -34477 -109426
6628a09426M9358j3286j35391k3641o6625j3594j02512K00877J50894J68435q1616
$$ -109426 -60068 -73354 -208745 -232386 -299011 -312605 -415117 -214240 -63346 105089 23473
6617B3473q3824k5172K3301r9807j22222N0297J02321N5740k5587j34819j07048
$$ 23473 -60351 -85523 -62222 -162029 -284251 -233954 -131633 -75893 -101480 -236299 -343347
6606c43347J37729Q1681R4705M9574q4813R0617M6602J03980K0798j67819j37744
$$ -343347 -205618 -123937 -29232 20342 -64471 26146 72748 176728 197526 29707 -108037
6595a08037n3235p41J70597K46175M5516q7583l7873j54253l0646l1594r7712
$$ -108037 -161272 -162013 8584 254759 300275 212692 174819 20566 -10080 -41674 -139386
6584a39386Q591P2091o1473j21089O7587J37365q8000l8910R8879L4111J42278
$$ -139386 -130795 -58704 -120177 -241266 -173679 -36314 -124314 -163224 -64345 -30234 112044
6573A12044n4518R2660R4579l9899o418J03097j05111j92111q945N8968p2436
$$ 112044 57526 150186 244765 204866 198448 301545 196434 4323 -4622 54346 -18090
6562a8090q7965O6289J79583k0277N4038J29012L1680j86598o8089K5058j18301
$$ -18090 -106055 -39766 139817 119540 173578 302590 334270 147672 79583 104641 -13660
6551a3660q8863l7757Q5635O5116J75258J07306l10982j85339J20975J16687k56488
$$ -13660 -102523 -140280 -54645 10471 185729 293035 -17947 -203286 -82311 34376 -222112
6540b22112j6419J65536O2656N9491m1809P920n7751j24872J7477K31409O1652
$$ -222112 -238531 -72995 -10339 49152 7343 15263 -42488 -167360 -149883 81526 143178
6529A43178L2591k37446j66657J3986O8907O5363l6439m9289j26366O7265R0379
$$ 143178 175769 -61677 -228334 -214348 -145441 -80078 -116517 -165806 -292172 -224907 -134528
6518a34528n4732O7376L7325r9726p5599j10046q2599q4874n4527K76915L10468
$$ -134528 -189260 -121884 -84559 -184285 -259884 -369930 -452529 -537403 -591930 -315015 -4547
6507d547N2515p5114m1279k8115o100J9341l8897K7736O3912n1102p7060m3897
$$ -4547 47968 -27146 -68425 -96540 -102640 -83299 -122196 -94460 -30548 -81650 -158710 -202607
6495b02607L774N5774Q3094o3599j31033J25560J68604k49r5461j41704J58851
$$ -202607 -198833 -143059 -59965 -123564 -254597 -129037 39567 39318 -56143 -197847 -38996
6484c8996J74465m0553l1330j09640n1870m7271O9262J11239k21526k02227J60378
$$ -38996 135469 94916 63586 -46054 -97924 -145195 -75933 35306 -186220 -388447 -228069
6473b28069O5112J34797n4283M2360n1820J41467R6781r9798j44357p9447j21288
$$ -228069 -162957 -28160 -82443 -40083 -91903 49564 146345 46547 -97810 -177257 -298545
6462b98545O6317j8817M6509J02728K0855J07657n6948N1223o3610q8992l6318
$$ -298545 -232228 -251045 -204536 -101808 -80953 26704 -30244 20979 -42631 -131623 -167941
6451a67941J5766J79369J45735N7015j98939j61789J35320J12529j6614l54J00747
$$ -167941 -152175 27194 172929 229944 31005 -130784 4536 117065 100451 100097 200844
6440B00844M9819o6984j07121j47843J22901J701N0714J8994L3953L2587R4377
$$ 200844 250663 183679 76558 -71285 51616 53317 104031 123025 156978 189565 283942
6429B83942p2989j10268J43126m5535K593o6409J33308O8475j63411j85760m5460
$$ 283942 210953 100685 243811 198276 200869 134460 267768 336243 172832 -12928 -58388
6418e8388j04088J09157J92234n7948k81804j49608J36806k1109O5290p5945K7611
$$ -58388 -162476 -53319 138915 80967 -200837 -350445 -213639 -234748 -169458 -245403 -217792
6407b17792o8711j17252l7818m3953l1698J25627R1710J11441J60985j46240j95633
$$ -217792 -286503 -403755 -441573 -485526 -517224 -391597 -299887 -188446 -27461 -173701 -369334
6396c69334J59004j0687k5979J79038J6179j34845K1494J77243N7245k09099L4226
$$ -369334 -210330 -221017 -246996 -67958 -51779 -186624 -165130 12113 69358 -139741 -105515
6385a05515K9555p5343O3564J26033L24983J15687j0687k7439r7774r4315J13010
$$ -105515 -75960 -151303 -87739 38294 363277 478964 468277 440838 343064 248749 361759
6374C61759M0246j92774j93278K2936K54587o6987j50027O9355n710J17804q7211
$$ 361759 402005 209231 15953 38889 293476 226489 76462 145817 140107 257911 170700
6363A70700l3911j0223K00042J11554r3290j55060M6703L9521j16593j58654j5468
$$ 170700 136789 126566 326608 438162 344872 189812 236515 276036 159443 789 -14679
6352a4679J90608p8204j76128k2590m0583Q7073L2145j51714m8084J24633L4726
$$ -14679 175929 97725 -78403 -100993 -141576 -54503 -22358 -174072 -222156 -97523 -62797
6341f2797m6707J22370r6589P9306o2755M9356k20471j14296R8706L6615N7735
$$ -62797 -109504 12866 -83723 -4417 -67172 -17816 -238287 -352583 -253877 -217262 -159527
6330a59527q5605J60294J21357J6521k25118j85948N4763J60540J73093J71285
$$ -159527 -245132 -84838 36519 53040 -172078 -358026 -303263 -142723 30370 201655
6320B01655k48417M289j0967J8036l0837p9117J48691n3477m100l1430J8078M2163
$$ 201655 -46762 -42473 -53440 -35404 -66241 -145358 3333 -50144 -54244 -85674 -67596 -25433
6308b5433N5217r8231m4055L1847M5002l9314R2812L9928j40289j01230j24608
$$ -25433 29784 -68447 -112502 -80655 -35653 -74967 17845 57773 -82516 -183746 -308354
6297c08354o1324J18556O8748Q5847O2355K9116k3449m3893M0927r225L62Q3451
$$ -308354 -369678 -251122 -182374 -96527 -34172 -5056 -28505 -72398 -31471 -40696 -40334 43117
6285D3117J3706n3521J1728o7017J0393N7255r8239j2187n1063K18J02105O1592
$$ 43117 56823 3302 15030 -51987 -41594 15661 -82578 -94765 -145828 -145610 -43505 18087
6273A8087M7399P6549n3201j15995k9097j11206k33819J58691J90842J18949n9623
$$ 18087 65486 142035 88834 -27161 -56258 -167464 -401283 -242592 -51750 67199 7576
6262G576J0736p8208j26819j84671J64309J41841J03157J47004j01008n3627O0519
$$ 7576 18312 -59896 -186715 -371386 -207077 -65236 37921 184925 83917 30290 90809
6251I0809n877p5340K6742K7543J404k69385j9790R1828k7546K39542J35649n7394
$$ 90809 84932 9592 36334 63877 65281 -204104 -223894 -132066 -159612 79930 215579 158185
6239A58185r7126Q0591R9722k82460J8599L0676p4032J6326Q8903j52781p9534
$$ 158185 61059 141650 241372 -41088 -22489 8187 -65845 -49519 39384 -113397 -192931
6228a92931J10478J06173J07678Q3280r601k17918q9511J2870K8073J12432J80784
$$ -192931 -82453 23720 131398 214678 205077 -12841 -102352 -89482 -61409 51023 231807
6217B31807j1987N3204o0173l0716j27718m2189L5947L9444l0282j23617K9383
$$ 231807 219820 273024 212851 182135 54417 12228 48175 87619 57337 -66280 -36897
$$ [...]
##END NTUPLES=NMR SPECTRUM
##END=
