##TITLE=Analysis number 319978
Compound Code spb 06322
Project Code adrs
Chemist Name scafell
##JCAMPDX= 6.0         $$ Bruker NMR JCAMP-DX V2.0
##DATA TYPE= NMR SPECTRUM
##DATA CLASS= NTUPLES
##ORIGIN= Bruker BioSpin GmbH
##OWNER= nmr
$$ XWIN-NMR		Version 3.5
$$ Tue Jun  6 10:57:09 2006 GMT Daylight Time (UT+1h)  MAYBRIDGE\nmr@NMR_250MHZ
##.OBSERVE FREQUENCY= 250.131544655141
##.OBSERVE NUCLEUS= ^1H
##.ACQUISITION MODE= SIMULTANEOUS (DQD)
##.ACQUISITION SCHEME= undefined
##.AVERAGES= 16
##.DIGITISER RES= 18
##SPECTROMETER/DATA SYSTEM= dpx250
##.PULSE SEQUENCE= zg30
##.SOLVENT NAME= CDCl3
##.SHIFT REFERENCE= (INTERNAL, CDCl3, 0, 16.522)
##AUDIT TRAIL= $$ (NUMBER, WHEN, WHO, WHERE, WHAT)
$$ ##TITLE= Audit trail, XWIN-NMR		Version 3.5
$$ ##JCAMPDX= 5.01
$$ ##ORIGIN= Bruker BioSpin GmbH
$$ ##OWNER= nmr
$$ C:\u/data/dgb/nmr/ADRS/320/pdata/1/auditp.txt
$$ ##AUDIT TRAIL=  $$ (NUMBER, WHEN, WHO, WHERE, WHAT)
(   1,<2006-06-06 10:56:27.79 +100>,<MAYBRIDGE\nmr>,<NMR_250MHZ>,
      <created by zg, POWCHK disabled, PULCHK disabled
       configuration hash MD5:
       E2 DF 36 D8 04 B2 41 60 5A D7 A3 38 5A 4B D0 FE
       data hash MD5: 64K
       4B E0 44 4D 0A 7F 8F AE 70 08 EE FD 3B A3 7C C4>)
(   2,<2006-06-06 10:56:45.40 +100>,<MAYBRIDGE\nmr>,<NMR_250MHZ>,
      <Start of raw data processing
       ef LB = 0.3 FT_mod = 6 PKNL = 1 SI = 32K 
       data hash MD5: 32K
       AA D9 39 4D 98 90 A4 FF 64 01 B7 D9 96 B6 8C 10>)
(   3,<2006-06-06 10:56:49.34 +100>,<MAYBRIDGE\nmr>,<NMR_250MHZ>,
      <apk 
       data hash MD5: 32K
       22 50 29 BC 10 72 28 5E AC 16 2A B0 54 E0 A7 9F>)
(   4,<2006-06-06 10:56:51.23 +100>,<MAYBRIDGE\nmr>,<NMR_250MHZ>,
      <abs ABSG = 5 
       data hash MD5: 32K
       E0 2A 0F 9A D5 CF 39 48 A2 81 93 F8 55 07 D8 2B>)
$$ ##END=
$$ 
$$ hash MD5
$$ B2 93 73 48 7D EF A6 FA FA F2 7B 18 56 74 50 15
##$RELAX= 
##$RELAX= 
##$RELAX= 
##$RELAX= 
##$RELAX= 
##$RELAX= 
##$RELAX= 
$$ Bruker specific parameters
$$ --------------------------
##$DU= <C:\u>
##$EXPNO= 320
##$NAME= <ADRS>
##$PROCNO= 1
##$TYPE= <nmr>
##$USER= <dgb>
##$AMP= (0..31)
100 100 100 100 100 100 100 100 100 100 100 100 100 100 100 100 100 100 
100 100 100 100 100 100 100 100 100 100 100 100 100 100 
##$AQSEQ= 0
##$AQ_mod= 3
##$AUNM= <au_zg>
##$AUTOPOS= <5 >
##$BF1= 250.13
##$BF2= 250.13
##$BF3= 250.13
##$BF4= 250.13
##$BF5= 500.13
##$BF6= 500.13
##$BF7= 500.13
##$BF8= 500.13
##$BYTORDA= 1
##$CFDGTYP= 0
##$CFRGTYP= 5
##$CHEMSTR= <none>
##$CNST= (0..31)
1 1 145 1 1 1 1 1 1 1 1 1 1 1 1 1 1 1 1 1 1 1 1 1 1 1 1 1 1 1 1 1 
##$CPDPRG= <>
##$CPDPRG1= <>
##$CPDPRG2= <>
##$CPDPRG3= <>
##$CPDPRG4= <mlev>
##$CPDPRG5= <mlev>
##$CPDPRG6= <mlev>
##$CPDPRG7= <mlev>
##$CPDPRG8= <mlev>
##$CPDPRGB= <>
##$CPDPRGT= <>
##$D= (0..31)
0 1 0 0 0 0 0 0 0 0.06 0 0 0 0 0 0 0.0002 0 0 0 0 0 0 0 0 0 0 0 0 0 0 
0 
##$DATE= 1149587785
##$DBL= (0..7)
120 120 120 120 120 120 120 120 
##$DBP= (0..7)
150 150 150 150 150 150 150 150 
##$DBP07= 0
##$DBPNAM0= <>
##$DBPNAM1= <>
##$DBPNAM2= <>
$$ [...]
##$SUBNAM7= <"">
##$SUBNAM8= <"">
##$SUBNAM9= <"">
##$SW= 20.6930455092707
##$SWIBOX= (0..15)
0 0 3 0 0 0 0 0 0 0 0 0 0 0 0 0 
##$SW_h= 5175.983436853
##$TD= 65536
##$TD0= 1
##$TE= 296.16
##$TE2= 300
##$TE3= 300
##$TEG= 300
##$TL= (0..7)
0 120 120 120 120 120 120 120 
##$TP= (0..7)
150 150 150 150 150 150 150 150 
##$TP07= 0
##$TPNAME0= <>
##$TPNAME1= <>
##$TPNAME2= <>
##$TPNAME3= <>
##$TPNAME4= <>
##$TPNAME5= <>
##$TPNAME6= <>
##$TPNAME7= <>
##$TPOAL= (0..7)
0.5 0.5 0.5 0.5 0.5 0.5 0.5 0.5 
##$TPOFFS= (0..7)
0 0 0 0 0 0 0 0 
##$TUNHIN= 0
##$TUNHOUT= 0
##$TUNXOUT= 0
##$USERA1= <user>
##$USERA2= <user>
##$USERA3= <user>
##$USERA4= <user>
##$USERA5= <user>
##$V9= 5
##$VALIST= <valist>
##$VCLIST= <CCCCCCCCCCCCCCC>
##$VD= 0
##$VDLIST= <DDDDDDDDDDDDDDD>
##$VPLIST= <PPPPPPPPPPPPPPP>
##$VTLIST= <TTTTTTTTTTTTTTT>
##$WBST= 1024
##$WBSW= 4
##$XGAIN= (0..3)
0 0 0 0 
##$XL= 0
##$YL= 0
##$YMAX_a= 376977
##$YMIN_a= -371643
##$ZGOPTNS= <>
##$ZL1= 120
##$ZL2= 120
##$ZL3= 120
##$ZL4= 120
##$ABSF1= 16.522
##$ABSF2= -4.171173
##$ABSG= 5
##$ABSL= 3
##$ALPHA= 0
##$AQORDER= 0
##$ASSFAC= 0
##$ASSFACI= 0
##$ASSFACX= 0
##$ASSWID= 0
##$AUNMP= <proc_1d>
##$AZFE= 0.1
##$AZFW= 0.1
##$BCFW= 0
##$BC_mod= 0
##$BYTORDP= 0
##$COROFFS= 0
##$CY= 12.5
##$DATMOD= 1
##$DC= 0
##$DFILT= <>
##$DTYPP= 0
##$F1P= 14.0000005364418
##$F2P= -0.99999901652339
##$FCOR= 0.5
##$FTSIZE= 32768
##$FT_mod= 6
##$GAMMA= 0
##$GB= 0
##$INTBC= 1
##$INTSCL= 1
##$ISEN= 128
##$LB= 0.3
##$LEV0= 0
##$LPBIN= 0
##$MAXI= 10000
##$MC2= 0
##$MEAN= 0
##$ME_mod= 0
##$MI= 0
##$NCOEF= 0
##$NC_proc= -3
##$NLEV= 6
##$NOISF1= 0
##$NOISF2= 0
##$NSP= 0
##$NTH_PI= 0
##$NZP= 0
##$OFFSET= 16.522
##$PC= 1
##$PHC0= 172.4281
##$PHC1= 8.325448
##$PH_mod= 1
##$PKNL= yes
##$PPARMOD= 0
##$PSCAL= 4
##$PSIGN= 0
##$REVERSE= no
##$SF= 250.13
##$SI= 32768
##$SIGF1= 0
##$SIGF2= 0
##$SINO= 400
##$SIOLD= 32768
##$SREGLST= <1H.CDCl3>
##$SSB= 0
##$STSI= 32768
##$STSR= 0
##$SW_p= 5175.98343685301
##$SYMM= 0
##$S_DEV= 0
##$TDeff= 65536
##$TDoff= 0
##$TI= <Analysis number 999999
Compound Code 99
Book Reference 9
Project Code 9>
##$TILT= no
##$TM1= 0
##$TM2= 0
##$TOPLEV= 0
##$USERP1= <user>
##$USERP2= <user>
##$USERP3= <user>
##$USERP4= <user>
##$USERP5= <user>
##$WDW= 1
##$XDIM= 32768
##$YMAX_p= 336113285
##$YMIN_p= -165191
$$ End of Bruker specific parameters
$$ ---------------------------------
##NTUPLES= NMR SPECTRUM
##VAR_NAME=  FREQUENCY,     SPECTRUM/REAL,   SPECTRUM/IMAG
##SYMBOL=    X,             R,               I
##VAR_TYPE=  INDEPENDENT,   DEPENDENT,       DEPENDENT
##VAR_FORM=  AFFN,          ASDF,            ASDF
##VAR_DIM=   32768,         32768,           32768
##UNITS=     HZ,            ARBITRARY UNITS, ARBITRARY UNITS
##FACTOR=    0.157963299565203, 1,           1
##FIRST=     4132.6476996994, 0,             0
##LAST=      -1043.33573715361, 0,           0
##MIN=       -1043.33573715361, -165191,     0
##MAX=       4132.6476996994, 336113285,     0
$$ Real data points
##PAGE= N=1
##DATA TABLE= (X++(R..R)), XYDATA
$$ [...]
19283A48847J7158k5509M2099L5150P506r005K7812L5475j7702o4105q3430q250
19271A06046L2614N126J8842O557J451M0536Q029j8534K6573j0404l0397P261
19259A93700K7242J3088M55p214L2797R31l2498n3754k1425P5417K2004m0805
19247B09938o069k903m1250n5766k0507K8595n271m4786j2032N365O7171K0453
19235A42938j5175p600l2660n7986r471m6119j2034L0790P571n218R587N6543
19223F1166K0499n0978n045K1227L1084K4554q708l5964K8596O0027o828k0651
19211A18979L998P087l4657j1703k4631J5670L7915N2997k8015l7058j2776P654
19199I5460j9752m1987L5314P0174l1280n3537k2345O46N1258J1942k052J3184
$$ plain form
19283 148847 166005 140496 182595 217745 225251 216246 244058 279533 261831 197726 114296 106046
19271 106046 138660 143786 162628 169185 170636 211172 219201 200667 227240 216836 186439 193700
19259 193700 220942 234030 234485 227271 260068 260999 228501 174747 153322 228739 250743 209938
19247 209938 203869 200966 159716 103950 83443 112038 106767 61981 49949 55314 122485 142938
19235 142938 127763 120163 87503 29517 20046 -26073 -38107 -7317 254 -4964 4623 61166
19223 61166 81665 30687 25642 46869 77953 102507 93799 57835 86431 146458 139630 118979
19211 118979 122977 130064 95407 83704 59073 74743 112658 165655 137640 100582 87806 95460
19199 95460 75708 33721 69035 139209 107929 54392 32047 32693 83951 95893 93841 107025
19187A07025P226k3492J9109k941m2491j1179N5883r401n258j5818r072j9759
19175D9832j1586J0632L9175M3473j7226m3665k2096J837N664R38l8611m043L3858
19162D8182Q723j758K9139Q283j1382L5819K3601m0519k5209k599m2403L8415
19150F8292J1325m696J53l1297l8883k9521p179Q3866R5859M4889k5401k6090
19138A41317J0819P718j9016K989j362j0076M0746Q850k9989j3229N610J903Q031
19125A54311K5311n48m6633o646j8232j270m290r450r760J133k0828j4967K8824
19112G6955M7776m7913J9550M6792j1532k6915j262m474k0254k3769K1790K6093
19100A02837j6804j8477o756m7841L1590N1021j1509L904m3280J6145P2785j0474
$$ plain form
19187 107025 114251 90759 109868 106927 64436 53257 109140 99739 94481 78663 69591 49832
19175 49832 38246 48878 88053 131526 114300 70635 48539 50376 56040 56978 18367 14324 48182
19162 48182 56905 55147 84286 92569 81187 117006 140607 100088 74879 72280 29877 68292
19150 68292 79617 74921 75074 43777 4894 -24627 -31806 52060 147919 192808 167407 141317
19138 141317 152136 159854 140838 143827 142465 132389 173135 181985 151996 138767 144377 146280 154311
19125 154311 179622 179074 132441 125795 107563 106293 102003 92553 82793 83926 63098 48131 76955
19112 76955 124731 76818 96368 143160 131628 104713 103451 98977 78723 54954 76744 102837
19100 102837 86033 67556 60800 12959 44549 95570 84061 87965 44685 60830 133615 123141
19088A23141l0561O146K5049N7734K3606m9683l799K7315L9650k2341n3481M0974
19076A83750N8254J0026L8400P868k2813j7781L2124N8636j9054j2258l1141L2629
19064C18640J8102l3659m8468k8558K6942m732j9330m1267n677M1072J964J1876
19052B36905k5m1617J9022n570l0845k6782M706l821M8212L3219J4815J613l8181
19039B11651K6637l7374o658J7887K8389L772M2887N6937j6203k6366M3368j1211
19027C33716o371J1483m490M073q559L817j4249L5114N6174L3080L8726J0569
19015D93083Q144J0666r935k1454j2995r594n7804m5967n4963j4547j9029L0003
19003B95608L4543P941J4604J9011J52J7174K9068k8282N468O1324K7653n176
$$ plain form
19088 123141 92580 98726 123775 181509 205115 155432 151633 178948 218598 196257 142776 183750
19076 183750 242004 252030 290430 298298 275485 257704 289828 348464 329410 317152 286011 318640
19064 318640 336742 303083 254615 226057 252999 248267 228937 187670 181993 223065 225029 236905
19052 236905 236880 195263 214285 208715 177870 151088 155794 151973 200185 233404 248219 249832 211651
19039 211651 238288 200914 194256 212143 240532 244304 287191 344128 327925 301559 344927 333716
19027 333716 327345 338828 334338 338411 329852 333669 319420 354534 410708 443788 482514 493083
19015 493083 501227 511893 501958 480504 467509 457915 400111 354144 299181 284634 265605 295608
19003 295608 330151 338092 352696 371707 371859 389033 418101 389819 395287 456611 484264 479088
18991D79088j2685L4485O0989K0637K0377j1662N4862K1470O5913O3065M1817
18980H38356P5289M5235L6033j133M8678J7473N3751N5958R2241J39483J38041
18969A539405J21526J09621K00021K25361L02843L59150M53400O66805Q75948
18960D854080J191414J701264K367462L159484L355273K631820K366709K344583
18952B3972089K111423J445893O98261Q49164J800992K927252K944873J320983
18944C8070930r61308j789124j136858q63423j539397j829978j467049q99639
18936B7584154r83844j856691l515944m678122l669740k187786j425654r98025
18928H268348o87525n09063m03499l16829k32981j18552j30249j54507p6792K2265
$$ plain form
18991 479088 466403 500888 561877 582514 602891 591229 646091 667561 733474 796539 838356
18980 838356 913645 958880 994913 993780 1042458 1059931 1113682 1169640 1261881 1401364 1539405
18969 1539405 1660931 1770552 1970573 2195934 2498777 2857927 3311327 3978132 4854080
18960 4854080 6045494 7746758 10114220 13273704 16628977 19260797 21627506 23972089
18952 23972089 26083512 27529405 28227666 29076830 30877822 33805074 36749947 38070930
18944 38070930 37109622 35320498 34183640 33320217 31780820 29950842 28483793 27584154
18936 27584154 26600310 24743619 21227675 16549553 12879813 10692027 9266373 8268348
18928 8268348 7580823 7071760 6668261 6351432 6118451 5999899 5869650 5715143 5638351 5660616
18918E660616J7605M8821J22019K95978N16659P67637J062173J429422K108029
18909A2028959K971469L845677L843695L072792K806776K725143K410527J458551
18901C5163589P19422J123556K370038L766704L588324J274295j327638k097912
18893D4580378j351122j272760k156953k394832j868625j224616j395291k577588
18885C0338591m772313n898971m487796k800160j730250j172560q69626o61940
18877G944975n79266m86561l83626l33529l12193k90930k88209k57844k25378
18868D787439k02900k32755j92594j76968k07316k01296j79759r0526j30050j58064
18858C015211p0303r5260q6280o6427n0620o7582j09203m2683p2476r7979o2979
$$ plain form
18918 5660616 5678221 5727042 5849061 6145039 6661698 7429335 8491508 9920930 12028959
18909 12028959 15000428 18846105 22689800 25762592 28569368 31294511 33705038 35163589
18901 35163589 35883011 37006567 39376605 43143309 46731633 48005928 46678290 44580378
18893 44580378 43229256 41956496 39799543 37404711 35536086 34311470 32916179 30338591
18885 30338591 25566278 19667307 15179511 12379351 10649101 9476541 8606915 7944975
18877 7944975 7365709 6879148 6495522 6161993 5849800 5558870 5270661 5012817 4787439
18868 4787439 4584539 4351784 4159190 3982222 3774906 3573610 3393851 3303325 3173275 3015211
18858 3015211 2944908 2849648 2763368 2696941 2646321 2578739 2469536 2426853 2354377 2256398 2193419
18847B193419n2624l1944j9685k1976l8809j2916j0531j5223J3636M8496K1527
18836B073370L8671Q9020N5412P1324O3841P7399J38976J85390K26938K90362
18826C310703M62729O68606Q93540J290126J829785K511974K876940K632977K711341
18817A9188721K552374J427694K75614j018151j270775j124892j136394R6569
18809A8990760J092840J811430K396297K059810J721366J170916O69371N30851
18801C0443641J05349m59655p34824j375130k147813j898121j884057j331558
18793B0717832K0143O44450J073931Q58117n5381j101912k389274k560722k711923
18784A4495261k960342k204450j392312q88586n30754m25736l29987k14738j97366
$$ plain form
18847 2193419 2140795 2108851 2089166 2067190 2028381 2015465 2004934 1989711 2003347 2051843 2073370
18836 2073370 2112041 2201061 2256473 2327797 2391638 2469037 2608013 2793403 3020341 3310703
18826 3310703 3773432 4442038 5335578 6625704 8455489 10967463 13844403 16477380 19188721
18817 19188721 21741095 23168789 23444403 22426252 21155477 20030585 18894191 18990760
18809 18990760 20083600 21895030 24291327 26351137 28072503 29243419 29912790 30443641
18801 30443641 30548990 30089335 29354511 27979381 25831568 23933447 22049390 20717832
18793 20717832 20737975 21382425 22456356 23314473 23259092 22157180 19767906 17207184 14495261
18784 14495261 11534919 9330469 7938157 7049571 6518817 6093081 5763094 5548356 5350990
18775E350990j64610j32013m8694L7165L9418P0544R9073J52084L74513O68650
18765F447120Q88246J290335J910824K538737K680414K537968K675506K015372
18757B2984522R14899j44728j276766j235014j176041o82512P74292J531814K191312
18748B3881778K395204J888830J503687P28898L65606J47134k92678o76987q61320
18739B9080152j681399k127635j832702j688527o11817L83918Q71714J212811
18731B3606515O10659l83530j627998k636034k668010l072332k987667k034562
18723H807041j214038q55792n66471m12832l63654l01439k68685k81773k87641
18714D254716k35166j71777j81414k23718k04014k12525j66440j40187j32321
$$ plain form
18775 5350990 5186380 5054367 5005673 5042838 5082256 5152800 5251873 5403957 5778470 6447120
18765 6447120 7335366 8625701 10536525 13075262 15755676 18293644 20969150 22984522
18757 22984522 23899421 23754693 22477927 21242913 20066872 19384360 20158652 21690466 23881778
18748 23881778 26276982 28165812 29669499 30398397 30764003 30911137 30618459 29941472 29080152
18739 29080152 27398753 25271118 23438416 21749889 21138072 21521990 22393704 23606515
18731 23606515 24217174 23833644 22205646 19569612 16901602 13829270 10841603 8807041
18723 8807041 7593003 6737211 6170740 5757908 5394254 5092815 4824130 4542357 4254716
18714 4254716 4019550 3847773 3666359 3442641 3238627 3026102 2859662 2719475 2587154
18705B587154j05627j06816q9183n7359o7055j01162p3457j06042j17928q2358
18695A680167n0201n4522k8777k5100m1022j8973J9005j8127n0607l8990j1702
18684A361151r20j8795m7332j5320p2935o0106j6409K2662l7474n0091k7054j7245
18672A020132k4439k2839n4196q267j3370q503l5402L2883j971j9466n2520m3809
18660G68233m1021j0524J4139l3755j3103k4076L039l7110l564M488O630n1672
18648E81704k6912N257M520j7527j2929j7484k241K7148l1878m5755n4481L3292
18636D42714J1345k6876m3954m0418l0358l8505J2022N0652M4114O362o4601k8399
18624B94098K0424K551K3254J7322J1834N084l4243k2666l302J5733o61q074l1532
$$ plain form
18705 2587154 2481527 2374711 2285528 2228169 2161114 2059952 1986495 1880453 1762525 1680167
18695 1680167 1629966 1575444 1546667 1521567 1480545 1461572 1480577 1462450 1411843 1372853 1361151
18684 1361151 1360231 1341436 1294104 1278784 1205849 1145743 1129334 1151996 1114522 1064431 1037377 1020132
18672 1020132 995693 972854 918658 910391 897021 888518 853116 885999 884028 864562 812042 768233
18660 768233 727212 716688 730827 697072 683969 659893 662932 625822 622258 626746 633376 581704
18648 581704 554792 560049 564569 547042 534113 516629 514388 541536 509658 463903 409422 442714
18636 442714 454059 427183 383229 342811 312453 273948 285970 336622 380736 387098 322497 294098
18624 294098 314522 317073 340327 357649 369483 374567 340324 317658 314356 330089 329428 321354 289822
18611B89822k2808j7936P746n725l2023k6678l9073j219K7231O0643K9165m657
18599B64488p045L2096J523m0431k2357L7699O281j095j0357L150L952L6654L4875
18586C39433j3004K089K984r826N9161N784m5747R17J2665L3347Q1665J5918j1290
18573D74096l172O974L972K2007m504L1179Q134Q811l2236n724L0175K0725Q076
18560E68513O8928M9733L5226Q0626J22067J56962J99523K81683L89329N23952
18550B476542O74043R69292J393113J968608K484554K313740K116856K123232
18542A6519980J179909O1776j328169k201069k245890k696171k410087j507702
18534E372577r38168o21216m74592k86736k17632j02949j02263j04662r0792l1174
$$ plain form
18611 289822 267014 249078 256824 251099 219076 192398 153325 152106 179337 239980 269145 264488
18599 264488 257443 289539 291062 250631 228274 265973 272254 271159 260802 263952 267904 304558 339433
18586 339433 326429 328518 331502 321676 380837 386621 340874 341791 354456 387803 469468 485386 474096
18573 474096 470924 477898 481870 503877 499373 530552 538686 547497 515261 509537 539712 560437 568513
18560 568513 637441 687174 722400 803026 925093 1082055 1281578 1563261 1952590 2476542
18550 2476542 3150585 4119877 5512990 7481598 9966152 12279892 14396748 16519980
18542 16519980 17699889 17761665 16433496 14232427 11986537 9290366 6880279 5372577
18534 5372577 4434409 3813193 3338601 3051865 2834233 2731284 2629021 2524359 2433567 2402393
18524B402393j2374L3899j1134N6170J63983J73914K46742M07679O14892Q68184
18514D944348J102701J542707K107875K497595K245849K177512J968700Q80002
18506A9467289j56577j518723j945857k020717k214585j280068k4983R56964J853228
18497A3115971K660821L063967L756830M446051L891897K711510J700872M33132
18489C5781051j201342l176240m659822m199772m184496m213159k990920j896010
18481I259290j198398q25873o12267m93490l63243k91349k25356j41918q3334
18472E024062l1782M7287J36035K68858L98830O31136R53745J286518J847622
18463A0562311K580473L151378L446659M140802M585306L668830K555692J379842
$$ plain form
18524 2402393 2390019 2423918 2412784 2468954 2632937 2806851 3053593 3461272 4076164 4944348
18514 4944348 6047049 7589756 9697631 12195226 14441075 16618587 18587287 19467289
18506 19467289 19310712 17791989 15846132 13825415 11610830 10330762 10305779 11262743 13115971
18497 13115971 15776792 18840759 22597589 27043640 30935537 33647047 35347919 35781051
18489 35781051 34579709 31403469 26743647 22543875 18359379 14146220 11155300 9259290
18481 9259290 8060892 7235019 6622752 6129262 5766019 5474670 5249314 5107396 5024062
18472 5024062 4992280 5039567 5175602 5444460 5843290 6474426 7428171 8714689 10562311
18463 10562311 13142784 16294162 19740821 23881623 28466929 32135759 34691451 36071293
18455C6071293o3443j601515l628532m453680l786681l755912l078274j494941
18447A4208315m2057J114153J981323K148229K012710K122632J181279p5335j534616
18438B3116633k786366k733538l181576l228105k145544j321913q50501o11774
18430F257316m53154l01625k66128k02725j97377j82192j01746j09737q3414k076
18420D357142l817L3518R1395K13852L81402N34764P48172J082239J531720K144343
18410A1114730K721923K541329K274142K244107J186294m2125j646219k721570
18402A7672611k741756l246177k989594j946410j151295p71105n61660m09760
18394C854854l15651k76761k06647j94075j74934j56721j20784r1832q0281p2636
$$ plain form
18455 36071293 36007850 34406335 30777803 26324123 22537442 18781530 15703256 14208315
18447 14208315 14166258 15280411 17261734 19409963 21422673 23545305 24726584 24651249 23116633
18438 23116633 20330267 17596729 14415153 11187048 9041504 7719591 6869090 6257316
18430 6257316 5804162 5502537 5236409 5033684 4836307 4654115 4552369 4442632 4359218 4357142
18420 4357142 4353325 4386843 4478238 4692090 5073492 5608256 6356428 7438667 8970387 11114730
18410 11114730 13836653 16377982 18652124 20896231 22082525 22040400 20394181 17672611
18402 17672611 14930855 11684678 8695084 6748674 5597379 4826274 4264614 3854854
18394 3854854 3539203 3262442 3055795 2861720 2686786 2530065 2409281 2317449 2237168 2164532
18384B164532p0022l6267o4371o1826n4996l5496l3450n5007r4371p7591l3836
18373A547299R176j0649r1869q1448n9536l7816p0343o7439o8183N897k0321k9423
18361A025345l6969J3514m9172m2475l0151m5793O065k010m4979r671K4163j8442
18349G89425k4388j9347M245K7295q068m2356o9870m0376o379M047k7138j4836
18337E72254K071j2056j4744k0807M181J5385j7336j5273m2204k8483J3475K1242
18325D77705J0259K021L3104K627l7211j2409k4572j7668l1560j6686L1289J5294
18313D32193k7756K553M9459K2551K3286r98L0526K2674j1388j9639n929K5551
18301E43083L0280j7726k7803p039J1186K6074J8633p615K0807J4898M5835L4354
$$ plain form
18384 2164532 2094510 2058243 1993872 1932046 1877050 1841554 1808104 1753097 1658726 1581135 1547299
18373 1547299 1556475 1545826 1453957 1372509 1312973 1275157 1204814 1137375 1069192 1075089 1054768 1025345
18361 1025345 988376 1001890 952718 910243 880092 834299 840364 838354 793375 783704 807867 789425
18349 789425 765037 745690 749935 777230 769162 726806 656936 616560 610181 614228 587090 572254
18337 572254 574325 562269 547525 526718 530899 546284 528948 513675 471471 442988 456463 477705
18325 477705 487964 489985 523089 525716 488505 476096 451524 433856 402296 385610 416899 432193
18313 432193 404437 406990 456449 479000 502286 501288 531814 554488 543100 523461 517532 543083
18301 543083 573363 555637 527834 520795 531981 558055 576688 569073 589880 604778 650613 684967
18289F84967K7018L2554O4083R9721Q5686M1848O5772J34908J33904J06864J44951
18278A622276K42153K57960L14037M83274P51839J003227J219342J717559K332920
18269I944587K310209J721112J537594J338542J023320K71456n23978n66530l46675
18260A6709637L7925j23161o07468j757704j934353o49946P44790J551441J401814
18251A5372975J088507R89778P80322M78596l51549p68044p56801m44709m19250
18242A5969825p94184j709130k824776k423338j496238r12445n93938l68033k11171
18233D636572j40924r4672m7951n1791l7995Q0688J69403K37902L51766N25932
18223E628930Q01836J133593J494642K013783K895997L817645L737117K762114
$$ plain form
18289 684967 711985 744539 808622 908343 994029 1035877 1101649 1236557 1370461 1477325 1622276
18278 1622276 1864429 2122389 2436426 2919700 3671539 4674766 5894108 7611667 9944587
18269 9944587 12254796 13975908 15513502 16852044 17875364 18146820 17622842 17056312 16709637
18260 16709637 16747562 16624401 16016933 14259229 12324876 11674930 12419720 13971161 15372975
18251 15372975 16461482 17451260 18231582 18710178 18358629 17590585 16833784 16389075 15969825
18242 15969825 15175641 13466511 10641735 8218397 6722159 5809714 5215776 4847743 4636572
18233 4636572 4495648 4400976 4353025 4301234 4263239 4343927 4513330 4751232 5102998 5628930
18223 5628930 6430766 7564359 9059001 11072784 13968781 17786426 21523543 24285657
18215B4285657K441626K135561J574047L72464q25314j001386n84669j53714l85651
18206B7858621j309398l014792l019114r51931J200558K546353K380767J772489
18198B7463553J679152J333266O88612o85895j456091j298670q68783r01588j580902
18189B4372654l086566m593605l969913k461640j499124j003211p30645n43319
18181F484631l96219k76956k72547k21065j73698j83632q5539m2118o8331M3534
18171D808060J66469L26449N03431O79566J040723J507457J573963J085824R64186
18162A2656128Q54796N88237J37251m55635n56111l34549j30381j83519m24418
18153A2151799j169382j319512m98335L79459J030103J027128O82981O87487N38922
$$ plain form
18215 24285657 26727283 28862844 30436891 30809355 29984041 28982655 28397986 28244272 27858621
18206 27858621 26549223 23534431 20515317 19563386 20763944 23310297 25691064 27463553
18198 27463553 29142705 30475971 31164583 30478688 29022597 27723927 26855144 25953556 24372654
18189 24372654 21286088 16692483 12722570 10260930 8761806 7758595 7027950 6484631
18181 6484631 6088412 5811456 5538909 5317844 5144146 4960514 4874975 4832857 4764526 4808060
18171 4808060 4974529 5300978 5804409 6483975 7524698 9032155 10606118 11691942 12656128
18162 12656128 13510924 14099161 14236412 13780777 13224666 12890117 12759736 12576217 12151799
18153 12151799 10982417 9662905 9164570 9544029 10574132 11601260 12284241 12971728 13510650
18144A3510650L32667k41649o92316o36703m61346m06140n86533j148283j955905
18135G714442j701247j025120n80356l50939k35810j82711j22723p8214q5404
18126C351918k2212M1544J09139J80901K45169N00039P88324J280349J834410
18117H309581K394245L419511N139268P440574O662702K847500K356259Q64588
18109C9434228j227000o218181j0882390p327536l770252k060808j293036r23437
18101E731588o53950m75680l42129l35735k91816k19455j84331j28122j83525
18092B916845k08642j66650j08130j12402j20068j17251j01688j02047j03956
18083A776011o9455k6069m6822o9932r1162o2255l3626m5994l1592m0281r0542
$$ plain form
18144 13510650 13843317 13601668 12909352 12272649 11811303 11405163 10818630 9670347 7714442
18135 7714442 6013195 4988075 4407719 4056780 3820970 3638259 3515536 3437322 3351918
18126 3351918 3329706 3371250 3480389 3661290 3906459 4406498 5194822 6475171 8309581
18117 8309581 10703826 14123337 19262605 26703179 33365881 36213381 38569640 39434228
18109 39434228 38207228 31989047 21106657 13779121 10008869 7948061 6655025 5731588
18101 5731588 5077638 4601958 4259829 3924094 3632278 3412823 3228492 3100370 2916845
18092 2916845 2708203 2541553 2433423 2321021 2200953 2083702 1982014 1879967 1776011
18083 1776011 1706556 1680487 1633665 1563733 1472571 1410316 1376690 1330696 1299104 1258823 1168281
18072A168281o4204m8698k2440k6413l9041k0153j298L175o7848k6601j2104l6370
18060H06286j6071n5075m042l4278l0927K580J1765J8341l0434j9960p0059K230
18048E80356J6741k0795l8163l0900K5861K5633n9780p5866k0631k5317j4066
18037C63073J0050l030k8427m1943L0450k249l4220j3155M1125K0059L2749M951
18025C79433j0660O897j436j7020L9304j3032J5133k970k4463m290J130K2744
18013C90770J9323n7845M5968O233n7243n9509m6274k8089k9466J1425L326l240
18001A95379k8488o3400l0424J8665M834L950K072j9072L8615J1884K9688O182
17989A69885J056L3028p619o623J4251j1843J02L1198L9585k3555k4086k856k6917
$$ plain form
18072 1168281 1104077 1055379 1032939 1006526 967485 947332 946034 949209 881361 854760 842656 806286
18060 806286 790215 735140 731098 696820 665893 668473 680238 698579 668145 648185 578126 580356
18048 580356 597097 576302 538139 507239 533100 558733 498953 423087 402456 377139 363073
18037 363073 373123 370093 341666 299723 330173 327924 293704 280549 321674 341733 374482 379433
18025 379433 368773 375670 374234 357214 396518 383486 398619 395649 371186 366896 368026 390770
18013 390770 410093 352248 398216 404449 347206 287697 241423 213334 183868 195293 198619 195379
18001 195379 166891 103491 73067 91732 96566 100516 102588 83516 122131 134015 163703 169885
17989 169885 170941 203969 196350 189727 203978 192135 192237 223435 263020 239465 215379 212523 185606
17976A85606M4535K3923l733K5097Q426P51p522K9429j6406j7006m53L6128M7647
17963C56422j1417k9512o9103R084M4890j7559n1302m8709J9769K876P947j914
17951B11472j1659j6373K1123l3261K9989J3617O711m66J4948m563j5691m2231
17939A73616m5667j7187K2249J4166k2741P100j4095N7098P6054P7802p996l2900
17927B87499k8001K0893o0786n3952l3851r074l783N2840J2803k3243k5240M4084
17915A80189N6704J6525j5575k1187l3532j2838q670l8708j4369k34j3153k6670
17903F8482l0543m6737J5967J7044O619J3884Q714J6802j6289j6377M939L4359
17891G6864K6029k3107m216l3586Q608L8531j2694L104j1065J4568J6728O501
$$ plain form
17976 185606 230141 254064 250331 275428 283854 284605 277083 306512 290106 273100 272647 308775 356422
17963 356422 345005 315493 246390 255474 300364 282805 231503 182794 202563 205439 213386 211472
17951 211472 199813 183440 204563 171302 201291 214908 221619 221153 236101 231538 215847 173616
17939 173616 127949 110762 133011 147177 124436 131536 117441 174539 250593 328395 320399 287499
17927 287499 259498 280391 219605 165653 131802 122728 118945 171785 184588 161345 136105 180189
17915 180189 236893 253418 237843 216656 183124 170286 161616 122908 108539 108305 95152 68482
17903 68482 37939 -8798 7169 24213 30832 44716 53430 70232 53943 37566 42505 76864
17891 76864 102893 79786 75570 41984 50592 89123 76429 79533 68468 83036 99764 106265
17879A06265L591J0220j0242L0021k4451p6485K8765j4548j1491n859L289n35
17867C8540k390m2616l5611J497L9854J3282J0936o168J0637J7862K9094m393
17855G0524k1839r302n172q213j8942l1640J1423J7105q890J6343L735K3903J1421
17842E0456r148N778j2643r258j2055P250n2396j8193O3099L5307J908l7545j937
17829A0623Q48K0642m3815l6147P36P257M2525K7241j5174j3821K441r42K9988
17816C2402l0346J5696Q038p4227J6493J1787k182j7728l1351J8368J5034J7279
17804b0737N9210k1936p6712r415N0336O298k3668j2773m123M0757Q5695p59m8185
17791B3988l0186K2167N451j4370L458K1708K78P674m29l1031j8061L5374K4463
$$ plain form
17879 106265 109856 120076 109834 139855 115404 38919 67684 53136 41645 35786 39075 38540
17867 38540 36150 -6466 -42077 -40580 -726 12556 23492 17324 27961 45823 74917 70524
17855 70524 48685 39383 34211 25998 7056 -24584 -13161 3944 -4946 11397 15132 39035 50456
17842 50456 41308 47086 34443 25185 13130 20380 -32016 -50209 12890 48197 50105 12560 10623
17829 10623 11471 32113 -11702 -47849 -47113 -39856 2669 29910 14736 915 3356 2414 32402
17816 32402 2056 17752 25790 -48437 -31944 -20157 -22339 -40067 -71418 -53050 -38016 -20737
17804 -20737 38473 16537 -60175 -69590 -19254 -12956 -36624 -49397 -53520 -12763 72932 72173 23988
17791 23988 -6198 15969 21420 7050 10508 32216 32494 40168 39739 8708 -9353 26021 50484
17778E0484K2977P33j6730k1761j8007j1714O11K684m23J5800N2691l155k4484
17765D9706n1113n0830K9976M5401o416j6986J6759K275k4063N928P353J6090
17753B4080M1219J9804P746R109Q972J9756j4459k6631J5088K7708J6215n1439
17741I7168k5155j0196q404P717j1926j8124j7427J8532K0906M964K871J4207
17729G5133N3k496J5383R525J0480L4982L2933k9807k8448r448k3259n2000m2463
17716i432o784L7743J44R675j2925j0142K721j3084J86J6473J0089n280L988m726
17702A8646k0072N014K1318q822J1854Q213K4794M1308K458K1866O0780L7811
17690B25168J36J868N253k4743l2304K534m289j1830o3689j0361M8971N1209K4717
$$ plain form
17778 50484 73461 74194 57464 35703 17696 5982 6593 9277 8854 24654 77345 74190 49706
17765 49706 -1407 -52237 -22261 23140 16724 -262 16497 18772 -5291 637 7990 24080
17753 24080 65299 85103 92849 101958 110930 130686 116227 89596 104684 132392 148607 97168
17741 97168 72013 61817 53413 61130 49204 31080 13653 32185 53091 58055 60926 75133
17729 75133 75186 72690 88073 97598 108078 143060 175993 146186 117738 108290 85031 33031 -9432
17716 -9432 -16216 21527 21671 31346 18421 8279 11000 -2084 -1898 14575 24664 19384 23372 18646
17702 18646 -1426 3588 24906 16084 27938 36151 60945 102253 104711 126577 187357 225168
17690 225168 225304 227172 232425 207682 175378 177912 173623 161793 98104 87743 136714 187923 212640
17677B12640K346k6151j061J6103r817J6525j4670n8034m2187N021m1356m470
17665E4889l0524r276N0511L511K9546j7038J1800N61k2556N897P443Q905L7660
17652A31329o1930k1004j6919m1160j1136L8398M9675l5420p107n647K7753K8735
17640G5567M0095J2404M4555j4622n8188l0535k4102J9001K96k7473J5723N848
17628E8569K1335J5765q792K0798K2680k2514l5368m546L9122J1130l8106J521
17616H1594N548j8922k9481k4266L596L0394k7931k3181L1882n079j2940J865
17604A3079r67M0026k306k4160l4087Q067M0615j1885j2144m8591L0878N7484
17592E6009q1651k5168J1752J9145R982k411M4960J3900j0404K4207J5856k5320
$$ plain form
17677 212640 214986 188835 187774 203877 194060 210585 195915 137881 95694 100715 59359 54889
17665 54889 24365 15089 65600 69111 98657 81619 93419 93980 71424 77321 84764 93669 131329
17652 131329 69399 48395 31476 -9684 -20820 17578 67253 31833 24726 19079 46832 75567
17640 75567 115662 128066 172621 157999 99811 69276 45174 64175 64471 36998 52721 58569
17628 58569 79904 95669 86877 107675 130355 107841 72473 67927 107049 118179 80073 81594
17616 81594 87142 68220 38739 14473 18069 48463 20532 -2649 29233 24154 11214 13079
17604 13079 12112 52138 49832 25672 -8415 -348 40267 28382 16238 -32353 -1475 56009
17592 56009 -25642 -50810 -39058 -19913 -9931 -12342 32618 46518 36114 60321 76177 50857
17580E0857o9110k2334l7035m7102j1288L4795O2611l7022l3199L1792O6482J2652
17568B099m06J7421K2438L74k5474k8480m1179l2295L7105k8875j5927J3247L0263
17555d9689M7745O963j6819k7590k4482j3831J8784L6728M4603K7466N660J2720
17543F8258K4243L968k3644k9698m1710j3399L8409R451j5237n2680k7942J8853
17531d1128K7987l983K9531Q804Q467j6191k2180j9415j5284o926j4243k8413
17519i2974j4090J7165M3783J4003J7621k672K7423P652l3805j9886K5642P103
17507c035j3651j2255K3830K9729J4668K2425j6146k2680n882j5372q920o477
17495a3766l178K3382J1190M9529M6162J145l5350k8868m2925m2952r565J9755
$$ plain form
17580 50857 -18253 -40587 -77622 -124724 -136012 -101217 -38606 -75628 -108827 -77035 -10553 2099
17568 2099 1693 19114 41552 41926 16452 -12028 -53207 -85502 -48397 -77272 -93199 -79952 -49689
17555 -49689 -1944 5019 -11800 -39390 -63872 -77703 -58919 -22191 22412 49878 55538 68258
17543 68258 92501 96469 72825 43127 1417 -11982 26427 35878 20641 -32039 -59981 -41128
17531 -41128 -13141 -17124 12407 21211 29678 13487 -8693 -28108 -43392 -50318 -64561 -92974
17519 -92974 -107064 -89899 -46116 -32113 -14492 -17164 10259 17911 -15894 -35780 -10138 -3035
17507 -3035 -16686 -28941 -5111 24618 39286 61711 45565 22885 17003 1631 -7289 -13766
17495 -13766 -16944 6438 17628 67157 113319 114464 79114 50246 7321 -35631 -45196 -25441
17483b5441K5458Q294l209j5196P159m7180J9421N126R551M6863J1074j4711k632
17470B4577J4527N3660q439N342k9087l7466j712K0431j3778m8752J4944M7048
17458D1295k2515l972L8182n213k2480k8962J7961L1315K773M5934M0438J4211
17446A48967J3697L3409J2649k6438o6990m3073o3153l4133J0551O964J0596j8671
17434a5625K0933M7933k03k5709m8876k9868K2573N0970L9964j8628j2921Q52
17422C1395m978j9435K2881j980l7807J4322J6596j83j1107j1423n9581P271K2916
17409c1113M1827J5378J2644J209j1152K6800m805m366k2370n0192J2697K6243
17397A2800J80l1179J9763N4627l6067k6187L1882j9170m116r689j0395M4280
$$ plain form
17483 -25441 17 8311 5102 -10094 -2935 -50115 -30694 -25568 -16017 30846 41920 27209 24577
17470 24577 39104 92764 84325 89667 60580 23114 21402 41833 28055 -20697 -5753 41295
17458 41295 18780 14808 52990 47777 25297 -3665 14296 45611 48384 94318 134756 148967
17446 148967 162664 196073 208722 182284 115294 72221 9068 -25065 -14514 -7550 3046 -15625
17434 -15625 5308 53241 53038 27329 -21547 -51415 -28842 22128 62092 43464 30543 31395
17422 31395 26417 6982 29863 27883 -9924 4398 20994 20811 9704 -1719 -61300 -54029 -31113
17409 -31113 10714 26092 38736 39945 28793 55593 50788 46422 24052 -26140 -13443 12800
17397 12800 12980 -18199 1564 56191 20124 -6063 25819 6649 2533 -7156 -17551 26729
17385B6729J8676k4563l0929n5849j5183p401j3753L9498L1282J307P41L1674
17373B229L8739l3565r79l298k8527o409l1584K0955K936N09K0903K2048k3490
17360a9533k7619K8579j1072j0830J9515J3344M859j0584M460R043o393K2J990
17347d219Q369j6192n822K097L4356J9191j6681l6400m3758J6794J4502J7560
17335a0203J0691J8433Q667k0930L893o688l7888J7951N31n0992j9168K6578L6638
17322b2487M3458J165m9607j0093O423k0318K270M054J2513N0319M9879r278m2612
17309A5686q33K1706L4649R566l2716m7490l3262J249Q271L1053R113l3606m3356
17296e9970P402K2454p908J5909r511P209m5308J8233j2719M827J1222M707n049
$$ plain form
17385 26729 45405 20842 -10087 -65936 -81119 -88520 -102273 -62775 -31493 -30186 -29445 2229
17373 2229 40968 7403 6424 3126 -25401 -31810 -63394 -42439 -39503 -38994 -18091 3957 -19533
17360 -19533 -47152 -18573 -29645 -40475 -20960 -7616 -2757 -13341 -8881 162 -6231 -6209 -4219
17347 -4219 4150 -12042 -17864 -15767 18589 37780 21099 -15301 -59059 -42265 -27763 -10203
17335 -10203 488 18921 27588 6658 10551 3863 -34025 -16074 -15543 -66535 -85703 -59125 -22487
17322 -22487 20971 22136 -27471 -37564 -31141 -51459 -49189 -45135 -32622 17697 67576 58298 15686
17309 15686 14853 36559 71208 80774 48058 568 -32694 -31445 -23174 7879 16992 -16614 -59970
17296 -59970 -52568 -30114 -38022 -22113 -31624 -24415 -69723 -51490 -64209 -59382 -48160 -43453 -48502
17283d8502K4477L29k7666j083M0246J0492L9900L42k248k0505j1807l5958k5744
17270e7727k45K2722J4092K3515r260j4298J0524j2545j6687K0648M7605K2078
17258E0422j2700P055p327l6015j8387j6121p753K9500K9328l5831l992L2821
17246A1000K7735k4219O302K2480K6660j6820k1122j9513o8734N424k0889J5555
17234e6141r020J1249J8145N158R300L2418m975j8918k109j7537l487M0821K3757
17221B8661J0952J1548l2668J3721J2773J8599k8483l1388k9308M730n124J8377
17209g610K3671j7411j2553K7175l0753j7809j9048k4572P536K095L44N8581J6639
17196F285m892K4349N657Q661j1526j625P800j7037m6078J9573K0725n814k3262
$$ plain form
17283 -48502 -24025 -23696 -51362 -52445 -12199 -1707 38193 38535 36287 15782 3975 -31983 -57727
17270 -57727 -57972 -35250 -21158 2357 -6903 -21201 -10677 -23222 -39909 -19261 28344 50422
17258 50422 37722 44777 37450 1435 -16952 -33073 -40826 -11326 18002 -17829 -21821 11000
17246 11000 38735 14516 20818 43298 69958 53138 32016 12503 -56231 -50807 -71696 -56141
17234 -56141 -65161 -53912 -35767 -30609 -21309 11109 6134 -12784 -14893 -32430 -35917 4904 28661
17221 28661 39613 51161 18493 32214 44987 63586 35103 3715 -25593 -20863 -25987 -7610
17209 -7610 16061 -1350 -13903 13272 -17481 -35290 -54338 -78910 -71374 -69279 -68935 -10354 6285
17196 6285 1393 25742 31399 40060 28534 26909 34709 17672 -28406 -8833 11892 6078 -17184
17183a7184k3884l4825L4053J8650K848L1946m1446n6679K0602J804J8960L4892
17171a0263J9935k9609J0570M451j14P885M0499k2520m2804N630L5056L965j215
17158B1466j5462k4231K0047m534Q509M4203l987j5710l2716n5134l1338J6047
17146g2840j5138j3851L1678N4700M0122j0180M027M910k376K5375j2537J3252
17134D7142J2734J8202k818m1497l4067k0913j7896j6603M0130N7165O455k1248
17122B6786l6460l4282J1955L0126j889k4292l8018J9969J6164K936Q018L1990
17110A3003K7463K7128N3902P0822N8020J5380J1992M1300j0675l4497p2408o8343
17098A33087p0089m2652j098N990M363K1538m7970L897L7980k1059m509j4893
$$ plain form
17183 -17184 -41068 -75893 -41840 -23190 -20342 11604 -29842 -86521 -65919 -64115 -45155 -10263
17171 -10263 9672 -19937 -9367 -4916 -5030 2855 43354 20834 -21970 -16340 18716 22681 21466
17158 21466 6004 -18227 1820 -2714 5795 49998 46011 30301 -2415 -57549 -88887 -72840
17146 -72840 -87978 -101829 -70151 -15451 24671 14491 18518 23428 21052 46427 33890 47142
17134 47142 59876 78078 75260 33763 -304 -21217 -39113 -55716 -15586 41579 48034 26786
17122 26786 -9674 -43956 -32001 -1875 -3764 -28056 -66074 -46105 -29941 -27005 -18987 13003
17110 13003 40466 67594 121496 192318 250338 265718 277710 319010 308335 273838 201430 133087
17098 133087 62998 20346 19248 25238 29601 51139 3169 7066 45046 23987 19478 4585
17086D585j0409P363J3065j1687j7153J8210P298p708L0003K7824k6682n0319
17074a5610J6640J0088l6820n650K2686M766j171P280n975n445j2410K605j7704
17061c6720J7317K1188k754N336p666j4834J9490K7132J470j5915l9909n0987
17049g6852m0175K6425K4031K2403J8058j9495J5615M6700L8097J7875n2887m5901
17037b6106l4614j7669J4858r197O3216K6019J1139o947k2131L4565q119m3828
17025a8814r763K7669k1258J2512J5004k2073J2549L4696n236p976m360o8160
17013e5210J7715N015M2015K3386k1541n259R338n436K3178L051k088J3682J7799
17000F5645K4728J0684L636k1458o7729j9171M871J6359k2864l9683j8617K3646
$$ plain form
17086 4585 -5824 1539 14604 2917 -14236 3974 11272 3564 33567 61391 34709 -15610
17074 -15610 1030 11118 -25702 -31352 -8666 -3900 -5071 2209 -3766 -9211 -21621 -19016 -36720
17061 -36720 -19403 1785 -969 4367 -3299 -18133 1357 28489 29959 14044 -25865 -76852
17049 -76852 -117027 -90602 -66571 -44168 -26110 -45605 -29990 16710 54807 72682 19795 -26106
17037 -26106 -60720 -78389 -63531 -72728 -9512 16507 27646 20699 -1432 33133 25014 -18814
17025 -18814 -28577 -908 -22166 -9654 5350 -16723 -4174 30522 25286 17310 12950 -55210
17013 -55210 -37495 -32480 9535 32921 11380 6121 15459 10023 33201 36252 34164 47846 65645
17000 65645 90373 101057 104693 83235 15506 -3665 1206 17565 -5299 -44982 -63599 -39953
16988c9953R055q094k4752J5384J2300K3398K3714k8526j8051L3675K0845J739
16976B0734j404J6700k4955L0265J9693k703m8663l2295R728N129K4182K787N971
16963B5169J070m3750k0364m0782q158N1835L6849R890r364L5510L0473m4048
16951B4330n2154q464o271K4189K4369l732l2061j1523J4714K596m688k2960L7284
16938a4371l8866o916L996J8260l6084K7578M9740N0585n9585l0203L6281P5186
16926G5601M361o9277k6417J3509l0636J0309l033j7561R582j349N935J8622M2509
16913C2155l0985l9937o189N9400N625n141L915k4898l5886n141L8133R613K5016
16900B5680K8564k75l9220m0357O29L6998M045m2493j7465R934k2806k7156q924
$$ plain form
16988 -39953 -30898 -38992 -63744 -48360 -36060 -12662 11052 -17474 -35525 -1850 18995 20734
16976 20734 19330 36030 11075 41340 61033 58330 9667 -22628 -12900 -7771 16411 19198 25169
16963 25169 26239 -17511 -37875 -78657 -86815 -34980 1869 11759 2395 37905 68378 24330
16951 24330 -27824 -36288 -42559 -18370 5999 2267 -29794 -41317 -26603 -24007 -28695 -51655 -14371
16938 -14371 -53237 -60153 -56157 -37897 -73981 -46403 3337 53922 -5663 -35866 415 75601
16926 75601 79962 10685 -15732 -2223 -32859 -22550 -25583 -43144 -33562 -34911 -28976 -10354 32155
16913 32155 1170 -38767 -44956 14444 20069 14928 18843 -6055 -41941 -47082 -8949 664 25680
16900 25680 54244 53969 14749 -25608 -24979 12019 16064 -26429 -43894 -33960 -56766 -83922 -92846
16887i2846N7752L3707P533N079L0431O533L456m0116k2639L1476q819J567k4
16874A3090j5237l7057K0777M2269k7961k7300l9291O348N6396l0535J4221J8302
16862e978k6673n491L521K955J9918j9516K4854J2605J1028K3321j3047k0669
16850F828l3795q389J0095Q378j3367l2511j6726K0929J0497l1165j1439L0434
16838f0231K806J3347J5699J517N9326J16n860j1560m5866r609k8781r881N17
16825g8460J3135K4673j0528l5648K3223j0560O063M157L3623J0351j4647L0498
16813d120j9879j2794L0189M1889O79p090O710n055o238k4458l1559M3035K6807
16800C8116o830m991j3477l9235j3281K6523L2861J8874j311l2979o0444k5242
$$ plain form
16887 -92846 -35094 -1387 6146 11225 41656 48189 51645 11529 -11110 20366 11547 13114 13090
16874 13090 -2147 -39204 -18427 23842 -4119 -31419 -70710 -64362 -7966 -38501 -24280 -5978
16862 -5978 -32651 -38142 -34621 -31666 -11748 -31264 -6410 6195 17223 40544 27497 6828
16850 6828 -26967 -35356 -25261 -16883 -30250 -62761 -79487 -58558 -48061 -79226 -90665 -60231
16838 -60231 -57425 -44078 -28379 -26862 32464 32580 26720 15160 -30706 -40315 -69096 -78977 -78460
16825 -78460 -65325 -40652 -51180 -86828 -63605 -74165 -68102 -63945 -30322 -19971 -34618 -4120
16813 -4120 -23999 -36793 -6604 35285 35964 28874 35584 30529 24291 -167 -31726 11309 38116
16800 38116 31286 26295 12818 -26417 -39698 -13175 19686 38560 37249 4270 -56174 -81416
16788h1416L2072J4582J3146M7867R845J2556n2244k5892J2615Q164m0698l710
16776e3113N0988L4088L0846r179k6187m5285o395l1179j4501K8646L142P391
16764c0738P936K2715O516K1065k6756k0934k1259J519o3387j4528N4970M2174
16752b0707J4512l9470k1477M2683Q865r483l31K4368M6858r578j516Q437r3L328
16738D6396J8395J4111R734M082k9553j7475k1845j4171J2991O420r325nj3280
16725F475J3397p351j3784r168J7784K3632j2407o3018l1109j0446J5124L7855
16713c3016J5998j4643J1463k8622q925J683o519J6631j7080k7265J4617P399
16701f8279J1702J209M5911p867j1616J6881j666k9157P485J6562L674j0891j2125
$$ plain form
16788 -81416 -49344 -34762 -21616 26251 36096 48652 -3592 -29484 -16869 -8705 -49403 -53113
16776 -53113 -2125 31963 62809 53630 27443 -17842 -24237 -55416 -69917 -41271 -38129 -30738
16764 -30738 -22802 -87 6429 27494 738 -20196 -41455 -39936 -103323 -117851 -62881 -20707
16752 -20707 -6195 -45665 -67142 -24459 -15594 -25077 -25408 -1040 45818 36240 34724 43161 43068 46396
16738 46396 64791 78902 88636 92718 63165 45690 23845 9674 22665 29085 19760 19755 6475
16725 6475 19872 12521 -1263 -10431 7353 30985 18578 -44440 -75549 -85995 -70871 -33016
16713 -33016 -17018 -31661 -20198 -48820 -57745 -56062 -62581 -45950 -63030 -90295 -75678 -68279
16701 -68279 -56577 -55368 -9457 -17324 -28940 -12059 -13725 -42882 -35397 -18835 -15161 -26052 -38177
16688c8177J2251Q987j7678Q843K3748l154m5872n937M098K2849Q017j0673Q643
16675b4055q819l267J1350Q823j4733l0748M991J5156M4365r962l1832J6149J1646
16662a0936J0760L45K6620N746j9980m1322o287J990r854J973k3784N36O8960
16649D767M0771j6991k9624l108M5468l206l4659m4859K4212N0073K533Q290J7430
16636F1097J1588l0229m1823j8032j550k7999L9707K0427m851N903K4920J1867
16624E1025j6602k5240M087K1442p286k3497m4446q289N0156N5477k0734k466
16612C3627j4280k4396J162M29r536M9142L7217J884j7056j5779L0830k5348l5106
16599A2790n0562K6555N507o5359j3084N2411J8349J170J1422K0392L9580j1375
$$ plain form
16688 -38177 -25926 -16939 -34617 -25774 -2026 -5180 -51052 -56989 -52891 -30042 -22025 -32698 -24055
16675 -24055 -32874 -36141 -24791 -15968 -30701 -61449 -56458 -41302 3063 -6899 -38731 -22582 -10936
16662 -10936 -176 169 26789 32535 12555 -28767 -35054 -33064 -42918 -40945 -64729 -64193 4767
16649 4767 45538 28547 -1077 -4185 41283 38077 3418 -41441 -17229 32844 35377 43667 61097
16636 61097 72685 42456 633 -17399 -18949 -46948 -7241 13186 8335 14238 39158 51025
16624 51025 34423 9183 13270 34712 27426 3929 -40517 -48806 1350 56827 36093 33627
16612 33627 19347 -5049 -3887 -3458 -12994 36148 73365 75249 58193 42414 73244 47896 12790
16599 12790 -37772 -11217 -5710 -71069 -84153 -31742 -13393 -12223 -801 19591 59171 47796
16587D7796l0288O396L692L2058j4487p636m950l511K63p083K7815l379l4673
16574A2013K0679n957j625j6614k8024J8320k1243o1070m3134j1285K0361L6809
16562h0770k0920j559R1367L5003o488K759O79k586p283l2096m1089P653L3671
16549b1659j363O937m1567J3834K3752L3386k0028k1418M008K5207J1987n5212
16537d2136n7525O358N9976k2384k7023J870J7696Q446J0631L4636M6404k9131
16525G818q208p946k5437k279N84K8965Q475L8568K9368k6831n5998K3095N0941
16512F1115j3145P189j6354l3180J9084j5674j4669j3107K0155N7592J1306j9156
16500E1156l6431M93m8355l122j8497j922k3836J02J0626J8242L0399J7080k3271
$$ plain form
16587 47796 17508 23904 27596 59654 45167 37531 32581 29070 29333 22250 50065 46686 12013
16574 12013 32692 26735 25110 8496 -19528 -1208 -22451 -83521 -126655 -137940 -117579 -80770
16562 -80770 -101690 -103249 -11882 23121 16633 19392 20071 17485 10202 -21894 -62983 -55330 -21659
16549 -21659 -23022 -16085 -57652 -43818 -20066 13320 -6708 -28126 -24118 1089 13076 -42136
16537 -42136 -99661 -93303 -33327 -55711 -82734 -80864 -63168 -54722 -44091 -9455 36949 7818
16525 7818 -390 -8336 -33773 -36052 -35468 -6503 1972 40540 69908 43077 -12921 10174 61115
16512 61115 47970 55159 38805 5625 24709 9035 -5634 -18741 1414 59006 70312 51156
16500 51156 14725 15218 -33137 -36259 -54756 -56678 -80514 -80412 -69786 -51544 -21145 -4065 -27336
16487b7336j4993M9869l677p935N301J9014O404r828L7479J6212l2392l4648j8653
16474a5183J7698L0601k905j9185j7259L9694J110k9834o791j6226Q582k7884
16462c7582k792J4027K0951L234p211K3385O976l4493k4147q971J3304J4625k7635
16449d6329K6323L2909j5273m1430j6694k6532j8480K9270L5061j1325J4008n212
16437d3704J6950K4486j6366m2322q386N881M6628j6408j7271L5176L2323N671
16425B2658l0855k7471j2903k5383n641M2214j0765k5222n605M1469L5111P562
16413E169m581J709L2228Q896o5856l8700K333J7216O2193k079j4159r432J6419
16400A1356R482k0851q59R278k9960k0047j6512M6637N2667J291k374m312p086
$$ plain form
16487 -27336 -42329 7540 3863 -4072 1229 20243 26647 16819 54298 70510 38118 3470 -15183
16474 -15183 2515 33116 30211 11026 -6233 33461 34571 4737 -2054 -18280 -9698 -37582
16462 -37582 -40374 -26347 -5396 -2162 -9373 14012 20988 -13505 -37652 -46623 -33319 -18694 -46329
16449 -46329 -20006 12903 -2370 -43800 -60494 -87026 -105506 -76236 -41175 -52500 -38492 -43704
16437 -43704 -26754 -2268 -18634 -60956 -69342 -63461 -16833 -33241 -50512 -15336 16987 22658
16425 22658 -8197 -35668 -48571 -73954 -79595 -37381 -48146 -73368 -78973 -37504 -2393 5169
16413 5169 588 2297 34525 43421 -22435 -61135 -58802 -41586 20607 18528 4369 -5063 11356
16400 11356 20838 -13 -872 8406 -21554 -41601 -58113 -11476 41191 42482 40108 35796 28710
16387B8710J6134j6035n1508n6792l5933N9818O5761j465k6723J816j8172J0718
16375b3671J2552j7699m7954k5656P2506K0344k3653k9854K5526K2611P082j7618
16363b5484m984N6903J7561l3662K6617J0280J1102k2142l4307p740k2127p204
16351c5187m798K1894K5016J5624J3310o9742P091j5536M605M4196o424J0787
16339A0836k0263n254r75m065J9686J0291j0898j4386l3903J8233j320L424K292
16326b6302r28k151J7962J657k6201o912J6849P576J0899M2238K0064p524k4929
16313B2298n434o704k3384k7227J1012m4041L3607J1787k440J06K1082K0402k1800
16300a0736K085n509n79r194j4873j3974j0668j7K2879l200l275P200K7889J9170
$$ plain form
16387 28710 44844 28809 -22699 -79491 -115424 -55606 10155 8690 -18033 -16217 -34389 -23671
16375 -23671 -11119 -28818 -76772 -102428 -29922 -9578 -33231 -63085 -37559 -14948 -7866 -25484
16363 -25484 -30468 26435 43996 10334 36951 47231 58333 36191 1884 -5856 -27983 -35187
16351 -35187 -39985 -18091 6925 22549 35859 -33883 -26792 -42328 -37723 6473 49 10836
16339 10836 -9427 -14681 -15656 -19721 -35 10256 -642 -15028 -48931 -30698 -32018 -28594 -26302
16326 -26302 -27230 -29381 -11419 -9762 -35963 -42875 -26026 -18450 -7551 34687 54751 47227 22298
16313 22298 16864 10160 -13224 -40451 -29439 -73480 -39873 -28086 -30526 -30420 -9338 11064 -10736
16300 -10736 -8651 -14160 -14739 -23933 -38806 -52780 -63448 -63465 -40586 -43786 -47061 -39861 -11972 7198
16286G198L9661K7923K7720n4383k8727m659R328m071l3948r793j1633K2620n224
16273a7988k3463j1708L2087n083K3484N8557M274l7281k8832n479J6201q423
16261c654o197l5292N753K0183o512j9581n556R719L0255N8929l575m2820k6770
16248b5118l2308k3892J2749N8087O512k4400k0580J8211M7709n6471J1422K8310
16236B31j6137P931K0958k5379N558N409k4996n526j0364n37l578j971J6036m703
16222c7068J0141Q333J9794K457K1805k6275n0585n460j1202N212K9275N1778
16210A8205m547k4064M386j0505j2285J5243P971M882k23j6286K3463K319l3622
16197b5063k735J4179L8177J7770j7963m0954l5644J5904N530K6633Q162J2244
$$ plain form
16286 7198 46859 74782 102502 48119 19392 14733 24061 19990 -13958 -23751 -35384 -12764 -17988
16273 -17988 -41451 -53159 -21072 -26155 -2671 55886 60160 22879 -5953 -11432 4769 -3654
16261 -3654 -9851 -45143 -39390 -19207 -25719 -45300 -50856 -41137 -10882 48047 44472 1652 -25118
16248 -25118 -57426 -81318 -68569 -10482 -3970 -28370 -48950 -30739 16970 -39501 -28079 231
16236 231 -15906 -7975 12983 -12396 -6838 -1429 -26425 -31951 -42315 -42852 -46430 -48401 -32365 -37068
16222 -37068 -26927 -18594 1200 3657 25462 -813 -51398 -56858 -68060 -62848 -33573 18205
16210 18205 13658 -10406 -6020 -16525 -28810 -13567 -5596 -714 -937 -17223 6240 8559 -25063
16197 -25063 -27798 -13619 24558 42328 24365 -16589 -52233 -36329 -30799 -4166 3996 16240
16185A6240k495J456j8728l9820O033K0461P978k1591J1394J8985j9150J5731
16173c506j8753K869m239l1620O060J9681n063K9414L8292J1669m619J4318j9933
16160C4570j2987j5259l5482k2072J7374K3793j3211j348J9129L4407j79j4355
16148A4380N214O5957P649k7234l4202k383m9767l112K2271k1597L3955q717m896
16135b482M0969K02l2710o99n601m510j423k0737O614N398j5399J2787O403O83
16121a0505j9480M87P388o845J9000L5841P306J0680N4541J1079l2253m0786m5808
16108i355M9261l004o5087j2577N616J208L648k755K3707l168P321K4503l6579
16095a7261k8060J0811K8507K6313J3139k5174m5040K5357K877P883J5695K0038
$$ plain form
16185 16240 13745 15201 -3527 -43347 -37314 -16853 -8875 -30466 -19072 -87 -19237 -3506
16173 -3506 -22259 -19390 -23629 -55249 -49189 -29508 -34571 -5157 33135 44804 40185 54503 34570
16160 34570 21583 6324 -29158 -51230 -33856 -10063 -23274 -24622 -5493 28914 28735 14380
16148 14380 19594 85551 93200 65966 31764 29381 -20386 -23498 -1227 -22824 11131 2414 -2482
16135 -2482 38487 38689 5979 5280 -321 -4831 -6254 -26991 -20377 -14979 -30378 -17591 -11188 -10505
16121 -10505 -29985 -29498 -22110 -28955 -9955 25886 33192 43872 98413 109492 77239 36453 -9355
16108 -9355 39906 36902 -28185 -40762 -35146 -33938 -30290 -33045 -9338 -12506 -5185 19318 -17261
16095 -17261 -45321 -34510 -6003 20310 33449 8275 -36765 -11408 -8531 -648 15047 35085
16083C5085j75j0539k5077k4070J615Q845j4149k7835k3116R403J0780j6640r887
16070h5760q231j4949M9650J7397P920L1879N9677j3933l5789k2602k660K9962
16058A2561K7501M549j5069l1986K0933k971l4798K9523l532j40O792j7001l7023
16045d0661j7468j586K9559K3797m987j4142N35L2720L9156q358R670j02K1477
16032F9610q50n0895K5782j4256m6538J1810J8032M3986k4189l7028j737L4186
16020B7913j10k3604k9776k2887K9626L3294K2303L758l569K2361k2458O217K3684
16007F6752k4791m4280r036l5756j7822J3708j4113o211m874L2980N1539J4860
15995B2956L3708k2121j8317K8710l62m5444l5969k87N9868k9239k8052L978o010
$$ plain form
16083 35085 34910 24371 -706 -24776 -23161 -14316 -28465 -56300 -79416 -70013 -59233 -75873 -85760
16070 -85760 -93991 -108940 -59290 -41893 -33973 -2094 57583 43650 7861 -14741 -17401 12561
16058 12561 40062 44611 29542 -2444 18489 15518 -19280 10243 6711 6571 13363 -3638 -40661
16045 -40661 -58129 -59715 -30156 -6359 -11346 -25488 -24953 7767 46923 38565 48235 48133 69610
16032 69610 68760 17865 43647 29391 -17147 -5337 12695 56681 32492 -4536 -6273 27913
16020 27913 27803 4199 -25577 -48464 -18838 14456 36759 40517 36948 59309 36851 43068 66752
16007 66752 41961 -2319 -11355 -47111 -64933 -51225 -65338 -71549 -76423 -43443 8096 22956
15995 22956 56664 34543 16226 44936 44574 -870 -36839 -37126 22742 -6497 -34549 -30571 -36581
15982c6581P399K764j9444K1047j176P76J8327l3794L5710M8482O6765J8767r5876
15969C3166q2348P893L9015l5305K2653M3383j0809k043n2399l1187L7098L5589
15957D706Q442m9513j0403o59m493j971K1662q431J2649J9497k0367k570K5246
15944f205N2530N906l1382l3644j8223q675M8986L8369l0528k8709J5630l9970
15932c5915j2109J6961J2519J2297m926j720J7255J0734j7553k6445P573Q210
15920a3119K7022p38K8625j5305j3740k6694j4606K6369m56l6537k6835J9287
15908d6727M1526K8884K648m103j0046o141K7758p143K4273m006p4816m6194M1188
15895c2899K5388k3565l655p349L0836N205J3789L8886m7013j5049j4863K2361
$$ plain form
15982 -36581 -29182 -26418 -45862 -24815 -25991 -25215 -6888 -40682 -4972 43510 110275 129042 33166
15969 33166 -49182 -41289 -2274 -37579 -14926 28457 17648 15605 -36794 -67981 -30883 4706
15957 4706 13148 -36365 -46768 -47427 -51920 -53891 -32229 -40660 -28011 -8514 -28881 -31451 -6205
15944 -6205 46325 52231 20849 -12795 -31018 -39693 9293 47662 17134 -11575 4055 -35915
15932 -35915 -48024 -31063 -18544 -6247 -11173 -12893 4362 15096 -2457 -28902 -21329 -13119
15920 -13119 13903 13165 41790 26485 12745 -13949 -28555 -2186 -2642 -39179 -66014 -46727
15908 -46727 -5201 23683 26331 22228 12182 6041 33799 26656 50929 46923 -27893 -74087 -32899
15895 -32899 -7511 -31076 -34731 -42080 -11244 -6039 7750 46636 -377 -15426 -30289 -7928
15883g928l0831j0239M5589K4677j0909j8707L6595L1758l3083j1231O0938K4139
15871A00768o3120n4732m0480p886j1188K6230N4416J8116J0572j892o5007n6618
15859i0821N618L4901Q695J341j5530M2436O7370J1078J6073J5843o925o8601
15847B1478k1731k0031L28L2528K8834k6737q827P325M2639j7713J8415l2001
15835B4507k9854K2612K4396P976j5571j3512J8715J8950k3581j8780J8407n981
15823B8284O697K600J2928K1775j4782m9039o0917r742n558j0391j2860J2496
15811g8509k483K0836j2863j381L6820p664l5945l1239L6180J1841j8827J4313
15799f8921j572k0150J3477M6838M7400l8602K784L7956J529k831l653k7674l396
$$ plain form
15883 -7928 -38759 -48998 -3409 21268 10359 -8348 28247 60005 26922 15691 76629 100768
15871 100768 37648 -17084 -57564 -65450 -76638 -50408 4008 22124 32696 30804 -34203 -90821
15859 -90821 -85203 -50302 -41607 -40266 -55796 -13360 54010 65088 81161 97004 90079 21478
15847 21478 -253 -20284 -19956 12572 41406 14669 5842 13167 55806 38093 56508 24507
15835 24507 -5347 17265 41661 49637 34066 20554 39269 58219 34638 15858 34265 28284
15823 28284 34981 37581 50509 72284 57502 8463 -52454 -62196 -67754 -78145 -91005 -78509
15811 -78509 -80992 -60156 -73019 -74400 -37580 -45244 -81189 -112428 -76248 -64407 -83234 -68921
15799 -68921 -70493 -90643 -77166 -30328 17072 -21530 -18746 19210 20739 17908 14255 -13419 -16815
15786a6815J5728K555l2198L4688p54P30J4837j9190M215j3674j6045m8403L1745
15773d2581L7313p742l469K2030L0845l9321k4023J5948K3246L6085m0263Q264
15761A6332J406K6378J3558j1424r186p276p584j8799o492J4681j4706l4826k0081
15748e8019N956M8761J0160K5620k1426l1261k2944k8267L6581L3919n400m808
15736a1128L586K3807K8376J196k2709k0501k300l948M695j8959m9438K0374N3354
15723F405L888k1867j5194P055k4253j4484L6132O3176j651R147o209J7443n390
15710E4198J3920j6072N427K5431k3235j1174j8284J015K1393L683k8768L136
15698C0670j9295j6686M3449J7853j2663k1979o8015K0124K2720J7946J2965o9916
$$ plain form
15786 -16815 -1087 1468 -30730 3958 3204 3934 18771 -419 3796 -9878 -25923 -74326 -42581
15773 -42581 -5268 -13010 -16479 5551 36396 -2925 -26948 -11000 12246 48331 8068 16332
15761 16332 17738 44116 57674 46250 37064 29788 22204 3405 -3087 11594 -3112 -37938 -58019
15748 -58019 -52063 -3302 6858 32478 11052 -20209 -43153 -71420 -34839 -920 -6320 -11128
15736 -11128 -7542 16265 44641 45837 23128 2627 327 -3621 1074 -17885 -67323 -46949 6405
15723 6405 10293 -11574 -26768 -19713 -43966 -58450 -22318 40858 39207 48354 42145 59588 54198
15710 54198 68118 52046 57473 82904 59669 48495 30211 31226 52619 56302 27534 30670
15698 30670 11375 -5311 38138 55991 43328 21349 -46666 -26542 -3822 14124 27089 -42827
15686d2827L1318J4677J6795L6743k6804o1307j7934R210m1761j5844Q712J4121
15674g4901j6300j5797L9508M4811Q725l1344m3400j3130J9607K0837K5767N447
15662c0170l1362n536L0639L8618L6924j7192l9175n032M3477l8148m5339j0133
15650g2429j4811L9034L8110L5017j4033j8604Q951k614l3088j5384K1451J3034
15638a5366N2101k369m7845j1431j2774j641K5584O7939j486m3882o507L3512
15626C5835O690J5356j6295j1714j9234l8816J311K1883L1877j5001k3387R024
15614b471k3198k0035J3997J8474k0301n49q787M93L5231O695j7513J026L9930
15601B2992K0642O44n223Q871J7424m6480j4440k9015j3535n106l129j4144n954
$$ plain form
15686 -42827 -11509 3168 19963 56706 29902 -31405 -49339 -40129 -81890 -97734 -89022 -74901
15674 -74901 -91201 -106998 -67490 -22679 -13954 -45298 -88698 -101828 -82221 -61384 -35617 -30170
15662 -30170 -61532 -67068 -36429 2189 39113 21921 -17254 -22286 21191 -16957 -62296 -72429
15650 -72429 -87240 -48206 -10096 24921 10888 -7716 1235 -1379 -34467 -49851 -28400 -15366
15638 -15366 36735 34366 -13479 -24910 -37684 -39325 -13741 54198 52712 8830 2323 35835
15626 35835 42525 57881 41586 29872 10638 -28178 -26867 -4984 26893 11892 -11495 -2471
15614 -2471 -25669 -45704 -31707 -13233 -33534 -34083 -42870 -42377 -7146 -451 -17964 -16938 22992
15601 22992 43634 44278 39055 47926 65350 18870 4430 -24585 -38120 -43226 -46355 -60499 -66453
15588f6453M082J0085L2489k9516l6473N0057L4292M392J7716Q271j788K3075
15576E0229L3760k5769k3410j4408J1834k6499j2260n495q80J3647l670l1172
15564c4093j5861n111K408K6184O739N255o846k2201j3929K9317K3527k0390J2731
15551a2270K426M1233J0648R329j9256J0965N800N152L0281p601Q047k4698m331
15538E5725j5010j9925K4090P9l0750m09k680o155m679L5381K505j6408l8430
15525a6666J5408n425k8135L0796k8262k0749J2511L1762K2721Q846N937l1836
15513c092j8847k1852J8562K9502R239j8224n037j1629K2197K2851M6516O295
15501G6481j7992k96r732n1631L697R093k6851L98K7023J014l6666J2582M1953
$$ plain form
15588 -66453 -62371 -52286 -19797 -49313 -85786 -35729 -1437 2955 20671 28942 27154 50229
15576 50229 83989 58220 34810 20402 32236 5737 -6523 -12018 -12898 749 -2921 -34093
15564 -34093 -49954 -55065 -52657 -26473 -19734 -14479 -21325 -43526 -57455 -28138 -4611 -25001 -12270
15551 -12270 -9844 31389 42037 51366 32110 43075 48875 54027 84308 76707 84754 60056 55725
15538 55725 40715 20790 44880 44959 14209 13800 11120 4965 286 35667 38172 21764 -16666
15525 -16666 -1258 -6683 -34818 -4022 -32284 -53033 -40522 -8760 13961 22807 28744 -3092
15513 -3092 -21939 -43791 -25229 4273 13512 -4712 -9749 -21378 819 23670 70186 76481
15501 76481 58489 58193 48461 -3170 527 9620 -17231 -16833 10190 11204 -25462 -12880 29073
15488B9073M055k5583j6289K1085L6565M5465j1176m2692k8740j9826k2070K9861
15476b72N0937o740j2866l2884K5425j3252j2556j5820J233K4330L47p963J5352
15463A5271O533l5211k2234m3845J2423M4854L8416K8729k8907J7139J2971o0184
15451a4045k7405K5989N5808q710J2867Q367J489q907l2981m0263J3695l0859
15439d4955L1718N6922k8471l8377k4659l456k1860j7663K7640K9327r022j5475
15427e8331J9361K0860j7281k4766Q665P2296M787O457L0145K6188k3840p2064
15415g523j8775l6521l95K4291J2760N624L174P651j150L199l3109j7464J1762
15402d6476O045j7184J1491J38q62N8940M82m9777M5792L8962K1602k0987n0756
$$ plain form
15488 29073 33128 7545 -8744 12341 48906 94371 83195 40503 11763 -8063 -30133 -272
15476 -272 50665 43925 31059 -1825 23600 10348 -2208 -18028 -16795 7535 7882 -81 15271
15463 15271 21804 -13407 -35641 -79486 -67063 -22209 16207 44936 16029 33168 46139 -14045
15451 -14045 -41450 -15461 40347 31637 44504 52871 54360 45453 12472 -27791 -14096 -44955
15439 -44955 -13237 43685 15214 -23163 -47822 -51278 -73138 -90801 -63161 -33834 -42856 -58331
15427 -58331 -38970 -18110 -35391 -60157 -51492 20804 25591 32048 62193 88381 64541 -7523
15415 -7523 -26298 -62819 -63214 -38923 -26163 -20539 -17365 -9714 -10864 -7665 -40774 -58238 -46476
15402 -46476 -40431 -57615 -46124 -45986 -46848 12092 12574 -37203 8589 47551 69153 48166 -2590
15389b590L2578M9639j8790q896k004m762n1949k8819j7402j3488O618M3780M730
15376a1355J3385L238k9879j2853K4532K0443J4866k0587l941j4897J9237P703
15364I892j5940J3121P039q712k3693n506j6515N2048M7521J760n0910k0533K3674
15351A3246N978k994m5500j6801j3470M0786M9478J65m6131l8344m2717N9122
15339c7182O1289K84j4110l7978j3095k3339k0964J6920K1980J991k872P0113
15327B3037J2202j4168j2770J1703K5057p654j3965k7663k5652j4301j6510o823
15315f7507J6217j2347r423J3191N8974N5618k1332m1563m6782J8115L2279l1224
15303c5784J6345R017j5362n06j7665L5318P335J1172J5187L335m1041j0722J9993
$$ plain form
15389 -2590 29988 79627 60837 51941 49937 45175 -6774 -35593 -52995 -66483 -59865 -16085 -11355
15376 -11355 2030 5268 -24611 -37464 -12932 7511 22377 1790 -2151 -17048 2189 9892
15364 9892 -6048 7073 14112 5400 -18293 -23799 -40314 11734 59255 61015 10105 -10428 13246
15351 13246 19224 16230 -29270 -46071 -59541 -18755 30723 30888 -15243 -53587 -96304 -37182
15339 -37182 24107 24391 10281 -27697 -40792 -64131 -85095 -68175 -46195 -44204 -47076 23037
15327 23037 35239 21071 8301 20004 45061 37407 23442 -4221 -29873 -44174 -60684 -67507
15315 -67507 -51290 -63637 -73060 -59869 -895 54723 33391 -8172 -54954 -36839 -4560 -35784
15303 -35784 -19439 -10422 -25784 -26290 -43955 -8637 -1302 9870 25057 28392 -12649 -23371 -3378
15290c378L079j3702k4077R501k3438M2636M4242N7390j4339o1447r690L3332
15278D0109L7971o609L568N155k0995m3662k1253K0536O475m8324k18j521J4752
15265a4016j6949m828j9717L6050Q606r706K8331K0182L4122p258j7762K1457
15253E8512P314k0021k4154j4252L5196k4155j1838j5427k3793o820K4784L416
15241a1238P923k401n042L881j2519M199o440j2983Q629L3145M6998K0354j7657
15228E6849k0730J7176N087j1421j4408N722n412p558J605n8128k6175J1220P525
15215c8648J9674J8796K0882k7894n896L1632K5187j2625k4012k2988o982j637
15203b4511k012p933K406K0502l616m3797k2448J8703J4196K2080L2171P280K2082
$$ plain form
15290 -3378 -299 -14001 -38078 -28577 -52015 -9379 34863 92253 77914 16467 6777 40109
15278 40109 78080 71471 75039 80194 59199 15537 -5716 14820 21295 -27029 -27247 -28768 -14016
15265 -14016 -30965 -35793 -55510 -19460 -10854 -20560 7771 27953 62075 54817 37055 58512
15253 58512 65826 45805 21651 7399 42595 18440 6602 -8825 -32618 -39438 -14654 -11238
15241 -11238 -3315 -5716 -10758 -6877 -19396 -15197 -21637 -34620 -25991 7154 54152 74506 56849
15228 56849 36119 53295 58382 46961 32553 38275 32863 25305 26910 -31218 -57393 -46173 -38648
15215 -38648 -18974 -178 20704 -7190 -13086 18546 43733 31108 7096 -15892 -22874 -24511
15203 -24511 -26523 -34456 -32050 -11548 -15164 -58961 -81409 -62706 -48510 -26430 5741 13021 35103
15190C5103j7848p459J4159k7336k8208R983j4795R19M4807m514m4816O008K0640
15177a3357P1022l428n0973k1714J1433l089k8307K437N0841j1758q913j1146
15165a6952k8712K0899K7174L1252k7260N475N8452J0323N956l8014m960k2569
15153B1064k144j4152l3470K6824K2140Q206K1195J138j4006J7020q466m0671
15141D678M759k3291o219K3677L1078l9258o4740K8001N7645J1487j9397j1208
15129b788M9166L3717n2267l0437J5043J6923L3354j8920j6362k4872O459N5127
15117F4143K3827m9143q3633l9856K2344J3744N4450K5825M239m7333K503j3443
15105b2333K4915J5843o449l3373m7376P622N713Q485O3742K4089J2493k9074
$$ plain form
15190 35103 17255 9796 23955 -3381 -31589 -21606 -36401 -35482 9325 4811 -40005 -33997 -13357
15177 -13357 57665 54237 3264 -18450 -7017 -10106 -38413 -35976 14865 3107 -5806 -16952
15165 -16952 -45664 -24765 2409 33661 6401 11876 70328 80651 86607 48593 43633 21064
15153 21064 18920 4768 -28702 -1878 20262 28468 49663 50801 36795 53815 45349 4678
15141 4678 9437 -13854 -20073 3604 34682 -4576 -69316 -41315 16330 27817 8420 -2788
15129 -2788 46378 80095 27828 -2609 12434 29357 62711 43791 27429 2557 9016 64143
15117 64143 87970 38827 -44806 -84662 -62318 -48574 5876 31701 35940 -11393 -8890 -22333
15105 -22333 2582 18425 11976 -21397 -68773 -61151 -55438 -46953 16789 40878 53371 24297
15093B4297l1449l6402k065J5900L4021k494j0301N879J9612M913q434N038J4998
15080C3513q489J628k0513l93K6865M727k2937j8692j1486J8429k6010J1412L7113
15067B5167m445j4987O787j5561j5881R450K1895l9051j2383K7005n78k682k9873
15054d5137M661M8457R772K9727k195R634p754p9170J3134L5659R620K5304n4373
15041b661j1266m9043k6067N7313J0448J6465M170j2519K6690k9963l2180k96
15029d8909J5256J2079J103L7314L1123n2409q609j4283J6613J1303N221j1849
15017f047l903j9566j7057n773J0205M638r026N6779K7507l5208K9604N9400k2647
15004F8906j1973N746K4374j8060q424m1737J7682j4812J8878K416O284J4529
$$ plain form
15093 24297 -7152 -43554 -45619 -29719 4302 1808 -8493 -2614 16998 21911 13477 18515 33513
15080 33513 25024 26652 6139 5746 32611 37338 14401 -4291 -15777 2652 -23358 -11946 25167
15067 25167 20722 5735 12522 -3039 -18920 -9470 12425 -26626 -39009 -12004 -12582 -15264 -45137
15054 -45137 -40476 7981 17753 47480 45285 54919 47165 -32005 -18871 16788 26408 51712 -2661
15041 -2661 -13927 -62970 -89037 -31724 -21276 -4811 -641 -13160 13530 -16433 -48613 -48909
15029 -48909 -33653 -21574 -20471 16843 47966 -4443 -13052 -27335 -10722 581 5802 -6047
15017 -6047 -9950 -29516 -46573 -52346 -42141 -37503 -46529 10250 37757 2549 32153 91553 68906
15004 68906 56933 62679 87053 68993 60569 18832 36514 21702 40580 42996 49280 63809
14992F3809j9635M528J1023l1232K3511n663J6966K991m3973j3944j0048k4350
14980b6017J8475J6341k3613M781k6214N609K6316P407j9060j0022L7851J5445
14968B7299l7806n036K6328N1343M703j580p178J7856K8635l1364p7189j584L1082
14955B5509Q511N313J4326m2162k4584M2884K4512n1259o9813K5280M891m6629
14943h3221K1758O4511J9913k0634j9574j0366l945k3267o259l1318R072O6018
14931a7312J9018r278n856j1068q45J2714j7759m3919O699K7757j0881k6705L5050
14918d2385P0592k9677K569M0740j1602l5989o223M1719R604j4511l8054l6381
14906d9598j9081J5599L2298J7795L0633L659l5562j9433l8783k4182P718L4166
$$ plain form
14992 63809 44174 48702 59725 28493 52004 46341 63307 66298 22325 8381 -1667 -26017
14980 -26017 -7542 8799 -14814 -10033 -36247 -30638 -4322 3085 -15975 -25997 11854 27299
14968 27299 -10507 -15543 10785 62128 66831 65251 58073 75929 104564 73200 -3989 -5573 25509
14955 25509 34020 39333 53659 11497 -13087 29797 54309 3050 -66763 -41483 -36592 -83221
14943 -83221 -61463 3048 22961 2327 -17247 -27613 -31558 -54825 -61084 -92402 -83330 -17312
14931 -17312 1706 -7572 -13428 -24496 -25341 -12627 -30386 -74305 -67606 -39849 -50730 -77435 -42385
14918 -42385 28207 -1470 1099 41839 30237 -5752 -11975 29744 39348 24837 -13217 -49598
14906 -49598 -68679 -53080 -20782 -2987 27646 31305 -4257 -23690 -62473 -86655 -78937 -44771
14894d4771K2561K2067L467o5424O886K0644k0778m594l0632r599M6004P5139
14882B0970M6633j8960m7425M465J4634O444O0313J6429l2480j3045m4818k9272
14870a6112m293M5167K2387j7236J8064j32j7426n1236o4721l9777L7350M9654
14858c8311M7947L2448N88l1465j0405K4017l34m0401K7776k7609j3017k515J1456
14845a9825L0016n540k5775N4418N4935L8597m6106n2975j9221N157n953L784
14833A1512K3531K2929k1457j3575j9074k647j2237J2174m9774m0693J9351q85
14821g0845M338J1549j7043K0549N2197L4428k4669o8249k5336L1190J4604M2269
14809D982k2498j6429M451J5272l9679k586k8957r258R0499N3055k5088J3314
$$ plain form
14894 -44771 -22210 -143 3324 -62100 -55214 -34570 -55348 -59942 -90574 -100173 -54169 20970
14882 20970 67603 48643 1218 5683 20317 26761 87074 103503 71023 57978 13160 -16112
14870 -16112 -20405 24762 47149 29913 47977 47845 30419 -20817 -85538 -125315 -87965 -38311
14858 -38311 9636 42084 42672 11207 802 24819 24485 -15916 11860 -15749 -28766 -31281 -19825
14845 -19825 10191 4651 -21124 33294 88229 126826 80720 27745 8524 13681 7728 11512
14833 11512 35043 57972 36515 22940 3866 1219 -11018 1156 -48618 -89311 -69960 -70845
14821 -70845 -66507 -54958 -72001 -51452 745 35173 10504 -57745 -83081 -51891 -37287 4982
14809 4982 -17516 -33945 -29494 -14222 -53901 -56487 -85444 -94702 -4203 48852 23764 37078
14797C7078O733l7258k2468k4397j8736q001J4399L4857m295p830K7544K2914
14785B0540J2803j7617j0691n170K5823R826j1677L5648k5689n2687K9426l3192
14773b2657l9799K9356M4793j8366J6034l344k2915J9324L4025j2963m183M018
14761B3323j9810j2416l2088k4579j0826q734K0078N7532l9490k3422j9312J4079
14749g5665M954m099L4704M9007K8166M5184l4977l3043k2181k1269p688K8763
14737h144O498l2882j4252M9323L9146k0920n2461k5898K2860J6102l958K5896
14725A310J9349k0576O634r91j6661N069k7424Q969M3008K1310j5212p1738O830
14712d0123J8151j4982J3101j683M1612q38k8952k1401j0439K7389k626o677j0207
$$ plain form
14797 37078 43811 6553 -15915 -40312 -59048 -67049 -52650 -17793 -22088 -29918 -2374 20540
14785 20540 33343 15726 5035 -135 25688 35514 23837 59485 33796 -18891 10535 -22657
14773 -22657 -62456 -33100 11693 -6673 9361 6017 -16898 2426 36451 23488 19305 23323
14761 23323 3513 -8903 -40991 -65570 -76396 -85130 -65052 -7520 -47010 -70432 -89744 -75665
14749 -75665 -70711 -74810 -40106 8901 37067 82251 47274 14231 -7950 -29219 -36907 -8144
14737 -8144 -1646 -34528 -48780 543 39689 18769 -33692 -59590 -36730 -20628 -24586 1310
14725 1310 20659 83 6717 5726 -10935 -5866 -33290 -24321 18687 39997 24785 -46953 -40123
14712 -40123 -21972 -36954 -23853 -25536 16076 15238 -13714 -35115 -45554 -18165 -20791 -27468 -37675
14699c7675m533L6224N0858K905l3716j8529j2577J8202O316m0494j0519k103
14687d5641R046L8447J3830o217j2376J7430m643k2760O20k009k9057l4226J7329
14674f0227J4069R515k4296k7406K8582L2560Q193O174j7800O124L5047J5721
14662B6256k4596K497M354j168l2204j18M0205m206k8742j9917p940K7223K602
14649a5754J5207K6176P757m5201j4832j3921K0949r831J3805P117J8971K1009
14637C1452r765m074n1799J2862K6154K9429j7508L2596K122k5151J79j1205j5804
14624e12m276M4557m5375p768j1082J5858J2954o649J5399J4426K479j0400K628
14611B2239K1413K9085K6413l3639m9129l5429k3465k8727k6022L633O2879J3070
$$ plain form
14699 -37675 -42208 -5984 44874 47779 14063 -4466 -17043 1159 7475 -33019 -43538 -45641
14687 -45641 -36595 1852 15682 9465 -2911 14519 9876 -12884 -12264 -14273 -43330 -77556 -60227
14674 -60227 -46158 -36643 -60939 -88345 -59763 -27203 -19010 -12836 -30636 -24512 10535 26256
14662 26256 1660 4157 8511 7343 -24861 -24979 15226 11020 -17722 -37639 -45579 -18356 -15754
14649 -15754 -547 25629 33386 -11815 -26647 -40568 -19619 -29450 -15645 -8528 10443 31452
14637 31452 21687 17613 -34186 -21324 4830 34259 16751 49347 51469 26318 26497 15292 -512
14624 -512 -4788 39769 -5606 -13374 -24456 -8598 4356 -2293 13106 27532 30011 19611 22239
14611 22239 43652 72737 99150 65511 16382 -19047 -42512 -71239 -97261 -93628 -30749 -17679
14599a7679o4017K349L8038P6512p63J1909j1166m975m311J2869k5114k9081k8737
14586d4166l8846M3793O2560l086m5092O0J1606r858j7691L2315L4817j1065l2709
14573a7362n087N3398K3646j9049k1794n763M084M1080K0883k0568K4459j5665
14561F2262k0789k3711k8211k1513L3132K6089k7435n3224k164K1029l4892n870
14549g5297K1908m2673o6102J4998K5811P6809M4994l607M9731K5575j3255l211
14537E5681k8924m3833J669L5398k535k1844M8220M7858k1295k8141l1693J782
14525A2343k2113k8550p535J6374M2512L9136L8399n9331r296O152l5411m4574
14513e1894m642J7960J0274r323l6962K9011N1459M5809j7962l1999m413k0117
$$ plain form
14599 -17679 -81696 -79347 -41309 35203 34440 46349 35183 30208 25897 38766 13652 -15429 -44166
14586 -44166 -83012 -39219 23341 20255 -24837 -24777 -13171 -23029 -40720 -8405 26412 15347 -17362
14573 -17362 -22449 30949 54595 35546 13752 7989 12073 53153 74036 53468 77927 62262
14561 62262 41473 17762 -10449 -31962 1170 27259 -176 -53400 -55564 -34535 -69427 -75297
14549 -75297 -53389 -96062 -162164 -147166 -121355 -44546 448 -3159 46572 72147 58892 55681
14537 55681 26757 -17076 -15407 19991 17456 -4388 43832 91690 70395 42254 10561 12343
14525 12343 -9770 -38320 -45855 -29481 13031 52167 90566 31235 21939 28091 -7320 -51894
14513 -51894 -56536 -38576 -28302 -37625 -74587 -45576 5883 51692 33730 1731 -2682 -22799
14501b2799J432J2371p274j864l088m257L1327m0742p4694L909O6363N0763O36
14488A2083l5059K6511L5055n2963k8646L7304J6620o803n1695N8764L6206j5053
14476C2324j0795j6900l7467J7463L7558l0505k1180M1921L4860R51k9432m8872
14464c0074L582K9307K0030J2870j1204k5881K9169j1567l8858J2989N0747k345
14452C8765j0936j8841j6316j8128R602J6130j2347k6618P647K4130j1712n981
14440b4605j4221J5621J079n9037j0679K0104L6996M975k6524K353O5616J4224
14428B5902M1j3839j0758k0812J6352O460j2751l943j4733J8547N094k0439j2821
14415c7700N0529J3897K2197k3175l8359j9867O098p884K22J9417P9L1200L591
$$ plain form
14501 -22799 -21367 -8996 -16270 -18134 -21222 -25479 5848 -34894 -109588 -105679 -39316 11447 12083
14488 12083 -22976 3535 38590 -14373 -43019 -5715 10905 4102 -47593 11171 47377 32324
14476 32324 21529 4629 -32838 -15375 22183 -8322 -29502 12419 47279 48230 18798 -30074
14464 -30074 -26492 2815 22845 35715 24511 -1370 27799 16232 -22626 -9637 41110 38765
14452 38765 27829 8988 -7328 -25456 -15854 276 -12071 -38689 -31042 -6912 -18624 -24605
14440 -24605 -38826 -23205 -22126 -81163 -91842 -71738 -34742 -29767 -56291 -53938 11678 25902
14428 25902 25943 12104 1346 -19466 -3114 3346 -9405 -13348 -28081 -9534 -4440 -24879 -37700
14415 -37700 12829 26726 48923 25748 -12611 -32478 -26380 -34264 -34042 -14625 -14546 16654 20245
14402B0245k7687l499j1019K395K587K0852m296m826j5159L3212j6989k7114J267
14389c0031L707K7144J2600P793L366l1590l018K4066n955M5042J5229j2225k8218
14376B7910k522j9501k1450N0412p209j1864J4450J2497L6326Q075k2105j3765
14364E1254m451p265k2995K2822N0256r981P010j6329l9968k7505o120K9435M6325
14351G2488k4022j5730J4214L289l7088o402k361M1322j4757m6623l7187M1804
14339a1053L6022J0513j6555k683l4525l717J3111J4474N35J3091Q094O0674J9239
14326A07220L3202L6194m125l356N688m4368R497j1038m1935l6354N814P646j9671
14313D4414j7240J5481J9210P002k3229K8270K7918M8293k756m2242l9686n8154
$$ plain form
14402 20245 -7442 -10941 -21960 -19565 -16978 3874 -422 -5248 -20407 12805 -4184 -31298 -30031
14389 -30031 -26324 820 13420 21213 24579 -7011 -10029 14037 8082 53124 68353 56128 27910
14376 27910 25388 5887 -15563 34849 27640 15776 30226 42723 79049 87124 65019 51254
14364 51254 46803 39538 16543 39365 89621 79640 86650 70321 30353 2848 -3272 26163 72488
14351 72488 48466 32736 46950 50239 13151 6749 4388 45710 30953 -15670 -52857 -11053
14339 -11053 24969 35482 18927 16244 -18281 -21998 -8887 5587 6122 19213 27307 87981 107220
14326 107220 140422 176616 172491 169135 174823 130455 139952 128914 86979 50625 56439 64085 44414
14313 44414 27174 42655 61865 68867 45638 73908 101826 150119 147363 105121 65435 7281
14301G281l7113l0064J6444M711k4803J1494J9943N2031k7221k8347L9063l206
14289B13j9643m259K6884P8086K5362l0953o7256l1232j2509K2586K2826K0254
14277C0359k6802p425j0979p549p902J3401J0392J6647o940j469J6069J4077j1074
14264B0805M12k769k4185j6720L8090K3614j6466l0733m1467l3881r464M2698
14252e0066J9956J6215J5184j618J8825j2532k1000j2965K9195J6581j177k6947
14240a0349j7363J8815J6983K5185J3031j0066K3419J2089K4180l6556o320P522
14228F0570N10k7317Q396L3316j2084p4237Q696K9071k2772m942L5762N950o9397
14215b8478j0577M414j3929N286j0076j6191O744J0804K3275J0729k7819K3267
$$ plain form
14301 7281 -29832 -59896 -43452 -38741 -63544 -52050 -32107 19924 -7297 -35644 3419 213
14289 213 -19430 -23689 3195 81281 106643 75690 8434 -22798 -35307 -12721 10105 30359
14277 30359 3557 -3868 -14847 -22396 -30298 -16897 -6505 10142 3202 1733 17802 31879 20805
14264 20805 21217 18448 -5737 -22457 15633 39247 22781 -7952 -49419 -83300 -92764 -50066
14252 -50066 -30110 -13895 1289 -329 18496 5964 -15036 -28001 1194 17775 16598 -10349
14240 -10349 -27712 -8897 8086 33271 46302 36236 59655 71744 95924 59368 53048 60570
14228 60570 61080 33763 42159 75475 63391 -10846 -2150 26921 4149 -793 34969 40919 -28478
14215 -28478 -39055 -34641 -48570 -43284 -53360 -69551 -62807 -52003 -28728 -17999 -45818 -22551
14203b2551M5981K1554p273o0368p1422l0127R551O3730Q4023K707l7343k5996
14191b7534j6497J6216J7831K6000K8541l6028Q573J2254j5289j7461N379m837
14179b852J4416O629j8182O947M7690j4098m2702L295K1197K6496K3558q07l2001
14166C9586n0736l9629M23K6579M9421R278J9430N908m1431m7078k5499J1493
14154d2255L3987k4640L1534Q3273j4837k7679r152L0037R442m709k9864L0282
14142F5419j227k6402O04k6352j3908M4690K5782k1999J4969K2700Q594l75J457
14129I3952l6513j321K020K0915J3003l6698j9414K7422j0189m1271J24M409q478
14116G961J1608J3101L020J7404j1332k1054N7258J2959O796N1143K4877J7472
$$ plain form
14203 -22551 23430 44984 37711 -22657 -94079 -124206 -114655 -50925 33098 35805 -1538 -27534
14191 -27534 -44031 -27815 -9984 16016 44557 8529 17102 29356 14067 -3394 1985 -2852
14179 -2852 11564 18193 11 6958 54648 40550 -2152 1143 22340 48836 72394 71587 39586
14166 39586 -11150 -50779 -50356 -23777 25644 34922 54352 60260 18829 -28249 -53748 -42255
14154 -42255 -8268 -32908 -1374 81899 67062 39383 30231 60268 69710 65001 35137 65419
14142 65419 64192 37790 38394 12042 -1866 42824 68606 46607 61576 84276 92870 92495 93952
14129 93952 57439 56118 58138 79053 92056 55358 35944 63366 53177 11906 12030 16439 7961
14116 7961 19569 32670 35690 53094 41762 20708 77966 90925 97721 148864 173741 191213
14104A91213J09890J64663K10454K48936L40416K93398R6357N8118J6552j35042
14094A594955l22893m12150k89481j88387r0194n2483N491Q536l4952j2733j4920
14083A90789l0148n940q287K9371L7600j6448m992j4169q3835m7032k2708k512
14071B1689r149N0876M3776j5319m0031M854L8005J3148j2396m309K9280R869
14059A30293m3251l7716J5488l0765J590m3993j4338M274M9383L3977k3171J4
14047D1785J4205l075K7607j0082m9023p786q369J4752R460j6118L165k97l5657
14034a9433K7351O6590J0960j278K6865j658K2438M8911M613l5115o7500l9223
14022D3521l4746J1179M9491L0674j2897l5956j3139K6823l0175n7078j9481k2422
$$ plain form
14104 191213 301103 465766 676220 925156 1265572 1558970 1655327 1713445 1729997 1594955
14094 1594955 1272062 859912 570431 382044 291850 239367 244858 253394 218442 205709 190789
14083 190789 160641 154701 146414 175785 213385 196937 191945 177776 93941 46909 24201 21689
14071 21689 12540 63416 107192 91873 51842 56696 94701 107849 95453 91144 120424 130293
14059 130293 87042 49326 64814 34049 35639 -8354 -22692 -18418 30965 64942 41771 41785
14047 41785 55990 52915 80522 70440 21417 13631 5262 20014 29474 13356 16521 16224 -19433
14034 -19433 7918 74508 85468 84190 111055 109397 131835 180746 185359 150244 82744 43521
14022 43521 8775 19954 69445 100119 87222 51266 38127 64950 34775 -22303 -41784 -64206
14010f4206K4494K8668J8541o435K7238K1991J0907M522L039k2708J6894L5336
13998I8281j8432L0982N6563l531k0234l1738q282m213l8304m9581l7636R603
13986a6522K9889k499j1976K8232N842J774J6428r385l938l878K063k1397K2412
13973C7045n675j484L7602L718m4157n341m4600K440J2257J3692J3163j7231J1387
13960A2816j2964j6594J4538P469L7156J7365J0833k2681m8680m4463J6297k703
13948c1611K1495M9792K7442K703k7703J2569K0277K206j1372K736k292R492o2505
13935A3229k38M136j7209P100L195j1692j8178r918J4513N625q747m7598J2386
13922e3396N1015K661J8308p431J840L806M1400K6309q359m5869l02j7637k7147
$$ plain form
14010 -64206 -39712 -11044 7497 1062 28300 50291 61198 65720 68759 46051 62945 98281
13998 98281 79849 110831 167394 163863 143629 111891 103609 99396 61092 11511 -26125 -16522
13986 -16522 13367 10868 -1108 27124 32966 34740 51168 41783 37845 33967 36030 14633 37045
13973 37045 31370 29886 67488 71206 27049 21708 -22892 -20452 -8195 5497 18660 1429 12816
13960 12816 -148 -16742 -2204 5265 42421 59786 70619 47938 -742 -45205 -28908 -31611
13948 -31611 -10116 39676 67118 69821 42118 54687 74964 77170 65798 68534 66242 75734 13229
13935 13229 12991 17127 -82 7018 10213 -1479 -19657 -29575 -15062 -9437 -18184 -65782 -53396
13922 -53396 -2381 280 18588 11157 12997 16803 58203 84512 76153 30284 29982 12345 -14802
13909a4802l321M4625K3403J8081j109l4876k3526M7345j7052m0556J6954r840
13897E326k1851M350N913O1127J2682K2766p082p257J2354j6011n9110M340O108
13884B3655p597n430O3352O0205J8433l9171k5575M610j6516J6150Q265l1381
13872F9000O920M8795j0806m7091j6333N2153J5856J1463O519K7108j770l6973
13860A24841l3589j265K5465O817l3059j4316M304o928m194L4280M6242N360l5673
13847A18285l0604M0628K6891k2414k7360j7301K7655J1834n3603l9415o307n169
13835B3120K0836K0662n962K2006m770k2037l0163k7192r76J289K257J0447o6895
13822e7378m454J6005j2547j106M6433L7866J7462J0428m3703l9580p157M3588
$$ plain form
13909 -14802 -18123 26502 49905 67986 66877 32001 8475 55820 38768 -1788 15166 5326
13897 5326 -16525 -12175 -6262 54865 67547 90313 83231 75974 88328 72317 13207 17547 23655
13884 23655 16058 10628 73980 134185 152618 113447 87872 92482 75966 92116 100381 69000
13872 69000 75920 124715 113909 66818 50485 102638 118494 129957 136476 163584 161814 124841
13860 124841 91252 89987 115452 122269 89210 74894 79198 72270 68076 102356 148598 153958 118285
13847 118285 87681 128309 155200 132786 105426 88125 115780 127614 74011 34596 28289 23120
13835 23120 43956 64618 58656 80662 75892 53855 23692 -3500 -4476 -3187 -930 9517 -57378
13822 -57378 -61832 -45827 -58374 -59480 -13047 24819 42281 52709 9006 -30574 -37731 5857
13810E857M3240J933M0506R659R959K455n5326m6079K5035K5682J785k2114K863
13797D5455K8300l296j4294k3357K545J8557K2767k1882j679K3056J3081j6476
13785G2777q588j1980l7321n128K5658l0354Q660L3068M8734O998k5461j3559
13773F3504j0204n3327n2008l3646J9710Q0751K6412L466N3537O3482k7573o853
13761A27251J3762K7733J9896J5410J8922N0672O5430L1536Q9697J33212N0484
13750F44005j2857R292k9434q2230o7585O582q218k7928j9435j5475K8130j3892
13738D10955L555M7780k2869K519j1353j3517m438l7563k2563m9680m3828k1102
13726B37896p922l1497p795L8285J2365j3652K438j0696L3905J5078Q858J987
$$ plain form
13810 5857 49097 51030 91536 101195 111154 113609 58283 12204 37239 62921 64706 42592 45455
13797 45455 73755 70459 56165 32808 35353 53910 76677 54795 53116 76172 89253 72777
13785 72777 64189 52209 14888 9760 35418 5064 13724 46792 95526 102524 77063 63504
13773 63504 53300 -27 -52035 -85681 -65971 14780 41192 44658 98195 161677 134104 127251
13761 127251 141013 168746 188642 204052 222974 273646 339076 370612 460309 593521 644005
13750 644005 631148 640440 611006 528776 461191 467773 459555 431627 412192 396717 424847 410955
13738 410955 414510 462290 439421 441940 430587 417070 412632 375069 352506 302826 258998 237896
13726 237896 229974 198477 190682 228967 241332 227680 230118 219422 253327 268405 277263 279250
13714B79250l5445l5083j5595j309O7170j8093m9587r518l441N3291O317o481
13702B31476K6724K0100k5710N478J2660k0720o1395k0429Q7994M5280L7626K5435
13690C64519R068L6970J0336J7074K3268M227K1020J0738j9725l1399k1386K3649
13678D48359j6719K6371Q6736J30221R1084N0059L0787J2473l1604k8663j1182
13667G87922M8173R740Q7792Q7309j3510L9428O7029R6361O8086L4424J6821j192
13655A328383N0076P6787O4408J13487J16118J36423J68668J98499J66244K11718
13645B630811L22967L12901L60330M23205N62527O82144Q30006J038623J312671
13636H476185J747516K140806K588323L267894M650889O881761J0322980J4627788
$$ plain form
13714 279250 243805 208722 193127 191818 258988 240895 191308 181790 178349 231640 237957 231476
13702 231476 258200 278300 252590 258068 270728 250008 188613 168184 256178 301458 339084 364519
13690 364519 373587 410557 420893 437967 461235 465462 486482 497220 477495 446096 424710 448359
13678 448359 431640 458011 544747 674968 766052 816111 846898 859371 827767 799104 787922
13667 787922 836095 845835 933627 1020936 1007426 1046854 1113883 1210244 1278330 1312754 1329575 1328383
13655 1328383 1378459 1455246 1519654 1633141 1749259 1885682 2054350 2252849 2419093 2630811
13645 2630811 2953778 3266679 3627009 4050214 4612741 5294885 6124891 7163514 8476185
13636 8476185 10223701 12364507 14952830 18220724 22871613 29753374 40076354 54704142
13628E4704142J9648599K6759004L8105442N5053745O3869834M0128756K2454530
13621C20724052J5389233j666187k8043681p6128627p9730479m7452304k5845621
13614G7246386j5483999r994276o720917m916819l781063l035182k594529k341197
13606B8378404k183153j922659j626685j476254j394879j269782j163962j107879
13598A6233151j071026r11457p46952o74723o31481n06156m95724m78158l90796
13589A0326678m16207m80997m44475l68231l40578l10205k71274k75064l10447
13580G109200k61408k34686k16312k24866k20816k00070k02775k22806k12069
13571E113392k39344j69187j15047j10405o8199p5521j14460j35536j28810j32268
$$ plain form
13628 54704142 74352741 101111745 139217187 194270932 258140766 298269522 320724052
13621 320724052 336113285 334447098 306403417 230274790 150544311 103092007 77246386
13614 77246386 61762387 51768111 45047194 40130375 36349312 33314130 30719601 28378404
13606 28378404 26195251 24272592 22645907 21169653 19774774 18504992 17341030 16233151
13598 16233151 15162125 14250668 13503716 12828993 12197512 11691356 11195632 10717474 10326678
13589 10326678 9910471 9429474 8984999 8616768 8276190 7965985 7694711 7419647 7109200
13580 7109200 6847792 6613106 6396794 6171928 5951112 5751042 5548267 5325461 5113392
13571 5113392 4874048 4704861 4589814 4479409 4411210 4335689 4221229 4085693 3956883 3824615
13561C824615j20484n5380q8798o5732p0109j26265r7443j05793m0255j00136
13551B954220o3876j2942o8224q1022p6670q7122o8263p9825r0552j04085q9485
13540B132154q1687p6112n8135j4355n3963r2326k1034L4556m3894n3365j0494
13529A661345k2985n7672q406M144L4809R035p6747p3079p6749k4163l0178p6347
13517A263007q5740o9667o3876k0424p4603r4611r1726k4517k5771j9391m2083
13506F50598l6872p0830m1809l2561J4891k689J8539K7976M4498k8429l6270k707
13494E04335n346m4950o5476j5803j0161R202L1121j8100j1278q445J1472k9443
13482C47128k0765J434n681L0707J1127K2983m597M0274K5745l2053n3916j7245
$$ plain form
13561 3824615 3704131 3648751 3559953 3494221 3424112 3297847 3200404 3094611 3054356 2954220
13551 2954220 2890344 2877402 2809178 2728156 2651486 2564364 2496101 2416276 2325724 2221639 2132154
13540 2132154 2050467 1974355 1916220 1901865 1847902 1755576 1734542 1769098 1725204 1671839 1661345
13529 1661345 1638360 1580688 1572282 1576426 1611235 1620270 1543523 1470444 1393695 1369532 1339354 1263007
13517 1263007 1177267 1107600 1043724 1023300 948697 854086 762360 737843 712072 692681 650598
13506 650598 613726 542896 501087 468526 483417 480728 499267 527243 571741 543312 507042 504335
13494 504335 498989 454039 388563 372760 362599 371801 402922 384822 373544 365099 376571 347128
13482 347128 326363 327797 322116 352823 363950 386933 382336 422610 448355 416302 362386 345141
13470C45141M7860j6767l6873J4099N278k1463m6461O422K3494m7658m3308K562
13458B32326R5864K0530J0543m7928l2349j1196R917J1124j8124j6957j2142J0012
13446B51620J0951l635k0399l4138O856M8294K1977k2806k4506j9638k4886j1270
13434A78420K2775L5621k0406j5486M1084O812j6580J9690L104K1833K4624j4676
13422B86815o097o788k4792m816M723l4601m7510n485K3072k4098J4920L4653
13410B09996J4247l8828r702j3949r488J8418K3303J9434R63j9758L4893n2928
13398A76601p2482N7434M3301Q46l9183j2582J1362j488M0431j6083K0284r013
13386A99428j7343j5621L3155l9888j8930k0715J0428m2731j4011n484L1964J4413
$$ plain form
13470 345141 393001 376234 339361 353460 358738 337275 290814 297236 320730 273072 229764 232326
13458 232326 328190 348720 359263 311335 278986 267790 277707 288831 270707 253750 241608 251620
13446 251620 262571 258936 238537 204399 211255 259549 281526 258720 234214 214576 189690 178420
13434 178420 201195 236816 216410 200924 242008 248820 232240 251930 255034 276867 301491 286815
13422 286815 280718 273930 249138 244322 249045 214444 166934 161449 184521 160423 175343 209996
13410 209996 224243 185415 175713 161764 152276 170694 193997 213431 214394 194636 229529 176601
13398 176601 104119 161553 204854 205700 166517 153935 165297 163809 204240 188157 208441 199428
13386 199428 182085 166464 199619 159731 140801 120086 130514 87783 73772 68288 100252 114665
13374A14665J9123J6250J3841n480m9492j58L5849M3207l2104l1899l309P911
13362A28404J2559j6013l2502j4127J8375q118j1019J1641R937K1051r119l3793
13350G7276m242j5812o898M2902K2778k072J3485K2078m0731j9708m4353j1437
13338C3266L0051K7664k7996p238m1137l46k829o296L5385K6740J1951l6185j6741
13325B6289L0523j341k0972P70k1890K889O213j8569m2225J0594R00P522k4153
13312d3450N853L8951M9119k4346k6645q499J9436k4665J6612M4943J2801m050
13300E6060m0973k4097M212J2855k8549J71J3649k351m074J7172j1222m095J3770
13287B528J2144l960M978L3077K3509o741k2835k9146P050k6114K5944J23j3380
$$ plain form
13374 114665 133788 150038 163879 158399 108907 108749 144598 187805 155701 123802 120493 128404
13362 128404 140963 124950 92448 78321 96696 88578 77559 89200 99137 120188 111069 77276
13350 77276 73034 57222 50324 93226 116004 113932 127417 149495 108764 89056 44703 33266
13338 33266 63317 90981 62985 55747 14610 14264 11435 5139 40524 67264 79215 43030 26289
13325 26289 56812 55471 34499 35269 13379 16268 22481 3912 -38313 -27719 -26819 -19297 -43450
13312 -43450 -37597 1354 50473 26127 -518 -9017 10419 -14246 2366 47309 60110 56060
13300 56060 15087 -9010 -4798 8057 -20492 -20321 -6672 -9023 -13097 4075 -7147 -11242 2528
13287 2528 14672 10712 15690 48767 72276 65535 42700 13554 20604 -5510 20434 20557 7177
13274G177j8049L2657M665k082R518J6164l9801j854M4438k5027l2560j0619J9974
13261D601K4533m7748l6290j0143K7585K3407L0568m972j4633J6626K887k0607
13249d186L3537M2496J459m0706n2121J4762j6437O29J8903j1297L44K9673k6589
13236i533j5760J1279M1967L2285J9854L1412k9948n8149k4699L4090K9413J9169
13224H1380j4717m9539K1483K0534O715P393k3755k1752J2941O2346r748K529
13212I5810n0331p2362J8102K4643l289Q336l1800k124l4492k5900K8801O037
13200c8569K3344j1435M986k452K6864M6776R080q35J8154J1846k4719J3268q065
13187F8243N645L859k0367k8116k7280K3276KJ5811l087j8043Q601J58K0511L0295
$$ plain form
13274 7177 -10872 21785 26450 24368 33886 50050 10249 8395 52833 27806 -4754 -15373 4601
13261 4601 29134 -18614 -54904 -65047 -37462 -14055 16513 11541 -3092 13534 16421 -4186
13249 -4186 29351 71847 73306 32600 -19521 -4759 -21196 -20567 -1664 -12961 -12617 17056 -9533
13236 -9533 -25293 -14014 27953 60238 80092 111504 81556 23407 -1292 32798 62211 81380
13224 81380 66663 17124 38607 59141 65856 73249 49494 27742 40683 103029 93281 95810
13212 95810 45479 -26883 -8781 15862 12573 20909 -10891 -13015 -47507 -73407 -44606 -38569
13200 -38569 -15225 -26660 -21674 -24126 2738 49514 58594 57759 75913 87759 63040 76308 68243
13187 68243 73888 77747 57380 29264 1984 25260 25262 41073 37986 19943 28544 28702 49213 79508
13173G9508k9599J2527l3302k708L8907L5696n914j7195K5667q679k3298m1620
13161B9990L9374K6672n4964k789L0448k883j451P526J9053J6798K2609J7764
13149A48147M8691O001N7366O4400J04644J86925K64034L36178K75541J97622
13139A689549P5621n7518j32584k10130l98479l26188j18413p2156o4285q9566
13129B95851l5577j9507k8390L492j9291l4759j9993j1177J0761l9024k167j3979
13117H6240k4813l4054J8940M3414J4793j5583k0970j4993l9905p096K4007L7693
13105F7673k5435N0716J6396j0932j4765l2174k5109j2283K3683L3028j993q004
13093F0801L417l6397o1236L999K0397J549J9319J6876p83K9R75p92j6251p369
$$ plain form
13173 79508 49909 62436 29134 26426 65333 101029 95115 77920 103587 94908 71610 29990
13161 29990 69364 96036 41072 38283 68731 65848 64397 71923 90976 107774 130383 148147
13149 148147 196838 202839 260205 324605 429249 616174 880208 1216386 1491927 1689549
13139 1689549 1765170 1707652 1575068 1364938 966459 640271 521858 449702 385417 295851
13129 295851 260274 240767 212377 215869 196578 161819 141826 130649 141410 102386 100219 86240
13117 86240 61427 27373 46313 89727 104520 88937 67967 52974 13069 5973 29980 67673
13105 67673 42238 92954 109350 98418 83653 51479 26370 14087 37770 70798 68805 60801
13093 60801 64218 27821 -33415 -29416 -9019 -7470 11849 28725 27942 27971 28946 28154 11903 4534
13079D534M7177k3531P376M2245J8706j6523n6427k1226m3347O234J8739l9916
13067e5959J3821L6160M3817j2726k8682K6686M633j9184K06K7833r166L3410
13055F0849K6477K0024k8838k8414j7856k5343p473L5259R018m9436K7737K5117
13043D7121l4922m2798j5037k1462J4088N9465L3515K522p065j5219j4561j3657
13031h010k6142J8568N3673J6447L0308J6481l8859m8806K0841l848k8234K1410
13019B3829j0818r375L6641L8937K3732m0007k0159k9604n4900j885L1302J196
13007a1111N5042K9394k473k1779n0055K6261Q6813j7013l8470J3384k3093n3309
12995f409Q180K8653j8504q261K410K1624j7296k5551o2480J2105L510J6172P7942
$$ plain form
13079 4534 51711 28180 35556 77801 96507 79984 23557 2331 -41016 -34782 -16043 -55959
13067 -55959 -42138 -5978 37839 25113 -3569 23117 27750 8566 8772 36605 27439 60849
13055 60849 87326 107350 78512 50098 32242 6899 -574 34685 43703 -5733 22004 47121
13043 47121 12199 -30599 -45636 -67098 -53010 6455 39970 42492 35427 20208 5647 -8010
13031 -8010 -34152 -15584 38089 54536 84844 101325 62466 13660 34501 30653 2419 23829
13019 23829 13011 3636 40277 79214 102946 62939 42780 13176 -41724 -43609 -12307 -11111
13007 -11111 43931 73325 70852 49073 -982 25279 112092 95079 56609 69993 46900 -6409
12995 -6409 1771 30424 11920 3659 6069 27693 10397 -15154 -77634 -65529 -62019 -45847 32095
12982C2095O1580j0244m9233j5712J2147M4451m2086n6146k8755K1575J4341K8297
12970A2310L0477L6738J7825K0168l0885o5795j6667k3378L499N1828P571j4399
12958B9292P809O511j0061l0476k285r137K4338L5529K4233k1713m8998K6150
12946C1192j6005P43L4766K8966j5419m0419n778k3610L4418J7354n5872l5245
12934d4909l3901L8096J5134j3606J7271J5260K4076J3311M295l9664j9225K5136
12922A274J7943j8577l959k7922R221k8080J3371L0119J0895q633l1833N0301
12910A4120o36m7265k2436p640K1314M1059l1821j9820O946L745p315J5240K3621
12897a0888L1922M6l3737p569K6365P3777j1802m5754k3819M38L4568J5757n0994
$$ plain form
12982 32095 93675 83431 34198 18486 30633 75084 32998 -23148 -51903 -30328 -15987 12310
12970 12310 42787 79525 97350 117518 86633 20838 4171 -19207 -15708 36120 43691 29292
12958 29292 37101 43612 33551 3075 790 -8347 15991 51520 75753 54040 5042 31192
12946 31192 15187 15930 50696 79662 64243 23824 18046 -5564 28854 46208 -9664 -44909
12934 -44909 -78810 -40714 -25580 -39186 -21915 -6655 17421 30732 35027 -4637 -23862 1274
12922 1274 19217 640 -3319 -31241 -22020 -50100 -36729 -6610 4285 -4348 -36181 14120
12910 14120 13484 -33781 -56217 -63857 -42543 -1484 -33305 -53125 -46179 -42434 -49749 -34509 -10888
12897 -10888 21034 21080 -12657 -20226 6139 79916 68114 22360 -1459 -1021 33547 49304 -1690
12884a690l7354j8647j9782J8959O4650N6053L114o7840n2954M9059M8855r645
12872C2778k6862J4067K0307J435l0402j9504j393K5505K5401j2688k9144l1633
12860c2133J3484j4577l7777K5676K274J7985L532j8320L7493K2744K4605L7214
12848H2200k4432k9864N5462J6602n4778J7594l72P002k2104j1307J4419Q432
12836E8854r935M923p907L916J4672K338O031k7900n5833K8262l3577m1640L1656
12823b6140J1821o411k635J8543M4696N3638l284l1320k7095m8387J2103j6648
12811b1119m2546m5852j3078N3367J5744M0940N3138L6510J9896j2968k5083o027
12799E2922m9225k8226K6037K1746k4041l0245J8248Q975J5271l559l8759L2453
$$ plain form
12884 -1690 -39044 -57691 -77473 -58514 6136 62189 65303 -2537 -55491 -6432 42423 32778
12872 32778 5916 19983 40290 41725 11323 -8181 -9574 15931 41332 28644 -500 -32133
12860 -32133 -18649 -33226 -71003 -45327 -43053 -25068 -21536 -39856 -2363 20381 44986 82200
12848 82200 57768 27904 83366 99968 45190 62784 62412 69414 47310 36003 50422 58854
12836 58854 48919 53842 45935 49851 64523 66861 72892 44992 -10841 17421 -16156 -57796 -26140
12823 -26140 -14319 -20730 -23365 -4822 39874 93512 90228 58908 31813 -16574 -4471 -21119
12811 -21119 -63665 -109517 -122595 -69228 -53484 -12544 40594 77104 97000 84032 58949 52922
12799 52922 3697 -24529 1508 23254 -787 -31032 -12784 -3809 11462 7903 -30856 1597
12787A597M2166j8369l5834j8282K7885J4132K2641j2828k6136r034M201K7996
12775B0135M4125j082l3200k0970J9660J3415J5728L3076p85k9155k5249j5389
12763B0309L9359K0068o4267k7747M5253K2804k6773K1540k097k0340k2372k4972
12751a9235O064j2346M0077N5462K4989j0281k9217L117l2788j9134J1250r139
12739H819j9473n885M311M6465j7830l1138K7814J0340j7998r365k8979j0422
12727d3341J0793N5968J7668l2179k2367k2119L429K5667m605M104j42j3958K6719
12714E637j8362P62M285j9965p077r809j2062J3116L3783P3031M0842O592k5053
12701H5720k3030j1816m6242k1382l2410M8387M9136L6418j0581l0080k4084k3909
$$ plain form
12787 1597 43763 25394 -10440 -28722 -837 13295 35936 23108 -3028 -12062 -7861 20135
12775 20135 64260 63178 29978 9008 28668 42083 57811 90887 90102 60947 35698 20309
12763 20309 59668 79736 15469 -12278 32975 55779 29006 50546 48449 28109 5737 -19235
12751 -19235 -13171 -25517 14560 70022 95011 84730 55513 58630 25842 6708 17958 8819
12739 8819 -10654 -16539 -12228 34237 16407 -14731 13083 23423 5425 -3940 -32919 -43341
12727 -43341 -32548 23420 41088 8909 -13458 -35577 -32148 -6481 -11086 -6982 -7124 -21082 5637
12714 5637 -12725 -11963 -7678 -27643 -34720 -44529 -56591 -43475 -9692 63339 104181 110773 85720
12701 85720 62690 50874 4632 -16750 -49160 -773 48363 84781 74200 44120 20036 -3873
12689c873m0984j2217O3314P7372K6003m2107k4886j9599j5748J1437O627k1892
12677C447p282K5459L2468K0613O069k9979l0986m1861K0654n836K0141j0090
12665B817j4247N3102j2428m2635j4292j0567r553K7233L5836k7407k6075M7025
12653H809J0990j388q072K4556L420o477K5643n0342R830K5752k1140j6324j2080
12640f823Q190k1030k1070M522R098L5595J9138J1429K7113J2725m642k914j2924
12627E8407l5121j0836j7736j8946k29k1625l7909Q897J9244N9856n338J3319
12615A1983K1726k9197L027J966k8171J1827K3279k3339j8507K4274N917k2856
12603a8071K8247J781J7391K1014o3548J9138K9584l6086k7801Q387K785M5189
$$ plain form
12689 -3873 -44857 -57074 6240 83612 109615 67508 42622 23023 7275 18712 25339 3447
12677 3447 -3835 21624 54092 74705 80774 50795 19809 -22052 -1398 -7234 12907 2817
12665 2817 -11430 41672 29244 -13391 -27683 -38250 -47803 -20570 15266 -12141 -38216 8809
12653 8809 19799 18411 10339 34895 38315 31838 57481 7139 16969 42721 21581 5257 -6823
12640 -6823 1367 -19663 -40733 -36211 -27113 8482 27620 39049 66162 78887 74245 71331 58407
12627 58407 23286 12450 -5286 -24232 -24461 -46086 -83995 -75098 -55854 4002 -1336 11983
12615 11983 33709 4512 7539 9505 -18666 -6839 16440 -6899 -25406 -1132 4785 -18071
12603 -18071 10176 11957 29348 50362 -13186 5952 35536 -550 -28351 -19964 -17179 28010
12591B8010J0890M98k4638j9696j9652k1100M500Q3391M144l958J296J593L349
12578D8627j5776p50n140L600K1342j9392m8023j6058j2170k7944M1360N2209
12566B1885K596J4994k137m2194R586k8077l0809l6691K6051P2l9697J9391N0368
12553c4662L0950M0714J4346j6383R344J824K4423j3349k8285n3066K2286L1365
12541B9507k9259J5557K2986J7717K1643k400j6586p8772k0379K975n6468K213
12529i1266K7449L8006l321M7377n212j6246J2692j7044n444j759L8120J0330
12517C3682m9534M3386L4161L079l2165j1117l0257j9114J8385K5174l0746l5669
12505e0735K6891Q318R899L4404L5262J3288k5281J4986O2447L455l8926m1080
$$ plain form
12591 28010 38900 39398 14760 -4936 -24588 -45688 -41188 42203 46347 42389 43685 45278 48627
12578 48627 32851 32101 26961 30561 51903 32511 -15512 -31570 -43740 -71684 -30324 21885
12566 21885 24481 39475 37338 -4856 4730 -23347 -54156 -90847 -64796 -64724 -104421 -85030 -34662
12553 -34662 -3712 37002 51348 34965 44309 46133 70556 57207 28922 -24144 -1858 29507
12541 29507 248 15805 38791 56508 78151 75751 59165 -19607 -39986 -37011 -93479 -91266
12529 -91266 -63817 -25811 -29132 18245 13033 -3213 9479 -7565 -13009 -14768 23352 33682
12517 33682 -15852 27534 61695 64774 32609 21492 -8765 -27879 -9494 15680 -15066 -50735
12505 -50735 -23844 -15526 -5627 28777 64039 77327 52046 67032 129479 132934 94008 52928
12493E2928r106R325m531k0249n8574q145Q214J5297j0307L0882N3599K28P465
12480F7026j2024l7788J006J3500o806L9513k365j0429j3518r677r312J800K575
12467B3501k1321Q25R024p149j2960N30Ql3665M0804K3338k4565j0158p362Q287
12453a0863o712K0885J2485J5575n211j1438l4547M3283L9097M4639L0309m1553
12441I5949l7855O657J2364k7768o9278n5636L1903M9005j1306j1163K9228J1968
12429B4068O953l5555O951J2489k2739L3400r98k0906o379L433R170j9852L2770
12416B2805l880r500k1739j5289k8772K7666K1000N132K1605R357l2240k2594
12404b6449k288M2381j8707n174o025K2175m3896q577K4486J9669j936m0612J2588
$$ plain form
12493 52928 43822 53147 48616 28367 -30207 -38352 -30138 -14841 -25148 5734 59333 59561 67026
12480 67026 55002 17214 18220 31720 24914 64427 62062 51633 38115 28438 19126 20926 23501
12467 23501 2180 3005 12029 4880 -8080 -7550 -7542 -41207 -403 22935 -1630 -11788 -19150 -10863
12453 -10863 -17575 3310 15795 31370 26159 14721 -19826 23457 62554 107193 137502 95949
12441 95949 58094 64751 77115 49347 -19931 -75567 -43664 5341 -5965 -17128 12100 24068
12429 24068 31021 -4534 2417 14906 -7833 25567 24569 3663 -2716 717 9887 -9965 22805
12416 22805 18925 9425 -12314 -27603 -56375 -28709 -7709 -2577 19028 28385 -3855 -26449
12404 -26449 -28737 13644 -5063 -10237 -16262 5913 -37983 -46560 -22074 -2405 -4341 -44953 -32365
12391c2365J5661K5278j9145k2207L066K0689Q405L6582K9940J365q062j2925
12379D6282k3153p894j3620M2140K0984l3427k4606q2P555j7438j0794j4143J1803
12366a6393J3653J4674j0503k8776j9837J82o376K3721L1369Q284o347j5061m761
12353a6171J4970j3340k1157P127J1413L2243P646l4591k3744j067j5361L6248
12341a5784j3932m639O3883o376n1928k8599R153O2773M0799m5589k9434J6693
12329b980L437N356Q446l7802j3958j6141K1260M5852K3556M6068p706j0147j4506
12316E0735j0632n675m1860O625J7254J8447J5369K2008M0855Q133k3280l0284
12304F7695n295m3694k2274J3777Q69K578J4130J5497j2835K5013r937q057L2322
$$ plain form
12391 -32365 -16704 8574 -10571 -32778 -29712 -9023 -618 35964 65904 67269 59207 46282
12379 46282 23129 15235 1615 43755 64739 31312 6706 6624 14179 -3259 -14053 -28196 -16393
12366 -16393 -2740 11934 1431 -27345 -47182 -47000 -53376 -29655 1714 9998 3651 -11410 -16171
12353 -16171 -1201 -14541 -35698 -28571 -17158 15085 22731 -11860 -35604 -36671 -52032 -15784
12341 -15784 -29716 -34355 29528 23152 -28776 -57375 -48222 14551 55350 9761 -19673 -2980
12329 -2980 457 5813 14259 -23543 -37501 -53642 -32382 13470 37026 83094 75388 65241 50735
12316 50735 40103 34428 -7432 -807 16447 34894 50263 72271 113126 121259 97979 67695
12304 67695 62400 18706 -3568 10209 11078 13656 27786 43283 30448 55461 45524 37467 69789
12291F9789K4605m2582k3625m5157l1621K8676M3600k4434m434N919J3693l5086
12279b0657j1278P179R319M6871k2131P90J1589k6150l282L291j4317l354n296
12266b7426o449j3388k1135L3737Q368m695K8350m989o183j2821K3654j9290k5598
12253d7865l965J7179l963k39k200n875q823M558l291K5140j0542J1037P746M682
12239a6421M1379k0051k8659n9J6571m394m100J8398N0423J0390n6981l8427j5331
12226d7262k5621R242N0182K7204k3234J8163K3866J2458M402l3480k6439K2159
12214A1640J3989j3883j2845M379k1080l5915k7645M8269N5878J1937J2069J3255
12202F0048N1830n575l5867o8222m5666M4037J9475l9312n578M5382P4261K3892
$$ plain form
12291 69789 94394 51812 28187 -16970 -48591 -19915 23685 -749 -5183 736 14429 -20657
12279 -20657 -31935 -24756 -15437 31434 9303 10093 21682 -4468 -7750 -4459 -18776 -22130 -27426
12266 -27426 -33875 -47263 -68398 -34661 -26293 -30988 -2638 -7627 -13810 -26631 -2977 -22267 -47865
12253 -47865 -51830 -34651 -38614 -38853 -41053 -46928 -55751 -51193 -54484 -29344 -39886 -28849 -21103 -16421
12239 -16421 24958 4907 -23752 -23811 -7240 -11634 -15734 2664 53087 63477 6496 -31931 -47262
12226 -47262 -72883 -63641 -13459 13745 -9489 8674 32540 44998 49400 15920 -10519 11640
12214 11640 25629 11746 -1099 3280 -17800 -53715 -81360 -33091 22787 34724 46793 60048
12202 60048 111878 106303 70436 2214 -43452 585 20060 -19252 -24830 20552 94813 118705
12190A18705m5401l6368j1276J2479M362J1980k6010m2464l4048j6531K2393Q1694
12178C9515l052j0168K757j1816M384p108j5575j0269q620K302J8690K5350l9559
12165a3169o920J3319k408p936j4356J4455j3519o79R880M8333l4610p0153Q678
12152f9085M3386l5691J7130L3940k885J0405o941l894j5894k9484m295J4868
12140d8440j1015k5420M3476J2063l3626J9438R243J708l3035L9372M3216N738
12128B2718K9059l72r103m6043R149J8892J2307k710o093j2164j5753j7485P275
12115a0323Q360M7578n690l4148l4420J8382M8088p528l7494j5728L7292J3408
12103B7777j0675N980Q64L8810k2427m5701j0723j5558P656j2066J430J6646J1447
$$ plain form
12190 118705 73304 36936 25660 38139 42501 54481 28471 -13993 -48041 -64572 -42179 39515
12178 39515 36463 26295 29052 17236 21620 14512 -1063 -11332 -19952 -17650 1040 26390 -13169
12165 -13169 -20089 -6770 -9178 -17114 -31470 -17015 -30534 -31213 -21333 27000 -7610 -77763 -69085
12152 -69085 -25699 -61390 -44260 -10320 -13205 -2800 -9741 -13635 -29529 -59013 -63308 -48440
12140 -48440 -59455 -84875 -41399 -29336 -62962 -43524 -34281 -32573 -65608 -26236 16980 22718
12128 22718 51777 51405 42302 -3741 5408 24300 36607 33897 27804 15640 -113 -17598 -10323
12115 -10323 -1963 45615 39925 5777 -28643 -10261 37827 30299 -7195 -22923 14369 27777
12103 27777 17102 23082 23946 62756 40329 -5372 -16095 -31653 -23997 -36063 -34633 -17987 -6540
12090f540j2529j1113J8944j4112J4795K567Q393L0982J7345n0213m9187L8228
12078a2440K7309n001j2549J1522K2694j1658m2463m3460N2971M2501J2871k2375
12066A9922l0791j4366o065M71k4659J5263Q277K9262L9951l9642j3985J3306
12054c056j7588K1956L8387J6545k1685k9861J6831J9730Q52n4339l3129K4391
12042b0966K3884J4299l2786k5154n955j6791M0854J0811L4761N455k9481r466
12030a0535j870l3832O681J5343M9133r670m47J4787k0466P833j4113l2326J5622
12017a3860K6839N6736K192o5047p8832K722L4337Q947J1800j584j5264k671K1963
12004a1722K2473l1610j4226r864l4231Q778K0347L4610P9543J7054m1384n3976
$$ plain form
12090 -6540 -19069 -30182 -11238 -25350 -10555 -7988 405 31387 48732 -1481 -50668 -12440
12078 -12440 14869 9868 -2681 8841 31535 19877 -22586 -66046 -13075 29426 42297 19922
12066 19922 -10869 -25235 -31300 -30829 -55488 -40225 -31948 -2686 37265 -2377 -16362 -3056
12054 -3056 -20644 1312 39699 56244 34559 4698 21529 41259 42111 -12228 -45357 -20966
12042 -20966 2918 17217 -15569 -40723 -46678 -63469 -22615 -11804 22957 28412 -1069 -10535
12030 -10535 -12405 -46237 -39556 -24213 24920 15250 14803 29590 9124 16957 2844 -29482 -13860
12017 -13860 12979 69715 71907 6860 -71972 -69250 -34913 -25966 -14166 -15750 -31014 -33685 -11722
12004 -11722 10751 -20859 -35085 -44949 -79180 -70402 -50055 -15445 64098 81152 39768 -14208
11992a4208k1567L1469O5543M116L429J0877j4982j1817j3764O874l0731l0837
11980a5598l2124K291k1143J9519L5682k6147j4486M5576J9683j7706n4709l4782
11968i3944M5200K0139q522j2208K136m878N4696K0320j7892l390n7704k6433
11956h2480K5919N2041O305j3504j5609J3056J2336K0795j8806k2500j6591k3781
11944f2819n1551J9583P3170O7100j1868r756R55j4812j1930k878q762O744K8203
11931B1379J4721J0905l9653l7017L0645K2302j6050j3255J8767j1524J1462q087
11919D595J1030J7281p285o571m1523J5673j312l403L3082m173J4256j6012n8212
11906d2574k4748J5114J8799J459o376L4030m2617Q191R690K8696N510J2844P932
$$ plain form
11992 -14208 -35775 -4306 61237 65353 68782 79659 64677 52860 39096 45970 15239 -15598
11980 -15598 -47722 -45431 -66574 -47055 -11373 -37520 -52006 -6430 13253 -4453 -59162 -93944
11968 -93944 -48744 -28605 -37127 -49335 -47199 -52077 2619 22939 5047 1657 -56047 -82480
11956 -82480 -56561 -4520 1785 -11719 -27328 -14272 -1936 18859 53 -22447 -39038 -62819
11944 -62819 -114370 -94787 -21617 45483 33615 23859 24814 10002 -1928 -4806 -13568 -6824 21379
11931 21379 36100 47005 7352 -29665 980 23282 7232 -6023 12744 1220 12682 4595
11919 4595 15625 32906 25621 19050 -22473 -6800 -8112 -11515 21567 17394 31650 15638 -42574
11906 -42574 -67322 -52208 -33409 -31950 -38326 -4296 -46913 -38722 -29032 -336 5174 18018 25950
11893B5950j3536l2027j580L4839L2304k9536k676k1946q834J7785R96k5829O366
11880a7724r376k1244N546m4277n3388L2185M1363L0396K7522n213M9406l2934
11868B262l9530m1540K655q493k3702L9036N3789P680k3517L9981M681O290l8372
11855a8780l2881l9573K3833L4428R138j1735J2902j982k1781l4178L9059M1344
11843b06L7986L001K557l3377m4972L7843j6117J2769K2023l3657j1747l0349
11831e4246L8585J8065K0717J651k4869k309k048L572j3111L7474J9600o988l4672
11818A421P428J4755j7546M183L651n204k6430k8750L753K2027R198K2189J6811
11805B7486K979L4663L6082m4699n3502k707L0860k1328r778k1857R08Q865J4838
$$ plain form
11893 25950 12414 -19613 -21193 13646 45950 16414 13738 -8208 -17042 743 1739 -24090 -17724
11880 -17724 -27100 -48344 -42798 -87075 -140463 -108278 -66915 -36519 -8997 -14210 35196 2262
11868 2262 -37268 -78808 -76153 -84646 -108348 -69312 -15523 -7843 -31360 8621 13302 19592 -18780
11855 -18780 -51661 -91234 -67401 -32973 -23835 -35570 -22668 -24650 -46431 -80609 -41550 -206
11843 -206 37780 40781 43338 9961 -35011 2832 -13285 -516 21507 -12150 -23897 -54246
11831 -54246 -15661 2404 23121 24772 -97 -2406 -4454 -882 -13993 23481 43081 36093 1421
11818 1421 8849 23604 6058 10241 13892 8688 -17742 -46492 -42739 -20712 -11514 10675 27486
11805 27486 30465 65128 101210 56511 3009 302 31162 9834 56 -21801 -20893 -12028 2810
11792B810O541l0578l1740L6143L1346k1874q494j0434k4916K4633k55K7854J6607
11779A7643j9189m7999J0701n036l5589N3562M7141j994n31m0537M010L1346j1043
11766B485k1020j2198k0455l2123p090K6697K4503K3141J4431k5969l432J8349
11754a2681P956k9623P784l2392N088K4825M480m521N0092K0904k5065m104J5377
11741B8120j3919l9893J3241K8774K3574J0905j2361k8455m706j2793L0554J8945
11729D1986K1457R212q096p0414l8491J4533R474J1440K680k9104j0376M6553
11717H54j617k3390R076L5741Q549j5176l7800j0077K2949j0997N204J6394k7619
11704b7909J5038K1865j2962n919K4395K7765j0074p2791K3383O1372j3022l2712
$$ plain form
11792 2810 9351 -21227 -52967 -16824 14522 -7352 -15846 -26280 -51196 -26563 -26818 1036 17643
11779 17643 -1546 -49545 -38844 -43880 -79469 -25907 21234 19240 18709 -21828 -17818 13528 2485
11766 2485 -18535 -30733 -51188 -83311 -90401 -63704 -39201 -16060 -1629 -27598 -31030 -12681
11754 -12681 -4725 -34348 -26564 -58956 -53868 -29043 -24563 -29084 21008 41912 16847 12743 28120
11741 28120 14201 -25692 -12451 16323 39897 50802 38441 9986 5280 -7513 23041 41986
11729 41986 63443 72655 64559 -5855 -44346 -29813 -20339 -8899 -6219 -35323 -45699 854
11717 854 -763 -24153 -15077 20664 29213 14037 -23763 -33840 -10891 -21888 -16684 -290 -27909
11704 -27909 -12871 8994 -3968 -9887 14508 42273 32199 -40592 -17209 44163 31141 -1571
11692a571m819K4901M8467K8060p1828j7045L0283K6124N060o6138j2902j5563
11680b6971l799p238J9443q579M536J9459p172j5979J6726O706k4934j1762M6007
11667F443J1584K7246J3250J7949K0125j5449p2024O154J2636O514j1767J219
11655B3880p091L440N1545L3730j9566n0220j4591m8005k2480r968L064N0398
11643e864J5808r563K1265L0960L8549m3775p9206j0123q062p83Q755j5165J6515
11630d0689J5833r96l0260r355R909L0784j5397J9264K3087L6875L3002R7j5441
11617E6713m6337O245j7320j6342k99j199o52P4392M1253k4320m4795l6157J4126
11604E308L2434j8357l0164L7178K9152L024P925j9660m3626k5004k3190K6454
$$ plain form
11692 -1571 -6390 18511 66978 95038 23210 6165 36448 62572 67632 1494 -11408 -26971
11680 -26971 -30770 -38008 -18565 -27144 -22608 -3149 -10321 -26300 -9574 -2868 -27802 -39564 6443
11667 6443 18027 45273 58523 76472 96597 81148 9124 15278 27914 34428 22661 23880
11655 23880 16789 20229 71774 105504 85938 35718 21127 -26878 -49358 -59326 -56262 -5864
11643 -5864 9944 381 21646 52606 91155 47380 -31826 -41949 -50011 -50794 -42039 -57204 -40689
11630 -40689 -24856 -25852 -56112 -65467 -55558 -24774 -40171 -20907 2180 39055 72057 72154 56713
11617 56713 10376 16621 -699 -17041 -17340 -18539 -19191 55201 96454 72134 27339 -8818 5308
11604 5308 37742 19385 -10779 26399 55551 58575 66500 46840 3214 -21790 -44980 -18526
11592a8526M3758l9364l1905L6920J7048M852P448j7589k5196j5955L4193N4690
11580E0374K702L823k2041m4062j4394j6693l786K1309j5421K466k4974J4244
11568d6453K348O298j9509j717N330K377L5377L131l6345k5427J8572M7107L8308
11555B9397L276K6537K1224n4070l8413p031l8737k7107L2309J0950J1359M3905
11543A3599K8968J8821o3393l5187J7057J9677k4335O716k082l2130j6891N3757
11531a5423N4960j3718k975J1022j0435l819l3614J3542j3880j9345K3455L9032
11519B8802n391J2669P232K748k0310l7275j0303j478K5891L1874K219k233l602
11506C0843m099l2310n7364l011L6830L6946L3593q327r578o497l0550M536j802
$$ plain form
11592 -18526 25232 -14132 -46037 -9117 7931 12783 20231 2642 -22554 -38509 -4316 50374
11580 50374 53076 56899 34858 -9204 -23598 -40291 -44077 -22768 -38189 -35723 -60697 -46453
11568 -46453 -44105 -37807 -57316 -59033 -53703 -51326 -15949 -12818 -49163 -74590 -56018 -8911 29397
11555 29397 32673 59210 80434 26364 -12049 -19080 -57817 -84924 -52615 -41665 -30306 13599
11543 13599 42567 61388 -2005 -37192 -20135 -458 -24793 -18077 -20159 -52289 -69180 -15423
11531 -15423 39537 25819 22844 33866 23431 19612 -14002 -460 -14340 -33685 -10230 28802
11519 28802 23411 36080 43312 46060 25750 -11525 -21828 -23306 2585 34459 36678 34445 30843
11506 30843 26744 -5566 -62930 -65941 -29111 7835 41428 33101 23523 17026 -13524 -8988 -10790
11493a0790P847j6405k7777k1264J4123l5747K9246O4936R80l878o881j5980L2952
11480A1362K0117j7650l6252M525J6044P156N715J8461K3307j2239J9628m3882
11468A6292k5081O688p179L188L2076n995K356k2569m3023n2062M5567L6428j5685
11455b8999n0641M4467M0818K094K0478J8285m3269k4398j5347J1756k820q594
11443c6170K3574j3877l4935K4267K7902J2835j4245m8122L6791N2554J9969m5288
11431E255k1272K9103K2729m724j0787O015m867m0445k4429K8858N7406J1873
11419E4715m614j5937r461J577j0124j0640K685l618M805L3824j436K1842J749
11406F5367j0660k0260m7999J6924J8669k2148J0148m127m314n248L1922K1307
$$ plain form
11493 -10790 -2943 -19348 -47125 -68389 -54266 -90013 -60767 4169 5149 1271 -5610 -21590 11362
11480 11362 31479 13829 -22423 -17898 -1854 5302 11017 29478 52785 40546 60174 16292
11468 16292 -8789 -2101 -9280 -6092 25984 19989 22345 -224 -43247 -95309 -49742 -13314 -28999
11455 -28999 -79640 -35173 5645 7739 28217 46502 3233 -21165 -36512 -24756 -27576 -36170
11443 -36170 -12596 -26473 -61408 -37141 -9239 3596 -10649 -58771 -21980 30574 50543 5255
11431 5255 -16017 13086 35815 31091 20304 26319 21452 -18993 -43422 -14564 42842 54715
11419 54715 50101 34164 24703 26280 16156 5516 8201 4583 9388 43212 41776 63618 65367
11406 65367 54707 34447 -13552 3372 22041 -107 10041 5914 1600 -3648 28274 49581
11394D9581m6368k0674n615l3441p66K7966M8096l2406p238p046J5861J8769L435
11381A0154o746J5948L8586j0590l3652l4057j9275K1509K031k3946J9787j8254
11369c8505j4611M805J0582L5047J1638N751l3717k8262J2134M1703p89k7710
11357b1934j2149M1924l215j0236k0632N134m4198p701O0931R569j1229k1139
11345c4875k1985L0784J761j6034P885L751k9633j4306L9253N5865J7082m5323
11333e775n0669K0045j5466j6965M790K8671J5294M666j7441L4042O596o549K4803
11320B6042j1365m8322J0562L7582l6129M970J1137M89m4982j7627L8990m561
11308c3214j563j6786J9865L2286J0090k7266j19K5145O819J1070J5303j6736
$$ plain form
11394 49581 3213 -17461 -23076 -56517 -57283 -29317 18779 -13627 -20865 -27911 -12050 6719 10154
11381 10154 3408 19356 57942 47352 13700 -20357 -39632 -18123 -16092 -40038 -20251 -38505
11369 -38505 -53116 -48311 -37729 -2682 8956 14707 -19010 -47272 -35138 6565 5776 -21934
11357 -21934 -34083 7841 4626 -5610 -26242 -21108 -65306 -73007 -12076 -2507 -13736 -34875
11345 -34875 -56860 -26076 -24315 -40349 -32464 -28713 -58346 -72652 -33399 22466 39548 -5775
11333 -5775 -56444 -36399 -51865 -68830 -64040 -35369 -20075 -15409 -32850 1192 7788 1239 26042
11320 26042 14677 -33645 -23083 14499 -21630 -16660 -5523 -5034 -50016 -67643 -28653 -33214
11308 -33214 -34777 -51563 -31698 588 10678 -16588 -16707 8438 15257 26327 41630 24894
11296B4894j5033j5107N927m5559p9367J1677O5372K0475K7984R165Q796L7735
11284E6959j4791L0708k5553l9675n2633r741L3690j449p663J2443K3883K5145
11272C1323l9184J4925R664j386k382j0953l0899l200K7956K4278J6453j3014
11260B3581m1054J3564O3313K4886m6053m4964k4115r202p986Q301J0422J0254
11248a9053n63K8034J8706o598n343J1134K16j4602j6601L048J4217m4432j2297
11235d4134J7059k033M2142P372j1490K460k6136L7883J7690k2392j5591J9291
11223B2121k1025J4370j0431k9251k4229q825j4873K3563K182j6207K9084L0671
11211b850J0831r504j0201L6109O669J3942j9757k852J1928J5898K2636O476k5968
$$ plain form
11296 24894 9861 -5246 681 -44878 -124245 -112568 -47196 -26721 1263 10428 19224 56959
11284 56959 42168 72876 47323 7648 -44985 -54726 -21036 -22485 -30148 -17705 6178 31323
11272 31323 -7861 7064 16728 15342 12960 2007 -28892 -32092 -4136 20142 36595 23581
11260 23581 -17473 -3909 59404 84290 38237 -6727 -30842 -40044 -48030 -39729 -29307 -19053
11248 -19053 -19616 8418 27124 20526 15183 26317 26533 11931 -4670 -1622 12595 -31837 -44134
11235 -44134 -27075 -29108 13034 20406 8916 11376 -14760 23123 40813 18421 2830 22121
11223 22121 1096 15466 5035 -24216 -48445 -57270 -72143 -48580 -46398 -62605 -33521 -2850
11211 -2850 7981 -1523 -11724 24385 31054 44996 25239 22387 34315 50213 72849 79325 53357
11198E3357j2211k2308k1621J1126K159M577k911K473K3691p406N122K8944o0813
11185D179k2297K2970l5288n4113N594K4596l7942q547K0499j979O518J6068k3850
11172h3592L228M4673Q4590O3942L672j8561j0385k0474k1875K2357n0079n0587
11160c3091J2129L8532N5017J8371p8704o1412J0479K8349l8940J4162k1249Q893
11148d7464p80k01R395J8748O739J4815j9031K0661L8654R754j4730N3397K263
11135I2220k2922m7487j5917j2588k1916j2895j5521J6898J5121J6067J6473k0811
11123a3278j4831P28K8150M031r50k7855m8088j8179L1346M1882M755J1059J5187
11110A3957qK3691K5547n3266l2499K1040M5437J5650p1421l1318m84N7703j6196
$$ plain form
11198 53357 41146 18838 -2783 8343 10502 15079 12168 14641 38332 30926 36048 64992 4179
11185 4179 -18118 4852 -30436 -84549 -78955 -54359 -92301 -100848 -80349 -82328 -75810 -59742 -83592
11172 -83592 -80364 -35691 48899 112841 116513 97952 87567 67093 45218 67575 17496 -33091
11160 -33091 -20962 17570 72587 90958 12254 -49158 -38679 -10330 -49270 -35108 -56357 -47464
11148 -47464 -48244 -48445 -39050 -20302 -13563 1252 -17779 2882 41536 51290 36560 89957 92220
11135 92220 69298 21811 5894 -6694 -28610 -41505 -57026 -40128 -25007 -8940 7533 -13278
11123 -13278 -28109 -27381 769 4800 3850 -24005 -72093 -90272 -58926 -17044 -12289 -1230 13957
11110 13957 13949 37640 63187 9921 -22578 -1538 43899 59549 -11872 -43190 -43674 14029 -2167
11097b167o1571N0535M9406j790k2372l6130Q803R440r090n357K8319j1394p607
11084a0975K245r045j7871J1187L6439J1057l6208J801N8222l5285j4992k4210
11072b7635j3555O351Q735O798l773J1111M1388J6216j5124n6614j8600J074j9831
11059f3459J538J2744j8543P2790k2838l5450M3320j6990k5453l6877N1M5472
11047d3695L9359Q160j6629k0865K078j2159q100K0021K0571Q26M1586M68m2675
11034a1054l4407K1976L3825O174j7149n7303m17M7162k5691k6972j951j8167
11022h3974J7685J5605l408J2895J9398J0276J7363k6346j0793m1615j9751k0014
11010a12679M8462L1421L5500m2077l1489L5983M0906M9128j5053j4844j2655
$$ plain form
11097 -2167 -63738 -13203 36203 34413 12041 -24089 -15286 -5846 -14936 -20293 8026 -3368 -10975
11084 -10975 -8730 -17775 -35646 -24459 11980 23037 -13171 -11370 46852 11567 -3425 -27635
11072 -27635 -41190 -34839 -26104 -19306 -23079 -11968 29420 45636 30512 -26102 -44702 -43628 -63459
11059 -63459 -61921 -49177 -67720 5070 -17768 -53218 -9898 -26888 -52341 -89218 -89167 -43695
11047 -43695 -4336 3824 -12805 -33670 -31592 -43751 -51851 -31830 -11259 -10433 31153 31621 -11054
11034 -11054 -45461 -23485 10340 16514 -635 -57938 -58355 -11193 -36884 -63856 -65807 -83974
11022 -83974 -66289 -50684 -54092 -41197 -21799 -11523 5840 -20506 -31299 -72914 -92665 -112679
11010 -112679 -64217 -32796 2704 -39373 -70862 -34879 6027 55155 40102 25258 12603
10999A2603n1139p4275m1511N5994R0575Q847P676j5071k216m1358r264O5943
10987F804N7165m4134o0786J702J6594o237J4193L5937n980l0672K1856L354j4946
10974e150J7931M0012m79N192m5098l8408j9510o877K7977J3131J1383p03k4566
10961b5165k7720K2645J8106j5954K5970J2765N65l8257l9502j8263r87J7274
10949f8523L0339L6621M2701j5481J4835j3744j3344J4078P252j6850k451L7754
10937E3187J3623J4833k0020n0536J1600K4302l6663L034q910r510J2137K0642
10925B7719l9460p766L1508K246O047N406l2324n761k1060Q359K4465r169j3987
10912b3777j4061L02J8947q070m1688k1305K3184K9607N6589L6578r801l0365
$$ plain form
10999 12603 -38536 -112811 -154322 -98328 -7753 1094 8770 -6301 -8517 -49875 -59139 6804
10987 6804 63969 19835 -40951 -39249 -22655 -28892 -14699 21238 15258 -15414 6442 9796 -5150
10974 -5150 12781 52793 52314 57506 12408 -26000 -45510 -52387 -24410 -11279 104 -599 -25165
10961 -25165 -52885 -30240 -12134 -28088 -2118 10647 11212 -27045 -66547 -84810 -85797 -68523
10949 -68523 -38184 -1563 41138 25657 40492 26748 13404 27482 34734 17884 15433 53187
10937 53187 66810 81643 61623 11087 22687 46989 10326 13360 4450 -5060 7077 27719
10925 27719 -11741 -19507 12001 14247 20294 25700 -6624 -12385 -33445 -25086 -621 -9790 -23777
10912 -23777 -37838 -37536 -18589 -26659 -68347 -89652 -66468 -36861 19728 56306 46505 16140
10900A6140k4777P158J9658l4878J5823O122J7794j9057k6278J9220j828k9772
10888c4675l7563k6348k568K9950J8081N7125P341J0756k2823P189j3616m3175
10876e0326l6470L6620K6931M5650J4137n810P295j7885k2125o72J1849k7659
10864a8465o342L1737P029O748m0992m0272K6716O1542J8000l757k1420m8936
10852b8412l2584l739J4585L8450J5924k7881r91N823q080o276q646L4276K3340
10839A5789L5793j6567n6428l1204K3628L3030J4779q543m336Q240k9749l6951
10827e2519r748J1426K39k6588K9244N4964l9266J2969J4309L4433K1112k8485
10815B2090J7987j1994j2582Q2420J7303o3720m6255n406j164L3420L5201n4018
$$ plain form
10900 16140 -8637 -1479 18179 -16699 -876 5246 23040 3983 -22295 -3075 -4903 -34675
10888 -34675 -72238 -98586 -101154 -71204 -53123 4002 11343 22099 -724 6465 -7151 -50326
10876 -50326 -86796 -50176 -23245 22405 36542 30732 38027 20142 -1983 -2655 9194 -18465
10864 -18465 -24807 6930 13959 20707 -20285 -60557 -33841 27701 45701 41944 20524 -28412
10852 -28412 -60996 -64735 -50150 -11700 4224 -23657 -24648 -18825 -26905 -33181 -41827 -7551 15789
10839 15789 51582 35015 -21413 -52617 -28989 4041 18820 10277 5941 14181 -15568 -52519
10827 -52519 -62267 -50841 -50602 -77190 -47946 7018 -32248 -19279 -4970 29463 50575 22090
10815 22090 40077 28083 15501 97921 115224 51504 5249 -157 -1321 32099 67300 13282
10803A3282j4771P3934m452k3744j1141j1048k0638K9610j5340K628N541m206
10791A9655K523k270k022J4993j4205K3909l0014l1267k8400j7153J5724j0139
10779e8666o024O5812J5696K873L9227J1915o060j5752O956L3814q722k0420n5545
10766E104j9558j0380J8392j0784j6520l058K650J2202k5748o358l3018K5312
10754f1764N6110p663r483K2795M0677K1690r314N2108M3941O3383Q0373J34146
10742D26999J69388J31161Q0041K4836O2562o4046k17016j71109j00480q1605
10732B60731l7255k6189n8083j3769k2613j7470k5255n0864J6288M848q932L0759
10720E2196J3010K3410j2353k3454n6182m1855r222L0287K4622O934k7175L563
$$ plain form
10803 13282 -1489 72445 67993 44249 33108 22060 1422 31032 15692 18320 23861 19655
10791 19655 22178 19908 17886 32879 18674 42583 12569 -18698 -47098 -64251 -48527 -58666
10779 -58666 -64690 1122 16818 19691 58918 70833 64773 49021 55977 89791 81069 60649 5104
10766 5104 -14454 -24834 -6442 -17226 -33746 -36804 -34154 -21952 -47700 -54058 -87076 -61764
10754 -61764 -5654 -13317 -22800 -5 40672 62362 53048 105156 149097 212480 292853 426999
10742 426999 596387 727548 807589 832425 894987 830941 613925 442816 342336 260731
10732 260731 223476 197287 139204 125435 102822 85352 60097 9233 25521 30369 21437 52196
10720 52196 65206 88616 76263 52809 -3373 -45228 -54450 -24163 459 7393 -19782 -16219
10708a6219k76j960O997K4521M9061p1350m8418K6758L9351J0943j2363j3625
10696f580K5330J6010m6778j2299J2717N1435m551J7838r641N628j4359r880p695
10683A7175r267J4573Q391k7114m03j8241N171J192P933O070l3064r763N0888
10670A3541M4435K1737J6238o8978n3137L7704O856K6085K5573n5419o209k5509
10658a7083j9666J6441l8112m0071K429L0035M9932j5387P331N4266j957k4852
10646C306O606J5803M535m7822n223j7209l3891J3607M3147M5296O676j4481l9878
10633a9528J7944j7007m297O602O1322k0796n6243M718m8926L8781L4813m239
10621f856P749K1925J2313m4635l0592j8806r46K667J8559L3840J2341j7886l5216
$$ plain form
10708 -16219 -16495 -18455 -11458 13063 62124 -9226 -57644 -30886 8465 19408 7045 -6580
10696 -6580 18750 34760 -12018 -24317 -11600 39835 35284 53122 43481 49109 34750 24870 17175
10683 17175 7908 22481 30872 3758 3355 -14886 -9715 -8523 -590 5480 -27584 -37347 13541
10670 13541 57976 79713 95951 26973 -26164 11540 18396 44481 70054 14635 8426 -17083
10658 -17083 -36749 -20308 -58420 -98491 -96062 -66027 -16095 -31482 -24151 30115 28158 3306
10646 3306 9912 25715 30250 -17572 -22795 -40004 -73895 -60288 -17141 28155 34831 20350 -19528
10633 -19528 -1584 -18591 -22888 -16286 45036 24240 -32003 -27285 -76211 -37430 -2617 -6856
10621 -6856 893 22818 35131 -9504 -40096 -58902 -59848 -57181 -38622 -4782 7559 -10327 -45543
10608d5543o776k6066p364K2489L3213K4482J9535J3472j7661j1916J2951j4769
10596c953L221k1035m599j2292j4237J3641q135l712L1573K4244L2895j2687m2873
10583a7949O255j2518l4939l4311N567J8349J9648M7619R888j4719P594L132k0600
10570a6984Q008K8132m467n0715O92J1636N929l4605j2993J8289j278N423M861
10557c8072N2692j1086p9337l637M6725M2628J8881J1004j6907r218L2642l1317
10545A4998P902R40K011L889j8972m0779L759K1716j8014P4151K4001M21m2796
10532C3227O16N450N081j9108J2539j3934J877J1274O4958r253j1868J919K6974
10519A09752l3228q22l3738l9820l9779K8066K2872M233p953J0686k6238j2641
$$ plain form
10608 -45543 -52319 -78385 -85749 -63260 -30047 -5565 13970 27442 9781 -2135 10816 -3953
10596 -3953 -732 -21767 -26366 -38658 -52895 -39254 -47389 -51101 -19528 4716 37611 24924 -17949
10583 -17949 -11694 -24212 -59151 -93462 -87895 -69546 -49898 -2279 7609 -7110 484 3616 -16984
10570 -16984 -8976 19156 14689 -36026 -35334 -23698 -17769 -52374 -65367 -47078 -48356 -42933 -38072
10557 -38072 14620 3534 -75803 -79440 -32715 9913 28794 39798 22891 13673 46315 14998
10545 14998 22900 23840 25851 29740 10768 -30011 -26252 -4536 -22550 51601 75602 76023 33227
10532 33227 33843 39293 44374 25266 37805 23871 25748 37022 101980 92727 80859 82778 109752
10519 109752 76524 75702 41964 2144 -37635 -9569 13303 17536 9583 20269 -5969 -18610
10507a8610O794J1725K4573l577L0364J533k5586j8577K2054J5893j6690o5406
10495c5510J9640K9317K5285j3349j2449J0351K9913J1214n9329n0466p389J648
10483e1124K3864M027K1086k6327k70R037r051q55L2910J2911L3339J1623m4040
10470A7130j5933j7112l2928j1591L8834j1431k2409J0385M565K1207K4237j6161
10458a1207O3359J6919n1289j5108M4772M974L0406n7882p9842n8650L6759N5611
10446b1178J8715K1948k0468k5750k9267J5805J123L8725N0837N629M383J0647
10434G1149j0570k638K8135k3909l5181m4970k5577o83K8852K907j5736M648o201
10421b9774N7619P826k8924J3537K3070m0052r043j201K5771j94j7568m834N397
$$ plain form
10507 -18610 -11816 -91 24482 20905 51269 52802 27216 8639 30693 46586 29896 -35510
10495 -35510 -15870 13447 38732 25383 12934 23285 53198 64412 5083 -45383 -52772 -51124
10483 -51124 -27260 -23233 -2147 -28474 -28744 -19707 -28758 -29613 3297 16208 49547 61170 17130
10470 17130 1197 -15915 -48843 -60434 -21600 -33031 -55440 -45055 -40490 -19283 4954 -11207
10458 -11207 52152 69071 17782 2674 47446 52420 82826 24944 -54898 -113548 -76789 -21178
10446 -21178 -2463 19485 -983 -26733 -56000 -40195 -39072 -347 50490 56119 60502 71149
10434 71149 60579 57941 86076 62167 26986 -17984 -43561 -44244 -15392 -12485 -28221 -23573 -29774
10421 -29774 27845 35671 6747 20284 43354 3302 -5741 -6942 18829 18635 1067 -3767 1630
10408A630k2346k3908l956L6311K2776l4241k0503L8678j8882j206K3098N658
10396C109J7625k9534j4457M1378O309m1569L8825L7373L5571O256m9597J2773
10384F4062n2277K3362K1893p487j9033k0836J9050q512k1539K2939o671J4804
10372B9755L3318k3878j5868J9044j5121k1245k0600p437j745k0032K3324J542
10360a8943k0901L0563J9510P220j1544K4276o3K6017k6813q171M1761J0835m0256
10347C3491l1639J1048J7783J3818k4587m1920k4805L986O0672M120k0631k2178
10335b0842q185r083L6892m207P155K4816m769k5556n2214m3462j321K8317K346
10322g0113O0755J9801K8652J7222k4083J840J395J2138J3044l7771k8477M9523
$$ plain form
10408 1630 -20716 -44624 -48580 -12269 10507 -23734 -44237 -5559 -24441 -25647 -2549 3109
10396 3109 20734 -8800 -23257 18121 24430 -17139 21686 59059 94630 100886 51289 64062
10384 64062 11785 35147 57040 49553 30520 9684 28734 20222 -1317 21622 14951 29755
10372 29755 63073 39195 23327 42371 27250 6005 -14595 -22032 -23777 -43809 -20485 -18943
10360 -18943 -39844 -9281 10229 17449 5905 30181 30118 56135 29322 21151 62912 73747 33491
10347 33491 1852 12900 30683 44501 19914 -22006 -46811 -42825 17847 21967 1336 -20842
10335 -20842 -29027 -38110 -1218 -5425 1730 26546 21777 -3779 -55993 -99455 -100776 -72459 -70113
10322 -70113 -9358 10443 39095 56317 32234 34074 35469 47607 60651 22880 -5597 43926
10310D3926n4903m5900K1572M3979L057m6497k0408N9697r326j8915N0849J2361
10298C9492j5283l6055k9834K1341J7399L3930m8597J4463l3070l848L5698J1859
10286G495n639k3413M006k145K410k2066J6210M5082l8114k7473K1467r44M5073
10273B1949R753n418n6129j5343Q0853R334l2265k784k2898j0488l786o575K9757
10260d040L68k0632k4250m101K6394K853J3150J2132J8248j6065j2805j9009m315
10247c2072J1909J3980N955j6464o369J697O320Q016o522j1141p374m4039l1070
10234a07174R092J7752L4817M777L4445J742n200K308qJ9109p873n6728R604M1762
10220a575l5303m6578M8648L2516q050m3011k9725N1705K8289J9364K4768j8568
$$ plain form
10310 43926 -10977 -56877 -35305 8674 11731 -34766 -55174 4523 -4803 -23718 27131 39492
10298 39492 24209 -11846 -41680 -20339 -2940 30990 -17607 -3144 -36214 -40062 -4364 7495
10286 7495 1856 -21557 -17551 -19696 -17286 -39352 -23142 21940 -16174 -43647 -22180 -23124 21949
10273 21949 31702 26284 -29845 -45188 35665 44999 12734 9950 -12948 -23436 -27222 -33797 -4040
10260 -4040 -3672 -24304 -48554 -52655 -26261 -23408 -10258 1874 20122 4057 -8748 -27757 -32072
10247 -32072 -20163 -6183 -228 -16692 -23061 -21364 -15044 -7028 -13550 -24691 -32065 -76104 -107174
10234 -107174 -98082 -80330 -45513 -40736 -6291 -4549 -9749 -7441 -7449 11660 3787 -52941 -43337 -1575
10220 -1575 -36878 -83456 -34808 -2292 -10342 -53353 -83078 -31373 -3084 16280 41048 22480
10208B2480k932j1253l2968l3235J5683j631n197J4446J0039o305j6822j8597
10196f6292l979J1939k7966K0479K7213L9596L4848k5358j4756k3939m176k423
10184c4814p234J8829P770k245j0225j4612M1836Q383k0357K7414k1350j5754
10172b2359j3262l6814M4742L2484l3277n844L7163K8655j9680k5727l959L601
10160a4277j8117q838J3848Q963j1097J6056j1523j377M382M259K5291p30o4348
10147e7508J9263l454k1338Q406M1266N4584L8847m3307M617L1837k5343j5906
10135C1964r918k1547R484J5656k3459k7521j6781J4535O100o418m878n141j5394
10122e3318j35O1411N0411O80j8831P955Q494J7090m3615k0334q758l578J417
$$ plain form
10208 22480 19548 8295 -24673 -57908 -42225 -43856 -49053 -34607 -24568 -30873 -47695 -66292
10196 -66292 -70271 -58332 -86298 -65819 -38606 990 35838 10480 -4276 -28215 -32391 -34814
10184 -34814 -42048 -23219 -15449 -17694 -27919 -42531 -695 7688 -12669 14745 -6605 -22359
10172 -22359 -35621 -72435 -27693 4791 -28486 -34330 2833 31488 11808 -13919 -17878 -14277
10160 -14277 -32394 -41232 -27384 -18421 -29518 -13462 -24985 -26362 -21980 -17721 7570 6840 -57508
10147 -57508 -38245 -41699 -63037 -54631 -13365 41219 80066 36759 41376 73213 47870 31964
10135 31964 22046 499 9983 25639 2180 -25341 -42122 -27587 -21487 -27905 -32783 -37924 -53318
10122 -53318 -53453 7958 58369 59049 40218 48173 56667 73757 30142 9808 1050 -2528 -1111
10109a111K2416P082J5364P740k0996j8038n648k4004k1176m8543O2012L9653
10097A4751L255j8827m1214L596M2459j0590J1535O2408O433m8291N481j4598
10085A6398k396k3919K6956Oj1595O356l347l9187J3070J4485K2394J7468n0049
10072a3360j3900K5663j3247m1189m809M0538J8645K0556P393N528J532j4645
10060A8705j6494J1766j4853j5612l8733l577K193J3881O2210j4234m6970j754
10048d3472Q499j2219L0267K6483l1738O200j3440J4863L1280J8616k2310L0659
10036D3688n349k1783m0772l4271j3401J6362k8632L7222J04771J7916k0792K068
10024E7027k8931j2768l0163J5J3790j8476j0563p865Q71p066M2908n372j1700
$$ plain form
10109 -1111 21305 28387 43751 51491 30495 12457 6809 -17195 -38371 -86914 -24902 14751
10097 14751 18006 -821 -42035 -38439 4020 -6570 4965 67373 73806 25515 30996 16398
10085 16398 14002 -9917 17039 17045 5450 11806 8459 -30728 -17658 -3173 19221 36689 -13360
10072 -13360 -27260 -1597 -14844 -56033 -60842 -20304 -1659 18897 26290 31818 33350 18705
10060 18705 2211 13977 -876 -16488 -55221 -58798 -56605 -42724 19486 5252 -41718 -43472
10048 -43472 -34973 -47192 -16925 9558 -22180 -15980 -29420 -14557 16723 35339 13029 43688
10036 43688 38339 16556 -24216 -58487 -71888 -55526 -84158 -46936 57835 75751 54959 57027
10024 57027 28096 15328 -14835 -14820 -1030 -19506 -30069 -37934 -37063 -44129 -1221 -6593 -18293
10011a8293k2101J6929M0577O872j8701k7365n277K5438J8537M0457J338r403
9999D9008k9595M4174P135n7923k3065m959K0137J668M60m2283l2018L4441K5824
9986f996j1163J2923l217J6952J4152q019l2864l8722k0337J1266K5947M7604
9974G526K2047k4463l068k272K7153J7700k7251L711K8154n882o8904m120K9335
9961c34N4819R528m4888n034K3637l399J86M2905L0536l0017n4773J8057K3507
9948F4730J7678m9841l2887M3302M1730J2470j5616J6213j9050k4859j2302j3497
9936B8071p391J2403j1743M338k1034J2140k4448m3508p8J480j7624K1873L5317
9923a0204M1627J8108K1073n6225j0354k694N7204N0161j6240n9821k1397l3542
$$ plain form
10011 -18293 -40394 -23465 17112 23984 5283 -22082 -27359 -1921 16616 57073 58411 49008
9999 49008 19413 63587 70722 12799 -10266 -15225 4912 6580 7040 -35243 -67261 -32820 -6996
9986 -6996 -18159 -5236 -8453 8499 22651 14632 -18232 -56954 -77291 -66025 -40078 7526
9974 7526 29573 5110 2042 -230 26923 44623 17372 21083 49237 43355 -25549 -29669 -334
9961 -334 54485 64013 19125 14091 37728 34329 34515 77420 107956 77939 23166 41223 64730
9948 64730 82408 32567 -320 42982 84712 97182 81566 97779 78729 53870 41568 28071
9936 28071 20680 33083 21340 25678 4644 16784 -7664 -51172 -51250 -49770 -67394 -45521 -10204
9923 -10204 31423 49531 70604 14379 4025 1331 58535 108696 92456 32635 11238 -22304
9911b2304j7297K0807O0325l5758j6084l671l1482j5263J8271N8443p359J4329
9899B2957N4755q454m6160j6278O772j5906k7978j6296K4166K9302j8661l3869
9887d5650L4147L1995k2883m1131l4723q091j2914J8788K9138K7296J2623Q164
9875c241O813K1742K6231k725M570l2508l1536J6087O1831q22P731p625K873j2202
9861E7219m1902J2663j539J3392M2316j0064o778r899M901k0632K2513j2694j4704
9848C4792K7957m2164k3788o1465K008K3255L970J271k9885M7589P6332J8288
9836G8160n1378k0462j5066O837J5683K2024k5612l4549l15j3435J4033J5097
9824h983o399L3032k621m820j8410r685Q204j979L202l9303J1395N3224K080m6701
$$ plain form
9911 -22304 -39601 -18794 41531 5773 -10311 -13982 -45464 -60727 -42456 15987 8628 22957
9899 22957 77712 69258 23098 6820 13592 -2314 -30292 -46588 -22422 6880 -11781 -45650
9887 -45650 -11503 20492 -2391 -43522 -78245 -86336 -99250 -80462 -51324 -24028 -11405 -3241
9875 -3241 3572 25314 51545 48820 53390 20882 -10654 5433 67264 66442 74173 66548 69421 57219
9861 57219 15317 27980 26441 39833 82149 72085 65307 55408 60309 39677 62190 49496 34792
9848 34792 62749 20585 -3203 -64668 -62660 -39405 -35435 -34164 -64049 -16460 59872 78160
9836 78160 26782 6320 -8746 -1909 13774 35798 10186 -24363 -24678 -38113 -24080 -8983
9824 -8983 -15382 17650 15029 10209 -8201 -17886 -9682 -11661 -8459 -47762 -36367 16857 18937 -27764
9810b7764k9709N53J1258N7130J7805j0777K709j5288Q017R76k084p655k7992
9797b2821k8182K7619O4529L1967k7876k3377L376J0699j1666j0738L4697N199
9785E3426n0540l9463k8147N8038L2164k4010j0274k1834k3856J1830L8352p211
9773a1525j1131L432j1716o879R063J6494M619M090q422j4785K4356n822K4592
9760A6366L5322Q359k7218m3114k0968m440n224N4132K9285J4367j6555k4622
9748A5690K0786j449n819L1227m430l6658q669n748Q684J5126o954n6911K5660
9735i465J0780k3359j1488j7296M384J3350m4871q510O951j2070J9692J8978R391
9722d3533l0601J9492L9041J2602l1956K2328K8654m658Q291L252K5763K7131
$$ plain form
9810 -27764 -57473 -56920 -45662 11468 29273 18496 21205 5917 13934 14910 12826 5171 -22821
9797 -22821 -51003 -23384 41145 73112 45236 21859 25235 35934 24268 13530 48227 53426
9785 53426 2886 -36577 -64724 -6686 25478 1468 -8806 -30640 -54496 -42666 -4314 -11525
9773 -11525 -22656 -19224 -30940 -37819 -28756 -12262 -7643 -3553 -11975 -26760 -2404 -8226 16366
9760 16366 51688 60047 32829 -10285 -31253 -35693 -40917 13215 42500 56867 40312 15690
9748 15690 36476 35027 29208 60435 56005 19347 10678 4930 13614 28740 21786 -35125 -9465
9735 -9465 1315 -22044 -33532 -50828 -46444 -33094 -77965 -86475 -79524 -91594 -71902 -52924 -43533
9722 -43533 -74134 -54642 -15601 -2999 -34955 -12627 16027 11369 19660 22912 48675 75806
9710G5806j1346q2153l2893N4118L4144J2215j6138O759K2536j9414k1073l8606
9698a6045O132J5335k2409J4671n735k8203k1773K6660j1365k4722M2336M1036
9686A5918J1984l5713K3869J8084l8626l4503q076l5492l7259K606Q4738M4511
9674A2041m4094m0361L2523L8533K5398M304m6150n0868L2357j7441k8732Q931
9662g3559J8393K679J35J3967K0069k4002j582m3400N979j6856K4586k377k6721
9649a02689K3145o919j4862M908M0585K0204L4838P0913N894m1252m3601n2649
9637f1485M9466j668N985j485k575J3483L4897l9617l4243K968k769k8818J0110
9624e5751L5110J8936l1521r804l0626J6341K5557K6723m136j064K4272J0719
$$ plain form
9710 75806 64460 -17693 -50586 3532 37676 49891 33753 40512 63048 43634 22561 -16045
9698 -16045 -9913 5422 -16987 -2316 -8051 -36254 -58027 -31367 -42732 -67454 -25118 15918
9686 15918 27902 -7811 16058 34142 -4484 -38987 -47063 -82555 -119814 -117208 -32470 12041
9674 12041 -32053 -72414 -39891 -1358 24040 28344 -17806 -68674 -36317 -53758 -82490 -73559
9662 -73559 -55166 -52487 -52352 -38385 -18316 -42318 -43900 -87300 -81321 -98177 -73591 -75968 -102689
9649 -102689 -79544 -86463 -101325 -96417 -55832 -35628 -790 70123 76017 34765 -8836 -61485
9637 -61485 -12019 -13687 -7702 -9187 -11762 1721 36618 -2999 -37242 -34274 -37043 -65861 -55751
9624 -55751 -20641 -1705 -33226 -43030 -73656 -57315 -31758 -5035 -9171 -10235 14037 24756
9612B4756l1989L711J0782M272L626J432o8593m4074K5324M5348P375K217j7298
9599c3111L8006J192n5408k266J7997l6068P868L2785K0360R22j6712P229K1914
9586D708j5959l804m333P1945J0986P128K0120o738j8995j9555J6104o6654J5388
9573A0341P988l8977M0378J892k6173m809o088q93O619J1174K0114J8319k2259
9560A7626j8429J317l146K0902n3272l5008j730M377J3201M3607L8349N2924J3022
9547I3740k0635k2084M848k6435k2557J5485K0035L6871J3737j9061j7183l1839
9535B4922m1286j906J3754K3366j1399K4452O3040j7523l1693k0760R18k1514
9523D371m854k3695K4784N0712K8901j2657p501j0899j2553k0360p8313J1316
$$ plain form
9612 24756 -7233 -3522 7260 11532 15158 16590 -52003 -96077 -70753 -25405 -18030 -15813 -33111
9599 -33111 4895 6087 -49321 -51587 -33590 -69658 -61790 -29005 -8645 -7723 -24435 -17206 4708
9586 4708 -11251 -15055 -19388 52557 63543 70671 90791 84053 65058 45503 61607 -5047 10341
9573 10341 18329 -20648 19730 21622 -4551 -9360 -15448 -16341 -9722 1452 21566 39885 17626
9560 17626 -803 514 -2632 18270 -35002 -70010 -71740 -67363 -54162 -10555 27794 80718 93740
9547 93740 73105 51021 55869 29434 6877 22362 42397 79268 93005 73944 56761 24922
9535 24922 -16364 -18270 -4516 18850 7451 31903 94943 77420 45727 24967 25885 4371
9523 4371 -483 -24178 606 51318 80219 67562 60061 49162 36609 16249 -62064 -50748
9511e0748K0729K9966q378k0040Q061J0378J7451R288M443J1970j1459j8449K0804
9498B4016j1354L394m5216l7386K8330N4451M0222j9644k3442J0761l3282l0818
9486c9968k6524l3508n370L1706j8824K4596J602J8399M053K1065K1291l2664
9474c4146k564J5115m680n2372L8874M5288j8172j1757K4588L0169J9781J626
9462E1750q892k655l6884K546k1411M026k4731n746N012K9530j3432k3169m447
9449d8503n020k4623K4374M2248K961L4132L3837q811j1402L088J2035j4225l4367
9436E724K9531K5079L9112l8387k8706j1806k7358k177J162k6988j2260L254k9855
9423g3675N825J3292Q005K4663J2045N713K9131O651l6299l0535K5632o626l9351
$$ plain form
9511 -50748 -30019 -53 -8431 -28471 -20410 -10032 7419 16707 21150 33120 21661 3212 24016
9498 24016 12662 16056 -29160 -66546 -38216 16235 56457 36813 13371 24132 -9150 -39968
9486 -39968 -66492 -100000 -105370 -73664 -92488 -67892 -66290 -47891 -43838 -22773 -1482 -34146
9474 -34146 -36710 -21595 -26275 -78647 -39773 5515 -12657 -24414 174 30343 50124 51750
9462 51750 42858 40203 3319 5865 -15546 -11520 -36251 -41997 -36985 -7455 -20887 -44056 -48503
9449 -48503 -53523 -78146 -53772 -11524 -8563 25569 59406 50595 39193 42281 54316 40091 5724
9436 5724 35255 60334 99446 61059 32353 20547 -6811 -8988 -7826 -34814 -47074 -43820 -73675
9423 -73675 -67850 -54558 -46553 -21890 -9845 -4132 24999 31650 -4649 -35184 -9552 -16178 -55529
9410e5529J5780L970m674J2612J1413n919J2970k2428l9295J2445R481j808J0799
9397d0183J1226M8353K4404j7958l7739j8018K7203l476j5940J7921K9524j8010
9385G307m3559m921M8161j022n3525k8749J6009K8626J5124J6330N420J5710N711
9372B6622M168k8123O471L9722J0847O976l8468m8659m924R713M7467J7915J728
9359E1455k870k8170l5765l2476o7080K3635K1817k8456M6621M4919k2915k0841
9347e0126J8848M1507q622L2631j3797m126l7790J775q155K1221j2335q753J6911
9334a0811k4294l0666L4784M3538k0029m7583J2318M397j2051K1679J075J6929
9322a0714L3001M6130L529r216k6056k4776n905J3571n290M849Q222q396j6521
$$ plain form
9410 -55529 -39749 -35779 -40453 -27841 -16428 -22347 -9377 -31805 -71100 -58655 -49174 -50982 -40183
9397 -40183 -28957 19396 43800 25842 -11897 -29915 -2712 -6188 -22128 -4207 25317 7307
9385 7307 -36252 -41173 6988 5966 -47559 -76308 -60299 -31673 -16549 -219 5201 20911 26622
9372 26622 30790 2667 9138 48860 59707 66683 28215 -20444 -25368 -15655 31812 49727 51455
9359 51455 48585 20415 -15350 -47826 -114906 -91271 -69454 -97910 -51289 -6370 -29285 -50126
9347 -50126 -31278 10229 1607 34238 20441 16315 -21475 -19700 -27855 -6634 -18969 -27722 -10811
9334 -10811 -35105 -65771 -30987 12551 -7478 -55061 -42743 -38346 -50397 -28718 -27643 -10714
9322 -10714 22287 68417 71946 62730 36674 11898 5993 19564 14274 19123 27345 18949 2428
9309B428O447R116M001l2227M7187J5669l5962K9115K3853k4337l0625J0792j3593
9296A1864l4005K6949K7921Q074m8131k591j663k7312j4121R502L6931j7698L8405
9283A4125j66j8275K807k6102o373N1809J261n1631L230O7137M3389n5485o5909
9270d0183m109K8357J8199M2094N8663R127q3061N0964K4417m6990n2844n0278
9258d5644L1756L2052J5381j0504k9028l3537J4287M4674K7547j6300m7414n4786
9246g1516J1542L8929K0221j4693J9737M186k4857j2231J8984k373j236m762J2314
9233e755L4349l7876l0937p64N152N3205O1952L3088k8981j9073j5024r498j7253
9220B2585O14R769l2890j0862N6764K0865k8922n2503k7096K732L1399Q61L1933
$$ plain form
9309 2428 8875 17991 21992 -10235 36952 52621 16659 45774 69627 45290 14665 25457 11864
9296 11864 -22141 4808 32729 40803 -7328 -9919 -11582 -38894 -53015 -43513 -6582 -24280 14125
9283 14125 13959 -4316 -1509 -27611 -33984 17825 19086 -32545 -29315 37822 81211 25726 -40183
9270 -40183 -44292 -15935 2264 44358 103021 112148 29087 80051 104468 57478 4634 -45644
9258 -45644 -13888 18164 33545 23041 -5987 -39524 -25237 19437 46984 30684 -16730 -71516
9246 -71516 -59974 -21045 -824 -15517 4220 8406 -16451 -28682 -9698 -12071 -13307 -18069 -5755
9233 -5755 28594 -9282 -40219 -40983 -35831 17374 79326 112414 83433 64360 49336 39838 22585
9220 22585 23199 32968 78 -10784 45980 66845 37923 -14580 -41676 -38944 -7545 -6684 25249
9207B5249j7725j589L8066J1399k4477j7496j7673K4619r714N267O1943R874j8523
9194F9220j8932k5616j8939o8286J3069L4125n135K5667P1424J4292k7039j9415
9182D4435j0498n9725K2357l194K1842k456k1104j6628j4754L3549K3544K6271
9170D3639l1899M771J8232K5457N979Q322r78m937J5425K929j7390j915j4910
9157E2725k8161j2871j0827n0543j154m5505k8021N2090J5127N3197K1584j3466
9145D175j5159k8350J0957L9719j9254J9988j0911j9548M1404L8453k8759p45
9133C1970J7998K6054K1795J060q616J9910j1656p4495l7138M8276J3272K6272
9121G4702M2912n0548q296M8492L0170j256j3783j334l517N1007K9629j200L8950
$$ plain form
9207 25249 7524 5935 44001 55400 30923 13427 -4246 20373 10659 15926 77869 87743 69220
9194 69220 50288 24672 5733 -62553 -49484 -15359 -20494 5173 76597 90889 63850 44435
9182 44435 33937 -25788 -3431 -6625 15217 12761 -8343 -24971 -39725 -6176 17368 43639
9170 43639 11740 16511 34743 60200 66179 74501 73523 68586 84011 86940 69550 67635 52725
9157 52725 24564 11693 866 -49677 -50831 -96336 -124357 -72267 -57140 -3943 17641 4175
9145 4175 -10984 -39334 -28377 11342 -7912 12076 1165 -18383 23021 61474 32715 31970
9133 31970 49968 76022 97817 98877 90261 110171 98515 24020 -13118 35158 48430 74702
9121 74702 117614 67066 58770 107262 137432 136176 122393 121059 117542 168549 198178 196978 235928
9108B35928k309M6156N5318Q5723R5251J57954J30030K08120L84084N33697P96201
9097B726153J090196J452262K119905K578082J541950P80716O84080O120r12010
9088A2067454l026031l210522j876846r82559n80168m21704k78444k12591j78710
9079A299879p6890r9194q2896m7741m409m0416j05967m4402K037n7880o0961n0193
9067F30967k5451k8585l4807m739n545k0508j2575k5583n9204n418k2949j3757
9055C71846j7179k1427n0898k4549N7862r719l1263j3401k3192O724Q014k296
9043B50522k5152j4333q073K542k718J8587k0011k6823L8506N846L9105L528l6553
9030B24973n0659k0473L9168j9866l0885j2752L2143K4708o72P718l0143m5346
$$ plain form
9108 235928 233619 279775 335093 420816 516067 674021 804051 1012171 1396255 1929952 2726153
9097 2726153 3816349 5268611 7388516 9966598 11508548 12289264 12973344 12979464 12067454
9088 12067454 9041423 5830901 3954055 2971496 2391328 1969624 1691180 1478589 1299879
9079 1299879 1222989 1123795 1040899 993158 988749 948333 842366 797964 800001 742121 681160 630967
9067 630967 605516 576931 542124 537385 531840 511332 498757 473174 413970 408552 385603 371846
9055 371846 354667 333240 282342 257793 315655 305936 274673 261272 238080 244804 252818 250522
9043 250522 225370 211037 202964 205506 202788 221375 201364 174541 213047 218893 257998 261526 224973
9030 224973 174314 153841 193009 173143 142258 129506 161649 186357 185685 193403 163260 117914
9018A17914J6691N0401l2650k967P743j251J0735J945n444k8838J2424J8153j8254
9005A46602k982m3016n3947k1423m046L4154J7990M727J2325j5941k2955l1131
8993B0357j1908J0834P107M803L254l7850J0498j123J2416N917J7486q832J4762
8980D7721K7034k5467n2786M6608j4845o329m376k9002L7074M920n61R346m2872
8967c535k4227o183l715J3005k7794O493L4729N1091K3546k9968j5901l484j7380
8954c323n1514J3169K3666L5664K1674j2197k8353k1903Q942l11l969j8958J9231
8941a8182K3489J5699J3265J9161k0854k9928M678n749P252l5125m841N8871J9311
8928D7047j3950j0315j7922k4747R423M0575j1132j2334M1832M1931l4588k1216
$$ plain form
9018 117914 134605 185006 152356 149389 157132 155881 166616 168561 163117 134279 146703 164856 146602
9005 146602 143620 100604 46657 25234 21188 55342 73332 78059 90384 74443 51488 20357
8993 20357 8449 19283 26390 31193 34447 -3403 7095 5972 18388 24305 41791 32959 47721
8980 47721 74755 49288 -3498 43110 28265 21936 17560 -11442 25632 30552 29991 39337 -3535
8967 -3535 -27762 -33945 -37660 -24655 -52449 -45956 -11227 39864 63410 33442 17541 14057 -3323
8954 -3323 -54837 -41668 -18002 17662 39336 27139 -1214 -23117 -14175 -14486 -18455 -37413 -18182
8941 -18182 5307 21006 34271 53432 32578 2650 7328 1579 8831 -26294 -31135 27736 47047
8928 47047 33097 22782 4860 -19887 -10464 30111 18979 6645 48477 90408 55820 34604
8916C4604L3631k0118J505J7366k5789R085M5130j3737o8440k2314J1015m6587
8904d4649q083P0859K1304p503L1649J4166j5507L0769j3947k4715o314K9090
8892G7119L7733J3806K8488m571j6864N0169q89j0483j4073M5298L4015M2183
8880B81931L6564K6733N3539P9412O4022J43471K70555L53053L67127M92328O93592
8869B862327P81127O46078M18642K60314J2110l36901q25444j010858q02037m75961
8859A529397k60585j76645j51651j33625r0037n5725k1850l9263p7990l5732m4180
8848D42114l7746k6071l9201N011L2448L3004Q762n8592j13993l6509J520k3240
8836A87507k9735j6914J5023J1056K5140m4266k211k449q517K3752l108R220N9364
$$ plain form
8916 34604 68235 48117 49622 66988 41199 50284 95414 81677 13237 -9077 1938 -44649
8904 -44649 -52732 18127 39431 31928 63577 77743 62236 93005 79058 54343 48029 77119
8892 77119 114852 128658 157146 152575 135711 185880 184991 174508 160435 205733 239748 281931
8880 281931 318495 345228 398767 478179 542201 685672 956227 1309280 1676407 2168735 2862327
8869 2862327 3643454 4289532 4708174 4968488 4980598 4643697 3818253 2807395 2005358 1529397
8859 1529397 1268812 1092167 940516 806891 716854 661129 639279 600016 522026 486294 442114
8848 442114 404368 378297 339096 344107 376555 409559 418321 359729 245736 209227 210747 187507
8836 187507 157772 140858 155881 166937 192077 147811 145600 143151 134634 158386 155278 164498 223862
8823B23862L0001k0636o8478m7311k0788N2338O59l9364j1604m2708n2693k0890
8811a7612K7556N3801r645k0707m1039j0712P980L1197j5929j0654J9312N518
8799A9066K645r071k2717q38K6204j782M0k5889L1626L4108j4486j342J6014k0398
8785C3180j1540J1270J1134o938m422k4942m4947q085J7232o606P138J3108r467
8772b3885J4582N0597K1073k2551j8459R217J7429j857o486l3892q144J1206p014
8759A816P249J2403p553O341k2804m2848J5840K321M6358N4009K065J3759j9691
8746F9265n1288l8133P996j0143L1546L1802N137O503K1238j6046j1558O539O572
8733E9430N122J4216l3822m3495L1096K4420k4314m4473J2333L7452J5929m4202
$$ plain form
8823 223862 253863 233227 164749 117438 96650 148988 149647 110283 98679 55971 3278 -17612
8811 -17612 9944 63745 54100 33393 -7646 -18358 -10378 20819 4890 -5764 13548 19066
8799 19066 21711 12640 -10077 -10915 15289 13507 13547 -12342 19284 53392 38906 37564 53578 33180
8785 33180 21640 32910 44044 37106 32684 7742 -37205 -45290 -28058 -34664 -27526 -14418 -23885
8772 -23885 -9303 41294 62367 39816 21357 30574 48003 46146 39660 5768 -2376 8830 1816
8759 1816 9065 21468 13915 20256 -2548 -45396 -29556 -27235 19123 73132 75197 88956 69265
8746 69265 17977 -20156 -12160 -22303 9243 41045 46182 52685 73923 57877 46319 52858 59430
8733 59430 64552 78768 44946 1451 32547 56967 32653 -11820 513 37965 53894 9692
8721I692m607N03M1194K563l0005J4223R03n82N157j3194j2940j5802L4302K0110
8707E1517M234m6097k4349k8379L9788J838J4766q946l519Q565J8790j1069l3195
8694a6056k2352L5743O981j4716n6070K6522O1604M9302L3995j0743m7490k8371
8682A8349j243n590j8316j6676k6128n3053L6370M7311L1605K9000m868j2715
8670B4046M4580R854m6939n0774k4853J3146N3756J0103j3103j2124k4199J6037
8658d70M4123l958R517j6023p975k132j062k682o501k9055j3925m220j2746M0743
8644f366L9796L1576O873j8345m9798l861K0600k8081l0023l8652n478j165L6551
8631d6373l537J8557L6971J5494j2082o092K855P181K0631n49m3880j5722J4379
$$ plain form
8721 9692 5085 5588 46782 49345 19340 33563 34466 33884 39041 25847 12907 -2895 31407 51517
8707 51517 55751 9654 -14695 -43074 -3286 -1448 13318 4372 853 9418 28208 17139 -16056
8694 -16056 -38408 -2665 4316 -10400 -66470 -39948 21656 70958 104953 94210 46720 18349
8682 18349 17106 11516 -6800 -23476 -49604 -102657 -66287 -18976 12629 41629 36761 24046
8670 24046 68626 78480 31541 -19233 -44086 -30940 22816 32919 19816 7692 -16507 -470
8658 -470 43653 39695 49212 33189 25214 23082 22020 19338 12837 -16218 -30143 -34363 -47109 -6366
8644 -6366 33430 65006 71879 53534 3736 -125 20475 -7606 -37629 -76281 -81759 -82924 -46373
8631 -46373 -49910 -31353 5618 21112 9030 2938 5793 12974 33605 33056 -10824 -26546 -12167
8618a2167j3610m2669k1795K1327P700M0135k161k0461J9571L7604j954k6753
8606a5233K0141p148N749K4557j913K919k2841j43o82K5217l9182J8623J4257
8593B4321m6890J7160K0066j7051K6571M3627l6778j7673L0582l0497k3659J2647
8581B426j4483k0338n129m4293k55K6402K0651N761M567R154j1041R963L6606
8568A9991j0771L3839K9255J4539n4192K440j3988l4356j8893N562m1228k8009
8556i5811N3573P368r535L862M0221K1506K2579j6367n7380j1427L22L539J7022
8543b0528k4982n3945m9650N6225N7090m169k7271M606J8627L4484J1210k6025
8531b4328J620J7592P653k4272J5082j1818o5009N7315J4192l8127j4307L6032
$$ plain form
8618 -12167 -25777 -68446 -90241 -68914 -61214 -21079 -23240 -43701 -24130 13474 11520 -15233
8606 -15233 4908 -2240 3509 28066 26153 29072 6231 6088 5406 30623 -8559 10064 24321
8593 24321 -22569 -5409 14657 -2394 24177 67804 31026 13353 43935 13438 -10221 2426
8581 2426 -12057 -32395 -37524 -81817 -82072 -55670 -35019 -29258 -24691 -15537 -26578 -16615 19991
8568 19991 9220 43059 72314 86853 32661 35101 21113 -13243 -32136 -26574 -67802 -95811
8556 -95811 -42238 -34870 -44405 -40543 -322 21184 43763 27396 -29984 -41411 -41089 -37550 -20528
8543 -20528 -45510 -99455 -149105 -92880 -35790 -39959 -67230 -62624 -43997 -9513 1697 -24328
8531 -24328 -22708 -5116 2537 -21735 -6653 -18471 -83480 -26165 -11973 -50100 -64407 -28375
8519b8375J9316k3342k1776L5895M0007N495o248m3633k3337J9163J5574j6660
8507b7921k5042K056L6173J8483o957o090J6137J264L5882K6565j8556l1076k0566
8494C52k8532J3294N115k9274j2393K2304M2095L1435J3169K5086k6658n9726
8482c733m3732J746o245K8040k356M9947O5455N3119o341k4041l9362M107l1211
8469D5393k5059o2532q091N6324k148J5142j674N077k3402M0736M5026n8807l6296
8456a0311k0813K9853L7050L6678K8478j9749j57J4006m1108n5360j8026m542
8444b4001K6915K2171k0344n409J1878J5518Q744P548k3300o0467k4439O83J7721
8431d6782O268O572l8009L857J8402M4140j6569n745K4020k536k9470j4331J6860
$$ plain form
8519 -28375 -9059 -32401 -54177 -18282 21725 27220 20972 -22661 -45998 -26835 -11261 -27921
8507 -27921 -52963 -50907 -14734 3749 -3208 -9298 6839 8103 43985 70550 51994 20918 352
8494 352 -28180 -14886 -9771 -39045 -51438 -29134 12961 44396 57565 82651 55993 -3733
8482 -3733 -47465 -45719 -51964 -23924 -26280 23667 89122 142241 135900 111859 72497 76604 45393
8469 45393 20334 -42198 -50289 6035 3887 19029 17355 22432 -970 39766 84792 25985 -10311
8456 -10311 -31124 -1271 35779 72457 100935 81186 81029 95035 53927 -1433 -19459 -24001
8444 -24001 2914 25085 4741 -668 11210 26728 35472 43020 19720 -40747 -65186 -64503 -46782
8431 -46782 -40514 -33942 -71951 -68094 -49692 -5552 -22121 -27866 -3846 -6382 -35852 -50183 -33323
8418c3323M5080O725M811j0823l8524p078K1364K2757Q944j330n022n368o675
8405A538J1333k0405R111l4659l543J0566j6875R900L3325L4593N222P326j597
8392D5835j4179j6360O382k31R669k5510l928K1511J1168k9222k7226Q828L2351
8379A9088L6307k7947m0292L491l6883J0853J9564L0461l5548K1400K1131R710
8367C1335J7963k6123n300k7708m1717J5083K7692L4939J8526j0892J3808n2260
8355d654o915M3497K1278j1650o977J4210J025k9464P76K5521O075R199l7387
8342B4534l0150m529K5480J4156O452j7333k5631k2310j0407N2452L0816K3030
8330F6560l0994n4966K5779J5881M1456R886j4865k4064j3063k3027M132L5317
$$ plain form
8418 -33323 11757 18482 23293 12470 -26054 -33132 -11768 10989 19933 18603 13581 8213 1538
8405 1538 12871 -7534 1577 -33082 -36625 -26059 -42934 -33034 291 34884 40106 47432 45835
8392 45835 31656 15296 21678 21447 31116 5606 1678 23189 34357 5135 -22091 -13263 19088
8379 19088 55395 27448 -12844 -9353 -46236 -35383 -15819 14642 -20906 494 21625 31335
8367 31335 49298 23175 17875 -9833 -51550 -36467 -8775 26164 44690 33798 47606 -4654
8355 -4654 -11569 31928 53206 41556 34579 48789 49814 20350 21126 46647 52722 61921 24534
8342 24534 -5616 -10145 15335 29491 35943 18610 -7021 -29331 -39738 12714 43530 66560
8330 66560 35566 -19400 6379 22260 63716 73602 58737 34673 21610 -1417 2715 38032
8318C8032j1917k7247j8932k0858P490M8787k4305l1355L2272J2579J1094R463
8306B5103m1646k2668J3532K1915p097J8445l3461O831r405J3651l393O3913R773
8293E5493k9280M6475P550n5774k1408K8096j5587j0380R599K0993j4477k9789
8281h489L563K1069Q749k8630K6674R860l5836p2966M78K9174p555L4174J1495
8268h240j6298J0404O199j5267n1527O229L156K473K901r666L6026j5759K6799
8255b2570N316J3699p171k9867K4501K9126J1534p254l7131m8240j1674L4408
8243d5323L8601J5146L5519N3591M817j7805J1447k1628k1398Q799m0249o0049
8231c8532l8196J5752K9827J4160l4249O79L5201N1537L0844k7471J206k4865
$$ plain form
8318 38032 26115 -1132 -20064 -40922 -33432 15355 -8950 -40305 -8033 4546 15640 25103
8306 25103 -16543 -39211 -25679 -3764 -10861 7584 -25877 -19046 -28451 -14800 -18193 45720 55493
8293 55493 26213 72688 80238 24464 3056 31152 15565 5185 14784 35777 21300 -8489
8281 -8489 -4926 16143 24892 -3738 22936 32796 -3040 -76006 -75528 -46354 -53909 -19735 -8240
8268 -8240 -24538 -14134 -7935 -23202 -74729 -68500 -65344 -62871 -59970 -69636 -33610 -49369 -22570
8255 -22570 -17254 -3555 -10726 -40593 -16092 13034 24568 17314 -19817 -68057 -79731 -45323
8243 -45323 -6722 8424 43943 97534 102351 84546 95993 74365 52967 61766 21517 -38532
8231 -38532 -76728 -60976 -31149 -16989 -51238 -50559 -15358 36179 67023 39552 40758 15893
8219A5893K7318l71K3729l9836o8602J560L1694K6492K8962p431p014J7335K751
8206E2480k3424J5736j9208j0141L2643L1896j2386o3024L6059P00j2676L306
8194C1961O357Q564j5925m2843k8287J0261R331L2414K4752J5223j9702k8184
8182C922l3849K2271K6670j0089Q234J1107p430k4815l5421J0519K9501j4331
8170a3711r019j9626j0569m711N7154M207K9909M4427k0936k9255R92k6335O760
8157I287q971j9301k755K9648q82o018J8543Q693Q898l3987J290l4580j0419J5526
8143b5028j6771l9319M5209J0796J1738L8542j801o863M2553Q284l7835o2573
8131c3068n190J9520k0245L7185L4238K0537J1258m5468l360j5721M320n0317
$$ plain form
8219 15893 43211 42840 66569 26733 -41869 -40309 -8615 17877 46839 39408 32394 49729 52480
8206 52480 29056 44792 25584 15443 48086 79982 67596 4572 40631 41331 28655 31961
8194 31961 38318 46882 30957 -11886 -40173 -29912 -20581 11833 36585 51808 32106 3922
8182 3922 -29927 -7656 19014 8925 17159 28266 20836 -3979 -39400 -28881 620 -13711
8170 -13711 -22730 -42356 -52925 -57636 -482 3725 33634 78061 57125 27870 28862 2527 9287
8157 9287 316 -18985 -21740 7908 7026 1008 19551 28244 37142 3155 4445 -30135 -40554 -25028
8143 -25028 -41799 -81118 -35909 -25113 -13375 25167 23366 16503 59056 67340 29505 -33068
8131 -33068 -38258 -18738 -38983 -1798 32440 52977 64235 18767 15407 -314 4006 -46311
8119d6311K6025M8903j1185m6040K0966L2484N0244J0617r486j5334n5014l527
8107B342K6699K2052j2925M876m272K47l9205j4540j9311r466M807l691O4625
8094B2238N779J1333M1442l8802m4248k0060K1341n441J5755M069K3565k7093
8082I878J9706L6972k5451k9240J8069K039m1819n550L5217J6910n4796k9106
8070d7171j2876N3091L5455j6491l8522l6363J3207N6825K22o776q738m3646J9453
8057c2330L0656k9643n1209k6560p356L5644L1595R140p268k5085J8540L9391
8045a4485N1581l3442k5126J687J7230r539L619J0629j3998k1517M6397j450j5872
8032d286j9546K9660M183J9704j6784m2548r027j8753j0171j7584K3581J096J9400
$$ plain form
8119 -46311 -20286 28617 17432 -28608 -7642 24842 75086 85703 76217 60883 5869 2342
8107 2342 29041 51093 38168 43044 38772 39019 -186 -14726 -34037 -43503 -38696 -42387 22238
8094 22238 28017 39350 80792 41990 -2258 -22318 -977 -6418 9337 13406 36971 9878
8082 9878 29584 66556 41105 11865 29934 31973 -9846 -15396 19821 36731 -18065 -47171
8070 -47171 -60047 -6956 28499 12008 -26514 -62877 -49670 7155 7377 601 -8137 -51783 -32330
8057 -32330 -1674 -31317 -82526 -109086 -116442 -80798 -49203 -40063 -47331 -72416 -53876 -14485
8045 -14485 37096 3654 -21472 -19785 -2555 -12094 -8475 2154 -11844 -33361 13036 11586 -4286
8032 -4286 -23832 5828 10011 29715 12931 -29617 -38644 -57397 -67568 -85152 -61571 -60475 -41075
8019d1075N231L1720K3309J9329j429L1258m5662j8384L4059J5399m0686k878
8007A0191J0367j9460J4559M3466N1011k3620j5512R000n0460l7168k9308k2856
7995e9790L9866J226K235K4442J2344L669J9025L0059j7729O1n158l8733J0767
7982B2284J4317m414l0032o959j6572j7764J0188K2164K181k9096j7671M0514
7970a0860P582m6073K720N4194O392k0570l9494J7733J0431K5857J7134j3172
7958A1874l9218J2469J7186L8575j5192l6384j514j7843p329L4230M2154K1151
7946F0159o2848J2171Q446l1468k5965P148K6886J1745j6764K0383O220L1572
7934D7685k0311l6312K6332M9973j8583l4210l1568j9422J5936N5595K2054M756
$$ plain form
8019 -41075 -35844 -4124 19185 38514 37085 68343 22681 4297 38356 53755 13069 10191
8007 10191 20558 1098 15657 59123 110134 86514 71002 80002 29542 -7626 -36934 -59790
7995 -59790 -19924 -18698 -16463 7979 20323 23992 43017 73076 55347 55408 50250 11517 22284
7982 22284 36601 32187 2155 -4804 -21376 -39140 -28952 -6788 -4607 -33703 -51374 -10860
7970 -10860 -3278 -49351 -46631 7563 13955 -6615 -46109 -28376 -17945 7912 25046 11874
7958 11874 -27344 -14875 2311 40886 25694 -10690 -12204 -30047 -37376 -3146 39008 60159
7946 60159 -2689 9482 17928 -13540 -39505 -32357 -5471 6274 -10490 9893 16113 47685
7934 47685 27374 -8938 17394 67367 48784 14574 -16994 -36416 -20480 35115 57169 61925
7922F1925k3872r412M2209k281k0537k031k4335N983L36m092N176J2090l776J540
7908C8923m7309q729N5857O170R020k0719k3980P942l143R771j5275k6084j5644
7895c3200L895R290k7559K8551j3256k697L2472j1609J1392k5782P706K3526k2060
7882a9331J3583N93k5424p80J4451O754N716l282j5483K452O326J2284j0833M896
7868h078J6328K818j2330J9128J2479n725p588K0277O592m292K5694o349k909
7855E6045L360k0608o6682m4702K5117L2368L7897L8027N199o190m8272n0423
7843c8864M1576J2551K0615L2422P587J0065m4575l7696n80O3682J8766k1280
7831F4269p1370m3935L7915K6388j4707j3657L7566k2697j6344o677l304k8542
$$ plain form
7922 61925 38053 28641 70850 68569 48032 46001 21666 27649 27985 23893 29069 41159 37383 38923
7908 38923 -8386 -17115 38742 44912 53932 33213 9233 17175 14032 23803 8528 -17556 -33200
7895 -33200 -29305 -20015 -47574 -19023 -32279 -34976 -2504 -14113 -2721 -28503 -20797 2729 -19331
7882 -19331 -5748 -5155 -30579 -31359 -16908 -10154 -4438 -7720 -23203 -20751 -14425 -2141 -12974 -8078
7868 -8078 8250 11068 -1262 17866 30345 24620 17032 37309 43901 39609 65303 58954 56045
7855 56045 59405 38797 -27885 -72587 -47470 -15102 22795 60822 66021 59831 11559 -38864
7843 -38864 2712 15263 35878 68300 75887 85952 41377 3681 3101 66783 85549 64269
7831 64269 -7101 -51036 -13121 13267 -1440 -15097 22469 -228 -16572 -23249 -26553 -55095
7819e5095k6044J9477N7282j4159K268J5856J6783K886L230K3536k9643n419J9270
7806C0228J350l0817j4396L3907K419j2717k7215r964o615N3137J2744M877j4961
7793B1977n5467k0046j3666N550r359j7459J9031M3486J7634J1598l744k579L575
7780E31K9402J6389K7355q25l7006k6272m2865K1139O4981j4902j8538m3556n370
7767b9537k805K432J0762L9490J704l0712r64J4799l9201j8558N9046l058j1440
7754h042J7585L9895l9048j4560J6109l4016j4088L1433r456j1771n047R604K0942
7741d60j4631Q147j9281J1595Q619k4485k0447K191N383r474J2876K8779L0909
7728A9721M582N419q333j5658l0051k998L4957J7726r37k0382K3065p235j3096
$$ plain form
7819 -55095 -81139 -61662 -4380 -18539 -16271 -415 16368 19254 22484 46020 16377 10958 30228
7806 30228 31578 761 -13635 20272 22691 9974 -17241 -27205 -33820 19317 32061 36938 21977
7793 21977 -33490 -53536 -67202 -61652 -71011 -88470 -69439 -25953 -8319 3279 -465 -3044 531
7780 531 29933 46322 73677 72852 35846 9574 -33291 -12152 52829 37927 19389 -24167 -29537
7767 -29537 -32342 -29910 -19148 20342 22046 -8666 -9630 5169 -34032 -52590 6456 3398 -8042
7754 -8042 9543 49438 10390 -4170 11939 -22077 -36165 -4732 -14188 -25959 -31006 -21402 -460
7741 -460 -15091 -6944 -26225 -14630 -6011 -30496 -50943 -48752 -43369 -52843 -39967 -11188 19721
7728 19721 24303 29722 21389 5731 -24320 -27318 7639 25365 24428 4046 27111 19876 6780
7715F780l742K8834K7912n2528j6850M3661k679J3380p090l2425k737J1149k1260
7702g595M9482Q885n5292Q20J885o8107J2630K8074L8341R357j8919j6498M269
7689a2668l189K7954m3164j9359m6466o95M3646L5196l2243P864P426L438k6758
$$ plain form
7715 6780 3038 31872 59784 7256 -9594 34067 31388 44768 37678 5253 2516 13665 -7595
7702 -7595 41887 50772 -4520 -3700 -1815 -69922 -57292 -29218 9123 18480 -439 -16937 -12668
7689 -12668 -15857 12097 -31067 -50426 -96892 -97587 -53941 -18745 -50988 -43124 -35698 -32260 -59018
$$ [...]
##END NTUPLES=NMR SPECTRUM
##END=
