##TITLE=Analysis number 317946
Compound Code cc 18713
Project Code adrs
Chemist Name melford
##JCAMPDX= 6.0         $$ Bruker NMR JCAMP-DX V2.0
##DATA TYPE= NMR SPECTRUM
##DATA CLASS= NTUPLES
##ORIGIN= Bruker BioSpin GmbH
##OWNER= nmr
$$ XWIN-NMR		Version 3.5
$$ Wed Mar  8 14:57:34 2006 GMT Standard Time (UT+0h)  MAYBRIDGE\nmr@NMR_250MHZ
##.OBSERVE FREQUENCY= 250.131544655141
##.OBSERVE NUCLEUS= ^1H
##.ACQUISITION MODE= SIMULTANEOUS (DQD)
##.ACQUISITION SCHEME= undefined
##.AVERAGES= 16
##.DIGITISER RES= 18
##SPECTROMETER/DATA SYSTEM= dpx250
##.PULSE SEQUENCE= zg30
##.SOLVENT NAME= CDCl3
##.SHIFT REFERENCE= (INTERNAL, CDCl3, 0, 16.522)
##AUDIT TRAIL= $$ (NUMBER, WHEN, WHO, WHERE, WHAT)
$$ ##TITLE= Audit trail, XWIN-NMR		Version 3.5
$$ ##JCAMPDX= 5.01
$$ ##ORIGIN= Bruker BioSpin GmbH
$$ ##OWNER= nmr
$$ C:\u/data/dgb/nmr/ADRS/310/pdata/1/auditp.txt
$$ ##AUDIT TRAIL=  $$ (NUMBER, WHEN, WHO, WHERE, WHAT)
(   1,<2006-03-08 14:57:14.21 +000>,<MAYBRIDGE\nmr>,<NMR_250MHZ>,
      <created by zg, POWCHK disabled, PULCHK disabled
       configuration hash MD5:
       84 BC 41 DB A1 6E 1D 46 DA 25 12 A5 C1 ED C5 3A
       data hash MD5: 64K
       4D 94 48 7C 0A 59 DF 33 68 25 F6 E5 F6 BE EC 65>)
(   2,<2006-03-08 14:57:25.74 +000>,<MAYBRIDGE\nmr>,<NMR_250MHZ>,
      <Start of raw data processing
       ef LB = 0.3 FT_mod = 6 PKNL = 1 SI = 32K 
       data hash MD5: 32K
       B9 E5 C0 A7 02 12 A2 7F 65 F7 A5 37 5E BD 5D 34>)
(   3,<2006-03-08 14:57:27.54 +000>,<MAYBRIDGE\nmr>,<NMR_250MHZ>,
      <apk 
       data hash MD5: 32K
       09 0A 72 06 49 3A F3 AA 41 CA 41 CF 62 32 30 C4>)
(   4,<2006-03-08 14:57:28.38 +000>,<MAYBRIDGE\nmr>,<NMR_250MHZ>,
      <abs ABSG = 5 
       data hash MD5: 32K
       87 52 D6 0B E0 E6 A0 DA A3 47 4E 4D AC FB B2 3F>)
$$ ##END=
$$ 
$$ hash MD5
$$ 45 0D 48 08 52 C9 B3 6D BB F4 8D 53 7C 42 2A 17
##$RELAX= 
##$RELAX= 
##$RELAX= 
##$RELAX= 
##$RELAX= 
##$RELAX= 
##$RELAX= 
$$ Bruker specific parameters
$$ --------------------------
##$DU= <C:\u>
##$EXPNO= 310
##$NAME= <ADRS>
##$PROCNO= 1
##$TYPE= <nmr>
##$USER= <dgb>
##$AMP= (0..31)
100 100 100 100 100 100 100 100 100 100 100 100 100 100 100 100 100 100 
100 100 100 100 100 100 100 100 100 100 100 100 100 100 
##$AQSEQ= 0
##$AQ_mod= 3
##$AUNM= <au_zg>
##$AUTOPOS= <44 >
##$BF1= 250.13
##$BF2= 250.13
##$BF3= 250.13
##$BF4= 250.13
##$BF5= 500.13
##$BF6= 500.13
##$BF7= 500.13
##$BF8= 500.13
##$BYTORDA= 1
##$CFDGTYP= 0
##$CFRGTYP= 5
##$CHEMSTR= <none>
##$CNST= (0..31)
1 1 145 1 1 1 1 1 1 1 1 1 1 1 1 1 1 1 1 1 1 1 1 1 1 1 1 1 1 1 1 1 
##$CPDPRG= <>
##$CPDPRG1= <>
##$CPDPRG2= <>
##$CPDPRG3= <>
##$CPDPRG4= <mlev>
##$CPDPRG5= <mlev>
##$CPDPRG6= <mlev>
##$CPDPRG7= <mlev>
##$CPDPRG8= <mlev>
##$CPDPRGB= <>
##$CPDPRGT= <>
##$D= (0..31)
0 1 0 0 0 0 0 0 0 0.06 0 0 0 0 0 0 0.0002 0 0 0 0 0 0 0 0 0 0 0 0 0 0 
0 
##$DATE= 1141829833
##$DBL= (0..7)
120 120 120 120 120 120 120 120 
##$DBP= (0..7)
150 150 150 150 150 150 150 150 
##$DBP07= 0
##$DBPNAM0= <>
##$DBPNAM1= <>
##$DBPNAM2= <>
$$ [...]
##$SUBNAM7= <"">
##$SUBNAM8= <"">
##$SUBNAM9= <"">
##$SW= 20.6930455092707
##$SWIBOX= (0..15)
0 0 3 0 0 0 0 0 0 0 0 0 0 0 0 0 
##$SW_h= 5175.983436853
##$TD= 65536
##$TD0= 1
##$TE= 294.16
##$TE2= 300
##$TE3= 300
##$TEG= 300
##$TL= (0..7)
0 120 120 120 120 120 120 120 
##$TP= (0..7)
150 150 150 150 150 150 150 150 
##$TP07= 0
##$TPNAME0= <>
##$TPNAME1= <>
##$TPNAME2= <>
##$TPNAME3= <>
##$TPNAME4= <>
##$TPNAME5= <>
##$TPNAME6= <>
##$TPNAME7= <>
##$TPOAL= (0..7)
0.5 0.5 0.5 0.5 0.5 0.5 0.5 0.5 
##$TPOFFS= (0..7)
0 0 0 0 0 0 0 0 
##$TUNHIN= 0
##$TUNHOUT= 0
##$TUNXOUT= 0
##$USERA1= <user>
##$USERA2= <user>
##$USERA3= <user>
##$USERA4= <user>
##$USERA5= <user>
##$V9= 5
##$VALIST= <valist>
##$VCLIST= <CCCCCCCCCCCCCCC>
##$VD= 0
##$VDLIST= <DDDDDDDDDDDDDDD>
##$VPLIST= <PPPPPPPPPPPPPPP>
##$VTLIST= <TTTTTTTTTTTTTTT>
##$WBST= 1024
##$WBSW= 4
##$XGAIN= (0..3)
0 0 0 0 
##$XL= 0
##$YL= 0
##$YMAX_a= 553774
##$YMIN_a= -805812
##$ZGOPTNS= <>
##$ZL1= 120
##$ZL2= 120
##$ZL3= 120
##$ZL4= 120
##$ABSF1= 16.522
##$ABSF2= -4.171173
##$ABSG= 5
##$ABSL= 3
##$ALPHA= 0
##$AQORDER= 0
##$ASSFAC= 0
##$ASSFACI= 0
##$ASSFACX= 0
##$ASSWID= 0
##$AUNMP= <proc_1d>
##$AZFE= 0.1
##$AZFW= 0.1
##$BCFW= 0
##$BC_mod= 0
##$BYTORDP= 0
##$COROFFS= 0
##$CY= 12.5
##$DATMOD= 1
##$DC= 0
##$DFILT= <>
##$DTYPP= 0
##$F1P= 14.0000005364418
##$F2P= -0.99999901652339
##$FCOR= 0.5
##$FTSIZE= 32768
##$FT_mod= 6
##$GAMMA= 0
##$GB= 0
##$INTBC= 1
##$INTSCL= 1
##$ISEN= 128
##$LB= 0.3
##$LEV0= 0
##$LPBIN= 0
##$MAXI= 10000
##$MC2= 0
##$MEAN= 0
##$ME_mod= 0
##$MI= 0
##$NCOEF= 0
##$NC_proc= -3
##$NLEV= 6
##$NOISF1= 0
##$NOISF2= 0
##$NSP= 0
##$NTH_PI= 0
##$NZP= 0
##$OFFSET= 16.522
##$PC= 1
##$PHC0= 169.2486
##$PHC1= 4.158485
##$PH_mod= 1
##$PKNL= yes
##$PPARMOD= 0
##$PSCAL= 4
##$PSIGN= 0
##$REVERSE= no
##$SF= 250.13
##$SI= 32768
##$SIGF1= 0
##$SIGF2= 0
##$SINO= 400
##$SIOLD= 32768
##$SREGLST= <1H.CDCl3>
##$SSB= 0
##$STSI= 32768
##$STSR= 0
##$SW_p= 5175.98343685301
##$SYMM= 0
##$S_DEV= 0
##$TDeff= 65536
##$TDoff= 0
##$TI= <Analysis number 999999
Compound Code 99
Book Reference 9
Project Code 9>
##$TILT= no
##$TM1= 0
##$TM2= 0
##$TOPLEV= 0
##$USERP1= <user>
##$USERP2= <user>
##$USERP3= <user>
##$USERP4= <user>
##$USERP5= <user>
##$WDW= 1
##$XDIM= 32768
##$YMAX_p= 448019673
##$YMIN_p= -51489
$$ End of Bruker specific parameters
$$ ---------------------------------
##NTUPLES= NMR SPECTRUM
##VAR_NAME=  FREQUENCY,     SPECTRUM/REAL,   SPECTRUM/IMAG
##SYMBOL=    X,             R,               I
##VAR_TYPE=  INDEPENDENT,   DEPENDENT,       DEPENDENT
##VAR_FORM=  AFFN,          ASDF,            ASDF
##VAR_DIM=   32768,         32768,           32768
##UNITS=     HZ,            ARBITRARY UNITS, ARBITRARY UNITS
##FACTOR=    0.157963299565203, 1,           1
##FIRST=     4132.6476996994, 0,             0
##LAST=      -1043.33573715361, 0,           0
##MIN=       -1043.33573715361, -51489,      0
##MAX=       4132.6476996994, 448019673,     0
$$ Real data points
##PAGE= N=1
##DATA TABLE= (X++(R..R)), XYDATA
$$ [...]
$$ plain form
16284 -2820 -5889 -16208 -4422 13019 16595 7536 -2564 -16740 -11419 7970 5558 1139 7123
16271 7123 8313 5297 -6287 -19899 -26893 -18115 -12546 -15621 -9089 -3877 7010 14504 28398 28214
16257 28214 2929 -7363 -6239 -6205 -12443 -21347 -22257 -17081 -2258 5863 6770 18028 23748 10621
16243 10621 -2599 -10457 -21749 -22543 -17227 -18308 -22369 -20688 -17073 -21641 -18374 -5370 11254 14604
16229 14604 20300 12176 9813 15829 13554 -3675 -31382 -37388 -18833 -12511 -21442 -39161 -37243
16216 -37243 -9488 13304 4841 11576 11331 901 -2458 1937 1082 -4478 -16120 -5917 2670 -3016
16202 -3016 -2888 -5342 2062 -9279 -12390 -10692 -14182 -7666 -1906 -5483 -6290 -15695 -26770 -22099 -7206
16187 -7206 3274 2810 9498 12114 -918 2227 3058 2919 8057 7766 -1790 -8895 -17986 -8629 -11249
$$ packed form
16284b820l069j0319J1786J7441L576r059j0100j4176N321J9389k412m419N984
16271G123J190l016j1584j3612o994Q778N569l075O532N212J0887P494J3894j84
16257B8214k5285j0292J124L4o238q904r10N176J4823Q121R07J1258N720j3127
16243A0621j3220p858j1292p94N316j081m061J681L615m568L267J3004J6624L350
16229A4604N696q124k363O016k275j7229k7707o006J8555O322q931j7719J918
16216c7243K7755K2792q463O735k45j0430l359M395q55n560j1642J0203Q587n686
16202c016J28k454P404j1341l111J698l490O516N760l577q07r405j1075M671J4893
16187g206J0480m64O688K616j3032L145Q31j39N138k91r556p105r091R357k620
$$ plain form
16172 -11249 -12793 -15662 -26691 -25139 -4335 5240 17260 15755 -675 -15505 -18578 -26641 -30587
16159 -30587 -34101 -36705 -33214 -28001 -12133 216 -592 -9748 -12227 -2517 -15203 -24709 -17744 -2297
16145 -2297 1581 7675 496 1795 9990 5999 15365 21048 22522 8377 5399 10261 3095 -3499
16131 -3499 -1556 -2229 730 -1928 -10080 -6724 -2189 100 985 -16062 -20570 -12200 -6172 -9863 -1399
16116 -1399 8141 11858 20051 10423 9541 16828 14029 2019 -4381 3915 2777 -5905 -9528 -3079 -2930
16101 -2930 -7273 -22677 -25899 -21586 -16258 -1961 533 6661 25317 27771 21575 9884 -9846
16088 -9846 -23428 -18442 -5857 -10984 -3448 -4391 -7917 9774 15289 11174 20242 13452 -3442 -15569
16074 -15569 -12303 -14413 -18675 -9237 -8826 -2417 -4330 -16725 -7558 -5529 1386 97 5340 12336
$$ packed form
16172a1249j544k869j1029J552K0804R575J2020j505j6430j4830l073q063l946
16159c0587l514k604L491N213J5868J2349q08r156k479R710j2686r506O965J5447
16145b297L878O094p179J299Q195l991R366N683J474j4145k978M862p166o594
16131c499J943o73K959k658q152L356M535K289Q85j7047m508Q370O028l691Q464
16116a399R540L717Q193r628q82P287k799j2010o400Q296j138q682l623O449J49
16101b930m343j5404l222M313N328J4297K494O128J8656K454o196j1691j9730
16088i846j3582M986J2585n127P536r43l526J7691N515m115R068o790j6894j2127
16074a5569L266k110m262R438M11O409j913j2395R167K029O915j289N243O996
$$ plain form
16060 12336 -399 -21813 -23545 -16500 -27688 -16161 -1199 -779 -1466 -17605 -11162 -1713 11909
16047 11909 9930 2739 -12879 -12860 11489 12245 5881 10769 19146 13848 4136 -16581 -28963 -18908
16033 -18908 -13172 -4700 -23900 -35389 -26437 -11164 -16908 -15397 -3145 7997 5087 -5260 -8362
16020 -8362 -18635 -24792 -12473 -27689 -35872 -32300 -19084 -15809 -23791 -18496 -16390 -15575 -19325 -19741
16006 -19741 -12841 -2330 -12150 -10541 -3896 -5706 -2381 6936 -3721 -11054 -8245 8999 15584 2256
15992 2256 -3411 -4844 505 1859 -11043 -12249 -7515 4359 6846 -4398 -16942 -42021 -35852
15979 -35852 -18312 1202 27572 13460 3530 2121 10022 -2812 -14071 -16790 -6855 -390 10669
15966 10669 13149 9904 5225 -8866 -4543 -3371 225 14963 28992 40503 36647 17490 -2637
$$ packed form
16060A2336j2735k1414j732P045j1188J1527J4962M20o87j6139O443R449J3622
16047A1909j979p191j5618J9K4349P56o364M888Q377n298r712k0717j2382J0055
16033a8908N736Q472j9200j1489Q952J5273n744J511J2252J1142k910j0347l102
16020h362j0273o157J2319j5216q183L572J3216L275p982N295K106Q15l750m16
16006a9741O900J0511r820J609O645j810L325R317j0657p333K809J7244O585j3328
15992B256n667j433N349J354j2902j206M734J1874K487j1244j2544k5079O169
15979c5852J7540J9514K6370j4112r930j409P901j2834j1259k719R935O465J1059
15966A0669K480l245m679j4091M323J172L596J4738J4029J1511l856j9157k0127
$$ plain form
15953 -2637 -13499 -9818 -15874 -22167 -22404 -8229 -325 -7177 -12327 -12904 -5919 -3173 -9533 -27799
15939 -27799 -44913 -44231 -36436 -29272 -19042 -13734 -17862 -7232 6369 6588 7696 4930 2963 -4850
15925 -4850 -249 -6048 -13988 -3542 -487 -6305 -10955 -11713 -15186 -10942 -15822 -11692 130 -5373
15911 -5373 -766 6334 -78 4645 -921 -921 -8801 2951 24110 12404 -3714 -10008 -8737 -6538
15897 -6538 -5908 -2481 2633 7142 2297 -8815 0 6127 -5398 -20811 -28819 -12049 2867 4389
15883 4389 3302 15832 9905 1107 4684 838 -2034 -5623 -6566 -15541 -22399 -18033 -11513 -19249 -12835
15868 -12835 -14713 -1125 2900 -2904 -2264 -2058 -17235 -13710 2144 -312 -4385 -9921 -8008 -6548
15854 -6548 -11776 -10363 -4041 110 -9521 -9182 -4013 4220 10546 10265 6675 18278 9555 -2228 -15529
$$ packed form
15953b637j0862L681o056o293k37J4175P904o852n150n77O985K746o360j8266
15939b7799j7114O82P795P164J0230N308m128J0630J3601K19J108k766j967p813
15925d850M601n799p940J0446L055n818m650p58l473M244m880M130J1822n503
15911e373M607P100o412M723n566%p880J1752K1159j1706j6118o294J271K199
15897f538O30L427N114M509m845j1112Q815O127j1525j5413q008J6770J4916J522
15883D389j087J2530n927q798L577l846k872l589r43q975o858M366O520p736O414
15868a2835j878J3588M025n804O40K06j5177L525J5854k456m073n536J913J460
15854f548n228J413O322M151r631L39N169Q233O326k81l590J1603q723j1783j3301
$$ plain form
15839 -15529 -27845 -36223 -31377 -26436 -38111 -48822 -38717 -33947 -21102 -25501 -24876 -25435 -16763 -7475
15825 -7475 -2942 -15 3196 10628 -5585 -9020 -16749 -17065 -4593 -11888 -10613 -1898 -11538 -15275
15811 -15275 -7933 2562 7152 13855 5836 -3545 -5021 -6828 -18511 -17821 -8576 -8599 -13819 -5161 -4137
15796 -4137 -1977 3831 1679 -7531 -11356 -9476 -9676 -20897 -25315 -18824 -16800 -518 9018 12710
15782 12710 11860 5756 -2951 -12580 -6833 -6003 2640 15680 18215 17912 18610 12799 14814 10794 4412
15767 4412 2890 3842 443 6937 -2132 -7424 10179 7488 11195 6646 11138 17444 16827 2821 -10244
15752 -10244 -5493 4942 12010 20303 7408 6236 2669 3026 44 -4820 -7085 -14280 -2328 17241
15738 17241 14131 5774 -3244 -6614 7459 11494 17750 24472 14171 20040 18121 8142 16291 16616
$$ packed form
15839a5529j2316q378M846M941j1675j0711J0105M770J2845m399O25n59Q672R288
15825g475M533K927L211P432j6213l435p729l16J2472p295J275Q715r640l737
15811a5275P342J0495M590O703q019r381j476j807j1683O90R245k3n220Q658J024
15796d137K160N808k152r210l825J880k00j1221m418O491K024J6282R536L692
15782A2710q50o104q707r629N747Q30Q643J3040K535l03O98n811K015m020o382
15767D412j522R52l399O494r069n292J7603k691L707m549M492O306o17j4006j3065
15752a0244M751J0435P068Q293j2895j172l567L57k982m864k265p195J1952J9569
15738A7241l110q357r018l370J4073M035O256O722j0301N869j919r979Q149L25
$$ plain form
15724 16616 19037 2618 -1703 -5967 -4473 -767 1422 -2846 -9059 -3393 -3961 -8360 -7370 -13664 -7260
15709 -7260 4030 7669 1864 397 -693 -3578 -14330 -25769 -39371 -42557 -36413 -24614 -11357
15696 -11357 502 -12671 -12864 -4893 -9985 -24827 -23754 -15968 -5652 491 -5770 -12497 -16492 -11386
15682 -11386 -19906 -27918 -36686 -33081 -25945 -24680 -31654 -20656 -24792 -24672 -23719 -21582 -21458 -20143 -19035
15667 -19035 -16683 -6809 -11864 -17728 -17719 -19895 -28681 -23382 -7890 7061 9673 6045 5559 -7562 -15639
15652 -15639 -28777 -28388 -11798 -11707 -30165 -31056 -29968 -16013 -22182 -26783 -35969 -47602 -36225 -12127
15638 -12127 3179 -5427 -1429 -6406 -23831 -13969 -6442 -16583 -31769 -21318 5239 15915 4819
15625 4819 -4480 -18775 -15320 -2457 -2764 -8680 -4106 -195 1731 -1110 9298 16556 3666 6522
$$ packed form
15724A6616K421j6419m321m264J494L706K189m268o213N666n68m399R90o294O404
15709g260J1290L639n805j467j090k885j0752j1439j3602l186O144J1799J3257
15696a1357J1859j3173j93P971n092j4842J073P786J0316O143o261o727l995N106
15682a1386q520q012q768L605P136J265o974J0998m136J20R53K137J24J315J108
15667a9035K352R874n055n864Rk176q786N299J5492J4951K612l628m86j3121q077
15652a5639j3138L89J6590R1j8458q91J088J3955o169m601r186j1633J1377K4098
15638a2127J5306q606L998m977j7425R862P527j0141j5186J0451K6557J0676j1096
15625D819r299j4295L455J2863l07n916M574L911J926k841J0408P258j2890K856
$$ plain form
15611 6522 453 -8898 -12585 -11246 -8516 -13906 -12067 -12504 -12736 9417 17403 13974 -4838 -15698
15597 -15698 -18432 -6259 -9054 -33368 -30937 -31055 -31306 -24855 -15313 -11074 -12806 -7469 2442 19959
15583 19959 21413 11526 9903 23028 3434 -8451 -681 -5406 6205 4885 -3870 8327 8951
15570 8951 6825 5990 -1619 -609 14420 3984 -11435 -19321 -10927 -15554 -21638 -20255 -37521 -35888
15556 -35888 -31657 -32419 -32448 -24921 -13192 -832 -1672 11725 14987 -7568 -27552 -22759 -24838 -37036
15542 -37036 -32002 -20599 -12472 -13627 -8115 7600 -2065 -2735 -11873 -15167 -14718 -1750 -2730 -4868
15528 -4868 -5007 710 3806 -14289 -24165 -8389 1857 9991 20568 16192 7988 5406 18643 23347
15514 23347 13124 -4505 -16917 -23100 -12026 11523 25967 18612 1659 4636 3877 -1926 9921
$$ packed form
15611F522o069r351l687J339K730n390J839m37k32K2153P986l429j8812j0860
15597a5698k734J2173k795k4314K431j18k51O451R542M239j732N337R911J7517
15583A9959J454r887j623J3125j9594j1885P770m725J1611j320q755J2197O24
15570H951k126q35p609J010J5029j0436j5419p886Q394m627o084J383j7266J633
15556c5888M231p62k9P527J1729J2360q40J3397L262k2555j9984M793k079j2198
15542c7036N034J1403Q127j155N512J5715r665o70r138l294M49J2968r80k138
15528d868j39N717L096j8095r876J5776J0246Q134J0577m376q204k582J3237M704
15514B3347j0223j7629j2412o183J1074K3549J4444p355j6953K977p59n803J1847
$$ plain form
15501 9921 1187 -21022 -22493 -7148 11791 21762 1294 -19583 -15607 -10018 -14772 -19167 -8791
15488 -8791 -417 -1888 -14990 -25862 -30875 -36647 -36478 -44387 -28742 -20394 -7701 -5378 4033 17999
15474 17999 18811 11711 17242 25559 19161 1850 -14098 -11551 -579 6641 -613 615 7118 4293
15460 4293 182 -4503 3081 -2127 -20497 -28691 -17651 -9344 -6380 -5041 -5260 -2780 2748 -7158
15446 -7158 -7354 -3127 -9523 -14983 -7156 -2721 1952 -18031 -26315 -23598 -16757 -10636 -3599 -1808 8738
15431 8738 8007 -7065 -12785 -993 5197 3234 18168 5734 -2012 -10674 -15453 -12414 -5469 3598
15417 3598 -7542 -10028 -13574 -815 1702 -4448 -7625 4872 8693 463 -3950 -16776 -22018 -21329
15403 -21329 -12128 -4339 -6539 7289 15560 17451 7895 -1011 -3007 -7707 10874 17436 14610 18774
$$ packed form
15501I921q734k2209j471J5345J8939R971k0468k0877L976N589m754m395J0376
15488h791Q374j471j3102j0872n013n772J69p909J5645Q348J2693K323R411J3966
15474A7999Q12p100N531Q317o398j7311j5948K547J0972P220p254J228O503k825
15460D293m111m685P584n208j8370q194J1040Q307K964J339k19K480N528r906
15446g158j96M227o396n460P827M435M673j9983q284K717O841O121P037J791J0546
15431H738p31j5072n720J1792O190j963J4934j2434p746q662m779L039O945R067
15417C598j1140k486l546J2759K517o150l177J2497L821q230m413j2826n242O89
15403b1329R201P789k200J3828Q271J891r556q906j996m700J8581O562k826M164
$$ plain form
15389 18774 7924 2874 9521 20018 4562 -1818 9368 -4738 -6493 -4410 -4815 -3088 7098
15376 7098 3241 4601 -3663 -13751 -11392 -17762 -17320 -30997 -29957 -31211 -22355 -13011 -12909 -11094 -18398
15361 -18398 -27237 -23340 -16678 -11576 -691 -335 -16794 -29249 -26304 -21268 -13534 -7632 -9168 -18049
15347 -18049 -18449 -15189 -23538 -25050 -21759 -17925 -9857 -16029 -17349 -16484 -21161 -26898 -21406 -14255 -24421
15332 -24421 -18790 -13877 -12868 -15870 -20805 -17013 -12271 -12754 -15219 -20974 -26127 -13704 3886 -3109
15318 -3109 -12196 -11338 -18752 -14576 -16101 -5073 -7319 -9309 -13637 -17761 -19038 -18343 -17715 -13371 -4679
15303 -4679 -910 9421 14812 6292 6124 11144 -2027 8793 23438 14057 14235 7708 5602 11411
15289 11411 5698 -2747 -16456 -21436 -6739 -4029 -27582 -25637 -6392 6764 741 -7031 -11068
$$ packed form
15389A8774j0850n050O647J0497j5456o380J1186j4106j755K083m05J727J0186
15376G098l857J360q264j0088K359o370M42j3677J040j254Q856R344J02J815p304
15361a8398q839L897O662N102J0885L56j6459j2455K945N036P734N902j536q881
15347a8049m00L260q349j512L291L834Q068o172j320Q65m677n737N492P151j0166
15332b4421N631M913J009l002m935L792M742m83k465n755n153J2423J7590o995
15318c109r087Q58p414M176j525J1028k246j990m328m124j277O95O28M344Q692
15303d679L769J0331N391q520j68N020j3171J0820J4645r381J78o527k106N809
15289A1411n713q445j3709m980J4697K710k3553J945J9245J3156o023p772m037
$$ plain form
15276 -11068 -16360 -9258 -5717 -4577 -1898 -3030 -8084 -14775 -7497 -1920 451 -8585 -3908 -2901
15262 -2901 -8219 -19796 -6483 5747 9692 3343 -6296 -14230 -13986 -9844 -2111 17427 19327 9525
15248 9525 14272 1264 -2667 -843 7841 8590 -7105 -22760 -6502 -1005 2188 -6791 -6624 -1912
15234 -1912 5765 16375 12454 -19021 -31832 -17500 -3345 1280 -332 -3168 2333 9657 -8101
15221 -8101 -18035 -28293 -30130 -26627 -25748 -24949 -20587 -9152 -10048 -8910 -14468 -13020 -12957 -5182 -6028 -6948
15205 -6948 -6792 -4108 -11465 1962 1749 4054 3521 1191 -5300 -3843 11800 14022 6145 12206 1253
15190 1253 -10976 -8788 -1382 2369 -9566 -23286 -10723 -3106 -4511 7277 6447 -5736 -15245
15177 -15245 -13552 -1620 -1293 -1877 -4560 -15060 -29948 -36493 -28448 -16584 -22065 -40259 -36248 -29992
$$ packed form
15276a1068n292P102L541J140K679j132n054o691P278N577K371r036M677J007
15262b901n318j1577J3313J2230L945o349r639p934K44M142P733J9538J900r802
15248I525M747j3008l931J824Q684P49j5695j5655J6258N497L193q979J67M712
15234a912P677J0610l921l1475j2811J4332J4155M625j612k836N501P324j7758
15221h101r934j0258j837L503Q79P99M362J1435q96J138n558J448O3P775q46r20
15205f948J56K684p357J3427k13K305n33k330o491J457J5643K222p877O061j0953
15190A253j2229K188P406L751j1935j3720J2563P617j405J1788q30j2183r509
15177a5245J693J1932L27n84k683j0500j4888o545Q045J1864n481j8194M011O256
$$ plain form
15163 -29992 -16385 -11756 -9966 3866 1586 -3380 -10339 -6793 -2277 -11193 -12369 -19079 -15065 -7139
15149 -7139 -14427 -34323 -27756 -7195 -455 -3638 -4344 1325 1454 -2597 4688 5145 8901 14407 21949
15134 21949 11014 -6174 -12073 -7452 -2634 -6335 -13101 -10239 -10683 -16146 -6492 66 590 -332 -1947
15119 -1947 -7520 -10786 -20 1556 -8539 -943 -32 -5370 125 -144 -5646 -23629 -25197 -7780
15105 -7780 -1275 2407 9953 7249 3837 997 -3929 -5801 -6579 -619 -727 -1988 5089 1989 4864
15090 4864 9618 2518 140 7055 2462 -7079 -9193 2072 12527 4254 -2446 -11471 -24350 -24093
15076 -24093 -17871 -19631 -19035 1954 -2400 4588 8637 9923 7857 13282 7119 -4686 -12906 -5216
15062 -5216 14117 12017 10024 1205 103 -1711 -12879 -14898 -6829 -4365 -4651 -5703 -18978 -29432
$$ packed form
15163b9992J3607M629J790J3832k280m966o959L546M516q916j176o710M014P926
15149g139p288j9896O567K0561O740l183p06N669J29m051P285M57L756N506P542
15134B1949j0935j7188n899M621M818l701o766K862m44n463R654O558N24r22j615
15119a947n573l266J0766J576j0095P596R11n338N495k69n502j7983j568J7417
15105g780O505L682P546k704l412k840m926j872p78N960j08j261P077l100K875
15090D864M754p100k378O915m593r541k114J1265J0455q273o700r025j2879K57
15076b4093O222j760N96K0989m354O988M049J286k066N425o163j1805q220P690
15062e216J9333k100j993q819j102j814j1168k019Q069K464k86j052j3275j0454
$$ plain form
15048 -29432 -29057 -419 6627 18743 23773 15615 5873 1215 -8290 -10577 -5607 -8525 -3402 -5738
15034 -5738 -8213 -13499 -2301 -1953 7372 11069 -3899 -16744 -16853 -8397 -14078 -10921 -4516 8173
15020 8173 -921 -1449 -8771 -15763 -11122 -4561 -9511 -13998 -8404 6593 -3951 -9301 2176 -781
15006 -781 -2269 1353 11534 7753 16448 11323 6494 588 3793 9607 18214 12026 -530 -490 5270
14991 5270 4660 -570 -5571 -1773 -3981 980 9234 7869 377 4062 7169 10108 4520 -7519 -14850
14976 -14850 -20349 -20332 -26672 -31455 -18919 -9678 -1352 1011 7393 4717 -10008 -14108 -10728 -6607
14962 -6607 -2107 703 11666 4084 -12069 -12625 2228 -457 -11863 -14617 -11899 -18220 -13413 -15723
14948 -15723 -15279 -5930 6463 7533 7300 9740 -15076 -32789 -31935 -25472 -26651 -31168 -26330 -15058
$$ packed form
15048b9432L75K8638P046J2116N030q158r742m658r505k287M970k918N123k336
15034e738k475n286J1198L48R325L697j4968j2845j09Q456n681L157O405J2689
15020H173r094n28p322o992M641O561m950m487N594J4997j0544n350J1477k957
15006g81j488L622J0181l781Q695n125m829n906L205N814Q607o188j2556M0N760
14991E270o10n230n001L798k208M961Q254j365p492L685L107K939n588j2039p331
14976a4850n499J7o340m783J2536R241Q326K363O382k676j4725m100L380M121
14962f607M500K810J0963p582j6153n56J4853k685j1406k754K718o321M807k310
14948a5723M44R349J2393J070k33K440k4816j7713Q54O463j179m517M838J1272
$$ plain form
14934 -15058 -7878 -16877 -25033 -20510 -24888 -26300 -3600 -3484 -16655 -10027 -8022 1049 -5851 -12580
14920 -12580 -4964 -2816 -3194 2280 -14190 -22557 1973 13067 15888 2528 -7525 184 2485
14907 2485 555 -4265 -7030 -13299 -183 2400 8078 13023 3102 -5664 -1107 9797 -5534 -13457
14893 -13457 4400 11805 9434 10836 17846 9546 3338 -97 -16773 -26288 -13867 3612 -795
14880 -795 -9401 -1789 5594 2797 4204 16414 13570 5723 8416 -7545 -13837 -8614 -12108 -19412
14866 -19412 -23178 -26403 -22082 -14093 -10654 -4541 6236 1135 -13438 -13736 -11022 -6672 -5748 -3398
14852 -3398 -7038 -9662 -10870 -12325 -18666 -1141 -3304 -15938 -13331 -19653 -20620 -26295 -19151 -14383
14838 -14383 -7595 -12348 -5079 5286 6294 7132 16264 27991 14392 5605 20628 22999 25837 13268
$$ packed form
14934a5058P180q999q156M523m378j412K2700J16j3171O628K005R071o900o729
14920a2580P616K148l78N474j6470q367K4530J1094K821j3360j0053P709K301
14907B485j930m820k765o269J3116K583N678M945r921q766M557J0904j5331p923
14893a3457J7857P405k371J402P010q300o208l435j6676r515J2421J7479m407
14880g95q606P612P383k797J407J2210k844p847K693j5961o292N223l494p304
14866a9412l766l225M321P989L439O113J0777n101j4573k98K714M350R24K350
14852c398l640k624j208j455o341J7525k163j2634K607o322r67n675P144M768
14838a4383O788m753P269J0365J008Q38R132J1727j3599q787J5023K371K838j2569
$$ plain form
14824 13268 -11451 -14326 -11598 -15329 -24771 -17034 -4808 1914 -4024 -16259 -10348 -477 4735 -3181
14810 -3181 -2060 -6290 -18668 -17467 -14272 -9022 -6018 -9543 -7158 -1660 -259 3158 8978 13903
14796 13903 6513 -615 -19257 -9615 3115 -2370 -22872 -34203 -21828 -13883 -25337 -25336 -17518 -1961
14782 -1961 -8947 -22142 -15687 -21132 -13746 -15582 -18197 -18158 -23058 -25317 -31581 -27975 -34629 -31908 -28945
14767 -28945 -31487 -30047 -29091 -19605 -13788 -5504 -8653 -5566 -7793 -14477 -16247 -18999 -26818 -22871 -16546
14752 -16546 -9034 -10509 -16279 -18971 1492 13680 6321 225 189 -9922 -16085 -6886 -10315 -5989
14738 -5989 -4630 -5445 -3722 -2209 3586 4023 -1999 3475 2901 1916 -15903 -13618 -17747 -26134 -26532 -21319
14722 -21319 -7097 -3385 -14935 -36092 -38655 -30119 -25510 -7952 -9173 -21194 -34048 -25247 -11874
$$ packed form
14824A3268k4719k875K728l731r442P737J2226O722n938j2235N911R871N212p916
14810c181J121m230j2378J201L195N250L004l525K385N498J401L417N820M925
14796A3903p390p128j8642R642J2730n485k0502j1331J2375P945j1454JP818J5557
14782a961o986j3195O455n445P386j836k615L9m900k259o264L606o654K721K963
14767b8945k542J440R56R486N817Q284l149L087k227o684j770k752p819L947O325
14752a6546P512j475n770k692K0463J2188p359o096l6j0111o163R199l429M326
14738e989J359q15J723J513N795M37o022N474n74r85j7819K285m129q387l98N213
14722b1319J4222L712j1550k1157k563Q536M609J7558j221j2021j2854Q801J3373
$$ plain form
14709 -11874 -9636 -14951 -23970 -9731 -3395 1478 3799 -6608 -10178 -13518 -21184 -27301 -17314 -8307
14695 -8307 -5019 -975 9364 19044 -256 -15307 -16251 -22078 -38630 -29167 -17756 -15398 -11789 -9171
14681 -9171 3323 18926 24618 20393 17521 6528 16273 20673 4657 -4569 -14466 -15276 -4483 -6464
14667 -6464 -5786 -3733 -7186 -11576 -8391 -59 -4979 -21183 -24202 -10154 -10262 -22886 -27643 -27779 -19163
14652 -19163 -10849 -4541 -6384 -2700 -4411 -9932 -12401 2229 7027 6067 6528 3355 10990 13762 2656
14637 2656 3494 -7213 -12882 518 10323 -42 -8394 -10427 -8573 -2445 -7277 -11650 -8213 -3410
14623 -3410 -101 334 5848 1268 -10916 -13642 -11711 -8592 -11505 -3488 7075 -2174 -15876 -12584
14609 -12584 -5304 -6006 -3974 2070 3567 23754 32576 32752 23663 13560 -5456 -24560 -13887 -14963
$$ packed form
14709a1874K238n315r019J4239O336M873K321j0407l570l340p666o117R987R007
14695h307L288M044J0339R680j9300j5051r44n827j6552R463J1411K358L609K618
14681i171J2494J5603N692m225k872j0993R745M400j6016r226r897q10J0793j981
14667f464O78K053l453m390L185Q332m920j6204l019J4048j08j2624m757j36Q616
14652a9163Q314O308j843L684j711n521k469J4630M798r60M61l173P635K772j1106
14637B656Q38j0707n669J3400R805j0365q352k033J854O128m832m373L437M803
14623c410L309M35N514m580j2184k726J931L119k913Q017J0563r249j3702L292
14609a2584P280p02K032O044J497K0187Q822J76r089j0103j9016j9104J0673j076
$$ plain form
14595 -14963 -22802 -15863 -25251 -32094 -37712 -28385 -10682 1126 11075 -5494 -5457 -4713 -12199 -10706
14581 -10706 -15304 -3387 443 -1201 -6242 -9869 -28403 -32304 -42128 -45337 -23178 -12596 -15094
14568 -15094 -17057 -19293 -5135 -9671 -16133 -19066 -23022 -16964 -19722 -25834 -17751 -2871 1779 -5184
14554 -5184 -19050 -13053 1289 -3932 -13689 -15388 -8242 1012 -6443 -14258 -12210 848 4027 -3351
14540 -3351 -536 -3305 -12802 -26 5364 3020 -3812 -11025 -15898 4879 6652 17531 17249 24730
14526 24730 18629 18023 12399 17893 22547 16906 -4566 -13265 -2335 -8769 -3983 7355 -3114 -8288
14512 -8288 682 -1462 -3279 9460 14396 1137 896 11559 14014 8921 7391 -10702 -14450 -1787
14498 -1787 502 -1125 -12096 -13069 -6733 1927 -61 -4772 -14122 -23664 -23872 -19619 -15331 -9944 -8652
$$ packed form
14595a4963p839O939r388o843n618R327J7703J1808R949j6569L7P44p486J493
14581a0706m598J1917L830j644n041l627j8534l901r824l209K2159J0582k498
14568a5094j963k236J4158m536o462k933l956O058k758o112Q083J4880M650o963
14554e184j3866N997J4342n221r757j699P146R254p455p815K048J3058L179p378
14540c351K815k769r497J2776N390k344o832p213m873K0777J773J0879k82P481
14526B4730o101o06n624N494M654n641k1472q699J0930o434M786J1338j0469n174
14512h288Q970k144j817J2739M936j3259k41J0663K455n093j530j8093l748J2663
14498a787K289j627j0971r73O336Q660j988m711r350r542k08M253M288N387J292
$$ plain form
14483 -8652 336 -718 -8293 -8280 -12034 -23945 -16143 -21608 -26548 -19492 -26198 -31421 -21017 -13696 -11459
14468 -11459 -13263 -2799 -2927 -13143 -12639 -22674 -17105 -15934 -14149 -17901 -16790 -7658 -9066 -23188
14454 -23188 -29791 -35514 -36128 -19407 -1751 7606 7833 14769 3988 430 -11834 -19955 -18851 -14967
14440 -14967 196 5478 -7292 -19212 -25559 -9732 -3561 -5325 -12062 -8019 6331 8590 -1720
14427 -1720 -20062 -16267 2764 19447 19375 11222 16446 22087 28250 16003 -873 -2318 657 -1211
14413 -1211 -75 -11195 -18347 -4719 507 -4410 -1344 -3862 -15146 -31795 -25968 -16770 -5670
14400 -5670 -4201 838 11327 4876 2094 -14473 -17902 -13027 -13524 706 2343 6169 14 -5717
14386 -5717 178 2565 -3113 -15938 -7263 -2508 3866 5516 1162 -6175 -8883 2733 -5536 -18941
$$ packed form
14483h652Q988j054p575J3l754j1911P802n465m940P056o706n223J0404P321K237
14468a1459j804J0464j28j0216N04j0035N569J171J785l752J111R132j408j4122
14454b3188o603n723o14J6721J7656R357K27O936j0781l558j2264q121J104L884
14440a4967J5163N282j2770j1920o347J5827O171j764o737M043J4350K259j0310
14427a720j8342L795J9031J6683p2q153N224N641O163j2247j6876j445K975j868
14413a211J136j1120p152J3628N226m917L066k518j1284j6649N827R198J1100
14400e670J469N039J0489o451k782j6567l429M875m97J4230J637L826o155n731
14386e717N895K387n678j2825Q675M755O374J650m354p337k708J1616q269j3405
$$ plain form
14372 -18941 -15291 -16893 -14511 -9961 -14126 -27923 -11601 -4383 3166 -6706 -3903 -1442 2534 -7657
14358 -7657 -7816 -3003 138 -8598 -17955 -21844 -22281 -32560 -26078 -14868 -13510 -11321 -872 3154
14344 3154 11807 30251 24308 11640 9327 -3639 -12868 -2559 -2592 -14958 -31760 -37352 -27443 -18450
14330 -18450 -12294 -10455 -3274 6361 -1317 -3619 -20491 -16326 -5602 -10265 -7276 -988 10613 16584
14316 16584 2103 576 5283 7271 -1249 -13773 -19057 -17097 -19558 -22826 -26234 -23151 -20263 -19064
14302 -19064 -8610 -12722 -30602 -26057 -16167 -10289 -3592 -4135 -5124 -11231 -13639 -25107 -29306 -39097
14288 -39097 -45130 -26246 -12602 -13421 -16736 -9778 14410 15563 -4670 -3562 6632 12268 6819
14275 6819 -15075 -11658 -14623 -31812 -39173 -38472 -24029 -36194 -32997 -22275 -18034 -7142 -10971
$$ packed form
14372a8941L650j602K382M550m165j3797J6322P218P549r872K803K461L976j0191
14358g657j59M813L141q736r357l889m37j0279O482J1210J358K189J0449M026
14344C154Q653J8444n943j2668k313j2966r229J0309l3j2366j6802n592R909Q993
14330a8450O156J839P181R635p678k302j6872M165J0724m663K989O288J1601N971
14316A6584j4481j527M707J988q520j2524n284J960k461l268l408L083K888J199
14302a9064J0454m112j7880M545R890N878O697n43r89o107k408j1468m199r791
14288c9097o033J8884J3644q19l315O958K4188J153k0233J108J0194N636n449
14275F819k1894L417k965j7189p361P01J4443j2165L197J0722M241J0892l829
$$ plain form
14262 -10971 -27448 -10655 -23684 -27612 -17498 -27894 -23741 -25302 -24182 -17636 -9961 -10708 -23179
14249 -23179 -18978 -3342 -1471 -9490 -10129 2569 11004 8072 6609 -4501 -4771 7718 22748 19607
14235 19607 6862 2082 -2407 461 8851 6959 -13483 -18920 -4646 -3433 -7797 131 -2765 -15545
14221 -15545 -19234 -3184 10528 7672 1518 3053 6098 16770 10385 8078 5509 8668 8676 13442
14207 13442 -3707 -22881 -21270 -15044 -18050 -2963 5770 -87 -1612 -9467 -22892 -38514 -32120
14194 -32120 -19392 -14217 -11707 -16215 -12785 -6494 6655 17422 13206 12501 3305 -3911 3093 1569
14180 1569 2103 1138 -7597 -10824 2234 9310 -5781 -19041 -14094 -12148 -10599 -960 4247 6787
14166 6787 6284 10342 -120 -3069 3969 13174 15237 11903 9606 13875 5622 -3323 -8469 -9637 -4608
$$ packed form
14262a0971j6477J6793j3029l928J0114j0396M153j561J120O546P675p47j2471
14249b3179M201J5636J871q019o39J2698Q435k932j463j1110k70J2489J5030l141
14235A9607j2745m780m489K868Q390j892k0442n437J4274J213m364P928k896j2780
14221a5545l689J6050J3712k856o154J535L045J0672o385k307k569L159QM766
14207A3442j7149j9174J611O226l006J5087Q733n857j525p855j3425j5622O394
14194c2120J2728N175K510m508L430O291J3149J0767m216p05r196p216P004j524
14180A569N34r65q735l227J3058P076j5091j3260M947J946J549R639N207K540
14166F787n03M058j0462k949P038R205K063l334k297M269q253q945n146j168N029
$$ plain form
14151 -4608 -6633 -3652 959 1704 2838 725 65 9179 13184 19595 12908 10221 28163 24548 7888
14136 7888 4797 -1311 1145 9291 10777 5212 6969 8485 1844 -2342 -4216 -12011 -15416 -12173 -14811
14121 -14811 -8151 530 -2379 -4809 -5003 -10360 -25568 -43755 -33754 -15512 -1550 8518 8065
14108 8065 2908 3748 10106 10530 -2673 -10219 -16947 -22589 -23717 -27929 -27325 -15021 -7259 -18238 -15273
14093 -15273 -12550 2219 -5881 -7426 -17172 -20591 -21323 -25210 -23378 -11098 -4792 -590 -2103 -2923
14079 -2923 -2917 -6053 -22303 -30265 -20721 -28629 -22443 -21343 -20656 -24677 -6182 -2652 -24531 -16025 -605
14064 -605 7344 -3 -18930 -22938 -22236 -19112 -17671 -8741 -3154 6009 15122 9763 -7524 -19344
14050 -19344 -29339 -27258 -28591 -26166 -23717 -4181 3419 5897 1072 1553 1916 -6429 -15536 -25094 -18246
$$ packed form
14151d608k025K981M611P45J134k113o60R114M005O411o687k687J7942l615j6660
14136G888l091o108K456Q146J486n565J757J516o641m186j874p795l405L243k638
14121a4811O660Q681k909k430j94n357j5208j8187J0001J8242J3962J0068m53
14108H065n157Q40O358M24j3203p546o728n642j128m212O04J2304P762j0979K965
14093a5273K723J4769q100j545r746l419p32l887J832J2280O306M202j513q20
14079b923Ol136j6250p962R544p908O186J100O87m021J8495L530k1879Q506J5420
14064f05P949p347j8927m008P02L124J441Q930N587R163R113n359j7287j1820
14050a9344r995K081j333K425K449J9536P600K478m825M81L63q345r107r558O848
$$ plain form
14035 -18246 -4928 129 8640 32551 44624 43682 55207 69751 77269 82471 83090 111753 129611
14022 129611 131275 126962 117468 118281 121789 122806 125253 122049 124338 105842 86081 80192 67658 44353
14008 44353 25651 23985 26985 22887 34369 31297 15317 -5576 -18161 -20381 -18592 -7274 -2782
13995 -2782 8601 3312 -2814 -3206 475 3461 3884 4878 -4405 1983 -3688 -8150 -5960 -2707 -13742
13980 -13742 -24680 -3012 -1361 -4576 -20836 -26735 -14568 -14155 -13927 -19465 -18653 -13743 -11074 -9807
13966 -9807 -10051 375 1341 -6941 -15746 -20563 -21171 -13739 393 -6185 -481 -947 -12940 -28369 -25392
13951 -25392 -18021 -8356 -3371 2800 -10409 -11660 -7228 -4791 488 -6495 -533 9012 -3240 7035
13937 7035 13233 11504 20502 11765 3558 7172 9360 5993 -2102 2343 3225 -13028 -9935 2630
$$ packed form
14035a8246J3318N057Q511K3911J2073r42J1525J4544P518N202O19K8663J7858
14022A29611J664m313r494Q13L508J017K447l204K289j8496j9761n889j2534k3305
14008D4353j8702j666L000m098J1482l072j5980k0893j2585k220J789J1318M492
13995b782J1383n289o126l92L681K986M23R94r283O388n671m462K190L253j1035
13980a3742j0938K1668J651l215j6260n899J2167M13K28n538Q12M910K669J267
13966i807k44J0426R66q282q805m817o08P432J4132o578N704m66j1993j5429K977
13951b5392P371R665M985O171j3209j251M432K437N279o983N962R545j2252J0275
13937G035O198j729Q998q737q207L614K188l367q095M445Q82j6253L093J2565
$$ plain form
13923 2630 -4488 4756 23707 18660 7430 -1347 899 7729 7567 8150 6265 -6248 -2918 4068
13909 4068 23810 16591 5352 -78 -4682 -3552 3925 -1198 -777 -349 -2357 -6804 -4283 -161 -6487
13894 -6487 -15437 -10744 -2974 -17259 -25553 -17303 -6751 -5873 -25258 -27448 -24640 -14812 -3906 -1135
13880 -1135 328 12603 18443 13712 3526 -6355 -12013 -4077 5547 6096 -3421 -12567 -16038 -20615
13866 -20615 -21601 -27766 -31169 -25392 -22030 -11901 -12991 -17869 -20726 -14429 -7888 5538 -3778 -20542
13852 -20542 -13624 551 7918 5894 -1920 -2561 3305 13985 9771 6339 17616 22444 25430 28854
13838 28854 31540 33012 22701 31504 56975 78249 82363 108081 149370 205659 293038 396945
13826 396945 483418 565848 630161 671238 682278 663009 584987 509084 411610 315585 239116
$$ packed form
13923B630p118R244J8951n047j1230q777K246O830j62N83j885j2513L330O986
13909D068J9742p219j1239n430m604J130P477n123M21M28k008m447K521M122o326
13894f487q950M693P770j4285q294Q250J0552Q78j9385k190K808R828J0906K771
13880a135J463J2275N840m731j0186r881n658P936R624N49r517r146l471m577
13866b0615r86o165l403N777L362J0129j090m878k857O297O541J3426r316j6764
13852b0542O918J4175P367k024p814o41N866J0680m214l432J1277M828K986L424
13838B8854K686J472j0311Q803K5471K1274M114K5718M1289N6289Q7379J03907
13826C96945Q6473Q2430O4313M1077J1040j9269p8022p5903r7474r6025p6469
$$ plain form
13815 239116 183202 145326 113483 98806 90329 72772 53496 46437 40728 23787 17266 23143
13803 23143 33892 31272 26150 25471 15694 1065 9369 4654 3614 -6255 6046 9053 2362 -1535
13789 -1535 -1853 3036 7873 20127 20193 9763 11419 12756 22642 18694 14243 9797 12270 31148 28048
13774 28048 15046 6779 -6087 -10190 235 -8407 -14652 3537 5341 -2589 -2537 1476 5570 -6063
13760 -6063 -14407 -9955 -2974 -4148 -9169 5737 6654 1739 3760 595 3062 2985 -9061 -16787 -19430
13745 -19430 -30852 -27709 -22544 -17308 479 2582 -5090 -20889 -26385 -5546 2719 4938 -1392
13732 -1392 -2173 7446 3126 -8510 -10012 -11307 82 -2926 264 -3474 -19955 -37626 -49051 -49289
13718 -49289 -22554 490 7774 7608 -5039 -23304 -24000 -37523 -24375 -1999 11398 4496 2724
$$ packed form
13815B39116n5914l7876l1843j4677q477j7557j9276p059n709j6941o521N877
13803B3143J0749k620n122o79r777j4629Q304m715j040r869J2301L007o691l897
13789a535l18M889M837J2254O6j0430J656J337R886l948m451m446K473J8878l100
13774B8048j3002q267j2866m103J0425q642o245J8189J804p930N2M013M094j1633
13760f063q344M452O981j174n021J4906R17m915K021l165K467p7j2046p726k643
13745a9430j1422L143N165N236J7787K103p672j5799n496K0839Q265K219o330
13732a392p81R619m320j1636j502j295J1389l008L190l738j6481j7671j1425k38
13718d9289K6735K3044P284j66j2647j8265o96j3523J3148K2376J3397o902j772
$$ plain form
13705 2724 1978 -5545 -9253 -11579 -6814 -11227 -17424 -3043 4361 14509 21772 6604 -14053 -23069
13691 -23069 -14051 -6673 -21552 -26672 -24833 -28046 -19295 -7293 -4183 11729 20870 -3441 -16702
13678 -16702 -14149 -18976 -26760 -28222 -23086 -19710 -18589 -20275 -17798 -20246 -12332 -4534 8353 14432
13664 14432 -2628 -15145 -20524 -11310 6027 17177 11046 -4247 -21315 -16195 -16221 -14778 -7725
13651 -7725 11079 15515 10834 16543 25860 22314 26825 15990 8131 6156 3667 437 -13431 -7740
13637 -7740 13097 12542 -10718 -30649 -13787 -9498 -15031 -20486 -11180 1410 9647 11407 1725 -5736
13623 -5736 -17507 -7002 -1829 10282 3426 -2903 484 11513 3553 -6889 -541 1273 7579
13610 7579 24093 10617 -8855 -6827 -1134 -8085 2085 8463 6388 582 542 10973 5625 2897
$$ packed form
13705B724p46p523l708k326M765m413o197J4381P404J0148P263j5168k0657r016
13691b3069R018P378j4879n120J839l213Q751J2002L110J5912R141k4311j3261
13678a6702K553m827p784j462N136L376J121j686K477k448P914P798J2887O079
13664A4432j7060j2517n379R214J7337J1150o131j5293j7068N120k6J443P053
13651g725J8804M436m681N709R317l546M511j0835p859j975k489l230j3868N691
13637g740K0837n55k3260j9931J6862M289n533n455R306J2590Q237J760r682p461
13623e736j1771J0505N173J2111o856o329L387J1029p960j0442O348J814O306
13610G579J6514j3476j9472K028N693o951J0170O378k075n806m0J0431n348k728
$$ plain form
13596 2897 12985 5877 -5111 -5692 -2254 -6541 -18269 -11815 -11661 -2301 -1174 -4701 6965 6453
13582 6453 881 35677 54673 37672 12622 -759 -7913 -8129 -20450 -14624 1183 11849 1206
13569 1206 -12544 -13878 1205 38 -5289 -19017 -5862 1811 4112 12878 9869 -8439 -8976 1799
13555 1799 11127 13404 11131 11608 6628 -213 -2126 -8576 -8157 -7524 -3232 8401 11156 6852 13739
13540 13739 15453 8425 1356 2397 6622 25558 33393 37639 34156 28718 37257 58805 72190 82768
13526 82768 84883 82549 84209 87070 88409 89021 90088 104113 113011 122628 121517 116387 95202 74291
13512 74291 67778 66806 76573 90367 94955 90123 83145 71778 72521 63321 39436 10654 5886 7046
13498 7046 3235 15930 33417 45389 34195 30135 25595 21747 18115 794 -1593 6856 21763
$$ packed form
13596B897J0088p108j0988n81L438m287j1728O454J54R360J127l527J1666n12
13582F453n572L4796J8996j7001k5050j3381p154k16j2321N826J5807J0666j0643
13569A206j3750j334J5083j167n327j3728J3155P673K301Q766l009j8308n37J0775
13555A799R328K277k273M77m980o841j913o450M19O33M292J1633K755m304O887
13540A3739J714p028p069J041M225J8936P835M246l483n438Q539K1548J3385J0578
13526H2768K115k334J660K861J339O12J067J4025Q898R617j111n130k1185k0911
13512G4291o513r72R767J3794M588m832o978j1367P43r200k3885k8782m768J160
13498G046l811J2695J7487J1972j1194m060m540l848l632j7321k387Q449J4907
$$ plain form
13485 21763 18421 5669 -982 -9062 -475 12876 17422 20299 7768 -31084 -36055 -16488 -4988
13472 -4988 -8209 10798 16583 -496 -7049 6514 5739 4159 15008 13998 5805 -3069 -10331 -12288
13458 -12288 -4219 14251 3858 -5899 -2245 -5924 -17376 -28862 7794 9570 -3301 9582 13233
13445 13233 8586 11893 20245 22362 18659 6030 -2266 -10983 -10118 -5774 -9916 -3515 -635 522
13431 522 21252 29149 33750 19345 5 2549 1651 2710 3026 -1169 -7621 1237 -2727 -1902 -17255
13416 -17255 -10941 -15 16358 7869 1194 -10244 -19097 -12378 -496 -2776 2606 15424 21379
13403 21379 14955 5557 2315 -2239 -2162 -1168 -7601 -22880 -26761 -29130 -20330 -3631 8577 -524
13389 -524 -11624 -9995 2089 4873 7354 16643 13820 20304 3379 -17951 -18826 -9671 2772 12397
$$ packed form
13485B1763l342j2752o651q080Q587J3351M546K877j2531l8852m971J9567J1500
13472d988l221J9007N785j7079o553J3563p75j580J0849j010q193q874p262j957
13458a2288Q069J8470j0393r757L654l679j1452j1486L6656J776j2871J2883L651
13445A3233m647L307Q352K117l703j2629q296q717Q65M344m142O401K880J157
13431E22K0730P897M601j4405j9340K544q98J059L16m195o452Q858l964Q25j5353
13416a7255O314J0926J6373q489o675j1438q853O719J1882k280N382J2818N955
13403B1379o424r398l242m554P7R94o433j5279l881k369Q800J6699J2208r101
13389e24j1100J629J2084K784K481R289k823O484j6925k1330q75R155J2443R625
$$ plain form
13375 12397 14224 14541 17256 31797 50302 44159 45742 25859 9656 21878 18439 12344 4924
13362 4924 16088 18409 5450 -2564 -7112 917 -6492 -25698 -14145 5864 8275 17560 12662
13349 12662 8270 -3146 12097 20534 14158 10467 11262 21597 28192 10343 -8934 -21915 -12996
13336 -12996 10355 14307 21403 15120 7819 -9167 -15302 9215 5760 -12922 -7666 10325 17349
13323 17349 11677 13661 12484 7758 11975 23378 24590 20323 5476 926 11873 17006 18076 6540
13309 6540 -927 1192 8676 17708 20742 24432 14357 10293 8184 3592 824 3071 15171 13147
13295 13147 5917 7117 11914 23826 7753 10297 10764 22573 25484 23582 16336 3151 729 7860
13281 7860 11778 11255 17106 19902 11279 -1527 -5613 -7170 -5827 -5043 -11163 -19615 -7158 3172
$$ packed form
13375A2397J827L17K715J4541J8505o143J583j9883j6203J2222l439o095p420
13362D924J1164K321j2959q014m548Q029p409j9206J1553K0009K411R285m898
13349A2662m392j1416J5243Q437o376l691P95J0335O595j7849j9277j2981Q919
13336a2996K3351L952P096o283p301j6986o135K4517l455j8682N256J7991P024
13323A7349n672J984j177m726M217J1403J212m267j4847m550J0947N133J070j1536
13309F540p467K119P484R032L034L690j0075m064k109m592k768K247J2100k024
13295A3147p230J200M797J1912j6073K544M67J1809K911j902p246j3185k422P131
13281G860L918n23N851K796q623j2806m086j557J343P84o120q452J2457J0330
$$ plain form
13267 3172 -4943 2654 7547 13670 13618 10270 10748 17331 17735 20911 14508 -2732 -5184 -6829 4966
13252 4966 18208 27519 20960 23040 23478 14142 15935 12808 2078 9152 14805 2463 -3276 43
13238 43 -9205 -4862 -18235 -34878 -34581 -12859 9202 17825 17926 5368 9297 17015 22440 20105
13224 20105 -247 -454 -7857 -5312 -456 8960 8323 11239 2699 6900 -2361 3713 -3804 3213 1071
13209 1071 3447 6246 9459 11112 11867 9160 10536 15188 4708 -908 -1458 -6123 -4760 2731 -13246
13194 -13246 -17385 -13577 -2686 -323 2647 6049 8764 8402 9068 3494 15181 12992 16689 19490
13180 19490 21088 6948 -4448 -9737 -8661 2971 12166 -3611 -3854 7083 20330 16235 13445
13167 13445 10650 -1390 8843 4326 -14863 -28053 -17770 5296 12237 19563 17060 33007 28147
$$ packed form
13267C172q115P597M893O123n2l348M78O583M04L176o403j7240k452j645J1795
13252D966J3242R311o559K080M38r336J793l127j0730P074N653j2342n739L319
13238D3r248M343j3373j6643K97K1722K2061Q623J01j2558L929P718N425k335
13224B0105k0352k07p403K545M856R416o37K916q540M201r261O074p517P017k142
13209A071K376K799L213J653P55k707J376M652j0480n616n50m665J363P491j5977
13194a3246m139L808J0891K363K970L402K715l62O66n574J1687k189L697K801
13180A9490J598j4140j1396n289J076J1632R195j5777k43J0937J3247m095k790
13167A3445k795j2040J0233m517j9189j3190J0283K3066O941P326k503J5947m860
$$ plain form
13154 28147 17744 4790 -3395 7009 6835 959 12137 17158 10134 1885 -2035 -19694 -16434
13141 -16434 -7347 -14508 8194 19988 17976 6353 -8682 -10380 -1258 -6746 -11727 -13851 10897
13128 10897 15452 16859 18321 16128 13513 17597 18898 25245 35392 23664 10194 -2928 -1008
13115 -1008 10572 15954 19918 20988 26041 30160 33903 30236 39338 48171 35473 16792 9690 3804
13101 3804 -141 -12292 -17219 -7629 -2060 14461 28286 37285 38558 34593 15985 -6847 596
13088 596 21355 26290 22987 20986 18680 13667 7267 7668 8334 16996 18006 14049 9893 5774 10232
13073 10232 10850 21772 28680 25956 20710 19588 10288 8427 12155 3654 3359 7608 16647 15611 7099
13058 7099 15834 31763 23339 22618 11911 18631 40449 38067 21440 22348 19715 5564 -133 4143
$$ packed form
13154B8147j0403j2954q185J0404j74n876J1178N021p024q249l920j7659L260
13141a6434R087p161K2702J1794k012j1623j5035j698R122n488m981k124K4748
13128A0897M555J407J462k193k615M084J301O347J0147j1728j3470j3122J920
13115a008J1580N382L964J070N053M119L743l667R102Q833j2698j8681p102n886
13101C804l945j2151m927R590N569J6521J3825Q999J273l965j8608k2832P443
13088E96K0759M935l303k001k306n013o400M01O66Q662J010l957m156m119M458
13073A0232O18J0922O908k724n246j122r300j861L728q501k95M249R039j036q512
13058G099Q735J5929q424p21j0707O720K1818k382j6627R08k633j4151n697M276
$$ plain form
13044 4143 26809 39233 43582 52032 59647 51312 41725 34156 40801 52986 47694 24613 28138 46195
13030 46195 56242 48313 33258 31012 44391 48834 50076 52593 56878 55479 47381 35394 29508
13017 29508 35560 45410 60218 59153 78994 95751 106626 121884 133955 139232 145766 171014 178837
13004 178837 206864 247048 306045 395310 523412 660724 798906 915431 1019681 1082474
12994 1082474 1076013 1019710 924910 809063 673929 543157 418557 325096 265760 227592 206389
12983 206389 185409 177680 170200 160150 149403 147113 141411 124372 104377 77909 68271 66702 56845
12970 56845 52206 70966 77498 74217 77171 69604 61877 57521 71645 76223 77721 75906 62757 51112
12956 51112 45372 49928 59593 76782 73919 62010 61845 56602 65072 53084 44361 46245 49772 55496
$$ packed form
13044D143K2666J2424M349Q450P615q335r587p569O645J2185n292k3081L525J8057
13030D6195J0047p929j5055k246J3379M443J242K517M285j399q098j1987n886
13017B9508O052R850J4808j065J9841J6757J0875J5258J2071N277O534K5248P823
13004A78837K8027M0184N8997Q9265J28102J37312J38182J16525J04250O2793
12994A082474o461n6303r4800j15847j35134j30772j24600r3461n9336l8168k1203
12983B06389k0980p729p480j0050j0747k290n702j7039j9995k6468r638j569r857
12970E6845m639J8760O532l281K954p567p727m356J4124M578J498j815j3149j1645
12956E1112n740M556R665J7189k863j1909j65n243Q470j1988q723J884L527N724
$$ plain form
12942 55496 56752 52879 48062 33347 24292 19436 27248 37430 51072 62453 47257 41307 50425
12929 50425 48731 49777 59779 58944 50180 47869 45260 43350 37731 34312 42858 54873 60414 59059
12915 59059 41961 45251 37270 42444 50564 42496 32583 45507 62360 59715 51871 68281 78121
12902 78121 77064 72681 74434 69306 58734 64222 70672 76184 80016 76575 65266 66813 73756 63078
12888 63078 60274 67316 63155 48964 41536 40494 42954 37795 27682 20358 19567 19661 27034 26645 30805
12873 30805 29803 29611 29120 41456 34255 18196 19398 26200 32031 27474 27267 36632 44459 44022 31074
12858 31074 19645 8054 15977 28137 43457 52969 46917 38958 29291 32876 40688 40433 45158 24170
12844 24170 10262 10088 10656 29912 46453 44981 33144 27465 35418 51233 54938 68815 72972
$$ packed form
12942E5496J256l873m817j4715r055m856P812J0182J3642J1381j5196n950R118
12929E0425j694J046J0002q35q764k311k609j910n619l419Q546J2015N541j355
12915E9059j7098L290p981N174Q120q068r913J2924J6853k645p844J6410R840
12902G8121j057m383J753n128j0572N488O450N512L832l441j1309J547O943j0678
12888F3078k804P042m161j4191p428j042K460n159j0113p324p91R4P373l89M160
12873C0805j002j92m91J2336p201j6059J202O802N831m557k07R365P827m37j2948
12858C1074j1429j1591P923J2160J5320R512o052p959r667L585P812k55M725k0988
12844B4170j3908j74N68J9256J6541j472j1837n679P953J5815L705J3877M157
$$ plain form
12831 72972 67377 91113 107118 111320 118601 134928 135037 124131 118799 121070 128041 127213 126810 111477
12817 111477 91206 74624 63702 70367 67963 70623 78429 74177 73768 55994 58190 63474 71318
12804 71318 71557 58524 60326 72342 72437 61423 50645 39466 50028 60796 70260 68721 69089 85721
12790 85721 95884 103256 92484 86349 90701 85005 70137 71422 78606 78436 76857 89935 98827 84376
12776 84376 81505 78975 78795 87993 86321 86433 87939 87591 94760 91622 80801 83861 73092 76030 75322
12761 75322 74429 87939 100493 115147 132483 145939 147964 141834 142976 148418 135420 133176 135362
12748 135362 135498 132032 129971 123832 121299 119581 107658 90033 69556 68785 88971 97943 87270
12735 87270 77286 92135 101784 113381 130269 145908 153266 159214 176053 182139 191737 194600 181152
$$ packed form
12831G2972n595K3736J6005M202P281J6327J09j0906n332K271O971q28m03j5333
12817A11477k0271j6582j0922O665k404K660P806m252m09j7774K196N284P844
12804G1318K39j3033J802J2016R5j1014j0778j1179J0562J0768R464j539L68J6632
12790H5721J0163P372j0772o135M352n696j4868J285P184j70j579J3078Q892j4451
12776H4376k871k530j80R198j672J12J506l48P169l138j0821L060j0769K938p08
12761G5322q93J3510J2554J4654J7336J3456K025o130J142N442j2998k244K186
12748A35362J36l466k061o139k533j718j1923j7625k0477p71K0186Q972j0673
12735H7270r984J4849R649J1597J6888J5639P358N948J6839O086R598K863j3448
$$ plain form
12722 181152 164092 156446 158592 165135 148043 123906 121633 141465 142723 134231 122549 111083 125858
12709 125858 129896 113865 101697 102226 95504 85949 79036 82259 71846 63835 80025 88874 88474 88304
12695 88304 92788 90464 103449 106551 103663 113380 123206 120276 106344 115881 128765 125460 125535 135880
12681 135880 155100 163629 159746 152211 175878 184552 181905 192859 200405 217074 213210 204424 191277
12668 191277 169916 174914 183928 187063 192704 198128 211385 209209 220104 237285 231019 209136 206291
12655 206291 202553 200819 197399 192558 195816 210189 213225 217512 224176 235911 247488 251862 268868
12642 268868 289646 301335 305949 322396 354084 379204 397922 420240 444112 467089 493776 521076
12630 521076 535517 547660 568885 579981 597373 617768 628308 649260 669505 701043 733409
$$ packed form
12722A81152j7060p646K146O543j7092k4137k273J9832J258q492j1682j1466J4775
12709A25858M038j6031j2168N29o722r555o913L223j0413q011J6190Q849m00j70
12695H8304M484k324J2985L102k888R717R826k930j3932R537J2884l305P5J0345
12681A35880J9220Q529l883p535K3667Q674k647J0954P546J6669l864q786j3147
12668A91277k1361M998R014L135N641N424J3257k176J0895J7181o266k1883k845
12655B06291l738j734l420m841L258J4373L036M287O664J1735J1577M374J7006
12642B68868K0778J1689M614J6447L1688K5120J8718K2318K3872K2977K6687K7300
12630E21076J4441J2143K1225J1096J7392K0395J0540K0952K0245L1538L2366
$$ plain form
12619 733409 770464 807670 835978 872380 932018 994435 1045287 1094403 1165875 1239886 1308650
12608 1308650 1370697 1439866 1524543 1635780 1753238 1890110 2027946 2177282 2339682 2561066
12598 2561066 2825652 3106659 3448434 3874802 4376013 5004450 5786816 6721545 7787597
12589 7787597 8973111 10306445 11781028 13419822 15300147 17602721 20707575 25193251
12581 25193251 31905764 42192666 57581908 78498780 103213336 128938494 153627351
12574 153627351 175957416 193185315 201255855 197805786 184567391 165356419 142872962
12567 142872962 118464054 94071847 72638014 56289096 45074493 37663761 32601395
12560 32601395 28861054 25798427 23143791 20749886 18536390 16437064 14413941 12567088
$$ packed form
12619G33409L7055L7206K8308L6402N9638O2417N0852M9116P1472P4011O8764
12608A308650O2047O9169Q4677J11237J17458J36872J37836J49336J62400K21384
12598B561066K64586K81007L41775M26368N01211O28437P82366R34729J066052
12589G787597J185514J333334J474583J638794J880325K302574L104854M485676
12581B5193251O712513J0286902J5389242K0916872K4714556K5725158K4688857
12574A53627351K2330065J7227899Q070540l450069j3238395j9210972k2483457
12567A42872962k4408908k4392207k1433833j6348918j1214603p410732n062366
12560C2601395l740341l062627k654636k393905k213496k099326k023123j846853
$$ plain form
12552 12567088 10982565 9663941 8565535 7669355 6915200 6283058 5749686 5280033 4871691
12543 4871691 4511457 4212642 3936745 3671842 3419950 3187395 2990097 2820669 2649149
12534 2649149 2490273 2338172 2211459 2096948 1991174 1896458 1801579 1713860 1615398 1524248
12524 1524248 1448324 1360586 1276567 1214120 1135137 1048665 995159 950840 893353 835974 789786
12513 789786 765421 739828 729528 741757 751733 747839 735487 714491 690486 691843 695024 688644
12501 688644 656793 617621 601843 585063 565081 550854 525862 524505 500203 479486 466318 450942
12489 450942 430396 414541 401123 395359 379968 355932 347264 342710 328173 335530 337584 322897
12477 322897 309117 289370 281964 279776 262955 242877 230484 235372 240253 249391 252631 244776 248814
$$ packed form
12552A2567088j584523j318624j098406q96180p54155o32142n33372m69653m08342
12543D871691l60234k98815k75897k64903k51892k32555j97298j69428j71520
12534B649149j58876j52101j26713j14511j05774r4716r4879q7719r8462r1150
12524A524248p5924q7738q4019o2447p8983q6472n3506m4319n7487n7379m6188
12513G89786k4365k5593j0300J2229R976l894j2352k0996k4005J357L181o380
12501F88644l1851l9172j5778j6780j9982j4227k4992j357k4302k0717j3168j5376
12489D50942k0546j5855j3418n764j5391k4036q668m554j4537P357K054j4687
12477C22897j3780j9747p406k188j6821k0078j2393M888M881R138L240p855M038
$$ plain form
12464 248814 260669 258058 263745 254709 252416 270952 269542 259964 256303 263724 274039 289644 301518
12451 301518 308216 322660 347024 381788 423323 455530 489776 515522 534662 562956 579298 604346
12439 604346 612845 592378 542629 484412 428974 382493 334639 290174 256727 248831 233709 210187
12427 210187 188777 178855 155532 127489 115458 99942 92125 94306 81466 63362 53617 64744
12415 64744 75217 98212 127804 130458 147006 146707 139477 139439 148863 153365 158043 164539 170765 178208
12401 178208 189497 197573 194614 201184 202060 201684 207864 240761 295966 359959 474932 633267 813591
12388 813591 1005531 1196542 1362771 1486049 1526793 1483401 1366049 1217125 1043755 861082
12378 861082 682527 537865 449020 373401 318433 294441 273381 250438 229329 213729 184235
$$ packed form
12464B48814J1855k611N687r036k293J8536j410r578l661P421J0315J5605J1874
12451C01518O698J4444K4364L4764M1535L2207L4246K5746J9140K8294J6342K5048
12439F04346Q499k0467m9749n8217n5438m6481m7854m4465l3447p896j5122k3522
12427B10187k1410r922k3323k8043j2031j5516p817K181j2840j8104r745J1127
12415F4744J0473K2995K9592K654J6548k99p230l8R424M502M678O496O226P443
12401A78208J1289Q076k959O570Q76l76O180L2897N5205O3993J14973J58335J80324
12388H13591J91940J91011J66229J23278M0744m3392j17352j48924j73370j82673
12378H61082j78555j44662q8845p5619n4968k3992k1060k2943k1109j5600k9494
$$ plain form
12367 184235 165614 161925 143602 133720 135252 139431 122608 122904 119701 97697 92166 91816 103193
12354 103193 99206 83861 83027 75203 76170 79227 80416 86682 84072 89588 100072 96781 98680 95179
12340 95179 100659 96272 80340 65334 70830 63496 52503 61951 78771 86567 75626 78151 71229
12327 71229 76454 86950 97432 91279 81771 82588 87345 89437 93012 95829 73941 62424 74463
12314 74463 77604 72131 70619 81273 81493 75248 88490 82294 71063 70849 84632 85638 59455 63377
12300 63377 73615 83682 86267 69869 62179 70090 68359 57313 62648 75074 92227 85888 76416
12287 76416 68828 69480 65299 73900 83618 79374 65474 61531 61553 48321 38637 46703 48743 51789 60974
12272 60974 63193 58341 67091 70695 73382 59687 48462 47923 51078 44631 36844 26097 26317 18117
$$ packed form
12367A84235j8621l689j8323r882J532M179j6823K96l203k2004n531l50J1377
12354A03193l987j5345q34p824R67L057J189O266k610N516J0484l291J899l501
12340I5179N480m387j5932j5006N496p334j0993R448J6820P796j0941K525o922
12327G1229N225J0496J0482o153r508Q17M757K092L575K817k1888j1517J2039
12314G4463L141n473j512J0654K20o245J3242o196j1231k14J3783J006k6183L922
12300F3377J0238J0067K585j6398p690P911j731j1046N335J2426J7153o339r472
12287G6416p588O52m181Q601R718m244j3900l943K2j3232r684Q066K040L046R185
12272F0974K219m852Q750L604K687j3695j1225n39L155o447p787j0747K20q200
$$ plain form
12258 18117 18594 21585 12456 25261 19415 19421 31837 31046 22050 19119 14991 16213 9463 3923 12675
12243 12675 23616 11746 7703 15077 32163 28119 12767 14981 22786 27992 38455 49564 56899
12230 56899 45168 32348 38142 46538 34658 34758 29062 22490 34408 37199 26308 33279 47099
12217 47099 40499 45638 47026 41372 30156 29248 19219 13175 35324 36240 36271 49890 58274 63113
12203 63113 54414 43494 34404 31804 25267 27972 29394 29051 32008 37610 49770 56339 50821 36737
12189 36737 35441 31402 60023 64214 45830 33201 50044 62588 55543 64383 69108 70077 68705
12176 68705 62798 52790 54011 55189 49316 40435 39823 46770 56003 51223 40596 47496 49139 69874
12162 69874 83988 99819 100790 105782 106394 108700 109980 108193 140877 183648 229979 277256 358271
$$ packed form
12258A8117M77K991r129J2805n846OJ2416p91q996k931m128J222o750n540Q752
12243A2675J0941j1870m043P374J7086m044j5352K214P805N206J0463J1109P335
12230E6899j1731j2820N794Q396j1880J00n696o572J1918K791j0891O971J3820
12217D7099o600N139J388n654j1216r08j0029o044K2149R16L1J3619Q384M839
12203F3113q699j0920r090k600o537K705J422l43K957N602J2160O569n518j4084
12189C6737j296m039K8621M191j8384j2629J6843J2544p045Q840M725R69j372
12176F8705n907j0008J221J178n873q881o12O947R233m780j0627O900J643K0735
12162F9874J4114J5831R71M992O12K306J280j787L2684M2771M6331M7277Q1015
$$ plain form
12149 358271 472279 599402 725742 857737 965601 1069243 1135201 1140521 1084220 981364
12139 981364 872233 743336 598903 486381 392107 317348 261561 232986 226865 224641 222668
12128 222668 212532 182908 172585 161631 158615 153170 146806 156583 181469 176634 180186 188391 184762
12115 184762 173600 185979 216281 235177 249568 278450 317500 373608 424510 459170 482998
12104 482998 487884 476422 440369 394859 347048 329660 317128 288482 267601 269320 273410 265835
12092 265835 270323 293021 311028 324987 349461 389109 405321 401450 407561 427999 440425 438403
12080 438403 426949 449435 475995 499713 521101 543825 558942 566598 572057 575359 547990 527546
12068 527546 529484 498048 471578 456110 442227 447438 458686 444891 428614 403149 393810 388884
$$ packed form
12149C58271J14008J27123J26340J31995J07864J03642O5958N320n6301j02856
12139I81364j09131j28897j44433j12522r4274p4759n5787k8575o121k224j973
12128B22668j0136k9624j0323j0954l016n445o364R777K4886m835L552Q205l629
12115A84762j1162J2379L0302J8896J4391K8882L9050N6108N0902L4660K3828
12104D82998M886j1462l6053m5510m7811j7388j2532k8646k0881J719M090p575
12092B65835M488K2698J8007J3959K4474L9648J6212l871O111K0438J2426k022
12080D38403j1454K2486K6560K3718K1388K2724J5117P656N459L302k7369k0444
12068E27546J938l1436k6470j5468j3883N211J1248j3795j6277k5465r339m926
$$ plain form
12056 388884 357565 339353 328463 305942 303821 298660 312133 332610 352617 372447 399873 439884
12044 439884 488527 533453 552648 553966 549630 540415 513822 468728 429645 391410 354056 336738
12032 336738 311897 281267 242206 215182 191656 180693 183934 180215 177777 165923 164791 159361
12020 159361 155967 150281 140901 129583 132400 134328 135879 135691 147202 141629 141971 136619 129890 142867
12006 142867 145783 141494 142448 145372 125792 117892 118651 121124 133264 142326 136871 116415 117317 118437
11992 118437 125455 112776 106668 110095 118291 116379 115047 106623 102347 100133 101633 105135 113466 121466
11978 121466 119767 113389 105200 116237 120911 122386 112702 105612 116481 141228 144187 131761 126812
11965 126812 132971 131726 114815 120320 137286 123983 105355 101477 108554 112692 111932 123469 132216
$$ packed form
12056C88884l1319j8212j0890k2521k121n161J3473K0477K0007J9830K7426M0011
12044D39884M8643M4926J9195J318m336r215k6593m5094l9083l8235l7354j7318
12032C36738k4841l0630l9061k7024k3526j0963L241l719k438j1854j132n430
12020A59361l394n686r380j1318K817J928J551j88J1511n573L42n352o729J2977
12006A42867K916m289R54K924j9580p900P59K473J2140R062n455k0456R02J120
11992A18437P018j2679o108L427Q196j912j332q424m276k214J500L502Q331Q000
11978A21466j699o378q189J1037M674J475r684p090J0869K4747K959j2426m949
11965A26812O159j245j6911N505J6966j3303j8628l878P077M138p60J1537Q747
$$ plain form
11952 132216 116702 109889 125049 136134 129053 137834 133722 133341 132739 121140 100139 108211 106904
11939 106904 107119 110161 117588 134160 148464 151365 138770 127673 140440 150764 145368 132951 134851
11926 134851 136337 141246 135363 120421 111249 121305 121622 119574 124026 116869 125874 127711 125794 125851
11912 125851 130172 132120 135558 134763 138576 137415 135689 139937 154227 175108 181457 181970 185758 185890
11898 185890 191704 185277 178645 171064 171437 177385 155453 154704 144312 153912 163999 165783 160005 166677
11884 166677 173750 180057 186226 178353 179767 185107 196547 204399 201199 211030 214401 206361 211293 219724
11870 219724 207670 202969 211209 210149 227496 231636 229221 234874 233759 220387 224406 234453 233907
11857 233907 247612 239920 230808 234786 225300 216811 221567 210845 203550 201925 205601 220391 227339
$$ packed form
11952A32216j5514o813J5160J1085p081Q781m112l81o02j1599k1001Q072j307
11939A06904K15L042P427J6572J4304K901j2595j1097J2767J0324n396j2417J900
11926A34851J486M909n883j4942r172J0056L17k048M452p157R005J837j917N7
11912A25851M321J948L438p95L813j161j726M248J4290K0881O349N13L788J32
11898A85890N814o427o632p581L73N948k1932p49j0392R600J0087J784n778O672
11884A66677P073O307O169p873J414N340J1440P852l200R831L371q040M932Q431
11870B19724j2054m701Q240j060J7347M140k415N653j115j3372M019J0047n46
11857B33907J3705p692r112L978r486q489M756j0722p295j625L676J4790O948
$$ plain form
11844 227339 226553 226157 227299 223946 239974 267760 293075 308721 322348 354501 374764 373112 376111
11831 376111 377778 371546 363062 358626 361999 347209 334775 323774 336766 338857 334827 323364 314917
11818 314917 333532 350026 350300 348203 366149 369544 363048 358343 354255 354586 365704 362754 387387
11805 387387 412457 433121 463888 476813 487671 524611 566254 586755 603183 613089 618765 601445
11793 601445 593042 590154 568772 549921 533360 520743 521580 519103 498205 486495 484327 478511 475576
11780 475576 468979 457065 450263 458094 458482 465947 466586 476066 496392 511562 515120 527026 536686 534874
11766 534874 528850 523122 525121 535620 526442 520675 510378 496785 504800 514855 504203 508293 515829
11753 515829 522515 526724 546812 552353 554110 558722 567660 584004 595774 607306 624627 652073 669662
$$ packed form
11844B27339p86l96J142l353J6028K7786K5315J5646J3627L2153K0263j652K999
11831C76111J667o232q484m436L373j4790j2434j1001J2992K091m030j1463q447
11818C14917J8615J6494K74k097J7946L395o496m705m088L31J1118k950K4633
11805C87387K5070K0664L0767J2925J0858L6940M1643K0501J6428R906N676j7320
11793F01445q403k888k1382j8851j6561j2617Q37k477k0898j1710k168n816k935
11780D75576o597j1914o802P831L88P465O39R480K0326J5170L558J1906R660j812
11766E34874o024n728J999J0499r178n767j0297j3593Q015J0055j0652M090P536
11753E15829O686M209K0088N541J757M612Q938J6344J1770J1532J7321K7446J7589
$$ plain form
11740 669662 685075 716993 736379 756012 778523 790609 803168 819153 847086 880979 905006
11729 905006 945441 980857 1005049 1043614 1075747 1121236 1170497 1220921 1277007 1352384 1427087
11718 1427087 1495081 1562949 1634674 1725279 1833310 1944952 2068290 2190575 2323490 2455431
11708 2455431 2600306 2747768 2934397 3132147 3347848 3609944 3904419 4239019 4642109
11699 4642109 5119763 5678759 6329193 7065829 7937663 9003933 10279566 11822322 13709297
11690 13709297 16013521 18866684 22442432 26999146 32802469 40087405 48964199 59158478
11682 59158478 69795039 79271087 85575369 87242573 84106952 77379188 68953843 60526719
11674 60526719 53125804 47188645 42774138 39753647 37953631 37226926 37399258 38378351
$$ packed form
11740F69662J5413L1918J9386J9633K2511J2086J2559J5985K7933L3893K4027
11729I05006M0435L5416K4192L8565L2133M5489M9261N0424N6086P5377P4703
11718A427087O7994O7868P1725R0605J08031J11642J23338J22285J32915J31941
11708B455431J44875J47462J86629J97750K15701K62096K94475L34600M03090
11699D642109M77654N58996O50434P36636Q71834J066270J275633J542756J886975
11690A3709297K304224K853163L575748M556714N803323P284936Q876794J0194279
11682E9158478J0636561R476048O304282J667204l135621o727764q425345q427124
11674F0526719p400915n937159m414507l020491j800016p26705J72332R79093
$$ plain form
11666 38378351 40129810 42602444 45687276 49222187 53003994 56814034 60429629 63652346
11658 63652346 66390335 68697497 70850896 73201541 76105690 79830492 84446824 89682271
11650 89682271 94838152 98896688 100856644 100130262 96860734 91778315 85921793 80284297
11642 80284297 75535120 72042398 69852929 68729525 68247501 67865233 67079559 65559370
11634 65559370 63262717 60364185 57115575 53761497 50504610 47560807 45146297 43468765
11626 43468765 42700956 43022384 44579125 47577180 52239071 58716692 66951855 76485451
11618 76485451 86292814 94692742 99721436 99904240 95053397 86339728 75651838 64728176
11610 64728176 54723236 46186379 39218795 33639959 29209603 25627697 22682840 20189496
$$ packed form
11666C8378351J751459K472634L084832L534911L781807L810040L615595L222717
11658F3652346K737989K307162K153399K350645K904149L724802M616332N235447
11650H9682271N155881M058536J959956p26382l269528n082419n856522n637496
11642H0284297m749177l492722k189469j123404m82024l82268p85674j520189
11634F5559370k296653k898532l248610l354078l256887k943803k414510j677532
11626D3468765p67809L21428J556741K998055M661891O477621Q235163R533596
11618G6485451R807363Q399928N028694J82804m850843q713669j0687890j0923662
11610F4728176j0004940q536857o967584n578836m430356l581906k944857k493344
$$ plain form
11602 20189496 18027012 16140611 14500527 13053695 11795605 10680459 9687874 8825989
11594 8825989 8087919 7449558 6883578 6381556 5934337 5526725 5159107 4816969 4500864
11585 4500864 4231223 3986007 3756919 3554544 3369363 3193070 3039074 2895079 2753897
11576 2753897 2626758 2522612 2401969 2297886 2209860 2141016 2065300 1994169 1921500 1874048
11566 1874048 1817922 1764093 1731830 1705811 1687476 1656084 1621155 1579896 1513622 1434092 1360908
11555 1360908 1303317 1258471 1203211 1161449 1124729 1081188 1044642 1020529 1007659 1004782 1005667 994069
11543 994069 982930 956451 929298 908581 890973 869563 855571 851944 840670 820070 801423 785266
11531 785266 755905 730834 701131 691852 670890 651322 644831 662934 675437 664321 678789 704623
$$ packed form
11602B0189496k162484j886401j640084j446832j258090j115146r92585q61885
11594H825989p38070o38361n65980n02022m47219m07612l67618l42138l16105
11585D500864k69641k45216k29088k02375j85181j76293j53996j43995j41182
11576B753897j27139j04146j20643j04083q8026o8844p5716p1131p2669m7452
11566A874048n6126n3829l2263k6019j8335l1392l4929m1259o6274p9530p3184
11555A360908n7591m4846n5260m1762l6720m3541l6546k4113j2870k877Q85j1598
11543I94069j1139k6479k7153k0717j7608k1410j3992l627j1274k0600j8647j6157
11531G85266k9361k5071k9703r279k0962j9568o491J8103J2503j1116J4468K5834
$$ plain form
11519 704623 688330 666271 659292 646183 646517 633699 620003 610197 625283 640317 681460 719629
11507 719629 748108 782447 816615 835213 854361 855999 833444 805105 778720 735995 683669 631159
11495 631159 582334 550031 505105 474760 472681 466655 460925 450925 433410 417343 403328 372584
11483 372584 337648 322178 300521 286350 272194 260976 241579 232646 229780 210445 204073 207455
11471 207455 208707 204443 185508 168281 162867 149329 150866 142877 137816 131794 131150 141629 155510
11458 155510 180971 196784 193683 185523 186302 177751 180379 188904 191950 181627 173983 178840 176880 173369
11444 173369 156200 144062 147741 158700 164863 173474 163678 159068 160619 166569 174727 163608 149889
11431 149889 158733 177089 195698 193973 178202 182835 201530 224460 248070 267933 291599 317221
$$ packed form
11519G04623j6293k2059o979j3109L34j2818j3696r806J5086J5034M1143L8169
11507G19629K8479L4339L4168J8598J9148J638k2555k8339k6385m2725n2326n2510
11495F31159m8825l2303m4926l0345k079o026n730j0000j7515j6067j4015l0744
11483C72584l4936j5470k1657j4171j4156j1218j9397q933k866j9335o372L382
11471B07455J252m264j8935j7227n414j3538J537p989n061o022o44J0479J3881
11458A55510K5461J5813l101q160P79q551K628Q525L046j0323p644M857j960l511
11444A73369j7169j2138L679J0959O163Q611r796m610J551N950Q158j1119j3719
11431A49889Q844J8356J8609j725j5771M633J8695K2930K3610J9863K3666K5622
$$ plain form
11419 317221 330775 309640 303983 305386 313652 321840 331677 341132 328176 304874 273926 247749 240291
11406 240291 236464 224799 225645 243658 269879 269992 270891 280390 275932 257972 252725 254128 235203 224417
11392 224417 212663 210904 206762 221975 244869 246951 267720 267357 255213 252879 254031 266567 283108
11379 283108 276613 277518 297724 317553 305986 300368 280658 264662 245723 224490 199874 170216
11367 170216 165992 162643 158483 165056 175048 159555 153003 162138 178593 189239 191612 185779 180713
11354 180713 186685 193045 184227 162790 167811 170025 164124 151019 141366 134930 139850 144550 141982 136827
11340 136827 119618 111956 96269 93206 100763 101749 94470 93454 103182 93558 89590 93968 95358 96939
11326 96939 98019 92715 83220 88780 84510 76073 66937 69044 71674 53332 44627 52879 69506 74816
$$ packed form
11419C17221J3554k1135n657J403Q266Q188R837R455j2956k3302l0948k6177p458
11406B40291l827j1665Q46J8013K6221J13Q99R499m458j7960n247J403j8925j0786
11392B24417j1754j759m142J5213K2894K082K0769l63j2144k334J152J2536J6541
11379B83108o495R05K0206J9829j1567n618j9710j5996j8939k1233k4616k9658
11367A70216m224l349m160O573R992j5493o552R135J6455J0646K373n833n066
11354A80713N972O360q818k1437N021K214n901j3105r653o436M920M700k568n155
11340A36827j7209p662j5687l063P557R86p279j016R728r624l968M378J390J581
11326I6939J080n304r495N560m270q437r136K107K630j8342q705Q252J6627N310
$$ plain form
11312 74816 76303 62433 38923 50848 58821 47904 56585 59005 51657 46645 42594 33448 25719
11299 25719 28577 28193 41271 61684 66566 63151 46402 43828 52044 36792 41464 52881 58316
11286 58316 58919 68805 70619 69786 60068 53702 63275 59697 54123 65218 61120 58783 67453 86364
11272 86364 97447 84648 96263 100221 84062 75828 75798 81748 83853 90938 95015 103525 105133 114962
11258 114962 151208 172649 202027 226438 260277 294120 339460 377416 418629 435091 443412 438898
11246 438898 413664 384770 361710 331299 313135 304892 277971 264143 258989 239121 239534 261294
11234 261294 276958 280991 299345 322584 362770 395870 415328 447962 471482 478592 482535 490693
11222 490693 497432 528636 554181 567619 573368 574590 568392 542932 513776 478869 447796 429736
$$ packed form
11312G4816J487j3870k3510J1925P973j0917Q681K420p348n012m051r146p729
11299B5719K858l84J3078K0413M882l415j6749k574Q216j5252M672J1417N435
11286E8316O03R886J814q33r718o366R573l578n574J1095m098k337Q670J8911
11272H6364J1083j2799J1615L958j6159q234l0N950K105P085M077Q510J608R829
11258A14962L6246K1441K9378K4411L3839L3843M5340L7956M1213J6462Q321m514
11246D38898k5234k8894k3060l0411j8164q243k6921j3828n154j9868M13K1760
11234B61294J5664M033J8354K3239M0186L3100J9458L2634K3520P110L943Q158
11222D90693O739L1204K5545J3438N749J222o198k5460k9156l4907l1073j8060
$$ plain form
11210 429736 433834 429853 428167 434490 425971 426340 425848 432578 429119 412447 402835 393139 374017 348754
11196 348754 312619 309448 330358 349114 361443 380935 405416 430613 459799 487800 512112 535899
11184 535899 538492 540099 528660 486377 444563 392342 353317 311070 268376 236294 217737 198635
11172 198635 194983 188718 171835 157383 153979 150889 168169 169606 166360 163218 161630 149878 129820
11159 129820 120358 116969 115705 99450 98483 97614 101874 103527 96623 95092 88870 92448 107833 112431
11145 112431 105342 106841 104430 115815 121254 122644 127793 116493 125739 123828 130888 142652 162798
11132 162798 185055 194129 201866 218836 239888 275929 304637 356481 424640 496064 560368 605561
11120 605561 614224 622233 612422 576894 537778 509281 465197 432359 392525 350551 338156 332850
$$ packed form
11210D29736M098l981j686O323q519L69m92O730l459j6672r612r696j9122k5263
11196C48754l6135l171K0910J8756J2329J9492K4481K5197K9186K8001K4312K3787
11184E35899K593J607j1439m2283m1814n2221l9025m2247m2694l2082j8557j9102
11172A98635l652o265j6883j4452l404l090J7280J437l246l142j588j1752k0058
11159A29820r462l389j264j6255r67q69M260J653o904j531o222L578J5385M598
11145A12431p089J499k411J1385N439J390N149j1300R246j911P060J1764K0146
11132A62798K2257R074P737J6970K1052L6041K8708N1844O8159P1424O4304M5193
11120F05561Q663Q009r811l5528l9116k8497m4084l2838l9834m1974j2395n306
$$ plain form
11108 332850 337657 353364 369077 402026 411369 400487 401763 414737 419371 428921 427006 420767 431759
11095 431759 433779 442219 466415 488918 511088 540825 589247 637049 671543 702620 720899 732209
11083 732209 716093 692226 647808 609363 572151 542152 515290 482261 469628 465331 463377 433210
11071 433210 403668 383305 359303 340423 319410 306016 313137 310371 322153 342330 369762 412422
11059 412422 444733 462576 490090 515216 544252 544580 527476 504208 474382 438659 408581 380364
11047 380364 347442 337098 330627 323718 310212 289253 275515 255939 235062 217712 207678 213831
11035 213831 214859 205863 185241 192850 204300 190067 164629 167072 174340 172039 161806 151196 138493
11022 138493 129574 124992 136296 149855 139378 149769 155022 148291 146025 148803 150197 159045 138406
$$ packed form
11108C32850M807J5707J5713L2949R343j0882J276J2974M634R550j915o239J0992
11095D31759K020Q440K4196K2503K2170K9737M8422M7802L4494L1077J8279J1310
11083G32209j6116k3867m4418l8445l7212k9999k6862l3029j2633m297j954l0167
11071D33210k9542k0363k4002j8880k1013j3394P121k766J1782K0177K7432M2660
11059D12422L2311J7843K7514K5126K9036L28j7104k3268k9826l5723l0078k8217
11047C80364l2922j0344o471o909j3506k0959j3738j9576k0877j7350j0034O153
11035B13831J028q996k0622P609J1450j4233k5438K443P268k301j0233j0610j2703
11022A38493q919m582J1304J3559j0477J0391N253o731k266K778J394Q848k0639
$$ plain form
11009 138406 135010 144611 152231 149380 141973 140453 135881 130063 119140 114780 120436 135382 142805 132941
10995 132941 134470 141961 138047 135433 126608 120424 124776 128515 123686 111508 113102 121036 122775 118748
10981 118748 109271 106959 116499 113777 115597 120991 129145 122245 113243 106765 110691 111270 109194 104608
10967 104608 109447 124265 128125 133329 140276 147071 152639 168531 176778 166942 175577 167663 157033
10954 157033 138397 139488 136597 143524 138817 140764 147398 147535 139701 138343 137355 139144 131274 150936
10940 150936 163431 157053 159909 162985 160686 157483 159959 154061 150762 137150 137747 133392 145769 147199
10926 147199 145645 172766 186209 180539 164420 169577 185629 188199 182796 181472 179791 173719 163160
10913 163160 155718 152741 153876 150673 154098 169193 168496 165878 180931 193922 198279 201686 194880 188189
$$ packed form
11009A38406l396R601P620k851p407j520m572n818j0923m360N656J4946P423r864
10995A32941J529P491l914k614q825o184M352L739m829j2178J594P934J739m027
10981A18748r477k312R540k722J820N394Q154o900r002o478L926N79k076m586
10967A04608M839J4818L860N204O947O795N568J5892Q247r836Q635p914j0630
10954A57033j8636J091k891O927m707J947O634J37p834j358r88J789p870J9662
10940A50936J2495o378K856L076k299l203K476n898l299j3612N97m355J2377J430
10926A47199j554K7121J3443n670j6119N157J6052K570n403j324j681o072j0559
10913A63160p442k977J135l203L425J5095o97k618J5053J2991M357L407o806o691
$$ plain form
10899 188189 183648 187298 176567 171644 171894 183860 192363 192193 195057 205190 208062 214773 218972 211374
10885 211374 220957 213451 212909 220855 230794 232571 208193 210069 216215 217795 219722 226775 231668 231367
10871 231367 236502 223750 216961 227360 236574 241151 237477 237783 254320 246868 237067 250457 269228
10858 269228 286371 298583 309577 314441 317705 318517 309778 313428 321285 311125 307584 322143 335841
10845 335841 326489 310370 300459 312859 317042 318230 305539 292414 290248 300980 305767 304839 308909
10832 308909 316061 317956 320583 315378 302410 318397 353905 388830 408412 424667 458228 489519
10820 489519 519874 554207 592633 636425 673815 712639 725290 721539 695728 671431 645438 615556
10808 615556 584405 554870 532989 520215 511862 497412 495136 490390 480040 468031 454617 456382
$$ packed form
10899A88189m541L650j0731m923K50J1966Q503j70K864J0133K872O711M199p598
10885B11374R583p506n42P946R939J777k4378J876O146J580J927P053M893l01
10871B31367N135j2752o789J0399R214M577l674L06J6537p452r801J3390J8771
10858B69228J7143J2212J0994M864L264Q12q739L650P857j0160l541J4559J3698
10845C35841r352j6119r911J2400M183J188j2691j3125k166J0732M787r28M070
10832C08909P152J895K627n205j2968J5987L5508L4925J9582J6255L3561L1291
10820D89519L0355L4333L8426M3792L7390L8824J2651l751k5811k4297k5993k9882
10808F15556l1151k9535k1881j2774q353j4450k276m746j0350j2009j3414J765
$$ plain form
10796 456382 452995 447264 461464 481899 478976 476831 477390 490709 492251 504896 522664 515424 502690
10783 502690 499505 522084 546559 551766 555036 547170 557960 560680 571397 587753 595381 604051 604100
10770 604100 613861 630164 645838 657141 680360 706444 732796 743437 761534 767783 773805 801289
10758 801289 824202 836978 859465 882661 899770 924259 950213 982901 1032657 1076130 1129626
10747 1129626 1180795 1225658 1285804 1357098 1420074 1477813 1560518 1635167 1735401 1850400 1993731
10736 1993731 2169904 2357352 2618028 2974571 3440950 3985388 4450276 4652916 4555049 4339232
10726 4339232 4191456 4180926 4283433 4480493 4758607 5111949 5548533 6048352 6644079 7315193
10716 7315193 8087545 8999305 10096377 11444303 13111822 15187377 17821452 21164754
$$ packed form
10796D56382l387n731J4200K0435k923k145N59J3319J542J2645J7768p240j2734
10783E02690l185K2579K4475N207L270p866J0790K720J0717J6356P628Q670M9
10770F04100R761J6303J5674J1303K3219K6084K6352J0641J8097O249O022K7484
10758H01289K2913J2776K2487K3196J7109K4489K5954L2688M9756M3473N3496
10747A129626N1169M4863O0146P1294O2976N7739Q2705P4649J00234J14999J43331
10736A993731J76173J87448K60676L56543M66379N44438M64888K02640r7867k15817
10726D339232j47776j0530J02507J97060K78114L53342M36584M99819N95727O71114
10716G315193P72352R11760J097072J347926J667519K075555K634075L343302
$$ plain form
10708 21164754 25431222 30865202 37724038 46256719 56609315 68475867 80904956 92105214
10700 92105214 99624980 101413041 97232891 88829327 78597314 68529212 59839225 53044362
10692 53044362 48161243 44959625 43147038 42463148 42757406 43895666 45755789 48274915
10684 48274915 51246731 54379289 57303117 59615798 61130366 61978994 62508764 63184356
10676 63184356 64435564 66592804 69776608 74043632 79335493 85448010 91898611 97842443
10668 97842443 102273471 104362423 103699528 100501968 95530591 89823448 84261135 79421507
10660 79421507 75568027 72685058 70534919 68726623 66757238 64194709 60866899 56961315
10652 56961315 52848028 48918753 45445441 42535565 40272413 38738889 38049627 38305121
$$ packed form
10708B1164754M266468N433980O858836Q532681J0352596J1866552J2429089J1200258
10700I2105214P519766J788061m180150q403564j0232013j0068102q689987o794863
10692E3044362m883119l201618j812587o83890K94258J138260J860123K519126
10684D8274915K971816L132558K923828K312681J514568Q48628N29770O75592
10676F3184356J251208K157240L183804M267024N291861O112517O450601N943832
10668I7842443M431028K088952o62895l197560m971377n707143n562313m839628
10660G9421507l853480k882969k150139j808296j969385k562529l327810l905584
10652E6961315m113287l929275l473312k909876k263152j533524o89262K55494
$$ plain form
10644 38305121 39646330 42258625 46375979 52183199 59770529 68855482 78476896 86857186
10636 86857186 91655039 91151285 85367238 76114219 65682272 55754867 47138510 39974838
10628 39974838 34156139 29460083 25652969 22514109 19898005 17671552 15764178 14117147
10620 14117147 12680419 11431818 10331522 9368677 8514111 7744307 7055424 6449353 5937934
10611 5937934 5469519 5059500 4716218 4416562 4128274 3861899 3642653 3439571 3260460
10602 3260460 3088957 2929585 2775895 2632045 2486775 2368028 2268742 2168849 2073947 1979351
10592 1979351 1900154 1811812 1738488 1660780 1580679 1522657 1470970 1407834 1362412 1318706 1280773
10581 1280773 1232091 1192957 1161489 1126220 1115357 1099636 1078599 1059977 1052853 1044802 1042562 1044963
$$ packed form
10644C8305121J341209K612295M117354N807220P587330R084953R621414Q380290
10636H6857186M797853n03754n784047r253019j0431947r927405q616357p163672
10628C9974838n818699m696056l807114l138860k616104k226453j907374j647031
10620A4117147j436728j248601j100296r62845q54566p69804o88883o06071n11419
10611E937934m68415m10019l43282k99656k88288k66375k19246k03082j79111
10602C260460j71503j59372j53690j43850j45270j18747r9286r9893r4902r4596
10592A979351p9197q8342p3324p7708q0101n8022n1687o3136m5422m3706l7933
10581A280773m8682l9134l1468l5269j0863j5721k1037j8622p124q051k240K401
$$ plain form
10569 1044963 1037661 1020994 994171 961902 947028 912043 883820 895325 917774 912220 850638 805633
10557 805633 790477 767784 745421 730156 697977 673228 659206 649398 637653 632174 624979 616022
10545 616022 618215 609220 588983 571694 556355 543635 535741 527970 528661 532779 534763 525004 510307
10532 510307 523399 547489 560666 576274 567769 566796 569194 567028 571540 586397 573276 559370 562008
10519 562008 548143 526161 524690 510438 493679 495632 508684 489487 465857 445884 429147 407813
10507 407813 392991 388569 370544 365896 359069 347417 351096 364231 375546 383478 389200 408312 429270
10494 429270 425357 415330 417281 417187 409743 397813 368180 338147 302215 279792 272546 281602 268970
10481 268970 259633 261499 257761 256095 270089 290322 293344 285129 299811 328570 354791 402189 474038
$$ packed form
10569A044963p302j6667k6823l2269j4874l4985k8223J1505K2449n554o1582m5005
10557H05633j5156k2693k2363j5265l2179k4749j4022r808j1745n479p195q957
10545F16022K193q995k0237j7289j5339j2720p894p771O91M118J984r759j4697
10532E10307J3092K4090J3177J5608q505r73K398k166M512J4857j3121j3906K638
10519E62008j3865k1982j471j4252j6759J953J3052j9197k3630j9973j6737k1334
10507D07813j4822m422j8025m648o827j1652L679J3135J1315P932N722J9112K0958
10494D29270l913j0027J951r4p444j1930k9633l0033l5932k2423p246R056j2632
10481B68970r337J866l738j666J3994K0233L022q215J4682K8759K6221M7398P1849
$$ plain form
10468 474038 553953 622726 686560 673373 597332 564613 558180 546999 538200 518934 496875 468937
10456 468937 463350 467949 472916 494989 560717 651621 765337 951804 1231018 1700736 2443489
10445 2443489 3414646 4100351 3847338 2927471 2046261 1468313 1135607 968968 854316
10436 854316 756863 675780 626992 604874 577749 559115 560016 568436 559032 542228 511802 495068
10424 495068 473844 460476 438748 422670 426365 461420 478389 473843 474264 491354 523793 519587
10412 519587 510920 504646 492718 470379 454507 451398 463924 473372 500866 503309 505054 504091 501741
10399 501741 509666 497446 494700 499616 486311 487222 494220 503090 504579 511474 515342 507155 509094 514818
10385 514818 541393 556097 578971 610555 640699 664841 676811 723149 787508 840842 885631
$$ packed form
10468D74038P9915O8773O3834j3187p6041l2719o433j1181q799j9266k2059k7938
10456D68937n587M599M967K2073O5728R0904J13716J86467K79214M69718P42753
10445B443489R71157O85705k53013r19867q81210n77948l32706j66639j14652
10436H54316r7453q1083m8788k2118k7125j8634R01Q420r404j6804l0426j6734
10424D95068k1224j3368k1728j6078L695L5055J6969m546M21J7090L2439m206
10412E19587q667o274j1928k2339j5872l109J2526R448K7494K443J745r63k350
10399E01741P925j2220k746M916j3305R11O998Q870J489O895L868q187J939N724
10385E14818K6575J4704K2874L1584L0144K4142J1970M6338O4359N3334M4789
$$ plain form
10374 885631 915939 946678 977971 990700 1015532 1052757 1081222 1111230 1137424 1175317 1219173
10363 1219173 1258759 1278307 1310835 1356590 1416663 1477486 1553046 1635333 1740602 1859075 1978177
10352 1978177 2073004 2136098 2213444 2316870 2458530 2609428 2762235 2917120 3088514 3287662
10342 3287662 3540461 3804314 4085961 4431708 4836078 5323604 5866796 6493079 7208095
10333 7208095 8075245 9189671 10694442 12594319 14559125 16097957 17103134 18065879
10325 18065879 19560665 21831077 24907159 28956365 34364001 41716565 51901516 66461624
10317 66461624 87955277 120657094 171327791 247623627 347493072 434886357 448019673
10310 448019673 378049484 280805321 202230180 149233366 114618004 91525715 75674451
$$ packed form
10374H85631L0308L0739L1293J2729K4832L7225K8465L0008K6194L7893M3856
10363A219173L9586J9548L2528M5755O0073O0823P5560Q2287J05269J18473J19102
10352A978177R4827O3094P7346J03426J41660J50898J52807J54885J71394J99148
10342C287662K52799K63853K81647L45747M04370M87526N43192O26283P15016
10333G208095Q67150J114426J504771J899877J964806J538832J005177R62745
10325A8065879J494786K270412L076082M049206N407636P352564J0184951J4560108
10317F6461624K1493653L2701817N0670697P6295836R9869445Q7393285J3133316
10310D48019673o9970189r7244163p8575141n2996814l4615362k3092289j5851264
$$ plain form
10303 75674451 64581926 56517896 50106928 44460254 39372269 34948958 31341604 28609676
10295 28609676 26531161 24544864 22188880 19601791 17164863 15080057 13383043 12010633
10287 12010633 10888326 9978010 9210100 8543922 7952719 7425424 6973167 6575950 6225922
10278 6225922 5900084 5583191 5298459 5061591 4825954 4590082 4337363 4080047 3850429
10269 3850429 3641750 3469529 3279992 3105332 2948263 2790544 2642375 2506182 2378810
10260 2378810 2247742 2142853 2071709 2010358 1920014 1823051 1740756 1682352 1628152 1573909 1520472
10249 1520472 1493545 1476326 1464493 1489300 1530076 1565127 1580727 1574860 1556724 1518769 1487061
10238 1487061 1438978 1388353 1330188 1274556 1237915 1200261 1159230 1139987 1106394 1087703 1056644
$$ packed form
10303G5674451j1092525q064030o410968n646674n087985m423311l607354k731928
10295B8609676k078515j986297k355984k587089k436928k084806j697014j372410
10287A2010633j122307r10316p67910o66178n91203n27295m52257l97217l50028
10278F225922l25838l16893k84732k36868k35637k35872k52719k57316k29618
10269C850429k08679j72221j89537j74660j57069j57719j48169j36193j27372
10260B378810j31068j04889p1144o1351r0344r6963q2295n8404n4200n4243n3437
10249A520472k6927j7219j1833K4807M0776L5051J5600n867j8136l7955l1708
10238A487061m8083n0625n8165n5632l6641l7654m1031j9243l3593j8691l1059
$$ plain form
10227 1056644 1014863 974320 936425 883140 834070 803729 797358 779665 772240 782896 804112 807405
10215 807405 816418 830049 845216 859257 879294 888520 887245 867220 829445 784107 732384 683248
10203 683248 649991 624169 605912 581695 550505 515138 488977 483998 463244 453595 452982 481245
10191 481245 524937 576471 612232 641783 656143 697244 767556 874850 988896 1077516 1157269
10180 1157269 1218900 1246997 1252581 1215905 1125106 1043908 941621 836115 730603 624778 545704
10169 545704 480715 430685 371965 337101 295609 238538 206243 186213 174503 167522 139127 111065
10157 111065 90221 88717 113604 152075 190540 213951 229283 239042 234115 229214 235991 232447 219083
10144 219083 204440 188479 191874 180608 161402 168805 160038 137292 110555 86982 79633 79980 74031
$$ packed form
10227A056644m1781m0543l7895n3285m9070l0341o371j7693p425J0656K1216L293
10215H07405R013J3631J5167J4041K0037R226j275k0025l7775m5338n1723m9136
10203F83248l3257k5822j8257k4217l1190l5367k6161m979k0754r649o13K8263
10191D81245M3692N1534L5761K9551J4360M1101P0312J07294J14046Q8620P9753
10180A157269O1631K8097N584l6676r0799q1198j02287j05506j05512j05825p9074
10169E45704o4989n0030n8720l4864m1492n7071l2295k0030j1710o981k8395k8062
10157A11065k0844j504K4887L8471L8465K3411J5332R759m927m901O777l544j3364
10144B19083j4643j5961L395j1266j9206P403q767k2746k6737k3573p349L47n949
$$ plain form
10131 74031 62228 49799 54834 70160 78013 81758 79674 86328 102720 119058 123508 119695 127869
10118 127869 130555 127564 129435 135100 128033 129009 138455 131756 133898 120140 106827 102510 99819 97527
10104 97527 88876 89055 110637 131525 139360 139728 136288 117398 115638 105001 100089 108552 117848 126113
10090 126113 127266 132933 133718 133465 141746 150086 145055 139503 142688 136164 113918 100369 98339 96413
10076 96413 82679 80620 75401 59919 64688 80882 92031 101383 104701 108702 115024 118667 117456
10063 117456 119506 128925 135176 142728 145192 151728 150624 136022 128742 129891 130070 137547 131679 125652
10049 125652 114171 106372 103874 97808 95687 109195 114019 119404 121734 118188 105720 117010 124107
10036 124107 124577 125354 131943 143973 143632 142729 142818 139502 154697 178989 236235 331505 499544 736253
$$ packed form
10131G4031j1803j2429N035J5326P853L745k084O654J6392J6338M450l813Q174
10118A27869K686k991J871N665p067R76R446o699K142j3758j3313m317k691k292
10104I7527q651J79K1582K0888P835L68l440j8890j760j0637m912Q463R296Q265
10090A26113J153N667P85k53Q281Q340n031n552L185o524k2246j3549k030j926
10076I6413j3734k059n219j5482M769J6194J1149R352L318M001O322L643j211
10063A17456K050R419O251P552K464O536j104j4602p280J149J79P477n868o027
10049A25652j1481p799k498o066k121J3508M824N385K330l546j2468J1290P097
10036A24107M70P77O589J2030l41r03Q9l316J5195K4292N7246R5270J68039K36709
$$ plain form
10022 736253 813422 621009 391813 261998 212253 185728 145169 137291 145787 168319 167467 169532
10010 169532 152001 125070 98576 90619 85163 78773 71058 68541 61062 60124 51594 26038 16787
9997 16787 21952 18956 15297 27203 31939 29920 26359 41786 55140 58492 48158 45329 48567 49379
9983 49379 49918 39420 38921 16772 16874 17872 21088 14976 20437 32085 44520 59939 63050 68778
9969 68778 70488 55642 31158 22471 31290 41510 37624 25693 30849 35767 48273 46874 53959
9956 53959 55376 70621 56058 38592 34645 30583 31611 31362 34901 44341 46417 39551 46580 36620
9942 36620 31817 33482 33398 20525 12849 13736 16791 21730 26435 29275 25542 25361 35642 53466 45607
9927 45607 38114 42777 60330 66080 56338 55745 47424 38094 24504 24389 46984 53758 45775 57308
$$ packed form
10022G36253P7169j92413k29196j29815m9745k6525m0559p878Q496K2532q52K065
10010A69532j7531k6931k6494p957n456o390p715k517p479r38q530k5556r251
9997A6787N165k996l659J1906M736k019l561J5427J3354L352j0334k829L238Q12
9983D9379N39j0498m99k2149J02R98L216o112N461J1648J2435J5419L111N728
9969F8778J710j4846k4484q687Q819J0220l886j1931N156M918J2506j399P085
9956E3959J417J5245j4563j7466l947m062J028k49L539R440K076o866P029r960
9942C6620m803J665q4j2873p676Q87L055M939M705K840l733j81J0281J7824p859
9927D5607p493M663J7553N750r742n93q321r330j3590j15K2595O774p983J1533
$$ plain form
9913 57308 76095 77232 68486 66459 78849 77259 78812 86782 90770 100346 131977 146800 152880 159239
9899 159239 180513 208174 237693 269512 330347 403829 498113 633029 832350 1127649 1525203
9888 1525203 1931226 2159901 2055724 1706958 1312045 999250 768188 611944 514728 443364
9878 443364 376847 326043 293013 262861 247655 244966 239567 248790 257385 275733 292798 309268
9866 309268 293328 275766 249339 229510 239849 269292 329064 371773 361528 299418 225648 189157
9854 189157 177583 164903 185347 198348 181027 153977 126861 108881 85136 52241 41150 39811
9842 39811 52794 56592 56684 69375 73444 69999 72547 63510 62173 72587 76492 80065 72241 57892
9828 57892 68173 67424 69066 59286 54497 65647 68538 72677 54900 35473 31808 41053 39692 50143
$$ packed form
9913E7308J8787J137q746k027J2390j590J553P970L988R576L1631J4823O080O359
9899A59239K1274K7661K9519L1819O0835P3482R4284J34916J99321K95299L97554
9888A525203M06023K28675j04177l48766l94913l12795k31062j56244r7216p1364
9878D43364o6517n0804l3030l0152j5206k689n399R223Q595J8348J7065J6470
9866C09268j5940j7562k6427j9829J0339K9443N9772M2709j0245o2110p3770l6491
9854A89157j1574j2680K0444J3001j7321k7050k7116j7980k3745l2895j1091j339
9842C9811J2983L798R2J2691M069l445K548r037j337J0414L905L573p824j4349
9828E7892J0281p49J642r780m789J1150K891M139j7777j9427l665R245j361J0451
$$ plain form
9814 50143 52892 45791 53749 57019 61849 55771 45520 34041 21394 20073 40409 43975 48929 53674
9800 53674 40297 33456 41382 54964 55562 47319 32854 37351 46620 35093 34406 38639 31307 36085
9786 36085 45644 34091 26999 22093 30119 26755 35140 51791 58560 48304 36880 45317 39550 24357
9772 24357 27824 37982 47984 45783 54135 68428 63123 43847 39492 39224 38061 38696 42578 37199
9758 37199 33341 28905 34268 38477 42797 39826 32374 21083 14039 12932 21619 30186 25487 16794
9744 16794 23422 22340 26131 22174 25808 22936 20613 28982 46838 55518 46054 44328 40441 40904 28662
9729 28662 32496 36790 51609 58894 60384 64664 63298 57136 41491 36674 33881 38311 39547 32792
9715 32792 37495 39818 48403 41835 34217 28258 14382 17865 16669 15586 17100 34814 49582 63457
$$ packed form
9814E0143K749p101P958L270M830o078j0251j1479j2647j321K0336L566M954M745
9800E3674j3377o841P926J3582N98q243j4465M497R269j1527o87M233p332M778
9786C6085R559j1553p092m906Q026l364Q385J6651O769j0256j1424Q437n767j5193
9772B4357L467J0158J0002k201Q352J4293n305j9276m355k68j163O35L882n379
9758C7199l858m436N363M209M320k971p452j1291p044j107Q687Q567m699q693
9744A6794O628j082L791l957L634k872k323Q369J7856Q680r464j726l887M63j2242
9729B8662L834M294J4819P285J490M280j366o162j5645m817k793M430J236o755
9715C2792M703K323Q585o568p618n959j3876L483j196j083J514J7714J4768J3875
$$ plain form
9701 63457 69945 61785 62231 61905 52845 50552 49157 48714 40389 38171 28787 26083 27480 51332 53843
9686 53843 41942 38331 36762 42855 48583 45794 48730 55267 53194 56879 54147 48203 39505 42768
9672 42768 52723 43727 31803 41421 28246 19115 20258 28219 32109 28895 32737 32526 38036 38707 41738
9657 41738 56879 55314 64158 52811 45352 38304 39373 33821 32484 47816 46283 43403 47376 60843
9643 60843 53494 51959 69693 73313 85421 87405 116629 151699 186340 220204 246211 265181 318066
9630 318066 386908 412574 380674 312904 296354 271817 224694 178121 142043 115905 101762 82754
9618 82754 76244 65163 55093 49173 43805 41431 34901 48598 53655 55791 64228 55050 53932 56565
9604 56565 47650 22511 28911 43638 46408 55849 58943 60522 55537 54295 54151 39911 31787 33006
$$ packed form
9701F3457O488q160M46l26r060k293j395m43q325k218r384k704J397K3852K511
9686E3843j1901l611j569O093N728k789K936O537k073L685k732n944q698L263
9672D2768R955q996j1924R618j3175r131J143P961L890l214L842k11N510O71L031
9657D1738J5141j565Q844j1347p459p048J069n552j337J5332j533k880L973J3467
9643F0843p349j535J7734L620J2108J984K9224L5070L4641L3864K6007J8970N2885
9630C18066O8842K5666l1900o7770j6550k4537m7123m6573l6078k6138j4143j9008
9618H2754o510j1081j0070n920n368k374o530J3697N057K136Q437r178j118K633
9604E6565q915k5139O400J4727K770R441L094J579m985j242j44j4240q124J219
$$ plain form
9590 33006 34686 35711 18136 5733 3379 20998 33134 32670 33419 49372 52175 49545 52659 46394
9576 46394 49474 56539 68304 81134 57177 29279 21044 3209 -3089 7151 18558 16434 17799
9563 17799 29372 39957 35343 41825 32806 32727 29287 36744 38332 42729 39541 35505 31498 37804 39440
9548 39440 41312 41898 43055 43583 41597 45957 53518 42359 36070 34962 37001 42288 51602 68905 55462
9533 55462 43960 38510 24732 14849 13386 27810 26703 18863 31993 40890 50575 58339 49285 40118
9519 40118 31115 27662 23705 28828 52639 63953 50113 48619 43061 48880 48853 39901 36061 43655
9505 43655 40383 42941 30757 25305 32493 40559 32803 30995 30894 38804 49348 62030 56672 47566
9491 47566 41103 52685 69550 64041 58526 38658 39968 47537 45399 41453 43415 55152 54741 49640
$$ packed form
9590C3006J680J025j7575j2403k354J7619J2136m64P49J5953K803k630L114o265
9576D6394L080P065J1765J2830k3957k7898q235j7835o298J0240J1407k124J365
9563A7799J1573J0585m614O482r019p9l440P457J588M397l188m036m007O306J636
9548C9440J872N86J157N28j986M360P561j1159o289j108K039N287R314J7303j3443
9533E5462j1502n450j3778r883j463J4424j107p840J3130Q897R685P764r054r167
9519D0118r003l453l957N123K3811J1314j3840j494n558N819k7q952l840P594
9505D3655l272K558j2184n452P188Q066p756j808j01P910J0544J2682n358r106
9491D7566o463J1582J6865n509n515j9868J310P569k138l946J962J1737m11n101
$$ plain form
9477 49640 60815 61377 71068 73008 65975 54080 44020 42821 62328 74499 70124 71196 72670 69602
9463 69602 63100 48563 54168 61456 63690 65669 65818 61734 49577 62252 73087 66144 52822 50068
9449 50068 53136 65820 65086 70568 55258 54865 63513 67774 75320 71333 51185 46780 57526 70977
9435 70977 58638 57688 35483 25354 29814 47811 63189 68873 72814 64698 63385 49799 41256
9422 41256 53578 74409 70443 76831 74706 70545 70318 54088 51465 55138 54433 59633 62474 68314
9408 68314 64858 59154 50895 55648 58931 53701 57577 67939 62477 72787 73674 85807 79372 72670
9394 72670 72523 83705 95777 98786 85700 82543 87039 82044 78838 77981 90788 89415 73109 61676
9380 61676 51719 59248 74244 82318 73454 64271 58986 56369 56531 61452 64353 63652 61068 64499 58440
$$ packed form
9477D9640J1175N62R691J940p033j1895j0060j199J9507J2171m375J072J474l068
9463F9602o502j4537N605P288K234J979J49m084j2157J2675J0835o943j3322k754
9449E0068L068J2684p34N482j5310l93Q648M261P546l987k0148m405J0746J3451
9435G0977j2339r50k2205j0129M460J7997J5378N684L941q116j313j3586q543
9422D1256J2322K0831l966O388k125m161k27j6230k623L673p05N200K841N840
9408F8314l456n704q259M753L283n230L876J0362n462J0310Q87J2133o435o702
9394G2670j47J1182J2072L009j3086l157M496m995l206q57J2807j373j6306j1433
9380F1676r957P529J4996Q074q864r183n285k617J62M921K901p01k584L431o059
$$ plain form
9365 58440 58883 60587 65516 85745 91536 94142 82639 88021 101577 104876 100069 101505 106371 93581
9351 93581 64028 60480 66082 74911 83012 86589 79584 73868 67082 63720 75675 71340 78088 82599
9337 82599 80540 89987 85751 76161 76738 76549 81990 84194 80693 82373 90953 97695 99961 79468 87700
9322 87700 93788 90604 83777 70264 65271 67511 69286 70160 75322 86956 79031 71834 77347 93991
9308 93991 110176 119121 126167 127862 120936 110602 102467 103949 101703 109457 103805 110644 106644 113468
9294 113468 105038 94340 86524 86046 84491 93922 100517 123023 132087 115897 108142 109236 106853 116653
9280 116653 126572 117238 108739 104158 105672 113355 131664 143691 143227 126366 108697 89935 86926
9267 86926 88418 101991 112849 118038 129916 132122 124536 125703 119254 125430 129953 134054 125277 120861
$$ packed form
9365E8440M43J704M929K0229N791K606j1503N382J3556L299m807J436M866j2790
9351I3581k9553l548N602Q829Q101L577p005n716o786l362J1955m335O748M511
9337H2599k059R447m236r590N77j89N441K204l501J680Q580O742K266k0493Q232
9322H7700O088l184o827j3513m993K240J775Q74N162J1634p925p197N513J6644
9308I3991J6185Q945P046J695o926j0334q135J482k246P754n652O839m000O824
9294A13468q430j0698p816m78j555R431O595K2506R064j6190p755J094k383R800
9280A16653R919r334q499m581J514P683J8309J2027m64j6861j7669j8762l009
9267H6926J492J3573J0858N189J1878K206p586J167o449O176M523M101q777m416
$$ plain form
9253 120861 131996 128234 126561 130616 124385 130125 132192 134747 133488 124573 118878 136049 155051 158258
9239 158258 158543 144492 139736 137856 138649 136512 150050 155868 155090 158897 153370 156653 149268 141223 125648
9224 125648 105899 116596 145256 154741 157823 153497 137577 129549 132075 131897 131054 142029 152744
9211 152744 155291 145998 141875 143643 150433 143564 140409 153440 162899 162114 156985 156745 154567 159935 156673
9196 156673 168560 193368 181924 179184 183703 171696 163606 167877 176913 186388 202337 208069 208350
9183 208350 201187 194491 195770 201586 201813 196733 197571 186689 188809 201434 189166 178734 189729 191436
9169 191436 197497 193295 195591 191627 196381 195689 201061 211460 210413 217907 215933 211864 207465 206867 220029
9154 220029 220606 211945 223426 218748 214385 215589 213082 220838 225817 224154 212044 216439 216048 231453
$$ packed form
9253A20861J1135l762j673M055o231N740K067K555j259q915n695J7171J9002L207
9239A58258K85j4051m756j880P93k137J3538N818p78L807n527L283p385q045j5575
9224A25648j9749J0697K8660R485L082m326j5920q028K526j78q43J0975J0715
9211A52744K547r293m123J768O790o869l155J3031R459p85n129k40k178N368l262
9196A56673J1887K4808j1444k740M519j2007q090M271R036R475J5949N732K81
9183B08350p163o696J279N816K27n080Q38j0882K120J2625j2268j0432J0995J707
9169A91436O061m202K296l964M754o92N372J0399j047P494j974m069m399n98J3162
9154B20029N77q661J1481m678m363J204k507P756M979j663j2110M395l91J5405
$$ plain form
9140 231453 242702 224913 226638 221644 209814 208685 206606 223959 234095 228689 233474 246362 248205
9127 248205 249725 247028 242593 247374 241009 247441 245789 242919 235635 240394 239094 244716 267808 279162
9113 279162 281666 267065 267329 278571 266472 273101 274099 267044 259940 256414 264705 281468 287961 294496
9099 294496 284005 272917 273167 267885 268507 276726 279921 276893 280071 273210 273451 275968 287792 302581
9085 302581 303692 297587 304493 316100 320088 333203 344637 349327 352569 347091 344291 353438 355326 342437
9071 342437 331704 328612 350826 360757 365538 363515 362062 364260 374603 381890 393608 398599 397934 407996
9057 407996 412786 402087 393174 395820 401147 403440 404318 412478 419732 426018 417685 425118 442299 439999
9043 439999 424038 424962 431466 440036 443723 438661 434603 442879 442831 441921 451743 459007 473784 482260 487176
$$ packed form
9140B31453J1249j7789J725m994j1830j129k079J7353J0136n406M785J2888J843
9127B48205J520k697m435M781o365O432j652k870p284M759j300N622K3092J1354
9113B79162K504j4601K64J1242j2099O629R98p055p104l526Q291J6763O493O535
9099B94496j0491j1088K50n282O22Q219L195l028L178o861K41K517J1824J4789
9085C02581J111o105O906J1607L988J3115J1434M690L242n478k800R147J888j2889
9071C42437j0733l092K2214R931M781k023j453K198J0343P287J1718M991o65J0062
9057D07996M790j0699q913K646N327K293Q78Q160P254O286q333P433J7181k300
9043D39999j5961R24O504Q570L687n062m058Q276m8r10R822P264J4777Q476M916
$$ plain form
9028 487176 486261 486360 491039 491510 496051 494727 487176 475459 472081 491445 508387 511624 508234 514923 530232
9013 530232 543627 554258 573214 579385 594067 611845 609548 592192 580200 577753 569870 576115 583635
9000 583635 590052 616128 627818 622912 630884 631738 645767 665382 666841 662593 678395 672906 677040
8987 677040 689464 706001 704539 714095 722823 734227 745345 740757 738323 736229 752979 770536 786720
8974 786720 780446 786502 811423 823636 812358 808987 821566 826589 833869 846709 851153 877448 901878
8961 901878 917779 909847 914898 926464 939433 958788 981622 995578 997168 1020236 1037318 1052168
8949 1052168 1055756 1058314 1079728 1093300 1101331 1129021 1146535 1155908 1176436 1179576 1181259 1195669 1205769
8936 1205769 1201945 1203372 1232544 1265374 1283975 1306684 1314172 1329847 1357202 1372426 1384311 1397901
$$ packed form
9028D87176r15R9M679M71M541j324p551j1717l378J9364J6942L237l390O689J5309
9013E30232J3395J0631J8956O171J4682J7778k297j7356j1992k447p883O245P520
9000E83635O417K6076J1690m906P972Q54J4029J9615J459m248J5802n489M134
8987F77040J2424J6537j462R556Q728J1404J1118m588k434k094J6750J7557J6184
8974G86720o274O056K4921J2213j1278l371J2579N023P280J2840M444K6295K4430
8961I01878J5901p932N051J1566J2969J9355K2834J3956J590K3068J7082J4850
8949A052168L588K558K1414J3572Q031K7690J7514R373K0528L140J683J4410J0100
8936A205769l824J427K9172L2830J8601K2709P488J5675K7355J5224J1885J3590
$$ plain form
8924 1397901 1433223 1458690 1463455 1488640 1506946 1527748 1551140 1586299 1609786 1640216 1667490 1690168
8912 1690168 1730797 1761563 1776654 1791410 1806577 1841800 1880440 1918203 1954757 1989993 2027152
8901 2027152 2069537 2113144 2145360 2194159 2235523 2264901 2307668 2363403 2405317 2437934 2491886
8890 2491886 2539059 2594303 2668890 2739369 2793536 2854176 2913846 2960115 3006697 3073987 3147697
8879 3147697 3226283 3294307 3345085 3405111 3489210 3582779 3667364 3763778 3843576 3921538 4007483
8868 4007483 4110363 4216155 4333697 4460686 4567337 4686498 4813909 4952445 5094910 5237635
8858 5237635 5380690 5530262 5693876 5859768 6037361 6217728 6400085 6586701 6793285 7002083
8848 7002083 7223582 7456530 7697490 7931006 8193047 8478958 8761070 9064058 9385469 9719835
$$ packed form
8924A397901L5322K5467M765K5185J8306K0802K3392L5159K3487L0430K7274K2678
8912A690168M0629L0766J5091J4756J5167L5223L8640L7763L6554L5236L7159
8901B027152M2385M3607L2216M8799M1364K9378M2767N5735M1914L2617N3952
8890B491886M7173N5244P4587P0479N4167O0640N9670M6269M6582O7290P3710
8879C147697P8586O8024N0778O0026Q4099R3569Q4585R6414P9798P7962Q5945
8868D007483J02880J05792J17542J26989J06651J19161J27411J38536J42465J42725
8858E237635J43055J49572J63614J65892J77593J80367J82357J86616K06584K08798
8848G002083K21499K32948K40960K33516K62041K85911K82112L02988L21411L34366
$$ plain form
8838 9719835 10065135 10432133 10802850 11187829 11604517 12056984 12527231 13024718 13525990 14039428
8828 14039428 14602060 15190821 15800747 16444433 17114516 17815626 18546774 19299246 20079713
8819 20079713 20894780 21736868 22604345 23513738 24441196 25389096 26349695 27333374 28327287
8810 28327287 29326527 30310293 31274379 32240541 33174209 34065361 34901912 35679068 36374923
8801 36374923 36970652 37470299 37888621 38188329 38386651 38456614 38403505 38238329 37961373 37586309
8791 37586309 37133823 36557980 35895460 35171596 34389155 33540077 32639597 31722902 30792929
8782 30792929 29839694 28875115 27915749 26978117 26051338 25124285 24209799 23318191 22448772
8773 22448772 21607466 20815301 20043064 19287037 18567211 17874852 17212233 16571402 15949193
$$ packed form
8838I719835L45300L66998L70717L84979M16688M52467M70247M97487N01272N13438
8828A4039428N62632N88761O09926O43686O70083P01110P31148P52472P80467
8819B0079713Q15067Q42088Q67477R09393R27458R47900R60599R83679R93913
8810B8327287R99240R83766R64086R66162R33668Q91152Q36551P77156O95855
8801C6374923N95729M99647M18322K99708J98322O9963n3109j65176k76956l75064
8791C7586309m52486n75843o62520p23864p82441q49078r00480r16695r29973
8782C0792929r53235r64579r59366r37632r26779r27053r14486q91608q69419
8773B2448772q41306p92165p72237p56027p19826o92359o62619o40831o22209
$$ plain form
8764 15949193 15349293 14791887 14254046 13744713 13265599 12802936 12363530 11921485 11491246
8755 11491246 11076079 10695896 10328115 9976492 9639573 9311318 9007693 8726009 8436594
8746 8436594 8164409 7915072 7668578 7426252 7180595 6959036 6755349 6551552 6361058 6193856
8736 6193856 6029256 5854381 5681117 5532239 5387263 5245559 5091932 4952302 4823547 4700794
8726 4700794 4585788 4481540 4365595 4264456 4174724 4082397 3983710 3906156 3837687 3771215 3681025
8715 3681025 3590098 3490768 3394457 3310192 3229245 3160372 3095348 3030387 2969052 2900625 2842327
8704 2842327 2789903 2725018 2674061 2628487 2575736 2515948 2469328 2425293 2375785 2319750 2269189
8693 2269189 2226006 2195855 2161296 2126324 2073751 2031863 2004503 1974296 1949654 1927226 1880959
$$ packed form
8764A5949193n99900n57406n37841n09333m79114m62663m39406m42045m30239
8755A1491246m15167l80183l67781l51623l36919l28255l03625k81684k89415
8746H436594k72185k49337k46494k42326k45657k21559k03687k03797j90494j67202
8736F193856j64600j74875j73264j48878j44976j41704j53627j39630j28755j22753
8726D700794j15006j04248j15945j01139q9732r2327r8687p7554o8469o6472r0190
8715C681025r0927r9330r6311q4265q0947o8873o5024o4961o1335o8427n8298
8704B842327n2424o4885n0957m5574n2751n9788m6620m4035m9508n6035n0561
8693B269189m3183l0151l4559l4972n2573m1888k7360l0207k4642k2428m6267
$$ plain form
8682 1880959 1839893 1801585 1767541 1745982 1706137 1673903 1647598 1624433 1607025 1590013 1573280
8671 1573280 1547194 1520560 1494415 1468837 1441255 1430490 1419567 1396265 1370371 1345257 1327063
8660 1327063 1320278 1309733 1284006 1262681 1219023 1185477 1185284 1170003 1146617 1145563 1129726 1102112
8648 1102112 1082024 1079237 1053445 1023139 1025043 1011392 992516 979780 970884 955284 925409 917044
8636 917044 910762 887944 885492 881072 864366 863657 866602 849159 845198 842024 834069 823692 802002
8623 802002 772442 748980 752361 759378 753780 740387 715140 708349 701931 714130 714250 690791 679694
8610 679694 658314 650676 645402 628499 632308 638463 641674 643546 623077 594911 580556 591672 595566
8597 595566 595035 581975 575380 595705 603690 584750 582836 585369 562130 551458 545111 554522 564091
$$ packed form
8682A880959m1066l8308l4044k1559l9845l2234k6305k3165j7408j7012j6733
8671A573280k6086k6634k6145k5578k7582j0765j0923k3302k5894k5114j8194
8660A327063o785j0545k5727k1325m3658l3546j93j5281k3386j054j5837k7614
8648A102112k0088k787k5792l0306J904j3651j8876j2736q896j5600k9875q365
8636I17044o282k2818k452m420j6706p09K945j7443l961l174p955j0377k1690
8623H02002k9560k3462L381P017n598j3393k5247o791o418J2199J20k3459j1097
8610F79694k1380p638n274j6903L809O155L211J872k0469k8166j4355J1116L894
8597E95566n31j3060o595K0325P985j8940j914K533k3239j0672o347R411R569
$$ plain form
8584 564091 556320 549427 547614 548201 552407 550680 555979 558074 547105 537815 550286 548492 528698 520362
8570 520362 516310 497404 479998 472619 470391 463338 454594 441726 443676 442698 442192 435875 436630 434017
8556 434017 449407 442719 429433 421673 414539 411027 411873 405596 397260 380234 369628 383254 403869
8543 403869 409162 414025 410140 389948 380489 375225 368435 360739 359950 359145 351739 339097 324032 323480
8529 323480 330830 326864 309543 304872 309679 316519 315713 324433 322536 323094 318674 319191 325329 319269 309720
8514 309720 312558 307245 308576 299075 304080 298286 306007 300751 272932 263139 272610 295706 298392 296888
8500 296888 296567 287264 280327 275384 266355 253588 245308 255833 265462 254717 254929 254656 254599 245953 254121
8485 254121 257878 249930 245982 245203 249727 236253 233910 226571 214820 216059 213571 204154 199115 197969
$$ packed form
8584E64091p771o893j813N87M206j727N299K095j0969r290J2471j794j9794q336
8570E20362m052j8906j7406p379k228p053q744j2868J950r78n06o317P55k613
8556D34017J5390o688j3286p760p134l512Q46o277q336j7026j0606J3626K0615
8543D03869N293M863l885k0192r459n264o790p696p89q05p406j2642j5065n52
8529C23480P350l966j7321m671M807O840q06Q720j897N58m420N17O138o060r549
8514C09720K838n313J331r501N005n794P721n256k7819r793R471K3096K686j504
8500B96888l21r303o937m943r029j2767q280J0525R629j0745K12k73n7q646Q168
8485B54121L757p948l948p79M524j3474k343p339j1751J239k488r417n039j146
$$ plain form
8471 197969 197866 207208 199148 190446 186794 177113 174222 184984 200441 196760 193716 196529 186610 181580
8457 181580 182265 170402 157494 158408 162300 172397 189179 189349 189215 191288 180129 172306 178265 181519
8443 181519 185755 177201 163488 153180 151658 156744 166024 172329 181407 178425 173935 166835 167741 170668
8429 170668 161173 139120 130714 145038 158019 179922 176053 162823 164769 168813 172736 154533 139555
8416 139555 131220 131143 118090 115420 118811 124838 145708 170821 172979 167937 155915 151587 142529 127472
8402 127472 124767 134632 124528 124771 135338 133689 124463 122928 121940 127255 131230 127594 127844 121081 113270
8387 113270 115661 123132 129547 129283 129911 128507 122733 134442 140032 140385 127910 126350 122966 126137 107370
8372 107370 110202 130727 135853 129064 123208 123373 119090 104618 105064 110049 120360 120781 122075 117126
$$ packed form
8471A97969j03R342q060q702l652r681k891J0762J5457l681l044K813r919n030
8457A81580O85j1863j2908R14L892J0097J6782J70j34K073j1159p823N959L254
8443A81519M236q554j3713j0308j522N086R280O305R078k982m490p100R06K927
8429A70668r495k2053q406J4324J2981K1903l869j3230J946M044L923j8203j4978
8416A39555q335p7j3053k670L391O027K0870K5113K158n042j2022m328r058j5057
8402A27472k705R865j0104K43J0567j649r226j535r88N315L975l636K50o763p811
8387A13270K391P471O415k64O28j404n774J1709N590L53j2475j560l384L171j8767
8372A07370K832K0525N126o789n856J65m283j4472M46M985J0311M21J294m949
$$ plain form
8358 117126 100932 96763 108005 108162 112710 115393 113473 113659 123897 114749 115473 124531 125209 122838 130268
8343 130268 132347 120555 111898 113858 108996 108052 107717 122942 140647 143974 137475 139691 146297 140325
8329 140325 138232 154031 160942 168194 191372 215140 254929 321664 426509 572771 771825 967561
8317 967561 1002426 843004 626751 457329 336193 263415 222268 209852 203590 191861 186112
8306 186112 173356 162016 151657 138165 134674 144407 140474 129274 109810 109690 123077 133086 137988
8293 137988 146088 160019 147718 141336 142037 141930 140654 162861 186599 202832 242168 323611 448457
8280 448457 646453 890156 1005201 895528 674048 484703 354873 271025 227787 194758
8270 194758 166580 156195 160241 147365 138990 133513 129416 126537 104437 97813 89755 105259 120980
$$ packed form
8358A17126j6194m169J1242J57M548K683j920J86J0238r148P24R058O78k371P430
8343A30268K079j1792q657J960m862r44l35J5225J7705L327o499K216O606n972
8329A40325k093J5799O911P252K3178K3768L9789O6735J04845J46262J99054J95736
8317I67561L4865j59422k16253j69422j21136p2778m1147j2416o262j1729n749
8306A86112j2756j1340j0359j3492l491R733l933j1200j9464j20J3387J0009M902
8293A37988Q100J3931j2301o382P01j07j276K2207K3738J6233L9336Q1443J24846
8280D48457J97996K43703J15045j09673k21480j89345j29830q3848m3238l3029
8270A94758k8178j0385M046j2876q375n477m097k879k2100o624q058J5504J5721
$$ plain form
8257 120980 110150 108959 109042 106362 100453 93020 90587 83497 92691 94008 85778 78901 74182 69385 67268
8242 67268 59101 61366 43693 29316 36329 55774 59342 56968 58540 53349 48694 54999 59019 63286
8228 63286 67898 54818 46251 36192 34849 47855 55092 65775 70748 62375 56520 61377 54998 61087
8214 61087 67416 77202 86891 80134 86901 75653 56622 61143 70065 68044 57324 62245 65918 74361
8200 74361 71854 65069 61850 48239 42038 50499 49245 46304 45367 47735 51216 51814 42864 40403 47667
8185 47667 53898 59154 61058 62876 60100 60773 66072 69081 64381 52615 39409 41096 63315 66239
8171 66239 57244 49436 44834 37447 34458 48667 44922 42508 43215 62609 76494 76331 77413 68680
8157 68680 55550 38973 28496 32657 38832 50870 46785 40607 32486 38780 54571 64230 69747
$$ packed form
8257A20980j0830j191Q3k680n909p433k433p090R194J317q230o877m719m797k117
8242F7268q167K265j7673j4377P013J9445L568k374J572n191m655O305M020M267
8228F3286M612j3080q567j0059j343J3006P237J0683M973q373n855M857o379O089
8214F1087O329R786R689o757O767j1248j9031M521Q922k021j0720M921L673Q443
8200G4361k507o785l219j3611o201Q461j254k941r37K368L481N98q950k461P264
8185D7667O231N256J904J818k776O73N299L009m700j1766j3206J687K2219K924
8171F6239q995p808m602p387k989J4209l745k414P07J9394J3885j63J082q733
8157F8680j3130j6577j0477M161O175J2038m085o178q121O294J5791R659N517
$$ plain form
8144 69747 54407 47648 39678 39332 45085 35825 32537 38421 52264 61702 59498 43184 25214 24285
8130 24285 36168 29586 30105 42934 49430 41561 32287 34295 29136 25400 37358 47023 44365 35035
8116 35035 22108 31808 42208 50468 53765 52430 50394 49104 45511 42107 37914 42079 30831 16732
8102 16732 5613 27947 44702 44480 31909 41315 44683 26144 24835 26289 33938 40665 40458 41026
8088 41026 41536 39429 33841 26901 34926 20698 15358 27358 27687 22349 27194 35010 23698 16180
8074 16180 16291 13711 13493 23815 29635 24857 22345 16736 14983 17133 19375 26548 20084 5447 -8552
8059 -8552 -9523 -905 16648 40873 56416 70807 78052 65279 52354 47176 49327 56665 52163 41947
8045 41947 46663 45085 32668 25921 26072 27177 25183 29077 33624 37826 30087 21943 6166 -3310
$$ packed form
8144F9747j5340o759p970l46N753r260l288N884J3843R438k204j6314j7970r29
8130B4285J1883o582N19J2829O496p869r274K008n159l736J1958R665k658r330
8116C5035j2927R700J0400Q260L297j335k036j290l593l404m193M165j1248j4099
8102A6732j1119K2334J6755k22j2571R406L368j8539j309J454P649O727k07N68
8088D1026N10k107n588o940Q025j4228n340J2000L29n338M845P816j1312p518
8074A6180J11k580k18J0322N820m778k512n609j753K150K242P173o464j4637j3999
8059h552r71Q618J7553K4225J5543J4391P245j2773j2925n178K151P338m502j0216
8045D1947M716j578j2417o747J51J105j994L894M547M202p739q144j5777r476
$$ plain form
8031 -3310 -1896 4975 12960 6082 8279 17534 25758 31838 12361 13371 33210 39371 20686 21182
8017 21182 28547 37702 29114 19292 8951 16766 32837 37024 50209 58785 59727 53327 48041 50336
8003 50336 46762 44164 29337 17196 9414 10015 12051 14992 6122 1708 1788 -4178 826 6453 12740
7988 12740 25326 42176 46874 40695 26446 8764 8313 21559 24784 9781 -2659 1329 9557
7975 9557 11032 26937 29084 19513 7576 1163 9364 22376 34359 36385 30661 15273 15566 10980
7961 10980 15589 28280 24086 6188 -9784 -15141 -12365 -19350 -9111 12321 11310 13588 18706
7948 18706 7342 27342 34823 26046 18536 16757 3547 3944 17504 25508 39630 48280 38875 41412
7934 41412 44083 36602 22382 21832 18617 26233 43202 47841 35763 22697 22840 16467 4138 4216
$$ packed form
8031c310J414O871P985o878K197R255Q224O080j9477J010J9839O161j8685M96
8017B1182P365R155q588r822j0341P815J6071M187J3185Q576R42o400n286K295
8003E0336l574k598j4827j2141p782O01K036K941q870m414Q0n966N004N627O287
7988A2740J2586J6850M698o179j4249j7682m51J3246L225j5003j2440L988Q228
7975I557J475J5905K147r571j1937o413Q201J3012J1983K026n724j5388K93m586
7961A0980M609J2691m194j7898j5972n357K776o985J0239K1432j011K278N118
7948A8706j1364K0000P481q777p510j779j3210L97J3560Q004J4122Q650r405K537
7934D1412K671p481j4220n50l215P616J6969M639j2078j3066J43o373j2329P8
$$ plain form
7920 4216 12794 17925 3920 13803 29984 41847 37836 33676 30106 12787 14387 20842 21688 24058
7906 24058 30401 41078 45735 48061 47847 53000 47163 37532 41507 50945 49538 40247 36397 23040
7892 23040 22539 28665 24373 15735 15149 16965 22215 25007 30535 29435 12141 13780 21517 14824 21553
7877 21553 17751 18020 13216 4235 -12345 -15907 -14806 -5704 2783 1169 1013 -4132 1735 20018 19685
7862 19685 -9471 -9686 4520 17342 16867 10742 11808 26726 26641 25633 33209 35523 33288 26597 17411
7847 17411 16793 9846 11958 27514 16368 20542 40551 38687 31228 27253 27325 21976 22171 15758 12452
7832 12452 2519 4597 10027 12142 10053 24747 28189 30101 34349 36297 20020 8167 10762 3268
7818 3268 3706 6366 899 2522 7391 -1869 -5997 2281 -14612 -18754 -6266 3238 -3780 7000
$$ packed form
7920D216Q578N131j4005R883J6181J1863m011m160l570j7319J600O455Q46K370
7906B4058O343J0677M657K326k14N153n837r631L975R438j407r291l850j3357
7892B3040n01O126m292q638n86J816N250K792N528j100j7294J639P737o693O729
7877B1553l802K69m804q981j6580l562J101R102Q487j614j56n145N867J8283l33
7862A9685k9156k15J4206J2822m75o125J066J4918q5j008P576K314k235o691r186
7847A7411o18o947K112J5556j1146M174K0009j864p459l975P2n349J95o413l306
7832A2452r933K078N430K115k089J4694L442J912M248J948j6277j1853K595p494
7818C268M38K660n467J623M869r260m128Q278j6893m142J2488R504p018J0780
$$ plain form
7804 7000 21327 33296 29264 32279 30774 33312 21956 4488 8764 9546 4148 283 -6938 -8016
7790 -8016 5008 19524 18646 6116 10472 9650 3116 6132 7650 14589 25526 21535 8593 -12043
7776 -12043 -4318 1261 11700 11020 5886 13730 8302 -4535 -11877 -18739 -11463 -3321 4304 2091
7762 2091 2983 -315 15249 28954 17676 -3503 -2596 4101 -17161 -8099 10273 15738 26932 28684
7748 28684 15494 -199 3780 2704 1367 2198 -4876 6009 15974 12281 23485 35377 24393
7735 24393 29864 30642 21708 16727 -2462 -3271 13803 17063 20971 24989 16012 16383 23142 27753 31399
7720 31399 20444 19546 8523 1381 805 -188 -10084 -20887 -20185 -20046 -7317 -10342 944 7190 13714
7705 13714 16078 15474 1384 1937 -6491 -15225 -1239 14988 19334 14556 862 -10586 -7178 -3694
$$ packed form
7804G000J4327J1969m032L015j505K538j1356j7468M276P82n398l865p221j078
7790h016J3024J4516q78j2530M356q22o534L016J518O939J0937l991j2942k0636
7776a2043P725N579J0439o80n134P844n428j2837p342o862P276Q142P625k213
7762B091Q92l298J5564J3705j1278k1179R07O697k1262R062J8372N465J1194J752
7748B8684j3190j5693L979j076j337Q31p074J0885R965l693J1204J1892j0984
7735B4393N471P78q934m981j9189q09J7074L260L908M018q977L71O759M611L646
7720C1399j0955q98j1023p142n76r93r896j0803P02J39J2729l025J1286O246O524
7705A3714K364o04j4090N53q428q734J3986J6227M346m778j3694j1448L408L484
$$ plain form
7691 -3694 3186 5504 19318 19296 5189 5142 10656 8488 -11445 -11377 2281 -1570 -9794 -14355 -6215
7676 -6215 3662 4041 4874 20543 24678 14626 5237 3808 -7197 -14773 2390 5132 -16021 -21365
7662 -21365 -26817 -35361 -15416 13683 23091 17498 16061 11953 5397 6205 7874 9044 -1138 -9589
7648 -9589 6659 7033 -138 1635 7413 4902 -4497 -7820 -3458 3535 -13052 -21319 -12790 2490
7634 2490 12281 13371 10321 5957 525 10268 17997 11115 10001 11225 -285 -7099 -9794 57 7406
7619 7406 -2067 8384 9438 -18 2425 8670 13930 1245 -4398 -2902 -13617 -1531 8448 -3187
7605 -3187 -7605 2765 3845 6288 11183 -3246 -16823 -7597 2606 8085 11849 22748 33502
7592 33502 34029 28694 10512 -6945 -19272 -26431 -26463 -15294 -15233 -3665 -14535 -18720 -25456 -27853
$$ packed form
7691c694O880K318J3814k2j4107m7N514k168j9933O8J3658l851q224m561Q140
7676f215R877L79Q33J5669M135j0052r389j429j1005p576J7163K742k1153n344
7662b1365n452q544J9945K9099R408n593j437m108o556Q08J669J170j0182q451
7648i589J6248L74p171J773N778k511r399l323M362O993j6587q267Q529J5280
7634B490R791J090l050m364n432R743P729o882j114J224j1510o814k695R851P349
7619G406r473J0451J054r456K443O245N260j2685n643J496j0715J2086R979j1635
7605c187m418J0370J080K443M895j4429j3577R226J0203N479L764J0899J0754
7592C3502N27n335j8182j7457j2327p159l2J1169O1J1568j0870m185o736k397
$$ plain form
7578 -27853 -13632 -2469 -6957 -19800 -14417 -13023 -6249 -2560 -10936 131 -2177 -836 -3520 -1914
7564 -1914 3157 -708 -438 1073 -774 -7299 -11262 -3722 -9878 -4988 3386 13145 13931 11783 16244
7549 16244 17666 15520 12137 24651 20813 20232 14979 5671 4421 4482 1996 3790 -550 3774 -1818
7534 -1818 665 -3758 -10668 -9634 -11186 -10571 -11341 -25598 -27258 -3601 3110 -15340 -30956 -39607
7520 -39607 -28254 -15391 -4223 -6476 -3829 -14516 -24465 -26633 -26513 -19413 -14864 -12451 -15165 -25897
7506 -25897 -5079 3510 -2164 1310 4237 -1197 2549 6041 -10437 -17618 -24010 -24496 -19574 -26506
7492 -26506 -28512 -34159 -38485 -32863 -13078 -9824 -7011 -146 -1000 5664 -3545 9202 13575 12509
7478 12509 12507 -975 -7923 -6170 -18550 -16278 609 7905 9714 -187 4129 10916 10805 11663 15297
$$ packed form
7578b7853J4221J1163m488j2843N383J394O774L689q376J1067k308J341k684J606
7564a914N071l865K70J511j847o525l963P540o156M890Q374R759P86k148M461
7549A6244J422k146l383J2514l838n81n253r308j250O1k486J794m340M324n592
7534a818K483m423o910J034j552O15p70j4257j660K3657O711j8450j5616q651
7520c9607J1353J2863J1168k253K647j0687r949k168J20P100M549K413k714j0732
7506b5897K0818Q589n674L474K927n434L746L492j6478p181o392m86M922o932
7492b6506k006n647m326N622J9785L254K813O865q54O664r209J2747M373j066
7478A2509kj3482o948J753j2380K272J6887P296J809r901M316O787j11Q58L634
$$ plain form
7463 15297 25348 21277 7100 -6418 -14585 -26260 -19503 5659 18646 -1855 -12228 -931
7451 -931 -5428 -873 4184 2134 2522 -6237 -5072 -6828 -1099 2136 -7220 -17771 -7005 -4496 -904
7436 -904 -6763 -20071 -20173 -20502 -15134 -11948 -6783 4003 3908 10755 12326 -990 -8129 -2767 -8879
7421 -8879 -13066 -21706 -10673 -1445 4578 4013 -4289 -10523 -12647 -4892 8970 18281 6152 3875
7407 3875 11278 5212 -9382 -1787 723 7430 10938 -484 -6497 -9895 -9651 -4158 -1407 -10268 -12329
7392 -12329 -12360 10493 3504 -6154 -11285 -13299 -12034 -3132 6496 -11127 -9283 -3020 -6490 4594
7378 4594 9777 1028 -5303 -6432 -14026 -23611 -24743 -19044 -13873 -6077 -4600 2746 12976 17100 12091
7363 12091 11935 12306 -620 -3491 -7934 -7927 -14616 -7334 -9802 -16968 -11420 -13417 -13387 -7730 -5343 -10229
$$ packed form
7463A5297J0051m071j4177j3518q167j1675O757K5162J2987k0501j0373J1297
7451i31m497M555N057k050L88q759J165j756N729L235r356j0551J0766K509L592
7436i04n859j3308j02l29N368L186N165J0786r5O847J571j3316p139N362o112
7421h879m187q640J1033R228O023n65q302o234k124P755J3862R311j2129k277
7407C875P403o066j4594P595K510O707L508j1422o013l398K44N493K751q861k061
7392a2329l1K2853o989r658n131k014J265Q902R628j7623J844O263l470J1084
7378D594N183q749o331j129p594r585j132N699N171P796J477P346J0230M124n009
7363A2091j56L71j2926k871m443Po689P282k468p166N548j997L0N657K387m886
$$ plain form
7347 -10229 -13539 -6888 2236 -10827 -28843 -26146 -30487 -36360 -15668 -2697 -2790 5269 12416 23104
7333 23104 18232 3394 -9332 -19168 -10467 -353 -3254 -12075 -19800 -23278 -20190 -25225 -18971 -12075
7319 -12075 -19086 -19765 -13452 -2634 991 -11461 -17726 1836 6049 14203 14724 -1262 -7898 -5793
7305 -5793 3328 10755 21009 20024 22415 10669 -4870 -15211 -18138 -19792 -1411 12158 4014 1289
7291 1289 2911 3861 -12018 -15440 -9600 -9149 -17284 -14689 -21217 -28940 -16618 -6385 -4483 -5127 -10106
7276 -10106 -11083 -15674 -28477 -9645 -5308 -7038 -9830 -11900 -3850 -154 -15242 1539 -10743 -10307
7262 -10307 3437 -2673 -10149 -16826 -15294 -9255 -15141 -13946 -2945 -2234 -7405 2818 -6762 -24398
7248 -24398 -27790 -13856 -4571 -8151 -10359 -1271 -1804 -9193 -29916 -36986 -39094 -22395 -13995 -22887
$$ packed form
7347a0229l310O651R124j3063j8016K697m341n873K0692J2971r3Q059P147J0688
7333B3104m872j4838j2726r836Q701J0114k901q821p725l478L088n035O254O896
7319a2075p011o79O313J0818L625j2452o265J9562M213Q154N21j5986o636K105
7305e793R121P427J0254r85K391j1746j5539j0341k927j654J8381J3569q144k725
7291A289J622R50j5879l422N840M51q135K595o528p723J2322J0233J902o44m979
7276a0106r77m591j2803J8832M337j730k792k070Q050L696j5088J6781j2282M36
7262a0307J3744o110p476o677J532O039n886J195J1001P11n171J0223r580j7636
7248b4398l392J3934R285l580k208R088n33p389k0723p070k108J6699Q400q892
$$ plain form
7234 -22887 -18381 -13440 -13218 -20059 -33731 -29592 -16805 -12120 -17409 -17699 -13415 -8877 -2278 -1607 6239
7219 6239 17172 5629 -5123 -3733 539 1659 -1231 -11817 -26855 -36721 -41985 -24667 3087
7206 3087 14326 16104 12660 13347 7673 7853 530 -5678 -8717 -8678 -5121 -5462 -7980 -12052 -21703 -26064
7190 -26064 -10555 -5238 -2163 -15298 -21176 -4852 3956 -614 -1842 1758 4500 8721 6334 3041
7176 3041 337 15162 28595 7442 -133 -1920 6730 3791 -641 16425 20216 14911 8253 2457
7162 2457 832 -1178 -2216 -12829 -17254 -11434 -12211 1218 3782 4283 12001 13092 -1984 -2867 -75
7147 -75 -2266 -1667 1679 -13862 -9486 996 -5182 -2391 -13700 -14592 -8206 -8130 6180 7648 -5584
7132 -5584 -12205 -10413 -7322 7429 11549 19024 17761 6846 5861 3585 -9384 -20273 -15407 -17181
$$ packed form
7234b2887M506M941K22o841j3672M139J2787M685n289k90M284M538O599O71P846
7219F239J0933j1543j0752J390M272J120k890j0586j5038r866n264J7318K7754
7206C087J1239J778l444O87n674J80p323o208l039L9L557l41k518m072r651m361
7190b6064J5509N317L075j3135n878J6324Q808m570j228L600K742M221k387l293
7176C041k704J4825J3433k1153p575j787Q650k939m432J7066L791n305o658n796
7162B457j625k010j038j0613m425N820p77J3429K564N01P718J091j5076q83K792
7147g5k191N99L346j5541M376J0482o178K791j1309q92O386P6J4310J468j3232
7132e584o621J792L091J4751M120P475j263j0915r85k276j2969j0889M866j774
$$ plain form
7118 -17181 -12904 -17555 -14261 -11916 -5471 13 4682 -6624 -9442 -19537 -18707 -15755 -7653 -3247
7104 -3247 -8481 -19867 -20934 -16133 -20166 -27852 -20376 -19355 -33689 -37586 -29532 -35098 -39834 -41800
7090 -41800 -38055 -29092 -31744 -26479 -15481 -3515 -2985 -17229 -26851 -18717 -22372 -30208 -22454 -11753
7076 -11753 -5442 -12088 -12135 -1422 -147 -93 -5189 -10360 -9982 -9925 -21973 -12749 -7510 -3713 -264 7741
7060 7741 2149 -4951 3930 539 -4993 -6296 -13370 -20969 -13573 -1194 12245 17489 14506 8960
7046 8960 3852 11061 404 -13233 -19498 -29739 -19342 -9140 3585 2922 10936 -1450 -3311
7033 -3311 -16703 -22345 -25514 -14027 776 4096 -6377 -4604 -17868 -19844 -12425 -481 7992
7020 7992 7336 5902 3446 -116 -6247 -11577 3355 2164 2337 2410 2923 15797 -891 -12282 -7918
$$ packed form
7118a7181M277m651L294K345O445N484M669j1306k818j0095Q30K952Q102M406
7104c247n234j1386j067M801m033p686P476J021j4334l897Q054n566m736j966
7090d1800L745Q963k652N265J0998J1966N30j4244r622Q134l655p836P754J0701
7076a1753O311o646m7J0713J275N4n096n171L78N7j2048R224N239L797L449Q005
7060G741n592p100Q881l391n532j303p074p599P396J2379J3439N244k983n546
7046H960n108P209j0657j3637o265j0241J0397J0202J2725o63Q014j2386j861
7033c311j3392n642l169J1487J4803L320j0473J773j3264j976P419J1944Q473
7020G992o56j434k456l562o131n330J4932j191J73P3N13J2874j6688j1391M364
$$ plain form
7005 -7918 -7768 -22025 -30670 -10179 7816 9082 14580 9193 -17803 -32501 -25644 -24758 -18901 -20257
6991 -20257 -17721 -17489 -9380 12787 15714 13878 -4058 -14103 2568 7687 -19 -14884 -26725
6978 -26725 -24507 -28264 -42714 -33114 -26747 -83 918 -3611 3418 129 12682 289 -12547
6965 -12547 -5239 4498 -5864 -10553 -6577 5059 7147 6858 532 9028 4143 3339 -1079 -8319 -2209
6950 -2209 907 -8016 -9124 906 10273 18911 8598 1757 -487 5012 11472 3315 -11367 -16812
6936 -16812 -19724 -13567 -5378 457 -3949 10407 4540 -750 -2314 830 -5787 -10580 -13911 -14152 -12726
6921 -12726 -2303 -434 -3375 -5830 -9197 -2092 -1722 -2212 -5569 4434 8873 10471 554 2851 19623
6906 19623 20536 1691 -27643 -40593 -33396 184 14698 -6018 -10520 -13450 -3100 612 2062
$$ packed form
7005g918J50j4257q645K0491J7995J266N498n387k6996j4698O857Q86N857j356
6991b0257K536K32Q109K2167K927j836j7936j0045J6671N119p706j4865j1841
6978b6725K218l757j4450R600O367K6664J001m529P029l289J2553j2393j2836
6965a2547P308R737j0362m689L976J1636K088k89o326Q496m885q04m418p240O110
6950b209L116q923j108J0030R367Q638j0313o841k244N499O460q157j4682n445
6936a6812k912O157Q189N835m406J4356n867n290j564L144o617m793l331k41J426
6921a2726J0423J869k941k455l367P105L70m90l357J0003M439J598r917K297J6772
6906A9623R13j8845k9334j2950P197L3580J4514k0716m502k930J0350L712J450
$$ plain form
6893 2062 3903 -10114 -7961 -4165 -9131 2493 13213 8404 1568 -3771 2767 -1154 -4382 7159
6879 7159 7873 4453 6207 10344 -3223 -10597 -3585 -4437 -15448 -20094 -10558 -1778 10962 9868 3716
6864 3716 4701 -8894 -12551 -6517 -7913 -20393 -21393 -23111 -19047 -22788 -21654 -18439 -20227 -19726 -13349
6849 -13349 -8673 -16783 -27555 -27819 -30419 -36489 -38434 -28257 -25636 -19211 -13941 -11515 -7251 -11240
6835 -11240 -5705 -3233 -5553 -14512 -20044 -25061 -27452 -25278 -22475 235 18488 18470 15881 11354 -1800
6820 -1800 -11081 -12405 -14113 -7077 3634 -8552 -38377 -25554 -5080 -3409 2987 5383 5990 1468
6806 1468 -378 -787 4197 402 -2066 -10250 -8572 1700 -5551 -27931 -25282 -24184 -3442 5042
6792 5042 -237 2881 5850 7516 1877 -8072 -12844 -12952 -7392 2888 7170 2492 -14460 -13534 -16511
$$ packed form
6893B062J841j4017K153L796m966J1624J0720m809o836n339O538l921l228J1541
6879G159P14l420J754M137j3567p374P012q52j1011m646R536Q780J2740j094o152
6864C716R85j3595l657O034j396j2480j000j718M064l741J134L215j788N01O377
6849a3349M676q110j0772k64k600o070j945J0177K621O425N270K426M264l989
6835a1240N535K472k320q959n532n017k391K174K803K2710J8253j8k589m527j3154
6820a800r281j324j708P036J0711j2186k9825J2823K0474J671O396K396O07m522
6806A468j846m09M984l795k468q184J678J0272p251k2380K649J098K0742Q484
6792E042n279L118K969J666n639r949m772j08N560J0280M282m678j6952R26k977
$$ plain form
6777 -16511 -9318 -9695 -979 92 701 15823 18001 4063 -23028 -18224 -2782 7914 -6225 -9356
6763 -9356 -16967 -9846 567 -4981 3876 9341 740 5770 16970 12859 12043 -4293 -22221 -26528
6749 -26528 -11599 -11250 -10253 -6172 1141 9046 -6841 -10475 -8450 7485 10987 329 5466 13993
6735 13993 16904 17199 7870 10326 6959 6638 14889 17056 22858 31614 16854 9782 20936 34345
6721 34345 30188 19799 13019 8766 9764 10264 17040 11187 9577 22994 17892 23452 38502 35952
6707 35952 46950 44768 38407 46183 51812 40197 9933 -5635 -237 2936 6819 17142 12949
6694 12949 -3634 -10317 -7917 1473 8403 8277 130 4828 -7611 -22811 -38484 -33447 -16030 -4682
6680 -4682 -2720 -516 -1924 2868 -218 -2335 -2392 3119 1519 -1872 -1444 -6875 -14802 -19153 -9714 2334
$$ packed form
6777a6511P193l77Q716J071O09J5122K178j3938k7091M804J5442J0696j4139l131
6763i356p611P121J0413n548Q857N465q601N030J1200m111q16j6336j7928m307
6749b6528J4929L49R97M081P313P905j5887l634K025J5935L502j0658N137Q527
6735A3993K911K95r329K456l367l21Q251K167N802Q756j4760p072J1154J3409
6721C4345m157j0389o780m253R98N00O776n853j610J3417n102N560J5050k550
6707C5952J0998k182o361P776N629j1615l0264j5568N398L173L883J0323m193
6694A2949j6583o683K400R390O930j26q147M698j2439j5200j5673N037J7417J1348
6680d682J962K204j408M792l086k117n7N511j600l391M28n431p927m351R439J2048
$$ plain form
6664 2334 -2859 12974 16713 -1995 -8993 -13889 -4920 8701 -5251 -8655 6052 16400 6111
6651 6111 -6292 -5898 -4375 -7598 -16862 -26891 -30460 -27911 -18418 -6787 -1554 476 -7429 -15975
6637 -15975 -258 682 11375 7776 3625 4646 3531 -6181 8828 16522 20543 13240 16497 3084
6623 3084 -1628 -2675 -12813 -15706 -21577 -25296 -11472 -4342 -4087 -20131 -33734 -19720 -10381 -12645
6609 -12645 -15090 -20051 -17373 -14397 91 1455 -625 -138 -1668 6695 13280 -4957 -20335 -22422
6595 -22422 -23783 -33145 -26045 -9900 -15866 -20875 -17228 -2082 -1060 -7335 -12516 -9566 -9698 -21059
6581 -21059 -15905 -8089 -14762 -6632 -570 -3661 -15692 -13217 -8778 -5274 1083 2002 -10785 -23272
6567 -23272 -24259 -23839 -16472 -6997 -3212 -1939 7064 14772 18224 10702 -1371 -12160 -18271 -17697 -6183
$$ packed form
6664B334n193J5833L739j8708o998m896Q969J3621j3952l404J4707J0348j0289
6651F111j2403L94J523l223r264j0029l569K549R493J1631N233K030p905q546
6637a5975J5717R40J0693l599m151J021j115r712J5009P694M021p303L257j3413
6623C084m712j047j0138k893n871l719J3824P130K55j6044j3603J4014R339k264
6609a2645k445m961K678K976J4488J364k080M87j530Q363O585j8237j5378k087
6595b2422j361r362P100J6145n966n009L647J5146J022o275n181K950j32j1361
6581b1059N154P816o673Q130O062l091j2031K475M439L504O357R19j2787j2487
6567b3272r87M20P367R475L785J273R003P708L452p522j2073j0789o111N74J1514
$$ plain form
6552 -6183 -7176 -7842 -2462 -4812 -4193 -9106 -8364 -11889 -13330 -10528 -11839 -9065 -9510 -10270 -5585 -10323
6536 -10323 -9459 -8334 -6292 2903 7068 7350 -5921 -11247 -9441 -5491 -11030 -8988 -19882 -25545 -14668
6521 -14668 -566 -3329 -2629 -2080 -12279 -30246 -24796 -13532 -20936 -17225 -8011 -17362 -26800 -11868
6507 -11868 -10260 -5169 1782 9204 8650 12593 17690 22493 8754 -10101 -19067 -16565 -6336 -9685
6493 -9685 -11675 -1064 2159 4105 2779 -6573 -24243 -24499 -16135 -6251 375 7827 8027 -59 -1816
6478 -1816 1240 -20599 -28483 -27673 -22895 -17043 -12487 -17784 -8296 -1418 2465 10486 18108 5585 -9527
6463 -9527 -11624 51 5947 -3864 -6967 6035 13399 14895 16775 21414 9735 -18487 -28366 -17599
6449 -17599 -33807 -24082 2280 3902 -6102 -10850 -1621 -436 -5143 -8460 -22590 -16082 -5373
$$ packed form
6552f183r93o66N380k350O19m913P42l525j441K802j311K774m45p60M685m738
6536a0323Q64J125K042R195M165K82j3271n326J806L950n539K042j0894n663J0877
6521a4668J4102k763P00N49j0199j7967N450J1264p404L711R214r351r438J4932
6507a1868J608N091O951P422n54L943N097M803j3739j8855q966K502J0229l349
6493i685j990J0611L223J946j326r352j7670k56Q364R884O626P452K00q086j757
6478a816L056k1839p884Q10M778N852M556n297R488O878L883Q021P622j2523j5112
6463i527k097J1675N896r811l103J3002P364J496J880M639j1679k8222r879J0767
6449a7599j6208R725K6362J622j0004m748R229J185m707l317j4130O508J0709
$$ plain form
6436 -5373 -13027 -11127 -6178 -6443 -9832 -10290 -14066 -20392 -3311 6912 -3623 -2000 -5292 -1809 10955
6421 10955 7419 -15562 -14045 2130 -3317 -35 2308 7608 10514 -5220 -23319 -31319 -22717 -3148
6407 -3148 -11315 -17117 -3020 9175 6077 -3887 -1369 3676 2409 -2843 -17340 -27700 -19884 -15817
6393 -15817 -13681 4239 -5156 -23082 -22883 -16720 -17900 -31301 -29645 -17115 -12869 -6262 -20852 -35945
6379 -35945 -33224 -27065 -21831 -18474 -9366 -7179 -6984 -20702 -30081 -21899 -15105 -15057 -12162 -10181 -22060
6364 -22060 -23907 -21321 -14273 3892 3498 5196 -4684 -13397 -14342 -16710 -17848 -8464 -11768 -17951 -7043
6349 -7043 -4215 -1999 -18420 -17847 -22511 -20824 -16589 -10463 -8006 -10212 -13065 -18546 -9312 -6041 -2799
6334 -2799 -4799 -640 -2029 -17332 -15676 -13444 -13574 -25008 -18799 -24031 -27724 -26886 -31651 -28731 -16630
$$ packed form
6436e373p654J900M949k65l389m58l776o326J7081J0223j0535J623l292L483J2764
6421A0955l536k2981J517J6175n447L282K343N300K906j5734j8099q000Q602J9569
6407c148q167n802J4097J2195l098r964K518N045j267n252j4497j0360P816M067
6393a5817K136J7920r395j7926J99O163j180j3401J656J2530M246O607j4590j5093
6379c5945K721O159N234L357R108K187J95j3718r379Q182O794M8K895J981j1879
6364b2060j847K586P048J8165l94J698r880q713r45k368j138R384l304o183J0908
6349g043K828K216j6421N73m664J687M235O126K457k206k853n481R234L271L242
6334b799k000M159j389j5303J656K232j30j1434O209n232l693Q38m765K920J2101
$$ plain form
6319 -16630 -12152 -20896 -10911 -4966 -11401 -18615 -24858 -37192 -39334 -23680 -10689 593 8077 7047
6305 7047 17480 24979 5166 -12447 -16061 -22236 -14971 -19504 -29066 -17929 -12327 -10835 -13976 -21787
6291 -21787 -17487 3544 19628 14027 3376 -13290 -12105 1473 2997 -3696 -19524 -16102 -7814
6278 -7814 13071 29423 14767 -1790 -8526 -17098 -10702 791 9877 13628 27154 32701 14850
6265 14850 -1307 -723 4307 2395 -5647 -8945 -13650 -24243 -17954 4540 -325 -11109 -8703 -7164
6251 -7164 -5704 6941 22222 18949 4930 -15293 -30015 -19762 -13587 -10335 -12967 -18049 -26507
6238 -26507 -22867 -14599 -8709 -6634 -9030 -14310 -13167 -18821 -7677 1875 2167 -6783 -19 -11703
6224 -11703 -31961 -28226 -24472 -19862 -22625 -28908 -22070 -17767 -18263 -20206 -23215 -23559 -23119 -10664 -15705
$$ packed form
6319a6630M478q744R985N945o435p214o243j2334k142J5654J2991J1282P484j030
6305G047J0433P499j9813j7613l614o175P265m533r562J1137N602J492l141p811
6291b1787M300K1031J6084n601j0651j6666J185J3578J524o693j5828L422Q288
6278g814K0885J6352j4656j6557o736q572O396J1493R086L751J3526N547j7851
6265A4850j6157N84N030j912q042l298m705j0593O289K2494m865j0784K406J539
6251g164J460J2645J5281l273j4019k0223j4722J0253O175L252k632n082q458
6238b6507L640Q268N890K075k396n280J143n654J1144R552K92q950O764j1684
6224a1703k0258L735L754M610k763o283O838M303m96j943l009l44M40J2455n041
$$ plain form
6209 -15705 -22057 -8216 6241 7055 7252 -6828 -22367 -10449 -6209 -7708 -14631 -20911 -17679 -14734
6195 -14734 -4853 -2679 -10786 -13264 -8398 -12776 -7826 2588 19459 11439 4312 -5603 -14562 -26182
6181 -26182 -35932 -29627 -16645 -18585 -21830 -19327 -21087 -11453 -682 -7815 -3523 16072 16694 9264
6167 9264 -4187 -9011 -21149 -29433 -35497 -34522 -24684 -25973 -17251 -5177 -684 -932 -20121 -17403
6153 -17403 -16237 -10550 6238 8957 -2724 -17118 -14495 -12967 -9210 -8775 -26161 -31692 -21589 -8999
6139 -8999 -12446 -8578 -8710 -7290 -18644 -31247 -35401 -30996 -20270 -1001 15742 -3415 -4334 -7753
6125 -7753 -16668 -20269 -18380 -15561 -7150 -13818 -24649 -30807 -18050 -8691 -18654 -22068 -33045 -20527
6111 -20527 -10801 -9302 -9552 3580 15548 17916 18245 17647 5944 5592 9602 4311 126 17675 17496
$$ packed form
6209a5705o352J3841J4457Q14J97j4080j5539J1918M240j499o923o280L232K945
6195a4734R881K174q107k478M866m378M950J0414J6871q020p127r915q959j1620
6181b6182r750O305J2982j940l245K503j760R634J0771p133M292J9595O22p430
6167I264j3451m824j2138q284o064R75R838j289Q722J2074M493k48j9189K718
6153a7403J166N687J6788K719j1681j4394K623J528L757M35j7386n531J0103J2590
6139h999l447L868j32J420j1354j2603m154M405J0726J9269J6743j9157r19l419
6125g753q915l601J889K819Q411o668j0831o158J2757R359r963l414j0977J2518
6111b0527R726J499k50J3132J1968K368L29n98j1703l52M010n291m185J7549j79
$$ plain form
6096 17496 17819 14988 14372 24148 24309 13791 5503 2386 8994 6159 12121 -1690 109 7146 5037
6081 5037 3184 12157 16084 24377 26582 26278 13474 11285 5894 -1898 -8664 -10128 -15404 -14165 -7154
6066 -7154 -13766 -11390 -4364 10206 10134 -1103 9740 9071 742 -21044 -20620 -15188 -18235 -10179 -13439
6051 -13439 -36035 -31997 -20024 -20442 -24861 -23510 -10369 -2577 6983 5013 -1999 -6537 -9665 -14725
6037 -14725 -12184 -17002 -25735 -35849 -9515 6281 -2614 -4674 7282 16482 7938 -21 -4908 -4735
6023 -4735 -323 -5513 -12501 -9146 3095 -5617 -6578 6482 8997 8896 7393 -6969 -14847 -17686 -21322
6008 -21322 -40449 -27788 -7580 -8978 3507 5342 -3369 -7284 -6928 10977 21057 21294 20493 11181
5994 11181 -12485 -27343 -23906 -15864 -12835 -22612 -15475 -8739 -2114 372 -2161 3086 1697 -6227
$$ packed form
6096A7496L23k831o16R776J61j0518q288l117O608k835N962j3811J799P037k109
6081E037j853Q973L927Q293K205l04j2804k189n391p792o766j464n276J239P011
6066g154o612K376P026J4570p2j1237J0843o69q329k1786M24N432l047Q056l260
6051a3439k2596M038J1973m18m419J351J3141P792R560j970p012m538l128n060
6037a4725K541m818q733j0114K6334J5796q895k060J1956R200q544p959m887J73
6023d735M412n190o988L355J2241q712r61J3060K515j01j503j4362p878k839l636
6008b1322j9127J2661K0208j398J2485J835q711l915L56J7905J0080K37q01r312
5994A1181k3666j4858L437Q042L029r777P137O736O625K486k533N247j389p924
$$ plain form
5980 -6227 -11513 -5510 12813 6481 6214 16946 33001 24266 13544 13133 18047 7791 2034 10530
5966 10530 -6655 -13318 -13142 -7950 -7178 7728 17664 15971 8728 9701 16218 13561 8517 10373 20335
5951 20335 18156 10947 7117 4168 13594 8225 -7276 -6844 -2268 -1758 709 -9190 4017 7286 -1702
5936 -1702 -6213 -15105 -16495 -4435 -8411 -11167 -5200 -13919 -31246 -25509 -18437 -14530 -12466 -17910
5922 -17910 -16439 -3885 3025 -1925 1169 5344 11798 16864 12702 2917 3344 2412 -5124 -6346 -9689
5907 -9689 -14000 -16069 -14176 -9252 -3345 4611 8375 9880 6192 82 -7719 -11399 -8134 -7937 -8406
5892 -8406 -2105 9422 13751 12449 9924 7333 9883 3664 -3702 -3070 -7977 -16929 -15972 -8888 -4229
5877 -4229 -10645 -29903 -27021 -13940 -14964 -24840 -12150 1851 -12242 -9390 -15452 -27688 -25259
$$ packed form
5980f227n286O003J8323o332k67J0732J6055q735j0722m11M914j0256n757Q496
5966A0530j7185o663J76N192P72J4906R936j693p243R73O517k657n044J856R962
5951B0335k179p209l830k949R426n369j5501M32M576N10K467r899J3207L269q988
5936a702m511q892j390J2060l976k756N967q719j7327N737P072L907K064n444
5922a7910J471J2554O910m950L094M175O454N066m162r785M27r32p536j222l343
5907i689m311k069J893M924N907P956L764J505l688o110p801l680L265J97m69
5892h406O301J1527M329j302k525k591K550o219p366O32m907q952R57P084M659
5877d229o416j9258K882J3081j024r876J2690J4001j4093K852o062j2236K429
$$ plain form
5864 -25259 -19868 -936 143 -1546 -5021 -9055 -23735 -19020 -19695 -25872 -21528 -30875 -13487 -1326
5850 -1326 -9448 -6687 2504 -544 1910 14538 17937 10072 5398 10168 1431 -21532 -31874 -28245
5836 -28245 -10706 -11699 -23578 -23507 -11661 -7153 -11771 -18552 -25860 -20342 -18559 -16693 -21962 -27259 -24932
5821 -24932 -12580 -16695 -15092 -3479 1215 -20785 -34434 -24308 -13216 -20386 -21594 -24764 -25013
5808 -25013 -16385 -9813 1701 6783 -5806 -16636 -18316 -14331 -9832 -1755 -16146 -27368 -19747
5795 -19747 -13303 -18077 -23440 -21579 -18312 -11895 -10989 -21833 -13467 5123 -13994 -34856 -44741 -40474
5781 -40474 -35127 -16625 6368 14312 6719 993 -4762 -5927 9109 4217 -5027 -1541 -2640 -7264
5767 -7264 -2901 -1702 4454 23112 30901 11773 -3074 -9601 4824 5701 1731 -2000 -9750 -6068
$$ packed form
5864b5259N391J8932J079j689l475m034j4680M715o75o177M344r347J7388J2161
5850a326q122K761R191l048K454J2628L399p865m674M770q737k2963j0342L629
5836b8245J7539r93j1879P1J1846M508m618o781p308N518J783J866n269n297K327
5821b4932J2352m115J603J1613M694k2000j3649J0126J1092p170j208l170k49
5808b5013Q628O572J1514N082j2589j0830j680L985M499Q077j4391j1222P621
5795a9747O444m774n363J861L267O417R06j0844Q366J8590j9117k0862r885M267
5781d0474N347J8502K2993P944p593n726n755j165J5036m892r244L486j099m624
5767g264M363J199O156J8658P789j9128j4847o527J4425Q77l970l731p750L682
$$ plain form
5753 -6068 -6034 -9558 -15468 -12711 -3314 8145 9931 8964 8855 5843 10796 -446 -8127 -7060 -8481
5738 -8481 -5750 -5531 -10000 -898 -1103 -15134 -28234 -20742 -15731 -20720 -26030 -37196 -28253 -17849
5724 -17849 -8172 9840 1852 -8482 -8908 -9955 -9940 -15255 -12890 -9611 -10263 -4197 714 4588 -4321
5709 -4321 -4075 1189 5005 4573 9053 21091 16566 -3846 -6421 7206 3477 -193 4604 -5144 -18936
5694 -18936 -15308 -11375 -15251 -9522 -11708 -12099 1929 18927 18555 395 -10289 -18596 -22421 -17854
5680 -17854 -19911 -26080 -22516 -15102 -7227 -3583 1096 3661 2657 -12512 -19554 -10074 -6571 -7254 -3298
5665 -3298 11432 7151 -8973 -11272 -22428 -30621 -27684 -12286 -1177 -369 -4945 -16561 -21961 -29744
5651 -29744 -24694 -18558 -4359 -4302 -13240 -7998 -4222 -16390 -14843 -13701 -1826 -1243 4167 4860 3889
$$ packed form
5753f068L4l524n910K757R397J1459J786r67j09l012M953j1242p681J067j421
5738h481K731K19m469R102k05j4031j3100P492N011m989n310j1166Q943J0404
5724a7849R677J8012p988j0334m26j047J5n315K365L279o52O066M911L874q909
5709d321K46N264L816m32M480J2038m525k0412k575J3627l729l670M797r748j3792
5694a8936L628L933l876N729k186l91J4028J6998l72j8160j0684q307l825M567
5680a7854k057o169L564P414P875L644M679K565j004j5169p042R480L503o83L956
5665c298J4730m281j6124k299j1156q193K937J5398J1109Q08m576j1616n400p783
5651b9744N050O136J4199N7q938N242L776j2168J547J142J1875N83N410O93r71
$$ plain form
5636 3889 1304 2744 -6384 -15708 -20841 -21230 -20215 -36708 -37027 -23377 -30280 -44445 -27091 -25601
5622 -25601 -40351 -48769 -41557 -25216 -16537 -9722 -5961 -12432 -12709 -12981 -7288 9235 11881 5877
5608 5877 -613 -9144 -7698 -6694 -10357 -13629 -5691 1123 1923 -6033 -10284 -6181 -4703 -2934 8475
5593 8475 13264 8229 -10678 -11112 -8139 -2404 -8410 -11340 -17611 -26344 -33112 -30064 -39189 -34628 -21595
5578 -21595 -15750 -16543 -11975 1163 -2322 -681 11968 23026 14912 10331 16699 3418 -411 -5541
5564 -5541 -13885 -11560 -4358 -10812 -26324 -18918 809 -656 -13965 -24492 -8307 -8052 -14703 -19235
5550 -19235 -12728 -16089 -17530 -15120 -20675 -17193 -3337 -14584 -17417 -7676 -22919 -26427 -13040 -526
5536 -526 2830 3588 319 -6586 -8829 -9789 -9943 -16507 -10954 -3669 -20026 -9691 4032 2299 8723
$$ packed form
5636C889k585J440r128r324n133l89J015j6493l19J3650o903j4165J7354J490
5622b5601j4750q418P212J6341Q679O815L761o471k77k72N693J6523K646o004
5608E877o490q531J446J004l663l272P938O814Q00p956m251M103J478J769J1409
5593H475M789n035j8907m34K973N735o006k930o271q733o768L048r125M561J3033
5578b1595N845p93M568J3138l485J641J2649J1058q114m581O368j3281l829n130
5564e541q344K325P202o454j5512P406J9727j465j3309j0527J6185K55o651m532
5550a9235O507l361j441K410n555L482J3856j1247k833R741j5243l508J3387J2514
5536e26L356P58l269o905k243r60j54o564N553P285j6357J0335J3723j733O424
$$ plain form
5521 8723 4318 3228 -148 -88 7186 -8473 -14724 -23009 -27293 -31799 -35461 -24548 -15980 -13850 -15900
5506 -15900 -20004 -8803 -13840 -7059 -9732 -9246 11595 20579 25757 22234 7220 -919 -13131 -9404
5492 -9404 1856 2597 5855 4469 -6880 7949 26607 16726 19198 25615 18433 7639 3150 3978
5478 3978 11169 5754 -16187 -19499 -6747 -1421 -7217 -17300 -14954 -5164 -11151 -19469 -23060 -25776
5464 -25776 412 3023 -7719 -11531 -13272 -3035 3960 6112 -6798 -25206 -27209 -24605 -18749
5451 -18749 -22310 -25334 -25926 -17913 3255 10101 -6975 -24266 -18849 -1163 13943 7087 1864 -9502
5437 -9502 -9278 -6975 -8739 -14853 -8450 8384 13548 17566 5010 4130 5694 6030 367 2886 6497
5422 6497 7011 2516 -3706 -5268 835 7568 176 7530 5296 -14930 -19477 -18086 -10172 -6276 3634
$$ packed form
5521H723m405j090l376O0P274j5659o251q285m284m506l662J0913Q568K130k050
5506a5900m104J1201n037O781k673M86K0841Q984N178l523j5014q139j2212L727
5492i404J1260P41L258j386j1349J4829J8658r881K472O417p182j0794m489Q28
5478C978P191n415k1941l312J2752N326n796j0083K346R790n987q318l591k716
5464b5776K6188K611j0742l812j741J0237O995K152j2910j8408k003K604N856
5451a8749l561l024n92Q013K1168O846j7076j7291N417J7686J5106o856n223j1366
5437i502K24K303j764o114O403J6834N164M018j2556q80J564L36n663K519L611
5422F497N14m495o222j562O103O733p392P354k234k0226m547J391P914L896R910
$$ plain form
5407 3634 136 -4620 3285 6471 7420 15594 14271 -2414 -21495 -28463 -18243 -5913 -8629 -30263
5393 -30263 -35279 -42426 -28543 -23677 -13891 -3001 6682 5046 -1997 6233 22048 21945 9046 15144
5379 15144 8408 714 -6903 4474 15531 16539 5853 6433 -341 -6126 -5591 7945 11562 3594
5365 3594 2986 4747 -671 -4600 216 -13135 -8343 4464 -7002 -24058 -26034 -12992 -9693 -1187
5351 -1187 9685 7671 10737 -12762 -22381 -17437 -10182 9929 13865 8923 7232 233 -509 8692
5337 8692 2630 -10067 -5522 7317 12333 -9657 -11659 -15248 -22265 -1261 18323 19683 12371 192
5323 192 1982 14338 11648 11648 3043 2316 -20 -2345 -14073 -15455 -21720 -16782 -23878 -15099 280
5308 280 3254 6002 9935 12684 7320 3219 2350 5403 1964 1216 -5275 -14573 -15539 -13271 -24129 -14318
$$ packed form
5407C634l498m756P905L186R49Q174j323j6685j9081o968J0220J2330k716k1634
5393c0263n016p147J3883M866R786J0890R683j636p043Q230J5815j03j2899O098
5379A5144o736p694p617J1377J1057J008j0686N80o774n785N35J3536L617p968
5365C594o08J761n418l929M816j3351M792J2807j1466j7056j976J3042L299Q506
5351a187J0872k014L066k3499r619M944P255K0111L936m942j691o999p42R201
5337H692o062j2697M545J2839N016k1990k002l589p017K1004J9584J360p312j2179
5323A92J790J2356k690%q605p27k336k325j1728j382o265M938p096Q779J5379
5308B80K974K748L933K749n364m101q69L053l439p48o491r298r66K268j0858R811
$$ plain form
5292 -14318 -15874 -17878 -15619 -18447 -13201 -16489 -22985 -39414 -36622 -28559 -14662 3835 17512 6616
5278 6616 -3223 -13348 -20711 -20271 -7694 -1259 6985 1677 -3372 -11530 -15238 -16875 -15429 -18099 -17165
5263 -17165 -15695 -13260 -18026 -12500 -7711 -7832 -7091 -35 12596 20130 -2133 -3799 -304 -279 11781
5248 11781 12131 -1611 -2069 13761 15201 12202 21479 9364 6385 11657 18582 9845 -8477 -10256
5234 -10256 1773 13135 14203 15983 15890 17303 5265 -3191 -3952 -3571 434 -1264 -25187 -28689 -14925
5219 -14925 -9853 -8317 -7100 -2358 -1825 -1647 -3309 -3684 790 5141 -7789 -8428 -20905 -26404 -31425
5204 -31425 -25144 -13552 -1712 -3927 -7098 -3641 -3432 -3095 -261 1885 -412 10351 -34 -16089
5190 -16089 -27178 -17901 -8106 -2795 -6954 -14220 -23895 -22761 -20646 -22823 -8784 475 -10956 -16853
$$ packed form
5292a4318j556k004K259k828N246l288o496j6429K792Q063J3897J8497J3677j0896
5278F616r839j0125p363M40J2577O435Q244n308n049q158l708j637J446k670R34
5263a7165J470K435m766N526M789j21P41P056J2631P534k2263j666L495K5J2060
5248A1781L50j3742m58J5830J440k999R277j2115k979N272O925q737j8322j779
5234a0256J2029J1362J068J780r3J413j2038q456p61L81M005j698k3923l502J3764
5219a4925N072J536J217M742N33J78j662l75M474M351j2930o39j2477n499n021
5204c1425O281J1592J1840k215l171L457K09L37K834K146k297J0763j0385j6055
5190a6089j1089R277R795N311m159p266r675J134K115k177J4039R259j1431n897
$$ plain form
5176 -16853 -16328 -3648 6130 12698 11346 12182 11361 11822 -5166 -11740 -12444 -15509 -19603 -21015 -19848
5161 -19848 -4666 9152 2002 -20494 -28766 -25910 -22168 -15870 -15215 -12488 -25254 -16379 -14594 -7177
5147 -7177 -1657 13443 14454 -10528 -16288 -15220 -8185 -7821 -2568 1112 -1946 3554 16956 11089
5133 11089 2244 5813 -5240 -13683 -10688 -10100 -2416 16741 8235 2727 8933 -6623 -10266 -10994
5119 -10994 -7729 -9875 5144 -6828 -11686 -799 -2466 -12049 -23522 -14370 -7191 -1946 -7691 -16943
5105 -16943 -14247 7360 21646 -1831 -5926 -11614 -15214 -3042 -4177 -8487 -4898 -12415 -13641 -10912
5091 -10912 -20629 -18672 -17385 -19918 -8189 -5259 -10376 -2778 -11866 341 -429 -12736 -13313 -11349
5077 -11349 -19850 -10097 -9582 1207 18600 21998 25169 24748 10753 8613 24862 30051 35332 33285
$$ packed form
5176a6853N25J2680R778O568j352Q36q21M61j6988o574p04l065m094j412J167
5161a9848J5182J3818p150k2496q272K856L742O298O55K727j2766Q875J785P417
5147g177N520J5100J011k4982n760J068P035L64N253L680l058N500J3402n867
5133A1089q845L569j1053q443K995N88P684J9157q506n508O206j5556l643p28
5119a0994L265k146J5019j1972m858J0887j667r583j1473R152P179N245n745r252
5105a6943K696K1607J4286k3477m095n688l600J2172j135m310L589p517j226K729
5091a0912r717J957J287k533J1729K930n117P598r088J2207p70j2307n77J964
5077a1349q501R753N15J0789J7393L398L171m21j3995k140J6249N189N281k047
$$ plain form
5063 33285 24734 -45 4 15088 18338 30460 30732 14407 8196 3674 -370 8252 20413 14039
5049 14039 10938 3100 -4475 -8932 2355 10075 28936 36969 30855 11835 -570 -2673 -3128 -5499
5035 -5499 -8859 -11510 -13759 -17594 -6753 -2915 -15740 -16891 -5218 -127 -909 -870 100 -6319 -5111
5020 -5111 -6273 -12238 -14075 -5628 6422 13051 14961 2203 -471 8754 23029 25837 16591 5245
5006 5245 -11515 -14501 3584 8579 10522 23920 14231 -2548 -6686 -4963 -3903 -13369 -27663 -21789
4992 -21789 -24487 -30637 -25636 -11630 -7695 -17636 -1144 3444 -56 5884 -1561 -13997 -16682 -8211
4978 -8211 2840 666 3892 -2482 -5284 -1077 -964 -1897 -11823 -22097 -25656 -9112 4206 -6940
4964 -6940 -13536 -10962 4670 5491 -992 -2303 5936 7366 4797 -5289 4879 26061 25302 -5460
$$ packed form
5063C3285q551k4779M9J5084L250J2122K72j6325o211m522m044Q622J2161o374
5049A4039l101p838p575m457J1287P720J8861Q033o114j9020j2405k103m55k371
5035e499l360k651k249l835J0841L838j2825j151J1673N091p82L9R70o419J208
5020e111j162n965j837Q447J2050O629J910j2758k674R225J4275K808r246j1346
5006E245j6760k986J8085M995J943J3398r689j6779m138J723J060r466j4294N874
4992b1789k698o150N001J4006L935r941J6492M588l500N940p445j2436k685Q471
4978h211J1051k174L226o374k802M207J13r33r926j0274l559J6544J3318j1146
4964f940o596K574J5632Q21o483j311Q239J430k569j0086J0168K1182p59l0762
$$ plain form
4950 -5460 -19251 -11590 -4735 -16683 -16346 -15603 -21940 -20990 19 203 -13785 -9484 6823 24631
4936 24631 24262 27619 21189 3151 14250 25814 12968 -6440 8604 14551 18086 12424 4093
4923 4093 -20858 -25609 -20700 -3039 324 5273 12007 19237 15002 11269 3082 4190 3866 -3504 6860
4908 6860 14147 8725 -593 -25 -1043 -1970 13318 23144 7235 -9474 -4587 -3243 64 1246 4286
4893 4286 18619 17365 14587 15490 2741 -2029 -184 -9297 -15665 -19326 -26213 -6453 3182 6519
4879 6519 -3782 -10565 -4486 1154 -11486 -11720 -20790 -17109 -16499 -12292 -13296 -8424 -7003 -17322 -22914
4864 -22914 -26500 -38445 -28269 -14083 -6445 -9504 -3998 12857 12360 11686 23973 17127 -1895 -6235
4850 -6235 -1816 1835 10262 15872 19369 7166 -3373 -10845 -22496 -19354 -2227 7170 16167 21343
$$ packed form
4950e460j3791P661O855j1948L37P43o337R50K1009J84j3988M301J6307J7808
4936B4631l69L357o430j8038J1099J1564j2846j9408J5044N947L535n662q331
4923D093k4951m751M909J7661L363M949O734P230m235l733q187J108l24p370J0364
4908F860P287n422r318N68j018r27J5288R826j5909j6709M887J344L307J182L040
4893D286J4333j254k778R03j2749m770J845r113o368l661o887J9760R635L337
4879F519j0301o783O079N640j2640k34r070L681O10M207j004M872J421j0319n592
4864b2914l586j1945J0176J4186P638l059N506J6855m97o74J2287o846j9022m340
4850f235M419L651Q427N610L497j2203j0539p472j1651L142J7127R397Q997N176
$$ plain form
4836 21343 23680 14765 8288 4845 -4969 2970 6962 -64 -1739 4957 -22734 -40252 -30624 -19988
4822 -19988 -16217 -17972 -30309 -32866 -23573 -17633 -8136 348 -5691 -20508 -24887 -6016 4696 9783
4808 9783 5440 -1292 -419 3861 661 -15493 -31250 -32227 -36188 -28948 -18476 -17349 -4748 -4135 -9977
4793 -9977 -5887 1513 -4642 -8977 -7755 -17278 -38534 -35821 -13444 2618 8083 215 -7209 -19283
4779 -19283 -8973 1320 -2679 -10895 -16808 -26515 -37940 -28166 -20470 -14332 -9283 -11486 -28089 -28125
4765 -28125 -15851 -6361 -3802 -7535 -12735 -4823 8162 19350 8420 -23452 -40270 -24715 -11716
4752 -11716 -15166 -2819 4463 -9351 -12143 -2295 11008 4407 -24855 -21728 11217 16829 12893
4739 12893 7391 -8040 3294 10041 14605 14351 2455 3180 1570 3261 1766 17151 33888 23522
$$ packed form
4836B1343K337q915o477l443r814P939L992p026j675O696k7691j7518R628J0636
4822a9988L771j755j2337k557R293N940R497Q484o039j4817m379J8871J0712N087
4808I783m343o732Q73M280l200j6154j5757r77l961P240J0472J127J2601O13n842
4793i977M090P400o155m335J222r523k1256K713K2377J6062N465p868p424j2074
4779a9283J0310J0293l999q216n913r707j1425R774P696O138N049k203j6603l6
4765b8125J2274R490K559l733n200P912J2985J1188j0930l1872j6818J5555J2999
4752a1716l450J2347P282j3814k792R848J3303o601k9262L127L2945N612l936
4739A2893n502j5431J1334O747M564k54j1896P25j610J691j495J5385J6737j0366
$$ plain form
4725 23522 18531 13520 2777 12782 17326 15681 5524 -19601 -18188 -12244 -6416 7328 19723
4712 19723 15845 11089 3732 -5551 2484 -5160 -1725 6811 13452 4815 -23765 -29492 -22415 -30357
4698 -30357 -26905 -22121 -11036 -13459 -14950 -11690 7120 10194 9715 8543 -2334 -12142 -16347 -11615
4684 -11615 3064 5135 13554 17627 25577 17226 -6944 -12932 -7751 3947 562 -16113 -2014
4671 -2014 21238 11689 1507 -8286 -10700 -15501 -9853 -6556 4279 6189 4695 5684 4474 12927
4657 12927 16360 14686 8082 7650 -1964 -16810 -9475 -11708 -5730 1280 1127 8559 -4021 -16793
4643 -16793 -12883 -4842 -4756 -9711 -11716 -3784 -118 -3298 7578 15050 27300 8057 -4257 -8374
4629 -8374 -25508 -14763 -4685 5115 -12652 -18890 -8004 -16055 -13271 2492 -2296 1406 45
$$ packed form
4725B3522m991n011j0743J0005M544j645j0157k5125J413N944N828J3744J2395
4712A9723l878m756p357r283Q035p644L435Q536O641q637k8580n727P077p942
4698c0357L452M784J1085k423j491L260J8810L074m79j172j0877r808m205M732
4684a1615J4679K071Q419M073P950q351k4170n988N181J1698l385j6675J4099
4671b014K3252r549j0182r793k414m801N648L297J0835J910j494R89j210Q453
4657A2927L433j674o604m32r614j4846P335k233N978P010j53P432j2580j2772
4643a6793L910Q041Q6m955k005P932L666l180J0876P472J2250j9243j2314m117
4629h374j7134J0745J0078R800j7767o238J0886q051K784J5763m788L702j361
$$ plain form
4616 45 -7124 -3048 15159 7637 699 2833 13280 16102 5472 -2430 1204 -8585 -14561 -2914
4602 -2914 -4932 -458 743 -4734 -5517 -10426 -5911 -2152 946 -12406 -11665 -6052 -611 -2398 -8760
4587 -8760 -4154 -8986 -11648 -7029 -6532 6741 9764 18329 21797 11352 -1254 421 4349 8414
4573 8414 -717 8122 20554 19740 15323 9044 -5748 -5196 2831 5477 -3599 -18910 -17166 -9967 591
4558 591 5930 7028 -525 1041 5460 6804 2094 -3894 -13885 -1953 3088 -11355 -18601 -19576 -17785
4543 -17785 -12165 5758 9165 -1598 -517 -12318 -24076 -9366 -3724 1322 -3968 -7120 693
4530 693 8741 5958 9584 19905 15308 1463 -6728 -4898 -7920 1384 8130 14208 15819 5770
4516 5770 -6729 -6826 -12180 -12642 -10857 -22961 -13155 -714 7361 22260 26628 30176 30779 24937 15659
$$ packed form
4616D5p169M076J8207p522o938K134J0447K822j0630p902L634r789n976J1647
4602b914k018M474J201n477p83m909M515L759L098j3352P41N613N441j787o362
4587h760M606m832k662M619M97J3273L023Q565L468j0445j2606J675L928M065
4573H414r131Q839J2432q14m417o279j4792N52Q027K646r076j5311J744P199J0558
4558E91N339J098p553J566M419J344m710n988r991J1932N041j4443p246r75J791
4543a7785N620J7923L407j0763J081j1801j1758J4710N642N046n290l152P813
4530F93Q048k783L626J0321m597j3845q191J830l022R304O746O078J611j0049
4516E770j2499r7n354m62J785j2104R806J2441Q075J4899M368L548O03n842r278
$$ plain form
4501 15659 6538 11198 25809 21259 6687 -7968 -5658 -4092 4157 -1983 13720 16148 7957 -7079
4487 -7079 -4728 11183 -153 -7861 -9458 -9566 -12119 -888 -8213 -3647 5146 5936 5133 -3202 -7173
4472 -7173 2194 5270 -1998 -5589 -8115 -4615 -4888 -2718 3285 1797 -2682 -1115 -8303 -18473 -24543
4457 -24543 -9959 -23603 -34584 -34195 -26197 -22523 -12438 -9879 -1859 5111 2280 3088 22494 25389
4443 25389 18224 8933 11855 17965 27349 24273 16075 11621 16071 21437 1601 -12919 -12254 3104
4429 3104 -1315 -277 4078 21030 24266 72 -4029 -1889 482 2969 3682 -3168 -6987 -4064 -2623
4414 -2623 -9796 2996 14900 4613 -10664 -6537 -9902 5559 10650 -2344 -14808 -18993 -10031
4401 -10031 -7505 -18264 -19827 -16401 -16849 -21051 -30411 -18991 -10222 -7948 -8801 -10297 -29961 -33177
$$ packed form
4501A5659r121M660J4611m550j4572j4655K310J566Q249o140J5703K428q191j5036
4487g079K351J5911j1336p708j597j08k553J1231p325M566Q793P90q03q335l971
4472g173R367L076p268l591k526L500k73K170O003j488m479J567p188j0170o070
4457b4543J4584j3644j0981L89P998L674J0085K559Q020O970k831Q08J9406K895
4443B5389p165r291K922O110R384l076q198m454M450N366j9836j4520O65J5358
4429C104m419J038M355J6952L236k4194m101K140K371K487P13o850l819K923J441
4414b623p173J2792J1904j0287j5277M127l365J5461N091j2994j2464m185Q962
4401a0031K526j0759j563L426m48m202r360J1420Q769K274q53j496j9664l216
$$ plain form
4387 -33177 -29296 -25616 -20058 -14141 -26329 -22327 -6948 -5247 -8842 -8714 -20785 -30066 -24643 -22528
4373 -22528 -17511 -24356 -13687 1886 4696 681 -5027 -24885 -24643 -10558 -10842 -25919 -25358 -27638
4359 -27638 -28196 -24080 -34907 -39590 -26059 -22152 -24084 -19061 -4680 -16368 -6211 -1418 630 1075
4345 1075 1442 535 -11761 -19396 -10425 1330 -280 -11743 -10285 -6957 2472 -1979 -9036 6495
4331 6495 14480 6192 -10546 -5939 -850 10799 14750 12025 -88 -7971 -5808 -982 -1185 -1286 12958
4316 12958 10072 2433 5013 13111 -514 -6852 -4746 2905 11027 4375 2627 6355 10808 1664
4302 1664 -1601 -823 -305 -2644 -6896 -9665 -9660 -10465 -7548 2930 11423 6052 8346 -767 -10525 -24173
4286 -24173 -23443 -19481 -3973 5024 16390 17635 13779 11131 -1489 4223 10315 6125 2898 6831
$$ packed form
4387c3177L881L680N558N917j2188M002J5379J701l595J28j2071r281N423K115
4373b2528N017o845J0669J5573K810m015n708j9858K42J4085k84j5077N61k280
4359b7638n58M116j0827m683J3531L907j932N023J4381j1688J0157M793K048M45
4345A075L67r07j2296p635Q971J1755j610j1463J458L328R429m451p057J5531
4331F495P985q288j6738M607N089J1649L951k725j2113p883K163M826k03j01J4244
4316A2958k886p639K580Q098j3625o338K106P651Q122o652j748L728M453r144
4302A664l265P78N18k339m252k769Nq05K917J0478Q493n371K294r113r758j3648
4286b4173P30L962J5508Q997J1366J245l856k648j2620N712O092m190l227L933
$$ plain form
4272 6831 11258 664 -3165 4743 1739 -485 -9212 -18562 -18078 -21959 -10897 8924 13074 8291
4258 8291 -11546 -10639 -7026 9147 20173 2836 -11630 -10776 643 -1870 -12187 -20384 -11609 6222
4244 6222 14096 15036 19292 16285 8553 -1455 4636 7545 5972 1533 -3868 7113 2086 -13203
4230 -13203 -15364 -7534 -19993 -23653 -32111 -40416 -24666 -11506 -18175 -5328 -762 2399 6109 15367
4216 15367 -1245 -3405 -2489 -4807 1821 5318 26263 29304 28493 15623 17442 1739 4404 15634
4202 15634 22035 16432 9598 -6784 -11123 -9005 -10686 -8908 -10221 -8464 6469 8810 -861 2651
4188 2651 25736 41005 46282 20688 1594 -3049 -11259 111 -6577 -8013 -4929 -5711 2110 7095
4174 7095 263 -10915 -16937 -18161 -12431 -11348 -15374 -9621 -12523 -25222 -20315 -15540 -29829 -37288
$$ packed form
4272F831M427j0594l829P908l004k224q727r350M84l881J1062J9821M150m783
4258H291j9837R07L613J6173J1026j7337j4466Q54J1419k513j0317q197Q775J7831
4244F222P874R40M256l007p732j0008O091K909j573m439n401J0981n027j5289
4230a3203k161P830j2459l660q458q305J5750J3160o669J2847M566L161L710R258
4216A5367j6612k160R16k318O628L497K0945L041q11j2870J819j5703K665J1230
4202A5634O401n603o834j6382m339K118j681J778j313J757J4933K341r671L512
4188B651K3085J5269N277k5594j9094m643q210J1370o688j436L084p82P821M985
4174G095o832j1178o022j224N730J083m026N753k902j2699M907M775j4289p459
$$ plain form
4160 -37288 -34388 -24768 -21914 -8101 -272 9215 10161 5575 2646 4925 10884 14314 17294 15019 9981
4145 9981 -1732 -3424 3351 7087 3616 4890 13038 17338 23906 24400 2923 -29344 -37946 -42015
4131 -42015 -22103 -1836 8825 8882 3934 -6186 -8097 -8011 -11098 -2515 1472 -3004 -4169 -920 17067
4116 17067 16152 -11502 -15480 -25148 -8514 4906 -4572 -8191 1606 16934 9353 2037 1876 -330
4102 -330 7194 15904 15424 -4901 -27185 -31584 -12231 -5269 -5582 11084 25405 10639 -8585 -9881
4088 -9881 -15145 -6437 -6849 -1782 319 -10402 -7878 -498 9644 8519 13311 6056 -7840 -14522
4074 -14522 -6954 7167 23044 24182 19027 11277 4261 19533 18392 20837 19178 16526 9625 1516
4060 1516 -19 4357 16156 13293 -3236 -4971 -3935 7711 6508 6890 14465 1710 -8385 -23133
$$ packed form
4160c7288K900R620K854J3813P829R487R46m586k929K279N959L430K980k275n038
4145I981j1713j692O775L736l471J274Q148M300O568M94k1477l2267q602m069
4131d2015J9912K0267J0661N7m948j0120j911Q6l087Q583L987m476j165L249J7987
4116A7067r15k7654l978r668J6634J3420r478l619R797J5328p581p316j61k206
4102c30P524Q710m80k0325k2284m399J9353O962l13J6666J4321j4766j9224j296
4088i881n264Q708m12N067K101j0721K524P380J0142j125M792p255j3896o682
4074a4522P568J4121J5877J138n155p750p016J5272j141K445j659k652o901q109
4060A516j535M376J1799k863j6529j735J036J1646j203L82P575j2755j0095j4748
$$ plain form
4046 -23133 -24403 -17961 -11344 63 7841 7958 13782 19129 16368 492 -5300 -752 -1776 -7797
4032 -7797 -15121 -5668 2556 -6891 -19893 -18693 -10363 -2908 4076 9843 10489 17237 21296 18199 2050
4017 2050 -4126 -4302 -3116 -13323 3069 8839 14819 13821 792 -7665 -14899 -14227 -21059 -31809 -23642
4002 -23642 -14211 -15000 -20302 -15144 4630 16808 6159 9172 12523 12222 10050 -4781 -7597 -2776
3988 -2776 -8221 -10258 -6185 10128 17329 19459 30761 22407 -6104 -28788 -8462 2151 -6356
3975 -6356 -5956 1704 248 -3980 -2337 7441 20041 21726 18175 17976 8994 15600 14613 10255 9393 -8701
3959 -8701 -1141 -1843 10640 14408 -2352 -17647 -12170 9196 33089 41601 30263 27983 10787
$$ packed form
4046b3133j270O442O617J1407P778J17N824N347k761j5876n792M548j024o021
4032g797p324R453Q224r447j3002J200Q330P455O984N767O46O748M059l097j6149
4017B050o176j76J186j0207J6392N770N980r98j3029q457p234O72o832j0750Q167
4002b3642R431p89n302N158J9774J2178j0649L013L351l01k172j4831k816M821
3988b776n445k037M073J6313P201K130J1302q354k8511k2684K0326J0613q507
3975f356M00P660j456m228J643R778J2600J685l551j99q982O606r87m358q62j8094
3959h701P560p02J2483L768j6760j5295N477K1366K3893Q512j1338k280j7196
$$ [...]
##END NTUPLES=NMR SPECTRUM
##END=
