##TITLE=Analysis number 320061
Compound Code tl 00757
Project Code adrs
Chemist Name fudan
##JCAMPDX= 6.0         $$ Bruker NMR JCAMP-DX V2.0
##DATA TYPE= NMR SPECTRUM
##DATA CLASS= NTUPLES
##ORIGIN= Bruker BioSpin GmbH
##OWNER= nmr
$$ XWIN-NMR		Version 3.5
$$ Mon Jun 12 12:02:46 2006 GMT Daylight Time (UT+1h)  MAYBRIDGE\nmr@NMR_250MHZ
##.OBSERVE FREQUENCY= 250.131544655141
##.OBSERVE NUCLEUS= ^1H
##.ACQUISITION MODE= SIMULTANEOUS (DQD)
##.ACQUISITION SCHEME= undefined
##.AVERAGES= 16
##.DIGITISER RES= 18
##SPECTROMETER/DATA SYSTEM= dpx250
##.PULSE SEQUENCE= zg30
##.SOLVENT NAME= DMSO
##.SHIFT REFERENCE= (INTERNAL, DMSO, 0, 16.522)
##AUDIT TRAIL= $$ (NUMBER, WHEN, WHO, WHERE, WHAT)
$$ ##TITLE= Audit trail, XWIN-NMR		Version 3.5
$$ ##JCAMPDX= 5.01
$$ ##ORIGIN= Bruker BioSpin GmbH
$$ ##OWNER= nmr
$$ C:\u/data/dgb/nmr/ADRS/550/pdata/1/auditp.txt
$$ ##AUDIT TRAIL=  $$ (NUMBER, WHEN, WHO, WHERE, WHAT)
(   1,<2006-06-12 12:02:05.17 +100>,<MAYBRIDGE\nmr>,<NMR_250MHZ>,
      <created by zg, POWCHK disabled, PULCHK disabled
       configuration hash MD5:
       E2 DF 36 D8 04 B2 41 60 5A D7 A3 38 5A 4B D0 FE
       data hash MD5: 64K
       69 D0 C4 57 02 22 0D 1D 0B 92 08 43 E5 15 4E F6>)
(   2,<2006-06-12 12:02:24.12 +100>,<MAYBRIDGE\nmr>,<NMR_250MHZ>,
      <Start of raw data processing
       ef LB = 0.3 FT_mod = 6 PKNL = 1 SI = 32K 
       data hash MD5: 32K
       DB EE 64 2D 2F 80 D8 DE 8E FA 46 4E 45 8F 37 F5>)
(   3,<2006-06-12 12:02:28.25 +100>,<MAYBRIDGE\nmr>,<NMR_250MHZ>,
      <apk 
       data hash MD5: 32K
       75 14 B0 92 9D 61 A7 65 5B 66 48 31 B9 DC 88 43>)
(   4,<2006-06-12 12:02:29.89 +100>,<MAYBRIDGE\nmr>,<NMR_250MHZ>,
      <abs ABSG = 5 
       data hash MD5: 32K
       0A FC 9B 53 2D AC BB AE B1 A6 82 8B E9 DA E5 43>)
$$ ##END=
$$ 
$$ hash MD5
$$ 48 D8 AC 45 1C D5 88 5A 7A BE 6A A0 86 65 A5 A7
##$RELAX= 
##$RELAX= 
##$RELAX= 
##$RELAX= 
##$RELAX= 
##$RELAX= 
##$RELAX= 
$$ Bruker specific parameters
$$ --------------------------
##$DU= <C:\u>
##$EXPNO= 550
##$NAME= <ADRS>
##$PROCNO= 1
##$TYPE= <nmr>
##$USER= <dgb>
##$AMP= (0..31)
100 100 100 100 100 100 100 100 100 100 100 100 100 100 100 100 100 100 
100 100 100 100 100 100 100 100 100 100 100 100 100 100 
##$AQSEQ= 0
##$AQ_mod= 3
##$AUNM= <au_zg>
##$AUTOPOS= <20 >
##$BF1= 250.13
##$BF2= 250.13
##$BF3= 250.13
##$BF4= 250.13
##$BF5= 500.13
##$BF6= 500.13
##$BF7= 500.13
##$BF8= 500.13
##$BYTORDA= 1
##$CFDGTYP= 0
##$CFRGTYP= 5
##$CHEMSTR= <none>
##$CNST= (0..31)
1 1 145 1 1 1 1 1 1 1 1 1 1 1 1 1 1 1 1 1 1 1 1 1 1 1 1 1 1 1 1 1 
##$CPDPRG= <>
##$CPDPRG1= <>
##$CPDPRG2= <>
##$CPDPRG3= <>
##$CPDPRG4= <mlev>
##$CPDPRG5= <mlev>
##$CPDPRG6= <mlev>
##$CPDPRG7= <mlev>
##$CPDPRG8= <mlev>
##$CPDPRGB= <>
##$CPDPRGT= <>
##$D= (0..31)
0 1 0 0 0 0 0 0 0 0.06 0 0 0 0 0 0 0.0002 0 0 0 0 0 0 0 0 0 0 0 0 0 0 
0 
##$DATE= 1150110122
##$DBL= (0..7)
120 120 120 120 120 120 120 120 
##$DBP= (0..7)
150 150 150 150 150 150 150 150 
##$DBP07= 0
##$DBPNAM0= <>
##$DBPNAM1= <>
##$DBPNAM2= <>
##$DBPNAM3= <>
$$ [...]
##$SUBNAM7= <"">
##$SUBNAM8= <"">
##$SUBNAM9= <"">
##$SW= 20.6930455092707
##$SWIBOX= (0..15)
0 0 3 0 0 0 0 0 0 0 0 0 0 0 0 0 
##$SW_h= 5175.983436853
##$TD= 65536
##$TD0= 1
##$TE= 296.16
##$TE2= 300
##$TE3= 300
##$TEG= 300
##$TL= (0..7)
0 120 120 120 120 120 120 120 
##$TP= (0..7)
150 150 150 150 150 150 150 150 
##$TP07= 0
##$TPNAME0= <>
##$TPNAME1= <>
##$TPNAME2= <>
##$TPNAME3= <>
##$TPNAME4= <>
##$TPNAME5= <>
##$TPNAME6= <>
##$TPNAME7= <>
##$TPOAL= (0..7)
0.5 0.5 0.5 0.5 0.5 0.5 0.5 0.5 
##$TPOFFS= (0..7)
0 0 0 0 0 0 0 0 
##$TUNHIN= 0
##$TUNHOUT= 0
##$TUNXOUT= 0
##$USERA1= <user>
##$USERA2= <user>
##$USERA3= <user>
##$USERA4= <user>
##$USERA5= <user>
##$V9= 5
##$VALIST= <valist>
##$VCLIST= <CCCCCCCCCCCCCCC>
##$VD= 0
##$VDLIST= <DDDDDDDDDDDDDDD>
##$VPLIST= <PPPPPPPPPPPPPPP>
##$VTLIST= <TTTTTTTTTTTTTTT>
##$WBST= 1024
##$WBSW= 4
##$XGAIN= (0..3)
0 0 0 0 
##$XL= 0
##$YL= 0
##$YMAX_a= 413791
##$YMIN_a= -584513
##$ZGOPTNS= <>
##$ZL1= 120
##$ZL2= 120
##$ZL3= 120
##$ZL4= 120
##$ABSF1= 16.522
##$ABSF2= -4.171173
##$ABSG= 5
##$ABSL= 3
##$ALPHA= 0
##$AQORDER= 0
##$ASSFAC= 0
##$ASSFACI= 0
##$ASSFACX= 0
##$ASSWID= 0
##$AUNMP= <proc_1d>
##$AZFE= 0.1
##$AZFW= 0.1
##$BCFW= 0
##$BC_mod= 0
##$BYTORDP= 0
##$COROFFS= 0
##$CY= 12.5
##$DATMOD= 1
##$DC= 0
##$DFILT= <>
##$DTYPP= 0
##$F1P= 14.0000005364418
##$F2P= -0.99999901652339
##$FCOR= 0.5
##$FTSIZE= 32768
##$FT_mod= 6
##$GAMMA= 0
##$GB= 0
##$INTBC= 1
##$INTSCL= 1
##$ISEN= 128
##$LB= 0.3
##$LEV0= 0
##$LPBIN= 0
##$MAXI= 10000
##$MC2= 0
##$MEAN= 0
##$ME_mod= 0
##$MI= 0
##$NCOEF= 0
##$NC_proc= -4
##$NLEV= 6
##$NOISF1= 0
##$NOISF2= 0
##$NSP= 0
##$NTH_PI= 0
##$NZP= 0
##$OFFSET= 16.522
##$PC= 1
##$PHC0= 164.9568
##$PHC1= 4.580837
##$PH_mod= 1
##$PKNL= yes
##$PPARMOD= 0
##$PSCAL= 4
##$PSIGN= 0
##$REVERSE= no
##$SF= 250.13
##$SI= 32768
##$SIGF1= 0
##$SIGF2= 0
##$SINO= 400
##$SIOLD= 32768
##$SREGLST= <1H.DMSO>
##$SSB= 0
##$STSI= 32768
##$STSR= 0
##$SW_p= 5175.98343685301
##$SYMM= 0
##$S_DEV= 0
##$TDeff= 65536
##$TDoff= 0
##$TI= <Analysis number 999999
Compound Code 99
Book Reference 9
Project Code 9>
##$TILT= no
##$TM1= 0
##$TM2= 0
##$TOPLEV= 0
##$USERP1= <user>
##$USERP2= <user>
##$USERP3= <user>
##$USERP4= <user>
##$USERP5= <user>
##$WDW= 1
##$XDIM= 32768
##$YMAX_p= 465270450
##$YMIN_p= -355281
$$ End of Bruker specific parameters
$$ ---------------------------------
##NTUPLES= NMR SPECTRUM
##VAR_NAME=  FREQUENCY,     SPECTRUM/REAL,   SPECTRUM/IMAG
##SYMBOL=    X,             R,               I
##VAR_TYPE=  INDEPENDENT,   DEPENDENT,       DEPENDENT
##VAR_FORM=  AFFN,          ASDF,            ASDF
##VAR_DIM=   32768,         32768,           32768
##UNITS=     HZ,            ARBITRARY UNITS, ARBITRARY UNITS
##FACTOR=    0.157963299565203, 1,           1
##FIRST=     4132.6476996994, 0,             0
##LAST=      -1043.33573715361, 0,           0
##MIN=       -1043.33573715361, -355281,     0
##MAX=       4132.6476996994, 465270450,     0
$$ Real data points
##PAGE= N=1
##DATA TABLE= (X++(R..R)), XYDATA
$$ [...]
$$ plain form
17554 79561 -5148 -45381 56522 99120 73107 40775 -28044 21889 57056 41246 8696
17543 8696 -36977 11813 -9975 5141 12225 -45083 -97520 -40558 28286 96479 78880 21198
17531 21198 -4942 12859 88506 96530 164512 153572 154674 67039 -16484 -27103 -43952 -31917
17519 -31917 -47797 -31847 6487 52186 86225 126192 33623 -65427 -68297 -57487 -49778 66431
17507 66431 109796 47039 -18317 -6502 13237 47191 28619 -20510 -54313 4507 72254 86904
17495 86904 54285 10671 -122251 -179464 -47617 5423 -20193 -6339 -41936 -90485 -69939
17484 -69939 -43369 -6538 -12097 -81338 -93467 -81190 -105391 -112727 -37683 -38479 3851 23078
17472 23078 68932 124172 59097 31743 97584 68125 91914 81756 36445 1135 11230 50270
$$ packed form
17554G9561q4709m0233J01903M2598k6013l2332o8819M9933L5167j5810l2550
17543H696m5673M8790k1788J5116P084n7308n2437N6962O8844O8193j7599n7682
17531B1198k6140J7801P5647Q024O7982j0940J102q7635q3523j0619j6849J2035
17519c1917j5880J5950L8334M5699L4039L9967r2569r9050k870J0810P709J16209
17507F6431M3365o2757o5356J1815J9739L3954j8572m9129l3803N8820O7747J4650
17495H6904l2619m3614j32922n7213J31847N3040k5616J3854l5597m8549K0546
17484f9939K6570L6831n559o9241j2129J2277k4201p336P5044p96M2330J9227
17472B3078M5854N5240o5075k7354O5841k9459K3789j0158m5311l5310J0095L9040
$$ plain form
17460 50270 46492 68677 4216 -91705 -115007 -105706 -115794 -100659 -112869 -160385 -140717 -107485
17448 -107485 -110702 -70436 -62887 -28958 57768 1842 -56347 -23877 7703 -25718 -92604 -117361
17436 -117361 -119473 -185979 -203583 -136969 -82802 -35169 -239 14570 -23300 -14137 67402 35851
17424 35851 25675 38196 61564 126788 152708 44954 -38978 -74416 -71601 -49314 -76215 -126373
17412 -126373 -45636 375 40553 152572 73296 31614 -6683 -5294 -55376 -31517 -1909
17401 -1909 60119 103045 153539 136474 59997 10523 12904 -30895 -128838 -88532 -75802 -84616
17389 -84616 -67470 -15636 -31066 -25740 -52791 -83096 -77706 -5948 5005 -3781 44751 5669
17377 5669 -55451 -46005 -9933 -60925 -67501 -91431 26616 67288 12200 67759 46687 38680
$$ packed form
17460E0270l778K2185o4461r5921k3302R301j0088J5135j2210m7516J9668L3232
17448a07485l217M0266P549L3929Q6726n5926n8189L2470L1580l3421o6886k4757
17436a17361k112o6506j7604O6614N4167M7633L4930J4809l7870R163Q1539l1551
17424C5851j0176J2521K3368O5224K5920j07754q3932l5438K815K2287k6901n0158
17412a26373Q0737M6011M0178J12019p9276m1682l8297J389n0082K3859K9608
17401a909O2028M2926N0494j7065p6477m9474K381m3799r7943M0306J2730q814
17389h4616J7146N1834j5430N326k7051l0305N390P1758J0953q786M8532l9082
17377E669o1120R446L6072n0992o576k3930J18047M0672n5088N5559k1072q007
$$ plain form
17365 38680 -54344 -74221 -89715 -124311 -46951 64370 59445 36724 75895 156162 164562 78716
17353 78716 84173 98793 133833 112281 -24958 -54492 -32402 -53718 -50491 -42125 5473 12440
17341 12440 26118 -13249 -85406 -82924 -20309 22522 11627 -93343 -98706 -59558 -9006 -87260
17329 -87260 -72553 -106147 -124790 4706 77760 148932 54636 -4347 -26121 -59737 -37431
17318 -37431 -51427 -65142 -57571 83898 72171 21496 -40943 -76784 -111476 -131428 -62320 77681
17306 77681 87272 58140 20908 1350 37496 35599 77653 47927 12192 22234 60588 79254
17294 79254 54985 130177 142571 81406 94217 54717 -60059 -4281 107485 167089 225548
17283 225548 233868 107483 16128 48825 82875 129666 54219 -9888 41291 80843 99335
$$ packed form
17365C8680r3024j9877j5494l4596P7360J11321m925k2721L9171Q0267Q400q5846
17353G8716N457J4620L5040k1552j37239k9534K2090k1316L227Q366M7598O967
17341A2440J3678l9367p2157K482O2615M2831j0895j04970n363L9148N0552p8254
17329h7260J4707l3594j8643J29496P3054P1172r4296n8983k1774l3616K2306
17318c7431j3996j3715P571J41469j1727n0675o2439l5841l4692j9952O9108J40001
17306G7681R591k9132l7232j9558L6146j897M2054k9726l5735J0042L8354J8666
17294G9254k4269P5192J2394o1165J2811l9500j14776N5778J11766N9604N8459
17283B25548Q320j26385r1355L2697L4050M6791p5447o4107N1179L9552J8492
$$ plain form
17272 99335 60403 26706 56344 129913 164005 181139 125499 93924 80200 120007 101403 -28906
17260 -28906 -140611 -131999 -27389 51482 69667 82885 137289 124796 24693 -31313 -6442
17249 -6442 -62777 -65111 -33502 19279 106384 60660 57645 74124 4744 -8544 -12160 -50030
17237 -50030 3290 -6421 9162 57830 118697 75111 -4420 -24133 27469 35900 -63619 -121980
17225 -121980 -118825 -135536 -78300 -95553 -57914 -50471 -45879 -77782 -52392 34419 5038 -65479
17213 -65479 -26105 -20110 -4047 -58101 -6788 -29393 -9034 -40247 -52174 -116463 13603 -26837
17201 -26837 -42621 26930 83135 104137 66901 10234 -78211 -49342 12856 17304 -4656 7041
17189 7041 -30328 -58695 -37538 -100071 -133806 -85631 -27796 -93631 -189867 -163717 -84413 -57927
$$ packed form
17272I9335l8932l3697K9638P3569L4092J7134n5640l1575j3724L9807j8604j30309
17260b8906j11705Q612J04610P8871J8185J3218N4404j2493j00103n6006K4871
17249f442n6335k334L1609N2781Q7105m5724l015J6479o9380j3288l616l7870
17237e0030N3320r711J5583M8668O0867m3586p9531j9713N1602Q431r9519n8361
17225a21980L155j6711N7236j7253L7639P443M592l1903K5390Q6811k9381p0517
17213f5479L9374N995J6063n4054N1313k2605K0359l1213j1927o4289J30066m0440
17201b6837j5784O9551N6205K1002l7236n6667q8445K8869O2198M448k1960J1697
17189G041l7369k8367K1157o2533l3735M8175N7835o5835r6236K6150P9304K6486
$$ plain form
17177 -57927 -26626 -15374 11749 26089 5818 -47114 -51157 -23911 -60326 -13787 45808 39757
17165 39757 19808 1460 18167 30778 43772 45174 35653 61681 47814 42455 18099 56928
17153 56928 72651 42654 3480 -29916 -46852 -75983 -100399 -55685 -53575 16106 -40172 -55336
17141 -55336 -29469 -724 -21154 -30624 -22425 -32561 -51254 -144316 -115811 2777 -54631 -84067
17129 -84067 -27147 -5109 -7655 60030 -9161 -102108 -72728 -10205 38388 86549 107088 101131
17117 101131 66820 43661 6047 74054 130207 113276 103187 107796 101731 53835 -88002 -93075
17105 -93075 -14525 -52540 -92114 -83382 -31819 -34048 -54494 5583 5437 61111 73300 56033
17093 56033 118321 110593 97612 78773 25451 46973 103888 92909 35161 45156 18851 242
$$ packed form
17177e7927L1301J1252K7123J4340k0271n2932m043K7246l6415M6539N9595o051
17165C9757j9949j8348J6707J2611J2994J402r521K6028j3867n359k4356L8829
17153E6928J5723k9997l9174l3396j6936k9131k4416M4714K110O9681n6278j5164
17141e5336K5867K8745k0430r470Q199j0136j8693r3062K8505J18588n7408k9436
17129h4067N6920K2038k546O7685o9191r2947K9380O2523M8593M8161K0539n957
17117A01131l4311k3159l7614O8007N6153j6931j0089M609o065m7896j41837n073
17105i3075P8550l8015l9574Q732N1563k229k0446O0077j46N5674J2189j7267
17093E6033O2288p728j2981j8839n3322K1522N6915j0979n7748R995k6305j8609
$$ plain form
17081 242 -65831 -47344 -12016 -32145 -24549 37070 105902 43273 28398 -14472 -8644 -35503
17069 -35503 5057 65582 -17548 -104332 -63352 -152848 -178127 -101544 -15432 -13166 -88966 -165265
17057 -165265 -197948 -204978 -147430 13018 93391 51786 39758 -23193 -67477 -73030 -21159 39223
17045 39223 48657 17609 4773 27776 -31262 -17885 -49023 -63621 -34559 1257 73433 90544
17033 90544 34778 25958 -48627 -88353 -23894 24698 45882 132829 104765 69230 -11260 -65011
17021 -65011 -142992 -110617 47880 67207 75458 75184 22961 11508 -2176 13014 -85 -41196
17009 -41196 20467 106011 115802 87235 47919 19322 -32577 -28116 -145175 -133428 -79947 -21330
16997 -21330 37352 68423 50619 2500 2572 4413 -17153 -8058 -51373 -43202 -57896 614 32979
$$ packed form
17081B42o6073J8487L5328k0129P596O1619O8832o2629j4875m2870N828k6859
17069c5503M0560O0525q3130q6784M0980q9496k5279P6583Q6112K266p5800p6299
17057a65265l2683p030N7548J60448Q0373m1605j2028o2951m4284n553N1871O0382
17045C9223R434l1048j2836K3003n9038J3377l1138j4598K9062L5816P2176J7111
17033I0544n5766q820p4585l9726O4459M8592K1184Q6947k8064l5535q0490n3751
17021f5011p7981L2375J58497J9327Q251k74n2223j1453j3684J5190j3099m1111
17009d1196O1663Q5544R791k8567l9316k8597n1899M461j17059J1747N3481N8617
16997b1330N8682L1071j7804m8119P2J841k1566R095m3315Q171j4694N8510L2365
$$ plain form
16984 32979 29050 99409 159941 175344 74691 26816 25239 765 716 37998 94724 124430
16972 124430 54680 31218 58140 107795 112890 122375 160195 143535 13619 -33975 22481 41896
16960 41896 22990 75363 49782 66650 113318 126740 92955 114429 100459 133192 177788 110590
16948 110590 68720 36204 123829 159582 173914 154875 45385 -13912 35927 19212 -48934
16937 -48934 -82947 -125974 -87417 -100350 -133443 -66062 -56699 -53790 -45771 -107289 -33176 -19447
16925 -19447 -40525 -45078 774 -8053 -30123 -1512 42418 98253 41056 -11909 -29908 -55952
16913 -55952 4123 -39445 -35951 65698 63297 22034 -19813 -11339 -79010 -67114 1429 74939
16901 74939 140909 133164 118149 140603 103615 96668 128186 121627 20094 -31490 22321 94177
$$ packed form
16984C2979l929P0359O0532J5403j00653m7875j577k4474m9L7282N6726K9706
16972A24430o9750k3462K6922M9655N095R485L7820j6660j29916m7594N6456J9415
16960D1896j8906N2373k5581J6868M6668J3422l3785K1474j3970L2733M4596o7198
16948A10590m1870l2516Q7625L5753J4332j9039j09490n9297M9839j6715o8146
16937d8934l4013m3027L8557j2933l3093O7381R363K909Q019o1518P4113J3729
16925a9447k1078m553M5852q827k2070K8611M3930N5835n7197n2965j7999k6044
16913e5952O0075m3568L494J01649k401m1263m1847Q474o7671J1896O8543P3510
16901G4939O5970p745j5015K2454l6988o947L1518o559j01533n1584N3811P1856
$$ plain form
16889 94177 126482 55931 66263 55545 -7861 -86131 -165016 -129985 -32782 -68128 -139820 -173069
16877 -173069 -133512 -86782 36731 -39350 -62148 -6934 32619 87947 78893 -4768 -35329
16866 -35329 -72891 -81094 -57981 -103092 -63558 -68179 -30503 -19251 -133515 -152041 -115460 -37692
16854 -37692 -11975 -57838 -109951 -123107 -193807 -58097 -51385 -192164 -222867 -120968 -5870
16843 -5870 93943 35549 -70879 -190714 -140162 9992 -15757 -36173 -6364 45346 34215
16832 34215 71460 57128 10984 32505 -24607 -11351 -46601 29875 63627 33197 47742 2521
16820 2521 -17005 25503 -25840 -19609 -29789 -75554 -74294 -66919 -37010 -50200 -67739 -126577
16808 -126577 -176865 -202312 -124701 -128670 -91287 -66282 -101624 -109182 -105094 -74077 -46194 61012
$$ packed form
16889I4177L2305p0551J0332j0718o3406p8270p8885L5031R7203l5346p1692l3249
16877a73069L9557M6730J23513p6081k2798N5214L9553N5328r054q3661l0561
16866c5329l7562q203K3113m5111L9534m621L7676J1252j14264j8526L6581P7768
16854c7692K5717m5863n2113j3156p0700J35710O712j40779l0703J01899J15098
16843e870R9813n8394j06428j19835N0552J50154k5749k0416K9809N1710j1131
16832C4215L7245j4332m6144K1521n7112J3256l5250P6476L3752l0430J4545m5221
16820B521j9526M2508n1343O231j0180m5765J260P375K9909j3190j7539n8838
16808a26577n0288k5447P7611l969L7383K5005l5342p558M088L1017K7883J07206
$$ plain form
16796 61012 137107 105987 54826 55399 80700 40247 18062 -5817 57410 11636 -771 -17463
16784 -17463 -35282 -49435 -75357 -120476 -75317 -14535 20879 18444 -19268 -53711 -3940 -31097
16772 -31097 -38577 -53740 -1593 60862 104793 124804 29698 322 116626 108183 -25831 -62140
16760 -62140 -129215 -101913 -21001 -88276 -175791 -115855 -87607 -116742 -39114 56239 -29896 -36165
16748 -36165 -58827 -30660 17776 16050 -59098 -60210 -54481 -57962 -9630 70128 104727 122010
16736 122010 97204 88658 61934 64948 89660 124116 31941 -25819 -30147 -19832 -135072 -141512
16724 -141512 -128136 -96214 -42337 -74799 -65638 14989 85267 11182 -30200 -128826 -215137 -91847
16712 -91847 -63638 -57687 -78934 -27214 65613 60145 -17622 -74992 -72788 -7059 9359 50907
$$ packed form
16796F1012P6095l1120n1161N73K5301m0453k2185k3879O3227m5774j2407j6692
16784a7463j7819j4153k5922m5119M5159O0782L5414k435l7712l4443M9771k7157
16772c1097p480j5163N2147O2455M3931K0011r5106k9376J16304q443j34014l6309
16760f2140o7075K7302Q0912o7275q7515N9936K8248k9135P7628R5353q6135o269
16748c6165k2662K8167M8436j726p5148j112N729l481M8332P9758L4599J7283
16736A22010k4806q546k6724L014K4712L4456r2175n7760m328J0315j15240o440
16724a41512J3376L1922N3877l2462R161Q0627P0278p4085m1382r8626q6311J23290
16712i1847K8209N951k1247N1720R2827n468p7767n7370K204O5729J6418M1548
$$ plain form
16700 50907 46203 -11683 3899 -24895 34651 130597 107706 33203 -84671 -113965 -32447 -14036
16688 -14036 -31790 -26888 -33706 -21606 -16819 20162 27339 9736 -52900 -15942 -15983 -22628 46820
16675 46820 53105 -14370 -59784 20803 34131 -21810 6607 29011 12595 -73973 -88845 -99222
16663 -99222 -97179 13893 -42645 -87311 -109818 -72078 -158790 -68284 -10947 -15159 -13384 74451
16651 74451 108323 23876 -95802 -205427 -181927 -151863 -160711 -135454 -9789 86905 152741
16640 152741 96011 -53551 -68005 -14619 -20687 -56121 -47472 -39591 -85319 -94722 -20803 21938
16628 21938 -46398 -117276 -79256 -59282 -60817 -124125 -117137 -74564 -140921 -122762 -83273 -49457
16616 -49457 -44133 -18185 68509 129360 12312 -155104 -283547 -281069 -242631 -198465 -156829
$$ packed form
16700E0907m704n7886J5582k8794N9546R5946k2891p4503j17874k9294Q1518J8411
16688a4036j7754M902o818J2100M787L6981P177j7603o2636L6958m1o645O9448
16675D6820O285o7475m5414Q0587J3328n5941K8417K2404j6416q6568j4872j0377
16663i9222K043J11072n6538m4666k2507L7740q6712R0506N7337m212J775Q7835
16651G4451L3872q4447j19678j09625K3500L0064q848K5257J25665R6694O5836
16640A52741n6730j49562j4454N3386o068l5434Q649P881m5728r403P3919M2741
16628B1938o8336p0878L8020J9974j535o3308O988M2573o6357J8159L9489L3816
16616d9457N324K5948Q6694O0851j17048j67416j28443K478L8438M4166M1636
$$ plain form
16605 -156829 -117475 -159461 -204033 -188915 -221928 -222976 -180633 -89329 -66291 -70118 -128136 25925
16593 25925 79602 13804 -68359 -99372 -130433 -227409 -181521 -132136 -97162 -168771 -181814 -83683
16581 -83683 -69884 -89192 -135958 -124690 -22452 55305 141409 155318 87194 -1323 50253
16570 50253 -16086 -108587 -152016 -116391 -107394 -132893 -147377 -158144 -93199 -73163 7533 -30851
16558 -30851 -153178 -205856 -131036 -64129 -33096 -91940 -58990 -114810 -101038 -58315 -67571 -43779
16546 -43779 -61173 -261 37900 88649 104359 138154 129410 90047 37684 -20186 19611 14735
16534 14735 -21687 -112195 -109759 39539 10520 -76774 -76362 -10534 -11510 -100500 -135813 -179838
16522 -179838 -164996 -133681 -149307 -25516 64688 43688 109393 147754 130711 32030 42310
$$ packed form
16605a56829L9354m1986m4572J5118l3013j048M2343R1304K3038l827n8018J54061
16593B5925N3677o5798q2163l1013l1061r6976M5888M9385L4974p1609j3043R8131
16581h3683J3799j9308m6766J1268J02238P7757Q6104J3909o8124q8517N1576
16570E0253o6339r2501m3429L5625Q997k5499j4484j0767O4945K0036Q0696l8384
16558c0851j22327n2678P4820O6907L1033n8844L2950n5820J3772M2723r256K3792
16546d3779j7394O0912L8161N0749J5710L3795q744l9363n2363n7870L9797m876
16534A4735l6422r0508K436J49298k9019q7294M12O5828r76q8990l5313m4025
16522a79838J4842L1315j5626J23791R0204k1000O5705L8361j7043r8681J0280
$$ plain form
16511 42310 37244 40267 -28059 -87295 -105612 -27849 -58373 49020 110332 -2580 -72321 16555
16499 16555 6378 -30469 -108525 -173679 -132944 -116308 -140429 -106356 -39986 11954 83982 101546
16487 101546 32130 -49625 -88327 -122893 -161750 -140372 -129648 -145072 -100599 -124930 -4293
16476 -4293 12689 -12145 -32445 -54304 -29006 1585 50731 607 -119462 -78345 4772 7762
16464 7762 15131 10237 -26115 -16179 17221 -13293 -7680 18901 90351 75018 53986 19378 -15571
16451 -15571 -41143 -42735 -10165 12271 -35121 -7143 6245 54804 108479 88593 9436 64960
16439 64960 112466 93591 78160 26713 -29408 -190513 -184834 -132675 -138621 -95289 21717 -29743
16427 -29743 -35824 -39436 -8508 23248 -30646 17184 40132 66129 4618 -63108 -108336 3244
$$ packed form
16511D2310n066L023o8326n9236j8317P7763l0524J07393O1312j12912o9741Q8876
16499A6555j0177l6847p8056o5154M0735J6636k4121L4073O6370N1940P2028J7564
16487A01546o9416q1755l8702l4566l8857K1378J0724j5424M4473k4331J20637
16476d293J6982k4834k0300k1859K5298L0591M9146n0124j20069M1117Q3117K990
16464G762P369m894l6352R936L3400l0514N613K6581P1450j5333k1032l4608l4949
16451a5571k5572j592L2570K2436m7392K7978J3388M8559N3675j9886p9157N5524
16439F4960M7506j8875j5431n1447n6121j61105N679N2159n946M3332J17006n1460
16427b9743o081l612L0928L1756n3894M7830K2948K5997o1511o7726m5228J11580
$$ plain form
16415 3244 40106 55172 32315 -25554 64749 17602 48416 72325 -11605 -33790 -4812 28711
16403 28711 41692 14463 2204 101560 88566 14980 -65902 -125593 -128139 -160314 -172137 -146570
16391 -146570 -24589 54248 120125 78245 -1656 -58521 -76959 -57368 -79817 -76911 -34872
16380 -34872 12682 14304 -33640 -36396 -119132 -74230 -32260 -99921 -106901 -125788 -127278 -135626 -91979
16367 -91979 -22841 -36120 -64530 -6486 42816 -52538 -91816 -97343 -96201 -175532 -148144 -21159
16355 -21159 -11080 4426 -20436 -17639 -50302 -67815 -86276 -66744 -16383 -32423 -79718 -83710
16343 -83710 -93262 -87874 -40694 -8235 -115576 -176889 -95966 17387 54655 26190 -4437 -117755
16331 -117755 -182424 -117891 1600 104298 196019 136216 41163 -11320 37618 68000 42491
$$ packed form
16415C244L6862J5066k2857n7869R0303m7147L0814K3909q3930k2185K8978L3523
16403B8711J2981k7229j2259R9356j2994p3586q0882n9691k546l2175j1823K5567
16391a46570J21981P8837O5877m1880p9901n6865j8438J9591k2449K906M2039
16380c4872M7554J622m7944k756q2736M4902M1970o7661o980j8887j490q348M3647
16367i1979O9138j3279k8410N8044M9302r5354l9278n527J142p9331K7388J26985
16355b1159J0079J5506k4862K797l2663j7513j8461J9532N0361j6040m7295l992
16343h3710r552N388M7180L2459j07341o1313Q0923J13353L7268k8465l0627j13318
16331a17755o4669O4533J19491J02698R1721n9803r5053n2483M8938L0382k5509
$$ plain form
16320 42491 -24217 44523 64746 22147 2857 -68115 -129494 -131203 -78841 10597 66918 53691
16308 53691 62476 -57006 -99521 -119028 -170187 -192048 -127501 -163820 -180170 -104588 -115644 -95616
16296 -95616 -42750 -88300 -75653 -69234 -58856 -41959 -58464 -39975 4632 -7556 -79085 -99281
16284 -99281 -42286 -58564 -89178 -87822 -47301 -49244 -120513 -128219 -76489 -91570 -97412 -63610
16272 -63610 -101111 -161710 -189417 -172237 -57736 -41108 -139144 -138343 -134189 -127324 -101670 -146881
16260 -146881 -101264 -26236 59887 31664 93409 22991 -46051 -28198 -69323 -149757 -154653 -97089
16248 -97089 -111026 -68876 -52222 -71418 -96328 -53962 -17661 -23059 -51363 -4493 26206 56150
16236 56150 23751 13799 54 -41159 -125943 -121512 -101229 -45816 -38927 -23395 -40085 -7252
$$ packed form
16320D2491o6708O8740K0223m2599j9290p0972o1379j709N2362Q9438N6321j3227
16308E3691Q785j19482m2515j9507n1159k1861O4547l6319j6350P5582j1056K0028
16296i5616N2866m5550J2647O419J0378J6897j6505J8489M4607j2188p1529k0196
16284i9281N6995j6278l0614J356M0521j943p1269p706N1730j5081n842L3802
16272f3610l7501o0599k7707J7180J14501J6628r8036Q01M154O865K5654m5211
16260a46881M5617P5028Q6123k8223O1745p0418o9042J7853m1125q0434m896N7564
16248i7089j3937M2150J6654j9196k4910M2366L6301n398k8304M6870L0699K9944
16236E6150l2399r952j3745m1213q4784M431K0283N5413O889J5532j6690L2833
$$ plain form
16224 -7252 -19977 -37587 -57183 -55705 1880 25905 28469 29716 -39631 -134441 -203691 -206201 -130963
16211 -130963 -129372 -61185 -37823 1011 50074 -20794 -142620 -182891 -136039 -102973 -110105 -112260
16199 -112260 -114563 -31843 23197 92508 87735 18859 -3382 -32844 -145256 -206966 -135473 3345
16187 3345 31281 29845 29284 -12184 -30851 -2551 -68092 -101607 -64534 -130547 -58977 35875
16175 35875 36567 34311 14434 -83124 -133713 -44052 -11278 -46728 -62708 -12362 32594 62090
16163 62090 118212 79638 81062 76633 56868 33321 87921 109431 158030 203879 120217 129630
16151 129630 109740 105208 118770 75648 -62266 -91831 -5435 -24615 -123287 -40229 -25075
16140 -25075 -32390 -5372 2548 -30104 -50747 -104691 -158222 -127968 -17203 91394 86781 -8142
$$ packed form
16224g252j2725j7610j9596J478N7585K4025K564J247o9347r4810o9250k510P5238
16211a30963J591O8187K3362L8834M9063p0868j21826m0271M6852L3066p132k155
16199a12260k303Q2720N5040O9311m773o8876k2241k9462j12412o1710P1493J38818
16187C345K7936j436n61m1468j8667K8300o5541l3515L7073o6013P1570R4852
16175C5875O92k256j9877r7558n0589Q9661L2774l5450j5980N0346M4956K9496
16163F2090N6122l8574J424m429j9765k3547N4600K1510M8599M5849q3662R413
16151A29630j9890m532J3562m3122j37914k9565Q6396j9180r8672Q3058J5154
16140b5075p315K7018P920l2652k0643n3944n3531L0254J10765J08597m613r4923
$$ plain form
16128 -8142 -73667 -72960 -80063 -147175 -80806 -68698 -113950 -99330 -88645 -47237 -37719 -107692 -129428
16115 -129428 -105912 -176262 -116158 -88410 -88896 -95481 -69709 -55611 -45770 -71835 2298 17940
16103 17940 -28095 35112 106302 146376 131320 73233 53514 22137 12396 6425 -24103 -63188
16091 -63188 -6062 -30175 -20156 12592 15625 25262 102141 159245 108367 88306 87278 76428
16079 76428 125220 208851 160857 50521 17032 11921 -70257 -50766 -96084 -258401 -317708
16068 -317708 -272571 -286098 -209777 -111536 -71304 -58355 -72365 -71375 7493 2459 -64291 -69788
16056 -69788 -72828 -20860 19348 26493 -31988 -18590 101098 191454 202513 139705 168764 106603
16044 106603 66625 159116 193633 229190 207905 65408 -30807 -58909 -86682 -77802 -30996
$$ packed form
16128h142o5525P07p103o7112O6369J2108m5252J4620J0685M1408R518o9973k1736
16115a29428K3516p0350O0104K7748m86o585K5772J4098R841k6065P4133J5642
16103A7940m6035O3207P1190M0074j5056n8087j9719l1377r741n971l0528l9085
16091f3188N7126k4113J0019L2748L033R637P6879N7104n0878k0061j028j0850
16079G6428M8792Q3631m7994j10336l3489n111q2178J9491m5318j62317n9307
16068c17708M5137j3527P6321R8241M0232J2949j4010R90P8868n034o6750n497
16056f9788l040N1968M0208P145n8481J3398J19688R0356J1059o2808K9059o2161
16044A06603l9978R2491L4517L5557k1285j42497r6215k8102k7773Q880M6806
$$ plain form
16033 -30996 2296 28660 3704 -35277 -135368 -223299 -244170 -194477 -84609 -66421 -100531
16022 -100531 -142335 -95329 -56762 -29174 39106 81569 7344 -1884 -59662 -98632 -123280 -115751
16010 -115751 -129583 -138016 23801 80165 93892 56801 -49372 -92791 -112289 -154543 -177461
15999 -177461 -48114 75576 171017 114712 99714 57375 -37866 -95843 -33150 9263 8796
15988 8796 36507 81220 67174 51597 65222 106271 121237 154654 132436 27338 -17311 -20213
15976 -20213 -112755 -74024 31429 41532 56277 -15906 -57898 -102059 -162471 -135850 -95166
15965 -95166 -55784 -44559 33116 20814 30934 90154 69852 14992 -33074 -73921 -7887 -33293
15953 -33293 -69667 -100900 -114583 -192569 -139106 -56325 -91643 -43745 -5300 52091 97842 59902
$$ packed form
16033c0996L3292K6364k4956l8981j00091q7931k0871M9693J09868J8188l4110
16022a00531m1804M7006L8567K7588O8280M2463p4225r228n7778l8970k4648P529
16010a15751j3832q433J61817N6364J3727l7091j06173m3419j9498m2254k2918
15999a77461J29347J23690R5441n6305j4998m2339r5241n7977O2693M2413m67
15988H796K7711M4713j4046j5577J3625M1049J4966L3417k2218j05098m4649k902
15976b0213r2542L8731J05453J0103J4745p2183m1992m4161o0412K6621M0684
15965i5166L9382J1225P7675j2302J0120N9220k0302n4860m8066m0847O6034k5406
15953c3293l6374l1233j3683p7986N3463Q2781l5318M7898L8445N7391M5751l7940
$$ plain form
15941 59902 -13003 19469 -25401 -54644 -119580 -180123 -126020 -56208 -94249 -87948 -19887 -65501
15929 -65501 -90190 -35270 5856 19599 -3394 -36427 -116781 -148673 -191514 -191826 -212559 -201000
15917 -201000 -134586 -107312 -83813 35278 75520 -31763 -112183 -72849 -54111 -85136 -103206
15906 -103206 -118035 -45959 -52937 -56907 -69763 -20969 25756 99344 141977 70403 540 50736
15894 50736 52035 34018 79222 104342 97673 29880 309 -39831 -31111 22922 2446 14527
15882 14527 -2113 -55356 -94223 -93403 -130647 -75035 -74444 -64991 -40862 -55181 -136597 -138609 -114372
15869 -114372 -43773 -33407 -59495 -46111 16193 36943 -16424 2972 65402 80474 65704
15858 65704 43353 17038 -78869 -139325 -160852 -128171 -37054 -23054 -48875 -32192 9787 54068
$$ packed form
15941E9902p2905L2472m4870k9243o4936o0543N4103O9812l8041O301O8061m5614
15929f5501k4689N4920M1126J3743k2993l3033q0354l1892m2841l12k0733J1559
15917b01000O6414K7274K3499J19091M0242j07283q0420L9334J8738l1025j8070
15906a03206j4829P2076o978l970j2856M8794M6725P3588M2633p1574o9863N0196
15894E0736J299j8017M5204K5120o669o7793k9571m0140Q720N4033k0476J2081
15882A4527j6640n3243l8867Q20l7244N5612N91R453K4129j4319q1416k012K4237
15869a14372P0599J0366k6088J3384O2304K0750n3367J9396O2430J5072j4770
15858F5704k2351k6315r5907o0456k1527L2681R1117J4000k5821J6683M1979M4281
$$ plain form
15846 54068 41862 58471 84738 17385 63626 79026 58596 55871 99719 169470 203567 89547
15834 89547 -8419 50998 27449 31425 56313 55017 45042 63017 102434 93227 80980 41368
15822 41368 -16842 -11537 44542 59675 96723 46357 60293 52452 -11542 -68667 -137289 -74956
15810 -74956 20794 138019 148499 104159 91797 62723 35234 -37747 -95786 -155638 -197657
15799 -197657 -144139 -78020 -124919 -23785 24615 -17555 -348 30094 2892 -37695 -81807
15788 -81807 -120998 -151543 -86087 -5604 12575 11282 -20342 -85057 -92080 -115510 -144288 -171436
15776 -171436 -116471 -57659 -70062 -119476 -125461 -103353 -60059 -3481 54465 90122 129546 105047
15764 105047 26591 6128 15727 -62248 -106902 -70556 26901 44049 70992 100446 149296 142362
$$ packed form
15846E4068j2206J6609K6267o7353M6241J5400k0430k725M3848O9751L4097j14020
15834H9547r7966N9417k3549L976K4888j296r975J7975L9417r207j2247l9612
15822D1368n8210N305N6079J5133L7048n0366J3936p841o3994n7125o8622O2333
15810g4956R5750J17225J0480m4340j2362k9074k7489p2981n8039n9852m2019
15799a97657N3518O6119m6899J01134M8400m2170J7207L0442k7202m0587m4112
15788h1807l9191l0545O5456Q0483J8179j293l1624o4715p023k3430k8778k7148
15776a71436N4965N8812j2403m9414n985K2108M3294N6578N7946L5657L9424k4499
15764A05047p8456k0463R599p7975m4654L6346R7457J7148K6943K9454M8850o934
$$ plain form
15752 142362 -16754 -83611 -15222 51667 43761 -935 -45711 -13534 68582 61103 121440 155154
15740 155154 106570 67323 136343 87768 40232 11206 -42275 -79893 28769 64936 -35767
15729 -35767 -113419 -97011 -63178 33436 61484 118874 79346 19825 27039 2510 -2270 20164
15717 20164 90601 -34994 10225 102112 124128 112611 40982 16691 79709 149022 39839
15706 39839 16407 108787 176918 138935 77790 46937 -71965 -99365 -32086 -256 18993
15695 18993 71429 37937 77074 22273 9704 -65766 -62955 -4355 24356 32582 41388 81270
15683 81270 111722 81619 50325 -38179 -87090 -127502 -111113 -130363 -57658 31287 -18304 -37414
15671 -37414 1120 -65904 -79308 -68387 -93599 -94259 -47924 20588 56371 15492 48051 134706
$$ packed form
15752A42362j59116o6857O8389O6889p906m4696m4776L2177Q2116p479O0337L3714
15740A55154m8584l9247O9020m8575m7536k9026n3481l7618J08662L6167j00703
15729c5767p7652J6408L3833R6614K8048N7390l9528n9521P214k4529m780K2434
15717B0164P0437j25595M5219R1887K2016j1517p1629k4291O3018O9313j09183
15706C9839k3432R2380O8131l7983o1145l0853j18902k7400O7279L1830J9249
15695A8993N2436l3492L9137n4801j2569p5470K811N8600K8711Q226Q806L9882
15683H1270L0452l0103l1294q8504m8911m0412J6389j9250P2705Q8945m9591j9110
15671c7414L8534o7024j3404J0921k5212o60M6335O8512L5783m0879L2559Q6655
$$ plain form
15659 134706 31064 -101669 -149036 -184250 -44885 74875 -22566 -106962 -167920 -178437 -104476
15648 -104476 -60278 -29569 12756 9791 -27838 -8919 55330 29681 -37149 -92285 -81932 -31672
15636 -31672 2793 -64303 -85386 -101757 -181744 -54588 6916 -21279 -97881 -147106 -68056
15625 -68056 -118367 -186156 -77611 2338 -417 -11558 -61421 -4979 46231 50441 2971 -34828
15613 -34828 33602 45399 95576 108985 89440 63092 8339 31491 73560 -34534 -10558
15602 -10558 28631 76924 56287 -67507 -81538 -10426 49342 37370 -544 10789 -43293
15591 -43293 -138980 -104332 -135632 -173836 -189360 -180677 -134146 -45890 -9010 6321 -55096 -102955
15579 -102955 1977 20774 -26392 -6303 -2382 -88725 -75512 -40889 -91450 -82201 -105107 -130459
$$ packed form
15659A34706j03642j32733m7367l5214J39365J19760r7441q4396o0958j0517P3961
15648a04476M4198L0709M2325k965l7629J8919O4249k5649o6830n5136J0353N0260
15636c1672L4465o7096k1083j6371p9987J27156O1504k8195p6602m9225P9050
15625f8056n0311o7789J08545P9949k755j1141m9863N6442N1210M210m7470l7799
15613c4828O8430J1797N0177J3409j9545k6348n4753K3152M2069j08094K3976
15602a0558L9189M8293k0637j23794j4031P1112N9768j1972l7914J1333n4082
15591d3293r5687L4648l1300l8204j5524Q683M6531Q8256L6880J5331o1417m7859
15579a02955J04932J8797m7166K0089L921q6343J3213L4623n0561R249k2906k5352
$$ plain form
15567 -130459 -131923 -125814 -96369 -126601 -108877 -52365 -28502 -43956 -115417 -39290 -8894 2761
15555 2761 -27899 -26201 2422 -43982 -53854 -6553 43138 25497 43230 101969 128100 96723
15543 96723 29196 -12434 -84919 -106508 -142044 -148048 -89023 34543 -14573 -24481 -55751 -41704
15531 -41704 2463 -6666 -1952 -19307 -75588 -53329 -40362 58439 55256 54061 -2605 -99372
15519 -99372 -91785 -38977 -34760 41633 51374 54136 45310 33762 15922 41849 61125 48529 96543
15506 96543 125975 145589 108046 50835 -44366 -77768 -101561 -50232 18573 -38189 -62547 -97265
15494 -97265 -130047 -60194 -15354 -1010 -8972 55375 88092 40064 -26338 -14073 33503 62306
15482 62306 30995 -27249 -18954 20345 13915 72142 130276 96838 42251 -51603 -26912 2974
$$ packed form
15567a30459j464O109K9445l0232J7724N6512K3863j5454p1461P6127L0396J1655
15555B761l0660J698K8623m6404r872M7301M9691j7641J7733N8739K6131l1377
15543I6723o7527m1630p2485k1589l5536o004N9025J23566m9116r908l1270J4047
15531d1704M4167r129M714j7355n6281K2259J2967R8801l183j195n6666r6767
15519i9372P587N2808M217P6393R741K762q826j1548j7840K5927J9276j2596M8014
15506I6543K9432J9614l7543n7211r5201l3402k3793N1329O8805n6762k4358l4718
15494i7265l2782O9853M4840J4344p962O4347L2717m8028o6402J2265M7576K8803
15482F2306l1311n8244Q295L9299o430N8227N8134l3438n4587r3854K4691K9886
$$ plain form
15470 2974 -20563 -16336 -18870 -14498 -1441 -18164 -49182 -47193 -124999 -155653 -104827 -152390 -180751
15457 -180751 -139848 -79912 -97530 -57238 -18897 -7808 -18248 -50575 5024 -15113 32402
15446 32402 -39134 -67158 -22421 72746 70838 -26176 -77083 -58047 -38793 -62409 -79226 -104188
15434 -104188 -131789 -23611 60130 63733 14031 -19313 50362 93500 -6032 6989 34018
15423 34018 -18838 -47878 -94484 -96300 14832 76884 -10031 -27308 21868 5261 -28813 -117151
15411 -117151 -176418 -99289 -5345 41173 -21778 -39610 -36239 -16038 61452 28339 21241 46389
15399 46389 39507 -83227 -132419 -79025 -17764 -44307 -112873 -159496 -75347 -12827 -61901 -85421
15387 -85421 -23913 -3199 38767 74315 118569 86925 159241 118096 -41692 -52598 -104987
$$ packed form
15470B974k3537M227k534M372J3057j6723l1018J989p7806l0654N0826m7563k8361
15457a80751M0903N9936j7618M0292L8341J1089j0440l2327N5599k0137M7515
15446C2402p1536k8024M4737R5167j908r7014n0907J9036J9254k3616j6817k4962
15434a04188k7601J08178Q3741L603m9702l3344O9675M3138r9532J3021K7029
15423C4018n2856k9040m6606j816J11132O2052q6915j7277M9176j6607l4074q8338
15411a17151n9267P7129R3944M6518o2951j7832L371K0201P7490l3113p098K5148
15399D6389o882j22734m9192N3394O1261k6543o8566m6623Q4149O2520m9074k3520
15387h5421O1508K0714M1966L5548M4254l1644P2316m1145j59788j0906n2389
$$ plain form
15376 -104987 -128301 -98217 -148601 -87418 -12314 51502 88846 55061 4609 67021 69307 39775
15364 39775 39698 24592 99353 47071 13810 -3405 -7849 -93887 -78448 -87134 -110343 -138718 -69400
15351 -69400 -17104 -17003 2188 12462 83859 3365 -88833 -170414 -112066 -93170 -179601 -196009
15339 -196009 -137017 -135670 -141177 -106772 -31017 65095 89830 70289 -5063 -81439 -89309 -54200
15327 -54200 38108 49036 -64910 -172460 -164087 -178082 -141519 -42405 6745 -6575 -49621
15316 -49621 -71669 -59450 13031 82713 22938 -18409 -75618 -80846 -76545 12112 55116 -62915
15304 -62915 -102410 29 1823 57132 79222 23606 -82002 -129700 -86127 -145237 -190178
15293 -190178 -75061 -7747 -22143 39923 14469 -46080 -22057 -11549 -23374 -36677 20610
$$ packed form
15376a04987k3314L0084n0384O1183P5104O3816L7344l3785n0452O2412K286k9532
15364C9775p7j5106P4761n2282l3261j7215m444q6038J5439q686k3209k8375O9318
15351f9400N2296J01J9191J0274P1397q0494r2198q1581N8348J8896q6431j6408
15339a96009N8992J347n507L4405P5755R6112K4735j9541p5352p6376p870L5109
15327e4200R2308J0928j13946j07550Q373j3995L6563R9114M9150j3320m3046
15316d9621k2048J2219P2481O9682n9775m1347n7209n228M301Q8657M3004j18031
15304f2915l9495J02439J794N5309K2090n5616j05608m7698M3573n9110m4941
15293a90178J15117O7314j4396O2066k5454o0549K4023J0508j1825j3303N7287
$$ plain form
15282 20610 31384 10307 32025 38035 45936 48845 64084 49940 67659 15922 20441 1907
15270 1907 -55271 -35575 9723 33262 19405 89520 87946 5696 -60372 -44609 -36441 44398
15258 44398 118072 91380 35577 -10538 -32350 25903 37390 13632 -39706 -99672 -74169 -58211
15246 -58211 -95867 -71677 -63483 -83056 -70588 -42983 -34114 -33754 -987 3680 -42861 -85860 -177774
15233 -177774 -208307 -132975 -33634 -6157 170060 211765 128831 -27315 -68787 -26546 59521
15222 59521 63784 24195 24314 50548 28527 49952 43615 -20834 -38159 -18339 -12516 -79183 24737
15209 24737 42205 -10856 -17796 -54633 -90157 -65028 -38699 -24001 58902 102060 99739 64648
15197 64648 5084 28775 35616 -69531 -132605 -126066 -3080 87125 57626 -21733 -72292 -12367
$$ packed form
15282B0610J0774k1077K1718O010P901K909J5239j4144J7719n1737M519j8534
15270A907n7178J9696M5298K3539j3857P0115j574q2250o6068J5763Q168Q0839
15258D4398P3674k6692n5803m6115k1812N8253J1487k3758n3338n9966K5503J5958
15246e8211l7656K4190Q194j9573J2468K7605Q869L60L2767M667m6541m2999r1914
15233a77774l0533P5332R9341K7477J76217M1705q2934j56146m1472M2241Q6067
15222E9521M263l9589J19K6234k2021K1425o337o4449j7325J9820N823o6667J03920
15209B4737J7468n3061o940l6837l5524K5129K6329J4698Q2903M3158k321l5091
15197F4648n9564K3691O841j05147o3074O539J22986R0205k9499p9359n0559N9925
$$ plain form
15185 -12367 -354 16822 20404 -28267 -56396 -112720 -174656 -219100 -163638 -119082 -120698 -145682
15173 -145682 -109455 -24462 58519 78282 12375 -31256 -25989 -66876 -99897 -98298 -116923 -92685
15161 -92685 -104759 -84395 -11800 -6244 -49745 -46684 -32588 75291 94120 36938 -16183 -107454
15149 -107454 -153977 -76890 -102871 -118672 -125164 -94458 -113582 -121725 -75831 6643 21997 12633
15137 12633 -32523 -122228 -171886 -176567 -132600 -46817 -83851 -99136 -51823 25280 36906 31043
15125 31043 97382 63521 15812 45575 7575 -34210 -53319 -37151 -61660 -122443 -109276 -73552
15113 -73552 -65788 -116026 -85844 -142038 -87256 -102501 -44616 30362 54865 45854 35798 10911
15101 10911 -8104 9622 76865 40111 37823 57982 82487 39989 83222 59607 77145 133411
$$ packed form
15185a2367J2013J7176L582m8671k8129n6324o1936m4444N5462M4556j616k4984
15173a45682L6227Q4993Q2981J9763o5907m3631N267m0887l3021J599j8625K4238
15161i2685j2074K0364P2595N556m3501L061J4096J07879J8829n7182n3121r1271
15149a07454m6523P7087k5981j5801o492L0706j9124q143M5894Q2474J5354r364
15137A2633m5156q9705m9658m681M3967Q5783l7034j5285M7313P7103J1626n863
15125C1043O6339l3861m7709K9763l8000m1785j9109J6168k4509o0783J3167L5724
15113g3552P764n0238L0182n6194N4782j5245N7885P4978K4503r011j0056k4887
15101A0911j9015J7726O7243l6754k288K0159K4505m2498M3233k3615J7538N6266
$$ plain form
15089 133411 102816 42873 14273 73978 124548 82220 62267 38816 24128 27656 37799 36100
15077 36100 34936 28661 21161 41641 40776 78261 72926 79076 20078 -45701 -61276 -3120 31872
15064 31872 76564 173898 117045 40801 -70697 -104962 -63168 -97096 -114900 -100795 -78050
15053 -78050 -31598 35528 45591 -33309 -74685 -1560 -48294 -34994 -61511 -71468 -81612 -110476
15041 -110476 -102278 1509 70750 87859 115150 52788 -26874 -28991 -40091 -44557 6991 94372
15029 94372 52581 21711 10884 74703 108121 175057 53004 49412 73744 -4587 -52325 -69055
15017 -69055 -13708 -81911 -146487 -199342 -205062 -87722 -20259 25663 -10378 88 83084 149468
15005 149468 77603 1669 -86512 -97038 -72805 -137068 -108217 -95984 -46623 -19743 24185
$$ packed form
15089A33411l0595n9943k8600N9705N0570m2328j9953k3451j4688L528J0143j699
15077C6100j164o275p500K0480q65L7485n335O150n8998o5779j5575N8156L4992
15064C1872M4692R7334n6853p6244j11498l4265M1794l3928j7804J4105K2745
15053g8050M6452O7126J0063p8900m1376P3125m6734J3300k6517r957j0144k8864
15041a10476Q198J03787O9241J7109K7291o2362p9662k117j1100m466N1548Q7381
15029I4372m1791l0870j0827O3819L3418O6936j22053l592K4332p8331m7738j6730
15017f9055N5347o8203o4576n2855n720J17340O7463M5922l6041J0466Q2996O6384
15005A49468p1865p5934q8181j0526K4233o4263K8851J2233M9361K6880M3928
$$ plain form
14994 24185 -22828 -90908 -77433 -22777 -95002 -175745 -158298 -166306 -125760 -161526 -141281 -49137
14982 -49137 -9876 -42411 -71775 -127794 -131208 -53447 -66692 -59682 -32066 33249 23561 39411
14970 39411 8179 70036 149036 144943 77846 -82279 -155630 -226563 -157208 -17371 61742
14959 61742 108712 124270 21331 26929 78707 83095 14423 -100363 -119868 -91176 -69221 -88887
14947 -88887 -46305 -70837 -110800 -121314 -55753 10803 41118 99950 56243 -26748 -37291 -49285
14935 -49285 -48346 53153 93387 72196 70440 31584 -40382 -114589 -96363 -54400 -11100 -49903
14923 -49903 -15712 69011 25372 -48916 -28984 -9179 82571 49854 10852 -38924 -52273 1779
14911 1779 8365 -3 3357 -64480 -122436 -97896 5685 84362 3291 -82803 -93349 -95055
$$ packed form
14994B4185m7013o8080J3475N4656p2225q0743J7447q008M0546l5766K0245R2144
14982d9137L9261l2535k9364n6019l414P7761j3245P010K7616O5315r688J5850
14970C9411l1232O1857P9000m093o7097j60125p3351p0933O9355J39837P9113
14959F1742M6970J5558j02939N598N1778M388o8672j14786j9505K8692K1955j9666
14947h8887M2582k4532l9963j0514O5561O6556L0315N8832m3707q2991j0543j1994
14935d9285R39J01499M0234k1191j756l8856p1966p4207J8226M1963M3300l8803
14923d9903L4191Q4723m3639p4288J9932J9805R1750l2717l9002m9776j3349N4052
14911A779O586q368L360o7837n7956K4540J03581P8677q1071q6094j0546j706
$$ plain form
14899 -95055 -81620 -89892 -99526 -117139 -118810 -114049 -134131 -191007 -166876 -135348 -126020 -133093 -110201
14886 -110201 8923 32234 36373 37916 47543 56838 69810 74792 62801 42553 47105 80896
14874 80896 104785 62105 -15531 -99777 -88398 -117122 20431 36834 13201 -115295 -61082
14863 -61082 24744 26759 -56938 -6763 40966 14253 88041 111975 70038 52422 -21180 -75922
14851 -75922 -68789 -66615 -130758 -145205 -117029 -27167 29301 53084 16124 8824 -6691 -112667
14839 -112667 -135387 -67938 -31553 -57328 2800 45389 -19570 -71383 -12846 96479 80858
14828 80858 -7576 -15628 101331 81443 40900 54483 62471 36408 -22515 32367 39594 4364
14816 4364 109768 146563 25688 -31443 1577 32708 7753 52968 63525 39113 23080
$$ packed form
14899i5055J3435q272r634j7613j671M761k0082n6876K4131L1528R328p073K2892
14886a10201J19124K3311M139J543R627R295J2972M982j1991k0248M552L3791
14874H0896K3889m2680p7636q4246J1379k8724J37553J6403k3633j28496N4213
14863f1082Q5826K015q3697N0175M7729k6713P3788K3934m1937j7616p3602n4742
14851g5922P133K174o4143j4447K8176Q9862N6468K3783l6960p300j5515j05976
14839a12667k2720O7449L6385k5775O0128M2589o4959n1813N8537J09325j5621
14828H0858q8434q052J16959j9888m0543J3583P988k6063n8923N4882P227l5230
14816D364J05404L6795j20875n7131L3020L1131k4955M5215J0557k4412j6033
$$ plain form
14805 23080 71144 148907 92963 33090 39143 7465 -46116 -21741 -5051 80298 66506 11820
14793 11820 -27146 -14124 48214 -23193 11150 -2303 4036 -92403 -111611 -87088 -163729 -160303
14781 -160303 -112148 -114423 -53484 -2691 -47082 -82044 -46683 49 6041 22560 2639 -22188
14769 -22188 -52608 -25363 17371 38206 53769 20473 -9343 68779 25138 -14488 2839 -17998
14757 -17998 -66345 -72162 -101856 -18748 12230 53289 7308 -50819 -39568 -60775 -13267 48747
14745 48747 20256 30055 69659 -25584 -91546 -55497 -130270 -187304 -96362 -67000 -10493 -78605
14733 -78605 -118584 -8803 -2240 63573 73468 -92613 -111036 -69820 -63049 -30628 29181 2505
14721 2505 59727 40772 -16085 21499 76256 79782 71147 -39519 -160315 -158893 -156148 -148706
$$ packed form
14805B3080M8064P7763n5944n9873O053l1678n3581K4375J6690Q5349j3792n4686
14793A1820l8966J3022O2338p1407L4343j3453O339r6439j9208K4523p6641L426
14781a60303M8155k275O0939N0793m4391l4962L5361M6732N992J6519j9921k4827
14769b2188l0420K7245M2734K0835J5563l3296k9816P8122m3641l9626J7327k0837
14757a7998m8347n817k9694Q3108L0978M1059m5981n8127J1251k1207M7508O2014
14745D8747k8491R799L9604r5243o5962L6049p4773n7034R0942K9362N6507o8112
14733g8605l9979J09781O563O5813R895j66081j8423M1216O771L2421N9809k6676
14721B505N7222j8955n6857L7584N4757L526q635j10666j20796J422K745P442
$$ plain form
14709 -148706 -59072 -100973 -166868 -146847 -203931 -204441 -105471 -60222 -37074 -48603 -39713 -10644
14697 -10644 50890 10900 -24808 4642 -19611 -16148 54161 115764 143541 112594 24215 -49024
14685 -49024 -48596 14105 -20856 -67165 -36707 6471 17032 -80203 -166490 -210011 -144564 -112131
14673 -112131 -125977 -63810 -63727 -60485 -69299 -17103 81146 97717 -10323 -92388 -13822 66722
14661 66722 93257 58293 14951 55367 91060 151081 185004 120024 99783 3149 1983 33354
14649 33354 87832 126199 120967 135854 101352 -1321 -148415 -175922 -201774 -194274 -140158 -102166
14637 -102166 -88551 -74427 -99008 -77350 -47290 -63398 749 61020 46328 30266 19974
14626 19974 -40372 -65939 -62819 -86399 -92188 -42203 -11154 4464 -25014 -95237 -58077 -78522
$$ packed form
14709a48706Q9634m1901o5895K0021n7084n10R8970M5249K3148j1529Q890K9069
14697a0644O1534l9990l5708K9450k4253L463P0309O1603K7777l0947q8379p3239
14685d9024M28O2701l4961m6309L0458M3178J0561r7235q6287m3521O5447L2433
14673a12131j3846O2167Q3L242q814N2196R8249J6571j08040q2065P8566Q0544
14661F6722K6535l4964m3342M0416L5693O0021L3923o4980k0241r6634j166L1371
14649C3354N4478L8367n232J4887l4502j02673j47094k7507k5852P500N4116L7992
14637a02166J3615J4124k4581K1658L0060j6108O4147O0271j4692j6062j0292
14626A9974o0346k5567L120k3580n789M9985L1049J5618k9478p0223L7160k0445
$$ plain form
14614 -78522 -89839 -124523 -42714 -6839 -8117 -10607 555 71685 9328 -5531 105053 152843
14602 152843 108670 25299 8830 90165 81953 122436 136349 132347 140421 91174 90377 29013
14590 29013 -47817 -54471 -28341 54026 121025 114808 -3047 -54794 -44337 6872 55713 102527
14578 102527 91399 -61594 -2654 51790 120263 144265 118485 98959 -42347 -95553 -58673
14567 -58673 -74808 -107138 -51365 -323 2561 -79434 -87763 -76615 -48851 -169744 -163187 -53578
14555 -53578 -19897 55535 92440 41777 124034 113246 44112 -21458 -59076 -87201 -83936 -20045
14543 -20045 28721 64692 85634 62080 82018 61692 70734 -56167 -125141 -84520 -59721 5107
14531 5107 7983 -116570 -228601 -249971 -219048 -134740 -62675 -108156 -200547 -152698 -156791 -60271
$$ packed form
14614g8522j1317l4684Q1809L5875j278k490J1162P1130o2357j4859J10584M7790
14602A52843m4173q3371j6469Q1335q212M0483J3913m002Q074m9247p97o1364
14590B9013p6830o654K6130Q2367O6999o217j17855n1747J0457N1209M8841M6814
14578A02527j1128j52993N8940N4444O8473K4002k5780j9526j41306n3206L6880
14567e8673j6135l2330N5773N1042K884q1995q329J1148K7764j20893O557J09609
14555e3578L3681P5432L6905n0663Q2257j0788o9134o5570l7618k8125L265O3891
14543b0045M8766L5971K0942k3554J9938k0326R042j26901o8974M0621K4799O4828
14531E107K876j24553j12031k1370L0923Q4308P2065m5481r2391M7849m093R6520
$$ plain form
14519 -60271 -27705 14600 70122 62109 96746 84857 37676 994 -78295 -158488 -63956 6518
14507 6518 52911 28842 -85960 -174849 -102126 -117999 -75116 -81903 -174495 -182641 -64662 72165
14495 72165 7864 -38127 -19712 7835 7008 -103212 -84353 -6459 86216 30096 42978 -6879
14483 -6879 2903 56029 113896 79842 17383 5510 2652 44618 19921 -38272 -30304 -49097
14471 -49097 30806 1091 -76006 -85590 -72543 -58088 3699 33124 -76096 -184660 -102484
14460 -102484 -53849 -102966 -116197 -85305 -17157 59869 23735 11860 26526 41075 -33099
14449 -33099 -61250 -50274 -45642 46756 112695 111321 -9576 -8469 35359 14839 -10747 31307
14437 31307 1392 -22494 12418 22047 23101 -64224 -133495 -203336 -85156 -2537 10590 58316
$$ packed form
14519f0271L2566M2305N5522q013L4637j1889m7181l6682p9289q0193R4532P0474
14507F518M6393k4069j14802q8889P2723j5873M2883o787r2592q146J17979J36827
14495G2165o4301m5991J8415K7547q27j10220J8859P7894R2675n6120J2882m9857
14483f879R782N3126N7867l4054o2459j1873k858M1966k4697n8193P968j8793
14471d9097P9903k9715p7097r584J3047J4455O1787K9425j09220j08564Q2176
14460a02484M8635m9117j3231L0892O8148P7026l6134j1875J4666J4549p4174
14449c3099k8151J0976M632R2398O5939j374j20897J107M3828k0520k5586M2054
14437C1307k9915k3886L4912R629J054q7325o9271o9841J18180Q2619J3127M7726
$$ plain form
14425 58316 -1820 -108526 -57238 101566 119693 64065 48126 19168 15205 -11688 -38809
14414 -38809 4762 47301 118060 127164 104191 70030 47374 98812 87009 34228 -124434 -185816
14402 -185816 -229647 -128003 3352 49016 55353 99593 165648 195727 50628 -65359 -57394
14391 -57394 -18721 -13434 -51815 1423 -12305 -31191 -10867 -62952 -94728 -84208 -5087 102232
14379 102232 49198 -76325 -111178 -73589 -36676 -11774 3866 41547 -15582 -65174 -102369
14368 -102369 -161085 -71000 -59800 -73866 -69492 -27755 -93935 -122378 -46019 -25410 -273 -9995
14356 -9995 -92403 -89237 -119277 -111290 -42794 -90581 -16099 -48095 -36914 37417 24986 17781
14344 17781 -6484 -23517 -91769 -141347 -69185 1090 -34782 -67317 -73285 34061 37433 -23657
$$ packed form
14425E8316o0136j06706N1288J58804J8127n5628j5939k8958l963k6893k7121
14414c8809M3571M2539P0759R104k2973l4161k2656N1438j1803n2781j58662o1382
14402a85816m3831J01644J31355M5664O337M4240O6055L0079j45099j15987P965
14391e7394L8673N287l8381N3238j3728j8886K0324n2085l1776J0520P9121J07319
14379A02232n3034j25523l4853L7589L6913K4902J5640L7681n7129m9592l7195
14368a02369n8716R0085J1200j4066M374M1737o6180k8443P6359K0609K5137r722
14356i995q2408L166l0040P987O8496m7787P4482l1996J1181P4331j2431p205
14344A7781k4265j7033o8252m9578P2162P0275l5872l2535n968J07346L372o1090
$$ plain form
14332 -23657 -27316 -15879 -2359 -36287 -95950 -110177 -125252 -27538 -29539 -104860 -63723 -56713
14320 -56713 -55487 -54156 -12755 83476 45799 31392 36237 44852 36809 31299 117976 86776 -9041
14307 -9041 -44273 21725 20633 23354 59266 109761 110603 117280 115278 98413 41266 -4583 -68001
14294 -68001 -39900 -54806 -94931 -94710 -69061 1574 19720 -69193 -7728 141685 195855 214201
14282 214201 143892 46631 -6899 -65978 -42284 50963 86689 53562 8469 -32700 -95627
14271 -95627 -31050 65155 81489 92773 88129 99644 28185 -30026 1720 30749 -4670 -8233
14259 -8233 -50075 -90569 -91999 -98925 -125668 -130764 -73230 -110677 -131592 50876 53023 -7674
14247 -7674 -578 -9802 5690 -42522 -49184 39429 92955 104465 131263 123475 62210 -28477 -70644
$$ packed form
14332b3657l659J1437J3520l3928n9663j4227j5075R7714k001p5321M1137P010
14320e6713J226J331M1401R6231l7677j4407M845Q615q043n510Q6677l1200r5817
14307i041l5232O5998j092K721L5912N0495Q42O677k002j6865n7147m5849o3418
14294f8001K8101j4906m0125K21K5649P0635J8146q8913O1465J49413N4170J8346
14282B14201p0309r7261n3530n9079K3694R3247L5726l3127m5093m1169o2927
14271i5627O4577R6205J6334J1284m644J1515p1459n8211L1746K9029l5419l563
14259h233m1842m0494j430o926k6743n096N7534l7447k0915J82468K147o0697
14247g674P096r224J5492m8212o662Q8613N3526J1510K6798p788o1265r0687m2167
$$ plain form
14234 -70644 -62922 29013 46786 24215 -85689 -159160 -99677 -68756 -65193 15424 51670 3092
14222 3092 -47818 33396 165128 138458 90084 85695 45743 -4177 -5913 -23857 -5149 -39117
14210 -39117 2393 64193 50948 52160 85208 92062 61708 3169 29264 72305 59001 -61034
14198 -61034 -73244 -54132 -18854 -33387 -59108 -33233 -26544 -45301 -85364 -61472 -49939 -44413
14186 -44413 -109548 -95585 24399 125797 116913 70198 77837 32597 61910 60268 26193 33425
14174 33425 34846 88748 69040 25443 58160 51385 47564 101357 103441 32163 83799 70219
14162 70219 55791 -44835 -107052 -120140 -72488 -26403 74453 53517 32675 83674 76698
14151 76698 136561 85808 -39044 -81531 -95396 -79528 -104657 -121009 -61848 40542 55495
$$ packed form
14234g0644P722R1935J7773k2571j09904p3471N9483L0921L563Q0617L6246m8578
14222C092n0910Q1214J31732k6670m8374m389l9952m9920j736j7944J8708l3968
14210c9117M1510O1800j3245J212L3048O854l0354n8539K6095M3041j3304j20035
14198f1034j2210J9112L5278j4533k5721K5875O689j8757m0063K3892J1533N526
14186d4413o5135J3963J19984J01398q884m6715P639m5240K9313j642l4075P232
14174C3425J421N3902j9708m3597L2717o775l821N3793K084p1278N1636j3580
14162G0219j4428j00626o2217j3088M7652M6085J00856k0936k0842N0999o976
14151G6698N9863n0753j24852m2487j3865J5868k5129j6352N9161J02390J4953
$$ plain form
14140 55495 -75793 -104744 -42364 40193 69639 58786 12302 -3921 24690 71390 83357
14129 83357 18541 -3150 28854 95573 101916 107246 -2100 -20649 57385 127088 83754 41630
14117 41630 -16329 -24820 -617 -50146 -66332 -103788 -130251 -192730 -197429 -146092 -48154 -61764
14105 -61764 -72725 -68195 -91754 -144469 -190279 -133855 -127174 -156264 -169520 -192661 -126843 -119071
14093 -119071 -74181 -59373 -38250 -41253 -28707 32599 886 -6765 50991 109019 134625 34909
14081 34909 68345 89806 89933 58708 2696 45806 104266 12381 -6627 -20914 -60344 -18213
14069 -18213 29256 -16857 1399 105423 89460 488 -49330 -54257 -57378 -109644 -91381 -96821
14057 -96821 -86395 -35506 18776 16028 19885 20391 23471 -2023 91410 50906 -42936 -85176 -71911
$$ packed form
14140E5495j31288k8951O2380Q2557K9446j0853m6484j6223K8611M6700J1967
14129H3357o4816k1691L2004O6719O343N330j09346j8549P8034O9703m3334m2124
14117D1630n7959q491K4203m9529j6186l7456k6463o2479m699N1337R7938j3610
14105f1764j0961M530k3559n2715m5810N6424O681k9090j3256k3141O5818P772
14093a19071M4890J4808K1123l003J2546O1306l1713p651N7756N8028K5606r9716
14081C4909L3436K1461J27l1225n6012M3110N8460r1885j9008j4287l9430M2131
14069a8213M7469m6113J8256J04024j5963q8972m9818m927l121n2266J8263n440
14057i6821J0426N0889N4282k748L857N06L080k5494R3433m0504r3842m2240J3265
$$ plain form
14044 -71911 59503 86650 -2312 -58843 -14174 -36542 20489 111122 71895 -21308 -17335 11974
14032 11974 19837 55340 48371 -58405 -49380 -39458 29299 8066 -8113 23769 24945 -56015
14020 -56015 -72148 -19528 63457 103278 84333 112023 24106 -82460 -14390 64543 6307
14009 6307 -36544 -15358 -21322 -44854 2406 55818 73468 60960 794 -19916 -47629 -22609
13997 -22609 -44818 -81584 -89450 -40202 -9176 23569 -10363 -47506 -15135 36218 48685 61725
13985 61725 117520 122129 120754 44611 -30555 -33183 50232 -3291 -30225 10074 31833 69400
13973 69400 128168 74250 76049 120824 33521 -22665 -58299 -156758 -98563 -21555 -16552 -13594
13961 -13594 -62432 -58940 -11005 -2392 -23063 -64275 -76930 -96095 -85027 -18197 -21960 -120175
$$ packed form
14044g1911J31414K7147q8962n6531M4669k2368N7031R0633l9227r3203L973K9309
14032A1974P863L5503o969j06776R025R922O8757k1233j6179L1882J176q0960
14020e6015j6133N2620Q2985L9821j8945K7690q7917j06566O8070P8933n8236
14009F307m2851K1186n964k3532M7260N3412J7650j2508o0166k0710k7713K5020
13997b2609k2209l6766p866M9248L1026L2745l3932l7143L2371N1353J2467J3040
13985F1725N5795M609j375p6143p5166k628Q3415n3523k6934M0299K1759L7567
13973F9400N8768n3918J799M4775q7303n6186l5634r8459N8195P7008N003K958
13961a3594m8838L492M7935Q613k0671m1212j2655j9165J1068O6830l763r8215
$$ plain form
13949 -120175 -149978 -82417 -70370 -85860 -110534 -113779 -43951 -4117 -35964 -94412 -108602 -97266
13937 -97266 -58183 -28478 -91216 -86636 10026 26476 9709 -7371 -25452 -35498 -25928 658
13925 658 41164 37200 86427 43632 66027 4041 -54877 6196 -459 -8703 -62828 -52066 -17286
13912 -17286 -12867 28783 49798 10588 3328 35728 25523 60644 54653 33265 20323 -20222
13900 -20222 6134 15917 12122 -47759 -83394 33448 153778 142269 71735 -6436 -64667 -64694
13888 -64694 31655 58185 -1247 35032 29551 -73523 -132350 -196293 -182018 -88664 -34710 8787
13876 8787 -47193 -59303 -81511 -74635 -8714 -36491 -82950 41670 48832 -9336 -10955 -85811
13864 -85811 -83117 -73108 -37560 -87284 -124592 -133801 -83629 -77911 -86067 -153753 -185496 -168563
$$ packed form
13949a20175k9803O7561J2047j5490k4674l245O9828L9834l1847n8448j4190J1336
13937i7266L9083K9705o2738M580R6662J6450j6767j7080j8081j0046R570K6586
13925F58M0506l964M9227m2795K2395o1986n8918O1073o655q244n4125J0762L4780
13912a7286M419M1650K1015l9210p260L2400j0205L5121n991k1388j2942m0545
13900b0222K6356R783l795n9881l5635J16842J20330j1509p0534p8171n8231k7
13888f4694R6349K6530n9432L6279n481j03074n8827o3943J4275R3354N3954M3497
13876H787n5980j2110k2208O876O5921k7777m6459J24620P162n8168j619p4856
13864h5811K694J0009L5548m9724l7308r209N0172N718q156o7686l1743J6933
$$ plain form
13852 -168563 -213838 -300041 -263842 -153009 -91602 -55945 -70092 -82572 -37133 7700 -6995
13841 -6995 55219 134624 118841 139102 101064 10505 42861 44594 -100232 -165206 -64632 -9148
13829 -9148 -62657 -126352 -88264 -90984 -106647 -97832 -143181 -181223 -150194 -141985 -150885 -74559 35565
13816 35565 46465 4265 145 57209 53099 8527 -22391 -37169 -100995 -193176 -151357 -108338
13804 -108338 -138820 -111177 -95089 -105898 34764 110795 136657 104591 67265 72023 37651
13793 37651 -2891 2841 5361 -28067 -24729 -84309 -71444 -108903 -130390 -18783 109677 142688
13781 142688 29538 -52100 -11153 -47841 -1183 -1417 -50492 -38462 -44382 -19873 41727 22631
13769 22631 21688 -22269 -40809 -56040 -143864 -121199 -76599 -80013 -148444 -158466 -149745 -156665 -80162
$$ packed form
13852a68563m5275q6203L6199J10833O1407L5657j4147j2480M5439M4833j4695
13841f995O2214P9405j5783K0261l8038r0559L2356J733j44826o4974J00574N5484
13829i148n3509o3695L8088k720j5663Q815m5349l8042L1029Q209q900P6326J10124
13816C5565J0900m2200m120N7064m110m4572l0918j4778o3826r2181M1819M3019
13804a08338l0482K7643J6088j0809J40662P6031K5862l2066l7326M758l4372
13793C7651m0542N732K520l3428L338n9580J2865l7459k1487J11607J28460L3011
13781A42688j13150q1638M0947l6688M6658k34m9075J2030n920K4509O1600j9096
13769B2631r43m3957j8540j5231q7824K2665M4600l414o8431j0022Q721o920P6503
$$ plain form
13756 -80162 -97548 -74341 -32115 -59392 -89382 -99996 -114417 -127111 20948 41816 -14126
13745 -14126 16409 70321 35359 -80151 -40762 -26722 -121461 -100615 -143224 -117033 -150540
13734 -150540 -179903 -84810 -97875 -85151 5948 109073 151154 180116 90386 -1250 -37833
13723 -37833 41315 30867 -29689 -73475 -105308 -107263 -79456 -58709 -34560 -76873 -39208 24533
13711 24533 42753 25895 52853 24321 28797 -2250 -81592 -172946 -272136 -205282 -135558 -99629
13699 -99629 -88113 -167556 -160133 -68549 -32107 -5965 26351 87594 91115 94768 128175 144001
13687 144001 48358 88585 110972 61309 -29025 -40376 -49125 -159132 -149978 -113207 -89428 -39289
13675 -39289 -21509 -32318 -55255 -75012 -145895 -111147 16010 85594 111314 117115 98056 51667
$$ packed form
13756h0162j7386K3207M2226k7277k9990j0614j4421j2694J48059K0868n5942
13745a4126L0535N3912l4962j15510L9389J4040r4739K0846m2609K6191l3507
13734a50540k9363R5093j3065J2724R1099J03125M2081K8962q9730r1636l6583
13723c7833P9148j0448o0556m3786l1833j955K7807K0747K4149m2313L7665O3741
13711B4533J8220j6858K6958k8532M476l1047p9342r1354r9190O6854O9724L5929
13699i9629J1516p9443P423R1584L6442K6142L2316O1243L521L653L3407J5826
13687A44001r5643M0227K2387m9663r0334j1351q749j10007R154L6771K3779N0139
13675c9289J7780j0809k2937j9757p0883L4748J27157O9584K5720N801j9059m6389
$$ plain form
13663 51667 46584 1658 18698 -48998 -53834 -25591 -9091 4166 -44654 -60893 -93534 -95340
13651 -95340 -29263 -32171 -34224 -14822 121116 96480 34848 -32189 -94241 -168028 -102896 -102509
13639 -102509 -10912 77667 136967 143231 117764 159358 167870 89170 54418 67193 27620 -17618
13627 -17618 -23721 46577 156448 187548 90764 -22044 -9174 -41778 -77197 -36030 -53220
13616 -53220 -34121 -92423 -136986 20828 131882 73685 137544 163801 78045 14336 -42434
13605 -42434 7874 43622 26716 17231 -37489 -125786 -205033 -254379 -307740 -180963 -7506
13594 -7506 -21546 -54205 63646 73565 -15192 -75573 -55529 24023 33921 891 -65793 -69836
13582 -69836 -56962 -87408 -150633 -83431 -46397 -32148 10656 52477 126400 104573 43888 -3998
$$ packed form
13663E1667n083m4926J7040o7696m836K8243J6500J3257m8820j6239l2641j806
13651i5340O6077k908k053J9402J35938k4636o1632o7037o2052p3787O5132L87
13639a02509R1597Q8579N9300O264k5467M1594Q512p8700l4752J2775l9573m5238
13627a7618o103P0298J09871L1100r6784j12808J2870l2604l5419M1167j7190
13616e3220J9099n8302m4563J57814J11054n8197O3859K6257q5756o3709n6770
13605d2434N0308L5748j6906r485n4720q8297p9247m9346n3361J26777J73457
13594g506j4040l2659J17851R919q8757o0381K0044P9552R898l3030o6684m043
13582f9836J2874l0446o3225O7202L7034J4249M2804M1821P3923k1827o0685m7886
$$ plain form
13570 -3998 8774 -23680 -172936 -253596 -200681 -109499 -28771 -18530 27550 11872 -123200
13559 -123200 -179071 -138462 -135014 -76100 -114870 -59309 8850 -24768 -86621 -104279 -21475 -30141
13547 -30141 -124503 -191341 -148387 -91053 -16075 -87916 -101334 -43680 -11186 -8243 -45146 -19168
13535 -19168 55363 36732 -42412 -68721 -27588 63023 80572 74179 111361 210077 207505 119137
13523 119137 131073 95891 21590 80320 144596 149841 115482 110627 130479 131262 78346 856
13511 856 61565 107428 79630 70305 24582 54429 44210 -56296 -69401 -64086 -39423 -92356
13499 -92356 -102909 -59615 22393 50048 -44885 -116334 -97784 -29989 65614 89800 48556 5949
13487 5949 36750 29986 3977 -18971 -32892 -5289 -95035 -148322 -25114 15644 -9936 -24699
$$ packed form
13570c998J2772l2454j49256q0660N2915R1182Q0728J0241M6080j5678j35072
13559a23200n5871M0609L448N8914l8770N5561O8159l3618o1853j7658Q2804q666
13547c0141r4362o6838M2954N7334P4978p1841j3418N7654L2494K943l6903K5978
13535a9168P4531j8631p9144k6309M1133R0611J7549o393L7182R8716k572q8368
13523A19137J1936l5182p4301N8730O4276N245l4359m855J9852P83n2916p7490
13511H56O0709M5863k7798r325m5723K9847j0219j00506j3105N315K4663n2933
13499i2356j0553M3294Q2008K7655r4933p1449J8550O7795R5603K4186m1244m2607
13487E949L0801o764k6009k2948j3921K7603q9746n3287J23208M0758k5580j4763
$$ plain form
13475 -24699 -54528 -30511 15420 39959 -747 -1849 49915 71253 74077 37869 31213 56583
13463 56583 41994 99600 82934 19818 5867 -1284 7834 62801 14607 48723 85787 79685
13451 79685 100697 28741 -16459 -12167 -39600 -59511 -131076 -96112 -96069 -16847 6535 -54778
13439 -54778 -24875 37302 66893 65202 106517 118848 63406 44440 12413 23316 46166 26567
13427 26567 5192 56764 92074 99703 59940 28624 49978 11330 -3614 -23138 -4919 112250
13415 112250 199187 192001 109383 46841 18255 -8862 -29811 -72630 -147408 -18175 98712
13404 98712 108950 12548 -10936 -56348 -101562 -111738 -182307 -25859 29666 81495 76261 16923
13392 16923 -7533 49720 31554 -17062 -35165 39121 67935 113300 61783 32434 4438 342
$$ packed form
13475b4699k9829K4017M5931K4539m0706j102N1764K1338K824l6208o656K5370
13463E6583j4589N7606j6666o3116j3951p151R118N4967m8194L4116L7064o102
13451G9685K1012p1956m5200M292k7433j9911p1565L4964M3P9222K3382o1313
13439e4778K9903O2177K9591j691M1315J2331n5442j8966l2027J0903K2850j9599
13427B6567k1375N1572L5310P629l9763l1316K1354l8648j4944j9524J8219J17169
13415A12250Q6937p186q2618o2542k8586k7117k0949m2819p4778J29233J16887
13404I8712J0238r6402k3484m5412m5214j0176p0569J56448N5525N1829n234n9338
13392A6923k4456N7253j8166m8616j8103P4286K8814M5365n1517k9349k7996m096
$$ plain form
13380 342 -45828 -18378 55383 -69826 -123993 -85062 -31488 39536 4491 -33262 18448 74891
13368 74891 80731 23891 21106 58426 105414 165636 200229 197533 183493 172580 129557 71214
13356 71214 77940 -7871 -72727 -8119 -9298 -75424 -83797 19935 49409 94971 98478 -35111
13344 -35111 -156895 -102541 -8651 1143 23847 38484 -13627 -45338 -10838 -34415 -31830 -68368
13332 -68368 -10649 13107 -68112 -39985 -15956 -59318 -13619 125273 89070 61851 -5138
13321 -5138 27428 115797 73834 14501 46027 51893 59353 24041 -23917 26344 142052 113936
13309 113936 95703 1838 -72303 -67068 -3955 63992 -33406 -63841 -15354 39935 77686 54055
13297 54055 20485 5694 -51297 -12917 45526 54283 20931 62308 99823 29136 -24820 -70242
$$ packed form
13380C42m6170K7450P3761j25209n4167L8931N3574P1024l5045l7753N1710N6443
13368G4891N840n6840k785L7320M6988O0222L4593k696j4040j0913m3023n8343
13356G1214O726q5811o4856O4608j179o6126q373J03732K9474M5562L507j33589
13344c5111j21784N4354R3890R794K2704J4637n2111l1711L4500k3577K585l6538
13332f8368N7719K3756q1219K8127K4029m3362M5699J38892l6203k7219o6989
13321e138L2566Q8369m1963n9333L1526N866P460l5312m7958N0261J15708k8116
13309A13936j8233r3865p4141N235O3113O7947r7398l0435M8487N5289L7751k3631
13297E4055l3570j4791n6991L8380N8443Q757l3352M1377L7515p0687n3956m5422
$$ plain form
13285 -70242 -20915 33947 28051 -37894 -110919 -60500 -19222 -32520 -29520 25561 44700 60257
13273 60257 35887 128346 122939 124523 108159 76588 15214 -31978 -45 -17869 -89162 -36659
13261 -36659 35382 -2496 31270 47720 89577 80355 41752 -21996 -87678 -137288 -82753 86889
13249 86889 128062 59746 66765 44478 4916 56604 82037 114401 89871 48371 57259 97761
13237 97761 163324 132173 78763 100483 11244 -56599 -26329 -93598 -73675 -2191 39181 66765
13225 66765 45982 -37814 -136307 -140625 -134783 -215874 -169313 -118062 -77814 -61861 -120752 -68896
13213 -68896 14854 -3916 28138 86778 98407 57844 52117 175401 163168 161431 68406 54286
13201 54286 22561 -13873 -25135 26978 51007 72429 58266 123283 142224 109994 76395 63035
$$ packed form
13285g0242M9327N4862n896o5945p3025N0419M1278j3298L000N5081J9139J5557
13273F0257k4370R2459n407J584j6364l1571o1374m7192L1933j7824p1293N2503
13261c6659P2041l7878L3766J6450M1857r222l8603o3748o5682m9610N4535J69642
13249H6889M1173o8316P019k2287l9562N1688K5433L2364k4530m1500Q888M0502
13237I7761O5563l1151n3410K1720q9239o7843L0270o7269J9923P1484M1372K7584
13225F6765k0783q3796r8493m318N842q1091M6561N1251M0248J5953n8891N1856
13213f8896Q3750j8770L2054N8640J1629m0563n727J23284j2233j737r3025j4120
13201E4286l1725l6434j1262N2113K4029K1422j4163O5017J8941l2230l3599j3360
$$ plain form
13189 63035 22884 39644 27323 27080 128403 121662 256871 266363 102634 -7990 34177 87857
13177 87857 162881 173063 212756 89967 13127 83111 79696 -8476 -40948 16396 127701
13166 127701 55668 37488 528 -21262 5876 19631 -2990 34369 143227 137707 87479
13155 87479 38174 20820 35168 122954 144146 127009 113113 88210 144892 130093 958
13144 958 18349 -48541 -35909 19963 5302 -25746 53461 -13164 -119411 -113001 -2916 104333
13132 104333 75115 3501 -76056 -37685 42193 60133 5090 -66738 -57093 -38737 -291 37749
13120 37749 55327 135475 231229 299011 309674 259008 188089 110922 77788 77468 -8388 -28596
13108 -28596 48674 100880 50530 84280 165849 176976 60628 37046 37087 44276 44653 -25257 25772
$$ packed form
13189F3035m0151J6760j2321k43J01323o741J35209R492j63729j10624M2167N3680
13177H7857P5024J0182L9693j22789p6840O9984l415q8172l2472N7344J11305
13166A27701p2033j8180l6960k1790K7138J3755k2621L7359J08858n520n0228
13155H7479m9305j7354J4348Q7786K1192j7137j3896k4903N6682j4799j29135
13144I58J7391o6890J2632N5872j4661l1048P9207o6625j06247O410J10085J07249
13132A04333k9218p1614p9557L8371P9878J7940n5043p1828R645J8356L8446L8040
13120C7749J7578Q0148R5754O7782J0663n0666p0919p7167l3134l20q5856k0208
13108b8596P7270N2206n0350L3750Q1569J1127j16348k3582M1P189L77o9910N1029
$$ plain form
13095 25772 22100 57928 78362 99988 92343 30197 -78280 -77027 9211 -21987 -36340 -30590
13083 -30590 -13620 -39358 3372 53485 116050 144561 30024 24486 79192 50530 24889 5952
13071 5952 10401 9765 -11088 1804 29575 32259 19658 40066 -32141 -73429 6970 -29462 -88035
13058 -88035 -33602 -2456 67712 66623 -25512 -183342 -196370 -148333 -142633 -162588 -133587 -71528
13046 -71528 -98966 -49575 11410 21504 32630 29923 55311 -5553 -30178 -8663 7609 -3357
13034 -3357 115268 81535 39555 31352 6145 -32438 -76426 7092 48354 3167 1691 1663 1933
13021 1933 33268 58832 81083 -444 -32300 5534 92146 78911 36268 -56497 -85139 -100395
13009 -100395 -111367 -94573 -118647 -133913 -88530 -99413 -156134 -107897 -104436 -89662 -28874 -13621
$$ packed form
13095B5772l672L5828K0434K1626p645o2146j08477J253Q6238l1198j4353N750
13083c0590J6970k5738M2730N0113O2565K8511j14537n538N4706k8662k5641j8937
13071E952M449o36k0853J2892K7771K684j2601K0408p2207m1288Q0399l6432n8573
13058h8035N4433L1146P0168j089r2135j57830j3028M8037N700j9955K9001O2059
13046g1528k7438M9391O0985J0094J1126k707K5388o0864k4625K1515J6272j0966
13034c357J18625l3733m1980q203k5207l8583m3988Q3518M1262m5187j476k8K70
13021A933L1335K5564K2251q1527l1856L7834Q6612j3235m2643r2765k8642j5256
13009a00395j0972J6794k4074j5266M5383j0883n6721M8237L461J4774O0788J5253
$$ plain form
12997 -13621 25197 77956 95030 29949 40193 25323 12503 10001 54801 16513 23298 -31532
12985 -31532 -35910 33616 -44181 -88163 -90076 -70013 -34184 -108262 -114467 -27391 82975 73660
12973 73660 91111 124020 125968 23306 -49645 12765 77502 -5272 -85970 -96438 47119
12962 47119 79871 -257 -40083 -65352 -75365 -93334 -9627 52524 -852 10932 -26191 -59137
12950 -59137 18487 4848 -42980 -70513 -85346 -126287 -111707 -3997 47856 36759 -28027
12939 -28027 -50356 -59378 27597 105995 41694 -19359 13976 84681 38558 945 56264 62212
12927 62212 79494 112344 76919 66488 46625 6838 70382 72527 91175 146668 996 -51063
12915 -51063 -76578 -24917 44710 20503 -52939 -100084 -143638 -126895 -91227 -84373 -120010 -155830
$$ packed form
12997a3621L8818N2759J7074o5081J0244j4870j2820k502M4800l8288O785n4830
12985c1532m378O9526p7797m3982j913K0063L5829p4078o205Q7076J10366r315
12973G3660J7451L2909J948j02662p2951O2410O4737q2774q0698j0468J43557
12962D7119L2752q0128l9826k5269j0013j7969Q3707O2151n3376J1784l7123l2946
12950e9137P7624j3639m7828k7533j4833m0941J4580J07710N1853j1097o4786
12939b8027k2329r022Q6975P8398o4301o1053L3335P0705m6123l7613N5319N948
12927F2212J7282L2850l5425j0431j9863l9787O3544K145J8648N5493j45672n2059
12915e1063k5515N1661O9627k4207p3442m7145m3554J6743L5668O854l5637l5820
$$ plain form
12903 -155830 -123251 -103794 -63478 -22742 -83113 -129655 -91662 -64917 -73587 55237 102999
12892 102999 51412 5057 11792 -19180 4636 35608 -46183 -149570 -87537 -28604 5657
12881 5657 48187 37999 31491 41931 65805 58833 -15102 -50849 -104090 -137148 -109330 -49969
12869 -49969 -54967 -121519 -68595 41654 -8887 -102538 -109343 -78399 -47780 -43806 -22946 10654
12857 10654 -11038 -128793 -54900 3752 105387 95604 44238 31065 35878 78889 123880 2482
12845 2482 45153 83295 91077 95517 55373 15301 14880 8443 -33107 66870 186891 164699 61056
12832 61056 41427 3606 -21148 -51375 -77636 -103673 -100254 -36732 -12389 -2995 77182 71563
12820 71563 109506 167017 67534 39353 75294 125445 95706 84431 133434 101495 36385 -21319
$$ packed form
12903a55830L2579J9457M0316M0736o0371m6542L7993K6745q670J28824M7762
12892A02999n1587m6355O735l0972K3816L0972q1791j03387O2033N8933L4261
12881E657M2530j0188o508J0440K3874o972p3935l5747n3241l3058K7818N9361
12869d9969m998o6552N2924J10249n0541r3651o805L0944L0619L974K0860L3600
12857A0654k1692j17755P3893N8652J01635r783n1366j3173M813M3011M4991j21398
12845B482M2671L8142P782M440m0144m0072m21o437m1550R9977J20021k2192j03643
12832F1056j9629l7821k4754l0227k6261k6037L419O3522K4343R394Q0177n619
12820G1563L7943N7511r9483k8181L5941N0151k9739j1275M9003l1939o5110n7704
$$ plain form
12808 -21319 -118383 -88224 -101165 -116078 -190112 -167192 -148177 -127143 -82206 -47573 -23810 16523
12796 16523 -7625 15073 52454 34512 22219 -5278 -12413 -35439 -132684 -128680 -51923 -49352
12784 -49352 -29346 91230 172014 140159 76917 112918 58431 46159 2197 -20594 -15415 -21329
12772 -21329 -15098 -8325 11554 54618 13597 -15836 11770 71641 118045 75141 131545 104750
12760 104750 37316 105898 69893 44510 101171 127488 92853 78103 17785 -60579 -67202 -43442
12748 -43442 57993 80434 -18767 -96920 -144271 -80820 -21324 -69400 -94971 -76427 -118812
12737 -118812 -135280 -70249 74352 71115 34336 11280 9389 56738 80615 93980 125052 148576
12725 148576 107292 106608 77197 9118 -25821 -24981 -97131 -65167 -93937 -142723 -93012 -32024
$$ packed form
12808b1319r7064L0159j2941j4913p4034K2920J9015K1034M4937L4633K3763M0333
12796A6523k4148K2698L7381j7942j2293k7497p135k3026r7245M004P6757K571
12784d9352K0006J20576Q0784l1855o3242L6001n4487j2272m3962k2791N179n914
12772b1329O231O773J9879M3064m1021k9433K7606N9871M6404m2904N6404k6795
12760A04750o7434O8582l6005k5383N6661K6317l4635j4750o0318p8364o623K3760
12748d3442J01435K2441r9201p8153m7351O3451N9496m8076k5571J8544m2385
12737a18812j6468O5031J44601l237l6779k3056j891M7349K3877J3365L1072K3524
12725A48576m1284o84k9411o8079l4939Q40p2150L1964k8770m8786M9711O0988
$$ plain form
12713 -32024 118997 233430 167672 72442 8216 30687 -22658 -93084 -71474 -19462 -5765
12702 -5765 42667 64603 24023 -25981 23624 31710 31192 -23285 -79056 -84290 -19038 -12079 -9233
12689 -9233 -52115 -99114 -88167 -42789 -26917 8692 93901 229747 231902 155608 111001 -17248
12677 -17248 -49656 42542 19598 34034 62926 53028 2367 43720 31226 -24274 -33031 85357
12665 85357 143548 96174 81607 23970 23810 35149 98157 139207 119223 55988 24706 22226
12653 22226 52048 103067 166008 112538 35419 -20207 -37541 -25402 -58077 -78166 -66744 -82556
12641 -82556 -17844 97816 58420 -37161 -84469 -130419 -164455 -73686 -20791 27104 32520 -17623
12629 -17623 -22495 46244 -5740 -48980 -11189 17321 29642 79769 47778 63912 100073 71325
$$ packed form
12713c2024J51021J14433o5758r5230o4226K2471n3345p0426K1610N2012J3697
12702e765M8432K1936m0580n0004M9605Q086n18n4477n5771n234O5252O959K846
12689i233m2882m6999J0947M5378J5872L5609Q5209J35846K155p6294m4607j28249
12677a7248l2408R2198k2944J4436K8892r898n0661M1353j2494n5500q757J18388
12665H5357N8191m7374j4567n7637j60J1339O3008M1050j9984o3235l1282k480
12653B2226K9822N1019O2941n3470p7119n5626j7334J2139l2675k0089J1422j5812
12641h2556O4712J15660l9396r5581m7308m5950l4036R0769N2895M7895N416n0143
12629a7623m872O8739n1984m3240L7791K8510J2321N0127l1991J6134L6161k8748
$$ plain form
12617 71325 46440 63220 77449 26643 -9969 1441 -32962 -111420 -54064 -5673 52234 131019
12605 131019 130937 130615 60562 37239 -12748 -58436 -53773 -59763 -49868 -20315 60086 88105 30358
12592 30358 52112 21747 -31852 -127472 -142289 3757 76659 67866 115564 127334 83446 -15847
12580 -15847 -44462 -98359 21689 112054 119351 87218 145883 199444 207522 196343 260150 279277
12568 279277 238568 154990 138969 91851 34026 53227 132980 133261 93945 50077 16882 28395
12556 28395 34727 123985 92496 -6524 -62844 -67026 -7561 67603 118102 59693 56 -39924
12544 -39924 -93328 -124706 -50157 -77512 -89855 -67819 -16743 -3173 -63980 -88036 -23474 26411
12532 26411 142869 124108 54513 27018 68476 59305 113021 82627 57453 87986 114723 100577
$$ packed form
12617G1325k4885J6780J4229n0806l6612J1410l4403p8458N7356M8391N7907P8785
12605A31019q2l22p0053k3323m9987m5688M663n990R895K9553Q0401K8019n7747
12592C0358K1754l0365n3599r5620j4817J46046P2902q793M7698J1770m3888r9293
12580a5847k8615n3897J20048R0365P297l2133N8665N3561Q078j1179O3807J9127
12568B79277m0709q3578j6021m7118n7825J9201P9753K81l9316m3868l3195J1513
12556B8395O332Q9258l1489r9020n6320m182N9465P5164N0499n8409n9637l9980
12544c9924n3404l1378P4549k7355j2343K2036N1076J3570o0807k4056O4562M9885
12532B6411J16458j8761o9595k7495M1458r171N3716l0394k5174L0533K6737j4146
$$ plain form
12520 100577 156075 121449 69828 47046 -37846 -3163 -9460 -73735 -134226 -12909 37582
12509 37582 13894 -63340 -80290 -31759 -55293 -107293 -36785 2337 66406 117173 96644 -23522
12497 -23522 7510 27854 77783 68836 33309 62711 90520 22998 -15117 -26856 -28287 48035
12485 48035 38488 -7219 -21823 84270 99674 131430 141826 143557 130131 77765 106049 144101
12473 144101 73249 41929 -30556 -96211 -79504 -45855 53160 101475 86957 -31497 -43692
12462 -43692 -27237 -31200 19600 41368 -14054 -52806 -11522 45742 94423 179906 211742 189936
12450 189936 143647 141495 110121 165330 145551 136120 79271 5552 -19755 -51330 -90344 26972
12438 26972 104993 107750 158103 153891 151788 180923 181140 92477 -38930 -45307 25895 44462 73694
$$ packed form
12520A00577N5498l4626n1621k2782q4892L4683o297o4275o0491J21317N0491
12509C7582k3688p7234j6950M8531k3534n2000P0508L9122O4069N0767k0529j20166
12497b3522L1032K0344M9929q947l5527K9402K7809o7522l8115j1739j431P6322
12485D8035r547m5707j4604J06093J5404L1756J0396J731j3426n2366K8284L8052
12473A44101p0852l1320p2485o5655J6707L3649R9015M8315j4518j18454j2195
12462d3692J6455l963N0800K1768n5422l8752M1284N7264M8681Q5483L1836k1806
12450A89936m6289k152l1374N5209j9779r431n6849p3719k5307l1575l9014J17316
12438B6972P8021K757N0353m212k103K9135K17q8663j31407o377P1202J8567K9232
$$ plain form
12425 73694 62299 29691 40729 18170 106807 121596 36366 19510 12042 -93923 -72360 -39572
12413 -39572 -26155 -2338 15917 87950 90987 152303 249811 350708 304465 233893 77950
12402 77950 76846 133331 151182 120414 113247 120976 166119 143792 148157 147929 186524 264131 245016
12389 245016 163984 31634 20088 -48838 -69532 32290 -5226 -86491 -44475 33849 83512
12378 83512 129459 112206 61716 -34343 24174 103736 70395 66794 47039 -7181 -48892 79910
12366 79910 243537 255325 168697 106715 69543 75086 96734 184582 205490 198408 142930 151472
12354 151472 137727 69350 -38886 -17785 8079 105783 135244 109945 33493 -54638 24856
12343 24856 153949 205839 163752 132548 84274 83491 45884 88786 47871 28027 132692 143284
$$ packed form
12425G3694j1395l2608J1038k2559Q8637J4789q5230j6856p468j05965K1563L2788
12413c9572J3417K3817J8255P2033L037O1316R7508J00897m6243p0572j55943
12402G7950j104N6485J7851l0768p167P729M5143k2327M365k28L8595P7607j9115
12389B45016q1032j32350j1546o8926k0694J01822l7516q1265M2016P8324M9663
12378H3512M5947j7253n0490r6059N8517P9562l3341l601j9755n4220m1711J28802
12366G9910J63627J1788q6628o1982l7172N543K1648Q7848K0908p082n5478Q542
12354A51472j3745o8377j08236K1101K5864R7704K9461k5299p6452q8131P9494
12343B4856J29093N1890m2087l1204m8274p83l7607M2902m0915j9844J04665J0592
$$ plain form
12331 143284 10082 38231 100538 94675 53940 17063 4775 -35206 3104 94651 196530
12320 196530 189226 153614 115285 99473 132218 98677 12472 21914 62104 76277 141810 162670
12308 162670 150567 138309 109356 110812 174802 169468 161092 125069 48615 45174 87751 79300
12296 79300 138650 217104 200038 179110 156137 157921 136014 83189 103684 125735 139043 127146
12284 127146 49923 41271 98111 110934 110534 163932 230910 179382 80865 59367 68232 32133
12272 32133 60055 33363 38936 86066 202994 189407 255289 158845 42960 -3427 -95691
12261 -95691 -65314 -113593 -49517 -3353 43739 20248 9947 51085 93892 128193 158507 179986
12249 179986 167956 155281 132650 69436 38444 129346 161924 69968 35836 83185 90447 56507
$$ packed form
12331A43284j33202K8149O2307n863m0735l6877j2288l9981L8310R1547J01879
12320A96530p304l5612l8329j5812L2745l3541q6205R442M0190J4173O5533K0860
12308A62670j2103j2258k8953J456O3990n334q376l6023p6454l441M2577q451
12296G9300N9350P8454j7066k0928k2973J784k1907n2825K0495K2051J3308j1897
12284A27146p7223q652N6840J2823m00N3398O6978n1528r8517k1498Q865l6099
12272C2133K7922k6692N573M7130J16928j3587O5882r6444j15885m6387r2264
12261i5691L0377m8279O4076M6164M7092k3491j0301M1138M2807L4301L0314K1479
12249A79986j2030j2675k2631o3214l0992R0902L2578r1956l4132M7349P262l3940
$$ plain form
12237 56507 131196 172081 202187 201246 209736 149999 77241 37225 82382 167022 123961 82248
12225 82248 181416 150167 127427 102048 124113 170863 185201 135308 88840 101473 21114 -32586
12213 -32586 -55901 -22317 21988 111353 156732 190634 286904 299651 163824 53599 80234
12202 80234 5801 50833 130946 278844 269619 189266 212336 205365 227046 226528 150681 151236 190949
12189 190949 229010 259545 311833 350931 427205 443267 409907 416448 404351 430777 467788 477786
12177 477786 415712 393809 369692 334645 337508 304105 311892 353138 312179 271121 308108 242070
12165 242070 250231 280110 328070 386291 419212 288176 192608 134548 161669 226056 273489
12154 273489 265010 314195 325581 282645 292349 234312 196145 217020 225038 184595 140108 173759
$$ packed form
12237E6507P4689M0885L0106r41Q490n9737p2758m0016M5157Q4640m3061m1713
12225H2248R9168l1249k2740k5379K2065M6750J4338m9893m6468J2633q0359n3700
12213c2586k3315L3584M4305Q9365M5379L3902R6270J2747j35827j10225K6635
12202H0234p4433M5032Q0113J47898r225q0353K3070o971K1681n18p5847N55L9713
12189A90949L8061L0535N2288L9098P6274J6062l3360O541j2097K6426L7011R998
12177D77786o2074k1903k4117l5047K863l3403P787M1246m0959m1058L6987o6038
12165B42070Q161K9879M7960N8221L2921j31036r5568n8060K7121O4387M7433
12154B73489q479M9185J1386m2936R704n8037l8167K0875Q018m0443m4487L3651
$$ plain form
12142 173759 175101 157549 152056 129225 139010 95334 90771 149962 169692 125203 140158 208298
12130 208298 136332 78749 68963 116212 124419 166748 269919 241711 178233 159527 180029 139766
12118 139766 91287 -14733 40624 166907 193924 129728 90005 33636 -46716 -82703 -15546
12107 -15546 -277 26926 25580 69579 108698 208539 280804 324217 229324 183917 102453 100005
12095 100005 139411 30562 -8455 17464 8814 -2818 34993 48532 52087 3144 1468 -8331
12083 -8331 50637 -8510 -59569 -80919 -41549 21124 101293 186792 220714 230339 218105 290139
12071 290139 406996 443065 473985 564059 588020 591787 701009 838415 945372 1078462 1321615
12060 1321615 1501123 1565059 1563827 1652729 1743501 1641966 1696464 1820498 1928001 1984548 1823649
$$ packed form
12142A73759J342j7552n493k2831R785m3676m563N9191J9730m4489J4955O8140
12130B08298p1966n7583r786M7249Q207M2329J03171k8208o3478j8706K0502m0263
12118A39766m8479j06020N5357J26283K7017o4196l9723n6369q0352l5987O7157
12107a5546J5269K7203j346M3999L9119R9841P2265M3413r4893m5407q1464k448
12095A00005L9406j08849l9017K5919q650j1632L7811J3539L555m8943j676r799
12083h331N8968n9147n1059k1350L9370O2673Q0169Q5499L3922R625j2234P2034
12071B90139J16857L6069L0920R0074K3961L767J09222J37406J06957J33090K43153
12060A321615J79508O3936j232Q8902R0772j01535N4498J24034J07503N6547j60899
$$ plain form
12049 1823649 1458386 1057817 957190 1144133 1267327 1237773 1119533 1074473 1067397 1103406
12039 1103406 1091769 987491 977640 1017628 995366 965221 975087 921225 927191 916376 900054 970370
12027 970370 1009908 892731 878741 902433 935269 1015570 995493 920537 883518 850775 911147
12016 911147 989960 1077523 1096477 1081254 1037118 973967 928744 971430 1017040 1035796 1063156
12005 1063156 1009542 1154072 1280661 1385229 1448317 1486473 1373266 1325418 1411915 1382349
11995 1382349 1399292 1433973 1426164 1454773 1416209 1404956 1487021 1599531 1721322 1813974 1804663
11984 1804663 1790117 1809635 1868671 1949532 2031664 2198528 2329922 2425709 2504225 2492043 2704043
11973 2704043 2784029 2816451 3067907 3328238 3444186 3568781 3811284 3974321 4215392 4495106
$$ packed form
12049A823649l65263m00569j00627J86943J23194k9554j18240m5060p076L6009
12039A103406j1637j04278r851L9988k2262l0145R866n3862N966j0815j6322P0316
12027I70370L9538j17177j3990K3692L2836Q0301k0077p4956l7019l2743O0372
12016I11147P8813Q7563J8954j5223m4136o3151m5223M2686M5610J8756K7360
12005A063156n3614J44530J26589J04568O3088L8156j13207m7848Q6497k9566
11995A382349J6943L4681p809K8609l8564j1253Q2065J12510J21791R2652r311
11984A804663j4546J9518N9036Q0861Q2132J66864J31394R5787P8516j2182K12000
11973B704043P9986L2422K51456K60331J15948J24595K42503J63037K41071K79714
$$ plain form
11963 4495106 4837482 5153560 5392697 5810309 6273571 6687002 7181409 7935666 8734763
11954 8734763 9595686 10437663 11383035 12495091 13702774 14955730 16438253 18327512 20504744
11945 20504744 23023992 26012484 29496461 33654951 38755686 45220620 53641141 64920310
11937 64920310 80502147 102976230 136777195 187995574 258640675 335468402 392676182
11930 392676182 416662714 419425205 415267296 409034692 408562928 420628632 443914541 465270450
11922 465270450 451619911 374661315 272779223 195081477 146360181 115861880 95585590
11915 95585590 81205033 70764039 62694095 56182702 50790650 46345680 42743515 39651468
11907 39651468 36971394 34631666 32549870 30759677 29064906 27550649 26218915 24987072
$$ packed form
11963D495106L42376L16078K39137M17612M63262M13431M94407P54257P99097
11954H734763Q60923Q41977R45372J112056J207683J252956J482523J889259K177232
11945B0504744K519248K988492L483977M158490N100735O464934Q420521J1279169
11937F4920310J5581837K2474083L3800965N1218379P0645101P6827727N7207780
11930C92676182K3986532K762491m157909o232604m71764J2065704K3285909K1355909
11922D65270450j3650539p6958596j01882092p7697746m8721296l0498301k0276290
11915I5585590j4380557j0440994q069944o511393n392052m444970l602165l092047
11907C9651468k680074k339728k081796j790193j694771j514257j331734j231843
$$ plain form
11899 24987072 23960605 23016048 22170982 21410057 20679209 19963861 19378226 18752781 18139669
11890 18139669 17668497 17236420 16733739 16206168 15591925 14982220 14284710 13628050 12995897
11881 12995897 12438811 11977457 11415196 10844479 10378800 9868975 9400291 9080784 8837275
11872 8837275 8497301 8182497 7944500 7699353 7465786 7220228 7021148 6860498 6649316
11863 6649316 6422646 6165510 5937817 5728708 5474256 5204037 5073081 5055956 4896797 4776522
11853 4776522 4613677 4537606 4437263 4395975 4352498 4265606 4133150 4038120 3901691 3788634
11843 3788634 3735495 3645547 3523742 3364683 3282136 3232448 3210002 3190453 3079895 3042296 3009459
11832 3009459 3053435 2889399 2722945 2578282 2446347 2315644 2189281 2039691 1899826 1833252
$$ packed form
11899B4987072j026467r44557q45066p60925p30848p15348n85635o25445o13112
11890A8139669m71172m32077n02681n27571o14243o09705o97510o56660o32153
11881A2995897n57086m61354n62261n70717m65679n09825m68684l19507k43509
11872H837275l39974l14804k37997k45147k33567k45558j99080j60650k11182
11863F649316k26670k57136k27693k09109k54452k70219j30956j7125j59159j20275
11853D776522j62845p6071j00343m1288m3477q6892j32456r5030j36429j13057
11843C788634n3139q9948j21805j59059q2547m9688k2446j9549j10558l7599l2837
11832C009459M3976j64036j66454j44663j31935j30703j26363j49590j39865o6574
$$ plain form
11822 1833252 1753751 1702367 1625579 1542035 1436598 1354649 1317422 1335752 1340469 1301200 1240753
11811 1240753 1104228 1063892 1095825 1086492 943679 811422 609394 433365 411010 523177
11801 523177 567157 586610 568817 512932 532636 515272 612441 793577 917465 878880 852580
11790 852580 842814 773457 824800 895661 826350 793004 776100 747525 774718 724804 669532 725659
11778 725659 673809 811542 988786 1092920 1139903 1133149 1037914 1038700 1057948 1056364 1085333 1168334
11766 1168334 1217419 1146672 1013979 870243 849330 893733 896433 965355 953096 829526 804594
11755 804594 847017 872343 862392 906280 887670 817137 750943 710921 654861 735424 761633 718040
11743 718040 669693 627225 648934 699885 802976 871764 825436 772515 749186 664331 691168
$$ packed form
11822A833252p9501n1384p6788q3544j05437q1949l7227J8330M717l9269o0447
11811A240753j36525m0336L1933r333j42813j32257k02028j76029k2355J12167
11801E23177M3980J9453j7793n5885J9704j7364R7169J81136J23888l8585k6300
11790H52580r766o9357N1343P0861o9311l3346j6904k8575K7193m9914n5272N6127
11778G25659n1850J37733J77244J04134M6983o754r5235P86J9248j584K8969Q3001
11766A168334M9085p0747j32693j43736k0913M4403K700O8922j2259j23570k4932
11755H04594M2423K5326r951M3888j8610p0533o6194m0022n6060Q0563K6209m3593
11743G18040m8347m2468K1709N0951J03091O8788m6328n2921k3329q4855K6837
$$ plain form
11732 691168 665747 489207 427048 449703 500008 523228 538449 610888 655769 608596 618949
11721 618949 600528 552942 651390 690305 711270 654494 628739 678443 657248 630056 596366
11710 596366 648735 645310 598754 629885 642092 628626 660605 704449 685507 678358 640390 593061
11698 593061 588884 638368 680321 694244 617530 511033 483600 555515 556685 573723 551185 552089
11686 552089 591677 606647 546217 490715 485661 462665 451155 489967 500574 527858 659274
11675 659274 780015 788212 852064 837575 767312 735171 705916 673313 693557 664142 724220
11664 724220 855173 769038 607504 531624 450452 366881 322288 263243 334390 404888 491231
11653 491231 583041 509470 504157 491444 449418 362962 388043 488132 519999 571778 618141
$$ packed form
11732F91168k5421j76540o2159K2655N0305K3220J5221P2439M4881m7173J0353
11721F18949j8421m7586R8448L8915K0965n6776k5755M9704k1195k7192l3690
11710E96366N2369l425m6556L1131J2207j3466L1979M3844j8942p149l7968m7329
11698E93061m177M9484M1953J3923p6714j06497k7433P1915J170J7038k2538R04
11686E52089L9588J4970o0430n5502n054k2996j1510L8812J0607K7284J31416
11675F59274J20741Q197O3852j4489p0263l2141k9255l2603K0244k9415O0078
11664G24220J30953q6135j61534p5880q1172q3571m4593n9045P1147P0498Q6343
11653D91231R1810p3571n313j2713m2026q6456K5081J00089L1867N1779M6363
$$ plain form
11642 618141 654409 774843 815367 770335 745179 820048 753531 763296 791958 801237 828594 900403
11630 900403 911313 711162 700179 729424 712012 654587 577206 546822 473360 509514 579416
11619 579416 614700 588169 531708 453771 434868 460201 468689 505707 491894 497804 631136 717243
11607 717243 688390 683200 741905 716553 654177 639632 682795 742564 730936 675583 685759 725543
11595 725543 769708 793259 772126 761871 755397 769022 775966 779123 839505 832689 783620 749402
11583 749402 720505 723208 769022 748949 788437 793942 789746 797150 838273 914939 923495 911038
11571 911038 831422 811062 826117 842519 949980 912755 948245 986931 1035646 989848 970976
11560 970976 1030284 1104246 1139743 1147784 1245698 1283438 1283064 1278478 1286315 1211795 1237667 1316486
$$ packed form
11642F18141L6268J20434M0524m5032k5156P4869o6517R765K8662R279K7357P1809
11630I00403J0910k00151j0983K9245j7412n7425p7381l0384p3462L6154O9902
11619E79416L5284k6531n6461p7937j8903K5333Q488L7018j3813N910J33332Q6107
11607G17243k8853n190N8705k5352o2376j4545M3163N9769j1628n5353J0176L9784
11595G25543M4165K3551k1133j0255o474J3625O944L157O0382o816m9069l4218
11583G49402k8897K703M5814k0073L9488N505m196P404M1123P6666Q556j2457
11571I11038p9616k0360J5055J6402J07461l7225L5490L8686M8715m5798j8872
11560I70976N9308P3962L5497Q041R7914L7740l74m586P837p4520K5872P8819
$$ plain form
11548 1316486 1412323 1473912 1581830 1548432 1506050 1512644 1601732 1662345 1664933 1745314 1797696
11537 1797696 1840000 1939496 2091613 2218720 2312969 2425328 2500251 2654953 2883804 3080065
11527 3080065 3234373 3480216 3779508 4066300 4395513 4838724 5216326 5678519 6281629
11518 6281629 6954257 7775827 8756703 9945755 11370163 13086978 15061664 17218205 19659048
11509 19659048 22436853 25306116 28198051 31298926 34373877 37159923 39807410 42152142
11501 42152142 44092710 45611944 46530473 47023760 47083890 46594280 45693404 44513121 43122211
11492 43122211 41553611 40072337 38609363 37193290 36099858 35252737 34741728 34645573 34685586
11483 34685586 35052559 35702674 36570417 37560666 38752627 40213717 41948984 43702944 45623246
$$ packed form
11548A316486R5837O1589J07918l3398m2382O594Q9088O0613K588Q0381N2382
11537A797696M2304R9496J52117J27107R4249J12359P4923J54702K28851J96261
11527C080065J54308K45843K99292K86792L29213M43211L77602M62193O03110
11518F281629O72628Q21570R80876J189052J424408J716815J974686K156541K440843
11509A9659048K777805K869263K891935L100875L074951K786046K647487K344732
11501D2152142J940568J519234R18529M93287O0130m89610r00876j180283j390910
11492D3122211j568600j481274j462974j416073j093432q47121n11009r6155M0013
11483C4685586L66973O50115Q67743R90249J191961J461090J735267J753960J920302
$$ plain form
11474 45623246 47653551 49752155 51838655 53819313 55802684 57809450 59654811 61213328
11466 61213328 62553056 63575877 64311411 64647299 64557478 64101296 63377086 62222241 60852633
11457 60852633 59305804 57635347 55921042 54206388 52538562 50979648 49612669 48286349
11449 48286349 46945371 45861026 45004007 44154847 43280017 42652884 42208094 42004913 41853783
11440 41853783 41830766 42062445 42574472 43368428 44320037 45569793 47156354 48948817 50915700
11431 50915700 52943922 54995266 56901147 58512937 59766733 60391800 60552227 60219591
11423 60219591 59245651 57660293 55451065 52808025 49756707 46466438 42879463 39170547
11415 39170547 35496141 32025246 28698394 25598994 22827805 20385819 18224650 16360418
$$ packed form
11474D5623246K030305K098604K086500J980658J983371K006766J845361J558517
11466F1213328J339728J022821P35534L35888q9821m56182p24210j154845j369608
11457F0852633j546829j670457j714305j714654j667826j558914j366979j326320
11449D8286349j340978j084345q57019q49160q74830o27133m44790k03181j51130
11440D1853783k3017K31679N12027P93956R51609J249756J586561J792463J966883
11431E0915700K028222K051344J905881J611790J253796O25067J60427l32636
11423F0219591r73940j585358k209228k643040l051318l290269l586975l708916
11415C9170547l674406l470895l326852l099400k771189k441986k161169j864232
$$ plain form
11407 16360418 14917418 13734696 12682059 11764693 10986447 10306326 9737800 9184511 8615066
11398 8615066 8178218 7762499 7345261 6923267 6567967 6247205 6036226 5847400 5573624
11389 5573624 5324298 5158695 4991698 4743267 4515129 4396537 4246232 4050999 3896013
11380 3896013 3796812 3602692 3389578 3158020 3112847 3032580 2916490 2780021 2784356 2787180 2718745
11369 2718745 2638188 2646765 2586593 2445536 2264787 2090678 2071284 2139554 2008372 1908993 1886729
11358 1886729 1837434 1814309 1719486 1637542 1512885 1557385 1541668 1518049 1451719 1358503 1287834
11347 1287834 1304623 1280332 1186503 1213920 1237325 1271221 1209611 1100755 1076436 1069050 1042848
11336 1042848 990495 1022333 1078092 1049876 1091154 1103171 1063783 1009357 1027321 988762 914606
$$ packed form
11407A6360418j443000j182722j052637r17366p78246o80121n68526n53289n69445
11398H615066m36848m15719m17238m21994l55300l20762k10979j88826k73776
11389E573624k49326j65603j66997k48431k28138j18592j50305j95233j54986
11380C896013r9201j94120k13114k31558m5173q0267j16090j36469M335K824o8435
11369B718745q0557Q577o0172j41057j80749j74109j9394O8270j31182r9379k2264
11358A886729m9295k3125r4823q1944j24657M4500j5717k3619o6330r3216p0669
11347A287834J6789k4291r3829K7417K3405L3896o1610j08856k4319p386k6202
11336A042848n2353L1838N5759k8216M1278J2017l9388n4426J7964l8559p4156
$$ plain form
11325 914606 876390 904700 878776 837386 687346 636782 683358 710326 666019 728972 829048
11314 829048 842064 807966 877396 855524 773072 663687 703536 751899 681335 640756 672813
11303 672813 667206 653057 653225 622388 567966 655857 679686 627733 616826 634232 608939 567918
11291 567918 556544 528510 501062 499893 504697 464998 453758 498911 487949 534182 488520 520102
11279 520102 557892 618722 647718 575626 487721 515131 556989 625434 657723 611916 635152
11268 635152 612608 506706 576837 658433 683212 587832 593900 598319 542549 444181 375960 447546
11256 447546 517622 445157 358034 423512 502857 455261 421752 415256 367979 249592 266281
11245 266281 223644 228778 320969 396371 421653 501589 488911 481311 485338 523719 609887 682375
$$ packed form
11325I14606l8216K8310k5924m1390j50040n0564M6576K6968m4307O2953J00076
11314H29048J3016l4098O9430k1872q2452j09385L9849M8363p0564m0579L2057
11303F72813n607j4149J68l0837n4422Q7891K3829n1953j0907J7406k5293m1021
11291E67918j1374k8034k7448j169M804l9699j1240M5153j0962M6233m5662L1582
11279E20102L7790O0830K8996p2092q7905K7410M1858O8445L2289m5807K3236
11268F35152k2544j05902P0131Q1596K4779r5380O068M419n5770r8368o8221P1586
11256D47546P0076p2465q7123O5478P9345m7596l3509o496m7277j18387J6689
11245B66281m2637N134R2191P5402K5282P9936j2678p600M027L8381Q6168P2488
$$ plain form
11233 682375 679556 666517 628655 527472 577649 619022 544534 534380 553338 494444 443876
11222 443876 466023 461700 469253 486577 393162 364286 450242 475424 355832 342273 378042 344119
11210 344119 305956 266009 186865 198352 285014 281913 289833 269395 267099 210089 207906 250015
11198 250015 294766 277784 314070 291638 254798 225750 263685 280443 238024 281158 289477 313412
11186 313412 339257 339393 349243 373328 312830 241213 305058 313156 301527 316118 356761 355913 359020
11173 359020 422797 394091 400169 401483 358750 435284 442115 390512 435771 395399 356910 426399
11161 426399 412513 462978 540994 559248 533829 577176 565693 523598 558838 490836 535778
11150 535778 573907 560154 481204 452384 510320 398001 312799 329504 458932 506817 421927
$$ packed form
11233F82375k819j3039l7862j01183N0177M1373p4488j0154J8958n8894n0568
11222D43876K2147m323P553J7324r3415k8876Q5956K5182j19592j3559L5769l3923
11210C44119l8163l9947p9144J1487Q6662l101P920k0438k296n7010k183M2109
11198B50015M4751j6982L6286k2432l6840k9048L7935J6758m2419M3134Q319K3935
11186C13412K5845J36R850K4085o0498p1617O3845Q098j1629J4591M0643q48L107
11173C59020O3777k8706O078J314m2733P6534O831n1603M5259m0372l8489O9489
11161D26399j3886N0465P8016J8254k5419M3347j1483m2095L5240o8002M4942
11150E35778L8129j3753p8950k8820N7936j12319q5202J6705J29428M7885q4890
$$ plain form
11139 421927 424500 506777 560170 612522 619691 531860 460035 451612 449406 449009 550485 600878
11127 600878 593370 595299 633588 653826 639476 582900 532908 452025 385158 294699 324118 391005
11115 391005 359084 424750 488891 429860 391780 402532 405519 406980 371493 353563 410967 364712
11103 364712 309402 273258 350127 380700 342650 392529 546575 597396 594938 534236 498987
11092 498987 581952 602069 599090 679618 670231 643205 641750 619931 681524 685480 706456 756707
11080 756707 754115 714145 690955 632706 537284 479578 478579 534308 596879 600411 566583 468513
11068 468513 447455 520886 504605 476886 559480 633924 623279 617969 578156 573696 613154 590153
11056 590153 617294 655813 705227 760041 732346 741312 678255 681632 693824 729711 823767 899643
$$ packed form
11139D21927K573Q2277N3393N2352P169q7831p1825q423k206l97J01476N0393
11127F00878p508J929L8289K0238j4350n6576m9992q0883o6867r0459K9419O6887
11115C91005l1921O5666O4141n9031l8080J0752K987J461l5487j7930N7404m6255
11103C64712n5310l6144P6869L0573l8050M9879J54046N0821k458o0702l5249
11092D98987Q2965K0117k979Q0528r387k7026j455k1819O1593L956K0976N0251
11080G56707k592l9970k3190n8249r5422n7706r99N5729O2571L532l3828r8070
11068D68513k1058P3431j6281k7719Q2594P4444j0645n310l9813m460L9458k3001
11056E90153K7141L8519M9414N4814k7695Q966o3057L377J2192L5887R4056P5876
$$ plain form
11044 899643 1025737 1126407 1100839 1116708 1048583 1023261 1029047 1091700 1081726 1002737 1075183
11033 1075183 1076608 1038309 996132 939491 946667 990719 935475 945338 977691 1078571 1137681 1073264
11021 1073264 1138364 1076963 978211 952803 905452 978926 1081316 1073868 953763 889790 853149
11010 853149 805658 788455 771053 736337 738560 759820 711515 735368 639540 592335 546067 564170
10998 564170 628866 659928 583307 549110 500717 432976 368940 450050 470404 392646 318930
10987 318930 276182 342597 404789 422030 360221 288618 231578 250544 274712 281456 324351 293647
10975 293647 340379 330125 246760 267404 266716 199357 180403 181606 119592 110252 67527 117352
10963 117352 141853 94529 127956 228892 206967 267495 298144 305265 288959 320871 404391
$$ packed form
11044H99643J26094J00670k5568J5869o8125k5322N786O2653r974p8989P2446
11033A075183J425l8299m2177n6641P176M4052n5244R863L2353J00880N9110o4417
11021A073264O5100o1401r8752k5408m7351P3474J02390p448j20105o3973l6641
11010H53149m7491j7203j7402l4716K223K1260m8305K3853r5828m7205m6268J8103
10998E64170O4696L1062p6621l4197m8393o7741o4036Q1110K0354p7758p3716
10987C18930m2748O6415O2192J7241o1809p1603n7040J8966K4168O744M2895l0704
10975B93647M6732j0254q3365K0644o88o7359j8954J203o2014r340m2725M9825
10963A17352K4501m7324L3427J00936k1925O0528L0649P121j6306L1912Q3520
$$ plain form
10952 404391 462362 438810 473575 539837 510485 478258 489820 591640 632664 548771 539428
10941 539428 486318 447597 450330 486519 425546 347630 285158 255542 292844 289531 274113 308802
10929 308802 350165 426594 447085 459650 456751 364607 321183 284899 255583 227880 147151 135055
10917 135055 116114 165790 281755 296423 190691 59200 26700 25385 45744 38939 82887
10906 82887 114852 125439 130144 140704 207798 190447 213453 228092 220410 190213 198045 327140
10894 327140 331059 312453 346332 411246 396962 316105 286371 291130 301217 240060 281878 468266
10882 468266 570096 488135 435399 431426 434102 414316 373130 407418 489969 540062 484439 437834
10870 437834 463803 497072 506402 561726 554400 563498 547655 604005 579460 510122 496618 546878
$$ packed form
10952D04391N7971k3552L4765O6262k9352l2227J1562J01820M1024q3893r343
10941E39428n3110l8721K733L6189o0973p7916o2472k9616L7302l313j5418L4689
10929C08802M1363P6429K0491J2565k899r2144m3424l6284k9316k7703q0729j2096
10917A35055j8941M9676J15965J4668j05732j31491l2500j315K0359o805M3948
10906H2887L1965J0587M705J0560O7094j7351K3006J4639p682l0197P832J29095
10894C27140L919j8606L3879O4914j4284q0857k9734M759J0087o1157M1818J86388
10882D68266J01830q1961n2736l973K676j9786m1186L4288Q2551N0093n5623m6605
10870D37834K5969L3269R330N5324p326R098j5843N6350k4545o9338j3504N0260
$$ plain form
10858 546878 585739 630867 662435 657992 632618 652786 646447 673100 690151 708888 742926 695367
10846 695367 678254 582307 499918 608849 749173 826775 748884 740565 701949 708740 718056 725921
10834 725921 752668 812717 852501 766892 782819 894401 979152 973826 940234 961405 893878
10823 893878 840606 863140 998562 995974 999907 987507 885189 991322 1114974 1149973 1082338
10812 1082338 1131315 1154714 1188918 1202623 1189425 1235394 1202163 1217592 1208958 1232780 1320380
10801 1320380 1378550 1398123 1434087 1467756 1544050 1686174 1778092 1869255 1867874 1870325 1944372
10790 1944372 2018361 2008863 2112967 2217214 2249623 2274081 2420003 2502759 2633044 2866371
10780 2866371 3127139 3306226 3504305 3841900 4313078 4724729 5067273 5453045 5974931
$$ packed form
10858E46878L8861M5128L1568m443k5374K0168o339K6653J7051J8737L4038m7559
10846F95367j7113r5947q2389J08931J40324P7602p7891q319l8616O791R316P865
10834G25921K6747O0049L9784q5609J5927J11582Q4751n326l3592K1171o7527
10823H93878n3272K2534J35422k588L933j2400j02318J06133J23652L4999o7635
10812A082338M8977K3399L4204J3705j3198M5969l3231J5429q634K3822Q7600
10801A320380N8170J9573L5964L3669P6294J42124R1918R1163j381K451P4047
10790A944372P3989r498J04104J04247L2409K4458J45922Q2756J30285K33327
10780B866371K60768J79087J98079L37595M71178M11651L42544L85772N21886
$$ plain form
10771 5974931 6581612 7220304 8049872 8942780 9977002 11292650 12931569 14958160 17375824
10762 17375824 20408691 24291912 28973757 34518697 40659515 46780792 52178998 56291946
10754 56291946 59133105 60994627 62273550 63330446 64049384 64393616 63891213 61805299
10746 61805299 57936675 53138057 48513685 44746729 41838301 39606575 37854247 36626491
10738 36626491 35835249 35679745 36266775 37817495 40203989 42793356 44610944 45021883 44494517
10729 44494517 43862739 43688824 44014016 45259756 47496731 50453259 53261405 55029254
10721 55029254 56016718 57069198 58874235 61071003 63198456 64980139 66275521 67325739
10713 67325739 68236716 69125611 69769280 70044995 69684260 68217006 65500800 61653253 57334377
$$ packed form
10771E974931O06681O38692Q29568Q92908J034222J315648J638919K026591K417664
10762A7375824L032867L883221M681845N544940O140818O121277N398206M112948
10754E6291946K841159J861522J278923J056896P18938L44232n02403k085914
10746F1805299l868624m798618m624372l766956k908428k231726j752328j227756
10738C6626491p91242j55504N87030J550720K386494K589367J817588M10939n27366
10729D4494517o31778j73915L25192J245740K236975K956528K808146J767849
10721E5029254R87464J052480J805037K196768K127453J781683J295382J050218
10713F7325739R10977Q88895O43669K75715l60735j467254k716206l847547m318876
$$ plain form
10704 57334377 53363665 50220690 48219621 47366173 47356498 47332668 46211394 43457148 40087926
10695 40087926 37241884 35315434 34196146 33782035 33860745 34357654 34999187 35596346 36230596
10686 36230596 37395322 39433764 42351468 45851396 49366705 52406821 54524565 55648715
10678 55648715 56126434 56076514 55658785 54999074 53878865 51978367 48778453 44332341 39069280
10669 39069280 33731479 28941788 25038906 21973282 19603378 17646955 15989466 14725647
10661 14725647 13756925 12880264 12081835 11367773 10772875 10327321 9851436 9313059 8822714
10652 8822714 8497191 8220067 7994872 7779535 7538843 7348252 7236550 7205155 7252974 7269149
10642 7269149 7245544 7214094 7287570 7472773 7665366 8028568 8508352 8997100 9615932 10407807
$$ packed form
10704E7334377l970712l142975k001069q53448r675k3830j121274k754246l369222
10695D0087926k846042j926450j119288m14111P8710M96909O41533N97159O34250
10686C6230596J164726K038442K917704L499928L515309L040116K117744J124150
10678E5648715M77719m9920m17729o59711j120209j900498l199914m446112n263061
10669C9069280n337801m789691l902882l065624k369904j956423j657489j263819
10661A4725647r68722q76661p98429p14062n94898m45554m75885n38377m90345
10652H822714l25523k77124k25195k15337k40692j90591j11702l1395M7819J6175
10642G269149k3605l1450P3476J85203J92593L63202M79784M88748O18832P91875
$$ plain form
10632 10407807 11463375 12915576 14709194 16981908 19803297 22985010 26142566 28954593
10624 28954593 31289574 33280380 35422788 37829064 40592529 44189860 48493049 53179854
10616 53179854 58034501 62496706 66151864 68798152 70558711 71790315 73210621 75437142
10608 75437142 78960009 83698266 89346622 94917805 99255207 101863874 102995179 102930483
10600 102930483 102099373 100981346 100316039 100566738 102080369 104646406 107241173 108212286
10592 108212286 106229577 101814001 96456196 91207155 86478239 82576447 79558848 77450618
10584 77450618 76367978 75910174 75205026 73142719 68915954 63319504 57662788 52718963
10576 52718963 48606951 45189104 42376623 40176177 38410101 36607666 34583951 31824443
$$ packed form
10632A0407807J055568J452201J793618K272714K821389L181713L157556K812027
10624B8954593K334981J990806K142408K406276K763465L597331M303189M686805
10616E3179854M854647M462205L655158K646288J760559J231604J420306K226521
10608G5437142L522867M738257N648356N571183M337402K608667J131305o4696
10600A02930483q31110j118027o65307K50699J513631K566037K594767R71113
10592A08212286j982709m415576n357805n249041m728916l901792l017599k108230
10584G7450618j082640m57804p05148k062307m226765n596450n656716m943825
10576E2718963m112012l417847k812481k200446j766076j802435k023715k759508
$$ plain form
10568 31824443 28365519 24633979 21110349 18383985 16244771 14628008 13346036 12219116
10560 12219116 11327241 10584885 9896421 9353516 8844919 8348652 7921442 7588964 7211238
10551 7211238 6931406 6647800 6298152 5991261 5702372 5543793 5389621 5211458 5018371
10542 5018371 4894109 4812273 4724856 4639263 4448736 4290946 4137437 3921194 3777475 3679048
10532 3679048 3528822 3431313 3373310 3245085 3047791 2958744 2969344 3007788 2904073 2849567
10522 2849567 2832200 2781595 2733043 2694286 2607484 2424594 2358333 2362159 2260666 2176946 2070777
10511 2070777 2009427 2017861 1913714 1833164 1824836 1826740 1789602 1716598 1648786 1544930 1411298
10500 1411298 1333834 1329558 1341565 1287761 1198995 1211802 1237248 1159984 1067795 1028583 1051780
$$ packed form
10568C1824443l458924l731540l523630k726364k139214j616763j281972j126920
10560A2219116q91875p42356o88464n42905n08597m96267m27210l32478l77726
10551G211238k79832k83606l49648l06891k88889j58579j54172j78163j93087
10542E018371j24262q1836q7417q5593j90527j57790j53509k16243j43719r8427
10532C679048j50226r7509n8003j28225j97294q9047J0600L8444j03715n4506
10522B849567j7367n0605m8552l8757q6802j82890o6261L826j01493q3720j06169
10511B070777o1350Q434j04147q0550q328J904l7138p3004o7812j03856j33632
10500A411298p7464m276J2007n3804q8766J2807K5446p7264r2189l9212K3197
$$ plain form
10489 1051780 1103244 1006677 1010915 1006924 949098 874086 850680 822617 710079 670357 713694
10478 713694 711487 734059 771516 749350 666395 623505 616241 555200 561473 541308 518607 522399
10466 522399 623873 681156 618217 549821 600208 537939 551893 499011 417802 412493 479197
10455 479197 579691 595432 595709 522386 565630 573286 605846 609739 596049 592333 579060 577668
10443 577668 548780 539255 589096 611813 622755 585022 634830 641342 665916 597787 556040 614868
10431 614868 690585 658903 600136 595135 574645 562966 512820 566963 634948 515773 481723
10420 481723 421000 479501 467723 358172 342155 406470 367447 312910 290778 259096 337618
10409 337618 451910 527750 559218 531099 501832 491488 406681 395843 370008 386742 360005
$$ packed form
10489A051780N1464r6567M238l991n7826p5012k3406k8063j12538l9722M3337
10478G13694k207K2572L7457k2166q2955m2890p264o1041O273k0165k2701L792
10466E22399J01474N7283o2939o8396N0387o2269J3954n2882q1209n309O6704
10455D79197J00494J5741K77p3323M3244P656L2560L893j3690l716j3273j392
10443E77668k8888r525M9841K2717J0942l7733M9808O512K4574o8129m1747N8828
10431F14868P5717l1682n8767n001k0490j1679n0146N4143O7985j19175l4050
10420D81723o0723N8501j1778j09551j6017O4315l9023n4537k2132l1682P8522
10409C37618J14292P5840L1468k8119k9267j0344q4807j0838k5835J6734k6737
$$ plain form
10398 360005 305928 281459 367674 441182 437143 469138 507149 476939 430464 329466 340429
10387 340429 399958 453009 504362 526901 455391 442167 421070 508231 591326 612091 570382
10376 570382 540284 602469 699862 674939 705573 816334 978144 1112490 1212274 1347644 1552551
10365 1552551 1818035 1988393 2077021 2152730 2237504 2286533 2312377 2336853 2218210 2113997
10355 2113997 1883542 1659977 1408184 1153087 951612 904004 856412 813510 764213 707502
10345 707502 640437 567347 555980 553650 553920 610254 685009 704224 763456 781703 754315 788003
10333 788003 757023 738403 766450 721136 671011 590757 523400 503578 592705 648709 644529 684971
10321 684971 622726 562348 478784 486601 465517 427389 444745 469116 433168 509285 439520 463964
$$ packed form
10398C60005n4077k4469Q6215P3508m039L1995L8011l0210m6475j00998J0963
10387C40429N9529N3051N1353K2539p1510j3224k1097Q7161Q3095K0765m1709
10376E70382l0098O2185R7393k4923L0634J10761J61810J34346R9784J35370K04907
10365A552551K65484J70358Q8628P5709Q4774M9029K5844K4476j18643j04213
10355B113997k30455k23565k51793k55097k01475m7608m7592m2902m9297n6711
10345G07502o7065p3090j1367k330K70N6334P4755J9215N9232J8247k7388L3688
10333G88003l0980j8620K8047m5314n0125q0254o7357j9822Q9127N6004m180M0442
10321F84971o2245o0378q3564P817k1084l8128J7356K4371l5948P6117o9765K4444
$$ plain form
10309 463964 498168 449647 424903 491121 531529 533405 532595 481917 544370 569650 539585 474877
10297 474877 504188 578994 681402 609306 539905 548003 556610 553570 517780 508329 602135 590323
10285 590323 504559 463282 429410 457477 482998 447565 481968 465432 438317 384152 369966
10274 369966 359147 340807 467936 475062 428191 399271 409123 377167 403415 436319 435229 375964
10262 375964 352901 531427 523956 494199 441675 463874 480113 494453 468221 509211 484258
10251 484258 355402 276643 261517 248926 276766 269151 287283 259577 151209 84979 65585
10240 65585 80444 76540 187003 227442 266519 337763 345593 287965 267207 256509 176901 189855
10228 189855 237326 302689 289387 202671 128603 180202 259895 311761 390125 487278 575547
$$ packed form
10309D63964L4204m8521k4744O6218M0408J876q10n0678O2453K5280l0065o4708
10297D74877K9311P4806J02408p2096o9401Q098Q607l040l5790r451R3806j1812
10285E90323q5764m1277l3872K8067K5521l5433L4403j6536k7115n4165j4186
10274C69966j0819j8340J27129P126m6871k8920R852l1956K6248L2904j090n9265
10262C75964k3063J78526p471k9757n2524K2199J6239J4340k6232M0990k4953
10251D84258j28856p8759j5126j2591K7840p615J8132k7706j08368o6230j9394
10240F5585J4859l904J10463M0439L9077P1244P830n7628k0758j0698p9608J2954
10228A89855M7471O5363j3302q6716p4068N1599P9693N1866P8364R7153Q8269
$$ plain form
10217 575547 567777 583852 567105 499089 433758 471668 454469 419806 364846 355655 345439 338805
10205 338805 389849 456366 406725 433203 409927 393529 366492 301745 231234 225815 212459 225328
10193 225328 320947 338075 344416 314030 297050 265243 294216 387662 479784 520589 457483 412250
10181 412250 353814 423465 539175 521990 499012 509992 485443 474244 508031 572756 644006
10170 644006 682280 702077 673130 643109 677300 714331 767642 724444 719994 785030 802416 745823
10158 745823 720670 698714 808611 867396 853974 764723 767485 762750 686969 682198 668424 604848
10146 604848 658390 723361 698625 629712 566097 473516 359398 349305 394785 412143 409930
10135 409930 391724 356999 276664 247150 215197 282972 244289 248444 269912 262220 268496 199173
$$ packed form
10217E75547p770J6075j6747o8016o5331L7910j7199l4663n4960r191j0216o634
10205C38805N1044O6517m9641K6478k3276j6398k7037o4747p0511n419j3356J2869
10193B25328R5619J7128O341l0386j6980l1807K8973R3446R2122M0805o3106m5233
10181D12250n8436O9651J15710j7185k2978J0980k4549j1199L3787O4725P1250
10170F44006L8274J9797k8947l0021L4191L7031N3311m3198m450O5036J7386n6593
10158G45823k5153k1956J09897N8785j3422q9251K762m735p5781m771j3774o3576
10146F04848N3542O4971k4736o8913o3615r2581j14118j0093M5480J7358k213
10135D09930j8206l4725q0335k9514l1953O7775l8683M155K1468p692O276o9323
$$ plain form
10123 199173 178673 184481 100084 34250 21372 -3599 7610 -8133 -1729 -8299 14513 80756
10111 80756 69502 114539 138344 160145 177659 247733 236690 315318 390012 409455 461246 580755
10099 580755 643312 673494 715260 760062 937225 1086250 1110905 1219929 1377273 1430212 1471286
10088 1471286 1464064 1480042 1630013 1727809 1736320 1844084 1870853 1709252 1515363 1311560 1229126
10077 1229126 1224719 1200409 1109442 1124251 1047432 1022763 1088117 1130647 1181646 1223033 1237389
10066 1237389 1226266 1159158 1058526 977590 940479 965459 1019802 1014133 997353 1032707 1051723
10055 1051723 1044999 934138 1012469 1054197 1054064 1075654 1040793 1072868 1068777 1060115 1071134 1153649
10043 1153649 1191712 1133794 995309 939101 1072862 1118849 1114781 1318527 1394637 1466527 1590765
$$ packed form
10123A99173k0500N808q4397o5834j2878k4971J1209j5743O404o570K2812O6243
10111H0756j1254M5037K3805K1801J7514P0074j1043P8628P4694J9443N1791J19509
10099E80755O2557L0182M1766M4802J77163J49025K4655J09024J57344N2939M1074
10088A471286p222J5978J49971R7796Q511J07764K6769j61601j93889k03803q2434
10077A229126m407k4310r0967J4809p6819k4669O5354M2530N0999M1387J4356
10066A237389j1123o7108j00632q0936l7111K4980N4343n669j6780L5354J9016
10055A051723o724j10861P8331M1728j33K1590l4861L2075m091q662J1019Q2515
10043A153649L8063n7918j38485n6208J33761M5987m068K03746P6110P1890J24238
$$ plain form
10032 1590765 1545347 1529593 1588263 1600338 1690057 1753569 1827300 1908094 1919362 2003379 2054945
10021 2054945 2047453 2049220 2030363 2039521 2117240 2194522 2308650 2388541 2474107 2575331 2709914
10010 2709914 2757242 2831860 2916163 3086500 3241708 3313811 3445130 3652222 3834837 3964198
10000 3964198 4072142 4313620 4647246 4971191 5231430 5558303 5883315 6268095 6752840
9991 6752840 7227070 7855843 8513485 9202554 9924893 10809056 11888427 13072990 14492963
9982 14492963 15960377 17556149 19240838 21051639 23166679 25607257 28436899 31696342
9974 31696342 35552976 40256229 46121918 53333390 62498438 74649375 91162326 114118043
9966 114118043 146205682 189466877 242209436 294319260 332138052 350615156 356570707
$$ packed form
10032A590765m5418j5754N8670J2075Q9719O3512P3731Q0794J1268Q4017N1566
10021B054945p492J767j8857R158P7719P7282J14128P9891Q5566J01224J34583
10010B709914M7328P4618Q4303J70337J55208P2103J31319K07092J82615J29361
10000C964198J07944K41478L33626L23945K60239L26873L25012L84780M84745
9991F752840M74230O28773O57642O89069P22339Q84163J079371J184563J419973
9982A4492963J467414J595772J684689J810801K115040K440578K829642L259443
9974C1696342L856634M703253N865689P211472R165048J2150937J6512951K2955717
9966A14118043L2087639M3261195N2742559N2109824L7818792J8477104N955551
$$ plain form
9959 356570707 356988162 355946013 358154797 365720030 375475887 377549999 355073431 299646377
9951 299646377 233358845 179563531 141560248 115206768 96392536 82594075 72209275
9944 72209275 64201690 57898327 52822392 48523780 44791619 41602902 38807514 36358123
9936 36358123 34157815 32236884 30459852 28671604 26859946 25090080 23460787 22075626
9928 22075626 20749047 19587760 18644106 17735614 16922662 16141493 15436623 14737259 14128878
9919 14128878 13599650 13011658 12555230 12156009 11616665 11083590 10645595 10270350 9953136
9910 9953136 9582614 9248155 8963947 8782295 8509851 8173245 7976739 7840309 7616713 7380122
9900 7380122 7202054 7003127 6735754 6538073 6400982 6141060 5858066 5711117 5475270 5256010
$$ packed form
9959C56570707M17455j042149K208784P565233R755857K074112k2476568n5427054
9951B99646377o6287532n3795314l8003283k6353480j8814232j3798461j0384800
9944G2209275q007585o303363n075935m298612l732161l188717k795388k449391
9936C6358123k200308j920931j777032j788248j811658j769866j629293j385161
9928B2075626j326579j161287r43654r08492q12952p81169p04870o99364o08381
9919A4128878n29228n87992m56428l99221n39344n33075m37995l75245l17214
9910I953136l70522l34459k84208j81652k72444l36606j96506j36430k23596k36591
9900G380122j78068j98927k67373j97681j37091k59922k82994j46949k35847k19260
$$ plain form
9890 5256010 5124872 5010112 4863416 4731281 4560595 4433061 4306470 4213559 4108141 3996995
9880 3996995 3889193 3796105 3729611 3606916 3453573 3387563 3301562 3236074 3219342 3242933 3164782
9869 3164782 3122102 3061296 3005340 2834346 2730800 2633721 2572949 2464678 2312505 2237095 2165476
9858 2165476 2045021 1972217 1932005 1875878 1733314 1565468 1559059 1553150 1483197 1444472 1482496
9847 1482496 1490373 1461684 1484311 1419820 1363745 1321842 1200551 1136607 1157420 1101111 910463
9836 910463 715441 719188 742151 685456 683579 695250 596710 556266 548769 614592 784796 883705
9824 883705 941880 949920 1070208 1099168 1149682 1202896 1159205 1127101 1067252 1025993 1018224 1066320
9812 1066320 1124240 1120963 1114268 1119762 1174187 1259142 1264147 1198441 1145571 1096418 1047768 991842
$$ packed form
9890E256010j31138j14760j46696j32135j70686j27534j26591r2911j05418j11146
9880C996995j07802r3088o6494j22695j53343o6010q6001o5488j6732K3591p8151
9869C164782m2680o0806n5956j70994j03546r7079o0772j08271j52173p5410p1619
9858B165476j20455p2804m0212n6127j42564j67846o409n909o9953l8725L8024
9847A482496P877k8689K2627o4491n6075m1903j21291o3944K0813n6309j90648
9836I10463j95022L747K2963n6695j877J1671r8540m0444p497O5823J70204R8909
9824H83705N8175Q040J20288K8960N0514N3214m3691l2104n9849m1259p769M8096
9812A066320N7920l277o695N494N4425Q4955N005o5706n2870m9153m8650n5926
$$ plain form
9800 991842 1032897 1108903 1060904 1104387 1173184 1128007 1078009 1012692 1034890 980607 917080 889537
9788 889537 848201 794702 700039 677728 761564 778407 710160 686242 622403 578913 623386 605130
9776 605130 618726 616229 570619 673981 778642 760445 666616 640002 630034 619265 629598 608663
9764 608663 545731 507262 579756 504907 482578 524084 539920 591454 577694 533156 521717 574744
9752 574744 604767 586900 547870 611107 628294 553626 528735 485141 456201 521095 540466 576884
9740 576884 605011 538924 481828 499924 561832 491757 455377 497531 415437 386446 447338 399005
9728 399005 391638 461246 434375 502393 486559 346167 313580 414844 442103 426151 358652
9717 358652 306146 311715 257908 173542 212336 257720 289651 345092 384044 342924 311018 259553
$$ packed form
9800I91842M1055P6006m7999M3483O8797m5177m9998o5317K2198n4283o3527k7543
9788H89537m1336n3499r4663k2311Q3836J6843o8247k3918o3839m3490M4473j8256
9776F05130J3596k497m5610J03362J04661j8197r3829k6614r968j0769J0333k0935
9764F08663o2932l8469P2494p4849k2329M1506J5836N1534j3760m4538j1439N3027
9752E74744L0023j7867l9030O3237J7187p4668k4891m3594k8940O4894J9371L6418
9740E76884K8127o6087n7096J8096O1908p0075l6380M2154q2094k8991O0892m8333
9728C99005p367O9608k6871O8018j5834j40392l2587J01264K7259j5952o7499
9717C58652n2506N569n3807q4366L8794M5384L1931N5441L8952m1120l1906n1465
$$ plain form
9705 259553 206195 201206 194161 256873 298478 348082 338169 283041 219734 149255 162538 163851
9693 163851 131466 117723 195907 256362 227253 229354 308268 351608 396906 342610 201486 130440
9681 130440 148241 225188 230010 221837 144469 117293 153850 268639 310991 257335 219633 197602
9669 197602 180987 197144 223304 231422 303379 423383 489441 507247 618257 648108 717797
9658 717797 707516 634203 654370 697272 741438 783565 826938 815364 731711 595216 465347
9647 465347 472645 348340 198946 197357 233868 228004 262759 193875 50800 86285 117737 80956
9635 80956 70546 183661 220923 240483 244255 277207 272124 284434 291276 276140 178061 106067
9623 106067 75751 29453 56505 114893 84937 132913 171942 197854 239371 117836 95341
$$ packed form
9705B59553n3358m989p045O2712M1605M9604r913n5128o3307p0479J3283J313
9693A63851l2385j3743P8184O0455k9109K101P8914M3340M5298n4296j41124p1046
9681A30440J7801P6947M822q173p7368k7176L6557J14789M2352n3656l7702k2031
9669A97602j6615J6157K6160Q118P1957J20004O6058J7806J11010K9851O9689
9658G17797j0281p3313K0167M2902M4166M2127M3373j1574q3653j36495j29869
9647D65347P298j24305j49394j589L6511n864L4755o8884j43075L5485L1452l6781
9635H0956j0410J13115L7262J9560L772L2952n083J2310O842j5136r8079p1994
9623A06067l0316m6298K7052N8388k9956M7976L9029K5912M1517j21535k2495
$$ plain form
9612 95341 152326 177802 145590 63464 95769 132595 37242 146513 202053 232918 206241 184228
9600 184228 110359 104129 136663 64904 930 35777 -14698 -10148 22663 70251 118079 104609
9588 104609 92783 141025 163032 160687 188072 193018 179684 80192 -7508 39579 125947 170221
9576 170221 125768 139800 169985 200758 232284 298752 273424 294286 313006 311288 340955 355857
9564 355857 389089 411130 455846 522160 629250 703417 849653 1017025 1249984 1457526 1646226
9553 1646226 1764480 1839627 1872922 1857753 1907610 1996403 2036996 2009196 1972858 1787957 1411580
9542 1411580 1132047 864472 763870 687616 564741 477291 401358 275630 246384 180783
9532 180783 224239 351079 363398 337866 270067 303220 308457 319724 315381 215351 171506 152222
$$ packed form
9612I5341N6985K5476l2212q2126L2305L6826r5353J09271N5540L0865k6677k2013
9600A84228p3869o230L2534p1759o3974L4847n0475M550L2811M7588M7828j3470
9588A04609j1826M8242K2007k345K7385M946j3334r9492q7700M7087Q6368M4274
9576A70221m4453J4032L0185L0773L1526O6468k5328K0862J8720j718K9667J4902
9564C55857L3232K2041M4716O6314J07090P4167J46236J67372K32959K07542J88700
9553A646226J18254P5147L3295j5169M9857Q8793M0593k7800l6338j84901l76377
9542A411580k79533k67575j00602p6254j22875q7450p5933j25728k9246o5601
9532A80783M3456J26840J2319k5532o7799L3153N237J1267m343j00030m3845j9284
$$ plain form
9520 152222 120827 174302 143520 163556 108317 102673 58641 108300 170426 227476 254591 265806
9508 265806 331969 335908 347010 238975 226869 228760 251137 284624 270751 306726 270502 194937
9496 194937 100012 -27531 -48002 14958 3179 16676 -13279 -16281 -28438 59649 199374
9485 199374 216383 201405 135718 107550 88577 49555 -16718 12952 22692 64497 68030 78716
9473 78716 5740 32416 76776 47947 69862 98643 130064 76356 -38680 -123160 -44363 -7980
9461 -7980 -11502 -84751 -93499 -55799 -36946 40265 46992 -35182 -15834 -9689 21626 77919 -9819
9448 -9819 -58023 -42624 40723 91924 137062 104406 75026 63798 49072 36602 11006 30103
9436 30103 7621 64925 111208 85149 33683 56921 23938 37855 79557 72597 63761 48131
$$ packed form
9520A52222l1395N3475l0782K0036n5239n644m4032M9659O2126N7050K7115J1215
9508B65806O6163L939J1102j08035j2106J891K2377L3487j3873L5975l6224p5565
9496A94937r4925j27543k0471O2960j1779J3497k9955l002j2157Q8087J39725
9485A99374J7009j4978o5687k8168j8973l9022o6273K9670R740M1805L533J0686
9473G8716p2976K6676M4360k8829K1915K8781L1421n3708j15036q4480P8797L6383
9461g980l522p3249q748L7700J8853P7211O727q2174J9348O145L1315N6293q7738
9448i819m8204J5399Q3347N1201M5138l2656k9380j1228j4726j2470k5596J9097
9436C0103k2482N7304M6283k6059n1466K3238l2983J3917M1702o960q836j5630
$$ plain form
9424 48131 61562 43002 47442 106205 102911 111611 62006 65925 120014 44001 -85414 -139105
9412 -139105 -77520 -85351 -124586 -113111 -98548 -53174 90535 70544 44600 143300 134801 116914
9400 116914 55446 745 41642 80931 71550 59811 94306 129934 91524 -4308 4736 16860
9388 16860 -16598 41636 45006 51680 127198 80324 16572 117984 115396 156497 160336 72770
9376 72770 41415 47104 19345 -4254 -39982 -103621 -76585 -4635 -67855 -70997 45472 125901
9364 125901 84900 43107 33525 73089 149187 169120 162086 230171 231588 129624 65445 94902
9352 94902 221508 203144 175366 146452 22497 -92253 -154418 -137611 31770 130745 152321
9341 152321 82389 58480 95156 93368 29364 -6424 -2852 -29729 40054 103737 185394 160008
$$ packed form
9424D8131J3431j8560M440N8763l294Q700m9605L919N4089p6013j29415n3691
9412a39105O1585p831l9235J1475J4563M5374J43709j9991k5944R8700q499j7887
9400A16914o1468n4701M0897L9289r381j1739L4495L5628l8410r5832R044J2124
9388A6860l3458N8234L370O674P5518m6874o3752J01412k588M1101L839q7566
9376G2770l1355N689k7759k3599l5728o3639K7036P1950o3220l142J16469Q0429
9364A25901m1001m1793r582L9564P6098J9933p034O8085J417j01964o4179K9457
9352I4902J26606j8364k7778k8914j23955j14750o2165J6807J69381R8975K1576
9341A52321o9932k3909L6676j788o4004l5788L572k6877O9783O3683Q1657k5386
$$ plain form
9329 160008 71589 5198 -4689 -51991 -85898 43699 112724 74482 8052 -40956 -6410 27270
9317 27270 -3886 74124 51462 -30620 -38245 -63090 -66823 12940 81575 87605 72014 66346 61104
9304 61104 -30177 -64411 9980 20975 -36084 -42017 30420 69035 6176 -19117 -44108 42788
9292 42788 65546 48206 -85919 -107987 -73484 -4530 6788 -33027 28307 55213 15310 29021
9280 29021 71557 82354 55451 21391 -20198 36428 -48234 -31679 -25173 41248 118106 119866
9268 119866 129078 48078 -4271 55275 86760 56412 39526 33900 866 30462 -4819 55458
9256 55458 18860 -61412 -42555 -34795 19512 72040 26095 5257 64773 170864 191284 136501
9244 136501 165771 216570 75533 14295 -13420 -40471 -110492 -140684 -28211 530 5190
$$ packed form
9329A60008q8419o6391r887m7302l3907J29597O9025l8242o6430m9008L4546L3680
9317B7270l1156P8010k2662q2082p625k4845l733P9763O8635O030j5591n668n242
9304F1104r1281l4234P4391J0995n7059n933P2437L8615o2859k5293k4991Q6896
9292D2788K2758j7340j34125k2068L4503O8954J1318l9815O1334K6906l9903J3711
9280B9021M2536J0797k6903l4060m1589N6626q4662J6555O506O6421P6858J760
9268A19866R212q1000n2349N9546L1485l0348j6886n626l3034K9596l5281O0277
9256E5458l6598q0272J8857P760N4307N2528m5945k0838N9516J06091K0420n4783
9244A36501K9270N0799j41037o1238k7715k7051p0021l0192J12473K8741M660
$$ plain form
9233 5190 24159 122344 178903 103564 36581 19108 5800 28612 140006 125192 88227 106833
9221 106833 114228 138603 113519 75989 86521 40148 -41048 -50300 -112419 -88006 22609 85718
9209 85718 61999 -8944 16411 14441 10728 14978 -28065 -35486 -741 99013 79550 50674 18833
9196 18833 -18682 6279 3843 -6462 -42226 -102390 -77875 -135919 -177407 -79510 -6002 35443
9184 35443 -3231 -52305 -29272 6017 33820 -14833 -43426 -39324 -7731 -7747 18457 46723 13006
9171 13006 -68561 -51123 -18011 -62207 -100756 -46227 37550 21467 -41660 -27535 -45750 -50313
9159 -50313 -64929 -72028 -51937 -41715 -25130 -5399 27810 -58281 -121515 -117294 15954 16693
9147 16693 17219 61621 89056 24799 -47078 -82206 -92717 -112149 -69439 -8092 14882 -11158
$$ packed form
9233E190J8969R8185N6559p5339o6983j7473j3308K2812J11394j4814l6965J8606
9221A06833P395K4375k5084l7530J0532m6373q1196r252o2119K4413J10615O3109
9209H5718k3719p0943K5355j970l713M250m3043p421L4745R9754j9463k8876l1841
9196A8833l7515K4961k436j0305l5764o0164K4515n8044m1488R7897P3508M1445
9184C5443l8674m9074K3033L5289K7803m8653k8593M102L1593j6K6204K8266l3717
9171A3006q1567J7438L3112m4196l8549N4529Q3777j6083o3127J4125j8215m563
9159e0313j4616p099K0091J0222J6585J9731L3209q6091o3234M221J33248P39
9147A6693N26M4402K7435o4257p1877l5128j0511j9432M2710O1347K2974k6040
$$ plain form
9135 -11158 -72620 -143058 -145141 -132806 -65975 -41667 46396 72776 21824 -26958 -78986 -152501
9123 -152501 -181442 -130616 -65333 12705 -48759 -82514 -66177 -124198 -69415 46362 61304
9112 61304 3493 -62002 14784 -37265 -65043 -47051 -23071 -30700 -74686 -38606 -117165 -129290
9100 -129290 -35500 67252 118171 138493 147728 163721 94698 82073 85261 89146 57853 45915
9088 45915 -1141 48759 91710 76599 47902 70098 144450 124824 170043 260342 191408 86898
9076 86898 60798 20462 1753 37047 33320 35361 124961 135035 132748 101933 39762 37302 67370
9063 67370 122101 117116 74169 136786 120161 5992 12921 -23784 -72735 -151050 -76843 41187
9051 41187 147428 191487 144623 62221 63687 139511 158076 162755 108669 75802 57419 68059
$$ packed form
9135a1158o1462p0438k083J2335O6831K4308Q8063K6380n0952m8782n2028p3515
9123a52501k8941N0826O5283P8038o1464l3755J6337n8021N4783J15777J4942
9112F1304n7811o5495P6786n2049k7778J7992K3980p629m3986L6080p8559j2125
9100a29290R3790J02752N0919K0322R235J5993o9023j2625L188L885l1293j1938
9088D5915m7056M9900M2951j5111k8697K2196P4352j9626M5219R0299o8934j04510
9076H6898k6100m0336j8709L5294l727K041Q9600J0074k287l0815o2171k460L0068
9063F7370N4731m985m2947O2617j6625j14169O929l6705m8951p8315P4207J18030
9051D1187J06241M4059m6864q2402J466P5824J8565M679n4086l2867j8383J0640
$$ plain form
9039 68059 74844 46487 36449 5540 7495 -5095 -9137 8422 77073 24373 -47129 -85507
9027 -85507 -73892 -133244 -799 127497 117744 39582 -29063 39888 87507 53579 67137 68928
9015 68928 30061 -85767 -148652 -118128 20174 105450 97869 89101 71160 123646 70867 -28515
9003 -28515 -33579 15040 24282 69062 87810 26851 6026 14662 52010 2522 -34096 -39376 -54399
8990 -54399 -1778 68664 168081 142188 35873 -7307 22087 -19832 -31582 7254 10021 50332
8978 50332 25517 -35149 -59820 -5211 9405 7547 -61446 -91011 -68420 -15503 -32374 -18283
8966 -18283 66589 167284 90631 46286 37551 67368 113469 145299 180311 104430 53947 7675
8954 7675 20198 -23297 -107589 -75093 -30407 -45602 -109916 -88474 -97956 -78839 -7821 53759
$$ packed form
9039F8059O785k8357j0038l0909J955j2590m042J7559O8651n2700p1502l8378
9027h5507J1615n9352J32445J28296r753p8162o8645O8951M7619l3928J3558J791
9015F8928l8867j15828o2885L0524J38302Q5276p581q768j7941N2486n2779r9382
9003b8515n064M8619R242M4780J8748o0959k0825Q636L7348m9488l6618n280j5023
8990e4399N2621P0442R9417k5893j06315m3180K9394m1919j1750L8836K767M0311
8978E0332k4815o0666k4671N4609J4616j858o8993k9565K2591N2917j6871J4091
8966a8283Q4872J00695p6653m4345q735K9817M6101L1830L5012p5881n0483m6272
8954G675J2523m3495q4292L2496M4686j5195o4314K1442r482J9117P1018O1580
$$ plain form
8942 53759 -18719 -57431 -119462 -131615 -57605 6989 23003 15374 68687 84975 36995 -32480
8930 -32480 -77741 -71484 9138 102905 81381 -42253 -11939 -25401 -27940 98933 119718 47701
8918 47701 3021 -23736 -41793 -25809 34067 9417 -34218 -61837 -110682 -185804 -66777 -48978
8906 -48978 -26382 47046 10308 -37529 -34267 46890 69721 129632 160441 85425 67086 138446
8894 138446 218618 151354 67852 26628 52751 42085 21362 12013 -32047 -90559 -15762 37565
8882 37565 11077 -2640 -21128 66986 121117 64500 51089 77398 34699 -8717 -26336 29461
8870 29461 46542 46386 99622 27746 -7403 -7833 -52542 -91251 -17004 7554 79564 19786 43357
8857 43357 78659 -17143 15025 67314 33559 48813 91142 48776 -21856 89729 179729 113398
$$ packed form
8942E3759p2478l8712o2031j2153P4010O4594J6014p629N3313J6288m7980o9475
8930c2480m5261O257Q0622R3767k1524j23634L0314j3462k539J26873K0785p2017
8918D7701m4680k6757j8057J5984N9876k4650m3635k7619m8845p5122J19027J7799
8906d8978K2596P3428l6738m7837L262Q1157K2831N9911L0809p5016j8339P1360
8894A38446Q0172o7264q3502m1224K6123j0666k0723r349m4060n8512P4797N3327
8882C7565k6488j3717j8488Q8114N4131n6617j3411K6309m2699m3416j7619N5797
8870B9461J7081j56N3236p1876l5149m30m4709l8709P4247K4558P2010n9778K3571
8857D3357L5302r5802L2168N2289l3755J5254M2329m2366p0632J11585R0000o6331
$$ plain form
8845 113398 74526 59137 100981 164842 100486 34857 22054 -3395 -80031 -87328 16921 86268
8833 86268 105943 139614 49988 61170 74663 3648 -19998 -11436 1261 78193 66790 45262
8821 45262 28171 67108 103483 29108 28321 48006 96419 152914 131908 54772 56640 34643
8809 34643 107875 161860 154130 78579 7945 5646 34421 18919 3607 -12797 45763 87753
8797 87753 29780 -36811 -68696 -65209 -69142 -93586 -48811 -392 -19247 -85082 -52161 50777
8785 50777 94499 59748 -478 -116755 -20057 -13033 -92777 -30620 12131 29416 52065 28868
8773 28868 -26950 -25076 23782 25702 35002 43491 -9040 -27872 21434 12164 -88817 -87899 -128701
8760 -128701 -138411 -118316 -17874 18958 18122 87675 59288 34089 22333 1300 -681 109266
$$ packed form
8845A13398l8872j5389M1844O3861o4356o5629j2803k5449p6636p297J04249O9347
8833H6268J9675L3671q9626J1182J3493p1015k3646Q562J2697P6932j1403k1528
8821D5262j7091L8937L6375p4375p87J9685M8413N6495k1006p7136J868k1997
8809C4643P3232N3985p730p5551p0634k299K8775j5502j5312j6404N8560M1990
8797H7753n7973o6591l1885L487l933k4444M4775M8419j8855o5835L2921J02938
8785E0777M3722l4751o0226j16277R6698P024p9744O2157M2751J7285K2649k3197
8773B8868n5818J874M8858J920R300Q489n2531j8832M9306r270j00981R18m0802
8760a28701r710K0095J00442L6832q36O9553k8387k5199j1756k1033j981J09947
$$ plain form
8748 109266 129238 124716 75315 99576 63363 -4032 -16728 -35172 -67692 -114549 -72732 -54714
8736 -54714 38576 140965 116594 96464 145024 88844 73362 94893 85837 94331 89792 82335
8724 82335 -23795 -74356 -22190 41734 -14576 -23658 58891 26286 -3946 16631 32395 93077
8712 93077 43499 -41156 -79425 4196 55127 79806 67707 65733 39670 45507 31196 72531
8700 72531 4541 -41042 -11195 -21440 -44545 -11313 80392 114903 85878 53941 -2832 49661
8688 49661 117664 143039 174896 164538 49644 11189 -34222 -83864 44766 130634 46274
8677 46274 -42759 -66357 19299 90064 83106 43876 35615 15977 -16588 47980 138126 120920
8665 120920 19324 48595 8962 -38177 23632 87775 84107 110282 179120 195447 171355 147865
$$ packed form
8748A09266J9972m522m9401K4261l6213o7395j2696j8444l2520m6857M1817J8018
8736e4714R3290J02389k4371k0130M8560n6180j5482K1531r056Q494m539p457
8724H2335j06130n0561N2166O3924n6310r082Q2549l2605l0232K0577J5764O0682
8712I3077m9578q4655l8269Q3621N0931K4679j2099j974k6063N837j4311M1335
8700G2531o7990m5583K9847j0245k3105L3232R1705L4511k9025l1937n6773N2493
8688D9661O8003K5375L1857j0358j14894l8455m5411m9642J28630Q5868q4360
8677D6274q9033k3598Q5656P0765o958l9230q261j9638l2565O4568R0146j7206
8665A20920j01596K9271l9633m7139O1809O4143l668K6175O8838J6327k4092k3490
$$ plain form
8653 147865 102182 124558 77504 72456 101908 41307 -8140 112008 214489 132570 58159
8642 58159 84949 104726 117779 151819 116868 112205 104178 94242 79918 131435 137474 147677 70488
8629 70488 74479 86299 101505 166809 166618 219996 263519 232350 188353 147657 101362 79451
8617 79451 -20345 -41581 -30176 40223 138631 49489 -44621 -10738 52437 46927 93470 69014
8605 69014 121508 133874 79187 59857 22080 53437 103788 179750 223636 280286 254647 167579
8593 167579 151602 195307 237923 272758 239980 243244 266926 281916 291832 262769 214550 171996
8581 171996 168415 217043 147800 186538 195567 300358 355541 289013 302629 323020 369430 353513
8569 353513 246667 130443 108291 157930 205475 236258 191403 143317 218431 245535 230802
$$ packed form
8653A47865m5683K2376m7054n048K9452o0601m9447J20148J02481q1919p4411
8642E8159K6790J9777J3053L4040l4951m663q027r936j4324N1517O039J0203p7189
8629G0488L991J1820J5206O5304j91N3378M3523l1169m3997m0696m6295k1911
8617G9451r9796k1236J1405P0399R8408q9142r4110L3883O3175n510M6543k4456
8605F9014N2494J2366n4687j9330l7777L1357N0351P5962M3886N6650k5639q7068
8593A67579j5977M3705M2616L4835l2778L264K3682J4990R916k9063m8219m2554
8581A71996l581M8628o9243L8738R029J04791N5183o6528J3616K0391M6410j5917
8569C53513j06846j16224k2152M9639M7545L0783m4855m8086P5114K7104j4733
$$ plain form
8558 230802 89408 134881 192184 210011 170310 118757 35918 -19011 31357 66138 173885
8547 173885 198591 185652 95919 73755 134389 180695 84795 16997 49195 70758 74757 45029
8535 45029 42643 73880 3723 -30586 -56966 -1027 97539 178195 182808 111350 145241 137543
8523 137543 75835 34018 69455 54617 49761 104849 42921 41520 92113 83145 152977 132428
8511 132428 106828 117884 71771 89585 9711 -123838 -163307 -116647 -63415 -49928 -54654 14021
8499 14021 58313 21745 -15540 -105335 -152925 -2560 149569 65788 31287 14136 -9897
8488 -9897 -14476 31786 50932 42491 4005 71444 143274 129718 142308 203146 159394 80683
8476 80683 67667 61962 90233 105926 132680 59503 62551 148759 147397 148348 125983 82976 124598
$$ packed form
8558B30802j41394M5473N7303J7827l9701n1553q2839n4929N0368L4781J07747
8547A73885K4706j2939q9733k2164O0634M6306r5900o7798L2198K1563L999k9728
8535D5029k386L1237p0157l4309k6380N5939R8566Q0656M613p1458L3891p698
8523A37543o1708m1817L5437j4838m856N5088o1928j401N0593q968O9832k0549
8511A32428k5600J1056m6113J7814p9874j33549l9469M6660N3232J3487m726O8675
8499A4021M4292l6568l7285q9795m7590J50365J52129q3781l4501j7151k4033
8488i897m579M6262J9146q441l8486O7439P1830j3556J2590O0838m3752p8711
8476H0683j3016n705K8271J5693K6754p3177L048Q6208j362R51k2365m3007M1622
$$ plain form
8463 124598 163880 152509 158481 170156 72163 65917 13595 52994 107873 166186 203432 140108
8451 140108 92349 161868 139160 124516 104769 108338 66427 56589 121047 224260 259847 223909
8439 223909 189455 131029 46764 55069 84650 62029 13136 -870 24558 6107 33271 92513
8427 92513 35175 -57887 -114517 -76975 2784 27610 -17317 -3168 -6144 1637 -18517 385
8415 385 3751 -62280 -117072 -97185 -51039 5099 21559 55419 -44327 -85804 -19887 24353
8403 24353 59069 72583 57042 87583 137124 75347 16070 69920 162630 140296 26249 -38386
8391 -38386 12797 9191 -56797 -60840 -30480 -44838 -54948 -83139 -17275 -14450 -10222 -67002 1221
8378 1221 51832 135791 172825 150111 184596 197640 115351 143784 214138 134761 28829 -4146
$$ packed form
8463A24598L9282j1371N972J1675r7993o246n2322L9399N4879N8313L7246o3324
8451A40108m7759O9519k2708j4644j9747L569m1911r838O4458J03213L5587l5938
8439B23909l4454n8426q4265Q305K9581k2621m8893j4006K5428j8451K7164N9242
8427I2513n7338r3062n6630L7542P9759K4826m4927J4149k976P781k0154J8902
8415C85L366o6031n4792J9887M6146N6138J6460L3860r9746m1477O5917M4240
8403B4353L4716J3514j5541L0541M9541o1777n9277N3850R2710k2334j14047o4635
8391c8386N1183l606o5988m043L0360j4358j0110k8191O5864K825M228n6780O8223
8378A221N0611Q3959L7034k2714L4485J3044q2289K8433P0354p9377j05932l2975
$$ plain form
8366 -4146 42527 71731 34429 -48964 -122446 7844 22835 -123253 -86207 -13786 -5622 27784
8354 27784 78193 120480 46779 42757 50145 10360 -12036 -110580 -138015 -117564 -63314 20308
8342 20308 -117947 -139145 -141249 -131285 -101655 -173898 -187168 -190106 -228178 -163030 -53927 62695
8330 62695 44090 54599 -8179 4560 -29694 36411 -547 -83326 -180205 -230737 -197815 -71480
8318 -71480 -45153 -47572 15540 57371 102697 45359 -85257 -113538 -85342 -98352 -56955 -71535
8306 -71535 -159379 -87128 -9714 20243 14616 -62693 -19823 -4560 -46276 -78896 -137627 -59503
8294 -59503 -81857 18108 23656 -38191 -80849 -160145 -182142 -71478 104156 98679 58619 -71660
8282 -71660 -159632 -141594 -155324 -146688 -162978 -111361 -29455 -6721 33289 20496 6967 64678
$$ packed form
8366d146M6673K9204l7302q3393p3482J30290J4991j46088L7046P2421Q164L3406
8354B7784N0409M2287p3701m022P388l9785k2396r8544k7435K0451N4250Q3622
8342B0308j38255k1198k104R964K9630p2243j3270k938l8072O5148J09103J16622
8330F2695j8605J0509o2778J2739l4254O6105l6958q2779r6879n0532L2922J26335
8318g1480K6327k419O3112M1831M5326n7338j30616k8281K8196j3010M1397j4580
8306g1535q7844P2251P7414K9957n627p7309M2870J5263m1716l2620n8731P8124
8294e9503k2354R9965N548o1847m2658p9296k1997J10664J75634n477m0060j30279
8282g1660q7972J8038j3730Q636j6290N1617Q1906K2734M0010j2793j3529N7711
$$ plain form
8270 64678 108767 103446 127199 134326 97866 43210 -1275 27227 -1382 -20135 -40243 -39749 20534
8257 20534 -47779 -85527 -57553 9126 -89045 -169002 -123670 -50222 1744 -49872 -36632 16393
8245 16393 91285 24176 -50714 -42332 -128866 -114449 -45948 -34567 -59139 -59634 24961 101316
8233 101316 98662 104446 94855 37553 24070 -9704 -6671 -48610 -26545 -16276 -28276 -16555
8221 -16555 22539 107804 124322 88520 62515 121756 186279 81891 -35548 -54465 -38094
8210 -38094 54553 106711 132619 143933 65321 81769 249445 311482 226571 79705 -36106
8199 -36106 -111249 -109776 25715 90358 79916 22623 -23220 -57103 -37236 433 -14612 -6132
8187 -6132 63260 61074 39603 55061 -23342 -29509 45046 78765 12870 -53513 -74506 -16723
$$ packed form
8270F4678M4089n321K3753P127l6460n4656m4485K8502k8609j8753k0108M94O0283
8257B0534o8313l7748K7974O6679r8171p9957M5332P3448N1966n1616J3240N3025
8245A6393P4892o7109p4890Q382q6534J4417O8501J1381k4572m95Q4595P6355
8233A01316k654N784r591n7302j3483l3774L033m1939K2065J0269j2000J1721
8221a6555L9094Q5265J6518l5802k6005N9241O4523j04388j17439j8917J6371
8210c8094R2647N2158K5908J1314p8612J6448J67676O2037q4911j46866j15811
8199c6106p5143J473J35491O4643j0442n7293m5843l3883J9867L7669j5045Q480
8187f132O9392k186k1471J5458p8403o167P4555L3719o5895o6383k0993N7783
$$ plain form
8175 -16723 35343 82998 52174 41066 -39505 -169309 -215226 -119270 -92572 -19952 -64930 23638
8163 23638 43146 -49456 -179274 -140066 -134766 -140317 -90497 -79493 27361 96029 113333 117959
8151 117959 98517 140748 96933 31321 -7498 -77056 -67310 -48126 -43134 -100873 -82010 -96040
8139 -96040 17987 55980 45377 49017 70451 77956 79510 91873 62045 -36722 -101521 -129222
8127 -129222 -99591 -76983 -26773 59147 58963 -19504 -60374 -80808 -94793 -52477 -52448 -78771 -73017
8114 -73017 -46330 -61433 -120349 -57335 -45097 3659 -52590 -97191 -48244 -55032 -90839 -72525
8102 -72525 -42936 19593 69047 101248 80225 8001 61602 2876 -130954 -157533 -100855 -5277
8090 -5277 8406 35629 99006 193507 129448 39830 -6312 26527 81820 141122 166769 175586
$$ packed form
8175a6723N2066M7655l0824j1108q0571j29804m5917R5956K6698P2620m4978Q8568
8163B3638J9508r2602j29818L9208N300n551M9820J1004J06854O8668J7304M626
8151A17959j9442M2231m3815o5612l8819o9558R746J9184M992n7739J8863j4030
8139i6040J14027L7993j0603L640K1434P505J554J2363k9828r8767o4799k7701
8127a29222K9631K2608N0210Q5920j84p8467m0870k0434j3985M2316K9k6323N754
8114g3017K6687j5103n8916O3014J2238M8756n6249m4601M8947o788l5807J8314
8102g2525K9589O2529M9454L2201k1023p2224N3601n8726j33830k6579N6678R5578
8090e277J3683K7223O3377R4501o4059q9618m6142L2839N5293N9302K5647Q817
$$ plain form
8078 175586 145231 99881 817 -74971 -62737 42734 46300 -3900 2549 -14633 31416 106844
8066 106844 47532 -47534 -104976 -123289 -93570 7648 53 -116630 -165399 -137654 -77412
8055 -77412 -54604 -64385 -9270 6045 44145 37518 44876 40894 29530 -23711 987 -26146 -6123
8042 -6123 -2674 -29376 -17732 -18163 -4379 18483 -2976 33142 148539 129710 129358 178798 151054
8029 151054 61174 -26437 -73747 -95006 -53727 -1710 67640 98757 8131 -32326 34629 83162
8017 83162 34052 19625 -15894 -24355 11092 115265 163037 115596 117331 131608 59246 101423
8005 101423 50152 -17261 -36219 20410 70326 56534 49052 59174 110351 157647 199967 163086
7993 163086 -7284 -58853 -144460 -89631 -47776 -84527 -54034 16862 107462 126827 173509
$$ packed form
8078A75586l0355m5350r9064p5788J2234J05471L566n0200O449j7182M6049P5428
8066A06844n9312r5066n7442j8313K9719J01218p595j16683m8769K7745O0242
8055g7412K2808r781N5115J5315L8100o627P358l982j1364n3241K4698k7133K0023
8042f123L449k6702J1644m31J3784K2862k1459L6118J15397j8829l52M9440k7744
8029A51054q9880q7611m7310k1259M1279N2017O9350L1117r0626m0457O6955M8533
8017H3162m9110j4427l5519q461L5447J04173M7772m7441J735J4277p2362M2177
8005A01423n1271o7413j8958N6629M9916j3792p482J0122N1177M7296M2320l6881
7993A63086j70370n1569q5607N4829M1855l6751L0493P0896R0600J9365M6682
$$ plain form
7982 173509 223580 196302 177594 105086 26465 7971 6720 15719 -52639 -23408 34467 -34708
7970 -34708 -19316 18520 46100 95271 107356 57347 93772 59625 31926 64568 37944 -5895
7958 -5895 13210 45270 37228 120853 84647 -1358 37742 125826 117703 52924 26103 45248
7946 45248 85202 142264 203965 158344 30213 -73088 -33491 14165 90081 91929 75484 82827
7934 82827 131350 127601 80116 59049 82502 65115 85713 95594 29154 6752 21595 -20966
7922 -20966 2201 49798 73962 46245 973 -40939 -63293 -134613 -73473 -15678 31183 64044
7910 64044 52062 -30035 -37039 -34365 -43943 14454 100958 172759 125072 72222 107845 186698
7898 186698 193843 122598 149938 199077 96590 55516 49318 39367 -33209 8804 13272 -70832
$$ packed form
7982A73509N0071k7278j8708p2508p8621j8494j251Q999o8358K9231N7875o9175
7970c4708J5392L7836K7580M9171J2085n0009L6425l4147k7699L2642k6624m3839
7958e895J9105L2060q042Q3625l6206q6005L9100Q8084q123o4779k6821J9145
7946D5248L9954N7062O1701m5621j28131j03301L9597M7656P5916J848j6445P343
7934H2827M8523l749m7485k1067K3453j7387K0598R881o6440k2402J4843m2561
7922b0966K3167M7597K4164k7717m5272m1912k2354p1320O1140N7795M6861L2861
7910F4044j1982q2097p004K674r578N8397Q6504P1801m7687n2850L5623P8853
7898A86698P145p1245K7340M9139j02487m1074o198r951p2576M2013M468q4104
$$ plain form
7886 -70832 -23738 35736 70255 52493 56842 116723 126299 27124 -52931 2811 86074 68753
7874 68753 35896 83217 166787 96025 23637 25443 -29249 5363 -42965 -70879 -48105 -57768
7862 -57768 -52440 -77706 58480 42430 -50865 -136353 -63171 -78521 -140923 -98465 -26746 -12127
7850 -12127 -38998 -11347 -50693 -89883 -48419 -77170 -86700 -66295 -25301 -2117 102840 137191
7838 137191 9683 -47021 -40783 -76002 -54264 -17260 34271 147579 145262 167160 146717 128149
7826 128149 128242 59929 17581 11567 46469 89687 34400 21608 48194 39869 37080 88568 96131
7813 96131 84189 80224 -29342 -76391 -53036 -45894 18562 56253 41248 41114 93769 49952
7801 49952 9925 -5461 -38749 -9317 30649 47079 67264 20374 16337 -22215 29273 54858
$$ packed form
7886g0832M7094N9474L4519j7762M349N9881R576r9175q0055N5742Q3263j7321
7874F8753l2857M7321Q3570p0762p2388J806n4692L4612m8328k7914K2774r663
7862e7768N328k5266J36186j6050r3295q5488P3182j5350o2402M2458P1719J4619
7850a2127k6871K7651l9346l9190M1464k8751r530K0405M0994K3184J04957L4351
7838A37191j27508n6704O238l5219K1738L7004N1531J13308k317K1898k0443j8568
7826A28149R3o8313m2348o014L4902M3218n5287j2792K6586q325k789N1488P563
7813I6131j1942l965j09566m7049K3355P142O4456L7691j5005j34N2655m3817
7801D9952m0027j5386l3288K9432L9966J6430K0185m6890m037l8552N1488K5585
$$ plain form
7789 54858 44022 28833 38114 163226 243131 106863 -49522 -154244 -152760 -80560 -33121
7778 -33121 -35974 -16313 -47530 -12712 -14532 -60707 -476 68588 54135 23561 6500 114345
7766 114345 67044 16447 96595 129881 116382 84055 -79817 -39827 85478 63933 106845
7755 106845 146770 98406 61225 36097 12186 10013 31342 10450 -5945 -4166 80406 95355
7743 95355 136588 114324 81576 28912 13049 13572 -36852 -104256 -101342 -105215 -169842 -117363 -47823
7730 -47823 -55130 -86075 -23665 -38959 -46268 -9335 -52987 -35065 -35023 -67719 -3973 72215 89011
7717 89011 113846 99613 31289 -37375 -12667 60031 126626 140493 120729 26130 -63652 -44159
7705 -44159 65726 139014 121972 112921 -31319 -43750 27700 89885 31413 -100761 -86738
$$ packed form
7789E4858j0836j5189R281J25112P9905j36268j56385j04722J484P2200M7439
7778c3121k853J9661l1217L4818j820m6175O0231O9064j4453l0574j7061J07845
7766A14345m7301n0597Q0148L3286j3499l2327j63872L9990J25305k1545M2912
7755A06845L9925m8364l7181k5128k3911k173K1329k0892j6395J779Q4572J4949
7743I5355M1233k2264l2748n2664j5863N23n0424o7404K914l873o4627N2479O9540
7730d7823p307l0945O2410j5294p309L6933m3652J7922M2l2696O3746P6188J6796
7717H9011K4835j4233o8324o8664K4708P2698O6595J3867j9764r4599q9782J9493
7705d4159J09885P3288j7042r051j44240j2431P1450O2185n8472j32174J4023
$$ plain form
7694 -86738 -13149 -69152 -10018 69840 63863 56951 6791 43603 55717 15054 -43553 -53872
7682 -53872 -25490 -35431 -78570 -12316 -15284 -54503 -36272 -15347 27105 -57172 -84837 -50225
7670 -50225 -79286 -67169 -99191 -78573 -98390 -76069 6022 31718 -7801 -40342 -67537 -62617
7658 -62617 -4869 -57266 -99214 -49387 -45898 -55298 -51670 -38359 10449 68713 167109 91003
7646 91003 -67187 -149601 -135671 -75309 -46295 -27354 -45861 26483 82758 40232 25542 21102
7634 21102 75000 21385 -5868 34464 58402 27956 29488 127322 208712 174137 70341 54850
7622 54850 120633 98751 70832 60441 41770 54231 120919 99581 119398 36953 -74881 -189878
7610 -189878 -120016 -88703 -15093 14335 28234 59470 91580 -12328 -107002 -108915 -77906 -46116
$$ packed form
7694h6738P3589n6003N9134P9858n977o912n0160L6812J2114m0663n8607j0319
7682e3872K8382r941m3139O6254k968l9219J8231K0925M2452q4277k7665L4612
7670e0225k9061J2117l2022K0618j9817K2321Q2091K5696l9519l2541k7195M920
7658f2617N7748n2397m1948M9827L489r400L628J3311M8808N8264R8396p6106
7646I1003j58190q2414J3930O0362K9014J8941j8507P2344N6275m2526j4690m440
7634B1102N3898n3615k7253M0332K3938l0446J532R7834Q1390l4575j03796j5491
7622E4850O5783k1882k7919j0391j8671J2461O6688k1338J9817q2445j11834j14997
7610a89878O9862L1313P3610K9428J3899L1236L2110j03908r4674j913L1009L1790
$$ plain form
7598 -46116 -30519 -120366 -155471 -139653 -67086 1106 29713 -10863 4414 34983 62218 80619
7586 80619 80357 -30201 -88543 -57375 -53337 -22253 21771 16321 29621 44449 78443 39120
7574 39120 84878 141159 79860 68058 16506 25093 -20708 -100800 -155131 -49522 283 14429
7562 14429 19846 3289 -866 61812 103347 102345 120727 152340 104929 122205 109649 61663
7550 61663 -21635 -17111 24596 -2191 -56198 -69445 -65321 -96532 -154547 -144691 -44868 -67327
7538 -67327 -87873 -137015 -98562 -10211 32727 47796 -36071 3514 46356 87198 3820 -12857
7526 -12857 33431 105318 85356 66022 119208 192413 126884 30702 -76699 -80676 13992 90985
7514 90985 -3595 -95287 -17392 81262 133651 85576 34949 49410 86310 24385 -12542 -10238
$$ packed form
7598d6116J5597q9847l5105J5818P2567O8192K8607m0576J5277L0569K7235J8401
7586H0619k62j10558n8342L1168M038L1084M4024n450J3300J4828L3994l9323
7574C9120M5758N6281o1299j1802n1552Q587m5801q0092n4331J05609M9805J4146
7562A4429N417j6557m155O2678M1535j002J8382L1613m7411J7276j2556m7986
7550F1663q3298M524M1707k6787n4007j3247M124l1211n8015R856R9823k2459
7538f7327k0546m9142L8453Q8351M2938J5069q3867L9585M2842M0842q3378j6677
7526a2857M6288P1887j9962j9334N3186P3205o5529r6182j07401l977R4668P6993
7514I0985r4580r1692P7895R8654N2389m8075n0627J4461L6900o1925l6927K304
$$ plain form
7502 -10238 17855 7618 91379 123847 89553 93691 35150 50033 91152 72969 34689 42367
7490 42367 131568 114828 111008 89109 74605 90992 119301 116445 21744 -8571 -35759 -57638
7478 -57638 -49817 67115 71688 17645 -5287 84366 129317 83402 14626 3937 -32912 -108448
7466 -108448 -116751 -95191 -40315 43106 33101 73959 12075 -93390 -94985 -99858 -118103 -78902
7454 -78902 -540 -29127 -15219 24853 -12379 -42407 -16119 95846 96631 57173 69020 14344
7442 14344 -33203 -50799 -74615 21601 67552 62076 45100 -38528 4726 52122 23789 -4828
7430 -4828 16367 20455 -11960 -28001 -43642 -78533 -122793 -95173 -72030 -40873 -68883 -98031
7418 -98031 -67535 -7668 -11527 25500 30009 -21124 -68548 -54409 -7171 -38545 -32822 -15972
$$ packed form
7502a0238K8093j0237Q3761L2468l4294M138n8541J4883M1119j8183l8280P678
7490D2367Q9201j6740l820k1899j4504J6387K8309k856r4701l0315k7188k1879
7478e7638P821J16932M573n4043k2932Q9653M4951m5915o8776j0689l6849p5536
7466a08448q303K1560N4876Q3421j0005M0858o1884j05465j595m873j8245L9201
7454g8902P8362k8587J3908M0072l7232l0028K6288J11965P85l9458J1847n4676
7442A4344m7547j7596k3816R6216M5951n476j6976q3628M3254M7396k8333k8617
7430d828K1195M088l2415j6041j5641l4891m4260K7620K3143L1157k8010k9148
7418i8031L0496N9867l859L7027M509n1133m7424J4139M7238l1374N723J6850
$$ plain form
7406 -15972 -28720 -57573 -104001 -55446 79249 107747 -13338 -52205 -36776 -60215 -20637
7395 -20637 -103327 -80683 -47589 -97019 -68580 -60633 935 122228 153972 177827 149505 96405
7383 96405 60633 12428 -30646 -1005 13576 -39622 -63161 -91438 -77571 -142202 -105369 -48507
7371 -48507 15611 -23055 -70145 -94024 -89809 -62724 -99776 -105959 -85820 -108370 -122766 -155204
7359 -155204 -129659 -53499 -35997 13312 -16603 -122801 -189333 -137901 -102481 -40649 -59681
7348 -59681 16719 108052 135814 61460 -24381 -78876 -130426 -123364 -68187 -37157 -20256 30572
7336 30572 56675 156528 219323 184450 179776 179444 169241 182272 88246 90290 83662 38196 13885
7323 13885 -3140 17375 8489 18777 40827 77282 59086 -7427 22154 83201 48663 -22464
$$ packed form
7406a5972j2748k8853m6428M8555J34695K8498j21085l8867J5429k3439L9578
7395b0637q2690K2644L3094m9430K8439P947O1568J21293L1744K3855k8322n3100
7383I6405l5772m8205m3074K9641J4581n3198k3539k8277J3867o4631L6833N6862
7371d8507O4118l8666m7090k3879M215K7085l7052o183K0139k2550j4396l2438
7359a55204K5545P6160J7502M9309k9915j06198o6532N1432L5420O1832j9032
7348e9681P6400R1333K7762p4354q5841n4495n1550P062N5177L1030J6901N0828
7336C0572K6103R9853O2795l4873m674l32j0203J3031r4026K044o628m5466k4311
7323A3885j7025K0515q886J0288K2050L6455j8196o6513K9581O1047l4538p1127
$$ plain form
7311 -22464 -8939 1109 -76217 -190401 -198444 -101052 46219 94595 95301 59669 -50437 -108374
7299 -108374 -60339 -15337 -18625 -104446 -95395 -34539 -18425 -101760 -109298 -58714 -2552 96875
7287 96875 46728 -2724 42962 70643 68025 57029 98225 26498 76119 80987 13325 -48317
7275 -48317 -119318 -85386 -73360 -111450 -76194 -106533 -111689 -87722 -42066 -72744 -77570 -40417
7263 -40417 -42830 -30434 -12278 -55910 -2482 -5989 -35101 -174722 -240201 -149779 -44347 -34276
7251 -34276 -66568 -75273 -95354 -141871 -120211 -106200 -66612 -91143 -76904 10293 76193 77925
7239 77925 22322 -84143 -69018 44604 59259 -58504 -97601 -90360 -100230 -111234 -99327 -101273
7227 -101273 -40410 -46055 -38866 -18379 -7044 -35239 -18252 -16599 3673 63296 64285 50596 98056
$$ packed form
7311b2464J3525J0048p7326j14184q043R7392J47271M8376P06l5632j10106n7937
7299a08374M8035M5002l288q5821R051O0856J6114q3335p538N0584N6162R9427
7287I6875n0147m9452M5686K7681k618j0996M1196p1727M9621M868o7662o1642
7275d8317p1001L3932J2026l8090L5256l0339n156K3967M5656l0678m826L7153
7263d0417k413J2396J8156m3632N3428l507k9112j39621o5479R0422J05432J0071
7251c4276l2292q705k0081m6517K1660J4011L9588k4531J4239Q7197O5900J732
7239G7925n5603j06465J5125J13622J4655j17763l9097P241r870j1004J1907j946
7227a01273O0863n645P189K0487J1335k8195J6987J653K0272N9623R89j3689M7460
$$ plain form
7214 98056 106209 119812 7322 54236 83914 98852 16179 -71251 -83631 -99121 -168349 -180187
7202 -180187 -217665 -120194 -46599 -3192 -121844 -122153 -32710 -41492 -77501 -72232 -70150 -44134
7190 -44134 25288 43245 -7107 -125602 -96942 -19448 43783 31070 50288 139719 78497 29530
7178 29530 -13682 -119739 -182138 -101460 -114640 -64214 41944 64006 53502 -15155 -21486 66739
7166 66739 19810 -57846 -54487 -87574 -40086 -37005 41127 91735 101033 11471 -19136 -5483
7154 -5483 24299 31279 -55671 -127559 -80629 -38972 -21788 -80043 -151365 -153246 -136016 -140154 -159217
7141 -159217 -129975 -173559 -182398 -100101 -11444 -57283 -98264 -43355 946 30340 -16759 -118566
7129 -118566 -25772 14610 15373 70836 121272 109076 65426 70345 -28311 -95305 -90863 -86189 -83982
$$ packed form
7214I8056Q153J3603j12490M6914K9678J4938q2673q7430j2380j5490o9228j1838
7202a80187l7478R7471P3595M3407j18652l09Q9443q782l6009N269K082K6016
7190d4134O9422J7957n0352j18495K8660P7494O3231j2713J9218Q9431o1222m8967
7178B9530m3212j06057o2399Q0678j3180N0426J06158K2062j0504o8657o331Q8225
7166F6739m6929p7656L359l3087M7488L081P8132N0608R298q9562l0607J3653
7154e483K9782O980q6950p1888M6930M1657J7184n8255p1322j881J7230m138j9063
7141a59217K9242m3584q839Q2297Q8657m5839m0981N4909M4301K9394m7099j01807
7129a18566R2794M0382P63N5463N0436j2196m3650M919r8656o6994M442M674K207
$$ plain form
7116 -83982 -81197 -95763 -74246 -56990 -22245 106338 119624 10941 -4815 30341 -21614 -93791
7104 -93791 -66354 -82206 -83512 -102933 -122193 -99479 -104951 -82052 -41124 -61234 -84737 -49641
7092 -49641 -54058 17598 19406 36326 121452 183814 159185 64754 4876 -13252 -64695 -60275
7080 -60275 -67141 -16512 -4034 -37562 11135 37793 79090 55884 27986 -75855 -139347 -46327
7068 -46327 -18821 -57835 -128518 -160115 -142906 -75733 -27109 28237 76514 71853 27153 42198
7056 42198 4827 68576 51568 7577 -65888 -69406 -14182 101554 99889 121308 161871 128188
7044 128188 44979 30747 40900 16246 75058 140212 85350 -2333 2471 44664 78976 32986
7032 32986 -8030 -1324 -28809 -94753 -196347 -193822 -170865 -69601 -15859 -128570 -101082 25892
$$ packed form
7116h3982K785j4566K1517J7256L4745J28583J3286j08683j5756L5156n1955p2177
7104i3791K7437j5852j306j9421j9260K2714n472K2899M0928k0110k3503L5096
7092d9641m417P1656J808J6920Q5126O2362k4629r4431n9878j8128n1443M420
7080f0275o866N0629J2478l3528M8697K6658M1297k3206k7898j03841o3492R3020
7068d6327K7506l9014p0683l1597J7209O7173M8624N5346M8277m661m4700J5045
7056D2198l7371O3749j7008m3991p3465l518N5224J15736j665K1419M0563l3683
7044A28188q3209j4232J0153k4654N8812O5154n4862q7683M804M2193L4312m5990
7032C2986m1016O706k7485o5944j01594K525K2957J01264N3742j12711K7488J26974
$$ plain form
7020 25892 36734 96022 173437 139721 128990 38369 3761 25366 28679 56060 11256 -5259
7008 -5259 -9582 529 9473 -5587 -27932 -50987 6022 -12251 2662 7718 4382 27872 103402
6995 103402 197003 202283 122599 25842 26741 103791 27163 20798 17478 -25459 -83657 -39348 -48850
6982 -48850 17512 -33000 -325 -43221 -109822 -86021 -38077 -26862 11113 -351 46864 57177
6970 57177 -5713 -9806 28456 15836 -25117 -30360 63875 114742 95785 -5429 -49085 -80719
6958 -80719 -44206 -15291 -14874 -46303 -111422 -101355 -21073 24599 -61053 -73939 -45655 81039
6946 81039 85598 -14398 -25293 91211 124236 48956 51702 55900 -9548 8036 58349 107647
6934 107647 97890 55793 66947 19112 -12211 24947 -28880 -50522 -41812 -63778 -96416 -92567
$$ packed form
7020B5892J0842N9288P7415l3716j0731r0621l4608K1605L313K7381m4804j6515
7008e259m323J0111Q944j5060k2345k3055N7009j8273J4913N056l336K3490P5530
6995A03402R3601N280p9684r6757Q99P7050p6628o365l320m2937n8198M4309r502
6982d8850O6362n0512L2675m2896o6601K3801M7944J1215L7975j1464M7215J0313
6970E7177o2890m093L8262j2620m0953n243R4235N0867j8957j01214m3656l1634
6958h0719L6513K8915M17l1429o5119J0067Q0282M5672q5652j2886K8284J26694
6946H1039M559r9996j0895J16504L3025p5280K746M198o5448J7584N0313M9298
6934A07647r757m2097J1154m7835l1323L7158n3827k1642Q710k1966l2638L849
$$ plain form
6922 -92567 -137876 -160622 -137276 -95172 -95 39570 106075 108626 39441 72820 55322 54795
6910 54795 51995 -3480 -128905 -48312 31199 96368 139329 70056 13074 7957 35311 12000
6898 12000 -74909 -94321 -60656 -38142 -16619 50523 119878 16631 -85409 -115023 -31092
6887 -31092 -27745 -43927 -18525 62489 129982 128030 58856 22980 60094 32678 -73162 -100549
6875 -100549 -98197 -89187 -66784 -40608 -85204 -74175 35595 92637 27987 18751 37860 72405
6863 72405 78258 38882 -4861 44996 116045 110150 43608 -19983 6955 7105 -18956 -85080 -68836
6850 -68836 -71272 -27110 33093 14559 10183 -25885 -70212 -2256 132097 153905 98399 722
6838 722 16131 66770 83873 48785 44757 37332 112463 142579 48463 -28327 -3501 67585 65326
$$ packed form
6922i2567m5309k2746K3346M2104R5077L9665O6505K551o9185L3379j7498n27
6910E4795k800n5475j25425Q0593P9511O5169M2961o9273n6982n117K7354k3311
6898A2000q6909j9412L3665K2514K1523O7142O9355j03247j02040k9614Q3931
6887c1092L347j6182K5402Q1014O7493j952o9174l5876L7114k7416j05840k7387
6875a00549K352R010K2403K6176m4596J1029J09770N7042o4650r236J9109L4545
6863G2405N853l9376m3743M9857P1049n895o6542o3591K6938J50k6061o6124J6244
6850f8836k436M4162O0203j8534m376l6068m4327O7956J34353K1808n5506r7677
6838G22J5409N0639J7103l5088m028p425P5131L0116r4116p6790K4826P1086k259
$$ plain form
6825 65326 78291 74887 52543 51150 130581 104956 -36772 -14516 110378 85156 64658 67132
6813 67132 87722 70973 114687 169722 176857 62764 -7872 -38249 -99170 -100237 -92738 -46312
6801 -46312 87168 83584 -33059 -28632 -29835 -19603 90490 168632 106738 78605 112985 85517
6789 85517 -10625 82621 94272 95696 95511 41916 40999 93261 63878 -111 -50273 -29073 68097
6776 68097 50786 135542 215126 198976 108834 119680 112576 34532 38750 56728 72316 74831
6764 74831 -5182 -4417 -57859 -96476 -99105 -83198 -78557 -59748 -20965 -393 -41940 -47352 -62783
6751 -62783 -32765 -9884 -37845 -65441 -86548 -26709 -15670 -65508 -42652 759 21507 -56262
6739 -56262 -170820 -172076 -144849 -94230 -60246 16355 18190 -54808 -63597 -29164 84958 123453
$$ packed form
6825F5326J2965l404k2344j393P9431k5625j41728K2256J24894k5222k0498K474
6813F7132K0590j6749M3714N5035P135j14093p0636l0377o0921j067P499M6426
6801d6312J33480l584j16643M427j203J0232J10093P8142o1894k8133L4380k7468
6789H5517r6142R3246J1651J424j85n3595r17N2262k9383o3989n0162K1200R7170
6776F8097j7311Q4756P9584j6150r0142J0846p104p8044M218J7978J5588K515
6764G4831q0013P65n3442l8617k629J5907M641J8809L8783K0572m1547n412j5431
6751f2783L0018K2881k7961k7596k1107N9839J1039m9838K2856M3411K0748p7769
6739e6262j14558j256K7227N0619L3984P6601J835p2998q789L4433J14122L8495
$$ plain form
6727 123453 131642 56632 65714 42713 -8526 -44083 -51712 -25770 -75188 -196971 -220736 -168296
6715 -168296 -173092 -195975 -128300 -124799 -101735 -104743 -89409 -65104 -49937 -20730 40630 32635
6703 32635 -34775 -104312 -107330 -48850 13050 -15520 1203 46185 1162 -7992 17834 7481
6691 7481 18418 -10518 -50237 -84874 -76869 -58731 -42085 1786 48341 89159 138860 73138
6679 73138 -45093 -47279 3763 -46489 -15477 -52815 20124 85045 125454 164715 77385 67904
6667 67904 82839 -4098 18100 -18192 -67192 -11057 37670 62627 183111 193493 49240
6656 49240 15418 -33716 -111074 -138621 -38617 14988 -38238 -20512 -38315 -54407 3177 44378
6644 44378 53368 -19806 -39830 -92732 -41587 31771 53586 29370 42301 16561 16354 95284
$$ packed form
6727A23453Q189p5010R082k3001n1239l5557p629K5942m9418j21783k3765N2440
6715a68296m796k2883O7675L501K3064l008J5334K4305J5167K9207O1360p995
6703C2635o7410o9537l018N8480O1900k8570J6723M4982m5023r154K5826j0353
6691G481J0937k8936l9719l4637Q005J8138J6646M3871M6555M0818M9701o5722
6679G3138j18231k186N1042n0252L1012l7338P2939O4921M0409L9261q7330r481
6667F7904J4935q6937K2198l6292m9000N6135M8727K4957J20484J0382j44253
6656D9240l3822m9134p7358k7547J00004N3605n3226J7726j7803j6092N7584M1201
6644D4378Q990p3174k0024n2902N1145P3358K1815k4216J2931k5740k07P8930
$$ plain form
6632 95284 138338 114961 90182 79581 40068 35819 829 -56868 -42642 -29442 19428 46519
6620 46519 92747 64959 -19438 2366 13378 40482 95464 64970 -52183 -81286 -136512 -87445
6608 -87445 -36560 -61788 -45907 -8761 32581 615 -10031 -52483 -84297 -64840 -62348 39131
6596 39131 44649 -1354 -38356 66749 133164 90170 27368 -125764 -117424 -43767 47635 50866
6584 50866 43126 31140 -25652 -43609 -73290 -29860 10474 19200 47644 53494 40566 60444
6572 60444 -2787 36616 90912 68174 71198 54616 99486 37213 34157 42202 61694 92972
6560 92972 115771 83765 89026 136672 83837 16167 -7646 15026 55039 43105 79350 91510
6548 91510 40993 -28644 30528 35694 39332 107016 176952 156417 93552 119526 181622 180013
$$ packed form
6632I5284M3054k3377k4779j0601l9513m249l4990n7697J4226J3200M8870K7091
6620D6519M6228k7788q4397K1804J1012K7104N4982l0494j17153k9103n5226M9067
6608h7445N0885k5228J5881L7146M1342l1966j0646m2452l1814J9457K492J01479
6596C9131N518m6003l7002J05105O6415m2994o2802j53132Q340P3657R1402L231
6584E0866p740j1986n6792j7957k9681M3430M0334Q726K8444N850j2928J9878
6572F0444o3231L9403N4296k2738L024j6582M4870o2273l056Q045J9492L1278
6560I2972K2799l2006N261M7646n2835o7670k3813K2672M0013j1934L6245J2160
6548I1510n0517o9637N9172N166L638O7684O9936k0535o2865K5974O2096j609
$$ plain form
6536 180013 124330 93289 55561 48037 24502 75693 84480 9550 -86250 -52083 -47445 -45689
6524 -45689 -960 57235 76856 82985 44836 8026 -23323 -63833 10840 -65643 -113506 -103764
6512 -103764 -157157 -94908 -54806 -76039 -10270 26225 17918 -64335 -82924 -35494 73585 113940
6500 113940 54339 -55909 -524 -50848 -90379 4754 37174 63320 29575 -43366 11737
$$ packed form
6536A80013n5683l1041l7728p524k3535N1191Q787p4930r5800L4167M638J756
6524d5689M4729N8195J9621O129l8149l6810l1349m0510P4673p6483m7863R742
6512a03764n3393O2249M0102k1233O5769L6495q307q2253j8589M7430J09079M0355
6500A13940n9601j10248N5385n0324l9531R5133L2420K6146l3745p2941N5103
$$ [...]
##END NTUPLES=NMR SPECTRUM
##END=
