##TITLE=Analysis number 319456
Compound Code cc 23504
Project Code adrs
Chemist Name fudan
##JCAMPDX= 6.0         $$ Bruker NMR JCAMP-DX V2.0
##DATA TYPE= NMR SPECTRUM
##DATA CLASS= NTUPLES
##ORIGIN= Bruker BioSpin GmbH
##OWNER= nmr
$$ XWIN-NMR		Version 3.5
$$ Tue May 16 09:43:33 2006 GMT Daylight Time (UT+1h)  MAYBRIDGE\nmr@NMR_250MHZ
##.OBSERVE FREQUENCY= 250.131544655141
##.OBSERVE NUCLEUS= ^1H
##.ACQUISITION MODE= SIMULTANEOUS (DQD)
##.ACQUISITION SCHEME= undefined
##.AVERAGES= 16
##.DIGITISER RES= 18
##SPECTROMETER/DATA SYSTEM= dpx250
##.PULSE SEQUENCE= zg30
##.SOLVENT NAME= CDCl3
##.SHIFT REFERENCE= (INTERNAL, CDCl3, 0, 16.4603)
##AUDIT TRAIL= $$ (NUMBER, WHEN, WHO, WHERE, WHAT)
$$ ##TITLE= Audit trail, XWIN-NMR		Version 3.5
$$ ##JCAMPDX= 5.01
$$ ##ORIGIN= Bruker BioSpin GmbH
$$ ##OWNER= nmr
$$ C:\u/data/dgb/nmr/ADRS/4390/pdata/1/auditp.txt
$$ ##AUDIT TRAIL=  $$ (NUMBER, WHEN, WHO, WHERE, WHAT)
(   1,<2006-05-16 09:42:55.63 +100>,<MAYBRIDGE\nmr>,<NMR_250MHZ>,
      <created by zg, POWCHK disabled, PULCHK disabled
       configuration hash MD5:
       84 BC 41 DB A1 6E 1D 46 DA 25 12 A5 C1 ED C5 3A
       data hash MD5: 64K
       E2 70 14 43 5A D6 B1 79 AB A8 F6 F9 AE 56 C0 46>)
(   2,<2006-05-16 09:43:13.19 +100>,<MAYBRIDGE\nmr>,<NMR_250MHZ>,
      <Start of raw data processing
       ef LB = 0.3 FT_mod = 6 PKNL = 1 SI = 32K 
       data hash MD5: 32K
       3B 10 C2 15 93 54 97 C2 0A 89 D3 FC 59 18 C4 CE>)
(   3,<2006-05-16 09:43:17.63 +100>,<MAYBRIDGE\nmr>,<NMR_250MHZ>,
      <apk 
       data hash MD5: 32K
       76 CD D6 59 2D B9 B9 5F C9 93 90 DD 83 64 B0 3D>)
(   4,<2006-05-16 09:43:19.24 +100>,<MAYBRIDGE\nmr>,<NMR_250MHZ>,
      <abs ABSG = 5 
       data hash MD5: 32K
       89 9A 80 5C 9A 0D AD 04 85 48 9B B4 D8 3E 47 4F>)
$$ ##END=
$$ 
$$ hash MD5
$$ BB 60 CD 3C 9A 7B C2 7B 4F 3F A1 3D 44 40 34 CC
##$RELAX= 
##$RELAX= 
##$RELAX= 
##$RELAX= 
##$RELAX= 
##$RELAX= 
##$RELAX= 
$$ Bruker specific parameters
$$ --------------------------
##$DU= <C:\u>
##$EXPNO= 4390
##$NAME= <ADRS>
##$PROCNO= 1
##$TYPE= <nmr>
##$USER= <dgb>
##$AMP= (0..31)
100 100 100 100 100 100 100 100 100 100 100 100 100 100 100 100 100 100 
100 100 100 100 100 100 100 100 100 100 100 100 100 100 
##$AQSEQ= 0
##$AQ_mod= 3
##$AUNM= <au_zg>
##$AUTOPOS= <10 >
##$BF1= 250.13
##$BF2= 250.13
##$BF3= 250.13
##$BF4= 250.13
##$BF5= 500.13
##$BF6= 500.13
##$BF7= 500.13
##$BF8= 500.13
##$BYTORDA= 1
##$CFDGTYP= 0
##$CFRGTYP= 5
##$CHEMSTR= <none>
##$CNST= (0..31)
1 1 145 1 1 1 1 1 1 1 1 1 1 1 1 1 1 1 1 1 1 1 1 1 1 1 1 1 1 1 1 1 
##$CPDPRG= <>
##$CPDPRG1= <>
##$CPDPRG2= <>
##$CPDPRG3= <>
##$CPDPRG4= <mlev>
##$CPDPRG5= <mlev>
##$CPDPRG6= <mlev>
##$CPDPRG7= <mlev>
##$CPDPRG8= <mlev>
##$CPDPRGB= <>
##$CPDPRGT= <>
##$D= (0..31)
0 1 0 0 0 0 0 0 0 0.06 0 0 0 0 0 0 0.0002 0 0 0 0 0 0 0 0 0 0 0 0 0 0 
0 
##$DATE= 1147768973
##$DBL= (0..7)
120 120 120 120 120 120 120 120 
##$DBP= (0..7)
150 150 150 150 150 150 150 150 
##$DBP07= 0
##$DBPNAM0= <>
##$DBPNAM1= <>
##$DBPNAM2= <>
$$ [...]
##$SUBNAM7= <"">
##$SUBNAM8= <"">
##$SUBNAM9= <"">
##$SW= 20.6930455092707
##$SWIBOX= (0..15)
0 0 3 0 0 0 0 0 0 0 0 0 0 0 0 0 
##$SW_h= 5175.983436853
##$TD= 65536
##$TD0= 1
##$TE= 295.16
##$TE2= 300
##$TE3= 300
##$TEG= 300
##$TL= (0..7)
0 120 120 120 120 120 120 120 
##$TP= (0..7)
150 150 150 150 150 150 150 150 
##$TP07= 0
##$TPNAME0= <>
##$TPNAME1= <>
##$TPNAME2= <>
##$TPNAME3= <>
##$TPNAME4= <>
##$TPNAME5= <>
##$TPNAME6= <>
##$TPNAME7= <>
##$TPOAL= (0..7)
0.5 0.5 0.5 0.5 0.5 0.5 0.5 0.5 
##$TPOFFS= (0..7)
0 0 0 0 0 0 0 0 
##$TUNHIN= 0
##$TUNHOUT= 0
##$TUNXOUT= 0
##$USERA1= <user>
##$USERA2= <user>
##$USERA3= <user>
##$USERA4= <user>
##$USERA5= <user>
##$V9= 5
##$VALIST= <valist>
##$VCLIST= <CCCCCCCCCCCCCCC>
##$VD= 0
##$VDLIST= <DDDDDDDDDDDDDDD>
##$VPLIST= <PPPPPPPPPPPPPPP>
##$VTLIST= <TTTTTTTTTTTTTTT>
##$WBST= 1024
##$WBSW= 4
##$XGAIN= (0..3)
0 0 0 0 
##$XL= 0
##$YL= 0
##$YMAX_a= 374672
##$YMIN_a= -448514
##$ZGOPTNS= <>
##$ZL1= 120
##$ZL2= 120
##$ZL3= 120
##$ZL4= 120
##$ABSF1= 16.46025
##$ABSF2= -4.232922
##$ABSG= 5
##$ABSL= 3
##$ALPHA= 0
##$AQORDER= 0
##$ASSFAC= 0
##$ASSFACI= 0
##$ASSFACX= 0
##$ASSWID= 0
##$AUNMP= <proc_1d>
##$AZFE= 0.1
##$AZFW= 0.1
##$BCFW= 0
##$BC_mod= 0
##$BYTORDP= 0
##$COROFFS= 0
##$CY= 12.5
##$DATMOD= 1
##$DC= 0
##$DFILT= <>
##$DTYPP= 0
##$F1P= 14.0000005364418
##$F2P= -0.99999901652339
##$FCOR= 0.5
##$FTSIZE= 32768
##$FT_mod= 6
##$GAMMA= 0
##$GB= 0
##$INTBC= 1
##$INTSCL= 1
##$ISEN= 128
##$LB= 0.3
##$LEV0= 0
##$LPBIN= 0
##$MAXI= 10000
##$MC2= 0
##$MEAN= 0
##$ME_mod= 0
##$MI= 0
##$NCOEF= 0
##$NC_proc= -2
##$NLEV= 6
##$NOISF1= 0
##$NOISF2= 0
##$NSP= 0
##$NTH_PI= 0
##$NZP= 0
##$OFFSET= 16.46025
##$PC= 1
##$PHC0= 170.4934
##$PHC1= 7.077964
##$PH_mod= 1
##$PKNL= yes
##$PPARMOD= 0
##$PSCAL= 4
##$PSIGN= 0
##$REVERSE= no
##$SF= 250.13001544295
##$SI= 32768
##$SIGF1= 0
##$SIGF2= 0
##$SINO= 400
##$SIOLD= 32768
##$SREGLST= <1H.CDCl3>
##$SSB= 0
##$STSI= 32768
##$STSR= 0
##$SW_p= 5175.98343685301
##$SYMM= 0
##$S_DEV= 0
##$TDeff= 65536
##$TDoff= 0
##$TI= <Analysis number 999999
Compound Code 99
Book Reference 9
Project Code 9>
##$TILT= no
##$TM1= 0
##$TM2= 0
##$TOPLEV= 0
##$USERP1= <user>
##$USERP2= <user>
##$USERP3= <user>
##$USERP4= <user>
##$USERP5= <user>
##$WDW= 1
##$XDIM= 32768
##$YMAX_p= 301195403
##$YMIN_p= -84534
$$ End of Bruker specific parameters
$$ ---------------------------------
##NTUPLES= NMR SPECTRUM
##VAR_NAME=  FREQUENCY,     SPECTRUM/REAL,   SPECTRUM/IMAG
##SYMBOL=    X,             R,               I
##VAR_TYPE=  INDEPENDENT,   DEPENDENT,       DEPENDENT
##VAR_FORM=  AFFN,          ASDF,            ASDF
##VAR_DIM=   32768,         32768,           32768
##UNITS=     HZ,            ARBITRARY UNITS, ARBITRARY UNITS
##FACTOR=    0.157963299565203, 1,           1
##FIRST=     4117.20280042896, 0,            0
##LAST=      -1058.78063642405, 0,           0
##MIN=       -1058.78063642405, -84534,      0
##MAX=       4117.20280042896, 301195403,    0
$$ Real data points
##PAGE= N=1
##DATA TABLE= (X++(R..R)), XYDATA
$$ [...]
19569G1814j3087m744K6966J2799j5825j9640J396N941j0888j7383P595l844N854
19556D6954q004R265J3928o710k3660n227k257L783j331n322R299K7365R154r737
19542E7500j0532o24J5086J1775O115P25q761k6866N225K0544J153O081R001P828
19528I4250k063m262j7521n521Q77J6195k022j1206J1976K2788R4j2761l347Q741
19514I6218o317n477O220j1764l291P879K4065l356j6010j5286J7327L019o979
19501H6248J6129J7385o302j6192J4381R721J5072K805o403j3679O155L275o176
19488A22419j3192K3354J3318R911K5272j025J6866M1620K9140N7410J7609n959
19476C36743J1148N569q605J2158K8752M2931L4585L5778L4249M3430L2916Q113
$$ plain form
19569 71814 58727 53983 80949 93748 77923 58283 59679 65620 54732 37349 44944 41100 46954
19556 46954 38950 48215 62143 55433 31773 26546 24289 28072 26741 21419 30718 58083 67237 57500
19542 57500 46968 46344 61430 73205 79320 80045 71284 44418 49643 70187 71340 77421 86422 94250
19528 94250 92187 87925 70404 64883 65760 81955 79933 68727 80703 103491 103585 90824 87477 96218
19514 96218 89901 84424 90644 78880 75589 83468 107533 104177 88167 72881 90208 93227 86248
19501 86248 102377 119762 113460 97268 111649 121370 136442 139247 132844 119165 125320 128595 122419
19488 122419 109227 132581 145899 155810 181082 180057 196923 238543 267683 325093 342702 336743
19476 336743 347891 353460 344855 357013 385765 428696 463281 499059 533308 576738 609654 617767
19464F17767M378r60J085L8202O9318J19750J41967J38389J30978J46465J66870
19453A574209K10345L16059M99365P71890J247406K057974L421756M884659M945709
19444A9929372L306642M02891k500554l564392k290259J923K344049L698983L186729
19435B4515384R55690k086641m410901m577370l296974k125233j368842r20662
19427F684451o47999m75918l36248k68397k73343k58346k60331k21599j51867
19418C790403j14683p0037o1853n4566o9967o3103l3564n6946n5663q7778j06837
19407C015406n6143j0349M5240J14154J12806J24000J10798P7218Q2128J93832
19397C809090L91170O39690R84536J601052K740474M440872N795350N337800L012400
$$ plain form
19464 617767 622145 621185 622270 660472 729790 849540 991507 1129896 1260874 1407339 1574209
19453 1574209 1784554 2100613 2599978 3371868 4619274 6677248 10099004 14983663 19929372
19444 19929372 23236014 23638905 21138351 17573959 15283700 15285623 17629672 21328655 24515384
19435 24515384 25471074 23384433 18973532 14396162 11099188 8973955 7605113 6684451
19427 6684451 6036452 5560534 5224286 4955889 4682546 4424200 4163869 3942270 3790403
19418 3790403 3675720 3605683 3543830 3489264 3419297 3356194 3322630 3265684 3210021 3122243 3015406
19407 3015406 2959263 2948914 2994154 3108308 3221114 3345114 3455912 3533130 3615258 3809090
19397 3809090 4200260 4839950 5824486 7425538 10166012 14606884 20402234 25740034 28752434
19388B8752434n14820l532091l997108k036667O87934L258040M330348L120514
19380C0068584J45005l349171n496899n061956l507317k236815j471107j002151
19372H088173p28741n71889m54656l82730l35156l14146k78022k61747k30592
19363D530494j71257j04102j31448j40251j20266r8504j01598j18952j23774j09811
19353C310531j25368j50693j20254q2219n9350o3609n6120n0701n2343q5182j02414
19342B362278q4816p6810p1923n9108n6894k9621k6839o8525q2476n5338l7061
19331A712867l0377l1541n5777l0440n6580p2262l9911m4939j8951j0558q268
19320A313263k434m1500m9872l6406k8680l4436l2538k0833l3692k9707j2726
$$ plain form
19388 28752434 28237614 24705523 20708415 18671748 19359682 22617722 26948070 30068584
19380 30068584 30213589 26864418 21367519 16305563 12798246 10561431 9090324 8088173
19372 8088173 7359432 6787543 6332887 5950157 5615001 5300855 5022833 4761086 4530494
19363 4530494 4359237 4255135 4123687 3983436 3863170 3764666 3663068 3544116 3420342 3310531
19353 3310531 3185163 3034470 2914216 2831997 2772647 2709038 2652918 2602217 2549874 2464692 2362278
19342 2362278 2277462 2200652 2128729 2069621 2012727 1983106 1956267 1887742 1805266 1749928 1712867
19331 1712867 1682490 1650949 1595172 1564732 1508152 1435890 1395979 1351040 1332089 1321531 1313263
19320 1313263 1310829 1269329 1219457 1183051 1154371 1119935 1087397 1066564 1032872 1003165 990439
19309I90439k1452n5975k2042k865j4017j9986k1606k8322j2641n1089k4900l513
19297G12031j3342j8232j24N535k9556j2368j0435n0167k7831j7299j882j2615
19285E23715j6521p158l3067j5139k0947k1102j5189L163L349k746o937l114j9112
19272C69195n5782n567J0250j0239L885J8629k1394M488K28k960j5729m237M32
19259B91199l557J4063P175M458P799J0557L1214J8429m723j508J071k0497m357
19246C51323M894o782j5559p881k6800l9670k1300j7077o440O047k9307k9755
19234A61693k7696q863K0791L558p086l498N155J7010j262j5582l3807j2315N413
19221A03511J0595r31k5190o63R898P619J395j0717J9931J8695j4232k4369K739
$$ plain form
19309 990439 968987 913012 890970 888105 874088 854102 832496 804174 791533 740444 715544 712031
19297 712031 698689 680457 680333 685868 656312 643944 633509 583342 555511 538212 536330 523715
19285 523715 507194 500036 466969 451830 430883 409781 394592 397755 401104 398358 391421 388307 369195
19272 369195 313413 307846 318096 307857 311742 330371 308977 313465 313693 310733 295004 290767 291199
19259 291199 287642 301705 308880 313338 321137 331694 362908 381337 376614 375106 376177 355680 351323
19246 351323 356217 349435 333876 325995 299195 259525 238225 221148 214708 220755 191448 161693
19234 161693 133997 125134 145925 149483 142397 138899 144054 161064 159802 144220 110413 98098 103511
19221 103511 114106 113175 87985 87322 97220 104839 106234 95517 115448 134143 119911 95542 98281
19208I8281Q225k383j1660k7654J1749o783J2572L5543L8632K2236N099r002J3918
19195A88773K095K1160j1936k0719j7930k029q666p534l082J308k1048o887N491
19182A18996j5319j6275j1070p475m015K016j1385r588J8620R656r614j3626j064
19169D9857O386m006J0099r326l321j1895k8879Q90K1664L4571J7316o471j50
19156G6735k6245j8716J6032L143j1753J0953K0569R861j29j2368r749l163j9115
19143C6055m572R233J6613Q455l3428k7923J6166P799p10q414k385p931k9314
19130b0356j6775K2900J9025J2093p267J5166J2988L2107L40j9068j2317j1114
19118B7722K567J900r601J1136Q359J3090K061j0929n651R094J2116r624M062
$$ plain form
19208 98281 106506 104123 92463 64809 76558 69775 82347 117890 156522 178758 183857 174855 188773
19195 188773 190868 212028 200092 179373 161443 159414 150748 143214 140132 141440 120392 113505 118996
19182 118996 103677 87402 76332 68857 64842 66858 55473 45885 64505 74161 64547 50921 49857
19169 49857 56243 52237 62336 53010 49689 37794 8915 9805 31469 66040 83356 76885 76735
19156 76735 50490 31774 47806 50949 39196 50149 70718 80579 80450 68082 58333 55170 36055
19143 36055 31483 40716 57329 65784 32356 4433 20599 28398 27688 19274 16889 8958 -20356
19130 -20356 -37131 -14231 4794 16887 9620 24786 37774 69881 70221 51153 38836 27722
19118 27722 30289 32189 22588 33724 42083 55173 57234 46305 40654 49748 61864 52240 56302
19105E6302k0471k2290j7676k166n29M547j909J1922N755m359j3615j8893R973
19092a3409K0415j729k084m508P550o195J2909N513L488J9413J2608p016M329
19079E1284k6119j2794N070j1785M548K8371n648j9241r380J6298J5329j8309
19067A7624j0855j192k3607j1530Q067j896k808L9143K7087k416j666k5650k319
19054G982N262L490j0164j0881j4574P932R601P625J3582N18k471j5672k6379
19041b4149J2756K7453r863M627q846J1987m836j3986P622o600j711J1417J2490
19028A8361J5761j0517k3769j7504k0245J8263K6361J6170n143q466P281j2051
19016D502l834J1236j3614j1753l133J9198l162k1023K2308J2674q16P617j6041
$$ plain form
19105 56302 35831 13541 -4135 -6301 -6830 -2283 -4192 7730 13485 9126 -4489 -23382 -13409
19092 -13409 7006 5277 3193 -1315 6235 40 12949 18462 21950 41363 53971 46955 51284
19079 51284 25165 12371 17441 5656 10204 38575 32927 13686 4306 20604 35933 17624
19067 17624 6769 5577 -18030 -29560 -21493 -23389 -26197 12946 40033 37617 35951 10301 7982
19054 7982 13244 16734 6570 -4311 -18885 -10953 -1352 6273 19855 20373 17902 2230 -24149
19041 -24149 -11393 16060 6197 10824 1978 13965 9129 -4857 2765 -3835 -5546 5871 18361
19028 18361 34122 23605 -164 -17668 -37913 -19650 6711 22881 17738 9272 16553 4502
19016 4502 668 11904 -1710 -13463 -16596 2602 -560 -21583 725 13399 12583 20200 4159
19003D159j5173m652J230J2476O87R807p988q423m71k011j0220J8851J0118Q158
18989A6548J2167R069o417r106r869p844J1246K3927K2059k092k574o272K896
18976E3738l13R617j5975j0438J9644J0024j854k1816L495j717l088j1590o02
18963B9125J0173r65j790M375J2810L768j757J2909K829l076k0230r638K5328
18950F3861J4806m2800j3760J2314P762Q165k783J0484l356J160J0967n581o263
18937E4976r047o926j937J0396j0073K6300L0507r618K70J6007O015K4654M3723
18924A75247J8055j4273l6827j4477J0870J9755J8600k17j8148j7707q549o073
18912A26256j4957j5095j6216N273M983r024o7K32j9636m1839K432P929J570j0108
$$ plain form
19003 4159 -11014 -15666 -14436 -1960 -1273 8534 546 -7877 -8348 -10359 -20579 -1728 8390 16548
18989 16548 28715 37784 31367 22261 12392 4548 15794 39721 61780 59688 57114 50842 53738
18976 53738 53425 63042 47067 36629 56273 66297 64443 42627 46122 44405 41317 29727 29125
18963 29125 39298 38333 36543 40918 53728 57496 55739 68648 71477 68401 48171 38533 63861
18950 63861 78667 35867 22107 34421 42183 50348 47565 58049 54693 55853 66820 61239 54976
18937 54976 45929 39003 37066 47462 37389 63689 94196 84578 84848 100855 106870 131524 175247
18924 175247 193302 179029 142202 127725 138595 158350 176950 176733 158585 140878 132329 126256
18912 126256 111299 96204 79988 85261 90244 81220 81153 81385 61749 19910 22342 30271 31841 21733
18898B1733Q606K4171O968k3901J3077K789j6641J4439J3537R223j3050J697L434
18885F6082P817k6417J10K0403L645j1295O717l638j8243P324J65J0212M7848
18872A10730N4721K6886L640j144J0329k1991l4680j3627J9387J5970J5310J0530
18860A96061r654m504m609j0169j1744j3175l177j0181j9932j1968k3252j7550
18848E6146K9415N724j1273M675P816K208j5249o255N990j0528N064p059n452
18835F1222J921K1907k585q363j3330M021L833l706j8373p339J154M313q877n480
18821C0318K1484R883p200J4515J929J7919J9716J3355J4449l5334j9040j2737
18809F9257l144K9059L224J4216O794M37n826J4921m694o144L166j7278M269M239
$$ plain form
18898 21733 30339 54510 61478 37577 50654 53443 36802 51241 64778 74001 60951 62648 66082
18885 66082 73899 47482 47592 67995 71640 60345 67062 63424 45181 52505 52670 62882 110730
18872 110730 165451 192337 195977 194833 205162 183171 148491 134864 154251 170221 185531 196061
18860 196061 186407 181903 177294 167125 155381 142206 139029 128848 108916 96948 73696 56146
18848 56146 85561 91285 80012 84687 92503 94711 79462 73207 79197 68669 73733 66674 61222
18835 61222 63143 85050 82465 74102 60772 64793 68626 64920 46547 39208 40362 44675 35798 30318
18821 30318 51802 61685 54485 69000 70929 88848 108564 121919 136368 101034 81994 69257
18809 69257 66113 95172 98396 112612 119406 119843 114017 128938 124244 118100 121266 103988 108257 112496
18795A12496j0490j6880o973J3957J5398k082j3023k0633l932K5313K4369L04
18783A17824L183J3035J8517o015j0092k02Q842R765j624R188o231q371J3865
18770A61684R379J4249J7335R521L8397M2238M8290J6672M006j6995l4555N310
18758C15531L0213J3354L8967L1275L5907M9012N0823L2334O1510L9300N1899
18747G50125O1205N6400O4709P5624Q2843J17799J32190J38464J63953K11733
18737A855045L18995M50240O10169Q89235J487848K483763L623108M008195L597982
18728A9324580L148583K936876L509824L291057J599249j039247k800477k593240
18720B7377205k143315k372594l512722m008298l184347k141474j430463r91519
$$ plain form
18795 112496 102006 85126 78153 92110 107508 105426 92403 71770 67838 93151 117520 117824
18783 117824 121007 134042 152559 146544 136452 136250 145092 154857 153233 162421 156190 147819 161684
18770 161684 171063 185312 202647 212168 250565 292803 341093 357765 361771 344776 310221 315531
18758 315531 345744 359098 398065 429340 465247 514259 565082 597416 658926 698226 750125
18747 750125 811330 867730 932439 1008063 1090906 1208705 1340895 1479359 1643312 1855045
18737 1855045 2174040 2624280 3234449 4123684 5611532 8095295 11718403 15726598 19324580
18728 19324580 22473163 25410039 28919863 32210920 33810169 32770922 29970445 27377205
18720 27377205 25233890 22861296 19348574 15340276 12155929 10014455 8583992 7592473
18712G592473p27195n64874m42387l34277k81821k61375k18810j62869j50130
18703D448735j49705j41187j35142j52193j21424r9732q5503q2351p1606o2078
18693C347814o5902m1894l6019k6546l4913O514N5629N1772P2978R2673J35279
18682C557385K15307L44883N36114Q79998J419413K343641L308885L381118K966974
18673A8953718K513591K539154L035515K519119P57412j516772k608361k193284
18665B4000092j883429k262989l288374l397689k513960j641084j125587p95524
18657G091456n90051m48299l73474l09546k70216k33450k26221j93447j80191
18648D266561j47663j26714j42479j55751j60710j51700j18986j25607j18485
$$ plain form
18712 7592473 6865278 6300404 5858017 5523740 5241919 4980544 4761734 4598865 4448735
18703 4448735 4299030 4157843 4022701 3870508 3749084 3649352 3563849 3481498 3409892 3347814
18693 3347814 3281912 3240018 3203999 3177453 3142540 3149054 3204683 3256455 3329433 3422106 3557385
18682 3557385 3772692 4117575 4653689 5533687 6953100 9296741 12605626 15986744 18953718
18673 18953718 21467309 24006463 27041978 29561097 30318509 28801737 26193376 24000092
18665 24000092 22116663 19853674 16565300 13167611 10653651 9012567 7886980 7091456
18657 7091456 6501405 6053106 5679632 5370086 5099870 4866420 4640199 4446752 4266561
18648 4266561 4118898 3992184 3849705 3693954 3533244 3381544 3262558 3136951 3018466
18639C018466j05775r3695p0572n8281p9525q9564p5766q2193q3050p0230m9456
18628B160359m4165l4220o4927p2205n7230m2859m9513n4087m7903l4129n1606
18617A607515m2362m6813m5630n0585m7007k9436k3665j9144k2854j7432l5691
18606A226896m0895l4517k5399k8643k8316k8655k5522k2856k4335k3465k4693
18595I19600k6784l1114k0662P615k3882n1757l3172k6970j678j3754j5108r276
18583F73058j4646j9879k6123k0352j3688o475k249j8830j1343k8322j4494K568
18571D99225r313j3836L920j0458k3724j7703j1423j7479j8526j0626k1104k1134
18559C27819J5717n389j1083q191j6237r007n696L789R682l0380j6716J668l5480
$$ plain form
18639 3018466 2912691 2818996 2748424 2690143 2610618 2521054 2445288 2363095 2280045 2209815 2160359
18628 2160359 2116194 2081974 2017047 1944842 1887612 1844753 1795240 1741153 1693250 1659121 1607515
18617 1607515 1565153 1518340 1472710 1422125 1375118 1345682 1322017 1302873 1280019 1262587 1226896
18606 1226896 1186001 1151484 1126085 1097442 1069126 1040471 1014949 992093 967758 944293 919600
18595 919600 892816 861702 841040 848655 824773 773016 739844 712874 711196 697442 682334 673058
18583 673058 658412 638533 612410 592058 578370 571895 569646 550816 539473 511151 496657 499225
18571 499225 489912 476076 479996 469538 445814 428111 416688 399209 380683 370057 348953 327819
18559 327819 343536 338147 327064 318873 302636 293629 287933 291722 301404 271024 254308 255976 220496
18546B20496j4568J2322J9358j5785k9184j9011K375j561K3787R451j6825m006
18534A86849M524N072O98k3116n899O477q132j2273j2230m731J000j0791p353
18521A20095n039o781K950j177j2626P802p631j0004j323J2885R19j5615R114
18508I3569j5497p807J441J7134j0901j3056m51K0542j0856m482R641j2015o153
18495F1109j6061p745J2327k343P869R55n170j4229l306L0417k491j0362p093
18482D3877j7520k2239J0627M7946K3003j6522j5604r18j5833j3229R036L659
18470C6283J6288J2958J8048q568j1342j8555k6654q884L516j666m019Q205q182
18457G428J2386J7687J1742J0337q650n890P85L431J0850o68j3877J2772L994
$$ plain form
18546 220496 205928 218250 237608 221823 192639 173628 176003 174442 198229 207680 190855 186849
18534 186849 191373 196445 197143 174027 168128 174605 166473 154200 141970 137239 138239 127448 120095
18521 120095 115056 108275 111225 110048 97422 105224 97593 87589 86266 99151 100070 84455 93569
18508 93569 78072 70265 71706 88840 77939 64883 64432 84974 74118 69636 79277 67262 61109
18495 61109 45048 37303 49630 47287 55156 56111 50941 36712 33406 63823 61332 50970 43877
18482 43877 26357 4118 14745 62691 85694 69172 53568 52650 36817 23588 32624 36283
18470 36283 52571 65529 83577 75009 63667 45112 18458 9574 13090 11424 7405 15610 7428
18457 7428 19814 37501 49243 59580 50930 45040 45825 49256 60106 59438 45561 58333 62327
18444F2327j6427J4015R421k4904j8193p444j817O246m219m849K0806J0387j6358
18431B8991p249J1144K099n552j368q71R857J348j8942J476R873J0726Q237p927
18417D1842k9764n023J3990R251l182p7o213n920p612j2672j6449j0075N619L4583
18403H298K3828p661r8j7581O603P219j4460m348j2333j5695N704l128L0169L5667
18389D2184q803j7100J946n838N126j0700K610J3807r22k322j101j049j345k3319
18375f826j1779o362J1519o370O732J0114K0278J8198p796N449N019j4065R27
18362B5038J6315O272L901j2543k6562n519J8526P790k9654n834L395j3674J9920
18349G371p70P523L266r535Q981J3629j8254j9206p990J1186N526J5663Q398k232
$$ plain form
18444 62327 45900 59915 69336 44432 26239 18795 16978 23224 19005 14156 34962 45349 28991
18431 28991 21742 32886 34985 29433 28065 27194 37051 38399 19457 20933 30806 41532 49769 41842
18417 41842 12078 7055 21045 30296 27114 27037 20824 14904 7292 -5380 -21829 -31904 -26285 8298
18403 8298 32126 24465 24367 6786 13389 20608 6148 1800 -10533 -26228 -20524 -23652 6517 42184
18389 42184 33381 16281 18227 12389 17515 6815 9425 23232 22310 19988 18887 17838 16493 -6826
18375 -6826 -18605 -24967 -13448 -19818 -13086 -2972 17306 35504 27708 33157 38176 24111 25038
18362 25038 41353 47625 51526 38983 12421 6902 25428 33218 3564 -2270 1125 -12549 7371
18349 7371 6601 14124 17390 7855 16836 30465 12211 -6995 -14985 -3799 1727 17390 25788 23556
18335B3556p06J3296Q459n400p775N93r940J894J8776n507k290j3897j6573L313
18321G799O211k900l41m192m258K6952K6322M293m2310j2554J0923m245P690R749
18307B9139q448j8651O154J86l962M838M483N643K6097j1905j5920r354N498J3564
18293B7362K8484R686q273l525K055k0164K661J3473K1005J466k3350k2090m247
18280B4543j5694R02N834J5209R38j4012l05J8202R67N539n203k375m68R848p597
18265C6328k0617M274K81o681j9888l06N598k0746j106R557J3044L1227J8969
18252D9934L901j5979J2152j1260j5748N022o20p265k154q322p644j2491j466
18239a1940J6480J1192L751r77J4752R511J963K799J4169o880k1312j9537J1784
$$ plain form
18335 23556 22850 36146 44605 39205 31430 32023 22083 23977 42753 37246 34956 21059 4486 7799
18321 7799 14010 11110 10769 6577 2319 29271 55593 59886 17576 5022 15945 11700 19390 29139
18307 29139 20691 2040 8194 8380 4418 9256 13739 19382 45479 33574 17654 8300 13798 27362
18293 27362 55846 65532 57259 53734 55789 35625 38286 51759 72764 74230 50880 28790 24543
18280 24543 8849 9751 15585 30794 31732 17720 17415 35617 36584 42123 36920 34545 34077 43925 36328
18265 36328 15711 19985 20266 13585 -6303 -6609 -1011 -21757 -22863 -13306 -262 30965 49934
18252 49934 53835 37856 50008 38748 23000 28022 27402 20137 17983 9661 2017 -10474 -11940
18239 -11940 4540 15732 19483 18506 33258 42769 44732 47531 61700 54820 33508 13971 25755
18226B5755j3337n839n14J4316J9918j2336O996J726O493J6474j7802o274Q359
18213D3935P562m477k812o847Q083j7948k0339N833L0606P404j0456n968J1280
18200D5856J4694K6985J2238K8622L6252J1604J3325j0067K0442K3046p607l3052
18188A82338k9825m397k4607k2934R465j2448j3846k5616k1125J483j3491J5580
18176D0577L0573j5685j4076j6994n169K448K3263K4546O846j8998r11m535o613
18163D5272K774L575J029R761J2905K3139k3936m966N605J2044J342P03J4975
18150A04222K9k1391n465K2973Q744j0001n186L1916M2092L3593M5149K3011P413
18137B77099O629L183k1970j0136J0102m320Q341j6663J6991M912o679m93j5870
$$ plain form
18226 25755 12418 6579 6065 20381 40299 27963 34959 36685 43178 59652 41850 35576 43935
18213 43935 51497 47020 44208 37361 45444 27496 7157 12990 43596 51000 40544 34576 45856
18200 45856 60550 87535 99773 128395 164647 176251 189576 179509 199951 222997 215390 182338
18188 182338 152513 148116 123509 100575 110040 97592 83746 58130 37005 38488 24997 40577
18176 40577 71150 55465 41389 24395 19226 21674 44937 69483 76329 57331 56420 51885 45272
18163 45272 48046 51621 52650 62411 75316 98455 74519 69553 75158 87202 88544 89247 104222
18150 104222 104251 82860 77395 100368 109112 99111 93925 125841 167933 201526 246675 269686 277099
18137 277099 283728 286911 264941 254805 264907 260587 268928 252265 269256 274168 267489 266996 251126
18124B51126K0784L1941L7347K2638M3484P6130R9427R0823J29317J48560J70699
18113A122276K24537L81866O03515R72331J753085L270763N736701O421918L736974
18104B4223966M99038m769663o374811m321422k440958j406470r01028o32560
18096C876092m60883l49929k90096k68641j99985j43103j35055j01670o5627m4635
18086A816468p5124q0076q6445o5576o2555m2691n7050o0561o2316n7125m7549
18075A119400k4581j5667k4103k3914j2364n1744l8177k0834l7680l2167m5477
18064G92692m3976k2587j0212n897K114j7696j2546j1586r283j3813l9330k9090
18052E78790p3j2899k7899k1084j7434r491q690J0921N15k651l3709j1064j423
$$ plain form
18124 251126 271910 303851 341198 363836 407320 483450 582877 673700 803017 951577 1122276
18113 1122276 1346813 1728679 2332194 3304525 5057610 8328373 14065074 20486992 24223966
18104 24223966 24723004 19953341 13578530 9257108 6816150 5409680 4508652 3876092
18096 3876092 3415209 3065280 2775184 2506543 2306558 2163455 2028400 1926730 1861103 1816468
18086 1816468 1741344 1661268 1574823 1509247 1446692 1404001 1346951 1286390 1224074 1166949 1119400
18075 1119400 1094819 1079152 1055049 1031135 1018771 967027 928850 908016 870336 838169 792692
18064 792692 748716 726129 715917 710020 712134 694438 681892 670306 661023 647210 607880 578790
18052 578790 578717 565818 537919 516835 499401 489910 481220 492141 492656 490005 456296 445232 443809
18039D43809j2633k9120l2762j7180K0243J5754K300j9164k3461l755j6258j0015
18027C17758n470j812j538j8935j7830J930L510J175j3006j9558j5904J4977R858
18014B55155j0410k0243j0550j942j0087J1805M735m309R87R93k5272j9130k594
18001A69138r653o124K1576o485j3181r79q397N025m013j9687j9639J0050l76
17988A17255J325L450l074j8236j3578K430J7452Q544r990J0924J1403j8608m122
17975A05175m663l412o52p197Q46J9363J3971n992j6665K68l570J7633k291k1314
17961I1500k6716n25L0010M838r829J600j7529r915p874j3790j8967n376P553
17948B4980J8862K4803m293j1078k254j3328p440l940J9029J0787o473o125J153
$$ plain form
18039 443809 431176 402056 369294 352114 372357 388111 390411 371247 347786 344031 327773 317758
18027 317758 312288 310476 308938 290003 272173 274103 277613 278788 265782 246224 230320 245297 255155
18014 255155 244745 224502 213952 212010 201923 213728 218463 214154 215141 216134 190862 171732 169138
18001 169138 159485 153361 174937 168452 155271 154292 145895 150920 146907 127220 107581 117631 117255
17988 117255 118580 122030 118956 100720 87142 89572 107024 115568 105578 116502 127905 109297 105175
17975 105175 100512 97100 96448 89251 90097 109460 123431 117439 100774 101042 97472 115105 112814 91500
17961 91500 64784 64259 94269 99107 89278 90878 73349 63434 55560 41770 22803 17427 24980
17948 24980 43842 68645 64352 53274 51020 37692 30252 26312 45341 56128 49655 43530 44683
17935D4683R431R656p680K367J993j6875k109J397l981j0264p359r31J0138n923
17921B4543P047J3278J2463p621l994j0189L881L126J056j8152n079j2107k3959
17908a5707r424J7903J5782K3408j0973k2714L882R629j1639j3474J4620J9266
17896B0559k3j9390j1748K693q649o806L4490Q191j9416j1195K2266j5363M617
17883B26n059j0257Q997J1331Q00k056J2646K6892J1392j4748q478k4572j9494
17870a2380N032J4763k2254n191K3381O212K2677n48k3683j7630J6343q023q290
17857i591O320K3335K6433j0910j2802j5125n292J8977J9025K985j3241l4316
17845d202J307L0641l534J348M24l252N791j3015J0389k729l9225j991J8517N691
$$ plain form
17935 44683 54114 63770 56090 58457 60450 43575 41466 42863 38882 28618 21259 20328 30466 24543
17921 24543 31590 44868 57331 49710 45716 35527 39408 42534 43590 25438 20359 8252 -15707
17908 -15707 -25131 -7228 8554 31962 20989 -1725 2157 11786 147 -13327 1293 20559
17896 20559 20536 1146 -10602 -7909 -16558 -23364 11126 19317 -99 -11294 10972 -4391 226
17883 226 -4833 -15090 -6093 5238 6038 3982 16628 43520 54912 40164 31686 7114 -12380
17870 -12380 -7348 7415 -14839 -20030 3351 9563 32240 31692 8009 -9621 6722 -1301 -9591
17857 -9591 -3271 20064 46497 35587 22785 7660 2368 21345 40370 43355 30114 -4202
17845 -4202 -2895 27746 24212 25560 25984 22732 28523 15508 25897 23168 -16057 -18048 469 6160
17831F160o574R977J7706p044j0836q962L818J6619J0425Q66K335j7142o504r01
17817I943j3669j2384M172J2970L971j5354K9048m328j2790J0009N943P987q217
17804A7301j2915J247J532J001L950j07P384j0460J5557O78k2298j1131N994j7858
17790b0125r9J797L082J3197Q60j6070q53J1542J5223J993n003O587K3822M495
17776D0448k2773q364j9395Q894m042j4758m641J3368j1302r38Q763O438j0867
17763a9169m10L96J8199J324k6573k335J822j382J1053K137K365J1109j2614j8348
17749c2426L237J1326l612m527j300J7799k116L446k88M669q169K3935q858J2816
17735A5932R416J7925J5621n968m0334l0417j0874K3259K254l545j1259N11J1402
$$ plain form
17831 6160 -414 9563 27269 20225 9389 427 4245 20864 31289 32155 34490 17348 10844 9943
17817 9943 -3726 -16110 -11938 1032 5003 -10351 18697 14369 1579 11588 17531 25518 17301
17804 17301 4386 5633 7165 8166 12116 12009 19393 8933 24490 25168 2870 -8261 -2267 -20125
17790 -20125 -20224 -18427 -15345 -2148 -1288 -17358 -18211 -6669 8554 10547 5544 12131 35953 40448
17776 40448 17675 9311 -10084 -1190 -5232 -19990 -24631 -11263 -22565 -23503 -14740 -8302 -19169
17763 -19169 -19579 -19183 -984 340 -26233 -28568 -26746 -28128 -17075 -14938 -12573 -1464 -14078 -32426
17749 -32426 -29189 -17863 -21475 -26002 -27302 -9503 -11619 -8173 -8461 -3792 -11961 11974 3116 15932
17735 15932 25348 43273 58894 52926 12592 -17825 -28699 -5440 -3186 -6731 -17990 -17479 -6077
17722f077J5606j7873k572L595J614j454l902N960J6920j239K34K903j6022J7604
17708A5297J8461k8940k7222n213J8043J2501J5644O722R890j0396m1323p868
17696b4404M782J0763J5600Q515m630j7909J6214K0954k6256j8268Q516r074n483
17683b0680L963J466Q708N27J357j4316j6263L416K967M007Q484J4385J9965J2675
17669C0661P49j919j0058m855K3778j6439j4633j2561j9912k807K454l456J198
17656b7800Q361J8934J6864k3486r828J8473j269k3368P332K7553n845j4182l264
17643a1525J7706q751j0567j0610n184q421N557O403Q051K4733j2381j5285j0623
17630c0897j6551q876K3348L7288j584l4071l822Q02j0495p967K4485K0802k0123
$$ plain form
17722 -6077 9529 -8344 -10916 -7321 -5707 -7161 -11063 -5103 11817 10578 10812 13715 -2307 15297
17708 15297 33758 4818 -22404 -27617 -9574 2927 18571 25293 35183 24787 -16536 -24404
17696 -24404 -19622 -8859 6741 15256 10626 -7283 8931 29885 3629 -14639 -6123 -15197 -20680
17683 -20680 -16717 -15251 -6543 -6016 -4659 -18975 -35238 -31822 -28855 -24848 -16364 -1979 17986 30661
17669 30661 31410 29491 19433 14578 38356 21917 7284 -5277 -25189 -27996 -25542 -28998 -27800
17656 -27800 -19439 -505 16359 -7127 -16955 1518 249 -23119 -15787 11766 5921 -8261 -11525
17643 -11525 6181 -2570 -13137 -23747 -28931 -37352 -31795 -25392 -17341 7392 -4989 -20274 -30897
17630 -30897 -47448 -56324 -32976 4312 2728 -31343 -35165 -34363 -44858 -52825 -28340 -7538 -27661
17617b7661j1840L112L192N022J6063J4184Q226Q37Q151Q531p862l6625k1010
17604c7680j8441j4196j0111J4773L7039J1136p389P289J260o846J3318K602j4145
17591b1391o48K1358J4153M515q471r41O93j2830j9796o470Q209P024p685J2338
17577i942J688J4204J1162J055o064j3240p013R136K2441J512L839j5970k2491
17564i683J4271L258J981J1168p223j3509r521q366L580K231M849o314R814j8509
17550b1973q528L813J5238J7488k873k2364l9502m836M524j724P353l794R903
17537d7275P993L898J0938K2975j04p552N14J7028O437n496M631R80m337j5471
17523d841N490O702o537J6767K5877N302P482l3319k7590n31k353Q102J3247N832
$$ plain form
17617 -27661 -39501 -36389 -33197 -28175 -12112 2072 10298 11135 19286 27817 19955 -16670 -37680
17604 -37680 -56121 -70317 -80428 -65655 -28616 -17480 -24869 -17580 -16320 -23166 -9848 -7246 -21391
17591 -21391 -22039 -681 13472 17987 9516 8575 9268 -3562 -23358 -29828 -21619 -14595 -22280 -9942
17577 -9942 -8254 5950 17112 18167 12103 -1137 -8150 986 23427 24939 28778 12808 -9683
17564 -9683 4588 7846 9827 20995 13772 263 -9258 -17624 -14044 -11813 -6964 -13278 -3464 -21973
17550 -21973 -30501 -26688 -11450 6038 3165 -19199 -58701 -63537 -59013 -60737 -53384 -57178 -47275
17537 -47275 -39282 -35384 -24446 -1471 -1575 -9127 -8613 8415 14852 9356 13987 14967 10630 -4841
17523 -4841 649 7351 814 17581 43458 48760 56242 22923 -4667 -5198 -7551 551 13798 19630
17509A9630k0668k9190L856J6576M789j005k6293j6717K3236K292j1478J5507
17497a9465J1738N839j932J2929R350k5462Q558P287j8201J3274k762n269O007
17484A891j685l661j9247P760o026J0767J9967l288j3739n438j0688j49M979j5448
17470c4005M137O499k211L821K229p548m159j4575J6340K4152J0631r610n071
17457i370l827j0373O554J3987J030j0262L711j6263l346M452J843r622K758Q920
17443a9808M933K2297N2620M3934L4120o888l4305l1772l8164j5572j5182J0715
17431F928j1897K0489k265l2918q827p584r919K0166K3671k3939O480K4796K206
17418G387J6650K563j3060j0731J2323J2396m156j3845R498L1219k4094M731L051
$$ plain form
17509 19630 -1038 -30228 -26372 -9796 -5007 -6012 -32305 -49022 -25786 -23494 -34972 -19465
17497 -19465 -7727 -1888 -3820 9109 18459 -7003 1555 8842 -9359 3915 1153 -4116 1891
17484 1891 206 -3455 -22702 -14942 -20968 -10201 9766 6478 -7261 -12699 -23387 -23536 -18557 -34005
17470 -34005 -29868 -23369 -25580 -21759 -19530 -27078 -31237 -45812 -29472 -5320 5311 -4299 -9370
17457 -9370 -13197 -23570 -17016 -3029 -1999 -12261 -8550 -24813 -28159 -23707 -21864 -31486 -28728 -19808
17443 -19808 -14875 7422 60042 103976 138096 131208 96903 65131 26967 11395 -3787 6928
17431 6928 -4969 15520 13255 -19663 -28490 -36074 -45993 -25827 -2156 -26095 -19615 5181 7387
17418 7387 24037 26600 13540 2809 15132 27528 23372 9527 19025 50244 26150 30881 33932
17405C3932j5543j0253j3125J3336Q977J5187j5163l0930j0626j4448J0077N556
17393b3023J2453J4038M828k8849n314J495J2232J4134j1013j589L3057J199k8252
17380d604J2059J529J141j090m93p56j2772j9132R839n824L477J9102K2447j1141
17366A3782j0612J114J048j9779k490Q377J4497K2196q234k569p07J262R40J0291
17352B9116k994p898P790p006r360K811k5771L545L0671q355j0077J754j477R668
17338A2417J868j5559R239j7071k2408K3248K3605R419k2049j5691M461K0844
17326A2323l365j8977K94Q284N784m984n232J0426r844j3322k159l677N478l950
17312b2921K1031J1011j7864o315J147R892j4746Q760J2629R489J7369Q51j4975
$$ plain form
17405 33932 18389 8136 -4989 8347 17324 32511 17348 -13582 -24208 -38656 -28579 -23023
17393 -23023 -10570 3468 8296 -20553 -25867 -24372 -12140 1994 -9019 -10608 22449 23648 -4604
17380 -4604 7455 8984 10125 9035 8542 7786 -4986 -24118 -14279 -20103 -16626 2476 24923 13782
17366 13782 3170 4284 5332 -14447 -16937 -8560 5937 28133 19899 17330 16623 17885 18825 29116
17352 29116 26122 18224 26014 19008 9648 12459 -13312 -9767 20904 12549 2472 4226 2749 12417
17338 12417 14285 -1274 7965 -9106 -31514 -8266 15339 24758 2709 -12982 -8521 12323
17326 12323 8958 -10019 -9725 -1441 4343 -641 -5873 4553 -5291 -18613 -20772 -24449 -18971 -22921
17312 -22921 -1890 9121 -8743 -15058 -13911 -4019 -18765 -10005 2624 12113 29482 30333 15358
17299A5358k696j1058j5405J1973O203j1954J945J8194r144p803J955k2000Q300
17286a6132K2737m428Q488j1968j4240K5739J3616K0017R448p682k4104j2078
17274I413j6614j8757K4431J576P331J1698j0581j1134j1234M267K1792J8693
17262C0881N916j7144j658j4126r098k524J350K3538O744j6743j1255P143N453
17249H477R637j0000k7809j8092J1253P109O311K106n301J0134J6059K388n406
17236F866m898J2944O624k2971L172J8174j6220j4125r94j7850J696K3935J0689
17223G042j2085l6296j7059K5195J4922j3812j2538K6579L1710j7273Q212K6630
17211C1227j8700j4340n612k0100P416J1792J2359M234r048J5401J2092O540l8626
$$ plain form
17299 15358 12662 1604 -13801 -1828 4375 -7579 -5634 12560 3416 -4387 -2432 -24432 -16132
17286 -16132 6605 2177 10665 -1303 -15543 10196 23812 43829 53277 45595 21491 9413
17274 9413 -7201 -25958 -1527 49 7380 19078 8497 -2637 -13871 -9604 12188 30881
17262 30881 36797 19653 17995 3869 -5229 -7753 -6403 17135 23879 7136 -4119 3024 8477
17249 8477 18114 8114 -19695 -37787 -26534 -19425 -13114 -11008 -16309 -6175 9884 12272 6866
17236 6866 1968 14912 21536 -1435 1737 19911 3691 -10434 -11428 -29278 -27582 -3647 7042
17223 7042 -5043 -41339 -58398 -33203 -18281 -32093 -44631 -18052 13658 -3615 4597 31227
17211 31227 12527 -1813 -7425 -27525 -20109 -8317 4042 8276 -772 14629 26721 33261 -5365
17198e365m705J0363O82p558q744n189j075J8497K5743m527j7190O738o798P0
17184I42j6296N974M554j4616j438L886N952N092J76m096K1660N726k1984m68
17170d936o982l659O816K769j280J6027K3279j6979j7542k0031j6499J7075L019
17157a8923J2310J1894J2213o142j8887J1132O315j5477j1233K2164j6686k6005
17145c7325m126J4043L0011J1963R668o075k2230P968K79k9213k2001J6703K8619
17132a716L2670K2430j4205l4989J356l381J705M422q303k791P315k602P214m159
17118D966r111j4102M013K8464N448k0201k4586j4572J0233J837J5684L2356P807
17105B8236l48K115m941j5927N22l196N924k0061r954l400j929P773J6594J7988
$$ plain form
17198 -5365 -10070 293 975 -6583 -15327 -20516 -21591 -3094 22649 18122 932 7670 872 942
17184 942 -15354 -9380 -4826 -19442 -20880 -16994 -11042 -5950 -5774 -9870 11790 17516 -4468 -4936
17170 -4936 -11918 -15577 -8761 -5992 -7272 8755 32034 15055 -2487 -22518 -39017 -21942 -18923
17157 -18923 -6613 5281 17494 11352 -7535 3597 9912 -5565 -16798 5366 -11320 -37325
17145 -37325 -41451 -27408 2603 14566 24234 18159 -4071 3897 4176 -25037 -47038 -30335 -1716
17132 -1716 30954 53384 39179 4190 5546 2165 3870 8292 -11 -2802 4513 1911 9125 4966
17118 4966 -4145 -18247 -14234 14230 19678 -523 -25109 -39681 -29448 -27611 -11927 20429 28236
17105 28236 27888 30003 25062 9135 9657 6461 12385 -7676 -17630 -21030 -22959 -15186 1408 19396
17091A9396M665p833j4386N142j0921K31K992k009J8822K586N357P50p022q248
17077I522o965l45J2937R562j5578k3745M431N520Q045o424Q666J2330J5208M148
17063C7312j9945j280K594PM622p783n051p839k0263j5621L779J8037Q393q758
17049a1796K313j0646j8186m638J9578o969K993Q144J3999n620J0781n029M439
17036f37N406P536n146o704Q674j6543L26J0278j372l2830k7681R850j981q988
17022e9812j8168o554J2778J7466J5234P436o451M871J8968K1557l099Q53j2076
17009f997j5885l0214L393L3651P177l664L548l299l865J860N409J2766K1569
16996B5449k1019p067j785q307M434q18K611J4543R018n238k2575j2051L555J3276
$$ plain form
17091 19396 24061 16228 1842 6984 -3937 -3706 -714 -2723 16099 18685 24042 24792 17770 9522
17077 9522 2557 2212 15149 24711 9133 -14612 -10181 -4661 3384 -3040 5626 17956 33164 37312
17063 37312 17367 16087 18681 18688 23310 15527 10476 2637 -17626 -33247 -29468 -11431 -3038 -11796
17049 -11796 -9483 -20129 -38315 -42953 -23375 -30344 -27351 -19207 -5208 -10828 -47 -5076 -637
17036 -637 4769 12305 7159 455 9129 -7414 -7088 3190 1818 -31012 -58693 -48843 -50824 -59812
17022 -59812 -77980 -84534 -71756 -54290 -39056 -31620 -38071 -33200 -14232 7325 4226 5079 -6997
17009 -6997 -22882 -53096 -49703 -16052 -8875 -12539 -8991 -12290 -16155 -14295 -8886 3880 25449
16996 25449 4430 -2637 -4422 -12729 -8295 -9113 -6502 8041 17059 11821 -10754 -22805 -19250 -5974
16982e974K738J0759K1656O294k6495m1686n997K9859K8686N81Q272K139j8232
16969A2600l2787o527J7197R584J6326J0966l640p991k1913k1718q389J9623Q160
16956h509Q460K3640K739j3037j0093J8172k9480m6475j0254K0264J8363k994
16944b9204P107J2365K4938m629j7675k4501r581K3881K6690o150J2058o017j0268
16931i86j8143k6523j6914O939J2572M499J8198J6236j1739J4887L397J953k5
16918D351j8712l8402m281J7502J6150N001Q225J1163J3244J2921J3338k339j3523
16905B4638k1617L067J8105n356q78l238K142N591m877N966k7242l1670R367J4328
16891a1674J6884j1842J0324J9410k1703l7120m707j1675L4960K791o78K6292
$$ plain form
16982 -5974 -3236 7523 29179 35473 8978 -32708 -38705 -8846 19840 20421 28693 30832 12600
16969 12600 -20187 -26714 -9517 67 16393 27359 23719 15728 -6185 -27903 -36292 -16669 -8509
16956 -8509 -49 23591 26330 13293 3200 21372 -8108 -54583 -64837 -44573 -26210 -29204
16944 -29204 -22097 -9732 15206 10577 -7098 -31599 -41180 -17299 9391 3241 15299 9282 -986
16931 -986 -19129 -45652 -62566 -55627 -43055 -38556 -20358 -4122 -15861 -974 2423 4376 4351
16918 4351 -14361 -52763 -57044 -39542 -23392 -18391 -10166 997 14241 27162 40500 38161 24638
16905 24638 3021 6088 24193 18837 17959 14721 16863 22454 17577 23543 -3699 -35369 -26002 -11674
16891 -11674 5210 -6632 3692 23102 1399 -35721 -40428 -52103 -17143 -14352 -15030 11262
16879A1262j5397j0366R134k832l843J925J5464J2188j6730r802n16J0086j3114
16866a2541K344n427j3338k5802j6264K6818K2877J587J2619o996L88m941J693
16853a6983J2654l751q364k8482j2717J8113K8004K0206p038o240q626l270j7847
16840c4341m534J1837J2107q402o536O213q401M505l412J4092J6608k097m54J6134
16826A3319n619k6488m833P497N052N863m282Q510K471k0482J378j0684l137K0389
16812a1046j1542j0345m149K6606L319N591J3375J1740k592k3439m785k826r343
16799a9436J5254L894j7782J308K2405J329k6695m486J038r291J9590O634p635
16786a3873k4429j1177L7915R849q366N684L2604j397j0518p520o389O864j3096
$$ plain form
16879 11262 -4135 -14501 -5367 -8199 -12042 -10117 5347 17535 805 -8997 -9513 573 -12541
16866 -12541 -10197 -15624 -28962 -54764 -71028 -44210 -21333 -19746 -7127 -14123 -13735 -18676 -16983
16853 -16983 -4329 -8080 -16444 -44926 -57643 -39530 -11526 8680 1642 -4598 -13224 -16494 -34341
16840 -34341 -38875 -27038 -14931 -23333 -29869 -23656 -32057 -27552 -30964 -16872 -264 -2361 -2815 13319
16826 13319 7700 -18788 -23621 -16124 -11072 -5209 -9491 -981 1490 -18992 -17614 -28298 -31435 -11046
16812 -11046 -22588 -32933 -37082 -10476 -7157 -1566 11809 23549 20957 -2482 -7267 -10093 -19436
16799 -19436 -4182 -288 -18070 -16762 5643 6972 -19723 -24209 -23171 -32462 -12872 -6238 -13873
16786 -13873 -38302 -49479 -11564 -1715 -10081 -4397 28207 26810 16292 8772 2383 9247 -3849
16773c849j17K4904p540j1607O819K8178L173q630j4413k2331k8542k571M398
16760c2128m284q034J1467K6644J5316M083j3480j7280q483m492K879n307j6811
16747d9910l168O572J5708J1455m850J900j9613J8255J4997J3956o852p066n387
16734a4003j5261L046p818o397K878K2595J6125k580j9346k5237K5276J141J6176
16721c405K012l0157L583J5644R867k9947j2152j1674J1905M0731O092j7148k344
16708a6993j4128p30K9538L00r404k5596j5936k911l672J5593J819J489J6253
16695b4378K607r738R570O83R226R415J3388J0892k1651k8092l450j1315p505
16682e0348J1935J4099j982J6084o907J9393K2234j1433l70m960J292o792j4098
$$ plain form
16773 -3849 -3966 20938 13398 1791 8610 36788 39961 31331 16918 -5413 -33955 -36526 -32128
16760 -32128 -36412 -44446 -32979 -6335 8981 13064 -416 -17696 -26179 -30671 -27792 -33099 -49910
16747 -49910 -53078 -46506 -30798 -19343 -24193 -22293 -41906 -23651 -8654 5302 -1550 -8616 -14003
16734 -14003 -29264 -26218 -34036 -40433 -37555 -14960 1165 -1415 -20761 -45998 -20722 -19581 -3405
16721 -3405 -1393 -31550 -27967 -12323 -2456 -32403 -44555 -56229 -44324 -3593 2499 -14649 -16993
16708 -16993 -31121 -31851 -2313 -2013 -11417 -37013 -52949 -55860 -59532 -43939 -42120 -40631 -24378
16695 -24378 -21771 -31509 -21939 -21256 -12030 -2615 10773 21665 14 -28078 -31528 -42843 -50348
16682 -50348 -38413 -24314 -26296 -10212 -17119 2274 24508 13075 12705 7745 9037 2245 -11853
16669a1853l077k00K1956q386r855P246m057r407M928K728J467O010J9160N048
16655B1708J4230J3146q229j4030j712j2635j1045K858J2480K346j8712J2349
16643A2754o177Q28J0335k6784j6809O737O723j5230p345L2054K3344r52l5676
16630a6198j062J4675O202K9528q783j2461j1316j8566n004q249M799Q650j3367
16617c1152J2742J7558K151p785K950M497J2697o334k3631j432J0920O450j0293
16604a0662J798J5152J587p429J469j2734N55P381l462j4959K1521j589j3702
16591a5074r445K968Q410L692K0823Q541j5676j2395O672K614k2663k0233n600
16578d7366J4793p841j8874L196K7211J9024J0144j0918n912Q035k493o83Q617
$$ plain form
16669 -11853 -14930 -15130 6826 -1560 -11415 -4169 -8226 -17633 -12705 -9977 -8510 -2500 16660 21708
16655 21708 35938 49084 40855 26825 25113 12478 1433 4291 16771 19117 405 12754
16643 12754 6577 7405 17740 -9044 -25853 -19116 -12393 -27623 -34968 -2914 20430 19478 -16198
16630 -16198 -17260 -2585 3617 33145 24362 11901 585 -17981 -22985 -31234 -26435 -17785 -31152
16617 -31152 -18410 -852 1299 -6486 -3536 961 13658 7324 -16307 -17739 -6819 -369 -10662
16604 -10662 -8864 6288 7875 446 1915 -10819 -10264 -2883 -6345 -21304 217 -1372 -15074
16591 -15074 -24519 -21551 -13141 -9449 11374 19915 4239 -8156 -1484 1130 -21533 -41766 -47366
16578 -47366 -32573 -40414 -59288 -56092 -28881 -9857 287 -10631 -16543 -8508 -11001 -11684 -3067
16565c067J904n701M917K839K892P477J590j0240q458n460k905r418J6775r045
16551a5900o327j4176O910l338N266P301R961J7923j286j4670j0645J2366R821
16538C206J0595k4713K298J4596q450O340O560k6349j1735R047P434J7374L23
16525F526k3702o394R583O676j2276L767J127k916N628K1447k335l0433o019J2781
16511a6540R40q685K047k5430O240K1359j08J3025j630K986j652o936J8203L791
16497G610r22r83Q697N636j9364k3797L826j2222o482J3663K2044J3210J198j3627
16483a513n680r067L829J8803K283K793l6418l148O48J4140K039L242N671l918
16469f296p310k4339K182Q901J4549O58M046K9648J0143j128q159j2787q998J846
$$ plain form
16565 -3067 -1163 -6864 -1947 892 3784 11261 12851 2611 -5847 -11307 -14212 -23630 -6855 -15900
16551 -15900 -22227 -36403 -29493 -32831 -27565 -20264 -10303 7620 6334 -8336 -18981 -6615 3206
16538 3206 13801 -10912 -8614 5982 -2468 3872 10432 -15917 -27652 -18605 -11171 6203 6526
16525 6526 -17176 -23570 -13987 -7311 -19587 -15820 -14693 -17609 -11981 9466 7131 -23302 -29321 -16540
16511 -16540 -15600 -24285 -22238 -47668 -41428 -20069 -20177 -7152 -8782 -5796 -7448 -14384 3819 7610
16497 7610 6688 5705 14402 20038 674 -23123 -19297 -31519 -38001 -24338 -2294 10916 12114 -1513
16483 -1513 -7193 -16260 -12431 6372 8655 11448 -24970 -28118 -27470 -13330 -11291 -8049 -2378 -6296
16469 -6296 -13606 -37945 -35763 -26862 -12313 -11655 -7609 22039 32182 31054 22895 10108 1110 2956
16455B956O153R913j793J097L466j7016L223R788j8546M272l825r961J089O214
16441b970j2695p903L858J1801Q534K5450j4698k3004K334K419K764k964J781
16428e293j3788M800J8876R130K751j0773j3231j048Q310R727J2136m633o49j1886
16414D429j3958P686J201r334K7292m368j9766J9768L2251k8570j8469j0835M694
16401g979o423j980N242j4792O967k0102m551k30rJ7590J6550Q477N883j4777
16387a0134j696j2339k2858J3798J2169N316J6772q11J4263o944l3412j8681P457
16374c7100j0496P697l235J2142J2967J4714j2992P804L0302j268j7847k3944
16362b1256k235j8876L751J4007J7837j2398q204J6485J1457n518M21l997j5517
$$ plain form
16455 2956 9109 19022 17229 18326 21792 4776 7999 17787 -759 3513 -312 -10273 -9184 -2970
16441 -2970 -15665 -23568 -19710 -7909 625 26075 11377 -11627 -9293 -6874 -4110 -7074 -5293
16428 -5293 -19081 -14281 4595 13725 16476 5703 -7528 -8576 -266 9461 21597 16964 16315 4429
16414 4429 -9529 -1843 -642 -9976 17316 12948 -6818 12950 45201 16631 -1838 -12673 -7979
16401 -7979 -14402 -16382 -11140 -25932 -18965 -39067 -43618 -43848 -43857 -26267 -9717 -1240 4643 -10134
16387 -10134 -11830 -24169 -47027 -33229 -21060 -15744 1028 217 14480 7536 -25876 -44557 -37100
16374 -37100 -47596 -39899 -43134 -30992 -18025 -3311 -16303 -8499 21803 20535 2688 -21256
16362 -21256 -23491 -42367 -38616 -24609 -6772 -19170 -27374 -10889 568 -4950 -4529 -8526 -24043
16349b4043J973n188j4188j881J3968K1384J5100n372Q346o173j4303l966L356
16336a0987j3595J0381q321O769M2813O579n2831j0906j2563q620J7560K088Q187
16323b3446K435j9878M508J1722L829L548L0547o48j5883R91j7801r459L59K3936
16309e240L90J277J5033p393j4255k8653P555n709J2799K6261J1402o810j6678
16296a0021l4925q804J5324K0824J6374Q379j5254j4715L0513R044j1385Q680
16284A4034L218N999l661l5333j9304J6218K1389J528r858J3460j2288j9253K0176
16271c675J128l030j4145P50N02r01J7210M135Q328J5821j4839j9373m838n442
16257a8369p86j6222J9507K460j3474Q068K0765n681k644l903J9798k5134r190
$$ plain form
16349 -24043 -22070 -27258 -41446 -43327 -29359 -7975 7125 1753 10099 3926 -10377 -14343 -10987
16336 -10987 -24582 -14201 -22522 -15753 27060 33639 -19192 -30098 -42661 -51281 -33721 -31633 -23446
16323 -23446 -21011 -40889 -36381 -24659 -20830 -17282 13265 12617 -3266 -2275 -20076 -29535 -29176 -5240
16309 -5240 -4850 -3573 11460 4067 -10188 -38841 -31286 -36995 -24196 2065 13467 6657 -10021
16296 -10021 -44946 -53750 -38426 -17602 -1228 7151 -8103 -22818 7695 16739 5354 14034
16284 14034 17252 23251 19590 -15743 -35047 -18829 2560 4088 -5770 7690 -4598 -23851 -3675
16271 -3675 -2547 -5577 -19722 -18972 -18470 -19371 -2161 1974 10302 26123 11284 -8089 -12927 -18369
16257 -18369 -19155 -35377 -15870 -13410 -26884 -18816 1949 -3732 -6376 -10279 9519 -15615 -24805
16244b4805J5340Q8J0032J959q302M87P359p74J963j5256r845L950Q690K736Q938
16229B560J1764J3225O00r295j0135q13n419L31j5353j9434j4311J7638M5958
16216A7316R016j7774q621K730J0817J10j2285j8667M036J3550j2486k6452Q960
16203b9750J8726N019j2273J153K816J692k2802L716J9615j780m933j3038m9M987
16189b6901m68j2687J5939j096j3496L406J4296O493j1429M712J9767R39r148
16176i673q159m274L0296J5202j4125k6529j382L178j0842q416p564K2824J8434
16163a030l003R07J5475Q716j2016j0790M793K2429J0994k9025k8822j0465O48
16150c1189J6600M370L909j081M009l906P34p486R395M915j2442q410n560M719
$$ plain form
16244 -24805 -9465 -9377 655 2614 -5688 -5201 2158 1384 3347 -11909 -21754 -17804 -9114 -6378 2560
16229 2560 14324 27549 28149 18854 8719 7906 2487 2818 -12535 -31969 -46280 -28642 17316
16216 17316 26332 8558 -63 2667 13484 13594 1309 -17358 -13322 228 -12258 -38710 -29750
16203 -29750 -11024 -6005 -18278 -17125 -14309 -12617 -35419 -31703 -12088 -13868 -18801 -31839 -31888 -26901
16189 -26901 -27369 -40056 -24117 -25213 -38709 -35303 -21007 -14514 -25943 -21231 -1464 -525 -9673
16176 -9673 -17832 -22106 8190 23392 9267 -17262 -18644 -15466 -26308 -34724 -42288 -19464 -1030
16163 -1030 -4033 -3126 12349 21065 9049 -1741 3052 25481 36475 7450 -21372 -31837 -31189
16150 -31189 -14589 -10219 -6310 -7391 -3382 -7288 -6554 -14040 -4645 270 -12172 -20582 -26142 -21423
16136b1423N879J9010J633J376j1889m726j82J3975P275k4113l2141j6058O361
16123e5023K8864P64K266R273J836j475n64o953M467K9078l255k7760k0318J3866
16109b4934K8939K5595P35o904k654m229q058k9476j4797J94J4489J6000o016
16096a1116o789K95k433j0557J5688j689K283R622J8104j3194M701J913J2359
16083A9187Q817k406j5300p380j2795q269j0069J542J8379J4952Q974j4313N782
16070G101J7729l6947j5196j0633J4585K5819J808j2380k121R584j4499r160P113
16057a7197J9167P097K440M317n228o668k5185n48K2770j5734L026L3753p5m650
16043A7285l372k095q272j7355k2320J3018R419j3487J0962L6133L023q655q487
$$ plain form
16136 -21423 -15544 3466 5099 6475 -5414 -10140 -10322 3653 10928 -13185 -45326 -61384 -55023
16123 -55023 -26159 -25395 -23129 -13856 -12020 -13495 -14059 -21012 -16545 12533 9278 -18482 -38800 -24934
16109 -24934 4005 29600 30335 23431 20777 16548 8490 -20986 -35783 -35589 -21100 -5100 -11116
16096 -11116 -17905 -17610 -20043 -30600 -14912 -16601 -14318 -4696 13408 214 4915 6828 19187
16083 19187 28004 25598 10298 2918 -9877 -18146 -28215 -26673 -8294 6658 15632 1319 7101
16070 7101 24830 -12117 -27313 -37946 -23361 2458 4266 -8114 -10235 -651 -15150 -24310 -17197
16057 -17197 1970 9067 11507 15824 10596 3928 -21257 -21805 965 -14769 -11743 22010 21935 17285
16043 17285 13913 11818 3546 -13809 -36129 -23111 -13692 -27179 -16217 19916 22939 14284 5797
16030E797J2072q880J6120o5m0990m340O479J1288l03j7714K710J7876r833r54
16016a0737K1174j862J337P889q560j1676n995O447k1200j767k97R926R718N338
16002b65j6755j1615J5764L1368R689j7439N868K616k3548j5630O992R017K4105
15989B0167r231n814N176Q88R59j1582K202O176K341p696j3116j7332k360K5925
15975c297k502k58k62Q978o509k219O946r144j0411k3462O993J5347O235j237
15961a4802j0722P542N673L645o927K4366K3582K0688L568k7804l6474k821K2611
15948A2125J1290k1097k9323k0908o576m339J4778P927j3163n249J1134J8182
15936b5219P055j068O417P781J1601j3830N835M694Q804m852n142l0010o91O612
$$ plain form
16030 5797 17869 8989 25109 25044 -15946 -20286 -13807 -2519 -2822 -20536 -17826 50 -9783 -10737
16016 -10737 10437 8575 9912 17801 9241 -2435 -8430 -1983 -23183 -24950 -25247 -15321 -5603 -265
16002 -265 -17020 -28635 -12871 18497 28186 10747 16615 19231 -4317 -19947 -12955 -3938 20167
15989 20167 10936 5122 10298 11186 12145 563 2765 8941 11282 3586 -9530 -26862 -29222 -3297
15975 -3297 -5799 -6057 -6319 2659 -3850 -6069 877 -8267 -18678 -42140 -35147 -19800 -13565 -14802
15961 -14802 -25524 -17982 -12309 -8664 -15591 8775 32357 53045 56613 28809 -7665 -10486 12125
15948 12125 23415 2318 -27005 -47913 -54489 -58828 -44050 -36123 -49286 -54535 -43401 -25219
15936 -25219 -18164 -19232 -12815 -5034 6567 -7263 -1428 3266 12070 7218 2076 -27934 -28625 -22013
15922b2013J9822J4358k2708j9444q77j774j0298n956J2533J3875j4578k0604
15910e7664J5922K8773J8466R699j3011j6564j4436J0291J7741j1472k9002J3163
15898b8094J0619j2288Q790M510J6521n812o048n47p728r408q813J919K1283J3287
15884a809P905K568p156j0656O293j1121k3494P480N463k791n341R834L2817J3189
15870B3181j6066l0076k4046r982J8685K1839R26Q360J0274J0947K16K041J4137
15857C0436j2274m308k3698k1082N907J9026P484L054k4211j5306K542R028J2039
15844a1363J7760K868N607j2525Q54J3792k5822k9523R785K4102N652J2914r950
15831D151n07l962J0044N691p479j9799n56m679L494K0026K121j5994L498K6622
$$ plain form
15922 -22013 -2191 12167 -10541 -29985 -30862 -32636 -42934 -48890 -36357 -22482 -37060 -57664
15910 -57664 -41742 -12969 5497 15196 2185 -14379 -28815 -18524 -783 -12255 -41257 -28094
15898 -28094 -17475 -29763 -20973 -16463 58 -5754 -11802 -12349 -20077 -29485 -38298 -36379 -15096 -1809
15884 -1809 6096 8664 1508 -9148 -2855 -13976 -37470 -29990 -24527 -27318 -32659 -22825 9992 23181
15870 23181 7115 -22961 -47007 -56989 -38304 -16465 -15539 -7179 3095 14042 14258 16299 30436
15857 30436 18162 13854 -9844 -30926 -25019 -5993 1491 4545 -19666 -34972 -32430 -23402 -11363
15844 -11363 6397 9265 14872 2347 3201 16993 -8829 -38352 -28567 -4465 1187 14101 4151
15831 4151 3644 -318 9726 15417 7938 -11861 -12417 -17096 -13602 6424 8545 -7449 -3951 22671
15817B2671k209q190k1899j2208J2461R083j0498j0154J1125j716q941j755R102
15804a3128J6080K3450k8849j1355O739N464J4806J457q430K931K957K002P067
15791B1191j6164l4317q871Q88M384j802K0746L946m964N426K1650J8881k3040
15778G954k8943p487j6373j765P802J989K297K265J1490J0508j246J8156N622
15765A2269n570k2482J2977o899L330j6851M141K7171j3470k880j420J5199p62
15752D753j1855j2200J0374J0709p321r177J2731j078j7831k2127j7265K984J3690
15739d3613K3242J7716k3871L667J3270K3444r42k0001o312K3469p311k3562o046
15726b6850J9984K6118L611O156n524j5339j4951J6617O537J5713r242r901K117
$$ plain form
15817 22671 20462 12272 -9627 -21835 -9374 -291 -10789 -20943 -9818 -11534 -20475 -22230 -13128
15804 -13128 2952 26402 -2447 -13802 -7063 -1599 13207 14664 6234 9165 12122 14124 21191
15791 21191 5027 -29290 -38161 -37273 -32889 -34691 -13945 -9999 -14963 -9537 12113 30994 7954
15778 7954 -20989 -28476 -44849 -46614 -38812 -36823 -34526 -32261 -20771 -10263 -11509 6647 12269
15765 12269 6699 -15783 -2806 -9705 -6375 -23226 -19085 8086 -5384 -8264 -9684 5515 4753
15752 4753 -7102 -19302 -8928 1781 -5540 -14717 -1986 -3064 -20895 -43022 -60287 -57303 -43613
15739 -43613 -20371 -2655 -26526 -22859 -9589 13855 12913 -7088 -13400 10069 2758 -20804 -26850
15726 -26850 -6866 19252 22863 29019 23495 8156 -6795 9822 16359 32072 22830 12929 15046
15713A5046M094j7136P102k07o24R142j3131l0424K2387J8838P445j3802j3419
15700d689j1209N965O272K763J0291J4412m459j190k268r733p818l1709p223j597
15686d2192K2522L1308J391J305r250o571j4455j650j3023L096K7887J9738N877
15673B5983r296l6913M584J9658J6326j688j0048j3673j0169n751Q10J4688n968
15660a1457J9225m59j3274M249k61j1668J1500n763J9771p906j6652q281O676
15647a4300M743J3057N584j6625j8449O439R097J2343J4352j4169j3305j2062
15635b3295N558R612r404K0419j6281p814j6682j5002p303P692j630j811O594
15622d9347L124M126j5585o548K9273j5387J0244J5231n569M379J2633J342R143
$$ plain form
15713 15046 19140 2004 9106 8899 8275 17417 4286 -26138 -3751 15087 22532 8730 -4689
15700 -4689 -15898 -9933 -3661 -898 9393 23805 19346 18156 15888 6155 -1663 -33372 -40595 -42192
15686 -42192 -19670 11638 13029 14334 5084 -1487 -15942 -17592 -30615 -27519 368 20106 25983
15673 25983 16687 -20226 -15642 4016 20342 18654 8606 -5067 -15236 -20987 -20177 -5489 -11457
15660 -11457 7768 7309 -5965 -1716 -1977 -13645 -2145 -7908 11863 3957 -12695 -20976 -14300
15647 -14300 -9557 3500 9084 -7541 -25990 -19551 -10454 1889 16241 2072 -11233 -23295
15635 -23295 -17737 -8125 -17529 2890 -13391 -21205 -37887 -52889 -60192 -52500 -54130 -55941 -49347
15622 -49347 -46223 -42097 -57682 -64230 -34957 -50344 -40100 -24869 -30438 -26059 -13426 -12084 -2941
15609b941K944n266l34k2732j3002j197Q617k559J1083J2061J3102j1694m769
15596a6687J1883J7938l213k149k058K2316J852p924j59r136j7830j6584j1722
15583c3473J2411m650P538M436J8192l700j8265J686K2046j0059j4483R837P492
15570i92j1111j7771Q296J4121q074J117j1949J0479j9944p333O734l15m578L054
15556c8266Q99l235o03Q008K1024K7959R500j9508l284J0655n464p013j2925j1718
15542b3971J1967o166q056m328O264L665l429J1939P533K962r971K2602J3378
15529B4389n188j2345j2613n230j4115o717l544J9269J4341j5336n422o040J538
15516b7013K2948K680j2880m621n978j0127K5438R459k9018r149J0470J3313M271
$$ plain form
15609 -2941 3 -5263 -5597 -28329 -41331 -42528 -33911 -36470 -25387 -13326 -224 -11918 -16687
15596 -16687 -4804 13134 9921 7772 5714 28030 29882 21958 21799 12663 -5167 -21751 -33473
15583 -33473 -21062 -25712 -18174 -13738 4454 754 -17511 -15825 6221 -3838 -18321 -8484 -992
15570 -992 -12103 -29874 -21578 -7457 -15531 -14414 -26363 -15884 -35828 -43161 -36427 -36742 -41320 -38266
15556 -38266 -37367 -40602 -41205 -33197 -12173 15786 25286 5778 2494 13149 7685 672 -12253 -23971
15542 -23971 -12004 -18170 -26226 -30554 -24290 -20625 -24054 -12115 -4582 -1620 -11591 11011 24389
15529 24389 19201 6856 -5757 -10987 -25102 -31819 -35363 -16094 -1753 -17089 -22511 -28551 -27013
15516 -27013 -4065 -1385 -14265 -18886 -24864 -34991 -9553 -94 -29112 -38261 -27791 -14478 -10207
15503a0207O984j2698j0183J6022K162j6084k083K7625p994M717M367N660J9204
15490B7492j3854q204j9333l006j0249j0859L921J4513K584k0280J0076M187j0293
15477c3305N17L060L3385o981R0N461p236Q011k9328J2233J7109m214K946j6369
15463a4621l1692O047M266J3827J8087j0361n729J8720j5861j122r610j6806o412
15450e1267p330j904J9830J7207J4958J2665P047j692k5214L550J6739k190L029
15437E428l051k2126l60k3943Q464K5921l021o990j366J375L244l819J0274k53
15423a0223O939m348N10r29J456J1344l609L743j0141l218J2547k902r955m0K339
15408f487Q068q854R788o023p17J8878R248q213j7743l606j4586J5744J5567l867
$$ plain form
15503 -10207 -3223 -15921 -26104 -10082 -7920 -24004 -26087 1538 -6456 -1739 2628 8288 27492
15490 27492 13638 5434 -13899 -16905 -27154 -38013 -34092 -19579 -16995 -37275 -27199 -23012 -33305
15477 -33305 -32788 -29728 3657 -3324 -3234 2227 -5009 3002 -26326 -14093 3016 -1198 1748 -14621
15463 -14621 -46313 -40266 -36000 -22173 -4086 -14447 -20176 -1456 -17317 -18439 -28049 -44855 -51267
15450 -51267 -58597 -60501 -40671 -23464 -8506 4159 11206 9514 -15700 -12150 4589 2399 5428
15437 5428 2377 -19749 -20109 -44052 -35588 -9667 -12688 -19678 -21044 -19669 -16425 -20244 -9970 -10223
15423 -10223 -3284 -7632 -7122 -8051 -6595 4749 1140 4883 -5258 -8476 4071 1169 -8786 -8826 -6487
15408 -6487 1581 -7273 2515 -3508 -4225 14653 23901 15688 -2055 -5661 -20247 -4503 11064 7197
15394G197M707p641k2658r694m290J9221N872n539Q360K7115j0541k2085j934
15381a1910J0667l373L2614N847j5988j1463j1677j6653O074J6031K018j1158
15369h971j848R668N687j479Q456J5271o967j6522n253o819j811j3257L504J2499
15355g842J0777q43J0068K6143l093q852K2996K4855k7087l5881j7299J2157R182
15342A5281R371p72k586Q865j0116K757N310j0379j1989l751j686j0394j8406
15329b8495J1823Q618k3282j5195K668P047K3381p902J5741J4002J6589j0638
15317A4357k1979l838j322L588L981q034J204j0898j1560J1821K2730j2062k6747
15304c8759P924L5223J2005r559j087j2312k291J9738J6329r33l9380o585N065
$$ plain form
15394 7197 11904 4263 -18395 -28089 -32379 -13158 -7286 -12825 -4465 22650 12109 -9976 -11910
15381 -11910 -1243 -4616 27998 33845 17857 6394 -5283 -21936 -15862 169 2187 -8971
15369 -8971 -10819 -1151 4536 3057 11513 26784 19817 3295 -1958 -8777 -10588 -23845 -20341 -7842
15355 -7842 2935 2092 12160 38303 35210 26358 49354 74209 47122 11241 -6058 6099 15281
15342 15281 24652 23880 21294 30159 20043 22800 28110 17731 5742 1991 305 -10089 -28495
15329 -28495 -16672 -8054 -31336 -46531 -43863 -36816 -13435 -21337 -5596 8406 24995 14357
15317 14357 -7622 -11460 -12782 -9194 -5213 -13247 -12043 -22941 -34501 -22680 50 -12012 -38759
15304 -38759 -30835 4388 16393 6834 5747 -6565 -8856 10882 27211 26278 -13102 -19687 -14622
15291a4622O426R005M434P705p603k1028l928J7159l484K560K0814J054j0668
15278G824o540m64q177q526J9211l377j092j361J8118J4876m919m6083k8167j6033
15264f4710J6341J6289m14J1765o38J495K7862n733k5237j3018k043j2236k2623
15251g2900L69K8420J6385M401j0071k0413J0556r9Q727m985M573L8951L1358
15238C5272P276j6422k6717j3166k369J3557J7050j849k0783k3291R553J4772
15226g117j6668M438J7493J4392k3619l476j297Q545p533R10K744J1445r243m114
15212a3100O993m490O496Q46q959j3515j0485l012J5410M89j1653Q246L4879K650
15198A0795k834l1238l0313R716N120j7146J3400R871Q300O958m391j5484J0042
$$ plain form
15291 -14622 -8196 809 5243 12948 5345 -15683 -19611 -2452 -5936 -3376 17438 18492 7824
15278 7824 1284 820 -7357 -15883 3328 -49 -1141 -2502 15616 30492 25573 -20510 -48677 -64710
15264 -64710 -48369 -32080 -32494 -20729 -21367 -19872 7990 2257 -22980 -35998 -38041 -50277 -72900
15251 -72900 -72531 -44111 -27726 -23325 -33396 -53809 -43253 -43352 -34625 -39610 -35037 3914 35272
15238 35272 42548 26126 -591 -13757 -16126 -2569 14481 12632 -8151 -31442 -21889 -7117
15226 -7117 -23785 -19347 -1854 12538 -11081 -14557 -15854 -7309 -14842 -13932 -11188 257 -8986 -13100
15212 -13100 -6107 -10597 -4101 -3255 -12214 -25729 -36214 -39226 -23816 -23327 -34980 -26734 8145 10795
15198 10795 7961 -23277 -53590 -43874 -38754 -55900 -42500 -32629 -24329 -17371 -21762 -37246 -27204
15185b7204P87K3152q622M035N63r780j1848r115L634J9307o816j9925K1263Q885
15171a1684k934k4224J6269J4225Q959J7173k3154j0814j0952j904p194P761L0915
15158B442M745J5064j3397q311r893l16q058M166k37J6978M579p98J8862q857
15144A6969k5981j9838Q283M08J0261K829J1156O590m321k3539o043R291J7087
15131C152j738j2096n054k228R782p923l1037n148J0370K3854K7754J8096J943
15118B9727k6011k5230j0092L544K2890K3457J6370k7305k0604n364k684J1403
15106i899R778K729J7805l70k2025k4527K026L869r462J7920J194p510k891K727
15092a8636n756L055j815m724L614o494R297K2048o013P498p205L681p433J143
$$ plain form
15185 -27204 -26417 -3265 -11887 -7852 -7289 -17069 -28917 -38032 -34398 -15091 -21907 -41832 -20569 -11684
15171 -11684 -14618 -38842 -22573 -8348 611 17784 -5370 -16184 -27136 -29040 -36234 -28473 2442
15158 2442 7187 22251 8854 543 -9350 -9666 -17724 -13558 -13795 3183 7762 6964 25826 16969
15144 16969 -9012 -28850 -20567 -20159 -9898 -7069 4087 10677 6356 -17183 -23226 -13935 3152
15131 3152 1414 -10682 -15736 -17964 -8182 -16105 -47142 -52290 -41920 -18066 9688 27784 29727
15118 29727 3716 -21514 -31606 -28062 -5172 18285 34655 7350 -13254 -18618 -21302 -9899
15106 -9899 -121 2608 20413 20043 -1982 -26509 -24483 -20614 -30076 -12156 -10962 -18472 -21363 -18636
15092 -18636 -24392 -21337 -23152 -27876 -24262 -30756 -21459 589 -5424 2074 -5131 -1450 -8883 -7740
15078g740K2692k92j4526l1138J964K6220K6147L0881p856j4878q833L33k1360
15065A614j1821P573R907J429r010o116J610j3659j3003K5033L154J5662L432
15052A5805j0185r102k0563l121O171j201j9947j1758m759J0008J7281J9921P640
15039c810k8725j5687J9547j540l310n203j3778k239J1258K7238K4235j6677p562
15026a6253P205l391j0661l919m504R884K7999J3101j378j8494j0766j544J1070
15013a651L2098l524k1988j216J261J9738j1183j4909j6817o238j6493j6921J1475
15000d6368R841J0119P976J3513J8077J1918J7121o87L0985Q8938J07374J21386
14988C90193P4998j1300j06083j21491o4626l1245j9010k6563k7127K836o04O188
$$ plain form
15078 -7740 14952 14660 134 -31004 -29040 -2820 23327 54208 46352 31474 22641 22974 1614
15065 1614 -10207 -2634 7273 8702 -308 -6424 -4814 -18473 -31476 -6443 -3289 12373 15805
15052 15805 5620 -3482 -24045 -27166 -20995 -22196 -42143 -53901 -58660 -48652 -31371 -11450 -3810
15039 -3810 -32535 -48222 -28675 -30215 -33525 -38728 -52506 -54745 -43487 -16249 7986 -8691 -16253
15026 -16253 -9048 -12439 -23100 -27019 -31523 -21639 6360 19461 18083 -411 -11177 -12721 -1651
15013 -1651 30447 26923 4935 3719 4980 24718 13535 -1374 -18191 -24429 -40922 -57843 -46368
15000 -46368 -36527 -26408 -18432 -4919 13158 25076 42197 41510 72495 161433 268807 390193
14988 390193 465191 453891 347808 226317 161691 130446 111436 84873 57746 60582 59978 66166
14976F6166j8153l3893p965j1602q719O895j907P761J2377o781N808M984R240
14963B4211j5325j1941m151J2509J147J1315k4080J320R18L703j0778K489N566
14950c097k100J7408n416j1881J4830m663o23N461K8627M264j6775j8169q264
14937c98P751L20j3776q994k201o146j251J1840K3527n59k5468j1185N373P268
14923a3899J9466K677j2982q769J811p213O158o927p122J8383J3232j9390o144
14910b0719L747J7690Q295j0507J3723J6677j191j6833o505J0937R734j5406N45
14897A0187p495L08P235J5367m496R083l823l34j3786M152p426j7398k2924J1279
14883b0071J5658J1876j042J1533L040j8937N302j1004l388O757l0k3790n133
$$ plain form
14976 66166 48013 14120 6155 -5447 -14166 -7271 -9178 -1417 10960 4179 9987 14971 24211
14963 24211 8886 -3055 -7206 5303 6450 17765 -6315 -4995 -4077 -374 -11152 -8663 -3097
14950 -3097 -5197 12211 6795 -5086 9744 5081 4458 9919 38546 42810 26035 7866 -398
14937 -398 7353 7673 -6103 -15097 -17298 -23444 -24695 -12855 10672 10113 -15355 -26540 -21167 -13899
14923 -13899 5567 8244 -4738 -13507 -11696 -18909 -12751 -19678 -26800 -8417 4815 -14575 -20719
14910 -20719 -16972 718 9013 -1494 12229 28906 27715 10882 4377 15314 25048 9642 10187
14897 10187 2692 3000 10235 25602 21106 30189 26366 26032 12246 16398 8972 -8426 -31350 -20071
14883 -20071 -4413 7463 6421 17954 20994 2057 7359 -3645 -7033 -276 -306 -24096 -29229
14870b9229O32Q821J3972J4610P590j6048j1356l475l409R811p044P360J3302
14857E537n954j1943q706n40j816k853l1602J0448K3362o708K128M503O291Q788
14843i065J8871J482K262j0437j5260J6116J5819j2089n496m791j905q428q14
14830a3735O116k301M081J5438P265J5919m587l3419k2787j5401K4378J6529J2389
14817I885N792k3663m017k8827K124J6566J4604J8220K1778L938k2827j9654L433
14804b648K403m989j5317J3147j1418j8612J4874P717M34j3068q945p776Q710
14791c5488K1106J6938R804k808k5633p156M49P305K1063q241k8601P402K2173
14778a687j225j2932p512J1829N018k179J7480K5296k205k2755k0031J5557j4480
$$ plain form
14870 -29229 -28597 -19776 -5804 8806 16396 348 -11008 -14483 -17892 -8081 -15125 -7765 5537
14857 5537 -417 -12360 -21066 -21606 -23422 -26275 -57877 -47429 -24067 -30775 -28647 -24144 -17853 -9065
14843 -9065 9806 11288 13550 3113 -12147 3969 19788 7699 2203 -2588 -4493 -12921 -13735
14830 -13735 -7619 -9920 -5839 9599 16864 32783 28196 -5223 -28010 -43411 -19033 -2504 9885
14817 9885 15677 -7986 -12003 -40830 -38706 -22140 -7536 10684 32462 36400 13573 -6081 -2648
14804 -2648 -245 -5234 -20551 -7404 -18822 -37434 -22560 -14843 -14409 -27477 -36422 -44198 -35488
14791 -35488 -14382 2556 12360 9552 -16081 -23237 -22788 -15483 5580 -2661 -31262 -23860 -1687
14778 -1687 -2912 -15844 -23356 -11527 -6509 -8688 8792 34088 31883 9128 -10903 4654 -9826
14765i826p134L720O640l440L061k1647o425J5004K840j683K2316J7973j021R24
14751B1302j3871l977J0958j6208j0065k835J8571Q953J1689n31J285l300j8008
14738C963j2436K6569J2500r050r225p545k598Q520M499o536j3958l651K650j8918
14724b5216J1409K939K5574P665j386r047p953K1564L603j8298j6492j1720J1114
14711f244o121q337J3645L010j0892j9403j3338K160K0339M467j440J3280J2127
14698C253J268k2441J0571R114r526l3580n201J6969J431N183k598j4558O906
14685c3209J5040Q40J125R510J3650O947O079j2667q039j3272J4248J5326r24
14672A4654m368q270k0462l20j058l213n411J2151J6096R526K253k664k836j1156
$$ plain form
14765 -9826 -16960 -13240 -6600 -10040 -6979 -28626 -35051 -20047 -17207 -18890 3426 21399 20378 21302
14751 21302 7431 3454 14412 -1796 -11861 -14696 3875 12828 24517 23986 25271 21971 3963
14738 3963 -8473 18096 30596 21546 12321 4776 2178 10698 15197 8661 -5297 -8948 -6298 -25216
14724 -25216 -13807 -10868 14706 22371 20985 11938 3985 25549 29152 10854 -5638 -17358 -6244
14711 -6244 -12365 -20702 -7057 -4047 -14939 -34342 -47680 -45520 -25181 -20714 -22154 -8874 3253
14698 3253 4521 -17920 -7349 1765 -7761 -41341 -46542 -29573 -28142 -22959 -25557 -40115 -33209
14685 -33209 -18169 -17329 -16204 -6694 6956 13903 19982 7315 -724 -13996 252 15578 14654
14672 14654 10286 2016 -18446 -18766 -19824 -23037 -28448 -16297 -201 9325 11578 8914 6078 -5078
14658e078l957q12K597l362r176o325J0005K4872L0917K11q830j6783q154j475
14644D650L348K106j0318p08K079j821j5520q118O019J8459K5366N526j9110j8306
14630f348J2780L847n37o285R85K691N431P77o178k0968j836j1192l628j878L6870
14615D531J4231O11q627q754q690l559J6078o909j6228n199K786o443r774O996
14601b8950O739j0588K7411K9428k0031k4983P262j1071J9420j89j2342j8437
14589c6331J510J4699K558o483j1360J8170K4994j0453j2285k347l425j2494Q285
14576b4962Q745J4680o314j8991R399M457r899Q893j6742N010k359p143J4532
14563b0694j1496m815K8902P464J3491P45p638j496j6414p673k2208p25M2135
$$ plain form
14658 -5078 -9035 -9847 -7250 -10612 -19788 -26113 -16108 8764 39681 39892 31062 14279 6125 4650
14644 4650 7998 10104 -214 -922 1157 -664 -16184 -24302 -18283 176 25542 31068 11958 -6348
14630 -6348 6432 10279 9742 3457 4442 7133 12564 13341 7163 -13805 -15641 -26833 -30461 -32339 4531
14615 4531 18762 19373 10746 1992 -6698 -10257 5821 -1088 -17316 -22515 -19729 -26172 -35946 -28950
14601 -28950 -22211 -32799 -5388 24040 4009 -20974 -13712 -24783 -5363 -5552 -17894 -36331
14589 -36331 -34821 -20122 -17564 -24047 -35407 -17237 7757 -2696 -14981 -17328 -20753 -33247 -24962
14576 -24962 -16217 -1537 -7851 -26842 -17443 -12986 -22885 -13992 -30734 -25724 -28083 -35226 -20694
14563 -20694 -32190 -37005 -8103 -639 12852 13597 5959 4463 -11951 -19624 -41832 -42557 -422
14550d22L3190O306j7689k560M26J0088j6203j0507L2k6243j971Q895K2280K602
14536H224j13M91m42n631l104k914N791j3171l0841l279L0101K4644J179j4045
14522c110K445O256j530r959j2930K8N705n364p566k4650j6821J1702K2450J0323
14508b3021j8721k4632L0134R111q680j8835q894J6817N909J6272J2114L259q23
14495i990m81j0783O979l208j8314K1676K3630J0113J2270J2310O752j0394j1152
14482B9408n322o746q041j7292j3900q338J0010K5162L353l990J655j878k0782
14469a6701j2709K57O03n283o264K3499K660l59J4806K554n44o999Q444n070Q285
14454G179j982j654m146j8527K1291J2391j0732J9140N746l678P679O315o993
$$ plain form
14550 -422 32768 39074 21385 18825 19251 29339 13136 2629 2661 -23582 -25553 -16658 5622 8224
14536 8224 8111 8602 8160 2529 -575 -3489 2302 -10869 -41710 -44989 -14888 9756 10935 -3110
14522 -3110 -665 5591 4061 -5898 -18828 -18800 -13095 -18459 -26025 -50675 -67496 -55794 -33344 -23021
14508 -23021 -41742 -66374 -36240 -27129 -35809 -54644 -63538 -46721 -40812 -24540 -12426 -9167 -9990
14495 -9990 -10471 -21254 -14275 -17483 -35797 -14121 9509 19622 31892 44202 50954 40560 29408
14482 29408 24086 17340 9299 -7993 -21893 -30231 -20221 4941 8294 4304 5959 4081 -16701
14469 -16701 -29410 -29153 -28550 -33833 -40097 -16598 -13938 -14297 509 3063 2519 -4480 3964 -1106 7179
14454 7179 5197 3543 -603 -19130 2161 14552 3820 22960 28706 25028 32707 39022 32029
14441C2029k0247l054p478p162K041J7165N147k707n861o363J784L642N910l869
14427A0977J930k1181Q966J2553J072k3182j1770j3989j0857J1248J7836K0476
14415D079J3877K6815m68k1492j2486j213j7833j4272K596K8662M725n212K251
14402A0029J1342K268m0805j8838L4362L3130M979j9471j801k7104o820Q200J9125
14389H596o533l4515L803L7213m363k3192K178m747l73J3664j949l7515L364K8627
14375a5742J1883M648K824n747N612K5949k0087J5285M667M332J3385j4230k6768
14362F011o997N463J9430j8488k1160R887J5460Q402K641j7241j0343l462J1876
14349A479K130m222Q464j4655j6538P035P353J3197l0059n384N166J1109J9751
$$ plain form
14441 32029 11782 8728 1250 -5912 -3871 13294 18441 15734 9873 3510 5294 8936 14846 10977
14427 10977 12907 -8274 692 13245 14317 -8865 -20635 -34624 -45481 -34233 -16397 4079
14415 4079 17956 44771 44303 22811 10325 9112 -8721 -22993 -20397 8265 12990 7778 10029
14402 10029 21371 23639 -17166 -36004 -1642 31488 36467 16996 15195 -11909 -18729 -10529 8596
14389 8596 2063 -32452 -28649 8564 4201 -18991 -16813 -21560 -21933 -8269 -10218 -47733 -44369 -15742
14375 -15742 -3859 789 3613 -2134 3478 29427 9340 24625 29292 33624 47009 32779 6011
14362 6011 -986 4477 23907 5419 -15741 -5854 9606 18008 20649 3408 -6935 -10397 1479
14349 1479 3609 -613 7851 -6804 -23342 -16307 -8954 4243 -25816 -31200 -26034 -14925 4826
14336D826R836r200qK168R51k9404j7302n772J5580K7867M725j5684J768k1437
14322c1086Q433L9578j711K921j8898Q756K5588Q655j8838j4616K153j0866m384
14309d315j196j9624O963J5034M872k244o372N544m951j3568j4961M310J3071
14296a7437R556j5030K647L399n398k780J336j020J337R55N271m257J4816J1626
14282E021j0902L683N267k893j17P655q148j5674K292m15P312k209k747P553j738
14267f060j5691M584J4279J3024J2748Q44k4969k1855k3327J233K6776L1816O247
14254A9649k2076K292J3066R254L431k7989m912Q946K2327k0305j9783l561J0916
14241h745L2247O564k6074j2371q872O613K544n715J2687K3567L4356j2694k7360
$$ plain form
14336 4826 14662 5462 5454 7622 8573 -20831 -38133 -43905 -28325 -458 4267 -11417 -9649 -31086
14322 -31086 -22653 16925 15214 18135 -763 7993 33581 42236 23398 8782 10935 69 -4315
14309 -4315 -5511 -25135 -18172 -3138 1734 -510 -6882 -1338 -6289 -19857 -34818 -30508 -17437
14296 -17437 -7881 -22911 -20264 -16865 -22263 -25043 -23707 -24727 -23390 -22435 -17164 -21421 -6605 5021
14282 5021 -5881 -2198 3069 176 59 7714 -434 -16108 -13816 -14231 -6919 -9128 -11875 -4322 -6060
14267 -6060 -21751 -17167 -2888 10136 22884 23728 -1241 -23096 -46423 -45190 -18414 13402 19649
14254 19649 -2427 -135 12931 22185 25616 -2373 -7285 1661 23988 3683 -16100 -19661 -8745
14241 -8745 23502 30066 3992 -8379 -17251 -10638 -8094 -13809 -1122 22445 56801 44107 16747
14228A6747k5092m701J7069J6462m487j1506n740J5221J0151k2543j5423J0953
14216b889M76J4929L959J3532j6168l2398P646L292k013J1737q777j0786M391
14203a3069Q022L681k528l0073j4182J7960K537J783K0414N769j0198l778J2056
14190a606K880J04j2626O455J8322j9156m817p95N400N672n722l296J4831j1539
14176e893p941M01Q132J9709L058j9304j4895M728m775M169P686n643J4140o76
14162B896J1345l400j2008J20K0668n006N328l731q056j0606k3561P874J8813
14149F76n663J53J6755J6349p163k4248o199J2859m781R742J9073m188J442Q91
14135B5698k1978r782P816l372r570k850k063O915J1482J4403J7907J6011J026
$$ plain form
14228 16747 -8345 -13046 4023 20485 15998 4492 -1248 13973 24124 1581 -13842 -2889
14216 -2889 -2413 12516 16475 30007 13839 -18559 -10913 -7621 -9634 2103 -6674 -17460 -13069
14203 -13069 -5047 -1366 -3894 -33967 -48149 -30189 -27652 -25869 -5455 314 -9884 -13662 -1606
14190 -1606 1274 1378 -11248 -4793 13529 -5627 -10444 -11239 -5839 -167 -5889 -9185 5646 -5893
14176 -5893 -13834 -13433 -5301 14408 17466 -1838 -16733 -12005 -16780 -12611 -4925 -10568 3572 2896
14162 2896 14241 10841 -1167 -1047 19621 14615 19943 16212 8156 -2450 -26011 -18137 676
14149 676 -4987 -4834 11921 28270 21107 -3141 -9340 3519 -1262 8480 27553 23365 24807 25698
14135 25698 3720 -6062 1754 -1618 -11188 -14038 -16101 -9186 2296 16699 34606 50617 51643
14122E1643j1551k0226K511M394q66j9155j3824n556M139J1858K7965J1749j541
14109D1540m985k1822l3812m985Q187j831o446p313M8208J9444j1919l882O809
14096B7193M199j8157o406q091k722K6032M664O457J1226m276k1998j7898o039
14083e816J3432R034P058k8462k0540J2380o361J2871J4210K803k419n460J432
14070D162J8380k336j1449L902J315r252q816r566J6610Q453j7422j2823L161
14057a5681j8051J5717M159K7848Q845o759k2457j9751o44R224J5269J7428L70
14044A5517k1263j0734J843J8863J3376K0633n253j4040j9149q151R394N319q063
14031a708L986j3854j9299K1903N794J2999K3474p184n283n455R231j501R926
$$ plain form
14122 51643 40092 19866 22377 26771 25905 6750 -7074 -12630 -8491 3367 31332 43081 41540
14109 41540 36555 14733 -19079 -24064 -15877 -17708 -24154 -31467 16741 36185 24266 20384 27193
14096 27193 31392 13235 6829 -1262 -3984 22048 26712 33169 44395 40119 18121 223 -5816
14083 -5816 7616 16650 23708 -4754 -25294 -12914 -19275 -6404 7806 10609 8190 2730 4162
14070 4162 22542 20206 8757 12659 13974 4722 -4094 -13660 2950 11403 -6019 -18842 -15681
14057 -15681 -33732 -18015 -13856 13992 22837 16078 -6379 -26130 -26774 -17550 -2281 15147 15517
14044 15517 -5746 -16480 -14637 4226 17602 38235 32982 18942 -207 -8358 1036 6355 -1708
14031 -1708 2278 -11576 -30875 -8972 -3178 9821 33295 26111 20828 15373 24604 23103 33029
14018C3029M779j4116q838k1764j5526k4676l745J0588Q190J6632J7683K116L83
14005D735N36r986J1249m128k5557p84p196m618J3809J9652Q18L237J0079J4626
13991B6472R883j4090R467k327Q930p932j3249N049O906k770j6777J438q126j8476
13977a5602j6698J8393J1937j2108M353K4715K9468J1708J5708J4816R057K0427
13965A16174Q491J1891k059K3711N0126P8804J40016K50410L60202L36288J80873
13954A554927K2526k45667l49320k77029j65636r7383o9481p2941l6257k2249
13944B41490j4787m843j5627m308k0896l1420K211K7913j0504k7272k0253n703
13932A16001j420j9245j3334l362J1554L274n276j8257p665L8j1530J0566M16
$$ plain form
14018 33029 37808 23692 14854 -6910 -22436 -47112 -50857 -40269 -32079 -15447 2236 4352 4735
14005 4735 5271 -4715 6534 2406 -23151 -23935 -31131 -35749 -21940 -2288 -1470 1767 11846 26472
13991 26472 36355 22265 31732 29405 38335 30403 17154 22203 29109 26339 9562 11000 2874 -15602
13977 -15602 -32300 -13907 -1970 -14078 -9725 14990 44458 56166 71874 86690 95747 116174
13965 116174 124665 136556 134497 158208 208334 287138 427154 677564 1037766 1374054 1554927
13954 1554927 1577453 1331786 982466 705437 539801 442418 372937 299996 263739 241490
13944 241490 226703 221860 206233 201925 181029 149609 151820 179733 169229 141957 121704 116001
13932 116001 114581 95336 82002 78640 90194 93468 88192 69935 62270 62308 50778 61344 61760
13919F1760J7176j9227R79K1350J8929j488j7449n963L305r889j2898l824j6141
13906C6620j3809n666L782J8418j147o159N792J6373J5049K4722q734j1652m905
13893F8684j9419R043J4434Q095o691j5545Q827j1955p166j0896j6111K951M888
13880B9139l141k0757j1751j7759j3262J6753L9240K6744O291j8383l3375j1496
13868a1757r43O6L0686K505J9151R339Q415j4578j8417j4515k3599J270J4143
13855A766J1451L121j2638n44J1429j7974m397k449R82J1550J1218J0725j838
13842B2402j71J4781J6770K9119l989k7176j5523J0608j3056l5474m896K0105
13830A3500J8504M204Q729K309k066r451k3195r444K5932k818O543Q835K804p790
$$ plain form
13919 61760 78936 59709 60688 82038 100967 99479 82030 76067 79372 69483 56585 52761 36620
13906 36620 22811 17145 20927 39345 38198 32039 37831 54204 69253 93975 85241 73589 68684
13893 68684 49265 58308 72742 80837 74146 58601 67428 55473 48307 37411 21300 24251 29139
13880 29139 25998 5241 -6510 -24269 -37531 -20778 18462 45206 51497 33114 -261 -11757
13868 -11757 -12700 -12634 18052 20557 39708 49047 57462 42884 24467 9952 -13647 -12377 1766
13855 1766 13217 16338 3700 3156 14585 -3389 -7786 -10235 -9253 2297 13515 24240 22402
13842 22402 22231 37012 53782 82901 78912 51736 36213 46821 33765 -1709 -6605 13500
13830 13500 32004 36208 44937 47246 45180 35729 12534 3090 29022 26204 32747 41582 44386 36596
13816C6596K6092P503j3890j7858r750k823k1872O806l310j0460Q208L036j1861
13803c583j3476K2073K7086J934k3156k132p56o05j8297j5728J7767J8515K1206
13790C0848J1670r59J153l6676o758J9690J1471J2818K2079J8362j3063p136J1444
13777G4943l287j7126k2646k3503J0648J345L046J1330L6500R891J7528n42K2517
13764A20644L2785L1289O563j3753j7698k739J0905j0682q975j5349l1754k1994
13752G9242K69r463j2511j307K1312J5521j8768j2148N854l358j1866J3272P351
13739G3400O734P972r323M772J2146j69K091j6618j4423M93m110j8129Q585N186
13725E8607Q350J3063K1292r868l118r015L444r378q425l186k752q552k395k1148
$$ plain form
13816 36596 62688 70191 56301 38443 28693 25870 3998 10804 7494 -2966 5242 8278 -3583
13803 -3583 -17059 5014 32100 34034 10878 8746 7990 7385 -10912 -26640 -8873 9642 30848
13790 30848 42518 41559 42712 6036 -722 18968 30439 43257 65336 83698 70635 63499 74943
13777 74943 71656 54530 31884 8381 19029 20374 23420 34750 71250 81141 98669 98127 120644
13764 120644 153429 184718 191281 177528 159830 157091 167996 157314 148339 132990 101236 79242
13752 79242 79511 70048 57537 56230 77542 93063 74295 62147 68001 64643 52777 66049 73400
13739 73400 80134 88106 78783 83555 95701 95532 97623 81005 66582 67075 62965 44836 53421 58607
13725 58607 66957 80020 101312 91444 88326 79311 82755 73377 64952 61766 59014 50462 48067 26919
13711B6919j8833Q213k0686k4220K5428J7355j94J8067K6169j2306j9378m018
13699B2516j569N840J4873J6982J2721p637L859K0549o162j2075l351J4757o132
13686G5171j3669j0177M922J869k7422m265K601J5842N206o933K1333R089m473
13673F9094j0797j5848K997J0339j2935j8301o538j5569l1228k4589j188J8845
13661c5718J9100L2031L9226K7145K3890p720j4499O63k498j5028l482L7167J4889
13648A15166K221J6206J1824K189K1132K0254M1080O8248P2110M5082K4237l229
13636D36520n0205q7678l5799k8466j5380j9564k3156l6161j4071J4522M944j451
13624A44055m511j5556j4936O374J434N442r702J5925K1803j8620k4129j8465
$$ plain form
13711 26919 8086 16299 -4387 -28607 -3179 14176 13982 32049 58218 45912 26534 22516
13699 22516 20947 26787 41660 58642 71363 63726 67585 88134 81972 69897 66546 81303 75171
13686 75171 61502 51325 56247 58116 30694 26429 29030 44872 50078 43145 64478 73567 69094
13673 69094 58297 42449 45446 55785 42850 24549 18011 2442 -28786 -53375 -54563 -35718
13661 -35718 -16618 15413 54639 81784 105674 97954 83455 84118 81620 66592 63110 100277 115166
13648 115166 117387 133593 145417 147606 168738 188992 230072 298320 370430 415512 439749 436520
13636 436520 386315 298637 262838 234372 218992 199428 176272 140111 126040 140562 145506 144055
13624 144055 139544 123988 109052 115426 116860 122302 112600 128525 150328 131708 107579 89114
13612H9114L4415J9503L828O525K5781J8299O8K2482m39j0577R918K0595j720
13599B37792j5088J3162M3128M156k114Q497q042j4914j6286m263l454q479k069
13586B32026K8474M9483L2306J9291J0940l014J5388m039P871J0781M609J7841
13574D21957J4236j3854k6651k3807p432K0393M3135L0332K3520J6256l720K5714
13562E20079K0206N0820M0312L2518M0740J7915Q722j4056L850L7406N1165N1305
13550H60982N8426O6415R7592R8323Q6742L7439M9724P7790P7875R0282Q5078
13539A686668R0933J04344J16523J64104J80066K11163K23662K44474K28713J93575
13529C444225K31734L15621M76503O52976Q73090J077434J288503J535154J807700
$$ plain form
13612 89114 123529 143032 146860 153385 179166 197465 197533 220015 219576 208999 218917 239512 237792
13599 237792 222704 235866 278994 283150 281036 289533 281491 266577 250291 246028 242574 234095 232026
13586 232026 260500 309983 342289 361580 372520 369506 384894 380855 388726 399507 404116 421957
13574 421957 436193 422339 395688 371881 364449 384842 427977 458309 481829 498085 494365 520079
13562 520079 540285 591105 631417 663935 704675 722590 731312 717256 721106 758512 809677 860982
13550 860982 919408 985823 1083415 1181738 1268480 1305919 1355643 1433433 1511308 1601590 1686668
13539 1686668 1777601 1881945 1998468 2162572 2342638 2553801 2777463 3021937 3250650 3444225
13529 3444225 3675959 3991580 4468083 5121059 5994149 7071583 8360086 9895240 11702940
13520A1702940K228174L042460M258088N992592Q689210J3410205K2711952M0336827
13512A12372448O4934436P1755625M4745909P386985m5119077o9515951n4298753
13505A32261622l3296692j9904366j2797089r047164p022070n820432m746829
13498C9626980l711975k942523k401592j931769j516632j242745j063707r92379
13490B3823658j060373j118826r95022q06056p49247p38513p08215o97658o60822
13481A6288926n75601m87240m15420l93139l97969l84600l90272m27186m49064
13472A2368435m56087m15553l56273l35844k58566k17638k11524j86275k04944
13463I725731k21205k08753k26574k77603k59623k74854k88909k72149k86339
$$ plain form
13520 11702940 13931114 16973574 21231662 27224254 35913464 49323669 72035621 112372448
13512 112372448 177306884 249062509 293808418 301195403 256076326 186560375 132261622
13505 132261622 98964930 79060564 66263475 57216311 50194241 44373809 39626980
13498 39626980 35915005 32972482 30570890 28639121 27122489 25879744 24816037 23823658
13490 23823658 22763285 21644459 20649437 19843381 19094134 18355621 17647406 16949748 16288926
13481 16288926 15713325 15226085 14810665 14417526 14019557 13634957 13244685 12817499 12368435
13472 12368435 11912348 11496795 11140522 10804678 10546112 10328474 10116950 9930675 9725731
13463 9725731 9504526 9295773 9069199 8791596 8531973 8257119 7968210 7696061 7409722
13454G409722k50397j94065j61631j55846j44550j34179j21139j31335j64268
13445E952312j76972j33394j23722j25070j19513j30607j36413j48044j29427
13436D729150j16859j13290j21020j22176j02306q3351j05487q7124r1414q8213
13426C697910r8112r4404q9431q2482o8493o9529o5429l6453m0548l9090m5516
13415B968423l1456m7795r6829q4649o8639o9552o8755q7529p2112o9003o6027
13404B206077q1537p4271l5546l9226n3782m7646l8491j7957r835l0492m1150
13393A736144n9095k3162k7782n8170m5085l7731j0062N808j4167l1276q9828
13382A345594r2285o2303k7747P008K4491n722j5331p1446l2560m4253m4648l3097
$$ plain form
13454 7409722 7159325 6965260 6803629 6647783 6503233 6369054 6247915 6116580 5952312
13445 5952312 5775340 5641946 5518224 5393154 5273641 5143034 5006621 4858577 4729150
13436 4729150 4612291 4499001 4377981 4255805 4153499 4070148 3964661 3877537 3786123 3697910
13426 3697910 3599798 3505394 3415963 3333481 3264988 3195459 3130030 3093577 3053029 3013939 2968423
13415 2968423 2936967 2889172 2792343 2707694 2639055 2569503 2500748 2413219 2341107 2272104 2206077
13404 2206077 2124540 2050269 2014723 1975497 1921715 1874069 1835578 1817621 1807786 1777294 1736144
13393 1736144 1677049 1653887 1626105 1567935 1522850 1485119 1475057 1480865 1466698 1435422 1345594
13382 1345594 1253309 1191006 1163259 1170267 1194758 1189036 1173705 1102259 1069699 1025446 980798 947701
13370I47701m8113n4204p7633j9807j153k3983j6771k0083j0289p067l6268k7901
13358F04429n27J7791p10m4673m2724m7224l8037j9542J4365L06k0733m8621j9610
13345C54490k1319j9917j1636p82k1431p50j0811J214M854J052q584Q061n268
13332B69173k2349J0635l0978p036J8647P759j3774q845J1863N608P69n963J0009
13319B45518j548j1050l3108J9970J5972j3575l143m702K2560K2364N754r665
13307B55347k0993m1368j2002O207n194j6635k0237j828l697Q696K9240J8975
13295A96511L21j3262N321j427P901j4206j7435j568m083o572j043L156P976L837
13281A65427K77n823P07n463l2998P876O454o923j7399l018N830K4845L4919J6812
$$ plain form
13370 947701 899588 845384 767751 747944 746791 722808 706037 685954 675665 668598 632330 604429
13358 604429 603902 621693 620983 576310 533586 486362 448325 428783 443148 443454 422721 374100 354490
13345 354490 333171 313254 301618 300836 279405 278655 267844 269058 273912 274964 266380 274441 269173
13332 269173 246824 257459 226481 219445 238092 245851 232077 223232 235095 240703 241472 235509 245518
13319 245518 243970 232920 199812 219782 235754 222179 219036 214334 236894 259258 265012 255347
13307 255347 234354 192986 180984 187191 181997 165362 145125 143297 139600 148296 177536 196511
13295 196511 196832 183570 188891 187464 195365 181159 163724 162156 158073 151501 150458 153614 161590 165427
13281 165427 165704 159881 160588 155125 122127 130003 136457 129534 112135 109117 114947 139792 174711 191523
13267A91523k3867j5718J1087j831j8783k4981o272R607O872N919l782J6460P083
13254A53317l79j2997p898J0439K7239P62l3024j5093j3199J2123N94r883j743
13241A10258o006l806k1791M790J7258R698P784q247N067r73k7739k7992P115
13228F5416K5193j539r720p567M57k915m285Q887J653M181R518P761q155r954
13214G8931O614J3905q99q677k1041j2475j9011k5284j5072J1230J9844Q66j2513
13201A6418N746K5632N115m675j067m655r896k412q531M980J5306K1055p968j8549
13187C6499n499O738O446j3063q52M952j620k9398J8012R559n018J1967K574j6719
13173B4578R35K3342K1738K1266K810q759q301p301l762O488M689J0807j2327
$$ plain form
13267 191523 167656 151938 163025 161194 142411 117430 111158 120765 127637 133556 129774 146234 153317
13254 153317 152938 139941 132043 142482 169721 170483 137459 122366 109167 121290 121884 112001 110258
13241 110258 104252 100446 78655 83445 100703 110401 118185 109938 115005 114032 86293 58301 65416
13228 65416 90609 89070 79350 71783 72240 69325 65040 73927 75580 79761 89279 97040 88885 78931
13214 78931 85545 99450 98551 89874 68833 56358 37347 12063 -3009 8221 28065 28931 16418
13201 16418 22164 47796 52911 48236 47169 42514 32618 30206 21675 26655 41961 63016 55048 36499
13187 36499 31000 37738 44184 31121 30269 35221 33601 4203 22215 31774 26756 38723 41297 24578
13173 24578 25513 48855 70593 91859 94669 85910 77609 70308 66546 73034 77723 88530 76203
13160G6203J856j1256j2549N594j4037j482K081q088j5023Q030L509k0579j5869
13147a610n185K3702J8496J397m693J5236l075j2663k0638j0154l467K0150Q636
13134B6132m244m210K6149L2765j9356k4682j2631N068J6233l07k4811n101n743
13121E262j1606J1796J1498j0004J480J9252J3643N558Q107N876j3551M383J951
13108E3645l811N070q674p285j1357j1646j1685L422p666J5293j6187P087P177
13095A3383q663j8437j904J9767J5624J2022R446J804R176O962p565j9963J994
13082C3646k2n330j4587p185O245L395k267J0265k975Q464N330N019n20K1274
13068F0752J8436J8523K9557L5437M0366Q5738R7053J99768L47747L65490K30501
$$ plain form
13160 76203 78059 66803 54254 59848 45811 44329 46410 38322 23299 31329 34838 14259 -1610
13147 -1610 -6795 16907 35403 36800 32107 47343 44268 31605 10967 813 -2654 17496 26132
13134 26132 21888 17678 43827 76592 57236 32554 19923 24991 41224 40917 16106 11005 5262
13121 5262 -6344 5452 16950 6946 8426 27678 41321 46879 54986 60862 47311 51694 53645
13108 53645 49834 54904 46230 38945 27588 15942 4257 7679 13 15306 -881 6206 13383
13095 13383 4720 -13717 -15621 4146 19770 31792 41238 43042 52218 59180 51615 31652 33646
13082 33646 33624 28294 13707 6522 12767 16162 13895 24160 21185 29649 34979 39998 39478 60752
13068 60752 79188 97711 127268 162705 203071 288809 385862 585630 933377 1298867 1529368
13057A529368O2010k13241l46009k87958j90143j19454n9711l4479m4703l4133
13047B61547j4917j0479j3877j9516j7558j1575r195m1427j9299J7085J4452k903
13035A32338j3882J1834l420j7519r20r804j8281j0560k042J314m371p985K1407
13022G8109Q350R751Q603j9765j8948j1294J6843l089J2347q328O361J0903k1535
13009F8308q45o134o339m130L116j4444n951J607J2436K961J4328O103J867j4659
12995E8224j615K2527k664j6313J8790J7996l161j1824k759r675k544n339j0571
12982E1072k606k156K998K460l1694k844Q782J4814R066J3342N975j1980k5639
12969C1590j5101J0502J5956n46K3339N659p784k0532m395r88j3619k5174q178
$$ plain form
13057 1529368 1591378 1378137 1032128 744170 554027 434573 374862 340383 295680 261547
13047 261547 246630 236151 222274 202758 185200 173625 164430 123003 103704 120789 135241 132338
13035 132338 118456 130290 126870 109351 108431 98627 80346 69786 67744 69058 64687 56702 78109
13022 78109 86459 96210 104813 85048 66100 54806 71649 68560 80907 72579 78940 89843 68308
13009 68308 67463 61329 54990 50860 53976 39532 33581 35188 47624 50585 64913 71016 72883 58224
12995 58224 56609 79136 76472 60159 78949 96945 93784 81960 79201 69526 66982 61643 51072
12982 51072 48466 46310 49308 51768 20074 17230 26012 40826 49892 63234 69209 57229 31590
12969 31590 16489 26991 42947 42401 65740 71399 63615 43083 38688 37700 24081 -1093 -9271
12956i271K0462m363j7692J0611J5427o276J2796K0527n03j9233j89N247j0894
12943A6649M358M120K355P078J7188J8441o386k4872j1801M075p242O031L876
12930C3870o402J2482M2943J4377q74k1581r050k3438l4519n906J9914L2734J57
12917E4707n636r380l6080k4472J9746j221j3825K2302J3566J6222J3108L3505
12905H2542K2665K3566J8934J609J416k8689j9244o453k8369l4829p553j5078
12893A0517N939J4864J9070M461n158k4037K160r2j3112J4242J9795P121L721
12880E9491j0683J562j2730j2106K2438K4851M896k1436j666m751P305j6873k3597
12867A6701J0570K996r51j2806k59J326k332j0263M267J3795M364M699J5135J626
$$ plain form
12956 -9271 11191 6828 -10864 -253 15174 8898 21694 42221 41718 22485 22296 27543 16649
12943 16649 21007 25127 27482 34560 51748 70189 63803 38931 27130 31205 23963 29994 33870
12930 33870 27468 39950 82893 97270 96396 74815 65765 42327 7808 1902 21816 54550 54707
12917 54707 49071 39691 3611 -20861 -1115 -2336 -16161 6141 19707 35929 49037 82542
12905 82542 105207 128773 147707 149316 150732 122043 102799 96346 67977 33148 25595 10517
12893 10517 16456 31320 50390 54851 49693 25656 27816 27724 14612 28854 48649 55770 59491
12880 59491 48808 50370 37640 25534 47972 72823 77719 56283 54617 49866 57171 40298 16701
12867 16701 27271 30267 29316 16510 16251 17577 15245 4982 9249 23044 27408 32107 47242 48868
12853D8868J2342r583j2919j3481m531m06J7737n784K196J0883m527o626J1555
12840D5724k1853l235K031J4896M672M195j0266q591l754k3205J8476R711K541
12827C1342k172p318j6512k1485j130J6539K3388j90J1322j7991j6580k882J0932
12814G263k629j9082k66J5933k433K0839j3431o917m594J6963M589k6457m505
12801a4727L988R145K090o47J892j78l899J734j1310J8125K3769J999Q225k1158
12787A9048j4669j2668j098K858J1003J0911r02N787M834j3462m037M878K953
12774A5436n747k9223N860K81N642j548J7367J7657l80k4620j4054K1503J9029
12761B7203r328r49J5454j1592m261J0337o029P133q167O758K0246j0263k3376
$$ plain form
12853 48868 61210 51627 38708 25227 20696 20290 38027 32243 34439 45322 40795 34169 45724
12840 45724 23871 20636 22667 37563 42235 46430 36164 27573 23819 614 19090 28801 31342
12827 31342 29170 21852 5340 -16145 -17275 -736 22652 22462 33784 15793 -787 -3669 7263
12814 7263 4634 -14448 -14714 1219 -1214 19625 6194 -723 -5317 11646 16235 -10222 -14727
12801 -14727 -10739 -1594 496 -151 1741 1563 -2336 -602 -11912 6213 29982 31981 40206 19048
12787 19048 4379 -8289 -9387 -6529 4474 15385 14483 20270 25104 11642 7605 12483 15436
12774 15436 9689 -19534 -13674 -13393 -7751 -9299 8068 25725 25345 725 -13329 8174 27203
12761 27203 17875 16926 32380 20788 16527 26864 20835 27968 19801 26559 46805 36542 13166
12748A3166r646K3688p543N232j1896K9713Q485j8508l511j8320q994P801n340
12735D327j6812R364k0808k4637J4825L0297J677m906J2857J0633j2409j1984
12723g576K8259L183j5532r796J7590j7576l2600K0182L903J2215l159o15N605
12710D083K7037J2274j0964j3683j1860j4600J736J3271J9232M517j0270j0746
12698A0027j2417J481L975m550j6118J570L813j945J3837J8656l544N18j7084
12685a781k3350k287R911J5742j050m555N069J877j3504r49M457J2359R680R390
12671B1009m179j2026Q362k898j0356n02J0010J3274K1351n207k8172j472q761
12658D33o977R081R024K8850L250l0670j8735P749m792P160p092J1326L317R975
$$ plain form
12748 13166 3520 27208 19665 24897 13001 42714 51199 32691 29180 10860 1866 9667 4327
12735 4327 -12485 -3121 -23929 -48566 -33741 -3444 -1767 -6673 6184 16817 4408 -7576
12723 -7576 20683 23866 8334 -1462 16128 -1448 -34048 -13866 -9963 2252 -907 -1522 4083
12710 4083 31120 43394 32430 18747 6887 -7713 -5977 7294 26526 31043 20773 10027
12698 10027 -2390 -909 3066 -1484 -17602 -16032 -12219 -14164 -327 18329 14785 15303 -1781
12685 -1781 -25131 -27418 -17507 -1765 -2815 -7370 -2301 -424 -13928 -14877 -10420 1939 11619 21009
12671 21009 16830 4804 13166 10268 -88 -590 9420 22694 44045 38838 10666 9194 433
12658 433 -6544 2537 11561 40411 43661 12991 -5744 2005 -2787 4373 -2719 8607 11924 21899
12644B1899J3745J5797r538j8205k194m256k4764j2347P8j4745J7265K2883q92
12631D726n091p41K2789M814l771n395r066j191K378R867Q363j1503j6565Q066
12617G680j5165N554K0576j9527k4978n448J877Q339R906J5613L884r385j3980
12604a5054J3706J6443j3290j3509j295K9147R229J7777L375q776j0164J3878
12592D1467j7803j6257j8412O942k636j1574M828R821L611j5869j1361K9595R031
12579A1383j0584r373P341q404j0918j317L59J733M1065l491j6619k0141J6424
12566b542K5172j0548j4727m182K0306k083j1985J795q433o247j9697K5383M2075
12553C4287m224j5265j9378n498Q842j5561k1493j0360P988J1499R59p241j0403
$$ plain form
12644 21899 35644 51441 41903 23698 21504 17248 -7516 -19863 -19785 -34530 -17265 5618 4726
12631 4726 -365 -1106 21683 26497 22726 17331 8265 7074 9452 19319 27682 16179 -386 7680
12617 7680 -7485 -1931 18645 -882 -25860 -31308 -29431 -21092 -11186 4427 8311 -1074 -15054
12604 -15054 -1348 15095 1805 -11704 -12999 16148 25377 43154 46529 37753 27589 41467
12592 41467 23664 7407 -11005 -4063 -6699 -18273 -13445 -3624 -13 -15882 -27243 2352 11383
12579 11383 799 -8574 -1233 -9637 -20555 -21872 -21513 -19780 21285 17794 1175 -18966 -2542
12566 -2542 22630 12082 -2645 -6827 13479 11396 -589 1206 -7227 -13474 -33171 -7788 34287
12553 34287 30063 14798 -4580 -10078 -1236 -16797 -38290 -48650 -40662 -29163 -28204 -35445 -45848
12540d5848J1421N103J2363k626N579L0492M966Q612J6296q707j0590l5429o641
12527a5009Q73P25K5670R448m389n299r641q834n661m390Q750j6467m344J3178
12513a5390R009N613k182q095r297j6762j3374L041O145q320J1884J4683j039
12500b4084R486J9047o260j0642j7020j4661K298K613J5706P58J5402O947J1476
12487A1066O189j6168l1674J620J6809J9892P578P712J832R652j0955j6364P228
12474A4417q35m74j1201J2704k071j6290l852M7J6965K70j4744n030R270Q269
12460G445J4946J7058n746r780m356O901m08j3265j7756j9095J5667J4011l5964
12447c0342k1734o753L89J9606R542K008m0N783J0258Q23M458n653j326O729K669
$$ plain form
12540 -45848 -34427 -29324 -16961 -19587 -14008 16484 21450 30062 46358 37651 27061 -8368 -15009
12527 -15009 -14136 -13411 12259 21707 17318 12019 2378 -6456 -12117 -16507 -7757 -24224 -28568 -15390
12513 -15390 -6381 -768 -2950 -11045 -20342 -37104 -50478 -47437 -41292 -49612 -37728 -23045 -24084
12500 -24084 -14598 4449 -1811 -12453 -29473 -44134 -41836 -39223 -23517 -22759 -7357 -410 11066
12487 11066 17255 1087 -30587 -28967 -12158 7734 15312 23024 24856 34508 23553 7189 14417
12474 14417 13582 13108 1907 14611 12540 -3750 -7602 -7555 9410 9680 -5064 -10094 -824 7445
12460 7445 22391 39449 33703 23923 19567 26468 26060 12795 -4961 -24056 -8389 5622 -30342
12447 -30342 -52076 -58829 -58440 -38834 -29292 -27284 -27324 -21541 -11283 -10460 -6002 -11655 -12981 -6252 -3583
12432c583K1982J3185n594p721J500j2M597R801k0473j6426l0518j5523J0545
12419c8240O618n781l867J1373o367M514R011J6109j772J5784J211J2078n439
12406A5232l1210k6939K2618J6188M845K242M343J1212R800m414L787q715k6877
12393g888n349K0935P801l582J0583j9984j7783l661R982o285j352P040j1974
12380b1517j448p95j1032o752M19J2772J3773K059P002o48J3145K9239r842r330
12366A7045k709K80L382j1961L682J0969j5351J278J3020j9080j1534J645q435
12353a7769K6519K800j55J7352K762j0520k0870k0473l68M0851L880j9506n000
12340d97J2279O854j4026m932j0908J5454q541j7015J2525J1556j1974n233p25
$$ plain form
12432 -3583 18399 31584 25990 18269 19769 19757 24354 34155 13682 -2744 -33262 -48785 -38240
12419 -38240 -31622 -37403 -41270 -29897 -36264 -31750 -22739 -6630 -8402 7382 8593 20671 15232
12406 15232 -15978 -42917 -20299 -4111 734 2976 7319 18531 28331 23917 27704 18989 -7888
12393 -7888 -13237 7698 15499 11917 22500 2516 -15267 -18928 -8946 -15231 -16583 -9543 -21517
12380 -21517 -22965 -23760 -34792 -41544 -41125 -28353 -14580 -12521 -5519 -6167 6978 36217 26375 17045
12366 17045 14336 14616 17998 6037 9719 20688 5337 6615 19635 555 -10979 -9334 -17769
12353 -17769 8750 11550 11395 28747 31509 20989 119 -20354 -20722 20129 24009 4503 -497
12340 -497 11782 18636 4610 -322 -11230 4224 -4317 -21332 -8807 2749 -9225 -14458 -15183
12327a5183J1461m758J4679Q785l4706n282K3275j6168r795J7482J5899J2021
12315A7710J4337j9722l0429P969k720j5279J3175K4201p853o918P449K1322J0568
12302C3810K837j4547k3786k787K5187L0408q575q104j2565j3746M34K6389k1457
12289A3498l938j3454j5419p098J7770k844J0215P362J0885n552k092J9445n220
12276B3558o970m386J741j3149n711j1435j0468J7851J6298j7327n441l961O334
12263a3066P670J5425L839J9990L206l5572p517q038j0784K3134K6147J8005j0077
12250C2362k1370j6426J7936O840r835k4344O966K9025J6073k2308k931M229r994
12237F223j2954M549j073k036r09r266J9280J2325J4578q570m003l779M120j7452
$$ plain form
12327 -15183 -3722 -8480 6199 14984 -19722 -25004 -1729 -17897 -27692 -10210 5689 17710
12315 17710 32047 12325 -18104 -10135 -12855 -28134 -14959 9242 1389 -5529 1920 23242 33810
12302 33810 36647 22100 -1686 -4473 20714 51122 42547 34443 21878 8132 8566 34955 13498
12289 13498 9560 -3894 -19313 -26411 -8641 -11485 -1270 6092 16977 11425 9333 28778 23558
12276 23558 16588 12202 13943 794 -4917 -16352 -26820 -8969 7329 -9998 -15439 -19400 -13066
12263 -13066 -5396 10029 13868 33858 37064 1492 -6025 -14063 -24847 -1713 24434 42439 32362
12250 32362 10992 -5434 12502 19342 9507 -14837 -7871 21154 37227 14919 11988 16217 6223
12237 6223 -6731 -2182 -3255 -5291 -6200 -15466 3814 16139 30717 22147 18144 14365 18485 1033
12223A033m0184J590L3335J1121o641m457j4496k12l72q753K0279J4719l416j4855
12209a1309n184P63J2854n369J480j4458j1183m286J2023J0690K4685R137J8731
12196C8574j0854l4551n435K7671R717j2224j5660O225O239k925J2956K2565j9492
12183B2806k2061n946p98L708M227n855p584q020p607N029K700O951L168M601
12169d681k999n143J0048J5143l58j1035j3170k6010R657Q328j165k23M455j0268
12155b7421K579J534q151p867J6958L844n869Q657J8830J4706n912k1859k3191
12142c3162k6434j5834K2053K7030r006n339n057M784l086L362J3865R226j4632
12129c2230J0294n852J1800N7j8428L97O788J2644J3916L087N519q909k8441K518
$$ plain form
12223 1033 -39151 -37561 -4226 6895 254 -4203 -18699 -18911 -19283 -28036 -7757 6962 3546 -11309
12209 -11309 -16493 -15730 -2876 -8245 -6765 -21223 -32406 -36692 -24669 -13979 10706 19843 38574
12196 38574 27720 -6831 -12266 15405 25122 12898 -2762 3463 9702 6777 19733 42298 22806
12183 22806 745 -5201 -5999 -2291 1936 -3919 -11503 -19523 -27130 -22101 -19401 -12450 -9282 -4681
12169 -4681 -7680 -12823 -2775 12368 12010 975 -12195 -38205 -28548 -20220 -21385 -21608 -17153 -27421
12155 -27421 -24842 -23308 -31459 -39326 -22368 -18524 -24393 -15736 3094 17800 11888 -9971 -33162
12142 -33162 -59596 -75430 -53377 -26347 -35353 -40692 -45749 -40965 -44051 -40689 -26824 -17598 -32230
12129 -32230 -21936 -27788 -15988 -15931 -34359 -33962 -27174 -14530 -614 2473 7992 -917 -29358 -26840
12115b6840J62J2319J0003j5016j5638o003J2020K9626J0985K648j0327j6366
12103a2427J2405R181L371J4426J2309J7023q234l3865r074j5908J0113N904M47
12090E671J993J0276K967J6729K301r21k6003n240m290L325k109K2513N370N150
12076C7732J3058j5340l5922j1868m031K387k0042O136n612j0191N442L2067J7577
12063A1393Q781j4516K675k715Q95K048q535J0345j3900J5346K1887M360j4989
12050B3075k5492K4200K2025j9903j8130l745J8727j3813k976j1316L400p872
12038a1820J3065N698Q690o182j6011P221k3056P026m533N400O631J6695J0500
12025A9324k7132N587L464k1l855J097j0227J4284K5585Q872j2603J4320j2115
$$ plain form
12115 -26840 -26678 -14359 -4356 -19372 -35010 -41013 -28993 633 11618 14266 3939 -12427
12103 -12427 -22 9159 12530 26956 39265 56288 48054 14189 5115 -10793 -680 5224 5671
12090 5671 7664 17940 20907 37636 39937 39016 13013 7773 3483 6808 4699 27212 32582 37732
12076 37732 50790 35450 -472 -12340 -16371 -13984 -34026 -27890 -33502 -43693 -38251 -6184 11393
12063 11393 20174 5658 8333 5618 6513 8561 26 10371 -3529 11817 33704 38064 23075
12050 23075 -2417 21783 43808 23905 5775 2030 20757 6944 3968 -7348 -3948 -11820
12038 -11820 1245 6943 15633 9451 -6560 661 -22395 -15369 -19902 -14502 -7871 8824 19324
12025 19324 -7808 -2221 1243 1222 -2633 -1536 -11763 2521 28106 36978 24375 38695 26580
12012B6580J1927j6760k1455j8907K920n891L79l788L466n98N649J9222Q17N914
11998I475j5026n590M090n098j96O87j4536j4025p989L5165J8159Q40n584l671
11984c299j096j3557J2095j06k403L801P843q499j4927Q353J0080j4043j1826
11971b7584j9023J4829K0920K864p474j497K7571l497j7807k467Q642L3969r75
11958B8471k577p940L367l044j0572N229j443R813p707l2350j269J3326j0038
11945a6734J4886J4579o922j1695m133J652j0899n843K1038N895k007k750J3761
11932A0828j1384m029j2278M781J9283j6401K567k313r797r232O448K2855P630
11919H958o660m783J791q008j9709M736Q720L4783p589Q951J49M792m123k5023
$$ plain form
12012 26580 38507 21747 292 -18615 -15695 -21586 -21207 -24995 -21529 -22127 -16478 2744 3561 9475
11998 9475 -5551 -11141 -7051 -12149 -12345 -11658 -26194 -40219 -48208 -13043 5116 5956 372 -3299
11984 -3299 -4395 -17952 -5857 -5963 -8366 -4565 3278 -5221 -20148 -11795 -1715 -15758 -27584
11971 -27584 -46607 -31778 -10858 -7994 -15468 -16965 10606 7109 -10698 -13165 -4523 29446 28471
11958 28471 25894 17954 21321 18277 7705 12934 11491 21304 13597 -18753 -20022 -6696 -16734
11945 -16734 -1848 12731 5809 -5886 -10019 -8367 -19266 -25109 -4071 1824 -183 -2933 10828
11932 10828 -556 -4585 -16863 -12082 7201 -9200 -6633 -8946 -18743 -27975 -21527 1328 8958
11919 8958 2298 -2485 -694 -8702 -28411 -23675 -14955 19828 12239 21190 21339 26131 22008 -3015
11905c015K0039J902O781J717k5333k793Q268O90l840P001M291J1696K51q544
11891A9111j8605j3014L151J011R764P395k2242n862J3679K5683j531l2380p273
11878b1113K0086J6838k833p144K290j9990P027j3424M511J5588j0292N2J0111
11865A707R589j9404P26J9907k28r090j9633j989K497j5765M885K7547J7783P960
11851B6492K96j945O990k800q695k3726K202J5256J7834Q969j2226j2759j1339
11838D549j974j424K800j4957j855R976J2096m238J923q274M052K8461n537k8313
11824b715p294J6232r64r704n882q050J3913R411Q127q450J1160j949P68R926
11810B4529J5382o406k3694K178M973j0700L800J3057m689k5986j605P271J0070
$$ plain form
11905 -3015 17024 18926 25707 27424 2091 -702 7566 8256 4416 11417 15708 27404 27655 19111
11891 19111 506 -12508 -9357 -8346 1418 8813 -13429 -19291 -5612 20071 18540 -13840 -21113
11878 -21113 -1027 15811 12978 5834 8124 -11866 -4839 -18263 -13752 1836 -8456 -8404 1707
11865 1707 11296 -8108 -7382 12525 12297 3207 -16426 -18415 -15918 -31683 -26798 749 18532 26492
11851 26492 26788 24843 31833 29033 20338 -3388 -1186 14070 31904 40873 28647 15888 4549
11838 4549 2575 1151 3951 -11006 -12861 -2885 9211 4973 6896 -1378 2674 31135 25598 -2715
11824 -2715 -10009 6223 5259 -4445 -10327 -18377 -4464 4947 13074 4624 15784 13835 14603 24529
11810 24529 39911 33505 9811 11989 16962 6262 10062 23119 18430 -7556 -9161 -1890 8180
11797H180j997J1795k7158n224M624j5978k3088J1477J8779J3969k75l6289k2574
11784f3759j8990M811P308K0744J4335J9546K0843m34Q243m192q34J1475j6149
11771B947p412p918j8189K0815K0777M190j145j409j1992j3404K633J5567j2069
11758f609o879l04Q65P602k4597m684L9261K797j4384r597J1396P559Q472o383
11744D515l2399R845K7866R872p063n209j1455l351J4497P728O338j3699r417
11731a932K0228J0820K0514N56m1706k9022O922J1268j150J3385K389P899k0616
11718d45r819j690p4K206q795J2019r2J783j7524j0974K1310K4857L370j5286
11704H46j6972n306L025J8528J5952m486k546M414k0576j3509l90K0997J0553
$$ plain form
11797 8180 6183 17978 -9180 -14404 -9780 -25758 -48846 -37369 -18590 -4621 -4896 -41185 -63759
11784 -63759 -82749 -77938 -70630 -49886 -35551 -16005 4838 4404 12647 8455 7621 19096 2947
11771 2947 -4465 -12383 -30572 -9757 11020 15210 14065 12656 664 -12740 -10107 5460 -6609
11758 -6609 -13488 -13792 -12927 -5325 -29922 -34606 4655 7452 -6932 -16529 -5133 2426 10898 4515
11744 4515 -27884 -18039 9827 19699 12636 7427 -4028 -7379 7118 14846 21184 7485 -1932
11731 -1932 18296 29116 49630 50186 8480 -20542 -13620 -2352 -3502 9883 12272 20171 -445
11718 -445 -10264 -11954 -12028 -9822 -18617 -6598 -6690 -4907 -22431 -33405 -12095 12762 16132 846
11704 846 -16126 -21432 -18407 121 16073 11587 9041 13455 -7121 -20630 -21020 -23 10530
11691A0530k5378j9770J2939j4615P946J9183j7493j7594L4086O408N275Q878
11679A0395n416j582o301l6900m872P430M115Q273k25J8370K8797q861n869j6340
11665h986o799R3n435l143K0202m964P304K7086N65j2158k8152j0523J72N899
11651a8839L5786K0121O85J845j3069p722P995Q158j6417p876r152j8119k0877
11638c7481P978L6334J8819N03q624M791j7404q454J3550J8564p00K21o786k3542
11624b231R933L987m377r412J6767P70j2983Q698J0451J0364j8183M418Q371J6103
11610D2676o517J842J6387P675j2358j7267j7682j1871p497J3435J2640O986j0660
11597A7789q565L450l811p673O746J3178k0992q522N826j169j1849J3245p878
$$ plain form
11691 10530 -14848 -34618 -21679 -36294 -28348 -9165 -26658 -44252 -10166 -3758 1517 10395
11679 10395 4979 3397 -2904 -39804 -44676 -37246 -33131 -24858 -25083 -6713 22084 13223 7354 -8986
11665 -8986 -15785 -15692 -21127 -24270 -4068 -9032 -1728 25358 25923 13765 -14387 -24910 -24738 -18839
11651 -18839 16947 37068 37753 39598 26529 18807 26802 34960 18543 10667 1515 -16604 -37481
11638 -37481 -29503 6831 25650 26153 17529 22320 4916 -3538 10012 28576 27876 28097 21311 -2231
11624 -2231 7702 11689 7312 -2100 14667 15437 2454 11152 21603 31967 13784 18202 26573 42676
11610 42676 36159 38001 54388 62063 49705 32438 14756 2885 -4612 8823 21463 28449 17789
11597 17789 9224 12674 8863 1190 7936 21114 122 -8400 -2574 -3743 -15592 -2347 -10225
11584a0225J8946l732l1382M830K0835J1199j316J920q908j8214J1889q409K722
11571i845Q716J0279k5706k4471J7186l766k1604J2455P591J6974Q707J2305J6696
11558B5517p678p87K1567j6260j5681j1461L790O516r023j7409k0879Q418J5158
11545a8212J7295o825J0532R471j0881k422J071L31k624J0775M459p890J2147
11532A7227R309j5862L092J8279j818l2379n40o960j6196J892m953r455R024J0088
11518a9252r011P795K293M717K4834l5258k9266J2418J8027j1458J862J8646K3238
11505I585M54M779O332Q918q212k993J2914p827k5089o088O376o862M895P599
11491D781j7293o480r460P143M871l557O678K830p88l427N267n969R814J4274
$$ plain form
11584 -10225 8721 4989 -26393 -21563 -728 10471 9155 11075 2167 -16047 -4158 -12567 -9845
11571 -9845 -1129 9150 -16556 -41027 -23841 -27607 -49211 -36756 -29165 -12191 -3484 8821 25517
11558 25517 17839 17052 38619 22359 6678 -4783 -993 5523 -3500 -20909 -41788 -33370 -18212
11545 -18212 -917 -7742 2790 12261 1380 -1042 29 360 -2264 8511 12970 5080 17227
11532 17227 26536 10674 13766 32045 30227 -2152 -2692 -9652 -25848 -23956 -28909 -38364 -29340 -19252
11518 -19252 -28263 -20468 -18175 -13458 11376 -23882 -53148 -40730 -22703 -34161 -32299 -13653 9585
11505 9585 10039 14818 21150 30068 21856 18863 31777 23950 -1139 -7227 -851 -7713 -2818 4781
11491 4781 -12512 -18992 -28452 -21309 -16438 -19995 -13317 -10487 -11275 -14702 -9435 -15404 -5590 8684
11477H684q178j042M080N756K865Q35r552l523n457m677J0193K0201J722M20J0846
11462C3173m313o920Q001j3706l003o515N919J7529j1152q60J1600k92j7392j0764
11448A305J2439Q78m948n495j3357m315k831M453K352j0662J841J7991J6097j2009
11434C739l223j8623J4679k748j2359o09J1019J4759m864l1616j1416K4816K6405
11421I959J8879J2569j0754n203L161j6206j1829K621L796n355j9924j7513j7215
11408e3014J2145R681l181j3335k7432M455L2737j466L174J1480K349j5562J118
11395c6851K5530J9620j0660l3509m822N882L7920J1748j4191J1286m243l320
11383D390O54J0942Q995l962J507N915J422L114r135J1863K7208p92k2743k4432
$$ plain form
11477 8684 506 -536 3544 9300 12165 13000 3448 -75 -5532 -10209 -16 20185 21907 22327 33173
11462 33173 28860 21940 29941 16235 13232 6717 12636 30165 19013 18153 29753 29461 12069 1305
11448 1305 13744 14622 9674 4179 -9178 -13493 -16324 -11871 -9519 -20181 -18340 -349 15748 3739
11434 3739 516 -18107 -3428 -6176 -18535 -19144 -8125 6634 1770 -29846 -41262 -16446 9959
11421 9959 28838 41407 30653 25450 28611 12405 576 3197 6993 1638 -18286 -35799 -53014
11408 -53014 -40869 -31188 -34369 -47704 -75136 -70681 -37944 -39410 -36236 -24756 -22407 -37969 -36851
11395 -36851 -11321 8299 -2361 -35870 -40692 -34810 3110 14858 667 11953 7710 4390
11383 4390 5044 15986 24981 21019 22526 28441 29863 32977 23842 35705 62913 62121 39378 14946
11369A4946o082R719m324j5673j3879L282N440M513r4j3026L090J5495r366J32
11355e827j846p019M215J2501K583j6237P80N679j5444M137J2762Q608k824J0389
11341A2457j0660j3233p504j1595o925j5506J4760J2037J1634l172j810L772m782
11328b0527N136Q695R343M424j5528o724J401j2884M58J6960J1657j6779o244
11315b0612q873l146J3590p677J603R807P208m524Q366l046j1499k402J5181O150
11301A26P448j2095K050R998j5663L498L848K5864Q082R817j4264k4907j740j2029
11287i967O325R719P026J2450M636n222j0491j5706p05j7063j0133J9802Q292
11274a037l25J75q469j3825q952L0953J4057k9189k6889J1970Q850k0543q289
$$ plain form
11369 14946 8864 18583 14259 -1414 -15293 -12011 -6571 -2058 -2152 -15178 -12088 3407 -5959 -5827
11355 -5827 -7673 -14692 -10477 2024 4607 -11630 -10850 -5171 -20615 -16478 -3716 4892 2068 12457
11341 12457 1797 -11436 -18940 -30535 -37460 -52966 -38206 -26169 -14535 -17707 -19517 -15745 -20527
11328 -20527 -15391 -6696 2647 7071 -8457 -15181 -13780 -26664 -26206 -9246 2411 -14368 -20612
11315 -20612 -29485 -32631 -19041 -26718 -25115 -15308 -8100 -12624 -4258 -7304 -18803 -21205 -6024 126
11301 126 7574 -4521 -2471 7527 -8136 -4638 -790 25074 33156 42973 28709 3802 2062 -9967
11287 -9967 -3642 6077 13103 25553 30189 24967 14476 -1230 -1935 -18998 -29131 -9329 -1037
11274 -1037 -1362 -1187 -9656 -23481 -32433 -1480 12577 -16612 -43501 -31531 -22681 -43224 -51513
11261e1513J6075K6386J3109R25k6939K573j3094K676j1917N340J3565R400J0300
11248c114J0127j078k172j4704k0653j2920m717P252M3588J4331j4593j1718J6876
11235F505P958r175j9720j4055J9380m815k3982o801Q690K3299J192j2989j1803
11222c6316K155j0590j975N5206J8152j4647j0846P414q959n767j2352J9768L9170
11209D0413j2420k4094j6935r506p047M728P027o761q473J0330R168J9870Q564
11196A4864L556J1349j1565k0527r478q036j3988P88L2192J7488k2900j257O95
11183f819R363K3971P152k7780k0769j082n608N145j1152J228n34J4810J0336
11170a739K3127L656k0835j0636n001pJ1345J1333L498j3834m227L0750L809j5354
$$ plain form
11261 -51513 -35438 -9052 4057 4982 -21957 -19384 -32478 -29802 -41719 -36379 -22814 -13414 -3114
11248 -3114 7013 5935 3763 -10941 -31594 -44514 -49231 -41979 1609 15940 1347 -10371 6505
11235 6505 14463 5288 -14432 -28487 -9107 -13922 -37904 -44705 -36015 -12716 -11524 -24513 -36316
11222 -36316 -34161 -44751 -46726 8480 26632 11985 1139 8553 -406 -6173 -18525 1243 40413
11209 40413 27993 3899 -13036 -22542 -29589 -24861 -17834 -24595 -33068 -22738 -13570 6300 14864
11196 14864 18420 29769 18204 -2323 -11801 -19837 -33825 -33037 -845 16643 -6257 -7514 -6819
11183 -6819 2544 26515 33667 5887 -14882 -15964 -21572 -16427 -27579 -26351 -26885 -12075 -1739
11170 -1739 21388 25044 4209 -6427 -11428 -11435 -90 11243 14741 907 -3320 27430 31239 15885
11156A5885j1617j9500l455r906M092j2165p018J2105l289J4884j343p39j0795
11143c2861N416Q26J5801Q905K3199P714q269p235J692j232R031K1452J8934L206
11129F6579k1006m1886l4389O856K7396k99l525J7257K3517Q339m208k6705j9316
11116a390j135J4147J5670N026M960L213O606k6299j4684l573O256r801r068m303
11102a4375j1164Q085J2664J8358J2043j809r911J4340N131j0186j4779J633J405
11089A1435R271k0469j0541M718J2241Q488l765j3621q432o00r975k449K935n057
11075b5821q159j8244K8760K6759k2095j7973N845K6920J904j3794J7654J6682
11063A8438l87j0419j2978j3645n139J5688j5838J3594K0940R731k0569j6915
$$ plain form
11156 15885 4268 -15232 -18687 -28593 -24501 -36666 -43684 -31579 -34868 -19984 -21327 -22066 -32861
11143 -32861 -27445 -26619 -10818 -1913 21286 29000 20731 13496 15188 13956 22987 44439 63373 66579
11129 66579 45573 3687 -30702 -23846 3550 3251 -274 16983 40500 48839 44631 17926 -1390
11116 -1390 -2525 11622 27292 32318 37278 40491 47097 20798 6114 2541 8797 -1004 -10072 -14375
11102 -14375 -25539 -17454 -4790 13568 25611 23802 13891 28231 33362 23176 8397 10030 11435
11089 11435 20706 237 -10304 -5586 6655 15143 11378 -2243 -10675 -11275 -21250 -23699 -20764 -25821
11075 -25821 -33980 -52224 -23464 3295 -18800 -36773 -30928 -4008 -2104 -15898 1756 18438
11063 18438 18051 7632 -5346 -18991 -24130 -8442 -24280 -10686 10254 19985 -584 -17499
11051a7499K922j0743j0012O838K7768J9491r06r89m951K026j216j0096O454J4362
11037B3449q567p032j7893n697J1365P815j0722j2938P342K1466M476l4254o929
11024b8119P244L242K4607J4836J054j5782o616N659R577q157l3779k5746J1078
11011d0902L3084J8172j8134l4919j7958K5357N156P46J433K5951L707j0035N77
10998g765O509m343Q439Q495K1036p909j6685l868j3860k118O485M419j9488K8805
10984H152J2299j5683L19K4828j113j9726J3820K1053o909j0719j3333j5011r504
10971a1527J881R074k3181p114Q077O275P397Q950J4631J1554rM336P287p347
10957C0284J955M098j5224j6342Q29R491p279n926k743L456p87k5597N627L686
$$ plain form
11051 -17499 -14577 -25320 -35332 -28494 -726 18765 17859 16870 11919 13945 12729 2633 9087 23449
11037 23449 14882 7850 -10043 -15740 -4375 3440 -7282 -20220 -12878 8588 13064 -21190 -28119
11024 -28119 -20875 -17633 6974 21810 22864 7082 466 6125 15702 7545 -26234 -51980 -40902
11011 -40902 -7818 10354 -7780 -42699 -60657 -35300 -30144 -29398 -27965 -2014 1693 -8342 -7765
10998 -7765 -1256 -5599 2840 11335 32371 24462 7777 3909 -9951 -12069 -5584 -1165 -20653 8152
10984 8152 20451 4768 5087 29915 28802 9076 22896 43949 37040 26321 12988 -2023 -11527
10971 -11527 -9646 -572 -23753 -30867 -22790 -16515 -9118 -168 14463 26017 26008 30344 37631 30284
10957 30284 32239 36337 21113 4771 5600 15091 7812 1886 -857 2599 1812 -23785 -18158 -14472
10943a4472K5224K5324k826k2320r053j2482R180R801j2399l024J1377p30l559
10930D1P232K1783Q060j4437j5616o763Q81K193J2430K1234M686k21j4166j5745
10916A1592M139l101N679j3858k3117O78L1584L55k2933Q321L059j0229L905N826
10902A900N409m223m22J3174P664O76o287q790o586k986n765J708J9970Q708m375
10887A9775j2999m413j9781j3296L095J2576P610K2081k310o33R657P071n20L207
10873C1120j0133n793J225M884r359R50J7968J6627j852Q1m1601k8765L841J1733
10859i074m278j6013J4317J1363P67r527l664J6845o990J443N238j5879Q407J695
10845e350k736J2212J1259J1359j0453k0832P583L274j6572n823%o689n427P557
$$ plain form
10943 -14472 10752 36076 33250 10930 1877 -10605 -1425 8376 -4023 -7047 4330 3600 41
10930 41 7273 29056 37116 22679 7063 300 1181 3374 15804 37038 41724 41503 27337 11592
10916 11592 15731 12630 18309 4451 -18666 -17988 13596 13951 -8982 -661 2398 -7831 -3926 1900
10902 1900 7309 3086 2664 15838 23502 24178 17891 9101 2515 -471 -6236 -4528 15442 24150 19775
10887 19775 6776 2363 -17418 -30714 -27619 -15043 -7433 14648 12338 11705 21362 28433 27913 31120
10873 31120 20987 15194 16419 21303 11944 12894 30862 47489 45637 45718 4117 -24648 -20807 -9074
10859 -9074 -13352 -29365 -15048 -3685 -2918 -12445 -16109 736 -6254 -4811 427 -15452 -7045 -5350
10845 -5350 -8086 4126 15385 26744 16291 -4541 3042 6316 -10256 -16079 -16079 -22768 -28195 -20638
10831b0638J4602l275M921J1690O893j1165p482r54K8711J0885j6768k3291j2232
10818a8103o598J1554J4388O144r977k2399j7584j7109J3740K2993j542l111O052
10805b1552K2025J7101j713l68p857k5894j4623Q935J6753J6843L493J1546k661
10792B2028o99j0683j2156L997J9048j2826j1094p14k2944p131Q274p025O764
10779b5161J0507k2410O431J3807O279J8230K3594l227j2782j8026j7295J8027
10767b026m503n812J1602L404K163k4118Q871J2499j5722r625M969J6673j42K351
10753E84J6241J4696j999J7488n811j0470k325L89J6818l381m435k6282j075J8618
10739B9056Q247j512j3238o136K912M962j0453N361L713k618n442r623j7664L94
$$ plain form
10831 -20638 -6036 -9311 -4390 7300 14193 3028 -4454 -5408 23303 34188 17420 -5871 -18103
10818 -18103 -24701 -13147 1241 7385 -2592 -24991 -42575 -59684 -45944 -22951 -24493 -27604 -21552
10805 -21552 473 17574 15861 15493 7636 -18258 -32881 -23946 -7193 9650 13143 24689 22028
10792 22028 21329 10646 -1510 2487 21535 8709 -2385 -3099 -26043 -33174 -24900 -31925 -25161
10779 -25161 -14654 -37064 -30633 -16826 -10547 7683 31277 28050 15268 -2758 -20053 -2026
10767 -2026 -6529 -12341 -739 2665 4828 -19290 -10419 2080 -13642 -23267 -18298 -1625 -1767 584
10753 584 16825 31521 29522 47010 41199 30729 28404 28793 45611 42230 37795 11513 10438 29056
10739 29056 37303 35791 22553 16417 19329 24291 13838 19199 22912 20294 14852 5229 -12435 -12041
10725a2041K4384j338j2430R580m380q958k37L981O737J751r056O720q602K561
10711a328j7748J488J9880J7966J0851m657k3488J623p994k0243j2062O653J2059
10698a7000M424J7610l947k2123M652L409L243K6204J6209k2160n208O610O144
10685A8067r958q284j5837K273j8196q575J6888K282P476J8281m306J016J2475
10672A3602J9485j666N403J9540r352j5204k1682Q146k179m533j6689j4646q56
10659b0631q089n744K1756K2315J9439J1653o925j7555m058K953q353L183O734
10646A6678J2702J1791J7105l615l0208o601K2474j5808j6887K1123L518j8268
10634A4004K55k663j4134j9356J4107J0639R106j0261N157L490P812L043l294
$$ plain form
10725 -12041 12343 11005 -1425 8155 3775 -5183 -5420 -1439 5298 7049 -2007 4713 -3889 -1328
10711 -1328 -19076 -17588 2292 20258 31109 26452 2964 4587 -3407 -23650 -35712 -29059 -17000
10698 -17000 -12576 5034 1087 -21036 -16384 -12975 -9732 16472 32681 10521 5313 11923 18067
10685 18067 8109 -175 -16012 -13739 -31935 -40510 -23622 -21340 -13864 4417 111 1127 13602
10672 13602 33087 31421 36824 56364 47012 31808 10126 18272 16093 11560 -5129 -19775 -20631
10659 -20631 -28720 -34464 -12708 9607 29046 40699 33774 16219 12161 15114 6761 9944 16678
10646 16678 29380 41171 58276 54661 24453 17852 40326 24518 7631 28754 32272 14004
10634 14004 14259 11596 -2538 -21894 -7787 2852 11958 1697 6854 10344 18156 21199 17905
10621A7905j0752j365p197j6919r370o200L752J3142K4457l203o124l161j2908
10608a7943j4233j2567m093J0208Q949J060p304J3392L0621O630j2O323r0k730
10594A8211k6951j0360j643L1285j4984J4224L0115J4162p095j1173j1192K0659
10582D5258J5567J3167J3785j5041r299J250L282k71n080j1961k697N505P46N242
10568E9453k320N268k0980J997J0387j3819N185m412q402k1519j7432J0902Q205
10555A2513j2086j5549L012K1940K1310k2073j9666k794l233q222O153J4767m038
10542g966N354j0753N814J2438R111J3628p32l5376Q856L4799k972l244o560J4448
10528C6845n577k6267o900K180M941j0716j4744l855n200J3655J2157N284Q003
$$ plain form
10621 17905 7153 5788 -1409 -18328 -27698 -33898 -30146 -17004 7453 4250 -1874 -5035 -17943
10608 -17943 -32176 -44743 -48836 -38628 -29679 -28619 -35923 -22531 8090 14720 14708 21031 20941 18211
10594 18211 -8740 -19100 -20743 10542 -4442 9782 39897 54059 46964 35791 24599 45258
10582 45258 60825 73992 87777 72736 63437 64687 67969 67698 62618 50657 47960 53465 54211 59453
10568 59453 57133 62401 41421 43418 53805 39986 45171 40759 32357 10838 -6594 4308 12513
10555 12513 427 -15122 -12110 9830 31140 9067 -10599 -13393 -16626 -24848 -18695 -3928 -7966
10542 -7966 -2612 -13365 -7551 4887 13998 27626 26894 -8482 374 35173 32201 28957 22397 36845
10528 36845 31268 5001 -1899 281 5222 -5494 -20238 -24093 -29293 -15638 -3481 1803 9806
10515I806j6060j5732L396J7168J7052J4999K765O106j6476j3948q56J6749q416
10502A6553k392k1433J5273M381j2974j7159L0658L6881l52k6840j4266K192r485
10489A037n369K7317M353j742m479r594j8223L904R454o724n893J5535K7699J7542
10475E4817m167r438j2706j0606j9670K866J0601j2773j7304K5230L291K387j767
10462A0761k7465p487k132l306K2338J7687j110O323J2444N155j7128J002m248
10449A2834k3883k55L6022N38j9541Q977K629n077R700J9447M816j1438o502m668
10435B3599L995j5783j4285l573p978O828J0023M009r329l190J2797j0516j693
10422e096L365L167J3736j940l912j4958m441j908N128J502J3528K3672R507J0920
$$ plain form
10515 9806 -6254 -21986 -18590 -1422 15630 30629 33394 39500 23024 9076 8220 24969 16553
10502 16553 14161 -7272 8001 12382 -592 -17751 12907 49788 49436 22596 8330 10522 1037
10489 1037 -4332 22985 27338 25596 21117 11523 -6700 -2796 6658 -66 -5959 9576 37275 54817
10475 54817 50650 41212 28506 17900 -1770 1096 11697 -1076 -18380 6850 10141 12528 10761
10462 10761 -16704 -24191 -26323 -29629 -7291 10396 9286 15609 28053 33208 16080 17082 12834
10449 12834 -11049 -11304 24718 25256 5715 14692 17321 12244 21944 41391 46207 34769 28267 23599
10435 23599 27594 11811 -2474 -6047 -14025 -7197 2826 6835 -2494 -5684 7113 -3403 -5096
10422 -5096 -1731 1436 15172 13232 9320 -5638 -10079 -11987 -6859 -5357 8171 31843 41350 52270
10408E2270O376J826P176j1714k4873k6505k6656J4085K0745J1955L041j8252
10396I474J10N595J3459J3427j1592l2554L215j9677L880O338j2608LK3751K2024
10382B4845j1733r874j6873j3066O682p921O054J3399K1095J2874o482q096k9214
10369a8310j1205M646J0259Q619J4703L042k8167l109K0979L1527J404k6988l324
10356D076k930J1812J9949Q954K410o713k0949j272J1132k3526O553n097k28n05
10342C666o005J7063r59k8401j6066J0125R668r488L609J7287o848j9093Q260
10329a7182J4072q879j2506k3013Q208R064J6006L1447k075j5976L2896M3761
10317G5823L7368J2641L756J4278j4426j5285n712j1488J3868q038j9808j4742
$$ plain form
10408 52270 58646 60472 67648 55934 31061 4556 -22100 -8015 12730 24685 27726 9474
10396 9474 9584 15179 28638 42065 30473 -2081 1134 -18543 -14663 -8325 -20933 -20930 2821 24845
10382 24845 13112 3238 -13635 -26701 -20019 -27940 -21886 -8487 12608 25482 19000 10904 -18310
10369 -18310 -29515 -24869 -14610 -5991 8712 11754 -16413 -19522 1457 32984 34388 7400 4076
10356 4076 1146 12958 32907 41861 44271 37558 16609 15337 26469 2943 9496 4399 4171 3666
10342 3666 -2339 14724 13765 -14636 -30702 -20577 -10909 -20397 -16788 499 -6349 -25442 -17182
10329 -17182 -3110 -11989 -24495 -47508 -39300 -30236 -14230 17217 15142 -834 32062 75823
10317 75823 113191 125832 129588 143866 129440 114155 108443 96955 110823 102785 82977 68235
10305F8235M131j3362k4118M026j4050p330k56j463l735o987Q66K0492K1793j5083
10291C3159j3495K217n373Q174J0874j1483p319N841R293R613j090m271j2608
10278B3532K80n779j674J5382J5374J935j4066l2866O449j2720o546R516L527
10265B344R434J5999Q312k3904j7404J0350J0685k243J2148N44n441j7888J3241
10252A6177j1989K020k912L585k815j1079L710L7548K4204q300k9880j5392J1619
10239A6496J2138q890j057p887J3021r704k1311r873q1J7408M246L427J5285j3165
10225A0053n197L298l563L979R840P719j8313j0937Q30R683J1037j7511K40l220
10211b062N430O670K695Q258m931j6642j4479j0554P838M542K2155K0911M575
$$ plain form
10305 68235 72366 59004 34886 38912 24862 17532 17276 15813 12078 5091 5957 26449 48242 33159
10291 33159 19664 21881 16508 24682 35556 24073 16754 22595 31888 41501 40411 36140 23532
10278 23532 23812 18033 16359 31741 47115 49050 34984 2118 8567 -4153 -10699 -1183 2344
10265 2344 11778 27777 36089 12185 -5219 5131 15816 13573 25721 26265 20824 2936 16177
10252 16177 4188 6208 3296 6881 4066 -7013 -3303 34245 58449 50149 20269 4877 16496
10239 16496 28634 19744 18687 10800 23821 14117 -7194 -17067 -17148 260 4506 7933 23218 10053
10225 10053 4856 8154 4591 8570 18410 26129 7816 -3121 -2291 7392 18429 918 1158 -2062
10211 -2062 3368 10038 12733 20991 16060 -582 -15061 -25615 -17777 -13235 8920 29831 34406
10198C4406J1077J0618n507j9215k2172l509j2634j468K284Q478o795k0704j7206
10185d2347J1920J5914J968K960M97q98j1645J4842K7205l391j5709Q385J1605
10172B1306j0487m709p74R884n086J1473O731k1112k9139M398J3671M399j8801
10159a8246n681J2442K302K2155k609L879J576k2932J3241l139K725J6106j8396
10146C423j1209P43K132R252L454N610k2782j822m375o105J3196P202K3070Q985
10132C0774l920m361j5542m804K3358O770j5887k9548l520q738J3104O941j2655
10119a8028J2810N77Q104J0321m959j4939m785j0427r622R787J1421q988j238
10106a9966O055N410K4818j72p530l835j2068R209J0565L787n936J0460Q141N457
$$ plain form
10198 34406 45483 56101 50594 31379 9207 5698 -6936 -8404 -6120 2358 -4437 -25141 -42347
10185 -42347 -30427 -14513 -12545 -9585 -9088 -9986 -21631 -6789 20416 17025 1316 9701 21306
10172 21306 10819 6110 5336 15220 10134 21607 28338 7226 -21913 -17515 -3844 555 -18246
10159 -18246 -23927 -11485 -9183 12972 10363 14242 15818 -7114 6127 2988 5713 21819 3423
10146 3423 -7786 -7043 -4911 4341 7795 13405 -9377 -11199 -15574 -21679 -8483 -1281 21789 30774
10132 30774 26854 22493 6951 2147 25505 32275 16388 -13160 -16680 -25418 -12314 -5373 -18028
10119 -18028 -5218 -4641 3463 13784 8825 -6114 -10899 -21326 -30948 -21161 -9740 -18728 -19966
10106 -19966 -13911 -8501 16317 16145 8615 4780 -7288 1921 12486 16273 10337 20797 28938 34395
10092C4395r255k3414P518m900n170K733J2429q662p946K7447K566j0574n161
10079A2006j6371k5309J5678o409r996K452j9920k1093K9710K1037j2106J0573
10067a9748n19K6266J7874q944j1626J744J4510j0567Q245J9251o358k795p329
10054B0004p683l41n848L361j59M120M502J2204j5008j0516N052L1521j5700j5691
10040I818k032o197j4714M013j3160M10q273P298R530j1492R639K2259j11O444
10026A3432J5371j8562j5680J136K591j0271m547K0529m517r337M079O816J5957
10013A6997J3930j9896J3609J1541j9249k0426P156k163j0386M45r796K997M72
10000a4769Q250P946m738O909K995j1050j0716L342J2121q886M730R445J1720
$$ plain form
10092 34395 25140 1726 9244 4344 -826 1907 14336 5674 -2272 25175 27741 17167 12006
10079 12006 -4365 -29674 -13996 -20405 -30401 -27949 -47869 -68962 -39252 -18215 -30321 -19748
10067 -19748 -20267 5999 23873 14929 3303 5047 19557 8990 17235 36486 30128 27333 20004
10054 20004 12321 11980 6132 9493 9334 13454 17956 30160 15152 4636 9688 41209 25509 9818
10040 9818 7786 1589 -13125 -9112 -22272 -21862 -30135 -22837 -13307 -24799 -15160 7099 6988 13432
10026 13432 28803 10241 -5439 -4303 -1712 -11983 -16530 3999 -518 -9855 -5776 1040 16997
10013 16997 30927 11031 24640 36181 16932 -3494 3662 1499 -8887 -8442 -18238 -15241 -14769
10000 -14769 -6519 1427 -3311 3598 6593 -4457 -15173 -11831 290 -8596 -3866 5579 17299
9987A7299m99J8433K370j2880j6166j4681J5788J02p7j526o066l981J2440L654
9973A4210q687K625N983k1287j0921K3314J4469k063n626O618r169o883K703O592
9959A1878J3863O464M844j2841j9135k015n256m617O218o199P624P46j6688n376
9945b0490p181j3365K4424J8352K2773M3220j4378j0815l897j8715k1440j4851
9933a6363J6905P098j468J4727r206j3339R356O204p379p828k5930r293N117O118
9919b5281O675J3351J1406K626N481j1432j5965R398m413j0996Q345J2957K3663
9906B5815J0749p473j411N047l280j6374N06J2183j6960n627J895n573P673o52
9892F518n612j4991R528P639m188J4453M914L721N784m359j2305J6484J3395M936
$$ plain form
9987 17299 16800 35233 37603 24723 8557 -6124 9664 9766 9689 8163 2097 -1884 10556 14210
9973 14210 5523 8148 14131 -7156 -18077 5237 19706 17643 12017 18635 9466 2583 5286 11878
9959 11878 25741 32205 37049 24208 5073 3058 -2198 -6815 -597 -6796 828 1574 -15114 -20490
9945 -20490 -27671 -41036 -16612 1740 24513 67733 53355 42540 38643 19928 -1512 -16363
9933 -16363 542 7640 6172 20899 11693 -1646 7710 13914 6535 -1293 -27223 -36516 -31399 -25281
9919 -25281 -18606 -5255 6151 8777 14258 2826 -13139 -3741 -8154 -19150 -10805 2152 25815
9906 25815 36564 29091 27680 32727 29447 13073 13579 25762 8802 3175 5070 -503 7170 6518
9892 6518 906 -14085 -4557 3082 -1106 13347 18261 21982 27766 23407 11102 27586 40981 45917
9878D5917j2683J429Q604o42k95j0957l7874j6400k806O154K102Q380j49P782
9864a438j0016r060j1339R026K9537K4175j557j2509J894j9064r982q537K5752
9851F882L7098K6210J232k5321l5475o773N018m383k0968j843J0676J7389K9466
9838C9208l340r142k4535n623J5212K0511m445j423J4313k5871l2111K488k547
9825a7305J55J5055R725O434j7086j3593Q375q262r137Q43Q894P152J3119m865
9811d96m409k3140o603k639j861L1726J6334n099r682J7765N489j9927j9991K8789
9797F256j1995j4281J2395o233j4302J4691J4010J0111K44k3208j3868K1720J1139
9784F679r053k4857j242R966j5703k148R286m291K0818K4559J7853J0354j4745
$$ plain form
9878 45917 33234 34663 43267 42625 42330 31373 -6501 -22901 -25707 -19553 -17451 -9071 -9220 -1438
9864 -1438 -11454 -20514 -31853 -22827 6710 30885 29328 16819 18713 -351 -10333 -18870 6882
9851 6882 43980 70190 71422 46101 10626 3853 8871 4488 -16480 -18323 -7647 9742 39208
9838 39208 35868 26726 2191 -3432 11780 32291 27846 26423 40736 14865 -17246 -14758 -17305
9825 -17305 -17150 -2095 7630 14064 -3022 -16615 -8240 -16502 -25639 -24796 -15902 -8750 4369 -496
9811 -496 -4905 -28045 -34648 -37287 -39148 -7422 8912 3813 -5869 11896 17385 -2542 -22533 6256
9797 6256 -5739 -20020 -7625 -13858 -28160 -13469 541 10652 10896 -12312 -26180 -4460 6679
9784 6679 -2374 -27231 -28473 -18507 -34210 -36358 -27072 -31363 -10545 14014 31867 42221 27476
9771B7476l2945l926J9998m665K403l54k981J5273M010m938N156k5765l309r72
9757e539r309K28L87J2892J9422O139j3714l112J1348L684j291K186K193r811
9743A5703k1197J062L261n857K818j3335k1817J058J9449J5854k439p060j879
9730a4379K559P13l526j2093R942K2900k7M910O409Q838L183J080l476o149p575
9715A3309K9567r682k2712j6995J6729P797k54j3889l993j190J1291o543j5544
9702a2109q564K6570J8185J4260M50k719o768j8472l6891L833J3752k808K997
9689h284k65q176m918L75k2787p570K9311J5483J6536m952O1o857K049J3911m951
9674H966M515M274m785r684j0899o05J0565o028M618j991j7563J9237k519l1911
$$ plain form
9771 27476 -5469 -9395 10603 5938 8341 7987 5006 20279 24289 19351 24507 -1258 -4567 -5539
9757 -5539 -14848 -14620 -14233 -1341 18081 24220 10506 7394 18742 22426 21135 23321 25514 15703
9743 15703 -5494 -4432 -1171 -7028 -4210 -17545 -39362 -38304 -18855 -3001 -5440 -12500 -14379
9730 -14379 -11820 -11107 -14633 -26726 -16784 6116 6089 10999 17408 26246 29429 30509 27033 20884 13309
9715 13309 42876 33194 10482 -6513 10216 18013 17759 3870 -123 -1313 9978 3435 -12109
9702 -12109 -20673 5897 24082 38342 38792 36073 29305 10833 -26058 -22225 -8473 -11281 -8284
9689 -8284 -8549 -16725 -21643 -21268 -44055 -51625 -22314 -6831 9705 4753 4814 -2043 6 13917 8966
9674 8966 13481 17755 12970 3286 -7613 -8218 2347 -3681 937 -1054 -18617 620 -1899 -33810
9660c3810j1536K5629J4458j0800j662l538l847R324l854q012J6435j2397k8942
9647e2552J6717Q454j6165o465P550N425J8388K1592J1557j9786j3103o78K985
9634a6081P771M751K371j6586J106P50L68K654J3680m738k1521k2675J1737J0406
9620b6007j1347j9762M972K4631J7288L976K4892j0592r318j4947j6964k099O426
9607b8851J4813Q697k0997o548J6879R951l342n630l2850j4696J3803K9157O493
9594a3121n895l108j1598k461J9763R88p890j5747J8746J3671j3798J5261J7878
9581A2689j8882P085K431j1614q556j569j504L375K5003K2737n9j5689o958r314
9567h25p839k6225r55l201K6946L0021J5461Q10L399N80j4280m462j3604j0708
$$ plain form
9660 -33810 -45346 -19717 -5259 -16059 -17721 -21259 -25106 -15782 -19636 -27648 -11213 -23610 -52552
9647 -52552 -35835 -27381 -43546 -50011 -42461 -37036 -18648 2944 14501 -5285 -18388 -19066 -16081
9634 -16081 -8310 -3559 -1188 -17774 -16668 -15918 -15550 -12896 784 -3954 -25475 -48150 -36413 -26007
9620 -26007 -37354 -57116 -52144 -27513 -10225 -6249 18643 8051 -1267 -16214 -33178 -35277 -28851
9607 -28851 -14038 -5341 -26338 -32886 -16007 -6056 -9398 -15028 -47878 -62574 -48771 -19614 -13121
9594 -13121 -19016 -22124 -33722 -36183 -16420 -15432 -23322 -39069 -20323 -6652 -20450 -5189 12689
9581 12689 -6193 892 3323 -8291 -16847 -18416 -19920 -16545 8458 31195 31136 15447 8489 -825
9567 -825 -8664 -34889 -35844 -39045 -12099 17922 33383 34193 37592 38172 23892 19430 5826 -4882
9553d882J0603K1574j2016k2625j3644j6509j2372O323o884j0098K2211K6805
9541a1514q344k5277K2290M3614J6802j4205n2K311q879J2462J0993r049k0001
9528A1151j8625J1497K647j650l452R002m37r239K994K844k0359n41L510r496
9514b0154J2043N082K3353o677j5152J2021J4625l875p659p516j9295J398N363
9501f443k2725r881Q313J5687J4434N59J3767J1944k2561J091r867m567R160K618
9487A529J0213N652j0650o668J3319P805l805l581J7922n816l6638j4649J0227
9474a5140J0528K6505m325M418k2561j1147l586m0j779P574P369N184J4198j1069
9460F129j1575K2652k436j9263N025j114k1114K192q679L620Q146n400M597L953
$$ plain form
9553 -4882 5721 27295 15279 -7346 -20990 -37499 -49871 -43548 -50432 -60530 -38319 -11514
9541 -11514 -19858 -45135 -22845 20769 37571 23366 23314 25625 16746 29208 40201 31152 11151
9528 11151 -7474 4023 6670 5020 1568 10570 10133 894 3888 6732 -13627 -14168 -10658 -20154
9514 -20154 -8111 -3029 20324 13647 -1505 10516 25141 21266 13607 6091 -13204 -11806 -6443
9501 -6443 -29168 -39049 -30736 -15049 -615 -56 13711 25655 3094 4185 -5682 -10249 -1089 1529
9487 1529 11742 17394 6744 76 13395 21200 17395 13814 31736 25920 -10718 -25367 -15140
9474 -15140 -4612 21893 17568 21986 -575 -11722 -15308 -15348 -17127 -9553 -2184 3000 17198 6129
9460 6129 -5446 17206 14770 -4493 532 -582 -21696 -19504 -28183 -24563 -16417 -21817 -17220 -13267
9446a3267P250J2834J7512K661j6513o53J1849L306p86o372l2880j1868J9580
9433g347J3591k715k506r36k1324j0861P6r234K0727R412R168J1072J0492O835
9419B6450J3759k0701j0721P679j8504k0795o079j0295m775N71J0359J4083P670
9406a1299j7872m795K7704J3592P57M597R532L65n752N510Q136r876j6070J0031
9392A4560Q083p4O248P904p351N382L968j608l077j7161j1188j7078jj0126O480
9377a5039J9123R752o86j0457L934K6813R86j2617l522O791j8268r804P393j1647
9363g248R589l806j0535Q571J3014K3637l901r344k142R64j4682N320J2866N075
9349B7378k23n410o164N106l898J77N61k711j2620m127J4628K6132j7500L977
$$ plain form
9446 -13267 -6017 6817 24329 26990 10477 9824 21673 24979 24193 17821 -15059 -26927 -7347
9433 -7347 6244 3529 1023 87 -21237 -32098 -32022 -41256 -20529 -11117 -1949 9123 19615 26450
9419 26450 40209 19508 8787 16466 -2038 -22833 -28912 -39207 -43982 -43411 -33052 -18969 -11299
9406 -11299 -29171 -33966 -6262 7330 8087 12684 22216 22581 16829 22339 30475 20599 4529 14560
9392 14560 22643 22569 28817 36721 29370 34752 38720 37112 34035 16874 5686 -11392 -11393 -21519 -15039
9377 -15039 4084 13836 13150 2693 6627 33440 34426 21809 18287 25078 6810 -2994 4399 -7248
9363 -7248 2341 -1465 -12000 -3429 9585 33222 29321 19977 17835 18799 4117 9437 22303 27378
9349 27378 27155 21745 15581 20687 16789 16966 17527 14816 2196 -1931 12697 38829 21329 25306
9335B5306o140j5968N383K5989L470K87k1261K3217m729m614J0016j4534j4469
9322A1953j6041k044R507p496p36p974O53n405R101R384J1230L736J3241P637
9308C6746K572n613m845P527J9968l951k838J4869J8562j5244J6336R479l183
9295I0385j221Q804K3438P107p730M482p005J0931J6983J9229O619L42J7995K9794
9281B20153J6607L0281L3501M3297L9907P0639P8998Q9786J09548J52556J99507
9270A084780K66660L92611N87785R05579J387756J925572K188944J678443M67667
9261A0885797r70232j888277j869475j381941r37382o41087m60947l64998k73456
9252B098002k08958j81683j38140r5016q8148q3639o9082o4611m6543n2651n4051
$$ plain form
9335 25306 19166 3198 8581 34570 38040 38327 17066 40283 35554 30940 40956 26422 11953
9322 11953 -4088 -6132 3375 -4121 -4857 -12831 -12178 -17583 -8482 902 12132 15868 29109 36746
9308 36746 39318 33705 28860 36387 56355 52404 49566 64435 82997 67753 84089 93568 90385
9295 90385 89164 97968 121406 128513 120783 125265 118260 129191 146174 165403 172022 172364 190359 220153
9281 220153 236760 267041 300542 343839 383746 454385 533383 623169 732717 885273 1084780
9270 1084780 1351440 1744051 2331836 3237415 4625171 6550743 8739687 10418130 10885797
9261 10885797 9915565 8027288 6157813 4775872 3838490 3197403 2736456 2371458 2098002
9252 2098002 1889044 1707361 1569221 1474205 1386057 1302418 1233336 1168725 1122182 1069531 1015480
9241A015480n5154m6897l4216l7963l5032m7310j5208r689k4885j5592l4735j9192
9229F39607q641j6422k3688J5567k1240k7642k2717k7038l0704j6526j8291j1812
9217D30453K426o485j0036k785K42k4297l084j04j0910q470j35j9114m0796j5789
9203B91116j7211l264k8709j6589K1347m748j4692J707J3211K411k4660n656l64
9190B13899j4496j6564Q044O629j8673M628p417J6369j470j2429j7470o538j0542
9177A43970N186J3420j8106q310Q228J0696j6180j4638l11k982J4440J362j5546
9164A21229n944j2612R069j3578J1764N795m598j521K7143j4924j6405j0915J257
9151I5760q301k6456O748J3480O837L65p370r436q151J4089L455J966N576R892
$$ plain form
9241 1015480 960326 913429 879213 841250 806218 758908 743700 734011 709126 693534 658799 639607
9229 639607 630966 614544 590856 606423 585183 557541 534824 507786 477082 460556 442265 430453
9217 430453 432879 426394 416358 413573 413815 389518 386434 386330 375420 366950 366815 347701 306905 291116
9203 291116 273905 270641 241932 225343 246690 241942 227250 228957 242168 244579 219919 214263 213899
9190 213899 199403 182839 190883 197512 178839 183467 176050 192419 190949 178520 161050 154512 143970
9177 143970 149156 162576 144470 136160 144388 155084 138904 124266 123955 120973 135413 136775 121229
9164 121229 115285 102673 111742 98164 109928 115723 111125 109604 136747 121823 105418 94503 95760
9151 95760 87459 61003 67751 81231 88068 88433 81063 71627 63476 77565 81020 82986 88562 98454
9137I8454k3136j0355J9652j3669k2365J2190K3950R116j1607j4580r991r34j9625
9124C7100j8128L462O740n691n023m421L202l106j6296j2480L1713J5486k4249
9111H309J3269O142K380J5064J0187j0115l2525k1477O234J4369Q908j6327k5049
9098b0631P028q316K16o429J0082L1536O823J4035O359j2866l809j9895L738N334
9084A3205R438K2539L784k7222k506P61m736J1996M157J2629N650r901j2583J664
9070B8875j539n866J074L070j2688j5530Q005J4617p401j1749J2102O777m82J9761
9056C9026k275j7538P563J1922k2201j7371P578M795o861j1557m423r917K3851
9043B592K4809J0619J5948n811k0679p048j4107J4100J912j2732j532J0252O201
$$ plain form
9137 98454 75318 64963 84615 70946 48581 60771 84721 93837 82230 67650 57659 56725 37100
9124 37100 18972 22434 29174 23483 18460 14039 17241 14135 -2161 -14641 17072 32558 8309
9111 8309 21578 27720 30100 45164 55351 45236 12711 -8766 -2532 11837 20745 4418 -20631
9098 -20631 -13603 -21919 -21703 -28132 -18050 13486 20309 34344 40703 27837 24028 4133 7871 13205
9084 13205 22643 45182 48966 21744 19238 19999 15263 27259 31416 44045 49695 39794 27211 28875
9070 28875 27336 21470 22544 25614 12926 -2604 5401 20018 12617 868 12970 19747 19265 39026
9056 39026 36751 19213 26776 38698 16497 -874 6704 11499 4638 -6919 -11342 -21259 2592
9043 2592 27401 38020 53968 48157 27478 20430 6323 20423 22335 9603 8071 18323 24524
9030B4524M008k119m602k1615k3693J3644k2139j4693K9236L3179q745j3565P645
9017A065P752Qm408j5917M679K0640P235Q60o898p847o19R245P71P131r156k0095
9001e554r872l625j126P096L2841J0081n748j3152r791L060j0106m135J333q739
8987a7437j3759K31L4389O370J717K514p443o858J1271J0532j3692N823J3309
8974B6967j4865J2285L288l4646k299K761J2090P456j0929p888l789J558j584
8961i595j1821J3845P18n843j1614R440M753R251Q334j5652p367j4953K6863P447
8947C806j1044R394l241r456p980n480K170L2472j9643j0487L772J696K2872J8590
8933B7441m923K972n028J01o403p360J2914j4335M1J2139J4079k460Q831k4232
$$ plain form
9030 24524 28532 26413 21811 196 -23497 -9853 -31992 -46685 -17449 15730 6985 -6580 1065
9017 1065 8817 8825 4417 -11500 -6821 13819 21054 21914 15016 7169 6550 15795 16566 23697 14541 -5554
9001 -5554 -15426 -19051 -20177 -13081 19760 29841 24093 10941 1150 4210 -5896 -10031 -8698 -17437
8987 -17437 -31196 -30965 3424 9794 11511 14025 6582 -276 10995 21527 7835 13658 26967
8974 26967 12102 24387 27675 -6971 -9270 -6509 5581 13037 2108 -5780 -9569 -8011 -9595
8961 -9595 -21416 -7571 -6853 -12696 -24310 -14870 -10117 -866 7468 -8184 -15551 -30504 -3641 3806
8947 3806 -7238 2156 -1085 -10541 -18521 -24001 -21831 10641 -9002 -19489 -15717 -14021 8851 27441
8933 27441 22518 25490 20462 20563 14160 6800 19714 5379 5420 17559 31638 29178 38009 13777
8919A3777L031j5548k1523k0974K404L0147J2461J077M915J7859K686j5102j0759
8906D451J3230J3611j3606r170L649p746K554l050k7362J2001K0299J7907K400
8893B9168j7085j646L324q951p407J3819P054P637J822l776J2564j49j1071N7
8879B5360R460Q499j8235l2541q821o040J1703Q642K3543J0891j9608P126o762
8866A3217p358L873P594J6409j7692m6065P967K5726j632l4800l394J7173J7544
8853a438L0934R023l231j5119J0465K1698m952J757R76j8384k2935r60o079k1762
8839b0007M788K2653J9707j0178M648k251J4077L924N861o331k0950r497J1108
8826A7552P938k301j1736l3359R500K9161j901Q346M26j1639l2781j7598J9718
$$ plain form
8919 13777 16808 1260 -20263 -41237 -38833 -8686 3775 4852 9767 27626 30312 15210 4451
8906 4451 17681 31292 17686 8516 12165 4419 6973 3923 -23439 -11438 8861 26768 29168
8893 29168 12083 10437 13761 4810 -2597 11222 18276 25913 27735 23959 36523 36374 25303 25360
8879 25360 34820 43319 25084 -7457 -16278 -22318 -10615 -1973 21570 32461 12853 19979 13217
8866 13217 5859 9732 17326 33735 16043 -30022 -22055 3671 2039 -32761 -36155 -18982 -1438
8853 -1438 29496 38519 35288 20169 30634 52332 47380 49137 50113 31729 8794 7834 1755 -20007
8839 -20007 -15219 7434 27141 16963 21611 19360 33437 37361 43222 36891 15941 6444 17552
8826 17552 25490 23189 11453 -21906 -12406 16755 14854 23200 23626 11987 -20794 -38392 -18674
8813a8674J8633j1204p879j0186K195L885q847p739M374K5229n871K358O329J2705
8799E308J1165k0294l453N926N553J5017j3193j0188K0456j0140j2512O325j7345
8786a7375K2926J2037j1150o403P01M773J0106j392R930m402q058j5469m963m053
8772a2792j4400K011J5762K1445P259n924j60k4524r163J6589K8722L45o307j8710
8758A53l613O915n479O026R635j8379R519M53J988M103j5109J8088J2002l305
8744B2997p404j0990K665K123J7241k124Q40k88r622L676j9001R988j6414j6348
8730b2661K4502L478j4942j1185R193k1547K036J3096O286n93P931j0396j2362
8717b7164J7883M561r718n075J0615j531R457Q034J5036m669j173J942N654L4437
$$ plain form
8813 -18674 -41 -11245 -19124 -29310 -27115 -23230 -32077 -39816 -35442 -10213 -16084 -13726 -7397 5308
8799 5308 16473 -3821 -7274 -1348 4205 19222 6029 -4159 16297 6157 -6355 -30 -17375
8786 -17375 5551 17588 6438 35 736 5509 15615 14223 24153 19751 11693 -3776 -8739 -12792
8772 -12792 -27192 -25181 -9419 12026 19285 13361 13201 -11323 -20486 -3897 24825 25170 18863 153
8758 153 -3460 3455 -2024 4002 13637 -4742 4777 5230 7218 11321 -3788 14300 26302 22997
8744 22997 15593 4603 7268 9391 26632 24508 25348 25060 15438 19114 113 10101 -6313 -22661
8730 -22661 1841 5319 -9623 -20808 -11615 -33162 -31126 -18030 -11744 -12337 -4406 -14802 -27164
8717 -27164 -9281 -4720 -14438 -19513 -8898 -10429 -972 7062 22098 17429 16256 18198 23852 58289
8703E8289K5811j6279l1287o542j9101j2990j041k644j7828J906J3820J3337J8909
8690B4360Q999Q422J1046J6699r552Q077j2974j1285n747j6726O07l083j1286
8677G557j289P820r538q135n151P917L3935K0527k2190k4796k1535p050q117Q093
8663b1952J1456J0399L27k4351o201L515J5500J9628n772J145k6087k122L6703
8650A2188K8494j5474k3322L615J8409J3469j1721k9931P033p046l640R196O112
8637G382J1910l758p962K6779j2091k2961L214Q857L791j7528m893K3664j374
8624A5030j4393j4910k924J7121K6032J3100j2820j7643P394l56k6253L94k948
8611a3176K749J2546K2677J1952p915L603L318j6754L616K1838p872k4013O103
$$ plain form
8703 58289 84100 67821 36534 29992 10891 -2099 -3140 -5784 -23612 -21706 -7886 5451 24360
8690 24360 33359 41781 52827 69526 59974 68051 55077 43792 38045 21319 21926 18843 7557
8677 7557 6268 14088 4550 -3585 -8736 -819 33116 53643 31453 6657 -14878 -21928 -30045 -21952
8663 -21952 -10496 -97 230 -24121 -30322 -26807 -11307 8321 2549 3694 -22393 -24515 12188
8650 12188 40682 25208 1886 5501 23910 37379 25658 -4273 2760 -4286 -7926 1270 7382
8637 7382 19292 15534 7572 34351 22260 -701 2513 11370 15161 -2367 -7260 16404 15030
8624 15030 637 -14273 -17197 -76 25956 39056 26236 8593 15987 15631 -10622 -10228 -13176
8611 -13176 -10427 2119 24796 36748 28833 32436 35754 19000 22616 44454 36582 12569 18672
8598A8672p812k7542N247m214M091L3310O394O568J9112k513p390R471j4769k4332
8584A4293K7370J8906l618o859J2350J8538R561L6701J5509j2948J6721J8608
8572A65132J175l589j3988r766p823k0585k108j6095l1627j8278m085p25J8032
8559E5670k392N267Q398k444J2349L424r392j7253o161j0616O565K545j3300m502
8545B8158Q503k6039N236L728M9j8606m308K1551r888q838L352j8932M811Q745
8531b478M049M485m877n676L334N975M290J843o996L324p22j1315J4726J1650
8517B1612M215M510J0439r520p386j3703l507K3253J994r438P159j7108j0058
8504B462J0862Q302J7762j530l642n094R172K3389J8923k7523k59l0506j7933
$$ plain form
8598 18672 10860 -16682 -11435 -15649 -11558 21752 28146 34714 53826 51313 43923 53394 38625 14293
8584 14293 41663 60569 56951 50092 62442 80980 90541 127242 142751 129803 146524 165132
8572 165132 166307 162718 148730 138964 131141 110556 108448 92353 60726 42448 38363 37638 55670
8559 55670 53278 58545 66943 64499 76848 80272 70880 53627 47466 36850 43415 45960 32660 28158
8545 28158 36661 10622 15858 19586 19635 1029 -3279 18272 8384 -454 2898 -16034 -11223 -2478
8531 -2478 1571 6056 1179 -4497 -1163 4812 9102 10945 3949 7273 6551 -4764 9962 21612
8517 21612 25827 30337 40776 31256 23870 10167 6660 29913 31907 22469 29628 12520 2462
8504 2462 13324 21626 39388 37858 34216 29122 38294 61683 80606 53083 52824 22318 4385
8491D385O068l163m815K0968J4291k3962l805J9873j1398l647J4064N002K739
8478C6600K0456j1737k8992j262R39J4141o72j1478k0341r066r951L1889n106
8465E420p965J0580Q607l996R145L764R44L524j4078k131p006j3356J0841J7474
8451B1767L445j3474J830J0790J041j3544l1440n994J5497K286J2865J9951j1635
8438A3385k8628N984J3546l748J0588o745L095J0139q39j0613k570O480k131n864
8424B079K9026L264k4188p314j7376O145J2590J1621q211j9182p807R356K5541
8411A5544J2p618L499R754K1586r571j5479Q87j1760K1130J0488m465j1830p360
8397A4817j7481j3154M572Q070R681k480L551r847r090K503L297r265O750K1504
$$ plain form
8491 4385 10453 7290 2475 23443 37734 13772 9967 29840 18442 14795 28859 33861 36600
8478 36600 57056 45319 16327 15065 16004 30145 29473 17995 -2346 -11412 -21363 10526 5420
8465 5420 -2545 8035 16642 12646 21791 25555 26499 30023 15945 13814 6808 -6548 4293 21767
8451 21767 25212 11738 13568 24358 25399 11855 -19585 -25579 -10082 -7796 5069 25020 13385
8438 13385 -15243 -9259 4287 539 11127 4382 7477 17616 16777 6164 3594 10074 7943 2079
8424 2079 31105 34369 10181 2867 -14509 -8364 4226 15847 7636 -11546 -19353 -9997 15544
8411 15544 15556 7938 11437 21191 42777 33206 17727 18614 6854 27984 38472 34007 22177 14817
8397 14817 -2664 -15818 -11246 -3176 6505 4025 7576 -2271 -11361 -8858 -5561 -14826 -8076 13428
8383A3428n034j3646l241J3434K257j753K0572J3310j7962k861j589n851K0572
8370C1636j7500M738K9271J0687l3168j5527L662J125j6033R54j1899o866N898
8357a3022l366N091n615r205J5399J1308P107m377J1620N390O19O066J952j4253
8343A4714k2863p832j610R258J417L790R80k0209K3061k1605r955P175J7265j674
8329h088j5489K2664J7374N171J1720Q679P856m0271j6733M323Q458J2980L75
8316A9019r917k8796o701p941J7644K4593j4946J3564k0798n847j1497j7305J0303
8303c8625R116J9426R384J3211L209J0459N305j500j5386R96J5275J1096q492
8290C3474n015o88m005j6261N779K3239j3360k0813J7636r70n929r507k1960J082
$$ plain form
8383 13428 8394 -5252 -8493 4941 7198 5445 26017 39327 21365 18504 16915 11064 31636
8370 31636 14136 18874 48145 58832 25664 10137 13799 14924 -1109 -155 -12054 -18920 -13022
8357 -13022 -16388 -11297 -16912 -26117 -10718 590 7697 3320 14940 20330 20949 27015 28967 14714
8343 14714 -8149 -15981 -17591 -8333 -6916 -3126 -2146 -22355 706 -20899 -30854 -23679 -6414 -8088
8329 -8088 -23577 -913 16461 21632 33352 42031 49887 9616 -7117 -2794 5664 18644 19019
8316 19019 9102 -19694 -26395 -34336 -16692 7901 -7045 6519 -14279 -20126 -31623 -48928 -38625
8303 -38625 -29509 -10083 -699 12512 15721 26180 31485 29985 14599 15595 30870 41966 33474
8290 33474 28459 27771 23766 7505 13284 36523 23163 2350 19986 19016 13087 3580 -18380 -17298
8276a7298O705j4948r43L0552J4887j839j3794o474j1531j0669Q613K1023K472
8263F756J369j3211k8911j925K0464m413j544M507J0304K2218J9233j461j6740
8250A6646j0272K4320R526p860k2398k234M247J4542q341k1739j2117N579K5963
8237A5862M771j9326j0742K471j952N080k68J0039L5002j7310j4486l654q105
8224b618j2127r608M594p430m687J7450R218m247n238k2107R331J0332K992K4371
8210A0226R528j8005p874J6455J1078L088j6434j4444M994Q325n237K7034K014
8197C0748l193M125q500q125n392R235k15O274J8540l026K2920k108k4937j7393
8183A8953j3838j9577M764J1934P925l374r078o522N298k598O946N616q748J1659
$$ plain form
8276 -17298 -10593 -25541 -26484 4068 18955 17116 3322 -3152 -14683 -25352 -16739 4284 6756
8263 6756 8125 -5086 -33997 -35922 -15458 -19871 -21415 -16908 -6604 15614 34847 33386 16646
8250 16646 6374 30694 40220 32360 9962 7728 11975 26517 18176 -3563 -15680 -10101 15862
8237 15862 20633 1307 -9435 -6964 -8916 -3836 -4104 5935 40937 23627 9141 5487 -2618
8224 -2618 -14745 -24353 -19759 -27189 -31876 -14426 -5208 -9455 -14693 -36800 -27469 -17137 -14145 10226
8210 10226 19754 1749 -6125 10330 21408 24496 8062 -6382 -1388 6937 1700 28734 30748
8197 30748 27555 31680 23180 15055 9663 18898 18683 24957 43497 40471 63391 61283 36346 18953
8183 18953 5115 -14462 -9698 2236 10161 6787 -2291 -8813 -3515 -6113 833 6449 -2299 9360
8169I360L1512k243l1076n306K1096k3422k7142L081J8008Q110j1381J1795j2188
8156i796P958R706o501O713R253K833m89K723j4036N81k161K19j4243P863L0655
8141C1278o182j5971M21j3019n171j7670L647J8674m62j476J0767L617j441q582
8127a570n663J4236K3010J4722j3493j4548m869l6643o620J2105J6145J4384J2746
8114B3942o341J8195K258k5672p444J2438K891O362Q302k3097j980j871J5626
8101B3609j2537k532K2643j4379J5866K247k0599k2985J634R499j0233p773L267
8088a2273J9862R007J7269K0281j123j176m634p17R476l481j1838J389k5101K2998
8074C9939m423k1307J6045K77K1094J2184j2912j8943j6503P23K75j5756m497
$$ plain form
8169 9360 40872 38629 7553 2247 23343 -79 -27221 -24140 -6132 1978 -9403 2392 -9796
8156 -9796 -1838 7868 1367 8080 17333 20166 19677 22400 8364 8945 6784 7003 -7240 623 31278
8141 31278 25096 9125 9546 -3473 -8644 -26314 -22667 -3993 -4455 -5931 4836 8453 7012 -1570
8127 -1570 -7233 7003 30013 44735 31242 16694 11825 -24818 -31438 -19333 -3188 11196 23942
8114 23942 17601 35796 38054 12382 4938 17376 20267 26629 34931 11834 9854 7983 23609
8101 23609 11072 8540 31183 16804 32670 34917 14318 -8667 -7033 2466 -7767 -15540 -12273
8088 -12273 7589 16596 33865 54146 53023 51847 47213 46496 55972 52491 40653 42042 16941 39939
8074 39939 35516 14209 30254 30531 51625 63809 50897 31954 15451 16174 16449 693 -3804
8061c804j1932m440J1909K2342J1631O900q407p410J0092r501m305n007j8271
8048a0203j1441J6589L6685J7274k7419j8084J7602k022n541j0581L296r550j1314
8035a4709J3530K1439j2988K1996k366o104j796K2550J8332j3556m258q230j4345
8022A9495j141r138P736p35Q348J3070p481p377k201n006l3p597J1010Q514m392
8007B3072N191N736o627k0785j467l0617p704K6303J7318o528q920J0757R56J6756
7993B3441J6443K32k4908o444Q568O266R634k9199q156J9946J0487k465j3974
7980I871O810p775L336l814j0765j023J2971K2902j1447l898j7997k3153J5861
7967h121q44q395R55P327k547P99P297J6616J2582J729k814J6178j3273k1792
$$ plain form
8061 -3804 -15736 -20176 -8267 14075 25706 32606 24199 16789 26881 17380 13075 8068 -10203
8048 -10203 -21644 -5055 31630 48904 21485 3401 21003 18981 13440 2859 6155 -3395 -14709
8035 -14709 -1179 20260 7272 29268 26902 20798 19002 41552 59884 46328 42070 33840 19495
8022 19495 18354 9216 16952 16217 24565 37635 30154 22777 20576 15570 15537 7940 18950 27464 23072
8007 23072 28263 33999 27372 6587 5120 -25497 -33201 -6898 10420 3892 -5028 5729 6685 23441
7993 23441 39884 40116 15208 8764 17332 23598 33232 4033 -4123 15823 26310 23845 9871
7980 9871 16681 8906 12242 8428 -2337 -3360 9611 32513 21066 17168 -829 -23982 -8121
7967 -8121 -8965 -17360 -16405 -9078 -11625 -10826 -3529 13087 25669 27398 24584 40762 27489 5697
7953E697M153K5893K141j489K1001j827Q547K5093l585j4846O234j7643Q128m875
7939F2622l918n621N264q415j8093j0908J0420N132j0744r858k431k832O697J7398
7925C4713p251j1149J4447j6369k240J2306J9211J858L41L083j3200k8944j81
7912F625Q519j017q674J6404J0334j793J077M710l874m103K179K4518j2070l035
7898C9800J6077o213j1386j0496O997P801j6940k9704j5340J1347q450J0415J9023
7885A2931J4706J9828j9235l0320m854K0116q134K220l087m853K1146Q64M894
7872B6222j9322k831J6187N729m835j187j2198K34Q048J955r751q19J7519O701
7858C1652j3296j3655n14q012R067R201J512n645j3420J6487N255M91O545k5522
$$ plain form
7953 5697 9850 35743 37884 36395 57396 55569 64116 89209 85624 70778 77012 59369 67497 62622
7939 62622 58704 53083 58347 49932 31839 20931 31351 36483 25739 15881 13450 10618 17315 34713
7925 34713 27462 16313 30760 14391 12151 24457 43668 45526 45867 48950 35750 6806 6625
7912 6625 15144 14127 5453 21857 32191 30398 31475 36185 32311 28208 30387 54905 42835 39800
7898 39800 55877 49664 38278 27782 34779 42580 25640 -4064 -19404 -8057 -16507 -6092 12931
7885 12931 27637 47465 28230 -2090 -6944 13172 5038 7258 4171 -682 20464 21328 26222
7872 26222 6900 4069 20256 25985 21150 19963 7765 7999 16047 18002 8251 7432 24951 31652
7858 31652 18356 4701 4187 -3825 5242 14443 15955 10310 -3110 13377 18632 19123 25668 146
7844A46j5450J3408P267J337O171q637k70O948m821J0956n38j0157Q480k6527
7830a1687L953j43n600q235L409J2254q923O986J1848j6723k1217J9839L1371
7817A7132O072K610j116m921j4639O221J0403M668j4243j0432L235J0278K06j5403
7803G1J191k963J1643J2255q555k2023k2183O500J2092O597k287M760J6091O05
7789A3794L28j1041j2580J7077l17Q90k6029k0876J208K2313K1306M749Q009k7555
7775h724p74J8624j8818k0659k986j2508J168R44n241K3579K9228K1886j461J4384
7761C8642r838j6248o377k2504j774q467p149L5477J0199j438k389J3198K654
7748B3986k0467j7202Q092J9056P305j3150k236M925o330k3192K190j4689j7745
$$ plain form
7844 146 -15304 -1896 5371 6708 12879 4242 3972 10920 6099 17055 16517 6360 14840 -11687
7830 -11687 -7734 -7877 -13477 -21712 -18303 -6049 -14972 -7986 3862 -12861 -34078 -14239 17132
7817 17132 23204 25814 24698 19777 5138 11359 21762 26430 12187 1755 4990 15268 15474 71
7803 71 1262 -1701 9942 22197 13642 -8381 -30564 -24064 -11972 -5375 -7662 -2902 13189 13794
7789 13794 14122 3081 -9499 7578 7261 8151 -17878 -38754 -37546 -15233 6073 10822 18831 -8724
7775 -8724 -9498 9126 -9692 -30351 -33337 -45845 -44677 -43733 -48974 -25395 3833 25719 24258 38642
7761 38642 28804 12556 6179 -16325 -18099 -26566 -33715 1762 11961 10523 8134 21332 23986
7748 23986 3519 -13683 -5591 13465 20770 7620 5384 10309 3979 -19213 -17023 -31712 -49457
7735d9457J0691o499J798K9963N727K1133J4822k944j9697n659j6729q795O159
7722a9487J9235n551k815o975M366j7794K0769K2771M582J1572q886j2497l025
7709F265p954Q173j333j3670J1654p188J0774p177Q628p333l4994J0811N657k1322
7695c9009K564J8688k341J4570J0285Q985j2128K900J1590p05k279j0003j1941
7682h824J558J6848J7500r50L619k616k2294k3084K300K5662j5681l056K0679
7669A1661J6180Q769l2001j6798j0186J1174K6192j120j234j6316K69j1949j2398
7656b7757M558j7402k5085Q273K8492j0207J5631J4075r316P444O492j1700L629
7643a2873K3732M248J3643O001M488j4963k4525J386j0813L704P715r316j3309
$$ plain form
7735 -49457 -38766 -45265 -43467 -13504 -7777 13356 28178 25234 5537 -122 -16851 -25646 -19487
7722 -19487 -252 -5803 -8618 -15593 -11227 -29021 -8252 14519 19101 30673 21787 9290 6265
7709 6265 -1689 6484 5151 -8519 3135 -4053 6721 -456 8172 839 -34155 -23344 -17687 -39009
7695 -39009 -36445 -17757 -20098 -5528 4757 13742 1614 4514 16104 15399 13120 3117 -8824
7682 -8824 -7266 9582 27082 26132 29751 27135 4841 -18243 -15943 9719 -5962 -9018 11661
7669 11661 27841 36610 4609 -12189 -22375 -11201 14991 13871 12637 -3679 -3410 -15359 -27757
7656 -27757 -23199 -40601 -65686 -57413 -28921 -39128 -23497 -9422 -18738 -11294 -4802 -16502 -12873
7643 -12873 10859 15107 28750 34751 39239 24276 -249 1137 -9676 -5972 1743 -7573 -20882
7630b0882J1285M7209k210k9774l684l947j7663j215L049J0554J2616p058J116
7617f04R356m933j9084N164k3237q807M4950q22J2840M5964J6187j4644l2835
7604B9495k7330k2680K821O922O878o762O828k693o314P344M718N544N14k343
7590B942j7729l380R338p217J8178L2469L106j9943j4043k7094j2910J7856J5398
7577c029K516p790q43q307j5344N957J2805j5362o881Q969J1299p668J5249P862
7563e67j498j9202K295J3680J6626O298r157o044Q965K792L1j5849j9119N877
7549a4872P758M457j3029q391J2254K976j3975L917r942l008P032N72j5168J682
7535c7737J7301N606j3495J1796J1368N853j8919l988K0645R926j6852l4824L868
$$ plain form
7630 -20882 -9597 37612 35402 5628 1944 -2003 -19666 -20881 -17832 -7278 5338 -1720 -604
7617 -604 8752 3819 -15265 -10101 -33338 -42145 2805 1983 14823 60787 76974 62330 29495
7604 29495 2165 -20515 -17694 -10772 -3894 -10656 -3828 -6521 -12835 -5491 -773 4771 5285 2942
7590 2942 -14787 -18167 -8829 -16046 2132 34601 37707 17764 3721 -23373 -36283 -18427 -3029
7577 -3029 -513 -8303 -9146 -17453 -32797 -26840 -14035 -29397 -36278 -27309 -16010 -23678 -8429 -567
7563 -567 -2065 -21267 -18972 -5292 11334 17632 8475 2431 11396 14188 14219 -1630 -20749 -14872
7549 -14872 -7114 -2657 -15686 -24077 -11823 -8847 -22822 -18905 -28847 -31855 -24823 -24251 -39419 -37737
7535 -37737 -20436 -14830 -28325 -16529 -5161 692 -18227 -22215 -1570 8356 -8496 -43320 -39452
7522c9452L380J3358q36J05j2742m883r574M500J6250M799J5377J3763J9019o134
7508A6930N502O220j2358o122L221p544J2747K5767j6872r913N410j3112j5798
7495e922p773r615N4j725M376J0153J3607k462k4148l2739p311J8449J8932J1972
7481a4152j9877l532J2872J5239r34p394q602j003R185p37L848m322o649L850
7467b2208K4269N294m244J358K0166k4083l5107j2283K0450J1679J7225m600j1198
7454a3282J3408J953l601j2063m928J1855J5354j9545j3726j373j070K1475J1682
7441F139j998k0487j4385K3530L2923L889j296k1931j8080j846r326j555J9223
7428e200J0143k4458q762J2143j6433p930j2776J4450J7815m338p1m862J4782
$$ plain form
7522 -39452 -36072 -22714 -23550 -23445 -36187 -41070 -50644 -46144 -29894 -25095 -9718 4045 23064 16930
7508 16930 22432 28652 16294 10172 13393 5849 18596 44363 27491 17578 22988 9876 -5922
7495 -5922 -13695 -23310 -23256 -24981 -20605 -10452 3155 693 -23455 -56194 -63505 -45056 -26124 -14152
7481 -14152 -34029 -37561 -24689 -9450 -10384 -17778 -26380 -27383 -18198 -18935 -15087 -19409 -26058 -22208
7467 -22208 2061 7355 3111 4469 24635 552 -34555 -46838 -26388 -14709 2516 -2084 -13282
7454 -13282 126 2079 -1522 -13585 -18513 -6658 8696 -10849 -24575 -25948 -27018 -5543 6139
7441 6139 4141 -16346 -30731 -7201 25722 29611 28315 6384 -11696 -13542 -22868 -24423 -5200
7428 -5200 4943 -19515 -28277 -16134 -32567 -40497 -53273 -38823 -21008 -25346 -25417 -30279 -15497
7415a5497K3513O128m047O763m875k639k7753o220J0098J4648J4245k907K1194
7402C2651m164o328J5379p346j0126k3645j507J0430j2129M368K0529P272q849
7389A6535j8629L501J3653J0209p85k729k449m364q907m798n407m962L576J4569
7375I013L097R064m873m088m061n236J1976R782k5527k7550m645K7753L36R321
7361D362j4041j4237R494J7219j3430j8965p427K0242j0088Q38k810L285R27K6535
7347A904O972l421j0921L014o581k154L996p563j3339K7139j2506l336R44o151
7333b2003j2543O566R44m286k1673J9096K6138K2888O37k176m591r401m281j4528
7319a9213O813P856q202J0173J397j3607J5196M293l889j8026J2444Q26k140J9638
$$ plain form
7415 -15497 8016 14144 10097 16860 11985 9346 -18407 -24627 -14529 119 14364 11457 32651
7402 32651 28487 22159 37538 30192 20066 -3579 -5086 5344 -6785 -2417 18112 25384 16535
7389 16535 -2094 1407 15060 25269 24484 21755 19306 14942 6035 1237 -4170 -9132 -5556 9013
7375 9013 12110 21174 16301 12213 8152 2916 14892 24674 -853 -28403 -33048 -5295 -4959 4362
7361 4362 -9679 -23916 -14422 2797 -10633 -29598 -37025 -16783 -26871 -26033 -28843 -25558 -24631 1904
7347 1904 8876 5455 -5466 -2452 -9033 -11187 -7191 -14754 -28093 -954 -13460 -16796 -15852 -22003
7333 -22003 -34546 -27980 -27036 -31322 -52995 -33899 -7761 15127 15764 13588 8997 -404 -4685 -19213
7319 -19213 -12400 -4544 -12746 -2573 -1176 -14783 413 4706 817 -17209 -4765 -3939 -6079 13559
7305A3559O86N062k787R938M070j6563q725k1890k0539J848J5473P725n500j0152
7291b7795R782K0111J1284P916n61K617j0055j8980j2188J0598j4736J7512j270
7278e765j0938K631J9152l0337K13r33k877Q88J0146J0759L697k1013L607o593
7264b7363Q526O3Q270J5873j7689P315K928j8930Q889J567j5037K456P694o454
7250b1892J4202J1990n821o190K5785J3457r972j5952O171m921j1592P606j0830
$$ plain form
7305 13559 14245 19307 16520 26458 30528 13965 5240 -16650 -37189 -35341 -19868 -12143 -17643 -27795
7291 -27795 -18013 2098 13382 21298 20737 23354 13299 -5681 -17869 -7271 -22007 -4495 -5765
7278 -5765 -16703 -14072 5080 -25257 -25044 -25977 -28854 -27966 -17820 -7061 -3364 -24377 -20770 -27363
7264 -27363 -18837 -18774 -10504 5369 -12320 -5005 -2077 -21007 -12118 -10551 -25588 -23132 -15438 -21892
7250 -21892 -7690 4300 -1521 -7711 18074 31531 21559 5607 11778 6857 -4735 2871 -7959
$$ [...]
##END NTUPLES=NMR SPECTRUM
##END=
