##TITLE=Analysis number 315002
Compound Code cc 24601
Project Code adrs
Chemist Name synnovation
##JCAMPDX= 6.0         $$ Bruker NMR JCAMP-DX V2.0
##DATA TYPE= NMR SPECTRUM
##DATA CLASS= NTUPLES
##ORIGIN= Bruker BioSpin GmbH
##OWNER= NMR
$$ XWIN-NMR		Version 3.5
$$ Wed Nov  2 15:02:03 2005 GMT Standard Time (UT+0h)  MAYBRIDGE\NMR@NMR_250MHZ
##.OBSERVE FREQUENCY= 250.131544655141
##.OBSERVE NUCLEUS= ^1H
##.ACQUISITION MODE= SIMULTANEOUS (DQD)
##.ACQUISITION SCHEME= undefined
##.AVERAGES= 16
##.DIGITISER RES= 18
##SPECTROMETER/DATA SYSTEM= dpx250
##.PULSE SEQUENCE= zg30
##.SOLVENT NAME= DMSO
##.SHIFT REFERENCE= (INTERNAL, DMSO, 0, 16.522)
##AUDIT TRAIL= $$ (NUMBER, WHEN, WHO, WHERE, WHAT)
$$ ##TITLE= Audit trail, XWIN-NMR		Version 3.5
$$ ##JCAMPDX= 5.01
$$ ##ORIGIN= Bruker BioSpin GmbH
$$ ##OWNER= NMR
$$ C:\u/data/dgb/nmr/ADRS/11820/pdata/1/auditp.txt
$$ ##AUDIT TRAIL=  $$ (NUMBER, WHEN, WHO, WHERE, WHAT)
(   1,<2005-11-02 15:01:28.07 +000>,<MAYBRIDGE\NMR>,<NMR_250MHZ>,
      <created by zg, POWCHK disabled, PULCHK disabled
       configuration hash MD5:
       62 19 C7 07 E1 42 D1 B7 37 6C 3D D0 77 39 F9 E6
       data hash MD5: 64K
       E7 5E 76 47 01 58 C4 AC CA BD 0B FB 7B 78 37 4E>)
(   2,<2005-11-02 15:01:47.03 +000>,<MAYBRIDGE\NMR>,<NMR_250MHZ>,
      <Start of raw data processing
       ef LB = 0.3 FT_mod = 6 PKNL = 1 SI = 32K 
       data hash MD5: 32K
       51 E2 9E 5F 97 93 99 E6 2C E9 7A CE AF BD 6B 0E>)
(   3,<2005-11-02 15:01:48.97 +000>,<MAYBRIDGE\NMR>,<NMR_250MHZ>,
      <apk 
       data hash MD5: 32K
       29 59 B0 72 D9 4B 5F 1F 75 AB CB 96 BE D7 94 0C>)
(   4,<2005-11-02 15:01:50.07 +000>,<MAYBRIDGE\NMR>,<NMR_250MHZ>,
      <abs ABSG = 5 
       data hash MD5: 32K
       16 7E 71 4B 1A 89 3D EF E7 23 04 E7 54 2E BF AD>)
$$ ##END=
$$ 
$$ hash MD5
$$ 9B 73 0D 88 7F 13 CA 56 CC 14 D5 E8 97 74 38 C6
##$RELAX= 
##$RELAX= 
##$RELAX= 
##$RELAX= 
##$RELAX= 
##$RELAX= 
##$RELAX= 
$$ Bruker specific parameters
$$ --------------------------
##$DU= <C:\u>
##$EXPNO= 11820
##$NAME= <ADRS>
##$PROCNO= 1
##$TYPE= <nmr>
##$USER= <dgb>
##$AMP= (0..31)
100 100 100 100 100 100 100 100 100 100 100 100 100 100 100 100 100 100 
100 100 100 100 100 100 100 100 100 100 100 100 100 100 
##$AQSEQ= 0
##$AQ_mod= 3
##$AUNM= <au_zg>
##$AUTOPOS= <34 >
##$BF1= 250.13
##$BF2= 250.13
##$BF3= 250.13
##$BF4= 250.13
##$BF5= 500.13
##$BF6= 500.13
##$BF7= 500.13
##$BF8= 500.13
##$BYTORDA= 1
##$CFDGTYP= 0
##$CFRGTYP= 5
##$CHEMSTR= <none>
##$CNST= (0..31)
1 1 145 1 1 1 1 1 1 1 1 1 1 1 1 1 1 1 1 1 1 1 1 1 1 1 1 1 1 1 1 1 
##$CPDPRG= <>
##$CPDPRG1= <>
##$CPDPRG2= <>
##$CPDPRG3= <>
##$CPDPRG4= <mlev>
##$CPDPRG5= <mlev>
##$CPDPRG6= <mlev>
##$CPDPRG7= <mlev>
##$CPDPRG8= <mlev>
##$CPDPRGB= <>
##$CPDPRGT= <>
##$D= (0..31)
0 1 0 0 0 0 0 0 0 0.06 0 0 0 0 0 0 0.0002 0 0 0 0 0 0 0 0 0 0 0 0 0 0 
0 
##$DATE= 1130943686
##$DBL= (0..7)
120 120 120 120 120 120 120 120 
##$DBP= (0..7)
150 150 150 150 150 150 150 150 
##$DBP07= 0
##$DBPNAM0= <>
##$DBPNAM1= <>
##$DBPNAM2= <>
$$ [...]
##$SUBNAM6= <"">
##$SUBNAM7= <"">
##$SUBNAM8= <"">
##$SUBNAM9= <"">
##$SW= 20.6930455092707
##$SWIBOX= (0..15)
0 0 3 0 0 0 0 0 0 0 0 0 0 0 0 0 
##$SW_h= 5175.983436853
##$TD= 65536
##$TD0= 1
##$TE= 295.16
##$TE2= 300
##$TE3= 300
##$TEG= 300
##$TL= (0..7)
0 120 120 120 120 120 120 120 
##$TP= (0..7)
150 150 150 150 150 150 150 150 
##$TP07= 0
##$TPNAME0= <>
##$TPNAME1= <>
##$TPNAME2= <>
##$TPNAME3= <>
##$TPNAME4= <>
##$TPNAME5= <>
##$TPNAME6= <>
##$TPNAME7= <>
##$TPOAL= (0..7)
0.5 0.5 0.5 0.5 0.5 0.5 0.5 0.5 
##$TPOFFS= (0..7)
0 0 0 0 0 0 0 0 
##$TUNHIN= 0
##$TUNHOUT= 0
##$TUNXOUT= 0
##$USERA1= <user>
##$USERA2= <user>
##$USERA3= <user>
##$USERA4= <user>
##$USERA5= <user>
##$V9= 5
##$VALIST= <valist>
##$VCLIST= <CCCCCCCCCCCCCCC>
##$VD= 0
##$VDLIST= <DDDDDDDDDDDDDDD>
##$VPLIST= <PPPPPPPPPPPPPPP>
##$VTLIST= <TTTTTTTTTTTTTTT>
##$WBST= 1024
##$WBSW= 4
##$XGAIN= (0..3)
0 0 0 0 
##$XL= 0
##$YL= 0
##$YMAX_a= 503879
##$YMIN_a= -444311
##$ZGOPTNS= <>
##$ZL1= 120
##$ZL2= 120
##$ZL3= 120
##$ZL4= 120
##$ABSF1= 16.522
##$ABSF2= -4.171173
##$ABSG= 5
##$ABSL= 3
##$ALPHA= 0
##$AQORDER= 0
##$ASSFAC= 0
##$ASSFACI= 0
##$ASSFACX= 0
##$ASSWID= 0
##$AUNMP= <proc_1d>
##$AZFE= 0.1
##$AZFW= 0.1
##$BCFW= 0
##$BC_mod= 0
##$BYTORDP= 0
##$COROFFS= 0
##$CY= 12.5
##$DATMOD= 1
##$DC= 0
##$DFILT= <>
##$DTYPP= 0
##$F1P= 14.0000005364418
##$F2P= -0.99999901652339
##$FCOR= 0.5
##$FTSIZE= 32768
##$FT_mod= 6
##$GAMMA= 0
##$GB= 0
##$INTBC= 1
##$INTSCL= 1
##$ISEN= 128
##$LB= 0.3
##$LEV0= 0
##$LPBIN= 0
##$MAXI= 10000
##$MC2= 0
##$MEAN= 0
##$ME_mod= 0
##$MI= 0
##$NCOEF= 0
##$NC_proc= -5
##$NLEV= 6
##$NOISF1= 0
##$NOISF2= 0
##$NSP= 0
##$NTH_PI= 0
##$NZP= 0
##$OFFSET= 16.522
##$PC= 1
##$PHC0= 60.79343
##$PHC1= 7.48522
##$PH_mod= 1
##$PKNL= yes
##$PPARMOD= 0
##$PSCAL= 4
##$PSIGN= 0
##$REVERSE= no
##$SF= 250.13
##$SI= 32768
##$SIGF1= 0
##$SIGF2= 0
##$SINO= 400
##$SIOLD= 32768
##$SREGLST= <1H.DMSO>
##$SSB= 0
##$STSI= 32768
##$STSR= 0
##$SW_p= 5175.98343685301
##$SYMM= 0
##$S_DEV= 0
##$TDeff= 65536
##$TDoff= 0
##$TI= <Analysis number 999999
Compound Code 99
Book Reference 9
Project Code 9>
##$TILT= no
##$TM1= 0
##$TM2= 0
##$TOPLEV= 0
##$USERP1= <user>
##$USERP2= <user>
##$USERP3= <user>
##$USERP4= <user>
##$USERP5= <user>
##$WDW= 1
##$XDIM= 32768
##$YMAX_p= 386637135
##$YMIN_p= -462549
$$ End of Bruker specific parameters
$$ ---------------------------------
##NTUPLES= NMR SPECTRUM
##VAR_NAME=  FREQUENCY,     SPECTRUM/REAL,   SPECTRUM/IMAG
##SYMBOL=    X,             R,               I
##VAR_TYPE=  INDEPENDENT,   DEPENDENT,       DEPENDENT
##VAR_FORM=  AFFN,          ASDF,            ASDF
##VAR_DIM=   32768,         32768,           32768
##UNITS=     HZ,            ARBITRARY UNITS, ARBITRARY UNITS
##FACTOR=    0.157963299565203, 1,           1
##FIRST=     4132.6476996994, 0,             0
##LAST=      -1043.33573715361, 0,           0
##MIN=       -1043.33573715361, -462549,     0
##MAX=       4132.6476996994, 386637135,     0
$$ Real data points
##PAGE= N=1
##DATA TABLE= (X++(R..R)), XYDATA
$$ [...]
17132D6232k4154p1130P2221o5587R2973O0130P975k9148m965j76130r6006K4772
$$ 46232 22078 -49052 23169 -42418 50555 110685 118660 89512 84547 -91583 -187589 -162817
17120a62817m086R876j7858J02453N9636j02036m0940R3625J35627N690q3944
$$ -162817 -166903 -157027 -174885 -72432 -12796 -114832 -155772 -62147 73480 79170 -4774
17109d774j31143J64035J47417l8671o4460q8814J9265J05496Q222o1779N4827
$$ -4774 -135917 28118 175535 136864 72404 -16410 2855 108351 116573 54794 109621
17098A09621M5510p7279p1165p4825J4392o95k6862P9400Q5978j14345J0621j17858
$$ 109621 155131 77852 6687 -68138 -53746 -54441 -81303 -1903 84075 -30270 -19649 -137507
17086a37507j22642J5716N9751o7786N3261j6813k5704K2678J2589M4013N812
$$ -137507 -260149 -244433 -184682 -252468 -199207 -216020 -241724 -219046 -206457 -162444 -156632
17075a56632O7380j17208o5932n4523R3958P2294P8685P8236j4797P22M3056J604
$$ -156632 -89252 -206460 -272392 -326915 -232957 -160663 -81978 -3742 -18539 -17817 25239 26843
17063B6843K1882p7052M7445N6035m0084n2409J3159k6125J754N1017j04915j33527
$$ 26843 48725 -28327 19118 75153 35069 -17340 -4181 -30306 -28552 22465 -82450 -215977
17051b15977p1592J50554J91j33253l9248Q6296J38412J4561k7795J2474L8901
$$ -215977 -287569 -137015 -136824 -270077 -309325 -223029 -84617 -70056 -97851 -85377 -46476
17040d6476P8738q1758r8781P4607R335M3886m7930m0931J06907O0809J1397P5174
$$ -46476 32262 -49496 -148277 -73670 -64335 -20449 -68379 -109310 -2403 58406 69803 144977
17028A44977m7214r2362o7069j2000M5931O1017m3774n2725m2989N578m8765J9967
$$ 144977 97763 5401 -61668 -73668 -27737 33280 -10494 -63219 -106208 -100630 -149395 -129428
17016a29428n4042k118J03961Q2747J11197m9047K5361k5794M6131J19833L5017
$$ -129428 -183470 -185588 -81627 1120 112317 63270 88631 62837 108968 228801 263818
17005B63818K4365k1365J01056k15677o6409P0415q5553k396o4478o3120J11498
$$ 263818 288183 266818 367874 152197 85788 156203 70650 68254 3776 -59344 52154
16994E2154J18828p9668p6204L9567m1768n6518J6229N0870Q3931R3171m2207
$$ 52154 170982 91314 15110 54677 12909 -43609 -27380 23490 107421 200592 158385
16983A58385j9083J44728M2117l5754j2552q2725L0319N7403K8454k8023r249
$$ 158385 139302 284030 326147 290393 277841 195116 225435 282838 311292 283269 274020
16972B74020k5728J06158M6122R998j6871j10662l794J8378l7272p3597n4334
$$ 274020 248292 354450 400572 410570 393699 283037 279243 297621 260349 186752 132418
16961A32418N1267K03256N7622J4311o8231p4304m4099j3412m0193n6901j36806
$$ 132418 183685 386941 444563 458874 390643 316339 272240 258828 218635 161734 24928
16950B4928j01615j0786l0330J4756m710N8604J38370l0926Q1038j624j3358j06746
$$ 24928 -76687 -87473 -117803 -103047 -107757 -49153 89217 58291 139329 137705 124347 17601
16938A7601k5434l9156k0369o399J05332R548R4630J72539L7818R209m7737K12350
$$ 17601 -7833 -46989 -67358 -73757 31575 41123 135753 308292 346110 355319 307582 519932
16926E19932N6755j64762j17783p9192n8805n8363j5256m5064p4747L6349J8052
$$ 519932 576687 411925 294142 214950 156145 97782 82526 37462 -37285 -936 17116
16915A7116m4466n8580q6582n8730M124J86852P8548k3600m2267M6196q018l434
$$ 17116 -27350 -85930 -172512 -231242 -227118 -40266 38282 14682 -27585 18611 10593 7159
16903G159j18870p6088N1701r1751p4803l0532m64j5065R5510O7761M0365J2714
$$ 7159 -111711 -187799 -136098 -227849 -302652 -333184 -333648 -348713 -253203 -185442 -145077 -132363
16891a32363N2564p136o0286o7813m937L168m3923N0778J02613n9996j0980N3275
$$ -132363 -79799 -86935 -147221 -215034 -219971 -216803 -260726 -209948 -107335 -167331 -178311 -125036
16879a25036l7934K4251O7889K5567R444N4457M7082Q266k1846p3580j25663n9504
$$ -125036 -162970 -138719 -70830 -45263 -35819 18638 65720 73986 52140 -21440 -147103 -206607
16867b06607M8389L1215K8814P594j18896N120o926Q4056J58933m4509j29241
$$ -206607 -158218 -127003 -98189 -90595 -209491 -204371 -211297 -127241 31692 -12817 -142058
16856a42058n5129Q0734J5128k652k1635m7580j02550O2790J00818O0889k051
$$ -142058 -197187 -116453 -101325 -103977 -125612 -173192 -275742 -212952 -112134 -51245 -53296
16845e3296q347P8335j4077L5479Q2635q1077j07132K2084J23915M7272q6238
$$ -53296 -61643 16692 2615 38094 120729 39652 -67480 -45396 78519 125791 39553
16834C9553j35221k6856O4255N3998j01020n5566l6283L4873P7274L1119j8658
$$ 39553 -95668 -122524 -58269 -4271 -105291 -160857 -197140 -162267 -84993 -53874 -72532
16823g2532Q4790n0899N9625M0236r5215p5360l4275m7216K7804N4233o4876L5133
$$ -72532 12258 -38641 20984 61220 -33995 -109355 -143630 -190846 -163042 -108809 -173685 -138552
16811a38552O3057k3927J8451Q735j287P0777K0095J9717m3832j25050j20553
$$ -138552 -75495 -99422 -80971 -72236 -73523 -2746 17349 37066 -6766 -131816 -252369
16800b52369L2061J67302O2589M3215k9406r7759l1180j16838n5913J03352J15203
$$ -252369 -220308 -53006 9583 52798 23392 -74367 -105547 -222385 -278298 -174946 -59743
16789e9743L9265m1249p2848K6091M1663R0893P3707j85799n0773L5219P3664
$$ -59743 -20478 -61727 -134575 -108484 -66821 24072 97779 -88020 -138793 -103574 -29910
16778b9910K4393J14394j26446o1621R3234J42147Q7827j46672j28193j88l4860
$$ -29910 -5517 108877 -17569 -79190 14044 156191 244018 97346 -30847 -31035 -65895
16767f5895j47844l0320j11518J0617P8286O372m9553J7800Q9563J52275L9964
$$ -65895 -213739 -244059 -355577 -344960 -266674 -260302 -309855 -292055 -202492 -50217 -10253
16756a0253p1275j42746J8639J2421N6691O385K354j446m495Q244M6764R1131
$$ -10253 -81528 -224274 -205635 -193214 -136523 -130138 -127784 -129230 -133725 -125481 -78717 12414
16744A2414j7894j11400J6385J12669P2219M6811r6630k9207Q0391K6824N3917
$$ 12414 -5480 -116880 -100495 12174 84393 131204 34574 5367 85758 112582 166499
16733A66499k4642j20414j74002l5436L4985J3992J04440l8660k746P5277n5389
$$ 166499 141857 21443 -152559 -187995 -153010 -139018 -34578 -73238 -75984 -707 -56096
16722e6096N2821J07276p1682j50625L0262L6692m9301j3802J1845J1645J10442
$$ -56096 -3275 104001 32319 -118306 -88044 -51352 -100653 -114455 -102610 -90965 19477
16711A9477j1904J20458L6861k19477r6956k6752J41115Q8236j39950K7549O6743
$$ 19477 7573 128031 164892 -54585 -151541 -178293 -37178 51058 -88892 -61343 5400
16700E400p8919j08824M6961m5168l7296p1609L3660l2533Q9484J67240k2188
$$ 5400 -73519 -182343 -135382 -180550 -217846 -289455 -255795 -288328 -198844 -31604 -53792
16689e3792p4296m2584Q1608J32204r142j40884K8245J25090J40819o0305j57302
$$ -53792 -128088 -170672 -89064 43140 33998 -106886 -78641 46449 187268 126963 -30339
16678c0339j28509j5021K0488k4236L0198O7340N2476j2548o3349K8397Q2736
$$ -30339 -158848 -173869 -153381 -177617 -147419 -80079 -27603 -40151 -103500 -75103 7633
16667G633N2147L7675k0300J2954j31859p5157j34056p8779J363K01492K4081
$$ 7633 59780 97455 77155 90109 -41750 -116907 -250963 -329742 -328379 -126887 -102806
16656a02806q8338q4029J1135P7966K5093N7808n1515m5141j2192P6805m4002
$$ -102806 -191144 -275173 -264038 -186072 -160979 -103171 -154686 -199827 -212019 -135214 -179216
16645a79216j36455R8380K580K722Q9606L1467k5625K5302K6109p3389n1761N2003
$$ -179216 -315671 -217291 -214711 -211989 -122383 -90916 -116541 -91239 -65130 -138519 -190280 -138277
16633a38277p438n197m3587M5100K2372l0719l5232L6334O4778M3170j62242k7892
$$ -138277 -145715 -150912 -194499 -149399 -127027 -157746 -192978 -156644 -91866 -48696 -210938 -238830
16621b38830P4430L1996P5858K1911J172R2943N6569k04854j19852l6096J7989
$$ -238830 -164400 -132404 -56546 -34635 -33463 59480 116049 -88805 -208657 -244753 -226764
16610b26764L1420p454j6789J12908L1634j1237l8934N3822m730n8825m6238N7785
$$ -226764 -195344 -202798 -219587 -106679 -75045 -86282 -125216 -71394 -76124 -134949 -181187 -123402
16598a23402n6928j3361Q1158M1072K9657p7095j41288n4909Q1854N0240L9748
$$ -123402 -180330 -193691 -112533 -71461 -41804 -118899 -260187 -315096 -233242 -183002 -143254
16587a43254L1084M2756j79173o2059R9517J5435J20942N6122j87923o1004L2416
$$ -143254 -112170 -69414 -248587 -310646 -211129 -195694 -74752 -18630 -206553 -267557 -235141
16576b35141N1195O9496Q7438r5172p6919n481R6282L3563j11052j3757Q2671
$$ -235141 -183946 -114450 -27012 -122184 -199103 -204584 -108302 -74739 -185791 -199548 -116877
16565a16877L3280P9675n1324n7884N1810q78P7377R4704O019j04718O1561Q9292
$$ -116877 -83597 -3922 -55246 -113130 -61320 -62198 15179 109883 115902 11184 72745 162037
16553A62037j30598j16183R7793p459p6540J03874L5481r8411j05499M6827J48534
$$ 162037 31439 -84744 13049 5590 -70950 32924 68405 -30006 -135505 -88678 59856
16542E9856j815m9132r4378n6773M1971o0825n4511K3666O294N1032J6461L5371
$$ 59856 58041 8909 -85469 -142242 -100271 -161096 -215607 -191941 -185647 -134615 -118154 -82783
16530h2783o2646O5532R8962N1035j6938K040l3092O7667k8092l1686q3385r175
$$ -82783 -145429 -79897 19065 70100 53162 55202 22110 89777 61685 29999 -53386 -62561
16518f2561N6251M6449J2164j7656k37659j50711J75385J41767L5551k0638k2136
$$ -62561 -6310 40139 52303 34647 -203012 -353723 -178338 -36571 -1020 -21658 -43794
16507d3794l8647o8106k2666J41410J17833n7336k06269l8259L9178n6001J28196
$$ -43794 -82441 -150547 -173213 -31803 86030 28694 -177575 -215834 -176656 -232657 -104461
16496a04461R1351Q997j17525k4748J0517J29440r6641n4504J10921l3763l2022
$$ -104461 -13110 -4113 -121638 -146386 -135869 -6429 -103070 -157574 -46653 -80416 -112438
16485a12438j6772j13418P4694N9508l2910M9688J07679P3631m8777j696m4548
$$ -112438 -129210 -242628 -167934 -108426 -141336 -91648 16031 89662 40885 39189 -5359
16474e359l218k7227L9582q291n9898J19477n2536j82107n8538l5660K19806J28903
$$ -5359 -8577 -35804 3778 -4513 -64411 55066 2530 -179577 -238115 -273775 -53969 74934
16462G4934m9988k7292j9700J0145o4790r7244K4665r3858p7145N6371J44865
$$ 74934 24946 -2346 -22046 -11901 -76691 -173935 -149270 -243128 -320273 -263902 -119037
16451a19037J19476J23620q720j18373j00815l2557J510P4752m9051L0122N137
$$ -119037 439 124059 115339 -3034 -103849 -136406 -134896 -60144 -109195 -79073 -73936
16440g3936N9722J6774p8173m3565M8228J00957j4268q3055j3535O7929O2706
$$ -73936 -14214 2560 -75613 -119178 -70950 30007 15739 -67316 -80851 -12922 49784
16429D9784J01504P0736p0100j16709l4352J3150j35644M8830P0132J4257p4455
$$ 49784 151288 222024 151924 35215 863 14013 -121631 -72801 -2669 11588 -62867
16418f2867K9528K7787j8288K629J30082J7751j01944o7795M0123m2402p3478
$$ -62867 -33339 -5552 -23840 -21211 108871 126622 24678 -43117 -2994 -45396 -118874
16407a18874L6357J28246P4041O448j84108o2396N919j09589M3892L4823L6471
$$ -118874 -82517 45729 119770 126218 -57890 -120286 -114367 -223956 -180064 -145241 -108770
16396a08770k5712R6885O1918n4099l1419l9711N3671L1441l9096q693M5083L0111
$$ -108770 -134482 -37597 24321 -29778 -61197 -100908 -47237 -15796 -54892 -63585 -18502 11609
16384A1609j514r0606J04401N0409M6699P8042k2229j14289k3512P4232n8874
$$ 11609 10095 -80511 23890 74299 120998 199040 176811 62522 39010 113242 54368
16373E4368J509m1691j58090j95091J841J13364J30318P9504J3599J8238M6607
$$ 54368 55877 14186 -143904 -338995 -337154 -223790 -93472 -13968 -369 17869 64476
16362F4476o7037q9193Q4112J09544p4600j4045Q7110k515o7865j20269j6725
$$ 64476 -2561 -91754 -7642 101902 27302 13257 100367 97852 29987 -90282 -107007
16351a07007M2482M4574K896L5867q7759R5093N7237j0989q368j7162j20828o5661
$$ -107007 -64525 -19951 -17055 18812 -68947 26146 83383 72394 64026 46864 -73964 -139625
16339a39625J19056M937n5846p0895j2439P9940j71004J7967J06387N0690n2401
$$ -139625 -20569 -15632 -71478 -142373 -154812 -74872 -245876 -227909 -121522 -70832 -123233
16328a23233J8633J7618J7121R9225K3498J7963m2760J6382O3329j8637m5582
$$ -123233 -104600 -86982 -69861 29364 52862 70825 28065 44447 107776 89139 43557
16317D3557M499j30532l0763Q3013j8781k9129J243J7239k1433q471M2407n2303
$$ 43557 48056 -82476 -113239 -30226 -49007 -78136 -76893 -59654 -81087 -89558 -47151 -99454
16305i9454J8501J3903R0827J38631N0522k504j14833j36915p4848M3638r805
$$ -99454 -80953 -67050 23777 162408 212930 210426 95593 -41322 -116170 -72532 -82337
16294h2337O3306K0770n1643Q4102O5437m09j3901p0210j11554j08130k2103L7986
$$ -82337 -19031 1739 -49904 34198 99635 99226 85325 15115 -96439 -204569 -226672 -188686
16282a88686J83827J32410p613p4027j04360K673k2612j2952J06451k6033m9423
$$ -188686 -4859 127551 119938 45911 -58449 -55776 -78388 -91340 15111 -10922 -60345
16271f0345j4007N478q4383Q2226K17260K413L052R339j83166L0098J15650N186
$$ -60345 -74352 -68874 -153257 -71031 146229 148642 151694 161033 -22133 7965 123615 128801
16259A28801j42230r1047k7609Q534O6522K2008P6463l5112k3857o435J15931
$$ 128801 -13429 -104476 -132085 -123551 -57029 -35021 41442 6330 -17527 -23962 91969
16248I1969M9728l3970j53798l3957k1501j5719J05368L1377l3775L8979N4362
$$ 91969 141697 107727 -46071 -80028 -101529 -117248 -11880 19497 -14278 24701 79063
16237G9063J1883r6818k583O8938n8991m49r6879m0211j6366j6122L2934K9781
$$ 79063 90946 -5872 -8455 60483 1492 1043 -95836 -136047 -152413 -168535 -135601 -105820
16225a05820K6961J3511K5290P8839N0554Q785r0540n9352o6890R8582j0860n0378
$$ -105820 -78859 -65348 -40058 38781 89335 98120 7580 -51772 -118662 -20080 -30940 -81318
16213h1318J0579J53085N5690l5834m1944j01368k7045j033p990J8502K3355o6122
$$ -81318 -70739 82346 138036 102202 60258 -41110 -68155 -69188 -77178 -58676 -35321 -101443
16201a01443j119N0757j03778n0759l4883Q7142N7630q6018p589q675k849L7792
$$ -101443 -102562 -51805 -155583 -206342 -241225 -154083 -96453 -182471 -190060 -198735 -201584 -163792
16189a63792k2896P2033K23291m1862j36207l2524l0474R619n4217P4378J68357
$$ -163792 -186688 -114655 108636 66774 -69433 -101957 -132431 -122812 -177029 -102651 65706
16178F5706L7064M7423l8889l9364j39058p2410Q2922R8283K0405J311n006j08959
$$ 65706 102770 150193 111304 71940 -67118 -139528 -56606 41677 62082 63393 58387 -50572
16166e0572m3434o5297r3748L6859J30359N8302N4880o8118j50508L6776J29639
$$ -50572 -94006 -159303 -253051 -216192 -85833 -27531 27349 -40769 -191277 -154501 -24862
16155b4862O9010j8477o4989k1777j628M9199J8708K3266J8352L479n4025n8202
$$ -24862 44148 25671 -39318 -61095 -62723 -13524 5184 28450 46802 50281 -3744 -61946
16143f1946o9424K6874J18606J13222J863k09571p2697L1805n2719J35119L2287
$$ -61946 -131370 -104496 14110 127332 129195 -80376 -153073 -121268 -173987 -38868 -6581
16132f581n3198k966l7897j03607L1203K06054J33129m702o0151m5736j12813
$$ -6581 -59779 -62745 -100642 -204249 -173046 33008 166137 161435 101284 55548 -57265
16121e7265m595N4287L1239L9815j05611m7726M8978M660k9785r103K5863k5163
$$ -57265 -61860 -7573 23666 63481 -42130 -89856 -40878 -36218 -66003 -75106 -49243 -74406
16109g4406P8436r0907p6620N3447N5517L4916M0913L7910n8238q6542j6092J35371
$$ -74406 4030 -86877 -163497 -110050 -54533 -19617 21296 59206 968 -85574 -101666 33705
16097C3705O5603r4371j988L0525m668n7172j0714n750P5732P0518P1463k2972
$$ 33705 99308 4937 2949 33474 28806 -28366 -39080 -44830 30902 101420 172883 149911
16085A49911j51853n7811K0211m1434K3950Q1142j6904p9558p660K6552j7213
$$ 149911 -1942 -59753 -39542 -80976 -57026 24116 7212 -72346 -80006 -53454 -70667
16074g0667M3673J55617j217p2595j6131p814J6647K3928m740j71562j72803J4473
$$ -70667 -26994 128623 127406 54811 38680 30866 47513 71441 66701 -104861 -277664 -263191
16062b63191K01114J35242q546K9000P2082o3639j49300r6516Q8591r282m3939
$$ -263191 -62077 73165 64619 93619 165701 102062 -47238 -143754 -55163 -64445 -108384
16051a08384N0038m5534J12944L6296M6074k2750j8086L3908l4981k3407n1264
$$ -108384 -58346 -103880 9064 45360 91434 68684 50598 84506 49525 26118 -25146
16040b5146L1741N8530m492q7251j70030J23397J7797j3308R3941M6751l5162
$$ -25146 6595 65125 60633 -26618 -196648 -73251 -55454 -68762 25179 71930 36768
16029C6768l8426k4685P9847N375o09q5593P438p5657p874J41485j4814O6412
$$ 36768 -1658 -26343 53504 58879 58270 -27323 -19885 -95542 -103416 38069 23255 89667
16017H9667k9525k6413O496q2947n8732J06339M0125m7317M7490J31221m7069
$$ 89667 60142 33729 40225 -42722 -101454 4885 45010 -2307 45183 176404 129335
16006A29335q6361J568O0070m5259q7673k0515r5L1248k8423K8259n096j11316
$$ 129335 42974 44542 104612 59353 -28320 -48835 -48930 -17682 -46105 -17846 -22942 -134258
15994a34258j04829o2581k5260j5354J151P0119N3208R3160o712J0363Q238N9613
$$ -134258 -239087 -301668 -326928 -342282 -341131 -271012 -217804 -124644 -131356 -120993 -112755 -53142
15982e3142j44429O54O1350N0899J4189K6025N440J8446K3692l1238J29433K1406
$$ -53142 -197571 -196917 -135567 -84668 -70479 -44454 -39014 -20568 3124 -28114 101319 122725
15970A22725j05751R232K2396m3402K3273L8353p5626r7387j07605j35396N6828
$$ 122725 16974 26206 48602 5200 28473 66826 -8800 -106187 -213792 -349188 -292360
15959b92360J21189J77203J3920k819p3132l6223Q6946J55635J2991o4366l1536
$$ -292360 -171171 6032 19952 17133 -55999 -92222 -5276 150359 163350 98984 67448
15948F7448j35292k4924Q4924j16720j51777j1677N0308K6625J36682O4560J0016
$$ 67448 -67844 -92768 -7844 -124564 -276341 -288018 -237710 -211085 -74403 -9843 173
15937A73j33693o7570k5591J76170R7321l0320p8561l9693N3885J19526J2337
$$ 173 -133520 -201090 -226681 -50511 46810 16490 -62071 -101764 -47879 71647 83984
15926H3984J1436j5186j40738j06865n8572j34649l0805J69345J32909j639l9846
$$ 83984 95420 80234 -60504 -167369 -225941 -360590 -391395 -222050 -89141 -90780 -130626
15915a30626p0108n1804m1330K411J5833M6682M5654o5231l1018K8332j0059m8442
$$ -130626 -200734 -252538 -293868 -291457 -275624 -228942 -183288 -248519 -279537 -251205 -261264 -309706
15903c09706O6603j821j9442Q3242R7410n477J958K5265l0881Q7575q364l3062
$$ -309706 -243103 -244924 -264366 -181124 -83714 -89191 -87233 -61968 -92849 -5274 -13638 -46700
15891d6700P3069m3241r0292N4489J5435n0809o4747j17738J1058N3237J84442
$$ -46700 26369 -16872 -107164 -52675 -37240 -88049 -152796 -270534 -259476 -206239 -21797
15880b1797N9812M1988N3061p0755j48410n6785P9415J26868K0844j26595o6341
$$ -21797 38015 80003 133064 62309 -86101 -142886 -63471 63397 84241 -42354 -108695
15869a08695k6512j9522Q3089p87K8950K4827K3844l4174j31600r6913K9297J93875
$$ -108695 -135207 -154729 -71640 -72427 -43477 -18650 5194 -28980 -160580 -257493 -228196 -34321
15857c4321J13842m5577r488l5677r3128n9368k7503j4331O0546O8153L9349p609
$$ -34321 79521 33944 24456 -11221 -104349 -163717 -191220 -205551 -145005 -76852 -37503 -45112
15845d5112k3331N9951k217k0556q5767j28345L3117M7620l1009j2455P5363M4929
$$ -45112 -68443 -8492 -10709 -31265 -117032 -245377 -212260 -164640 -195649 -208104 -132741 -87812
15833h7812M1378L2841K1827M544p6283K979r0235l1546L4319J08743N1374N5487
$$ -87812 -46434 -13593 8234 12778 -63505 -60526 -150761 -182307 -147988 -39245 12129 67616
15821F7616k4118P104n8416l434o1651p1767R04K0750n9763p6494l6870J03806
$$ 67616 43498 50602 -7814 -11248 -72899 -144666 -143762 -123012 -182775 -259269 -296139 -192333
15809a92333R6722o6395n2172J33616L7435k8345l7943o4088K639P3585j13935
$$ -192333 -95611 -162006 -214178 -80562 -43127 -71472 -109415 -173503 -170864 -97279 -211214
15798b11214k5780J3860O1516n526L714Q0570m8363j0020Q5779K3181m2738j2890
$$ -211214 -236994 -223134 -161618 -167144 -163430 -82860 -131223 -141243 -55464 -32283 -75021 -87911
15786h7911n9873N7396K5420P67L1168k2134o9153O2707J7952J16329L7507j5572
$$ -87911 -147784 -90388 -64968 -64201 -33033 -55167 -124320 -61613 -43661 72668 110175 94603
15774I4603j28358n6873m2185N0247M7l077O1210Q6717k7846j7149J3127M4251
$$ 94603 -33755 -90628 -132813 -82566 -82519 -85596 -24386 62331 34485 17336 30463 74714
15762G4714J56418J50994N4034q8913j16782j8943l3084o8918p632j34430j54055
$$ 74714 231132 382126 436160 347247 230465 211522 178438 109520 101888 -32542 -186597
15751a86597N0427O8400N9974p5207m8712l1025l6364N9858Q1863J69251p7069
$$ -186597 -136170 -67770 -7796 -83003 -131715 -162740 -199104 -139246 -57383 111868 34799
15740C4799j33812j243j28456p9028P0288M8737k9717n522J00171N8911j7286
$$ 34799 -99013 -100256 -228712 -307740 -237452 -188715 -218432 -223954 -123783 -64872 -82158
15729h2158n4609m5492J54333M8510j79429L718Q3548m431N4722J51490O4372
$$ -82158 -136767 -182259 -27926 20584 -158845 -155127 -71579 -76010 -21288 130202 194574
15718A94574O6168L7668r3482m8551n4410M2805o412j88736p5475M0819N322N0194
$$ 194574 260742 298410 204928 156377 101967 144772 138360 -50376 -125851 -85032 -79710 -29516
15706b9516l4823R548L2067P5244j00390O9282J84552p3756j28793K2846M66l5319
$$ -29516 -64339 -54791 -22724 52520 -47870 21412 205964 132208 3415 26261 26727 -8592
15694h592n9886r9075j33402m3270P7007K02364J72315J620j9625m3451O6920
$$ -8592 -68478 -167553 -300955 -344225 -267218 -64854 107461 109081 89456 46005 112925
15683A12925j31221j3959N3540O5838k6922n0790k6244J43078N3967L7016n7454
$$ 112925 -18296 -32255 21285 87123 60201 9411 -16833 126245 180212 217228 159774
15672A59774j37400n1106j9472j21156p554N0879j31713r5505L5924M3202R8239
$$ 159774 22374 -28732 -48204 -169360 -176914 -126035 -257748 -353253 -317329 -274127 -175888
15661a75888N7045k5995J71032k4554n2650J31139m0535j01092O8889o8710j97106
$$ -175888 -118843 -144838 26194 1640 -51010 80129 39594 -61498 7391 -61319 -258425
15650b58425m3343R1489J07713J31242R3808r909o8920j03955m9477K0555m224
$$ -258425 -301768 -210279 -102566 28676 122484 112575 43655 -60300 -109777 -89222 -93446
15639i3446k5739j8674J1098M0232j0530j19235l1987J03541R7720p3220l3107
$$ -93446 -119185 -137859 -126761 -86529 -97059 -216294 -248281 -144740 -47020 -120240 -153347
15628a53347M146J17820N7977j10R4891J73531J00549q6431q5784k07571n9386
$$ -153347 -149201 -31381 26596 26486 121377 294908 395457 309026 223242 15671 -43715
15617d3715m7761m8226J60439K2501N2770r431m854n5284m1227l2238J8045m5721
$$ -43715 -91476 -139702 20737 43238 96008 86577 81723 26439 -14788 -47026 -28981 -74702
15605g4702j63052K6563N1812Q2852L1488J32543O7675n5841r9923j27893q91
$$ -74702 -237754 -211191 -159379 -76527 -45039 87504 155179 99338 -585 -128478 -129369
15594a29369J52828N4873j04798q6675j1582O8886Q8846K3829p0143j566J9390
$$ -129369 23459 78332 -26466 -113141 -124723 -55837 33009 56838 -13305 -14871 4519
15583D519O8487j6516j55502M8489n612n461O7954m8936r6695l7463L9672L6793
$$ 4519 73006 56490 -99012 -50523 -56135 -61596 6358 -42578 -139273 -176736 -137064 -100271
15571a00271L2637M6340n5197L5643K6874j7180j8662J27667J28894l8640q8189
$$ -100271 -67634 -21294 -76491 -40848 -13974 -31154 -49816 77851 206745 168105 79916
15560G9916j51619j31330l2075l1451P3016N23p4118M5853J46069J60303n999
$$ 79916 -71703 -203033 -235108 -266559 -193543 -193020 -267138 -221285 -75216 85087 79088
15549G9088j14870j08097K7041p3814L455J38564P1930n5768j01479o9019l4185
$$ 79088 -35782 -143879 -116838 -190652 -187197 -48633 23297 -32471 -133950 -202969 -237154
15538b37154L967P5011o0821n4733O5311N1891J15975R3586R7411l9613o9133
$$ -237154 -233187 -158176 -218997 -273730 -208419 -156528 -40553 53033 150444 110831 41698
15527D1698R2220M1335p1742p8580o9904K7792L5811n7957R71P1877j0678l592
$$ 41698 133918 175253 103511 24931 -44973 -17181 18630 -39327 -38356 33521 22843 19251
15515A9251P538j22636q5548r956k3993q584J11453L4652J61163J9776j00018
$$ 19251 26789 -95847 -181395 -191351 -215344 -223928 -112475 -77823 83340 103116 3098
15504C098p8260l2744j7665k1720L5535l0920p8251J20656J46390k1027l973L0290
$$ 3098 -75162 -107906 -125571 -147291 -111756 -142676 -220927 -100271 46119 25092 21119 51409
15492E1409l5307m092K4567N0900K3785p9579j6569p5555r4578l9555O9522k935
$$ 51409 16102 12010 36577 87477 111262 31683 15114 -60441 -155019 -194574 -125052 -127987
15480a27987M0886j13365K5136P8132O9865J17556l457j4978p2051k4599M1095
$$ -127987 -87101 -200466 -175330 -97198 -27333 90223 86766 71788 -263 -24862 16233
15469A6233J6378r8603o0292m7090O7492N5768m7216o4868q9032Q8317M607m8023
$$ 16233 32611 -65992 -126284 -173374 -105882 -50114 -97330 -162198 -251230 -162913 -158306 -206329
15457b06329K5794J65848P9390l8559n4469K408M7692M5070p8907L6484J07241
$$ -206329 -180535 -14687 64703 26144 -28325 -25917 21775 66845 -12062 24422 131663
15446A31663o958O6809m740r0987o6923J1238J01110l5465j33521j62734m9765
$$ 131663 124705 191514 186774 95787 28864 40102 141212 105747 -27774 -190508 -240273
15435b40273m738o3629m8894j7589N2485l1599K6939M1785J16201J45079N2169
$$ -240273 -245011 -308640 -357534 -375123 -322638 -354237 -327298 -285513 -169312 -24233 27936
15424B7936J2362m0630r6298l1853N3482J68361N3342p3733q8686L3061j5373
$$ 27936 40298 -332 -96630 -128483 -75001 93360 146702 72969 -15717 17344 1971
15413A971R05q4210K2548L5612O8508J04127j15262j55075p0184R4308P3452q474
$$ 1971 2876 -81334 -58786 -23174 45334 149461 34199 -120876 -191060 -96752 -23300 -31774
15401c1774M807l9282O5561l687J16396N3131K4953r4302j20586m7486o393l495
$$ -31774 -26967 -66249 -688 -4375 112021 165152 190105 95803 -24783 -72269 -78662 -82157
15389h2157O2002O1162j8487L7318O3830K7080k6698j55223o5849J03334j0199
$$ -82157 -20155 41007 22520 59838 123668 150748 124050 -31173 -97022 6312 -3887
15378c887j6680K1115p3222j2382J08329j7332j87077q6644m7490p527L2803J19009
$$ -3887 -20567 548 -72674 -85056 23273 5941 -181136 -267780 -315270 -322797 -289994 -170985
15366a70985M581R112l8580N906R4559O5658K4859j20467m2873Q1601O318L646
$$ -170985 -166404 -157292 -195872 -189966 -95407 -29749 -4890 -125357 -168230 -86629 -80311 -76665
15354g6665R1669k0402p1023J0441M8887P4450m6382j14570n262j0477K1153j7296
$$ -76665 15004 -5398 -76421 -65980 -17093 57357 10975 -103595 -108857 -119334 -98181 -115477
15342a15477Q806K9373K3878r7734k0786k6335k74R2005M4330l9030M697J9722
$$ -115477 -106671 -77298 -53420 -151154 -171940 -198275 -198549 -106544 -62214 -101244 -96547 -76825
15330g6825J0835k9147j06018n962K30190J45976j87792j09583L4457m986k6786
$$ -76825 -65990 -95137 -201155 -207117 23073 169049 -18743 -128326 -93869 -98855 -125641
15319a25641k4435L4340j4661m0007N6171J01070J6624l5832l7462Q574k6170
$$ -125641 -150076 -115736 -130397 -170404 -114233 -13163 3461 -32371 -69833 -61259 -87429
15308h7429n4897L6781L4513n4853O9151O8585k5036q081q852m6207k7312k680
$$ -87429 -142326 -105545 -71032 -125885 -56734 11851 -13185 -21266 -30118 -76325 -103637 -106317
15296a06317M7271L3844r7624n8881J4412J12699N6759n7545j4636r8787l1054
$$ -106317 -59046 -25202 -122826 -181707 -167295 -54596 2163 -55382 -70018 -168805 -199859
15285a99859L6373J37277N0799Q9106L7761n1781j3237j35450k1333N9635N096
$$ -199859 -163486 -26209 24590 113696 151457 99676 86439 -49011 -70344 -10709 -5613
15274e613J2005k4718O7047k435j06699o319J03617M69m7673o0744j65508O4371
$$ -5613 6392 -18326 48721 46286 -60413 -66732 36885 37354 -10319 -71063 -236571 -172200
15262a72200M3345Q1066J23357m2635j2096P2129N929j18271P1378R315K4651
$$ -172200 -128855 -47789 75568 32933 20837 92966 98895 -19376 52002 61317 85968
15251H5968l9399l6029L5676o4714o6453k6153N9585O3532M3021J04941O750q7410
$$ 85968 46569 10540 46216 -18498 -84951 -111104 -51519 12013 55034 159975 166725 79315
15239G9315o6751Q7509N2858j4519J1742J63630N3997j63327l8185r7036l0775
$$ 79315 12564 100073 152931 138412 150154 313784 367781 204454 166269 69233 38458
15228C8458Q7311O3435j23989m1306K1519L7062M1847k6237R0250Q6866N8786
$$ 38458 125769 189204 65215 23909 45428 82490 124337 98100 188350 275216 334002
15217C34002j01839j3263j37463q2068l4630M4181N2583L2465L2261Q4287q5633
$$ 334002 232163 218900 81437 -631 -35261 8920 61503 93968 126229 210516 124883
15206A24883n8805j45157o2888N9259N5974o634n8749J678J17417O0216r7012
$$ 124883 66078 -79079 -141967 -82708 -26734 -33368 -92117 -90439 26978 87194 -9818
15195i818O2093P8987n3208p5074j38358k3533Q6766J08867q0474j27707j1136
$$ -9818 52275 131262 78054 2980 -135378 -158911 -72145 36722 -43752 -171459 -182595
15184a82595N475J04953J83080j10467q9931M4934j7932P9457J00922j1883l0381
$$ -182595 -177120 -72167 110913 446 -89485 -44551 -62483 16974 117896 106013 75632
15173G5632j3089Q737O5863l9837n5456p5042q1419j5028j2594J04396J8612M6697
$$ 75632 62543 71280 137143 97306 41850 -33192 -114611 -129639 -142233 -37837 -19225 27472
15161B7472J26334j29919p2072j7392L7959j3908J24775O620l4080j8011N876
$$ 27472 153806 23887 -48185 -65577 -27618 -41526 83249 89869 55789 37778 43654
15150D3654o7568J8463K5956L7050q0826K6231k717p0644n2771M5677J29364M7827
$$ 43654 -23914 -5451 20505 57555 -23271 2960 243 -70401 -123172 -77495 51869 99696
15138I9696j15192J20243J53080r4759j25500o7726J18360O1112q2798n3049o1042
$$ 99696 -15496 104747 257827 163068 37568 -30158 88202 149314 66516 13467 -47575
15127d7575M4868k6555k8891k6591P263J5357M7581P2433L1975j844R2473P1366
$$ -47575 -2707 -29262 -58153 -84744 -77481 -62124 -14543 57890 89865 88021 180494 251860
15115B51860o4203o7789q7402k5109l0466Q803J0957j7653k8799o1517J01557
$$ 251860 187657 119868 32466 7357 -23109 -14306 -3349 -21002 -49801 -111318 -9761
15104i761J7732n6476N7630o3840L5584j34491J01038J18409N5630l2937J874
$$ -9761 7971 -48505 9125 -54715 -19131 -153622 -52584 65825 121455 88518 90392
15093I0392p2360n3760l044L5000J5867q6515o7516J29652M5417l6494L8076L6350
$$ 90392 18032 -35728 -38772 -3772 12095 -74420 -141936 -12284 33133 -3361 34715 71065
15081G1065k6726l3950o0741n8559j37133l9675K11754J99027J14970q4633j9746
$$ 71065 44339 10389 -50352 -108911 -246044 -285719 -73965 125062 240032 155399 135653
15070A35653o6877j25529l8786j0069l492M6607J02403p41j30051J0756J07603
$$ 135653 68776 -56753 -95539 -105608 -109100 -62493 39910 39169 -90882 -80126 27477
15059B7477K8564J5411n6942Q2326m7999p138R504k2410J09212Q7073R240o8245
$$ 27477 56041 71452 14510 96836 48837 41699 51203 28793 138005 225078 234318 166073
15047A66073l7849o4709j1793L3799m9432M2971P4617N0205N914k0284k4259J9537
$$ 166073 128224 63515 51722 85521 36089 79060 153677 203882 209796 189512 165253 184790
15035A84790K2906m3076l7419O2045j3209o303p8092r7594l2693O9854J3362M4277
$$ 184790 207696 164620 127201 189246 176037 169734 91642 -5952 -38645 31209 44571 88848
15023H8848M5171l4380k6828J9257j16090k06893L2491K33008p868p3313o7159
$$ 88848 134019 99639 72811 92068 -24022 -230915 -198424 34584 26716 -46597 -113756
15012a13756M7845J50093K9179M7818o5776l3889k8783J06813j8591j0511k7936
$$ -113756 -65911 84182 113361 161179 95403 61514 32731 139544 120953 110442 82506
15001H2506M0451j5528K4899j00453m4523k2611Q9445M55N7853O1187j03855L557
$$ 82506 122957 107429 132328 31875 -12648 -35259 54186 54641 112494 173681 69826 73383
14989G3383J9840p4078l385J604k2572R1937J50581q9101j48829r831R0544q927
$$ 73383 93223 19145 15760 17364 -5208 86729 237310 148209 -620 -10451 80093 71166
14977G1166Q5992M8449n4588j31129o4653J1708Q0920k3878O9741q9272m6956
$$ 71166 157158 205607 151019 19890 -44763 -33055 47865 23987 93728 4456 -42500
14966d2500k953m6295J03443M1750j11808K4955l5659R1245K7920q2425j9992
$$ -42500 -45453 -91748 11695 53445 -58363 -33408 -69067 22178 50098 -32327 -52319
14955e2319j6370J06220J57900o9769r6150O8919K9340j24066n7149o0491j0128
$$ -52319 -68689 37531 195431 125662 29512 98431 127771 3705 -53444 -113935 -124063
14944a24063K02977M3918j13966p104N8665O10K6992J05637r4350j03637m4372
$$ -124063 78914 122832 8866 1762 60427 61037 88029 193666 99316 -4321 -48693
14933d8693J3330M3751j6436n6086L9452O3998K9330L4925n7528j12257n0162
$$ -48693 -35363 8388 -8048 -64134 -24682 39316 68646 103571 46043 -66214 -116376
14922a16376k427N1194J26828j9279r568k0125O2327P6874n71Q1981o885q3995
$$ -116376 -118803 -67609 59219 39940 30372 10247 72574 149448 148877 230858 223973 139978
14910A39978j36408q35n9571l7233P5675o2947m5089p624n931J81936N7230j87501
$$ 139978 3570 2735 -56836 -94069 -18394 -81341 -126430 -134054 -139985 41951 99181 -88320
14898h8320m9669Q2935M7449J9424Q9373O0248m8094j23382n9800o0122J7059
$$ -88320 -137989 -55054 -7605 11819 101192 161440 113346 -10036 -69836 -129958 -112899
14887a12899P9558Q0591n0597j5423j3307j8967r5601M4022k4576P6981J11905
$$ -112899 -33341 47250 -3347 -18770 -32077 -51044 -146645 -102623 -127199 -50218 61687
14876F1687J03959l3815j3409J20814K9024p3047m596l9079j38583M5070M3037
$$ 61687 165646 131831 118422 239236 268260 195213 190617 151538 12955 58025 101062
14865A01062k1138O86M5266O5430n9364K1034K8812o0549q2983j36449M9061o489
$$ 101062 79924 80610 125876 191306 131942 152976 181788 121239 38256 -98193 -49132 -55621
14853e5621o8227k9639O2578R9099j4006k8341P7243j7178M4410j5801n076p2814
$$ -55621 -123848 -153487 -90909 8190 -5816 -34157 43086 25908 70318 54517 49441 -23373
14841b3373m5644o1270J02442J6913R501q3049l3228J9460O0144N2100Q9376k1567
$$ -23373 -69017 -130287 -27845 -10932 -1431 -84480 -117708 -98248 -38104 13996 103372 81805
14829H1805k6233J3482k7180o878O6400l4495P5685j944N414J07193m9708j49463
$$ 81805 55572 69054 41874 34996 101396 66901 142586 140642 146056 253249 203541 54078
14817E4078r0334L1629J19775R1182k7652k3480q3784N075J1756q3133J1730R7164
$$ 54078 -36256 -4627 115148 206330 178678 155198 71414 76489 88245 5112 16842 114006
14805A14006k8886m3109j1269J074N8472n7349r8424N9934J21836J39885j8909
$$ 114006 85120 42011 30742 31816 90288 32939 -65485 -5551 116285 256170 237261
14794B37261L204l8643q7693o4819o9827O3400N0484j1143m2426o2105l8114O6367
$$ 237261 240465 201822 114129 49310 -20517 42883 93367 82224 39798 -22307 -60421 5946
14782E946m584n3041O0429O4959n7180p6459j53953L4014J28607J07281j9035
$$ 5946 1362 -51679 8750 73709 16529 -59930 -213883 -179869 -51262 56019 36984
14771C6984l587l8134L158J15085j1500K4004o5590n7719N9721l5511l4348P2476
$$ 36984 33397 -4737 -1579 113506 102006 126010 60420 2701 62422 26911 -7437 65039
14759F5039M3632J104M2534O0314o7031M4500N2775j34425o5748K1464j6709n6940
$$ 65039 108671 109775 152309 212623 145592 190092 242867 108442 42694 64158 47449 -9491
14747i491n6285Q1230K0892n4189J0870O6031O3737N9976r6098r180m1755n6876
$$ -9491 -65776 15454 36346 -17843 -6973 59058 122795 182771 86673 77493 35738 -21138
14735b1138Q9060m212K8323n373j59855Q7294P8671o8004N4776J09876L0599n9585
$$ -21138 67922 63710 92033 86660 -73195 14099 92770 24766 79542 189418 220017 160432
14723A60432j27o453p2665r0542q3496p157M7968J04117K7045J137R0185M4505
$$ 160432 160305 153852 81187 -9355 -92851 -100008 -52040 52077 79122 80259 170444 214949
14711B14949l6278j727j48049j14653J16288P7377j17115p0891l1587l046M3455
$$ 214949 178671 176944 28895 -85758 30530 107907 -9208 -80099 -111686 -114732 -71277
14700g1277O2900N1716k1900q5011j7647K6048m6891J7407R9695N7136l2324O9071
$$ -71277 -8377 43339 21439 -63572 -81219 -55171 -102062 -84655 15040 72176 39852 108923
14688A08923l5942L6188l4250r9293o8868J09051M5746M5967j0336Q7757J03759
$$ 108923 72981 109169 74919 -24374 -93242 15809 61555 107522 97186 184943 288702
14677B88702q7630L214j15527m9153l1965J13576l5338m6079p0155k5108j239
$$ 288702 201072 204286 88759 39606 7641 121217 85879 39800 -30355 -55463 -56702
14666e6702P3182j0343j48047k5822L5928O6999J80115L1282j54455j44824N0523
$$ -56702 16480 6137 -141910 -167732 -131804 -64805 115310 146592 -7863 -152687 -102164
14655a02164J25594R2489l203O7533M2817p2874p1067j32762P8141R651l7260
$$ -102164 23430 115919 112716 180249 223066 150192 79125 -53637 24504 34155 -3105
14644c105Q5687k4386j39472o5403J9631N0697J17919q9846r2684J0538P8862
$$ -3105 82582 58196 -81276 -146679 -127048 -76351 41568 -48278 -140962 -130424 -51562
14633e1562M8077l6963R1381m8093m9742o3271k8741L9206M5615L2552j8198J4661
$$ -51562 -3485 -40448 50933 2840 -46902 -110173 -138914 -99708 -54093 -21541 -39739 -25078
14621b5078Q1943P2760P5696j24787o9186m6261r8563O0655L5704O89k7926m212
$$ -25078 56865 129625 205321 80534 11348 -34913 -133476 -72821 -37117 -36428 -64354 -68566
14609f8566J04814l5762O1155J0999j4353q5557l9325P2159N7378M7915O9216
$$ -68566 36248 486 61641 72640 58287 -27270 -66595 5564 62942 110857 180073
14598A80073j5346n7586j01570p9897m3166Q3124M2461m5485l5459J68717O0281
$$ 180073 164727 107141 5571 -74326 -117492 -34368 8093 -37392 -72851 95866 156147
14587A56147j22303K3721L6852J8274P9843q9638l8746j894n7619m8790j8254
$$ 156147 33844 57565 94417 112691 192534 102896 64150 62256 4637 -44153 -62407
14576f2407n2441M2694J38034m1251L0586M8602o2919m1076Q7475l9602N9357
$$ -62407 -114848 -72154 65880 24629 55215 103817 40898 -178 87297 47695 107052
14565A07052J50557q1628j16007o8452J2222M5279L6110P4213J15161q9469j7485
$$ 107052 257609 175981 59974 -8478 3744 49023 85133 159346 274507 185038 167553
14554A67553j958K19k2941r2331k2271J07186J12899R158j76192j03767m4983
$$ 167553 165595 165814 142873 50542 28271 135457 248356 257514 81322 -22445 -67428
14543f7428N4587m7579j014J1449k7947L1164L9927m9796J71256L4909j09960
$$ -67428 -12841 -60420 -61434 -49985 -77932 -46768 -6841 -56637 114619 149528 39568
14532C9568l520P5663P4822l1839j5532j8737q7567N3468L1906n65k6491J11625
$$ 39568 36048 111711 186533 154694 139162 120425 32858 86326 118232 117667 91176 202801
14520B02801J53562m2120j20047r3221k1793l6198O7748M7021q3015M0544k9476
$$ 202801 356363 314243 194196 100975 79182 42984 110732 157753 74738 115282 85806
14509H5806O4744j22924j01872J96132M1475p0761M1055q1797k4452K6181K6447
$$ 85806 150550 27626 -74246 121886 163361 92600 133655 51858 27406 53587 80034
14498H0034q8842M8235K5416k4919J6456L0341q8485p6177Q8678O3342m6032M9803
$$ 80034 -8808 39427 64843 39924 56380 86721 -1764 -77941 10737 74079 28047 77850
14486G7850L4262J0008o6941j1261k3743k2189p7498K2566J0246J3040l8590P5597
$$ 77850 112112 122120 55179 43918 20175 -2014 -79512 -56946 -46700 -33660 -72250 3347
14474C347M2079L6993m4114l2544p8410M3587r034K862L2969k9415Q078J69055
$$ 3347 45426 82419 38305 5761 -72649 -29062 -38096 -35234 -2265 -31680 -23602 145453
14462A45453R1753k2146m2707j1458q9497j0070L0440j37207m1466l3677l0808
$$ 145453 237206 215060 172353 160895 71398 61328 91768 -45439 -86905 -120582 -151390
14451a51390o767n3417K6652J39131n632J07115M3909j191O0733L0692l5051o2467
$$ -151390 -158157 -211574 -184922 -45791 -51423 55692 99601 98410 159143 189835 154784 92317
14439I2317o4830o5127j2082q8559j0837J28541p258J69955Q9859q8178k428J7286
$$ 92317 27487 -37640 -49722 -138281 -149118 -20577 -27835 142120 231979 143801 141373 158659
14427A58659n7006l6175m3071L8266p5172l8806j0934N1381J39215O9265J8215
$$ 158659 101653 65478 22407 60673 -14499 -53305 -64239 -12858 126357 195622 213837
14416B13837K5954k2516n9729j03311m4391J8243p413L8651N1794l9152r5223
$$ 213837 239791 217275 157546 54235 9844 28087 20674 59325 111119 71967 -23256
14405b3256P8512J42042m7325j32767M2837n566n5096M1047o5119m7199J2050
$$ -23256 55256 197298 149973 17206 60043 54477 -619 40428 -24691 -71890 -59840
14394e9840J2147o8747m9005M6532j6220q427k5918J26364N8347J503o2500J6413
$$ -59840 -47693 -116440 -165445 -118913 -135133 -143560 -169478 -43114 15233 16736 -45764 -29351
14382b9351M6981j8578M8121J54767J8264o6347J8795o8704l0853q1879o7710
$$ -29351 17630 -948 47173 201940 220204 153857 172652 103948 73095 -8784 -76494
14371g6494M1425l2303l951n606P9580K2537N4857L7061l7357L125k1003m8792
$$ -76494 -35069 -67372 -71323 -76929 2651 25188 80045 117106 79749 82874 61871 13079
14359A3079k3504P8069M4753o4428k1970l927P5016p662K0081O9294p3324j7708
$$ 13079 -10425 67644 112397 47969 25999 22072 97088 89426 109507 178801 105477 87769
14347H7769j9040q4522o6281k7381P540J4300P028Q8868Q46m1036j4285J03604
$$ 87769 68729 -15793 -82074 -109455 -101915 -87615 -80587 8281 9127 -31909 -46194 57410
14335E7410J1233P8493J1883l2351J890N5012O498q3452o0145K1684p3997N7429
$$ 57410 68643 147136 159019 126668 128558 183570 190068 106616 46471 68155 -5842 51587
14323E1587J6394n8979R2539j1456L9175j30540q7106N9345j2791j3661r5214
$$ 51587 67981 9002 101541 90085 129260 -1280 -88386 -29041 -41832 -55493 -150707
14312a50707l570J12441J27887J12109l9949k4842p6736j36471k7893J29863N0817
$$ -150707 -154277 -41836 86051 198160 158211 133369 56633 -79838 -107731 22132 72949
14301G2949K1861K7040O7533J3048n0598o858J530L455O8648k0335j06415m0789
$$ 72949 94810 121850 189383 202431 151833 144975 146505 149960 218608 198273 91858 51069
14289E1069n660J47908j01908m2104O0464J61147m0999o2859K5892N6294O5337
$$ 51069 45409 193317 91409 49305 109769 270916 229917 167058 192950 249244 314581
14278C14581l0454j24710l9099m3643n5722L5594J1803Q916r627m0615M7277k5243
$$ 314581 284127 159417 120318 76675 20953 56547 68350 77266 67639 27024 74301 49058
14266D9058j35P7206P2002o3831j8743l5869j1303L3983M8647k1173L8258O4870
$$ 49058 48923 126129 198131 134300 115557 79688 68385 102368 151015 129842 168100 232970
14254B32970n1565p8524k6516J9050j01398l0061M4547r1274n0554m3114Q633
$$ 232970 181405 102881 76365 95415 -5983 -36044 8503 -82771 -133325 -176439 -167806
14243a67806M9899M6597k3701N5447N7970j0317M772o1362K2267L7343M1706N8046
$$ -167806 -117907 -71310 -95011 -39564 18406 8089 12861 -48501 -26234 11109 52815 110861
14231A10861q048k6048j3719Q465N1409M6208J2735J8134n2348r3981l3633m0698
$$ 110861 102813 76765 63046 71511 122920 169128 181863 199997 147649 53668 20035 -20663
14219b0663l0461P4538N8217J8511j31590l5691J40953Q7660n04O09n2458k6595
$$ -20663 -51124 23414 81631 100142 -31448 -67139 73814 161474 160970 161579 109121 82526
14207H2526j21K4183R8202o3675j14127J5666Q9963k7324J5453J0561M8593l5501
$$ 82526 82405 106588 204790 141115 26988 42654 132617 105293 120746 131307 179900 144399
14195A44399J37892p3077j27205R636L7876M4811r2351j04050L2379n842Q2743
$$ 144399 282291 209214 82009 91645 129521 174332 81981 -22069 10310 4468 87211
14184H7211j3894L3107P6732Q578j02917n3527O7673l9151j5809J24026N052o7133
$$ 87211 73317 106424 183156 191734 88817 35290 102963 63812 48003 172029 177081 109948
14172A09948L2715q7467j58180j29417k4705J66742K0366r0495o3425J82752J7099
$$ 109948 142663 55196 -102984 -232401 -257106 -90364 -69998 -160493 -223918 -41166 -24067
14161b4067r3957L1623Q9365p5551J14190J27292K9296q5223k5531N6757M2223
$$ -24067 -118024 -86401 2964 -72587 41603 168895 198191 112968 87437 144194 186417
14150A86417o4788n3541j5703Q78P5293K5815l232j0644K9723J1615K9307l5391
$$ 186417 121629 68088 52385 53263 128556 154371 151139 140495 170218 181833 211140 175749
14138A75749l3452J8541r1754p1866L3586P4653J0271L042o6439O1181K6911l7502
$$ 175749 142297 160838 69084 -2782 30804 105457 115728 118770 52331 113512 140423 102921
14126A02921m4251k530K642j8224p9552M4795j0394l3102N2774l6301P8732J66485
$$ 102921 58670 56140 58782 40558 -38994 5801 -4593 -37695 15079 -21222 57510 223995
14114B23995J18238o5613n4751j818r8778p2990m6037k172n732R5302l0728m3123
$$ 223995 342233 276620 221869 220051 121273 48283 2246 74 -5658 89644 58916 15793
14102A5793L9134M3843n8379l4298J5640K0739J17427L4817m5921J2752q7817
$$ 15793 54927 98770 40391 6093 21733 42472 159899 194716 148795 161547 73730
14091G3730l6982K3612m2086j18139l9924J51941J03444O9188m1980l4331L5898
$$ 73730 36748 60360 18274 -99865 -139789 12152 115596 184784 142804 108473 144371
14080A44371l27j24870M0229J51764R5672K0501l7998r6690k5352j05205m4023
$$ 144371 144044 19174 59403 211167 306839 327340 289342 192652 167300 62095 18072
14069A8072m7989k677P3816l5143n3637J45741N6115N7928j19139m8446n861M8709
$$ 18072 -29917 -32594 41222 6079 -47558 98183 154298 212226 93087 44641 38780 87489
14057H7489Q7300j515j00883J4860r786p9605Q7996L5779L144j19602j29388R001
$$ 87489 174789 173274 72391 87251 77465 -2140 85856 121635 124779 5177 -124211 -115210
14045a15210r329J34760J85063j4764p4312j3796k4660p573N5059Q8769J7726
$$ -115210 -124539 10221 195284 180520 106208 92412 67752 60179 115238 204007 221733
14034B21733k3630n4790q2204K1331n1511k09681n572Q2085Q9027m3447O3229
$$ 221733 198103 143313 61109 82440 30929 -178752 -184324 -102239 -13212 -56659 6570
14023F570J72201M8949n8557p2604L677j44145l8262J54009M7267m7039j32850
$$ 6570 178771 227720 169163 96559 100236 -43909 -82171 71838 119105 72066 -60784
14012f0784l6834J4246N5482J24709P7914k1977j54193j59714o7946L2939P109
$$ -60784 -97618 -83372 -27890 96819 174733 152756 -1437 -161151 -229097 -196158 -189049
14001a89049o3500J59715J45527O7203K4064o2135r426K2713n1250L4990O3452
$$ -189049 -252549 -92834 52693 119896 143960 81825 72399 95112 43862 78852 142304
13990A42304k1178n4601m3566j18448M5886J62302P1935p5075p5908m1368O1804
$$ 142304 121126 66525 22959 -95489 -49603 112699 184634 109559 33651 -7717 54087
13979E4087P4663k9341m7276J38635l9693j37496n1697K4290O6208O4369M2133
$$ 54087 128750 99409 52133 190768 151075 13579 -38118 -13828 52380 116749 158882
13968A58882m4968j3632Q457l2049N5686L1947q1675p2324k684O7585J14901k1324
$$ 158882 113914 100282 108739 76690 132376 164323 82648 10324 7640 75225 190126 168802
13956A68802J1588j2197q3411j4415N7479m3037l9429k2089K3512M1209L9633
$$ 168802 180390 168193 84782 70367 127846 84809 45380 23291 46803 88012 127645
13945A27645J18133R9221o3427j19248l008k8530J10096n9291n3974m9951n4130
$$ 127645 245778 344999 281572 162324 159316 130786 240882 181591 127617 77666 23536
13934B3536J39999R8992j17373n7276J22776K1722j04682r301n2195j0319k534
$$ 23536 163535 262527 145154 87878 210654 232376 127694 118393 66198 55879 53345
13923E3345n8425n8407m3617N5869J00493K1507P8165n18r0363o5893j4973N7172
$$ 53345 -5080 -63487 -107104 -51235 49258 70765 148930 148412 58049 -7844 -22817 34355
13911C4355l5001j154J04165J26370k0052o0456j32867r0480j641J1653R0898
$$ 34355 -646 -1800 102365 228735 208683 148227 15360 -75120 -76761 -65108 25790
13900B5790Q0496m6038J5271P5361q682l8184j5486L8581J6670o1391N7761M2860
$$ 25790 106286 60248 75519 150880 142198 104014 88528 127109 143779 82388 140149 183009
13888A83009n5566k9909R5548j881r001k0588Q8224k9400m2565j04112l208Q6715
$$ 183009 127443 97534 193082 191201 182200 161612 249836 220436 177871 73759 70551 157266
13876A57266l2874o7287K9847n9746j7531M2819j463j0317n2907J1066P3906R2856
$$ 157266 124392 57105 86952 27206 9675 52494 51031 40714 -12193 -1127 72779 165635
13864A65635L4300l5564M3750k4990N0467J01126j72963j23777l4507M7957K7483
$$ 165635 199935 164371 208121 183131 233598 334724 161761 37984 3477 51434 78917
13853G8917k1399J07282Q8303m3749q2191o5446j6103o1641k8887p6678l1165
$$ 78917 57518 164800 253103 209354 127163 61717 45614 -16027 -44914 -121592 -152757
13842a52757J64263L990j11380J4645J25567J27208j20393n1232J25357J9649
$$ -152757 11506 15496 -95884 -81239 44328 171536 51143 -89 125268 144917
13832A44917j13067K418J531P0992Q9441j69909m7403m7212k4691J30323O4819
$$ 144917 31850 34268 35799 106791 196232 26323 -21080 -68292 -92983 37340 102159
13821A02159k2679k6479R3655r9416j15492k0670k8549q3133J08952J09572j955
$$ 102159 79480 53001 146656 47240 -68252 -88922 -117471 -200604 -91652 17920 15965
13810A5965N0149j1325r1923r0983l1991l6425M4957O2541L2754j621J2023K4249
$$ 15965 66114 54789 -37134 -128117 -160108 -196533 -151576 -89035 -56281 -57902 -45879 -21630
13798b1630L4862L1840N1182n5240l7389R2191J29265j2612O3919L5384j57248
$$ -21630 13232 45072 96254 41014 3625 95816 225081 212469 276388 311772 154524
13787A54524r7197M8532j4918m8483N2351L2474L0598J839k2613K1318O5091q5694
$$ 154524 57327 105859 90941 42458 94809 127283 157881 159720 137107 158425 223516 137822
13775A37822j51907O5098Q0461M9168q2303k1155N8178k5179j00725m1090N8747
$$ 137822 -14085 51013 131474 180642 98339 77184 135362 110183 9458 -31632 27115
13764B7115J65892J52896k5038j00305m8173P673p9520j1668O9194K1780K6979
$$ 27115 193007 345903 320865 220560 172387 180060 100540 88872 158066 179846 206825
13753B06825j1543l4545N938k3403N7245N1111r3819J0282p1410m6769J1036n5716
$$ 206825 195282 160737 166675 143272 200517 251628 157809 168091 96681 49912 60948 5232
13741E232J2123O9404M5798m2946O6991L5714O5089M2602j6706L602o213o8082
$$ 5232 17355 86759 132557 89611 156602 192316 257405 300007 283301 286903 280690 212608
13729B12608j8869L7345j2905j0676O9585m2135j25215k2141J30155k5912J0743
$$ 212608 193739 231084 218179 207503 277088 234953 109738 87597 217752 191840 202583
13718B02583m3878J28351M7535j8408M7218r2986j8366m8095P5543J6581q6577
$$ 202583 158705 287056 334591 316183 363401 270415 252049 203954 279497 296078 209501
13707B09501m1565r6797k9939J8053P2317K8229r579K629j7681j17440L7039J17152
$$ 209501 167936 71139 41200 59253 131570 159799 150220 152849 135168 17728 54767 171919
13695A71919J733q0702L5925P0540l7481J4808l065L4271J16185Q425R4083j10123
$$ 171919 173652 92950 128875 199415 161934 176742 173677 207948 324133 332558 426641 316518
13683C16518j56589o6794k5476l387J06430K4435r6493n3791o9512L0844Q0184
$$ 316518 159929 93135 67659 64272 170702 195137 98644 44853 -24659 6185 86369
13672H6369M9737P2380l5068r8838L8036N9748o9135J8865Q7422L2129O0475m1086
$$ 86369 136106 208486 173418 74580 112616 172364 103229 122094 209516 241645 302120 261034
13660B61034m3503N2719O2252q6452j74466k7427O2323J04011Q2054l3554k6047
$$ 261034 217531 270250 332502 246050 71584 44157 106480 210491 292545 258991 232944
13649B32944q9904L5607J338R8419n9475m9846l9738K3789j4074m5204j11529
$$ 232944 143040 178647 179985 278404 218929 169083 129345 153134 139060 93856 -17673
13638a7673J30791J05889k3560k8349j2501P0509n348k5141k8506K8529m1801
$$ -17673 113118 219007 195447 167098 154597 225106 219758 194617 166111 194640 152839
13627A52839n0532M3051N0664N0180n1041j05523j2435K9589R5241N4140m8818
$$ 152839 102307 145358 196022 246202 195161 89638 77203 106792 202033 256173 207355
13616B07355L287j01663J20563q068j0255J1408J18343n1332r0519N0151m6849
$$ 207355 210642 108979 229542 221474 211219 222627 340970 289638 199119 249270 202421
13605B02421r6385j20948N7549O5916Q2823O2049L6548O7230q440j2613O4905
$$ 202421 106036 -14912 42637 108553 191376 253425 289973 357203 348763 336150 401055
13594D01055q378j46186o5737k3768n6879M1586N7817o6381M4695N2099O4877
$$ 401055 392677 246491 180754 156986 100107 141693 199510 133129 177824 229923 294800
13583B94800L512r8492j0534j890Q2519o8297k483R6399J11173J6725q9161R655
$$ 294800 298312 199820 189286 187396 269915 201618 199135 295534 406707 423432 334271 343926
13571C43926m9511j57365j419J6525L7636N7940P2302J15990m2575j05142l9384
$$ 343926 294415 137050 135631 152156 189792 247732 320034 436024 393449 288307 248923
13560B48923o8249r0152j30849N693P5002J09913k5383J7010J79955L192j26940
$$ 248923 180674 90522 -40327 -34634 40368 150281 124898 141908 321863 325055 198115
13549A98115j08544K18935L0352N721N00q5895j6038k6803J4109M2618r9761q0048
$$ 198115 89571 308506 338858 344579 345079 259184 243146 216343 230452 273070 173309 93261
13537I3261M6243J76589m2423j22444M8502J37932J25363R630q5589j0705j04480
$$ 93261 139504 316093 273670 151226 199728 337660 463023 472653 387064 376359 271879
13526B71879p6786o6667n5431J47609K21242k3308r4099k0542j9441L7300P7645
$$ 271879 195093 128426 72995 220604 441846 418538 324439 303897 284456 321756 399401
13515C99401j11085q2412j8168N2399N8877J3250j7092J425J3261j4050m2680
$$ 399401 288316 205904 187736 240135 299012 312262 295170 296595 309856 295806 253126
13504B53126M8849k1838n8881j5100l2474K0867m1643K2236J1673j02316l8305
$$ 253126 301975 280137 221256 206156 173682 194549 152906 175142 186815 84499 46194
13493D6194O4954P2748K8854J00892j0895M3390o2813j8950O8855K4709n4168
$$ 46194 111148 183896 212750 313642 302747 346137 283324 264374 333229 357938 303770
13482C03770m5883r738P0204k5993r704r6827o176J18001j7629K2452q6512o5790
$$ 303770 257887 248149 318353 292360 282656 185829 179653 297654 280025 302477 215965 150175
13470A50175L7657k6808J04249O1522j00735N6208R8975K5278m7696j4779P3491
$$ 150175 187832 161024 265273 326795 226060 282268 381243 406521 358825 344046 417537
13459D17537k3073Q157l9101r4681L4193j34707K1245K9366J5357o8299j1345
$$ 417537 394464 402621 363520 268839 303032 168325 189570 218936 234293 165994 154649
13448A54649M0784J05912J24204J06051J2058k4549j55945j16883j730n7895n2692
$$ 154649 195433 301345 425549 531600 543658 519109 363164 246281 244551 186656 133964
13437A33964J57667O8445r3108j03175k88q8514n8063k702l352N8815O1071Q9461
$$ 133964 291631 360076 266968 163793 163505 74991 16928 14226 10874 69689 130760 220221
13425B20221R3430p3704n5828p1067J7599R5861j05279L1369J198r7815n5980
$$ 220221 313651 239947 184119 113052 130651 226512 121233 152602 153800 55985 5
13414EQ9029P6600N6610j329j4151J0369N563k6943J27206K1831r6330k9221p8242
$$ 5 89034 165634 222244 220915 206764 217133 222696 195753 322959 344790 248460 219239 140997
13401A40997k9242O1425l3518r1148m2927N3047J18626J5181l6350k0827m3928
$$ 140997 111755 173180 139662 48514 5587 58634 177260 192441 156091 135264 91336
13390I1336r724M2418K1961L3496J01239R1914k4370P451m5325Q171P5392M5395
$$ 91336 81612 124030 145991 179487 280726 372640 348270 355721 310396 318567 393959 439354
13378D39354o8047k55318o2822J38757N5083L7447P9156l0878o8521j7618K2183
$$ 439354 371307 115989 53167 191924 247007 284454 363610 332732 264211 246593 268776
13367B68776J08572o8434l5873Q451n5782K6947R9974l3980k1468L5842K7173
$$ 268776 377348 308914 273041 281492 225710 252657 352631 318651 297183 333025 360198
13356C60198N1524p2220r5438r9048J7068m9931M058J11484R9341K5695K8582
$$ 360198 411722 339502 244064 145016 162084 112153 116211 227695 327036 352731 381313
13345C81313K8238M3329k8428j08427L845N1880n2358j20507j0605J43373k4169
$$ 381313 409551 452880 424452 316025 319870 371750 319392 198885 188280 331653 307484
13334C07484K893l7883j3404N480M389J9724j8087n0007k7597K9336q5648N3191
$$ 307484 310377 272494 259090 264570 268959 288683 270596 220589 192992 222328 136680 189871
13322A89871J17377p578J8882J10670l3414m3390J1588q041q0539q1518Q970J33535
$$ 189871 307248 299670 318552 429222 395808 352418 364006 355965 275426 193908 202878 336413
13310C36413r3888j22882l4317O855J17068J02352Q127l2991J3198K3192r2826
$$ 336413 242525 119643 85326 92181 209249 311601 319728 286737 299935 323127 230301
13299B30301m1310R578l1315P7403O6898q2193J2586J55855Q685j98011p6311
$$ 230301 188991 198569 167254 244657 311555 229362 241948 397803 406488 208477 132166
13288A32166L6448L101j9518L2844O3828K5639O1089J04809L9759j15793j05979
$$ 132166 168614 171715 152197 185041 248869 274508 335597 440406 480165 364372 258393
13277B58393o526L2223k4910n309J4892L1888J60940Q9112n8809j23132q052L0937
$$ 258393 251867 284090 259180 253871 268763 300651 461591 550703 491894 368762 360710 391647
13265C91647M5713J2440l2731J5762K149L3527r492L7205j41523j28948J7172
$$ 391647 437360 449800 417069 432831 434980 468507 459015 496220 354697 225749 242921
13254B42921q5926J194k0956p5893k8110Q3764J03228P0954l0j25723M3523N1865
$$ 242921 156995 158189 137233 61340 33230 116994 220222 291176 291146 165423 208946 260811
13242B60811m5776L6810J43666P299j39083l104k0598N9451R328N1699j8500q2456
$$ 260811 215035 251845 395511 402810 263727 260623 240025 299476 308804 360503 342003 259547
13230B59547n8001p9918M2072M5754q219K5066l1383k544K32718J3704n8834p8354
$$ 259547 201546 121628 163700 209454 201235 226301 194918 192374 425092 438796 379962 301608
13218C01608j32956R5713P3112m6644q6802K7076L3892n3230p0729J48354N5516
$$ 301608 168652 264365 337477 290833 204031 231107 264999 211769 141040 289394 344910
13207C44910q2874o0721P4328R909o0382N6725k5618K0352J8213j08909N82K0276
$$ 344910 262036 201315 275643 285552 225170 281895 256277 276629 294842 185933 186515 206791
13195B06791Q7400J31803K5330j3016k9839o6992p4560Q384J8977q1116M2943
$$ 206791 294191 425994 451324 438308 408469 341477 266917 275301 294278 213162 256105
13184B56105J60826M6266k6210p6556Q6651k0535j23009p4808M4928L8380K760
$$ 256105 416931 463197 436987 360431 447082 426547 303538 228730 273658 312038 314798
13173C14798O318N0897J01583o1816j66002j20725J2537O6077P0170K0999R6619
$$ 314798 321116 372013 473596 411780 245778 125053 137590 203667 273837 294836 391455
13162C91455O1216J1802j8157j03863o2306Q7293J04665o3600l1702K8733k1070
$$ 391455 452671 464473 446316 342453 280147 367440 472105 408505 376803 405536 384466
13151C84466k013M2575k6569l3529Q2950L0487N4778r93m3077L0101j05773n6260
$$ 384466 382453 425028 398459 364930 447880 478367 533145 532152 489075 519176 413403 357143
13139C57143J5185R9961n1549j13592P089L6987j43393J533L1649l2987R5384
$$ 357143 372328 472289 420740 307148 314237 351224 207831 209364 241013 208026 303410
13128C03410K6153l8023p8202P2648O5313L3414L0307L8744k0779l2603j05729
$$ 303410 329563 291540 213338 285986 351299 384713 415020 453764 432985 400382 294653
13117B94653j8746l4055l7242M4324O9368N4570J31647L4977n1507m1211j9426
$$ 294653 275907 241852 204610 248934 318302 372872 504519 539496 487989 446778 427352
13106D27352l364j40419N4125O5662j22062j45863J0862O5977n6668l7666J20815
$$ 427352 423988 283569 337694 403356 281294 135431 146293 212270 155602 117936 238751
13095B38751j4743l0832O1586K9977N2108O400k2041J915l8274k4311N8218N7602
$$ 238751 224008 193176 254762 284739 336847 343247 321206 323121 284847 260536 318754 376356
13083C76356J2968K4564Q5179n8935m2823m1000J05671J02817k495R868j01205
$$ 376356 389324 413888 499067 440132 397309 356309 461980 564797 562302 572170 470965
13072D70965l1440L0882n0066r5680j00048K1692O1447Q4741R29l6976P2763R697
$$ 470965 439525 470407 420341 324661 224613 246305 307752 392493 393422 356446 429209 438906
13060D38906K3400n7237R9897N6787K7086o8780l4359M7353l5435j25136K1665
$$ 438906 462306 405069 504966 561753 588839 520059 485700 533053 497618 372482 394147
13049C94147R6090O9514k8002L4607m4626m1873k7127k391j4420P5340k3381K8737
$$ 394147 490237 559751 531749 566356 521730 479857 452730 450339 435919 511259 487878 516615
13037E16615l4197j06739p1402Q4247L0845J00816M8681o4712j41811J2513K9079
$$ 516615 482418 375679 304277 388524 419369 520185 568866 504154 362343 374856 403935
13026D03935J00617R8213P6822j8425l3267j22813k5454l8270M5504L8384q2902
$$ 403935 504552 602765 679587 661162 627895 505082 479628 441358 486862 525246 442344
13015D42344K3717R8016M6307p876k8726l1560m617m6617J0711P032M3075m3586
$$ 442344 466061 564077 610384 602508 573782 542222 537605 490988 501699 508731 551806 508220
13003E08220L7341m1892j03006O0904R4690j07901M6511K1475N1953r7814O3259
$$ 508220 545561 503669 400663 461567 556257 448356 494867 516342 568295 470481 533740
12992E33740l957J1031p8491M1727P3177l1830P9172R7573Q6064k2602r8232m5066
$$ 533740 529783 540814 462323 504050 577227 545397 624569 722142 808206 785604 687372 642306
12980F42306Q7202Q0768j8349k03082J1991M5925m0072J4873J5687M30m6945o9790
$$ 642306 729508 810276 791927 588845 600836 646761 606689 621562 637249 637679 590734 520944
12968E20944n8489R0093P2445o4596n0799j506o7832M6592J39253P6526q0458
$$ 520944 462455 552548 624993 560397 509598 508092 440260 486852 626105 702631 622173
12957F22173q1816P6427K24632P2308j08202j87213r7634O7031j0501N8051N6727
$$ 622173 540357 616784 841416 913724 805522 618309 520675 587706 577205 635256 691983
12946F91983K6537L7749o4199j11998k0606J22275M9614L405R6375j7258j15510
$$ 691983 718520 756269 692070 580072 559466 681741 731355 734760 831135 813877 698367
12935F98367J04164J2681l2953q481j1837l8457M1883K4927J77126O4466j69445
$$ 698367 802531 815212 782259 773778 761941 723484 765367 790294 967420 1031886 862441
12924H62441L884J77912J86026m0110J09383J52345J59949k9216K0431K03771
$$ 862441 866325 1044237 1230263 1190153 1299536 1451881 1611830 1582614 1603045 1806816
12914A806816Q2577k1217j34763k5142P0159L1137q7740N1812K3212r8804o4909
$$ 1806816 1889393 1868176 1733413 1708271 1778430 1809567 1721827 1773639 1796851 1698047 1633138
12903A633138l9514P1672M217o7514L1414N7835R0665Q0561M8510l2271Q8992
$$ 1633138 1593624 1665296 1669513 1601999 1633413 1691248 1781913 1862474 1910984 1878713 1967705
12892A967705K40053J11521N7733J13114P6330j6842p4896L0070K7811m9787r8178
$$ 1967705 2207758 2319279 2377012 2490126 2566456 2549614 2474718 2504788 2532599 2482812 2384634
12881B384634K6759K8829J7503k9910k11693j91715p7123l1762K6624q4636L0458
$$ 2384634 2411393 2440222 2457725 2427815 2216122 2024407 1947284 1915522 1942146 1857510 1887968
12870A887968J44060L1932l4029q5054O4456N8604L0606o966j1665M1644P5304
$$ 1887968 2032028 2063960 2029931 1944877 2009333 2067937 2098543 2091577 2079912 2121556 2196860
12859B196860N6739N5205o6487j21612M6438P8313r5721j58836k05218m2819J13500
$$ 2196860 2253599 2308804 2242317 2120705 2167143 2245456 2149735 1990899 1785681 1742862 1856362
12848A856362J08526n0078k06000j42378l7403k3497L2616j30244k45999j03190
$$ 1856362 1964888 1914810 1708810 1566432 1529029 1505532 1538148 1407904 1161905 1058715
12838A058715M5809r922Q3670J12007p9189m7569L0144l9697o9194Q2894m9329
$$ 1058715 1104524 1094602 1178272 1290279 1211090 1163521 1193665 1153968 1084774 1167668 1118339
12827A118339j00781o5770o937N6601k7552R3618P1003l7336q6036q509N7812
$$ 1118339 1017558 951788 944851 1001452 973900 1067518 1138521 1101185 1015149 1006640 1064452
12816A064452j2771j11404L1724N2462K7538J5803q5496N5380m653j3205k0962
$$ 1064452 1051681 940277 972001 1024463 1052001 1067804 982308 1037688 1033035 1019830 998868
12805I98868j08997R962J38015j1872o1314l6490L3804R9253l6625k9744L4049
$$ 998868 889871 899833 1037848 1025976 964662 928172 961976 1061229 1024604 994860 1028909
12794A028909O560m2780l1611n3789l3306N2235P1112L1764K9295J31081J0983
$$ 1028909 1035469 992689 961078 907289 873983 926218 997330 1029094 1058389 1189470 1200453
12783A200453J0255j4520j21148n2541j12021L613J32282R3840r314P9203P4582
$$ 1200453 1210708 1196188 1075040 1022499 910478 914091 1046373 1140213 1130899 1210102 1284684
12772A284684j7345q1092q6117j16670l6176P4275O1251M0329p186j23588r0909
$$ 1284684 1267339 1186247 1100130 983460 947284 1021559 1082810 1123139 1115953 992365 901456
12761I01456J83225J09944j05975J7798J6235J1653m9949L3396P967Q366J34684
$$ 901456 1084681 1194625 1088650 1106448 1122683 1134336 1084387 1117783 1125750 1134116 1268800
12750A268800R4810o272l182m6658J141m3786M8580J4564q327M8368j2950K7394
$$ 1268800 1363610 1357338 1354156 1307498 1308639 1264853 1313433 1327997 1319670 1368038 1355088 1382482
12738A382482j6559r6455o4031L058J04509m656l6872P3361l7710p6603k3130
$$ 1382482 1365923 1269468 1205437 1208495 1313004 1308348 1271476 1344837 1307127 1230524 1207394
12727A207394J5377J31168Q2429l1416m1582o0505P3857J11475R6788J5748j42970
$$ 1207394 1222771 1353939 1436368 1404952 1363370 1302865 1376722 1488197 1584985 1600733 1457763
12716A457763k6392K8786p8439j8207n994j65915k3728J7645j5144P7047J60096
$$ 1457763 1431371 1460157 1381718 1363511 1357517 1191602 1167874 1185519 1170375 1247422 1407518
12705A407518P135p0742j23526N430r479K1445o5146n2674R8563o3888j41484
$$ 1407518 1414653 1343911 1220385 1225815 1216336 1237781 1172635 1119961 1218524 1154636 1013152
12694A013152N8424N6850O8470L7446M5939j01674m0640O5003O8622J53169P5218
$$ 1013152 1071576 1128426 1196896 1234342 1280281 1178607 1137967 1202970 1271592 1424761 1499979
12683A499979O370j54136k5936L3279l2732R0079p4657M8452J42081l5401j04275
$$ 1499979 1506349 1352213 1326277 1359556 1326824 1416903 1342246 1390698 1532779 1497378 1393103
12672A393103n2057P6561o5896o531N3761P2125L6376n914q8436O1259r1872o7850
$$ 1393103 1341046 1417607 1351711 1345180 1398941 1471066 1507442 1501528 1413092 1474351 1382479 1314629
12660A314629o895K91r865j05214J31062J45168J3426O5029K071j5512o6902p9868
$$ 1314629 1307734 1308025 1298160 1192946 1324008 1469176 1482602 1547631 1549702 1534190 1467288 1387420
12648A387420P0260r7279n1370J82288k2395n1375q098q7540o4195J26241J13602
$$ 1387420 1457680 1360401 1309031 1491319 1468924 1417549 1409451 1321911 1257716 1383957 1497559
12637A497559k2945o0190L9939L6599n6141O2322l1503k2233P418o8282N396j9526
$$ 1497559 1474614 1414424 1454363 1490962 1434821 1497143 1465640 1443407 1450825 1382543 1387939 1368413
12625A368413q8137m063R514n9425J45851J12661k8450k0389J71078M4784J1327
$$ 1368413 1280276 1276213 1285727 1226302 1372153 1484814 1456364 1435975 1607053 1651837 1663164
12614A663164j0528J43599P0391m7477l3133O6350J42911k5637o1478M501J37893
$$ 1663164 1652636 1796235 1866626 1819149 1786016 1852366 1995277 1969640 1908162 1912663 2050556
12603B050556l5841j63850r3395L9510J64223J32295p8732O7269J8011K10177
$$ 2050556 2014715 1850865 1757470 1796980 1961203 2093498 2014766 2082035 2100046 2310223
12593B310223K34593J05858J214Q054J3257Q5766J11289l7881p9099m0567K4905
$$ 2310223 2544816 2650674 2651888 2659942 2673199 2758965 2870254 2832373 2753274 2712707 2737612
12582B737612J37881J08640o6976m1199M2961k8426J4333Q4632J26612j7918r9708
$$ 2737612 2875493 2984133 2917157 2875958 2918919 2890493 2904826 2989458 3116070 3098152 2998444
12571B998444l7731M6944R297J13275K1469N485Q1793J634J17102J14790J12021
$$ 2998444 2960713 3007657 3016954 3130229 3151698 3157183 3238976 3240610 3357712 3472502 3584523
12560C584523P7323p2375J40764J26845J34869M3675P050Q0741J19113J07227
$$ 3584523 3661846 3589471 3730235 3857080 3991949 4035624 4042674 4123415 4242528 4349755
12550D349755J72M5033J44401J81437N0442o05L7542J14762L5407o9335J25571
$$ 4349755 4349927 4394960 4539361 4720798 4771240 4770635 4808177 4922939 4958346 4889011 5014582
12539E014582J30961J21055J86578N699Q7468K49287J69819q687J28325J48900
$$ 5014582 5145543 5266598 5453176 5458875 5546343 5795630 5965449 5956762 6085087 6233987
12529F233987J68073J90595J4838O8313O5657K53013J81345J08453J64076J47598
$$ 6233987 6402060 6592655 6607493 6675806 6741463 6994476 7175821 7284274 7448350 7595948
12519G595948K70501J67877J49044J29075K41146K37600K72257K98982K74095
$$ 7595948 7866449 8034326 8183370 8312445 8553591 8791191 9063448 9362430 9636525
12510I636525L44985L69310L33042L94850M35528M15964K78168M32110M92238
$$ 9636525 9981510 10350820 10683862 11078712 11514240 11930204 12208372 12640482 13132720
12501A3132720N03049N38561N95387N68470O67975R42597Q18461R22710Q42853
$$ 13132720 13635769 14174330 14769717 15338187 16006162 16948759 17767220 18689930 19532783
12492A9532783R40384J059312J249058J317447J490883J812732J992923K182066
$$ 19532783 20473167 21532479 22781537 24098984 25589867 27402599 29395522 31577588
12484C1577588K509804K800560L155646L497930M043719M692196N505555O508321
$$ 31577588 34087392 36887952 40043598 43541528 47585247 52277443 57782998 64291319
12476F4291319P546088Q827454J0614673J2922802J5341727J7996656K0372008
$$ 64291319 71837407 80664861 91279534 104202336 119544063 137540719 157912727
12469A57912727K2626500K3476244K2229288J8575250J2684817N596570j219217
$$ 157912727 180539227 204015471 226244759 244820009 257504826 263101396 261882179
12462B61882179o664955j0314579j1995118j1991621j0677313q908480o747603
$$ 261882179 255217224 244902645 232907527 220915906 210238593 201330113 194582510
12455A94582510m803899l356484k298764j501306k79857J457716L864859O791817
$$ 194582510 189778611 186422127 184123363 182622057 182342200 183799916 187664775 194456592
12447A94456592J0300016J4127677J7893753K0640338K1823108K1702994K0227044
$$ 194456592 204756608 218884285 236778038 257418376 279241484 300944478 321171522
12440C21171522J8121370J5811023J2627112Q692431M027534j102470n570603
$$ 321171522 339292892 355103915 367731027 376423458 380450992 379348522 373777919
12433C73777919q936858j0772593j1212772j0753072j0210750j0275262j1191538
$$ 373777919 364841061 354068468 342855696 332102624 321891874 311616612 300425074
12426C00425074j2691520j4271444j5155194j5012228j3899640j1616481q812877
$$ 300425074 287733554 273462110 258306916 243294688 229395048 217778567 208965690
12419B08965690n585359k368701M01813K537813M041920N726928P394837R463628
$$ 208965690 203380331 201011630 201413443 203951256 207993176 213720104 221114941 230578569
12411B30578569J2024488J4891774J7365940J8197133J6358875J1750599M375477
$$ 230578569 242603057 257494831 274860771 293057904 309416779 321167378 325542855
12404C25542855m388391j3059157j9868238k4050673k6190214k6391945k5089126
$$ 325542855 321154464 308095307 288227069 264176396 237986182 211594237 186505111
12397A86505111k2977340k0151354j7433108j5010971j2777096j0881544r267102
$$ 186505111 163527771 143376417 125943309 110932338 98155242 87273698 78006596
12390G8006596p902986o774927n959552n016079m463838m020590l441816l047594
$$ 78006596 70103610 63328683 57369131 52353052 47889214 43868624 40426808 37379214
12382C7379214k783568k313118k143023j943073j868465j564809j389697j320077
$$ 37379214 34595646 32282528 30139505 28196432 26327967 24763158 23373461 22053384
12374B2053384j068809j103235j126270r65810r28681q08198o88126o50260m56581
$$ 22053384 20984575 19881340 18755070 17789260 16860579 16052381 15364255 14713995 14257414
12365A4257414m46172n27643o50005n86941l81252m84225l75769k74006k46930
$$ 14257414 13811242 13283599 12633594 12046653 11665401 11181176 10805407 10531401 10284471
12356A0284471k53547k50311k38645l28070l82488l13223k66446j43345j09059
$$ 10284471 10030924 9780613 9541968 9213898 8831410 8518187 8251741 8108396 7999337
12347G999337j78052j91755j42508j59247j37450j67891j00255m2746j79187k34971
$$ 7999337 7821285 7629530 7487022 7327775 7190325 7022434 6922179 6879433 6700246 6465275
12337F465275j28332j37084j7966m9226l5926J2872J36292P4371j01317k1906
$$ 6465275 6336943 6199859 6181893 6132667 6096741 6109613 6245905 6320276 6218959 6197053
12327F197053O7421N5945Q0822J54773j7972j38699o1922J1205j9257r9602m353
$$ 6197053 6264474 6320419 6401241 6556014 6538042 6399343 6337421 6348626 6329369 6229767 6225414
12316F225414P338j37188J0843r4287k7740M4018j50560j00309j06060p5870j1414
$$ 6225414 6232752 6095564 6106407 6012120 5984380 6028398 5877838 5777529 5671469 5595599 5584185
12305E584185n1521l9834j09940K92J0112j1933r5415j9416R5852r744m0167n8566
$$ 5584185 5532664 5492830 5382890 5383182 5393294 5381361 5285946 5266530 5362382 5352638 5312471 5253905
12293E253905l0510K5857J22922J42978L47884J76350J52823Q4201K02571J03173
$$ 5253905 5223395 5249252 5372174 5515152 5863036 6039386 6192209 6276410 6478981 6582154
12283F582154M8955R3134K53302k5382r2520k55227l38006k77938j92704j71288
$$ 6582154 6631109 6724243 6977545 6952163 6859643 6604416 6266410 5988472 5795768 5624480
12273E624480j40805k61648j8897r421j37444k43915j39164l0597j35171o7166
$$ 5624480 5483675 5222027 5203130 5193709 5056265 4812350 4673186 4642589 4507418 4440252
12263D440252o1852p843k7170O3227O0054l8123j82709p1986M636k0576k2468
$$ 4440252 4378400 4370557 4343387 4406614 4466668 4428545 4245836 4173850 4178486 4157910 4135442
12252D135442N0361k1454n2628j13085l9521j0831l0607o5709j427m9376r8054
$$ 4135442 4185803 4164349 4111721 3998636 3959115 3948284 3917677 3851968 3850541 3801165 3703111
12241C703111j02424q4462O4536l7375j50226k6877j08271K6763J08425n7556
$$ 3703111 3600687 3516225 3580761 3543386 3393160 3366283 3258012 3284775 3393200 3335644
12231C335644o0467q9840N122o302M8721o5860n0539J7493n46O8533o818l3921
$$ 3335644 3275177 3185337 3190459 3184157 3232878 3167018 3116479 3133972 3133426 3201959 3195141 3161220
12219C161220k7106K0267N6872N2009J00675q3328J2067P0911j35127K5525M2345
$$ 3161220 3134114 3154381 3211253 3263262 3363937 3280609 3292676 3363587 3228460 3253985 3296330
12208C296330O9201q1306j045K525j08703j6720K0398M7144M5818p4295q2956
$$ 3296330 3365531 3284225 3283180 3285705 3177002 3160282 3180680 3227824 3273642 3199347 3116391
12197C116391J3356L8721l5163j20301k0572O9381J14628K6801l2271l8541Q7661
$$ 3116391 3129747 3168468 3133305 3013004 2992432 3061813 3176441 3203242 3170971 3132430 3220091
12186C220091K6478n6843O9567J42338n0987j05400m605L8752j0327m25L4517
$$ 3220091 3246569 3189726 3259293 3401631 3350644 3245244 3240639 3279391 3269064 3268639 3303156
12175C303156O669L537j05402O7781J4656k5621J06527K71328J14921j22328o3213
$$ 3303156 3309825 3313362 3207960 3275741 3290397 3264776 3371303 3642631 3757552 3635224 3572011
12164C572011j83721j74152l9395K1929L575Q2670R2456l406R83K402M5795J11191
$$ 3572011 3388290 3214138 3174743 3196672 3200247 3282917 3375373 3371967 3372950 3375352 3421147 3532338
12152C532338q3609k86071J1816J05347K3942R8618L121l8737M8228n3381J04483
$$ 3532338 3448729 3162658 3174474 3279821 3303763 3402381 3405502 3366765 3414993 3361612 3466095
12141C466095n7923m7260J6106Q4894n5828j41888k6062N5702K6653N1015J46688
$$ 3466095 3408172 3360912 3377018 3461912 3406084 3264196 3238134 3293836 3320489 3371504 3518192
12130C518192P088O60K2783j44959N824M4632l0014O7729k1479o0376n6852P2820
$$ 3518192 3525280 3525940 3548723 3403764 3409588 3454220 3424206 3491935 3470456 3410080 3353228 3426048
12118C426048P9037J5577J2163k6460n3509J08866J83611O9524l1218N4034p8539
$$ 3426048 3505085 3520662 3532825 3506365 3452856 3561722 3745333 3814857 3783639 3837673 3759134
12107C759134M672r5365N7040J17616m6828m3482M5807n1968L7924R7254n9433
$$ 3759134 3763806 3668441 3725481 3843097 3796269 3752787 3798594 3746626 3784550 3881804 3822371
12096C822371j1776M0858j23553J36602P0993M1679Q9303n7795J6248j5534r510
$$ 3822371 3810595 3851453 3727900 3864502 3935495 3977174 4066477 4008682 4024930 4009396 3999886
12085C999886n2830M7774M8174J428p562J13661L8177R17J2153K8318M2877j02884
$$ 3999886 3947056 3994830 4043004 4044432 4036870 4150531 4188708 4189625 4201778 4230096 4272973 4170089
12073D170089J0626L7296k5878R5234R9925n1189j12804k2459M7891n4482J95964
$$ 4170089 4180715 4218011 4192133 4287367 4387292 4336103 4223299 4200840 4248731 4194249 4390213
12062D390213J44683N5006j36630L1477K0422L9619k2240j18125M8335q8138K6296
$$ 4390213 4534896 4589902 4453272 4484749 4505171 4544790 4522550 4404425 4452760 4364622 4390918
12051D390918J6282m0910j03768K7503J89317J20468J66955J02096J25523J18925
$$ 4390918 4407200 4366290 4262522 4290025 4479342 4599810 4766765 4868861 4994384 5113309
12041E113309m480R8552Qo9381K6099J3674L4675J41047J78914J72665r888l392
$$ 5113309 5108829 5207381 5207389 5138008 5164107 5177781 5212456 5353503 5532417 5705082 5695194 5691802
12029E691802q0790l112J11106R6824O0405J20392J24112J76776J65086J87191
$$ 5691802 5611012 5607900 5719006 5815830 5876235 5996627 6120739 6297515 6462601 6649792
12019F649792K60534L59595L08119J00898O5281L2513J24399P5331Q2348j44373
$$ 6649792 6910326 7269921 7578040 7678938 7744219 7776732 7901131 7976462 8058810 7914437
12009G914437j43335L0480p7370r6013M6513Q725R5881j15285q807J41208J85483
$$ 7914437 7771102 7801582 7724212 7628199 7674712 7683437 7779318 7664033 7655226 7796434 7981917
11998G981917J16594J5108N6930P7606n267J15693J24570O1590p3763J26651j1087
$$ 7981917 8098511 8113619 8170549 8248155 8242888 8358581 8483151 8544741 8470978 8597629 8586542
11987H586542J27720J87219J52120O7746J80180N1896L1632j2836O3526P1934
$$ 8586542 8714262 8901481 9053601 9121347 9301527 9353423 9385055 9372219 9435745 9507679
11977I507679P2354P6409J1146M5710K09959J88118J21534K4484Q2448K4730N4195
$$ 9507679 9580033 9656442 9667588 9713298 9923257 10111375 10232909 10257393 10339841 10364571 10418766
11966A0418766J15557J52325N2782J54657L11627K68502J18102J46776K67981
$$ 10418766 10534323 10686648 10739430 10894087 11205714 11474216 11592318 11739094 12007075
11957A2007075K59690M2964J20316J94772K07394R0000J01523K15396K17962K31817
$$ 12007075 12266765 12309729 12430045 12624817 12832211 12922211 13023734 13239130 13457092 13688909
11947A3688909J6518k3159N9288P0113J99343J52500J49164J56042K35224K70152
$$ 13688909 13705427 13682268 13741556 13811669 14011012 14163512 14312676 14468718 14703942 14974094
11937A4974094K01045K28915K75986L97485L33465L83819L50484M82952N52253
$$ 14974094 15175139 15404054 15680040 16077525 16410990 16794809 17145293 17628245 18180498
11928A8180498N06378N13884O91115P06903O87594P55824R38943Q53385Q52282
$$ 18180498 18686876 19200760 19891875 20598778 21286372 22042196 22981139 23834524 24686806
11919B4686806J043550J204731J393879J392144J428993J620981K077600K227034
$$ 24686806 25730356 26935087 28328966 29721110 31150103 32771084 34848684 37075718
11911C7075718K405818K847322L146995L637238M098026M753156N590863O602507
$$ 37075718 39481536 42328858 45475853 49113091 53211117 57964273 63555136 70157643
11903G0157643P666303R069776J0593589J2715644J5008839J7708343K0981882
$$ 70157643 77823946 86893722 97487311 110202955 125211794 142920137 163902019
11896A63902019K4050345K6644037K8119687K7421348K4005960J7781299R700332
$$ 163902019 187952364 214596401 242716088 270137436 294143396 311924695 321625027
11889C21625027J193381o093307j1366842j4216489j4882245j4013537j2472559
$$ 321625027 322818408 316725101 305358259 291141770 276259525 262245988 249773429
11882B49773429j0735293r519562q456626p268310n460705l334958r68068J959875
$$ 249773429 239038136 229518574 221061948 213793638 208332933 204997975 204029907 205989782
11874B05989782N091523Q454880J1278046J3035405J3558687J3155956J2180390
$$ 205989782 211081305 219536185 230814231 243849636 257408323 270564279 282744669
11867B82744669J1717110J1998571J2946826J4170115J4765389J4128814J2057078
$$ 282744669 294461779 306460350 319407176 333577291 348342680 362471494 374528572
11860C74528572Q335592L772971j117534n689425r683740j3254164j6113256j8700228
$$ 374528572 382864164 386637135 385519601 379830176 370146436 356892272 340779016 322078788
11852C22078788k0506028k0976925k0403553j8663799j6048593j2984580r760262
$$ 322078788 301572760 280595835 260192282 241528483 225479890 212495310 202735048
11845B02735048o613401m034710k010272o13216L47701J243869K468776M323919
$$ 202735048 196121647 192086937 190076665 189463449 189811150 191055019 193523795 197847714
11837A97847714O524578R059540J1237730J2619283J2339116R996131N597445
$$ 197847714 204372292 213431832 224669562 237288845 249627961 259624092 265221537
11830B65221537m04087o993335j3099368j7620458k0172172k0955365k0454437
$$ 265221537 264817450 257824115 244724747 227104289 206932117 185976752 165522315
11823A65522315j9087704j7179655j5105031j3200680j1384724r588569q249173
$$ 165522315 146434611 129254956 114149925 100949245 89564521 79975952 71726779
11816G1726779p143070o204633n109388m585902m039187l360240l000569k737717
$$ 71726779 64583709 58379076 53269688 48683786 44644599 41284359 38283790 35546073
11808C5546073k467921k139509j753060j558820j609086j366261j318634j160032
$$ 35546073 33078152 30938643 29185583 27626763 26017677 24651416 23332782 22172750
11800B2172750q69009q27968r25703q82039p10947o57327p45287o78437n89541
$$ 22172750 21303741 20475773 19550070 18668031 17957084 17299757 16554470 15876033 15286492
11791A5286492m88248l91322n23951m58930l11240l44879l68106n01136k97047
$$ 15286492 14798244 14406922 13882971 13424041 13112801 12767922 12399816 11898680 11601633
11782A1601633j90807k66977l34631l25487n3309j92727k19585k47082l26900
$$ 11601633 11410826 11143849 10809218 10483731 10430422 10237695 10018110 9771028 9444128
11773I444128k88539j64108o5739j14195j34395j07916j08025j23228k06892k13535
$$ 9444128 9155589 8991481 8925742 8811547 8677152 8569236 8461211 8337983 8131091 7917556
11763G917556j63613j02635k05259j72619j92995j37008j3015p3993j55560j52424
$$ 7917556 7753943 7651308 7446049 7273430 7080435 6943427 6930412 6856419 6700859 6548435
11753F548435n2676o1150j68177j91522j9870Q5412k2756j86835p5981K1365q110
$$ 6548435 6495759 6434609 6266432 6074910 6055040 6140452 6117696 5930861 5854880 5876245 5868135
11742E868135n4956N8163J0485p5488n2071j71306j03754N0105J5511q5432l1326
$$ 5868135 5813179 5871342 5881827 5806339 5754268 5582962 5479208 5529313 5544824 5459392 5428066
11731E428066o0777q8418o2088O8647k2765m9554j23713j98218n0723m1445p4563
$$ 5428066 5367289 5278871 5216783 5285430 5262665 5213111 5089398 4891180 4840457 4799012 4724449
11720D724449n1969j11501P6871J2120O6520K9900j68495j1992O0272N3090N0018
$$ 4724449 4672480 4560979 4637850 4649970 4716490 4746390 4577895 4565903 4626175 4679265 4729283
11709D729283M6080N2758N1171L7315P5250m9334n2973m6160j99893j01626n0059
$$ 4729283 4775363 4828121 4879292 4916607 4991857 4942523 4889550 4843390 4643497 4541871 4491812
11698D491812j03961r6445k8150j4233m9273n2502q8442n8385J059p7429j82335
$$ 4491812 4387851 4291406 4263256 4249023 4199750 4147248 4058806 4000421 4001480 3924051 3741716
11687C741716r8660J79999Q2595j31462k09671j37495Q1130J12131q9348M8663
$$ 3741716 3643056 3823055 3905650 3774188 3564517 3427022 3508152 3620283 3530935 3579598
11677C579598J76919M3133o8484j60218o6883o1811R5925R2072q142j49985m6317
$$ 3579598 3756517 3799650 3731166 3570948 3504065 3442254 3538179 3630251 3622109 3472124 3425807
11666C425807m072l5943P4752N448p5695j49628j32861o2495l7077j735k3502
$$ 3425807 3421735 3385792 3460544 3465992 3390297 3240669 3107808 3045313 3008236 3006501 2982999
11655B982999j2726k5678o5546l4259j9954l1739K0231K182K2513n2850o851L1470
$$ 2982999 2970273 2944595 2879049 2844790 2824836 2793097 2813328 2815510 2838023 2785173 2778322 2809792
11643B809792r5194p9367Q2545l4211k5140M4404l4555m9086n2437j20262m5233
$$ 2809792 2714598 2635231 2717776 2683565 2658425 2702829 2668274 2619188 2566751 2446489 2401256
11632B401256M1541M0283l2810n2845m3120K7698l8880Q6298k2455k8207L3211
$$ 2401256 2442797 2483080 2450270 2397425 2354305 2382003 2343123 2429421 2406966 2378759 2411970
11621B411970l0406q1913J18453J8015o0100j58703r3503N855N0184O7325l0525
$$ 2411970 2381564 2299651 2418104 2436119 2376019 2217316 2123813 2129668 2179852 2247177 2216652
11610B216652o5432j21651o4559k922R4956q6156p6335l6633P3505J86022J4220
$$ 2216652 2151220 2029569 1965010 1962088 2057044 1970888 1894553 1857920 1931425 2117447 2131667
11599B131667r5912q5930p2072M9153N0077j00756J4665m4124O322K9712M3623
$$ 2131667 2035755 1949825 1877753 1926906 1976983 1876227 1890892 1846768 1853090 1882802 1926425
11588A926425j40200j14921l6211J2013K9887j27020k3395P9502N995j05962j5496
$$ 1926425 1786225 1671304 1635093 1647106 1676993 1549973 1526578 1606080 1612075 1506113 1490617
11577A490617M3663J9196L2295p678M6498L2039J4007J6850j01298q4407J4467
$$ 1490617 1534280 1553476 1585771 1578093 1624591 1656630 1670637 1687487 1586189 1501782 1516249
11566A516249O1737m7777q0834J9249P1659J53363R9998q6884j95624j07342n1394
$$ 1516249 1577986 1530209 1449375 1468624 1540283 1693646 1793644 1706760 1511136 1403794 1352400
11555A352400L1888k1380j42882k2429m9274P6864M6434J1469R55J02145k8884
$$ 1352400 1384288 1362908 1220026 1197597 1148323 1225187 1271621 1283090 1284045 1386190 1357306
11544A357306k5361j18066j62349P831Q8608k3496j8362n0835J5289K02188O7257
$$ 1357306 1331945 1213879 1051530 1059361 1147969 1124473 1106111 1055276 1070565 1272753 1340010
11533A340010k5580J5971k8748j53466k6771P6220J11670l1418j30675j08780
$$ 1340010 1314430 1330401 1301653 1148187 1121416 1197636 1309306 1277888 1147213 1038433
11523A038433K045P6390j2419K6829N2684k3037r4702L8972Q6350J9218M986n3442
$$ 1038433 1040478 1116868 1104449 1131278 1183962 1160925 1066223 1105195 1191545 1210763 1215749 1162307
11511A162307j07469k9426p0218k2629j6974J9971P2318Q5276l4335K7182P9739
$$ 1162307 1054838 1025412 955194 932565 915591 935562 1007880 1093156 1058821 1086003 1165742
11500A165742P7369R6616L933p0602j8724j01957l0759N6196O2959j2474q4082
$$ 1165742 1243111 1339727 1343660 1273058 1254334 1152377 1121618 1177814 1240773 1228299 1144217
11489A144217N8161M0759Q7900N0568l3469p0494m6620k257j02668p9976o355
$$ 1144217 1202378 1243137 1331037 1381605 1348136 1277642 1231022 1228765 1126097 1046121 1039766
11478A039766K2850L1055M8242J00794j44129j03182M1084q7011l7857J31652
$$ 1039766 1062616 1093671 1141913 1242707 1098578 995396 1036480 949469 911612 1043264
11468A043264J07807o9947o6205J19805J79108O5800J27581o0224J7511J49977
$$ 1043264 1151071 1081124 1014919 1134724 1313832 1379632 1507213 1446989 1464500 1614477
11458A614477J41395L5089J3926N1867Q5902J07496Q0364N0665N622K9005j7642
$$ 1614477 1755872 1790961 1804887 1856754 1942656 2050152 2130516 2181181 2186803 2215808 2198166
11447B198166K737n5142j71349j49716j16636R7637J2263Q1360J10826j2271m4270
$$ 2198166 2200903 2145761 1974412 1824696 1708060 1805697 1817960 1899320 2010146 1997875 1953605
11436A953605M9350j564p0862L1650J39990J71187J59479P9350m4476O521J7066
$$ 1953605 2002955 2001391 1930529 1962179 2102169 2273356 2432835 2512185 2467709 2474230 2491296
11425B491296N7714J1070P7923o4805m4284J32619N5703n7723j56354j40315o8537
$$ 2491296 2549010 2560080 2638003 2573198 2528914 2661533 2717236 2659513 2503159 2362844 2294307
11414B294307N0700k12473j16407K4829M3467j02260j3890j14472j7379L4524
$$ 2294307 2345007 2132534 2016127 2040956 2084423 1982163 1968273 1853801 1836422 1870946
11404A870946l3442Q0583K4920J2769j41145r0443l3758O6453P5330M0697K8947
$$ 1870946 1837504 1918087 1943007 1955776 1814631 1724188 1690430 1756883 1832213 1872910 1901857
11393A901857L5108J251l745m1077k6502p5102j24637k0597j8201j39214o9513
$$ 1901857 1936965 1938216 1934471 1893394 1866892 1791790 1667153 1646556 1628355 1489141 1419628
11382A419628M9412q4525r3972r0090q3695o3015o1675k4099m8853Q2484n682
$$ 1419628 1469040 1384515 1290543 1200453 1116758 1053743 992068 967969 919116 1001600 995918
11371I95918q8491N9312P749j40876l0131m4248J04457R60o0383p3243J7423K9782
$$ 995918 907427 966739 974488 833612 803481 759233 863690 864650 804267 731024 748447 778229
11359G78229j03285R9118m0021k9901N9618o5173j16611R505j720k411n3787M753
$$ 778229 674944 774062 734041 704140 763758 698585 581974 591479 589759 587348 533561 538314
11347E38314J45588N3531p576n8522k093K0112j37326o8133L1527M8663J1848
$$ 538314 683902 737433 729857 671335 669242 689354 552028 483895 515422 564085 575933
11336E75933O154N7462J621j35683L2858J61130j27316j28698o0214Q975M0650
$$ 575933 582087 639549 641170 505487 538345 699475 572159 443461 383247 392222 432872
11325D32872m7578P6647J00615J26238l4261q2891k4256m158q214o6503k7070
$$ 432872 385294 461941 562556 688794 654533 571642 547386 543228 535014 468511 441441
11314D41441O5304l6270k7118j16719Q869K4443M5504J68193n7856J340K3163
$$ 441441 506745 470475 443357 326638 335507 359950 405454 573647 515791 517131 540294
11303E40294q5030L9061N6310N3667m8101L0913j00910l2585J1227Q208l0249
$$ 540294 455264 494325 550635 604302 556201 587114 486204 453619 464846 473054 442805
11292D42805K3190R0106n7406m2290O6416M4192M3563p2636j7727n4977M092N3504
$$ 442805 465995 556101 498695 456405 522821 567013 610576 537940 520213 465236 469328 522832
11280E22832K8848m9456m3058M1169K2697j08587r7566o6823l8931M7291J60N0838
$$ 522832 551680 502224 459166 500335 523032 414445 316879 250056 211125 258416 258576 309414
11268C09414J9546p321J2219K6735o5874L8991k477r652J18307R8388Q8448L5255
$$ 309414 328960 321639 333858 360593 294719 333710 331233 321581 439888 538276 626724 661979
11256F61979M1802n6324j38999K2774J3963n3907n3583P8485j5202p6216j77855
$$ 661979 703781 647457 508458 531232 545195 491288 437705 516190 500988 424772 246917
11245B46917r8394J14329Q6402M4706L1151m1974M1421N6776j09318j00256K2417
$$ 246917 148523 262852 349254 393960 425111 383137 424558 481334 372016 271760 294177
11234B94177N0205K8105O9339o7846Q287m0690j01726r874N4499L2970J1231L4113
$$ 294177 344382 372487 441826 373980 382267 341577 239851 229977 284476 317446 328677 362790
11222C62790K3287M912n7784p0215l2899N554K0030J25090M3574j05206J01J1863
$$ 362790 386077 390989 333205 262990 230091 235645 255675 380765 424339 319133 319234 331097
11210C31097K2276l3223R049o772m3280L9467J19166K4187o6266j49666J1479
$$ 331097 353373 320150 329199 322427 279147 318614 437780 461967 395701 246035 257514
11199B57514J19090P8237m555l2295n7023m665o41l8144J00801M040j47523o0921
$$ 257514 376604 454841 450286 417991 360968 356303 355662 317518 418319 422359 274836 213915
11187B13915K941P0552R3399M3339o5371k0264L6103j4813l5422o0323m9326M9146
$$ 213915 216856 287408 380807 424146 358775 338511 374614 359801 324379 264056 214730 263876
11175B63876j3408J694J7612J9197l2825m9902o0627m0467o289J85284K3024m8093
$$ 263876 250468 252162 269774 288971 256146 206244 145617 105150 98861 284145 307169 259076
11163B59076J2490J64055L2250j0585K8967n3167q1230q809m4460J9114o8242
$$ 259076 271566 435621 467871 457286 486253 433086 351856 343047 298587 317701 249459
11152B49459O9114l6246j1499O344J41140k1541j20100M7652r425n2070M2983
$$ 249459 318573 282327 270828 277172 418312 396771 276671 324323 314898 262828 305811
11141C05811J21977o7440j38958j1992r847J5430L4346N7216P1125m743q560m2531
$$ 305811 427788 360348 221390 209398 199551 214981 249327 306543 377668 372925 364365 321834
11129C21834j9224n140m2899R5725O9052p4414o3255r066J21462k835M1269o0349
$$ 321834 302610 297470 254571 350296 419348 344934 281679 272613 394075 391240 432509 372160
11117C72160m8747p4706r0161k3945L4865j0313k8130l5546m0856Q1475Q6141
$$ 372160 323413 248707 158546 134601 169466 159153 131023 95477 54621 136096 222237
11106B22237r0639J9385J378m6258N3807J07170Q6823o6470J13843Q6065j33848
$$ 222237 131598 150983 152361 106103 159910 267080 353903 287433 401276 487341 353493
11095C53493k03676m2353N7696K5571o0065p212R439j4337o2924J10724k9303
$$ 353493 149817 107464 165160 190731 130666 123454 132893 118556 55632 166356 137053
11084A37053p1627K425J30865Q6138O9352J32715J9501p2009n0905j35584m3162
$$ 137053 65426 67851 198716 284854 354206 486921 506422 434413 383508 247924 204762
11073B04762r3777N4744l5018o4292N6734r2926r569J66007O3966j30859n6977
$$ 204762 110985 165729 130711 66419 123153 30227 20658 186665 250631 119772 62795
11062F2795P6179M7241k8261N9999J46236q4679j8719j03429K3435O2941L2972
$$ 62795 138974 186215 157954 217953 364189 279510 260791 157362 180797 243738 276710
11051B76710K2075j8106M7710O7157L8907j6413m5284j27924j33063K30R2787
$$ 276710 298785 280679 328389 395546 434453 418040 372756 244832 111769 111999 204786
11040B04786k7644L135R9885K510p364P0474J1249L2724Q8856n4505o4973P0087
$$ 204786 177142 180277 280162 282672 275308 345782 357031 389755 478611 424106 359133 429220
11028D29220J01400J22358K0342O7450R7265O9985r8716p1894J6818J04799R8504
$$ 429220 530620 652978 673320 740770 838035 908020 809304 737410 754228 859027 957531
11017I57531J38024R6430m5568p6902n938K3207L4063o684j01511j64290n99j10788
$$ 957531 1095555 1191985 1146417 1069515 1063577 1086784 1120847 1114163 1012652 848362 847763 736975
11005G36975q5027J1606M1087J61656m093j06014j00913q8909j6858N6096m2212
$$ 736975 651948 663554 704641 866297 862204 756190 655277 566368 549510 605606 563394
10994E63394q1452k0971o1737N2634J44377K6631l6310J7912m5907m1537j33183
$$ 563394 481942 460971 399234 451868 596245 622876 586566 604478 558571 517034 383851
10983C83851p6089j0620J0868L7943R2663r4387p7486q9959O9262k238N451K9164
$$ 383851 307762 297142 308010 345953 438616 344229 266743 176784 246046 243808 249259 278423
10971B78423q5790j32445O4006R5076p3722p6906l3822J46478M2160o7436j80934
$$ 278423 192633 60188 124194 219270 145548 68642 34820 181298 223458 156022 -24912
10960b4912n6470O1822Q7158J60776J12943r0848q2194J33228p0984l6675J1183
$$ -24912 -81382 -19560 67598 228374 341317 250469 168275 301503 230519 193844 205027
10949B05027M906n1278j74107n807R7809J27253N4871j9753M4181n8254m7300
$$ 205027 209933 158655 -15452 -21259 76550 203803 258674 238921 283102 224848 177548
10938A77548M6413R6868K4335l8777r9108o9915L7486M2320j34722n8372R4155
$$ 177548 223961 320829 345164 306387 207279 137364 174850 217170 82448 24076 118231
10927A18231Q4274L5761L0489n3717m9645k6283L479J05647J27245m4902j09022
$$ 118231 202505 238266 268755 215038 165393 139110 142589 248236 375481 330579 221557
10916B21557r4671N2069K2169q2668q7196J21117L3309n6196l2189L6898J10640
$$ 221557 126886 178955 201124 118456 31260 152377 185686 129490 97301 134199 244839
10905B44839j7746M248k9500N1617m705j08690r902n3145n2881K6591N8450j0657
$$ 244839 227093 231341 201841 253458 248753 140063 130161 77016 24135 50726 109176 98519
10893I8519J18865M6927j7158q1518p9437Q5242J02203j1390l5654K6569o7032
$$ 98519 217384 264311 247153 165635 86198 171440 273643 262253 226599 253168 186136
10882A86136L209n4488O567J39724n8402j109Q7235M6688K799j17142Q2562J6085
$$ 186136 189345 134857 141424 281148 222746 221637 308872 355560 358359 241217 323779 339864
10870C39864J2266p0285m3465J4109N7231l6622o4516J7838j40761m0350L6563
$$ 339864 352130 281845 238380 252489 309720 273098 208582 226420 85659 45309 81872
10859H1872m9690K5391L3993J5445J41045l6629J2445P3136M6027l1812l0204
$$ 81872 32182 57573 91566 107011 248056 211427 223872 297008 343035 311223 281019
10848B81019N1664Q6694P0242j19295j4283m2325j27821m2257k3097l4840r2494
$$ 281019 332683 419377 489619 370324 356041 313716 185895 143638 120541 85701 -6793
10837f793M9686M7804Q9881M8387l9946Q4835j12235j9295N4657n7047k4218O5365
$$ -6793 42893 90697 180578 228965 189019 273854 161619 142324 196981 139934 115716 181081
10825A81081K3335j03169N2689P5141J4950r2919r7515j5326R3711O9765j11608
$$ 181081 204416 101247 153936 229077 244027 151108 53593 38267 131978 201743 90135
10814I0135l2777R9609J14381M1764m7765o6651R608N4382l342p1278O825q5573
$$ 90135 57358 156967 271348 313112 265347 198696 208304 262686 259344 188066 194891 109318
10802A09318j04681j00982O5289J23832K7618n624J13254O5107k0363j9416j20867
$$ 109318 4637 -96345 -31056 92776 120394 114770 228024 293131 272768 253352 132485
10791A32485j15560K17771J95777j9625o9182q644k9283l4715p0438N858O6266
$$ 132485 16925 234696 430473 410848 341666 333022 303739 269024 198586 204444 270710
10780B70710P0584J2640j13537j9804J19049r864o5150o5667l1151j6546j9706
$$ 270710 341294 353934 240397 220593 339642 329778 264628 198961 167810 151264 131558
10769A31558o2272k5695P7365Q402j74059p5572J38741p6501r7275N5942J40875
$$ 131558 69286 43591 120956 129358 -44701 -120273 18468 -58033 -155308 -99366 41509
10758D1509L4133N6245J8698P2760p974o3962p7610O4061n8321o8902J7522J13554
$$ 41509 75642 131887 150585 223345 215371 151409 73799 137860 79539 10637 28159 141713
10746A41713J40737K5934r6312m3553m1910q5395p2405m3152j5731N1466J23114
$$ 141713 282450 308384 212072 168519 126609 41214 -31191 -74343 -90074 -38608 84506
10735H4506J39724J02611N5428m81j8049l0058j67813J9480J35920M4586j08397
$$ 84506 224230 326841 382269 381788 363739 333681 165868 185348 321268 365854 257457
10724B57457j6533L0216L9959P0143n9266n2598M4047p659l5475k7781K5395J42068
$$ 257457 240924 271140 311099 381242 321976 269378 313425 305766 270291 242510 267905 409973
10712D09973K3651q749Q2919m2320N084m575j18240j16451j3448J38763P458l8003
$$ 409973 433624 424875 507794 465474 470558 465983 347743 231292 217844 356607 364065 326062
10700C26062O6102Q4852M6038l448J8328k5708m6014j27217L6205M2467J07065
$$ 326062 392164 477016 523054 519606 537934 512226 466212 338995 375200 417667 524732
10689E24732R1468n7667p8726P466J02568M9187j79488M5424P0437M4141J19455
$$ 524732 616200 558533 479807 487273 589841 639028 459540 504964 575401 619542 738997
10678G38997R5474J6667m0869P5153J795P5404P7760j75649r3889P8087J9559
$$ 738997 834471 851138 810269 885422 887217 962621 1040381 864732 770843 848930 868489
10667H68489j6238R1079k3025O9220P892l9264L9682N0182M7153N1239J01728
$$ 868489 852251 943330 920305 989525 997417 958153 997835 1048017 1095170 1146409 1248137
10656A248137m0141j34392k0505l0802n1380R7456J78982M9984J70490J60574
$$ 1248137 1207996 1073604 1053099 1022297 970917 1068373 1247355 1297339 1467829 1628403
10646A628403N9013j0213o2089P717Q6725J38152O4894L1268J7297J38351K17307
$$ 1628403 1687416 1677203 1615114 1622831 1709556 1847708 1912602 1943870 1961167 2099518 2316825
10635B316825J59283J55882l7632Q7589J85256K37062J62925K20673L35892M07153
$$ 2316825 2476108 2631990 2594358 2681947 2867203 3104265 3267190 3487863 3823755 4230908
10625D230908M84277L73267L90714N09124M83060N44541O17650P29641R62597
$$ 4230908 4715185 5088452 5479166 5988290 6471350 7015891 7633541 8363182 9325779
10616I325779J233104J436748J787111K273614K978597L822514M810545N470462
$$ 9325779 10558883 11995631 13782742 16056356 19034953 22857467 27668012 33138474
10608C3138474N863823N201154L519542J799636O26906M07959O87763J561109
$$ 33138474 39002297 44203451 47722993 49522629 50149535 50557494 51245257 52806366
10600E2806366L169351N368525P855318R943182J0317563Q044913L919178l71671
$$ 52806366 55975717 61344242 69199560 79142742 89460305 97505218 101424396 101052725
10592A01052725k738049l289027k678903r65409J835134N199245Q789951J1687932
$$ 101052725 98314676 95025649 92346746 91381337 93216471 98415716 107205667 118893599
10584A18893599J1484892P423599N86589n456350q726585r489369q870871p063520
$$ 118893599 130378491 137802090 138388679 132932329 124205744 114716375 105845504 98781984
10576I8781984m152039r86004K045091M126737M072556J197645l144706o913019
$$ 98781984 94629945 93643941 95689032 99815769 103888325 105085970 101941264 95028245
10568I5028245q724910q793330p917201o541444m724223l045555j453812m47945
$$ 95028245 86303335 77510005 69592804 63051360 58327137 55281582 53827770 53379825
10560E3379825m89980j569752l280175m514421n165222n302438m874653m329374
$$ 53379825 52889845 51320093 48039918 43525497 38360275 33057837 28183184 23853810
10552B3853810l681335l019517k451732k000861j475553j203909r39739q00864
$$ 23853810 20172475 17152958 14701226 12700365 11224812 10020903 9081164 8280300
10544H280300q11819p17040o88167n65746n42109l34979j54114k39586l54419
$$ 8280300 7468481 6751441 6063274 5497528 4955419 4620440 4466326 4226740 3872321
10535C872321m55691j68135j71207j16641j06790k41373j45823j95953j07016
$$ 3872321 3416630 3248495 3077288 2960647 2853857 2612484 2466661 2270708 2163692
10526B163692Q984L3052q5599k85829p6871o1985j13991j97137j6498q5914j1479
$$ 2163692 2172676 2205728 2120129 1834300 1757429 1695444 1581453 1384316 1367818 1281904 1270425
10515A270425l9014N6612N2510j23894j51940p0928m1485k1929q4284q7J13713
$$ 1270425 1231411 1288023 1340533 1216639 1064699 993771 952286 930357 846073 845986 959699
10504I59699l1515k0436R698p3704N7749j9636j07431l5410r8147N9859J09845
$$ 959699 928184 907748 917446 843742 901491 881855 774424 739014 640867 700726 810571
10493H10571K0273o7098j61339j97309l1127N5739K16759R1220j49862p5478p1288
$$ 810571 830844 763746 602407 405098 373971 429710 646469 737689 587827 512349 441061
10482D41061m5341o2784J15835L2874o5303m7534P669J6621k4620M482l3436J9748
$$ 441061 395720 332936 448771 481645 416342 368808 376477 393098 368478 372960 339524 359272
10470C59272m4175p3196O3694J9283k6774l9583L8492L8171M5422N6407n6733
$$ 359272 315097 241901 305595 324878 298104 258521 297013 335184 380606 437013 380280
10459C80280k7401p7890o4484L4599R2588K1616L8342o5851O3010R427O5171n7852
$$ 380280 352879 274989 210505 245104 337692 359308 397650 331799 394809 404236 469407 411555
10447D11555m1303O2840R8326K4730r1676j34807N606o7403r8515q847L3718M7957
$$ 411555 370252 433092 531418 556148 464472 329665 335271 267868 169353 160506 194224 242181
10435B42181O8916l9365q1508M5897O1387R778Q6789N6304J04594j3933k8707
$$ 242181 311097 271732 190224 236121 297508 307286 394075 450379 554973 541040 512333
10424E12333k2133l1897j14756m0555j48598j64421J0880N5034K4677O5318J3700
$$ 512333 490200 458303 343547 302992 154394 -10027 853 55887 80564 145882 159582
10413A59582J34021J95012m5543j56064j60413m9595j689N9857j7506R866J43675
$$ 159582 293603 488615 443072 287008 126595 77000 75311 135168 117662 127528 271203
10402B71203P5711n2809j3032j9668P9221j06451k5475P0248j9960J9306R950
$$ 271203 346914 294105 281073 261405 340626 234175 208700 278948 258988 278294 288244
10391B88244m151l7755J0667K3188l0489j0195K212O820n3382k8186M4613k441
$$ 288244 284093 246338 257005 280193 249704 239509 241721 248541 195159 166973 211586 209145
10379B09145q0089R0085J8832o74j69772j2550R1753K0307J8413m8508o2328Q877
$$ 209145 129056 219141 237973 237299 67527 54977 146730 167037 185450 136942 74614 83491
10367H3491o5616m9936k6940P2166N435L4153O0562O8358J8472q1035L1083J46637
$$ 83491 17875 -32061 -59001 13165 18600 52753 113315 181673 200145 119110 150193 296830
10355B96830r9284j16518l9924j5824M8254p1992j3165J17809P6654P226m6985
$$ 296830 197546 81028 41104 25280 73534 1542 -11623 106186 182840 190066 143081
10344A43081k5269m9044p9654q6321O3076R5326J6749Q0060M0582n0126q1088
$$ 143081 117812 68768 -10886 -97207 -34131 61195 77944 158004 198586 148460 67372
10333F7372j09338O4435Q9382J7651l4560N3445P219r9761n3033R0427P0476K3210
$$ 67372 -41966 22469 111851 129502 94942 148387 155606 55845 2812 93239 163715 186925
10321A86925J07276P342j24026k9753k1221P739j5260M7454J4504K4379k6081
$$ 186925 294201 301543 177517 147764 126543 134282 119022 166476 180980 205359 179278
10310A79278r7766K5358L3339j7275P5332j96146q1096M9067k8146j0052q0289
$$ 179278 81512 106870 140209 122934 198266 2120 -78976 -29909 -58055 -68107 -148396
10299a48396K137P9664N1442O3967m7691j64040k08354l7199L6964Q8210J20644
$$ -148396 -146259 -66595 -15153 48814 1123 -162917 -371271 -408470 -371506 -283296 -162652
10288a62652L4617M1455j0103M5397J12963m0564R054k6881j7679J2065J24195
$$ -162652 -128035 -86580 -96683 -51286 61677 21113 30167 3286 -14393 -2328 121867
10277A21867K3856j21480l7418R6988R8991l8423n7891j6308O083j13612j3967
$$ 121867 145723 24243 -13175 83813 182804 144381 86490 70182 76265 -37347 -51314
10266e1314q605L0626L6115N8110j11655L4952n9668M1331l8758p5733j10501
$$ -51314 -59919 -29293 6822 64932 -46723 -11771 -71439 -30108 -68866 -144599 -255100
10255b55100Q1931N4131J1416P7453K4838n4735R5485r3722q6978J4162K08125
$$ -255100 -173169 -119038 -107622 -30169 -5331 -60066 35419 -58303 -145281 -131119 77006
10244G7006K1235l6335L556o4100j4861r7266m1376K7975K9708m4715j1991P2685
$$ 77006 98241 61906 65462 1362 -13499 -110765 -152141 -124166 -94458 -139173 -151164 -78479
10232g8479J207K908N169J4850P6049j1194J9046L3290L770l5396m3314j1898
$$ -78479 -77272 -74364 -69195 -54345 21704 10510 29556 62846 66616 31220 -12094 -23992
10220b3992R0564R578N3177p2683n0716J3374p6763O2992M7676J508p992K7932
$$ -23992 66572 76150 129327 56644 5928 19302 -57461 5531 53207 54715 46723 74655
10208G4655N0532q510p3183m3346k5944O4252k2652n9616k6913q0663R787l0888
$$ 74655 125187 116677 43494 148 -25796 38456 15804 -43812 -70725 -151388 -141601 -172489
10196a72489J20412L6152q1672K8942N9416L2333k686n1945J03024M8091j16644
$$ -172489 -52077 -15925 -97597 -68655 -9239 23094 20408 -31537 71487 119578 2934
10185B934l2856J10387M2433j881k718n4885P724r8763n945j2477O0362M7403
$$ 2934 -29922 80465 122898 121017 118299 63414 71138 -27625 -33570 -46047 14315 61718
10173F1718R6200M9710r4304n9675M4723J92242J03433m7261R1887j3232n9775
$$ 61718 157918 207628 113324 53649 98372 290614 394047 346786 438673 425441 365666
10162C65666k8228K0243J8673k5409O6158P1846m4757J0404j8382J3250n28K6852
$$ 365666 337438 357681 376354 350945 417103 488949 444192 454596 436214 449464 448936 475788
10150D75788o1300N7633K1338O5442L2813n3948l7318l5147l8225M1634k3680
$$ 475788 414488 472121 493459 558901 591714 537766 500448 465301 427076 468710 445030
10139D45030O7092k2092M8678L2329K8201k52615j20652n7547j1551P6578J29358
$$ 445030 512122 490030 538708 571037 599238 346623 225971 168424 156873 233451 362809
10128C62809J04792j6081J5672m0842o8760m2484o2253k7631M2322L2285n4214
$$ 362809 467601 451520 467192 426350 357590 315106 252853 225222 267544 299829 245615
10117B45615k2151j2463K9178j34127j17420l3351L0670K1745L7855J29476P5064
$$ 245615 223464 211001 240179 106052 -11368 -44719 -14049 7696 45551 175027 250091
10106B50091n2820j34033o5433P1378Q6915q961l0036p732N9765p5753L3662L4370
$$ 250091 197271 63238 -2195 69183 156098 147137 117101 109369 169134 93381 127043 161413
10094A61413k080j49851o631J79064j069j65877o7107m970M3093k6626J1254K1371
$$ 161413 159333 9482 2851 181915 180846 14969 -52138 -57108 -14015 -40641 -29387 -8016
10082h016K4577M2099j32490j65673j5442Q5483J80753j8157N0482j5918j57595
$$ -8016 16561 58660 -73830 -239503 -254945 -169462 11291 -6866 43616 27698 -129897
10071a29897N9171j4938j18120M1873P1916L7014l3992O4274j0508N3016J13946
$$ -129897 -70726 -85664 -203784 -161911 -89995 -52981 -86973 -22699 -33207 19809 133755
10060A33755o1569p9971p0746M8465l703N3293M3711m1072R7899R0245J2029o3479
$$ 133755 72186 -7785 -78531 -30066 -33769 19524 63235 22163 120062 210307 222336 158857
10048A58857o9594L4228j1916n1402k1422j8263j49351M216J47961P5773L0099
$$ 158857 89263 123491 111575 60173 38751 20488 -128863 -124647 23314 99087 129186
10037A29186m2029j2454n1817m5831N9202O5542o4171R2105j7349r3563j53323
$$ 129186 87157 74703 22886 -22945 36257 101799 37628 129733 112384 18821 -134502
10026a34502j7246j5983J22079R3934k2266l5629N4393k2573l2195O975J17034
$$ -134502 -151748 -167731 -45652 48282 26016 -9613 44780 22207 -9988 -3013 114021
10015A14021N3625Q61J3410J29134j7250r4153j78477k3478J14645l9402k04264
$$ 114021 167646 168507 181917 311051 293801 199648 21171 -2307 112338 72936 -131328
10004a31328l1904j1729k1085N0848M4384M655M300q7531m1780J42561J55900
$$ -131328 -163232 -174961 -196046 -145198 -100814 -96159 -91859 -179390 -221170 -78609 77291
9993G7291k2246j02037q8810K7874M2119J09750L7120o6884j61517l8310P7130
$$ 77291 55045 -46992 -135802 -107928 -65809 43941 81061 14177 -147340 -185650 -108520
9982a08520j9378m4551l8918J55553R9505L5704k0443L0302O3392N0703q8740
$$ -108520 -127898 -172449 -211367 -55814 43691 79395 58952 89254 152646 203349 114609
9971A14609j43553m1741M826K974M2537j5681r7269J2983N8170J670L7823J02448
$$ 114609 -28944 -70685 -65859 -62885 -20348 -36029 -133298 -120315 -62145 -60475 -22652 79796
9959G9796l3068r1490P8426K08O285R4298J43562q4670j08274j4152k4007j7235
$$ 79796 46728 -44762 33664 33872 40157 134455 278017 193347 85073 70921 46914 29679
9947B9679n3522o1555j51813J7808J08283J28495K2002j13336l4143J3579P1647
$$ 29679 -23843 -85398 -237211 -219403 -111120 17375 39377 -73959 -108102 -94523 -22876
9936b2876j2642M1556K572Q1117m3575M2836P0632m5648j6575J30207r6578q649
$$ -22876 -35518 6038 8610 89727 46152 88988 159620 113972 97397 227604 131026 122377
9924A22377J046L1037M9339R95l7136j54294M6994O1222Q9219J23368N979J95664
$$ 122377 123423 154460 203799 204794 167658 13364 60358 121580 210799 334167 340146 535810
9912E35810K60963L25464N03798P69488R06808N15547l17938n82786n86701m78750
$$ 535810 796773 1122237 1626035 2395523 3302331 3817878 3499940 2917154 2330453 1851703
9902A851703l28868l54913k98243k53465k19331n2488j634j12294l5162j0213
$$ 1851703 1522835 1167922 869679 616214 396883 344395 342761 230467 195305 185092
9892A85092L9735q1363n1603O0897l2962K3347m1983j06576J5339K8230m5251
$$ 185092 224827 143464 91861 152758 119796 143143 101160 -5416 9923 38153 -7098
9881g098o8627O759J26921M3320q3449j43650Q0745P570L4097R085n7363n0400
$$ -7098 -75725 -68966 57955 101275 17826 -125824 -45079 -37509 -3412 5673 -51690 -102090
9869a02090P3530l0838R0377Q2688J66o3405j35842j67893L7283M8654N6261o561
$$ -102090 -28560 -59398 30979 113667 113833 50428 -85414 -253307 -216024 -167370 -111109 -117670
9857a17670j8582J48868j18390o9925N4461R8231K2630o2315N9141J09383q1883
$$ -117670 -136252 12616 -105774 -175699 -121238 -23007 -377 -62692 -3551 105832 23949
9846B3949j43931N0182n058n355Q6353J0270J22874K7147j04367m5101J08866
$$ 23949 -119982 -69800 -74858 -80213 6140 16410 139284 166431 62064 16963 125829
9835A25829k4570j22400k8347J5708k3956j04269K5154M8883J16452k1084j17699
$$ 125829 101259 -21141 -49488 -33780 -57736 -162005 -136851 -87968 28484 7400 -110299
9824a10299l2328m7140O6841l2042Q691N4853N6154J2703q3262q2366K855r201
$$ -110299 -142627 -189767 -122926 -154968 -146277 -91424 -35270 -22567 -105829 -188195 -185340 -194541
9812a94541K1209M1010J1286m3036n55o3767J27906N1506q3469J610Q0854p139
$$ -194541 -173332 -132322 -121036 -164072 -164627 -228394 -100488 -48982 -132451 -130841 -49987 -57126
9800e7126j3783r270P3667P7200l7020k5861L4270j45938j76772O5036J95061
$$ -57126 -70909 -80179 -6512 70688 33668 7807 42077 -103861 -280633 -215597 -20536
9789b0536Q4475r1266j29979l7149J50466P3965l0310k1860P02m1876j6930m6886
$$ -20536 63939 -27327 -157306 -194455 -43989 29976 -334 -22194 -21492 -63368 -80298 -127184
9777a27184J4023R2947P4684J6674k11449m7019P2998L5848O9956O3530Q1979
$$ -127184 -113161 -20214 54470 71144 -140305 -187324 -114326 -78478 -8522 55008 136987
9766A36987j1095l0263l8002M6615j07626o0339m5551n1529J41K0520R2719M3505
$$ 136987 125892 95629 57627 104242 -3384 -63723 -109274 -160803 -160662 -140142 -47423 -3918
9754c918m3372J9490Q4802J198l3K4159j1314k450j02732p5106Q9830P6652L9625
$$ -3918 -47290 -27800 57002 58200 58167 82326 71012 68562 -34170 -109276 -19446 57206 96831
9741I6831J0628k0066L0302j6813p6113j10292r0467L1007o490O585O9734J32929
$$ 96831 107459 87393 117695 100882 24769 -85523 -175990 -144983 -151473 -144888 -75154 57775
9729E7775k1959r3370J8990j8237J26384M6716q635n9804J5914J7147l3707q5817
$$ 57775 35816 -57554 -38564 -56801 69583 116299 107664 47860 63774 80921 47214 -38603
9717c8603M7732J1874j33848k1274J38838R7582j39128j18138J40635N5712j46698
$$ -38603 9129 21003 -112845 -134119 4719 102301 -36827 -154965 -14330 41382 -105316
9706a05316o3183Q9669K8357q0902L9583P1427K2861l5206k1590J2293M5540n2508
$$ -105316 -168499 -78830 -50473 -131375 -91792 -20365 2496 -32710 -54300 -42007 3533 -48975
9694d8975l0459n3055j9854j0712R9298O668o853m8054J64556J9517p373l6829
$$ -48975 -79434 -132489 -152343 -163055 -63757 -57089 -63942 -111996 52560 72077 64704 27875
9682B7875J8157J4991p692M3322J7892l1498L8236R6362k43063k10668k2210q6594
$$ 27875 46032 61023 53331 96653 114545 83047 121283 217645 -25418 -236086 -258296 -344890
9670c44890J26441J57226M0395o9824k5901k0164J32452J84024N7619q1285j33049
$$ -344890 -218449 -61223 -20828 -90652 -116553 -136717 -4265 179759 237378 156093 23044
9659B3044j56823j1860N4376m8899L5624M2736q4437n1506J29701P0274J2408
$$ 23044 -133779 -145639 -91263 -140162 -104538 -61802 -146239 -197745 -68044 2230 14638
9648A4638J02362m758j5056K5843J61703K4644j41449q9212K0107o717r905M4904
$$ 14638 117000 112242 97186 123029 284732 309376 167927 78715 98822 92105 82200 127104
9636A27104J5728l7636p2457o1415k5200J7232P5577N5908j4548j16063J3974
$$ 127104 142832 105196 32739 -28676 -53876 -36644 38933 94841 80293 -35770 -21796
9625b1796n6691m5472P836l4751m5119L3409P6146L7819j4415p6987n3135N862
$$ -21796 -78487 -123959 -116123 -150874 -195993 -162584 -86438 -48619 -63034 -140021 -193156 -187294
9613a87294j938L5577o213j00453P9021K6417O8327P899M3445O4426M6506M5119
$$ -187294 -189232 -153655 -159868 -260321 -181300 -154883 -86556 -78657 -35212 29214 75720 120839
9601A20839k7149q0648n1420j472P5234R842n2946R668K5262j07868m9883k3457
$$ 120839 93690 13042 -38378 -39850 35384 45226 -7720 1948 27210 -80658 -130541 -153998
9589a53998K5603M6747K05489K0453j61294o8581N565j5236k7848J5525o1460
$$ -153998 -128395 -81648 123841 144294 -17000 -85581 -80016 -95252 -123100 -107575 -169035
9578a69035M1276M6120m2770q0743P9563M4232M5078K0297r0512j4706N3486p3419
$$ -169035 -127759 -81639 -124409 -205152 -125589 -81357 -36279 -15982 -106494 -121200 -67714 -141133
9566a41133j27586r1543o1308J31782J64369L9519n2423R6168j734j8847r986
$$ -141133 -268719 -360262 -421570 -289788 -125419 -85900 -138323 -42155 -43889 -62736 -72722
9555g2722R5245k8512J17239L581k00500r6228M1298o8389N8869O3097o4539o0238
$$ -72722 22523 -5989 111250 114831 -85669 -181897 -140599 -208988 -150119 -87022 -151561 -211799
9543b11799J5811M7994R1257J69218p1455q2532O4271o1484q58P8602p9307K2176
$$ -211799 -195988 -147994 -56737 112481 41026 -41506 22765 -38719 -39577 39025 -40282 -18106
9531a8106J7121J4293R4263j01035j69645N260J8651q6516M0081J52754J8666
$$ -18106 -985 13308 107571 6536 -163109 -157849 -139198 -225714 -185633 -32879 -14213
9520a4213K9702J35175p8695l0780L6124L9117o8782j9461N0048Q810l1182m5368
$$ -14213 15489 150664 71969 41189 77313 116430 47648 28187 78235 87045 55863 10495
9508A0495N0549O3112n4425n4823r342O6257P772L1272q6127k6299J31814N2004
$$ 10495 61044 124156 69731 14908 5566 71823 79595 110867 24740 -1559 130255 182259
9496A82259j40887l7348j27883M8520J34184Q1917K2203m8132k8846j42515N365
$$ 182259 41372 4024 -123859 -75339 58845 140762 162965 114833 85987 -56528 -51163
9485e1163M9961P0735j6221k6793l6140j11236P7141R5580j49034j29017m5393
$$ -51163 -1202 69533 53312 26519 -9621 -120857 -43716 51864 -97170 -226187 -271580
9474b71580l797j8774N8718O1573P1543J012R9512N4509L7627o013N3104o880
$$ -271580 -275377 -294151 -235433 -173860 -102317 -101305 -1793 52716 90343 84330 137434 130554
9462A30554j04172m4155m1751j7679R7531r2556j01278Q5117L3398L5145q4812
$$ 130554 26382 -17773 -59524 -77203 20328 -72228 -173506 -88389 -54991 -19846 -104658
9451a04658l6014J4942n291J6852j1820N3264O2629m8658j70379M7785J07469
$$ -104658 -140672 -125730 -131021 -114169 -125989 -72725 -10096 -58754 -229133 -181348 -73879
9440g3879M147k0507q0715j09399L4494M0530J13408J7898J9766o6902j10844
$$ -73879 -69732 -90239 -170954 -280353 -245859 -205329 -91921 -74023 -54257 -121159 -232003
9429b32003P189P6720M6358j7319M0691Q6483O7810r8425m1157K0201J47460K1341
$$ -232003 -224814 -148094 -101736 -119055 -78364 8119 75929 -22496 -63653 -43452 104008 125349
9417A25349r8743j55760n3416j4990J24444M7747Q6375o4892j37474P2028R6815
$$ 125349 26606 -129154 -182570 -197560 -73116 -25369 61006 -3886 -141360 -69332 27483
9406B7483o4531n0695R9581R1692q9354q935J13411L4918m0522o5915j9626m080
$$ 27483 -37048 -87743 11838 103530 14176 5241 118652 153570 113048 47133 27507 23427
9394B3427M3868j13887N354M0303P746N8597n059j42593o8299Q9393J02370p3074
$$ 23427 67295 -46592 -41238 -935 6811 65408 60349 -82244 -150543 -61150 41220 -31854
9382c1854j18118K3291L4989m80J1103P327k6004M2922q1202r034P1737J33153
$$ -31854 -149972 -126681 -91692 -92172 -81069 -73742 -99746 -56824 -138026 -147060 -75323 57830
9370E7830j4961l9325n321J1250q1757L7153q1519j00101Q2874M3193J7814l0021
$$ 57830 42869 3544 -1777 9473 -72284 -35131 -116650 -216751 -133877 -90684 -72870 -102891
9358a02891o0581k575J13888Q760J9538K4889L6571R179j24357K0557j5328p1958
$$ -102891 -163472 -166047 -52159 -43399 -23861 1028 37599 46778 -77579 -57022 -72350 -144308
9346a44308J27015J21966j7969m4700q8785j6707k4243M0304J5735j17417o8483
$$ -144308 -17293 104673 86704 42004 -46781 -63488 -87731 -47427 -31692 -149109 -217592
9335b17592k0972O5969N5798o4478r8526J02171J79469N8808M4524K7430o7812
$$ -217592 -238564 -172595 -116797 -181275 -279801 -177630 1839 60647 105171 132601 64789
9324F4789j31349N2799M3398j515j49547P8581p995M182J9996m3632J38930l1517
$$ 64789 -66560 -13761 29637 28122 -121425 -42844 -50839 -46657 -26661 -70293 68637 37120
9312C7120O012R4695J8853k3627j52336L4930O3066l4149m7428O5878l458q7666
$$ 37120 43132 137827 156680 133053 -19283 15647 78713 44564 -2864 63014 59556 -28110
9300b8110k4519J9869R0855j834O8376Q4225m0146j76897j06784O9251l5221o9667
$$ -28110 -52629 -32760 58095 56261 124637 208862 168716 -8181 -114965 -45714 -80935 -150602
9288a50602o0503K7309J67853R375j0326R5373j2694j23881o9914K2211K0295
$$ -150602 -211105 -183796 -15943 -6568 -16894 78479 65785 -58096 -128010 -105799 -85504
9277h5504P9523p5981o1841J3094r3434m5792K70758J71540K4704j82781o0638
$$ -85504 -5981 -81962 -143803 -130709 -224143 -269935 823 172363 197067 14286 -46352
9266d6352M8959Q4071j8509J2045k1139p0690N50j09055j6069J34352L9400p3676
$$ -46352 2607 86678 68169 80214 59075 -11615 -11065 -120120 -136189 -1837 37563 -36113
9254c6113M1642N7228K829O069j11042j0401j3484o3206N8158J43129Q3309O4517
$$ -36113 5529 62757 65586 71655 -39387 -49788 -63272 -126478 -68320 74809 158118 222635
9242B22635o7073o3114J2424l0537p72J2853P533p3565R571O4574m7277j09176
$$ 222635 155562 92448 104872 74335 73563 86416 93949 20384 29955 94529 47252 -61924
9230f1924O500Q9161K3081L0698l2539L3698q4679q0850k5163O0989J0384j0693
$$ -61924 -55424 33737 56818 87516 54977 88675 3996 -76854 -102017 -41028 -30644 -41337
9218d1337P3997P8141j1590l3984r2295o6062r4521j05990J789J04374l1426p988
$$ -41337 32660 110801 99211 65227 -27068 -93130 -187651 -293641 -291852 -187478 -218904 -226892
9206b26892k1828Q0816J83089n4113j4414K0515N5829N6062r916n1139O13n8890
$$ -226892 -248720 -167904 15185 -38928 -53342 -32827 23002 79064 69148 18009 18622 -40268
9194d0268J8058N7443j00740k3404Q7098Q1199o9212j07314j17916o7485j2670
$$ -40268 -22210 35233 -65507 -88911 -1813 79386 10174 -97140 -215056 -282541 -295211
9183b95211J27260N4761p0381O9120J79095J10386J8095l1482K5995q7356l606
$$ -295211 -167951 -113190 -183571 -114451 64644 175030 193125 161643 187638 100282 96676
9172I6676K1293r2158j07013L051N3557m0964k1183j2889J40012O1187o2237n3515
$$ 96676 117969 25811 -81202 -78151 -24594 -65558 -86741 -99630 40382 101569 39332 -14183
9160a4183r0086O7805o4877r0160l1761N8186M6079J04275R8228n0325m5812N3392
$$ -14183 -104269 -36464 -101341 -191501 -223262 -165076 -118997 -14722 83506 33181 -12631 40761
9148D0761k8921j8019m2558q672n0474q3923J16418k202j475j05193L4100J39850
$$ 40761 11840 -6179 -48737 -57409 -107883 -191806 -75388 -77590 -79065 -184258 -150158 -10308
9136a0308R5699l1680j80533j00305L2617K5191l9374N2629R7715k4526j13284
$$ -10308 85391 53711 -126822 -227127 -194510 -169319 -208693 -156064 -58349 -82875 -196159
9125a96159K7577J9390J24133P768j96609K418J05980o2143n606J08760P1168
$$ -196159 -168582 -149192 -25059 -17291 -213900 -211482 -105502 -167645 -173251 -64491 6677
9114F677R453P5408L0275r5459r0120o9603p471J12416Q3241N4834P799n1119
$$ 6677 16130 91538 121813 26354 -63766 -133369 -140840 -28424 54817 109651 117450 66331
9102F6331N7086N4463j10035j84926L4290k3315l3492l6228m5413n253K12008
$$ 66331 123417 177880 67845 -117081 -82791 -106106 -139598 -175826 -221239 -226492 -14484
9091a4484K8332k2146l0312k484J8167O6084k9250l9500J01790j5473m7256L1843
$$ -14484 13848 -8298 -38610 -41094 -22927 43157 13907 -25593 76197 60724 13468 45311
9079D5311J13539N2583r8917j02717p2699p5238L815r301o2261L1054J65369O8831
$$ 45311 158850 211433 112516 9799 -62900 -138138 -134323 -143624 -205885 -174831 -9462 59369
9067E9369R7674j3135K8069l7910r1337Q5430O9927r2233m9672n9062m4653j09777
$$ 59369 157043 143908 171977 134067 42730 128160 198087 105854 56182 -2880 -47533 -157310
9055a57310o7427o1980J66125k605j7182l4157N8137M6554K1096O6170p779j00997
$$ -157310 -224737 -286717 -120592 -123197 -140379 -174536 -116399 -69845 -48749 17421 9642 -91355
9043i1355k0861K9043L8396K7029r5120M5305j0936J38326l0091o4287J37232
$$ -91355 -112216 -83173 -44777 -17748 -112868 -67563 -78499 59827 29736 -34551 102681
9032A02681L3786J909l7564j735J13991N3941j01011j24467n9567p4897j5628
$$ 102681 136467 138376 100812 99077 213068 267009 165998 41531 -18036 -92933 -108561
9021a08561o2472M152R8593J07082m3211j59516O8443J73195m3626q2137l5383
$$ -108561 -171033 -166881 -68288 38794 -4417 -163933 -95490 77705 34079 -48058 -83441
9010h3441Q3905N6725j5107n5507P3625L1587j10198j7388J27437O7157j71013
$$ -83441 464 57189 42082 -13425 60200 91787 -18411 -35799 91638 158795 -12218
8999a2218j05385j14524J68992J25217j0106K7583N2363n7438n547J187P30p2707
$$ -12218 -117603 -232127 -63135 62082 51976 79559 131922 74484 68937 70124 70854 -1853
8987a853N762k0862J2364P7961P5213q1599j1069q890q5503L2536O4818o444L9117
$$ -1853 3909 -16953 -4589 73372 148585 66986 55917 47027 -38476 -5940 58878 52434 91551
8974I1551O0415R8776l6033j46198k6647n0695o4004m9314m3746M0457J15614
$$ 91551 151966 250742 214709 68511 41864 -8831 -72835 -122149 -165895 -125438 -9824
8963i824R0475J8603l5592r8071k9043J55083k669j10825N621l0198o8817K2641
$$ -9824 80651 99254 63662 -34409 -63452 91631 88962 -21863 -16242 -46440 -115257 -92616
8951i2616l5327p8563O8335P7991J4457l1448j21637M7073N8992k5047K0225J0489
$$ -92616 -127943 -206506 -138171 -60180 -45723 -77171 -198808 -151735 -92743 -117790 -97565 -87076
8939h7076P853J1592n218K4944j3131p2354o2172k6262j381n022J6670Q0811P9063
$$ -87076 -79223 -67631 -72849 -47905 -61036 -133390 -195562 -221824 -223205 -228227 -211557 -130746 -51683
8926e1683J25001K1061k6033k6244l401P8795K1161j32909q7249j9772L2313j2393
$$ -51683 73318 94379 68346 42102 38701 117496 138657 5748 -81501 -101273 -68960 -81353
8914h1353L4425M8110l594P401J01320N2601j63090n8720k5200j2972j1824K3659
$$ -81353 -46928 1182 -2412 4989 106309 158910 -4180 -62900 -88100 -101072 -112896 -89237
8902h9237K853J02417k4463k216l0750L9059J3582R1998n4567l546P9156j0341
$$ -89237 -86384 16033 -8430 -10646 -41396 -2337 11245 103243 48676 45130 124286 113945
8890A13945O9295J68971l4207j71918p6876O3432p047J3973J5508j47333k75491
$$ 113945 183240 352211 318004 146086 69210 132642 125595 139568 155076 7743 -267748
8879b67748k5994J56717j5764n3252j17652J5907K28738R3000K5508L44l7812
$$ -267748 -293742 -137025 -152789 -206041 -323693 -307786 -79048 13952 39460 39804 1992
8868A992P68j46277n5795J1362N0561R8310J39915K0670M4883P8676q2381j75527
$$ 1992 2760 -143517 -199312 -187950 -137389 -39079 100836 121506 166389 245065 162684 -12843
8856a2843o3906k3876J09802q1372m1416M1234L937o2062k2009n5831K6940L6598
$$ -12843 -76749 -100625 9177 -72195 -113611 -72377 -68440 -130502 -152511 -208342 -181402 -144804
8844a44804j2307J86304J9311n3079L035K2118p5110p6327R3770J56416M9186
$$ -144804 -157111 29193 48504 -4575 -1540 20578 -54532 -130859 -37089 119327 168513
8833A68513q1284p6069K9244N3000J8998r9623K2701J12279p2408j1126M0124
$$ 168513 87229 11160 40404 93404 112402 12779 35480 147759 75351 64225 104349
8822A04349L0647N0584j639k19520n7337J45337J2351n4521o7270N3057j2430
$$ 104349 134996 185580 183941 -35579 -92916 52421 64772 10251 -57019 -3962 -16392
8811a6392k1090m2529k3209L2140J0006o7491P3009J41023m3875q2491j61133
$$ -16392 -37482 -80011 -103220 -71080 -61074 -128565 -55556 85467 41592 -40899 -202032
8800b02032o3561O9356R0184L2660m5305o855N5492J12483P6291n3711r4289K3011
$$ -202032 -265593 -196237 -106053 -73393 -118698 -125553 -70061 42422 118713 65002 -29287 -6276
8788f276k5602o9575q7033Q198L8718J35759M2536K5573m9335m7096j2877J2912
$$ -6276 -31878 -101453 -188486 -180288 -141570 -5811 36725 62298 12963 -34133 -47010 -34098
8776c4098o5462j06440j657M7891R370n9221K6431J5198M1874J75149P426j14160
$$ -34098 -99560 -206000 -207657 -159766 -150396 -209617 -183186 -167988 -126114 49035 56461 -57699
8764e7699j09782M391J00706K809P9003q8789q8872R2187j7678l879J19743l0675
$$ -57699 -167481 -163090 -62384 -59575 19428 -69361 -158233 -66046 -83724 -87603 32140 1465
8752A465o5837j9495M2996O3541o9246R3020J8667p7928Q809r272N6028K1825
$$ 1465 -64372 -83867 -40871 22670 -46576 46444 65111 -12817 -4008 -13280 42748 64573
8740F4573j03o8635j14560p9170M1728J0799l856Q7063L3068j39018M1807k6510
$$ 64573 64470 -4165 -118725 -197895 -156167 -145368 -149224 -62161 -29093 -168111 -126304 -152814
8728a52814N5041L0615L6181n4735r5707J14878M1835n3069K7171P990J4374o8463
$$ -152814 -97773 -67158 -30977 -85712 -181419 -66541 -24706 -77775 -50604 -42614 -28240 -96703
8716i6703q45J5540l9910M3229q7186N5995J6974R1120M2382r8267n0943N1043
$$ -96703 -97548 -82008 -121918 -78689 -165875 -109880 -92906 -1786 40596 -57671 -108614 -57571
8704e7571p143J5418J53280N7082N2486J3118m8814r6150k8218N662j7030K3350
$$ -57571 -64714 -49296 103984 161066 213552 226670 177856 81706 53488 59150 42120 65470
8692F5470j1584p3089o9504k0977Q1368J19376L3663m891j4362n2016k9094m5036
$$ 65470 53886 -19203 -88707 -109684 -28316 91060 124723 119832 105470 53454 24360 -20676
8680b0676n2437O9668N091O7903J35344o3549j01536p7076J68858M9814j11334
$$ -20676 -73113 -3445 1646 69549 204893 141344 39808 -37268 131590 181404 70070
8669G0070j989Q2673q4021r4227l322Q1468j41696l608R0899j6583l6123m115
$$ 70070 68081 150754 66733 -27494 -30816 50652 -91044 -94652 -3753 -20336 -56459 -60574
8657f0574L8600L1431K9038o9094m0058o0248o6841L0149k7038O9816M1877q6694
$$ -60574 -21974 9457 38495 -30599 -70657 -130905 -197746 -167597 -194635 -124819 -82942 -169636
8645a69636m8152j13450P3555N2434O0664J8425k6424K3699j02089Q614O5518
$$ -169636 -217788 -331238 -257683 -205249 -144585 -126160 -152584 -128885 -230974 -222360 -156842
8634a56842J19745n4925p8162k6520M675J6590n0173K6955J21901R618M8965J805
$$ -156842 -37097 -92022 -170184 -196704 -192029 -175439 -225612 -198657 -76756 -67138 -18173 -16368
8622a6368j60195m9913J4244P5683J21893J82047M4926r6001n8298L3253K4416
$$ -16368 -176563 -226476 -212232 -136549 -14656 167391 212317 116316 58018 91271 115687
8611A15687k0563O0500j73761m4948N1862K8558j2877J5987k670j60398l4038
$$ 115687 95124 155624 -18137 -63085 -11223 17335 4458 20445 17775 -142623 -176661
8600a76661P7313j06236j1337L9791R9324p805J3255P3613l254J36684Q682O2824
$$ -176661 -99348 -205584 -216921 -177130 -77806 -85611 -72356 1257 -1997 134687 143369 206193
8588B06193o5509l1430j27832R317M6774j08J2795P6821M3865q8853q7656o462
$$ 206193 140684 109254 -18578 -9261 37513 37405 50200 127021 170886 82033 -5623 -12085
8576a2085j09565r4702R5900J05934m7380M249N7978N9136O627K91o4950P7656
$$ -12085 -121650 -216352 -120452 -14518 -61898 -57649 329 59465 66092 66383 1433 79089
8564G9089J1042k1697j1221L3263P4409m0003r9848j3782M9705O3734j02817p5015
$$ 79089 90131 68434 57213 90476 164885 124882 25034 11252 60957 124691 21874 -53141
8552e3141m8806R1085N5692J6637j43391o1694L1630l8316Q0759k614r7011j57214
$$ -53141 -101947 -10862 44830 61467 -81924 -143618 -111988 -150304 -69545 -72159 -169170 -326384
8540c26384L7134Q2265N6985Q3786K16871l1954o2227r90J7945m2840j58741j02593
$$ -326384 -289250 -206985 -150000 -66214 150657 118703 56476 55486 73431 30591 -128150 -230743
8528b30743O4159L4801L7250K1482P7686O3312j69346j55116q2089N6196J28305
$$ -230743 -166584 -131783 -94533 -73051 4635 67947 -101399 -256515 -338604 -282408 -154103
8517a54103J11779l0571P2830L0895r6542k0935n5199m4096M6442J05595k786
$$ -154103 -42324 -72895 -65 30830 -65712 -86647 -141846 -185942 -139500 -33905 -36691
8506c6691k5639k2218J1176k3707R441M7845J68716j7380J3615j8865n0640j847
$$ -36691 -62330 -84548 -73372 -97079 -87638 -39793 128923 111543 125158 106293 55653 53806
8494E3806k2219k458K9191J5964k2072M3071p1949o5739m952k6932m8640O0749
$$ 53806 31587 29129 58320 74284 52212 95283 23334 -42405 -47357 -74289 -122929 -62180
8482f2180J31384L6902r34j12899j64016N6352J55882J30429j60051r5544K3851
$$ -62180 69204 106106 105172 -7727 -171743 -115391 40491 170920 10869 -84675 -60824
8471f0824J69362J09708j59486j46319j39344J12881J58078q7130p8103p4811
$$ -60824 108538 218246 58760 -87559 -226903 -114022 44056 -43074 -121177 -195988
8461a95988J4578P3589m7424N452J21258M2946j7327p2519n6568j9477Q7006R5256
$$ -195988 -181410 -107821 -155245 -149793 -28535 14411 -2916 -75435 -132003 -151480 -64474 30782
8449C0782j05614Q3439Q1866o6750p541p8363O2103M9394o4959j0235J7290O5086
$$ 30782 -74832 8607 90473 23723 16182 -62181 -78 49316 -15643 -25878 -8588 56498
8437E6498J08944j4220o8948L868L8324J0993n3792l4957M2213L1381p0514k116
$$ 56498 165442 151222 82274 86142 124466 135459 81667 46710 88923 120304 49790 47674
8425D7674P9449j50751j05541L5200N7455m2928O3210J19672n0161m3892j8397
$$ 47674 127123 -23628 -129169 -93969 -36514 -79442 -16232 103440 53279 9387 -9010
8414i010n8591M4878J14604n6644r1415j71602Q3939K0074j2247J10258K3336
$$ -9010 -67601 -22723 91881 35237 -56178 -227780 -143841 -123767 -136014 -25756 -2420
8403b420k7691o8447K2587j01356K6980J44441K2192r2990j23180l0897Q9246
$$ -2420 -30111 -98558 -75971 -177327 -150347 -5906 16286 -76704 -199884 -230781 -141535
8392a41535N3432j2754k3303j6392M6525Q6597O9725p0009p8830l5505K4800P1745
$$ -141535 -88103 -100857 -124160 -140552 -94027 -7430 62295 -7714 -86544 -122049 -97249 -25504
8380b5504R1236J58168j33513n8818J2796M7144j5469m0477j25350l3906L3447
$$ -25504 65732 223900 90387 31569 44365 91509 76040 35563 -89787 -123693 -90246
8369i0246p5436R2405J02103M4294j3702m1304q6557k20252q712M7429M8949L1339
$$ -90246 -165682 -73277 28826 73120 59418 18114 -68443 -288695 -297407 -249978 -201029 -169690
8357a69690M1692J1829L233J13512J56634q1746n1127p1786m0899l8261J30078
$$ -169690 -127998 -116169 -112936 576 157210 75464 24337 -47449 -88348 -126609 3469
8346C469K2104j0863O9488m8284M7021J2805l5789o192k9236o2023j3979l3409
$$ 3469 25573 14710 84198 35914 82935 95740 59951 53759 24523 -37500 -51479 -84888
8334h4888n3772P9381K7709k7153J1085m2487J1563o2990p3538P4311J06485j43680
$$ -84888 -138660 -59279 -31570 -58723 -47638 -90125 -78562 -141552 -215090 -140779 -34294 -177974
8322a77974j10824L0950j0561J23453O8849Q1504j6004O0778k0687j37784L9342
$$ -177974 -288798 -257848 -268409 -144956 -76107 5397 -10607 50171 29484 -108300 -68958
8311f8958M0261L2627M2530J7415j31012p3912R5152J02002P1961p5831k910L7830
$$ -68958 -28697 3930 46460 63875 -67137 -141049 -45897 56105 128066 52235 49325 87155
8299H7155q3244o0737k2208l8664J0853K5954M071O317j1491L4379n5952J22847
$$ 87155 3911 -56826 -79034 -117698 -106845 -80891 -76820 -70503 -81994 -47615 -103567 19280
8287A9280K08267m5672j62117k0627K0370J4897k2156l7442N6790J8507l9579
$$ 19280 227547 181875 19758 -869 19501 34398 12242 -25200 31590 50097 10518
8276A0518J2270m1641P6324N0259m2938j05150n2206N1073k6978N5481K6804Q6781
$$ 10518 22788 -18853 57471 107730 64792 -40358 -92564 -41491 -68469 -12988 13816 100597
8264A00597r6768l6683M1541O5282M8485j57822r7934o5731K0772O1773o2783
$$ 100597 3829 -32854 8687 73969 122454 -35368 -133302 -199033 -178261 -116488 -179271
8253a79271n6784N2140O1132J21989N3401n1815M3337l9443j56106q7094J20358
$$ -179271 -236055 -183915 -122783 -794 52607 792 44129 4686 -151420 -238514 -118156
8242a18156J17307M2313Q6397j26258k5555j02265l0258R0273o218r3145P1569
$$ -118156 -849 41464 127861 1603 -23952 -126217 -156475 -66202 -72420 -165565 -93996
8231i3996O9090n7314m9379N2291J34689m463j33546j2572J42938M9853R49m9318
$$ -93996 -24906 -82220 -131599 -79308 55381 50918 -82628 -95200 47738 97591 98540 49222
8219D9222r4064p8318J8549Q9895m7115p3936M3082m6212L1320J57333J9342J6530
$$ 49222 -44842 -123160 -104611 -14716 -61831 -135767 -92685 -138897 -107577 49756 69098 85628
8207H5628J3415j2188J18758J6661l6605q8522p8401J03391J9113j18490J8009
$$ 85628 99043 86855 205613 222274 185669 97147 18746 122137 141250 22760 40769
8196D0769L810K0712k4231r0968o3768n420N2543p0392p528m057Q3095P9847r1428
$$ 40769 44579 65291 41060 -49908 -113676 -119096 -66553 -136945 -144473 -148530 -65435 14412 -77016
8183g7016N9863M4747N1574j5886O4729n5783k04048j4285N1362n9859L1840k3721
$$ -77016 -17153 27594 79168 63282 128011 72228 -131820 -146105 -94743 -154602 -122762 -146483
8171a46483m6093J04453O5522M2504R664j40059K0876k280J5509l5996O4637J2783
$$ -146483 -192576 -88123 -22601 19903 29567 -110492 -89616 -91896 -76387 -112383 -47746 -34963
8159c4963o6780N7224P2491L5140p1685j39520j50958L7570J58016J52685L4691
$$ -34963 -101743 -44519 27972 63112 -8573 -148093 -299051 -261481 -103465 49220 83911
8148H3911k3932j10040j5238n5280r8209m3021J11379J12097M169l0883n9153
$$ 83911 59979 -50061 -65299 -120579 -218788 -261809 -150430 -38333 -34164 -65047 -124200
8137a24200m0847l5983P8984M0472k6263j45321k2029J11807M8105j19315Q4721
$$ -124200 -165047 -201030 -122046 -81574 -107837 -253158 -275187 -163380 -115275 -234590 -149869
8126a49869K5023r8602n510J79963L5534K8151P7116l5007m1460m4759j09860
$$ -149869 -124846 -223448 -228958 -48995 -13461 14690 91806 56799 15339 -29420 -139280
8115a39280O0737M8884l1937n6862k808L6886J18364N5591j60499n7190N4759
$$ -139280 -78543 -29659 -61596 -118458 -121266 -84380 33984 89575 -70924 -128114 -73355
8104g3355Q8931o5067P373R946o8983J2526M2450Q9896O7234N6839O6294j83462
$$ -73355 15576 -49491 -42118 -32172 -101155 -88629 -46179 43717 110951 167790 234084 50622
8092E0622j10293J6943K0234m4784j05678o1736q788L6879j6282m9736j855l0624
$$ 50622 -59671 -42728 -22494 -67278 -172956 -234692 -243480 -206601 -222883 -272619 -274474 -305098
8080c05098O9950K8213K2899K1302q739p1195N9188n3711q352J32411J33581K4109
$$ -305098 -235148 -206935 -184036 -162734 -171473 -242668 -183480 -237191 -245543 -113132 20449 44558
8068D4558l1323L5734q325n9766l2174O2533n454q7984K848J4620L6668J6928
$$ 44558 13235 48969 40644 -19122 -51296 11237 5783 -82201 -79353 -64733 -28065 -11137
8056a1137R9714Q6172O9278m9566j37581r1452o6516p8128J58845J15363k3712
$$ -11137 88577 174749 244027 194461 56880 -34572 -101088 -179216 -20371 94992 71280
8045G1280l7068j93903k2355J16021R9702l5335o6281O4089O5199k7491r4647
$$ 71280 34212 -159691 -182046 -66025 33677 -1658 -67939 -3850 61349 33858 -60789
8034f0789K4046L1300m2997Q5402M5331m4690K0868l3813j23458m2814m6005q9042
$$ -60789 -36743 -5443 -48440 36962 82293 37603 58471 24658 -98800 -141614 -187619 -276661
8022b76661K39916J22972J07637o7694m7229j4037k0280j6707P7587J8191j3828
$$ -276661 -36745 86227 193864 126170 78941 64904 44624 27917 105504 123695 109867
8011A09867M7368q7112l3527j4595K872J9109j7821N2788k2386j18700o0601j2313
$$ 109867 157235 70123 36596 22001 24873 43982 26161 78949 56563 -62137 -122738 -135051
7999a35051O8446N4927q089k756N9776P15n2452r7143K4J6592J3719J6050K5941
$$ -135051 -66605 -11678 -19767 -22523 37253 37968 -14484 -111627 -111603 -95011 -81292 -65242 -39301
7986c9301J7392P6796L7569q3182p6268p2338J3241K6912o0100j8401J35001J17241
$$ -39301 -21909 54887 92456 9274 -66994 -139332 -126091 -99179 -159279 -177680 -42679 74562
7974G4562j2389l8997P243q572K6534l8244j50456K9445M8765m6511J0776K8814
$$ 74562 62173 23176 30419 21847 48381 10137 -140319 -110874 -62109 -108620 -97844 -69030
7962f9030p449M8746K8714P3276k700k01996n7850M1236Q6234L8657L4261M7782
$$ -69030 -76479 -27733 981 74257 71557 -130439 -188289 -147053 -60819 -22162 12099 59881
7950E9881o2477N0205q6710q5380J14496O3169j7471l4988p1372k32130l0689
$$ 59881 -2596 47609 -39101 -124481 -9985 53184 35713 725 -70647 -302777 -333466
7939c33466K05900K2226J4483P0067l5411l9077r197R0187M7621j06490L3689
$$ -333466 -127566 -105340 -90857 -20790 -56201 -95278 -104475 -14288 33333 -73157 -39468
7928c9468K216j3479N3702j22480r9194K7291N8811j0930Q0038P7851L2014M0757
$$ -39468 -37252 -50731 2971 -119509 -218703 -191412 -132601 -143531 -63493 14358 46372 87129
7916H7129j0616L0728K1386l3489l1204o6183l6965k4044M6283j4188J29602k5722
$$ 87129 76513 107241 128627 95138 63934 -2249 -39214 -63258 -16975 -31163 98439 72717
7904G2717j13423K4872N7428l506k4329j0829R0447M8614p1522M932J3250q9378
$$ 72717 -40706 -15834 41594 38088 13759 2930 93377 141991 70469 75401 88651 -727
7892g27P4317J3889p3544m5833m8254l0813m1105P0298J49188O3367o9310k4677
$$ -727 73590 87479 13935 -31898 -80152 -110965 -152070 -81772 67416 130783 61473 36796
7880C6796J07297k3592l8536p0348p610j06144n7617k244N0777P1732l0053m271
$$ 36796 144093 120501 81965 11617 4007 -102137 -159754 -161998 -111221 -39489 -69542 -73813
7868g3813O2010P4983r1320l7548J6933J17630p9079j07295O4266P9406J16807
$$ -73813 -11803 63180 -28140 -65688 -48755 68875 -10204 -117499 -53233 26173 142980
7857A42980l3602p150q425K4067J37078K1711n3675j08151l6414j18649j9737
$$ 142980 109378 102228 93803 117870 254948 276659 222984 114833 78419 -40230 -59967
7846e9967k8939m1252M2374J8021p0476m8230J65347J33659l1113p6348O1945
$$ -59967 -88906 -130158 -87784 -69763 -140239 -188469 -23122 110537 79424 3076 65021
7835F5021P9102Q873n3945K7026J6967r1061n8648j02155L7043Q6883n9347j29481
$$ 65021 144123 152996 99051 126077 143044 51983 -6665 -108820 -71777 15106 -44241 -173722
7823a73722j5543M1969P0773N3940L5937L8949Q9047p9194j51237q3406J4178
$$ -173722 -189265 -147296 -76523 -22583 13354 52303 141350 62156 -89081 -172487 -158309
7812a58309P3902N0377K9365L2278q1349l6103O7848l926M0282O1728J0276j08077
$$ -158309 -84407 -34030 -4665 27613 -53736 -89839 -21991 -25917 14365 76093 86369 -21708
7800b1708J3407J8810j02905K01716J72665Q2010n6061j87276p3926l0088m8888
$$ -21708 -8301 10509 -92396 109320 281985 363995 307934 120658 46732 16644 -32244
7789c2244o8483p3089N1022K9090l0376k4395j9628K7890O452K15111L3134k0994
$$ -32244 -100727 -173816 -122794 -93704 -124080 -148475 -168103 -140213 -133761 81350 114484 93490
7777I3490n5880j28603o2317R1612J4241p3164o161k4775p4625n0778n6945M6646
$$ 93490 37610 -90993 -153310 -61698 -47457 -120621 -126782 -151557 -226182 -276960 -333905 -287259
7765b87259M5569M0837J18464j1322J5006J44855J47401J7799m3711l0982O0472
$$ -287259 -241690 -200853 -82389 -93711 -78705 66150 213551 231350 187639 156657 217129
7754B17129k4772q3682l5484p3069k1158l581K220J24407p9100L0296k98j56531
$$ 217129 192357 108675 73191 122 -21036 -24617 -22397 102010 22910 53206 52908 -103623
7742a03623P5528j0829M8001J6546n7094j154J7941j61360K5631L4620P1404P6652
$$ -103623 -28095 -38924 9077 25623 -31471 -32625 -14684 -176044 -150413 -115793 -44389 32263
7730C2263k1558L8453R138o2633L154O5583N685l0238L5596N3848q8261m8768
$$ 32263 10705 49158 58296 -4337 -1183 64400 70085 39847 75443 129291 41030 -7738
7718g738k3505n893R1058J4353n1107m8309l9415O3899n4239o1618p1764J0215
$$ -7738 -31243 -37136 53922 68275 17168 -31141 -70556 -6657 -60896 -122514 -194278 -184063
7706a84063K06216L6141n6535k4547p2664J72005O5100J7060j3302o8393J5166
$$ -184063 22153 58294 1759 -22788 -95452 76553 141653 158713 145411 77018 92184
7695I2184Q1346p5138l2896m1457m811O2883P001l6090K2906J8604m7474N3350
$$ 92184 173530 98392 65496 24039 19228 82111 89112 53022 75928 94532 47058 100408
7683A00408n630o9234r54j14867l3697P9337K4741J9709j4556o2383J7924M3044
$$ 100408 94778 25544 24590 -90277 -123974 -44637 -19896 -187 -14743 -77126 -59202 -16158
7671a6158o8720q0317R0868p1259j02457L9863K709r6470j17323R1718R2914K3881
$$ -16158 -84878 -165195 -74327 -145586 -248043 -208180 -205471 -301941 -419264 -327546 -234632 -210751
7659b10751K0661N032o1183K7863q927J17403R0703M3127j27078o449J13060M2010
$$ -210751 -190090 -185058 -246241 -218378 -227305 -109902 -19199 23928 -103150 -109599 3461 45471
7647D5471r1355l4021J1191q315J7040j3177k8401p5678J5079J74788L1714q8555
$$ 45471 -45884 -79905 -68714 -77029 -59989 -73166 -101567 -177245 -162166 12622 44336 -44219
7635d4219J26044J3736m638M0298J8156L3217l6446k008Q6239M1257j34073j48881
$$ -44219 81825 95561 90923 131221 149377 182594 146148 144140 230379 271636 137563 -11318
7623a1318O3947j9517q8991M1445P3301l2703k2704o6259j01988j9215K5056j6725
$$ -11318 52629 33112 -55879 -14434 58867 26164 3460 -62799 -164787 -184002 -158946 -175671
7611a75671M470N9211P1218J23353j7112r7650q5961N6149M1436O1617K4763N1220
$$ -175671 -171201 -111990 -40772 82581 65469 -32181 -118142 -61993 -20557 41060 65823 117043
7599A17043J6066j12564n6431J944l1101p0460L0033l0078Q0470J16219l8130
$$ 117043 133109 20545 -35886 -33942 -65043 -135503 -105470 -135548 -55078 61141 23011
7588B3011n5103m6609m3358n0074o5949J8858P8068k6830K6621M7612N3470j14911
$$ 23011 -32092 -78701 -122059 -172133 -238082 -219224 -141156 -167986 -141365 -93753 -40283 -155194
7576a55194J6967J8128J16145k5115j43141l4150M8665P9703J24538l818o1730
$$ -155194 -138227 -120099 -3954 -29069 -172210 -206360 -157695 -77992 46546 42728 -19002
7565a9002l86m4649J0381k1708Q9221J710k2445l1587r944p2995P7694O0028N7564
$$ -19002 -19388 -64037 -53656 -75364 13857 15567 -6878 -38465 -48409 -121404 -43710 16318 73882
7552G3882j6603n5446k5390k4542m8929m731O3135M5643p571N1381l0061l1649
$$ 73882 57279 1833 -23557 -48099 -97028 -101759 -38624 7019 -552 50829 20768 -10881
7540a0881k8770l6517O7410K2860J21499L8287o2302p3693q2161Q077M5505P7126
$$ -10881 -39651 -76168 -8758 14102 135601 173888 111586 37893 -44268 -36191 9314 86440
7528H6440j2947m8923r665L3284p9623r1963L6834m4968m414O6649P5439m0648
$$ 86440 73493 24570 14905 48189 -31434 -123397 -86563 -131531 -135945 -69296 6143 -34505
7516c4505j6335p4573J9390m575j05278l4845l7241J365L7479Q0604Q6920R8026
$$ -34505 -50840 -125413 -106023 -110598 -215876 -250721 -287962 -286597 -249118 -168514 -81594 16432
7504A6432O0938m0674J8655r8509j5787k2682K9650r957P899Q5662K7451m9700
$$ 16432 77370 36696 55351 -43158 -58945 -81627 -51977 -61934 -54035 31627 59078 9378
7492I378o2959q1386k9796L0047n5170J3282J0795N8783K9508K6764o4803j33119
$$ 9378 -53581 -134967 -164763 -134716 -189886 -176604 -165809 -107026 -77518 -50754 -115557 -248676
7480b48676P6549J52973N618N8945l9886K7988Q4198p7053L533N3680r0686r9038
$$ -248676 -172127 -19154 -13536 45409 5523 33511 117709 40656 44189 97869 7183 -91855
7468i1855Q1222J00076j7592J14172M7551j46284q454L2372l70j08538N0279P7052
$$ -91855 -10633 89443 71851 186023 233574 87290 78836 111208 110838 2300 52579 129631
7456A29631M8410j10149j45986m4788L5084O1825K7804k4281P4495j20292Q255
$$ 129631 178041 67892 -78094 -122882 -87798 -25973 1831 -22450 52045 -68247 -59992
7445e9992K0526L0714n69K5080q2895j76750n3475J53931P2125m8874J0087K5935
$$ -59992 -39466 -8752 -9321 15759 -67136 -243886 -297361 -143430 -71305 -120179 -110092 -84157
7433h4157p1390J525n0821k8970L4386J35871m7781N0672K5114k6041j02894j6295
$$ -84157 -155547 -154022 -204843 -233813 -199427 -63556 -111337 -60665 -35551 -61592 -164486 -180781
7421a80781N535m5552J34935L5138K5520k5101L3931J23362N291l3651P4047J126
$$ -180781 -175246 -220798 -85863 -50725 -25205 -50306 -16375 106987 112278 78627 152674 153800
7409A53800r4060J9516k2518L675J00710j43587O153R521j6573j582j64767j05278
$$ 153800 59740 79256 56738 60413 161123 17536 23689 33210 16637 15055 -149712 -254990
7397b54990O9065J38884J7412L2438j2833q2742K1988j07989k3684R2803K1243
$$ -254990 -185925 -47041 -29629 2809 -10024 -92766 -70778 -178767 -202451 -109648 -88405
7386h8405j00897M3271k179L9410J56827M943j27329j07011O825K8406P5912m2314
$$ -88405 -189302 -146031 -148210 -108800 48027 52970 -74359 -181370 -174545 -146139 -70227 -112541
7374a12541R9255l5830q4749J33667Q70o2153K2606O5727l4097K2689o6227j54080
$$ -112541 -13286 -49116 -133865 -198 672 -61481 -38875 26852 -7245 15444 -50783 -204863
7362b04863n4122Q1332J39052J42155q2103o3763j4560J79726J3005j01142r0855
$$ -204863 -258985 -177653 -38601 103554 21451 -42312 -56872 122854 135859 34717 -56138
7351e6138M9330R732M5065j3748J5144n0017r0369N6584O1373M7496o507J8741
$$ -56138 -6808 2924 47989 34241 49385 -632 -91001 -34417 26956 74452 67945 86686
7339H6686r5999J9186R820o6253J15926O3920j06409j47030o323K4043M3325O2765
$$ 86686 -9313 9873 19693 -46560 69366 133286 26877 -120153 -126476 -102433 -59108 3657
7327C657K7861k5979p4433q4132Q0202l6028k2086J59402P1512n6733k2465j440
$$ 3657 31518 5539 -68894 -153026 -72824 -108852 -130938 28464 99976 43243 20778 19338
7315A9338q3962L7637Q8145l992J6615k5006r818L7771R5804p9595r2501j4688
$$ 19338 -64624 -26987 61158 57166 73781 48775 38957 76728 172532 92937 436 -14252
7303a4252K2931O8895o1089p9931l0787M3639N9817J10640r4916q5938k9856j12496
$$ -14252 8679 77574 16485 -63446 -94233 -50594 9223 119863 24947 -60991 -90847 -203343
7291b03343J2404J07916P0702P1335J2767l7847p127P9028P4729L542q6307p3516
$$ -203343 -190939 -83023 -12321 59014 71781 33934 26807 105835 180564 184106 97799 24283
7279B4283J2282R4483j10231q807N8615q6194j41556j20145l9517L6247l8402
$$ 24283 36565 131048 20817 12010 70625 -15569 -157125 -277270 -316787 -280540 -318942
7268c18942J9915P6648M2148J24012M623N6364m4397K59k4872r168k5266Q4300
$$ -318942 -299027 -222379 -180231 -56219 -51596 4768 -39629 -39370 -64242 -73410 -98676 -14376
7256a4376J23887L7143J2439m6113j10657K217J40942o6400j75875L9743J37664
$$ -14376 109511 146654 159093 112980 2323 4540 145482 79082 -96793 -57050 80614
7245H0614L1078n4060K9633o781j19219L8001M7251l4922l6690J9489K562o1331
$$ 80614 111692 57632 87265 80484 -38735 -734 46517 11595 -25095 -5606 -3044 -64375
7233f4375O0023R0507J5004j08633l8599m2351M9831K5145P875N305L7873j17152
$$ -64375 -4352 86155 101159 -7474 -46073 -88424 -38593 -13448 -5573 -268 37605 -79547
7221g9547n7377K0396k5118m7375J56009K4000p5895n7772r4944N7409J3613J0851
$$ -79547 -136924 -116528 -141646 -189021 -33012 -9012 -84907 -142679 -237623 -180214 -166601 -155750
7209a55750P4208L1156L9464j8194J0250o129n8862q246J35883P2511p6301K9177
$$ -155750 -81542 -50386 -10922 -29116 -18866 -24995 -83857 -92103 43780 116291 39990 69167
7197F9167R0569L5275N7305j541K0144q5525m52K0785r7506p7341o4709P2093
$$ 69167 159736 195011 252316 250775 270919 185394 184942 205727 108221 30880 -33829 38264
7185C8264R2986K271P111k1926J6421J27752R3699j05611j23340p885p4803j40972
$$ 38264 131250 133521 140632 118706 135127 262879 356578 250967 127627 119742 44939 -96033
7173i6033j61550j817J11798Q7356L1747n4987L1624J03793k3524J08492O192
$$ -96033 -257583 -259400 -147602 -60246 -28499 -83486 -51862 51931 28407 136899 143091
7162A43091j26427J9916m7237n9054K5475O5047O8260L2075k0943j599k1166n6594
$$ 143091 16664 36580 -10657 -69711 -44236 20811 89071 121146 100203 98604 77438 20844
7150B0844J0132m5003m5564k2470j02320j2129Q2353M5047m4408n1190J33021
$$ 20844 30976 -14027 -59591 -82061 -184381 -196510 -114157 -69110 -113518 -164708 -31687
7139c1687M4933L5790l5019j340j27186n0957Q7345N0520O5067j6149p7547j20409
$$ -31687 13246 49036 14017 12677 -114509 -165466 -78121 -27601 37466 21317 -56230 -176639
7127a76639q955J52625J39691L8443j30217r3527n9227r131j021M9614L2744J7619
$$ -176639 -185594 -32969 106722 145165 14948 -78579 -137806 -146937 -147958 -98344 -65600 -47981
7115d7981M0850J2231J2477N5599R005q9184L494J00183O1645l9686K293M8732
$$ -47981 -7131 5100 17577 73176 82181 -7003 -3509 96674 158319 118633 120926 169658
7103A69658o2512j23971j37167R7086J27708j5152m5790O1790J10932j23881j13930
$$ 169658 107146 -16825 -153992 -56906 70802 55650 9860 71650 182582 58701 -55229
7092e5229J279L1990k2968k3987o076o9687J00868Q8161k7619M8741r884L3341
$$ -55229 -53950 -21960 -44928 -68915 -74991 -144678 -43810 44351 16732 65473 55589 88930
7080H8930j18816o3631O9191M3146J2153j943j18220m014N4275L2011k4592j7326
$$ 88930 -29886 -93517 -24326 18820 30973 29030 -89190 -93204 -38929 -6918 -31510 -48836
7068d8836q0111o3916M0610R7765p266p6474R1497j07979r8655J27411J96813
$$ -48836 -128947 -192863 -152253 -54488 -61754 -138228 -46731 -154710 -253365 -125954 70859
7057G0859n4546o6890j38432L1201Q7211O1769L1830K4163K6079J84657k5806
$$ 70859 16313 -50577 -189009 -157808 -70597 -8828 23002 47165 73244 257901 232095
7046B32095p2360j58155j09644n4320J2846Q9972j00418j01313L6059J70338K6597
$$ 232095 159735 1580 -108064 -162384 -149538 -59566 -159984 -261297 -225238 -54900 -28303
7035b8303j71638l7781J41815R2712p0039L8111N0644m8567m8513M0923L012j7375
$$ -28303 -199941 -237722 -95907 -3195 -73234 -35123 15521 -33046 -81559 -40636 -37624 -54999
7023e4999J6046l9302L6143m0144n4139J7348N7186o6035k1622J2749j8670M1667
$$ -54999 -38953 -78255 -42112 -82256 -136395 -119047 -61861 -127896 -149518 -136769 -155439 -113772
7011a13772Q9178N2585J3392Q321p8682k5820n2952j1783K0728k3972N9721k7637
$$ -113772 -24594 27991 41383 49704 -28978 -54798 -107750 -119533 -98805 -122777 -63056 -90693
6999i0693K7330N4460P1781n171Q086q0183j39812P030O9250l9250K8142O776
$$ -90693 -63363 -8903 62878 57707 65793 -14390 -154202 -147172 -77922 -117172 -89030 -82254
6987h2254p1974l996O5859J02835P1620l771M9301M1045k0585q5485k5744j18704
$$ -82254 -154228 -158224 -92365 10470 82090 78319 127620 168665 148080 62595 36851 -81853
6975h1853j3143l4013o6101M2949J48095N3443J34316P720j67785o2632m5699
$$ -81853 -94996 -129009 -195110 -152161 -4066 49377 183693 191413 23628 -39004 -84703
6964h4703q6744j20454k1021J03294M2496P130K9209j1486P4512P1962L4681j2754
$$ -84703 -171447 -291901 -312922 -209628 -167132 -160002 -130793 -142279 -67767 4195 38876 26122
6952B6122P783k0817L7145k9654m0500Q4868O747O4761K9513J4605p4402j72240
$$ 26122 33905 13088 50233 20579 -19921 64947 71694 136455 165968 180573 106171 -66069
6940f6069j66443O1134M4262k3470J43404l7885j85836m2933J5631N9287l604
$$ -66069 -232512 -171378 -127116 -150586 -7182 -45067 -230903 -273836 -258205 -198918 -202522
6929b02522n303m0118L5130J25323J05919k83O3787N3969j53689m1703P8807m6045
$$ -202522 -207825 -247943 -212813 -87490 18429 18146 81933 135902 -17787 -59490 19317 -26728
6917b6728p8380O6334m544Q09m726o7114K0598o7901q7964l4466Q8860K4209J11505
$$ -26728 -105108 -38774 -43318 -42509 -47235 -114349 -93751 -161652 -249616 -284082 -195222 -171013 -59508
6904e9508L8931n4097q3502N1580Q9179J822q2962K1817p5080l5515O6995L8489
$$ -59508 -20577 -74674 -158176 -106596 -17417 -15595 -98557 -76740 -151820 -187335 -120340 -81851
6892h1851J41969J2457q0565K0299J7578o0029r5883o091J47895l8485m3836k7480
$$ -81851 60118 72575 -7990 12309 29887 -30142 -126025 -132116 15779 -22706 -66542 -94022
6880i4022k8079Q6376Q3465L983r0840N0177J19771K7790n5748m6534O672k0539
$$ -94022 -122101 -35725 47740 51723 -39117 11060 130831 158621 102873 56339 63011 42472
6868D2472r2953K1099R8162Q6168q7026J3868K570L6558j09761m0638L7104L3283
$$ 42472 -50481 -29382 68780 154948 67922 81790 84360 120918 11157 -29481 7623 40906
6856D0906K8182j33038R063M6368K290R3482l8769p410j3356o6989l3243K8615
$$ 40906 69088 -63950 -54887 -8519 -6229 87253 48484 41074 27718 -39271 -72514 -43899
6844d3899Q6904O2152o1930K1402Q0236j2928m3012j20798n557M2281q291M5570
$$ -43899 43005 105157 43227 64629 144865 131937 88925 -31873 -37430 4851 -3440 42130
6832D2130J240N4745R0399L45j01204j46367O2327M5796q397q4046K5294J56520
$$ 42130 43370 98115 188514 188859 87655 -58712 3615 49411 41014 -43032 -17738 138782
6820A38782K9476j84567k06318M5461K00564O7878K1616j3952n5651j05846J3984
$$ 138782 168258 -16309 -222627 -177166 23398 91276 112892 98940 43289 -62557 -48573
6809d8573N1651j7086n1464l4984M3949O1376k9702o1514q6817L0506P1392R2845
$$ -48573 3078 -14008 -65472 -100456 -56507 4869 -24833 -86347 -173164 -142658 -71266 21579
6797B1579J8339n4009Q7100P9405J7264M8212j67927j20794p2960K3220L487K6227
$$ 21579 39918 -14091 73009 152414 169678 217890 49963 -70831 -143791 -120571 -117084 -90857
6785i0857L6231Q0737k5730K652l7762j20031Q5921n1845p173J2462j33992n04
$$ -90857 -54626 26111 381 3033 -34729 -154760 -68839 -120684 -127857 -115395 -249387 -249891
6773b49891M6951J15304Q8948l5548n515p7115M5116J22319L4729k6036N204p6737
$$ -249891 -202940 -87636 1312 -34236 -39751 -116866 -71750 50569 85298 59262 64466 -12271
6761a2271p9233o1505l5196j4583J03779N7511j6636k6946j08553J0891J12947
$$ -12271 -91504 -153009 -188205 -202788 -99009 -41498 -58134 -85080 -193633 -182742 -69795
6750f9795R0705J2572K1515k8549n9755m6358k8117R6428K9769n0522n5657o5023
$$ -69795 20910 33482 54997 26448 -33307 -79665 -107782 -11354 18415 -32107 -87764 -152787
6738a52787k0221k4006K8147N7536k2715m7727J27822M6563M2341J0912M5712
$$ -152787 -173008 -197014 -168867 -111331 -134046 -181773 -53951 -7388 34953 45865 91577
6727I1577J0384Q121n1896j47305J15700J7744p2817J05518N8046l2620k4644
$$ 91577 101961 110082 58186 -89119 26581 44325 -28492 77026 135072 102452 77808
6716G7808n2326j14515k6835J00851p1602r4246K3233J8757Q3650P6444K8550
$$ 77808 25482 -89033 -115868 -15017 -86619 -180865 -157632 -138875 -55225 21219 49769
6705D9769L5553P0642n728r2108o5675p1794J29540J11451l0578q7153m0663p405
$$ 49769 85322 155964 150236 58128 -7547 -79341 50199 161650 131072 43919 3256 -4149
6693d149J2764p662o1676L081Q0965O3260n3289R1544o1134m1584L7830M4225
$$ -4149 8615 953 -60723 -57642 23323 86583 33294 124838 63704 22120 59950 104175
6681A04175k1725J9464L7613r8713p8872r167j9401M0372K3691j28545O3053K7644
$$ 104175 82450 101914 139527 40814 -38058 -47225 -66626 -26254 -2563 -131108 -68055 -40411
6669d0411m8351N5786L7782L9535m8224o1198K5803l5933J1989J06640Q5462j41341
$$ -40411 -88762 -32976 4806 44341 -3883 -65081 -39278 -75211 -63222 43418 128880 -12461
6657a2461o6603K0720J27124k0583r5450K3850J22867J989O0778n0589j26360
$$ -12461 -79064 -58344 68780 48197 -47253 -23403 99464 101453 162231 111642 -14718
6646a4718n7443n0133L7433o9888n6502J7256K3343N7488J21296o3559N8917P0732
$$ -14718 -72161 -122294 -84861 -154749 -211251 -193995 -170652 -113164 8132 -55427 3490 74222
6634G4222K4165j22794l1952J2786l3077Q4503L0409r5076r8584j6736J33132
$$ 74222 98387 -24407 -56359 -43573 -76650 7853 38262 -56814 -155398 -172134 -39002
6623c9002Q9892n9501M4498j2432k47275n8295R4835J47856J23295J31027j59995
$$ -39002 50890 -8611 35887 23455 -223820 -282115 -187280 -39424 83871 214898 54903
6612E4903j13564J8326O0785o878j03358r6388N8181P4611j2836r3768k7482J2038
$$ 54903 -58661 -40335 20450 13572 -89786 -186174 -127993 -53382 -66218 -159986 -187468 -175430
6600a75430m2507M043J06145J00620k977k9176O482o2976k1095k0193K3052m406
$$ -175430 -217937 -213894 -107749 -7129 -10106 -39282 -32800 -95776 -116871 -137064 -114012 -118418
6588a18418K5854j5181K9400l8808J9046n9095m4758L2240J81949J1926j1439
$$ -118418 -92564 -107745 -78345 -117153 -98107 -157202 -201960 -169720 12229 24155 12716
6577A2716L3537K8033N116n7622n2892N0340m7195p2543m700N0099j2592O5400
$$ 12716 46253 74286 79402 21780 -31112 19228 -27967 -100510 -105210 -55111 -67703 -2303
6565b303P4087l6039J1191p5225K9031j1109q0380n7255P2830M3700j3929m8876
$$ -2303 71784 35745 46936 -28289 742 -10367 -90747 -148002 -75172 -31472 -45401 -94277
6553i4277K0260L9301Q8252l5105j20717o6619K0018J26365Q8825j29728m9577
$$ -94277 -74017 -34716 53536 18431 -102286 -168905 -148887 -22522 66303 -63425 -113002
6542a13002M3365K9900j0570m227K4470J4093O0907J18528l1350p2030p5364r4380
$$ -113002 -69637 -39737 -50307 -54534 -30064 -15971 44936 163464 132114 60084 -15280 -109660
6530a09660J983L8724o4423j37454n3121M3938J55002N3603m186j8918N336j2911
$$ -109660 -107677 -68953 -133376 -270830 -323951 -280013 -125011 -71408 -75594 -94512 -89176 -102087
6518a02087N8802K2243J9213Q6790M9552j21096j07271K6284Q8870K116J4659
$$ -102087 -43285 -21042 -1829 84961 134513 13417 -93854 -67570 21300 23416 38075
6507C8075K0713n2452L0472J3519l9309L1953R2031l1280j72093j20696R4840
$$ 38075 58788 6336 36808 50327 11018 42971 135002 103722 -68371 -189067 -94227
6496i4227J16472j6054r9458L6120J11842O5905r9427j92722q8424k1182n7344
$$ -94227 22245 6191 -93267 -57147 54695 120600 21173 -171549 -259973 -281155 -338499
6485c38499J22092K14674J44181L0408o3209j67348M0296M2764M2347n8656J6923
$$ -338499 -216407 -1733 142448 172856 109647 -57701 -17405 25359 67706 9050 25973
6474B5973J15030o8533o5355n4322p966j6752j49909J14875O9684k006j5833J0948
$$ 25973 141003 72470 7115 -47207 -55173 -71925 -221834 -106959 -37275 -39281 -55114 -44166
6462d4166R9872n4378Q858J26060k4415l9806j26969q1984J01468N1628J8379
$$ -44166 55706 1328 10186 136246 111831 72025 -54944 -136928 -35460 16168 34547
6451C4547p4790l7032J63424l7877r5931j4567m1035K6187M7811o9082j7879K2189
$$ 34547 -40243 -77275 86149 48272 -47659 -62226 -103261 -77074 -29263 -98345 -116224 -94035
$$ [...]
##END NTUPLES=NMR SPECTRUM
##END=
