##TITLE=Analysis number 317763
Compound Code cc 24802
Project Code adrs
Chemist Name endeavour
##JCAMPDX= 6.0         $$ Bruker NMR JCAMP-DX V2.0
##DATA TYPE= NMR SPECTRUM
##DATA CLASS= NTUPLES
##ORIGIN= Bruker BioSpin GmbH
##OWNER= nmr
$$ XWIN-NMR		Version 3.5
$$ Thu Mar  2 15:46:52 2006 GMT Standard Time (UT+0h)  MAYBRIDGE\nmr@NMR_250MHZ
##.OBSERVE FREQUENCY= 250.131544655141
##.OBSERVE NUCLEUS= ^1H
##.ACQUISITION MODE= SIMULTANEOUS (DQD)
##.ACQUISITION SCHEME= undefined
##.AVERAGES= 16
##.DIGITISER RES= 18
##SPECTROMETER/DATA SYSTEM= dpx250
##.PULSE SEQUENCE= zg30
##.SOLVENT NAME= CDCl3
##.SHIFT REFERENCE= (INTERNAL, CDCl3, 0, 16.522)
##AUDIT TRAIL= $$ (NUMBER, WHEN, WHO, WHERE, WHAT)
$$ ##TITLE= Audit trail, XWIN-NMR		Version 3.5
$$ ##JCAMPDX= 5.01
$$ ##ORIGIN= Bruker BioSpin GmbH
$$ ##OWNER= nmr
$$ C:\u/data/dgb/nmr/ADRS/17360/pdata/1/auditp.txt
$$ ##AUDIT TRAIL=  $$ (NUMBER, WHEN, WHO, WHERE, WHAT)
(   1,<2006-03-02 15:45:53.98 +000>,<MAYBRIDGE\nmr>,<NMR_250MHZ>,
      <created by zg, POWCHK disabled, PULCHK disabled
       configuration hash MD5:
       84 BC 41 DB A1 6E 1D 46 DA 25 12 A5 C1 ED C5 3A
       data hash MD5: 64K
       F6 33 33 D1 CE 09 56 D2 38 51 03 62 FE BD F8 26>)
(   2,<2006-03-02 15:46:18.48 +000>,<MAYBRIDGE\nmr>,<NMR_250MHZ>,
      <Start of raw data processing
       ef LB = 0.3 FT_mod = 6 PKNL = 1 SI = 32K 
       data hash MD5: 32K
       22 72 4E A1 1A 40 DE 85 19 53 42 5B 16 BA B9 21>)
(   3,<2006-03-02 15:46:22.31 +000>,<MAYBRIDGE\nmr>,<NMR_250MHZ>,
      <apk 
       data hash MD5: 32K
       90 D8 FC F4 38 3B D3 7B 94 0C 12 0F 3B CD 59 85>)
(   4,<2006-03-02 15:46:23.61 +000>,<MAYBRIDGE\nmr>,<NMR_250MHZ>,
      <abs ABSG = 5 
       data hash MD5: 32K
       E1 6F 9A A9 41 14 CF BC BD 32 95 39 30 55 A2 B7>)
$$ ##END=
$$ 
$$ hash MD5
$$ 4C 0F AA 7D 5D BD C7 4F 6A 43 9F A1 45 66 60 2B
##$RELAX= 
##$RELAX= 
##$RELAX= 
##$RELAX= 
##$RELAX= 
##$RELAX= 
##$RELAX= 
$$ Bruker specific parameters
$$ --------------------------
##$DU= <C:\u>
##$EXPNO= 17360
##$NAME= <ADRS>
##$PROCNO= 1
##$TYPE= <nmr>
##$USER= <dgb>
##$AMP= (0..31)
100 100 100 100 100 100 100 100 100 100 100 100 100 100 100 100 100 100 
100 100 100 100 100 100 100 100 100 100 100 100 100 100 
##$AQSEQ= 0
##$AQ_mod= 3
##$AUNM= <au_zg>
##$AUTOPOS= <37 >
##$BF1= 250.13
##$BF2= 250.13
##$BF3= 250.13
##$BF4= 250.13
##$BF5= 500.13
##$BF6= 500.13
##$BF7= 500.13
##$BF8= 500.13
##$BYTORDA= 1
##$CFDGTYP= 0
##$CFRGTYP= 5
##$CHEMSTR= <none>
##$CNST= (0..31)
1 1 145 1 1 1 1 1 1 1 1 1 1 1 1 1 1 1 1 1 1 1 1 1 1 1 1 1 1 1 1 1 
##$CPDPRG= <>
##$CPDPRG1= <>
##$CPDPRG2= <>
##$CPDPRG3= <>
##$CPDPRG4= <mlev>
##$CPDPRG5= <mlev>
##$CPDPRG6= <mlev>
##$CPDPRG7= <mlev>
##$CPDPRG8= <mlev>
##$CPDPRGB= <>
##$CPDPRGT= <>
##$D= (0..31)
0 1 0 0 0 0 0 0 0 0.06 0 0 0 0 0 0 0.0002 0 0 0 0 0 0 0 0 0 0 0 0 0 0 
0 
##$DATE= 1141314350
##$DBL= (0..7)
120 120 120 120 120 120 120 120 
##$DBP= (0..7)
150 150 150 150 150 150 150 150 
##$DBP07= 0
##$DBPNAM0= <>
##$DBPNAM1= <>
##$DBPNAM2= <>
$$ [...]
##$SUBNAM7= <"">
##$SUBNAM8= <"">
##$SUBNAM9= <"">
##$SW= 20.6930455092707
##$SWIBOX= (0..15)
0 0 3 0 0 0 0 0 0 0 0 0 0 0 0 0 
##$SW_h= 5175.983436853
##$TD= 65536
##$TD0= 1
##$TE= 293.16
##$TE2= 300
##$TE3= 300
##$TEG= 300
##$TL= (0..7)
0 120 120 120 120 120 120 120 
##$TP= (0..7)
150 150 150 150 150 150 150 150 
##$TP07= 0
##$TPNAME0= <>
##$TPNAME1= <>
##$TPNAME2= <>
##$TPNAME3= <>
##$TPNAME4= <>
##$TPNAME5= <>
##$TPNAME6= <>
##$TPNAME7= <>
##$TPOAL= (0..7)
0.5 0.5 0.5 0.5 0.5 0.5 0.5 0.5 
##$TPOFFS= (0..7)
0 0 0 0 0 0 0 0 
##$TUNHIN= 0
##$TUNHOUT= 0
##$TUNXOUT= 0
##$USERA1= <user>
##$USERA2= <user>
##$USERA3= <user>
##$USERA4= <user>
##$USERA5= <user>
##$V9= 5
##$VALIST= <valist>
##$VCLIST= <CCCCCCCCCCCCCCC>
##$VD= 0
##$VDLIST= <DDDDDDDDDDDDDDD>
##$VPLIST= <PPPPPPPPPPPPPPP>
##$VTLIST= <TTTTTTTTTTTTTTT>
##$WBST= 1024
##$WBSW= 4
##$XGAIN= (0..3)
0 0 0 0 
##$XL= 0
##$YL= 0
##$YMAX_a= 395803
##$YMIN_a= -409375
##$ZGOPTNS= <>
##$ZL1= 120
##$ZL2= 120
##$ZL3= 120
##$ZL4= 120
##$ABSF1= 16.522
##$ABSF2= -4.171173
##$ABSG= 5
##$ABSL= 3
##$ALPHA= 0
##$AQORDER= 0
##$ASSFAC= 0
##$ASSFACI= 0
##$ASSFACX= 0
##$ASSWID= 0
##$AUNMP= <proc_1d>
##$AZFE= 0.1
##$AZFW= 0.1
##$BCFW= 0
##$BC_mod= 0
##$BYTORDP= 0
##$COROFFS= 0
##$CY= 12.5
##$DATMOD= 1
##$DC= 0
##$DFILT= <>
##$DTYPP= 0
##$F1P= 14.0000005364418
##$F2P= -0.99999901652339
##$FCOR= 0.5
##$FTSIZE= 32768
##$FT_mod= 6
##$GAMMA= 0
##$GB= 0
##$INTBC= 1
##$INTSCL= 1
##$ISEN= 128
##$LB= 0.3
##$LEV0= 0
##$LPBIN= 0
##$MAXI= 10000
##$MC2= 0
##$MEAN= 0
##$ME_mod= 0
##$MI= 0
##$NCOEF= 0
##$NC_proc= -4
##$NLEV= 6
##$NOISF1= 0
##$NOISF2= 0
##$NSP= 0
##$NTH_PI= 0
##$NZP= 0
##$OFFSET= 16.522
##$PC= 1
##$PHC0= 249.3864
##$PHC1= 12.90968
##$PH_mod= 1
##$PKNL= yes
##$PPARMOD= 0
##$PSCAL= 4
##$PSIGN= 0
##$REVERSE= no
##$SF= 250.13
##$SI= 32768
##$SIGF1= 0
##$SIGF2= 0
##$SINO= 400
##$SIOLD= 32768
##$SREGLST= <1H.CDCl3>
##$SSB= 0
##$STSI= 32768
##$STSR= 0
##$SW_p= 5175.98343685301
##$SYMM= 0
##$S_DEV= 0
##$TDeff= 65536
##$TDoff= 0
##$TI= <Analysis number 999999
Compound Code 99
Book Reference 9
Project Code 9>
##$TILT= no
##$TM1= 0
##$TM2= 0
##$TOPLEV= 0
##$USERP1= <user>
##$USERP2= <user>
##$USERP3= <user>
##$USERP4= <user>
##$USERP5= <user>
##$WDW= 1
##$XDIM= 32768
##$YMAX_p= 311842533
##$YMIN_p= -726857
$$ End of Bruker specific parameters
$$ ---------------------------------
##NTUPLES= NMR SPECTRUM
##VAR_NAME=  FREQUENCY,     SPECTRUM/REAL,   SPECTRUM/IMAG
##SYMBOL=    X,             R,               I
##VAR_TYPE=  INDEPENDENT,   DEPENDENT,       DEPENDENT
##VAR_FORM=  AFFN,          ASDF,            ASDF
##VAR_DIM=   32768,         32768,           32768
##UNITS=     HZ,            ARBITRARY UNITS, ARBITRARY UNITS
##FACTOR=    0.157963299565203, 1,           1
##FIRST=     4132.6476996994, 0,             0
##LAST=      -1043.33573715361, 0,           0
##MIN=       -1043.33573715361, -726857,     0
##MAX=       4132.6476996994, 311842533,     0
$$ Real data points
##PAGE= N=1
##DATA TABLE= (X++(R..R)), XYDATA
$$ [...]
28538 -9363 40746 95084 87973 127853 144430 176079 369196 325679 124924 84668 -9858 14205
28526 14205 122645 204603 159568 93825 21766 84913 165263 69920 46041 123477 116624 102659
28514 102659 136292 39672 53390 165170 -99123 -284378 -420769 -351577 -203155 -57629
28504 -57629 79163 171757 128512 20417 -126758 -209717 -203769 -175804 -124034 -126260 -12111
28493 -12111 111636 126098 -147438 -370342 -394436 -122636 14810 -89169 -17241 -133101
28483 -133101 -214033 -118634 48343 169818 188147 169806 24886 -267989 -215694 -113827
28473 -113827 -205643 -17536 152737 131735 99658 90519 48081 99693 -45744 -10417 56914
28462 56914 171339 409098 243330 -68260 -144185 -210087 -360823 -233629 -167037 -146787
28452 -146787 1387 57554 89287 94435 234271 233781 167017 233065 176441 -116284 -233590
28441 -233590 -268060 -122809 -117625 -66148 8892 61683 12277 -57750 -106858 26131 -47251
28430 -47251 -17311 -125133 -186256 -249260 -78448 -30394 -120491 -137167 -55816 -182919 -351911
28419 -351911 -389512 -234706 -34299 6956 -21391 -14769 -152339 -108555 -30029 -47378 -99637
28408 -99637 -84149 42979 88983 54237 100956 132712 99750 255480 415641 333713 158946
28397 158946 67344 120769 105960 101569 158533 58893 42202 79137 162335 -32977 -168144
28386 -168144 34182 220277 141850 -10182 -93659 393 130979 168671 127029 20367
28376 20367 -77039 -50132 -77668 -100920 -12145 43024 -90550 -148403 -17247 -43193 -141327
28365 -141327 -82996 58596 189567 322011 256742 115423 -36654 -236910 -105216 78840
28355 78840 168976 65636 45427 69731 43085 83602 59848 239382 246560 108328 90932
28344 90932 89597 77444 151791 -104036 -136075 -95093 -212748 -330995 -186398 -28098 48987
28333 48987 116495 202250 295070 446447 509245 356487 158513 64104 213256 154907 2443
28322 2443 -212935 -172071 -169658 -261445 -114679 79980 155480 66234 6103 100327 120492
28311 120492 160867 147607 256037 402001 174212 6899 -5992 22297 25629 90834 -22503
28300 -22503 -169631 -278176 -258112 9393 300453 512869 420756 289368 289271 349198 218447
28289 218447 32588 48651 128043 34660 -118532 -163334 -312870 -408569 -422980 -359663 -174228
28278 -174228 -184894 -206167 -173326 -235124 -229316 -288166 -280894 -332111 -281192 -135548 -45115 2008
28266 2008 55910 133723 184702 479503 477131 68117 -86143 -60327 28431 -26169 -246858
28255 -246858 -226866 84362 361841 276986 236684 231489 114271 20294 131886 193246 56025
28244 56025 14319 -81072 -15203 2291 59402 38516 122822 95950 -27873 -53215 -47441 17926
28232 17926 -87030 -63826 -15946 132894 145280 266856 210274 180334 128459 74900 46269
28221 46269 44040 94999 137269 113431 34677 270217 387163 378241 245497 108482 -9024
28210 -9024 -117190 -132511 -7861 -12693 -136319 -97643 47608 208755 237687 250075 140307
28199 140307 135627 148619 245444 238762 355733 189567 -113163 -106801 71913 210876 117386
28188 117386 -3963 -27187 8164 -118780 11504 15186 32474 87986 -59810 4004 11910
28177 11910 124930 125505 100340 62777 -54833 -63789 -21164 -76898 -77207 27215 80582 62607
28165 62607 -104096 47216 -86920 -53950 16773 -58889 -242435 -211123 -96549 -129536 -202604
28154 -202604 -201732 -82550 -122131 -54625 118618 340681 374510 365506 311720 312042 185747 138406
28142 138406 16756 -34166 -170855 -261164 -182750 -105413 -45186 -38043 -143880 -101406 -81296
28131 -81296 -116675 -135173 -209224 -92103 -67193 67827 109492 -44723 -247928 -399825 -413410
28120 -413410 -294601 -138583 -37267 102275 107159 23069 -20488 34725 100354 190530 45089
28109 45089 -30072 -87844 -191714 -145042 -50951 56991 147144 65024 -42029 -144160 -1359
28098 -1359 155862 -25999 -170177 -139901 51389 265424 125197 -6794 -47217 -204646
28088 -204646 -229356 -141707 25890 20700 -164545 -241417 -78759 213378 276481 194202 101206
28077 101206 89603 232000 139940 19195 8083 -53925 -27914 147100 192227 177552 177349
28066 177349 118683 62102 62987 89695 117340 -52254 -291059 -188640 -119593 -151741 64384
28055 64384 7805 -100075 -147832 -53771 -140820 -105601 -29547 65520 -49749 25941 62136
28044 62136 84265 154574 165200 -67668 -96210 28510 -198927 -117824 -49139 23172 -22927
28033 -22927 -24655 123217 83785 -16984 -87381 -70659 177772 323217 172147 -20434 -22542
28022 -22542 94176 175356 155509 235079 216384 282402 174694 -12117 -120044 -93752 -25424
28011 -25424 22079 24547 -35051 -168305 -43577 166532 220524 257864 130003 98127 152007
28000 152007 78770 47496 195472 52339 -87027 -133796 -215817 -155684 -152351 -95074 -145795
27989 -145795 -148073 -14765 86605 72162 63765 -75329 -23741 -278760 -355614 -230451 -172066
27978 -172066 -169160 -293754 -344792 -111174 155622 264054 303673 364183 235188 148294 166640
27967 166640 185503 172047 9156 87160 298855 238466 46989 -4800 105695 241439
27957 241439 260199 122809 4740 -43538 74304 198712 198795 31964 19274 130332 31235
27946 31235 44517 -15731 -209046 -379545 -376769 -303610 -133825 -109444 -41376 33452 161891
27935 161891 110331 78251 26821 250511 140004 84538 161059 102178 53631 46274 -20124
27924 -20124 8685 58136 236982 163056 204096 235806 199993 251601 348820 19907 -114936
27913 -114936 -527 16571 103057 107697 187656 300687 42273 -194585 -202340 -125288 -50295
27902 -50295 27485 127 -47466 5581 9002 126126 291375 194138 -65993 -110256 2176
27891 2176 137325 233563 114421 190258 146403 83744 163714 204430 237881 82882 -35647
27880 -35647 -75411 -11056 -8827 -174203 -232025 -275616 -262211 -367084 -307951 -212780 -362165
27869 -362165 -240011 -179665 -240097 -140171 -50401 48300 45005 -126035 -287094 -93202 -24382
27858 -24382 19427 -4357 -63470 -92602 -196108 -227803 -103675 -79720 -111064 -139464 -212994
27847 -212994 -144731 -91679 -96493 40457 262638 327088 488859 441829 262083 171355 35783
27836 35783 48170 50273 87536 -5839 -44766 -61895 9847 109734 17020 -109576 -74616 -103454
27824 -103454 -286466 -380104 -225893 -162385 -208326 -161200 -69242 54958 41463 83869 237081
27813 237081 171704 179433 92472 28373 326003 388786 185825 32925 -83528 -187420 -216099
27802 -216099 -82085 -81687 -169643 -261348 -23903 239282 306668 216170 36762 84721 -29617
27791 -29617 47841 -64461 -147781 -217382 -80057 99634 269321 157839 192606 222428 115218
27780 115218 174322 144181 34288 -3415 -212444 -206098 -141763 -165822 -119091 -216084 -233419
27769 -233419 -142094 -101322 -235941 -285506 -162027 36276 176874 174384 246535 181712 19098
27758 19098 -83986 -65642 4925 -76638 -212395 -163795 -106537 -128753 -195200 -254740 -246498
27747 -246498 -181397 -226089 -114351 6627 54533 -12377 -43411 45850 70741 -52604 -12057
27736 -12057 133581 129869 170200 305813 138300 -43125 -130980 -126987 -72852 -89853 -60861
27725 -60861 92810 -34145 -31902 60413 77449 195855 307132 229794 84432 7337 134329
27714 134329 137077 188023 253682 266533 84064 76592 12716 -80601 -72205 -152040 -220703 -356965
27702 -356965 -357155 -245248 -13301 145920 210843 326442 341409 225541 10342 2048 89698
27691 89698 137907 129656 -59809 -39649 46490 -112419 -130045 115630 111013 -1010 -225012
27680 -225012 -19319 196898 185024 85104 79456 -16790 -272237 -289619 -188104 43024 169082
27669 169082 249306 142937 116022 98055 -52370 -71987 -26186 103856 211897 117088 -156772
27658 -156772 -278813 -160502 -9934 22250 12341 -58747 -135586 -78327 -58995 -10393 -77049
27647 -77049 -89510 29614 34779 -46193 -92765 111486 105804 141256 -23772 23916 137259
27636 137259 171336 230876 324916 -35469 -67172 -36885 -128742 -188078 -249426 -158563 -60084
27625 -60084 25674 189950 128341 -112821 -119053 -96646 49493 8763 -118664 -78952 -98423
27614 -98423 -235676 -188570 -75790 -79969 -187857 -36580 117276 124281 67929 191020 371679
27603 371679 323385 170323 81182 -128370 -12374 36857 109276 306775 326037 155619
27593 155619 102284 160496 -1301 -115720 88320 225081 272734 218144 189193 -2161
27583 -2161 117693 87454 -60105 -187924 -42971 -94074 34920 -62345 -21783 -114895 -91370
27572 -91370 -76517 -23925 -54182 -27678 33182 145305 -21340 -211913 -180419 -187813 -128088
27561 -128088 -95147 -128613 -16901 54045 84004 34294 54332 27511 -26258 996 82445
27550 82445 127048 118417 2228 109923 116458 62253 -13506 32810 -78175 -135971 -255852
27539 -255852 -388445 -340552 -287644 -231794 -36375 -169535 -423808 -417004 -252379 11686
27529 11686 -55311 -157259 -202074 -201933 -51807 110579 78822 -7197 35595 -9683 166923
27518 166923 181184 187536 132119 26227 -59535 -104354 -29788 95513 164633 106361 -28304
27507 -28304 -249336 -437598 -471725 -300765 -234642 -353474 -371407 -300894 -251771 -126189 -244759
27496 -244759 -500297 -412806 -244768 -360513 -497202 -311287 -132759 -106997 -35734 85964
27486 85964 55014 155147 252787 197145 252347 157719 157017 30694 -45638 -30820 -14469 202004
27474 202004 170204 88171 69609 26205 90851 45451 236071 194648 152457 148703 115157
27463 115157 177337 232599 21291 -71166 35701 151265 36148 -80497 -178370 -284921
27453 -284921 -153449 -64127 -217914 -337800 -151251 -18338 45478 76075 131575 145707
27443 145707 19644 -77636 -66963 -13771 70171 -34468 -75276 78573 127143 70968 57465
27432 57465 88155 236754 149061 126404 161107 -96238 -276030 -344564 -172035 -68697 -71541
27421 -71541 -14369 44121 16968 175861 37679 -88545 -56830 36256 -57690 123279 349223
27410 349223 495050 398771 158516 -87061 -205170 -235763 -232432 -205121 -298054 -239333 -264989
27399 -264989 -214080 -5701 91900 176932 211439 212808 197656 85991 216422 136725 -74560
27388 -74560 -221645 -129724 56318 39603 2781 -151937 -187020 -108479 122550 247599 226708
27377 226708 283996 249770 135457 164291 274985 308550 167447 -28417 -116923 -139397 -42102
27366 -42102 238472 143443 -4385 103263 96697 10079 14525 -23632 -121571 -71004 -189889
27355 -189889 -198406 -94002 -101957 78379 136558 188131 351556 392668 401238 253975 55818
27344 55818 -37650 -20626 -43786 -107036 -158050 33881 -73998 -61331 -35932 -45232 -19352
27333 -19352 -66203 46562 -20238 114039 189820 268678 222792 -10825 75018 121413 127698
27322 127698 122065 209386 154815 143061 314225 284350 157071 186096 268969 130854 100011
27311 100011 251111 404720 420874 215243 113529 204447 105262 8451 -63487 -71675 -76784
27300 -76784 -133050 -5275 -15488 -142461 -208570 -67172 -108025 -139525 -147471 -87210 -115457
27289 -115457 -199823 -221941 -112608 -99157 4606 -153731 -214311 -118153 -182042 -66834 26542
27278 26542 121357 156075 177302 79012 -75443 -271673 -438723 -511355 -293752 -156782 -183823
27267 -183823 -172250 -269959 -248331 -199223 -77421 -62780 628 66221 -53114 -153870 -274764
27256 -274764 -298769 -134928 -204228 -88889 -19902 -110379 -70765 -16261 42554 2863 -115306
27245 -115306 -88203 164845 193455 16838 26668 24860 607 36177 -123991 -26528 -35114
27234 -35114 -54836 -141910 -112143 98293 14586 -30555 -83117 -191 174984 262985 347525
27223 347525 274538 188410 181527 153361 81173 69053 311470 418879 324016 217951 225628
27212 225628 202671 33533 60274 134499 99924 -3829 25575 987 92614 138378 -157653
27201 -157653 -160627 -164634 -213909 -228818 -215601 -64403 -162924 -32204 -75646 -333793 -398695
27190 -398695 -420619 -324094 -102407 70560 34469 129239 290968 370724 151226 -17611
27180 -17611 -84974 -117448 -149873 -123944 -162660 -174742 -172141 -206768 -57191 152427 177448
27169 177448 61790 -126678 -158723 -165583 -127531 -99735 -308080 -411242 -316027 -291851 -50409
27158 -50409 203107 167336 -43798 25078 -59019 -126793 -172643 -143893 -158601 -90749 -100866
27147 -100866 -130309 -36588 168242 326501 163960 18165 -39360 39524 148947 95356
27137 95356 70231 129360 118969 42413 -169407 -58705 -79165 130387 216837 228241 174014
27126 174014 98463 40912 170127 153970 48888 -109925 -70015 -64130 16617 69738 -48373
27115 -48373 40559 161009 90195 105663 113475 101191 56651 43110 46581 13176 22418 49985
27103 49985 57475 184393 230438 160419 -49174 -203508 -393261 -225959 16148 31183 110253
27092 110253 215038 235890 62512 -74053 -175308 -141721 10121 138408 263244 131152
27082 131152 88995 100265 119475 92088 -4491 104942 265103 207958 222868 165119 74898
27071 74898 -126467 -234694 -118745 -3097 -88681 -276569 -233808 -162163 -187964 -235186 -304437
27060 -304437 -437160 -387917 -240083 -184483 -32706 8975 -165227 -305896 -260878 -265346 -296887
27049 -296887 -267834 -209469 -156691 -31024 43831 46984 350747 326811 73932 -42077 92110
27038 92110 266224 202075 139010 231426 292369 326929 310252 216041 64224 57395 -75721
27027 -75721 -189341 12902 178370 51189 38125 146294 277663 118113 -13497 124397
27017 124397 162661 -45328 14410 160476 228241 279431 314436 393058 271735 326920 230313
27006 230313 99263 43027 29060 -5948 -38323 -171309 -31679 73829 123324 167605 78761
26995 78761 -21766 54735 168577 231279 195493 174420 126119 4017 -100521 -130481 -219438
26984 -219438 -242446 -57944 -234395 -270134 -74018 46758 33113 163551 256349 224214
26974 224214 -11605 -213061 -226289 -313086 -40908 -22301 42341 -7873 35139 -1607 -9560
26963 -9560 33111 53238 137950 183026 -12236 -119754 2616 194525 49147 -165013 -266109
26952 -266109 -339128 -269246 -55646 20667 239588 258757 32769 -38470 -122351 -233179 -65610
26941 -65610 -98422 26431 33803 -10766 -139249 -181625 -216775 -206481 -103069 31315 19425
26930 19425 -49348 -109830 -336378 -260311 -157675 -99213 2707 -18115 -156506 -207800 -23328
26919 -23328 29436 102110 188343 75232 135655 168417 26336 49149 79237 3988 -156268
26908 -156268 -213893 -210639 -172290 -155820 -234578 -207680 -269144 -110559 -29084 -122703 -198713
26897 -198713 -8453 102824 -25050 -69787 101390 34893 134043 134778 -122777 -277767 -296296
26886 -296296 -85926 92613 -23707 -184273 -87135 -58394 -101992 -117857 -97143 34098
26876 34098 202197 -6865 -166245 -152570 -98556 -126673 -21149 32980 -115556 -184028 -188893
26865 -188893 -210657 3238 87564 28821 73835 -54885 -240210 -52880 -103737 -173216 -121948
26854 -121948 -191316 -293911 -299532 -230983 -177596 -116122 -41373 53966 194493 154095 20843
26843 20843 71150 19012 -139885 -80006 -111306 -190404 -125711 -58269 -3570 -102775 -156024
26832 -156024 -12853 -63692 -171188 -132349 34001 204258 213116 332409 140308 51322
26822 51322 27885 1827 82785 185192 246530 174295 189895 -35108 -143022 -112578 -28320
26811 -28320 -118165 -120668 -123046 -51273 -14722 62077 139349 15472 -154878 -123635 -32949 -48888
26799 -48888 -230273 -261577 -203174 -239544 -275556 -277944 -96962 -7430 -139598 -133666 -195062
26788 -195062 -126075 -99513 -143979 -153071 109788 153570 201924 374325 404348 323488 168230
26777 168230 167243 99927 106276 21903 -26080 -158705 -138979 -43205 14382 11223 64173 94501
26765 94501 -17535 191206 304192 243084 61095 -150825 -121525 106431 88844 46898
26755 46898 -3948 12509 -116109 -264918 -125967 63543 279121 313356 290480 154349
26745 154349 86828 318079 329788 127250 -66191 -30000 191817 117379 -28138 1446
26735 1446 -46058 13647 133616 192390 180492 155408 149174 199877 42938 -9364 96662
26724 96662 252062 237699 167885 58431 57677 95826 -116626 -100837 68422 303700 543529
26713 543529 434308 192661 55935 47530 14138 -52048 -148234 -190928 -234633 -221432 -111546
26702 -111546 -40112 -51667 -21918 -99849 -184644 -215575 -76950 -46011 -48482 72871 190916
26691 190916 180286 89301 -56020 -196040 -77857 183701 126181 2247 -133225 -76120
26681 -76120 -63944 -7934 -115621 -58093 125647 286238 229131 63048 1911 122513 145644
26670 145644 -14946 -98901 -135883 -64649 75744 159487 159087 53037 -10442 -236434 -158203
26659 -158203 10348 64366 71566 -87293 -186545 -122938 -172742 -7497 86996 -68381 -54603
26648 -54603 -65030 33133 150310 71928 -49436 -214484 -169442 -265577 5987 126929 79917
26637 79917 51231 197052 240926 -43458 -138185 -3634 22072 -50931 -22820 6308 -89333
26626 -89333 -131237 -5592 162950 89584 2839 1529 78353 686 -212081 -252533 -165542
26615 -165542 -123749 -162052 -138411 -91923 144194 161311 27692 -40288 26569 75849 -31723
26604 -31723 -154471 -277655 -212359 -167224 -147415 -219343 -251348 -155003 -2752 75004 208514
26593 208514 232206 189588 126994 215672 209074 73603 137084 -36960 -337406 -355539 -29208
26582 -29208 297409 373315 202175 46075 -71978 -88221 -110102 -250414 -225717 -113430
26572 -113430 -69801 -60732 4676 68032 7169 -455 36922 -152313 -286043 -186711 -239234
26561 -239234 -245968 -252083 -86039 -22408 -305212 -328340 -155706 -92888 -130121 -140082 -139001 44751
26549 44751 101346 -6065 9141 -32374 -40174 -130983 -235715 -120859 -54759 -46165 -155734
26538 -155734 -180639 -172003 -212888 -210507 -181296 -78795 -78616 49172 242990 228498 185047 289395
26526 289395 45259 -169721 -76610 132162 -66465 -90779 -103020 -123986 -232358 61358
26516 61358 236366 315549 337462 182440 190653 276586 221648 96694 75825 146365 3330
26505 3330 -38423 30550 68246 -40542 -104377 -209717 -145228 -141851 -191314 -127444 -167410 -203403
26493 -203403 -242689 -340004 -305820 -180239 -62664 35425 187642 305329 183608 -45595
26483 -45595 -90601 -37073 -5338 -97161 -29842 40429 -201163 -127615 -10651 277456 512417
26472 512417 555709 463587 313018 175299 130544 186782 295599 310672 286253 332480 469911
26461 469911 315796 185829 107315 125362 80855 22190 319274 242469 229222 250096 62119
26450 62119 87097 97537 38055 57055 156540 195605 -61796 -78053 -90533 -175641 -85280
26439 -85280 -169226 -276506 -277277 -142065 62330 249647 202282 40542 -20458 -9797 80289
26428 80289 28493 110438 199820 119365 -62842 7019 162200 164682 59674 70990 74717
26417 74717 157443 124810 -145747 -187771 -48386 41534 187869 255198 298032 170082 158778
26406 158778 99824 29164 83929 172589 83959 48598 19015 21148 -157768 -322389 -425166
26395 -425166 -329032 -130576 -127954 -66312 -86217 -156631 -101398 -55806 -87346 -136028 -351688
26384 -351688 -239499 53387 44887 56789 -105328 -209366 -320801 -132612 21866 5438
26374 5438 -111529 -35001 98109 68561 -55900 -210800 -217282 -179887 -61965 69229 85705
26363 85705 -61739 -116132 -46624 102413 133584 97697 -27006 -167291 -61545 -192195
26353 -192195 -345780 -176099 -136249 -189256 -34350 -63993 -34458 -10475 -185710 -113681 -4990
26342 -4990 -114698 -131791 -185434 -72478 21115 -50833 -216509 -207831 -179011 -213723 -223129 -177450
26330 -177450 -124179 121197 158018 286473 205279 4565 -33692 41361 -185534 -147340 46107
26319 46107 -9050 -166842 -198350 -75044 -62212 -35756 138405 144127 184583 165512 159917
26308 159917 128061 74856 172192 211457 62073 145000 229191 165492 183309 244364 220509
26297 220509 294986 438515 460462 161593 110627 -35809 -33760 -75779 -177475 -265464 -183828
26286 -183828 -186204 -114662 -98572 -13566 164211 200403 131513 1243 -163263 -207133 -137925
26275 -137925 -82374 -44256 -47491 -2750 -158055 -75415 1485 24606 -22164 -201540 -41629
26264 -41629 -27595 30941 70594 -46363 -79879 -103685 -27360 -92055 -64378 -125684 -199741
26253 -199741 -194471 -84297 -171484 -241630 -149753 -72605 7639 108246 194957 217786 214644
26242 214644 83483 -73403 -120592 14421 51630 -143853 -159535 -114986 -126918 -112459 -104683
26231 -104683 36385 202254 276268 154669 279748 231695 283038 167481 -86698 -130159
26221 -130159 -51561 -165923 -195863 -49501 22462 145550 231407 215031 209186 159479 86338
26210 86338 -149707 -207294 -169234 -156817 -265433 -150808 -143067 -21614 17783 54492 184576
26199 184576 137874 87340 196814 353013 350131 321420 188656 246329 234231 13033 -70864
26188 -70864 -82639 -62995 -62359 -65080 -76330 -91118 -20811 -69733 -17215 -139045 -155588 -160172
26176 -160172 -157192 -124362 -148123 -129677 16737 -73229 -248948 -144857 -272773 -342122 -358668
26165 -358668 -150511 -62663 -129179 -95163 -108718 59835 28520 129408 183182 159224 186307
26154 186307 64263 46379 -2588 21770 853 22356 79319 -120518 -80304 -15730 -23282
26143 -23282 -61386 -124944 -2205 147994 205088 275126 145619 26408 105177 159028 76961
26132 76961 -84395 -308755 -358735 -161608 -19036 45990 32362 -98876 -81449 21488
26122 21488 132346 281769 154599 42015 172514 210129 35644 -117377 -110392 -142869
26112 -142869 -156416 -141124 -120877 20256 213960 109407 7127 119546 212899 242816
26102 242816 121262 -1532 -53988 -28556 -62395 98277 141991 63581 86170 98691 46467
26091 46467 -71641 -36513 22745 -104439 -216430 -215977 -87163 -29751 7306 -137255 -206607
26080 -206607 -274565 -127787 20894 123594 194523 157028 47505 -77288 -101988 -51421
26070 -51421 -101171 20078 143497 31516 68752 -157001 -192061 36843 130767 48488 9164
26059 9164 -52277 -86963 -94406 -70716 30352 -48856 148739 301902 165011 35787 58738
26048 58738 153183 19776 73375 162661 194969 262380 244536 50316 59467 65247 166942
26037 166942 163864 145616 122412 24800 -41824 -39710 -108661 -99923 69324 312736 442962
26026 442962 385940 299768 243800 261537 179222 64140 -87823 -125520 -145320 -44840 138072
26015 138072 304663 148836 39410 59897 204167 172163 2441 -25330 71418 256392
26005 256392 184085 119878 18689 -150375 -292721 7992 205383 196059 225233 209859 -16049
25994 -16049 -145101 -176608 -83402 54158 183504 163136 50344 -20629 -104490 -178279 12918
25983 12918 74208 -47824 -164417 -50468 -26879 -78723 -31414 -36247 160069 185209 -70295
25972 -70295 -278612 -301612 -237001 -256486 -272294 -269887 -262147 -124562 -170094 -279213 -201603
25961 -201603 -28833 -86728 -99842 71497 183271 -20801 -53622 15242 42644 -98279
25951 -98279 -116946 -101921 -88588 -28032 66467 39381 -27669 60621 112843 190877 104138 -57582
25939 -57582 78777 40610 29739 152409 53242 43139 184924 230243 147447 80869 -3756
25928 -3756 68118 332449 246888 186419 249209 73455 -80348 -219646 -216653 -274469 -379060
25917 -379060 -70302 152148 118391 93911 18675 -103387 -181331 -73943 109200 27992
25907 27992 -116103 -241874 -268505 -90657 43206 22232 -61671 -159441 -163073 -299718 -363678
25896 -363678 -377310 -352929 -188896 -36119 -43326 71382 120017 103465 62042 -83781 -75689
25885 -75689 -84291 -257962 -165674 22120 -144592 -336822 -85845 3185 -51754 37726 -32890
25874 -32890 99044 202867 109262 78998 129122 181552 100596 20716 71630 153386 159943
25863 159943 229622 241401 73800 49961 -53715 21740 -21566 81340 232054 216050 91112
25852 91112 75396 173344 143485 166617 222483 118425 -127073 -378248 -390939 -159898 -169370
25841 -169370 -99782 -49509 -210637 -278979 -120328 -38898 80612 330647 244135 15830
25831 15830 54036 64622 -71805 14729 12154 -124309 -140058 -95447 -82742 -119186 -63097
25820 -63097 -231726 -251406 -95272 88361 244164 114257 148093 82304 -70481 -118095
25810 -118095 -85179 143618 -34699 -132087 -132074 -90880 50479 129063 110038 50740 16706
25799 16706 -116797 -23360 -52819 -128875 -17713 63959 83724 9419 14565 70166 94156
25788 94156 89277 131995 50158 8092 -43511 -78915 -68718 41712 -210273 -349003 -150089
25777 -150089 -232754 -304803 -301459 -182288 71155 161049 73674 -74284 19213 108535 208676
25766 208676 394372 321842 347957 497609 377209 135921 3150 -68043 -198123 -98449
25756 -98449 -85390 -149158 -10776 284384 375296 218362 10311 -177896 -234594 -175664 15139
25745 15139 21351 -28509 -251450 -321385 -297182 -244597 -60752 -82233 -84074 2067 165348
25734 165348 201126 -11662 -80021 189429 318616 288054 115082 -19794 -113945 -162491
25724 -162491 24278 88107 145863 79808 -27704 133574 374785 235736 167434 134797
25714 134797 -51880 -56744 -149687 -165530 -88235 -50297 -14695 29566 110807 256241 280198
25703 280198 177200 92848 -63168 -25496 94349 -19686 -243348 -244776 -100984 154419
25693 154419 123622 -11199 -499 -34759 -247474 -304717 -137038 -5580 91834 244190
25683 244190 134881 -26756 -177870 -171258 -120337 8540 -118112 23228 126592 13778
25673 13778 96453 135873 -79872 -178619 -44099 -121155 -12434 384 -60432 -104163 -21650
25662 -21650 -160368 -55326 44966 -65524 -146177 -159298 -169549 -102226 81120 205555
25652 205555 -148178 -207470 -89577 -32705 -55373 -178458 -220237 -144188 -52235 74080 304526
25641 304526 450195 264318 40077 132662 136501 61672 15369 -68323 48919 127707 32183
25630 32183 -99051 -110938 -197738 -316427 -162603 -92956 -202385 -200528 -139444 -198964 -294714
25619 -294714 -268046 -147469 -123409 6717 -61996 -233370 -358746 -221607 -27584 -117042
25609 -117042 -81699 253622 281418 249628 282582 120805 43644 35998 -63453 -89847 2437
25598 2437 111161 208968 177729 102495 -89797 -150836 -69208 173754 404281 376157 100533
25587 100533 -119117 -98993 -59151 -89090 -267587 -305129 -234612 -261204 -192590 -137729 -56324
25576 -56324 62937 -43129 -124669 -162078 -80390 -121631 -196949 -19890 245822 140582 145511
25565 145511 230939 125889 -46621 -108175 -58822 -159063 -122900 59626 114741 11438
25555 11438 -85197 -189878 -229938 -254285 -42754 -6252 -98577 15020 26034 40515 120051
25544 120051 59727 158636 168572 87671 64010 -54362 -34679 114853 69964 -187763 -275948
25533 -275948 -226219 -160167 -241413 -123536 3559 -67351 -182911 -148714 -163724 -191655 -130597
25522 -130597 -126867 -10207 155408 182820 -169447 -230571 -195341 -153292 -152697 -75478 -45124
25511 -45124 -116324 -103363 -35231 162260 343206 147041 -40673 -6029 -9003 -15440 44244
25500 44244 -245360 -409018 -334581 -231997 -151386 -61524 10667 -40873 21319 183175 222628
25489 222628 152592 204412 281536 301288 174292 106783 28698 -61991 -29926 -15353 -163597
25478 -163597 -59984 105164 78985 -64407 -112913 -93167 -240537 -223762 -147771 -257505
25468 -257505 -191214 -120205 12494 40340 -57551 10188 102134 243013 270888 128275 65790
25457 65790 49296 36415 31059 195951 221287 149901 41639 -96712 -66141 -20742 -139872
25446 -139872 -101943 -114065 -80967 -115277 -46250 52511 169525 57746 -81949 -93004 -184019
25435 -184019 -137318 38144 19609 75996 160492 265149 130454 29293 114685 159794 158250
25424 158250 12915 -60643 -14872 84853 250743 236744 121901 12605 -7614 44550 39062
25413 39062 -70630 -210724 -107217 81711 1768 -17397 30825 82090 147601 230610 138578
25402 138578 83757 123527 97207 -5444 15657 -131935 -336355 -282403 -318564 -171314 143400
25391 143400 32011 -125025 48613 62587 -30134 -201800 -182467 37144 36316 -139175 -240729
25380 -240729 -210870 -122324 -7165 34342 74519 94782 -32359 -170876 -132696 100918 210940
25369 210940 248212 42773 -114653 73119 195829 68489 178146 204393 215712 137814
25359 137814 25050 69376 -4742 -74382 26311 23275 -154163 -110529 -99523 -97299 53403
25348 53403 110931 56368 -1643 -102446 -81109 -100244 -325166 -222969 -210280 -32649 49006
25337 49006 -114657 19169 -6101 2754 -3855 93612 -11041 -184581 -213946 43785 119774
25326 119774 61600 30061 -13034 24235 -197758 -169988 -68768 -41071 12111 -9209 -145576
25315 -145576 -132518 -101604 132922 43830 91580 80814 64007 53440 -74458 -50048 -106926
25304 -106926 -135794 -137295 -208136 -220881 32647 122826 -46970 -21384 -78006 -169610 28455
25293 28455 65609 62142 -35075 -82437 -37406 162733 192684 236309 169649 114820 12513
25282 12513 -141811 -131421 -2749 141264 220147 243054 141026 114234 43857 -170741 -167754
25271 -167754 -32295 -54540 47185 250075 223176 91114 114496 207231 192654 462161
25261 462161 604474 521029 369906 271205 9484 -140435 -84175 -38420 102481 225726
25251 225726 253536 261971 200378 148051 -9330 -146548 -198306 -182180 -21149 76386 17875
25240 17875 -70802 -250240 -241407 -161250 -59328 -3255 71978 32960 -63871 -3038 -24941
25229 -24941 -4407 96763 -45125 -211648 -152678 115828 -11358 -133032 -91382 45366
25219 45366 -115781 -262317 -247686 -75904 84158 72323 -142642 -160532 -218629 -160104 42537
25208 42537 100517 196050 230532 194398 183144 188050 70993 -46420 -15894 137029 8410
25197 8410 -122106 17245 27264 -65112 -70350 -75440 18302 -27768 -18857 21109 144020 303112
25185 303112 246646 146739 135532 168071 95421 -21845 -81251 -34979 -50120 -111502 -342697
25174 -342697 -295042 -272713 -302383 -215583 -151767 -126330 -157683 -175665 -61427 132635 63717
25163 63717 -125627 -265787 -160833 36812 214571 226293 199982 136069 23915 176357
25153 176357 277318 162571 106729 -14858 -47744 -169188 -91006 -12217 -87043 6660 157377
25142 157377 336659 268601 121676 -22363 144748 92953 66341 68575 13191 15669 -7822
25131 -7822 -20596 23529 -7763 -62469 31339 170377 193274 242880 106493 43922 115444
25120 115444 190914 43758 80081 72998 -309512 -182710 -44117 -673 -123287 -265537
25110 -265537 -267222 -404683 -307931 -132234 29760 39943 -103241 -55906 25468 72295 58230
25099 58230 -114577 -18755 207567 163468 62695 172749 171706 101625 46713 -96982 -76474
25088 -76474 153390 273454 325835 408855 354163 236894 99794 -6383 85595 93179 41282
25077 41282 75497 143060 162886 189262 253214 -44635 -207757 -21813 160246 279391 171738
25066 171738 11180 160517 108362 104546 179299 160888 131226 305230 198080 -99254 -201475
25055 -201475 -268281 -206292 -145727 -83486 -6846 -43607 -154938 -177848 -69012 53908 236431
25044 236431 85411 22809 -16816 74532 180231 62925 -45256 -139506 -171732 -38045
25034 -38045 9626 -79761 -132882 -53745 78468 87748 -81773 -51957 56928 -834 -22808
25023 -22808 8555 -67164 -84693 -1208 222736 301331 361542 362546 223913 220482 73911
25012 73911 -28857 -96836 -107915 -54115 43293 97952 45226 105445 205942 3035 -16735
25001 -16735 95318 3745 -123255 -352395 -334518 -145015 -194581 -144344 -15829 201555
24991 201555 197652 270028 112154 154965 22721 -11869 -24919 -2779 75452 118038 97412
24980 97412 -107075 -323899 -108300 82345 78104 -126203 -271428 -247227 -236115 -50872
24970 -50872 -52040 -31527 19814 126065 41796 -104754 -331411 -304286 -34462 20545 82321
24959 82321 117733 37655 -100746 -166176 -240746 -31257 67407 -38087 -66778 71603 263274
24948 263274 388400 373568 406784 479034 261219 136698 95226 80221 138194 -46623 -219116
24937 -219116 -63425 -258986 -353030 -253098 -49351 130230 132374 38822 -105760 -134123 9164
24926 9164 -38669 -32885 -497 181108 182693 -12893 102696 87111 -16280 98742 57083
24915 57083 -100363 -249640 -144329 48137 -133050 -445776 -377083 -266585 -245525 -202562
24905 -202562 -137366 -157092 -17256 -39262 -74376 77408 154952 -11755 124973 212165 185578
24894 185578 35583 -84437 -36618 -177248 -179961 -96170 -3611 -43263 -67789 -45534 -171812
24883 -171812 -93032 -106760 -110719 -118591 115372 230428 203723 148657 -78114 -181866 -113476
24872 -113476 62960 196689 233899 360031 318212 -9185 34539 194672 116047 173672
24862 173672 140038 65047 -258848 -306490 -260481 -306360 -353036 -358266 -156237 151996 186955
24851 186955 -21236 119098 249509 171540 -1290 -181744 -131183 82227 225778 203341
24841 203341 223234 339876 226880 153958 98779 62477 -22651 -108302 -138266 -38102 44518
24830 44518 135767 124210 119013 130658 29197 -102052 90940 120676 67329 34439 65808
24819 65808 78076 -71915 -181110 -313533 -310365 -249630 -279123 -295994 -326018 -317674 -216259
24808 -216259 -85091 -117861 -137701 -73346 130531 365566 352139 338096 314538 78169 28858
24797 28858 91532 9500 -22958 56790 234739 185594 132033 102454 17747 -47636 -54682 -86512
24785 -86512 -288295 -129038 -14657 183748 117488 -34167 -148740 -114816 100374 140850
24775 140850 36298 88528 -73190 -218465 -228243 -241769 -75748 60232 204885 143921
24765 143921 245656 260100 27510 -74444 -33065 26637 -4548 43461 70886 -23877 -29498
24754 -29498 -53232 -76969 -174201 -344008 -194264 -33611 64938 24385 -72606 -19458 -50016
24743 -50016 -90769 -75063 27575 29042 -160405 -36663 -177449 -316302 -152663 -26362
24733 -26362 -111361 -147329 -78840 157633 211780 214558 -10225 -96692 34559 -23644 11182
24722 11182 16636 -14870 -131609 -72612 -6745 -78740 -128668 -127642 -99008 -126391 -168433 19086
24710 19086 97997 58793 -42455 14366 -10861 -49203 -54201 20723 80512 49347 -4008 5129
24698 5129 -48423 7780 7344 -136443 -10424 113719 29472 -97466 30476 93228 67398
24687 67398 54113 -20812 11677 15521 -155949 -267478 -253142 29677 136352 -49771 -172498
24676 -172498 -59084 -15336 -23713 19325 23517 170928 170199 83820 -31765 -9484 -55156 113925
24664 113925 116430 47912 141148 302090 232745 -35776 -102968 -66384 -113939 -161486 -156157
24653 -156157 -75472 -18541 81079 138358 85585 -176562 -399765 -302464 -278623 -339389 -402484
24642 -402484 -386481 -339859 -283362 -135661 -106948 20952 60539 58748 -29649 -71113 -161765
24631 -161765 319 32071 -59266 -93848 -56142 78901 190485 118142 84912 52149 -36173
24620 -36173 -1265 7749 -63339 19923 69859 148562 110903 101509 79484 234943 223831 88728
24608 88728 86582 -4707 -217518 -180629 -90296 -174593 -227060 -144706 -105699 -114010 -255501 -170989
24596 -170989 -6606 160152 190329 108780 32776 117656 346738 368114 250134 212584 213514
24585 213514 151728 -57978 -170738 -129085 -149561 -85978 -120940 -73202 -11928 -27187 -18950
24574 -18950 -48138 128984 -87891 -286766 -224149 -161501 -58866 -45376 -108885 -148110 -66600
24563 -66600 -79229 -143287 -256931 -250367 -188703 -246143 -213287 -195022 -126095 -100959 -60326 -69354
24551 -69354 -164314 -39583 -85227 -77449 -26126 -81647 115578 134734 59899 -87054 -102547
24540 -102547 -106702 -169169 -200620 -5076 139537 112276 160277 47563 29114 -60202 -69429
24529 -69429 -73827 64229 140143 -1340 -66590 -83020 -200181 -50391 58631 24529 89393
24518 89393 49624 56824 -11961 -113081 16411 -75735 -108158 -100883 -232723 -200638 -147243
24507 -147243 19249 -81042 -287481 -90247 106599 101743 21357 -20781 34738 153152
24497 153152 125958 -23312 151027 258667 344983 215416 -58947 -141368 -109906 -34479
24487 -34479 124038 118307 -83254 -71828 -35889 208295 166273 -32248 24130 167038 67761
24476 67761 112146 111348 -40604 -67797 12289 158783 76576 -137418 -223333 -26275 106721
24465 106721 145447 194368 321550 189142 127758 144933 106804 -124609 -283219 -97691
24455 -97691 68438 180291 352780 251868 -39230 -187899 -21491 -154766 -215027 -97645
24445 -97645 -58311 82428 -6614 -110397 68338 191075 128588 29750 -55751 17543 -109000
24434 -109000 -189817 -176484 -145789 244 -575 106251 230259 111346 -181069 -361498 -23321
24423 -23321 124217 63153 -175495 -209504 -88741 -71031 -162134 -213864 -47676 122799 116109
24412 116109 37748 -101380 -203007 -140615 -138749 61451 205990 142460 -45159 -95649 -105871
24401 -105871 -80638 -135551 -199006 -275716 -155456 -115063 -124639 -142803 -171970 -143672 23786
24390 23786 87595 38597 -5528 40407 288376 288113 228029 239066 -49353 -244362 -157063
24379 -157063 74288 186421 95869 99288 -107901 -62815 -101191 -80083 70433 190127 147873
24368 147873 148325 231610 275035 177878 185490 169603 13624 -54401 -56613 -220081 -114303 -29660
24356 -29660 60511 -13778 -86361 75586 88723 -6158 -27646 -8931 42968 -46192 -79964
24345 -79964 -149170 -152396 -54553 -130446 -80700 -173542 -76668 16713 -107048 -183359 -85787 32981
24333 32981 -56076 -43052 1206 -48731 -178632 -285793 -173998 -147184 -210531 -227784 -236014
24322 -236014 -312158 -297858 -198614 -372726 -258439 -223352 -172447 -242468 -166388 -73116 -253248
24311 -253248 -199728 -138630 1249 45152 -144244 -174035 -281036 -206199 66182 77409 -138299
24300 -138299 -118063 -184776 -143521 -135216 -256758 -255973 -17245 25217 -40987 -248465 -287616
24289 -287616 -238375 -193460 -44042 69403 182555 232626 118058 197889 204777 156971 21631
24278 21631 6185 -130910 -193571 -198750 -221718 -156847 53002 1646 -109565 -63222 -172276
24267 -172276 -259056 -197948 76850 261598 241939 25526 -128916 -144401 -71050 108293
24257 108293 65214 60068 94916 -31402 -79165 52404 147322 -53520 -277195 -253932 -220932
24246 -220932 -301644 -256761 -32244 -77198 -90935 -176603 -127809 -136015 -106287 -133807 -142073 -31512
24234 -31512 -111327 -78103 -110872 -150105 -235960 -59006 -28503 -42751 15959 62892 -35519
24223 -35519 -127268 -89278 64884 64756 171680 132460 36262 -60358 71847 -30842 -238453
24212 -238453 -177862 -231097 -338622 -99014 18838 -89912 -56404 69984 -62616 -142186
24202 -142186 -118051 -101980 71976 112959 163066 198484 52291 68527 -24033 -113153 -147275
24191 -147275 -143740 -102453 64531 -60646 -156315 -259502 -319119 -216447 -88017 -128065 -24506
24180 -24506 183652 118692 -37447 -89536 80774 134944 206816 193385 96027 62682 30617
24169 30617 -52178 -43206 -58280 -54684 -139342 -203596 -51538 -109568 -116250 -92056 -187169 -143416
24157 -143416 -135396 -127503 -74238 98185 130061 -111262 -53453 43758 -32882 -162930 -199609
24146 -199609 -26397 122684 266313 230005 44173 32893 94083 -11270 -132201 -52421
24136 -52421 -98303 -327835 -280895 -267505 -295276 -238138 -27995 157622 83309 18122 -25825
24125 -25825 6246 2165 44379 49813 -134790 -253413 -153404 -254599 -289923 -156251 -97860
24114 -97860 -194040 -29016 -47397 60874 126476 165474 261440 50494 -162352 -221098 -103461
24103 -103461 -241647 -84893 -52039 -16435 -32006 -165681 -314406 -127296 203 -147016
24093 -147016 -323736 -347755 -364179 -287584 -235765 -283170 -5578 -17537 57060 123970 125228
24082 125228 25385 68439 100663 78290 34591 118581 87409 -30061 -128603 -122058 -91366
24071 -91366 -8731 143115 285149 320831 240311 148052 -134379 -210701 -186349 -178215 -70550
24060 -70550 -77547 -252110 -82502 112952 56193 -37916 -51547 -180642 -44633 65977 45274
24049 45274 28735 -150271 -143059 -129555 1465 -68620 -135023 -230242 -178126 19782 160473
24038 160473 30110 47023 235650 428693 284030 132576 -4303 -110730 -57415 -26431
24028 -26431 41040 184666 58932 112017 106562 -18318 -65655 38096 59549 107168 197734
24017 197734 150361 51776 7841 -101716 96469 343430 340466 230054 34676 -100255
24007 -100255 -224962 -160911 -80352 -63059 -69556 74373 13049 -125128 -218851 -225086 -194220
23996 -194220 -64061 37551 -67138 -121276 -76025 27102 -167208 -143928 23642 -22252
23986 -22252 -128029 -68050 -98886 -34614 39064 -7551 110885 174957 123919 74731 15336
23975 15336 -38752 -196516 -259421 -343533 -325699 -285315 -114789 64498 -122580 -233108 -96812
23964 -96812 -23535 105009 -52813 -168672 -174827 -202210 -301339 -236870 -132999 -126381 -50863
23953 -50863 -122146 -146846 -78241 -118995 -104323 -45902 58051 -10194 -146328 -237334 -268587
23942 -268587 -263644 -193483 -168960 -44555 41115 -157835 -429638 -387314 -252799 -121142 -83741
23931 -83741 -121314 -125399 -59862 -238316 -193889 6576 9485 84285 140313 14964 -42636
23920 -42636 -25656 -5901 -79387 -262407 -318506 -74906 11425 -119172 -155052 -178125 -68250
23909 -68250 -209545 -351080 -411044 -277841 -177821 -65543 -57399 6318 -9812 102508 102840
23898 102840 127125 119903 146739 111897 155067 18245 -102013 -246533 -277532 -79834 -29353
23887 -29353 -78523 64759 194202 232130 179205 115159 65197 -76517 12315 -32521 41392
23876 41392 202381 126473 130146 148741 16157 38449 128089 215671 29732 -109160 -102056
23865 -102056 -13851 -31542 -168482 -143553 -37024 34658 16946 -213955 -161186 -85935 -81003
23854 -81003 -84784 -183658 -220157 -74014 -74029 -49015 58107 197393 228123 169849 -141276 -270526
23842 -270526 -227431 -36702 54846 -95759 -273412 -352452 -210514 -215490 -280208 -156706 -48661
23831 -48661 117965 138646 3939 -15835 -44419 -100853 -229963 -285132 -175438 -91042 -149700
23820 -149700 -36721 97804 56059 21987 195735 323593 269678 28418 -101790 144908
23810 144908 253595 -856 30878 21640 51261 11380 -113097 -184455 -163192 -49304 -79537
23799 -79537 -121796 -146567 -209955 -182860 -189003 -141636 -152428 -971 111320 32375 -103044
23788 -103044 -205361 -313601 -128921 -29886 136116 240011 273409 197232 82258 109201
23778 109201 -53329 -222705 -164335 -271691 -351971 -306798 -240955 -61052 -36057 -100391 -168253
23767 -168253 32414 104922 105874 52703 99206 153408 14416 -22458 121397 215434 309269
23756 309269 380199 434107 398172 237154 156982 69680 141261 155910 23887 134177 209706
23745 209706 308150 174335 113898 34595 109315 7447 -18908 180962 226549 -34216 -28456
23734 -28456 70765 226446 384684 341554 178129 75323 78669 -2626 -174948 -225658 -97558
23723 -97558 45397 -46824 -21531 -256867 -463191 -380364 -411215 -341690 -396783 -415438 -358125
23712 -358125 -252362 -134209 -72932 63319 16314 18811 -89315 -230347 -332095 -188183
23702 -188183 -11657 161492 173524 220564 348353 338012 72068 -194999 -235654 -198690
23692 -198690 -210192 -342187 -377184 -239725 -105412 -76789 -96381 -212028 -307500 -155810
23682 -155810 114726 216453 260308 101002 11723 94497 35168 3805 140359 239297 215937
23671 215937 214643 141154 -30993 -144625 -221335 -242647 -281081 -134671 -77009 44974 175135
23660 175135 151366 53082 -34795 -130867 -152577 -170975 -109422 -41738 -41285 -2311 124610 221014
23648 221014 125343 226371 157962 60758 189526 214951 174057 341057 381199 161131 44964
23637 44964 50915 -989 142141 288597 251034 129961 110215 -68244 -54140 -35991 -30337
23626 -30337 103956 81325 -16017 50595 360239 369137 250540 209813 213290 310819 277190
23615 277190 84447 -102432 15419 111310 11299 -50201 -29673 -117536 -77198 -68939 -13144
23604 -13144 142311 144238 27748 122740 165630 172453 191494 134009 136900 54921 -2526 -7700
23592 -7700 9609 -72950 -80253 29329 251051 220682 199729 188854 82208 -86692 -335480
23581 -335480 -363574 -268375 -236233 -148280 -81610 -54139 119019 152641 112754 -92289 -177837
23570 -177837 -161742 -91106 -50117 -94041 -219596 -93252 -24149 66671 -80532 -118368 40631
23559 40631 122644 108428 -60151 -95171 26587 86170 12008 57791 226787 197313 218146
23548 218146 306294 141285 146632 135066 162516 303038 173637 93007 -49491 -41053 45989
23537 45989 112157 39638 -117513 -146197 -177498 -49931 127825 120790 40189 -180933 -165204
23526 -165204 -71628 -95331 -166569 -94471 62517 56510 -190036 -289588 -181398 -141505 -117333
23515 -117333 -170093 -80994 29689 28331 98186 26885 84614 182339 200688 315807 273077
23504 273077 94156 -83286 20694 153767 318285 290470 273582 88677 163745 173311
23494 173311 247640 124010 96377 78579 -63344 -123933 -275659 -400905 -426679 -224103
23484 -224103 -42306 9565 -24555 -88256 -157313 -206342 -131198 54661 80322 100548 70587
23473 70587 104063 177265 94539 83941 49539 112058 33194 -39412 -105816 -29117 -64539 93504
23461 93504 132138 308452 288616 72223 -45976 -170693 -233701 -265276 -181310 -202216 -256595
23450 -256595 -316184 -198471 -40483 -170087 -164804 -153262 -141790 -150206 -74154 -52991 -188522
23439 -188522 -109036 -35888 -6523 45394 48839 97838 169138 187710 19140 -32256 -88906
23428 -88906 -12941 98940 62251 -31149 -72964 -106181 -60273 -15870 69456 -55243 -19441
23417 -19441 -27489 -45820 -124577 -93229 -166969 -42820 -177897 -322775 -231696 -163970 -40891
23406 -40891 -52240 -100689 -89465 105752 -15596 -163754 -78487 -51668 56251 214458 175003
23395 175003 87902 52265 46996 -33344 44130 13981 -109647 -198139 -129408 101982 103792
23384 103792 -63240 7329 161669 134360 55031 -22511 37205 198942 184056 13913 3827
23373 3827 -15506 -74479 -43469 -180889 -112825 -14957 -60820 11409 130014 89705 165093
23362 165093 188483 75336 -136842 -69572 129946 134926 159437 331448 474631 554031 575238
23351 575238 307363 -125351 -191162 -25517 -122969 -76027 -107192 -137603 -118178 -172597 -72104
23340 -72104 -51026 -97628 -137445 -149687 -53034 22236 92982 165296 5460 -21912 245385
23329 245385 212125 77373 -24691 88456 123739 100762 144952 -53430 -227917 -277958
23319 -277958 -447592 -406355 -456808 -343434 -123141 -171123 -249782 -434030 -485379 -446848 -400847
23308 -400847 -493611 -420806 -195577 -166265 39527 -21931 -136007 -199123 -297453 -371335 -247109
23297 -247109 -144729 32656 162261 147395 143740 127088 14409 -284 -200760 -33684
23287 -33684 169082 73209 109832 99856 99005 214415 325847 356317 275788 249626 199850 54066
23275 54066 -58677 -65511 -107339 17247 -56351 -127382 -134560 -288861 -325289 -396350 -458373
23264 -458373 -324098 -215185 -43715 15616 8158 45189 48824 5456 -186080 -339791 -392501
23253 -392501 -169424 158466 182849 -47601 -13471 78315 88362 146984 -38446 -57456 -187711
23242 -187711 -344401 -388511 -277167 -174312 -108029 -242456 -126944 33275 3750 -83511
23232 -83511 -93121 -88512 -17419 -84815 -125940 -235314 -128934 -111353 7247 252370 97395
23221 97395 96336 219503 142722 48620 -21266 -91582 7241 153815 137642 18632 -9515
23210 -9515 17556 87385 53714 -31542 -89348 -69332 148142 209671 111747 200813 75140
23199 75140 -15684 5244 13517 30974 210108 265082 224736 225771 221160 124115 89301 257884
23187 257884 325149 206532 268247 118159 -21606 -198703 -251566 -114965 -232177 -214625
23177 -214625 -16297 -56480 -76902 35332 13836 70271 72092 155905 219209 144851 70254
23166 70254 24496 93744 68600 -33641 -103239 33771 158087 94407 31817 -66534 11458
23155 11458 137073 45080 -4410 -10229 -23657 17223 38496 55291 21608 46926 -60998
23144 -60998 -151332 -232990 -238946 -211102 -342970 -389938 -250573 -135539 -196910 -371269 -194743
23133 -194743 -192166 -71197 15638 132717 250407 73772 83558 10061 -82164 168508 108686
23122 108686 86481 238611 278340 141290 84265 -30924 -91850 86476 -1761 -161361
23112 -161361 -215562 -367068 -363316 -334260 -169408 -153941 -90909 85802 122440 52411 -85481
23101 -85481 -182783 -217851 -359344 -199606 113204 285079 225503 116753 221910 269101
23091 269101 231325 170570 130755 144011 119067 165483 10079 -123391 -122267 -16715 153586
23080 153586 75260 -111809 -177273 -123195 -99227 -10610 20568 152015 256036 113587 148551
23069 148551 88043 39670 -51042 -95595 -177194 -128117 -224615 -206277 -206581 -222960 -332432 -209741
23057 -209741 -173722 -100246 -158768 -80398 55216 208095 48351 -61503 -147583 -124044 -32388
23046 -32388 -14145 -23108 62640 42979 -135902 -46420 -94468 -183030 -315275 -321125 -312172 -303751
23034 -303751 -110933 -45345 -35985 -176457 -223021 -111178 586 95608 120503 183120 85231
23023 85231 77450 2749 -8663 -127881 -197982 -209535 -223271 -215006 -326987 -212231 -179760
23012 -179760 -96195 125047 -54544 -209867 -77375 -188829 -212644 -99899 -4994 113031
23002 113031 -41458 -176076 -200947 -280671 -98073 36910 -41422 -216799 -218326 -125647 58468
22991 58468 -19396 -268100 -374490 -251671 2284 72111 100260 144495 50510 -39682 -169180
22980 -169180 -304546 -241266 -236946 -165673 -34215 -138639 -140050 -47043 102013 148448 149151
22969 149151 140644 23593 -152518 -333859 -271727 -286895 -319303 -158824 23283 141758
22959 141758 108671 20167 -88814 -204704 -261819 -427820 -453325 -347359 -510259 -377866
22949 -377866 -243670 -224656 -237826 -66683 68405 119433 -30998 -235780 -59559 -51329
22939 -51329 -44656 -80452 -105259 -96340 -140331 82019 228054 24470 80578 109502 122293
22928 122293 54651 -30305 1186 -145268 -246678 -196720 -67652 80375 86101 -23271 -68900
22917 -68900 -126480 -78573 -339768 -318010 -132017 16032 -4013 55954 109466 -9614 -30328
22906 -30328 -187104 -5480 73305 35735 123458 24700 -94423 102602 228431 253376 217340
22895 217340 123371 -72191 -389450 -296220 -123524 -67638 -71192 -93704 -16155 72112 302362
22884 302362 153334 88655 119019 6908 -19863 126079 65762 38136 -80589 5002 62209
22873 62209 -54281 -223532 -141085 -244364 -360530 -360677 -497754 -485368 -169693 -64441 -4337
22862 -4337 -61281 32833 -33591 -80933 34543 173519 145356 -958 -50975 39795 65698
22851 65698 17169 -28186 -161445 -318490 -239458 -2702 19359 16651 -3475 41190 216991
22840 216991 285261 205668 38636 16287 169812 132736 299075 341836 276195 252805 248379
22829 248379 171364 145163 249319 315678 249597 91386 -19996 13146 27624 -31739 12067
22818 12067 -133041 -145975 -43879 -99917 -83550 -52638 42123 126451 169692 181712 136069
22807 136069 85560 104081 198653 28586 -10797 -63090 -130365 31988 207748 268554 106162
22796 106162 123392 -91259 -198519 -46621 74837 76818 -253389 -442377 -431399 -330366
22786 -330366 -256178 -238254 -163330 -40936 -37689 -165828 -292155 -212775 -120475 -45849 -134753
22775 -134753 -190008 -233665 -371726 -266472 -270908 -398511 -281423 -117360 24432 282982
22765 282982 290637 141832 38240 -46936 -43726 -94833 120697 256540 95933 -93105 -136550
22754 -136550 -162053 -3842 -117551 -431982 -411238 -347442 -258835 -224927 -183235 -55041 45165
22743 45165 220843 202663 95465 -7343 1473 216825 342102 -542 -32067 6300 -29548
22732 -29548 -90483 -155449 -167586 -271107 -181268 -310180 -318097 -108987 -9078 -99712 -294521
22721 -294521 -437854 -398178 -161948 18966 133905 154424 63718 -6604 17308 36243 66712
22710 66712 126319 187865 168147 -77224 -148529 -11770 154533 130059 125728 136099 197947
22699 197947 164908 -14890 -62759 68413 240608 287632 182085 46581 36627 96524 108972
22688 108972 -62505 -62487 -125718 -43504 67202 81836 -63343 -196231 -185546 -76227 49512
22677 49512 752 -21843 -61111 -225726 -242078 -163383 -158834 -12015 173862 209843 132854
22666 132854 226794 191026 57589 -148141 -135872 -19216 218038 260912 48594 -53830
22656 -53830 -17005 -181393 -317360 -218197 -125048 -3104 73903 107047 81722 135673 14141
22645 14141 21733 105804 -34403 -176176 -171113 -328273 -407232 -174495 53567 87170 104048
22634 104048 -8053 -244730 -263661 -159567 -157100 -294244 -291196 -130368 -95263 31824 -112634
22623 -112634 26496 13260 -67402 -160061 -383459 -412449 -405111 -167397 -108754 -103527 -178965
22612 -178965 -175341 -147098 -71185 19027 98406 31855 -166661 -241516 -101317 -71767 -5259
22601 -5259 39298 8762 50550 8746 -18399 -148385 -351145 -249246 -101613 -20548 -57865
22590 -57865 -93715 -67322 -51680 35493 -2725 -17800 35475 901 38430 29649 -21713 209048
22578 209048 215625 94670 16967 -160630 -321027 -531524 -726857 -407936 -191312 -155196
22568 -155196 -131821 -201110 -309112 -172184 -113515 -101585 -33136 -23315 -28698 68409 210012
22557 210012 110856 37784 -76711 46546 85244 220539 241513 -35741 -109672 -169672 -210611
22546 -210611 -45923 -35903 50956 -28604 -53876 -17537 -111615 -198597 -117811 -229563 -221887
22535 -221887 -68729 -49534 -69663 38999 13225 25785 -35976 -156388 -159397 -181166 -265933
22524 -265933 -157501 81713 260913 339486 98999 40072 8230 -126979 -194783 -244366
22514 -244366 -252896 -136693 19150 -15653 -82196 -58779 133269 385562 414787 447393 221751
22503 221751 94411 113177 -1449 -94003 -66551 -52252 -88200 -49562 45367 -21334 -19325
22492 -19325 38759 -100080 -271077 -321156 -270816 -275280 -128957 -18902 29721 -37276 77648
22481 77648 65065 -92165 -163371 -99913 -69076 65716 132031 69496 -125215 -272541 -299025
22470 -299025 -272768 -237369 -256750 -269457 -263563 -100239 163654 209854 217135 270022 236704
22459 236704 165356 90346 -62862 -81643 -38486 -129332 -265804 -250875 -323630 -560402 -448264
22448 -448264 -290457 -232262 -185112 -152007 -9723 -27762 -165039 -241610 -82144 -53379 23158
22437 23158 -117325 -154990 -102324 -203341 -134031 -50270 112462 172930 102742 31331 1234
22426 1234 -171251 -143599 -169262 -226600 -185148 -68439 -104110 -281180 -250465 -131273 -98610
22415 -98610 146728 122772 79529 107806 139865 13525 -34341 -164785 -253540 -185094 -89399
22404 -89399 -28109 70260 104546 28811 -26775 9368 14504 164402 8213 -148819 -221923
22393 -221923 -172006 -184760 -313213 -249178 -316881 -395844 -276764 -102077 64535 205350
22383 205350 118686 58621 -229917 -316719 -285498 -275963 -166027 -85812 -97387 -62023 -65196
22372 -65196 -15003 -8016 11588 14570 15281 46112 -110756 -63408 113722 311655 331936 304623
22360 304623 133723 3328 273617 312001 124143 88834 78897 90924 156451 4259 -95046
22349 -95046 -68431 -63669 11228 -181930 -212928 -63469 -103873 -162706 -100706 -75606 -23628
22338 -23628 -13405 113875 124761 -70855 -248556 -253134 -262684 -219499 -258887 -279921 -337307
22327 -337307 -169840 34388 55821 97351 238080 207030 243714 283835 238626 232684 94983
22316 94983 41609 21889 124469 299493 161139 33684 -83342 -145806 -132566 11917
22306 11917 166299 161275 145142 95040 118880 140218 143920 32060 -161309 -174995 -157878
22295 -157878 -250226 -174352 -143060 -199654 -149965 -154741 -129331 94276 317936 382388 223384
22284 223384 188064 36167 79427 92676 62712 85271 48387 -28496 21845 152144 104865
22273 104865 37803 -79642 -150010 -118326 -156192 -204315 -197423 -131778 -32410 -1168 92120
22262 92120 158726 103555 250511 348558 372465 223704 78206 155546 268266 307907 228269
22251 228269 146104 154398 76478 54488 29615 -11431 -79019 -200822 -244969 -362485 -138739
22240 -138739 27547 -202998 -162403 -207438 -189476 -108988 -30171 53996 25562 -73742 -239345
22229 -239345 -313370 -180879 -100685 -97248 -49831 -52975 -34332 -30558 -48850 -15244 24224 -24944
22217 -24944 -10152 13950 -101439 -140920 -188269 -186069 -175230 -87003 -52256 -109109 -193601 -225168
22205 -225168 -63836 79774 244372 12114 -299166 -551972 -456020 -253530 -126297 -189971
22195 -189971 -205039 -81222 -169121 -206210 -145240 104680 5147 -83020 73951 62707 86815
22184 86815 261827 196872 41528 31579 101558 -46135 -154458 -5103 96883 54772 46644
22173 46644 53461 -54469 -199197 -280232 -94236 -1998 -82950 -181245 -129021 -222932 31658
22162 31658 106542 77483 10441 45062 -133350 -210541 -269545 -253822 -185421 -171823 -318036
22151 -318036 -402630 -370208 -380414 -357530 -235469 -2230 9742 -57897 -136183 -275688 -397299
22140 -397299 -425532 -364740 -240342 60691 210093 212472 4487 -105959 -265693 -423239
22130 -423239 -318342 -69492 159000 195816 53052 125020 338546 203239 -34946 -122033
22120 -122033 -45583 81165 146369 105424 280769 377344 419938 376301 87905 -165452 -16884
22109 -16884 7251 -52165 -102845 -244080 -101515 -5648 -5242 -44280 -204079 -151853 -151249 -60173
22097 -60173 -104348 -211301 -98367 -18333 -9045 -119159 -97612 -242419 -354714 -253843 -52446
22086 -52446 -36822 -16135 23430 -81296 -6415 48141 154698 268417 244234 191739 142927
22075 142927 114553 104742 5245 -56035 -182206 -167772 -65864 115428 205687 -10525 -46556
22064 -46556 -25383 -46888 8910 -18781 240965 355027 494371 561452 333959 381429 161037
22053 161037 39662 53707 47205 56063 -84854 -133695 -179512 -261320 -365335 -424784 -322306
22042 -322306 -181094 -102452 -216301 -190268 -29330 139710 203184 199611 156080 -35535 -44466
22031 -44466 97470 204638 222856 182662 24008 -280131 -392759 -291204 -237016 -60751
22021 -60751 95681 270151 151096 154681 219800 211723 258373 -122617 -171900 58049 6197
22010 6197 16924 75526 254120 287076 83339 181405 281881 390405 321183 201985 228506
21999 228506 239903 75324 40647 -1192 -184781 -344260 -157586 7710 151211 108371
21989 108371 21767 -13138 -99225 -173712 -134765 -119001 -10409 208905 233589 75513 101534
21978 101534 150027 42389 -25667 -78426 -122913 -27345 183650 181117 87477 205828 169117
21967 169117 155017 233584 233587 334549 341224 138662 1283 30640 -142584 -164733 -197913 -108648
21955 -108648 -193174 -233608 -16910 212560 106001 37385 166013 342397 315074 173192
21945 173192 168478 415644 327539 111736 -7957 -1282 101850 154598 158515 330807 375314
21934 375314 279409 241315 127769 18310 105408 49606 91706 199357 244744 201279 120037
21923 120037 49132 69854 -26937 -100951 -46233 -188018 -394203 -335801 -146433 -100390 -203514
21912 -203514 -145316 -199179 -219472 -134735 -52370 45774 174409 133270 131148 21845 83276
21901 83276 68545 145951 156005 205493 3961 -98098 -111872 -137288 -155389 -43705 43094
21890 43094 -277475 -192521 -242352 -128705 -244092 -323205 -207601 -102340 -148592 -248287 -210507
21879 -210507 -168056 -114081 61524 166167 22857 -160274 23128 226943 -70089 -181915
21869 -181915 -117921 -114515 -156443 -256887 -252190 -136649 -113569 -91531 -36397 -119992 -141596
21858 -141596 -70022 -134488 -207849 -161729 -61262 7589 8983 149692 192103 79511 -69491
21847 -69491 91845 257975 232905 252817 175238 -15679 -17385 168626 133462 77364 10014
21836 10014 -75654 -38461 -111140 -49463 -33026 -20210 -24448 -114803 -110603 3577 94849 239681
21824 239681 98112 51658 -97131 -247366 -228017 -172369 -53388 -2317 29968 49562 66489
21813 66489 -3013 6944 24349 23856 57519 -52702 35922 124213 151336 50488 -155792 -121106
21801 -121106 -69826 -104645 -145885 -99103 121551 196695 184223 114075 84385 41434 253742
21790 253742 124504 271650 147269 -8338 56920 141343 205413 183819 -62690 -263387
21780 -263387 -114067 12612 -166731 -216973 -229206 -458353 -433034 -265848 -140598 19785
21770 19785 154844 74202 -37212 -90474 -257208 -336690 -209392 -172846 -218208 -90753 91757
21759 91757 245643 242623 151122 25730 -21636 95964 53936 -76025 -221699 -225855 -88776
21748 -88776 -258380 -266933 -156554 34581 125766 94733 171525 325418 429361 274858 228165
21737 228165 191968 112094 -156876 -317531 -331943 -258864 -218420 -63010 -72911 -190161 -312662
21726 -312662 -178913 -130734 79196 98772 97598 103576 -1124 -105483 -78442 -111572 -60411
21715 -60411 -195365 -273883 -239437 -181818 -174289 -191221 -161824 -30484 -19456 -84080 -116317
21704 -116317 -213549 -349065 -350657 -161203 -127488 -102813 -16511 -57008 -134095 32208 186178
21693 186178 99631 -40927 -113932 -150285 -293777 -175944 -2333 41114 64690 77248 115177
21682 115177 151074 139613 255827 327682 187074 224885 191337 89992 -58276 26351 67816
21671 67816 108532 138878 198823 161154 28263 -82582 -229398 4625 7287 27452 52592
21660 52592 182485 241897 10769 -74420 -95547 -160788 -99085 -68973 -50521 -288901 -325349
21649 -325349 -4971 40292 87510 73735 126688 141284 -20437 -132255 -109726 -259791 -171611
21638 -171611 -101204 -215826 -264010 -319740 -130969 93859 195931 95794 76179 232954
21628 232954 362121 131435 -108834 -194414 -120726 -37745 -64927 -151319 -235150 -212578 -279027
21617 -279027 -212203 -95225 -161537 -266205 -285477 -166938 -225544 -241946 -39834 162113
21607 162113 215160 142499 11885 -90004 -73456 64920 -15997 -228863 -370988 -212165
21597 -212165 -232394 -120557 123415 124535 -15787 -23588 -33825 86378 130186 249836 149741
21586 149741 142464 365272 384544 206441 14217 -18240 17014 -3901 58916 111571 -24897
21575 -24897 -133002 -91527 -59743 22788 -52702 -311940 -484397 -343830 -17613 252963
21565 252963 396125 286503 326968 475130 360722 14113 -147113 -12775 -122110 -211975
21555 -211975 -72494 30041 101317 -14633 -62206 22049 77108 -73115 -26509 197076
21545 197076 229770 59215 -100845 -150014 -61149 75993 86766 79634 -45339 -56012 -94438
21534 -94438 53928 8872 -24492 -110902 -253307 -54919 42477 40350 -125473 -232575 -253880
21523 -253880 -355242 -368436 -228567 -163253 -81004 28854 54727 158613 116385 260928
21513 260928 243788 196987 125762 60118 65570 15805 112724 123884 -23730 -179242 -349453
21502 -349453 -314715 -177904 -220027 -165855 50344 -20094 -123328 6369 -179660 -212168
21492 -212168 -94889 -134493 -136224 -179645 -331810 -334589 -258955 -362682 -327633 -152667 -100001
21481 -100001 -161848 -214973 -69917 -11219 -48349 -121994 30 63915 143499 42813 191367
21470 191367 207764 126191 127078 133211 13145 -63351 -62045 53195 138971 157200 163199 270441
21458 270441 141254 120667 291406 209180 75562 80890 -8833 -12324 92365 104412 246137
21447 246137 354040 343019 108936 -96803 -115595 103883 138483 16222 71531 155913
21437 155913 40055 241231 67144 -94151 -84551 -190453 -303765 -390477 -253737 -41746
21427 -41746 -173787 -437404 -542694 -331961 -137604 191706 300885 293636 333287 249711
21417 249711 289173 123364 35789 -44106 -20744 200338 122383 114926 104866 68053 20499
21406 20499 115194 145967 147831 208227 175745 225011 212038 150765 104549 102825 76016 20963
21394 20963 148287 110061 7033 -169261 -246827 -128734 -24507 -15385 -201803 -342641
21384 -342641 -315811 -349580 -178648 -8368 46440 96572 -55348 29616 44857 44917 -88193
21373 -88193 -174178 -17794 -153396 -298159 -191583 -202562 -246398 -263995 -270468 -318811 -198892
21362 -198892 -212489 -192303 -317108 -308394 -352323 -331792 -158417 -157372 -206694 -109127 -127594
21351 -127594 -257442 -430050 -373085 -261787 -156699 10732 23892 -202608 -134955 -54155
21341 -54155 -200834 -129061 149272 0 29603 170212 177099 32714 -13588 40835 -27598
21330 -27598 -104410 -130460 -32917 7949 -156212 -155089 -209205 -97500 38975 -81508 -61487
21319 -61487 -246225 -230526 -61170 107583 32464 -28792 49548 76814 138912 285809 290579
21308 290579 167809 89056 -49558 -122475 -271924 -61030 -103500 -62838 -2261 -60791 -54865
21297 -54865 -99593 -14106 186734 98826 -62319 -165040 -161282 -217508 -227086 -91038 -197441
21286 -197441 -167522 -148738 -158078 -130824 13004 -91308 -287732 -226277 -214961 -255186 -142510
21275 -142510 -135435 -188900 -225273 -89045 43496 -43888 -234410 -215016 -14260 48093 90775
21264 90775 143069 -116383 -245670 -373594 -376944 -250026 -222817 -314511 -393015 -488154 -279712
21253 -279712 -155620 -120209 -95901 163240 136409 6913 -251569 -323633 -336141 -431189 -487361
21242 -487361 -379567 -383982 -383773 -158438 -92066 -51345 102687 220601 219911 252859 185544 158337
21230 158337 368 -115868 69679 184160 211060 258422 84305 -15967 3839 -44181
21220 -44181 5291 159589 227967 135967 -78342 91656 131660 189760 161603 72691 58153
21209 58153 245521 375459 306848 233203 29672 -196955 -103316 412 60615 114867 179898
21198 179898 209427 132346 59450 41306 -98034 -109253 -111646 -153790 -97874 229589 214634
21187 214634 123735 59588 170351 162319 220628 354277 113398 25689 -66237 -144952 -267179
21176 -267179 -266521 -326119 -336837 -53861 54598 2996 -13688 70062 59629 110401 181982
21165 181982 157691 139911 100292 187126 181426 118186 82361 102233 170590 101342 41225 118388
21153 118388 149749 -3280 -6048 16978 -48357 -160279 -126443 -240 103300 140873 227052
21142 227052 254730 267422 181896 156060 139326 151503 189476 252556 203572 82184 18846
21131 18846 -89644 -29339 -224973 -336746 -457211 -589137 -458884 -312728 -118292 -96309
21121 -96309 7879 117096 35308 -101308 -156715 -206620 -45486 -80795 -119082 -103187 29100
21110 29100 -2438 -89514 -154622 -272197 -288249 -170357 -32533 10508 55255 -4450 -113206
21099 -113206 -142106 -128596 14992 57021 133507 1809 -150778 -39492 13729 -133876
21089 -133876 -187238 -96956 -301030 -434500 -327043 -419121 -371892 -284163 -181719 -107910 -61607
21078 -61607 -111893 37919 100539 -121820 -268827 -189820 1233 85720 -32262 9580 -1768
21067 -1768 -36770 -101568 -207018 -228402 -174488 118571 274550 146261 -60762 -36363 109099
21056 109099 144640 65285 -172987 -358967 -147348 72901 7740 -59320 -72123 -146942 -86533
21045 -86533 -105731 -141311 -141359 -160576 -140451 -134998 -215943 -318759 -408722 -341860 -149953 -121839
21033 -121839 -106392 -11853 26347 -36206 -104717 -105127 -265251 -143358 43550 -25205 -132876
21022 -132876 -148538 -65440 -72523 -30091 -85823 -151725 -25983 167628 230389 100266 -119929
21011 -119929 -234881 -159602 -31305 107693 205611 149888 75188 -92219 -72671 -80798 -142665
21000 -142665 -135052 -70240 -81182 -39556 -95456 14444 96673 -52063 -242375 -198150 -13956
20989 -13956 165848 1209 -112753 -228474 -197148 -128175 -115814 -190939 -157107 -91520 -164
20978 -164 -71085 -234097 -129291 -113440 -115372 -218228 -371244 -377095 -395697 -251693 -620
20967 -620 -103622 -78231 -155246 -102581 -73183 -252753 -143102 19169 54033 85990 48961
20956 48961 -106324 -187560 -153336 2120 130074 56078 166618 242347 149136 -38442 -192080
20945 -192080 -123081 29213 -146340 -58031 95217 173309 252992 390936 221283 245371
20935 245371 267536 250438 324296 104014 43670 -97276 -160018 -340607 -409036 -287469 -39034
20924 -39034 88345 -118640 -75302 -50013 -8920 81197 50119 65229 118980 137228 107436
20913 107436 -14206 -39638 79089 -25749 -62228 -76682 2276 -82715 -163650 -226946 -10406
20902 -10406 319993 386392 429400 270587 -77964 -34784 41168 -79335 -191658 -34509
20892 -34509 -14178 -143449 -246408 -371875 -409112 -383496 -255188 -239554 -311679 -272508 -142408
20881 -142408 172710 198361 77708 106895 191859 64002 -47425 -102722 -18158 24318 166158
20870 166158 211874 76586 220827 339722 300307 185502 225286 120432 301 54808
20860 54808 74031 -34297 -179657 -164506 -123643 34470 -55088 -87649 241156 233773 332356
20849 332356 362830 221624 163601 -1002 -88392 -75661 151442 120691 168182 267601 232788
20838 232788 224547 266708 303210 194675 307558 638535 790623 803325 976673 1026949 1064438
20827 1064438 1067671 939877 943871 945646 744023 765792 880424 1012382 1185530 1225807 1063323
20816 1063323 920910 771492 847187 832414 618066 268663 147498 127613 50236 121287
20806 121287 34572 144357 188547 127252 183733 258707 169763 117731 115378 56157 -4840
20795 -4840 14825 -92296 -63451 87077 147663 219334 424934 357033 244507 302637 174329
20784 174329 55891 48463 -4099 -96103 -73574 53810 46079 80986 88927 119607 63302 2480
20772 2480 -87609 25112 146146 147078 184174 412472 237205 209650 239472 150388 42859
20761 42859 -92336 -32357 127681 318746 493689 175873 24972 163316 16763 -129998
20751 -129998 -171873 -61499 -127418 -219204 -214962 -153762 -124062 -164920 -30693 -102458 -173775
20740 -173775 -57487 26395 -7481 -108105 -107401 81583 242214 288750 163052 138073 55129
20729 55129 15974 -42476 -161978 -10630 -45470 -185438 -285019 -255929 -253827 -187860 -3127
20718 -3127 58757 -121521 -190447 -69578 140348 25556 -1042 -134497 -289137 -350908 -403734
20707 -403734 -163474 103373 221222 151719 47542 -160375 -199231 -108716 30731 3896
20697 3896 -54820 -135868 31349 -37836 -67382 35896 43978 -164740 -158270 -106292 -159894 -143258
20685 -143258 -63937 -89951 -285901 -388852 -290333 -165390 -194494 -39023 -200840 -125042
20675 -125042 -29310 -55442 -45935 -17324 13139 5626 157739 156391 202084 147275 38440 13534
20663 13534 208604 208339 225911 156587 137009 127982 34997 81891 8183 8039 -12262 -5903 76490
20650 76490 27893 -59488 -97943 -145777 -156348 -54162 -122220 -79598 -142267 -40437 -75970
20639 -75970 -114311 -65103 -167183 -138036 -5967 -54056 -115025 -139962 -132464 7648 9247
20628 9247 -19516 -134404 -312211 -69016 6197 91018 195341 200182 -111990 -154630 -144171
20617 -144171 -180832 -185670 -221562 -247696 -226165 -97008 -150285 23561 61854 50338 39311
20606 39311 22053 29640 -155112 -162549 -39039 107908 143325 221510 139951 8041 67265
20595 67265 42944 147590 150675 -86351 -243095 -290578 -236292 -211560 -9462 92251 -34115
20584 -34115 -185748 -31184 50555 -13807 4430 -84855 -146297 7750 91450 84172 -118325
20573 -118325 -159122 -5164 162983 151072 245032 322084 320868 259431 333966 266388 183952
20562 183952 215331 92692 112350 211842 218196 199556 159743 125777 167755 -30750 -54047
20551 -54047 -73842 -169370 -85879 -131717 -188006 -223616 -221549 -108738 123122 176458 75784
20540 75784 162993 527852 563263 360510 264717 351423 259892 277928 253684 375547 285982
20529 285982 270013 189301 56620 -12710 11287 162286 234152 309054 292129 142161 33088
20518 33088 -77796 -245485 -53717 128677 82887 208694 245443 116553 129433 -132931
20508 -132931 -196702 -137759 -128918 -268872 -286197 -260775 -272777 -300673 -359714 -269307 -117966
20497 -117966 221718 177101 -97090 -98016 -27140 -173497 -257558 -306363 -212151 -227533 -196495
20486 -196495 -163374 -75204 -126265 -201052 -188028 -83823 -27008 -13490 78245 -45467 -245888
20475 -245888 -52507 170694 209964 93841 46519 117779 179308 266960 312180 229075 87283
20464 87283 17647 29965 107578 106058 86276 2352 16833 269207 376349 416332 453127
20453 453127 419301 435354 495462 505253 427457 302224 347051 314746 231524 228102 262300 260296
20441 260296 301358 384095 307845 227835 176505 355175 396552 222600 294080 320179 209363
20430 209363 -55349 -79899 68996 20200 -252078 -255711 -218402 -72688 -6935 -1785 27082
20419 27082 18165 -59239 -48267 174463 212825 186531 169361 350347 346565 163550 -43888
20408 -43888 -140854 92794 377894 416618 276895 277150 302127 178726 228642 338315 354677
20397 354677 410879 506262 462604 378095 389153 352694 191392 226391 301077 214951 215291 25929
20385 25929 24289 88494 177910 276142 346992 321554 182509 204272 328027 151733 261059
20374 261059 357290 276575 139914 95265 307816 514619 694184 645307 527797 382069
20364 382069 616231 720769 703492 784135 794800 843289 1028561 1189711 1242860 931499
20354 931499 872810 935372 1044431 1142654 1235664 1428665 1555934 1598920 1667044 1755208 1747853
20343 1747853 1582213 1469801 1480031 1599460 1843762 2253765 2722493 3282678 3682557 4161381
20333 4161381 4709055 5329631 5948790 6461875 6728843 7056931 7578209 8493584 9275369
20324 9275369 9975559 10780208 11832476 13713609 16176423 19240902 23933391 31217029
20316 31217029 43516017 64575031 95704095 132823590 166816484 188837804 198873560
20309 198873560 202162308 204253063 201672933 191204262 173068783 159205785 160116544 177611909
20301 177611909 200947018 215400947 217898826 213672424 209660570 202056303 183848381
20294 183848381 151816251 114574618 81435652 58640241 45298894 36942589 31098093
20287 31098093 26711093 23152800 20302794 18172346 16579158 15243558 14069601 12841411
20279 12841411 11886724 11071185 10330950 9638528 8880040 7870863 7121674 6505407 6070091
20270 6070091 5464264 4884950 4220412 3660251 3291589 3166851 2962162 2870370 2734944 2511941
20260 2511941 2182595 1874811 1860176 1918201 1866822 1799693 1837690 1809416 1664026 1640827 1392093
20249 1392093 1269674 1204973 1112591 1020495 796568 524763 487749 498693 606912 814250
20239 814250 799889 779225 679362 733794 620643 416307 325839 308534 397622 425223 373463
20228 373463 352228 437394 483520 323478 254946 157582 164257 198153 278182 220975 80568
20217 80568 178126 352920 363519 288815 154595 79373 -79143 12125 56514 117438 283025
20206 283025 586690 714847 990182 1206840 1149411 1164495 1331936 1268532 1115623 1106812
20196 1106812 1150147 1271618 1489461 1531150 1440096 1340855 1237758 1035236 846768 746482
20186 746482 554046 457991 505413 599913 431250 377056 368343 412847 307807 414488 408406
20175 408406 525567 525769 395916 338829 320191 300300 131371 115597 216526 216717 165261
20164 165261 283157 248975 136271 58521 123680 10070 -28416 -62010 -109787 18604 19469
20153 19469 -58062 -150893 -44417 115927 188468 86434 -52773 177801 291847 79010
20143 79010 17296 96164 286916 324555 135273 134211 184217 147345 238868 305431 401601
20132 401601 260217 80350 125948 346742 318883 260576 29642 12819 145141 165637
20122 165637 204020 227268 291337 288782 203024 18072 45368 103244 197457 385530 230969
20111 230969 86340 197516 128717 -115345 -163048 -54668 113613 40553 -68627 -1763
20101 -1763 -53592 -72609 -124411 -170653 -152031 -30935 -83035 -209649 -131604 -109143 -95859
20090 -95859 -167282 -317400 -313304 -221482 -240513 -241886 -98239 -194587 -167642 381 -120620
20079 -120620 -331801 -300147 -224710 -127613 -196320 -170079 -47657 -36216 -259739 -404249 -248625
20068 -248625 -60355 -34352 -27306 -11218 -119996 -252259 -237674 -40241 33675 -109112 -38020
20057 -38020 -73850 -127339 86381 178125 220804 198732 88784 59176 165701 306572 144601
20046 144601 68213 103838 206788 247632 149581 44703 -48898 17485 -32521 44847 -114967
20035 -114967 -109838 -201305 -181977 138238 201509 -15981 -108350 -80161 -120051 -64387 -85557
20024 -85557 69295 46245 -132797 -206788 -191602 -211307 -294877 -420725 -385195 -497700 -371151
20013 -371151 -78858 23783 -29158 -8831 -47523 -64171 46754 120596 -61270 -120184 -157577
20002 -157577 -166769 -54354 -91827 -3339 31364 24714 68486 93210 -25020 -99911 -125135
19991 -125135 32079 132236 46594 -600 -13101 100401 79476 165046 180341 -102034 -315016
19980 -315016 -264250 -179623 -53551 -121618 17776 106610 55158 40327 -26114 -57967 334
19969 334 104985 198996 83265 -18858 -11794 -179508 -181242 -185483 -197400 -41766 28457 113480
19957 113480 73370 110174 126315 79041 37075 47572 28524 -69252 -37076 -95913 -207410
19946 -207410 -58728 4752 -39915 -194848 -328160 -259988 -88304 -121129 -290681 -217754
19936 -217754 -29459 51738 181211 314395 190627 85986 116677 122162 62847 -29177 25314
19925 25314 43219 135133 -43419 -160600 -117072 -13292 267742 335606 137654 -101192
19915 -101192 -111312 -6053 38740 80443 15299 -166045 -68280 139172 11650 -95403
19905 -95403 -194876 -62389 134517 38849 36384 -31169 -60840 -5229 120246 193656 65133
19894 65133 -203593 12272 360511 657463 796123 794437 679971 589191 609346 579672 413428
19883 413428 397715 371502 537624 745059 802522 779066 785521 687846 366207 152464 92276
19872 92276 36508 151747 159699 116679 129583 168622 324578 405125 267352 -53051 -67338
19861 -67338 5821 -136980 -408572 -297142 -206216 -138548 -302000 -352702 -262738 -113140 -160149
19850 -160149 -310773 -147023 32105 121510 154541 199859 235114 248357 391234 266539
19840 266539 69857 222485 325427 327410 348830 494394 715830 705194 594715 491703
19830 491703 275312 224744 124899 186621 305694 423149 555027 667490 533389 354567
19820 354567 231752 164709 161941 160337 33775 71842 150461 85028 -17417 51001 165826
19809 165826 233662 109399 -4686 99131 84052 205058 239721 290840 367572 630874
19799 630874 776075 736362 738745 951315 1061116 1001133 1224214 1315943 969611 848516
19789 848516 1005595 1337492 1427210 1210017 1150219 1210726 1341291 1426078 1208245 891312
19779 891312 890159 983786 1083808 1199628 1317775 1371819 1235852 1219929 1244300 1191026 946092
19768 946092 729100 530522 430926 190413 -38715 -35665 43257 -37593 -69177 -204378 8112
19757 8112 175205 330079 402976 266506 121688 24289 107079 110990 56354 140368 379054
19746 379054 494072 453570 488953 779760 826762 856906 1173790 1306578 1183182 1068433
19736 1068433 1053978 911760 708720 567354 388193 250758 277097 324565 379710 567541
19726 567541 512780 207673 -101622 4978 14817 24227 35216 131522 392068 537744 339937
19715 339937 293583 144907 35326 3170 3881 91989 89561 42564 91945 170017 164425 -147644
19703 -147644 -28055 112489 -41261 -204895 -43571 -48688 -132212 -8803 36817 228192
19693 228192 343906 182506 14006 129777 185478 158877 272340 237643 350684 296439
19683 296439 76184 75960 52252 -135159 -195590 -97243 21272 -57782 -156846 -262384 -252983
19672 -252983 -28109 203517 158755 64785 101783 67351 -50793 124903 246349 225460
19662 225460 91097 -48058 -86219 -37750 81446 237344 262262 169655 152508 152643 3484
19651 3484 24946 67227 247838 333504 340163 316078 274512 127562 163282 294809 222755
19640 222755 118438 187492 113630 53737 32781 142011 152214 111462 224324 320086 83147
19629 83147 -70917 27918 176384 163078 253066 362483 202237 35516 -7758 175712
19619 175712 378174 449722 441620 448294 371694 211671 153238 276266 166432 -75888 -8231
19608 -8231 136121 215780 168948 177973 239948 220193 306489 344708 128578 4833 -41618
19597 -41618 -57406 -147830 16833 216603 105325 93777 176408 69732 -32385 178795
19587 178795 359616 437183 557040 570199 475858 353358 390247 473283 420532 530722 438375
19576 438375 509170 508765 512235 350523 311640 280831 332325 265909 102461 78236 22269 -13645
19564 -13645 75788 176383 327199 312619 353912 171810 326290 442140 333168 142033
19554 142033 5584 18163 78506 276942 295981 208281 146033 -4712 -48636 -11712 -59297
19543 -59297 2097 -168447 -316756 -280563 -74492 181796 222841 110337 -2946 -26832
19533 -26832 -165123 22781 161817 237613 415720 318689 234734 434446 630881 534054
19523 534054 557064 681762 847719 963037 864925 789164 876547 737453 664570 536436
19513 536436 404872 556299 648797 701865 631720 370410 315054 377421 422977 305177 80207
19502 80207 -61574 5005 36575 -70982 88554 171087 299282 371484 269235 239473 199560
19491 199560 81591 -48978 -242476 -321909 -194530 105302 279574 86246 35385 99919
19481 99919 26066 30241 -45616 6308 64107 367692 446183 275903 285745 422360 563774
19470 563774 555031 416330 177432 37144 40513 298143 473197 470619 363579 462522 593868
19459 593868 736448 705344 644713 693376 530545 309157 330892 467534 390894 381879 319712
19448 319712 185967 250694 242433 278529 249005 16287 46850 26539 -102189 -208786 -361636
19437 -361636 -317118 -267117 -98216 79790 115092 14540 78543 256368 236584 211122 63816
19426 63816 234107 404263 326310 270690 269640 465455 524767 388266 471867 559489 428018
19415 428018 558737 547505 545273 734151 821086 769262 656070 831978 953685 1206218
19405 1206218 1331588 1355322 1315473 1328928 1534163 1490205 1236013 1209707 1293815 1266481 1476212
19394 1476212 1632807 1842303 2008622 2227547 2419185 2615942 2543505 2699708 2905295 3023307
19384 3023307 3369940 3802767 4444146 5329213 6933944 9772093 14622651 23268976 36828960
19375 36828960 51676853 63326788 69866020 67724974 61505436 50940151 37332104
19368 37332104 29008168 26905182 30929311 40956907 53269231 62862023 68254329 65912800
19360 65912800 58750931 47698696 33150882 22620697 16791612 13744805 11964048 10848689
19352 10848689 9903340 9282905 8763232 8259113 7633943 7039541 6444643 5909472 5569267
19343 5569267 5483788 5652550 5814892 6112357 6488949 7009115 7309046 7612862 7876887 8240776
19333 8240776 8475818 8764247 9304788 10134940 11477341 13274502 15749978 19665781 26048043
19324 26048043 36785141 55359776 87245875 130446533 169446641 198384210 206139253
19317 206139253 193851429 171181885 133206430 99011811 84118254 87395334 109266508
19310 109266508 146676827 182456984 208880364 215683939 200144865 173708045 130964073
19303 130964073 87973924 60859996 45656402 36908154 31112966 27126662 24086034
19296 24086034 21645288 19528149 17814676 16434561 15512674 14707169 13878515 13053699 12470079
19287 12470079 11984179 11718374 11644931 11671786 11695494 11781053 12286530 12907198 13544338 13992684
19277 13992684 14369256 14933776 16106051 18246344 21444391 26252489 34023642 47063941
19269 47063941 69789299 105767791 146041427 175806600 193323555 209010542 248213395
19262 248213395 288675713 300296178 271741785 225461877 203783336 191644600 170274299
19255 170274299 130521414 89584315 63386476 48415125 38978724 32454552 27821260
19248 27821260 24332279 21610012 19597995 17771182 16128218 14544229 13178935 12232424
19240 12232424 11332146 10569644 10219699 9758433 9161898 8745263 8376192 7994925 7924458
19231 7924458 7788988 7438885 7167067 6747100 6428528 6372801 6296210 6238704 6142401 6296663
19221 6296663 6728747 7268225 8269509 9645982 11905176 15283611 21083004 30660818
19213 30660818 43932200 55876141 63403269 66735104 74158862 88970665 98373787 96508865
19205 96508865 81565380 69365247 65223382 60492164 50660324 35958745 24724439
19198 24724439 18189197 14280769 11716624 9932350 8735320 7759250 7009483 6441965
19190 6441965 5901562 5561902 5231934 4777983 4551648 4383168 4334936 4204376 3814823 3493731
19180 3493731 3158858 2919278 2759671 2775525 2642169 2162550 1756957 1641597 1616385 1348432
19170 1348432 1055332 1041593 1035681 1142180 1107809 1012333 1024486 935719 869878 751656 679525
19159 679525 740213 893168 925109 821202 734953 843575 969974 950604 718395 583645
19149 583645 795158 751274 925035 1063325 1010712 829405 860204 886803 745838 580188
19139 580188 535057 588333 591432 712994 682747 643964 720194 646043 797788 824608 671605
19128 671605 556036 600522 671213 532836 307881 300141 260119 276869 279243 375552 423152
19117 423152 406416 422584 429962 289841 214905 182536 -18064 -15635 103942 185381 143659
19106 143659 87255 279081 194493 74594 201154 234340 313529 191216 145392 224600 235348
19095 235348 331772 358099 331412 454689 559810 345906 386994 427652 361234 279017 327515
19084 327515 334727 302725 412281 285165 180992 335798 412763 133583 84058 27251 55976
19073 55976 111041 109437 293237 492023 544455 451917 307080 357428 342585 240431 54030
19062 54030 55206 107521 122144 175829 190698 190762 43239 106328 304292 221901 69931 60379
19050 60379 292958 369530 324289 380377 467164 503380 481253 459313 328400 220591 133606
19039 133606 35906 48022 185438 510763 662580 672842 833244 883479 994433 1150277
19029 1150277 1373828 1424996 1440409 1485962 1487918 1253329 1020129 873382 632385 528676
19019 528676 292406 -29087 -188891 136246 326926 328327 476601 393094 266446 135890
19009 135890 245941 267338 267009 238680 188020 188752 285233 305109 242990 137248 62189 294164
18997 294164 566182 918268 1244765 1280396 1244879 1223954 1168936 1097375 1054313 833389 575990
18986 575990 456645 301553 -26032 -63191 28862 59758 307495 383545 478216 305303
18976 305303 270271 332651 180352 118964 242790 379966 237202 228873 214123 122277 72283
18965 72283 310454 427264 217867 134490 137759 47266 32903 197085 168538 187437 287547
18954 287547 403730 239599 157931 168977 208464 232056 229067 240944 177986 203384 174381
18943 174381 197316 70353 7277 -54660 -83032 -64140 -141504 -77611 81850 187398 216552
18932 216552 -13211 61533 115690 180107 150968 296282 292632 133366 222922 371524 467746
18921 467746 497322 467208 495414 505577 331257 111231 48577 -100450 -90153 -66115 22317
18910 22317 -20963 -76879 54378 13741 138407 288615 171548 209416 291024 251047 204046
18899 204046 165022 159293 151694 160523 12288 -75196 25478 93432 147763 86428 251931
18888 251931 340557 228144 218935 57274 -16415 -5139 -158148 -4472 90096 213751 20202
18877 20202 -117827 -7389 -102977 -102007 -86159 38599 -55683 45267 185633 206532 133250
18866 133250 117293 103982 103728 251487 178559 32630 6329 -47700 -166796 -273482 -275421
18855 -275421 -195143 -88952 3803 19909 9192 -98170 -65491 -74822 60770 106261 230814
18844 230814 350584 355965 224297 330371 479818 720034 783505 808121 865926 998774
18834 998774 864667 599549 263850 168944 190347 362049 517758 721356 708627 647369
18824 647369 784193 741823 483917 260064 170345 55843 39096 -23631 177285 337217
18814 337217 461918 306250 277254 127339 240489 112871 109108 187470 283449 84061
18804 84061 -63430 29352 106953 50828 120506 39113 -115501 -106840 -143822 -128119 -24038
18793 -24038 -105535 -215663 -115612 -129903 -167736 -37602 65668 85337 67628 127415 431286
18782 431286 763944 786101 675839 510521 586418 504594 431149 371970 475093 554301 726676
18771 726676 896192 852018 836828 839672 713190 865995 1014637 1435528 1807792 2004209
18761 2004209 1598527 910703 551430 396436 120918 -26535 31899 135368 291700 333721
18751 333721 217445 125606 42532 148283 320202 532106 658448 711438 957747 1111171
18741 1111171 1324199 1533352 1582514 1646512 1329034 986054 767530 653324 571299 496031
18731 496031 348283 330312 282741 387045 530408 522879 322872 207721 202797 205965 355861
18720 355861 333742 341712 258238 372836 302450 215092 353037 510590 604933 579347 632334
18709 632334 692807 775388 819149 887171 1019826 931377 1002519 990545 1023136 1214117 1296486
18698 1296486 1510872 1804298 2083949 2373423 2399571 2226426 2176720 2062742 2108734 2189796
18688 2189796 2345554 2583138 2868455 3232404 3698280 4122020 4604331 4930486 5134333
18679 5134333 5125054 5322082 5592349 5946071 6708821 8031099 9832502 12271867 15730592
18670 15730592 20845985 29428616 44441601 70798275 109926094 153517961 190350605
18663 190350605 209421986 207300598 185994075 149497215 106653854 70879353 49203250
18656 49203250 36769408 29061364 23912513 20332305 17790269 16236562 15569030 15358179
18648 15358179 15316796 15232988 15125150 14687247 14072192 13507051 13312401 13455698 14423267 15979761
18638 15979761 18329585 21904859 27326186 35952176 50548242 76275564 120355001 180999484
18630 180999484 243879776 292066988 311842533 300849442 263387728 205500416 142306032
18623 142306032 93861103 65164012 48761304 38578272 31825752 26824191 23086747
18616 23086747 20370726 18179893 16348689 14829113 13436951 12342069 11327198 10459473
18608 10459473 9363960 8388824 7540250 6893406 6316429 5891677 5625526 5509684 5530672
18599 5530672 5521097 5428692 5219679 4956810 4660354 4131213 3623983 3135062 2801919 2659369
18589 2659369 2448324 2248549 2171531 2098456 1960124 1852566 1832400 1925856 1841664 1657329
18579 1657329 1831931 1807726 1867022 2060637 2241003 2050829 1827328 1560978 1343799 1123173
18569 1123173 1094996 1179873 1249649 1134908 1044219 1087418 1036945 885080 874229 782534 727413
18558 727413 828561 801232 813726 860581 861828 842943 818960 809311 786523 654195 660119 861979
18546 861979 1058932 1124533 1365469 1417622 1538165 1705780 1815561 1923954 1790573 1476998
18536 1476998 1210602 1014409 1010305 1104231 1234731 1090050 915490 881390 835457 879193
18526 879193 1134453 1417659 1666130 1736805 1748847 1788940 1874816 1911285 2213046 2482889
18516 2482889 2687705 2791041 2953701 3392972 3891066 4454850 5041267 5480670 5721946
18507 5721946 6075702 6495518 6730274 6962329 7220346 7576823 7918571 8427898 9524748
18498 9524748 10997268 13227244 16329302 21031650 28492478 41497877 64840759 103261530
18490 103261530 150986742 196298967 223962312 228459682 229203866 227822000 229955031 216694475
18482 216694475 181284063 136470549 92546534 63929814 47884137 38460136 32191727
18475 32191727 27542151 23990073 21704379 20047974 18412127 17256835 16572685 15925594
18467 15925594 15224970 14735111 14636168 15044378 15872626 17090150 18758664 21622911 26677690
18458 26677690 36006077 53124126 80467243 112404470 141595490 155825353 157284932
18451 157284932 157142304 156018242 156870210 143434611 117407978 85456028 57273009 40119664
18443 40119664 30146098 23984699 19868389 16710588 14309231 12697245 11456727 10351803
18435 10351803 9799330 9186424 8416683 7897588 7615685 7430843 7014814 6697667 6360491
18426 6360491 5852264 5449639 4970369 4529871 4276846 4093787 3822955 3625373 3433718
18417 3433718 3179780 3093706 3060698 2822120 2525915 2171428 1812084 1732806 1585023 1282821
18407 1282821 1349751 1228830 1026309 986587 1163660 1217204 1136063 1073464 1084151 1101137 1075612
18396 1075612 773775 500175 434413 491574 513844 574755 608282 587397 711769 851418
18386 851418 1009768 1055322 1133428 1238975 1151943 1079300 1069527 952829 845853 882770 1045862
18375 1045862 985181 678619 404506 391148 488114 568951 771799 920142 1019091 1169522
18365 1169522 1181440 1060287 941898 904422 783494 731978 801260 988833 971002 1025498
18355 1025498 964120 651071 316118 246356 196126 333083 501023 516745 584661 464806
18345 464806 450632 178717 380217 643252 598263 434034 330136 429591 367898 303598
18335 303598 523959 659135 631444 718342 710470 606704 691472 875634 824700 754725 570874
18324 570874 520556 473591 238880 119387 194111 142025 195965 73138 -145807 -215575 169829
18313 169829 249524 307394 347865 410783 254700 43809 8954 148547 264602 296359 132158
18302 132158 173883 288812 -44173 -121524 -97515 -67655 23413 -96566 78223 4952 -51690
18291 -51690 50527 151523 219525 175262 176773 215775 164514 132921 49529 -37933 -74711
18280 -74711 32540 -49314 108140 178035 101416 93204 238784 315200 263490 149058 226561
18269 226561 249530 186178 296359 308627 252559 410687 323519 44256 -6487 -5470 152093
18258 152093 153004 18201 118691 176111 215639 266107 149511 194282 245371 178308 180555
18247 180555 201962 -7361 -111132 112846 441498 404302 257229 51001 169324 135284
18237 135284 23527 -190549 -175197 -43458 -63993 62777 59510 48257 94707 54197 102770
18226 102770 30622 23498 131126 149749 183500 168410 129216 172683 274381 229937 200499
18215 200499 57248 85278 91552 148640 121290 -28168 140733 264050 337798 139874 112949
18204 112949 183874 230613 340601 330527 303872 369094 332009 249103 279477 191492 104289
18193 104289 69522 181278 157776 45904 67562 134231 112450 98013 128398 207543 177903
18182 177903 62430 204324 233937 310401 457736 476589 577531 521544 332110 237412
18172 237412 171817 89917 143989 157995 -13622 -38146 -20395 79754 250192 275959 185182
18161 185182 101712 207284 115263 122125 288852 206911 53258 145043 391209 436364 51021
18150 51021 25505 295298 290557 133334 87206 234420 258183 308148 458926 594460 816982
18139 816982 727058 478231 491339 555244 623367 578924 611220 466482 535308 716827 846399
18128 846399 1122510 1515231 1741305 2034042 2405770 2813819 3017332 3224335 3559721 4053245
18118 4053245 4565406 5127264 6023181 7366689 9184613 11984955 15978128 22034251 32212140
18109 32212140 50532920 86547968 154613284 248394240 306298725 307175954 227555660
18102 227555660 134204945 81214744 54517356 40448800 31556771 25270825 20994270
18095 20994270 17913106 15340815 13208130 11428479 10089019 8750067 7693680 6793176
18087 6793176 6145624 5620008 5109875 4840913 4491690 4134890 4025894 3668166 3313665
18078 3313665 3238859 3047492 2950457 2953816 3052785 3062026 2917957 2776142 2640092 2893359 3156772
18067 3156772 3025553 2708761 2566916 2260881 1908322 1550180 1396504 1409154 1153478 943030
18057 943030 885323 905014 860189 943657 1104895 1003252 806097 694019 524050 508076
18047 508076 432204 380376 280857 297790 401437 469184 300119 133547 266890 634344
18037 634344 1078411 1299217 1334402 1375275 1422218 1441271 1365067 1270280 1246475 1024496 794856
18026 794856 579928 391455 342219 394258 403329 485240 350216 248244 95370 -17937
18016 -17937 -167235 -146378 46945 45417 -25413 44561 81948 219874 83060 133771 87574
18005 87574 -136693 -162371 -37323 88757 139719 176230 178883 70517 276726 230663 32197
17994 32197 -39529 -80565 -75582 67846 229038 217251 15201 24999 142706 316546 484697
17983 484697 459423 387393 223276 201333 165150 127546 164939 74443 236994 159660 256939
17972 256939 201658 -127979 -128321 139823 340828 376930 344893 171882 219176 496714 348538
17961 348538 271965 253006 171328 -112295 -287615 -120964 -26326 -17407 84922 47535 139784
17950 139784 404147 617485 867583 1190860 1314111 1304876 1255630 1222001 1163250 1125194 1179760
17939 1179760 991638 750277 672655 665931 551735 689495 689656 540939 334745 120490
17929 120490 45686 47489 142646 139563 107624 125821 291445 284500 93091 48966 11148 63585
17917 63585 206826 234315 218374 354771 641353 840157 985331 1047651 1136068 1351516
17907 1351516 1462716 1220331 816981 651515 492304 428257 430606 318871 239604 266601
17897 266601 197707 171274 266894 149694 260720 288808 120602 65543 -18350 -104413 -13513
17886 -13513 186693 414631 472576 414417 222771 342088 321629 298092 335210 102991 71229
17875 71229 234397 295130 357614 412439 432066 351414 316789 325810 292564 171533 122265
17864 122265 204863 304629 338887 272484 263117 190715 207679 211003 238222 351617 354799 336197
17852 336197 106532 -133404 -183567 -15462 -39961 -87736 -126608 -83176 -12053 71508 303339
17841 303339 369121 137463 33584 11261 113327 155897 102267 174149 202478 231647 144859
17830 144859 33298 -37116 54351 163806 154855 2842 95596 185599 212659 116232 160739
17819 160739 172841 218420 170316 122104 -51089 -116386 -125584 -139570 -172774 -161051 -132280
17808 -132280 -119905 -63132 101549 136605 -66030 -253181 -366352 -359394 -206316 12118
17798 12118 225824 279916 213962 104816 27634 -164276 -296339 -295838 -162233 -304917 -168778
17787 -168778 -53578 33199 112053 137332 87401 90770 218836 305420 100903 -126863 -37584
17776 -37584 -83295 2762 19922 -113847 -185000 -338435 -386508 -281593 -154115 -79074 -181583
17765 -181583 -52091 -27562 -311828 -525343 -377980 -272661 -277123 -216076 -14291 82784
17755 82784 91410 163858 274008 225913 161444 10431 -9007 -183534 -214945 -162858 -100343
17744 -100343 -157937 -167277 -75759 -39246 1830 11660 153630 124630 86544 103624 224727
17733 224727 387276 515903 521113 453905 414218 353475 324512 288959 367076 366197 206508
17722 206508 -41316 -141533 -215154 -132496 -64443 -189201 -219769 -188005 -301594 -163672
17712 -163672 65648 37198 -55154 -284259 -386315 -279576 -169869 -228213 -172931 8832
17702 8832 -122371 -405696 -387510 -221694 -311432 -308592 -113550 55396 189628 179935 5084
17691 5084 -31403 110972 98367 37634 -76632 -101030 -83559 -91087 -87692 -188375 -97124 20159
17679 20159 86841 56990 -20630 -186100 -356628 -149640 -118105 -154281 -81790 11736 89322
17668 89322 120163 77186 -80320 -43281 -109905 -4479 181815 232964 98746 -47838 20094
17657 20094 -131885 2636 -4006 82318 25352 23901 409762 428008 216100 217836 176845
17646 176845 216026 235065 86962 17726 -17368 -189492 -342022 -239455 -4267 76417
17636 76417 59104 216209 55474 55979 129031 168854 104804 175986 128607 -111349 -157012
17625 -157012 -29847 -69932 -250646 -257511 -100659 -139706 -212640 -306079 -344569 -379660 -342434
17614 -342434 -146408 -22617 -71972 24241 44631 -195011 -277883 -98132 -204445 -263326
17604 -263326 -127663 -81948 40527 192733 349660 360792 212257 188877 130371 -75214
17594 -75214 44868 209147 132834 101022 139308 179351 110387 76102 216876 53933 12453
17583 12453 -4489 161261 306528 206997 166264 -91342 -236519 -226667 -135406 -164542 -73770
17572 -73770 133748 217724 371599 341646 275873 144667 62516 -29190 -47769 -41318 30101
17561 30101 130740 185926 277361 108481 -148535 -132880 -116836 12595 37744 92311 112094
17550 112094 110440 133036 144850 110926 -85782 -124329 -88281 -35897 -21178 -59440 43313
17539 43313 74004 39972 45885 238809 435557 705965 560906 218185 30773 -71687
17529 -71687 24160 -48811 -147245 -113454 -64475 13089 143917 -45341 -106001 127926 329728
17518 329728 336778 339150 200602 137586 -11479 -74170 66550 193146 134971 31989 -63407
17507 -63407 81267 255909 383524 309607 200836 153784 284106 -24159 -254981 -301569
17497 -301569 -183203 -138124 -207144 -96203 83259 107748 102427 41389 70118 57804 50364
17486 50364 169812 141657 1523 60234 79621 -125249 -284512 -242582 -147383 47742 -49632
17475 -49632 -93051 -21575 65944 115052 18588 24643 -36816 -240169 -135374 -66227 21438
17464 21438 12108 -85578 151476 171690 93836 -59904 -175201 -156124 -11257 81938 226378
17453 226378 320976 328758 184269 -15783 -95123 -141862 -167356 -300493 -126643 12978 95736
17442 95736 341296 666395 1248052 1771318 1646245 1314798 810319 408071 179504 210327
17432 210327 188597 270753 268761 324428 416945 157839 44049 81429 86572 -46026 -167950
17421 -167950 -55718 87856 254132 146193 -15403 -184072 -323192 -124559 -91084 119803
17411 119803 94720 -70586 -124413 -19183 753 72042 35276 -133300 -119869 -32628 -198741
17400 -198741 -351155 -288205 -453808 -485274 -284962 -138738 54959 -187342 -219585 -193799
17390 -193799 -128838 65476 157583 18927 -26275 -39683 150234 90442 -74515 -186713
17380 -186713 -110451 -148247 -130242 -54700 100286 159723 141485 142106 162222 181471 184978 215639
17368 215639 135044 -137141 -225147 -122959 -83386 156480 245182 252845 229246 55491 -20253
17357 -20253 -35499 -145637 -332331 -378875 -403333 -465566 -344776 -357607 -313539 -233513 -260412
17346 -260412 -351288 -284619 -85830 -88633 8701 39636 117934 116824 -141944 -247962 -183574
17335 -183574 -90119 49927 147513 121021 108876 201718 82608 24467 -5011 -62029 -104707
17324 -104707 -185602 -5837 11676 50420 61016 32079 -116205 -33319 -7352 -148609 -325484
17313 -325484 -431195 -331220 -242851 -265056 -194273 -115293 -1164 -116808 -33081 -646 -65649
17302 -65649 -115831 -178401 -59123 -115637 -259082 -296404 -380571 -418611 -404384 -444034 -291250
17291 -291250 -99415 -100204 -106032 -96496 -100499 -88489 -245775 -342258 -225774 -6510 6827 -52759
17279 -52759 -250269 -307340 -111069 -16667 -5745 75430 70267 51793 -93608 -157697 -76581
17268 -76581 -39877 57485 181544 210772 40959 42185 37976 -93870 -146222 -134305 -170101
17257 -170101 -149700 -4737 -62746 -36902 50189 12097 -13488 -14755 -219046 -159077 -95302
17246 -95302 -64317 -51987 -66429 -47895 34808 -11900 -119663 -251231 -327281 -220676 -78232
17235 -78232 -221607 -188279 28930 -9266 70566 -91424 -138894 -75479 -97934 -101828 -9412
17224 -9412 -38340 -3261 57449 32400 113067 86905 166094 145528 261739 246831 153481 136270
17212 136270 189485 -82517 -313887 -241631 -84993 -112062 -326937 -259706 -41928 66905
17202 66905 246500 322687 208814 169112 -5493 126584 213825 39499 -3401 47745 107358
17191 107358 62248 24869 39525 -97103 -279687 -296024 -229988 -229583 -237945 -200500 -111676 -68190
17179 -68190 46695 121095 61421 188183 58559 24131 62960 176410 63156 27510 1707
17168 1707 -76452 -144143 -90794 -16152 -108024 -23002 -2217 86557 179069 192100 22281 -231086
17156 -231086 -281869 -265248 -236630 -10761 180740 195553 -42905 -5323 135937 169276 108766
17145 108766 38942 -115747 -249586 -209644 -169312 -71704 -129973 -133808 -105281 -4823 -76021
17134 -76021 -184391 -142626 71121 86522 315754 444999 324467 175735 -28376 65954
17124 65954 6526 -11277 50248 62519 59692 88496 241388 133971 -60078 -30175 -136974
17113 -136974 -265214 -192595 14514 211392 184730 140123 189538 117982 143635 -55517 -78117
17102 -78117 20930 120674 128311 -23595 -218803 -313429 -80675 80060 73146 114384 181027
17091 181027 228082 139660 52002 59453 -7122 145889 118526 -87882 7439 4190 -171923
17080 -171923 -244289 -4652 -12888 -161751 -89551 1507 36050 44655 117980 75878 45389
17069 45389 89261 143544 208118 153296 -56574 -159175 -4704 202173 145863 156357 142750
17058 142750 271554 452982 327965 60565 -129227 -37029 121190 109684 -52560 -103761
17048 -103761 -257250 -209067 -308812 -417675 -290218 -311529 -403209 -414973 -277734 -125353
17038 -125353 2645 -18728 -139646 -224609 -151185 -76305 6016 24380 164645 199379 118312
17027 118312 -156558 -250154 -340055 -318699 -193870 -94332 -84529 -150055 -194718 -46646 64823
17016 64823 -161407 -208386 -117626 -92400 -58231 33440 64290 42109 53261 115673 22406
17005 22406 -24420 -17714 27914 51343 -13176 -268993 -343353 -294784 -201826 -105714 11011
16994 11011 -4257 -4067 3145 66719 -24877 144259 177947 154348 264827 236744 47583 46971
16982 46971 120457 82372 78285 -34059 -75358 50033 39686 -35022 -185764 -123115 62684
16971 62684 149341 162718 -57549 -109184 -58927 -92129 -207780 -106989 -98384 -188065 -294564
16960 -294564 -497150 -491178 -382306 -347284 -291079 -136541 -109006 -235848 -184217 -264863 -372943
16949 -372943 -345448 -316864 -232810 -185070 -204177 34623 127479 153971 216077 318453 362771
16938 362771 138014 60665 -272614 -322115 -186475 -210515 -159806 -129522 -254785 -181558 -91654
16927 -91654 -82279 -191032 12723 342417 270027 9230 -240449 -314201 -125941 -8674
16917 -8674 -200157 -160454 -165474 -88353 -18126 4084 -53557 42339 160103 135548 -17384
16906 -17384 202548 286291 249895 165753 164087 185302 188145 77774 -121044 -111443 -99407 -230166
16894 -230166 -189934 -178919 -160085 -144405 -125329 -134174 -108965 236224 340879 222303 133707
16883 133707 -53798 -120640 40002 117606 106682 -117219 -126293 -27722 -36133 -37596 4491
16872 4491 -160011 -154919 -205498 -207576 -287407 -257855 -205328 -219958 -99115 878 48918 74004
16860 74004 -82713 -260328 -215104 -15805 27217 -5909 10916 -11803 4729 -1442 -3814
16849 -3814 -19080 20773 -24619 -52694 -205150 -110067 -56165 2574 107545 179029 129862
16838 129862 76878 120498 298458 401179 364431 353261 414971 367846 113550 4623 107145
16827 107145 249773 24887 -125423 -132885 -175874 -299688 -350784 -252623 -204811 -255774 -317251
16816 -317251 -78229 146131 185056 189806 251896 244023 139562 82477 189238 272469 182375
16805 182375 136864 73084 180850 368390 424282 176781 24143 -60436 35886 163974
16795 163974 99585 37168 39133 -47009 5874 -32526 52763 189730 153128 165239 141400
16784 141400 298003 482487 487532 439735 345052 158904 185078 229924 -86258 -282341 -498275
16773 -498275 -346750 -260482 -200803 -255725 -205822 -25534 109612 74385 276403 154625
16763 154625 110210 134636 119760 85771 -207618 -398355 -293250 -71838 -58292 2268 -41966
16752 -41966 -137029 -181597 38028 82353 -102897 -313994 -71328 39720 53113 97628 8047
16741 8047 -98988 -79186 3725 -62358 -194248 -209003 -38432 47981 26125 -68418 -11704
16730 -11704 40400 99328 -28920 -79192 94192 154506 138158 57475 109059 -66914 -217014
16719 -217014 -165700 17705 191918 115298 -65991 -102144 -81326 -150825 -118179 -193328 -191142
16708 -191142 -108922 126849 319380 299987 326882 264021 218770 143885 85963 -2601 -115174
16697 -115174 -216658 -172933 -154050 -245566 -260725 -118220 -242604 -456301 -226319 -31997
16687 -31997 -4101 43413 -77907 -257446 -221122 -76009 -70979 -148621 -132825 -1019 41226
16676 41226 -98042 -10870 203724 205785 136434 70005 23217 45178 51240 169647 164295 188778
16664 188778 301423 140044 69268 -109724 -101156 183266 283150 198161 280913 320268 311247
16653 311247 293766 181231 104167 55968 36906 -33930 -135254 -329698 -239087 6401 307551
16642 307551 438307 319733 191222 146132 125368 98110 64423 190786 179254 64165
16632 64165 -24225 83908 192538 151762 80713 81815 103260 40439 64707 75030 -233954
16621 -233954 -268692 -258009 -206673 -150546 -48279 11581 -108375 -108436 87794 186071 250178
16610 250178 227327 108284 -52593 -190740 -107848 -107690 -205546 -112870 -87733 -18162 176923
16599 176923 201282 -82187 -3644 5223 -171304 -253936 -105286 -17082 -64431 -123491 -101396
16588 -101396 -72981 -25569 -53809 -143420 -33480 151058 225402 61396 -84658 -189961
16578 -189961 -141822 42124 241890 171253 103116 62193 -18905 -182667 -138409 -44545 -202620
16567 -202620 -305500 -307858 -391689 -471407 -434759 -275428 -99573 22059 53675 -33300 -194476
16556 -194476 -284030 -154751 24088 154155 240621 122047 34730 11815 -11678 -54191 -51131
16545 -51131 -94209 -25215 30456 110717 68943 39190 128880 71335 118060 -2387 -133216
16534 -133216 -184688 -199856 -45348 87508 123608 134605 305060 296942 113809 -159683 -235873
16523 -235873 -273589 -74395 -74695 -89857 -182636 -272995 -340465 -405759 -477477 -348095 -220434
16512 -220434 -256646 -108917 74351 124266 125283 97452 131030 112772 -50760 -6337 20581
16501 20581 -114363 -77886 104754 30131 54281 226204 264031 113087 103385 58590 76385
16490 76385 -32425 -44233 51462 57813 -55657 112960 90407 42775 76100 81072 152262
16479 152262 224611 141481 -98505 -127931 -30678 -123244 -189232 -98232 -134619 -66260 -109084
16468 -109084 -255052 -175306 -123184 -136048 -227859 -340341 -53120 108814 96774 73502 127241
16457 127241 138465 91328 110003 136765 227616 173681 98792 93487 168665 -61166 -220793
16446 -220793 -210950 30393 104830 49501 -67608 -247262 -267335 -291352 -292596 40979 117838
16435 117838 89590 91421 9614 30973 109617 133824 138125 142134 -13930 109826 190894 217961
16423 217961 357452 325974 331794 215635 214584 297836 194481 -56779 3321 -76610 52616
16412 52616 167566 170794 -89012 -151218 -60248 22703 43048 79452 22204 111110 158331
16401 158331 57894 -108429 -258384 -446426 -383502 -230120 -210825 -160255 11177 -55501
16391 -55501 -135482 -191275 -89306 196470 239273 249835 395331 406595 177147 17143 -6018
16380 -6018 -214436 -69836 92815 84272 -9729 90568 81896 36761 -65320 -123238 -136525
16369 -136525 91493 90502 94883 44948 88484 133617 55861 36967 21917 256138 294388 237679
16357 237679 280437 166504 55588 -5828 -61790 59146 134955 66985 -109317 -141888 -135270
16346 -135270 -150664 -150840 -52291 -61353 -125641 -105189 -270556 -311529 -297421 -278199 -267578 -112680
16334 -112680 22420 175667 114237 -68833 -76709 1575 55039 223621 303094 286448 308920
16323 308920 197086 99013 249334 223558 -7275 10409 93217 238914 276440 136120
16313 136120 -68346 -206456 -132452 -69949 70639 101821 63083 135969 185494 105829 144422
16302 144422 142857 83541 -13275 -60078 5268 115171 -67041 -106485 -15927 104484 138998
16291 138998 62092 72449 -25672 -208496 -193018 -50529 -146622 -69712 -81761 -77260 -4907
16280 -4907 27723 29671 -71591 -83716 246306 213198 147455 189749 311304 336509 139798
16269 139798 60864 53417 -17138 -21044 21180 114768 176960 181976 142475 31969 60832 110074
16257 110074 77041 7092 -24583 -332 8595 -145240 -303651 -304975 -291249 -160175 -67115
16246 -67115 -145657 5413 32666 -12925 11835 196688 61975 -134180 58891 173216
16236 173216 37839 -175310 -29864 144227 51845 -13467 26426 268666 276267 166301
16226 166301 -93097 -200118 -149988 -151551 -66743 -168205 -110387 151798 322742 264115 226169
16215 226169 90324 79970 28031 224132 231648 128155 116850 -48633 -142865 -218911 -158232
16204 -158232 -184062 -130450 67562 86271 76478 198570 153509 270437 192993 -75954 -118263
16193 -118263 -57648 75921 -37447 -94252 -70552 -50681 44118 -22748 -87543 -1945 1309
16182 1309 -32208 83695 210829 46032 -261758 -269313 -111014 -114824 -112553 -6353 -20119
16171 -20119 -11958 -222988 -158553 -23452 14196 -4509 15311 -126089 208 -105550 -121173
16160 -121173 18895 76315 -40212 -38684 123230 -60118 -135744 -119241 33597 86707 -46493
16149 -46493 7171 1759 -177502 -82460 -1935 18994 96899 128827 29396 28734 -33238 -38107
16137 -38107 -171073 -208610 -59157 -20204 150379 170284 193749 192798 127860 124847 -43198
16126 -43198 -239101 -306917 -207404 -88221 -29171 56838 -6354 -82069 58937 -20139 -116010
16115 -116010 -169757 -234192 -192796 -94249 -40745 -56295 79211 174055 174369 129794 -34269
16104 -34269 -87252 -81507 -1204 -12051 -60606 -167656 -137090 -2821 -52392 -120940 -159038
16093 -159038 -57610 -102004 3474 -87014 -293184 -282871 -132598 -100909 -209129 -168269
16083 -168269 -82268 -38536 -170495 -237895 -199911 -188328 -290756 -355549 -244078 -88241 92139
16072 92139 -3918 -175510 -178595 -138336 -83477 -51180 42526 50018 -53390 -187284 -106297
16061 -106297 -208309 -458790 -248713 -100523 -159541 -251399 -190869 -181005 -237644 -39578 39278
16050 39278 95454 11001 1525 168595 261519 142355 -22354 -82726 -143496 -76730 -69135
16039 -69135 -35054 -191935 -120600 -84843 -165054 7859 102410 3262 -73674 11549 66061
16028 66061 33229 87052 198272 132988 101498 16686 -22214 64477 59736 -49678 -215570
16017 -215570 -329615 -168239 41139 159464 142037 113661 59917 109951 158921 96297 -95303
16006 -95303 -301697 -358777 -229321 -13101 -202753 -235159 -27607 66058 -16898 31357 -30095
15995 -30095 -80329 -174850 -167724 -136251 29717 51574 -68423 37185 150905 102146 29342
15984 29342 130018 -115027 -296329 -145278 48362 -21558 81259 186450 84223 129994
15974 129994 118606 -6209 -121707 -75668 -77052 -125075 -120168 -27193 51528 69870 81068
15963 81068 93943 183100 252188 253982 194858 62618 -154822 -86319 -47204 -22544 -76536
15952 -76536 -93216 -132041 -177339 -124594 -3316 -2225 -9578 154126 115011 115578 143217 165892
15940 165892 75774 -141214 -37606 -100416 -85825 -49239 -26501 60288 -62755 -249948 -189178
15929 -189178 -223275 -191600 -91796 -60783 86818 12139 31684 104610 -299485 -544346 -406338
15918 -406338 -4076 191474 -15914 -161860 -117214 -73902 147287 333782 407160 225386
15908 225386 30732 -52652 -11504 34765 5744 194345 260281 164712 -101144 43281 191219
15897 191219 135202 -53074 -1886 63952 9441 -15794 53808 12283 -106271 -34928 73208
15886 73208 196673 145375 142939 84090 13351 -56100 73242 107460 -42408 30587 201785
15875 201785 209068 227793 158734 75379 -21258 46907 229472 118614 58893 -5897 -16779
15864 -16779 -136918 -238541 -114477 -147307 -187144 -109819 100633 116926 -37415 -172573
15854 -172573 -104184 -94370 -76335 -2925 -15628 16149 -34447 80888 -90539 -28151 45810
15843 45810 53858 -9564 -217454 -296247 -59631 -109227 -160973 -86678 -51343 50813 220364
15832 220364 177599 76996 -110463 -90482 -71978 67653 148728 185456 192405 85311 -182529
15821 -182529 -178762 -78761 -190953 -89689 9517 23113 42794 -136086 -118090 89212 257107
15810 257107 183951 70629 133592 188172 265309 159499 216760 304268 49868 -133944 -132393
15799 -132393 -210838 -98984 -198573 -326696 -296869 -72322 115815 127730 48015 51792 64510
15788 64510 183044 166919 -46953 -110556 -68716 -94786 -197965 -162852 56451 123922 91800
15777 91800 59219 185 128523 58696 -91797 -99527 -69785 -115312 -124645 -87528 145824
15766 145824 180781 125428 -13052 -179863 -271653 -147799 -56099 -189300 17238 139135
15756 139135 -29638 -154721 94131 164067 -15560 -220444 -151588 -73114 -74264 -213335
15746 -213335 -147979 79303 53806 98976 102149 142378 28962 -249240 -351018 -278340 -265667
15735 -265667 -158454 -115613 -155379 -92944 85561 156506 157837 -1622 27777 193483 158218
15724 158218 41811 -1189 -89551 -134304 1272 40100 125566 -47980 -33443 -10485 159600
15713 159600 352562 319771 151866 -36086 -61329 -48150 -693 51744 -94391 -29033 180360
15702 180360 274785 160700 243 -144839 -130787 9741 -19677 -60330 -203714 -140469
15692 -140469 -239969 -313561 -210722 -54834 -36967 -161076 -163131 -122861 -69749 61288 73112
15681 73112 45101 91154 -117484 -134220 -93771 -78188 44513 135597 193522 168871 218816
15670 218816 54247 -64138 48309 294256 363734 236818 110716 -53227 18221 -65058
15660 -65058 50633 -167710 -31817 156132 145034 111491 114516 164032 279134 345642 200395
15649 200395 192483 134340 92388 -56351 -93634 -107538 -129776 -103463 -58342 89228 94302
15638 94302 -7531 -41171 -132086 -82916 44474 -51907 -72236 -15508 222752 302539 197090
15627 197090 340734 420310 477145 524731 493138 265189 103617 109321 172474 189285 113379
15616 113379 158549 150815 44377 -66247 -2305 203827 283754 131364 29860 -10481 150639
15605 150639 275258 191366 59322 1945 -208282 -278122 -324735 -118482 90923 28141
15595 28141 3298 66034 67063 88158 156844 117259 -9728 94755 118207 184462 182041 92946
15583 92946 46305 -15910 26550 29997 86201 33504 106690 252094 167059 130222 -112236
15572 -112236 -426029 -475101 -306182 -186659 -241019 -249057 -103073 -95428 -82568 -152545 -230059
15561 -230059 -204990 -194052 -168713 -235318 -204916 -427442 -468068 -403848 -235668 27784 -51601
15550 -51601 -142188 15558 82699 -108920 -172642 13146 132977 82576 50316 51904 -61499
15539 -61499 -192831 -171312 -2380 -7594 49019 157363 312800 298091 354807 341736 209785
15528 209785 174296 254018 270440 234778 97345 -46856 -151862 -201749 -210382 -49739 64289
15517 64289 150889 161964 194464 259944 245215 125827 85365 116141 -59608 -79235 65348
15506 65348 -23045 -101921 -69452 147782 134451 100970 127725 128029 67693 -153435 -180419 -28490
15494 -28490 28713 122076 196448 120487 66347 136230 8542 -115265 -129207 -142866 -40022
15483 -40022 -76696 -80535 7585 39078 136718 145222 229249 250887 326075 113792 41911 18307
15471 18307 191201 253491 108498 11787 101608 145384 148216 167724 -26801 -113369 -124376
15460 -124376 -133045 -1217 81219 46688 25056 45849 74462 201381 -8475 -201810 -299489
15449 -299489 -467179 -393222 -211784 -273639 -208896 -214593 -110469 -18821 1097 143369 224117
15438 224117 128192 110497 238642 290425 247743 -10001 -156478 -38665 -91342 -6842 -167731
15427 -167731 -213828 -231339 -133325 -9702 -48316 13607 132358 198863 160012 107726 54038
15416 54038 86883 -25475 -192964 -280950 -179201 -166557 -145753 -13813 256397 86961
15406 86961 52281 70255 -199622 -411157 -192736 -135054 -179040 -98113 -76323 -69546 -128739
15395 -128739 -92390 3665 44088 127641 118727 40644 146111 199220 106952 49834 9064
15384 9064 -32006 -38969 -105356 -45036 9167 -6959 -108871 -415476 -254768 -181803 -227030
15373 -227030 -277451 -200626 -96907 -81169 11660 -33923 -66247 -5349 -129028 -123755 -247782
15362 -247782 -331989 -144886 13365 58742 26417 16810 94574 241019 144721 72587 -123485
15351 -123485 -229980 -296411 -199103 -172528 -100322 -51558 3243 19503 58675 -26941 -128923
15340 -128923 -206069 -133638 -24725 -72354 -58131 -62296 -284497 -353881 -277319 -235956 -126947
15329 -126947 -262247 -382152 -320856 -69865 115891 146044 139462 241385 145965 137408 156467
15318 156467 95709 89562 29501 98177 177027 13602 -20218 19211 141570 146551 180761
15307 180761 30089 13919 96450 192302 266293 306066 189930 54626 5398 -56169 -30980
15296 -30980 22939 -23199 6838 15060 47366 110581 216892 112297 71886 9100 -35274
15285 -35274 -101393 -23297 5941 -56726 -143443 -88074 -17416 173475 160985 49391 -38230
15274 -38230 -247939 -374839 -211229 -49118 90248 70370 -35683 -71140 -20977 46823
15264 46823 55343 6760 73465 7449 -75989 -186007 -248530 -277893 -281630 -265632 -147479 -58498
15252 -58498 -59032 43534 113300 -28538 -197082 -110925 143095 179433 -107253 -215635 -99997
15241 -99997 -11406 -36241 -94404 20890 140682 7063 48033 115509 102152 160466 142945
15230 142945 199120 -6152 1732 69030 35300 -129687 -9733 202531 203672 28292 -15135
15219 -15135 -43056 -200956 -270253 -133725 -24850 13716 196454 195565 203581 255328 230703
15208 230703 35421 45938 114297 103877 174030 70612 205126 256190 202192 265311 239968
15197 239968 203690 83281 -51848 -34412 -91983 80274 313331 229173 275855 192345 190208
15186 190208 331407 427082 452282 314974 357590 342400 307407 311067 185461 205101 221406
15175 221406 224439 -20295 -101415 -59234 115346 187961 79836 35527 -3603 10192 46710
15164 46710 -34005 -175409 -317861 -361039 -312670 -232049 -258764 -70033 -152093 -230839 -305495
15153 -305495 -290829 -130409 93280 193460 107508 109948 242923 361515 361559 194033 157330
15142 157330 -2691 -3363 97194 13019 -8689 -47087 35451 -123933 -139409 -32688 -23767
15131 -23767 21977 -34018 6898 -12122 -112969 -177167 -76336 79540 200639 310469 408702
15120 408702 286528 191547 56121 77547 -9906 -54459 -18068 -50899 -72247 14615 -161017
15109 -161017 -10247 178793 99059 4502 -156033 -67501 -51161 -53843 39818 206294 178774
15098 178774 83387 61181 58436 56104 106849 -30365 -181476 -199155 -292205 -275127 -169079
15087 -169079 -110977 -121544 -52452 -56781 -88911 -47960 -114513 -162084 -131825 10475 115348
15076 115348 163257 51639 -9823 -30554 -108038 -230319 -155584 -192222 -228707 -225398 -384122
15065 -384122 -363214 -361811 -227955 -178374 -308310 -243031 -185698 -51372 17849 -41410 -220190
15054 -220190 -163430 -74179 -55528 16427 110954 -106666 -175063 -181531 -194106 -174519 -214299
15043 -214299 -175314 -87587 108447 130719 83915 49594 128075 -52975 -273908 -266510 -121528
15032 -121528 -17025 -15307 22303 49940 -145637 -295709 -38304 -79239 -184970 -152160 -39675
15021 -39675 32986 38320 -70837 -211592 -193249 -199155 -37702 -45926 -274687 -428714 -415797
15010 -415797 -330843 -228215 -81791 43951 -56130 -86779 -108970 -45381 -262014 -249808
15000 -249808 -177234 -212864 -93361 -44094 53002 138024 169920 32488 61749 122449 -102069
14989 -102069 -111340 -185098 -131519 -50478 -46681 -120453 -104503 -116033 -29610 179204 257967 247278
14977 247278 135290 108136 195709 225790 72561 107490 139916 28577 4143 55490 90592
14966 90592 20342 212277 236449 139468 5047 203101 302574 234861 140339 316503 299433
14955 299433 172965 47342 119840 245918 162843 102961 104030 117401 169847 128294 82463
14944 82463 21197 83949 79314 62645 -5143 -90749 -95264 -121868 -102167 -6354 56656 51528
14932 51528 45267 31953 175448 217331 219693 225481 413243 363403 356667 420892 240645 126892
14920 126892 110154 35286 -2512 57243 82857 184027 123910 -9917 63090 167606 129619
14909 129619 152638 137088 181796 180066 -80012 -143104 -113158 162095 117779 18651 86678
14898 86678 185202 124927 -91412 -203572 -235045 -77708 -18023 -165985 -313799 -195698
14888 -195698 -184048 -387678 -187523 -98338 -160681 -40318 21475 25148 76106 -6681 -46806
14877 -46806 -38398 -13755 11509 107442 155391 52030 -38904 -56288 -148103 -318927 -105545
14866 -105545 -144340 -294358 -402005 -294644 -263195 -264722 -144653 -51667 42084 -79152 -27744
14855 -27744 1275 -97036 -127528 -139497 -128764 -33725 -73223 17296 36422 109796 184290 14959
14843 14959 -194575 -217527 -162500 -88965 18300 142784 34742 120558 246810 250965 131462
14832 131462 -18142 -90666 -62176 -151894 -203088 -213545 -97595 -2462 2366 -29047 -95531
14821 -95531 -191251 -34250 -10688 -74643 12337 218002 19009 -74870 177605 296896 160231
14810 160231 54784 -18342 -40876 38160 -95960 -104600 -313746 -351758 -138356 -90865 -153333
14799 -153333 -70693 45025 200649 176737 57237 -103985 -174088 -91854 80289 183926
14789 183926 196377 91111 -80044 -156662 -41182 158550 130567 124549 107530 72631 -7827
14778 -7827 89379 223177 281133 206160 284595 265660 224262 213186 94519 30168 28764 95125
14766 95125 139819 168097 157958 121628 6671 -63508 120676 274916 280410 228962 53519
14755 53519 109508 95443 -70682 -238795 -208388 -244597 -337122 -271810 -135821 -201052 -270751
14744 -270751 3307 69613 1272 -222597 -178025 -47991 -66703 -12087 86479 167734 345099
14733 345099 371996 160285 7344 -6626 -62729 -30905 26404 13043 -73248 -171163 3097
14722 3097 56845 123855 139128 246388 215779 262284 306345 109213 -9507 -145125 -79020
14711 -79020 -117542 -285809 -192561 -100334 -160243 -253368 -167914 -73889 -14016 -3362 42067
14700 42067 76935 -115449 -268413 -218743 -46933 2545 -51672 -15677 78473 68817 -18094
14689 -18094 43205 36077 -52815 59178 -14079 -72952 -82147 -48513 175060 220803 50943
14678 50943 1414 -18247 29835 81523 -14266 5006 -126253 -237754 -309148 -288320 -205057
14667 -205057 -118911 -57068 -143135 -161141 9298 34460 -50196 -48157 -25192 -77613 -176792
14656 -176792 29775 78091 33517 3215 -1529 101410 128710 24898 -244320 -264475 -239617
14645 -239617 -237687 -254178 -94673 197207 381853 236958 156461 148753 119846 224044 235041
14634 235041 89330 52980 142521 109936 98958 103959 117695 81936 -104245 -245007 -229361
14623 -229361 -55037 -5940 -42708 -90566 -82099 11391 327820 434327 219117 -83202 -241313
14612 -241313 -337227 -149808 55800 -92653 -91844 -31681 -63366 -18168 131101 200283 210714
14601 210714 237118 210635 110448 71267 87025 11238 -73534 -99806 -121629 -46324 -83415
14590 -83415 -51536 125764 -46666 -118626 -104925 -47126 -73678 -151169 -14865 198557 135045
14579 135045 147881 215211 157481 119717 45527 -16239 11537 -39240 -68026 -18825 84931
14568 84931 -5338 -37278 -24771 168234 212722 64043 103217 147438 91042 118031 -75944
14557 -75944 -232220 -144515 -11522 -55669 -86909 -98898 -173070 -81453 -149301 -76746 -62555
14546 -62555 -115021 47679 236740 60975 -25153 76651 129231 164143 139074 187281 183110
14535 183110 210694 213624 182015 97478 -182583 -285453 -199972 -140095 99011 180926 123258
14524 123258 210977 596123 533984 371149 202284 40259 -113931 -173772 -162469 -246119
14514 -246119 -49224 52143 -203150 -285775 -76083 -88665 -48856 79280 -37445 -165059
14504 -165059 -256824 -141686 19501 -53147 1462 29359 25718 -51559 -44815 -59816 -96766
14493 -96766 33998 119767 -52032 -105815 -146459 -84285 -25144 -71713 -184128 -185048 -145236
14482 -145236 103114 262297 62843 29542 -139339 -251440 -84943 67497 168879 136077
14472 136077 93812 211854 263998 213199 111097 -11223 -32756 98958 103189 24317 23256
14461 23256 88901 216767 287425 126295 -126189 -146434 -3913 40175 -60940 81742
14451 81742 291369 347788 289431 79807 -72152 -33388 11073 5475 30298 86507 144602
14440 144602 174209 138713 167925 157227 -25251 -102297 -319668 -337268 -278085 -265475 -174494
14429 -174494 -262085 -64807 70467 123418 29024 33513 -82323 -33679 19092 14149 -32860
14418 -32860 -212796 -265644 -251993 -189827 -100434 -2537 67659 14934 -43234 -103872 -89131
14407 -89131 95673 193886 -70202 -235102 -143131 -27254 -87460 -135250 -158263 -132445 -21232
14396 -21232 164754 282544 216654 296122 358900 170591 214431 83565 79486 120033 94627
14385 94627 18319 -183251 -312325 -313400 -299043 -200640 -18110 -52778 -183148 -140010 92183
14374 92183 183282 230694 241723 188104 148375 -48689 -30639 110305 190711 125150 -10958
14363 -10958 64050 -73490 13175 -25331 -84409 -95221 -113873 -112326 -283328 -268967 34758
14352 34758 142815 -25312 65691 -79040 -339645 -292830 -201141 -32092 -202420 -249114
14342 -249114 -30371 44638 -52093 -65577 41869 153402 75439 -21429 -89912 -105875 -121035
14331 -121035 -133121 -254237 -321124 -210391 -215100 -166198 -78432 -65483 -195578 -222155 -63860
14320 -63860 74880 145267 87562 106167 98233 28188 -1337 -166914 -42963 58397 183442
14309 183442 93072 -123043 -253758 -262462 -206615 -282356 -97588 59265 -99452 -141459 -81159
14298 -81159 -76121 134412 184490 133025 141005 37182 -157201 -83586 -77646 -244243 -282171
14287 -282171 -49792 98716 147038 -19992 27607 122621 151238 199812 42688 80467 62386
14276 62386 -24155 -31280 -71771 -207141 -283543 -295084 -192630 -289845 -164181 -115225 -87617
14265 -87617 101943 221397 276804 213650 108678 113903 187033 218785 135579 147052 334845
14254 334845 319678 143084 76473 9011 68304 -41745 -200566 -28568 -26964 57366 49010
14243 49010 -12114 -26165 -245508 -139593 7466 -9776 -90099 -208365 -316685 -272734 -177991
14232 -177991 -145412 -191852 -207147 -290022 -219143 -105450 -132763 -157366 -67411 115682 124239
14221 124239 99588 147613 -81100 -125591 -142732 -127591 78376 189298 189573 -24384 -183506
14210 -183506 -17345 6853 -121412 -113132 27654 147129 167188 269080 228619 33844
14200 33844 -60132 -150742 -230432 -201137 -140461 -139680 -181277 -297924 -184291 -174713 -203407 -170703
14188 -170703 8850 41076 -37105 -69202 208430 256857 422020 279123 64592 -19049
14178 -19049 110750 -12285 -4823 -38645 -54182 -172947 -122081 -89860 -97403 -98085 72447 135902
14166 135902 135565 42913 -64753 -52392 46358 256526 272730 253755 226221 162039 152566 55820
14154 55820 25296 -36419 10332 148137 274338 285967 161343 195025 234618 171983 223739
14143 223739 221879 138217 61657 274459 159997 241672 324613 136009 137385 89351 -27673
14132 -27673 -207890 -317962 -188306 42478 24109 -212235 -50165 -27967 74554 111525
14122 111525 22036 -125719 -93277 33126 96693 26317 36349 63887 -60572 -4440 -145727
14111 -145727 -185525 -159555 89677 62703 167924 389687 361912 163286 10066 -62382
14101 -62382 -59723 -82622 -300341 -283492 -183584 -261409 -414872 -243266 -264360 -264274 -150012 -113058
14089 -113058 -178429 -225964 -90564 -38872 47465 115416 53020 -46404 -122871 11295 138981
14078 138981 365842 295117 14412 24090 43403 67896 -135924 -239776 -106212 -117357 -170308
14067 -170308 -107058 14408 11761 -193316 -303814 -215168 -99540 12834 72290 8016 1512
14056 1512 251410 205941 114335 64033 -44749 33799 -30799 -147729 -45811 -133110 -134085
14045 -134085 -52953 -183847 -181432 3700 73864 238616 426731 425025 351147 291595 348343
14034 348343 294535 102821 -13617 128415 153938 185863 257075 172368 3566 29277 27000
14023 27000 -49857 -51849 9275 38144 76748 -142935 -238301 292 129880 -66941 -37190
14012 -37190 20926 147163 99767 -11766 16247 51306 -80610 -71317 -311129 -305676 -83010
14001 -83010 -15289 -167875 -20701 188350 130728 45154 -114938 -331859 -434249 -350933
13991 -350933 -328139 -321393 -223462 -62302 1619 79793 -83524 -224942 -216260 -168020 -86922
13980 -86922 28893 4956 8759 -112668 -139074 37792 127076 961 -8275 43826 -21364
13969 -21364 -57006 -88036 -114764 -140403 -299438 -110800 -22325 -162394 -288403 -356134 -487595
13958 -487595 -283770 -146901 -144622 -157005 -260581 -332024 -209233 -97391 22233 -26683
13948 -26683 125197 307822 249711 58196 -186317 -244655 -122332 -138748 285 228705
13938 228705 105358 -108842 -134148 -138006 -147081 -169410 -215363 -100006 -147930 -247272 -293640
13927 -293640 -179917 9820 121234 130377 103772 -76355 -187727 -140211 -142636 -96151 -138233
13916 -138233 -76322 186084 179794 193391 131584 -6294 33810 184473 235353 246221 68733
13905 68733 -58734 65801 290758 377181 276968 195854 145304 185250 155232 280070 96202
13894 96202 118797 242767 217683 12807 -91445 -251718 -171674 -96960 -135368 -112462 59978
13883 59978 -31239 -33302 -40286 -134905 -219312 -139431 -91280 -290182 -384585 -255193 -117096
13872 -117096 -155679 -231516 -253467 -355568 -331534 -182569 53151 -135530 -243734 -99771
13862 -99771 23715 71360 165236 382153 425986 372257 290803 224396 300428 297529 117952
13851 117952 79212 -56048 -159392 -226857 -229708 -251515 -228554 -112759 101063 254409 125338
13840 125338 -55594 -147952 -78478 16445 16340 113727 226216 109858 40358 43038 106183
13829 106183 -30183 29853 -7502 18382 65637 211220 154377 29743 -55640 60627 55732
13818 55732 -9393 26032 79018 -30793 -41562 10869 -101013 19935 97984 120053 109899
13807 109899 223043 169226 -64482 -5607 16997 32802 12773 112284 256814 324963 268724
13796 268724 20252 122126 177265 82811 -3717 125256 298094 285281 197998 -94403
13786 -94403 -144498 -200647 -65907 134726 293314 276154 203936 -39426 -114356 109968 153234
13775 153234 151330 48099 -57899 -16996 -44191 79233 217072 103138 -5821 54640
13765 54640 37558 -168193 -320689 -56000 123764 133610 15361 -38307 -5171 -16159 80634
13754 80634 288923 211588 58023 35942 -38514 -48089 -76162 -191095 -99158 119843 87713
13743 87713 -98186 -250863 -65898 69536 19704 122204 302033 211725 133827 149316
13733 149316 -12700 -161541 -301592 -225746 -128005 -46969 57062 189455 162212 44490
13723 44490 -47047 37713 44064 86950 -56253 -91312 8982 54138 -52668 -136745 -196524
13712 -196524 -179569 -229174 -292316 -252324 -112813 -77277 -105335 17797 63527 81012 135720
13701 135720 150804 64986 79979 -5354 -131005 -70380 6883 -83248 110099 262865 379863
13690 379863 222054 41962 -88569 -336407 -301535 -164690 -106018 59575 77864 140606
13680 140606 144330 52323 -31421 -9501 -84892 -56639 61974 86180 -49638 19365 32504
13669 32504 -64611 -25638 44997 67382 168636 21153 30043 101047 -38592 168401 272759
13658 272759 256326 203593 180784 52453 126570 75052 15817 73078 292760 326123 -357
13647 -357 -86008 -92152 -324764 -332892 -116076 -80308 -277811 -343381 -311498 -268961 -266736 -253946
13635 -253946 -25858 113504 269882 259858 243156 273292 228961 291666 102999 185998 271460
13624 271460 329889 357715 272583 238941 177624 16468 6343 40142 169701 172565 48999
13613 48999 242429 356991 206753 30188 -91643 -168345 -120989 -122809 -34083 -83584 8623
13602 8623 99553 -68252 -144131 -91277 61649 143824 -80381 -94870 28025 49105 32239
13591 32239 -31158 -9061 195769 200896 -65931 -199439 -120335 -71789 41337 -1383 37062
13580 37062 160847 151867 122439 18866 -31683 16505 -86615 -109421 -154977 -200168 -144339
13569 -144339 -314761 -390829 -151659 -159337 -174992 -155593 -56004 -4383 -63767 142335 252150
13558 252150 214983 35002 -136076 -363510 -220795 -60203 84036 191338 315468 312303
13548 312303 208166 220223 210719 44193 -4577 238158 309488 185138 -10516 36963 178764
13537 178764 84444 114034 59947 199111 238471 161500 54947 31759 5104 173879 257671
13526 257671 67962 -140774 -127138 125614 376837 245614 24666 30635 197367 218139
13516 218139 -24071 -14622 -65746 -45259 -156281 -141646 95422 376129 335777 26047 8135
13505 8135 38651 -198856 -287791 -178969 -264447 -272970 -333189 -240686 84173 160851 73875
13494 73875 -86109 -166731 -120413 -7160 17549 -17008 -189586 -176624 -147409 -23158 72505
13483 72505 -31003 -4824 4359 15606 -35644 27455 7965 78597 105379 73635 155683 110046
13471 110046 212606 142739 41217 79884 102009 32605 287405 439857 212161 236629
13461 236629 369316 295403 178493 177358 161360 34055 -52953 -76308 -22812 -63011 -7271
13450 -7271 -22447 -140217 -145335 -65781 -27636 -123134 -137955 -99885 -126231 -191092 -144533 -84962
13438 -84962 -196004 -102408 -68262 -84030 -54881 -23340 19774 3747 68499 -114218 -30163
13427 -30163 -66919 -39227 165210 337237 265846 237124 299216 277383 142170 -31350 -24472
13416 -24472 -77013 -328546 -323493 -179770 -120011 -90653 -46749 -131437 -257947 -209287 -147424
13405 -147424 -38085 21346 71550 -90055 -180500 -241609 -192677 -7881 117057 191264 124337
13394 124337 47731 -6881 -183363 -187680 -167404 -267731 -225919 -121823 -52810 15026 -4117
13383 -4117 -64386 -63985 -47936 -66682 -55534 -67942 -162139 -63207 -65263 -226055 -199677 -139221
13371 -139221 -178116 -208309 -78048 85649 125784 78097 4101 -135881 -77002 36634 111566
13360 111566 54211 51104 57173 -12812 21327 -96204 -12696 -74921 -84401 -105637 -117603 -85066
13348 -85066 153413 282852 371456 158340 -33294 -124352 -61880 127550 225815 227348 218617
13337 218617 86856 -9920 14040 58927 96950 109065 68546 -57251 32624 77774 -35339
13326 -35339 106203 200878 -17655 -142256 -78311 -84692 -178945 -56030 36089 131057 -22396
13315 -22396 -148340 -130862 -62437 54949 71703 147760 149536 108745 110053 201283 133359 -14999
13303 -14999 45680 80949 158466 171189 -14347 -261707 -215803 -15303 113464 20689 -29799
13292 -29799 95257 121529 132015 105937 130549 39029 -203060 -202336 -88760 11479 -162296
13281 -162296 -80908 170722 120128 -22207 30652 98276 -16919 -39909 5825 -32346 -122148
13270 -122148 -101487 -174272 -262931 -241035 -247610 -12280 109614 17083 19295 36891 -109828
13259 -109828 -3237 -38983 -29688 -233688 -210956 -33944 9983 -100339 -102249 -187302 -57566
13248 -57566 153492 108777 25572 -151737 -298745 -251612 -130463 18509 146098 117587
13238 117587 -131220 -246534 -45620 122313 275142 351395 469308 384747 162050 2040
13228 2040 -14393 46727 68334 128570 96369 43876 -94369 -211874 -72539 5566 -48067
13217 -48067 -49108 62185 85734 181829 133885 28312 -2818 -2772 11040 99814 168400 167372
13205 167372 171132 111100 178835 222742 122621 -7994 -211180 -172520 -18853 -20578 4069
13194 4069 -12334 -21364 6298 -51966 81971 130613 95048 84156 29339 -23367 -130952 -321801
13182 -321801 -350114 -217939 -81116 -116344 29843 176804 96011 166612 176864 186850 132119
13171 132119 -43082 -116916 -174025 -258881 -376898 -176370 -92090 -33098 152020 240850 163242
13160 163242 101693 158584 -24387 -143817 -149517 103183 201117 167079 234652 224173 213002
13149 213002 178811 138180 732 89462 103114 194733 222346 137128 16415 55970 -42386
13138 -42386 -16116 56560 96623 -114808 -134698 11046 54998 -120223 -157406 -210394 -303496
13127 -303496 -262592 -144281 -22292 131193 109952 -53433 -79877 -90154 -39099 -87847 -172586
13116 -172586 -84237 -79864 -164361 -25931 13501 -101924 -141309 -85475 -30249 -188518 -177491
13105 -177491 -174009 -91209 69822 104068 109102 8474 51681 174563 238816 177245 120549
13094 120549 166696 74696 45002 47959 6343 -66489 -82182 -190872 -258452 -185040 -199257
13083 -199257 -121399 122539 296865 175367 66412 12228 -69123 -239356 -100765 82914
13073 82914 -22649 -108991 -61459 67609 -27550 -143031 -82099 -120512 -174286 -200331 -260365
13062 -260365 -458681 -491452 -455130 -185614 -59285 -56231 66437 82202 -62465 198999
13052 198999 347869 39423 -134576 -104619 -168115 -110866 36023 55859 119129 80112 204658
13041 204658 75284 -50434 -26062 156769 156737 13452 -141891 -372459 -454678 -312389 -110595
13030 -110595 6981 -108917 -101988 -66386 17394 -56980 -113525 -67998 -339932 -392082 -329319
13019 -329319 -188322 -27136 8927 -61451 57230 353543 415128 312302 298502 269363
13009 269363 201795 101675 -98506 -30106 8213 120334 244420 223608 252075 240522 184980
12998 184980 192737 188157 256063 182248 212493 307393 252220 232669 318830 110897 -79093
12987 -79093 -130361 -229529 -166388 -178821 -132355 -58129 -122793 -171941 -20010 285813 180303
12976 180303 27146 -79155 -103856 -21970 -174941 -238161 -208758 21442 -109792 -198090
12966 -198090 -225856 -253857 -99374 -73146 -73442 120046 88787 -88943 -79894 21049 38926
12955 38926 56953 167790 234352 336656 203346 -15731 -129493 -187520 -293044 -69485
12945 -69485 129457 179000 208170 230741 206769 247610 288746 288892 181693 166876 252361 295715
12933 295715 219921 74685 -17933 -68864 -69423 -163415 -31494 104991 66422 -96898 -173869
12922 -173869 -174133 24824 89894 -28196 -183832 -203749 37429 237370 385384 189631
12912 189631 156455 52554 92647 240414 156816 66099 227101 173039 88902 -76954 -38186
12901 -38186 13223 57484 191149 164063 182110 10893 153512 190536 -30867 -270256 -239539
12890 -239539 -204344 -168575 -271005 -319643 -85301 84974 229822 282149 238185 270852 118373
12879 118373 3391 -111621 2921 108079 215088 152406 109049 99421 -84507 -165658
12869 -165658 -86492 10057 46563 144694 163590 32102 36092 -67585 11869 7280 -67700
12858 -67700 -158396 -144124 -125523 -16601 -38026 66394 96748 88788 -15239 -126247 -223407
12847 -223407 -205816 -84777 112435 122399 -4656 59806 222893 111106 -230575 -240929
12837 -240929 -223162 -109241 -47743 -80487 -63765 76245 128517 38071 -30543 -155374 -114005
12826 -114005 73062 52706 50038 37130 179620 237749 166295 107890 142981 49050 40600
12815 40600 116803 223701 385197 488872 251410 121558 166819 129841 212335 292427 234732
12804 234732 304227 245245 194766 147904 98865 73710 175745 190294 140173 67035 85282
12793 85282 326402 235121 154245 237920 192932 68256 55029 -28288 -14594 -152762 -386166
12782 -386166 -158805 106459 169391 314029 289753 68115 161216 195032 130383 314710
12772 314710 240292 67203 58254 26377 57461 150526 297412 216198 44417 -21531 -137827
12761 -137827 -49341 -133646 -91305 -36239 103921 -36148 -193612 -187444 -187090 -283633 -41251
12750 -41251 151562 171180 76403 12180 -24333 -84713 -211960 -117607 -83116 -172607 -450968
12739 -450968 -530619 -455573 -336421 -317462 -110307 -84745 -80815 -177685 -89360 -71633 -27246
12728 -27246 87666 321973 409316 320661 236093 113209 222318 259996 116868 -153842
12718 -153842 -237342 -253973 -144884 -188324 -222569 -148552 -154670 -57945 -166021 -129908 -112211
12707 -112211 58531 23088 -53895 -105915 -46189 -96463 -220953 -205798 -149094 -221009 -38320
12696 -38320 29070 57514 7301 -78125 -140988 -174839 -239992 -229502 -103166 -166495 -122706
12685 -122706 -43018 44299 220943 175878 24580 -40011 -112462 -139726 70858 37825 -82884
12674 -82884 -180266 -188316 -125975 -42351 -84249 -4622 -18684 -35935 199573 347086 42248
12663 42248 -178581 -25216 115058 287558 197295 77966 -52373 -103647 -141265 -82269
12653 -82269 -135387 16051 38033 92040 213349 231755 248416 135870 37790 -94874 -115466
12642 -115466 -112347 -248178 -315882 -123890 -191952 -235454 -252387 -129603 -94197 111861 135555
12631 135555 240072 152903 29935 21103 85916 68610 45985 77655 149458 169474 203549
12620 203549 205345 226752 225300 79338 48018 103947 211588 120192 72582 91365 53464
12609 53464 945 -343377 -295398 -92154 -97847 -172715 -175179 -193263 -231998 -162673 77831
12598 77831 108978 38340 -200844 -240808 -427666 -326594 -194446 -103860 78183 75074 26855
12587 26855 17455 176865 -290 -159273 -27209 166566 299742 217992 193177 159160 163393
12576 163393 181745 176394 16161 44300 195855 148286 188047 220988 83233 -25550 -27962
12565 -27962 68535 124980 -28894 -55913 -5709 -53268 -151719 -72424 -53665 -85957 -202341
12554 -202341 -170990 -100260 -191487 -84533 -3197 156971 228894 99353 22263 6716 172186
12543 172186 116439 157696 146228 88843 46523 -12761 -138523 -126720 -73841 -146206 -140923
12532 -140923 -157541 -63455 -137620 -71890 17360 148341 134623 -146523 -281922 -227197 -121606
12521 -121606 -216207 -197942 -217323 -189892 -124258 -51964 11976 -126263 22968 48046 34356
12510 34356 94285 145878 71755 -28750 -99648 144813 238380 257936 170854 17985 133292
12499 133292 192332 264934 291680 196556 121372 30881 -855 -85563 -222473 -211749 -70376
12488 -70376 63063 154433 193948 99176 -46515 -33386 -6248 -15671 -57191 -245557 -282455
12477 -282455 -256377 -216809 -102273 106768 -13357 -139161 -148427 -58826 28591 168982 171637
12466 171637 63901 108772 187563 45777 -122368 -66607 -88276 -137913 -274693 -193588 -210832
12455 -210832 -49231 -49539 -11513 26273 -76366 -99649 19766 -12295 -28510 -46340 -55043
12444 -55043 -31506 43598 91491 135091 101556 -12225 59948 19368 93717 -90424 -190240
12433 -190240 -114731 -35033 51895 3594 -113536 -83374 8260 -142999 -272600 -236219 -208352
12422 -208352 -69171 62214 -165459 -343874 -211181 -72245 50998 56451 70242 12605
12412 12605 129512 33705 69581 76534 25777 -107117 -91010 125793 162957 25455 -214188
12401 -214188 -283528 -276550 -146463 -38355 35174 120676 59580 -41133 -84229 47639 180856
12390 180856 129189 170275 377567 369122 283553 170960 128990 125835 60523 86608 157635
12379 157635 -85675 -290394 -212353 -28038 -46547 -145742 -66276 -107044 -126285 -179613 -222240
12368 -222240 -27329 139177 83740 -46278 -88983 -179882 -214157 -93270 -198271 44322
12358 44322 140671 140438 -37497 -208025 -239683 -132794 -174846 -92153 5153 -147777 -209168
12347 -209168 -162823 -78738 -102238 -60916 90684 129997 90924 123093 122041 124793 94901 60226
12335 60226 89975 41448 80277 150913 137604 80139 118441 168601 54541 202104 282582
12324 282582 340642 207183 43129 -70647 -132727 -198238 -205219 -271449 -233961 -97881 -10594
12313 -10594 -63380 -72473 -140314 -172259 -53709 69239 270363 403270 360575 123542 -75504
12302 -75504 -72852 -6637 182559 129374 1531 -5492 -12841 -80692 -36084 53300 10852 124720
12290 124720 147643 91803 156053 43481 -49455 -39738 130416 110623 142536 199022 220263
12279 220263 112559 -54957 -153422 -178586 -90974 80064 6019 -326555 -216226 -315
12269 -315 50400 -43905 -116670 104081 185502 80378 158120 -84166 -165475 -121859 -110789
12258 -110789 -149725 52511 254100 188134 72387 -13395 35220 -122423 -99864 43994
12248 43994 -10520 -79886 -114071 -107656 188166 184675 182942 151907 112385 243953 160104 -174538
12236 -174538 -307551 -138958 9124 -5048 8084 -115412 -169651 -39750 197011 159639
12226 159639 74243 233709 134509 64824 105659 124990 58672 -88986 -97441 -105752 -240264
12215 -240264 -186577 -82026 -135820 -175655 48873 209601 206493 117496 -127074 -115606 -73914
12204 -73914 36466 112054 -27438 21041 112103 -47619 -132770 -8071 22936 -165177 -132164
12193 -132164 -793 2867 -226714 -142437 -26658 -118826 -43674 -174157 -174606 -19892 -39556
12182 -39556 -73095 36535 20776 -148152 -326323 -357943 -284038 -250160 -350865 -215233 -16602
12171 -16602 -139259 -225723 -259361 -103302 -134237 -95032 -6833 -23536 27086 -24002 -241334
12160 -241334 -247878 -110173 -254365 -296529 -9142 59152 -31931 -63887 4918 -5013 114168
12149 114168 173362 168464 -16261 17792 136601 190568 120364 91417 79055 203651 234843
12138 234843 155056 52956 183651 172470 252184 187718 194269 289923 172622 -10312 -18875
12127 -18875 -21877 23453 227798 165349 32667 -68261 -291532 -337575 -295183 -373378 -383117
12116 -383117 -382611 -250943 -73264 87821 100218 109211 231804 364093 313856 192853 54617
12105 54617 34069 207190 101332 -213911 -172370 -102310 -137508 -107246 -168710 -109958 -84563
12094 -84563 21332 87772 77427 70235 167200 373548 201589 -63198 29205 5238 -93954
12083 -93954 -88577 -124589 -103400 -202023 -190488 28199 52456 -130008 -273157 -322494 -20538
12072 -20538 -83022 -64992 15649 -159207 -242331 -73055 -27544 -117440 -148506 -19164 -24883
12061 -24883 -60922 65330 -68207 -207120 -129685 77459 95846 112964 101564 94596 35601
12050 35601 -123801 -80076 -81933 -90983 55699 -5011 -186451 -177638 -195714 -127882 -44205 -109818
12038 -109818 -290661 -212281 -26787 37195 -128465 -240141 -93226 -54054 -7704 85814
12028 85814 143564 73378 -246134 -398396 -237123 -45718 -29232 -67070 -136265 -240173 -171244
12017 -171244 80607 136034 100079 -50675 17271 51384 -65097 -173706 -71181 128927
12007 128927 52354 29253 29364 5755 71104 100927 196499 90356 -44638 -89927 -72403
11996 -72403 -64066 60592 62025 98529 83661 32880 -87614 -17933 -19648 -38163 103616 164531
11984 164531 336894 423519 402964 336578 199283 128732 77140 21360 72859 -94933 -233115
11973 -233115 -329662 -58737 61142 -47375 -90714 -218201 -60866 -58949 -80935 -91258 -27918
11962 -27918 -57092 -110563 -240259 -120022 -3949 64779 100693 -95596 -6363 55260 -34176
11951 -34176 -187534 3578 52667 -191758 -340923 -243375 -62029 -36292 43165 16410 -213598
11940 -213598 -346289 -166516 -43341 50145 -69145 -191282 -83563 124706 119881 -9752
11930 -9752 -125420 -171510 -46952 18192 -64135 -11119 88419 -17091 -93498 7374 13028
11919 13028 86365 -8391 -46210 -54089 -58176 66835 161906 -154338 -388436 -476457 -270029
11908 -270029 -209978 -114504 -30071 -11357 -127561 -112451 -243800 -252895 -160745 -126844 -94264
11897 -94264 -78661 -14045 203351 96063 24365 -29248 -105432 -160811 -245438 -227790 -178282
11886 -178282 -119187 174461 161347 242644 251876 186685 99679 -5832 -70122 -47694 -68790
11875 -68790 -121944 -136996 -153420 -111172 -162465 -103804 -34014 -71875 -54619 33607 -269432
11864 -269432 -476325 -404230 -272238 -274448 4470 297676 170588 -32885 -236728 -322174
11854 -322174 -105412 104584 143482 200831 210171 73834 -128718 -241114 -296784 -162884
11844 -162884 66072 252011 323935 228422 121490 -69841 -132137 16768 -49546 -143610
11834 -143610 -67072 49175 38579 -149020 -358661 -438687 -174575 -134393 -229517 -322654 -373456
11823 -373456 -349957 -287297 -182840 -15604 2840 63272 85083 -56386 -124866 -115774 -90599
11812 -90599 66682 120449 146697 197533 296614 101042 -147985 -116550 -89548 -82076 20508
11801 20508 54383 7675 84207 232597 242313 -43115 -178589 -140189 -677 131219 336669
11790 336669 292171 294292 246599 343817 241738 -4651 2663 120809 135684 28758 -21285
11779 -21285 29433 -51940 16276 77841 -64747 -127189 36905 186323 155121 226740 73234
11768 73234 -8627 -38804 90675 68114 145480 110153 -23848 -92858 -81446 -79450 58594
11757 58594 115377 128958 5956 111397 234199 294543 118841 39493 -67618 -44645 -15905
11746 -15905 -33412 109282 262155 344087 199527 142789 276344 353406 181199 27383
11736 27383 7211 -11025 -184760 -322669 -164971 -184989 -321234 -404942 -166268 49004
11726 49004 198733 155780 -84274 -56973 51573 227336 94115 -33726 13288 147006
11716 147006 9245 -173227 -282049 -264990 -50438 71998 83573 21032 -8494 40885
11706 40885 52414 60912 137912 100169 -104450 -180255 -238887 -77684 -68344 -245194 -283419
11695 -283419 -207672 -220409 -175031 2983 18923 -22022 109832 94272 205271 270105 209090
11684 209090 178801 17282 -44920 -24183 25828 -19278 -119462 -201207 -142614 -68338 -230974
11673 -230974 -317198 -363118 -314688 -271637 15906 156262 -81341 -323997 -214985 42806
11663 42806 149327 210619 140950 -86677 55062 60583 130606 286527 169665 29152 -93632
11652 -93632 -49712 -40760 -77792 -163240 -87593 -162377 -50469 19935 -196250 -401400 -256653
11641 -256653 -38150 103299 198386 7640 -202932 -411380 -246636 24734 12319 -175295
11631 -175295 -260996 -114272 -20543 -157692 -171639 113144 173797 26712 105854 196789 247120
11620 247120 167278 63904 99961 120309 60917 -35537 -157765 -22253 -43839 -62344 33425
11609 33425 -102915 -85079 234937 351198 354633 179629 -59288 -48086 2950 -60875 -103684
11598 -103684 -45736 174722 296209 133997 -54999 -101424 96578 263770 319337 164508
11588 164508 -134267 -150910 -165248 -113756 -180247 -146000 7988 73156 198511 113903 64272
11577 64272 -11447 -54798 -33949 22624 -153062 -262616 -390390 -181605 20758 72972 266828
11566 266828 132741 -60335 5144 -104348 -38728 -3679 -1755 -111689 -77427 -185748 -270453
11555 -270453 -295808 -255256 -139794 -194823 -258224 -35375 64203 83468 42853 5489 127859
11544 127859 -38768 -19644 -64410 -116058 -90144 -337866 -344710 -129572 124530 31838 -178317
11533 -178317 -133540 -98264 -8449 -92120 -347051 -243318 -190135 -330646 -105724 85995
11523 85995 89489 9907 5214 -57623 -98977 16370 103343 138887 71802 35955 60813 226153
11511 226153 289740 9638 -169340 -243710 -158284 -245922 -289299 -125490 -161023 -232980 -187821
11500 -187821 -50214 -144404 125458 257862 193643 118035 32443 61044 110543 -18496 -85920
11489 -85920 -154581 -246648 -423800 -541068 -272679 45959 56312 -185499 -191908 -152201 -182032
11478 -182032 71144 177227 201418 230902 329296 418114 240439 -4317 -218171 -320374
11468 -320374 -372581 -299323 -206631 -170127 42408 23564 -175741 -109691 6557 54344 -23589
11457 -23589 105422 132502 118282 97406 -110834 -179316 59939 1058 -160829 74307 296299
11446 296299 411304 255247 229906 166493 45043 -25317 -146003 -228950 -132264 30125
11436 30125 203176 148145 93213 -81954 -167261 -137800 -142624 16454 137172 34980 67699
11425 67699 192177 123362 -77596 -182902 -89111 15444 -112940 -167016 -163551 -63745 -43369
11414 -43369 -134411 -104801 35726 21789 -128760 -162951 -187992 -92888 -79256 -286089 -157591
11403 -157591 -125638 -86699 -76031 75833 116181 60464 189325 75719 -44242 -51705 -116754
11392 -116754 -169810 -164868 -391498 -248634 -56499 -146392 -353268 -445012 -366678 -285416 -309649
11381 -309649 -241853 -230497 -187358 -187130 -67463 -102763 -288695 -412125 -375603 -285446 -87698
11370 -87698 23277 31775 -27426 -84990 -42578 115597 277793 168045 3028 -67775 -108719
11359 -108719 -55611 -26203 129502 194013 95268 -2422 -5939 -126361 -87367 -75368 -136745
11348 -136745 -251039 -392517 -237514 -86022 23917 54739 67103 153362 102875 85358
11338 85358 -13008 79876 83138 129468 247470 70809 -23961 55315 136171 195183 308154
11327 308154 310279 44619 -36705 94519 76152 79004 -87860 -23991 194082 248165 153689
11316 153689 15668 -106344 -77313 -113236 -160801 -129066 -121291 -175324 -173390 -102448 36826
11305 36826 65861 5593 -76910 -88593 -217095 -165741 -112717 -160217 -258890 -236221 -306280
11294 -306280 -110145 53488 -79352 -206594 -253459 -197988 -147081 -67753 -6280 18947 93363
11283 93363 162591 57709 208489 223984 117081 151876 223929 171093 210967 100855 123100
11272 123100 306177 349446 207143 112747 -6431 15975 3683 101646 233673 365384
11262 365384 346209 26557 -138605 -102743 -106448 -54856 68 89809 -6516 -6952 48898 -16858
11250 -16858 -158073 -297308 -314763 -162846 29474 97292 -9938 -180309 -274632 -212726
11240 -212726 -22898 -45480 37179 12759 8264 32439 -53698 -96753 45881 -88297 -108637
11229 -108637 1143 -99826 -317566 -103246 -47940 -166283 -90078 89278 -24499 -95538
11219 -95538 -151568 -100811 -1383 -21565 -133739 -243145 -101358 -70563 -41673 74455 77388
11208 77388 -181420 -284079 -223877 20147 75498 -13910 -67926 -58202 8133 -52179 -146219
11197 -146219 -117967 -137332 -94600 -64565 -47266 -4960 -31300 -128890 -182390 -278344 -601005
11186 -601005 -642127 -321576 -248701 -225925 -6592 -30866 107908 57108 38725 160082 142494
11175 142494 -137216 -245335 -241573 -60227 123938 48766 127698 217510 131564 -49853 -132085
11164 -132085 -73256 116048 168090 143475 296572 261224 130113 -42939 -266942 -199702
11154 -199702 -136191 -161394 -143400 -146105 -137421 -57792 -164481 -196215 -311087 -279619 -149687
11143 -149687 -133101 -190927 -399866 -414546 -294176 -101240 -84789 45938 -13096 -44717 -203754
11132 -203754 12186 41999 -71191 -14318 136926 171447 2987 -58397 95839 139624
11122 139624 224675 -5917 46477 260122 353255 166830 104521 117984 206879 361919 284012
11111 284012 292361 284800 163240 14519 78044 82751 -11468 -193973 -290493 -175042 109027
11100 109027 -22059 -196289 -254730 -165733 -3265 131995 234917 86292 -82325 -132753
11090 -132753 -56806 -237983 -179996 -103085 -244605 -258659 -164608 -141720 -199313 -155968 -130843
11079 -130843 -79810 70043 253719 198735 46701 -12884 -34641 12267 82350 41999 -30645
11068 -30645 10165 110851 167351 283056 235796 219132 131736 -111153 -187541 -335503 -426748
11057 -426748 -304135 -165450 13990 16326 -55840 -69394 -19058 58927 65297 -119683 -96397
11046 -96397 34018 53159 102099 -125422 -151806 -112781 -27895 162832 4477 -24535 113278
11035 113278 16434 9448 -34076 -164489 -275984 -249826 -88920 36747 53121 -134818 -112915
11024 -112915 -40267 66029 -26240 -29982 34502 19055 61160 150027 72957 -110386 -110660 -286023
11012 -286023 -26388 134940 120740 63859 -132298 10267 227588 -72329 -475028 -446223
11002 -446223 -299455 -219671 -217266 -270136 -248653 -212165 -291329 -185189 -100284 17768 -204003
10991 -204003 -261976 -71520 -88510 -103087 -80987 59088 -56400 -192705 -469726 -314538
10981 -314538 -227593 -68764 74670 -1409 -15103 -54647 -159500 -177707 -251786 -129413 54281
10970 54281 41908 -132458 -160047 -89148 -187445 -240965 -153867 -30402 -58294 -14107 -14907 -216706
10958 -216706 -260198 -238912 74135 186809 175333 99546 116004 131788 109685 122138 186028
10947 186028 176669 54982 153880 159447 87864 -15572 -26610 -74321 -144482 -167046 -176813 -145944
10935 -145944 -246871 -221180 -43089 84989 4612 -131739 -207124 -208456 -244848 -178540 -50888
10924 -50888 -88756 -191271 -157138 -56275 3498 75650 200120 263678 116559 -59087 -229217
10913 -229217 -49370 4864 15677 44960 60996 109925 143908 133791 -55915 -21514 136895
10902 136895 80888 -103766 -258841 -90356 -49511 148745 205208 105443 114483 73761 -130094
10891 -130094 -116493 15237 103945 101105 204713 172474 275433 159146 132091 16484 -209056
10880 -209056 -147170 -142039 -211167 -189627 -50451 205656 137983 58505 92574 59912 26578
10869 26578 2293 23685 -37273 -98204 -273683 -359648 -288540 -184354 -69580 -13655 37796
10858 37796 69767 -123741 -71307 41497 -41441 -161978 -152282 -117860 -161766 -156837 -85078
10847 -85078 -144375 24687 264460 360395 215585 207650 148502 90829 106774 38631 21259
10836 21259 -91100 -111526 -58520 -152088 -238370 -141350 11130 102150 161126 22551 -55170
10825 -55170 -85084 -152598 -152217 -146305 -80558 -230887 -279968 -256618 -208726 -139343 -33226 -56596
10813 -56596 -66242 32192 91309 211709 276377 146214 203008 201223 58704 22298 30912 -141
10801 -141 -45458 -64289 -180947 -280201 -156619 52670 58706 -54219 45077 -60802 -126136
10790 -126136 -126710 -30190 36871 21295 -68989 -12196 163720 71368 -63187 166914 13402
10779 13402 -90298 -96392 -86685 -50494 173210 234998 161491 80605 -37531 -41283 -7349 72781
10767 72781 20513 52036 136716 73217 -39239 -24588 15678 68922 10033 78325 138550
10756 138550 -108233 -106462 -113124 -56468 -6187 -32975 115296 108986 38383 46482 95004 17495
10744 17495 -25295 -166840 -312178 -242145 -45998 -33133 -147769 -246855 -350797 -267227 -208816
10733 -208816 -333354 -191228 -79746 107311 206715 52822 -54442 -124428 -252112 -296180
10723 -296180 -298481 -246809 -302517 -323051 -322615 -214650 -128225 -254638 -265314 -76970 149837
10712 149837 174642 39586 47121 83882 22234 22580 73439 6117 -14275 -4952 -119726 -212387
10700 -212387 -90193 -102789 -104887 -287812 -264452 -190021 -161887 87180 129842 11164 7189
10689 7189 -141264 -236859 -379743 -457654 -268887 -64896 32352 -3937 -140897 -164179 -99232
10678 -99232 -96637 91649 178657 27506 53507 -45120 -84113 -136093 10251 63372 99600
10667 99600 9031 -42759 -97277 -152773 -139460 -189573 -144911 -58661 -74441 -7211 -33559 -55291
10655 -55291 -9653 93202 112972 81524 50700 -209183 -327122 -110022 230835 303366 303598
10644 303598 -137742 -202385 -239536 -309618 -150879 -199832 -161354 -28659 87126 68429 104319
10633 104319 76338 -153490 -233655 -230116 -225532 -224317 -80982 -14806 68922 154337 -80064
10622 -80064 -253750 -149927 -76263 7626 59817 90217 131762 278282 126420 130686 65452
10611 65452 -269272 -320123 -317166 -355412 -194057 -17666 -95776 -36358 193852 326043 91870
10600 91870 -23042 111189 177939 108460 143544 117501 77265 56557 4083 -59702 -5022
10589 -5022 -77758 -60269 59813 167375 143066 138460 -3232 -64779 68304 -57382 -9173
10578 -9173 -16699 -42889 -110987 -214342 25141 7778 -110557 -55432 -40419 -175694 -95329
10567 -95329 101100 137442 111790 108961 90273 103621 89154 228650 194718 106859 3745
10556 3745 29891 -181342 -250279 -6190 155059 182522 155594 37867 -231642 -180182 -77088
10545 -77088 48005 113491 -86680 37184 221188 69581 -75940 23289 109614 173067
10535 173067 144596 113676 51556 220785 313817 245358 279191 367879 165625 45605 15968
10524 15968 -28039 -52354 56433 -44978 -182905 -97017 6396 56846 -60019 -173079
10514 -173079 -180290 -166548 -105678 -33606 -172541 -52715 -18995 17763 122930 -14863 -54256
10503 -54256 -71065 -89162 -62410 122445 95990 -125154 -120068 -188677 -174025 -319872 -407311
10492 -407311 -362585 -418055 -404094 -271062 -182670 -239883 -287368 -114426 -127305 -139324 -162236
10481 -162236 -90321 -50228 57253 261900 204249 195089 133699 87470 60931 57799 280785
10470 280785 283962 165256 131575 70057 269367 314890 272458 172360 106183 -14085 -132706
10459 -132706 -379075 -438409 -120386 -33592 -84517 -126601 -109834 -186003 -10862 38142 15867
10448 15867 -39754 61138 54110 -1755 -323604 -512355 -450215 -411383 -259068 -51933 36352
10437 36352 -76567 -171831 -30103 -17061 66029 206416 95228 26711 -1124 -132454 -201681
10426 -201681 -210695 -47864 223877 240562 223577 142011 14585 -81263 -249694 -129065 -146085
10415 -146085 -61338 -13693 68975 78088 -127996 -86432 24115 161486 211911 80733 -1139
10404 -1139 -15058 49332 128023 -113151 -264980 -140934 44729 1389 -53741 -7152 71829
10393 71829 -88827 -283671 -315117 -180993 -43389 -24565 -57616 -137796 16357 -43129 -215899
10382 -215899 -171475 -193651 -38438 68602 73629 18289 73946 127934 70409 43401 156252
10371 156252 15107 -231508 -209482 -105568 -66622 127830 150370 67043 39004 -105677
10361 -105677 -274608 -211375 -267298 -264880 -245985 -210192 -131719 -97681 68080 166679 93530
10350 93530 78770 2315 -51433 74390 100130 125537 -59654 -213836 -232339 -294393 -274368
10339 -274368 -72832 -135015 -136310 -56738 -968 152317 295650 315377 13533 -154119 -219309
10328 -219309 -197884 -72876 36718 210193 296011 211570 62328 100958 -3915 -23391
10318 -23391 99762 141358 81387 162425 245993 224322 78602 -125931 -144131 -195674 -350935
10307 -350935 -387845 -196365 -101232 40841 101248 114769 110421 168989 179168 87054 88761
10296 88761 33203 -227612 -187681 77532 57185 8545 -238071 -336104 -87990 -77608 83208
10285 83208 107926 157103 136189 52974 54661 -27721 -26456 -162850 -226759 -63653 123054
10274 123054 204887 175824 261060 198220 162042 113557 -47470 100063 44648 -187627 -289155
10263 -289155 -105529 -237294 -289504 -66851 51999 -12157 6261 75591 6596 -27492 -14987
10252 -14987 -82901 -258791 -379514 -139341 10224 26764 15844 -23460 58373 -47374 -37520
10241 -37520 -9433 82201 122534 151622 -33883 -139023 -172026 -152858 -59871 -114997 -56780
10230 -56780 126920 208959 245774 -17071 -109452 -101638 -44101 37242 -118119 -396942 -599747
10219 -599747 -281889 -166815 -156441 -157446 -139263 -76856 -154663 -394369 -358113 73140 353913
10208 353913 276461 149873 -16852 4464 102233 -106551 -268662 -237117 -21294 124934
10198 124934 226064 64718 -90848 -175593 -61654 -4589 94721 74007 86206 73642 -19849
10187 -19849 41946 88110 13067 -115324 -118512 -132457 -200367 32645 22612 20158 -31668 -13040
10175 -13040 15381 25179 157251 144032 146808 36897 24280 -34407 -48871 -125767 -329117
10164 -329117 -303825 -59462 65157 21018 -52851 98878 173228 179633 175799 71990 13334
10153 13334 -129049 -81683 56261 189005 148067 182542 310614 170051 -37530 103421
10143 103421 34688 -84340 -93817 -70851 -80894 -76665 -205524 -385156 -147553 91373 125429
10132 125429 26823 5808 214309 308267 291219 155099 211052 142275 -81173 -99085 -213978
10121 -213978 -109122 127867 184225 8286 163869 164375 56761 -27161 -66250 -13960 -68853
10110 -68853 80813 103967 104194 186087 135153 158866 65076 64753 34047 -5427 -147968 -127122
10098 -127122 92932 170999 202213 216202 67424 -76916 -192492 -3596 168008 -21917
10088 -21917 -267443 -129284 57195 206095 247641 67776 -174025 -248388 -273542 -345681
10078 -345681 -322701 -237026 -236035 -147514 -79176 5604 76489 67158 115386 179112 176305 319657
10066 319657 400709 348680 256954 223895 191180 322315 486045 332785 268421 452647 735854
10055 735854 1047447 2036729 3131837 3686584 3341332 2161342 1360954 911794 746638
10046 746638 599958 350964 225868 309103 380232 329103 306775 178943 72088 84868
10036 84868 202061 176985 61394 18070 -8546 58969 219505 -95749 -75666 46533 -213585
10025 -213585 -148143 106933 329745 211357 -46029 -136410 -70589 39516 76855 -101549
10015 -101549 -151738 -120684 28614 173644 196561 93364 22704 82670 69258 196790 222819
10004 222819 50022 -20165 -83235 -159187 -30931 -75406 -290152 -200262 -75813 -199167
$$ [...]
##END NTUPLES=NMR SPECTRUM
##END=
